##TITLE=Analysis number 319587
Compound Code btb 02944
Book Reference b
Project Code adrs
Chemist Name fudan
##JCAMPDX= 6.0         $$ Bruker NMR JCAMP-DX V2.0
##DATA TYPE= NMR SPECTRUM
##DATA CLASS= NTUPLES
##ORIGIN= Bruker BioSpin GmbH
##OWNER= nmr
$$ XWIN-NMR		Version 3.5
$$ Fri May 19 13:08:29 2006 GMT Daylight Time (UT+1h)  MAYBRIDGE\nmr@NMR_250MHZ
##.OBSERVE FREQUENCY= 250.131544655141
##.OBSERVE NUCLEUS= ^1H
##.ACQUISITION MODE= SIMULTANEOUS (DQD)
##.ACQUISITION SCHEME= undefined
##.AVERAGES= 16
##.DIGITISER RES= 18
##SPECTROMETER/DATA SYSTEM= dpx250
##.PULSE SEQUENCE= zg30
##.SOLVENT NAME= CDCl3
##.SHIFT REFERENCE= (INTERNAL, CDCl3, 0, 16.522)
##AUDIT TRAIL= $$ (NUMBER, WHEN, WHO, WHERE, WHAT)
$$ ##TITLE= Audit trail, XWIN-NMR		Version 3.5
$$ ##JCAMPDX= 5.01
$$ ##ORIGIN= Bruker BioSpin GmbH
$$ ##OWNER= nmr
$$ C:\u/data/dgb/nmr/ADRS/4760/pdata/1/auditp.txt
$$ ##AUDIT TRAIL=  $$ (NUMBER, WHEN, WHO, WHERE, WHAT)
(   1,<2006-05-19 13:08:02.64 +100>,<MAYBRIDGE\nmr>,<NMR_250MHZ>,
      <created by zg, POWCHK disabled, PULCHK disabled
       configuration hash MD5:
       84 BC 41 DB A1 6E 1D 46 DA 25 12 A5 C1 ED C5 3A
       data hash MD5: 64K
       5E CF D4 54 15 2D E2 F1 F1 14 12 6E C3 16 CF 2A>)
(   2,<2006-05-19 13:08:15.23 +100>,<MAYBRIDGE\nmr>,<NMR_250MHZ>,
      <Start of raw data processing
       ef LB = 0.3 FT_mod = 6 PKNL = 1 SI = 32K 
       data hash MD5: 32K
       88 FA 1E E9 26 F7 0E 02 F3 3C 9A F2 04 BA 43 D9>)
(   3,<2006-05-19 13:08:16.76 +100>,<MAYBRIDGE\nmr>,<NMR_250MHZ>,
      <apk 
       data hash MD5: 32K
       9E 9A 77 2A 42 9E 42 F4 AA FE AA 8B DC F8 83 75>)
(   4,<2006-05-19 13:08:17.53 +100>,<MAYBRIDGE\nmr>,<NMR_250MHZ>,
      <abs ABSG = 5 
       data hash MD5: 32K
       A4 C2 DB F3 02 69 E4 25 90 2F 1D D6 8C 76 51 20>)
$$ ##END=
$$ 
$$ hash MD5
$$ 83 E8 42 36 65 05 7A 6F 76 DE F8 7D 58 78 07 E1
##$RELAX= 
##$RELAX= 
##$RELAX= 
##$RELAX= 
##$RELAX= 
##$RELAX= 
##$RELAX= 
$$ Bruker specific parameters
$$ --------------------------
##$DU= <C:\u>
##$EXPNO= 4760
##$NAME= <ADRS>
##$PROCNO= 1
##$TYPE= <nmr>
##$USER= <dgb>
##$AMP= (0..31)
100 100 100 100 100 100 100 100 100 100 100 100 100 100 100 100 100 100 
100 100 100 100 100 100 100 100 100 100 100 100 100 100 
##$AQSEQ= 0
##$AQ_mod= 3
##$AUNM= <au_zg>
##$AUTOPOS= <30 >
##$BF1= 250.13
##$BF2= 250.13
##$BF3= 250.13
##$BF4= 250.13
##$BF5= 500.13
##$BF6= 500.13
##$BF7= 500.13
##$BF8= 500.13
##$BYTORDA= 1
##$CFDGTYP= 0
##$CFRGTYP= 5
##$CHEMSTR= <none>
##$CNST= (0..31)
1 1 145 1 1 1 1 1 1 1 1 1 1 1 1 1 1 1 1 1 1 1 1 1 1 1 1 1 1 1 1 1 
##$CPDPRG= <>
##$CPDPRG1= <>
##$CPDPRG2= <>
##$CPDPRG3= <>
##$CPDPRG4= <mlev>
##$CPDPRG5= <mlev>
##$CPDPRG6= <mlev>
##$CPDPRG7= <mlev>
##$CPDPRG8= <mlev>
##$CPDPRGB= <>
##$CPDPRGT= <>
##$D= (0..31)
0 1 0 0 0 0 0 0 0 0.06 0 0 0 0 0 0 0.0002 0 0 0 0 0 0 0 0 0 0 0 0 0 0 
0 
##$DATE= 1148040481
##$DBL= (0..7)
120 120 120 120 120 120 120 120 
##$DBP= (0..7)
150 150 150 150 150 150 150 150 
##$DBP07= 0
##$DBPNAM0= <>
##$DBPNAM1= <>
$$ [...]
##$SUBNAM7= <"">
##$SUBNAM8= <"">
##$SUBNAM9= <"">
##$SW= 20.6930455092707
##$SWIBOX= (0..15)
0 0 3 0 0 0 0 0 0 0 0 0 0 0 0 0 
##$SW_h= 5175.983436853
##$TD= 65536
##$TD0= 1
##$TE= 295.16
##$TE2= 300
##$TE3= 300
##$TEG= 300
##$TL= (0..7)
0 120 120 120 120 120 120 120 
##$TP= (0..7)
150 150 150 150 150 150 150 150 
##$TP07= 0
##$TPNAME0= <>
##$TPNAME1= <>
##$TPNAME2= <>
##$TPNAME3= <>
##$TPNAME4= <>
##$TPNAME5= <>
##$TPNAME6= <>
##$TPNAME7= <>
##$TPOAL= (0..7)
0.5 0.5 0.5 0.5 0.5 0.5 0.5 0.5 
##$TPOFFS= (0..7)
0 0 0 0 0 0 0 0 
##$TUNHIN= 0
##$TUNHOUT= 0
##$TUNXOUT= 0
##$USERA1= <user>
##$USERA2= <user>
##$USERA3= <user>
##$USERA4= <user>
##$USERA5= <user>
##$V9= 5
##$VALIST= <valist>
##$VCLIST= <CCCCCCCCCCCCCCC>
##$VD= 0
##$VDLIST= <DDDDDDDDDDDDDDD>
##$VPLIST= <PPPPPPPPPPPPPPP>
##$VTLIST= <TTTTTTTTTTTTTTT>
##$WBST= 1024
##$WBSW= 4
##$XGAIN= (0..3)
0 0 0 0 
##$XL= 0
##$YL= 0
##$YMAX_a= 466648
##$YMIN_a= -588902
##$ZGOPTNS= <>
##$ZL1= 120
##$ZL2= 120
##$ZL3= 120
##$ZL4= 120
##$ABSF1= 16.522
##$ABSF2= -4.171173
##$ABSG= 5
##$ABSL= 3
##$ALPHA= 0
##$AQORDER= 0
##$ASSFAC= 0
##$ASSFACI= 0
##$ASSFACX= 0
##$ASSWID= 0
##$AUNMP= <proc_1d>
##$AZFE= 0.1
##$AZFW= 0.1
##$BCFW= 0
##$BC_mod= 0
##$BYTORDP= 0
##$COROFFS= 0
##$CY= 12.5
##$DATMOD= 1
##$DC= 0
##$DFILT= <>
##$DTYPP= 0
##$F1P= 14.0000005364418
##$F2P= -0.99999901652339
##$FCOR= 0.5
##$FTSIZE= 32768
##$FT_mod= 6
##$GAMMA= 0
##$GB= 0
##$INTBC= 1
##$INTSCL= 1
##$ISEN= 128
##$LB= 0.3
##$LEV0= 0
##$LPBIN= 0
##$MAXI= 10000
##$MC2= 0
##$MEAN= 0
##$ME_mod= 0
##$MI= 0
##$NCOEF= 0
##$NC_proc= -3
##$NLEV= 6
##$NOISF1= 0
##$NOISF2= 0
##$NSP= 0
##$NTH_PI= 0
##$NZP= 0
##$OFFSET= 16.522
##$PC= 1
##$PHC0= 167.4537
##$PHC1= 6.102201
##$PH_mod= 1
##$PKNL= yes
##$PPARMOD= 0
##$PSCAL= 4
##$PSIGN= 0
##$REVERSE= no
##$SF= 250.13
##$SI= 32768
##$SIGF1= 0
##$SIGF2= 0
##$SINO= 400
##$SIOLD= 32768
##$SREGLST= <1H.CDCl3>
##$SSB= 0
##$STSI= 32768
##$STSR= 0
##$SW_p= 5175.98343685301
##$SYMM= 0
##$S_DEV= 0
##$TDeff= 65536
##$TDoff= 0
##$TI= <Analysis number 999999
Compound Code 99
Book Reference 9
Project Code 9>
##$TILT= no
##$TM1= 0
##$TM2= 0
##$TOPLEV= 0
##$USERP1= <user>
##$USERP2= <user>
##$USERP3= <user>
##$USERP4= <user>
##$USERP5= <user>
##$WDW= 1
##$XDIM= 32768
##$YMAX_p= 434923727
##$YMIN_p= -83436
$$ End of Bruker specific parameters
$$ ---------------------------------
##NTUPLES= NMR SPECTRUM
##VAR_NAME=  FREQUENCY,     SPECTRUM/REAL,   SPECTRUM/IMAG
##SYMBOL=    X,             R,               I
##VAR_TYPE=  INDEPENDENT,   DEPENDENT,       DEPENDENT
##VAR_FORM=  AFFN,          ASDF,            ASDF
##VAR_DIM=   32768,         32768,           32768
##UNITS=     HZ,            ARBITRARY UNITS, ARBITRARY UNITS
##FACTOR=    0.157963299565203, 1,           1
##FIRST=     4132.6476996994, 0,             0
##LAST=      -1043.33573715361, 0,           0
##MIN=       -1043.33573715361, -83436,      0
##MAX=       4132.6476996994, 434923727,     0
$$ Real data points
##PAGE= N=1
##DATA TABLE= (X++(R..R)), XYDATA
$$ [...]
16493e2785J8327J1252n51J4957J7029j8304j5314J1307N575l8Q787Q465n322
$$ -52785 -34458 -23206 -23757 -8800 8229 -10075 -25389 -14082 -8507 -8545 242 8707 3385
16480C385j4597j4730N257R012J944J0964k978r708J299o465N539k44m91k097
$$ 3385 -11212 -25942 -20685 -11673 -9729 1235 -1743 -11451 -10152 -16617 -11078 -11322 -11813 -13910
16466a3910j2444j966Q46J4105J7600j7783k4571J6548J3698J4801j721R353j5567
$$ -13910 -26354 -28320 -27474 -13369 4231 -13552 -38123 -21575 -7877 6924 5203 14556 -1011
16453a011k3074k340N541J2785j5112L389L9555Q604j8340l434J75l693Q803N275
$$ -1011 -24085 -26425 -20884 -8099 -23211 -19822 19733 28337 9997 6563 6738 3045 11848 17123
16439A7123N202j488N192O912k030l0271P084J6327j977P855j0241j8525j465
$$ 17123 22325 20837 26029 32941 30911 640 7724 24051 22074 29929 19688 1163 -302
16426c02J1896k8326K240J9093j780j0574j5521j1203J2107J3957p136j3752K692
$$ -302 11594 -16732 -14492 4601 2821 -7753 -23274 -34477 -22370 -8413 -15549 -29301 -26609
16413b6609J8186K022j2152J102r310J2089j9298Q285j4491q669j925M938P885
$$ -26609 -8423 -6401 -18553 -17451 -26761 -14672 -33970 -25685 -40176 -48845 -50770 -45832 -37947
16400c7947L6975P737Q551K6686L323k7527k123o589k0830j8957Q744K4912o448
$$ -37947 -972 6765 15316 42002 45325 17798 15675 9086 -11744 -30701 -21957 2955 -3493
16387c493K2052q770l9728j1227O050j7736R086L674m345N052J4079K1870P577
$$ -3493 18559 9789 -29939 -41166 -35116 -52852 -43766 -40092 -44437 -39385 -25306 -3436 4141
16374D141j3157j7001m517j044L0630j6993q732Q147J8021j8081J379J7803Q156
$$ 4141 -9016 -26017 -30534 -31578 -948 -17941 -26673 -18526 -505 -18586 -17207 596 8752
16361H752N82j2509j3877j5584j7163J0358K415M72J4539J2821k795K8554K786
$$ 8752 9334 -3175 -17052 -32636 -49799 -39441 -37026 -36554 -22015 -9194 -11989 16565 19351
16348A9351K459k102j3633j6146q47J5110M445J7513k665l270r974k8302o707
$$ 19351 21810 19708 6075 -10071 -10918 4192 8637 26150 23485 20215 10241 -18061 -24768
16335b4768j1395q921O808J6149L250K6819j4847p370J4076l274r490K1395n632
$$ -24768 -36163 -45084 -38276 -22127 -18877 7942 -6905 -14275 -199 -3473 -12963 8432 2800
16322B800R004N415J4985l3518J519N008J5272J9135m481l2944k8976K48J1588
$$ 2800 11804 17219 32204 -1314 205 5213 20485 39620 35139 2195 -26781 -26533 -14945
16309a4945j6950j9247P738J6824J4893K3938L1200J518j5985k5230K526O928
$$ -14945 -31895 -51142 -43404 -26580 -11687 12251 43451 44969 28984 3754 6280 13208
16297A3208m245j0006j4383J5290n603j5687P16N522N855o338L073j3956j3213
$$ 13208 8963 -1043 -15426 -136 -5739 -21426 -20710 -15188 -9333 -15671 -12598 -26554 -39767
16284c9767J114K8739J7252k1729j3962j86L8292J6778J5693j1385j0228M34J6635
$$ -39767 -38653 -9914 7338 -14391 -28353 -28539 9753 26531 42224 30839 20611 21045 37680
16271C7680m365k6399l1624k0601k18R88R34J5691J1843r291k333l736J6226J5365
$$ 37680 33315 6916 -24708 -45309 -45527 -44539 -43605 -27914 -16071 -25362 -27695 -31431 -15205 160
16257A60K4076k670o976N769l402m203j1570j0939j9387P346q542J1486J9015
$$ 160 24236 21566 14590 20359 16957 12754 1184 -9755 -29142 -21796 -30338 -18852 163
16244A63J6020j8606m797J2741o198j4105L471N424Q297j4014R475n460N17J7497
$$ 163 16183 -2423 -7220 5521 -677 -14782 -11311 -5887 2410 -11604 -2129 -7589 -7072 10425
16230A0425m071K0401J7267N106j2950j6858l0736j9864p34P112n39K0654J4623
$$ 10425 6354 26755 44022 49128 36178 19320 -11416 -31280 -32014 -24902 -25441 -4787 9836
16217I836J933L136p75p153K2563m268n446o528p023j0506J6537J4212j0897l625
$$ 9836 11769 14905 14130 6977 29540 25272 19826 13298 6275 -4231 12306 26518 15621 11996
16203A1996k4894j8962J2590k742j6979P770J1085J1159J7045l498k4448j2551
$$ 11996 -12898 -31860 -19270 -22012 -38991 -31221 -20136 -8977 8068 4570 -19878 -32429
16191c2429J2207J8451J4992j7126K611P252p105j200j5227L881K1275J4102O557
$$ -32429 -20222 -1771 13221 -3905 -1294 5958 -1147 -2347 -17574 -13693 7582 21684 28241
16178B8241l3020j4805N238J9466J7929J9999R33l5891k4154P298n795k430m023
$$ 28241 -4779 -19584 -14346 5120 23049 43048 43981 8090 -16064 -8766 -14561 -16991 -21014
16165b1014L1568J4704j1239p442J4547j6860m232L764j0321Q502J5967l2480
$$ -21014 10554 25258 14019 6577 21124 4264 32 3796 -6525 1977 17944 -14536
16153a4536o798M40J0879L077P271n414k588j0528Q259J0281M553k7800k3938
$$ -14536 -21334 -20894 -10015 -6938 333 -5081 -7669 -18197 -9938 343 4896 -22904 -46842
16140d6842J5836K0335q487l338L1141Q034r004N452Q442r84j3770j6402J2093
$$ -46842 -31006 -10671 -19158 -22496 8645 16679 7675 13127 21569 20585 6815 -9587 2506
16127B506J3417J3235J5232r532j3629l1410q869j805L464J7589K1305K8147J6788
$$ 2506 15923 29158 44390 34858 21229 -10181 -19050 -20855 -17391 198 21503 49650 66438
16114F6438j2438k3503n596m5275j7837q562J6949N750r874l130j0150r185P376
$$ 66438 54000 30497 24901 -20374 -38211 -46773 -29824 -24074 -33948 -37078 -47228 -56413 -49037
16101d9037N741J8481J5758O36K7033k5673l6750K7L7660K2425J7438j5335k5771
$$ -49037 -43296 -24815 -9057 -8421 18612 -7061 -43811 -43784 -6124 16301 33739 18404 -7367
16088g367j528j3314k143j9318O658l420J7290J6293M37L1910J6575m122k1861
$$ -7367 -8895 -22209 -24352 -43670 -37012 -40432 -23142 -6849 -6412 25498 42073 37951 16090
16075A6090l9660K461L916l294J2668M889J0007J6899j2480r772K963J9272J979
$$ 16090 -23570 -21109 -17193 -20487 -7819 -2930 7077 23976 11496 1724 4687 23959 25938
16062B5938P000J6776j5502r655j3231j5585J358k8246p41J085K3046q327r822
$$ 25938 32938 49714 34212 24557 11326 -4259 -2901 -31147 -31888 -30803 -7757 -16084 -25906
16049b5906j4076j9027K4534J6443r680j1087N247Q929k2878J7463K267j2211
$$ -25906 -39982 -59009 -34475 -18032 -27712 -38799 -33552 -24623 -47501 -30038 -27771 -39982
16037c9982J2838K2117L96o697k397r54q761J3862L425j119j590m127l627r165
$$ -39982 -27144 -5027 -4631 -11328 -13725 -14679 -23440 -9578 -6153 -7272 -8862 -12989 -16616 -25781
16023b5781r302J5974k653K6517j2276k9307R60O032p145K864J2835k943n199
$$ -25781 -35083 -19109 -21762 4755 -7521 -36828 -35868 -29836 -36981 -34117 -21282 -24225 -29424
16010b9424K6447j2715l030O416j485k2053J5058K075Q989J6316J8208O505R962
$$ -29424 -2977 -15692 -18722 -12306 -13791 -35844 -20786 -18711 -9722 6594 24802 31307 41269
15997D1269Q38k0231j3452j4824r045J4465K4308j856j1448k9658L128M339J1045
$$ 41269 42107 21876 8424 -6400 -15445 -980 23328 21472 10024 -19634 -16506 -12167 -1122
15984a122P423R258K6293k1348o215j3692j0397j3728K7719K5993l5925k3887
$$ -1122 6301 15559 41852 20504 14289 597 -9800 -23528 4191 30184 -5741 -29628
15972b9628K0736j146k257L0252P345p431o369K837o951j40N290j4796j1423p129
$$ -29628 -8892 -10038 -12295 17957 25302 17871 11502 14339 7388 7248 12538 -2258 -13681 -20810
15958b0810r49L5351j339K669j336q891q470j9714j4121n970J5406L1268M0544
$$ -20810 -21759 13592 12253 14922 13586 4695 -3775 -23489 -37610 -43580 -28174 3094 43638
15945D3638J3599r410l9228k686P743j5134k7893j0736K2534K4976J0971k0101
$$ 43638 57237 47827 8599 5913 13656 -1478 -29371 -40107 -17573 7403 18374 -1727
15933a727N320N458N492L0743J8477l5789l0270r687m177q219N665P021q64L53
$$ -1727 3593 9051 14543 45286 63763 27974 -2296 -11983 -16160 -24379 -18714 -11693 -12557 -12204
15919a2204n165J1028P38n148J4764j0771j4062r481k1748K2672K5471P61j9709
$$ -12204 -17369 -6341 -5603 -10751 4013 -6758 -20820 -30301 -52049 -29377 -3906 -3145 -22854
15906b2854J3803J0700R743K479O541J3438q340k3844m797J0582K8903J4859l1617
$$ -22854 -9051 1649 11392 13871 20412 33850 25510 1666 -3131 7451 36354 51213 19596
15893A9596k2728p824L156o414R07K193R28N462r203P87j3106m025K4377O062
$$ 19596 -3132 -10956 -7800 -14214 -13307 -11114 -10186 -4724 -13927 -13140 -26246 -30271 -5894 168
15879A68J1212j0101j052J7594j3638l5489k5787J6423M2432J2367j6508R765
$$ 168 11380 1279 227 17821 4183 -31306 -57093 -40670 1762 14129 -2379 7386
15867G386L499n365j2608j336Q446J927j3563q043Q620P876J0290j789O269L822
$$ 7386 10885 5520 -7088 -8424 22 1949 -11614 -19657 -11037 -3161 7129 5340 11609 15431
15853A5431k3186r332q6L049K4970r687k6401l987K6984O588m881k0421r407k709
$$ 15431 -7755 -17087 -17173 -14124 10846 1159 -25242 -29229 -2245 4343 -538 -20959 -30366 -33075
15839c3075k8058J2139k25N443J2734J0546j5817r616K3045L426P888r250p883
$$ -33075 -61133 -48994 -49219 -43776 -31042 -20496 -36313 -45929 -22884 -19458 -11570 -20820 -28703
15826b8703P743K0852J1710l2191j5578j4842K2483K1593Q704J2585J1655J043
$$ -28703 -20960 -108 11602 -20589 -36167 -51009 -28526 -6933 1771 14356 26011 27054
15814B7054j6057O200r114j597R999J4630R744q657m865l0196n052l702J9622
$$ 27054 10997 17197 8083 6486 16485 31115 40859 32202 27337 -2859 -7911 -11613 8009
15801H009J1544O915l4036L699J3142j6541K101J1142M271J8054J2666o628K91
$$ 8009 19553 26468 -7568 -3869 9273 -7268 -5167 5975 10246 28300 40966 34338 34629
15788C4629k416l2790l0023L874P45K1648J007n231K937O973j0075r452j424L3
$$ 34629 32213 -577 -30600 -26726 -25981 -4333 -3326 -8557 -5620 1353 -8722 -18174 -19598 -19565
15774a9565L18j437K020R900L6965K2939j4198l3473l0253L000j92N860j1491
$$ -19565 -19247 -20684 -18664 -8764 28201 51140 36942 3469 -26784 -23784 -23976 -18116 -29607
15761b9607Q873J6900j726m064r219n025Q5q4m694m531K3605l845j4952J1989
$$ -29607 -20734 -3834 -5560 -9624 -18843 -23868 -23783 -23867 -28561 -33092 -9487 -13332 -28284 -16295
15747a6295J2991Q038j4783n1K6808N038P540j813j1798m498J701m0085l2648
$$ -16295 -3304 4734 -10049 -10100 16708 21746 29286 27473 15675 11177 12878 -27207 -59855
15734e9855N101o179p634m718J3232K2313l954k2938K2528J3612q02K984P049
$$ -59855 -54754 -60933 -68567 -73285 -60053 -37740 -41694 -64632 -42104 -28492 -29294 -26310 -19261
15721a9261l478P120j0943o750K0448K8022L0086j0433p443P426j1290j0631J392
$$ -19261 -22739 -15619 -26562 -33312 -12864 15158 45244 34811 27368 34794 23504 12873 14265
15708A4265k0249O59k0337l1358j6111M778J2367L678j731J6032J2432N226M922
$$ 14265 -5984 -5325 -25662 -57020 -73131 -68353 -55986 -52308 -54039 -38007 -25575 -20349 -15427
15695a5427J0745m435r617M18j7506j0082K6965J9819N727r719P151K5531J8969
$$ -15427 -4682 -9117 -18734 -18316 -35822 -45904 -18939 880 6607 -3112 4039 29570 48539
15682D8539j4631m0464k2860j6844J4205l051o513O472K2679M836k3854J7361
$$ 48539 33908 -6556 -29416 -46260 -32055 -35106 -41619 -35147 -12468 -7632 -31486 -14125
15670a4125M221L769O906O765K445j9062o650R584L4998m235l3822p836k351q159
$$ -14125 -9904 -6135 771 7536 9981 -9081 -15731 -6147 28851 24616 -9206 -17042 -19393 -27552
15656b7552J6945n045K0580J4451o624o227l270k4607L6180R406j3088J3242j4930
$$ -27552 -10607 -15652 4928 19379 12755 6528 3258 -21349 14831 24237 11149 24391 9461
15643I461j9384K5738L407P146Q023k3209J0837j666k4434J0836L2087r376j9453
$$ 9461 -9923 15815 19222 26368 34391 11182 22019 20353 -4081 6755 38842 29466 10013
15630A0013j0277R931J4146k5907k6856J4166K5949j351j6208J838m819j1341
$$ 10013 -264 9667 23813 -2094 -28950 -14784 11165 9814 -6394 -4556 -9375 -20716
15618b0716K29K953Q944j0128M017M43N68J8901L3197r203j2015o304J232j4372
$$ -20716 -20487 -17534 -8590 -18718 -14701 -14258 -13690 5211 38408 29205 17190 10886 12118 -2254
15604b254j617K731J969j5599j1935J5546M543K1103J2227l7656q370J0066k967
$$ -2254 -3871 -1140 829 -14770 -26705 -11159 -6616 14487 26714 -10942 -19312 -9246 -12213
15591a2213P214j285J944o149L9070K2180l1447j4242J2113P191q115Q526l0865
$$ -12213 -4999 -6284 -4340 -10489 28581 50761 19314 5072 17185 24376 16261 24787 -6078
15578f078k4600l562M8934J9910l8088q552J1822r49n331K978P437p662j2183
$$ -6078 -30678 -34240 14694 34604 -3484 -12036 -214 -1163 -6494 -3516 3921 -3741 -15924
15565a5924k07N10J4227L221M529l019p123M101l936M046j9412k6903j1925J0662
$$ -15924 -16131 -15621 -1394 1827 6356 3337 -3786 315 -3621 425 -18987 -45890 -57815 -47153
15551d7153L0797J8038J2210M236J4733j7581L888j919k0960J5749R682j8372
$$ -47153 -16356 1682 13892 18128 32861 15280 19168 17249 -3711 12038 21720 3348
15539C348l9690l869m547j8778K2338J2378p031j0052O097L8012K8046o734j2711
$$ 3348 -36342 -40211 -44758 -63536 -41198 -28820 -35851 -45903 -39806 -1794 26252 19518 6807
15526F807o687j7850K0251K133P824k4248j3339N917J9247J9229k453j0114j0831
$$ 6807 120 -17730 2521 4654 12478 -11770 -25109 -19192 55 19284 16831 6717 -4114
15513d114K4311j2703r556N782k5909p185J8572L563j3242Q786K7586j0037p546
$$ -4114 20197 7494 -2062 3720 -22189 -29374 -10802 -7239 -20481 -11695 15891 5854 -1692
15500a692m515o612q326J6974J1193k2277q523L0791j8270j7745K3270K6727j1917
$$ -1692 -6207 -12819 -21145 -4171 7022 -15255 -23778 7013 -11257 -29002 -5732 20995 9078
15487I078M767k674p920m77J7753k3458j0828J7364j8152j7149l194J5667K4299
$$ 9078 13845 11171 3251 2774 20527 -2931 -13759 3605 -14547 -31696 -34890 -19223 5076
15474E076l467m001R479l2693j1558O33q087J3682P723p925L366L0727J5195j4008
$$ 5076 1609 -2392 7087 -25606 -37164 -36531 -44618 -30936 -23213 -31138 -27772 2955 18150 4142
15460D142j4772l166j4074R81K6664k133l650K1828Q361k6703j0501M674j1247
$$ 4142 -10630 -13796 -27870 -26889 -225 -2358 -6008 15820 24181 -2522 -13023 -8349 -19596
15447a9596J5579N22o684K1194P423j0449k290J4664q183j2747q274j2077L0035
$$ -19596 -4017 -3495 -10179 11015 18438 7989 5699 20363 12180 -567 -8841 -20918 9117
15434I117j1553l2611J7421J6601M706o862j4312J5967M868L128j070j2172J2048
$$ 9117 -2436 -35047 -17626 -1025 3681 -3181 -17493 -1526 3342 6470 5400 -6772 5276
15421E276j1577j4891M797j5932L473n870J567p656L306K3813J5068j5389j7840
$$ 5276 -6301 -21192 -16395 -32327 -28854 -34724 -33157 -40813 -37507 -13694 1374 -14015 -31855
15408c1855K3453K5448o699k3188j5024J7329K8956j0918k6604j337J718J6964
$$ -31855 -8402 17046 10347 -12841 -27865 -10536 18420 7502 -19102 -20439 -18721 -1757
15396a757J8960q020k0782n836r900L755M8051n909j0635M168K394J6346J685
$$ -1757 17203 9183 -11599 -17435 -27335 -23580 24471 18562 7927 12095 14489 30835 32520
15383C2520j6305l386J0388j9824j0474j5634L0275J1457k2823j1031P284L955
$$ 32520 16215 12829 23217 3393 -7081 -22715 7560 19017 -3806 -14837 -7553 -3598
15371c598O649J4428k2598k3061k2889K240L5514K7031k688R579J6132J7289j2631
$$ -3598 3051 17479 -5119 -28180 -51069 -48829 -13315 13716 11028 20607 36739 54028 41397
15358D1397k2764j0783l1526k7978Q787K4189J1994K0246K479L70j4200N110r274
$$ 41397 18633 7850 -23676 -51654 -42867 -18678 -6684 13562 16041 16411 2211 7321 -1953
15345a953n613J6377j4971p530Q263M57n51j058p292K317J1950M44j668n810K4972
$$ -1953 -7566 8811 -6160 -13690 -5427 -4970 -5521 -6579 -13871 -11554 396 840 -828 -6638 18334
15330A8334O149q092j6934j4329K8638K5550j1733k5503j2174j1142L283P942
$$ 18334 24483 16391 -543 -14872 13766 39316 27583 2080 -10094 -21236 -17953 -10011
15318a0011K6851j0701k8672J289N931P928J715J0424n178M508K784j7747k403
$$ -10011 16840 6139 -22533 -21244 -15313 -7385 -5670 4754 -424 4084 6868 -10879 -13282
15305a3282o396r058P483m885R891J4678j933O855j7327J1304J7259k778j0987
$$ -13282 -19678 -28736 -21253 -26138 -16247 -1569 -3502 3353 -13974 -2670 14589 11811 824
15292H24L7688K6408j3396l7861j3621J3366m137J4639k665p465N153j6975l9197
$$ 824 38512 64920 51524 13663 42 13408 9271 23910 21245 13780 18933 1958 -37239
15279c7239o565K1339J3307J2891j9086j962J3670J0034j1894k561K0218J0217
$$ -37239 -43804 -22465 -9158 3733 -15353 -17315 -3645 6389 -5505 -8066 12152 22369
15267B2369l098l1076j9743L634M49K2680J1035l4280k244L645O079m307K2689
$$ 22369 19271 -11805 -31548 -27914 -27465 -4785 6250 -28030 -30274 -26629 -20550 -24857 -2168
15254b168M57K388J0796q777O335j3427o728K3483j1949k4215j3096J9425p582
$$ -2168 -1711 677 11473 2696 9031 -4396 -11124 12359 410 -23805 -36901 -17476 -25058
15241b5058j20N244M12K05q005J367P632J5276N001k1232j1512r960J1026j1251
$$ -25058 -25178 -19934 -19522 -19317 -27322 -25955 -18323 -3047 1954 -19278 -30790 -40750 -29724 -40975
15227d0975J7933K9219n659l932K5641k0806k4130l486M097K251q767K839M577
$$ -40975 -23042 6177 518 -3414 22227 1421 -22709 -26195 -22098 -19847 -28614 -25775 -21198
15214b1198l606j5452J2245K065N290o053r804J0153p690j0705p997J8588J5039
$$ -21198 -24804 -40256 -28011 -25946 -20656 -26709 -36513 -26360 -34050 -44755 -52752 -34164 -19125
15201a9125O015R5k3556n598o923j2294J025M094J0099l054N789L1769Q860o409
$$ -19125 -13110 -13015 -36571 -42169 -49092 -61386 -60361 -56267 -46168 -49222 -43433 -11664 -2804 -9213
15187i213j2941M335J7423J4986j2445k4448o115K0683J5556o257j8295K3267
$$ -9213 -22154 -17819 -396 14590 2145 -22303 -28418 -7735 7821 1564 -16731 6536
15175F536r659q500Q635j5600k1766J5500k1643N381Q168j4243J5212L558n52
$$ 6536 -3123 -11623 -2988 -18588 -40354 -24854 -46497 -41116 -32948 -47191 -31979 -28421 -28973
15162b8973K1388j7524r133K0273P291J3889K214p075k1090M70R002L810K8259
$$ -28973 -7585 -25109 -34242 -13969 -6678 7211 9425 2350 -18740 -18270 -9268 -5458 22801
15149B2801m973m098j6952j62K151j6204k197j5207J2142P616J3182J1422J4166
$$ 22801 17828 13730 -3222 -3384 -1233 -17437 -19634 -34841 -22699 -15083 -1901 9521 23687
15136B3687J5773j1279L174K8864k1900k155k0718p675N439j3743P683R174K3383
$$ 23687 39460 28181 31355 60219 38319 36164 15446 7771 13210 -533 7150 16324 39707
15123C9707J275j0355l0205k2890o00J037k979l943j7970J905M5508L9685J3522
$$ 39707 40982 30627 422 -22468 -23068 -22031 -25010 -28953 -46923 -45018 490 40175 53697
15110E3697k4019m0881j3044M660j1694N498R685O081L48J9279j133L200J706
$$ 53697 29678 -11203 -24247 -19587 -31281 -25783 -16098 -10017 -9669 9610 8477 11677 13383
15097A3383q99m5151k6930L0441K6867k581K4224N981j2772q694K022r70M155
$$ 13383 12484 -32667 -59597 -29156 -2289 -4870 19354 25335 12563 3869 5891 4921 9076
15084I076J3496J6917q151j3258n917L339o944K478j7487k5634N333J9768l838
$$ 9076 22572 39489 31338 18080 12163 15502 8558 11036 -6451 -32085 -26752 -6984 -10822
15071a0822k2516L580l10J7046J0128m870N455j0355n632J2204r693j6211O336
$$ -10822 -33338 -29758 -30068 -13022 -2894 -7764 -2309 -12664 -18296 -6092 -15785 -31996 -25660
15058b5660J8301J2410P976k1248j6063r998J6304m39j866k0963J3562K5676M962
$$ -25660 -7359 5051 13027 -8221 -24284 -34282 -17978 -18417 -20283 -41246 -27684 -2008 2954
15045B954o712Q45l676j3095n510l7703j5199L7373M8341K7238l326j4607n893
$$ 2954 -3758 -2913 -6589 -19684 -25194 -62897 -78096 -40723 7618 34856 31530 16923 11030
15032A1030j5772J8820j0424j4186P607K5605n190j7336q603Q179L2977P127o820
$$ 11030 -4742 14078 3654 -10532 -2925 22680 17490 154 -8449 -270 32707 39834 33014
15019C3014l4084l7975J3813P867Q290P768k8090J6087J1585O187R823J2446k4225
$$ 33014 -1070 -39045 -25232 -17365 -9075 -1307 -29397 -13310 -1725 4462 14285 26731 2506
15006B506k8083k3172K2606J5452J1953L54j5973m900J7691J368L889P916k4850
$$ 2506 -25577 -48749 -26143 -10691 1262 1616 -14357 -19257 -1566 -198 3691 11607 -13243
14993a3243M162J0161j3840q86M0l806l115J589J6412K1212k0937k8782k1267
$$ -13243 -9081 1080 -12760 -13646 -13606 -17412 -20527 -18938 -2526 18686 -2251 -31033 -52300
14980e2300Q755K3386q88j2152O763k704L997O118L1882k429k1217R410J3376
$$ -52300 -43545 -20159 -21047 -33199 -26436 -29140 -25143 -19025 12857 10428 -10789 -1379 11997
14967A1997O059j4354J2087J1136k0540k3239J0422J1917o608j4346J3479n786
$$ 11997 18056 3702 15789 26925 6385 -16854 -6432 5485 -1123 -15469 -1990 -7776
14955g776j7451j3502M539L2184N926q732j9894r239N469m420l702K2644K1139
$$ -7776 -25227 -38729 -34190 -2006 3920 -4812 -24706 -33945 -28476 -32896 -36598 -13954 7185
14942G185k2394q011q671R330K9188j4285R926J2093J1018l1325r208J0237n369
$$ 7185 -15209 -23220 -31891 -22561 6627 -7658 2268 14361 25379 -5946 -15154 -4917 -10286
14929a0286l503K0889j7529M65J5214j2105j9161o81O096j835J624K1392L6461
$$ -10286 -13789 7100 -10429 -9964 5250 -6855 -26016 -26697 -20601 -22436 -20812 580 37041
14916C7041j4201l2970o295J4860M996q294j5234r071J9360J0280M363J5813k1807
$$ 37041 22840 -10130 -16425 -1565 3431 -4863 -20097 -29168 -9808 472 4835 20648 -1159
14903a159n724J8234J6027J1412j5273k9217l771J3353L700L925K202k8516j6087
$$ -1159 -6883 11351 27378 38790 23517 -5700 -9471 3882 7582 11507 13709 -14807 -30894
14890c0894J4793K1297M07m011j2850j209m577J5847O841p194k230K2159o400
$$ -30894 -16101 5196 5603 1592 -11258 -12467 -17044 -1197 5644 -1550 -3780 18379 11979
14877A1979k2105R052K5732J1056m8062k9782J4181o928M826J5722P969J5415
$$ 11979 -10126 -1074 24658 35714 -12348 -42130 -27949 -34877 -30051 -14329 -6360 9055
14865I055J1434M857Q916Q956k8277k9481j9586J5008K0566n842j1925R492p58
$$ 9055 20489 25346 34262 43218 14941 -14540 -34126 -19118 1448 -4394 -16319 -6827 -7585
14852g585l315L932J4308K3720p139M738l810J335J7275r514k7394k7211j5871
$$ -7585 -10900 -6968 7340 31060 23921 28659 24849 26184 43459 33945 6551 -20660 -36531
14839c6531L740L2648n114p387o489K6496J499l2945N265P125j7853j101J1953
$$ -36531 -32791 -143 -5257 -12644 -19133 7363 8862 -24083 -18818 -11693 -29546 -30647 -18694
14826a8694J4402K4759j5760k3243L0929L4724p801q416q072k723k82J8888k777
$$ -18694 -4292 20467 4707 -18536 12393 47117 39316 30900 22828 20105 19823 38711 35934
14813C5934j2618m1039l1494L3686L4248K588m2910P706J7143p125q66R920k3564
$$ 35934 23316 -17723 -49217 -15531 18717 21305 -21605 -13899 3244 -3881 -4747 5173 -18391
14800a8391k0118K8418Q221j3520k2087j5118M1021J4064o26j1931k0585J3405
$$ -18391 -38509 -10091 -1870 -15390 -37477 -52595 -11574 2490 1864 -10067 -30652 -17247
14788a7247j7302k962M055J8767j8207p145L3771K7095J58J9956N035l9044k7765
$$ -17247 -34549 -37511 -33456 -14689 -32896 -40041 -6270 20825 20983 40939 45974 6930 -20835
14775b0835q995O664L848J2147O296O254n71j2966j4112K516K0751K8661Q305
$$ -20835 -29830 -23166 -19318 -7171 -875 5379 4808 -8158 -22270 -19754 997 29658 37963
14762C7963j6281o092j7944j4302P836K860k3290j3412L273J9259R606j1202J605
$$ 37963 21682 15590 -2354 -16656 -8820 -5960 -29250 -42662 -39389 -20130 -10524 -21726 -20121
14749b0121L5410J8631q60q948k6286j6073Q489K7613J5762j3844k5257j2772
$$ -20121 15289 33920 33060 24112 -2174 -18247 -9758 17855 33617 19773 -5484 -18256
14737a8256J4245L622K16J1718L706j6463j2598k0043J0073K855j2052Q674J547
$$ -18256 -4011 -389 -173 11545 15251 -1212 -13810 -33853 -23780 -20925 -32977 -24303 -22756
14724b2756Q386O764J3797N270k1430l413k380P867P037k838j5905k0500m240
$$ -22756 -14370 -7606 6191 11461 -9969 -13382 -15762 -7895 -858 -3696 -19601 -40101 -44341
14711d4341K4911J4914Q394o304j5997j670n286l574J1006J3297M35L332j0793
$$ -44341 -19430 -4516 3878 -2426 -18423 -20093 -25379 -28953 -17947 -4650 -4215 -883 -11676
14698a1676j2146P02K1499j3936p896P489J20j8469Q739K2943J3203J7985k1666
$$ -11676 -23822 -23120 -1621 -15557 -23453 -15964 -15844 -34313 -25574 -2631 10572 28557 6891
14685F891p925L3830N295j9707K2992K5522j3640m4735j3800j4177L030j5610
$$ 6891 -1034 32796 38091 18384 41376 66898 53258 8523 -5277 -19454 -16424 -32034
14673c2034J1098q950n811K814Q887K2211N896m143l570j9458p548O485K3904
$$ -32034 -20936 -29886 -35697 -32883 -23996 -1785 4111 -32 -3602 -23060 -30608 -24123 -219
14660b19K1684q29P878j8738j3236J5395K4567L866j8021k1617j7797l654J5044
$$ -219 21465 20636 28514 9776 -3460 11935 36502 40368 22347 730 -17067 -20721 -5677
14647e677K1045k1853p791K9968n272l6580l647m310L8525K8795l807j6706j3284
$$ -5677 15368 -6485 -14276 15692 10420 -26160 -29807 -34117 4408 33203 29396 12690 -594
14634e94L6494j94l0292j9194n079J9897J5064m19O241R833M294k2150k8434N849
$$ -594 35900 35706 5414 -13780 -18859 1038 16102 15683 21924 31757 36051 13901 -14533 -8684
14620h684J6860p685K493q865j0340k310P232J7916J9797j0496j6220J5910j0492
$$ -8684 8176 491 2984 -5881 -16221 -18531 -11299 6617 26414 15918 -302 15608 5116
14607E116K93l5114k5095J7579K0758Q66J2203N02j9333Q44P602N189J3209J6056
$$ 5116 5409 -29705 -54800 -37221 -16463 -15597 -3394 -2892 -22225 -21381 -13779 -8590 4619 20675
14593B0675n254l6693m057J389j5254K3674J1312J9303L017q036L474K3683l316
$$ 20675 15421 -21272 -25329 -23940 -39194 -15520 -4208 15095 18112 10076 13550 37233 33917
14580C3917m528j4873J8576L906k0588J1663k371k4770j015J3761M672j1906j9612
$$ 33917 29389 14516 33092 36998 16410 28073 25702 932 -83 13678 18350 6444 -13168
14567a3168j0041M014L931K2124p477j4337m204k2857J1204K4223O290P930j2512
$$ -13168 -23209 -19195 -15264 6860 -617 -14954 -19158 -42015 -30811 -6588 -298 7632 -4880
14554d880r444n893j0399K5032K8551j1723j4595j1938J0773L612j5927n15o165
$$ -4880 -14324 -20217 -30616 -5584 22967 11244 -3351 -15289 -4516 -904 -16831 -17346 -23511
14541b3511J5565K99J693j256j4981K895J3568M1050k1776k4110q788N042j1799
$$ -23511 -7946 -7647 -5954 -7210 -22191 -19296 -5728 35322 13546 -10564 -19352 -14310 -26109
14528b6109K7422K5583J62M172j1571r485l879L4887N835j5134j6049j8255Q88
$$ -26109 1313 26896 27058 31230 19659 10174 6295 41182 47017 31883 15834 -2421 -1533
14515a533N492j0546J4233J7265l819K178J0442k9786n507J6390J246J1025J6090
$$ -1533 3959 -6587 7646 24911 21092 23270 33712 3926 -1581 14809 16055 27080 43170
14502D3170N385j0928K242O994l284j5574K1144m876r908N254j732m392m55q845
$$ 43170 48555 37627 39869 46863 43579 28005 49149 44273 34365 39619 37887 33495 33040 24195
14488B4195j1459J2729N050j904j1521k0463k520J6843J0439N889k2300N038J8043
$$ 24195 12736 25465 30515 28611 17090 -3373 -5893 10950 21389 27278 4978 10016 28059
14475B8059O373j4703J146K5437j3934R445j0929k1763j6538j297K8973J8393
$$ 28059 34432 19729 20875 46312 32378 41823 30894 9131 -7407 -8704 20269 38662
14463C8662j45l8047N613K1606j18K19M191k3091O728J647P166L3330J3287k3900
$$ 38662 38517 470 6083 27689 27571 27790 31981 8890 15618 17265 24431 57761 71048 47148
14449D7148k8908M401j091l928O492j1848k0001j1549j117L2991K1165j1685j7325
$$ 47148 18240 22641 21550 17622 24114 12266 -7735 -19284 -20401 12590 33755 22070 4745
14436D745M622J5615r694n511k3998j4971Q98M046J2113J4123m779K971J7975
$$ 4745 9367 24982 15288 9777 -14221 -29192 -28294 -24248 -12135 1988 -2791 180 18155
14423A8155k522k1017J5246N597p315J7409K2906o158k2698l995j0030j0697Q515
$$ 18155 15633 -5384 9862 15459 8144 25553 48459 42301 19603 15608 5578 -5119 3396
14410C396J7208k3511l448l023j480j5200J7486K5496K9055k2969l0854j0570
$$ 3396 20604 -2907 -6355 -9378 -10858 -26058 -8572 16924 45979 23010 -7844 -18414
14398a8414k3292J3064J0729k4359J5312K5957L424J3559j2048J596R590J3666
$$ -18414 -41706 -28642 -17913 -42272 -26960 -1003 2421 15980 3932 5528 15118 28784
14386B8784j2495n55p72l1390R253L609P180k698K1125k755m4566N500L0139j215
$$ 28784 16289 15734 14962 -16428 -7175 -3566 3614 916 22041 19286 -25280 -19780 10359 9144
14372I144O490N545j4983K959K3667n566M851R945j6964j8642M136L23K0944r405
$$ 9144 15634 21179 6196 9155 32822 27256 32107 42052 25088 6446 10582 10905 31849 22444
14358B2444J91K7532n84l1131k5335O66J1667J148k6373J2070R235J0495q715
$$ 22444 22635 50167 49583 18452 -6883 -6217 5450 6598 -19775 -7705 1530 12025 3310
14345C310n488J543j0000j3827j2116K0443j8570J6949J6257Q924Q003j8799j8568
$$ 3310 -2178 -635 -10635 -24462 -36578 -16135 -34705 -17756 -1499 7425 15428 -3371 -21939
14332b1939P519P643K3283Q093J1202q594Q0K7726j6433m0481p236J7664J1474
$$ -21939 -14420 -6777 16506 24599 35801 27207 27287 55013 38580 -1901 -9137 8527 20001
14319B0001p355j760j182J254Q757M36K2213N38j0556K129l294J527l205j773
$$ 20001 12646 10886 9704 10958 19715 20151 42364 42902 32346 34475 31181 32708 29503 27730
14305B7730m18l314j2622Q413J9018j384n115n690j386l092J2726o483j3137J404
$$ 27730 27312 23998 11376 19789 38807 37423 32308 26618 25232 22140 34866 28383 15246 16650
14291A6650K465K4457q159K477j1338K1317k624j2831j3274k377j1210J0696j5398
$$ 16650 19115 43572 35413 37890 26552 47869 45245 32414 19140 16763 5553 16249 851
14278H51j8312q970K894K0746J8221j7687J2000R110L433P086n797Q301K0162
$$ 851 -17461 -26431 -23537 -2791 15430 -2257 9743 18853 22286 29372 23575 31876 52038
14265E2038k2302k3589l273l791J6642Q139k2467n436K1104J1202P21j1623k3227
$$ 52038 29736 6147 2874 -917 15725 23864 1397 -4039 17065 28267 28988 17365 -5862
14252e862r007K2008K8548j9163j4451j1008k6725k0444J0259K2516N113k795
$$ -5862 -14869 7139 35687 16524 2073 -8935 -35660 -56104 -45845 -23329 -18216 -21011
14240b1011K015N391O007K1002J4513K065k3426O201j738p641M387J9646j0501
$$ -21011 -18996 -13605 -7598 13404 27917 29982 6556 12757 11019 3378 7765 27411 16910
14227A6910p164J1129J2382p613k3380n869J2359o643r57m010j3605k205K8072
$$ 16910 9746 20875 33257 25644 2264 -3605 8754 2111 1154 -2856 -16461 -18666 9406
14214I406J4098P960o049n89J1089J0234j5823O899j4766k9828K2380K9287N179
$$ 9406 23504 31464 25415 24826 35915 46149 30326 37225 22459 -7369 15011 44298 49477
14201D9477R04l457o019J1733m215k6765j1212M586n338j5487k777L746n935k1073
$$ 49477 50381 46924 40905 52638 48423 21658 10446 15032 9694 -5793 -8570 -4824 -10759 -31832
14187c1832l296K0059K0507Q639N99k735L953M409j238p923j2354J7858J5511
$$ -31832 -35128 -15069 5438 14077 14676 11941 15894 20303 19065 11142 -1212 16646 32157
14174C2157Q910n651k3538j3564N599M540k0509M821M5614M811j5698j4070O516
$$ 32157 41067 35416 11878 -1686 3913 8453 -12056 -7235 38379 43190 27492 13422 19938
14161A9938j2545R847J2047k0424N572l541j1859K9756k506j7863J7292J6206
$$ 19938 7393 17240 29287 8863 14435 10894 -965 28791 26285 8422 25714 41920
14149D1920j0544L982j7479l3789j2635R226k515j2217K7770J6025J2864j3377
$$ 41920 31376 35358 17879 -15910 -28545 -19319 -21834 -34051 -6281 9744 22608 9231
14137I231j806j9852j0380l970J1004K390q575K982l273P14P67J8791J7265J220
$$ 9231 7425 -12427 -22807 -26777 -15773 -13383 -21958 -18976 -22249 -21535 -20768 -1977 15288 16508
14123A6508J39J1376j4878k1196J6892J1932P359k750j1067J2297K5849J5323
$$ 16508 16647 28023 13145 -8051 8841 20773 28132 25382 14315 26612 52461 67784
14111F7784j3785k6734J8794K6395J292k7723r988J1697j1934r195J6290M745
$$ 67784 53999 27265 46059 72454 73746 46023 36035 47732 35798 26603 42893 47638
14099D7638l57K534j2578j1107J9928K703j5367l816L8338K1127J053k5897j6143
$$ 47638 47281 49815 37237 26130 46058 48761 33394 29578 67916 89043 90096 64199 48056
14086D8056j6469J4953L3126J9248j3908r748J0271l865M114L2244O531R642J0406
$$ 48056 31587 46540 79666 98914 85006 75258 85529 81664 85778 118022 124553 134195 144601
14073A44601j0613K3089P4088J01452J26209J92719L24482M71649M24934K51057
$$ 144601 133988 157077 231165 332617 458826 651545 976027 1447676 1872610 2123667
14063B123667J36664j06796m31476m99027l65609j96027r4571o9416n7182j8138
$$ 2123667 2260331 2153535 1722059 1223032 857423 661396 566825 497409 440227 422089
14053D22089k4596l9280l8808l3007l0044K908l9950m2549r998m135J0155K5199
$$ 422089 397493 358213 319405 286398 256354 259262 219312 176763 166765 162630 172785 197984
14041A97984J3414j9143m9944o202L2317M923j6508r157K5564n07j7696k8841
$$ 197984 211398 192255 142311 136109 168426 173349 156841 147684 173248 172741 155045 126204
14029A26204k5794k8321k0312r299J0785L2266J7692r681q706m485l711K3263
$$ 126204 100410 72089 51777 42478 53263 85529 103221 93540 84834 80349 76638 99901
14017I9901j333J2467j6738j7067J038q807J7291J0302K183k063k5029p411R628
$$ 99901 98568 111035 94297 77230 78268 69461 86752 97054 99237 97174 72145 64734 74362
14004G4362N258O89J8850N1181R6141J06946J61062K09073J49590P4624j7294
$$ 74362 79620 80309 99159 150340 246481 353427 514489 723562 873152 947776 930482
13993I30482j46467k35843j84569q1882m8384q554o429m4617l4791j7102j0039
$$ 930482 784015 548172 363603 281721 233337 224783 218354 173737 138946 121844 111805
13982A11805j4415J4488m189L815K77k3373j1862K1043K107j0171P083j1917o179
$$ 111805 97390 111878 107689 111504 111781 88408 76546 97589 99696 89525 96608 84691 78512
13969G8512j6665m1440J968K2543J6013j4346J2072K3291k0510m329j094K838
$$ 78512 61847 20407 22375 44918 60931 46585 58657 81948 61438 57109 56015 58853
13957E8853R594J2621Q296l2018k1114j4635j0247n2J1397l263J0100J2353L83
$$ 58853 68447 81068 89364 57346 36232 21597 11350 11298 22695 19432 29532 41885 42268
13944D2268j8336N160Q244M618J108M082O904K4577k798l1064l5042P348J7413
$$ 42268 23932 29092 37336 41954 43062 47144 54048 78625 75827 44763 9721 17069 34482
13931C4482N370k935J5313L902p537j9298O091J1351J6091K0941r296o630N179
$$ 34482 39852 36917 52230 56132 48595 29297 35388 46739 62830 83771 74475 67845 73024
13918G3024R288r220j4788m671L0277p85M67j8089m920r575K2978J4108j4398
$$ 73024 82312 73092 58304 53633 83910 83125 83592 65503 60583 51008 73986 88094 73696
13905G3696N410n248J0342Q464k324j6959m672M6800K8350J7445P591l7413o7513
$$ 73696 79106 73858 84200 92664 90340 73381 68709 115509 143859 161304 168895 131482 63969
13892F3969p9310l57J4962k588p061p638j4925J4680L4669J0002o658k1668j3748
$$ 63969 -15341 -15698 -736 -3324 -10385 -18023 -32948 -18268 16401 26403 19745 -1923 -15671
13879a5671K3433L0011L132J4091O468k9842n624L977r543M62j0029k3754k977
$$ -15671 7762 37773 40905 54996 61464 31622 25998 29975 20432 20894 10865 -12889 -15866
13866a5866M107J1236K0088J9784R674k5004l4624n145J5386j423n545J0343L4866
$$ -15866 -11759 -523 19565 39349 49023 24019 -10605 -15750 -364 -1787 -7332 3011 37877
13853C7877J5776j7870j457J9276J0306J0940j4176K0455N4673L2109M0368M1264
$$ 37877 53653 35783 34326 53602 63908 74848 60672 81127 135800 167909 208277 249541
13841B49541L3838j2300j8712k4344j5514k3308k210k7494l5987m840J3973k872
$$ 249541 283379 271079 252367 228023 212509 189201 186991 159497 123510 118670 132643 129771
13829A29771n109k992j0181J9786J3433K1281N379o685p001k4026j0260j2093
$$ 129771 124662 121670 111489 131275 144708 165989 171368 164683 157682 133656 123396 111303
13817A11303n159L8905l188k6296l7695j5447o623J5699J9193k4072j3029r171
$$ 111303 106144 145049 141861 115565 77870 62423 55800 71499 90692 66620 53591 44420
13805D4420J8020k7253k0011j9227J5499J9687J0742j711j0497J495K6459J220
$$ 44420 62440 35187 15176 -4051 11448 31135 41877 40166 29669 31164 57623 58843
13793E8843k6498q680m152l6381j8695M598N715K2296L0482K8805K3591J2343
$$ 58843 32345 23665 19513 -16868 -35563 -30965 -25250 -2954 27528 56333 79924 92267
13781I2267j6424k602l535N74n826J1777n325j7431p963J0728L1602O901l5570
$$ 92267 75843 73241 69706 70280 64454 76231 70906 53475 45512 56240 87842 94743 59173
13768E9173j8394J2919O735p601J6263J5244L924K2230K0163r544j3028k3483
$$ 59173 40779 53698 60433 52832 69095 84339 88263 110493 130656 121112 108084 84601
13756H4601J6825k1456k4589n691p981m306J5803J3123l237J7777K7562K0626
$$ 84601 101426 79970 55381 49690 41709 37403 53206 66329 63092 80869 108431 129057
13744A29057O851n835J362oq684K7063n890r217l608n559p658K1051L3033L7190
$$ 129057 135908 130073 131435 131429 122745 149808 143918 134701 131093 125534 117876 138927 171960 209150
13730B09150N1028m383j2647k0741P192K037q79J808N702K9133N4087M1926M8676
$$ 209150 260178 255795 243148 222407 229599 231636 230757 232565 238267 267400 321487 363413 412089
13717D12089N0570J7581j4894m6433l9284n5289p9576n6546M061j5028J1518K6119
$$ 412089 462659 480240 465346 418913 379629 324340 244764 188218 192279 177251 188769 214888
13705B14888M9336K4766L4188K6127J4018l998k8532j9666N952J363j1104J7669
$$ 214888 264224 288990 323178 349305 363323 359325 330793 311127 317079 318442 307338 325007
13693C25007O2955K7199o237l079r935J3089J3983j7190k589J7979R690N022K162
$$ 325007 387962 415161 408924 405845 395910 408999 422982 405792 403203 421182 430872 435894 438056
13680D38056Q007j445Q0k5441j3254l821j0573J8058L7959K0378K6002J6592o262
$$ 438056 446063 444618 444698 419257 406003 402182 391609 409667 447626 468004 494006 510598 504336
13667E04336k5654L737K1144K4217L054k2245O28J9806J4399j0918N214L9873
$$ 504336 478682 482419 503563 527780 530834 508589 509217 529023 543422 532504 537718 577591
13655E77591K8092K509K3087K1046N513M2992L1179J9361m868J0926J6999K5610
$$ 577591 605683 608192 631279 652325 657838 700830 732009 751370 746502 757428 774427 800037
13643H00037M9426O0461M6738n526R410N3966M0430N1017M0111M6139L2034J9504
$$ 800037 849463 909924 956662 951136 960546 1014512 1054942 1105959 1146070 1192209 1224243 1243747
13631A243747J2281j2613K0162M2091P2563J01574J24052J52742J64135J32284
$$ 1243747 1256028 1243415 1263577 1305668 1378231 1479805 1603857 1756599 1920734 2053018
13621B053018J70482K14807J52042J33321J49937J54512K08439K75295K68853
$$ 2053018 2223500 2438307 2590349 2723670 2873607 3028119 3236558 3511853 3780706
13612C780706L06783L78624M57083N48685O28889P56013Q96250J039683J249888
$$ 3780706 4087489 4466113 4923196 5471881 6100770 6856783 7753033 8792716 10042604
13603A0042604J525298J808193K120826K490158K911935L622391M849888P044432
$$ 10042604 11567902 13376095 15496921 17987079 20899014 24521405 29371293 36415725
13595C6415725J1037528J8225572L1360236N4648540Q4973645R0662588O0280160
$$ 36415725 47453253 65678825 97039061 151687601 236661246 327323834 387603994
13588C87603994L9657226P662507o6218534j11538772q3336476m7244942k7074547
$$ 387603994 427261220 434923727 368705193 257166421 173829945 126585003 99510456
13581I9510456j6589789j1087653q045350o237894n006473m077036l678914l529752
$$ 99510456 82920667 71833014 63787664 57549770 52543297 48466261 44787347 41257595
13573D1257595l100786k542245k163585j808062j564092j380493j242213j153397
$$ 41257595 38156809 35614564 33450979 31642917 30078825 28698332 27456119 26302722
13565B6302722j029219r82519j026907j058592j043345r83067r01687p72630o75109
$$ 26302722 25273503 24290984 23264077 22205485 21162140 20179073 19277386 18504756 17829647
13556A7829647o00388n12874m77418m31359l96091m13949m18344m39203m86194
$$ 17829647 17229259 16716385 16238967 15807608 15411517 14997568 14579224 14140021 13653827
13547A3653827m66530m16408l89768l58457l45413l46973l84876l51123l18403
$$ 13653827 13187297 12770889 12381121 12022664 11677251 11330278 10945402 10594279 10275876
13538A0275876k76445k80591l13950k75748k72966k64324k73827k45346k16869
$$ 10275876 9999431 9718840 9404890 9129142 8856176 8591852 8318025 8072679 7855810
13529G855810k40750j91265j81778j89329j82270j74703j87612k06243j98691
$$ 7855810 7615060 7423795 7242017 7052688 6870418 6695715 6508103 6301860 6103169
13520F103169j79365j50028j21537j10789r2140j45880j33722j39778j45643j53044
$$ 6103169 5923804 5773776 5652239 5541450 5449310 5303430 5169708 5029930 4884287 4731243
13510D731243j36511q2325j28584j71641j54576j49992r9832q9314q8632j02207
$$ 4731243 4594732 4512407 4383823 4212182 4057606 3907614 3807782 3718468 3629836 3527629
13500C527629j18733j20682r8154j08941r3495m5463o4680q7450r6335o0372o4628
$$ 3527629 3408896 3288214 3190060 3081119 2987624 2942161 2877481 2790031 2693696 2633324 2568696
13489B568696p8522p0280o4908n6648o1635m9746m1101k2115n82l7208n3070m7578
$$ 2568696 2490174 2419894 2354986 2298338 2236703 2186957 2145856 2123741 2123159 2085951 2032881 1985303
13477A985303l3197k1277k1547j7014l191k50J7097L8209L740l2040k5784k0817
$$ 1985303 1952106 1930829 1909282 1892268 1889077 1888827 1905924 1944133 1947873 1915833 1890049 1869232
13465A869232m9843j05449j35016j23483j07002j44645j47819j19202p2714k3105
$$ 1869232 1819389 1713940 1578924 1455441 1348439 1203794 1055975 936773 864059 840954
13455H40954m988j5025k9582j2560n5773n3112k4342k4093k8364k8787k9166l6690
$$ 840954 835966 820941 791359 778799 723026 669914 645572 621479 593115 564328 535162 498472
13443D98472l692M134j9335l8434j6358L648j9305m8935k2655k1295R348K1580
$$ 498472 494780 498914 479579 441145 424787 428435 409130 360195 337540 316245 325593 347173
13431C47173Q903J2268J0337p057q972j4120L4128K0093j6652k3138j3791p549
$$ 347173 356076 368344 378681 371624 362652 348532 382660 402753 386101 362963 349172 341623
13419C41623k9120k2501J8448J7256J7419J2652r684k0135j2343O540r187k81
$$ 341623 312503 290002 308450 325706 343125 355777 346093 325958 313615 320155 310968 310687
13407C10687r147J3069J4245J8697n672J3902o235m3706m065M036K3284k7945
$$ 310687 301540 314609 328854 347551 341879 355781 349546 305840 301775 305811 329095 301150
13395C01150j6767J3026j5073j921k081K1157M1242K9356M197n89q532l5540j1722
$$ 301150 284383 297409 282336 280415 278334 299491 340733 370089 374286 373697 365165 329625 317903
13382C17903R97j8j5611l0516N864P20j0083J964Q124j7374J832L498p188j0368
$$ 317903 318900 318882 303271 272755 278619 279339 269256 271220 279344 261970 263802 267300 260112 249744
13368B49744Q137K6870J3819j9562j2241J1401k3777k2131k622n676k3535j9464
$$ 249744 257881 284751 298570 279008 266767 278168 254391 232260 229638 223962 200427 180963
13356A80963n309O328N812J6068J4118Q387q527m50j1681p951J754o087O944M544
$$ 180963 175654 181982 187794 203862 217980 226367 217840 217390 205709 197758 199512 193425 200369 204913
13342B04913o160j4161J1812K8957l985q292J2831j0655j1653N592J5978N947
$$ 204913 198753 184592 196404 225361 221376 213084 225915 215260 203607 209199 225177 231124
13330B31124j3223j4295k159j0306k8708J5337J1558j6607q717k1567m6520m789
$$ 231124 217901 203606 201447 191141 162433 177770 189328 172721 164004 142437 95917 91128
13318I1128J3127P933k520O315Q770J5155J1728j2817j6660j0436l2872l271J7033
$$ 91128 104255 112188 109668 115983 124753 139908 151636 138819 122159 111723 78851 75580 92613
13305I2613O580o49j0576L481p944L4785J9735j3934k0162l940K3518K710M395
$$ 92613 99193 98544 87968 91449 83505 118290 138025 124091 103929 99989 123507 126217 130612
13292A30612L1172k8512m5092J3670J6204k774n015j569k4595l2938l2198k6505
$$ 130612 161784 133272 88180 101850 118054 115280 110265 108696 84101 51163 18965 -7540
13280g540k1961l3803j7564K3441J0821Q28L2952J3455m560k6559j0495J8872
$$ -7540 -29501 -63304 -80868 -57427 -46606 -45778 -12826 629 -3931 -30490 -40985 -22113
13268b2113L7740P202K0671j8502j2925N306K1256O976j7031j7465m127M085J794
$$ -22113 15627 22829 43500 24998 12073 17379 38635 45611 28580 11115 6988 11073 12867
13255A2867n915j6094R417l92N209J0227K713J1853J5888j1618j885J486r2k835
$$ 12867 6952 -9142 275 -117 5092 15319 18032 29885 45773 34155 32270 33756 33664 30829
13241C0829Q652M343o285K100m432o043J8475j0749j0178O883J1321P551k4123
$$ 30829 39481 43824 37539 39639 35207 29164 47639 36890 26712 33595 44916 52467 28344
13228B8344k6299J9119J0404q59j7396K0168J3359O723k2543m428J1743O824p595
$$ 28344 2045 21164 31568 30709 13313 33481 46840 53563 31020 26592 38335 45159 37564
13215C7564o187J3398J7443Q543k1748L83l384O659J6062m281k3242l550J2431
$$ 37564 31377 44775 62218 70761 49013 49396 46012 52671 68733 64452 41210 37660 50091
13202E0091j444j2267j7335O132r512p318N01J4795J6055j3476k0408L012K3782
$$ 50091 48647 36380 19045 25177 15665 8347 8848 23643 39698 26222 5814 8826 32608
13189C2608J7901J1122q715j6170k7169J192K1293n466l2047k1118l397R958K4190
$$ 32608 50509 61631 52916 36746 9577 10769 32062 26596 -5451 -26569 -29966 -20008 4182
13176D182L2481J1171o153p642k4221O546N547O103r134j0604J2952J3840J0378
$$ 4182 36663 47834 41681 34039 9818 16364 21911 28014 18880 8276 21228 35068 45446
13163D5446J8651n513l4283j725r886o554K8151o548J8213M575j404j929J1652
$$ 45446 64097 58584 24301 22576 12690 6136 34287 27739 45952 50527 49123 47194 58846
13150E8846J1385L397k2700k1779k0221q045r696J0739O72k3470j9345J2400J862
$$ 58846 70231 73628 50928 29149 8928 883 -8813 1926 2598 -20872 -40217 -27817 -25955
13137b5955K3876J6180k3036m818K4516J3190k0565l4819p020L401L6108Q934
$$ -25955 -2079 14101 -8935 -13753 10763 23953 3388 -31431 -38451 -35050 1058 9992
13125I992j5048K237n172J0206O236L8851K6854K6217J7151K9299L5509L4229
$$ 9992 -5056 -2819 -7991 2215 8451 47302 74156 100373 117524 146823 182332 216561
13113B16561P8324R8476J55189K70467M01006M55026L27441K17771M2775l19185
$$ 216561 294885 393361 548550 819017 1220023 1675049 2002490 2220261 2263036 1943851
13103A943851n32617m26440k61266j51537p3356o9126l7099j2576m0951l9631
$$ 1943851 1411234 984794 723528 571991 498635 429509 392410 379834 338883 299252
13093B99252l0941l3282n872l1603K0385R924k0784l542r320O682p3k6106j9001
$$ 299252 268311 235029 229157 197554 217939 227863 207079 203537 194217 200899 200826 174720 155719
13080A55719k0420J0158R000l4705j2620R557j5417O337Q967M884P59l051k4497
$$ 155719 135299 145457 154457 119752 107132 116689 101272 107609 116576 121460 122219 119168 94671
13067I4671n452K2930j9650k7428J6053Q002j7847j5923k9008j867L460J2907
$$ 94671 89219 112149 92499 65071 81124 89126 71279 55356 26348 24481 27941 40848
13055D0848J9685M933k5852k8795J8028j0032n886K5454P839J714k8811j1893
$$ 40848 60533 65466 39614 10819 28847 18815 12929 38383 46222 47936 19125 7232
13043G232K5863K6067o071J9194q310k5035L35j47P093J8392M525J539j2845l3951
$$ 7232 33095 59162 53091 72285 63975 38940 39275 39128 46221 64613 69138 70677 57832 23881
13029B3881j1644J3151J5480l887q635Q442j2624j1328j3866N659J3047m504k671
$$ 23881 12237 25388 40868 36981 28346 36788 24164 12836 -1030 4629 17676 13172 10501
13016A0501Q340R639J633J0636J7328p948j9294L42k4344N523q636j9045k7562
$$ 10501 18841 28480 30113 40749 58077 50129 30835 31177 6833 12356 3720 -15325 -42887
13003d2887p718L0916K0938L707k8572n490K6307J1803j1160M401J270k2165J9910
$$ -42887 -50605 -19689 1249 4956 -23616 -29106 -2799 9004 -2156 2245 3515 -18650 1260
12990A260L372j0315O161K6230J6204k2016l4896M543k168K574K446K72J5044
$$ 1260 4632 -5683 478 26708 42912 20896 -14000 -9457 -11625 -9051 -6605 -6333 8711
12977H711K8146P800j402j1160n306k818o103q979J582O13R13j3055J558J4974
$$ 8711 36857 44657 43255 32095 26789 23971 17868 8889 10471 11084 11997 -1058 500 15474
12963A5474J3033j2251l5337m664L607K0386K3836L2298J5659K006N226k133j8268
$$ 15474 28507 16256 -19081 -23745 -20138 248 24084 56382 72041 74047 79273 77140 58872
12950E8872m769k5308q578j9710j1315r265o338J8532L4350K4484J3256K483j9388
$$ 58872 54103 28795 20217 507 -10808 -20073 -26411 -7879 26471 50955 64211 66694 47306
12937D7306k5736O300J9130j304j3177j5798n891j5936Q705J3093j179J3742k162
$$ 47306 21570 27870 47000 45696 32519 16721 10830 -5106 3599 16692 15513 29255 27093
12924B7093r307q173k1749j1405j5130n463K7851J9667L392J930K267j5003j8445
$$ 27093 17786 9613 -12136 -23541 -38671 -44134 -16283 3384 6776 8706 10973 -4030 -22475
12911b2475q641p77J5737J3356L605j3713l929P672K8595r068p452N983Q048J4662
$$ -22475 -31116 -31893 -16156 -2800 805 -12908 -16837 -9165 19430 10362 2910 8893 16941 31603
12897C1603j7477o481p843q471J0303J8818K0608N39q418o828j2612j8851k100
$$ 31603 14126 7645 -198 -8669 1634 20452 41060 41599 33181 26353 13741 -5110 -7210
12884g210k4571J637K1131J397j5432l5367K4249K8552J3787j1471k0696J15K6058
$$ -7210 -31781 -30144 -9013 -7616 -23048 -58415 -34166 -5614 8173 -3298 -23994 -23879 2179
12871B179O450j5817J3161K0278P40j3849J105l110j4515k5910M596J8672p848
$$ 2179 8629 -7188 5973 26251 26991 13142 14247 11137 -3378 -29288 -24692 -6020 -13868
12858a3868p674l847O838Q14j2020J3892K3411K6471k0815n59m130K942Q932R167
$$ -13868 -21542 -25389 -18551 -17737 -29757 -15865 7546 34017 13202 12643 8513 11455 20387 29554
12844B9554l0634j1307K0854K5963k2915k7719o757q210R84J0448m416q508L756
$$ 29554 -1080 -12387 8467 34430 11515 -16204 -22961 -31171 -30187 -19739 -24155 -32663 -28907
12831b8907K8986J0686j197L987R876J8291J04j800K4165j9599k6025m3660o381
$$ -28907 79 10765 9568 13555 23431 41722 41826 40026 64191 44592 18567 -25093 -31474
12818c1474L6405L877J4930P761j0330r884j3762j1082J4212k276j4339J5326
$$ -31474 4931 8808 23738 31499 21169 11285 -2477 -13559 653 -1623 -15962 -636
12806f36P181p604k8867j1371J3366L1491m098l1711O888J5865K3647k2186M564
$$ -636 6545 -1059 -29926 -41297 -27931 3560 -538 -32249 -25361 -9496 14151 -8035 -3471
12793c471J6646R915j0182J164p162N282J1612L0j6945J344J4630K4720K62j9829
$$ -3471 13175 23090 12908 14072 6910 12192 23804 23834 6889 8233 22863 47583 47845 28016
12779B8016l6615l039L833N22k564J2J2439J1443k3028l014j781R561j951J0840
$$ 28016 -8599 -11638 -7805 -7283 -9847 -9835 2604 14047 -8981 -11995 -13776 -4215 -6166 4674
12765D674P94j2366p599j1665p773q414r275j651J8640K801j5795k5318m509K5446
$$ 4674 5468 -6898 -14497 -26162 -33935 -42349 -51624 -53275 -34635 -31834 -47629 -72947 -77456 -52010
12751e2010K2453K1622o413k4200J079J4640R95j0891p81L212J8802K2010q64
$$ -52010 -29557 -7935 -14348 -38548 -37469 -22829 -21834 -32725 -33506 -30294 -11492 10518 9654
12738I654k779m152j2133R46j136k4606J4026k649j3169L5883J4750o803j64l225
$$ 9654 6875 2723 -9410 -8464 -9600 -34206 -20180 -22829 -35998 -115 14635 7832 7668 4443
12724D443j1420K715l645K070o510o215J455j4340J4956L6002j1229j6084r512
$$ 4443 -6977 -4262 -7907 -5837 -12347 -18562 -17107 -31447 -16491 19511 8282 -7802 -17314
12711a7314J2414J6254J8211k2724O563J3973j6987l0504o861K3912K2299O757
$$ -17314 -4900 11354 29565 6841 13404 27377 10390 -20114 -26975 -3063 19236 25993
12699B5993m2J785R505j235j2485j383r967Q222p037m1583l7914K2148J1715J4556
$$ 25993 25951 27736 37241 36006 23521 22138 12171 20393 13356 -28227 -66141 -43993 -32278 -17722
12685a7722O898j2827k107K0621M1375J0604l2833J3780p526j1873J3514m653
$$ -17722 -10824 -23651 -25758 -5137 36238 46842 14009 27789 20263 8390 21904 17251
12673A7251j4420k4808j1751K4775l10k2410j2213O071L1378J9120j1628j7243
$$ 17251 2831 -21977 -33728 -8953 -9263 -31673 -43886 -37815 -6437 12683 1055 -16188
12661a6188R850J0209q367j2433l4480q004o56K7402K4803O819J6114O187j7452
$$ -16188 -6338 3871 -4496 -16929 -51409 -59413 -60069 -32667 -7864 -1045 15069 21256 3804
12648C804R11j2258o916Q013j2701J3383m845k2772j6126P70J7017J8883K2388
$$ 3804 4715 -7543 -14459 -6446 -19147 -5764 -10609 -33381 -49507 -48737 -31720 -12837 9551
12635I551l7393j4269J2940M4377j7118l5152q440K2733R799m512j799K4213l311
$$ 9551 -27842 -42111 -29171 15206 -1912 -37064 -45504 -22771 -12972 -17484 -19283 4930 1619
12622A619q874j3089N713K0861J7460M134k2960j6071O312l693J163M027o793
$$ 1619 -7255 -20344 -14631 6230 23690 27824 4864 -11207 -4895 -8588 -7425 -3398 -10191
12609a0191j4715Q436R219k389j8658j927N113O57J0509R668j3388j0078P275
$$ -10191 -24906 -16470 -7251 -9640 -28298 -30225 -25112 -24455 -13946 -4278 -17666 -27744 -20469
12596b0469L1539K732J3341j5781l0914n914J599J7180N655N355K4091J4356K258
$$ -20469 11070 13802 27143 11362 -19552 -25466 -23867 -6687 -1032 4323 28414 42770 45028
12583D5028M388q350r618n355q61o248j9870q980J9329J8415J6102r065r137k3691
$$ 45028 49416 41066 31448 26093 25232 18984 -886 -9866 9463 27878 43980 34915 25778 2087
12569B087J873j5973J2005L2129p931k3289K4791K6111k2214j8106p815J3569
$$ 2087 3960 -12013 -8 32121 24190 901 25692 51803 29589 11483 3668 17237
12557A7237m141m005j2683P832k6975q530K6916L6021R593o050l4569J7239K1083
$$ 17237 13096 9091 -3592 4240 -22735 -31265 -4349 31672 41265 35215 646 17885 38968
12544C8968m593l2692J309Q492j7032o831J3517J7266J2450j0294k1440n29R422
$$ 38968 34375 1683 2992 11484 -5548 -12379 1138 18404 30854 20560 -880 -1409 8013
12531H013l282q145R107K686j7563k578L868J0050K176j3000n924j5061p626O378
$$ 8013 4731 -3414 5693 8379 -9184 -11762 -7894 2156 4332 -8668 -14592 -29653 -37279 -30901
12517c0901j8738l790j0716N834J6560O723J0462m271%P187J1002J496K1132J2825
$$ -30901 -49639 -53429 -64145 -58311 -41751 -35028 -24566 -28837 -28837 -21650 -10648 -9152 11980 24805
12503B4805J7043j4007l0620k4303j517K0247K0591J6023K283j5430N335J0292
$$ 24805 41848 27841 -2779 -27082 -28599 -8352 12239 28262 30545 15115 20450 30742
12491C0742j1333R259K9220j9833k3162m406K796q620J8055p874k4434K5486K2258
$$ 30742 19409 28668 57888 38055 14893 10487 13283 4663 22718 14844 -9590 15896 38154
12478C8154P005k3429l2724j3333j0855o323K7586q826O338K5565K715J6492J3062
$$ 38154 45159 21730 -10994 -24327 -35182 -41505 -13919 -22745 -16407 9158 11873 28365 41427
12465D1427m828r930l281k5920n51O782J7064o005J356K6234J367j6853p489k6681
$$ 41427 36599 26669 23388 -2532 -3083 3699 20763 14758 16114 42348 43715 26862 19373 -7308
12451g308p065j6160j1100j8Q096J4677K767M541p046j7549R097p716j6777R777
$$ -7308 -14373 -30533 -41633 -41651 -33555 -18878 -16111 -11570 -18616 -36165 -27068 -34784 -51561 -41784
12437d1784J0632J8873K4524j3316k5695k711J2000O850J5632K4529k349j1093
$$ -41784 -31152 -12279 12245 -1071 -26766 -29477 -17477 -10627 5005 29534 27185 16092
12425A6092q301N810N106O752J3572k739Q690R770j9997J4495J3032j2726k2613
$$ 16092 7791 13601 18707 25459 39031 36292 44982 54752 34755 49250 62282 49556 26943
12412B6943n281j375o371o723R286l25p268r284o816j9814k939k4412m940k387
$$ 26943 21662 20287 13916 7193 16479 16154 8886 -398 -7214 -27028 -29967 -54379 -59319 -61706
12398f1706K3300K3557K5527J3628j6435j6324k3438r144R344J4507o158J3290
$$ -61706 -38406 -14849 10678 24306 7871 -8453 -31891 -41035 -31691 -17184 -23342 -10052
12386a0052L115j2698p821K8871J380j5233o431K3960p06k8224l1532J3821K9973
$$ -10052 -6937 -19635 -27456 1415 2795 -12438 -18869 5091 4385 -23839 -55371 -41550 -11577
12373a1577K7985K9905j6280r894k2697k338Q192l0408j1630J2440K3980J407
$$ -11577 16408 46313 30033 20139 -2558 -4896 3296 -27112 -38742 -26302 -2322 -915
12361i15J2443K2992j939m186k5572k2974R48J7983p339j8787j0792r176l721
$$ -915 11528 34520 32581 28395 2823 -20151 -19203 -1220 -8559 -27346 -38138 -47314 -51035
12348e1035J2699K9107K395k855J6857K2552r636j1405m206L833J2702J0042p429
$$ -51035 -38336 -9229 -6834 -9689 7168 29720 20084 8679 4473 8306 21008 31050 23621
12335B3621K139j3892M313J0700k6166l0834m109J7357j654n721J0218J3475K019
$$ 23621 25760 11868 16181 26881 715 -30119 -34228 -16871 -18525 -24246 -14028 -553 1466
12322A466J3741J690k0813l475l159l4482j0308q19j4688L741J0777J7663m921
$$ 1466 15207 16897 -3916 -7391 -10550 -45032 -55340 -56159 -70847 -67106 -56329 -38666 -43587
12309d3587Q936L665j3324J5724J5320K439J8200r25J490l406k5815j9582K793
$$ -43587 -34651 -30986 -44310 -28586 -13266 -10827 7373 6448 7938 4532 -21283 -40865 -38072
12296c8072J1605K6598q434k3277r203K490q268K760J9812K4661p452j9491M168
$$ -38072 -26467 131 -8303 -31580 -40783 -38293 -46561 -43801 -23989 672 -6780 -26271 -22103
12283b2103K0141r068j9353j7229N29L5846L3791j1068j7309O324j6962l2170
$$ -22103 -1962 -11030 -30383 -47612 -47083 -11237 22554 11486 -5823 501 -16461 -48631
12271d8631j2014Q023K6839J5516J512K6356J2525J9220r184j2266l2630O390
$$ -48631 -60645 -52622 -25783 -10267 -8755 17601 30126 49346 40162 27896 -4734 1656
12259A656K8675j7315j5521K147j0127K3413P922l357J476P629M303j0548k9480
$$ 1656 30331 13016 -2505 -358 -10485 12928 20850 17493 18969 26598 30901 20353 -9127
12246i127j3546l642J7065k088P329J4032J281j9766n268J1912J1419l05m0866
$$ -9127 -22673 -26315 -9250 -11338 -4009 10023 11304 -8462 -13730 -1818 9601 9296 -31570
12233c1570j0512J8394J0020J8150J6383L957p845l4048J5361L630P23L375K1301
$$ -31570 -42082 -23688 -13668 4482 20865 24822 16977 -17071 -1710 1920 2643 6018 27319
12220B7319j2203p029j4751k0810k005J1969O243o586R760M69k142k2586o774
$$ 27319 15116 8087 -6664 -27474 -29479 -17510 -11267 -17853 -8093 -7624 -9766 -32352 -39126
12207c9126J6731L988J2317M654Q167q249o403j3427l0782K0760K7952N94J3958
$$ -39126 -22395 -18407 -6090 -1436 6731 -1518 -7921 -21348 -52130 -31370 -3418 -2824 11134
12194A1134J9017k2497p576P52L8729L5746J657j0460j1779j5336j5202j3406
$$ 11134 30151 7654 78 830 39559 75305 76962 66502 54723 39387 24185 10779
12182A0779j6890m4112J8851J4763p78m643L3662P911l4042j1872O28l26J0112
$$ 10779 -6111 -50223 -31372 -16609 -17387 -22030 11632 19543 -14499 -26371 -25743 -26069 -15957
12169a5957L0735J498j3196j4087l475j3640q213j1636Q450J5243J0947q496L325
$$ -15957 14778 16276 3080 -11007 -14482 -28122 -36335 -47971 -39521 -24278 -13331 -21827 -18502
12156a8502Q822J5074Q114J483J842n833n844j2200l3266j4475J3095M4155j085
$$ -18502 -9680 5394 13508 14991 16833 11000 5156 -7044 -40310 -54785 -41690 2465 1380
12143A380J0730l338n595K7599j641o588j669J195J4108N943n836r142k0062K2993
$$ 1380 12110 8772 3177 30776 29135 22547 20878 22073 36181 42124 36288 27146 7084 30077
12129C0077L530l1978k314J2882k0020r771J4170K1096j5658j3501k2766j1364
$$ 30077 33607 1629 -685 12197 -7823 -17594 -3424 17672 2014 -11487 -34253 -45617
12117d5617O656K8538O158J1633r561r501l262R959J3278o057k554L51p71J3780
$$ -45617 -38961 -10423 -4265 7368 -2193 -11694 -14956 -4997 8281 2224 -330 21 -750 13030
12103A3030p494p839O045n084R464r357j9330N231J3071n850j5208j0771J7554
$$ 13030 5536 -2303 3742 -1342 8122 -1235 -20565 -15334 -2263 -8113 -23321 -34092 -16538
12090a6538M553K2819n836k0368N509k4676J676K0219j958j1987j9333O19L700
$$ -16538 -11985 10834 4998 -15370 -9861 -34537 -32861 -12642 -14600 -26587 -45920 -45301 -41601
12077d1601J5749J2250k465R046J1088j2172j2107j7582pL1049j58k3481O053
$$ -41601 -25852 -13602 -16067 -7021 4067 -8105 -20212 -37794 -37801 -6752 -6910 -30391 -24338
12064b4338k126q520N130n260p087k417k2988j688L2697J9503J687L675j6574
$$ -24338 -26464 -34984 -29854 -35114 -42201 -44618 -67606 -69294 -36597 -17094 -15407 -11732 -28306
12051b8306N185Q288p821r290q613o051J2684O88K019k5398j031K0743J8787P590
$$ -28306 -23121 -14833 -22654 -31944 -40557 -46608 -33924 -33236 -31217 -56615 -57646 -36903 -18116 -10526
12037a0526P617l5324k8745k767L6790L1226j6004n531m166Q335K8891N460K4937
$$ -10526 -2909 -38233 -66978 -69745 -32955 -1729 -17733 -23264 -27430 -19095 9796 15256 40193
12024D0193m771l6182l7839j7357J6272J8381J2901J1201N933r026j2665J6436
$$ 40193 35422 -760 -38599 -55956 -39684 -21303 -8402 2799 8732 -294 -12959 3477
12012C477K6790r936r132q232k385j2950m020j1914K0530K1737R201j5068O607
$$ 3477 30267 20331 11199 2967 582 -12368 -16388 -28302 -7772 13965 23166 8098 14705
11999A4705L148j2999j1162M333J5249j2634m658J900n326J1130K050j0524o74
$$ 14705 17853 4854 -6308 -1975 13274 640 -4018 -2118 -7444 3686 5736 -4788 -5462
11986e462M765l628j8199J766L615J3118j4886J263K4363J3565J5343k5033l983
$$ -5462 -697 -4325 -22524 -20758 -17143 -4025 -18911 -17648 6715 20280 35623 10590 6607
11973F607Q610m528J1471K3733q82j9082q666k1433j5062J5888l459O456M288
$$ 6607 15217 10689 22160 45893 45011 25929 17263 -4170 -19232 -3344 -6803 -347 3941
11960C941k7684k658M1982O987K868O499k1669P019M756l7577k2079p848J5913
$$ 3941 -23743 -26401 15581 22568 25436 31935 10266 17285 22041 -15536 -37615 -45463 -29550
11947b9550p955Q107L342n743L36J8217K4657k0423k647r044j7339p213J2008
$$ -29550 -37505 -29398 -26056 -31799 -31463 -13246 11411 -9012 -11659 -20703 -38042 -45255 -33247
11934c3247J1057o0J4670j0090k9413j5798J8501O24J4930J7960L459M029R588
$$ -33247 -22190 -22250 -7580 -17670 -47083 -62881 -44380 -43756 -28826 -10866 -7407 -3378 6210
11921F210q443o168k3793j0344K0068K3968Q574l2753m223P491Q927N686j5663
$$ 6210 -2233 -8401 -32194 -42538 -22470 1498 10072 -22681 -26904 -19413 -10486 -4800 -20463
11908b0463j5416M038n817j1799j2400M094K1966L6088r925J619J2654n70j1102
$$ -20463 -35879 -31841 -37658 -49457 -61857 -57763 -35797 291 -9634 -8015 4639 4069 -7033
11895g033n509j5016m65R368l636K0435L128m92O455J3996j1122j8041j8733n077
$$ -7033 -12542 -27558 -28023 -18655 -22291 -1856 1272 780 7235 21231 10109 -7932 -26665 -31742
11881c1742J1504m960q934K8335J0191p867l296j0846M104k189J3523J483j6602
$$ -31742 -20238 -25198 -34132 -5797 4394 -3473 -6769 -17615 -13511 -15700 -2177 -694 -17296
11868a7296n230J1033n813L903j0661j1194n841M082J79j0118j7975P090K5458
$$ -17296 -22526 -11493 -17306 -13403 -24064 -35258 -41099 -37017 -36838 -46956 -64931 -57841 -32383
11855c2383L077L3096J1875j1414p111K997K002J693J6175j2111r561J7450J2039
$$ -32383 -29306 3790 15665 4251 -2860 137 2139 3832 20007 7896 -1665 15785 27824
11842B7824q257k0124l785q661j777m658n347J9197P238p0R355k3219l404Q795
$$ 27824 19567 -557 -4342 -13003 -14780 -19438 -24785 -5588 1650 1580 10935 -12284 -15688 -6893
11828f893j0321l602J3331M917j5982K1417O937p730k294J1459M219J2145p154
$$ -6893 -17214 -20816 -7485 -2568 -18550 2867 9804 2074 -220 11239 15458 27603 20449
11815B0449Q02J964q328k2897l301J3166J245p980K969J2528J5767j1901j4689
$$ 20449 21251 23215 14887 -8010 -11311 1855 3100 -4880 -1911 10617 26384 14483 -206
11802b06j8603J7655L4212J4231J1809k1353j5510M428j9790j6094k2768j3783
$$ -206 -18809 -1154 33058 47289 59098 37745 22235 26663 6873 -9221 -31989 -45772
11790d5772J52o849N982Q232m309N18J3229L3394J2140O439m143l4181j3754O899
$$ -45772 -45620 -52469 -46487 -38255 -42564 -42046 -28817 4577 16717 23156 19013 -15168 -28922 -22023
11776b2023R337J4652j1691l692m437l927R679J1168O46J3090q727j6353O436
$$ -22023 -12686 1966 -9725 -13417 -17854 -21781 -12102 -934 -288 12802 4075 -12278 -5842
11763e842M520l2264r609L5945K010n835J378k856Q342K7634J6433r148j4121
$$ -5842 -1322 -33586 -43195 -7250 -5240 -11075 -9697 -12553 -4211 23423 39856 30708 16587
11750A6587m0408j6073J7791O340j3825j0578J3206M559J6189M087K203K6168
$$ 16587 -23821 -39894 -22103 -15763 -29588 -40166 -26960 -22401 -6212 -2125 78 26246
11738B6246J5664j0804r066r77j5197J6925R751j6301j5178m976O764j6183j0651
$$ 26246 41910 31106 22040 21063 5866 22791 32542 16241 1063 -3913 2851 -13332 -23983
11725b3983j1433m432J8830L1755K058j6659k2701o722M669K308J7691N426m5810
$$ -23983 -35416 -39848 -21018 10737 12795 -3864 -26565 -33287 -28618 -26310 -8619 -3193 -49003
11712d9003K225N255J1066M5362K5120k1217l856N993j89k4751P130q357n27J0918
$$ -49003 -46778 -41523 -30457 14905 40025 18808 14952 20945 20756 -3995 3135 -5222 -5749 5169
11698E169L197m53M788j1942k0267j2527J2353p485m341j623K0938J2389j258
$$ 5169 8366 7913 12701 759 -19508 -32035 -19682 -27167 -31508 -33131 -12193 196 -1062
11685a062N997j2209R893J0416K0385m651p162n507r496l0383p865o264P796J8016
$$ -1062 4935 -7274 2619 13035 33420 28769 21607 16100 6604 -23779 -31644 -37908 -30112 -12096
11671a2096K1265J9394j8778j1855L771J5089j3535k6319J4734J1514P492l4003
$$ -12096 9169 28563 9785 -2070 1701 16790 3255 -23064 -8330 3184 10676 -23327
11659b3327J28K0070P578l200l3632j2193K7098N351J6398m381k4706j5978J6140
$$ -23327 -23199 -3129 4449 1249 -32383 -44576 -17478 -12127 4271 -110 -24816 -40794 -24654
11646b4654K5471q693j6021J080j372J0900n062j3499R996K5822M019l650j3067
$$ -24654 817 -7876 -23897 -22817 -24189 -13289 -18351 -31850 -21854 3968 7987 4337 -8730
11633h730j631o360j2536Q449L2614K3616l2801o173M455j9434O05k3225n2P352
$$ -8730 -10361 -16721 -29257 -20808 11806 35422 2621 -3552 903 -18531 -17926 -41151 -41203 -33851
11619c3851J745J2153K6686J6044j7632n251o126k837j5000j6167O948k692J3151
$$ -33851 -32106 -19953 6733 22777 5145 -106 -6232 -9069 -24069 -40236 -33288 -35980 -22829
11606b2829J5121P604q004Q332N073k0307J8962J1267j9854l979r937j1907R127
$$ -22829 -7708 -104 -8108 224 5297 -15010 3952 15219 -4635 -8614 -18551 -30458 -21331
11593b1331p515R313J7207k3647j7477L6424J0531j2975j3641k77J644m022J34
$$ -21331 -28846 -19533 -2326 -25973 -43450 -7026 3505 -9470 -23111 -23388 -21744 -25766 -25632
11580b5632k0053k0198j7022J3552J4745K1697K844J8454J7178J2877K57k6940
$$ -25632 -45685 -65883 -82905 -69353 -54608 -32911 -30067 -11613 5565 18442 18699 -8241
11568h241j4611O578J4520Q950p857k4046J1894K1981Q83J1478j778l0316K829
$$ -8241 -22852 -16274 -1754 7196 -661 -24707 -12813 9168 10051 21529 19751 -10565 -7736
11555g736N545k8976q566j530K0612N823j4570n696K2812K7378j9695l8284j6662
$$ -7736 -2191 -31167 -39733 -41263 -20651 -14828 -29398 -35094 -12282 15096 -4599 -42883 -59545
11542e9545L1259L4480M839k6927k1978N383q523k0321n780M3736N3963m205j4306
$$ -59545 -28286 6194 11033 -15894 -37872 -32489 -41012 -61333 -67113 -23377 30586 26381 12075
11529A2075l568P460j9099j4201J5326L671R135K4089J2576k5691k3352L675j0261
$$ 12075 8507 15967 -3132 -17333 -2007 1664 10799 34888 47464 21773 -1579 2096 -8165
11516h165r140J0154j2168L20R989J10q881J4667J6400q741k7408m595J2504J0772
$$ -8165 -17305 -7151 -19319 -18999 -9010 -8900 -17781 -3114 13286 4545 -22863 -27458 -14954 -4182
11502d182j8877l3211J703J6559P670j0548j1997J8979K6484M629J2615j3011
$$ -4182 -23059 -56270 -54567 -38008 -30338 -40886 -52883 -33904 -7420 -2791 9824 -3187
11490c187j1900J0496k847Q573k906Q565J6651k5765j3447q120k6164R012K8087
$$ -3187 -15087 -4591 -7438 1135 -1771 6794 23445 -2320 -15767 -23887 -50051 -41039 -12952
11477a2952J3283K276N696j5896J0526k173L96M703k5166j4455L6486n169j6350
$$ -12952 331 2607 8303 -7593 2933 760 1156 5859 -19307 -33762 2724 -2445 -18795
11464a8795l391m198J679j7408J7820J0261K6963J6108n943q664p897O097m648
$$ -18795 -22186 -26384 -24705 -42113 -24293 -14032 12931 29039 23096 14432 6535 12632 7984
11451G984k6740J8095K4619P997l3812k9040J3845K5693Q064q013J3594L58j1162
$$ 7984 -18756 -661 23958 31955 -1857 -30897 -17052 8641 16705 8692 22286 22644 11482
11438A1482k5672L554J6053l658N905Q719J0563k0469k5731q269L390o286L0937
$$ 11482 -14190 -10636 5417 1759 7664 16383 26946 6477 -19254 -27523 -24133 -30419 518
11425E18J9396P775j454l1963k7668m903J3161J8531R615j2341p100J1793K9210
$$ 518 19914 27689 26235 -5728 -33396 -38299 -25138 -6607 3008 -9333 -16433 -4640 24570
11412B4570P796m0097J7969J9686j6335m588K320J7846J3571j0187M968Q01j4300
$$ 24570 32366 -7731 10238 29924 13589 9001 11321 29167 42738 32551 37519 38320 24020
11399B4020l9388j7240J7834K1323K785K4557J0012N234j2937j4420M799J3771
$$ 24020 -15368 -32608 -14774 6549 9334 33891 43903 49137 36200 21780 26579 40350
11387D0350j6380k1844p702Q817j0934k6818j7410M0156J0042J13l762L80j0158
$$ 40350 23970 2126 -5576 3241 -7693 -34511 -51921 -11765 -1723 -1610 -5372 -4992 -15150
11374a5150k1556q635K8500J6410j6350j7037J5590Q409j2509k987L0671J0126
$$ -15150 -36706 -45341 -16841 -431 -16781 -33818 -18228 -9819 -22328 -25315 5356 15482
11362A5482j1803k810k183l0091j6754l504r267K6549J8555P782Q917p371k2586
$$ 15482 3679 869 -1314 -31405 -48159 -51663 -60930 -34381 -15826 -8044 873 -6498 -29084
11349b9084j3054j3743J2482L8507J4911o434j2650J2280J3132m358L38J0812
$$ -29084 -42138 -55881 -43399 -4892 10019 3585 -9065 3215 16347 11989 12327 23139
11337B3139j1149Q783j379j1403j6060m445R495J6629J981k3032j0269O145J5007
$$ 23139 11990 20773 19394 7991 -8069 -12514 -3019 13610 15591 -7441 -17710 -11565 3442
11324C442J8908j6353l4665J1010J1559O439j4691r607L3480O926j3281r565J6628
$$ 3442 22350 5997 -28668 -17658 -6099 340 -14351 -23958 9522 16448 3167 -6398 10230
11311A0230L700K1239Q157j7107j5792j4220o460N368j632J0313K2725O837j3343
$$ 10230 13930 35169 43326 26219 10427 -3793 -10253 -4885 -6517 3796 26521 33358 20015
11298B0015k0242m886J0919k1973Q600L2267j0887r971J396n013k689R551j3191
$$ 20015 -227 -5113 5806 -16167 -7567 24700 13813 3842 5238 225 -2464 7087 -6104
11285f104j1213K1707J5346m1j3201L819j4511q796p4O320J0281n379J5290j6811
$$ -6104 -17317 4390 19736 19695 6494 10313 -4198 -12994 -13068 -6748 3533 -1846 13444 -3367
11271c367k2779K8927J5228o315j1656m667J9136N599j4055l1574K0588J8942
$$ -3367 -26146 2781 18009 11694 38 -4629 14507 20106 6051 -25523 -4935 14007
11259A4007Q231j0213j5534p242r770J5944J5596J4121j949J2185r335m211j4278
$$ 14007 22238 12025 -3509 -10751 -20521 -4577 11019 25140 23191 35376 26041 21830 7552
11246G552m715N008m472M7972J6866k5240R086k539l8390k1001j4010J5625K1066
$$ 7552 2837 7845 3373 51345 68211 42971 52057 49518 11128 -9873 -23883 -8258 12808
11233A2808j0955j2333Q567Q603J2226k4558O250K9j1714J1268Q556Q623K812
$$ 12808 1853 -10480 -1913 6690 18916 -5642 608 637 -11077 191 8747 17370 20182
11220B0182Q950K200j7643O936K4053j948l0871k943J8217Q439j2519K616J0533
$$ 20182 29132 31332 13689 20625 44678 42730 11859 8916 27133 35572 23053 25669 36202
11207C6202J9809r166q52j419j3617j1962k0327K3364K6214k067q204j3168n956
$$ 36202 56011 46845 45993 44574 30957 18995 -1332 22032 48246 46179 37975 24807 18851
11194A8851k505J8540L4534l844k9534j5060j9052M346m90p842J2841K2562J9774
$$ 18851 16346 34886 69420 65576 36042 20982 1930 6276 5786 -2056 10785 33347 53121
11181E3121K6022p16k8831k4477j0143Q787K3181O220J4981j3034j2542p7p173
$$ 53121 79143 78427 49596 25119 14976 23763 46944 53164 68145 55111 42569 42492 35319
11168C5319j7883j25J7446J805j8674j5477J9572R89K773L897q914K3012O954
$$ 35319 17436 17311 34757 36562 17888 2411 21983 22972 25745 29642 20728 43740 50694
11155E0694r840L943J487j2881l28J602j0911J1456L1696k1402j4721o245L893
$$ 50694 40854 44797 46284 33403 33075 34677 23766 35222 66918 45516 30795 24550 28443
11142B8443j638l21Q861J7601R527j1130k7922j3830R99L5341j1544k1259K660
$$ 28443 26805 26484 35345 52946 62473 51343 23421 9591 10590 45931 34387 13128 15788
11129A5788n759L348j7452o199L1631m458l9752o992K8056K3346K0341J4175m759
$$ 15788 10029 13377 -4075 -10274 21357 16899 -22853 -29845 -1789 21557 41898 56073 51314
11116E1314l9640l0783q320J3031K822L0080K1043K760j9753K758j340K361q870
$$ 51314 11674 -19109 -27429 -14398 -11576 18504 39547 42307 22554 25312 23972 26333 17463
11103A7463j519n136P198N407k8504J3898J5475q380n874J116j09K292J3223N786
$$ 17463 15944 10808 18006 23413 -5091 8807 24282 15902 10028 11144 11035 13327 26550 32336
11089C2336M861O018j6553p257J4892Q50Q073R128j0173J0072Q670k9674j7710
$$ 32336 37197 43215 26662 19405 34297 35147 43220 52348 42175 52247 60917 31243 13533
11076A3533K8235J865l572j751m588J3687N133J1909P123P974j0591j821R411
$$ 13533 41768 43633 40061 38310 33722 47409 52542 64451 71574 79548 68957 67136 76547
11063G6547J3442n287k5339k9299j9214K807P722Q216Q618o775k029M287o652
$$ 76547 89989 84702 59363 30064 10850 13657 21379 29595 38213 31438 29409 33696 27044
11050B7044n583j6235J1896K0227j609o641m53j0000K212m702q127N61J4938n839
$$ 27044 21461 5226 17122 37349 35740 29099 28646 18646 20858 16156 8029 8590 23528 17689
11036A7689K1162J04k4746r224r379r247N920j3303r793J1709J9347K106J2963
$$ 17689 38851 38955 14209 4985 -4394 -13641 -7721 -21024 -30817 -19108 239 2345 15308
11023A5308R859j0391o063k3808R335J3978L423M235J0271j2983j0048m386j491
$$ 15308 25167 14776 8713 -15095 -5760 8218 11641 15876 26147 13164 3116 -1270 -2761
11010b761J9697J8406j0082l163K055J743j2316J0278Q934j0496p339q494j1901
$$ -2761 16936 35342 25260 22097 24152 25895 13579 23857 32791 22295 14956 6462 -5439
10997e439r587K5714J0162k8890j2023o573K4489L1688m8k020r428j4880K028
$$ -5439 -15026 10688 20850 -8040 -20063 -26636 -2147 29541 29493 27473 18045 3165 5193
10984E193J9988L465J7495J4260J51k192R625M849r694J3783n107j5685j5076
$$ 5193 25181 28646 46141 60401 60552 58360 67985 72834 63140 76923 71816 56131 41055
10971D1055K2162L367k141R804o223j0520n0968m298Q648j562K174k0769J629
$$ 41055 63217 66584 64443 74247 68024 57504 6536 2238 10886 9324 11498 -9271 -7642
10958g642L7910K8400j0058j5555j1323K743N245K4899O408k2687o327J0526J3648
$$ -7642 30268 58668 48610 33055 21732 24475 29720 54619 61027 38340 32013 42539 56187
10945E6187Q804p815j2035J0774m004l1926O267K0100J6598J8751J3350j9348
$$ 56187 64991 57176 45141 55915 51911 19985 26252 46352 62950 81701 95051 75703
10933G5703j1886J0496j206j6363k883k3082M802L4889K5778J1985k793J1183
$$ 75703 63817 74313 73107 56744 53861 30779 35581 70470 96248 108233 105440 116623
10921A16623n985j7118m411l861j2857l0647k9544k4641q104n043R866j1257m021
$$ 116623 110638 93520 89109 85248 72391 41744 12200 -12441 -20545 -25588 -15722 -26979 -31000
10908c1000r883N303L3936k18Q617J8393L1516k79o456J5011K9231J0595L5220
$$ -31000 -40883 -35580 -1644 -1862 6755 25148 56664 56385 49929 64940 94171 104766 139986
10895A39986L4700K8879q818r487R163L8570O1283O0957J34369J94316K35466
$$ 139986 174686 203565 194747 185260 194423 232993 294276 355233 489602 683918 919384
10884I19384K82347K88249K60590K32155J76058P4535j8121r9364j39132j95994
$$ 919384 1201731 1489980 1750570 1982725 2158783 2233318 2215197 2115833 1976701 1780707
10874A780707k42420k29389k18231j91350j56877j26644j06889o2567n6561k1306
$$ 1780707 1538287 1308898 1090667 899317 742440 615796 508907 446340 389779 368473
10864C68473k958o835k1276r481j1220j6338j3205m683j0174j7559m1464n218
$$ 368473 365515 358680 337404 327923 316703 300365 287160 282477 272303 254744 213280 208062
10852B08062l4021j247N816J9402K533o972j8863j3138j3885q967J553K9997j9317
$$ 208062 174041 172794 178610 198012 200545 193573 174710 161572 147687 138720 140273 170270 150953
10839A50953p277n422j3670k53K1348l0766k0345R195M132k162N280j2275j5397
$$ 150953 143676 138254 124584 124331 145679 114913 94568 103763 107895 105733 111013 98738 83341
10826H3341j5231J6857J1944j5907J050J9889J693j3776n254K3129q946j0610
$$ 83341 68110 84967 96911 81004 82054 101943 103636 89860 84606 107735 98789 88179
10814H8179K8749j0759l2308l536K178R739N900P672o716K2403K1923j3188K922
$$ 88179 116928 106169 73861 70325 72503 82242 88142 95814 89098 111501 133424 120236 123158
10801A23158j9257K174p282l2613K4709J1047j5174j6986k8449j0938L4610L2623
$$ 123158 103901 106075 98793 66180 90889 101936 86762 69776 41327 30389 64999 97622
10789I7622L5115L7015J6866K43r470k4324m092j0061l5931j7723P351j5636j1850
$$ 97622 132737 169752 186618 186861 177391 153067 148975 138914 102983 85260 92611 76975 65125
10776F5125j9915j3325l246J3262j1155J386J785n639p517N036l392M08R218m908
$$ 65125 45210 31885 28639 41901 30746 32132 33917 28278 20761 25797 22405 22813 32031 27123
10762B7123j3269M62j2519j0073M935Q89k878j765K031L012r543J1137L1360K9621
$$ 27123 13854 14316 1797 -8276 -3341 -2452 -5330 -7095 -5064 -2052 -11595 -458 30902 60523
10748F0523n442M710K2656j1003l0482j7020k86J3593J1870q87O710J8080J7190
$$ 60523 55081 59791 82447 71444 40962 23942 23656 37249 49119 48232 54942 73022 90212
10735I0212J9008L1968N814K1953M9227M0154K3579J1187P239P027K1157K1874
$$ 90212 109220 141188 147002 168955 218182 258336 281915 293102 300341 307368 328525 350399
10723C50399J7896l1181n4540l3832o791J45K088J2257K31m160j0746m124K3171
$$ 350399 368295 337114 282574 248742 241951 242096 244184 256441 256672 252512 241766 237642 260813
10710B60813o674l8555k5695m075M862J4676k1839j6023j2203j9239q50j1455
$$ 260813 254139 215584 189889 185814 190676 205352 183513 167490 155287 136048 135198 123743
10698A23743j9216q773L965K2481L1328J3485K3194J6756M500j521k6860k6953
$$ 123743 104527 95754 99719 122200 153528 167013 190207 206963 211463 209942 183082 156129
10686A56129m6910l2715J4067K7234l8045l5190k2984Q132J2593l684j062K0198
$$ 156129 109219 76504 90571 117805 79760 44570 21586 29718 42311 38627 37565 57763
10674E7763L9316J0095p461O409P389J1338J6428k304N518j8397k0038k6982J7248
$$ 57763 97079 107174 99713 106122 113511 124849 141277 138973 144491 126094 106056 79074 96322
10661I6322K7245j273j3843M458N5913K5343p840N661r541l5779J1966k261l0737
$$ 96322 123567 122294 108451 112909 168822 194165 186325 191986 182445 146666 158632 156371 125634
10648A25634R591Q027m506Q856J7410j3758j2757O740r948k2153k6936j1210J166
$$ 125634 135225 143252 138746 147602 165012 151254 138497 145237 135289 113136 86200 74990 76156
10635G6156L9197J7721L405P343L3931J5277k711j584j5855Q072M0618J5982j2984
$$ 76156 115353 133074 136479 143822 177753 193030 190319 188735 172880 180952 221570 237552 224568
10622B24568k4332k4769l96K7892K3866N313J786J3922J1554L9212K2930L781
$$ 224568 200236 175467 175071 202963 226829 232142 233928 247850 259404 298616 321546 325327
10610C25327K3528L4938N0306M1830J5406K2052K7653J5262r91p023q831k2237
$$ 325327 348855 383793 434099 475929 491335 513387 541040 556302 555311 548288 539457 517220
10598E17220n2576m7061l2593j4848K079J6222L105J5296P176K5864K8679L0558
$$ 517220 464644 417583 384990 370142 372221 388443 391548 406844 414020 439884 468563 499121
10586D99121K3542K6729K2829j6944l6733L601N194O593J8626M1861j0595N235
$$ 499121 522663 549392 572221 555277 518544 522145 527339 533932 552558 594419 583824 589059
10574E89059L2558J4931k567l559j6413K558J5701K7634R071n526k298o542l094
$$ 589059 621617 636548 633981 630422 614009 616567 632268 659902 668973 663447 661149 654607 651513
10561F51513K732J0709J2888J3912J9924K5583j194K256J658K508Q306J9021P869
$$ 651513 654245 664954 677842 691754 711678 737261 736067 738323 739981 742489 750795 769816 777685
10548G77685k650J018J9231k169N531L9222K2223N6913M5764K8033L4790L2226
$$ 777685 775035 776053 795284 793115 798646 837868 860091 917004 962768 990801 1025591 1057817
10536A057817K1035L3566L1605J4325N2368L0520M8498M2128L4301M6157L8757
$$ 1057817 1078852 1112418 1144023 1158348 1210716 1241236 1289734 1331862 1366163 1412320 1451077
10525A451077N8987Q6497O7046R6687Q6922N1219O4454P3522R6783Q8549J10354
$$ 1451077 1510064 1596561 1663607 1760294 1847216 1898435 1962889 2036411 2133194 2221743 2332097
10514B332097J60259J44545J64622J76372J88187J91083K33768K87076L10344
$$ 2332097 2492356 2636901 2801523 2977895 3166082 3357165 3590933 3878009 4188353
10505D188353L29343L86738M83925N60843O91585Q75120J098764J312123J425044
$$ 4188353 4517696 4904434 5388359 5949202 6640787 7515907 8614671 9926794 11351838
10496A1351838J625744J789046J779641J782893J857889J907336K018626K447575
$$ 11351838 12977582 14766628 16546269 18329162 20187051 22094387 24113013 26560588
10488B6560588L293490M666727P010241J1235684J8266015K7376303L4663139
$$ 26560588 29854078 34520805 41531046 52766730 71032745 98409048 133072187
10481A33072187M1454078N0331104N2202159M5041637L9082364L3083808J7620541
$$ 133072187 174526265 224857369 277059528 322101165 361183529 394267337 411887878
10474D11887878j663521j6932371k6381934l7868340m6386320m5247173m0079174
$$ 411887878 410224357 393291986 366910052 329041712 282655392 237408219 197329045
10467A97329045l8549894l2490611k1984379j4146147r534463o889796n300115
$$ 197329045 158779151 126288540 104304161 90158014 80623551 73733755 68433640
10460F8433640m181964l511624l118973k856762k676535k576267k550391k475370
$$ 68433640 64251676 60740052 57621079 54764317 52087782 49511515 46961124 44485754
10452D4485754k347206k238548k160998j965448j769289j653563j539275j358804
$$ 44485754 42138548 39900000 37739002 35773554 34004265 32350702 30811427 29452623
10444B9452623j188345j083094r69827q78067p99181p72418p38840p14085o82123
$$ 29452623 28264278 27181184 26211357 25333290 24534109 23761691 23022851 22308766 21626643
10435B1626643o61920o40168o50959o41230n87520n46666n24870n05544n07273
$$ 21626643 20964723 20324555 19673596 19032366 18444846 17898180 17373310 16867766 16360493
10426A6360493n07932m87642m57017m62268m21868l99916l96342l76934l57462
$$ 16360493 15852561 15364919 14907902 14445634 14023766 13623850 13227508 12850574 12493112
10417A2493112l45951l74410l61928l30600l20939l17366k82153k42668k48148
$$ 12493112 12147161 11772751 11410823 11080223 10759284 10441918 10159765 9917097 9668949
10408I668949k55126k37695k59804k50268k21003j98970j59876j98579k16805
$$ 9668949 9413823 9176128 8916324 8666056 8445053 8246083 8086207 7887628 7670823
10399G670823k00404k03631k18521j90210k06798k05288j69111j82180j65713
$$ 7670823 7470419 7266788 7048267 6858057 6651259 6445971 6276860 6094680 5928967
10390E928967j81049j80995j54349j56415j42651j52208j62850j42872j10479
$$ 5928967 5747918 5566923 5412574 5256159 5113508 4961300 4798450 4655578 4545099
10381D545099j13785j12958j04505j09500j10784j00388r1388r4085j12813r8821
$$ 4545099 4431314 4318356 4213851 4104351 3993567 3893179 3801791 3707706 3594893 3496072
10371C496072r1158n5988m9027n0723o7694n3114m7311n2331l2842l0739j6569
$$ 3496072 3404914 3348926 3299899 3249176 3181482 3128368 3081057 3028726 2995884 2965145 2948576
10360B948576j2275j6267k7615k7933m0647k9924k4481m8817j02616j15477j28997
$$ 2948576 2936301 2920034 2892419 2864486 2823839 2793915 2769434 2720617 2618001 2502524 2373527
10349B373527j20181j41229j75990j73596j34536j06224q5541q3136q2343q4494
$$ 2373527 2253346 2112117 1936127 1762531 1627995 1521771 1436230 1353094 1270751 1186257
10339A186257m6601l8687m8750p4104o8606o2883k8005o623n243k6784k4425o5748
$$ 1186257 1139656 1100969 1052219 978115 909509 846626 818621 811998 806755 779971 755546 689798
10327F89798l8073P72k5771l0364r679k3884j4851r366k1131M519M0628J5951
$$ 689798 651725 652497 626726 596362 586683 562799 547948 538582 517451 521970 562598 578549
10315E78549q578n722k600K476K3596k000k5230j2063K1196L4485j8751l5055
$$ 578549 569971 564249 561649 564125 587721 585721 560491 548428 569624 604109 585358 550303
10303E50303j0575p06j1451k7150k0660n442K1653n044J713m201J2985K9786m180
$$ 550303 539728 539022 527571 500421 479761 474319 495972 490928 492641 488440 501425 531211 527031
10290E27031p313j076k8323j5014O73l2361j9397L445J1381k9213j946N3731L654
$$ 527031 519718 518642 490319 475305 475978 443617 424220 427665 439046 409833 407887 461618 465272
10277D65272k1619K5937M0841J6910l3525q483M89P823K033o52N904r556J8075
$$ 465272 443653 469590 510431 527341 493816 485333 485822 493645 495678 495026 500930 491374 509449
10264E09449J1194j4251k5826j7282N666q027j7957k3657O263j81j4060n076O406
$$ 509449 520643 506392 480566 463284 468950 460923 442966 419309 425572 425391 411331 406255 412661
10251D12661L241L482k5913k1888J4862Q518k7161n7279k7988J7082m075nQ193
$$ 412661 415902 419384 393471 371583 386445 394963 367802 310523 282535 299617 295542 295537 303730
10238C03730O064J362Q539L422k6327O381o660N759J3006k1730L012K407J9942
$$ 303730 309794 311156 319695 323117 296790 303171 296511 302270 315276 293546 296558 298965 318907
10225C18907J1305j7342j862M547K2411J9739j7159J470J6017k515J6883j6688
$$ 318907 330212 312870 311008 315555 337966 357705 340546 342016 358033 355518 372401 355713
10213C55713k6249n706O36n128m1326j4804k4089k8013j1359K603k4510K215J1186
$$ 355713 329464 323758 324394 319266 277940 263136 239047 211034 199675 202278 177768 179983 191169
10200A91169J006J163p618m645k231J9598K8754j1504r697m245o580L198k0728
$$ 191169 192175 193338 185720 181075 178844 198442 227196 215692 205995 201750 195170 198368 177640
10187A77640K336p052o040j3150r157O865j622j2384J8573J4617k3577q102K456
$$ 177640 179976 172924 166884 153734 144577 151442 149820 137436 156009 170626 147049 138947 141403
10174A41403K937j3829j5283r656j3340q070m6796j3248j6334k3479k3565M656
$$ 141403 144340 130511 115228 105572 92232 84162 37366 24118 7784 -15695 -39260 -34604
10162c4604K973K5794P170J3452K7287M809J9357O955P637l969Q299k8748N68
$$ -34604 -31631 -5837 1333 14785 42072 46881 66238 73193 80830 76861 85160 56412 56980
10149E6980O163k7953k854m647l302n114j3716J433Q05K4110N5031P335k0366
$$ 56980 63143 35190 32336 27689 24387 19273 5557 6990 7795 31905 86936 94271 73905
10136G3905n184j1587m330J7883j4157k352J1543J868R22J7128L562q974j1899
$$ 73905 68721 57134 52804 70687 56530 54178 65721 67589 68511 85639 89201 80227 68328
10123F8328j8431R921K8757K3326j1678l475j0636m636K9819m122j3866p112L941
$$ 68328 49897 59818 88575 111901 100223 96748 86112 81476 111295 107173 93307 86195 90136
10110I0136M450M124n520K0484K473n972q770K981N568P640l6832j3005J6386
$$ 90136 94586 98710 93190 113674 116147 110175 101405 104386 109954 117594 80762 67757 84143
10097H4143J3447k0123L673K2161K4113J9577K2276N112L637K0263n526l59j0587
$$ 84143 97590 77467 81140 103301 127414 146991 169267 174379 178016 198279 192753 192394 181807
10084A81807M293P524l9840j7141K4125K9309K3086J8980L6809P4442J12103J63814
$$ 181807 186100 193624 153784 136643 160768 190077 213163 232143 268952 343394 455497 619311
10072F19311K07744K58033K79207K61087K41411K21652J58961M9392m5104r7348
$$ 619311 827055 1085088 1364295 1625382 1866793 2088445 2247406 2296798 2251694 2154346
10062B154346j43851k04550k26522k33616k38813j98943j48600j11096r3153n4975
$$ 2154346 2010495 1805945 1579423 1345807 1106994 908051 759451 648355 555202 500227
10052E00227l6224k8037j5415k8595j2971n3092k6065P146K2945j186k2021k6154
$$ 500227 464003 435966 420551 391956 378985 325893 299828 306974 329919 328733 306712 280558
10040B80558k2157j1509M3784l0347k7128j0443j4113l7466k7952n413Q062J0790
$$ 280558 258401 246892 290676 260329 233201 222758 208645 171179 143227 137814 145876 156666
10028A56666K965j1169L515j6139R89q698j6435o173n339J1999K2869k0202k2422
$$ 156666 159631 148462 151977 135838 136827 128129 111694 105521 100182 112181 135050 114848 92426
10015I2426m2013j7571J3875m558J798J1469P883R408p056k8440j715R528J6159
$$ 92426 50413 32842 46717 42159 43957 55426 63309 72717 65661 37221 35506 45034 61193
10002F1193q128K2191r552j2246J5963K1755j6210K613L085j0372j1079m43J3129
$$ 61193 53065 75256 65704 53458 69421 91176 74966 77579 80664 70292 59213 58770 71899
9989G1899m306k74J3416J0962q05k2415l7848n373J1900l0928m813L359r838K4665
$$ 71899 67593 67319 80735 91697 90892 68477 30629 25256 37156 6228 1415 4774 -5064 19601
9975A9601L2389j2232j3745m296J8954J2012j9230j0180J4662j4770J2427J1505
$$ 19601 51990 39758 26013 21717 40671 52683 33453 23273 37935 23165 35592 47097
9963D7097q638j9622J2954K7173J6145j0798k4209j186j4814J456J8241L905k978
$$ 47097 38459 18837 31791 58964 75109 64311 40102 38916 24102 25558 43799 47704 44726
9950D4726l442o100l154Q524L299r013j7149m675r171m905R285k055k0383n750
$$ 44726 41284 35184 32030 40554 43853 34840 17691 13016 3845 -1060 8225 6170 -14213 -19963
9936a9963K1845K4323R215R232q75K595j7629K50O292l332O170L83j1912k1q705
$$ -19963 1882 26205 35420 44652 43777 46372 28743 28993 35285 31953 38123 38506 26594 26573 17868
9921A7868j1561J0028K441J9772n577J0253j4714q766O917J3892j2719O145m269
$$ 17868 6307 16335 18776 38548 32971 43224 28510 19744 26661 40553 27834 33979 29710
9908B9710L117k1238N991R412r701J1369L365L082q914N361J3535l511j7181k2735
$$ 29710 32827 11589 17580 26992 17291 28660 32025 35107 26193 31554 45089 41578 24397 1662
9894A662o764J0849J9359k9095K7506K8885K937J9846K931j2465j7630l0719M852
$$ 1662 -5102 5747 25106 -3989 23517 52402 55339 75185 78116 65651 48021 17302 22154
9881B2154J0672P981K8575J6059Q75l4174n3281l117K8030L1140R91k3519J6489
$$ 22154 32826 40807 69382 85441 86316 52142 -1139 -4256 23774 54914 55905 32386 48875
9868D8875J2539j6653n571k797j3470j0138K162j2489N622J0264P388N304k5403
$$ 48875 61414 44761 39190 36393 22923 12785 14947 2458 8080 18344 25732 31036 5633
9855E633p278J2749J2651J6814o329k935J3783l568j0900l1878j5266j1445K4177
$$ 5633 -1645 11104 23755 40569 34240 31305 45088 41520 30620 -1258 -16524 -27969 -3792
9842c792K0501R120J0071j6221j3712q874q98K1473K7242j278j1224j149l0652
$$ -3792 16709 25829 35900 19679 5967 -2907 -3805 17668 44910 43632 32408 31259 607
9829F07k2921J5947M2696K6829P425J8149j0064l7727l718k7045j5306K6697L5975
$$ 607 -22314 -6367 36329 63158 70583 88732 78668 40941 37223 10178 -5128 21569 57544
9816E7544j2947k6612j0846R998j4646K554M194Q164l3o322L0051o026K957k431
$$ 57544 44597 17985 7139 17137 2491 5045 9239 17403 17370 11048 41099 35073 38030 35599
9802C5599p409j0295q18M009L66j7824L8347L697l0611k1308j3396K1951K0324
$$ 35599 28190 17895 17077 21086 21452 3628 41975 45672 15061 -6247 -19643 2308 22632
9789B2632O29k733o643O378M533K465l091Q133j1192k807R85L372j637j8253j792
$$ 22632 23261 20528 13885 20263 24796 27261 24170 32303 21111 18304 19289 22661 21024 2771 979
9774I79L772R606j0433j8980j1526J1983J6686j2636o904R412N05k869J952r037
$$ 979 4751 14357 3924 -15056 -26582 -14599 2087 -10549 -17453 -8041 -7536 -10405 -8453 -17490
9760a7490K2j405m345K2809J7920K0030K602k535o21k8974l5852N962J147m554
$$ -17490 -17468 -18873 -23218 -409 17511 37541 40143 37608 36987 8013 -27839 -21877 -20730 -25284
9746b5284J5790k713J5278K5780O023k7617j4894p529q525K7227K582l4120L4180
$$ -25284 -9494 -12207 3071 28851 34874 7257 -7637 -15166 -23691 3536 6118 -28002 6178
9733F178J8912k8304k0999L6748L7284k5739j3520J3818l551K838J4321p253K6642
$$ 6178 25090 -3214 -24213 12535 49819 24080 10560 24378 20827 23665 37986 30733 57375
9720E7375N119n976o964j655k139j7550j5774O923j1111n184J3469Q980j113P582
$$ 57375 62494 56518 49554 47899 45760 28210 12436 19359 8248 3064 16533 25513 24400 31982
9706C1982M794j6751k2894L046J7401K4524N038j1675j1583O694r027k5291j4032
$$ 31982 36776 20025 -2869 177 17578 42102 47140 35465 23882 30576 21549 -3742 -17774
9693a7774J0527J0716r211L657J0093j04J896K706j5121j2579j63Q07L960J5290
$$ -17774 -7247 3469 -5742 -2085 8008 7904 9800 12506 -2615 -15194 -15357 -14550 -10590 4700
9679D700J861j1274q714P401J1300K3908r808Q451K607j4686k4125M786p675J4745
$$ 4700 6561 -4713 -13427 -6026 5274 29182 19374 27825 30432 15746 -8379 -3593 -11268 3477
9665C477L5665J2260j8842j8366j3828K5290J8018o516j3418N916J781p581J7943
$$ 3477 39142 51402 32560 14194 366 25656 43674 37158 23740 29656 31437 23856 41799
9652D1799m112l4974j9476J1824K8490j2953N44j4875m459J1360J7297J4256J0852
$$ 41799 37687 2713 -16763 -4939 23551 10598 11142 -3733 -8192 3168 20465 34721 45573
9639D5573J9606l163j7176n14P880o64Q235o494J2132j5949j9053O321P123j393
$$ 45573 65179 62016 44840 44326 52206 51542 59777 53283 65415 49466 30413 36734 43857 42464
9625D2464K769L26o827p443O471j5552r775j9908j1712L0979J5587J9194J1394
$$ 42464 45233 45559 38732 31289 37760 22208 12433 -7475 -19187 11792 27379 46573 57967
9612E7967l478m7308l200J5717P807J6263r106k3374k1021j1862Q871Q136L8384
$$ 57967 54489 7181 3981 19698 27505 43768 34662 11288 -9733 -21595 -12724 -4588 33796
9599C3796R749M92j6712M071J0844k27q391J4544k930k9090l202k39P379R931
$$ 33796 43545 44037 27325 31396 42240 42013 33622 48166 45236 16146 12944 12705 20084 30015
9585C0015k4576m543O712J1456J2246J9026J2560p785j6200j609R805K018k979
$$ 30015 5439 896 7608 19064 31310 50336 62896 55111 38911 37302 47107 49125 46146
9572D6146l699j3784J1691k49k543j4175k5907N506L4793J8117j8258k9729j3869
$$ 46146 42447 28663 40354 40105 37562 23387 -2520 2986 37779 55896 37638 7909 -5960
9559e960o729R286J7515m625p208j5035j3130o206K3573J5769k1711R469J1084
$$ -5960 -12689 -3403 14112 9487 2279 -12756 -25886 -32092 -8519 7250 -14461 -4992 6092
9546F092K1454R516j398m911k044o640j4725q051m305O788j448k823J689K1778
$$ 6092 27546 37062 35664 30753 28709 22069 7344 -707 -5012 1776 328 -2495 -806 20972
9532B0972K879j4925j8375m338k827j1835k45J9904J6874J1701r205j9451P084
$$ 20972 23851 8926 -9449 -13787 -16614 -28449 -28694 -8790 8084 19785 10580 -8871 -1787
9519a787p173K6336J0092r708M666J3118J3071N409j0509J7514K929l0709k1144
$$ -1787 -8960 17376 27468 17760 22426 35544 48615 54024 43515 61029 63958 33249 12105
9506A2105q28Q081j9172n676K646J9453n773r181j28j5088J2603K6908P695o325
$$ 12105 11277 19358 186 -5490 -2844 16609 10836 1655 1527 -13561 -958 25950 33645 27320
9492B7320n307o032r639N978N124l5729j3705R333k3306m513M9988n326p456m775
$$ 27320 22013 15981 6342 12320 17444 -18285 -31990 -22657 -45963 -50476 -488 -5814 -13270 -18045
9478a8045P771J1050R043j9663p763J4052r91o626p733K055J0456J1246J4883
$$ -18045 -10274 776 9819 -9844 -17607 -3555 -4546 -11172 -18905 -16850 -6394 4852 19735
9465A9735Q989j5985m13J2396k7337N083K3514R023J3519j9523j0983m661j7841
$$ 19735 28724 12739 12326 24722 -2615 2468 25982 35005 48524 29001 18018 13357 -4484
9452d484j1689J9430J2016m470R893q543j5710N247k769J4291M432j0651l175
$$ -4484 -16173 3257 15273 10803 20696 12153 -3557 1690 -1079 13212 17644 6993 3818
9439C818M069R933j460j1904K204j3973J8538J4928j813J0600J8770j710j3154
$$ 3818 7887 17820 16360 4456 6660 -7313 11225 26153 24340 34940 53710 52000 38846
9426C8846P310J126k9835k4742p75J3887j6887n327L991J8211J2236R104L562
$$ 38846 46156 47282 17447 -7295 -8070 5817 -11070 -16397 -12406 5805 18041 27145 30707
9413C0707j3573k2605p593l178o600m87K0146M272j2193O79j2564j5290j4784
$$ 30707 17134 -5471 -13064 -16242 -22842 -23329 -3183 1089 -11104 -10425 -22989 -38279 -53063
9400e3063J9404L2266K1021o741K0207j4304k776K1310l856q080P331K0818k1245
$$ -53063 -33659 -1393 19628 12887 33094 18790 16014 37324 33468 25388 32719 53537 32292
9387C2292j3163r032k618K1409K1777J853k2030k3801J0688K3218j7478k887J1070
$$ 32292 19129 10097 7479 28888 50665 52518 30488 6687 17375 40593 23115 20228 31298
9374C1298K0924J0456l7708j9215J7894J7176j0109l476K2702J9457r136L43j3763
$$ 31298 52222 62678 24970 5755 23649 40825 30716 27240 49942 69399 60263 60606 46843
9361D6843j8779m291j8136p718l972R543P979N53K4058K0379k7792l7772K472
$$ 46843 28064 23773 5637 -2081 -6053 3490 11469 12022 36080 56459 28667 -9105 -6633
9348f633K464j5587J0318K933r415j0776N022j852M80Q946J8806p489n256j1809
$$ -6633 -4169 -19756 -9438 -6505 -15920 -26696 -21674 -23526 -23046 -14100 4706 -2783 -8039 -19848
9334a9848K4859K7812m127j6306m669J5184k532L575p988m4276n01J8914L1997
$$ -19848 5011 32823 28696 12390 7721 22905 20373 23948 15960 -28316 -28817 -9903 22094
9321B2094J1620R47K4123k288k3755j2291j2414O004q433O344K594n83j166j797
$$ 22094 33714 34661 58784 56496 32741 20450 8036 14040 5607 11951 14545 13962 12796 10999
9307A0999K197l409J8709K4251n020m0861J795O949J8912J3034p462k6989J727
$$ 10999 13196 9787 28496 52747 47727 6866 8661 15610 34522 47556 40094 13105 14832
9294A4832j7745K4291R853J2572K356j2801l738q982K9816j2868m0665j8219M597
$$ 14832 -2913 21378 31231 43803 46159 33358 29620 20638 50454 37586 -3079 -21298 -16701
9281a6701K2986K4829k863k0411k0754J800J5099L705o732q028k571q071J2768
$$ -16701 6285 31114 28251 7840 -12914 -11114 3985 7690 958 -7070 -9641 -17712 -4944
9268d944j3035m805J5349n906N389j0297J4412K3285Q855j6964n846J1673L210
$$ -4944 -17979 -22784 -7435 -13341 -7952 -18249 -3837 19448 28303 11339 5493 17166 20376
9255B0376j9973q011j4493n133k730M592K1092J7067j6862K381q147K7369N051
$$ 20376 403 -7608 -22101 -27234 -29964 -25372 -4280 12787 -4075 -1694 -9841 17528 22579
9242B2579j4516Q456J9604K7694Q43q585q064K2349k776j9730j3221K410J3331
$$ 22579 8063 16519 36123 63817 64660 56075 48011 70360 67584 47854 34633 37043 50374
9229E0374j8807N675j2709k5429N929m340p221j8173j0526K4281O861J1782K498
$$ 50374 31567 37242 24533 -896 5033 693 -6528 -24701 -35227 -10946 -4085 7697 10195
9216A0195k4522l953J6675P367R785o657J6115P882m726J657j9741J1851K2856
$$ 10195 -14327 -18280 -1605 5762 15547 8890 25005 32887 28161 29818 10077 21928 44784
9203D4784j067k161N6l400J1377K907K2727O758o026k675j8677k0311K358O46
$$ 44784 43717 41556 41612 38212 49589 52496 75223 81981 75955 73280 54603 34292 36650 37296
9189C7296p995M841J608j4042J9556J1449J1715r491j4277J4249K4320J1067J0804
$$ 37296 29301 34142 35750 21708 41264 52713 64428 54937 40660 54909 79229 90296 101100
9176A01100K467q236l148M971K6900J2566N986J5917K3429O878j0086L2213K8623
$$ 101100 103567 95331 92183 97154 124054 136620 142606 158523 181952 188830 178744 210957 239580
9163B39580q308L1171L9016M3531L8918O0830N9364O8617Q0441Q7463J33432J55833
$$ 239580 231272 262443 301459 344990 383908 444738 504102 572719 653160 740623 874055 1029888
9151A029888K43873L57104M89184P01207J058992J436432J625352J436336R72257
$$ 1029888 1273761 1630865 2120049 2821256 3880248 5316680 6942032 8378368 9350625
9142I350625L12460n99277j461438j668816j336612r59574o67416m45508l38956
$$ 9350625 9663085 9063808 7602370 5933554 4596942 3637368 2969952 2524444 2185488
9133B185488k45069j87020j51982j73816j35499p9004p1443o6501p0031l4548
$$ 2185488 1940419 1753399 1601417 1427601 1292102 1213098 1141655 1075154 1005123 970575
9123I70575l8304m9984m5642k0188n1565n0357o1930m224o260l1868l3915l8258
$$ 970575 932271 882287 836645 816457 764892 714535 652605 648381 642121 610253 576338 538080
9111E38080j6213k4677N045q367q224j1591K464n770l3134j3677J1444R46m1825
$$ 538080 521867 497190 502235 493868 485644 474053 476517 470747 437613 423936 435380 436326 394501
9098C94501j2052J3615k1527j8258j9928k0413j0241P491k6255j4903P33j5258
$$ 394501 382449 396064 374537 356279 336351 315938 305697 313188 286933 272030 272763 257505
9086B57505j9595K132j3209J3732M715J3615k0298k4786k2266L526K0469J0617
$$ 257505 237910 240042 226833 240565 245280 258895 238597 213811 191545 195071 215540 226157
9074B26157j9931j1613L424j9465j1966K716l4652l225r604j6945J2785N052M302
$$ 226157 206226 194613 198037 178572 166606 169322 134670 131445 121841 104896 117681 122733 127035
9061A27035J5035L943j6828j2042L1294R649r737j5424k9125j1478j2770J9449
$$ 127035 142070 146013 129185 117143 148437 158086 148349 132925 103800 92322 79552 99001
9049I9001m108j6646J6451L360o920k0356n955J6576J9432k9104k3580J4928J263
$$ 99001 94893 78247 94698 98058 91138 70782 64827 81403 100835 71731 48151 63079 64342
9036F4342k111J1363Q640q91o928j5407r821P913j3505J1064L470K6757j253j0922
$$ 64342 62231 73594 82234 81343 74415 59008 49187 57100 43595 54659 58129 84886 83633 72711
9022G2711j3551J6597J2392q224j3212j6521O816J3678q511o342k165j623r76
$$ 72711 59160 75757 88149 79925 66713 50192 57008 70686 62175 55833 53668 52045 51069
9009E1069m644j0746N679N680j2026j5194o352N46l176J3323j202N785j0244j0625
$$ 51069 46425 35679 41358 47038 35012 19818 13466 14012 10836 24159 22957 28742 18498 7873
8995G873J0323O152J5370P427j7464k3912L944O256J0017O664k2250m88J6329
$$ 7873 18196 24348 39718 47145 29681 5769 9713 15969 25986 32650 10400 9912 26241
8982B6241m986J1826n372m186J2603r502r088M478K1221R880K6451k1569j0177
$$ 26241 21255 33081 27709 23523 36126 26624 17536 22014 43235 53115 79566 57997 47820
8969D7820O36k0173K225J0228j391K979p024k5173j1940k0049J2823J0597O205
$$ 47820 48456 28283 30508 40736 39345 42324 35300 10127 -1813 -21862 -9039 1558 7763
8956G763K55P155q294J7976j3619M617o732j553K1534J9829q366k696j3095q817
$$ 7763 8018 15173 6879 24855 11236 15853 9121 7568 29102 48931 40565 37869 24774 15957
8942A5957K5460l513m482r374k5541j1723K3428J4791j5275J4112R130J8549N645
$$ 15957 41417 37904 33422 24048 -1493 -13216 10212 25003 9728 23840 32970 51519 57164
8929E7164J3576j4016j5048j9293j4154j447J7460n919r137J4544J0200j5037
$$ 57164 70740 56724 41676 22383 8229 6782 24242 18323 9186 23730 33930 18893
8917A8893K1159O722m0685k3383J010p500J3798J4335M717r108m316j2067O307
$$ 18893 40052 46774 6089 -17294 -16284 -23784 -9986 4349 9066 -42 -4358 -16425 -10118
8904a0118j3369J6926j427l1581o389j1241J8056K0606l579R697J0645J3427R805
$$ -10118 -23487 -6561 -7988 -39569 -45958 -57199 -39143 -18537 -22116 -12419 -1774 11653 21458
8891B1458K921q693n453L436J6337m668j4995k3424M569N692L918Q178P884q911
$$ 21458 24379 15686 10233 13669 30006 25338 10343 -13081 -8512 -2820 1098 9276 17160 8249
8877H249o113N236K4530j0486m2414o376j559J8542J7454j4623R690J54R12k415
$$ 8249 2136 7372 31902 21416 -20998 -27374 -28933 -10391 7063 -7560 2130 2284 3196 781
8863G81o138P784K060N305K67j2597n632N435K4379K7723j1207l0030m9212l506
$$ 781 -5357 2427 4487 9792 10059 -2538 -8170 -2735 21644 49367 38160 8130 -41082 -44588
8849d4588j5285J0431K1940J9739j5875r059J5470L4J1035o491l323n394L1542
$$ -44588 -59873 -49442 -27502 -7763 -23638 -32697 -17227 -17193 -6158 -12649 -15972 -21366 10176
8836A0176J7696k6930L191J4657M225k890j4900K53j2019l53L2395j34k9454r994
$$ 10176 27872 942 4133 18790 23015 20125 5225 5478 -6541 -6894 25501 25367 -4087 -14081
8822a4081j0657J2654m558J325q775J2719J2708J7872J205P99j0599r403N434
$$ -14081 -24738 -12084 -16642 -15317 -24092 -11373 1335 19207 20412 21211 10612 1209 6643
8809F643L388o141j1793O254j4167M845P997j9386j2298j6861J146J6642J2248
$$ 6643 10031 3890 -7903 -1649 -15816 -10971 -2974 -22360 -34658 -51519 -50373 -33731 -21483
8796b1483K519k1304K2097J9331M450r325k4775L860K627M718N365J2596Q266
$$ -21483 -18964 -40268 -18171 1160 5610 -3715 -28490 -24630 -22003 -17285 -11920 676 8942
8783H942L1K0450K1190L478j3159j7677k729k1391r696m288K1207J565K6579L3982
$$ 8942 8973 29423 50613 54091 40932 23255 20526 -865 -10561 -14849 6358 7923 34502 68484
8769F8484R381j0914m1241k1301J0423O355R835o203j0606K6664J7848k6282l0091
$$ 68484 77865 66951 25710 4409 14832 21187 31022 24819 14213 40877 58725 32443 2352
8756B352Q715k3311J0609K8215j6610j9165l149j0102j6469K4466K4749J1386
$$ 2352 11067 -12244 -1635 26580 9970 -9195 -12344 -22446 -38915 -14449 10300 21686
8744B1686l0969l0304J2825L081M746M402J7187J1748K041k556m312M918R496
$$ 21686 -9283 -39587 -26762 -23681 -18935 -14533 2654 14402 16443 13887 9575 14493 23989
8731B3989K8309J2939j275j7184r545k0726l7811j5796j9134K8370M1310J8266
$$ 23989 52298 65237 63962 46778 37233 16507 -21304 -37100 -56234 -27864 13446 31712
8719C1712J4818j917m242j6199j2657J624K7453J4576j3269k0090k7734m0163
$$ 31712 46530 44613 40371 24172 11515 13139 40592 55168 41899 21809 -5925 -46088
8707d6088j8464K7713M2059K3634L3768j2966j8610j2633j248l71j3361k914Q527
$$ -46088 -64552 -36839 5220 28854 62622 49656 31046 18413 17165 16794 3433 519 9046
8694I046K5990N644j1835j5279J0186j4186j9924Q560J4950j2994j6759K2012
$$ 9046 35036 40680 28845 13566 23752 9566 -10358 -1798 13152 158 -16601 5411
8682E411J7701J5723M959L78q881p521j6109j0898J0513K5691o184K397J852k5093
$$ 5411 23112 38835 43794 44172 35291 27770 11661 763 11276 36967 30783 33180 35032 9939
8668I939j8314J8939J1941N69k1229o846j595N680J6221L8J7260j0174N60j8530
$$ 9939 -8375 10564 22505 23074 1845 -5001 -6596 -916 15305 15343 32603 22429 22989 4459
8654D459m428J8302Q74n293j5928j1045K6297J1343n290p935k696j7381J3193
$$ 4459 31 18333 19207 13914 -2014 -13059 13238 24581 19291 11356 8660 -8721 4472
8641D472K3511R512j4442K4447R611r567k20k4692j7439J4100n735m694J1403
$$ 4472 27983 37495 23053 47500 57111 47544 47324 22632 5193 19293 13558 8864 20267
8628B0267M68q159o341M550j3846J6600J9809N911k855j6558l108Q742J3747O772
$$ 20267 20735 12576 6235 10785 -3061 13539 33348 39259 36404 19846 16738 25480 39227 45999
8614D5999r350p044J8771m900j7041j3510K4400M843j03j1722L744j0792p921
$$ 45999 36649 29605 48376 43476 26435 12925 37325 42168 42065 30343 34087 23295 15374
8601A5374j3116m26J5707O298o429j528P412P776q091J2917L5078L765j5013J5591
$$ 15374 2258 1832 17539 23837 17408 15880 23292 31068 22977 35894 70972 74737 59724 75315
8587G5315K4852J6894L917j1242l5383m279J0014j2670j9161p981p796k625Q270
$$ 75315 100167 117061 120978 109736 74353 70074 80088 67418 48257 40276 32480 29855 38125
8574C8125K4609O333O658k5782m0837O815J0324o991j767J2128N77k5704j3545
$$ 38125 62734 69067 75725 49943 9106 15921 26245 19254 17487 29615 30192 4488 -9057
8561i057j2254J1767J0535N115K7955P372l1070o639J2691k6806k342K3117N832
$$ -9057 -21311 -9544 991 6106 34061 41433 10363 3724 16415 -10391 -12733 10384 16216
8548A6216J5063L512j6944Q989K874O279r215J410k338Q469J0818j1278j6281
$$ 16216 31279 34791 17847 26836 29710 35989 26774 28184 25846 34315 45133 33855 17574
8535A7574n922o574l372J2039P634L884k925o084M369N120M658j1045J2893k004
$$ 17574 11652 5078 1706 13745 21379 25263 22338 16254 20623 25743 30401 19356 32249 30245
8521C0245l9501m0387P698K1537M657K34l933j618M368l933J2743p824Q404J2865
$$ 30245 -9256 -49643 -41945 -20408 -15751 -15517 -19450 -21068 -16700 -20633 -7890 -15714 -7310 5555
8507E555J7445k339k8323k1794J8744J6011P000j6276j5093J0918J2228J6766
$$ 5555 23000 20661 -7662 -29456 -10712 5299 12299 -3977 -19070 -8152 4076 20842
8495B0842j5726j0167j8047K242m501N205Q471J3661J4689j4284k6747k5569J2758
$$ 20842 5116 -5051 -23098 -20856 -25357 -20152 -11681 1980 16669 2385 -24362 -49931 -37173
8482c7173M152j2129M9196K4610j7436j2692j0067l3457p62M320J1446K5397K3261
$$ -37173 -33021 -45150 4046 28656 11220 -1472 -11539 -44996 -45758 -41438 -29992 -4595 18666
8469A8666K560O478j3126l469o07k894k1737J0827q598p814l255K7179K067p257
$$ 18666 21226 27704 14578 11109 10502 7608 -14129 -3302 -11900 -19714 -22969 4210 6277 -980
8455i80J5819k9315j0213J4989k1490k377P476K5009k6953j4704n257l585K0653
$$ -980 14839 -14476 -24689 -9700 -31190 -33567 -26091 -1082 -28035 -42739 -47996 -51581 -30928
8442c0928K2061P233J9723O544j2687p095M895R309J4130P483k5657k1837Q851
$$ -30928 -8867 -1634 18089 24633 11946 4851 9746 19055 33185 40668 15011 -6826 2025
8429B025j1517n353K4693n271k0262m169O00L084Q417M951j0030j059L655K3272
$$ 2025 -9492 -14845 9848 4577 -15685 -19854 -19254 -16170 -7753 -2802 -12832 -13891 -10236 13036
8415A3036k3100n657R714k353j2397R869N062l725r805J4719k2083m635J5476
$$ 13036 -10064 -15721 -6007 -8360 -20757 -10888 -5826 -9551 -19356 -4637 -26720 -31355 -15879
8402a5879l292R32k3533J5940K0750Q729k010r626k6330Q502J4939O931q113j6937
$$ -15879 -19171 -18239 -41772 -25832 -5082 3647 1637 -7989 -34319 -25817 -10878 -3947 -12060 -28997
8388b8997n346J6476O659J2707J1375j7618k2722l155Q748k004K0830J3428J009
$$ -28997 -34343 -17867 -11208 1499 12874 -4744 -27466 -30621 -21873 -23877 -3047 10381 11390
8375A1390J9460m0431j6373J8396K0321o405p796J9889J6467r835n450k7163o048
$$ 11390 30850 -9581 -25954 -7558 12763 6358 -1438 18451 34918 25083 19633 -7530 -13578
8362a3578R204n94p779R928o000j8194O893P432N767J2948n352k1129L96J6308
$$ -13578 -4374 -4968 -12747 -2819 -8819 -27013 -20120 -12688 -6921 6027 675 -20454 -20058 -3750
8348c750j0476k7146j1614q298r2K9191J7219q769M879l986p289L097K9966P053
$$ -3750 -14226 -41372 -52986 -61284 -61376 -32185 -14966 -23735 -18856 -22842 -30131 -27034 2932 9985
8334I985O583o78k9685R701K76p890J2905o930o207j2207Q617J5631J553L468
$$ 9985 16568 15890 -13795 -4094 -3818 -11708 1197 -5733 -11940 -24147 -15530 101 1654 5122
8320E122l0875K4279M450l167n754l8801J0577L45J1951M3895n853k4859r50K294
$$ 5122 -25753 -1474 2976 -191 -5945 -44746 -34169 -33824 -21873 22022 16169 -8690 -9640 -7346
8306g346r509O376K5537k324n4929k6142j1623L81L2773K5587r409k1389j2399
$$ -7346 -16855 -10479 15058 12734 -42195 -68337 -79960 -79579 -46806 -21219 -30628 -52017 -64416
8293f4416K2311N0535J9762k9170l0487l956K1280L146O178n522K843R714j3911
$$ -64416 -42105 8430 28192 -978 -31465 -35421 -14141 -10995 -4817 -10339 -7496 2218 -11693
8280a1693J2774K2473J0069r918k7564j7309M092L3257J0101j7197k9413L319
$$ -11693 1081 23554 33623 23705 -3859 -21168 -17076 16181 26282 9085 -20328 -17009
8268a7009K812O642p665J3567J9320J2080n959O860k1664j7951L396R880l765
$$ -17009 -14197 -7555 -15220 -1653 17667 29747 23788 30648 8984 -8967 -5571 4309 544
8255E44k4683j2339K0235O313P401K051N279m123O564j179l378l275k0098O805
$$ 544 -24139 -36478 -16243 -9930 -2529 -478 4801 678 7242 6063 2685 -590 -20688 -13883
8241a3883K0472K3108k4397m3379J9737O818L715O519J3474p56k8785j2459J3014
$$ -13883 6589 29697 5300 -38079 -18342 -11524 -7809 -1290 12184 11428 -17357 -29816 -16802
8228a6802K9672K599L006q533j5727M906l601Q988k322P278N057N175R70j60l653
$$ -16802 12870 15469 18475 9942 -5785 -879 -4480 4508 2186 9464 14521 19696 20666 20506 16853
8213A6853N9o43L298J5413k528l2638j6094J5709J4536p028J0363J2100J3748
$$ 16853 16912 16269 19567 34980 32452 -186 -16280 -571 13965 6937 17300 29400 43148
8200D3148l5118J2368J0881n974L412M699P853K6318j0737j1403k3938j3443J0683
$$ 43148 8030 20398 31279 25305 28717 33416 41269 67587 56850 45447 21509 8066 18749
8187A8749O078J6195R135j8854j6914J3183q914j2878K1389j8419o064K301j0782
$$ 18749 24827 41022 50157 31303 14389 27572 18658 5780 27169 8750 2686 4987 -5795
8174e795j4527k0716J7968K788j0422K908m022K4454k77j711J490j3148P84k9209
$$ -5795 -20322 -41038 -23070 -20282 -30704 -27796 -31818 -7364 -7641 -9352 -7862 -21010 -20226 -49435
8160d9435P822J9429j7264j6078r463O466M0002K4671K2473j0514j4916r332q668
$$ -49435 -41613 -22184 -39448 -55526 -64989 -58523 -18521 6150 28623 18109 3193 -6139 -14807
8147a4807j633K5428L010l180K0651Q775q063q28M007j5008o01P661N999j3683
$$ -14807 -16440 8988 11998 8818 29469 38244 30181 29353 33360 18352 17751 25412 31411 17728
8133A7728N224n876j4897q923K3803j8151k4458P060k1156k2502K1381L5398m980
$$ 17728 22952 17076 2179 -6744 17059 -1092 -25550 -18490 -39646 -62148 -40767 -5369 -10349
8120a0349p789j5738q44M449L87J8109L0207o841j7058j5371J1598R934j3693
$$ -10349 -18138 -33876 -34720 -30271 -29884 -11775 18432 11591 -5467 -20838 -9240 694 -12999
8107a2999l4232k221L0690M0764K649o872j8427P786L4943j3742J2483M423r102
$$ -12999 -47231 -49452 -18762 22002 24651 17779 -648 7138 42081 28339 40822 45245 36143
8094C6143J4476Q391j2888m7195j1396J3048j1284k3082M476m48K3918N750J199
$$ 36143 50619 59010 46122 -1073 -12469 579 -10705 -33787 -29311 -29759 -5841 -91 1108
8081A108M711k0320O490L231N06m614J2421J9674l0708l0336J571Q147K9183J889
$$ 1108 5819 -14501 -8011 -4780 -4274 -8888 3533 23207 -7501 -37837 -36266 -28119 1064 2953
8067B953m699Q668J4858l492k8515n189J2124Q671O675k2302j3552k352L3767
$$ 2953 -1746 6922 21780 18288 -10227 -15416 -3292 5379 12054 -10248 -23800 -26152 7615
8054G615J0827L242j3477k578j9052L044N147J5517r623j847j2060r526L487K9208
$$ 7615 18442 21684 8207 5629 -13423 -10379 -5232 10285 662 -1185 -13245 -22771 -19284 9924
8040I924j428N139O648j605m129k3424M864j3551J500N958O56l644o188j0406
$$ 9924 8496 13635 20283 18678 14549 -8875 -4011 -17562 -16062 -10104 -9448 -13092 -19280 -29686
8026b9686L438R293Q69l565J2023P893j248J2166r915j7545j8596k784K2650M081
$$ -29686 -26248 -16955 -16086 -19651 -7628 265 -983 11183 1268 -16277 -34873 -37657 -15007 -10926
8012a0926n67P087K0650R694O856o138p444j8241k292J4343P375p749q154l679
$$ -10926 -11493 -4406 16244 25938 32794 26656 19212 971 -1321 13022 20397 12648 4494 815
7998H15j653J4326o082k7935n017M501k3503q987K5053K3406K1595J1817K7103
$$ 815 -838 13488 7406 -20529 -25546 -21045 -44548 -53535 -28482 -5076 16519 28336 55439
7985E5439M638l1340n2251p377mR966J5669J2473k023n928j2543p629k0898o123
$$ 55439 60077 28737 -23514 -30891 -30895 -20929 -5260 7213 5190 -738 -13281 -20910 -41808 -47931
7971d7931J2129J4063J4183K1592O492k704N502K715p977J1216K2661p620k8779
$$ -47931 -35802 -21739 -7556 14036 20528 17824 23326 26041 18064 29280 51941 44321 15542
7958A5542J801J991q852j6815J1618O573N423J5162O504P157M903j0254Q401J6094
$$ 15542 17343 19334 10482 -6333 5285 11858 17281 32443 38947 46104 51007 40753 49154 65248
7944F5248j2913q326m494m774J4499k3031k349J2002m465p539O262j2292q563
$$ 65248 52335 44009 39515 34741 49240 26209 23860 35862 31397 23858 30120 17828 9265
7931I265J5877k367J8498o621j0306J4397j6378q704k78K1200J8886o42j8010
$$ 9265 25142 22775 41273 34652 24346 38743 22365 13661 13383 34583 53469 52827 34817
7918C4817k7719k261J7519k828J578q920m17M096O524j0787j4448l845N726K920
$$ 34817 7098 4837 22356 19528 21106 12186 11769 15865 22389 11602 -2846 -6691 -965 1955
7904A955K8811J3140j5588j1463j520O456J3782K476o251j7718K171p227m299
$$ 1955 30766 43906 28318 16855 15335 21791 35573 38049 31798 14080 16251 9024 4725
7891D725j59l107J325R29N181Q992j5386q635k569K5420J1703o146J2909o543
$$ 4725 4566 1459 2784 3713 8894 17886 2500 -6135 -8704 16716 28419 22273 35182 28639
7877B8639l245n725j4828M66j99J462o475j4337n127k228k342n635k38o627J9382
$$ 28639 25394 19669 4841 5307 5108 6570 95 -14242 -19369 -21597 -23939 -29574 -29812 -36439 -17057
7862a7057K551K405j513K848Q932k568M124K6548m512j4587m665J3051J589k0917
$$ -17057 -14506 -12101 -13614 -10766 -1834 -4402 -278 26270 21758 7171 2506 15557 17146 -3771
7848c771j4316j9024J2165J7118jk647J5664j890k0556l974J6430J9196j0952
$$ -3771 -18087 -37111 -24946 -7828 -7829 -10476 5188 3298 -17258 -21232 -4802 14394 3442
7835C442L813J5243J6612N858q974j1793q626q625K8J1419L855q66J4249o611
$$ 3442 7255 22498 39110 44968 35994 24201 15575 6950 6978 18397 22252 21386 35635 29024
7821B9024j1156j0741m611j8572j9161P381M685k357K6312q975m131p622j9588
$$ 29024 17868 7127 2516 -16056 -35217 -27836 -23151 -25508 804 -8171 -12302 -19924 -39512
7808c9512j2083J7988O250J4761j2185m089J5869J9406N819q93N539q430k7328
$$ -39512 -51595 -33607 -27357 -12596 -24781 -28870 -13001 6405 12224 11331 16870 8440 -18888
7795a8888J349j6113K1429n976j4713K763k3573J5135K0625J1765k6039p439P367
$$ -18888 -17539 -33652 -12223 -18199 -32912 -30149 -53722 -38587 -17962 -6197 -32236 -39675 -32308
7782c2308N779j7761K356K8904P812O474J4924m644o395K060j0794j2408Q640
$$ -32308 -26529 -44290 -41934 -13030 -5218 1256 16180 11536 5141 7201 -3593 -16001 -7361
7769g361K7107K7603J7539k2097j6461M918m615j9633q909J2214j1416q623j0919
$$ -7361 19746 47349 64888 42791 26330 31248 26633 7000 -1909 10305 -1111 -9734 -20653
7756b0653R138J1297L115j0828K694o587r791k340L1654M642q093j4458M628j2231
$$ -20653 -11515 -218 2897 -7931 -5237 -11824 -21615 -23955 7699 12341 4248 -10210 -5582 -17813
7742a7813k6843K0577J2605J6654j3969r018p294K911R467n602j0750K6144M616
$$ -17813 -44656 -24079 -11474 5180 -8789 -17807 -25101 -22190 -12723 -18325 -29075 -2931 1685
7729A685J5582R199k8204j7207q914j0511R975K0351J2037q027k9208n82K2984
$$ 1685 17267 26466 -1738 -18945 -27859 -38370 -28395 -8044 3993 -4034 -33242 -33824 -10840
7716a0840L4393N77q078N657J5788j4024k0095k2268j0870K0474K7007L409L2630
$$ -10840 23553 24130 16052 21709 37497 23473 3378 -18890 -29760 -9286 17721 21130 53760
7703E3760j3085j4689m137m899j090k4221Q277q041k4720q209J4168M380j0642
$$ 53760 40675 25986 21849 16950 15860 -8361 -84 -8125 -32845 -41054 -26886 -22506 -33148
7690c3148J9168j5047j9200r668K6878J6779K0997K4873l1878j3565O103J1111
$$ -33148 -13980 -29027 -48227 -57895 -31017 -14238 6759 31632 -246 -13811 -7708 3403
7678C403J2291P954l116J2268J8168P342k079j3667k3004k5666K1786k648n977
$$ 3403 15694 23648 20532 32800 50968 58310 56231 42564 19560 -6106 15680 13032 7055
7665G055j9542k7473k366P270J0587j960J8964J6477O879k50k3489J0943p309
$$ 7055 -12487 -39960 -42326 -35056 -24469 -26429 -7465 9012 15891 15641 -7848 3095 -4214
7652d214j710j6887J2080Q191m031j762o753j0947J0854J4409k4839n883M552
$$ -4214 -5924 -22811 -10731 -2540 -6571 -8333 -15086 -26033 -15179 -770 -25609 -31492 -26940
7639b6940j4445J2086P582J5592K896Q821J8626n191m7939j4986J7830P026R214
$$ -26940 -41385 -29299 -21717 -6125 -3229 5592 24218 19027 -28912 -43898 -26068 -19042 -9828
7626i828N233M68J5636O870l0173j3538Q113O591J5808L958k0044j0049q592K184
$$ -9828 -4595 -4127 11509 18379 -11794 -25332 -17219 -10628 5180 9138 -10906 -20955 -29547 -27363
7612b7363N108L660J3630n657J7661J7432k5579k8651J8821L4005m227q183j061
$$ -27363 -22255 -18595 -4965 -10622 7039 24471 -1108 -29759 -10938 23067 18840 10657 9596
7599I596K014j5590j1668j0265J585J4340K0568L101k0595m787J08J5613J6014
$$ 9596 11610 -3980 -15648 -25913 -24328 -9988 10580 13681 -6914 -11701 -11593 4020 20034
7586B0034o221m418M172J5222m034k3935p501K635m698K547J3225R237P00k2307
$$ 20034 13813 9395 13567 28789 24755 820 -6681 -4046 -8744 -6197 7028 16265 16965 -5342
7572e342k1193k7136K0198J3648k2611O043L2765o513O197P068n64o915q860J8978
$$ -5342 -26535 -53671 -33473 -19825 -42436 -36393 -3628 -10141 -3944 3124 2560 -4355 -13215 5763
7558E763J9470j6040o74K570L542k6804o059J1875m047K4758j39O68l730J123
$$ 5763 25233 9193 8519 11089 14631 -12173 -18232 -6357 -10404 14354 14215 14883 11153 12276
7544A2276O392j0301o774L717j0689K584K3281J2806j8641J923l833q666k2390
$$ 12276 18668 8367 1593 5310 -5379 -2795 20486 33292 14651 16574 12741 4075 -18315
7531a8315J1753J4507r200L122K3896R394j5204k2849j6630k5028J8578P444L1332
$$ -18315 -6562 7945 -1255 1867 25763 35157 19953 -2896 -19526 -44554 -25976 -18532 12800
7518A2800J2577M569N265J87Q470L799l1813l0071J6261K7216K8311j974j2925
$$ 12800 25377 29946 35211 35398 43868 47667 15854 -14217 2044 29260 57571 55597 42672
7505D2672j1151j0615J5020N383j0783k6962q738j7946j0056K068L0812J229K4025
$$ 42672 31521 20906 35926 41309 30526 3564 -5174 -23120 -33176 -31108 -296 933 24958
7492B4958p864k6886M925L132q66k434J4026L281L749O528j7302o062n564J4259
$$ 24958 17094 -9792 -4867 -1735 -2601 -5035 8991 12272 16021 22549 5247 -815 -6379 7880
7478G880m199P370j481k316J0036P555L207j4515q586R024j902j8937M217J9035
$$ 7880 3681 11051 9570 7254 17290 24845 28052 13537 4951 13975 12073 -6864 -2647 16388
7464A6388m445j3602j1218K5730j0756q048R927J7004m20p656k803r100j5997
$$ 16388 11943 -1659 -12877 12853 2097 -5951 3976 20980 20560 12904 10101 1001 -14996
7451a4996K0936n07l698K3823j924j5557j1226K379q245J0406j7990q528J4935
$$ -14996 5940 5433 1735 25558 23634 8077 -3149 -770 -9015 1391 -16599 -25127 -10192
7438a0192L9468J4595K735j514j1581k8468j2690j4235p090J4798K7536o709J4785
$$ -10192 29276 43871 46606 45092 33511 5043 -7647 -21882 -28972 -14174 13362 6653 21438
7425B1438L6932j0113l0359k501k4324M828j4709l720N573J9030K1048j129n958
$$ 21438 58370 48257 17898 15397 -8927 -4099 -18808 -22528 -16955 2075 23123 21994 16036
7412A6036j7138N978J3927j6101J733o63j1718J1870J9276p216m287N48K984j4920
$$ 16036 -1102 4876 18803 2702 4435 3772 -7946 3924 23200 15984 11697 12245 15229 309
7398C09r496J591K2780N188p426J3013J5636k6073l897l231m143J1914J7964r910
$$ 309 -9187 -7596 15184 20372 12946 25959 41595 15522 11625 8394 4251 16165 34129 24219
7384B4219k3851J3163J742j6642k3597J0249L0128j5756q510r232p059o516j700
$$ 24219 368 13531 15273 -1369 -24966 -14717 15411 -345 -8855 -18087 -25146 -31662 -33362
7371c3362K5613K183j5007J9311L828K0980j153q944j0904J8129J8611j6971p128
$$ -33362 -7749 -5566 -20573 -1262 2566 23546 22393 13449 2545 20674 39285 22314 15186
7358A5186j6863J0990K6841l5777j6577J0973k668N593K4224l954j5869k7195
$$ 15186 -1677 9313 36154 377 -16200 -5227 -7895 -2302 21922 17968 2099 -25096
7346b5096J0750O064L165J8338r452m739J6181j5570q009J0145l1111K3060j8126
$$ -25096 -14346 -8282 -5117 13221 3769 -970 15211 -359 -8368 1777 -29334 -6274 -24400
7333b4400j6155J0662P632r132J291K1590K3151j9365k0463j2938M326L0911Q909
$$ -24400 -40555 -29893 -22261 -31393 -30102 -8512 14639 -4726 -25189 -38127 -33801 -2890 6019
7320F019K5073l351j1867j5986J1963J4943J5638k1389j7385J694J056k4879n330
$$ 6019 31092 27741 15874 -112 11851 26794 42432 21043 3658 5352 6408 -18471 -23801
7307b3801p530n988J0662J3208J7130R822J0398q086j4920J2141N012J629m42
$$ -23801 -31331 -37319 -26657 -13449 3681 13503 23901 15815 895 13036 18048 19677 19235
7294A9235j1068o43M448q585J148J939q57n951r751j919K2519P377r561J6895
$$ 19235 8167 7524 11972 3387 4535 6474 5617 -334 -10085 -12004 10515 17892 8331 25226
7280B5226L509j6598L487k1745j4165j1744L185M487K0044R392M797N055J345
$$ 25226 28735 12137 15624 -6121 -20286 -32030 -28845 -24358 -4314 5078 9875 14930 16275
7267A6275L130l7094j2014J1406M8614k626j4412j529j668n768O740Q26n547j1880
$$ 16275 19405 -17689 -29703 -18297 30317 27691 13279 11750 10082 4314 11054 11880 6333 -5547
7253e547J4900J9000N128K271j2985j2351l820M688m344l566J5344l2001j6336
$$ -5547 9353 28353 33481 35752 22767 10416 6596 11284 6940 3374 18718 -13283 -29619
7240b9619P489J2067P128j3346K2859N550j4381Q322J4935k0356l2078J714K5914
$$ -29619 -22130 -10063 -2935 -16281 6578 12128 -2253 6069 21004 648 -31430 -29716 -3802
7227c802k75o723J0068N346L783J014o470j9817J1393R934j8794p210q68j6056
$$ -3802 -4077 -10800 -732 4614 8397 9411 2941 -16876 -5483 4451 -14343 -21553 -22421 -38477
7213c8477J7872J1570J314l2304L1550K9651n321j1295M93j4884R41l469P158
$$ -38477 -20605 -9035 -7721 -40025 -8475 21176 15855 4560 5053 -9831 -8890 -12359 -5201
7200e201K155Q98O635l283l3778j2062K815L2466J9467q940j7683p753O051N844
$$ -5201 -3046 -2148 4487 1204 -32574 -44636 -41821 -9355 10112 1172 -16511 -24264 -18213 -12369
7186a2369j251K852O135K0095J3352j0206k8821j1293J1282K8292J6798j8771
$$ -12369 -13620 -10768 -4633 15462 28814 18608 -10213 -21506 -10224 18068 34866 16095
7174A6095j2459k2461j3588J2958k0114J1445K0083O542J5405r016k435k4127
$$ 16095 3636 -18825 -32413 -19455 -39569 -28124 -8041 -1499 13906 4890 2455 -21672
7162b1672j1630K218P550r209Q305J3284n427J7032J4429m791m357k2220K1929
$$ -21672 -33302 -31084 -23534 -32743 -24438 -11154 -16581 451 14880 10089 5732 -16488 5441
7149E441J8100k8127l790k2076J7018K551n852J7358J7262O272l0942j3437K7886
$$ 5441 23541 -4586 -8376 -30452 -13434 -10883 -16735 623 17885 24157 -6785 -20222 7664
7136G664K6486p631k5943m816M064J7937R640M530L011o139k4282j4266N12J1653
$$ 7664 34150 26519 576 -4240 -176 17761 27401 31931 34942 28803 4521 -9745 -9233 2420
7122B420M504j089Q051L9196J2999n769k5985p495J1352k3329l710j75M296k2457
$$ 2420 6924 5835 13886 53082 66081 60312 34327 26832 38184 14855 11145 10970 15266 -7191
7108g191O389K5886k7579k663K5457J1240k3912k1133J431j813o740N355J3874
$$ -7191 -802 25084 -2495 -5158 20299 31539 7627 -13506 -12075 -13888 -20628 -15273 -1399
7095a399J968J6007M436Q377J083M946O20j6974l5770j4691K0936J3004n187q286
$$ -1399 569 16576 21012 29389 30472 35418 36038 19064 -16706 -31397 -10461 2543 -2644 -10930
7081a0930l1181n26J5060J5659L486k089Q417L462k0962j7592O433J0215J2925
$$ -10930 -42111 -42637 -27577 -11918 -8432 -10521 -2104 1358 -19604 -37196 -30763 -20548 -7623
7068g623k1371q391J1034J8553J0860l4619j8688L3733J9940p756p279o542Q446
$$ -7623 -28994 -37385 -26351 -7798 3062 -31557 -50245 -16512 3428 -4328 -11607 -18149 -9703
7055i703J6285J6491K189P071l2601J4563j766l0899j7363p141K3905L204j1471
$$ -9703 6582 23073 25262 32333 -268 14295 12529 -18370 -35733 -42874 -18969 -15765 -27236
7042b7236j7975L276L3570N716J8611j7964r707q207N891l486j1950J0212J4987
$$ -27236 -45211 -41935 -8365 -2649 15962 -2002 -11709 -19916 -14025 -17511 -29461 -19249 -4262
7029d262J2726p283J5034j4216o205k484J8111k968J3686J8821r731R575J2470
$$ -4262 8464 1181 16215 1999 -4206 -6690 11421 8453 22139 40960 31229 40804 53274
7016E3274j0074l801j7177J0433J9306J956j0385l1904j8151K0534j196j8237
$$ 53274 43200 39399 22222 32655 51961 53917 43532 11628 -6523 14011 12815 -5422
7004e422k2930k1936j872K5043p678K088K6692L057P305m608k1058J2640K247
$$ -5422 -28352 -50288 -52160 -27117 -34795 -32707 -6015 -2958 4347 -261 -21319 -8679 -6432
6991f432k406O968j7302r080P686j570o776N117j1433j9224N417R023J7495p622
$$ -6432 -8838 -1870 -19172 -28252 -20566 -22136 -28912 -23795 -35228 -54452 -49035 -40012 -22517 -30139
6977c0139n796N845J2431N285Q118M837j9543J3375R444Q768o076O357Q220k7387
$$ -30139 -35935 -30090 -17659 -12374 -4256 581 -18962 -5587 3857 12625 6549 12906 21126 -6261
6963f261l498K977o02j0853N571o334L782K1483j093k5497j5686N721J9322K0928
$$ -6261 -9759 -6782 -7384 -18237 -12666 -19000 -15218 6265 5172 -20325 -36011 -30290 -10968 9960
6949I960k7656j8848l39l289J9448J3443j4367r037K1616r092j3222J1527M92
$$ 9960 -17696 -36544 -36883 -40172 -20724 -7281 -21648 -30685 -9069 -18161 -31383 -19856 -19364
6936a9364n688n038o191M750J1473O81J232m54L110j1948K2152J2811J2636l603
$$ -19364 -25052 -30090 -36281 -31531 -20058 -19377 -18145 -18599 -15489 -27437 -5285 7526 20162 16559
6922A6559k1519O185l988J0479M705l0079n95K1408j2752j6302K7888L2667p434
$$ 16559 -4960 1225 -2763 7716 12421 -17658 -18253 3155 -9597 -25899 1989 34656 27222
6909B7222o523k7117o270k493p354M87J2518J7301J2474J8553j4424k4927o515
$$ 27222 20699 -6418 -12688 -15181 -22535 -22048 -9530 7771 20245 38798 24374 -553 -7068
6896g068M4R599P911k6696l0487j3770K2633J0410J4577K7764j6560j6431R397
$$ -7068 -7024 2575 10486 -16210 -46697 -60467 -37834 -27424 -12847 14917 -1643 -18074 -8677
6883h677L2698O448p38j1537l3525n392K5119P847k3695J5820n97j3472J1332
$$ -8677 24021 30469 29731 18194 -15331 -20723 4396 12243 -11452 4368 3771 -9701 1631
6870A631L961J214J7839P607k9792J9542J0175l7852L078j2651p279K0549J0598
$$ 1631 5592 6806 24645 32252 2460 22002 32177 -5675 -2597 -15248 -22527 -1978 8620
6857H620M332k8582N458J4568j6234j1107N788K5068J1732o813l933o896J0385
$$ 8620 12952 -15630 -10172 4396 -11838 -22945 -17157 7911 19643 12830 8897 2001 12386
6844A2386L047J77J6108R879J858j3368M89M387j3753m548l867j7238J767J6509
$$ 12386 15433 15610 31718 41597 43455 30087 30576 34963 21210 16662 12795 -4443 -2676 13833
6830A3833k1691j3856K3898M8301q55m0896L544j5876m531j255J7576J4449P961
$$ 13833 -7858 -21714 2184 50485 49630 8734 12278 -3598 -8129 -9384 8192 22641 30602
6817C0602k078j6026n048l923M921r248L955j7150m802j4394N18M942L96J8975
$$ 30602 28524 12498 7450 3527 8448 -800 3155 -13995 -18797 -33191 -32673 -27731 -27335 -8360
6803h360l649j158K8219R56J4321k4033j6593n182l662j0604l517r890j6237P736
$$ -8360 -12009 -13167 15052 16008 30329 6296 -10297 -15479 -19141 -29745 -33262 -43152 -59389 -51653
6789e1653K6943j848j5078N408J9126M572K4944l706j6406j3601j618K8136j0205
$$ -51653 -24710 -26558 -41636 -36228 -17102 -12530 12414 8708 -7698 -21299 -22917 5219 -4986
6776d986k7454m192J4549Q072J7608J194m849j2875L662j8646k755j1384k275
$$ -4986 -32440 -36632 -22083 -14011 3597 4791 -58 -12933 -9271 -27917 -30672 -42056 -44331
6763d4331J8459O763j1482l0796J5389L1549k150k3901J1085L5324J3661J1977
$$ -44331 -25872 -19109 -30591 -61387 -45998 -14449 -16599 -40500 -29415 5909 19570 31547
6751C1547K740q736J5103M780O353j6118p10J3532j2774m864k407j0435k4746
$$ 31547 34287 25551 40654 45434 51787 35669 34959 48491 35717 30853 28446 18011 -6735
6738f735j7173J1531J4204M386J8412J0277M778j4348j6579R486P330j1911J3417
$$ -6735 -23908 -12377 1827 6213 24625 34902 39680 25332 8753 18239 25569 13658 27075
6725B7075K8285p341p353l817k0453J9356R946j9843j4151j6937k2681m205l856
$$ 27075 55360 48019 40666 36849 16396 35752 45698 25855 11704 -5233 -27914 -32119 -35975
6712c5975o833J850P724o563J4091J2890K988R218L893l1623J4390J3787j2623
$$ -35975 -42808 -40958 -33234 -39797 -25706 -12816 -9828 -610 3283 -28340 -13950 -163 -12786
6699a2786J3856J251J2071j2664k3242l486J1213q550J3604R109l508j0172M885
$$ -12786 1070 2321 14392 1728 -21514 -25000 -13787 -22337 -8733 376 -3132 -13304 -8419
6686h419r125K039K0276N526J0690O654O329j075k1209k7426j094K342j2803n000
$$ -8419 -17544 -15505 4771 10297 20987 27641 33970 32895 11686 -15740 -16834 -14492 -27295 -32295
6672c2295O076J1426K5425R295j5227o228J1064n577k040N52r768K497J5994J0430
$$ -32295 -26219 -14793 10632 19927 4700 -1528 9536 3959 1919 2471 -7297 -4800 11194 21624
6658B1624K405J334J0590P40J1256j0301k7913n420L895K2818j3091l2392k1009
$$ 21624 24029 25363 35953 36693 47949 37648 9735 4315 8210 31028 17937 -14455 -35464
6645c5464J3331P53m219J3196K334M033p428J433M560N441J9561J5678k0252j079
$$ -35464 -22133 -21380 -25599 -12403 -10069 -6036 -13464 -12031 -7471 -2030 17531 33209 12957 11878
6631A1878J8376n675K160j8876k3369l1230M338O623J5777J5511N431M38K114
$$ 11878 30254 24579 26739 7863 -15506 -46736 -42398 -35775 -19998 -4487 944 1382 3496
6618C496j25K564j3961j5754J9748K3462l844k3099k4301P39J4594J3578L1231
$$ 3496 3371 5935 -8026 -23780 -4032 19430 15586 -7513 -31814 -31075 -16481 -2903 28328
6605B8328o034k1008M538l824j6924j3043J7050r597K723J2080J5792O803l6098
$$ 28328 22294 1286 5824 2000 -14924 -27967 -10917 -20514 -17791 -5711 10081 16884 -19214
6592a9214j879K0004J4490K16J3650J5894k5047r309Q991N594j2916k2983o014
$$ -19214 -21093 -1089 13401 13617 27267 43161 18114 8805 17796 23390 10474 -12509 -18523
6579a8523J3923q938J2038J9730q772j8915J0899J2108l2116k5538J5431K2944
$$ -18523 -4600 -13538 -1500 18230 9458 -9457 1442 13550 -18566 -44104 -28673 -5729
6567e729M18K3684q035j6818j5116J7353Q317K726P123k0220p878K0574J9891
$$ -5729 -5311 18373 10338 -6480 -21596 -4243 4074 6800 13923 -6297 -14175 6399 26290
6554B6290l443j5041J7572j8550j7049o454q31P525j6393O092J9111o937p056
$$ 26290 22847 7806 25378 6828 -10221 -16675 -17506 -9981 -26374 -20282 -1171 -8108 -15164
6541a5164L004L106K818j3206o594K3352J5086P373k3602m4927K4906J7401R888
$$ -15164 -12160 -9054 -6236 -19442 -26036 -2684 12402 19775 -3827 -48754 -23848 -6447 3441
6528C441J853R086N171J0375J8018k5665j1743j60l736J0494K633p503J8743P964
$$ 3441 5294 14380 19551 29926 47944 22279 10536 10376 6640 17134 19767 12264 31007 38971
6514C8971j5903l5323j2149K310l244r03r79L572O16L660J74N647j723O166j3806
$$ 38971 23068 -12255 -24404 -22094 -25338 -26241 -27220 -23648 -23032 -19372 -19198 -13551 -15274 -9108 -22914
6499b2914o494j4981K3154m476M312K5619J1171P738k4059j4817m592M1j1721
$$ -22914 -29408 -44389 -21235 -25711 -21399 4220 15391 23129 -930 -15747 -20339 -20298 -32019
6486c2019j972k146N57J1484j1509j9646K1108Q081K3936K285l814o104p827Q751
$$ -32019 -33991 -36137 -35580 -24096 -35605 -55251 -34143 -26062 -2126 159 -3655 -9759 -17586 -8835
6472h835j9593k9279m339L4876K5114q264K3103j402q131K536r690j5118p827
$$ -8835 -28428 -57707 -62046 -27170 -2056 -10320 12783 11381 3250 5786 -3904 -19022 -26849
6459b6849J4065Q735q320J2077j5399l004O627J5280K3328j2321j5087J902j8208
$$ -26849 -12784 -4049 -12369 -292 -15691 -18695 -12068 3212 26540 14219 -868 1034 -17174
6446a7174J0174O626N625J5167K9557j580k8217k1441J841Q279j8218k0281J3079
$$ -17174 -7000 -374 5251 20418 49975 48395 20178 -1263 578 8857 -9361 -29642 -16563
6433a6563Q415j7713j2794Q356K3915O889l05r31R385j2626j1687j8973j00O970
$$ -16563 -8148 -25861 -38655 -30299 -6384 505 200 -731 8654 -3972 -15659 -34632 -34732 -27762
6419b7762L4765j6744m413K3558J628N775l317M881r820j7485n66J4781j6233
$$ -27762 7003 -9741 -14154 9404 11032 16807 13490 18371 8551 -8934 -9500 5281 -10952
6406a0952q458M493j397j4390N61q30J1737N56p441O437p633R540j6654p69K5165
$$ -10952 -19410 -14917 -16314 -30704 -30143 -30973 -19236 -18680 -26121 -19684 -27317 -17777 -34431 -35200 -10035
6391a0035k238K4973O624J666o034j8602M533L3562j3578k8266r25J9124o275
$$ -10035 -12273 12700 19324 20990 14956 -3646 887 34449 20871 -7395 -8320 10804 4529
6378D529K4419p695k2593o489K036k9186N892L3930K6692J8189J4838j3257m733
$$ 4529 28948 21253 -1340 -7829 -5793 -34979 -29087 4843 31535 49724 64562 51305 46572
6365D6572j4403l1548j0092M03j0224J6325L1372m21o174J7069n139o55j632m4325
$$ 46572 32169 621 -9471 -9068 -19292 -2967 28405 27984 21810 38879 33740 33085 31453 -12872
6351a2872j1087p110J8806K6402n006j3449J5112J5790j287n122J5286j5012q032
$$ -12872 -23959 -31069 -12263 14139 9133 -4316 10796 26586 25299 20177 35463 20451 12419
6338A2419J7117q566J670l242k2414j0030K3043O339J5296j619q295m719l747
$$ 12419 29536 20970 22640 19398 -3016 -13046 9997 16336 31632 30013 21718 16999 13252
6325A3252K5048L4553l6819j9313j0347J2069p166p578q994j0511K1603j6003
$$ 13252 38300 72853 36034 16721 6374 18443 11277 3699 -5295 -15806 5797 -10206
6313a0206k1183J9806J4817k9833J8786K4564j42Q727k452l264J679k8414j4210
$$ -10206 -31389 -11583 3234 -26599 -7813 16751 16609 25336 22884 19620 21299 -7115 -21325
6300b1325k4864n388J8808R130K148M035O086l500L1111N341j3150k826j5933
$$ -21325 -46189 -51577 -32769 -23639 -21491 -17456 -11370 -14870 16241 21582 8432 5606 -10327
6287a0327q70J1121o024N306J1695P393J0887M585j6166j2488k0087j7943J6433
$$ -10327 -11197 -76 -6100 -794 10901 18294 29181 33766 17600 5112 -14975 -32918 -16485
6274a6485P911O394j497J1322M387j8657M86J0764J4954P457k5966k5437J476
$$ -16485 -8574 -2180 -3677 7645 12032 -6625 -6139 4625 19579 27036 1070 -24367 -22891
6261b2891Q966j7558m25J6419j1197j3013J4608j7202J812N624p166K1436j3667
$$ -22891 -13925 -31483 -31908 -15489 -26686 -39699 -25091 -42293 -40481 -34857 -42023 -20587 -34254
6248c4254j0570J6412k199k0249J2384Q816r726J2468J3728J4245j1255l0294
$$ -34254 -44824 -28412 -30611 -50860 -38476 -29660 -39386 -26918 -13190 1055 -10200 -40494
6236d0494P355K6979O646l3310p207K0084k5315P756M730K3384R506k6470j763
$$ -40494 -33139 -6160 486 -32824 -40031 -19947 -45262 -37506 -32776 -9392 114 -26356 -28119
6223b8119N42J3055l628k9977j90J7638Q07R990O004l4872J7101L8865K4577k4136
$$ -28119 -27577 -14522 -18150 -48127 -48317 -30679 -29872 -19882 -13878 -48750 -31649 7216 31793 7657
6209G657j0808K0040P350K384q991p602N045J5189Q976N778k5740M917J044j7437
$$ 7657 -3151 16889 24239 26623 17632 10030 15075 30264 39240 45018 19278 24195 25239 7802
6195G802M388k4257n112j3870J1256J3241J2209K215J9345P023l40j642q883k087
$$ 7802 12190 -12067 -17179 -31049 -19793 -6552 5657 7872 27217 34240 33900 32258 23375 21288
6181B1288K8764R046r218M905j4912k8913j9129l915J1206K4370J6833j7612k6298
$$ 21288 50052 59098 49880 54785 39873 10960 -8169 -12084 -878 23492 40325 22713 -3585
6168c585r143J6847M976j6453J6117o526p827N359j454J836q028J111O70J1814
$$ -3585 -12728 4119 9095 -7358 8759 2233 -5594 -235 -1689 147 -7881 -6770 -6100 5714
6154E714M936O755O915l0956k5847j0950J83J0647K8914J6639j1766j2938K908
$$ 5714 10650 17405 24320 -6636 -32483 -43433 -43250 -32603 -3689 12950 1184 -11754 -8846
6141h846M679j9570K4622j4026K733J3378r280o160Q276J4630k846J0519O591
$$ -8846 -4167 -23737 885 -13141 -10408 2970 -6310 -12470 -4194 10436 7590 18109 24700
6128B4700K9696j4999k6905j6751J2260J8232J3298k2903n0151l456M3933o904
$$ 24700 54396 39397 12492 -4259 8001 26233 39531 16628 -33523 -36979 6954 50
6116E0j7932J0385r117Q732N804j8421N668q382J5700k31l3809N296K1042Q266
$$ 50 -17882 -7497 -16614 -7882 -2078 -20499 -14831 -23213 -7513 -7744 -41553 -36257 -15215 -6949
6102f949K7654m028j5684j8387o137K4886J780k266o854j0305N69p532J7760j4918
$$ -6949 20705 16677 993 -17394 -23531 1355 3135 869 -5985 -16290 -15721 -23253 -5493 -20411
6088b0411p297K250J3540N1542J9302j2631j141j1536j3582p705K1928p474O231
$$ -20411 -27708 -25458 -11918 39624 58926 46295 45154 33618 20036 12331 34259 26785 33016
6075C3016q15j1005j7081l198R449K3476j3092n084M5806k317l4279m0725n185
$$ 33016 32201 21196 4115 917 10366 33842 20750 15666 61472 59155 24876 -15849 -21034
6062b1034K7481J1725o216j8008j8710j0126j940R455J0778J7895l643p249J958
$$ -21034 6447 18172 11956 -6052 -24762 -34888 -36828 -27373 -16595 1300 -2343 -9592 -7634
6049g634k3011J5346J2891p362j413K6158J1281k4930k3194J4979L3644J9742
$$ -7634 -30645 -15299 -2408 -9770 -11183 14975 26256 1326 -21868 -6889 26755 46497
6037D6497l485k9054k1464p31J7604l041j4296J6595m152j6087J612m526j6563
$$ 46497 43012 13958 -7506 -8237 9367 6326 -7970 8625 4473 -11614 -10002 -14528 -31091
6024c1091j0746N010J2176k0895j4494J4801K7948m214j22J2167K5024J1847Q236
$$ -31091 -41837 -36827 -24651 -45546 -60040 -45239 -17291 -21505 -21627 -9460 15564 27411 35647
6011C5647m252j5194r095l019q998K303L759j4294j7163J7992L0194j9976k6906
$$ 35647 31395 16201 7106 4087 -4911 -2608 1151 -13143 -30306 -12314 17880 -2096 -29002
5998b9002J1269K2173J7N28k95l2940o806K9049M686k733o239o368M689r358J0682
$$ -29002 -17733 4440 4457 4985 4690 -28250 -35056 -6007 -1321 -4054 -10293 -16661 -11972 -21330 -10648
5983a0648M409j687l867j1964R432Q295J0981j7834j9387r406J0165K5179j3090
$$ -10648 -6239 -7926 -11793 -23757 -14325 -6030 4951 -12883 -32270 -41676 -31511 -6332 -19422
5970a9422L4862K2728j0466J1590J7057J5826j1006k3844j8733O727m112k6259
$$ -19422 15440 38168 27702 39292 56349 72175 61169 37325 18592 25319 21207 -5052
5958e052j7828J5402j0243q22L434L702l593r025J1665P292M809J1295k2132n930
$$ -5052 -22880 -7478 -17721 -18543 -15109 -11407 -15000 -24025 -12360 -5068 -259 11036 -11096 -17026
5944a7026K1346P853N107N875O323r265J1119K3236K0830k0632k1900j3362K491
$$ -17026 4320 12173 17280 23155 29478 20213 31332 54568 75398 54766 32866 19504 21995
5931B1995l440Q38K4054J4229l3981m806K197o673q349j0264O029n689O343O130
$$ 21995 18555 19393 43447 57676 23695 18889 21086 14413 6064 -4200 1829 -3860 2483 8613
5917H613J8763m531k2697L454J4229J233k2233O234K4741P025N936k1345j2194
$$ 8613 27376 22845 148 3602 17831 19064 -3169 3065 27806 34831 40767 19422 7228
5904G228R14m522j6353j1256o697L988M24q549N975p145j2947J4871J2219K9934
$$ 7228 8142 3620 -12733 -23989 -30686 -26698 -26274 -34823 -28848 -35993 -48940 -34069 -21850 8084
5890H084R599j8349k1513M693O599K3932Q27j7294J0720p198j5954O963K074p311
$$ 8084 17683 -666 -22179 -17486 -10887 13045 13872 -3422 7298 100 -15854 -8891 -6817 -14128
5876a4128K0149K5816o001k2002k7167K9700k578l2992J3166J8842n977o063k828
$$ -14128 6021 31837 25836 3834 -23333 6367 3789 -29203 -16037 2805 -3172 -9235 -12063
5863a2063K371n772J988R586j845l9J1245M40k902l939j5707L598J738j303O935
$$ -12063 -9692 -15464 -13476 -3890 -5735 -5774 5471 5911 3009 -930 -16637 -13039 -11301 -12604 -5669
5848e669J7052k377j4599j5511K201J1268R120J2528o638L891Q644o431k8240
$$ -5669 11383 9006 -5593 -21104 -18903 -7635 1485 14013 7375 11266 19910 13479 -14761
5835a4761l1940m590L462K7692M530R817J35L808P918j781k0094l946LK12M495
$$ -14761 -46701 -51291 -47829 -20137 -15607 -5790 -5655 -1847 6071 4290 -15804 -19750 -19747 -19535 -15040
5820a5040p1j0708k3907q395J4513K8645O762q322k6369r784L622n574j5J1645
$$ -15040 -15111 -25819 -49726 -58121 -43608 -14963 -8201 -16523 -42892 -52676 -49054 -54628 -54643 -42998
5806d2998P151K2322L150o317j2349J6357K6943N996J3679m923L132n585l937
$$ -42998 -35847 -13525 -10375 -16692 -29041 -12684 14259 20255 33934 29011 32143 26558 22621
5793B2621k1281k9991R000P683J4142J4724P021j1509k1278j0815k299K6346K874
$$ 22621 1340 -28651 -19651 -11968 2174 16898 23919 12410 -8868 -19683 -21982 4364 7238
5780G238j705o147l4k8179j0814L9824J6570k0245k4001j9603J5380L1839Q985
$$ 7238 5533 -614 -648 -28827 -39641 183 16753 -3492 -27493 -47096 -31716 123 9108
5767I108J0128n942j1680j9117P420N227k873j3255Q079L208O011J0549K3177
$$ 9108 19236 13294 1614 -17503 -10083 -4856 -7729 -20984 -12905 -9697 -3686 6863 30040
5754C0040j1093J793j3600n315P86r285j188O004j3895m590J106k813j236J1395
$$ 30040 18947 20740 7140 1825 2611 -6674 -7862 -1858 -15753 -20343 -19237 -22050 -23286 -11891
5740a1891q945j302P001n728p521o057J0986O075J9089J4320M785o508K1385j8291
$$ -11891 -20836 -22138 -15137 -20865 -28386 -34443 -23457 -17382 1707 16027 20812 14304 35689 17398
5726A7398l3611j9716M819K2390J2557M456j819M102j1633j8928p306N109J5194
$$ 17398 -16213 -35929 -31110 -8720 3837 8293 6474 10576 -1057 -19985 -27291 -22182 -6988
5713f988j396j0665j7821l0223J7339K7226k38q027J224L352L149p133J51Q496
$$ -6988 -8384 -19049 -36870 -67093 -49754 -22528 -22766 -30793 -29569 -26217 -23068 -30201 -30050 -21554
5699b1554q676p088L020J8336L560N799J1161J9990m809k733Q278j912j3324M193
$$ -21554 -30230 -37318 -34298 -15962 -12402 -6603 4558 24548 19739 17006 25284 23372 10048 14241
5685A4241J6475Q730l160j9788J1844m525j8582J181n155l629Q457j9915J666
$$ 14241 30716 39446 36286 16498 28342 23817 5235 6416 1261 -2368 6089 -13826 -12160
5672a2160J2550j034N043n373m559j5054q87N072J9936Q065k799k7056j7018L2157
$$ -12160 390 -644 4399 -974 -5533 -20587 -21474 -16402 3534 11599 8800 -18256 -35274 -3117
5658c117L4234K3228j1962O033p836l1721j7511K148M419J4333p807j9223j0983
$$ -3117 31117 54345 42383 48416 40580 8859 -8652 -6504 -2085 12248 4441 -14782 -25765
5645b5765P787R831J3560o315m443R272j785L424k430j2140J317J1249J9424J880
$$ -25765 -17978 -8147 5413 -902 -5345 3927 2142 5566 3136 -9004 -7687 3562 22986 24866
5631B4866J2374M942l0045r94P351P824J9295j189n490P922j8181l7207j8473
$$ 24866 37240 42182 12137 11143 18494 26318 45613 44424 38934 46856 28675 -8532 -27005
5618b7005K0737L992j2768M934n785J1179K158j4542J619J2557O919N127R416
$$ -27005 -6268 -2276 -15044 -10110 -15895 -4716 -2558 -17100 -15481 -2924 3995 9122 18538
5605A8538J2286k2869j7697p063Q598N688J753j9030J2674K3066Q813K352j9359
$$ 18538 30824 7955 -9742 -16805 -8207 -2519 -766 -19796 -7122 15944 24757 27109 7750
5592G750k6097j1438J802J4456J7358Q979J0889k5051k1604J2082K2075N145L516
$$ 7750 -18347 -29785 -27983 -13527 3831 12810 23699 -1352 -22956 -10874 11201 16346 19862
5579A9862j8938M672Q068j1498q101J3125O156j2818R691J650n345m09k334J4938
$$ 19862 924 5596 13664 2166 -5935 7190 13346 528 10219 11869 6524 6115 3781 18719
5565A8719o652j6258q546j6758j3961J0254K6031r787J112J8088N261j4357R219
$$ 18719 12067 -4191 -12737 -29495 -43456 -33202 -7171 -16958 -15846 2242 7503 -6854 2365
5552B365m127N661k0302k1706R296J3172p123n767J3794K2868K6686J4387k0q516
$$ 2365 -1762 3899 -16403 -38109 -28813 -15641 -22764 -28531 -14737 8131 34817 49204 49184 40668
5538D0668k2127j0210K845r64j5988k2654O282J0163l755j2835j4319K4987O697
$$ 40668 18541 8331 11176 10212 -5776 -28430 -22148 -11985 -15740 -28575 -42894 -17907 -11210
5525a1210J561K8924j5154j3759K439q207R901j3980k1049j198l757k317k1406
$$ -11210 -9649 19275 4121 -9638 -7199 -15406 -5505 -19485 -40534 -41732 -45489 -47806 -69212
5512f9212L962j1228K3153K7941r101J1212o521L853q556J0470K4894P351j3998
$$ -69212 -65250 -76478 -53325 -25384 -34485 -23273 -29794 -25941 -34497 -24027 867 8218 -5780
5499e780J632R405k5832p728K7666J9638M726P699l6250M704P128K120j7518L62
$$ -5780 -4148 5257 -20575 -28303 -637 19001 23727 31426 -4824 -120 7008 9128 -8390 -8028
5485h028m230k7169j7304o319J4539J6147J7975J0267o09l821k9591k3972L61
$$ -8028 -12258 -39427 -56731 -63050 -48511 -32364 -14389 -4122 -4731 -8552 -38143 -62115 -61754
5472f1754J0231K269L6537K9802Q96p723j3207N469o189n091K926K8757k47j1189
$$ -61754 -51523 -49254 -12717 17085 17981 10258 -2949 2520 -3669 -8760 -5834 22923 22676 11487
5458A1487j7996J0216j2230o375O762J1178J8689j5018l6683J19J6541K105J1483
$$ 11487 -6509 3707 -8523 -14898 -8136 3042 21731 6713 -29970 -29851 -13310 -11205 278
5445B78n178J1437J6832J309K344j4941R729K509j544m347K632J7294l012l742
$$ 278 -4900 6537 23369 24678 27022 12081 21810 24319 22775 18428 21060 38354 35342 31600
5431C1600j0498m800K2785p603k8658k1028j475J5577J2424P69J1404J3138j717
$$ 31600 21102 16302 39087 31484 2826 -18202 -19677 -4100 8324 9093 20497 33635 31918
5418C1918O578k9818l6572J0309J1304K57K24P453K4827Q82l3014k8844J42K750
$$ 31918 38496 8678 -27894 -17585 -6281 -6024 -5800 1653 26480 27362 -5652 -34496 -34354 -31604
5404c1604r876l812j4175k064L5746J4891o852r03L5346J0395l05K900j2192j2113
$$ -31604 -41480 -45292 -59467 -61531 -25785 -10894 -17746 -18649 16697 27092 26787 29687 17495 5382
5390E382l8444J7856J3948J2247m757k3206j9719n310M059N486J3947K5097L6888
$$ 5382 -33062 -15206 -1258 10989 6232 -16974 -36693 -42003 -37944 -32458 -18511 6586 43474
5377D3474j0834j2529R142J3980m93n4449J457J5857K9098l0838l9236l088m309
$$ 43474 32640 20111 29253 43233 42740 -11709 -10252 5605 34703 3865 -35371 -38459 -42768
5364d2768J9444K0156M988J0895l677l2295J174j1337r348n787k4484p784M0665
$$ -42768 -23324 -3168 1820 12715 9038 -23257 -22083 -33420 -42768 -48555 -73039 -80823 -40158
5351d0158N8290k203j3161j0799r591n315L3612J5784j9112r948r469P561K3391
$$ -40158 18132 15929 2768 -8031 -17622 -22937 10675 26459 7347 -2601 -12070 -4509 18882
5338A8882j311j108K548O110L820j2020m094J3802l750j0266L827j2345l220j8409
$$ 18882 17571 16463 19011 25121 28941 16921 12827 26629 22879 12613 16440 4095 875 -17534
5324a7534k440K2565J0232k6342J994o607J993o691j3124j1927O53K1493J4536
$$ -17534 -19974 2591 12823 -13519 -11525 -18132 -16139 -22830 -35954 -47881 -47228 -25735 -11199
5311a1199Q26K53P943K0713J6899o820M052n111J265K3728O775l6618l1237L623
$$ -11199 -10373 -10120 -2177 18536 35435 28615 32667 27556 28821 52549 59324 22706 -8531 -4908
5297d908J9594Q69p768L354j8676J958J8673J4707P10P239q840k1929j7502r91
$$ -4908 14686 15555 7787 11141 -7535 -5577 13096 27803 28513 35752 26912 4983 -12519 -13510
5283a3510p62J605j3968J6365R866J694p176j221j1068R49O33m198p54M61J2853
$$ -13510 -14272 -12667 -26635 -10270 -404 1290 -5886 -7107 -18175 -17226 -16593 -20791 -21545 -21084 -8231
5268h231K5978P63l298m514k3778j7697J4959L9005M946m1137J0068L1879N321
$$ -8231 17747 18510 15212 10698 -13080 -30777 -15818 23187 28133 -13004 -2936 28943 34264
5255C4264J1403j1579j8602r610p270l5743N542L3662p22m578m845K654j892J7020
$$ 34264 45667 34088 15486 5876 -1394 -37137 -31595 2067 1345 -3233 -8078 -5424 -7316 9704
5241I704j0133J0009K0924j5000k4235J3914r02l5243Q297J3362j7128k3077p597
$$ 9704 -429 9580 30504 15504 -8731 5183 4281 -30962 -22665 -9303 -26431 -49508 -57105
5228e7105M798K3377p645j4511J3403l873M168P514K2727k1449j1059L3260m124
$$ -57105 -52307 -28930 -36575 -51086 -37683 -41556 -37388 -29874 -7147 -28596 -39655 -6395 -10519
5215a0519j9613r078J3991J4651J2241R846J3915q956j9665l0463q048J2187K0158
$$ -10519 -30132 -39210 -25219 -10568 1673 11519 25434 16478 -3187 -33650 -41698 -29511 -9353
5202i353K0436L078M33r30j7841k8792K339Q939J0465m023J8626N561j395k7557
$$ -9353 11083 14161 14594 13664 -4177 -32969 -30630 -21691 -11226 -15249 3377 8938 7543 -20014
5188b0014l3015K0341K4687J8988Q974k5974j3178r639p698L858J3250j1825q051
$$ -20014 -53029 -32688 -8001 10987 19961 -6013 -19191 -28830 -36528 -32670 -19420 -31245 -39296
5175c9296J2803m71J6610R746j4743j3080L0970J2521J3116j8119k2635j156P217
$$ -39296 -26493 -26964 -10354 -608 -15351 -28431 2539 15060 28176 10057 -12578 -13734 -6517
5162f517q290j0443k658n995R623q80j629K0331m757L741Q896J2647j8229j2698
$$ -6517 -14807 -25250 -27908 -33903 -24280 -25160 -26789 -6458 -11215 -7474 1422 14069 -4160 -16858
5148a6858J9472J5925p920j6897k3101K493k073K7102J4717j4628L614K750j5405
$$ -16858 2614 18539 10619 -6278 -29379 -26886 -28959 -1857 12860 -1768 1846 4596 -10809
5135a0809p664J8163J0332K883j1004k7333m799N563J4640L2180j5619K2609M631
$$ -10809 -18473 -310 10022 12905 1901 -25432 -30231 -24668 -10028 22152 6533 29142 33773
5122C3773j6072k3677k0939o85j6257j3103j3339J5790R003J8770O893P974L588
$$ 33773 17701 -5976 -26915 -27600 -43857 -56960 -70299 -54509 -45506 -26736 -19843 -11869 -8281
5109h281k0460j0062N748L6287K3587J865R645O933k3199k0066j383j3905k0924
$$ -8281 -28741 -38803 -33055 3232 26819 28684 38329 45262 22063 1997 614 -13291 -34215
5096c4215J3680M8915J178q202J1369j4852j7531N854K3907k6170j6328Q581j2046
$$ -34215 -20535 28380 29558 21356 32725 17873 342 6196 30103 3933 -12395 -3814 -15860
5083a5860R938N791j6615K3202J6856p601N898M981m580j9873r666J0494l730
$$ -15860 -5922 -131 -16746 6456 23312 15711 21609 26590 22010 2137 -7529 2965 -765
5070g65J6600J6162j936j5025J4641K9970j9309k1958j6490J853l452k534J5271
$$ -765 15835 31997 30061 15036 29677 59647 40338 18380 1890 3743 291 -2243 13028
5057A3028j3965n892J4740o337l2238k398K5336K7221K102q299n609j911q533
$$ 13028 -937 -6829 7911 1574 -30664 -33062 -7726 19495 21597 13298 7689 5778 -2755
5044b755k2527p767p635j0321J8847J7873N945J4232J6970N361j3184R0j3153
$$ -2755 -25282 -33049 -40684 -51005 -32158 -14285 -8340 5892 22862 28223 15039 15129 1976
5031A976k5124K3884J3579j6486l64q625Q975J1616n971k4102j7004J8491q406
$$ 1976 -23148 736 14315 -2171 -2535 -11160 -2185 9431 3460 -20642 -37646 -19155 -27561
5018b7561j0233K1726K51K39K9552o552j6401Q579N577p971N635j1152O093M855
$$ -27561 -37794 -16068 -15817 -15578 13974 7422 -8979 -400 5177 -2794 2841 -8311 -2218 2637
5004B637l18O809l004L035k762j2132r943L956r369k480K4015J486j9162j736
$$ 2637 2319 9128 6124 9159 6397 -5735 -15678 -11722 -21091 -23571 444 1930 -17232 -18968
4990a8968J5786j2278l36m949j3772j898j5506P854J6249P476K4692k0076j3501
$$ -18968 -3182 -15460 -15796 -20745 -34517 -36415 -51921 -44067 -27818 -20342 4350 -15726 -29227
4977b9227J9441r42K0351J9328P47j9599j4245j8352k108J122K810P570R687P188
$$ -29227 -9786 -10728 9623 28951 29698 10099 -4146 -22498 -24606 -23484 -20674 -13104 -3417 3771
4963C771j5657p801K1809M382O121o821j2413p632j0475j2676J4387K6885J8887
$$ 3771 -11886 -19687 2122 6504 12625 5804 -6609 -14241 -24716 -37392 -23005 3880 22767
4950B2767N218j9486j78N27K2281j1732j8718j625J0784P162J4429k088K7k0477
$$ 22767 27985 8499 8321 8848 31129 19397 679 -946 9838 17000 31429 29341 29368 8891
4936H891l4558j7947M154J2541J4667K0429R205p14P224Q65r484r528j4537K3048
$$ 8891 -25667 -43614 -39460 -26919 -12252 8177 17382 16668 23892 24757 15273 5745 -8792 14256
4922A4256K2663j6797l996j3945j1981q201m810J5587M991p014O654q258L605
$$ 14256 36919 20122 16126 2181 -9800 -18001 -22811 -7224 -2233 -9247 -2593 -10851 -7246
4909g246m702l5040K0204j3427L84J6745j3070K2095P213K151J7167p550j2462
$$ -7246 -11948 -46988 -26784 -40211 -39827 -23082 -36152 -14057 -6844 -4693 12474 4924 -7538
4896g538K9016J0087m053j9915k4574Q631O860J3303L1622o681k8105q821j012
$$ -7538 21478 31565 27512 7597 -16977 -8346 -1486 11817 43439 36758 8653 -168 -1180
4883a180k0511p705K7247O695q824j6829J4012J0813j0515M239r232k0624K2660
$$ -1180 -21691 -29396 -2149 4546 -4278 -21107 -7095 3718 -6797 -2558 -11790 -32414 -9754
4870i754K0639K40j4364j4672J205J3259J6424l997J1843J6226n098j6991r62
$$ -9754 10885 11125 -3239 -17911 -16706 -3447 12977 8980 20823 37049 31951 14960 13998
4857A3998Q915J0918j533k7284l394L0640j1360k1374o752o979o656P022j0719
$$ 13998 22913 33831 32298 5014 1620 32260 20900 -474 -7226 -14205 -20861 -13839 -24558
4844b4558P542L571q845k1580n164K7464N932k447J1391j0302l829M081J4520
$$ -24558 -17016 -13445 -22290 -43870 -49034 -21570 -15638 -18085 -6694 -16996 -20825 -16744 -2224
4831b224m916j8789N959N946O056m039J7451k717p051p710J4880J8655p919J1567
$$ -2224 -7140 -25929 -19970 -14024 -7968 -12007 5444 2727 -4324 -12034 2846 21501 13582 25149
4817B5149j1444k081r458j3194Q346J9967J3419n121j2067R663k4122j6978O938
$$ 25149 13705 11624 2166 -11028 -2682 17285 30704 25583 13516 23179 -943 -17921 -10983
4804a0983J8838j5816o957j7682n287J7083J6428l759k009j9886m154n102J0527
$$ -10983 7855 -7961 -14918 -32600 -37887 -20804 -4376 -8135 -10144 -30030 -34184 -39286 -28759
4791b8759P670l534J0088M8948J503k2681j4465r978r364R851j2707L426J1671
$$ -28759 -21089 -24623 -14535 34413 35916 13235 -1230 -11208 -20572 -10721 -23428 -20002 -8331
4778h331J3591k732k3280n740R493Q305k0778O059p949J7016j222J1435O714j1316
$$ -8331 5260 2528 -20752 -26492 -16999 -8694 -29472 -23413 -31362 -14346 -15568 -4133 2581 -8735
4764h735k1259j150m636N904K9621J3173j8275j3728K339J0517m918J527J7164
$$ -8735 -29994 -31144 -35780 -29876 -255 12918 -5357 -19085 -16746 -6229 -11147 -9620 7544
4751G544p816n109J3458j3782m392K852P770K6563k4217J775j1775j3496K5493
$$ 7544 -272 -5381 8077 -5705 -10097 -7245 525 27088 2871 4646 -7129 -20625 4868
4738D868J0117j4175j5695j4860J6265N940m45l361m694J6002Q986K1618k354
$$ 4868 14985 810 -14885 -29745 -13480 -7540 -7985 -11346 -16040 -38 8948 30566 28212
4725B8212m813J2026P44j4694n549j5159j7461R442J0055k0609j8638J6861P682
$$ 28212 23399 35425 36169 21475 15926 767 -16694 -7252 2803 -17806 -36444 -19583 -11901
4712a1901M739K7503Q091j3570j2546j0052M771J487J1222N127m948j2732J7639
$$ -11901 -7162 20341 28432 14862 2316 -7736 -2965 -1478 9744 14871 9923 -2809 14830
4699A4830k6192n142M601J9398Q049n287j4589l623k2478j779L0763J3918J1429
$$ 14830 -11362 -16504 -11903 7495 15544 10257 -4332 -7955 -30433 -32212 -1449 12469 23898
4686B3898q390l4105k839K4952J8063m116M537j7487j2856r595j2052J2499O607
$$ 23898 15508 -18597 -21436 3516 21579 17463 22000 4513 -8343 -17938 -29990 -17491 -10884
4673a0884j5933k665P581J0570J2255m808j1461J0047J6671m101m4068N789k097
$$ -10884 -26817 -29482 -21901 -11331 924 -3884 -15345 -5298 11373 7272 -36796 -31007 -33104
4660c3104m83M909K3440M84J0338q902j0761j408k003J113o745M87j558J1200
$$ -33104 -33587 -28678 -5238 -4754 5584 -3318 -14079 -15487 -17490 -16377 -23122 -22635 -24193 -12993
4646a2993N289p861L71Q65N120n499n866P41j757k3429J21M4422J0794n995k48
$$ -12993 -7704 -15565 -15194 -14329 -9209 -14708 -20574 -19833 -21590 -45019 -44898 -476 10318 4323 4075
4631D075j7180j6378J099J8570m053j5614N935j317Q544L844o802J4940j7813
$$ 4075 -13105 -29483 -28384 -9814 -13867 -29481 -23546 -24863 -16319 -12475 -19277 -4337 -22150
4618b2150q705K2705R881j6235N793j6445J3681J1531r39K0959R067K3308j8510
$$ -22150 -30855 -8150 1731 -14504 -8711 -25156 -11475 56 -883 20076 29143 52451 33941
4605C3941k9013r961j5333J7313J6771k1189J598o428m817M942J1506J5916j4347
$$ 33941 4928 -5033 -20366 -3053 13718 -7471 -5873 -12301 -17118 -12176 -670 15246 899
4592H99l6121j0817K2741P020j3482o331R22L969j4746M087K2093K909J0418K028
$$ 899 -35222 -46039 -23298 -16278 -29760 -36091 -35169 -31200 -45946 -41859 -19766 -16857 -6439 -4411
4578d411k0968q846J7409J634n752q525J7351L2604Q113k1695l0676j4739M391
$$ -4411 -25379 -34225 -16816 -15182 -20934 -29459 -12108 20496 28609 6914 -23762 -38501 -34110
4565c4110j1421J2057R540J6830J3475q807r662r037M82N162J8475o504M813Q84
$$ -34110 -45531 -33474 -23934 -7104 6371 -2436 -12098 -21135 -20653 -15491 2984 -3520 1293 2177
4551B177n217O846J2411q291r738o921J673J7952K699j1456k605j270k0190J3058
$$ 2177 -3040 3806 16217 7926 -1812 -8733 -7060 10892 13591 2135 -470 -1740 -21930 -8872
4537h872P615p023N248k2946m0544J6040J3308J6496R716Q670J2778R972j7008
$$ -8872 -1257 -8280 -3032 -25978 -66522 -50482 -37174 -20678 -10962 -2292 10486 20458 3450
4524C450j4322j2345p752J3642J6834P530k609l227P917K068p161K572j2584j3894
$$ 3450 -10872 -23217 -30969 -17327 -493 7037 4428 1201 9118 11186 4025 6597 -5987 -19881
4510a9881J8185L8612K4732k8672k1779j7673k950J0473r159K588J7470J4560
$$ -19881 -1696 36916 61648 32976 11197 -6476 -9426 1047 -8112 -5524 11946 26506
4498B6506j2215l771j696l288m040J1047q63N225k7368n490J4205r282K1455R863
$$ 26506 14291 10520 8824 5536 1496 12543 11680 16905 -10463 -15953 -1748 -11030 10425 20288
4484B0288m192j2187k3676k0221j907R804J4554J2671k151K8706k4103j2560K70
$$ 20288 16096 3909 -19767 -39988 -41895 -32091 -17537 -4866 -7017 21689 -2414 -14974 -14704
4471a4704J5793J5396o157Q97j1065j6154J1517p050O756J0417K979J938k0107
$$ -14704 1089 16485 10328 11225 160 -15994 -4477 -11527 -4771 5646 8625 10563 -9544
4458i544j6723o357M834j3015j3508P22J0607K2760J9632M947j305O997J2214
$$ -9544 -26267 -32624 -27790 -40805 -54313 -53591 -42984 -20224 -592 4355 3050 10047 22261
4445B2261J2454p322k4079j5045j8282k0652J974K1798O303M891J7623K1499J3174
$$ 22261 34715 27393 3314 -11731 -30013 -50665 -48691 -26893 -20590 -15699 1924 23423 36597
4432C6597n232k219p122j402J9603L1978l228j8900k1748l4852q467K0800K9083
$$ 36597 31365 29146 22024 20622 40225 72203 68975 50075 28327 -6525 -14992 5808 34891
4419C4891J463j6473k1076k3261r42J7212p979l619K6739O485j1900p848k0061
$$ 34891 36354 19881 -1195 -24456 -25398 -8186 -16165 -19784 6955 13440 1540 -6308 -26369
4406b6369J359J9859N792p466k5340j0030P007K2035O359J9034J1771J9661k4948
$$ -26369 -25010 -5151 641 -6825 -32165 -42195 -35188 -13153 -6794 12240 24011 43672 18724
4393A8724m900p588k7702j2088L3826O659l060K123p535L18R958Q630O529K023
$$ 18724 13824 6236 -21466 -33554 272 6931 3871 5994 -1541 -1223 8735 17365 23894 25917
4379B5917j6938m498Q390l2319j8825l085K5026j010j090n036J0071j0319R305
$$ 25917 8979 4481 12871 -19448 -38273 -41358 -16332 -17342 -18432 -23468 -13397 -23716 -14411
4366a4411k656n205J8970J2117O649J2930l198j5184q31q811K504l833j3200q325
$$ -14411 -17067 -22272 -3302 8815 15464 28394 25196 10012 9181 370 2874 -959 -14159 -22484
4352b2484j119N348L0448N817p473l0474N860N587k0714j8196K0762K7105j3986
$$ -22484 -23603 -18255 12193 18010 10537 -19937 -14077 -8490 -29204 -47400 -26638 467 -13519
4339a3519k2837n847J0299J6897J7525O571N481J5938m969q831J3357j4747k5316
$$ -13519 -36356 -42203 -31904 -15007 2518 9089 14570 30508 25539 16708 30065 15318 -9998
4326i998j9435p224m679K5071j5158O97J6002K613K2608j1963k1694L488J6030
$$ -9998 -29433 -36657 -41336 -16265 -31423 -30726 -14724 -12111 10497 -1466 -23160 -19672 -3642
4313c642J5095n169p403J8275m069j7449m719Q545k3127k450K3574K7284m440
$$ -3642 11453 6284 -1119 17156 13087 -4362 -9081 -536 -23663 -26113 -2539 24745 20305
4300B0305o93l738k0918J3166M270j1034j6417K4092Q848j0675k8493k3396p872
$$ 20305 19612 15874 -5044 8122 12392 1358 -15059 9033 17881 7206 -21287 -44683 -52555
4287e2555P161J3414J9031K2559K4941J4304k7985l1940m630J2685K9970M782
$$ -52555 -45394 -31980 -12949 9610 34551 48855 20870 -11070 -15700 -3015 26955 31737
4275C1737j6143j4753K3886o085o374k0994r842k1596Q189J8445J7933J5779J5236
$$ 31737 15594 841 24727 18642 12268 -8726 -18568 -40164 -31975 -13530 4403 20182 35418
4262C5418j4717K283j4614r587j4934M483l73k2402M848o585j5122L789K2513
$$ 35418 20701 22984 8370 -1217 -16151 -11668 -12041 -34443 -29595 -36180 -51302 -47513 -25000
4249b5000j663j5398k949O162L80R027j1183k827p746J4000Q270J536p475L2081
$$ -25000 -26663 -42061 -45010 -38848 -38468 -29441 -40624 -43451 -51197 -37197 -28927 -27391 -34866 -2785
$$ [...]
##END NTUPLES=NMR SPECTRUM
##END=
