##TITLE=Analysis number 319515
Compound Code btb 04131
Project Code adrs
Chemist Name melford
##JCAMPDX= 6.0         $$ Bruker NMR JCAMP-DX V2.0
##DATA TYPE= NMR SPECTRUM
##DATA CLASS= NTUPLES
##ORIGIN= Bruker BioSpin GmbH
##OWNER= nmr
$$ XWIN-NMR		Version 3.5
$$ Wed May 17 14:20:44 2006 GMT Daylight Time (UT+1h)  MAYBRIDGE\nmr@NMR_250MHZ
##.OBSERVE FREQUENCY= 250.131544655141
##.OBSERVE NUCLEUS= ^1H
##.ACQUISITION MODE= SIMULTANEOUS (DQD)
##.ACQUISITION SCHEME= undefined
##.AVERAGES= 16
##.DIGITISER RES= 18
##SPECTROMETER/DATA SYSTEM= dpx250
##.PULSE SEQUENCE= zg30
##.SOLVENT NAME= CDCl3
##.SHIFT REFERENCE= (INTERNAL, CDCl3, 0, 16.522)
##AUDIT TRAIL= $$ (NUMBER, WHEN, WHO, WHERE, WHAT)
$$ ##TITLE= Audit trail, XWIN-NMR		Version 3.5
$$ ##JCAMPDX= 5.01
$$ ##ORIGIN= Bruker BioSpin GmbH
$$ ##OWNER= nmr
$$ C:\u/data/dgb/nmr/ADRS/4630/pdata/1/auditp.txt
$$ ##AUDIT TRAIL=  $$ (NUMBER, WHEN, WHO, WHERE, WHAT)
(   1,<2006-05-17 14:20:21.63 +100>,<MAYBRIDGE\nmr>,<NMR_250MHZ>,
      <created by zg, POWCHK disabled, PULCHK disabled
       configuration hash MD5:
       84 BC 41 DB A1 6E 1D 46 DA 25 12 A5 C1 ED C5 3A
       data hash MD5: 64K
       CD 82 5E 7C D0 D8 CF 20 3E E1 E8 56 A0 D5 DD DC>)
(   2,<2006-05-17 14:20:33.73 +100>,<MAYBRIDGE\nmr>,<NMR_250MHZ>,
      <Start of raw data processing
       ef LB = 0.3 FT_mod = 6 PKNL = 1 SI = 32K 
       data hash MD5: 32K
       0C B2 2D A4 D7 44 97 92 DC FE A1 CB 3B 70 41 96>)
(   3,<2006-05-17 14:20:35.38 +100>,<MAYBRIDGE\nmr>,<NMR_250MHZ>,
      <apk 
       data hash MD5: 32K
       6C DD AB C3 82 FB 2E 8F BD 6E 23 F3 17 98 09 4E>)
(   4,<2006-05-17 14:20:36.42 +100>,<MAYBRIDGE\nmr>,<NMR_250MHZ>,
      <abs ABSG = 5 
       data hash MD5: 32K
       F7 89 6B AE CE 4F 1D F3 49 DE 8F A2 FA 3B CF D6>)
$$ ##END=
$$ 
$$ hash MD5
$$ F5 36 8A 55 60 2A 15 25 2D 0A E9 7A CD EA 12 8F
##$RELAX= 
##$RELAX= 
##$RELAX= 
##$RELAX= 
##$RELAX= 
##$RELAX= 
##$RELAX= 
$$ Bruker specific parameters
$$ --------------------------
##$DU= <C:\u>
##$EXPNO= 4630
##$NAME= <ADRS>
##$PROCNO= 1
##$TYPE= <nmr>
##$USER= <dgb>
##$AMP= (0..31)
100 100 100 100 100 100 100 100 100 100 100 100 100 100 100 100 100 100 
100 100 100 100 100 100 100 100 100 100 100 100 100 100 
##$AQSEQ= 0
##$AQ_mod= 3
##$AUNM= <au_zg>
##$AUTOPOS= <41 >
##$BF1= 250.13
##$BF2= 250.13
##$BF3= 250.13
##$BF4= 250.13
##$BF5= 500.13
##$BF6= 500.13
##$BF7= 500.13
##$BF8= 500.13
##$BYTORDA= 1
##$CFDGTYP= 0
##$CFRGTYP= 5
##$CHEMSTR= <none>
##$CNST= (0..31)
1 1 145 1 1 1 1 1 1 1 1 1 1 1 1 1 1 1 1 1 1 1 1 1 1 1 1 1 1 1 1 1 
##$CPDPRG= <>
##$CPDPRG1= <>
##$CPDPRG2= <>
##$CPDPRG3= <>
##$CPDPRG4= <mlev>
##$CPDPRG5= <mlev>
##$CPDPRG6= <mlev>
##$CPDPRG7= <mlev>
##$CPDPRG8= <mlev>
##$CPDPRGB= <>
##$CPDPRGT= <>
##$D= (0..31)
0 1 0 0 0 0 0 0 0 0.06 0 0 0 0 0 0 0.0002 0 0 0 0 0 0 0 0 0 0 0 0 0 0 
0 
##$DATE= 1147872020
##$DBL= (0..7)
120 120 120 120 120 120 120 120 
##$DBP= (0..7)
150 150 150 150 150 150 150 150 
##$DBP07= 0
##$DBPNAM0= <>
##$DBPNAM1= <>
##$DBPNAM2= <>
$$ [...]
##$SUBNAM7= <"">
##$SUBNAM8= <"">
##$SUBNAM9= <"">
##$SW= 20.6930455092707
##$SWIBOX= (0..15)
0 0 3 0 0 0 0 0 0 0 0 0 0 0 0 0 
##$SW_h= 5175.983436853
##$TD= 65536
##$TD0= 1
##$TE= 295.16
##$TE2= 300
##$TE3= 300
##$TEG= 300
##$TL= (0..7)
0 120 120 120 120 120 120 120 
##$TP= (0..7)
150 150 150 150 150 150 150 150 
##$TP07= 0
##$TPNAME0= <>
##$TPNAME1= <>
##$TPNAME2= <>
##$TPNAME3= <>
##$TPNAME4= <>
##$TPNAME5= <>
##$TPNAME6= <>
##$TPNAME7= <>
##$TPOAL= (0..7)
0.5 0.5 0.5 0.5 0.5 0.5 0.5 0.5 
##$TPOFFS= (0..7)
0 0 0 0 0 0 0 0 
##$TUNHIN= 0
##$TUNHOUT= 0
##$TUNXOUT= 0
##$USERA1= <user>
##$USERA2= <user>
##$USERA3= <user>
##$USERA4= <user>
##$USERA5= <user>
##$V9= 5
##$VALIST= <valist>
##$VCLIST= <CCCCCCCCCCCCCCC>
##$VD= 0
##$VDLIST= <DDDDDDDDDDDDDDD>
##$VPLIST= <PPPPPPPPPPPPPPP>
##$VTLIST= <TTTTTTTTTTTTTTT>
##$WBST= 1024
##$WBSW= 4
##$XGAIN= (0..3)
0 0 0 0 
##$XL= 0
##$YL= 0
##$YMAX_a= 454593
##$YMIN_a= -448197
##$ZGOPTNS= <>
##$ZL1= 120
##$ZL2= 120
##$ZL3= 120
##$ZL4= 120
##$ABSF1= 16.522
##$ABSF2= -4.171173
##$ABSG= 5
##$ABSL= 3
##$ALPHA= 0
##$AQORDER= 0
##$ASSFAC= 0
##$ASSFACI= 0
##$ASSFACX= 0
##$ASSWID= 0
##$AUNMP= <proc_1d>
##$AZFE= 0.1
##$AZFW= 0.1
##$BCFW= 0
##$BC_mod= 0
##$BYTORDP= 0
##$COROFFS= 0
##$CY= 12.5
##$DATMOD= 1
##$DC= 0
##$DFILT= <>
##$DTYPP= 0
##$F1P= 14.0000005364418
##$F2P= -0.99999901652339
##$FCOR= 0.5
##$FTSIZE= 32768
##$FT_mod= 6
##$GAMMA= 0
##$GB= 0
##$INTBC= 1
##$INTSCL= 1
##$ISEN= 128
##$LB= 0.3
##$LEV0= 0
##$LPBIN= 0
##$MAXI= 10000
##$MC2= 0
##$MEAN= 0
##$ME_mod= 0
##$MI= 0
##$NCOEF= 0
##$NC_proc= -2
##$NLEV= 6
##$NOISF1= 0
##$NOISF2= 0
##$NSP= 0
##$NTH_PI= 0
##$NZP= 0
##$OFFSET= 16.522
##$PC= 1
##$PHC0= 165.8897
##$PHC1= 4.501503
##$PH_mod= 1
##$PKNL= yes
##$PPARMOD= 0
##$PSCAL= 4
##$PSIGN= 0
##$REVERSE= no
##$SF= 250.13
##$SI= 32768
##$SIGF1= 0
##$SIGF2= 0
##$SINO= 400
##$SIOLD= 32768
##$SREGLST= <1H.CDCl3>
##$SSB= 0
##$STSI= 32768
##$STSR= 0
##$SW_p= 5175.98343685301
##$SYMM= 0
##$S_DEV= 0
##$TDeff= 65536
##$TDoff= 0
##$TI= <Analysis number 999999
Compound Code 99
Book Reference 9
Project Code 9>
##$TILT= no
##$TM1= 0
##$TM2= 0
##$TOPLEV= 0
##$USERP1= <user>
##$USERP2= <user>
##$USERP3= <user>
##$USERP4= <user>
##$USERP5= <user>
##$WDW= 1
##$XDIM= 32768
##$YMAX_p= 281763471
##$YMIN_p= -80450
$$ End of Bruker specific parameters
$$ ---------------------------------
##NTUPLES= NMR SPECTRUM
##VAR_NAME=  FREQUENCY,     SPECTRUM/REAL,   SPECTRUM/IMAG
##SYMBOL=    X,             R,               I
##VAR_TYPE=  INDEPENDENT,   DEPENDENT,       DEPENDENT
##VAR_FORM=  AFFN,          ASDF,            ASDF
##VAR_DIM=   32768,         32768,           32768
##UNITS=     HZ,            ARBITRARY UNITS, ARBITRARY UNITS
##FACTOR=    0.157963299565203, 1,           1
##FIRST=     4132.6476996994, 0,             0
##LAST=      -1043.33573715361, 0,           0
##MIN=       -1043.33573715361, -80450,      0
##MAX=       4132.6476996994, 281763471,     0
$$ Real data points
##PAGE= N=1
##DATA TABLE= (X++(R..R)), XYDATA
$$ [...]
17112A9307k532R737P538o868r076J5568K2414Q766j955k5933J464j973r142P445
$$ 19307 16775 26512 34050 27182 18106 33674 56088 64854 62899 36966 38430 36457 27315 34760
17098C4760M137j0247O129M491O417K274j6094J6763N104p633q109K124k519n143
$$ 34760 38897 28650 34779 39270 45687 47961 31867 48630 53734 46101 37992 40116 37597 32454
17084C2454j543L795k265l930m001J1454n519j4507L769P456Q168K0071R057r838
$$ 32454 30911 34706 32441 28511 24510 35964 30445 15938 19707 27163 35331 55402 64459 54621
17070E4621m183P196Q354r813k332j5398q185J4374m24k0869j6255j667K4579
$$ 54621 50438 57634 65988 56175 53843 38445 30260 44634 44210 23341 7086 5419 29998
17057B9998J6302m38k753o602j4655j697P561N382q926K732K0795N317j8579j6768
$$ 29998 46300 45862 43109 36507 21852 20155 27716 33098 24172 26904 47699 53016 34437 17669
17043A7669j1005J756K4993J5479j4601j9298J813K5807j3258J30Q850k539K029
$$ 17669 6664 8420 33413 48892 34291 14993 16806 42613 29355 29485 38335 35796 37825
17030C7825L976p79N713O975l252N56p036j922P293r733N118k0507o861J3008
$$ 37825 41801 41022 46735 53710 50458 51014 43978 42056 49349 39616 44734 24227 17366 30374
17016C0374J136j0583m59J1343J1654m897o815N397J887l089q39J2821K0874m224
$$ 30374 31510 20927 20468 31811 43465 38568 31753 37150 39037 35948 35109 47930 68804 64580
17002F4580j0290k536N348j1215o902J0466k161r790N297R84J0407l949j3765
$$ 64580 54290 51754 57102 45887 38985 49451 47290 37500 42797 43781 54188 50239 36474
16989C6474L435J0382m331k158j4213p737p704P258J3098K29N315p806p187k05
$$ 36474 39909 50291 45960 43802 29589 21852 14148 21406 34504 34733 40048 32242 25055 24850
16975B4850r08l680J953L053K68R035m683K273j4943k6179O43K1618J8528M005
$$ 24850 23942 20262 22215 25268 25536 34571 29888 32161 17218 -8961 -8318 13300 31828 35833
16961C5833j7802m459M607K56j4737L222J5220J8102L142q796o298o659p506j018
$$ 35833 18031 13572 18179 18435 3698 6920 22140 40242 43384 34588 28290 21631 14125 13107
16947A3107O523j669l515Q695j3887j9643o518Q892J4604R754J3796P757l652
$$ 13107 19630 17961 14446 23141 9254 -10389 -16907 -8015 6589 16343 30139 37896 34244
16934C4244j4245n415R458L919K909m907o794J507K624O945m981o495j3037Q18
$$ 34244 19999 14584 24042 27961 30870 25963 19169 20676 23300 30245 25264 18769 5732 6550
16920F550r196J4952M914L458J9596N633j2594k0921q231j786J0439R669J3093
$$ 6550 -2646 12306 17220 20678 40274 45907 33313 12392 4161 2375 12814 22483 35576
16907C5576J5283l425o17p890j6150J121O619Q830M609m111K075n790j6679j4853
$$ 35576 50859 47434 46817 38927 22777 23898 30517 39347 43956 39845 41920 36130 19451 4598
16893D598j4851q948K849r1R915K3418j329p305K69N485m971j097J4536l233M073
$$ 4598 -10253 -19201 -16352 -16443 -6528 16890 15561 8256 8525 14010 9039 7942 22478 19245 23318
16878B3318p65j492n255p801Q296O213J0514j6997q190K1150o370k5368r995R129
$$ 23318 22553 21061 15806 8005 16301 22514 33028 16031 7841 28991 22621 -2747 -12742 -3613
16864c613J7679Q429j4428K2215K2178j0585j3710j434R4J1371J013p513k0951
$$ -3613 14066 22495 8067 30282 52460 41875 28165 26731 26825 38196 39209 31696 10745
16851A0745l393K3382J4439J0320o444j0055Q031M153j2925Q739l53k9582k7275
$$ 10745 7352 30734 45173 55493 49049 38994 47025 51178 38253 46992 46639 17057 -10218
16838a0218P589N835J3542J5505m993q874j8566N398l858j7356q835N598K3970
$$ -10218 -2629 3206 16748 32253 27260 18386 -180 5218 1360 -15996 -24831 -19233 4737
16825D737Q135J205k182K130M286j1669J065K5560p075L54o285K862j3918K969
$$ 4737 12872 14077 11895 14025 18311 6642 7707 33267 26192 26546 20261 23123 9205 12174
16811A2174N950P1J149n807n805r472J431J0548Q297K8154K624j6245k7175j5525
$$ 12174 18124 18195 19344 13537 7732 -1740 -309 10239 18536 46690 49314 33069 5894 -9631
16797i631M733P252J3924p055l0437j4548K4125K3452P16k649j0085j9885j3054
$$ -9631 -4898 2354 16278 9223 -21214 -35762 -11637 11815 12531 9882 -203 -20088 -33142
16784c3142P437R104J3251n894J2511P420l772p154j8398q215L1718Q524q93K398
$$ -33142 -25705 -16601 -3350 -9244 3267 10687 6915 -239 -18637 -26852 4866 13390 12497 14895
16770A4895N95m54o671n899j0804N080K645l85m575Q581J4344J0857P872M107
$$ 14895 15490 15036 8365 2466 -8338 -3258 -613 -998 -5573 3008 17352 28209 36081 40188
16756D0188Q303N773l879k1676j7497k771J720M474P861J4872q480k4682j1648
$$ 40188 48491 54264 50385 28709 11212 8441 10161 14635 22496 37368 28888 4206 -7442
16743g442J0917K643r040j0164j232K2934K6021n47m480j2903O96P460j8231j3572
$$ -7442 3475 6118 -2922 -13086 -14318 8616 34637 34090 29610 16707 17403 24863 6632 -6940
16729f940J3802K5468p03j6991j7672j5268m672R138n81O596K0620R765J2590
$$ -6940 6862 32330 31627 14636 -3036 -18304 -22976 -13838 -14419 -7823 12797 22562 35152
16716C5152J0691j2801m319j6721k277o811m286j2800o54N920j4064J0818M2662
$$ 35152 45843 33042 28723 12002 9725 2914 -1372 -14172 -14826 -8906 -22970 -12152 30510
16703C0510L5135o925k3551k6095j5606J0304k392p005r918j1355J0778J1827
$$ 30510 65645 58720 35169 9074 -6532 3772 1380 -5625 -15543 -26898 -16120 -4293
16691d293R313J3780L872j1090j416o874J3567M120j3638m038r661o754N303J1290
$$ -4293 5020 18800 22672 11582 10166 3292 16859 20979 7341 3303 -6358 -13112 -7809 3481
16677C481Q632r861n541N138Q839K672N079j0437r834j6216N89J5786K4730J089
$$ 3481 12113 2252 -3289 1849 10688 13360 18439 8002 -1832 -18048 -17459 -1673 23057 24146
16663B4146j1341J82n384L895q59L721q941N342N142k2402r085J213K083J4333
$$ 24146 12805 12987 7603 11498 10639 14360 5419 10761 15903 -6499 -15584 -14371 -12288 2045
16649B045j247J1311j615k349P890m793j0308n547l162l422n972o90K202J3374
$$ 2045 798 12109 10494 8145 16035 11242 934 -4613 -7775 -11197 -17169 -17859 -15657 -2283
16635b283R206J772n606n893O653J6520J2015O808k0231k4996J406J3017N176
$$ -2283 6923 8695 3089 -2804 3849 20369 32384 39192 18961 -6035 -4629 8388 13564
16622A3564P739k320j594L014L89k3574M323m014j4786J7866J002k17m71l42L347
$$ 13564 21303 18983 17389 20403 20792 -2782 1541 -2473 -17259 607 1609 1392 921 579 3926
16607C926j6305p693M393J246J2898J4813J4127J040j4780o250n879o551J4715
$$ 3926 -12379 -20072 -15679 -14433 -1535 13278 27405 28445 13665 7415 1536 -5015 9700
16594I700q040O291K1407K2912j2794j4786j6476j4922Q69J814o01J4710J936
$$ 9700 1660 7951 29358 52270 39476 24690 8214 -6708 -5839 -4025 -4626 10084 12020
16581A2020J478Q582L387p606j778r911o943o681p350J8441P467j0399j392j216
$$ 12020 13498 22080 25467 17861 16083 6172 -771 -7452 -14802 3639 11106 707 -685 -1901
16567a901K944K1803N775r570n550J8607j397j2031l0697j1817N216J2304P499
$$ -1901 1043 22846 28621 19051 13501 32108 30711 18680 -12017 -23834 -18618 -6314 1185
16554A185o52K576J1125l840r998j6404j471K4674L151R88J1707P672O835p348
$$ 1185 533 3109 14234 10394 396 -16008 -17479 7195 10346 11334 23041 30713 37548 30200
16540C0200j0662M344j9108j0577Q204J21k388Q700Q061P98j7655l1305J3673
$$ 30200 19538 23882 4774 -5803 2401 2522 134 8834 16895 17693 38 -31267 -17594
16527a7594J8847K141J3254l17r603j2205m966p8J2554j3193p660O423P328J2818
$$ -17594 1253 3394 16648 16331 6728 -5477 -10443 -10521 2033 -11160 -18820 -12397 -5069 7749
16513G749J0249J6485J0695k0285o956k31m285R839m794o659j7093J3448L228
$$ 7749 17998 34483 45178 24893 17937 17706 13421 23260 18466 11807 -5286 8162 11390
16500A1390p564j984O709J2090J0128J1306K446j0103j9373j9084K73K925j896
$$ 11390 3826 1842 8551 20641 30769 42075 44521 34418 15045 -4039 -3766 -841 -2737
16487b737k537j6121L840L986k3148J3621Q070P264J0683J0779J7117j8662k2465
$$ -2737 -5274 -21395 -17555 -13569 -36717 -23096 -15026 -7762 2921 13700 30817 12155 -10310
16474a0310j930K397J2206j2480K134J6278p0q681J6623J7331p445K669J0295
$$ -10310 -12240 -9843 2363 -10117 -7983 8295 8225 -456 16167 33498 26053 28722 39017
16461C9017K251k828k1161j4825N783j540l348J3668J087N257r492K173Q716j7934
$$ 39017 41268 38440 17279 2454 8237 6697 3349 17017 18104 23361 13869 16042 24758 6824
16447F824k4348j6189J2863J1168N234j9404j2230Q710K7354J5375k0683N88J6786
$$ 6824 -17524 -33713 -20850 -9682 -4448 -23852 -36082 -27372 -18 15357 -5326 -4738 12048
16434A2048l048m587p658Q721M082n832J419O402o478j5023j3027M359k263J4260
$$ 12048 9000 4413 -3245 5476 9558 3726 5145 11547 5069 -9954 -22981 -18622 -20885 -6625
16420f625r267q772R656J6053J2029J816Q046N156m982p513J33N153k0719r93
$$ -6625 -15892 -24664 -15008 1045 13074 14890 22936 28092 23110 15597 15730 20883 164 -829
16406h29q9J1115N440n021l286r1m113J2206J329r37j3803j1521r066K1794J5708
$$ -829 -918 10197 15637 10616 7330 7239 3126 15332 16661 15724 1921 -9600 -18666 3128 18836
16391A8836J57l62j1802k534L0413j106j5230p042L848n54o319P137P223o822
$$ 18836 18993 18631 6829 4295 34708 33602 18372 11330 15178 14624 8305 15442 22665 15843
16377A5843k0119n555j854N508J3376J0639o152J2060o277p127k7651n77J6195
$$ 15843 -4276 -9831 -11685 -6177 7199 17838 11686 23746 17469 10342 -17309 -17886 -1691
16364a691J1311l432j2168q150r637q90o414R601j251r06K614O399J8400J3514
$$ -1691 9620 6188 -5980 -14130 -23767 -24657 -31071 -21470 -22721 -23627 -21013 -14614 3786 17300
16350A7300j0089J356j8566r647K1804M492n323j3469L945l670M903j7543j6437
$$ 17300 7211 8567 -9999 -19646 2158 6650 1327 -12142 -8197 -11867 -6964 -24507 -40944
16337d0944J0277K8627K4063l0468j5458J4315J947M425J014j2652P805K5027
$$ -40944 -30667 -2040 22023 -8445 -23903 -9588 -7641 -3216 -2202 -14854 -7049 17978
16325A7978o260j8157k299j0108r81O182M955J1093r571j8219Q537Q823m167k815
$$ 17978 11718 -6439 -8738 -18846 -19827 -13645 -8690 2403 -7168 -25387 -16850 -8027 -12194 -15009
16311a5009J565n056K3558q223k2357j0540R150K997J7875J6880p438j0142J0000
$$ -15009 -13444 -18500 5058 -3165 -25522 -36062 -26912 -23915 -6040 10840 3402 -6740 3260
16298C260M766n396j574O333k880k797R308j47j0370K233K678j4387p287J1647
$$ 3260 8026 2630 1056 7389 4509 1712 11020 10873 503 2736 5414 -8973 -16260 -4613
16284d613L929M648P099O823n63L112q765j0012l283P651L197J2597j819k2264
$$ -4613 -684 3964 11063 17886 17323 20435 11670 1658 -1625 6026 9223 21820 20001 -2263
16270b263L211p452J2131j1864k5444M424J9681J274q095K653M498q729K624N905
$$ -2263 948 -6504 5627 -6237 -31681 -27257 -7576 -6302 -14397 -11744 -7246 -15975 -13351 -7446
16256g446j4592p222k381J4005R317j1978j1748m760j305J5242O917K970K3293
$$ -7446 -22038 -29260 -31641 -17636 -8319 -20297 -32045 -36805 -38110 -22868 -15951 -12981 10312
16243A0312J1083N830r135k0565M814n48n82n953M834j4733j0209K3413J5364
$$ 10312 21395 27225 18090 -2475 2339 1791 1209 -4744 90 -14643 -24852 -1439 13925
16230A3925j5598j7451j8117N770J1124K1926P961j3240q288j9k949P193R07o294
$$ 13925 -1673 -19124 -37241 -31471 -20347 1579 9540 -3700 -11988 -12007 -14956 -7763 -6856 -13150
16216a3150j4878L758M315k267N708L23J3243N090j4293j223j0123R480K16k47
$$ -13150 -28028 -24270 -19955 -22222 -16514 -16191 -2948 2142 -12151 -13374 -23497 -14017 -13801 -14048
16202a4048K211o549J8719K0744n906J768j7396j0955K611P49M625M215q824q678
$$ -14048 -11837 -18386 333 21077 15171 16939 -457 -11412 -8801 -8052 -3427 788 -8036 -16714
16188a6714N730j566m564j4569o691M043J2353J2869J4087n44M136j8149q993
$$ -16714 -10984 -12550 -17114 -31683 -38374 -34331 -21978 -9109 4978 4434 8570 -9579 -18572
16175a8572M606m405m037r137P841J0899n742j5724N426R929l11O537K0087k009
$$ -18572 -13966 -18371 -22408 -31545 -23704 -12805 -18547 -34271 -28845 -18916 -19227 -12690 7397 5388
16161E388J3154M168j3837j3339o119J8453J6030J55j4147k0061M660R279j3703
$$ 5388 18542 22710 8873 -4466 -10585 7868 23898 24053 9906 -10155 -5495 3784 -9919
16148i919o380l806j6315K430K8283K2633J856j8131n349n248J416k1249J1795
$$ -9919 -16299 -20105 -36420 -33990 -5707 16926 18782 651 -4698 -9946 -8530 -29779 -17984
16135a7984P812l205j2806J26R757N459J280j059Q404q387q395j293P792J5728
$$ -17984 -10172 -13377 -26183 -26057 -16300 -10841 -9561 -10620 -2216 -10603 -18998 -20291 -12499 3229
16121C229J6798M58o424r847K690J1301j611j0983j0048L866R383J7293J35j0467
$$ 3229 20027 20485 14061 4214 6904 18205 16594 5611 -4437 -571 8812 26105 26240 15773
16107A5773n343K2105L028j5622q706j8559k983J3805k88Q337N881q550p226l748
$$ 15773 10430 32535 35563 19941 11235 -7324 -10307 3498 3210 11547 17428 8878 1652 -2096
16093b096q164j1858O674J2626R796l179j522P152l043o223n292o547N667m86
$$ -2096 -10260 -22118 -15444 -2818 6978 3799 2277 9429 6386 163 -5129 -11676 -6009 -6495
16079f495J3027Q279j7873p605m243L126M682j4218p536J5142K3604J4116m127
$$ -6495 6532 14811 -3062 -10667 -14910 -11784 -7102 -21320 -28856 -13714 9890 24006 19879
16066A9879r063j1882o488O494k870J4392Q433k0366j2135J475J322R715j6116
$$ 19879 10816 -1066 -7554 -1060 -3930 10462 18895 -1471 -13606 -12131 -10809 -1094 -17210
16053a7210R509m138J3092j1288P278J763J6m10m864J2210Q348j2200l597J3162
$$ -17210 -7701 -11839 1253 -10035 -2757 -994 -978 -1388 -6252 5958 14306 2106 -1491 11671
16039A1671N440j580O577k1920k514J842j4338J1914l797p805M726M989J3201
$$ 11671 17111 15531 22108 188 -2326 -484 -14822 -2908 -6705 -14510 -9784 -4795 8406
16026H406j6623j1726l642n654R078J630N732M597J7854K1014p088J0985n0r895
$$ 8406 -8217 -19943 -23585 -29239 -20161 -18531 -12799 -8202 9652 30666 23578 34563 34513 24618
16012B4618l1997L200J7634O28j5121k8113k842K484M338R468J5798r660r412
$$ 24618 -7379 -4179 13455 14083 -1038 -29151 -31993 -29509 -25171 -15703 95 -9565 -18977
15999a8977J327l775L248N892O018N107P66o611L887L49N578o348O306K689N016
$$ -18977 -17650 -21425 -18177 -12285 -6267 -1160 -394 -7005 -3118 -2769 2809 -3539 2767 5456 10472
15984A0472n042L901k591M684J0834p264r26n973j9323j0876j6790P92l686K824
$$ 10472 5430 9331 6740 11424 22258 14994 14068 8095 -11228 -22104 -38894 -38102 -41788 -38964
15970c8964J4198J0267o146j8441O781J0585K14J1407J6700M426N685j1817m958
$$ -38964 -24766 -14499 -20645 -39086 -32305 -21720 -21506 -10099 6601 11027 16712 4895 -63
15957f3K320M756l728k1422n713J1982R282m854o985j9092J5092K1370n844j4066
$$ -63 2257 7013 3285 -18137 -23850 -11868 -2586 -7440 -14425 -33517 -18425 2945 -2899 -16965
15943a6965j382P717J6250p239r543O049j679m369K9887J4052j8319r285r86J1189
$$ -16965 -18347 -10630 5620 -1619 -11162 -5113 -6792 -11161 18726 32778 14459 5174 4188 15377
15929A5377P186m178j1883j6409k760K1827N771J774l560k788o223O32j797J1900
$$ 15377 22563 18385 6502 -9907 -12667 9160 14931 16705 13145 10357 4134 4766 2969 14869
15915A4869K148j9033l213K256L381R093Q08M062r647j1001l65K342q414M469
$$ 14869 17017 -2016 -5229 -2973 408 9501 10309 14371 4724 -6277 -6642 -4300 -12714 -8245
15901h245J467K612J5875k029n755j2388k2510l2646j6831M929J7224J5638R712
$$ -8245 -6778 -4166 11709 9680 3925 -8463 -30973 -63619 -80450 -75521 -58297 -42659 -32947
15888c2947J2504J5362K603l97J6250R191n545j1889O510n152L504k869o061j3733
$$ -32947 -20443 -5081 -2478 -2875 13375 22566 17021 5132 11642 6490 9994 7125 1064 -12669
15874a2669p038R821j4458p558J3028J4995j066J2074j7884o289j0766j0134m374
$$ -12669 -19707 -9886 -24344 -31902 -18874 -3879 -4945 7129 -10755 -17044 -27810 -37944 -42318
15861d2318J3939J0568m902L952K2208l264m740O111r253j1207j1754n039k90
$$ -42318 -28379 -17811 -22713 -18761 3447 183 -4557 1554 -7699 -18906 -30660 -35699 -35989
15848c5989R434K0108k516k759J4731R666K006K443j6053L120N862J5749o409
$$ -35989 -26555 -6447 -8963 -11722 3009 12675 14681 17124 1071 4191 10053 25802 19393
15835A9393j9477j4289L661k678N75K0768N92k3042P257K9881o652k458J1447
$$ 19393 -84 -14373 -10712 -13390 -12815 7953 8545 -14497 -7240 22641 15989 13531 24978
15822B4978l407j2180j7494O244j3644p145J8421Q577k334O533m041m387P310
$$ 24978 21571 9391 -8103 -1859 -15503 -22648 -4227 4350 2016 8549 4508 121 7431
15809G431O506j1483p863K023o995k0618J2379J4277N990N967P718j57q005o535
$$ 7431 13937 2454 -5409 -3386 -10381 -30999 -18620 -4343 1647 7614 15332 15175 7170 635
15795F35Q91J0661r087n624K371P369o144N611O185j4629j2357n232L048K3208
$$ 635 1526 12187 3100 -2524 -153 7216 1072 6683 12868 -1761 -14118 -19350 -16302 6906
15781F906N852o745J3169n344r576m917J9192k2484k4264R549J4141K184j597
$$ 6906 12758 6013 19182 13838 4262 -655 18537 -3947 -28211 -18662 -4521 -2337 -3934
15768c934L065K2397l36m437k2644j0747J9619J3385M512Q097k4519k7929P261
$$ -3934 -869 21528 21192 16755 -5889 -16636 2983 16368 20880 28977 4458 -23471 -16210
15755a6210J7441o045J0395J0869l856q940Q037l267k861L264l128J560l689n396
$$ -16210 1231 -4814 5581 16450 12594 3654 11691 8424 5563 8827 5699 7259 3570 -1826
15741a826j6366R757k757Q609J616M243j735p200p01J5285Q966j8125j7277M214
$$ -1826 -18192 -8435 -11192 -2583 -967 3276 1541 -5659 -6360 8925 17891 -234 -17511 -13297
15727a3297q812N434J1020O769j4946j5872N059J3289J3224J0449j5537j1367
$$ -13297 -22109 -16675 -5655 1114 -13832 -29704 -24645 -11356 1868 12317 -3220 -14587
15715a4587K595M75R066J0777p35L014M228j7995m391J6196j4767o85q320q371
$$ -14587 -11992 -11517 -2451 8326 7591 10605 14833 -3162 -7553 8643 -6124 -6809 -15129 -23500
15701b3500N242K0336R240J274K4738k236k739L686k0696j2205j1359J099J1172
$$ -23500 -18258 2078 11318 12592 37330 35094 32355 36041 15345 3140 -8219 -7120 4052
15688D052o399k511Q317L370K039j7630K302K0948K582k6728M607K920N896K414
$$ 4052 -2347 -4858 3459 6829 8868 -8762 -6460 14488 17070 -9658 -5051 -2131 3765 6179
15674F179p356j2175m909N097Q200L577j1761K5187P080j8444O112K575O185j0057
$$ 6179 -1177 -13352 -18261 -13164 -4964 -1387 -13148 12039 19119 675 6787 9362 15547 5490
15660E490j3335J812J6637n83j4050j0408j1492J258N167j1169k312Q759J1118
$$ 5490 -7845 -6033 10604 10021 -4029 -14437 -25929 -24671 -19504 -30673 -32985 -24226 -13108
15647a3108L634n339j724J3196K0595n48j8060o265M108l428L228J6553l611q640
$$ -13108 -9474 -14813 -16537 -3341 17254 16706 -1354 -7619 -3511 -6939 -3711 12842 9231 591
15633E91j0117J877O639l196o538J3877k979j3250R251J3300j0081J2560M168
$$ 591 -9526 -7649 -1010 -4206 -10744 3133 154 -13096 -3845 9455 -626 11934 16102
15620A6102j6203R947j6171j1511K227O572J1994P690M413J253l969q680L967
$$ 16102 -101 9846 -6325 -17836 -15609 -9037 2957 10647 15060 16313 12344 3664 7631
15607G631K678l425O572M096O173l909r958K666L353m98j7684j2721o90j0446
$$ 7631 10309 6884 13456 17552 23725 19816 9858 12524 15877 15379 -2305 -15026 -15716 -26162
15593b6162P945J2215J0251K717r97n538o110l523j1461J3488K2009J2698J2223
$$ -26162 -18217 -6002 4249 6966 5969 431 -5679 -9202 -20663 -7175 14834 27532 39755
15580C9755q65j4294k1877O974J5481o653m54j3993j066N643J0849j22l720p250
$$ 39755 38890 24596 2719 9693 25174 18521 18067 4074 3008 8651 19500 19378 15658 8408
15566H408n272K273L808J0710k462L916j161j2259K098M081p39p170q790K848
$$ 8408 3136 5409 9217 19927 17465 21381 20220 7961 10059 14140 13401 6231 -2559 289
15552B89R71o82M51m056J6149N979k468k946k672p725L80M519J5025J4367j3744
$$ 289 1260 578 1029 -3027 13122 19101 16633 13687 11015 3290 3670 8189 23214 37581 23837
15537B3837k016Q744k3024m050j202j535K732L323n831K052l524Q320j5218j0680
$$ 23837 21821 30565 7541 3491 2289 754 3486 6809 978 3030 -494 7826 -7392 -18072
15523a8072m941J0119N125K173J3589J001l51p926L122o460Q79J2596j777j5037
$$ -18072 -23013 -12894 -7769 -5596 7993 8994 8643 717 3839 -2621 -1742 10854 9077 -5960
15509e960p150p781K097L422N129O662j7179J0118J0726R695o220j6942J082R068
$$ -5960 -13110 -20891 -18794 -15372 -10243 -3581 -20760 -10642 84 9779 3559 -13383 -12301 -3233
15495c233L893P476j1194j7321P208j625k1353l523K2077J1395J3011N707j2886
$$ -3233 660 8136 -3058 -20379 -13171 -14796 -36149 -39672 -17595 -6200 6811 12518 -368
15482c68j3453j1821j0315j130K0762J5467j0752J3927J5027j4485k392R273M295
$$ -368 -13821 -25642 -35957 -37087 -16325 -858 -11610 2317 17344 2859 467 9740 14035
15469A4035r667j3005O936n825J1006p85k0120k478J792J1193m16J3287m47p485
$$ 14035 4368 -8637 -1701 -7526 3480 2695 -17425 -19903 -18111 -6918 -7334 5953 5506 -1979
15455a979J079J428k1014q040O284j358J0508N103o111n328n372P499J8115q91
$$ -1979 -900 528 -20486 -28526 -22242 -23600 -13092 -7989 -14100 -19428 -24800 -17301 814 -77
15441g7J237K307O172P06k0219L257M867L606r106p021O573J1327r69M123j0112
$$ -77 1160 3467 9639 10345 -9874 -6617 -1750 1856 -7250 -14271 -7698 3629 2660 6783 -3329
15426c329j3728o44q152j0272J9523K942p414J521J2991r889j4714n343j009L82
$$ -3329 -17057 -17701 -25853 -36125 -16602 -13660 -21074 -19553 -6562 -16451 -31165 -36508 -37517 -37135
15412c7135r075N044J3795M300N731k096J3734m155m630P599j0424j4693K456
$$ -37135 -46210 -41166 -27371 -23071 -17340 -19436 -5702 -9857 -14487 -6888 -17312 -32005 -29549
15399b9549O043O702N142k842o452J001J1549m850K822J5575J2715j8866n758
$$ -29549 -23506 -16804 -11662 -14504 -20956 -19955 -8406 -13256 -10434 5141 17856 -1010 -6768
15386f768r300k731r506k850J6221Q330J0499r977J371O79j1430J3058N84o329
$$ -6768 -16068 -18799 -28305 -31155 -14934 -6604 3895 -6082 -4711 -4032 -15462 -2404 -1820 -8149
15372h149J8107J0953M37o066n799j2482J0109J451r712k2145p219J767J9232
$$ -8149 9958 20911 21348 15282 9483 -2999 7110 8561 -1151 -23296 -30515 -28748 -9516
15359i516L913j6640o250L653k438J2345K861K124q640o923K0603R160j2030k205
$$ -9516 -5603 -22243 -28493 -24840 -27278 -14933 -12072 -9948 -18588 -25511 -4908 4252 -7778 -9983
15345i983P128L326L73M033N736n678m388q042k811J0126P20q186o496p041p670
$$ -9983 -2855 471 844 4877 10613 4935 547 -7495 -10306 -180 540 -7646 -14142 -21183 -28853
15330b8853k546N479L289o857M946J1951L635k094O199J1286k367j0675r563j9459
$$ -28853 -31399 -25920 -22631 -29488 -24542 -12591 -8956 -11050 -4851 6435 4068 -6607 -16170 -35629
15316c5629k938J2015Q542J5348k113J181Q061k202o083j331l687N421Q008N612
$$ -35629 -38567 -26552 -18010 -2662 -4775 -3594 4467 2265 -3818 -5149 -8836 -3415 4593 10205
15302A0205N453j0260n993j9623R180R878M142J2913r934r151p859k913J0148
$$ 10205 15658 5398 -595 -20218 -11038 -1160 2982 15895 5961 -3190 -11049 -13962 -3814
15289c814n564j294R297N776m159j8880j348o237j548m142J357K0268J2255J2987
$$ -3814 -9378 -10672 -1375 4401 242 -18638 -19986 -26223 -27771 -31913 -30556 -10288 1967 14954
15275A4954Q264j3677k4781n039J2344K2886K077j8040j7289R70j019m68J5570
$$ 14954 23218 9541 -15240 -20279 -7935 14951 17028 -1012 -18301 -17331 -18350 -18818 -3248
15262c248r876k967j0827L808q014J809M780l254Q776J8266q825J8149K775p940
$$ -3248 -13124 -16091 -26918 -23110 -31124 -29315 -24535 -27789 -19013 -747 -9572 8577 11352 3412
15248C412m497n257j2023n578q438m098P850K5435J0950o580J5417J685P217j5534
$$ 3412 -1085 -6342 -18365 -23943 -32381 -36479 -28629 -3194 7756 1176 16593 18278 25495 9961
15234I961k0149N326O02P77N798L738r262j0871l519K779J0273j3561j32K1918
$$ 9961 -10188 -4862 -4260 -3483 2315 6053 -3209 -14080 -17599 -14820 -4547 -18108 -18240 3678
15220C678J086k462j1602r359q116L999J9650O498Q279J7712N230j8j973j770
$$ 3678 4764 2302 -9300 -18659 -26775 -22776 -3126 3372 11651 29363 34593 34575 32602 30832
15206C0832J0083j5193j6784j463r981k321j636j2649o440J4563l490m633R854
$$ 30832 40915 25722 8938 7475 -2506 -4827 -6463 -19112 -25552 -10989 -14479 -19112 -9258
15193i258K1027O927l096j6161J9922p156j0967n817o049l134J2768J0039l338
$$ -9258 11769 18696 15600 -561 19361 12205 1238 -4579 -10628 -13762 -994 9045 5707
15180E707k133R19j695j4809R211J3972J5812l398j5034k5967r589J1429J7314
$$ 5707 3574 4493 2798 -12011 -2800 11172 26984 23586 8552 -17415 -27004 -15575 1739
15167A739M938j1977j2412J1591J2598n439r704P04N096o307N983l111j1350j5892
$$ 1739 6677 -5300 -17712 -6121 6477 1038 -8666 -7962 -2866 -9173 -3190 -6301 -17651 -33543
15153c3543J732K0906p390J204J0906J1573l177j1101j267l388j7943j9279J3693
$$ -33543 -31811 -10905 -18295 -17091 -6185 5388 2211 -8890 -10157 -13545 -31488 -50767 -37074
15140c7074J3535J2309K0461O211k6029k4566K714J5814R763J2522J3768j6252
$$ -37074 -23539 -11230 9231 15442 -10587 -35153 -32439 -16625 -6862 5660 19428 3176
15128C176q851J929j2711j517J2705K2971L809o197j7886j4977l6J7259L0241
$$ 3176 -5675 -3746 -16457 -17974 -5269 17702 21511 15314 -2572 -17549 -17585 -326 29915
15115B9915J86k7605J330j7697J151J5381P952p63l797K0767o243n677j0031k013
$$ 29915 30101 2496 3826 -13871 -12720 2661 10613 9850 6053 26820 20577 14900 4869 2856
15101B856P270j721n472O987p739l620j165K381N148k350j0261m330J7451p378
$$ 2856 10126 8405 2933 9920 2181 -1439 -2604 -223 4925 2575 -7686 -12016 5435 -1943
15087a943J0741J1666k188m373J0203l766j7428M956O25o295J138P270J0931j1401
$$ -1943 8798 20464 18276 13903 24106 20340 2912 7868 8493 2198 3336 10606 21537 10136
15073A0136k2015K003L788L502J1654O251M778R857j4762k3170k5376N943M1798
$$ 10136 -11879 -9876 -6088 -2586 9068 15319 20097 29954 15192 -7978 -33354 -27411 14387
15060A4387K652r953l264j606j0116q905j5085J239O890Q821J3707o007q275j5090
$$ 14387 17039 7086 3822 2216 -7900 -16805 -31890 -30651 -23761 -14940 -1233 -7240 -15515 -30605
15046c0605m184J0866K0996J7084r014m932J018q623k441J1028J4396R664p055
$$ -30605 -34789 -23923 -2927 14157 5143 211 1229 -7394 -9835 1193 15589 25253 18198
15033A8198j9007J8417j4366m229n171k3968J40K1297J2323N188J4986j6070k2207
$$ 18198 -809 17608 3242 -987 -6158 -30126 -29986 -8689 3634 8822 23808 7738 -14469
15020a4469j5957J3510J637J7262L0119j1589j5240l016p574J1959L882j5368
$$ -14469 -30426 -16916 -15279 1983 32102 20513 5273 2257 -5317 6642 10524 -4844
15008d844m377J8687k93l5390o772J0746K1439J8722k9958m325J524P28J2761
$$ -4844 -9221 9466 9173 -26217 -32989 -22243 -804 17918 -12040 -16365 -14841 -14113 -1352
14995a352O577p440q369q842k866R908m326J770K6018P246j5847r650O176l522
$$ -1352 5225 -2215 -10584 -19426 -22292 -12384 -16710 -14940 11078 18324 2477 -7173 -997 -4519
14981d519N68K779j4576r292O271J3385j5714K925j4137n658J9050n947n257O479
$$ -4519 -3951 -1172 -15748 -25040 -18769 -5384 -21098 -18173 -32310 -37968 -18918 -24865 -30122 -23643
14967b3643L027n896J9564K2969J702j108N070l252R968n833q064q408l305j4165
$$ -23643 -20616 -26512 -6948 16021 17723 16615 21685 18433 28401 22568 14504 6096 2791 -11374
14953a1374K606l879r381J0232M598j6879r150j6140R115K3847J9391L442O351
$$ -11374 -8768 -12647 -22028 -11796 -7198 -24077 -33227 -49367 -40252 -16405 2986 6428 12779
14940A2779J2156L803j9766j92j4247j0520o051m464O356Q992K986o908m721J0243
$$ 12779 24935 28738 8972 8780 -5467 -15987 -22038 -26502 -20146 -11154 -8168 -15076 -19797 -9554
14926i554P5m847J0559o866p282j1616L160j736J7049J2805J6934j2755m153j884
$$ -9554 -9479 -14326 -3767 -10633 -17915 -29531 -26371 -28107 -11058 1747 18681 5926 1773 -111
14912a11n431r973n784J15q874j4972K1358K0672M748j5691k4825J4098K2018
$$ -111 -5542 -15515 -21299 -21184 -30058 -45030 -23672 -3000 1748 -13943 -38768 -24670 -2652
14899b652k3792j2619J1706m589l593m82m105J781N011K0348J6510o045K518Q245
$$ -2652 -26444 -39063 -27357 -31946 -35539 -36021 -40126 -38345 -33334 -12986 3524 -2521 -3 8242
14885H242j1636J0130P009Q57Q546J3397j3312j975j4414j1951j6604k364J3128
$$ 8242 -3394 6736 13745 14602 23148 36545 23233 21258 6844 -5107 -21711 -24075 -10947
14872a0947K1717J0424k532j3022k4726q510k488l52J3431P801j9741o320J5775
$$ -10947 10770 21194 18662 5640 -19086 -27596 -30084 -30436 -17005 -9204 -28945 -35265 -19490
14859a9490O106o896Q470j2795j104N121l191j741k271L742k161m345K544R041
$$ -19490 -13384 -20280 -11810 -24605 -25709 -20588 -23779 -25520 -27791 -24049 -26210 -30555 -28011 -18970
14845a8970K4246J1639n666j9241M931p623K423m875P020J1579L732l808j9907
$$ -18970 5276 16915 11249 -7992 -3061 -10684 -8261 -13136 -6116 5463 9195 5387 -14520
14832a4520p449K8304J1677M455m245j0665q019r198q012N557K227J0270J515
$$ -14520 -21969 6335 18012 22467 18222 7557 -462 -9660 -17672 -12115 -9888 382 1897
14819A897R91j3973j0552O178J4431j2434K175m540o103j378J133n319j53J0250
$$ 1897 2888 -11085 -21637 -15459 -1028 -13462 -11287 -15827 -21930 -23308 -22175 -27494 -27647 -17397
14805a7397K821N056J2042J6132j0416j5025n986Q102P542O884r778k1279j899
$$ -17397 -14576 -9520 2522 18654 8238 -6787 -12773 -4671 2871 9755 -23 -21302 -23201
14792b3201M840M845J705J9653R222K526p914p107O120P792R141k8473k1788O864
$$ -23201 -18361 -13516 -11811 7842 17064 19590 11676 4569 10689 18481 27622 -851 -22639 -15775
14778a5775J6268N274L078l509p156Q663j408J1575M010r791r445m660j2106m992
$$ -15775 493 5767 8845 5336 -1820 6843 5435 17010 21020 11229 1784 -2876 -14982 -19974
14764a9974k911K5010O129R53J6796l995k397J010k0124k0092M692N499O88K862
$$ -19974 -22885 2125 8254 9207 26003 22008 19611 20621 497 -19595 -14903 -9404 -8716 -5854
14750e854R663J0245J0105o083q325o723m079k0684n122R028N762K704N56K956
$$ -5854 3809 14054 24159 18076 9751 3028 -1051 -21735 -26857 -17829 -12067 -9363 -8807 -5851
14736e851j0047N75j4861O880K6506J815q071J999l925j5135N994J2230r971P33
$$ -5851 -15898 -15323 -30184 -23304 3202 5017 -3054 -1055 -4980 -20115 -14121 -1891 -11862 -11129
14722a1129k557q072J5078L418M628L621q599O144M954P905l876q128O432J0252
$$ -11129 -13686 -21758 -6680 -3262 1366 4987 -3612 2532 7486 15391 11515 3387 9819 20071
14708B0071l019q591o526j0712k203j2049R722P828j6853r661q45n273J2334N514
$$ 20071 17052 8461 1935 -8777 -10980 -23029 -13307 -5479 -22332 -31993 -32838 -38111 -25777 -20263
14694b0263N99R946J0469L398j353r894J944m776k049K144j918n062J6952j7439
$$ -20263 -19664 -9718 751 4149 2796 -7098 -5154 -9930 -11979 -9835 -11753 -16815 137 -17302
14680a7302m841J0329K9748p463j5130j5094P664K0642Q944j1536j186k1925N308
$$ -17302 -22143 -11814 17934 10471 -4659 -19753 -12089 8553 17497 5961 4775 -17150 -11842
14667a1842L210K660J2357j263j1629k2683j348L322p66J5538J034j8065Q576
$$ -11842 -8632 -5972 6385 5122 -6507 -29190 -30538 -27216 -27982 -12444 -11410 -29475 -20899
14654b0899K073J2916j569j1334j3433J0034J0372J002L417j324J4612j301R148
$$ -20899 -18826 -5910 -7479 -18813 -32246 -22212 -11840 -10838 -7421 -8745 5867 4566 13714
14641A3714j0962J749O596J545j6046o589Q460J0524J4684k3605O438m744J623
$$ 13714 2752 4501 11097 12642 -3404 -9993 -1533 8991 23675 70 6508 1764 3387
14628C387M412L491j5727l216K031M463j191p753o975O888N554K872N477J847
$$ 3387 7799 11290 -4437 -7653 -5622 -1159 -2350 -10103 -17078 -10190 -4636 -1764 3713 5560
14614E560L10Q96O352J9119k3249j0202n993j3107q886K0244K5545k13j4148q57
$$ 5560 5870 6766 13118 32237 8988 -1214 -7207 -20314 -29200 -8956 16589 16376 2228 1371
14600A371p294j2277J1340q223Q708k23q595k989J1942K0582j5854j8137j240
$$ 1371 -5923 -18200 -6860 -15083 -6375 -6598 -15193 -18182 -6240 14342 -1512 -19649 -20889
14587b0889J032J2518N400m992J2213Q394N757m553j7890R023Q59J343r611j253
$$ -20889 -19857 -7339 -1939 -6931 5282 13676 19433 14880 -3010 6013 6872 8215 -1396 -2649
14573b649m042P522M997J765q60j5214k3149L328J2922J707M2k393J015J7954
$$ -2649 -6691 831 5828 7593 6733 -8481 -31630 -28302 -15380 -13673 -13631 -16024 -15009 2945
14559B945Q212M637K996j6212j4025J0550J5599j2918j0107m137M309p484l256
$$ 2945 11157 15794 18790 2578 -11447 -897 14702 1784 -8323 -12460 -8151 -15635 -18891
14546a8891J737J5950J8665l608j4468j1077r063p324M180M970j2842J139K6100
$$ -18891 -17154 -1204 17461 13853 -615 -11692 -20755 -28079 -23899 -18929 -31771 -30632 -4532
14533d532J7670O780k2524j4900Q729j676Q60j246j7500m046J5969Q788K788J5367
$$ -4532 13138 19918 -2606 -17506 -8777 -10453 -9593 -10839 -28339 -32385 -16416 -7628 -4840 10527
14519A0527m155P492k972j4826j5198j256J9202J2069n408K172l195j6278p910
$$ 10527 6372 13864 10892 -3934 -19132 -20388 -1186 10883 5475 7647 4452 -11826 -19736
14506a9736R711m658j857L546k293o379j5000j3191J6038J1331N205M355n100
$$ -19736 -10025 -14683 -16540 -12994 -15287 -21666 -36666 -49857 -33819 -22488 -17283 -12928 -18028
14493a8028k319j0096M140Q520j7674Q381J0218o429O566J7979o740j4610P581
$$ -18028 -20347 -30443 -26303 -17783 -35457 -27076 -16858 -23287 -16721 1258 -5482 -20092 -12511
14480a2511J6667k352P420n390r466Q498n74J447J9898K5615o419k2375k6550
$$ -12511 4156 1804 9224 3834 -5632 2866 2292 3739 23637 49252 42833 20458 -6092
14467f092j4429P697J3969n752R724J6897K446j3534n716J679J8234k7j4164j2013
$$ -6092 -20521 -12824 1145 -4607 5117 22014 24460 10926 5210 6889 25123 25096 10932 -1081
14453a081K674r16J698j3036n695L456J1927L782n866l993P042J3861p982j757
$$ -1081 1593 677 2375 -10661 -16356 -12900 -973 2809 -3057 -7050 -8 13853 5871 4114
14439D114j3926j0658q077n20K1234J8535j1896j8846K885J9207j5008m117J390
$$ 4114 -9812 -20470 -28547 -29067 -7833 10702 -1194 -20040 -17155 2052 -12956 -17073 -15683
14426a5683p379J8403K0715J2350j258j1238P028r565j5312J1204M488j295q397
$$ -15683 -23062 -4659 16056 28406 27148 15910 22938 13373 -1939 9265 13753 12458 4061
14413D061n092k117k303q089J861q68N228J106J0517R151q450O382Q254r462q865
$$ 4061 -1031 -3148 -5451 -13540 -11679 -12547 -7319 -6213 4304 13455 5005 11387 19641 10179 1314
14398A314q900N415N171P144k41r364m435M106j620j1362L135J7779R886Q408
$$ 1314 -7586 -2171 3000 10144 9903 539 -3896 210 -1410 -12772 -9637 8142 18028 26436
14384B6436J855j8513j1651M651q774o048j1631r532K837J1654l924m474J2809
$$ 26436 28291 9778 -1873 2778 -5996 -12044 -23675 -33207 -30370 -18716 -22640 -27114 -14305
14371a4305M293O125M83j6597O3J283P897J3860j0167k2529j0675K0001K0244
$$ -14305 -10012 -3887 -3404 -20001 -19938 -18655 -10758 3102 -7065 -29594 -40269 -20268 -24
14358b4j0839j3257l491L152J2555K7371m555k7198k0459J0514J2827k798k980
$$ -24 -10863 -24120 -27611 -24459 -11904 15467 10912 -16286 -36745 -26231 -13404 -16202 -19182
14345a9182q597R128J486K93j5183J607M747J5252j690o374M719m870K3261J6291
$$ -19182 -27779 -18651 -17165 -16872 -32055 -30448 -25701 -10449 -12139 -18513 -13794 -18664 4597 20888
14331B0888J1116j265l4757l0021j7312M495N070J761l865P082J82K6087j984
$$ 20888 32004 30739 -4018 -34039 -51351 -46856 -41786 -40025 -43890 -36808 -36626 -10539 -12523
14318a2523j7022K337M974J3823J5476j0828l175R636n464N343j0933l153k163
$$ -12523 -29545 -27208 -22234 -8411 7065 -3763 -6938 2698 -2766 2577 -8356 -11509 -13672
14305a3672R708m748M875p425m959J632M16p807q257Q686P258M150J1538M611
$$ -13672 -3964 -8712 -3837 -11262 -16221 -14589 -14173 -21980 -30237 -21551 -14293 -10143 1395 6006
14291F006P209O222j0131j1561k112K877m422K711M024j711R25m508l863k918
$$ 6006 13215 19437 9306 -2255 -4367 -1490 -5912 -3201 823 -888 37 -4471 -8334 -11252
14277a1252l866J431m343k129j2831L482N452J4458J5879O613q001p138K2584
$$ -11252 -15118 -13687 -18030 -20159 -32990 -29508 -24056 -9598 6281 12894 4893 -2245 20339
14264B0339J2598j0089j6088K905k957J385K368j2376k7166j8533P977K680K0442
$$ 20339 32937 22848 6760 9665 6708 8093 10461 -1915 -29081 -47614 -39637 -36957 -16515
14251a6515O232m118J0851k752j6787K634J5559q232j3802o54K636O862p731m630
$$ -16515 -10283 -14401 -3550 -6302 -23089 -20455 -4896 -13128 -26930 -27584 -24948 -18086 -25817 -30447
14237c0447n276M494P336J8773L1300l232j8052L378r276m591M001q750J1480
$$ -30447 -35723 -31229 -23893 -5120 26180 22948 4896 8274 -1002 -5593 -1592 -10342 1138
14224A138J0226j9002j4134O465J817l631l585J0942K538J5021O81J588k810J814
$$ 1138 11364 -7638 -21772 -15307 -13490 -17121 -20706 -9764 -7226 7795 8476 10064 7254 9068
14210I068M215L659J334j1910j4383N422M103K60l483J0939m909N810o168o67
$$ 9068 13283 16942 18276 6366 -8017 -2595 1508 1768 -1715 9224 4315 10125 3957 3290
14196C290N209K399l275j8159J455J1303m964k2950L022P157r898j1191k951q35
$$ 3290 8499 10898 7623 -10536 -9081 2222 -2742 -25692 -22670 -15513 -25411 -36602 -39553 -40388
14182d0388J4166l880K98R906N196n258R758J2376Q685n750p694N169m462j9781
$$ -40388 -26222 -30102 -29804 -19898 -14702 -19960 -10202 2174 10859 5109 -2585 2584 -1878 -21659
14168b1659P271J5541k847j2654o52J0028p011j318l3q432Q547K961p601P586
$$ -21659 -14388 1153 -1694 -14348 -15000 -4972 -11983 -13301 -13334 -21766 -13219 -10258 -17859 -10273
14154a0273N535M040j7133j0131K053j822J1575Q874m673j6010J3239J8763J1744
$$ -10273 -4738 -698 -17831 -27962 -25909 -27731 -16156 -7282 -11955 -27965 -14726 4037 15781
14141A5781O49j9312M780L639j992N152k0048j8731j2157J1983j866J2977J2878
$$ 15781 16430 -2882 1898 5537 3545 8697 -11351 -30082 -42239 -30256 -32122 -19145 -6267
14128f267N580J4027j5167K258L697j1171n622M110j7144O566K7835j0795j0348
$$ -6267 -687 13340 -1827 431 4128 -7043 -12665 -8555 -25699 -19133 8702 -2093 -12441
14115a2441K427K284o466l881k113Q555n197n230Q793J6358O588M915M609j4723
$$ -12441 -10014 -7730 -14196 -18077 -20190 -11635 -16832 -22062 -13269 3089 9677 14592 19201 4478
14101D478j7106J2004m321j2456j3149M590j462L313J3660J9688N412j2218l392
$$ 4478 -12628 -624 -4945 -17401 -30550 -25960 -27422 -24109 -10449 9239 14651 2433 -959
14088i59k657o057j2070l985J5363O899Q704k407N038l161n706j2487p657K9724
$$ -959 -3616 -9673 -21743 -25728 -10365 -3466 5238 2831 7869 4708 -998 -13485 -21142 8582
14074H582K9221j3183j8475j5778k0143j8420L541O722L635o055k058K3008j674
$$ 8582 37803 24620 6145 -9633 -29776 -48196 -44655 -37933 -34298 -40353 -42411 -19403 -21077
14061b1077M471J146q202L344J7269K3968Q940k893p711q99k0552j3993O28Q931
$$ -21077 -16606 -15460 -23662 -20318 -3049 20919 29859 26966 19255 18356 -2196 -16189 -15561 -6630
14047f630K3121P45j0078l3814m489k310Q343Q04M452M042L723J340J2743M780
$$ -6630 16491 17236 7158 -26656 -31145 -33455 -25112 -24308 -19856 -15814 -12091 -10751 1992 6772
14033F772j3760m182r74M649j2101N712J2827J2593j0723j0911R165J5379K6437
$$ 6772 -6988 -11170 -12144 -7495 -19596 -13884 -1057 11536 813 -10098 -933 14446 40883
14020D0883r194r431j2576M628J557k571j9785j8491o583J1830j1649j0938N898
$$ 40883 31689 22258 9682 14310 15867 13296 -6489 -24980 -31563 -19733 -31382 -42320 -36422
14007c6422J3031O188J8339O047j636J994l489j1880J0891Q417O907j4069j0775
$$ -36422 -23391 -17203 1136 7183 5547 7541 4052 -7828 3063 11480 18387 4318 -6457
13994f457k402j322L473N905L205L780k393K5770l363j3474m407m919j7377j7881
$$ -6457 -8859 -10181 -6708 -803 2402 6182 3789 29559 26196 12722 8315 3396 -13981 -31862
13980c1862j9904q13M6189K6681j9043k8243j8710p789L47J9314J3910M009m243
$$ -31862 -51766 -52579 -6390 20291 1248 -26995 -45705 -53494 -53147 -33833 -19923 -15914 -20157
13967b0157R242K8229J492J2240K602n736l187p002k8p756j648j1288o010o761
$$ -20157 -10915 17314 18806 31046 33648 27912 24725 17723 17695 9939 8291 -2997 -9007 -15768
13953a5768K115J7386j0306Q847J0952K5947k963j7431r190O541J2414r301q304
$$ -15768 -13653 3733 -6573 2274 13226 39173 36210 18779 9589 16130 28544 19243 10939
13940A0939j2840J6882O5j9691J0858J3925m946R037j4076j5554O074O177q331
$$ 10939 -1901 14981 15046 -4645 6213 20138 15192 24229 10153 -5401 673 6850 -1481
13927a481o703n205P755J8502R35N58q393p721p088K311q447o374J003m695K4941
$$ -1481 -8184 -13389 -5634 12868 13803 14361 5968 -1753 -8841 -6530 -14977 -21351 -20348 -25043 -102
13912a02r926j6475J3171M46L529o516K534n364j5599J7003M995m933Q063j1633
$$ -102 -10028 -26503 -13332 -12886 -9357 -15873 -13339 -18703 -34302 -17299 -12304 -17237 -9174 -20807
13898b0807j7836n69L432J4162l923O649r83j873k690P9N314K761M180Q166Q051
$$ -20807 -38643 -39212 -35780 -21618 -25541 -18892 -19875 -21748 -24438 -24359 -19045 -16284 -12104 -3938 4113
13883D113k857j6511J458K4615J2220L08j5304j7695O42j6696o458J3163K5574
$$ 4113 1256 -15255 -13797 10818 23038 23346 8042 -9653 -9011 -25707 -32165 -19002 6572
13870F572J4999r61p730j279j3379j5055L580p197j198q336O344J4034J0910Q665
$$ 6572 21571 20610 12880 11601 -1778 -16833 -13253 -20450 -21648 -29984 -23640 -9606 1304 9969
13856I969J3768j2471r047J9215P070j331j0801L799o321j9210L314M272j699
$$ 9969 23737 11266 2219 21434 28504 27173 16372 20171 13850 -5360 -2046 2226 527
13843E27R490l574j3399M721J2098Q999L867j5668m127P769j0684k917J283o58
$$ 527 10017 6443 -6956 -2235 9863 18862 22729 7061 2934 10703 19 -2898 -1615 -2273
13829b273J0527j0796j9864R693J5631p835l732j5278L733J3438M571Q667L30
$$ -2273 8254 -2542 -22406 -12713 2918 -4917 -8649 -23927 -20194 -6756 -2185 6482 6812
13816F812j0545p828J4136M322j669K809O655k1854j5115n81K2802k69j1784j5126
$$ 6812 -3733 -11561 2575 6897 5228 8037 14692 -7162 -22277 -22858 -56 -325 -12109 -27235
13802b7235J8106p109R277l804Q7Q561o34K15l175L557l826j5299j4244M370J0970
$$ -27235 -9129 -16238 -6961 -10765 -10678 -2117 -2751 -2536 -5711 -2154 -5980 -21279 -35523 -31153 -20183
13787b0183J2427n198j1440N642P359l55l353J1445K294m416L655P674P607j2246
$$ -20183 -7756 -12954 -24394 -18752 -11393 -11748 -15101 -3656 -1362 -5778 -2123 5551 13158 912
13773I12L54r454k685m675j300P888q107k812l977J106N431r43N170l49L365j080
$$ 912 1266 -8188 -10873 -15548 -16848 -8960 -17067 -19879 -23856 -22750 -17319 -18262 -13092 -13441 -10076 -11156
13757a1156r424P719J4934J4933L1815k863k9719q285K0853k4968p134R922l031
$$ -11156 -20580 -12861 2073 17006 48821 45958 16239 7954 28807 3839 -3295 6627 3596
13744C596K018j963j1387m884J4547o447o96Q57N036J424r198k0802m852P048
$$ 3596 5614 3651 -7736 -12620 1927 -4520 -5216 -4359 677 2101 -7097 -27899 -32751 -25703
13730b5703J0119L589k192J478j1073P264J3269J2954P849j0331Q603J036k59
$$ -25703 -15584 -11995 -14187 -12709 -23782 -16518 -3249 9705 17554 7223 15826 16862 16603
13717A6603k320p637j863k819Q390R144o810l172m763j0755j0009K813M170N440
$$ 16603 14283 6646 4783 1964 10354 19498 12688 9516 4753 -6002 -16011 -13198 -9028 -3588
13703c588l912j3513R236K3036m206K390m501j5105m11m864l200P209j83O857
$$ -3588 -7500 -21013 -11777 11259 7053 9443 4942 -10163 -10574 -15438 -18638 -11429 -11612 -4755
13689d755M657j6679R334J378J6841l410K522k172L737M698m357p474j3879N070
$$ -4755 -98 -16777 -7443 -6065 10776 7366 9888 7716 11453 16151 11794 4320 -9559 -4489
13675d489R838J704j7985o606J4683m408j983J0350j165k5027K864K800J5505
$$ -4489 5349 7053 -10932 -17538 -2855 -7263 -9246 1104 -61 -25088 -22224 -19424 -3919
13662c919J0978O630K911q112R460k374j0796j441J7415n652m178R393p128j2065
$$ -3919 7059 13689 16600 8488 17948 15574 4778 3337 20752 15100 10922 20315 13187 1122
13648A122K830N288k921K595J0979K883j0364k895K929m603q667k228O884M0o361
$$ 1122 3952 9240 6319 8914 19893 22776 12412 9517 12446 7843 -824 -3052 3832 3872 -2489
13633b489J2383J6297k53L94j0699j6745m453j0521J092J861j370q8j432P523
$$ -2489 9894 26191 25938 26332 15633 -1112 -5565 -16086 -14994 -13133 -14503 -14591 -16023 -8500
13619h500O235K594m34k7052P126Q087P849j0207J2866K893j384l486m137q443
$$ -8500 -2265 329 -105 -27157 -20031 -11944 -4095 -14302 -1436 1457 73 -3413 -7550 -15993
13605a5993K026M752j8575n813K6420N262M249J7864k191j3883m511Q485m546
$$ -15993 -13967 -9215 -27790 -33603 -7183 -1921 2328 20192 18001 4118 -393 8092 3546
13592C546L191k409k2826j0986L249L850J5364j2065j2947J3121J5632j6801j6191
$$ 3546 6737 4328 -18498 -29484 -26235 -22385 -7021 -19086 -32033 -18912 -3280 -20081 -36272
13579c6272M544r43J5403J9953P407o150J885j8724j7553l375J0355Q406J7937
$$ -36272 -31728 -32671 -17268 2685 10092 3942 5827 -12897 -30450 -33825 -23470 -15064 2873
13566B873Q858M737J0235J9750q070k3850J4171l571j8477j6981L210J5043J5554
$$ 2873 11731 16468 26703 46453 38383 14533 28704 25133 6656 -10325 -7115 7928 23482
13553B3482l422r431j6479m027M821K774o336J2902J1024P302J711q29N120j3195
$$ 23482 20060 10629 -5850 -9877 -5056 -2282 -8618 4284 15308 22610 24321 23492 28612 15417
13539A5417q66p126O278m4J2450L188j5770j304p07m880k1783k0086k701J7076
$$ 15417 14551 7425 13703 13659 26109 29297 13527 12223 11516 6636 -15147 -35233 -37934 -20858
13525b0858O683r710J4872N485M98j043m795K214J791q204K556J6932L4214r305
$$ -20858 -14175 -23885 -9013 -3528 -3030 -4073 -8868 -6654 -4863 -13067 -10511 6421 40635 31330
13511C1330n920L997m585l3358k0957p99J3109J6629J160j3742K934J3213p379
$$ 31330 25410 29407 24822 -8536 -29493 -30292 -17183 -554 606 -13136 -10202 3011 -4368
13498d368l418K1257q433j4993j7333q202J3771J4379j3921j12P158o680o844
$$ -4368 -7786 13471 5038 -9955 -27288 -35490 -21719 -7340 -21261 -21373 -14215 -20895 -27739
13485b7739M035P585J3307m07r774l425J3096O000j3924p709R888J3765J520M201
$$ -27739 -23704 -16119 -2812 -3219 -12993 -16418 -3322 2678 -11246 -18955 -9067 4698 6218 10419
13471A0419j1674J1456J0912k3120n580J615l461J0365n899R76r0j3780J185J5455
$$ 10419 -1255 10201 21113 -2007 -7587 -5972 -9433 932 -4967 -3991 -4081 -17861 -16676 -1221
13457a221R316l451j1693q304Q062L368n13l192r340R281J4959P556k604j60j18
$$ -1221 8095 4644 -7049 -15353 -7291 -3923 -4436 -7628 -16968 -7687 7272 14828 12224 12064 11946
13442A1946L582J3018J3409J1477k758j8326j3935J109J634j2910j25J1131J1881
$$ 11946 15528 28546 41955 53432 50674 32348 18413 19522 21156 8246 8121 19252 31133
13429C1133M263k3966k8283n09N740Q029O983P155j875j6202k0552N464J0531
$$ 31133 35396 11430 -16853 -17362 -11622 -3593 3390 10545 8670 -7532 -28084 -22620 -12089
13416a2089M059J4910r529k0257o736j8962l088K989K4172J8703P028j3380K1169
$$ -12089 -8030 6880 -2649 -22906 -29642 -48604 -51692 -48703 -24531 -5828 1200 -12180 8989
13403H989J5423J63j6346j3900R187l151k7332p50K8253J3588o322Q28r346N242
$$ 8989 24412 24575 8229 -5671 3516 365 -26967 -27717 536 14124 7802 8630 -716 4526
13389D526K136Q31Q21j4612O377j494k6690l294J4179J3367j129n508j073K785
$$ 4526 6662 7493 8314 -6298 79 -1415 -28105 -31399 -17220 -3853 -4982 -10490 -11563 -8778
13375h778l456M336j524K0929J3031o89m860M321j3415m660L549p0j8071j2079
$$ -8778 -12234 -7898 -9422 11507 24538 23849 18989 23310 9895 5235 8784 8714 -9357 -21436
13361b1436M398J122m448j0393J2478O743k730J5116N699j675m989P186p73j0191
$$ -21436 -17038 -15916 -20364 -30757 -18279 -11536 -14266 850 6549 4874 -115 7071 6298 -3893
13347c893j2310J4311r10j850p340k1977o998K2720K1038r111Q34J5922M534P797
$$ -3893 -16203 -1892 -2802 -4652 -11992 -33969 -40967 -18247 2791 -6320 -5486 10436 14970 22767
13333B2767j119p042j7777j4507J5205J167p426J99J0641K3585k5772J482k685
$$ 22767 21648 14606 -3171 -17678 -2473 -1306 -8732 -8533 2108 25693 -79 1403 -1282
13320a282L934q027o905j0151K783K4934L603P82n277K737m702j0857k118K0270
$$ -1282 2652 -5375 -12280 -22431 -19648 5286 8889 9671 4394 7131 2429 -8428 -10546 9724
13306I724o198k2030K602J6859J3136P257p021j5278m795j3391k6924N659J8828
$$ 9724 3526 -18504 -15902 957 14093 21350 14329 -949 -5744 -19135 -46059 -40400 -21572
13293b1572J6968J1220r155k4562l372L657N888n431P17L476N717K4993l125j4262
$$ -21572 -4604 6616 -2539 -27101 -30473 -26816 -20928 -26359 -25642 -22166 -16449 8544 5419 -8843
13279h843m827j8270Q824P691Q144R835j2352j6016J4435J2070m694j1511R185
$$ -8843 -13670 -31940 -23116 -15425 -7281 2554 -9798 -25814 -11379 691 -4003 -15514 -6329
13266f329l952K623M656R223r390m439N208n981P54J6067k769L773J5543j059
$$ -6329 -10281 -7658 -3002 6221 -3169 -7608 -2400 -8381 -7627 8440 5671 9444 24987 23928
13252B3928k8924k2378N603N837J707r135N282P783Q9J0228J085L102J2987j7317
$$ 23928 -4996 -27374 -21771 -15934 -14227 -23362 -18080 -10297 -10208 20 1105 4207 17194 -123
13238a23j310J7218r321j5451j5K174P725j0076q483o098p068l2Q335O556K3019
$$ -123 -1433 15785 6464 -8987 -9002 -6828 897 -9179 -17662 -23760 -30828 -30860 -22525 -15969 7050
13223G050J9990L694o003k421m003L4L515j3222j3921K850J1942k016p884Q025
$$ 7050 27040 30734 24731 22310 18307 18341 21856 8634 -5287 -2437 9505 7489 -395 7630
13209G630J45k223N099p579j3696n772p7P361J60j241l948p190J9063J7225l46
$$ 7630 7775 5552 10651 3072 -10624 -16396 -16473 -9112 -8952 -10193 -14141 -21331 -2268 14957 14611
13194A4611j0908L136j459%O459q24L314L189m829l516q251j5691n089J0846j1588
$$ 14611 3703 6839 5380 5380 11839 11015 14329 17518 12689 9173 922 -14769 -19858 -9012 -20600
13179b0600p11J6737J2161M803M194j4582p392r661O897J4187J865K402n376K810
$$ -20600 -21311 -4574 7587 12390 16584 2002 -5390 -15051 -8154 6033 7898 10300 4924 7734
13165G734K79K921P641q344p006N596j4238N488J0420p276M343j2431O267J0927
$$ 7734 8013 10934 18575 10231 3225 8821 -5417 71 10491 3215 7558 -4873 1394 12321
13151A2321j0955j3604N812J6142j7046j2786K0037l738k475m710K970J0466N873
$$ 12321 1366 -12238 -6426 9716 -7330 -20116 -79 -3817 -6292 -11002 -8032 2434 8307
13138H307j0313j4087J7776J6666j542J4j759j0152k6606p334J7878O78R703j2466
$$ 8307 -2006 -16093 1683 18349 16807 16821 15062 4910 -21696 -29030 -11152 -10474 -771 -13237
13124a3237o06J5911K8924K051k4774R73j402l304R544L547J5326j631P495k3174
$$ -13237 -13843 2068 30992 33043 8269 9242 7840 4536 14080 17627 32953 31322 38817 15643
13110A5643j6140j719L845m017M259k5587o686K263J2960J4867l226J3112j215
$$ 15643 -497 -2216 1629 -2388 1871 -23716 -30402 -28139 -15179 -312 -3538 9574 8359
13097H359J0600J331m172P57j5547j5736j0397P936K7257K2906L328j7314j2889
$$ 8359 18959 20290 16118 16875 1328 -14408 -24805 -16869 10388 33294 36622 19308 6419
13084F419q251j3689m434N191J0371J44O187m379l194M643J1528j0955l5732j884
$$ 6419 -1832 -15521 -19955 -14764 -4393 -4249 1938 -2441 -5635 -992 10536 -419 -36151 -38035
13070c8035L624J5559J1563K0825j1269j150K928p810O593J785j3902r757p148
$$ -38035 -34411 -18852 -7289 13536 2267 1117 4045 -3765 2828 4613 -9289 -19046 -26194
13057b6194j0923l22J3760O902J3165J2472m376j295m416q722o6o560J76P55l875
$$ -26194 -37117 -37439 -23679 -16777 -3612 8860 4484 3189 -1227 -9949 -10015 -16575 -16399 -15644 -19519
13042a9519R690M77P917J6584L865j6027r538L788l175M97P908r199J2190O706
$$ -19519 -9829 -9352 -1435 15149 19014 2987 -6551 -2763 -5938 -5441 2467 -6732 5458 12164
13028A2164j711j3141O823N820j4819k69J852N120P737J3579J4964j0447m503
$$ 12164 10453 -2688 4135 9955 -4864 -5133 -3281 1839 9576 23155 38119 27672 23169
13015B3169j0392k7091r840J4639P549j5706o82M289O127L500n566m38Q994J3755
$$ 23169 12777 -14314 -24154 -9515 -1966 -17672 -18354 -14065 -7938 -4438 -10004 -10442 -1448 12307
13001A2307M043P466j8493J007r856m570j1682j7265o480P089J6425P417J0644
$$ 12307 16350 23816 5323 6330 -3526 -8096 -19778 -37043 -43523 -36434 -20009 -12592 -1948
12988a948p444R932L929r669m717N635Q354J8486r71m110R083K602j3011j5813
$$ -1948 -9392 540 4469 -5200 -9917 -4282 4072 22558 21587 17477 26560 29162 16151 338
12974C38L060N453J0643m088j7530j1215M228J855J1664J4419N57j0813n113R220
$$ 338 3398 8851 19494 15406 -2124 -13339 -9111 -7256 4408 18827 19384 8571 3458 12678
12960A2678q757J777p144k729K652K245p648J5049p288M197J3877K797j0647m919
$$ 12678 3921 5698 -1446 -4175 -1523 722 -6926 8123 835 5032 18909 21706 11059 6140
12946F140j4411j2674J5354J933j3673Q510P281K040J501j2230o053J2031K442
$$ 6140 -8271 -20945 -5591 -3658 -17331 -8821 -1540 500 2001 -10229 -16282 -4251 -1809
12933a809q392Q997k74j69J192M597R881J683j4923M007N174m784j9747j3011
$$ -1809 -10201 -1204 -1478 -1647 -455 4142 14023 15706 783 4790 9964 5180 -14567 -27578
12919b7578n328K6014j002j088J3062J6085O328j6826j5002j5143J475Q055J5137
$$ -27578 -32906 -6892 -7894 -8982 4080 20165 26493 9667 -5335 -20478 -19003 -10948 4189
12906D189J7612k504j4468J2749Q076k7083r582k995L761P005L876n412K765K2446
$$ 4189 21801 19297 4829 17578 25654 -1429 -11011 -14006 -10245 -3240 636 -4776 -2011 20435
12892B0435P466n409j9506n32J7973j2175j3572k1017K303P852M488O620j626
$$ 20435 27901 22492 2986 2454 20427 8252 -5320 -26337 -24034 -16182 -11694 -5074 -6700
12879f700o427J4895J1648o578j2907k496R278K993j6917o932O071R000R179M157
$$ -6700 -13127 1768 13416 6838 -6069 -8565 713 3706 -13211 -20143 -14072 -5072 4107 8264
12865H264O574O846k265j4570O081K147L207k862l803L841Q629P096k0690j0989
$$ 8264 14838 21684 19419 4849 10930 13077 16284 13422 9619 13460 22089 29185 8495 -2494
12851b494L177M546P709q24o643o954M839j1211j235k661J4294R427M338r59j1268
$$ -2494 683 5229 12938 12114 5471 -1483 3356 -7855 -9090 -11751 2543 11970 16308 15349 4081
12836D081j3869J1415n442k0294O869J1464K5858N933l776k8603j1300R730J3216
$$ 4081 -9788 1627 -3815 -24109 -17240 -5776 20082 26015 22239 -6364 -17664 -7934 5282
12823E282L471k502J1051J3342q888k9205j1746j489R373R422O676o44m878P213
$$ 5282 8753 6251 17302 30644 21756 -7449 -19195 -20684 -11311 -1889 4787 4143 -735 6478
12809F478j2068j7178N248L634r728J7068J7480R327K058J42j0034j0233j8269
$$ 6478 -5590 -22768 -17520 -13886 -23614 -6546 10934 20261 22319 22461 12427 2194 -16075
12796a6075k271J1285K6485R706j009N713j0672n196L039M487o607j7234m743
$$ -16075 -18346 -7061 19424 29130 28121 33834 23162 17966 21005 25492 18885 1651 -3092
12783c092N332M464q23p208J1167L102K769j8040k313J1443q12J759p833j0428
$$ -3092 2240 6704 5881 -1327 9840 12942 15711 -2329 -4642 6801 5989 7748 -85 -10513
12769a0513j3328k312O906J8018j215j4538j1829J0186N461q353L880k382o725
$$ -10513 -23841 -26153 -19247 -1229 -2444 -16982 -28811 -18625 -13164 -21517 -17637 -20019 -26744
12756b6744N951K790R266M112Q581r067r780N010J0668J192N750j4544k8850P302
$$ -26744 -20793 -18003 -8737 -4625 3956 -5111 -14891 -9881 787 1979 7729 -6815 -35665 -28363
12742b8363K0060R253J8511n695k570K680q479M263l50m554J4022k099q997n142
$$ -28363 -8303 950 19461 13766 11196 13876 5397 9660 9310 4756 18778 16679 7682 2540
12728B540N285J6458l767q543m229J971l417o254j7791P53K6844J9739j1169j3412
$$ 2540 7825 24283 20516 11973 7744 9715 6298 44 -17747 -16994 9850 29589 18420 5008
12714E008J8813r547Q99N949j8569p512J2775M809k228o316j677j3657l49j5312
$$ 5008 23821 14274 15173 21122 2553 -4959 7816 12625 10397 4081 2404 -11253 -11602 -26914
12700b6914j1722J7946M454L237J8279Q365j4125k2834j3357J0091O352J3267
$$ -26914 -38636 -20690 -16236 -12999 5280 13645 -480 -23314 -36671 -26580 -20228 -6961
12688f961J7512l537N87j0604J5500R468L768j5008j6020K954l741O717J3636
$$ -6961 10551 7014 7601 -3003 12497 21965 25733 10725 -5295 -2341 -6082 635 14271
12675A4271P084q395j4545M55O345O380p212m9O006J0323O327p471P791J1329
$$ 14271 21355 12960 -1585 -1130 5215 11595 4383 4334 10340 20663 26990 19519 27310 38639
12661C8639q698k3751p837m664M873j6134O132J4296J0095j0108Q575l576k782
$$ 38639 29941 6190 -1647 -6311 -1438 -17572 -11440 2856 12951 2843 11418 7842 5060
12648E060Q348N616j0299O83j6105k1359k660R003M271J1020L619L656K4534J0838
$$ 5060 13408 19024 8725 9408 -6697 -28056 -30716 -21713 -17442 -6422 -2803 853 25387 36225
12634C6225j5576K844o139j7801K412J7547N168n032J836J407m813o12q090N81
$$ 36225 20649 23493 17354 -447 1965 19512 24680 19648 21484 22891 18078 17466 9376 9957
12620I957N028M134j0862P905K227j2252Q644K6055m020j8186N913j1364j0502
$$ 9957 14985 19119 8257 16162 18389 6137 14781 40836 36816 18630 24543 13179 2677
12607B677J0614Q472Q74m305m363j293r101J3703M375j4151J1494q093P057J4500
$$ 2677 13291 21763 22637 18332 13969 12676 3575 17278 21653 7502 18996 10903 17960 32460
12593C2460J8096r870J97L335n272o396K976j818q680J125L766J6227N259K656
$$ 32460 50556 40686 40883 44218 38946 32550 35526 33708 25028 26153 29919 46146 51405 54061
12579E4061R607J1421L0007R735j4877J0431J9853K8024J3373K0430J0720J4416
$$ 54061 63668 75089 105096 114831 99954 110385 130238 158262 171635 192065 202785 217201
12567B17201j2695k1212j0020j9364k1219M92l073J640k6700k7116J1452l61m669
$$ 217201 204506 183294 173274 153910 132691 133183 130110 131750 105050 77934 89386 89025 84356
12554H4356m940r968J1745N478L579o679j5099J338J4620P448l654j434J4141
$$ 84356 79416 69448 81193 86671 90250 83571 68472 69810 84430 91878 88224 86790 100931
12541A00931L22p978L127J7495K8551J2310L069K7239L0438M8003K2364L9496
$$ 100931 101253 93275 96402 113897 142448 154758 157827 185066 215504 263507 285871 325367
12529C25367L5149K7313M6597N0710M4678J7716J3687K981l2868o3190m8527l5027
$$ 325367 360516 387829 434426 485136 529814 547530 561217 564198 531330 468140 419613 384586
12517C84586l1271l5021m6101l0194N15K058j8129k9095j7953j0390j2280n889
$$ 384586 353315 318294 272193 241999 242514 244572 226443 197348 179395 169005 156725 150836
12505A50836j6928L344N005L876K372K654R854j4525o233p171J5971J9177K3084
$$ 150836 133908 137252 142257 146133 148505 151159 161013 146488 140255 133084 149055 168232 191316
12492A91316K6645O12J4901J9639L7757K2173K4345J5745N2049M5664M4755N1432
$$ 191316 217961 218573 233474 253113 290870 313043 337388 353133 405182 450846 495601 547033
12480E47033M2859J5595j0450l8963n0775n5852n1500l9689l3344m2630j5028
$$ 547033 589892 605487 595037 556074 505299 449447 397947 358258 324914 282284 267256
12469B67256r861j1395k3403j1138k4326k1509P044J9923m149k1729k6048j2027
$$ 267256 257395 246000 222597 211459 187133 165624 172668 192591 188442 166713 140665 128638
12457A28638j4425j8906p241J4273O320Q692L227J586J2200k421J4652J5574j7041
$$ 128638 114213 95307 88066 102339 108659 117351 120578 122164 134364 131943 146595 162169 145128
12444A45128q220R714j651M786J4166J7617N754K0314M0840J5698j2064k775j5015
$$ 145128 136908 146622 144971 149757 163923 181540 187294 207608 248448 264146 252082 249307 234292
12431B34292k3460k8580k3489j6444l2168J304J8414l152J284k4069k142N40q246
$$ 234292 210832 182252 158763 142319 110151 111455 129869 126717 128001 103932 101790 102330 94084
12418I4084k249m315o162J4580N613r327j5898L278P201k0393n923m170j1713
$$ 94084 91835 87520 81358 95938 101551 92224 76326 79604 86805 66412 60489 56319 44606
12405D4606k206l808J021Q467r842L559O540J0247J561k3098K219N456p633M537
$$ 44606 42400 38592 39613 48080 38238 41797 48337 58584 60145 37047 39266 44722 37089 41626
12391D1626J7434n4r204N465M273j3039j1493Q321l401j0279Q727J022q222n760
$$ 41626 59060 59006 49802 55267 59540 46501 35008 43329 39928 29649 38376 39398 31176 25416
12377B5416J3024n701j1107O293n811M041j7370n112m267L666J6397J268q585
$$ 25416 38440 32739 21632 27925 22114 26155 8785 3673 -594 3072 19469 20737 12152
12364A2152M158j1854M595N578L256j8161m982J4024k717j71K451j9452m032J4182
$$ 12152 16310 4456 9051 14629 17885 -276 -5258 8766 6049 5878 8329 -11123 -15155 -973
12350i73K5256O432K0557N3k5102r476j5349N988K57L952K290J906J7104j921
$$ -973 24283 30715 51272 51325 26223 16747 1398 7386 7643 11595 13885 15791 32895 30974
12336C0974j6399p929r15J1855J5043M083j8348o267o783O192R663Q708Q303p463
$$ 30974 14575 6646 5731 17586 32629 36712 18364 12097 5314 11506 21169 29877 38180 30717
12322C0717J0714N882r234l152J298J5543P004k6842j0151K167n501m007L907
$$ 30717 41431 47313 38079 34927 36225 51768 58772 31930 21779 23946 18445 14438 18345
12309A8345j1746j3037j301O541j0881P903J9873q005K07m806j1679R513p256
$$ 18345 6599 -6438 -7739 -1198 -12079 -4176 15697 7692 7899 3093 -8586 927 -6329
12296f329J369J0957k345Q338J1615q678j1199Q439R399K284p237m690n964j6383
$$ -6329 -4960 5997 3652 11990 23605 14927 3728 12167 21566 23850 16613 11923 5959 -10424
12282a0424m088N685J0390M175o413q782Q997J8742Q67l116N441r21j1062j0324
$$ -10424 -14512 -8827 1563 5738 -675 -9457 -460 18282 19149 16033 21474 20553 9491 -833
12268h33J1555J9920K6806l041l514O656j0635j9362k0254q12K635J414p182J6578
$$ -833 10722 30642 57448 54407 50893 57549 46914 27552 7298 6486 9121 10535 3353 19931
12254A9931J8863j6084k4079l377K0575j365K965n551j2188k5439K014J6738J8235
$$ 19931 38794 22710 -1369 -4746 15829 14464 17429 11878 -310 -25749 -23735 -6997 11238
12241A1238j411O941K1234o905j589Q349j2091k2454N977q38J285m055k313L835
$$ 11238 9827 16768 38002 31097 29508 37857 25766 3312 9289 8451 9736 5681 3368 7203
12227G203N866M722R709k0401o447M157J947j1885J9274M00L309J393j7159n971
$$ 7203 13069 17791 27500 7099 652 4809 6756 -5129 14145 14545 17854 19247 2088 -3883
12213c883O92J6043R312j3321l518M131j398o388j741K457J0426K851R541q540
$$ -3883 -3191 12852 22164 8843 5325 9456 8058 1670 -71 2386 12812 15663 25204 16664
12199A6664j1527N105J2652j4564j6964O39K2328J4752k924j5863K36Q724l843
$$ 16664 5137 10242 22894 8330 -8634 -7995 14333 29085 26161 10298 10534 19258 15415
12186A5415J2311J4279r614q004o039j5735n510p238N969K0346P696n406k232
$$ 15415 27726 42005 32391 24387 18348 2613 -2897 -10135 -4166 16180 23876 18470 16238
12173A6238m758J2304L947n902j9681j3465P375K0717O779o854q053M234o1n414
$$ 16238 11480 23784 27731 21829 2148 -11317 -3942 16775 23554 16700 8647 12881 12820 7406
12159G406K119J3052q472j9109J2764N749k276l268n291R751J4023P334r085j1543
$$ 7406 9525 22577 14105 -5004 7760 13509 11233 7965 2674 12425 26448 33782 24697 13154
12145A3154J3481J361k037J3828j5019k1318o942o482k306o41J4074R020l531
$$ 13154 26635 27996 25959 39787 24768 3450 -3492 -9974 -12280 -12921 1153 10173 6642
12132F642j3360J4741k051J4033j5255j6785J4792M092j1019p227J4169J617O66
$$ 6642 -6718 8023 5972 20005 4750 -12035 2757 6849 -4170 -11397 2772 4389 5055
12119E055r253Q56N56j2724m771K182K499j3231j3930K0431K0998J372j0598k556
$$ 5055 -4198 -3342 -2786 -15510 -20281 -18099 -15600 -28831 -42761 -22330 -1332 40 -10558 -13114
12105a3114L870K2309K791q371J2258j710l816j2298j7176J7638J6648j4671k0146
$$ -13114 -9244 13065 15856 7485 19743 18033 14217 1919 -15257 2381 19029 4358 -15788
12092a5788L687R323J2500N164k993j8635J1168Q982r499L123J578j1463P96l395
$$ -15788 -12101 -2778 9722 14886 11893 -6742 4426 13408 3909 7032 8610 -2853 -2057 -5452
12078e452j516O92L988M428J0655j391m605J383K017Q972M163r461l062Q506P670
$$ -5452 -6968 -6276 -2288 2140 12795 11404 6799 8182 10199 19171 23334 13873 10811 19317 26987
12063B6987j3759M660M308j0059K785J2674R731j7025j9693j5265J577O990k682
$$ 26987 13228 17888 22196 12137 14922 27596 37327 20302 609 -14656 -13079 -6089 -8771
12050h771l075J6620Q844o54o512L832O928j979k5j0352j6247R901J7010O289
$$ -8771 -11846 4774 13618 12964 6452 10284 17212 15233 15208 4856 -11391 -1490 15520 21809
12036B1809L415J9685k870k076o503J107p058j9810J96r555n656r15J401Oj1856
$$ 21809 25224 44909 42039 39963 33460 34567 27509 7699 7895 -1660 -7316 -8231 -6830 -6824 -18680
12021a8680j2525n056J1998K071J2540K4374N392q89P451R482l243R43j951j746
$$ -18680 -31205 -36261 -24263 -22192 -9652 14722 20114 19225 26676 36158 32915 33858 31907 30161
12007C0161L442K981k0899o306m936m540J7908N586o275q616M638k065J0508n312
$$ 30161 33603 36584 15685 9379 4443 -97 17811 23397 17122 8506 13144 11079 21587 16275
11993A6275J4049l95J764J698J1371N897j9601j5453q189q828N78R396j1864j3238
$$ 16275 30324 29929 31693 33391 44762 50659 31058 15605 7416 -1412 -834 8562 -3302 -16540
11979a6540N057J972K3752R256k0167j4475J2197J7447J2880j3698k0696j3515
$$ -16540 -11483 -9511 14241 23497 3330 -11145 1052 18499 31379 17681 -3015 -16530
11967a6530p910m183K7126K4973J4544M479n55J909j5484l756p22j571q233j5780
$$ -16530 -24440 -28623 -1497 23476 38020 42499 41944 43853 28369 24613 23891 22320 14087 -1693
11953a693m804K877J5539R451j0605J4624k0005j6303J3905P658j5139m985l789
$$ -1693 -6497 -3620 11919 21370 10765 25389 5384 -10919 2986 10644 -4495 -9480 -13269
11940a3269P565J8352P102l567p903p9j4189M272J6076J5258o34J1239N815j8442
$$ -13269 -5704 12648 19750 16183 8280 8201 -5988 -1716 14360 29618 28984 40223 46038 27596
11926B7596k5491q684J3855J2041l749r557m742n384j0178K669j3750k803J2297
$$ 27596 2105 -6579 7276 19317 15568 6011 1269 -4115 -14293 -11624 -25374 -28177 -15880
11913a5880J6222Q6j5092O725J9382J4166N063p457k53O199M279j5314k3872r140
$$ -15880 342 428 -14664 -7939 11443 25609 30672 23215 22962 29161 33440 18126 -5746 -14886
11899a4886K956P964O642K3940N664m242n411K730j3488l3729m430Q076K2879
$$ -14886 -11930 -3966 2676 26616 32280 28038 22627 25357 11869 -21860 -26290 -18214 4665
11886D665P917K866q325m468o082k197R117J0957j1486j6685N051J5767r490o59
$$ 4665 12582 15448 7123 2655 -3427 -5624 3493 14450 2964 -13721 -8670 7097 -2393 -3052
11872c052J1649j2272j0403J4763J7339n410j652L787P559j8395j3873J0146j3694
$$ -3052 8597 -3675 -14078 685 18024 12614 10962 14749 22308 3913 -9960 186 -13508
11859a3508O193J3592K2580o731P602k08J818q219n836M77l59J0644q86J391m139
$$ -13508 -7315 6277 28857 22126 29728 29520 31338 23119 17283 17760 17401 28045 27159 28550 24411
11844B4411j5028l464k221j3961L428R999J1225O793j2080j0323k834J1647K2966
$$ 24411 9383 5919 3698 -10263 -6835 3164 14389 21182 9102 -1221 -4055 7592 30558
11831C0558j45j2792p163O249P453L813K313j0740j5142l650N239J181j964j6848
$$ 30558 30413 17621 10458 16707 24160 27973 30286 19546 4404 754 5993 7174 5210 -11638
11817a1638J3371J9435J867j6143l706j269L242m476o761P76k363R86J5412r48
$$ -11638 1733 21168 23035 6892 3186 1917 5159 683 -6078 -5302 -7665 -6679 8733 7785
11803G785N536Q813J2012K255l994l851o984j595M768k228j2760n055R120J092
$$ 7785 13321 22134 34146 36401 32407 28556 21572 19977 24745 22517 9757 4702 13822 14914
11789A4914J3154J000j3859j1029j5838r458Q846M794j186O621n38r98J3369J7491
$$ 14914 28068 29068 15209 4180 -11658 -21116 -12270 -7476 -8662 -2041 -2579 -3577 9792 27283
11775B7283J0874L525j8471q951J513n474q892p72o560J8877l348n261n026o541
$$ 27283 38157 41682 23211 14260 15773 10299 1407 635 -5925 12952 9604 4343 -683 -7224
11761g224O392P04p022o875l36J6937M77K3038J0926j0216j4009j7052n777k488
$$ -7224 -832 -128 -7150 -14025 -14361 2576 3053 26091 37017 26801 12792 -4260 -10037 -12525
11747a2525j839r816P209J6154K1668J3465r560N129o043N872J0400n820j3506
$$ -12525 -14364 -24180 -16971 -817 20851 34316 24756 29885 23842 29714 40114 34294 20788
11734B0788j978q638j369J3203R655k4448m678J6444M433j94q543l361L017P563
$$ 20788 18810 10172 8803 22006 31661 7213 2535 18979 23412 23218 14675 11314 14331 21894
11720B1894J2122J1921q916J153J0254O788j3115j482j9822o35L478p63J0359
$$ 21894 34016 45937 37021 38174 48428 55216 42101 40619 20797 20162 23640 22877 33236
11707C3236j0970j4965N43p546n451J0473J1358m965P050Q806j2431N323j4459
$$ 33236 22266 7301 7844 298 -5153 5320 16678 11713 18763 27569 15138 20461 6002
11694F002q705J4581n769q755J5040K9135N031k2255k4109L027O568n41L419j5654
$$ 6002 -2703 11878 6109 -2646 12394 41529 46560 24305 196 3223 9791 9250 12669 -2985
11680b985K224J2721P449j5900Q212J5728n021j4381J6837p903q410k237N46O418
$$ -2985 -761 11960 19409 3509 11721 27449 22428 8047 24884 16981 8571 6334 6880 13298
11666A3298K7014K234k2303j0026j005J225O682O577o521j5006j1276J4438q18
$$ 13298 40312 42546 20243 10217 9212 10437 17119 23696 17175 2169 -9107 5331 4513
11653D513k671N968J7820J8112O367j3947p91p056Q179J054J281K420j6313j0474
$$ 4513 1842 7810 25630 43742 50109 36162 35371 28315 36494 37548 38829 41249 24936 14462
11639A4462k2942O605P857k3050J3547J9703R772m1j3774j0048M365J0444q639
$$ 14462 -8480 -1875 5982 -17068 -3521 16182 25954 25913 12139 2091 6456 16900 8261
11626H261p548p587Q300J8584J5914J2955l244r740m767k877R76l854J1112r616
$$ 8261 713 -6874 1426 20010 35924 48879 45635 35895 31128 28251 29227 25373 36485 26869
11612B6869q203O720K500o239J47j2906m012m11K836J2966J7410k679P4J0786
$$ 26869 18666 25386 27886 21647 21794 8888 4876 4465 7301 20267 37677 34998 35072 45858
11598D5858j85N831p711m385k747j9125j5411j4592p416J1445J3879J4293J983
$$ 45858 45673 51504 43793 39408 36661 17536 2125 -12467 -19883 -8438 5441 19734 21717
11585B1717j648l709R784k350r641m174N526r148M478K0211K1786J081j2655p862
$$ 21717 20069 16360 26144 23794 14153 9979 15505 6357 10835 31046 52832 53913 41258 33396
11571C3396r162j4750j5014l593K191q984L290J798N259J0176n666K082K559k519
$$ 33396 24234 9484 -5530 -9123 -6932 -15916 -12626 -10828 -5569 4607 -1059 1023 3582 1063
11557A063j396K152j374p999L226J1365J5564N395J1874K846r617n049j0930l884
$$ 1063 -333 1819 445 -7554 -4328 7037 22601 27996 39870 42716 33099 28050 17120 13236
11543A3236M524J7640L967k724j0139p756O520J0631K312o874q202j5405p025
$$ 13236 17760 35400 39367 36643 26504 18748 25268 35899 38211 31337 23135 7730 705
11530G05P998J3016K562O22J1548J734R587J8798j9074j8359m386Q42l835j1219
$$ 705 8703 21719 24281 24903 36451 38185 47772 66570 47496 29137 24751 25593 21758 10539
11516A0539l055J0644J3082P19J3755O209l345k0754N43Q046l408M429J370O847
$$ 10539 7484 18128 31210 31929 45684 51893 48548 27794 28337 36383 32975 37404 38774 45621
11502D5621O00q719O104k269j0872j4449j7942m210L2039Q076M336J9382J2254
$$ 45621 46221 37502 43606 41337 30465 16016 -1926 -6136 25903 33979 38315 57697 69951
11489F9951j4378j9937j480k133J8884J858k0479j103j471N134J1243J3198j1189
$$ 69951 55573 35636 34156 32023 50907 52765 32286 31183 29712 34846 46089 59287 48098
11476D8098k1104j4871O093J6146L266P058M498r191j2111k813J118J361n335
$$ 48098 26994 12123 18216 34362 37628 44686 49184 39993 27882 25069 26187 27548 22213
11463B2213r319Q29N690l192J5276J3165o985j8632O626J2829q734N213o647j973
$$ 22213 12894 13723 19413 16221 31497 44662 37677 19045 25671 38500 29766 34979 28332 26359
11449B6359J2873j1855l973J4056J1722QO83m148N99L023j9892O251K327j1505
$$ 26359 39232 27377 23404 37460 49182 49190 49873 45725 46324 49347 29455 35706 38033 26528
11435B6528j167J930M457Q18l933k939J1596K735p174J3784M56o538j0350N667
$$ 26528 25361 27291 31748 32566 28633 25694 37290 40025 32851 46635 47091 40553 30203 35870
11421C5870J5531J150K12r048K657Q370q533n921n550j4299n77J5446J7172Q362
$$ 35870 51401 52551 52763 43715 46372 54742 46209 40288 34738 20439 19862 35308 52480 60842
11407F0842k64j1150k001N916p171m350O65k450j513K298m112P313J2174q634
$$ 60842 60578 49428 47427 53343 46172 41822 42487 40037 38524 40822 36710 44023 56197 47563
11393D7563j6725k2831J146J1055L291O060P89j641J3314L601J4052P930j2967
$$ 47563 30838 8007 9153 20208 23499 29559 30348 28707 42021 45622 59674 67604 54637
11380E4637n040J2236k057m184O007K0709J250j4633j2185j6898P721K180n715
$$ 54637 49597 61833 59776 55592 61599 82308 83558 68925 56740 39842 47563 49743 44028
11367D4028m342K4701K189n281j502Q53k063j2262o012k699J281O71J0498L842
$$ 44028 39686 64387 66576 61295 59793 60646 58583 46321 40309 37610 38891 39562 50060 53902
11353E3902j552k072q665K0k931j8054j3792J2100P239J5339L1488J6162k6837
$$ 53902 52350 50278 41613 41633 38702 20648 6856 18956 26195 41534 73022 89184 62347
11340F2347n096J5586j0678j5905k677J793O310M649p305L182J0580R719J1425
$$ 62347 57251 72837 62159 46254 43577 45370 51680 56329 49024 52206 62786 72505 83930
11327H3930j0993M563P927Q547J0161k1321j8810k0700j0276j1554J588P120J309
$$ 83930 72937 77500 85427 93974 104135 82814 64004 43304 33028 21474 23062 30182 31491
11314C1491L911J6334R814K225Q747R388Q342o640M977j7720k579q269l451M366
$$ 31491 35402 51736 61550 63775 72522 81910 90252 83612 88589 70869 68290 60021 56570 60936
11300F0936J0483n765M750J0873m543j8020R22J780N898j5739j8844m927J1972
$$ 60936 71419 65654 70404 81277 76734 58714 59636 61416 67314 51575 32731 27804 39776
11287C9776J5589N488M503J2227j981j5957M760J1914J43k463m092j127k3511
$$ 39776 55365 60853 65356 77583 75602 59645 64405 76319 76462 73999 69907 68780 45269
11274D5269K424P189Q687j755J2205O516J9124J3633k7915j3423Q99q251j8166
$$ 45269 47693 54882 63569 61814 74019 80535 99659 113292 85377 71954 72853 64602 46436
11261D6436j0259J3664R328j0283N186J0099J1363k636m209n687j1196m195p404
$$ 46436 36177 49841 59169 48886 54072 64171 75534 72898 68689 63002 51806 47611 40207
11248D0207Q894R56R12J5756J6428R692R880k2146l49J0457m718L704j245k37
$$ 40207 49101 50057 50969 66725 83153 92845 102725 80579 80230 90687 85969 89673 88428 88191
11234H8191J747L51j1667j7549o479j592R469m119r082M846K9348J1442j2178
$$ 88191 89938 90289 78622 61073 54594 53002 62471 58352 49270 54116 83464 94906 82728
11221H2728p690J2355k237J251k676j0854J3202J8228J5611k8912j9741N860J3796
$$ 82728 75038 87393 85156 86407 83731 72877 86079 104307 119918 91006 71265 77125 90921
11208I0921k858J1017J3517J3001J5106n656m284m899O984m344L428J5909J7855
$$ 90921 88063 99080 112597 125598 140704 135048 130764 125865 132849 128505 131933 147842 165697
11195A65697K9641J7278M5192N3161N0146Q2700J23230K02348K62478K77908K18486
$$ 165697 195338 212616 257808 310969 361115 443815 567045 769393 1031871 1309779 1528265
11184A528265M4378j64712l05517k63380j92802j24594p8601n8524l8678j5463
$$ 1528265 1572643 1407931 1102414 839034 646232 521638 443037 384513 345835 330372
11174C30372k7355k5883j954k670j3418o268j6593j0173L515q609j3885n795l068
$$ 330372 303017 277134 275180 272510 259092 252824 236231 226058 229573 220964 207079 201284 198216
11161A98216j1195J962q444j1568n785j5546O084J7299q699K730J341L924j0971
$$ 198216 187021 188983 180539 168971 163186 147640 153724 171023 162324 165054 166395 170319 159348
11148A59348r542J338q546J1237J7406l443k0643O140J645K564K647m766j73J8942
$$ 159348 149806 151144 142598 153835 171241 167798 147155 153295 154940 157504 160151 155385 155212 174154
11134A74154N859q667j1133J638j400p312p861j0421M11J0641q107p249n958n250
$$ 174154 180013 171346 160213 161851 160451 153139 145278 134857 135268 145909 137802 130553 124595 119345
11120A19345O427Q347N584k69m329n673j60l310j951k451J6962M277k896J3436
$$ 119345 125772 134119 139703 139434 135105 129432 129272 125962 124011 121560 138522 142799 139903 153339
11106A53339n352j557O362j6097o598J1758K3386j4889j3084q434j2799p75Q449
$$ 153339 147987 146430 152792 136695 130097 141855 165241 150352 137268 128834 116035 115260 123709
11093A23709Q007J500K832n247p931m286L187j707j5389r945r924J7443J8372
$$ 123709 131716 133216 136048 130801 122870 118584 121771 120064 104675 94730 84806 102249 120621
11080A20621L30J9258M969k1603L554o033M010O527p447J4074K4550M939m940
$$ 120621 120951 140209 145178 123575 127129 121096 125106 131633 124186 138260 162810 167749 162809
11067A62809r246j1410k2056k634Q910k688L949J6047J5100k7081l518L5038J6822
$$ 162809 153563 142153 120097 117463 126373 123685 127634 143681 158781 131700 128182 163220 180042
11054A80042l402j330N779k2471l615J1539l842m827K1985J7651J3624n690N07
$$ 180042 176640 175310 181089 158618 155003 166542 162700 157873 179858 197509 211133 205443 205950
11041B05950J2335P590J5745L995k548p519J4979J3008o403M794O184n883L735
$$ 205950 218285 225875 241620 245615 243067 235548 250527 263535 257132 261926 268110 262227 265962
11028B65962L58m879q341L071q577j5899k829j6228M095j0j4092m910J7622p54
$$ 265962 266320 261441 253100 256171 247594 231695 228866 212638 216733 216723 202631 197721 215343 214589
11014B14589Q966k452K185j696q063k0179O334q992j9391K662P971K5896l983
$$ 214589 223555 221103 223288 221592 213529 193350 199684 190692 171301 173963 181934 207830 203847
11001B03847p210j487J2777J0162J0570j724j1310J355o15J0137J7795l449Q951
$$ 203847 196637 195150 207927 218089 228659 226935 215625 216980 216365 226502 244297 240848 249799
10988B49799P968J8590m434m103J00j4330J097j382J0685Q164L2263L3398L5241
$$ 249799 257767 276357 271923 267820 267920 253590 254687 253305 263990 272154 304417 337815 373056
10975C73056N4831L0655J973j401j6360k6541n5543p2889n7070m4049j9609n117
$$ 373056 427887 458542 460515 459114 442754 416213 360670 287781 230711 186662 167053 161936
10963A61936M095M254r424J73m656k0011j5029J4490K4322Q000K1007J3414j0952
$$ 161936 166031 170285 160861 161034 156378 136367 121338 135828 160150 168150 189157 202571 191619
10950A91619j108j446m965K5957J2918L084J8552J952k769M703j0909p46n449
$$ 191619 190511 189065 184100 210057 222975 226059 244611 246563 243794 248497 237588 236842 231393
10937B31393K6703R511j0859j1536O656K4610J5621J0329R613J2095J536l5479
$$ 231393 258096 267607 256748 245212 251868 276478 292099 302428 312041 324136 325672 290193
10925B90193j3595n597j6315j5935n7Q407K3421J6106P466J0631J3260j1558l025
$$ 290193 276598 271001 254686 238751 238694 247101 270522 286628 294094 304725 317985 306427 303402
10912C03402m36K5343K7336N1220L3664M755K7762L3224j2262kj1253m756L645
$$ 303402 302966 328309 355645 406865 440529 445284 473046 506270 494008 494006 482753 477997 481642
10899D81642K9724M3629K4044M063J1031K2148k87k896q27n540R658P296k9033
$$ 481642 511366 554995 579039 583102 594133 616281 615994 613098 612271 606731 616389 623685 594652
10886E94652m1080j4594J8093O826J7897J9443M528K17O60O101J6989J7485l58
$$ 594652 553572 538978 557071 563897 581794 601237 605765 605982 606642 612743 629732 647217 646859
10873F46859J8665O667R782J8521J2154Q460M503J6090K1939J5866K9506R810
$$ 646859 665524 672191 681973 700494 712648 721108 725611 741701 763640 779506 809012 818822
10861H18822L504K75N641N239j5769k6251k331J4476L0959L7411N3464M8689L5947
$$ 818822 822326 822601 828242 833481 817712 791461 789130 803606 834565 871976 925440 974129 1010076
10848A010076M6781N2963N9807N4141M4473N2336M3099J5871J4529L7955J7588
$$ 1010076 1056857 1109820 1169627 1223768 1268241 1320577 1363676 1379547 1394076 1432031 1449619
10837A449619L5446K6993K3270M4534O0426P5132O9583O7160M9796N4478P5530
$$ 1449619 1485065 1512058 1535328 1579862 1640288 1715420 1785003 1852163 1901959 1956437 2031967
10826B031967P8569P6197M6090N1461O2553M4631J9353K7396P4237J25226J41122
$$ 2031967 2110536 2186733 2232823 2284284 2346837 2391468 2410821 2438217 2512454 2637680 2778802
10815B778802J35085J46180J67953J99983K35072K45657L03701L54234L72691
$$ 2778802 2913887 3060067 3228020 3428003 3663075 3908732 4212433 4566667 4939358
10806D939358M10361M16251M67980N51968P21474R26311J141160J233622J098561
$$ 4939358 5349719 5765970 6233950 6785918 7507392 8433703 9574863 10808485 11907046
10797A1907046P88442N90407Q01794J240531J770076K316629K963407L853332
$$ 11907046 12695488 13285895 14087689 15328220 17098296 19414925 22378332 26231664
10789B6231664N088360O793525R366971J3565036K0565895L1419198M5027112
$$ 26231664 31320024 38113549 47480520 61045556 81611451 113030649 158057761
10782A58057761N3128810M6473319K4103581j6997902n3891616n6038739l8658902
$$ 158057761 211186571 257659890 281763471 264765569 210873953 154835214 116176312
10775A16176312k4129156j6002665j1484593q564857o407159m832157l795474
$$ 116176312 92047156 76044491 64559898 55995041 49587882 44755725 40960251
10768D0960251l163022k627472k128377j680463j356055j181511j132319j183236
$$ 40960251 37797229 35169757 33041380 31360917 30004862 28823351 27691032 26507796
10760B6507796j340940j543195j592093j413141j166646r70285q42322p73528
$$ 26507796 25166856 23623661 22031568 20618427 19451781 18481496 17639174 16865646
10752A6865646p43242p13483p08650o57484o00721n53770n26481n15658n10034
$$ 16865646 16122404 15408921 14700271 14042787 13442066 12888296 12361815 11846157 11336123
10743A1336123m77091m97642m88974m41470l69683l20112k79740k26371j96828
$$ 11336123 10859032 10361390 9872416 9430946 9061263 8741151 8461411 8235040 8038212
10734H038212j92426j85550j87625k12172k00078j66094j41827j17468j15862
$$ 8038212 7845786 7660236 7472611 7260439 7060361 6894267 6752440 6634972 6519110
10725F519110j51180j58283j59212j47415j36886j54182j42474j28275j14088
$$ 6519110 6367930 6209647 6050435 5903020 5766134 5611952 5469478 5341203 5227115
10716E227115j12092j20442j06151q4097o7144n9198l5280k0829l0694l9263m9812
$$ 5227115 5115023 4994581 4888430 4804333 4737189 4677991 4642711 4621882 4591188 4551925 4502113
10705D502113p5955p4580p0317p1337n5190o6089p1118l8339m1136l4760k011
$$ 4502113 4426158 4351578 4281261 4209924 4154734 4088645 4017527 3979188 3938052 3903292 3901281
10694C901281J363j6223q577q092m0949p3280j07862j24654j40762j36069j50236
$$ 3901281 3902644 3886421 3877844 3869752 3828803 3755523 3647661 3523007 3382245 3246176 3095940
10683C095940j42326j14677j01001q2543p9317p4824q3806o1059p7630q9664r6105
$$ 3095940 2953614 2838937 2737936 2655393 2576076 2501252 2417446 2356387 2278757 2189093 2092988
10672B092988p1000m1944l2324l5515j5164k2266l0539k1572o525L444O096o001
$$ 2092988 2021988 1980044 1947720 1912205 1897041 1874775 1844236 1822664 1816139 1819583 1825679 1819678
10660A819678j2216l201n63n579n0237p6120p7703n9040p5789j06278r8143o3474
$$ 1819678 1807462 1804261 1803698 1798119 1747882 1671762 1594059 1535019 1459230 1352952 1254809 1191335
10648A191335o0681q5619p9951o7605n2510l4933k2254r941k9747n7516l5403
$$ 1191335 1130654 1045035 965084 897479 844969 810036 787782 777841 748094 690578 655175
10637F55175k7836l6358j1785k2047n2458n7493l9283j5942Q331l514l0093l0793
$$ 655175 627339 590981 579196 557149 504691 447198 407915 391973 400304 396790 366697 335904
10625C35904l2362j9485k997J3337L935l647r968p070k906j439j6075n817N675
$$ 335904 303542 284057 281060 294397 298332 294685 284717 277647 274741 273302 257227 251410 257085
10612B57085J646P06Q984J5545L965J3152L1176J7895P024j843n942j893k1179
$$ 257085 258731 259437 268421 283966 287931 301083 332259 350154 357178 355335 349393 347500 326321
10599C26321p839L242k66N090m2444m2819n5665n5161n3587n5554l8037o383O433
$$ 326321 318482 321724 321458 326548 284104 241285 185620 130459 76872 21318 -16719 -23102 -16669
10586a6669J6165L0294M0458L6724L1348K4731J9243L823j2303k0421J2898J155
$$ -16669 -504 29790 70248 106972 138320 163051 182294 186117 173814 153393 166291 167446
10574A67446j8769q043L687J7903R991J8060J4677N527j1823l511O484l1087o025
$$ 167446 148677 140634 144321 162224 172215 190275 204952 210479 198656 195145 201629 170542 164517
10561A64517M817J88L564K159j427J1914N211r935k2557j9015o115r833Q166O841
$$ 164517 169334 169522 173086 175245 173818 185732 190943 181008 158451 139436 133321 123488 131654 138495
10547A38495j3177k577j4036P261P345P497J2381J374j6715o296N619J411o733
$$ 138495 125318 122741 108705 115966 123311 130808 143189 144563 127848 121552 127171 128582 121849
10534A21849k504O027K569M031N111J682L978J0885o14j0978j2362j1844K083
$$ 121849 119345 125372 127941 131972 137083 138765 142743 153628 153014 142036 129674 117830 119913
10521A19913k6883j6862J819m536K589K2437J8358n075k9341k0463J23R768j5330
$$ 119913 93030 76168 77987 73451 76040 98477 116835 111760 82419 61956 62079 71847 56517
10508E6517k7000j5390o152L891m038M502J9005O600j4215m645l04k4051J0110
$$ 56517 29517 14127 7975 11866 7828 12330 31335 37935 23720 19075 18771 -5280 4830
10495D830J7597j955n612j720m397k036p202J7207l957n120r195j7205p006J8761
$$ 4830 22427 20472 14860 13140 8743 6707 -495 16712 12755 7635 -1560 -18765 -25771 -7010
10481g010J1096J9389J4006l0667o084K2379Q285j0707r703q130k77P501J372
$$ -7010 4086 23475 37481 6814 730 23109 31394 20687 10984 2854 2577 10078 11450
10468A1450m964j5183m149M168K844l806P334J2583K650j1053n945q509j5696
$$ 11450 6486 -8697 -12846 -8678 -5834 -9640 -2306 10277 12927 1874 -4071 -12580 -28276
10455b8276J4387N452k1176J7220J4671P954J1150N462P025J442j2372k6917J5146
$$ -28276 -13889 -8437 -29613 -12393 2278 10232 21382 26844 33869 35311 22939 -3978 11168
10442A1168N605q077K9727r446l8063o059R085l797o427J3045L039j817n413m452
$$ 11168 16773 8696 38423 28977 -9086 -15145 -6060 -9857 -16284 -3239 -200 -2017 -7430 -11882
10428a1882j55L464L924j953J1410j214j1589P493K5482p911q826K003N142q669
$$ -11882 -12037 -8573 -4649 -6602 4808 3594 -7995 -502 24980 17069 8243 10246 15388 6719
10414F719L57J1024J265N966Q941l563K351p070J381O506J2937k780m225j9717
$$ 6719 7076 18100 19365 25331 34272 30709 33060 25990 27371 33877 46814 44034 39809 20092
10400B0092J780Q349Q224j3456j4622O176J4892Q657K121M310P215J8045J7567
$$ 20092 21872 30221 38445 24989 10367 16543 31435 40092 42213 46523 53738 71783 89350
10387H9350M39p685L180M947j176J3347L0617L1922L1125M5170L7887P4862J22701
$$ 89350 89789 82104 85284 90231 89055 102402 133019 164941 196066 241236 279123 353985 476686
10374D76686J96126K60327K83231K06935P0218j61737l10023k80487j76342r6721
$$ 476686 672812 933139 1216370 1423305 1493523 1331786 1021763 741276 564934 468213
10364D68213o6309n3453m3717l2393k6464k9363k7529n707q578j62J1827J1700
$$ 468213 401904 348451 304734 272341 245877 216514 188985 183278 174700 174538 186365 198065
10352A98065r007k2658k5599o254j2625J083k635k6167j4699J2492N623l553n220
$$ 198065 189058 166400 140801 134547 121922 123005 120370 94203 79504 91996 97619 94066 88846
10339H8846k3832l279Q432K942j4893j0638O226J2279j4976j2147n572P692O122
$$ 88846 65014 61735 70167 73109 58216 47578 53804 66083 51107 38960 33388 41080 47202
10326D7202M489m277j8161j3184J791K601J70L177j3387J056O198M450J4943J836
$$ 47202 51691 47414 29253 16069 17860 20461 20631 23808 10421 11477 17675 22125 37068 38904
10312C8904j5742j204N773J1933N159J3414o544j8511J3278O437J967j8263k3443
$$ 38904 23162 21958 27731 39664 44823 58237 51693 33182 46460 52897 54864 36601 13158
10299A3158j5387N169N271K1334O310O155M926j4530j1006O270m989Q381N471
$$ 13158 -2229 2940 8211 29545 35855 42010 46936 32406 21400 27670 22681 31062 36533
10286C6533o731l682j6800j7824k330K510J0409O87j219J4695K0918O545m64k0473
$$ 36533 29802 26120 9320 -8504 -10834 -8324 2085 2772 1553 16248 37166 43711 43247 22774
10272B2774j9372R095l99r006J390J4813j8417k3632N364M228n8K527L267R272
$$ 22774 3402 12497 12098 3092 4482 19295 878 -22754 -17390 -13162 -13220 -10693 -7426 1846
10258A846k2751p876R290M0Q185L88M188P771k1425j6208J238k881J1580R034
$$ 1846 -20905 -28781 -19491 -19451 -11266 -10878 -6690 1081 -20344 -36552 -35314 -38195 -26615 -17581
10244a7581J981R467J0040m089j8554J2742l672Q711P274O135M76j8580k21J666
$$ -17581 -15600 -6133 3907 -182 -18736 -5994 -9666 -955 6319 12454 12930 -5650 -5871 -4205
10230d205k0999Q075N361P979k977l429K071Q39J728j2096n116K0625O930o707
$$ -4205 -25204 -17129 -11768 -3789 -6766 -10195 -8124 -7285 -5557 -17653 -22769 -2144 4786 -1921
10216a921o571J0433K610J0560J0227J52O086q33j6640j4545l083r18j2037m194
$$ -1921 -8492 1941 4551 15111 25338 25490 31576 30743 14103 -442 -3525 -4443 -16480 -20674
10202b0674J3680J649N041n322R406m640J2993o48k2807p473J1803J5914J6800
$$ -20674 -6994 -5345 -304 -5626 3780 -860 12133 11485 -11322 -18795 -6992 8922 25722
10189B5722R081M605j279k372L007j331k358r105j7134j4461O679R690r674j5789
$$ 25722 34803 39408 38129 35757 38764 37433 35075 25970 8836 -5625 1054 10744 1070 -14719
10175a4719O22J1970l596j4645O753J2609J4704K649j5830l466J3616O176j0501
$$ -14719 -14097 -2127 -5723 -20368 -13615 -1006 13698 16347 517 -2949 10667 16843 6342
10162F342q913O051K2512J1992j6326j8837L239M134j295p217j386j3486O629
$$ 6342 -2571 3480 25992 37984 21658 2821 6060 10194 8899 1682 296 -13190 -6561
10149f561K910j0961o114J3059J5879m807J5750q34K130N830k432j8816k9745
$$ -6561 -3651 -14612 -20726 -7667 8212 3405 19155 18321 20451 26281 23849 5033 -24712
10136b4712r578Q395K7821L0960K1680j8013k9520O973J1676k409j385o288P524
$$ -24712 -34290 -25895 1926 32886 54566 36553 7033 14006 25682 23273 21888 15600 23124
10123B3124l858R053P094k1488J4998L834o650N025P307j8369o487L854j2359
$$ 23124 19266 28319 35413 13925 28923 32757 26107 31132 38439 20070 13583 17437 5078
10110E078Q419j7138p669J2607J4320J2454Q041R4j1909j7313o637R687K360j6643
$$ 5078 13497 -3641 -11310 1297 15617 28071 36112 36206 24297 6984 347 10034 12394 -4249
10096d249r745K5098J3871J007P848L67k96k1819k5796P465J3770o323j2615J5213
$$ -4249 -13994 11104 24975 25982 33830 34197 33901 12082 -13714 -6249 7521 1198 -11417 3796
10082C796Q486j8229J755O941o423j7171O622K1609J8342j6778j3985q171p012
$$ 3796 12282 -5947 -4192 2749 -3674 -20845 -14223 7386 25728 8950 -5035 -13206 -20218
10069b0218R283J3400r865j179N126R72J0617o596p324K387J013J0700M797o398
$$ -20218 -10935 2465 -7400 -8579 -3453 -2481 8136 1540 -5784 -3397 -2384 8316 13113 6715
10055F715K687K034l301n879J3333K2381j3780j6768J6693J0750L829L203q559
$$ 6715 9402 11436 8135 2256 15589 37970 24190 7422 24115 34865 38694 41897 33338
10042C3338J310k2699j5488O55P308J633l27m552j8975N901M442R659M28J0633
$$ 33338 34648 11949 -3539 -2884 4424 6057 5730 1178 -17797 -11896 -7454 2205 2633 13266
10028A3266J9093j4710j4896o171L611n860j3780N958m121K210k42J9372J1888
$$ 13266 32359 17649 2753 -3418 193 -5667 -19447 -13489 -17610 -15400 -15642 3730 15618
10015A5618L262p509M061J094j9200n702J748Q15Q206j0576j7444N57O637m968
$$ 15618 18880 11371 15432 16526 -2674 -8376 -6628 -5813 2393 -8183 -25627 -25070 -18433 -23401
10001b3401K707J676K1215K062j3572R527n13j5984J0760L7416K1377j5794j0694
$$ -23401 -20694 -19018 2197 4259 -9313 214 -299 -16283 -5523 31893 53270 37476 26782
9988B6782o38q392n202J855j681m996L782r037j3692J5127K3929k1452r027k94
$$ 26782 26144 17752 12550 14405 12724 7728 11510 2473 -11219 3908 27837 6385 -2642 -2936
9974b936J0242L095j3035j433M017m986J0007N184j0978M089r916M095L855j6074
$$ -2936 7306 10401 -2634 -4067 -50 -5036 4971 10155 -823 3266 -6650 -2555 1300 -14774
9960a4774M625J4010J6225n547p137o085l77j1329j9324l009J961rm784P728J7444
$$ -14774 -10149 3861 20086 14539 7402 1317 940 -10389 -29713 -32722 -30761 -30770 -35554 -27826 -10382
9945a0382J2714n478N797j3227l402r833J9191J7259m094J64j9499j769n370J4781
$$ -10382 2332 -3146 2651 -10576 -13978 -23811 -4620 12639 8545 8709 -10790 -12559 -17929 -3148
9931c148J7413q365k2879k567P620J4830J3379m91j209P564J5247m579K863j2816
$$ -3148 14265 5900 -16979 -19546 -11926 2904 16283 15792 14583 22147 37394 32815 35678 22862
9917B2862m749k687j0468R825n442R70J1529L573M09p268n095j0731m315o546
$$ 22862 18113 15426 4958 14783 9341 10311 21840 25413 25822 18554 13459 2728 -1587 -8133
9903h133Q624M112O120j2040o43M748p717O199J2801p82j1228P869L102n087R790
$$ -8133 491 4603 10723 -1317 -1960 2788 -4929 1270 14071 13289 2061 9930 13032 7945 17735
9888A7735q007o571r976j5783j2646L094K0745K4275m275j452J8008qk7243q264
$$ 17735 9728 3157 -6819 -22602 -35248 -32154 -11409 12866 8591 7139 25147 25139 -2104 -10368
9874a0368r2J4508J5743n322j9967p195J0454L861M125k032K104j661P094N731
$$ -10368 -10460 4048 19791 14469 -5498 -12693 -2239 1622 5747 3715 5819 4158 11252 16983
9860A6983j5646j3196R145m29p410Q178o558j9382J7559J6724J5119p381M928
$$ 16983 1337 -11859 -2714 -3143 -10553 -2375 -8933 -28315 -10756 5968 21087 13706 18634
9847A8634j5993j0812m911p377n780J1646K5062J1004j7511r171j371J788K579
$$ 18634 2641 -8171 -13082 -20459 -26239 -14593 10469 21473 3962 -5209 -6580 -4792 -2213
9834b213k20k749N205J216j5857j245K0937J4028R911J773j6236j9036L735q791
$$ -2213 -2433 -5182 23 1239 -14618 -15863 5074 19102 29013 30786 14550 -4486 -751 -9542
9820i542j2791M262k166M989J3149j2864J871K5483K246j5476j4530k4989q275
$$ -9542 -22333 -18071 -20237 -15248 -2099 -14963 -13092 12391 14637 -839 -15369 -40358 -48633
9807d8633P127J3657K769J7016J3896N022r622j2149N984m48j1569M067N452j0171
$$ -48633 -41506 -27849 -25080 -8064 5832 10854 1232 -10917 -4933 -5381 -16950 -12883 -7431 -17602
9793a7602L24M198j633J2312L669N296j2990j117J5515n708r814k095j427Q029
$$ -17602 -17278 -13080 -14713 -2401 1268 6564 -6426 -7543 7972 2264 -7550 -9645 -11072 -3043
9779c043J7310R866j6829p864l777n342l692l480j478J1599j10jj881o579j4954
$$ -3043 14267 24133 7304 -560 -4337 -9679 -13371 -16851 -18329 -6730 -6840 -6841 -8722 -15301 -30255
9764c0255P196J1751k914o716J1095J4946k592j2947O904j867n448l532J0861
$$ -30255 -23059 -11308 -14222 -20938 -9843 5103 2511 -10436 -3532 -5399 -10847 -14379 -3518
9751c518L03m029N246p577j988j0400l269J2617J2268n971n100J260k877n44n23
$$ -3518 -3215 -7244 -1998 -9575 -11563 -21963 -25232 -12615 -347 -6318 -11418 -10158 -13035 -13579 -14102
9736a4102R495q397K932K1373L176q323j488Q451q481j2780K653J3271p377R309
$$ -14102 -4607 -13004 -10072 11301 14477 6154 4666 13117 4636 -8144 -5491 7780 403 9712
9722I712k633L650R110o012p500o884p588L149j04j5903j502J5199O106j4307
$$ 9712 7079 10729 19839 13827 6327 -557 -8145 -4996 -5100 -21003 -22505 -7306 -1200 -15507
9708a5507j1647J2132K806m120J1179J6913J1046r145P048J8725l692j6815k2390
$$ -15507 -27154 -15022 -12216 -16336 -5157 11756 22802 13657 20705 39430 35738 18923 -3467
9695c467j2624P300M599l218j1200J550o951k39r758J1330J1443j334J883J6294
$$ -3467 -16091 -8791 -4192 -7410 -18610 -17060 -24011 -24250 -34008 -22678 -11235 -12569 -10686 5608
9681E608O528j2723o207L166N094M151p395O263J3120j5694j8536j818l440J5069
$$ 5608 12136 -587 -6794 -3628 1466 5617 -1778 4485 17605 1911 -16625 -18443 -21883 -6814
9667f814J3741J7230j3269j8462K203K157M674Q978p774j305l619m08j1959j034
$$ -6814 6927 24157 10888 -7574 -5371 -3214 1460 10438 2664 1359 -2260 -2668 -14627 -15661
9653a5661L5377K619j6143j9046k002p106Q069J1191Q956m043o584p390j372N59
$$ -15661 19716 22335 6192 -12854 -14856 -21962 -13893 -2702 6254 2211 -4373 -11763 -13135 -12576
9639a2576p348J7140Q814m352j226k780O926q664j5380j0354J5271K1440j574
$$ -12576 -19924 -2784 6030 1678 452 -2328 4598 -4066 -19446 -29800 -14529 6911 5337
9626E337k760J5910K316k3790j982j4008o955J4636Q738q938J0977M655j187j8787
$$ 5337 2577 18487 20803 -2987 -4969 -18977 -25932 -11296 -2558 -11496 -519 4136 2949 -15838
9612a5838j0402l330R660l72q377j529J4776O896j2235j364m666p033J8533L714
$$ -15838 -26240 -29570 -19910 -20282 -28659 -30188 -15412 -8516 -20751 -22115 -26781 -33814 -15281 -11567
9598a1567m728J9283K591q740k702m47q17J0801J2577j282J28o490r523P800k068
$$ -11567 -16295 2988 5579 -3161 -5863 -6310 -7127 3674 16251 14969 15097 8607 -916 6884 4816
9583D816p015J3348P331l88j6662l996j3948o751J0864K0958K2802o733k4270
$$ 4816 -2199 11149 18480 18092 1430 -2566 -16514 -23265 -12401 8557 31359 24626 356
9570C56p361j5860j1090m877L3061J6837n095j2870j6366j4028n504P840R910
$$ 356 -7005 -22865 -33955 -38832 -5771 11066 5971 -6899 -23265 -37293 -42797 -34957 -25047
9557b5047K165K81J1621J1395l438J3532m50q898k062q722k6635R858O037k124
$$ -25047 -22882 -22601 -10980 415 -3023 10509 10059 1161 -901 -9623 -36258 -26400 -20363 -22487
9543b2487j641K2288L0938J6936K108j4656j6711j5193p82P714q627q489P135
$$ -22487 -24128 -1840 29098 46034 48142 33486 16775 1582 800 8514 -113 -8602 -1467
9530a467J78J552L399J681j691J1293k1714j9255n701J5009O35j1212K376J9287
$$ -1467 -1289 263 3662 5343 3652 14945 -6769 -26024 -31725 -16716 -16081 -27293 -24917 -5630
9516e630O015J3852k884o200j330j6510k7239O581O444K827Q552R444n531j742
$$ -5630 385 14237 11353 5153 3823 -12687 -39926 -33345 -26901 -24074 -15522 -6078 -11609 -13351
9502a3351j683K3443M702R091r012m251j5047k060L58l616J9400j812l207r646
$$ -13351 -15034 8409 13111 22202 13190 8939 -6108 -8168 -7810 -11426 7974 6162 2955 -6691
9488f691k563J0456J021O273L354j6247j3376J1848P821j2636k226P741K754K4515
$$ -6691 -9254 1202 2223 8496 11850 -4397 -17773 -5925 1896 -10740 -12966 -5225 -2471 22044
9474B2044K2204l150l4934k1855L475J631R78j419o574n941J5913J7371J502L04
$$ 22044 44248 41098 6164 -15691 -12216 -10585 -9607 -11026 -17600 -23541 -7628 9743 11245 11549
9460A1549L688R846j4601j77R692L442m754O914R382n709m104j6903j6719j4210
$$ 11549 15237 25083 10482 10305 19997 23439 18685 25599 34981 29272 25168 8265 -8454 -22664
9446b2664k262M990n179N654k880J131K5567P181k069P72l844l298m259O660m419
$$ -22664 -24926 -19936 -25115 -19461 -22341 -21210 4357 11538 9469 10241 6397 3099 -1160 5500 1081
9431A081R849l227l491N129L290N784M326p950r426r279j0757L322J5705p156
$$ 1081 10930 7703 4212 9341 12631 18415 22741 14791 5365 -3914 -14671 -11349 4356 -2800
9417b800J5309J9576L014j0890K588l490j4122N04k459l42P501J1212P43J6123
$$ -2800 12509 32085 35099 24209 26797 23307 9185 9689 7230 6888 14389 25601 26344 42467
9403D2467k76j2648m460P40j0550p32Q139j6251p732J1543p234m738J3277J1739
$$ 42467 42191 29543 25083 25823 15273 14541 22680 6429 -1303 10240 3006 -1732 11545 23284
9389B3284M325j4611j5189J540L599P635K702q884R23J1155J7250p830p216k098
$$ 23284 27609 12998 -2191 -651 2948 10583 13285 4401 5324 16479 33729 25899 18683 16585
9375A6585j4325o467J3474J0464J51J0966p910j2293J1691m076L283k198m229
$$ 16585 2260 -4207 9267 19731 19882 30848 22938 10645 22336 18260 21543 19345 15116
9362A5116l017n822j3026l650J1352L324n145o029O237K624K771Q636N865J3172
$$ 15116 12099 6277 -6749 -10399 953 4277 -868 -6897 -660 1964 4735 13371 19236 32408
9348C2408J6119j148L85r561p629j2883k658p459l949J1710j5309Q579J2922p108
$$ 32408 48527 47379 47764 38203 30574 17691 15033 7574 3625 15335 26 8605 21527 14419
9334A4419j0553J3612J3923j5334J0099J0461q325l101j0857m706J9690R82K151
$$ 14419 3866 17478 31401 16067 26166 36627 28302 25201 14344 9638 29328 30310 32461
9321C2461o58j60p103j68R451M865k3935j9849K1676K1852n628J0657P256j0936
$$ 32461 31803 31643 24540 24372 33823 38688 14753 -5096 16580 38432 32804 43461 50717 39781
9307C9781l857n246J1810J2140k426j0530Q88L871M468n548j8773m025M138L535
$$ 39781 35924 30678 42488 54628 52202 41672 42560 46431 50899 45351 26578 22553 26691 30226
9293C0226M342p047J529l754K357J7005N950k2256j9286m580J0953J7125L518
$$ 30226 34568 27521 29050 25296 27653 44658 50608 28352 9066 4486 15439 32564 36082
9280C6082j1598j320J0126P840o006q186p79J1777J4506q140M477L023k640p733
$$ 36082 24484 23164 33290 41130 35124 26938 26159 37936 52442 44302 48779 51802 49162 41429
9266D1429k720j269m7M20M540R530J6532n258q230k340K324j1559j354M029J8559
$$ 41429 38709 37440 37393 37813 42353 51883 68415 63157 54927 52587 54911 43352 41998 46027 64586
9251F4586J6351j2609j1404j7130p15J3626p517J0478J2564L557J206j3795q001
$$ 64586 80937 68328 56924 39794 39079 52705 45188 55666 68230 71787 72993 59198 51197
9238E1197j894K3956J4021M54N425k428j5343k867O403M032j571M105R804K3553
$$ 51197 49303 73259 87280 87734 93159 90731 75388 72521 78924 82956 81385 85490 95294 118847
9224A18847J327m157Rl394o132o200K5880L5804r145k6811M905N132r282j049
$$ 118847 120174 116017 116026 112632 106500 100300 126180 161984 152839 126028 130933 136065 126783 125734
9210A25734j6710J488J1889j0125j833P928m422J5494J6560J7119k173n247j580
$$ 125734 109024 110512 122401 112276 110443 118371 113949 129443 146003 163122 160949 155702 154122
9197A54122O195l310Q452Q183j74P976Q817J3385p579N225N481O142K547k968
$$ 154122 160317 157007 165459 173642 173468 181444 190261 203646 196067 201292 206773 212915 215462 212494
9183B12494j0634K3753K0475K8105l268o951p264m277k903k502J0031j236O446
$$ 212494 201860 225613 246088 274193 270925 263974 256710 252433 249530 247028 257059 255823 262269
9170B62269J9711J7570J2643N779J1894J4304q952l11J3645J1689N379J8573N204
$$ 262269 281980 299550 312193 317972 329866 344170 335218 334907 348552 360241 365620 384193 389397
9157C89397K145K8443J0303k0001p782K0353K1464Q197K5886M5039M816q780N823
$$ 389397 391542 419985 430288 410287 402505 422858 444322 452519 478405 523444 528260 519480 525303
9144E25303J7365K9778J9724M551M779Q063K0302J8169K459J4937J5951J4113
$$ 525303 542668 572446 592170 596721 601500 609563 629865 648034 650493 665430 681381 695494
9132F95494K101K4093J4519J7714K3590L930p022O057K2578J9221P651O961N123
$$ 695494 697595 721688 736207 753921 777511 781441 774419 780476 803054 822275 829926 836887 842010
9119H42010N221M270M306p038K965J0164K51M4l882r450k82p586j8973L404n988
$$ 842010 847231 851501 855807 848769 851734 861898 862149 862193 858311 848861 848579 840993 822020 825424 819436
9104H19436r040j0017j2409j5693p559J2922M576j2544j5884j3386p640k851j5997
$$ 819436 810396 800379 787970 772277 764718 777640 782216 769672 753788 740402 732762 729911 713914
9091G13914j2376r786Q727k1429k7999k0858j1325m545J0607l440k6574k6380
$$ 713914 701538 691752 700479 679050 651051 630193 618868 614323 624930 621490 594916 568536
9079E68536j3152o309J0344j3848l6259j5106J615j948o505m573k933l892j755
$$ 568536 555384 549075 559419 545571 509312 494206 495821 493873 487368 482795 479862 475970 474215
9066D74215q918j8311q712j1285j8722p943j86q290r224j4885o304j5680o84J2833
$$ 474215 465297 446986 438274 426989 408267 400324 400138 391848 382624 367739 361435 345755 345071 357904
9052C57904k432k6884p907k834N934j626r523r735j2073k231p488n775j1977Q539
$$ 357904 355472 328588 320681 317847 323781 322155 312632 302897 290824 288593 281105 275330 263353 271892
9038B71892N069j0508j5694J4989j231p70k949N223o67n177k3509j7010P809J2638
$$ 271892 276961 266453 250759 265748 264517 263747 260798 266021 265354 260177 236668 219658 227467 240105
9024B40105l432j2305m39m595j5347j0166m51P095L728j2736k5843n883K451k18
$$ 240105 236673 224368 223929 219334 203987 193821 193370 200465 204193 191457 165614 159731 162182 161964
9010A61964k930N34K4851j674j108J2656j8873o483J595j5813N297J0046j3972
$$ 161964 159034 159568 184419 182745 181637 194293 175420 168937 170532 154719 160016 170062 156090
8997A56090m786n60l792L343O126J607n405j8408K672L365r113j7851P036j7627
$$ 156090 151304 150744 146952 150295 156421 158028 152623 134215 136887 140252 131139 113288 120324 102697
8983A02697m411K349J4458J9483K2576k750k3161n340J1310P849k2423j3044k7027
$$ 102697 98286 100635 115093 134576 157152 154402 131241 125901 137211 145060 122637 109593 82566
8970H2566O496L155n948O966j064J554J933n30j2303L224J0264j4598K050K7580
$$ 82566 89062 92217 86269 93235 92171 93725 95658 95128 82825 86049 96313 81715 83765 111345
8956A11345j1189j1946q165K920O115l859o845l24J4354R344o002n739k2124k1423
$$ 111345 100156 88210 80045 82965 89080 85221 78376 78052 92406 101750 95748 90009 67885 46462
8942D6462k610J682q594j4233M335L038J0560n82N229L13K709N47l110Q299m166
$$ 46462 43852 45534 36940 22707 27042 30080 40640 40058 45287 45600 48309 48856 45746 54045 49879
8927D9879L8p0j5293q625Q088O715J0538l797m225q691J5536m467j4457K0117
$$ 49879 49917 49847 34554 25929 34017 40732 51270 47473 43248 34557 50093 45626 31169 51286
8913E1286J6697j3698k3068k6360p536K4514J4745K798j59K439p283j895n182
$$ 51286 67983 54285 31217 4857 -2679 21835 36580 39378 39219 41658 34375 32480 27298
8900B7298j697j1944J2948L0908q731j9287j4007j052J5734J6942j9551j2389
$$ 27298 25601 13657 26605 57513 48782 29495 15488 14436 30170 47112 27561 15172
8888A5172J2535q661M422R582r301l765P852R211P820j8803r318J0057J5403O092
$$ 15172 27707 19046 23468 33050 23749 19984 27836 37047 44867 26064 16746 26803 42206 48298
8874D8298Q658j3071j0617k18l075m579J3344r078o622j8986p451J4186j66j094
$$ 48298 56956 43885 33268 33050 29975 25396 38740 29662 23040 4054 -3397 10789 10623 9529
8860I529J4757N451m06O797j4534J755J1654K629j3409K349k752j9637N025J7587
$$ 9529 24286 29737 29331 36128 21594 23349 35003 37632 24223 26572 23820 4183 9208 26795
8846B6795J9132N584k210R231j9380k2260k059K1951j325j7288J0909m57J3862
$$ 26795 45927 51511 49301 58532 39152 16892 14833 36784 35459 18171 29080 28623 42485
8833D2485J1456k188k0298j4492m645Q194K0829j332j8791j3054L481R635m575
$$ 42485 53941 51753 31455 16963 12318 20512 41341 40009 21218 8164 11645 21280 16705
8820A6705J593J9676r87o407j2137K662J2015p515J092j6532O151J4083n609q13
$$ 16705 18298 37974 36987 30580 18443 21105 33120 25605 26697 10165 16316 30399 24790 23977
8806B3977L969q886Q777K0467j1992j2438q012J0637K3282q595J097K036O069
$$ 23977 27946 19060 27837 48304 36312 23874 15862 26499 49781 41186 42283 44319 50388
8793E0388p45N024j7110j1474p009o504P297j19J2415M025N665j2951q67N36j7079
$$ 50388 49643 54667 37557 26083 19074 12570 19867 19748 32163 36188 41853 28902 28035 28571 11492
8778A1492O24J587R447J9827J135k2218K290J2820O146p105j6915o424j3021J8868
$$ 11492 12116 13703 23150 42977 44112 21894 24184 37004 43150 36045 19130 12706 -315 18553
8764A8553N964J3316q602r888J3626J5273J2983N478k3059j654q16j2903P082
$$ 18553 24517 37833 29231 19343 32969 48242 61225 66703 43644 41990 41174 28271 35353
8751C5353J0530j0532n882p722R323L558k953N703K820k1247J6103M098o643q483
$$ 35353 45883 35351 29469 21747 31070 34628 31675 37378 40198 18951 35054 39152 32509 24026
8737B4026l776j3728J1573R844O045j707M228M771O725r510k5350P51O996J4227
$$ 24026 20250 6522 18095 27939 33984 32277 36505 41276 48001 38491 13141 13892 20888 35115
8723C5115K475p288Q693M977P824j6205k7519m857J3667j2884L17J5006J4093
$$ 35115 37590 30302 38995 43972 51796 35591 8072 3215 16882 3998 4315 19321 33414
8710C3414n044q096m716J3343J6845J1334n842j544q674l38k067n780j2357k091
$$ 33414 28370 20274 15558 28901 45746 57080 51238 49694 41020 40682 38615 32835 20478 18387
8696A8387J9306K208o1j5403m535j3649K396Q708k359q449O722L881O483J0852
$$ 18387 37693 39901 39840 24437 19902 6253 8649 17357 14998 6549 13271 17152 23635 34487
8682C4487J4646J6222J3435r724j8690j0217k1861r31R724K0330j582k585p54
$$ 34487 49133 65355 78790 69066 50376 40159 18298 17367 27091 47421 45839 43254 42500
8669D2500K91R887R42O355j6007M356J3603l412O56j8848p428J1559J7381q401
$$ 42500 42791 52678 53620 59975 43968 48324 61927 58515 59171 40323 32895 44454 61835 53434
8655E3434j3515L474N054K3343N864k142J9433K057j4347J392k4370j6652O938
$$ 53434 39919 43393 48447 71790 77654 75512 94945 97002 82655 84047 59677 43025 49963
8642D9963L0626Q000o582J2687P781k219J7796R116l440J0685J0287j068J7831
$$ 49963 80589 88589 82007 94694 102475 100256 118052 127168 123728 134413 144700 143632 161463
8629A61463J3985Q683K9896L1211N8395O8602R1746J26038J48789J39333J06214
$$ 161463 175448 184131 214027 245238 303633 372235 463981 590019 738808 878141 984355
8618I84355L121j11845j56516j40451r9537p4530k8978l5376l7994k2197j7601
$$ 984355 987476 875631 719115 578664 479127 404597 375619 340243 302249 280052 262451
8607B62451o327P759p004o765q417p031L153j1896O135J711o185j0187r790O710
$$ 262451 256124 263883 256879 250114 241697 234666 237819 225923 232058 233769 227584 217397 207607 214317
8593B14317J9306o382l405J0612K7552J2551O430m583J2377N2147N2103N9331
$$ 214317 233623 227241 223836 234448 262000 274551 280981 276398 288775 340922 393025 452356
8581D52356O6062J01844J63753K09241K92802L27190K41940Q4593j46619l37789
$$ 452356 518418 620262 784015 993256 1286058 1613248 1855188 1939781 1793162 1455373
8571A455373l08539k21563j38421j07348j01223p1491l3567l7448k1097l5302
$$ 1455373 1146834 925271 786850 679502 578279 506788 473221 435773 414676 379374
8561C79374l6028O406j885j3218r022l6780k2732q698J4466j8639j9553K1163
$$ 379374 343346 349752 347867 334649 325627 288847 266115 257417 271883 253244 233691 254854
8549B54854K192q979J818p409J4849l184j1370J523K0881R396J2798K9291L5091
$$ 254854 257046 248067 249885 242476 257325 254141 242771 244294 265175 274571 287369 316660 351751
8536C51751M4782O8855R8591J10529J33775J32354Q1875k1473j41651j45235j20908
$$ 351751 396533 465388 563979 674508 808283 940637 1022512 1001039 859388 714153 593245
8525E93245r9463o0518n4496m8135l1341r213j2541l2191j8368j8541q590j9474
$$ 593245 493782 433264 378768 330633 299292 290079 277538 245347 226979 208438 199848 180374
8513A80374j2506j1530J5708K5776j7903k6451q212M83R9o712M466Q517k399N941
$$ 180374 167868 156338 172046 197822 179919 153468 145256 145739 145838 139126 143592 152109 149710 155651
8499A55651j9721j5506o749k2o955j0758j9947M593O201R704M035j5160j3038
$$ 155651 135930 120424 113675 113653 106698 95940 75993 80586 86787 96491 100526 85366 72328
8486G2328j2147P169K1086L286r554J1423j452j1176k0593j93J4381p12Q30J0767
$$ 72328 60181 67350 88436 91722 82168 93591 92139 80963 60370 60177 74558 73846 74676 85443
8472H5443m033j9872j0319L329J842J090j47n973j0623K0140J9582j5865j9321
$$ 85443 81410 61538 51219 54548 56390 57480 57333 51360 40737 60877 80459 64594 45273
8459D5273Q691j9468j2387L430m293N689O679J0988o509Q336K610J828O073j8209
$$ 45273 53964 34496 22109 25539 21246 26935 33614 44602 38093 46429 49039 50867 56940 38731
8445C8731j3075L69O08l29j0239R331L512j1197j5699M562K0740j848q839m507
$$ 38731 25656 26025 26633 26304 16065 25396 28908 17711 2012 6574 27314 25466 16627 12120
8431A2120m192J4395m954m782J329M712R98o605K844M12Q52j7396L766J1032K170
$$ 12120 7928 22323 17369 12587 13916 18628 19626 13021 15865 16277 17129 -267 3499 14531 16701
8416A6701o87o838M688o952j832P727k571N0P098K1789j237j3529r874m92L000
$$ 16701 16014 9176 13864 6912 5080 12807 10236 10286 17384 39173 37936 24407 14533 14041 17041
8401A7041J7330R712O68n527n183j2922j764L162n638Q714J649o497k324K257
$$ 17041 34371 44083 44751 39224 34041 21119 19355 22517 16879 25593 27242 20745 18421 20678
8387B0678P611k370j1019j9137m308J0017O623P156N585j635R16N77j1170N45
$$ 20678 28289 25919 14900 -4237 -8545 1472 8095 15251 20836 19201 20117 20694 9524 10069
8373A0069J5385j406j9030j0565J9277J1390N519j0467j433J4945k292p521n365
$$ 10069 25454 24048 5018 -5547 13730 25120 30639 20172 18739 33684 31392 23871 18506
8360A8506q588K887J3158M620n051k17j1886j3429o466p009J6723J5234j194k1914
$$ 18506 9918 12805 25963 30583 25532 25315 13429 0 -6466 -13475 3248 18482 17288 -4626
8346d626j4994L72J6675M092j8087l701l029l063J961Q943J9694J7198j1133k200
$$ -4626 -19620 -19248 -2573 1519 -16568 -20269 -23298 -26361 -24400 -15457 4237 21435 10302 8102
8332H102n159r993l272k137J9678P772r711M594r101k0971J1801L1984O637j4190
$$ 8102 2943 -7050 -10322 -12459 7219 14991 5280 9874 773 -20198 -8397 23587 30224 16034
8318A6034j0193n121p313Q361K031J473o350J1201J764q653L794N259j082L608
$$ 16034 5841 720 -6593 1768 3799 5272 -1078 10123 11887 3234 7028 12287 11205 14813
8304A4813l552j5365l410l75N759Q599j5930r689J1066J0022L199m196m350O974
$$ 14813 11261 -4104 -7514 -7889 -2130 6469 -9461 -19150 -8084 1938 5137 941 -3409 3565
8290C565K1544J086j2190j1105k0235q388P098K3542J2013j1177N330M042m72
$$ 3565 25109 26195 14005 2900 -17335 -25723 -18625 4917 16930 5753 11083 15125 14653
8277A4653k943j3146J232o687P858m096J916J2010M25j6087P96J1212N549o150
$$ 14653 11710 -1436 -204 -6891 967 -3129 -1213 10797 11222 -4865 -4069 7143 12692 6542
8263F542p658N598p165m472J888r3o572N892l879J7225O691N196M48p969N81J539
$$ 6542 -1116 4482 -2683 -7155 -5267 -5360 -11932 -6040 -9919 7306 13997 19193 19641 11672 12253 13792
8247A3792K7560r02m139j1197j9187N178j3000j0327L25J0180J6384O942Q924
$$ 13792 41352 40450 36311 25114 5927 11105 -1895 -12222 -11897 -1717 14667 21609 30533
8234C0533j0544J006J0156j4719j8894j4195J530J3670Q679l488Q18J2159J2950
$$ 30533 19989 20995 31151 16432 -2462 -16657 -15127 -1457 7222 3734 4552 16711 29661
8221B9661j4221r759J970K952N862j1562k2517l755K1112J0072P673j3668m699
$$ 29661 15440 5681 7651 10603 16465 4903 -17614 -21369 -257 9815 17488 3820 -879
8208h79J0893j7105M106n640o080K810J5777j3493j1791k958p803J198J5291K0157
$$ -879 10014 -7091 -2985 -8625 -14705 -11895 3882 -9611 -21402 -24360 -32163 -30965 -15674 4483
8194D483P037m995K078j4897j915p731O702J2291j995k320J4366J1688j3778j4055
$$ 4483 11520 6525 8603 -6294 -8209 -15940 -9238 3053 1058 -1262 13104 24792 11014 -3041
8180c041O930J8267m450j5278k1811P105K099m514l935J606J1058Q580j012o436
$$ -3041 3889 22156 17706 2428 -19383 -12278 -10179 -14693 -18628 -17022 -5964 2616 1604 -4832
8166d832k2684Q039P948r342L840k657m291J186o285q694J7768J1005J9996J0277
$$ -4832 -27516 -19477 -11529 -20871 -17031 -19688 -23979 -22793 -29078 -37772 -20004 -8999 10997 21274
8152B1274j908j1183j1264j4934j1534j1404n015J2492K764L426r199K1022J2114
$$ 21274 19366 8183 -3081 -18015 -29549 -40953 -45968 -33476 -30712 -27286 -36485 -15463 -3349
8139c349L122O71o9q125R81j1228k812K9414K3602K971k8889p975p869J5419J3240
$$ -3349 -227 444 375 -7750 -6769 -17997 -20809 8605 32207 35178 6289 -1686 -9555 5864 19104
8124A9104j1277j4608j2058l491J1860J4240j2010p587P324K236K126m708m236
$$ 19104 7827 -6781 -18839 -22330 -10470 3770 -8240 -15827 -8503 -6267 -4141 -8849 -13085
8111a3085J6991j4445p176k398P323J3077N027j2531l812j9629n520J4439J8639
$$ -13085 3906 -10539 -17715 -20113 -12790 287 5314 -7217 -11029 -30658 -36178 -21739 -3100
8098c100k551m724P619j1369L284J1179p647P350j980M33K024k687r606j6620
$$ -3100 -5651 -10375 -2756 -14125 -10841 338 -7309 41 -1939 -1506 518 -2169 -11775 -28395
8084b8395N510M180j1097P788L0434M900k8092j692Q786l272Q929O613j589j2010
$$ -28395 -22885 -18705 -29802 -22014 8420 13320 -14772 -16464 -7678 -10950 -2021 4592 3003 -9007
8070i007M766O994j1455j6557L605J8043J4771Q741O945j238k2970k3986J2969
$$ -9007 -4241 2753 -8702 -25259 -21654 -3611 11160 19901 26846 25608 2638 -21348 -8379
8057h379o139L753J196j737m895P333q905N456J1008J20J2116N968o657q83P417
$$ -8379 -14518 -10765 -9569 -11306 -16201 -8868 -17773 -12317 -1309 -1189 10927 16895 10238 9355 16772
8042A6772J0413k166j7659q452j2973o519J4020J100j336q39Q383P017q05L771
$$ 16772 27185 25019 7360 -1092 -14065 -20584 -6564 -5464 -6800 -7639 744 7761 6956 10727
8028A0727K808m539j8406j961K26j8539K1571J4265o239L43J8270J2534P379n274
$$ 10727 13535 8996 -9410 -11371 -11145 -29684 -8113 6152 -87 256 18526 31060 38439 33165
8014C3165j9547q018l851K066k921R218J8344J2212J4813m715k0826j1907K3127
$$ 33165 13618 5600 1749 3815 894 10112 28456 40668 55481 50766 29940 18033 41160
8001D1160J2204K5597o932k0954k4497j5470K537K8194R328j3322l547n645j9904
$$ 41160 53364 78961 72029 51075 26578 11108 13645 41839 51167 37845 34298 28653 8749
7988H749O72J5079J278j4577n686n995j395J3418o611j3726m398K4268j348j184
$$ 8749 9421 24500 25778 11201 5515 -480 -1875 11543 4932 -8794 -13192 11076 9728 8544
7974H544N816p385j3375k692p103j4586j9255J7724J4981J1244J7339K4422l404
$$ 8544 14360 6975 -6400 -9092 -16195 -30781 -50036 -32312 -17331 -6087 11252 35674 32270
7961C2270o58j8628j3505J5772J3681R064N800j4591j2397j493l84N598R219P88
$$ 32270 31612 12984 -521 15251 28932 37996 43796 29205 16808 15315 14931 20529 29748 30536
7947C0536j053j3618j0529R86O865q726j221J8265O513j1676p112j0256Q811J0721
$$ 30536 29483 15865 5336 6322 13187 4461 3240 21505 28018 16342 9230 -1026 7785 18506
7933A8506j3304n511n735N685J1738k0605j2191J7612L71K416N068J3211m621
$$ 18506 5202 -309 -6044 -359 11379 -9226 -21417 -3805 -3434 -1018 4050 17261 12640
7920A2640j0351L04N307p754J571J52J0245J1564K750j3987j623N799j0189j1751
$$ 12640 2289 2593 7900 146 1717 1869 12114 23678 26428 12441 10818 16617 6428 -5323
7906e323M651J1779j2702j6789K808P701J6903J174j8717r082Q33K2238J5724
$$ -5323 -672 11107 -1595 -18384 -15576 -7875 9028 10202 -8515 -17597 -16764 5474 21198
7893B1198j135j300k657k19n848J2548O660L865n910M376L582k1246p120o494
$$ 21198 20063 18763 16106 15887 10039 22587 29247 33112 27202 31578 35160 13914 6794 300
7879C00m663K051L824R567J852n282j2417P318l779q826K253J1488K0418J1270
$$ 300 -4363 -2312 1512 11079 12931 7649 -4768 2550 -1229 -10055 -7802 3686 24104 35374
7865C5374j2015j3095R667R627m93q893k0335m360O977J7482L062j2727j8078
$$ 35374 23359 10264 19931 29558 29065 20172 -163 -4523 2454 19936 22998 10271 -7807
7852g807J2088n627p957o992k689l358k106N158J2656J7204J4516j1168p200L916
$$ -7807 4281 -1346 -9303 -16295 -18984 -22342 -24448 -19290 -6634 10570 25086 13918 6718 10634
7838A0634n468K758N477j4571q020O34R690n759R300J4856p564R406J4568n447
$$ 10634 5166 7924 13401 -1170 -9190 -8556 1134 -4625 4675 19531 11967 21373 35941 30494
7824C0494j5190j5206j3345R517J3612j146J695p052O789p600k2292o05m59L296
$$ 30494 15304 98 -13247 -3730 9882 8736 10431 3379 10168 2568 -19724 -20329 -20788 -17492
7810a7492n7N949J2694J4746K1922k0688k9406J820Q394q824j0825k593L3600
$$ -17492 -17549 -11600 1094 15840 37762 17074 -12332 -10512 -2118 -10942 -21767 -24360 9240
7797I240J6045j3261N742Q455k267k5589L9j096Q199J8658j8743j4213o425K823
$$ 9240 25285 12024 17766 26221 23954 -1635 -1596 -2692 5507 24165 5422 -8791 -15216 -12393
7783a2393Q149n643J1151K431k5371j5214l813O056p392R579J8595J1499o154
$$ -12393 -4244 -9887 1264 3695 -21676 -36890 -40703 -34647 -42039 -32460 -13865 -2366 -8520
7770h520R841q169J831M123k108m78j3224p064O081J1478j3556j3939J7104m816
$$ -8520 1321 -6848 -5017 -894 -3002 -3480 -16704 -23768 -17687 -6209 -19765 -33704 -16600 -21416
7756b1416j2344J0641J4764k652L931P30K425J3303k518K921o503j3679K11k04
$$ -21416 -33760 -23119 -8355 -11007 -7076 -6346 -3921 9382 6864 9785 3282 -10397 -10186 -10390
7742a0390j1457r276J6599J0992K422r194j6589k725J1928J3696J2777R263q651
$$ -10390 -21847 -31123 -14524 -3532 -1110 -10304 -26893 -29618 -17690 -3994 8783 18046 9395
7729I395q000j525J0441j2362N95o454m356N4j0541J9828j759n312K779j1823
$$ 9395 1395 -130 10311 -2051 -1456 -7910 -12266 -12212 -22753 -2925 -4684 -9996 -7217 -19040
7715a9040k95J0995j7226k4915j745K4748J7518J2492j5962M003K3777K3j4315
$$ -19040 -19335 -8340 -25566 -50481 -52226 -27478 -9960 2532 -13430 -9427 14350 14373 58
7702E8p375K0719P224k0039n938l791J1817J7629J1903j2411O857J5391j5406
$$ 58 -7317 13402 20626 587 -5351 -9142 2675 20304 32207 19796 26653 42044 26638
7689B6638p060k5626O306q227k3913k239K681p392Q195J3591q691K785J8506O673
$$ 26638 19578 -6048 258 -7969 -31882 -34121 -31440 -38832 -30637 -17046 -25737 -22952 -4446 2227
7675B227J3980j0911k1661k738K6235n413j6056j264R600j881n224o175O070Q519
$$ 2227 16207 5296 -16365 -19103 7132 1719 -14337 -15601 -6001 -7882 -13106 -19281 -13211 -4692
7661d692N028R539j0557m785J3941j2660j0357K417O060k187j2577l619K942j271
$$ -4692 336 9875 -682 -5467 8474 -4186 -14543 -12126 -6066 -8253 -20830 -24449 -21507 -22778
7647b2778K755q00k517j0715L226L3930m311j391k857j2439j5534L501O808P294
$$ -22778 -20023 -20823 -23340 -34055 -30829 3101 -1210 -2601 -5458 -17897 -33431 -29930 -23122 -15828
7633a5828q86J3036J149j4753J860r365L355n144K276j028J3676j3603J0260M282
$$ -15828 -16714 -3678 -2529 -17282 -15422 -24787 -21432 -26576 -24300 -25328 -11652 -25255 -14995 -10713
7619a0713J427p774N53J2331P927N480j370j403l098j1863j0971o676q846J4417
$$ -10713 -9286 -17060 -16507 -4176 3751 9231 7861 6458 3360 -8503 -19474 -26150 -34996 -20579
7605b0579O450J0238j476n737J195P967R761K245m061Q72M952o18j4626j641J1595
$$ -20579 -14129 -3891 -5367 -11104 -9909 -1942 7819 10064 6003 6875 11827 11209 -3417 -5058 6537
7590F537j8864j4874P820Q84K1j1397m732N001J1835P658q883P351Q932K433r956
$$ 6537 -12327 -27201 -19381 -18497 -18476 -29873 -34605 -29604 -17769 -10111 -18994 -11643 -2711 -278 -10234
7575a0234o814L234O590K33J1188m9j7835o347j2158k057o952q531m312j0295
$$ -10234 -17048 -13814 -7224 -6991 4197 4148 -13687 -20034 -32192 -34249 -41201 -49732 -54044 -64339
7561f4339J1195P016P121R380Q808J4149M891J3456k4993j7119r04m840m287K1461
$$ -64339 -53144 -46128 -39007 -29627 -20819 -6670 -1779 11677 -13316 -30435 -31339 -36179 -40466 -19005
7547a9005R499j203J040K2341O496k168M359j9508p244Q384k831n943k5927j2889
$$ -19005 -9506 -10709 -9669 12672 19168 17000 21359 1851 -5393 2991 160 -5783 -31710 -44599
7533d4599J5489J9208K848k668R99L811m366j2672K292J6061K043K431L070j29
$$ -44599 -29110 -9902 -7054 -9722 -8723 -4912 -9278 -21950 -19658 -3597 -1554 877 3947 3818
7519C818O470l680j1443L976q241K041J0700J6775M477j3911o434n205j3728j2830
$$ 3818 10288 6608 -4835 -859 -9100 -7059 3641 20416 24893 10982 4548 -657 -14385 -27215
7505b7215k080J1091n299M002o791o96M716j817J068l473M815N823J442k616j1349
$$ -27215 -29295 -18204 -23503 -19501 -26292 -26988 -22272 -24089 -23021 -26494 -21679 -15856 -14414 -17030 -28379
7490b8379j1858K224P5L0531r577j1333q08J4061J2891k704k152n970J058J1006
$$ -28379 -40237 -38013 -37938 -7407 -16984 -28317 -29125 -15064 -2173 -4877 -7029 -12999 -11941 -935
7476i35O632r213j1707o203r951J1936J65j3697J2797J0910r833P50P462j923
$$ -935 5697 -3516 -15223 -21426 -31377 -19441 -19276 -32973 -20176 -9266 -19099 -18349 -10887 -12810
7462a2810J0012q36m40j0819L563K397j0711N698K9719J8341k037j9412Q076L165
$$ -12810 -2798 -3634 -4074 -14893 -11330 -8933 -19644 -13946 15773 34114 32077 12665 20741 23906
7448B3906l13m288R815k3550j2578M089K586M263R909J2339j2342j3225J6328
$$ 23906 23593 19305 29120 5570 -7008 -2919 -333 3930 13839 26178 13836 611 16939
7435A6939K1233j6467o293j6201p075k594l931O747K1469J0300k0977j4255o861
$$ 16939 38172 21705 15412 -789 -7864 -10458 -14389 -7642 13827 24127 3150 -11105 -17966
7422a7966K0231R727o724j5109K313q63n965K3743j138K306l196j6527J79j0522
$$ -17966 2265 11992 5268 -9841 -7528 -8391 -14356 9387 8249 10555 7359 -9168 -8989 -19511
7408a9511j691m426J3202P932nN303Q061l397j3879j8997j58J2191J4912J5711
$$ -19511 -21202 -25628 -12426 -4494 -4499 804 8865 5468 -8411 -27408 -27566 -15375 -463 15248
7394A5248p510j8073m142k907J143J2454r092O663K97J5457l147j3763K576P581
$$ 15248 7738 -10335 -14477 -17384 -16241 -3787 -12879 -6216 -5919 9538 6391 -7372 -4796 2785
7380B785J465O377K106k0089j1801Q226J2482J3939j3915j4513K297p699Q471
$$ 2785 4250 10627 12733 -7356 -19157 -10931 1551 15490 1575 -12938 -10641 -18340 -9869
7367i869p078l814N634j3684k31L169Q922K52O759o965q922J0337R666k515k756
$$ -9869 -16947 -20761 -15127 -28811 -29042 -25873 -16951 -16699 -9940 -16905 -25827 -15490 -5824 -8339 -11095
7352a1095j5905p6K3107K8017J3789n428j0419l383J8631M060j8849j1631r097
$$ -11095 -27000 -27076 -3969 24048 37837 32409 21990 18607 37238 41298 22449 10818 1721
7339A721J1441o84J0938M851o756k4214N793p268j3647j189R213m854N686p117
$$ 1721 13162 12478 23416 28267 21511 -2703 3090 -4178 -17825 -19014 -9801 -14655 -8969 -16086
7325a6086J0212R181N236o257p047J2091j938m837L305o056j1854J6877K6023
$$ -16086 -5874 3307 8543 2286 -4761 7330 5392 555 3860 -2196 -14050 2827 28850
7312B8850J4755j787J518q617L212j750j3315k7022l805R918O828o364o692J977
$$ 28850 43605 41818 43336 34719 37931 36181 22866 -4156 -7961 1957 8785 2421 -4271 -2294
7298b294J0806J0578l291j1670q03n752m378J7154o417J7624O850k630j480o456
$$ -2294 8512 19090 15799 4129 3326 -2426 -6804 10350 3933 21557 28407 25777 24297 17841
7284A7841o752p307j4817k2994j5644N386K7222J5535J0312l2209j0439J1991
$$ 17841 11089 3782 -11035 -34029 -49673 -44287 -17065 -1530 8782 -23427 -33866 -21875
7272b1875J5728j1093l301M48j1967j49J7495J0704R299L696Q496o818j6300m928
$$ -21875 -6147 -17240 -20541 -20093 -32060 -32209 -14714 -4010 5289 8985 17481 10663 -5637 -10565
7258a0565p804R130L615J327j5443o667j869K4656K2900j7902j9441l32J9710
$$ -10565 -18369 -9239 -5624 -4297 -19740 -26407 -28276 -3620 19280 1378 -18063 -18395 1315
7245A315r291L043J9453P344J1174L862j6306l237o404l480j0638q523M622K653
$$ 1315 -7976 -4933 14520 21864 33038 36900 20594 17357 10953 7473 -3165 -11688 -7066 -4413
7231d413k3Q069R302K7314p370j5319n983j377n174j5719j6519j7153J2649j1211
$$ -4413 -4436 3633 12935 40249 32879 17560 11577 10200 5026 -10693 -27212 -44365 -31716 -42927
7217d2927K0647J1541r351L695N970J1066J600l816O068K98r885l383r937J946
$$ -42927 -22280 -10739 -20090 -16395 -10425 641 2241 -1575 4493 4791 -5094 -8477 -18414 -16468
7203a6468J4392m672j2133K403J3483J418r549O061j0916R245J7530j583M532
$$ -16468 -2076 -6748 -18881 -16478 -2995 -1577 -11126 -5065 -15981 -6736 10794 9211 13743
7190A3743j3620l846J3566K78p124k9774j2251r940L25K2518J3406j7236j764
$$ 13743 123 -3723 9843 10121 2997 -26777 -39028 -48968 -48643 -26125 -12719 -29955 -31719
7177c1719o774m008J9127Q345q09j6490l72l41Q158J1650J7231j3669j4519K968
$$ -31719 -38493 -42501 -23374 -15029 -15838 -32328 -32700 -33041 -24883 -13233 3998 -9671 -24190 -21222
7163b1222k027J335q199k1370K922L2478K7579N502j2340q084j1985Q624K8435
$$ -21222 -23249 -21914 -30113 -51483 -48561 -16083 11496 16998 4658 -3426 -15411 -6787 21648
7150B1648J1063l768j373p450j9661j8847J3927Q795o801O620L333l999k487K414
$$ 21648 32711 28943 27570 20120 459 -18388 -4461 4334 -2467 4153 7486 3487 1000 3414
7136C414j6694P909J1208J53J0382o295m212j369j7161O77J1501O020k3608p022
$$ 3414 -13280 -5371 5837 5990 16372 10077 5865 4496 -12665 -11988 -487 5533 -18075 -25097
7122b5097O840J594m702J3587J2029k042J4261J0118k555r005j8467j1567j294
$$ -25097 -18257 -16663 -21365 -7778 4251 2209 16470 26588 24033 15028 -3439 -15006 -16300
7109a6300J4232K534K653J4321J87r406j1161j6413J6452J2310J2346p410j0582
$$ -16300 -2068 466 3119 17440 17627 8221 -2940 -19353 -2901 9409 21755 14345 3763
7096C763k025P956K714j1363n649m131R303N818O028L209M124k002o643n036j7948
$$ 3763 1738 9694 12408 1045 -4604 -8735 568 6386 12414 15623 19747 17745 11102 6066 -11882
7081a1882j1968R78q45p841k68L011K0196K468J3173R470j7793j1615J8511J2173
$$ -11882 -23850 -22872 -23717 -31558 -31826 -28815 -8619 -6151 7022 16492 -1301 -12916 5595 17768
7067A7768K233p00J902j6387j1946k2325l823J5059J78j2457J551J7711J0722
$$ 17768 20001 19301 21203 4816 -7130 -29455 -33278 -18219 -18041 -30498 -28947 -11236 -514
7054e14Q54j3492m401j161m645k3732K482K947K4976J3254q276N288J7383J1637
$$ -514 340 -13152 -17553 -18714 -23359 -47091 -44609 -41662 -16686 -3432 -11708 -6420 10963 22600
7040B2600J1401k4278k4523l609J4866J0647J511q060N040J43p439m766K980O35
$$ 22600 34001 9723 -14800 -18409 -3543 7104 8615 555 5595 5738 -1701 -6467 -3487 -2852
7026b852p863n614J2214J0243N628j3724q482J3067Q963m900j81P902J0640j7066
$$ -2852 -10715 -16329 -4115 6128 11756 -1968 -10450 2617 11580 6680 6499 14401 25041 7975
7012G975j4400J0375J0960r879l167k384N600o216M700j469O714M627m050j1893
$$ 7975 -6425 3950 14910 5031 1864 -520 5080 -1136 3564 2095 8809 13436 9386 -2507
6998b507q315M737j09R78K299J189j0674J5588N076j538k928r674r780j0579n118
$$ -2507 -10822 -6085 -6194 -5216 -2917 -1728 -12402 3186 8262 6724 3796 -5878 -15658 -26237 -31355
6983c1355J993L767J3017P973J9453N341r185k3382j5534M718J3065L18J1409
$$ -31355 -29362 -25595 -12578 -4605 14848 20189 11004 -12378 -27912 -23194 -10129 -9811 1598
6970A598P022j4600j9676N147L711j114J465m064L346J0057r39K704K2n275N531
$$ 1598 8620 -5980 -25656 -20509 -16798 -17912 -16447 -20511 -17165 -7108 -8047 -5343 -5321 -10596 -5065
6955e065J323J0616K004j2970l174k996K557J5650J1325J0788j3762m466j0273
$$ -5065 -3742 6874 8878 -4092 -7266 -10262 -7705 7945 19270 30058 16296 11830 1557
6942A557n708Q679Q924j105J71p509j9700j4624L418K8341J5216l329J446J3818
$$ 1557 -4151 4528 13452 12347 12518 5009 -14691 -29315 -25897 2444 17660 14331 15777 29595
6928B9595j3891k6995l578P115j1806j2439O173k306L965L278J6847L385j8583
$$ 29595 15704 -11291 -14869 -7754 -19560 -31999 -25826 -28132 -24167 -20889 -4042 -657 -19240
6915a9240j0464J7547L929L213j6936O554J0603o332R554J2598K0522K065q827
$$ -19240 -29704 -12157 -8228 -5015 -21951 -15397 -4794 -11126 -1572 11026 31548 33613 24786
6902B4786m773L67N95k0118o656j1483L842J0632p380K467M119O280J8196r118
$$ 24786 20013 20380 20975 857 -5799 -17282 -13440 -2808 -10188 -7721 -3602 2678 20874 11756
6888A1756k700n397L774N554j373r484J071n239Q419P135k306j9778l181J7126
$$ 11756 9056 3659 7433 12987 11614 2130 3201 -2038 6381 13516 11210 -8568 -11749 5377
6874E377L908q332k264j0222o157q546M220J3190M66J319J2788J061j8296j8178
$$ 5377 9285 953 -1311 -11533 -17690 -26236 -22016 -8826 -8360 -7041 5747 6808 -11488 -29666
6860b9666J1012Q298J2124j8724J73j5530l713J5815J6442j270M164K390m939
$$ -29666 -18654 -10356 1768 -16956 -16783 -32313 -36026 -20211 -3769 -5039 -875 1515 -3424
6847c424O786P095m04l006j1717n078n836R043P28J5723M378j2877o773K238l265
$$ -3424 3362 10457 10053 7047 -4670 -9748 -15584 -6541 -5813 9910 14288 1411 -5362 -3124 -6389
6832f389n058p42K6736J0985o441Q58j2717k5426j0200O80J5102r849Q386P947
$$ -6389 -11447 -12189 14547 25532 19091 19949 7232 -18194 -28394 -27714 -12612 -22461 -14075 -6128
6818f128o363J825K6104l907q563j02Q120p829j6535O786O426m520o628L77Q770
$$ -6128 -12491 -10666 15438 11531 2968 2866 10986 3157 -13378 -6592 -166 -4686 -11314 -10937 -2167
6803b167p572M203K2622l342j1388P893o828n553Q225R314p53j7203k2756J46
$$ -2167 -9739 -5536 17086 13744 2356 10249 3421 -2132 6093 15407 14654 -2549 -25305 -25159
6789b5159J9506R657O877L23j5123j3561k320L240M694j3400j4033n36J1359K2071
$$ -25159 -5653 4004 10881 11204 -3919 -17480 -19800 -16560 -11866 -25266 -39299 -39835 -28476 -6405
6775f405K2585N249j2251n047J4796r269r120n346N327Q748Q134M59j1510p877
$$ -6405 16180 21429 9178 4131 18927 9658 538 -4808 519 9267 17401 17860 6350 -1527
6761a527j5897m570J4075P050j0543J4104J7152ll833j0781R91l911n601M379
$$ -1527 -17424 -21994 -7919 -869 -11412 2692 19844 19841 16008 5227 6218 2307 -3294 1085
6747A085q775K1807J888j7576j540N124j3189k265J329J0151k474q224j012P154
$$ 1085 -7690 14117 16005 -1571 -3111 2013 -11176 -13441 -12112 -1961 -4435 -12659 -13671 -6517
6733f517j0723j274J4712M856J2437K092o657j3835p972j076O409R384J3003J7832
$$ -6517 -17240 -18514 -3802 1054 13491 15583 8926 -4909 -12881 -13957 -7548 1836 14839 32671
6719C2671Q557N699m727L417k7818l3351q368K0219O526Q569k384K400J440Q593
$$ 32671 41228 46927 42200 45617 17799 -15552 -23920 -3701 2825 11394 9010 11410 12850 21443
6705B1443N0M171K231n977k3290k3622m05J9190K2400l286q899Q11O049j6707
$$ 21443 21493 25664 27895 21918 -1372 -24994 -25399 -6209 16191 12905 4006 4817 10866 -5841
6691e841j6813J3977Q665n215p887k731n79Q619M46l34o849P449J8060J9501j6460
$$ -5841 -22654 -8677 -12 -5227 -13114 -15845 -16424 -7805 -7359 -7693 -14542 -7093 10967 30468 14008
6676A4008k7845k876J5351J2470M332j5291k3327j982J6454J1729N703l233j4671
$$ 14008 -13837 -16713 -1362 11108 15440 149 -23178 -25160 -8706 3023 8726 5493 -9178
6663i178J6376N299j2645Q379q919r620Q288m304j8372q320L982J4487K4131K6164
$$ -9178 7198 12497 -148 8231 -688 -10308 -2020 -6324 -24696 -33016 -29034 -14547 9584 35748
6649C5748p731o220k1074j5920q190J0145K5325P872oj7544M836R008j0329m181
$$ 35748 28017 21797 723 -15197 -23387 -13242 12083 19955 19949 2405 7241 16249 5920 1739
6635A739m675o349J8459K510k4002k1884K704J8771k772j9001l887J4396M566
$$ 1739 -2936 -9285 9174 11684 -12318 -34202 -31498 -12727 -15499 -34500 -38387 -23991 -19425
6622a9425m855J7474J9483L355j5668j5978j4177q891N398J4143M625n3l25N622
$$ -19425 -24280 -6806 12677 16032 364 -15614 -29791 -38682 -33284 -19141 -14516 -14569 -14894 -9272
6608i272Q143K217N379r310j1636j1953J4090N198J7431J4017r873j3136j0255
$$ -9272 -1129 1088 6467 -2843 -14479 -26432 -12342 -7144 10287 24304 14431 1295 -8960
6595h960M673J2071P851j9081M340O939P693j618j0705k5660J1684J5220q297
$$ -8960 -4287 7784 15635 -3446 894 7833 15526 13908 3203 -22457 -10773 4447 -3850
6582c850N241N595P052r597j8116j9677L243J6423q739J4395J8278m453j3363
$$ -3850 1391 6986 14038 4441 -13675 -33352 -30109 -13686 -22425 -8030 10248 5795 -7568
6569g568O09j4646J679O464o806k318R415q694M591O975j2571m746l761K0888
$$ -7568 -6959 -21605 -19926 -13462 -20268 -22586 -13171 -21865 -17274 -10299 -22870 -27616 -31377 -10489
6555a0489R879n447o429Q023j3525L264J3179o690k4124q316K0169J5455O817
$$ -10489 -610 -6057 -12486 -4463 -17988 -14724 -1545 -8235 -32359 -40675 -20506 -5051 1766
6542A766R365o287q691m298r360O947Q117J1320L640Q876r779j4407j4980j0505
$$ 1766 11131 4844 -3847 -8145 -17505 -10558 -2441 8879 12519 21395 11616 -2791 -17771 -28276
6528b8276Q639J0080J1249P608r143q464l549m795J4708M377j6751J8613O036
$$ -28276 -19637 -9557 1692 9300 157 -8307 -11856 -16651 -1943 2434 -14317 4296 10332
6515A0332K447p112J2175J6065j5196j1691K141m603J1108o607M699N407j0891
$$ 10332 12779 5667 17842 33907 18711 7020 9161 4558 15666 9059 13758 19165 8274
6502H274j5343K854J6385l451j1968M590J570j3003j5630M620J7125J2869L07
$$ 8274 -7069 -4215 12170 8719 -3249 1341 2911 -10092 -25722 -21102 -3977 8892 9199
6489I199r788p716k1895n972Q481P534l368N402J7724Q800l852P14j9521O337
$$ 9199 -589 -8305 -30200 -36172 -27691 -20157 -23525 -18123 -399 8401 4549 5263 -14258 -7921
6475g921l423J259J628P32l72J3571J404p763j1246J0016N047J650m949j4705
$$ -7921 -11344 -10085 -8457 -7725 -8097 5474 6878 -885 -12131 -2115 2932 4582 -367 -15072
6461a5072L745j1818k0896Q542l024J7186J6519Q885M22M554M566j921j4858j1895
$$ -15072 -11327 -23145 -44041 -35499 -38523 -21337 -4818 4067 4489 9043 13609 11688 -3170 -15065
6447a5065o7J0451k95M562j8800N083J1898N156R618q342m008j431r444L134J9841
$$ -15065 -15132 -4681 -4976 -414 -19214 -14131 -2233 2923 12541 4199 191 -1240 -10684 -7550 12291
6432A2291k139o133j3866j9427R787J2644K168r491o303J6021M666m685R013j774
$$ 12291 10152 4019 -9847 -29274 -19487 -6843 -4675 -14166 -20469 -4448 218 -4467 4546 2772
6418B772j1381k547m923M269J2383N561j137o787o581J4157Q666j5329j2102j7420
$$ 2772 -8609 -11156 -16079 -11810 573 6134 4997 -1790 -8371 5786 14452 -877 -12979 -30399
6404c0399P35K4974J1587o482P235j5151M814m889n796O677N998p602m987N911
$$ -30399 -29664 -4690 6897 415 7650 -7501 -2687 -7576 -13372 -6695 -697 -8299 -13286 -7375
6390g375k977R499M660K491n156r038p701p417l976l528R74J962J6247J7185J0275
$$ -7375 -10352 -853 3807 6298 1142 -7896 -15597 -23014 -26990 -30518 -29544 -27582 -11335 5850 16125
6375A6125m311N290j3452j4665q433k915K2502j6849j9991M783L3771J4192k8646
$$ 16125 11814 17104 3652 -11013 -19446 -22361 141 -16708 -36699 -31916 1855 16047 -12599
6362a2599m905J7534L910j2061k343K433j827N333j531L893J442q36R013m019
$$ -12599 -17504 30 3940 -8121 -10464 -8031 -9858 -4525 -6056 -2163 -721 -1557 7456 3437
6348C437o945M072j1789L819J2040k081j479N258N473k8170J616J2754R134j15
$$ 3437 -3508 564 -11225 -7406 4634 2553 1074 6332 11805 -16365 -14749 -1995 7139 7024
6334G024j3917j3342J1011k552o286o646J0082O306Q749K478p213k774k933Q129
$$ 7024 -6893 -20235 -9224 -11776 -18062 -24708 -14626 -8320 429 2907 -4306 -7080 -10013 -1884
6320a884Q19j887m69k88j6077p219J3355J0377k677n069M077J056K193m902p761
$$ -1884 -1065 -2952 -3421 -3709 -19786 -27005 -13650 -3273 -5950 -11019 -6942 -5886 -3693 -8595 -16356
6305a6356K885o328o241J0609J627j2942R502K4268J8233j114j5252j2101K845
$$ -16356 -13471 -19799 -26040 -15431 -13804 -26746 -17244 7024 25257 24143 8891 -3210 -365
6292c65K4847j3294j4455L3o516M305j134m290L072J2314j7704n897k074O767
$$ -365 24482 11188 -3267 -3234 -9750 -5445 -6579 -10869 -7797 4517 -13187 -19084 -21158 -14391
6278a4391k823k1891o408J1874N619n803J5407J91L139J2544L465r07o143k516
$$ -14391 -17214 -39105 -45513 -33639 -28020 -33823 -18416 -18225 -15086 -2542 923 16 -6127 -8643
6264h643O149j3143l037J856m421j259O147M979J3470J2360M401j018J076j2382
$$ -8643 -2494 -15637 -18674 -16818 -21239 -22498 -16351 -11372 2098 14458 18859 17841 18917 6535
6250F535k6583o419K1238O959J1008M217m680j3411l374P888P404p328j4788J2046
$$ 6535 -20048 -26467 -5229 1730 12738 16955 12275 -1136 -4510 3378 10782 3454 -11334 712
6236G12J4826n229j0855l974J4076J6897k4434j6995P663Q145j470q731j5129
$$ 712 15538 10309 -546 -4520 9556 26453 2019 -14976 -7313 832 -638 -9369 -24498
6223b4498J1674m212l809j782J0303J1465R922r892k5256j4472n047J774M224
$$ -24498 -12824 -17036 -20845 -22627 -12324 -859 9063 -829 -26085 -40557 -45604 -43830 -39606
6210c9606j446P059J9386O934M61N678j0071j9381K511l984Q704J5591o610j779
$$ -39606 -41052 -33993 -14607 -7673 -7212 -1534 -11605 -30986 -28475 -32459 -23755 -8164 -14774 -16553
6196a6553r078k912j2122R499J6690J993J1392j1185l081K662M496J8759o695
$$ -16553 -25631 -28543 -40665 -31166 -14476 -12483 -1091 -12276 -15357 -12695 -8199 10560 3865
6183C865j6175N826J5145L932Q368k822n196r77j9572j425M81j0163Q609J2416
$$ 3865 -12310 -6484 8661 12593 20961 18139 12943 11966 -7606 -9031 -8550 -18713 -10104 2312
6169B312R416j2021r853P338K2104P83k428q196k045k555j9903o360K606m299
$$ 2312 11728 -293 -10146 -2808 19296 20079 17651 9455 7410 4855 -15048 -21408 -18802 -23101
6155b3101n181j970Q458J4036j076J2246j188k633p21J034K614N347j302J8421
$$ -23101 -28282 -30252 -21794 -7758 -8834 3412 2224 -409 -1130 -96 2518 7865 6563 24984
6141B4984M401P327l721r312j8347j6948L971N90J6538R886j751r538m648l588
$$ 24984 29385 36712 32991 23679 5332 -11616 -7645 -7055 9483 19369 17618 8080 3432 -156
6127a56p433m28J038k685Q921N811K632j659J1770J079n722j1414R65P126k124
$$ -156 -7589 -8017 -6979 -9664 -743 5068 7700 6041 17811 18890 13168 1754 2719 9845 7721
6112G721L427J0231M745p648p287k568o020O40M130J4258j2040k4709j2643J5169
$$ 7721 11148 21379 26124 18476 11189 8621 2601 3241 7371 21629 9589 -15120 -27763 -12594
6098a2594J4598m62m762k653k070J1861J113j2997o04r979j3878Q323o117J7622
$$ -12594 2004 1542 -3220 -5873 -7943 3918 5031 -7966 -8570 -18549 -32427 -24104 -30221 -12599
6084a2599K9144Q003j4460j2616j0795l659R349j937J3849J4357k86n665r89J0021
$$ -12599 16545 24548 10088 -2528 -13323 -16982 -7633 -9570 4279 18636 18350 12685 11696 21717
6070B1717k4977j6615K472J2804k329j8413M455Q692M508j1126J284P02o373j1377
$$ 21717 -3260 -19875 -17403 -4599 -6928 -25341 -20886 -12194 -7686 -18812 -17528 -16826 -23199 -34576
6056c4576q116O046P694K3274l320m087n199l718k633K810l290J3683p988j0621
$$ -34576 -42692 -36646 -28952 -5678 -8998 -13085 -18284 -22002 -24635 -21825 -25115 -11432 -19420 -30041
6042c0041R964j462o13O523L811m265K1500M38j0808l461k431P055J0056j0386
$$ -30041 -20077 -21539 -22152 -15629 -11818 -16083 5417 5855 -4953 -8414 -10845 -3790 6266 -4120
6028d120n671K1850O223M97l56O130k111k5569k3114r75O862J2575J5049k102
$$ -4120 -9791 12059 18282 18779 18423 24553 22442 -3127 -26241 -27216 -20354 -7779 7270 5168
6014E168k257N22J2787o260j4077J1942L932k451l232O66n399R137J601m779k452
$$ 5168 2911 3433 16220 9960 -4117 7825 11757 9306 6074 6740 1341 10478 12079 7300 4848
5999D848K140o29j803j2577j793r051J9569O187j4320j583m620p617N409j1611
$$ 4848 6988 6359 4556 -8021 -9814 -18865 704 6891 -7429 -9012 -13632 -21249 -15840 -27451
5985b7451n57J6758J6021o107r275j55O029R299J2687l359q982p4M689p564r021
$$ -27451 -28008 -11250 4771 -1336 -10611 -10766 -4737 4562 17249 13890 4908 4834 9523 1959 -7062
5970g062m806P121j723J618N780j60L448l467L3l834j4061L957J9423m515j2259
$$ -7062 -11868 -4747 -6470 -4852 928 768 4216 749 782 -3052 -17113 -13156 6267 1752 -10507
5955a0507M869r548K12P173j5841j4441J6934j978K0818N460o067J1988l191p826
$$ -10507 -5638 -15186 -14974 -7801 -23642 -38083 -21149 -23127 -2309 3151 -2916 9072 5881 -1945
5941a945k161N558r720j1882k055M841l100L316J5084K1023r953l1076r990J7332
$$ -1945 -4106 1452 -8268 -20150 -22205 -17364 -20464 -17148 -2064 18959 9006 -22070 -32060 -14728
5927a4728J0529r836J048N526N327J1566n318j7060J7499J5854M963j0124k1222
$$ -14728 -4199 -14035 -12987 -7461 -2134 9432 4114 -12946 4553 20407 25370 15246 -5976
5914e976j7887k643O24K1092J7624K649j5409j0616P510M524j525P005M400P061
$$ -5976 -23863 -26506 -25882 -4790 12834 15483 74 -10542 -3032 1492 -33 6972 11372 18433
5900A8433o249j406L953J948j1161j0418P501k854j0070J7409o728j4627m240
$$ 18433 12184 10778 14731 16679 5518 -4900 2601 -253 -10323 7086 358 -14269 -18509
5887a8509J5870J347p1j614o454k146O107r404J5546J2876p590L978j1094r716
$$ -18509 -2639 -1292 -1363 -2977 -9431 -11577 -5470 -14874 672 13548 5958 9936 -1158 -10874
5873a0874k438K019j445M569j1227j1515J4634M09J7541K1881j472P122j3745
$$ -10874 -13312 -11293 -12738 -8169 -19396 -30911 -16277 -15868 1673 23554 22082 29204 15459
5860A5459N617o538j985j6131J241M595q453l257L316l268n86p106j822N367o878
$$ 15459 21076 14538 12553 -3578 -2337 2258 -6195 -9452 -6136 -9404 -9990 -17096 -18918 -13551 -20429
5845b0429K848J1440m643o527J1699l506j4139l824N432J561m860O057O267k584
$$ -20429 -17581 -6141 -10784 -17311 -5612 -9118 -23257 -27081 -21649 -20088 -24948 -18891 -12624 -15208
5831a5208j5749q777J2698L865J275P558j2451m061O919q561K7707K0673m508
$$ -15208 -30957 -39734 -27036 -23171 -21896 -14338 -26789 -30850 -23931 -32492 -4785 15888 11380
5818A1380j5882j9603r6K5586K645k0143o908J0646N705Q031j5318r21J3179P993
$$ 11380 -4502 -24105 -24201 1385 4030 -16113 -23021 -12375 -6670 1361 -13957 -14878 -1699 6294
5804F294O068M204r249M259J998j070q930j4175O524J2505o88J57q166j0519P354
$$ 6294 12362 16566 7317 11576 13574 12504 3574 -10601 -4077 8428 7740 7897 -269 -10788 -3434
5789c434K5o220J0053Q93j2188J0614J0305K1853L17j1662k1946K029O023o829
$$ -3434 -3409 -9629 424 1317 -10871 -257 10048 31901 32218 20556 -1390 639 6662 -167
5775a67R309O353p203K266J4784j31r127j454k2797j2880o948P233J0742J9852
$$ -167 9142 15495 8292 10558 25342 25211 16084 14630 -8167 -21047 -27995 -20762 -10020 9832
5761I832J0375q924k567N166L68L01K236m373n206j010q926j8975j6033r580P936
$$ 9832 20207 11283 8716 13882 14250 14551 16787 12414 7208 6198 -2728 -21703 -37736 -47316 -39380
5746c9380J0125J6263J6982l670j60J1011q130j3155p079P489K7784J8006M079
$$ -39380 -29255 -12992 3990 320 160 11171 3041 -10114 -17193 -9704 18080 36086 40165
5733D0165j6503J320J0123O299m480j1606j9597p837J1870J1289n738o084N388
$$ 40165 23662 24982 35105 41404 36924 25318 5721 -2116 9754 21043 15305 9221 14609
5720A4609J2249J1544k6519k0540o406J3105M514J6373o916j9837k48j205k439
$$ 14609 26858 38402 11883 -8657 -15063 -1958 2556 18929 12013 -7824 -8072 -9277 -11716
5707a1716K75k113K055j973L241k517K2347n521j8554J2641Q144P283j2313r691
$$ -11716 -11441 -13554 -11499 -13472 -10231 -12748 9599 4078 -14476 -1835 6309 13592 1279 -8412
5693h412R55l308j2441j2231M457K3423R889j5925q118j1268N22J3681J6j436
$$ -8412 -7457 -10765 -23206 -35437 -30980 -7557 2332 -13593 -21711 -32979 -32457 -18776 -18760 -20196
5679b0196Q121R860j386R7n283J0910J4115K427m5O893k228j4679O076n702j5794
$$ -20196 -12075 -2215 -3601 -3504 -8787 2123 16238 18665 18620 25513 23285 8606 14682 8980 -6814
5664f814j0887l727P637J8937k478n099K249j0073j5614K0411M517J3048R702
$$ -6814 -17701 -21428 -13791 5146 2668 -2431 -182 -10255 -25869 -5458 -941 12107 21809
5651B1809k0407k595M816k755m673o552j0817j3397k7719J454J7351L0334P066
$$ 21809 1402 -1193 3623 868 -3805 -10357 -21174 -34571 -62290 -60836 -43485 -13151 -6085
5638f085j2627q354J1779Q124M740j0040L083K3943R249j6377j1225k141Q294
$$ -6085 -18712 -27066 -15287 -7163 -2423 -12463 -9380 14563 23812 7435 -3790 -5931 2363
5625B363n289j3052o87J5393Q280J0780k007P756P396L949q461j6300j6995p020
$$ 2363 -2926 -15978 -16665 -1272 7008 17788 15781 23537 30933 34882 26421 10121 -6874 -13894
5611a3894O994Q494j415L886K847O017M671j2603j8518R203O926j785j7848l189
$$ -13894 -6900 1594 179 4065 6912 12929 17600 4997 -13521 -4318 2608 823 -17025 -20214
5597b0214J1560J474j0216R958l707J7377r340k784Q047j127q12j3015K541Q332
$$ -20214 -8654 -7180 -17396 -7438 -11145 6232 -3108 -5892 2155 1028 216 -12799 -10258 -1926
5583a926Q292j23j4784Q160J3094J253J1727n386o880K041J5716M56k8517o548
$$ -1926 6366 6243 -8541 -381 12713 13966 25693 20307 13427 15468 31184 31640 3123 -3425
5569c425J5974L395j0128k1090l853k182m531n418J8225R469n132P335P799j42
$$ -3425 12549 15944 5816 -15274 -19127 -21309 -25840 -31258 -13033 -3564 -8696 -1361 6438 6296
5555F296N793j916N879m547q87J3704j1625j4571J084J7261r723Q57j7679j3813
$$ 6296 12089 10173 16052 11505 10618 24322 12697 -1874 -790 16471 6748 7605 -10074 -23887
5541b3887J1996l506k849K1988O61k227j5406j7704o009J929l670R052Q292O137
$$ -23887 -11891 -15397 -18246 3742 4403 2176 -13230 -30934 -36943 -35014 -38684 -29632 -21340 -15203
5527a5203N927p476k149j0326P751K342K922J77m678N594J883q418O244k957m867
$$ -15203 -9276 -16752 -18901 -29227 -21476 -19134 -16212 -16035 -20713 -15119 -13236 -21654 -15410 -18367 -23234
5512b3234K757J003p502O314J5740j2192j727K300L480L771j49K041j2257j4711
$$ -23234 -20477 -19474 -26976 -20662 -4922 -17114 -18841 -16541 -13061 -9290 -9439 -7398 -19655 -34366
5498c4366p159L661L359K94M998J2500J4667L047J238R045Q114j0751M926N593
$$ -34366 -41525 -37864 -34505 -34211 -29213 -16713 -2046 1001 2239 11284 19398 8647 13573 19166
5484A9166Q597j0334j0949o969j7M597q382k570r15m221j0514Q127J1876J2237
$$ 19166 27763 17429 6480 -489 -506 4091 -4291 -6861 -7776 -11997 -22511 -14384 -2508 9729
5470I729J5064J819j0811j6358j0335j7155k989J0463m81j2543m793K1254J7320
$$ 9729 24793 26612 15801 -557 -10892 -28047 -31036 -20573 -21054 -33597 -38390 -17136 184
5457A84j1313q893j893l853j2550J5343O8J739l754R099J5485j2735p734n187
$$ 184 -11129 -20022 -21915 -25768 -38318 -22975 -22907 -21168 -24922 -15823 -338 -13073 -20807 -25994
5443b5994L926J0220J4980k293j1794o56J971K0002K2667Q590q036j0316n451
$$ -25994 -22068 -11848 3132 839 -10955 -11611 -9640 10362 33029 41619 33583 23267 17816
5430A7816N325p151j3770R470k239j1645j2019m751L281P858J2472m210n737j4902
$$ 17816 23141 15990 2220 11690 9451 -2194 -14213 -18964 -15683 -7825 4647 437 -5300 -20202
5416b0202j0907O221J4141o150j5540J7075m190l733J5913Q398J2181L554j3216
$$ -20202 -31109 -24888 -10747 -16897 -32437 -15362 -19552 -23285 -7372 1026 13207 16761 3545
5403C545j9737q601L019O040M32Q537n455n649J3275K773J245n483l301J6416
$$ 3545 -16192 -24793 -21774 -15734 -15302 -6765 -12220 -17869 -4594 -1821 -576 -6059 -9360 7056
5389G056R879R12j6115j0159P941m372m682J0122J528m243j2974m24J3775m571
$$ 7056 16935 17847 1732 -8427 -486 -4858 -9540 582 2110 -2133 -15107 -15531 -1756 -6327
5375f327K534j0475j2961j3986k274k502J7661J3437J0229j0018Q37R313Q227
$$ -6327 -3793 -14268 -27229 -41215 -43489 -45991 -28330 -14893 -4664 -14682 -13845 -4532 3695
5362C695K121N581N04j3478J680O305N391o631p561J0962j212J1737Q445k1025
$$ 3695 5816 11397 11901 -1577 103 6408 11799 5168 -2393 8569 7357 19094 27539 6514
5348F514j7641j6905J977j006Q433J4387j304k2019l539R17K422J3442J1965J1694
$$ 6514 -11127 -28032 -26055 -27061 -18628 -4241 -5545 -27564 -31103 -30186 -27764 -14322 -2357 9337
5334I337j932j1918N717J1330L288K254N56j4949J132j490q861j350J1934K878
$$ 9337 7405 -4513 1204 12534 15822 18076 18632 3683 4815 3325 -5536 -6886 5048 7926
5320G926j1756j18J0195N843k497r209m179j499m783J1782r45J2183j9512q345
$$ 7926 -3830 -3948 6247 12090 9593 384 -3795 -5294 -10077 1705 760 12943 -6569 -14914
5306a4914K0337q242r002J7917M409j3512J348R977p202R97r772K660P982O854
$$ -14914 5423 -2819 -11821 6096 10505 -3007 -1659 8318 1116 2113 -7659 -4999 2983 9837
5292I837p074j7878K17K670K1344J6484r124j5342R268J252j1875l603K746l137
$$ 9837 2763 -15115 -14898 -12228 9116 25600 16476 1134 10402 11654 -221 -3824 -1078 -4215
5278d215k6046M337K4116J2495N986O457o43p867p987Q987M266k5615j5089J0917
$$ -4215 -30261 -25924 -1808 10687 16673 23130 22487 14620 6633 15620 19886 -5729 -20818 -9901
5264i901l931M369M097j5378r130R384r902Q963k082o568r984J2740j120L937
$$ -9901 -13832 -9463 -5366 -20744 -29874 -20490 -30392 -21429 -23511 -30079 -40063 -27323 -28443 -24506
5250b4506L2207R770j7171j564J4662J3345Q529L939J021j7587j8729m752q437
$$ -24506 7701 17471 300 -1264 13398 26743 35272 39211 40232 22645 3916 -836 -9273
5237i273p2J4882O377j0549q277L65P198k644j6539M929K3663N566j0567o964
$$ -9273 -9345 5537 11914 1365 -6912 -6547 651 -1993 -18532 -13603 10060 15626 5059 -1905
5223a905K455j3580l457J3143l900j7962L266q634l049J1447j4793K967P929M883
$$ -1905 550 -13030 -16487 -3344 -7244 -25206 -21940 -30574 -33623 -22176 -36969 -34002 -26073 -21190
5209b1190P545j1749l132L198j2417J192J0785n077n329R701J1461l66L27J868
$$ -21190 -13645 -25394 -28526 -25328 -37745 -36553 -25768 -30845 -36174 -26473 -15012 -15378 -15051 -13183
5195a3183J2810Q669R936m677n230l124o848l741J0278J7060q018m616k283P931
$$ -13183 -373 8296 18232 13555 8325 5201 -1647 -5388 4890 21950 13932 9316 7033 14964
5181A4964o305k0271j2500J2421K4952Q255p550j1487j1612J835N644R601l208
$$ 14964 8659 -11612 -24112 -11691 13261 21516 13966 2479 -9133 -7298 -1654 7947 4739
5168D739l135R551P493j165P110N761j4984j6238r759N640J3117J6029L901j1596
$$ 4739 1604 11155 18648 17483 24593 30354 15370 -868 -10627 -4987 8130 24159 28060 16464
5154A6464Q707P898j0531P420m661j8875p036m793J8233N105l1754M233L26K892
$$ 16464 25171 33069 22538 29958 25297 6422 -614 -5407 12826 17931 -13823 -9590 -9264 -6372
5140f372m346P765J6294N512j4312l957l276o493k945q84l278O581J0722l250
$$ -6372 -10718 -2953 13341 18853 4541 584 -2692 -9185 -12130 -13014 -16292 -9711 1011 -2239
5126b239j9694J403J5259j0465j1265P179L595r634N219J538K405J0391M198J2784
$$ -2239 -21933 -20530 -5271 -15736 -27001 -19822 -16227 -25861 -20642 -19104 -16699 -6308 -2110 10674
5112A0674J115m382r757J2980k80j0240j0215J8422J7625j0159k7004J81j0332
$$ 10674 11789 7407 -2350 10630 10350 110 -10105 8317 25942 15783 -11221 -11040 -21372
5099b1372j5177l3R704J4278M983q812J4830m126q012N819P647J4401j595m818
$$ -21372 -36549 -36582 -26878 -12600 -7617 -16429 -1599 -5725 -13737 -7918 -271 14130 12535 7717
5085G717J0647J480m638m556q810j289J1486l733j3970N156j464Q580K378m702
$$ 7717 18364 19844 15206 10650 1840 551 12037 8304 -5666 -510 -1974 6606 8984 4282
5071D282L289j4335l213R399K475k678j7379L641J6474J976P353N567k143L314
$$ 4282 7571 -6764 -9977 -578 1897 -781 -18160 -14519 1955 3931 11284 16851 14708 18022
5057A8022k985r216l373r098j0226k564K096P55Q161J5178M57k0942n797K539
$$ 18022 15037 5821 2448 -6650 -16876 -19440 -17344 -16589 -8428 6750 7207 -13735 -19532 -16993
5043a6993K865j1510p48P307R466m807q927M129R384j2571l779j137J616R050
$$ -16993 -14128 -25638 -26386 -19079 -9613 -14420 -23347 -19218 -9834 -22405 -26184 -27321 -25705 -16655
5029a6655j5322j1595K0854J5916j697P420J2637p5j7931J1640Q431O887L108
$$ -16655 -31977 -43572 -22718 -6802 -8499 -1079 11558 11483 -6448 5192 13623 20510 23618
5016B3618m576l451o786l300J5596k355p181j1665R49J263N854O179j1535L129
$$ 23618 19042 15591 8805 5505 21101 18746 11565 -100 849 2112 7966 14145 2610 5739
5002E739O237K273j7810j6086j0213P137J187K908J1387J6714O362j646p8o156
$$ 5739 11976 14249 -3561 -19647 -29860 -22723 -21536 -18628 -7241 9473 15835 14189 14111 7955
4988G955j2810L755J2504P249q046o121q568N3M104K0001j901P051k421k4097
$$ 7955 -4855 -1100 11404 18653 10607 4486 -4082 -4029 75 20076 18175 25226 22805 -1292
4974a292j4416l767K4761J638o962M206J0708r779k0334M406L639J098m040m574
$$ -1292 -15708 -19475 5286 6924 -38 4168 14876 5097 -15237 -10831 -7192 -6094 -10134 -14708
4960a4708M870j597K1244L036o865j2219j4709K477J0823k605P467p817j2279
$$ -14708 -9838 -11435 9809 12845 5980 -6239 -20948 -18471 -7648 -10253 -2786 -10603 -22882
4947b2882J1193K8514K033k921n62j0971l241q113J1529j3966j0452J4747k887
$$ -22882 -11689 16825 18858 15937 15375 4404 1163 -6950 4579 -9387 -19839 -5092 -7979
4934g979r475n926J5066J6758j1973P523K3341j0534k6257q934Q890J8448j1065
$$ -7979 -17454 -23380 -8314 8444 -3529 3994 27335 16801 -9456 -18390 -9500 8948 -2117
4921b117j595R146P442M433P453j1150o134q287j3569K0609N188k199k185M772
$$ -2117 -3712 5434 12876 17309 24762 13612 7478 -809 -14378 6231 11419 9220 7035 11807
4907A1807Q516k777r179j0020K512o834r903O594R555k222K890K3863J7272K616
$$ 11807 20323 17546 8367 -1653 859 -5975 -15878 -9284 271 -1951 939 24802 42074 44690
4893D4690k5927l1448L442N310L535j0337J7721J1400q400j2709l022J4746J1768
$$ 44690 18763 -12685 -9243 -3933 -398 -10735 6986 18386 9986 -2723 -5745 9001 20769
4880B0769m097j4627N845j8999j7819P978J692j0160j855J4024M207k220l122
$$ 20769 16672 2045 7890 -11109 -28928 -20950 -19258 -29418 -31273 -17249 -13042 -15262 -18384
4867a8384J3748J7978J0289j9433j3341o007q402J382n283R663R235j3646J07
$$ -18384 -4636 13342 23631 4198 -9143 -15150 -23552 -22170 -27453 -17790 -8555 -22201 -22094
4854b2094J1165j0288K807J9079J7315n62k9199p26m16o230p58n498L705J5332
$$ -22094 -10929 -21217 -18410 669 17984 17422 -11777 -12503 -12919 -19149 -19907 -25405 -21700 -6368
4840f368M642J44O174Q143j2683J0964m546m500l121p591j702Q989N15O179N520
$$ -6368 -1726 -1582 4592 12735 52 11016 6470 1970 -1151 -8742 -10444 -1455 -940 5239 10759
4825A0759n526j6151m472O264J5338N92j3754P100J3387K804j0680j5182P595
$$ 10759 5233 -10918 -15390 -9126 6212 6804 -6950 150 13537 16341 5661 -9521 -1926
4812a926J369k35q080k423n466J4234R21J0606J2302j0634M172M753J0307k503
$$ -1926 -557 -792 -8872 -11295 -16761 -2527 -1606 9000 21302 10668 14840 19593 29900 27397
4798B7397j6497m635m655k635M572j4329J717J6324L632n899Q182J0472o790k08
$$ 27397 10900 6265 1610 -1025 3547 -10782 -9065 7259 10891 4992 13174 23646 16856 16648
4784A6648N589M03n76L342j016M717N249j0115j0841O34J3423j5350j3107M529
$$ 16648 22237 22640 22064 25406 24390 29107 34356 24241 13400 14034 27457 12107 -1000 3529
4770C529m97j0187N75J371J414k25O378N485k2866P055K0754M492j5549k2645
$$ 3529 3032 -7155 -6580 -5209 -3795 -4020 2358 7843 -15023 -7968 12786 17278 1729 -20916
4756b0916m565o79N78J2151j653J2229J6037R687M930r428k655k080j9556J1751
$$ -20916 -25481 -26160 -25582 -13431 -15084 -2855 13182 22869 27799 18371 15716 13636 -5920 5831
4742E831P453j6609k654J8574p025o800n736l209N505N076O35K981K485O969K2546
$$ 5831 13284 -3325 -5979 12595 5570 -1230 -6966 -10175 -4670 406 1041 4022 6507 13476 36022
4727C6022O077j3912M813j7889j8889j0713k843J3792l778p765O389q666J2923
$$ 36022 42099 28187 33000 15111 -3778 -14491 -17334 -3542 -7320 -15085 -8696 -17362 -4439
4714d439J6738J9033q142r771j3223r437N649J494J8139R06j6569O853O369n180
$$ -4439 12299 31332 23190 13419 196 -9241 -3592 -2098 16041 16947 378 7231 13600 8420
4700H420j4642j0207m975r359J1053J6037N560J883k485K398q035J249j7338r688
$$ 8420 -6222 -16429 -21404 -30763 -19710 -3673 1887 3770 1285 3683 -4352 -3103 -20441 -30129
4686c0129N063O093J185M14o813n620P290j876J2524J0470j0985r069J209o13
$$ -30129 -25066 -18973 -17788 -17374 -24187 -29807 -22517 -24393 -11869 -1399 -12384 -21453 -20244 -20857
4672b0857J4951k381j2088Q901O573J124J0806J1603J1248o725r129j2062j5208
$$ -20857 -5906 -8287 -20375 -11474 -4901 -3777 7029 18632 29880 23155 14026 1964 -13244
4659a3244L617K4643J2528j3516L639k061p522O470K330p930j7196m622O134n67
$$ -13244 -9627 15016 27544 14028 17667 15606 8084 14554 16884 8954 -8242 -12864 -6730 -7297
4645g297j4603R651K0243J8962K350k8002j0921J1044L280j3966M122n566k958
$$ -7297 -21900 -12249 7994 26956 29306 1304 -9617 1427 4707 -9259 -5137 -10703 -13661
4632a3661L3879N00j8709p891Q841m67j4546j61O934N033Q424J0082M678j0349
$$ -13661 20218 20718 2009 -5882 2959 2492 -12054 -12215 -5281 -248 8176 18258 22936 12587
4618A2587M800j7364j2194o426R315J0123J9015R333j6832j8222J9681j857J25
$$ 12587 17387 23 -12171 -18597 -9282 841 19856 29189 12357 -5865 13816 11959 12084
4605A2084j2429N807Q760K492j0048n157n231Q592o631j6036P660m633J3958O07
$$ 12084 -345 5462 14222 16714 6666 1509 -3722 4870 -1761 -17797 -10137 -14770 -812 -205
4591b05j3491J276J9676J194r237j7597n4J3020R596j186q901j1817j849m341
$$ -205 -13696 -12420 7256 8450 -787 -18384 -18438 -5418 4178 2992 -5909 -17726 -19575 -23916
4577b3916P954k808r95o038J8220N567N751J1708Q73J0420J4081n272j6929j8819
$$ -23916 -15962 -18770 -19765 -25803 -7583 -2016 3735 15443 16316 26736 40817 35545 18616 -203
4563b03k383N41k226K983J1630j2831m651j1135O319Q954J3485j8333j7153J451
$$ -203 -2586 -2045 -4271 -1288 10342 -2489 -7140 -18275 -11956 -3002 10483 -7850 -25003 -23552
4549b3552J0279J0914j8182j0071R712L2319N658O02n052j5939q103O502J745
$$ -23552 -13273 -2359 -20541 -30612 -20900 11419 17077 17679 12627 -3312 -11415 -4913 -3168
4536c168N937l958l2958j0697q677J0268J1562N766J0881Q998l04J9859M969o435
$$ -3168 2769 -1189 -34147 -44844 -53521 -43253 -31691 -25925 -15044 -6046 -6350 13509 18478 12043
4522A2043j8430j8379m196J028M817J471J7439N805K446O005K317J0545l223p438
$$ 12043 -6387 -24766 -28962 -27934 -23117 -21646 -4207 1598 4044 10049 12366 22911 19688 12250
4508A2250q975j6609q097j0607J7423K4166N127l558n428Q225J420j3504k216
$$ 12250 3275 -13334 -21431 -32038 -14615 9551 14678 11120 5692 13917 15337 1833 -383
4495c83L545J2764p126p526q47L13r849j3131q964j0079J2207K5871r550q541
$$ -383 3162 15926 8800 1274 427 740 -9109 -22240 -31204 -41283 -29076 -3205 -12755 -21296
4481b1296j0275L801Q459P095j0790o461J5357L0743L052j3079m695p520k2247
$$ -21296 -31571 -27770 -19311 -12216 -23006 -29467 -14110 16633 19685 6606 1911 -5609 -27856
4468b7856n517O932q52j3731P252J7818J6334J863l554l595%n236p864N805J5533
$$ -27856 -33373 -26441 -27293 -41024 -33772 -15954 380 2243 -1311 -4906 -4906 -10142 -18006 -12201 3332
4453C332R183j0073k358Q130L171j39L351j4689j2893L430m609j2057M197K602
$$ 3332 12515 2442 84 8214 11385 11246 14597 -92 -12985 -9555 -14164 -26221 -22024 -19422
4439a9422m339k832J9582M285J930j687J3459O614L142O09R711j2142j8731j2778
$$ -19422 -23761 -26593 -7011 -2726 -796 -2483 10976 17590 20732 21341 31052 18910 179 -12599
4425a2599l506J2456O088P610j567m366n271J0179p94q07m078k6782n201J8190
$$ -12599 -16105 -3649 2439 10049 8482 4116 -1155 9024 8230 7423 3345 -23437 -28638 -10448
4411a0448r355j1096N871J4911J006r137o512K555p216Q92K0942Q340J506k328
$$ -10448 -19803 -30899 -25028 -10117 -9111 -18248 -24760 -22205 -29421 -28529 -7587 753 2259 -69
4397f9j1855j2006L899J51m894J56J0546J5524J04j4704Q637J8653k776j5452
$$ -69 -11924 -23930 -20031 -19880 -24774 -24618 -14072 1452 1556 -13148 -4511 14142 11366 -4086
$$ [...]
##END NTUPLES=NMR SPECTRUM
##END=
