##TITLE=Analysis number 318743
Compound Code btb 06842
Project Code adrs
Chemist Name ugmt
##JCAMPDX= 6.0         $$ Bruker NMR JCAMP-DX V2.0
##DATA TYPE= NMR SPECTRUM
##DATA CLASS= NTUPLES
##ORIGIN= Bruker BioSpin GmbH
##OWNER= nmr
$$ XWIN-NMR		Version 3.5
$$ Wed Apr 12 11:28:20 2006 GMT Daylight Time (UT+1h)  MAYBRIDGE\nmr@NMR_250MHZ
##.OBSERVE FREQUENCY= 250.131544655141
##.OBSERVE NUCLEUS= ^1H
##.ACQUISITION MODE= SIMULTANEOUS (DQD)
##.ACQUISITION SCHEME= undefined
##.AVERAGES= 16
##.DIGITISER RES= 18
##SPECTROMETER/DATA SYSTEM= dpx250
##.PULSE SEQUENCE= zg30
##.SOLVENT NAME= CDCl3
##.SHIFT REFERENCE= (INTERNAL, CDCl3, 0, 16.4583)
##AUDIT TRAIL= $$ (NUMBER, WHEN, WHO, WHERE, WHAT)
$$ ##TITLE= Audit trail, XWIN-NMR		Version 3.5
$$ ##JCAMPDX= 5.01
$$ ##ORIGIN= Bruker BioSpin GmbH
$$ ##OWNER= nmr
$$ C:\u/data/dgb/nmr/ADRS/2590/pdata/1/auditp.txt
$$ ##AUDIT TRAIL=  $$ (NUMBER, WHEN, WHO, WHERE, WHAT)
(   1,<2006-04-12 11:27:57.69 +100>,<MAYBRIDGE\nmr>,<NMR_250MHZ>,
      <created by zg, POWCHK disabled, PULCHK disabled
       configuration hash MD5:
       84 BC 41 DB A1 6E 1D 46 DA 25 12 A5 C1 ED C5 3A
       data hash MD5: 64K
       3C 9F 3B 28 9F F2 83 DE FB 52 34 A4 6A A0 E3 19>)
(   2,<2006-04-12 11:28:10.71 +100>,<MAYBRIDGE\nmr>,<NMR_250MHZ>,
      <Start of raw data processing
       ef LB = 0.3 FT_mod = 6 PKNL = 1 SI = 32K 
       data hash MD5: 32K
       4B 28 24 11 6A B0 91 E6 5D EA F2 D7 A2 EA 90 02>)
(   3,<2006-04-12 11:28:12.21 +100>,<MAYBRIDGE\nmr>,<NMR_250MHZ>,
      <apk 
       data hash MD5: 32K
       71 17 47 0E 91 F4 22 3D 27 E2 F8 05 68 5E 83 D6>)
(   4,<2006-04-12 11:28:12.93 +100>,<MAYBRIDGE\nmr>,<NMR_250MHZ>,
      <abs ABSG = 5 
       data hash MD5: 32K
       E6 E4 ED 14 BA 61 42 FE AF 6F 7F 79 6D 0F B0 BA>)
$$ ##END=
$$ 
$$ hash MD5
$$ 65 0E 0D D6 F9 52 BA 13 DE 18 DA A7 A0 FE C8 09
##$RELAX= 
##$RELAX= 
##$RELAX= 
##$RELAX= 
##$RELAX= 
##$RELAX= 
##$RELAX= 
$$ Bruker specific parameters
$$ --------------------------
##$DU= <C:\u>
##$EXPNO= 2590
##$NAME= <ADRS>
##$PROCNO= 1
##$TYPE= <nmr>
##$USER= <dgb>
##$AMP= (0..31)
100 100 100 100 100 100 100 100 100 100 100 100 100 100 100 100 100 100 
100 100 100 100 100 100 100 100 100 100 100 100 100 100 
##$AQSEQ= 0
##$AQ_mod= 3
##$AUNM= <au_zg>
##$AUTOPOS= <18 >
##$BF1= 250.13
##$BF2= 250.13
##$BF3= 250.13
##$BF4= 250.13
##$BF5= 500.13
##$BF6= 500.13
##$BF7= 500.13
##$BF8= 500.13
##$BYTORDA= 1
##$CFDGTYP= 0
##$CFRGTYP= 5
##$CHEMSTR= <none>
##$CNST= (0..31)
1 1 145 1 1 1 1 1 1 1 1 1 1 1 1 1 1 1 1 1 1 1 1 1 1 1 1 1 1 1 1 1 
##$CPDPRG= <>
##$CPDPRG1= <>
##$CPDPRG2= <>
##$CPDPRG3= <>
##$CPDPRG4= <mlev>
##$CPDPRG5= <mlev>
##$CPDPRG6= <mlev>
##$CPDPRG7= <mlev>
##$CPDPRG8= <mlev>
##$CPDPRGB= <>
##$CPDPRGT= <>
##$D= (0..31)
0 1 0 0 0 0 0 0 0 0.06 0 0 0 0 0 0 0.0002 0 0 0 0 0 0 0 0 0 0 0 0 0 0 
0 
##$DATE= 1144837676
##$DBL= (0..7)
120 120 120 120 120 120 120 120 
##$DBP= (0..7)
150 150 150 150 150 150 150 150 
##$DBP07= 0
##$DBPNAM0= <>
##$DBPNAM1= <>
##$DBPNAM2= <>
$$ [...]
##$SUBNAM7= <"">
##$SUBNAM8= <"">
##$SUBNAM9= <"">
##$SW= 20.6930455092707
##$SWIBOX= (0..15)
0 0 3 0 0 0 0 0 0 0 0 0 0 0 0 0 
##$SW_h= 5175.983436853
##$TD= 65536
##$TD0= 1
##$TE= 294.16
##$TE2= 300
##$TE3= 300
##$TEG= 300
##$TL= (0..7)
0 120 120 120 120 120 120 120 
##$TP= (0..7)
150 150 150 150 150 150 150 150 
##$TP07= 0
##$TPNAME0= <>
##$TPNAME1= <>
##$TPNAME2= <>
##$TPNAME3= <>
##$TPNAME4= <>
##$TPNAME5= <>
##$TPNAME6= <>
##$TPNAME7= <>
##$TPOAL= (0..7)
0.5 0.5 0.5 0.5 0.5 0.5 0.5 0.5 
##$TPOFFS= (0..7)
0 0 0 0 0 0 0 0 
##$TUNHIN= 0
##$TUNHOUT= 0
##$TUNXOUT= 0
##$USERA1= <user>
##$USERA2= <user>
##$USERA3= <user>
##$USERA4= <user>
##$USERA5= <user>
##$V9= 5
##$VALIST= <valist>
##$VCLIST= <CCCCCCCCCCCCCCC>
##$VD= 0
##$VDLIST= <DDDDDDDDDDDDDDD>
##$VPLIST= <PPPPPPPPPPPPPPP>
##$VTLIST= <TTTTTTTTTTTTTTT>
##$WBST= 1024
##$WBSW= 4
##$XGAIN= (0..3)
0 0 0 0 
##$XL= 0
##$YL= 0
##$YMAX_a= 419153
##$YMIN_a= -461791
##$ZGOPTNS= <>
##$ZL1= 120
##$ZL2= 120
##$ZL3= 120
##$ZL4= 120
##$ABSF1= 16.45829
##$ABSF2= -4.234882
##$ABSG= 5
##$ABSL= 3
##$ALPHA= 0
##$AQORDER= 0
##$ASSFAC= 0
##$ASSFACI= 0
##$ASSFACX= 0
##$ASSWID= 0
##$AUNMP= <proc_1d>
##$AZFE= 0.1
##$AZFW= 0.1
##$BCFW= 0
##$BC_mod= 0
##$BYTORDP= 0
##$COROFFS= 0
##$CY= 12.5
##$DATMOD= 1
##$DC= 0
##$DFILT= <>
##$DTYPP= 0
##$F1P= 14.0000005364418
##$F2P= -0.99999901652339
##$FCOR= 0.5
##$FTSIZE= 32768
##$FT_mod= 6
##$GAMMA= 0
##$GB= 0
##$INTBC= 1
##$INTSCL= 1
##$ISEN= 128
##$LB= 0.3
##$LEV0= 0
##$LPBIN= 0
##$MAXI= 10000
##$MC2= 0
##$MEAN= 0
##$ME_mod= 0
##$MI= 0
##$NCOEF= 0
##$NC_proc= -2
##$NLEV= 6
##$NOISF1= 0
##$NOISF2= 0
##$NSP= 0
##$NTH_PI= 0
##$NZP= 0
##$OFFSET= 16.45829
##$PC= 1
##$PHC0= 172.8221
##$PHC1= 3.405406
##$PH_mod= 1
##$PKNL= yes
##$PPARMOD= 0
##$PSCAL= 4
##$PSIGN= 0
##$REVERSE= no
##$SF= 250.130015933485
##$SI= 32768
##$SIGF1= 0
##$SIGF2= 0
##$SINO= 400
##$SIOLD= 32768
##$SREGLST= <1H.CDCl3>
##$SSB= 0
##$STSI= 32768
##$STSR= 0
##$SW_p= 5175.98343685301
##$SYMM= 0
##$S_DEV= 0
##$TDeff= 65536
##$TDoff= 0
##$TI= <Analysis number 999999
Compound Code 99
Book Reference 9
Project Code 9>
##$TILT= no
##$TM1= 0
##$TM2= 0
##$TOPLEV= 0
##$USERP1= <user>
##$USERP2= <user>
##$USERP3= <user>
##$USERP4= <user>
##$USERP5= <user>
##$WDW= 1
##$XDIM= 32768
##$YMAX_p= 301066839
##$YMIN_p= -115113
$$ End of Bruker specific parameters
$$ ---------------------------------
##NTUPLES= NMR SPECTRUM
##VAR_NAME=  FREQUENCY,     SPECTRUM/REAL,   SPECTRUM/IMAG
##SYMBOL=    X,             R,               I
##VAR_TYPE=  INDEPENDENT,   DEPENDENT,       DEPENDENT
##VAR_FORM=  AFFN,          ASDF,            ASDF
##VAR_DIM=   32768,         32768,           32768
##UNITS=     HZ,            ARBITRARY UNITS, ARBITRARY UNITS
##FACTOR=    0.157963299565203, 1,           1
##FIRST=     4116.71236497534, 0,            0
##LAST=      -1059.27107187767, 0,           0
##MIN=       -1059.27107187767, -115113,     0
##MAX=       4116.71236497534, 301066839,    0
$$ Real data points
##PAGE= N=1
##DATA TABLE= (X++(R..R)), XYDATA
$$ [...]
17000c8056J8432M615M556k8949k4043J4377K8301J7840q853j4409J671Q805L523
$$ -38056 -19624 -15009 -10453 -39402 -63445 -49068 -20767 -2927 -11780 -26189 -24518 -15713 -12190
16987a2190p84J5520j2149j2031n631J2740K0832j5996l6536L5438L0776P996
$$ -12190 -12974 2546 -9603 -21634 -27265 -14525 6307 -9689 -46225 -10787 19989 27985
16975B7985q019k0763k5794o742J2151j0r340J1908j0254P218K318J733J3420
$$ 27985 19966 -797 -26591 -33333 -21182 -21192 -30532 -18624 -28878 -21660 -19342 -17609 -4189
16962d189K4603J8204J1823k3247k7919k75R466L8948L632m4091l625L7747q049
$$ -4189 20414 38618 50441 27194 -725 -1000 8466 47414 51046 6955 3330 41077 33028
16949C3028j4166n666j0682K4411Q210k8765k2308J1074K4540j4564N402K8405
$$ 33028 18862 13196 2514 26925 35135 6370 -15938 -4864 19676 5112 10514 38919
16937C8919p574k5243j4514K799j4784J0390j1596j2521K2452j4593n099K2463
$$ 38919 31345 6102 -8412 -5613 -20397 -10007 -21603 -34124 -11672 -26265 -31364 -8901
16925h901O562J1334k830j636J2346J0798J9732j0947m948r586k9719k4914j7
$$ -8901 -2339 8995 6165 4529 16875 27673 47405 36458 31510 21924 -7795 -32709 -32726
16912c2726J5569m402p676k911L0163L0474J5470j4082p472j517m064O52J7689
$$ -32726 -17157 -21559 -29235 -32146 -1983 28491 43961 29879 22407 20890 16826 17478 35167
16899C5167J8671j8532k5853j1969j7305J6507q441J060k738p930j0490l492N358
$$ 35167 53838 35306 9453 -2516 -19821 -3314 -11755 -10695 -13433 -21363 -31853 -35345 -29987
16886b9987J7735J6636k0040J5481m677j5509M502O843j962J432J1485p670J403
$$ -29987 -12252 4384 -15656 -175 -4852 -20361 -15859 -9016 -10978 -9546 1939 -5731 -4328
16873d328j103L0458J1819l0310O766O507k2567j5950O558j6740K0433J5575j8195
$$ -4328 -5431 25027 36846 6536 13302 19809 -2758 -18708 -12150 -28890 -8457 7118 -11077
16860a1077n476j7253j87K0304R556j1410q662K0304j2018J8412j019P404J343
$$ -11077 -16553 -33806 -33993 -13689 -4133 -15543 -24205 -3901 -15919 2493 1474 8878 10221
16847A0221k2615j8386p575K4031J2873J41J3268J8671J0966j292j073j2317l23
$$ 10221 -12394 -30780 -38355 -14324 -1451 -1310 11958 30629 41595 40303 39230 26913 26590
16834B6590r984j5836O316o012N870J5315l532k1827M310J9993O137k982j4619
$$ 26590 16606 770 7086 1074 6944 22259 18727 -3100 1210 21203 27340 24358 9739
16821I739r286Q492n138J5859O862k8699j962r008J5445j2357J350L0196M938
$$ 9739 453 8945 3807 19666 26528 -2171 -4133 -13141 2304 -10053 -8703 21493 26431
16808B6431j9634l4568r169J4607n26j4886L325p981r603R6R275J8119R268j0087
$$ 26431 6797 -27771 -36940 -22333 -22859 -37745 -34420 -42401 -52004 -51908 -42633 -24514 -15246 -25333
16794b5333k124R924K5436N720o487J8395K955r615j4780k6172j6557M83P099
$$ -25333 -27457 -17533 7903 13623 7136 25531 28486 18871 4091 -22081 -38638 -38155 -31056
16781c1056P553K1276K711j2417J5260O001o292j0763l058o733J962j1457J0061
$$ -31056 -23503 -2227 484 -11933 3327 9328 3036 -7727 -10785 -17518 -15556 -27013 -16952
16768a6952J2913p872j1391q544j6255J2763K8299o603q018N385O722K0896L265
$$ -16952 -4039 -11911 -23302 -31846 -48101 -35338 -7039 -13642 -21660 -16275 -9553 11343 14608
16755A4608J525J750k917j4754Q630M900J5989r625j486K345k1250P760K6421
$$ 14608 16133 17883 14966 212 8842 13742 29731 20106 18620 20965 -285 7475 33896
16742C3896J4229j8637l7193k2511R880J454j7394q781n110O083J5110L0589L2533
$$ 33896 48125 29488 -7705 -30216 -20336 -18882 -36276 -45057 -50167 -44084 -28974 1615 34148
16729C4148p361l8572j6944K1359r299O24J6068J0441j2271o426r54N838o682
$$ 34148 26787 -11785 -28729 -7370 -16669 -16045 23 10464 -1807 -8233 -9187 -3349 -10031
16716a0031j223J670J1367j1564j7613p732P673L0639M513q713K1401J1104R111
$$ -10031 -11254 -9584 1783 -9781 -27394 -35126 -27453 3186 7699 -1014 20387 31491 40602
16703D0602j7015P03P167k4835k3573P843k7354k8197k295L938J3273K6882l689
$$ 40602 23587 24290 31457 6622 -16951 -9108 -36462 -64659 -66954 -63016 -49743 -22861 -26550
16690b6550q500P066L0116P211p94J6023K1303J3448k4685j2030j6219r478K057
$$ -26550 -35050 -27984 2132 9343 8549 24572 45875 59323 34638 22608 6389 -3089 -1032
16677a032o603n362j1286K119L5786O883q314J0171K858j6534j0393J434J616
$$ -1032 -7635 -12997 -24283 -22164 13622 20505 12191 22362 25220 8686 -1707 -273 1343
16664A343P119m913o410R424k095Q832K9261j4668j5998l309r665L654P592k6603
$$ 1343 8462 3549 -2861 6563 4468 13300 42561 27893 11895 8586 -1079 2575 10167 -16436
16650a6436q441K3622J4282j6400j9119K0321N601j4026k6281Q815M386r334N450
$$ -16436 -24877 -1255 13027 -3373 -22492 -2171 3430 -10596 -36877 -28062 -23676 -33010 -27560
16637b7560J0431l463j4789L382L4389J93q572k555P698q56k3349P063L3599O291
$$ -27560 -17129 -20592 -35381 -31999 2390 2583 -5989 -8544 -846 -1702 -25051 -17988 15611 21902
16623B1902N198j0020j748q913l2132j953J74K9136R958n383j5658l1640J4003
$$ 21902 27100 17080 15332 6419 -25713 -27666 -27492 1644 11602 6219 -9439 -41079 -27076
16610b7076J0692K7969Q140J7320N02k1180k7890l384J2473K3131P839j976J2331
$$ -27076 -16384 11585 19725 37045 37547 16367 -11523 -14907 -2434 20697 28536 26560 38891
16597C8891j1999k1658j4094m09n337N402j9462p306J5139q271k1012J2948M1729
$$ 38891 26892 5234 -8860 -9269 -14606 -9204 -28666 -35972 -20833 -29104 -50116 -37168 4561
16584D561J5224j3397m277p166k871J3502L9974J4948L11N175j1816j1323k3729
$$ 4561 19785 6388 2111 -5055 -7926 5576 45550 60498 60809 65984 54168 42845 19116
16571A9116k5291R37J1589K357o232K7879J8481K2246O056k5452j7118j3801J2990
$$ 19116 -6175 -5238 6351 8708 2476 30355 48836 71082 77138 51686 34568 20767 33757
16558C3757l145m750J6302n77m250m99l8138j9241n799j3801P621K2250K3517
$$ 33757 30612 25862 42164 41587 37337 36838 -1300 -20541 -26340 -40141 -32520 -10270 13247
16545A3247O602l637q998o136O092k4124o230L7436K0330Q292j4888k2258j4568
$$ 13247 19849 16212 7214 1078 7170 -16954 -23184 14252 34582 42874 27986 5728 -8840
16532h840P901j0129j6970K5883O492r978K7002N696j1843J2914M918l502j2404
$$ -8840 -939 -11068 -28038 -2155 4337 -5641 21361 27057 15214 28128 33046 29544 17140
16519A7140k5008l0575q405K7K1813K5315m784K2145M564k1951k340j5112j4289
$$ 17140 -7868 -38443 -46848 -46821 -25008 307 -4477 17668 22232 281 -2059 -17171 -31460
16506c1460J2647R609L308k7666l1740o971K7053K6092J9090L498M304l1953l9070
$$ -31460 -18813 -9204 -5896 -33562 -65302 -72273 -45220 -19128 -38 3460 7764 -24189 -63259
16493f3259K294M7147K5021j5765l401r127Q650l318j2495N058K7726K638J1346
$$ -63259 -60965 -13818 11203 -4562 -7963 -17090 -8440 -11758 -24253 -19195 8531 11169 22515
16480B2515L4m21N618K088j7325J5031Q28n300L679l159r732n583k848j4500l5394
$$ 22515 22549 22128 27746 29834 12509 27540 28368 23068 26747 23588 13856 8273 5425 -9075 -44469
16465d4469L690L6189J6091j5395R685J7555n344j284m28j2858o866J9831n169
$$ -44469 -40779 -4590 11501 -3894 5791 23346 18002 16718 16290 3432 -3434 16397 11228
16452A1228j7331K9918J8149l2701j5569K7189J8287R07K6445K0839K0871p39
$$ 11228 -6103 23815 41964 9263 -6306 20883 39170 40077 66522 87361 108232 107493
16440A07493m750l2173j6535J7066N393M610K1107K8144J475j9454j6412J8447
$$ 107493 102743 70570 54035 71101 76494 81104 102211 130355 131830 112376 95964 114411
16428A14411k0083o79L554j173l9187r591J0005P282r338j1518J3922K561j6157
$$ 114411 94328 93649 97203 96030 56843 47252 57257 64539 55201 43683 57605 60166 44009
16415D4009K871p421p525k4299P648M939n174J5208R772j3648p47k0606l247L718
$$ 44009 46880 39459 31934 7635 15283 20222 15048 30256 40028 26380 25633 5027 1780 5498
16401E498K27j1874l6557k043L9601j0964k855j1101j0004J6101L258O334p953
$$ 5498 5725 -6149 -42706 -44749 -5148 -16112 -18967 -30068 -40072 -23971 -20713 -14379 -22332
16388b2332j0112M143k5924j4054K2513P345K6453L6824o792j2613k6294j0703
$$ -22332 -32444 -28301 -54225 -68279 -45766 -38421 -11968 24856 18064 5451 -20843 -31546
16376c1546j062j2127p215K5529L505L760j646M487p887O413K3697R340l452n710
$$ -31546 -32608 -44735 -51950 -26421 -22916 -19156 -20802 -16315 -24202 -17789 5908 15248 11796 6086
16362F086K466K8921K386l1537l017J6397j2399m6381L177K1722P874m901K4114
$$ 6086 8552 37473 39859 8322 5305 21702 9303 -37078 -33901 -12179 -4305 -9206 14908
16349A4908K8489j2575k8504N5p269k7105r483O819K4736M305j7094j220j8390
$$ 14908 43397 30822 2318 2373 -4896 -32001 -41484 -34665 -9929 -5624 -22718 -23938 -42328
16336d2328J0156l46J6105m224P640L5713M154j2740j4454l948n738K351M047
$$ -42328 -32172 -32518 -16413 -20637 -12997 22716 26870 14130 -324 -4272 -10010 -7659 -3612
16323c612j084k2844N557K1632O897N739N811k1315P32J1050m36k4864Q13q603
$$ -3612 -4696 -27540 -21983 -351 6546 12285 18096 -3219 -2487 8563 8127 -16737 -15924 -24527
16309b4527l772J1286j3966j0064n98K716J0043J6512J2639M032Q609K649L552
$$ -24527 -28299 -17013 -30979 -41043 -41641 -38925 -28882 -12370 269 4301 12910 15559 19111
16296A9111n636j7369j6304P747J6094p13j3082l5983j277K2580J8450L817R368
$$ 19111 13475 -3894 -20198 -12451 3643 2930 -10152 -46135 -47412 -24832 -6382 -2565 6803
16283F803N031n086J166j6464j303j133j0839N502r544k0894O083J4322J2744
$$ 6803 11834 6748 7914 -8550 -9853 -10986 -21825 -16323 -25867 -46761 -40678 -26356 -13612
16270a3612j0795j3927J3536L0566J7468j1916l9733j4712J2654l558J8948r511
$$ -13612 -24407 -38334 -24798 5768 23236 11320 -28413 -43125 -30471 -34029 -15081 -24592
16258b4592M025J0280L879J3324k548k0191o037J4031Q511j1500k4935L468K3683
$$ -24592 -20567 -10287 -6408 6916 4368 -15823 -21860 -7829 682 -10818 -35753 -32285 -8602
16245h602J6171O669j6707J0244q489K180j3034k2809L0370K0444p452k3371j777
$$ -8602 7569 14238 -2469 7775 -714 1466 -11568 -34377 -4007 16437 8985 -14386 -16163
16232a6163O028k0879l0857P499K1237J8286J409q977O451O153r597l7041K8355
$$ -16163 -10135 -31014 -61871 -54372 -33135 -14849 -13440 -22417 -15966 -9813 -19410 -56451 -28096
16219b8096J8317j3917j4987j2424k038Q756L3780K1640J6027n972K1471j0855
$$ -28096 -9779 -23696 -38683 -51107 -53145 -44389 -10609 11031 27058 21086 42557 31702
16207C1702k954N030q953O616k3226k3501J8593L0003k467m730p445k222J794
$$ 31702 28748 33778 24825 31441 8215 -15286 3307 33310 30843 26113 18668 16446 18240
16194A8240J814j0757k4276j9888J0776K1576l005j1325j4542K3973R420j0501
$$ 18240 20054 9297 -14979 -34867 -24091 -2515 -5520 -16845 -31387 -7414 2006 -8495
16182h495p770j998K4830K8412j8969o072J3158K3752O35J053j3779j0526k218
$$ -8495 -16265 -18263 6567 34979 16010 9938 23096 46848 47483 48536 34757 24231 22013
16169B2013j367k2951J762R820j8908k811L165K829J7074O551L3422M523k8608
$$ 22013 20646 -2305 -543 9277 -9631 -12442 -9277 -6448 10626 17177 50599 55122 26514
16156B6514k1897J5190Q579J8561J2291m4341p083Q151l778L252k1447P530Q971
$$ 26514 4617 19807 28386 46947 59238 14897 7814 15965 12187 15439 -6008 1522 10493
16143A0493j4902K2071m749k4364L642m326k786n673j4380P969J092j479j854
$$ 10493 -4409 17662 12913 -11451 -7809 -12135 -14921 -20594 -34974 -27005 -25913 -27392 -29246
16130b9246J4642K5206p062k471j1693K5990M859R556J8388j6870l2911j0896
$$ -29246 -14604 10602 3540 1069 -10624 15366 20225 29781 48169 31299 -1612 -12508
16118a2508J0836J3432K222n65J309M754l154r291n547P851j4176j0838l004k8490
$$ -12508 -1672 11760 13982 13417 14726 19480 16326 7035 1488 9339 -4837 -15675 -18679 -47169
16104d7169r710K3072M2307J0243k3853J2851l6373p255J1389K1589L2053L6991
$$ -47169 -56879 -33807 8500 18743 -5110 7741 -28632 -35887 -24498 -2909 29144 66135
16092F6135L240j3574q883K598P109q357l4518m0402k5365K7471K5705K682p969
$$ 66135 69375 55801 46918 49516 56625 48268 13750 -26652 -52017 -24546 1159 3841 -4128
16079d128n451j2084j2220L1390R455J0875J0408j3114p625j2184j771M034N181
$$ -4128 -9579 -21663 -33883 -2493 6962 17837 28245 15131 7506 -4678 -6449 -2415 2766
16066B766N722n223L777K2026O516j7292K446k3074j9458J0277l6769Q619O552
$$ 2766 8488 3265 7042 29068 35584 18292 20738 -2336 -21794 -11517 -48286 -39667 -33115
16053c3115K1558N287k0123k258L1715K1164j1021k2557O217o190j227K0115j6196
$$ -33115 -11557 -6270 -26393 -28651 3064 24228 13207 -9350 -3133 -9323 -10550 9565 -6631
16040f631r419q926K1167J6538j2768Q218j4732k4734l58K0823J2684P668r020
$$ -6631 -16050 -24976 -3809 12729 -39 8179 -6553 -31287 -31645 -10822 1862 9530 510
16027E10j3509k8082J1489J3395K1183K2624q414l0131k0825j3969k0929j367
$$ 510 -12999 -41081 -29592 -16197 4986 27610 19196 -10935 -31760 -45729 -66658 -68025
16015f8025L499J948J5774j876J1019J8781k0111l634K2453K1578k93j0931K1190
$$ -68025 -64526 -62578 -46804 -48680 -37661 -18880 -38991 -42625 -20172 1406 1113 -9818 11372
16002A1372K2027k6568l855K2702O550j1545l3972j6863L5266K0595k720o577
$$ 11372 33399 6831 2976 25678 32228 20683 -13289 -30152 5114 25709 22989 16412
15990A6412k4870K768k84O699K3314L622j8388n909k958K004l916L591L3582r319
$$ 16412 -8458 -5690 -5974 725 24039 27661 9273 3364 406 2410 -1506 2085 35667 26348
15976B6348O522j0334l1538k3595O890M3947J667o089J2285J267k1967J1589K4977
$$ 26348 32870 22536 -9002 -32597 -25707 18240 19907 13818 26103 27370 5403 16992 41969
15963D1969j0010l3813n160R372j109l193K7405j11j104p397j5964j6251j0233
$$ 41969 31959 -1854 -7014 2358 1249 -1944 25461 25350 24246 16849 885 -15366 -25599
15950b5599j0085j3241k4757J6299K2519K5698J6710J9193K696q010l211K611
$$ -25599 -35684 -48925 -73682 -57383 -34864 -9166 7544 26737 29433 21423 18212 20823
15938B0823j0610j7572j564k9072N081J4179J8412n56q868O02J4826K7791J918
$$ 20823 10213 -7359 -8923 -37995 -32914 -18735 -323 -879 -9747 -9145 5681 33472 35390
15925C5390j5811q262J5078Q769j1355j4891j6174J2667P490o575J5557N51j4220
$$ 35390 19579 11317 26395 35164 23809 8918 -7256 5411 12901 6326 21883 22434 8214
15912H214p995r829Q266J3185j6427l148J2036N982P156P688j116o719n774j8375
$$ 8214 219 -9610 -1344 11841 -4586 -7734 4302 10284 17440 25128 24012 17293 11519 -6856
15898f856J0944R974J0300k557j088j0077O245j4679j437K833J22k785K646q226
$$ -6856 4088 14062 24362 21805 20717 10640 16885 2206 769 3602 3724 939 3585 -4641
15884d641l0705j6579K9252J9987J5912q048k5501J5219L8782K6093r733j5618
$$ -4641 -35346 -51925 -22673 -2686 13226 5178 -20323 -5104 33678 59771 50038 34420
15872C4420J1615K74K489m2752j2794k147k3003K847Q309M401J4520J6794K8981
$$ 34420 46035 46309 48798 6046 -6748 -8895 -31898 -29051 -20742 -16341 -1821 14973 43954
15859D3954n716k7975j6607k9213J883K0632J0371J773K988O041m10j8690M147
$$ 43954 38238 10263 -6344 -35557 -33674 -13042 -2671 -898 2090 8131 7721 -10969 -6822
15846f822P837n237o532J2278J6217n063k2218J5502p900r655l284K0971m880
$$ -6822 1015 -4222 -10754 1524 17741 12678 -9540 5962 -1938 -11593 -14877 6094 1214
15833A214m8918o147L8223K830N880P223o879J8265L837k5295m247J1973M4971
$$ 1214 -47704 -53851 -15628 -12798 -6918 305 -6574 11691 15528 -9767 -14014 -2041 42930
15820D2930n610j2824j9884J0435K191l147r139O506L96M020j2520n928R224J1217
$$ 42930 37320 24496 4612 15047 17238 14091 4952 11458 11854 15874 3354 -2574 6650 17867
15806A7867j0857l751j1069l1872L984J7657R722L624l2435l324J6488J049Q990
$$ 17867 7010 3259 -7810 -39682 -35698 -18041 -8319 -4695 -37130 -40454 -23966 -22917 -13927
15793a3927J2369J011k4514k94m869J7002M374o379j3537Q957J3530K153j2936
$$ -13927 -1558 -547 -25061 -25355 -30224 -13222 -8848 -15227 -28764 -19807 -6277 -4124 -17060
15780a7060k1723J510J5700Q547n935j1129R245L918J068P166N90j8816M012j8672
$$ -17060 -38783 -37273 -21573 -13026 -18961 -30090 -20845 -16927 -15859 -8693 -8103 -26919 -22907 -41579
15766d1579Q47M494K751L2234K735J5245K4835J3496k0009l7725M3O204j5638
$$ -41579 -40732 -36238 -33487 -1253 1482 16727 41562 55058 35049 -2676 -2633 3571 -12067
15753a2067L258J488J4180o47M301M058R631J175J901l9955K880P604q28M750
$$ -12067 -8809 -7321 6859 6212 10513 14571 24202 25377 27278 -12677 -9797 -2193 -3021 1729
15739A729L216j7976j4994J3098o966j3472J7623M004l329P643K085R703J9292
$$ 1729 4945 -13031 -28025 -14927 -21893 -35365 -17742 -13738 -17067 -9424 -7339 2364 21656
15726B1656K5569r168p230j6077k5895o651l953M9738P280k3279k6455k0620M997
$$ 21656 47225 38057 30827 14750 -11145 -17796 -21749 27989 35269 11990 -14465 -35085 -30088
15713c0088K0001J6759L6788J9563k949o378l387j3996l4498l3913N917r804J0744
$$ -30088 -10087 6672 43460 63023 60074 53696 50309 36313 1815 -32098 -26181 -35985 -25241
15700b5241L5272K160k7092k5124L4469Q511O320n986j2831K4609Q74P362J078
$$ -25241 10031 12191 -14901 -40025 -5556 2955 9275 3289 -9542 15067 15941 23303 24381
15687B4381k6974j754K870J8901M713L89m171k1337J4030J0300m355j5821J3164
$$ 24381 -2593 -4347 -1477 17424 22137 22526 18355 -2982 11048 21348 16993 1172 14336
15674A4336k3716j7171P761L119j9889K2531J6161j1771r736j8949j3152m673
$$ 14336 -9380 -26551 -18790 -15671 -35560 -13029 3132 -8639 -18375 -37324 -50476 -55149
15662e5149O645J1431L022L490q848o317N338J7780Q927J408j7285L610j1781
$$ -55149 -48504 -37073 -34051 -30561 -39409 -45726 -40388 -22608 -13681 -12273 -29558 -25948 -37729
15649c7729P333l557M6045L3650k2606j7723k461J0992N801j0862j5963o112J3195
$$ -37729 -30396 -33953 12092 45742 23136 5413 2952 13944 19745 8883 -7080 -13192 3
15636Cj3870J7914K9412J737j9924p935j5484j9249N281J1468j0602k30N20L01
$$ 3 -13867 4047 33459 35196 15272 7337 -8147 -27396 -22115 -10647 -21249 -21479 -20959 -20658
15622b0658m007M189R501j073o176K0077L001k928j2944k0508j49J2300K7464
$$ -20658 -24665 -20476 -10975 -12048 -18224 1853 4854 1926 -11018 -31526 -31675 -19375 8089
15609H089j761L591p945J6150j1764j0396K2344q007k4606J5845Q581j9120m043
$$ 8089 6328 9919 1974 18124 6360 -4036 18308 10301 -14305 1540 10121 -8999 -13042
15596a3042k9664k6279L8205P527M761K360j8348O585K3445J899k5321o968n420
$$ -13042 -42706 -68985 -30780 -23253 -18492 -16132 -34480 -27895 -4450 -2551 -27872 -34840 -40260
15583d0260k181K7964O780J169j9601r367J6751M4396m417m147m939j4243K783
$$ -40260 -42441 -14477 -7697 -6528 -26129 -35496 -18745 25651 21234 17087 12148 -2095 688
15570F88n232k350P01q535p548L883R909m936Q81j096j6831K2453J5985J097j4542
$$ 688 -4544 -6894 -6193 -14728 -22276 -18393 -8484 -13420 -12539 -13635 -30466 -8013 7972 9069 -5473
15555e473j6699K3218J6613K59j679J0198J1528k2111j422j2467J5854K9526p185
$$ -5473 -22172 1046 17659 17918 16239 26437 37965 15854 14432 1965 17819 47345 40160
15542D0160j3716K881k2485m949j7457L117l822j4853k791j3669M801K1815K5750
$$ 40160 26444 29325 6840 1891 -15566 -12449 -16271 -31124 -33915 -47584 -42783 -20968 4782
15529D782k0135j1262K2830j8765j8590J9587M588J098k1880J1523j1110J9508
$$ 4782 -15353 -26615 -3785 -22550 -41140 -21553 -16965 -15867 -37747 -26224 -37334 -17826
15517a7826J6783P834j4497l923p441j3097j1536q346m711l773J9172R023J8017
$$ -17826 -1043 6791 -7706 -11629 -19070 -32167 -43703 -52049 -56760 -60533 -41361 -32338 -14321
15504a4321j4970J0264j0111o42J3949O546K008J3504j8073J1938J1049j0939
$$ -14321 -29291 -19027 -29138 -29780 -15831 -9285 -7277 6227 -11846 92 11141 202
15492B02n670O445m404J5142Q698l872j3187J4196J4941m1138l9591l248K2503
$$ 202 -5468 977 -3427 11715 20413 16541 3354 17550 32491 -8647 -48238 -51486 -28983
15479b8983P041K726K1969L5874K7266l3545k8736j7045j3235K6449K2828r172
$$ -28983 -21942 -19216 2753 38627 65893 32348 3612 -13433 -26668 -219 22609 13437
15467A3437J0307m3099k3639J8045O21K1351K2606L202j3665j5582Q865J4430
$$ 13437 23744 -19355 -42994 -24949 -24328 -2977 19629 22831 9166 -6416 2449 16879
15455A6879j0505p452K706J6959P426k0964j2749M791P377Q051j5580j1052j433
$$ 16879 6374 -1078 1628 18587 26013 5049 -7700 -2909 4468 12519 -3061 -14113 -15546
15442a5546q398l484J337p338k1617k594J8552J7511R485L79J365O897m072k8709
$$ -15546 -23944 -27428 -26091 -33429 -55046 -57640 -39088 -21577 -12092 -11713 -10348 -3451 -7523 -36232
15428c6232J0438K0784p982J4239N04O515l470k5172J052J7347J0304M414j0295
$$ -36232 -25794 -5010 -12992 1247 1751 8266 4796 -20376 -19324 -1977 8327 12741 2446
15415B446p907k622j7593n376J5321o620J9055p165j3756J6902K4162j0587k8827
$$ 2446 -5461 -8083 -25676 -31052 -15731 -22351 -3296 -10461 -24217 -7315 16847 6260 -22567
15402b2567r339J5773Q539m720J2687j5293r225J7015J9888j8707l0784R274L889
$$ -22567 -31906 -16133 -7594 -12314 373 -14920 -24145 -7130 12758 -5949 -36733 -27459 -23570
15389b3570m737J9811P13j8538k982k027J1913l13m057n88J6357L400J5781l776
$$ -23570 -28307 -8496 -7783 -26321 -29303 -31330 -19417 -19730 -23787 -24375 -8018 -4618 11163 7387
15375G387J3308k277n812L536J5923K136q893O711J2979p561o692k1321j9931
$$ 7387 20695 18418 12606 16142 32065 34201 25308 32019 44998 37437 30745 9424 -10507
15362a0507l369j6999K4805J8319K155k5670J3510K264J5047k0484o634J4724
$$ -10507 -13876 -30875 -6070 12249 14404 -11266 2244 4508 19555 -929 -7563 7161
15350G161l69N649J3115o754k1693p714N943J0875P682p150M011j944J0147j8479
$$ 7161 6792 12441 25556 18802 -2891 -10605 -4662 6213 13895 6745 10756 8812 18959 480
15336D80p747k5880O271K3276K772j8100J3594n186k6986M421J8964J4081j8422
$$ 480 -7267 -33147 -26876 -3600 -828 -18928 -5334 -10520 -37506 -33085 -14121 -40 -18462
15323a8462J705M8159N175j2614J334j9377J1733J8130J0923j8309r97l6290j0314
$$ -18462 -16757 31402 36577 23963 25297 5920 17653 35783 46706 28397 27400 -8890 -19204
15310a9204K0629P130j1491k3994n37K3446j575l1204j7546J6282J4959J1164
$$ -19204 1425 8555 -2936 -26930 -27467 -4021 -5596 -36800 -54346 -38064 -23105 -11941
15298a1941l51M212J2308m719J2019R83k3455k5100P345J6800P01J2722J0447
$$ -11941 -12292 -8080 4228 -491 11528 12511 -10944 -36044 -28699 -11899 -11198 1524 11971
15285A1971K3913j5416p488J3133Q45l3330r814K9437K6422q754j0424Q741j8993
$$ 11971 35884 20468 12980 26113 26958 -6372 -16186 13251 39673 30919 20495 29236 10243
15272A0243q822N182J3777J289L544j3377l636j0770l065N868R652L0171N32n410
$$ 10243 1421 6603 20380 21669 25213 11836 8200 -2570 -5635 233 9885 40056 40588 35178
15258C5178n464J5226L80j2580j6179j9944M862n894M71K1484J0628m794J0362
$$ 35178 29714 44940 45320 32740 16561 -3383 1479 -4415 -3944 17540 28168 23374 33736
15245C3736K6819j3604j0040J2431q903J3378m546j4686k731m282j5536L940j5895
$$ 33736 60555 46951 36911 49342 40439 53817 49271 34585 31854 27572 12036 15976 81
15232H1j6997j3724J6551j384J1855n386J4835K1568P00l682l6415j8395j3452
$$ 81 -16916 -30640 -14089 -15473 -3618 -9004 5831 27399 28099 24417 -11998 -30393 -43845
15219d3845J1766L5075L138j708M563l3267l1353p09K0082L5260J280k7331r189
$$ -43845 -32079 2996 6134 4426 8989 -24278 -55631 -56340 -36258 -998 282 -27049 -36238
15206c6238k10K6991K2540q654k6958r82N570p263K0020k0181J3613j3176J1943
$$ -36238 -36448 -9457 13083 4429 -22529 -23511 -17941 -25204 -5184 -25365 -11752 -24928 -12985
15193a2985P596J1601P243r026Q392J0113k2111M74k4255l412K3824M460P518
$$ -12985 -5389 6212 13455 4429 12821 22934 823 1297 -22958 -26370 -2546 1914 9432
15180I432j240p418r562J5669m240L923J0166P689M412J782k0488q350p177J1678
$$ 9432 8192 774 -8788 6881 2641 6564 16730 24419 28831 30613 10125 1775 -5402 6276
15166F276K8618J5919p790p96n0305r283J3631R915N194j1943L100J9521J0986
$$ 6276 34894 50813 43023 42227 -8078 -17361 -3730 6185 11379 -564 2536 22057 33043
15153C3043k7194j2352m2379p974L8288J4676J2557Q984K0363k1457k1820j0662
$$ 33043 5849 -6503 -48882 -56856 -18568 -3892 8665 17649 38012 16555 -5265 -15927
15141a5927J7196K2736p103O324l611m1528j4744K5860p569j074K91j5976o858
$$ -15927 1269 24005 16902 23226 19615 -21913 -36657 -10797 -18366 -19440 -19149 -35125 -41983
15128d1983R872L4996M008k0297k0935J9992K6780L1074k0329l0124j0982J9100
$$ -41983 -32111 2885 6893 -13404 -34339 -14347 12433 43507 23178 -6946 -17928 1172
15116A172M3924L680k4355k5989j641J0302l567k5408J4114P404j4922j1116K0774
$$ 1172 45096 48776 24421 -1568 -3209 7093 3526 -21882 -7768 -364 -15286 -26402 -5628
15103e628O918J9509O634k2815j2292K61m942k1552j046O605n939o401J8655K0363
$$ -5628 1290 20799 27433 4618 -7674 -7413 -12355 -33907 -34953 -28348 -34287 -40688 -22033 -1670
15089a670k3768J7668L185j3186J8995J8427n302J2554m815n098j4241l0125J0196
$$ -1670 -25438 -7770 -4585 -17771 1224 19651 14349 26903 22088 16990 2749 -27376 -17180
15076a7180J5942J2451j1590J6143k20j2163j1956J8561k0177q129m925k4182
$$ -17180 -1238 11213 -377 15766 15546 3383 -8573 9988 -10189 -18318 -23243 -47425
15064d7425R496J5763L905J4159l723j0838N624J3709K0315Q470J1242j6429j4278
$$ -47425 -37929 -22166 -18261 -4102 -7825 -18663 -13039 670 20985 29455 40697 24268 9990
15051I990l160J7805j8512q934k579j8590M532j1209k1315m561M0801J5516j9387
$$ 9990 6830 24635 6123 -2811 -5390 -23980 -19448 -30657 -51972 -56533 -15732 -216 -19603
15038a9603j2588j7835j6051L3415L7263N83p51J4324J926k3231j9516J6202O345
$$ -19603 -32191 -50026 -66077 -32662 4601 5184 4433 18757 20683 -2548 -22064 -5862 483
15025D83j6233Q21K047J4386J604K0299N344K12k8726k7831l283R174j1543p233
$$ 483 -15750 -14929 -12882 1504 3108 23407 28751 28963 237 -27594 -30877 -21703 -33246 -40479
15011d0479q010n556k480K6143O732K5048K0171j2256j0618j086J113J1852j0217
$$ -40479 -48489 -54045 -56525 -30382 -23650 1398 21569 9313 -1305 -2391 -1278 10574 357
14998C57n661J186J9161Q320n74k6267j4566j4845K0962l423J9257Q044j7511
$$ 357 -5304 -4118 15043 23363 22789 -3478 -18044 -32889 -11927 -15350 3907 11951 -5560
14985e560l3568R3K5063L821J563l6184q183K6229k0564j0780k12J5011L7333
$$ -5560 -39128 -39035 -13972 -10151 -8588 -44772 -52955 -26726 -47290 -58070 -58282 -43271 -5938
14972e938j2945K165J0337j0921J966j2832j1763J1249K6772J3716J1228O830
$$ -5938 -18883 -16718 -6381 -17302 -15336 -28168 -39931 -28682 -1910 11806 23034 29864
14960B9864l4199j8430k988m90M070J8372K3620j02k003j61k8769j3626j0999
$$ 29864 -4335 -22765 -25753 -26243 -22173 -3801 19819 19717 17714 17553 -11216 -24842 -35841
14947c5841N740J9431j0907N923q339J3219J8943M211k5702j1478l789j107r017
$$ -35841 -30101 -10670 -21577 -15654 -23993 -10774 8169 12380 -13322 -24800 -28589 -29696 -38713
14934c8713J4389K0212Q354K2157Q875O131j0150k8387m364J8853R085J3859j1244
$$ -38713 -24324 -4112 4242 26399 35274 41405 31255 2868 -1496 17357 26442 40301 29057
14921B9057k2136Q735K8478j2415K0048Q678k8860l4313o06J518p104L549Q717
$$ 29057 6921 15656 44134 31719 51767 60445 31585 -2728 -3334 -1816 -8920 -5371 3346
14908C346L991k7984k5708j8041N994J8214K5636j5870J621o236m587K2727J2051
$$ 3346 7337 -20647 -46355 -64396 -58402 -40188 -14552 -30422 -28801 -35037 -39624 -16897 -4846
14895d846q225J1673J6996N972J3545l0727k9956J8810j2685j2006q76R62J2984
$$ -4846 -13071 -1398 15598 21570 35115 4388 -25568 -6758 -19443 -31449 -32325 -31363 -18379
14882a8379P62m179j5871O560J8866J3887J2245N188k9182k5648K9070K4315k2869
$$ -18379 -17617 -21796 -37667 -31107 -12241 1646 13891 19079 -10103 -35751 -6681 17634 -5235
14869e235q517j2590j9984J3043M757r121J3709k6816p685K0561Q600R035K6422
$$ -5235 -13752 -26342 -46326 -33283 -28526 -37647 -23938 -50754 -58439 -37878 -29278 -20243 6179
14856F179K6690J0692j92j4503k3639R231j1548k0671r014J9603r105k6919J1542
$$ 6179 32869 43561 43369 28866 5227 14458 2910 -17761 -26775 -7172 -16277 -43196 -31654
14843c1654J2064K1047j4818o997J4695j2494J5378J3052O848j3637k4548j9792
$$ -31654 -19590 1457 -13361 -20358 -5663 -18157 -2779 10273 17121 3484 -21064 -40856
14831d0856l698J4204J1015J7496N005R131K553J1621N229p301j778J3314j4224
$$ -40856 -44554 -30350 -19335 -1839 3166 12297 14850 26471 31700 24399 22621 35935 21711
14818B1711j2636n505k752J60J1953J30j0608o412L94o431k3501O925J9134L3299
$$ 21711 9075 3570 818 978 12931 13061 2453 -3959 -3565 -9996 -33497 -26572 -7438 25861
14804B5861J33k3175m9730j7726J5189K1780K0574R886J7494k3316j1632J2834
$$ 25861 25994 2819 -46911 -64637 -49448 -27668 -7094 2792 20286 -3030 -14662 -1828
14792a828L1658p072j2135j4765J4227p211r950j5144k3628J7940j0885O803Q655
$$ -1828 29830 22758 10623 -4142 10085 2874 -7076 -22220 -45848 -27908 -38793 -31990 -23335
14779b3335J4055j3338M956J9448k841j0965k1765L1128P736J665m735R507j6254
$$ -23335 -9280 -22618 -17662 1786 -1055 -12020 -33785 -2657 5079 6744 2009 11516 -4738
14766d738j0257J3988j9823o331R134p81J1923j406q903n188l391p43K984Q020
$$ -4738 -14995 -1007 -20830 -27161 -18027 -18808 -6885 -8291 -17194 -22382 -25773 -26516 -23532 -15512
14752a5512p525J3183M551j0326j888n997j5961p525K5938J9460j6159l801L9253
$$ -15512 -23037 -9854 -5303 -15629 -17517 -23514 -39475 -47000 -21062 -1602 -17761 -21562 17691
14739A7691J0901j3783j2567j1898n433q188J4013J3374j604k8786q445L753q145
$$ 17691 28592 14809 2242 -9656 -15089 -23277 -9264 4110 2506 -26280 -34725 -30972 -39117
14726c9117J4366Q303K3916K0749o306l6111m033K1668j1642j2439K3757L3386
$$ -39117 -24751 -16448 7468 28217 21911 -14200 -18233 3435 -8207 -20646 3111 36497
14714C6497j108J2536j4149j3514R298M405P967r200O757j7150p368J8884j1373
$$ 36497 35389 47925 33776 20262 29560 33965 41932 32732 39489 22339 14971 33855 22482
14701B2482r164J8216L827l3481q283l0713l5368r45M1824K5694j0715r14j4083
$$ 22482 13318 31534 35361 1880 -6403 -37116 -72484 -73429 -31605 -5911 -16626 -17540 -31623
14688c1623L893J2307J480J4040j3455k2225J2570J1435P315j8983K380J3790
$$ -31623 -27730 -15423 -13943 97 -13358 -35583 -23013 -11578 -4263 -23246 -20866 -7076
14676g076m236k953k5300j7647L7790L0170J419K1772K6502j906j9314k5962N796
$$ -7076 -11312 -14265 -39565 -57212 -19422 10748 12167 33939 60441 58535 39221 13259 19055
14663A9055J6881j2126l5487n6L1949K7954j2003k6851p855j6310j5257L103k348
$$ 19055 35936 23810 -11677 -11733 20216 48170 36167 9316 1461 -14849 -30106 -27003 -29351
14650b9351p859r596r720L884J2105K9353J3546J0706R585J1625p813J516J4256
$$ -29351 -37210 -46806 -56526 -52642 -40537 -11184 2362 13068 22653 34278 26465 27981 42237
14637D2237j0385k2597m778J8515K802p947l4484R121J3950R101J237p573o028
$$ 42237 31852 9255 4477 22992 25794 17847 -16637 -7516 6434 15535 16772 9199 3171
14624C171j5423j0396j1215K3693R827N80j2206J9799j5700l5995r062J2426K6487
$$ 3171 -12252 -22648 -33863 -10170 -343 237 -11969 7830 -7870 -43865 -52927 -40501 -14014
14611a4014j184q320J7709J7216r114K442j80k5447j8534K1487K9727J3658l099
$$ -14014 -15198 -23518 -5809 11407 2293 4735 4555 -20892 -39426 -17939 11788 25446 22347
14598B2347J899J9204J1652k5037k596k34O287J668m659j14j1305l0474j8874
$$ 22347 24246 43450 55102 30065 27469 27235 33522 35190 30531 30417 19112 -11362 -30236
14585c0236j5398K3148J8588J6837j1381j4384j1152o811J4061J0303k0412j5751
$$ -30236 -45634 -22486 -3898 12939 1558 -12826 -23978 -30789 -16728 -6425 -26837 -42588
14573d2588L383K0893J888n350J8556L6201j1001j9230k57M346R732P11N61j5225
$$ -42588 -39205 -18312 -16424 -21774 -3218 32983 21982 2752 2495 6841 16573 17284 17845 2620
14559B620j2048n921K5490L6282k139j5161l89j0600L3623J7100k2967p701n032
$$ 2620 -9428 -15349 10141 46423 44284 29123 28734 18134 51757 68857 45890 38189 33157
14546C3157K493j074j8505Q97p01J4570J18j8012j621K539l1016r412M5582J2504
$$ 33157 35650 34576 16071 16968 16267 30837 30955 12943 11322 13861 -17155 -26567 19015 31519
14532C1519j4543m5998j1975K3235k1659l001K1886K7875J6003J2506j6471r47
$$ 31519 16976 -29022 -40997 -17762 -39421 -42422 -20536 7339 23342 35848 19377 18430
14520A8430k2926j1183j0259q845Q732K2875m410m396Q055L187J2979j9726j083
$$ 18430 -4496 -15679 -25938 -34783 -26051 -3176 -7586 -11982 -3927 -740 12239 -7487 -8570
14507h570Q373j6402j2285J9455M651L442J6128K7692j9809J6433k0158j2735
$$ -8570 -197 -16599 -28884 -9429 -4778 -1336 14792 42484 22675 39108 18950 6215
14495F215J0746K538J687J3500j9882j6248K5117J0164J78j6594n1517P02J2136
$$ 6215 16961 19499 21186 34686 14804 -1444 23673 33837 34015 17421 -34096 -33394 -21258
14482b1258n963k0472J7861K1835m344N958J7728Q153o027r45j3634J8289K6839
$$ -21258 -27221 -47693 -29832 -7997 -12341 -6383 11345 19498 13471 12526 -1108 17181 44020
14469D4020k832k3108j27j553L067j4119k5312P772J6415N292K2513m1447p329
$$ 44020 41188 18080 17953 16400 19467 5348 -19964 -12192 4223 9515 32028 -9419 -16748
14456a6748L7251j1712O07l1130k5746P488L974R438J6154M172O654j4212l2552
$$ -16748 20503 8791 9398 -21732 -47478 -39990 -36016 -26578 -10424 -6252 402 -13810 -46362
14443d6362J2080M2985J1344p301j1937l263j1983P315r619k0539P733L1548j0154
$$ -46362 -34282 8703 20047 12746 809 -2454 -14437 -7122 -16741 -37280 -29547 2001 -8153
14430h153L168K9157q631r202J7856k5929j1968j448j6695O546q680j9177K6836
$$ -8153 -4985 24172 15541 6339 24195 -1734 -13702 -15150 -31845 -25299 -33979 -53156 -26320
14417b6320M641J3879p777p526k29q964K6972o962J6652j4574r01J3361K7983
$$ -26320 -21679 -7800 -15577 -23103 -23332 -32296 -5324 -12286 4366 -10208 -11109 2252 30235
14404C0235J0477m633l3501l1929k0406k4057P390K1619R633O401K1978K408l427
$$ 30235 40712 36079 2578 -29351 -49757 -73814 -66424 -44805 -35172 -28771 -6793 -4385 -7812
14391g812j377J5176j6050m4830j2888J3834O740j5191K8574K5740J2050p433
$$ -7812 -9189 5987 -10063 -54893 -67781 -53947 -47207 -62398 -33824 -8084 3966 -3467
14379c467j6787j9621J6279J4826j6175o920q236J8744K5352R902K2321j6879
$$ -3467 -20254 -39875 -23596 -8770 -24945 -31865 -40101 -21357 3995 13897 36218 19339
14367A9339k2280j8985k0318J6921J1465J9594J1893J4488O767k6224k9856k0485
$$ 19339 -2941 -21926 -42244 -25323 -13858 5736 17629 32117 38884 12660 -17196 -37681
14355c7681j5826K3485L256M252n250k4434K733K6545O79J6349j2592J2488J0551
$$ -37681 -53507 -30022 -26766 -22514 -27764 -52198 -49465 -22920 -22241 -5892 -18484 -5996 4555
14342D555J0582P456J6157p553j4184k0502j4784m272o601J4251J6132j0057Q173
$$ 4555 15137 22593 38750 31197 17013 -3489 -18273 -22545 -29146 -14895 1237 -8820 -647
14329f47K6135R663k23M045l1041k7454K8257l370j9916M020J2807j2515J6080
$$ -647 25488 35151 34928 38973 7932 -19522 8735 5365 -14551 -10531 2276 -10239 5841
14316E841J0048J4134O987j9378m032j3931l0886p766L0806n158K819K4763J0489
$$ 5841 15889 30023 37010 17632 13600 -331 -31217 -38983 -8177 -13335 -10516 14247 24736
14303B4736j3187m5251l8254J7457J8980j0138q113L3453K2729q147l1774m169
$$ 24736 11549 -33702 -71956 -54499 -35519 -45657 -53770 -20317 2412 -5735 -37509 -41678
14291d1678J2662J5596K4385L1885k150l1346Q768R042j8575m829k907k5112M286
$$ -41678 -29016 -13420 10965 42850 40700 9354 18122 27164 8589 3760 853 -24259 -19973
14278a9973p24q206M990j2890l811O52K5132J0255n227j3847L370K3408j4127
$$ -19973 -20697 -28903 -23913 -36803 -40614 -39962 -14830 -4575 -9802 -23649 -20279 3129 -10998
14265a0998j451J4299l893l2348K6142R380l2251k0815K3741q198Q570R825R091
$$ -10998 -12449 1850 -2043 -34391 -8249 1131 -31120 -51935 -28194 -36392 -27822 -17997 -8906
14252h906M387J9022l5472q015j641r104P347J9792Q264L636o748j3315k3558
$$ -8906 -4519 14503 -20969 -28984 -30625 -39729 -32382 -12590 -4326 -690 -7438 -20753 -44311
14239d4311l259J6429M2661K5178m111j5668j0244K487L0285l3004k6418k2979
$$ -44311 -47570 -31141 11520 36698 32587 16919 6675 9162 39447 6443 -19975 -42954
14227d2954l522L8444J4529J0842m720j8122j3141Q072K8870L7398M674l1518
$$ -42954 -46476 -8032 6497 17339 12619 -5503 -18644 -10572 18298 55696 60370 28852
14215B8852k8637j4283j2948L0537Q91p097J087j3916K0779K677k1212l8427M88
$$ 28852 215 -14068 -27016 3521 4412 -2685 -1598 -15514 5265 7942 -13270 -51697 -51209
14202e1209J1729O439j316J4374L6442J6181N271m17j8952J416J1462J5480j3693
$$ -51209 -39480 -33041 -34357 -19983 16459 32640 37911 37494 18542 19958 31420 46900 33207
14189C3207M87q574K770j6043k0492r197J6878O750r36K7641J9208k0271k4281
$$ 33207 33694 25120 27890 11847 -8645 -17842 -964 5786 4850 32491 51699 31428 7147
14176G147j2728N367N181J0703p898j0415k1813j0146L3244n99k494O65K207j7474
$$ 7147 -5581 -214 4967 15670 7772 -2643 -24456 -34602 -1358 -1957 -4451 -3786 -1579 -19053
14162a9053j8196O258J0491k785J6547O155k993j7018j0297J8152N64r821M688
$$ -19053 -37249 -30991 -20500 -23285 -6738 -583 -3576 -20594 -30891 -12739 -12175 -21996 -17308
14149a7308P389K1564M880o11j0753N338l001k324j7786l932N365K5985q955m2419
$$ -17308 -9919 11645 16525 15914 5161 10499 7498 5174 -12612 -16544 -11179 14806 5851 -36568
14135c6568k8340J4224J3470J4703m27o07p211O253J6266L0024k8556n566m560
$$ -36568 -64908 -50684 -37214 -22511 -22938 -23545 -30756 -24503 -8237 21787 -6769 -12335 -16895
14122a6895k0339J1040J7883j1543L0492q018j1886p082J1005J4808M655j5303
$$ -16895 -37234 -26194 -8311 -19854 10638 2620 -9266 -16348 -5343 9465 14120 -1183
14110a183P792j38j2506j0554j6599P035Q274J9450m156J9973L129K897j0773
$$ -1183 6609 6471 -6035 -16589 -33188 -26153 -17879 1571 -2585 17388 20517 23414 12641
14097A2641l3579j3631N130J1971J4439J3527l90J9731r879k2856O621o756J2266
$$ 12641 -20938 -34569 -29439 -17468 -3029 10498 10108 29839 19960 -2896 3725 -3031 9235
14084I235O08P704O387k0531l4385l9165J598J7482J5646M585J2453j9614j3164
$$ 9235 9843 17547 23934 3403 -30982 -70147 -68549 -51067 -35421 -30836 -18383 -37997 -51161
14071e1161k2968j3970j6092j0922L9081L7182J4386j074m665N172J1103Q942
$$ -51161 -74129 -88099 -104191 -115113 -76032 -38850 -24464 -25538 -30203 -25031 -13928 -4986
14059d986k423Q049j3976k4337o692J5212L860m1372q538L8841J4464j0757j217
$$ -4986 -7409 640 -13336 -37673 -44365 -29153 -25293 -66665 -75203 -36362 -21898 -32655 -33872
14046c3872L5565Q170j9706M791m912J2923K0131m830J96p612j9423k9925k1404
$$ -33872 1693 9863 -9843 -5052 -9964 2959 23090 18260 18456 10844 -8579 -38504 -59908
14033e9908K8L6340J5445R054J5852K035J3509m028l0936j9460k9243Q638M4579
$$ -59908 -59880 -23540 -8095 959 16811 18846 32355 28327 -2609 -22069 -51312 -42674 1905
14020A905J5208J1799j1778j1247k5709k1634K1420J2996J34J3476j2137m92J3
$$ 1905 17113 28912 17134 5887 -19822 -41456 -20036 -7040 -6906 6570 -5567 -6059 -6046
14007f046j7356P061J7863J2260j3034L489L646J8334j5618M987j1457r610l283
$$ -6046 -23402 -16341 1522 13782 748 4237 7883 26217 10599 15586 4129 -5481 -8764
13994h764l321J0138M66P227l531M57m076J4936j0955P188R292j2574J0322J1189
$$ -8764 -12085 -1947 -1481 5746 2215 2672 -1404 13532 2577 9765 19057 6483 16805 27994
13980B7994O67P524Q674l2137j6606J9774j7511j7902J7626J2080j4607N860J668
$$ 27994 28661 36185 44859 12722 -3884 15890 -1621 -19523 -1897 10183 -4424 1436 3104
13967C104p552J2911k6440m4591K0656J1349K141J5560L7888O742r153o706j1576
$$ 3104 -4448 8463 -17977 -62568 -41912 -30563 -28422 -12862 25026 31768 22615 15909 4333
13954D333J4960O556m619N197L908K47j5868j6650k3490J4812J9008M951k4680
$$ 4333 19293 25849 21230 26427 30335 30582 14714 -1936 -25426 -10614 8394 13345 -11335
13941a1335k2171j3362p42J1314J6701L2984N049j8971r124J4199J8621L662L357
$$ -11335 -33506 -46868 -47610 -36296 -19595 13389 18438 -533 -9657 4542 23163 26825 30182
13928C0182j4309J299N245K500q233n64j26j081M413j42K821M896j9428l8781
$$ 30182 15873 17172 22417 24917 16684 16120 15994 14913 19326 19184 22005 26901 7473 -31308
13914c1308N558L5192K1253R860l727l744M533q459j8909k7130R887J9033l484
$$ -31308 -25750 9442 30695 40555 36828 33084 37617 29158 10249 -16881 -6994 12039 8555
13901H555J9215J1105j9634j4125j0394q855k5722j0804L9043J8930J5079K1121
$$ 8555 27770 38875 19241 5116 -5278 -14133 -39855 -50659 -11616 7314 22393 43514
13889D3514r605l4736j5730J7914l021q081J5974r201L66J7061k2647m353Q056
$$ 43514 33909 -827 -16557 1357 -1664 -9745 6229 -2972 -2606 14455 -8192 -12545 -4489
13876d489n996k0089m235N089M203K9191J0407r032k8453o156P258M772M18k405
$$ -4489 -10485 -30574 -34809 -29720 -25517 3674 14081 5049 -23404 -29560 -22302 -17530 -17112 -19517
13862a9517P537j3505p38l630k0030J5843O634J1363K7762L482l350k0903j0920
$$ -19517 -11980 -25485 -26223 -29853 -49883 -34040 -27406 -16043 11719 15201 11851 -9052 -19972
13849a9972J5654J0482j7465k2672M308K8324j1262j2092J5204J0716J5088N854
$$ -19972 -4318 6164 -11301 -33973 -29665 -1341 -12603 -24695 -9491 1225 16313 22167
13837B2167J1349K6778r818m6998l1091k2293O949J8997j9580p488J3127L5391
$$ 22167 33516 60294 50476 3478 -27613 -49906 -42957 -23960 -43540 -51028 -37901 -2510
13825b510K1155j1103l56J024J9164N669j5611k1895M973J0306j187P674n323
$$ -2510 18645 7542 7186 8210 27374 33043 17432 -4463 510 10816 9629 17303 11980
13812A1980J2825o211j5000J6390j1898k2481l911L1101K1898k3952p991j784
$$ 11980 24805 18594 3594 19984 8086 -14395 -18306 12795 34693 10741 2750 966
13800I66j742J2563r565N886j138k579j2633j1632J0184N575m260J274P41O101
$$ 966 -776 11787 2222 8108 6970 4391 -8242 -19874 -9690 -4115 -8375 -7101 -6360 -259
13786b59R253j2840j7124L597L107J5820j243J6929J8777j4342k2897J206P093
$$ -259 8994 -3846 -20970 -17373 -14266 1554 311 17240 36017 21675 -1222 -16 7077
13773G077N194r147J5489J2080k67k4689K325l211m593Q401k3720j8540M1016
$$ 7077 12271 3124 18613 30693 30426 5737 8062 4851 258 8659 -15061 -33601 7415
13760G415q562o863J7486O816J0175j026N157Q19M37k7879k0397m465r107q82
$$ 7415 -1147 -8010 9476 16292 26467 25441 30598 31417 31854 3975 -16422 -20887 -29994 -30876
13746c0876K1040K3080l1159j6238o249k28N40r524K9813J1443j5036M844p55
$$ -30876 -9836 13244 -17915 -34153 -40402 -40630 -40090 -49614 -19801 -8358 -23394 -18550 -19305
13733a9305J1784L2061O774m453j5512j5485N349K0281K5327J7833L404k4609
$$ -19305 -7521 24540 31314 26861 11349 -4136 1213 21494 46821 64654 68058 43449
13721D3449l7409k4800J1103K1332L305j2887Q927N293j7363r239P979q151j3870
$$ 43449 6040 -18760 -7657 13675 16980 4093 13020 18313 950 -8289 -310 -8461 -22331
13708b2331j509J9405k887J2478m805L0967N477l2348p714J6137M8j5489n729
$$ -22331 -23840 -4435 -7322 5156 351 31318 36795 4447 -3267 12870 12918 -2571 -8300
13695h300O776L510r833n646L3558j5300l917j8802J952M785j3501J4394K4948
$$ -8300 -1524 1986 -7847 -13493 20065 4765 848 -17954 -16002 -11217 -24718 -10324 14624
13682A4624j054k7106k5171j3181J4189K0746J7382O937l861n981j3471k3661
$$ 14624 13570 -13536 -38707 -51888 -37699 -16953 429 7366 3505 -2476 -15947 -39608
13670c9608l09K7496Q587K379J0869m522j2100k8716j3596J3326N299K0285m282
$$ -39608 -39917 -12421 -3834 -1455 9414 4892 -7208 -35924 -49520 -36194 -30895 -10610 -14892
13657a4892R008n526k8928J9903K9456k0641r440j3422K3374M3170K2525k243
$$ -14892 -5884 -11410 -40338 -20435 9021 -11620 -21060 -34482 -11108 32062 54587 52344
13645E2344p975j3978J0755j5089j4844j9189M941J0419j5260j6182J0796L5267
$$ 52344 44369 30391 41146 26057 11213 -7976 -3035 7384 -7876 -24058 -13262 22005
13633B2005j6772P503m677n287j1729M386k292R965R975j997j0464k4427k5235
$$ 22005 5233 12736 8059 2772 -8957 -4571 -6863 3102 13077 11080 616 -23811 -49046
13620d9046J7886m767j6206M34K2446L5510Q693j9023K6035O109m999j9684l9879
$$ -49046 -31160 -35927 -52133 -51699 -29253 6257 14950 -4073 21962 28071 23072 3388 -36491
13607c6491o30O322J0133K4667l21j071J91k2088j9912J0358m224o143K5465K3508
$$ -36491 -37121 -30799 -20666 4001 3680 2609 2800 -19288 -39200 -28842 -33066 -39209 -13744 9764
13593I764P469K566o565n654O013p028j389N467J9180M936j5143J7734K51k4674
$$ 9764 17233 19799 13234 7580 13593 6565 5176 10643 29823 34759 19616 37350 37601 12927
13579A2927k5457q610L8068J8545k5439J868J1162m844L721N731J2163K7073K671
$$ 12927 -12530 -21140 16928 35473 10034 11902 23064 18220 21941 27672 39835 66908 69579
13566F9579j2358l2586k9317j4365j5409j722l679O097K4986K503j8615J9697
$$ 69579 57221 24635 -4682 -19047 -34456 -36178 -39857 -33760 -8774 -6271 -24886 -5189
13554e189r733K977K2072J6241p795J4680J3733k9045j9535j140j5008k1015N119
$$ -5189 -14922 -11945 10127 26368 18573 33253 46986 17941 -1594 -2734 -17742 -38757 -33638
13541c3638O007O35K3610p726j6147J2238K1945K1265K5827k4149k4535j6749
$$ -33638 -27631 -26996 -3386 -11112 -27259 -15021 6924 28189 54016 29867 5332 -11417
13529a1417N874Q244k6987J7684O311J070o92j6454K0474j6179l3106K8455J9623
$$ -11417 -5543 2701 -24286 -6602 -291 779 87 -16367 4107 -12072 -45178 -16723 2900
13516B900O196L0835j5689q053j0057k4975o268J8217K9383P448j0240N692J0065
$$ 2900 9096 39931 24242 16189 6132 -18843 -25111 -6894 22489 29937 19697 25389 35454
13503C5454m8268l2721m356K5098m528o124J337J2178L0578J4763k7967j4967
$$ 35454 -12814 -45535 -49891 -24793 -29321 -35445 -34108 -21930 8648 23411 -4556 -19523
13491a9523m299q115Q01K0915M1208k9817k3041N137k585R590m126K833J997k732
$$ -19523 -23822 -31937 -31136 -10221 30987 1170 -21871 -16734 -19319 -9729 -13855 -11022 -9025 -11757
13477a1757n738j5681l5056R770L758K4301L9415O062j3593J598m761j2024o226
$$ -11757 -17495 -33176 -68232 -58462 -54704 -30403 9012 15074 1481 3079 -1682 -13706 -19932
13464a9932j5770k842K3922M046l955K1326K1719l956j1814j2463P918P860J0603
$$ -19932 -35702 -38544 -14622 -10576 -14531 6795 28514 24558 12744 281 8199 16059 26662
13451B6662J6142J1274j079q506l1530J8879J7992k1563q465J779j3935o222J8018
$$ 26662 42804 54078 52999 44493 12963 31842 49834 28271 19806 21585 7650 1428 19446
13438A9446j6382l072K3565j8591p10J2581Q041j5399K6971J6682j0118j8097
$$ 19446 3064 -8 23557 4966 4256 16837 24878 9479 36450 53132 43014 24917
13426B4917J7995Q698K7429l044q814m941L425M029L19j2294l009M926k440j1325
$$ 24917 42912 51610 79039 75995 67181 62240 65665 69694 70013 57719 54710 59636 57196 45871
13412D5871j7799k5456n633k747q613L5307k012j8210K6875O833j3368j8486Q403
$$ 45871 28072 2616 -3017 -5764 -14377 20930 18918 708 27583 34416 21048 2562 10965
13399A0965j3686j3368j3282j1083K4512L3587K428J9382J1709j3646j3920P456
$$ 10965 -2721 -16089 -29371 -40454 -15942 17645 20073 39455 51164 37518 23598 31054
13387C1054k8164j0672P221J2399j3885j1227J5619J3934M624K366p138p156J6696
$$ 31054 2890 -7782 -561 11838 -2047 -13274 2345 16279 20903 23269 16131 8975 25671
13374B5671p968J2838j4679k613K8955J5418j7556p343K8n314J8547J1738K021
$$ 25671 17703 30541 15862 13249 42204 57622 40066 32723 32751 27437 45984 57722 59743
13361E9743j7617N916m306l5860l3680n281P227R296j642j9535J065k104L116
$$ 59743 42126 48042 43736 7876 -25804 -31085 -23858 -14562 -16204 -35739 -34674 -36778 -33662
13348c3662M2407J2690j9097J9154o727k2845R092K78L9699K9844j4330l3898
$$ -33662 8745 21435 2338 21492 14765 -8080 1012 1290 40989 70833 56503 22605
13336B2605N589J4552n650l8420m33j9628N132L167L278j0381J7295O5j1994J6289
$$ 22605 28194 42746 37096 -1324 -1757 -21385 -16253 -13086 -9808 -20189 -2894 -2829 -14823 1466
13322A466l751r141j1349k2858r834L2630J4210J4221J9746j0368k6084k1122
$$ 1466 -2285 -11426 -22775 -45633 -55467 -22837 -8627 5594 25340 14972 -11112 -32234
13310c2234q137J0649Q757J5217K9803j827j7194j1008j3551J6469K4985m307
$$ -32234 -40371 -29722 -20965 -5748 24055 22228 5034 -5974 -19525 -3056 21929 17622
13298A7622j1012l255J0977p063q217N684K5634j7625l3248j1804n353J8511k466
$$ 17622 6610 3355 14332 7269 -948 4736 30370 12745 -20503 -32307 -37660 -19149 -21615
13285b1615n568L1910K2262j3597j0318L317j5937J371O729j4850J6193J8679
$$ -21615 -27183 4727 26989 13392 3074 6391 -9546 -8175 -1446 -16296 -103 18576
13273A8576j329p519K395k671j735N574m07K602l255j349J7601K3058K573j3498
$$ 18576 17247 9728 12123 9452 7717 13291 12884 15486 12231 10882 28483 51541 54114 40616
13259D0616k7986k4677J4066m661j0744J2567J6726J592j2592j7853J3117o760
$$ 40616 12630 -12047 2019 -2642 -13386 -819 15907 17499 4907 -12946 171 -6589
13247f589j9141k194K5938J0699M073M865k3715n517m534R002m595J4005K296
$$ -6589 -25730 -27924 -1986 8713 12786 17651 -6064 -11581 -16115 -7113 -11708 2297 4593
13234D593j6385J1275L0495k9159p131k3200j240O429J9717J7821K1337J257n602
$$ 4593 -11792 -517 29978 819 -6312 -29512 -30752 -24323 -4606 13215 34552 35809 30207
13221C0207j79Q080j3307N855M871k271K1805M881q630j0534j8117j8078m768
$$ 30207 30028 38108 24801 30656 35527 33256 55061 59942 51312 40778 22661 4583 -185
13208a85l632j3854k807K2384L152K4750J1392R137j2800p871l985j2192l2800
$$ -185 -3817 -17671 -20478 1906 5058 29808 41200 50337 37537 29666 25681 13489 -19311
13195a9311K412k464o708Q496J7146N97N843j5210j8702k3159k703K7058J1967
$$ -19311 -16899 -19363 -26071 -17575 -429 168 6011 -9199 -27901 -51060 -53763 -26705 -14738
13182a4738j6721j8111J7125L1788K20j0567L124J4604K0732n200m0253k2706
$$ -14738 -31459 -49570 -32445 -657 -437 -11004 -7880 6724 27456 22256 -17997 -40703
13170d0703N363J8985L883p788k8159K4524L8317J0270P266p865M234J8980K220
$$ -40703 -35340 -16355 -12472 -20260 -48419 -23895 14422 24692 31958 24093 28327 47307 49527
13157D9527l0285o057M416r00R888J4390N888j2108k0084R066R870l4551M325
$$ 49527 19242 13185 17601 16701 26589 40979 46867 34759 14675 23741 33611 -940 3385
13144C385K433l6833Q778K6810L3306n891m206j9964j4849p305j1066m558K6149
$$ 3385 5818 -31015 -22237 4573 37879 31988 27782 7818 -7031 -14336 -25402 -29960 -3811
13131c811P291J453P6R773J5127J8496k2463j3689K45J6294p842J236p867k0818
$$ -3811 3480 4933 5009 14782 29909 48405 25942 12253 12498 28792 20950 22186 14319 -6499
13117f499J3223p334L598k705P391p670l923p837k570J458J0462j0713Q522r709
$$ -6499 6724 -610 2988 283 7674 4 -3919 -11756 -14326 -12868 -2406 -13119 -4597 -14306
13103a4306k480J3182k1122J7276J9405n973J459j7532q7r661k869J5403j4469
$$ -14306 -16786 -3604 -24726 -7450 11955 5982 7441 -10091 -10178 -19839 -22708 -7305 -21774
13090b1774j5492L551L98K2183J1951m930J3682K4006J9588n683o962j1799j8974
$$ -21774 -37266 -33715 -33317 -11134 817 -4113 9569 33575 53163 47480 40518 28719 9745
13077I745j8741N524l357j108n460J0582p349k5192M4065L0586j8963j2846j2068
$$ 9745 -8996 -3472 -6829 -7937 -13397 -2815 -10164 -35356 8709 39295 20332 7486 -4582
13064d582J1409J3211K236k974J1139k944k8166j9807j5688J6621j1417p630K4504
$$ -4582 6827 20038 22274 19300 30439 27495 -671 -20478 -36166 -19545 -30962 -38592 -14088
13051a4088L592N732O872Q979k1889k8895J0641J4618M445L3642J6982j9475j8458
$$ -14088 -10496 -4764 2108 11087 -10802 -39697 -29056 -14438 -9993 23649 40631 21156 2698
13038B698j1004q748L653k515K7625J3285q256l3386J1527K2867l1779j1811j8871
$$ 2698 -8306 -17054 -13401 -15916 11709 24994 16738 -16648 -5121 17746 -14033 -25844 -44715
13025d4715J2830K1682l998P799J6824p017o57K0203r887j5266p233j0791r770
$$ -44715 -31885 -10203 -14201 -6402 10422 3405 2748 22951 13064 -2202 -9435 -20226 -29996
13012b9996K3910J2951Q99o983l473j3587j0108J4274K9805l623Q44J302J4103
$$ -29996 -6086 6865 7764 781 -2692 -16279 -26387 -12113 17692 14069 14913 16215 30318
12999C0318j6891j3214J59j3822R58k3281j4192L4537J6575J1675K1324o507j4289
$$ 30318 13427 213 372 -13450 -12492 -35773 -49965 -15428 1147 12822 34146 27639 13350
12986A3350o78K551m314N6K591l1563m213K0587j2696J1054O500J4014J3146J3854
$$ 13350 12672 15223 10909 10965 13556 -18007 -22220 -1633 -14329 -3275 3225 17239 30385 44239
12972D4239j603j7350J507o754N653j0247l5690j2072N645K0090J9516J1763l098
$$ 44239 42636 25286 26793 20039 25692 15445 -20245 -32317 -26672 -6582 12934 24697 21599
12959B1599m539k6643K658p657J490K18k4266P91L2910R952j6850J189J9101J8327
$$ 21599 17060 -9583 -6925 -14582 -13092 -12874 -37140 -36349 -3439 6513 -10337 -9148 9953 28280
12945B8280K2008j0235j4768j8582k5756j8030j4049k2714L2883L1390K4019j2271
$$ 28280 50288 40053 25285 6703 -19053 -37083 -51132 -73846 -40963 -9573 14446 2175
12933B175p489q150j7071L6409n104j924j1385l6613J3060J4739j3165O401O95
$$ 2175 -5314 -13464 -30535 5874 770 -1154 -12539 -49152 -36092 -21353 -34518 -28117 -27422
12920b7422j3177M767L6752J2830Q355k1083K110J3283j1154j614k1575l398J9695
$$ -27422 -40599 -35832 920 13750 22105 1022 3132 16415 5261 3647 -17928 -21326 -1631
12907a631o994j5683J6945O597n195J9305J0329K3788j904m0975j5126N417m277
$$ -1631 -8625 -24308 -7363 -766 -5961 13344 23673 47461 45557 4582 -10544 -5127 -9404
12894i404l0394K0694J4699q964j5682j1054j656j5262j1554J1414J2875K4960
$$ -9404 -39798 -19104 -4405 -13369 -29051 -40105 -41761 -57023 -68577 -57163 -44288 -19328
12882a9328K4072M42q35J4670j197N55r460j2208J2501M493J4279N932P403n241
$$ -19328 4744 5186 4351 19021 17824 18379 8919 -3289 9212 13705 27984 33916 41319 36078
12868C6078j3319q565j1695m995p245j380R300J0444q363K5913K38k5998k0167
$$ 36078 22759 14194 2499 -2496 -9741 -11121 -1821 8623 260 26173 26411 413 -19754
12855a9754K5861L6431n033j5691n028j4927K4117J9634R029L235Q673k3452m5432
$$ -19754 6107 42538 37505 21814 16786 1859 25976 45610 54639 57874 66547 43095 -2337
12842b337l09Q997R926l150k7958m58K1917N344k4089J9032o218l0397j1254K2166
$$ -2337 -2646 6351 16277 13127 -14831 -15289 6628 11972 -12117 6915 697 -29700 -40954 -18788
12828a8788J9516J4524k4159k0708k0859j0924J0872J8573J3328K2760J9211k4174
$$ -18788 728 15252 -8907 -29615 -50474 -61398 -50526 -31953 -18625 4135 23346 -828
12816h28k0964j5208P4j0724M469K3520J0951L622j8127o093K2129L1051n999
$$ -828 -21792 -37000 -36926 -47650 -43181 -19661 -8710 -5088 -23215 -29308 -7179 23872 17873
12803A7873j0727k0791J0415J301k1139k1164K4724J2479N843J5142q943p656
$$ 17873 7146 -13645 -3230 -1929 -23068 -44232 -19508 -7029 -1186 13956 5013 -2643
12791b643Q633l500q802l36N573j2384O51Q18n896J3027R843K7928R942j2187
$$ -2643 5990 2490 -6312 -6648 -1075 -13459 -12808 -11990 -17886 -4859 4984 32912 42854 30667
12777C0667j1995j3118j5546j5562j5989M77k036K8457K5701j3504k0481n436
$$ 30667 18672 5554 -9992 -25554 -41543 -41066 -43102 -14645 11056 -2448 -22929 -28365
12765b8365K7353L0804J5423l049O377O594k8232j9959p773j1674j339n191J421
$$ -28365 -1012 29792 45215 42166 48543 55137 26905 6946 -827 -12501 -13840 -19031 -17610
12752a7610J7858n470K7817K9470j481l4493l1690j8050k626Q163J095Q568J3450
$$ -17610 248 -5222 22595 52065 50584 16091 -15599 -33649 -36275 -28112 -27017 -18449 -4999
12739d999l66R970j3050l301J3969L394q568j4351N113L9313K6299k8133k5139
$$ -4999 -5365 4605 -8445 -11746 2223 5617 -2951 -17302 -12189 27124 53423 25290 151
12726A51M12J0222Q517k2561r081J6155J9472K2204j848k1516k6260K0408Q317
$$ 151 563 10785 19302 -3259 -12340 3815 23287 45491 43643 22127 -4133 16275 24592
12713B4592R587p935o584r819j2904J3134J2286J0173L3549J4407k102j6618L115
$$ 24592 34179 26244 19660 9841 -3063 10071 22357 32530 66079 80486 78384 61766 64881
12700F4881M068j6142k3123k2702r499R858q010K065O645K2222j0688j4417J3784
$$ 64881 68949 52807 29684 6982 -2517 7341 -669 1396 8041 30263 19575 5158 18942
12687A8942N886n482q961l5509j577L2054j323k7527r737K2006J4960J6933K2538
$$ 18942 24828 19346 10385 -25124 -26701 5353 4030 -23497 -33234 -11228 3732 20665 43203
12674D3203P67j9372k0225j0714j8142j4516N113K2353L126J470K1839J8834n53
$$ 43203 43970 24598 4373 -6341 -24483 -38999 -33886 -11533 -8407 -6937 14902 33736 33183
12661C3183n801l1814k4196J8998J3597K3027j1171j6280J6057R981m241J0046
$$ 33183 27382 -4432 -28628 -9630 3967 26994 15823 -457 15600 25581 21340 31386
12649C1386j5367j3823L570O251J2751j015j1410K061m599J7651J9519q728n060
$$ 31386 16019 2196 5766 12017 24768 23753 12343 14404 9805 27456 46975 38247 33187
12636C3187o074o522J0999K465M263j8691j9084Q854L856p562L3966J9263m6233
$$ 33187 27113 20591 31590 34055 38318 19627 543 9397 13253 5691 39657 58920 12687
12623A2687k6441R598N434L1473J1454j8596O38L4916K7472k8712j5632k065R81
$$ 12687 -13754 -4156 1278 32751 44205 25609 26247 61163 88635 59923 44291 42226 43207
12610D3207q647Q223m199R849p350N668M202J018j3411k6656J3809J3645j052
$$ 43207 34560 42783 38584 48433 41083 46751 50953 51971 38560 11904 25713 39358 38306
12597C8306j5415k6557k0141J939O983L955J2214j9056L0351N5972K1370k1310
$$ 38306 22891 -3666 -23807 -21868 -14885 -10930 1284 -17772 12579 68551 89921 68611
12585F8611k8411j9287k9303J6944j921J599M461l3274j5407J3921J3180R565
$$ 68611 40200 20913 -8390 8554 6633 8232 12693 -20581 -35988 -22067 -8887 678
12573F78j2313M328J4935J3461l193j9037J7506j1650o908j2923k3173J4489K8184
$$ 678 -11635 -7307 7628 21089 17896 -1141 16365 4715 -2193 -15116 -38289 -23800 4384
12560D384R007k502j5337j6091K6312J7675J953r489o459O511R813K31L0809M870
$$ 4384 13391 10889 -4448 -20539 5773 23448 25401 15912 9453 15964 25777 26008 56817 61687
12546F1687l406k6019q291j2773J393P358J4203L916L147k2907J3943p183P9L185
$$ 61687 58281 32262 23971 11198 12591 19949 34152 38068 41215 18308 32251 25068 25147 28332
12532B8332j3264J2973q835j4698l536k138J5497R548j1162O238r902j9976o648
$$ 28332 15068 28041 19206 4508 972 -1166 14331 23879 12717 18955 9053 -10923 -17571
12519a7571K8434J7453J1859j1767k0359M3312l695j6915O344k221j4528P634
$$ -17571 10863 28316 40175 28408 8049 51361 47666 30751 37095 34874 20346 27980
12507B7980k4711k2639J3366K4684P406q060k1649M719J6719R376r755j1056J0833
$$ 27980 3269 -19370 -6004 18680 26086 18026 -3623 1096 17815 27191 17436 6380 17213
12494A7213k0407j1196L2590M708k3072k6646R22k057K0707J7263M194J0336n925
$$ 17213 -3194 -14390 18200 22908 -164 -26810 -25888 -27945 -7238 10025 14219 24555 18630
12481A8630N203o234l023k8760p018L0172k758j7679j9653r617J0101J8146J4488
$$ 18630 23833 17599 14576 -14184 -21202 8970 6212 -11467 -31120 -40737 -30636 -12490 1998
12468A998J3465J0703j2373J2505n840k1217l147K1434J6823J7626o950N329N752
$$ 1998 15463 26166 13793 26298 20458 -759 -3906 17528 34351 51977 45027 50356 56108
12455E6108j2918P493l621O732J3070k9088k2211j2409J7533J4134Q622k3965
$$ 56108 43190 50683 47062 53794 66864 37776 15565 3156 20689 34823 43445 19480
12443A9480q160k5142J0173q17K7951K8771k5k4781k3739p459K7165k0247j6711
$$ 19480 11320 -13822 -3649 -4466 23485 52256 52231 27450 3711 -3748 23417 3170 -13541
12430a3541m652o098M650J2481K4938M06N773o434k1847Q467q240j4318j8168
$$ -13541 -18193 -24291 -19641 -7160 17778 18184 23957 17523 -4324 4143 -4097 -18415 -36583
12417c6583K871K016K5281K0234K7679j3985k1882j8657K2655l674n825k2665
$$ -36583 -33712 -31696 -6415 13819 41498 27513 5631 -13026 9629 5955 130 -22535
12405b2535j245P579K7638L0577R201q439j9038j4452p507J6468R705N091k790
$$ -22535 -23780 -16201 11437 42014 51215 42776 23738 9286 1779 18247 27952 33043 30253
12392C0253k7300j1408N997o614j2273K3198M2645p935M531j1629p851J9524j73
$$ 30253 2953 -8455 -2458 -9072 -21345 1853 44498 36563 41094 29465 21614 41138 40965
12379D0965j8216l151j0908k9080j7046k085J1141L1685J1454n952p522n90K1184
$$ 40965 22749 19598 8690 -20390 -37436 -39521 -28380 3305 14759 8807 1285 695 21879
12366B1879j458j3956J9224o45k8451k5475L2963J1243j912n172j0382j3746r500
$$ 21879 20421 6465 25689 25044 -3407 -28882 4081 15324 13412 8240 -2142 -15888 -25388
12353b5388P401J6479J6671P821m342r079j1822J792k263o581j2030j8785J1835
$$ -25388 -17987 -1508 15163 22984 18642 9563 -2259 -467 -2730 -9311 -21341 -40126 -28291
12340b8291J6006R404n623N310L3031M030J5252j4793l9834n468n100j2835K3393
$$ -28291 -12285 -2881 -8504 -3194 29837 33867 49119 34326 -5508 -10976 -16076 -28911 -5518
12327e518K4309J5862N866j5401k4749O639j5354l4790j3204O110o175q19m613
$$ -5518 18791 34653 40519 25118 369 7008 -8346 -43136 -56340 -50230 -56405 -57224 -61837
12314f1837L5445O939J5163k206k005q505k0083r225j6558j573N339J8953M606
$$ -61837 -26392 -19453 -4290 -6496 -8501 -17006 -37089 -46314 -62872 -64445 -59106 -40153 -35547
12301c5547m858J9197J9873K9735J9845k7161m0m001p913P819j4762N468J2271
$$ -35547 -40405 -21208 -1335 28400 48245 21084 21044 17043 9130 16949 2187 7655 19926
12288A9926P969j6876j4368j431j3739n551O649J0933M591o309J7400l181J915
$$ 19926 27895 11019 -3349 -4780 -18519 -24070 -17421 -6488 -1897 -8206 9194 6013 7928
12275G928J5276J3647j1317n236Q574k1407m387J8126j028k9222q068o1m022j349
$$ 7928 23204 36851 25534 20298 28872 7465 3078 21204 20176 -9046 -17114 -17175 -21197 -22546
12261b2546P661k6748j0221J2241K2049R885R060q571J204j441l7640j655M2489
$$ -22546 -14885 -41633 -51854 -39613 -17564 -7679 1381 -7190 -5986 -7427 -45067 -46722 -4233
12248d233M6627J0483k6690k0739k252P540K2163l900j5647j53N36j0786j0541
$$ -4233 42394 52877 26187 5448 3196 10736 32899 28999 13352 13199 13735 2949 -7592
12235g592J3368J9854p94q925r667K166j0856J0405J2645r726L647j976Q294p50
$$ -7592 5776 25630 24836 15911 6244 8410 -2446 7959 20604 10878 14525 12549 20843 20093
12221B0093j9722l6656Q260J3755J2024K277J8162J4023Q477j3458l669k6763
$$ 20093 371 -36285 -28025 -14270 -2246 31 18193 32216 40693 27235 23566 -3197
12209c197k4698q562j7580m627M519J8883r65K3832P067j9365L549r035R292J9903
$$ -3197 -27895 -36457 -54037 -58664 -54145 -35262 -36227 -12395 -5328 -24693 -21144 -30179 -20887 -984
12195i84K212l5732o049J0605j9345m534L6834J4008q912k3710K347J1991J6317
$$ -984 1228 -34504 -40553 -29948 -49293 -53827 -16993 -2985 -11897 -35607 -33260 -21269 -4952
12182d952K3379P758J116k0308k5358K0958J8823k4577O816K430j2965j5512L1869
$$ -4952 18427 26185 27301 6993 -18365 2593 21416 -3161 3655 6085 -6880 -22392 9477
12169I477L7085K1091j2702p231j8248k7673m745L7469K933j2760k166k6185k1475
$$ 9477 46562 67653 54951 47720 29472 1799 -2946 34523 37456 24696 22530 -3655 -25130
12156b5130j677j361K1149M761K993P570j4470o145R086r261l635J1621P962r556
$$ -25130 -26807 -28168 -7019 -2258 735 8305 -6165 -12310 -3224 -12485 -16120 -4499 3463 -6093
12142f093q146l8313K724K4665M0053J2785j4901M156J4211L995J1876k6434l0293
$$ -6093 -14239 -52552 -49828 -25163 14890 27675 12774 16930 31141 35136 47012 20578 -9715
12129i715l5920J3992J6393J0872P596J9832J94j2511j0115r265j264J0382J2899
$$ -9715 -45635 -31643 -15250 -4378 3218 23050 23244 10733 618 -8647 -9911 471 13370
12116A3370k3507j4095J1153J6769M569j1775J5145J4576k648o714K873J8596
$$ 13370 -10137 -24232 -13079 3690 8259 -3516 11629 26205 23557 16843 19716 38312
12104C8312n375j6277J0184J3885L526k6317l7004J0508J9566J5665k826j8627
$$ 38312 32937 16660 26844 40729 44255 17938 -19066 -8558 11008 26673 23847 5220
12092E220J4867j4237j7042M4284K1739k3744k4661m769M3797j3532j6056J949
$$ 5220 20087 5850 -11192 33092 54831 31087 6426 1657 45454 31922 15866 17815
12080A7815L913l2789r357j510J4404J0695j5144p0r69J3585n233k974j8996j0478
$$ 17815 21728 -11061 -20418 -21928 -7524 3171 -11973 -12043 -13012 573 -4660 -7634 -26630 -37108
12066c7108j8191Q254j0308P281K2586K8693M214L567J2895M532n111k0481J2588
$$ -37108 -55299 -47045 -57353 -50072 -27486 1207 5421 8988 21883 26415 21304 823 13411
12053A3411P504j4141J435j255N319J905N671q244l1994j6007K0840J8755K506
$$ 13411 20915 6774 8209 6954 12273 14178 19849 11605 -20389 -36396 -15556 3199 5705
12040E705q33j1420j5210l780J234J5198J0138L233J693p683L491K3801k3K8916
$$ 5705 4872 -6548 -21758 -25538 -24304 -9106 1032 4265 5958 -1725 1766 25567 25544 54460
12026E4460Q968j9865p712k5770j1812M19K1554L455j0988M992r327Q918J5690
$$ 54460 63428 43563 35851 10081 -1731 -1312 20242 23697 12709 17701 8374 17292 32982
12013C2982n896k2726j4625k9871m688J8929J3091J8742J4073j1385Q565K045
$$ 32982 27086 4360 -10265 -40136 -44824 -25895 -12804 5938 20011 8626 17191 19236
12001A9236R479J5905j0370j0776n826P051j2559K2847O117o392L578j2617k9014
$$ 19236 28715 44620 34250 23474 17648 24699 12140 34987 41104 34712 38290 25673 -3341
11988c341o657J3577j3921q603K9312J62k8428O481n727k668K3613l506k919n433
$$ -3341 -9998 3579 -10342 -18945 10367 10529 -17899 -11418 -17145 -19813 3800 294 -2625 -8058
11974h058j1753J601j6664J1762j5226O710L0521J8179L346m386j4975o678P812
$$ -8058 -19811 -18210 -34874 -23112 -38338 -31628 -1107 17072 20418 16032 1057 -5621 2191
11961B191J1296p787j5946j465Q930J8957K330j4842n400R915R175L047n611m967
$$ 2191 13487 5700 -10246 -11711 -2781 16176 18506 3664 -1736 8179 17354 20401 14790 9823
11947I823M460M039j4390O142L1028J6370J698l9649j4758j2924N095J6188q106
$$ 9823 14283 18322 3932 10074 41102 57472 59170 19521 4763 -8161 -3066 13122 5016
11934E016m849J7537K3653j280j7889p733J9446J7382n116j4822L68L741j7357
$$ 5016 167 17704 41357 40077 22188 14455 33901 51283 46167 31345 31713 35454 18097
11921A8097j792k808p167j0256N911J5844J0319j4301P790J9283J9150L0959O91
$$ 18097 16305 13497 6330 -3926 1985 17829 28148 13847 21637 40920 60070 91029 91720
11908I1720l1880k9395j7830n158N103q751M972l109j1815J5251J4601r021J0519
$$ 91720 59840 30445 12615 7457 12560 3809 8781 5672 -6143 9108 23709 14688 25207
11895B5207J6636o871P375J6291o687j711J4627K1009j1699j8819J8036p37Q542
$$ 25207 41843 34972 42347 58638 51951 50240 64867 85876 74177 55358 73394 72657 81199
11882H1199j4036j1897J805L616J9882P300j7664k0297k2738Q118O256R109Q835
$$ 81199 67163 55266 57071 60687 80569 87869 70205 49908 27170 35288 41544 50653 59488
11869E9488o721j1592L274k3980j4329K5644L1309n203k1065J0617j6824m50q12
$$ 59488 52767 41175 44449 20469 6140 31784 63093 57890 36825 47442 30618 30168 29356
11856B9356K0960r338o450j6548r456k4260M178N472J0753K7091K9861J1946j688
$$ 29356 50316 40978 34528 17980 8524 -15736 -11558 -6086 4667 31758 61619 73565 71877
11843G1877K7269N6289K0290o884J3928j8313p503k348J5395L671n17K600N767
$$ 71877 99146 155435 175725 168841 182769 164456 156953 154605 170000 173671 173154 175754 181521
11830A81521m1880m2447j5025j6367O015O213k128k9182M788J3711R508j0423
$$ 181521 139641 97194 82169 65802 71817 78030 75902 46720 51508 65219 74727 64304
11818F4304k5702K883j057n20M3701L973k9481j5235J699k2059j4717m766L9320
$$ 64304 38602 41485 40428 39908 83609 87582 58101 42866 44565 22506 7789 3023 42343
11805D2343L5023L4747N539p770k5181l0521K384K0317K7874J979J3528J8448
$$ 42343 77366 112113 117652 109882 84701 54180 56564 76881 104755 106734 120262 138710
11793A38710l184j8538j6260J1030L3992R48j847j4732J1718J9757K3852R464
$$ 138710 135526 116988 100728 111758 145750 146698 144851 130119 141837 161594 185446 194910
11781A94910k6644n6257l6899j6062m186r696K762K002M583j2263K2373K2789
$$ 194910 168266 112009 75110 59048 54862 45166 47928 49930 54513 42250 64623 87412
11769H7412l859m0654j9352J2720N629j476j7549q703J460P936K3356p134r67
$$ 87412 83553 42899 23547 36267 41896 40420 22871 14168 15628 23564 46920 39786 38819
11756C8819O458L199j8759n736N607K597M515K532k0399j3205K200J7660K9369
$$ 38819 45277 48476 29717 23981 29588 32185 36700 39232 18833 5628 7828 25488 54857
11743E4857N175l6900o657L845N220J9071q265j996J5959k363j2722o316p751
$$ 54857 60032 23132 16475 20320 25540 44611 36346 34350 50309 47946 35224 28908 21157
11730B1157k284R707p316q679N126K907r716k9772R456M9052J6426j6569j737
$$ 21157 18873 28580 21264 12585 17711 20618 10902 -18870 -9414 39638 56064 39495 37758
11717C7758q980k9294n179Q020K0872Q479M519j2746P203n323l1702q424Q616
$$ 37758 28778 -516 -5695 2325 23197 31676 36195 23449 30652 25329 -6373 -14797 -6181
11704f181K1216j1600r819j7888M93J5185l97J3970Q9j0671k099K4488P968o880
$$ -6181 15035 3435 -6384 -24272 -23779 -8594 -8991 4979 5068 -5603 -7702 16786 24754 17874
11690A7874j3994j1366J4393O060k15j702o56J7253j0122l4864k327J3842J1425
$$ 17874 3880 -7486 6907 12967 12752 11050 10394 27647 17525 -17339 -19666 -5824 5601
11677E601O222J8090K2065J1965k2892l2041J41J0224j4296j5743J703m988n920
$$ 5601 11823 29913 51978 63943 41051 9010 9151 19375 5079 -10664 -8961 -13949 -19869
11664a9869N192J2840K7517J1318j82O248k1267j5300N653p613j1564R327P919
$$ -19869 -14677 -1837 25680 36998 36816 43064 21797 6497 12150 4537 -7027 2300 10219
11651A0219J5322J9585j0861k4736k300Q511K946j9832Q853K9535n111j2242o656
$$ 10219 25541 45126 34265 9529 7229 15740 18686 -1146 7707 37242 32131 19889 13233
11638A3233l116J0183r958J994K9865r541J0831O861L0458m766j1613J3936p618
$$ 13233 10117 20300 10342 12336 42201 32660 43491 50352 80810 76044 64431 78367 70749
11625G0749l263m132j7527j6108j1523k5226J1404K6077k2923j5992l395l131
$$ 70749 67486 63354 45827 29719 18196 -7030 4374 30451 7528 -8464 -11859 -14990
11613a4990J7277J6547P603J3745K2077p375J926k2275j8195J1412J7133K9699
$$ -14990 2287 18834 26437 40182 62259 54884 56810 34535 16340 27752 44885 74584
11601G4584l443L894r241r005k2217j4419j561q069k979J7516K1006J6519L987
$$ 74584 71141 75035 65794 56789 34572 20153 18592 10523 7544 25060 46066 62585 66572
11588F6572p219l354l6851j4951J5460N681J1195K9651J3226j6055k4679k4029
$$ 66572 59353 55999 19148 4197 19657 25338 36533 66184 79410 63355 38676 14647
11576A4647j0263J1790L245j8654K1204J9071j860k4198k9521K2238K3955K7649
$$ 14647 4384 16174 19419 765 21969 41040 39180 14982 -14539 7699 31654 59303
11564E9303p529O900O739p17m325P552l1265j7184j7548J0639k0512k9641J9005
$$ 59303 51774 58674 65413 64696 60371 67923 36658 19474 1926 12565 -7947 -37588 -18583
11551a8583J2014L1757J3350r954K3496r66j4532j0772n643k451k1062k1312L3084
$$ -18583 -6569 25188 38538 28584 52080 51114 36582 25810 20167 17716 -3346 -24658 8426
11538H426K4740J578m796J496K953j22m537J3398k40j1224j3397l0984M428K6058
$$ 8426 33166 34744 29948 31444 34397 34275 29738 43136 42896 31672 18275 -12709 -8281 17777
11524A7777K3161J8017k3143l2773P955Q190k917n234k500K134Q705k81Q1j5040
$$ 17777 40938 58955 35812 3039 10994 19184 16267 11033 8533 10667 19372 19091 19172 4132
11510D132J3231P089J6853J3034O947R189j4515q984J6414j3859j0778j0388o181
$$ 4132 17363 24452 41305 54339 61286 70475 55960 46976 63390 49531 38753 28365 22184
11497B2184K5881j626l1023k035K9435J4023l306K838R998j4890J7376J7461Q489
$$ 22184 48065 46439 15416 13381 42816 56839 53533 56371 66369 51479 68855 86316 94805
11484I4805j0791j2319j3223j5725n033K6410J8594j1801k3875j9573K3484K7306
$$ 94805 84014 71695 58472 42747 37714 64124 82718 70917 47042 27469 50953 78259
11472G8259k1975r066J2884L798j2538j0104l0588r620J5010J5709J4061j5261
$$ 78259 56284 47218 60102 63900 51362 41258 10670 1050 16060 31769 45830 30569
11460C0569j4299J1094K644R600N326l914j5610K9837K465p920L937J3039K668
$$ 30569 16270 27364 30008 39608 44934 41020 25410 55247 57712 49792 53729 66768 69436
11447F9436Q780M051J1614j7543k3256k1150p026K0140L2966k7618k8824J4687
$$ 69436 78216 82267 93881 76338 53082 31932 24906 45046 78012 50394 21570 36257
11435C6257j918J1921L6515O814q093j5261J7461R748j1148q232K2421J2991j8578
$$ 36257 34339 46260 82775 89589 81496 66235 83696 93444 82296 74064 96485 109476 90898
11422I0898J629j2148N90M42k8017k8199m70J9681L0990J5347j050J2757j2347
$$ 90898 92527 80379 80969 81411 53394 25195 24725 44406 75396 90743 89693 102450 90103
11409I0103q416M046L086j529k3953j3237J9814K549k89J2218J9417k2767l8098
$$ 90103 81687 85733 88819 87290 63337 50100 69914 72463 72174 84392 103809 81042 42944
11396D2944K5804j5427O203j8951j5058J6150j544k3713O610J8206J9254J0377
$$ 42944 68748 53321 59524 40573 25515 41665 40121 16408 23018 41224 60478 70855
11384G0855n860N78M258J4625P190j6715q519L0792J9049L1777J4135J1483J6211
$$ 70855 64995 65573 69831 84456 91646 74931 66412 97204 116253 148030 162165 173648 189859
11371A89859K4299r741j9287l3538L835M52R58k2010j074J3024k5803j7490j2259
$$ 189859 214158 204417 185130 151592 155427 155879 156837 134827 133753 146777 120974 103484 91225
11358I1225j7553Q348J3238j198J4625K7275p417j2983J5239R955q202j7494J777
$$ 91225 73672 82020 95258 94060 108685 135960 128543 115560 130799 140754 132552 115058 116835
11345A16835j328j6689P332K4881j745j1013j1795k479L201o372j6899p390R074
$$ 116835 115507 98818 106150 131031 129286 118273 106478 103999 107200 100828 83929 76539 85613
11332H5613O751O228O727L6509M2048N3614K1890K8190Q2675K8802m4138l5235
$$ 85613 92364 98592 105319 141828 183876 237490 259380 287570 370245 399047 354909 319674
11320C19674n116r936Q200l3480l7927k1085m5423l5060K804L2428L0548q424
$$ 319674 314558 304622 312822 279342 241415 220330 174907 139847 142651 175079 205627 197203
11308A97203J8528M2925M4735K7880P1790J04793J24543K13122K82248K84691
$$ 197203 215731 258656 303391 331271 403061 507854 632397 845519 1127767 1412458
11298A412458K45060J09101p3629k20137k95567k90756k29514j56469r3357m5603
$$ 1412458 1657518 1766619 1692990 1472853 1177286 886530 657016 500547 407190 361587
11288C61587q350k5592L251Q753j8424k3644r34J1926j0647k0236J8620L3254
$$ 361587 353237 327645 330896 339649 321225 297581 296647 308573 297926 277690 296310 329564
11276C29564K7832q120K6072j7845j3166o54k4214k4979j962q984j6157J7711
$$ 329564 357396 349276 375348 357503 344337 343683 319469 294490 292528 283544 267387 285098
11264B85098L5921K88K8950J1156K7309M4935R8499Q7988N5407q347m51j6321
$$ 285098 321019 321307 350257 361413 388722 433657 532156 620144 675551 667204 666753 650432
11252F50432l0994r4526q4781o3849o4923m5137k4353m06Q674j7220n4437J1484
$$ 650432 619438 524912 440131 376282 311359 266222 241869 241463 250137 232917 178480 189964
11240A89964J6211k6481j0617J5293L938j3363k3731k3227m207J7439L682j9105
$$ 189964 206175 179694 169077 184370 188308 174945 151214 127987 123780 141219 144901 125796
11228A25796m493K805J4951L2582r074j1352K424M136N746o0J5010R119j3422
$$ 125796 121303 124108 139059 171641 162567 151215 153639 157775 163521 163461 178471 187590 174168
11215A74168l5026j3200j094K1725O020J2638J7399j7150k0288m761Q793P800
$$ 174168 139142 125942 124848 146573 152593 165231 182630 165480 145192 140431 149224 157024
11203A57024o947k8955R05p099J2434O012r849R356J613J0120M871L710K087l439
$$ 157024 150077 121122 122027 114928 127362 133374 123525 132881 134494 144614 149485 153195 155282 151843
11189A51843m281j4219k2532l808K7962J0676Q505P212k9881O269J9206l0059
$$ 151843 147562 133343 110811 107003 134965 145641 154146 161358 131477 137746 156952 126893
11177A26893k8941J2134K6938J1257k8358j2897J0886P406J1844k6146j2645r94
$$ 126893 97952 110086 137024 148281 119923 107026 117912 125318 137162 111016 98371 97377
11165I7377j6108J4012L9554O270m983L5606J0122J8308J600r222J469P939K0034
$$ 97377 81269 95281 134835 141105 136122 171728 181850 200158 201758 192536 194005 201944 221978
11152B21978K4491M0273L339j3419j0629j5769l9601l2167L372J7330K4648m466
$$ 221978 246469 286742 290081 276662 266033 250264 210663 178496 181868 199198 223846 219380
11140B19380k6436j2497r38l592k6012o896j8081j2442M1479N5543k405k54P074
$$ 219380 192944 180447 179509 175917 149905 143009 124928 112486 153965 209508 207103 206849 213923
11127B13923m072q243q150m789l080p284j498j8086j0080k9752n216J1986J0162
$$ 213923 209851 201608 193458 188669 185589 178305 176807 158721 148641 118889 113673 125659 135821
11114A35821N4k9055J6200P963J8595L5855o478P649l042K5364L5793M9151J2663
$$ 135821 135875 106820 123020 130983 149578 185433 178955 186604 183562 208926 244719 293870 306533
11101C06533r817l5686l2361k1380N37m525p994k0883l2416K2195L250j8062q630
$$ 306533 296716 261030 228669 207289 207826 203301 195307 174424 142008 164203 167453 149391 140761
11088A40761K6347O6447M6069K3842P1779N0543L3014K2387l5974l3579j6061
$$ 140761 167108 233555 279624 303466 375245 425788 458802 481189 445215 411636 395575
11077C95575k3861l6371j4175J2451l8090j3536j2840m212K924J386K0400L817
$$ 395575 371714 335343 321168 333619 295529 281993 269153 264941 267865 269251 289651 293468
11065B93468R057p557M776k6877j5440N899L5036P987j7664J4743L0238J692J0518
$$ 293468 302525 294968 299744 272867 257427 263326 298362 306349 288685 303428 333666 335358 345876
11052C45876J6991l238k2485o607k0998m9250P35L8573R4117J08793Q9046J12730
$$ 345876 362867 359629 337144 330537 309539 260289 261024 299597 393714 502507 591553 704283
11040G04283P5162J5555k1569o1668j08361n7429o1285m3621m2070k4288j2875
$$ 704283 779445 795000 773431 711763 603402 545973 484688 441067 398997 374709 361834
11029C61834m5025j143K8793P8530K03525L44295N12509N35932L31994J29088
$$ 361834 316809 315666 344459 422989 626514 970809 1483318 2019250 2351244 2480332
11019B480332j92745l90548l44015k51585j56037p6589m1640q0758o6078o8057
$$ 2480332 2287587 1897039 1553024 1301439 1145402 1068813 1027173 946415 880337 812280
11009H12280m1674r811n408j7241R91k0421j6096l830M865n4528l0043J7591L7791
$$ 812280 770606 760795 755387 738146 739137 718716 702620 698790 703655 649127 619084 636675 674466
10996F74466L818L0355M5140L1377L905m8423Q45l9819n5352N011K2472J1868
$$ 674466 678284 708639 753779 785156 789061 740638 741483 701664 646312 651323 673795 685663
10984F85663j2879k7K1449J4892L3324K0357q517k0566o157j3317l6120J7487
$$ 685663 672784 672757 694206 709098 742422 762779 754262 733696 727539 714222 678102 695589
10972F95589j0226k59K3329K7304K6493L0408K916R126K0570l985j3999K056M9220
$$ 695589 685363 685104 708433 735737 762230 792638 795554 804680 825250 821265 807266 809322 858542
10959H58542K5366l6147k7141K281L3393J1340L2789M420K8041K2205J2002o787
$$ 858542 883908 847761 820620 822901 856294 867634 900423 904843 932884 955089 967091 960304
10947I60304K2105L6873K696M6925J7299J2926J4858K6823L5723L5384Q358J3484
$$ 960304 982409 1019282 1021978 1068903 1086202 1099128 1113986 1140809 1176532 1211916 1220274 1233758
10935A233758N5212N3077J0598J934k3297l1306L986N4591J00774J28150J86615
$$ 1233758 1288970 1342047 1352645 1354579 1331282 1299976 1303962 1358553 1459327 1587477 1774092
10924A774092K04299J91241J97355K04388J95525K27990K90817L89409M81184
$$ 1774092 1978391 2169632 2366987 2571375 2766900 2994890 3285707 3675116 4156300
10915D156300N40469O00054N83832N20745M81365N08356P17022J043469J449405
$$ 4156300 4696769 5296823 5880655 6401400 6882765 7391121 8108143 9151612 10601017
10906A0601017J845100K240844K715167L394094M560220O555644R943819J5361906
$$ 10601017 12446117 14686961 17402128 20796222 25356442 31912086 41855905 57217811
10898E7217811K3245439L3927046M6162594N4589033N0603905L1956793L364218
$$ 57217811 80463250 114390296 160552890 215141923 265745828 297702621 301066839
10891C01066839l0762014m8874739n3883153m7481486l2427594j9503410j1698347
$$ 301066839 270304825 221430086 167546933 120065447 87637853 68134443 56436096
10884E6436096p421655n018642l691595k854644k260606j891124j575550j262427
$$ 56436096 49014441 43995799 40304204 37449560 35188954 33297830 31722280 30459853
10876C0459853r41947o25243l30022j24383j02333k07725m39727p71034j056719
$$ 30459853 29517906 28892663 28562641 28438258 28335925 28128200 27688473 26917439 25860720
10867B5860720j256680j364891j365843j287108j139345r71285q11258o61843
$$ 25860720 24604040 23239149 21873306 20586198 19446853 18475568 17664310 17002467
10859A7002467n31808m63573l90341l04488j86009l7985R4581Q6654l7806k50049
$$ 17002467 16470659 16007086 15616745 15312257 15126248 15088263 15182844 15269498 15231692 14981643
10849A4981643o02987q27116q92486q47637o91255n43112m32196l39785l30693
$$ 14981643 14378656 13551540 12659054 11811417 11120162 10577050 10144854 9805069 9474376
10840I474376k86032k50837k37272k23974j84257k07170k03943k01364k05003
$$ 9474376 9188344 8937507 8700235 8476261 8292004 8084834 7880891 7679527 7474524
10831G474524k05731j89574j52919j50503j58727j68150j64774j64471j70814
$$ 7474524 7268793 7079219 6926300 6775797 6617070 6448920 6284146 6119675 5948861
10822E948861j75478j38795j23259q9731p5242q1526n7043p3132j04684j01454
$$ 5948861 5773383 5634588 5511329 5421598 5346356 5264830 5207787 5134655 5029971 4928517
10812D928517j34182j38243r8491q7766r6257q6189p4070o1683o5760p5677q0397
$$ 4928517 4794335 4656092 4557601 4469835 4373578 4287389 4213319 4151636 4085876 4010199 3929802
10801C929802j10968p6613n3290q2873r7446m4578q4921p8180o4206r5180p9167
$$ 3929802 3818834 3742221 3688931 3606058 3508612 3464034 3379113 3300933 3236727 3141547 3062380
10790C062380o6294n4251l3055n0762o0652l8473k6098m9623n7310o9569m7760
$$ 3062380 2996086 2941835 2908780 2858018 2797366 2758893 2732795 2683172 2625862 2556293 2508533
10779B508533l5542n8679j8940j2533r536K2077R6785J76318L21239M12782L86090
$$ 2508533 2472991 2414312 2395372 2382839 2373303 2395380 2492165 2668483 2989722 3402504 3788594
10768C788594J88376n8935k88330m26519l82840l30926k11292j38911r3307m8715
$$ 3788594 3976970 3918035 3629705 3203186 2820346 2489420 2278128 2139217 2045910 1997195
10758A997195m0607p4547o8422k2322j8238j8146l2473r807Q03r109N43q04K1575
$$ 1997195 1956588 1882041 1813619 1791297 1773059 1754913 1722440 1712633 1713436 1704327 1704870 1704066 1725641
10745A725641L0252K1124L2527L5200R102l1378l9418o6003j07650j32977r7480
$$ 1725641 1755893 1777017 1809544 1844744 1853846 1822468 1783050 1717047 1609397 1476420 1378940
10734A378940k0439l0466k3882k602k3349j2530l843j0781k122l2893l7310k9515
$$ 1378940 1358501 1328035 1304153 1301551 1278202 1265672 1261829 1251048 1248926 1216033 1178723 1149208
10722A149208l4383l3579l3428m9782j8733m419k2261l5727l7765k1126j6831
$$ 1149208 1114825 1081246 1047818 998036 979303 974884 952623 916896 879131 858005 841174
10711H41174j9556l5382n6006m5824n9006m2316l5097j5818k4073k1202K4284
$$ 841174 821618 786236 730230 684406 625400 583084 547987 532169 508096 486894 511178
10700E11178N1701K6884L4900M9138J1728r650k0353k3425j3027M737k1631l3205
$$ 511178 562879 589763 624663 673801 685529 675879 655526 632101 619074 623811 602180 568975
10688E68975k7524k7853k0125j4209N420l752k1945P340K8233K2587p921k0926
$$ 568975 541451 513598 493473 479264 484684 480932 458987 466327 494560 517147 509226 488300
10676D88300j3357k0611L190K9244J709k9491m4045l3151M861q016j1222j0123
$$ 488300 474943 454332 457522 486766 488475 458984 414939 381788 386649 378633 367411 357288
10664C57288N406j2438j4138r175j4550o859K3533Q692l0195k8411L244J0291
$$ 357288 362694 350256 336118 326943 312393 305534 329067 337759 307564 279153 282397 292688
10652B92688k5655J5059M2668J7370k0967j0515l098J3285P254k0876k2302r404
$$ 292688 267033 282092 324760 342130 321163 310648 307550 320835 328089 307213 284911 275507
10640B75507N938N189k1674k5800J330j8622k3246m528p358L380L465m9006k9747
$$ 275507 281445 286634 264960 239160 240490 221868 198622 194094 186736 190116 193581 144575 114828
10627A14828K3598M778J5748N335P681L9011m079j6847M650M529P999r889n854
$$ 114828 138426 143204 158952 164287 171968 210979 206900 190053 194703 199232 207231 197342 191488
10614A91488j8691J199q519k5064L202P111k0480j3932J2744N957K1130j2252
$$ 191488 172797 173996 165477 140413 143615 150726 130246 116314 129058 135015 156145 143893
10602A43893p2q197j2905j0733K879k6824k9612J4690J1303l398Q684J046j4256
$$ 143893 143821 135624 122719 111986 114865 88041 58429 73119 84422 81024 89708 90754 76498
10589G6498m675J4401j2957P063J0069N30M435J6095l142J3032k9683j3572l551
$$ 76498 71823 86224 73267 80330 90399 90929 95364 111459 108317 121349 91666 78094 74543
10576G4543j0614K3358L5797K0789l9587m7475O740L1066m281k4016k3166l272
$$ 74543 63929 87287 123084 143873 104286 56811 63551 94617 90336 66320 43154 39882
10564C9882J8337J9828J4692L140j4877n967j8892j9360j5240L8941J8726q152
$$ 39882 58219 78047 92739 95879 81002 75035 56143 36783 21543 60484 79210 71058
10552G1058j3163j0754j39k1722r863j0502K777N430K4602J6226M5694n900l595
$$ 71058 57895 47141 47002 25280 15417 4915 7692 13122 37724 53950 99644 93744 90149
10539I0149P530J5182J3802M7759L7868j8194k3315L944o508k3193m3583l0400
$$ 90149 97679 112861 126663 174422 212290 194096 170781 174725 168217 145024 101441 71041
10527G1041Q143l022j5783n351k726k2292J1943Q144l720K4155J2822M866J1314
$$ 71041 79184 76162 60379 55028 52302 30010 41953 50097 46377 70532 83354 88220 99534
10514I9534j5357Q153j9110m658Q693J8678K808M779q311j3915m480j2485o929
$$ 99534 84177 92330 73220 68562 77255 95933 98741 103520 95209 81294 76814 64329 57400
10501E7400Q199M93J299k0602k58P765M172J8707M4110K8213M0308K9095J11908
$$ 57400 65599 66092 67391 46789 46531 54296 58468 77175 121285 149498 189806 218901 330809
10488C30809J26892J59748K19921K69491K88094J90527J7246j57347k55506l00711
$$ 330809 457701 617449 837370 1106861 1394955 1585482 1602728 1445381 1189875 889164
10478H89164k56152j93662r5299m5913m4002k5704j296j4437K488j6736j7886
$$ 889164 633012 439350 344051 298138 254136 228432 227136 212699 215187 198451 180565
10467A80565j2255m820K752j6530O909J3067N46j7562k9380m9N005j281m73l0040
$$ 180565 168310 163490 166242 149712 156621 169688 170234 152672 123292 123243 128248 126967 126494 96454
10453I6454J7466L3288P286j894l1182l4279k0766n423J3315j943j2832J395J951
$$ 96454 113920 147208 154494 152600 121418 87139 66373 60950 74265 72322 59490 60885 62836
10440F2836l1974J3476j1969k8420j2482P227N149L997M403J5460M712j3354K296
$$ 62836 30862 44338 32369 3949 -8533 -1306 3843 7840 12243 27703 32415 19061 21357
10427B1357K4083k1922j2021R265o7m323J6052q497K647m242R519R353J6076L487
$$ 21357 45440 23518 11497 20762 20695 16372 32424 23927 26574 22332 31851 41204 57280 60767
10413F0767r817J5720j2649j1488j0918J7900J5281k1385K652J3596m773l3126
$$ 60767 50950 66670 54021 42533 31615 49515 64796 43411 46063 59659 54886 21760
10401B1760j8292o146J1079k60m673P587J8482r897m7582L250M2548K9593o044
$$ 21760 3468 -2678 8401 8141 3468 11055 29537 19640 -27942 -24692 17856 47449 41405
10388D1405j4936p720j7345k6806k2898J4427J2592j2563j7071l981n315L546
$$ 41405 26469 18749 1404 -25402 -48300 -33873 -21281 -33844 -50915 -54896 -60211 -56665
10376e6665l1693k0534L9829M4091o252j3010J4174L5699n878k8925j196o928
$$ -56665 -88358 -108892 -69063 -24972 -31224 -44234 -30060 5639 -239 -29164 -30360 -37288
10364c7288J1858L3867J4136j2513J1465J719j8351k9617k0316J3153P11N777
$$ -37288 -25430 8437 22573 10060 21525 23244 4893 -24724 -45040 -31887 -31176 -25399
10352b5399J0964J0430J4983p026j1028J614j672k6065o855K55R748j1081q548
$$ -25399 -14435 -4005 10978 3952 -7076 -5462 -7134 -33199 -40054 -39799 -30051 -41132 -49680
10339d9680J2488L145k863J1755J7907j1839j7225k0421J626L4101J7682j2559
$$ -49680 -37192 -34047 -36910 -25155 -7248 -19087 -36312 -56733 -55107 -21006 -3324 -15883
10327a5883l176o4M741j424Q785j0465k096l399J1264J8674q920K0876P546j4107
$$ -15883 -19059 -19123 -14382 -15806 -7021 -17486 -19582 -22981 -11717 6957 -1963 18913 26459 12352
10313A2352n725j2355J5372l876O865r52n325j6788k9124K47J2948P691J5731
$$ 12352 6627 -5728 9644 5768 12633 11681 6356 -10432 -39556 -39309 -26361 -18670 -2939
10300b939N502r514L30l383j0614J1143O740k1822m477K1295L707j6332o843o553
$$ -2939 2563 -6951 -6621 -10004 -20618 -9475 -2735 -24557 -29034 -7739 -4032 -20364 -27207 -33760
10286c3760J4999K2382K0378P44j8226j6069p816L932J9258J3529j0447k6424
$$ -33760 -18761 3621 23999 24743 6517 -9552 -17368 -13436 5822 19351 8904 -17520
10274a7520j3215J7122K5201o882p215K1230K837j7276J2978n651l0207p525M353
$$ -17520 -30735 -13613 11588 4706 -2509 18721 21558 4282 17260 11609 -18598 -26123 -21770
10261b1770K6331R129k552k2088R51K1515m850n747j5355j3650N115P822J4807
$$ -21770 4561 13690 11138 -10950 -9999 11516 6666 919 -14436 -28086 -22971 -15149 -342
10248c42O868J258O059K661J154j1569n376R023j360k3333m413j9039k0868K3134
$$ -342 6526 7784 13843 16504 17658 6089 713 9736 8376 -14957 -19370 -38409 -59277 -36143
10234c6143P049J2388n711j4604L694N093j1872J5618J7601K120k161Q11M992
$$ -36143 -29094 -16706 -22417 -37021 -33327 -28234 -40106 -24488 -6887 -4767 -6928 -6117 -1125
10221a125J2363j5176j0439l2148O479r846O64J371J214n162k972L867J7468J3953
$$ -1125 11238 -3938 -14377 -46525 -40046 -49892 -49228 -47857 -46643 -51805 -54777 -50910 -33442 -19489
10207a9489P336L690j653J445J4840J0353j5225k4307r90Q626l836J3303L0174
$$ -19489 -12153 -8463 -10116 -8671 6169 16522 1297 -23010 -24000 -15374 -19210 -5907 24267
10194B4267J4556k3839K3156J1568k0349j4557m946L488K0948j2582j1114K106
$$ 24267 38823 14984 38140 49708 29359 14802 9856 13344 34292 21710 10596 12702
10182A2702l2895j5585J0921j503j744Q473q501P284K6431K981j6021R113j8256
$$ 12702 -20193 -35778 -24857 -26360 -28104 -19631 -28132 -20848 5583 8564 -7457 1656 -16600
10169a6600R264J1922j6620J1725J8521m004m1641k0063q442L0266J2470m103
$$ -16600 -7336 4586 -12034 -309 18212 14208 -27433 -47496 -55938 -25672 -13202 -17305
10157a7305j1742l64K4434o317r243J7338J6730k1053K6496J3612l6308l5610
$$ -17305 -29047 -29411 -4977 -11294 -20537 -3199 13531 -7522 18974 32586 -3722 -39332
10145c9332J1289J4990O683N168j2060k8629J3349J9460J5347J0191q391j3926
$$ -39332 -28043 -13053 -6370 -1202 -13262 -41891 -28542 -9082 6265 16456 8065 -5861
10133e861k820k5958q910L225K1575L722Q531R283q862J4242K5256k829j9892
$$ -5861 -8681 -34639 -43549 -40324 -18749 -15027 -6496 2787 -6075 8167 33423 30594 10702
10120A0702j2061q49j6384j435j2662o31J6601K071K6149O623R311J8725p352
$$ 10702 -1359 -2208 -18592 -20027 -32689 -33320 -16719 -14648 11501 18124 27435 46160 38808
10107C8808k6530k3029j6646q238p476J9445J1202j796L86L337J7102K0406j8844
$$ 38808 12278 -10751 -27397 -35635 -43111 -23666 -12464 -14260 -13874 -10537 6565 26971 8127
10094H127j1335j8389J3657J1806k2004j6719j5502M596J5708J729J6599R210
$$ 8127 -3208 -21597 -7940 3866 -18138 -34857 -50359 -45763 -30055 -28326 -11727 -2517
10082b517n759R471J6227k4030l8163n313j0260L629K5358K6246K6261p393m0246
$$ -2517 -8276 1195 17422 -6608 -44771 -50084 -60344 -56715 -31357 -5111 21150 13757 -26489
10069b6489k6782M735J0814L0806k523j9036J7667N147J5928K0711k2943j7803
$$ -26489 -53271 -48536 -37722 -6916 -9439 -28475 -10808 -5661 10267 30978 8035 -9768
10057i768J206j0012j3995L1099J3464p959k9589Q746Q23j6553j2925J5907J7717
$$ -9768 -8562 -18574 -32569 -1470 11994 4035 -25554 -16808 -15985 -32538 -45463 -29556 -11839
10044a1839k1558p623n430K2432J9353J1939q279j597P987J5644j824r780k8221
$$ -11839 -33397 -41020 -46450 -24018 -4665 7274 -1005 -2602 5385 21029 19205 9425 -18796
10031a8796k1060K2618J8414j116k4652r577J3809J851j1380j7588J2887K4343
$$ -18796 -39856 -17238 1176 60 -24592 -34169 -20360 -18509 -29889 -47477 -34590 -10247
10019a0247l020o210O785M583j5066j4347o846j3843L5114K4219l3469o791j6161
$$ -10247 -13267 -19477 -12692 -8109 -23175 -37522 -44368 -58211 -23097 1122 -32347 -39138 -55299
10006e5299k4114N455J2442J2138L0066J2555L417o237L861k3432r549l0132j1802
$$ -55299 -79413 -73958 -61516 -49378 -19312 -6757 -3340 -9577 -5716 -29148 -38697 -68829 -80631
9993h0631J5574J7453J3935O318K0196J5446n112k8441o700P312K6259N969k2900
$$ -80631 -65057 -47604 -33669 -27351 -7155 8291 3179 -25262 -31962 -24650 1609 7578 -15322
9980a5322j4246k778J476j0724m352J3549Q654K9080o097k5570n792j685Q776
$$ -15322 -29568 -32346 -30870 -41594 -45946 -32397 -23743 5337 -760 -26330 -32122 -33807 -25031
9967b5031J8977J3888K8355l6l9090j0633j440K1154J2657k3460k98r42k3269
$$ -25031 -6054 7834 36189 36153 -2937 -13570 -15010 6144 18801 -4659 -4957 -5899 -29168
9954b9168N677p869j7399J9726J9241q671J3213J8444j1075l0392M103o440J5621
$$ -29168 -23491 -31360 -48759 -29033 -9792 -18463 -5250 13194 2119 -28273 -24170 -30610 -14989
9941a4989J7664m919J588R958J0000J5774L9289K8067K2454M9144K8329j5833
$$ -14989 2675 -2244 -656 9302 19302 35076 74365 102432 124886 174030 202359 186526
9929A86526n3632n7241k2363j6096j7786p026J8883k7685k8279p571J14p748L3908
$$ 186526 132894 75653 53290 37194 19408 12382 31265 3580 -24699 -32270 -32156 -39904 -5996
9916e996J2093p591l043J9424J1577J3319N854J2442l1224k5285J4203J7763j478
$$ -5996 6097 -1494 -4537 14887 26464 39783 45637 58079 26855 1570 15773 33536 32058
9903C2058k1618k3429N182k007n971J7922N066r497q648j4830r997j6049J9454
$$ 32058 10440 -12989 -7807 -9814 -15785 2137 7203 -2294 -10942 -25772 -35769 -51818 -32364
9890c2364J9111J7476j6426O998J1865k2037J2204P122l27j2811J0008L07j831
$$ -32364 -13253 4223 -12203 -5205 6660 -15377 -3173 3949 3622 -9189 819 1126 -705
9877g05m234p297j2996J4349K0973k152j6655l457q168o571J1437K779M7222K9068
$$ -705 -4939 -12236 -25232 -10883 10090 7938 -8717 -12174 -20342 -26913 -15476 -12697 34525 63593
9863F3593j1155m0993j2537k5675K083M4705J45M820O190j1613j5505J252r947
$$ 63593 52438 11445 -1092 -26767 -24684 20021 20166 24986 31176 19563 4058 5310 -4637
9850d637o916J5351q720Q288q143j7674m375K5375J9034k5014j0303J7507J2315
$$ -4637 -11553 3798 -4922 3366 -4777 -22451 -26826 -1451 17583 -7431 -17734 -227 12088
9837A2088K435O695N494J7836P091j4529q116k0334q411j0532l587m101K7001
$$ 12088 14523 21218 26712 44548 51639 37110 28994 8660 249 -10283 -13870 -17971 9030
9824I030J8795k74J2721K983J5586M60l0385K044N915J6510J143j2133j8303r179
$$ 9030 27825 27551 40272 43255 58841 59301 28916 30960 36875 53385 54528 42395 24092 14913
9810A4913L185j1935r443N9R565P431o137p168K8014L4281J7826k7698q627k4135
$$ 14913 18098 6163 -3280 -3221 6344 13775 7638 470 28484 62765 80591 52893 44266 20131
9796B0131q268n615k7411r099j8624J3114M156m339m727L802r637J7948K612j1137
$$ 20131 11863 6248 -21163 -30262 -48886 -35772 -31616 -35955 -40682 -36880 -46517 -28569 -25957 -37094
9782c7094J0159L4306L1559k2593k1339l0065L94K679P033O536q530K0719J594
$$ -37094 -26935 7371 38930 16337 -5002 -35067 -34673 -31994 -24961 -18425 -26955 -6236 -4642
9769d642j5524j4088j3257N735p43J5414j919M444j2812k3794J7497K5292j0934
$$ -4642 -20166 -34254 -47511 -41776 -42519 -27105 -29024 -24580 -37392 -61186 -43689 -18397 -29331
9756b9331k2915K567K253o739J6489K8848J2138k1917j2418O80J4291j302N389
$$ -29331 -52246 -49679 -47426 -54165 -37676 -8828 3310 -18607 -31025 -30345 -16054 -17356 -11967
9743a1967K8474K0033n914j5032l3840J4959m060k1217j4193j02K907J3329M753
$$ -11967 16507 36540 30626 15594 -18246 -3287 -7347 -28564 -42757 -42859 -39952 -26623 -21870
9730b1870m789k0371j3284J223M3155L2786p261M689n202J0828J7554j4993j8565
$$ -21870 -26659 -47030 -60314 -59091 -15936 16850 9589 14278 9076 19904 37458 22465 3900
9717C900Q824l465l4980N230m984r06Q194J8086K0838J733l5150k0917l872K2317
$$ 3900 12724 9259 -25721 -20491 -25475 -26381 -18187 -101 20737 22470 -12680 -33597 -37469 -15152
9703a5152M4588J0792j4554j7990j4379j324O516k930J0403j7556l0190l2112
$$ -15152 29436 40228 25674 7684 -6695 -8019 -1503 -4433 5970 -11586 -41776 -73888
9691g3888J5923M3324j6190j700K407J3473K0978l092J650M011J0749k206Q273
$$ -73888 -57965 -14641 -30831 -32531 -30124 -16651 4327 1235 2885 6896 17645 15439 23712
9678B3712J371Q69l494j0154r796j1171J4441J0080r321k0635j315j5238j8247
$$ 23712 25083 25952 22458 12304 2508 -8663 5778 15858 6537 -14098 -15413 -30651 -48898
9665d8898L0756n659k437Q069o106J8617j0078k0868O014P546r304l182J7886
$$ -48898 -18142 -23801 -26238 -18169 -24275 -5658 -15736 -36604 -30590 -23044 -32348 -35530 -17644
9652a7644j1235J7769p11j3927j587k438J1405L2787J1859P584K2192k4444n0362
$$ -17644 -28879 -11110 -11821 -25748 -27335 -29773 -18368 14419 26278 33862 56054 31610 -18752
9639a8752k2581J1851L4074j1480l8228j7660K3484O002J8097O700R543k3596
$$ -18752 -41333 -29482 4592 -6888 -45116 -62776 -39292 -33290 -15193 -8493 1050 -22546
9627b2546n095J2286R644J6346j575p934n316J8442O413j0311j2984k2984j6795
$$ -22546 -27641 -15355 -5711 10635 9060 1126 -4190 14252 20665 10354 -2630 -25614 -42409
9614d2409J4886J8547k726K5559J6944k1200j8991P897Q493k1879K041k5470j1552
$$ -42409 -27523 -8976 -11702 13857 30801 9601 -9390 -1493 7000 -14879 -12838 -38308 -49860
9601d9860J775K3253L0422J9094j4238o118K397k5055M639J0754j5035r280q557
$$ -49860 -48085 -24832 5590 24684 10446 4328 6725 -18330 -13691 -2937 -17972 -27252 -35809
9588c5809J569J2680j1346J1484K2161P685k387L783l580j6703K5746N527J7288
$$ -35809 -34240 -21560 -32906 -21422 739 8424 6037 9820 6240 -10463 15283 20810 38098
9575C8098L355l7995j9833R954M880j4120O931J1520k956m979k029m075N590K3606
$$ 38098 41453 3458 -16375 -6421 -1541 -15661 -8730 2790 -166 -5145 -7174 -11249 -5659 17947
9561A7947r434k430M241j3303M244n823K936j3400O030n88J7988O870j8907j3916
$$ 17947 8513 6083 10324 -2979 1265 -4558 -1622 -15022 -8992 -9580 8408 15278 -3629 -17545
9547a7545P143K6094j1810j4947M89k247K8808j8293j7387M084K838J2284j7620
$$ -17545 -10402 15692 3882 -11065 -10576 -12823 15985 -2308 -19695 -15611 -12773 -489 -18109
9534a8109K0722R312j885R336P457j8665o145J7273o628l473j2441k0862J7606
$$ -18109 2613 11925 10040 19376 26833 8168 2023 19296 12668 9195 -3246 -24108 -6502
9521f502J0467J6590j3439j9378P849J8982J7677k5742p636J8814J6061J370j8572
$$ -6502 3965 20555 7116 -12262 -4413 14569 32246 6504 -1132 17682 33743 35113 16541
9508A6541j977k9381k8846J9439M6223J6943J8963K082j001n2089k2727J6596
$$ 16541 14564 -14817 -43663 -24224 21999 38942 57905 59987 58986 6897 -15830 766
9496G66J4152J9313K6568J564q177j8331r078j4467j8583L05J5951j0955m934
$$ 766 14918 34231 60799 62363 54186 35855 26777 12310 -6273 -5968 9983 -972 -5906
9483e906j6607J5598L6011J2437j5390k7471J9498M0546j2025k2351j4219M950
$$ -5906 -22513 -6915 29096 41533 26143 -1328 18170 58716 46691 24340 10121 15071
9471A5071K9193K4034l386k1852k4325k489j6447J9942K1312j6445k2271k61n731
$$ 15071 44264 68298 64912 43060 18735 16246 -201 19741 41053 24608 2337 2076 -3655
9458c655J3557J2304J6119J1219L566k1837n183L7092J8082N8k5089k1689j1710
$$ -3655 9902 22206 38325 49544 53110 31273 26090 63182 81264 81322 56233 34544 22834
9445B2834K3936L7220q42p622k1037J1002J7035j6737k1139m984J8646J2763O607
$$ 22834 46770 83990 83148 75526 54489 65491 82526 65789 44650 39666 58312 71075 77682
9432G7682j2401j1986J5778J728j3241l2241J6843O1450J0503j5507k0648l8227
$$ 77682 65281 53295 69073 70801 57560 25319 42162 103612 114115 98608 77960 39733
9420C9733j0525K0263J4563P288j462j7144P328L2620K821K413j1341K494K5143
$$ 39733 29208 49471 64034 71322 69860 52716 60044 92664 95485 97898 86557 89051 114194
9407A14194J899j8643m427o734p251Q218M791J2494J6627j4901M706J7808J0905
$$ 114194 116093 97450 93023 86289 79038 87256 92047 104541 121168 106267 110973 128781 139686
9394A39686l128J0122j1860l3156J2146J0505j4573l030K2421K4558R082J0621
$$ 139686 136558 146680 134820 101664 113810 124315 109742 106712 129133 153691 162773 173394
9382A73394L4428J9389J3153O991N166J6550n151L720J6680J5026K6560J5619
$$ 173394 207822 227211 240364 247355 252521 269071 263920 267640 284320 299346 325906 341525
9370C41525O149J5578L0865J5899K5520Q0392Q9469L9208K5662L0658N0314N2428
$$ 341525 347674 363252 394117 410016 435536 515928 605397 644605 670267 700925 751239 803667
9358H03667M6333N7787N8513N3942Q9415J02945J18751J00862J18813J36594Q1126
$$ 803667 850000 907787 966300 1020242 1109657 1212602 1331353 1432215 1551028 1687622 1768748
9347A768748J09087J02409R7503R1232Q2954N2166J7394J0565J2582l8644p7140
$$ 1768748 1877835 1980244 2077747 2168979 2251933 2304099 2321493 2332058 2344640 2305996 2228856
9336B228856p9825p1701q4312j21969r9584r3285q9364p0438n7571m9518l7268
$$ 2228856 2149031 2077330 1993018 1871049 1771465 1678180 1588816 1518378 1460807 1411289 1374021
9325A374021n9253p9655o6729n4865l1352m2839m0234j0392l5772m2295o3449
$$ 1374021 1314768 1235113 1168384 1113519 1082167 1039328 999094 988702 952930 910635 847186
9314H47186n0371j6830j4421p694l4518l7441k2604l5125j6766k3948j9557j8816
$$ 847186 796815 779985 765564 757870 723352 685911 663307 628182 611416 587468 567911 549095
9302E49095n248m3473m1655J0687n549q758k5110k5506j278J930q01O94n408j4287
$$ 549095 543847 500374 458719 469406 463857 455099 429989 404483 403205 405135 404334 405028 399620 385333
9288C85333l6823p796L038j6187R40k1943j8575J5172J2092j2293R097J2049j4891
$$ 385333 348510 340714 343752 327565 328505 306562 287987 303159 315251 302958 312055 324104 309213
9275C09213k2574M69p662k142j9749k1683l863m655J7895M865J003l128k5756
$$ 309213 286639 287108 279446 277304 257555 235872 232009 227354 245249 250114 251117 247989 222233
9262B22233r208K3555M816p829K983r059Q621k923j7106O052M258j7206M753J4386
$$ 222233 213025 236580 241396 233567 236550 227491 236112 233189 216083 222135 226393 209187 213940 228326
9248B28326k234j2633P292k0836k6106j6112j6016l079J7356m71m5825m8578m286
$$ 228326 226092 213459 220751 199915 173809 157697 141681 138602 155958 155487 109662 61084 56798
9235E6798M4452J4389R139l344K0397K9270r181l5278j2536J3290O115P117l1677
$$ 56798 101250 115639 124778 121434 141831 171101 161920 126642 114106 127396 133511 140628 108951
9222A08951j7120K5416J527k1592k9025J13O12J9397J9398j4449N627Q445K517
$$ 108951 91831 117247 118774 97182 68157 68270 68882 88279 107677 93228 98855 107300 109817
9209A09817K8312j4647j8068p197k5596n208L3919n680l840n53j9425j3764J3699
$$ 109817 138129 123482 105414 98217 72621 67413 101332 95652 91812 91259 71834 58070 71769
9196G1769j303O420J743O120K0874N526j7498J2656j8729R01L768q004j520k983
$$ 71769 70466 76886 78629 84749 105623 111149 93651 106307 87578 88479 92247 84243 82723 79740
9182G9740J4788j8128l9464l3370j5646L0613L3992J3809J1433j1073l3118j7073
$$ 79740 94528 76400 36936 3566 -12080 18533 52525 66334 77767 66694 33576 16503
9170A6503N008J6249L6135M676p577j0598n456j2415n613k1789m248J1514o52
$$ 16503 21511 37760 73895 78571 70994 60396 54940 42525 36912 15123 10875 22389 21737
9157B1737J6273N44l502j2030n336o860j1327K2137j3582m396K7835L1188J7169
$$ 21737 38010 38554 35052 23022 17686 10826 -501 21636 8054 3658 31493 62681 79850
9144G9850p745O168j0451j7976l6139l0949j2620l197j0382Q008J4614k8226N041
$$ 79850 72105 78273 67822 49846 13707 -17242 -29862 -33059 -43441 -35433 -20819 -49045 -44004
9131d4004J0447K0535K6876j8739K3882M52Q148m060L793N080k4257p067K664
$$ -44004 -33557 -13022 13854 -4885 18997 19449 27597 23537 27330 32410 8153 1086 3750
9118C750Q305Q485J964J0814R750J3333J9488j0364k9493J479q126N133j963j0973
$$ 3750 12055 20540 22504 33318 43068 56401 75889 65525 36032 37511 29385 34518 32555 21582
9104B1582m323q528p076J809M892q42n803k901J3026m98o64O965l218j3103R464
$$ 21582 17259 8731 1655 3464 8356 7514 1711 -1190 11836 11338 10674 17639 14421 1318 10782
9089A0782J1403K813k3601J1994J1489J1929o405O599O350q065j1247k1671j7428
$$ 10782 22185 24998 1397 13391 24880 36809 30404 37003 43353 35288 24041 2370 -15058
9076a5058P804J7065J2051K1304K3095m980J457j5271q887K845J0229j3752q693
$$ -15058 -7254 9811 21862 43166 66261 61281 62738 47467 38580 41425 51654 37902 29209
9063B9209o054r193O702k1587k7595j679J3568j4426j617K423J4509M873r19K2681
$$ 29209 23155 13962 20664 -923 -28518 -30197 -16629 -31055 -32672 -30249 -15740 -10867 -11786 10895
9049A0895K0884m450j371j3810j5865j9425Q930M0642j0606j1969j1681k106K3908
$$ 10895 31779 27329 25958 12148 -3717 -23142 -14212 26430 15824 3855 -7826 -9932 13976
9036A3976L2356J4256k1075j0740j0036j5031J1648O941K690K824j2974R234L985
$$ 13976 46332 60588 39513 28773 18737 3706 15354 22295 24985 27809 14835 24069 28054
9023B8054J4432n484n923J2617j2279k7553j0079q792L401L9938j2768j8797J497
$$ 28054 42486 37002 31079 43696 31417 3864 -6215 -15007 -11606 28332 15564 -3233 -1736
9010a736R148N10K842m404k5688P61J9556n48j8834j123R582j7535P950J4712
$$ -1736 7412 7922 10764 6360 -19328 -18567 989 441 -18393 -19516 -9934 -27469 -19519 -4807
8996d807Q713O404K0192l574j5107k56K9441q733l9187J4548K3842m670P973j1392
$$ -4807 3906 10310 30502 26928 11821 11565 41006 32273 -6914 7634 31476 26806 34779 23387
8982B3387K390j9798j1794L769J26p271o7q030P2j0561L5777J0373m984j1069
$$ 23387 25777 5979 -5815 -2046 -1920 -9191 -9258 -17288 -17216 -27777 8000 18373 13389 2320
8968B320L044J0890L344j029N772M425P41j4336p517K972R155j3603K786j2009
$$ 2320 5364 16254 19598 18569 24341 28766 29507 15171 7654 10626 19781 6178 8964 -3045
8954c045k0504L15K1200K4451j2093j6578R583K7052j3357k7103j7068J7687Q178
$$ -3045 -23549 -23234 -2034 22417 10324 -6254 3329 30381 17024 -10079 -27147 -9460 -1282
8941a282J4558N149J8579J5547j9769l6083R763M760l8280L521J005J6071p140
$$ -1282 13276 18425 37004 52551 32782 -3301 6462 11222 -27058 -23537 -22532 -6461 -13601
8928a3601k468J153p421P536M657n28J9025n890o688j0819K272J5551n835l7478
$$ -13601 -16069 -14916 -22337 -14801 -10144 -10672 8353 2463 -4225 -15044 -12772 2779 -3056 -40534
8914d0534K599K2241L0065L729L274j1868j8845j810J3367K8927L946k0975k1901
$$ -40534 -37935 -15694 14371 18100 21374 9506 -9339 -11149 2218 31145 35091 14116 -7785
8901g785J3903K874j2182j5857J1191K2898p38j2499J9336J2379j751m883J8849
$$ -7785 6118 8992 -3190 -19047 -7856 15042 14304 1805 21141 33520 31769 26886 45735
8888D5735M585j0033p601J790m147Q077J1458k053k7199J0321J118J4194K6162
$$ 45735 50320 40287 32686 34476 30329 38406 49864 47811 20612 30933 32051 46245 72407
8875G2407o930n705J59k3705J8567J59k8546M220N1302L3539K3143L7945L1596
$$ 72407 65477 59772 59931 36226 54793 54952 26406 30626 81928 115467 138610 176555 208151
8862B08151N3398J1511n4291o7489l9283l6278k6072p832k1837J8766K4728K3939
$$ 208151 261549 273060 218769 151280 111997 75719 49647 41815 19978 38744 63472 87411
8850H7411j4439O272k742k7686J3585P480J1325J6394j6334l4934n101J232J7954
$$ 87411 72972 79244 76502 48816 62401 69881 81206 97600 81266 46332 41231 42463 60417
8837F0417j0220k3809k484j0417K053M679r071k2924J5674K4361j284m792K9361
$$ 60417 50197 26388 23904 13487 15540 20219 11148 -11776 3898 28259 26975 22183 51544
8824E1544J3649j4680j9016m8952j3895J0956p774q233K2094J3285K3823n101
$$ 51544 65193 50513 31497 -17455 -31350 -20394 -28168 -36401 -14307 -1022 22801 17700
8812A7700M954M571k467k0076q103J6837J1279K4025o184n0567j6830J3012L5593
$$ 17700 22654 27225 24758 4682 -3421 13416 24695 48720 42536 -8031 -24861 -11849 23744
8799B3744O915l880k0393j3170M124r893L576J0393j7878O581K3315r392R693
$$ 23744 30659 26779 6386 -6784 -2660 -12553 -8977 1416 -16462 -9881 13434 4042 13735
8786A3735K0631M297k1174j3391p54k5954J4073J4389J4317M001n821k0618R288
$$ 13735 34366 38663 17489 4098 3344 -22610 -8537 5852 20169 24170 18349 -2269 7019
8773G019J2872J4493q359N880K1474M487j4205p687J315r509J4250K062O696Q88
$$ 7019 19891 34384 26025 31905 53379 57866 43661 35974 37289 27780 42030 44092 50788 51676
8759E1676j1410j4350O464O549p220K058K3035K183l865N52J5438k0502J6074
$$ 51676 40266 25916 32380 38929 31709 33767 56802 58985 55120 55672 71110 50608 66682
8746F6682q536j8381q006o137j2784l67J5288N2j875k2327k2762j3585K3461K8516
$$ 66682 58146 39765 31759 25622 12838 12471 27759 27811 25936 3609 -19153 -32738 -9277 19239
8732A9239J1112J4734M404j9139K9881L5951j4376l2598j4987j5187Q924L1940
$$ 19239 30351 45085 49489 30350 60231 96182 81806 49208 34221 19034 27958 59898
8720E9898p498j0140O449J2684J1106N442j6474j7016Q131q652j2091J4406J6841
$$ 59898 52400 42260 48709 61393 72499 77941 61467 44451 52582 43930 31839 46245 63086
8707F3086o866k5134q445K315J344K7976J3298n559j5791j4016Q535J5820L311
$$ 63086 56220 31086 22641 24956 26300 54276 67574 62015 46224 32208 40743 56563 59874
8694E9874J507N855J1409M739j0077j6976k9609j4485M0782K1583k959j3627J4703
$$ 59874 61381 67236 78645 83384 73307 56331 26722 12237 53019 74602 71643 58016 72719
8681G2719J3190j422j6385o240j6963j8296K2522J5219O513j5979j6747M421n589
$$ 72719 85909 84487 68102 61862 44899 26603 49125 64344 70857 54878 38131 42552 36963
8668C6963j9389j450J0416J0155M630j1571o029K9510L0293K2681j7383k2300
$$ 36963 17574 16124 26540 36695 41325 29754 23725 53235 83528 106209 88826 66526
8656F6526m550j3184J074k8278j5608J2953R783O805n36J9458K1877K5613j8163
$$ 66526 61976 48792 49866 21588 5980 18933 28716 35521 34985 54443 76320 101933 83770
8643H3770j6677N087R279j8877j7846J0600j9579O357L9603j00J463L0838J0632
$$ 83770 67093 72180 81459 62582 44736 55336 35757 42114 81717 81617 83080 113918 124550
8630A24550j3035j5173j3373L605K315J2533j5985j4870P308O728J8193J7892
$$ 124550 111515 96342 82969 86574 88889 101422 85437 70567 77875 84603 102796 120688
8618A20688p45L4p442k7074j6645j0692J7369J3815p046K203K426P659L2611n217
$$ 120688 119943 119977 112535 85461 68816 58124 75493 89308 82262 84465 86891 94550 127161 121944
8604A21944K199K5104P126r380Q688p975K4431L8611L0091J2947P16K1095K8996
$$ 121944 124143 149247 156373 146993 155681 147706 172137 210748 240839 253786 254502 275597 304593
8591C04593Q032p842K1562M4385L8118M8969O8655P0380L5606K8680M1808J9916
$$ 304593 312625 304783 326345 370730 408848 457817 526472 596852 632458 661138 702946 722862
8579G22862J2583k6176l7796k7727o0786q8709o1642j4237o279m0045l7520k9029
$$ 722862 735445 709269 671473 643746 582960 494251 432609 418372 412093 372048 334528 305499
8567C05499p797j5047k3777l6325j1876K1282J5500l0931l4677K9124K7585J7175
$$ 305499 297702 282655 258878 222553 210677 231959 247459 216528 181851 210975 238560 255735
8555B55735j4159j3874j6939r087N564j6269k2964m306q153O267j6503j9718P081
$$ 255735 241576 227702 210763 201676 207240 190971 168007 163701 155548 161815 145312 125594 132675
8542A32675K0958J1699O163K619q881o984p413K706N934l6655j9464p524n641
$$ 132675 153633 165332 171495 174114 165233 158249 150836 153542 159476 122821 103357 95833 90192
8529I0192J8123j2366o136j1969K0667L540J0780k6184l448j2980k640K0418N000
$$ 90192 108315 95949 89813 77844 98511 102051 112831 86647 83199 70219 67579 87997 92997
8516I2997k8548p645j954O581O57J3463Q104O240j6171k2780O656k945P169N920
$$ 92997 64449 56804 54850 61431 62088 75551 83655 89895 73724 50944 57600 54655 61824 67744
8502F7744k7132j5011J292J2255J3564N731R68K887r68j56L901p516N796M2759
$$ 67744 40612 25601 26893 39148 52712 58443 59411 62298 61330 61174 65075 57559 63355 106114
8488A06114j358j7209k0083J1897J3673j0811j0173k5913m825j7829M104K2050
$$ 106114 104756 87547 67464 79361 93034 82223 72050 46137 41312 23483 27587 49637
8476D9637J124k3374o35P64o855L873J4692K940n151m011R419M517J2436Q828
$$ 49637 50761 27387 26752 27516 20661 24534 39226 42166 37015 33004 42423 46940 59376 68204
8462F8204P3O15n893j5468j5354J3154q610L1344j0853j5321J1693k1289k9753
$$ 68204 68277 68892 62999 47531 32177 45331 36721 68065 57212 41891 53584 32295 2542
8449B542l856R193L0486J0778p050M532l348J2442r641k648j2706O364J535K417
$$ 2542 -1314 7879 38365 49143 42093 46625 43277 55719 46078 43430 30724 37088 38623 41040
8435D1040Q812j806J514l70k1761k7291K4665J4637O564o793j6375k413J1635
$$ 41040 49852 48046 49560 49190 27429 138 24803 39440 46004 39211 22836 20423 32058
8422C2058k684p69p431J9373L36j670j5219J2453j2200J437R122k1683J7295r402
$$ 32058 29374 28605 21174 40547 40883 39213 23994 36447 24247 25684 34806 13123 30418 21016
8408B1016j900j1916k1987P143L2113J241k8721m710J9026K2597J5653j1991J5642
$$ 21016 19116 7200 -14787 -7644 24469 25710 -3011 -7721 11305 33902 49555 37564 53206
8395E3206L2101j3374m1971N549m178P083J0021m204q931j5118o174J0361J687
$$ 53206 85307 71933 29962 35511 31333 38416 48437 44233 35302 20184 14010 24371 26058
8382B6058k3863J7768J7336m5649K743R072j0219j268L2314J5030l0681Q582R126
$$ 26058 2195 19963 37299 -8350 -5607 3465 -6754 -8022 24292 39322 8641 17223 26349
8369B6349j7684k2918J6688N151l572J7746p005J3307k546j3989K1197q289K117
$$ 26349 8665 -14253 2435 7586 4014 21760 14755 28062 25516 11527 32724 24435 26552
8356B6552j5253j6716J9854N757J588K391l082J357R376l899R547K784p674k8125
$$ 26552 11299 -5417 14437 20194 21782 24173 21091 22448 31824 27925 37472 40256 32582 4457
8342D457k4735P488L0345r226m094J5949o502j0907N879K5815M958j1133o953
$$ 4457 -20278 -12790 17555 8329 4235 20184 13682 2775 8654 34469 39427 28294 21341
8329B1341j2433j6145P195K877J1554o894j7139j8763K7585M1936p553q311q67
$$ 21341 8908 -7237 -42 2835 14389 7495 -9644 -28407 -822 41114 33561 25250 24383
8316B4383J840O402j325R059k6277j5004L115J044O769j0482J440j4018J8831
$$ 24383 26223 32625 31300 40359 14082 -922 2193 3237 10006 -476 964 -13054 5777
8303E777k325j5110j3466K6423j5488J8716J4873m955k3766j6511J748L3174J5502
$$ 5777 3452 -11658 -25124 1299 -14189 4527 19400 14445 -9321 -25832 -24084 9090 24592
8290B4592k3380J6584K8268R12l7574j7259j790Q421j3314J3238M3135r996k7002
$$ 24592 1212 17796 46064 46976 9402 -7857 -9647 -1226 -14540 -1302 41833 31837 4835
8277D835J1337K8263j048l826n621j2677k3084j0071l085p172J8150K4790N127
$$ 4835 16172 44435 43387 39561 33940 21263 -1821 -11892 -14977 -22149 -3999 20791 25918
8264B5918J3106L628j0968j4265p551p110L3208J4204l1807p223k8396n697J0003
$$ 25918 39024 42652 31684 17419 9868 2758 35966 50170 18363 11140 -17256 -22953 -12950
8251a2950L668l353J5601L0456N207k7073J8648J9398l9585j8979j4094M290K9633
$$ -12950 -9282 -12635 2966 33422 38629 11556 30204 49602 10017 -8962 -23056 -18766 10867
8238A0867J0394j3087j9124K845K6520j1418l3152p831K6324K6835R56o911q266
$$ 10867 21261 8174 -10950 -8105 18415 6997 -26155 -33986 -7662 19173 20129 13218 4952
8225D952j0325L870l0341j7163J1161J3896L1083R880j4717q145K434J1040J2189
$$ 4952 -5373 -1503 -31844 -49007 -37846 -23950 7133 17013 2296 -5849 -3415 7625 19814
8212A9814k4747o573J5952P074O161P106l094n131j2546k0306k8217q939L0045
$$ 19814 -4933 -11506 4446 11520 17681 24787 21693 16562 4016 -16290 -44507 -53446 -23401
8199b3401J7847N151j079j037K211J93l347k2111k2960k583J2325J7874K2803
$$ -23401 -5554 -403 -1482 -2519 -308 -115 -3462 -25573 -48533 -51116 -38791 -20917 1886
8186A886j1002Q732K7356J8624p906j6429J1766l036J0299L800j0338j8169r579
$$ 1886 -9116 -384 26972 45596 37690 21261 33027 29991 40290 44090 33752 15583 6004
8173F004m290j0127J888R57L1266K6101L114l2644j7008J0328K2589m733l0897
$$ 6004 1714 -8413 -6525 -5568 25698 51799 54913 22269 5261 15589 38178 33445 2548
8160B548j2224L1194N789j7922r719n987M029J5899L5267N402n3327k2663R988
$$ 2548 -9676 21518 27307 9385 -334 -6321 -2292 13607 48874 54276 949 -21714 -11726
8147a1726L057n195k804P365j5474J6307J2936J19j2279P238L9624N131M824l396
$$ -11726 -8669 -13864 -16668 -9303 -24777 -8470 4466 4585 -7694 -456 39168 44299 49123 45727
8133D5727m2839j9946L2209L632j4063J4626R851j3617k0715O635K1341K6718
$$ 45727 2888 -17058 15151 18783 4720 19346 29197 15580 -5135 1500 22841 49559
8121D9559k6003O495K9553q942k383O321O332l3026l370J2807j84Q486R92j5215
$$ 49559 23556 30051 59604 50662 48279 54600 60932 27906 24536 37343 37159 45645 46637 31422
8107C1422p084K2192q016j3823o539k5559N008K2312j3696j3836q622J0939J7000
$$ 31422 24338 46530 38514 24691 18152 -7407 -2399 19913 6217 -7619 -16241 -5302 11698
8094A1698J3526j1373j9037K708o283O712N418O732j34p237K5808l058O455p381
$$ 11698 25224 13851 -5186 -2478 -8761 -2049 3369 10101 9967 2730 28538 25480 31935 24554
8080B4554j2061N522O231k1935r776K4036n797j274L044J5484q072j6810k6884
$$ 24554 12493 18015 24246 2311 -7465 16571 10774 9500 12544 28028 19956 3146 -23738
8067b3738O723J9291J6193M962J6271k3360j5077J9037J9923K7843j8708k7642
$$ -23738 -17015 2276 18469 23431 39702 16342 1265 20302 40225 68068 49360 21718
8055B1718k9934P678M6818L3184P388Q746j9485j2049M773o850l757k1707M013
$$ 21718 -8216 -538 46280 79464 86852 95598 76113 64064 68837 61987 58230 36523 40536
8042D0536J0212J5499j4231J6236P362k2007K340K3554J03k0913j2097o068m319
$$ 40536 50748 66247 52016 68252 75614 53607 55947 79501 79604 58691 46594 40526 36207
8029C6207J9714l245j3400o408J2294J919l25K6163R75P697O321j4048k9370j5864
$$ 36207 55921 52676 39276 32868 45162 47081 46756 72919 73894 81591 87912 73864 44494 28630
8015B8630J8902K6133J5818J5452N517k7864k380j314q686k4908j1103N480J4242
$$ 28630 47532 73665 89483 104935 110452 82588 80208 78894 70208 45300 34197 39677 53919
8002E3919O328n791R869J0668k872l793J5858J1166l0456J3313L0840K47j4567
$$ 53919 60247 54456 64325 74993 72121 68328 84186 95352 64896 78209 109049 109296 94729
7989I4729J4207L1664J322o418n089r620r22L0338N603j6252k1711j9191j1837
$$ 94729 108936 140600 141922 135504 130415 120795 119873 150211 155814 139562 117851 98660 86823
7976H6823k80j9515k7511j3422Q096J4655l745K0241K8408K1373L518o23l0055
$$ 86823 86543 67028 39517 26095 34191 48846 45101 65342 93750 115123 118641 118018 87963
7963H7963o935J5356j1316J2679r755J9130K1348j2047k5413j7424K2806L6164
$$ 87963 81028 96384 85068 97747 87992 107122 128470 116423 91010 73586 96392 132556
7951A32556m989j9076r509j0755M10N547L2300L5902J7550m363j0790k0653j6841
$$ 132556 127567 108491 98982 88227 88637 94184 126484 162386 179936 175573 164783 144130 127289
7938A27289j2109J3259j8214j187j0539N157r464k8205j1982K0660K8932L2187
$$ 127289 115180 128439 110225 109038 98499 103656 94192 65987 54005 74665 103597 135784
7926A35784k4361Q46M309p38j6378j7538J3708p129l030J0630J6490j1854q404
$$ 135784 111423 112269 116578 115840 99462 81924 95632 88503 85473 96103 112593 100739 92335
7913I2335k713r111K1904O04j9136P450K4423O462q492k9698J5097J6200Q665
$$ 92335 89622 80511 102415 103019 83883 91333 115756 122218 113726 84028 99125 115325 123990
7900A23990J6725j7933j9220l5251j5330j8906K1558J9591R367R783K7552n849
$$ 123990 140715 122782 103562 68311 52981 34075 55633 75224 84591 94374 121926 116077
7888A16077k7354o302j5259Q0J2874o176M351n957k4618K2587j0195p668j1280
$$ 116077 88723 82421 67162 67242 80116 73940 78291 72334 47716 70303 60108 52440 41160
7875D1160j3909j660K57r170j0871k686K6354M566J2507k1232n242j6263J524
$$ 41160 27251 25591 25848 16678 5807 3121 29475 34041 46548 25316 20074 3811 5335
7862E335P947k5179m925J8233J6587j34o112K58l714o552P243J0464j1751J8980
$$ 5335 13282 -11897 -16822 1411 17998 17864 11752 12010 8296 1744 8987 19451 7700 26680
7848B6680l685l591K1045j8790j4245J1482j815j0956j0312J435M9663R026j5081
$$ 26680 22995 19404 40449 21659 7414 18896 17081 6125 -4187 -2752 46911 55937 40856
7835D0856j2897k0569K0363K131k277R85k5854n296O693J2704N628L787j0161
$$ 40856 27959 7390 27753 29884 27607 28592 2738 -2558 4135 16839 22467 26254 16093
7822A6093n539%l975M883L2572J5247l6365k2926k7486Q533O44j1742J0483J6593
$$ 16093 10554 10554 6579 11462 44034 59281 22916 -10 -27496 -18963 -18319 -30061 -19578 -2985
7808b985K8052K4263l705j3885J230j7009r886N349k731q52k187N74R820K503
$$ -2985 25067 49330 45625 31740 32970 15961 6075 11424 8693 7841 5654 6228 16048 18551
7794A8551j2444N698j4047n873Q041k920l906j2397j3306J6560k470J5449P383
$$ 18551 6107 11805 -2242 -8115 -74 -2994 -6900 -19297 -32603 -16043 -18513 -3064 4319
7781D319q339J2760J4684m503j4509j4750o363l785l576r024J166J6613J0806
$$ 4319 -4020 8740 23424 18921 4412 -10338 -16701 -20486 -24062 -33086 -31920 -15307 -4501
7768d501o019J786K1115O186n501Q704J8045j1645k552L3139J2042R304p710j9100
$$ -4501 -10520 -8734 12381 18567 13066 21770 39815 28170 25618 58757 70799 80103 72393 53293
7754E3293k5800l0160n298Q167J9979K1568o69k5889k317l111L693M094P864K1407
$$ 53293 27493 -2667 -7965 202 20181 41749 41080 15191 12874 9763 13456 17550 25414 46821
7740D6821K2157l1645k0596k6180N597J2177N944R692J235J9072k4659j0708l661
$$ 46821 68978 37333 16737 -9443 -3846 8331 14275 23967 25202 44274 19615 8907 5246
7727E246j4058j4496o072J9753J8130J7172M262j1155j2442J3127o714j6197J4069
$$ 5246 -8812 -23308 -29380 -9627 8503 25675 29937 18782 6340 19467 12753 -3444 10625
7714A0625P847j1125j0440k3079M669j103J0379K3888K131M077k1538l933M916
$$ 10625 18472 7347 -3093 -26172 -21503 -22606 -12227 11661 13792 17869 -3669 -7602 -2686
7701b686m592K6416Q292l1375Q38M087k656j3435j4082L735j0504m531P471L3884
$$ -2686 -7278 19138 27430 -3945 -3107 980 -1676 -15111 -29193 -25458 -35962 -40493 -33022 862
7687H62K0838l0887j9029Q511j0688p083L4138J6064R445k3144k8304j8453M423
$$ 862 21700 -9187 -28216 -19705 -30393 -37476 -3338 12726 22171 -973 -29277 -47730 -43307
7674d3307J2445J2894k487L1786o648n2148j2943K0918L4442q593O014R699k2312
$$ -43307 -30862 -17968 -20455 11331 4683 -47465 -60408 -39490 -5048 -13641 -7627 2072 -20240
7661b0240k7171j5894L1229N707m516R705K2354K3687P030j6776k967k3831k332
$$ -20240 -47411 -63305 -32076 -26369 -30885 -21180 1174 24861 31891 15115 12148 -11683 -14015
7648a4015Q099O089j2809J5532K469J255K0971J4372j1513M044k303m488j3533
$$ -14015 -5916 173 -12636 2896 5365 6620 27591 41963 30450 34494 32191 27703 14170
7635A4170l0467J5209K9305o852j7119L396j606k2498K4043J9212J0445q996j4196
$$ 14170 -16297 -1088 28217 21365 4246 7642 6036 -16462 7581 26793 37238 28242 14046
7622A4046L544L542j51j758k2451l148j4736l481J692K6826o864j0094J6798K4757
$$ 14046 17590 21132 20981 19223 -3228 -6376 -21112 -24593 -22901 3925 -2939 -13033 3765 28522
7608B8522K0786q584m5010j10J7002k989M17K5167k2164k0982J268J665j8589
$$ 28522 49308 40724 -4286 -4396 12606 9617 10034 35201 13037 -7945 -6677 -5012 -23601
7595b3601r269K5149J6776N142k220K018j6416k903J6669k9735j5526J0302J6437
$$ -23601 -32870 -7721 9055 14197 11977 13995 -2421 -5324 11345 -18390 -33916 -23614 -7177
7582g177O642N715J6296j6862j7348j4919R40J5144j4612K810L2599K990L00j1539
$$ -7177 -535 5180 21476 4614 -12734 -27653 -26713 -11569 -26181 -23371 9228 12218 12518 979
7568I79Q709N989P278l361O64N790J0129P12k0932o996L268m0581r815n022J9106
$$ 979 9688 15677 22955 19594 20258 26048 36177 36889 15957 8961 12229 -28352 -38167 -43189 -24083
7553b4083K4671o622O774K5208J0205P708j2997j1635j4312R956j8126M647n284
$$ -24083 588 -6034 740 25948 36153 43861 30864 19229 4917 14873 -3253 1394 -3890
7540c890l187M884r681L336J476o42M968J6078j0339k0839l47M288N433J6034
$$ -3890 -7077 -2193 -11874 -8538 -7062 -7704 -2736 13342 3003 -17836 -18183 -13895 -8462 7572
7526G572n127j36L796l8123M038K3412j0106M413n331p641R8J9459N588Q242J0007
$$ 7572 2445 2309 6105 -32018 -27980 -4568 -14674 -10261 -15592 -23233 -23135 -3676 1912 10154 20161
7511B0161J4332r26l9521j9876J1285K1368K1387j0726m16j1970J8066N094j8255
$$ 20161 34493 33567 -5954 -25830 -14545 6823 28210 17484 17068 5098 23164 28258 10003
7498A0003k2015M853k2R628J5043l064l533l906k3282r673K2114J2078P209L922
$$ 10003 -12012 -7159 -7181 2447 17490 14426 10893 6987 -16295 -25968 -3854 8224 15433 19355
7484A9355J9258o052j6998j1912j8305n466L0701K4769j5330j7905P327J0644
$$ 19355 38613 32561 15563 3651 -14654 -20120 10581 35350 20020 2115 9442 20086
7472B0086J8551o364l5968j111k243N556J6289n31j7672P635n072k9119k2389
$$ 20086 38637 32273 -3695 -4806 -7049 -1493 14796 14265 -3407 4228 -844 -29963 -52352
7459e2352J3994J4028L2498k6325o364n894M18p891j8331M1415P946p442K1302
$$ -52352 -38358 -24330 8168 -18157 -24521 -30415 -29997 -37888 -56219 -14804 -6858 -14300 7002
7446G002Q972j9740O702K6600K96k7174m9510k089P087K9225N839K696o105p439
$$ 7002 15974 -3766 2936 29536 29832 2658 -46852 -48941 -41854 -12629 -6790 -4094 -10199 -17638
7432a7638r969q221p2K396p052J1312k459K5419Q842J2909M97K2421j1357l6246
$$ -17638 -27607 -35828 -35900 -33504 -40556 -29244 -31703 -6284 2558 15467 15964 38385 27028 -9218
7418i218n803M095Q54R409J3350L321l087P839J338m459j2815r98k2201J226K3798
$$ -9218 -15021 -10926 -10072 -663 12687 16008 12921 20760 22098 17639 4824 3826 -18375 -17149 6649
7403F649l55J6507k1198O744k239q441J6476l0785j0527K0532m24L574j6692k5103
$$ 6649 6294 22801 1603 8347 6108 -2333 14143 -16642 -27169 -6637 -7061 -3487 -20179 -45282
7389d5282P41J1796K6279L1779j0055o456N964j182j5970r194Q629K2393J2663
$$ -45282 -44541 -32745 -6466 25313 15258 8802 14766 13584 -2386 -11580 -2951 19442 32105
7376C2105k9561n064L373K4703k579o648k2634q255K0482k792p338l7941R668
$$ 32105 2544 -2520 853 25556 22977 16329 -6305 -14560 5922 3130 -4208 -42149 -32481
7363c2481L8283Q624k5915j6218L2588m923k7685K689L6842J0135J908j488k1570
$$ -32481 5802 14426 -11489 -27707 4881 -42 -27727 -25038 11804 21939 23847 22359 789
7350G89Q50j868J176k3330k7103O938L1193R00L705L0674J3254j8258j4487j8443
$$ 789 1639 -229 947 -22383 -49486 -42548 -11355 -10455 -6750 23924 37178 18920 4433 -14010
7336a4010R798l859L0660K0322m1127j453J6636o843l0893L476K7154K614L911
$$ -14010 -4212 -8071 22589 42911 1784 331 16967 10124 -20769 -17293 9861 12475 16386
7323A6386l3436k8293R504K3947M967r374K234R224k244o828J907J1956j2311
$$ 16386 -17050 -45343 -35839 -11892 -6925 -16299 -14065 -4841 -7085 -13913 -12006 -50 -12361
7310a2361j2486J1705l780L037K08q341r065R168J9655J3109K9822j0226j935
$$ -12361 -24847 -13142 -16922 -13885 -13677 -22018 -31083 -21915 -2260 10849 40671 30445 28510
7297B8510r07J1036k4654j1325m48m878J1903M088j1477k4786J4245L8773k1104
$$ 28510 27603 38639 13985 2660 2212 -2666 9237 13325 1848 -22938 -8693 30080 8976
7284H976p173J3010L485k3364k8868l321K7599R834J3239k0080j1044N245k445
$$ 8976 1803 14813 18298 -5066 -33934 -37255 -9656 178 13417 -6663 -17707 -12462 -14907
7271a4907k3639J4948K6709j1561K773k6578m4316q348J4285L0546L6477J4395
$$ -14907 -38546 -23598 3111 -8450 -5677 -32255 -76571 -84919 -70634 -40088 -3611 10784
7259A0784J0312j3668n546j7749P374J0256L523L44J1229n813J0523R106j4574
$$ 10784 21096 7428 1882 -15867 -8493 1763 5286 5630 16859 11046 21569 30675 16101
7246A6101P48l4374j7569m135j6636J0796L6950K1993K9695N567k7269k5521K1908
$$ 16101 16849 -17525 -35094 -39229 -55865 -45069 -8119 13874 43569 49136 21867 -3654 18254
7233A8254Q078j8330k0701j537j1286j522J6769J3433L174j0117j8121j0407J1630
$$ 18254 26332 8002 -12699 -14236 -25522 -27044 -10275 3158 6332 -3785 -21906 -32313 -20683
7220b0683k1273J5841J0373p878n299J4142M70j7334o309J1387Q77o317J2985
$$ -20683 -41956 -26115 -15742 -23620 -28919 -14777 -14307 -31641 -37950 -26563 -25686 -32003 -19018
7207a9018K3715N6k6920K5262N594j1723L192J5622j7605J4010o314j0826J8032
$$ -19018 4697 4753 -22167 3095 8689 -3034 158 15780 -1825 12185 5871 -4955 13077
7194A3077K138j4623j821J376k081m655Q844P349N004r035J3122O808n97J1003
$$ 13077 15215 592 -1229 147 -1934 -6589 2255 9604 14608 5573 18695 25503 24906 35909
7180C5909K876k4688l1510l8084Q023L2518q536j137p033L298m077J306J7692
$$ 35909 38785 14097 -17413 -55497 -47474 -14956 -23492 -24629 -31662 -28364 -32441 -31135 -13443
7167a3443K69k2589n656j6660l712M8665K2637m168R652q996j1577j1009j1544
$$ -13443 -13174 -35763 -41419 -58079 -61791 -13126 9511 5343 14995 5999 -5578 -16587 -28131
7154b8131J2447J9944P672r492k2129j163K423L2324J3589K709l532j4792l0313
$$ -28131 -15684 4260 11932 2440 -19689 -20852 -18429 13895 27484 30193 26661 11869 -18444
7141a8444k3080K43j038l729J8632K3225j5945J5042K5391r050M098k0530k4219
$$ -18444 -41524 -41281 -42319 -46048 -27416 -4191 -20136 -5094 20297 11247 15345 -5185 -29404
7128b9404J966k557Q297j6523o961J1568O26k005m069p040o860O993O738J634
$$ -29404 -27438 -29995 -21698 -38221 -45182 -33614 -32988 -34993 -39062 -46102 -52962 -45969 -39231 -37597
7114c7597K299J8395L6181K5911L174j6864l3046j3379J413J1015l363k4296j372
$$ -37597 -35298 -16903 19278 45189 48363 31499 -1547 -14926 -13513 -2498 -5861 -30157 -31529
7101c1529j889K6786J8772q067j2410m787K865j8019p388J097M017J1763p48K928
$$ -31529 -33418 -6632 12140 4073 -8337 -13124 -10259 -28278 -35666 -34569 -30552 -18789 -19537 -16609
7087a6609j0186j575P55J2162r437j523J1781L2922m739P910n500r713k5213P070
$$ -16609 -26795 -28370 -27615 -15453 -24890 -26413 -14632 18290 13551 21461 15961 6248 -18965 -11895
7073a1895l03L686J7926R789P613j0254J3698j5397l308r16k1152j2081m66J1745
$$ -11895 -12198 -8512 9414 19203 26816 16562 30260 14863 11555 10639 -10513 -22594 -23060 -11315
7059a1315K345J5253R13l4161j5985P56q402J7050k032J2713J1203L123m983o517
$$ -11315 -8970 6283 7196 -26965 -42950 -42194 -50596 -33546 -35578 -22865 -11662 -8539 -13522 -20039
7045b0039m593j4915K4539J8066J4183p779j5298j8392n707j5639j8189J2976
$$ -20039 -24632 -39547 -15008 3058 17241 9462 -5836 -24228 -29935 -45574 -63763 -50787
7033e0787L4535J8159M905l964R719R912J7599p417j6087r434k2136m054K388
$$ -50787 -16252 1907 6812 2848 12567 22479 40078 32661 16574 7140 -14996 -19050 -16662
7020a6662m045K3576J9558J1013k2614j4936n145k7553L177K7157j577J460K546
$$ -16662 -20707 2869 22427 33440 10826 -4110 -9255 -36808 -33631 -6474 -8051 -6591 -4045
7007d045q74J0708J2744j923j3630j9090R420l737j9220M399J5157J8105j7894
$$ -4045 -4919 5789 18533 16610 2980 -16110 -6690 -10427 -29647 -25248 -10091 8014 -9880
6994i880l4324j9352M3310L169K413Q472J2083j3337j5233J6230J0210R030j0589
$$ -9880 -44204 -63556 -20246 -17077 -14664 -6192 5891 -7446 -22679 -6449 3761 12791 2202
6981B202j6458J3709L5844k8356k1381l534Q054k825o66K4707J8315j7678k2446
$$ 2202 -14256 -547 35297 6941 -14440 -17974 -9920 -12745 -13411 11296 29611 11933 -10513
6968a0513k1790k2670j1208J4973J5082J5756j7770k388M918k527Q849o358Q671
$$ -10513 -32303 -54973 -66181 -51208 -36126 -20370 -38140 -40528 -35610 -38137 -29288 -35646 -26975
6955b6975K4908L902o145p071l852j6619L2231J0231J028j3662j5420k3393n602
$$ -26975 -2067 1835 -4310 -11381 -15233 -31852 379 10610 11638 -2024 -17444 -40837 -46439
6942d6439j7011p234L0258J1012j8385j1563J7428J3532o494l591J3787k329L005
$$ -46439 -63450 -70684 -40426 -29414 -47799 -59362 -41934 -28402 -34896 -38487 -24700 -27029 -24024
6929b4024K866j3469K0943J2887l459n635Q27L072R546J6684J7127q301k3960
$$ -24024 -21158 -34627 -13684 -797 -4256 -9891 -9064 -5992 3554 20238 37365 29064 5104
6916E104r546K3620L6715l3212j1408J8045r063k4280q204N868k6014k6394K6617
$$ 5104 -4442 19178 55893 22681 11273 29318 20255 -4025 -12229 -6361 -32375 -58769 -32152
6903c2152J8931K8198K7574m111j7738j0086n410j4354q732J2003N352p001J8855
$$ -32152 -13221 14977 42551 38440 20702 10616 5206 -9148 -17880 -5877 -525 -7526 11329
6890A1329K2587J652K2273j0609m763J363j8641O36M080j6905j5432L293J0877
$$ 11329 33916 35568 57841 47232 42469 43832 25191 25827 29907 13002 -2430 863 11740
6877A1740o612j0755r953P233j531k1362k0722K0944Q473j4068j1105j586P885
$$ 11740 5128 -5627 -15580 -8347 -9878 -31240 -51962 -31018 -22545 -36613 -47718 -49304 -41419
6864d1419J8699J7232J6513M921l5705j6195l467n171q911j1837j432R017J0777
$$ -41419 -22720 -5488 11025 15946 -19759 -35954 -39421 -44592 -53503 -65340 -66772 -57755 -46978
6851d6978j9702p62J3235L9150L614r913O678J1314K5472j4960j5015m728j9161
$$ -46978 -66680 -67442 -54207 -15057 -11443 -21356 -14678 -3364 22108 7148 -7867 -12595 -31756
6838c1756j0869Q071l404L3111J2267J0772N622k7762k5499J6293R684K9692j1039
$$ -31756 -42625 -34554 -37958 -4847 7420 18192 23814 -3948 -29447 -13154 -3470 26222 15183
6825A5183n271O541q483k7602j4364J0032j0084l319J1762L6598K3086J1656M704
$$ 15183 9912 16453 7970 -19632 -33996 -23964 -34048 -37367 -25605 10993 34079 45735 50439
6812E0439m04K599k0843k1054j1913j0024p870K2935J0864o917j8780J739l755
$$ 50439 50035 52634 31791 10737 -1176 -11200 -19070 3865 14729 7812 -10968 -9229 -12984
6799a2984N279j5666l5065P454K4947J0163N838l768j7466J4464J0512j7606k0098
$$ -12984 -7705 -23371 -58436 -50982 -26035 -15872 -10034 -13802 -31268 -16804 -6292 -23898 -43996
6786d3996l262Q931J8680J2853k2478o407j1701J7665J3872l794J2028n771j0529
$$ -43996 -47258 -38327 -19647 -6794 -29272 -35679 -47380 -29715 -15843 -19637 -7609 -13380 -23909
6773b3909R29J766p910R680j5900j3408Q771K5738n376j1171r642P183J0881R248
$$ -23909 -22980 -21214 -29124 -19444 -35344 -48752 -39981 -14243 -19619 -30790 -40432 -33249 -22368 -13120
6759a3120J1700o622r664J4311P558j479j8757k1302N422N314j3298J8714m511
$$ -13120 -1420 -8042 -17706 -3395 4163 2684 -16073 -37375 -31953 -26639 -39937 -21223 -25734
6746b5734J9114n963K7888L706K209P8l1178P117N404M005j3359k0235j1270J786
$$ -25734 -6620 -12583 15305 19011 21220 21298 -9880 -2763 2641 6646 -6713 -26948 -38218 -36432
6732c6432m347J7202O261j3675k1378l37O70K0392Q217P759O556O445q151P432
$$ -36432 -40779 -23577 -17316 -30991 -52369 -52706 -52036 -31644 -23427 -15668 -9112 -2667 -10818 -3386
6718c386L1312m712R308L421J2511q721j7234K2724P5217O7148P9857M7413K9865
$$ -3386 27926 23214 32522 35943 48454 39733 22499 45223 120440 187588 267445 314858 344723
6705C44723l0326m6449q7474n8949l8348k5253j4616m4605k3521J5643J02L3845
$$ 344723 314397 267948 180474 121525 83177 57924 43308 -1297 -24818 -9175 -9073 24772
6693B4772J2453J0962k4287k2072K684L687R388N781K2114Q258q547J458r220
$$ 24772 37225 48187 23900 1828 4512 8199 17587 23368 45482 53740 45193 46651 37431
6680C7431l0070K1433R014q149k4561k9801o064Q848m167j4771p009J7235J1985
$$ 37431 7361 28794 37808 29659 5098 -24703 -30767 -21919 -26086 -40857 -47866 -30631 -18646
6667a8646P906J3534n079J2622J6682N666j8962l0203K6142J6712j5776l2013
$$ -18646 -10740 2794 -2285 10337 27019 32685 13723 -16480 9662 26374 10598 -21415
6655b1415k421P10L933J2124J7335k9013j3086N050J6876M299J806L335N869J2048
$$ -21415 -23836 -23126 -19193 -7069 10266 -18747 -31833 -26783 -9907 -5608 -3802 -467 5402 17450
6641A7450j6398j731j1514j8585K2691M324j9929J501r548m361o742J3958j6946
$$ 17450 1052 -679 -12193 -30778 -8087 -3763 -23692 -22191 -31739 -36100 -42842 -28884 -45830
6628d5830j1407N114m032L980J6095O86P672J576j747p81J477K3700J8187J5478
$$ -45830 -57237 -52123 -56155 -52175 -36080 -35394 -27722 -26146 -27893 -28674 -27197 -3497 14690 30168
6614C0168j0018j4632j365J1464P811l1593j4529J8188J4728j2100J7872k2281
$$ 30168 20150 5518 4153 15617 23428 -8165 -22694 -4506 10222 -1878 15994 -6287
6602f287k9935M663L4814J8002j153j7755j5452N144J7585L749M250k9656p439
$$ -6287 -36222 -31559 3255 21257 20104 2349 -13103 -7959 9626 13375 17625 -12031 -19470
6589a9470J4962J3103K3716k4077j8101J0573l975R217l357q485O288j7784O100
$$ -19470 -4508 8595 32311 8234 -9867 706 -3269 5948 2591 -5894 394 -17390 -11290
6576a1290n595r351J5685J4852k6891k0317k0988K8202K5503l0168P783J4705
$$ -11290 -16885 -26236 -10551 4301 -22590 -42907 -63895 -35693 -10190 -40358 -32575 -17870
6564a7870K7230j9063N390J5962j8421R811Q993k3338J1685M018K66M518K1191
$$ -17870 9360 -9703 -4313 11649 -6772 3039 12032 -11306 379 4397 4663 9181 30372
6551C0372q457r810L125j6935J2415J0441l636l2339l2690L2o153Q62J3624J4922
$$ 30372 21915 12105 15230 -1705 10710 21151 17515 -14824 -47514 -47482 -53635 -52773 -39149 -24227
6537b4227K1027J0753l014J8374K1026j8324r990J2321k442l552k4134K451Q077
$$ -24227 -3200 7553 4539 22913 43939 25615 15625 27946 25504 21952 -2182 269 8346
6524H346j1298P60j0435P325P341o671j5364M148K035J5177J2793K745K3357k1536
$$ 8346 -2952 -2192 -12627 -5302 2039 -4632 -19996 -15848 -13813 1364 14157 16902 40259 18723
6510A8723j1658M05j5036n533j6027j1791P692J1810J4241J2161J2049k3965j8879
$$ 18723 7065 7470 -7566 -13099 -29126 -40917 -33225 -21415 -7174 4987 17036 -6929 -25808
6497b5808o076R773J8686J1170J1706j1569K3196N818K910m4869l2087N572L1168
$$ -25808 -31884 -22111 -3425 7745 19451 7882 31078 36896 39806 -5063 -37150 -31578 -410
6484d10k99P644M0156k363k5346l5873j9567K3602J1639r444R611P13O405J60
$$ -410 -709 6935 47091 44728 19382 -16491 -36058 -12456 -817 -10261 -650 63 6468 6628
6470F628o716l4065K076m043M327Q953m643k907j1565L275j2146M746J4153O369
$$ 6628 -88 -34153 -32077 -36120 -31793 -22840 -27483 -30390 -41955 -38680 -50826 -46080 -31927 -25558
6456b5558J0835K686O846P909j2596J191k2269Q829j535P263n620K1688K9407
$$ -25558 -14723 -12037 -5191 2718 -9878 -8687 -30956 -22127 -23662 -16399 -22019 -331 29076
6443B9076R382j3787k0483l1772N429L1255K2502P902p331l3605j3711n71m800
$$ 29076 38458 24671 4188 -27584 -22155 9100 31602 39504 32173 -1432 -15143 -15714 -20514
6430b0514k0074j7482L5263K7577J2880j3778k2358k8083Q004K3296R599r566
$$ -20514 -40588 -58070 -22807 4770 17650 3872 -18486 -46569 -38565 -15269 -5670 -15236
6418a5236j5012m835L8190M387k0729J943n178j4266k4359J1167K7562J3030Q136
$$ -15236 -30248 -35083 3107 7494 -13235 -11292 -16470 -30736 -55095 -43928 -16366 -3336 4800
6405D800o288j567P069j0677l8077l1931J072K001J8909K6287J2825N071j2543
$$ 4800 -1488 -3055 4014 -6663 -44740 -76671 -75599 -73598 -54689 -28402 -15577 -10506 -23049
6392b3049K2847j883P156j2615q917K244J2707j7429k2134K355j416o109q305
$$ -23049 -202 -2085 5071 -7544 -16461 -14217 -1510 -18939 -41073 -38718 -40134 -46243 -54548
6379e4548K2216m179j1266P477N886o076O702L427J9912J6558J0480j2812m2265
$$ -54548 -32332 -36511 -47777 -40300 -34414 -40490 -33788 -30361 -10449 6109 16589 3777 -38488
6366c8488m8K8892J4152M669r249l1154j6494O947J7432J6969j5486m246N432
$$ -38488 -38536 -9644 4508 9177 -72 -31226 -47720 -40773 -23341 -6372 -21858 -26104 -20672
6353b0672J8265j120j1643R44K4968J5070r046j523L6197J7046k269j0056k1438
$$ -20672 -2407 -3527 -15170 -14226 10742 25812 16766 15243 51440 68486 66217 56161 34723
6340C4723j2484o190N624Q852k0652Q498O999l0775q465L5294J9125j0448k2139
$$ 34723 22239 16049 21673 30525 9873 18371 25370 -5405 -13870 21424 40549 30101 7962
6327G962j7605m069R550J757k7031L0754Q325K405r79j980r017j8531R570M179
$$ 7962 -9643 -13712 -4162 -2405 -29436 1318 9643 12048 11069 9089 72 -18459 -8889 -4710
6313d710J1823L748j7105q932Q563J6455J3185M140q586n240l8518r84Q036J9636
$$ -4710 7113 10861 -6244 -15176 -6613 9842 23027 27167 18581 13341 -25177 -26161 -18125 1511
6299A511J8450o684j5991o020J9145J0464j0655J117j0522k8085k4967J6664M362
$$ 1511 19961 13277 -2714 -8734 10411 20875 10220 11337 815 -27270 -52237 -35573 -31211
6286c1211P00J005Q54j1778r260J0471Q716L9171J9224n718j4276j3412q390r804
$$ -31211 -30511 -29506 -28652 -40430 -49690 -39219 -30503 8668 27892 22174 7898 -5514 -13904 -23708
6272b3708j6840M235J675k8751M584K3871M05M770j2180K5045J8020m1m617K183
$$ -23708 -40548 -36313 -34638 -63389 -58805 -34934 -34529 -29759 -41939 -16894 1126 1085 -3532 -1349
6258a349n006N959m51l1693P06N69J5838l055L100K3295J7037J216l8830n135
$$ -1349 -6355 -396 -847 -32540 -31834 -31265 -15427 -18482 -15382 7913 24950 26166 -12664 -17799
6244a7799K6316J74q722o304R100Q42k3467l4414l0588Q519R730K194O129q539
$$ -17799 8517 8691 -31 -6335 2765 3607 -19860 -54274 -84862 -76343 -66613 -64419 -58290 -66829
6230f6829r494k189J1020K6763j714j4364M7261L6363k4441k0758K752L892j4960
$$ -66829 -76323 -78512 -67492 -40729 -42443 -56807 -9546 26817 2376 -18382 -15630 -11738 -26698
6217b6698K2801J1648k4960j6035q914P322K8968K913O442J791J0444J231j422
$$ -26698 -3897 7751 -17209 -33244 -42158 -34836 -5868 -2955 3487 5278 15722 16953 15531
6204A5531J252k2702j3809M902L3909q628j2212N652J6752j0859o337Q956l2031
$$ 15531 16783 -5919 -19728 -14826 19083 10455 -1757 3895 20647 9788 3451 12407 -19624
6191a9624l1495J3932J6609J9729J9422J4843j5784p006J4949j0487j7784j6663
$$ -19624 -51119 -37187 -20578 -849 18573 33416 17632 10626 25575 15088 -2696 -19359
6179a9359J1232J0835N285m617O516M886K8040k9701l3757k3455j1119K465K0723
$$ -19359 -8127 2708 7993 3376 9892 14778 42818 13117 -20640 -44095 -55214 -52749 -32026
6166c2026J3155J6484K635j8398q620J2148j6975j6247J4664J5220N5306K7129
$$ -32026 -18871 -2387 248 -18150 -26770 -14622 -31597 -47844 -33180 -17960 37346 64475
6154F4475j0628l5619l2741j555P608K1436J4563l6101j2254Q949r671Q416L1412
$$ 64475 53847 18228 -14513 -16068 -8460 12976 27539 -8562 -20816 -11867 -21538 -13122 18290
6141A8290K47r437r953r232J8556j5954j0311O836r276J8338K0438K216k1742
$$ 18290 18537 9100 -853 -10085 8471 -7483 -17794 -10958 -20234 -1896 18542 20758 -984
6128i84K2493K9846j2390k5583r934j666r081K4921K1873j7333j9461p873j4385
$$ -984 21509 51355 38965 13382 3448 1782 -7299 17622 39495 22162 2701 -5172 -19557
6115a9557k1395q096P365R519J888K2502O714l6943j0755R100J6386P771j7876
$$ -19557 -40952 -49048 -41683 -32164 -30276 -7774 -1060 -38003 -48758 -39658 -23272 -15501 -33377
6102c3377J0572j2727O994R808k1493M164R69L086j7609j8142O766L6821K2838
$$ -33377 -22805 -35532 -28538 -18730 -40223 -36059 -35090 -32004 -49613 -67755 -60989 -24168 -1330
6089a330j0401L717k1387k0852k541J9749K1000j9304k0887N930J8143J880m687
$$ -1330 -11731 -8014 -29401 -50253 -52794 -33045 -12045 -31349 -52236 -46306 -28163 -26283 -30970
6076c0970M5638L1101j1747l3487k5733K061Q21K81O514O875o165M804l804k1193
$$ -30970 14668 45769 34022 535 -25198 -23137 -22316 -22035 -15521 -8646 -14811 -10007 -13811 -35004
6062c5004M392K510q156J8829R408p837L410J6160L3859m031j6757j2960J5125
$$ -35004 -30612 -28102 -36258 -17429 -8021 -15858 -12448 3712 37571 33540 16783 3823 18948
6049A8948J7210p280j2268j3502k3581J3005N880n648Q408r077k0006j3960p474
$$ 18948 36158 28878 16610 3108 -20473 -7468 -1588 -7236 1172 -7905 -27911 -41871 -49345
6036d9345K8047J5015k4999j1882j020K1176J3876r83Q503j93J900P482k0646
$$ -49345 -21298 -6283 -31282 -43164 -44184 -23008 -9132 -10115 -1612 -1805 95 7577 -13069
6023a3069n404K3116l1745r875J2703K753m700J0136k535J1076J7912K9950j3792
$$ -13069 -18473 4643 -27102 -36977 -24274 -21521 -26221 -16085 -18620 -7544 10368 40318 26526
6010B6526k9448k825Q912J3423r381o958j8164k556J9831P494j1455N381J4817
$$ 26526 -2922 -5747 3165 16588 7207 249 -17915 -20471 -640 6854 -4601 780 15597
5997A5597J2146j1279O963k2237j8225j062J4636l978j2038m351K2811J8262j22
$$ 15597 27743 16464 23427 1190 -17035 -18097 -3461 -7439 -19477 -23828 -1017 17245 17123
5984A7123J016l526r945k0417k0038M915q657n347K9710J9298k69m881O915q589
$$ 17123 18139 14613 4668 -15749 -35787 -30872 -39529 -44876 -15166 4132 3863 -1018 5897 -2692
5970b692n692q630j5327L150K7795l830M479K3577J6217j2276K1625P15k4305
$$ -2692 -8384 -17014 -32341 -29191 -1396 -5226 -747 22830 39047 26771 48396 49111 24806
5957B4806k0325l8982N073k076j266k3916l046J1910J4732J7279R144j0087K1523
$$ 24806 4481 -34501 -29428 -31504 -32770 -56686 -59732 -47822 -33090 -15811 -6667 -16754 4769
5944D769K670o149K752N990k7990p359L334L11J530P254N83p502J0350J2051l408
$$ 4769 7439 1290 4042 10032 -17958 -25317 -21983 -21672 -20142 -12888 -12305 -19807 -9457 2594 -814
5929h14K869J6631J4378q040q438R823k1903j7056K9568J6330k0605l6668j0322
$$ -814 2055 18686 33064 25024 16586 26409 4506 -12550 17018 33348 12743 -23925 -34247
5916c4247J3830j589o996J9916K2858j3077k0992m036L6303J4820k488j741N803
$$ -34247 -20417 -22006 -29002 -9086 13772 695 -20297 -24333 11970 26790 24302 22561 28364
5903B8364J8926k2481l2662j1691L7486L0673J0797j255p273j7235j5062L813
$$ 28364 47290 24809 -7853 -19544 17942 48615 59412 58157 50884 33649 18587 22400
5891B2400P907r351j5704J2389K5920j2k6449k2710j0727K1937J4923O719j0044
$$ 22400 30307 20956 5252 17641 43561 43549 17100 -5610 -16337 5600 20523 27242 17198
5878A7198j8430J4019P005P989K635j3292q636R801J5417k0348J8203o922j5794
$$ 17198 -1232 12787 19792 27781 30416 17124 8488 18289 33706 13358 31561 24639 8845
5865H845J7588L242j805j6114j0791J6616Q234q462q619j5923P99Q300j3554k0221
$$ 8845 26433 29675 27870 11756 965 17581 25815 17353 8734 -7189 -6390 1910 -11644 -31865
5851c1865Q66J0321K0596K1394R503M213k9254M837j0104N172N628j7465l4741
$$ -31865 -30999 -20678 -82 21312 30815 35028 5774 10611 507 5679 11307 -6158 -40899
5838d0899n952J8386J2318J1344P405j3341K4156J2093l3102j3944J600K0385
$$ -40899 -46851 -28465 -16147 -4803 2602 -10739 13417 25510 -7592 -21536 -19936 449
5826D49J4477j5707L83l296q325o186M910J0912L851j499P295K5298j2437j8679
$$ 449 14926 -781 -398 -3694 -12019 -18205 -13295 -2383 1468 -31 7264 32562 20125 1446
5812A446k0897L032M105N617J1326J1503J0592L168l9815J53j6428n714L1917
$$ 1446 -19451 -16419 -12314 -6697 4629 16132 26724 29892 -9923 -9770 -26198 -31912 5
5799EJ2126K802j7482L258Q87N314r010J1123J4386j3957K2482O003q913k9915
$$ 5 12131 14933 -2549 709 1596 6910 -2100 9023 23409 9452 31934 37937 29024 -891
5785h91j6660Q19J1192J732J6380N591k3629l71J6511J646n986N401j253o259
$$ -891 -17551 -16732 -5540 -3808 12572 18163 -5466 -5837 10674 12320 6334 11735 10482 4223
5771D223J867J8856l1930k9805K3006p203j3546L2475P498q799Q049o303j2700
$$ 4223 6090 24946 -6984 -36789 -13783 -20986 -34532 -2057 5441 -3358 4691 -1612 -14312
5758a4312O371Q309K0675j1392K309J9298O793k8991l5906l882j529R888R968
$$ -14312 -7941 368 21043 9651 11960 31258 38051 9060 -26846 -30728 -32257 -22369 -12401
5745a2401M54J3987N613j4373n965P004p90M192j3672j225o983j3958p000J0803
$$ -12401 -11947 2040 7653 -6720 -12685 -5681 -6471 -2279 -15951 -17176 -24159 -38117 -45117 -34314
5731c4314J7409K118j7912Q257L534J1952J0796N985K6949m049j870L811j1847
$$ -34314 -16905 -14787 -32699 -24442 -20908 -8956 1840 7825 34774 30725 28855 32666 20819
5718B0819j6209j4255k0295R806J7043K3861m468q930K2775m950l5941j4264R467
$$ 20819 4610 -9645 -29940 -20134 -3091 20770 16302 7372 30147 25197 -10744 -25008 -15541
5705a5541k456J546L270L79P776J6651J4789j0041j0298j1675l5548j7167j1827
$$ -15541 -17997 -16451 -13181 -12802 -5026 11625 26414 16373 6075 -5600 -41148 -58315 -70142
5692g0142q353K6590K1287K5100Q510k385K4160M527m145j3375l0855k6439L064
$$ -70142 -78495 -51905 -30618 -5518 2992 607 24767 29294 25149 11774 -19081 -45520 -42456
5679d2456L383M051K7500n805K0494J6794k90j4590N01K454j6690J0558q235k808
$$ -42456 -39073 -35022 -7522 -13327 7167 23961 23671 9081 9582 12036 -4654 5904 -2331 -5139
5665e139J6955K402k049l6310j0915J7218O464J794k343r022L1479K0752k175
$$ -5139 11816 14218 12169 -24141 -35056 -17838 -11374 -9580 -11923 -20945 10534 31286 29111
5652B9111K753j6077m082J5324Q80K0929j0960j3248j591q897j0778l114j248
$$ 29111 31864 15787 11705 27029 27909 48838 37878 24630 23039 14142 3364 250 -998
5639i98J7445J8402P262n898j0537k4125j9400L206j0634l342K960j1905N668
$$ -998 16447 34849 42111 36213 25676 1551 -17849 -14643 -25277 -28619 -25659 -37564 -31896
5626c1896O941K2465Q950j2426m33k0507J3264l297J847J902k87J2036J8682P389
$$ -31896 -24955 -2490 6460 -5966 -6399 -26906 -13642 -16939 -15092 -13190 -13477 -1441 17241 24630
5612B4630k744N870M896j1065L871J9073m554l1036l048J2629j1042j1314L949
$$ 24630 21886 27756 32652 21587 25458 44531 39977 8941 5893 18522 7480 -3834 115
5599A15R468J1235J4550j8158K066N352J622R803j2050k3645r748Q096j9433l2952
$$ 115 9583 20818 35368 17210 19276 24628 26250 36053 24003 358 -9390 -1294 -20727 -53679
5585e3679k348K2816J8176J7051K3828L106j0479k0180J0393K6151j6431j7416
$$ -53679 -56027 -33211 -15035 2016 25844 28950 18471 -1709 8684 34835 18404 988
5573I88k4049J8975K2499k4834k4714j3935Q263J0307J8728J547o999N91L439
$$ 988 -23061 -4086 18413 -6421 -31135 -45070 -36807 -26500 -7772 -6225 -13224 -12633 -9194
5560i194k0885Q742K8705O504j6165O352J4767j9757k0293k37q940l390j172j7942
$$ -9194 -30079 -21337 7368 13872 -2293 4059 18826 -931 -21224 -21461 -30401 -33791 -34963 -52905
5546e2905O610J1216K7606m889n608P766p580p816J2270J6531J7517O14Q005p903
$$ -52905 -46295 -35079 -7473 -12362 -17970 -10204 -17784 -25600 -13330 3201 20718 21332 29337 21434
5532B1434j1813j9622K0733L5030p065j1337j5841q063P87j0737j1005r731o278
$$ 21434 9621 -10001 10732 45762 38697 27360 11519 3456 4243 -6494 -17499 -27230 -33508
5519c3508J0176J5163n911j9581j0511n639K4412K1802j7812j1405K5847O342
$$ -33508 -23332 -8169 -14080 -33661 -44172 -49811 -25399 -3597 -21409 -32814 -6967 -625
5507f25L977K0102J7675q541j7948K0399K069M832l726k0943L748n643k1051j181
$$ -625 3352 23454 41129 32588 14640 35039 37108 41940 38214 17271 21019 15376 -5675 -6856
5493f856p230m285j7581O828P613j7616n877J9803L3544K7469Q971l996k6818
$$ -6856 -14086 -18371 -35952 -29124 -21511 -39127 -45004 -25201 8343 35812 44783 40787 13969
5480A3969J5738J5985k3072j7439R859j584p736R073q581j9329J4790O721J951
$$ 13969 29707 45692 22620 5181 15040 13456 5720 14793 6212 -13117 1673 8394 10345
5467A0345j742j6182m0107O970K0897o320p082k548K7303J7914L897k9166J0238
$$ 10345 8603 -7579 -47686 -40716 -19819 -26139 -33221 -35769 -8466 9448 13345 -15821 -5583
5454e583L82m59J2646K3163n082j8879K984K844P055j9640j4990P156l4602Q61
$$ -5583 -5201 -5660 6986 30149 25067 6188 9172 12016 19071 -569 -15559 -8403 -43005 -42144
5440d2144J4980P46K454P48J6455j2465K0996J1474J930L795k4969L120l950j4026
$$ -42144 -27164 -26418 -23964 -23216 -6761 -19226 1770 13244 15174 18969 -6000 -2880 -6830 -20856
5426b0856j056j3110K9629L2345O758J90j5626j223n211r575j5141J016L639J0433
$$ -20856 -21912 -35022 -5393 26952 33710 33900 18274 17051 11840 2265 -12876 -11860 -8221 2212
5412B212O43l734M7308K8025k0645K072L201l1577m2832J157M3451L6143k0937
$$ 2212 2855 -879 46429 74454 53809 55881 59082 27505 -15327 -14170 29281 65424 44487
5399D4487k9311j3286l7885k1979J5002J799J5705o765P778j957R936J6151M412
$$ 44487 15176 1890 -35995 -57974 -42972 -41173 -25468 -32233 -24455 -26412 -16476 -325 4087
5386D087m136J6038J023o096R139k2346k9800O698N358M285N929m410J7567J5948
$$ 4087 -49 15989 17012 10916 20055 -2291 -32091 -25393 -20035 -15750 -9821 -14231 3336 19284
5372A9284j5636m367J0815M368m348j2919P601J7912N100j2935j0116L665p213
$$ 19284 3648 -719 10096 14464 10116 -2803 4798 22710 27810 14875 4759 8424 1211
5359A211k518M322k7755J7958K6111k4294j6812O886l575J6918K0256p656M166
$$ 1211 -1307 3015 -24740 -6782 19329 -4965 -21777 -14891 -18466 -1548 18708 11052 15218
5346A5218m483j5073l7987J0873K5113R916j31R83j7869p439J7574J9034k738
$$ 15218 10735 -4338 -42325 -31452 -6339 3577 3446 4429 -13440 -20879 -3305 15729 12991
5333A2991L956j6617o670P235L691j5850K3795K4023j1391l1739q281k820K4459
$$ 12991 16947 330 -6340 895 4586 -11264 12531 36554 25163 -6576 -14857 -17677 6782
5320F782l053j5763K624M896J0412r560j1636O230r864n671j378K8819j3659j2042
$$ 6782 3729 -12034 -9410 -4514 5898 -3662 -15298 -9068 -18932 -24603 -25981 2838 -10821 -22863
5306b2863Q538K1549J6582l9823j1466L3065L264R53M543J3381j5181j8875l58
$$ -22863 -14325 7224 23806 -16017 -27483 5582 8846 9799 14342 27723 12542 -6333 -6691
5293f691O143J723o939j7747k320N366J3539K6061k145l5260k5182J4970J6004
$$ -6691 -548 1175 -5764 -23511 -25831 -20465 -6926 19135 16990 -18270 -43452 -28482 -12478
5280a2478O766l09j4943k89L3673j4999p827N478K6637J2440l3126k5566j6218
$$ -12478 -5712 -6021 -20964 -21253 12420 -2579 -10406 -4928 21709 34149 1023 -24543 -40761
5267d0761J4479M2341q765l2207K3523K5335J4304p212o350m063j0825r579p933
$$ -40761 -26282 16059 7294 -24913 -1390 23945 38249 31037 24687 20624 9799 220 -7713
5254g713j0980J0180j2679j2870k4752K3518M0501K3819N630J937r092l1242j2537
$$ -7713 -18693 -8513 -21192 -34062 -58814 -35296 5205 29024 34654 36591 27499 -3743 -16280
5241a6280j1851Q01J1585L622j1547m656Q209J1215J5387j0521k1830j396J3611
$$ -16280 -28131 -27330 -15745 -12123 -23670 -28326 -20117 -8902 6485 -4036 -25866 -27262 -13651
5228a3651R614k0848j4541K2530L685J3576J5799k3773j1400O655J3897r93p684
$$ -13651 -4037 -24885 -39426 -16896 -13211 365 16164 -7609 -19009 -12354 1543 550 -7134
5215g134j0171r875j4280j0866j0679J3495K5893J7619j4302J4885J9984l002
$$ -7134 -17305 -27180 -41460 -52326 -63005 -49510 -23617 -5998 -20300 -5415 14569 11567
5203A1567j9369j2627J078O176J3905r488p653j512J9783L587k9073L824m502
$$ 11567 -7802 -20429 -19351 -13175 730 -8758 -16411 -17923 1860 5447 -23626 -19802 -24304
5190b4304k355J4983j609l6484j029K2918J3472M24O183k8563j9465M142K6543
$$ -24304 -26659 -11676 -13285 -49769 -50798 -27880 -14408 -13984 -7801 -36364 -55829 -51687 -25144
5177b5144m190m234j4268k155J5075N426R69o003q07J1058P380L6242K8524N034
$$ -25144 -29334 -33568 -47836 -49991 -34916 -29490 -28521 -34524 -35331 -24273 -16893 19349 47873 52907
5163E2907q575L325J0120j1584k3148o163L520J1074l5719p200Q158l170l492
$$ 52907 44332 47657 57777 46193 23045 16882 20402 31476 -4243 -11443 -3285 -6455 -9947
5150i947J0072M798J4998j7393k3038l27L3693q698o287J4417l3263l487P832
$$ -9947 125 4923 19921 2528 -20510 -20837 12856 4158 -2129 12288 -20975 -24462 -16630
5137a6630j1928j5513j7505K1264J8112j9284L9572J7169r221R373O682j778l2494
$$ -16630 -28558 -44071 -61576 -40312 -22200 -41484 -1912 15257 6036 15409 22091 20313 -12181
5124a2181k4611L347J968K2351M8j6899k7010P33P814L6656J4631l919m676J4421
$$ -12181 -36792 -33445 -31477 -9126 -9078 -25977 -52987 -52254 -44440 -7784 6847 2928 -1748 12673
5110A2673j1420J628Q075K9746K8387q758l5158j6985K0995M718j818m1259j2638
$$ 12673 1253 2881 10956 40702 69089 60331 25173 8188 29183 33901 32083 -9176 -21814
5097b1814J6296J834L935p875J1761p555Q445L125M234N360j4293l4504k2683
$$ -21814 -5518 -3684 251 -7624 4137 -3418 5027 8152 12386 17746 3453 -31051 -53734
5084e3734m203J7770J2744K6782j059l0971J697M21m45L900m027N027l3392p932
$$ -53734 -57937 -40167 -27423 -641 -1700 -32671 -30974 -30553 -30998 -27098 -31125 -26098 -59490 -67422
5070f7422J0324J3159k610J1259K0170j8169j843k695m067L0730J534o553k743
$$ -67422 -57098 -43939 -46549 -35290 -15120 -33289 -35132 -37827 -41894 -11164 -9630 -16183 -18926
5057a8926K620K2022K4465j480l118K1611k6524k6146j0661j1257o070j261P399
$$ -18926 -16306 5716 30181 28701 25583 47194 20670 -5476 -16137 -27394 -33464 -34725 -27326
5044b7326J0495K8752o745l3269k152J8313N628j4102l0361j5749J9185N111J4661
$$ -27326 -16831 11921 5176 -28093 -30245 -11932 -6304 -20406 -50767 -66516 -47331 -42220 -27559
5031b7559J8134P28o943p540k2716R566J3239J5777l816j915J2545n973K370j5934
$$ -27559 -9425 -8697 -15640 -23180 -45896 -36330 -23091 -7314 -11130 -13045 -500 -6473 -4103 -20037
5017b0037r947M124Q245j1429n236R338J0180J1882J2692J2957J3980m467k2482
$$ -20037 -29984 -25860 -17615 -29044 -34280 -24942 -14762 -2880 9812 22769 36749 32282 9800
5004I800j0259Q679J4181K9197P080l1508j8593k2862k0780J5940M5209R549j7097
$$ 9800 -459 8220 22401 51598 58678 27170 8577 -14285 -35065 -19125 26084 35633 18536
4991A8536r769k4292j1623k3088J0338L2926M8830k7204l1874O024J0106m25j433
$$ 18536 8767 -15525 -27148 -50236 -39898 -6972 41858 14654 -17220 -11196 -1090 -1515 -2948
4978b948L7940p377k4879l230j1228j1714p047J0399N860J0779O266m529L997
$$ -2948 34992 27615 2736 -494 -11722 -23436 -30483 -20084 -14224 -3445 2821 -1708 2289
4965B289j1890j0466j8918J9565M593J3692J0586j0804q92L2690J6568l3526j8813
$$ 2289 -9601 -20067 -38985 -19420 -14827 -1135 9451 -1353 -2245 30445 47013 13487 -5326
4952e326q838P607j8511k7326Q622L5355K8121m566j7793J1197L2217n039j1258
$$ -5326 -14164 -6557 -25068 -52394 -43772 -8417 19704 15138 -2655 8542 40759 35720 24462
4939B4462j4964q827j5671J6951P046j9640j551J1586j113K415K4471K1924j2861
$$ 24462 9498 671 -15000 1951 8997 -10643 -12194 -608 -1721 694 25165 47089 34228
4926C4228m649j9035k4308j399J9280L012o95m3424n010K8260J8976r293l0109
$$ 34228 29579 10544 -13764 -15163 4117 7129 6434 -36990 -42000 -13740 5236 -4057 -34166
4913c4166j0601l366j7889j840R172J8390J0046L1050K4566n318m0197j0533L5996
$$ -34166 -44767 -48133 -66022 -67862 -58690 -40300 -30254 796 25362 20044 -20153 -30686 5310
4900E310k229M404M857j1163m208n44O818K0042j5131j5978M898k9733q687J2227
$$ 5310 3081 7485 12342 1179 -3029 -3573 3245 23287 8156 -7822 -2924 -32657 -41344 -29117
4886b9117K3385J3710k569j9614l1826L019K1173N983J587K3067J3136m929j8621
$$ -29117 -5732 7978 5409 -14205 -46031 -43012 -21839 -15856 -14269 8798 21934 17005 -1616
4873a616o262j0517K706J3798k4976r443m14O68R104K0202Q030mP342N750M102
$$ -1616 -7878 -18395 -15689 -1891 -26867 -36310 -36724 -36056 -26952 -6750 1280 1276 8618 14368 18470
4858A8470j5803k2717J0333J5098q491k5149l779K6520J2340O06P273j0324k3472
$$ 18470 2667 -20050 -9717 5381 -3110 -28259 -32038 -5518 6822 7428 14701 4377 -19095
4845a9095q176n365m62J8956n189p808L0315J0162p105j633J4121J1610j4219
$$ -19095 -27271 -32636 -33098 -14142 -19331 -27139 3176 13338 6233 4600 18721 30331 16112
4832A6112j1417k16J419m969J132j3677K0499o721j9518J4912J879n619j9108
$$ 16112 4695 4479 5898 929 2061 -11616 8883 2162 -17356 -2444 -565 -6184 -25292
4819b5292j4547M600n785Q276J174q641R957O51K1880p81p97k1520O850K7474
$$ -25292 -39839 -35239 -41024 -32748 -31574 -40215 -30258 -29607 -7727 -8508 -9305 -30825 -23975 3499
4805C499R147M916j1531r804o940m83j0107K152j9243k188J2094O522q405M20
$$ 3499 12646 17562 6031 -3773 -10713 -11196 -21303 -19151 -38394 -40582 -28488 -21966 -30371 -29951
4791b9951m083n774L389j0374K5466J543J8398Q790M445Q956q509k2525k2865
$$ -29951 -34034 -39808 -36419 -46793 -21327 -19784 -1386 7404 11849 20805 12296 -10229 -33094
4778c3094o347K6451J9114j5924k1194l229J6317J849o206m204P235O002K887
$$ -33094 -39441 -12990 6124 -9800 -30994 -34223 -17906 -16057 -22263 -26467 -19232 -13230 -10343
4765a0343J0164Q859J2980j6464J5779k573N454k4996j0807Q591J0852K213j7048
$$ -10343 -179 8680 21660 5196 20975 18402 23856 -1140 -11947 -3356 7496 9709 -7339
4752g339M22m706J3737J2006J0177j065l0039o594K7813p325q047J742p560j8984
$$ -7339 -6917 -11623 2114 14120 24297 23232 -6807 -13401 14412 7087 -960 782 -6778 -25762
4738b5762J2610O83l3339N716Q776l846R02J1006M3182o509p226O797q830O99
$$ -25762 -13152 -12469 -45808 -40092 -31316 -35162 -34260 -23254 19928 13419 6193 12990 4160 4859
4724D859K5114j4272k748m886j3014n499o51K3051R142j8557p972J3364P832j0019
$$ 4859 29973 15701 12953 8067 -4947 -10446 -11097 11954 21096 2539 -5433 7931 15763 5744
4710E744k8022l3558N088K5629n386J4339L6189j3540R224J212j3936n971l1470
$$ 5744 -22278 -55836 -50748 -25119 -30505 -16166 20023 6483 15707 16919 2983 -2988 -34458
$$ [...]
##END NTUPLES=NMR SPECTRUM
##END=
