##TITLE=Analysis number 319125
Compound Code btb 07157
Project Code adrs
Chemist Name fudan
##JCAMPDX= 6.0         $$ Bruker NMR JCAMP-DX V2.0
##DATA TYPE= NMR SPECTRUM
##DATA CLASS= NTUPLES
##ORIGIN= Bruker BioSpin GmbH
##OWNER= nmr
$$ XWIN-NMR		Version 3.5
$$ Wed May  3 10:53:14 2006 GMT Daylight Time (UT+1h)  MAYBRIDGE\nmr@NMR_250MHZ
##.OBSERVE FREQUENCY= 250.131544655141
##.OBSERVE NUCLEUS= ^1H
##.ACQUISITION MODE= SIMULTANEOUS (DQD)
##.ACQUISITION SCHEME= undefined
##.AVERAGES= 16
##.DIGITISER RES= 18
##SPECTROMETER/DATA SYSTEM= dpx250
##.PULSE SEQUENCE= zg30
##.SOLVENT NAME= CDCl3
##.SHIFT REFERENCE= (INTERNAL, CDCl3, 0, 16.522)
##AUDIT TRAIL= $$ (NUMBER, WHEN, WHO, WHERE, WHAT)
$$ ##TITLE= Audit trail, XWIN-NMR		Version 3.5
$$ ##JCAMPDX= 5.01
$$ ##ORIGIN= Bruker BioSpin GmbH
$$ ##OWNER= nmr
$$ C:\u/data/dgb/nmr/ADRS/3590/pdata/1/auditp.txt
$$ ##AUDIT TRAIL=  $$ (NUMBER, WHEN, WHO, WHERE, WHAT)
(   1,<2006-05-03 10:52:38.45 +100>,<MAYBRIDGE\nmr>,<NMR_250MHZ>,
      <created by zg, POWCHK disabled, PULCHK disabled
       configuration hash MD5:
       84 BC 41 DB A1 6E 1D 46 DA 25 12 A5 C1 ED C5 3A
       data hash MD5: 64K
       02 F1 F7 A1 20 04 30 6B ED 7B 11 89 17 BF 09 A6>)
(   2,<2006-05-03 10:52:57.32 +100>,<MAYBRIDGE\nmr>,<NMR_250MHZ>,
      <Start of raw data processing
       ef LB = 0.3 FT_mod = 6 PKNL = 1 SI = 32K 
       data hash MD5: 32K
       9D A5 40 17 A0 FD 34 6B DD 56 6C 3B E6 6D 68 33>)
(   3,<2006-05-03 10:52:59.67 +100>,<MAYBRIDGE\nmr>,<NMR_250MHZ>,
      <apk 
       data hash MD5: 32K
       60 18 06 C7 3B EB 96 3A FC 62 9E 53 52 72 09 6A>)
(   4,<2006-05-03 10:53:00.59 +100>,<MAYBRIDGE\nmr>,<NMR_250MHZ>,
      <abs ABSG = 5 
       data hash MD5: 32K
       4E 93 B5 84 89 57 38 8B 96 17 45 C0 2B 18 6F AF>)
$$ ##END=
$$ 
$$ hash MD5
$$ A0 3C 10 32 CB 59 65 65 3E EC AB 56 C9 B9 26 A8
##$RELAX= 
##$RELAX= 
##$RELAX= 
##$RELAX= 
##$RELAX= 
##$RELAX= 
##$RELAX= 
$$ Bruker specific parameters
$$ --------------------------
##$DU= <C:\u>
##$EXPNO= 3590
##$NAME= <ADRS>
##$PROCNO= 1
##$TYPE= <nmr>
##$USER= <dgb>
##$AMP= (0..31)
100 100 100 100 100 100 100 100 100 100 100 100 100 100 100 100 100 100 
100 100 100 100 100 100 100 100 100 100 100 100 100 100 
##$AQSEQ= 0
##$AQ_mod= 3
##$AUNM= <au_zg>
##$AUTOPOS= <12 >
##$BF1= 250.13
##$BF2= 250.13
##$BF3= 250.13
##$BF4= 250.13
##$BF5= 500.13
##$BF6= 500.13
##$BF7= 500.13
##$BF8= 500.13
##$BYTORDA= 1
##$CFDGTYP= 0
##$CFRGTYP= 5
##$CHEMSTR= <none>
##$CNST= (0..31)
1 1 145 1 1 1 1 1 1 1 1 1 1 1 1 1 1 1 1 1 1 1 1 1 1 1 1 1 1 1 1 1 
##$CPDPRG= <>
##$CPDPRG1= <>
##$CPDPRG2= <>
##$CPDPRG3= <>
##$CPDPRG4= <mlev>
##$CPDPRG5= <mlev>
##$CPDPRG6= <mlev>
##$CPDPRG7= <mlev>
##$CPDPRG8= <mlev>
##$CPDPRGB= <>
##$CPDPRGT= <>
##$D= (0..31)
0 1 0 0 0 0 0 0 0 0.06 0 0 0 0 0 0 0.0002 0 0 0 0 0 0 0 0 0 0 0 0 0 0 
0 
##$DATE= 1146649955
##$DBL= (0..7)
120 120 120 120 120 120 120 120 
##$DBP= (0..7)
150 150 150 150 150 150 150 150 
##$DBP07= 0
##$DBPNAM0= <>
##$DBPNAM1= <>
##$DBPNAM2= <>
$$ [...]
##$SUBNAM7= <"">
##$SUBNAM8= <"">
##$SUBNAM9= <"">
##$SW= 20.6930455092707
##$SWIBOX= (0..15)
0 0 3 0 0 0 0 0 0 0 0 0 0 0 0 0 
##$SW_h= 5175.983436853
##$TD= 65536
##$TD0= 1
##$TE= 295.16
##$TE2= 300
##$TE3= 300
##$TEG= 300
##$TL= (0..7)
0 120 120 120 120 120 120 120 
##$TP= (0..7)
150 150 150 150 150 150 150 150 
##$TP07= 0
##$TPNAME0= <>
##$TPNAME1= <>
##$TPNAME2= <>
##$TPNAME3= <>
##$TPNAME4= <>
##$TPNAME5= <>
##$TPNAME6= <>
##$TPNAME7= <>
##$TPOAL= (0..7)
0.5 0.5 0.5 0.5 0.5 0.5 0.5 0.5 
##$TPOFFS= (0..7)
0 0 0 0 0 0 0 0 
##$TUNHIN= 0
##$TUNHOUT= 0
##$TUNXOUT= 0
##$USERA1= <user>
##$USERA2= <user>
##$USERA3= <user>
##$USERA4= <user>
##$USERA5= <user>
##$V9= 5
##$VALIST= <valist>
##$VCLIST= <CCCCCCCCCCCCCCC>
##$VD= 0
##$VDLIST= <DDDDDDDDDDDDDDD>
##$VPLIST= <PPPPPPPPPPPPPPP>
##$VTLIST= <TTTTTTTTTTTTTTT>
##$WBST= 1024
##$WBSW= 4
##$XGAIN= (0..3)
0 0 0 0 
##$XL= 0
##$YL= 0
##$YMAX_a= 293899
##$YMIN_a= -416160
##$ZGOPTNS= <>
##$ZL1= 120
##$ZL2= 120
##$ZL3= 120
##$ZL4= 120
##$ABSF1= 16.522
##$ABSF2= -4.171173
##$ABSG= 5
##$ABSL= 3
##$ALPHA= 0
##$AQORDER= 0
##$ASSFAC= 0
##$ASSFACI= 0
##$ASSFACX= 0
##$ASSWID= 0
##$AUNMP= <proc_1d>
##$AZFE= 0.1
##$AZFW= 0.1
##$BCFW= 0
##$BC_mod= 0
##$BYTORDP= 0
##$COROFFS= 0
##$CY= 12.5
##$DATMOD= 1
##$DC= 0
##$DFILT= <>
##$DTYPP= 0
##$F1P= 14.0000005364418
##$F2P= -0.99999901652339
##$FCOR= 0.5
##$FTSIZE= 32768
##$FT_mod= 6
##$GAMMA= 0
##$GB= 0
##$INTBC= 1
##$INTSCL= 1
##$ISEN= 128
##$LB= 0.3
##$LEV0= 0
##$LPBIN= 0
##$MAXI= 10000
##$MC2= 0
##$MEAN= 0
##$ME_mod= 0
##$MI= 0
##$NCOEF= 0
##$NC_proc= -3
##$NLEV= 6
##$NOISF1= 0
##$NOISF2= 0
##$NSP= 0
##$NTH_PI= 0
##$NZP= 0
##$OFFSET= 16.522
##$PC= 1
##$PHC0= 179.3203
##$PHC1= 0.5943082
##$PH_mod= 1
##$PKNL= yes
##$PPARMOD= 0
##$PSCAL= 4
##$PSIGN= 0
##$REVERSE= no
##$SF= 250.13
##$SI= 32768
##$SIGF1= 0
##$SIGF2= 0
##$SINO= 400
##$SIOLD= 32768
##$SREGLST= <1H.CDCl3>
##$SSB= 0
##$STSI= 32768
##$STSR= 0
##$SW_p= 5175.98343685301
##$SYMM= 0
##$S_DEV= 0
##$TDeff= 65536
##$TDoff= 0
##$TI= <Analysis number 999999
Compound Code 99
Book Reference 9
Project Code 9>
##$TILT= no
##$TM1= 0
##$TM2= 0
##$TOPLEV= 0
##$USERP1= <user>
##$USERP2= <user>
##$USERP3= <user>
##$USERP4= <user>
##$USERP5= <user>
##$WDW= 1
##$XDIM= 32768
##$YMAX_p= 443225101
##$YMIN_p= -622766
$$ End of Bruker specific parameters
$$ ---------------------------------
##NTUPLES= NMR SPECTRUM
##VAR_NAME=  FREQUENCY,     SPECTRUM/REAL,   SPECTRUM/IMAG
##SYMBOL=    X,             R,               I
##VAR_TYPE=  INDEPENDENT,   DEPENDENT,       DEPENDENT
##VAR_FORM=  AFFN,          ASDF,            ASDF
##VAR_DIM=   32768,         32768,           32768
##UNITS=     HZ,            ARBITRARY UNITS, ARBITRARY UNITS
##FACTOR=    0.157963299565203, 1,           1
##FIRST=     4132.6476996994, 0,             0
##LAST=      -1043.33573715361, 0,           0
##MIN=       -1043.33573715361, -622766,     0
##MAX=       4132.6476996994, 443225101,     0
$$ Real data points
##PAGE= N=1
##DATA TABLE= (X++(R..R)), XYDATA
$$ [...]
20610 2186645 2160994 2155433 2208339 2218151 2167790 2111761 2087180 2088618 2093522 2088742 2075188 2094013
20598 2094013 2081744 2071052 2119618 2102556 2056604 2069092 2045067 2022346 1996083 1995705 2033021 2080875
20586 2080875 2045388 2037835 2020035 2018344 2022858 2035039 2010632 2000782 2004653 2005003 1975744 1967204 1954088
20573 1954088 1955909 1933363 1908983 1932371 1918604 1938087 1887519 1903633 1882296 1873960 1871970 1842195
20561 1842195 1840359 1802684 1750546 1748063 1779260 1788320 1802264 1805686 1810395 1824792 1782325 1717063
20549 1717063 1700352 1685707 1676640 1696234 1716516 1738214 1741830 1731710 1748603 1776837 1784065 1755167
20537 1755167 1736060 1708339 1683357 1675721 1641974 1603200 1604127 1619111 1641493 1638416 1640163 1616059
20525 1616059 1639749 1659850 1699027 1693971 1640384 1610010 1598331 1597812 1613362 1646278 1601541 1550571
20513 1550571 1546863 1608979 1552850 1531544 1518802 1500961 1511568 1528847 1532055 1563430 1566179 1514559
20501 1514559 1481709 1458894 1496094 1471817 1500027 1547962 1550368 1518136 1545246 1580601 1589487 1560263
20489 1560263 1558545 1562709 1579980 1569241 1511397 1482404 1457794 1450257 1445235 1419163 1460827 1455849
20477 1455849 1468572 1464136 1496805 1520279 1498623 1434730 1396826 1399853 1373217 1374155 1419767 1407940
20465 1407940 1341446 1356097 1349505 1350302 1338316 1316643 1303022 1334004 1338557 1351460 1336250 1325568
20453 1325568 1302423 1284515 1280084 1308728 1289539 1244033 1179017 1179421 1165160 1173788 1206237 1204914
20441 1204914 1202818 1222315 1226975 1240731 1275640 1273885 1261409 1251032 1237040 1245501 1227779 1222959
20429 1222959 1212589 1225363 1221953 1219923 1190707 1203258 1177897 1135878 1157273 1142805 1145495 1164296
20417 1164296 1181042 1166385 1184718 1151622 1120727 1127316 1116858 1081447 1110071 1094208 1068252
20406 1068252 1037323 1028326 1036887 1075550 1108829 1122348 1101472 1034862 986836 1007385 1013799 985311
20394 985311 1027403 986145 962700 992374 1003496 1023048 1031899 1027626 1017635 985715 936774 942047
20382 942047 913720 931006 951222 915444 898550 894399 918366 981863 1003730 959231 947039 959888
20370 959888 934667 889373 879417 918832 932525 912225 869660 870348 874726 863194 849167 788678
20358 788678 779710 770112 825063 890536 895268 866074 818137 823715 832504 827964 839677 923565 937738
20345 937738 910971 818748 811383 827904 864198 889084 860265 841268 825926 840853 813735 789122
20333 789122 779003 750464 739578 741608 694895 664919 691904 750214 777059 772778 759475 789098
20321 789098 781431 739803 771051 751590 711318 707424 690340 666341 682420 738772 772023 755621
20309 755621 760828 765570 722417 671311 669612 688855 664937 612871 595919 592279 593262 595141 633532
20296 633532 642029 618008 647844 643030 626866 583232 567610 568708 566823 584509 575460 576348 597071
20283 597071 555719 535550 526462 528866 541023 510686 516353 573001 601422 577545 584017 561938
20271 561938 549829 542116 578396 587475 613287 636626 670360 635169 592174 588166 548058 524650
20259 524650 531519 535798 486754 451339 499524 490068 454802 441467 471886 512186 517476 533749
20247 533749 536839 533487 544872 514074 522045 522014 522663 542680 478621 423419 451559 507661 495158
20234 495158 435162 421203 410587 393201 430122 455313 421600 383650 334592 354488 333599
20223 333599 381884 470368 478255 435020 406443 418025 467324 496016 463269 474075 484777 482190
20211 482190 429412 398369 390813 397432 427941 448491 458230 425460 415876 406354 364754 377289
20199 377289 423325 393173 395797 415105 399776 427842 425302 364581 336470 348289 428701 426006
20187 426006 405164 420420 385729 342456 320069 346842 390741 349534 367037 407845 403452 402669
20175 402669 374912 330821 344594 308282 349290 368925 357068 352941 357462 408752 406038 373355
20163 373355 336488 303267 294254 276413 229685 272933 290835 278313 279063 272719 258084 247454
20151 247454 280448 302615 290723 301385 259513 257809 263715 262468 272476 234755 213924 212889
20139 212889 238660 218444 192826 230267 266894 262919 266238 289628 327387 334682 328781 284047
20127 284047 251190 248028 247233 239163 271288 282301 274910 264663 240387 205972 226322 239856
20115 239856 225441 248319 222451 199134 186543 206162 211511 235553 282735 280678 270231 247272
20103 247272 214266 213605 187894 166666 154665 134483 153743 177235 195147 236428 225839 175171
20091 175171 180537 207045 197934 183558 184811 224124 237652 230728 272606 306790 294512 248725
20079 248725 179734 187732 226051 241107 270677 280563 242610 205523 186316 234976 242283 221906
20067 221906 196675 168710 151719 175314 156170 160091 188689 207877 228513 216041 178456 161271
20055 161271 148584 139850 142603 168022 151953 179449 182789 163972 137601 132607 168554 151002
20043 151002 164930 176524 158852 128738 101880 129980 185591 167453 172463 170099 144083 142792
20031 142792 136162 151403 170783 200483 209242 175385 128440 133790 183883 216537 181838 162479
20019 162479 149591 132302 88879 99487 100343 85577 114947 136734 168068 135169 109201 140191
20007 140191 131100 121599 127748 120334 121112 71230 76660 115556 147173 166546 148759 107717 116796
19994 116796 125877 105484 89724 74883 48300 34682 34102 67206 111956 162024 217789 163904
19982 163904 84176 105756 130766 96800 65719 70274 90847 82828 70087 73306 71986 102506
19970 102506 152690 203891 190790 114508 56085 28777 26819 13034 21530 10227 36374 66412
19958 66412 97304 117776 118509 104353 127499 164130 153182 153876 137431 106960 61069 29415
19946 29415 31085 35394 69133 97506 63522 55723 101698 153223 179521 183961 191377 177322 141493
19933 141493 111874 94222 110243 129855 122824 117889 141051 157687 145741 110814 113908 145879
19921 145879 132957 113910 88308 77514 71244 77809 91374 84002 60615 78123 139585 159031
19909 159031 160659 138697 109252 61676 54595 76108 53773 56280 48400 46533 88509 106821
19897 106821 121413 134348 135430 171869 198764 191503 138883 118772 130868 98256 80275 78090
19885 78090 112894 118720 137204 118532 102334 69462 63339 101780 79892 53501 89245 84619
19873 84619 111440 148903 159392 153650 116096 82107 58328 96386 102237 94225 130464 115041
19861 115041 93505 80118 74758 86139 109194 93036 133058 143949 174679 210515 242208 219838
19849 219838 183095 171753 166212 173193 127997 121696 132670 135945 110813 101810 119720 106723
19837 106723 68619 22971 -3802 25836 80813 143313 178123 165882 139785 75261 60574
19826 60574 36667 22618 39688 84024 80607 57546 72544 66952 61689 67926 16112 24202 34069
19813 34069 69309 73768 71396 62045 54518 44821 53542 41729 10743 50848 92894 67829 50518
19800 50518 27735 15063 10981 40210 45847 23220 44108 52094 37412 17541 26336 25538 20312
19787 20312 49212 68732 49608 39526 -6312 -48261 -35556 -19757 -56566 -25255 68624 80919
19775 80919 68549 86245 82854 47528 44278 38275 13547 26053 36845 43164 77366 103429
19763 103429 110806 135309 132488 62203 46646 25686 23353 37717 51482 87780 75137 73850
19751 73850 45132 -5908 11594 3962 3765 -23316 -52650 -50887 -55364 -22557 -12646 -6566 -19789
19738 -19789 -18828 -37719 -52943 -60274 -34103 -280 22907 25536 -16238 -36885 1261 11346
19726 11346 23623 -917 -28211 2362 4968 -13402 8045 55925 25707 30461 50301 27406
19714 27406 -19659 -14185 8029 774 -15861 -61786 -45933 -14975 -60244 -11973 9717 -34770
19702 -34770 -43706 -49864 -47704 -58001 -24818 -24391 -54725 -25033 -41790 -31813 -30435 -11892 -3402
19689 -3402 -5659 27974 90891 94675 81333 133878 152186 110493 58663 -2395 -10935 9730
19677 9730 9665 11470 16069 34411 56653 64369 34048 1815 2328 31707 56454 3547 -30868
19664 -30868 -4417 23628 13894 12629 28822 24311 9782 8594 -3370 -13691 -19474 -29630 -19870
19651 -19870 -20922 -3544 23527 23008 4430 -40404 -48570 -31952 -11774 28389 55517 43300
19639 43300 40676 22774 -1627 7130 -3991 -59050 -71289 -36221 -28404 -31511 -10040 -824 9250
19626 9250 40768 20319 20435 -6199 -32250 -46765 -55582 -76211 -57005 -10363 10349 26681
19614 26681 -107 -8765 -3219 32741 7647 14060 28893 54884 6182 12027 -21979 2800
19602 2800 25815 8288 -23582 -8333 28531 81552 81966 90948 83241 92950 84157 71297 57944
19589 57944 -6591 -80802 -61715 -44448 23707 6641 -19377 -34356 -26998 3045 4793 -30877
19577 -30877 -33706 1707 14428 14027 27253 40066 14251 23110 22639 10882 23029 2922 -1197
19564 -1197 -17363 -56097 -56249 -76997 -73011 -42341 -37960 -31235 -37982 -32381 -34971 -24930 -2751
19551 -2751 -4138 -45298 -78866 -46436 -20193 -19937 5911 21057 52975 95754 66329 72184 71284
19538 71284 67331 37957 51204 34878 -3958 -51305 -31106 247 18855 26198 34016 77268
19526 77268 44511 51002 43673 11693 13973 16627 -12777 -14035 -27884 -45121 -19694 3837 14648
19513 14648 -2401 3669 -56463 -56125 -9577 -7840 -6680 -17296 -33709 -22050 -31398 2999 35159
19500 35159 33907 13266 -1003 -9313 -31744 -57960 -44914 8656 11370 50155 74014 81123
19488 81123 38974 24580 -23178 -80670 -71883 -44451 -25637 19310 31945 36816 26013 -2842
19476 -2842 -35787 -33750 -29656 13600 54915 37240 25638 10951 -8184 -9722 -14194 34016 3472
19463 3472 -19835 -26926 -18470 -302 -4730 -13303 2886 25431 9655 1557 -50193 -62844 -46334
19450 -46334 -26692 -15528 9860 5046 -9995 -60135 -66066 -25162 -41953 -79550 -44489 21378
19438 21378 61206 22482 -5482 -2595 -17235 -20652 -18886 -44239 -48936 -60791 -33815 -22244
19426 -22244 -6562 -28233 -26922 -20479 14530 13414 -7734 -21965 22286 -2234 -10187 -23921
19414 -23921 6823 20047 -18199 -16539 -17921 23140 31001 369 -3509 4542 -19255 -36840 -11935
19401 -11935 2060 3702 -5904 3631 3121 -12235 -13638 48213 65480 48210 30503 8555 -24027
19388 -24027 -15058 17084 79509 63289 22918 28910 30664 28168 -17970 -48443 -17420 2161
19376 2161 35471 -7811 -28778 -43274 -61631 -43151 13270 16675 -22837 -20100 -32819 -36272
19364 -36272 -39597 -22011 -8588 -16445 -27094 -1561 -26620 -22882 -16605 3324 -18733 4956
19352 4956 -10847 -25037 -48594 -56492 -13586 49725 24800 20354 1478 -39416 -39035 -3419 13034
19339 13034 1800 -10313 6514 -42172 -92011 -114167 -80470 -22080 -24344 -32493 -24384 -68557
19327 -68557 -84744 -88771 -81733 -74603 -49166 -81006 -72840 -81982 -57469 -537 18344 -11198 -13400
19314 -13400 -6822 25862 8347 2160 -6049 -3993 -34123 -76410 -81789 -43182 -24625 -28794 -18733
19301 -18733 -27888 -29622 -47666 -51665 -19021 -29157 -35444 -30643 -38401 -68169 -81722 -51608 -39028
19288 -39028 -39650 -29535 -3771 8513 42030 39727 39717 51647 31894 3833 -21576 -5824 -32016
19275 -32016 -40230 2760 -13261 -40182 -48075 -6136 10191 25924 -9808 -45999 -55294 -26569
19263 -26569 -14360 4431 30544 43078 42032 43374 -20934 -31152 -20143 -17821 -16189 -21755 -12967
19250 -12967 -30271 -29771 -22740 10691 -20696 -13174 -6709 -8115 10556 -36575 -43320 -46187 -59135
19237 -59135 -39288 5737 2626 10971 69511 69383 55838 41070 19390 -888 33022 88201
19225 88201 108816 89732 120577 107535 45665 12651 44628 66063 64357 69778 38240 437
19213 437 3321 16337 7513 -24535 9852 65509 87893 85858 97965 118913 116402 120425 88337
19200 88337 73800 66328 80134 82750 78654 111087 105987 50937 31332 7408 4044 22055 38311
19187 38311 12275 25067 34403 56315 71473 12133 16950 32133 32505 90381 137264 138292 128301
19174 128301 137221 95607 30545 42799 70982 86748 115983 122659 99119 103112 83123 73044
19162 73044 96541 114873 95117 68991 36119 13031 30947 -473 4240 3523 3108 72823 70571
19149 70571 9489 29824 40447 55129 50491 66926 76222 40708 23912 29122 32275 21897
19137 21897 31945 24675 33297 78166 66696 66497 27255 -26281 -46253 11223 36775 65383
19125 65383 66551 96261 89170 95651 123108 153420 202431 256644 249401 269734 305375 305837 283043
19112 283043 251181 243722 225638 202199 169613 148204 168092 197869 166658 183112 183091 181725
19100 181725 207412 236891 249236 260335 289411 294086 260653 239470 223520 217065 182760 154172
19088 154172 150426 99462 76599 103311 75090 97022 104682 80458 49268 40890 40092 71779
19076 71779 106964 82538 92805 92412 64374 55990 78105 92590 91424 111403 104972 121950 100193
19063 100193 105267 139668 143611 130407 118672 85638 68991 46072 54039 90736 78087 60765
19051 60765 69029 46209 42291 37855 61096 69093 104418 154051 80375 19819 909 21790
19039 21790 63948 87234 61973 -15509 3656 53298 78455 62945 64644 37551 -19642 -47982
19027 -47982 -18677 -1259 -48745 -51859 -51184 -35421 6118 7162 -15610 -19019 -26767 7280 35628
19014 35628 62488 43532 6490 14472 53985 95503 112760 63279 4983 712 25869 68619
19002 68619 107037 92995 35673 13393 -9972 -17811 41127 77932 100203 84649 95746 101559
18990 101559 90251 71890 34747 71291 161491 156585 145965 143926 117187 155313 170810 145849
18978 145849 164304 127955 123058 145185 158706 200260 197135 200918 198517 159938 183236 240109
18966 240109 255550 277103 272823 240759 191054 209354 213466 246339 251529 241935 255018 266505
18954 266505 288103 249690 216578 194847 212559 158780 97868 119574 174416 164998 150919 120319
18942 120319 119471 135230 125631 125392 130842 116976 102568 86573 56925 35864 623 15098 49118
18929 49118 43177 26657 20485 18713 11831 39758 28256 12999 1111 31676 29075 35033 19298
18916 19298 13814 26751 46493 27650 20421 -938 -35656 -51237 -11898 -11575 -34079 -20430
18904 -20430 -22499 -29240 -17721 -24421 -14282 -3135 10707 29221 18252 -8307 -13425 11373
18892 11373 -32485 -37103 -55882 -85755 -105332 -87674 -88903 -95738 -80327 -79637 -74726 -43967 -38761
18879 -38761 -27337 53 12290 -7571 -4467 -45280 -81414 -76372 -74289 -74625 -73852 -68015 -13992
18866 -13992 12864 -5586 12376 -13758 -50523 -48155 -19134 -34230 -18416 -297 37286 53559
18854 53559 -14497 -26901 -9813 -9839 1924 -36035 -77892 -43364 -23320 -30489 -52893 -67534
18842 -67534 -76211 -90284 -55690 -329 36621 20132 -4448 -13509 -9240 -56920 -12592 78853
18830 78853 81342 48729 18482 -3609 7352 9182 54674 54558 19768 24129 36056 58248 51373
18817 51373 16104 11876 25546 53424 94735 86384 29318 -35309 -40352 -31922 -8904 51549
18805 51549 93110 39907 8159 -12900 -5677 5152 -7605 40009 44308 11484 -9874 -35379
18793 -35379 18233 59840 66948 60531 14829 1214 -31572 -37338 -38373 -3184 40828 55925
18781 55925 24373 -19238 -22406 -52636 -71503 -41171 -48103 -61715 -50337 -23140 -10813 -21081
18769 -21081 -36184 -25890 9908 101614 173713 223178 211360 178158 160121 159682 127332 59453
18757 59453 41032 86252 75498 71286 102601 133757 64722 18534 18610 31357 36298 20810 -5390
18744 -5390 -5568 4144 -26983 -10151 -32310 -42015 -62703 -114033 -72125 -56455 -1297 37753 59824
18731 59824 27651 -40686 -85327 -147507 -121895 -29889 -9469 -20262 -12625 -23773 -72486 -118785
18719 -118785 -62360 -1963 51442 79739 68499 44959 -26593 -61929 -56207 -32796 -38387 -40273
18707 -40273 -47088 -22826 19741 -13481 -31014 -24074 3583 19253 8281 -24450 -73832 -86788
18695 -86788 -15439 31543 27896 12168 61339 62034 36222 53668 82108 61490 30321 -9212
18683 -9212 -35230 -51509 -79803 -37644 51076 74816 77748 75151 74555 60544 73682 46948 26168
18670 26168 18021 2115 -7452 3396 9603 -13662 -5079 25015 67639 86040 91632 84484 89620
18657 89620 60076 69215 25077 -8385 1424 70869 130528 136879 117547 112369 90648 68114
18645 68114 79201 116688 106338 77619 77338 78066 33892 75395 104377 114578 121607 108756 106068
18632 106068 69474 46126 45367 75118 90929 70567 60257 47526 14728 4846 45866 40329
18620 40329 93045 106193 130078 132419 133308 103744 93628 116823 93394 43674 23545 47671
18608 47671 62672 81733 115373 126005 120301 113120 107223 73919 18546 8188 6216 24000
18596 24000 27443 25946 35259 51102 83747 62953 50647 68150 71819 46155 47437 68083 57746
18583 57746 6329 -16635 -13093 9658 20704 51478 64111 70614 82192 57408 4545 -29406
18571 -29406 -37184 16978 66129 78869 40761 46272 67197 77003 37419 10618 17667 21321 37826
18558 37826 82002 79701 86191 63519 48301 18642 -11459 -33139 -7226 21488 -1174 -18782
18546 -18782 -13222 -5580 27558 30026 45844 46723 24242 21206 37646 63823 46869 56773 90082
18533 90082 61466 24430 35555 74619 79518 72957 31911 26522 42676 61636 60206 89032
18521 89032 95125 118982 117433 87574 46110 38710 28403 28707 66768 54588 44389 86545 89469
18508 89469 95480 84461 63811 65271 76960 45436 35350 56194 68969 97320 76586 50853
18496 50853 56344 22046 19500 46962 70171 95034 117917 98489 34101 22077 34078 25274
18484 25274 6342 -14301 -4681 35642 28198 9817 11514 81091 70334 59959 48117 56474
18472 56474 32239 -9901 -8082 -55166 -61602 -28994 32972 41812 31285 43911 42847 -6495
18460 -6495 -26366 -15144 15934 -11941 18992 71720 57944 29437 52280 75823 66654 4432
18448 4432 3965 30794 34272 53488 53848 57988 53255 84480 96731 98073 93649 96253 77512 100751
18434 100751 102667 139389 134218 131549 129960 129744 161131 175221 228932 298067 352692 400229 512597
18421 512597 631075 638909 642635 677512 741447 807760 877716 962326 1075227 1227828 1469299
18410 1469299 1756319 2061508 2335176 2724618 3281467 4057837 5345659 7412854 10418983
18401 10418983 13983079 16874493 18350221 18604435 18167095 17158718 16120076 15966977
18393 15966977 17393738 20693705 25448692 30509856 34714326 37093066 37258690 35652208
18385 35652208 33335118 31337219 30634784 31973012 34872280 38042748 40725644 42061034
18377 42061034 41359259 39072221 36431526 34445320 33856056 35276435 38234758 41325625
18369 41325625 43249414 43128267 41082798 37621118 33602722 29791572 26859114 25446457
18361 25446457 25674254 27265605 28982031 29450959 28537790 26771691 24358578 21439989
18353 21439989 18630970 16398728 14777631 13566859 12646853 11936338 11323992 10780466 10246878
18344 10246878 9731716 9281283 8888301 8520895 8212206 7940354 7650754 7371948 7125475
18335 7125475 6910701 6643550 6408653 6161696 5956495 5793894 5645424 5447518 5233076
18326 5233076 5037782 4877400 4702068 4536626 4451924 4372230 4236312 4108468 4005873 3919856
18316 3919856 3807488 3715893 3624662 3585685 3483642 3437766 3431661 3332129 3245050 3169913 3102474
18305 3102474 3003142 2918757 2821979 2732461 2637255 2578967 2546703 2531326 2454298 2384542 2350523
18294 2350523 2313706 2290617 2287802 2276268 2248003 2206863 2180073 2126636 2049820 1964157 1929370
18283 1929370 1874917 1844381 1814173 1817906 1777761 1756515 1711918 1649451 1626948 1599103 1619589
18272 1619589 1579144 1542492 1543885 1467919 1412893 1415721 1391469 1389597 1383055 1354346 1323675 1300791
18260 1300791 1324370 1315444 1288136 1218500 1108734 1064857 1071250 1106417 1135796 1118380 1088087
18249 1088087 1054533 1025041 1007805 967764 943776 903360 917964 933661 907312 938627 970381
18238 970381 938395 857781 817171 791138 759652 679400 626865 649170 668982 696674 735532
18227 735532 781747 819496 811882 749735 694614 681774 631293 637836 588001 595491 610552 626979
18215 626979 635603 605146 592190 605047 604431 616406 624803 608618 585079 572475 554801 553293
18203 553293 553369 572416 558113 536101 538828 571556 534213 492381 512561 500049 484258 500569
18191 500569 519931 520481 475953 466781 475388 476757 474000 491250 515448 517870 506547 547530 588082
18178 588082 629110 641402 659438 657675 674634 673848 614471 564753 518819 536962 517041 486904
18166 486904 443574 429663 465257 475271 501303 465772 420855 389579 386662 371110 391603 422418
18154 422418 476526 516785 545966 572088 568382 593645 566574 563850 591805 619842 610421 633900
18142 633900 628344 564698 550584 553210 532067 487044 480786 501822 489033 447959 400083 424289
18130 424289 444289 485076 520985 514174 539041 610940 631344 671613 688353 764787 843919 976790
18118 976790 1134757 1322920 1506043 1751447 2082896 2551117 3213006 4328971 6277256
18109 6277256 9833300 16293372 26331324 35061758 37577374 36015338 33007941 28536381
18101 28536381 21706880 15773215 12142130 10082994 8803366 7819032 6946245 6181336
18093 6181336 5545880 5029297 4607748 4290745 4021495 3837840 3691897 3535139 3369111
18084 3369111 3274519 3169029 3099916 3061988 2999706 2951779 2870913 2770261 2641065 2500680
18074 2500680 2384168 2297091 2217929 2172165 2095181 1983874 1879642 1820026 1775219 1704849 1645866
18063 1645866 1609545 1567120 1505423 1482802 1540194 1581657 1620704 1622479 1622949 1604127 1532760 1515505
18051 1515505 1461165 1403890 1344351 1323738 1302928 1280773 1271242 1221477 1120604 1074454 1059207
18040 1059207 1079585 1034837 986017 950330 899566 839090 806845 783551 780232 792101 844693
18029 844693 826602 782882 764616 733565 689934 679039 666769 645537 608904 621362 631596
18018 631596 645074 609963 613962 650121 631711 613586 596381 611813 606221 599762 569198 591403
18006 591403 606866 612734 571040 574591 585123 561349 559953 602760 618473 630366 641698 684193
17994 684193 705562 721540 748050 793001 795300 807144 877686 944636 968225 913909 843190 818624
17982 818624 809355 814845 812569 781199 735231 725023 740014 716114 641548 586392 564650 563626
17970 563626 587102 521981 451105 444307 494277 549830 575635 623383 620645 633133 603261 565110
17958 565110 543156 526710 529614 521039 532598 536287 474104 484953 514721 545957 577943 643407
17946 643407 678419 683550 696705 680580 652998 637102 666660 661941 653192 604439 569414 590930
17934 590930 616440 622164 605669 619994 594633 545674 506269 486968 471585 452586 414636 369768
17922 369768 285818 276253 262905 279002 328923 378421 345242 295758 252087 256300 292989 263956
17910 263956 250684 257545 258497 272396 272549 225088 198708 198198 188126 183111 218990 251636 207840
17897 207840 195217 220046 214740 177959 162871 195290 220855 215223 199678 155208 172901 181303
17885 181303 207064 207151 208021 200773 226283 201371 173973 145952 114977 117657 181809 183230 174274
17872 174274 169103 148231 117288 95645 101299 135050 151282 175513 151714 83801 76313 115207
17860 115207 98000 106226 121389 96782 52660 59127 78862 98845 104307 94240 67839 60891
17848 60891 52831 47992 41403 27579 37591 30441 6542 54614 92246 95618 90052 46589 66182
17835 66182 25649 27366 31124 38102 51451 74730 70606 91246 127156 131674 64207 52730 47361
17822 47361 -20311 -39270 -19708 46813 108426 107253 72214 27478 349 -612 213 6442 34862
17809 34862 57063 105738 150718 137367 132675 128517 105423 99354 83301 106875 139941 164225
17797 164225 151977 169642 205592 250842 264693 227454 196213 149622 166052 205773 245513
17786 245513 261969 223181 212397 204623 193177 217405 259890 250562 220880 300296 315713 307538
17774 307538 268999 248405 228610 227750 172024 95437 135505 192485 200097 217120 202965 180404
17762 180404 181808 176342 148231 107410 48547 58459 118390 98370 69168 16271 11458 25761
17750 25761 30301 1834 -476 15389 29338 16559 -10372 -11381 24171 26994 21142 48151 58924
17737 58924 44455 56351 48273 29967 77690 91580 67718 50835 42998 26202 6999 10722
17725 10722 14865 -5567 25699 85756 116898 141750 176218 156406 172757 174239 147284 155311
17713 155311 214108 260812 246776 208939 179826 154758 131399 151282 182978 167995 172622 194185
17701 194185 206401 184333 177769 185022 166984 127827 108735 91426 64916 71544 90115 85576
17689 85576 78410 86124 97096 98446 111690 109100 78360 69302 72481 72719 72411 54305 23846 35932
17675 35932 4070 18733 12531 41212 41694 17989 -23550 -28045 22219 70616 62271 1505 -22054
17662 -22054 7275 47380 29646 17565 20072 35122 63830 44035 68713 107146 27262 -32688
17650 -32688 -32367 -48708 -29348 31477 45472 48074 34199 10727 -25464 -41091 -35901 -52664
17638 -52664 -53121 2309 18249 7978 -6971 -22426 -31129 -36039 -61845 -67788 -21183 -9822 -10246
17625 -10246 13773 -30782 -21348 -13947 -31006 -31796 -12558 -32988 -69519 -72926 -85259 -87466 -41077
17612 -41077 -15654 -57343 -64016 -60109 -28027 18756 -15768 -57009 -83966 -115192 -96120 -63253
17600 -63253 -4347 4246 -48522 -75571 -20987 -25639 15979 18724 13534 580 -26831 -27810 -25404
17587 -25404 -29898 -18739 -16591 -12091 -11754 -36666 -51153 -52971 -34480 39197 17965 -2582 -24886
17574 -24886 -38649 -60370 -110028 -88720 -53618 -55975 5374 35965 9199 -58476 -71301 -59912
17562 -59912 -35004 -5967 -9841 -14323 -34642 -48715 -58174 -53627 -26992 -3379 25031 -12612
17550 -12612 -18460 -22578 -36305 -57833 -45208 -63584 -85718 -62213 -13007 -5955 -35101 -34599 -48535
17537 -48535 -70368 -52235 -62189 -55526 -38965 -20353 -13819 13354 -17292 -24332 -25915 -19677 -46337
17524 -46337 -73376 -52176 -63689 -58268 -58593 -27533 -31285 -18600 -3755 -45722 -108231 -151601
17512 -151601 -140504 -114331 -106378 -147344 -175004 -129445 -69896 -59196 -59137 -81393 -80466 -82766 -96653
17499 -96653 -82602 -45936 -69883 -61556 -93084 -109973 -68371 -28384 -28330 -25530 -41036 -71366 -24981
17486 -24981 -56059 -64501 -74508 -38702 -12888 -31467 -59302 -49549 -31911 29532 63174 31694
17474 31694 23700 72409 90766 75955 57514 -2569 -26800 -20046 -38011 -53331 -54502 -3269
17462 -3269 -6325 4291 -22185 -868 1653 -36886 -29468 -5757 -19439 -8265 4350 -6701
17450 -6701 -6389 13767 27686 15194 7312 -29927 -19950 53947 109831 138693 191006 224175 226916
17437 226916 274270 238620 188723 125399 77469 47612 15369 42823 63087 45354 53673 82113
17425 82113 97166 76404 83046 122047 105415 113319 114759 101973 77313 118178 163808 233481
17413 233481 266777 315740 374982 467302 530015 551038 571811 601821 647956 688018 746215
17402 746215 855084 979137 1137722 1295780 1488756 1714440 2001647 2365922 2823918 3500170
17392 3500170 4502491 5977965 8105801 10925286 13833105 15722047 16268742 15929999
17384 15929999 15039981 13774596 12484595 11777850 11978836 13124554 15330610 18677568
17376 18677568 22642557 26408562 29878525 32925222 34999834 36104291 36937607 37597150
17368 37597150 37022858 35184016 32982456 30960160 29350598 28600049 29347800 31335959
17360 31335959 33554403 35767112 38367332 41051459 42858881 43936440 44501817 43681543
17352 43681543 41058513 37368695 33512327 29761869 26337527 23787820 22357297 22031150
17344 22031150 22811051 24589948 26747441 28014518 27721429 26398701 24411472 21863015
17336 21863015 19124079 16775199 14994674 13707291 12709054 11880907 11161663 10519732 9956519
17327 9956519 9452712 8997403 8584540 8203521 7846807 7545837 7296725 7011695 6755587
17318 6755587 6505223 6287270 6115725 5992457 5841646 5644763 5441553 5226532 5008251
17309 5008251 4866534 4701056 4537556 4394287 4264923 4158045 4088934 4022478 3941507 3853706
17299 3853706 3687220 3565108 3492266 3403582 3313528 3247422 3135697 3076159 3037160 2935593
17289 2935593 2852996 2812369 2809646 2799025 2707641 2646929 2593288 2501625 2403198 2376668 2343055
17278 2343055 2275231 2196849 2197264 2198242 2180175 2155473 2126106 2051551 2002364 2007762 2010803 1952944
17266 1952944 1892629 1862345 1797826 1807762 1791165 1731727 1689159 1640552 1639553 1645932 1577324 1530536
17254 1530536 1474225 1461479 1446223 1429598 1401743 1362744 1379074 1366544 1337366 1314520 1294570
17243 1294570 1302219 1253283 1232561 1212401 1210053 1172546 1127766 1100632 1112556 1107881 1080545 1080774
17231 1080774 1072311 1049502 1000171 986199 1034232 1073832 1045954 1007676 998153 996691 987970 954438
17219 954438 906176 898696 948800 1008233 1055693 1055023 1010452 1021632 1087784 1088008 1058946 1074287
17207 1074287 1065349 1030470 1093795 1185712 1286332 1386112 1477095 1515357 1563809 1637756 1731234
17196 1731234 1822515 1956737 2176018 2413400 2654299 2953552 3299002 3778737 4445677 5432967
17186 5432967 6809423 8735339 11368665 14390045 17093466 18727527 19263715 19071993
17178 19071993 18457253 17706573 17337366 17896392 19588952 22126076 24592441 26277849 27371201
17169 27371201 28410956 29766486 31603311 33688682 35616843 37191836 38076054 37800797
17161 37800797 36528508 35039020 34071250 34039010 35077272 36765682 38408893 39714844
17153 39714844 40190997 39395469 37682977 35807721 34398539 33513038 32853436 31868894 30453558
17144 30453558 28767318 26898627 25033949 23595679 22911409 23148678 24084225 25016679 25201058
17135 25201058 24434191 22970776 21092027 18957045 16897999 15200469 13849671 12819948
17127 12819948 12021778 11362911 10713872 10124117 9614243 9178378 8781710 8405358 8108969
17118 8108969 7824612 7566992 7285514 7005916 6770889 6576593 6347410 6161663 5994337
17109 5994337 5821338 5682330 5557411 5374146 5186619 5013988 4874632 4734638 4603043
17100 4603043 4492070 4353672 4211200 4096773 3942713 3789294 3739030 3693536 3653976 3594195
17090 3594195 3487204 3433483 3355405 3256242 3163781 3060041 2988058 2918193 2902621 2847258 2794549
17079 2794549 2755529 2724647 2706381 2657800 2579752 2480727 2438434 2388100 2335646 2252100 2197418
17068 2197418 2186292 2186693 2169387 2156342 2077808 2009320 1959715 1978797 1950965 1876806 1804379 1795907
17056 1795907 1777108 1768793 1731820 1711890 1668188 1614040 1561920 1490325 1460020 1437904 1402717
17045 1402717 1380593 1316122 1274199 1271343 1287341 1318546 1263071 1215452 1281284 1310227 1294905
17034 1294905 1253232 1233344 1172825 1116521 1096131 1062878 1056174 1042929 1071758 1076543 1073910 1062436
17022 1062436 1008594 965349 957797 948043 962333 968549 941095 837857 792917 844765 880216 883487
17010 883487 850927 809649 781680 772176 761653 749644 773195 746193 732666 723680 730970 791995
16998 791995 754507 685386 676200 675912 685575 702544 714107 679213 601772 604700 658650 679406
16986 679406 663245 660614 650343 615307 597073 548676 559850 588431 588403 620420 604929 573423
16974 573423 564797 544018 496533 494987 491763 503026 550911 547482 530128 534582 498187 473469
16962 473469 485576 491866 472317 465981 458703 428698 422918 417050 390085 388565 379574 379838 359031
16949 359031 299002 294464 365384 423830 437202 432279 451052 430017 400642 406046 350052 362519
16937 362519 418984 441351 416420 403164 369905 308988 365629 365164 365531 350834 354807 361669 365034
16924 365034 392326 341786 295687 274267 295705 299790 279379 267319 304381 313672 288966 261192
16912 261192 285737 330638 362861 342868 311754 294864 301883 252079 226091 245559 245239 280078
16900 280078 316260 272329 243460 207351 200080 203053 200864 219605 241926 236474 248008 245725
16888 245725 207857 185565 214164 238185 242162 267917 275181 261248 247145 246382 255728 234730
16876 234730 218303 207618 225687 251846 268093 285352 242724 202970 210554 226200 237059 217686
16864 217686 194520 186060 175697 177103 189982 204279 178646 202157 176781 144640 130345 134060
16852 134060 143684 125369 145417 194112 206501 176974 172210 167668 175262 145089 107131 112806
16840 112806 106239 150700 180130 214691 212741 204160 177514 118883 127838 86945 118679 181643
16828 181643 207672 221985 198445 181655 162728 162081 162029 187752 174786 153498 179211 208023
16816 208023 226930 200620 157129 174483 177810 155312 120432 136979 177743 166107 161682 190623
16804 190623 205225 202211 195336 178620 173625 181430 159353 151084 167866 171172 171488 160264 151697
16791 151697 178676 197989 170799 182675 231871 241404 201330 196125 200447 253882 287999 289093
16779 289093 270156 291753 267703 280706 319675 319357 331674 342111 361249 367908 344822 306687
16767 306687 293290 300887 285498 299646 324026 356726 354875 346631 329736 339278 341650 326639
16755 326639 323866 303056 279791 274868 243252 230038 228475 246816 254457 242173 269382 309489
16743 309489 282947 285815 266112 239637 226615 229722 263408 268600 189340 119559 112104 157400
16731 157400 174683 214710 185785 149078 140093 142065 148014 150554 129953 101479 93700 107327
16719 107327 116662 102703 163969 192768 171136 107404 71996 88547 52214 27546 51626 58942
16707 58942 66247 91856 104372 76692 85193 85576 84099 70039 80934 114651 144438 145711 113625
16694 113625 132966 133025 110257 114796 102026 93412 108659 131276 171771 155281 187770 139960
16682 139960 146945 138495 120611 109727 133789 139066 149073 179662 203759 187141 153784 162948
16670 162948 164807 164057 163188 186859 168374 189888 211072 230016 219085 162873 117469 90133
16658 90133 116247 125818 94685 78706 101122 102145 113679 47930 36293 74485 68342 77759
16646 77759 76359 95988 116526 146480 162462 181985 144586 143268 140926 145870 157913 132191
16634 132191 137323 157827 140923 111529 125648 152547 162034 168942 226336 208910 180274 208435
16622 208435 228540 253225 265371 267535 279418 281097 255847 261862 258187 267452 302184 314048
16610 314048 309025 284004 273558 268848 271556 273348 290315 281103 340512 362906 286154 279023 304195
16597 304195 325563 299420 264928 245485 268777 286651 248468 185759 179706 170523 191359 212175
16585 212175 227749 250214 247868 246115 261266 242322 237753 249916 255932 245646 192671 153923
16573 153923 154175 172879 143000 142170 143605 135689 130409 168593 170995 109081 78892 86276 87061 70798
16559 70798 45798 42320 89308 121403 133735 98569 70975 67718 88690 77789 58178 51601
16547 51601 50759 22984 19727 87448 107042 88537 44080 21276 -7327 2864 65340 103623
16535 103623 109985 76697 31984 21519 59913 90648 71708 65241 75150 66386 104807 123174
16523 123174 104768 76992 50604 73365 81497 97327 53702 70769 48736 40483 42308 78277
16511 78277 85286 89481 68573 23513 55250 82135 56602 32673 -3763 22273 51356 33583
16499 33583 30579 14387 18962 51272 47111 17549 6398 28455 31786 23104 2013 17678 45623
16486 45623 5416 -21641 -6766 1401 85511 103017 46377 35089 76143 64077 50952 57654
16474 57654 76611 82030 125275 127784 110891 125171 140325 76299 2103 6892 56235 81611
16462 81611 96981 104674 81012 97301 108573 65125 18301 27457 47549 48195 52954 39782 70511
16449 70511 121796 103141 82234 76345 94696 86719 31345 27636 -513 26277 72837 97883
16437 97883 109568 131010 101061 78674 32968 22679 19493 37774 73053 67544 26423 -1525
16425 -1525 -21954 -16338 2617 1086 1430 24314 29205 -4691 -7759 42106 50343 82016 74162
16412 74162 85743 70889 48754 7426 -20275 -43151 -11800 29209 28606 44639 16491 -5953
16400 -5953 3260 -17602 23544 67677 85189 102193 73413 46617 7160 -6546 23296 72415
16388 72415 107747 106129 62574 46693 34230 51425 67531 55515 62389 45499 45824 84527
16376 84527 50870 49372 36410 33784 73136 60970 20733 -518 -1339 23609 33770 35481 43879
16363 43879 15058 317 1370 24686 31139 -42154 -24659 4885 -12218 -21287 14620 43530
16351 43530 48803 22114 0 56482 86518 73513 89217 74201 54840 48328 37748 39652
16339 39652 25969 -37644 -30025 19808 43418 67784 75634 69419 44349 27725 34800 66492
16327 66492 85915 99410 79624 76895 31355 -11217 541 26597 64454 62541 61829 69232 73288
16314 73288 41306 31053 69130 74630 58445 51403 41379 30528 47742 68931 66103 69294
16302 69294 9225 -17266 -29740 9390 74755 75158 77362 32853 38512 8250 2383 30143 36931
16289 36931 48469 49968 37440 -36347 -45212 10220 18354 22926 24647 35224 21950 -18835 -1924
16276 -1924 61960 84302 21425 -7011 -8970 1562 -20447 -33146 -20778 -40540 -56172 -26232
16264 -26232 -24286 -16089 16594 35798 66342 57114 69121 40050 -16096 -44696 -18071 46049
16252 46049 52536 38180 50900 11886 26821 30422 12605 789 14979 79782 86403 85243
16240 85243 90538 45177 23662 15068 46720 42423 69782 88634 72960 74429 48728 23425
16228 23425 36328 52043 48412 34232 -19557 -39427 -31087 5642 43940 48419 47633 21324 -17800
16215 -17800 -52979 -48577 -41801 13053 31030 36087 67439 55691 21346 29224 39484 33190 32874
16202 32874 32842 39667 39690 28196 40652 67642 88442 49545 35338 64929 75039 67959 77550
16189 77550 51618 -19467 -18859 6354 6655 5153 25459 69942 108377 113882 75620 72044 28261
16176 28261 22353 30001 47969 29999 44116 36141 20365 6794 16583 60220 80035 65649
16164 65649 36992 -13859 -59139 -70802 -22297 27497 1416 -26644 -17904 21995 -28112 -465
16152 -465 33896 64091 39248 3413 -15589 -30051 -16362 -39149 -50913 25124 61417 55762
16140 55762 42529 -13781 2318 -1496 33381 83958 83031 73086 89935 78717 39652 5123
16128 5123 -22120 6391 50824 66227 56381 44825 46544 48381 27170 11551 -11286 -63150
16116 -63150 -63867 14999 20749 -13794 -5433 -2700 7477 8080 30980 31722 77658 92704 26005
16103 26005 2360 -56 5289 54407 76851 20169 25577 33217 34640 34463 21413 6276 -5409
16090 -5409 15567 37740 75164 95951 68729 -15885 -73009 -53383 -8205 13398 37033 41561
16078 41561 38032 1726 8468 50076 61908 78510 49785 -5831 22761 42892 30564 25803
16066 25803 41869 -7808 -31488 6772 23191 30743 22520 32537 13890 40191 52127 32763
16054 32763 48653 75810 62871 67008 48018 40700 52580 43204 19489 17468 22498 18995 17318
16041 17318 36877 54027 90741 66858 68201 102195 104255 103695 114675 69336 7876 4837 38259
16028 38259 45007 12985 -31 -13988 -40233 -43823 -1316 12069 5869 -11979 -10093 -30145
16016 -30145 -9263 75251 116245 129783 154537 109776 63461 312 -47787 -43273 3654 9008
16004 9008 -4444 18261 -8111 -16317 5416 -3890 764 21800 49566 39283 50689 33545
15992 33545 28383 -31553 -54511 -35272 -40942 -14227 -11409 73 12477 -443 -10242 -28469
15980 -28469 -6718 43639 40565 51394 82054 44958 -188 -24683 -9499 -18452 5077 11092
15968 11092 25023 27913 24546 34316 63582 73758 35216 6087 -212 33471 22383 2627
15956 2627 13532 7479 1709 6325 42906 48528 28540 -19243 2648 35871 27649 38392 55393
15943 55393 56350 47580 -1577 -10855 17337 32936 11564 -9363 -8051 28548 68085 90999 50921
15930 50921 35096 56694 56450 52244 35974 35528 21003 34437 50314 19786 -16055 11761 19482
15917 19482 38900 44061 38461 23462 7317 11025 712 -45416 -40542 -53405 -75384 -62662
15905 -62662 -44461 -27746 -6037 -14461 -19932 31061 22998 20045 36120 42619 74633 76617 42040
15892 42040 7889 13522 41775 67155 23154 -29069 -24310 7459 72628 95884 2102 -21218
15880 -21218 11244 65821 86117 80841 27148 -17327 14376 -9916 -2403 11502 -22808 -62449
15868 -62449 -66237 -61319 -26422 -20117 21869 21958 -16407 195 30716 26641 11982 32093 46311
15855 46311 21644 13035 34154 36083 30980 41085 18641 -16230 -31373 -35753 23276 65344
15843 65344 47658 22690 56333 60634 86781 88364 88052 43482 38045 37486 50266 34996 35899
15830 35899 3774 -24112 -37723 -10164 -23205 -31148 -12374 -18364 -10417 -16327 12447 58452
15818 58452 29397 27307 55986 86087 88443 39785 30315 30883 4900 -42999 -24054 -20729 -21875
15805 -21875 -31333 -1337 22515 16271 -5819 -19226 -44481 -38378 20678 11054 -38461 -7592
15793 -7592 24388 42051 43182 18187 -6798 35580 27780 -2164 -55722 -49658 5202 20984
15781 20984 18211 -40323 -21175 34550 76385 56779 83077 61129 50625 23110 31854 34931
15769 34931 46251 32452 -2459 -6149 24861 31275 -14832 -39981 -30255 16592 56844 4845
15757 4845 -15543 -13396 -59365 -83812 -66444 -48283 -40251 -48324 -71618 -56437 7415 -9333
15745 -9333 -20880 -3253 46134 61129 38348 38008 36456 32483 53809 52311 18957 13862 37640
15732 37640 60162 121701 93804 75132 53816 36886 36338 47486 37171 40719 7697 -20422
15720 -20422 -29333 6582 -17723 -64150 -54787 -15388 8037 33107 22887 18627 62987 49010
15708 49010 24433 46981 54848 26406 13735 -27018 -2576 -5576 26402 47144 12706 -26264
15696 -26264 -27741 -76755 -65086 -22327 20120 13735 14306 28784 42840 65981 54549 25303
15684 25303 53356 65284 80419 50861 35240 24638 7279 -36008 -28513 -11120 -907 -451
15672 -451 -44606 -54522 -2931 40497 66016 73576 69062 81836 42917 -20970 -17487 21408 1055
15659 1055 -18094 -18885 4702 -7563 8174 14524 -8840 -18346 -6080 -17196 -12451 -4530 -57899
15646 -57899 -23378 17723 30868 54884 40520 -8156 -37230 -30311 -37556 -87255 -101261 -45834
15634 -45834 28090 46760 62656 78914 108069 67560 50377 49759 27862 25645 38168 39466
15622 39466 17866 18154 20103 22466 21707 38921 48777 49114 42539 31584 11619 -43975 -73971 -36264
15608 -36264 -13256 8810 -9220 2608 20033 54940 87476 83334 15920 11850 -6343 -50142
15596 -50142 -26954 54458 47466 25149 -15488 -63391 -49546 10014 57340 1043 -39648 -46691
15584 -46691 -53637 -25251 4093 23406 14962 -5602 -13360 3345 16146 7356 10825 46112 40847
15571 40847 56802 60582 42997 27965 29154 30151 30567 52687 46153 86896 89197 73456 11198
15558 11198 -33077 -11152 -7929 2238 16987 38189 41366 31284 44325 58790 54731 50190
15546 50190 29673 7000 10180 9593 -3106 -9969 5188 42294 58257 33197 45267 26219
15534 26219 1259 -1486 -10895 16553 27658 25683 -202 -994 -3958 7758 -25305 -27558 -1904
15521 -1904 32220 49543 48689 52049 13964 -52287 -35618 8120 8984 5956 22553 43556 34770
15508 34770 14530 15904 10855 12683 40805 87128 65441 33091 23265 -5508 -3629 43842 78300
15495 78300 48580 27585 -2703 15620 44565 30775 40562 40020 52116 28557 -1458 -13309
15483 -13309 -10113 23544 8776 -6918 -28286 -23166 -30168 -34317 -12391 -11141 -25804 -8822 -68673
15470 -68673 -100882 -72588 -25256 -13874 -18445 -22060 -29920 -10646 28482 53590 31863 -4582
15458 -4582 17825 31909 12729 19287 -5940 -47712 -85314 -27284 10194 46629 11700 -12379
15446 -12379 6648 -10108 -66389 -49241 -13275 -12418 3851 4487 -31356 -36586 -36288 -46371 -42036
15433 -42036 -47343 -113514 -79260 -10920 -1692 26513 39512 35670 35327 31266 38741 39467 56440
15420 56440 63137 42953 37704 60501 53552 31227 -10878 -13621 55952 102490 63734 -5147
15408 -5147 -13109 2358 -28484 -31920 25995 32043 30184 29375 51101 35472 -9151 -35022 -37826
15395 -37826 -18448 6998 -10249 -5123 9980 -28799 -44394 -30045 -35069 -19177 -4266 -10762
15383 -10762 -7567 -29315 3517 11291 42748 29406 -6538 -57276 -88544 -53321 -27984 -8824
15371 -8824 -12157 29114 53233 55917 47689 -942 -47418 -24931 2561 -12814 -21632 -2368 65625
15358 65625 46225 -13842 -39459 -20888 -26864 -42313 -40084 -59728 -76407 -58156 -43872 -65406
15346 -65406 -59115 -6783 38449 36336 32705 21101 -15265 -18254 -17665 -24038 12364 16322 1451
15333 1451 -11963 -28367 -26051 -36380 -53333 -18491 6395 47972 20907 -31907 -21303 2570
15321 2570 28685 34921 60219 49392 45051 66500 95278 87726 40843 38362 70235 95187 69372
15308 69372 72644 85713 91989 55547 33480 35415 16767 48634 58388 42007 39671 6860 914
15295 914 -44352 -67933 -53998 -31564 -33557 -41356 -34836 -17285 34716 25359 -1731 25053 63947
15282 63947 82827 16033 -4285 -44500 -50369 10563 29103 -5528 22801 27516 57117 44224
15270 44224 30705 39504 41155 40968 15298 -52113 -14721 18689 7751 -49159 -85542 -89332 -65509
15257 -65509 -37511 -33796 -1805 -9159 -28838 2389 31734 47745 54913 48374 15549 -37429
15245 -37429 -33553 -38872 -19340 6020 8464 -10636 -5018 31664 14655 24209 34047 23584 55980
15232 55980 62090 27800 -8805 -38267 -34404 -49779 -59739 -67691 -86156 -10181 3655 5111 -21249
15219 -21249 -1399 -10456 -10962 -25637 -8990 19263 37534 30038 6234 19999 24025 39539 50232
15206 50232 54575 -3744 -55810 -31958 4858 18331 26456 37115 3645 -52012 -62322 -37333
15194 -37333 -16029 11596 -7474 -54584 -56140 -31968 -38794 -50313 -72986 -51650 18215 68833
15182 68833 43332 -7898 -65559 -48228 -42422 -32052 -58767 -45978 -16336 -9295 -25087 -61769
15170 -61769 -48776 -33806 -32232 -24673 -24965 -2811 30478 28405 26798 24658 18185 12398 21843 49870
15156 49870 16116 -14267 -27610 2718 60561 102529 45918 33396 27549 -24584 -55368 -46818
15144 -46818 -28127 13775 36606 8383 18687 -11175 -57911 -64462 -59844 -20636 -470 -11585
15132 -11585 -8964 -14304 -14911 8 -43748 -46216 -58765 -37353 -30721 -44638 -29774 2818 26765
15119 26765 74537 53612 61474 53859 31653 13886 3304 -16985 7574 38884 26470 29420
15107 29420 40513 12626 -3808 5783 2049 -31320 -62291 -53287 -5566 43105 39619 23161
15095 23161 18697 -3455 -23968 -35166 -46488 -61327 -31780 -23869 -15188 -26018 -21184 -33015
15083 -33015 -22149 -44501 -42553 -61197 -32853 -5319 -3528 15393 24228 -3268 -22654 9903
15071 9903 25542 -15947 -28612 -17190 9395 43946 69287 61661 55363 38894 13792 2156
15059 2156 35271 23557 -11706 -37156 17669 3999 -28809 22958 47870 60708 -7539 6795
15047 6795 8682 -17427 -17548 -28994 -68963 -56166 -44020 -19162 -26882 -51928 -33256 -18236 -51777
15034 -51777 -35011 -298 34698 53976 85581 56373 25044 26405 13379 13420 50783 52183 38242
15021 38242 50133 -3687 -1270 -13879 -39137 -21137 -9136 -8916 25488 45794 31112 26040
15009 26040 22086 -4746 11660 37806 10112 109 13323 51945 40768 -43684 -104489 -75420
14997 -75420 -13413 -7338 -19416 -25613 -30263 -38342 -57193 -54139 -31268 -14446 -3853 11977 -5934
14984 -5934 -31112 -46682 -20531 -32016 -31558 -29903 -20026 -13749 -21095 -61038 -76475 -49035 -23179
14971 -23179 -27594 -155 28074 15895 30500 23079 -1931 -30750 -217 16627 -26918 -16736
14959 -16736 -11230 -46505 -46175 -14114 3668 -8129 -35538 -45763 -67033 -50303 -81765 -98986
14947 -98986 -34745 7133 20801 36168 43347 43374 22717 -55405 -31705 5478 21705 9974
14935 9974 19739 10496 223 36623 20217 15558 5012 7505 29690 70062 21627 -16371 -17642
14922 -17642 -46424 -17709 -6342 -9687 -9766 -207 58377 25699 44417 26074 22975 5094 -2978
14909 -2978 -11945 -29116 -35557 -26487 -40626 -44054 -4065 8050 39627 59268 61931 21357 6186
14896 6186 -23978 -3550 20414 35915 21618 9734 -21633 10933 15192 16467 -4256 -11709
14884 -11709 -48289 -38192 7448 -17405 -45241 -73735 -37266 -6041 -19785 -43887 -54563 -43204
14872 -43204 -28095 29561 51412 29152 23356 -19937 -64642 -72710 -85805 -45331 -5407 -3026
14860 -3026 -44709 -50717 6505 26173 37298 39530 45416 26887 -6841 -19394 -1521 -661 -10804
14847 -10804 -12732 -10855 -15196 8908 31150 28861 19847 58596 40235 3362 -48806 -60059 -68951
14834 -68951 -76212 -48521 3006 12304 -26058 -66795 -36402 -65589 -63884 -28246 -4332 8389
14822 8389 40048 -10877 -8505 17001 15119 472 -19555 -15830 -9916 -2105 24517 31528 79490
14809 79490 72955 45454 19568 22094 2113 13637 25496 8717 -7616 -33583 -30008 -49369
14797 -49369 -58175 -31148 -32514 -65385 -86894 -60650 -48667 -60541 -76763 -44385 -18060 2861
14785 2861 15188 5659 -11195 -3848 30376 55281 37644 32067 29453 33074 -12595 -12534 8396
14772 8396 7811 44639 30946 16124 2601 -20055 -34290 -48278 -44345 -25532 -17094 -62706 -118039
14759 -118039 -108608 -83254 -96768 -74201 -55050 -24254 21096 50654 38309 48138 51869 24597
14747 24597 -14108 9346 52481 36492 17747 15552 3922 -14353 -14383 -22772 -6228 -23356 -52091
14734 -52091 8783 3440 -12994 -11910 -12 24085 37773 6813 -38107 -31709 -46335 -34018
14722 -34018 18306 10276 -34836 -69440 -49741 -29358 -12527 22914 45579 47892 35351 11352
14710 11352 -4525 36581 58932 -15788 -55879 -52339 -40851 -36442 -27133 -3911 -32199 -82185
14698 -82185 -70175 -83642 -92620 -47049 -10452 -19851 -19888 -4118 -11609 -31960 -46176 -41535 -70556
14685 -70556 -57938 -49304 -19395 12683 8312 -11074 -36113 -44046 -46593 -33313 -27460 -990 31862
14672 31862 32270 21976 9125 19306 35232 20505 6098 8838 21150 3513 -9982 -22040
14660 -22040 15835 21236 -11230 -24108 -14441 -28488 -12036 -3281 31818 111330 100681 69594
14648 69594 98830 60867 36702 -2345 -16933 -31853 -20597 -9492 2315 11793 4500 29596
14636 29596 45447 23614 2229 15139 6415 -6538 6133 -2685 -37028 -39695 -14569 -16508
14624 -16508 -45424 -59231 -67014 -39356 -19391 -19866 -18248 -28152 -14282 4264 -12671 -16681 -24287
14611 -24287 -145 19648 6985 -19543 -398 2397 1574 14032 13260 48511 47539 7200 3208
14598 3208 -27452 -19055 -69847 -19080 10363 16281 43392 52239 67316 83543 76688 72187 63519
14585 63519 -8482 -47992 -56580 -53753 -40128 -61222 -63196 -74224 -48235 -38443 -19414 -56257
14573 -56257 -54521 -29375 -37251 -39516 -52291 -59086 -58239 -17800 -8665 8410 2106 -35115 -19812
14560 -19812 -55490 -41444 4206 -3109 -8587 -52975 -54076 -11050 39757 72738 32688 40917
14548 40917 69362 31669 8944 -1895 -46146 -88814 -81330 -44013 -26124 6139 27411 4963
14536 4963 -25756 -36977 -9645 38102 84577 44520 52982 74442 54005 23676 -2173 -37262
14524 -37262 -62523 -76114 -40525 -37565 -5592 155 -8404 -16869 2764 -25898 -55815 -35252
14512 -35252 -37844 -40671 -16554 -1250 3555 -12438 -23591 -31249 -57335 -57013 -1746 23087 20328
14499 20328 8596 -3390 1008 3553 32114 -5008 -77925 -76691 -57108 -78565 -73511 -56710
14487 -56710 -54556 -83712 -116956 -58945 -2908 -9898 -12999 -26303 -47795 -26821 -49366 -81560
14475 -81560 -85077 -60801 -35164 -44403 -55779 -51950 -24675 -21911 -33759 -10358 -23165 -29709 -5292
14462 -5292 -26213 -12474 -33457 -77462 -104837 -70051 -10800 -3068 2961 22858 29136 80481
14450 80481 118580 109567 110522 62124 32349 8230 24841 24763 -17603 -39875 -58403 -55753 -25986
14437 -25986 -5792 10399 46932 58540 54216 33144 24867 12567 9532 33993 28031 11096
14425 11096 -3211 -22770 -19556 -19626 -34513 -8068 32945 -7933 8257 6362 20544 14742 22530
14412 22530 41992 20339 -8737 -15452 -14359 18748 28341 71441 96388 109814 74400 42991
14400 42991 10933 9909 -18012 -38629 -19030 16130 -8848 6949 37616 39924 18424 9695
14388 9695 -10821 10693 27251 7444 10378 2423 9932 -31471 -67045 -89347 -64869 -47358
14376 -47358 -45375 -39821 -82883 -96154 -76545 -71966 -35711 -36843 -63444 -68031 -38388 -27971 -18604
14363 -18604 -45400 -42222 -18473 28160 64117 69131 68201 30034 -37864 -16033 24706 73874
14351 73874 92214 52748 74605 78792 85824 46479 22202 -28 -10292 -21227 -19475 -19488 17971
14338 17971 11693 24256 -1596 -33509 -56159 -29733 -51034 -106738 -102660 -49045 -20278 -39184
14326 -39184 -16748 -19368 -739 914 345 4327 2504 -43631 -46661 -57370 -37048 3428 19777
14313 19777 26087 -6525 -23884 -19250 -37471 -37701 -19820 -14934 21097 27216 29421 17463 34607
14300 34607 25501 24789 35145 20583 -16675 -62361 -14025 3295 -5762 16695 18898 59118 83508
14287 83508 57199 19775 -21983 -41521 -52245 -52509 -27924 2759 -18113 -32497 -25490 -23646
14275 -23646 -32454 -37144 9983 29777 44739 1150 -36500 -21434 17839 16751 24973 30221 53296
14262 53296 71409 80594 53999 35561 48819 36719 58774 59254 30530 23628 4800 -13081
14250 -13081 12548 49071 67469 18599 -63554 -64670 -31579 -31003 -25419 -2807 -27163 -56014
14238 -56014 -57037 -44831 3064 -23749 -23131 -14419 21333 2352 12410 -1685 396 43204 62038
14225 62038 37728 20595 37496 17662 824 -14169 -41551 -42329 -10946 12846 34609 24063
14213 24063 7588 -362 -14756 5060 2822 8661 39409 70887 55271 26553 -25516 -25808 24333
14200 24333 7586 751 33985 49876 56085 33117 -33723 -71626 -55546 -59859 -21005 -1347
14188 -1347 -21875 36787 64652 9817 -47822 -43277 -46426 -83153 -98158 -79709 -72735 -33212
14176 -33212 -39460 -12314 545 3945 -7186 -2237 27505 46780 -561 -16767 7054 -20229
14164 -20229 -37843 -33725 -47961 -47765 -41675 -7523 -3482 -62752 -37902 -58724 -45685 -8465 -2616
14151 -2616 -45805 -33109 29839 -2087 -32764 -34044 -78023 -74483 -59045 -58340 -53996 -20893 38306
14138 38306 33997 -8507 -55986 -56477 -59236 -75416 -3889 51243 72574 102444 72637 9946
14126 9946 5450 -9016 -45614 -17547 -44120 -75844 -67152 -61286 -27270 -35382 -7851 -25843 -47895
14113 -47895 -45318 -75503 -65643 -30227 11388 42728 57983 6661 -29554 2693 2982 -16664
14101 -16664 23828 38365 47173 18992 -11631 3016 26333 8229 -64751 -134780 -109465 -26786
14089 -26786 1152 -17557 5287 278 -10796 10866 12069 -10617 -26542 -53583 -52226 -27159
14077 -27159 -25668 -54261 -78309 -59024 -22586 21374 38756 43630 8101 30669 61892 66676
14065 66676 83916 49425 24793 1608 15046 50052 20428 -23031 -46824 -40475 -16551 108
14053 108 6672 13462 22266 42936 40885 50674 14093 -5315 -31402 -33894 -28298 -33187 -25818 -60903
14039 -60903 -63366 -63895 -34056 8737 12906 10124 2580 21572 -16988 -58964 -57260 -52873 -35085
14026 -35085 -33369 -7776 36071 46224 46127 44552 56067 74690 111501 97140 70154 36419 17237
14013 17237 -50754 -22070 3079 -6491 -15376 3349 5305 16078 18274 3936 -9108 -11571 -14949
14000 -14949 680 -9782 -3078 29933 6615 -39754 -44411 -37043 -48551 -33996 -29235 -27038 -9048
13987 -9048 -11565 10944 -23530 -8535 17597 48815 76698 39748 -8433 -49868 -41294 -46460
13975 -46460 -2754 11897 11919 5224 -44543 -136784 -119290 -78904 -20248 -5711 5927 9183 -41076
13962 -41076 -63086 -58894 -39166 -22112 -587 48096 54241 24476 9257 10036 28386 43519
13950 43519 52103 70859 58909 23620 16946 15036 -33045 -67257 -55189 -61027 -35455 -5181
13938 -5181 -14254 -37649 20200 31155 14597 33712 73558 49129 19778 54343 75105 61220
13926 61220 35510 135 -47359 -32206 -37125 -54970 -85549 -64009 -38599 -50430 -78693 -55665
13914 -55665 -31295 3118 34639 46644 73009 83946 83230 40872 43379 72599 94186 30759
13902 30759 32856 37925 46845 15169 -26247 -47138 -42817 -38415 -49448 -25423 -31764 -44718 -19085
13889 -19085 -45487 -74479 -67420 -33335 3395 -36180 -40910 -12676 12159 45062 50599 19441
13877 19441 8352 20760 22290 5948 -7484 42233 103785 63627 27870 57224 49703 29334
13865 29334 7083 25198 4360 -30511 -67889 -60955 -45173 -72020 -79061 -54696 -50896 -4466
13853 -4466 -14759 -40768 -30655 18609 45378 48248 44673 36739 31182 53969 85499 93314 41933
13840 41933 -11516 -4639 21528 8887 13413 -4918 -6955 -28908 -15384 15671 28433 -12688
13828 -12688 -24105 -48859 -75522 -53729 -37608 -6520 -9215 -24811 -13911 -52861 -28610 -23250
13816 -23250 -28094 -26851 -77143 -92534 -92103 -33236 6875 -1131 21214 22376 41746 39499 31630
13803 31630 -1443 31239 -32624 -77504 -74628 -101005 -75162 -30029 -43067 -22834 -3608 -5872
13791 -5872 32713 67724 49912 57730 63996 57478 7912 4839 48281 69558 61231 30006 6452
13778 6452 -7094 11840 15472 15406 -3888 5924 27558 -1393 31352 70394 52415 19347 10305
13765 10305 -10569 -7601 -2172 7815 70521 83295 68223 27282 -1092 -742 14465 65283 59476
13752 59476 52399 31313 -19105 -29468 -32815 -5314 54099 53855 5953 -7949 -10437 10915 19741
13739 19741 35002 9078 -16752 -41526 -18227 20365 53506 80399 63578 56573 18781 24358
13727 24358 46936 30165 30276 947 -28940 -43530 -89841 -89717 -67428 -27282 -66533 -79547
13715 -79547 -47834 -35995 -57155 -62667 -30999 22910 56504 69783 72027 81638 29766 28522
13703 28522 80739 100070 66690 85021 89292 5269 -9306 -8019 15689 12151 26912 79043
13691 79043 112129 69249 20445 -11479 13618 10370 23968 51338 47638 29112 -8054 -28649
13679 -28649 -7563 37589 41274 3955 -7528 9669 11393 20930 71002 68174 20732 3383
13667 3383 29474 15572 15449 -12350 -14048 11382 7160 -16447 -17673 53626 90218 41659 43901
13654 43901 56067 32516 13661 -21614 -34608 -32713 6765 11074 5153 25429 -7328 -46708
13642 -46708 -37271 -18732 -29957 -25873 -5602 16691 14647 -22299 -13512 -4879 -8464 10944 15438
13629 15438 -1619 13212 57166 67141 34687 18143 5533 4081 -4530 21026 31508 18398
13617 18398 2075 27786 22665 39513 63610 52813 66756 34394 20249 -4414 -13587 -1368
13605 -1368 11453 -17530 -16151 8798 37004 34574 24198 -7405 -19087 -8236 26754 61609
13593 61609 18273 22596 53755 67068 21420 -20594 -7103 -1721 4238 28403 51331 74664
13581 74664 43529 -1806 -447 -3068 2493 959 32037 41991 3940 -30757 -11964 -11551 9272
13568 9272 21002 34591 53261 59879 50507 7891 -48972 -71342 -115586 -108595 -107202 -93576 -82880
13555 -82880 -38698 -44768 -50941 -62334 -35397 -3110 20069 42249 56965 47526 3581 12037
13543 12037 17778 8438 1525 -17542 -59641 -82162 -75730 -52900 -14751 -2074 5140 -3604 -9734
13530 -9734 5250 -16423 -38854 -60330 -55782 -5270 8340 10002 -16376 -31808 -48942 -45545
13518 -45545 -57965 -63056 -72674 -102185 -87605 -42827 -54508 -36547 -2622 6249 -25694 -33016
13506 -33016 -19142 -36679 -22628 3898 13635 23822 25846 5238 20310 -10814 -14601 -35151
13494 -35151 -49245 -54739 -70455 -63733 -30289 -18387 -34467 -23933 -20057 -18322 -70189 -61695 -51015
13481 -51015 -52308 3954 44130 7601 -73751 -75808 20676 83633 86674 69264 60347 45866
13469 45866 20748 15173 43188 20827 -26722 -53394 -28328 14584 14376 2417 -6700 -7276 1647
13456 1647 33297 76557 38746 -991 -33966 -64744 -31370 20236 37087 -2906 -50243 -4891
13444 -4891 29895 46875 57804 46895 -1908 227 5040 -4138 -4948 -7441 11456 -8822 -9404
13431 -9404 -10485 20731 43402 13382 -30123 2248 -17165 -81730 -71780 -61121 -80517 -68638
13419 -68638 -27132 12426 25306 14667 -18204 -37190 -36485 -73247 -86020 -62946 -79837 -61739
13407 -61739 -84305 -67030 -10871 -641 -19346 -55072 -34198 -21420 -27469 -30738 -44861 -56080
13395 -56080 -76228 -44536 -4559 -18774 -53652 -35464 -46505 -74558 -50000 -19949 25304 52144
13383 52144 67759 78970 49358 32016 -9281 -24693 -18084 -51075 -44270 -14288 8036 22495
13371 22495 -10642 -33169 26389 71707 59347 23866 26906 77966 59014 37956 17449 21018
13359 21018 -279 -42099 -32198 -48272 5596 48955 8731 13825 15260 10095 27868 54040
13347 54040 59259 56818 27872 -7453 -39707 -23214 -734 46947 28868 4075 -16792 -10354
13335 -10354 7953 -5166 -30816 -34530 -48868 -57185 -19192 -141 -50788 -83425 -48892 13897
13323 13897 37791 25181 15140 9676 -20384 -36231 -66519 -47909 39724 54886 24591 6928
13311 6928 14146 3523 -11612 -22566 -14743 -9001 -45608 -40762 -42808 -15687 -14914 -26720 -33046
13298 -33046 -27991 -29655 -18003 13727 -4038 -15802 3995 -3708 -19257 -10361 14971 3768
13286 3768 32904 61275 28084 13802 -16350 -19970 -13359 9327 36890 68543 72318 40224
13274 40224 10934 5699 23276 38779 44454 51288 27345 16243 -16749 10453 6262 -4374
13262 -4374 -4704 18896 6092 -30832 -13766 46894 69504 43745 3154 -23931 -16356 -15789 3393
13249 3393 14164 1548 -18450 1904 37101 46811 49243 25492 1217 2827 7365 -2474 11045
13236 11045 21414 44974 17844 1825 15672 -57849 -101007 -107877 -63724 -24487 -7448 -10414
13224 -10414 -37606 -44723 -71554 -83567 -103197 -71057 -4517 4238 18070 45448 61656 55078
13212 55078 1921 19306 34985 48848 52046 46539 64124 70964 37721 33276 29893 -30692 -83190
13199 -83190 -79426 -34820 8533 -12466 -12776 3683 27512 73713 98451 92404 63889 37473
13187 37473 14548 6286 -3168 -8128 -2727 -2590 -7666 27395 51635 47564 19335 6512 4449
13174 4449 -2319 -9769 -7916 -5672 -7727 -20813 -64692 -33332 -7616 -21074 11584 34655 56730
13161 56730 33007 10468 -9545 -30840 -53777 -34683 -8091 -7167 9341 15714 2130 -6244
13149 -6244 -15225 40964 43086 16912 8951 2367 -4658 28012 19663 3364 17962 10783 -3083
13136 -3083 -39502 -51900 -34475 -15387 -19653 -53510 -28911 16875 21026 11365 -8173 3177
13124 3177 4433 13275 -22698 11137 80604 48010 4728 30755 79808 45945 20910 20984 -2631
13111 -2631 -31597 -51055 -71613 -79767 -91644 -46502 -6524 -21455 -28955 -6236 8404 19089
13099 19089 34193 17161 8155 16537 720 -4199 31105 52830 32672 11402 2454 42842
13087 42842 49078 23136 22189 17233 -27198 -45011 -2060 14482 11035 -10224 -80680 -101771 -93372
13074 -93372 -45980 8512 16619 12696 3743 55089 67144 31273 -13690 -25465 -25614 -10637 7210
13061 7210 15676 259 -36179 -27059 24532 40362 -11886 -32898 -11697 -7581 -15413 -8437 -21507
13048 -21507 -18605 -33607 -91473 -114676 -62941 -61843 -71771 -37020 2139 18066 -14376 1728
13036 1728 -6659 13059 17968 -9479 -44490 -4550 3368 22264 57842 47187 23707 -7013
13024 -7013 25319 46785 40329 2609 -3946 -1861 4092 13728 20020 5219 -12135 -40770 -80032
13011 -80032 -61693 -8596 8549 21694 48554 47523 16005 -6942 -726 -8594 -267 -24386
12999 -24386 -43514 -40306 -49475 -46811 -20975 -27794 -43697 -55079 -58710 -25989 -27392 -38047 -47760
12986 -47760 -10763 76868 44552 1987 -25436 -36272 -36179 5370 82457 84220 19631 49355
12974 49355 57542 -1755 -21657 -53334 -40750 -23621 -41619 -26461 8228 -1204 -14191 19689
12962 19689 -32308 -46642 -70199 -65998 -22689 -22370 -39389 -46258 -32268 -32724 -16556 -21106 -26363
12949 -26363 -13142 -7729 -3947 -16673 -12686 -9032 5117 -5378 -1354 24452 14055 -42376 -44494
12936 -44494 -43958 -39843 -57012 -68482 -59542 -31749 5323 61223 50267 17175 546 -3166 -376
12923 -376 4814 -12997 -19317 -58687 -97724 -117208 -148651 -142059 -101297 -23909 -2726 -17242 4155
12910 4155 55099 83381 65810 5218 -56418 -44662 1629 -20992 6736 24936 10105 -45316
12898 -45316 -49910 -7895 8819 -24001 -25347 24869 56592 75240 68716 67549 62565 102551 99773
12885 99773 42724 -2041 18509 35722 31784 1051 -1968 -11530 -17020 -17912 -16571 -35084 -45849
12872 -45849 -46553 -34441 3286 23316 53393 63009 -13953 -54065 -12458 -841 80429 91891
12860 91891 23984 -47187 -79062 -19062 -1044 11215 1618 11337 27641 14834 -26319 -22663
12848 -22663 -35782 -70861 -17540 65694 52380 54011 21235 -1599 -21424 -21041 -37175 -35415
12836 -35415 -27504 -51347 -37087 13382 48452 78194 78434 83083 115284 134491 76940 3852
12824 3852 -26758 -14123 6903 47718 68674 92455 102709 59859 71504 67830 40895 43074
12812 43074 31987 48560 33648 25667 15527 28479 28437 27508 40107 20684 8249 11385 -16953
12799 -16953 -61266 -70361 -49700 -50275 -30855 4305 51625 79312 24994 41100 26649 776
12787 776 -1111 -1859 3877 10109 15798 22452 31570 35642 35337 23117 35679 44317 45500 62788 18138
12772 18138 11118 1229 -20491 -16267 -19845 -32604 -43837 -60261 -38052 7701 28466 381
12760 381 -10631 -22477 -38426 -64214 -50487 -54623 -61855 -38669 -53859 -70719 -41707 -17680
12748 -17680 -16664 1462 17583 -4037 -29471 11780 34924 12645 -18792 -34963 -47128 -88800
12736 -88800 -39548 7021 3911 -43268 -84915 -82684 -89098 -47701 -36364 -45729 -20057 -10303 -33439
12723 -33439 4455 36712 9611 -3291 -39295 -25721 -28595 -51030 -72338 -67827 -77322 -85734
12711 -85734 -106066 -75721 -64527 -61290 -32882 -1256 21548 33909 -13670 -68376 -56669 -61046
12699 -61046 -12073 -3108 -19467 -32879 -8238 -19878 -1905 -17752 -29054 -7545 34386 75027
12687 75027 39730 14117 -22120 -65384 -48872 -14669 -3924 -17080 -25004 -1186 -2500 -34472
12675 -34472 -13229 787 60026 54842 -17630 -42127 -17493 -16967 -7944 -33390 -39595 19366 18923
12662 18923 26225 47757 498 -30229 -63593 -73155 -75223 -1420 10342 -26507 -42951 3126
12650 3126 -14029 -6847 21896 55773 63199 61076 36429 -21950 -60294 -31659 -22027 -77614 -116839
12637 -116839 -121403 -106029 -55510 -53479 -33145 22450 46600 14034 -9885 -76824 -82061 -38065
12625 -38065 -11567 36994 26679 32064 -6318 -605 -4604 -25496 -18670 6809 40760 21713
12613 21713 -12754 -580 45863 60760 26112 10676 -13542 40065 32742 -18812 -39511 -38687
12601 -38687 4308 19173 11608 40453 31988 13692 -19176 -13891 -7948 -33217 -51427 -14479
12589 -14479 4516 -17273 7011 32260 49094 60224 67755 19643 -13822 -41494 -80300 -75715
12577 -75715 -57731 -61935 -27998 -24764 7699 -11380 2174 -3789 -26968 -39979 -71640 -103801
12565 -103801 -88162 -27599 -317 -29519 -19051 36432 -13000 -47764 3602 6323 -43492 -36740
12553 -36740 35470 70472 27609 3152 1032 -9267 4054 30101 50209 25550 -16440 -29676
12541 -29676 -46656 -28703 1984 37474 24880 24906 12636 -41889 -47228 -57062 -34391 -20861 -11431
12528 -11431 -10810 327 -30111 -51584 -64360 -30885 -25093 -26513 -16259 -9243 9004 7630 -45147
12515 -45147 -44426 -7782 38710 44200 21706 -8672 -39281 -48096 -19450 -30464 -27510 -1105 12326
12502 12326 23164 45624 21378 -5646 -21229 -46911 -40552 -4501 22455 9031 -14902 15701
12490 15701 45767 61215 66903 56308 75688 80693 44558 70299 107974 150805 236339 347525
12478 347525 407089 394056 321487 290770 314754 248416 192229 132302 125128 124467 92548 72888
12466 72888 103072 43561 36576 63991 42905 50451 41245 46130 46496 48193 20881 35605 38778
12453 38778 32290 6725 5857 15960 -12036 5873 16375 21273 54889 47282 50831 51158 51592 45766
12439 45766 33975 -14757 14820 44234 56110 52063 49705 -6443 -76386 -57968 -65737 -76253
12427 -76253 -37758 -19520 -39194 13731 17015 9184 28152 21936 -17550 -29343 -56375 -54261
12415 -54261 -32786 -40630 -10078 21343 37406 89967 104043 76202 30118 11212 43089 39179
12403 39179 6866 -7446 1135 19963 47212 40540 32097 14185 23990 38640 37430 19440 -20160
12390 -20160 -35633 -49674 -84145 -92919 -50122 -23726 -10384 -1448 12675 -11512 -57146 -46069
12378 -46069 -22160 -6666 -24512 -30970 -27593 -31618 -49869 -55179 -44672 -42589 15100 994 9618
12365 9618 30342 17122 -14474 -66121 -48761 -30368 -35628 8989 19287 -18247 -37364 -62806
12353 -62806 -30591 4378 -2593 -24496 -51629 -79439 -51758 -5256 28087 34572 -5015 9530
12341 9530 23896 15909 -11174 20578 58614 56249 64327 34882 11838 20789 9458 16949 42328
12328 42328 20949 2469 -37825 -18542 -12612 -52927 -82220 -48560 -19533 -37241 -21985 -61476
12316 -61476 -111297 -97136 -50675 -19576 40293 38348 -11751 -90665 -70523 -37698 -12552 -1976
12304 -1976 4645 49314 39238 -1122 -39315 -21284 -15040 -39391 -27044 -13269 -6666 -32631
12292 -32631 -32992 -31769 -48499 -65617 -74372 -42687 -39035 -63486 -105307 -73616 -35061 -20082 -42161
12279 -42161 -70389 -55373 -6545 28095 8539 -67230 -99772 -82243 -72430 -67957 -50835 -31630
12267 -31630 -4735 34763 81782 79715 99591 96558 35525 60521 36089 4123 3111 -20300
12255 -20300 -24365 -44517 -82204 -81479 -83328 -52153 17914 38533 363 -15820 21501 51991
12243 51991 51076 41426 62594 88306 106624 79559 29612 -31278 -24821 -11253 -23127 -22041 -28353
12230 -28353 -27290 -24890 20131 -5156 -37287 -20940 -9379 -6941 58521 84195 89089 26294
12218 26294 -31933 -47677 -26337 -6042 -18029 -52675 -57129 -42813 -36439 -16436 -14746 -9928
12206 -9928 -32299 -50934 -39695 -53641 -94080 -32999 -11017 -30118 -64955 -43430 -42974 -74511
12194 -74511 -52369 -17146 -9991 -15948 -4414 19394 -9683 -52457 -75446 -61218 -28788 -9910
12182 -9910 -8950 9064 1515 -33592 -16107 -42386 -47237 -37300 -41050 4322 4773 -35226 -48645
12169 -48645 -9808 5374 9897 12592 -5290 -24105 -54787 -80176 -120211 -156719 -129832 -113626
12157 -113626 -83227 -55647 -80816 -76218 -31484 -38135 -29233 -13308 -7122 13510 11160 20840 -7185
12144 -7185 -28191 4816 6207 -22536 -22276 -31821 -56444 -34998 -10720 -16822 -33535 -30136 38869
12131 38869 80012 47445 41555 33263 49151 44702 12843 -542 26515 5447 -9405 -11470
12119 -11470 -16778 -15298 -77073 -52036 -25657 3943 32719 -17870 -24162 4110 -13242 -25788
12107 -25788 -22671 -62823 -80369 -76323 -89087 -39796 38239 7419 -52183 -38510 -16597 -84051
12095 -84051 -132851 -100252 -12178 25169 36069 28255 -33357 -24397 -32983 -51295 -39816 51747
12083 51747 75767 2171 -28593 -32371 -56851 -54363 -44659 -21190 -19229 -20355 -15125 -49622 -73383
12070 -73383 -58142 666 66836 36085 -13847 -45533 -40940 -58887 -22464 -18233 -10571 -2212
12058 -2212 8363 -2581 -25498 -3211 15783 5755 -47540 -17012 8346 -868 -34048 -43245
12046 -43245 6727 743 -27206 -15248 -20396 -33716 -29887 -21257 -914 806 -7679 -53896 -80886
12033 -80886 -82080 -41399 5735 8137 6454 14319 3021 9908 18254 -18233 -47769 -42935 -25762
12020 -25762 -28163 -33800 -44195 -22875 14582 16273 -51263 -63434 -33388 482 9903 -28660
12008 -28660 -4381 4523 39364 47249 47963 31111 11115 -29339 -43076 -38970 -26728 28430 -11974
11995 -11974 -28582 -59780 -45814 -58322 -54276 -11142 -27933 -32761 -55345 -83935 -54051 -45678
11983 -45678 -50599 -55807 -21359 32698 34845 113 14750 28487 23525 36713 80531 78644 41024
11970 41024 21812 2095 -8335 -55745 -72465 -43050 -9825 13911 -8915 -25309 -31733 -13704
11958 -13704 -13469 -73138 -64760 -64886 -35483 -18850 -16487 -8392 6895 5938 -28896 -66688 -70473 -70119
11944 -70119 -55149 -11047 3311 34063 35392 2345 13374 6835 -24281 -19052 -21044 -57760
11932 -57760 -81931 -16691 5635 25809 -8956 -43795 -31514 -27849 -18761 -2619 -13467 15878
11920 15878 -6379 -48905 -49858 -30403 -8559 2314 6601 -7424 -43840 -79959 -54464 -1369
11908 -1369 -12674 -20543 -19098 -53705 -98705 -92643 -54391 -51010 -62023 -51807 -39378 -65842 -78414
11895 -78414 -28372 -31524 -102787 -136695 -82298 -93959 -85277 -66487 -84228 -108338 -73468 -58496
11883 -58496 -68370 -112842 -125889 -117345 -59817 -72658 -47393 -48895 -12500 -18328 -51907 -85537
11871 -85537 -68240 -33266 -36778 -33606 -26861 -27294 -48623 -79390 -64831 -10766 45065 33942 13037
11858 13037 6242 -43713 -75971 -70135 -39094 -36002 -32650 24798 24464 -71060 -132916 -134677 -109152
11845 -109152 -69743 -67891 -27217 6654 -13965 14510 1942 27857 -8399 -43150 -24 7557
11833 7557 -23903 -52391 -56089 -55217 -23193 -157 -3326 -58178 -60172 -57032 -70929 -62389 -31907
11820 -31907 3642 2810 -66496 -101077 -63880 6459 23182 26052 4775 -19677 8312 32793
11808 32793 36936 35427 1003 -11449 -4311 -20890 -17601 7416 -1937 12083 2258 -9995 -30888
11795 -30888 -38666 -9474 9353 -6716 -18849 -32082 -42007 -1446 41274 49219 59739 14342
11783 14342 -24603 -28003 18186 44489 -1144 -20805 -75053 -92374 -63121 -37429 -14211 11997
11771 11997 19752 24121 21659 78622 54927 -9210 1816 28563 16660 3226 -16380 -25066
11759 -25066 -27796 -25876 -32787 -20899 4018 45306 37277 22618 18058 32884 32443 14933 -11495
11746 -11495 -33273 -22508 -4930 27674 77393 76171 57107 22255 22982 72464 106243 88315
11734 88315 64503 53247 15638 -30006 -37982 16771 43472 32621 11369 -24852 -29462 -4075
11722 -4075 62410 83798 68890 38290 13847 11056 -34394 -40633 -25274 -7658 3285 -36270
11710 -36270 -59926 -82191 -53076 -33014 -62125 -55853 2131 60326 36816 -14329 -33621 18554
11698 18554 41175 28724 -24159 -18490 -34075 -84399 -47470 -13735 -31685 -46788 -54351 -32465
11686 -32465 6904 -3618 -31601 -71433 -68976 -65019 -77909 -102349 -58341 -35596 -26101 -62468
11674 -62468 -55897 -8877 53787 40628 44479 43390 25557 37063 48366 27917 8885 -13472
11662 -13472 8445 -16904 -67049 -89452 -72633 -53801 -50932 -54127 -59321 -52709 -91674 -122841
11650 -122841 -106555 -15955 25095 -29725 -11576 3341 -30869 -26616 -27527 -25329 -49126 -67038
11638 -67038 -61076 -29728 -32013 -39566 -92452 -73892 -80667 -100465 -94069 -121132 -106043 -103058 -103640
11625 -103640 -36444 -7173 -39894 -68222 -44057 -16960 9649 569 -16625 -64408 -104920 -86060
11613 -86060 -82874 -75893 -28210 -45023 -51709 -65450 -67028 -42126 -34156 -34262 -44385 -49007 -8430
11600 -8430 -12112 -29028 -81054 -113265 -80768 -5300 5167 36504 45842 30924 -8346 -26424
11588 -26424 -49659 -42991 -6010 40388 49585 12680 53368 14312 -17260 -23359 -53129 -78450
11576 -78450 -99888 -91228 -52843 -51597 -27837 -6782 2116 -16528 443 14244 799 -26185
11564 -26185 -26638 -34871 -46967 -77321 -48742 -59603 -66081 -123544 -143636 -98114 -26566 -5954
11552 -5954 -41844 -56014 -24664 -19697 -34817 -46596 -69083 -45382 -63487 -56139 -46276 -50370 -30565
11539 -30565 -14881 3672 30245 32339 44473 68630 86441 54299 -9220 -13329 -17381 -52275
11527 -52275 -68101 -61853 -30692 -3005 17947 -26687 -24037 -21938 -29210 -1100 -21476 -107705
11515 -107705 -93538 -67143 -75633 -70208 -45071 -27739 -9129 -17082 -33740 -50342 -57176 -41640
11503 -41640 -36459 -10577 -67626 -99073 -59156 -17785 -13283 -22681 8290 25269 9919 -17554
11491 -17554 -52503 -30067 7895 28390 21504 -7257 -45771 -62899 -62704 -65479 -60742 -52178 -28829
11478 -28829 -39871 -45645 -46740 -40226 -86207 -106806 -84848 -31415 -19088 -24332 -33081 -68993 -92373
11465 -92373 -60779 2217 9043 20604 64414 54190 10635 17757 -11910 -43458 -53282 -3007
11453 -3007 3019 21470 -3670 -15055 4671 46568 -3600 -75200 -86087 -27638 19155 4852
11441 4852 -25317 -40183 -50491 -37744 -26087 1108 -11129 -39448 -56590 -65965 -63642 -49517
11429 -49517 -79950 -115734 -158119 -123772 -96385 -41085 -26431 -7217 -3783 -19116 -30579 -24730
11417 -24730 -58025 -93700 -101407 -103948 -130173 -117339 -72800 -27693 -4374 5137 -20929 -46451
11405 -46451 -60351 -30152 -46527 -74525 -78170 -79778 -70661 -50658 -43266 -65616 -56139 -87486 -91976
11392 -91976 -82515 -90950 -98019 -108327 -116542 -109692 -47941 -46696 -51929 -37619 -22240 -25330 -15576
11379 -15576 1619 26190 28379 21049 40375 17850 29851 26620 -5252 -17805 -25728 -30197 -34493
11366 -34493 -15799 -28883 -36552 -34590 -40744 -73572 -46769 -16162 41122 30674 31111 32302 9854
11353 9854 -33254 -47582 -48501 -11771 -15585 -25824 -8066 -25082 -25503 -63708 -65848 -80301 -64928
11340 -64928 -68829 -66619 -91739 -80768 -50531 -47920 -42281 -53991 -52396 -56144 -18142 -20008 -45649
11327 -45649 -57817 -41368 -30320 2387 -26497 -61449 -43528 275 -2620 -10815 -13390 -15113
11315 -15113 34349 39542 -15533 -36810 5959 27230 13472 -5095 -16991 -9235 -28032 -20129
11303 -20129 4675 43896 67165 73509 44214 8427 -13328 -4327 27394 18129 -45332 -46135 -50477
11290 -50477 -60117 -57666 8901 4363 20444 26632 -13238 -3928 -28839 -7599 -32898 -86702 -88312
11277 -88312 -49339 -22930 -38734 -41594 -39562 -64916 -37826 -18178 -20739 -57836 -60976 -62873 -98091
11264 -98091 -103417 -64810 -39227 -34945 -28269 -4030 25408 42431 46208 16382 6556 9681 -21735
11251 -21735 -52108 -24549 -8893 -60996 -111342 -139477 -86414 -29949 -10759 21455 63900 62118
11239 62118 17677 9780 35935 -2761 -6880 -32663 -43266 -69770 -64218 -58532 -82551 -83813 -57217
11226 -57217 -53701 -48387 -68957 -61531 -19270 -51798 -46394 1902 -25810 -15101 -24502 -5255 -1771
11213 -1771 5648 -18909 -57310 -79871 -80570 -67524 -63288 -55892 -55143 -42625 -54492 -104834 -86190
11200 -86190 -31560 -18356 -49208 -85981 -68255 -70368 -86933 -49143 -7301 -36558 -71195 -69797
11188 -69797 -30910 -50231 -71392 -51242 3562 23449 -30090 -18178 -34099 -80547 -70312 -23863
11176 -23863 -13177 -29773 333 -35910 -68065 -98343 -62097 -53443 -35595 -11608 14421 4986
11164 4986 -4383 9876 48023 -3182 -58813 -99267 -71287 -19748 -20322 -19442 21260 27789 18261
11151 18261 -15191 -30723 -36215 -32961 -33076 24751 28356 10872 -4163 -30144 -48132 -50063 3790
11138 3790 29182 53561 24218 15576 7757 879 38437 -17506 -36574 -14023 -14379 -26084 -44216
11125 -44216 -35147 -12281 -26421 -56471 -75870 -71813 -9289 39514 51717 37897 19225 25855
11113 25855 -2468 4705 -3571 -24620 -32726 -85246 -126732 -98049 -92118 -97541 -88675 -49251 -12540
11100 -12540 -57244 -68324 -20230 4516 -652 -16609 -18729 -7912 -22513 -21764 -1791 18130
11088 18130 65175 47201 11771 10114 13822 -11507 -30033 -48483 -39852 -6830 -18623 -5394
11076 -5394 -20845 -31435 -69433 -91936 -58920 -19502 -10014 -32111 -27572 -26974 -29469 -15037 7344
11063 7344 44988 68025 38181 24219 6648 -2975 19453 -5278 -19225 -25662 -59757 -50205
11051 -50205 -54812 -39814 -11751 31121 9759 21200 35061 29213 22250 22568 15746 18626 -6374
11038 -6374 30095 40401 64505 32904 -4886 -12791 -10053 1 -85 -23157 -58792 -35119 -2447
11025 -2447 15068 40593 31000 46761 -10649 -15575 -25337 -37389 1775 15304 -1720 -55159
11013 -55159 -60380 -30169 16419 -7277 -44382 -44673 -79542 -103553 -61630 -5155 20429 17795
11001 17795 642 2038 12234 -13936 -16742 -47093 -45071 -82695 -88278 -66512 -61718 -63029 -47142
10988 -47142 -14187 8659 -15159 -62902 -64785 -40955 -27000 -25965 -42922 -81747 -111488 -118172
10976 -118172 -118172 -87348 -52963 -16671 6299 -16201 26506 33458 27999 107057 128399 150103 204883
10963 204883 194493 161268 111602 74006 61464 34088 -19100 -55589 -32708 -13311 -23869
10952 -23869 26473 38559 16276 51601 49563 21287 20494 12567 19051 390 -14729 405 17937
10939 17937 31241 -1963 -24574 -13257 24251 -12267 2306 25332 1614 -1285 11409 -6825
10927 -6825 -26486 6249 3351 -8092 1660 24403 10289 17066 58049 48187 16876 -27796 -10252
10914 -10252 -15868 -16956 31489 10002 -8414 21089 72698 115975 207039 267156 282385 239715
10902 239715 195331 176200 174108 144222 93540 82299 109069 135157 104728 75456 78962 82229
10890 82229 100141 98748 138375 156358 163767 138870 108996 114808 177317 196328 157144 186825
10878 186825 217175 222630 249816 308471 366650 462167 666709 1046752 1647334 2240924 2416458
10867 2416458 2335803 2179741 1937405 1563376 1184226 912438 785008 661686 564791 468370
10857 468370 432826 407601 368405 304032 288055 239285 214044 210946 181369 181280 188020 200188
10845 200188 219040 213950 218692 216004 229368 234012 177757 139564 153402 137336 99850 71424
10833 71424 65161 113214 179745 199864 199151 181911 199944 187599 186438 184816 191658 155868 161042
10820 161042 132735 101936 92596 101657 123943 53272 6005 368 34153 31266 38759 5243
10808 5243 -20283 7169 29917 32300 35897 65371 87930 96137 91925 76925 47394 95532 116190
10795 116190 86890 111706 95207 101611 76357 49798 24513 56012 55152 16645 2060 44801
10783 44801 48031 14788 39328 73058 96019 62306 44019 59655 63313 59663 16096 10327
10771 10327 25034 19880 15480 8943 -17155 13359 38478 49235 69822 68018 64043 70339 28565
10758 28565 1450 1253 -19650 -20474 24331 -13252 -61463 -9180 -718 -19292 -39966 -50773 -41421
10745 -41421 -56222 -45999 6902 14788 13835 61782 96856 128100 63451 23665 9604 18495
10733 18495 -4840 -6604 -30738 9933 16330 -1665 23004 50024 -11654 -29315 -73608 -92577
10721 -92577 -61245 3401 98599 206255 279675 311134 276038 240174 216992 161793 115564
10710 115564 102874 67965 54799 39988 1604 -13895 26540 28830 17731 19554 52692 46215
10698 46215 52305 100068 99993 118751 144853 182014 206540 232688 240870 262164 242461 203805 166972
10685 166972 161869 148973 121179 169302 157612 103107 89718 78247 130677 110939 63030 72111
10673 72111 57249 23825 7288 -14805 -53930 1804 72894 161863 291694 438126 724892
10662 724892 1045504 1361331 1489046 1430408 1302614 1146799 945998 697842 613320 548232
10652 548232 494646 441645 381689 330820 314064 323428 355210 340961 303752 283143 253335 232993
10640 232993 205472 167662 133632 116144 108424 144041 172338 164758 186149 183997 165547 169768
10628 169768 136540 106842 109352 144010 153921 121274 120925 131071 124017 102028 97356 62400 76340
10615 76340 52404 49414 96397 64817 56758 54289 68860 81800 53995 68524 99643 150556
10603 150556 206448 281031 428352 607726 697783 673317 387812 -133826 -547803 -622766
10593 -622766 -375486 18616 390188 583768 593119 559811 516426 500466 497226 476123 428726
10582 428726 415015 355588 308858 302683 310240 286628 318925 334098 336753 327886 361229 408673
10570 408673 492509 535216 561417 511710 478440 446979 456703 406738 376897 338288 286384 294760
10558 294760 320221 357002 334455 323885 329206 299452 289340 302249 325363 352473 351036 363510
10546 363510 363197 356142 398173 394255 348922 326458 342138 332838 346496 347552 327318 318654 314418
10533 314418 349418 372631 323738 317483 328729 387499 469281 520335 541263 545093 562146 559121
10521 559121 644118 723480 791600 839539 888510 936255 996378 1081575 1106750 1160087 1231883
10510 1231883 1326985 1423477 1514903 1531140 1563087 1606734 1639112 1658570 1734962 1787198 1887594
10499 1887594 1984086 1997128 1975241 2011531 2208896 2468699 2789330 3247574 3813969 4557016
10489 4557016 5471502 6630735 7853876 8747350 9501587 10306755 11310088 12627100 14409573
10480 14409573 16761775 19942809 24278639 30196559 38524585 51118466 71231631 104991156
10472 104991156 163757733 260121317 375209815 439867523 443225101 414713548 372652009
10465 372652009 305836383 227832294 170096233 135016268 113389175 98616385 87008399
10458 87008399 76724159 67853425 60763825 55263885 50990295 47836140 45568639 43955651
10450 43955651 42443871 40960934 39564912 38318263 37122552 36001717 35046309 34254435
10442 34254435 33442917 32446555 31201089 29778232 28228117 26744998 25354891 24089050
10434 24089050 22976266 22033210 21107462 20213430 19428599 18708856 18012374 17351779 16733449
10425 16733449 16156688 15683412 15261385 14848223 14425112 14000776 13649359 13283386 12968085
10416 12968085 12659797 12344322 12063185 11816765 11588523 11371653 11162641 10923020 10725333
10407 10725333 10551739 10323679 10012968 9758316 9501593 9303946 9118496 8875382 8644137
10398 8644137 8474385 8316359 8130506 7948084 7795790 7711551 7625360 7500407 7360216 7196964
10388 7196964 7078491 7002849 6945933 6898538 6809177 6698686 6561838 6433515 6296016 6127699
10378 6127699 5989442 5846948 5719079 5592166 5509163 5406619 5298025 5207851 5100077 4995440
10368 4995440 4833173 4711326 4627969 4538392 4434296 4372275 4283422 4172470 4123904 4121352 4071491
10357 4071491 3984687 3873864 3784980 3731786 3676817 3555689 3479693 3441186 3375193 3346561 3255564
10346 3255564 3123761 3037498 2931408 2831714 2903738 3149882 3482791 3735866 3774119 3698984
10336 3698984 3615192 3601228 3608213 3666664 3736243 3757889 3720753 3635625 3492205 3333354 3144702
10325 3144702 2968011 2794280 2667796 2621889 2577004 2517016 2458094 2359826 2293790 2252896 2222596
10314 2222596 2086334 2017909 1961301 1917817 1898329 1856531 1788584 1709789 1708691 1657435 1615709
10303 1615709 1612032 1612146 1597630 1553734 1544778 1515732 1472458 1437090 1361235 1340922 1335042 1284275
10291 1284275 1258952 1265562 1223843 1218580 1200988 1177833 1168091 1137802 1113716 1087712 1163988 1224956
10279 1224956 1232071 1248148 1269917 1239969 1234432 1235111 1195376 1164114 1141878 1129678 1135312 1177676
10267 1177676 1186032 1136966 1026088 988808 1014843 1017257 1014394 983972 987969 996450 967851 905417
10255 905417 868007 824442 854296 860294 822104 809599 801557 820438 837649 789391 786721 771488
10243 771488 751068 751802 732011 724723 704087 730493 718195 695818 628850 631860 667758 624397
10231 624397 593246 577902 582319 604399 583060 591607 615685 601297 566206 541329 542795 550072
10219 550072 552180 546927 562448 580122 538306 523388 564063 583463 609340 635856 543023 522151
10207 522151 509299 449182 450708 489532 493495 479772 474979 445189 466470 477706 445789 386793
10195 386793 350580 334412 325762 378889 405183 411301 394170 349248 307535 326975 300187 321797
10183 321797 351425 367859 372898 377135 396506 382206 332779 311256 276041 280584 314419 297817
10171 297817 289298 255040 255754 297057 300128 301712 257273 230814 236592 236215 252737 292013 283130
10158 283130 252980 249687 256068 257598 252435 302723 284279 282824 296761 319591 346054 326156
10146 326156 335624 382343 411668 384204 362485 352261 304112 296168 300298 321275 313181 301257
10134 301257 265141 286889 286189 283000 248158 232524 200822 176453 176399 176246 179337 207956 221533
10121 221533 201885 195674 183590 165363 146671 170626 212576 233162 240193 224251 203472 164384
10109 164384 153196 195926 244529 256178 245492 235739 213938 212497 187045 176548 168689 137835
10097 137835 147462 137574 132628 149107 129890 151466 156870 147534 129800 141289 162058 180330
10085 180330 159156 158434 162841 158109 160958 190041 205989 240368 304655 312460 308364 289276 323513
10072 323513 404949 448443 528019 599258 782934 1174167 1749677 2310462 2531346 2460521
10062 2460521 2289198 2028692 1580581 1139990 900545 751150 679090 666203 693824 704445
10052 704445 667645 598704 575183 561183 503241 439537 393282 330477 293497 276542 254919
10041 254919 239180 271702 307024 345781 343121 305884 318729 308273 309571 313045 278265 280039
10029 280039 264443 265135 272070 283587 273540 222581 212397 237204 267287 296814 255543 203531
10017 203531 211924 189317 133630 100981 125623 163986 161458 149239 101648 95252 138775 127200
10005 127200 100587 131104 162198 191288 199291 201616 248874 238825 248245 253096 208131 194619
9993 194619 134277 125619 130954 115380 124897 175790 182973 152700 185312 184707 146596 131101 127466
9980 127466 146686 165720 177327 139367 118227 101897 35979 33249 53819 103686 125300 144255
9968 144255 174319 220083 206365 150336 152103 117480 92073 90774 115539 118254 117212 162302
9956 162302 139638 89614 38968 19410 45543 68639 106205 163532 171485 139306 99229 122963
9944 122963 139312 136562 115847 98005 104252 111887 114564 106052 73956 93121 125964 132633 76846
9931 76846 40889 62806 57255 36247 37525 72383 123800 113418 101508 72703 82405 111220
9919 111220 72186 71755 61487 83378 135168 204868 206112 185525 216397 221286 153246 142827
9907 142827 118451 107792 55570 71936 78426 84150 89827 118371 114526 113892 95608 124544 111448
9894 111448 80076 87187 106802 148418 148412 113967 108187 133214 148183 108378 61417 51811 66581
9881 66581 69693 97090 105938 78886 109332 183987 163178 114606 85712 53535 30294 22187
9869 22187 42887 47079 63241 94652 91992 76553 61317 81648 84349 45430 66052 92853
9857 92853 111307 89019 25839 42486 20604 38634 41424 73438 94456 125054 102655 73188
9845 73188 82266 74478 111048 97454 63956 58235 57384 27013 46639 73478 43684 39528 39446 53863
9831 53863 68439 42944 31156 85947 131701 118201 95470 95974 88405 98495 91420 87535 55242
9818 55242 8404 -30637 -13139 17932 31785 35823 37493 18091 40197 58210 38313 28207
9806 28207 9480 5733 10989 -22018 -21006 34957 36251 37987 35647 53975 38648 26312 13602
9793 13602 20578 42777 34410 22951 63094 69263 72211 78369 84252 91874 55026 38616 81185
9780 81185 76706 83056 77458 75516 105429 83658 75806 78249 77649 49171 38533 6311 -3346 36186
9766 36186 46580 70795 84067 25515 25906 32805 81920 76671 25975 13191 40592 53169 64365
9753 64365 101003 96922 65360 46740 62461 52735 19941 21909 62172 100977 99745 59351 16892
9740 16892 4653 -12492 13789 26648 94715 96748 98279 51780 -18910 14245 69508 80179
9728 80179 55370 46900 52978 86478 99311 67561 34411 4257 8691 3935 -2071 15327 -5533
9715 -5533 -34310 -54519 -24665 -4071 3088 14879 35300 18526 30818 63587 101410 94731
9703 94731 73101 105078 75420 11825 -12592 3520 17727 36898 73011 37692 32190 68435
9691 68435 31499 -61386 -41139 -42701 -29639 -15543 26313 51566 33073 40590 33742 27923 11504
9678 11504 172 28770 52331 75282 38756 20849 26395 2724 -25869 -2017 40013 85930
9666 85930 58546 13250 -2434 -3839 -7633 -13701 -34630 3787 9797 12839 46722 27720 7374
9653 7374 28006 74836 67844 54636 41117 38635 87944 69331 33941 18613 -20537 -5326
9641 -5326 39279 16479 -13187 16758 19316 8809 24692 28809 9039 21495 21905 -6062 25839
9628 25839 16793 25551 14824 -14569 -10368 -24804 -17635 21438 20048 22187 38355 66018 75142
9615 75142 104059 101974 72639 71858 58688 74383 112250 103994 86896 75725 80224 91849 73108
9602 73108 69238 53153 32237 39846 56102 29634 -4047 20606 44416 32569 53364 39819
9590 39819 -8740 -13595 66340 99339 90238 72675 33137 32372 41736 29452 80934 85630 63718
9577 63718 47548 46469 46021 24356 3401 8289 -15575 9981 31999 40639 29984 48993 100795
9564 100795 92982 81060 47502 46890 57669 61623 64775 79740 66493 39706 45717 89908 110391
9551 110391 111570 90195 54171 -2551 9443 -590 -36055 -32368 -43611 -41049 -8490 756
9539 756 19091 18472 -4023 -8349 30074 67960 68758 36131 38901 50735 77570 96617 94753 29041
9525 29041 25430 11580 16174 35874 55015 15178 -20455 -4044 22978 32634 30394 48635 86138
9512 86138 101012 75972 29678 18242 -26974 -11398 37057 26055 21765 20921 14222 -15929 -6028
9499 -6028 17655 -14198 -24719 -15668 -33533 -44922 -65938 -15445 19257 53071 21168 32542
9487 32542 65739 69826 30694 12795 36051 28551 1458 28753 31444 -3713 -26615 9157
9475 9157 36207 61324 70212 46288 24425 41621 41441 44499 105920 99204 110166 103979 67221
9462 67221 60807 60135 70109 25862 39094 61434 16702 -18271 -42942 -24482 9762 36785 41090
9449 41090 47959 41545 45328 32023 -14351 -17542 13383 47711 62304 54907 86608 107058 82947
9436 82947 95283 96958 82342 87903 74384 90144 89296 34540 2594 9174 31728 94624 81967
9423 81967 57635 32150 17366 17188 35475 62678 31184 43289 22807 39182 81608 86178
9411 86178 62541 33849 16791 -475 29855 52620 58111 80629 74244 42690 75818 97834
9399 97834 125298 181715 202458 174954 143854 126657 89197 132428 162719 190661 197031 177479
9387 177479 155517 187050 193593 146619 144374 178057 196562 182272 207668 283798 257495 205874
9375 205874 233948 300410 325961 314636 325385 395582 389044 412329 470765 513136 573029 697512
9363 697512 832824 926838 1057789 1258134 1550160 1901623 2413521 3123884 4101340 5548695
9353 5548695 7446617 9409445 10848447 11363399 11108546 10235375 8924631 7453533 6108180
9344 6108180 5049180 4254680 3694309 3227274 2826386 2509850 2284573 2127289 1955662
9335 1955662 1839139 1728592 1558766 1443752 1412268 1430231 1392317 1342013 1254374 1203277 1184930
9324 1184930 1155550 1136966 1074172 1028815 964339 934187 885648 862715 793924 720071 674025
9313 674025 662784 661672 692674 667890 636262 585408 564978 505072 477473 452943 433724 465289
9301 465289 514976 522553 477079 447118 448028 466388 475236 445581 404676 365854 335805 286418
9289 286418 268346 284283 303000 304190 294421 341761 374856 388362 350190 354824 298344 286470
9277 286470 312684 323651 331776 311663 266288 296417 289415 296737 269913 246314 237175 242779 254033
9264 254033 227402 197980 191621 203849 171723 157497 187352 208471 202315 178765 144034 130393
9252 130393 148998 170932 172983 183524 212848 186135 130070 144069 170715 183353 219276 177860
9240 177860 194576 220857 195453 211385 227404 240344 244503 244529 223790 224358 227411 202145 229420
9227 229420 231719 222477 219371 189057 154282 147864 167216 198876 179962 157691 161701 156684 110412
9214 110412 86402 87727 106139 96718 82555 107999 120015 99636 71140 83884 107990 88177
9202 88177 123354 172141 211550 195385 106274 81301 64487 83740 78770 80881 100037 129231
9190 129231 128323 111255 98099 70743 81429 100103 122596 129390 95242 54912 58003 61563 94513
9177 94513 108600 129111 129482 133345 123032 109028 113420 139942 114401 71587 44253 43078 44171
9164 44171 62993 64671 72602 59126 88315 114220 99124 39332 -10896 -31109 -22164 -29166 -50655
9151 -50655 -38216 -29920 -53340 -24830 48405 65270 -904 53797 92125 82999 24532 -17286
9139 -17286 10808 41425 67734 77338 46492 42836 50208 14145 12909 38412 78914 64296 47831
9126 47831 57021 82877 67620 47030 42187 16389 16506 -4743 -2857 45595 62595 74000 106563
9113 106563 121902 82895 70685 104556 55800 38402 44662 61671 132419 156632 113685 50168
9101 50168 41948 75254 126850 122481 140789 121415 102333 108641 106747 121616 112361 83075 53661
9088 53661 20351 42409 67585 60234 57574 69429 74923 10372 8967 63933 58458 37134 30114
9075 30114 75957 103241 121538 93801 76410 92352 85453 97377 81543 51482 106562 130287
9063 130287 71524 21105 16035 37209 88236 143469 106079 89292 116832 136221 103269 74637
9051 74637 58133 41321 3776 -4279 32729 38249 75855 87434 72588 74536 96842 98519 73500
9038 73500 28335 -3535 -27546 -60083 -62615 -39018 5583 15529 13190 -2422 -15837 -5473
9026 -5473 -21752 -20326 8739 72575 92279 79404 95044 61225 25052 19818 24118 -35526 -20255
9013 -20255 15643 60573 70950 103372 96102 99915 86166 96240 69001 42415 24832 75415
9001 75415 95899 71502 72337 31912 20106 46945 35398 9436 762 -8960 -16822 4902 36402
8988 36402 95912 94672 74978 34049 33209 35487 33199 27604 -13111 -55078 1050 48278 64081
8975 64081 84605 84750 70429 60886 86080 105528 106779 92494 86686 25004 11318 27143 45595
8962 45595 66360 58289 71048 58300 72696 86485 119476 105398 92663 93459 109606 97622
8950 97622 66799 -9291 -42519 31729 71345 18217 9642 45559 74044 66364 19910 -37464
8938 -37464 -5087 65737 109776 83699 38281 6039 -12267 -5407 -16326 -1552 18458 12713
8926 12713 2166 1282 31407 30336 22601 21671 2666 -12310 -21293 -17416 -20928 -14320 42936 74225
8912 74225 38323 36006 36466 31175 17240 11064 26999 13139 7879 36497 63538 22721 23201
8899 23201 40727 2505 -40673 -54944 -54995 -20970 14093 52557 67852 42910 61720 33305
8887 33305 -51085 -46384 -83195 -104260 -2029 51283 38336 23615 -5892 12053 33930 18589
8875 18589 9928 18001 53732 59615 78589 88379 61458 48419 45613 26649 15531 31832 76552
8862 76552 80333 74292 60401 63504 44620 58603 44732 10032 8648 49293 50626 47447 60139
8849 60139 61862 57794 45288 34200 55280 65581 45035 34399 -2200 -50490 -37736 -65907
8837 -65907 -31021 26890 41373 24318 30558 12321 11679 15367 15922 27718 3085 -16797 -39746
8824 -39746 -19785 -28598 -36150 -47876 -33935 -13702 2930 51530 44752 33069 82479 105928
8812 105928 91687 62241 10547 5936 -4024 -1700 43438 54481 70736 93560 71246 29822
8800 29822 19664 58818 83351 92804 69180 38258 37963 51185 21664 -20502 -3105 6321 13532
8787 13532 84681 131539 55335 -26811 -15235 -9433 -4963 11110 24591 940 -12289 -22468
8775 -22468 -3019 40179 -1421 -54585 -47444 -35188 -85179 -59688 11519 34827 12540 17557
8763 17557 27274 -11702 -12806 451 28619 12797 -18330 -15864 34431 38071 16313 277 -20287
8750 -20287 -28743 7132 22595 5436 -18074 -70341 -74326 -48896 -14632 13730 38778 57093
8738 57093 44567 4257 -58287 -30436 18325 13928 -16217 -13787 42139 85033 88319 12178
8726 12178 -27856 -51664 -61137 -49902 7266 16560 17204 -3441 38143 53090 16196 -20236 -2612
8713 -2612 -20118 -19732 -16051 -29022 -18209 -36590 -33951 -4521 9953 16758 25313 59916 64940
8700 64940 87543 33926 39609 49839 66468 16702 -30139 -27647 -8911 -37427 -59509 -54422
8688 -54422 -38109 -2454 60792 54530 17834 9610 28946 -26078 -41692 -65424 -82065 -22043
8676 -22043 67240 82417 45585 27195 -9453 -44802 -20423 -3575 54765 18218 34319 53077
8664 53077 58125 33782 80287 98888 79719 81248 96070 74019 42086 8779 6368 50702
8652 50702 19687 8236 28114 42113 53027 5882 24069 45850 9847 3463 -19302 -18375
8640 -18375 8570 9946 41239 71524 75890 80342 43872 13864 21603 -18932 -7109 -37003 -7703
8627 -7703 60519 64711 20261 -17642 -2326 22802 33279 10736 30177 16498 -14025 28560
8615 28560 44621 9464 12018 65218 38895 33885 58551 62265 64295 73573 78459 49846 30048
8602 30048 61258 63371 64244 56784 49015 65493 107256 79074 70467 104119 103984 97951 103263 90756
8588 90756 73012 94734 100510 80897 34850 -35557 -22783 -5905 6186 72498 93452 53801
8576 53801 19202 35347 56080 16233 -3531 22843 36199 65134 55434 73545 54547 78795
8564 78795 69545 48768 48557 25709 40867 56348 41321 201 12321 48664 75213 33882
8552 33882 30950 64350 90574 118471 91473 52939 60417 65449 16894 19221 42543 39557 17738
8539 17738 24911 30577 -27835 -24995 5103 5960 37082 57471 46747 53301 34194 26062 13133
8526 13133 30361 -23947 -36758 -26649 -53335 -50952 -19084 -2199 -945 -18119 -11263 24310
8514 24310 39957 32431 18136 15426 56753 63950 61422 62692 80059 27712 26397 66606 53727
8501 53727 48083 46290 49798 64601 96061 92876 69430 30902 32302 25967 37390 54183 14880
8488 14880 10406 43249 38401 73080 106984 128937 79418 66436 44504 25714 69622 39995
8476 39995 38317 51346 54211 33431 24251 37831 76217 73131 38569 -44812 -31559 56900 96287
8463 96287 70466 53662 30280 -13933 -21476 -18502 -15021 15860 45686 24715 -20255 -17686 20812
8450 20812 29125 23686 -5429 37932 70258 9303 13936 14269 6408 41061 53346 30304 20278
8437 20278 23919 30079 27819 52178 60031 25944 15315 9461 3865 6132 -47252 -47812 -42244 -20281
8423 -20281 -16490 15961 15567 22974 26476 12099 -10878 -22414 -24461 -2259 5054 -6718 -23274
8410 -23274 29482 73463 25228 10169 -25484 -25675 -25850 -2441 11885 -34123 -30865 27692 19179
8397 19179 -22897 -19637 38012 56571 36811 22617 -34920 -39069 7633 31304 42933 48797
8385 48797 15732 8673 41824 25525 15261 11679 5700 -5351 -12923 4414 -280 -24975 -32829
8372 -32829 8812 44151 71774 65018 56001 -13583 -39599 -25206 24886 15861 -18912 -12381 17254
8359 17254 22820 -5860 -10959 -25868 -15229 17138 33522 40256 42300 31096 45532 71125 100023
8346 100023 75510 38287 35751 12286 -19424 -19918 14178 14627 -10912 -19113 -35929 -58356 -103973
8333 -103973 -103559 -62402 -51148 -35254 -14452 -40253 -59118 -45966 9653 13720 -9759 -57977
8321 -57977 -52220 -72525 -65194 -34914 -17555 -26857 -11918 18849 16939 3870 -3939 11 -29411
8308 -29411 -8011 -27941 -58962 -28460 -7613 16973 17532 4912 -9395 -28784 -32026 -15710
8296 -15710 -12070 -48103 -77450 -67510 -72867 -42791 -3825 4045 35616 4170 -16247 -9507 23247
8283 23247 53937 65998 17315 -20796 -18408 -46181 -49694 -67615 -63092 -23384 -4056 1272 -12138
8270 -12138 5745 11232 21804 16478 -1172 -13109 -31536 -69255 -65885 -61979 -67774 -24671 24779
8257 24779 48124 71489 52944 -2995 -26597 -20849 -32747 8433 38811 9604 -17803 -8804
8245 -8804 -1114 31790 36324 46492 55507 45390 14971 4984 27056 32417 30743 33001 42432 31383
8231 31383 49804 36446 12746 -12801 -42172 -48268 -52718 -53131 -34617 -47170 -20003 -26692 -91710
8218 -91710 -88387 -43229 -17458 -10594 -26915 -57100 -12131 3079 672 -4633 12701 16223 -7860
8205 -7860 -21450 -12670 9767 -6759 -23431 -45403 48 13695 -17197 -45477 -46173 -31746 -31504
8192 -31504 -23924 40526 25627 9612 50844 91886 61803 16103 18888 16513 -30722 -33957 -18325
8179 -18325 -26127 -17670 -30468 -11070 -9235 -46164 -12872 6139 3957 60352 87277 91971 51699
8166 51699 5203 -10936 -3164 37149 67725 54569 42919 75723 61266 34077 -3120 597
8154 597 44106 31181 24039 6415 9692 4318 -26229 -21415 3070 4291 -10458 30535 21318
8141 21318 12231 4633 -19826 -12176 -4660 -34171 -31364 -61346 -14522 58776 79623 71301 31176
8128 31176 -20214 -57913 -76194 -30611 3632 56540 58247 -18522 -42928 13479 35182 38897
8116 38897 30562 43467 52251 35269 638 5255 9113 -8159 300 4555 -26177 -61151 -46237
8103 -46237 -14567 -36479 -30140 1324 2226 115 7217 16387 43467 47288 -8111 -14961 22321
8090 22321 33251 58520 80333 67488 42206 12027 -9501 2259 -9230 -3140 -29108 -53039
8078 -53039 -59573 -44483 -27581 -22162 -15784 -44246 -13708 28163 43224 41290 43472 40220 42038
8065 42038 -776 -83371 -91929 -62741 -29632 -29036 -36297 -55631 -48385 -35978 -31350 -25977 26783
8052 26783 39431 42260 45718 49385 16510 -6505 376 5278 18258 28157 46111 83 -14627
8039 -14627 10640 3946 -12818 -37935 -49049 -43989 -54083 -57503 -66695 -45501 19929 46214 57221
8026 57221 84509 83238 56864 30595 26822 15914 -30692 -31798 -44835 -81462 -94275 -72939
8014 -72939 -58274 -35971 -23040 13696 49999 31963 21027 29858 57386 15863 -41509 -57279
8002 -57279 -63708 -64232 -48391 -5346 54688 73379 24256 26729 19890 52364 65396 26425 -28956
7989 -28956 468 61564 40773 -24440 -81293 -100570 -52496 -48273 -35249 356 -258 -10403
7977 -10403 14349 32287 43596 29395 14072 -15737 -45312 -26528 36488 15500 -14706 4764
7965 4764 10409 14008 42339 41906 24731 20619 42432 21082 -28138 10892 21434 3286 -24722
7952 -24722 42814 44961 630 -22355 36787 45484 -1992 -13273 -16359 -10655 -7117 -24596 -25751
7939 -25751 6005 38980 50384 29734 17566 19025 32695 28907 24363 48894 104923 164582
7927 164582 134256 79654 49708 44405 27312 24505 54877 66040 63144 38477 19177 2936
7915 2936 -3837 8653 -21090 6579 629 21384 31137 -1597 -20390 38240 36554 35337 22689
7902 22689 42062 19388 -6105 12585 30137 33492 33234 38456 58356 27178 -11899 -23105 -25543
7889 -25543 -41093 -20616 -23705 25334 45763 41884 39535 40541 49005 51229 50303 46650 43974 26290
7875 26290 -2667 -21501 -3690 9421 12311 5863 -26114 -3416 11887 -20817 -32259 -19665
7863 -19665 40872 88393 83256 69005 40015 9310 1868 -7642 2898 22750 -11211 -80528
7851 -80528 -74081 -50082 -16641 -56258 -46641 -4910 -35707 -99191 -110411 -94210 -71044 -43244
7839 -43244 -31751 -41615 -31583 -29822 -18012 9623 -6679 15660 22458 15550 -3688 -16934 26029
7826 26029 48131 -14731 -54018 -40491 -23456 -15181 -22390 -19448 15653 7271 688 42708 96218
7813 96218 85663 39229 25 -13377 -32767 -50907 -84297 -79651 -25935 4449 5396 -31767
7801 -31767 -44527 -2042 -14536 -3864 28444 -16921 -77816 -40825 27308 26280 -1680 -17304
7789 -17304 -1925 12476 -6707 -59476 -61171 -56064 -48843 -27777 -3573 31347 55551 38442
7777 38442 -12160 -40439 -30508 -2226 -22100 -12578 21933 31815 5041 6889 14751 -41975 -28540
7764 -28540 -51648 -37419 8934 19147 -10032 16457 53951 71401 73715 48001 2139 -51403
7752 -51403 -113856 -111218 -61251 -40183 -23881 -54743 -51453 -58585 -87316 -79193 -32069 -2325 39718
7739 39718 19139 -9406 8285 4261 -3670 16564 18882 7324 10498 16137 36262 -14593 -49605
7726 -49605 -54329 -48729 -80074 -91661 -87576 -20519 5402 4579 -40772 -81011 -98440 -81744 -63876
7713 -63876 -28492 21427 42839 23061 -75525 -145118 -115611 -57017 -34165 -52630 -22854 -34610
7701 -34610 -43598 -18063 -3768 14447 41206 9384 -16645 4158 16576 16135 -1404 2049 -13152
7688 -13152 -43539 -94836 -112330 -94297 -35769 -25996 -18432 -31426 -79893 -52314 13222 44994
7676 44994 4733 -1651 7932 35316 34470 20780 11992 34248 62138 45932 45229 90940 129448
7663 129448 90583 55710 68016 40927 37966 84122 68065 67933 81463 56759 76782 53553
7651 53553 -22143 -5326 3443 18360 35557 38090 41046 40585 35173 12038 -2193 -12081 -5297
7638 -5297 5042 12589 22250 52010 35663 38481 4441 -7492 -28314 -15925 -35424 -39635 -58242
7625 -58242 -36860 -41441 -72338 -84537 -61649 -7805 3463 -45573 -66105 -53124 -34043 -44244
7613 -44244 -34077 -27738 -58927 -84032 -38968 -46840 -68227 -35655 -30760 -28581 8699 2874 7499
7600 7499 -14123 -27567 -46061 -50212 -12779 30711 43542 12920 35248 19193 -12016 16050
7588 16050 31578 -14043 25172 51068 6329 -81190 -77209 -14886 3532 -7237 -6800 34999
7576 34999 32120 11053 -1767 -12511 -23994 -36871 -12045 18219 -3950 -31970 -11455 -32447
7564 -32447 -55403 -46904 -51559 -57867 -65815 -31137 49097 70948 56539 34460 28003 50198 -3983
7551 -3983 -52155 -64733 -27581 -3314 14481 61638 85479 55132 -18753 -44159 -20937 13016
7539 13016 9326 21137 23614 38142 19661 45464 26736 -33348 -36316 -23114 1165 14248
7527 14248 10873 18962 -3232 -16057 -10811 37835 60827 79398 83995 64594 50007 18272 70690
7514 70690 117933 95210 55166 52809 50823 15830 -38193 -45008 -32965 -65945 -67338 -52343 -31918
7501 -31918 -65600 -65877 -49253 3020 46058 73758 53666 42788 27463 7296 -1470 -23206
7489 -23206 -63586 -93345 -64112 -29901 -38522 -43236 -11569 -40 4908 3336 -9527 -455 27541
7476 27541 14037 -9792 -37591 -21075 -7885 -27370 14143 36404 11450 5890 -11715 14522
7464 14522 23111 -44924 -46199 30444 62524 67382 65029 86908 66709 35703 39527 16446 -2897
7451 -2897 9216 -39899 -31127 3529 745 -5287 -45378 -18115 6669 14767 16526 -660 34176
7438 34176 14861 -33302 -67166 -59958 -35772 -876 -25094 -28451 -12333 -23466 -20531 7026
7426 7026 44581 26229 45274 53579 3278 -1434 29312 4569 -8345 22339 34842 27423 -13421
7413 -13421 -12235 -17206 2214 -16856 -62381 -31489 -1021 14876 -3683 -25515 -38716 -12885
7401 -12885 31653 1393 9283 31484 -16509 -47099 -3289 43965 22050 -7040 -3470 269
7389 269 -23664 -16969 24924 13635 -31288 -21160 30280 26424 12696 -29315 -38883 3307 53913
7376 53913 21846 34822 33063 -18495 -17399 -29401 -18966 -19010 -2612 -23117 -44727 -46258 -58622
7363 -58622 -76388 -38813 -68809 -98528 -106104 -86060 -10344 27105 -27431 -17061 -24325 -50008
7351 -50008 -22072 -13115 3317 13698 -12405 -60632 -109062 -113438 -78806 -47795 -58728 -79045
7339 -79045 -98936 -113354 -93679 -38020 -13163 -34894 -57155 -103666 -92690 1014 33312 14866
7327 14866 3391 -20651 27921 53006 38422 -5310 -26176 18710 45191 27664 15296 31709
7315 31709 32548 64041 62992 29083 8496 -18247 9930 26750 28177 12998 47927 74478 78052
7302 78052 99683 57518 34272 -13401 -2208 6190 23788 20716 -1227 -19912 -7392 11181
7290 11181 -3198 -22530 14947 40272 20918 31973 46769 19788 -22900 -48062 -31283 4177
7278 4177 -25480 -32202 -29555 -52342 -41904 3778 28313 36924 15490 10759 28222 9776 -23464
7265 -23464 -30775 -300 30156 53072 61591 27813 -7770 7501 21772 -2953 -25184 -21337
7253 -21337 5552 4178 10438 25626 43855 -8020 -71168 -63536 -11860 -956 19179 28736 54568
7240 54568 55240 28657 9837 4129 -16327 -23158 -31800 -32292 -44099 -41780 -30927 -11568 -198
7227 -198 -15346 -41035 -62837 -43271 -85551 -123788 -125453 -104825 -70663 -8036 11111 6923 6585
7214 6585 8036 -4674 -39294 -10675 -17240 -58969 -62650 -89086 -125554 -42600 15878 11041 -5624
7201 -5624 -14023 16277 23465 -25879 20612 61991 88721 67300 18377 -35063 -68818 -47455
7189 -47455 24205 64378 78371 81610 42842 -7669 -32776 -43014 -55705 -29131 -18958 -31369
7177 -31369 -1870 35349 28214 4054 -74172 -97303 -68797 -49912 -73396 -34104 -5534 331
7165 331 22897 39724 49273 43503 21101 -3000 -14577 -32510 -45462 -29934 -7268 -10842 607
7152 607 -13474 -34390 -45804 -13113 7243 -15854 -3880 350 44424 39365 -6487 -17732 -17119
7139 -17119 -24930 -40164 -56361 -36730 -29930 -55419 -53416 -11263 30028 49027 56412 12742 6227
7126 6227 -9782 2756 3616 7904 -21667 -45305 -28563 -1824 12059 -10876 26974 21219 -1855
7113 -1855 -487 4308 -12418 -41055 -28037 29927 30693 2127 -12132 29430 30994 38653 33032
7100 33032 -5386 4833 10769 37203 56891 39004 -16762 -50822 -66227 -70375 -67654 -101806
7088 -101806 -71182 -58986 -8182 8595 23670 6383 -13488 -30598 -6172 -12907 4183 14729
7076 14729 4060 -8142 -957 -19531 -49166 -10834 -34578 -57551 -56974 -52140 -72669 -40924 -41902
7063 -41902 -48583 -34330 -39767 -48827 -68251 -43191 -46063 14849 19196 6936 17948 -49373 -57592
7050 -57592 -55135 -48270 -43383 -12797 -35614 -30191 -19579 24934 52047 26994 -22992 -13176 20051
7037 20051 47411 57441 23131 -18270 -1403 29331 36524 6235 1277 -20539 -42804 -46235
7025 -46235 -50039 -32285 20015 39930 -9051 7444 9875 -22075 -37692 -45602 -32655 10896
7013 10896 44706 17094 -12462 -12081 29601 18805 -27382 -57892 -53941 -65808 -46799 -40112 -51493
7000 -51493 -27663 -142 -6614 -17354 -5754 -16349 -1488 28485 14436 18870 25621 30124 63141
6987 63141 73119 54672 -9204 -54525 -73953 3781 45554 30461 35662 16451 1448 -18913
6975 -18913 -26067 -9295 -33971 -28876 -64173 -60993 -53199 -42520 -31753 -7078 -23236 -20305 38424
6962 38424 27226 3133 -37888 -116073 -126430 -97083 -20969 -20625 -42424 -23293 -8973 -9252 35767
6949 35767 78623 97068 65401 34931 47333 17535 -25940 -71297 -68806 -28313 -8392 23920
6937 23920 31378 37642 57900 73394 66272 73514 68955 27783 2504 -4761 -17667 -35045 -12235
6924 -12235 -879 -29854 -56276 -67161 -34216 -20551 -38144 -20271 5710 -1025 23704 28157
6912 28157 -12786 -21425 -6598 -8221 -77292 -71784 -5453 14435 40773 97378 104069 66828 23123
6899 23123 2989 -14041 -68934 -42180 15253 21926 -24657 -22579 8195 1623 24646 39058
6887 39058 3778 -3890 18220 -16607 -10586 6125 -1137 16941 38181 -1197 -30078 -28113 -42770
6874 -42770 -27956 -31917 -58542 -56498 -49722 -27512 -19994 -34428 -28602 -47633 -94339 -102084 -61990
6861 -61990 -5622 -2202 3989 29038 15018 -4221 -3166 13538 13976 11261 -5578 -48860 -63409
6848 -63409 -25119 -52438 -78326 -83092 -59723 -59139 -96431 -85866 -37662 26087 32455 27769 -19934
6835 -19934 -16669 -3252 -2520 -7626 -1718 5414 4557 -23483 -56514 -59596 -72049 -66815 -67326 -81068
6821 -81068 -71259 -80945 -52861 -31131 9648 14804 14284 -7200 -17702 -40024 -91762 -113647 -91434
6808 -91434 -101475 -67325 -36138 2056 -31122 -57247 -45779 -246 57856 21903 -38014 -65802
6796 -65802 -86463 -28044 -44589 -91464 -92956 -71865 -20534 36600 17930 -7073 -46315 -49771
6784 -49771 -18563 19572 -14707 -55210 -54390 -29813 -23454 -7491 -30557 -47908 -93108 -64285
6772 -64285 10582 10688 52339 46222 45502 -10007 -58737 -32450 5053 35351 19820 11789 16707
6759 16707 -1669 -21922 -62429 -62077 -45779 -42578 -46232 -35027 -14397 5966 37006 56926 67934
6746 67934 47255 13253 -422 -2808 -40366 -23773 -27824 -19850 -26788 -1842 -6287 -55054 -70804
6733 -70804 -47300 10675 2335 -55818 -74360 -36856 -45454 -91369 -96162 -1525 22150 11852
6721 11852 -9051 -30522 -48791 -81143 -79595 -46709 -41278 -46867 -68576 -15644 35083 18760
6709 18760 56010 50717 31489 27823 3695 -3761 46483 50464 36716 -627 -37413 -57058 -53077
6696 -53077 -39091 -11591 -8311 -21116 -18139 -9079 21291 -23069 -24433 -16041 1848 18061 18660
6683 18660 -19008 -11176 -11243 -6326 -2621 1236 16896 19995 -9517 -34909 -12513 32157 8457
6670 8457 -20993 -14124 31903 3881 -13477 -46640 -13723 -16690 -35851 -9879 27579 48402
6658 48402 83659 81021 -1400 -39178 -18225 -22824 -18625 -17485 -19200 -37169 -33685 -16259 -13375
6645 -13375 -32878 -25476 -6882 12718 -3393 -19475 -15993 -32663 -36177 -21955 -36812 -60204
6633 -60204 -57393 -48735 -29962 -39756 -23221 -15228 -10623 -19241 -16864 -23114 -20628 -23134 -12639 -32981
6619 -32981 -52879 -29005 -15715 -34455 -13812 -9595 486 3557 -276 10045 -22396 -46394
6607 -46394 -18082 -35045 -43320 -27659 -28229 -27777 -13171 -49834 -60283 6604 59186 8943 -21886
6594 -21886 -28674 26262 97382 87958 31040 -5681 23143 14982 -35213 -24652 3260 412 -48590
6581 -48590 -55508 -50137 -40110 -17350 -13997 -6224 -17026 -23497 37632 11400 -34767 -44946 -79781
6568 -79781 -54303 14259 69762 62850 53690 85101 31812 4731 38881 55885 51873 6279
6556 6279 -5002 5070 -3633 -18472 -36275 -50308 -67585 -83005 -65758 -33199 -5948 -10610
6544 -10610 -2691 40139 18338 -18427 -27911 -53592 -63139 -46755 -23367 -19866 3771 33669 10686
6531 10686 -61951 -49008 -17870 11215 -9716 -52094 -71683 -65060 -64702 -8570 5831 -45092
6519 -45092 -53398 -48878 8902 53082 68659 11975 -13662 -31939 -43921 -43809 -46721 -27052 1988
6506 1988 1015 -10814 -23537 -18228 -43548 -13118 -12 11390 -3236 -20764 -17267 -27486 -59332
6493 -59332 -25109 4219 -24765 -46619 -41577 -35555 -47111 -11922 35788 35200 28483 28822 46033
6480 46033 29145 12461 2503 9669 -27573 -2861 41986 36404 -5533 -4556 47589 33363 6425
6467 6425 -3346 -2332 -51199 -37238 4940 25283 11366 7782 18582 -12067 -57079 -35273 -6235
6454 -6235 -11285 -37396 -44816 -34548 -67857 -80350 -78582 -66044 -39744 -5497 -109 -57899 -87296
6441 -87296 -92177 -110567 -89578 -21784 39215 51711 25878 5746 15981 54277 65812 59093
6429 59093 35977 9441 -360 -40394 -38073 -40640 -49201 -37487 -27354 -18106 4839 38308 35255
6416 35255 5412 -16767 -8529 -23133 -17291 -36546 -29121 4971 1560 -18272 -54372 -13366 -20165
6403 -20165 -56095 -75493 -89387 -62922 -24211 40770 26517 2088 -1650 -17559 -23181 -20126
6391 -20126 -27570 -27589 -39956 -76885 -5273 7873 35523 68716 72946 32562 120 20803 22138
6378 22138 10436 24210 8850 23593 11458 -33317 -52483 -83591 -57259 -69416 -82196 -75293
6366 -75293 -85948 -69615 -29781 5170 -37464 -42646 -40980 -1277 14581 22919 4649 4196 -4333
6353 -4333 -28087 -20150 -7758 -21663 -12135 20245 34066 -6530 -65867 22411 91759 70719
6341 70719 53408 49744 32981 6792 -6805 8028 -324 10532 -51668 -106138 -78612 222
6329 222 34518 -13039 2180 11973 22163 33904 27059 -2747 8385 -21275 -4776 27756 23126
6316 23126 58986 88012 67129 51807 86232 97583 84173 20071 -46645 -72251 -69738 -41853
6304 -41853 -23372 21230 -7600 -20747 34169 41571 16202 18721 -25633 -37368 -13395 -26272
6292 -26272 -29525 -26837 -6696 -11341 -36154 -74853 -99504 -116785 -119605 -131796 -85618 -71491 -38748
6279 -38748 -47334 -72391 -72329 -75299 -122681 -158363 -135340 -96475 -84793 -55193 -44322 -45797 -9743
6266 -9743 -13821 -44216 -42706 -34834 -1983 -35966 -33773 -13202 17075 14054 6497 -8894 -9204 -48561
6252 -48561 -51254 -31277 -66197 -68718 -54338 -55488 -60113 -32228 -54843 -53591 -28986 2401 16690
6239 16690 45125 51227 26312 22620 36666 3155 -7242 -3455 -13599 -27399 -51707 -53750 -38836
6226 -38836 -53249 -17228 -29717 -70029 -64409 -71101 -12967 -51141 -69818 -55270 -36270 -60662
6214 -60662 -52747 -25486 -43597 -41976 -65769 -56315 -2745 7442 11451 -13376 19532 68422 28942
6201 28942 13720 53345 38293 36063 -23232 -58718 -66557 -86808 -95908 -55759 -18553 -26004 -61998
6188 -61998 -86976 -74329 -56540 -25972 -46398 -63506 -68955 -79414 -71058 -16709 -4783 35458
6176 35458 30200 11902 28238 75889 52489 28028 64405 41775 -19249 -39450 27333 18724
6164 18724 -4971 -15037 -34590 -29736 -41989 -30927 -25318 -6737 31627 46059 23251 -4978
6152 -4978 6626 -367 10507 40701 52083 41943 57032 64422 64964 19519 9308 46326 64606
6139 64606 49110 9250 -6828 -35842 -42977 -9761 27396 37132 1666 12669 8434 22911
6127 22911 48697 60251 55796 25447 6874 6194 4923 28147 13058 4165 27998 42724 40905
6114 40905 -12328 -55599 -55036 -53906 -40459 -22216 23562 47534 14086 -17853 -41668 -18454
6102 -18454 -33273 -18527 -40169 -21082 5960 43260 19595 -17186 -73785 -90617 -30976 3735
6090 3735 -724 -21765 -143 18494 -4902 -21044 -30806 30340 10008 3252 16193 39333 49467
6077 49467 24773 -12704 -35105 -6395 -33356 -15781 -2514 -16386 -22921 -18806 -46771 -49920
6065 -49920 -73007 -46737 -5250 14550 46101 24544 21575 11610 4321 -14406 2403 38071
6053 38071 7913 -43402 -6628 49104 70297 83730 55323 41022 32321 -13905 -43808 -36039
6041 -36039 -26713 -18077 -44343 -36145 -3561 11987 277 -11403 -8264 3080 18013 -53987 -32839
6028 -32839 -15677 -39580 -36918 -29872 -46161 -63829 -57721 -82909 -47038 -30167 -7196 5656
6016 5656 -30486 -28833 -34656 -34946 -21293 15544 -4211 37146 60176 31918 6366 -2865 799
6003 799 18032 10128 -12878 -29355 -29154 -37074 -7719 20904 54495 3313 -47564 -50 -11512
5990 -11512 9329 10972 21876 39025 -622 2241 31806 49487 28693 42208 2318 457
5978 457 2802 -17279 -7479 9422 33508 18054 17864 1857 4267 11963 33870 1318 -19855
5965 -19855 7601 39654 12845 -19232 -30837 -32509 -10524 120 -2018 11380 -43425 -57707
5953 -57707 -71752 -65881 -29754 14348 18313 -5654 -55573 -74586 -77463 -61302 -67105 -76081 -49066
5940 -49066 10783 18620 2460 44292 12770 -28031 -8456 29374 29830 17944 2235 -39720
5928 -39720 -91192 -64470 -52296 -46810 -59460 -84752 -79955 -50129 -16591 -35945 -25193 -31662
5916 -31662 17380 17278 20810 16344 25095 884 -40220 -52186 -20908 25948 43394 41794 -3722
5903 -3722 -58508 -74390 -114274 -115273 -109180 -60610 -30635 -3025 -29300 -37570 -74577 -92005 -40218
5890 -40218 -3676 -30055 -9808 6031 27085 26287 27185 32529 6217 -20697 -28469 -12627 -26148
5877 -26148 -29957 -55427 -20274 -42481 -85198 -80166 -83819 -83083 -32023 -20564 -20034 15477 64839
5864 64839 89737 32643 1487 -22841 -9887 -7322 1088 -5236 -17170 -4720 -6533 32616 9338
5851 9338 -20848 -24317 4842 12869 11706 -19380 10365 800 11125 67381 61280 41155 22431
5838 22431 1220 -17794 -30421 -16920 -32841 -34307 -13187 25875 32173 31520 28463 27959 -12224
5825 -12224 -11571 -318 6001 -819 2750 24455 34336 18296 -7865 19188 20972 52095 75185
5812 75185 49408 -21268 -29660 -49437 -34144 -5634 -16 -20220 -24383 -38415 -36057 -22954 -31659
5799 -31659 -21732 -11730 -36708 -50424 -30098 -39211 -14528 -25137 -7117 20351 22442 35637
5787 35637 37644 60041 31763 -24079 -50023 -8931 46924 41757 3290 28988 44241 37801
5775 37801 31346 27284 34747 -19058 -52057 -56850 -80439 -59635 -4706 18992 17920 -17792 -47923
5762 -47923 -24191 -5217 -14961 2280 -19317 -5633 14046 21238 -26501 -21582 -23747 -2854 709
5749 709 -2652 -6151 -5604 1534 36430 49640 5715 -4801 33079 61143 55114 176 -20371
5736 -20371 28757 72426 67810 52836 24610 16886 -12540 -4490 12649 18174 39107 56286 -10174
5723 -10174 -36229 -20062 -6352 30173 66461 85500 35711 34204 4428 -19359 -45294 -20456
5711 -20456 -3842 -15984 -56077 -77317 -71793 -67662 -23639 -23257 -46636 -4055 9330 -47082 -104600
5698 -104600 -67056 -39057 -33194 -24287 -46381 -43373 -26217 28137 45890 3740 -35911 -63069
5686 -63069 -36086 -37289 -20887 -2836 -14779 -21052 -10042 -32999 -36399 -29639 -22443 -35237 20819
5673 20819 18690 -10930 -12093 20293 11272 20711 -3443 -8506 55703 82656 58376 35491 2307
5660 2307 -61340 -74616 -58692 -29264 -25968 -26602 8163 -5369 19884 7543 -27480 -17314 -21600
5647 -21600 -44019 -45290 -43733 -26649 -1786 1349 -13920 -14337 16371 31843 -18335 -20627 3336
5634 3336 9943 12294 -8236 -37427 -58696 -86357 -69757 -56886 -56895 -47966 -46385 -37314 -41327 -26643
5620 -26643 13220 -14929 -29674 4204 -22164 -33616 -16029 -40370 -38545 -43634 -23408 16097
5608 16097 48507 67655 47364 48544 70383 73017 790 -20177 -1570 8861 36360 -421
5596 -421 2640 34537 55471 46325 46780 43091 76866 60393 23099 3181 -5962 5103 -749 -14267
5582 -14267 -20876 25105 36196 19615 6201 -27633 4041 59737 14808 -28717 -51627 -50197
5570 -50197 -44873 -32932 -23011 -9130 -22230 17367 44670 -5892 -2498 24277 66294 95396
5558 95396 68286 34934 28661 16247 19198 -230 14954 22439 28616 20059 -13623 7028 21928
5545 21928 33950 49355 37512 38648 27995 -11023 -44574 -6497 4455 -18720 13295 75453
5533 75453 65125 72818 44648 20290 14955 -11725 -99264 -124076 -105216 -64007 -48246 -22649
5521 -22649 33859 32289 -16002 3473 14889 -22279 -17109 7203 35590 74361 63893 41047
5509 41047 69695 39070 29147 13972 28332 17579 3951 45640 65964 63914 36444 29018
5497 29018 56384 47861 31720 -6498 2419 72514 65647 18084 -3449 -4855 -6751 5273 71218
5484 71218 74494 28116 14446 -476 -6436 14042 -1513 -43964 -66613 -74832 -57566 -42312
5472 -42312 -36920 -43519 -36594 1609 15272 11639 19018 18025 26028 19362 52671 26096 5321 4989
5458 4989 12210 15210 37411 54772 48903 29000 12743 -17541 -1056 18743 -23670 -74832 -95421
5445 -95421 -81269 -100494 -121878 -128247 -67017 -13604 4536 23945 -21302 -52247 -56876 -35821
5433 -35821 -36450 -61852 -63972 -59642 -24827 18751 60196 52731 22841 5549 -27644 -20973 -33557
5420 -33557 -36493 21780 6691 16719 8603 8507 10026 -13679 -11380 8006 38276 41208 31414 4766
5406 4766 -18267 25088 58753 63371 68876 72648 36298 12245 2856 13487 40286 69993 86822
5393 86822 88821 64135 16221 18000 19901 13195 -25069 -34723 -56627 -72818 -64272 -54555 -78008
5380 -78008 -86742 -94693 -78885 -96668 -95853 -93085 -92972 -76279 -11745 19537 -998 -2419 12721
5367 12721 15502 24247 -677 -32948 -27760 -54939 -43045 -16587 365 14079 41274 97672
5355 97672 62523 18964 12267 15176 6038 -8094 -24242 -47171 -54889 -31690 4622 23378 68501
5342 68501 38043 -2118 -4040 38930 61547 30101 4375 -37786 31009 56876 23578 16275
5330 16275 52433 59441 29955 -29698 -41025 -59723 -108021 -64987 -15178 -3385 -7376 -19426
5318 -19426 -24931 7452 2217 -23410 -37160 -71565 -104067 -90337 -62289 -4803 29054 30130
5306 30130 15274 -32415 -51290 -37694 7106 32634 39729 -10254 -76952 -51018 -7479 6858
5294 6858 47560 17416 9684 32319 39462 10615 -1198 -9004 -24235 -15118 35728 11188 24683
5281 24683 40548 19369 42721 38638 12492 -4189 53138 43297 4837 -16457 14292 23659
5269 23659 -26826 -38444 -38069 -28569 -6086 44700 61423 45837 -25333 -21779 1592 9286 -87397
5256 -87397 -87049 -70813 -61704 -22498 -10007 8335 6463 8533 22737 16431 328 1014 15690
5243 15690 7773 24926 13396 -35855 -6440 -9006 -48511 -47186 -24313 35678 32266 3950 -38415
5230 -38415 -35227 -34418 -4444 -11167 -41864 -63119 -38847 -33112 -24420 -10453 55 45355 46182
5217 46182 21996 53601 99678 67000 -3591 9501 52989 33418 -7378 -33088 -51729 -25943
5205 -25943 -42658 -51517 -38589 -17563 -8246 -8321 -11404 -386 -2158 -3597 -13041 -83202 -85597 -85711
5191 -85711 -105996 -86902 -66171 -28075 -12944 -12877 -5312 -4763 18642 -16684 -12702 -10452 -2481 34367
5177 34367 37459 15621 -2627 -7194 -9333 4245 2520 -27690 -67785 -57569 -40437 -40529 1221
5164 1221 48751 47406 1942 -28466 -35677 -36509 -68788 -66243 -36357 -16599 -17946 -14374 40516
5151 40516 59159 90166 87275 59965 50671 55782 41797 20605 2061 -4103 30071 36053 -25736
5138 -25736 -79014 -63102 -27439 4865 -10821 -17005 19189 27776 -4918 17739 75998 78475
5126 78475 70815 38832 41795 20915 30917 21644 -9593 -20453 868 -23490 -33116 -25055 -35413
5113 -35413 -80014 -97208 -87459 -66656 -64746 -87297 -47526 35840 9552 -35500 17372 29351
5101 29351 42498 20978 14980 -721 164 8041 34610 30230 7609 -1233 -19734 -9724 2760
5088 2760 12800 37045 34421 30501 12246 11265 26554 31259 30965 2771 -19551 -24317 -49131 -6451
5074 -6451 -6638 -55206 -76123 -73263 -45906 -53168 -25385 -17915 -1192 25681 82777 75245 53479
5061 53479 50956 27527 -8455 -22412 -5141 -16100 24077 72130 67961 75564 33707 15681
5049 15681 -35356 -48005 -23905 5948 -21300 -34123 17541 13512 -44884 -68320 -44946 -5067
5037 -5067 -23603 -2273 8685 10374 70938 73352 47920 68600 52145 34848 26315 11412 -1038
5024 -1038 -8349 -3359 19412 23198 16550 -1925 -11139 -12522 -20634 -27240 -19538 -61628 -57983 -51673
5010 -51673 -57620 -56217 -78341 -70357 -75162 -65907 -55609 -22933 -238 1433 -22214 -21716 8965
4997 8965 15809 -11307 7232 59658 53987 -846 -19636 -27309 -29801 -32260 -20098 4746 9652
4984 9652 48585 61780 32807 46020 48641 43130 41291 44964 36660 54887 58996 43279 62559
4971 62559 57568 26349 24811 27516 702 -4808 -16504 8577 34803 63719 45825 -1544 5831
4958 5831 -11850 -16233 -4296 -747 27459 13250 -2009 4247 -7541 805 20376 58870 58219
4945 58219 55836 58250 74626 85365 60749 6471 14982 -10643 -84314 -96660 -70931 -50702
4933 -50702 -25907 12415 10696 4017 -8892 -12345 4202 9664 -17966 7204 49289 61164 44004
4920 44004 27343 -2684 -8252 -8531 -51097 -50015 -9328 21304 18746 -7480 -13010 -41899 -52858
4907 -52858 -54565 -41537 -43941 58092 148184 134862 53737 53711 36438 25929 39857 839 -14279
4894 -14279 -5148 -1986 -45256 -60201 -77287 -47426 -42424 -40643 -33476 -23211 -57936 -79598 -82780
4881 -82780 -53863 -40846 -43668 -28125 -25338 -22278 -8126 -18830 -19868 -41700 -21528 -7353 23826
4868 23826 49664 47068 13220 10637 40327 17332 -7372 -39800 -34547 47554 72067 52147
4856 52147 70544 41003 -39590 -54905 -39550 3780 6091 -8929 -6088 2055 -21203 -36833
4844 -36833 -26127 -56685 -82394 -82074 -33498 -21881 15700 48231 31661 31582 11621 -2488 -12378
4831 -12378 828 32722 41086 16737 -23659 -31405 -36291 -62222 -62534 -43565 -34239 -34965 -30165 -24586
4817 -24586 -40925 -24274 -10830 -13549 -62252 -58228 -58903 -47709 11815 40083 29188 19874 19244
4804 19244 18567 20371 -22355 -27319 -7904 26922 59808 61405 58970 28818 2375 58993 66437
4791 66437 67773 65671 85663 91067 86772 59573 48460 61960 8828 -68390 -95007 -91449 -93668
4778 -93668 -101614 -79481 -8824 12909 -21316 -53015 -49014 -10466 -6724 -23375 -52923 -68549
4766 -68549 -60451 -30793 -28905 -47558 -16668 -35272 -56256 -40881 -35869 -19347 -20087 -2844 7086
4753 7086 23331 33699 18519 -31556 -60398 -36702 -14632 -39730 -64977 -18543 19490 19156
4741 19156 -11175 -46428 -12457 -16561 -13591 -15413 -62517 -40797 13965 16091 -19662 -22651 -15026
4728 -15026 -1595 8115 13687 3290 9863 51711 41504 18645 9508 -19974 19037 8535 2899
4715 2899 8226 -1070 -10450 -64712 -103781 -82923 -37822 -28575 -29320 -28553 -30082 -64553 -34452 -29803
4701 -29803 -19615 23275 49647 59022 68400 69966 28694 -44399 -109947 -99091 -45389 -18921
4689 -18921 -1435 45885 29413 -1022 -17876 -10982 -38194 -64747 -79608 -32348 -12501 -17957
4677 -17957 12764 46787 48096 21026 12628 26427 -11647 17177 91587 98545 62667 53164 42930
4664 42930 -18359 -38848 2771 36614 23187 3400 -28872 -15950 1948 -25806 -34784 -20027
4652 -20027 -28155 -48359 -27415 10388 30774 -1855 41382 97826 87714 70970 34817 16317
4640 16317 27871 14470 -42650 -25547 -4998 2001 -33742 -21511 -20377 -35420 -12429 30409
4628 30409 70262 48171 37411 -30150 -32813 -4100 16981 56696 69589 60115 33931 3516
4616 3516 -1228 10879 22225 3593 -35229 -49820 -36668 -22384 -16857 -33419 -53022 -47602 -34324
4603 -34324 -26036 47044 70362 32281 26388 24145 -2199 -12877 -18893 -4576 31771 23991 54632
4590 54632 86747 94707 44121 76 11420 29222 41828 14800 -44925 -39808 16645 856
4578 856 -63023 -4763 72172 64408 34331 67480 27814 -21712 5760 64970 66388 14131 23725
4565 23725 51497 83082 51464 30174 -5507 -16313 -85022 -58739 -24762 -4719 -19185 -63812
4553 -63812 -103286 -109390 -72795 -37650 -39222 -24214 11131 16758 -56411 -87371 -56392 -11398
4541 -11398 -18137 -30212 -24017 -25529 16523 12501 -21447 -15444 -14732 -36536 -75883 -73741 -64642 -47721
4527 -47721 -56816 -40981 -36115 -34524 3667 -8971 -77247 -95321 -60028 -62111 -72991 -89281 -55167
4514 -55167 -16458 -24714 -32153 -10747 36201 51119 33685 6678 -2226 -27549 -37523 -28783 -43319
4501 -43319 -18466 28000 -2143 -23957 -1682 28197 1460 31580 68931 44888 55004 83434
4489 83434 89984 83121 53092 68361 107151 93247 51893 -14202 -12694 -36758 -41721 -27403 12334
4476 12334 25917 27236 28869 8419 6725 10548 29118 -2379 -48676 -52192 -35999 -25411 -4880
4463 -4880 13381 20206 30395 62694 68740 53547 34136 -27442 -50113 -33672 -33950 24830 64975
4450 64975 51685 11125 -7774 57674 107611 63173 52188 14145 11979 14946 32224 47666
4438 47666 27583 9620 -30146 -2634 27905 73206 73974 43508 31413 14837 -17815 5998
4426 5998 39691 31533 31587 1043 -34497 -45258 -65409 -23822 13527 35987 -2260 1090 6773
4413 6773 -36186 -51303 -28814 -38927 -12371 -28291 -22129 11586 32773 41053 67775 65228 72446
4400 72446 58847 18688 -3819 -3975 -11081 -12815 -17251 -39319 -29992 -32994 -8343 1457 -19290
4387 -19290 2082 -8620 3613 2144 46957 65047 43553 62916 70819 52135 24566 56688
4375 56688 35438 -22092 -36768 -10096 21025 44365 62030 52671 46179 15824 22100 16314 -3209
4362 -3209 21260 46368 62894 33186 7671 -5009 371 7592 8120 33311 54290 63754 82374
4349 82374 91049 60269 45085 92145 32424 6814 10648 16889 -11603 -16712 -31177 2140 -2621
4336 -2621 -38068 -78846 -112747 -83388 -42897 -18583 14152 71226 61420 22637 -9925 -5030
4324 -5030 7912 1595 -13563 -16393 -15199 4957 -9555 25203 26165 -19388 -37243 -60876 -50681
4311 -50681 -15866 7662 16666 -16932 -54266 -82003 -88637 -63817 -25315 -7533 -10981 11150
4299 11150 -22925 -36274 -43581 -78705 -91001 -13585 23457 21342 -13456 -32645 -28560 -22890 -8063
4286 -8063 18934 38011 33707 -40524 -55816 -11774 -31717 -27342 -28332 -12469 -23240 -61866 -45372
4273 -45372 -52418 -34567 -19078 -9435 -26449 -27109 -9826 25348 39505 33653 69839 87161 16185
4260 16185 4693 -24494 -32307 -22827 -47481 -60358 -6848 3709 15145 38255 6773 22403
4248 22403 14914 13471 -14158 -30999 -25453 -11175 -4476 -13692 -21628 -44871 -73922 -43936 -14364
4235 -14364 -34280 -67721 -45010 -16863 3729 53903 97522 66344 46080 49564 35851 -4903
4223 -4903 -21448 7926 14044 -21133 -18516 -16573 5410 43584 83204 92469 73007 53827 37035
4210 37035 9215 15099 -28361 -11955 400 -15096 -30225 -55282 -46785 -22701 -13413 -28404
4198 -28404 -6144 42071 28079 1359 8222 -13829 -47826 -58501 -30250 1712 212 694 -23422
4185 -23422 15499 46729 45172 33749 28434 8533 -2846 -3244 -3595 -9015 13985 8011 650 -15478
4171 -15478 -7896 -2563 -20644 -38602 -29072 -31657 -64252 -93979 -79184 -39079 -15189 -4636 11553
4158 11553 -19343 527 53166 8788 -24166 -56468 -62720 -53430 -80407 -50430 -33 5506
4146 5506 -12263 4004 50897 47277 -7369 -9852 7100 1408 -46999 -45465 -11298 -1297 -28437
4133 -28437 -74019 -53525 2721 18952 11575 1033 -14695 -27133 -22071 33647 62711 49834
4121 49834 71853 5522 -9478 20391 26642 3395 -32922 -37103 -24903 -2284 -6681 2767 -16353
4108 -16353 -15236 26730 34102 60965 34929 5665 4192 1545 14637 1401 -21966 -63698 -55896
4095 -55896 -60729 -39485 -18700 -3796 14791 31908 486 -15249 -15401 -8848 -16784 -25340 -27963
4082 -27963 -51451 -85228 -86532 -44785 -24267 -12914 9970 73592 80637 28148 4927 11746
4070 11746 -17402 -2371 3057 9158 33641 70984 62770 32313 33963 -7001 52173 57010 21551
4057 21551 26845 13153 32993 -17589 -40731 -14287 15269 20187 7794 15978 38973 32446 -4369
4044 -4369 -28371 -3672 21068 15503 -25658 -36802 -31297 -21869 10776 -6603 -32908 -28090 -31075
4031 -31075 -23170 -14305 -29199 -100542 -122740 -63483 -24643 12670 3754 17347 19690 6882 2554
4018 2554 2634 -19854 22098 43722 42808 30484 -12697 -11394 33683 24963 -20613 -35211 -4561
4005 -4561 9569 13915 -39739 -84988 -30087 -8994 -11407 -35388 -22332 -10695 -9943 30650 73621
3992 73621 61319 10216 -11061 37221 67117 72630 29378 -31609 -25181 -19436 -41368 3343
3980 3343 42787 65827 43666 33701 10357 -25156 -27113 26663 62868 51695 1282 -14987
3968 -14987 -33806 -19729 -12202 -34616 20721 23100 -3242 -15055 -4833 55177 63148 65105 38652
3955 38652 51311 66347 85705 90634 47621 18464 24083 24161 12695 -3762 16370 55820 66189
3942 66189 58162 33912 62702 69389 97329 116393 96006 68271 13456 973 26677 18257
3930 18257 9856 -1284 -63349 -41775 -524 -25899 -32158 -54589 -38854 -9133 -19104 -40439
3918 -40439 -26065 3287 -2625 -15502 -42878 -62490 -8734 9197 5534 16704 4499 -42679
3906 -42679 -17034 -8394 25334 46547 8382 -24013 43330 79046 89960 88859 65094 81978
3894 81978 85766 47414 25643 27647 49350 81168 48758 14042 12431 5802 3317 -4255 -16751
3881 -16751 -18739 -3150 17162 45802 10247 -33618 -78780 -48689 -10786 -7455 19607 57668
3869 57668 61457 21917 5800 -4390 -27001 -58084 -10334 -20816 12000 -11350 -64844 -66375
3857 -66375 -47189 -46715 21338 30139 30901 43026 42659 52316 43908 49018 29922 -28037 -62327 -57102
3843 -57102 -59153 -80418 -46494 -14048 -21369 -32774 -35926 -45092 -21607 -21646 2274 20871 -6438
3830 -6438 -21171 -59846 -29658 -15789 -47240 -63526 -70539 -58135 -70215 -65658 -89710 -83112 -64671
3817 -64671 -38741 -39481 -76894 -108725 -96255 -68611 -34839 -30859 -52285 -42238 -14008 -2227
3805 -2227 -31739 -72867 -53789 -30500 -56170 -32543 23776 51613 29500 34210 45443 13800
3793 13800 23279 81197 118456 62024 13871 -11614 -38370 -35579 -42215 -19700 6219 -6934
3781 -6934 -20952 -24576 -39632 -37403 -24553 -46788 -47688 -16710 -11919 -27363 -16330 3301 -5821
3768 -5821 6087 15785 19215 10278 13849 33801 28255 23710 41150 63830 53121 45471 18586
3755 18586 1567 -22447 -29094 -12814 -22271 -43238 -15059 -22424 -51552 -42273 -41565 -51112 -64451
3742 -64451 -33832 8300 -1543 -6129 -1385 -6684 742 25436 -26390 -5092 3410 16359 -1137
3729 -1137 7813 -15929 -54178 -38861 -33551 -64850 -86600 -78410 -63971 -42355 -20622 -21518 -3868
3716 -3868 26431 44978 20183 -25739 25225 1472 -12838 12846 -7690 6502 18480 33972
3704 33972 32526 27513 40512 69621 65059 32836 -18930 -63850 -40869 -7961 -13023 -7928 -28272
3691 -28272 -77724 -73701 -41608 -6257 -9628 -4675 -9664 -8604 -4283 -9659 21456 8287 -18452
3678 -18452 -16765 -27558 -34496 -48790 -32981 -5440 -2607 10050 46760 42983 34790 62848 45738
3665 45738 9395 -24838 -4285 21023 19522 19758 35339 29993 14885 -48678 -41374 -4154 4489
3652 4489 19414 43915 48465 32555 -8718 -17071 7064 16130 -23394 -40448 -24044 -48531 -25649
3639 -25649 31478 61041 62245 36404 24174 40105 38609 43342 79948 84216 31402 -9542 -27610
3626 -27610 -41995 -44147 -43228 -29858 -25240 -13334 7469 26727 23181 25343 38504 -1563 -30854
3613 -30854 -4068 5257 -33251 -50220 -37066 -27448 10205 36958 27398 20256 362 -48449 -62650
3600 -62650 -15507 12949 -324 -13586 -40069 -28866 -69346 -100420 -91410 -85576 -44009 -2671
3588 -2671 13972 -938 -32902 -35994 -53826 -34123 2363 9904 -30700 -36186 -28028 -49346 -50025
3575 -50025 -26342 -2500 -15695 -29648 -48064 -15808 32227 61554 69488 76960 44351 -47679
3563 -47679 -47292 -64430 -46121 -4907 38753 61064 65971 6616 -3649 11683 -968 -4108 3464
3550 3464 -24181 -48004 -25483 -32810 -36162 -17483 -33296 292 29862 31576 10650 -49232 -45056
3537 -45056 13614 4188 4284 -16264 -64096 -59538 -67481 -36731 -18777 -17694 5572 16820 6439
3524 6439 -23360 -23826 -30823 -20727 -1537 -6050 -16999 -38972 7279 60589 65776 53766 28952
3511 28952 -29957 -34953 -6462 -42531 -52053 -72736 -43937 -26320 -39568 -54408 -75510 -56050
3499 -56050 -12096 -6553 15681 24102 41413 934 -22887 14732 52907 2138 -33669 -46256
3487 -46256 -40015 32877 61504 44552 -16380 -31969 -59034 -47361 -18991 3693 -8911 5524
3475 5524 5814 -12229 15611 23732 -37048 -43023 -62944 -107448 -87192 -47271 15156 38480 47147
3462 47147 44619 38988 46375 -9203 -63181 -59236 -87675 -85260 -72344 -23223 19679 -3270 -12088
3449 -12088 -2404 -14214 -49488 -42857 -46128 -34213 -16045 16220 31878 39670 33510 -4565 5902
3436 5902 -5595 -5362 18164 31329 -4554 -30209 -37101 -69358 -100787 -74769 -55824 -41137 -15782
3423 -15782 21877 24960 30158 24275 57667 69722 54882 24897 6662 -7397 -7731 16470 54746
3410 54746 45211 2626 26416 38430 -2632 -45087 -46685 -33984 -58776 -61530 -39045 -20514
3398 -20514 22096 85534 72070 34676 72007 6937 -45317 -38042 -21030 -5319 -13995 -5172
3386 -5172 -14070 -1528 32209 6445 -2831 -57724 -49174 -35685 -27656 -22378 14372 57678 58788
3373 58788 27563 19161 23953 -17760 -29037 1231 46861 50894 76425 38583 29657 3332 -49254
3360 -49254 -21616 30957 52674 16339 -4866 52282 71256 41993 -19375 -74872 -87134 -36813
3348 -36813 -36628 -35493 -20230 31654 58375 63191 64557 69513 83538 53003 9866 -7629 22333
3335 22333 -6964 -18946 5480 8680 15992 -4170 -53443 -65789 -59070 -12542 37927 45959 -18324
3322 -18324 -61785 -31279 41833 26923 -9430 -7167 15230 51048 79885 58149 26841 19239
3310 19239 91995 99311 40827 8187 14364 18342 32398 27629 -8318 -63542 -57471 -17511 39326
3297 39326 44765 8147 -35776 -30236 -38727 -59279 -19471 18081 -3607 12178 -19065 -40397
3285 -40397 -55602 -58978 -14304 26449 46688 23654 21418 -661 16291 30402 -13926 -20812
3273 -20812 23362 20888 17960 -4116 -37823 -12295 2439 -15038 2896 -9907 -7098 -22145
3261 -22145 -27444 13777 41696 57645 39398 -8065 -33565 -31798 4920 31712 57479 59235
3249 59235 29730 13357 3218 10569 52429 64463 29217 10465 -32723 -59436 -8952 5142
3237 5142 -25048 -30669 -8807 19833 -35158 -82373 -29592 13148 10212 -11389 -32572 3121
3225 3121 56247 23711 23086 46725 8341 -27607 -43392 -37490 -40754 -4314 4035 8737 -24986
3212 -24986 -76363 -123228 -132467 -85261 -61616 -101990 -73455 -24780 -5417 -27993 13310 76455
3200 76455 61234 -6651 -27147 -8577 -44265 -1279 30977 -2766 -839 28211 3210 16887
3188 16887 56423 38119 -1009 32452 71202 91541 81586 14444 -8619 -32170 -74553 -99339
3176 -99339 -144954 -180027 -133390 -102126 -52982 -12664 -29887 -61415 -29621 -32911 -17936 -14043
3164 -14043 -19351 8753 39738 25173 -4189 -18994 1128 59702 35718 19752 27007 24498
3152 24498 22812 39139 17663 10024 6150 -13426 -41398 -8064 3315 43464 58653 19863
3140 19863 21962 16123 15019 10387 22336 73479 16716 -4749 36065 63020 72444 26519 -17222
3127 -17222 -65258 -21002 629 7127 -49736 -65974 -30680 -32269 -24314 24426 16836 -25302 1705
3114 1705 58816 49598 13145 -23579 -13000 34078 46271 23504 10800 -9560 228 22348
3102 22348 56259 46321 4814 -11334 -2973 14266 4280 3078 17870 3941 -1653 20733 -20202
3089 -20202 -56218 -47495 -5448 33001 31560 11292 26325 25126 15092 14922 -833 -32313 -21061
3076 -21061 -20478 -43870 -13302 10028 -3219 -31887 -58653 -65840 -14096 7366 -34639 -46529
3064 -46529 -36552 -36896 -15442 -7365 -17629 17085 -18511 -23364 1124 13261 -9341 -38235 -27926
3051 -27926 -61013 -63305 -35128 -23359 -12533 -27072 -7814 3414 43983 57203 29742 -20344
3039 -20344 -37235 -38089 417 37231 20229 7670 4215 -4620 28519 31563 25298 -1504 -23559
3026 -23559 -46083 -11075 32164 43106 3243 -5356 -18186 3192 23549 5657 -10623 -4836
3014 -4836 15868 15763 21723 10121 25300 23306 19468 35343 58900 54594 25665 1128 -23914
3001 -23914 3566 55140 76710 61209 85700 63054 22683 -46241 -42617 -10807 22852 -6840
2989 -6840 -46658 -21765 -8943 -4364 24022 20355 11516 -33437 -30215 -15446 15240 12222 23003
2976 23003 11446 -3696 4838 12033 -963 25855 68474 65313 42672 30220 -21918 -51940
2964 -51940 -25587 -728 29244 35117 45066 66282 41592 43587 15987 -10916 8839 13681 92
2951 92 34043 21478 19662 78775 111544 97356 97752 100337 10700 1229 47150 96674 101003 87700
2937 87700 63842 32774 27857 -3113 -5345 28420 58518 59112 29149 24375 -6219 -12717 3186
2924 3186 656 -16257 -21103 -31474 -61324 -69114 -48223 -50426 -40345 -31843 -1520 17988 9071
2911 9071 18790 40535 38063 10647 -55716 -32628 9328 33497 29298 -16545 -25222 -35543 -48379
2898 -48379 -25177 10875 18501 -147 12864 -21522 -26741 -9365 21552 10243 -36411 -49327
2886 -49327 -31188 -23503 -23034 -11855 39871 19203 31452 46484 -30729 -46696 -15403 -29755
2874 -29755 -49839 -25673 -4824 48899 42981 30712 51997 26673 -12732 -39648 -3049 29717
2862 29717 10221 -21820 -29804 6182 18849 8527 1381 14550 11043 13245 -14318 45916 107506
2849 107506 112545 97958 46325 7459 -30833 -18427 -28215 -62748 -50394 -49643 -25796 9349
2837 9349 -23255 -39197 -9007 -15452 -50477 -17860 -8239 -7379 28639 71051 56145 6194 28144
2824 28144 64073 94983 36955 -24388 -31902 -25766 -40282 -46588 -70733 -75560 -40051 -67156 -71280
2811 -71280 -72024 -78991 -60067 -56969 -57386 -33412 -8717 -10302 -6512 40951 66244 91378 30483
2798 30483 22688 39886 45775 62824 84304 50562 -635 -487 18855 24443 19804 25863 -14032
2785 -14032 -41011 -6402 21831 30429 25413 -29122 -45270 -16376 -31889 -51293 -38778 -60794
2773 -60794 -48648 -33014 -6323 -17160 -42561 -45207 -44203 -17238 4708 13362 15525 20706 -9149
2760 -9149 -17589 -32110 -17682 -19531 10982 6630 123 -31210 -99134 -86813 -19854 -2748 18589
2747 18589 -16455 -34686 -53285 -43364 -1883 -928 -18043 -43875 -46381 -65103 -81157 -56409 1605
2734 1605 1287 -13098 1570 2854 -21860 -59587 -61904 -47665 -17236 -26435 -44116 -66389 -66035
2721 -66035 -47047 -32995 5922 -16842 -36954 -5990 -4010 -28892 -20480 5818 -897 -18732
2709 -18732 -31709 -13841 -14107 16813 33208 20758 1663 -2349 -29786 -19419 -19954 6709 -4670
2696 -4670 -20909 -24608 -9746 41869 14782 17991 29026 28654 3503 -16274 2547 41546 50825
2683 50825 54239 68635 23906 8178 6255 -917 -51319 -63764 -55529 -38065 -37645 -70599 -44226
2670 -44226 7773 31542 28262 -7684 -6612 -19163 -46250 -44835 -27288 1664 46691 54614 60586
2657 60586 57014 80174 77959 24485 -6509 -11855 -14604 -123 1275 8940 35998 38498 -5766
2644 -5766 -24362 -29037 -48027 -61845 -37520 -8692 3646 -15639 -30370 -43156 -40658 -26550
2632 -26550 -44840 -71279 -61609 -82034 -55540 42226 89405 45835 16192 11465 -6458 -1932
2620 -1932 14426 33066 44780 34683 9101 -13662 -34721 -10935 8393 22012 -890 18315
2608 18315 86081 114379 74308 12383 -17914 -34944 -25498 48804 32439 -2129 -41386 -36038
2596 -36038 -26215 3617 -6078 -10347 -4103 4255 18376 24420 17686 -16396 -26361 -53562 -42031
2583 -42031 -30857 -2498 26317 35575 76140 50046 -10794 -46211 -39367 -38058 -19033 11095
2571 11095 8400 -26532 -42255 -12446 16000 24707 25559 34896 59713 82157 26952 -6575 -25715
2558 -25715 -48556 -46823 -13870 69476 102411 105748 79577 24194 11059 33407 58218 74326
2546 74326 33206 27835 6746 25897 57891 56931 17389 -9198 10428 50353 79121 68344
2534 68344 68377 94930 55235 -33157 -78979 -49006 8379 6619 19211 -10868 -2615 42733 12448
2521 12448 10996 29870 -17988 -36683 -75594 -101731 -103196 -94254 -82650 -54603 -70493 -26237
2509 -26237 12523 -910 28714 10075 -16405 -13930 20198 10597 -18944 -19258 -11053 -4838 -24803
2496 -24803 -31365 -27773 12719 59284 61575 -7812 -30207 -56119 -25133 20981 29566 -2965 -14392
2483 -14392 -47637 -44705 -69513 -33424 -41225 -40157 -67504 -51949 -63140 -40723 8003 6611 -6175
2470 -6175 -42843 -105380 -76855 -80722 -52638 -42140 -36303 -42707 -71798 -88879 -66860 -23217 20551
2457 20551 15608 17977 51140 79430 16370 6667 -23040 -18520 -25430 -21048 3520 -24642 -521
2444 -521 24705 38160 18265 22093 5359 26841 37532 44905 34510 23401 1676 -35624 -30786
2431 -30786 -11436 -2828 38374 69511 41403 9155 -15180 -36014 -7002 33021 44369 56049
2419 56049 69594 55024 13164 -39031 -42433 -2634 33369 75209 31323 -22141 -10620 -18199
2407 -18199 10537 12579 32038 31025 58362 61857 50469 24325 33028 54408 87489 90660 116715
2394 116715 97806 86499 74031 7991 -22816 33393 55447 18033 4943 5704 14203 38263
2382 38263 50797 52385 46570 45552 77145 69696 51339 93267 21477 -7021 4634 9681 13989
2369 13989 23659 39562 61720 34886 879 2149 16357 40099 30825 79895 95131 46936
2357 46936 44105 41606 35833 15736 24435 46707 48042 6767 2085 15882 20416 42172 84179
2344 84179 77681 42736 54966 73407 41006 7209 -19664 -20162 -522 26193 30247 52257 69687
2331 69687 39306 48405 84650 51814 10178 -6202 -29645 -41802 -46956 -51518 -17551 37636
2319 37636 7463 9534 43152 51116 55926 28840 2734 7697 20369 28882 18549 33155 62837
2306 62837 61966 77930 63065 43231 16967 -10399 -47428 -53467 -30065 -37975 -22305 -20478 -29401
2293 -29401 -48798 -748 24517 -10261 -40685 -44161 -3902 23324 -12355 -18244 22249 32778
2281 32778 31496 -6700 -7999 -54314 -71802 -40775 20395 32720 31319 57905 49105 10688 -29600
2268 -29600 -1231 22193 -29010 -44718 -30712 -2367 22630 3789 -36500 -32487 -7510 -19495
2256 -19495 -17257 -13237 -29463 -40217 -38616 13990 33606 51157 59278 74222 69577 57657 53721
2243 53721 66433 97006 65469 30673 12342 14260 -4748 -15795 -22200 -45102 -37209 -21006
2231 -21006 -5905 22117 64880 84127 73789 66545 44555 70775 75645 37451 55565 105100
2219 105100 175739 161569 112515 106527 63829 28734 35780 3489 -32708 -11840 70894 43101
2207 43101 13707 2684 17058 18134 -20079 -34134 -14165 -37447 -42124 -13884 -19785 3774
2195 3774 12936 28375 8043 -832 9112 37418 28008 29472 35604 41660 15505 7924 -16182 8311
2181 8311 12931 11499 15602 -629 10600 40343 62932 32301 14254 -5621 -7042 9106 51011
2168 51011 35701 63386 36838 5513 5018 -7361 6950 17330 965 -15756 3146 28300
2156 28300 33686 16379 17134 -19200 -59883 -51714 -33680 -34390 -30728 11020 40432 38665 26850
2143 26850 -22079 -41374 -32649 16617 35777 29591 8981 -4909 -8230 -29821 -23002 -16821 4841
2130 4841 11510 -8042 -15066 11896 24479 48386 27849 36127 82448 56687 33877 50616 26683
2117 26683 1665 -41578 -23005 -79 16330 52225 53930 25864 35550 -14110 -53744 -61211
2105 -61211 -67776 -64891 -57487 -6874 -10440 -10785 2577 -6327 -11560 -2934 -57610 -78337 -45774 2587
2091 2587 42417 33702 22168 5025 51721 50758 18343 -4890 7274 45452 48620 46428 14589
2078 14589 -31742 -9076 -20045 -28628 4960 9397 18619 54875 58047 19880 -19515 12974 64459
2065 64459 37203 17778 -3719 -9924 6103 3904 -23757 -47001 -40490 -32359 -25818 -35454 -46378
2052 -46378 -37385 -20356 -7992 -17393 -67079 -47231 10677 -15277 -53362 -63108 -70514 -67541 -72624
2039 -72624 -43666 -13863 -24435 11453 30162 36137 57731 -81 -24869 -31881 -35441 -25337
2027 -25337 10871 71823 74406 48665 23969 26185 17355 -8017 -40717 -71800 -70588 -60354 -27916
2014 -27916 -9530 13439 -3175 9877 21144 3747 9593 -611 -1531 -24550 -27916 -22273 -21175
2001 -21175 6977 18747 44414 27272 37816 36923 60741 41104 24414 -358 -4659 35430
1989 35430 28083 10983 9126 12615 -9185 18271 5757 -28949 -10717 26942 17222 43766 36182
1976 36182 6873 -35191 -56561 -30127 -46838 -35777 -51083 -42152 -16728 -19118 -60717 -73908
1964 -73908 -15062 -11284 -77187 -102105 -48347 -41079 -67402 -44978 4521 43198 80865 112860
1952 112860 76789 20178 14362 12360 25071 6003 1814 13126 30521 18171 42762 7224
1940 7224 -21134 -10546 -7406 -29452 -13943 -12116 -11894 -9382 593 22078 33795 33983 25493 20268
1926 20268 6154 62409 93652 97318 69762 30783 19924 73580 110991 109386 61382 39220
1914 39220 52224 63874 75575 59227 34445 48246 58644 27654 35068 34126 56973 6772
1902 6772 -40679 -20268 13750 53686 60306 63983 62535 76106 87059 61354 14874 -14246 3166
1889 3166 20077 -25947 -47637 -39373 -22551 -16517 -10298 1784 -20580 -42091 -31062 -35484 -17338
1876 -17338 -20050 -59710 -34258 1820 12154 30103 20899 18632 32680 17369 -2077 29797
1864 29797 88275 74574 52228 80606 79847 78485 22017 2644 40235 79809 59677 13255
1852 13255 -1113 12102 -640 -6000 24050 11110 -28970 -17136 -9302 8522 11976 14805 21119
1839 21119 42352 45829 64988 25918 2544 19782 20657 35059 27650 34813 22817 49837 43527
1826 43527 13117 -29319 -39844 -1701 2417 -52569 -91153 -81060 -79061 -40209 -27861 -13619
1814 -13619 26202 58493 21935 -19641 -28110 -45092 -23152 -9422 -6785 10539 -4257 29774
1802 29774 -23687 -43350 -65325 -47026 -26692 -792 -7232 12519 48171 29825 -4948 -18472
1790 -18472 -27170 8454 -24428 -46585 -4679 11024 12928 18227 35395 42687 36525 65503 15264
1777 15264 5490 17493 3075 -12300 -52649 -64999 -81736 -70479 -94397 -78824 -93162 -58789
1765 -58789 -30111 -33578 -15614 17946 37045 12239 -28665 -50563 -30879 8292 22503 -7270
1753 -7270 -7613 20602 46817 58902 36462 -571 13241 34728 58489 89921 62155 -12288
1741 -12288 10944 -41010 -22672 4579 -1924 -12245 4784 12085 -40215 -33456 6995 17521
1729 17521 21982 25468 35544 16348 -43845 -31195 -16398 -25405 -18161 11751 17981 41731 54268
1716 54268 58618 69823 82968 60623 17516 1406 -38023 -13560 2612 8664 9414 -11458 -10620
1703 -10620 5797 -11019 -54659 -69850 -82519 -58120 -28466 -59645 -23818 3638 -4622 -8759
1691 -8759 -41060 -39609 -16950 -7098 -8879 -46281 -23925 20169 20062 37906 15627 -9425 13576
1678 13576 66110 75116 40174 44449 34083 29056 40722 19094 -32368 -33355 -11078 -25633 -27800
1665 -27800 -53376 -45814 -29088 -42745 -39125 15112 5116 -4558 -6113 -5882 -19954 -20328 10185 52086
1651 52086 61165 59801 51186 13327 -7204 24894 18010 18149 42225 34387 32236 32461 3626 -21057
1637 -21057 23494 40017 12485 -22638 -43357 -33571 -61403 -48167 -33921 -74646 -86358 -81459
1625 -81459 -62805 -35051 -8571 6281 11810 -8563 -18594 -34419 -10558 -2406 -25815 -20431
1613 -20431 -12119 -27565 -39426 -49270 -45824 -51392 -9663 10926 47471 20850 -7826 -39002 -29484
1600 -29484 3952 4380 20827 8851 2335 -9061 -1083 -5752 -5195 -25364 -21229 14701 -8539
1587 -8539 -33264 -424 21565 14969 13594 37358 59517 102691 68315 23300 20892 8116 -2087
1574 -2087 11031 -956 -17544 -7178 3501 -14543 -12948 13825 11230 4465 -16403 -43981 12789
1561 12789 18042 -23598 -10596 -2383 -9726 38552 99110 33383 -32271 -8000 40082 67575
1549 67575 68608 56194 60975 48159 2042 -19848 -46698 -39555 -32843 -36221 -11192 33116 36972
1536 36972 5397 14417 25082 52063 58087 25130 5371 60237 111753 107227 86171 72310
1524 72310 62895 17155 -28566 -21079 -4240 -2141 -3363 22321 38832 5426 -8765 -35878 7645
1511 7645 2465 -13098 38657 46720 48272 41495 20596 43145 64676 35230 13188 -16164 12265
1498 12265 -2307 -6862 -31623 -2133 55191 36961 25770 35146 6548 764 24686 31408 32696
1485 32696 11795 41470 40635 44429 70711 29305 -6354 10598 53158 930 -50689 -63295
1473 -63295 -46061 -43540 -20117 -18480 7340 36323 40406 33714 34711 13230 -1187 3916 19053
1460 19053 -12775 -24531 -46760 -11040 -26377 -16045 -7301 -24773 -15145 24914 60307 62906
1448 62906 68166 87536 73477 65162 25077 -11278 -14406 -11857 -6269 -14206 -25222 -57865 -46121
1435 -46121 -42864 -44101 -59692 -43087 -11428 -81 -30401 -54998 -33329 -23342 11527 -20224
1423 -20224 1645 50864 29368 25800 34556 40788 18266 -18614 -6104 47106 53196 7056 10774
1410 10774 6127 12983 36418 35003 16130 -9034 -10434 -62949 -37747 16607 3832 -20101 -25283
1397 -25283 -48529 -76304 -58097 -44576 -41268 3353 -334 -20975 -6105 -24430 -26875 -33718 -53360
1384 -53360 -37780 -24227 -25262 -13729 5284 -2016 41698 57129 47207 9534 -12159 -57204
1372 -57204 -102479 -93222 -43679 -57182 -104471 -63514 -68187 -24034 -25147 -60047 -61369 -40952 5734
1359 5734 41532 43652 67820 75678 50716 29880 19790 14783 28702 115039 74816 641 8517
1346 8517 23590 33299 17002 -8893 -13439 -636 -31974 -50527 -30289 16401 16232 -12447 -25296
1333 -25296 -34655 -36825 -10628 50977 47686 -9326 -9379 -28314 -64266 -75237 -26415 20979 38771
1320 38771 19109 10004 -31618 -64715 -52417 -59585 -50319 -14843 -1409 23276 40749 15879
1308 15879 -19065 -34761 -29713 -53882 -36551 -39420 -32297 -17162 -33341 -41449 -21630 -39668 -82263
1295 -82263 -85080 -47514 -23776 -30049 -23452 -15074 -20335 -26038 -30206 -37055 -46002 -45805 -60487 -23895
1281 -23895 21415 18289 -21843 8233 32364 -10151 -23376 2099 30173 52682 52684 39735 70466
1268 70466 37141 -36532 -46509 -4268 5309 14307 14416 -1703 17203 13581 4897 13197 30575
1255 30575 57743 27665 -4063 -27763 -68521 -63955 -24524 35311 44889 80493 96589 107405
1243 107405 49339 25086 33318 16892 -14136 -60300 -60667 -52819 -867 50043 48268 -11310 -42463
1230 -42463 -55640 -55487 -74926 -95198 -94071 -112010 -60477 -55615 -53477 -22563 -22911 21296 2763
1217 2763 -15254 -33146 -23572 11959 15814 -14858 -21133 -10207 -45431 -50580 -51125 -25724 20962
1204 20962 17639 -23837 -40835 -41578 -66777 -35011 -4523 17467 26386 2039 5782 3883 -19956
1191 -19956 1924 24114 -29940 -58864 -346 41602 31437 13851 24539 33769 34454 32044 7357
1178 7357 8366 -5382 -15234 -18331 -43547 -55588 -38387 -16217 -5880 -42911 -41763 -14882 -7785
1165 -7785 -40044 -46229 -42288 -9666 -1041 -51120 -46413 -26423 -18397 -567 -7090 39500 42313
1152 42313 12589 -40216 -57523 -79840 -101806 -126791 -100824 -35650 -2235 20283 11741 14259
1140 14259 14984 8114 -3641 -21726 -8597 -31212 -48862 -34032 -41344 -14150 33717 60894 31577
1127 31577 5427 -14467 -26128 -24414 -27401 23735 42308 19992 -55351 -64124 -41060 -5167
1115 -5167 -35603 -48332 -23524 -42083 -52171 -11410 -15213 -1756 38633 41950 17769 -7137
1103 -7137 -3249 3343 38217 64847 56826 38786 16599 -29574 -34013 -36828 -40149 -14698 -641
1090 -641 17570 39372 -25400 -34028 -18608 17007 36173 39384 47354 37040 13841 25319 13530
1077 13530 17829 35204 28843 -3043 -5859 9068 -10990 -33150 -2009 836 -4102 -46271 -66595
1064 -66595 -4543 -1772 -46918 -68748 -53971 -13481 -4594 -34240 -45044 -34019 -15431 7382
1052 7382 -9040 -45083 -41718 -29425 -36377 -74825 -65594 -51530 -8588 51788 27279 31791 8467
1039 8467 -17479 -7392 30191 53755 -1172 -45249 -81833 -87736 -72249 -11237 -1970 12622
1027 12622 44646 28152 41553 -13920 7525 24503 14680 -24396 -81055 -107693 -117665 -78718
1015 -78718 -64034 -16498 -5842 -3786 35178 48505 58053 79604 71099 55123 25218 32403 51745
1002 51745 52685 43871 47277 21474 4311 -9985 -6658 653 28196 -5860 -24441 -15470 -24388
989 -24388 -241 29965 21852 29459 69165 66153 17354 28695 33370 3471 -3778 -26004 -23163
976 -23163 15529 15033 26653 28051 64960 71944 -11207 -15845 28742 23539 -16536 3829 44762
963 44762 57586 64450 28403 19163 9814 11429 24545 34444 19264 -8091 16605 17247 14624 7823
949 7823 -2764 -27494 -37505 -38217 -29538 -28436 12993 31453 32511 -1917 918 -40630 -41013 -54707
935 -54707 -40019 -29349 -45751 -35343 -76525 -91107 -19022 2916 4950 33709 50799 58170
923 58170 48145 38643 35883 48606 42579 48517 89246 143050 137500 105048 75253 26565 33598
910 33598 36677 45783 30383 -9967 6778 -19664 -32001 -20586 -10370 -33867 -31995 -75072 -48348
897 -48348 -11605 19767 26433 680 22148 26355 -8332 -25805 -43519 -67169 -87158 -102285
885 -102285 -136183 -100490 -40798 -23827 -44320 -1727 5343 -5570 -1333 11740 3979 1262 -17425
872 -17425 -14078 9732 -33874 -46562 -7807 44655 43169 48418 67793 63038 68959 34683 2409
859 2409 -3978 -28817 10312 42906 41003 4675 -37053 -25069 30098 68766 68380 65814 40534
846 40534 -672 1029 713 25751 46825 50438 62919 67588 85173 55884 39536 51150 41097
833 41097 -6705 -43454 -45675 -30616 -345 -2480 -15902 9874 305 -6154 19873 7159 22906
820 22906 36431 21464 32195 35022 23041 17405 54478 85379 81799 43902 21161 -16718 -6597
807 -6597 41222 30053 -31 -30941 -30214 -36454 7436 22181 5689 -4445 -39334 -38699 -57102
794 -57102 -50735 -27216 -14907 28165 61978 95876 65359 18396 12676 -32760 -47205 -55087 -50397
781 -50397 -41674 -27228 -5908 33247 57021 16996 -2432 -53586 -94565 -83000 -71017 -29217
769 -29217 -5992 16272 40373 64467 98564 68580 21854 -24345 11654 44382 44893 23217
757 23217 23473 24357 38232 -912 -4724 21774 35674 75099 51709 15390 34533 38110 36955
744 36955 -2225 -61116 -36209 -17551 -34629 -20907 2799 -6799 8864 21727 47598 41777
732 41777 5289 20082 1863 -28002 -28097 -45649 -31137 -1743 14292 38624 54433 23284 -12123
719 -12123 -25233 -8627 -9809 -21952 -68396 -76092 -28792 9978 12909 2625 20571 24779 44525
706 44525 20470 -2553 10438 17333 -30855 -581 39411 31022 -22187 -11849 11312 24204
694 24204 -2326 -10216 57387 81524 72859 12772 -361 -10053 35782 34778 33055 40691 53327
681 53327 35404 2305 1517 -16343 -38514 -20145 -8934 20527 63250 100050 89974 64030
669 64030 48511 59410 71521 107591 132332 96497 36372 -3915 -17592 -10858 8722 31579
657 31579 25635 -4789 -29687 -13650 -46927 -43472 -31863 -47108 -53258 -80830 -70024 -40743 -21506
644 -21506 -46107 -32784 -19959 -33185 13039 22130 30984 -12853 -21587 -12546 -20732 -67190 -85382
631 -85382 -25834 -16722 -31581 -14801 -5288 -8185 -29078 -49199 -23899 -35996 -44909 -55864 -19465
618 -19465 -29241 -52949 -59746 -43299 -22495 -2791 33269 63984 87096 40218 39256 52211 78579
605 78579 41970 27907 24773 21880 -66448 -88801 -54697 13444 62104 103315 109774 89635 78126
592 78126 48101 16720 308 31208 6079 6389 12834 34794 6307 7714 -16048 -54635 -38481
579 -38481 -58425 -75585 -74789 -65069 -37183 -26632 -44121 -44232 -12832 -20567 38566 100176 82693
566 82693 102385 44397 23838 7515 9255 26126 -8531 -19662 -23507 1713 10862 -1142 -26696
553 -26696 27670 12677 3920 -16274 -41325 -62307 -59267 -42519 1890 64357 65478 51779 91776
540 91776 45951 -17656 2124 53349 65255 79295 119737 75856 44534 69514 80368 73521
528 73521 69034 53886 47818 16832 5288 52003 43279 2171 -10707 22723 66556 43130 16541
515 16541 28335 68827 62381 25343 20837 27564 64443 92329 94380 77704 41219 30632 29617
502 29617 64476 59139 36234 26793 23578 12571 -31831 -52338 25740 97158 97525 83545 64300
489 64300 35944 30481 33928 50248 68751 47391 32502 48978 -5862 -33489 -9437 17280
477 17280 23808 35571 42282 41266 42981 24050 30359 4209 -1419 -15166 -25706 -13218 1385
464 1385 15267 -33145 -13506 207 20407 32503 -8964 -38445 -43387 -28986 -9978 -3567 14253
451 14253 6538 -11151 -1077 32455 33109 -21758 -12926 39696 10551 -10622 -20542 -12312 -8185
438 -8185 -32290 -29128 -9719 7753 19084 13387 11435 -7112 -28199 -72019 -124412 -117156 -53699
425 -53699 889 8291 -3268 -18971 -22159 -37559 -50432 -51971 -38976 -40318 -67750 -74200 -79587
412 -79587 -53446 -51750 -63488 -105440 -53862 -3518 33111 16728 -6787 -808 -10368 -27509 -18528
399 -18528 10022 25896 3822 -3278 -3722 -777 -18439 2010 -10830 -22009 -3765 -42730 -88801
386 -88801 -96312 -105119 -113045 -79992 8397 28746 11362 -13302 -47357 -9597 39001 59983 61369
373 61369 43244 53208 51858 59158 64025 86858 90956 57549 24858 23655 50356 70739 17251
360 17251 -26498 -7556 -29747 4954 37744 53495 48464 54899 31170 -25031 -26825 -32820 -39750
347 -39750 -43305 -35872 -21403 -34531 -33102 -15124 -18412 8902 -25692 -17381 1715 10984 -32492
334 -32492 -71157 -27745 9454 -159 -26515 9099 67027 63503 43427 56249 73145 66727 44262
321 44262 40921 27355 9667 41322 19074 3122 2953 4729 264 -19431 -31859 14001 68733
308 68733 90986 101279 84969 69407 15408 -4939 17516 50983 25388 2121 9145 23623
296 23623 46314 34846 10590 22272 -4939 -46398 -45452 -9550 293 14671 -6297 -37041 -47182
283 -47182 -50615 -786 22612 16531 23734 29208 63408 54514 20699 10225 -28422 -2193 2320
270 2320 -20202 -14264 19049 26759 5367 12932 44344 37344 45025 58164 38164 34404 69125
257 69125 57753 -5475 -41505 -32556 -25437 8702 6587 9463 24152 35201 43095 3344 1939
244 1939 37174 21851 -6693 16707 61766 57852 63609 24338 13438 36664 29965 -7728 -42932
231 -42932 -26329 -5135 -15411 25934 48998 30701 36414 38348 25535 1055 17005 23782 18854
218 18854 -22695 -49591 -49791 -30798 -15800 -18927 -26395 -26386 -28484 -1724 8466 14888 28097 -1231
204 -1231 -11749 8533 -4570 3364 40937 75730 60068 1141 -2408 28004 36210 29807 59036
191 59036 80438 102680 58880 28327 11634 -9911 -14985 -6941 -513 21610 44128 26789 41182
178 41182 57932 35537 28291 14081 -15840 -966 -26971 -24252 -14676 -19826 -2231 6347 -10288
165 -10288 -6261 -11041 -5966 15266 311 -3338 -31412 -25335 -28935 -35493 -5874 11786 -2362
152 -2362 13788 18383 16490 1899 4430 -17498 -10349 7340 -7644 8120 2809 6926 31310
139 31310 34645 19934 3783 15835 -11000 17865 44930 37646 23471 40021 58353 20938
127 20938 7649 -21501 -46457 -27685 34508 43897 46117 32502 -15114 -10714 12152 9463 2745
114 2745 -7132 3189 15621 15722 34508 39627 35372 17429 25471 28527 3904 -21578 -9081 -10525
100 -10525 -35572 -37482 -22541 3825 26714 22839 2061 -5149 12502 43249 13838 -6023 3669
87 3669 25150 6215 -30598 -47101 -47804 -28593 -6826 21836 36005 23783 7792 -5883 15980
74 15980 39324 37322 22361 17553 10356 -22462 11185 45862 30939 17793 42314 38379 13739
61 13739 5150 21528 45314 62192 14432 -17406 -21002 -24860 -32292 -43043 -53272 -46516 -34197
48 -34197 -1413 10816 -5115 -6311 12276 35502 34859 33019 48666 34921 23528 46881 35121
35 35121 16006 2361 -8093 5534 17297 24261 21409 30417 41181 52430 51678 28822 2726
22 2726 -15489 -2294 4282 13121 24290 31908 64352 39803 32654 26936 6596 2870 -2857 -20457
8 -20457 -19443 -27233 -22581 -8056 -10990 -5011 123 18199
0 18199
$$ Imaginary data points
##PAGE= N=2
##DATA TABLE= (X++(I..I)), XYDATA
32767 81527 92832 118182 91452 62368 59882 72964 77659 70953 59927 53385 56074 65609 85028
32754 85028 74533 80718 97966 120337 151567 128128 103570 104886 96339 78667 71209 86387
$$ [...]
##END NTUPLES=NMR SPECTRUM
##END=
