##TITLE=XTC-1731o_3
##JCAMPDX= 6.0         $$ Bruker NMR JCAMP-DX V2.0
##DATA TYPE= nD NMR SPECTRUM
##DATA CLASS= NTUPLES
##NUM DIM= 2
##ORIGIN= BRUKER
##OWNER= patiny
$$ 1.79 TOPSPIN		Version 3.0
$$ 2012-05-21 01:46:38.741 +0200  patiny@icmbsg005
$$ Compression mode = diff/dup
##.OBSERVE FREQUENCY= 400.131591127025
##.OBSERVE NUCLEUS= ^1H
##.ACQUISITION MODE= SIMULTANEOUS (DQD)
##.ACQUISITION SCHEME= NOT PHASE SENSITIVE
##.AVERAGES= 2
##.DIGITISER RES= 23
##SPECTROMETER/DATA SYSTEM= spect
##.PULSE SEQUENCE= cosygpppqf
##.SOLVENT NAME= D2O
##.SHIFT REFERENCE= INTERNAL, D2O, 1, 7.26493
##AUDIT TRAIL= $$ (NUMBER, WHEN, WHO, WHERE, PROCESS, VERSION, WHAT)
$$ ##TITLE= Audit trail, TOPSPIN		Version 3.0
$$ ##JCAMPDX= 5.01
$$ ##ORIGIN= Bruker BioSpin GmbH
$$ ##OWNER= patiny
$$ $$ /opt/data/patiny/nmr/XTC-1731o_3/12/pdata/1/auditp.txt
$$ ##AUDIT TRAIL=  $$ (NUMBER, WHEN, WHO, WHERE, PROCESS, VERSION, WHAT)
(   1,<2012-05-21 01:46:37.670 +0200>,<patiny>,<icmbsg005>,<go>,<TOPSPIN 3.0>,
      <created by zg
	started at 2012-05-21 01:26:49.843 +0200,
	POWCHK enabled, PULCHK disabled,
       configuration hash MD5:
       77 C7 B7 C4 10 F4 BA 30 64 2E BB 52 82 F2 DA 41
       data hash MD5: 2K * 256
       09 94 04 6D 11 E2 51 8C 5E 67 8D 71 72 49 F5 FA>)
(   2,<2012-05-21 01:46:37.733 +0200>,<patiny>,<icmbsg005>,<audit>,<TOPSPIN 3.0>,
      <user comment:
       ICON-NMR User ID: patiny
       data hash MD5: 2K * 256
       09 94 04 6D 11 E2 51 8C 5E 67 8D 71 72 49 F5 FA>)
(   3,<2012-05-21 01:46:38.458 +0200>,<patiny>,<icmbsg005>,<proc2d>,<TOPSPIN 3.0>,
      <Start of raw data processing
       xfb same F2: SI = 1K WDW = 4 SSB = 0 FT_mod = 6 PKNL = 1 F1: SI = 1K ME_mod = 2 NCOEF = 32 WDW = 4 SSB = 0 FT_mod = 6 PH_mod = 2
       data hash MD5: 1K * 1K
       D1 E2 38 CF A6 25 6B 30 00 7C 89 22 72 D0 C5 D4>)
(   4,<2012-05-21 01:46:38.573 +0200>,<patiny>,<icmbsg005>,<proc2d>,<TOPSPIN 3.0>,
      <abs2 F2: ABSG = 5 ABSF1 = 7.26493 ABSF2 = 0.68812
       data hash MD5: 1K * 1K
       81 A7 75 DD C3 3E 10 3D 61 63 7C 2D 68 E2 A6 E0>)
(   5,<2012-05-21 01:46:38.688 +0200>,<patiny>,<icmbsg005>,<proc2d>,<TOPSPIN 3.0>,
      <abs1 F1: ABSG = 5 ABSF1 = 7.26493 ABSF2 = 0.68812
       data hash MD5: 1K * 1K
       67 BA A2 73 BE 0E E5 9B 0A D7 78 EF F2 80 29 D0>)
(   6,<2012-05-21 01:46:38.731 +0200>,<patiny>,<icmbsg005>,<proc2d>,<TOPSPIN 3.0>,
      <sym
       data hash MD5: 1K * 1K
       EB 8E 99 9C 4D 27 50 98 8B 74 46 71 85 9C 59 BE>)
$$ ##END=
$$ 
$$ $$ hash MD5
$$ $$ 0D 13 D1 E6 1B 7D 1A E1 07 59 33 82 45 90 0D 2B
##$RELAX= 
##$RELAX= 
##$RELAX= 
##$RELAX= 
##$RELAX= 
##$RELAX= 
##$RELAX= 
##$RELAX= 
##$RELAX= 
$$ Bruker specific parameters
$$ --------------------------
##$DATPATH= </opt/data/patiny/nmr>
##$EXPNO= 12
##$NAME= <XTC-1731o_3>
##$PROCNO= 1
##$ACQT0= 1000000
##$AMP= (0..31)
100 100 100 100 100 100 100 100 100 100 100 100 100 100 100 100 100 100
100 100 100 100 100 100 100 100 100 100 100 100 100 100
##$ANAVPT= -1
##$AQSEQ= 0
##$AQ_mod= 3
$$ [...]
##$PSIGN= 0
##$PYNMP= <proc.py>
##$REVERSE= no
##$SF= 400.13
##$SI= 1024
##$SIGF1= 7.26493
##$SIGF2= 0.68812
##$SINO= 0
##$SIOLD= 1024
##$SPECTYP= <>
##$SREGLST= <1H.MeOD>
##$SSB= 0
##$STSI= 1024
##$STSR= 0
##$SW_p= 2631.57894736843
##$SYMM= 1
##$S_DEV= 7455
##$TDeff= 2048
##$TDoff= 0
##$TI= <>
##$TILT= no
##$TM1= 0
##$TM2= 0
##$TOPLEV= 100
##$USERP1= <>
##$USERP2= <>
##$USERP3= <>
##$USERP4= <>
##$USERP5= <>
##$WDW= 4
##$XDIM= 1024
##$YMAX_p= 499323562
##$YMIN_p= 0
##$CURPLOT= <Cups-PDF>
##$CURPRIN= <$Cups-PDF>
##$DFORMAT= <normdp>
##$LAYOUT= <+/2D_hom.xwp>
##$LFORMAT= <normlp>
##$PFORMAT= <normpl>
$$ Bruker specific parameters for F1
$$ ---------------------------------
##$ACQT0= 0
##$BF1= 400.13
##$FnMODE= 1
##$NUC1= <1H>
##$O1= 1591.12702459416
##$SFO1= 400.131591127025
##$SW= 6.5767837524556
##$SW_h= 2631.57894736843
##$TD= 256
##$ABSF1= 7.26493
##$ABSF2= 0.68812
##$ABSG= 5
##$ABSL= 0
##$ALPHA= 0
##$AQORDER= 0
##$ASSFAC= 0
##$ASSFACI= 0
##$ASSFACX= 0
##$ASSWID= 0
##$AUNMP= <>
##$AXLEFT= 0
##$AXNAME= <F1>
##$AXNUC= <1H>
##$AXRIGHT= 0
##$AXTYPE= 0
##$AXUNIT= <>
##$AZFE= 0.1
##$AZFW= 0.5
##$BCFW= 0
##$BC_mod= 0
##$BYTORDP= 0
##$COROFFS= 0
##$CY= 15
##$DATMOD= 1
##$DC= 0
##$DFILT= <>
##$DTYPP= 0
##$ERETIC= no
##$F1P= 0
##$F2P= 0
##$FCOR= 0.5
##$FTSIZE= 1024
##$FT_mod= 6
##$GAMMA= 0
##$GB= 0
##$INTBC= 1
##$INTSCL= 1
##$ISEN= 128
##$LB= 0
##$LEV0= 0
##$LPBIN= 512
##$MAXI= 10000
##$MC2= 0
##$MEAN= 0
##$ME_mod= 2
##$MI= 0
##$NCOEF= 32
##$NC_proc= -5
##$NLEV= 6
##$NOISF1= 0
##$NOISF2= 0
##$NSP= 0
##$NTH_PI= 0
##$NZP= 0
##$OFFSET= 7.26493
##$PC= 4
##$PHC0= 0
##$PHC1= 0
##$PH_mod= 2
##$PKNL= no
##$PPARMOD= 1
##$PPDIAG= 0
##$PPIPTYP= 0
##$PPMPNUM= 2147483647
##$PPRESOL= 1
##$PSCAL= 1
##$PSIGN= 0
##$PYNMP= <proc.py>
##$REVERSE= no
##$SF= 400.13
##$SI= 1024
##$SIGF1= 7.26493
##$SIGF2= 0.68812
##$SINO= 0
##$SIOLD= 1024
##$SPECTYP= <>
##$SREGLST= <>
##$SSB= 0
##$STSI= 1024
##$STSR= 0
##$SW_p= 2631.57894736843
##$SYMM= 1
##$S_DEV= 7455
##$TDeff= 512
##$TDoff= 0
##$TI= <>
##$TILT= no
##$TM1= 0
##$TM2= 0
##$TOPLEV= 0
##$USERP1= <>
##$USERP2= <>
##$USERP3= <>
##$USERP4= <>
##$USERP5= <>
##$WDW= 4
##$XDIM= 128
##$YMAX_p= 499323562
##$YMIN_p= 0
$$ End of Bruker specific parameters
$$ ---------------------------------
##NTUPLES= nD NMR SPECTRUM
##VAR_NAME=  FREQUENCY1,    FREQUENCY2,      SPECTRUM
##SYMBOL=    F1,            F2,              Y
##.NUCLEUS=  1H,            1H
##VAR_TYPE=  INDEPENDENT,   INDEPENDENT,     DEPENDENT
##VAR_FORM=  AFFN,          AFFN,            ASDF
##VAR_DIM=   1024,          1024,            1024
##UNITS=     HZ,            HZ,              ARBITRARY UNITS
##FACTOR=    2.56990131578948, 2.56990131578948, 1
##FIRST=     2906.91634943962, 2629.00904605264, 995
##LAST=      277.907303386981, 0,            -576
##MIN=       277.907303386981, 0,            0
##MAX=       2906.91634943962, 2629.00904605264, 499323562
##PAGE= F1=2906.91634944
##FIRST=     2906.91634943962, 2629.00904605264, 995
##DATA TABLE= (F2++(Y..Y)), PROFILE
$$ [...]
##PAGE= F1=2380.086579703
##FIRST=     2906.91634943962, 2629.00904605264, 11600
##DATA TABLE= (F2++(Y..Y)), PROFILE
893d656k478L411a363A77J126j18b046p304K333j656m52a121B303C69j8O025A956
$$ -4656 -7134 -3723 -1363 177 1303 1185 -2046 -9350 -7017 -8673 -9125 -1121 2303 369 351 6376 1956
875D582r77a161m112l794k989q13M72O36J100J684N53r31j279j59J918K333J710
$$ 4582 3605 -1161 -5273 -9067 -12056 -12869 -12397 -11761 -10661 -8977 -8424 -9355 -10634 -10793 -8875 -6542 -4832
858d832p19j160k084J894L072q269O004p790I1h76o497m05j503L108b359I30l47
$$ -4832 -5551 -6711 -8795 -6901 -3829 -12098 -6094 -13884 91 -876 -7373 -7778 -9281 -6173 -2359 930 583
841E83L268K83p58q32i189c945C851M80a037A739b388n023l819J722o7L221l41
$$ 583 3851 4134 3376 2544 -9189 -3945 3851 4331 -1037 1739 -2388 -7411 -11230 -9508 -9575 -6354 -6695
824f695J263J978J573p105L795o328e345J858o812a086A9828J5411Q6433P18k0148
$$ -6695 -5432 -3454 -1881 -8986 -5191 -11519 -5345 -3487 -10299 -1086 19828 35239 121672 122390 102242
809A02242B0126f980A1352b402n512L00b610A698J896j203c613j068k682O59K546
$$ 102242 20126 -6980 11352 -2402 -7914 -7614 -2610 1698 3594 2391 -3613 -4681 -7363 -6704 -4158
794d158L97p305L907K30K994q13a238o071B809r69a720A996n0b026m162B399N616
$$ -4158 -3761 -11066 -7159 -6929 -3935 -4748 -1238 -7309 2809 1840 -1720 1996 1946 -2026 -6188 2399 8015
777H015C78a897c51l86k027P19G923k143g718A06e674j26b312M53e11k886l825
$$ 8015 378 -1897 -351 -737 -2764 -2045 7923 5780 -7718 106 -5674 -5800 -2312 -1859 -511 -3397 -7222
760g222J50L268A563a852p881k494j17M236c506A1291l757g883F721A429B1h476
$$ -7222 -7072 -3804 1563 -1852 -9733 -12227 -12344 -8108 -3506 11291 7534 -7883 6721 1429 21 -8476
743B841c226r062e253B617e977K312E579O417h52m809B263a492l886k822j8O2
$$ 2841 -3226 -12288 -5253 2617 -5977 -3665 5579 11996 -852 -5661 2263 -1492 -5378 -8200 -8218 -8156
727h156A115i406A821K657c906J573m004l269P69K812J966m48n09j620b837j014
$$ -8156 1115 -9406 1821 4478 -3906 -2333 -6337 -9606 -8837 -6025 -4059 -4507 -5016 -6636 -2837 -3851
711c851j765k531l142j594J724L430L285b172n61r239b984j615r69n70L76O06
$$ -3851 -5616 -8147 -11289 -12883 -11159 -7729 -4444 -2172 -2733 -11972 -2984 -4599 -5568 -6138 -5762 -5156
695e156N91J29l93j253k500j433K720N00m44J802j575J224N95a596I692l957B165
$$ -5156 -4565 -4436 -4829 -6082 -8582 -10015 -7295 -6795 -7239 -5437 -7012 -5788 -5193 -1596 9692 5735 2165
677b4m262l690E90b71p095l83o76J598b551A274h089L310g77l843l314l15K516
$$ -24 -4286 -7976 590 -271 -7366 -7749 -8425 -6827 -2551 1274 -8089 -4779 -777 -4620 -7934 -8249 -5733
660e733l547a909p47j827k740j165Q05J783K809A388L362b442G21J2462l824b855
$$ -5733 -9280 -1909 -2656 -4483 -7223 -8388 -7583 -5800 -2991 1388 4750 -2442 721 13183 9359 -2855
643B145b763j241A450K670a676L78C483M983K48A499d933b381j777k612K638o627
$$ 2145 -2763 -4004 1450 4120 -1676 -1298 3483 8466 8714 1499 -4933 -2381 -4158 -6770 -4132 -10759
627a0759E139c6571k6903a8490f085p852f090k544R77L415B921O254d290k179
$$ -10759 5139 -36571 -63474 -18490 -6085 -13937 -6090 -8634 -7657 -4242 2921 9175 -4290 -6469
613f469a415j0350J517o90J861K472J683J429a720j320O78H75K621p51f677k945
$$ -6469 -1415 -11765 -10248 -10938 -9077 -6605 -4922 -3493 -1720 -3040 -2362 875 3496 2745 -6677 -9622
597i622F36K501c09r174A848J81a0368f46J13A690E63J0286J340A593i657d325
$$ -9622 636 3137 -309 -9483 1848 2029 -10368 -646 -533 1690 563 10849 12189 1593 -9657 -4325
580h01A876P21b861q199L263K237m800L198j7L132l471m109j370M694L711K143
$$ -801 1876 2597 -2861 -11060 -7797 -5560 -10360 -7162 -7179 -4047 -7518 -11627 -12997 -8303 -4592 -2449
564b449m434J998b168l642m813E817J1599M534n482E736J202a844p87m440J124
$$ -2449 -6883 -4885 -2168 -5810 -10623 5817 17416 21950 16468 5736 6938 -1844 -2631 -7071 -5947
549e947M25a049B045o1b70j0802M668l149j746K518c310m28l515n694K701m9K751
$$ -5947 -5522 -1049 2045 1984 -270 -11072 -6404 -9553 -11299 -8781 -3310 -3738 -7253 -12947 -10246 -10295 -7544
532g544D399N543K029K327F125b695J53p749a435o025k443J704m108J447o71M242
$$ -7544 4399 9942 11971 14298 6125 -2695 -2542 -10291 -1435 -7460 -9903 -8199 -12307 -10860 -11531 -7289
516g289I40c323G744B771e769l795Q41M95b758q100M469b716m230J238n946b822
$$ -7289 940 -3323 7744 2771 -5769 -9564 -8723 -8228 -2758 -10858 -6389 -2716 -6946 -5708 -11654 -2822
499e518L83b251C16f972k561k122b784E424J02q3M47J480A578a797k479a391B724
$$ -5518 -5135 -2251 316 -6972 -9533 -11655 -2784 5424 5526 5443 5890 7370 1578 -1797 -4276 -1391 2724
481e382n862m449L553K132n87q89K926L892J650i92o63j357j392j751k473l249
$$ -5382 -11244 -15693 -12140 -10008 -10595 -11484 -8558 -4666 -3016 -992 -1655 -3012 -4404 -6155 -8628 -11877
465a1877k955l92J505J954K176L209K974a450B52b008n8o865b357j499K63m243
$$ -11877 -14832 -15224 -13719 -11765 -9589 -6380 -3406 -1450 252 -2008 -2066 -8931 -2357 -3856 -3593 -7836
449g836c309o16j701n86J808b154b12j186k173m22g59D948g669A429N186b950
$$ -7836 -3309 -3925 -5626 -6212 -4404 -2154 -212 -1398 -3571 -3993 -759 4948 -7669 1429 6615 -2950
432a0531K786E99Q57J229h683J399K947C529e118n996J995L601n433L182A659
$$ -10531 -7745 599 1456 2685 -8683 -7284 -4337 3529 -5118 -11114 -9119 -5518 -10951 -7769 1659
416F129d46j590j431Q82E3a4602e993k594P18m827J300p21d966q30H51b92k071
$$ 6129 -446 -2036 -3467 -2585 53 -14602 -5993 -8587 -7869 -12696 -11396 -12117 -4966 -5796 851 -292 -2363
399b363k198l73j918J761n192C566A368f165l211A980L734p01p24j372a05l919
$$ -2363 -4561 -4934 -6852 -5091 -10283 3566 1368 -6165 -9376 1980 5714 5013 4289 2917 -105 -4024
383d024m548m371R55M552a794q013B215K934R63a14E778b48G616L560e352C43
$$ -4024 -8572 -12943 -11988 -7436 -1794 -9807 2215 5149 6112 -114 5778 -248 7616 11176 -5352 343
366e714m808l221O700a805g64q270M376g33D143d984p892L161M052b229m09m316
$$ -5714 -10522 -13743 -7043 -1805 -764 -9034 -4658 -733 4143 -4984 -12876 -9715 -5663 -2229 -2638 -6954
350f954k976j800k99j070R15j340k252L655N694b636D540A199d930n44J402m952
$$ -6954 -9930 -11730 -12029 -13099 -12184 -13524 -15776 -12121 -6427 -2636 4540 1199 -4930 -5474 -4072 -9024
334i024A843L400g1k875m112m865j573f063b624A201g832C885a2026Q91N026J964
$$ -9024 1843 5243 -71 -2946 -7058 -11923 -13496 -6063 -2624 1201 -7832 3885 -12026 -11135 -6109 -4145
318d145a770m156l175j286O70J875K876l599j80F76a627j2014b22B858I1f90k5928
$$ -4145 -1770 -5926 -9101 -10387 -9717 -7842 -4966 -8565 -8745 676 -1627 -13641 -222 2858 91 -690 -26618
301b6618m3141J6022c394q67l965c993C413M044C330O573a543J65D909a0059J396
$$ -26618 -69759 -53737 -3394 -4261 -8226 -3993 3413 7457 3330 9903 -1543 -1378 4909 -10059 -8663
286h663j446K257c727p292F770D81r5d857a57A0906j826h207M055n372M550j510
$$ -8663 -10109 -7852 -3727 -11019 6770 481 386 -4857 -157 10906 9080 -8207 -4152 -9524 -4974 -6484
270f484j680L016A1819m427l481g384b98r109C05e903f21j886r769K127L354o84
$$ -6484 -8164 -5148 11819 7392 3911 -7384 -298 -9407 305 -5903 -621 -2507 -12276 -10149 -6795 -7479
254g479k227q6K167K476P94j053j779Q08b325B782L788K326a264B513O95B1J5827
$$ -7479 -9706 -9792 -7625 -5149 -4355 -5408 -7187 -6379 -2325 2782 6570 8896 -1264 2513 3208 21 15848
237A5848n476D252a256n317J343E362A744c23J18C95A26b004l965l620j297K561
$$ 15848 10372 4252 -1256 -6573 -5230 5362 1744 -323 -205 395 126 -2004 -5969 -9589 -10886 -8325
221h325K670K422J039p985d133l0j606j497m065R15j326J057M35L378c254g67
$$ -8325 -5655 -3233 -2194 -10179 -4133 -4163 -5769 -7266 -11331 -10416 -11742 -10685 -10250 -6872 -3254 -767
204c038R87a61k827l739l199j85J508qq80c348j156m434m504N498c779n114A7654
$$ -3038 -2051 -161 -2988 -6727 -9926 -10111 -8603 -8611 -9491 -3348 -4504 -8938 -13442 -7944 -3779 -8893 17654
186B2271o133E096m54G38h78n058o995c20B188D74k28d78k304L89m530b86F17
$$ 22271 16138 5096 4642 738 -878 -5936 -12931 -320 2188 474 246 -478 -2782 -2393 -6923 -286 617
168b342m498n294J201N365a046B188f782j436B5Q062l820A196R032l896D36d374
$$ -2342 -6840 -12134 -10933 -5568 -1046 2188 -6782 -8218 25 8087 4267 1196 10228 6332 436 -4374
151e224R63d05i7j983l252l981k0c521h62B479F27a473j0382G714B654f005r05
$$ -5224 -4261 -405 -97 -2080 -5332 -9313 -9333 -3521 -862 2479 627 -1473 -11855 7714 2654 -6005 -6910
134f910j087K584d02D698M886A46e525k02j431k882G75e82j282l194J225l536
$$ -6910 -7997 -5413 -402 4698 9584 146 -5525 -5727 -7158 -10040 775 -582 -1864 -5058 -3833 -7369
118g369J805B098q90J76B76Q431B108a482B283J300e676k010l861J682p90k95
$$ -7369 -5564 2098 1208 1384 276 8707 2108 -1482 2283 3583 -5676 -7686 -11547 -9865 -10655 -10950
102a0950K310K493j696r30b359j378j599j137l535K366l090L279r69r81J336K796
$$ -10950 -8640 -6147 -7843 -8773 -2359 -3737 -5336 -6473 -10008 -7642 -10732 -7453 -8422 -9403 -8067 -5271
86e271J950o0k103k888j146J133n44j095R47L415K654J036j828m135l880K796
$$ -5271 -3321 -3381 -5484 -8372 -9518 -8385 -8929 -10024 -9077 -5662 -3008 -1972 -3800 -7935 -11815 -9019
70i019c529j777E398d750F185k563a82m027l658r79K016b931A130d442j751B313
$$ -9019 -3529 -5306 5398 -4750 6185 3622 -182 -4209 -7867 -8846 -6830 -2931 1130 -4442 -6193 2313
53f230K936A00b006n6k3r289L088k417k145j264K438L622c906A6J625d670E659
$$ -6230 -3294 100 -2006 -2062 -2085 -11374 -8286 -10703 -12848 -14112 -11674 -8052 -3906 16 1641 -4670 5659
35g046E530K496d343m894D23J484h459A080L895e675n478j841N051I0R81f704
$$ -7046 5530 8026 -4343 -9237 423 1907 -8459 1080 4975 -5675 -11153 -12994 -7943 90 1071 -6704
18f101j930a354A134j53J21A23c218m882n838n188O173e825b80o350c275m58D39
$$ -6101 -8031 -1354 1134 981 1102 123 -3218 -8100 -13938 -19126 -12953 -5825 -280 -6630 -3275 -3733 439
0F459
$$ 6459
##PAGE= F1=2377.516678387
##FIRST=     2906.91634943962, 2629.00904605264, 12870
##DATA TABLE= (F2++(Y..Y)), PROFILE
1023A2870j205A604i881d075I710m452a22l833p84j504o10L208n219a440q14K24
$$ 12870 11665 1604 -9881 -4075 9710 5258 -122 -3955 -4739 -6243 -6853 -3645 -8864 -1440 -2254 -2030
1007b030b01p79r123a421j882j691o397L867J504h52l790a264o59k753k412l503
$$ -2030 -201 -980 -10103 -1421 -3303 -4994 -11391 -7524 -6020 -852 -4642 -1264 -1923 -4676 -7088 -10591
991a0591g39B013J538N59p03d922a373l211k912n411J392K705K983J723a831c00
$$ -10591 -739 2013 3551 4110 3407 -4922 -1373 -4584 -7496 -12907 -11515 -8810 -5827 -4104 -1831 -300
974A271R45j034f894J718K100o76J247a195q09l227k679j478J264c104Q95E598
$$ 1271 2216 1182 -6894 -5176 -3076 -3752 -2505 -1195 -2004 -5231 -7910 -9388 -8124 -3104 -2209 5598
957h95m421c60A079a6226K052D09c953n01i86r461c570D240c802p273e184A019
$$ -895 -5316 -360 1079 -16226 -14174 409 -3953 -4454 -986 -10447 -3570 4240 -3802 -11075 -5184 1019
940i129q27a34F661i654D008h53j057A333O86r23J97A20a0849M739a966r468D360
$$ -9129 -9956 -134 6661 -9654 4008 -853 -1910 1333 2019 1096 1293 120 -10849 -6110 -1966 -11434 4360
922B673e263C461c92j1466e084b377D44K635K346J144c139l030j939J850a38k971
$$ 2673 -5263 3461 -392 -11858 -5084 -2377 444 3079 5425 6569 -3139 -6169 -8108 -6258 -138 -3109
906c109o342A208L992h966D453b394G6e453J903I24e844b582l541j968P19K97
$$ -3109 -9451 1208 5200 -8966 4453 -2394 76 -5453 -3550 924 -5844 -2582 -6123 -8091 -7372 -7075
890g075j060O16L381f59q633K702a708l026C76N817b403J70B153h95E002j418
$$ -7075 -8135 -7519 -4138 -659 -9292 -6590 -1708 -4734 376 6193 -2403 -2233 2153 -895 5002 3584
874C584b642m853m02L370a185D62h649a544k934k667k45j499L211J14j461j340
$$ 3584 -2642 -7495 -7897 -4527 -1185 462 -8649 -1544 -4478 -7145 -7390 -8889 -5678 -5564 -7025 -8365
858h365n10J114J633J870J805n887K377q097E17b214n311j181j495K709c577C57
$$ -8365 -8875 -7761 -6128 -4258 -2453 -8340 -5963 -14060 517 -2214 -7525 -8706 -10201 -7492 -3577 357
841b465E502J260j73p55d776m22A735a656l945l582K363J012b429B531f527K672
$$ -2465 5502 6762 6589 5834 -4776 -5198 1735 -1656 -5601 -9183 -6820 -5808 -2429 2531 -6527 -3855
825c855o140l972L420L395o69L630j154a521k771m345aH671Q0114O6289M9342
$$ -3855 -9995 -13967 -10547 -7152 -7821 -4191 -5345 -1521 -4292 -8637 -1 8671 88785 155074 204416
810B04416O841j03896A6349J393M204p484d692I099A944K852B139d806J012j115
$$ 204416 211257 107361 16349 17742 21946 14462 -4692 9099 1944 4796 2139 -4806 -3794 -4909
796d909J55J104K75n980c950k210l791r94d581m394B03K3c937A533J743B60g754
$$ -4909 -4754 -3650 -3375 -9355 -3950 -6160 -9951 -10945 -4581 -8975 203 226 -3937 1533 3276 260 -7754
778B378M402b495O41B570M947b030k486A22c176n548l227L077L891J866l94k212
$$ 2378 6780 -2495 -1854 2570 7517 -2030 -4516 122 -3176 -8724 -11951 -8874 -4983 -3117 -3511 -5723
762e723k703r30J092L33n97q22J524n775L043j406G82L239H70g332j653J603a346
$$ -5723 -8426 -9356 -8264 -7931 -8528 -9350 -7826 -13601 -10558 -11964 782 4021 870 -7332 -8985 -7382 -1346
744b444F974C16a0706K862a714o648L567C918L089f771b413c27m468l712k732
$$ -2444 6974 316 -10706 -7844 -1714 -8362 -4795 3918 7007 -6771 -2413 -327 -4795 -8507 -11239
729a1239k02K210L390k59J297H25f14n56m046m282k148M135c370K72L57l199N06
$$ -11239 -11441 -9231 -5841 -6100 -4803 825 -614 -1170 -5216 -9498 -11646 -7511 -3370 -3098 -2741 -5940 -5434
712e434Q37k045K804l078b347J054l446D468Q09a770p943H374n95C323b619k778
$$ -5434 -4597 -6642 -3838 -6916 -2347 -1293 -4739 4468 5277 -1770 -9713 8374 7779 3323 -2619 -5397
696e397m429k308r14Q50L661c932q723B313h309L924R58Q57A059l04J775a475
$$ -5397 -9826 -12134 -13048 -12198 -8537 -3932 -12655 2313 -8309 -4385 -3427 -2570 1059 755 2530 -1475
679d725Q64e76n717p96A048b234n618K335a924j775C302l34g643L431E926l03
$$ -4725 -3861 -576 -6293 -7089 1048 -2234 -7852 -5517 -1924 -3699 3302 2968 -7643 -4212 5926 5623
663E623i552F088k32f636b754I00e548o503L244c733e37A113Q9a135k205E250
$$ 5623 -9552 6088 5856 -6636 -2754 900 -5548 -12051 -8807 -3733 -537 1113 1202 -1135 -3340 5250
646E930j098f214b641n701n577f307D46b092f18G93N045B674e298q640c896C7
$$ 5930 4832 -6214 -2641 -8342 -13919 -6307 446 -2092 -618 793 5838 2674 -5298 -13938 -3896 37
629c686N12r149D388b5945j5977g760L064n618l124M492c812n77C262O765d547
$$ -3686 -3174 -12323 4388 -25945 -41922 -7760 -4696 -10314 -13438 -8946 -3812 -4389 3262 10027 -4547
613a0128d365r372F59c693d20j78m7A282K110e262q09i01H592A811g257b135a062
$$ -10128 -4365 -13737 659 -3693 -420 -598 -645 1282 3392 -5262 -6071 -901 8592 1811 -7257 -2135 -1062
595A762J102i376B916o80h389E02c168I75O18Q78K71R8c654J032j74B70L291C86
$$ 1762 2864 -9376 2916 2236 -8389 502 -3168 975 1593 2471 2742 2840 -3654 -2622 -2796 270 3561 386
576a0215L172j571Q29K247J847J117N00M18g59A359J614a165k936j017B139c150
$$ -10215 -7043 -8614 -7785 -5538 -3691 -2574 -2074 -1656 -759 1359 2973 -1165 -4101 -5118 2139 -3150
559a0245D089J8687L781p834E773K674E92d095k582j903c915a44F3c872o403j043
$$ -10245 4089 22776 26557 18723 5773 8447 592 -4095 -6677 -8580 -3915 -144 63 -3872 -10275 -11318
543a1318e340a858N26k519k394m239l196K066j124K32b999E963O250J029K831
$$ -11318 -5340 -1858 -1332 -3851 -6245 -10484 -13680 -11614 -12738 -12506 -2999 5963 12213 13242 16073
528A6073o903g72G96h353n41L05J401L259o656M11j403k502O291b790c73j056
$$ 16073 9170 -772 796 -8353 -8894 -8589 -7188 -3929 -10585 -10174 -11577 -14079 -7788 -2790 -373 -1429
512a429l128l447m16J785N95m577K593c977k004o5n974G510l78J277L117E072
$$ -1429 -4557 -8004 -8420 -6635 -6040 -10617 -8024 -3977 -5981 -6046 -12020 7510 7132 8409 11526 5072
495e877m232k105a014H03l36K049L033N75B603c675l966a796I46h710l71d171
$$ -5877 -10109 -12214 -1014 803 467 2516 5549 6124 2603 -3675 -7641 -1796 946 -8710 -9081 -4171
478d386k87Qj544l656k124M107b969B55J891N40d860k995L422l543k042j81Q78
$$ -4386 -4673 -4665 -6209 -9865 -11989 -7882 -2969 255 2146 2686 -4860 -7855 -4433 -7976 -10018 -10199 -9321
461i321M3n07j757n19L405L571J570o02E224R92e652j053a950b29j687j320a507
$$ -9321 -9278 -9785 -11542 -12061 -8656 -5085 -3515 -4117 5224 6216 -5652 -6705 -1950 -229 -1916 -3236 -1507
443d61E73a312k816J096o30j45j087K334d67j394n499L491F01c621n867l559K493
$$ -461 573 -1312 -4128 -3032 -3662 -3807 -4894 -2560 -467 -1861 -7360 -3869 601 -3621 -9488 -13047 -10554
426a0554K124E377i467E092B298d971q574J880c371p11l407l702L204c713dj1640
$$ -10554 -8430 5377 -9467 5092 2298 -4971 -13545 -11665 -3371 -4082 -7489 -11191 -7987 -3713 -4 -11644
410a1644L214k27J681m234K270r74M283p79E39g88j916k258j223j948c576n354
$$ -11644 -8430 -8657 -6976 -11210 -8940 -9914 -5631 -6410 539 -788 -2704 -4962 -6185 -8133 -3576 -8930
394h930L573k817l626L961A516M44G48a973l074j020K763J399A336L045n05j709
$$ -8930 -5357 -8174 -11800 -7839 1516 1960 748 -1973 -5047 -6067 -3304 -1905 1336 4381 3876 2167
378B167i072b820m4J121l459e74l50l9c87n226a532l639q459M252L103c056P97
$$ 2167 -9072 -2820 -2864 -1743 -5202 -574 -924 -963 -387 -5613 -1532 -5171 -13630 -9378 -6275 -3056 -2259
361b259l145n577N423F30g462m677M905L167P70D710o88e238r16k609m05K375
$$ -2259 -5404 -10981 -5558 630 -7462 -12139 -7234 -4067 -3297 4710 4022 -5238 -6154 -8763 -9168 -6793
345f793J185Q30j56k78K46J321J599J24k368jm525b806k217k533l089j548J939
$$ -6793 -5608 -4778 -4934 -5212 -4966 -3645 -2046 -1922 -4290 -4291 -8816 -2806 -5023 -7556 -10645 -12193 -10254
328a0254J261J408R86J204j647c446p205J375L568J737B460J317b809a263G63
$$ -10254 -8993 -7585 -6599 -5395 -7042 -3446 -10651 -9276 -5708 -3971 2460 3777 -2809 -1263 763
312b999m305l721J768M280a860q656A20f53j614M1r092n935A830J1774K142E619
$$ -2999 -7304 -11025 -9257 -4977 -1860 -10516 120 -653 -2267 -2226 -11318 -17253 1830 13604 15746 5619
295A2029m223A590K328J37a660G00j21i760k96d274j824D348a1278E485b26E876
$$ 12029 7806 1590 3918 4055 -1660 700 579 -9760 -10056 -4274 -6098 4348 -11278 5485 -226 5876
278B0a808H551J10d828J273p972c298m75n191L943A1171n343d92j3399I94f689
$$ 20 -1808 8551 8661 -4828 -3555 -11527 -3298 -3773 -8964 -5021 11171 5828 -492 -13891 994 -6689
261b592l832i39r51j1114K896M929k470k697j018J997M664F23g001B494h811F677
$$ -2592 -6424 -939 -1890 -13004 -10108 -5179 -7649 -10346 -11364 -9367 -4703 623 -7001 2494 -8811 6677
244B946b243m233j759J091c558l188F605L53l64B722c578o918D572J0663J060
$$ 2946 -2243 -6476 -8235 -7144 -3558 -6746 6605 6958 6594 2722 -3578 -10496 4572 15235 16295
229A6295G441l061J1513G678g47k10E757j502P822K939A120e249D429P18B22d658
$$ 16295 7441 4380 15893 7678 -747 -957 5757 4255 12077 15016 1120 -5249 4429 5147 222 -4658
212a4744O543L163m511J878j741q05b375d20j835P54o171n536M127c489a477k602
$$ -14744 -8201 -5038 -9549 -7671 -9412 -10217 -2375 -420 -2255 -1501 -7672 -13208 -9081 -3489 -1477 -4079
196d079n538d066n194K969l386L39M189j142a633B724L028R68k987b495n80n513
$$ -4079 -9617 -4066 -9260 -6291 -9677 -9338 -5149 -6291 -1633 2724 5752 6720 3733 -2495 -3075 -8588
180h588l335L871L901a451O89j291l250k311N65K439J255n65j910j908J662h12
$$ -8588 -11923 -8052 -4151 -1451 -762 -2053 -5303 -7614 -7049 -4610 -3355 -3920 -5830 -7738 -6076 -812
163E273B51c132j241a463G609k463A921P475k642c912J082D707a238l462G059
$$ 5273 251 -3132 -4373 -1463 7609 5146 1921 9396 6754 -3912 -2830 4707 -1238 -4700 7059
147B755b852L07o264N48c555D764O26C98i331b857o539l491R03M80J980d152A057
$$ 2755 -2852 -2545 -8809 -8261 -3555 4764 5390 398 -9331 -2857 -9396 -12887 -11984 -11504 -9524 -4152 1057
129E156f78m403m627N01K643A415K88k47a2173M507k90c102f69B289L374A095
$$ 5156 -678 -5081 -9708 -9207 -6564 1415 1703 1456 -12173 -7666 -7956 -3102 -669 2289 5663 1095
112D031A108g48k107J385p677p70m64N99j15o18l47j130m5J561L335L468i37I18
$$ 4031 1108 -748 -2855 -1470 -9147 -9917 -10381 -9782 -9897 -10515 -10862 -11992 -12037 -10476 -7141 -3673 -937 918
93a3894g02j1462B827o68c38l001r73J320i79A001K503b84j2015b741c06E387
$$ -13894 -702 -12164 2827 2159 -338 -3339 -4312 -2992 -979 1001 3504 -284 -12299 -2741 -306 5387
76g14m598N20b184J56A129K32a022j685J158k152k749k909k387O63K683L163a916
$$ -714 -5312 -4792 -2184 -2028 1129 1361 -1022 -2707 -1549 -3701 -6450 -9359 -11746 -11083 -8400 -5237 -1916
58B078L280d047j676A684i500i57k268k935l280l356j268J598J399R69Q8k35p14
$$ 2078 5358 -4047 -5723 1684 -9500 -957 -3225 -6160 -9440 -12796 -14064 -12466 -11067 -10098 -10010 -10245 -10959
41a0959R79L126b314k284F078B85N282K477f04m365j71K155o818b914C398e536
$$ -10959 -9980 -6854 -2314 -4598 6078 285 5567 8044 -604 -4969 -5140 -2985 -9803 -2914 3398 -5536
24a0680M903m891L581H30g700J392J718B78N37D6a071c15k752o222J755j567o95
$$ -10680 -5777 -10668 -7087 830 -7700 -6308 -4590 278 815 46 -1071 -315 -3067 -9289 -7534 -9101 -9796
7i796K252c318k061d39k905M75D839
$$ -9796 -7544 -3318 -5379 -439 -3344 -2869 4839
##PAGE= F1=2374.946777071
##FIRST=     2906.91634943962, 2629.00904605264, 12600
##DATA TABLE= (F2++(Y..Y)), PROFILE
1023A2600j636A935a1552d031B998D05b686l405Q02J509J515N59m967a796k567
$$ 12600 10964 1935 -11552 -4031 2998 405 -2686 -6091 -5289 -3780 -2265 -1706 -6673 -1796 -4363
1008d363k534J104b129o222a848C297q81a2835e644O57l023k277m82K485L824
$$ -4363 -6897 -5793 -2129 -8351 -1848 3297 2416 -12835 -5644 -4987 -8010 -10287 -10769 -8284 -4460
993d460l75q265a339B285J0478l206C035e453A135J530f174j672m171a068A312
$$ -4460 -4835 -13100 -1339 2285 12763 9557 3035 -5453 1135 2665 -6174 -7846 -12017 -1068 1312
977a0121L871l720K30L747K799m230K735k427j031K227K593N57j915j984k962
$$ -10121 -6250 -9970 -9740 -5993 -3194 -7424 -4689 -7116 -8147 -5920 -3327 -2770 -4685 -6669 -9631
962i631j840L179c956E18f502A569K749a678j5443R42d487j841c146J303j2101
$$ -9631 -11471 -8292 -3956 518 -6502 1569 4318 -1678 -17121 -16179 -4487 -6328 -3146 -1843 -13944
947a3944f550J374n251L654J721j076p590f428J046A381g783A147b221l869k588
$$ -13944 -6550 -5176 -10427 -6773 -5052 -6128 -13718 -6428 -5382 1381 -7783 1147 -2221 -6090 -8678
932h678j365l99O91J785m900c560B020f102D238O33c653E569o54h174P78k207
$$ -8678 -10043 -10442 -9751 -7966 -12866 -3560 2020 -6102 4238 4871 -3653 5569 4915 -8174 -7396 -9603
916i603K586J421j6j260q75O11P64J697A859c685M43E108K638a3098B273d875
$$ -9603 -7017 -5596 -5612 -6872 -7747 -7136 -6372 -4675 1859 -3685 -3242 5108 7746 -13098 2273 -4875
899c5o145j427c120p921H7c175m715K694l424q90J606J543J184l799K242b958
$$ -35 -6180 -7607 -3120 -11041 87 -3175 -7890 -5196 -8620 -9510 -7904 -6361 -5177 -8976 -6734 -2958
882a908A058L616e650a024j009j392C199o30a074l531k710R9J843J291o448L906
$$ -1908 1058 4674 -5650 -1024 -2033 -3425 3199 2569 -1074 -4605 -7315 -7216 -5373 -4082 -10530 -6624
866f624j992J27K102K143l29o61b112o80q3A818j06a536m616l257K087m888c604
$$ -6624 -8616 -8489 -6387 -4244 -4573 -5234 -2112 -2792 -2875 1818 1712 -1536 -6152 -9409 -7322 -12210 -3604
848e620k942j845L945c115A435K295e336E485J627J933M23a513l119A0669m371
$$ -5620 -8562 -10407 -6462 -3115 1435 3730 -5336 5485 7112 9045 9468 -1513 -4632 10669 6298
833F298a25n053j83j666L334i33l559J44m629R08l138M961K35b671q16q05l515
$$ 6298 -125 -5178 -5361 -7027 -3693 -933 -4492 -4348 -8977 -8069 -11207 -6246 -6011 -2671 -3487 -4292 -7807
816g807J235l441C6838Q7963Q5696M4166j3514q0078B4033q073m684C936O73P3
$$ -7807 -6572 -10013 36838 124801 210497 254663 241149 161071 24033 15960 11276 3936 4609 4682
802D682A270c879n690j279L089K747a441o51j943k218f07A603a2k304M19r016
$$ 4682 1270 -3879 -9569 -10848 -7759 -5012 -1441 -2092 -4035 -6253 -607 1603 -12 -2316 -1897 -10913
786a0913d235J086m480I23L657j355f526A899M755c916h09D469M005A89h040B19
$$ -10913 -4235 -3149 -7629 923 4580 3225 -6526 1899 6654 -3916 -809 4469 8474 189 -8040 219
769a639o695J957j839r51p27m7J149K165K524J646k81j540k893l304k613R61R39
$$ -1639 -8334 -6377 -8216 -9167 -9894 -9941 -8792 -6627 -4103 -2457 -2738 -4278 -7171 -10475 -13088 -12127 -11188
752a1188L590J013J403J218P73j14k92j97J863B672h952J377J518l128d082c74
$$ -11188 -7598 -6585 -5182 -3964 -3191 -3305 -3597 -3794 -1931 2672 -8952 -7575 -6057 -9185 -4082 -374
735a18j3431O143q99J437J766j534j018c730j436k903m283J725K507J048K07L96
$$ -118 -13549 -7406 -8305 -6868 -5102 -6636 -7654 -3730 -5166 -8069 -12352 -10627 -8120 -7072 -6865 -6469
719f469j433L099J872J187l72k104m047K184j966K321m565d698K99k763C659N74
$$ -6469 -7902 -4803 -2931 -1744 -2116 -4220 -8267 -6083 -8049 -5728 -10293 -4698 -4399 -7162 3659 4233
703D233b333n687G920k288A201b164m692m165j846K440L671c137i03j0800b680
$$ 4233 -2333 -8020 7920 5632 1201 -2164 -6856 -11021 -12867 -10427 -6756 -3137 -903 -11703 -2680
687h639a365m20A587O460p13k794A506c42P1D22i744L881K305m569l761K922d435
$$ -8639 -1365 -1785 1587 8047 7334 4540 1506 -342 -271 422 -9744 -5863 -3558 -8127 -11888 -8966 -4435
669b845A068O91g261L342E006K372a1658I421j917f143J74B628c472o515j260
$$ -2845 1068 1759 -7261 -3919 5006 7378 -11658 9421 7504 -6143 -5969 2628 -3472 -9987 -11247
654a1247L698K256P47o80m965O11j372J160J882j885L835J166J210J464M87j833
$$ -11247 -7549 -5293 -4546 -5226 -10191 -9580 -10952 -9792 -7910 -9795 -5960 -4794 -3584 -2120 -1633 -3466
638c466J389j320j792l243l451J20M737c332a298k579r915A25b0740j2816d092
$$ -3466 -2077 -3397 -5189 -8432 -11883 -11763 -7026 -3332 -1298 -3877 -13792 125 -20740 -33556 -4092
622a544N1k017o742M030K126e06A946g729q142O646m615e28r70E89J076P60R011
$$ -1544 -1493 -3510 -10252 -6222 -4096 -506 1946 -7729 -15871 -9225 -13840 -528 -1498 589 1665 2425 11436
605A1436C203h845j640a174B642f109o008M432L135P69q37l178K676R09K83C405
$$ 11436 3203 -8845 -10485 -1174 2642 -6109 -12117 -7685 -4550 -3781 -4618 -7796 -5120 -4211 -3928 3405
588c462B76K731Q295k557k547C099a034m986b121A765c48o960A178b363k740J972
$$ -3462 276 3007 11302 8745 6198 3099 -1034 -6020 -2121 1765 -348 -7308 1178 -2363 -5103 -3131
572c131N31i56A472L227L264l351j076H53f98l006A819c748o703M539H33N888
$$ -3131 -2600 -956 1472 4699 7963 4612 3536 853 -698 -3704 1819 -3748 -10451 -5912 833 6721
556F721L294D683M631C988d673P12m943K513i56B773K0h82o266k932b922C132
$$ 6721 10015 4683 9314 3988 -4673 -3961 -8904 -6391 -956 2773 2793 -882 -7148 -10080 -2922 3132
539E221k201h048J519l874n81K129c37H248C539J526N957K098D10M540a798j0740
$$ 5221 3020 -8048 -6529 -10403 -10984 -8855 -337 8248 3539 5065 11022 13120 410 4950 -1798 -12538
523a2538L839J469K466r85m738K446g77j746i42j17r82j352j976k373j364J619
$$ -12538 -8699 -7230 -4764 -5749 -10487 -8041 -777 -2523 -942 -1059 -2041 -3393 -5369 -7742 -9106 -7487
507g487m171c845a592l383q63n833e696q37R22K117J380l034o306M521j404k898
$$ -7487 -11658 -3845 -1592 -4975 -5838 -11671 -5696 -6533 -5611 -3494 -2114 -5148 -11454 -6933 -8337 -11235
491a1235j060J763L658b548A882d353l311e67j61r807J973c280B913a524m830
$$ -11235 -12295 -10532 -6874 -2548 1882 -4353 -7664 -567 -728 -10535 -8562 -3280 2913 -1524 -6354
476f354l742n51K155M114H87O125k207b276j0340K325I30J561J90a206l040j817
$$ -6354 -10096 -10647 -8492 -4378 887 7012 4805 -2276 -12616 -10291 930 2491 2681 -1206 -4246 -6063
460f063j7P02M25o17k093a040A145K902j245h325J417L007B844J598h124E477
$$ -6063 -6080 -5378 -4953 -5570 -7663 -1040 1145 4047 2802 -8325 -6908 -3901 2844 4442 -8124 5477
443D447q04b264k789J856k705D301c986E737M214a301l144j226j230M15r94r116
$$ 4447 3643 -2264 -5053 -3197 -5902 4301 -3986 5737 9951 -1301 -4445 -5671 -6901 -6486 -7480 -16596
427a6596M461M404E981a2248I942K70c416j1708N83O529p47n82O84P56L18J117
$$ -16596 -12135 -7731 5981 -12248 9942 10212 -3416 -15124 -14541 -8012 -8759 -9341 -8657 -7901 -7583 -6466
411f466j498O80n16j364j055J374K752J298l284b671j346j681j828j203n59j11
$$ -6466 -7964 -7284 -7800 -9164 -10219 -8845 -6093 -4795 -8079 -2671 -4017 -5698 -7526 -8729 -9288 -9399
395i399Q49K520K229l742J061C574M339k722L498P35c415B080c550D453M430l366
$$ -9399 -8550 -6030 -3801 -7543 -6482 3574 7913 5191 8689 9424 -3415 2080 -3550 4453 8883 5517
379E517A934h073K658j939Q27J842R34l4q58j363k199j603j072n350M645J532
$$ 5517 1934 -8073 -5415 -7354 -6527 -4685 -3751 -3785 -4643 -6006 -8205 -9808 -10880 -16230 -11585 -10053
363a0053K091J893J515l36j001r25j978k172N148N12k43j552l404q5N203J564
$$ -10053 -7962 -6069 -4554 -4890 -5891 -6816 -8794 -10966 -5818 -5306 -5549 -7101 -10505 -10590 -5387 -3823
347c823j567F376k982o2A115b171k104p04o53o15j9J516l363c617A945d646C848
$$ -3823 -5390 6376 3394 3332 1115 -2171 -4275 -4979 -5632 -6247 -6266 -4750 -8113 -3617 1945 -4646 3848
329C080B78c942m074l906J340J098j88j59K728N12N60F553J809e155q44J430l256
$$ 3080 278 -3942 -8016 -11922 -10582 -9484 -9672 -9831 -7103 -6591 -6031 6553 8362 -5155 -5999 -4569 -7825
312g825J448j564k93K20K034K60K669a476F1L016L3Q293L607K508k982A062J0565
$$ -7825 -6377 -7941 -8234 -8014 -5980 -5720 -3051 -1476 61 3077 3110 11403 15010 17518 14536 1062 11627
295A1627m897f001H07P40b452c87k344l232m29f16o843C0i917A262b59C80K851
$$ 11627 6730 -6001 807 1547 -2452 -387 -2731 -5963 -6392 -616 -7459 30 -9917 1262 -259 380 3231
278C231d782D155K110b008n449l259b456l772m194L963A966a270o728o98c998
$$ 3231 -4782 4155 6265 -2008 -7457 -10716 -2456 -6228 -10422 -6459 1966 -1270 -7998 -8696 -3998
262e086J915l871J492k438l523J007q87p37J670J924J493P47L99m697b845q485
$$ -5086 -3171 -7042 -5550 -7988 -11511 -10504 -11391 -12128 -10458 -8534 -7041 -6294 -5895 -10592 -2845 -11330
246a1330b838k160l490k410n21L21L038n656B947j256O684k666f8j0618b977C159
$$ -11330 -2838 -4998 -8488 -10898 -11419 -11098 -8060 -13716 2947 1691 8375 5709 -68 -10686 -2977 3159
229A0168m135k339Q661C284A496M062O417D670O051J769b46o79A1520k101l644
$$ 10168 6033 3694 12355 3284 1496 5558 11975 4670 10721 12490 -246 -925 11520 9419 5775
214E775A872a5065O423K843o655f069m484k941c524B354b056l375k170n26L49
$$ 5775 1872 -15065 -8642 -5799 -12454 -6069 -10553 -13494 -3524 2354 -2056 -5431 -7601 -8127 -7778
199g778p79K293j144m318a173n899c386m166j784L949l9n1k51p60j124j923k251
$$ -7778 -8557 -6264 -7408 -11726 -1173 -7072 -3386 -7552 -9336 -5387 -5426 -5477 -5728 -6488 -7612 -9535 -11786
182a1786P80K897k170a961a1k255q68k152l862M289O9A942Q156B649f590C620
$$ -11786 -11006 -8109 -10279 -1961 -11 -2266 -3134 -5286 -9148 -4859 -4790 1942 10098 2649 -6590 3620
165a854D989K934c254B107F76a033H078K706E232K298c83j1426H92M493A332a2050
$$ -1854 4989 7923 -3254 2107 676 -1033 8078 10784 5232 7530 -383 -11809 892 5385 1332 -12050
148E779i09K91n18q013j412d904F965L752B521g396G746C463f73m364j272k865
$$ 5779 -909 -618 -1136 -9149 -10561 -4904 6965 10717 2521 -7396 7746 3463 -673 -5037 -6309 -9174
132i174k167K370L709M79r78m395q02b179A0575N70r01f274n729J960c164m143
$$ -9174 -11341 -8971 -5262 -4783 -5761 -10156 -10958 -2179 10575 11145 10244 -6274 -12003 -10043 -3164 -7307
116g307J004b289E32Q59g14j681m594k81o91L526m125J99l785q58L442J203J60
$$ -7307 -6303 -2289 532 1391 -714 -2395 -6989 -7270 -7961 -4435 -8560 -8361 -12146 -13004 -9562 -8359 -8199
99h199j921j972M340a900D538i323C15a2727I57Q404D502a266E13d303C796K062
$$ -8199 -10120 -12092 -7752 -1900 4538 -9323 315 -12727 957 9361 4502 -1266 513 -4303 3796 5858
83E858M064B747a5751M131M233A3259L815G942K499l984a22D090d1l58k221f35
$$ 5858 9922 2747 -15751 -11620 -7387 13259 17074 7942 10441 6457 -122 4090 -41 -399 -2620 -635
66c003k508k858j689K445L143b050h12a29p46l052j278J935n002E786N89j726
$$ -3003 -5511 -8369 -10058 -7613 -4470 -2050 -812 -129 -875 -3927 -5205 -3270 -8272 5786 6375 4649
50D649p04c47o890K382K09m42k266k767J219L848b056e95l410E156M89J164K64
$$ 4649 3945 -347 -7237 -4855 -4646 -5088 -7354 -10121 -8902 -5054 -2056 -595 -4005 5156 5645 6809 7073
33G073C093h60o017j392j204c829a100m967l074L366A696c668m538M7K377Q40
$$ 7073 3093 -860 -6877 -8269 -9473 -3829 -1100 -6067 -9141 -5775 1696 -3668 -8206 -8159 -5782 -4942
17d942j242j920j698N6K245K002k996L374k546J298n878M829L385A935b003k732
$$ -4942 -6184 -8104 -9802 -9746 -7501 -5499 -8495 -5121 -7667 -6369 -12247 -7418 -4033 1935 -2003 -4735
1d735D183
$$ -4735 4183
##PAGE= F1=2372.376875755
##FIRST=     2906.91634943962, 2629.00904605264, 3413
##DATA TABLE= (F2++(Y..Y)), PROFILE
1023C413c010p009R75b620C947b445B073h676a236E83a349K56k769J865m515n910
$$ 3413 -3010 -10019 -9044 -2620 3947 -2445 2073 -8676 -1236 583 -1349 -1093 -3862 -1997 -6512 -12422
1007a2422e646A028f088b682H117k224a2182c413k975l053o81K219L816b62l056
$$ -12422 -5646 1028 -6088 -2682 8117 5893 -12182 -3413 -6388 -9441 -10122 -7903 -4087 -262 -3318
992c318q522b470A808K312j751b75m445D46K150A31c789o680a686A964a0013C834
$$ -3318 -11840 -2470 1808 4120 2369 -275 -4720 446 2596 131 -3789 -10469 -1686 1964 -10013 3834
975I37b668m004k977L15K934c195i85G21b872B62f620D156d191J22A26J973a443
$$ 937 -2668 -6672 -9649 -9334 -6400 -3195 -985 721 -2872 262 -6620 4156 -4191 -4069 126 2099 -1443
957a0814j89k908L551o443m68Q515M05P21J022j0938g430k337k589J2K165J831
$$ -10814 -11003 -13911 -10360 -16803 -17271 -8756 -8351 -7630 -6608 -17546 -7430 -9767 -12356 -12344 -10179 -8348
941h348n42qj867r08K098M532d79A880L550M75k061A636o55a2040a846D293a665
$$ -8348 -8890 -8898 -10765 -11673 -9575 -5043 -479 1880 5430 5905 3844 1636 981 -12040 -1846 4293 -1665
923C985K589c006D393q47d366a749h68k046j40J269a49m609k603J951J107B119
$$ 3985 6574 -3006 4393 3546 -4366 -1749 -868 -2914 -3054 -1785 -149 -4758 -7361 -5410 -4303 2119
906b009A0c364j267o001a36o352b70o853m503e151l555D28b015m590I20b431l708
$$ -2009 10 -3364 -4631 -10632 -136 -6488 -270 -7123 -11626 -5151 -8706 428 -2015 -6605 920 -2431 -6139
889f139k492n40J712q34J205A45K948J605O18h223C79f082J500K023P05A305b531
$$ -6139 -8631 -9171 -7459 -8293 -7088 145 3093 4698 5316 -8223 379 -6082 -4582 -2559 -1854 1305 -2531
871A0407J588j384l806a1902B02a479A998h04o045q773g234c029l865R12D9K977
$$ 10407 11995 10611 6805 -11902 202 -1479 1998 -804 -6849 -15622 -7234 -3029 -6894 -5982 49 3026
855C026J8069m840B005b891n189L34n830M652b939B012a28F550N46f249E273M352
$$ 3026 21095 16255 2005 -2891 -8080 -7746 -13576 -8924 -2939 2012 -128 6550 7096 -6249 5273 9625
839I625K272k230A14a928B507R165e28r082N41P19L475J18J945k756m391m998
$$ 9625 11897 9667 114 -1928 2507 11672 -528 -9610 -9069 -8350 -4875 -4757 -2812 -5568 -9959 -14957
823a4957J840L471J822O59l134J662K065a374l68H1256J71705J95452J05134n4857
$$ -14957 -13117 -9646 -7824 -7165 -10299 -8637 -6572 -1374 -1742 81256 252961 448413 553547 498690
809D98690A06503l8604A161Q881M705E723R478C610P578b244m195m760k115n74
$$ 498690 106503 67899 1161 10042 14747 5723 15201 3610 11188 -2244 -6439 -11199 -13314 -13888
795a3888J620L238c679a347B856H10a736B756a2504L075K461n356A42N768L92
$$ -13888 -12268 -9030 -3679 -1347 2856 810 -1736 2756 -12504 -9429 -6968 -12324 142 5910 6302
780F302b759I52N945c641C92M872L709C398i787c409j498j548J251Q5N23P53J108
$$ 6302 -2759 952 6897 -3641 392 5264 8973 3398 -9787 -3409 -4907 -6455 -5204 -5119 -4596 -3843 -2735
763b735J173c64A132M62a065l538l583c341j474j262j771B751a629m214l611k271
$$ -2735 -1562 -364 1132 1594 -1065 -4603 -8186 -3341 -4815 -6077 -7848 2751 -1629 -5843 -9454 -11725
747a1725n95J336J602J107M5n60J817R15l418b443l095k98l295d565n563K568
$$ -11725 -12320 -10984 -9382 -8275 -8230 -8790 -6973 -6058 -9476 -2443 -5538 -5836 -9131 -4565 -10128 -7560
731g560K362J688l411C260P355I66a1198b004I013D288b1k562p515M947J74M70
$$ -7560 -5198 -3510 -6921 3260 10615 966 -11198 -2004 9013 4288 -21 -2583 -10098 -5151 -4977 -4507
715d507k49j741l402l316L744K803l449L798J45l599G65K8d916k919b588l99L20
$$ -4507 -4756 -6497 -9899 -13215 -9471 -6668 -10117 -6319 -6174 -9773 765 793 -4916 -7835 -2588 -2987 -2667
698b667j30j218o307N104M26P10M45j403l366m911f652I84a113D508P529j571
$$ -2667 -2797 -4015 -10322 -5218 -4792 -4082 -3637 -5040 -8406 -13317 -6652 984 -1113 4508 12037 10466
682A0466l462C294I92C20f04j4809e653l443j816O89O03L50N33P3m84j02J418
$$ 10466 7004 3294 992 320 -604 -15413 -5653 -9096 -10912 -10223 -9620 -9270 -8737 -8664 -9148 -9250 -7832
665g832K414K665m412C404K749h063k970B916d00k110m900a711j236k391k051
$$ -7832 -5418 -2753 -7165 3404 6153 -8063 -11033 2916 -400 -2510 -7410 -1711 -2947 -5338 -7389
650g389j391l03o4j41J027l955b481F18J711N16A358e684J769h75B306K203H15
$$ -7389 -8780 -9083 -9147 -9288 -8261 -12216 -2481 618 2329 2845 1358 -5684 -3915 -875 2306 4509 815
632d904I72c662l664j461o745N479j2592j5043f954A2201m82m627a1053c637q21
$$ -4904 972 -3662 -7326 -8787 -15532 -10053 -22645 -37688 -6954 12201 11719 7092 -11053 -3637 -4458
617d458b115C164a3360P73k186K297a870A049g51e4o81I019B022a2441J865b55
$$ -4458 -2115 3164 -13360 -12587 -14773 -12476 -1870 1049 -751 -54 -735 9019 2022 -12441 -10576 -255
600c408o454K040L383N55j998k968m74Q04J622g96G813c820h87A451K5888m892
$$ -3408 -9862 -7822 -4439 -3884 -5882 -8850 -9324 -8520 -6898 -796 7813 -3820 -887 1451 27339 22447
584B2447A1023j555A76h627c662A25a268j972B805b897j35D792B065b161j409
$$ 22447 11023 9468 176 -8627 -3662 125 -1268 -3240 2805 -2897 -3032 4792 2065 -2161 -3570
569c570R24a242C64Q05O87I17b975F2b457r271N009J421g85B737K09K684j953
$$ -3570 -2646 -1242 364 1169 1856 917 -2975 62 -2457 -11728 -6719 -5298 -785 2737 2946 5630 3677
552C677c392K09n077J599a595B351C10c556P19k133k982L180a159e70E79e22q942
$$ 3677 -3392 -3183 -8260 -6661 -1595 2351 310 -3556 -2837 -4970 -7952 -4772 -1159 -570 579 -522 -9464
535i464J48K904B50K674e97a90F390P465G86R321l885g035l237b105J031m841
$$ -9464 -9316 -6412 250 2924 -597 -190 6390 13855 786 10107 6222 -7035 -10272 -2105 -1074 -5915
519e915n398b975C436i51A178J530m02L899a13o523k419M522o956M756K481k709
$$ -5915 -11313 -2975 3436 -951 1178 2708 2306 6205 -113 -6636 -9055 -4533 -11489 -6733 -4252 -6961
503f961j291j258d324J991d25A035a431l989l218c950k268j405m40M03o16L024
$$ -6961 -8252 -9510 -4324 -2333 -425 1035 -1431 -5420 -8638 -3950 -6218 -7623 -8063 -7660 -8276 -5252
487e252J539M14j877K339j899o146J800L41Q66N27m67n54l42j212Q24L652a44
$$ -5252 -3713 -3299 -5176 -2837 -4736 -10882 -9082 -8741 -7875 -7348 -7815 -8369 -8711 -9923 -9099 -5447 -144
469A748i682K583b116E190A512i03F61e271O0A75d428k769J026l743J783k844
$$ 1748 -9682 -7099 -2116 5190 1512 -903 661 -5271 -5211 175 -4428 -7197 -6171 -9914 -8131 -10975
453a0975J052J329j055J578p51D51K223i061A0093l565B327d395j894K144l575
$$ -10975 -9923 -8594 -9649 -8071 -8822 451 2674 -9061 10093 6528 2327 -4395 -6289 -4145 -7720
438g720A101d606E523M569a08k218B891a582m317j787j0577N806h47D093a2059
$$ -7720 1101 -4606 5523 10092 -108 -2326 2891 -1582 -5899 -7686 -18263 -12457 -847 4093 -12059
422C846L31c738j1761J129N013B238a7q362K771k205K028J855M57j083b213O95
$$ 3846 4177 -3738 -15499 -14370 -9357 2238 -17 -8379 -5608 -7813 -5785 -3930 -3473 -4556 -2213 -1518
406a518g24k461j010o252c842m411O61J105b388o307C72J042K920k140b123l476
$$ -1518 -724 -3185 -4195 -10447 -3842 -8253 -7592 -6487 -2388 -8695 372 1414 4334 2194 -2123 -5599
390e599a213e23I45K188K655e545C590c745F914L437r71l280f675b830m468l22
$$ -5599 -1213 -523 945 3133 5788 -5545 3590 -3745 6914 10351 9380 6100 -6675 -2830 -7298 -7620
374g620K878J843J020i04c26l213J254j778j0633L965e346L38l41N26J584a273
$$ -7620 -4742 -2899 -1879 -904 -326 -3539 -2285 -4063 -14696 -10731 -5346 -5008 -5349 -4823 -3239 -1273
357B55i300P12M200O67j547J977o046m042d352oJ752A547c01k741l823l152P4
$$ 255 -9300 -8588 -4388 -3721 -5268 -3291 -9337 -13379 -4352 -4358 -2606 1547 -301 -3042 -6865 -10017 -9943
340i943K056K413b159j62j449l100q7D19f636D846j072A881d43j315m88Q89o711
$$ -9943 -7887 -5474 -2159 -2321 -3770 -6870 -6957 419 -6636 4846 3774 1881 -443 -1758 -2246 -1357 -8068
323h068B339i341M055k826j533B691J326g101k466J215l317L542L328J973C380
$$ -8068 2339 -9341 -5286 -8112 -9645 2691 4017 -7101 -9567 -8352 -11669 -8127 -4799 -2826 3380
307A686a850F076M844M779j989k657P347l837m245m621f375K888k789m667K813
$$ 1686 -1850 6076 10920 15699 13710 11053 18400 14563 10318 5697 -6375 -3487 -6276 -10943 -8130
292h130k663L647c284o263a551j424I64b311n39m159b808a82B529K261f488A088
$$ -8130 -10793 -7146 -3284 -9547 -1551 -2975 964 -2311 -2850 -7009 -2808 -182 2529 4790 -6488 1088
275c00o668J091j349a271o479j695N23j820O16m095L820Q32J195R43N89n23L504
$$ -300 -6968 -5877 -7226 -1271 -7750 -9445 -8922 -10742 -10126 -14221 -10401 -9569 -8374 -7431 -6842 -7365 -3861
258c861n145j384M578J152O65r5r06j287p89k679M416m832M920b139J99r18k290
$$ -3861 -9006 -10390 -5812 -4660 -3995 -4090 -4996 -6283 -7072 -9751 -5335 -10167 -5247 -2139 -1940 -2858 -5148
241e148l414q67n734d234N56I892j797l800d890l631p77C112K119r98M086F61
$$ -5148 -8562 -9429 -15163 -4234 -3678 9892 8095 4295 -4890 -8521 -9298 3112 5231 4233 8319 661
224E088M691L092E026A81g071K875A899L149P3j660j495a4677L476K417j176c580
$$ 5088 9779 12871 5026 181 -7071 -4196 1899 5048 5121 3461 1966 -14677 -11201 -8784 -9960 -3580
207i822K327b042C127a433q307O90J370K871o810n23J1K433K295J77J677p44j738
$$ -9822 -7495 -2042 3127 -1433 -9740 -9050 -7680 -4809 -11619 -12142 -12131 -9698 -7403 -7226 -5549 -6293 -8031
190h031H8d883E451k388g06l503j784k979c497O76o800b330L46l795m00J810k599
$$ -8031 88 -4883 5451 3063 -706 -4209 -5993 -8972 -3497 -2821 -9621 -2330 -1984 -5779 -6179 -4369 -6968
173f968J236O9C466P907B331i245C048c611C711j115e056A37M055B050O800q06
$$ -6968 -5732 -5663 3466 11373 2331 -9245 3048 -3611 3711 2596 -5056 137 4192 2050 8850 8044
157H044k892H16c639j642i41C830m68a1586C210d741j255A574f159J709K134I008
$$ 8044 5152 816 -3639 -5281 -941 3830 3362 -11586 3210 -4741 -5996 1574 -6159 -4450 -2316 9008
140A4791E006e767A4175J951D601a357F219c270A556N662A714a0047m07M002j053
$$ 14791 5006 -5767 14175 16126 4601 -1357 6219 -3270 1556 7218 1714 -10047 -10454 -6452 -7505
125g505B259M653P49k58a798j3228L810d434k408q4Q98N42J0n24j378j699k457
$$ -7505 2259 6912 7661 7403 -1798 -15026 -11216 -4434 -6842 -6926 -6028 -5486 -5476 -6000 -7378 -9077 -11534
108a1534J39R29J977J643Q56l79j094k755j877j22K478K934L118b34m997B744
$$ -11534 -11395 -10466 -8489 -6846 -5990 -6369 -7463 -10218 -12095 -12217 -9739 -6805 -3687 -234 -5231 2744
91i353c483E285k402f608k356L047b870J278B59K312a0664j180n828e75n25j293
$$ -9353 -3483 5285 2883 -6608 -8964 -5917 -2870 -1592 259 2571 -10664 -11844 -17672 -575 -1100 -2393
75b393A565K778c28C652c408a619l509H954i48k348O09k439l138J069b583J281
$$ -2393 1565 4343 -328 3652 -3408 -1619 -5128 8954 -948 -3296 -2687 -5126 -8264 -7195 -2583 -1302
59a302l83k122k000k64e58l910H636P0k917A619a943l017K370O02k53j576j873
$$ -1302 -1685 -3807 -5807 -6071 -558 -4468 8636 8706 5789 1619 -1943 -4960 -2590 -1988 -2241 -3817 -5690
42e690k182j835j645m49P35K156L466a497B469K566G19d062n991J297b961g7q340
$$ -5690 -7872 -9707 -11352 -11801 -11066 -8910 -5444 -1497 2469 5035 719 -4062 -10053 -8756 -2961 -77 -8417
25h417P73J256A629C94a061n208K158J205C183a664l397k462c121j407k239j313
$$ -8417 -7644 -6388 1629 394 -1061 -6269 -4111 -2906 3183 -1664 -5061 -7523 -3121 -4528 -6767 -8080
9h080j239m55J652L556J8A879a751J32C055
$$ -8080 -9319 -9774 -8122 -4566 -4548 1879 -1751 -1619 3055
##PAGE= F1=2369.80697444
##FIRST=     2906.91634943962, 2629.00904605264, -10638
##DATA TABLE= (F2++(Y..Y)), PROFILE
1023a0638M339a951m519a102o46P10B741a2788f43o446k445K173J350q68l368
$$ -10638 -6299 -1951 -6470 -1102 -1748 -1038 2741 -12788 -643 -7089 -9534 -7361 -6011 -6879 -10247
1008a0247M69c603B434e219L65F857l090a0877b795j048j0m548L983K132B533
$$ -10247 -9778 -3603 2434 -5219 -4854 6857 3767 -10877 -2795 -3843 -3853 -8401 -4418 -2286 2533
992b468p244d188B08P891A51e977j212c441b23A500b169p927c480A838c044P82
$$ -2468 -9712 -4188 208 8099 151 -5977 -7189 -3441 -223 1500 -2169 -10096 -3480 1838 -3044 -2262
976b262E385H53d145m552j862L667b067B099M182h37j366o085D109b836J82A657
$$ -2262 5385 853 -4145 -8697 -10559 -6892 -2067 2099 6281 -837 -2203 -8288 4109 -2836 -2654 1657
959A809c214n504L157b265B46a4470k375P778p13K440K547j3735a878k159k600
$$ 1809 -3214 -8718 -5561 -2265 246 -14470 -16845 -9067 -9780 -7340 -4793 -18528 -1878 -4037 -6637
944f637Q72K571J494j450j922l681l900j052O035a605B050L169K133B808j103
$$ -6637 -5765 -3194 -1700 -3150 -5072 -8753 -12653 -13705 -7670 -1605 2050 5219 7352 2808 1705
929A705R4a1912a159j268j490p26N81Q07a8l21j021B22L583l3E75c322m252j829
$$ 1705 1799 -11912 -1159 -2427 -3917 -4643 -4062 -3255 -18 -339 -1360 222 3805 3772 575 -3322 -7574 -9403
911i403J874K848O4J298j925l087j822K45J034Q01N80J022j786k433c761k168
$$ -9403 -7529 -4681 -4617 -3319 -5244 -8331 -10153 -9908 -8874 -8073 -7493 -6471 -8257 -10690 -3761 -5929
895e929a021l57m315a384k591m376j341M509J698m218J51A313M609q59q68i759
$$ -5929 -1021 -1378 -5693 -1384 -3975 -8351 -9692 -5183 -3485 -7703 -7552 1313 5922 5063 4195 -9759
878b93j0160d981j79J281D7h752A0615P033l124q04f827b011B362K888A585c237
$$ -293 -10453 -4981 -5160 -3879 47 -8752 10615 17648 14524 13720 -6827 -2011 2362 5250 1585 -3237
861e739b818j712l585j847d119B708K2158n0G704A559e277J732A997G33L325j076
$$ -5739 -2818 -4530 -8115 -9962 -4119 2708 24866 24816 7704 1559 -5277 -3545 1997 733 4058 2982
845B982l09K805l85e497A391a01j015N03a57A039f575H417a679j0738K511P25
$$ 2982 2673 5478 5093 -5497 1391 -101 -1116 -613 -157 1039 -6575 8417 -1679 -12417 -9906 -9181
829i181L901j350m8k958J217d056J116E078o48h655a086aj0012a742C2772P0094
$$ -9181 -5280 -6630 -6678 -9636 -8419 -4056 -2940 5078 4430 -8655 -1086 -1 -10013 -1742 32772 102866
813A02866O754P95213J06814j92626A76668m6096B6697p320A078J86M466j099
$$ 102866 109620 904833 1011647 819021 176668 130572 26697 19377 1078 1264 5730 4631
801D631b653m180L84K168o165e066j443n142k557M227b871A194a476B774a1852
$$ 4631 -2653 -6833 -6449 -4281 -10446 -5066 -6509 -11651 -14208 -9981 -2871 1194 -1476 2774 -11852
785a1350d557k750K033h05C973A037f3F847c076A016L869L796k288e533P46j786
$$ -11350 -4557 -7307 -5274 -805 3973 1037 -63 6847 -3076 1016 4885 8681 6393 -5533 -4787 -6573
769f573J822J719j228k903l342J178L580K403N57j602l242j663j929e055K385
$$ -6573 -4751 -3032 -4260 -7163 -10505 -9327 -5747 -3344 -2787 -4389 -7631 -9294 -11223 -5055 -2670
754b670m056J147K319l102j820l63N30J659a914C626M761B757h825a534p70o489
$$ -2670 -6726 -5579 -3260 -6362 -8182 -8545 -8015 -6356 -1914 3626 8387 2757 -8825 -1534 -2304 -8793
738h793a184m270J627a627F452c864O46n51a446n881B26O124A967e597K237A2276
$$ -8793 -1184 -5454 -3827 -1627 6452 -3864 -3218 -3769 -1446 -7327 226 6350 1967 -5597 -3360 12276
721I677r94l049f213C970j04j748a157n891m646N512m765d846l152j47J181n146
$$ 9677 8683 5634 -6213 3970 3866 2118 -1157 -7048 -11694 -6182 -10947 -4846 -7998 -8145 -6964 -12110
705a2110c805j982l939k622R34K131K658K491j085K321k220B02e92m01n17k559
$$ -12110 -3805 -5787 -9726 -12348 -11414 -9283 -6625 -4134 -5219 -2898 -5118 202 -592 -993 -1510 -4069
689d069p35l036j836J695K297M61j360k659j03L225K920j21o047b873j266m270
$$ -4069 -4804 -7840 -9676 -7981 -5684 -5223 -6583 -9242 -9345 -6120 -3200 -3321 -9368 -2873 -4139 -8409
673h409Q7j403L060J262B210J507e641M45J899l752m494J00e185n708j137G55
$$ -8409 -8322 -9725 -6665 -5403 2210 3717 -5641 -5196 -3297 -7049 -11543 -11443 -5185 -10893 -12030 755
656a631k835n8b189A0237j217l36B307f459n77j828J485k077B105N235J752J777
$$ -1631 -4466 -4524 -2189 10237 9020 8684 2307 -6459 -7036 -8864 -7379 -9456 2105 7340 9092 10869
640A0869A244g776K996D30R491j76C251e494D582a525m726n386n353P869k0552
$$ 10869 1244 -7776 -4780 430 9921 9745 3251 -5494 4582 -1525 -6251 -11637 -16990 -9121 -29673
625b9673j9138a3215A0817Q304m303i226E484e752j702E36a1437N282o135K530
$$ -29673 -48811 -13215 10817 19121 14818 -9226 5484 -5752 -7454 536 -11437 -6155 -12290 -9760
611i760c630b85k019j43k06G055E07a3380N785G56N874b237n414c454A610a062
$$ -9760 -3630 -285 -2304 -2447 -2653 7055 507 -13380 -7595 756 6630 -2237 -7651 -3454 1610 -1062
594C203d000B04J125J209M908e289b345f74I018k305C317e95l300l420L594a063
$$ 3203 -4000 204 1329 2538 7446 -5289 -2345 -674 9018 6713 3317 -595 -3895 -7315 -3721 -1063
577D59M32J031d017a565l003r355c142m646F932O073F76K645R23C61c860J274
$$ 459 891 1922 -4017 -1565 -4568 -13923 -3142 -7788 6932 13005 676 3321 4244 361 -3860 -2586
561b586j557r466L264M952e66C190j343O986J114f64b42k061n794c598B665c434
$$ -2586 -4143 -13609 -10345 -5393 -566 3190 1847 8833 9947 -664 -242 -2303 -8097 -3598 2665 -3434
544c352h70j5r069K517l303j375M967b733n067o66L590j701l909r91L519c500
$$ -3352 -870 -885 -9954 -7437 -10740 -12115 -7148 -2733 -7800 -8466 -4876 -6577 -10486 -11477 -7958 -3500
527E87N88M386P51a071k620a444G754l421a1501N600p557M827c292B83J441M37
$$ 587 1175 5561 6312 -1071 -3691 -1444 7754 4333 -11501 -5901 -13458 -8631 -3292 283 1724 2161
511B161k42d69I79c216m769j151c704k156o75R21b686i12B83J433b70n896K936
$$ 2161 1919 -469 979 -3216 -7985 -9136 -3704 -5860 -6535 -5614 -2686 -912 283 1716 -270 -6166 -3230
494c230a318m42P78A89R19e071a365A011h50j198k85o03n779b526j104l192B463
$$ -3230 -1318 -1760 -982 189 1108 -5071 -1365 1011 -850 -2048 -2333 -2936 -8715 -2526 -3630 -6822 2463
476F511L871j114c918F834a1o390m01k936A246M141K091E39J479h74p400L080
$$ 6511 10382 9268 -3918 6834 -11 -6401 -6802 -9738 1246 5387 7478 539 2018 -874 -8274 -5194
460e194m121j748L484c076q558a41E51h76D18g640Q31J433j13o281K768b175A986
$$ -5194 -9315 -11063 -7579 -3076 -11634 -141 551 -876 418 -7640 -6809 -5376 -5489 -11770 -9002 -2175 1986
442C181g058l78J690l098c644j518E097N853A835a433F127e2o329m475o946P211
$$ 3181 -7058 -7436 -5746 -8844 -3644 -5162 5097 10950 1835 -1433 6127 -52 -6381 -10856 -17802 -10591
426a0591M099M13n174N081K52M46q270K394M227L032K68o740L757c133r5j075
$$ -10591 -6492 -6079 -11253 -6172 -5920 -5474 -13744 -11350 -7123 -4091 -3823 -10563 -6806 -3133 -3228 -4303
410d303j706j971j329n96N31J719K696m686K686k622d53r1k698k386k5K362d94
$$ -4303 -6009 -7980 -9309 -9905 -9374 -7655 -4959 -9645 -6959 -9581 -453 -544 -3242 -5628 -5653 -3291 -494
392C05K06e170a83l35r74j959k874k274K842b272D335L223K945J25e175C601b079
$$ 305 511 -5170 -183 -518 -1492 -3451 -6325 -8599 -5757 -2272 4335 7558 10503 10628 -5175 3601 -2079
374f158K741G58b076G513J472f00C2Pa2384J504L992a03o474l943a430A468d285
$$ -6158 -3417 758 -2076 7513 8985 -600 32 39 -12384 -10880 -6888 -103 -6577 -10520 -1430 1468 -4285
356f531J535J214K58j282l049m91K00m29j713R84L594a909l086I48a686E43I0
$$ -6531 -4996 -3782 -3524 -4806 -7855 -8346 -8146 -8575 -10288 -9304 -5710 -1909 -4995 948 -1686 543 90
338e65k57m22l92k679n609c024m473O17k721k167K994M036i78B841f887C61i060
$$ -565 -822 -1244 -1636 -4315 -9924 -3024 -7497 -6880 -9601 -11768 -8774 -4738 -978 2841 -6887 361 -9060
320d095m784J636a835A015g407l581L265J889J142a732g74B478A35h8A0065N205
$$ -4095 -8879 -7243 -1835 1015 -7407 -10988 -7723 -5834 -4692 -1732 -774 2478 135 -88 10065 15270
304A5270l62l824K25p42l779o94f519o553B376i78m554k185l335N202p28j839
$$ 15270 14908 11084 11309 10567 6788 6094 -6519 -13072 2376 -978 -5532 -7717 -11052 -5850 -6578 -8417
288h417B650h14G69K502i96k288k394l631J897J695k66k104L28c801J824j497
$$ -8417 2650 -814 769 3271 -996 -3284 -5678 -9309 -7412 -5717 -5983 -8087 -7759 -3801 -1977 -3474
272c474A88g278L68m177K631K176k046b963Q73o93a134m542l315b681l105l711
$$ -3474 188 -7278 -6910 -11087 -8456 -6280 -8326 -2963 -2090 -2783 -1134 -5676 -8991 -2681 -5786 -9497
256i497d210J93j481k586l120M05M531O28J802l437n50B413j30Hc272l526j907
$$ -9497 -4210 -4017 -5498 -8084 -11204 -10799 -6268 -5640 -3838 -7275 -7825 2413 2283 8 -3272 -6798 -8705
239h705k063N144p1J169O75a432H81f726n125c797E058L10kA756P884q50m037
$$ -8705 -10768 -5624 -5695 -4526 -3851 -1432 881 -6726 -11851 -3797 5058 5368 5366 1756 9640 8790 4753
222D753B59d071j441J414a620b08R6r46j628j0893j156M689j400K246J071K511
$$ 4753 259 -4071 -5512 -4098 -1620 -208 -112 -1058 -2686 -13579 -14735 -10046 -11446 -9200 -8129 -5618
206e618O91k42l14m456M272a622a55p485l396m386c587F875k28A895e406j331
$$ -5618 -4927 -5169 -5483 -9939 -5667 -1622 -155 -7640 -11036 -15422 -3587 6875 6647 1895 -5406 -6737
190f737I09e996H837l207h5o142j186k807f4j07r715b818h08p255j467c4j011
$$ -6737 909 -5996 8837 5630 -85 -6227 -7413 -10220 -64 -171 -9886 -2818 -808 -8063 -9530 -34 -1045
173a045n770l675d974i19E32e359K211m285m081L088M208B775L088N15J582k237
$$ -1045 -6815 -10490 -4974 -919 532 -5359 -3148 -7433 -11514 -8426 -4218 2775 5863 6378 7960 5723
157E723A583b742n87b59c5A770L453d825a801A943L938I1c232n64r54l70a216
$$ 5723 1583 -2742 -3329 -259 -35 1770 5223 -4825 -1801 1943 5881 91 -3232 -3796 -4750 -5120 -1216
139E445e052A1757P79E024k419R200a72C45J0117a403p700J204j489M306B358
$$ 5445 -5052 11757 12536 5024 2605 11805 -172 345 10462 -1403 -9103 -7899 -9388 -5082 2358
123F471O44j853b64j1482L888b632J213J25j604k257j152Q01K074q8o378B666
$$ 6471 7115 5262 -264 -11746 -7858 -2632 -1419 -1294 -2898 -5155 -6307 -5506 -3432 -3520 -9898 2666
106C852c239I46K68e130j114K744m479k986K755j849b153G70b286E249e017k110
$$ 3852 -3239 946 1214 -5130 -6244 -3500 -7979 -10965 -8210 -10059 -2153 770 -2286 5249 -5017 -7127
90g127a562n383k293J856J391m95k141k617m55K403J971j4616P550c974C868J093
$$ -7127 -1562 -6945 -9238 -7382 -5991 -6486 -8627 -11244 -11699 -9296 -7325 -21941 -14391 -3974 3868 4961
74D961A249a708j811m842l237O72J702J491J285R77k50j628l504N354a2E755M053
$$ 4961 1249 -1708 -3519 -8361 -11598 -10926 -9224 -7733 -6448 -5471 -5721 -7349 -10853 -5499 -12 5755 9808
57I808g26p299a677M46C160j328F08A52b306n52A831a721A251c81j525j450m901
$$ 9808 -726 -8025 -1677 -1231 3160 1832 608 152 -2306 -2858 1831 -1721 1251 -381 -1906 -3356 -8257
40h257K959l5J415d23D873N248C168L018H67a294l966j740a689j02q604e026L81
$$ -8257 -5298 -5333 -3918 -423 4873 10121 3168 6186 867 -1294 -5260 -7000 -1689 -1791 -10395 -5026 -4645
23d645H28N99C57c240J530k61A800c568e72l025j415J059J01J70m0m257L861p40
$$ -4645 828 1427 357 -3240 -1710 -1971 1800 -3568 -572 -3597 -5012 -3953 -3852 -3682 -3722 -7979 -4118 -4858
5d858p60j401j970k762j326
$$ -4858 -5618 -7019 -8989 -11751 -13077
0a3077
$$ -13077
##PAGE= F1=2367.237073124
##FIRST=     2906.91634943962, 2629.00904605264, -12286
##DATA TABLE= (F2++(Y..Y)), PROFILE
1023a2286L060L401J727A90e521c83l132o295l255l005J929L878K684N25l313
$$ -12286 -9226 -5825 -4098 190 -5521 -383 -3515 -9810 -13065 -16070 -14141 -10263 -7579 -7054 -10367
1008a0367o572q36g089J502k127F751J996i365c387C433e350J696J355O03C794
$$ -10367 -16939 -17775 -7089 -5587 -7714 6751 8747 -9365 -3387 3433 -5350 -3654 -2299 -1696 3794
992B03f061o43a543I04d474a402k881a779C446K610b906p568M603B429j42h395
$$ 203 -6061 -6704 -1543 904 -4474 -1402 -4283 -1779 3446 6056 -2906 -10474 -5871 2429 2287 -8395
975c254e41I34h69n822n749N208B293P153B102c384l963C747b229n9A413L785
$$ -3254 -541 934 -869 -6691 -12440 -7232 2293 9446 2102 -3384 -7347 3747 -2229 -2288 1413 5198
959E198l30d669A4702M85C901a1055l088O939K7N03L25q471a993A666h281K869
$$ 5198 4868 -4669 14702 15187 3901 -11055 -14143 -7204 -7177 -6674 -6349 -14820 -1993 1666 -8281 -5412
943e412J643k588C66J714c405m678m685k470M158N296f48B701b21A26J248g083
$$ -5412 -3769 -6357 366 2080 -3405 -8083 -12768 -15238 -11080 -5784 -648 2701 -221 126 1374 -7083
926c556l618l975k552M90K455L278J596A65J115d48m129m580j585K819J403j208
$$ -3556 -7174 -11149 -13701 -13211 -10756 -7478 -5882 165 1280 -448 -4577 -9157 -10742 -7923 -6520 -7728
910g728K966k716k190J493M026a2B335f370a661l895a616p567J711n110O165b83
$$ -7728 -4762 -7478 -9668 -8175 -4149 -12 2335 -6370 -1661 -5556 -1616 -9183 -7472 -12582 -6417 -283
893b035l774M89L14m044n63J610K886k170o17B056b517j511k88o313K709l093
$$ -2035 -5809 -5320 -5006 -9050 -9613 -8003 -5117 -7287 -7904 2056 -2517 -4028 -4316 -10629 -7920 -11013
877a1013j587K558M105l543m955E226J055q23k295a353m694m590k851L801d788
$$ -11013 -12600 -10042 -5937 -9480 -14435 5226 6281 5458 3163 -1353 -6047 -10637 -13488 -9687 -4788
861f013B86e946J255r3j374B522J8055q400C379c835l156Q36J460a741G00L846
$$ -6013 286 -5946 -4691 -4784 -6158 2522 20577 12177 3379 -3835 -6991 -6155 -4695 -1741 700 4546
845D546J7k000E69d962C33e186k558m242j482j591K505M612c521n550R71j267
$$ 4546 4563 2563 569 -4962 333 -5186 -7744 -11986 -13468 -15059 -12554 -7942 -3521 -9071 -8100 -9367
829i367M474J155j447k324k649m282f940h56G679C170J6658H671K8167M4418K1610
$$ -9367 -4893 -3738 -5185 -7509 -10158 -14440 -6940 -856 7679 3170 19828 8671 36838 81256 102866
814A02866O23969J322809J369654N59434o40875A552892C39686B9559N5516c836
$$ 102866 726835 2049644 3419298 3978732 3337857 1552892 339686 29559 85075 -3836
803A3749i405A2454C353I52e271b580n369M54l984j969Q53M406b158G70a56B615
$$ 13749 -9405 12454 3353 952 -5271 -2580 -7949 -7495 -11479 -13448 -12595 -8189 -2158 770 -156 2615
786i268L071l897L758a490G590L124D009b87F555c203G83K711M030J764C64b797
$$ -9268 -6197 -10094 -6336 -1490 7590 10714 4009 -287 6555 -3203 783 3494 7524 9288 364 -2797
769g456P99h76B999R87A950d25q120D673M848m046f71q134k111b979o117n956
$$ -7456 -6657 -876 2999 3986 1950 -425 -8545 4673 9521 5475 -671 -8805 -10916 -2979 -9096 -15052
753a5052L012e606e75C103J078f821a576j963@F955A56h996e31A126f537g85q36
$$ -15052 -12040 -5606 -575 3103 4181 -6821 -1576 -3539 0 6955 156 -8996 -531 1126 -6537 -785 -1621
736a621A323M125M506d118q501a588a06q505L120C51J392b082m019A2354l218
$$ -1621 1323 5448 9954 -4118 -12619 -1588 -106 -8611 -5491 351 1743 -2082 -6101 12354 9136
721I136C599a895n894r61b911B114J110b90o176q24m424a841m157m069K711m478
$$ 9136 3599 -1895 -7789 -8750 -2911 2114 3224 -290 -6466 -7290 -11714 -1841 -5998 -10067 -7356 -11834
705a1834K361K779n561O108k794d206K7B422d145E800a05l860A365K22a242o91
$$ -11834 -9473 -6694 -12255 -6147 -8941 -4206 -4179 2422 -4145 5800 -105 -3965 1365 1587 -1242 -1933
689a933f30B186J934c262J488m395l708j021L093L579K070o28m66l147m713m216
$$ -1933 -630 2186 4120 -3262 -1774 -6169 -9877 -10898 -7805 -4226 -2156 -2784 -3250 -6397 -11110 -15326
673a5326L963e553e61p424D441l58d995n02a675k854j966K160a275q283L156K124
$$ -15326 -11363 -5553 -561 -7985 4441 4083 -4995 -5497 -1675 -4529 -6495 -4335 -1275 -9558 -6402 -4278
657d278a373q012L623j306I606L395K450o745e859M37o301k600K252L901c359
$$ -4278 -1373 -9385 -5762 -7068 9606 13001 15451 8706 -5859 -5422 -11723 -14323 -12071 -8170 -3359
641b31C63b700n934N34c404B030K478K05f182A405a59j718j2992j433a266l7895
$$ -231 363 -2700 -8634 -8100 -3404 2030 4508 4713 -6182 1405 -159 -1877 -14869 -16302 -1266 -39161
625c9161k2172b0092D680N209m97f848D167h080k413c824q107J802K457J185K489
$$ -39161 -61333 -20092 4680 9889 9392 -6848 4167 -8080 -10493 -3824 -11931 -10129 -7672 -6487 -3998
610c998j92q72p56b520F907f30j1833O155F89O640B996b655o300o944K897e636
$$ -3998 -4190 -5062 -5818 -2520 6907 -630 -12463 -6308 689 7329 2996 -2655 -8955 -15899 -13002 -5636
593b385P02q53B731J703g657L447l026m471k649M261d169A179d487a411I39J423
$$ -2385 -1683 -2536 2731 4434 -7657 -4210 -7236 -11707 -14356 -10095 -4169 1179 -4487 -1411 939 2362
577B362J155a13n907K847r1B535e171p456I950P633B512K063L07b513m299L96
$$ 2362 3517 -113 -6020 -3173 -3264 2535 -5171 -12627 9950 17583 2512 4575 4882 -2513 -6812 -6416
561f416r70m949N699a612D76b83r03J63N1l56k764m382J078A95N338e083a620
$$ -6416 -7386 -12335 -6636 -1612 476 -283 -1186 -1023 -972 -1328 -4092 -8474 -7396 195 5533 -5083 -1620
543e56q83o822M099J88p066L56m776L966K877M163K035L16j548k896l350k705
$$ -556 -1439 -8261 -4162 -3974 -11040 -10684 -15460 -11494 -8617 -4454 -2419 -2103 -3651 -6547 -9897 -12602
527a2602Q82K115K079O95n07m08J149J377m843d040K47J626E23k17J30L858A44
$$ -12602 -11720 -9605 -7526 -6831 -7338 -7746 -6597 -5220 -10063 -4040 -3793 -2167 523 306 436 4294 144
509c61B716e165Q54o916d582b248M4l752l031k681k187o07K891M267b738A712
$$ -361 2716 -5165 -4311 -11227 -4582 -2248 -2204 -5956 -8987 -11668 -13855 -14462 -11571 -7304 -2738 1712
492a149C597M549n63D2b793A900f10l090l562j445K504a454j895m640C010J4158
$$ -1149 3597 8146 7583 42 -2793 1900 -610 -3700 -7262 -8707 -6203 -1454 -3349 -7989 3010 17168
476A7168K108D875h536A1009P871G048d143l299c53F422L398b76E984A116a0972
$$ 17168 19276 4875 -8536 11009 18880 7048 -4143 -7442 -353 6422 9820 -276 5984 1116 -10972
460a445l349o245L805I15h690E584L154e548b34n997b267F149b943B09b025n279
$$ -1445 -4794 -11039 -7234 915 -8690 5584 8738 -5548 -234 -6231 -2267 6149 -2943 209 -2025 -7304
444g304J159a966q930J334K655k126j242L643k274J086J761Q18k94j453r35K5
$$ -7304 -6145 -1966 -10896 -9562 -6907 -9033 -10275 -6632 -8906 -7820 -6059 -5241 -5535 -6988 -7923 -7898
428g898r679g939n48j234k402J928J618J856m353K750K547j174q10j958J065R91
$$ -7898 -17577 -7939 -8487 -9721 -12123 -10195 -8577 -6721 -11074 -8324 -5777 -6951 -7761 -9719 -8654 -7663
412g663j00j013j211n52P06O78l25j601p79L145K98J496f94j952b07j608l166
$$ -7663 -7763 -8776 -9987 -10539 -9833 -9155 -9480 -11081 -11860 -8715 -8417 -6921 -694 -2646 -207 -1815 -4981
395d981m314k345o8K158K760L286J293c93k140m609l231d488a517G154C376J1008
$$ -4981 -9295 -11640 -11708 -9550 -6790 -3504 -2211 -393 -2533 -7142 -10373 -4488 -1517 7154 3376 14384
379A4384j26e321B338b099k101A574M53b633A1608k747A983J302o50a1602L552
$$ 14384 14258 -5321 2338 -2099 -4200 1574 2027 -2633 11608 8861 1983 3285 2635 -11602 -8050
364h050m927e607b773b67B656A263a0985a587p60k504J88j735K293P47k200l930
$$ -8050 -12977 -5607 -2773 -267 2656 1263 -10985 -1587 -2347 -4851 -4663 -6398 -4105 -3358 -5558 -9488
348i488J166c037C820o3a3500f697K865l63I420m023B358a324n988n700L1K110
$$ -9488 -8322 -3037 3820 3757 -13500 -6697 -3832 -4195 9420 5397 2358 -1324 -7312 -13012 -12981 -10871
332a0871m4j950K238M292b500H73J605L50c81l176o250M748j740C30c25k950m073
$$ -10871 -10915 -12865 -10627 -6335 -2500 873 2478 2828 -381 -3557 -9807 -5059 -6799 330 -325 -3275 -7348
315g348l920e568A3c292a66j35B56c699J484l096J527F50N209k729i039n923o178
$$ -7348 -11268 -5568 13 -3292 -166 -301 256 -3699 -2215 -5311 -3784 650 5859 3130 -9039 -14962 -21140
298b1140Q513N12a749n077k794P90L070l098P64b336D523i22o50E771A774g64
$$ -21140 -12627 -12115 -1749 -6826 -9620 -8830 -5760 -8858 -8094 -2336 4523 -922 -1572 5771 1774 -764
281g096K627r93k913m95J374K018J876J392M96k55n083J251m446j746n22J55q9
$$ -7096 -4469 -5462 -8375 -8870 -7496 -5478 -3602 -2210 -1714 -1969 -7052 -5801 -10247 -11993 -12515 -12360 -12449
264a2449P64K020K351K531o940b08l263n482g73j874l674l663k998n57L137L044
$$ -12449 -11685 -9665 -7314 -4783 -11723 -208 -3471 -8953 -773 -2647 -6321 -9984 -12982 -13539 -10402 -7358
248g358K795p25h37B144K709j029A469a850m068l444L1M21P97R39K156b433j421
$$ -7358 -4563 -5288 -837 2144 4853 3824 1469 -1850 -5918 -9362 -9331 -8910 -8113 -7174 -5018 -2433 -3854
231c854j94o328C368N78j576K065k085a17k064J47H0K926c846D217r07N82L763
$$ -3854 -4048 -10376 3368 3946 2370 4435 2350 -117 -2181 -2034 80 3006 -3846 4217 3310 3892 7655
214G655Q44a0274O02a735j682C163f594G9R57N669a964m475j437B097H46c328
$$ 7655 8499 -10274 -9672 -1735 -3417 3163 -6594 79 1036 6705 -1964 -6439 -7876 2097 846 -3328
197d734n880C036R745j848B328d948k310j093p78j391k465m88L136K658k092M610
$$ -4734 -10614 3036 12781 10933 2328 -4948 -7258 -8351 -9129 -10520 -12985 -13473 -10337 -7679 -9771 -5161
181e161k470k45j638j23J779l872c478N48K08m622L140j935k216j792j049J09
$$ -5161 -7631 -7876 -9514 -9637 -7858 -11730 -3478 -2930 -2722 -7344 -4204 -6139 -8355 -10147 -11196 -11087
165a1087J039K044L557D77M794M231J231j660l810k147g1A213c206a005F738A324
$$ -11087 -10048 -8004 -4447 477 5271 9502 10733 9073 5263 3116 -71 1213 -3206 -1005 6738 1324
148g704A088J308e002n594L499b165b12o75rn220E453L604B900K426O149B192
$$ -7704 1088 2396 -5002 -10596 -7097 -2165 -212 -887 -896 -6116 5453 9057 2900 5326 11475 2192
131b621D069c345j566l297J446b347E387N458K118j426a435o460b698C434J872
$$ -2621 4069 -3345 -4911 -8208 -6762 -2347 5387 10845 12963 11537 -1435 -7895 -2698 3434 5306
116E306A730c219n394m753k169L906M764J313A816L170A453f421J265J344m484
$$ 5306 1730 -3219 -8613 -13366 -15535 -11629 -6865 -5552 1816 4986 1453 -6421 -5156 -3812 -8296
101h296L259j040a663p078J006I032C881a121E448h38q304C628A334b199j076
$$ -8296 -5037 -6077 -1663 -8741 -7735 9032 3881 -1121 5448 -838 -9142 3628 1334 -2199 -3275
86c275P32j978p498b808a85B238k77a1443j2916R486L260c874J540j312a026j1202
$$ -3275 -2543 -4521 -12019 -2808 -185 2238 1961 -11443 -24359 -14873 -11613 -3874 -2334 -3646 -1026 -12228
70a2228O025n164b844k217Q60p98B834j131a1755K256a982F126N084B259a1102
$$ -12228 -6203 -11367 -2844 -5061 -4201 -4999 2834 1703 -11755 -9499 -1982 6126 11210 2259 -11102
54c005D41c258k078m62J115Q97a597A00h275A051L45D0b673l510m287l730k338
$$ -3005 441 -3258 -5336 -5798 -4683 -3786 -1597 100 -8275 1051 1396 40 -2673 -6183 -10470 -14200 -16538
37a6538O58K241L158M132b542g70K8q88l464m855l904J510L935K630J196Q19J810
$$ -16538 -15880 -13639 -10481 -6349 -2542 -770 -742 -1630 -5094 -9949 -13853 -12343 -8408 -5778 -4582 -3763 -1953
20a953b61A298J116a812m201B809D6g036c219a020k553J448n106D376A540c458
$$ -1953 -261 1298 2414 -1812 -6013 2809 46 -7036 -3219 -1020 -3573 -2125 -7231 4376 1540 -3458
3f825l386n59J809
$$ -6825 -10211 -10770 -8961
0h961
$$ -8961
##PAGE= F1=2364.667171808
##FIRST=     2906.91634943962, 2629.00904605264, -26711
##DATA TABLE= (F2++(Y..Y)), PROFILE
1023b6711N223P642e819H27a14G89f279r034m023O727e095d10F56a225n509q502
$$ -26711 -21488 -13846 -5819 827 -114 789 -6279 -15313 -19336 -12609 -5095 -410 656 -1225 -6734 -15236
1007a5236j0250P028f200m393A988P686h251c877Q22r053p791r6R981A029M446
$$ -15236 -25486 -18458 -6200 -10593 1988 9674 -8251 -3877 -3055 -12108 -19899 -19995 -10014 1029 5475
992E475h82q380a822D126C03L45e848N59C032K445e413k872o27L573j4137M852
$$ 5475 -882 -9262 -1822 4126 303 648 -5848 -5289 3032 5477 -5413 -8285 -8912 -5339 -19476 -14624
976a4624b071E857B685b792j5009Q578E168l30L401l994bl433B684b959j41B307
$$ -14624 -2071 5857 2685 -2792 -17801 -9223 5168 4838 8239 4245 -2 -3435 2684 -2959 -3100 2307
959A0304m896a280A1808l153B977g870m826K141b938k116k063l313A598b270l294
$$ 10304 5408 -1280 11808 8655 2977 -7870 -12696 -10555 -2938 -5054 -7117 -10430 1598 -2270 -5564
944e564J170j230n712G96J0755m712b682g78m244m823m798j448M533M509L396
$$ -5564 -4394 -5624 -11336 796 11551 6839 -2682 -778 -5022 -9845 -14643 -16091 -11558 -7049 -3653
929c653a380Pm67l439n471l653M293c345A588h028B39K428c898B892N555J150
$$ -3653 -1380 -1373 -1840 -5279 -10750 -14403 -10110 -3345 1588 -8028 239 2667 -3898 2892 8447 9597
913I597m359g355L89j629N76c136J371A244g05l807l047j221p87o57K43M436E404
$$ 9597 5238 -7355 -6966 -8595 -8019 -3136 -1765 1244 -705 -4512 -7559 -8780 -9567 -10224 -9981 -5545 5404
895f622b08m677k230k054K825j817K099j23Q42k146j258c155l570l399k378j98
$$ -6622 -208 -4885 -7115 -9169 -6344 -8161 -6062 -6185 -5343 -7489 -8747 -3155 -6725 -10124 -12502 -12700
879a2700J110P53j125j987K7K320K024n2j723k424j547j93l06j674K251M927J858
$$ -12700 -11590 -10837 -11962 -13949 -13922 -11602 -9578 -9630 -11353 -13777 -15324 -15517 -15823 -17497 -15246 -10319 -8461
862h461K252A058h338b545b22k284A418J2048F704b45p282m060R26J766l3j542
$$ -8461 -6209 1058 -8338 -2545 -222 -2506 1418 13466 6704 -245 -7527 -11587 -10661 -8895 -8928 -10470
846a0470j001k507K512j04j88j630k773J975L73M683p03J422c899k669M22r83
$$ -10470 -11471 -13978 -11466 -11570 -11758 -13388 -16161 -14186 -13813 -9130 -9833 -8411 -3899 -6568 -6146 -7129
830g129l072M975b21m940D470e886A250h951G919L854P959J5507N3546L6016J28160
$$ -7129 -10201 -5226 -221 -5161 4470 -5886 1250 -8951 7919 11773 19732 35239 88785 124801 252961
815B52961A09620J940024Q399650P671205L764544k738502F246805A770321C35605
$$ 252961 109620 2049644 10449294 18120499 21885043 19146541 6246805 1770321 335605
805C52844C7765R6538E7583j6226j6502A0510c552k130j465A3072g999j815F995
$$ 352844 37765 134303 57583 41357 24855 10510 -3552 -5682 -7147 13072 -7999 -9814 6995
791G327n95c41E12J582f421B156R380D601b334F254M307D995gE497d976a138D70
$$ 7327 6732 -341 512 2094 -6421 2156 11536 4601 -2334 6254 10561 4995 -7 5497 -4976 -1138 470
773D723N432D866C28a270r881c625F368L964a87E52a0203A0314L745C499c514
$$ 4723 10155 4866 328 -1270 -11151 -3625 6368 10332 -187 552 -10203 10314 14059 3499 -3514
757f978j10D747d046p519M114B249Q785Q297r458c725J809G815J1682o948c944
$$ -6978 -7088 4747 -4046 -11565 -7451 2249 11034 19331 9873 -3725 -1916 7815 19497 12549 -3944
741i081k105m959J309K798L512K923K163J361n218g14I55oi446l105e255n462
$$ -9081 -11186 -16145 -14836 -12038 -8526 -5603 -3440 -2079 -7297 -714 955 949 -9446 -12551 -5255 -10717
725a0717n116p0J980q40k868J415O966a578D879A475P194l696e519p460l471O732
$$ -10717 -15833 -15903 -13923 -14763 -17631 -16216 -9250 -1578 4879 1475 8669 4973 -5519 -12979 -16450 -9718
709i718K173m219k105m858N017M930J11J233m404o037P150a778p34I601D326h908
$$ -9718 -7545 -11764 -13869 -18727 -13710 -8780 -8669 -7436 -11840 -17877 -10727 -1778 -2512 9601 4326 -8908
692d181J053l950p28J799K713e71n792C099n38b07p871m856n245M116K342M76
$$ -4181 -3128 -7078 -7806 -6007 -3294 -571 -6363 3099 2561 -207 -8078 -12934 -18179 -14063 -11721 -11245
676a1245J031L218b465C373c172h68q889B657L56e429q287l603K060j06j481K012
$$ -11245 -10214 -6996 -2465 3373 -3172 -868 -9757 2657 3013 -5429 -13716 -17319 -15259 -15365 -16846 -14834
660a4834N204M584k156b00H38J699a0118D903r39A619b313l489j758p35j377k231
$$ -14834 -9630 -5046 -7202 -200 838 2537 -10118 4903 3964 1619 -2313 -5802 -7560 -8295 -9672 -11903
644a1903j982J406L019L642a815o042K639b562A3293K774D733f881A2714m520
$$ -11903 -13885 -12479 -9460 -5818 -1815 -7857 -5218 -2562 13293 16067 4733 -6881 12714 8194
630H194H70a0805r179g377m0994k4920b6904i07r38B656e576D88a0926L917D990
$$ 8194 870 -10805 -19984 -7377 -48371 -73291 -26904 -907 -1845 2656 -5576 488 -10926 -7009 4990
614b349G40d726J386F212a116p863o60a207C842A25a2456N890c92F592j229k351
$$ -2349 740 -4726 -3340 6212 -1116 -8979 -9639 -1207 3842 125 -12456 -6566 -392 6592 5363 3012
598C012o10O0f16j1250q669P682N297J017k567l808J717N367g99b4k470l057R84
$$ 3012 2402 2462 -616 -11866 -20535 -12853 -7556 -6539 -9106 -12914 -11197 -5830 -799 -24 -2494 -5551 -4567
581d567K090g96J97B768J422b378o004L867B313p25h643P25A3939k612m706p9
$$ -4567 -2477 -796 -599 2768 4190 -2378 -8382 -4515 2313 1588 -8643 -7918 13939 11327 6621 6542
565F542B977e812m263n15q90K234J951j604j980j197J376L264L705A308d62A1015
$$ 6542 2977 -5812 -10075 -10590 -11480 -9246 -7295 -8899 -10879 -12076 -10700 -7436 -3731 1308 -462 11015
548F529j273j348d863I84a145n64l353k005A835g335m411o263r93O192e782i81
$$ 6529 5256 3908 -4863 984 -1145 -1709 -5062 -7067 1835 -7335 -11746 -18009 -19002 -12810 -5782 -981
531E133J235k327a205p262n354N11M801L529Q20j147j443k263k958j950M886A874
$$ 5133 6368 4041 -1205 -8467 -13821 -13310 -8509 -4980 -4160 -5307 -6750 -9013 -11971 -13921 -9035 1874
514C687b201J63B697a748O80A806e817a286r725L989a773l273q943K276b231o530
$$ 3687 -2201 -2038 2697 -1748 -1068 1806 -5817 -1286 -11011 -7022 -1773 -5046 -13989 -11713 -2231 -8761
498h761C487J279f302C736M384A05a931A666m85J134b420F27R52E23R294A125
$$ -8761 3487 4766 -6302 3736 8120 105 -1931 1666 1181 2315 -2420 627 1579 523 9817 1125
481c109o457j4580a1426f21A2832L528A82a1025H657C408i194j3137Q332b505
$$ -3109 -9566 -24146 -11426 -621 12832 16360 182 -11025 8657 3408 -9194 -22331 -13999 -2505
466E252K853D7N722B225a0232g66A374f769M16C419c809j16k838j76b032m998
$$ 5252 8105 47 5769 2225 -10232 -766 1374 -6769 -6353 3419 -3809 -3925 -6763 -6939 -2032 -7030
450g030C781J4159D298j562J0438J0468I501d130r680K232L233o00k118K170K86
$$ -7030 3781 17940 4298 2736 13174 23642 9501 -4130 -13810 -11578 -8345 -8945 -11063 -8893 -8607
435h607j726l549k678R72K143J670J289o897e105f58B947a1408D90N87e653j525
$$ -8607 -10333 -13882 -16560 -15588 -13445 -11775 -10486 -17383 -5105 -658 2947 -11408 490 1077 -5653 -7178
419g178P32m810l615o35K586L339K513K444O34j139k850l938n141m412N545N140
$$ -7178 -6446 -11256 -14871 -15506 -12920 -9581 -7068 -4624 -3990 -5129 -7979 -11917 -17058 -21470 -15925 -10785
403a0785c735l375J790K352n448M169m707l556p6K318P47K1j97J349K632b830
$$ -10785 -3735 -7110 -5320 -2968 -8416 -4247 -8954 -12510 -12586 -10268 -9521 -9500 -9697 -8348 -5716 -2830
386A10a1072M355c100J533C774b82B575A193e410A615f337E247J340A908b848
$$ 110 -11072 -6717 -3100 -1567 3774 -282 2575 1193 -5410 1615 -6337 5247 6587 1908 -2848
370G855J73l235J450A165a0948e274n123L01g62a25D998a584o631c991p375q697
$$ 7855 8028 4793 6243 1165 -10948 -5274 -10397 -10096 -762 -125 4998 -1584 -8215 -3991 -11366 -20063
354b0063J074Q627c905a099p88m047n336m580j524J769N033k783e463n514F129
$$ -20063 -18989 -10362 -3905 -1099 -1887 -5934 -11270 -15850 -17374 -15605 -10572 -13355 -5463 -10977 6129
338B542b42B601c98q563n477j827j269j604M300N993c670G40L057L166P2e037
$$ 2542 -242 2601 -398 -8961 -14438 -16265 -17534 -19138 -14838 -8845 -3670 740 3797 6963 7035 -5037
321i025J954b299G719J61l841g279k337c607C954d302q56m342m632l097M481d983
$$ -9025 -7071 -2299 7719 7880 4039 -7279 -9616 -3607 3954 -4302 -5158 -9500 -14132 -17229 -12748 -4983
304A936b414G21a1166k9529j2593J496a1716k933J288L393K874P29q15k117l62
$$ 1936 -2414 721 -11166 -40695 -53288 -51792 -11716 -14649 -13361 -9968 -7094 -6365 -7180 -9297 -9659
289i659K112L175b051j765P66P67D20e042m046d378A041d516p5o18C110c140a544
$$ -9659 -7547 -4372 -2051 -3816 -3050 -2283 420 -5042 -9088 -4378 1041 -4516 -4591 -5209 3110 -3140 -1544
271A008g784c352l648K506q11R94a588N52k278f75l021q641C292b029o238c579
$$ 1008 -7784 -3352 -7000 -4494 -5305 -4311 -1588 -1036 -3314 -675 -3696 -12337 3292 -2029 -8267 -3579
254A117K35f346n520k742j57K557M484L692E077m98O51k348c496n969j673J925
$$ 1117 1352 -6346 -11866 -14608 -14765 -12208 -7724 -4032 5077 4579 5230 2882 -3496 -9465 -11138 -9213
238i213A941b625m272j465c957B742b710F44a2710A757J274G20b383k298j558
$$ -9213 1941 -2625 -6897 -8362 -3957 2742 -2710 644 -12710 1757 3031 720 -2383 -4681 -6239
223f239k282k349N16e068J078B571K345B109a069d5n984J771A682b727D807e129
$$ -6239 -8521 -10870 -10354 -5068 -3990 2571 4916 2109 -1069 -45 -6029 -4258 1682 -2727 4807 -5129
206A666K17a485j346j571M61p28b45B19L49f370E041K579j397A247d545o468m986
$$ 1666 1883 -1485 -2831 -4402 -3941 -4669 -245 219 568 -6370 5041 7620 6223 1247 -4545 -11013 -15999
189a5999k196J719J618M74n39j851k339J093K996L315L089K639J786m737d200
$$ -15999 -18195 -16476 -14858 -14384 -14923 -16774 -19113 -18020 -15024 -11709 -8620 -5981 -4195 -8932 -4200
173e117J107j227B109K034J128J362k640a0552b811A316a77j298p639o746l012
$$ -5117 -4010 -5237 2109 4143 5271 6633 3993 -10552 -2811 1316 -177 -1475 -9114 -15860 -18872
158a8872O03L348P051c256i3o147J808G861j231a3159a71k999o062m545N419h50
$$ -18872 -18269 -14921 -7870 -3256 -93 -6240 -4432 7861 6630 -13159 -171 -3170 -9232 -13777 -8358 -850
141C075r16a656o500c959A578h99F384j16B624f822J69m123l722J92M808b820
$$ 3075 2159 -1656 -8156 -3959 1578 -899 6384 6268 2624 -6822 -6653 -10776 -14498 -14306 -9498 -2820
124D183O215J718l845c531M23B724N24j43c834q370q804N595N855L464O36j217
$$ 4183 10398 12116 8271 -3531 -3108 2724 3248 3105 -3834 -12204 -21008 -15413 -9558 -6094 -5458 -6675
108f675J072A81N657h358l902c484m204h42q196o603O447b630E181j092b073k961
$$ -6675 -5603 181 5838 -8358 -12260 -3484 -7688 -842 -9038 -15641 -9194 -2630 5181 4089 -2073 -5034
92e034a303r096A864O232K497F30a2581p409h414A171a186C773a089n552j3369
$$ -5034 -1303 -10399 1864 8096 10593 630 -12581 -19990 -8414 1171 -1186 3773 -1089 -6641 -20010
77b0010i344J150p51N77L499l34k663n6l249L121p7Q72M80D023H92a1241m52J481
$$ -20010 -9344 -8194 -8945 -8368 -4869 -5203 -7866 -7922 -11171 -8050 -8127 -7255 -6775 4023 892 -11241 -11693 -10212
59a0212d571F52L139g152K808J730n140n109m065k832l511k55O249P116c638C44
$$ -10212 -4571 652 3791 -7152 -4344 -2614 -7754 -12863 -16928 -19760 -23271 -23526 -17277 -10161 -3638 344
42A483e97l336j713k237L269a333A881b65o869p444m553j297k123k448L880Q171
$$ 1483 -597 -3933 -5646 -7883 -4614 -1333 1881 -265 -7134 -14578 -19131 -20428 -22551 -24999 -21119 -12948
26a2948M074h40A319J148J045c595F10L247M598f314l355C328A613g913c221B13
$$ -12948 -8874 -840 1319 2467 3512 -3595 610 3857 8455 -6314 -9669 3328 1613 -7913 -3221 213
9e713i56l464D397M13c904Q6j0135p892m011
$$ -5713 -956 -4420 4397 4810 -3904 -3818 -13953 -21845 -25856
0b5856
$$ -25856
##PAGE= F1=2362.097270492
##FIRST=     2906.91634943962, 2629.00904605264, -18269
##DATA TABLE= (F2++(Y..Y)), PROFILE
1023a8269P621c904h10C520j18O977A587a2036k0663j168J4833g869b752q7n235
$$ -18269 -10648 -3904 -810 3520 3402 10379 1587 -12036 -32699 -33867 -19034 -7869 -2752 -2839 -8074
1008h074r436j3231j2714R933J3565R001K161m002p711p877n336n074j167J2392
$$ -8074 -17510 -30741 -43455 -33522 -19957 -10956 -8795 -12797 -20508 -28385 -33721 -38795 -39962 -27570
994b7570a0003F674k713i021f25A769a3089j1811N840h033B254J652g677K777
$$ -27570 -10003 6674 3961 -9021 -625 1769 -13089 -24900 -19060 -8033 2254 3906 -7677 -4900
980d900j4032j105C55b019B996R800a664O31l284J17C176J29J551l38N35F79J84
$$ -4900 -18932 -20037 355 -2019 2996 12796 -1664 -1033 -4317 -4200 3176 3305 4856 4518 5053 679 863
963H63a2411k539a961I840l229B171K0056k548H315e571J116n522C961c5o421
$$ 863 -12411 -14950 -1961 9840 6611 2171 22227 19679 8315 -5571 -4455 -9977 3961 -35 -6456
948f456J344D032g721HN40g665L409i83G943L84b728D984B50a152E86a448n072
$$ -6456 -5112 4032 -7721 8 548 -7665 -4256 -983 7943 8327 -2728 4984 250 -1152 586 -1448 -6520
931f520j441c60A534d034k579N47o42P28n570p660j613a0003a324B227e942B88
$$ -6520 -7961 -360 1534 -4034 -6613 -6066 -6708 -5980 -11550 -19210 -20823 -10003 -1324 2227 -5942 288
914A6970b631k7495k6521b4029e896K259A460d330a525j2017k2132q530N494J759
$$ 16970 -2631 -30126 -56647 -24029 -5896 -3637 1460 -4330 -1525 -13542 -35674 -44204 -38710 -36951
900c6951m697j43J2361a4150N735d51p770J990J49J134j496J947J302J2l284k364
$$ -36951 -41648 -41791 -29430 -14150 -8415 -451 -8221 -6231 -6082 -4948 -6444 -4497 -3195 -3183 -6467 -8831
884h831A908N441d426a817o088h15e4p403c197m648j469m177m655n894o535R60
$$ -8831 1908 7349 -4426 -1817 -7905 -815 -54 -7457 -3197 -7845 -9314 -13491 -18146 -24040 -30575 -29615
868b9615j110j808k293p693k056J0635J2369N603N138K511m708J78r7q608k548
$$ -29615 -30725 -32533 -34826 -42519 -44575 -33940 -21571 -15968 -10830 -8319 -13027 -12849 -12946 -21554 -24102
853b4102o074l269Q272j152J1758e826l190C944A2a2301K181m479o60a091B239
$$ -24102 -30176 -33445 -25173 -26325 -14567 -5826 -9016 3944 12 -12301 -10120 -14599 -15259 -1091 2239
837a1639M196p727O682H818c612o03k446n0568K6063B536B39O515L037k146B808
$$ -11639 -7443 -15170 -8488 8818 -3612 -4215 -6661 -57229 -31166 2536 239 6754 9791 7645 2808
821B8360J6791r519Q6040L3402N5423K37916M56420K514465J4701201J16284723
$$ 28360 45151 35632 121672 155074 210497 448413 904833 3419298 18120499 134405222
811A34405222L5900630k4051761A2669234C746548A516923F44363j67092B21021
$$ 134405222 170305852 146254091 12669234 3746548 1516923 644363 477271 221021
802A06147E1477A568J8807c33A5194b5031A6545e920k73A0940J230m877I86j48
$$ 106147 51477 1568 20375 -333 15194 -25031 16545 -5920 -6193 10940 12170 7293 986 838
788H38J501b898H462i221m6517K647O100Q656J6596L879B824f838c177M15A532
$$ 838 2339 -2898 8462 -9221 -55738 -53091 -46991 -38335 -21739 -17860 2824 -6838 -3177 -2762 1532
772A0166j853C761g527j6882k3090P111J4400a1822B2d005F680O019F1g816c251
$$ 10166 8313 3761 -7527 -24409 -47499 -40388 -25988 -11822 22 -4005 6680 12699 61 -7816 -3251
756f745j2716l955L83Q39P586f175B790P226i10j349G496J2254G798g721o14K060
$$ -6745 -19461 -23416 -23033 -22194 -14608 -6175 2790 10016 -910 -2259 7496 19750 7798 -7721 -8335 -6275
740f275D767b362n31A125P086N678l853i171C59O906l624f398j809L868j9905
$$ -6275 4767 -2362 -2893 1125 8211 13889 10036 -9171 359 7265 3641 -6398 -8207 -4339 -24244
725b4244j8036j4607P542N181j596j320J2449a3016A134c5F944O5e402l219p71
$$ -24244 -42280 -56887 -49345 -44164 -45760 -47080 -34631 -13016 1134 -35 6944 7009 -5402 -8621 -9392
710i392k6054p208J7551a0745d271k503m496j4989j9669m335K2604h992a709D17
$$ -9392 -35446 -42654 -25103 -10745 -4271 -6774 -11270 -26259 -45928 -50263 -27659 -8992 -1709 417
695i60j1150r969n88Q988b358B76N954K605l711h703g88D339d117n657c931j5839
$$ -960 -12110 -22079 -22667 -13679 -2358 276 6230 8835 5124 -8703 -788 4339 -4117 -9774 -3931 -19770
679a9770j0253j67N679R119d207DR024b669O96o428b509A26d969R49C869R77J550
$$ -19770 -30023 -30190 -24511 -15392 -4207 4 9028 -2669 -1973 -8401 -2509 126 -4969 -4020 3869 4846 6396
662F396k954a0514j2824p253i114H768M272E126h670D673a5441l3358b2099b398
$$ 6396 3442 -10514 -23338 -30591 -9114 8768 13040 5126 -8670 4673 -15441 -48799 -22099 -2398
647B1195n164d16n120j7542k9912J9958h713c729k278j021m47A0287M313B333
$$ 21195 16031 -416 -5536 -23078 -52990 -33032 -8713 -3729 -6007 -7028 -7475 10287 14600 2333
632f652A090G0d665j0393j5794j5868o611l3326c5391J6946L297g301J646J136
$$ -6652 1090 70 -4665 -15058 -30852 -46720 -53331 -86657 -35391 -18445 -15148 -7301 -5655 -4519
618d519q613c959a030j0736o218R66N367N128c081p053j534j2990j4963p29J6525
$$ -4519 -13132 -3959 -1030 -11766 -17984 -17018 -11651 -6523 -3081 -10134 -11668 -24658 -39621 -40350 -23825
603b3825g615a704E688K807l853c674J498R03j0975o034L481g330b040q29p337
$$ -23825 -7615 -1704 5688 8495 4642 -3674 -2176 -1273 -12248 -18282 -14801 -7330 -2040 -2869 -10206
588a0206j0833m133J0909G71J0924L166C26a740j2429q493J673O307L781k627
$$ -10206 -21039 -25172 -14263 771 11695 14861 326 -1740 -14169 -22662 -20989 -14682 -10901 -13528
574a3528q390j2113j2494o202N786L720L230O639Q585Q896P801j867q05l282f917
$$ -13528 -21918 -34031 -46525 -52727 -46941 -43221 -39991 -33352 -24767 -15871 -8070 -9937 -10742 -14024 -6917
558B141d58k592J308A792N44M641F2b340A0756C416J25I60c405C898b055L16q12
$$ 2141 -458 -3050 -1742 1792 2336 6977 62 -2340 10756 3416 3541 960 -3405 3898 -2055 -1739 -2551
541b551o715c56o232j3633m516N4l86j473k126k117l009m221n064m635J170N713
$$ -2551 -9266 -356 -6588 -20221 -24737 -24683 -25069 -26542 -28668 -30785 -33794 -38015 -43079 -47714 -46544 -40831
525d0831O582M574J151k575n230p538l156R514J3201h829B698e795r52f02l618
$$ -40831 -34249 -29675 -28524 -31099 -36329 -43867 -47023 -37509 -24308 -8829 2698 -5795 -6747 -602 -4220
510d220J765D74e677C00i196o6K560p076j3909j4267J3137a3015F342l75c757
$$ -4220 -2455 474 -5677 300 -9196 -9262 -6702 -13778 -27687 -41954 -28817 -13015 6342 5967 -3757
494C636L064B186e678a792A62M28b798Q02A187A44J1775A237a790C35a6234j0793
$$ 3636 6700 2186 -5678 -1792 162 590 -2798 -1996 1187 144 11919 1237 -1790 335 -16234 -27027
478b7027l919k097m982q735K989J4172J2410Q046K467j826l314j560N56J164J660
$$ -27027 -30946 -33043 -38025 -46760 -43771 -29599 -17189 -9143 -6676 -8502 -11816 -13376 -12820 -11656 -9996
463i996L684n07D549J040d269j925E899H31c500B422d424l316k564I071J7502
$$ -9996 -6312 -6819 4549 5589 -4269 -6194 5899 831 -3500 2422 -4424 -7740 -10304 9071 26573
448B6573A2435n464J1817N519E834h723k615k118N160f03l878f75l437n127m030
$$ 26573 12435 6971 18788 24307 5834 -8723 -11338 -13456 -8296 -603 -4481 -675 -4112 -9239 -13269
433a3269p204r916j0415p878k642J0001J6284d973G0i160K454j43J931K088i32
$$ -13269 -20473 -30389 -40804 -48682 -51324 -41323 -25039 -4973 70 -9160 -6706 -6849 -4918 -2830 -932
417b630D186M219d004m803i69l333j139J681k297m980J339i97m876m893c534k756
$$ -2630 4186 8405 -4004 -8807 -969 -4302 -5441 -3760 -6057 -11037 -9698 -997 -5873 -10766 -3534 -6290
401f290R63Q96l315m528j6889p511P926P285m25n900o314K856J0210R922d823
$$ -6290 -5327 -4431 -7746 -12274 -29163 -36674 -28748 -21463 -21888 -27788 -34102 -31246 -21036 -11114 -4823
385d884m68m691o148p064o069j148O612R854d356p249D473j065A62c428B939L545
$$ -4884 -5352 -10043 -16191 -23255 -29324 -30472 -23860 -14006 -4356 -11605 4473 3408 162 -3428 2939 6484
369F484N97O086i768j0298Q712M595n370E12g81B616f572e04I518b8p171R22j220
$$ 6484 7081 13167 -9768 -20066 -11354 -6759 -12129 512 -781 2616 -6572 -504 9518 -28 -7199 -6277 -7497
352g497b331B255J541a91p791m200g1F508b25p813L298q507B557a156l396A749
$$ -7497 -2331 2255 3796 -191 -7982 -12182 -71 6508 -225 -8038 -4740 -13247 2557 -1156 -4552 1749
335a1605j1443p231L13Q127a0679b419m945f7F935M523J0323j0113d890k174k765
$$ -11605 -23048 -30279 -29966 -21839 -10679 -2419 -7364 -67 6935 11458 21781 11668 -4890 -7064 -9829
320i829A319J1160P02F141h286n233k2153o204K0936c176C785j826e585j7294
$$ -9829 1319 12479 13181 6141 -8286 -13519 -35672 -41876 -20940 -3176 3785 1959 -5585 -22879
306b2879j6840L977J3436Q779j6390k8371j1426K1714b2888a0793K588P73A147
$$ -22879 -39719 -35742 -22306 -13527 -29917 -58288 -69714 -48000 -22888 -10793 -8205 -7432 1147
292h855k1166j7764a9677C728j291b774k002B718C77g915r33l790d393B041e477
$$ -8855 -30021 -47785 -19677 3728 2437 -2774 -4776 2718 377 -7915 -8848 -12638 -4393 2041 -5477
276g57n673b43l956J721g87q531L791M81A434h555j4932m349L325J0333a779j136
$$ -757 -6430 -243 -4199 -2478 -787 -9318 -5527 -5046 1434 -8555 -23487 -27836 -24511 -14178 -1779 -2915
260b915o828C203b081n666L57B983N664P93D409a332q392C746N250c825H903k508
$$ -2915 -9743 3203 -2081 -7747 -7390 2983 8647 9440 4409 -1332 -9724 3746 8996 -3825 8903 6395
244F395j907G97h592o061K602N315J045q763p888o594l417P89M792P914Q195c773
$$ 6395 4488 797 -8592 -14653 -12051 -6736 -5691 -14454 -22342 -28936 -32353 -31564 -26772 -18858 -10663 -3773
227c29H61a501l513n10a495G069N915b927O55b30A3512n840a6229k0831N565J4263
$$ -329 861 -1501 -5014 -5524 -1495 7069 12984 -2927 -2272 -230 13512 7672 -16229 -37060 -31495 -17232
211a7232N656n206j4643j6937J5235a2911a182j003k021m159j2803n819K595J845
$$ -17232 -11576 -16782 -31425 -48362 -33127 -12911 -1182 -2185 -4206 -8365 -21168 -26987 -24392 -22547
197b2547n116j1703m576J5303J3623O957j073o691j0356p287K239O693N915L977
$$ -22547 -27663 -39366 -43942 -28639 -15016 -8059 -9132 -15823 -26179 -33466 -31227 -24534 -18619 -14642
183a4642L122j151d932a129r24J42g82n243j079e65k232q132p216n194q80M481
$$ -14642 -11520 -12671 -4932 -1129 -2053 -1911 -782 -6025 -7104 -565 -2797 -10929 -18145 -23339 -24219 -19738
167a9738P941j270d674b25j417n851J697G309J3732J993A1447B727c930d36q088
$$ -19738 -11797 -13067 -4674 -225 -1642 -7493 -5796 7309 21041 23034 11447 2727 -3930 -436 -8524
152h524j4767j0755O037a2080b146G026k208d246B698a2162k0519L336J4471O908
$$ -8524 -23291 -34046 -28009 -12080 -2146 7026 4818 -4246 2698 -12162 -32681 -29345 -14874 -7966
138g966J460n387o589l929j026r84l46L315J0105b730o30B495L085K086M570B579
$$ -7966 -6506 -11893 -18482 -22411 -23437 -24421 -24767 -21452 -11347 -2730 -3360 2495 5580 7666 12236 2579
121d606l310o3J111O19Q48o50a875A301g652m364d548g05E15K621N258J366a63
$$ -4606 -7916 -7979 -6868 -6249 -5401 -6051 -1875 1301 -7652 -12016 -4548 -705 515 3136 8394 9760 -163
103a4620d142j874B46K145d450k9696j5222a8184A289d285k420j0434N636C308
$$ -14620 -4142 -6016 246 2391 -4450 -34146 -49368 -18184 1289 -4285 -6705 -17139 -11503 3308
88I523O136j019o753c636Q23E876c30B550J1671A337a4489J917A696M054i775
$$ 9523 15659 14640 7887 -3636 -2813 5876 -330 2550 14221 1337 -14489 -12572 1696 5750 -9775
72b028p189j4508j6596l929N590M680J733M33Q37K087J814J365K816Q677C07L569
$$ -2028 -9217 -23725 -40321 -44250 -38660 -33980 -32247 -31814 -30977 -28890 -27076 -25711 -22895 -14218 307 3876
56C876c41k557i18E682a557j6531r260J239J0463f084J906C376O598P675l394
$$ 3876 -341 -2898 -918 5682 -1557 -18088 -27348 -26109 -15646 -6084 -4178 3376 9974 17649 14255
41A4255F094a27r562c998a062p08I393a880p997k3930k2692j0314J3787J2761
$$ 14255 6094 -127 -9689 -3998 -1062 -1770 9393 -1880 -9877 -33807 -56499 -66813 -53026 -40265
27d0265J4023i800a73C795j031R43e260a98F277Q130c925m694A772j86f545j8068
$$ -40265 -26242 -9800 -173 3795 2764 3707 -5260 -198 6277 14407 -3925 -8619 1772 1586 -6545 -24613
11b4613l5601J9354a1904a179C615A728h496j4739j3247r415l671
$$ -24613 -60214 -40860 -11904 -1179 3615 1728 -8496 -23235 -36482 -45897 -49568
0d9568
$$ -49568
##PAGE= F1=2359.527369176
##FIRST=     2906.91634943962, 2629.00904605264, -9250
##DATA TABLE= (F2++(Y..Y)), PROFILE
1023i250H00e329F90L880qL344b82j5875l2966r917K1399J6650P566j183r667
$$ -9250 800 -5329 690 4570 4562 7906 -282 -16157 -49123 -59040 -37641 -20991 -13425 -14608 -24275
1008b4275j6554k2075o620K3298J7974R949P87n332o598m621l135m567j353J1812
$$ -24275 -40829 -62904 -69524 -46226 -28252 -18303 -17516 -22848 -29446 -34067 -37202 -41769 -43122 -31310
994c1310a0674I136j023f512A196a6228k1610j149a7445e016B480J041e380j6233
$$ -31310 -10674 9136 8113 -6512 1196 -16228 -37838 -38987 -17445 -5016 2480 3521 -5380 -21613
980b1613l4489N120g646C346c115F947c811j430kq903a351A652F60K231N751C834
$$ -21613 -56102 -50982 -7646 3346 -3115 6947 -3811 -5241 -5243 -14146 -1351 1652 660 2891 8642 3834
963a145k2839o186f51A0376k260k081J5150k693G753d352F07i011C490R75e161
$$ -1145 -23984 -30170 -651 10376 8116 6035 21185 18492 7753 -4352 607 -9011 3490 4465 -5161
947D48P623a2900K513k559J988d956J669C655P607b194B232d768J066C73i17o830
$$ 448 8071 -12900 -10387 -12946 -10958 -4956 -3287 3655 11262 -2194 2232 -4768 -3702 373 -917 -7747
931g747O52F59d296j1382o4e781a603E252f565k4653k8223j194K8187g003J91
$$ -7747 -7095 659 -4296 -15678 -15742 -5781 -1603 5252 -6565 -31218 -59441 -60635 -32448 -7003 -6812
916f812a868q553l2236m3430K3639a2699M578L990a351l474l319H08c3226k4910
$$ -6812 -1868 -10421 -42657 -86087 -62448 -12699 -8121 -4131 -1351 -4825 -8144 808 -33226 -58136
902e8136o861j129q957j6927P600K5338K4009a5413P022c117J454p11k900o05
$$ -58136 -64997 -66126 -75083 -92010 -84410 -59072 -35063 -15413 -8391 -3117 -1663 -2374 -5274 -5879
888e879K733f34l256m124C30N690f075K911l258A946q3g729C856L175B779a0751
$$ -5879 -3146 -634 -3890 -8014 330 6020 -6075 -3164 -6422 1946 1863 -7729 3856 7031 2779 -10751
871b4276j4151j0911Q023M833K381m0j1029o239J2507J7045O201M231l032j7607
$$ -24276 -38427 -49338 -41315 -36482 -34101 -34141 -45170 -51409 -38902 -21857 -15656 -11425 -14457 -32064
857c2064j1361q873k0776J4433J2830K2484c790m748E202F22a1475A026N68a0752
$$ -32064 -43425 -52298 -73074 -58641 -45811 -23327 -3790 -8538 5202 622 -11475 1026 1594 -10752
842e181j8013r791e61k0056l0604K0345l9219a2742H614a645l360k719p7242M2098
$$ -5181 -23194 -32985 -561 -20617 -51221 -30876 -70095 -12742 8614 -1645 -5005 -7724 -84966 -42868
828d2868B398i25E569l17N492k61J9546K0147l855P6069Q2026N0247K98884M58100
$$ -42868 2398 -925 5569 5252 10744 10483 30029 50176 46321 122390 204416 254663 553547 1011647
814A011647K967085J7906311J48420809J46524468j25825009A7350429E176691
$$ 1011647 3978732 21885043 170305852 316830320 191005311 17350429 5176691
806B130125H28572k79982k73637A22652E1918C031K4103C127J0603i175A8394
$$ 2130125 828572 548590 274953 122652 51918 3031 27134 3127 13730 -9175 18394
794c281k2016Q910A4930F984b9131G06J480e940A1946a9170p437M976l6404K1570
$$ -3281 -25297 -16387 14930 6984 -29131 706 2186 -5940 11946 -19170 -26607 -21631 -58035 -36465
780c6465B243g823@h926L271j113b640H370J092m062a8349j8215l3423j1714J6342
$$ -36465 2243 -7823 0 -8926 -5655 -6768 -2640 8370 9462 5400 -18349 -36564 -69987 -81701 -65359
765f5359K1085a8249M194q31L022o475j0173p901j6582j2509O731J2806O676J1955
$$ -65359 -44274 -18249 -14055 -14886 -11864 -18339 -28512 -36413 -52995 -65504 -58773 -45967 -39291 -27336
751b7336Q776M657e334a854CO497P424D149a0753K643l638G349a608j388A312
$$ -27336 -18560 -13903 -5334 -1854 3 6500 13924 4149 -10753 -8110 -11748 7349 -1608 -2996 1312
735I001L636C752h609A543Q740l419b106h88B24b3174k7611k5846j4434J1253
$$ 9001 12637 3752 -8609 1543 10283 6864 -2106 -888 224 -23174 -50785 -76631 -91065 -79812
721g9812N804o82Q521K9410c740R19C600j743d781n326J972m4234k9915L5377
$$ -79812 -74008 -74690 -66169 -36759 -3740 -2821 3600 1857 -4781 -10107 -8135 -52369 -82284 -46907
707d6907a2358F1c93l434j4400l5951k3835L0464a3416e134D041f7j5359n480
$$ -46907 -12358 61 -393 -3827 -18227 -54178 -78013 -47549 -13416 -5134 4041 -67 -15426 -20906
693b0906i952P82C65K39Q533L106C624g271L586G65a0967L296K998l926j3096
$$ -20906 -9952 -9170 365 604 9137 12243 3624 -7271 -3685 765 -10967 -7671 -4673 -8599 -21695
678b1695m416K409P836b481B19N661b762L71l267m081c809J392M45C543L864K890
$$ -21695 -26111 -23702 -15866 -2481 219 5880 -2762 -2391 -5658 -9739 -3809 -2417 -1972 3543 7407 10297
662A0297D949g381l6505j2180a2089G139O335F467f761B651a145l9782J3573d19
$$ 10297 4949 -7381 -43886 -56066 -12089 7139 13474 6467 -6761 2651 -1145 -40927 -27354 -419
647A8025k119E695c061j1972m4700l2959M0205a9647d087o094j826E450i252j6037
$$ 18025 15906 5695 -3061 -15033 -59733 -92692 -52487 -19647 -4087 -10181 -12007 5450 -9252 -25289
633b5289m524R155h147a291l017j3981k1757k3333l6994K7500J1099J4465J7871
$$ -25289 -29813 -20658 -8147 -1291 -4308 -18289 -40046 -63379 -100373 -72873 -61774 -47309 -29438
620b9438a1875K309l683k229k2579k6662j4555J7007J9542J2505M069p039j6999
$$ -29438 -11875 -9566 -13249 -15478 -38057 -64719 -79274 -62267 -42725 -30220 -26151 -33190 -50189
607e0189j6932J0800b7447a1428c998J288D444j270e768q767r457r751p518M87
$$ -50189 -67121 -56321 -27447 -11428 -3998 -2710 4444 3174 -5768 -14535 -23992 -33743 -41261 -40774
593d0774J2371h015b245j176A558d305l0762k9075b5688A0220J20E78b031o51
$$ -40774 -28403 -8015 -2245 -3421 1558 -4305 -35067 -64142 -25688 10220 10340 578 -2031 -2682
579b682k878b758C61c459o383J165L464k0825j5900q346n331m683M660J7852a4868
$$ -2682 -5560 -2758 361 -3459 -9842 -8677 -5213 -26038 -41938 -50284 -55615 -60298 -55638 -37786 -14868
563e361k404J016l465M579A447O992b07k559A676EK019a090k738D628a594A066
$$ -5361 -7765 -6749 -10214 -5635 1447 8439 -207 -2766 1676 5 2024 -1090 -3828 4628 -1594 1066
546b891a223F375b835J384d36q024D91a647j6398l368M730O663d119a246j945
$$ -2891 -1223 6375 -2835 -1451 -436 -8460 491 -1647 -18045 -21413 -16683 -10020 -4119 -1246 -3191
531c191r063j6973k4293l0050J1055L0020a8801e814m9j2951k2969k8539M463
$$ -3191 -12254 -29227 -53520 -83570 -72515 -42495 -18801 -5814 -5863 -18814 -41783 -70322 -65859
518f5859b8895G803J3709A453h869m302d035l305b864B64e134k4813k2502M277
$$ -65859 -28895 7803 21512 1453 -8869 -13171 -4035 -7340 -2864 264 -5134 -29947 -52449 -48172
504d8172Q930o9q692j0606M959K1807g212F988i02A633L558o74c461k779l10K647
$$ -48172 -39242 -39311 -48003 -58609 -53650 -31843 -7212 6988 -902 1633 5191 4517 -3461 -6240 -6550 -3903
488c903j217J35E90g69A3144A281a825j6793j1109l362n81k861l014N181J6253
$$ -3903 -5120 -4985 590 -769 13144 1281 -1825 -18618 -29727 -33089 -33670 -36531 -39545 -34364 -18111
473a8111f01C899K903l370d940j9041j3332k240O485J2098d164a691D187K520
$$ -18111 -601 3899 6802 3432 -4940 -23981 -37313 -39553 -33068 -20970 -4164 -1691 4187 6707
459F707b701l872E030J22c624J513B98i956J705A3086J8807B750a5962a02B4738
$$ 6707 -2701 -6573 5030 5152 -3624 -2111 298 -9956 -8251 13086 31893 2750 -15962 -102 24738
443C001a0729J580l967e264E042A580J04d44l138n503n758j0371j6008j3957q487
$$ 3001 -10729 -9149 -13116 -5264 5042 1580 1684 -444 -3582 -9085 -14843 -25214 -41222 -55179 -63666
428f3666K278J6292a9592c089m101n678J865c363B158P45C75L509N693a498p085
$$ -63666 -61388 -45096 -19592 -3089 -7190 -12868 -11003 -3363 2158 2903 375 3884 9577 -1498 -8583
413h583k948j1868q819j544O766J1006P113K159q396j4743j2825J90P743L166
$$ -8583 -11531 -23399 -32218 -33762 -26996 -15990 -8877 -6718 -15114 -29857 -42682 -42492 -34749 -31583
399c1583o768j2726m211J3475J5678P449n449j5975k2968k4149J3863J4608O082
$$ -31583 -38351 -51077 -55288 -41813 -26135 -18686 -24135 -40110 -63078 -87227 -73364 -58756 -52674
386e2674k134p845l571J0157J7381J8136d844F443a983A279i153c72j07j495j963
$$ -52674 -54808 -62653 -66224 -56067 -38686 -20550 -4844 6443 -1983 1279 -9153 -372 -479 -1974 -3937
371c937J545D499M539a0666l1905k6748l156R383L755K8L655J0365J6077i828
$$ -3937 -2392 4499 9038 -10666 -42571 -69319 -72475 -63092 -59337 -59309 -55654 -45289 -29212 -9828
356A1993I9g122rk917d293I25M268h7q175j669C981Q510m019B35a686m961C239
$$ 11993 99 -7122 -7131 -10048 -4293 925 5193 -87 -8262 -9931 3981 12491 8472 235 -1686 -6647 3239
338a746o121b30k1036k9628j8188J7062K5846c132A0a3526J978B74P426J1303
$$ -1746 -7867 -230 -21266 -50894 -69082 -52020 -26174 -3132 10 -13526 -11548 274 7700 19003
324A9003o489a2550j4687R033b61A2265J531A949b0584k6944r354K3611f068A0822
$$ 19003 12514 -12550 -27237 -18204 -261 12265 13796 1949 -20584 -47528 -56882 -33271 -6068 10822
309G342A713b9595l9349Q174b4217h463o238k7460j583n257J9959a2254M368l819
$$ 7342 1713 -29595 -68944 -60770 -24217 -8463 -14701 -42161 -43744 -49001 -29042 -12254 -7886 -11705
295a1705e194D05b0060l6973j011a6209D053A62b319j465h51k0155j9729N907
$$ -11705 -5194 405 -20060 -57033 -58044 -16209 4053 162 -2319 -3784 -851 -21006 -40735 -34828
281c4828a5228b657D909f375j2891j5111Q875c976J139p88m818n96M331D726a7693
$$ -34828 -15228 -2657 4909 -6375 -19266 -34377 -25502 -3976 -2837 -3625 -8443 -9039 -4708 4726 -17693
265d0177k1649k3921J3220L1060h910J330A428c525l823l156E386M806j08J560
$$ -40177 -61826 -85747 -72527 -41467 -8910 -7580 1428 -3525 -7348 -10504 5386 10192 10084 11644
251A1644C017g494E796O823d538I531l013B274a846j0077J893J916j3884j2312
$$ 11644 3017 -7494 5796 12619 -4538 9531 6518 2274 -1846 -11923 -10030 -8114 -21998 -34310
237c4310j1572j0572q773n779n048m622P805K0157K4025f824E140O391K357J552
$$ -34310 -45882 -56454 -65227 -71006 -76054 -80676 -72871 -52714 -28689 -6824 5140 11531 13888 15440
223A5440K117r23o068f549I35c340H842A44b9864l3832k3440K3719J8010M024
$$ 15440 17557 16634 10566 -6549 935 -3340 8842 144 -29864 -63696 -87136 -63417 -45407 -41383
209d1383j1382k2069L608L4304e798Af139K375k6884k2795oJ0895K086p815m744
$$ -41383 -52765 -74834 -71226 -36922 -5798 1 -6139 -3764 -30648 -53443 -53449 -42554 -40468 -48283 -53027
194e3027J1846J9208i251R99r572j4809r996L084J1744J3226c264J68n822I583
$$ -53027 -41181 -21973 -9251 -8252 -17824 -32633 -42629 -39545 -27801 -14575 -3264 -3096 -8918 9583
179G572c211p09B2d346o119M281a074j9415k2165j6203o401L897R465J0328P134
$$ 7572 -3211 -3920 22 -4346 -10465 -6184 -1074 -20489 -42654 -58857 -65258 -61361 -51896 -41568 -34434
164c4434J291l122K095a5340H053Q660q75o083B301d531a842o654n761k7915p098
$$ -34434 -33143 -36265 -34170 -15340 8053 16713 15838 9755 2301 -4531 -1842 -8496 -14257 -42172 -49270
149d9270b1017e107D628A960f030a414D880a4580L562F612e072j593K101Q76D822
$$ -49270 -21017 -5107 4628 1960 -6030 -1414 4880 -14580 -11018 6612 -5072 -6665 -4564 -3688 4822
133d02p808j1746j1210L742f642F23K330L305q67f45k7310k0611p433L385Q171
$$ -402 -8210 -19956 -31166 -27424 -6642 623 2953 6258 5391 -645 -27955 -48566 -55999 -52614 -44443
118d4443J1111J4913R005a068a16j3579l72M428b437A005M519N539J153m628i184
$$ -44443 -33332 -18419 -9414 -1068 -116 -13695 -14067 -9639 -2437 1005 5524 11063 12216 7588 -9184
102f132J977A570k46h940n2629k8531c6578A79g549B600a2875L127E336M606N881
$$ -6132 -4155 1570 1324 -8940 -61569 -90100 -36578 179 -7549 2600 -12875 -9748 5336 9942 15823
87A5823J694o541a670Q06E227A297b6H242B551a0971j2023Q796A93a2756K206
$$ 15823 17517 10976 -1670 -864 5227 1297 -26 8242 2551 -10971 -22994 -14198 193 -12756 -10550
72a0550k8541l6383j1795L1787K6890a3405J798n401j1894j1482p651k484L095
$$ -10550 -39091 -75474 -87269 -55482 -28592 -13405 -11607 -17008 -28902 -40384 -48035 -50519 -47424
59d7424J2773a1113B119M291H01b663c88D043L856c237k751k18m838b461B483
$$ -47424 -34651 -11113 2119 6410 801 -2663 -388 4043 7899 -3237 -5988 -6206 -11044 -2461 2483
43H153Q238j90p415C470a0097c123B191a908H447a078k9832l4371k7563O821J6350
$$ 8153 16391 16201 8786 3470 -10097 -3123 2191 -1908 8447 -1078 -30910 -65281 -92844 -86023 -69673
28f9673J0471J0511J8518d957E750k286R12d002a569H272P567A938f114g56E13
$$ -69673 -59202 -48691 -30173 -4957 5750 3464 4376 -4002 -1569 8272 15839 1938 -6114 -756 513
12f049l3057l4985J1849K9608a2386e623m943j2446j5620j3202o364J312
$$ -6049 -39106 -74091 -62242 -32634 -12386 -5623 -10566 -23012 -38632 -51834 -58198 -56886
0e6886
$$ -56886
##PAGE= F1=2356.957467861
##FIRST=     2906.91634943962, 2629.00904605264, -1478
##DATA TABLE= (F2++(Y..Y)), PROFILE
1023a478A619d226A758K970j293q85c875r355j1267M291Q552M433j801p520j3063
$$ -1478 1619 -4226 1758 4728 3435 2550 -3875 -13230 -24497 -20206 -11654 -7221 -9022 -16542 -29605
1008b9605j5896K863J8419g343j827a388G275a1313d883n413l299l423l835j198
$$ -29605 -45501 -42638 -24219 -7343 -9170 -1388 7275 -11313 -4883 -10296 -13595 -17018 -20853 -22051
994b2051L740O822M423j505q538j3313r504Q599a4915b164B466J144c694j5194
$$ -22051 -18311 -11489 -7066 -8571 -17109 -30422 -39926 -31327 -14915 -2164 2466 3610 -3694 -18888
980a8888k2102j0359b0956F989I38N352b815p403K228E08a5582I30c088a047H414
$$ -18888 -40990 -51349 -20956 6989 938 6290 -2815 -10218 -7990 508 -15582 930 -3088 -1047 8414
964D407c531k269j0591d030A0618j847M40R063k445E675d540C751c747a03E704
$$ 4407 -3531 -5800 -16391 -4030 10618 8771 9211 18274 15829 5675 -4540 3751 -3747 -103 5704
948d758D606O538a5600e410q26m089I49d725d34A3711a212n77m952J993B03O63
$$ -4758 4606 11144 -15600 -5410 -6236 -10325 949 -4725 -434 13711 -1212 -1789 -6741 -4748 203 866
932H66d804J914p976o995k390M300O273L192k166q699j5095j8642l743J8131J4230
$$ 866 -4804 -2890 -10866 -17861 -20251 -15951 -9678 -6486 -8652 -17351 -32446 -51088 -54831 -36700 -22470
917b2470P522J27q173j5390j2472J6963g406q87K923R1b022r022h0A129g035r581
$$ -22470 -14948 -14821 -22994 -38384 -50856 -33893 -7406 -8293 -5370 -5279 -2022 -11044 -80 1129 -7035 -16616
901a6616p605p425n963l868K822Q600Q723R448a009A521f1m313m084K115A758
$$ -16616 -24221 -31646 -37609 -41477 -38655 -30055 -21332 -11884 -1009 1521 -61 -4374 -8458 -6343 1758
885D4f188e57D945g079L406k223C270j212g537C645N697m218b766j4434j3104
$$ 44 -6188 -557 4945 -7079 -3673 -5896 3270 2058 -7537 3645 9342 5124 -2766 -17200 -30304
870c0304l743J3043R200L934l459N121k79B597I27a0272J661L125m457j3283j0910
$$ -30304 -34047 -21004 -11804 -7870 -11329 -6208 -6487 2597 927 -10272 -8611 -5486 -9943 -23226 -34136
855c4136k1485M642J4426a6846a853l46H786A159g311c138h57r752e204k0830
$$ -34136 -55621 -50979 -36553 -16846 -1853 -2199 8786 1159 -7311 -3138 -857 -10609 -5204 -26034
841b6034j7926N646j9635K5859a3518N329E541J349G22h294j409l1781R852e47
$$ -26034 -43960 -38314 -57949 -32090 -13518 -8189 5541 6890 722 -8294 -9703 -41484 -31632 -547
826c122D521b31A1923l336J9813E904M3872N2466J09015K9892K57541L20331K518836
$$ -3122 4521 -231 11923 8587 28400 5904 49776 102242 211257 241149 498690 819021 3337857
813C337857J5808684J27107550M4751220j1170442A7237423E115803B123075G69370
$$ 3337857 19146541 146254091 191005311 179834869 17237423 5115803 2123075 769370
804D71296k02262A23581D2217A3594J6300F856M26a1841A9023h19m0986J8305
$$ 471296 269034 123581 42217 13594 29894 6856 7282 -11841 19023 -819 -41805 -23500
792b3500A5034F301b5505a0837l930k5726B583i882F126a847j0893d399B76K310
$$ -23500 15034 6301 -25505 -10837 -14767 -40493 2583 -9882 6126 -1847 -12740 -4399 276 2586
778B586a149p210r750L7h358J06D410a253j7182j1797j8294r200J1156J9816a0820
$$ 2586 -1149 -8359 -18109 -18072 -8358 -8252 4410 -1253 -18435 -30232 -48526 -57726 -46570 -26754 -10820
762h530l67k626r933j0592j0276j5633r87R245P850p06L249P317P569R872N412
$$ -8530 -8897 -11523 -21456 -32048 -42324 -57957 -58944 -49699 -41849 -42555 -39306 -31989 -24420 -14548 -9136
747i136L839A633M914B517a0837K690q58A0574a954O29B867M927j109d303j297
$$ -9136 -5297 1633 6547 2517 -10837 -8147 -9005 10574 -1954 -1325 2867 7794 6685 -4303 -5600
732e600B024R520j907A955K834j192h607j4298j5562j4288j25P873O775Q643J4584
$$ -5600 2024 11544 9637 1955 4789 3597 -8607 -22905 -38467 -52755 -52880 -45007 -38232 -29589 -15005
717a5005O477J873e07j934a124o703j0910l0820J74b0901b917D044N22C91M35
$$ -15005 -8528 -6655 -507 -2441 -1124 -7827 -18737 -49557 -49383 -20901 -2917 4044 4566 391 826
702H26a3343k0279J263a5109P190A696b592m799J369J46m565a34G2J0726L982
$$ 826 -13343 -33622 -32359 -15109 -7919 1696 -2592 -7391 -6022 -5876 -10441 -134 72 10798 14780
687A4780A375c728b06C759h274J478O81K105O53h49I055l927L98a248I92c013
$$ 14780 1375 -3728 -206 3759 -8274 -6796 -6115 -4010 -3357 -849 9055 5128 5526 -1248 992 -3013
670b635M72n877L259A078C89L366N219L614n205a3995k6123Q488a3505G163O842
$$ -2635 -2163 -8040 -4781 1078 389 3755 8974 12588 7383 -13995 -40118 -31630 -13505 7163 14005
655A4005F953f574A616P023b70j2825a512A2170K891l856A155c324j8927k3723
$$ 14005 6953 -6574 1616 8639 -270 -13095 -1512 12170 15061 11205 1155 -3324 -22251 -45974
641d5974j1078J6710J5047R382J829m987j1216j1564M44J4095a2762c235K03k556
$$ -45974 -57052 -40342 -25295 -15913 -14084 -19071 -30287 -41851 -41407 -27312 -12762 -3235 -3032 -5588
627e588j0212j4689o2971K4515c2760J1453i925M592l712l710n376j9979k1693
$$ -5588 -15800 -30489 -93460 -68945 -32760 -21307 -9925 -5333 -9045 -12755 -18131 -38110 -59803
614e9803J0739J5455J0447M221j960j0654j9735r10b0988G229i586h44k394B805
$$ -59803 -49064 -33609 -23162 -18941 -20901 -31555 -51290 -52200 -20988 7229 -9586 -844 -3238 2805
599A6963D375i842j2179q559k837N492a3153O157A352b68E222b814l212l8130
$$ 16963 4375 -9842 -22021 -30580 -33417 -27925 -13153 -6996 1352 -268 5222 -2814 -6026 -44156
585d4156a6333B580P94j576c029P58n143n28b864R6n049k011L530b322j4593j1391
$$ -44156 -16333 2580 3374 1798 -3029 -2271 -7414 -7942 -2864 -2768 -7817 -9828 -6298 -2322 -16915 -28306
569b8306j0163r624O718b0513B214d508j957c141j528q94a28D269d402J436A371
$$ -28306 -38469 -48093 -41375 -20513 2214 -4508 -6465 -3141 -4669 -5563 -128 4269 -4402 -2966 1371
553a765j624f20k705l862j5900n445Q082d271F836d216a452A435d866C642P28
$$ -1765 -3389 -620 -3325 -7187 -23087 -28532 -20450 -4271 6836 -4216 -1452 1435 -4866 3642 4370
538D370E44d954q82b867B388M023k614K185b971j6766k2691r579K4544e783l617
$$ 4370 544 -4954 -5836 -2867 2388 6411 3797 5982 -2971 -19737 -42428 -52007 -27463 -5783 -9400
523i400I952A405a3157j4511M712d13B0168n56c85q078J890K649o658a177A695
$$ -9400 9952 1405 -13157 -27668 -22956 -413 20168 19612 -385 -8463 -6573 -3924 -10582 -1177 1695
507a9524k0954j2709L573K088j286J542Q358J2508a2380G74P591A159a282D736
$$ -19524 -40478 -53187 -49614 -47526 -48812 -47270 -38912 -26404 -12380 774 8365 1159 -1282 4736
492E807d01j0857n089N747J601K3F9b631a201j3307r708k84P901h085b202f81
$$ 5807 -401 -11258 -16347 -10600 -8999 -8976 69 -2631 -1201 -14508 -24216 -24500 -16599 -8085 -2202 -681
475a115n005A1201d28k776C118H75c93H35a0962q311k910N248d209D573A571M724
$$ -1115 -6120 11201 -428 -3204 3118 875 -393 835 -10962 -19273 -22183 -16935 -4209 4573 1571 6295
459F295b528n340A734l50a145n002E509A37b446A4745R952A999a0892c300A6608
$$ 6295 -2528 -7868 1734 1384 -1145 -6147 5509 137 -2446 14745 24697 1999 -10892 -3300 16608
443A475h800N73k044h49I991l351b263m529e89j4343M473Q27p602j1167o869j4
$$ 1475 -8800 -8227 -10271 -849 9991 6640 -2263 -6792 -589 -14932 -10459 -9632 -17234 -28401 -35270 -35284
427c5284O553J0436f481Ko489N520a993F749o80k224N90J4E0h155m302o165o136
$$ -35284 -28731 -18295 -6481 -6479 -12968 -7448 -1993 6749 6069 3845 4435 4449 50 -8155 -12457 -18622 -24758
410b4758m822j748K457M074K369j406n688r559j0736o842N072Q83N8N937R271
$$ -24758 -29580 -31328 -28871 -24797 -22428 -23834 -29522 -39081 -49817 -56659 -51587 -50704 -50646 -44709 -35438
395c5438Q384N748Q30k544n345o539p126p526p960Q876R428J0053J0675g161a904
$$ -35438 -27054 -21306 -20476 -23020 -28365 -34904 -42030 -49556 -57516 -48640 -39212 -29159 -18484 -7161 -1904
379E011D69a14E80b929J409j419j015o69l251A841b305j5025j2793o558k79J48
$$ 5011 469 -114 580 -2929 -1520 -2939 -3954 -4623 -7874 1841 -2305 -17330 -30123 -36681 -36960 -36812
363c6812j508k031M09K995O017R650f107H35f065j850m692d581h13E783B43f899
$$ -36812 -38320 -40351 -39942 -36947 -30930 -21280 -6107 835 -6065 -7915 -12607 -4581 -813 5783 243 -6899
346e655A1369O519l428F923A409a909F513G53f674c049I814a7499k8632J884K1486
$$ -5655 11369 17888 14460 6923 1409 -1909 6513 753 -6674 -3049 9814 -17499 -46131 -44247 -22761
331b2761f142B510f276l389M356B982Q385j888h367j0224N393a140E776o65c016
$$ -22761 -6142 2510 -6276 -9665 -5309 2982 11367 9479 -8367 -18591 -13198 -1140 5776 5111 -3016
315a3542m865O939a919l70A4235m733d87k3449j3735a8674C103o23a8213m818
$$ -13542 -18407 -11468 -1919 -2289 14235 9502 -487 -23936 -37671 -18674 3103 2480 -18213 -23031
301b3031L693j0769J2050C59g523o417c466g78k1751j3696a6325D493r63f86e
$$ -23031 -19338 -30107 -18057 359 -7523 -13940 -3466 -778 -22529 -36225 -16325 4493 3530 -686 -5
285a322q509k7331q105K2307h020b013G086f633o15j1473N66d395b063n007K778
$$ -1322 -9831 -37162 -45267 -22960 -8020 -2013 7086 -6633 -7248 -18721 -18155 -4395 -2063 -7070 -4292
270d292n551L562A098i096r724r753r300l503R201a5403g025b258l414j530k029
$$ -4292 -9843 -6281 1098 -9096 -18820 -28573 -37873 -41376 -32175 -15403 -7025 -2258 -5672 -7202 -9231
255i231G704L778j173m910h99n664C192R839e648G516k145a011l391q274N907
$$ -9231 7704 11482 10309 5399 -899 -6563 3192 13031 -5648 7516 5371 -1011 -4402 -12676 -6769
240f769J840q618j0234p809l724K29J244k951j0174j3776K3070a2833d272G050
$$ -6769 -4929 -13547 -23781 -31590 -35314 -35085 -33841 -36792 -46966 -60742 -37672 -12833 -4272 7050
225A0561J546K398L62j798n326a325D253f302b023q461q953r442q395l839J064
$$ 10561 12107 14505 14867 13069 7743 -1325 4253 -6302 -2023 -10484 -19437 -28879 -37274 -41113 -40049
210d0049R31m151r845j852J7608J7762g994k146n942j7699j8462Q717J6140Q086
$$ -40049 -39118 -43269 -53114 -54966 -37358 -19596 -7994 -10140 -16082 -33781 -52243 -43526 -27386 -19300
196a9300k96m046r30O291P658L888r67m778n429k696J308M827O303b112j348F756
$$ -19300 -19596 -23642 -24572 -18281 -10623 -6735 -7702 -12480 -17909 -20605 -19297 -14470 -8167 -2112 -3460 6756
179I032e901n27h13l411r656J466O128k100j4100j2460q380j022N524P469N588
$$ 9032 -5901 -6428 -813 -4224 -13880 -12414 -6286 -8386 -22486 -34946 -43326 -44348 -38824 -31355 -25767
164b5767K456J999Q221O098A737O851k527K26I06f356J409j741m566r085j018
$$ -25767 -23311 -21312 -13091 -6993 1737 8588 6061 6287 906 -6356 -4947 -6688 -11254 -20339 -21357
149b1357c500m657A932b457l751K372B016L735K594Q607b544m065c194J569B389
$$ -21357 -3500 -8157 1932 -2457 -6208 -3836 2016 5751 8345 16952 -2544 -6609 -3194 -1625 2389
133E609j918b855r048m041P803D066j617K241A693f253k1405j7395o954K027N113
$$ 5609 3691 -2855 -11903 -15944 -8141 4066 2449 4690 1693 -6253 -27658 -45053 -52007 -49980 -44867
118d4867Q996J4160i348c967p52l313m162o8e392a062A847N642M850p01f213k492
$$ -44867 -35871 -21711 -9348 -3967 -4719 -8032 -12194 -12262 -5392 -1062 1847 7489 12339 11638 -6213 -8705
102h705a935A988c78q814j9944l7268b5672D641a0993G64d268j911D624L074M808
$$ -8705 -1935 1988 -378 -9192 -29136 -66404 -25672 4641 -10993 764 -4268 -6179 4624 7698 12506
87A2506M700n299b950o72B2K154f83c32j3881j4846m662N656N280j647r323j4976
$$ 12506 17206 11907 -2950 -3622 22 2176 -683 -332 -14213 -29059 -33721 -28065 -22785 -24432 -33755 -48731
71d8731j0629J4024J7847J2884N484k310q279j0995q083o67N598Q171J2030C097
$$ -48731 -59360 -45336 -27489 -14605 -9121 -11431 -19710 -30705 -38788 -39455 -33857 -25686 -13656 3097
56a696A0806C616e301j993G21R459j14e609l282j277b842a16E851Q002P97o743
$$ -1696 10806 3616 -5301 -7294 721 10180 10066 -5609 -8891 -10168 -2842 -116 5851 13853 14650 7907
40G907l789h624c625F139B419N511A260a5978k1545j7299M478R352J691k997N539
$$ 7907 4118 -8624 -3625 6139 2419 7930 1260 -15978 -37523 -54822 -50344 -40992 -39301 -42298 -36759
25c6759J7596c35B621R77a758j409p052K67a065m631J388J812n495K833j5066
$$ -36759 -19163 -335 2621 3598 -1758 -3167 -10219 -9952 -1065 -5696 -4308 -2496 -7991 -5158 -20224
10b0224j3775m227R050J2679g716K369l916o601m592J255
$$ -20224 -33999 -38226 -29176 -16497 -7716 -5347 -9263 -15864 -20456 -19201
0a9201
$$ -19201
##PAGE= F1=2354.387566545
##FIRST=     2906.91634943962, 2629.00904605264, -3962
##DATA TABLE= (F2++(Y..Y)), PROFILE
1023c962C47h12C535J439j48i54r740m741M434a974F81g52l958j691n469d543
$$ -3962 347 -812 3535 4974 4826 -954 -10694 -15435 -11001 -1974 681 -752 -4710 -6401 -11870 -4543
1006a169D139a320r270a891G862i569E664b71p905k471j758q13j666k079j406
$$ -1169 4139 -1320 -10590 -1891 7862 -9569 5664 -271 -8176 -10647 -12405 -13218 -14884 -16963 -18369
991a8369K106L538L308K640P61p93p71j976j062M98J180r32n158l140M265c201
$$ -18369 -16263 -12725 -9417 -6777 -6016 -6809 -7580 -9556 -10618 -10120 -8940 -9872 -15030 -18170 -13905 -3201
974G877f88j2232L597B174a0557j276d014j356D775k028e135K18k19j609l2K704
$$ 7877 -688 -12920 -9323 2174 -10557 -11833 -4014 -5370 4775 2747 -5135 -4917 -5136 -6745 -6777 -4073
958d073a548C069P893D420d878D792A925e643C482e090F910M575a4950F784k203
$$ -4073 -1548 3069 10962 4420 -4878 4792 1925 -5643 3482 -5090 6910 11485 -14950 6784 4581
943D581a0264A734d908O20I595A6d245j158Q78A122b906q367l972K342J747o04
$$ 4581 -10264 1734 -4908 -4288 9595 16 -4245 -5403 -4525 1122 -2906 -11273 -15245 -12903 -11156 -11760
927a1760l35J819L449K707Q46r94k916l220k274q06J216K715L971a432m986J42
$$ -11760 -12095 -10276 -6827 -4120 -3274 -4268 -7184 -10404 -12678 -13484 -12268 -9553 -5582 -1432 -6418 -6276
911f276B896e239r27k256A230f398B71N080Q197O63j504B579g479a359j128o096
$$ -6276 2896 -5239 -6166 -8422 1230 -6398 271 5351 13548 14211 12707 2579 -7479 -1359 -2487 -8583
895h583n824m595j817J323K269J706K416J597K988Q97L22K99K072k509b719l457
$$ -8583 -14407 -19002 -20819 -19496 -17227 -15521 -13105 -11508 -8520 -7623 -7301 -7002 -4930 -7439 -2719 -6176
879f176C242A525g053A492N603A423d107l667j3448Q679a769D051i577L022A0616
$$ -6176 3242 1525 -7053 1492 7095 1423 -4107 -7774 -21222 -12543 -1769 4051 -9577 -6555 10616
863A5420m626C321a2763f366R32j667J554o132p128J109O397M029J907j931p57
$$ 15420 10794 3321 -12763 -6366 -5434 -7101 -5547 -11679 -18807 -17698 -11301 -7272 -5365 -7296 -8053
848h053L882J157m061c197n751n674L827M103E250M496a144q487c598B430J870
$$ -8053 -4171 -3014 -7075 -3197 -8948 -14622 -10795 -6692 5250 9746 -1144 -9631 -3598 2430 4300
833D300g543o149J755k608e636J6N1C488d450A0614C872I16b953D2071B0126Q7235
$$ 4300 -7543 -13692 -11937 -14545 -5636 -5620 -5569 3488 -4450 10614 3872 916 -2953 42071 20126 107361
817A07361N3710n4568P0165J376224M693913O422429M681195j13006m800375C619427
$$ 107361 161071 106503 176668 1552892 6246805 12669234 17350429 17237423 12437048 3619427
806A503029A09074A2751J96874j01497H676J0044J0171A0499e240p851D263A039
$$ 1503029 109074 12751 209625 108128 8676 18720 28891 10499 -5240 -13091 4263 1039
793a116A432L089g905j2613K428f266a74k17B974j332a340j3707d889J196A15
$$ -1116 1432 4521 -7905 -20518 -18090 -6266 -174 -391 2974 1642 -1340 -15047 -4889 -3693 115
777H53f048j217l402Q06J416o823l836J135L994M633L713b147r184a003l970P59
$$ 853 -6048 -7265 -10667 -9861 -8445 -15268 -19104 -17969 -13975 -9342 -5629 -2147 -11331 -1003 -4973 -4214
761d214l672m713n870k263P143f575N35E93a38l885m813k766q13M52R37J420M32
$$ -4214 -7886 -12599 -18469 -20732 -13589 -6575 -6040 593 -138 -4023 -8836 -11602 -12415 -11963 -11026 -9606 -9174
744i174k39r13K184L057b428q23O41o29a162j522k485b446I06N289b248q773n819
$$ -9174 -9413 -10326 -8142 -5085 -2428 -3251 -2610 -3239 -1162 -2684 -5169 -2446 906 6195 -2248 -11021 -16840
727a6840j109L379f337b426l827E646P182C603b945n058k736r60j580r78f146
$$ -16840 -17949 -14570 -6337 -2426 -6253 5646 12828 3603 -2945 -8003 -10739 -11699 -13279 -14257 -6146
711d124j962b093E9i358d66G122j270k736f3l246k930k598j867j805o75J073L159
$$ -4124 -6086 -2093 59 -9358 -466 7122 5852 3116 -63 -3309 -6239 -8837 -10704 -12509 -13184 -12111 -8952
694h952d162J35o024g69p16A0105N039a015n04F738L540d157k075J463d00k383
$$ -8952 -4162 -4027 -10051 -769 -1485 10105 15144 -1015 -1519 6738 10278 -4157 -6232 -4769 -400 -2783
678b783j644B182b051F117c869J324j040J74n232q637J173e029A606J755M167
$$ -2783 -4427 2182 -2051 6117 -3869 -2545 -3585 -3411 -8643 -17280 -16107 -5029 1606 3361 7528
663G528B025g019r925K639d437n868I165N214F193h873H26L623g041j343a312
$$ 7528 2025 -7019 -16944 -14305 -4437 -10305 9165 14379 6193 -8873 826 4449 -7041 -8384 -1312
647C628K011K129k316c957k09a495q7q661L323m504K49J375L373b691F6J870q35
$$ 3628 5639 7768 5452 -3957 -4166 -1495 -1582 -10243 -6920 -11424 -11175 -9800 -6427 -2691 66 1936 1101
630A101c094l887L111l558k142n1753j4870h224a486m671a055m488o625J079g01
$$ 1101 -3094 -6981 -3870 -7428 -9570 -61323 -76193 -8224 -1486 -6157 -1055 -5543 -12168 -11089 -701
614d496J361J036e82A92i550a559l053K19C036K178g970A207c825D07J6752o930
$$ -4496 -3135 -2099 -582 192 -9550 -1559 -4612 -4393 3036 5214 -7970 1207 -3825 407 17159 10229
598A0229D464A249m09J569i573m625f505E411B188M431b022k771l003M17J410
$$ 10229 4464 1249 840 2409 -9573 -14198 -6505 5411 2188 6619 -2022 -4793 -7796 -7379 -5969
583e969K490C739d658E08e505n666N265K686k763M02k932N36p912k378L298K102
$$ -5969 -3479 3739 -4658 508 -5505 -11171 -5906 -3220 -5983 -5581 -8513 -7977 -15889 -18267 -14969 -12867
567a2867K432M359F40e380k45f21A82f458b802M62m041J868J794r42n288j127
$$ -12867 -10435 -6076 640 -5380 -5625 -621 182 -6458 -2802 -2340 -6381 -4513 -2719 -3661 -8949 -10076
551a0076n538L006K379b106q967b281l491k714j47K606a995A836L191a466F426
$$ -10076 -15614 -12608 -10229 -2106 -11073 -2281 -5772 -8486 -8633 -6027 -1995 1836 5027 -1466 6426
535G941b107B365c41o40k422a159m279l157o625n050P634q15a767G8J010M39K55
$$ 7941 -2107 2365 -341 -981 -3403 -1159 -5438 -8595 -15220 -20270 -12636 -13451 -1767 78 1088 1527 1782
518A782K268J513J043c514k766H23d083o557k350f353J637B147a873D53c9o484
$$ 1782 4050 5563 6606 -3514 -6280 823 -4083 -10640 -12990 -6353 -4716 2147 -1873 453 -39 -6523
502f523k880J680K233J069J351j512j637j362r36j419j854k388j322K364M640
$$ -6523 -9403 -7723 -5490 -4421 -3070 -4582 -6219 -7581 -8517 -9936 -11790 -14178 -15500 -13136 -8496
487h496L045i26n165J201n351k685M132b066B742K625a0103L963b07A4320E924
$$ -8496 -5451 -926 -6091 -4890 -10241 -12926 -8794 -2066 2742 5367 -10103 -6140 -207 14320 5924
471f926b718j345g6I574C788d219m551J691r070K2h059a979k393n698M276m616
$$ -6926 -2718 -4063 -76 9574 3788 -4219 -8770 -7079 -16149 -16127 -8059 -1979 -4372 -10070 -5794 -10410
455a0410k028L397c216A129P82K146A963a121k895k647j332Q04M55k598L487A69
$$ -10410 -12438 -9041 -3216 1129 1911 4057 1963 -1121 -4016 -6663 -7995 -7191 -6736 -9334 -5847 169
438e103q452j132K331e697p946O167r73B495a409k227j3166e593m60r2j18k921
$$ -5103 -13555 -14687 -12356 -5697 -13643 -7476 -8449 2495 -1409 -3636 -16802 -5593 -6053 -6145 -6263 -9184
422i184M162j28j733j102q98j70R68K625k228q94a426a85l245o292k526m230r02
$$ -9184 -5022 -5150 -6883 -7985 -8883 -9053 -8085 -5460 -7688 -8582 -1426 -185 -3430 -9722 -12248 -16478 -17380
405a7380N409N834a819L3n79m336o879r59P190a379B016J822f582I85J536E91
$$ -17380 -11971 -6137 -1819 -1786 -2365 -6701 -13580 -14539 -7349 -1379 2016 3838 -6582 985 2521 591
388a733j096O02D85K92a570p352L336J213g49m457B93h87C277l60b304k637k87
$$ -1733 -2829 -2227 485 777 -1570 -8922 -5586 -4373 -749 -5206 293 -887 3277 2917 -2304 -4941 -5228
371e228o427M54l611g348B817N16j59K765c479J163k047l472j179b327l018N00
$$ -5228 -11655 -11201 -14812 -7348 2817 3333 3174 5939 -3479 -2316 -4363 -7835 -9014 -2327 -5345 -4845
355d845R34m516j860b634K51F000E44d911K263B565q08K752N806C807G02Q580
$$ -4845 -3911 -8427 -10287 -2634 -2383 6000 544 -4911 -2648 2565 1757 4509 10315 3807 702 9282
339I282C305d356j306G742C511d370o874n579K475e525a584r13n312a753B356
$$ 9282 3305 -4356 -5662 7742 3511 -4370 -11244 -16823 -14348 -5525 -1584 -2497 -7809 -1753 2356
323D905i786c709q797d637n31j828l253j558N207l66j515G74J0577k499D140D2
$$ 4905 -9786 -3709 -12506 -4637 -5168 -6996 -10249 -11807 -6600 -6966 -8481 774 11351 8852 4140 42
306c7D550L512k32h858J997j596J682a321B113a971j1028b865a355k765N40j010
$$ -37 4550 8062 7830 -8858 -6861 -8457 -6775 -1321 2113 -1971 -12999 -2865 -1355 -4120 -3580 -4590
290d590D201j402b885o362l325M232L82a020C027h032b385G755f020j461j282
$$ -4590 4201 2799 -2885 -9247 -12572 -8340 -7958 -1020 3027 -8032 -2385 7755 -6020 -7481 -8763
275h763k613L746j166j924j020J96J04R82K995c705a51B268h088k22L637k987
$$ -8763 -11376 -7630 -8796 -10720 -11740 -11544 -11440 -10458 -7463 -3705 -151 2268 -8088 -8310 -4673 -7660
259g660J422M94o31P61k544o796l745L347L455K073K927a737l080D266O43c350
$$ -7660 -6238 -5744 -6375 -5614 -8158 -14954 -18699 -15352 -11897 -9824 -6897 -1737 -4817 4266 4909 -3350
242e336p657e374b650I905K58D426b707p512a582D048A623K172c238k721a325
$$ -5336 -12993 -5374 -2650 9905 10163 4426 -2707 -10219 -1582 4048 1623 3795 -3238 -5959 -1325
226G657J679K825j24j660D228a041m103n086n936j261N998M406J748j127k852
$$ 7657 9336 12161 12037 10377 4228 -1041 -5144 -10230 -16166 -17427 -11429 -7023 -5275 -6402 -9254
211i254k322L53o8L994J158q81J45K260o157a862k013m609n468L152c590B143
$$ -9254 -11576 -11223 -11291 -7297 -6139 -7020 -6875 -4615 -10772 -1862 -3875 -8484 -13952 -10800 -3590 2143
194D877g811m847a846j522l025l484k782n3J154P24j578l149l017R22K110O20
$$ 4877 -7811 -12658 -1846 -3368 -6393 -9877 -12659 -12712 -11558 -10834 -12412 -15561 -18578 -17656 -15546 -14926
178a4926n88m98J577L006k938L159b462K60k367m321m406j79O75e638D265K619
$$ -14926 -15514 -16012 -14435 -11429 -14367 -11208 -2462 -2202 -4569 -8890 -13296 -13475 -12800 -5638 4265 6884
162F884J854e850L19i71k845B041g28p183L3J942l047c883E196G52h240H94f070
$$ 6884 8738 -5850 -5531 -971 -3816 2041 -728 -7911 -7878 -5936 -8983 -3883 5196 752 -8240 894 -6070
144c545c01A070K750N890N785f20k567A835n87q6f776p320k591K834L888L607
$$ -3545 -301 1070 3820 9710 15495 -620 -3187 1835 1248 1162 -6776 -14096 -16687 -13853 -9965 -6358
128f358b379C49N16a624k027l446k666j920j303j368k076o35L482N491K201b927
$$ -6358 -2379 349 865 -1624 -3651 -7097 -9763 -11683 -12986 -14354 -16430 -17065 -13583 -8092 -5891 -2927
111a0053K302K70c602a627E050O503R13d643l354A710P62a495l591G087l83i35
$$ -10053 -7751 -7481 -3602 -1627 5050 11553 12466 -4643 -7997 1710 2472 -1495 -5086 7087 6704 -935
94C745a0700d248j69a728A250K505M064P525l618e902j812Q10G60M520B083a353
$$ 3745 -10700 -4248 -4417 -1728 1250 3755 7819 15344 11726 -5902 -7714 -6904 760 5280 2083 -1353
77b60E67e685o161l62M108K11K379K066l950b475A163c470l402J992l576q211
$$ -260 567 -5685 -11846 -12208 -8100 -7889 -5510 -3444 -7394 -2475 1163 -3470 -6872 -4880 -8456 -16667
61a6667c199I345J0882F747d982A3094E395g384r51C067J1003o066c499m995K364
$$ -16667 -3199 9345 20227 6747 -4982 13094 5395 -7384 -8335 3067 14070 8004 -3499 -8494 -6130
46f130b959a222E398P256j563D976k152e510K169A0555j370n26k830B8h268p542
$$ -6130 -2959 -1222 5398 12654 11091 4976 2824 -5510 -3341 10555 9185 8659 5829 28 -8268 -15810
30a5810K915M131L44l915o123Q606b862A020L66a009l745l750k992j444J441L549
$$ -15810 -12895 -8764 -8420 -12335 -18458 -9852 -2862 1020 1386 -1009 -4754 -8504 -11496 -12940 -11499 -7950
14g950K407n158M696Li94k876m243m074K87L086K081K05J807J669
$$ -7950 -5543 -10701 -6005 -6002 -994 -3870 -8113 -12187 -11900 -8814 -6733 -6528 -4721 -3052
0c052
$$ -3052
##PAGE= F1=2351.817665229
##FIRST=     2906.91634943962, 2629.00904605264, -354
##DATA TABLE= (F2++(Y..Y)), PROFILE
1023c54j675R17k65L76m75j344r493J612O3K886N88m78j367J523l492d400J360
$$ -354 -2029 -1112 -1377 -1001 -1476 -2820 -12313 -10701 -10638 -7752 -7164 -7642 -9009 -7486 -10978 -4400 -3040
1006c040C097b395j0409d059E148g259F173@h645K631o540M514c494A17J965a1096
$$ -3040 3097 -2395 -12804 -4059 5148 -7259 6173 0 -8645 -6014 -12554 -8040 -3494 117 2082 -11096
989c611j131B414b968l036a589A199K893j897Q39a281p981B593e64r87A101A63
$$ -3611 -4742 2414 -2968 -6004 -1589 1199 4092 2195 3034 -1281 -9262 2593 -564 -1551 1101 163
972a2119R64A668J385e80k558l860i06n60l932k766l608j086K737M381a223D299
$$ -12119 -11155 1668 3053 -580 -3138 -6998 -906 -1466 -5398 -8164 -11772 -12858 -10121 -5740 -1223 4299
955A0292D971d522D045K143a1378a474m386G148B717a2417A474o99h904h38l478
$$ 10292 4971 -4522 4045 6188 -11378 -1474 -5860 7148 2717 -12417 1474 775 -8904 -838 -4316
940d316m492c822A029c429l45m09A283c925o039l647L400M112b036i79B625J576
$$ -4316 -8808 -3822 1029 -3429 -3774 -4183 1283 -3925 -9964 -13611 -10211 -6099 -2036 -979 2625 4201
924D201O31e873A337K467a839o226J442k48l88b205P18n867J140m873n043J773
$$ 4201 4832 -5873 1337 3804 -1839 -8065 -6623 -6871 -7259 -2205 -1487 -7354 -6214 -11087 -16130 -14357
908a4357N751c481i07A195L57B67a367j721j691j717k201j587K82J827K036J777
$$ -14357 -8606 -3481 -907 1195 1552 267 -1367 -3088 -4779 -6496 -8697 -10284 -10002 -8175 -6139 -4362
892d362J823e82k13k52r044E290Q66g2E964J561f567b33o224e65o011j647c126
$$ -4362 -2539 -582 -795 -1047 -10091 5290 6156 -72 5964 7525 -6567 -233 -6457 -565 -6576 -8223 -3126
874A639d595m187c672n048J361A586c10j0682a653H033P989o75D180a1848d053
$$ 1639 -4595 -8782 -3672 -8720 -7359 1586 -310 -10992 -1653 8033 16022 15347 4180 -11848 -4053
858c964o992M345b376A396L464L804k403O144P20l447D649a559o564k141M78J499
$$ -3964 -10956 -6611 -2376 1396 4860 8664 6261 12405 13125 9678 4649 -1559 -8123 -10264 -9786 -8287
842h287o18j354j433k366j75J001l09K756L841c388n383l704k798d938o67R6l39
$$ -8287 -8905 -10259 -11692 -14058 -14233 -13232 -13541 -10785 -6944 -3388 -8771 -12475 -15273 -4938 -5605 -5509 -5848
825e848J124a550k340B668a47j0259L426A6349P684M3866O2673K09114J430635
$$ -5848 -4724 -1550 -3890 2668 -147 -10406 -6980 16349 24033 67899 130572 339686 1770321
812A770321J976227J430143o0888j496376A685066C54371A21334m6610k7218j5864
$$ 1770321 3746548 5176691 5115803 3619427 1685066 354371 121334 74724 47506 31642
802C1642A0205Q400k413p208a808q117D444j319C49O100k140d013o867J957c065
$$ 31642 10205 18605 16192 8984 -1808 -9925 4444 3125 349 6449 4309 -4013 -10880 -8923 -3065
786b85D146Q994b821A89e892b893p742k137O037c222k043k837o38a982B788h71
$$ -285 4146 13140 -2821 189 -5892 -2893 -10635 -12772 -6735 -3222 -5265 -8102 -8740 -1982 2788 -871
769h214b387k683j590j247k048k816k796p3L022K776J995K362K165l876A963K948
$$ -8214 -2387 -5070 -6660 -7907 -9955 -12771 -15567 -15640 -12618 -9842 -7847 -5485 -3320 -7196 1963 4911
753D911B143J543L935k217b375m567J909m57N85q2n650L68j927L548L933J656
$$ 4911 2143 3686 7621 5404 -2375 -6942 -5033 -5490 -4905 -4987 -10637 -10269 -12196 -8648 -4715 -3059
737c059j32j785j617K833A55a404G494K939l044K241C885K945p0h60m275B825
$$ -3059 -3191 -4976 -6593 -3760 155 -1404 7494 10433 7389 9630 3885 6830 6760 -860 -5135 2825
720E590b773m143o71q87m005N527a475I821D78d656j607b824n669B672L939J539
$$ 5590 -2773 -6916 -7587 -8474 -12479 -6952 -1475 9821 478 -4656 -6263 -2824 -8493 2672 6611 8150
704H150k068B955b498q142l960K162K942O54q25k85Q85J281n66L71j784j769J674
$$ 8150 6082 2955 -2498 -10640 -14600 -12438 -9496 -8842 -9667 -9952 -9067 -7786 -8352 -7981 -9765 -11534 -9860
687i860M196b062e53r67k038j006J859a11k585m668J219r2a489m849J810l869
$$ -9860 -5664 -2062 -553 -1520 -3558 -4564 -2705 -111 -2696 -7364 -6145 -6237 -1489 -6338 -4528 -8397
671h397m770n28N100M236a680e63b34n44j333j792j953j573l70o0c580a577a24
$$ -8397 -13167 -13695 -8595 -4359 -1680 -563 -234 -778 -2111 -3903 -5856 -7429 -7799 -7859 -3580 -1577 -124
653a2737A61h6j1753R05d689n36H731N131n351c320m337L805J17o318c20j0386
$$ -12737 161 -86 -11839 -10934 -4689 -5225 8731 13862 8511 -3320 -7657 -3852 -3735 -10053 -320 -10706
637a0706A66L284q68m30m99c191l086j361n083A211B28f22k4885k5123a7695A805
$$ -10706 166 3450 2582 2152 1653 -3191 -6277 -7638 -12721 1211 228 -622 -25507 -50630 -17695 1805
620d80D144c763o353k845f315q22F639A426k00L990a1511c312g13m488l188j337
$$ -480 4144 -3763 -10116 -12961 -6315 -7137 6639 1426 1226 5216 -11511 -3312 -713 -5201 -8389 -9726
604i726k02J550K159b675H13K908K112J552R61j22a2618j480d975O47m105j966
$$ -9726 -9928 -8378 -6219 -2675 813 3721 5833 7385 8346 8224 -12618 -14098 -4975 -4328 -8433 -10399
588a0399K108K859K519o208m559c402F447f093D477i54n782P6J542N04a074l547
$$ -10399 -8291 -5432 -2913 -9121 -13680 -3402 6447 -6093 4477 -954 -6736 -6660 -5118 -4614 -1074 -4621
572d621j387j222B962A042a0002M914D029N912f155K612H96K736f899N99R75m546
$$ -4621 -6008 -7230 2962 1042 -10002 -5088 4029 9941 -6155 -3543 896 3632 -6899 -6300 -5325 -9871
556i871L878j584r21j193o00j272m46L007L950o299a003j643q415d675j420p378
$$ -9871 -5993 -7577 -8498 -9691 -10291 -11563 -12009 -9002 -5052 -11351 -1003 -2646 -11061 -4675 -6095 -13473
540a3473e516B683H42M070O258b493A584e093n692q63L138N34j689j300k331Q78
$$ -13473 -5516 2683 842 4912 11170 -2493 1584 -5093 -10785 -11648 -8510 -7976 -9665 -10965 -13296 -12418
524a2418K038R65K02J398K893h04A634L021q4g736J689J448j518j757C290K289
$$ -12418 -10380 -9415 -9213 -7815 -4922 -804 1634 4655 4571 -7736 -6047 -4599 -6117 -7874 3290 5579
508E579e088D137D94K832j053K460P00c60m316R17D485A014b027l588k473J910
$$ 5579 -5088 4137 494 3326 2273 4733 5433 -360 -4676 -3759 4485 1014 -2027 -5615 -8088 -6178
492f178b813J063k254m984m784f211E81a1405D567b458o391l401J980r56J159
$$ -6178 -2813 -1750 -4004 -8988 -13772 -6211 581 -11405 4567 -2458 -8849 -12250 -10270 -11226 -10067
477a0067o06j566K047L497K621N01m658k618c139a50B742b256k129E495j025B141
$$ -10067 -10673 -12239 -10192 -6695 -4074 -3573 -8231 -10849 -3139 -150 2742 -2256 -4385 5495 4470 2141
460h366K627m328k542K751L303c205q011D267R56k478A021i00A073M324L401J396
$$ -8366 -5739 -10067 -12609 -9858 -6555 -3205 -11216 4267 5223 2745 1021 -900 1073 5397 8798 10194
444A0194B489e932o521g27C911n05H79c146q181N597k774K472n748c732j561j120
$$ 10194 2489 -5932 -12453 -727 3911 3406 879 -3146 -11327 -5730 -8504 -6032 -11780 -3732 -5293 -6413
428f413o268L018K427b147l340j634J244a330I006j838k670I81a906j180n209
$$ -6413 -12681 -9663 -7236 -2147 -5487 -7121 -5877 -1330 9006 7168 4498 981 -1906 -3086 -8295
413h295l868a401D649d009l871B908g440B644D44f508p921P176b986f91J57H15
$$ -8295 -12163 -1401 4649 -4009 -7880 2908 -7440 2644 444 -6508 -14429 -7253 -2986 -691 -534 815
396E827Q89J649J767e874D520j34F64b577k133j286j484j798J661j944G36M59
$$ 5827 6716 8365 10132 -5874 4520 4386 664 -2577 -4710 -5996 -7480 -9278 -7617 -9561 736 1195
380A195a370q933L782j406L538f06p99l815q27m773d221B829k64J940K170j788
$$ 1195 -1370 -10303 -6521 -7927 -4389 -606 -1405 -5220 -6047 -10820 -4221 2829 2565 4505 6675 4887
364D887O39a981k327l077m593N253J995j909k846p06J096J783a181k850C531d03
$$ 4887 5526 -1981 -4308 -7385 -11978 -6725 -4730 -6639 -9485 -10191 -9095 -7312 -1181 -4031 3531 -403
347c604J735F712A979c466m937m44L094b369b78l768m014a150j164m935K531p92
$$ -3604 -1869 6712 1979 -3466 -8403 -8847 -5753 -2369 -278 -4046 -8060 -1150 -2314 -7249 -4718 -5510
331e510p2J646J809f03p176J197M2G65e883P11p265r3k452r41n17K535L830J133
$$ -5510 -5582 -3936 -2127 -603 -7779 -6582 -6540 765 -5883 -5172 -12437 -12530 -14982 -15923 -16440 -13905 -10075 -8942
313h942n148A444M500O13B832M843l506K280K203l746i22m796j880L12q9n01L437
$$ -8942 -14090 1444 5944 6557 2832 7675 4169 6449 8652 4906 -922 -5718 -7598 -7286 -7375 -7876 -4439
296d439o870c038i16m599r84N3a6B440q3O044p55d836k306d04B784a0274c701
$$ -4439 -11309 -3038 -916 -5515 -6499 -6446 -16 2440 2357 8401 7646 -4836 -7142 -404 2784 -10274 -3701
278c812o085j204P7J715M094p03k447K374k89n482L811L837F38L343M93g514R05
$$ -3812 -9897 -11101 -11024 -9309 -5215 -5918 -8365 -5991 -6280 -11762 -7951 -4114 638 3981 4474 -7514 -6609
261f609r804O678P11c301j849b328A3136J317m198m612C16f081j336b801R57d4
$$ -6609 -16413 -9735 -9024 -3301 -5150 -2328 13136 14453 10255 5643 316 -6081 -7417 -2801 -1844 -44
244E041d320l02j0099f087K376p55A479K039b948n792E19M422A603Q024C485I24
$$ 5041 -4320 -4622 -14721 -6087 -3711 -4466 1479 3518 -2948 -8740 519 4941 1603 9627 3485 924
227B110M188K033M95m308f42n563n484k248K112L291K240R58m14j872l043k774
$$ 2110 6298 8331 8826 4518 -642 -6205 -11689 -13937 -11825 -8534 -6294 -5336 -5750 -7622 -10665 -13439
211a3439J305L955L09L22J032M29b559A304e644D86J030K91f224gk918k681j317
$$ -13439 -12134 -8179 -7870 -7548 -6516 -6087 -2559 1304 -5644 486 1516 1807 -6224 -7 -2925 -5606 -6923
194f923q57o583P103Q40J179M48n98l234l395d949b262i31B725Q26L68a1025Q20
$$ -6923 -7780 -14363 -7260 -6420 -5241 -4793 -5391 -8625 -12020 -4949 -2262 -931 2725 3551 3919 -11025 -10205
177a0205h01j635n581k728l777e799j012j540m988M967M24n664d309H837j206
$$ -10205 -801 -2436 -8017 -10745 -14522 -5799 -6811 -8351 -13339 -8372 -7948 -13612 -4309 8837 7631
162G631m80c236q737K670j815c897p604m450N165d919k926A017O830k126e765
$$ 7631 7151 -3236 -11973 -9303 -11118 -3897 -11501 -15951 -10786 -4919 -7845 1017 7847 5721 -5765
146i47r811J944D072n21R688R692r892C37a34k27r041q203O172c891A598K611
$$ -947 -10758 -8814 4072 3551 13239 22931 13039 337 -134 -361 -9402 -17605 -11433 -3891 1598 4209
130D209J611A176Q877B261a579k610C555e226q976j471M710J486j610k588j999
$$ 4209 5820 1176 10053 2261 -1579 -4189 3555 -5226 -14202 -15673 -10963 -9477 -11087 -13675 -15674
115a5674O02K115L221R89L895k969K960R27D400M780k470d272q83E405B676b503
$$ -15674 -15072 -12957 -9736 -8747 -4852 -7821 -4861 -3934 4400 9180 6710 -4272 -5155 5405 2676 -2503
98a567I828k790N567l710h879K937B118a711l205a811B633N131K039i341J644
$$ -1567 9828 7038 12605 8895 -8879 -5942 2118 -1711 -4916 -1811 2633 7764 9803 -9341 -7697
83g697l606J316L302c28A661O420N74C081f877a670n573l571K77J498J443J716
$$ -7697 -11303 -9987 -6685 -328 1661 8081 8655 3081 -6877 -1670 -7243 -10814 -10537 -9039 -7596 -5880
67e880K615i43l373l091k432k445e609C202P904H72f663A2588E161i187c201B340
$$ -5880 -3265 -943 -4316 -7407 -9839 -12284 -5609 3202 11106 872 -6663 12588 5161 -9187 -3201 2340
50B45a491j087l604b685K05f94F486N024j738G59f52j612K88j017r14j934k930
$$ 245 -1491 -2578 -6182 -2685 -2480 -694 6486 11510 9772 759 -652 -2264 -1976 -2993 -3907 -5841 -8771
33h771k791K718M340i72A775i743j72o63K601K952j42J107R36L95k75j305k366
$$ -8771 -11562 -8844 -4504 -972 1775 -9743 -9915 -10578 -7977 -5025 -5167 -4060 -3124 -2729 -3004 -4309 -6675
16f675k319P54K07k148K476j04n11k594M318b510l579C100I24f599E12d185
$$ -6675 -8994 -8240 -8033 -10181 -7705 -7809 -8320 -10914 -6596 -2510 -6089 3100 924 -6599 512 -4185
##PAGE= F1=2349.247763913
##FIRST=     2906.91634943962, 2629.00904605264, 617
##DATA TABLE= (F2++(Y..Y)), PROFILE
1023F17d398H02C74P38Q34Q53a0201m094e772K298m455k574J512L665n394M855
$$ 617 -4398 802 374 1112 1946 2799 -10201 -14295 -5772 -3474 -7929 -10503 -8991 -5326 -10720 -5865
1007e865j122l390r57m27M868B000e799D587B47g546a653o49q642o28b105E569
$$ -5865 -6987 -10377 -11334 -11761 -6893 2000 -5799 4587 247 -7546 -1653 -2302 -10944 -11572 -2105 5569
990a2196N829K721D057a71n919K621h62E82b956j908J992A202M584P77k055A564
$$ -12196 -6367 -3646 4057 -171 -6090 -3469 -862 582 -2956 -4864 -2872 1202 5786 6563 4508 1564
973a654r826q91E43N255k063c015k422q94k833m200k068K891L669K933a657C756
$$ -1654 -11480 -12371 543 5798 3735 -3015 -5437 -6331 -9164 -13364 -15432 -12541 -8872 -5939 -1657 3756
956A0050P65n296d479I90O143a1168K733N74I05g769p630O971L456k448K458k029
$$ 10050 10815 5519 -4479 990 7133 -11168 -8435 -7861 905 -7769 -15399 -8428 -4972 -7420 -4962 -6991
940f991p607d274a283r80k475r77b612j392k583m224k654L430M560M68g51B581
$$ -6991 -14598 -4274 -1283 -2263 -4738 -5715 -2612 -4004 -6587 -10811 -13465 -10035 -5475 -5007 -751 2581
923A802f951e77A916g244K627m10l589k102M75K358J828h71C643L17e236l125
$$ 1802 -6951 -577 1916 -7244 -4617 -5027 -8616 -10718 -10243 -7885 -6057 -871 3643 3960 -5236 -8361
907h361E885B475F24K597h37l475k778k108j475k57K575L721i50A847O09J22q23
$$ -8361 5885 2475 624 3221 -837 -4312 -7090 -9198 -10673 -10930 -8355 -4634 -950 1847 2456 2578 1755
890A755a153k850k556j768q48J70M44N42J226Q61k003J234k128l172k423J036
$$ 1755 -1153 -4003 -6559 -8327 -9175 -9005 -8561 -8019 -6793 -5932 -7935 -6701 -8829 -12001 -14424 -13388
874a3388M54j221c035j249p318N745L00p613M236B99O491L323A465a3755b723
$$ -13388 -12934 -14155 -3035 -4284 -11602 -5857 -5557 -13170 -8934 299 6790 10113 1465 -13755 -2723
858e789o850J613a746H379M190m695H99R151M206m835C745c701p509m12M817K621
$$ -5789 -12639 -11026 -1746 8379 12569 7874 899 10050 14256 9421 3745 -3701 -11210 -11622 -6805 -4184
842d184k810j06k563Q65K740j713n975f778C91K231c781r515P77e399n093k934
$$ -4184 -6994 -7100 -9663 -8798 -6058 -7771 -13746 -6778 391 2622 -3781 -13296 -12519 -5399 -10492 -13426
826a3426K677K766R15l49F670N405p57L4O390j782A161K5536K862L06046J181318
$$ -13426 -10749 -7983 -7068 -7417 6670 12075 11318 11352 17742 15960 1161 26697 29559 335605 1516923
811A516923O13202p050o20046C54371A30459D8956A6263o128P73D700L999f4p976
$$ 1516923 2130125 2123075 1503029 354371 130459 48956 16263 10135 10908 4700 8699 -64 -8040
798h040k184L932i43B520j160h53j776l247n69J480b421N31a10H079g035A468
$$ -8040 -10224 -6292 -943 2520 1360 -853 -2629 -5876 -6445 -4965 -2421 -1890 -110 8079 -7035 1468
781G71c825k983k122k130k239M302K515l70L027g07m970j52B630F3J866o07d445
$$ 771 -3825 -6808 -8930 -11060 -13299 -8997 -6482 -6852 -3825 -707 -5677 -5829 2630 63 1929 1322 -4445
763e376n274k753O116b068A581b935a0j1153H636L808a456D055K419j165c156
$$ -5376 -10650 -13403 -7287 -2068 1581 -2935 -10 -11163 8636 12444 -1456 4055 6474 5309 -3156
747i689b040l249K370j678p821e911H84d143j331a889B075J102j415L143B331
$$ -9689 -2040 -5289 -2919 -4597 -12418 -5911 884 -4143 -5474 -1889 2075 3177 1762 4905 2331
731e231B692O317r2K41A556M306J966F7a387F35b943p071n69M235O22j980J955
$$ -5231 2692 9009 8917 9158 1556 5862 7828 67 -1387 635 -2943 -10014 -10583 -6348 -5726 -7706 -5751
714e751d27D415b175o704k246L513j55D273L589l86q25k664d555m216N1l293N255
$$ -5751 -427 4415 -2175 -8879 -11125 -7612 -7767 4273 7862 7476 6651 3987 -4555 -8771 -8720 -12013 -6758
697f758b597g89j56j688k190k371K85J191J736J914h39j572K0k120m78K192D15
$$ -6758 -2597 -789 -945 -2633 -4823 -7194 -6909 -5718 -3982 -2068 -839 -2411 -2391 -4511 -4989 -2797 415
679B404c464m150p64a50E016g869A993e642K72e64k264j546j440j722j564j115
$$ 2404 -3464 -7614 -8378 -150 5016 -7869 1993 -5642 -5370 -564 -2828 -4374 -5814 -7536 -9100 -10215
663a0215J036L567j165C489A384e473H179j324B453a2355F05c806p002l157O526
$$ -10215 -9179 -5612 -6777 3489 1384 -5473 8179 6855 2453 -12355 605 -3806 -10808 -13965 -7439
648g439j497D364N637o68a590r932N160p53j448c564q047L458j163j797M239A5
$$ -7439 -8936 4364 10001 9333 -1590 -11522 -6362 -7115 -8563 -3564 -11611 -8153 -9316 -11113 -6874 15
631g625k317c809j1080e4H010l743i68k7257P267D506J063L237c799k908j382
$$ -7625 -9942 -3809 -14889 -54 8010 4267 -968 -28225 -20958 4506 5569 8806 -3799 -6707 -8089
616h089l583K37D556j861a586C288a0076L382R22k597J482J328J146G50d551p92
$$ -8089 -11672 -11435 4556 2695 -1586 3288 -10076 -6694 -5772 -8369 -6887 -5559 -4413 750 -4551 -5343
600e343b61j587n80h09B076K223a1488l807a502l61l309l452l730L255c799n954
$$ -5343 -261 -1848 -2428 -809 2076 4299 -11488 -15295 -1502 -1863 -5172 -8624 -12354 -9099 -3799 -9753
584i753J34C011N721e645D309a136p062l227M556c094C228A015d826O84C186K351
$$ -9753 -9619 3011 8732 -5645 4309 -1136 -8198 -11425 -6869 -3094 3228 1015 -4826 -4142 3186 5537
568E537h90m510j440R3j282k401O62L327J276m226l728K925M518j825k501J360
$$ 5537 -890 -5400 -6840 -6747 -8029 -10430 -9768 -6441 -5165 -9391 -13119 -10194 -5676 -7501 -10002 -8642
552h642R14R34N41m5O93k530c585p295L06M121a157e40F20J638J339L54n78a893
$$ -8642 -7728 -6794 -6253 -6298 -5605 -8135 -3585 -10880 -10574 -6453 -1157 -540 620 2258 3597 3951 3373 -1893
533b047k009P35a659A125P97h405L180J646O42l011l205j273R37J654K451K113
$$ -2047 -4056 -3321 -1659 1125 1922 -8405 -5225 -3579 -2937 -5948 -9153 -10426 -9489 -7835 -5384 -3271
517c271N76j086l716r50q72K388O82A323L230e121A281e508K207A316Q31L372
$$ -3271 -2695 -3781 -7497 -8447 -9319 -6931 -6249 1323 4553 -5121 1281 -5508 -3301 1316 2147 5519
501E519A348d124Q34A3982m029g41l321e84j028k363o24n899M332E20Q371D123
$$ 5519 1348 -4124 -3290 13982 9953 -741 -4062 -584 -1612 -3975 -4599 -10498 -6166 520 8891 4123
484a2947A120e662l983l601c407m455k410K37P14J06J54Q92K37j59j504R10N55
$$ -12947 1120 -5662 -9645 -13246 -3407 -7862 -10272 -10035 -9321 -9215 -9061 -8169 -7932 -8091 -9595 -8685 -8130
467h130J030Q52Q18J135P38L12p987d032q175K000r26M16M131o034B834K690E92
$$ -8130 -7100 -6248 -5430 -4295 -3557 -3245 -11232 -4032 -12207 -10207 -11133 -10717 -6586 -12620 2834 5524 592
449C898Q26j057J245L218N33l277e411m244E021M448L705j820D049e190h39n234
$$ 3898 4724 3667 4912 8130 8663 5386 -5411 -9655 5021 9469 13174 11354 4049 -5190 -839 -6073
433f073j437q187e414L11J063l376a179F261B887c409l354k409a224A971a676
$$ -6073 -7510 -15697 -5414 -5103 -4040 -7416 -1179 6261 2887 -3409 -6763 -9172 -1224 1971 -1676
417e923m204k617L436n25m447B599J163i120M084E132g941B84M245h274c066J210
$$ -5923 -10127 -12744 -9308 -9833 -14280 2599 3762 -9120 -5036 5132 -7941 284 4529 -8274 -3066 -1856
401a856k990q15K8J958A0303Q63D887b71m464k285j246n50n04n46k77K61N53J727
$$ -1856 -4846 -5661 -5633 -3675 10303 11166 4887 -271 -4735 -7020 -8266 -8816 -9320 -9866 -10143 -9882 -9329 -7602
383g602j432b780J354j898j0725O119l799L287d161a799k999j797k868K649K612
$$ -7602 -9034 -2780 -1426 -3324 -14049 -7930 -11729 -8442 -4161 -1799 -4798 -6595 -9463 -6814 -4202
368d202l441j948L13J315K62q55k020k750J131L255L084b567I1Q98i462d706A691
$$ -4202 -7643 -9591 -9278 -7963 -7701 -8556 -10576 -13326 -12195 -8940 -5856 -2567 91 989 -9462 -4706 1691
350e293C017b916j85j89J546r92J033a90G20A99a249k162k483m305d404j079p878
$$ -5293 3017 -2916 -3101 -3290 -1744 -2736 -1703 -190 720 199 -1249 -3411 -5894 -10199 -4404 -5483 -13361
333a3361h66C631J623b81l463a552n562l941q62a377j269n077n304O429n20J244
$$ -13361 -866 3631 5254 -281 -3744 -1552 -7114 -11055 -11917 -1377 -2646 -7723 -13027 -6598 -7118 -5874
317e874k237j543O70N82J207f82C742A625K34J1408m458D287J6583m690C283B48
$$ -5874 -8111 -9654 -8984 -8402 -7195 -682 3742 1625 1859 13267 8809 4287 20870 16180 3283 248
300g742j5119M228B578N002i963b334A057f770k820N84B08J19J481R578L65c359
$$ -7742 -22861 -18633 2578 7580 -9963 -2334 1057 -6770 -9590 -9006 208 327 1808 11386 11751 -3359
283g397g6C244a4257K030M200J226k113k798L757c157a028m900A700J07a1910
$$ -7397 -76 3244 -14257 -12227 -8027 -6801 -8914 -11712 -7955 -3157 -1028 -5928 1700 1807 -11910
267b801j8n000n026N151J443i04m547p573M046e42l696c06A4814L11o261C125
$$ -2801 -2819 -7819 -12845 -7694 -6251 -904 -5451 -13024 -8978 -542 -4238 -306 14814 15125 8864 3125
250a426l734p35J023a920l681D242e171K325r752L631k984M957A536L56d366o77
$$ -1426 -5160 -5895 -4872 -1920 -5601 4242 -5171 -2846 -12598 -8967 -11951 -6994 1536 1892 -4366 -5043
234e043B940K294f81C637g5A625J975r80M491P261m057m454A586b722q064j294
$$ -5043 2940 5234 -681 3637 -75 1625 3600 2620 7111 14372 10315 5861 1586 -2722 -10786 -12080
218a2080e279A408K177C25P87e742m328J26l929j856K807L551L714K126a753o45
$$ -12080 -5279 1408 3585 325 1112 -5742 -10070 -9944 -13873 -15729 -12922 -9371 -5657 -3531 -1753 -2398
202b398l78O40b08r942B198B02c800j544f35r482d716O43k337k633j213J005l320
$$ -2398 -2776 -2136 -208 -10150 2198 202 -3800 -5344 -635 -10117 -4716 -4073 -6410 -9043 -10256 -9251 -12571
185a2571b52B325a572B817C61c524o994l40B74c51m987m276n229B777J250a53
$$ -12571 -252 2325 -1572 2817 361 -3524 -10518 -10858 274 -351 -5338 -9614 -14843 2777 4027 -153
168e408b289k753p073c414R53r1K38L61n890O4J923l432K333l344j487M802j483
$$ -5408 -2289 -5042 -12115 -3414 -2461 -2552 -2314 -1953 -7843 -7779 -5856 -9288 -6955 -10299 -11786 -6984 -8467
151h467b396C64c81l564n949k85C10Q899j617O619N375I658A93P01Q396m043B500
$$ -8467 -2396 364 -381 -3945 -9894 -10179 310 9209 7592 14211 19586 9658 193 894 9290 5247 2500
133B721b35k940k631n31L97J621J409l499o6k109l636M142b914C37L43i812L123
$$ 2721 -235 -3175 -5806 -6337 -5940 -4319 -2910 -6409 -6475 -8584 -12220 -8078 -2914 337 680 -9812 -6689
116f689n247M84N518g54q524M323j259K525r19D002N18j305d707l208o604N467
$$ -6689 -11936 -11452 -5934 -754 -9278 -4955 -6214 -3689 -4608 4002 4520 3215 -4707 -7915 -14519 -9052
100i052M506A88N692M21M204M37h003b344G821B819a1825L194d271A819N161a0813
$$ -9052 -4546 188 5880 6301 10505 10942 -8003 -2344 7821 2819 -11825 -8631 -4271 1819 6980 -10813
83d031k823B69e245o475M09e238B03J228i100E52N679i989B671H04e614D257N998
$$ -4031 -6854 269 -5245 -11720 -11311 -5238 203 1431 -9100 552 6231 -9989 2671 804 -5614 4257 10255
66A0255p9d19r034j465r6c258l887p31R96K45n70j882j374J011J650N90N82J858
$$ 10255 10176 -419 -9453 -10918 -11014 -3258 -7145 -7876 -6880 -6635 -7205 -9087 -10461 -9450 -7800 -7210 -6628 -4770
48d770R46e9j345C16P768k98l494a838l817o74n40J617a805B303L945B098d414
$$ -4770 -3824 -59 -1404 316 8084 7786 4292 -1838 -5655 -6329 -6869 -5252 -1805 2303 6248 2098 -4414
30f440E87A68h055l210K514P86K464b639L43Q49j178j750k054j528j136L416j521
$$ -6440 587 168 -8055 -11265 -8751 -7965 -5501 -2639 -2296 -1447 -2625 -4375 -6429 -7957 -9093 -5677 -7198
13g198N00j370J65D52J69g47l266m469O82b255m268I8c605
$$ -7198 -6698 -8068 -7903 452 621 -747 -4013 -8482 -7800 -2255 -6523 98 -3605
##PAGE= F1=2346.677862597
##FIRST=     2906.91634943962, 2629.00904605264, 1555
##DATA TABLE= (F2++(Y..Y)), PROFILE
1023A555e780H617o92l193J623j77e693k377i58B317i677A049f953j095k343K481
$$ 1555 -5780 8617 7925 4732 6355 6178 -5693 -8070 -958 2317 -9677 1049 -6953 -8048 -10391 -7910
1007g910l085c848k885m817O68K852K042J530O46j361J80k631l645L878a304C574
$$ -7910 -10995 -3848 -6733 -11550 -10882 -8030 -5988 -4458 -3812 -5173 -4993 -7624 -11269 -7391 -1304 3574
990g429L21L446C712A715f125R39J765n031l660K984L884J985r14k822k458K773
$$ -7429 -7108 -3662 3712 1715 -6125 -5186 -3421 -8452 -12112 -9128 -5244 -3259 -4173 -6995 -9453 -6680
974f680J285l986J755B229K445A843c381p70l069l852k548l22K317J363j54L075
$$ -6680 -5395 -9381 -7626 2229 4674 1843 -3381 -4151 -7220 -11072 -13620 -13942 -11625 -10262 -10416 -7341
958g341b796B434M537j205d638J304E288f037n049J499I91J56d260l472j653K248
$$ -7341 -2796 2434 6971 5766 -4638 -3334 5288 -6037 -11086 -9587 991 1147 -4260 -7732 -9385 -7137
942g137o69J367o324a128q59l86m837j219G300k617A1f584m049M268a889m481
$$ -7137 -7806 -6439 -12763 -1128 -1987 -2373 -7210 -8429 7300 4683 11 -6584 -10633 -6365 -1889 -6370
926f370b413B778l20c826Q75J61r227N947k277c983n454B5f382K644c82D828q33
$$ -6370 -2413 2778 2458 -3826 -2951 -2790 -12017 -6070 -8347 -3983 -9437 25 -6382 -3738 -382 4828 3995
909C995d721m131a52k184j950j964j497n84L24J049J641J836k399a64D775K056
$$ 3995 -4721 -8852 -152 -2336 -4286 -6250 -7747 -8331 -8007 -6958 -5317 -3481 -5880 -164 4775 6831
893F831I36J49L20c385n528l78L702K245N21j458k484j038Q77k582b998R53m69
$$ 6831 936 1085 1405 -3385 -8913 -9291 -5589 -3344 -2823 -4281 -6765 -7803 -6926 -9508 -2998 -2045 -2514
876b514p096l64k188k543O663b640o259l456J597L592L114k844J981b057j523
$$ -2514 -9610 -9974 -12162 -14705 -8042 -2640 -8899 -12355 -10758 -7166 -4052 -6896 -4915 -2057 -3580
861c580m731L770k501n380j80c385A137M006L257h39E667K639l141k324I02f064
$$ -3580 -8311 -4541 -7042 -12422 -12602 -3385 1137 5143 8400 -839 5667 8306 5165 2841 902 -6064
844h459F969j270c942A1295O398p359a028n107j851n672a702F193c13j3698N553
$$ -8459 6969 5699 -3942 11295 17693 10334 -1028 -6135 -7986 -13658 -1702 6193 -313 -14011 -8458
829h458K627E99c226l474J425L01o090D544J1113G676b402B1946j0670j234R335
$$ -8458 -5831 599 -3226 -6700 -5275 -4974 -11064 4544 15657 7676 -2402 21946 11276 10042 19377
814A9377O5698K67769K91519J84209n9202A09074J2260D8956Q005B5286a459J14
$$ 19377 85075 352844 644363 828572 769370 109074 121334 48956 56961 25286 -1459 -1345
802a345F385J577j363K6j014b816i0k566k774j233L96R58K412i23D60d151h94
$$ -1345 6385 7962 6599 6625 5611 -2816 -90 -2656 -5430 -6663 -6267 -5309 -2897 -923 460 -4151 -894
784A1224i746B200j42a475m37m649j716c045l024j511J277J791Q11p242c682A0
$$ 11224 -9746 2200 2058 -1475 -1912 -6561 -8277 -3045 -6069 -7580 -6303 -4512 -3701 -10943 -3682 10
767a398j641j852l033l925J502K571c409J652L50k239B031e769I607J003e493
$$ -1398 -3039 -4891 -7924 -11849 -10347 -7776 -3409 -1757 -1407 -3646 2031 -5769 9607 10610 -5493
751D396p15K057A441g762G66c286l530k531l614e252B416J362e309B51J344l16
$$ 4396 3681 5738 1441 -7762 766 -3286 -6816 -9347 -12961 -5252 2416 3778 -5309 251 1595 1279
735A279Q52K877k483a0284c323G687J624k827b056C951K668G50a212j209r027
$$ 1279 2131 5008 2525 -10284 -3323 7687 9311 6484 -2056 3951 6619 750 -1212 -2421 -11448
720a1448l920K836e317J191k45L90K39L28a706o9m039p086N291B608L247l48n37
$$ -11448 -15368 -12532 -5317 -4126 -4371 -3981 -3742 -3414 -1706 -1775 -5814 -12900 -7609 2608 5855 5507 4970
703D970j177f265J75J702J072J643C230A012b673l425q70j130K515o49j617j772
$$ 4970 3793 -6265 -6090 -4388 -3316 -1673 3230 1012 -2673 -6098 -6968 -8098 -5583 -6232 -7849 -9621
687i621j882k098K294L218K637A755M270r89e757n78a531f41n18p353B64f669
$$ -9621 -11503 -13601 -11307 -8089 -5452 1755 6025 5036 -5757 -6335 -1531 -641 -1159 -8512 264 -6669
670g550D67J913L81e899j389L210F54L593I04h068D168b370j46C740e053j217
$$ -7550 467 2380 2761 -5899 -7288 -4078 654 4247 904 -8068 4168 -2370 -2516 3740 -5053 -6270
654f270k944c655k247k527m207M607J615K847d64B009e16j4736N701j455l45d993
$$ -6270 -9214 -3655 -5902 -8429 -12636 -8029 -6414 -3567 -464 2009 -516 -15252 -9551 -11006 -11351 -4993
637a4369B321O415k281A955c382p679J468A771a2075b861I476j445k414a4390
$$ -14369 2321 8736 6455 1955 -3382 -11061 -9593 1771 -12075 -2861 9476 8031 5617 -14390
622a4517H587J288J157f077K819p77o011n609D9K884f159e22q764m21j741J239
$$ -14517 8587 9875 11032 -6077 -3258 -4035 -10046 -15655 49 2933 -6159 -522 -9286 -9707 -11448 -10209
606a0209J243N42n54k79m03P15P66P05P51J265J929a336j0789j986B758M278a108
$$ -10209 -8966 -8424 -8978 -9257 -9660 -8945 -8179 -7474 -6723 -5458 -3529 -1336 -12125 -14111 2758 7036 -1108
588a512k956k408m36l268J486j8N19l91j553K21K063J902j184b527e79A262a119
$$ -1512 -4468 -6876 -7312 -10580 -9094 -9112 -8593 -8984 -10537 -10316 -8253 -6351 -7535 -2527 -579 1262 -1119
570b3m83l479l679j713Q77Q49j72J44J658K006J176p426k48J447l385K503p08
$$ -23 -506 -3985 -7664 -9377 -8500 -7651 -7823 -7679 -6021 -4015 -2839 -10265 -10513 -9066 -12451 -9948 -10656
553a0656d404Q15k004o50k659j397K86J328n195e891j798B154L525Q07r13k753
$$ -10656 -4404 -3589 -5593 -6243 -8902 -10299 -10013 -8685 -13880 -5891 -7689 2154 5679 6486 5573 2820
537B820a455m648n7K636F239N452k711j815l063e033j342K54O75K444l652l467
$$ 2820 -1455 -6103 -6160 -3524 6239 11691 8980 7165 4102 -5033 -6375 -6121 -5446 -3002 -6654 -10121
521a0121r28J890K606J249o08r73J058b733a06A254f270a109k364k349R92a208
$$ -10121 -11049 -9159 -6553 -5304 -5912 -6885 -5827 -2733 -106 1254 -6270 -1109 -3473 -5822 -4830 -1208
504C493c332A656M629B716c157M50A0028l524b962k633k588m157j065M687b145
$$ 3493 -3332 1656 6285 2716 -3157 -2707 10028 6504 -2962 -5595 -8183 -12340 -13405 -8718 -2145
488a861A572J2114n841g788c773o318N82o80c238l329r16J60j089l134J132N152
$$ -1861 1572 13686 7845 -7788 -3773 -10091 -9509 -10189 -3238 -6567 -7483 -7323 -8412 -11546 -10414 -5262
472e262a445D71b803j39l980r05L215a285G90k58a679o318n90k268L684J563B48
$$ -5262 -1445 471 -2803 -2942 -6922 -7827 -4612 -1285 790 532 -1679 -7997 -8587 -10855 -7171 -5608 248
454c630r525j286L491M198c310a021A368L070L058l504M510c704a112A0089M69
$$ -3630 -13155 -14441 -10950 -6752 -3310 -1021 1368 4438 7496 3992 8502 -3704 -1112 10089 10558
439A0558K531l828B434f63j304I66a006r033K601E148L940b358o485A4306o826
$$ 10558 13089 9261 2434 -663 -1967 966 -1006 -10039 -7438 5148 9088 -2358 -8843 14306 7480
424G480a551o437n377d32A390b36A09c807l032n847K46k06G267l01a0817a980
$$ 7480 -1551 -7988 -13365 -432 1390 -236 109 -3807 -6839 -12686 -12440 -12646 7267 6966 -10817 -1980
407A956g037J772J496o330a733j818l972l861o49L116A325d778m622o10L79O72
$$ 1956 -7037 -5265 -3769 -10099 -1733 -3551 -7523 -11384 -12033 -8917 1325 -4778 -9400 -10010 -9631 -8959
391h959M6o10k021k868L979d691e28A183g473E422j381d613j1003d676k594c138
$$ -8959 -8913 -9523 -11544 -14412 -10433 -4691 -528 1183 -7473 5422 4041 -4613 -15616 -4676 -7270 -3138
374b457j103m35k697k695J056I16e80m865N04a842b78n788J587l074o757L817
$$ -2457 -3560 -3995 -6692 -9387 -8331 916 -580 -5445 -4941 -1842 -278 -6066 -4479 -7553 -14310 -10493
358a0493c753B971N061C244h932b620B773e622a747m982k391k670p8J665K574
$$ -10493 -3753 2971 8032 3244 -8932 -2620 2773 -5622 -1747 -6729 -9120 -11790 -11868 -10203 -7629
343g629K700a585A930L312j780i105k473d441m664L080d98B332i73D44e969l868
$$ -7629 -4929 -1585 1930 5242 3462 -9105 -11578 -4441 -9105 -6025 -498 2332 -973 444 -5969 -9837
327i837m083R63J034O60K273r91l985d487M70m266J089j018k580M848p489L324
$$ -9837 -13920 -12957 -11923 -11263 -8990 -9981 -13966 -4487 -4017 -8283 -7194 -8212 -10792 -5944 -13433 -10109
311a0109a567j181A686J2807j823C101P478k014C246a1739l6171k2961c4013G967
$$ -10109 -1567 -2748 1686 14493 12670 3101 10579 8565 3246 -11739 -47910 -70871 -34013 7967
296F872h500A56M320g792j329q23b131n72a086A2674K120h69p397C28g908n904
$$ 6872 -8500 156 4476 -7792 -9121 -9944 -2131 -2703 -1086 12674 14794 -869 -8266 328 -7908 -13812
280a3812O619g25p422l73J284j192J282b968q0I976l530i023M470a144L78A618
$$ -13812 -7193 -725 -8147 -8520 -7236 -8428 -7146 -2968 -3048 9976 6446 -9023 -4553 -1144 -766 1618
263E348d576B897d260r425f765A664c522I20J1000n897E66c889l098j493J033
$$ 5348 -4576 2897 -4260 -13685 -6765 1664 -3522 920 11920 6023 566 -3889 -6987 -8480 -7447
248g447K231K342q344c71o118c072l887n154e238k83J68R72k822a653d55j896
$$ -7447 -5216 -2874 -11218 -371 -6489 -3072 -6959 -12113 -5238 -5521 -5353 -4381 -7203 -1653 -455 -2351
232b351m291n113l38N907i25j155D575n46q81j289a398j450l548l939J193d305
$$ -2351 -6642 -11755 -12093 -6186 -925 -2080 4575 4029 3148 1859 -1398 -2848 -6396 -10335 -9142 -4305
215e1B392L92d20k707N51k543l109k886K73L887J270a53g2j074j935k264o279
$$ -51 2392 2784 -420 -3127 -2576 -5119 -8228 -11114 -10841 -6954 -5684 -153 -72 -1146 -3081 -5345 -11624
198a1624R95L276k102a37E180f321O41i56a30o507q05j024m419a11n099m980o02
$$ -11624 -10629 -7353 -9455 -137 5180 -6321 -5680 -956 -130 -6637 -7442 -8466 -12885 -111 -5210 -10190 -10792
181a0792L489c533m669j73A586O85b674o397n548A109L74a517A890O656i89p983
$$ -10792 -7303 -3533 -8202 -8375 1586 2271 -2674 -9071 -14619 1109 1483 -1517 1890 8546 -989 -8972
165h972b735H063C106b539n842l950L706L588l998k063j091J10L266K336K1L66
$$ -8972 -2735 8063 3106 -2539 -8381 -12331 -8625 -5037 -9035 -11098 -12189 -12079 -8813 -6477 -6456 -6090
149f090j786k363j456K53K811d038A627N615M963n181C60K38J1053n327k729O013
$$ -6090 -7876 -10239 -11695 -11442 -8631 -4038 1627 7242 12205 7024 360 598 11651 6324 3595 9608
133I608O410l006n391A669d440l994j974n54K417L157a065D272f976A0611j884
$$ 9608 16018 13012 7621 1669 -4440 -8434 -10408 -10962 -8545 -5388 -1065 4272 -6976 10611 8727
118H727a0801C341e444l348J835b283q520L863c356h82k997B64a477l773o031
$$ 8727 -10801 3341 -5444 -8792 -6957 -2283 -10803 -6940 -3356 -882 -3879 264 -1477 -5250 -11281
103a1281k385e636D71g863E04J0401D468J0283k157f694A853P316D556d976o910
$$ -11281 -13666 -5636 471 -7863 504 10905 4468 14751 12594 -6694 1853 9169 4556 -4976 -11886
88a1886N941C92A38h860K650m555k711J986K318K876c070A11a679p599E05L524
$$ -11886 -5945 392 138 -8860 -6210 -10765 -13476 -11490 -9172 -6296 -3070 111 -1679 -9278 505 4029
72D029a0574F19a29m818D259K303J174l804a0136P59L1c066o624l697K560M937
$$ 4029 -10574 619 -129 -4947 4259 6562 7736 3932 -10136 -9377 -9346 -3066 -9690 -13387 -10827 -5890
56e890J580l359m719M880a920H23K35B1b545A137c97D67O051k170G61c218p671
$$ -5890 -4310 -7669 -12388 -7508 -1920 823 1058 21 -2545 1137 -397 467 6518 4348 761 -3218 -10889
39a0889j219k9M911a839C137M095B695d304n842b339j873k642k170K563J683C077
$$ -10889 -12108 -12137 -7226 -1839 3137 7232 2695 -4304 -10146 -2339 -4212 -6854 -9024 -6461 -4778 3077
22C604d801A0227D937b863J400p371p15K865J108J822l947k43k349P73K418J931
$$ 3604 -4801 10227 4937 -2863 -1463 -8834 -9549 -6684 -5576 -3754 -7701 -7944 -10293 -9520 -7102 -5171
6e171J694a185d51p202b45k864
$$ -5171 -3477 -1185 -451 -7653 -245 -3109
0c109
$$ -3109
##PAGE= F1=2344.107961282
##FIRST=     2906.91634943962, 2629.00904605264, 401
##DATA TABLE= (F2++(Y..Y)), PROFILE
1023D01e073A0331J863C577J0257o855b032m65B149q66i841A026d569b167q088
$$ 401 -5073 10331 12194 3577 13834 6979 -2032 -2497 2149 1283 -9841 1026 -4569 -2167 -10255
1008a0255l05K04j109N052b991p560b204n177b769J048j852Q25a85o315Q20I837
$$ -10255 -10560 -10356 -11465 -6413 -2991 -10551 -2204 -7381 -2769 -1721 -3573 -2748 -185 -6500 -5680 9837
991A1807b917m541O52K136l96j896m04J46k292j975L334b960A155J423o56F35
$$ 11807 -2917 -7458 -6806 -4670 -5066 -6962 -7366 -7220 -9512 -11487 -8153 -2960 1155 2578 1922 635
974A053a1193N134a845F110L99I61d358J263n84j7m248l655j640Q84J662K311
$$ 1053 -11193 -6059 -1845 6110 6509 961 -4358 -3095 -3679 -3696 -7944 -11599 -13239 -12355 -10693 -8382
$$ [...]
0e76
##END NTUPLES=nD NMR SPECTRUM
##END=
