##TITLE=Analysis number 314750
Compound Code btb 08843
Project Code adrs
Chemist Name endeavour
##JCAMPDX= 6.0         $$ Bruker NMR JCAMP-DX V2.0
##DATA TYPE= NMR SPECTRUM
##DATA CLASS= NTUPLES
##ORIGIN= Bruker BioSpin GmbH
##OWNER= NMR
$$ XWIN-NMR		Version 3.5
$$ Wed Oct 26 10:29:24 2005 GMT Daylight Time (UT+1h)  MAYBRIDGE\NMR@NMR_250MHZ
##.OBSERVE FREQUENCY= 250.131544655141
##.OBSERVE NUCLEUS= ^1H
##.ACQUISITION MODE= SIMULTANEOUS (DQD)
##.ACQUISITION SCHEME= undefined
##.AVERAGES= 16
##.DIGITISER RES= 18
##SPECTROMETER/DATA SYSTEM= dpx250
##.PULSE SEQUENCE= zg30
##.SOLVENT NAME= CDCl3
##.SHIFT REFERENCE= (INTERNAL, CDCl3, 0, 16.522)
##AUDIT TRAIL= $$ (NUMBER, WHEN, WHO, WHERE, WHAT)
$$ ##TITLE= Audit trail, XWIN-NMR		Version 3.5
$$ ##JCAMPDX= 5.01
$$ ##ORIGIN= Bruker BioSpin GmbH
$$ ##OWNER= NMR
$$ C:\u/data/dgb/nmr/ADRS/11400/pdata/1/auditp.txt
$$ ##AUDIT TRAIL=  $$ (NUMBER, WHEN, WHO, WHERE, WHAT)
(   1,<2005-10-26 10:28:59.14 +100>,<MAYBRIDGE\NMR>,<NMR_250MHZ>,
      <created by zg, POWCHK disabled, PULCHK disabled
       configuration hash MD5:
       62 19 C7 07 E1 42 D1 B7 37 6C 3D D0 77 39 F9 E6
       data hash MD5: 64K
       C5 32 01 5D 40 CA 87 33 95 03 49 C7 02 A4 A2 58>)
(   2,<2005-10-26 10:29:13.82 +100>,<MAYBRIDGE\NMR>,<NMR_250MHZ>,
      <Start of raw data processing
       ef LB = 0.3 FT_mod = 6 PKNL = 1 SI = 32K 
       data hash MD5: 32K
       BF 79 83 A5 65 13 DD 71 9F 15 87 1C 7A 62 AA 56>)
(   3,<2005-10-26 10:29:15.61 +100>,<MAYBRIDGE\NMR>,<NMR_250MHZ>,
      <apk 
       data hash MD5: 32K
       4C FC 05 C9 FA AC 55 A2 35 D3 6A 1C 9D B2 F0 98>)
(   4,<2005-10-26 10:29:16.38 +100>,<MAYBRIDGE\NMR>,<NMR_250MHZ>,
      <abs ABSG = 5 
       data hash MD5: 32K
       E3 B8 25 79 60 4D EB 9A FE 21 F4 6C 42 AD B1 72>)
$$ ##END=
$$ 
$$ hash MD5
$$ 95 07 E5 44 D5 1D 3A 10 E8 E2 40 AC 06 2B 5F 67
##$RELAX= 
##$RELAX= 
##$RELAX= 
##$RELAX= 
##$RELAX= 
##$RELAX= 
##$RELAX= 
$$ Bruker specific parameters
$$ --------------------------
##$DU= <C:\u>
##$EXPNO= 11400
##$NAME= <ADRS>
##$PROCNO= 1
##$TYPE= <nmr>
##$USER= <dgb>
##$AMP= (0..31)
100 100 100 100 100 100 100 100 100 100 100 100 100 100 100 100 100 100 
100 100 100 100 100 100 100 100 100 100 100 100 100 100 
##$AQSEQ= 0
##$AQ_mod= 3
##$AUNM= <au_zg>
##$AUTOPOS= <46 >
##$BF1= 250.13
##$BF2= 250.13
##$BF3= 250.13
##$BF4= 250.13
##$BF5= 500.13
##$BF6= 500.13
##$BF7= 500.13
##$BF8= 500.13
##$BYTORDA= 1
##$CFDGTYP= 0
##$CFRGTYP= 5
##$CHEMSTR= <none>
##$CNST= (0..31)
1 1 145 1 1 1 1 1 1 1 1 1 1 1 1 1 1 1 1 1 1 1 1 1 1 1 1 1 1 1 1 1 
##$CPDPRG= <>
##$CPDPRG1= <>
##$CPDPRG2= <>
##$CPDPRG3= <>
##$CPDPRG4= <mlev>
##$CPDPRG5= <mlev>
##$CPDPRG6= <mlev>
##$CPDPRG7= <mlev>
##$CPDPRG8= <mlev>
##$CPDPRGB= <>
##$CPDPRGT= <>
##$D= (0..31)
0 1 0 0 0 0 0 0 0 0.06 0 0 0 0 0 0 0.0002 0 0 0 0 0 0 0 0 0 0 0 0 0 0 
0 
##$DATE= 1130318937
##$DBL= (0..7)
120 120 120 120 120 120 120 120 
##$DBP= (0..7)
150 150 150 150 150 150 150 150 
##$DBP07= 0
##$DBPNAM0= <>
##$DBPNAM1= <>
##$DBPNAM2= <>
$$ [...]
##$SUBNAM7= <"">
##$SUBNAM8= <"">
##$SUBNAM9= <"">
##$SW= 20.6930455092707
##$SWIBOX= (0..15)
0 0 3 0 0 0 0 0 0 0 0 0 0 0 0 0 
##$SW_h= 5175.983436853
##$TD= 65536
##$TD0= 1
##$TE= 295.16
##$TE2= 300
##$TE3= 300
##$TEG= 300
##$TL= (0..7)
0 120 120 120 120 120 120 120 
##$TP= (0..7)
150 150 150 150 150 150 150 150 
##$TP07= 0
##$TPNAME0= <>
##$TPNAME1= <>
##$TPNAME2= <>
##$TPNAME3= <>
##$TPNAME4= <>
##$TPNAME5= <>
##$TPNAME6= <>
##$TPNAME7= <>
##$TPOAL= (0..7)
0.5 0.5 0.5 0.5 0.5 0.5 0.5 0.5 
##$TPOFFS= (0..7)
0 0 0 0 0 0 0 0 
##$TUNHIN= 0
##$TUNHOUT= 0
##$TUNXOUT= 0
##$USERA1= <user>
##$USERA2= <user>
##$USERA3= <user>
##$USERA4= <user>
##$USERA5= <user>
##$V9= 5
##$VALIST= <valist>
##$VCLIST= <CCCCCCCCCCCCCCC>
##$VD= 0
##$VDLIST= <DDDDDDDDDDDDDDD>
##$VPLIST= <PPPPPPPPPPPPPPP>
##$VTLIST= <TTTTTTTTTTTTTTT>
##$WBST= 1024
##$WBSW= 4
##$XGAIN= (0..3)
0 0 0 0 
##$XL= 0
##$YL= 0
##$YMAX_a= 462252
##$YMIN_a= -538522
##$ZGOPTNS= <>
##$ZL1= 120
##$ZL2= 120
##$ZL3= 120
##$ZL4= 120
##$ABSF1= 16.522
##$ABSF2= -4.171173
##$ABSG= 5
##$ABSL= 3
##$ALPHA= 0
##$AQORDER= 0
##$ASSFAC= 0
##$ASSFACI= 0
##$ASSFACX= 0
##$ASSWID= 0
##$AUNMP= <proc_1d>
##$AZFE= 0.1
##$AZFW= 0.1
##$BCFW= 0
##$BC_mod= 0
##$BYTORDP= 0
##$COROFFS= 0
##$CY= 12.5
##$DATMOD= 1
##$DC= 0
##$DFILT= <>
##$DTYPP= 0
##$F1P= 14.0000005364418
##$F2P= -0.99999901652339
##$FCOR= 0.5
##$FTSIZE= 32768
##$FT_mod= 6
##$GAMMA= 0
##$GB= 0
##$INTBC= 1
##$INTSCL= 1
##$ISEN= 128
##$LB= 0.3
##$LEV0= 0
##$LPBIN= 0
##$MAXI= 10000
##$MC2= 0
##$MEAN= 0
##$ME_mod= 0
##$MI= 0
##$NCOEF= 0
##$NC_proc= -2
##$NLEV= 6
##$NOISF1= 0
##$NOISF2= 0
##$NSP= 0
##$NTH_PI= 0
##$NZP= 0
##$OFFSET= 16.522
##$PC= 1
##$PHC0= -72.86229
##$PHC1= 9.327085
##$PH_mod= 1
##$PKNL= yes
##$PPARMOD= 0
##$PSCAL= 4
##$PSIGN= 0
##$REVERSE= no
##$SF= 250.13
##$SI= 32768
##$SIGF1= 0
##$SIGF2= 0
##$SINO= 400
##$SIOLD= 32768
##$SREGLST= <1H.CDCl3>
##$SSB= 0
##$STSI= 32768
##$STSR= 0
##$SW_p= 5175.98343685301
##$SYMM= 0
##$S_DEV= 0
##$TDeff= 65536
##$TDoff= 0
##$TI= <Analysis number 999999
Compound Code 99
Book Reference 9
Project Code 9>
##$TILT= no
##$TM1= 0
##$TM2= 0
##$TOPLEV= 0
##$USERP1= <user>
##$USERP2= <user>
##$USERP3= <user>
##$USERP4= <user>
##$USERP5= <user>
##$WDW= 1
##$XDIM= 32768
##$YMAX_p= 341669186
##$YMIN_p= -57028
$$ End of Bruker specific parameters
$$ ---------------------------------
##NTUPLES= NMR SPECTRUM
##VAR_NAME=  FREQUENCY,     SPECTRUM/REAL,   SPECTRUM/IMAG
##SYMBOL=    X,             R,               I
##VAR_TYPE=  INDEPENDENT,   DEPENDENT,       DEPENDENT
##VAR_FORM=  AFFN,          ASDF,            ASDF
##VAR_DIM=   32768,         32768,           32768
##UNITS=     HZ,            ARBITRARY UNITS, ARBITRARY UNITS
##FACTOR=    0.157963299565203, 1,           1
##FIRST=     4132.6476996994, 0,             0
##LAST=      -1043.33573715361, 0,           0
##MIN=       -1043.33573715361, -57028,      0
##MAX=       4132.6476996994, 341669186,     0
$$ Real data points
##PAGE= N=1
##DATA TABLE= (X++(R..R)), XYDATA
$$ [...]
17354d027M467l137k640J136k094N130J3027j4240m439K468L566M190r270j2998
$$ -4027 440 -2697 -5337 -4201 -6295 -1165 11862 -2378 -6817 -4349 -783 3407 -5863 -18861
17340a8861k333M998J4812M649J899L237p149N060p950o354P425R895N929o2r923
$$ -18861 -21194 -16196 -1384 3265 5164 8401 1252 6312 -1638 -7992 -567 9328 15257 15195 5272
17325E272q398j9837J0081J3163N128J664K700o122k13J0439K66q498r939K729
$$ 5272 -3126 -22963 -12882 281 5409 7073 9773 3651 3438 13877 14143 5645 -4294 -1565
17311a565l583R711K155j1816o778O311J4413R048n205K661j2991k3877p013K064
$$ -1565 -5148 4563 6718 -5098 -11876 -5565 8848 17896 12691 15352 2361 -21516 -28529 -26465
17297b6465J691P369P554K1012J1760j8706j2557N73k866J454J0206J558Q947
$$ -26465 -24774 -17405 -9851 11161 22921 4215 -8342 -7769 -10635 -9181 1025 2583 11530
17284A1530J574m213j4218n249J624P038K798j3636L92j923O346o787o401M067
$$ 11530 13104 8891 -5327 -10576 -8952 -1914 884 -12752 -12360 -14283 -7937 -14724 -21125 -17058
17270a7058J1051J1447n14K951K907j6196m178l596N844N219K574J6185P391o105
$$ -17058 -6007 5440 4926 7877 10784 -5412 -9590 -13186 -7342 -2123 451 16636 24027 17922
17256A7922k107O377O235j9524k0833P17J2944J5648M293o943r587k539j2808
$$ 17922 15815 22192 28427 8903 -11930 -11213 1731 17379 21672 14729 5142 2603 -10205
17243a0205L255M308L884m77p351j4477N427R445j0o733O073m393J6096j4250
$$ -10205 -6950 -2642 1242 765 -6586 -21063 -15636 -6191 -6201 -12934 -6861 -11254 4842 -9408
17229i408n463q60Q505K404J621m656m785k10p153O766J6622J146l143j619O331
$$ -9408 -14871 -15731 -7226 -4822 -3201 -7857 -12642 -12852 -20005 -13239 3383 4529 1386 -233 6098
17214F098q443j685o033M584J3123J1101o269l483Q608N899o346Q721j3j009K70
$$ 6098 -2345 -4030 -10063 -5479 7644 18745 12476 8993 17601 23500 17154 25875 25862 24853 25123
17199B5123q300j38j3303r999J0587P204O131r221M850J667k685M485J0414O84
$$ 25123 16823 16685 3382 -6617 3970 11174 17305 8084 12934 14601 11916 16401 26815 27499
17185B7499m531j1609j5462p064L214l503K675K86j856J0043M664k193m035N196
$$ 27499 22968 11359 -4103 -11167 -7953 -11456 -8781 -8495 -10351 -308 4356 2163 -1872 3324
17171C324m627j0285l379Q585M790o535K805k132N31q093q665O041o101m954O147
$$ 3324 -1303 -11588 -14967 -6382 -1592 -8127 -5322 -7454 -6923 -15016 -23681 -17640 -23741 -28695 -22548
17156b2548L413L961J5436J4472L768r288j9325K847p74M707J276n281j0349J819
$$ -22548 -19135 -15174 262 14734 18502 9214 -10111 -7264 -8038 -3331 -2055 -7336 -17685 -15866
17142a5866P650q428Q386N571p846J4102K479p461o135q927J5087M765o494r264
$$ -15866 -8216 -16644 -8258 -2687 -10533 3569 6048 -1413 -7548 -16475 -1388 3377 -3117 -12381
17128a2381l90k070J6233K2818J650l910r972l480J2018l919m011m122j4918o429
$$ -12381 -12771 -14841 1392 24210 25860 21950 11978 8498 20516 16597 12586 8464 -6454 -12883
17114a2883O43j886J3292M834K582R766j466q013l166O950K141j796j0445o935
$$ -12883 -12240 -14126 -834 4000 6582 16348 14882 6869 3703 10653 12794 10998 553 -6382
17100f382R367J5206m085l91k395J1934N578n158j5725l064m830J954O792j3707
$$ -6382 2985 18191 14106 13715 11320 23254 28832 23674 7949 4885 55 2009 8801 -4906
17086d906k4654N064J3663N905P378K983J73j7968p539O090m512J9437J542j1522
$$ -4906 -29560 -24496 -10833 -4928 2450 5433 5606 -12362 -19901 -13811 -18323 1114 2656 -8866
17072h866j5774M82J7779O913L637J748j0113N384P398m412n001P453j1030j6491
$$ -8866 -24640 -24158 -6379 534 4171 5919 -4194 1190 8588 4176 -825 6628 -4402 -20893
17058b0893O768Q614O973m173j0725J306M897R06J5808R886j600r115l740m702
$$ -20893 -14125 -5511 1462 -2711 -13436 -12130 -7233 -6327 9481 19367 17767 8652 4912 210
17044B10M476J3621K775q652M345p140r663l008p598K31J1924j0542j3933M021
$$ 210 4686 18307 21082 12430 16775 9635 -28 -3036 -10634 -10403 1521 -9021 -22954 -18933
17030a8933J0051M363j560p399j478l768P959L926J019N632m159j5394R50q051
$$ -18933 -8882 -4519 -6079 -13478 -14956 -18724 -10765 -6839 -5820 -188 -4347 -19741 -18791 -26842
17016b6842K182K401q07o661J4517K281Q944O592j5313j716q88N73K737l838n196
$$ -26842 -24660 -22259 -23066 -29727 -15210 -12929 -3985 2607 -12706 -14422 -15310 -14737 -12000 -15838 -21034
17001b1034r32O429N59p986O9J1309J5992j548n613J197j262K604k292j0489O120
$$ -21034 -21966 -15537 -14978 -22964 -22895 -11586 4406 2858 -2755 -1558 -2820 -216 -2508 -12997 -6877
16986f877k759j1040j2348J3865N167l774n990N945J2431J5659j0106m892J579
$$ -6877 -9636 -20676 -33024 -19159 -13992 -17766 -23756 -17811 -5380 10279 173 -4719 -3140
16973c140J1425k311r253o769M324K026J554N677j520J957j57j2383m428p734
$$ -3140 8285 5974 -3279 -10048 -5724 -3698 -2144 3533 2013 3970 3813 -8570 -12998 -20732
16959b0732J0496J1917L578n241J913n475o347l088k468P127p794J1637J0066
$$ -20732 -10236 1681 5259 18 1931 -3544 -9891 -12979 -15447 -8320 -16114 -4477 5589
16946E589k934k3754o132J9327Q390r972n564R096m856q324k974Q784p211n127
$$ 5589 2655 -21099 -27231 -7904 486 -9486 -15050 -5954 -10810 -19134 -22108 -13324 -20535 -25662
16932b5662J5406O256j6598N311J1109N250P711l246j677o020r695N373M692j888
$$ -25662 -10256 -4000 -20598 -15287 -4178 1072 8783 5537 3860 -2160 -11855 -6482 -1790 -3678
16918c678j0997j6926L508J3010J7441J8899r621o141J1209j3203k7464j4956
$$ -3678 -14675 -31601 -28093 -15083 2358 21257 11636 5495 16704 3501 -23963 -38919
16906c8919K482J1218J9501J687N329q784o378P513n087p587J1130J8660k276
$$ -38919 -36437 -25219 -5718 -4031 1298 -7486 -13864 -6351 -11438 -19025 -7895 10765 8489
16893H489N897K571l878M047j1135m874r802J479N479m196j3044q707j0538Q795
$$ 8489 14386 16957 13079 17126 5991 1117 -8685 -7206 -1727 -5923 -18967 -27674 -38212 -29417
16879b9417J2828J328M357J0317p112P147K1317k459j3419j0820m56P903M883
$$ -29417 -16589 -15261 -10904 -587 -7699 -552 20765 18306 4887 -5933 -6389 1514 6397
16866F397q744o5p443p088m25J7299j570P66N360J766l505j224j1571j0757L499
$$ 6397 -2347 -2412 -9855 -16943 -17368 -69 -1639 -873 4487 6253 2748 1524 -10047 -20804 -17305
16851a7305r53l21M632J190O295j637J1796Q28j2285K738l02M932j0014R988K6933
$$ -17305 -18258 -18579 -13947 -12757 -6462 -8099 3697 4525 -7760 -5022 -5324 -392 -10406 -418 26515
16836B6515O67q922q031J204j0760j246J2763m991k0499l597J1287l991r212M795
$$ 26515 27182 18260 10229 11433 673 -573 12190 7199 -13300 -16897 -5610 -9601 -18813 -14018
16822a4018J1128P847l401m751L478k469p40n373J271O021Q837L475j370j5828
$$ -14018 -2890 4957 1556 -3195 283 -2186 -2926 -8299 -7028 -1007 7830 11305 9935 -5893
16808e893o447r912M527Q302R137K76m309P253j531o103L634N994J1198n369j0103
$$ -5893 -12340 -22252 -17725 -9423 -286 -10 -4319 2934 1403 -4700 -1066 4928 16126 10757 654
16793F54J795m547o33n028Q161j2921p828k063P011J1932o460j0891o399L471
$$ 654 2449 -2098 -2731 -7759 402 -12519 -20347 -22410 -15399 -3467 -9927 -20818 -27217 -23746
16779b3746J3493p260j2885P25N027R879J2638j606O818K640l737j740J0698N684
$$ -23746 -10253 -17513 -30398 -29673 -24646 -14767 -2129 -3735 3083 5723 1986 246 10944 16628
16765A6628N594j5744j3612q89P675K45J1945j2053r403j556J2699M741m1q750
$$ 16628 22222 6478 -7134 -8023 -348 -103 11842 -211 -9614 -11170 1529 6270 6229 -2521
16751b521N065J460j3604j0464J403Q585J714Q976J0687L882l177q371L086q533
$$ -2521 2544 4004 -9600 -20064 -18661 -10076 -8362 614 11301 15183 12006 3635 6721 -1812
16737a812K846k1204m767n58N848J5549J003L283r557j1302N847J6243M529O534
$$ -1812 1034 -20170 -24937 -25495 -19647 -4098 -3095 188 -9369 -20671 -14824 1419 5948 12482
16723A2482j0374l196M136k3601j4365k409O664K3845J8608p764j1705J3519Q382
$$ 12482 2108 -1088 3048 -20553 -34918 -37327 -30663 -6818 11790 4026 -7679 5840 14222
16710A4222q106o705l580R357M007m385j7222m675Q071M75l202J3664P409N302
$$ 14222 6116 -589 -4169 5188 9195 4810 -12412 -17087 -9016 -8541 -11743 1921 9330 14632
16696A4632j3323q203j2441o365l078q6L505P8M903J3660Q701R85K627L951j2898
$$ 14632 1309 -6894 -19335 -25700 -28778 -28864 -25359 -25281 -20378 -6718 1983 2968 5595 9546 -3352
16681c352j8637J368o251P090Q320L132q870L55J1036J371k4Q435J567l539L398
$$ -3352 -21989 -20621 -26872 -19782 -11462 -8330 -17200 -16845 -5809 -4438 -4462 3973 5540 2001 5399
16666E399O230k365n391l637K940j0421q823r038R035K802q215l504O094J656
$$ 5399 11629 9264 3873 236 3176 -7245 -16068 -25106 -16071 -13269 -21484 -24988 -18894 -17238
16652a7238J0876j727P185n030j7885R285L433l497p368J203K462R477N086N726
$$ -17238 -6362 -8089 -904 -5934 -23819 -14534 -11101 -14598 -21966 -20763 -18301 -8824 -3738 1988
16638A988p48n8o58j712R097j5486j3679K503o506R975J3288J0821n027j6437
$$ 1988 1240 1182 524 -1188 7909 -7577 -21256 -18753 -25259 -15284 -1996 8825 3798 -12639
16624a2639j8328j1308J4366j281j653J6592N842k244p46j30J949m527L558L33
$$ -12639 -30967 -42275 -27909 -29190 -30843 -14251 -8409 -10653 -11399 -11529 -9580 -14107 -10549 -10216
16610a0216p825j311P161n036O159p143M691Q657j1488L856K5729N534k7846n666
$$ -10216 -18041 -19352 -12191 -17227 -11068 -18211 -13520 -4863 -16351 -12495 13234 18768 -9078 -14744
16596a4744J0257J6096j7303l909J1810j099l35m495k696K583Q589O492N786K749
$$ -14744 -4487 11609 -5694 -9603 2207 1108 773 -3722 -6418 -3835 4754 11246 17032 19781
16582A9781o206n786L748o69r620Q99M06m496j2737R641R118j2909O231L462n422
$$ 19781 13575 7789 11537 10868 1248 2147 2553 -1943 -14680 -5039 4079 -8830 -2599 863 -4559
16567d559K262m45o493L242J0003R389j808P742M924r109p574q210N520J396N615
$$ -4559 -2297 -2742 -9235 -5993 4010 13399 11591 19333 24257 15148 7574 -636 4884 6280 11895
16552A1895j0798q509L274K1R870k58J0053j377k2351j4333J4780R838o580o142
$$ 11895 1097 -7412 -4138 -4117 5753 5495 15548 14171 -8180 -22513 -7733 2105 -4475 -10617
16538a0617q640K839j539R712L742o567k914l207K704k271m787R050O503l732
$$ -10617 -19257 -16418 -17957 -8245 -4503 -11070 -13984 -17191 -14487 -16758 -21545 -12495 -5992 -9724
16524i724J271q517l190J523K1960R903N990o70j1401j5164o38Q838J887J0364
$$ -9724 -8453 -16970 -20160 -18637 3323 13226 19216 18546 7145 -8019 -8657 181 2068 12432
16510A2432K732o391J568q574p482j181l076L095M922L424P743K542j3596k4q252
$$ 12432 15164 8773 10341 1767 -5715 -6896 -9972 -6877 -1955 1469 9212 11754 -1842 -1866 -10118
16495a0118j1948O80P87M750Q552M152n555k824R631O047K9809o038l0240J0552
$$ -10118 -22066 -21386 -20599 -15849 -7297 -3145 -8700 -11524 -1893 4154 33963 27925 -2315 8237
16481H237Q26j0725j838O953o058K570o272k14p629j1909J3348J2258k0512J4
$$ 8237 9063 -1662 -3500 3453 -2605 -35 -6307 -6521 -14150 -26059 -12711 -453 -20965 -20951
16467b0951J5347P795Q665k724N645Q548j6415J836l565n564k526J5015q695m934
$$ -20951 -5604 2191 10856 8132 13777 22325 5910 7746 4181 -1383 -3909 11106 2411 -2523
16453b523j201n02N706l104n732J080J1109l380k1669r014J1360R219n016o122
$$ -2523 -3724 -4226 1480 -1624 -7356 -6276 4833 1453 -20216 -29230 -17870 -8651 -13667 -19789
16439a9789Q756j84N456j478n256N45p78m343P757N738P000J0939m856k720p932
$$ -19789 -11033 -11217 -5761 -7239 -12495 -11950 -12728 -17071 -9314 -3576 3424 14363 9507 6787 -1145
16424a145k734M623o814l924j6357k973Q303O326L574q699j0108J8437J8031r822
$$ -1145 -3879 744 -6070 -9994 -26351 -29324 -21021 -14695 -11121 -19820 -29928 -11491 6540 -3282
16410c282m486o367M533j2288n840P038o613p292K3328k607J7490J0253K777R823
$$ -3282 -7768 -14135 -9602 -21890 -27730 -20692 -27305 -34597 -11269 -13876 3614 13867 16644 26467
16396B6467J7678k7740k0297m713k286j9124j086Q133N347J0438J5200m049j3664
$$ 26467 44145 16405 -3892 -8605 -10891 -30015 -31101 -22968 -17621 -7183 8017 3968 -9696
16383i696P061j666m010K95r586J595r781P881M805L691J0983J4820k29m336k117
$$ -9696 -2635 -4301 -8311 -8016 -17602 -16007 -25788 -17907 -13102 -9411 1572 16392 16163 11827 9710
16368I710M163L837j012n725j0051p427p97o27j022p078j619o365o90J6625J1637
$$ 9710 13873 17710 16698 10973 922 -6505 -7302 -7929 -8951 -16029 -17648 -24013 -24703 -8078 3559
16353C559j0829O963N822n0q379j0520l242o491K002J3183J215q892j980J0708
$$ 3559 -7270 -307 5515 5465 -2914 -13434 -16676 -23167 -21165 -7982 -6767 -15659 -17639 -6931
16339f931K1744l91j894q34R88j4511l233p901k916J6398R028J43q287J1316j3070
$$ -6931 14813 14422 12528 11694 12682 -1829 -5062 -12963 -15879 519 9547 9690 1403 12719 -351
16324c51j5436j1817J2265L5392J6318l752k4092m243m825J0212m95j1048p191
$$ -351 -15787 -27604 -15339 20053 36371 32619 8527 4284 -541 9671 9176 -1872 -9063
16311i063Q263O931j0234P434O890o601j229R339p4p621m626l735P51k829M069
$$ -9063 -800 6131 -4103 3331 10221 3620 2391 11730 11656 4035 -591 -4326 -3575 -6404 -2335
16296b335R301M118K523j2082L282l010j2081L268J372J2752j568M846j5009o962
$$ -2335 6966 11084 13607 1525 4807 1797 -10284 -7016 -5644 7108 5540 10386 -4623 -11585
16282a1585l738J68k115J4473N913J3083l954j1456J0561l437k0821R02K8152
$$ -11585 -15323 -15155 -17270 -2797 3116 16199 12245 789 11350 7913 -12908 -12006 16146
16269A6146J1630j1746l666n351j7124J0801J211p5j711n951J559j577M563J567
$$ 16146 27776 16030 12364 7013 -10111 690 1901 1826 115 -5836 -4277 -5854 -1291 276
16255B76n660l640k589j787Q023o751j4911n760N055J1103N353l934L084l585
$$ 276 -5384 -9024 -11613 -13400 -5377 -12128 -27039 -32799 -27744 -16641 -11288 -15222 -12138 -15723
16241a5723K507q2q376M128K813N907q122p949K0310j284j654K325j2542P237
$$ -15723 -13216 -13298 -21674 -17546 -14733 -8826 -16948 -24897 -4587 -5871 -7525 -5200 -17742 -10505
16227a0505Q13j3516k239J3476j38p97m628l242N790j2450Q016J4808O256J353
$$ -10505 -9692 -23208 -25447 -11971 -12109 -12906 -17534 -20776 -14986 -27436 -19420 -4612 1644 2997
16213B997J05j4338k347J9454m48r48p345j4250j564J7119J5383n392j4717j0884
$$ 2997 3102 -11236 -13583 5871 5423 4475 -2870 -17120 -18684 -1565 13818 8426 -6291 -17175
16199a7175M654q866O665J8338p713l322J0806j3590k442J042n141N559K924k693
$$ -17175 -12521 -21387 -14722 3616 -4097 -7419 3387 -10203 -12645 -11603 -16744 -11185 -8261 -10954
16185a0954n687N860l071R606K571r238R911p65k200M24J0903n327j138J423j0682
$$ -10954 -16641 -10781 -13852 -4246 -1675 -10913 -1002 -1767 -3967 -3543 7360 2033 895 2318 -8364
16170h364j6733R073K485N970m331j1089m01L786l231n394m867K884j18J6920
$$ -8364 -25097 -16024 -13539 -7569 -11900 -22989 -23390 -19604 -22835 -28229 -33096 -30212 -30330 -13410
16156a3410J1029J7032M468j362j696k0097j337O579N991J2124K175j4546j13
$$ -13410 -2381 14651 19119 17757 16061 -4036 -5373 1206 7197 19321 21496 6950 6837
16143F837k55m506j030Q158k977p985j9143j6906P777K2190J4310l275Q802N847
$$ 6837 6582 2076 1046 9204 6227 -1758 -20901 -37807 -30030 -7840 6470 3195 11997 17844
16129A7844P497M350r305n566n873k1910l2932n369N618J4584Q459K913L07n736
$$ 17844 25341 29691 20386 14820 8947 -12963 -45895 -51264 -45646 -31062 -22603 -19690 -19383 -25119
16115b5119J4608Q089q921j5827j6871j2987J1925K9959J0299J313p44o284j6183
$$ -25119 -10511 -2422 -11343 -27170 -44041 -57028 -45103 -15144 -4845 -3532 -4276 -10560 -26743
16102b6743k521J987r763L721K0239J4201J5329q607o949R050j0054j4167n234
$$ -26743 -29264 -27277 -37040 -33319 -13080 1121 16450 7843 894 9944 -110 -14277 -19511
16089a9511j151J659K4497O597L197l683r018r018J2928R769o727l502q821q394
$$ -19511 -20662 -19003 5494 12091 15288 11605 2587 -6431 6497 16266 9539 6037 -2784 -11178
16075a1178J631P009P146l445N006J1137P346r473l0607L706K014Q770J1717q978
$$ -11178 -9547 -2538 4608 1163 6169 17306 24652 15179 -15428 -11722 -9708 -938 10779 1801
16061A801j2962k919J1629J2066K757K194j3968j3806r558J0106J9356M198k306
$$ 1801 -11161 -14080 -2451 9615 12372 14566 598 -13208 -22766 -12660 6696 10894 8588
16048H588j6923J1565J7141o975p104L428j0904n828m042Q340J6098k382q692
$$ 8588 -8335 3230 20371 13396 6292 9720 -1184 -7012 -11054 -2714 13384 11002 2310
16035B310M036o2n387j4049n457P722K0434Q226r474r324p685l766M358P293J640
$$ 2310 6346 6284 897 -13152 -18609 -10887 9547 17773 8299 -1025 -8710 -12476 -8118 -825 815
16020H15k521j1823l273K839R376m548m309q049J1117Q06O547J5910J1797j5158
$$ 815 -1706 -13529 -16802 -13963 -4587 -9135 -13444 -21493 -10376 -9570 -3023 12887 24684 9526
16006I526o727O980k812M610Q616k077j8116L637J9225j5512k3808M291k516l895
$$ 9526 2799 9779 6967 11577 20193 18116 0 3637 22862 7350 -16458 -12167 -14683 -18578
15992a8578J1185P697L364J4275J724n310N675l18K91j75j3705r878m939J0580
$$ -18578 -7393 304 3668 17943 19667 14357 20032 19714 20005 19830 6125 -3753 -8692 1888
15978A888J7815j4638j6133r158k290p013O613j758O332m117l75J991n833J4866
$$ 1888 19703 5065 -11068 -20226 -22516 -29529 -22916 -24674 -18342 -22459 -22834 -20843 -26676 -11810
15964a1810K1099J7101n202r287j0920j0991J2426M337m54r422K865N702M496
$$ -11810 9289 26390 21188 11901 981 -10010 2416 6753 6299 -3123 -258 5444 9940
15951I940M668P29p062r514M988J0799K393O38k615o025L6K998L899q598j590
$$ 9940 14608 15337 8275 -1239 3749 14548 16941 17579 14964 8939 8975 11973 15872 7274 5684
15936E684r457r491J0597n40N839n273j1675j163k077o153L030M762R112J5077
$$ 5684 -3773 -13264 -2667 -3207 2632 -2641 -14316 -15479 -17556 -23709 -20679 -15917 -6805 8272
15922H272j588p722J250m778l157k334p252J5561Q793o842M181j2938L309o112
$$ 8272 6684 -1038 212 -4566 -7723 -10057 -17309 -1748 7045 203 4384 -8554 -5245 -11357
15908a1357j3012l781Q983J5165m621R415P53j6774O589J2173J5721l430j2173
$$ -11357 -24369 -28150 -19167 -4002 -8623 792 1545 -15229 -8640 3533 19254 15824 3651
15895C651r801p775r513m155K509n262q547N124P124K2607Q883M92n036j6326
$$ 3651 -6150 -13925 -23438 -27593 -25084 -30346 -38893 -33769 -26645 -4038 4845 5337 301 -16025
15881a6025j0120J650Q859J9416R158N834p629k875J371k411j0185p833Q914P972
$$ -16025 -26145 -24495 -15636 3780 12938 18772 11143 8268 9639 7228 -2957 -10790 -1876 6096
15867F096o263N652P102j2358o468j0505j39N869o459J1407J473p23J0191R776
$$ 6096 -167 5485 12587 229 -6239 -16744 -16883 -11014 -17473 -6066 -4593 -5316 4875 14651
15853A4651J7382n125N58L616p245l495k828l725l494q058j2210J3036P609j0203
$$ 14651 32033 26908 27466 31082 23837 20342 17514 13789 10295 2237 -9973 3063 10672 469
15839D69J335O150O948j1743k061M774j158J3129J37Q45J639J92p812N439q279
$$ 469 1804 7954 14902 3159 1098 5872 4714 17843 17980 18825 20464 20656 12844 18283 10004
15824A0004j671J907J224j4956j350K49R819J2436l437J191k926j1094m900k770
$$ 10004 8333 10240 11464 -3492 -4842 -4593 5226 17662 14225 15416 12490 1396 -3504 -6274
15810f274N5o518m83J1326n486j2466l745O473J3531O165k801r602O179m239O26
$$ -6274 -6219 -12737 -13220 -1894 -7380 -19846 -23591 -17118 -3587 2578 -223 -9825 -3646 -7885 -7259
15795g259R256o241k1885k276J1716P787J0920J0159L711N016j2532j1487P25
$$ -7259 1997 -4244 -26129 -28405 -16689 -8902 2018 12177 15888 20904 8372 -3115 -2390
15782b390K940r53J0534J5226k867j1662q617m0R56k816j6455k0375M053K3678
$$ -2390 550 -403 10131 25357 22490 10828 2211 2171 3127 311 -16144 -36519 -32466 -8788
15768h788P660p625m548J009J5687N688j068L083j2691M343J2082O380M424N053
$$ -8788 -1128 -8753 -13301 -12292 3395 9083 8015 11098 -1593 2750 14832 21212 25636 30689
15754C0689p027o19k298r525L674K804j5656j502P912q091j8232N342N419j884
$$ 30689 23662 23043 20745 11220 14894 17698 2042 540 8452 361 -17871 -12529 -7110 -8994
15740h994l824q811L11P798k004P645Q182j5896o8M465k390P631Q48j6703M294
$$ -8994 -12818 -21629 -21318 -13520 -15524 -7879 303 -15593 -15661 -11196 -13586 -5955 -5107 -21810 -17516
15725a7516R741j18o779R232j5325j3317P501K8249L345q514j0694J6313J9915
$$ -17516 -7775 -7893 -14672 -5440 -20765 -34082 -26581 1668 5013 -3501 -14195 2118 22033
15712B2033l271o676p026O078P561M936j9222M957N893M660J380q961k1857j9749
$$ 22033 18762 12086 5060 11138 18699 23635 4413 9370 15263 19923 21303 12342 -9515 -29264
15698b9264p759O860J3384K115p331n36L530P246J7657K144m626M394p90m758
$$ -29264 -37023 -30163 -16779 -14664 -21995 -22531 -19001 -11755 5902 8046 3420 7814 7024 2266
15684B266o710j6209p191K0292J5480K43j3798j0095K144J4866J3560R129j2897
$$ 2266 -4444 -20653 -27844 -7552 7928 8171 -5627 -15722 -13578 1288 14848 23977 11080
15671A1080m208k985p06m030J3052L730m984n932q545j794q089J0464j926j761
$$ 11080 6872 3887 3181 -849 12203 15933 10949 5017 -3528 -5322 -13411 -2947 -4873 -6634
15657f634J927j3731l053J627J3215R80n277l324K285j056j133P820N397Q594
$$ -6634 -4707 -18438 -21491 -19864 -6649 -5669 -10946 -14270 -11985 -13041 -14174 -6354 -957 7637
15643G637j1971M197J3825l06j2175j0703j7133p366J462J3220r65J3721N558
$$ 7637 -4334 -137 13688 13382 1207 -9496 -26629 -33995 -32533 -19313 -20278 -6557 -999
15630i99J802J1245P05k813N57j1368k495j1961J247R4k260L067J9599P173j5575
$$ -999 803 12048 12753 9940 10497 -871 -3366 -15327 -14080 -13986 -16246 -13179 6420 13593 -1982
15615a982q553L62J9648L712j8043L109j414q212O83n245N983J1728m907L62N791
$$ -1982 -10535 -10173 9475 13187 -4856 -1747 -3161 -11373 -10690 -15935 -9952 1776 -3131 -2769 3022
15600C022j0557K245O395K659k335O23K073k810J1923P14M323O519j804j4273
$$ 3022 -7535 -5290 1105 3764 1429 2052 4125 1315 13238 13952 18275 24794 22990 8717
15586H717J369l263K490n494j3483M914p124P57R085K949j2644N605K839L824
$$ 8717 10086 6823 9313 3819 -9664 -4750 -11874 -11117 -2032 917 -11727 -6122 -3283 541
15572E41O052p013J0972p908j6943P288J6367L873P490P975r558k3013P97J7515
$$ 541 6593 -420 10552 2644 -14299 -7011 9356 13229 20719 28694 19136 -3877 -3080 14435
15558A4435O89O461R95m677m322N823J055l417j3067K2j3130O130N543m207K837
$$ 14435 15124 21585 22580 17903 13581 19404 20459 17042 3975 3997 -9133 -3003 2540 -1667 1170
15543A170J286j285O492j3945o487M49J292K718q35M904L396j2828j205M894K2873
$$ 1170 2456 1171 7663 -6282 -12769 -12320 -11028 -8310 -9145 -4241 -845 -13673 -14878 -9984 12889
15528A2889L035k874r14O03R076p663M196M030j5072L499O509j2580j3158M480
$$ 12889 15924 13050 12136 12739 21815 14152 18348 22378 7306 10805 17314 4734 -8424 -3944
15514c944n685j2455m202J6097R057o43N951J852Q362O714j2820l8L377p154l472
$$ -3944 -9629 -22084 -26286 -10189 -1132 -1775 4176 6028 14390 21104 8284 8246 11623 4469 997
15499I97l455p151q067R757K260K030P081P145K916N366P454r620j2699j1029
$$ 997 -2458 -9609 -17676 -7919 -5659 -3629 3452 10597 13513 18879 26333 16713 4014 -7015
15485g015q774P059J943m543l497Q628J2474j956p254N188L255r072k4878p804
$$ -7015 -15789 -8730 -6787 -11330 -14827 -6199 6275 4319 -2935 2253 5508 -3564 -28442 -36246
15471c6246K1198J668M071R973o37o765n213R242N012n475l3017r464J5215J1707
$$ -36246 -15048 -13380 -9309 664 27 -6738 -11951 -2709 2303 -3172 -36189 -45653 -30438 -18731
15457a8731n588Q144p988k063J4614L0l426M889J1011K858l446m845R905P690
$$ -18731 -24319 -16175 -24163 -26226 -11612 -11582 -15008 -10119 892 3750 304 -4541 5364 13054
15443A3054j1810j899K561j875j0650J4059O63p957m617k590N197J0911O314p639
$$ 13054 1244 -655 1906 31 -10619 3440 4103 -3854 -8471 -11061 -5864 5047 11361 3722
15429C722O314r864P366K0028r266k493l324P482n546j5777r400L890k423p14
$$ 3722 10036 172 7538 27566 18300 15807 12483 19965 14419 -1358 -10758 -6868 -9291 -10005
15415a0005N579L493K569P310J9208Q19k0847n164r547j925J6424Q034q444j8580
$$ -10005 -4426 -933 1636 8946 28154 28973 8126 2962 -6585 -8510 7914 15948 7504 -11076
15401a1076M327m163J2397r548l797r675O781J4527J1624L440n9P955l61m171
$$ -11076 -6749 -10912 1485 -8063 -11860 -21535 -14754 -227 11397 14837 14778 22733 22372 18201
15387A8201l735n928j9633k1731J2955J277j7081J229N180R199J0558J2689J2700
$$ 18201 14466 8538 -11095 -32826 -19871 -18594 -35675 -34446 -29266 -20067 -9509 3180 15880
15374A5880j1488k533N980j1892j3014r757r166q79J0840P387Q799k4256m282
$$ 15880 4392 1859 7839 -4053 -17067 -26824 -35990 -36869 -26029 -18642 -9843 -34099 -38381
15361c8381K1582J2185o6P169l244O324J4630j465J0167J626j0936j4758j5974
$$ -38381 -16799 -4614 -4680 2489 -755 5569 20199 18734 28901 30527 19591 4833 -11141
15348a1141j2201j129M461J9087J2104j3696j2757l805N258J4564J6312p38j2941
$$ -11141 -23342 -24471 -20010 -923 11181 -2515 -15272 -19077 -13819 745 17057 16319 3378
15335C378o506k33q245N406l832R777K432q509k576L753M211N380j371p781k39
$$ 3378 -3128 -3361 -11606 -6200 -10032 -255 2177 -6332 -8908 -5155 -944 4436 3065 -4716 -4955
15320d955j316q097j2822J1848P984M845M640K4516q329k3990j0611k89J7086
$$ -4955 -6271 -14368 -27190 -15342 -7358 -2513 2127 26643 18314 -5676 -16287 -16576 510
15307E10j321m54J4726l178j0453k254j082M250j173j9733J822J2261Q935j1065
$$ 510 -811 -1265 13461 10283 -170 -2424 -3506 744 -429 -20162 -18340 -6079 2856 -8209
15293h209j7824j2121P095L305N370M467Q875Q757j5720Q64k333m988J4051J0377
$$ -8209 -26033 -38154 -31059 -27754 -22384 -17917 -9042 -285 -16005 -15141 -17474 -22462 -8411 1966
15279A966m414J4036P877p473j5000j0237p213n248O157n865N565J3816R403p962
$$ 1966 -2448 11588 19465 11992 -3008 -13245 -20458 -25706 -19549 -25414 -19849 -6033 3370 -4592
15265d592m341R489j110k689J329M269K517N677o536j0839M880M059k335m096
$$ -4592 -8933 556 -554 -3243 -1914 2355 4872 10549 4013 -6826 -1946 2113 -222 -4318
15251d318J544M428q329R89O536j4991N114Q820J0384J1723N032L768m556L035
$$ -4318 -2774 1654 -6675 -5686 850 -14141 -9027 -207 10177 21900 26932 30700 26144 29179
15237B9179l04q458k6272k3877M869J5173P883Q040q920J199J2211J883j1450
$$ 29179 28875 20417 -5855 -29732 -24863 -9690 -1807 6233 -2687 -1488 10723 12606 1156
15224A156m892J1310J3704J3847k508o593m508n564k0604J0117J9605P12n266
$$ 1156 -3736 7574 21278 35125 32617 26024 21516 15952 -4652 5465 25070 25782 20516
15211B0516j7251J1277l06j2880p607k156j067r966j1080M393K2932J938L888
$$ 20516 3265 14542 14236 1356 -6251 -8407 -9474 -19440 -30520 -26127 -3195 -1257 2631
15198B631J6932M602j1845j2813j4909j1107J0879Q814o255n60O046J4928M616
$$ 2631 19563 24165 12320 -493 -15402 -26509 -15630 -6816 -13071 -13631 -7585 7343 11959
15185A1959o616K594K248r647j1770j3895J3031K1383n216l668J0057m401k080
$$ 11959 5343 7937 10185 538 -11232 -25127 -12096 9287 4071 403 10460 6059 3979
15172C979N460m734J081l533m460P201L334L824Q401j6808j3252m394k404J724
$$ 3979 9439 4705 5786 2253 -2207 4994 8328 12152 20553 3745 -9507 -13901 -16305 -14581
15158a4581J9726N713j2055O715P602l867p730o887j0689l109J4318J0572L933
$$ -14581 5145 10858 -1197 5518 13120 9253 1523 -5364 -16053 -19162 -4844 5728 9661
15145I661j0597q9p671m656M708j4371k285n429Q743J1513O580J2169L124j4788
$$ 9661 -936 -1025 -8696 -13352 -8644 -23015 -25300 -30729 -21986 -10473 -3893 8276 11400 -3388
15131c388n800J6428j2201o961k320M256K547j430L327M588o77O720L19o031J049
$$ -3388 -9188 7240 -4961 -11922 -14242 -9986 -7439 -8869 -5542 -954 -1631 5089 5408 -623 426
15116D26P779r169q932L097P908K0017P236j6954n287J366J7641O677q404k4916
$$ 426 8205 -964 -9896 -6799 1109 21126 28362 11408 6121 7487 25128 31805 23401 -1515
15102a515k916K0824k97J664p562j1465J1967j261n857M253K2417K651j2128J440
$$ -1515 -4431 16393 16096 17760 10198 -1267 10700 9439 3582 7835 30252 32903 20775 22215
15088B2215o207j2087j6598l825Q004N740N52N972P271q507j0926p88l35q09j259
$$ 22215 16008 3921 -12677 -16502 -8498 -2758 -2206 3766 11037 2530 -8396 -9184 -9519 -10328 -11587
15073a1587O717j406p195o401K928j362j6313p77J0363J0682j350K21j4896l580
$$ -11587 -4870 -6276 -13471 -19872 -16944 -18306 -34619 -35396 -25033 -14351 -15701 -15480 -30376 -33956
15059c3956J0872K866m333M707J5939N016p312L132o154q41J1628O881k716O380
$$ -33956 -23084 -20218 -24551 -19844 -3905 1111 -6201 -3069 -9223 -10064 1564 8445 5729 12109
15045A2109r3o923o649K0308L819j3052p037j0830Q401k699J0728o864O326Q023
$$ 12109 12016 5093 -1556 18752 22571 9519 2482 -8348 53 -2646 8082 1218 7544 15567
15031A5567j2119q829K021R730J054l155K972J1741o032j7879Q970O590O749r883
$$ 15567 3448 -5381 -3360 6370 7424 4269 7241 18982 12950 -4929 4041 10631 17380 7497
15017G497j2035J6137N058o091n209l356n815p820J2178J6133r549j7592k3n880
$$ 7497 -4538 11599 16657 10566 5357 2001 -3814 -11634 544 16677 7128 -10464 -10487 -16367
15003a6367J3354J2238j0384p492J0670J336r111J581J2592l786J186l242q118
$$ -16367 -3013 9225 -1159 -8651 2019 3355 -5756 -4175 8417 4631 5817 2575 -5543
14990e543J148J3455P466j0033j55K6392R750k752j7788n861p279m971j892K969
$$ -5543 -4395 9060 16526 6493 6338 32730 42480 39728 21940 16079 8800 3829 1937 4906
14976D906j5370J726J1391K450L132L142Q131q546k980l612r145o139Q796R120
$$ 4906 -10464 -8738 2653 5103 8235 11377 19508 10962 7982 4370 -4775 -10914 -2118 7002
14962G002P086j512q586J328J2226J3643o364p290n391n672J6090K577j3334n709
$$ 7002 14088 12576 3990 5318 17544 31187 24823 17533 12142 6470 22560 25137 11803 6094
14948F094j1615Q163k020M985P228l326J3809k181j0191p483J773J3169o829r811
$$ 6094 -5521 2642 622 5607 12835 9509 23318 21137 10946 3463 5236 18405 11576 1765
14934A765j0633m244J055Q203J7490m507j529K037n459J3146q681j5341J5276
$$ 1765 -8868 -13112 -12057 -3854 13636 9129 7600 9637 4178 17324 8643 -6698 8578
14921H578O939o237J1423k637m090K466P958m651P432q516k7963r329L069K4760
$$ 8578 15517 9280 20703 18066 13976 16442 24400 19749 27181 18665 -9298 -18627 -15558 9202
14907I202O714n222N158l341o297P270m677j6606o206J1739r35K650O467J0413
$$ 9202 15916 10694 15852 12511 6214 13484 8807 -7799 -14005 -2266 -3201 -551 5916 16329
14893A6329K723K207q074J0325R851q153L027j0501j4057l360J2456K764m887
$$ 16329 19052 21259 13185 23510 33361 25208 28235 17734 3677 317 12773 15537 10650
14880A0650j5637j726R905l81j6445K238J955l52N685J9843q1p231K814L951j2706
$$ 10650 -4987 -6713 3192 2811 -13634 -11396 -9441 -9793 -4108 15735 15654 8423 11237 15188 2482
14865B482N646J582m404K95N216J703J170j3543J1449J1354k437q779j471m425
$$ 2482 8128 9710 5306 5601 10817 12520 13690 147 11596 22950 20513 11734 10263 5838
14851E838q023m232Q324j1967r116Q542J2645P04n699k954K2561J1420M680j070
$$ 5838 -2185 -6417 1907 -10060 -19176 -10634 2011 2715 -2984 -5938 16623 28043 32723 31653
14837C1653j1689j6046j1834K815N475j7681K7L729j068P67P450Q768J0624J7167
$$ 31653 19964 3918 -7916 -5101 374 -17307 -17280 -13551 -14619 -13852 -6402 2366 12990 30157
14823C0157j2016r975k634M544q3j0904k752m253N326J704j663m397J41k363L612
$$ 30157 18141 8166 5532 10076 9993 -911 -3663 -7916 -2590 -886 -2549 -6946 -6805 -9168 -5556
14808e556l084N719J1038k351k290q115J790o560j8917K407K8375K1695j2951
$$ -5556 -8640 -2921 8117 5766 3476 -4639 -2849 -9409 -28326 -25919 2456 24151 11200
14795A1200j0936r161j8144P897J2737Q508K466l815j538j711j997O934n783q069
$$ 11200 264 -8897 -27041 -19144 -6407 2101 4567 752 -786 -2497 -4494 2440 -3343 -11412
14781a1412j974J4376L860K71Q007p150m009Q9k356p38J777r236O106N797j2937
$$ -11412 -13386 990 4850 5121 13128 5978 1969 2058 -298 -1036 741 -8495 -2389 3408 -9529
14766i529P969l65P135J4247J696q170r748q811Q408N845Q39j398j2548l857R285
$$ -9529 -1560 -1925 5210 19457 21153 12983 3235 -5576 2832 8677 9516 8118 -4430 -8287 998
14751I98k873r843j224N28j22R854Q496O732P16J023n768L532j1468o237J4651
$$ 998 -1875 -11718 -12942 -12414 -12536 -2682 5814 12546 13262 14285 8517 12049 581 -5656 8995
14736H995m730j1817K682M540l000n364O105P125p296K997O163P091n834k63M77
$$ 8995 4265 -7552 -4870 -330 -3330 -8694 -2589 4536 -2760 237 6400 13491 7657 7394 7871
14721G871L801P571r059L528m327o472p251n913j533N189K0682k120j325j5338
$$ 7871 11672 19243 10184 13712 9385 2913 -4338 -10251 -11784 -6595 14087 11967 10642 -4696
14707d696q498J2747n747j262k784k48R622j6533r694J1874R190O445J164j2443
$$ -4696 -13194 -447 -6194 -7456 -10240 -10488 -866 -17399 -27093 -15219 -6029 416 1580 -10863
14693a0863j4413O279l152k420K31m04N553K1126R278l586n49L996j0902j3444
$$ -10863 -25276 -18997 -22149 -24569 -24338 -24742 -19189 1937 11215 7629 7080 11076 174 -13270
14679a3270P339J3472o986J890J4780m127j4947M614j074P195K395O7m862M466
$$ -13270 -5931 7541 555 2445 17225 13098 -1849 2765 1691 8886 11281 11348 6486 10952
14665A0952p124L061K293N127K012o540L27j2334p171N325J3730O984p274l995
$$ 10952 3828 6889 9182 14309 16321 9781 10108 -2226 -9397 -4072 9658 16642 9368 5373
14651E373j769L194J809j7309n547L39J730N08q338K516l174K1J1720N660o143
$$ 5373 3604 6798 8607 -8702 -14249 -13910 -12180 -11672 -20010 -17494 -20668 -20647 -8927 -3267 -9410
14636i410K2321Q984N013p541k2043P56N92J9802O948m365j1546q992K1169N329
$$ -9410 12911 21895 26908 19367 -2676 -1920 -1328 18474 25422 21057 9511 519 21688 27017
14622B7017k7796L468k927k768Q59N124o036n318J1934P411J1315j5589k049J166
$$ 27017 -779 2689 -238 -3006 -2147 2977 -3059 -8377 3557 10968 22283 6694 4645 5811
14608E811R511j681j0482O18r819j9362o877J741J6375J0833N129m746j759j607
$$ 5811 15322 13641 3159 3777 -6042 -25404 -32281 -30540 -14165 -3332 1797 -2949 -4708 -6315
14594f315P4L778M123l623K219K111M805o867l610N152Q686p190j0228m594J6676
$$ -6315 -6241 -2463 1660 -1963 256 2367 7172 305 -3305 1847 10533 3343 -6885 -11479 5197
14579E197Q23j3126m097l720j1988M877l619k511J5477P833l614q243J8565J2443
$$ 5197 6020 -7106 -11203 -14923 -26911 -22034 -25653 -28164 -12687 -4854 -8468 -16711 1854 14297
14565A4297k625q145q254O404N924q551m51R582J0510L163j0924j2363J001k717
$$ 14297 11672 3527 -4727 1677 7601 -950 -1401 8181 18691 21854 10930 -1433 -432 -3149
14551c149N681O281k346R788J6100J266o96n854j4692r599K189j4283m745l37
$$ -3149 2532 8813 6467 16255 32355 33621 32925 27071 12379 2780 4969 -9314 -14059 -14396
14537a4396j635q631O657J5317k52m622k241r985R918R995p988M335K546J0497
$$ -14396 -16031 -24662 -18005 -2688 -2940 -7562 -9803 -19788 -9870 125 -7863 -3528 -982 9515
14523I515j34N477l322j3100q531m576k101P947P156L390n51N8J0144Q77r0m507
$$ 9515 9381 14858 11536 -1564 -10095 -14671 -16772 -8825 -1669 1721 1170 1228 11372 12249 12159 7652
14507G652q079J841Q659P137l737J2557p846j2949p705J6542n405j7883l765J961
$$ 7652 -427 1414 10073 17210 13473 26030 18184 5235 -2470 14072 8667 -9216 -12981 -11020
14493a1020p206l006J0206J1036P161K37Q749m671o457l800p165j729k502M702
$$ -11020 -18226 -21232 -11026 10 7171 7408 16157 11486 5029 1229 -5936 -7665 -10167 -5465
14479e465r71l209M976n473P980R641p328J8901Q001m391P634k989j4286j6562
$$ -5465 -6436 -9645 -4669 -10142 -2162 7479 151 19052 27053 22662 30296 27307 13021 -3541
14465c541o489n940J196P315Q985j3431j1282Q810m237p971q03J4588J193m598
$$ -3541 -10030 -15970 -14774 -7459 1526 -11905 -23187 -14377 -18614 -26585 -27388 -12800 -11607 -16205
14451a6205J889J4238J1568l746k1146Q72M911M642l513m706R70R56o430J87J9862
$$ -16205 -14316 -78 11490 7744 -13402 -12530 -7619 -2977 -6490 -11196 -10226 -9270 -15700 -15513 4349
14436D349K0259j6437k67R18j418K009Q342n690r154R554n626l350K392O187O52
$$ 4349 24608 8171 7904 8822 7404 9413 17755 12065 2911 12465 6839 3489 5881 12068 12720
14421A2720j831j442j763m911K332j0988n897r12J1000Q605j502j3223K106j880
$$ 12720 10889 9447 7684 2773 5105 -5883 -11780 -12692 -1692 6913 5411 -7812 -5706 -7586
14407g586p10m837p756j015L384J8089R959n533k6790p24K3660R859j93j1764
$$ -7586 -8296 -13133 -20889 -21904 -18520 -431 9528 3995 -22795 -23519 141 10000 9807 -1957
14393a957M445J8223L694q383j4719R313K819L693o886r195Q915L763r481k503
$$ -1957 2488 20711 24405 16022 1303 10616 13435 17128 10242 1047 9962 13725 4244 1741
14379A741Q963M86O80Q380j688j5795j4050N433P020m638j4756l155J6918M647
$$ 1741 10704 11190 11870 20250 18562 2767 -11283 -5850 1170 -3468 -18224 -21379 -4461 186
14365A86l762j2527K302L198K0431M415N47M057K49k0515j6047q986J2513k179
$$ 186 -3576 -16103 -13801 -10603 9828 14243 14790 18847 19096 -1419 -17466 -26452 -13939 -16118
14351a6118k872n23L332N308n288M196J2725q866j566Q120P09L215N369o550j6061
$$ -16118 -18990 -19513 -16181 -10873 -16161 -11965 760 -8106 -9672 -1552 -843 2372 7741 1191 -14870
14336a4870j3119J4541l742L284J1177J3784K050j4743q115J1199l157l706L689
$$ -14870 -27989 -13448 -17190 -13906 -2729 11055 13105 -1638 -9753 1446 -1711 -5417 -1728
14323a728K887M485J3779j693j1794L754K406p625m774o102j7188k190R858J323
$$ -1728 1159 5644 19423 17730 5936 9690 12096 4471 -303 -6405 -23593 -25783 -15925 -14602
14309a4602J5832O133j3601j0415k459M94k462k7k787j2647m956J508P672J7762
$$ -14602 1230 7363 -6238 -16653 -19112 -18618 -21080 -21107 -23894 -36541 -41497 -39989 -32317 -14555
14295a4555R712O670m256o742O08m896q13J6253L298L913Q164N577N184m191j0710
$$ -14555 -4843 1827 -2429 -9171 -8563 -13459 -14272 1981 5279 9192 17356 22933 28117 23926 13216
14280A3216M660J778O114p97k450j038p40J1638j0652m307J966r930N283r641
$$ 13216 17876 19654 25768 24971 22521 21483 20743 32381 21729 17422 19388 9458 14741 5100
14266E100k0133J6023O847M496j5849j9497J164P920K861J7080K2246J1941j5335
$$ 5100 -15033 990 7837 12333 -3516 -23013 -21849 -13929 -11068 6012 28258 40199 24864
14253B4864j5695j009n288q930J0523L918q048o252P943O126P003j1631j361q45
$$ 24864 9169 8160 2872 -6058 4465 8383 335 -5917 2026 8152 15155 3524 2163 1318
14239A318P90Q939l009m09m095J6241M96P85j345j1003J7579q985o118r056n896
$$ 1318 2108 11047 8038 7629 3534 19775 20271 21056 19711 8708 26287 17302 11184 2128 -3768
14224c768J2918M47M140J297j7869k120N936l06L456K957p6k510j998N104j2099
$$ -3768 9150 9597 13737 15034 -2835 -4955 981 675 4131 7088 7012 4502 2504 7608 -4491
14209d491l717P642j55n681J6470R25Q278j1179k758R176q652J284K889o402k913
$$ -4491 -8208 -566 -721 -6402 10068 10993 19271 8092 5334 14510 5858 7142 10031 3629 716
14194G16j2971R266L808o272M13J9730m449j4443l890q450n2J1845Q862J5935
$$ 716 -12255 -2989 819 -5453 -5040 14690 10241 -4202 -8092 -16542 -16594 -4749 4113 20048
14180B0048j6451m065j1996J879m319p443J8935O758L522j946m337N171j087j5191
$$ 20048 3597 -468 -12464 -10585 -14904 -22347 -3412 3346 6868 4922 585 5756 4669 -10522
14166a0522K349J1582M797L75M12o681l368o783P00M891j1135j5926J2975K4332
$$ -10522 -8173 3409 8206 8581 8993 2312 -1056 -7839 -7139 -2248 -13383 -29309 -16334 7998
14152G998L330q647J0183O600q335k803j5663K959N538L303m927j2503M179J2155
$$ 7998 11328 2681 12864 19464 11129 8326 -7337 -4378 1160 4463 -464 -12967 -8788 3367
14138C367J0626O691r048q959R625J1700j816q977j1420l953J442M147k3271l295
$$ 3367 13993 20684 11636 2677 12302 24002 22186 13209 1789 -2164 -722 3425 -19846 -23141
14124b3141K0097N128r978J887k886%k342K902j432M830J8968J9498m336j1336
$$ -23141 -3044 2084 -7894 -6007 -8893 -8893 -11235 -8333 -9765 -4935 14033 33531 29195 17859
14110A7859j6423j5015L425k658k205J748P457J9291k031q260k835j12L562J4900
$$ 17859 1436 -13579 -10154 -12812 -15017 -13269 -5812 13479 11448 3188 353 241 3803 18703
14096A8703l315l447n928J812o18j922q23j9339R068L877p901L422o13O262l533
$$ 18703 15388 11941 6013 7825 7207 5285 4462 -14877 -5809 -1932 -9833 -6411 -7024 -762 -4295
14081d295m829J665m065M116L330J0407M094j3541L326R155p752M886p517o182
$$ -4295 -9124 -7459 -11524 -7408 -4078 6329 10423 -3118 208 9363 1611 6497 -1020 -7202
14067g202N434P370J2836j1579r168M403J726J0005N539O931j0617P24j028q005
$$ -7202 -1768 5602 18438 6859 -2309 2094 3820 13825 19364 26295 15678 16402 15374 7369
14053G369k3641r648J8316N354n740L959J3029J044O224J4016L16p976J906q014
$$ 7369 -16272 -25920 -7604 -2250 -7990 -4031 8998 10042 16266 30282 30598 22622 24528 16514
14039A6514r799k32j5526q86R114O105l141K655J4005J160q239q200l582O442
$$ 16514 6715 6483 -9043 -9929 -815 5290 2149 4804 18809 19969 11730 3530 -52 6390
14025F390J0731N717O373j0672j0230J6657L396j5182r054o513q193J987R790
$$ 6390 17121 22838 29211 18539 8309 24966 28362 13180 4126 -2387 -10580 -8593 1197
14012A197j997k711j508j2948R737J374N5m76K033q758K990k721o944P397O171
$$ 1197 -800 -3511 -5019 -17967 -8230 -6856 -6801 -7277 -5244 -14002 -11012 -13733 -20677 -13280 -7109
13997g109P746J0781Q505o188j5282j2772J0435K113j200K673r2o643k0826k388
$$ -7109 637 11418 19923 13735 -1547 -14319 -3884 -1771 -2971 -298 -390 -7033 -27859 -30247
13983c0247O320N469l038J224R664J4691n173J356J0727K1181o644p421q697L739
$$ -30247 -23927 -18458 -21496 -20272 -10608 4083 -1090 266 10993 32174 25530 18109 9412 13151
13969A3151J1555j7224k420q502L440P712k990J776n798j136L913j1080n249j943
$$ 13151 24706 7482 5062 -3440 0 7712 4722 6498 700 -436 3477 -7603 -12852 -14795
13955a4795J866L22K135J5541Q473M280o436r920m339j0971J2772J9510O141r912
$$ -14795 -12929 -12607 -10472 5069 13542 17822 11386 1466 -2873 -13844 -1072 18438 24579 14667
13941A4667p359m447R59l157k82r00O081n798K127L522j1368N458j116p625J1879
$$ 14667 7308 2861 3820 663 381 -519 5562 -236 1891 5413 -5955 -497 -1613 -9238 2641
13926B641j529p47L282q62j2927q895J5414O332j9126j4756O940M298P693J8455
$$ 2641 1112 365 3647 2785 -10142 -19037 -3623 2709 -16417 -31173 -24233 -19935 -12242 6213
13912F213J0174J527n405R31m951j2956o640M741M312o62o755L012P875O52l881
$$ 6213 16387 17914 12509 13440 8489 -4467 -11107 -6366 -2054 -2716 -9471 -6459 1416 2068 -1813
13897a813k329j1929k538J971o723Q198M610k062O553K0509K2657L65k21r972
$$ -1813 -4142 -16071 -18609 -16638 -23361 -15163 -10553 -12615 -6062 14447 37104 37469 37248 27276
13883B7276j2586j978n271m006j212N710J2043p226j7706K536M80j681J9507j587
$$ 27276 14690 12712 7441 3435 2223 7933 19976 12750 -4956 -2420 -1940 -3621 15886 14299
13869A4299j4174q557O521M352p78J1719N075j199l929q862l454m795j2725r862
$$ 14299 125 -8432 -1911 2441 1663 13382 18457 17258 13329 4467 1013 -3782 -16507 -26369
13855b6369m07J5868L426j3750l295n570P915K2188J0684l630l581j4361R142
$$ -26369 -26776 -10908 -7482 -21232 -24527 -30097 -22182 6 10690 7060 3479 -10882 -1740
13842a740Q747J93J8528J4861j883j9660k1137j996k88L664O407o036l633l230
$$ -1740 7007 7200 25728 40589 38706 19046 -2091 -4087 -4375 -711 5696 -340 -3973 -7203
13828g203n296Q448J26n055l318n574n701L520R486J485l146O740J7308p457j5502
$$ -7203 -12499 -4051 -3925 -8980 -12298 -17872 -23573 -20053 -10567 -9082 -12228 -5488 11820 4363 -11139
13813a1139L55J403P837Q526q704j0399L102J0967L932M175o276m848O659L874
$$ -11139 -10784 -9381 -1544 6982 -1722 -12121 -9019 1948 5880 10055 3779 -1069 5590 9464
13799I464n283j1890O839K781N660J2537R103k602k6268j4673m264o969k095Q143
$$ 9464 4181 -7709 -870 1911 7571 20108 29211 26609 341 -14332 -18596 -25565 -27660 -19517
13785a9517O539J6516R932J0525o610k114J6662J2168q801k6701j4032m696J1940
$$ -19517 -12978 3538 13470 23995 17385 15271 31933 44101 35300 8599 -5433 -10129 1811
13772A811p774J650Q290M06n770o252K356J0806j1855r385k422j063J3679K187
$$ 1811 -5963 -4313 3977 4383 -1387 -7639 -5283 5523 -6332 -15717 -18139 -19202 -5523 -3336
13758c336P371J0910l178j1245r667j3468L814J6759P160p710j5494p47J7890
$$ -3336 4035 14945 11767 522 -9145 -22613 -18799 -2040 5120 -2590 -18084 -18831 -941
13745i41J7072M695k534M185L971m872o340k960R060Q625M609k6386k0567J7240
$$ -941 16131 20826 18292 22477 26448 21576 15236 12276 21336 29961 34570 8184 -12383 4857
13731D857k043j1717j5276r43Q467J2402P946N162K991L254J2282M002M435p271
$$ 4857 2814 -8903 -24179 -25122 -16655 -4253 3693 8855 11846 15100 27382 31384 35819 28548
13717B8548m851m924J1006K546O396K937k1573j4027o637J7280q237j5893o057
$$ 28548 23697 18773 29779 32325 38721 41658 20085 6058 -579 16701 8464 -7429 -13486
13704a3486j76J1187K425N676j0070p985J6029l492o242J6233O397Q586o737r978
$$ -13486 -13662 -2475 -50 5626 -4444 -12429 3600 108 -6134 10099 16496 25082 18345 8367
13690H367m705j9915K1780J2459P562L700r877k793Q56n981j1050j0471J0429
$$ 8367 3662 -16253 5527 17986 25548 29248 19371 16578 17434 11453 403 -10068 361
13677C61r499R549N227p167M845M194P536j1903j4416O03K785J9346J5051P68
$$ 361 -9138 411 5638 -1529 3316 7510 15046 3143 -11273 -10670 -7885 11461 26512 27280
13663B7280j3933n828P603N05r415K0N344m977J9758J1255j011j8727k2027J215
$$ 27280 13347 7519 15122 15627 6212 6232 11576 6599 26357 37612 36601 17874 -4153 -2938
13649b938P048J0692q938r249J053J1278M445p686J164K271J61o251k859J4028
$$ -2938 4110 14802 5864 -3385 -2332 8946 13391 5705 6869 9140 9301 3050 191 14219
13635A4219L918J0624J3604k1161j3632L711K552L372J324j3016P37J4986N374
$$ 14219 18137 28761 42365 21204 7572 11283 13835 17207 18531 5515 6252 21238 26612
13622B6612j4255o920r309q080k986J0378Q998J6227O684J137j6057N98J1636
$$ 26612 12357 5437 -3872 -11952 -14938 -4560 4438 20665 27349 28486 12429 13027 24663
13609B4663j7341n30Q111J165j2007j2398j1477P049j835R499O478J3383N588
$$ 24663 7322 6792 14903 16068 4061 -8337 -19814 -12765 -14600 -5101 1377 14760 20348
13596B0348N523M379j069m242n465j5680p928o638L528J6157P241j2362n679j1073
$$ 20348 25871 30250 29181 24939 19474 3794 -4134 -10772 -7244 8913 16154 3792 -1887 -12960
13582a2960l742o367R194K1479P519k9678j5929L593J2256K544M200P871K014
$$ -12960 -16702 -23069 -13875 7604 15123 -14555 -30484 -26891 -14635 -12091 -7891 -20 1994
13569A994k624p50M969j9422j079J8350J4296l593K806j765R110L421p157j0249
$$ 1994 -630 -1380 3589 -15833 -16912 1438 15734 12141 14947 13182 22292 25713 18556 8307
13555H307k1522p475M777k407L466K902J371M111O439j4836K094L78J1550R455
$$ 8307 -13215 -20690 -15913 -18320 -14854 -11952 -10581 -6470 -31 -14867 -12773 -12395 -845 8610
13541H610Q667L723M901j4287M250J0561m128O29O834L003m017O0J4891J0584
$$ 8610 17277 21000 25901 11614 15864 26425 22297 22926 29760 32763 28746 28806 43697 54281
13527E4281M3169O1260R2053R4720j3089p3560n8631n4299n0278l8996k1592p722
$$ 54281 97450 158710 250763 345483 332394 258834 200203 145904 95626 56630 35038 27316
13515B7316q488n265r228l372j672m572L008J315j1594Q586J1101J668P20k124
$$ 27316 18828 13563 4335 963 -709 -5281 -2273 -958 -12552 -3966 7135 8803 9523 7399
13501G399l996Q61k718j0200j0821R283Q238J6057K286j729r052o231J4256k417
$$ 7399 3403 4264 1546 -8654 -19475 -10192 -1954 14103 16389 14660 5608 -623 13633 11216
13487A1216j2643n842l885R890K2076J7833j4500k1867k147m08O990M941p253
$$ 11216 -1427 -7269 -11154 -1264 20812 38645 24145 2278 131 -277 6713 11654 4401
13474D401J3095o168r539K79l569J6810m544j3488n919L417j5213K679J3609J2791
$$ 4401 17496 11328 1789 2068 -1501 15309 10765 -2723 -8642 -5225 -20438 -17759 -4150 8641
13460H641l557J78L336J3431O792m073m92N063Q50p661j0215K31p795q567o339
$$ 8641 5084 5262 8598 22029 28821 24748 24256 29319 30169 22508 12293 12524 4729 -3838 -10177
13445a0177K794K61J2473J3291l197L52P891J099j8474j881j329N996J519p582
$$ -10177 -7383 -7122 5351 18642 15445 15797 23688 24787 6313 4432 3103 9099 10618 3036
13431C036J4249J598n597R79n556Q14M720n437Q696m309n893K465R303K273r408
$$ 3036 17285 18883 13286 14265 8709 9523 14243 8806 17502 13193 7300 9765 19068 21341 11933
13416A1933k6468j818o049K013J4085J2164J3646J1148M366o916o046j237j7369
$$ 11933 -14535 -16353 -22402 -20389 -6304 5860 19506 30654 35020 28104 22058 20821 3452
13403C452k092J4068J0531l068r487j1909n900R356Q108J1598r220P428q038j2074
$$ 3452 1360 15428 25959 22891 13404 1495 -4405 4951 13059 24657 15437 22865 14827 2753
13389B753j913M857j02L397J0549O497p973P287O651j0779m598j0838j5766O312
$$ 2753 840 5697 5595 8992 19541 26038 18065 25352 32003 21224 16626 5788 -9978 -3666
13375c666J8776Q097L006L651j4681M465Q623k51j1787m330J0753r82k874j679
$$ -3666 15110 23207 26213 29864 15183 19648 28271 28020 16233 11903 22656 21674 18800 17121
13361A7121K094j502J2436q782k028j1209J1453o605j2127m521O151K276j4694
$$ 17121 19215 17713 30149 21367 19339 8130 19583 12978 851 -3670 2481 4757 -9937
13348i937J359J6130Q411n855n882r397K290K298P748j2341Q70r369L651R168
$$ -9937 -8578 7552 15963 10108 4226 -5171 -2881 -583 7165 -5176 -4306 -13675 -10024 -856
13334h56Q15M323O757j723O956L683L807j6167k6431J0212L860N668J2341K0364
$$ -856 -41 4282 11039 9316 16272 19955 23762 7595 -18836 -8624 -4764 904 13245 33609
13320C3609M794j115Q153k301K328o446k464n543j1015n332J0475j0664j1530
$$ 33609 38403 37288 45441 43140 45468 39022 36558 31015 20000 14668 25143 14479 2949
13307B949R750M904Q504n811j1413O56N32l640P714o009K663j8626q511O959k639
$$ 2949 12699 17603 26107 20296 8883 9539 10071 6431 14145 8136 10799 -7827 -16338 -9379 -12018
13292a2018N828O195n669N048K635l114M246M976M501j2699j1042P823J9666l315
$$ -12018 -6190 5 -5664 -616 2019 -1095 3151 8127 12628 -71 -11113 -3290 16376 13061
13278A3061j5444N765K059O653k874K098R083r524k2159k122j0102Q166J758J2560
$$ 13061 -2383 3382 5441 12094 9220 11318 20401 10877 -11282 -13404 -23506 -15340 -13582 -1022
13264a022R883J777ln19R35r193N291K088l3j0983J823Q610J2776m399j3342n271
$$ -1022 8861 10638 10635 10116 11051 1858 7149 9237 9204 -1779 44 8654 21430 17031 3689 -1582
13248a582P443J343j215P290R156n824l770J2978j0461l249j7827P801P162M926
$$ -1582 5861 7204 5989 13279 22435 16611 12841 25819 15358 12109 -5718 2083 9245 14171
13234A4171l902P752j17k012o30k80K819j7172o043O132M243J754J4478J7056
$$ 14171 10269 18021 17904 15892 15262 14982 17801 629 -5414 718 4961 6715 21193 38249
13220C8249k229j1376j0927j2712N538P701j1765l623J0113J0707J5044j685q003
$$ 38249 36020 24644 13717 1005 6543 14244 2479 -1144 8969 19676 34720 33035 25032
13207B5032O821M113l902j5447N767j151n981K442o054O963j692P70J1702l677
$$ 25032 31853 35966 32064 16617 22384 21233 15252 17694 11640 18603 16911 17681 29383 25706
13193B5706j601r278j940k513J8164J2830J601r499j5001L597P142L921L114O392
$$ 25706 24105 14827 12887 10374 28538 41368 42969 33470 18469 22066 29208 33129 36243 42635
13179D2635J1346L892j911q388j4330j1491p063O394K0418J2273q523j2620J087
$$ 42635 53981 57873 55962 47574 33244 21753 14690 21084 41502 53775 45252 32632 33719
13166C3719O729r285J4930Q842k316j6352l519L00L775q945n442N233N607J1100
$$ 33719 40448 31163 46093 54935 52619 36267 32748 33048 36823 27878 22436 27669 33276 44376
13152D4376L341q282p223J675J1136M66J189J0167O077J1808K4550L1093K8783
$$ 44376 47717 39435 32212 33887 45023 45489 46678 56845 62922 74730 99280 130373 159156
13139A59156L9892O5552J17539K00024L52837M84964L27964p5913k87391k99058
$$ 159156 199048 264600 382139 582163 935000 1419964 1747928 1672015 1384624 1085566
13129A085566k82924k27690j53119j02698p4368o1210k3958j2704q031j4537k2838
$$ 1085566 802642 574952 421833 319135 244767 183557 159599 146895 138864 124327 101489
13118A01489O86R93k1285r334q678o302j0335N187J6420j2271k0444J22N144P086
$$ 101489 102175 103168 81883 72549 63871 57569 47234 52421 68841 56570 36126 36248 41392 48478
13104D8478j0308j284K811o917L54K84r040o780J4218M953l219j918Q091R545
$$ 48478 38170 36886 39697 32780 33134 33418 24378 17598 31816 36769 33550 31632 39723 49268
13090D9268P948j2628j3289O634n257K489N316o765r568N851r355j6498k89j344
$$ 49268 57216 44588 31299 37933 32676 35165 40481 33716 24148 29999 20644 4146 3857 2513
13076B513M467O747p356j4633j716Q190K2660J9857j05r090j3726L974J7642q44
$$ 2513 6980 13727 6371 -8262 -9978 -1788 20872 40729 40624 31534 17808 21782 39424 38580
13062C8580p273J896k2221l966J3718K379m910K551J156l820K72o010K3222J694
$$ 38580 31307 33203 10982 7016 20734 23113 18203 20754 21910 18090 18362 12352 35574 37268
13048C7268j7195j492J7386k002K897M910l951j0617O549N955j6913K489J2199
$$ 37268 20073 18581 35967 33965 36862 41772 37821 27204 33753 39708 22795 25284 37483
13035C7483L205J4711J0060j4833j2596k67k075P410J413j0258K864j1823k067
$$ 37483 40688 55399 65459 50626 38030 37763 35688 43098 44511 34253 37117 25294 23227
13022B3227j4736J814Q300P085R690J431r714p673J0433P749j3874k339k345n174
$$ 23227 8491 10305 18605 25690 35380 36811 27097 19424 29857 37606 23732 21393 19048 13874
13008A3874J4568J1536j1076j1179O240J1881Q020j1031j0382P800J2301Q380
$$ 13874 28442 39978 28902 17723 23963 35844 43864 32833 22451 30251 42552 50932
12996E0932k112j059N35p136J557o248m714L249N393P913j746J137J6281O111
$$ 50932 48820 47761 48296 41160 42717 36469 31755 35004 40397 48310 46564 47701 63982 70093
12982G0093j498n08j7331j9493m758Q062P422m281m165k4214k0057j5611o353
$$ 70093 68595 68087 50756 31263 26505 34567 41989 37708 33543 9329 -10728 -26339 -32692
12969c2692J7953J2220O722O216j270J8573Q950j0040j1149Q310P110R887j407
$$ -32692 -14739 -2519 4203 10419 9149 27722 36672 26632 15483 23793 30903 40790 39383
12956C9383J1792p326l676k523q292l245J1746J2101J3352r611j7826k0676P208
$$ 39383 51175 43849 40173 37650 29358 26113 37859 49960 63312 53701 35875 15199 22407
12943B2407M579m080j0500j1374J2353O552O765k851P539N712j1510q46K0252
$$ 22407 26986 22906 12406 1032 13385 19937 26702 23851 31390 37102 25592 24746 44998
12930D4998J9426O374p359K3562K552J2321J4212J9094K8713L4451n557l2798
$$ 44998 64424 70798 63439 87001 89553 101874 116086 135180 163893 198344 192787 159989
12918A59989J2681q632k7377l3208j7187m612R370J2406o708j2907j9772r043
$$ 159989 172670 164038 136661 103453 86266 81654 91024 103430 96722 83815 64043 55000
12906E5000j5850p611N57o504l057M221K682R797R005Q811Q842q592M19Q798k026
$$ 55000 39150 31539 32096 25592 22535 26756 29438 39235 48240 57051 65893 57301 57720 66518 64492
12891F4492P668N885j4086m060k40J4971M519j3309j3748j0218n968R52N11J1594
$$ 64492 72160 78045 63959 59899 59659 74630 79149 65840 52092 41874 35906 36858 37369 48963
12877D8963L898j6499K994P334J4526J0871J8570N642j1206n464j966O085R977
$$ 48963 52861 36362 39356 46690 61216 72087 90657 96299 85093 79629 77663 83748 93725
12864I3725j180j4241l8487n4541j5347J5268j0636j6413j282j1163K0079K1487
$$ 93725 92545 78304 39817 -14724 -30071 -14803 -25439 -41852 -43134 -54297 -34218 -12731
12852a2731n059j9558q260P976K0720J5826J8652L377K897p264Q832K3322J6608
$$ -12731 -17790 -37348 -45608 -37632 -16912 -1086 17566 20943 23840 16576 25408 48730 65338
12839F5338K1037K3613q93M853k95m114n066J1835J3826j2341j030M215J3396
$$ 65338 86375 109988 109095 113948 113653 109539 104473 116308 130134 117793 116763 120978 134374
12826A34374j1439k2176k3424j4339j6395k6055k6676J1412K3459P257J2811J5456
$$ 134374 122935 100759 77335 62996 46601 20546 -6130 5282 28741 35998 48809 64265
12814F4265R355N236P147p201k8183r452M565R254K818l838k591J1042J8946N884
$$ 64265 73620 78856 86003 78802 50619 41167 45732 54986 57804 53966 51375 62417 81363 87247
12800H7247O823K8727J4751r891r853o371N565J5110J3281L150L955J2542J541
$$ 87247 94070 122797 137548 127657 117804 111433 116998 132108 145389 148539 152494 165036 166577
12787A66577J040P542j1265r824J3538N420K2623R564J6203J3436m911l428N045
$$ 166577 167617 175159 163894 154070 167608 173028 195651 205215 221418 234854 229943 226515 231560
12774B31560J482j0409k8790r721J5697J6860J7072r609j4339j5784m563J7735
$$ 231560 233042 222633 193843 184122 199819 216679 233751 224142 209803 194019 189456 207191
12762B07191K0725O679l264k362L454q815J3877J0283n211j7898r277p160o710
$$ 207191 227916 234595 231331 228969 232423 223608 237485 247768 242557 224659 215382 208222 201512
12749B01512j5126J9817L5381J3119j2859j6091O635J2565j702k1254j6122k5213
$$ 201512 186386 206203 241584 254703 241844 225753 232388 244953 243251 221997 205875 180662
12737A80662k443K0219L7616L9172M8032M9927M2322L3878K6679J0022K1901J6295
$$ 180662 178219 198438 236054 275226 323258 373185 415507 449385 476064 486086 507987 524282
12725E24282l061j1309k4104k2650K986J9433L8282M7084M0106K9795L7886N6129
$$ 524282 521221 509912 485808 463158 466144 485577 523859 570943 611049 640844 678730 734859
12713G34859O9902P4626M6357J1372J0277K1740L8256O4935M5239L2896L1001
$$ 734859 804761 879387 925744 937116 947393 969133 1007389 1072324 1117563 1150459 1181460
12702A181460O0867Q5272Q8822R6623J02948Q2298J15748J34487J40413J69691
$$ 1181460 1242327 1327599 1416421 1513044 1615992 1698290 1814038 1948525 2088938 2258629
12692B258629J73535J28520J36800J76315K40757L53789N16980P02491Q67145
$$ 2258629 2432164 2560684 2697484 2873799 3114556 3468345 3985325 4687816 5554961
12683E554961J105962J297871J254343J307523J748616K533294L741344N571684
$$ 5554961 6660923 7958794 9213137 10520660 12269276 14802570 18543914 24115598
12675B4115598Q266896J2920267K2065310L9965135P0293486R7314704O0695315
$$ 24115598 32382494 45302761 67368071 107333206 177626692 274941396 335636711
12668C35636711k1390499n5824336n7059930n3453808m4981969l1549427k0551799
$$ 335636711 314246212 258421876 201361946 147908138 102926169 71376742 50824943
12661E0824943j3086136q244339n282950l423416k292742j860488j894368j805918
$$ 50824943 37738807 29494468 24211518 20788102 18495360 16634872 14740504 12934586
12653A2934586j566586j308567j082938r17458p73003o72623n97635n12905m25166
$$ 12934586 11368000 10059433 8976495 8059037 7286034 6613411 6015776 5502871 5077705
12644E077705l65576k79477k24196j75187j64012k25275k59530k08831j69312
$$ 5077705 4712129 4432652 4208456 4033269 3869257 3643982 3384452 3175621 3006309
12635C006309j58182j63552j68659j10182j03458j27206j57495j67382j35875
$$ 3006309 2848127 2684575 2515916 2405734 2302276 2175070 2017575 1850193 1714318
12626A714318j14212r7911o5123n4877n5345m5376k9230k6945l5607n4472n6970
$$ 1714318 1600106 1502195 1437072 1382195 1326850 1281474 1252244 1225299 1189692 1135220 1078250
12615A078250n7638n4553p5567p4819m7501l7480l7924l6738k6011k107N878J6624
$$ 1078250 1020612 966059 890492 815673 768172 730692 692768 656030 630019 627912 633790 650414
12603F50414L1271J5700N589k03l3958m4779m8842l5243k2729j3810k2922k8360
$$ 650414 681685 697385 702974 702771 668813 624034 575192 539949 517220 503410 480488 452128
12591D52128l188o405j2446j2179K064L969k4716k9790k7742k4382j9573j4397
$$ 452128 448940 442535 430089 417910 419974 423943 399227 369437 341695 317313 297740 283343
12579B83343j0138k870m025o157j0863r788p25l573l584k4745k7693k371J966
$$ 283343 273205 270335 266310 260153 249290 239502 238777 235204 231620 206875 179182 176811 178777
12566A78777L4j2661j1543j6150m419J894r097j5617J748L02q39K1435J7003p734
$$ 178777 178811 166150 154607 138457 134038 135932 126835 111218 112966 113268 112429 133864 150867 143133
12552A43133j3864p420p242k482K579n680J83K18N1179R1860K6636o2423o1192
$$ 143133 129269 121849 114607 112125 114704 109024 109207 109425 160604 252464 279100 216677 155485
12539A55485l2104p387L506K679j042K299R688M993L616P10P221p732k4096q352
$$ 155485 123381 115994 119500 122179 121137 123436 133124 138117 141733 142443 149664 141932 117836 109484
12525A09484l858J1838R62p314n54J2358K1261N03j1060j367o099r884m1111n6722
$$ 109484 105626 117464 118426 111112 110558 122916 144177 144680 133620 132253 126154 116270 75159 18437
12511A8437k5724J2469K3599P120j995j1331o530q146m728Q097k533J8908K971
$$ 18437 -7287 5182 28781 35901 33906 22575 16045 7899 3171 11268 8735 27643 30614
12498C0614J7816K5394J2702n377l886j3771p431R086L3761K9700K6148l382q085
$$ 30614 48430 73824 86526 81149 77263 63492 56061 65147 98908 128608 154756 151374 143289
12485A43289j1155j92q697j3470L083J8214N5321J794m6372l6896l1557l9256
$$ 143289 132134 131942 123245 109775 112858 131072 186393 188187 141815 104919 73362 34106
12473C4106l1999k070M631K576R146P663l286K843n196R129L329L856k504m76
$$ 34106 2107 37 4668 7244 16390 24053 20767 23610 18414 27543 30872 34728 32224 31748
12459C1748p755p368p170j610J6548R702p291O733j967o136r470q175k960m623
$$ 31748 23993 16625 9455 7845 24393 34095 26804 33537 31570 25434 15964 7789 4829 206
12445B06M192J6257O482J574J2754J1648L287M500j8754N33r486k2114m182P15
$$ 206 4398 20655 27137 28711 41465 53113 56400 60900 42146 42679 33193 11079 6897 7612
12431G612r052Q873L0508K5358j3388k7422p403j7376J36Q832j1650r699N407
$$ 7612 -1440 7433 37941 63299 49911 22489 15086 -2290 -2154 6678 -4972 -14671 -9264
12418i264R81J6805J1082j0581j37J5718l653L928j322j1227p425n521Q028J1594
$$ -9264 -8283 8522 19604 9023 8886 24604 20951 24879 23557 12330 4905 -616 7412 19006
12404A9006p895J1174R071j3600l462o825m364k107M028Q87o708r184M058K989
$$ 19006 11111 22285 31356 17756 14294 7469 3105 998 5026 5913 -795 -9979 -5921 -2932
12390b932l021J407j275L723J6067J1273K58p946J0044n9j6654m03R399R225P301
$$ -2932 -5953 -4546 -5821 -2098 13969 25242 25500 17554 27598 27539 10885 10482 19881 29106 36407
12375C6407L289k112J287P69j2629j875R038J6678K6139n895j1860o507p510k1097
$$ 36407 39696 37584 38871 39640 27011 25136 34174 50852 76991 71096 59236 52729 45219 24122
12361B4122j1323k492j6041k23j389j2797M421N567P503J7118M390j5170j5692
$$ 24122 12799 10307 -5734 -5957 -7346 -20143 -15722 -10155 -2652 14466 18856 3686 -12006
12348a2006Q957k701q80Q083R778r73l181p118O723N793k380j0727l847Q524l357
$$ -12006 -3049 -5750 -6630 1453 11231 10258 7077 -41 6682 12475 10095 -632 -4479 4045 688
12333F88o755l032J0324Q71J1001J001r912p289j1299J709Q438J3655o87N262
$$ 688 -6067 -9099 1225 2096 13097 14098 4186 -3103 -14402 -12693 -4255 9400 8713 13975
12319A3975J3882k0023q069L792o615m550K0056J9701K828n256r340l244j8991
$$ 13975 27857 7834 -235 3557 -3058 -7608 12448 32149 34977 29721 20381 17137 -1854
12306a854j1979l44n586j857K6392J1955K414j2556k425K716J5539L800k500j4904
$$ -1854 -13833 -14177 -19763 -21620 4772 16727 19141 6585 4160 6876 22415 26215 23715 8811
12292H811m752q740K511j2439j8199M667J3797m998j237M482M25Q160R095k887
$$ 8811 4059 -4681 -2170 -14609 -32808 -28141 -14344 -19342 -20579 -16097 -15672 -7512 1583 -1304
12278a304O49R007n412r744M73M768Q78o288M59J1596J5014Q667N227L500p0O618
$$ -1304 -655 8352 2940 -6804 -6331 -1563 -685 -6973 -6514 5082 20096 28763 33990 37490 37420 44038
12262D4038k66r021k2701j6982Q391J621J1179K92j1751j0696O862J1342J511
$$ 44038 43772 34751 12050 -4932 3459 5080 16259 16551 4800 -5896 966 12308 13819
12249A3819o619p88l475m614o730m137j2499j2697O595J7487o76J1278K4075L254
$$ 13819 7200 6412 2937 -1677 -8407 -12544 -25043 -37740 -31145 -13658 -14334 -3056 21019 24273
12235B4273p141j074l614j09N318o18k418r093o268J9870n499j6499q422J222
$$ 24273 17132 16058 12444 12335 17653 17035 14617 5524 -744 19126 13627 -2872 -11294 -10072
12221a0072J1818p576K2j4566O010J762K3032J6949J2776R081J7421J777o311
$$ -10072 1746 -5830 -5808 -20374 -14364 -12602 10430 27379 40155 49236 66657 68434 62123
12208F2123m168Q578P835J3756M4120N1675O6154J23311K08216L48038M90980
$$ 62123 57955 66533 74368 88124 132244 183919 250073 373384 581600 929638 1420618
12197A420618L35648p9299k85035k94252k81078k47453j71298r6937q4914o1275
$$ 1420618 1756266 1676967 1391932 1097680 816602 569149 397851 300914 216000 154725
12187A54725k9778k1480l131J0725K657k3387k2875J7469O87j1203p978j1909
$$ 154725 124947 103467 100336 111061 113718 90331 67456 84925 85612 74409 66431 54522
12175E4522o503o31m763K271J9965N881k007M778J505j3262j4928M820l802Q276
$$ 54522 48019 47388 42625 44896 64861 70742 68735 73513 75018 61756 46828 51648 47846 56122
12161E6122P363k959j524R264J2467j515M997J1886J1026Q797K9511M3398K8869
$$ 56122 63485 60526 59002 68266 80733 79218 84215 96101 107127 115924 145435 188833 217702
12148B17702K7658O7572Q4163J09687J53558K16367K96802L76920M21546L33616
$$ 217702 245360 312932 397095 506782 660340 876707 1173509 1550429 1971975 2305591
12138B305591J43636m7570j96462k66320k93032k82732k34613j72623j27489j02679
$$ 2305591 2449227 2401657 2205195 1938875 1645843 1363111 1128498 955875 828386 725707
12128G25707p6088o1379p0212l7662m3822j9993o087L196N488l139J784O430L2629
$$ 725707 649619 588240 518028 480366 436544 416551 410464 413660 419148 416009 417793 424223 456852
12115D56852L3612L1407O6015P5603J03129J29026J65784K56146L07677L33004
$$ 456852 490464 521871 587886 663489 766618 895644 1061428 1317574 1625251 1958255
12105A958255L38149K08675l427j99722l17152l34339l16407k91525k22411j61890
$$ 1958255 2296404 2505079 2501652 2301930 1984778 1650439 1334032 1042507 820096 658206
12095F58206j18833j02919p4029n3467m9776l4323l7903j6554N698j6435j8853
$$ 658206 539373 436454 362425 308958 259182 224859 186956 170402 176100 159665 140812
12084A40812l146j0348k3307j7879o054j738o070n509O465q062K180K835q736
$$ 140812 137666 127318 104011 86132 80078 78340 72270 66761 73226 65164 67344 70179 61443
12071F1443k1345r09J800j3539r923O244O824L016R635R07p472m96l978Q97l479
$$ 61443 40098 39189 40989 27450 17527 23771 30595 33611 43246 44153 36681 36185 32207 33104 29625
12056B9625r602Q83K0763j876j1274m736M037P932R43p85l68n938o919q087R86
$$ 29625 20023 20906 41669 39793 28519 23783 27820 35752 36695 35910 35542 29604 22685 14598 15584
12041A5584j5843o231L85n98O647O685N705K415l785m159J119l650K996J4929
$$ 15584 -259 -6490 -6105 -6703 -56 6629 12334 14749 10964 6805 7924 4274 7270 22199
12027B2199j371j2700M716j461j6401O724J6194M465j5915N402m767N941N279
$$ 22199 20828 8128 12844 11383 -5018 1706 17900 22365 6450 11852 7085 13026 18305
12014A8305j888O901L983m464o398j5371j0283R153M113l718J0561k044R70M699
$$ 18305 16417 23318 27301 22837 16439 1068 -9215 -62 4051 333 10894 8850 9820 14519
12000A4519j0815m801m954L338j193L848m174L228n330j1391N868J4801K747k906
$$ 14519 3704 -1097 -6051 -2713 -3906 -58 -4232 -1004 -6334 -17725 -11857 2944 5691 2785
11986B785n876j0710P398P708K979L28k783J0454J4725r609j9318j4750M924K6687
$$ 2785 -3091 -13801 -6403 1305 4284 4612 1829 12283 27008 17399 -1919 -16669 -11745 14942
11972A4942K1206l579j6250J155n669p47l753q374J045J0244J2697l640p385m91
$$ 14942 36148 32569 16319 17474 11805 11058 7305 -1069 -24 10220 22917 19277 11892 11401
11958A1401k266M893N517L430o643M40J1170P437j2102j6465m266J0578j0776
$$ 11401 9135 14028 19545 22975 16332 16772 27942 35379 23277 6812 2546 13124 2348
11945B348p803P08m01k099q456N290O183j934l497l084N481L192j6760n507J6461
$$ 2348 -5455 -4747 -5148 -7247 -15703 -10413 -4230 -6164 -9661 -12745 -7264 -4072 -20832 -26339 -9878
11930i878Q948k602J3602Q100q1m652j490K394P379n592Q726j4980p492J064m221
$$ -9878 -930 -3532 10070 18170 18089 13437 11947 14341 21720 16128 24854 9874 2382 3446 -775
11915g75R031M693j4430q857Q97K88K990J3901r603j3512K0127P983P584R434
$$ -775 8256 12949 -1481 -10338 -9441 -9153 -6163 7738 -1865 -15377 4750 12733 20317 29751
11901B9751n333j3368O167j772P599q705n571m751L594J1805j261j1234J0832
$$ 29751 24418 11050 17217 15445 23044 14339 8768 4017 7611 19416 18155 6921 17753
11888A7753J913l652l59M876N077m249j0698j0050M558p073j2876j965j0866P903
$$ 17753 19666 16014 15655 20531 25608 21359 10661 611 5169 -1904 -14780 -16745 -27611 -19708
11874a9708j348J792P386N946O395J1353j704j992n994j1202L673M720J2096J0396
$$ -19708 -21056 -19264 -11878 -5932 463 11816 10112 8120 2126 -9076 -5403 -683 11413 21809
11860B1809m979j2356N185N11k1328j1638J2828K0211P482j1557l919L984J554
$$ 21809 16830 4474 9659 10170 -11158 -22796 -9968 10243 17725 6168 2249 6233 7787
11847G787m288o915j0439q046k47P519o540J785J5906J5684J0496o518k879n832
$$ 7787 3499 -3416 -13855 -21901 -22148 -14629 -21169 -19384 -3478 12206 22702 16184 13305 7473
11833G473K886m57l653p9Q904o464j1749l780M624K4094J2562L922j4572m588
$$ 7473 10359 9902 6249 6170 15074 8610 -3139 -6919 -2295 21799 34361 38283 23711 19123
11819A9123l652n684k841m773K043k387P84L375L396q317j7944J0909O207j354
$$ 19123 15471 9787 6946 2173 4216 1829 2613 5988 9384 1067 -16877 -5968 239 -1115
11805a115j4038o449K6186J9020l283p727n223j9950R294J4078o5q520n212q381
$$ -1115 -15153 -21602 4584 23604 20321 12594 7371 -12579 -3285 10793 10728 2208 -3004 -11385
11791a1385l566J3275K0435J4840M913j3161j7084l766J7961O902o613j1881N093
$$ -11385 -14951 -1676 18759 33599 38512 25351 8267 4501 22462 29364 22751 10870 15963
11778A5963O290o742j2764j3976N051J3285P609n258n334m893K687p100L378Q154
$$ 15963 22253 15511 2747 -11229 -6178 7107 14716 9458 4124 -769 1918 -5182 -1804 6350
11764F350j895M239m757n07r440J201p218j3473O114L049J1498J5091K670Q799
$$ 6350 4455 8694 3937 3430 -6010 -4809 -12027 -25500 -19386 -16337 -4839 10252 12922 21721
11750B1721j2464p380R735O607j742j91k406j0481k3030N536J0817J3173J7964
$$ 21721 9257 1877 11612 18219 16477 16286 13880 3399 -19631 -14095 -3278 9895 27859
11737B7859J991N550j1175j0944m171K209j885m085K172N27o521N578M728R208
$$ 27859 29850 35400 24225 13281 9110 11319 9434 5349 7521 8048 1527 7105 11833 21041
11723B1041j3407q617l289M836M059J1469o561q938n616K179q770m753K512J4301
$$ 21041 7634 -983 -4272 564 4623 16092 9531 593 -5023 -2844 -11614 -16367 -13855 446
11709D46N808j1406K0480J5565j1453j7037l029P291J4235j0608j4785L683N045
$$ 446 6254 -5152 15328 30893 19440 2403 -626 6665 20900 10292 -4493 -810 4235
11696D235Q156J4249p602l987M657l502O099j438k0331q42K23n393o323k324K7748
$$ 4235 12391 26640 19038 15051 19708 16206 22305 20867 536 -306 -83 -5476 -11799 -14123 13625
11681A3625r4j981J9763N262r740l023J3178k507j1423k1190j93J1165l465p435
$$ 13625 13531 11550 31313 36575 26835 23812 36990 34483 23060 1870 1677 12842 9377 1942
11667A942O697Q016J5918m494r568k887P665j0618j7440J308J5286j346Q685O015
$$ 1942 8639 16655 32573 28079 18511 15624 23289 12671 -4769 -3461 11825 10479 19164 25179
11653B5179L292L082O03P672p463k0525j5397O447J452P297M317L103l845N839
$$ 25179 28471 31553 32156 39828 32365 11840 -3557 2890 4342 11639 15956 19059 15214 21053
11639B1053K297r537j4297N841m721r829k928R91j152J2818L746M548M899n548
$$ 21053 23350 13813 -484 5357 636 -9193 -12121 -11130 -12282 536 4282 8830 13729 8181
11625H181o669p230r85J1586J6507k691J0524n07n427j7431l1682j593J0294J1141
$$ 8181 1512 -5718 -6703 4883 21390 18699 29223 28716 23289 5858 -25824 -27417 -17123 -5982
11611e982J9534N724K983K09k744l160q699j03R670k062K000M635k763o705j7132
$$ -5982 13552 19276 22259 22468 19724 16564 7865 7762 17432 15370 17370 22005 19242 12537 -4595
11596d595O229J712o585j5149J3189M174k380o974j146J6642J2491r876j2090
$$ -4595 1634 3346 -3239 -18388 -5199 -1025 -3405 -10379 -11525 5117 17608 7732 -4358
11583d358j373J5465M731N438j219p942l563j382M968Q080R04n659r516j1155
$$ -4358 -5731 9734 14465 19903 18684 10742 7179 5797 10765 18845 19749 14090 4574 -6581
11569f581l677M419P839J846j072J6909M165l609o537L902q113n681j2585J823
$$ -6581 -10258 -5839 2000 3846 2774 19683 23848 20239 13702 17604 9491 3810 -8775 -6952
11555f952J1869o529r660J5160J313J2209N62j837o718j2683J5624n180J0190
$$ -6952 4917 -1612 -11272 3888 5201 17410 17972 16135 9417 -3266 12358 7178 17368
11542A7368m773J445l88Q72m604k587o742l921m981J820J7329J1502j3507Q19
$$ 17368 12595 14040 13652 14524 9920 7333 591 -3330 -8311 -6491 10838 22340 8833 9652
11528I652J3598Q995j2509n717R41o768K754N628M486J3901N538k225m175j602
$$ 9652 23250 32245 19736 14019 14960 8192 10946 16574 21060 34961 40499 38274 34099 32497
11514C2497j4932N56K413j6798j1139P09O446O230Q486N34J4453P31j0516l354
$$ 32497 17565 18121 20534 3736 -7403 -6694 -248 5982 14468 15002 29455 30186 19670 16316
11500A6316O74N797m093m348L603j4207j4899O335J1349r635J3230N505J146l655
$$ 16316 16990 22787 18694 14346 17949 3742 -11157 -4822 6527 -3108 10122 15627 16773 13118
11486A3118R556R517j0182p847n030M206O672M902J0848l028j5220j3182j0416
$$ 13118 22674 32191 22009 14162 9132 13338 20010 24912 35760 32732 17512 4330 -6086
11473f086L320L32K05N213J5947M062J024R437k712k2685j4693N00K3903k44O214
$$ -6086 -2766 -2434 -2229 2984 18931 22993 24017 33454 30742 8057 -6636 -6136 17767 17523 23737
11458B3737o251j7703J3504K2605M660J0732n513l402N200k490j1843L300k234
$$ 23737 17486 -217 13287 35892 40552 51284 45771 42369 47569 45079 33236 36536 34302
11445C4302p96p072p639o845O2J5955J0150J5231J1107J570n321j5276j1673m165
$$ 34302 33506 26434 18795 11950 12012 27967 38117 53348 64455 66025 60704 45428 33755 29590
11431B9590P173K6401K7162M0109O3998J12626J92595L32011M93101M25743j1153
$$ 29590 36763 63164 90326 130435 194433 307059 499654 831665 1324766 1750509 1739356
11420A739356k86658l07982k87033k48220j90646j23162p7074n2831l8973l2490
$$ 1739356 1452698 1144716 857683 609463 418817 295655 218581 165750 126777 94287
11410I4287r697p793j5706P473R734k2600j1874l28Q107M359L761l835n90j5417
$$ 94287 84590 76797 61091 68564 78298 55698 43824 43496 51603 55962 59723 55888 55298 39881
11396C9881k579R083J2505J1885J065j2850l245m479j1754J453L651N084j791
$$ 39881 37302 46385 58890 70775 71840 58990 55745 51266 39512 40965 44616 49700 47909
11383D7909j0212j3069K643J90P090M288n542j0162j2139L426M248N574J3248
$$ 47909 37697 24628 27271 27461 34551 38839 33297 23135 10996 14422 18670 24244 37492
11370C7492L519n72n828j323j0257M402Q455j1671j7198M565N906R888R050q95
$$ 37492 41011 40439 34611 33288 23031 27433 35888 24217 7019 11584 17490 27378 36428 35533
11356C5533q87O212N140Q383k943m766j7135p506l022J4058J0604j1441j6908
$$ 35533 34646 40858 45998 54381 51438 46672 29537 22031 19009 33067 43671 32230 15322
11343A5322L525K69O057k106J339J2046Q267j2225p807j3344j6494M315M053q646
$$ 15322 18847 19116 25173 23067 24406 36452 44719 32494 24687 11343 -5151 -836 3217 -5429
11329e429k239M782K1737Q183J768K734L209J1210q867N550N32m758j2922l561
$$ -5429 -7668 -2886 18851 27034 28802 31536 34745 45955 37088 42638 43170 38412 25490 21929
11315B1929l812J0315P784N534Q695n385j2850m689k418L594N998j27l367k2343
$$ 21929 18117 28432 36216 41750 50445 45060 32210 27521 25103 28697 34695 34568 31201 8858
11301H858q29Q718J3897P016J886k0167k745p36J0383J0077Q927n56j301m797
$$ 8858 8029 16747 30644 37660 39546 19379 16634 15898 26281 36358 45285 44729 43428 38631
11287C8631Q822O40K53J539J320P735Q070q203l057j5612k6837j5363k2669j334
$$ 38631 47453 48093 48346 49885 51205 58940 67010 58807 55750 40138 13301 -2062 -24731 -26065
11273b6065J999k722M534J7789J9956K151J3033N3J4965L354J52O931o714j1978
$$ -26065 -24066 -26788 -22254 -4465 15491 17642 30675 30728 45693 49047 49199 56130 49416 37438
11259C7438p793N66j942J168J243n161O91p208j645J2691J2952J729l322J2486
$$ 37438 29645 30211 28269 29437 30680 25519 26210 19002 17357 30048 43000 44729 41407 53893
11245E3893J067j3389M919j3535l253j0175j4461J7231J9448j2876n629Q996K0471
$$ 53893 54960 41571 46490 32955 29702 19527 5066 22297 41745 28869 23240 32236 52707
11232E2707J8637l396j042J6274J9892J6632K317K1323N1016N263n2406j5284
$$ 52707 71344 67948 66906 83180 103072 119704 122021 143344 194360 199623 147217 131933
11220A31933l684k4927k1655j2773j3609j1034R329l10n817M970l586k960j0728
$$ 131933 128249 103322 81667 68894 55285 44251 53580 53270 47453 52423 48837 45877 35149
11207C5149j385j0830j0654J0092R312J8005J5094j0129p854J2980R311Q564P957
$$ 35149 33764 22934 12280 22372 31684 49689 64783 54654 46800 59780 69091 77655 85612
11194H5612M920j9744J799Q438L42R262Q087L015J6303K6000K5902L5000P2625
$$ 85612 90532 70788 72587 81025 81367 90629 98716 101731 118034 144034 169936 204936 277561
11181B77561J02623J63495L09346M50074L76456J9248k25030k69103k69178k48387
$$ 277561 380184 543679 853025 1303099 1679555 1698803 1473773 1204670 935492 687105
11171F87105j72791j08723q1153n9286m6841l3651n2088p2359k3771K4635L225
$$ 687105 514314 405591 324438 265152 218311 184660 132572 60213 36442 61077 64302
11160F4302k2848j6071j9225J0966M558j2841r744l970N39O134J6879J1339J2428
$$ 64302 41454 25383 6158 17124 21682 8841 -903 -4873 -4334 1800 18679 30018 42446
11147D2446J5497q390j0023R420K2980J0666J8298K0678J0335o681k6407j7839
$$ 42446 57943 49553 39530 48950 71930 82596 100894 121572 131907 125226 98819 80980
11135H0980l829L550J692J0862K1023K4573N227k504j8019k6310l7207l9503j5952
$$ 80980 77151 80701 82393 93255 114278 138851 144078 141574 123555 97245 60038 20535 4583
11122D583P879K2736J9026J9846O750J005r925J0952L315k1348j5828r194j5994
$$ 4583 12462 35198 54224 74070 80820 81825 71900 82852 86167 64819 48991 39797 23803
11109B3803l453r801K086K6460J2397R983K2214L1070J0894q472o776j0680q217
$$ 23803 20350 10549 12635 39095 51492 61475 83689 114759 125653 117181 110405 99725 91508
11096I1508K3943J8039R227J2337Q945k021n43o762n857j6366K260R540K1113
$$ 91508 115451 133490 142717 155054 163999 161978 161435 154673 148816 132450 134710 144250 165363
11083A65363R861Q659M289J800j6389J1173K935r977j0359O229K246J0670R143
$$ 165363 175224 183883 188172 189972 173583 184756 187691 177714 167355 173584 175830 186500 195643
11070A95643R075J69k1623l0394K29N571J1255K0869K0050N318l584O832J4469
$$ 195643 204718 204887 183264 152870 153099 158670 169925 190794 210844 216162 212578 219410 233879
11057B33879N496N989J091J4421j9944l0406n249J0882O972k495M998N029J0502
$$ 233879 239375 245364 246455 260876 240932 210526 205277 216159 223131 220636 225634 230663 241165
11044B41165J495l1359j4533k4590l4505l4K9639M5067N4505L5713L0615L4630
$$ 241165 242660 211301 196768 172178 137673 137639 167278 212345 266850 302563 333178 367808
11032C67808j442R647L1986J4426K669o049j3455j7577K564N163L1660M7672M4607
$$ 367808 366366 376013 407999 422425 425094 419045 405590 388013 390577 395740 427400 475072 519679
11019E19679L7645K3490L9633N6043O6242N7899K8555r950K0484M1144P0639N5309
$$ 519679 557324 580814 620447 676490 742732 800631 829186 819236 839720 880864 951503 1006812
11007A006812K6882K2986O4797Q3397N3666O2362Q9278P9702Q4948J21440J33037
$$ 1006812 1033694 1056680 1121477 1204874 1258540 1320902 1410180 1489882 1574830 1696270 1829307
10996A829307J64498J74842J21305J23941J45556K16788L37518N53063Q33547
$$ 1829307 1993805 2168647 2289952 2413893 2559449 2776237 3113755 3666818 4500365
10987D500365J097038J063412O22598N62985R73824J502474K124277L246362M880278
$$ 4500365 5597403 6660815 7283413 7846398 8820222 10322696 12446973 15693335 20573613
10978B0573613P159192J0978569J8631605L4385983O4196109J01171171Q4572944
$$ 20573613 27732805 38711374 57342979 91728962 155925071 257096242 341669186
10971C41669186p273205n7467564o0714415n6276066m9327568l5164352k2678806
$$ 341669186 334395981 276928417 216214002 159937936 110610368 75446016 52767210
10964E2767210j4297018q892100n679732l752071k670258j973155j356437r59126
$$ 52767210 38470192 29578092 23898360 20146289 17476031 15502876 14146439 13187313
10956A3187313j114889j277453j163653j042650r31202p88228o81006n87325m90634
$$ 13187313 12072424 10794971 9631318 8588668 7657466 6869238 6188232 5600907 5110273
10947E110273l89335l16255k70674k73249k64731k23624k07224j73818j23254
$$ 5110273 4720938 4404683 4134009 3860760 3596029 3372405 3165181 2991363 2868109
10938B868109j04824j33883j29786p8573q6342j07142j39614j53480j58386j23939
$$ 2868109 2763285 2629402 2499616 2421043 2334701 2227559 2087945 1934465 1776079 1652140
10928A652140q5803o5525m7724o9598o9203p6934p0268k7258k8710o1615p3022
$$ 1652140 1566337 1500812 1453088 1383490 1314287 1237353 1167085 1139827 1111117 1049502 976480
10917I76480o9148p0274n3955n7544n1060m6697m9937j2507K2749K7600K7753
$$ 976480 907332 837058 783103 725559 674499 627802 577865 565358 588107 615707 643460
10906F43460M7262M6088M708j0110j6366l0690j4184j6098j3402l6762l0729n468
$$ 643460 690722 736810 741518 731408 715042 684352 670168 654070 640668 603906 573177 567709
10894E67709j2262j3857j0857j0033j55j7135l4825m0353l2187m1645l5969l2391
$$ 567709 555447 541590 530733 520700 520545 503410 468585 428232 396045 354400 318431 286040
10882B86040l8023j4630R507O985K069j56m91r496l968j4349k2524j0825J5583
$$ 286040 248017 233387 242894 249879 251948 251792 251301 241805 237837 223488 200964 190139 205722
10869B05722o32k579j6566j7922o668n703n482J8941J4383J9037M132K2926m219
$$ 205722 205090 202511 185945 168023 161355 155652 150170 169111 183494 202531 206663 229589 225370
10856B25370k597P455K63O454J6907R046l307o225M107K9521P1498L3238l2465
$$ 225370 222773 230228 230491 236945 253852 262898 259591 253366 257473 286994 358492 391730 359265
10843C59265m7289j1673n224N910J498J3510L101o937o586j0800k631P964j011
$$ 359265 311976 300303 295079 300989 302487 315997 319098 312161 305575 294775 292144 300108 299097
10830B99097Q066Q449k5315l0464k1937N288K8107K5892K5861J8364M204q484
$$ 299097 307163 315612 290297 259833 237896 243184 271291 297183 323044 341408 345612 337128
10818C37128K22j4431l3070m3914l0225k3678O829J1435J450J9477K0770j4427
$$ 337128 337350 322919 289849 245935 215710 192032 198861 210296 211746 231223 251993 237566
10806B37566j4491p756Q037K308k1110o559o331j7267K830K2644M5599N5056P6373
$$ 237566 223075 215319 223356 225664 204554 197995 191664 174397 177227 199871 245470 300526 376899
10793C76899Q2841P4491L5950J9927J2986j2293k336r255m0020j6388P465M9642
$$ 376899 459740 534231 570181 590108 603094 590801 588465 579210 539190 522802 530267 579909
10781E79909N0667J3201o731J4287K2233K4754L2538M7819M6923M2779M849n95
$$ 579909 630576 643777 637046 651333 673566 698320 730858 778677 825600 868379 873228 872633
10769H72633L1338O9190O3861L0794J8151N7756Q1489R6614J00738J09152Q9878
$$ 872633 903971 973161 1037022 1067816 1085967 1143723 1225212 1321826 1422564 1531716 1621594
10758A621594R0037J05511J40882J78130J99728J77670J59042K09748L22766N00603
$$ 1621594 1711631 1817142 1958024 2136154 2335882 2513552 2672594 2882342 3205108 3705711
10748C705711P80059J014827Q15972M54125L95956N94043J006182J562663K288112
$$ 3705711 4485770 5500597 6316569 6770694 7166650 7760693 8766875 10329538 12617650
10739A2617650L315975M811366O987863J0430424J6975615K9849715N3622606
$$ 12617650 15933625 20744991 27732854 38163278 55138893 84988608 138611214
10732A38611214Q5436132Q7008964J8463346m2687083n6896176n4744841m9766902
$$ 138611214 224047346 311056310 329519656 286832573 229936397 175191556 125424654
10725A25424654l8237750k5805138j6682825j0635819o873491m608462l265445
$$ 125424654 87186904 61381766 44698941 34063122 27189631 22581169 19315724
10718A9315724k471479j891197j350746r11738q00686j005930j090743j042617
$$ 19315724 16844245 14953048 13602302 12690564 11889878 10883948 9793205 8750588
10710H750588r25492q24558p20572o08452m96738l93339l18897k91542k77928
$$ 8750588 7825096 7000538 6279966 5671514 5174776 4781437 4462540 4170998 3893070
10701C893070k36002k14964j90120j58252j35660j23912j40314j19379r9683j22654
$$ 3893070 3657068 3442104 3251984 3093732 2958072 2834160 2693846 2574467 2474784 2352130
10691B352130j40477j75508j62087j18315r5689q7696o6717n5504m3110l9469
$$ 2352130 2211653 2036145 1874058 1755743 1660054 1572358 1505641 1450137 1407027 1367558
10681A367558l9364k2580m1746n9179n5154n5450n8674o0743p0410m3054l5226
$$ 1367558 1328194 1305614 1263868 1204689 1149535 1094085 1035411 974668 904258 861204 825978
10670H25978l0954l6318j9931L192m055J0211J9693K1371R922k0021m3724o0672
$$ 825978 795024 758706 738775 741967 737912 748123 767816 789187 799109 779088 735364 674692
10658F74692n9541k1891k0274k0139k5919k0699j0190j654j2760k3635r238r182
$$ 674692 615151 593260 572986 552847 526928 506229 496039 494385 481625 457990 448752 439570
10646D39570l3725m6301k6166j9834n016o679j0267p605m953m208R915j811n260
$$ 439570 405845 359544 333378 313544 308528 301849 291582 283977 279024 274816 284731 282920 277660
10633B77660j624j0297j1497o937k0621j52j2352n403j2536j7045p552j3027M299
$$ 277660 276036 265739 254242 247305 226684 226532 214180 208777 196241 179196 171644 158617 162916
10620A62916O382J784J0384n097L513m206m207m712j249m127j0121L330k2883
$$ 162916 169298 171082 181466 176369 179882 175676 171469 166757 165508 161381 151260 154590 131707
10607A31707r810L4293O7425O1710k3050o8846l9328k8457J2379J6600R160J5448
$$ 131707 121897 156190 223615 285325 262275 193429 154101 125644 138023 154623 163783 179231
10595A79231l29k884N40P939j381j0222J2955o216j7493p215n182j2747j7883
$$ 179231 178902 176018 176558 184497 183116 172894 185849 179633 162140 154925 149743 136996 119113
10582A19113j96L3640K2609O444k396l717j8079m7712n3793l1860k64R477J8492
$$ 119113 118917 152557 175166 181610 179214 175497 157418 109706 55913 24053 23789 33266 51758
10569E1758L145j9435J0542J7170l701j8946j5084N16J5581O065N659J6131J0977
$$ 51758 54903 35468 46010 63180 59479 40533 25449 25965 41546 47611 53270 69401 80378
10556H0378J3506J250j7708l292K2317K7752K2680J2595m974J7163K767k2392
$$ 80378 93884 95134 77426 74134 96451 124203 146883 159478 154504 171667 174434 152042
10544A52042j9645j0498J2344K2051L1291p563k9673l5320l9978k8150j4620j0379
$$ 152042 132397 121899 134243 156294 187585 180022 150349 115029 75051 46901 32281 21902
10532B1902J3428J5867r097J1913J5553J652K143K3633K9003J3048K9700M8884
$$ 21902 35330 51197 42100 54013 69566 71218 73361 96994 125997 139045 168745 217629
10520B17629O9063J18878K44383M31211N17502K10129j79139l05473l04659k72696
$$ 217629 286692 405570 649953 1081164 1598666 1808795 1629656 1324183 1019524 746828
10510G46828k05773j41526j11280p5703l5784j6838k4785j4221J3522N351m539
$$ 746828 541055 399529 288249 212546 176762 159924 135139 120918 134440 139791 135252
10499A35252N234L003k1646k3017k4605J801P579j7350o145J9717J2412k1651
$$ 135252 140486 143489 121843 98826 74221 76022 83601 66251 60106 79823 92235 70584
10487G0584p033j06P223Q56m847m86j2304m139R657j579O354l489J5731o390l019
$$ 70584 63551 63445 70668 71524 66677 66191 53887 49748 59405 57826 64180 60691 76422 70032 67013
10472F7013N274r043k7876m674P909o006L29O60K545l90j0695l0695R084O293
$$ 67013 72287 63244 35368 30694 38603 32597 32926 33586 36131 35741 25046 -5649 3435 9728
10458I728J1136J688j7260j6309j1958J1010K8982J3689R293o332n192o985J0235
$$ 9728 20864 22552 5292 -11017 -22975 -11965 17017 30706 39999 33667 28475 21490 31725
10445C1725J3960Q569o693o659q555J037P485n717r041N25o699m507J1823J3994
$$ 31725 45685 54254 47561 40902 32347 33384 40869 35152 26111 26636 19937 15430 27253 41247
10431D1247O061J987J9119K2085j1921j2256p721j4441o62j180j9881r823K039
$$ 41247 47308 49295 68414 90499 78578 66322 58601 44160 43498 42318 22437 12614 14653
10418A4653o646j4623J2761N695n154r879Q574M524J2626J800j4265k1301k743
$$ 14653 8007 -6616 6145 11840 6686 -3193 5381 9905 22531 24331 10066 -11235 -13978
10405a3978P732K1936k52j0001n148j780L177r333N834K2115J3996n13j6303m998
$$ -13978 -6246 15690 15438 5437 289 -1491 1686 -7647 -1813 20302 34298 33785 17482 12484
10391A2484n837p679P758Q554n246o425J430m699J3785J1812k3774n144R921m252
$$ 12484 6647 -1032 6726 15280 10034 3609 5039 340 14125 25937 2163 -2981 6940 2688
10377B688j1319J7981J4587L049o578m383N490j0729r933n493j9621K749J6686
$$ 2688 -8631 9350 23937 26986 20408 16025 21515 10786 853 -4640 -24261 -21512 -4826
10364d826L425j0107J2425J1710j149l30R609j2242j7446O838J3651N52O418n743
$$ -4826 -1401 -11508 917 12627 11478 11148 20757 8515 -8931 -2093 11558 12110 18528 12785
10350A2785o13l353o520p305R256J4836K0993P018j195J7254J8530M4145Q6404
$$ 12785 12172 8819 2299 -5006 4250 19086 40079 47097 45902 63156 81686 125831 212235
10337B12235Q9687K1484m9453p2678n5391l8484j9786j3934j8083j7317j3543
$$ 212235 301922 323406 273953 201275 145884 107400 87614 73680 55597 38280 24737
10326B4737j557J227P60q139M030J245m005j6212L478J5749P030L345O268j151
$$ 24737 23180 24407 25167 17028 21058 22303 18298 2086 5564 21313 28343 31688 37956 36805
10312C6805J141j0445j7445L696k934p892K73m161q26N182l570J1691R084O055
$$ 36805 37946 27501 10056 13752 10818 2926 3199 -962 -1788 3394 -176 11515 20599 26654
10298B6654K4779k510p429j5958k595M634n714J0882J1798P581J3134M653J9043
$$ 26654 51433 48923 41494 25536 22941 27575 21861 32743 44541 52122 65256 69909 88952
10285H8952K9283M9831O3173R4395J74999L11689M32299L57329Q183k18360k73706
$$ 88952 118235 168066 231239 325634 500633 812322 1244621 1601950 1610133 1391773 1118067
10274A118067k73765k31590j66393j01811q7666o4236l1906j3795j7548l5863
$$ 1118067 844302 612712 446319 344508 256842 192606 160700 146905 129357 93494
10264I3494l1809o632L363O493q862k644n379j4341m236J6019J0359j3386r589
$$ 93494 61685 55053 58416 64909 56047 53403 48024 33683 29447 45466 55825 42439 32850
10251C2850m261k266N43L547p229j1966K914r089O079R696O038M816k5641j2560
$$ 32850 28589 26323 26866 30413 23184 11218 14132 5043 11122 20818 26856 31672 6031 -6529
10237f529M310J22M188R62m628Q263L344N418j1824n467K001m773q059J3966J8645
$$ -6529 -2219 -2097 2091 3053 -1575 6688 10032 15450 3626 -1841 160 -4613 -12672 1294 19939
10222A9939J2671j194j4103j0359M648K251j0304n917O487N063K0265N032j1573
$$ 19939 32610 31416 17313 6954 11602 13853 3549 -2368 4119 9182 29447 34479 22906
10209B2906l495O189p769q889J102J4973J3061n372j4670M413K641l417j714l989
$$ 22906 19411 25600 17831 8942 10044 25017 38078 32706 18036 22449 25090 21673 19959 15970
10195A5970p603k174k017k643p161q103J4931J2194Q247O137j712j0331n698l153
$$ 15970 8367 6193 4176 1533 -5628 -13731 1200 13394 21641 27778 26066 15735 10037 6884
10181F884j1852K27O522Q679J1134p906j3416j2254n566J7996K820p005p711L764
$$ 6884 -4968 -4741 1781 10460 21594 13688 272 -11982 -17548 448 3268 -3737 -11448 -7684
10167g684j254O617J627k577Q2l609n476j8427J124M399P359K0232j0372J7384
$$ -7684 -8938 -2321 -694 -3271 -3189 -6798 -12274 -30701 -29577 -25178 -17819 2413 -7959 9425
10153I425J1184J880l93R601j3015p548p077j2967o514O778P215M540q019j0151
$$ 9425 20609 22489 22096 31697 18682 11134 4057 -8910 -15424 -8646 -1431 3109 -4910 -15061
10139a5061M069K3067l27j995L132Q16j0630j0012J4385O046q147j072J0058K121
$$ -15061 -10992 12075 11748 9753 12885 13701 3071 -6941 7444 13490 5343 4271 14329 16450
10125A6450j514R127j6193k0503j9408k431J8915K0627J151j428j236k610j4105
$$ 16450 14936 24063 7870 -12633 -32041 -34472 -15557 5070 6221 4793 3557 947 -13158
10112a3158q510J3416J1811O46n957k8719M99J2544M554k474J4154J5162q124
$$ -13158 -21668 -8252 3559 4205 -1752 -30471 -29972 -17428 -12874 -15348 -1194 13968 5844
10099E844j0985j478J4715O305L700j3273j3558L916k768o030k02P40J177M534
$$ 5844 -5141 -6619 8096 14401 18101 4828 -8730 -4814 -7582 -13612 -13814 -13074 -11897 -7363
10085g363n951Q999J3313J202J872N291j5430j3386M94K229m287R130J1779O685
$$ -7363 -13314 -4315 8998 10200 12072 17363 1933 -11453 -10959 -8730 -13017 -3887 7892 14577
10071A4577k743J302K331j0125n812R46R135p573Q645N319K095O57O182N2k477
$$ 14577 11834 13136 15467 5342 -470 476 9611 2038 10683 16002 18097 18754 24936 24988 22511
10056B2511j2397l977j2329q58l99N739K974j0952l900j673p786n432J6331Kj3540
$$ 22511 10114 6137 -6192 -7050 -7449 -1710 1264 -9688 -13588 -15261 -23047 -28479 -12148 -12146 -25686
10041b5686M27L258K1095K4088K082m90n526j5437j3498R661J3888m922J0624
$$ -25686 -25259 -22001 -906 23182 25264 24774 19248 3811 -9687 -26 13862 8940 19564
10028A9564j0257n617q277j7748q299K1387P541j8425p070j654L835J3676p87
$$ 19564 9307 3690 -4587 -22335 -30634 -9247 -1706 -20131 -27201 -28855 -25020 -11344 -12131
10015a2131n152O608J6212N687k884p495o154K800o664l31K4602J3095o513j7506
$$ -12131 -17283 -10675 5537 11224 8340 845 -5309 -2509 -9173 -9504 15098 28193 21680 4174
10001D174l078q144j1913L873J0177p034m344J4058J805R294R817j645j948k655
$$ 4174 1096 -7048 -18961 -15088 -4911 -11945 -16289 -2231 -426 8868 18685 17040 15092 12437
9987A2437j808P056q983n348o468M051Q81J2541j401M84k095K296o856K294k50
$$ 12437 10629 17685 8702 3354 -3114 937 1818 14359 12958 13442 11347 13643 6787 9081 8831
9972H831j4858n070O084J0965J4134K0445j3134j8385L068n448J079p597N520
$$ 8831 -6027 -11097 -5013 5952 20086 40531 27397 9012 12080 6632 7711 114 5634
9959E634P505P450j1128K321m956q237l405l146J9l716L269N432j9550j365J0345
$$ 5634 13139 20589 9461 11782 6826 -1411 -4816 -7962 -7943 -11659 -8390 -2958 -22508 -23873 -13528
9944a3528O594J157k769r463m453M878J4273L658K743Q39R754P59j7757Q659K406
$$ -13528 -6934 -5777 -8546 -18009 -22462 -17584 -3311 347 3090 3929 13683 14442 -3315 5344 7750
9929G750O615J6591j6177r502J200q368o063j929J0274J569r505m777P634q728
$$ 7750 14365 30956 14779 5277 6477 -1891 -7954 -9883 391 1960 -7545 -12322 -4688 -13416
9915a3416o383M012O249P236n703j955J4946N303m677j3154j1785L951J4240r04
$$ -13416 -19799 -15787 -9538 -2302 -8005 -9960 4986 10289 5612 -7542 -19327 -15376 -1136 -2040
9901b040R101Q584K598M527j09j565k333j4776j3383J3170Nk155j2004p9j1973
$$ -2040 7061 15645 18243 22770 22661 21096 18763 3987 -9396 3774 3779 1624 -10380 -10459 -22432
9886b2432J6036K8864R011L693r964r203R544n062k6843j4165L193L38k666R122
$$ -22432 -6396 22468 31479 35172 25208 16005 25549 20487 -6356 -20521 -17328 -16990 -19656 -10534
9872a0534N969J4651k168j6265l121J3245l072K564Q940J663j4567p352l288k687
$$ -10534 -4565 10086 7918 -8347 -11468 1777 -1295 1269 10209 11872 -2695 -10047 -13335 -16022
9858a6022p701r192L894J1287N744M309P027n315M885J8033O120k798J036k43
$$ -16022 -23723 -32915 -29021 -17734 -11990 -7681 -654 -5969 -1084 16949 23069 20271 21307 21064
9844B1064o612m894P749k537j220q73j1063j1796R143P209K602J3259J3059o979
$$ 21064 14452 9558 17307 14770 13550 12677 1614 -10182 -1039 6170 8772 22031 35090 28111
9830B8111j7253J0775j811J46j016K504P550j910l064l138k269j5543k874J228
$$ 28111 10858 21633 19822 19968 18952 21456 29006 27096 24032 20894 18625 3082 208 1436
9816A436k088l13Q505l396M68j0575P199L620L127O83p536n406j5785n231m850
$$ 1436 -652 -965 7540 4144 4612 -5963 1236 4856 7983 8666 1130 -4276 -20061 -25292 -30142
9801c0142r901J314n34J0442N151K217J4710N775l255j1014P433P951q835p515
$$ -30142 -40043 -38729 -39263 -28821 -23670 -21453 -6743 -968 -4223 -15237 -7804 147 -8688 -16203
9787a6203N063L614o956k5566q002K0172J7789J957j1794J0072L889j4538k903
$$ -16203 -11140 -7526 -14482 -40048 -48050 -27878 -10089 -8132 -19926 -9854 -5965 -20503 -23406
9774b3406J0792L291p708p421M364Q715K563K253L599l512P449n582L472j3221
$$ -23406 -12614 -9323 -17031 -24452 -20088 -11373 -8810 -6557 -2958 -6470 979 -4603 -1131 -14352
9760a4352K020n840K214J4696M692M95m837L283r90Q789k1740L017J4982l036
$$ -14352 -12332 -18172 -15958 -1262 3430 3925 -912 2371 1381 10170 -11570 -8553 6429 3393
9746C393n255M041m652r36m50j2089q445J4009K5581L538p646j1095j4918q652
$$ 3393 -1862 2179 -2473 -3409 -3859 -15948 -24393 -10384 15197 18735 11089 -6 -14924 -23576
9732b3576j725J7239K9172Q361j6440j3458N660q987j086O434M924j9502j6623
$$ -23576 -25301 -8062 21110 29471 13031 -427 5233 -3754 -4840 1594 6518 -12984 -29607
9719b9607j846L850P708K650q273o062P593J2583J6636o645p753m558R01P527
$$ -29607 -31453 -27603 -19895 -17245 -25518 -31580 -23987 -11404 5232 -1413 -9166 -13724 -12823 -5296
9705e296P587j0966M523m646q32K786k67k371j436j1140j140K0435r15p563j824
$$ -5296 2291 -8675 -4152 -8798 -9630 -6844 -7111 -9482 -10918 -22058 -23198 -2763 -3678 -11241 -13065
9690a3065O893r10J953J1340R800k395j002j339M71k65j3701q495k286L917P19
$$ -13065 -6172 -7082 -5129 6211 16011 13616 12614 11275 11746 11481 -2220 -10715 -13001 -9084 -8365
9675h365J862N101M59l704M849J12K835J3625k601j1757j0505N851M578R8j0053
$$ -8365 -6503 -1402 -943 -4647 202 314 3149 16774 14173 2416 -8089 -2238 2340 2438 -7615
9660g615L07N390j1162l515L649J0396j396m767o397j0294J4552K2J1154J5987
$$ -7615 -7308 -1918 -13080 -16595 -12946 -2550 -3946 -8713 -15110 -25404 -10852 -10830 324 16311
9646A6311K599J2836Q49p965q887K446J543J0993q250j4006p094m345L462Q999
$$ 16311 18910 31746 32595 24630 15743 18189 19732 30725 22475 8469 1375 -2970 492 9491
9632I491k892N670J4035N105l754j7218j1090k1514R68l118O459N478m316M327
$$ 9491 6599 12269 26304 31409 27655 10437 -653 -22167 -21199 -24317 -17858 -12380 -16696 -12369
9618a2369M743p811k418j155P76J7466j337q98K127j8523k891M710K17n13J0765
$$ -12369 -7626 -15437 -17855 -19010 -18234 -768 -2105 -3003 -876 -19399 -22290 -17580 -17363 -17876 -7111
9603g111J5248M804o637p503k056j1258J306j199L324J6505O344P75j6535j6742
$$ -7111 8137 12941 6304 -1199 -3255 -14513 -13207 -14406 -11082 5423 11767 12542 -3993 -20735
9589b0735J0981Q960O470o171k222O340n769r152R16o886n415j2019K7571K1811
$$ -20735 -9754 -794 5676 -495 -2717 3623 -2146 -11298 -10382 -17268 -22683 -34702 -7131 14680
9575A4680m007Q711L677O040j0688j120P90k4702p369J4019K0134j4854j3329
$$ 14680 10673 19384 23061 29101 18413 17293 18083 -6619 -13988 31 20165 5311 -8018
9562h018q686J2783J8027k913l206O804J2390o50m541n611j4311o198P04p263
$$ -8018 -16704 -3921 14106 11193 7987 14791 27181 26531 21990 16379 2068 -4130 -3426 -10689
9548a0689r055R17K1335P890m747r568r947j792R905R880j382O667R98q553r51
$$ -10689 -19744 -18827 2508 10398 5651 -3917 -13864 -15656 -5751 4129 2747 9414 10412 1859 908
9533I08M38q859j3563m507J0223L922J2916Q384R46j0891l313j5116P650J7580
$$ 908 1346 -7513 -21076 -25583 -15360 -11438 1478 9862 10808 -83 -3396 -18512 -10862 6718
9519F718R181L428j5114j4568j1841M47M729J3124k195r3j367L446M028j3054
$$ 6718 15899 19327 4213 -10355 -22196 -21749 -17020 -3896 -6091 -6184 -7551 -4105 -77 -13131
9505a3131m416J4918J4186R940r358p228j963n208R374L354j2477k210r918J1955
$$ -13131 -17547 -2629 11557 21497 12139 4911 2948 -2260 7114 10468 -2009 -4219 -14137 -2182
9491b182L851O072l270j0271K786J1149J691j614o667q567o566k086L069R057
$$ -2182 1669 7741 4471 -5800 -3014 8135 9826 8212 1545 -7022 -13588 -15674 -12605 -3548
9477c548N731J89m245j0558p561J3330j014L6390K893j5125p96l235K106l214
$$ -3548 2183 2372 -1873 -12431 -19992 -6662 -7676 28714 31607 16482 15686 12451 14557 11343
9463A1343N757p697Q876o848j2088R61K636K199k105n409K531J0834k609q509
$$ 11343 17100 9403 18279 11431 -657 304 2940 5139 3034 -2375 156 10990 8381 -128
9449a28N09m78j2185p480j3814J8709K1022J594k907m835l398N337P203q984q727
$$ -128 381 -97 -12282 -19762 -33576 -14867 6155 7749 4842 7 -3391 1946 9149 165 -8562
9434h562J524J631j7191J2791J8957m773K762J1220Q66o514j9338k194J496k411
$$ -8562 -7038 -5407 -22598 -9807 9150 4377 7139 18359 19225 12711 -6627 -8821 -7325 -9736
9420i736r098L950p99O583P123k818Q726R976P240L364J030J2415j097k1170m011
$$ -9736 -18834 -14884 -15683 -9100 -1977 -4795 3931 13907 21147 24511 25541 37956 36859 15689 11678
9405A1678j146L567l085r175J2560M211j1258j196k723j30J248J2607o593j7793
$$ 11678 10532 14099 11014 1839 14399 18610 7352 6156 3433 3303 4551 17158 10565 -7228
9391g228l555n194K932K636Q23J3375P335R518L464k0605j2779p660m677J0773
$$ -7228 -10783 -15977 -13045 -10409 -9586 3789 11124 20642 24106 3501 -9278 -16938 -21615 -10842
9377a0842P780M703K111Q248m794O904k00o329l514M27K655N157p815n718M881
$$ -10842 -3062 1641 3752 12000 7206 14110 13910 7581 4067 4494 7149 12306 4491 -1227 3654
9362C654J0064J0130N742j3622j5084j5771L835Q212n246j803J1304J0837L993
$$ 3654 13718 23848 29590 15968 884 -14887 -11052 -2840 -8086 -9889 1415 12252 16245
9349A6245j9022p983m529j605J3398J2218k1732j0016J3730k127l190j242Q615
$$ 16245 -2777 -10760 -15289 -16894 -3496 8722 -13010 -23026 -9296 -11423 -14613 -15855 -7240
9336g240L852J4406M394k1723j2784N442l811P896Q84J5734j0549N314k164k1667
$$ -7240 -3388 11018 15412 -6311 -19095 -13653 -17464 -9568 -8684 7050 -3499 1815 -349 -22016
9322b2016o742L695N514J556J158J4674L139J0038j6314o410L348q648Q111J1508
$$ -22016 -28758 -25063 -19549 -17993 -16835 -2161 978 11016 -5298 -11708 -8360 -17008 -8897 2611
9308B611J3765K969j4948j3208Q467n744k642M011N518Q424r23j018j4939N302
$$ 2611 16376 19345 4397 -8811 -344 -6088 -8730 -4719 799 9223 8300 7282 -7657 -2355
9294b355K908j359j320J8955P566N660l356p941L141J6227k2656l3679j0915P981
$$ -2355 553 -806 -2126 16829 24395 30055 26699 18758 21899 38126 15470 -18209 -29124 -21143
9280b1143l044r743M827l532J3882L220L0P324k0N975J2387n307j2350J8016J1537
$$ -21143 -24187 -33930 -29103 -32635 -18753 -15533 -15503 -8179 -8199 -2224 10163 4856 -7494 10522 22059
9265B2059r606j700K367p956j3009r808q677j0707J2061N08L122K6530p332r474
$$ 22059 12453 10753 13120 5164 -7845 -17653 -26330 -37037 -24976 -24468 -21346 5184 -2148 -11622
9251a1622M865P995O675R333j7413j1438K340K686n340M652J2550J7590j0164
$$ -11622 -6757 1238 7913 17246 -167 -11605 -9265 -6579 -11919 -7267 5283 22873 12709
9238A2709o540n85P204L578l81l294j2880p954J883J4523O576o502N710j2233
$$ 12709 6169 5584 12788 16366 15985 12691 -189 -8143 -6260 8263 14839 8337 14047 1814
9224A814n658Q357J847o892j055o974O275l539J4341R451j1747m62L90j522K383
$$ 1814 -3844 4513 6360 -532 -1587 -8561 -2286 -5825 8516 17967 6220 5758 6148 4626 7009
9209G009K091r963n703r010j303J5015n223k253K469K868P353j4646R6J2143R882
$$ 7009 9100 -863 -6566 -15576 -16879 -1864 -7087 -9340 -6871 -4003 3350 -11296 -11200 943 10825
9194A0825J4376n130o725l11K002J0687l920M22Q148O193k487l730m988P568R198
$$ 10825 25201 20071 13346 13035 15037 25724 21804 22226 30374 36567 34080 30350 25362 32930 42128
9179D2128k665p820m704q088J4350K5531Q36j0476k956j8100k0727Q04J0008R232
$$ 42128 39463 31643 26939 18851 33201 58732 59568 49092 46136 28036 7309 8113 18121 27353
9165B7353J526J0450N369R43n235K151J7961J5639p490R998N070K866l334N81
$$ 27353 28879 39329 44698 45641 40406 42557 60518 76157 68667 78665 83735 86601 83267 83848
9151H3848J7234J1708J1864m557J6611K3412L0381J3407K6989M1406O3211P8270
$$ 83848 101082 112790 124654 120097 136708 160120 190501 203908 230897 272303 335514 413784
9139D13784Q2181J49443K02693L14362M67360P87483J383532K430440L471722
$$ 413784 495965 645408 848101 1162463 1629823 2417306 3800838 6231278 9703000
9130I703000K448004n10139j909702k034484j915472j672049j217706q18645n22504
$$ 9703000 12151004 11640865 9731163 7696679 5781207 4109158 2891452 2072807 1550303
9121A550303l51122k13688j52665j20001q7484q9876p2000m0858l5656l2550k9832
$$ 1550303 1199181 985493 832828 712827 625343 535467 463467 422609 386953 354403 324571
9110C24571k7872k4256j6482k4925k9296l1181l476M444l667j4270j1969j9586
$$ 324571 296699 272443 255961 231036 201740 170559 167083 171527 167860 153590 141621 122035
9098A22035k4411L140J7485j1066R88m908j8728Q09Q700r321l844K0265J502K122
$$ 122035 97624 100764 118249 107183 108171 103263 84535 85344 94044 84723 80879 101144 102646 104768
9084A04768j0890o913J079l0363j0653L574k222M505Q03J444j3119k13l388o246
$$ 104768 93878 86965 88044 57681 47028 50602 48380 52885 53688 55132 42013 41800 38412 32166
9070C2166j0166k08L140L768L881L323m691l601J1022J476q964m629J0777J3332
$$ 32166 22000 21792 24932 28700 32581 35904 31213 27612 38634 40110 31146 26517 37294 50626
9056E0626p247J04J3906j1557n099j4353j3078M821l18q054P829J1963r774o538
$$ 50626 43379 43483 57389 45832 40733 26380 13302 18123 17805 9751 17580 29543 19769 13231
9042A3231M778P100m301L321j40k997l96J7814J9674o770l4906k9705l282M260
$$ 13231 18009 25109 20808 24129 23989 20992 20596 38410 58084 51314 16408 -13297 -16579 -12319
9028a2319j888N021J6842O49o389Q4J675Q838N183K782O043M947N519j990j9370
$$ -12319 -14207 -9186 7656 8305 1916 2000 3675 12513 17696 20478 26521 31468 36987 34997 15627
9013A5627r935N96K886j4802k4268j7941P496Q444O292L568N305K85n579l207
$$ 15627 5692 6288 9174 -5628 -29896 -47837 -40341 -31897 -25605 -22037 -16732 -16447 -22026 -25233
8999b5233J3310m768O795O621m20j927L969J9383M834m282n43q726Q312l004j4223
$$ -25233 -11923 -16691 -9896 -3275 -3695 -5622 -1653 17730 22564 18282 17739 9013 17325 14321 98
8984I8j0997k440P493J5585J1026l781M583O796l626j72J227Q25j387r708m954
$$ 98 -10899 -13339 -5846 9739 20765 16984 21567 28363 24737 24565 25792 26617 25230 15522 10568
8969A0568l384j4933j6348p116O866N704J0844o04r28Q530L056P605r517k1712
$$ 10568 7184 -7749 -24097 -31213 -24347 -18643 -7799 -8403 -9331 -801 2255 9860 343 -21369
8955b1369o761O413J7800R276n619L760m602J2929J1040J1186l124j0550j1561
$$ -21369 -28130 -21717 -3917 5359 -260 3500 -1102 11827 22867 34053 30929 20379 8818
8942H818p954n221j855Q656N753l267o88j922J1939j6004j0060j9928M427J3229
$$ 8818 864 -4357 -6212 2444 8197 4930 4242 2320 14259 -1745 -11805 -31733 -27306 -14077
8928a4077O904m640k5727L679P884O08J3501l45k17J0053R759Q076J3284n457
$$ -14077 -7173 -11813 -37540 -33861 -25977 -25369 -11868 -12213 -12430 -2377 7382 15458 28742 23285
8914B3285j9097j2936l597K466Q133J705k075k941j109J4209k345m909j0864j0699
$$ 23285 4188 -8748 -12345 -9879 -1746 -41 -2116 -5057 -6166 8043 5698 789 -10075 -20774
8900b0774Q345J2181N424N381r860q218r437l165J0024J5850n30q040J5208J8474
$$ -20774 -12429 -248 5176 10557 697 -7521 -16958 -20123 -10099 5751 5221 -2819 12389 30863
8886C0863K158j5152K362R135n795j5068Q173K471j2155q235m663o167J5879J1479
$$ 30863 33021 17869 20231 29366 23571 8503 16676 19147 6992 -1243 -5906 -12073 3806 15285
8872A5285J3190j4826r359q913m092J0933O718j7189N797J8778j5005N397K1200
$$ 15285 28475 13649 4290 -4623 -8715 2218 8936 -8253 -2456 16322 1317 6714 27914
8859B7914o73q585r825m170J9251j264p888P152K342j2135J4107j704j5123K131
$$ 27914 27241 18656 8831 4661 23912 22648 14760 21912 24254 12119 26226 24522 9399 11530
8845A1530n059j4783R846O115l374j2744o716J0007O253J4548k250j4441m561
$$ 11530 6471 -8312 1534 7649 4275 -8469 -15185 -5178 1075 15623 13373 -1068 -5629
8832e629n817j362r879r69O75q135J4851N649R294P610J3587O07j7222j1088L053
$$ -5629 -11446 -12808 -22687 -23656 -22981 -31116 -16265 -10616 -1322 6288 19875 20482 3260 -7828 -4775
8817d775O661o1j1533J2770Q584Q681j661k0865j5430j249o4J4380J8912J2662
$$ -4775 1886 1825 -9708 3062 11646 20327 18666 -2199 -17629 -18878 -18942 -4562 14350 27012
8803B7012n892m751K727j9205k42N583o897q089p590R156J7717J2526O66j0991
$$ 27012 21120 16369 19096 -109 -351 5232 -1665 -9754 -17344 -8188 9529 22055 22721 11730
8789A1730j461J694K707n423n379j918q280m830L63R519O905n452K052p531q30
$$ 11730 10269 11963 14670 9247 3868 1950 -6330 -11160 -10797 -1278 5627 175 2227 -5304 -6134
8774f134Q178m898j3300O293Q74O231O029J0943k586m486q685P238J6747J266
$$ -6134 2044 -2854 -16154 -9861 -8987 -2756 3273 14216 11630 7144 -1541 5697 22444 23710
8760B3710k1895j8423o889N398J4638O08J1764l770k0964m015R035J1641m632
$$ 23710 1815 -16608 -23497 -18099 -3461 -2853 8911 5141 -15823 -19838 -10803 838 -3794
8747c794o702J1356L340k3693j83O941R93M721M395k665p132j0959n072R324J2171
$$ -3794 -10496 860 4200 -19493 -19676 -12735 -11742 -7021 -2626 -5291 -12423 -23382 -28454 -19130 -6959
8732f959L898m727n273n921k842r57j522Q314O952Q85O688j1563O876r78l588
$$ -6959 -3061 -7788 -13061 -18982 -21824 -22781 -24303 -15989 -9037 -8152 -1464 -13027 -6151 -7129 -10717
8717a0717J364j905L803J2080J0201j4064k484J2568l785j1831k085J0582P175
$$ -10717 -9353 -11258 -7455 4625 14826 762 -1722 10846 7061 -4770 -6855 3727 10902
8704A0902n027j698J3291q598k0691m255R324J773k145J066j3753p760K970K1238
$$ 10902 5875 4177 17468 8870 -11821 -16076 -6752 -4979 -7124 -6058 -19811 -27571 -24601 -3363
8690c363O12j3366L902J1149o367j1436J8270Q212L910n585K331J738n473r283
$$ -3363 -2751 -16117 -12215 -1066 -7433 -18869 -599 7613 11523 5938 8269 10007 4534 -4749
8676d749o726J2104R561O45p382J9606J906j9093m472j4339J0157L442n340m913
$$ -4749 -11475 629 10190 10835 3453 23059 24965 5872 1400 -12939 -2782 660 -4680 -9593
8662i593j302P609o048p994O889R93m717q002J2611J433k411N300K349M131m086
$$ -9593 -10895 -3286 -9334 -17328 -10439 -9446 -14163 -22165 -9554 -8121 -10532 -5232 -2883 1248 -2838
8647b838o646n762Q676K5052K0670j0404j2543k0757P331l324n502o896K766N013
$$ -2838 -9484 -15246 -6570 18482 39152 28748 16205 -4552 2779 -545 -6047 -12943 -10177 -5164
8633e164m616j7830j751O724J4522J0212j115m334J0180M063k913N00J039p863
$$ -5164 -9780 -27610 -29361 -22637 -8115 2097 982 -3352 6828 10891 7978 8478 9517 1654
8619A654j115K39q635j0500M868K770m509Q77J0039P105q979j272M241p309r501
$$ 1654 539 778 -7857 -18357 -13489 -10719 -15228 -14351 -4312 2793 -6186 -7458 -3217 -10526 -20027
8604b0027N02L148R653Q459J743l296m27L070R238K096p132K002Q195m334j7513
$$ -20027 -19525 -16377 -6724 1735 3478 182 -245 2825 12063 14159 7027 9029 17224 12890 -4623
8589d623k584R44k260q746J0300J09j6578K004P181N190l106P973J1123J0999
$$ -4623 -7207 -6263 -8523 -17269 -6969 -6860 -23438 -21434 -14253 -9063 -12169 -4196 6927 17926
8575A7926j2615j1995k096N754M003k721m198N66J65j5121J0519M685l057q398
$$ 17926 5311 -6684 -8780 -3026 977 -1744 -5942 -5376 -5211 -20332 -9813 -5128 -8185 -16583
8561a6583J7607P508l97k81j684m222Q033m685n066j2900P53R466O398q616J2721
$$ -16583 1024 8532 8135 7854 6170 1948 9981 5296 230 -12670 -11917 -2451 3947 -4669 8052
8546H052R438j1745m012j0562J0159K8051J671j9055m880r334J5332P375P082
$$ 8052 17490 5745 1733 -8829 1330 29381 31052 11997 7117 -2217 13115 20490 27572
8533B7572K002r310p655j3526M293J094J8546J8485M940r984j0320q356P876j729
$$ 27572 29574 20264 12609 -917 3376 4470 23016 41501 46441 36457 26137 17781 25657 23928
8519B3928j9720k258J93p296j509q41Q665L859l602m636k653j3420m6K1902J1771
$$ 23928 4208 1950 2143 -5153 -6662 -7503 1162 5021 1419 -3217 -5870 -19290 -19336 2566 14337
8504A4337Q827j0099o782k93K6676Q553r607j2751K791n677j3975k535q306O826
$$ 14337 23164 13065 6283 5990 32666 41219 31612 18861 21652 15975 2000 -535 -8841 -2015
8490b015j3869j6943r092J7893O257J151o535m345J9587J1782J1844l398j6298
$$ -2015 -15884 -32827 -41919 -24026 -17769 -16618 -23153 -27498 -7911 3871 15715 12317 -3981
8477c981j3136J4876J1957k374J754k153r518k78K754M510q747r03R793J4776
$$ -3981 -17117 -2241 9716 7342 9096 6943 -2575 -2853 -99 4411 -4336 -5239 4554 19330
8463A9330k60o720j6887j421J4278n834j5350N699N566l640j3633p339K306R000
$$ 19330 19070 12350 -4537 -5958 8320 2486 -12864 -7165 -1599 -5239 -18872 -26211 -23905 -14905
8449a4905J6235K485j5801m391j0488p397O064J678N732J2474J0382J6358j271
$$ -14905 1330 3815 -11986 -16377 -26865 -34262 -28198 -26520 -20788 -8314 2068 18426 17155
8436A7155j2462j76p332j2215k034L489N757j485Q690J8138Q863k0587q558O099
$$ 17155 4693 4517 -2815 -15030 -17064 -13575 -7818 -9303 -613 17525 26388 5801 -2757 3342
8422C342P116q745j9574r640J8174Q494M885K309j2112J1627J533j285j7387P348
$$ 3342 10458 1713 -17861 -27501 -9327 -833 4052 6361 -5751 5876 7409 6124 -11263 -3915
8408c915j416l416K367P416l148j859j4717j7964k296J9652K3425o268r321p33
$$ -3915 -5331 -8747 -6380 1036 -2112 -3971 -18688 -36652 -38948 -19296 4129 -2139 -11460 -12193
8394a2193J4811M839j7025L545q20p48L661l928O644k450J582l336L571J836J200
$$ -12193 2618 7457 -9568 -6023 -6843 -7591 -3930 -7858 -1214 -3664 -2082 -5418 -1847 -11 1189
8379A189n558O782K551J492k700r364J2666q500j5633L070o075M421J3564J6775
$$ 1189 -4369 2413 4964 6456 3756 -5608 7058 -1442 -17075 -14005 -20080 -15659 -2095 14680
8365A4680P191j0648o854J1498J0507p315m356r025P105l9N054J2362p52j0248
$$ 14680 21871 11223 4369 15867 26374 19059 14703 5678 12783 12744 17798 30160 29408 19160
8351A9160j1495Q621l300j6767M802J169O330M740j9429j0057k48J963o844r494
$$ 19160 7665 16286 12986 -3781 1021 2190 8520 13260 -6169 -16226 -16474 -14511 -21355 -30849
8337c0849q827k321Q147M751P870P424M932p589l779M120R789J9719N270L814
$$ -30849 -39676 -41997 -33850 -29099 -21229 -13805 -8873 -16462 -20241 -16121 -6332 13387 18657 22471
8323B2471n166p166J1160N810P191j478j2482q696m615p53q267L282o774P717
$$ 22471 17305 10139 21299 27109 34300 32822 20340 11644 7029 6276 -1991 1291 -5483 2234
8309B234J69r278J9462J2551l822J2494o269j0010j9953k145n869J4018J5792
$$ 2234 2403 -6875 12587 25138 21316 33810 27541 17531 -2422 -4567 -10436 3582 19374
8296A9374k70l546J1968j2530k5419m527K1943K2249j0789n785R438o341K85q03
$$ 19374 19104 15558 27526 14996 -10423 -14950 6993 29242 18453 12668 22106 15765 16050 15247
8282A5247O709J1745l440j7931k0684O715J0763l829m669j5105M496J6561J7076
$$ 15247 21956 33701 30261 12330 -8354 -1639 9124 5295 626 -14479 -9983 6578 23654
8269B3654J918j0219j6068j35j0981j287J1728J4459R096j708Q159n473j8373
$$ 23654 25572 15353 -715 -850 -11831 -13118 -1390 13069 22165 20457 28616 23143 4770
8256D770j1933j0156J293L923J6947J603j2117K707J691N063K574l566j0577J4896
$$ 4770 -7163 -17319 -16026 -12103 4844 6447 -5670 -2963 -1272 3791 6365 2799 -7778 7118
8242G118m209r791K5577Q640P82Q991j672J019J556J2467J1930j883J8151J4403
$$ 7118 2909 -6882 18695 27335 28117 37108 35436 36455 38011 50478 62408 60525 78676 93079
8228I3079K6445K8398P062K535J4338q749k8431j867j1303k1517j7517j1261j8552
$$ 93079 119524 147922 154984 157519 171857 163108 134677 132810 121507 99990 82473 71212 52660
8215E2660N684J0206j3144k596o586j1718J8224M347q082j1898M232K2788J369
$$ 52660 58344 68550 55406 52810 46224 34506 52730 57077 48995 37097 41329 64117 65486
8202F5486J523J5156J5716K1812L1970K3711J4024M5332N1640N4929M6111M4187
$$ 65486 67009 82165 97881 119693 151663 175374 189398 234730 286370 341299 387410 431597
8190D31597L0357j897k7644l6190l2055n1933m5283l8316j8484m4292j5182N79
$$ 431597 461954 460057 432413 396223 364168 312235 266952 228636 210152 165860 150678 151257
8178A51257j3298k2925l731j016j0055L607J2994j2545q514Q189K7356J3424o490
$$ 151257 137959 115034 111303 110287 100232 103839 116833 104288 95774 103963 131319 144743 138253
8165A38253L475J9135J7024J8538L2410N6767N3892L6143L1678M6482J3548n208
$$ 138253 141728 160863 177887 196425 228835 285602 339494 375637 407315 453797 467345 462137
8153D62137n654q061m5450m8430o2249m4695k3792j4303j9802l7847l4715j2137
$$ 462137 456483 448422 402972 354542 292293 247598 223806 209503 189701 151854 117139 105002
8141A05002k0826j0899l401j4412k0040j345N605J6325J7925M131J010P515L746
$$ 105002 84176 73277 69876 55464 35424 34079 39684 56009 73934 78065 79075 86590 90336
8128I0336l132J2533O759J916L84J4858N259L236J7459J7954Q41j0764k2807j7965
$$ 90336 87204 99737 106496 108412 108796 123654 128913 132149 149608 167562 168403 157639 134832 116867
8114A16867m312n309j6362j6890j8892k0895k905J506j1521j3196R597q477r938
$$ 116867 112555 107246 90884 73994 55102 34207 31302 32808 21287 8091 17688 9211 -727
8101g27q624j554J813J755L342R631O398j4554j375N025j3548m54K617n02k49
$$ -727 -9351 -10905 -9092 -7337 -3995 5636 12034 -2520 -3895 1130 -12418 -12872 -10255 -10757 -11006
8086a1006r945o281K4113J1131m269j0431L809L62q472o86l491J0915J2377P8
$$ -11006 -20951 -27232 -3119 8012 3743 -6688 -2879 -2517 -10989 -11675 -15166 -4251 8126 8204
8072H204k430K0364l987j7499j0727L175l807n455J7511L547N424j6490l615j656
$$ 8204 5774 26138 22151 4652 -6075 -2900 -6707 -12162 5349 8896 14320 -2170 -5785 -7441
8058g441P34Q41O243k398q73R75r826p442N083n765p929P315o191p187M223Q634
$$ -7441 -6707 -5866 377 -2021 -2894 -1919 -11745 -19187 -14104 -19869 -27798 -20483 -26674 -33861 -29638 -21004
8042b1004R060J0620J5772m455l398K400Q229k206j4982r431Q704N277m128j1540
$$ -21004 -11944 -1324 14448 9993 6595 8995 17224 15018 36 -9395 -691 4586 458 -11082
8028a1082J051Q237J7315J1379j3173j8431l802n905J3730J3634j6383L983J7
$$ -11082 -10031 -1794 15521 26900 13727 -4704 -8506 -14411 -681 12953 -3430 553 570
8015E70P457M665J067j092j3029j621Q506m101k0800o321J9646P463n125K684
$$ 570 8027 12692 13759 12667 -362 -1983 6523 2422 -18378 -24699 -5053 2410 -2715 -31
8001c1l69Q837j8779k0264l09j694Q942J2501J2611m235K653J1199j4941r880
$$ -31 -400 8437 -10342 -30606 -30915 -32609 -23667 -11166 1445 -2790 -137 11062 -3879 -13759
7987a3759n706J585R380j418j4732J90K939N722J1966J1333K668m168j2036j3133
$$ -13759 -19465 -17880 -8500 -9918 -24650 -24460 -21521 -15799 -3833 7500 10168 6000 -6036 -19169
7973a9169P020J1876j058r671M0R543J8066Q480J532K856o617j1782j605r191
$$ -19169 -12149 -273 -1331 -11002 -10962 -1419 16647 25127 26659 29515 22898 11116 9511 320
7959C20N86j587j095j2693K577P363J15k991Q776j918m808L43Q585J2546m186
$$ 320 906 -681 -1776 -14469 -11892 -4529 -4414 -7405 1371 -547 -5355 -5012 3573 16119 11933
7944A1933n33M741J723o952J5812R735j0514j7917j4778J5829j062M692k402j3453
$$ 11933 11400 16141 17864 10912 26724 36459 25945 8028 -6750 9079 8017 12709 10307 -3146
7930c146l104K2084J5395m270k5979k783j587l001P904r706L998J2468r087K294
$$ -3146 -6250 15834 31229 26959 980 -1803 -3390 -6391 1513 -8193 -4195 8273 -814 1480
7916A480K385r652J1634K4301j6156j3792k795j5013j5198J0887J5692J2446R505
$$ 1480 3865 -5787 5847 30148 13992 200 -2595 -17608 -32806 -21919 -6227 6219 15724
7903A5724l729J542M9j6059K663J241n169K752J5711k38K717m024K289l726n713
$$ 15724 11995 13537 13586 -2473 190 1431 -3738 -986 14725 14487 17204 13180 15469 11743 6030
7888F030K372k398p746j5959j0699Q577J4761R103o51L891n590r064M079J6590
$$ 6030 8402 6004 -1742 -17701 -28400 -19823 -5062 4041 3390 7281 1691 -7373 -3294 13296
7874A3296P799l989j3469k887R075Q75k277j7786M39o18n042k997l617P151J1276
$$ 13296 21095 17106 3637 750 9825 10700 8423 -9363 -8924 -9542 -14584 -17581 -21198 -14047 -2771
7859b771J887j244o448o749j5384Q614J0541n617R683N014M991L203m368j4601
$$ -2771 -884 -2128 -8576 -15325 -30709 -22095 -11554 -17171 -7488 -2474 2517 5720 1352 -13249
7845a3249j148M030Q71R603J199q036q41J0273o126o880l367L549O436j748m511
$$ -13249 -14397 -10367 -9496 107 1306 -6730 -7571 2702 -3424 -10304 -13671 -10122 -3686 -5434 -9945
7830i945o539O536J63K923k801l665J2627J2723o07k550L42m307j0439p307R578
$$ -9945 -16484 -9948 -9785 -6862 -9663 -13328 -701 12022 11415 8865 9207 4900 -5539 -12846 -3268
7815c268r754N283J9367P591p625k5702n023N726J704L584J4820M110r656q331
$$ -3268 -13022 -7739 11628 19219 11594 -14108 -19131 -13405 -11701 -8117 6703 10813 1157 -7174
7801g174j0987J636J3336J3694R920K617j1546j2994k471R605m898o284N498J1328
$$ -7174 -18161 -16525 -3189 10505 20425 23042 11496 -1498 -3969 5636 738 -5546 -48 11280
7787A1280L064L013j5517o044l701J389J3567p403j5984l898J3753J4993Q41o919
$$ 11280 14344 17357 1840 -4204 -7905 -6516 7051 -352 -16336 -20234 -6481 8512 9353 2434
7773B434r24j0401Q589n065j7980n679J5216J738R316J713j3859m761J4679J5023
$$ 2434 1510 -8891 -302 -5367 -23347 -29026 -13810 -12072 -2756 -1043 -14902 -19663 -4984 10039
7759A0039p67K739R119j079j129p530q923J2285o811L012j925j526p586j0236
$$ 10039 9272 12011 21130 20051 18922 11392 2469 14754 7943 10955 9030 7504 -82 -10318
7745a0318k612P822J0280K840p024q713K961O478J153J641J1619O973j3149q462
$$ -10318 -12930 -5108 5172 8012 988 -7725 -4764 1714 2867 4508 16127 23100 9951 1489
7731A489j1286J6560J653n170j3147m324J2870P937J2657M276K150r061q580P103
$$ 1489 -9797 6763 8416 3246 -9901 -14225 -1355 6582 19239 23515 25665 16604 8024 15127
7717A5127r88j499m065L190l683n226M786m320Q195n670N117N68k736j1878P67
$$ 15127 14139 12640 8575 11765 8082 2856 7642 3322 11517 5847 10964 11532 8796 -3082 -2315
7702b315J0694j4504j0784j248N909k135j5089M399J1858p25l112L667Q619J1052
$$ -2315 8379 -6125 -16909 -18157 -12248 -14383 -29472 -25073 -13215 -13940 -17052 -13385 -4766 6286
7688F286k788n784q924j3792l929R600k239l185p691M419r38J5467J1744j0896
$$ 6286 3498 -2286 -11210 -25002 -28931 -19331 -21570 -24755 -32446 -28027 -28965 -13498 -1754 -12650
7674a2650n015j911P191R612Q163P924L428O767p186k4728r384P970n441o494
$$ -12650 -17665 -19576 -12385 -2773 5390 13314 16742 23509 16323 -8405 -17789 -9819 -15260 -21754
7660b1754J8144J348l130l987J228K387j3550k2530O228J3445P841J2345Q733
$$ -21754 -3610 -2262 -5392 -9379 -8151 -5764 -19314 -41844 -35616 -22171 -14330 -1985 6748
7647F748M729j0432j8910m446O186j896j0353K225K0858r65J68j620r570J4965
$$ 6748 11477 1045 -17865 -22311 -16125 -18021 -28374 -26149 -5291 -6256 -6088 -7708 -17278 -2313
7633b313J0649n897K155L891j0431k498n460j1478k600J996O563K52m313J0361
$$ -2313 8336 2439 4594 8485 -1946 -4444 -9904 -21382 -23982 -21986 -15423 -15171 -19484 -9123
7619i123N428m085M874m530q486L621Q270n60O459j1792k202L334m723J0490J4622
$$ -9123 -3695 -7780 -2906 -7436 -15922 -12301 -4031 -4591 1868 -9924 -12126 -8792 -13515 -3025 11597
7604A1597p968j631J5955J5261k603k4690j9720p676O174K5352M810j4332K313
$$ 11597 3629 1998 17953 33214 30611 5921 -13799 -21475 -15301 10051 14861 529 2842
7591B842P88m960j3719O483J0010r085j7161l732K229k31J6162J5402K48l685
$$ 2842 3630 -1330 -15049 -8566 1444 -7641 -24802 -28534 -26305 -26536 -10374 5028 5276 1591
7577A591n38P448J0863j3624l762o728N221K0253J5353n140j8483q944j0797n067
$$ 1591 1053 8501 19364 5740 1978 -4750 471 20724 36077 30937 12454 3510 -7287 -12354
7563a2354o703r26J6419M263k250J0018M036p507j1487o301k490j581J218Q531
$$ -12354 -19057 -19983 -3564 699 -1551 8467 12503 4996 -6491 -12792 -15282 -16863 -15645 -7114
7549g114J0709N933k207k204m675k757q10P122Q455J6083O777j4348j6948p85
$$ -7114 3595 9528 7321 5117 442 -2315 -3125 3997 12452 28535 35312 20964 4016 3231
7535C231L226j765j1593m505J3321J2747J3138J2713p235K898j1433p211L25q162
$$ 3231 6457 4692 -6901 -11406 1915 14662 27800 40513 33278 36176 24743 17532 17857 9695
7521I695n15p443l919R792J549k1567j4897J0524O860O749J4808j0207M183n470
$$ 9695 9180 1737 -2182 7610 9159 -12408 -27305 -16781 -9921 -3172 11636 1429 5612 142
7507A42q414n022m597m884P807P648R437J0290O754j6107j3220r693J594K797
$$ 142 -8272 -13294 -17891 -22775 -14968 -7320 2117 12407 19161 3054 -10166 -19859 -18265 -15468
7493a5468q76K121O624R249J378m443Q079J0790n433o904l832o438l718J2267
$$ -15468 -16344 -14223 -7599 1650 3028 -1415 6664 17454 12021 5117 1285 -5153 -8871 3396
7479C396O609j2473j5968o74n0J436k822o412K961R888R610p798o404J6541j142
$$ 3396 10005 -2468 -18436 -19110 -19160 -17724 -20546 -26958 -23997 -14109 -4499 -12297 -18701 -2160 -3302
7464c302R137J4289K0896j42j4827j0943j4645j9456p910J0295J1268l763j597
$$ -3302 5835 20124 41020 40878 26051 15108 463 -18993 -26903 -16608 -5340 -9103 -10700
7451a0700R271j245J951L506n312K935O954m316m78K020j345j6625k536O989O943
$$ -10700 -1429 -2674 -723 2783 -2529 406 7360 3044 2566 4586 3241 -13384 -15920 -8931 -1988
7436a988J3411k639r112P34R373K866k7J52q380L763R926q992o184M815J496n913
$$ -1988 11423 8784 -328 406 9779 12645 12618 12770 4390 8153 18079 9087 2903 7718 9214 3301
7420C301l71J4413M791j0724n768q427p555J707N244Q51k114j0974n89k135R069
$$ 3301 2930 17343 22134 11410 5642 -2785 -10340 -8633 -3389 -2538 -4652 -15626 -16215 -18350 -9281
7405i281J168m420j091r9p620n295J6200J5619J3526o098o252j4414m354p340
$$ -9281 -8113 -12533 -13624 -13723 -21343 -26638 -10438 5181 18707 12609 6357 -8057 -12411 -19751
7391a9751J3768P483R756m607q709o232j463J043J3854J0705j73m922o759j4357
$$ -19751 -5983 1500 11256 6649 -2060 -8292 -9755 -8712 5142 15847 15674 10752 3993 -10364
7377a0364J7246R440r263N396L541M489O919l328p413r841j278l568j184J056
$$ -10364 6882 16322 7059 12455 15996 20485 27404 24076 16663 6822 5544 1976 792 1848
7363A848o812J51q825k13k008l168j334J7095J015j186p720J1184q750q666O493
$$ 1848 -4964 -4813 -13638 -13851 -15859 -19027 -20361 -3266 -2251 -3437 -11157 27 -8723 -17389 -10896
7348a0896J4824J452j9134M93N547P251o701k3332L429Q507l845j3971M58O371
$$ -10896 3928 5380 -13754 -13261 -7714 -463 -7164 -30496 -27067 -18560 -22405 -36376 -35918 -29547
7334b9547N232j1065P310P437J4747J5566L495q72M008j0130j3916j2099J1398
$$ -29547 -24315 -35380 -28070 -20633 -5886 9680 13175 12303 16311 6181 -7735 -19834 -8436
7321h436J3282O798j639N926m193q207M271N756r768j4815k881K0433J2775k93
$$ -8436 4846 11644 10005 15931 11738 3531 7802 13558 3790 -11025 -13906 6527 19302 19009
7307A9009L933J996m460j4576k2709j8758q360l947J4477J1138k570r381l918
$$ 19009 22942 24938 20478 5902 -16807 -35565 -43925 -47872 -33395 -22257 -24827 -34208 -38126
7294c8126J9904J3896K488p671o223j645m533j1481P359k087O491Q094Q023p33
$$ -38126 -18222 -4326 -1838 -9509 -15732 -17377 -21910 -33391 -26032 -28119 -21628 -13534 -5511 -6244
7280f244r694r329K790L846N867O459P728Q190q521k368R001P78q277M335J0667
$$ -6244 -15938 -25267 -22477 -18631 -12764 -6305 1423 9613 1092 -1276 7725 8503 226 4561 15228
7265A5228l75j4452J986J0574P836p828m15j4885l987k942J659L710j595l167
$$ 15228 14853 401 2387 12961 20797 12969 12554 -2331 -6318 -9260 -7601 -3891 -5486 -8653
7251h653N738K595j019J732L008R481J209j0297j1159L482k722O670J0160M339
$$ -8653 -2915 -320 -1339 393 3401 12882 14091 3794 -7365 -3883 -6605 65 10225 14564
7237A4564k21j2736j5276L729k984R46J1352j619j578N278M834r336p012j4891
$$ 14564 14343 1607 -13669 -9940 -12924 -11978 -626 -2245 -3823 1455 6289 -3047 -10059 -24950
7223b4950J238J5218L3100J3846l28r222j7736n111j4134J3859J9564P958j3373
$$ -24950 -23712 -8494 24606 38452 38124 28902 11166 6055 -8079 5780 25344 33302 19929
7210A9929l867j0081L405O866k425r229M619o820q107K106J1790J0227K925Q00
$$ 19929 16062 5981 9386 16252 13827 4598 9217 2397 -5710 -3604 8186 18413 21338 22138
7196B2138P976j7872j6284n720N851j4821r81K7354J2129r923q115q588P032j1889
$$ 22138 30114 12242 -4042 -9762 -3911 -18732 -19713 7641 19770 9847 1732 -6856 176 -11713
7182a1713k569J2057K990l390m377K290J885K4326p149k152p295l432m107k82
$$ -11713 -14282 -2225 765 -2625 -7002 -4712 -2827 21499 14350 12198 4903 1471 -2636 -2918
7168b918j9814q958J397J2175K358J704R500P908m405R321J4082p760k5158j843
$$ -2918 -22732 -31690 -30293 -18118 -15760 -14056 -4556 3352 -1053 8268 22350 14590 -10568 -12411
7154a2411J2074M426q481L691n731L111N048n993j362J151m91L66J2369n176k616
$$ -12411 -337 4089 -4392 -701 -6432 -3321 1727 -4266 -5628 -4477 -4968 -4602 7767 2591 -25
7139b5p37j3324K821J399p177j1226L538J8893r960M901M060j416n144P360J708
$$ -25 -762 -14086 -11265 -9866 -17043 -28269 -24731 -5838 -15798 -10897 -6837 -8253 -13397 -6037 -4329
7124d329l243l497j902Q978J4689o572j3091J664J7098m78j0978l06p496m271
$$ -4329 -7572 -11069 -12971 -3993 10696 4124 -8967 -7303 9795 9317 -1661 -1967 -9463 -13734
7110a3734n818k142Q131J9295Q884n057j5182P227K227j3520o398n319J1412k920
$$ -13734 -19552 -21694 -13563 5732 14616 9559 -5623 1604 3831 -9689 -16087 -21406 -9994 -12914
7096a2914j0978o673K676O82J2059J5892P751k458r844N610M133j0542Q62J1391
$$ -12914 -23892 -30565 -27889 -27207 -15148 744 8495 6037 -3807 1803 5936 -4606 -3744 7647
7082G647J1349o591m819J106l791r939Q748J1806j2410Q293J936j1493N806K032
$$ 7647 18996 12405 7586 8692 4901 -5038 3710 15516 3106 11399 13335 1842 7648 9680
7068I680O823k100r15p811j7572N188J1232p795j0508k540p768K5352K564J992
$$ 9680 16503 14403 13488 5677 -11895 -6707 4525 -3270 -13778 -16318 -24086 1266 3830 5822
7054E822l069j0592r318J1623O317p296o670n623m694j8535j226J1554P171l223
$$ 5822 2753 -7839 -17157 -5534 783 -6513 -13183 -18806 -23500 -42035 -43261 -31707 -24536 -27759
7040b7759J838J4248J7421O573n452N608J2078N755j5949j6102n036n59n139J122
$$ -27759 -25921 -11673 5748 12321 6869 12477 24555 30310 14361 -1741 -6777 -7336 -12475 -11353
7026a1353O14M955J4957J2330J262R225N85k7400L922J0289m432o454L261j1134
$$ -11353 -10739 -5784 9173 21503 22765 31990 32575 5175 9097 19386 14954 8500 11761 627
7012F27j8596O853J46r674O070J5442P308m169j0375l997K060J3947k806M64M935
$$ 627 -17969 -11116 -10970 -20644 -14574 868 8176 4007 -6368 -10365 -8305 5642 2836 3300 8235
6997H235J2176J1083j835j1417q032n065j4308P959k71N142m565l122R425P2R504
$$ 8235 20411 31494 29659 18242 10210 5145 -9163 -1204 -1475 3667 -898 -4020 5405 5477 14981
6982A4981n418j5664p019m998J4068N847j993r444p300j69P403R148J0512J272
$$ 14981 9563 -6101 -13120 -18118 -4050 1797 -196 -9640 -16940 -17109 -9706 -558 9954 11226
6968A1226l652M645k6223j9729N571J7050J5483j621K637J766L439J7861P446
$$ 11226 7574 12219 -14004 -33733 -28162 -11112 4371 2750 5387 7153 10592 28453 35899
6955C5899j3689j4560j1155k576J8085J8716l239j2732q872q234K865n91n288
$$ 35899 22210 7650 -3505 -6081 12004 30720 27481 14749 5877 -2357 508 -83 -5371
6942e371o40N055q048k640M461n20Q18l956k208Q663N041O98p188r927Q046J121
$$ -5371 -6011 -956 -9004 -11644 -7183 -7703 -6885 -10841 -13049 -4386 655 1353 -5835 -15762 -7716 -6595
6926f595k687K31m395J0436j0274r143l26P596O98N787p257q427q078m69P859
$$ -6595 -9282 -9051 -13446 -3010 -13284 -22427 -22753 -15157 -14459 -8672 -15929 -24356 -32434 -32903 -25044
6911b5044N513n614Q953K4585J077j9528j760J1420m782k2672p543R923J2532
$$ -25044 -19531 -25145 -16192 8393 9470 -10058 -11818 -398 -5180 -27852 -35395 -25472 -12940
6898a2940J5459L347J431O982p299q03R767r712k141J0941J5537p670k2368R326
$$ -12940 2519 5866 7297 14279 6980 6177 15944 6232 4091 15032 30569 22899 531 9857
6884I857L110q431N650k65O602M10k0176j8433M843J5012M040j409Q480Q952J0073
$$ 9857 12967 4536 10186 9921 16523 16933 -3243 -21676 -16833 -1821 2219 810 9290 18242 28315
6869B8315m934l250j153m421l751j1181J451R114R447j448J0011J5716q852r510
$$ 28315 23381 20131 18978 14557 10806 -375 1076 10190 19637 18189 28200 43916 35064 25554
6855B5554j3735R938q93j3959k1313j6177O674l000l609J3533J7889L864k927
$$ 25554 11819 21757 20864 6905 -14408 -30585 -23911 -26911 -30520 -16987 902 4766 1839
6842A839m341K550J9351k960j9608o903K0646J2745j1137j7639J655J623K61L146
$$ 1839 -2502 48 19399 16439 -3169 -10072 10574 23319 12182 -5457 -3802 -2179 -1918 1228
6828A228O102P710j079p328K8n604l395J805j5812p778j188N984K1912K539q140
$$ 1228 7330 15040 13961 6633 6661 1057 -2338 -533 -16345 -24123 -25311 -19327 2585 5124 -3016
6813c016O138J1007R408r715p703m274m568j489n266q677N322p321N38P614R542
$$ -3016 3122 14129 23537 13822 6119 1845 -2723 -4212 -9478 -18155 -12833 -20154 -19616 -12002 -2460
6798b460J3026j3134r777j2964o913J3232K1663j391k230P71M30N037q749m457
$$ -2460 10566 -2568 -12345 -25309 -32222 -18990 2673 1282 -948 -177 253 5290 -3459 -7916
6784g916M542p610l574J7517l387p222Q17J4520O277N302K663o364q416L942J827
$$ -7916 -3374 -10984 -14558 2959 -428 -7650 -6833 7687 13964 19266 21929 15565 7149 11091 12918
6769A2918j0292p75L506k831j4988J6340K0073k945k6534r997R033r19J489n867
$$ 12918 2626 1851 5357 2526 -12462 3878 23951 21006 -5528 -15525 -6492 -7411 -5922 -11789
6755a1789o693m971O102K5831J4185j593k851o414p954L676N585r731j1401k037
$$ -11789 -18482 -23453 -17351 8480 22665 21072 18221 11807 3853 7529 13114 3383 -8018 -10055
6741a0055P640m265p569k5J2336J2582M492N911J2642L494j3724j5054p748N555
$$ -10055 -2415 -6680 -14249 -14274 -1938 10644 15136 21047 33689 37183 23459 8405 657 6212
6727F212l147L592j5878l945N686R320j235j105K808k0605L648K5377R168J272
$$ 6212 3065 6657 -9221 -13166 -7480 1840 605 -500 2308 -18297 -14649 10728 19896 21168
6713B1168j8958p261L650q978J6766l180j1348p588J3563P212J1116m293l749
$$ 21168 2210 -5051 -1401 -10379 6387 3207 -8141 -15729 -2166 5046 16162 11869 8120
6700H120q714k2567J381J0665o482r30j77L738Q529l788L115k070j1321j3532
$$ 8120 -594 -23161 -21780 -11115 -17597 -18527 -18704 -14966 -6437 -10225 -7110 -9180 -20501 -34033
6686c4033q53L332M815J7879l04j2815m265o413N323j702K171l914j420o916n019
$$ -34033 -34886 -31554 -26739 -8860 -9164 -21979 -26244 -32657 -27334 -29036 -26865 -30779 -32199 -39115 -44134
6671d4134P841Q921J3921L514n161j8599L771K6756K1733j3252r043J435j3363
$$ -44134 -36293 -27372 -13451 -9937 -15098 -33697 -29926 -3170 18563 5311 -3732 -2297 -15660
6658a5660m083N186Q594R046k1N418J5112R571m852j0855n032P79j743M523L93
$$ -15660 -19743 -14557 -5963 3083 3062 8480 23592 33163 28311 17456 12424 13203 11460 15983 16376
6643A6376m850J611l522j2024l491Q329J479R22m543P4M266l387p051j8455J2884
$$ 16376 11526 13137 9615 -2409 -5900 2429 3908 4830 287 361 4627 1240 -5811 -24266 -11382
6628a1382J2079N212q637R55P180q641P114N678k445q808o542o441P894J4161
$$ -11382 697 5909 -2728 -1773 5407 -3234 3880 9558 7113 -1695 -8237 -14678 -6784 7377
6614G377P142m597j2666o829j4869O013P664J765J0483J519n010k194K504P802
$$ 7377 14519 9922 -2744 -9573 -24442 -18429 -10765 -9000 1483 3002 -2008 -4202 -1698 6104
6600F104J0066l047n646m679q478K111l888N991Q887k902q587n875n226K0993
$$ 6104 16170 13123 7477 2798 -5680 -3569 -7457 -1466 7421 4519 -4068 -9943 -15169 5824
6586E824n301p632L063n776o278k551M425R466P322n12j301L902j437O724l944
$$ 5824 523 -7109 -4046 -9822 -16100 -18651 -14226 -4760 2562 2050 749 4651 3214 9938 5994
6571E994j9742n711Q063L467J348R328p882o805J4563n42R20J5130p334j6976
$$ 5994 -13748 -19459 -11396 -7929 -6581 2747 -5135 -11940 2623 2081 3001 18131 10797 -6179
6557f179M455j1247j1395M843J719J8779M486l755O742M329K446M85J702m796
$$ -6179 -1724 -12971 -24366 -19523 -17804 975 5461 1706 8448 12777 15223 15708 17410 12614
6543A2614n814l305r352Q31j0830N824n706k254M353J614K459L328K62k490J3103
$$ 12614 6800 3495 -5857 -5026 -15856 -10032 -15738 -17992 -13639 -12025 -9566 -6238 -5976 -8466 4637
6528D637J3603j1773o280r042q629R730J2102J156n12K2309P759o142n403L435
$$ 4637 18240 6467 187 -8855 -17484 -7754 4348 5504 4992 27301 35060 28918 23515 26950
6514B6950j9129j8726P996J2239l088n712m143n490Q44N477J300j051j5549K73
$$ 26950 7821 -10905 -2909 9330 6242 530 -3613 -9103 -8259 -2782 -1482 -2533 -18082 -17809
6500a7809L052j70L865N111K406j2064L163K022j886O762Q308o406J3026K970
$$ -17809 -14757 -14927 -11062 -5951 -3545 -15609 -12446 -10424 -12310 -5548 2760 -3646 9380 12350
6486A2350j208k42r917o206o855o626J7746P092l176Q687N180j217j1481k466
$$ 12350 11142 10900 983 -5223 -12078 -18704 -958 6134 2958 11645 16825 15608 4127 1661
6472A661K071L342O091r442k8669o440j2689O981J4426K2910J3257P480j3375
$$ 1661 3732 7074 13165 3723 -24946 -31386 -44075 -37094 -22668 242 13499 20979 7604
6459G604k3553m940J600J8260M306l727l155O68o859j452K764k689P843L647m669
$$ 7604 -15949 -20889 -19289 -1029 3277 -450 -3605 -2937 -9796 -11248 -8484 -11173 -3330 317 -4352
6444d352m160Q228J0317K106j3349j3029o394K098M70J9158J5249j376q149j3353
$$ -4352 -8512 -284 10033 12139 -1210 -14239 -20633 -18535 -18065 1093 16342 14966 6817 -6536
6430f536j0883o199J776j894j0892J828N766O137M213n551Q07L291n637q713K052
$$ -6536 -17419 -23618 -21842 -23736 -34628 -32800 -27034 -20897 -16684 -22235 -21428 -18137 -23774 -32487 -30435
6415c0435J9342J551l725L436l115m081P46l874k464K294J7581N106L987O822
$$ -30435 -11093 -9542 -13267 -9831 -12946 -17027 -16281 -20155 -22619 -20325 -2744 2362 6349 13171
6401A3171K943O374j1858j7057j2418J9845J0446l255r537n36M746j6172L967
$$ 13171 16114 22488 10630 -6427 -18845 1000 11446 8191 -1346 -1882 2864 -13308 -9341
6388i341o57O264l379J3661J216K6j695j044l820K782J3672r239j0276j4111J1011
$$ -9341 -9998 -3734 -7113 6548 7764 7790 6095 5051 1231 4013 17685 8446 -1830 -15941 -4930
6373d930L45l244J732l253k0211k698R068m358q180J1118J2518J1529J248J4453
$$ -4930 -4585 -7829 -6097 -9350 -29561 -32259 -23191 -27549 -35729 -24611 -12093 -564 684 15137
6359A5137O782j1928k2591l107p76L159Q832K994j1782Q42K4827q723j235P0o834
$$ 15137 21919 9991 -12600 -15707 -16483 -13324 -4492 -1498 -13280 -12438 12389 3666 2431 2501 -4333
6344d333Q34J0208L642q381k932j1948r804O152l2M996k156M174Q249J017q51
$$ -4333 -3499 6709 10351 1970 -962 -12910 -22714 -16562 -16594 -11598 -13754 -9580 -1331 -314 -1165
6329a165o215o99r639N877O734j299P338N059M611J2873j2688j2056j6931k743
$$ -1165 -7380 -8079 -17718 -11841 -5107 -6406 932 5991 10602 23475 10787 -1269 -18200 -20943
6315b0943M696p555J4117K6431L733p21o067l957m649k406j6148n620N356J165
$$ -20943 -16247 -23802 -9685 16746 20479 19758 13691 9734 5085 2679 -13469 -19089 -13733 -12568
6301a2568J94Q485Q34J69L478r113J1274n98M777j0514j6304Q501N349M405J4924
$$ -12568 -12374 -3889 -3055 -2886 592 -8521 2753 2155 6932 -3582 -19886 -11385 -6036 -1631 13293
6286A3293j487p62j0983j4342J3056P996M79J3443p497j4760J0193R478K457Q494
$$ 13293 11806 11044 61 -14281 -1225 6771 7250 20693 13196 -1564 8629 18107 20564 29058
6272B9058K15j5735P533l143k634P7p118j2830l80Q058q060k372p12l734Q47l08
$$ 29058 29273 13538 21071 17928 15294 15371 8253 -4577 -4957 3101 -4959 -7331 -8043 -11777 -10930 -11238
6256a1238J2072R570j1600r95m109p610N96J0129M281j137k0569k680J3731R384
$$ -11238 834 10404 -1196 -2191 -6300 -13910 -13314 -3185 1096 -41 -20610 -23290 -9559 -175
6242a75k991K432K884o509m272R220N195P037j4044j1679P255J3754k267p993
$$ -175 -3166 -734 2150 -4359 -8631 589 5784 12821 -1223 -12902 -5647 8107 5840 -2153
6228b153J0704j307j2920o29O800J0658J6108k348j6968n126J1043P962k708l567
$$ -2153 8551 7244 -5676 -6305 495 11153 27261 24913 7945 2819 13862 21824 19116 15549
6214A5549l17r754j3969j9684L621N647J1700L766M445L127L026q415M466p082
$$ 15549 15232 5478 -8491 -28175 -24554 -18907 -7207 -3441 1004 4131 7157 -1258 3208 -3874
6200c874m909P056J3667n716R54R975j2862l935J243M138p239j3128o949J7401
$$ -3874 -8783 -1727 11940 6224 7178 17153 4291 356 1599 5737 -1502 -14630 -21579 -4178
6186d178K586q583o181m996p447P22J7375R912L34n819p045L143J988j4543j0468
$$ -4178 -1592 -10175 -16356 -21352 -28799 -28077 -10702 -790 -456 -6275 -13320 -10177 -8189 -22732 -33200
6171c3200J5440R240r632J0541m788j3M263Q959K0887q728j4097j5543N922J2366
$$ -33200 -17760 -8520 -18152 -7611 -12399 -12412 -8149 810 21697 12969 -1128 -16671 -10749 1617
6157A617q712L848K189N230J7374l365k1225l337k498N698Q746m354n960R550
$$ 1617 -7095 -3247 -1058 4172 21546 18181 -3044 -6381 -8879 -3181 5565 1211 -4749 4801
6143D801J2557M77q767j8721j461K0946J3709k86p323r048j245k96L529o363L765
$$ 4801 17358 17835 9068 -9653 -11114 9832 23541 23255 15932 6884 5639 5343 8872 2509 6274
6128F274q911j1935p63K090P706K1572L661K905p652m133j979n517l894k21R193
$$ 6274 -2637 -14572 -15335 -13245 -5539 16033 19694 22599 14947 10814 8835 3318 -576 -797 8396
6113H396P043L364q019j0939N018J2333K888L407L035n779n459j3420j0414L137
$$ 8396 15439 18803 10784 -155 4863 17196 20084 23491 26526 20747 15288 1868 -8546 -5409
6099e409R073R97j022M963M318j8934j1699J8504j911r591m381j268J0940P443
$$ -5409 3664 4661 3639 8602 12920 -6014 -17713 791 -1120 -10711 -15092 -16360 -5420 2023
6085B023k805j0827l748O744n274l917P574K3872k1927j2664J7160Q96Q939J570
$$ 2023 -782 -11609 -15357 -8613 -13887 -17804 -10230 13642 -8285 -20949 -3789 -2893 6046 7616
6071G616o28k220o979O183J4464m447L040J337p157j0905k0702K289J9267O297
$$ 7616 6988 4768 -2211 3972 18436 13989 17029 18366 11209 304 -20398 -18109 1158 7455
6057G455m395k6426J2172j275N939k524j9861M694J4683k034K175P474L129K989
$$ 7455 3060 -23366 -11194 -12469 -6530 -9054 -28915 -24221 -9538 -11572 -9397 -1923 1206 4195
6043D195o091o588n163j0997L638J6702j932R261o257N614K137J154J507q390
$$ 4195 -1896 -8484 -13647 -24644 -21006 -4304 -6236 3025 -3232 2382 4519 5673 7180 -1210
6029a210j0378n4J2622j1542j5965L867L477l393K595J1137J2526Q003N199N23
$$ -1210 -11588 -11642 980 -10562 -26527 -22660 -19183 -22576 -19981 -8844 3682 11685 16884 17407
6015A7407m796j1527j916R617R496l343M692l348o168j3164l27j540n521P035
$$ 17407 12611 1084 -832 8785 18281 14938 19630 16282 10114 -3050 -3377 -4917 -10438 -3403
6001c403J5633o928j8007n0O438n311L39P599J1996j1741n985J1439J1639j925
$$ -3403 12230 5302 -12705 -12755 -6317 -11628 -11289 -3690 8306 -3435 -9420 2019 13658 11733
5987A1733o164o247n59J0286m484q911J6220Q936n512k116j8851r570L683J6423
$$ 11733 5569 -678 -1237 9049 4565 -4346 11874 20810 15298 13182 -5669 -15239 -11556 4867
5973D867l828o006R134J4975j2982j2176l843o606J3876L245k389J669M899j6554
$$ 4867 1039 -4967 4167 19142 6160 -6016 -9859 -16465 -2589 656 -1733 -64 4835 -11719
5959a1719q372j476K0485l189o161n752m597m875J4541J4239J3659j0338l157
$$ -11719 -20091 -21567 -1082 -4271 -10432 -16184 -20781 -25656 -11115 3124 16783 6445 3288
5946C288K726J8196P227p507j1491L015Q657m913j1575j1493n918P916l126L595
$$ 3288 6014 24210 31437 23930 12439 15454 24111 19198 7623 -3870 -9788 -1872 -4998 -1403
5932a403J489P257N299Q346m252q829j2541j734J2325r482q669r672J8886J2356
$$ -1403 86 7343 12642 20988 16736 7907 -4634 -6368 5957 -3525 -12194 -21866 -2980 9376
5918I376m521Q786j0566j9190j5248Q645J0850j224N559L369j5489J152J1056
$$ 9376 4855 13641 3075 -16115 -31363 -22718 -11868 -13092 -7533 -4164 -19653 -18501 -7445
5905g445J1734K476p356N000L772J942l340K906J1433q049p526m389L654k179
$$ -7445 4289 6765 -591 4409 8181 10123 6783 9689 21122 13073 5547 1158 4812 2633
5891B633O61J820P545m863K176j782N63j4765k0067n775M366k274o120K1367K3158
$$ 2633 3294 5114 12659 7796 9972 8190 8753 -6012 -26079 -31854 -27488 -29762 -35882 -14515 8643
5876H643N389l893J567j5410k755n490k414J672J566J0878M580n399j615K606
$$ 8643 14032 10139 11706 -3704 -6459 -11949 -14363 -12691 -11125 -247 4333 -1066 -2681 -75
5862g5K2456L253j0183m312j4459m902p98J3633J321J801L973o425m628q063j0482
$$ -75 22381 25634 15451 11139 -3320 -8222 -9020 4613 5934 7735 11708 5283 655 -7408 -17890
5847a7890j892P36Q410J7163j3994j2088J4960J2661r466j0034J976k926J2373
$$ -17890 -19782 -19046 -10636 6527 -7467 -19555 -4595 8066 -1400 -11434 -9458 -12384 -11
5834a1J362q99o982j2766n153L794J2998P298J1496j8477j8095o20j463L905J5760
$$ -11 1351 452 -6530 -19296 -24449 -20655 -7657 -359 11137 -7340 -25435 -26055 -27518 -23613 -7853
5819g853K5616L481L281n061p032o825K395p001j2833J7973J2034o668j3073P59
$$ -7853 17763 21244 24525 19464 12432 5607 8002 1001 -11832 6141 18175 11507 -1566 -807
5805h07l031N97J3201J1333P653m808j3149j7655j1436k733O118O262J1803p566
$$ -807 -3838 -3241 9960 21293 28946 24138 10989 -6666 -18102 -20835 -14717 -8455 3348 -4218
5791d218j6929o525k63j84L170P392L365P161P953M180j0741p354p678Q233o010
$$ -4218 -21147 -27672 -27935 -28119 -24949 -17557 -14192 -7031 922 5102 -5639 -12993 -20671 -12438 -18448
5776a8448J339L803J2207J7731L070j1540J0606r634j2888o014L277r270j190
$$ -18448 -17109 -13306 -1099 16632 19702 8162 18768 9134 -3754 -9768 -6491 -15761 -16951
5763a6951M807k766j7483n573J2484K930P028n616j952L553J1721J2877n964m936
$$ -16951 -12144 -14910 -32393 -37966 -25482 -22552 -15524 -21140 -23092 -19539 -7818 5059 -905 -5841
5749e841r293J921O457K3149l367j00j5086l949M79j1481n918J6229J0179P690
$$ -5841 -15134 -13213 -6756 16393 13026 12926 -2160 -6109 -5630 -17111 -23029 -6800 3379 11069
5735A1069J891n967p293o581N146N803j2695j0116J1723J173k60O152J9655j0292
$$ 11069 12960 6993 -300 -6881 -1735 4068 -8627 -18743 -7020 -5847 -6107 45 19700 9408
5721I408L613K658o668q209j502K090m99P642P688j225j1174p27P434j448R08
$$ 9408 13021 15679 9011 802 -700 1390 891 8533 16221 14996 3822 3095 10529 9081 9989
5706I989M333m703J1k965q954N722M25j0452k133l387Q379lP04n51l128j638J7965
$$ 9989 14322 9619 9630 6665 -2289 3433 3858 -6594 -8727 -12114 -3735 -3738 -3034 -3585 -6713 -8351 9614
5689I614J5174q990k3942O590J7143j38L145p618r176o96r092J646N449J437N599
$$ 9614 24788 15798 -8144 -1554 15589 15451 18596 10978 1802 1106 -7986 -6340 -891 546 6145
5674F145J0656J187o66j3129r140r855p481K3158J1240r39j0717j6796P85Q46
$$ 6145 16801 17988 17322 4193 -4947 -14802 -22283 875 12115 11176 459 -16337 -15552 -14706
5660a4706J551r349R161J2827q05q259j1456P021o5J681O134o019P869j3643j6038
$$ -14706 -13155 -22504 -13343 -516 -1321 -9580 -21036 -14015 -14080 -12399 -6265 -12284 -4415 -18058 -34096
5645c4096J0795L681p904l872N92O6J7033N789j648o109O635R015L32P633J359
$$ -34096 -23301 -19620 -27524 -31396 -30804 -30738 -13705 -7916 -9564 -15673 -9038 -23 309 7942 9301
5630I301M441O758j699o631j6632M406J0718k930j1489n867R665P474j19o31j622
$$ 9301 13742 20500 18801 12170 -4462 -56 10662 7732 -3757 -9624 41 7515 7396 6765 5143
5615E143j409r271M125o641j451J4095j860J724Q292r693j3789O272R05P29O310
$$ 5143 3734 -5537 -1412 -8053 -9504 4591 2731 4455 12747 3054 -10735 -4463 -3558 -2829 3481
5600C481P409J0485L189k380j2772j2031j344j0351p296M97R392N063R26J0104
$$ 3481 10890 21375 24564 22184 9412 -2619 -3963 -14314 -21610 -21113 -11721 -6658 -5732 4372
5586D372R22j0306N434J4195m273q214j0325k330L621r292J1934J762J48l09L44
$$ 4372 5294 -5012 422 14617 10344 2130 -8195 -10525 -6904 -16196 -4262 -2500 -2352 -2661 -2317
5571b317O447Q28j0325j3816M44J2899P096j557Q700q038j277J6217m503J754
$$ -2317 4130 4958 -5367 -19183 -18739 -5840 1256 -301 8399 361 -916 15301 10798 12552
5557A2552j3079R656J1480j1626j2433o483R29K669N667J530j2725K969R552p501
$$ 12552 -527 9129 20609 8983 -3450 -9933 -9004 -6335 -668 862 -11863 -8894 658 -6843
5543f843K621N95K84n611p013J613m660L970R306J0064K57j4011n335K791l205
$$ -6843 -4222 -3627 -3343 -8954 -15967 -14354 -19014 -15044 -5738 4326 4583 -9428 -14763 -11972 -15177
5528a5177J5598N134l794j1793M044J6348m848j3073P19J1621k425P372j2232
$$ -15177 421 5555 1761 -10032 -5988 10360 5512 -7561 -6842 4779 2354 9726 -2506
5515b506P21o076k354p956P559K874J416R547M87j0128m145R025J4147Q433J2981
$$ -2506 -1785 -7861 -10215 -18171 -10612 -7738 -6322 3225 3712 -6416 -10561 -1536 12611 21044 34025
5500C4025j4903j4880l389l902K698J699r050j1691j1851J3490J7580m728j819
$$ 34025 19122 4242 853 -3049 -351 1348 -7702 -19393 -31244 -17754 -174 -4902 -6721
5487f721k078M942k80j2447o777J3377k925j7708J179J7897J1104k705n408r53
$$ -6721 -8799 -3857 -4137 -16584 -23361 -9984 -12909 -30617 -29438 -11541 -437 -3142 -8550 -9503
5473i503L436j1288O35m006k131P437K374j145o628j197P978j9332j3016M578
$$ -9503 -6067 -17355 -16720 -20726 -22857 -15420 -13046 -14191 -20819 -22016 -14038 -33370 -46386 -41808
5459d1808j735J1904K1735j1623l010N824p695j061J757K273N748J497J5772K1276
$$ -41808 -43543 -31639 -9904 -21527 -24537 -18713 -26408 -27469 -25712 -23439 -17691 -16194 -422 20854
5445B0854K067j3522l8611r864K3391K703K754J1377m080Q91K961J173R707k386
$$ 20854 22921 9399 -29212 -39076 -15685 -12982 -10228 1149 -2931 -2040 921 2094 11801 9415
5431I415k518J482J0140j923k3316n671N999K923N645L088j0574j2335L619m471
$$ 9415 6897 8379 18519 16596 -6720 -12391 -6392 -3469 2176 5264 -5310 -17645 -14026 -18497
5417a8497o828O998J1570j465l683n411m568r934o561Q019P583J8555J4303j3529
$$ -18497 -25325 -18327 -6757 -8222 -11905 -17316 -21884 -31818 -38379 -30360 -22777 -4222 10081 -3448
5403c448q391L376q249n934O217O670J1459J208j7276j6926P934L0345R329o037
$$ -3448 -11839 -8463 -16712 -22646 -16429 -9759 1700 2908 -14368 -31294 -23360 6985 16314 10277
5389A0277r498m84J824j771j444J1228k497k6082K4Q743R504N030l902j2971q173
$$ 10277 779 295 2119 348 -1096 10132 7635 -18447 -18423 -9680 -176 4854 952 -12019 -20192
5374b0192P701P63k755M220m587n252N751J0956J389K637m702n389r74l595P801
$$ -20192 -12491 -11728 -14483 -10263 -14850 -20102 -14351 -3395 -2006 631 -4071 -9460 -10434 -14029 -6228
5359f228R025L405l938O721p148j675J4345j289l131k2219L641K0481J1439q453
$$ -6228 2797 6202 2264 8985 1837 162 14507 13218 10087 -12132 -8491 11990 23429 14976
5345A4976o908m10p822j2664k662R405j2983k0799K1447J6687J029j205k503j491
$$ 14976 8068 7658 -164 -12828 -15490 -6085 -19068 -39867 -18420 -1733 -704 -1909 -4412 -5903
5331e903N203o301K046p500m479n748q003O548J1989N928q795m805J216j4430
$$ -5903 -700 -7001 -4955 -12455 -16934 -22682 -30685 -24137 -12148 -6220 -15015 -19820 -18604 -33034
5317c3034P144J0445J1094J0874q865j1433R822R354J611K067q313k619M730J1568
$$ -33034 -25890 -15445 -4351 6523 -2342 -13775 -3953 5401 7012 9079 766 -1853 2877 14445
5303A4445J3592k319k012j5794q861o685k429n654R984J2945K493K06j26p315
$$ 14445 28037 25718 23706 7912 -949 -7634 -10063 -15717 -5733 7212 9705 9911 9785 2470
5289B470J149n116J460J1101J9091p015l480N076p900M677N846j3006j5040j6987
$$ 2470 3619 -1497 -37 11064 30155 23140 19660 24736 16836 21513 27359 14353 -687 -17674
5275a7674j1298J5324N508M589N574m625j2810Q223L774n845p150j137n873l329
$$ -17674 -28972 -13648 -8140 -3551 2023 -2602 -15412 -7189 -3415 -9260 -16410 -17547 -23420 -26749
5261b6749J9346J7140j086n763j1292L278j492r085m904P848J1902N391n665j4008
$$ -26749 -7403 9737 8651 2888 -8404 -5126 -6618 -15703 -20607 -12759 -857 4534 -1131 -15139
5247a5139l404k1007P354J8723N826J3499O127j4043m110j176m28j7724N974R687
$$ -15139 -18543 -39550 -32196 -13473 -7647 5852 11979 -2064 -6174 -7350 -7778 -25502 -19528 -9841
5233i841k169l918o356O64P176R388o929j1211J8469J0730P471j1293k825J9424
$$ -9841 -12010 -15928 -22284 -21620 -14444 -5056 -11985 -23196 -4727 6003 13474 2181 -644 18780
5219A8780l477j171p963k031Q984N481j0559j5985N40P066m825p374q410r440
$$ 18780 15303 14132 6169 4138 13122 18603 8044 -7941 -7401 -335 -5160 -12534 -20944 -30384
5205c0384M196Q82J4247Q952n361r602R8J12O939q203m54l108q574p027K643J2466
$$ -30384 -26188 -25306 -11059 -2107 -7468 -17070 -16972 -16860 -9921 -18124 -18578 -21686 -30260 -37287 -34644 -22178
5189b2178j132O603Q023R086o83l888K0483R062P78l0728r978N740M301J0134
$$ -22178 -23310 -16707 -8684 402 -281 -4169 16314 25376 26154 -4574 -14552 -8812 -4511 5623
5175E623K3813l957k4271K114N763j7776j3979m522l533J6234O158O688O032l711
$$ 5623 29436 25479 1208 3322 9085 -8691 -22670 -27192 -30725 -14491 -8333 -1645 4387 676
5161F76J9530J0709j9743k2102P76j979r664L85J424q423R089j034R583K0801
$$ 676 20206 30915 11172 -10930 -10154 -12133 -21797 -21412 -19988 -28411 -19322 -20356 -10773 10028
5147A0028O163p425m149j9671P785O514K043o321K322J0313q357p794j0249j405
$$ 10028 16191 8766 4617 -15054 -7269 -755 1288 -5033 -2711 7602 -755 -8549 -18798 -20203
5133b0203l232K248J2352J5069J417j5069R035m851o987M63q266P249m596j000
$$ -20203 -23435 -21187 -8835 6234 7651 -7418 1617 -3234 -10221 -9758 -18024 -10775 -15371 -16371
5119a6371m29J6170N161l678o788l359m906l885K426k790K631L417J7292Q703
$$ -16371 -16800 -630 4531 853 -5935 -9294 -14200 -18085 -15659 -18449 -15818 -12401 4891 13594
5105A3594m550j2743O90J563J2190o220m869j66j6588M516P638J4180K13M494
$$ 13594 9044 -3699 -3009 -1446 10744 4524 -345 -511 -17099 -12583 -4945 9235 9448 13942
5091A3942J7791j0458j1720q910j1498l628J8108J409n642m648J0535j61Q503
$$ 13942 31733 21275 9555 645 -10853 -14481 3627 5036 -606 -5254 5281 5120 13623
5078A3623j708J618K192Q36R675n649j5791k471J7563O085j4631j4867j6412q988
$$ 13623 11915 13533 15725 16561 26236 20587 4796 2325 19888 25973 11342 -3525 -19937 -28925
5064b8925n497k764J2301J7758M753J843n52M393J3096J432j3638n37r5M8N865
$$ -28925 -34422 -37186 -24885 -7127 -2374 -531 -1083 3310 16406 17838 4200 3663 3568 3616 9481
5049I481J0557l720j8845K147R293j677j6000n05r951Q943Q562Q16K607M618J0988
$$ 9481 20038 16318 -2527 -380 8913 7236 -8764 -9269 -19220 -10277 -1715 -899 1708 6326 17314
5034A7314L61o472J332J1238j417l483j1952j5880m641j9371J7538J3722p072
$$ 17314 17675 11203 12535 23773 22356 18873 6921 -8959 -13600 -32971 -15433 -1711 -8783
5021h783J3080M685l186K897j823L346n830p257K230K841M585R218l10K26J2889
$$ -8783 4297 8982 5796 8693 6870 10216 4386 -2871 -641 2200 6785 16003 15693 15919 28808
5006B8808Q948n752k0277j9617j1269K1757j472r754O430J2744j0733j8080p374
$$ 28808 37756 32004 11727 -7890 -19159 2598 1126 -8628 -2198 10546 -187 -18267 -25641
4993b5641K371M336Q776M695K421Q715K1185J132j1275J0854o190o523r569l801
$$ -25641 -23270 -18934 -10158 -5463 -3042 5673 26858 27990 16715 27569 21379 14856 5287 1486
4979A486n833J1758k043j3898P297l894r357n785R857Q042N15r595q547J274K756
$$ 1486 -4347 7411 5368 -8530 -1233 -5127 -14484 -20269 -10412 -2370 -1855 -11450 -19997 -18723 -15967
4964a5967N918P051J194K0322J5329L089n653J4300J925r063k800r466j1673j1828
$$ -15967 -10049 -2998 -1804 18518 33847 36936 31283 45583 47508 38445 35645 26179 14506 2678
4950B678J560j66l64R748r140l123j148M398j0133j3051J867J0839k485M37N083
$$ 2678 4238 4072 3708 13456 4316 1193 45 4443 -5690 -18741 -16874 -6035 -8520 -8083 -3000
4935c000P223j257l219L84K375m588o134L405J4236Q800j7683j2754o093N260
$$ -3000 4223 2966 -253 131 2506 -2082 -8216 -4811 9425 18225 542 -12212 -18305 -13045
4921a3045O528M699P469n194r11j408j5125K229J2650J6959N802R287j769j3519
$$ -13045 -6517 -1818 5651 457 -454 -1862 -16987 -14758 -2108 14851 20653 29940 28171 14652
4907A4652j4684j4143m982J0939J24O66l624M3J1879r479p184R177Q234l691M265
$$ 14652 -32 -14175 -19157 -8218 -8094 -7428 -11052 -11009 870 -8609 -15793 -6616 1618 -2073 2192
4892B192l50q119R136o731J2300P734L646j6683j358Q650l06n278l1975l144J5575
$$ 2192 1842 -6277 2859 -3872 8428 16162 19808 3125 1767 10417 10111 4833 -27142 -30286 -14711
4877a4711J8392J3826J022l908q417j2920J853Q842j20m33P817J707m69r239j4282
$$ -14711 3681 17507 18529 14621 6204 -6716 -4863 3979 3859 3426 11243 12950 12481 3242 -11040
4862a1040J9473J2101k1754j0995K256Q795o076J020j0494p022J398M559M67j701
$$ -11040 8433 20534 -1220 -12215 -9959 -1164 -7240 -6220 -16714 -23736 -22338 -17779 -17312 -19013
4848a9013O689L167K325Q520j622J5757O014j575j5233m157j9805R363J8311J2786
$$ -19013 -12324 -9157 -6832 1688 66 15823 21837 20262 5029 872 -18933 -9570 8741 21527
4834B1527j4173j4462R79Q470J2584J5050p931m519j9882j1268M830n062r897
$$ 21527 7354 -7108 -6129 2341 14925 29975 22044 17525 -2357 -13625 -8795 -13857 -23754
4821b3754J201R272K07N000k700J0376q039r193q616N283R919P410Q865K834l230
$$ -23754 -22553 -13281 -13074 -8074 -10774 -398 -8437 -17630 -26246 -20963 -11044 -3634 5231 8065 4835
4806D835L702O042l757j220L110p993j1338O565J0100j0706j8452j0660R670P623
$$ 4835 8537 14579 10822 9602 12712 4719 -6619 -54 10046 -660 -19112 -29772 -20102 -12479
4792a2479J09Q158P580k255K610J2921M052j2532m768K687J4501P239q335L731
$$ -12479 -12370 -4212 3368 1113 3723 16644 20696 8164 3396 6083 20584 27823 19488 23219
4778B3219k427j1698J734Q050j0320r849P91m87m140N808J5003K204j6663j6791
$$ 23219 20792 9094 10828 18878 8558 -1291 -500 -987 -5127 681 15684 17888 1225 -15566
4764a5566M865n090p00l23k622J20m3k699J3467N279N134K244o576J0063J3020
$$ -15566 -10701 -15791 -16491 -16814 -19436 -19316 -19359 -22058 -8591 -3312 1822 4066 -2510 7553 20573
4749B0573k202p717o476o891j575K0785L268k497m27M247l435j8967n239k762
$$ 20573 18371 10654 4178 -2713 -4288 16497 19765 17268 16841 21088 17653 -1314 -6553 -9315
4735i315L55P858N870K163k146j6661n102k833J3119J169O89o22j4533N99J6114
$$ -9315 -8960 -1102 4768 6931 4785 -11876 -16978 -19811 -6692 -5523 -4834 -5456 -19989 -19390 -3276
4720c276J5752M866j0030k833r841J9294Q920r580j5687r596j0128l237R683K409
$$ -3276 12476 17342 7312 4479 -5362 13932 22852 13272 -2415 -12011 -22139 -25376 -15693 -13284
4706a3284j4210J369J6992M869l528r280J4789L0278n835m919l791j413L787n394
$$ -13284 -27494 -26125 -9133 -4264 -7792 -17072 -2283 27995 22160 17241 13450 12037 15824 10430
4692A0430j4632p138J3829J0195j3541Q618q66k4424m599j318k590K055J5472
$$ 10430 -4202 -11340 2489 12684 -857 7761 6895 -17529 -22128 -23446 -26036 -23981 -8509
4679h509M407P771J0470q256j0097J155O254J0761n045l8K187Q198l66j885L234
$$ -8509 -4102 3669 14139 5883 -4214 -3059 3195 13956 8911 8873 11060 19258 18892 17007 20241
4664B0241n3R615L982p747N44k4546j0729O548l929k126R079J6989K85j5655M197
$$ 20241 20188 29803 33785 26038 26582 2036 -8693 -2145 -6074 -8200 879 17868 18153 2498 6695
4649F695j2791N518N890J928q978n778m713j5262K3007J2212j8867L630J0475
$$ 6695 -6096 -578 5312 7240 -1738 -7516 -12229 -27491 -4484 7728 -11139 -7509 2966
4636B966N271J5885n795K324r022j4271M39k54j931l765l349m100j3303p828J0555
$$ 2966 8237 24122 18327 20651 11629 -2642 -2203 -2457 -4388 -8153 -11502 -15602 -28905 -36733 -26178
4621b6178P329J2574N124l331j3906o1N9O546j199L023J3946N711L142j4253j4434
$$ -26178 -18849 -6275 -1151 -4482 -18388 -18449 -18390 -11844 -13043 -10020 3926 9637 12779 -1474 -15908
4606a5908R01N32J4382k625m534n171J0641Q145O929o214j1496J69q213o024N524
$$ -15908 -15007 -14475 -93 -2718 -7252 -12423 -1782 6363 13292 7078 -4418 -4249 -12462 -18486 -12962
4591a2962K2872J8220N054Q22j6436j5994k317q83P504J5525p574j5628P785q913
$$ -12962 9910 28130 33184 34006 17570 1576 -741 -1624 5880 21405 13831 -1797 5988 -2925
4577b925k250j554k414N764N324l211M713J92j967k185J554j390O1O903q164p413
$$ -2925 -5175 -6729 -9143 -3379 1945 -1266 3447 3639 1672 -513 1041 -349 -288 6615 -1549 -8962
4561h962k1890P13J434n553P974J2087P262p62o851m928J1856J2175k01p398O017
$$ -8962 -30852 -30139 -28705 -34258 -26284 -14197 -6935 -7697 -14548 -19476 -7620 4555 4354 -3044 2973
4546B973m948j1427j0605o668J4371O76M916M002k988Q184R535O547j4570r433
$$ 2973 -1975 -13402 -24007 -30675 -16304 -15628 -10712 -6710 -9698 -1514 8021 14568 -2 -9435
4532i435j150l965J276J8608n031r645j729J937J4952J0462k616j3716o942O496
$$ -9435 -10585 -14550 -13274 5334 303 -9342 -11071 -9134 5818 16280 13664 -52 -6994 -498
4518d98m251j1830j2174L286J2260M202J2778K4436q893k1810O467J6484p246
$$ -498 -4749 -16579 -28753 -25467 -13207 -9005 3773 28209 19316 -2494 3973 20457 13211
4505A3211j3329m501J701j346J309j7419r27O449R250k237l999J4750l600Q113
$$ 13211 -118 -4619 -2918 -4264 -2955 -20374 -21301 -14852 -5602 -7839 -11838 2912 -688 7425
4491G425o510j1146j191K05L584r385j2592L934R056m975L950K978j757m880m981
$$ 7425 915 -10231 -11422 -11217 -7633 -17018 -29610 -25676 -16620 -21595 -17645 -14667 -16424 -21304 -26285
$$ [...]
##END NTUPLES=NMR SPECTRUM
##END=
