##TITLE=Analysis number 319639
Compound Code btb 09864
Project Code adrs
Chemist Name adomenas
##JCAMPDX= 6.0         $$ Bruker NMR JCAMP-DX V2.0
##DATA TYPE= NMR SPECTRUM
##DATA CLASS= NTUPLES
##ORIGIN= Bruker BioSpin GmbH
##OWNER= nmr
$$ XWIN-NMR		Version 3.5
$$ Tue May 23 08:02:48 2006 GMT Daylight Time (UT+1h)  MAYBRIDGE\nmr@NMR_250MHZ
##.OBSERVE FREQUENCY= 250.131544655141
##.OBSERVE NUCLEUS= ^1H
##.ACQUISITION MODE= SIMULTANEOUS (DQD)
##.ACQUISITION SCHEME= undefined
##.AVERAGES= 16
##.DIGITISER RES= 18
##SPECTROMETER/DATA SYSTEM= dpx250
##.PULSE SEQUENCE= zg30
##.SOLVENT NAME= CDCl3
##.SHIFT REFERENCE= (INTERNAL, CDCl3, 0, 16.522)
##AUDIT TRAIL= $$ (NUMBER, WHEN, WHO, WHERE, WHAT)
$$ ##TITLE= Audit trail, XWIN-NMR		Version 3.5
$$ ##JCAMPDX= 5.01
$$ ##ORIGIN= Bruker BioSpin GmbH
$$ ##OWNER= nmr
$$ C:\u/data/dgb/nmr/ADRS/4890/pdata/1/auditp.txt
$$ ##AUDIT TRAIL=  $$ (NUMBER, WHEN, WHO, WHERE, WHAT)
(   1,<2006-05-23 08:02:18.73 +100>,<MAYBRIDGE\nmr>,<NMR_250MHZ>,
      <created by zg, POWCHK disabled, PULCHK disabled
       configuration hash MD5:
       84 BC 41 DB A1 6E 1D 46 DA 25 12 A5 C1 ED C5 3A
       data hash MD5: 64K
       12 DB 5A 3C 24 7C 50 3F 7C 90 FB 2D F6 1D 5D 8D>)
(   2,<2006-05-23 08:02:34.18 +100>,<MAYBRIDGE\nmr>,<NMR_250MHZ>,
      <Start of raw data processing
       ef LB = 0.3 FT_mod = 6 PKNL = 1 SI = 32K 
       data hash MD5: 32K
       A8 CE 15 3B E4 F3 71 3F 7B 0A 29 E0 9A 76 72 9A>)
(   3,<2006-05-23 08:02:36.01 +100>,<MAYBRIDGE\nmr>,<NMR_250MHZ>,
      <apk 
       data hash MD5: 32K
       FC 31 7D 6D 2D 81 CB 57 B6 0B 5E 29 55 0D 57 BA>)
(   4,<2006-05-23 08:02:36.77 +100>,<MAYBRIDGE\nmr>,<NMR_250MHZ>,
      <abs ABSG = 5 
       data hash MD5: 32K
       3D 21 BC 7D 84 7B 43 A6 8E C6 1F 06 C5 CA CE D3>)
$$ ##END=
$$ 
$$ hash MD5
$$ 30 29 08 8D EF B9 5A 0E 75 B1 0E C0 18 7C 5C FF
##$RELAX= 
##$RELAX= 
##$RELAX= 
##$RELAX= 
##$RELAX= 
##$RELAX= 
##$RELAX= 
$$ Bruker specific parameters
$$ --------------------------
##$DU= <C:\u>
##$EXPNO= 4890
##$NAME= <ADRS>
##$PROCNO= 1
##$TYPE= <nmr>
##$USER= <dgb>
##$AMP= (0..31)
100 100 100 100 100 100 100 100 100 100 100 100 100 100 100 100 100 100 
100 100 100 100 100 100 100 100 100 100 100 100 100 100 
##$AQSEQ= 0
##$AQ_mod= 3
##$AUNM= <au_zg>
##$AUTOPOS= <1 >
##$BF1= 250.13
##$BF2= 250.13
##$BF3= 250.13
##$BF4= 250.13
##$BF5= 500.13
##$BF6= 500.13
##$BF7= 500.13
##$BF8= 500.13
##$BYTORDA= 1
##$CFDGTYP= 0
##$CFRGTYP= 5
##$CHEMSTR= <none>
##$CNST= (0..31)
1 1 145 1 1 1 1 1 1 1 1 1 1 1 1 1 1 1 1 1 1 1 1 1 1 1 1 1 1 1 1 1 
##$CPDPRG= <>
##$CPDPRG1= <>
##$CPDPRG2= <>
##$CPDPRG3= <>
##$CPDPRG4= <mlev>
##$CPDPRG5= <mlev>
##$CPDPRG6= <mlev>
##$CPDPRG7= <mlev>
##$CPDPRG8= <mlev>
##$CPDPRGB= <>
##$CPDPRGT= <>
##$D= (0..31)
0 1 0 0 0 0 0 0 0 0.06 0 0 0 0 0 0 0.0002 0 0 0 0 0 0 0 0 0 0 0 0 0 0 
0 
##$DATE= 1148367737
##$DBL= (0..7)
120 120 120 120 120 120 120 120 
##$DBP= (0..7)
150 150 150 150 150 150 150 150 
##$DBP07= 0
##$DBPNAM0= <>
##$DBPNAM1= <>
##$DBPNAM2= <>
$$ [...]
##$SUBNAM7= <"">
##$SUBNAM8= <"">
##$SUBNAM9= <"">
##$SW= 20.6930455092707
##$SWIBOX= (0..15)
0 0 3 0 0 0 0 0 0 0 0 0 0 0 0 0 
##$SW_h= 5175.983436853
##$TD= 65536
##$TD0= 1
##$TE= 294.16
##$TE2= 300
##$TE3= 300
##$TEG= 300
##$TL= (0..7)
0 120 120 120 120 120 120 120 
##$TP= (0..7)
150 150 150 150 150 150 150 150 
##$TP07= 0
##$TPNAME0= <>
##$TPNAME1= <>
##$TPNAME2= <>
##$TPNAME3= <>
##$TPNAME4= <>
##$TPNAME5= <>
##$TPNAME6= <>
##$TPNAME7= <>
##$TPOAL= (0..7)
0.5 0.5 0.5 0.5 0.5 0.5 0.5 0.5 
##$TPOFFS= (0..7)
0 0 0 0 0 0 0 0 
##$TUNHIN= 0
##$TUNHOUT= 0
##$TUNXOUT= 0
##$USERA1= <user>
##$USERA2= <user>
##$USERA3= <user>
##$USERA4= <user>
##$USERA5= <user>
##$V9= 5
##$VALIST= <valist>
##$VCLIST= <CCCCCCCCCCCCCCC>
##$VD= 0
##$VDLIST= <DDDDDDDDDDDDDDD>
##$VPLIST= <PPPPPPPPPPPPPPP>
##$VTLIST= <TTTTTTTTTTTTTTT>
##$WBST= 1024
##$WBSW= 4
##$XGAIN= (0..3)
0 0 0 0 
##$XL= 0
##$YL= 0
##$YMAX_a= 594543
##$YMIN_a= -531741
##$ZGOPTNS= <>
##$ZL1= 120
##$ZL2= 120
##$ZL3= 120
##$ZL4= 120
##$ABSF1= 16.522
##$ABSF2= -4.171173
##$ABSG= 5
##$ABSL= 3
##$ALPHA= 0
##$AQORDER= 0
##$ASSFAC= 0
##$ASSFACI= 0
##$ASSFACX= 0
##$ASSWID= 0
##$AUNMP= <proc_1d>
##$AZFE= 0.1
##$AZFW= 0.1
##$BCFW= 0
##$BC_mod= 0
##$BYTORDP= 0
##$COROFFS= 0
##$CY= 12.5
##$DATMOD= 1
##$DC= 0
##$DFILT= <>
##$DTYPP= 0
##$F1P= 14.0000005364418
##$F2P= -0.99999901652339
##$FCOR= 0.5
##$FTSIZE= 32768
##$FT_mod= 6
##$GAMMA= 0
##$GB= 0
##$INTBC= 1
##$INTSCL= 1
##$ISEN= 128
##$LB= 0.3
##$LEV0= 0
##$LPBIN= 0
##$MAXI= 10000
##$MC2= 0
##$MEAN= 0
##$ME_mod= 0
##$MI= 0
##$NCOEF= 0
##$NC_proc= -5
##$NLEV= 6
##$NOISF1= 0
##$NOISF2= 0
##$NSP= 0
##$NTH_PI= 0
##$NZP= 0
##$OFFSET= 16.522
##$PC= 1
##$PHC0= 18.58064
##$PHC1= 5.213245
##$PH_mod= 1
##$PKNL= yes
##$PPARMOD= 0
##$PSCAL= 4
##$PSIGN= 0
##$REVERSE= no
##$SF= 250.13
##$SI= 32768
##$SIGF1= 0
##$SIGF2= 0
##$SINO= 400
##$SIOLD= 32768
##$SREGLST= <1H.CDCl3>
##$SSB= 0
##$STSI= 32768
##$STSR= 0
##$SW_p= 5175.98343685301
##$SYMM= 0
##$S_DEV= 0
##$TDeff= 65536
##$TDoff= 0
##$TI= <Analysis number 999999
Compound Code 99
Book Reference 9
Project Code 9>
##$TILT= no
##$TM1= 0
##$TM2= 0
##$TOPLEV= 0
##$USERP1= <user>
##$USERP2= <user>
##$USERP3= <user>
##$USERP4= <user>
##$USERP5= <user>
##$WDW= 1
##$XDIM= 32768
##$YMAX_p= 420434247
##$YMIN_p= -104253
$$ End of Bruker specific parameters
$$ ---------------------------------
##NTUPLES= NMR SPECTRUM
##VAR_NAME=  FREQUENCY,     SPECTRUM/REAL,   SPECTRUM/IMAG
##SYMBOL=    X,             R,               I
##VAR_TYPE=  INDEPENDENT,   DEPENDENT,       DEPENDENT
##VAR_FORM=  AFFN,          ASDF,            ASDF
##VAR_DIM=   32768,         32768,           32768
##UNITS=     HZ,            ARBITRARY UNITS, ARBITRARY UNITS
##FACTOR=    0.157963299565203, 1,           1
##FIRST=     4132.6476996994, 0,             0
##LAST=      -1043.33573715361, 0,           0
##MIN=       -1043.33573715361, -104253,     0
##MAX=       4132.6476996994, 420434247,     0
$$ Real data points
##PAGE= N=1
##DATA TABLE= (X++(R..R)), XYDATA
$$ [...]
14329a0388k0374J9178O022l1094k8724L6693J7423j750M55J4661J5088j0477
$$ -10388 -30762 -11584 -5562 -36656 -65380 -28687 -11264 -13014 -12559 2102 17190 6713
14317F713J7182l2913k2106k0730p679L1702p382p399j6791J7418L6809J0919
$$ 6713 23895 -9018 -31124 -51854 -59533 -27831 -35213 -42612 -59403 -41985 -5176 5743
14305E743j664k190J3178K500l4918k7066P441K0571j6092j6360J5343K5605J8457
$$ 5743 4079 1889 15067 17567 -17351 -44417 -36976 -16405 -32497 -48857 -33514 -7909 10548
14292A0548J0314J6313q818k0620j1906J4132j0465j3722O426Q287K6566J5113
$$ 10548 20862 37175 28357 7737 -4169 9963 -502 -14224 -7798 489 27055 42168
14280D2168l6662l1699J0119K0359j963k3775p257K8467K4174j0667k1071j2829
$$ 42168 5506 -26193 -16074 4285 2322 -21453 -28710 -243 23931 13264 -7807 -20636
14268b0636K7086j3991n602k2213K461K9426J2206r560k5181M466K817j4213k615
$$ -20636 6450 -7541 -13143 -35356 -32895 -3469 8737 -823 -26004 -21538 -18721 -32934 -35549
14255c5549p848K7653Q458l320J8753Q656j9849m2783o81K4608p909k5975R213
$$ -35549 -43397 -15744 -7286 -10606 8147 16803 -3046 -45829 -46510 -21902 -29811 -55786 -46573
14242d6573Q066K2380J1829j797m560k3568j5522r813J0520J1494K6316N664j2307
$$ -46573 -38507 -16127 -4298 -6095 -10655 -34223 -49745 -59558 -49038 -37544 -11228 -5564 -17871
14229a7871J910R553O357j009J4698p130p773q960K23K0870k814j6335k1225K2496
$$ -17871 -15961 -6408 -51 -1060 13638 6508 -1265 -10225 -10002 10868 8054 -8281 -29506 -7010
14215g010J9473J5785r604k3886k2547p906R844p443r414N149K9559R830J1711
$$ -7010 12463 28248 18644 -5242 -27789 -35695 -25851 -33294 -42708 -37559 -8000 1830 13541
14202A3541L296k6521M596M542l4073r78L4273K3204k153k556j7608R935k4495
$$ 13541 16837 -9684 -5088 -546 -34619 -35597 -1324 21880 19727 17171 -437 9498 -14997
14189a4997l4082K1324O983J3213j9512j5998J5701M4463l524j8290L743o247
$$ -14997 -49079 -27755 -20772 -7559 -27071 -43069 -27368 17095 13571 -4719 -976 -7223
14177g223j6488j8428j0217J0786J9051K3653Q778M80J4994p412k2171p987J146
$$ -7223 -23711 -42139 -52356 -41570 -22519 1134 9912 10392 25386 17974 -4197 -12184 -11038
14164a1038k5269J3907J6393N513K1944k98J0305O312k5588l2600m896k3981j5232
$$ -11038 -36307 -22400 -6007 -494 21450 21152 31457 37769 12181 -20419 -25315 -49296 -64528
14151f4528L568K6292J6182L016j5374N189O255p451J3621K8708K4625n896j4175
$$ -64528 -60960 -34668 -18486 -15470 -30844 -25655 -19400 -26851 -13230 15478 40103 34207 20032
14138B0032l1420J1532N919n294o213l266J1246j7552j0755J8258O801l4099j3248
$$ 20032 -11388 144 6063 769 -5444 -8710 2536 -15016 -25771 -7513 -712 -34811 -48059
14125d8059j4547j308M078K5796Q788r056J8884k9921l340k666k595J1501O093
$$ -48059 -62606 -63914 -59836 -34040 -25252 -34308 -15424 -45345 -48685 -51351 -53946 -42445 -36352
14112c6352R229K3099j7477k876J7663J6118k9356l3699p052L7167J7717K0453
$$ -36352 -27123 -4024 -21501 -24377 -6714 9404 -19952 -53651 -60703 -23536 -5819 14634
14100A4634j8644l0632J0347j931o679L5942K2453k4440k7385O932J7005K7464
$$ 14634 -4010 -34642 -24295 -26226 -32905 3037 25490 1050 -26335 -19403 -2398 25066
14088B5066j7276j943k8402j0122N888o226q67J1865K7308M250j1652k1522j3870
$$ 25066 7790 5847 -22555 -32677 -26789 -33015 -33882 -22017 5291 9541 -2111 -23633 -37503
14075c7503L2063J3069L4579J1684k6887m8636k0424l640M2381J4263j3990L6776
$$ -37503 -5440 7629 42208 53892 27005 -21631 -42055 -45695 -3314 10949 -3041 33735
14063C3735J3370k0937j8638j0101J5587K112J7382J6186K7175l1061m4897n861
$$ 33735 47105 26168 7530 -2571 13016 15128 32510 48696 75871 44810 -87 -5948
14051e948j3158J1004M6166q273j7812O561l216M245J7510o64N539j9393k0478
$$ -5948 -19106 -8102 38064 29791 11979 18540 15324 19569 37079 36415 41954 22561 2083
14038B083K0506M902j6469m996J7547L3371J7888m913J218j9235j979R174K31
$$ 2083 22589 27491 11022 6026 23573 56944 74832 69919 71137 51902 49923 59097 59328
14025E9328J0848j3188j8418q086N383O801M243k9848n130j4053J4299L3123K6576
$$ 59328 70176 56988 38570 30484 35867 42668 46911 17063 11933 -2120 12179 45302 71878
14012G1878J5809J4884j7236l450j3147P35K874l025j2184q302N295J7316J1428
$$ 71878 87687 102571 85335 81885 68738 69473 72347 69322 57138 48836 54131 71447 82875
13999H2875J1939J922J3290m013j4230j276M0495P639l4296k8244L840N390R655
$$ 82875 94814 96736 110026 106013 91783 90507 131002 138641 104345 76101 79941 85331 94986
13986I4986P101m5478k913o462j7947j028P071K5625J1767K005K2355l803n513
$$ 94986 102087 56609 53696 47234 29287 28259 35330 60955 72722 74727 97082 93279 87766
13973H7766J9375Q041l4698j6195j2745m478J772n065k3258J2152J3371l04n467
$$ 87766 107141 115182 80484 64289 51544 47066 48838 43773 20515 32667 46038 45734 40267
13960D0267k6006j9424K1731L6863M833m583k4080q937j76K1472K3333J1153k0858
$$ 40267 14261 -5163 16568 53431 58264 53681 29601 20664 20488 41960 65293 76446 55588
13947E5588j5701P389O125l6491j1445j9834O938L2209K176j1884j222L466r888
$$ 55588 39887 47276 53401 16910 5465 -14369 -7431 24778 26954 15070 13848 17314 7426
13934G426o661N422q916j0666q226J236k3949j2283q020J4061J285P444J5367
$$ 7426 765 6187 -2729 -13395 -21621 -20385 -44334 -56617 -64637 -50576 -49291 -41847 -26480
13921b6480O365J5135M655m037J6913l439l031L081k2432J0445R112O336J0745
$$ -26480 -20115 -4980 -325 -4362 12551 9112 6081 9162 -13270 -2825 6287 12623 23368
13908B3368l6751j1347N572N427K2805j6271p183K2193m415l2219j7234L3626
$$ 23368 -13383 -24730 -19158 -13731 9074 -7197 -14380 7813 3398 -28821 -46055 -12429
13896a2429k807j5028K2301J0573L247r668M753l3186l6846Q948J7650l036L1198
$$ -12429 -15236 -30264 -7963 2610 5857 -3811 942 -32244 -69090 -60142 -42492 -45528 -14330
13883a4330K6244J5897J0014j5752j9655j6812O903l361J4637K5963N747J7217
$$ -14330 11914 27811 37825 22073 2418 -14394 -7491 -10852 3785 29748 35495 52712
13871E2712q936j1923m121K8530Q181k2959k846J9008K3780q549n299J4613K3976
$$ 52712 43776 31853 27732 56262 64443 41484 38638 57646 81426 72877 67578 82191 106167
13858A06167J0756k267l849k5152j3021m778n576K1270J5054K280q951J7286j2353
$$ 106167 116923 114656 110807 85655 72634 67856 62280 83550 98604 100884 91933 109219 96866
13845I6866k5641j9789K528O697J939K0638J2669K658m967k526p830K0940j0630
$$ 96866 71225 51436 53964 60661 62600 83238 95907 98565 93598 91072 83242 104182 93552
13832I3552m7296m798j5119K2627J1526k3305o108L2102J3972k1685j910J6063
$$ 93552 46256 41458 26339 48966 60492 37187 31079 63181 77153 55468 53558 69621
13820F9621J1779J5439K5217n339q724l679k311n4048m058J7214m838O414j177
$$ 69621 81400 96839 122056 116717 107993 104314 102003 47955 43897 61111 56273 62687 61510
13807F1510m5629j9855K6584J8476L366k703N391L054j3713j9353k830k798L129
$$ 61510 15881 -3974 22610 41086 44452 41749 47140 50194 36481 17128 14298 11500 14629
13794A4629R534k210N771j443J5194j7115l727P978j2587K750J5571J5584J1861
$$ 14629 24163 21953 27724 26281 41475 24360 20633 28611 16024 18774 34345 49929 61790
13781F1790j5303l836l2104j3742L3521J9681j0632j90J4907n300m972k4519m925
$$ 61790 46487 42651 10547 -3195 30326 50007 39375 39185 54092 48792 43820 19301 14376
13768A4376n295r65J4616P784o42O37L3243K4667J2984K0781M404m1459j9781
$$ 14376 9081 8116 22732 30516 29874 30511 63754 88421 101405 122186 126590 85131 65350
13755F5350L8579R385J622m420j0441r714j9402L9765J8968K9297M873Q852L0330
$$ 65350 103929 113314 114936 110516 100075 90361 70959 110724 129692 158989 163862 172714 203044
13742B03044K166P642l2843j6035L8926K2910q184j280l7915j1881K3899K2454
$$ 203044 205210 212852 180009 163974 202900 225810 217626 216346 178431 166550 190449 212903
13730B12903l1768k2882m4198j4411o284p54K2416J4833R990m143k1910k1474
$$ 212903 181135 158253 114055 99644 93360 92606 115022 129855 139845 135702 113792 92318
13718I2318m19J9654j1588j0190j1376j2660R779r713j9701p050R6p352j8110
$$ 92318 91899 111553 99965 89775 78399 65739 75518 65805 46104 39054 39150 31798 13688
13705A3688l677J8228j925j2682j3392L957o076p663k94L0766K9963l656J9713
$$ 13688 10011 28239 26314 13632 240 4197 -1879 -9542 -9836 20930 50893 47237 66950
13692F6950J2208l1501l5197j7257J1190m594j4633J5673L98l0965k1870R088
$$ 66950 79158 47657 12460 -4797 6393 1799 -12834 2839 3237 -27728 -49598 -40510
13680d0510J9537N117K404J991O827O148K1751Q440k0327L471N189M587o463k0792
$$ -40510 -20973 -15856 -13452 -11461 -4634 1514 23265 31705 11378 14849 20038 24625 18162 -2630
13666b630R274L271j6013K5730k3491j5835k6133N758K5882O116n692n31M78P617
$$ -2630 6644 9915 -6098 19632 -3859 -19694 -45827 -40069 -14187 -8071 -13763 -14294 -13816 -6199
13652f199J1140J995k9126j1408k2322K3534J7929j9634Q976P004j1165l055l197
$$ -6199 4941 6936 -22190 -33598 -55920 -32386 -14457 -34091 -25115 -18111 -29276 -32331 -35528
13639c5528L3538Q604k2260j7822M6216K214j7255k4734R816J2131P766J8606
$$ -35528 -1990 6614 -15646 -33468 12748 14962 -2293 -27027 -17211 -5080 2686 21292
13627B1292k0943j0944j4790P577l075m147K684L768j7972m2964M388J8648J5985
$$ 21292 349 -10595 -25385 -17808 -20883 -25030 -22346 -18578 -36550 -79514 -75126 -56478 -40493
13614d0493P686j3868P982m300L927j3240J4299J1122M772K1675l41q764K1507
$$ -40493 -32807 -46675 -38693 -42993 -39066 -52306 -38007 -26885 -22113 -438 -779 -9543 11964
13601A1964q75j0171j1573L909l862L4593j5978j8555q929Q507K834J1996k5565
$$ 11964 11089 918 -10655 -6746 -10608 23985 8007 -10548 -19477 -10970 -8136 3860 -21705
13588b1705N125M1569J9849k6579m1258j3226p465m954Q301K1178o872M420o81
$$ -21705 -16580 24989 44838 18259 -22999 -36225 -43690 -48644 -40343 -19165 -26037 -21617 -22298
13575b2298O982J3078P641J8081K1697k6608j1241j4945j4752j0197J9440J7042
$$ -22298 -15316 -2238 5403 23484 45181 18573 7332 -7613 -22365 -32562 -13122 3920
13563C920N437j4152l1456k6679j402n296J3986L046J7601J9641K528j9836j9736
$$ 3920 9357 -4795 -36251 -62930 -64332 -69628 -55642 -52596 -34995 -15354 -12826 -32662 -52398
13550e2398k595K0659q248K0839J5049p024l2507J8102J4077K2751k006k9272
$$ -52398 -54993 -34334 -42582 -21743 -6694 -13718 -46225 -28123 -14046 8705 6699 -22573
13538b2573q114P752J6372j718n282J7717J2675j3269j7553j0028J1862J389p589
$$ -22573 -30687 -22935 -6563 -8281 -13563 4154 16829 3560 -13993 -24021 -12159 -10770 -18359
13525a8359l397r141K7485J1224j93r746q922j6664j329O61j1206l822n938J203
$$ -18359 -21756 -30897 -3412 7812 7619 -2127 -11049 -27713 -29042 -28381 -39587 -43409 -49347 -48144
13511d8144j0135j2503R912K5368P242L612q943j29q471m828M720j1131l978k077
$$ -48144 -58279 -70782 -60870 -35502 -28260 -24648 -33591 -33720 -42191 -47019 -42299 -53430 -57408 -59485
13497e9485J3882K8091j4109m113J5614J0306o068j2109j5158m694K8921J0511
$$ -59485 -45603 -17512 -31621 -35734 -20120 -9814 -15882 -27991 -43149 -47843 -18922 -8411
13485h411K3483Q955k3036N7l244k378J2088n173P601j57J1267J1892j1943k68
$$ -8411 15072 24027 991 1048 -2196 -4574 7514 2341 9942 9785 21052 32944 21001 20733
13471B0733k332j5779k1138M957Q963j6048p169J6211k0973k1913K0890q90l363
$$ 20733 18401 2622 -18516 -13559 -4596 -20644 -27813 -11602 -32575 -54488 -33598 -34488 -37851
13458c7851J0845J4444j6744q892J210k4630K739J8814q747j9066l4K4330J1362
$$ -37851 -27006 -12562 -29306 -38198 -36988 -61618 -58879 -40065 -48812 -67878 -67912 -43582 -32220
13445c2220N784R912J36j8450j7036J3874L792L1398M575m903J1113l962j3893
$$ -32220 -26436 -16524 -16388 -34838 -51874 -38000 -34208 -2810 1765 -3138 7975 4013 -9880
13432i880o889j118L4358o838k8455j8991k250M077J7200r031j25Q98J4621o289
$$ -9880 -16769 -17887 16471 9633 -18822 -37813 -40063 -35986 -18786 -27817 -27942 -27044 -12423 -18712
13418a8712k033n969K234J2452P140k8525M603P124k702K1145J3699K6320j1713
$$ -18712 -20745 -26714 -24480 -12028 -4888 -33413 -28810 -21686 -24388 -3243 10456 36776 25063
13405B5063m2009l575J5493K7223j9663n3o534j2167q810J7376Q297j7406J025
$$ 25063 -16946 -20521 -5028 22195 2532 2479 -4055 -16222 -25032 -7656 641 -16765 -15740
13392a5740J4056p042j5711p607j0549j046J1521J3797j0719k6179R303O698K2065
$$ -15740 -1684 -8726 -24437 -32044 -42593 -43639 -32118 -18321 -29040 -55219 -45916 -39218 -17153
13379a7153Q77k900J576J6274j2038J4723q726j5602n048L5734J8913K0424J9801
$$ -17153 -16276 -19176 -17600 -1326 -13364 1359 -7367 -22969 -28017 7717 26630 47054 66855
13366F6855j0248q157j3336N038o223j3214j6569k9501m889J5561M568M0011J5997
$$ 66855 56607 48450 35114 40152 33929 20715 4146 -25355 -30244 -14683 -10115 29896 45893
13353D5893j9269q17J8364J1272l3766j9269J418K865J297N884k2927j448Q226
$$ 45893 26624 25807 44171 55443 21677 2408 3826 6691 7988 13872 -9055 -10503 -2277
13340b277k1887j4778O240J006j498j6720J6655K3813L4230K96k9414q784K1594
$$ -2277 -24164 -38942 -32702 -31696 -33194 -49914 -33259 -9446 24784 25080 -4334 -13118 8476
13327H476o41m49L98J314Q244L207J1670m2350l7382o909L8482J6987n187P58
$$ 8476 7835 7386 7784 9098 17342 20549 32219 -10131 -47513 -54422 -15940 1047 -4140 -3382
13313c382j7172Q466n950P006J4488j938l531K7310L20O742j4258k7026J2992
$$ -3382 -20554 -12088 -18038 -11032 3456 1518 -2013 25297 25617 32359 18101 -8925 4067
13300D067R64l606J2049q479j6864K686N982J1566j4587K320K1578Q027r060j6570
$$ 4067 5031 1425 13474 4995 -11869 -9183 -3201 8365 -6222 -3902 17676 25703 16643 73
13286G3j105k1423j7061L6832Q629k2434J630J8327Q611Q05L561J9907O057M128
$$ 73 -1032 -22455 -39516 -2684 5945 -16489 -14859 3468 12079 12884 16445 36352 42409 46537
13272D6537j0575n799m853O576M676l3536m8045o701K7324J343k6324P044R694
$$ 46537 35962 30163 25310 31886 36562 3026 -45019 -51720 -24396 -23053 -49377 -42333 -32639
13259c2639J4985M677l252K2316M4275k3585n872k650k466J3128l666k31j0883
$$ -32639 -17654 -12977 -16229 6087 50362 26777 20905 18255 15789 28917 25251 25020 14137
13246A4137k6073j695J4825J2867k173m203l6k0145j0895O547J7276k4636J2968
$$ 14137 -11936 -13631 1194 14061 11888 7685 7649 -12496 -23391 -16844 432 -24204 -11236
13233a1236Q834k4646j2138J8943k842k2843K523K3985j1479r932k115N647O942
$$ -11236 -2402 -27048 -39186 -20243 -23085 -45928 -43405 -19420 -30899 -40831 -42946 -37299 -30357
13220c0357J9222p821r898L0465K1027l2145k3410J2389l759p9J1818l3865j6696
$$ -30357 -11135 -18956 -28854 1611 22638 -9507 -32917 -20528 -24287 -24366 -12548 -46413 -63109
13207f3109J3123K4342J2743n208J2590J1580J3630R25p881O57j6368q554m222
$$ -63109 -49986 -25644 -12901 -18109 -5519 6061 19691 20616 12735 13392 -2976 -11530 -15752
13194a5752j2689K4179k0972j1121J5559L5267j0026j1537N820J4207j5682j9391
$$ -15752 -28441 -4262 -25234 -36355 -20796 14471 4445 -7092 -1272 12935 -2747 -22138
13182b2138o922k2727m705K0571J1136M4649J4605p363J8304k9593k4811K9139
$$ -22138 -29060 -51787 -56492 -35921 -24785 19864 34469 27106 45410 15817 -8994 20145
13170B0145j879j8639j7049r809J4917K2195J8127j6490j3970j6571l501P476
$$ 20145 18266 -373 -17422 -27231 -12314 9881 28008 11518 -2452 -19023 -22524 -15048
13158a5048O237J2568P190k706K3210N963j4480R444m103k1475j6514j7637K0039
$$ -15048 -8811 3757 10947 8241 31451 37414 22934 32378 28275 6800 -9714 -27351 -7312
13145g312K4709k0545j5959l18L927J370J749J7010P111n606N709r475j5186J7683
$$ -7312 17397 -3148 -19107 -19425 -15498 -14128 -12379 4631 11742 6136 11845 2370 -12816 4867
13131D867L8317j2412k448K133k7326k8515n95Q270K5978p229l3798j6918K868
$$ 4867 43184 30772 28324 30457 3131 -25384 -25979 -17709 8269 1040 -32758 -49676 -46808
13118d6808L2589K0143N87j2093J2997o31j8127j1685j552m216q0J5161L875o453
$$ -46808 -14219 5924 6511 -5582 7415 6784 -11343 -23028 -24580 -28796 -28876 -13715 -9840 -16293
13104a6293k3475L3704P704L2939K0104k9374k7008P183P218Q887p685l690j7712
$$ -16293 -39768 -6064 1640 34579 54683 25309 -1699 5484 12702 21589 13904 10214 -7498
13091g498m101r021K0756j4012M729M5J8840K170k2263j8704K0979o835j1566
$$ -7498 -11599 -20620 136 -13876 -9147 -9102 9738 11908 -10355 -29059 -8080 -14915 -26481
13078b6481J1988j8542k846J2212j102j4041j3608M415K2045M968q450j83j8673
$$ -26481 -14493 -33035 -35881 -23669 -24771 -38812 -52420 -48005 -25960 -20992 -29442 -29625 -48298
13065d8298l6079J6371K4213q602n081j7827K3481M961k7471j4149M4620K6077
$$ -48298 -84377 -68006 -43793 -52395 -57476 -75303 -51822 -46861 -74332 -88481 -43861 -17784
13053a7784j2763M529P431O058j9333j7009J5247o0j3355j3493J9654R139P884
$$ -17784 -30547 -26018 -18587 -12529 -31862 -48871 -33624 -33684 -47039 -60532 -40878 -31739 -23855
13040b3855O576L7j674j1820N63J9466L095k7284L608J846J2947K866k7176r503
$$ -23855 -17279 -17242 -18916 -30736 -30173 -10707 -7612 -34896 -31288 -29442 -16495 -13629 -40805 -50308
13026e0308K849p370m579O699J7133O363j571J9327M241l042L262q471k824j6586
$$ -50308 -47459 -54829 -59408 -52709 -35576 -29213 -30784 -11457 -7216 -10258 -6996 -15467 -18291 -34877
13012c4877q275l892M240L0162K1086p667k3227J3485r909M530J3675l2812j3257
$$ -34877 -43152 -47044 -42804 -12642 8444 777 -22450 -8965 -18874 -14344 -669 -33481 -46738
12999d6738M617Q253J7532M109J1455R529j4841J018j5571l806K1594l905m443
$$ -46738 -42121 -33868 -16336 -12227 -772 8757 -6084 -5066 -20637 -24443 -2849 -6754 -11197
12986a1197k3437o950K5462O993N930j2308o141P614n899q030p026o740p842J3820
$$ -11197 -34634 -41584 -16122 -9129 -3199 -15507 -21648 -14034 -19933 -27963 -34989 -41729 -49571 -35751
12972c5751J5603J7235j6532j4525q188J6659p936K4926q129M592J3214q894j0926
$$ -35751 -20148 -2913 -19445 -33970 -42158 -25499 -33435 -8509 -16638 -12046 1168 -7726 -18652
12959a8652J8156L0587k142l3798j3030L609J0856M572J9470j9317l2346k625
$$ -18652 -496 30091 27949 -5849 -18879 -15270 -4414 158 19628 311 -32035 -34660
12947c4660K0242N260k0881n568J0193o892K6159R684m210N867J9094R104j4416
$$ -34660 -14418 -9158 -30039 -35607 -25414 -32306 -6147 3537 -673 5194 24288 33392 18976
12934A8976k1427r347J5530m567j196K5990Q178l8848k0088J1467P945N32P998
$$ 18976 -2451 -11798 3732 -835 -2031 23959 32137 -6711 -26799 -15332 -7387 -6855 1143
12921A143M272o893J726K282J3984k2861J0395J1139k1386p956P574O005j3660
$$ 1143 5415 -1478 248 2530 16514 -6347 4048 15187 -6199 -14155 -6581 -576 -14236
12908a4236m165K401O176J5153j079m0462m688q79K5080J5867Q184L8942Q546
$$ -14236 -18401 -16000 -9824 5329 4250 -36212 -40900 -41779 -16699 -832 7352 46294 54840
12895E4840k3195l4751k9322L4960L2828k5439k0382m414K2819J3354K273N246
$$ 54840 31645 -3106 -32428 2532 35360 9921 -10461 -14875 7944 21298 23571 28817
12883B8817j5249k5792k5850n158k178Q639J3874M746J5495j0933j4821m134j3369
$$ 28817 13568 -12224 -38074 -43232 -45410 -36771 -22897 -18151 -2656 -13589 -28410 -32544 -45913
12870d5913j453j9364l707J0697o007N596q598L3717K830k823M788K154k2085
$$ -45913 -47366 -66730 -70437 -59740 -65747 -60151 -68749 -35032 -32202 -35025 -30237 -28083 -50168
12857e0168M647K1905J5291K3617l568J5535j920J8643L796j9656j8240K796M420
$$ -50168 -45521 -23616 -8325 15292 11724 27259 25339 43982 47778 28122 9882 12678 17098
12844A7098k9542j3619M837J6833R008j5190q892J0248p293k0802L64J8526J7195
$$ 17098 -12444 -26063 -21226 -4393 4615 -10575 -19467 -9219 -16512 -37314 -36950 -18424 -1229
12831a229J5024N966j6247n010L6297j3086k0879l529j234p842k76L71q744O148
$$ -1229 13795 19761 3514 -1496 34801 21715 836 -2693 -3927 -11769 -12045 -11674 -20418 -14270
12817a4270J5910M444j2414j1677j0630K0309J6310r166j7681M410k2471j858
$$ -14270 1640 6084 -6330 -18007 -28637 -8328 7982 -1184 -18865 -14455 -36926 -38784
12805c8784j147o642r509J3836J4327K0942l937j6967J2339J39R227J454j0483
$$ -38784 -39931 -46573 -56082 -42246 -27919 -6977 -10914 -27881 -15542 -15403 -6176 -4722 -15205
12792a5205j0858j929K9728K6670J451L488J175n161l3417j2605n906M23j514
$$ -15205 -26063 -27992 1736 28406 29857 33345 34520 29359 -4058 -16663 -22569 -22146 -23660
12779b3660J9769J0933j7301j1719K3218r82K537J7342l66k138Q333l8996k0324
$$ -23660 -3891 7042 -10259 -21978 1240 258 2795 20137 19771 17633 25966 -13030 -33354
12766c3354l196q607M684k1310K853L8821Q41m709N924j309K0480n51P154r790
$$ -33354 -36550 -45157 -40473 -61783 -58930 -20109 -19268 -23977 -18053 -19362 1118 567 7721 -2069
12752b069q948J8518J855j8006k6979K4946L1475k8030l7073m021Q428J1888N623
$$ -2069 -11017 7501 9356 -8650 -35629 -10683 20792 -7238 -44311 -48332 -39904 -28016 -22393
12739b2393K0983K886j281K1497J8204m50j030j7924K9367K1383l7143n0325j2364
$$ -22393 -1410 1476 195 21692 39896 39446 38416 20492 49859 71242 34099 -16226 -28590
12726b8590k983N454K2896N259J5099K9772j2149l2196K708R551k6504j2814J3076
$$ -28590 -31573 -26119 -3223 2036 17135 46907 34758 2562 5270 14821 -11683 -24497 -11421
12713a1421J9336k5629j5197q652M466k490Q683N712J1774M824J9753O75k7105
$$ -11421 7915 -17714 -32911 -41563 -37097 -39587 -30904 -25192 -13418 -8594 11159 11834 -15271
12700a5271q777n321J0665K6816P617j0757m890k441K5913O444j2215k617o243
$$ -15271 -24048 -29369 -18704 8112 15729 4972 82 -2359 23554 29998 17783 15166 8923
12687H923j0769m1409L743K1525j8789k0938n810J8245Q713M554o954J8626q863
$$ 8923 -1846 -43255 -39512 -17987 -36776 -57714 -63524 -45279 -36566 -32012 -38966 -20340 -29203
12674b9203k680L1539O425l891P420k6597o921j2362N763L583J4751J2795j1481
$$ -29203 -31883 -344 6081 2190 9610 -16987 -23908 -36270 -30507 -26924 -12173 622 -10859
12661a0859j0531n181N005K8992J0162J0940m733l9586J345k598N939J0949J9801
$$ -10859 -21390 -26571 -21566 7426 17588 28528 23795 -15791 -14446 -17044 -11105 -156 19645
12648A9645l108n189j2897k781n941k7475j4528K0827L6185K5964k5550l8213
$$ 19645 16537 11348 -1549 -4330 -10271 -37746 -52274 -31447 4738 30702 5152 -33061
12636c3061O314M816K9635k9617k072J1722K2496L2941k0579o621j4073j7563
$$ -33061 -26747 -21931 7704 -21913 -23985 -12263 10233 43174 22595 15974 1901 -15662
12624a5662K228L3222j0101k5605Q314J4764l215r312J855L1595p212l0052n546
$$ -15662 -13434 19788 9687 -15918 -7604 7160 3945 -5367 -3512 28083 20871 -9181 -14727
12611a4727Q077L7446J8297k5424j0767j9327j5714j0502r631M572Q867L1093
$$ -14727 -6650 30796 49093 23669 12902 -6425 -22139 -32641 -42272 -37700 -28833 2260
12599B260Q54l35j4331J3751K9976j1427j4341r510R954J5945L731P741n389j8657
$$ 2260 3114 2779 -11552 2199 32175 20748 6407 -3103 6851 22796 26527 34268 28879 10222
12585A0222j2336J2932K8215o926k9248l0219P018J8423M860J295J307J254K0222
$$ 10222 -2114 10818 39033 32107 2859 -27360 -20342 -1919 2941 4236 5543 6797 27019
12572B7019L7523k5280j9066l1511k1765L8186k734k1116K5046J7645j0143q303
$$ 27019 64542 39262 20196 -11315 -33080 5106 2372 -18744 6302 23947 13804 5501
12560E501L06o951j87K4673O162L4119J3824n582m502j3918M193p099k1156K3571
$$ 5501 5807 -1144 -1331 23342 29504 63623 77447 71865 67363 53445 57638 50539 29383 52954
12546E2954J3197j5518q092K1572J8462L739j5932p291l383O446J0284k9979M17
$$ 52954 66151 50633 42541 64113 82575 86314 70382 63091 59708 66154 76438 46459 46876
12533D6876J0720K146L882J0455J4539j7474j8109j4099o317l38j1452p91K1109
$$ 46876 57596 59742 63624 74079 88618 71144 53035 38936 32619 32281 20829 20038 41147
12520D1147l499J026m629j3191l662M261k2520o554N755Q906q066J9609O146J9775
$$ 41147 37648 38674 34045 20854 17192 21453 -1067 -7621 -1866 7040 -1026 18583 24729 44504
12506D4504J0704k1618o830J2917r909Q156K0562k5125o492j3747R563J3924o858
$$ 44504 55208 33590 26760 39677 29768 37924 58486 33361 26869 13122 22685 36609 29751
12493B9751N748j3865q026L2133K5803j5389k8722r531R125o991n968r687l034
$$ 29751 35499 21634 13608 45741 71544 56155 27433 17902 27027 20036 14068 4381 1347
12480A347R641J5133P765j9428J142j1059J0068J2710N344q29K976o214J377k506
$$ 1347 10988 26121 33886 14458 15600 4541 14609 27319 32663 31834 34810 28596 29973 27467
12466B7467j1318j2375p082P860m875M399m992J6525K402J7190J958J5890K9275
$$ 27467 16149 3774 -3308 4552 -323 4076 -916 15609 18011 35201 37159 53049 82324
12453H2324j8355n023k4374j0795Q53J3630m679q258o278J8626K5193j973k3243
$$ 82324 63969 58946 34572 23777 24630 38260 33581 25323 19045 37671 62864 60891 37648
12440C7648K485J4758P144p582k8218p398K0787M380j9996k5924k3571j650M017
$$ 37648 40133 54891 62035 54453 26235 18837 39624 44004 24008 -1916 -25487 -27137 -23120
12427b3120L3120L2863Q07j5987K1039q222j0565J528R807L292j6196j629L481
$$ -23120 10000 42863 43670 27683 48722 40500 29935 31463 41270 44562 28366 26737 30218
12414C0218J6072J1652l588J2682k7746j8670J8827J9556q296k373j3198r000
$$ 30218 46290 57942 54354 67036 39290 20620 39447 59003 50707 48334 35136 26136
12402B6136J360M549J326k0469K153J3131R795j1696J1304p06P787J4450J2988
$$ 26136 27496 32045 33371 12902 15055 28186 37981 26285 37589 36883 44670 59120 72108
12389G2108k2124N56J3142r153n173j4353J077n248N419l978o829J0002J6799
$$ 72108 49984 50540 63682 54529 49356 35003 36080 30832 36251 32273 25444 35446 52245
12376E2245j6924j237M435q376k2983K4404r181L986j2373q729K3383J6559j4056
$$ 52245 35321 34084 38519 30143 7160 31564 22383 26369 13996 5267 28650 45209 31153
12363C1153m63n732j7115M995K1016l422k131K3620K7984J1741o613j6712l3778
$$ 31153 30690 24958 7843 12838 33854 30432 28301 51921 79905 91646 85033 68321 34543
12350C4543J706J7274j2270m419j1957O815m654p214O760J0303M362l0632O664
$$ 34543 36249 53523 41253 36834 24877 31692 27038 19824 26584 36887 41249 10617 17281
12337A7281K3909J2443L163n986j8172O057M846J4519K1598m0113J3176j5853
$$ 17281 41190 53633 56796 50810 32638 38695 43541 58060 79658 39545 52721 36868
12325C6868n068M3319P164j0626k3515J029j181J7934P137r800j4265k6492j7720
$$ 36868 31800 75119 82283 71657 48142 49171 47990 65924 73061 63261 48996 22504 4784
12312D784M834J1758j0086J3618J0769j8259k2395k8555O968K7369J5759K9640
$$ 4784 9618 21376 11290 24908 35677 17418 -4977 -33532 -26564 805 16564 46204
12300D6204j3305k9685L6549m688j5500Q741K47o894j8324P559p86p734O797K046
$$ 46204 32899 3214 39763 35075 19575 28316 28563 21669 3345 10904 10118 2384 9181 11227
12286A1227l2740M406N676k2513R602K7968j2245m11K144l859k4741J0865K0554
$$ 11227 -21513 -17107 -11431 -33944 -24342 3626 -8619 -9030 -6886 -10745 -35486 -24621 -4067
12273d067q991J5961K2051O506k0649J571j4289J2122L736j7817k198M482J9239
$$ -4067 -13058 2903 24954 31460 10811 12382 -1907 10215 13951 -3866 -6064 -1582 17657
12260A7657J3894o232o887k047O912l066j3869r077q3j0623j1013M2929J2108
$$ 17657 31551 25319 18432 16385 23297 20231 6362 -2715 -2798 -13421 -24434 18495 30603
12247C0603m3262L50K2380J766k6348q423J2866o897J0189K6504m406J704K1089
$$ 30603 -12659 -12309 10071 11837 -14511 -22934 -10068 -16965 -6776 19728 15322 17026 38115
12234C8115R946l0124j8548k986K4338j5404M335J1793K4661M947j9574l1375
$$ 38115 48061 17937 -611 -3597 20741 5337 9672 21465 46126 51073 31499 124
12222A24l8188K590J797o97R275J7680J4646J663o643j1171R040L3745l877M65
$$ 124 -38064 -35474 -33677 -34374 -25099 -7419 7227 8890 2247 -8924 116 33861 29984 30449
12208C0449J9107M726k1452J986k569j3802k0096k9215k347K4075L028r097l860
$$ 30449 49556 54282 32830 34816 32247 18445 -1651 -30866 -33213 -9138 -6110 -15207 -19067
12195a9067R556J678l490J4718Q101L907K7428j6948k4767p408J6975J8322K8943
$$ -19067 -9511 -7833 -11323 3395 11496 15403 42831 25883 1116 -6292 10683 29005 57948
12182E7948Q238l1049L23l8497j1929k752q034K2204r673k3291M426K9087K5740
$$ 57948 66186 35137 35460 -3037 -14966 -17718 -25752 -3548 -13221 -36512 -32086 -2999 22741
12169B2741O490j9820j296P909K5140n884j0916j2548N825k5530n23J4327K6155
$$ 22741 29231 9411 8115 16024 41164 35280 24364 11816 17641 -7889 -8412 5915 32070
12156C2070J0381r320k3729j928J8355J6999J1073l3729k1855P156K0179p632
$$ 32070 42451 33131 9402 7474 25829 42828 53901 20172 -1683 5473 25652 18020
12144A8020N311L987O872K22K115J807q439P052J8357Q35j7716j3773n447J7005
$$ 18020 23331 27318 34190 34412 36527 38334 29895 36947 55304 56139 38423 24650 19203 36208
12130C6208j6402q676J0891K859J5961K3539J9852J3973o467k4520k0223l572
$$ 36208 19806 11130 22021 24880 40841 64380 84232 98205 91738 67218 46995 43423
12118D3423k4765k2032K1860J9512k0545k1550J2324J551p21J6241q05M105L3267
$$ 43423 18658 -3374 18486 37998 17453 -4097 8227 9778 9057 25298 24493 28598 61865
12105F1865R166L3152O851k3661j4882j9174j3949O718O682J1364J5988q183j3635
$$ 61865 71031 104183 111034 87373 72491 53317 39368 46086 52768 64132 80120 71937 58302
12092E8302L070P72j1938j182q582k027r295r036O991k576l870J1079k3022M466
$$ 58302 61372 62144 50206 49024 40442 38415 29120 20084 27075 24499 20629 31708 8686 13152
12078A3152L7669j7509j6706K223J1785R9P044j0013N689m799q334K2249J3488
$$ 13152 50821 33312 16606 18829 30614 30713 37757 27744 33433 28634 20300 42549 56037
12065E6037P93K658J673j992Q71R399l1894k5623R391K945J1393M89l045k665
$$ 56037 56830 59488 61161 59169 60040 69439 37545 11922 21313 24258 35651 36140 33095 30430
12051C0430o416j3523k0259l976o637K5330J302J0581K0173P272J447L7296o806
$$ 30430 24014 10491 -9768 -13744 -20381 4949 6251 16832 37005 44277 45724 83020 76214
12038G6214k4271k064Q557k0001n032Q210R64l3723O831M783J1039r593j5041
$$ 76214 51943 49879 58436 38435 33403 41613 42577 8854 15685 20468 31507 21914 6873
12025F873n539O843P8j5190k830J7294J7694p838O616K7187J3842k921k0706m896
$$ 6873 1334 8177 8255 -6935 -9765 7529 25223 17385 24001 51188 65030 62109 41403 36507
12011C6507Q974J0135L024k229j1702j1031K153N924j253J1036j9980j241p166
$$ 36507 45481 55616 58640 56411 44709 33678 35831 41755 40502 51538 31558 30317 23151
11998B3151k171Q993K452j8327N895K94l1205o522J5043J839K093N027j659N274
$$ 23151 20980 29973 32425 14098 19993 20287 -10918 -17440 -2397 -558 1535 6562 4903 10177
11984A0177n00N928J1317J607n293j896L425J5698N398k5640j8456n767K3536
$$ 10177 9677 15605 26922 28529 23236 21340 24765 40463 45861 20221 1765 -4002 19534
11971A9534K769j2782K175K669K6p282l4424J4062k273p045K590O809j7759j705
$$ 19534 22303 9521 11696 14365 14391 7109 -27315 -13253 -15526 -22571 -19981 -13172 -30931 -32636
11957c2636J0910J6735o350L353J9239J3807n070j830j8733j5193K6815M725J177
$$ -32636 -21726 -4991 -11341 -7988 11251 25058 19988 18158 -575 -15768 11047 15772 16949
11944A6949P399o138j5629K240O426l185j7185J5432K0313J5820j9500J2774Q035
$$ 16949 24348 18210 2581 4821 11247 8062 -9123 6309 26622 42442 22942 35716 43751
11931D3751k004K714n736o163K654j1214j5287j5391k2434L0761K6298p453j1992
$$ 43751 41747 44461 38725 32562 35216 24002 8715 -6676 -29110 1651 27949 20496 8504
11918H504L4334M0582o344k5368k2494k3894k0127J5806L0597K91J6889K1767
$$ 8504 42838 83420 77076 51708 29214 5320 -14807 999 31596 31887 48776 70543
11906G0543l4140k5500O62k0096j057l5548n066K0179K9091k38L258P47j4510
$$ 70543 36403 10903 11565 -8531 -9588 -45136 -50202 -30023 -932 -1170 2088 2835 -11675
11893a1675K8926K5424j613k4319L565l111j6879j0512j4544L2183J2679J0659
$$ -11675 17251 42675 41062 16743 20308 17197 318 -10194 -24738 7445 20124 30783
11881C0783J4832L042j9245k34n973o170J227j913O731K3226k5538j9590j5374
$$ 30783 45615 48657 29412 29178 23205 17035 18262 16349 23080 46306 20768 1178 -14196
11868a4196j503p331M1J4841J9967q236r250J9286J2047J2169o893L108K6269
$$ -14196 -15699 -23030 -22989 -8148 11819 3583 -5667 13619 25666 37835 30942 34050 60319
11855F0319k4066l5649j6572J661N823K0190J6846j438j5576K990L28J2412l000
$$ 60319 36253 604 -15968 -14307 -8484 11706 28552 27114 11538 14528 14856 27268 24268
11842B4268M426j3231L569J4041n835O617O939k0497j9J4108j2363l1585k4668
$$ 24268 28694 15463 19032 33073 27238 33855 40794 20297 20278 34386 22023 -9562 -34230
11829c4230O468J7037r212k12j123N275L0892J3136o811N728j1796L503j4153
$$ -34230 -27762 -10725 -19937 -20149 -21272 -15997 14895 28031 21220 26948 15152 18655 4502
11816D502r316o05k0477k46N820l175J4964q025j8270R31J3180K5209J591N9j1957
$$ 4502 -4814 -5419 -25896 -26142 -20322 -23497 -8533 -16558 -34828 -33897 -20717 4492 6083 6142 -5815
11801e815j2069j6754L0552J7808K1100J5576j5227l7266J1482q794k7307J4475
$$ -5815 -17884 -34638 -4086 13722 34822 50398 35171 -2095 9387 593 -26714 -12239
11789a2239K692J2490o700J8589K6714m607O867L569J094J3112k0083l8222J200
$$ -12239 -9547 2943 -3757 14832 41546 36939 43806 47375 48469 61581 41498 3276 4476
11776D476L3599Q898k668j1864J406l018q150L206q617N423j4774j2784J9442
$$ 4476 38075 46973 44305 32441 33847 30829 22679 25885 17268 22691 7917 -4867 14575
11763A4575j0659j4187J733J6439K2162P396K5310K6529l4564k1260P945J5639
$$ 14575 3916 -10271 -8538 7901 30063 37459 62769 89298 54734 33474 41419 57058
11751E7058j5150M812j1349k4599R462l2656j2673J1128j8990q160R239K0195
$$ 57058 41908 46720 35371 10772 20234 -12422 -25095 -13967 -32957 -41117 -31878 -11683
11739a1683M160k014o991J3338J488l937K4639J3769L723J1965l6535j9736j1377
$$ -11683 -7523 -9537 -16528 -3190 -1702 -5639 19000 32769 36492 48457 11922 -7814 -19191
11726a9191o189N141M6828r5J117j390J0713O121l3804M030m423J3008Q534j7748
$$ -19191 -25380 -20239 26589 26494 27611 26221 36934 43055 9251 13281 8858 21866 30400 12652
11712A2652K835K2126J3477K7324J1122k8290k4689k6879k2964k2418J4871M839
$$ 12652 15487 37613 51090 78414 89536 61246 36557 9678 -13286 -35704 -20833 -15994
11700a5994K0038Q755k686k3911L5194J9113j1364o320j6179L622j98j4972N572
$$ -15994 4044 12799 10113 -13798 21396 40509 29145 22825 6646 10268 10070 -4902 670
11687F70k138J1560M3458o508k1436j3077p839R504J698j5001n027m184j1747
$$ 670 -1468 10092 53550 47042 25606 12529 4690 14194 15892 891 -4136 -8320 -20067
11674b0067J620L27J0700J3731j3790j9117J8728j0978J6418L8929K582k2142
$$ -20067 -18447 -18120 -7420 6311 -7479 -26596 -7868 -18846 -2428 36501 39083 16941
11662A6941k8635P587J9271J8104m36p880j3727k1621J6360p853j918K0284K1032
$$ 16941 -11694 -4107 15164 33268 32832 24952 11225 -10396 5964 -1889 -3807 16477 37509
11649C7509j2021l49J6526k0515Q02o610j3343j1000o934J1995K2163l7753l0390
$$ 37509 25488 25139 41665 21150 21952 15342 1999 -9001 -15935 -3940 18223 -19530 -49920
11636d9920K6836K5631K0802j6138L982n385J6739L603M615r190j1803l1432K1426
$$ -49920 -23084 2547 23349 7211 11193 5808 22547 26150 30765 21575 9772 -21660 -234
11623b34M657J1440j3820O283L132n723n456k2515L094K7805k711K0906J1404
$$ -234 4423 15863 2043 8326 11458 5735 279 -22236 -19142 8663 5952 26858 38262
11610C8262p594j0191J6055j4628l3845k0133J343k70Q292K2811K4438k4440j2636
$$ 38262 30668 20477 36532 21904 -11941 -32074 -30731 -31001 -22709 102 24540 100 -12536
11597a2536J2874J0963J9417j2037K0546J5049o962p637J214k4408O665J2570
$$ -12536 338 11301 30718 18681 39227 54276 47314 39677 40891 16483 23148 35718
11585C5718k402j359l650k035J3289k0676m0430P064k760n863L6277j5317j0148
$$ 35718 33316 31957 28307 26272 39561 18885 -21545 -14481 -17241 -23104 13173 -2144 -12292
11572a2292R541k636j9370R152L5458J7406j4921j8254M907P054j1371K3568K6257
$$ -12292 -2751 -5387 -24757 -15605 19853 37259 22338 4084 8991 16045 4674 28242 54499
11559E4499k5386j6590l189L4562j1192p655J755J411j2176K2431j463P51k868
$$ 54499 29113 12523 9334 43896 32704 25049 26804 28215 16039 38470 37007 37758 34890
11546C4890m174M344J3487l3676P306Q462j0787q42J3000q257k0800k1924r143
$$ 34890 30716 35060 48547 14871 22177 30639 19852 19010 32010 23753 2953 -18971 -28114
11533b8114N460J1380K55K4255K1788o356R037k339M389j857P138k884j0056k7480
$$ -28114 -22654 -11274 -11019 13236 35024 28668 37705 35366 39755 37898 45036 42152 32096 4616
11519D616K102N569r757R129M4695K4532Q704J4925n695k9243k1009J424l2927
$$ 4616 6718 12287 2530 11659 56354 80886 89590 104515 98820 69577 48568 49992 17065
11506A7065j0955K2526j4793o136k1078m802L075L361K394K0815k5540j8408P124
$$ 17065 6110 28636 13843 7707 -13371 -18173 -15098 -11737 -9343 11472 -14068 -32476 -25352
11493b5352J5808N968L184K4263j9009p111J9091R249O015j71l860j807j902n365
$$ -25352 -9544 -3576 -392 23871 4862 -2249 16842 26091 32106 31935 28075 26268 24366 19001
11479A9001m027R809k5652n405J5971K4945J304k7425j0487K2813J0052q339j7193
$$ 19001 14974 24783 -869 -6274 9697 34642 35946 8521 -1966 20847 30899 22560 5367
11466E367q476L800K5762K2359r539K864j2442k167k7478J8104K1576l192R556
$$ 5367 -3109 691 26453 48812 39273 42137 29695 27528 50 18154 39730 36538 46094
11453D6094r433j8315l1543L5858J219j7487m109q107J0262K2062J6568l1825
$$ 46094 36661 18346 -13197 22661 23880 6393 2284 -5823 4439 26501 43069 11244
11441A1244m402J9609j0252J5583O376k8420l508R965J8190l297k7805j2466J3452
$$ 11244 6842 26451 16199 31782 38158 9738 6230 16195 34385 31088 3283 -9183 4269
11428D269K1804J0450L884j2870R175J750O950k6243J479L446j773j568R760p075
$$ 4269 26073 36523 40407 27537 36712 38462 45412 19169 20648 24094 22321 20753 30513 23438
11414B3438j755K0839J5176R189j1418o84K357K6595n169l7785k1833K6183J3849
$$ 23438 21683 42522 57698 66887 55469 54785 57142 83737 78568 40783 18950 45133 58982
11401E8982q838j0562o136J6904K4577O953l1161j6702j139k529j1146J8937J2971
$$ 58982 50144 39582 33446 50350 74927 81880 50719 34017 32878 30349 19203 38140 51111
11388E1111q364l602p740j5821L1300J507k0933K611k183J340L279j6890J2226
$$ 51111 42747 39145 31405 15584 46884 48391 27458 30069 27886 29226 32505 15615 27841
11375B7841L8736N162K1841j2237k3396j2947J8274n386N87K2804n713k5970Q180
$$ 27841 66577 71739 93580 81343 57947 45000 63274 57888 58475 81279 75566 49596 57776
11362E7776m397j4337J612J9760J155j6210J0040J2823q21j3619k1877J4681k742
$$ 57776 53379 39042 40654 60414 61569 45359 55399 68222 67401 53782 31905 46586 43844
11349D3844L371K4624O798r147q18j904q692j6210M7343L6176j4709k1878k3213
$$ 43844 47215 71839 78637 69490 68672 66768 58076 41866 89209 125385 110676 88798 65585
11336F5585k7329q523K93J3249L0004M655n828j0071k076J8744J7508K6722N088
$$ 65585 38256 29733 30026 43275 73279 77934 72106 62035 59959 78703 96211 122933 128021
11323A28021q312J583k9891r38j1139l55j8172J4525J3776j1822K3245K2294j9951
$$ 128021 119709 121292 91401 90463 79324 78969 60797 75322 89098 77276 100521 122815 102864
11310A02864k0070m190J5388M37j9143j2793O613L9176K246j7701j6271k2770
$$ 102864 82794 78604 93992 94429 75286 62493 69106 108282 110528 92827 76556 53786
11298E3786o362Q77M1212L0848k3412j8106K0862K8385k9175n1739M33L5139J7885
$$ 53786 47424 48301 89513 120361 96949 78843 99705 128090 98915 47176 47609 82748 100633
11285A00633j4457l0809m333k286N453K4000J8473R027j8611j962K1344L3753
$$ 100633 86176 55367 51034 48748 54201 78201 96674 105701 87090 85128 106472 140225
11273A40225n901M792O051j1695l5408k2373K581O526j0303m102j141m9j3152
$$ 140225 134324 139116 145167 133472 98064 75691 78272 84798 74495 70393 69252 69203 56051
11260E6051R077J0574J1342k277K6836M5521R994k7210k392Q41K4250K0325k137
$$ 56051 65128 75702 87044 84767 111603 157124 167118 139908 137516 138357 162607 182932 180795
11247A80795j3585j9630j3990j3065P074J1933j8824p916q109j6973j3125J5059
$$ 180795 167210 147580 133590 120525 127599 139532 120708 112792 104683 87710 74585 89644
11235H9644P02J5190q355l716k8404j6961j8676R913K6250J2342j1741Q112J1466
$$ 89644 90346 105536 97181 93465 65061 48100 29424 39337 65587 77929 66188 74300 85766
11222H5766Q033R532M670j2954q86k6227L097Q22J3371K2296O754L596J9064J470
$$ 85766 93799 103331 108001 95047 94161 67934 71031 71853 85224 107520 114274 117870 136934 138404
11208A38404M404j3496j9842k0802J7726L7090J1628k7808o475j9009M419Q703
$$ 138404 142808 129312 109470 88668 106394 143484 155112 127304 120829 101820 106239 114942
11196A14942j2886Q901K2031p760j9602j3335J7589j1856k9871n705j8851j5591
$$ 114942 102056 110957 132988 125228 105626 92291 109880 98024 68153 62448 43597 28006
11184B8006N375J9320p045k624J0825l362M9M973J9652J2945K256r885j5381l191
$$ 28006 33381 52701 45656 43032 53857 50495 50544 55517 75169 88114 90370 80485 65104 61913
11170F1913Q347J629j8190j8703J338P832r856J1066O932K1712K650O52J3067
$$ 61913 70260 71889 53699 34996 36334 44166 34310 45376 52308 74020 76670 77322 90389
11157I0389J4702o700j0498J0702L7397J8755j1303j7787j6266J4154L502j9424
$$ 90389 105091 98391 87893 98595 135992 154747 143444 125657 109391 123545 127047 107623
11145A07623o605Q144k89j0794m1393l362Q389n549J475L7376N052r005M3422
$$ 107623 101018 109162 108873 98079 56686 53324 61713 56164 57639 95015 100067 91062 134484
11132A34484K1408k5495k418K0767j4160k3314J2560J2086j5167Q191N065J5227
$$ 134484 155892 130397 127979 148746 134586 111272 123832 135918 120751 128942 134007 149234
11120A49234J3024j8182J7913L9393J8438K6175O6859M0826L8181M0952M9328
$$ 149234 162258 144076 161989 201382 219820 245995 312854 353680 391861 432813 482141
11109D82141N1674J7121K4735Q068m7429q1268p6667l7815j501K755r736j219
$$ 482141 533815 550936 575671 583739 536310 455042 378375 340560 339059 341814 332078 330859
11097C30859k7155j9732l0014j129j1536l6143R179L41K2664n112l0963k7350
$$ 330859 303704 283972 253958 252829 241293 205150 214329 214670 237334 232222 201259 173909
11085A73909p799K5784K4107K6021J6807J020O519M1620p969l646N512K6148L1690
$$ 173909 166110 191894 216001 242022 258829 259849 266368 307988 300019 296373 301885 328033 359723
11072C59723L3169O1587O1221N4262J2707L2217L8527M1705M0856N2164K1609
$$ 359723 392892 454479 515700 569962 582669 614886 653413 695118 735974 788138 809747
11061H09747J9961j8423l5147r000n24l2157l9446k8792j5243l4070l7887k1809
$$ 809747 829708 811285 776138 767138 766614 734457 695011 666219 650976 616906 579019 557210
11049E57210p22k8899l3903j3422l2455k7667k4018l7682r46n259m0134l9519
$$ 557210 556488 527589 493686 480264 447809 420142 396124 358442 357496 352237 312103 272584
11037B72584j923J793L034K6798k0232r344K0232J4095O093L622q088k2580j102
$$ 272584 270661 272454 275488 302286 282054 272710 292942 307037 313130 316752 308664 286084 284982
11024B84982k551l000j0870K5249M5870M1308M2520N7154L7305O6323O8243L5279
$$ 284982 282431 279431 268561 293810 339680 380988 423508 480662 517967 584290 652533 687812
11012F87812J7455k405l9721k5901l7376m1732n0942k0864j9848m0907m7727r910
$$ 687812 705267 702862 663141 637240 599864 558132 507190 486326 466478 425571 377844 367934
11000C67934k9371l5094j3060J714j1600k4817k188l926n157j8798m284K0602
$$ 367934 338563 303469 290409 292123 280523 255706 253518 249592 244435 225637 221353 241955
10988B41955J2430q039L1254N88o826K1811j3699o443P066K182J6198p150k1032
$$ 241955 254385 246346 277600 278188 271362 293173 279474 273031 280097 282279 298477 291327 270295
10975B70295j4440j3436K640j1583j4509j6005J261P325j0385J9053M095o925
$$ 270295 255855 242419 245059 233476 218967 202962 204223 211548 201163 220216 224311 217386
10963B17386K7304K8370M702q005j05j3045Q137R605M887l8565j8051L3417l027
$$ 217386 244690 273060 277762 269757 269652 256607 264744 274349 279236 240671 222620 256037 253010
10950B53010k138n544J330J7284r444r502O794M237l65P736K4536j0452J1803
$$ 253010 250872 245328 246658 263942 254498 244996 251790 256027 255662 263398 287934 277482 289285
10937B89285L1829J9767n776J6654K0638L11q426n033j0909j5047j3717j3165
$$ 289285 321114 340881 335105 351759 372397 372708 364282 359249 348340 333293 319576 306411
10925C06411l194J0939j1455L017J5633M4432J1047j1207p687L354P445J2265
$$ 306411 303217 314156 302701 305718 321351 365783 376830 365623 357936 361290 368735 381000
10913C81000N83l317L232j9646J0894J4267Q767q911l3507P550J3136J82Q775
$$ 381000 381583 378266 381498 361852 372746 387013 395780 386869 353362 360912 374048 374230 383005
10900C83005j357k5328j9228n701k471M466J7399R321M31j5517J0229l737j3044
$$ 383005 381648 356320 337092 331391 328920 333386 350785 360106 360537 345020 355249 351512 338468
10887C38468K8084K3543J284J1132L396Q439j2613q583M350Q165o882j617P369
$$ 338468 366552 390095 391379 402511 405907 414346 401733 393150 397500 405665 398783 397166 404535
10874D04535j306j429K4277K5540m180k2961j2301K049J8917p326o780J5333L636
$$ 404535 403229 401800 426077 451617 447437 424476 412175 414224 433141 425815 419035 434368 438004
10861D38004J3265K1423l156j8916k1071N179J1889J2657n989j4264j656L3255
$$ 438004 451269 472692 469536 450620 429549 434728 446617 459274 453285 439021 437365 470620
10849D70620K5950j1840K0119m379j8645O381k6701p365J1677K4623J8807q915
$$ 470620 496570 484730 504849 500470 481825 488206 461505 454140 465817 490440 509247 500332
10837E00332N237R922J7389K5539j2018r660J7954L0785N831J2360P82k7198J1826
$$ 500332 505569 515491 532880 558419 546401 536741 554695 585480 591311 603671 604453 577255 589081
10824E89081K1344J1343q330L1128M362j3335K6536L4013j2439k946O604K2736
$$ 589081 610425 621768 613438 644566 648928 635593 662129 696142 683703 680757 687361 710097
10812G10097O947K2515J1347p825L3795K4383K2486O805J0144j8399O551K7937
$$ 710097 717044 739559 750906 743081 776876 801259 823745 830550 840694 822295 828846 856783
10800H56783L1628L3412J9420J3487J6546q785j5721j124n570J7248l291j652
$$ 856783 888411 921823 941243 954730 971276 962491 946770 945646 940076 957324 954033 952381
10788I52381K9881K2145N327K6476K6373o892j5976J7396O522J3469K0874K0217
$$ 952381 982262 1004407 1009734 1036210 1062583 1055691 1039715 1057111 1063633 1077102 1097976 1118193
10776A118193K6075k6179j7953N2123M5084K1499k815K0993L8700K3122L0541
$$ 1118193 1144268 1118089 1100136 1152259 1197343 1218842 1216027 1237020 1275720 1298842 1329383
10765A329383L9574L1179N8501N6896M4132K8751M6553O3352N9942N4536O6905
$$ 1329383 1368957 1400136 1458637 1515533 1559665 1588416 1634969 1698321 1758263 1812799 1879704
10754A879704P4625M3088Q8507R9095M0633M8087R8508J06951J18241J03686J31712
$$ 1879704 1954329 1997417 2085924 2185019 2225652 2273739 2372247 2479198 2597439 2701125 2832837
10743B832837J58411J59732J57439J86979K00808K22184K72273L17136L75856
$$ 2832837 2991248 3150980 3308419 3495398 3696206 3918390 4190663 4507799 4883655
10734D883655M07138M52922N30726N94663O50605P52773Q75448R64565J128193
$$ 4883655 5290793 5743715 6274441 6869104 7519709 8272482 9147930 10112495 11240688
10725A1240688J418152J818132K380870L173363M260529N518896O797262P985545
$$ 11240688 12658840 14476972 16857842 20031205 24291734 29810630 36607892 44593437
10717D4593437Q821730R140363Q780203P549803N549176L008281K90956k321330
$$ 44593437 53415167 62555530 71335733 78885536 84434712 87442993 87733949 85412619
10709H5412619m584084o264397p243399p464037p092670o316081n349256m349657
$$ 85412619 80828535 74564138 67320739 59856702 52764032 46447951 41098695 36749038
10701C6749038l466168k692039k061744j634288j294240j045924q57615o93324
$$ 36749038 33282870 30590831 28529087 26894799 25600559 24554635 23697020 23003696
10693B3003696n46198m14556k64482j29255K4572K10870M41285O99708R33268
$$ 23003696 22457498 22042942 21778460 21649205 21673777 21884647 22325932 23025640 23958908
10684B3958908J226723J592712K007144K463014L014248L700058M465482N247678
$$ 23958908 25185631 26778343 28785487 31248501 34262749 37962807 42428289 47675967
10676D7675967O049074O808933P498261Q094575Q507370Q651045Q506419Q050373
$$ 47675967 53725041 60533974 68032235 76126810 84634180 93285225 101791644 109842017
10668A09842017P250217O045212M500294K722844Q57315r54626k475781l660901
$$ 109842017 117092234 123137446 127637740 130360584 131217899 130263273 127787492 124126591
10660A24126591m450512m850681m879992m753502m561467m424546m438719m564069
$$ 124126591 119676079 114825398 109945406 105191904 100630437 96205891 91767172 87203103
10652H7203103m739980m952642n119075n167944n132185m863332m493112m050386
$$ 87203103 82463123 77510481 72391406 67223462 62091277 57227945 52734833 48684447
10644D8684447l566025l043971k601583k209473j852064j519783j242721j003135
$$ 48684447 45118422 42074451 39472868 37263395 35411331 33891548 32648827 31645692
10636C1645692p85590o01243m40483l32184j84916j5092J57109M00058O93479
$$ 31645692 30860102 30258859 29818376 29486192 29301276 29286184 29443293 29843351 30536830
10627C0536830J128648J749632K582442L681783N082683O587554Q021334R132498
$$ 30536830 31665478 33415110 35997552 39679335 44762018 51349572 59370906 68503404
10619F8503404R757680R594987Q519382O538637L860763Q04999k253230m956548
$$ 68503404 78261084 87856071 96375453 102914090 106774853 107579852 105326622 100370074
10611A00370074p069930q447362q974199q738356q008270o988722n850644m793227
$$ 100370074 93300144 84852782 75878583 67140227 59131957 52143235 46292591 41499364
10603D1499364l846611l087169k498972k081542j773855j590541j446872j299590
$$ 41499364 37652753 34565584 32066612 29985070 28211215 26620674 25173802 23874212
10595B3874212j253458j179766j103394j011706r28042q40909p83422p37554o51482
$$ 23874212 22620754 21440988 20337594 19325888 18397846 17556937 16773515 16035961 15384479
10586A5384479o36684n94225n25914m78286m66450m71472m82165m51757m29025
$$ 15384479 14747795 14153570 13627656 13149370 12682920 12211448 11729283 11277526 10848501
10577A0848501m19038l76146l41243l08263k95039k97343k43019k32968k47510
$$ 10848501 10429463 10053317 9712074 9403811 9108772 8811429 8568410 8335442 8087932
10568H087932k51880k04900k23744k09339k11872k00654j87254j88163j95717
$$ 8087932 7836052 7631152 7407408 7198069 6986197 6785543 6598289 6410126 6214409
10559F214409j69520j66223j54079j80678j69246j56211j51075j37488j50702
$$ 6214409 6044889 5878666 5724587 5543909 5374663 5218452 5067377 4929889 4779187
10550D779187j50218q5628j21458r9109j11127j24117r7361j11078j39049j38374
$$ 4779187 4628969 4543341 4421883 4322774 4211647 4087530 3990169 3879091 3740042 3601668
10540C601668j10320j02742q4183o3039q0474q9533o9826r9585q2012j00988j10687
$$ 3601668 3491348 3388606 3304423 3241384 3160910 3071377 3001551 2901966 2819954 2718966 2608279
10529B608279j02557p8534q4027o8858p8777m1549m1719o3975p8950m1674m9387
$$ 2608279 2505722 2427188 2343161 2274303 2195526 2153977 2112258 2048283 1969333 1927659 1878272
10518A878272p2207m0782k6676p0716o3527l1677m9490m1847J183k4273o962j4883
$$ 1878272 1806065 1765283 1738607 1667891 1604364 1572687 1523197 1481350 1482533 1458260 1451298 1436415
10506A436415j3644j8087l2652k3653l3403j3406k8534l753K5288l59l273j0351
$$ 1436415 1422771 1404684 1372032 1348379 1314976 1301570 1273036 1269283 1294571 1294212 1290939 1280588
10494A280588k1608j9278j0878l1068k802m0524l1940p0044o6989L464L221m1081
$$ 1280588 1258980 1239702 1228824 1197756 1194954 1154430 1122490 1052446 985457 988921 992142 951061
10482I51061o0449k1428j1525m3555l8163o5143m4283j7700j6504R652k0054j9703
$$ 951061 890612 869184 857659 814104 775941 710798 666515 648815 632311 641963 621909 602206
10470F02206n15J1119j7990l6876k1076k5804N33l226q189j3921l4140O171K3353
$$ 602206 601691 612810 594820 557944 536868 511064 511597 508371 500182 486261 452121 458292 481645
10457D81645N860j3462k4662M457L1268K0300Q347Q625k3599j6448r111K788j985
$$ 481645 487505 474043 449381 453838 485106 505406 513753 522378 498779 482331 473220 476008 474023
10444D74023K6396o25q837j4389k1727j6370m935k0757J8m476K7698R081n238
$$ 474023 500419 499794 490957 476568 454841 438471 433536 412779 412797 408321 436019 445100 439862
10431D39862r036l3507m1341k709J8921j4650j1051J7118J050k0235O56j5450
$$ 439862 430826 397319 355978 353269 372190 357540 346489 363607 364657 344422 345078 329628
10419C29628r344r790J3975J6981n393l6486j3885K8639L88M610J7922J6761Q722
$$ 329628 320284 310494 324469 341450 336057 299571 285686 314325 314713 319323 337245 354006 362728
10406C62728j0006j7353j0118j7531m580K3500m0170q384J4748j6063p491j4798
$$ 362728 352722 335369 325251 307720 303140 326640 286470 278086 292834 276771 269280 254482
10394B54482p531O26m765j4886J0130Q705R720o96k3219P843K6081k00K7056K7130
$$ 254482 246951 247577 242812 227926 238056 246761 256481 255785 232566 240409 266490 266290 293346 320476
10380C20476M6647M6810M7584P665J4192K0941k7670j8561j2959Q414P930k7147
$$ 320476 367123 413933 461517 469182 483374 504315 476645 458084 445125 453539 461469 434322
10368D34322m1023j3636j8044k2162k8679P82k128K638n691j1214J0918L3047
$$ 434322 393299 379663 361619 339457 310778 311560 309432 312070 306379 295165 306083 339130
10356C39130L831k6728j4054M131o851n293l1554l8720rp134K8o804J7486K2134
$$ 339130 342961 316233 302179 306310 299459 294166 262612 223892 223883 216749 216777 209973 227459 249593
10342B49593l0162o394j7742o725L58j8708o396J2969K4890K2353p585m0627p708
$$ 249593 219431 213037 195295 188570 188928 170220 163824 176793 201683 224036 216451 175824 168116
10329A68116K2749n828j3189K8090J2278o176O511K4794L8516R66n50j0281L5152
$$ 168116 190865 185037 171848 199938 212216 206040 212551 237345 275861 276827 276277 265996 301148
10316C01148O7525N3691M7661Q3887J3973M3450M3718j879j5185J1508r615j0337
$$ 301148 368673 422364 470025 553912 567885 611335 655053 653174 637989 649497 639882 629545
10304F29545k830O659K7361M3806L1862J7033J9005j75m4196q1765n9514j8100
$$ 629545 626715 633374 660735 704541 736403 753436 772441 772266 728070 646305 586791 568691
10292E68691o6201o4103l3842j9181l1368Q194L3166N407l977l4634j0256j3308
$$ 568691 502490 438387 404545 385364 353996 362190 395356 400763 396786 362152 351896 338588
10280C38588L201Q326J6993K4075K245P3L1382K7803N4696M2932K9304L2213L1139
$$ 338588 341789 350115 367108 391183 393428 393501 424883 452686 507382 550314 579618 611831 642970
10267F42970O4073P7794N7586K1897P92j4609J3858K322k1284m59j6322N187L250
$$ 642970 707043 784837 842423 864320 865112 850503 864361 866683 845399 844940 828618 833805 837055
10254H37055J983j2017l8079O629r9j5474m1429k7950j8137k2676o5142p3477
$$ 837055 839038 827021 788942 795571 795472 779998 738569 710619 692482 669806 604664 531187
10242E31187n2310o876m513k6186j1980j7514j0662k3796j813o851j9071o088
$$ 531187 478877 472001 467488 441302 429322 411808 401146 377350 375537 368686 349615 343527
10230C43527K6334M0537j7585j7212K0697L7326M4832K6123L3301N5447N8998
$$ 343527 369861 410398 392813 375601 396298 433624 478456 504579 537880 593327 652325
10219F52325K5485M2134L6258N5735M5980K6737j5666m8144m8321m5846n8923
$$ 652325 677810 719944 756202 811937 857917 884654 868988 820844 772523 726677 667754
10208F67754m5905p1185n0213k7198r608m6231l7031l9186j9604k0052k7429n785
$$ 667754 621849 550664 500451 473253 463645 417414 380383 341197 321593 301541 274112 268327
10196B68327J2992j5883n74j5753r551R804k110K283l1279j9429J4876J6066P200
$$ 268327 281319 265436 264862 249109 239558 249362 247252 249535 218256 198827 213703 229769 236969
10183B36969J285j6969j6519m062o456P204J6939P405q635k23j3716k4242N223
$$ 236969 238254 221285 204766 200704 194248 201452 218391 225796 217161 216938 203222 178980 184203
10170A84203J5191j4000k0565k4135R58Q77j7191j8653J6208K7015J7927K0436
$$ 184203 199394 185394 164829 140694 141652 142529 125338 106685 122893 149908 167835 188271
10158A88271j8065j3602q839J0632m543p219M785j0318j3941K132J5P569J159
$$ 188271 170206 156604 147765 158397 153854 146635 151420 141102 127161 129293 129308 136877 138036
10145A38036l093k4744J7458R458r192J3897q411k1969L7297K3750j3121j175
$$ 138036 134943 110199 127657 137115 127923 141820 133409 111440 148737 172487 159366 158191
10133A58191J2113M968O625j1972M315M624l624k5162j718p721J4549N961n994
$$ 158191 170304 175272 181897 169925 174240 178864 175240 150078 148360 140639 155188 161149 155155
10120A55155K0746q170k1241k1849n148L810J3004j1052j0487j1575J5529K896
$$ 155155 175901 167731 146490 124641 119493 123303 136307 125255 114768 103193 118722 121618
10108A21618M109n213j3012K0861n101j3908M34j1253J4824l165j465J0082J145
$$ 121618 125727 120514 107502 128363 123262 109354 109788 98535 113359 110194 108729 118811 119956
10095A19956j6829Q370K0906k6646j2688L1242O173n28L814J2923l140j876l055
$$ 119956 103127 111497 132403 105757 93069 124311 130484 129956 133770 146693 143553 141677 138622
10082A38622K1344K0337j0518j6148l736J4668J9622K573J299l681m1467l2399
$$ 138622 159966 180303 169785 153637 149901 164569 184191 186764 188063 184382 142915 110516
10070A10516K7775l723j5151j0341K1120m81q26r209j609p369R025J3860n30l602
$$ 110516 138291 134568 119417 109076 130196 129715 128889 119680 118071 110702 119727 133587 133057 129455
10056A29455J564P031Q77J981o598P31L011k2612j0474J5152L808O05o399P382
$$ 129455 131019 138050 138927 140908 134310 135041 138052 115440 104966 120118 123926 124531 118132 125514
10042A25514k3946k7162j2088k2096O050M5154L601j4542o097J5287m719J2982
$$ 125514 101568 74406 62318 40222 46272 91426 95027 80485 74388 89675 84956 97938
10030I7938N97L672L2416p065r471k8682j5009J9070J2753N668J2587J5413L4304
$$ 97938 98535 102207 134623 127558 118087 89405 74396 93466 106219 111887 124474 139887 174191
10017A74191k4699k1980p889J5180p296k1165k5964r860K518J5476J3770J3696
$$ 174191 149492 127512 119623 134803 127507 106342 80378 70518 73036 88512 102282 115978
10005A15978M256k8079j4952J524j294L30J3610k730j8773R214K9714r135p209
$$ 115978 120234 92155 77203 78727 77433 77763 91373 88643 69870 79084 108798 99663 92454
9992I2454Q571J2599J5134j0180j6553J081j6962J3785J7188j2366k5512j1002
$$ 92454 101025 113624 128758 118578 102025 103106 86144 99929 117117 104751 79239 68237
9980F8237J9416L6972k0721m140M74K3888q18j7612R423m584j5276Q823j360Q036
$$ 68237 87653 124625 103904 99764 100238 124126 123308 105696 115119 110535 95259 104082 102722 110758
9966A10758q752j0553j9562J4332P640M305n285j0002K8094J9902K4579k0374
$$ 110758 102006 91453 71891 86223 93863 98168 92883 82881 110975 130877 155456 135082
9954A35082l2885M965J3404j2087j5935l441j2314L580j037J2578l631P277K3979
$$ 135082 102197 107162 120566 108479 92544 89103 76789 80369 79332 91910 88279 95556 119535
9941A19535J4559k2906Q244l597P443J0030k8676j914K238M352j463Q699J40J1571
$$ 119535 134094 111188 119432 115835 123278 133308 104632 102718 104956 109308 107845 116544 116684 128255
9927A28255J0202j2590k5323J7740J2455P276m365K2090j9073j6948J2120J3969
$$ 128255 138457 125867 100544 118284 130739 138015 133650 155740 136667 119719 131839 145808
9915A45808Q703j9569k593M750j366J085j5615Q097n432L892J0988j6521k8070
$$ 145808 154511 134942 132349 137099 135733 136818 121203 129300 123868 127760 138748 122227 94157
9902I4157L4815J8628l861k611L0635p58j6582k3732O193k5161o837n930M677
$$ 94157 128972 147600 143739 141128 171763 171005 154423 130691 136884 111723 104886 98956 103633
9889A03633p486M219J2196J7823o291r107k0194J1172J5657k3593m1567J0597
$$ 103633 96147 100366 112562 130385 124094 114987 94793 105965 121622 98029 56462 67059
9877F7059K1361K3228n235P887M0291K5919n704m4299n084q518J52K3067k0928
$$ 67059 88420 111648 106413 114300 154591 180510 174806 130507 125423 116905 117057 140124 119196
9864A19196O92O258Q514q032J4874K126R949J0473j3449k2145L3898K1358j396
$$ 119196 119888 126146 134660 126628 141502 143628 153577 164050 150601 128456 162354 183712 182316
9851A82316j3998k3705j6593j0447n138l057k189m176j219J7982m764K5650J8987
$$ 182316 168318 144613 128020 117573 112435 109378 107189 103013 101794 119776 115012 140662 159649
9838A59649k6688p215K1878K7292p01j6894j3428o807L000j916J2979O187J4274
$$ 159649 132961 125746 147624 174916 174215 157321 143893 137086 140086 138170 151149 157336 171610
9825A71610J035p196R482M426J9635j3133k1420o036j8088J8831L2925j4518k1342
$$ 171610 172645 165449 174931 179357 198992 185859 164439 158403 140315 159146 192071 177553 156211
9812A56211o942J8657j4201k0159M927K0069M6379j0671k7947l86k5894q124K746
$$ 156211 149269 167926 153725 133566 138493 158562 204941 194270 166323 165937 140043 131919 134665
9799A34665Q473J0538n916o808j0009O984J9087J2320k8913m100M272N637L0170
$$ 134665 143138 153676 147760 140952 130943 137927 157014 169334 140421 136321 140593 146230 176400
9786A76400J0690k2124K136p589j0549q345k247l718J3024N744l355L4336O039
$$ 176400 187090 164966 167102 159513 148964 140619 138372 134654 147678 153422 150067 184403 190442
9773A90442j5956j4492Q380O080o323m472k636J4907O722J1613n269m2496j7883
$$ 190442 174486 159994 168374 174454 168131 163659 161023 175930 182652 194265 188996 146500 128617
9760A28617Q337M4470O977j3522j3619k0748Q648k636m0683K483L105K7146j1853
$$ 128617 136954 181424 188401 174879 161260 140512 149160 146524 105841 108324 111429 138575 126722
9747A26722J2631J7710n063J2294K4548J4407r916K265j976j136J165N523J2453
$$ 126722 139353 157063 152000 164294 188842 203249 193333 195598 193622 192486 193651 199174 211627
9734B11627r578j0034j1055P231j2912j3140o051L7180o057j3078k2129q679N786
$$ 211627 202049 192015 180960 188191 175279 162139 156088 193268 187211 174133 152004 143325 149111
9721A49111j147j595J1922J7516Q758m123J1499P302n352r986J8889L441l4122
$$ 149111 147964 146369 158291 175807 184565 180442 191941 199243 193891 183905 202794 206235 172113
9708A72113k6714k1688K1010K9217K3261j8498J0874j7262P259L556j4894J2197
$$ 172113 145399 123711 144721 173938 197199 178701 189575 172313 179572 183128 168234 180431
9696A80431J8158J4393o701O155j0973k6184k743J8668R159p158n583K3363J4568
$$ 180431 198589 212982 206281 212436 201463 175279 172536 191204 200363 193205 187622 210985 225553
9683B25553j312n153k3791J1533Q356j4033j0621p606O0J7844j234k851M249L0425
$$ 225553 224241 219088 195297 206830 215186 201153 190532 182926 182986 200830 199596 196745 200994 231419
9669B31419J182k3905k2887N373K6243K1907j1984J396k1723k9957O235O979q52
$$ 231419 232601 208696 185809 191182 217425 239332 227348 228744 207021 177064 183299 190278 189426
9656A89426K4928K822m528J0690J2082j1355j2340K39M872k4856o216L3954J5977
$$ 189426 214354 217176 212648 223338 235420 224065 211725 211964 216836 191980 185764 219718 235695
9643B35695m4901j7850K1389k93j638J3686L291m83l143p300J2835O962N731m046
$$ 235695 190794 172944 194333 194040 192402 206088 209379 208896 205753 198453 211288 218250 223981 219935
9629B19935J9239J1740J2640j4589o543j8592k8876K67J7903K4034J4789K4311
$$ 219935 239174 250914 263554 248965 242422 223830 194954 195221 213124 237158 251947 276258
9617B76258L0008J5513L4160Q904j4056j6667k6724K3239K4805N803j6791k3644
$$ 276258 306266 321779 355939 364843 350787 334120 307396 330635 355440 361243 344452 320808
9605C20808l087p475k5024K8938J65N405M719M727J5188M357M026r45r195j4125
$$ 320808 317721 310246 285222 314160 314325 319730 324449 329176 344364 348721 352747 351802 342607 328482
9591C28482O66l151L0182n027k2134P934K0889Q930n224J3366K3392q756J6719
$$ 328482 329148 325997 356179 351152 329018 336952 357841 366771 361547 374913 398305 389549 406268
9578D06268K9639L590N953K7204M1017J3547k4210j6745q979J8555L9026K1614
$$ 406268 435907 439497 445450 472654 513671 527218 503008 486263 477284 495839 534865 556479
9566E56479Q334j9276l2479k5803p322J1499K5573K6128r368k3382j1528J0989
$$ 556479 564813 545537 513058 487255 479933 491432 517005 543133 533765 510383 498855 509844
9554E09844N907n713J503l435L361K3668J9120k0747j7504K1093J4311r681J3101
$$ 509844 515751 510038 511541 508106 511467 535135 554255 533508 516004 537097 551408 541727 554828
9541E54828j414J2221j3682k4183m441K3319J9947J7350K4078l835Q41K9426Q287
$$ 554828 553414 565635 551953 527770 523329 546648 566595 583945 608023 604188 605029 634455 642742
9528F42742j34J2549K0878j227j9927j734J6262P487j3369p97L833J4909J3306
$$ 642742 642608 655157 676035 674808 654881 653147 669409 676896 663527 662730 666563 681472 694778
9515F94778j5049l4038k0631J9231J6373m698l74o984n271j1872Q433j372p974
$$ 694778 679729 645691 625060 644291 660664 655966 655592 648608 643337 631465 639898 638526 630552
9502F30552Q920k3240k524k3021J4945J1797j6041n223k3169l4833N654Q950R927
$$ 630552 639472 616232 613708 590687 605632 617429 601388 596165 572996 538163 543817 552767 562694
9489E62694J12P123M8489K2979J1856k3476Q571k5827j3651p543J2935N956J972
$$ 562694 562806 569929 618418 641397 653253 629777 638348 612521 598870 591327 604262 610218 612190
9476F12190J2355J11K5657L140R53J2230J4484p993k2177m078K211j2174j6860
$$ 612190 624545 624656 650313 653453 654406 666636 681120 673127 650950 646872 649083 636909 620049
9463F20049j596j9589N622J7966J2364J0124m077K1534K239L5847L1944J6854
$$ 620049 618453 598864 604486 622452 634816 644940 640863 662397 664636 700483 732427 749281
9451G49281P445j9946o494m201j675l0459l7811J2950q17j2797j7820l1932K5939
$$ 749281 756726 736780 730286 726085 724410 693951 656140 669090 668273 655476 637656 605724 631663
9438F31663K8791J2581J7858J0336P4P451K3220O099K0749L6875L110k8508j8251
$$ 631663 660454 673035 690893 701229 701303 708754 731974 738073 758822 795697 798807 770299 752048
9425G52048n0665m0105M764P838k1450O281Q288j3422j6287l1817j5319j1231
$$ 752048 701383 661278 666042 673880 652430 658711 666999 653577 637290 605473 590154 578923
9413E78923J659o161J7558J9158k4274j6033J8783J288P005j2038o127J5441K4260
$$ 578923 580582 574421 591979 611137 586863 570830 589613 590901 597906 585868 579741 595182 619442
9400F19442j8607q223J4442j1797r453J3356J6292r485j041j3388J4360K2028
$$ 619442 600835 592612 607054 595257 585804 599160 615452 605967 604926 591538 605898 627926
9388F27926r615k4550J6825P952p062J6644J68O567J4011p79M522k4927m463K6984
$$ 627926 618311 593761 610586 618538 611476 628120 628288 634855 648866 648087 652609 627682 623219 650203
9374F50203Q970L8390n587k9249R276K9154J0337O079K86L58K5126L06L9535R184
$$ 650203 659173 697563 691976 662727 672003 701157 711494 717573 717859 718217 743343 743649 783184 792368
9360G92368J368j7859q153m969L551j2754J1321l3550J8306L5649R271j520J3267
$$ 792368 793736 775877 767724 762755 766306 753552 764873 731323 749629 785278 794549 793029 806296
9347H06296l217n876o312j1742j3509K9613J4166J9598J5687n893q162k0721p174
$$ 806296 803079 797203 790891 779149 765640 795253 809419 829017 844704 838811 830649 809928 802754
9334H02754P835M372J4241K5725J2895p915L718j2062j7814J4935K0860Q557N824
$$ 802754 810589 814961 829202 854927 867822 859907 863625 851563 833749 848684 869544 878101 883925
9321H83925J0413o988J7449K3108J8630J0682l750L1033K7581r9Q10K3146K5095
$$ 883925 894338 887350 904799 927907 946537 957219 953469 984502 1012083 1011984 1012794 1035940 1061035
9308A061035P989Q594J9327J8813J0304j383q426J4958M817k77J0774J7577M2281
$$ 1061035 1069024 1077618 1096945 1115758 1126062 1124679 1116253 1131211 1136028 1135751 1146525 1164102 1206383
9295A206383L9831J6688L931Q309J1386m572m685m244K979N012K6473K8146Q892
$$ 1206383 1246214 1262902 1266833 1275142 1286528 1281956 1277271 1273027 1276006 1281018 1307491 1335637 1344529
9282A344529M6232N6029K7494N953N661J3170K758L2649K3435L1574N1930O0176
$$ 1344529 1390761 1446790 1474284 1480237 1485898 1499068 1501826 1534475 1557910 1589484 1641414 1701590
9270A701590M3892K2391M510K2007L8644L8758M2949M1361O7001M3422K3547P9603
$$ 1701590 1745482 1767873 1772383 1794390 1833034 1871792 1914741 1956102 2023103 2066525 2090072 2169675
9258B169675O5750O5058P4756N2889P6136J05259Q5097R6001J01458J07422P0960
$$ 2169675 2235425 2300483 2375239 2428128 2504264 2609523 2694620 2790621 2892079 2999501 3070461
9247C070461Q7429J18409J32194J29034J65683J66320K05989K50385K22092K46767
$$ 3070461 3157890 3276299 3408493 3537527 3703210 3869530 4075519 4325904 4547996 4794763
9237D794763K47430K51157K61313L03515K88018L19903L24897L55840M41980N15270
$$ 4794763 5042193 5293350 5554663 5858178 6146196 6466099 6790996 7146836 7588816 8104086
9227H104086N90198N92897N93925N47455M74101M06262L77945L01441K51519K29620
$$ 8104086 8694284 9287181 9881106 10428561 10902662 11308924 11686869 11988310 12239829 12469449
9217A2469449J75189J76227J42972J41103J60836J54796J37312J71516J55534
$$ 12469449 12644638 12820865 12963837 13104940 13265776 13420572 13557884 13729400 13884934
9208A3884934J80648K09809K34088K61904L09344L75023L84849M49866M87461
$$ 13884934 14065582 14275391 14509479 14771383 15080727 15455750 15840599 16290465 16777926
9199A6777926M99797N54044N84296O02491O54039O81459P39255P99893Q39987
$$ 16777926 17277723 17831767 18416063 19018554 19672593 20354052 21093307 21893200 22733187
9190B2733187R30840J007100J055588J108082J126111J158051J177864J253534
$$ 22733187 23664027 24671127 25726715 26834797 27960908 29118959 30296823 31550357
9182C1550357J291991J361827J461245J471719J401481J287543J124612R16547
$$ 31550357 32842348 34204175 35665420 37137139 38538620 39826163 40950775 41867322
9174D1867322O97647M76808L01976J65212P4762L4145J1913k4404p8020o5882
$$ 41867322 42564969 43041777 43343753 43508965 43583727 43617872 43629785 43605381 43527361 43461479
9164D3461479r7665j60626j59416j67297j59387j04998q3745k0977Q680O4384
$$ 43461479 43363814 43203188 43043772 42876475 42717088 42612090 42528345 42507368 42516048 42580432
9154D2580432J36558J83353K84468L87442M44173N67485O83565Q05249R48038
$$ 42580432 42716990 42900343 43184811 43572253 44016426 44583911 45267476 46072725 47020763
9145D7020763J031261J108293J167327J242452J299778J274252J257926J228057
$$ 47020763 48052024 49160317 50327644 51570096 52869874 54144126 55402052 56630109
9137E6630109J178070J160748J141184J072202R72664R26836Q25174O95880N39641
$$ 56630109 57808179 58968927 60110111 61182313 62154977 63081813 63906987 64602867 65142508
9128F5142508L59238J41040M424r9391j57738k22279k68483l33296m14446m59316
$$ 65142508 65501746 65642786 65647210 65547819 65390081 65167802 64899319 64566023 64151577 63692261
9118F3692261n23615o06356o88286p24458q05965q52680q92146q56625q21612
$$ 63692261 63168646 62562290 61874004 61149546 60343581 59490901 58598755 57742130 56920518
9109E6920518q18114p92501p65135p17945o58960n09786m37009l63806k96963
$$ 56920518 56102404 55309903 54544768 53826823 53167863 52658077 52221068 51857262 51560299
9100E1560299k00332j18870p0769p4529m1173m380L8842P9857J02095J39610J78155
$$ 51560299 51359967 51241097 51170328 51095799 51054626 51050246 51089088 51168945 51271040 51410650 51588805
9089E1588805K57299L03327L39723M13006M81535M86235M97735M29188K84740
$$ 51588805 51846104 52149431 52489154 52902160 53383695 53869930 54367665 54796853 55081593
9080E5081593J09191q3987k75401m84216p17623r13486j137077j302447j422752
$$ 55081593 55190784 55106797 54831396 54347180 53629557 52716071 51578994 50276547 48853795
9071D8853795j478029j476955j453998j356712j247747j134063j023830q83032
$$ 48853795 47375766 45898811 44444813 43088101 41840354 40706291 39682461 38799429
9063C8799429o96820m75074j87464P9527J49766k16420p19250r86174j092248
$$ 38799429 38102609 37627535 37440071 37519598 37669364 37452944 36733694 35747520 34655272
9054C4655272j224438j315821j235475j042811p89354o24602n22727m47131l82632
$$ 34655272 33430834 32115013 30879538 29836727 29047373 28422771 27900044 27452913 27070281
9045B7070281l18621k61287k58450k18056j78742j52183j02498q3439j12252j30635
$$ 27070281 26751660 26490373 26231923 26013867 25835125 25682942 25580444 25497005 25384753 25254118
9035B5254118j46723l06126m80398o12007p34830p98953q29163q83296q69842
$$ 25254118 25107395 24801269 24320871 23708864 22974034 22175081 21345918 20462622 19592780
9026A9592780p97230p47528o62803o21860n97080n32993n02594m81429m87868
$$ 19592780 18795550 18048022 17385219 16763359 16166279 15633286 15130692 14649263 14161395
9017A4161395n04836m71062m20114l74884l83694l75766l40486l30018l16909
$$ 14161395 13656559 13185497 12765383 12390499 12006805 11631039 11290553 10960535 10643626
9008A0643626k86843k61204k55698k17161k16607k28235k35916k00923j88461
$$ 10643626 10356783 10095579 9839881 9622720 9406113 9177878 8941962 8741039 8552578
8999H552578j68094j69011j70492j87948j52537j79795j75327j68989j49806j18030
$$ 8552578 8384484 8215473 8044981 7857033 7704496 7524701 7349374 7180385 7030579 6912549
8989F912549j54250j32733j16084j45340j21609j28437j06500j24687j33459j10488
$$ 6912549 6758299 6625566 6509482 6364142 6242533 6114096 6007596 5882909 5749450 5638962
8979E638962j00646j08356j39716j43389j25683j16505q7984r0057o6183q8159
$$ 5638962 5538316 5429960 5290244 5146855 5021172 4904667 4816683 4726626 4660443 4572284
8969D572284n7658o7834o0268o7514m9308m5515o1278k2757l4175l0664l5679
$$ 4572284 4514626 4446792 4386524 4319010 4269702 4224187 4162909 4140152 4105977 4075313 4039634
8958D039634l2876m7979p8673o6074l1406o1619l8651m0756p3747n9101j9898
$$ 4039634 4006758 3958779 3880106 3814032 3782626 3721007 3682356 3641600 3567853 3508752 3488854
8947C488854l2430n4149n4048l8278q117m5388o4140m3532k0878m8770k2174R92
$$ 3488854 3456424 3402275 3348227 3309949 3301832 3256444 3192304 3148772 3127894 3079124 3056950 3057942
8935C057942l6984k9917k9420j056l3062m5308l2247r742J48k1069m4022j2279
$$ 3057942 3020958 2991041 2961621 2960565 2927503 2882195 2849948 2840206 2840354 2819285 2775263 2762984
8923B762984j1529Q63m10k4682k3663j1885K5094K9456j2892j1731j1187l1577
$$ 2762984 2751455 2752318 2751908 2727226 2703563 2691678 2716772 2746228 2733336 2721605 2710418 2678841
8911B678841m2408m0418k1745j8367j2993Q83N465m609k9360m1659l723J6567
$$ 2678841 2636433 2596015 2574270 2555903 2542910 2543793 2549258 2544649 2515289 2473630 2469907 2486474
8899B486474J5523K6278M816J729j9336k9683k961K0390R234J1411m206Q690p908
$$ 2486474 2501997 2528275 2533091 2534820 2515484 2485801 2482840 2503230 2512464 2523875 2519669 2528359 2520451
8886B520451j9974k3939L1512M7254K0459k1421n741j5196K3790O322J7088M345
$$ 2520451 2500477 2476538 2508050 2555304 2575763 2554342 2548601 2533405 2557195 2563517 2580605 2584950
8874B584950q129J8495k0604J772K3467J9781J3417K6807K2299Q924M294P195
$$ 2584950 2576821 2595316 2574712 2576484 2599951 2619732 2633149 2659956 2682255 2691179 2695473 2702668
8862B702668J9297K7496L2716N737q936J4349J9566L3976L4343M1879L0883L0603
$$ 2702668 2721965 2749461 2782177 2787914 2778978 2793327 2812893 2846869 2881212 2923091 2953974 2984577
8850B984577M1120M3133K5997J0021O0291N5174L4156L3651N2701O5324N1607
$$ 2984577 3025697 3068830 3094827 3104848 3165139 3220313 3254469 3288120 3340821 3406145 3457752
8839C457752N5399P3072N2040R9194Q6727M9434M9602L9246N4240Q9401P2952
$$ 3457752 3513151 3586223 3638263 3737457 3824184 3873618 3923220 3962466 4016706 4106107 4179059
8828D179059O5920R5647J34370J25984J02962J11635J65013J64021J65210J83025
$$ 4179059 4244979 4340626 4474996 4600980 4703942 4815577 4980590 5144611 5309821 5492846
8818E492846J64560J55984J70089J54889J73925J59754J77364J93533J64518J51829
$$ 5492846 5657406 5813390 5983479 6138368 6312293 6472047 6649411 6842944 7007462 7159291
8808G159291J76512J64294K00230K22022K30380J89738J75798J61531K05820K28547
$$ 7159291 7335803 7500097 7700327 7922349 8152729 8342467 8518265 8679796 8885616 9114163
8798I114163K03920K28955K46089L09935L40568L39867L60875M01941M24549M18811
$$ 9114163 9318083 9547038 9793127 10103062 10443630 10783497 11144372 11546313 11970862 12389673
8788A2389673M12660M23910L78158L10626K96161K78741K46273K93307L18470
$$ 12389673 12802333 13226243 13604401 13915027 14211188 14489929 14736202 15029509 15347979
8779A5347979L59342M18864M37721M84595N08637N52969N67224N93621O41168
$$ 15347979 15707321 16126185 16563906 17048501 17557138 18110107 18677331 19270952 19912120
8770A9912120O59423O87346O95240P05964P77028Q20158Q42229Q61655R49207
$$ 19912120 20571543 21258889 21954129 22660093 23437121 24257279 25099508 25961163 26910370
8761B6910370J030365J052050J113508J155287J226628J336853J386113J444115
$$ 26910370 27940735 28992785 30106293 31261580 32488208 33825061 35211174 36655289
8753C6655289J576131J656536J773988J869159J979221K059433K132834K125030
$$ 36655289 38231420 39887956 41661944 43531103 45510324 47569757 49702591 51827621
8745E1827621K079247J935105J796682J625759J388415J212620J008695Q33460
$$ 51827621 53906868 55841973 57638655 59264414 60652829 61865449 62874144 63707604
8737F3707604P24306O77137P18765P60192Q09037Q61022R03897R37542R99353
$$ 63707604 64431910 65109047 65827812 66588004 67397041 68258063 69161960 70099502 71098855
8728G1098855J015953J044515J153903J259003J406777J604044J810306J995427
$$ 71098855 72114808 73159323 74313226 75572229 76979006 78583050 80393356 82388783
8720H2388783K166691K317962K436066K539795K647014K778218K835903K911481
$$ 82388783 84555474 86873436 89309502 91849297 94496311 97274529 100110432 103021913
8712A03021913L029323L094434L111405L134928L157488L231245L335773L481459
$$ 103021913 106051236 109145670 112257075 115392003 118549491 121780736 125116509 128597968
8704A28597968L634703L881637M141908M422000M733841N027069N244366N482644
$$ 128597968 132232671 136114308 140256216 144678216 149412057 154439126 159683492 165166136
8696A65166136N689070N899257O158779O451595O822409P293742P810232Q304297
$$ 165166136 170855206 176754463 182913242 189364837 196187246 203480988 211291220 219595517
8688B19595517Q659575Q842090Q777608Q342920P493088O393288N204205M080175
$$ 219595517 228255092 237097182 245874790 254217710 261710798 268104086 273308291 277388466
8680B77388466L191719K633901K424673K489152K738195L034507L326479L486763
$$ 277388466 280580185 283214086 285638759 288127911 290866106 293900613 297227092 300713855
8672C00713855L484067L300397K989246K698125K476384K434571K528921K890585
$$ 300713855 304197922 307498319 310487565 313185690 315662074 318096645 320625566 323516151
8664C23516151L453960M112231M811699N521039O135409O554143O698720O534117
$$ 323516151 326970111 331082342 335894041 341415080 347550489 354104632 360803352 367337469
8656C67337469O242788N983958N782481N555505N352348N063512M674496M186768
$$ 367337469 373580257 379564215 385346696 390902201 396254549 401318061 405992557 410179325
8648D10179325L594669K848064K054250J275966M81973j99476p02175j064782
$$ 410179325 413773994 416622058 418676308 419952274 420434247 420234771 419532596 418467814
8640D18467814j193530j222777j232893j262495j471620j976932k799183l876188
$$ 418467814 417274284 416051507 414818614 413556119 412084499 410107567 407308384 403432196
8632D03432196n050633o263604p333992q115501q609574q808150q784137q573418
$$ 403432196 398381563 392117959 384783967 376668466 368058892 359250742 350466605 341893187
8624C41893187q251457p917307p588749p294370o985202o645609o255963n780845
$$ 341893187 333641730 325724423 318135674 310841304 303856102 297210493 290954530 285173685
8616B85173685n319489m929822m718125m689078m812370n044406n428730n990756
$$ 285173685 279854196 274924374 270206249 265517171 260704801 255660395 250231665 244240909
8608B44240909o662259p367419q042046q593737q971062r119856r072478q803826
$$ 244240909 237578650 230211231 222169185 213575448 204604386 195484530 186412052 177608226
8600A77608226q389499p870475p316375o794332o287103n820003n358581m978571
$$ 177608226 169218727 161348252 154031877 147237545 140950442 135130439 129771858 124793287
8592A24793287m638267m320666m064002l828564l577661l409972l279821l129964
$$ 124793287 120155020 115834354 111770352 107941788 104364127 100954155 97674334 94544370
8584I4544370k975433k844712k723281k654516k554293k418988k283993k145483
$$ 94544370 91568937 88724225 86000944 83346428 80792135 78373147 76089154 73943671
8576G3943671k049523j973481j892477j771474j685204j612526j541531j473680
$$ 73943671 71894148 69920667 68028190 66256716 64571512 62958986 61417455 59943775
8568E9943775j431262j362311j355191j302902j246576j188824j175338j214333
$$ 59943775 58512513 57150202 55795011 54492109 53245533 52056709 50881371 49667038
8560D9667038j271789j281542j293171j319733j313027j284239j219518j203498
$$ 49667038 48395249 47113707 45820536 44500803 43187776 41903537 40684019 39480521
8552C9480521j163568j115095j087242j058051r98348r28716q53538q39929p80403
$$ 39480521 38316953 37201858 36114616 35056565 34058217 33129501 32275963 31436034 30655631
8543C0655631p42500p29916p33639p22957o19866o25933o67279o39639o09703
$$ 30655631 29913131 29183215 28449576 27726619 27106753 26480820 25813541 25173902 24564199
8534B4564199o02475n83222n87523n65954n52097n66637n60091n43051n54614
$$ 24564199 23961724 23378502 22790979 22225025 21672928 21106291 20546200 20003149 19448535
8525A9448535n54597n22129n42123m90069m82362m75832m50324m03244m19462
$$ 19448535 18893938 18371809 17829686 17339617 16857255 16381423 15931099 15527855 15108393
8516A5108393m13868l95264l93996l70784l55409l43531l42566l48240l32781
$$ 15108393 14694525 14299261 13905265 13534481 13179072 12835541 12492975 12144735 11811954
8507A1811954l53442l43775l33539k94438k89619l12199l02457k60708k43823
$$ 11811954 11458512 11114737 10781198 10486760 10197141 9884942 9582485 9321777 9077954
8498I077954k65255k64151k72578k41443k09200k31516k15063k37410k03316k11911
$$ 9077954 8812699 8548548 8275970 8034527 7825327 7593811 7378748 7141338 6938022 6726111
8488F726111j68161j45659j52439j56103j45671j18065j41967j47310j26110j34299
$$ 6726111 6557950 6412291 6259852 6103749 5958078 5840013 5698046 5550736 5424626 5290327
8478E290327j10599r0989j08488j22234r7966p1924p1867q0911q6358r6024p8508
$$ 5290327 5179728 5088739 4980251 4858017 4760051 4688127 4616260 4535349 4448991 4352967 4274459
8467D274459n8193m5225n0217o5804q7598n1979p8864n2485k1908k0961j6790
$$ 4274459 4216266 4171041 4120824 4055020 3967422 3915443 3836579 3784094 3762186 3741225 3724435
8456C724435k4458m2257k3860m7504l5912n5639q5444m4830m5529j7409j3809
$$ 3724435 3699977 3657720 3633860 3586356 3550444 3494805 3409361 3364531 3319002 3301593 3287784
8445C287784l1424l7682m3845m2854m2088k9572n0051m9712n4203k5073j6843
$$ 3287784 3256360 3218678 3174833 3131979 3089891 3060319 3010268 2960556 2906353 2881280 2864437
8434B864437j1885j360k0282k0542M673j885J7218j5520j6138K9989M0125Q799
$$ 2864437 2852552 2851192 2830910 2810368 2815041 2813156 2830374 2814854 2798716 2828705 2868830 2877629
8422B877629O0894J02874Q9414N2512p945m6083p1412r4309j04092j27086j00966
$$ 2877629 2938523 3041397 3130811 3183323 3175378 3129295 3057883 2963574 2859482 2732396 2631430
8411B631430q7841o5033p0552n5618l0151n9077j8716m0348n9532n9411n0218
$$ 2631430 2543589 2478556 2408004 2352386 2322235 2263158 2244442 2204094 2144562 2085151 2034933
8400B034933n4701k9897j3537O697M648k8913j6088l1089j9803k4732l6323j4210
$$ 2034933 1980232 1950335 1936798 1943495 1948143 1919230 1903142 1872053 1852250 1827518 1791195 1776985
8388A776985k463l755k205K1040P877m798R213m990l3773k2583l4578j7883K114
$$ 1776985 1774522 1770767 1768562 1789602 1797479 1792681 1801894 1796904 1763131 1740548 1705970 1688087 1690201
8375A690201J345m1002l1041r213L633n70k9699m4803k1873q806l8364j1341j333
$$ 1690201 1691546 1650544 1619503 1610290 1613923 1613353 1583654 1538851 1516978 1508172 1469808 1458467 1457134
8362A457134k3189k7216k1520m355J4775k8241r987R863j0592l743K0865r578
$$ 1457134 1433945 1406729 1385209 1380854 1395629 1367388 1357401 1367264 1356672 1352929 1373794 1364216
8350A364216r985O481n671j3965k3639j90K2468O157N211j393N191L3932j711
$$ 1364216 1354231 1360712 1355041 1341076 1317437 1317247 1339715 1345872 1351083 1349690 1354881 1388813 1387102
8337A387102j756P025j3992N731K0280J5523r297N322P691K3660k2062k0377M586
$$ 1387102 1385346 1392371 1378379 1384110 1404390 1419913 1410616 1415938 1423629 1447289 1425227 1404850 1409436
8324A409436K2093J6599J0541Q849J829J0928Q539J0407J8093J9651J9368Q352
$$ 1409436 1431529 1448128 1458669 1467518 1469347 1480275 1488814 1499221 1517314 1536965 1556333 1564685
8312A564685J4353l0024l0547J0332N3272M2864J2840K1402J4776J5400K8440
$$ 1564685 1579038 1549014 1518467 1528799 1582071 1624935 1637775 1659177 1673953 1689353 1717793
8301A717793K5647L4465J5722j0247J7671M5924J1194K887K1911l586J5198J6735
$$ 1717793 1743440 1777905 1793627 1783380 1801051 1846975 1858169 1861056 1882967 1879381 1894579 1911314
8289A911314q334l1101q537N184J7468J4620J3758P482l4499K185K2346N964J0698
$$ 1911314 1902980 1871879 1863342 1868526 1885994 1900614 1914372 1921854 1887355 1889540 1911886 1917850 1928548
8276A928548P640L3848J4859k260j1822J0214K885M951j446J0675J6717r252k7775
$$ 1928548 1936188 1970036 1984895 1982635 1970813 1981027 1983912 1988863 1987417 1998092 2014809 2005557 1977782
8263A977782j7987J4181o029k992J4305J4572n966j6941J7301r655j5679j6777
$$ 1977782 1959795 1973976 1967947 1964955 1979260 1993832 1987866 1970925 1988226 1978571 1962892 1946115
8251A946115K7245K6702r176j800j1322l2220L071j7077k8922j122q405k382N914
$$ 1946115 1973360 2000062 1990886 1989086 1977764 1945544 1948615 1931538 1902616 1901494 1893089 1890707 1896621
8238A896621n409k4062j8622j6790K1138K5178j1486q303k8189K0m614M810p348
$$ 1896621 1891212 1867150 1848528 1831738 1852876 1878054 1866568 1858265 1830076 1830096 1825482 1830292 1822944
8225A822944l3405j2216o883l245K0452K4059N24L293q814l6130j560K8898J0455
$$ 1822944 1789539 1777323 1770440 1767195 1787647 1811706 1812230 1815523 1806709 1770579 1769019 1797917 1808372
8212A808372m263M1326N726m3511q964J5194R917L68L2633k0863j4420K7942K159
$$ 1808372 1804109 1845435 1851161 1807650 1798686 1813880 1823797 1824165 1856798 1835935 1821515 1849457 1851616
8199A851616k6371m780j9110M379n402Q137J5821j0386N667r732L9296K0026j4114
$$ 1851616 1825245 1820465 1801355 1805734 1800332 1808469 1824290 1813904 1819571 1809839 1849135 1869161 1855047
8186A855047J9788K2082L2760J2505p899J1269K4671O567j4910N3181L6286P513
$$ 1855047 1874835 1896917 1929677 1942182 1934283 1945552 1970223 1976790 1961880 2015061 2051347 2058860
8174B058860r096k846J0134J3186o370P165K7531L2426M5019L3529M8058L7595
$$ 2058860 2049764 2046918 2057052 2070238 2063868 2071033 2098564 2130990 2176009 2209538 2257596 2295191
8162B295191O093L7573L2875J4091L2709M5665J2578L1767M5164P1319Q9364Q0436
$$ 2295191 2301284 2338857 2371732 2385823 2418532 2464197 2476775 2508542 2553706 2625025 2714389 2794825
8150B794825P0989N4899L1242M2018N3989Q5201N7602K0028M7166O6029O8009
$$ 2794825 2865814 2920713 2951955 2993973 3047962 3133163 3190765 3210793 3257959 3323988 3391997
8139C391997N7290O0978P8433Q5159N8721P2807N2514P3386N9908M3530L9284
$$ 3391997 3449287 3510265 3588698 3673857 3732578 3805385 3857899 3931285 3991193 4034723 4074007
8128D074007K7810R4629Q4544Q5296R3215P6277P3880Q6614O3969Q8310J17995
$$ 4074007 4101817 4196446 4280990 4366286 4459501 4535778 4609658 4696272 4760241 4848551 4966546
8117D966546J12923J03797J16253J26482J25774J40517J30343J69520J92882K40825
$$ 4966546 5079469 5183266 5299519 5426001 5551775 5692292 5822635 5992155 6185037 6425862
8107F425862K35473K20403K43078K30310K83591L07318L35794L55190L95091M41213
$$ 6425862 6661335 6881738 7124816 7355126 7638717 7946035 8281829 8637019 9032110 9473323
8097I473323M60965N29592N75304O48076P78389Q57943R60043J030379J077822
$$ 9473323 9934288 10463880 11039184 11687260 12465649 13323592 14283635 15314014 16391836
8088A6391836J143328J190104J227890J306437J466882J663858J827635K107421
$$ 16391836 17535164 18725268 19953158 21259595 22726477 24390335 26217970 28325391
8080B8325391K419768K865808L302272L813478M454463N124643N764910O264936
$$ 28325391 30745159 33610967 36913239 40726717 45181180 50305823 56070733 62335669
8072F2335669O487194O305487N662562M516836L071855J741907O42986k03981
$$ 62335669 68822863 75128350 80790912 85307748 88379603 90121510 90764496 90560515
8064I0560515q14325j032420j008284q35172o57050n65143n46691n64313o49332
$$ 90560515 89746190 88713770 87705486 86870314 86213264 85648121 85101430 84537117 83887785
8055H3887785o68902p04686p61543p99077p82256p02863n06046l30081n4369K53434
$$ 83887785 83218883 82514197 81752654 80953577 80171321 79468458 78962412 78632331 78577962 78831396
8045G8831396N34075P75879J038779J336375J627140J997716K519189L246815
$$ 78831396 79365471 80141350 81180129 82516504 84143644 86141360 88660549 91907364
8037I1907364M219487N561298P406122R984770J3759803J9252524K6392853L2141627
$$ 91907364 96126851 101688149 109094271 119079041 132838844 152091368 178484221 210625848
8029B10625848K9745205J7271702K927499o756011j3061938j9365971k3631145
$$ 210625848 240371053 257642755 260570254 253814243 240752305 221386334 197755189
8022A97755189k2922668j9095898j4963538j1777177r549749p944454o693192
$$ 197755189 174832521 155736623 140773085 128995908 119446159 111501705 104808513
8015A04808513n670597m781843m039742l557344l174706k837556k538770k284761
$$ 104808513 99137916 94356073 90316331 86758987 83584281 80746725 78207955 75923194
8007G5923194k055282j839802j594936j333448j007774o91966m56854k15898J2221
$$ 75923194 73867912 72028110 70433174 69099726 68091952 67399986 66943132 66727234 66739455
7998F6739455K46008N09834P94226J070470J419291J770149K226564K766690L505068
$$ 66739455 66985463 67495297 68289523 69359993 70779284 72549433 74775997 77542687 81047755
7989H1047755M342847N177288N628060N253903M001818K234710L27653j631579
$$ 81047755 85390602 90567890 96195950 101449853 105451671 107686381 108014034 106382455
7981A06382455l586103n198612o056250o347986o363407o141334n633781n066429
$$ 106382455 102796352 97597740 91541490 85193504 78830097 72688763 67054982 61988553
7973F1988553m509128l979254l495441l036136k645136k276315k008239j841152
$$ 61988553 57479425 53500171 50004730 46968594 44323458 42047143 40038904 38197752
7965C8197752j683632j616201j562670j482923j431869j349555j278165j207368
$$ 38197752 36514120 34897919 33335249 31852326 30420457 29070902 27792737 26585369
7957B6585369j108678j052907j000695r14681q50462p76668p25875p10638o77059
$$ 26585369 25476691 24423784 23423089 22508408 21657946 20881278 20155403 19444765 18767706
7948A8767706o44434o14509n81231n73850n48128n41929n21868m84825m45931
$$ 18767706 18123272 17508763 16927532 16353682 15805554 15263625 14741757 14256932 13811001
7939A3811001m40897m15623m13097l51977l11829l24652l62815l32903l09436
$$ 13811001 13370104 12954481 12541384 12189407 11877578 11552926 11190111 10857208 10547772
7930A0547772l14504l07922l18954l01433k81071k70973k57010k46930k21173
$$ 10547772 10233268 9925346 9606392 9304959 9023888 8752915 8495905 8248975 8027802
7921H027802k24016k59087k33593k31609k05238j77049j80320j64355j66138j73024
$$ 8027802 7803786 7544699 7311106 7079497 6874259 6697210 6516890 6352535 6186397 6013373
7911F013373j37721r7166j14828j31944j32607j30153j15159j51900j63390j58090
$$ 6013373 5875652 5778486 5663658 5531714 5399107 5268954 5153795 5001895 4838505 4680415
7901D680415j49347j55011j39584j20261j03513j12324j14201j51933j23972r7156
$$ 4680415 4531068 4376057 4236473 4116212 4012699 3900375 3786174 3634241 3510269 3413113
7891C413113r8444p6397o4660r1751j09547j04932q4516r3109p6853n9498o8653
$$ 3413113 3314669 3238272 3173612 3081861 2972314 2867382 2782866 2689757 2612904 2553406 2484753
7880B484753p6468p8590q2652n1508o0196n8235k4057l1157k8706l4663n2393
$$ 2484753 2408285 2329695 2247043 2195535 2135339 2077104 2053047 2021890 1993184 1958521 1906128
7869A906128l7333m8731j7355j6032l8436o3987l9513l7441k0784m870n3684m9322
$$ 1906128 1868795 1820064 1802709 1786677 1748241 1684254 1644741 1607300 1586516 1581646 1527962 1478640
7857A478640k5292k8315j1415n2595n3960l5609M715n2552m8065k2943j9057k8932
$$ 1478640 1453348 1425033 1413618 1361023 1307063 1271454 1276169 1223617 1175552 1152609 1133552 1104620
7845A104620k1130j1728J7976k2393p1960m5343l2330k2185n2928K405o558j6544
$$ 1104620 1083490 1071762 1089738 1067345 995385 950042 917712 895527 842599 845004 838446 821902
7833H21902m2011j6704j4826o130k8772o576O55K366K365q056p116k5464L740
$$ 821902 779891 763187 748361 742231 713459 706883 707538 709904 712269 704213 697097 671633 675373
7820F75373L680p479j7667k8872j1012n91L244K3218J0747k7981p708K076J826
$$ 675373 679053 671574 653907 625035 614023 613432 616676 639894 650641 622660 614952 617028 618854
7807F18854k139J2598j3627l4751k1313r638N430l2771k5432j6281J0022L6592
$$ 618854 616715 629313 615686 580935 559622 549984 555414 522643 497211 480930 490952 527544
7795E27544J5164j2462k4657n394j4961k7401K8968J5173k3187q351P404j8236
$$ 527544 542708 530246 505589 500195 485234 457833 486801 501974 478787 470436 477840 459604
7783D59604p214k4718J5721j4043J7688J5547M949l0071j2516k6462k1376J2264
$$ 459604 452390 427672 443393 429350 447038 462585 467534 437463 424947 398485 377109 389373
7771C89373j9559k7607j5217J1875K9752j6018k4123k3204R573Q284l273k1932
$$ 389373 369814 342207 326990 338865 368617 352599 328476 305272 314845 323129 319856 297924
7759B97924j8264Q94j2163J3896R066j2977K921J1134j4592l3652k0572j8995
$$ 297924 279660 280554 268391 282287 291353 278376 281297 292431 277839 244187 223615 204620
7747B04620L29j2359K730M415m703k6689k1111K527K9948K4107k7263j1876l980
$$ 204620 204949 192590 195320 199735 195032 168343 147232 149759 179707 203814 176551 164675 160695
7734A60695K2877q582p96P084p767q06L101j0811j6397j5366q001j798k624P864
$$ 160695 183572 174990 174194 181278 173511 172705 175806 164995 148598 133232 125231 123433 120809 128673
7720A28673P948k6084n172K220J4875L172j367l4410K0290K9404M080J266J318
$$ 128673 136621 110537 105365 107585 122460 125632 124265 89855 110145 139549 143629 144895 146213
7707A46213j2150j9754P045P867J7698j5279j4427J4976J5123m32q742j6348J3914
$$ 146213 134063 114309 121354 129221 146919 131640 117213 132189 147312 146880 138138 121790 135704
7694A35704K4456j1900R726J8651q604J9782j2024J3630K5575j2000j2286K8341
$$ 135704 160160 148260 157986 176637 168033 187815 175791 189421 214996 202996 190710 219051
7682B19051J5950J7090J6068J4445O1987P9726N7256N7761L7033P703j6189Q636
$$ 219051 235001 252091 268159 282604 344591 424317 481573 539334 576367 584070 567881 576517
7670E76517j6084l2998O736k2242j1034K78k962J4174m887l758K4828j05k7556
$$ 576517 560433 527435 534171 511929 500895 501173 498211 512385 507498 503740 528568 528463 500907
7657E00907k7303l0510k4216j9520N4888L9989J51n833j8557p382J9811j6767
$$ 500907 473604 443094 418878 399358 454246 494235 494386 488553 469996 462614 482425 465658
7645D65658j5149J1643L2190K7680j0244L3047L4488K0256L6973Q7969J30092
$$ 465658 450509 462152 494342 522022 511778 544825 579313 599569 636542 724511 854603
7634H54603J72071J97901J95556J18224Q164o3566r9051j18527j70329j61161
$$ 854603 1026674 1224575 1420131 1538355 1546519 1482953 1383902 1265375 1095046 933885
7624I33885j00479o5953o6997o3418m0638o2964m0037j9947j2136j5056l138L576
$$ 933885 833406 767453 700456 637038 596400 533436 493399 473452 461316 446260 443122 446698
7612D46698k1458j840q583k473j5751j5879o107O726K27K539J4628k4585J5869
$$ 446698 425240 423400 414817 412344 396593 380714 374607 381333 381560 384099 398727 374142 390011
7599C90011M127j7068j856K8773o840k348J8751K3089M6442O1108N3034K7214
$$ 390011 394138 377070 375214 403987 397147 394799 413550 436639 483081 544189 597223 624437
7587F24437L8852J2181P06k4870j2598m2355p2875m7378l3297l1781l1570m0201
$$ 624437 663289 675470 676176 651306 638708 596353 523478 476100 442803 411022 379452 339251
7575C39251j6522j7743m222j0791k2330l4502q405P638J3273q213m2471k2579
$$ 339251 322729 304986 300764 289973 267643 233141 224736 232374 245647 237434 194963 172384
7563A72384j3722J2606J9496k1974k8797k0541j6830o331k538J328K1534m684
$$ 172384 158662 171268 190764 168790 139993 119452 102622 96291 93753 95081 116615 111931
7551A11931j988K5259K0739k3202k9745O738J3944O528l255J2267j5108r814j4612
$$ 111931 109943 135202 155941 132739 102994 109732 123676 130204 126949 139216 124108 114294 99682
7538I9682j5122J5991n54r945j2000l439K4836K1044j2231j3753j7502J996M15
$$ 99682 84560 100551 99997 90052 78052 74613 99449 120493 108262 94509 77007 79003 79418
7525G9418k7770l253K898N820O198k3030r956r209J8026k8257p82J5056J3190
$$ 79418 51648 48395 51293 57113 63311 40281 30325 21116 39142 10885 10103 25159 38349
7512C8349j2057L888j2793K0376j0304m007j2165J216K559j4715M811l6907k2344
$$ 38349 26292 30180 17387 37763 27459 23452 11287 12503 15062 347 5158 -31749 -54093
7499e4093L7578K4513j028j2650J3092L3117L044M538j377K262K3284M205k1203
$$ -54093 -16515 7998 6970 -5680 7412 40529 43573 48111 46734 48996 72280 76485 55282
7486E5282j989k308n648n542j0346J1294K0527l861k7813J4135j1416k3481R152
$$ 55282 53293 50985 45337 39795 29449 40743 61270 57409 29596 43731 32315 8834 17986
7473A7986K2865n775J438k0623N102K003j26N534R228j5195j8644k645O566j6124
$$ 17986 40851 35076 36514 15891 20993 22996 22870 28404 37632 22437 3793 1148 7714 -8410
7459h410N072J3831K1920N755q513M157J3317O948q354k0593j2442J8816j7331
$$ -8410 -3338 10493 32413 38168 29655 33812 47129 54077 45723 25130 12688 31504 14173
7446A4173M335j5829p83K4518M58j1778k435r178j590j2753L2286L3282l881j6748
$$ 14173 18508 2679 1896 26414 26872 15094 12659 3481 1891 -10862 21424 54706 50825 34077
7432C4077L315k0110k2016N775l43M319J2293R389J311k2965j2252J4753L435
$$ 34077 37392 17282 -4734 1041 698 5017 17310 26699 28010 5045 -7207 7546 10981
7419A0981n972L126k8161j675M469K8056M1208J777j026j364Q384j494l6598p861
$$ 10981 5009 8135 -20026 -21701 -17232 10824 52032 53809 52783 51419 59803 58309 21711 13850
7405A3850R472m113j469K4529k0230m507l1772j92L259n973j2004L561J7404j6777
$$ 13850 23322 19209 17740 42269 22039 17532 -14240 -14432 -11173 -17146 -29150 -25589 -8185 -24962
7391b4962J5677R525Q574k299j6722m993K3099k9889O572N608J1119J7624k1480
$$ -24962 -9285 240 8814 6515 -10207 -15200 7899 -21990 -15418 -9810 1309 18933 -2547
7378b547k1462j5694J0769O449M253p300J0717R899M0574j5160L706K15j8622
$$ -2547 -24009 -39703 -28934 -22485 -18232 -25532 -14815 -4916 35658 20498 24204 24419 5797
7365E797j5841k8334k120J1521p151q710J4128r914N651K3883J8255M929k7478
$$ 5797 -10044 -38378 -40498 -28977 -36128 -44838 -30710 -40624 -34973 -11090 7165 12094 -15384
7352a5384n3366K7493L1003r132J453J3694r980k4391R478L6715j6193p495J5046
$$ -15384 -68750 -41257 -10254 -19386 -17933 -4239 -14219 -38610 -29132 7583 -8610 -16105 -1059
7339a059j0085J92Q583L497N488Q402O603l875O099N772o743m9603k5381l507
$$ -1059 -11144 -10952 -2369 1128 6616 15018 21621 17746 23845 29617 22874 -26729 -52110 -55617
7325e5617J5628R152J2180L4897p147k4534j6464j6541J3828p422k0386J1301
$$ -55617 -39989 -30837 -18657 16240 9093 -15441 -31905 -48446 -34618 -42040 -62426 -51125
7313e1125J2794j881J2115K1616K0686M513K479m135L424m787K508k1256l2311
$$ -51125 -38331 -40212 -28097 -6481 14205 18718 21197 17062 20486 15699 18207 -3049 -35360
7300c5360q337J1030R777K9414J4794R643J190j7598j2243j8959l0102J96k178
$$ -35360 -43697 -32667 -22890 6524 21318 30961 32151 14553 2310 -16649 -46751 -46555 -48733
7287d8733j4511L379O407P956M172J0407J0362Q406N450J8855J6832j4375q891
$$ -48733 -63244 -59865 -53458 -45502 -41330 -30923 -20561 -12155 -6705 12150 28982 14607 5716
7274E716J0037K7176j3475J253n853l2006q398j4499P061j6553j127K1219Q37
$$ 5716 15753 42929 29454 30707 24854 -7152 -15550 -30049 -22988 -39541 -40668 -19449 -18612
7261a8612l2J385O2r583J4468m730J5770M0510q505k1575J6615K4413l2934k2012
$$ -18612 -18644 -17259 -17197 -26780 -12312 -17042 -1272 39238 30733 9158 25773 50186 17252 -4760
7247d760k9490k43K1545K1539J8726j4512k863k6847m492K2439j2691Q844N748
$$ -4760 -34250 -34493 -12948 8591 27317 12805 9942 -16905 -21397 1042 -11649 -2805 2943
7234B943J5258k5911j3443m407r277K0545K9068N978J4717M835j7773j6202m979
$$ 2943 18201 -7710 -21153 -25560 -34837 -14292 14776 20754 35471 40306 22533 6331 1352
7221A352j7667N517n421r82k0762J0273R930n053l6698K5785Q471n826J075K3367
$$ 1352 -16315 -10798 -16219 -17201 -37963 -27690 -17760 -22813 -59511 -33726 -25255 -31081 -30006 -6639
7207f639j4936p488r396k2737m420L3454L9482L687j5162R447j3054J1959n039
$$ -6639 -21575 -29063 -38459 -61196 -65616 -32162 7320 11007 -4155 5292 -7762 4197 -842
7194h42N924K66k246j7524j4597J33J0386k438j5370K5834J067M396J1479N822
$$ -842 5082 5348 3102 -14422 -29019 -28886 -18500 -20938 -36308 -10474 -9407 -5011 6468 12290
7180A2290k0023K0053Q094l6790m091J7565N086k0564l133k736k4455J5106M709
$$ 12290 -7733 12320 20414 -16376 -20467 -2902 2184 -18380 -21513 -24249 -48704 -33598 -28889
7167b8889L16O310j2480Q645j2191o682j1926j1082m120J4630l27k1128P401J6127
$$ -28889 -28573 -22263 -34743 -26098 -38289 -44971 -56897 -67979 -72099 -57469 -57796 -78924 -71523 -55396
7153e5396K2104k69J0940J1883L0433R248k1688j3793k7752O224J5867Q541J52
$$ -55396 -33292 -33561 -22621 -10738 19695 28943 7255 -6538 -34290 -28066 -12199 -3658 -3506
7140c506k6743L730o402M170P911J1205J428o58k3343M888k523K068k771j8808
$$ -3506 -30249 -26519 -32921 -28751 -20840 -9635 -8207 -8865 -32208 -27320 -29843 -27775 -30546 -49354
7126d9354K5159M328j247K017j1204j1958L378q807o30k11K41J0126o941J1247
$$ -49354 -24195 -19867 -21114 -19097 -30301 -42259 -38881 -47688 -48318 -48529 -48288 -38162 -45103 -33856
7112c3856J3277n613j6047l289q064k7265j3531N214m75Q445K4106N634J5023
$$ -33856 -20579 -26192 -42239 -45528 -53592 -80857 -94388 -89174 -89649 -81204 -57098 -51464 -36441
7099c6441O350q199J8894M704N390M896l283m4032k3354o87J1294J1099R237P467
$$ -36441 -30091 -38290 -19396 -14692 -9302 -4406 -7689 -51721 -75075 -75762 -64468 -53369 -44132 -36665
7085c6665j204j604j3924J631J5073k1086j3512K7572K1748J4635L438Q095j1648
$$ -36665 -37869 -39473 -53397 -51766 -36693 -57779 -71291 -43719 -21971 -7336 -3898 4197 -7451
7072g451K7936K199k5010j1014N636J9100P911L210k0824k0649q008j2358l4494
$$ -7451 20485 22684 -2326 -13340 -7704 11396 19307 22517 1693 -18956 -26964 -39322 -73816
7059g3816q497J1810K2588J0301l494J1309m261m433L004M62l519K5223P404j6547
$$ -73816 -82313 -70503 -47915 -37614 -41108 -29799 -34060 -38493 -35489 -35027 -38546 -13323 -5919 -22466
7045b2466j6780J9172J7627Q318j9841m631L061j1539J3035M811N36P018K1002
$$ -22466 -39246 -20074 -2447 5871 -13970 -18601 -15540 -27079 -14044 -9233 -8697 -1679 19323
7032A9323O077j5037l8139k0608K1459k417P19K3238p345J4601k183j778o265
$$ 19323 25400 10363 -27776 -48384 -26925 -29342 -28623 -5385 -12730 1871 -312 -2090 -8355
7019h355O677j4280j4389N674o23J8346J6063l5036p315O818J5928r022k8917
$$ -8355 -1678 -15958 -30347 -24673 -25296 -6950 9113 -25923 -33238 -26420 -10492 -19514 -48431
7006d8431n56K1063J1320j7896n537j34N7K2713J9508K7482j4097l766L743N68
$$ -48431 -48987 -27924 -16604 -34500 -40037 -40171 -40114 -17401 2107 29589 15492 11726 15469 16037
6992A6037j2411k6787j1329J5081R795j6074j0020m127J0197J2540M19j18j7234
$$ 16037 3626 -23161 -34490 -19409 -9614 -25688 -35708 -39835 -29638 -17098 -16679 -16797 -34031
6979c4031L424J4108J9812j0015k6926n35K8984j982J3920J1009Q142l2295j3378
$$ -34031 -30607 -16499 3313 -6702 -33628 -34163 -5179 -7161 6759 17768 25910 -6385 -19763
6966a9763k573j259J6914J3089j1909l3309n322l077j9224R919J3594L6564J9075
$$ -19763 -22336 -23595 -6681 6408 -5501 -38810 -44132 -47209 -66433 -56514 -42920 -6356 12719
6953A2719J4299m9395l3741L652N011J4388j976K4984j635j1507L763m661J3689
$$ 12719 27018 -22377 -56118 -52466 -47455 -33067 -35043 -10059 -11694 -23201 -19438 -24099 -10410
6940a0410L2350k5592k4500q72k3982l5661R496Q186M0381K6916J0857k257K955
$$ -10410 21940 -3652 -28152 -29024 -53006 -88667 -79171 -70985 -30604 -3688 7169 4912 7867
6927G867o49l25j8419l4806j0223M845L1470J3653m064k1489l0458J5190J9757
$$ 7867 7218 6893 -11526 -46332 -56555 -51710 -20240 -6587 -10651 -32140 -62598 -47408 -27651
6914b7651Q568P22r569L319k1189L2553K0297J168K946r286J495K2953p147j9991
$$ -27651 -19083 -18361 -27930 -24611 -45800 -13247 7050 8218 11164 1878 3373 26326 19179 -812
6900h12k8496m826k396P200j6632p256J7986j966L880M1724q684k88K823p097
$$ -812 -29308 -34134 -36530 -29330 -45962 -53218 -35232 -37198 -33318 8406 -278 -566 2257 -4840
6886d840m657J1723k8974N995Q141N064l262k3445j4113k4017L148J3846r236
$$ -4840 -9497 2226 -26748 -20753 -12612 -7548 -10810 -34255 -48368 -72385 -69237 -55391 -64627
6873f4627K7927K4448o513p282Q921J5428l042K2575J5534K2196k7580j0336K637
$$ -64627 -36700 -12252 -18765 -26047 -17126 -1698 -4740 17835 33369 55565 27985 17649 20286
6860B0286k7913k383q314r195M80J3201Q762K739J123j1162J2907M934k708k0085
$$ 20286 -7627 -10010 -18324 -27519 -27039 -13838 -5076 -2337 -1214 -12376 531 5465 2757 -17328
6846a7328k4413Q821K0554J6810n762j3903k4604p481j1990M068J2822K2373J2295
$$ -17328 -41741 -32920 -12366 4444 -1318 -15221 -39825 -47306 -59296 -55228 -42406 -20033 -7738
6833g738j7908N330J0779J7467O587k0487n484R12j856l419m773K0459J7093k6136
$$ -7738 -25646 -20316 -9537 7930 14517 -5970 -11454 -10542 -12398 -15817 -20590 -131 16962 -9174
6819i174k1347Q156K2747k4448j7433K9638K7732J5608p330j8589k2159M555R590
$$ -9174 -30521 -22365 382 -24066 -41499 -11861 15871 31479 24149 5560 -16599 -12044 -2454
6806b454J960j9835j3959j8520j0393J266N397n195j0738J3313L019K3872N472
$$ -2454 -494 -20329 -34288 -52808 -63201 -61935 -56538 -61733 -72471 -59158 -56139 -32267 -26795
6793b6795r194K30R384Q937j8846j373K6534J5502m4901O450J9759K8371J731
$$ -26795 -35989 -35759 -26375 -17438 -36284 -37657 -11123 4379 -40522 -34072 -14313 14058 15789
6780A5789j1869M242n109k0556k0294J2933L3466m24P451J5957K846k0176n0390
$$ 15789 3920 8162 3053 -17503 -37797 -24864 8602 8178 15629 31586 34432 14256 -36134
6767c6134J1438L620k829P530N0162L5614k7685j3206M48j3788n994j2019O447
$$ -36134 -24696 -21076 -23905 -16375 33787 69401 41716 28510 28958 15170 9176 -2843 3604
6754C604J0490k2892k0540R402K841r000J981J2892R112n539k7034J2852j1767
$$ 3604 14094 -8798 -29338 -19936 -17095 -26095 -24114 -11222 -2110 -7649 -34683 -21831 -33598
6741c3598r490J3618K5442J8523m625j1865j184p825P284m561R24J1168M707j6572
$$ -33598 -43088 -29470 -4028 14495 9870 -1995 -3179 -11004 -3720 -8281 -7357 3811 8518 -8054
6727h054j6858P374K0650j9838j7492j3103j4239K4892R848K2265r974n137k1630
$$ -8054 -24912 -17538 3112 -16726 -34218 -47321 -61560 -36668 -26820 -4555 -14529 -19666 -41296
6714d1296J5501m843j099n358J5487Q502Q06j3584j2085J4042K0337o592m726
$$ -41296 -25795 -30638 -31737 -37095 -21608 -13106 -12300 -25884 -37969 -23927 -3590 -10182 -14908
6701a4908K8290j1618j4586j0434j812j0346P411K7461K1261j1545j547j9972
$$ -14908 13382 1764 -12822 -23256 -25068 -35414 -28003 -542 20719 9174 7627 -12345
6689a2345n540L336k963Q042J5405J7950m709k3565j2022j5994j1181R75J3681
$$ -12345 -17885 -14549 -17512 -9470 5935 23885 19176 -4389 -16411 -32405 -43586 -42611 -28930
6676b8930J6439K4826j1872m8187l1086M183K0367L0186J5099l439l0682r027
$$ -28930 -12491 12335 463 -47724 -78810 -74627 -54260 -24074 -8975 -12414 -43096 -52123
6664e2123L8025k204P345k9003k7079P864n253j1983o208J7751K9078J1170k8916
$$ -52123 -14098 -16302 -8957 -37960 -65039 -57175 -62428 -74411 -80619 -62868 -33790 -22620 -51536
6651e1536M860J4424K2611L8002L624J0498m354l2938j3830j8722k16K3019k1840
$$ -51536 -46676 -32252 -9641 28361 31985 42483 38129 5191 -8639 -27361 -27577 -4558 -26398
6638b6398j6251j6125J2165K2103n968p249j2300L103L96J4209J8962K3828q368
$$ -26398 -42649 -58774 -46609 -24506 -30474 -37723 -50023 -46920 -46524 -32315 -13353 10475 2107
6625B107j6787J3856J0086K986O326k6307P86J6142j0605M34Q793J0538j7756
$$ 2107 -14680 -824 9262 12248 18574 -7733 -6947 9195 -1410 -976 7817 18355 599
6612E99N822J0617j0606j1986o296j8091N051J4363J2559M535M105J3292j9098
$$ 599 6421 17038 6432 -5554 -11850 -29941 -24890 -10527 2032 6567 10672 23964 4866
6599D866j5142j0924j639K725J9965j486l3988O052J9543K7829J5886r877o666
$$ 4866 -10276 -21200 -22839 -20114 -149 -1635 -35623 -29571 -10028 17801 33687 23810 17144
6586A7144l7725j0103J6646J5126J9654m796l1477o424J3415j7352J720O004n237
$$ 17144 -20581 -30684 -14038 1088 20742 15946 -15531 -21955 -8540 -25892 -24172 -18168 -23405
6573b3405l507J1200R85J2106q37j4382j438j813M596K9640r163l3543J1848L406
$$ -23405 -26912 -15712 -14727 -2621 -3458 -17840 -19278 -21091 -16495 13145 3982 -29561 -17713 -14307
6559a4307j077J183j9195k1807N400K2388J5400j9477l3438r753R893K5456j3397
$$ -14307 -15384 -14201 -33396 -55203 -49803 -27415 -12015 -31492 -64930 -74683 -64790 -39334 -52731
6546e2731J1154O704n057j6216j1403J0765K2544J6526J0827Q228M719j670q944
$$ -52731 -41577 -34873 -39930 -56146 -67549 -56784 -34240 -17714 -6887 1341 6060 4390 -4554
6533d554j041k030n942j4513k0305J3155L8437J4377J0459k6194o879j0047j837
$$ -4554 -5595 -7625 -13567 -28080 -48385 -35230 3207 17584 28043 1849 -5030 -15077 -16914
6520a6914j5426j4172N878L3113O401j9093r903L0250O953J0554q265j5034p587
$$ -16914 -32340 -46512 -40634 -7521 -1120 -20213 -30116 134 7087 17641 9376 -5658 -13245
6507a3245j1540R459p569J0020K023R175J830j5395M663J4729p491R669m253K1612
$$ -13245 -24785 -15326 -22895 -12875 -10852 -1677 153 -15242 -10579 4150 -3341 6328 2075 23687
6493B3687J1346K012m3853m1441n014N536J3859J4732Q382m105J7264J4718l172
$$ 23687 35033 37045 -6808 -48249 -53263 -47727 -33868 -19136 -10754 -14859 2405 17123 13951
6480A3951l9019j6691q940K6438p158k8853m846J8233J8912P31K8832J8336M537
$$ 13951 -25068 -41759 -50699 -24261 -31419 -60272 -65118 -46885 -27973 -27242 1590 19926 24463
6467B4463n83J0379J0710k249k5978k3490l1963n195Q776L4190J3675l1932P61
$$ 24463 23880 34259 44969 42720 16742 -6748 -38711 -43906 -35130 -940 12735 -19197 -18436
6454a8436L1932j089j8315j9276N098K5975p917k4073p274L148J3394j3867k492
$$ -18436 13496 12407 -5908 -25184 -20086 5889 -2028 -26101 -33375 -30227 -16833 -30700 -33192
6441c3192K3381R991J4554K710k1647o642J5493K2012R882l1936l7409R402J037
$$ -33192 -9811 180 14734 17444 -4203 -10845 4648 26660 36542 4606 -32803 -23401 -22364
6428b2364j851J6924O563L6288K5623j6827m1175k9251m376P564R660j5976l410
$$ -22364 -24215 -7291 -728 35560 61183 44356 3181 -26070 -30446 -22882 -13222 -29198 -32608
6415c2608n110j015K9984L6001M068l010k2888J277K0195r301l1209p913J2069
$$ -32608 -37718 -38733 -8749 27252 31320 28310 5422 6699 26894 17593 -13616 -21529 -9460
6402i460r43q894q647l495j8449P435M2293O185o515j5489L744n694Q139o734
$$ -9460 -10403 -19297 -27944 -31439 -49888 -42453 -160 6025 -490 -15979 -12235 -17929 -9790 -16524
6388a6524m903N728M735p5n838l47J419K3943r398L767j5591O945J0593j100J8650
$$ -16524 -21427 -15699 -10964 -11039 -16877 -17224 -15805 8138 -1260 2507 -13084 -6139 4454 3354 22004
6373B2004l750l779p994J0650j6661o694l9276n082R844q528j3253J1036L9273
$$ 22004 18254 14475 6481 17131 470 -6224 -45500 -50582 -40738 -49266 -62519 -51483 -12210
6360a2210j2845j3405J77K64k4513J5461J6435l975j5897J1698m212L010J4227
$$ -12210 -25055 -38460 -38283 -38019 -62532 -47071 -30636 -34611 -50508 -38810 -43022 -40012 -25785
6347b5785J0268m940l329L2569K4244o860l6112k2272j6483N73K5282K3488n959
$$ -25785 -15517 -20457 -23786 8783 33027 26167 -9945 -32217 -48700 -48127 -22845 643 -5316
6334e316o013M372N297m02j7010n401Q285R753m120q550q134K2347q574j8351
$$ -5316 -11329 -6957 -1660 -2062 -19072 -24473 -16188 -6435 -10555 -19105 -27239 -4892 -13466 -31817
6320c1817k465j3780n84Q70J4472P038J6404j1601k8930q201O952j2535p513O757
$$ -31817 -34282 -48062 -48646 -47776 -33304 -26266 -9862 -21463 -50393 -58594 -51642 -64177 -71690 -64933
6306f4933K4184L7863j3296j7719q574L141K8723K6049j7079j5491p545k37j3671
$$ -64933 -40749 -2886 -16182 -33901 -42475 -39334 -10611 15438 -1641 -17132 -24677 -24914 -38585
6293c8585k0078M2399J622j5911J5688J9068j2784j1361J2239p215N572K705k9983
$$ -38585 -58663 -16264 -14642 -30553 -14865 4203 -8581 -19942 -7703 -14918 -9346 -6641 -36624
6280c6624J7735J1606k8074j6895J4220J7555j2306K3754J0837j3827j8660j5595
$$ -36624 -18889 -7283 -35357 -52252 -38032 -20477 -32783 -9029 1808 -12019 -30679 -46274
6268d6274n762K3624J5082m31K7271J4360R188j4180j2809o197p429k0833j0536
$$ -46274 -52036 -28412 -13330 -13761 13510 27870 37058 22878 10069 3872 -3557 -24390 -34926
6255c4926L388J2307J8294L7631L693o5529l4096p324J6359j0694o093J8573K6112
$$ -34926 -31538 -19231 -937 36694 40387 -25142 -59238 -66562 -50203 -60897 -66990 -48417 -22305
6242b2305k893K5783J3418R093j5494k930J7833l484j3726l0815j1944R93R001
$$ -22305 -25198 585 14003 23096 7602 4672 22505 19021 5295 -25520 -37464 -36471 -27470
6229b7470m230M676J8794R841K1721q771J7642K7473k4905l2150j5814o27J8602
$$ -27470 -31700 -27024 -8230 1611 23332 14561 32203 59676 34771 2621 -13193 -13820 4782
6216D782O098k0400J4005R230j4412l1703k2269J7923K8331J7908l569r726p563
$$ 4782 10880 -9520 4485 13715 -697 -32400 -54669 -36746 -8415 9493 5924 -3802 -11365
6203a1365j1745O756l9881k6884L1171K9194M55J168l291m998r483J592J7960
$$ -11365 -23110 -16354 -56235 -83119 -51948 -22754 -22299 -21131 -24422 -29420 -38903 -37311 -19351
6190a9351o980j9505K1469K7497l020k638K0670R177m1809j5495O051N0925j780
$$ -19351 -26331 -45836 -24367 3130 110 -2528 18142 27319 -14490 -29985 -23934 26991 25211
6177B5211k5209k2142K1587O400k0944J90Q898K3719K220j7737R71L473j1707
$$ 25211 2 -22140 -553 5847 -15097 -14907 -6009 17710 19930 2193 3164 6637 -5070
6164e070l1316O332O660R836J515r27k119k9008j0381R299K4159L4947K1109p545
$$ -5070 -36386 -30054 -23394 -13558 -12043 -12970 -15089 -44097 -54478 -45179 -21020 13927 35036 27491
6150B7491m1773R932J1174R210k2874l611M471O44k653M810K305j9103l2235J4760
$$ 27491 -14282 -4350 6824 16034 -6840 -10451 -5980 -5336 -7989 -3179 -874 -19977 -52212 -37452
6136c7452J1340l645N672K2620R562k5612n264j6017j1896N783J3678J2645Q140
$$ -37452 -26112 -29757 -24085 -1465 8097 -17515 -22779 -38796 -50692 -44909 -31231 -18586 -10446
6123a0446k3507l7710l495J3921K3816M971J2884L270J241J1203O68j1661j0224
$$ -10446 -33953 -71663 -75158 -61237 -37421 -32450 -19566 -16296 -15055 -3852 -3184 -14845 -25069
6110b5069j0727J4007j3741q063M640J8482J9455K1841k5006j6766k3124m929
$$ -25069 -35796 -21789 -35530 -43593 -38953 -20471 -1016 20825 -4181 -20947 -44071 -49000
6098d9000L544J3537K0152J237j4437j561K338K204J9825K04j8354j5587J0511
$$ -49000 -45456 -31919 -11767 -10530 -24967 -26528 -24190 -21986 -2161 -1957 -20311 -35898 -25387
6085b5387P661P428P576r722j625L37j5272m535j2732O062J5616M366n346R573
$$ -25387 -17726 -10298 -2722 -12444 -14069 -13732 -29004 -33539 -46271 -40209 -24593 -20227 -25573 -16000
6071a6000K0334K2320J0104Q771k5419k2344k6722o640R37M585J4621J3910J3128
$$ -16000 4334 26654 36758 45529 20110 -2234 -28956 -35596 -34659 -30074 -15453 -1543 11585
6058A1585j852N647K6676j5708J85j5824p899Q984J322m1722Q024J2628k5620
$$ 11585 9733 15380 42056 26348 26533 10709 2810 11794 13116 -28606 -20582 -7954 -33574
6045c3574n497L4043P896O442J465j4485j6712J4027P085p850k4305r30J4309
$$ -33574 -39071 -5028 2868 9310 10775 -3710 -20422 -6395 690 -7160 -31465 -32395 -18086
6032a8086K2541M664m123l082N600j368k6754j4934R67R364K4415r077j2914P787
$$ -18086 4455 9119 4996 1914 7514 6146 -20608 -35542 -34575 -25211 -796 -9873 -22787 -15000
6018a5000r68n599j2333q672J9120K2556l604M415n459j2692j2787J8507J0215
$$ -15000 -15968 -21567 -33900 -42572 -23452 -896 -4500 -85 -5544 -18236 -31023 -12516 -2301
6005b301J5492K3597N515k4231j0718j6287j4351N542J1721m0R312l825R396o400
$$ -2301 13191 36788 42303 18072 7354 -8933 -23284 -17742 -6021 -6061 3251 -574 8822 2422
5991B422j2952N716M755K206J3788l7693j0559M904J627n874o882K7261N123Q3
$$ 2422 -10530 -4814 -59 2147 15935 -21758 -32317 -27413 -25786 -31660 -38542 -11281 -6158 -6075
5977f075N177j6664q071j0360r906j3556j9280K6847K5693n156Q924M0118J9626
$$ -6075 -898 -17562 -25633 -35993 -45899 -59455 -78735 -51888 -26195 -31351 -22427 17691 37317
5964C7317j999j6237l982J9656M086p976j3001o242l3213l349j0488j1657J2648
$$ 37317 35318 19081 15099 34755 38841 30865 17864 11622 -21591 -24940 -35428 -47085 -34437
5951c4437J1668l849j1198L794K1989O952k1680j61m300r321n349J4613J0487
$$ -34437 -22769 -26618 -37816 -34022 -12033 -5081 -26761 -26922 -31222 -40543 -45892 -31279 -20792
5938b0792o841l4642k5018K6384L0740K113J1546J6868m281R459j2977k6246J9328
$$ -20792 -27633 -62275 -87293 -60909 -30169 -28056 -16510 358 -3923 5536 -7441 -33687 -14359
5925a4359J2960q92N108p238n675j1919J1770O894N625l9611p107J1411J3417
$$ -14359 -1399 -2291 2817 -4421 -10096 -22015 -10245 -3351 2274 -37337 -44444 -33033 -19616
5912a9616O051L520j5478J0271J5864R890j2623k4047j2115K2664L3773J2963
$$ -19616 -13565 -10045 -25523 -15252 612 10502 -2121 -26168 -38283 -15619 18154 31117
5900C1117j943j6314k0937j3301L7891K2729J9040k1292r478n878k2049L243l1780
$$ 31117 29174 12860 -8077 -21378 16513 39242 58282 36990 27512 21634 -415 2828 -28952
5887b8952j4080J8926N303q317N608K4167j1905l710O96j2536j796j4664j344
$$ -28952 -43032 -24106 -18803 -27120 -21512 2655 -9250 -12960 -12264 -24800 -26596 -41260 -42604
5874d2604J8929J3043R385K504k038j3355k0201R242L1012Q158j9819J4801K0056
$$ -42604 -23675 -10632 -1247 1257 -781 -14136 -34337 -25095 5917 14075 -5744 9057 29113
5861B9113k4826l4845J2330J3378m410P079J1279J7329k9570o624j4986k436J5290
$$ 29113 4287 -30558 -18228 -4850 -9260 -2181 9098 26427 -3143 -9767 -24753 -27189 -11899
5848a1899q823J8125P727j746j1979J4757j4143l4365R05Q27J3689K0614J2606
$$ -11899 -20722 -2597 5130 3384 -8595 6162 -7981 -42346 -41441 -40614 -26925 -6311 6295
5835F295j2977k7808M80j5245j3854o161M486K9613N6504r164j7231p750j6910
$$ 6295 -6682 -34490 -34010 -49255 -63109 -69270 -64784 -35171 21333 12169 -5062 -12812 -29722
5822b9722p723J8630j264N337k5416l298L903J8224o92J3192l675n838K0841K0975
$$ -29722 -37445 -18815 -20079 -14742 -40158 -43456 -39553 -21329 -22021 -8829 -12504 -18342 2499 23474
5808B3474k3516l5437P561K0905O241N970J9431J1870N967M947k3596j33r250
$$ 23474 -42 -35479 -27918 -7013 -772 5198 24629 36499 42466 47413 23817 23684 14434
5795A4434k6891R689K8555N140J7415K937l4465j91K3491k0835k7351j2354L0519
$$ 14434 -12457 -2768 25787 30927 48342 51279 16814 16623 40114 19279 -8072 -20426 10093
5782A0093L0679J7569j2083q262M609q429k2932O288M891j3378j3712N936j5306
$$ 10093 40772 58341 46258 37996 42605 34176 11244 17532 22423 9045 -4667 1269 -14037
5769a4037O966j392j6568n63L0429K9176R374j1013k8205j749K4769r160j7775
$$ -14037 -7071 -8463 -25031 -25594 4835 34011 43385 32372 4167 2418 27187 18027 252
5756B52k016R272j3383p325K71j9881K0672j5107j8179P201K0049J7596J3330
$$ 252 -1764 7508 -5875 -13200 -12929 -32810 -12138 -27245 -45424 -38223 -18174 -578 12752
5743A2752l5545l9865L098K2575J6776p506j1584O639R792R052n357m0486j4607
$$ 12752 -22793 -62658 -59560 -36985 -20209 -27715 -39299 -32660 -22868 -13816 -19173 -59659 -74266
5730g4266J2107J5734M657j2637q075K3178L2365M117l2104k2059L0694L7450
$$ -74266 -62159 -46425 -41768 -54405 -62480 -39302 -6937 -2820 -34924 -56983 -26289 11161
5718A1161k052o848k2677l0874J887J0975l855k3281J1063K2108K7167m175Q505
$$ 11161 9109 2261 -20416 -51290 -49403 -38428 -42283 -65564 -54501 -32393 -5226 -9401 -896
5705h96M561M586n077j7879k2628j0927M928j2447j3136P667K0454K475K0249
$$ -896 3665 8251 3174 -14705 -37333 -48260 -43332 -55779 -68915 -61248 -40794 -38319 -18070
5692a8070J7267K7595j5037k5187O635m414j9624l052j4982j4123P417R435K6689
$$ -18070 -803 26792 11755 -13432 -6797 -11211 -30835 -33887 -48869 -62992 -55575 -46140 -19451
5679a9451Q391l28k5792j3141L1819K5702r114N700P921J4847j1315K3914Q004
$$ -19451 -11060 -11388 -37180 -50321 -18502 7200 -1914 3786 11707 26554 15239 39153 47157
5666D7157l114j4236l7066R92k0558j1443n230J3916L0502j64j3743K751l425
$$ 47157 44043 29807 -7259 -6267 -26825 -38268 -43498 -29582 920 756 -12987 -10236 -13661
5653a3661r647P417K7147L9064q799k3270l9891m424N955L2769J5705k0929k3722
$$ -13661 -23308 -15891 11256 50320 41521 18251 -21640 -26064 -20109 12660 28365 7436 -16286
5640a6286j9418O220l360k431J610N283J4913K0608J4484l240j4837j7659j6533
$$ -16286 -35704 -29484 -32844 -35275 -33665 -28382 -13469 7139 21623 18383 3546 -14113 -30646
5627c0646K399R259j1800K2310J0891j8082J0767q059J3141K1785q82l1653k549
$$ -30646 -28247 -18988 -30788 -8478 2413 -15669 -4902 -12961 180 21965 21083 -10570 -13119
5614a3119J0757j7568R314k8217N306K2854J2430l6877k0091K5397O465j0603
$$ -13119 -2362 -19930 -10616 -38833 -33527 -10673 1757 -35120 -55211 -29814 -23349 -33952
5602c3952j4215M40Q983j3130M590K9870J3757j4477K135K7950p389j237J4589
$$ -33952 -48167 -47727 -38744 -51874 -47284 -17414 -3657 -18134 -15999 11951 4562 3325 17914
5589A7914K9904j35l9042m757K5709J1449j1731l2540k799n74J2410j3580Q19
$$ 17914 47818 47683 8641 3884 29593 41042 29311 -3229 -6028 -6602 5808 -7772 -6953
5576f953k9281J1401L046J8988N5787q675m4528j5510m3072J3315J8652K8554
$$ -6953 -36234 -24833 -21787 -2799 52988 44313 -215 -15725 -58797 -45482 -26830 1724
5564A724P303q074j8985K1751L264k637J2369p41j9944l306L942l26J524j8129
$$ 1724 9027 953 -18032 3719 6983 4346 16715 15974 -3970 -7276 -3334 -3660 -2136 -20265
5550b0265l723q442r053P216J6762L9310l771j0502Q637k1298r53O232K7751J2474
$$ -20265 -23988 -32430 -41483 -34267 -17505 21805 18034 7532 16169 -5129 -6082 150 27901 40375
5536D0375J852j6402j3980j2061j3852J2694O921Q839J0416J6560j0764l3414
$$ 40375 42227 25825 11845 -216 -14068 -1374 5547 14386 24802 41362 30598 -2816
5524b816J2924J8326j3317j819J0475k8037k8981j3496J5381N366K5574J7889
$$ -2816 10108 28434 15117 13298 23773 -4264 -33245 -46741 -31360 -25994 -420 17469
5512A7469j9278l3716J4013K5243M008O38q469j0961j6793O964J8041j2217j5349
$$ 17469 -1809 -35525 -21512 3731 7739 8377 -92 -11053 -27846 -20882 -2841 -15058 -30407
5499c0407l0410R460Q23j0921J9173K0177K948k0460j5579O489K2963K0841L8979
$$ -30407 -60817 -51357 -50534 -61455 -42282 -22105 -19157 -39617 -55196 -48707 -25744 -4903 34076
5486C4076o760j8907k8499J1511J2083o020K1544P492m570k7272k0139P710O878
$$ 34076 27316 8409 -20090 -8579 3504 -2516 19028 26520 21950 -5322 -25461 -17751 -10873
5473a0873q269m061M619J8234k4208k182L01k9127j2550J7445N278M661K3405
$$ -10873 -19142 -23203 -18584 -350 -24558 -26740 -26439 -55566 -68116 -50671 -45393 -40732 -17327
5460a7327L4200N222k6682J8102j442j4926k3967o086j7152J6124K5247J7355
$$ -17327 16873 22095 -4587 13515 12073 -2853 -26820 -32906 -50058 -33934 -8687 8668
5448H668Q756J978k4999l0144k686K1947K4570J2907O523M698R716q041J2440
$$ 8668 17424 19402 -5597 -35741 -38427 -16480 8090 20997 27520 32218 41934 33893 46333
5435D6333k0249l0550j339J5148L0043K2088m926l5675j1344J3358J0395j8047
$$ 46333 26084 -4466 -5805 9343 39386 61474 56548 20873 9529 22887 33282 15235
5423A5235Q65Q86l02l3032q859M177L830l494N274j780n595M761J6096q988k6157
$$ 15235 16100 16986 16684 -16348 -25207 -21030 -17200 -20694 -15420 -17200 -22795 -18034 -1938 -10926 -37083
5408c7083k1114N223K4674R019P213j6722J4495K9539J7303J0235J5838R150l3211
$$ -37083 -58197 -52974 -28300 -19281 -12068 -28790 -14295 15244 32547 42782 58620 67770 34559
5395C4559l2029J8481O268j4838p942k801J102l202j311o028J662j0695J5427
$$ 34559 2530 21011 27279 12441 4499 1698 2800 -402 -1713 -7741 -6079 -16774 -1347
5382a347K0938N471O233j9806k0518j538o906q642L078K2752L1849L473l629l439
$$ -1347 19591 25062 31295 11489 -9029 -10567 -17473 -26115 -23037 -285 31564 35037 31408 27969
5368B7969k5896P743Q362k3019K986M341j4097k9944k6432N343L4191L8694j1699
$$ 27969 2073 9816 18178 -4841 -1855 2486 -11611 -41555 -67987 -62644 -28453 10241 -1458
5355a458j0416O601O858O524K0921K517k528L215j6491K5466J6558o105k9862
$$ -1458 -11874 -5273 1585 8109 29030 31547 29019 32234 15743 41209 57767 51662 21800
5342B1800j2035J0623q346p282j5501J873K8445N017l698k83L528p215n114J4441
$$ 21800 9765 20388 12042 4760 -10741 -8868 19577 24594 20896 20613 24141 16926 11812 26253
5328B6253k844o957j8880O230K0935l5035j2617j7345j6554P691N094J4936R800
$$ 26253 23409 16452 -2428 3802 24737 -10298 -22915 -40260 -56814 -49123 -44029 -29093 -19293
5315a9293R991r057k0380p15J8332o8K0900J0275P592Q545L709K2862m454k2311
$$ -19293 -9302 -18359 -38739 -39454 -21122 -21190 -290 9985 17577 26122 29831 52693 48239 25928
5301B5928J1735q054l2945k2604M918J5759K5907r06J2712j803k8098J6490j84
$$ 25928 37663 29609 -3336 -25940 -21022 -5263 20644 19738 32450 30647 2549 19039 18855
5288A8855k5266k5680M092Q801K1649N576j0913M65J1101J5144p936n055L276
$$ 18855 -6411 -32091 -27999 -19198 2451 8027 -2886 -2421 8680 23824 15888 10833 14109
5275A4109j2023k792j1964R345K2906K1854q65J379j8619l8555J7721L812m7242
$$ 14109 2086 -706 -12670 -3325 19581 41435 40570 41949 23330 -15225 2496 6308 -40934
5262d0934K1088J6634m114P788P177J971K463J4328K9974J0379l8559j7776q085
$$ -40934 -19846 -3212 -7326 462 7639 9610 12073 26401 56375 66754 28195 10419 2334
5249B334J2648j7513J3378J6794R314j8890k1037o941J3054R841j9789j1872M847
$$ 2334 14982 -2531 10847 27641 36955 18065 -2972 -9913 3141 12982 -6807 -18679 -13832
5236a3832K5313Q134j7859j2462J0840J6291M030Q654Q97p327m915J0893j9927
$$ -13832 11481 19615 1756 -10706 134 16425 20455 29109 30006 22679 17764 28657 8730
5223H730k3991J4680j0425n161m712J5710N719r861J9837p3Q549m122L0904j5536
$$ 8730 -15261 -581 -11006 -16167 -20879 -5169 550 -9311 10526 10453 19002 14880 45784 30248
5209C0248l3952k048n020m780K1724k201O8l0485q147J6521J6062J3195l186r933
$$ 30248 -3704 -5752 -10772 -15552 6172 3971 4039 -26446 -34593 -18072 -2010 11185 7999 -1934
5195a934o12n773o804M812p107P908K3989j155k9046r867J0826J2887j5818j0007
$$ -1934 -2546 -8319 -15123 -10311 -17418 -9510 14479 13324 -15722 -25589 -14763 -1876 -17694 -27701
5181b7701k4884k2501K4356K0492J1457R519K0337j0449N913k1506k6640N911
$$ -27701 -52585 -75086 -50730 -30238 -18781 -9262 11075 626 6539 -14967 -41607 -35696
5169c5696J9652N382n996j8306N510J9099L431r475K2647L896j048M131J2981
$$ -35696 -16044 -10662 -16658 -34964 -29454 -10355 -6924 -16399 6248 10144 9096 13227 26208
5156B6208j4785k2871k3328o508q272J1118J8897J7782Q58j0750O129K457l420
$$ 26208 11423 -11448 -34776 -41284 -49556 -38438 -19541 -1759 -901 -11651 -5522 -3065 -6485
5143f485o005L255j151J2072l613J1820N472q307J8118J1761j1902j0587J5928
$$ -6485 -12490 -9235 -10386 1686 -1927 9893 15365 7058 25176 36937 25035 14448 30376
5130C0376K578r113l8461K128Q59O144K4609J1202j2590K901l443j2638r056k761
$$ 30376 32954 23841 -14620 -12492 -11633 -5489 19120 30322 17732 20633 17190 4552 -4504 -7265
5116g265R665j2055r11M994k0934o067L172k481N085J072k368J0840P997l295
$$ -7265 2400 -9655 -10566 -5572 -26506 -32573 -29401 -31882 -26797 -25725 -28093 -17253 -9256 -12551
5102a2551m497K3145n431k4636j1081L0470j4925k9536J4729J8105L280N783J7034
$$ -12551 -17048 6097 666 -23970 -35051 -4581 -19506 -49042 -34313 -16208 -12928 -7145 9889
5089I889j0841J7075K2445j2539p095J4868N620q033J2427Q917j5266k0779k2607
$$ 9889 -952 16123 38568 26029 18934 33802 39422 31389 43816 52733 37467 16688 -5919
5076e919k5663p707L0031J9460j7805k2016J6116l740j953l464j3355N864L0500
$$ -5919 -31582 -39289 -9258 10202 -7603 -29619 -13503 -17243 -19196 -22660 -36015 -30151 349
5063C49j853N01P782Q035p595K867j6476k588R173J9618J436O450j0631j7205
$$ 349 -1504 -1003 6779 14814 7219 10086 -6390 -8978 195 19813 21249 27699 17068 -137
5049a37M312J991o292O756J2108O668O110j7080l5738j6539j5258m943L9395K7565
$$ -137 4175 6166 -126 6630 18738 25406 31516 14436 -21302 -37841 -53099 -58042 -18647 8918
5035H918K2046j5066r5J563k4990j3761J826J1111J5433J1432O58j3012J0079
$$ 8918 30964 15898 15803 17366 -7624 -21385 -19559 -8448 6985 18417 19075 6063 16142
5022A6142j3795k2277O702Q723j081k2147k4159J0548M6567o10j5294m049O921
$$ 16142 2347 -19930 -13228 -4505 -5586 -27733 -51892 -41344 5223 4613 -10681 -14730 -7809
5009g809K1513P7P084q656K99n33j699n060j603K567K157o325j4209j2450k929
$$ -7809 13704 13781 20865 12209 12508 11975 10276 5216 3613 6180 8337 2012 -12197 -24647 -27576
4994b7576n644l72R058O81k8353P480K0117l876n550K2062N474J2504k0119j4247
$$ -27576 -33220 -33592 -24534 -23853 -52206 -44726 -24609 -28485 -34035 -11973 -6499 6005 -14114 -28361
4980b8361m438J5467J1526r068k2934j0625J0125J1054R026j0806j0930n03l916
$$ -28361 -32799 -17332 -5806 -14874 -37808 -48433 -38308 -27254 -18228 -29034 -39964 -40467 -44383
4967d4383M349J0325K9735K0331j2332j2290K2617K980n755j6394M311k9298j7761
$$ -44383 -40034 -29709 26 20357 8025 -4265 18352 21332 15577 -817 3494 -25804 -43565
4954d3565j1507M712K7225J8990p021j8143j9691R547j8138Q255K5131J6363L112
$$ -43565 -55072 -50360 -23135 -4145 -11166 -29309 -49000 -39453 -57591 -49336 -24205 -7842 -4730
4941d730L984N602m374N298K6225J3535j3903m2623k4341J2208K0187l585L149
$$ -4730 -746 4856 482 5780 32005 45540 31637 -10986 -35327 -23119 -2932 -6517 -3368
4928c368J079O185R765o32m556j120k98R599j36P66l544k1933l0132j6288r548
$$ -3368 -2289 3896 13661 13029 8473 7353 7055 16654 16518 17284 13740 -8193 -38325 -54613 -64161
4913f4161K222L8425K1051j1577K154m08J4897P587j6090r254k0247k3061j082
$$ -64161 -61939 -23514 -2463 -14040 -11886 -12294 2603 10190 -5900 -15154 -35401 -58462 -59544
4900e9544o85N058Q263O520P032n850j339K4766K5070p757j2629L3714J571l7867
$$ -59544 -60229 -55171 -46908 -40388 -33356 -39206 -40545 -15779 9291 1534 -11095 22619 24190 -13677
4886a3677J339J7105K5856J4719j7227n550K5734k4646n8294p547p29K4512j4173
$$ -13677 -12338 4767 30623 45342 28115 22565 48299 23653 -34641 -42188 -42917 -18405 -32578
4873c2578p712j2638L2995L5556o88J1996J9595j985j4335J6875k5746k8550L512
$$ -32578 -40290 -52928 -19933 15623 14935 26931 46526 44541 30206 47081 21335 -7215 -3703
4860c703M14J4317j8731K975K5096r90l867k0955p903o152J3008J3890J6170j0578
$$ -3703 -3289 11028 -7703 -4728 20368 19378 15511 -5444 -13347 -19499 -6491 7399 23569 12991
4846A2991k6140O557m993k1749P017M7880L2513l946j5615n052j0415l5273l83
$$ 12991 -13149 -6592 -11585 -33334 -26317 21563 54076 50130 34515 29463 19048 -16225 -16608
4833a6608L5666q90j4158Q429r22j4546l132L6975n686p104K6617j1045k2844
$$ -16608 19058 18168 4010 12439 11517 -3029 -6161 30814 25128 18024 44641 33596 10752
4820A0752L335j0814J759k5141j8359J3825O853m976m593J1984J4031K1785o554
$$ 10752 14087 3273 5032 -20109 -38468 -24643 -17790 -22766 -27359 -15375 -1344 20441 13887
4807A3887l298J6527J8414j3915k2080m49o398k457J6213m539k296P550J3050
$$ 13887 10589 27116 45530 31615 9535 9086 2688 231 16444 11905 9609 17159 30209
4794C0209n858k929j8792l5803R875R98M981k164j0899m568L0265j7972j1755
$$ 30209 24351 21422 2630 -33173 -23298 -22300 -17319 -19483 -30382 -34950 -4685 -22657 -34412
4781c4412J3223J9346K6796k4562k1536K816K3250j177l373k3689J462P39J6129
$$ -34412 -21189 -1843 24953 391 -21145 -18329 4921 3744 371 -23318 -21856 -21117 -4988
4768d988R190Q074k321l2682J8122J9093p449O813J0346l040j329n955J410k8376
$$ -4988 4202 12276 9955 -22727 -4605 14488 7039 13852 24198 21158 19829 13874 15284 -13092
4754a3092P08J1255j4163k8812K8427M1938n239l86k43k6342K34L3066q611j5770
$$ -13092 -12384 -1129 -15292 -44104 -15677 26261 21022 20636 20393 -5949 -5715 27351 18740 2970
4740B970r07j9560M0376Q688j3054j6301l1168j4948K0335J0995K2548k3388j9337
$$ 2970 2063 -17497 22879 31567 18513 2212 -28956 -43904 -23569 -12574 9974 -13414 -32751
4727c2751j1857p506J6901J6057J9806j9266j4273J0490N445L787J352M4347J0957
$$ -32751 -44608 -52114 -35213 -19156 650 -18616 -32889 -22399 -16954 -13167 -11815 32532 43489
4714D3489p610j649k1537p362n0242m210J6351J5593r19j2737K8872P124q097
$$ 43489 35879 34230 12693 5331 -44911 -49121 -32770 -17177 -18096 -30833 -1961 5163 -2934
4701b934j5521j4991J0686K8336J1127M372J7814k884K494j154j9528l5973j3875
$$ -2934 -18455 -33446 -22760 5576 16703 21075 38889 36005 38499 37345 17817 -18156 -32031
4688c2031k1797K810K277K1877M064l208L9098J7924k3188M558j2383O219R961
$$ -32031 -53828 -51018 -48741 -26864 -22800 -26008 13090 31014 7826 12384 1 6220 16181
4675A6181J4875j4840k2658p141L1307K3647J2446q795j6862K915j1323J8534
$$ 16181 31056 16216 -6442 -13583 17724 41371 53817 45022 28160 31075 19752 38286
4663C8286Q240m4774p956J0629r029K385r554J35N821j0627J1282j1043r889K857
$$ 38286 46526 1752 -6204 4425 -4604 -2219 -11773 -11638 -5817 -16444 -5162 -16205 -26094 -23237
4649b3237P364q646R695L162k058j0147K3361K6234k0520k1676J4069J2507p586
$$ -23237 -15873 -24519 -14824 -11662 -13720 -23867 -506 25728 5208 -16468 -2399 10108 2522
4636B522j7498N363j7429J1434N526j150r918K0235j0554R568r494j4370J084
$$ 2522 -14976 -9613 -27042 -15608 -10082 -11232 -21150 -915 -11469 -1901 -11395 -25765 -24681
4623b4681J9878J0709j2072L052q726L1188K9117p100j3808J3323j7006l9497
$$ -24681 -4803 5906 -6166 -3114 -11840 19348 48465 41365 27557 40880 23874 -15623
4611a5623k6607J2911J9299J1172o967p58k2418j7373n932P995L551N978N594
$$ -15623 -42230 -29319 -10020 1152 -5815 -6573 -28991 -46364 -52296 -44301 -40750 -34772 -29178
4598b9178M475J9610l4623o93o605j6580M5104M542N511k2810j5434J6419L634
$$ -29178 -24703 -5093 -39716 -40409 -47014 -63594 -18490 -13948 -8437 -31247 -46681 -30262 -26628
4585b6628N810L066k416j8202J0728J735l134j0185J0273L404O214K5981M496
$$ -26628 -20818 -17752 -20168 -38370 -27642 -25907 -29041 -39226 -28953 -25549 -19335 6646 11142
4572A1142j7077R73L113Q490j160m965M0439j356k5169l8062k6262N235L8529
$$ 11142 -5935 -4962 -1849 6641 5481 516 40955 39599 14430 -23632 -49894 -44659 -6130
4559f130J710j4901r868J1007J2655K978o521l043j1583J0985J3474o646r674
$$ -6130 -4420 -19321 -29189 -18182 -5527 -2549 -9070 -12113 -23696 -12711 763 -5883 -15557
4546a5557J1650L599J0577J6152j1130l4329l3176K313K7923O117K4309k862J3879
$$ -15557 -3907 -308 10269 26421 15291 -19038 -52214 -49901 -21978 -15861 8448 5586 19465
4533A9465o629o701m036J5728J3533l487k920O333J6447J6411l266j2041j6168
$$ 19465 12836 6135 2099 17827 31360 27873 24953 31286 47733 64144 60878 48837 32669
4520C2669j4846j4655p581j4586j7353J0969L2954K592J6059m658l9852n858Q590
$$ 32669 17823 3168 -4413 -18999 -36352 -25383 7571 10163 26222 21564 -18288 -24146 -15556
4507a5556N047Q80l296J7721J1443j3357J9931L521m617k791l043k1223j7251
$$ -15556 -10509 -9629 -12925 4796 16239 2882 22813 26334 21717 18926 15883 -5340 -22591
4494b2591K0236K1021M326j5283q990k883j1344j1671o600j8053L4991L3224j0547
$$ -22591 -2355 18666 22992 7709 -1281 -4164 -15508 -27179 -33779 -51832 -16841 16383 5836
4481E836p446k228Q62j8324J0600K5682Q113r259q879n940K569J6097L737k8119
$$ 5836 -1610 -3838 -2976 -21300 -10700 14982 23095 13836 4957 -983 1586 17683 21420 -6699
4467f699j0567o322J5874K4651m340m852J6019j550j6121J5264q026k6160r55
$$ -6699 -17266 -23588 -7714 16937 12597 7745 23764 22214 6093 21357 13331 -12829 -13784
4454a3784K5236j8782K4036J9823k1601p124j4780m4180J5035O273p599M2476
$$ -13784 11452 -7330 16706 36529 14928 7804 -6976 -51156 -36121 -29848 -37447 5029
4442E029K0279n596m1523k3624M1512O186P548J7352p078j7529q896j8919K6946
$$ 5029 25308 19712 -21811 -45435 -3923 2263 9811 27163 20085 2556 -6340 -25259 1687
4429A687Q807n887j932J8340j5144l4095j0583j9744K9004K5695m171j2237r821
$$ 1687 10494 4607 2675 21015 5871 -28224 -38807 -58551 -29547 -3852 -8023 -20260 -30081
4416c0081O015J0055K4162J1359k1852p570L3996j1179j4296N077l324K9525k0113
$$ -30081 -24066 -14011 10151 21510 -342 -7912 26084 14905 609 5686 2362 31887 11774
4403A1774j1067j0932K7925M297j6521k9439J7244K4976k485q563Q256J4431k8315
$$ 11774 707 -10225 17700 21997 5476 -23963 -6719 18257 15772 7209 15465 29896 1581
4390A581k0821J4853k561J8848k2052j4106O48o104j515K1836L2061J1642m820
$$ 1581 -19240 -4387 -6948 11900 -10152 -24258 -23610 -29714 -31229 -9393 22668 34310 29490
4377B9490J9429K0092r890k0038m144j0244O044L790l094k2374J902m211j5322
$$ 29490 48919 69011 59121 39083 34939 24695 30739 34529 31435 9061 10963 6752 -8570
4364h570J059J9217K7228k3043k7796j9780O992J4779K2903M519M766J0647k5726
$$ -8570 -7511 11706 38934 15891 -11905 -31685 -24693 -9914 12989 17508 22274 32921 7195
4351G195m2496m930M674p093l216J3394J643k7165r519J8098J4708n51m0804R064
$$ 7195 -35301 -40231 -35557 -42650 -45866 -32472 -30829 -57994 -67513 -49415 -34707 -35258 -76062 -66998
4337f6998M1805J0599r88p432J1317j281k081J2764N023j0488Q378j828p689o186
$$ -66998 -25193 -14594 -15582 -23014 -11697 -12978 -15059 -2295 2728 -7760 618 -1210 -8899 -15085
4323a5085j2390L246m538l447K9325M643P941P862m3930j303K3761Q29n211j7197
$$ -15085 -27475 -24229 -28767 -32214 -2889 1754 9695 17557 -26373 -27676 -3915 -3086 -8297 -25494
4309b5494J3234k346o289J5834l129l244r47q644J6203J5466j2131M451j3427
$$ -25494 -12260 -14606 -20895 -5061 -8190 -11434 -12381 -21025 -4822 10644 -1487 2964 -10463
4296a0463N648J58j5678k138Q339k461J9670K0921O923l538m0J424J4352m329
$$ -10463 -4815 -4657 -20335 -22473 -14134 -16595 3075 23996 30919 27381 27341 28765 43117 38788
4282C8788l6712L8q933k0750O164K1038l845J7163j779j2088J0942K0458m537
$$ 38788 2076 2114 -6819 -27569 -21405 -367 -4212 12951 11172 -916 10026 30484 25947
4269B5947k7607O729q003j3890J0543Q627k4196L3031K8564K6206k1847l0368
$$ 25947 -1660 5069 -2934 -16824 -6281 2346 -21850 11181 39745 65951 44104 13736
4257A3736m2273p801N812J0252L288O52M626J0643j3782n522k884L1000L384k6499
$$ 13736 -28537 -36338 -30526 -20274 -16986 -16334 -11708 -1065 -14847 -20369 -23253 7747 11131 -15368
4243a5368q161M980K655q011P419J3606K467K0289J7289k7765l669k1258j774
$$ -15368 -23529 -18549 -15894 -23905 -16486 -2880 -413 19876 37165 9400 5731 -15527 -17301
4230a7301M0016j7748k9628J6926P858p095N595J2677r172J0039o324O889o378
$$ -17301 22715 4967 -24661 -7735 123 -6972 -1377 11300 2128 12167 5843 12732 6354
4217F354P842R360j798k6045m151L6341N151k4045k9730J377j0488J0751j514
$$ 6354 14196 23556 21758 -4287 -8438 27903 33054 9009 -20721 -19344 -29832 -19081 -20595
4204b0595K7692l759K1424K788k4417j4343J2179l593N436r272O510J3783Q126
$$ -20595 7097 3338 24762 27550 3133 -11210 969 -2624 2812 -6460 50 13833 21959
4191B1959l712j7113k084Q087J1468n702l75l826K503K375P576n218J9310j1674
$$ 21959 18247 1134 -950 7137 18605 12903 12528 8702 11205 13580 21156 15938 35248 23574
4177B3574K211N003j8940Q020J1421o689k4124r69n251R907Q964k142K0404R624
$$ 23574 25785 30788 11848 19868 31289 24600 476 -493 -5744 4163 13127 10985 31389 41013
4163D1013r805J437j9656j2919L456L698K5666j1695o833j0301o952p091q314
$$ 41013 31208 32645 12989 70 3526 7224 32890 21195 14362 4061 -2891 -9982 -18296
4150a8296k481j1667J17O042m277j556Q776J9734Q310j0312r798l877K0315J6191
$$ -18296 -20777 -32444 -32327 -26285 -30562 -32118 -23342 -3608 4702 -5610 -15408 -19285 1030 17221
4136A7221M617m628j2127k3770J0107J2038M736q623k334j8067j2493J1131J0516
$$ 17221 21838 17210 5083 -18687 -8580 3458 8194 -429 -2763 -20830 -33323 -22192 -11676
4123a1676o416K2177K2018k876j5067J0219m350j7234j4769j0125J123M304J4454
$$ -11676 -18092 4085 26103 23227 8160 18379 14029 -3205 -17974 -28099 -26976 -22672 -8218
4110h218j4162l030O975K892J0274r596K281l624J5278O228m5548j8937K9521
$$ -8218 -22380 -25410 -18435 -15543 -5269 -14865 -12584 -16208 -930 5298 -40250 -59187 -29666
4097b9666L2175N497k1684l4383k0398K1112J9810p6L2078K4954R280k7409l6717
$$ -29666 2509 8006 -13678 -48061 -68459 -47347 -27537 -27613 4465 29419 38699 11290 -25427
4084b5427L4604o163J1196N798r108m421k4524J0875j608j8825J8352l6o164r276
$$ -25427 9177 3014 14210 20008 10900 6479 -18045 -7170 -8778 -27603 -9251 -9287 -15451 -24727
4070b4727k809j504J7497J7252k992j7535J9300K8893l0747k1997L779m682j0652
$$ -24727 -27536 -29040 -11543 5709 2717 -14818 4482 33375 2628 -19369 -15590 -20272 -30924
4057c0924K831R832J7387J8034K4891j0515M379q480k8748j5555j6368j7568K7645
$$ -30924 -28093 -18261 -874 17160 42051 31536 35915 27435 -1313 -16868 -33236 -50804 -23159
4044b3159k617K1498M0959p029j6826K435Q986m414m255M592L759O719M437m1
$$ -23159 -25776 -4278 36681 29652 12826 15261 24247 19833 15578 20170 23929 30648 35085 35044
4030C5044k3349j7693J6482j5957j1774J945R274M371J5989J5418j7263%j8110
$$ 35044 11695 -5998 10484 -5473 -17247 -15302 -6028 -1657 14332 29750 12487 12487 -5623
4017e623k0647n751J5095J4918J1432P33J4063l348K061j6960j7905J6198K30
$$ -5623 -26270 -32021 -16926 -2008 9424 10157 24220 20872 22933 5973 -11932 4266 4496
4004D496O713N93l0036k839j0217K720l3692j4669J2578K8211J0263L2055K4218
$$ 4496 11209 11802 -18234 -21073 -31290 -28570 -62262 -76931 -64353 -36142 -25879 6176 30394
3991C0394M029J3198k773k8415j7035M452K3994K46j6602j8516l27J2870m293
$$ 30394 34423 47621 44848 16433 -602 3850 27844 28090 11488 -7028 -7355 5515 1222
3978A222Q282K870m123J1767k0981j2436k1447N194J3536J6728J134q003K5773
$$ 1222 9504 12374 8251 20018 -963 -13399 -34846 -29652 -16116 612 1746 -6257 19516
3965A9516r368j3589n255K6823j262l198O396j6267l6177k1941K01M617N416J5439
$$ 19516 10148 -3441 -8696 18127 16865 13667 20063 3796 -32381 -54322 -54121 -49504 -44088 -28649
3951b8649P859p319J3294o628p783P297J1959J2663j5235J091K1127j7000l4522
$$ -28649 -20790 -28109 -14815 -21443 -29226 -21929 -9970 2693 -12542 -11451 9676 -7324 -41846
3938d1846r024J7937K2398N770J825J4513l518k3178K4585N862j7818K618J4500
$$ -41846 -50870 -32933 -10535 -4765 -2940 11573 8055 -15123 9462 15324 -2494 124 14624
3925A4624J1407k94J95K775m7422j8068P930r693n934J4232M226o369j7679N609
$$ 14624 26031 25737 25932 28707 -18715 -36783 -28853 -38546 -44480 -30248 -26022 -32391 -50070 -44461
3911d4461M2246J0101n539J1212j3628p633q036K3608j7348j5960J5363J3166
$$ -44461 -2215 7886 2347 13559 -69 -7702 -15738 7870 -9478 -25438 -10075 3091
3899C091N617J3892m558j2148J7428p053k3201l4082n038K0446l643L589L7495
$$ 3091 8708 22600 18042 5894 23322 16269 -6932 -41014 -46052 -25606 -29249 -25660 11835
3886A1835K4611o381k1678j7945J1489j9137J197K0666K5298r945l758k844j7441
$$ 11835 36446 30065 8387 -9558 1931 -17206 -16009 4657 29955 20010 16252 13408 -4033
3873d033j2784n126j1924K0379J8944O867j4467m588P560L2216M518o452j2242
$$ -4033 -16817 -21943 -33867 -13488 5456 12323 -2144 -6732 828 33044 37562 31110 18868
3860A8868j5652p652j235j6719k2250l187J3175O686L11J7473O282j5098j9597
$$ 18868 3216 -4436 -5671 -22390 -44640 -47827 -34652 -27966 -27655 -10182 -3900 -18998 -38595
3847c8595J3038N292K9311K2224o015r863L453J5593J2589n176j9639R629N607
$$ -38595 -25557 -20265 9046 31270 25255 15392 18845 34438 47027 41851 22212 31841 37448
3834C7448k0342j6016k0704L1924j296j4472L213p102J5601m107J582l158l5105
$$ 37448 17106 1090 -19614 12310 11014 -3458 -245 -7347 8254 4147 5729 2571 -32534
3821c2534j6960J0699n119L745O887M6989M2776K518j6898l195J4794J2424l2891
$$ -32534 -49494 -38795 -43914 -40169 -33282 13707 56483 59001 42103 38908 53702 66126 33235
3808C3235j8675J1779Q2R60L376j8437M476j1754J6675j3577p873n338K7411K8073
$$ 33235 14560 26339 26421 27381 30757 12320 16796 5042 21717 8140 267 -5071 22340 50413
3794E0413k2694l1860k1034J2646J1015Q263q525J878L6477J998n285O371r835
$$ 50413 27719 -4141 -25175 -12529 -1514 6749 -1776 102 36579 38577 33292 39663 29828
3781B9828p402k1634k4675j0051k1179J6757K7811j5250J3219L836j5190J1062
$$ 29828 22426 792 -23883 -33934 -55113 -38356 -10545 -25795 -12576 -8740 -23930 -12868
3769a2868Q706L153m10L3243N153K229j673p901o593j614q930J8294P697j0758
$$ -12868 -4162 -1009 -1419 31824 36977 39206 37533 29632 23039 21425 12495 30789 38486 27728
3755B7728P89J5463J0312o601k6847k2780j2328j6782P859K0599j345j588j4316
$$ 27728 28517 43980 54292 47691 20844 -1936 -14264 -31046 -23187 -2588 -3933 -5521 -19837
3742a9837j4047J804J0664J2170k676n878K025L818j5076J0942K3250J5772j8121
$$ -19837 -33884 -32080 -21416 -9246 -11922 -17800 -15775 -11957 -27033 -16091 7159 22931 4810
3729D810j867J117J0128j1437J5633J5051j8577j7490p672n502k6475K470L367
$$ 4810 2943 4060 14188 2751 18384 33435 14858 -2632 -10304 -15806 -42281 -39811 -36444
3716c6444k9387j6289R699K1426L3798L3065j4430J679J9607j8831j102J7961
$$ -36444 -65831 -82120 -72421 -50995 -17197 15868 1438 3117 22724 3893 2791 20752
3704B0752R736k6926l25k4756Q199M7258K2381k2956K792j4820k2423K1072l85
$$ 20752 30488 3562 3237 -21519 -13320 33938 56319 33363 36155 21335 -1088 19984 19599
3691A9599J5151K5217j165l4857k7909k103N952K971J6816P582n559J4218K2749
$$ 19599 34750 59967 58802 23945 -3964 -6067 -115 2856 19672 27254 21695 35913 58662
3678E8662k4945l6310j0949K2153J8406j7371k9205l9084J4748L7295K0787k320
$$ 58662 33717 -2593 -13542 8611 27017 9646 -19559 -58643 -43895 -6600 14187 11867
3666A1867j8754J9704P369r773j3957o937K343K310K3409Q041k2387k6118J6212
$$ 11867 -6887 12817 20186 10413 -3544 -10481 -8138 -5828 17581 25622 3235 -22883 -6671
3653f671J8615l010k9681M025p414N942J3808N712M89N817j001Q868J344J6143
$$ -6671 11944 8934 -20747 -16722 -24136 -18194 -4386 1326 1815 7632 6631 15499 16843 32986
3639C2986L182q687k397K2193l233j2178j1626o158j5049J9853n889j7932O007
$$ 32986 36168 27481 25084 47277 44044 31866 20240 14082 -967 18886 12997 -4935 1072
3626A072o101K6615J0320k9925l9317l064J3880L3820j7305j1422J0149L2132
$$ 1072 -5029 21586 31906 1981 -37336 -40400 -26520 7300 -10005 -21427 -11278 20854
3614B0854J801N589r217k6237l7139j2765N039M868j753P949J4419m115j4484
$$ 20854 22655 28244 19027 -7210 -44349 -57114 -52075 -47207 -48960 -41011 -26592 -30707 -45191
3601d5191Q352L3590K5872J1124k2500k3699j4252j1757m985N237K1668R144K437
$$ -45191 -36839 -3249 22623 33747 11247 -12452 -26704 -38461 -43446 -38209 -16541 -7397 -4960
3588d960J4964j8773k4664m75P990K598K315K7907k859j1377L000j658k701M924
$$ -4960 10004 -8769 -33433 -33908 -25918 -23320 -21005 6902 4043 -7334 -4334 -5992 -8693 -3769
3574c769L8901O720j5988m0562M584K2332p016n017o377R236J1551J0193R32j0904
$$ -3769 35132 41852 25864 -14698 -10114 12218 5202 185 -6192 3044 14595 24788 25720 14816
3560A4816o616J3805m838k3204N316J0795J717o279K7227l776l0977Q544P804
$$ 14816 8200 22005 17167 -6037 -721 10074 11791 5512 32739 28963 -2014 6530 14334
3547A4334L511l572l9214r390K2624K2733K1894p665j5000p065L021j9840j72
$$ 14334 17845 14273 -24941 -34331 -11707 11026 32920 25255 10255 3190 6211 -13629 -13801
3534a3801K7386L1579m236k6112l6996L759J7535k4652l592K4520J4117J3675
$$ -13801 13585 45164 40928 14816 -22180 -18421 -886 -25538 -29130 -4610 9507 23182
3522B3182k3914m6765q339J5727L2348O883j9323J4509Q452p997J1450J4568J0166
$$ 23182 -732 -47497 -55836 -40109 -7761 -878 -20201 -5692 2760 -5237 6213 20781 30947
3509C0947k260k6713L869j4864N098J5350j0732J920K5632K086O68k0374R853
$$ 30947 28687 1974 5843 -9021 -3923 11427 695 2615 28247 30333 31001 10627 20480
3496B0480J3441j5002m5931M185J2999N975K0649J3600J3132p083o314J2581l6994
$$ 20480 33921 18919 -27012 -22827 -9828 -3853 16796 30396 43528 36445 30131 42712 5718
3483E718l1044N286J6039l70L339K428l14l4799p021J7766K0930O732P144L1381
$$ 5718 -25326 -20040 -4001 -4371 -1032 1396 1082 -33717 -40738 -22972 -2042 4690 11834 43215
3469D3215M160k6904n0049N353L8485j858j7241K6098J0056R075j5900k1585l2459
$$ 43215 47375 20471 -29578 -24225 14260 12402 -4839 21259 31315 40390 24490 2905 -29554
3456b9554J1527K2300O166l6588L3856J5627Q919J4362J7942l1393q853M588l617
$$ -29554 -18027 4273 10439 -26149 7707 23334 32253 46615 64557 33164 24311 28899 25282
3443B5282j9646K0225J908p125j9000j4517O513N809K9081P310l8089j8311j6146
$$ 25282 5636 25861 27769 20644 1644 -12873 -6360 -551 28530 35840 -2249 -20560 -36706
3430c6706J3423J3473n366j4470j1088p620J5275N1409j0363j6235J4790m361
$$ -36706 -23283 -9810 -15176 -29646 -40734 -48354 -33079 18330 7967 -8268 6522 2161
3418B161j3890m533j3748K7573M937r116j6753J4187L281r465j7881N413P057
$$ 2161 -11729 -16262 -30010 -2437 2500 -6616 -23369 -9182 -5901 -15366 -33247 -27834 -20777
3405b0777N69L95r603P685J1584K7157J2772N346Q671j0364l1612j1698R36K4802
$$ -20777 -20208 -19813 -29416 -21731 -10147 17010 29782 35128 43799 33435 1823 -9875 -8939 15863
3391A5863k1631Q446K0116N853j2958J660k655j2157l1095n231L2485K7179J3417
$$ 15863 -5768 2678 22794 28647 15689 17349 14694 2537 -28558 -33789 -1304 25875 39292
3378C9292k5794k7063m652K8861N035j0900n922j4154l6795J815Q208M46J0534
$$ 39292 13498 -13565 -18217 10644 15679 4779 -1143 -15297 -52092 -50277 -42069 -41623 -31089
3365c1089K7089K7814j3758m413J0707j2881l203J0880j3857k1652r75P747K4894
$$ -31089 -4000 23814 10056 5643 16350 3469 266 11146 -2711 -24363 -25338 -17591 7303
3352G303K3776K1401M75l2863k1692j4405j3779K7757K2983K3742k671k4121j7422
$$ 7303 31079 52480 52955 20092 -1600 -16005 -29784 -2027 20956 44698 42027 17906 484
3339D84R039R075o301j4215l1386m954L2380Q487K119K5205o021j2626L86K3074
$$ 484 9523 18598 12297 -1918 -33304 -38258 -5878 2609 4728 29933 23912 11286 11672 34746
3325C4746J0782K703j1149n499N436j6647J7883k0991K927Q280o254j7976N987
$$ 34746 45528 48231 37082 31583 37019 20372 38255 17264 20191 28471 22217 4241 10228
3312A0228o667L1119n0j4870j1016K580j085J1352K560p235r078j4416j1263j8194
$$ 10228 3561 34680 34630 19760 8744 11324 10239 21591 24151 16916 7838 -6578 -17841 -36035
3298c6035J7570J076J1714K3714O776r158j8074m072p065q672M572L728M907J1866
$$ -36035 -18465 -17389 -5675 18039 24815 15657 -2417 -6489 -13554 -22226 -17654 -13926 -9019 2847
3284B847O419m480r897J5333J5228n357j1226k0094O310K2774p766J3192k3854
$$ 2847 9266 4786 -5111 10222 25450 20093 8867 -11227 -4917 17857 10091 23283 -571
3271e71k0474K1321K1262k7621j7665J5618M0545n199q319Q883q438n248l8048
$$ -571 -21045 276 21538 -6083 -23748 -8130 32415 27216 18897 27780 19342 14094 -23954
3258b3954m293L467k5687J0759K5793J607Q8J1009l18j9743J5975J2744j4045
$$ -23954 -28247 -24780 -50467 -39708 -13915 -12308 -12220 -1211 -1529 -21272 -5297 7447 -6598
3245f598L934Q128k0304k432j0962r954J2185J2808L0012j5728Q206K4698J3788
$$ -6598 -2664 5464 -14840 -17272 -28234 -38188 -26003 -13195 16817 1089 9295 33993 47781
3232D7781j8951l3474k0230K3056K2988r60J4807l964l0335Q954K105k4445O95
$$ 47781 28830 -4644 -24874 -1818 21170 20210 35017 31053 718 9672 11777 -12668 -11973
3219a1973J1513J6131j004m741j1567k5268J0291J3641j7840J4387k681r156R633
$$ -11973 -460 15671 14667 9926 -1641 -26909 -16618 -2977 -20817 -6430 -9111 -18267 -8634
3206h634L093l654R111R703K555j7740l5924O783R164K634P563n332n1552o488
$$ -8634 -5541 -9195 -84 9619 12174 -5566 -41490 -34707 -25543 -22909 -15346 -20678 -72230 -78718
3192g8718Q580M3565M9499K7696J7326n227j8902k3276p744j2934j9468n729j0331
$$ -78718 -70138 -26573 22926 50622 67948 62721 43819 20543 12799 -135 -19603 -25332 -35663
3179c5663K4363K4821J2996j0275l803O257q969k6335n542J0286J6936M506J2415
$$ -35663 -11300 13521 26517 16242 12439 18696 9727 -16608 -22150 -11864 5072 9578 21993
3166B1993j8672j2747J1214K1460J3069Q642q319j0136j9649N121J6565j7037
$$ 21993 3321 -9426 1788 23248 36317 44959 36640 26504 6855 11976 28541 11504
3154A1504j1326J1507N345j459l490L3444N294J1173k3844l2178j902n740k4302
$$ 11504 178 11685 17030 15571 12081 45525 50819 61992 38148 5970 4068 -1672 -25974
3141b5974Q007J7842j732O583Q816j4054n546l274R145N366j1179K2306n429N135
$$ -25974 -17967 -125 -1857 4726 13542 -512 -6058 -9332 -187 5179 -6000 16306 10877 16012
3127A6012N535n93k5620J9252K154J9355P760j5235k2923O17j3664M952j5976
$$ 16012 21547 20954 -4666 14586 16740 36095 43855 28620 5697 6314 -7350 -2398 -18374
3114a8374P115L5573J392J987J4498l051k7096P399L3173l133j6851j5138j0348
$$ -18374 -11259 24314 25706 27693 42191 39140 12044 19443 52616 49483 32632 17494 7146
3101G146k4760n14K0291K985L070K3483L9118j1455k8100k125N972l9902j4114
$$ 7146 -17614 -18128 2163 5148 8218 31701 70819 59364 31264 29139 35111 -4791 -18905
3088a8905K277J7875p414j1433j7614J8936K1152K6372j9357J6476j4594m2243
$$ -18905 -16628 1247 -6167 -17600 -35214 -16278 4874 31246 11889 28365 13771 -28472
3076b8472o767L1468J0618m275J2171R403q312J5263o221k786k158J0854J2581
$$ -28472 -35239 -3771 6847 2572 14743 24146 15834 31097 24876 22090 19932 30786 43367
3063D3367J6814j5567j9485j442l025l1485n558K8020j0816k826P545j928j717
$$ 43367 60181 44614 25129 23687 20662 -10823 -16381 11639 823 -2003 5542 3614 1897
3050A897L0635l3583k7916J1277L106k3728l0612K790J5048J6451J6647K8625
$$ 1897 32532 -1051 -28967 -17690 -14584 -38312 -68924 -66134 -51086 -34635 -17988 10637
3038A0637J5360n701l2374K0916J3713m577M882J4555l030j4739r3K4521o365
$$ 10637 25997 20296 -12078 8838 22551 17974 22856 37411 34381 19642 19549 44070 37705
3025C7705k7907Q7j0208Q277J2996J0036k8077m4507j6265K0054J3911N317Q957
$$ 37705 9798 9885 -323 7954 20950 30986 2909 -41598 -57863 -37809 -23898 -18581 -9624
3012i624l147J8860j3080n427o289L2311J0533j8857j3990o364k7467J872L9173
$$ -9624 -12771 6089 -6991 -12418 -18707 13604 24137 5280 -8710 -15074 -42541 -40669 -1496
2999a496O859k1872k0314K768K0684J2034K7012J8155j2103N698j8673Q43k297
$$ -1496 5363 -16509 -36823 -34055 -13371 -1337 25675 43830 31727 37425 18752 19595 17298
2986A7298j1439j1774p251r51J500K17J5694N65j6131j3030L988R698o22J1090
$$ 17298 5859 -5915 -13166 -14117 -12617 -12400 3294 3859 -12272 -25302 -21314 -11616 -12238 -1148
2972a148J3058Q77k4064k138L3267J281L779m820n216l1795q739J8970j989J7377
$$ -1148 11910 12787 -11277 -13415 19852 21133 24912 20092 14876 -16919 -25658 -6688 -8677 8700
2958H700R397j2018M125J2870K1581q840j8521n546o970j168j2913K5132K5053
$$ 8700 18097 6079 10204 23074 44655 35815 17294 11748 4778 3610 -9303 15829 40882
2945D0882j2132J6706l532j6516j0803j9715o974J1082j5462K1200p33m197k503
$$ 40882 28750 45456 41924 25408 14605 -5110 -12084 -1002 -16464 4736 4003 -194 -2697
2932b697O382r852j1853Q31j1011J0330K1128J3987O721j1412p4J3178k320L447
$$ -2697 3685 -6167 -18020 -17189 -28200 -17870 3258 17245 23966 12554 12480 25658 23338 26785
2918B6785k4856j0503J7147k744j1254r243r811R751Q38R043k277l708j7342K3323
$$ 26785 1929 -8574 8573 5829 -5425 -14668 -24479 -14728 -13890 -4847 -7124 -10832 -28174 -4851
2904d851Q92K6564q867j5982O067j9048L457L5679K0184j2857m720J1522P410
$$ -4851 -3959 22605 13738 -2244 3823 -15225 -11768 23911 44095 31238 26518 38040 45450
2891D5450k6289l0175l4807J2582J9662J4937L7956k5739j1409n638j3891n621
$$ 45450 19161 -11014 -45821 -33239 -13577 1360 39316 13577 2168 -3470 -17361 -22982
2879b2982K044J9264J2550j2174k0407R396K8281m082j6198R572L064Q012r90
$$ -22982 -20938 -1674 10876 -1298 -21705 -12309 15972 11890 -4308 5264 8328 16340 15350
2866A5350j0302p406l2018q253K2932K1249r478M049n897R933K2354q367j3453
$$ 15350 5048 -2358 -34376 -42629 -19697 1552 -7926 -3877 -9774 159 22513 14146 693
2853F93K2919j1123k963J0860J4682j2825k8321n302J9223N577r148k9418j6166
$$ 693 23612 12489 9526 20386 35068 22243 -6078 -11380 7843 13420 4272 -25146 -41312
2840d1312L2535M815M391J6637L808J6718q714P05K957k4492l4564j4147o344
$$ -41312 -8777 -3962 429 17066 20874 37592 28878 29583 32540 8048 -26516 -40663 -47007
2827d7007J4440J9185J0521J323j3437j9880O067J5421m315O580J4604K2318J5784
$$ -47007 -32567 -13382 -2861 -1538 -14975 -34855 -28788 -13367 -17682 -11102 3502 25820 41604
2814D1604j833j1884o855j8177M131j0853q862r884j7890J3169j073k082L2276
$$ 41604 39771 27887 21032 2855 6986 -3867 -12729 -22613 -40503 -27334 -28407 -30489 1787
2801A787K3791K5091K2810m69K114j3336k6807K717J7564J0304j7521j5350J0918
$$ 1787 25578 50669 73479 73010 75124 61788 34981 37698 55262 65566 48045 32695 43613
2788D3613J1672j4943l0160J0980l500J6565J64J4703j4434j3286J5688l054k3062
$$ 43613 55285 40342 10182 21162 17662 34227 34391 49094 34660 21374 37062 34008 10946
2775A0946J336j6965j1460K6445m016j6501J029N242J0299J3568M050K4228J369
$$ 10946 12282 -4683 -16143 10302 6286 -10215 -9186 -3944 6355 19923 23973 48201 49570
2762D9570n208l6696j9680K4598J7537j7909j857J7262J3304O809k087k7401p163
$$ 49570 44362 7666 -12014 12584 30121 12212 10355 27617 40921 47730 45643 18242 11079
2749A1079k1062j0795j2194L265R250K3869K306j5669r58p342R654J5245J2091
$$ 11079 -9983 -20778 -32972 -29707 -20457 3412 5718 -9951 -10909 -18251 -8597 6648 18739
2736A8739J7429K1718j1858n802j7976j4885K9511Q924j9744k5375j254K8935
$$ 18739 36168 57886 46028 40226 22250 7365 36876 45800 26056 681 -573 28362
2724B8362k1784j4546K700J3704n660j8715P914R43K3946J2106Q15q504k7861
$$ 28362 6578 -7968 -5268 8436 2776 -15939 -8025 -7082 16864 28970 29785 21281 -6580
$$ [...]
##END NTUPLES=NMR SPECTRUM
##END=
