##TITLE=Analysis number 314644
Compound Code btb 10241
Project Code adrs
Chemist Name avocado
##JCAMPDX= 6.0         $$ Bruker NMR JCAMP-DX V2.0
##DATA TYPE= NMR SPECTRUM
##DATA CLASS= NTUPLES
##ORIGIN= Bruker BioSpin GmbH
##OWNER= NMR
$$ XWIN-NMR		Version 3.5
$$ Mon Oct 24 08:38:23 2005 GMT Daylight Time (UT+1h)  MAYBRIDGE\NMR@NMR_250MHZ
##.OBSERVE FREQUENCY= 250.131544655141
##.OBSERVE NUCLEUS= ^1H
##.ACQUISITION MODE= SIMULTANEOUS (DQD)
##.ACQUISITION SCHEME= undefined
##.AVERAGES= 16
##.DIGITISER RES= 18
##SPECTROMETER/DATA SYSTEM= dpx250
##.PULSE SEQUENCE= zg30
##.SOLVENT NAME= CDCl3
##.SHIFT REFERENCE= (INTERNAL, CDCl3, 0, 16.522)
##AUDIT TRAIL= $$ (NUMBER, WHEN, WHO, WHERE, WHAT)
$$ ##TITLE= Audit trail, XWIN-NMR		Version 3.5
$$ ##JCAMPDX= 5.01
$$ ##ORIGIN= Bruker BioSpin GmbH
$$ ##OWNER= NMR
$$ C:\u/data/dgb/nmr/ADRS/11230/pdata/1/auditp.txt
$$ ##AUDIT TRAIL=  $$ (NUMBER, WHEN, WHO, WHERE, WHAT)
(   1,<2005-10-24 08:38:06.03 +100>,<MAYBRIDGE\NMR>,<NMR_250MHZ>,
      <created by zg, POWCHK disabled, PULCHK disabled
       configuration hash MD5:
       62 19 C7 07 E1 42 D1 B7 37 6C 3D D0 77 39 F9 E6
       data hash MD5: 64K
       55 7E AF 44 B8 99 17 65 9C D7 7C FE 7A 06 C9 72>)
(   2,<2005-10-24 08:38:16.67 +100>,<MAYBRIDGE\NMR>,<NMR_250MHZ>,
      <Start of raw data processing
       ef LB = 0.3 FT_mod = 6 PKNL = 1 SI = 32K 
       data hash MD5: 32K
       BD C4 B2 14 0E 6B 4E 58 BE 1F 59 B8 01 08 F7 46>)
(   3,<2005-10-24 08:38:18.42 +100>,<MAYBRIDGE\NMR>,<NMR_250MHZ>,
      <apk 
       data hash MD5: 32K
       FE BE BB 5F 85 7A DB 23 09 C6 80 E1 5D 87 CA DE>)
(   4,<2005-10-24 08:38:19.21 +100>,<MAYBRIDGE\NMR>,<NMR_250MHZ>,
      <abs ABSG = 5 
       data hash MD5: 32K
       75 60 84 8E 68 25 1C D8 E7 BF A2 5A 73 80 BD CE>)
$$ ##END=
$$ 
$$ hash MD5
$$ 94 5E 1A 34 09 F0 C6 5D AE EE 6E 64 EB FF 57 D6
##$RELAX= 
##$RELAX= 
##$RELAX= 
##$RELAX= 
##$RELAX= 
##$RELAX= 
##$RELAX= 
$$ Bruker specific parameters
$$ --------------------------
##$DU= <C:\u>
##$EXPNO= 11230
##$NAME= <ADRS>
##$PROCNO= 1
##$TYPE= <nmr>
##$USER= <dgb>
##$AMP= (0..31)
100 100 100 100 100 100 100 100 100 100 100 100 100 100 100 100 100 100 
100 100 100 100 100 100 100 100 100 100 100 100 100 100 
##$AQSEQ= 0
##$AQ_mod= 3
##$AUNM= <au_zg>
##$AUTOPOS= <2 >
##$BF1= 250.13
##$BF2= 250.13
##$BF3= 250.13
##$BF4= 250.13
##$BF5= 500.13
##$BF6= 500.13
##$BF7= 500.13
##$BF8= 500.13
##$BYTORDA= 1
##$CFDGTYP= 0
##$CFRGTYP= 5
##$CHEMSTR= <none>
##$CNST= (0..31)
1 1 145 1 1 1 1 1 1 1 1 1 1 1 1 1 1 1 1 1 1 1 1 1 1 1 1 1 1 1 1 1 
##$CPDPRG= <>
##$CPDPRG1= <>
##$CPDPRG2= <>
##$CPDPRG3= <>
##$CPDPRG4= <mlev>
##$CPDPRG5= <mlev>
##$CPDPRG6= <mlev>
##$CPDPRG7= <mlev>
##$CPDPRG8= <mlev>
##$CPDPRGB= <>
##$CPDPRGT= <>
##$D= (0..31)
0 1 0 0 0 0 0 0 0 0.06 0 0 0 0 0 0 0.0002 0 0 0 0 0 0 0 0 0 0 0 0 0 0 
0 
##$DATE= 1130139485
##$DBL= (0..7)
120 120 120 120 120 120 120 120 
##$DBP= (0..7)
150 150 150 150 150 150 150 150 
##$DBP07= 0
##$DBPNAM0= <>
##$DBPNAM1= <>
##$DBPNAM2= <>
$$ [...]
##$SUBNAM6= <"">
##$SUBNAM7= <"">
##$SUBNAM8= <"">
##$SUBNAM9= <"">
##$SW= 20.6930455092707
##$SWIBOX= (0..15)
0 0 3 0 0 0 0 0 0 0 0 0 0 0 0 0 
##$SW_h= 5175.983436853
##$TD= 65536
##$TD0= 1
##$TE= 296.16
##$TE2= 300
##$TE3= 300
##$TEG= 300
##$TL= (0..7)
0 120 120 120 120 120 120 120 
##$TP= (0..7)
150 150 150 150 150 150 150 150 
##$TP07= 0
##$TPNAME0= <>
##$TPNAME1= <>
##$TPNAME2= <>
##$TPNAME3= <>
##$TPNAME4= <>
##$TPNAME5= <>
##$TPNAME6= <>
##$TPNAME7= <>
##$TPOAL= (0..7)
0.5 0.5 0.5 0.5 0.5 0.5 0.5 0.5 
##$TPOFFS= (0..7)
0 0 0 0 0 0 0 0 
##$TUNHIN= 0
##$TUNHOUT= 0
##$TUNXOUT= 0
##$USERA1= <user>
##$USERA2= <user>
##$USERA3= <user>
##$USERA4= <user>
##$USERA5= <user>
##$V9= 5
##$VALIST= <valist>
##$VCLIST= <CCCCCCCCCCCCCCC>
##$VD= 0
##$VDLIST= <DDDDDDDDDDDDDDD>
##$VPLIST= <PPPPPPPPPPPPPPP>
##$VTLIST= <TTTTTTTTTTTTTTT>
##$WBST= 1024
##$WBSW= 4
##$XGAIN= (0..3)
0 0 0 0 
##$XL= 0
##$YL= 0
##$YMAX_a= 702789
##$YMIN_a= -668121
##$ZGOPTNS= <>
##$ZL1= 120
##$ZL2= 120
##$ZL3= 120
##$ZL4= 120
##$ABSF1= 16.522
##$ABSF2= -4.171173
##$ABSG= 5
##$ABSL= 3
##$ALPHA= 0
##$AQORDER= 0
##$ASSFAC= 0
##$ASSFACI= 0
##$ASSFACX= 0
##$ASSWID= 0
##$AUNMP= <proc_1d>
##$AZFE= 0.1
##$AZFW= 0.1
##$BCFW= 0
##$BC_mod= 0
##$BYTORDP= 0
##$COROFFS= 0
##$CY= 12.5
##$DATMOD= 1
##$DC= 0
##$DFILT= <>
##$DTYPP= 0
##$F1P= 14.0000005364418
##$F2P= -0.99999901652339
##$FCOR= 0.5
##$FTSIZE= 32768
##$FT_mod= 6
##$GAMMA= 0
##$GB= 0
##$INTBC= 1
##$INTSCL= 1
##$ISEN= 128
##$LB= 0.3
##$LEV0= 0
##$LPBIN= 0
##$MAXI= 10000
##$MC2= 0
##$MEAN= 0
##$ME_mod= 0
##$MI= 0
##$NCOEF= 0
##$NC_proc= -3
##$NLEV= 6
##$NOISF1= 0
##$NOISF2= 0
##$NSP= 0
##$NTH_PI= 0
##$NZP= 0
##$OFFSET= 16.522
##$PC= 1
##$PHC0= -74.2092
##$PHC1= 5.40161
##$PH_mod= 1
##$PKNL= yes
##$PPARMOD= 0
##$PSCAL= 4
##$PSIGN= 0
##$REVERSE= no
##$SF= 250.13
##$SI= 32768
##$SIGF1= 0
##$SIGF2= 0
##$SINO= 400
##$SIOLD= 32768
##$SREGLST= <1H.CDCl3>
##$SSB= 0
##$STSI= 32768
##$STSR= 0
##$SW_p= 5175.98343685301
##$SYMM= 0
##$S_DEV= 0
##$TDeff= 65536
##$TDoff= 0
##$TI= <Analysis number 999999
Compound Code 99
Book Reference 9
Project Code 9>
##$TILT= no
##$TM1= 0
##$TM2= 0
##$TOPLEV= 0
##$USERP1= <user>
##$USERP2= <user>
##$USERP3= <user>
##$USERP4= <user>
##$USERP5= <user>
##$WDW= 1
##$XDIM= 32768
##$YMAX_p= 449306768
##$YMIN_p= -56639
$$ End of Bruker specific parameters
$$ ---------------------------------
##NTUPLES= NMR SPECTRUM
##VAR_NAME=  FREQUENCY,     SPECTRUM/REAL,   SPECTRUM/IMAG
##SYMBOL=    X,             R,               I
##VAR_TYPE=  INDEPENDENT,   DEPENDENT,       DEPENDENT
##VAR_FORM=  AFFN,          ASDF,            ASDF
##VAR_DIM=   32768,         32768,           32768
##UNITS=     HZ,            ARBITRARY UNITS, ARBITRARY UNITS
##FACTOR=    0.157963299565203, 1,           1
##FIRST=     4132.6476996994, 0,             0
##LAST=      -1043.33573715361, 0,           0
##MIN=       -1043.33573715361, -56639,      0
##MAX=       4132.6476996994, 449306768,     0
$$ Real data points
##PAGE= N=1
##DATA TABLE= (X++(R..R)), XYDATA
$$ [...]
14796b4146Q758K0333O732k495k119J0425J1181K137n976p285q988k201l448L435
14782F343l576l181k621J576k091p466l047o62M319L914J0919N143J366j624l985
14767E327Q859l50q967r681N051J3524m003r073r42o125M820P255R08p896j3660
14752a4953M044n609m005O158M035P547r27m524J368M904L206l130N845L892j2866
14737e015j421M049M077R359j2543j4960Q996J4101q207r795j311M024N136N012
14723A502p439K593j400q132J656M270R656o820O845O742n687m202p549L227R902
14708E164N030k331l631j716j224o17l847k093j2435J7665L414r561p615J587
14694a2210q02K423l10j259k406j359m825O559K144J1613J5906J0600l696j9086
$$ y = [-24146, -15388, 4945, 11677, 9182, 7063, 17488, 28669, 30806, 24830, 17545, 8557, 6356, 2908, 6343, 2767, -414, -3035, -1459, -3550, -11016, -14063, -14725, -10406, -6492, 4427, 9570, 10936, 9312, 5327, 14186, 13836, 4869, -4812, 239, 13763, 9760, 687, -255, -6380, -1560, 5695, 6603, -1293, -14953, -10909, -16518, -20523, -14365, -10330, -2783, -3710, -8234, -6866, -1962, 1244, -1886, 3959, 7851, -5015, -6436, -2387, 1690, 11049, -1494, -16454, -7458, 6643, -1564, -11359, -12670, -8646, -3510, 1502, -5937, -3344, -4744, -12876, -11220, -6950, 2706, -4114, 2731, 9473, 3786, -416, -7965, -4738, 5164, 10194, 7863, 4232, 2516, 1292, 675, -3172, -5265, -17700, -35, 3379, -6182, -13797, -12210, -13012, -10589, -10899, -12158, -14564, -15923, -20748, -14189, -12045, -432, 15474, 26074, 22378, 3292]
14680C292M992m898j3947l160L378j3078O441J2329J937m325o417M614K670O444
14666B72p66N282J1251k07n745j0554j0816j587K685J1446P824j0559P823n701
14652F48n788j860r731l200R120J3485n304j3949J3718N960Q000k835j8007j0548
14638b0291Q036J0114L1Q234J6614j5820j1424j029L468O958p581j3101j0799
14625b6590n916Q462J9077O301M165l050j685J4474n93j2363k3833j653J7073
14612f131J9747k555r337o428o564K188J789R593O276j783j1634k3700j4350J9366
14598b3523P338J4729L276l854L398n255o962k192K390K253J2489K191O54j4950
14584h018j5027m040J0730P397p89p829j0305O230K31J1189J7807j2243m811j942
$$ y = [3292, 8284, 3386, -10561, -13721, -10343, -23421, -16980, -4651, -2714, -7039, -13456, -8842, -6172, 272, -494, 4788, 16039, 15832, 10087, -467, -11283, -12870, -10185, 1261, 9085, -1474, 6349, 648, -5140, -7000, -16731, -19931, -10811, 2674, -2630, -16579, -2861, 3099, 11099, 8264, -9743, -20291, -12255, -2141, -2110, 6124, 22738, 6918, -4506, -5535, -2067, 4891, -2690, -15791, -26590, -32506, -24044, -4967, 1334, 5499, 2449, 764, 15238, 14645, 2282, -21551, -23204, -6131, 13616, 11061, 1724, -4704, -11268, -9080, -7291, 2302, 8578, 6795, -4839, -28539, -42889, -23523, -16185, -1456, 1820, -2034, 1364, -3891, -10853, -13045, -10655, -8402, 4087, 6278, 6932, -8018, -23045, -27085, -16355, -8958, -9747, -17576, -27881, -21651, -21420, -10231, 7576, -4667, -9478, -11420]
14570a1420M11m021O470Q594J1587o67j1838M174L841m851L073N724p647p77Q648
14555A1301J258j9772m436N845o687k163M59j3023Q738P705O833J1516J4993J02
14541B2669j3972q577n16m137k187P075J4147P2j50r88k0067m300J6467L174P09
14526I419K512K76m002m748j641m947j63J0511Q772r974l21j1693m485q476J049
14511a7911J3970K663o705q800K729q252J0411K8582J6733j4180k0714j6420n717
14498b3611O760K037p220N298k200L21J3414J8235j0167j026r190Q906J572n902
14484b773j981k069p29N152M241N723m365j0655j680j091l880q275o320O204L723
14469a8775J1069J4207k983j4060q985l280n274k274K9494k831J36M328K54j0272
$$ y = [-11420, -11009, -15030, -8560, 34, 11621, 10954, -884, 3290, 7131, 2280, 5353, 11077, 3430, 2653, 11301, 12559, -7213, -11649, -5804, -12491, -14654, -14195, -27218, -18480, -10775, -3942, 7574, 22567, 22669, 8697, 120, -396, -4533, -6720, 355, 14502, 14574, 14424, 13436, -6631, -10931, 5536, 8710, 9419, 11931, 12207, 8205, 3457, 1816, -3131, -3294, 7217, 15989, 6015, 5694, -5999, -10484, -18960, -17911, -3941, -1278, -7983, -16783, -14054, -22306, -11895, 16687, 33420, 19240, -1474, -17894, -23611, -16851, -14814, -22034, -16736, -18936, -18615, -5201, 13034, 2867, 1841, -7349, 1557, 3129, -2773, -4754, -6823, -7552, -2400, 1841, 7564, 3199, -7456, -9136, -10227, -14107, -22382, -28702, -22498, -18775, -7706, 6501, 3518, -10542, -19527, -22807, -28081, -30355, -861, -3692, -3556, 772, 1026, -9246]
14455i246L44J58p792n974O791N303N207J1052j896j1182o576o35m690o185p30
14440b6051R030K567r466O509L837J4764J3755q09o275k463m646n887j066J3471
14426G270J2788J044j9774q2j0728m686j39k263P849K63l018N250J1787n805q253
14411h497j544p600P922K222j838J1545M943j3913m109N746O836q572L976J0443
14397G560l615j2932r317n147M914j8l79R21M662J926L009l05p611J1195j3645
14382a8782L482K59j1085m530R132J4411M658Q992j7858j7726R663J8816J0599
14369A0031K247j1994l956l014M457p082J877O714n921o451j910Q934J1816K946
14355H694j623J121m4l333o045P21K1480J5184j7639l837j0949r410Q443Q263
$$ y = [-9246, -8902, -8744, -16536, -22510, -15719, -10416, -5209, 5843, 3947, -7235, -13811, -14446, -19136, -25321, -26051, -17021, -14454, -23920, -17411, -13574, 1190, 14945, 14136, 7861, 5398, 752, -5135, -6201, 7270, 20058, 21102, 1328, 1246, -9482, -14168, -14307, -16570, -8721, -8458, -11476, -6226, 5561, -244, -8497, -10041, -17641, -9719, -7497, -9335, 2210, 7153, -6760, -10869, -5123, 1713, -6859, -2883, 7560, 3945, -8987, -18304, -23451, -18537, -18555, -18934, -18013, -13351, -11425, -8416, -8721, -16332, -5137, -18782, -15300, -15041, -26126, -30656, -21524, -7113, -2455, 6537, -11321, -29047, -19384, -568, 10031, 12278, 284, -3672, -6686, -2229, -9311, -7434, -720, -6641, -13092, -15002, -6068, 5748, 8694, 7071, 8192, 8148, 4815, -1230, -509, 20971, 36155, 18516, 14679, 3730, -5680, 2763, 11026]
14341A1026o692N92J6493k569k7448J806J4247Q640m910o571j0622M040K0292
14328A8324j945j7352J241L93j5019j1951m261q47K077k596j526K8102J3871K997
14314A1508N865K893j4609j2241o474J99O665j18j3006P131J6850J894J1j2956
14300f388o166J659K199K597O664Q135J310j0877p475k771k09m899k990J683J135
14285a6393M518M97j5955p520L799J8225R379n725J4161R48j0425j2479j1754
14272b8724J3268P605j840L605j031q67l696j341O953n850q55J2038R654j464
14258G455Q199R606j7621j4019k40l07J7150M345j1880k4658j6475P191J5574
14245a5680j0256p705L979J8269K382m535M781R413M844r91K138r642P596n055
$$ y = [11026, 4334, 4926, 21419, 18850, -8598, -6792, 7455, 16095, 11185, 4614, -6008, -1968, 18324, 16379, -973, 268, 661, -14358, -26309, -30570, -31417, -29340, -31936, -33462, -5360, 8511, 11508, 17373, 20266, 5657, -6584, -13058, -12859, -6194, -6312, -19318, -12187, 4663, 6557, 6568, -6388, -12554, -10895, -8696, -6099, 565, 8700, 10010, -867, -8342, -11113, -11322, -16221, -19211, -17528, -16393, -11875, -11378, -27333, -34853, -31054, -12829, -3450, -9175, 4986, 5934, -4491, -16970, -28724, -15456, -7851, -9691, -6086, -7117, -7984, -11680, -13021, -6068, -11918, -12773, -735, 8919, 7455, 15654, 25260, 7639, -6380, -6620, -6927, 10223, 14568, 2688, -21970, -38445, -31254, -15680, -25936, -33641, -29662, -11393, -9011, -13546, -8765, 648, 5492, 4501, 6639, -3003, 4593, -462]
14231d62m338M36q115K27K812j729J1298m588p526j272j374J745J3835N701m191
14216B459q411L346J089j1886j2755n358J2460J1320m993k93J1106k64j5748l848
14202b1776P936K289M38j8627L248J2595J4098J0990j5768m690L697j0110J1931
14189c749M922o782O450o152n49L52l42j642l259n815j2874J1480J1947J5733
14175I720o939j9480q303j023M18J0417J1377l419j5349L907k85p040J4714J2680
14161A395N179p749j699j27O578L58o72L830K338j1225j0123r804k181J7036J2671
14146E805k216k901q123k4471L440K656O534K6157N276M344p020j219r042r109
14132i889P500J6579j086k2610r721N085J6952J4619k856j1440r080j6110j0879
$$ y = [-462, -4800, -4364, -12479, -12252, -9440, -11169, 129, -4459, -11985, -13257, -14631, -12886, 949, 6650, 2459, -5952, -2606, -1517, -13403, -26158, -31516, -19056, -7736, -12729, -13022, -1916, -2180, -17928, -21776, -13840, -11551, -11113, -29740, -26492, -13897, 201, 11191, -4577, -9267, -5570, -15680, -3749, 1173, -5609, 841, -5311, -5860, -5508, -5850, -7492, -10751, -16566, -29440, -17960, -6013, 9720, 2781, -16699, -25002, -26025, -25607, -15190, -3813, -7232, -22581, -18674, -18959, -25999, -11285, 1395, 6574, -1175, -2874, -3001, 3577, 3935, 3263, 7093, 9431, -1794, -11917, -21721, -23902, -6866, 5805, 3589, 688, -7435, -31906, -28466, -25810, -19276, 6881, 12157, 16501, 9481, 8262, -780, -9889, -2389, 14190, 13104, -9506, -19227, -14142, 2810, 17429, 14573, 3133, -5947, -22057, -32936]
14119c2936P630J5571J0778q4k431r521j576p04L62M314O847K367j0831p495R087
14104h622L540J520R516J6734j029j5944o222K033M636k87m768P220r887k645
14090d205j79o024N234O60K685O365n165l945J524R733N973j1828K735j866P691
14075I388o752r697j3713J8590P601p662K552j1183j0465j0119N990L401J7114
14062d955K4555p153j3914q175L854J2525J6988j2612j0050l710O784l665j5353
14049a4881P853P533n326O733L842M11j755k411o337j406M514l311L608K752j528
14034B91K235P32l751o537j5055o600J521J2919J8452k14n204p275j3402l32J7890
14019d330J1427J095P354k452j0758j6285j93J8071j225N673k366p609K514m735
$$ y = [-32936, -25306, -9735, 1043, 959, -1472, -10993, -12569, -13273, -12911, -8597, -1750, 617, -10214, -17709, -8622, -5082, -3562, 5954, 22688, 21659, 5715, -507, 1526, 6162, 5875, 1107, 8327, -1560, -4205, -4384, -10408, -5174, -4514, -1829, 4536, -629, -4574, -3050, 6683, 12656, 828, 3563, 1697, 9388, 2636, -7061, -20774, -2184, 5417, -2245, 307, -10876, -21341, -31460, -25470, -22069, -4955, 19600, 12447, -1467, -9642, -5788, 6737, 23725, 11113, 1063, -2647, 4137, 472, -14881, -7028, 505, -4821, 1912, 5754, 6165, 4410, 1999, -4338, -5744, -1230, -4541, -933, 1819, 291, 2526, 3258, -493, -7030, -22085, -28685, -27164, -14245, 4207, 3993, -1211, -8486, -21888, -22220, -4330, 7097, 8192, 15546, 13094, 2336, -13949, -14142, 3929, 2704, 8377, 6011, -1598, 916, -3819]
14005c819Q477k380o961J2501J1701j5655j1740J0328r46Q04N051j059J083k923
13991D462p724q75k152Q643m16M557j0569J866K2028k832r809N769j2149m201
13977c402k296j3382J1524J0889J1524N325K349R591l067o610k5253j8685R74
13964b0519m85J1714L113L956p847K259L636l209N624O418J833p267j4032m711
13950a9517o184P316L985J860O525j3664n753N174j531K329l373J542r42o62Q54
13935b2041l182J6275M880O362O559j3372J777J1471j2920K63J0480j2280j0624
13922a6352P59J2345J972l81J545P9P18j3769m402P432J6487P017j1645k0537
13908a8732K35Q910Q972J0214j2905l183j966p3m841J0719P102J184J8825j1315
$$ y = [-3819, 4658, 2278, -4683, 7818, 19519, 3864, -7876, 2452, 1506, 2310, 7361, 6302, 7385, 4462, -3262, -4137, -6289, 2354, 1938, 6495, -4074, -2208, 19820, 16988, 7179, 12948, 799, -3402, -5698, -19080, -7556, 3333, 14857, 20182, 22531, 32122, 29055, 22445, -2808, -21493, -20519, -21004, -9290, -6177, -2221, -10068, -7809, -4173, -7382, -1758, 4660, 6493, -774, -14806, -19517, -25701, -18385, -14400, -12540, -6015, -19679, -25432, -20258, -21789, -19460, -22833, -21291, -22233, -22895, -22041, -25223, -8948, -4068, 2294, 8853, -4519, -2742, 8729, -4191, -3928, 6552, -5728, -16352, -15593, -3248, -1276, -1657, -112, -33, 685, -13084, -17486, -10054, 6433, 13450, 1805, -18732, -18497, -9587, -615, 9599, -3306, -6489, -8455, -8528, -13369, -2650, 4452, 5636, 24461, 13146]
13894A3146j9823m681K945M198j0915n563n326J7068o142m524J416o390N364n195
13880b4422R668O611j77J7239J3319j0136j3573j3989l057Q454N987L295J1387
13867A0606k428n741j7053j692J0154J642j1500q5J1532J5084O713P788j4879
13854A0141j5460k89J0267J7475K673n80j3164J1340K598o715j4677k991J6737
13841A7355R731M332l392q993j3470r391p715R55K0766R806J562m851k4695n944
13827a3944k083o20l713Q293N925O954J2342O243O508k60m563r664j495Q44l149
13812G618j6621p230L262J3117Q071r646P85p779j0507J1216O356M02J35l426
13798d247M043P437J2963r410j5635j1509K794l238K169J5509k835o457N086P309
$$ y = [13146, -6677, -11358, -8413, -4215, -15130, -20693, -26019, -8951, -15093, -19617, -18201, -24591, -19227, -24422, -14754, -8143, -8320, 8919, 22238, 12102, -1471, -15460, -18517, -10063, -4076, -781, 10606, 8178, 2437, -14616, -16308, -6154, -4512, -16012, -16097, -4565, 10519, 17232, 25020, 10141, -5319, -5608, 4659, 22134, 24807, 24227, 11063, 22403, 25001, 18286, 3609, 618, 17355, 27086, 31418, 28026, 19033, 5563, -3828, -11543, -10588, 10178, 19984, 21546, 16695, -8000, -13944, -16027, -16647, -20360, -12067, -6142, 812, 13154, 19397, 25905, 25645, 21082, 11418, 9923, 10767, 7618, -9003, -16233, -12971, 146, 8217, -1429, -644, -8423, -18930, -7714, -1358, -956, -821, -4247, -204, 7233, 20196, 10786, -4849, -16358, -13564, -16802, -14633, 876, -1959, -8416, -3330, 3979]
13784C979q565J3225R053q420p446N97m320N409L339o91J228k987n333o195j1320
13769a8447l796J065K006J917K03k823R027R042M142m154J4828J389j1405q038
13755e044K292J3843K899j0628r339O713O72m356L505P817N217o166o582o285
13741e442R37Q04m446M347N998N908J463r384k874l725k399J1448l215r224o727
13726a6531J918Q594K2893J9988l597j3812j2863M062n760J127P172k40J547M670
13712A9168j2145k0989K335L316p677j3057J0690Q914j1746J1188K894k986L386
13699f709o117L542k772j119J0969M9j3483l189J7625K845r661J931P55j0863
13685a6197r302J694J1400J0980R71p772r645J0773k129n428j0140k831N977J0646
$$ y = [3979, -4586, 8639, 17692, 9272, 1826, 2423, -1897, 3512, 6851, 6160, 7388, 4401, -932, -7127, -18447, -22243, -21178, -19172, -17255, -17052, -19875, -10848, -1806, 2336, -1818, 13010, 14399, 2994, -5044, -2752, 11091, 13990, 3362, -5977, 736, 1408, -2948, 557, 8374, 13591, 7425, 843, -5442, -4505, -3701, -8147, -3800, 2198, 8106, 9569, 185, -2689, -6414, -8813, 2635, -580, -9804, -16531, -14613, -6019, 16874, 36862, 33265, 19453, 6590, 10652, 4892, 6019, 13191, 12951, 14498, 19168, 7023, -13966, -11631, -8315, -15992, -29049, -18359, -9445, -21191, -10003, -7109, -10095, -6709, -12826, -9284, -12056, -13175, -2206, -2157, -15640, -18829, -1204, 1641, -8020, -6089, -5334, -16197, -25499, -23805, -12405, -1425, -454, -8226, -17871, -7098, -9227, -14655, -24795, -27626, -21649, -11003]
13671a1003Q753q571j2294O627o365o397J5793P456j0623J969M84n360k015p737
13657b9283r90p54O397O122n531Q15J736j1764K345O621J2006Q718r471l071Q128
13642g976N615M560k544l045K143q94J2240O893j7163q047K703K89Q067o675j2611
13627a6445m599n059J2391Q755n844P329N97R17J2163n59m687J8953j0324j9466
13613e878n596k75k080j331M632O375m859L46K622o669K163K890k101M626k787
13598g922K822J504l380R74J490J022K0101j426j2888r906l320J381l223j0422
13584b3193J044n635N694J9090K862j2029p146J0322P501J4716k055j0021p258
13571f108k5226L155J2904j5247j5880J4342J4524Q269p718N660J048J28O759
$$ y = [-11003, -2250, -10821, -23115, -16488, -22853, -29250, -13457, -6001, -16624, -14655, -14171, -19531, -21546, -29283, -30273, -31027, -24630, -18508, -24039, -23224, -21488, -33252, -30907, -24286, -12280, -3562, -13033, -16104, -7976, -2361, 2199, -345, -3390, -1247, -2141, 10099, 16992, -171, -8218, -5515, -5226, 2841, -3834, -16445, -21044, -26103, -13712, -4957, -10801, -3472, -2875, -1958, 10205, 9646, 4959, 23912, 13588, -5878, -11474, -11749, -13829, -15160, -10528, -4153, -9012, -8666, -6044, -12713, -10550, -7660, -9761, -5135, -7922, -5100, -3596, -6976, -6002, -4512, -3490, 16611, 15185, 2297, -7609, -10929, -9548, -12771, -23193, -22149, -27784, -22090, -3000, -138, -12167, -19313, -8991, -1490, 13226, 11171, 1150, -6108, -31334, -28179, -15275, -30522, -46402, -32060, -17536, -9267, -16985, -11325, -10277, -10149, -3390]
13558c390m22R77P300O666K430j3523k172M808r70J62q693j4313n576P05r818
13543c5829J1057J0087K241Q271L744O820M818J605M791j9680j4935P645J0340
13530I75K669p071K01p993j2769M984R30N732J6879M179j3495o514m675p759j1056
13515c4783r00j4257K039J4257L800N551R005Q641k189PJ799O727M432K532J4565
13500B1226O275j0324j6553m866o586K610m70P030k090k167o1O610K969j3462
13486i859O314m770L68M950q176j1641j6611k627P956R963O82j630Q929k737L986
13471a4903J7114j464j6996p664k573J6322P758L589k225O913j615J216K919j1806
13457c415j6086k297J7108Q705J220r729k737J8227P008k0540q242J3119J4238
$$ y = [-3390, -3812, -2835, 4465, 11131, 13561, 38, -2134, 2674, 1704, 1866, -6827, -21140, -26716, -26011, -35829, -24772, -14685, -12444, -4173, -429, 6391, 11209, 12814, 17605, -2075, -17010, -9365, 975, 3644, -3427, -3226, -11219, -23988, -19004, -18074, -12342, 4537, 8716, -4779, -11293, -15968, -23727, -34783, -35683, -49940, -47901, -33644, -29844, -24293, -15288, -6647, -8836, -8829, -7030, -303, 4129, 6661, 21226, 27501, 17177, 624, -4242, -10828, -8218, -8688, -1658, -3748, -5915, -5976, 634, 3603, -9859, -3545, -8315, -7947, -2997, -11173, -22814, -39425, -42052, -34096, -24133, -23451, -25081, -16152, -18889, -14903, 2211, 747, -16249, -23913, -26486, -10164, -2406, 1183, -1042, 5871, 4256, 5472, 8391, -3415, -19501, -21798, -4690, 4015, 5235, -4494, -7231, 10996, 18004, -2536, -10778, 2341, 16579]
13444A6579k757p981Q89j572l57j0221j4090N46J021P538j540q916P463M110k492
13429a1780L364P81m015J0057O424Q197k783j904r10M833L083o165m194k2093
13415a7105j3905R81J2459p60J0811J008j1583k672p148p100j0035j1590Q438
13402d8201K4959N866r370J8316J1077k079n713J3706p325P477K104m675n186
13389I56j5289J6387Q958K139j0876n745q060J426O775P545o050m86L920p659
13375f059m077Q826P087l426j4202n765J752L657K251m253l970o799K80R595J2452
13360b651l759p103N540o919P555M512J1558j278J126j5059N913K641j710o224
13346e858N366L728j6102m953J8113K554j9919J867J5253R995O986l034l908r470
$$ y = [16579, 13822, 5841, 6730, 5158, 4801, -5420, -19510, -18964, -17943, -10405, -11945, -20861, -13398, -9288, -11780, -8416, -7635, -11650, -1593, 4831, 13028, 10245, 8341, 7431, 12264, 15347, 9182, 4988, -17105, -31010, -30029, -17570, -18330, -7519, -6511, -18094, -20766, -27914, -35014, -45049, -56639, -48201, -23242, -17376, -26746, -8430, 2647, 568, -5145, 8561, 1236, 8713, 10817, 6142, 956, -14333, 2054, 11012, 13151, 2275, -3470, -11530, -10104, -3329, 4216, -1834, -2320, 1600, -6059, -10136, -1310, 5777, 2351, -11851, -17616, -15864, -12207, -9956, -14209, -18179, -24978, -24698, -15103, -2651, -6410, -13513, -7973, -14892, -7337, -2825, 8733, 7455, 8581, -6478, -565, 2076, 366, -5858, -492, 3236, -12866, -17819, 294, 2848, -17071, -15204, 49, 10044, 17030, 13996, 10088, 618]
13332F18q082l953n144j0935N445Q719J0167n020N85O572k454K560j0294r27L672
13317h471J2343O257K230j1559j8852j4615n53R042J7689p082K836J7626q47o441
13303c97j3634m640o310j6400N560K069J2282J2479K715K140L170O239L953J975
13289A1201q02m250K394n104n449k58L176J4457L430p014m746j5138o29J683r482
13274a6531L84K409m665p740O568J5817J942k0615o603N6j831L150L272J4282
13260a0105J191j8014M39K68q922o612J1193L028J0995L691M923n510m610L803
13246a4242K493K420Q845M423n749l89K305j1589J608N711n399o224j229j7930
13232c4946k664J2367N180P396J250j584P814O784K169N653J2045j787M318r229
$$ y = [618, -7464, -11417, -16561, -27496, -22051, -13332, -3165, -8185, -7600, -1028, -3482, -922, -11216, -12143, -8471, 3872, 10129, 12359, 800, -18052, -32667, -33220, -24178, -6489, -13571, -10735, 6891, 6044, -397, -14031, -18671, -24981, -41381, -35821, -33752, -21470, -8991, -6276, -4136, -966, 5273, 9226, 11201, 10399, 6149, 8543, 3439, -2010, -2268, 908, 15365, 18795, 11781, 7035, -8103, -8732, -7049, -16531, -16147, -13738, -18403, -26143, -19575, -3758, -1816, -22431, -29034, -28978, -30809, -27659, -24387, -10105, -8914, -26928, -26489, -26221, -35143, -41755, -30562, -27534, -16539, -12848, -7925, -13435, -18045, -14242, -11749, -9329, -484, 3939, -1810, -2199, 106, -11483, -9875, -4164, -9563, -15787, -17016, -34946, -37610, -25243, -20063, -12667, -11417, -13001, -5187, 1597, 3766, 9419, 21464, 19677, 23995, 14766]
13218A4766j8832p311R675J5624N370q497j0420p560M315J2570j2609o871n168
13205a4948K161O118J758J4121J899q752j1002p686m251Q790M625J2832p964K79
13191b020p177j2952O727P880p726j4460R605J4265J8369n201j4630j637R005
13178D8O826m668o664j0652l18P732N108P994J081m367l983J260k4277L655J5812
13163e413R421O633J0695l964j1246M869K457p13J929j2038p371l603r653Q689
13149i308J448o015L963M282M196R116j879j6372j469J3550Q499R229Q053k239
13135B5054J722Q11n942j0280j4925k896J887J5516O975q496N6k008J966K047
13121A1487j9346o275n534N01m20R899J1274M320O271j068j1061j3951k904Q585
$$ y = [14766, -4066, -11377, -1702, 13922, 19292, 10795, 375, -7185, -2870, 9700, -2909, -9780, -14948, -12787, -6669, -4911, 9210, 11109, 2357, -8645, -16331, -20582, -11792, -7167, 5665, -2299, -2020, -9197, -22149, -15422, -7542, -15268, -29728, -20123, -5858, 12511, 7310, -7320, -8957, 48, 6874, 2206, -4458, -15110, -15428, -7696, -2588, 5406, 6487, 2120, -1863, -603, -24880, -21225, -5413, 4008, 10641, 21336, 17372, 6126, 10995, 13452, 12739, 14668, 2630, -4741, -8344, -17997, -9308, -7860, -13875, -9912, -5630, -1434, 7682, 5803, -10569, -12038, 1512, 10011, 19240, 27293, 25054, 26776, 27587, 21645, 11365, -3560, -6456, -4569, 10947, 17922, 9426, 9482, 7474, 9440, 11487, -7859, -14134, -19668, -19167, -19587, -9688, 1586, 5906, 12177, 11109, 48, -13903, -16807, -8222]
13107h222k117l005M8j321n165r976K042J1692L224p688M227N593p129Q868O282
13092b647k0418K330j089K82J7787l111R094K64L899J965j3796j7616M537J0864
13078g655Q923L826j0573q430Q90Q598P805q535j79P98m685L272k031q962K110
13063a4828R204o834q068L758O201J2835O033k944l760l717k172P63O7K667j736
13048b531K840l663q74n715L736M076j4469j019K297P318N111p107L554J9324
13034A2878m061j8307j2489P013N386j1074j0108l988O223M556O624L428O337
13021g582O497N021j596K09q0J193o778m355P814O928r211j0497K125J0163j645
13006a794J6767K1343j5416j2555J538k183l20J2929O599k6593k706L199m011
$$ y = [-8222, -10339, -13344, -13296, -14617, -19782, -29758, -27716, -16024, -12800, -20488, -16261, -10668, -17797, -8929, -2647, -23065, -20735, -21824, -21542, -3755, -6866, 2228, 2492, 6391, 8356, -5440, -23056, -18519, -7655, 1268, 5094, -5479, -13909, -13019, -4421, 3384, -5151, -5330, -4532, -9217, -5945, -7976, -16938, -14828, -5624, -12458, -20526, -16768, -10567, 2268, 8301, 5357, 1597, -2120, -4292, -3529, -3462, -795, -2531, 309, -3354, -4228, -9943, -6207, -2131, -16600, -17619, -15322, -8004, -2893, -10000, -6446, 12878, 8817, -9490, -21979, -14966, -9580, -20654, -30762, -34750, -28527, -23971, -17347, -13919, -7582, -1085, 3936, 2340, 2549, 2469, 3662, -3116, -7471, 343, 7271, -1940, -12437, -10312, -149, -1794, 14973, 36316, 20900, 8345, 9883, 7700, 7380, 20309, 26908, 315, -2391, 808, -3203]
12993c203l57r937r705P016J0713p171N085Q288R591p962n424J466n855k122k204
12978a1781p890k217o53Q717Q496J2109M778M118l43r059j989r461j4687q142
12964b8004J4440J9568M477j1821j2493n949P171R204K023P302o324l7J963l10
12950A210r780M128p892n046k582J5402R704J215p703j447L017m955O434l796
12936b091m070L332Q412J4013r078j2456k225J0041O23j2185j3608n201O910K0003
12922B420J0150j1146j970k115O95N048j0221N01M274q640l845J2730K415M789
12908E085L620q215p710M363O713j3828L560K201o627j767j489p405P10j319o576
12893b8684O972J0886j149P575J5475P231j129k190j6995j322k503J1069K963
$$ y = [-3203, -3560, -13497, -23202, -16186, -5473, -12644, -7559, 729, 10320, 2358, -3066, -1600, -7455, -9577, -11781, -19671, -21888, -22541, -13824, -5328, 6781, 11559, 15677, 15334, 6275, 4286, -5175, -19862, -28004, -13564, 6004, 10481, -1340, -13833, -19782, -12611, -3407, -1384, 5918, -406, -443, 1520, 1210, -8570, -4442, -12334, -17380, -19962, -4560, 5144, 6359, -1344, -2791, 226, -4729, 1705, -2091, -6161, -2829, 5583, 19596, 10518, -1938, -4163, 5878, 6501, -5684, -19292, -24493, -17583, 2420, 12570, 1424, -546, -2661, -1966, 3082, -7139, -6638, -2364, -11004, -14849, -2119, 296, 5085, 8705, 490, -7220, -2857, 3856, -9972, -6412, -4211, -10838, -12605, -14094, -21499, -20789, -22108, -28684, -21712, -10826, -11975, -4400, 11075, 18306, 17177, 14987, -2008, -3330, -5833, 5236, 8199]
12880H199J1782J534q282o506l173j5376J1957j047o734R142j113j5508M159M7
12866a0919J498O852R535R125n302m624L08q507K815M906L237J90K935J92l917
12851H324j7426r239j1338n831M35N539P082j01j0826J4654J1011q292q342N849
12837a8501O011P407J236j6890J674P397J0134p057J367J2839n945p17m731P145
12823A369P961m563r630J775R110m157j6025J30m286o984N142O487N138P584j1942
12808a2891n050j265l767J5874M491j0535j0330Q022M111j2989K635J4310n259
12795a2643n26q502P13J4013J7400R929k600m629n627J5924P842j0163j2017O732
12781A5846R84k2054J36J504r682J87K565N07J5272O21j0161q466J093N385Q931
$$ y = [8199, 19981, 21515, 13233, 6727, 3554, -11822, 135, -912, -7646, 1496, 383, -15125, -10966, -10919, -9421, -2569, 6966, 16091, 10789, 6165, 6473, -2034, 781, 5687, 8924, 9114, 12049, 12241, 8324, -9102, -18341, -29679, -35510, -35075, -29536, -22454, -22555, -33381, -18727, -7716, -16008, -24350, -18501, -12490, -5083, -3847, -20737, -19063, -11666, -1532, -8589, -7222, 5617, -328, -1045, -5776, 1369, 9330, 4767, -4863, -3088, 6022, 1865, -14160, -14030, -18316, -25300, -20158, -13671, -8533, -949, -12891, -17941, -19206, -22973, -7099, -2608, -13143, -23473, -15451, -11340, -24329, -21694, -7384, -12643, -13169, -21671, -20958, -6945, 10455, 20384, 17784, 13155, 7528, 23452, 31294, 21131, 9114, 15846, 16830, -5224, -5088, -3584, -13266, -13079, -10514, -10007, 5265, 5886, -4275, -12741, -11648, -6263, 2668]
12766B668Q69j3127k3137r697J8350Q062J2378J0903L768q524J734M864L763q789
12752D085n633J2309Q708r708o772l113q819Q735K191j1481J148m302r115k9J0813
12737a0983J3380l932q78q474N383J0296n150P234J286k167o619p722R830j57
12723A327m807q645K091J3076j870j112m178q448p99J2377L929m846o579l344
12709a1828L852O066J313q781r617m137J6139j057r363L692M365R798p913j5015
12695b2486k194J1666J8677J5839k920j5725p382L407N294p193p663P29L994r96
12681f953L409K162n099O394l722p60j563L241K522m959k168o4K843Q019J1419
12666A4721m245o575K881L443N11K475k577r876P38K887Q323l530j0317j2045
$$ y = [2668, 3537, -9590, -32727, -42424, -24074, -16012, -3634, 7269, 11037, 2513, 4247, 9111, 12874, 4085, -1548, 10761, 19469, 9761, 2989, -124, -8943, -208, 1983, -9498, -8350, -12652, -21767, -21796, -10983, 2397, -1535, -2413, -10887, -5504, 4792, -358, 6876, 8162, 5995, -624, -8346, 1484, 1327, -3480, -12125, -10034, 3042, 1172, 60, -4118, -12566, -13365, -988, 2941, -1905, -8484, -11828, -7976, -1910, -597, -9378, -18995, -23132, -6993, -8050, -17413, -13721, -9356, 442, -7471, -22486, -24680, -13014, 5663, 21502, 18582, 2857, -4525, -1118, 4176, -3017, -10680, -9951, -5957, -6953, -3544, -1382, -6481, -87, -3809, -4569, -6132, -2891, -369, -5328, -7496, -7560, -4717, 3302, 14721, 10476, 3901, 6782, 10225, 10736, 13211, 10634, 758, 1496, 4383, 12706, 9176, -1141, -13186]
12652a3186r257r179J5636J1466r861j0876n716N72J2345J0866j5398n862J1218
12639a7232L076J1261N710n725j5694m90n036P298Q821N366n563R925O28j1074
12625h729k332M666j131J2977K0679R25j8801M369O339r424o841j2565J003k151
12611a1016j678K234J6784M598j580J4119K763k2935j5815j4259k220R068k34
12598b0171O743J0813n28J932j905K83l515n713k359N196L034l245m039j6234
12584b9708P037K2595K836j3551J887K257L636K130j4292j4606J1835P608J1729
12571A393P817L815J1332r70o317m617L331p201J263J860l0383j378O859N464
12557g732N274J2063J655J2246M187k0347j2175P720l586j1710K318Q386M230
$$ y = [-13186, -22443, -31622, -15986, -4520, -14381, -25257, -30973, -30401, -18056, -7190, -22588, -28450, -17232, -14156, -2895, 2815, -2910, -18604, -19094, -24130, -16832, -8011, -2645, -8208, 1717, 2345, -8729, -11061, -6395, -7526, 5451, 26130, 27055, 8254, 12623, 18962, 9538, 2697, -9868, -8865, -11016, -12694, -10460, 6324, 10922, 9342, 23461, 26224, 3289, -12526, -26785, -29005, -19937, -20171, -13428, -2615, -3143, -1211, -3116, -2833, -6348, -12061, -14420, -9224, -6190, -9435, -13474, -29708, -22671, -76, 2760, -10791, -8904, -6647, -3011, -881, -15173, -29779, -17944, -10336, 1393, 9210, 13025, 24357, 23387, 17070, 12453, 15784, 8583, 9846, 11706, -18677, -20055, -13196, -7732, -2458, 9605, 11260, 23506, 27693, 7346, -4829, 2891, -695, -12405, -10087, -1701, 2529]
12544B529L647M553O180j920o70O834k929m67j654n981M348k422j3077K63o013
12529f779M584J0381M340l313q006n762M73q431J3131J0242l128q095j1482P788
12515d057R761o761n054K462P609n616j0311R054R841J1663p736k54N193j0177
12501E617j7049k961J845J2422O012j7583o042N54O334M916O578m587O754K415
12487E225o011P57j780j6821M398o719o30R105J2773K507r407o467J4870K7699
12473B9499P808o450p846q566p615M63j0178o715p129n204M02j980M083J5373
12459d055R05j867K684q067j419R538j584p700N158l300L424O394P574n914q689
12444f918p093l107J0797N166k553m963M788M420N635k927j520j8111k369Q774
$$ y = [2529, 6176, 10729, 16909, 14989, 14319, 21153, 18224, 17757, 16103, 10122, 14470, 12048, -1029, -766, -6779, -2195, 8186, 12526, 9213, 1207, -4555, -4082, -12513, 618, 10860, 7732, -363, -11845, -4057, 5704, -1057, -6111, -3649, 3960, -1656, -11967, -2913, 6928, 18591, 10855, 10601, 15794, 5617, -11432, -14393, -12548, -126, 5886, -11697, -17739, -17185, -10851, -5935, 643, -3944, 2810, 5225, -786, -29, -1809, -18630, -14232, -20951, -21581, -12476, 297, 2804, -6603, -13070, 1800, 29499, 37307, 30857, 23011, 14445, 6830, 7293, -2885, -9600, -16729, -21933, -21531, -23511, -19428, -4055, -3150, -5017, -2333, -10400, -11819, -2281, -3865, -11565, -6407, -9707, -6283, 111, 7685, 1771, -6918, -14011, -17118, -6321, -1155, -3708, -8671, -3883, 537, 6172, 3245, 1725, -16386, -18755, -9981]
12430i981m058l795L206O755o054K816R392p111j2510n490M77L17R544L28j4535
12415c0699O07Q373Q385M426J0456J7251n524j9186p940l472n771l265K9349J4394
12401A7384j9607q465J1595K934k3171k334J2414J0926m445K495l039j7370O863
12388a3820J9502O673r873j794J232m385j0470J440Q884M821k103k374l466q727
12374a4460n36R557n433n980J1853J437j2724q957N983K591M078Q093L539J508
12360E49p482n104J500N932L279r94J781J447j8591l918Q85m132J703O742k195
12345a8598J0876R10O719J796m534Q369J1599q137j4722k633J2465J547O279R749
12331B1685l293j007j111q9j059K18J745L941Q297j341j3090n529j2337M594O073
$$ y = [-9981, -14039, -17834, -14628, -7873, -13927, -11111, -1719, -8830, -21340, -26830, -26353, -26036, -16492, -16164, -30699, -30092, -21719, -13334, -8908, 1548, 18799, 13275, -5911, -13851, -17323, -23094, -26359, 2990, 17384, -2223, -10688, 907, 3841, -19330, -21664, -9250, 1676, -2769, -274, -3313, -20683, -13820, 5682, 12355, 2482, 688, 1920, -2465, -12935, -11495, -2611, 2210, 107, -2267, -5733, -14460, -14996, -5439, -10872, -16852, -4999, -3562, -16286, -25243, -19260, -16669, -12591, -4498, -959, 549, -6933, -12037, -10537, -4605, -1326, -2320, -539, 908, -17683, -21601, -20716, -24848, -23145, -16403, -18598, -7722, -6812, -93, 1703, -2831, 5538, 17137, 9000, -5722, -8355, 4110, 5657, 11936, 21685, 18392, 17385, 16274, 16185, 15126, 15344, 17089, 21030, 29327, 27986, 14896, 9367, -2970, 1624, 7697]
12316G697J0925J06q527k4165k0812Q169q944q40J1362P474L196J790O408J4447
12302H286n065j0024j272n43L733J1238J4907n79k354J0615N862k492o085j8202
12288H025m801k1014n163J3498J4502p50O497p424l006j0908l675L842m548j0149
12274b5074r84Q460N913l4k052m701n351L894J4210N757k578N047k024k021J96
12259a342K80L736k0113q711L857J5959J2635N286j2501m060O712O172R381n645
12245A1646m218M69r062j0695k674n206K956J1722j340j1555R833P827N163J0920
12231A5786k132p773R62P942j093j594j059J3092k696M12Q515m414k6367r207
12217i626R79K4486J3652k914L73L219o349Q755k733r791r39p848j3085j969J609
$$ y = [7697, 18622, 18728, 10201, -13964, -34776, -26607, -35551, -36391, -25029, -17555, -14359, -12569, -6161, 8286, 3221, -6803, -8075, -8618, -4885, 6353, 21260, 20681, 18327, 28942, 34804, 32312, 26227, 8025, 3224, -17790, -22953, -9455, 5047, 4297, 10794, 3370, 364, -10544, -14219, -10377, -14925, -25074, -26058, -17598, -11685, -11719, -13771, -18472, -23823, -19929, -5719, 38, -2540, 2507, 483, -1538, -1342, -1062, 2674, -17439, -26150, -22293, -6334, 6301, 11587, -914, -4974, 1738, 7910, 17291, 11646, 7428, 7897, -1165, -11860, -14534, -19740, -16784, -5062, -6402, -17957, -8124, -297, 4866, 15786, 13654, 5881, 6843, 14785, 13692, 12098, 11039, 24131, 21435, 21847, 30362, 25948, -419, -9626, -8647, 15839, 29491, 26577, 26950, 30169, 23820, 32575, 29842, 20051, 19112, 11264, -1821, -3790, -2181]
12202b181k806J44R593O919j6255r983o84L406M390j0536k013J9219J8185N117
12188B2515k695n381j0090j4832j1742K0118r474r799N430O625l654O252O939
12175B12L063k930r163Q550o82J997J561l316o516O203L182j21k455N421q762
12160c756J307k316m345j25J1693N492q207j5034j847n68R439J4360p676j2934
12146a4517M319K588l529k648r772P180K2452J4706n61k786j3158l516P745k531
12132E972L497j3902q463J7611R418K194N537n256r934j1026J3415J1652l995
12119A6720K468j995p771O401N023j5605k534k839j901j224Q457J9062o0P652
12105C1854n766j5116n826J385Q788Q958o728l259o103j7882r949J3053J7599
$$ y = [-2181, -4987, -4843, 4750, 11669, -4586, -14569, -15253, -11847, -7457, -17993, -20006, -787, 17398, 22515, 19820, 14439, 4349, -10483, -22225, -2107, -11581, -21380, -15950, -9325, -12979, -6727, 212, 3275, 345, -8818, -268, -950, 1047, 2608, -708, -7224, -1021, 2161, 2040, -415, 5006, -3756, -2449, -4765, -9110, -9235, 2458, 7950, -257, -15291, -17138, -17706, -8267, 6093, -1583, -14517, -10198, -7610, -11139, -13787, -23559, -16379, 6073, 20779, 20218, 17432, 4274, 758, 8503, 5972, 9469, -4433, -12896, 4715, 14133, 16327, 21864, 16608, 6674, -4352, 9063, 20715, 16720, 19188, 17193, 9422, 15823, 20846, 5241, 2707, -132, -2033, -3257, 5200, 24262, 24202, 31854, 26088, 10972, 5146, 6531, 15319, 24277, 17549, 14290, 8187, -9695, -19644, -6591, 11008]
12092A1008L387o37p00r398j7290L327J0946J5784N529q608r728J908Q745M755
12078A9028j118j130o43j3239J039L566L374R325m939j1718j643j451M592J1648
12064A6691R647j178j4541o833k362J3196M620r023j0618O93L124Q071O387o898
12050A0976P272j5599q796q771K929N212n08m037on42O968k597j0232K295L336
12035a2100k71Q082K0120n548j0102k894r59M299O542m272j3211k755N46Q696
12021c827L55O375L735L016L581j788K742j031p892q469O522J6320J14r851j415
12006H487R265J2953N084K70o991r573j7248p312Q574J2441q013n791J7518m59
11992A9205J6723N081o362j2794j2272j4707j2407K0256J0692M555k099n596J1598
$$ y = [11008, 14395, 13758, 13058, 3660, -13630, -10303, 643, 16427, 21956, 13348, 3620, 5528, 14273, 19028, 17910, 16780, 16137, 2898, 3937, 7503, 10877, 20202, 15263, 3545, 1902, 451, 5043, 16691, 26338, 25160, 10619, 3786, 1424, 14620, 19240, 10217, -401, 292, 3416, 11487, 17874, 10976, 18248, 2649, -6147, -14918, -11989, -6777, -7285, -11322, -11328, -11870, -4902, -7499, -17731, -15436, -12100, -12371, -4289, 15831, 10283, 181, -2713, -3672, 627, 7169, 2897, -10314, -13069, -12523, -3827, -3472, 2903, 6638, 9654, 13235, 11447, 14189, 13158, 5266, -3203, 3319, 19639, 19753, 9902, 8487, 17752, 30705, 35789, 36059, 29068, 19495, 2247, -5065, 3509, 15950, 7937, 2146, 19664, 19205, 35928, 41009, 34647, 21853, 9581, -5126, -17533, 2723, 13415, 17970, 15871, 10275, 21873]
11979B1873l351r126k0629j1440J023K0807J4565m618J249K814l451J0292n739
11966A4269j7940l163J5652J3068N23m853j7779N455J0382K564K360j151l933
11953A5454j743j133m237n396j427r422q112J0911J1451L819k14O778N041Q810
11939C0580o45j2464K504j616o065P774m468N94K88n042p577p098M356M674J2787
11924A8582J346L745j0102N275r139r032K032M027R56p403M127p968O015J8682
11910B1143J5341j3548j4906j1654Q893o76o52k247l407o825J2441R911L269q683
11896H400o456N356J3565j899j0202p564n134O204J5368L955o868n897l277N294
11882A0845J1021P819J143l112r553k497j88j0126o753M885o536o233Q098J483
$$ y = [21873, 18522, 9396, -11233, -22673, -21650, -843, 13722, 9104, 10353, 13167, 9716, 20008, 14269, -3671, -6834, 8818, 21886, 22409, 17556, -223, 5232, 15614, 18178, 20538, 19387, 15454, 13711, 12578, 8341, 2945, 1518, -7904, -16016, -5105, 6346, 10165, 9951, 16729, 21770, 30580, 29935, 17471, 19975, 18359, 12294, 20068, 15600, 16194, 16482, 11440, 3863, -3235, 1121, 5795, 18582, 19928, 23673, 13571, 18846, 9707, 675, 2707, 6734, 7690, 287, 4414, -3554, 2461, 21143, 36484, 22936, 8030, -3624, 5269, 4593, 3941, 1694, -1713, -8538, 3903, 13814, 17083, 8400, 1944, 7300, 20865, 18966, 8764, 1200, -3934, 2270, 17638, 21593, 14725, 8828, 5551, 10845, 21866, 29685, 30828, 27716, 18163, 15666, 15478, 5352, -1401, 3484, -3052, -9285, -1187, 296]
11868B96O713J183R657K855j0159n062J257L899R924j877j3020L649J5562j93
11854B4684J569r023r393N70o664q630Q938O615Q828n378j4810N736N529J1522
11840B0093J1604n090r948j5970p293N262P303P186l577L449J043Q704J3250l127
11826C2889j705n657l637J96L791q082J6573M264j3475j6357o258p443l455J5678
11812G322K4349j0069M59q42l515j25M404K544R06K193k846r555m922Q803P707
11797B6813o948n059l443J4980O333M262j4950n487J2580J3164j3658p111k967
11784A8509n658P737J8129j2158j2863J463N338M814K3204P483J611M149j1526
11771E0232j0229K24O729J691O277M137J465J919J7535o064J3401P274J4583K346
$$ y = [296, 7009, 8192, 17849, 20704, 10545, 5483, 6740, 10639, 20563, 18686, 5666, 9315, 24877, 24684, 26253, 17230, 7837, 8407, 1743, -6887, 2051, 8666, 17494, 12116, -2694, 3042, 8571, 20093, 31697, 26607, 16659, 689, -6604, -1342, 5961, 13147, 9570, 13019, 14062, 22766, 36016, 32889, 31184, 25527, 21890, 22086, 25877, 17795, 34368, 38632, 25157, 8800, 2542, -4901, -8356, 7322, 31671, 21602, 22061, 21219, 17704, 17579, 21983, 24527, 25433, 27626, 24780, 15225, 10303, 19106, 26813, 19865, 14806, 11363, 26343, 32676, 36938, 21988, 16501, 29081, 42245, 28587, 21476, 18509, 12851, 20588, 38717, 26559, 13696, 15159, 20497, 25311, 48515, 55998, 57609, 61758, 50232, 40003, 40227, 46956, 48647, 54924, 59061, 60526, 62445, 79980, 73916, 87317, 94591, 109174, 111520]
11757A11520K0849J9843K2210L6302P4868Q2936J05760J23978J32094J39266J07424
11746I77050O9477K0910l4543q4575r1647j26382j33269j02708p2977o5598m0622
11735C15116l1894j0182j7334j640n516q540j6286j3138k005J376l942j1833j4922
11722A79260M805J4199M95K909J4771K1067J4548K1577J1224N848K0771M4238
11710C55712L9660M8522Q1314J21596J58842K11650K89640L74757M36728M46270
11700B564691L67546K53691J03450n4355k16396l27938l88657l87013l36086k71639
11690A307294k02004j44432j01877q5034n4372k9148k3946l6922k3037k4490k6823
11679E55209l3877m6973k8298k6876k4532k0503j7380r392j92Q851P139k767M968
$$ y = [111520, 132369, 152212, 174422, 210724, 285592, 368528, 474288, 598266, 730360, 869626, 977050, 1046527, 1067437, 1032894, 948319, 856672, 730290, 597021, 494313, 421336, 355738, 315116, 283222, 273040, 255706, 254066, 248550, 240010, 223724, 210586, 208581, 209957, 206015, 194182, 179260, 184065, 198264, 198759, 201668, 216439, 237506, 252054, 273631, 284855, 290703, 311474, 355712, 395372, 443894, 525208, 646804, 805646, 1017296, 1306936, 1681693, 2118421, 2564691, 2932237, 3185928, 3289378, 3235023, 3018627, 2690689, 2302032, 1915019, 1578933, 1307294, 1105290, 960858, 858981, 773947, 719575, 690427, 666481, 629559, 606522, 582032, 555209, 521332, 474359, 446061, 419185, 394653, 374150, 356770, 347378, 347186, 356037, 363176, 360409, 365377]
11666C65377J8588M2496L1669J6863N1521P8513Q2549J29031J96200K76523L73338
11655A662668M24486M31921M12075K96760J63180J4575j62081l13277l86699m05202
11645B138406l79259l22306k39034j77341j12524p6995o6667p9302m7569k2050
11635F15359k2751l5849l7028m3083n1450l4735k9616j9836l0268k9258k0942
11624B60543j5754k1482r013k629N421m912J230l788O99J3219L1190L1925M8251
11611C34900O4899Q2076J05332J38217J25799J35206J17356P7000K0030l7598
11601A163217r7576j29936j37834j24422r9192r7312p5148n3850l4337k5067r704
11590B78839j2605j2297m138j3634o390j3144k1440j3045p542k0445k3992p354
$$ y = [365377, 383965, 426461, 458130, 474993, 526514, 605027, 687576, 816607, 1012807, 1289330, 1662668, 2087154, 2519075, 2931150, 3227910, 3391090, 3405665, 3243584, 2930307, 2543608, 2138406, 1759147, 1436841, 1197807, 1020466, 907942, 830947, 764280, 684978, 637409, 615359, 592608, 556759, 519731, 476648, 425198, 390463, 360847, 341011, 310743, 281485, 260543, 244789, 223307, 214294, 211665, 217086, 212174, 213404, 209616, 210315, 223534, 254724, 286649, 334900, 399799, 481875, 587207, 725424, 851223, 986429, 1103785, 1180785, 1200815, 1163217, 1065641, 935705, 797871, 673449, 574257, 476945, 401797, 347947, 313610, 288543, 278839, 266234, 253937, 249799, 236165, 229775, 216631, 195191, 182146, 174604, 154159, 130167, 122813]
11578A22813N351j2531k0643j9974j0444O873Q396j3842j4010k620R397Q250J675
11565F8691m435K743j1851j713L992q91j1178j0606J2441k007M184J1278M02j1338
11551D9712k028j0600m101M394K2457m212k0472k557M559l711j0665k42Q216Q936
11537C9686m830n697j324k61m281o980M524P046M296M627m241N405O228M700L147
11522E2045n282O48n910Q03M303j257m877j1688k024J1872J7588J2751p392P892
11508F9472m871k828R371K848k713L028j5516l180r806P753J2646J6083J8102
11495A00389P642J9534L0734J3583K3614J7306J4687K9112J0971K174l0230k6054
11483B13462k0259k2739l3382o11J452o650k034j0972j3416j1522p84m79p544
$$ y = [122813, 128164, 115633, 94990, 75016, 64572, 71445, 79841, 65999, 51989, 49369, 58766, 67016, 68691, 64256, 66999, 55148, 53435, 57427, 56536, 45358, 34752, 47193, 45186, 49370, 60648, 61050, 49712, 47684, 37084, 32983, 37377, 59834, 55622, 35150, 32593, 37152, 33441, 22776, 22534, 30750, 39686, 34856, 29159, 27835, 27574, 23293, 16313, 20837, 27883, 32179, 36806, 32565, 37970, 44198, 48898, 52045, 46763, 47411, 41501, 42304, 46607, 45350, 40473, 28785, 26761, 38633, 56221, 68972, 61580, 69472, 64601, 61773, 71144, 73992, 71279, 74307, 58791, 55611, 45805, 53558, 66204, 82287, 100389, 108031, 127565, 158299, 171882, 195496, 212802, 227489, 256601, 267572, 269746, 239516, 213462, 193203, 170464, 137082, 136471, 137923, 131273, 129239, 118267, 104851, 93329, 92545, 92066, 84522]
11470H4522K553p238J4094m666L371J7971q34m097j0404N661R720k547k306n519
11456A00281K820N36m499K81L485K541J3183K6995L4958N9482O0639P6762P9463
11443D56927P7945P0786Q0932M8051J6113o799j9397o2095o3683o8848o4624o2772
11431D02536m4337o0271m7908k7597j7453p180n812q227j3855k224j42M636j937
11418A70229l90j4482o133j5801J882O172j148J544j790j3170J185o569J578L008
11404A26115K3290K1944J6612J47K7591M7782M8996P5693Q2269Q2223Q4580P8906
11392G16148L6536L0316J4116k9878n2778p0501q6135q2183o9092o4897m7322
11381B94330l7686k7555k6178r711j792j6585q764j9192j8653k763J406k377r893
$$ y = [84522, 87075, 79837, 93931, 89265, 92636, 110607, 109773, 105676, 95272, 100933, 110653, 108106, 105800, 100281, 103101, 103637, 99138, 99419, 102904, 105445, 118628, 145623, 180581, 240063, 300702, 377464, 456927, 534872, 605658, 686590, 734641, 750754, 743955, 724558, 662463, 598780, 529932, 465308, 402536, 358199, 297928, 250020, 222423, 204970, 197790, 191978, 183751, 169896, 167672, 167530, 172166, 170229, 169839, 155357, 149224, 133423, 135305, 141477, 140329, 141873, 140083, 126913, 128098, 121529, 123107, 126115, 149405, 171349, 187961, 188108, 215699, 263481, 312477, 388170, 470439, 552662, 637242, 716148, 752684, 783000, 797116, 767238, 714460, 643959, 557824, 475641, 406549, 341652, 294330, 256644, 229089, 202911, 193200, 191408, 174823, 166059, 146867, 128214, 125451, 126857, 124480, 114587]
11368A14587Q104J621j0237j1136j2946N193N897p604p592L776J9340R660m114
11355A14549J232J1558J0304N143J0786K5038L2518K9628K4391J2834R737L3317
11343C21035K1238J1303q532j4734n701j3392m2432n2336l6480k3618j7882o708
11331A31761k3140k919l070j1923k575R262j2546k3R049Q5j3988j3749r484M043
11317F0783J7212O904J915m572n734j341p778p536J4444N157l504Q647J1129k004
11303I3722l204Q749j504k465j564J3167J2851J8146N686J1436R446K387j1447
11290A55406M508J4140n85j4332j3624o882j6277k2647k3216o973k055N93q175
11277E9881k357L907j0870O302J093p470K022l29k029J586q18o710O208R139p600
$$ y = [114587, 122691, 124312, 114075, 102939, 89993, 95186, 101083, 93479, 85887, 89663, 109003, 118663, 114549, 115781, 127339, 137643, 142786, 153572, 178610, 211128, 240756, 265147, 277981, 287718, 321035, 342273, 353576, 345044, 330310, 324609, 311217, 268785, 216449, 179969, 156351, 138469, 131761, 108621, 105702, 102632, 90709, 88134, 97396, 84850, 84827, 93876, 93961, 79973, 66224, 56740, 60783, 77995, 84899, 86814, 82242, 76508, 75167, 67389, 59853, 74297, 79454, 75950, 84597, 95726, 93722, 90518, 99267, 97763, 95298, 93734, 106901, 119752, 137898, 143584, 155020, 164466, 166853, 155406, 159914, 174054, 173469, 159137, 145513, 138631, 122354, 99707, 76491, 69518, 67463, 68056, 59881, 57524, 61431, 50561, 56863, 57956, 50486, 52508, 52179, 50150, 51736, 50918, 44208, 50416, 59555, 51955]
11262E1955N656K180l182l398N334J3139Q984l857o184Q265j583J0987J0822R922
11248A09040J4685J9610J7266J2360K7395O191o32r739K681j0308k3441j2154
11236A52954j6158k1120j0366J338r253j1416k568j0459n620m668j8556o159N845
11223D3794P183O584O697l587L120J009M413j973N296j848M636k636J7319J8120
11209A08127m136q834R386J655j741L986L620K474l940L250J1646J1332K3358
11196A60183K446J3659J6876J9421Q583j2588k851J4715m521j1795p919m287r81
11183A90941N48n707o554k0493k205m065L029Q792r059n016j28J4062M885J2440
11169A81470J0239O790O227L779o55J0180M769P215N381J0958N878J2082p676
$$ y = [51955, 57611, 59791, 56609, 53211, 58545, 71684, 80668, 76811, 70627, 78892, 77309, 88296, 99118, 109040, 123725, 143335, 160601, 172961, 200356, 206547, 205915, 196176, 198857, 188549, 165108, 152954, 136796, 115676, 105310, 106648, 97395, 85979, 83411, 72952, 67332, 62664, 44108, 37949, 43794, 50977, 57561, 64258, 60671, 63791, 64800, 69213, 67240, 72536, 70688, 75324, 72688, 90007, 108127, 103991, 95157, 104543, 106198, 104457, 108443, 112063, 114537, 110597, 113847, 125493, 136825, 160183, 162629, 176288, 193164, 212585, 221168, 208580, 205729, 220444, 215923, 204128, 196209, 191922, 190941, 191489, 185782, 179228, 158735, 156530, 152465, 155494, 164286, 155227, 150211, 150083, 164145, 169030, 181470, 191709, 198499, 204726, 208505, 207850, 218030, 222799, 230014, 235395, 246353, 252231, 264313, 256637]
11156B56637P688Q492p00P637N21K0080K5911J0005J1623P194K5336L2906K2411
11143D35741K8622n121J0875K0487J0112J9152J1482l290j2045N211J0294J789
11131E33309N952K170L951K430J4559J7630L1463L9452M1458M1118M3363M0168
11119H17023N2699N2115N3362N4469O3350O3073O0456R6326J21264J39331J61524
11108A734992J99081K39912K64468K94851L20146L59835L85488M14811M52128
11099D665712N49749P00508R20110J257501J799238K551632L426696M212046M679831
11090B4763023M790585M603206M086650L068016J507033k55604j883574l014365
11082C7664970l779019m142713m215693l917899l305038k502950j777224j256245
$$ y = [256637, 264325, 272817, 272117, 279754, 280275, 300355, 326266, 336271, 347894, 355088, 380424, 413330, 435741, 464363, 459242, 470117, 490604, 500716, 519868, 531350, 528060, 516015, 521226, 531520, 533309, 539261, 541431, 545382, 547812, 562371, 580001, 611464, 650916, 692374, 733492, 776855, 817023, 869722, 921837, 975199, 1029668, 1093018, 1156091, 1216547, 1312873, 1434137, 1573468, 1734992, 1934073, 2173985, 2438453, 2733304, 3053450, 3413285, 3798773, 4213584, 4665712, 5215461, 5915969, 6836079, 8093580, 9892818, 12444450, 15871146, 20083192, 24763023, 29553608, 34156814, 38243464, 41311480, 42818513, 42562909, 40679335, 37664970, 33885951, 29743238, 25527545, 21609646, 18304608, 15801658, 14024434, 12768189]
11074A2768189r10797o55647n09842m35334l96562l68290l69047l73755l64263
11065H384652l19739k68343j66637m4604J05878K70332M14124N62600O90887P99621
11055A0428771Q84781R78297J102285J255100J519983J929576K565625L541641
11047B4206059N034515P239773J0000326J2687826J4291992J4867661J4358304
11040A02686456J3040854J0288465N997925K99795n137288r034449j1533437j2852140
11032I3756181j3435646j2839364j1185832q609693o195027m408329l184264k382092
11024C1515934j856622j561352j457239j450493j483599j514931j520771j472759
11016A9198168j380736j224364j016563p55273m84767k18009N456K06146L92238
$$ y = [12768189, 11857392, 11201745, 10691903, 10256569, 9860007, 9491717, 9122670, 8748915, 8384652, 8064913, 7796570, 7629933, 7585329, 7691207, 7961539, 8375663, 8938263, 9629150, 10428771, 11313552, 12291849, 13394134, 14649234, 16169217, 18098793, 20664418, 24206059, 29240574, 36480347, 46480673, 59168499, 73460491, 88328152, 102686456, 115727310, 126015775, 132013700, 132313495, 127176207, 118141758, 106608321, 93756181, 80320535, 67481171, 56295339, 47685646, 41490619, 37082290, 33898026, 31515934, 29659312, 28097960, 26640721, 25190228, 23706629, 22191698, 20670927, 19198168, 17817432, 16593068, 15576505, 14821232, 14336465, 14118456, 14123912, 14330058, 14722296]
11007A4722296N53627O83158Q42828J034759J299229J705651K334309L288649
10999B6464506M737111O885772R683628J2586942J4491729J5269297J4936318
10992A05055303J3705248J1230409O982321J386117m591575q827244j1746296
10985A13194283j3242802j4064522j3644994j2153227r589264o955047m961717
10978C8582710l590211k689912k096994j766637j624652j613785j656340j707788
10970B1836391j725247j692597j636843j502592j341392j164751r57893p63629
10962A1051447n82278m29451k86261j95802r1400k686Q6113K10490L83299O24997
10952A0768468R53067J427791K162429L147953M135199M846297N147676N133981
$$ y = [14722296, 15275923, 15959081, 16801909, 17836668, 19135897, 20841548, 23175857, 26464506, 31201617, 38087389, 47771017, 60357959, 74849688, 90118985, 105055303, 118760551, 129990960, 136973281, 138359398, 133767823, 124940579, 113194283, 99951481, 85886959, 72241965, 60088738, 50499474, 43544427, 38582710, 34992499, 32302587, 30205593, 28438956, 26814304, 25200519, 23544179, 21836391, 20111144, 18418547, 16781704, 15279112, 13937720, 12772969, 11815076, 11051447, 10469169, 10039718, 9753457, 9557655, 9466255, 9463569, 9549682, 9760172, 10143471, 10768468, 11721535, 13149326, 15311755, 18459708, 22594907, 27441204, 32588880, 37722861]
10944C7722861M762041L995881K575123O67918j285235k806511l826510m407557
10936C7398011m695291m595956m078163l275083k427810j748336j314222j056962
10928A4206188q95860q21917q04794q13744q15956q24178q18358p75435p38056
10919F897890o82406o09773n44669m75821m07408l61674l23585k77360k42131
10910B973063k27572j95174j81826j51469j53065j53711j46207j18443j12156
10901A533440r3457r2699q6537p7878p6345q3348o4325o2230n5526m7988m5442
10890G47665n1426o0211m2459k7236j5278r475p201q42j3265l035q44r209j4028
10877D93156j063m990o812m800q411j5028r614n731k694r857m107M074L131M108
$$ y = [37722861, 42484902, 46480783, 49055906, 49723824, 48438589, 45632078, 41805568, 37398011, 32702720, 28106764, 24028601, 20753518, 18325708, 16577372, 15263150, 14206188, 13310328, 12488411, 11683617, 10869873, 10053917, 9229739, 8411381, 7635946, 6897890, 6215484, 5605711, 5061042, 4585221, 4177813, 3816139, 3492554, 3215194, 2973063, 2745491, 2550317, 2368491, 2217022, 2063957, 1910246, 1764039, 1645596, 1533440, 1439983, 1347284, 1260747, 1182869, 1106524, 1023176, 958851, 896621, 841095, 793107, 747665, 696239, 636028, 593569, 566333, 551055, 541580, 534379, 533537, 520272, 517237, 516393, 507184, 493156, 492093, 487103, 480291, 475491, 467080, 452052, 442438, 436707, 434013, 424156, 420049, 424123, 427254, 431362]
10863D31362K579J102m617j1132j6654q003o206k62j284j4495O953j3766r951
10850C55626r741r920L58j4535k1538j9034k0915l433p987n844K911k586o338
10837B37024k799P090J375J6026J782N364n36l415Q616K592l31R150j6905j5513
10823B49520j2247n274N200m998J3270L040p490j1570k944J830n096P448L588
10810B34277m534L775N533K606p960l211j556j1655j0930j0625J054k354p665
10797A86755n789m216j1777k1126n089J2041J3698J3652j8189j1613m492j580
10785A42275M895L646k758M75K500R571M592k378j4259j1938p477j6502q182N789
10771A10249J2M083P019N180L003k326J4080k526j9292N472J0138K094N663k590
$$ y = [431362, 433941, 435043, 430426, 419294, 402640, 394637, 388431, 388169, 386885, 372390, 379343, 365577, 355626, 345885, 335965, 336323, 321788, 300250, 281216, 260301, 256868, 248881, 243037, 245948, 243362, 237024, 234225, 241315, 242690, 258716, 260498, 265862, 265326, 261911, 270527, 273119, 272788, 281938, 265033, 249520, 237273, 231999, 237199, 232201, 245471, 248511, 241021, 229451, 226507, 228337, 223241, 230689, 234277, 229743, 233518, 239051, 241657, 233697, 230486, 228930, 217275, 206345, 195720, 196774, 194420, 186755, 180966, 176750, 164973, 143847, 138758, 150799, 164497, 178149, 159960, 148347, 143855, 142275, 147170, 150816, 148058, 148533, 151033, 160604, 165196, 162818, 148559, 136621, 129144, 112642, 104460, 110249, 110261, 114344, 121363, 126543, 129546, 127220, 141300, 138774, 119482, 124954, 135092, 137186, 142849, 140259]
10757A40259j3691l946L303k493K485L729l449n641M289J3330Q994j5594m6P028
10743A38557K726j4441j7991j4554o055j615Q357l019p704p141J152m910q350
10730F5012p190n156o808m089J4713J023q669j1153O645K4103P2n49m067q657
10716E5230L333m987J1711N182n288j0856J778R767j155j0466k8J9924Q226o767
10702G5604l072j1260j305N73K1117J4220k802j643k965L024p70P324j805J5918
10688A12158K2613J1088P906J1057K5952R270L113Q342L311K811M723l956j0273
10675B08115p651j3466k4211k3531j5910q91k1337j8074N69N635j1846l68j4942
10662F2092Q601J5215R713o38o874j2568o423p715n364P437K3763J7919M383R60
$$ y = [140259, 126568, 122622, 125925, 123432, 125917, 129646, 126197, 120556, 124845, 138175, 147169, 131575, 131529, 138557, 141283, 126842, 108851, 94297, 88242, 86627, 94984, 91965, 84261, 77120, 78272, 73362, 65012, 57822, 52666, 45858, 41769, 56482, 57505, 48836, 37683, 44328, 68431, 68503, 67954, 63887, 55230, 58563, 53576, 65287, 70469, 65181, 54325, 56103, 65870, 64715, 54249, 54221, 74145, 82371, 75604, 72532, 61272, 59967, 60540, 81657, 95877, 93075, 91432, 88467, 91491, 90721, 98045, 96240, 112158, 134771, 145859, 153765, 164822, 190774, 200044, 203157, 211499, 214810, 217621, 222344, 218388, 208115, 200464, 186998, 162787, 139256, 123346, 122455, 101118, 83044, 83613, 89248, 77402, 77034, 62092, 70693, 85908, 95621, 94983, 88109, 75541, 69118, 61403, 56039, 63476, 87239, 105158, 109541, 110501]
10648A10501J455K755j2087M522J4113O199Q311L4438K9104L5360M4579O6620
10636C45870P9048P6814O5860O5726N6323L2949j1770l3428l2888m6718o6008
10625E31778n6499o7249n8682n6941n1498l1477j9655p075j6772j3548R807J7529
10613A79718p707k1012k2918j3236o192L499k483J383k500j0417M807K825l262
10600A02505q4J4719P98J675J6903J9582J0292J1625K4968K6429M1081O8183P9967
10587D18643Q2874Q1084P9061P1334L0105J2841j3901l2863m8421m8326n8851
10576E73580o2340m6231m6314m1252l1515k0336j0447o226l71J0652K6006N2092
10564C97298R4987J37437J62094J82539K00442J68834J78652J61038J38746O9614
$$ y = [110501, 111956, 114711, 102624, 107146, 121259, 127458, 135769, 170207, 199311, 234671, 279250, 345870, 424918, 501732, 567592, 633318, 689641, 722590, 710820, 677392, 644504, 597786, 531778, 475279, 408030, 349348, 292407, 240909, 209432, 189777, 182702, 165930, 152382, 162189, 179718, 172011, 150999, 128081, 114845, 108653, 112152, 109669, 111052, 108552, 98135, 102942, 105767, 102505, 102421, 117140, 117938, 119613, 136516, 156098, 166390, 178015, 202983, 229412, 270493, 338676, 418643, 501517, 582601, 661662, 732996, 763101, 775942, 762041, 729178, 680757, 632431, 573580, 511240, 465009, 418695, 377443, 345928, 325592, 315145, 308919, 308548, 319200, 345206, 397298, 492285, 629722, 791816, 974355, 1174797, 1343631, 1522283, 1683321, 1822067, 1891681]
10554A891681l6346q1127j16543j45803j69816j89409j89944j66854j14016q4731
10544E97092n9879k7963j0861o318J0167J536j0292o526M703m174l074l3624l7833
10531D12954m3450l4131l6641m4145k4257o590j9124m3707l3186L422j9825p137
10519A04183N651o776j0082q295j1917k3306j073l526L3k628J4679P304r377m597
10505E0273J399p069j4236J0613K021n289r292n219l567Q86m472o863j1328M643
10491B500N840Q238K2913J5206J895k837j1639p086n564j5240Q75J1596N699r060
10477B3336j1523l394O697N31k638K0472J6055J7302J1272Q784j5296q277K497
10464F5818J5490K2786K2761L3697L9264N5901O3353M2329N3309N6866N4975L9582
$$ y = [1891681, 1855335, 1774208, 1657665, 1511862, 1342046, 1152637, 962693, 795839, 681823, 597092, 537213, 509250, 498389, 492071, 502238, 503774, 493482, 486956, 491659, 487485, 484411, 450787, 412954, 369504, 335373, 298732, 254587, 230330, 223740, 204616, 160909, 127723, 131145, 111320, 104183, 109834, 103058, 92976, 84681, 72764, 49458, 48385, 44859, 44892, 42264, 56943, 64247, 54870, 50273, 51672, 44603, 30367, 40980, 43001, 37712, 28420, 23201, 19634, 20520, 16048, 9185, -2143, 2500, 8340, 16578, 39491, 54697, 56592, 53755, 42116, 35030, 29466, 14226, 15101, 26697, 32396, 23336, 11813, 8419, 15116, 15647, 13009, 33481, 49536, 66838, 78110, 86894, 71598, 63321, 65818, 81308, 104094, 126855, 160552, 199816, 255717, 319070, 361399, 414708, 471574, 526549, 566131]
10452E66131K8848n223k4703j7120j6356k0102j7367J327K3991O8409R2840J08343
10440G89018J64046J95034J92911K07085K10006K21601J67760J05490N8455M1755
10430B353161o923o8847j46094j90205j75227j82620j95911j92367j56051j31399
10420I07517j09484j03264r4744n1398k9532k4738l5353m1935l1807k4600l6273
10409C24389l7775k7309k6547k7889j9638j1758j5450j5276l2268j0885N081J03
10397A04778j8670j9266m498m874Q46l142o222J1899J04j6718j2596k059n554
10384B4028M387K819l576k984N402J4507j1275k907O798o307J000l649J882R41
10370C1066r150j3240j1139o52K3313J511J161p247R91q191o065m967R93j4133
$$ y = [566131, 594979, 589756, 565053, 547933, 531577, 511475, 494108, 495435, 519426, 587835, 680675, 789018, 953064, 1148098, 1341009, 1548094, 1758100, 1979701, 2147461, 2252951, 2311406, 2353161, 2346238, 2277391, 2131297, 1941092, 1765865, 1583245, 1387334, 1194967, 1038916, 907517, 798033, 694769, 600025, 548627, 519095, 494357, 459004, 417069, 385262, 360662, 324389, 286614, 259305, 232758, 204869, 185231, 173473, 158023, 142747, 110479, 99594, 104675, 104778, 86108, 66842, 62344, 57470, 58316, 55174, 48952, 60851, 60955, 44237, 31641, 29582, 24028, 28415, 31234, 27658, 24674, 30076, 44583, 33308, 30401, 37199, 30892, 31892, 28243, 30125, 31066, 21916, 8676, -2463, -3115, 20198, 21709, 22870, 15623, 16614, 8423, 2358, -2609, -1616, -15749]
10356a5749j0749O293K1760J8876J0906j5233l907J3315R965K686l507m480J765
10343C1941j4692q207Q814o390m055J826j374J655K813O228J0280R104J4441L566
10329E5950j018M026J4386j1684j4620L94m723m031l607j1880j238R128k268j0338
10315A8477j3102K053r828J868J8181P583m107O766q515j0592k347k553l003l201
10301b320k935o818o19O061k301O017J3131J0536j0044J790j909k1826j1847J5213
10287g871J6068j6386L323l80j3814k962N3J437Q850J1989Q864J543m277m112
10273B325j4461M152Q523M946M071L111N09p041l19O574N933p501P041k012m622
10258A1229N593n233j9995K67L501o098M962L551k071m985J0373M805K0N128J883
$$ y = [-15749, -26498, -20205, 1555, 20431, 31337, 16104, 12197, 25512, 35477, 38163, 34656, 30176, 31941, 17249, 9042, 17856, 11466, 7411, 9237, 7863, 9518, 12331, 18559, 28839, 37943, 52384, 55950, 54932, 58958, 73344, 61660, 47040, 47434, 42711, 38680, 35073, 23193, 21955, 31083, 28815, 18477, 5375, 7428, -2400, -532, 17649, 25232, 21125, 27891, 19376, 8784, 6437, 3884, 881, -2320, -5255, -12073, -12692, -6631, -8932, -2915, 10216, 20752, 10708, 12498, 10589, -11237, -23084, -7871, 8197, -8189, -4866, -5246, -19060, -22022, -21969, -20532, -11682, 307, 9171, 10714, 6437, 2325, -12136, -7984, 539, 5485, 9556, 12667, 13176, 6135, 5816, 12390, 18323, 10822, 17863, 15851, 11229, 16822, 11589, -8406, -8139, -4638, -10736, -5774, -2223, -4294, -9279, 1094, 5899, 5919, 11047, 12930]
10243A2930J493K026j898l245j0002N570O217k102r13J048n022n628O702n862
10229A314l931J3029L165l482l573L021n291j2540j670J701j277n640J7808R096
10215A1730j791N609J856l728M300J711J046k238J703k797L428M591j4232j282
10201I906j91p849K306R998o706j5555n145R207J0045J123k727q318o752M031
10187f627M19L365q21P701j812n406n16L275m178K248L961r491J3984oj4354o960
10171a5218N450P935O010J6803J1827k09r061q042m659o192M281l504L204p824
10157H01j8394j7486J8720O272m840k114O154M09R434K0056N946N06n496J391
10143B1359j463K325n282j0601Q306O984j0374n590O162m48k563k369j3790n377
$$ y = [12930, 14423, 16449, 14551, 11306, 1304, 6874, 13091, 10989, 10076, 11124, 6102, 474, 7176, 1314, -2617, 10412, 13577, 10095, 6522, 9543, 4252, -8288, -9958, -8257, -9534, -15174, 2634, 11730, 9939, 15548, 17404, 13676, 17976, 19687, 20733, 18495, 20198, 17401, 20829, 25420, 11188, 9906, 9715, 1866, 4172, 14170, 7464, -8091, -13236, -4029, 6016, 7139, 4412, -3906, -10658, -6627, -6208, -2843, -3664, 4037, 2225, -3181, -3697, -422, -4600, -2352, 1609, -7882, 6102, 6096, -8258, -15218, -9768, -1833, 4177, 20980, 32807, 32598, 23537, 15495, 10836, 4644, 8925, 5421, 8625, 801, -17593, -35079, -16359, -10087, -14927, -17041, -10887, -10478, -1044, 19012, 24958, 25464, 19968, 21359, 19896, 22221, 16939, 6338, 14644, 21628, 11254, 5664, 11826, 11378, 8815, 6446, -7344, -12721]
10129a2721l237j452K344k229o366Q116J0239M003M673l281m550l910J5768J3207
10115B0604j100k3268j1074p602O730K0190J2846j1508j8239j475j968p439J350
10102b1953r545L222K1557K8594m92k007L697j5378q261O555N912k054N710l384
10088A2173j1138R011P714p825RJ447L010J2549j0503j150J4333O492Jj3045L149
10073B6227o132k0291Q719O30m620O50J179P935k860Q229j5210k3967j263J8150
10059b624n88L312M344L37R488M058o599P27o184m115N452O317K385O490O726
10044B9526j2114k2390J64O478J53l207j028J4308R934j1164K374l364j611N934
10030A3993N528J3418o319q993j7039j2144n283n19K567J2670M280m102o854J1264
$$ y = [-12721, -15958, -17410, -15066, -17295, -23661, -15545, -5306, -1303, 3370, 89, -4461, -8371, 7397, 20604, 19504, -3764, -14838, -22440, -15710, 4480, 17326, 5818, -12421, -13896, -15864, -23303, -21953, -31498, -28276, -6719, 21875, 21383, 19376, 23073, 7695, -566, 5989, 11901, 9847, 15557, 12173, 1035, 10046, 17760, 9935, 9944, 11391, 14401, 26950, 16447, 15297, 29630, 36122, 36123, 23078, 26227, 20095, -196, 8523, 9153, 4533, 5183, 6362, 14297, 11437, 19666, 4456, -19511, -20774, -2624, -3212, 100, 4444, 4781, 14269, 18327, 11728, 12455, 6271, 2156, 7608, 13925, 16310, 22800, 29526, 17412, -4978, -4814, 1664, 1817, -1390, -2418, 11890, 21824, 10660, 13034, 9670, 8059, 13993, 19521, 32939, 26620, 17627, 588, -11556, -16839, -17358, -14791, -2121, 2159, -1943, -8797, 2467]
10016B467l822K866j591K702o641k667O157R326Q265L360P683O0j6919q233r588
10001f575p506J6031J4250m670O154q132j6503m22M090J5631J483k672m692J519
9987G986r569r514P453J1729j34K988Q675m220J681o958n095Q889Q877o34j3055
9972I099M470Q16L618L26M088J4339J147j8038j1323J059O65l65N38n80m171Q823
9956A4511L46p802O044J439m336j2827l445L625K890J1885N068J887O242L014
9942B8541k274K414l754j5502j4293P426M928k443j2193N480O193J1494k887p86
9928A2344J787o144o9R055L019K599n564j0544r79J0475N188N974n982n927J0046
9913B5278O363N538k974j2089j4270p8L972n542M165O119o615P056O891L796r577
$$ y = [2467, -1355, 1511, -80, 2622, -4019, -6686, -529, 8797, 17062, 20422, 28105, 28165, 11246, 3013, -6575, -14081, 1950, 16200, 11530, 17684, 9552, -6951, -7373, -3283, 12348, 13831, 11159, 6467, 7986, -1583, -11097, -3644, 8085, 7951, 10939, 19614, 15394, 17075, 10117, 5022, 13911, 22788, 22154, 9099, 13569, 14385, 18003, 18329, 22417, 36756, 37903, 19865, 8542, 9601, 10266, 9901, 10439, 9859, 5688, 14511, 14857, 7055, 13099, 14538, 10202, -2625, -6070, -2445, 445, 12330, 17398, 19285, 25527, 28541, 26267, 28681, 24927, 9425, -4868, 2558, 7486, 5043, -7150, -1670, 4523, 16017, 13130, 12344, 14131, 7987, 7918, 16973, 19992, 22591, 17027, 6483, 5504, 15979, 21167, 27141, 21159, 15232, 25278, 31641, 37179, 34205, 22116, 7846, 7768, 11740, 6198, 10363, 16482, 9867, 16923, 23814, 27610, 18033]
9898A8033j2036m362M576L512J276r424j2189m062L075R198L448P900P963M879
9884B1787j660Q783J0421O92j1377j0874r394N228p643M679k225j059O131Q302
9870B1791R028l954J546j3723j2894m237L428r09l990L951N367L885M265L537
9856A7091n117j9684p591R804J4598K5130q150j4583M885J2591o738j9747k163
9843C26M698j965M23j0535l466o677L383J333J878J3579O777l411n61j381J5046
9828A9447M026j0837j0494j4311p672J0768J1937J0142k009O758j725m221O616
9815A8425o909j0359j258J087J647K821K1003R952k0280j3032r442p363m256J271
9801a6693R495K0999Q874r18q347M706o43j186k382l175J3088O257j1085r624
$$ y = [18033, 5997, 1635, 6211, 9723, 10999, 1575, -10614, -14676, -11601, -2403, 1045, 8945, 16908, 21787, 20127, 28910, 39331, 40023, 28646, 17772, 8378, 13606, 5963, 10642, 8417, 7358, 13489, 21791, 30819, 26865, 28411, 14688, 1794, -2443, 985, 76, -3914, 37, 5404, 9289, 13554, 17091, 11974, -7710, -15301, -5497, 9101, 34231, 26081, 11498, 16383, 28974, 22236, 2489, 326, 5024, 3059, 3482, -7053, -10519, -17196, -13813, -12480, -10602, 2977, 9754, 6343, 5782, 4401, 19447, 23473, 12636, 2142, -12169, -19841, -9073, 2864, 13006, 10997, 17755, 16030, 11809, 18425, 11516, 1157, -101, 986, 2633, 5454, 26457, 36409, 16129, 3097, -6345, -13708, -17964, -16693, -7198, 13801, 22675, 21757, 13410, 18116, 17473, 16287, 13905, 10730, 23818, 30075, 18990, 9366]
9787I366p646l044L443j551o547q411O621K325k40K415M948P921m609N508N836
9772A6335j0110j0285M372J231l825q554K065M562j887Q069k50Q85j4961n468
9758a7821J3166l83L894J4617r427N709K597q088r488J5091J3524Oj0522M031
9744A6906L729M48K564j830m006r062j4267m277J4956j776q883J0091J7450q098
9730A3945k087p953j4068J865J2508N150R335J5641q35k0692r711j0368L486J8615
9716A4831p909j182m342l434R69P142J6845N196k124o174j512m011M888q9l921
9701A5173q437l339r31L335J3004r177j2515J602J617l158N288P294j2099l891
9687f234Q67K146O174J1157L497l78l520L650N383O578m952j4013L983k736n464
$$ y = [9366, 1720, -1324, 2119, 568, -5979, -14390, -7769, -5444, -5684, -3269, 1679, 9600, 4991, 10499, 16335, 6225, -4060, 312, 1543, -2282, -10836, -8771, -4209, -6096, 1973, 1723, 2608, -12353, -17821, -4655, -5038, -1144, 13473, 4046, 9755, 12352, 4264, -5224, 9867, 23391, 23397, 12875, 16906, 20635, 21083, 23647, 21817, 17811, 8749, -5518, -9795, 5161, 3385, -5498, 4593, 22043, 13945, 11858, 3905, -10163, -8298, 4210, 9360, 18695, 34336, 33501, 12809, 3098, -7270, -3784, 14831, 6922, 5740, 1398, -2036, -1067, 6075, 22920, 28116, 25992, 19818, 18306, 14295, 19183, 19094, 15173, 6736, 3397, 2466, 5801, 18805, 9628, -2887, -1285, 332, -2826, 2462, 9756, -2343, -6234, -5367, -3221, 2953, 14110, 17607, 17229, 13709, 17359, 22742, 29320, 24368, 10355, 14338, 11602, 6138]
9672F138Q946J000j0638k462r769M855J2297J0454M897J527k320j9581j0789p35
9658f180j1064j483J8497J1878N661P296j0823J570M805R50l393r024n654J354
9644D390n42l618m747l207J5686M562L277k518r038o346R26J1342j563K538k292
9629H850j0142M549J320j274M054M125L345q137l816l152K744N918l770q235J2956
9614I335J2417K595p446M588k62o922j476j911J6373l721j0529n304J014L665
9600A2416J2289O168j2015l462l969l131L828o293p354M321J4386j0547l932m40
9586B265M324J7067j4107j9302q19J1658k652l788L056K169R664R376k858J607
9572A7660M740P157k963p212j3398L39N238M158M483l422L909L88M607O902M383
$$ y = [6138, 15084, 16084, 5446, 2984, -6785, -1930, 10367, 20821, 25718, 27245, 24925, 5344, -5445, -6180, -17244, -18727, -230, 11648, 17309, 24605, 13782, 15352, 20157, 21107, 17714, 8690, 3036, 4390, 3848, 230, -4517, -7724, 7962, 12524, 15801, 13283, 4245, -2101, -1175, 10167, 8604, 11142, 8850, -1292, 3257, 4577, 3303, 7357, 11482, 14827, 6690, 2874, -278, 2466, 8384, 4614, -3621, 9335, 21752, 24347, 16901, 21489, 21227, 14305, 12829, 10918, 27291, 23570, 13041, 7737, 8751, 12416, 24705, 30873, 18858, 15396, 11427, 8296, 12124, 5831, -1523, 2798, 17184, 6637, 2705, 2265, 6589, 23656, 9549, -9753, -10572, 1086, -1566, -5354, -2298, -129, 9535, 18911, 16053, 17660, 22400, 29557, 26594, 19382, 5984, 6323, 11561, 15719, 20202, 16780, 20689, 21077, 25684, 32586, 36969]
9557C6969n568j1862j320j1232J941J8425O621M385n515j3151j5396m365M594
9544D526n94L906Q036l414p84n778m232n149K166n817N396L167J1472m099q825
9529b3P15J6967J3394l813p195n806L384k469L339j1345P059J725M65n927k796
9514G674P627M051n937r920J539k500P873J0348J656k360j2226J758L389R741
9500B2713O043N7j8608K613R142J1719Q42P050M265o103k30j3321j4323j6418
9486d559K328J7440M531k0904J3446J0635J4569O501j3075n691k405K363k314
9473B2865N085M281o92p784o112m241Q094K861O033J348K340N498K252m655q467
9458B8706o097L866j760q823L939J1648k459J804K0967P013P936j706j994J604
$$ y = [36969, 31401, 19539, 18219, 6987, 8928, 27353, 33974, 38359, 32844, 19693, 4297, -68, 4526, 3932, 7838, 15874, 12460, 11676, 5898, 1666, -3483, -1317, -7134, -1738, 1429, 12901, 8802, -23, 692, 17659, 31053, 27240, 20045, 14239, 17623, 15154, 18493, 7148, 14207, 15932, 16397, 10470, 7674, 15301, 19352, 13415, 3495, 5034, 2534, 10407, 20755, 22411, 20051, 7825, 9583, 12972, 22713, 28756, 28813, 10205, 12818, 21960, 33679, 34521, 41571, 45836, 39733, 39503, 26182, 11859, -4559, -2231, 15209, 19740, -1164, 12282, 22917, 37486, 43987, 30912, 25221, 22816, 25179, 22865, 27950, 32231, 31539, 23755, 17643, 13402, 21496, 24357, 30390, 31738, 34078, 39576, 41828, 37173, 28706, 22609, 26475, 24715, 15892, 19831, 31479, 29020, 30824, 51791, 58804, 66740, 65034, 63040, 64644]
9444F4644q708Q36P354O421l372k048l666j7545l524o559N732l376n772O037q249
9429B8205m540j7634K126p9J3802K5898r666j5231j3514P588J0663M93p577k406
9415A8128l553J387J5622O884J205P209q768k5549J9460K5689j0774P63N277M608
9401E7588Q443K957k5545k2429o325Q708M149P226k535r270J371n617o321P456
9387A9856M497J6163J476q690j4616m392L802R943K3880Q054j074j4602k4750
9374A9547o143O783J646n251J6989J706j2114j1026N900N222M004q656o310o611
9360E686J0389K721N625j635Q184N555N092m823L884L866k129j0927p699j461
9346B2328k2502J3073J1087R704M407p349j0997J9056N047m236M431j0284m945
$$ y = [64644, 55936, 56772, 64126, 70547, 67175, 65127, 61461, 43916, 40392, 33833, 39565, 36189, 30417, 36454, 28205, 23665, 6031, 8157, 8078, 21880, 47778, 38112, 22881, 9367, 16955, 27618, 28111, 20534, 18128, 14575, 15962, 31584, 38468, 39673, 46882, 38114, 12565, 32025, 57714, 46940, 47703, 52980, 57588, 66031, 68988, 43443, 21014, 14689, 23397, 27546, 34772, 32237, 22967, 24338, 18721, 12400, 19856, 24353, 40516, 41992, 33302, 18686, 14294, 18096, 28039, 51919, 59973, 58899, 44297, 19547, 13404, 20187, 21833, 16582, 33571, 35277, 23163, 12137, 18037, 23259, 27263, 18607, 12297, 5686, 16075, 18796, 24421, 22786, 30970, 36525, 41617, 36794, 40678, 44544, 42415, 31488, 23789, 22328, -174, 12899, 23986, 33690, 38097, 30748, 19751, 38807, 43854, 39618, 44049, 33765, 28820]
9333B8820n903l404J2990L410n661q553M775M152R502K512j5035R803l312l299
9319C0797j0099j922o963J198l75J904J2090j418l83J2759N637M823j610r434
9305C7004o976m152q535R2K343n181J0927J5027J349p187J632k398j3714p623
9291A2608Q402J7728k801p409O11Q303K010l737k0582j2459o012K5540J0561M852
9277C7615k465L776j5052j6847M318J1229N216m194J7527Q740o224j1115P141
9264C9665J2472L926j3532m608L17K104m542n599K3147J8030j3997j797M37l532
9250E2491N820k0596j9423j807j201J4533R395L449P954Q139p605j0684o825O16
9236C4256J638Q936R599p069j6228L459M705J216J5615N734L489n057n122J1339
$$ y = [28820, 22917, 19513, 32503, 35913, 30252, 21699, 26474, 30626, 40128, 42640, 27605, 37408, 34096, 30797, 20698, 18776, 11813, 13011, 12636, 14540, 26630, 25212, 24829, 37588, 43225, 48048, 46438, 37004, 30028, 25876, 17341, 17433, 19776, 14595, 25522, 40549, 41898, 34711, 36343, 33945, 20231, 12608, 21010, 38738, 35937, 28528, 29139, 37442, 39452, 35715, 15133, 2674, -3338, 22202, 32763, 37615, 35150, 38926, 23874, 7027, 11345, 22574, 27790, 23596, 41123, 49863, 43639, 32524, 39665, 52137, 56063, 42531, 37923, 38240, 40344, 35802, 30203, 53350, 71380, 57383, 55586, 56023, 52491, 58311, 37715, 18292, 16485, 15284, 29817, 39212, 42661, 50615, 58754, 51149, 40465, 33640, 34256, 35894, 44830, 54429, 47360, 31132, 34591, 39296, 40512, 56127, 61861, 65350, 60293, 55171, 66510]
9222F6510J0774O979m205j9313M259J8921P862Q976Q308O347q075j7703k0825
9209F8815l926j1434j504Q315J4231m630j1036J4711L840l890M980q392k337k869
9195F4874M036O282L11Q175R94j80J4117O710O804J2848j4817k2547j1793R557
9181H5371j0032l952l059J4662M293J0954J6686K3247J7285J0795q347k031L451
9168A59323m618J5410J2092j1964j1149O000K2520K84p925k61J3874J0094O178
9155B09858K785J2990K5516K3639M0428M4009L5862N1453O3652P0556N3807Q8910
9143G23465J36396J55767J81688K50227L97232N72835R19016J648439L074864
9134H059929M309334J353930k892958k992125j937529j273080r25089o67829m68763
$$ y = [66510, 77284, 84263, 80058, 60745, 65004, 83925, 91787, 100763, 109071, 115418, 107343, 89640, 68815, 64889, 53455, 51951, 60266, 74497, 69867, 58831, 73542, 77382, 73492, 78472, 70080, 67743, 64874, 68910, 75192, 75503, 83678, 84672, 84492, 98609, 105319, 112123, 124971, 110154, 87607, 75814, 85371, 75339, 71387, 68328, 82990, 87283, 98237, 114923, 138170, 155455, 166250, 157903, 155872, 159323, 154705, 170115, 182207, 170243, 159094, 165094, 187614, 187898, 179973, 179712, 193586, 203680, 209858, 212643, 225633, 251149, 274788, 315216, 359225, 395087, 446540, 510192, 580748, 634555, 723465, 859861, 1015628, 1197316, 1447543, 1844775, 2417610, 3336626, 4985065, 8059929, 12369263, 13723193, 10830235, 7838110, 5900581, 4627501, 3702412, 3034583, 2565820]
9125B565820l31415k32449j98927j58237j05301o1709m4099m0895o6834j08688
9115A217266j27909r3019o8797m1731j8837j7906L276M5117J10423K07256K26401
9104A441540R8453j05538k20871k34700j75555j38425j09343o9635n3341m6529
9094C86056l6956j0485l830O830j1518p727j3315j3708j7138q540j193n380j2195
9081B50901j2197l581r681J336J4907m05k2631j2868J5607M902J6642O241J3109
9068B62282K1737J3592J0372K7422L8797M6571Q0428J13073J54773K72966M57774
9057A499787N96009L74991j11455m16345m32253l24767k23087j56912j00001q8589
9047F17378o5850n9228m0434k3896j9542l118j0822k3455k2736j9075l4225l8688
$$ y = [2565820, 2234405, 2001956, 1803029, 1644792, 1539491, 1477782, 1433683, 1392788, 1325954, 1217266, 1089357, 996338, 927541, 885810, 866973, 849067, 852343, 897460, 1007883, 1215139, 1441540, 1539993, 1434455, 1213584, 978884, 803329, 664904, 555561, 485926, 432585, 386056, 349100, 338615, 334785, 341615, 330097, 322370, 309055, 295347, 278209, 269669, 268476, 263096, 250901, 238704, 235123, 225442, 226778, 241685, 241280, 218649, 205781, 221388, 226290, 242932, 249173, 262282, 284019, 297611, 307983, 335405, 374202, 420773, 501201, 614274, 769047, 1042013, 1499787, 2095796, 2470787, 2359332, 1942987, 1510734, 1185967, 962880, 805968, 705967, 617378, 551528, 492300, 451866, 427970, 408428, 405310, 394488, 371033, 348297, 329222, 294997, 256309]
9035B56309k3419m500l029l275j6328j3375j254l397j086J49l6J2924J7218n52
9021B16349N206K1929J7432K5765K4912K3191K0544J1757J9545N7988J21913J88798
9009G55329K42581K01892K1065j59789k36283j72727j21939r5025n7410m2604
8999C35090k9278l5183k9235L932J4361o361p600j0585j2408k7977j8552j1103
8987A65101k6836j2397J995J818J981j259K941o511j116J4321L998m197j927r773
8973A28139K422P506J4374J3924K9124K3994n85k0957k6417l3774j0681j527J5774
8960A41316L0611M1324O0635M8454L3873l3039p5611p5274m4103p248p665j866
8948A11407K887M121j241l233R246O340P908j1401j8247o174r563J1776K0720
$$ y = [256309, 232890, 228390, 225361, 222086, 205758, 192383, 191129, 187732, 186646, 186795, 186759, 199683, 216901, 216349, 221555, 243484, 260916, 286681, 311593, 334784, 355328, 367085, 386630, 444618, 566531, 755329, 997910, 1199802, 1220867, 1061078, 824795, 652068, 530129, 435104, 377694, 335090, 305812, 270629, 241394, 245326, 259687, 253326, 245726, 235141, 222733, 194756, 176204, 165101, 138265, 125868, 127863, 129681, 131662, 130403, 133344, 126833, 125717, 140038, 144036, 139839, 137912, 128139, 130561, 138067, 152441, 166365, 195489, 219483, 218898, 197941, 171524, 137750, 127069, 125542, 141316, 171927, 213251, 273886, 322340, 356213, 323174, 247563, 172289, 128186, 120938, 113273, 111407, 114294, 118415, 117174, 113941, 123187, 129527, 137435, 126034, 107787, 101613, 92050, 103826, 124546]
8935A24546J7896J3307p866j5460o190k1474j7628l538K20J6767Q651K1129K4482
8922A54842J2881n50l135l466j155o098k1480n667r441o85N1880J18297J29182
8909D15405Q9363N8703m8168j44600j25700q9779l4482O115K6185O311l127O463
8897A62689K323l0170k8556n838J4727J0533J595Q80j136k4724j794P326n650
8884A02205j163L49R509n307J113M719R443K815P125O404O429L791J3595J0780
8870A71807j1850j0058j5546j0745J502R004L8494O4264N7884N1100M0862P411
8858C94129m1379l7731m2864k6194k3015P374J1989J4327R993m227n1267p4715
8846A36420k3401K3783L7845K283j5227j2666q433l533J9632K5604J1180L7753
$$ y = [124546, 142442, 155749, 147883, 132423, 126233, 104759, 87131, 83593, 83813, 100580, 109231, 130360, 154842, 167723, 167173, 164038, 160572, 159417, 153319, 131839, 126172, 116731, 116046, 167926, 286223, 415405, 504768, 563471, 515303, 370703, 245003, 155224, 120742, 126857, 153042, 159353, 156226, 162689, 165012, 134842, 106286, 100448, 115175, 125708, 127303, 128183, 127047, 102323, 100529, 107855, 102205, 101042, 101391, 110900, 105593, 106706, 111425, 120868, 123683, 130808, 137212, 143641, 147432, 161027, 171807, 159957, 149899, 134353, 123608, 125110, 134114, 172608, 236872, 294756, 345856, 386718, 394129, 352750, 315019, 272155, 245961, 222946, 230320, 242309, 256636, 266629, 262402, 211135, 136420, 113019, 136802, 174647, 176930, 161703, 149037, 140604, 137071, 156703, 182307, 193487, 231240]
8834B31240N4633L4570K1915L0577L9052L8427K4356L1427L9935M4967L9370L6052
8822F66521O6240J01834J30982J86663K78306M23122P04897J099353J260564O69230
8812E587712m30348r63724q81933o51566m62009l16409k25170j50193j16634q1042
8802A308684o1989k8393m851k3728l7794l5951n7986p8471o2538m3144m2059k7231
8790H04549k062k0340Q034J8442K8427M2873M6246O1007Q1378O8104O3570Q6418
8778A286646Q0907N9094O9542J01886J57217K21301L11912M40125O75334J133846
8768D537810J933004K744751K033908m52366k000489j904461j384242r45393o27274
8759C935248m21984k99032k40213j95852j29588o9591n717L8642P483o5352j39468
$$ y = [231240, 285873, 320443, 342358, 372935, 411987, 450414, 474770, 506197, 546132, 591099, 630469, 666521, 732761, 834595, 965577, 1152240, 1430546, 1853668, 2558565, 3657918, 4918482, 5587712, 5157364, 4193640, 3311707, 2660141, 2198132, 1881723, 1656553, 1506360, 1389726, 1308684, 1246695, 1218302, 1213451, 1189723, 1151929, 1115978, 1057992, 979521, 916983, 873839, 831780, 804549, 802487, 782147, 790181, 808623, 837050, 879923, 926169, 987176, 1068554, 1136658, 1200228, 1286646, 1367553, 1426647, 1496189, 1598075, 1755292, 1976593, 2288505, 2728630, 3403964, 4537810, 6470814, 9215565, 11249473, 10797107, 8796618, 6892157, 5507915, 4562522, 3935248, 3513264, 3214232, 2974019, 2778167, 2648579, 2578988, 2573271, 2611913, 2619396, 2554044, 2414576]
8748B414576j41308j17722o4416j0089L8097N3008J8059J9387L0919M5345Q7194
8737B373050J39473J72664J79244J68947J48016J72422J98008J82576J73493K04565
8727D112458K91167M32108O00739Q13182J070766J438149J990366K585655K588495
8718A5923085J599573O19417M95093R32471J584554K399717L479234M978977P133254
8709C9145375J0540005J6428061K6841809M2698091N4434298L8143473o708943
8702B21522169m0023345m2783966l2352447k2744153j6019601j1267533p968136
8695D8362988n762768m196579k961690j906873j047935m28948l88544j089837
8687C0579814k016378k466430k332667j980018j656617j377862j154854r73880
$$ y = [2414576, 2273268, 2155546, 2091130, 2081041, 2119138, 2172146, 2190205, 2209592, 2240511, 2285856, 2373050, 2512523, 2685187, 2864431, 3033378, 3181394, 3353816, 3551824, 3734400, 3907893, 4112458, 4403625, 4835733, 5436472, 6249654, 7320420, 8758569, 10748935, 13334590, 15923085, 17522658, 18142075, 18637168, 19569639, 21154193, 23553910, 27033144, 32012121, 39145375, 49685380, 66113441, 92955250, 135653341, 190087639, 228231112, 221522169, 181498824, 138714858, 106362411, 83618258, 67598657, 56331124, 48362988, 42600220, 38403641, 35441951, 33535078, 32487143, 32058195, 31669651, 30579814, 28563436, 26097006, 23764339, 21784321, 20127704, 18749842, 17594988, 16621108]
8679A6621108p24962l92685j5486L61253P62599J240273J841761K443580K509313
8670B4646754K145882K147823K351019K762524L485265M656920O341388Q739815
8662E7277390J2320796J7954509K7650974M5700685P8453332J16510503R3438579
8655D49306768j0297684q1844763q5766336o4201769m5232065l2013632k2675729
8648A07274790j6164457j1705442q554399o099591m053923k286511q95769o15590
8640E6899108k212688m353063n264005m998427m312550l643721l073875k619351
8632B6421428k316476k029072j676975j313904r55804o12244k91003P3340M30849
8623A7730139O53752O13595N54640O87405R43900J276246J802562K600855L778168
$$ y = [16621108, 15896146, 15503461, 15487975, 15849228, 16611827, 17852100, 19693861, 22137441, 24646754, 26792636, 28940459, 31291478, 34054002, 37539267, 42196187, 48537575, 57277390, 69598186, 87552695, 115203669, 160904354, 239357686, 355868189, 449306768, 439009084, 357164321, 271397985, 207196216, 161964151, 129950519, 107274790, 91110333, 79404891, 70850492, 64750901, 60696978, 58410467, 57514698, 56899108, 54686420, 50333357, 45069352, 40070925, 35758375, 32114654, 29040779, 26421428, 24104952, 22075880, 20398905, 19085001, 18129197, 17516953, 17225950, 17299290, 17730139, 18383891, 18997486, 19552126, 20239531, 21183431, 22459677, 24262239, 26863094, 30641262]
8614C0641262N459007P983073J2198992J9736111L2691534M7967788M6342074
8607B03019841J1029869k9684132m2063799l4282438k4245915j7053780j2043719
8600E4675927q530546o150044m527862l275466k229435j375383p27384m94475
8592B7365332r80990j915971k506140k519445k222007j894340j615124j386075
8584A2325240j207519j081315r57784q40769p09517o03150n46294n10582m32766
8575E435544l61698l24149l30520l25630l11502k64164k43678k09996j63933j41605
8565B758669j48357j78480k06297j77806j43585j17237j01487j08243j32756j39154
8555A305267j22436r2754p9587l7600J092j4249k4882O193J6870N494j5859k2970
$$ y = [30641262, 36100269, 44083342, 56282334, 76018445, 108709979, 156677767, 203019841, 214049710, 184365578, 142301779, 108019341, 83773426, 66719646, 54675927, 46145381, 39995337, 35467475, 32192009, 29962574, 28587191, 27859807, 27365332, 26384342, 24468371, 21962231, 19442786, 17220779, 15326439, 13711315, 12325240, 11117721, 10036406, 9078622, 8237853, 7528336, 6925186, 6378892, 5868310, 5435544, 5073846, 4749697, 4419177, 4093547, 3782045, 3517881, 3274203, 3064207, 2900274, 2758669, 2610312, 2431832, 2225535, 2047729, 1904144, 1786907, 1685420, 1577177, 1444421, 1305267, 1182831, 1090077, 1010490, 972890, 973982, 959733, 934851, 941044, 957914, 963408, 947549, 924579]
8543I24579j0459q882l9949j9977j6574l6401M498L582k5861l549J9037R615L1182
8530H30841M7282L4476l71l8389n5746m8778n2038k8922k6284j9268j9382r135
8518F14286l800q143k1523m466j9950m6381m4714l5720q201J6801K3887r300l0162
8505D22614j3216o183j7718k6782O338M3194L2674K6056K2508J0323K2716K842
8493E25366j2857k8098j4559j105L284P82n896q753j4983O766P890J1945P712
8480D77494R52j6686k5864j8848k0202m010L293J5246K4125J3304k1042n2019
8468C75743j2256K4703M3916q66p4258q3361l6111k796J1489J7121J8981L1818
8456C14123q207k9610j9077r256m432J7536J2755p933n522J6610J7457P983K997
$$ y = [924579, 914120, 905238, 865289, 845312, 828738, 792337, 796835, 800417, 774556, 771007, 790044, 799659, 830841, 878123, 912599, 912228, 873839, 818093, 769315, 717277, 688355, 662071, 642803, 623421, 614286, 610486, 602343, 580820, 576354, 556404, 510023, 465309, 429589, 421388, 438189, 462076, 452776, 422614, 409398, 403215, 385497, 358715, 365053, 408247, 440921, 466977, 489485, 499808, 522524, 525366, 512509, 484411, 469852, 468747, 472031, 472813, 466917, 458164, 443181, 449947, 457837, 469782, 477494, 478446, 461760, 435896, 417048, 396846, 392836, 396129, 411375, 435500, 448804, 427762, 375743, 363487, 388190, 432106, 431240, 356982, 273621, 237510, 234714, 246203, 263324, 282305, 314123, 305916, 276306, 257229, 247973, 243541, 261077, 273832, 265899, 260377, 276987, 294444, 302427, 305424]
8443C05424k401j2166j5256k7939j5070L187J6796j905j6114J0007n623N666Q615
8430B53221n682J2242K035k1870p228M395O205r222j104J391n875M644o660p314
8416B19178m613l2545k8095j2693N319L777K8606K0206J0189P557K964K164j6365
8403B05649j4965j3717k9079j6972K0619K2964k976k1125k3044j7506j5975j288
8391I2585N988L012m497J6143J6912q440P016J2411L804P532j430O40N575J830
8377A59081n557j2630j0950Q669K295j1402j6143M225R838o30J464q392o609K2313
8363A35572J9269L0756J5343o990j1507m213o027k5290k0242k4640k0839m437
8351G6755J1246J9676n112r192j5896j6075l9104j6522J1578K7826O630n722J4261
$$ y = [305424, 303023, 290857, 275601, 247662, 232592, 235779, 252575, 250670, 234556, 244563, 238940, 244606, 253221, 247539, 259781, 261816, 239946, 232718, 237113, 243318, 234096, 232992, 234383, 228508, 233152, 226492, 219178, 214565, 182020, 153925, 141232, 146551, 150328, 178934, 199140, 209329, 216886, 219850, 222014, 205649, 190684, 176967, 147888, 130916, 151535, 174499, 171523, 150398, 127354, 109848, 93873, 92585, 98573, 101585, 97088, 113231, 130143, 121703, 128719, 141130, 144934, 152466, 151036, 151676, 157251, 159081, 153524, 140894, 129944, 138613, 140908, 129506, 113363, 117588, 127426, 126796, 128260, 119868, 113259, 135572, 154841, 185597, 200940, 193950, 182443, 178230, 172203, 146913, 126671, 102031, 81192, 76755, 88001, 107677, 102565, 93373, 77477, 61402, 22298, 5776, 17354, 45180, 51810, 46088, 60349]
8338F0349P612q117k504m562J4758Q253m886j1114M531K2391L969J2680J3346
8325A16706P877J805M411N62K118O094k097m675R29j342j946K5765J4494J925
8311A72626J5571n145r188J0637K2470K3476J3627L5506N0406P7506J57714K24162
8299G89368K78034J95632n4614k41453k15530j55207j18475q6887o6908m5615
8289B78345k7310l6619k5999n382J5251j675r753l572o019R582l497j1495j8406
8276A53451j4560q64p247q687J435J0673m06j5830m817J4386L2983K3674K4363
8263B08554J4950Q650J3218K476K0653L2849M0310O2792J08065J56918K43901
8252I13336M28715O22941M91254p6854m45899m38645l30440k37457j60554j18355
$$ y = [60349, 67961, 59844, 57340, 52778, 67536, 75789, 70903, 59789, 64320, 86711, 90680, 103360, 116706, 124583, 126388, 130799, 131361, 133479, 139573, 137476, 132801, 133730, 132388, 130442, 156207, 170701, 172626, 188197, 183052, 173864, 184501, 206971, 230447, 244074, 279580, 329986, 407492, 565206, 789368, 1067402, 1263034, 1208420, 966967, 751437, 596230, 477755, 390868, 323960, 278345, 251035, 214416, 188417, 183035, 198286, 196611, 186858, 183286, 177267, 186849, 183352, 171857, 153451, 138891, 138027, 130780, 122093, 123528, 134201, 133795, 117965, 113148, 127534, 160517, 184191, 208554, 223504, 232154, 245372, 247848, 268501, 301350, 341660, 404452, 512517, 669435, 913336, 1342051, 1964992, 2456246, 2379392, 1933493, 1494848, 1164408, 926951, 766397, 648042]
8242F48042r4232o1726o0850m4532l7000k5615j1041r724j3190j7612k7637l0989
8230B13894j7696j7693j2841j6825j7199j3781j671k220p34j0753N914L392M196
8217A15983K798J4081J0881l37n88J3694K5342K1956J3290J0766L1939P1289J11253
8204D42347J75831K52864K36310M7654j50893k03538j54656j20876q6047p0177
8194C68819o3334l3240k6118q132k9349m0980j4413k6499j6711j767q735j9111
8182H0430j2102J275M927r170j7470j7744j0748j634O525J201J0475P385J2175
8169E5525O454j2089O502k65o400o810l014j0077k2285j690M247O858J5892k099
8155C0749O94N1P18q546N36L237K608p10M438j0890M951N340J1906j479j9563
$$ y = [648042, 553810, 492084, 431234, 386702, 349702, 324087, 313046, 303322, 290132, 272520, 244883, 213894, 196198, 178505, 165664, 148839, 131640, 117859, 116188, 113968, 113234, 102481, 108395, 111787, 115983, 118781, 132862, 143743, 143406, 142818, 156512, 181854, 203810, 217100, 227866, 259805, 331094, 442347, 618178, 871042, 1107352, 1155006, 1004113, 800575, 645919, 525043, 438996, 368819, 305485, 272245, 246127, 237995, 208646, 167666, 153253, 126754, 110043, 108276, 99541, 80430, 68328, 69603, 74530, 65360, 47890, 30146, 19398, 17764, 24289, 25490, 35965, 43350, 55525, 61979, 49890, 56392, 56127, 49727, 42917, 39903, 29826, 7541, 5851, 10098, 16956, 32848, 30749, 31443, 31494, 32212, 23666, 24202, 27439, 30047, 29337, 33775, 22885, 27836, 33176, 45082, 43603, 24040]
8140B4040o527j0591O805k898L735P585J808K22j0551k63L052M897l037q609J926
8125A1594P253q374M609j4593q635k341L580L322O602m453N518J2649M66r959
8111G238J05n128k312J2993J6047Q781j8238q862K505o64k124k350j925k022Q273
8096A2317J6527k003j1471Q771j2447P452o783n488N352r56k372l955P145M96
8082A2585l689O072O076m932L443Q359K525k39j2137j2079J0503J1190j12L359
8068C0924K767L887j1728J1245K650k2547r654j4093o854K855J12L183K153O280
8054A180J1600M317o199l541m592P212N806N674k567j709J2799j0214j5050O982
8040A1698K054j1311M00J337j6760q06J1372J2112l029L614J409K131J788k985
$$ y = [24040, 17513, 6922, 13727, 10829, 14564, 22149, 23957, 24179, 13628, 13365, 16417, 21314, 18277, 9668, 11594, 18847, 10473, 15082, 489, -8146, -10487, -6907, -3585, 3017, -1436, 4082, 16731, 17197, 7238, 7343, 2215, -97, 12896, 28943, 37724, 19486, 10624, 13129, 12465, 10341, 7991, 6066, 4044, 12317, 28844, 26841, 15370, 24141, 11694, 19146, 12363, 6875, 12227, 11271, 8899, 4944, 12089, 12585, 8896, 14968, 21044, 16112, 19555, 27914, 30439, 30200, 18063, 5984, 16487, 27677, 27565, 30924, 33691, 37578, 25850, 37095, 39745, 17198, 7544, -6549, -13403, -10548, -10436, -7253, -5100, 1180, 12780, 17097, 10898, 7357, 2765, 9977, 15783, 21457, 18890, 17181, 29980, 19766, 4716, 11698, 13752, 2441, 2841, 4178, -12582, -13388, -2016, 10096, 7067, 10681, 12090, 14221, 16009, 13024]
8026A3024r559j180K19J3851J973o83q398L485K717L527J431k245r893o842m231
8011b804n278R501P245j537K82K763J550K670m708n47j0079j590K702J1901Q121
7996B0192q796l855l982J375k981N836m366N91Q20n079q463K947P954O886O964
7981A6043j976q395K779J5981r10k0745r444J4630P443L237J4233m499j5032N794
7967A9139N865p863j575L703O67n062q624l576M413J4666k467R407O782O48n801
7952C0322K540n346j494J3299o891j4227j0530j644K45N479Q335J1809l096K292
7938C1093k900p1l177o981M440l556j5676p97K1925J484o054Q669J842j560n222
7923B3459k0120j1744K15N821K2603m599m849j1296j0781O14N138m277j905J1137
$$ y = [13024, 3465, 2285, 2504, 16355, 18328, 17645, 9247, 12732, 15449, 18976, 20407, 18162, 8269, 1427, -2804, -8082, 1419, 8664, 7127, 7409, 10172, 11722, 14392, 9684, 9137, -942, -2532, 170, 12071, 20192, 11396, 7541, 3559, 4934, 1953, 7789, 3423, 4014, 4834, -245, -8708, -5761, 2193, 9079, 16043, 14067, 5672, 8451, 24432, 23522, 2777, -6667, 7963, 15406, 18643, 32876, 28377, 13345, 19139, 25004, 17141, 15566, 19269, 19936, 14874, 6250, 2674, 7087, 21753, 19286, 28693, 35475, 36123, 30322, 32862, 27516, 26022, 39321, 32430, 18203, 7673, 6029, 6274, 11753, 20088, 31897, 28801, 31093, 28193, 28122, 24945, 17964, 22404, 18848, 3172, 2375, 24300, 25784, 19730, 28399, 30241, 28681, 23459, 3339, -8405, -8190, -2369, 20234, 15635, 10786, -510, -11291, -10677, -5539, -9816, -11721, -584]
7909e84P41P659J896P063J729N189L596Q78L448j2212r812O778J1696l050j0309
7894A4706m834p565n024r5k786k85J3690L935M054r313k1827k334J2428P706K515
7879D971p628j5508p20N920P491j1005N704K993R610J3007j4504j3548R99j96
7865a2414J1754J6757o08j3003l527L638o026J271O233k824N359O393m964j2577
7851d538j0617J4100M610P097K4583N472p406j0254L778j993r412L417m901r603
7837D333l40M150l289j2272k983K580M250P223j894k683q075K853R141M613k722
7822D885r223N0p907K404j5293N802O752J8708Q347j8252M593J1956P79j6326
7808b725j6805k497Q128K2256O979k973o623j3824k687j349K869o359j0841K211
$$ y = [-584, 157, 7816, 9712, 16775, 18504, 23693, 27289, 28167, 31615, 19403, 9591, 16369, 28065, 25015, 14706, 9872, 2307, -2717, -2812, -5598, -5883, 7807, 11742, 15796, 6483, -15344, -17678, -5250, 2456, 4971, -2657, -18165, -18885, -12965, -5474, -16479, -10775, -7782, 1828, 14835, 331, -13217, -12218, -12414, -660, 16097, 15489, 2486, -1041, 2597, -3429, -2158, 4075, 1251, 6610, 13003, 8039, -4538, -15155, -1055, 3555, 10652, 35235, 40707, 33301, 23047, 26825, 24832, 15420, 18837, 13936, 4333, 3993, 8143, 4854, -7418, -10401, -7821, -3571, 3652, 1758, -925, -9000, -6147, 2994, 7607, 4885, -4338, -4288, -12195, -9791, -25084, -19282, -12530, 6178, 14525, -3727, 866, 12822, 13601, -2725, -19530, -22027, -13899, 8357, 15336, 12363, 5740, -8084, -10771, -12120, -9251, -15610, -26451, -24240]
7794b4240P265n402m718K0326O831K043J0204K143l979r546j5042l72l135l736
7780b1358O522P875J7608n376j063l666k816L170j2900q686k5643p677K2075J4548
7766a7387J5300K922n774q525l940Q604K4198J0999M994n769j3494r881O349L052
7752A1648O886J148j5223n644j4318q437j350J6889J1112r297j4972r90J1187
7739a1361J4490m945p194J372L180p321j0662K396R268j1588o63J7376M171j1842
7725a3323m04L600J7531j3052r249o08N724J0352R066Q549M551n874l369K328
7711A5822m710l053j59L37p254j0277r659r338J5131J4266J874j6205P472O865
7697A112q077R184J3041M016K009o164p626o7K863q964n021R250o673k875J0488
$$ y = [-24240, -16975, -22377, -27095, -6769, 62, 2105, 12309, 14452, 10473, 927, -14115, -14487, -17622, -21358, -14836, -6961, 10647, 5271, 4208, 542, -2274, 896, -12004, -20690, -46333, -54010, -31935, -17387, -2087, 835, -4939, -13464, -17404, -8800, 15398, 26397, 31391, 25622, 12128, 2247, 8596, 11648, 18534, 19682, 4459, -1185, -15503, -23940, -25290, -8401, 2711, -6586, -21558, -22548, -11361, 3129, -1816, -9010, -7638, -4458, -11779, -22441, -20045, -10777, -22365, -23028, -5652, -1481, -13323, -13727, -10127, 7404, -5648, -14897, -15505, -9781, 571, 9637, 18186, 22737, 16863, 13494, 15822, 11112, 8059, 7900, 8237, 983, -9294, -18953, -28291, -13160, 1106, 2980, -13225, -5753, 1112, -6965, 2219, 15260, 19276, 21285, 15121, 7495, 7428, 10291, 1327, -3694, 5556, -1117, -3992, 6496]
7682F496Q980M13m987J364l379k603j212q074P398J6012o427p005l705n902o488
7667i119J293K420L973M834o140n320M605n481O145O409l892K285j0863M46j2455
7652b0860J0119N046j122M72J0740J750L925K454K243q28n081j2940k297k865
7638i244n155J9J896J0683O884O873L771l38K700J101K134K1o216N203j2007j8397
7622a0072M806O316k457l082N522K133o058p918O3p613K058J5069o905n833O425
7607g546O337J4797j756j0027q312m188M200n70j2405n854J2123J6753L554J373
7593H479R578n347j0340k033l55K575m969j4012J9558m966l840j372J246K330
7579c468K572N302K951Q224r217j2426j0763j1002O183J3041R151q008J068O559
$$ y = [6496, 15476, 15889, 10902, 12266, 8887, 6284, 5072, -3002, 4396, 20408, 13981, 6976, 3271, -2631, -9119, -7826, -5406, -1433, 3401, -2739, -8059, -3454, -8935, -2790, 3619, -273, 2012, -8851, -8405, -20860, -10741, -5695, -6817, -6345, 4395, 6145, 10070, 12524, 14767, 13939, 8858, -4082, -6379, -9244, -14399, -14380, -12484, -1801, 5083, 11956, 15727, 15389, 18089, 19190, 21324, 21345, 15129, 20332, 8325, -10072, -5266, 1050, -1407, -4489, 1033, 3166, -2892, -10810, -10747, -18360, -16302, -1233, -8138, -13971, -7546, -1209, 13588, 11832, 1805, -6507, -10695, -6495, -7065, -19470, -25324, -13201, 3552, 7106, 8479, 18057, 12710, 2370, 337, -18, 2557, -2412, -16424, 3134, -1832, -5672, -7044, -5798, -3468, -896, 4406, 7357, 15581, 6364, -6062, -16825, -27827, -21644, -8603, 548, -7460, -6392, 167]
7565A67K826q281j420p006J484R579j304L412j2278j028q935j481L526Q191J1450
7550a098L348k0162j4409J6599J39m867j938J4714J757j8070r116J0420J1968
7537a0715J4637P21J427m25j717j5026K266N333l958k635Q368M45L367n41K922
7522D469k082k689o15r711m211Q935m125n458j729K430J623M948R986K099Q0l338
7506F12J89K862l604L68m831n627J1502J6868o627j3924M00n919M489Q047J1996
7491A6801j3470j1291J1593l822j425o642R331j97J434k99n158m594O728O55O763
7476F407j53J39M437j518L58K4l319j5351l826K734R988J3752n243r51J0146M5
7460A7669j1775j0874q322p704K751m681N011J1003L667k796k95K309q126n355
$$ y = [167, 2993, -5288, -6708, -13714, -12230, -2651, -3955, -543, -12821, -13849, -22784, -24265, -20739, -12548, -1098, 2250, -17912, -32321, -15722, -15583, -20450, -22388, -7674, -5917, -23987, -33103, -22683, -10715, 3922, 4643, 6070, 5645, 3928, -11098, -8832, -3499, -7457, -10092, -1724, -1279, 2088, 1547, 4469, 2387, -302, -917, -10628, -14839, -5904, -10029, -15487, -17216, -14786, -13163, -8215, 1771, 3870, 3950, 612, 801, 3663, 59, 427, -4404, -10031, 1471, 18339, 11712, -2212, -1812, -7731, -3242, 4805, 16801, 3331, -7960, 3633, -189, -1614, -8256, 1075, 878, 2312, 2013, -3145, -7739, -1011, -356, 6407, 6254, 6393, 10830, 9312, 9670, 9694, 6375, -8976, -12802, -10068, -80, 13672, 8429, 7478, 17624, 17669, 5894, -4980, -13302, -21006, -18255, -22936, -17925, -6922, -3255, -6051, -6346, -4037, -12163, -17518]
7446a7518p111l295R672m309J2550J5184J132r90n83k501M015J887p822l190j545
7431d424o614l468K131P662K697k301m834Q542l196n955J1475j1680o910N163
7417a1712J6939m814P077q813M673p259j0799N268J2738J399M649L190k668o867
7403C001q379M92K611K970j556j3469J3426R956r551m737k071j0414J776k021
7389a7966J447k049k920j811Q043R302m99J4289l483j1224R035R440j656J694
7375A1642o542p33M779r463j0579j2881M396J5782M234N034M389p102l04m065
7361a413j405j4326j145J1722K508p456L103k788o450m097R266O602n605j157
7347a2641J1547N99L245k965K173o75N197n721j0762p162k534j384j943J0005
$$ y = [-17518, -24629, -27924, -18252, -22561, -10011, 5173, 6305, 5315, 4732, 2231, 6246, 8133, 311, -2879, -4424, -11038, -14506, -12375, -4713, -2016, -4317, -9151, -609, -3805, -9760, 1715, -9965, -16875, -11712, 5227, 413, 7490, -1323, 3350, -3909, -14708, -9440, 3298, 4697, 9346, 12536, 9868, 3001, -5378, -4886, -2275, 695, -861, -14330, -904, 9052, -499, -5236, -7307, -17721, -15945, -17966, -16519, -18568, -21488, -23299, -15256, -5954, -6453, 7836, 4353, -6871, 2164, 11604, 9948, 11642, 5100, 4367, 9146, -317, -10896, -23777, -19381, -3599, 635, 5669, 10058, 2956, 2652, -1413, -2818, -17144, -18289, -6567, -4059, -11515, -8412, -11200, -17650, -21747, -12481, -5879, -11484, -12641, -1094, -495, 2750, -215, 1958, 1283, 6480, 759, -10003, -17165, -19699, -21083, -23026, -13021]
7333a3021J0839k436M7R5n962L482O371l248n255Q267K178j308Q041J548j975
7318G663p293j1677k818J4807P174P951p402p368j220k850l578Q921j787l592
7304c069o011j332j9278q195N978K5014K2559j0810p185Q102J0666n214j8421
7291g196j3389R362K0629j6758r95J0986j5562j5901K457J3118J1056J063Q56
7278b74M997n717n141j5069r312M969R939l6m488K429L739P367J2494K225p107
7263A015N924o508r186n798M060L473j4866l092K649N450m373n252l481P111J1594
7248a1280K964o930q730L975q580O572K843J220j0646J835N527q75R76J0868j669
7233a1930L077J0112n753r753N191l23K797Q520n67r895L466J400K446k927P235
$$ y = [-13021, -2182, -4618, -4571, -4476, -10438, -6956, -585, -3833, -9088, -821, 1357, 49, 8090, 9638, 7663, 370, -11307, -14125, 682, 7856, 15807, 8405, 1037, -183, -3033, -6611, 2310, 523, -3069, -9080, -10412, -29690, -37885, -31907, -6893, 15666, 4856, -2329, 5773, 16439, 11225, -7196, -20585, -11223, 9406, -7352, -8347, 2639, -12923, -28824, -26367, -13249, -2193, -1130, -274, 4723, -994, -6135, -21204, -30516, -25547, -15608, -15644, -20132, -17703, -13964, -6597, 5897, 8122, 1015, 6939, 431, -8755, -14553, -10493, -7020, -21886, -24978, -22329, -16879, -21252, -26504, -29985, -22874, -11280, -8316, -15246, -23976, -20001, -28581, -22009, -19166, -17946, -28592, -26757, -21230, -22105, -21129, -10261, -11930, -8853, 1259, -4494, -14247, -9056, -9379, -6582, 1938, 1371, -8524, -5058, -3658, -1212, -4139, 3096]
7218C096m158n396q210n197l737L039r57N462R616J7907R125l471p942r292O817
7203F702Q41j461k354m016o083Q92J1772J648k936k0111n889p18l069o714J6454
7188a5042P009q338J012Q604p66J193O369n629r330n333M986L090Q280j1467L19
7173a5043J4207K744k828j5624k062P087o719l370m544l13l350K912Q437J436
7159a7030o370n841m335O168Q577j017j2019k879J2065M319j6953q986J7335P269
7145a9697J650J0052o51L427q219k71N015L352m654L69l509r577m935l317K665
7130b8300Q539N905P847o874n661J0267M757m726J746Q27p056j2369j1977O484
7116c0591J4510Q583J5516Q502K272j0404j6015o587J602k85R843N288J395O00
$$ y = [3096, -1062, -6458, -14668, -19865, -23602, -20563, -21520, -16058, -6442, 11465, 20590, 17119, 9177, -115, 6702, 7543, 6082, 3728, -288, -6371, -5479, 6293, 7941, 5005, -15106, -20995, -21713, -24782, -31496, -15042, -8033, -16371, -15359, -6755, -7521, -6328, 41, -5588, -14918, -20251, -15265, -12175, -3895, -15362, -15043, -836, 1908, -920, -16544, -18606, -11519, -18238, -21608, -26152, -26465, -29815, -26903, -18466, -17030, -23400, -29241, -33576, -27408, -18831, -19848, -31867, -34746, -22681, -18362, -35315, -44301, -26966, -19697, -18047, -7995, -8646, -5219, -13438, -13709, -8694, -5342, -9996, -9627, -13136, -22713, -27648, -30965, -28300, -19761, -13856, -6009, -12883, -18544, -8277, -3520, -8246, -6500, -5673, -12729, -25098, -37075, -30591, -16081, -7498, 8018, 16520, 18792, 8388, -7627, -14214, -12612, -12897, -3054, 2234, 3629, 4229]
7102D229n193k602K259P020k496j6328q647Q906m333j564P423J6666p147n280
7088g087M60M865K7j4318K2O767m512o75m508K168N941J6424k203j648j0595j4369
7072b3241n401M038m758K062m663J0688Q220n798p537O020K4613R177j8166j2927
7058a7673n732j82P743M613R741J498J0534N5j8906p326O184Q480J655j671j2229
7043a3216M273Q600j3036q673R513J6424p289p962j54j0221K101j173J0096J1546
7029H29K01p023k892p100L135K852J3577l037j4328q279j548K210P033k954l12
7014a7636K769m023L771M70J847N313N987J966r350m997J2157k006L30p856J101
6999a0157j34K977J3052j7504m75O760N75o676P067J0392M864j0235j6908J777
$$ y = [4229, -964, -3566, -1307, 5713, 3217, -13111, -21758, -12852, -17185, -18749, -11326, 5340, -1807, -7087, -6627, -1762, -1735, -16053, -16031, -9264, -13776, -14451, -18959, -16791, -10850, 5574, 3371, 1723, -8872, -23241, -28642, -24604, -29362, -27300, -31963, -21275, -13055, -18853, -26390, -20370, 4243, 13420, -4746, -17673, -23405, -23587, -15844, -11231, -1490, 8, 10542, 10597, -8309, -15635, -9451, -971, 684, -987, -13216, -8943, -343, -13379, -22052, -12539, 3885, -3404, -11366, -11520, -21741, -19640, -20813, -10717, 829, 1030, -5993, -8885, -15985, -12850, -9998, 3579, 542, -13786, -22065, -23613, -21403, -14370, -17324, -17636, -14867, -18890, -15119, -14649, -12802, -7489, -1502, 464, -8886, -13883, -1726, -3732, -3402, -11258, -10157, -10291, -7314, 5738, -11766, -12241, -5481, -4906, -11582, -4515, 5877, 10741, 506, -16402, -14625]
6985a4625J5023M808k411M757q025k197J0729o546k163m970m475J096r11O319
6971c591M199M555K961o04p265r698o436Q317J3329M471K182j7076j3143J6871
6957i28P759J999O441M477r023k3620q178J2932P286r362o8o129N981R327j2510
6942a3616j8108J4634K5019J587M810J2396L096j0212j5231n001j1074Q925J4586
6929A1811q51q951P338K269j272n963p727q97O573o336K357q34j2196j0590J460
6914b3809K285O121K96p34Q822j727J926l23O505Q64n643P995J8024K560p374
6899A5788J016m104N684J478m304o493k78o217m675r915n463J7885J5294L751
6885A9447l318m551J0827R623R18n525n527k402q898q958p866M80J1036j665P532
$$ y = [-14625, 398, 5206, 2795, 7552, -473, -2670, 8059, 1513, -650, -5620, -10095, -8999, -9910, -3591, 608, 5163, 8124, 7520, 255, -9443, -15879, -7562, 5767, 10238, 12420, -4656, -17799, -928, 6831, 8830, 15271, 19748, 10725, -12895, -21073, -8141, -855, -10217, -10285, -16414, -10433, -1106, -13616, -31724, -17090, 7929, 9516, 14326, 26722, 29818, 19606, 4375, -626, -11700, -2775, 11811, 10960, 2009, 9347, 11616, 10344, 4381, -3346, -4243, 2330, -4006, -1649, -2483, -14679, -25269, -23809, -21524, -15403, -15107, -15841, -7019, -8746, -6820, -7143, -638, 226, -5417, 2578, 20602, 23162, 15788, 16804, 12700, 18384, 19862, 15558, 9065, 8787, 2570, -2105, -12020, -17483, 402, 15696, 19447, 16129, 11578, 22405, 32028, 32946, 27421, 21894, 19492, 10594, 1636, -6230, -5750, 5286, 3621, 11153]
6870A1153j045j846R173n210j2678j5951N147N236J0798j0730j0094Q011J8471
6857A0435J3035Q474M651j2735q125j199L080m719j310P978j2371j522Q960N637
6843B0269j91L232p697j4118l615M49L060j3557o827r633J1501J5893L703j361
6829A108m362m229J2779J4730j3159n204l084o004J168L382M215k892r363n575
6815a6490R648O081K390k427j4235r577L076n936L14K0035Q942K390L753J780
6801I744J0785J0627r645k4456l459o846l481N581K525o014L136O501M839J3297
6787A3134q562K914N590j1104j350L061j2192K141P933O904j856l090J66j212
6773B477J1396l967j648N205M101J994m396j2297p097K0590J6433J6933J1116
$$ y = [11153, 10108, 8262, 17435, 12225, -453, -16404, -11257, -6021, 4777, -5953, -16047, -8036, 10435, 23470, 31944, 36595, 23860, 15735, 14536, 17616, 12897, 11587, 19565, 7194, 5672, 14632, 20269, 20078, 23310, 15613, 1495, -2120, -1671, 1389, -12168, -18995, -28628, -17127, -1234, 2469, 1108, -3254, -7483, 5296, 20026, 6867, 1663, -1421, -7425, -6257, -2875, 1340, -1552, -10915, -16490, -6842, -761, 1629, -798, -15033, -24610, -21534, -27470, -27156, -7121, 1821, 4211, 7964, 9744, 20529, 31156, 21511, -2945, -6404, -13250, -16731, -11150, -8625, -14639, -11503, -5002, -163, 13134, 4572, 7486, 13076, 1972, 622, 3683, -8509, -6368, 1565, 8469, 6613, 3523, 3689, 2477, 13873, 9906, 8258, 13463, 17564, 19558, 15162, 2865, -4232, 16358, 32791, 49724, 60840]
6760F0840r585j0085j828N912p505J771r644j9991l220K253J8358J4068j1738
6747B9606j2604P630L067P787k462j2684o59J7398R845p162Q47k87n003q453k11
6732B6655J3765q876p489j5130p754k294j6795J3889K1378L247q31l996p787o938
6718A044j0464m664R001p748r403n372J049J1605K008J9070O973P44K468l363
6704A2948o560j4862n098P942J0389L907j5344j0388r225J6350M570N247J455
6691A331J1731Q02r630m317o3O780l742j0010K032p94K972m034m537M906L573
6676c000N020m237Q71m82j63M001j033q378j872L835N99L087J0464j956j0726
6661c970r446J3425J8146j0509j5703j2533N962P015j333K56M921M30k003O85
$$ y = [60840, 51255, 41170, 39342, 45254, 37749, 39520, 29876, 9885, 6665, 8918, 27276, 41344, 29606, 17002, 24632, 27699, 35486, 33024, 20340, 19681, 37079, 46924, 39762, 40609, 40322, 35319, 26866, 26655, 40420, 31544, 24055, 8925, 1171, -1123, -17918, -4029, 17349, 20596, 19765, 15769, 7982, 1044, -9420, -14084, -5083, -12831, -22234, -27606, -26557, -14952, -12944, 6126, 13099, 13843, 16311, 12948, 6388, -8474, -13572, -5630, 4759, 8666, -6678, -17066, -26291, -9941, -5371, -124, 1331, 13062, 13864, 4234, -83, -146, 6634, 2892, -7118, -5086, -5880, -2908, -6942, -11479, -6573, -3000, 2020, -2217, -1346, -1828, -1991, 2010, 977, -7401, -9273, -5438, -4839, -1752, 8712, 6756, -3970, -13416, 9, 18155, 7646, -8057, -20590, -14628, -7613, -8946, -8690, -3769, -3339, -5342, -4657]
6647d657K831k838o634n403O490O865n274J847q988j0226J6671K035m869Q892
6633c258Q141j474K248j615q322n434j518M402k45L630J298K358p651J991n361
6618a0810k483k88K741P458R282k271P169n372m537j0067q092P878J1757k432
6604f7n251k247L592M051L180j415J0559J0876n329p733P296j564j1790k0536
6590a6378N70K219O828n02J631O997l228K439R044k050n456q249r61J2716j128
6575D492j3479o01K856O031K115M60m800K797J3065q893j4713o355O433Q961j247
6560b878r317k169M006P730m540j47j541K1233o605j6012p970m389L40M301P463
6545a0495J1888j1537p151N671k547l802p207L95O806K3476M409J826K093m239
$$ y = [-4657, -1826, -4664, -11298, -16701, -10211, -3346, -8620, -6773, -15761, -25987, -9316, -7281, -12150, -3258, 4883, 3409, 5657, 4042, -4280, -9714, -11232, -6830, -7075, -3445, -2147, 211, -7440, -5449, -10810, -13293, -13581, -10840, -3382, 5900, 3629, 10798, 5426, 889, -9178, -17270, -9392, 2365, -67, -5318, -7565, -3973, 78, 3258, 1843, 12402, 23278, 17949, 10216, 17512, 15948, 4158, -16378, -15808, -13589, -6761, -7263, -5632, 1365, -1863, 576, 9620, 7570, 2114, -6135, -7096, 5620, 4492, -8987, -9588, -6732, -701, 1414, 1874, -2926, -129, 12936, 4043, -10670, -17025, -10592, -1631, -2878, -12195, -14364, -10358, -2628, -7168, -7315, -8856, 12377, 5772, -10240, -18210, -22599, -22259, -17958, -10495, 1393, -10144, -17295, -11624, -14171, -17973, -25180, -24785, -17979, 5497, 9906, 11732, 13825, 9586]
6531I586K312k003j837J519n031j4834L550J2488j565m962k2066j0968J5487P174
6517a1150N346K917j019K420j1679M37j45k264O955O607k656K086n961J511L321
6502c274p220j7134o561J8503M920n395R103r728j0374J2149J7686N192j3555
6489e688j4529M710R348M068j0252M911K415l215K781J163P924k349J3464l063
6475A1688q434m247j2106l249K515N043N962K034J144M44j0255j2546l055n7J2585
6460a2534P326k635q037p80J1055L586P208l200r990k1643o129J9227J2917n641
6446i270j4103n871M694O952l400j5604M980P684J1079N472J5399P825r783Q146
6432A4200Q267j6741n333J249O528P405j1321q755J3763J984m118j2273k4446
$$ y = [9586, 11898, 9895, 8058, 9577, 4546, -10288, -6738, 5750, 4185, -777, -22843, -33811, -18324, -11150, -5804, -2887, -3906, -1486, -13165, -12728, -12873, -15137, -8182, -1575, -4231, -2145, -8106, -6595, -3274, -10494, -27628, -34189, -15686, -10766, -16161, -7058, -16786, -27160, -15011, 2675, 7867, -5688, -20217, -15507, -6159, -2091, -12343, -7432, -5017, -8232, -5451, -4288, 3636, 1287, 14751, 11688, 3254, -993, -13099, -16348, -13833, -8790, -2828, -794, 350, 794, -9461, -22007, -25062, -25119, -12534, -5208, -7843, -15880, -16660, -5605, -2019, 5189, 1989, -8001, -29644, -35773, -16546, -3629, -9270, -23373, -29244, -24550, -17598, -20998, -36602, -31622, -23938, -12859, -7387, 8012, 15837, 6054, 14200, 22467, 5726, 393, 1642, 8170, 15575, 4254, -4501, 9262, 11246, 7128, -5145, -29591]
6419b9591j618M301P776J313p619j029J3637J5910K677k957q318R37j415j267
6405g263p66L545l898j8976n866R141R256M846j913R438O457j3105j4358l917
6391b7379P684P916P260o430L01N898r300M37K2150J56J489Q885l788j5994k441
6376c156p562o330J5223O264o189J75p710J193j719j900j00M586K709j739m784
6361a1039p488K796J2391M756k008N883l402k630J429q308J1086M657J678J640
6347A1441m236n336J095j271Q818j650o126n642l780m774j2853p532J1817K442
6333a7587Q785K417l202k319j788p642j444P46M219l422N698J4172j928m452k494
6318a0241m153J277k333R3j0386q898o176J2452N628m85N31K648J0337J7524P593
$$ y = [-29591, -31209, -26908, -19132, -17819, -25438, -26467, -12830, 3080, 5757, 2800, -5518, -4581, -5996, -7263, -8029, -4484, -8382, -27358, -33224, -24083, -14827, -9981, -11894, -2456, 4001, -9104, -23462, -27379, -19695, -11779, -4519, -10949, -10648, -4750, -14050, -13613, 8537, 8693, 10182, 19067, 15279, -715, -3156, -10718, -17048, -1825, 4439, -1750, -1575, -9285, -8092, -9811, -11711, -11811, -7225, -4516, -6255, -11039, -18527, -15731, -3340, 1416, -592, 5291, 1889, -741, 688, -7620, 3466, 8123, 9801, 11441, 7205, 1869, 2964, 1693, 10511, 8861, 2735, -2907, -6687, -11461, -24314, -31846, -20029, -17587, -8802, -6385, -9587, -11906, -13694, -21336, -22780, -22034, -17815, -21237, -15539, -1367, -3295, -7747, -10241, -14394, -13117, -15450, -15357, -25743, -34641, -40817, -28365, -22737, -23222, -22691, -20043, -9706, 7818, 15411]
6303A5411r96m794m427m702j866j4205j205M116N591l978j86L32m226k015K558
6288a4592O458p789o697P545K016r834Q204L011m234N494J2533J3016M772m028
6274A5875J7103P787j7108r500L3p780N346o634l960n397j4355n490l298p119
6260c4497M238J5449P267l726q247L82N328Q918N711l852M736K661p211k66J0778
6245G669o92j940o767M652J0586j1552j1611q107r24j483j4475P217N279K868
6231a9280O788k996j3760O439J1042m508j399L564n20l653K4381P089j0926j4054
6217a1793m206Q408O097K514R52K721j490m702j739K3532J5864o34L468q256q529
6202B2207J088q732o919M714n922j2387j065Q046l401M017l479j121M588J491
$$ y = [15411, 14415, 9621, 5194, 492, -1374, -15579, -16784, -12668, -7077, -11055, -11241, -10909, -15135, -17150, -14592, -8134, -15923, -22620, -15075, -13059, -22893, -14689, -11678, -15912, -10418, 2115, 15131, 19903, 15875, 32978, 40765, 23657, 14157, 14190, 6410, 11756, 5122, 1162, -4235, -18590, -24080, -27378, -34497, -30259, -14810, -7543, -11269, -19516, -19134, -13806, -4888, 823, -3029, 1707, 4368, -2843, -3109, 7669, 6977, 5037, -1730, 2922, 13508, 1956, -9655, -17762, -18686, -20169, -34644, -27427, -22148, -19280, -12492, -15488, -29248, -22809, -11767, -16275, -17674, -14110, -14630, -18283, 6098, 13187, 2261, -11793, -15999, -7591, -1494, 1020, 1972, 4693, 3203, -1499, -3238, 20294, 36158, 35524, 38992, 30736, 22207, 23295, 14563, 7644, 12358, 6436, -5951, -7016, 1030, -2371, 1646, -1833, -2954, 1634, 3125]
6188C125N74J547l261j7878r556Q12l91J6884l913j0091Q524N081l388k732p840
6173b2503j0474M195P792m006O592J5433O146j1689p486P563P912P299q874J557
6159e43K16k017O651m239N465K608m889o395L88K072k0574k109L476N519m255
6144a8626J7463L219j0535j4455j3032M616K4454N032P93q690O779l92M01p264
6130a0237j778Q289N294k200m876j0250k866J0682J2231M562n304n01k352R733
6116A0427n859j334j700N663R601P175m806j6621J281l993j5253p411j384M049
6102b0165R779J0808k375j0625j769Q167n30J370Q31O149N129P73j585N372j0440
6087H89j3271M858J038m871R06M595O663q487p646M941K9522q965k6583j226J1671
$$ y = [3125, 3699, 5246, 1985, -15893, -25449, -24637, -25028, -8144, -12057, -22148, -13624, -8543, -11931, -14663, -22503, -32977, -28782, -20990, -24996, -18404, -2971, 3175, -8514, -16000, -8437, -525, 6774, -2100, -543, -327, -2344, 4307, 68, 5533, 8141, 3252, -3143, -2755, -683, -21257, -23366, -19890, -14371, -18626, -1163, 2056, -8479, -22934, -35966, -31350, -6896, -1864, -1071, -9761, -2982, -3374, -2973, -10237, -12015, -3726, 1568, -632, -5508, -15758, -18624, -7942, 4289, 8851, 3547, 3046, 694, 10427, 4568, 3234, 1534, 7197, 16798, 23973, 19167, 2546, 3827, -166, -15419, -22830, -24214, -20165, -10386, 422, -1953, -12578, -14347, -6180, -6710, -5340, -4509, 1640, 6769, 7542, 5957, 11329, 889, -12382, -7524, -6486, -11357, -10451, -5856, 807, -7680, -15326, -10385, 19137, 10172, -16411, -17637, -5966]
6072e966K52J4950M826n83n383J043K029P664K72j8553p962j1515p839L615J143
6057b2007J5269L398n200L734l26r098j350M447P422N202m024J930L82O89O611
6042G079M209j823P563J1760j0809k1736q024O7J3562K484R66j0791p500P856
6028e137K032j1121j0977n346J2935n48Q589J007k022j756l365k141O148J884
6014i818Q113N951J1392n249o271O10O526q750m030q786J2717j9196l949K581
6000a8159J3754P47J760P168j9018p886J7530P598m569r88R257p506o548n73m93
5985g926p875k378N033P384R502j2185j7664R12Q19j029J3523L62n890J1302j4200
5970b0310j5765N756J8119Q681j628p521o293Q14O91j679P495L264j1121N591
$$ y = [-5966, -5714, 9236, 14062, 13479, 8096, 9139, 11168, 18832, 19104, 551, -7411, -18926, -26765, -23150, -22007, -6738, -3340, -8540, -4806, -5132, -14230, -15580, -11133, -3711, 1491, -2533, -603, -221, 468, 7079, 11288, 9465, 17028, 28788, 17979, -3757, -11781, -11714, 1848, 4332, 5298, -5493, -12993, -5137, -3105, -14226, -25203, -30549, -17614, -18162, -9573, -8566, -10588, -12344, -15709, -17850, -11702, -9818, -1705, 4246, 15638, 10389, 4118, 4728, 11254, 2504, -1526, -10312, 2405, -16791, -20740, -18159, -4405, -3658, -1898, 5270, -13748, -21634, -4104, 3494, -1075, -2063, 7194, -312, -6860, -7433, -7926, -15801, -18179, -13146, -5762, 3740, -8445, -26109, -25197, -24378, -25407, -11884, -11522, -17412, -6110, -20310, -36075, -30319, -12200, -3519, -5147, -12668, -18961, -18147, -17456, -19135, -11640, -8376, -19497, -13906]
5956a3906J3730K717K616N828j026K738k045L688j1743k30j1992j3460L643J0756
5942h686L714M68k34n006m81O907j337N479Q986K507p023R748r363q224p16k53
5926c514o506M349Q342m053J1135J697l423j1782M333M585j5810j2302o602O964
5912b2587J3205L538Q380j2648n164R06o16L43J1117L204q050o906K192m657n015
5897b2758P234J2799M801o834M340N119k078j6234p107N380J0926J1587J313Q183
5883A6671n551L074J3195M337j1206p016N719j3669k1571k832R764K5469J0685
5870B7069k5876j7430R87J0289Q724O965M504Q337m695p624j1529j1638j0446
5857b2363j192M526J2891m350J0368o75J524M275k145l046N519K874q018j558
$$ y = [-13906, -176, 2541, 5157, 10985, 9959, 12697, 10652, 14340, 2597, 2367, -9625, -23085, -19442, -8686, -4972, -4504, -4738, -9744, -10225, -3318, -4655, 824, 9810, 12317, 5294, 15042, 5679, -2545, -3261, -3514, -10020, -5671, 2671, -1382, 9753, 11450, 8027, -3755, 578, 5163, -10647, -22949, -29551, -22587, -9382, -5844, 2536, -10112, -15276, -14370, -14986, -14643, -3526, -322, -8372, -15278, -13086, -17743, -22758, -15524, -2725, 2076, -4758, -418, 4701, 2623, -13611, -20718, -15338, -4412, 7175, 8488, 16671, 11120, 14194, 27389, 31726, 20520, 13504, 19223, 5554, -16017, -18849, -9085, 16384, 27069, 1193, -16237, -15250, -4961, 3763, 10728, 15232, 23569, 18874, 11250, -279, -11917, -22363, -23555, -19029, -6138, -10488, -120, -795, 729, 5004, 2859, -187, 5332, 8206, 188, -1370]
5843a370j176r939m975J55J8965M855Q700o142j4155j1233j817m290q385R729
5829b1078K595L689j565k094P702J2651M835j44l549J038r52k1466p28R704R503
5814A41J4646k06K26k411P010r166j7114n017p594l483O211o991M852m83P309
5799a2070M776j358p240R469K0070n935j8018j4883l565J8735n584k863R058J5817
5785F409l951o513k2753m090P482j758o676J2755J5579N667j2883j007j2144L645
5771b0238L976N810P282O339n671p601P643J302O311L732l395M96j658q582m128
5756h382o759J0288n310q152j948Q944N952P296J32M674o172j5203N805M994L308
5741e33M278J841j8971l509O269o077j858R666O753N181j548J675P155N874j452
$$ y = [-1370, -2546, -12485, -17460, -17305, 1660, 6515, 15215, 9073, -5082, -16315, -18132, -22422, -30807, -21078, -18483, -14794, -16359, -18453, -10751, 1900, 6735, 6591, 3042, 4080, 3128, -18338, -19066, -9362, 141, 14787, 14581, 14807, 12396, 19406, 10240, -6874, -11891, -19485, -22968, -16757, -23748, -18896, -19379, -12070, -7294, -8652, -15892, -6423, 13647, 7712, -10306, -25189, -28754, -10019, -15603, -18466, -9408, 6409, 2458, -4055, -26808, -30898, -23416, -25174, -31850, -19095, -3516, 2151, -10732, -11739, -23883, -20238, -16262, -10452, -3170, 3169, -2502, -10103, -2460, -1158, 5153, 8885, 5490, 5986, 4328, -4254, -8382, -15141, -4853, -10163, -18315, -20263, -11319, -5367, 1929, 2061, 6735, 563, -14640, -8835, -3841, -533, 3745, 5586, -13385, -16894, -10625, -16702, -18560, -8894, -2141, 3040, 1492, 3167, 10322, 16196, 14744]
5726A4744r468k122n238j2698L416J56K882Q10J4704J9086J06k0504j6785j1289
5712b2200O983J8640M476K683p95j087K3l924m624O138q133j1992n198q78J3083
5697f805o598M554N624j2895p048q208l749R748J1868M967j0082L423J915L880
5683i406n58R27J9060O804j928o970l223J364j21o901M426K222Q466o52j3576
5668f6j917J523L712J0419K678k159P659q928r15q985j2562O39L614o311l6J269
5652a0366J2524N450j5343n004O889J9135K377N781j504q819j4798L632m791L638
5638a199R709q253n060L737l032q464N416K959L794r957q058p63K848K666j0788
5623b4445o061k605k666J3583J5010l785O91J4757Q222k17n398j078M973j967
$$ y = [14744, 5276, 3154, -2084, -14782, -11366, -11210, -8328, -7518, 7186, 26272, 26378, 5874, -10911, -22200, -15217, 3423, 7899, 10582, 9787, 8700, 8723, 4799, 175, 6313, -1820, -13812, -19010, -19888, -6805, -13403, -8849, -3225, -16120, -23168, -31376, -35125, -25377, -13509, -8542, -18624, -15201, -13286, -9406, -9964, -9037, 10023, 16827, 14899, 7929, 4706, 6070, 5949, -952, 3474, 5696, 14162, 13510, -66, -1983, -460, 3252, 13671, 16349, 14190, 21849, 12921, 12006, 3021, -9541, -8902, -5288, -11599, -11635, -10366, 2158, 7608, -7735, -12739, -5850, 13285, 15662, 21443, 19939, 11120, -3678, -46, -4837, -1199, 8510, 257, -4803, -1066, -4098, -12562, -7146, -4187, -393, -10350, -18408, -19171, -16323, -13657, -24445, -30506, -33111, -35777, -22194, -7184, -10969, -10278, 4479, 12701, 12484, 7086, 6008, 10981, 9014]
5609I014K936J034r692o081n83r453l228J3062J4841K38j2264k314J606M753J1663
5594A5532J222j6623j7282n338J2279j228l333J2738Q358p262R057L966j3621
5581a535j6586R901n37j259o176J3706J9023l920o144p161n431p779o927M437
5567a6388p759J0622J0299l484L816n397k077o26l264l155j0693R513Q923N949
5553c721K191m632m961q763L995J1096j623j529P593l93k459O211q772q437o30
5538a4834P927O03q48o467Q743J246n565m925J2529o797q66K481q812J316J2460
5523a809n85l517K953j316j897l655l386R303m336O996j2513j380J3817j516O356
5508C515O415l186k3754j4497J604R427Q279o344J0558N45j5272N298J0572j654
$$ y = [9014, 11950, 12984, 3292, -2789, -3372, -12825, -16053, -2991, 11850, 12088, -176, -2490, -884, 3869, 15532, 16754, 131, -17151, -22489, -10210, -11438, -14771, -2033, 6325, -937, 8120, 12086, -1535, -18121, -8220, -8757, -10016, -16192, -2486, 16537, 12617, 6473, -688, -6119, -13898, -20825, -16388, -24147, -13525, -3226, -6710, -2894, -8291, -10368, -10994, -14258, -17413, -28106, -18593, -9670, -3721, -1530, -6162, -11123, -19886, -15891, -4795, -6418, -7947, -354, -747, -3206, 3005, -5767, -14204, -14834, -6907, -6304, -7152, -13619, -4876, -3630, -9195, -14120, -1591, -8388, -9254, -6773, -15585, -14269, -1809, -2394, -5911, -2958, -4274, -6171, -9826, -13212, -3909, -8245, -1249, -13762, -15142, -1325, -2841, 3515, 9930, 6744, -17010, -31507, -29903, -20476, -12197, -18541, -7983, -7438, -22710, -17412, -6840, -8494]
5494h494j121N320j102n967L656Q888o945n14J859p250O675m886J985M264o134
5479i766l866K75K2814k878r559J0722P77p046P859k591n311m26J1116j0536r752
5464h168P502P305p989j1659j320R266K745r104J69n167k207J1492J6657L518
5450A3040M41o441J7170n936j1456j4297r785N664P580J0099Q08M7j9597k885
5436a5548Q440J5496Q499K028J568n995o179l021J4356Q93j2210r423j189J3238
5422A0953M750L64r927l61Q997L12n218N608K837l119O964p243j3583Q281j316
5407H299k87M37l946j750m985r73N625j0820j052J5017k213R148L39j885P22q434
5391C242J2153k732J1924j3742k4690m523J1420K560j1683j887J7286J3955N796
$$ y = [-8494, -9615, -4295, -5397, -11364, -7708, 1180, -5765, -6279, -4420, -11670, -4995, -9881, -7896, -3632, -9766, -13632, -13357, 9457, 6579, -2980, 7742, 8519, 1473, 9332, 6741, 1430, 1004, 12120, 1584, -8168, -666, 6639, -1350, -13009, -14329, -5063, -2318, -11422, -11253, -16420, -18627, -7135, 9522, 13040, 13481, 7040, 24210, 18274, 6818, -7479, -17264, -11600, -4020, 6079, 6887, 6934, -12663, -15548, -7108, 8388, 16887, 18915, 20483, 14488, 8309, 5288, 19644, 20537, 8327, -1096, -2285, 10953, 15703, 16067, 6140, 5779, 14776, 15088, 9870, 15478, 18315, 15196, 22160, 14917, 1334, 9615, 8299, 8012, 8449, 4503, 2753, -2232, -3205, 2420, -8400, -9452, 5565, 3352, 12500, 12839, 10954, 11676, 3242, 15395, 12663, 24587, 10845, -13845, -18368, -6948, -4388, -16071, -17958, -672, 13283, 19079]
5378A9079L619l438j749j6288N710P249n51q423k947N405R480O684p721q565l125
5363D419J0396j5130n510j059M737P963N5j2096k0343R279J8416P726N844l182
5349A1515m847J557j2631k453m979Q48K777j3566J0501J3797N542Q948j1860M68
5335E617N142j7559j7136J3329J3988j29L62q06q090m220j8323L542K1122l290
5321f451l538p014k898n733k169N844J1813l41M325K282n654p083j108J3316P047
5306B638j3699L658P964l240j0710n653O926J0627l275k540j917L636j842m006
5292a1433R291o107p682L527j428M929J255m096j073K247N111l534R036J4438
5278A4481N037j5253j6602L741P240o173R078Q721p420j877k227j054N860m713
$$ y = [19079, 22698, 19260, 17511, 1223, 6933, 14182, 13631, 5208, 2261, 7666, 17146, 23830, 16109, 7544, 4419, 14815, -315, -5825, -6884, -2147, 5816, 5871, -6225, -26568, -17289, 1127, 8853, 14697, 11515, 6668, 8225, -4406, -6859, -11838, -10990, -8213, -21779, -11278, 2519, 8061, 17009, 5149, 5617, 10759, -6800, -23936, -10607, 3381, 3252, 3614, 2808, -5282, -9502, -27825, -24283, -3161, -6451, -9989, -17003, -19901, -25634, -27803, -21959, -10146, -10487, -6162, -3880, -9534, -16617, -17725, -4409, 2638, -11061, -7403, 561, -2679, -13389, -19042, -12116, -1489, -4764, -7304, -9221, -5585, -7427, -11433, -2142, -8249, -15931, -12404, -13832, -8903, -7648, -11744, -12817, -10570, -5459, -8993, 43, 14481, 19518, 4265, -12337, -8596, -1356, -7529, 1549, 10270, 2850, 973, -1254, -2308, 3552, -1161]
5264a161l547p438j927l19o387n610k05J8223K437q935o681O095L709K905m854
5249a3695K706J0941J1607m128p525O23l738j342k718M511k665M107q050Q280
5235a086L198p75L031j2090j0439M128M643q736J871l303R247J2327J5065j0098
5221F983j5349J0625P037j947k673l588k084m843n617P462K739j0182l215k876
5207a7528J030K74o21J0790J7446r62m031O234j552k368j1889p4O99j0276r577
5192b2405n37R376J0478J4105o007p546Om411O17k333J240r345m453O389k288
5177a7114J053L656K136J0547m971j680O240Q830j3216j3204J9077p330L146P607
5163D777O54P68o900j3515K163L103L133O053k009m993N792j1119j3649j799k537
$$ y = [-1161, -4708, -12146, -14073, -14392, -20779, -26389, -26594, -8371, -5934, -14869, -21550, -15455, -11746, -8841, -13695, -10989, -48, 11559, 7431, -94, 529, -3209, -4551, -7269, -2758, -5423, -1316, -9366, -1086, 2112, 1337, 4368, -7722, -18161, -14033, -9390, -18126, -16255, -19558, -10311, 2016, 17081, 6983, -8366, 2259, 9296, 7349, 4676, 1088, -996, -5839, -11456, -3994, -1255, -11437, -14652, -17528, -16498, -16224, -16845, -6055, 11391, 10429, 6398, 12632, 11080, 8712, -3177, -3251, -2552, -12828, -22405, -22942, -13566, -3088, 11017, 5010, -2536, -2530, -6941, -6324, -8657, -7417, -16762, -21215, -14826, -17114, -16061, -12405, -10269, 278, -4693, -6373, -133, 8697, -4519, -17723, 1354, -5976, -2830, 4777, 5431, 6199, -701, -14216, -12053, -8950, -5817, 236, -1773, -6766, -974, -12093, -25742, -27541, -30078]
5148c0078R116J4316N931L022j862k606J9N606o82L14J232K223q443j3555o303
5133b1750Q154J1206O574K898P603k966o031j4646K763N134J055R013k218j5612
5119h823J589J4143K1196J1842j2994j4344q297n035K600q05P381R04r394l947
5105c984r31j2257Q95M722P353j785j5936O577J8173J2054p835j4920r391N735
5091a1530J0569O348q026k0098q646J2183R348l298k945k02Q548J061J258L020
5077b410K614O30P394j499L485j0235j3211O519R700q869r244o771Q018J6901
5063C022K221L652N374k940n807o039j7436M979L932j0784J0516j1453Q548J3907
5049A692K837N447M620o801m000j3605J98O258J7131p661j2336j1043P11J1110
$$ y = [-30078, -20962, -6646, -715, 2307, 445, -2161, -2142, 3464, 2782, 3096, 4328, 6551, -1892, -15447, -21750, -13596, -2390, 4184, 7082, 14685, 11719, 5688, -8958, -6195, -1061, -6, 9007, 6789, -8823, -7234, 6909, 28105, 39947, 26953, 12609, 4312, -723, 1877, 1072, 8453, 9357, -37, -3984, -4915, -17172, -16277, -11555, -4202, -5987, -21923, -15346, 2827, 14881, 7046, -7874, -17265, -11530, -961, 5387, -2639, -22737, -31383, -19200, -9852, -13150, -16095, -16297, -7749, -6688, -5430, -2410, 204, 834, 8228, 6729, 10214, -21, -13232, -6713, 2987, -5882, -15126, -21897, -13879, 3022, 5243, 8895, 14269, 11329, 5522, -517, -17953, -12974, -9042, -19826, -9310, -20763, -12215, 1692, 4529, 9976, 14596, 7795, 3795, -9810, -9612, -3354, 13777, 6116, -6220, -17263, -16552, -5442]
5035e442k837p864J0727J3536L484P618o04n526q660r833K918R988K734N850m97
5020A5592N645P719J363k419n347L270p807n792l099j6724q501m77m365o481L61
5005b7062J0780K162o70K0946J1616n472j4888j2117M939r269J412J6893M53p821
4991h098L207O536M374L675j925p742K117q207o570L621J0697O527J2534j3812
4977F934l546Q937M663j0417p41j310r24p833o144j587L600k495j88j108N641
4962f518n688n181J251K601o800J0101J6699o140k762N715m320j0770j0477R178
4948a3111J1427r608M182J8976q591p526L87L929J5724j49k628j2640L644J706
4934E722J335j4594j2859M30Q188M149J6876P819M257p194j797l236j1754j1209
$$ y = [-5442, -8279, -16143, -5416, 8120, 11604, 19222, 18618, 13092, 4432, -5401, -2483, 7505, 10239, 16089, 15592, 21237, 28956, 30319, 27900, 22553, 25823, 18016, 12224, 9125, -7599, -16100, -16577, -20942, -27423, -27062, -16282, -14120, -14790, 6156, 17772, 12300, -2588, -14705, -9766, -19035, -17623, -730, -277, -8098, -4891, 1645, 6019, 9694, 7769, 27, 2144, -6063, -12633, -9012, 1685, 8212, 20746, 6934, 3388, 12325, 16988, 6571, 5830, 4520, 3596, -4237, -10381, -11968, -8368, -10863, -11051, -12159, -6518, -12206, -17387, -16136, -13535, -20335, -10234, 6465, 325, -2437, 3278, -1042, -11812, -22289, -13111, -1684, -11292, -7110, 11866, 3275, -4251, -3864, 65, 15789, 15640, 13012, 372, 4016, 5722, 7057, -7537, -20396, -19966, -11778, -7629, 9247, 17066, 21323, 14129, 12332, 9096, -2658, -13867]
4920a3867j1242n10J5045J6920m018r043J419O399J722J0230M480n204n161Q364
4906A5534q66m391k885J0472J357o514J240J2196o065j0025j3334q99N385J3656
4892A4861q12j3281r14p077n96J676J5433O832o733m76R352p64j3471p902J2573
4877H701k016p484J0381N162j6852L106M992J177K010o48q425j505n040j953o834
4862a5228k0324L223J4100K5570P204M900M744j0487r207O130J845J632Q085N328
4848B7515j7216q371j646K085J0182j0758j2407n528J296l299Q236P702J3164
4835A0955O301o472l480R741q527n227R511J686Q582o924j5247o37q215m998N652
4820g299l539j4822P868J2323P32j0714J7236P128q238m712m128J2551J1373k99
$$ y = [-13867, -25109, -25619, -10574, 6346, 2328, -6715, -5296, 1103, 2825, 13055, 17535, 12331, 7170, 15534, 14668, 10277, 7392, 17864, 19221, 12707, 13947, 26143, 20078, 10053, -3281, -4180, 1205, 14861, 14049, 768, -146, -7223, -7819, -6143, 9290, 16122, 9389, 8913, 18265, 17501, 4030, -3872, 8701, 6685, -799, 9582, 14744, -2108, 998, 5990, 7167, 9177, 8529, 104, -1401, -6441, -8394, -15228, -35552, -32329, -18229, 7341, 14545, 19445, 24189, 13702, 4495, 10625, 12470, 14102, 22187, 27515, 10299, 1928, 282, 2367, 12549, 1791, -10616, -16144, -14848, -18147, -9911, -2209, 10955, 17256, 10784, 7304, 17045, 8518, 3291, 12802, 14488, 23070, 16146, 899, 262, -7953, -12951, -7299, -10838, -25660, -17792, -5469, -4737, -15451, 1785, 8913, 675, -4037, -8165, 4386, 15759, 15460]
4806A5460L798J328q08P364j0247o503R75k196q284l161P8j1999J391J4340J0754
4791A2290j1222J508J3223l985n888j940m38l823J710K345n05J772N643m907p859
4776b076l786j0842L132J0087L514j4649m44J4692K617j2005K299J1160r301k375
4762g977L593J1312k285r58J447Q489o95j371j4161n074J1941Q687j983p194l147
4747F24k367j0628p877j1056Q941J7694m137R722O733K875Q633m913r779j6748
4733a2283R10L805K0823J3674k0926j4014K227J290J1964J0298J613q132o103
4720E146j2966j0119k090J5805J4677J1753j8352k2116m718m167J2313M291m869
4707a5412j1419J3469L255Q956J893mJ648J383o38Q341o099j7161r181K301J2829
$$ y = [15460, 19258, 20586, 19778, 27142, 16895, 10392, 11367, 9171, 887, -2274, -2196, -14195, -12804, 1536, 12290, 1068, 2576, 15799, 11814, 5926, 3986, 3548, -275, 1435, 3780, 3275, 5047, 10690, 5783, -2076, -5862, -16704, -13572, -3485, 29, -14620, -15064, -372, 2245, -9760, -7461, 3699, -5602, -7977, -4384, 6928, 4643, 3685, 5132, 13621, 12926, 11555, -2606, -7680, 4261, 12948, 10965, 3771, 624, -1743, -12371, -20248, -31304, -22363, -4669, -8806, 916, 7649, 10524, 19157, 14244, 4465, -12283, -11373, -7568, 13255, 26929, 6003, -8011, -5784, -4494, 7470, 17768, 19381, 11249, 5146, -7820, -17939, -20029, -4224, 10453, 22206, 3854, -18262, -22980, -27147, -14834, -10543, -15412, -26831, -13362, -10107, -1151, 742, 738, 2386, 3769, 3131, 11472, 5373, -11788, -20969, -18668, -5839]
4692e839K536o167J731L018M035o284j9608M269J4825N154k374K143j3095j3582
4678b9238K04J5275P622J158J5404M066m629P56o835l719l427N887j400R6p398
4663f178k467J68M661J9039P658k1774k4116O579K0651j0997j0159q579J766J259
4649b2489L857O914m40n728o64m579J4811O076j3211n046n223K370J5853Q605
4635A106n334r101L034L016Q782l036l207R520Q42K672q584j7276j5998J4007
4621a9557J7055K2592R242n496j6007o800j3086j3152o922M538K3947J2621K741
4608A1716o547j3533k342k519l460m390Q503M184k932M591J0246J863n306p414
4594g340r93q402Q273O443j913P892q508o172k132J498n539N580j0901q890J6106
$$ y = [-5839, -3303, -9470, -7739, -4721, -686, -6970, -26578, -22309, -7484, -2330, -4704, -2561, -15656, -29238, -29034, -13759, -6137, -4979, 10425, 14491, 9862, 10618, 3783, 64, -3363, 2524, 1124, 1220, -6178, -8645, -8477, -3816, 15223, 22881, 1107, -23009, -16430, 4221, -6776, -16935, -25514, -23748, -22489, -18632, -11718, -12158, -17886, -18550, -23129, -8318, -2242, -15453, -20499, -25722, -23352, -7499, 1106, -4228, -13329, -10295, -7279, 1503, -1533, -4740, 4780, 5622, 8294, -290, -17566, -33564, -19557, -2502, 20090, 29332, 23836, 7829, 1029, -12057, -25209, -32131, -27593, -3646, 8975, 11716, 5169, -8364, -10706, -13225, -16685, -21075, -12572, -8388, -11320, -6729, 3517, 5380, 74, -7340, -8333, -16735, -8462, -2019, -3932, 3960, -4548, -10720, -12852, -11354, -16893, -11313, -22214, -31104, -14998]
4579a4998J9172P899J7706k360o521o399m156j0437P726P019n58m230p866l262
4565a265r713M89k345O30k865N351l67J3594o645o169j5362q196Q982O584K381
4550a4916N526L180l034o270j037k69q203K286R152L141M458K789l691J0045N831
4535H988Np991n717J5125J1552l409j1729o638j237K845P608n737N62k658j51
4520A418m271j6516n802Q262J925j451R817Q670M38P93j2564L89R885J022j482
4505E33Q473n408j4094O36J7846L307O198j096K86J789n685J41j2902o430m10
4490f816P700N875r375n726P960r877p101q712j138k051R075J2190J0156O984
4476I144p989j7290M011j3418l124J2314J3661j698M342O268M773n859m259l54
$$ y = [-14998, 4174, 12073, 29779, 27419, 20898, 14499, 10343, -94, 7632, 14651, 14093, 9863, 1997, -1265, -10978, -10489, -12834, -12204, -15069, -9718, -10085, 3509, -3136, -9305, -24667, -32863, -23881, -17297, -14916, -9390, -6210, -9244, -15514, -16551, -16820, -25023, -22737, -13585, -10444, -5986, -3197, -6888, 3157, 8988, 8993, 1002, -4715, 10410, 21962, 18553, 6824, 186, -1051, 1794, 9402, 3665, 4227, 1569, 1418, -2853, -19369, -25171, -16909, -14984, -16435, -6618, 2052, 2490, 3283, -9281, -8892, 993, 2015, 533, 9006, 3598, -10496, -9860, 7986, 11293, 17491, 16395, 16681, 18470, 12785, 12926, 24, -6406, -6816, 884, 6759, -2616, -8342, -382, -10259, -17360, -26072, -27210, -29261, -20186, -7996, 2160, 9144, 1155, -16135, -12124, -25542, -28666, -16352, -2691, -4389, -47, 6221, 10994, 5135, 876, 522]
4462E22l667l980J2551R457l372n800j1640r901P516P538M889N551q273j9406
4448a8015K036N021Q20r84K060N220k342J071J1027k60j4656q684J0620J4074
4434G008M678j1458j5716L288O002k0N837K7m370m629J361r664N863J1610N993
4419E810j099N722O467O1j0902K662R642p238j7661l661l157R000k965J198j004
4404g125J3860P73Q322k269p375n614q363j07n60M096L452o279J651q757m564
4389a8859n560J8349J6323N048q121o732R75J479j653j0085j0350M262N087J3134
4375C297J5300o122j1768m508k14l960M310l306m558M444p404m33Q10J0378P503
4360C769n714m203j851m709L811m075l55L996J8083Q690j1750j6912O974Q169
$$ y = [522, -3145, -7125, 5426, 14883, 11511, 5711, -5929, -15830, -8314, -776, 4113, 9664, 1391, -18015, -15979, -10958, -10138, -11122, -9062, -3842, -6184, -5113, 5914, 5654, -9002, -17686, -7066, 7008, 11686, 228, -15488, -12200, -6198, -6218, -381, -354, -4724, -9353, -7992, -17656, -11793, -183, 5810, 4711, 10433, 16900, 16961, 6059, 8721, 18363, 11125, -6536, -10197, -13354, -4354, -7319, -6121, -7125, 6735, 7508, 15830, 13561, 6186, 572, -7791, -7898, -8458, -4362, -910, -7189, -5538, -14295, -18859, -24419, -6070, 10253, 15301, 7180, 448, 1423, 2902, 1249, -8836, -19186, -14924, -9837, 3297, 18597, 12475, 707, -3801, -4015, -7975, -3665, -6971, -11529, -7085, -14489, -14922, -14112, -3734, 3769, -1945, -6148, -7999, -12708, -8897, -12972, -13327, -9331, 8752, 17442, 5692, -11220, -4246, 3923]
4346C923J075j1083J2245K551j6533N505L88m897L844J601J836P974M313j080
4332A1662q502m462N112K658m452m74k30J345m016J0058r398r224j959l007j0963
4317b5852K995P939L924J9906r838o910K574M457m976j966j700n746Q141O976
4303g6N182M086m97j262R14q824j0554J0054J742m134J341k26q386P545p222P883
4287b434q028j328O818M873j150K710l586L829j2137p41L04j0520R450O256L601
4272b083m472m714K611Q078K110n488n961p190K319j120M97m104O404J4506l193
4257a800l88l881N415K008n239l226k834K045J8654P618r701n314J2079k294n767
4242G375r436L481K568O093L030L136m299n508M251M563M787j0460j2736j1174
$$ y = [3923, 4998, -6085, 6160, 8711, -7822, -2317, -1929, -6826, -2982, -1381, 455, 8429, 12742, 11662, 3160, -1302, 3810, 6468, 2016, 1542, 1312, 2657, -1359, 8699, -699, -9923, -11882, -14889, -25852, -22857, -14918, -10994, 8912, -926, -7836, -5262, -805, -5781, -7747, -9447, -15193, -7052, -76, 5106, 9192, 8695, 7433, 8347, -477, -11031, -977, 765, -3369, -2028, -2254, -10640, -3095, -10317, -2434, -10462, -11790, -4972, -99, -1249, 1461, -2125, 1704, -10433, -11174, -10870, -21390, -11940, -5684, -2083, -6555, -11269, -8658, -580, 1530, -3958, -9919, -17109, -14790, -15910, -15413, -19517, -13113, 1393, -1800, -2188, -6069, -654, 1354, -3885, -7111, -9945, -7900, 10754, 18372, 8671, 3357, 15436, 13142, 7375, -2061, 1420, 3988, 10081, 13111, 16247, 11948, 6440, 10691, 15254, 20041, 9581, -3155, -14329]
4228a4329K748K457J357R176j2266o799q94K8078K074O1J922j7735k1260J520
4214b3890Q9J304J1244L421l60R650l372r068J027J0985j1793o601Q077K285l745
4199a0747R209O664J894l829j688j097k7779K313K037qp64K64Q415Q786P768K3
4183A461q13L69K99O508p559P083l159P525J1824m090j1822j2972P81J4478n611
4168D302O659r27O322l725K53k163j043j038j3161n305N889J0768N181j210K430
4153A3232L467j9077j3667K682P984k43L309p120J324k643O434J358n275q915
4139a7150J2051k203p634k212K712j0135n906J1215J5415L082J465K815n122O900
4125E293j4116k697J7655J188J1013J619L734j3110k1681l423K155q158J93M258
$$ y = [-14329, -11581, -9124, -7767, 1409, -10857, -17656, -18550, 9528, 11602, 11663, 13585, -4150, -25410, -23890, -23801, -22497, -11253, -7832, -8192, 1458, -1914, -10982, -9955, 1030, -10763, -17364, -9287, -7002, -10747, -1538, 5126, 7020, 3191, 1503, 406, -27373, -25060, -23023, -23031, -23795, -23531, -15116, -6330, 1438, 1461, 648, 1017, 1316, 7824, 265, 7348, 4189, 11714, 23538, 19448, 7626, -5346, -4565, 9913, 4302, 10961, 10034, 16356, 12631, 12884, 10721, 9678, 8640, -4521, -9826, -3937, 6831, 12012, 10802, 13232, 16699, -2378, -16045, -13363, -5379, -5622, -2313, -9433, -8109, -10752, -4318, -2960, -8235, -17150, -5099, -7302, -14936, -17148, -14436, -24571, -30477, -19262, -3847, -765, 700, 3515, -1607, 5293, -8823, -11520, 6135, 7323, 18336, 19955, 23689, 10579, -11102, -14525, -12370, -20528, -20335, -16077]
4111a6077N936K680R280P487j3313k989P681J4950P968m032o514k4387p798n466
4097b4594j343k386p0J021K0683M231k904k214N361N136j3523O63K763r600J12
4082a6664J2734J2854n876p063K552P950J5434P132O039j2214n643k0861M179
4069E53R339o76l730L156l348P072J1676L834l622j6036j482P068J985l279M415
4054A6925q894k058l311J367J615j277m678r990j398J648O361l787j444J6037
4040G116r90n991j62j5880j2629K764J9169L84j9533J6970J9617Q545l420j2284
4026C676m811l729P792P680L023n041o868J347P807j1613j2412n293L179J0560
4012d703L474k718J492L658Q418P708J0800K637r732j4079n050o924q154K77J5087
$$ y = [-16077, -10141, -7461, 1819, 9306, -4007, -6996, 685, 15635, 23603, 19571, 13057, -11330, -19128, -24594, -25937, -28323, -28393, -27372, -6689, -2458, -5362, -7576, -2215, 2921, -10602, -9939, -7176, -16776, -16664, -3930, 8924, 3048, -4015, -1463, 6487, 21921, 29053, 35092, 22878, 17235, -3626, 553, 9892, 9216, 5486, 8642, 5294, 12366, 24042, 27876, 24254, 8218, 6736, 13804, 15789, 12510, 16925, 8031, 5973, 2662, 4029, 5644, 4367, -311, -10301, -11699, -10051, -3690, -7477, -8921, 7116, 6126, 135, -27, -15907, -28536, -25772, -6603, -6219, -25752, -8782, 10835, 19380, 15960, 3676, -1135, -4864, 2928, 10608, 13631, 8590, 1722, 3069, 10876, -737, -13149, -18442, -15263, -4703, -1229, -3947, -2455, 1203, 9621, 17329, 28129, 30766, 21034, 6955, 1905, -5019, -13173, -12896, 2191]
3997B191L996j598J583N14N024J196N625j2249j3328m178o930Q642L568l55Q590
3982B291L535J018j1177k0494k147J6665L829j1828O162Q870q876J737R19q256
3968a7752R41N668J1801P799P887r501r701p743M603J835j383n072n566J347J3015
3953a822L73k062j0208n359o97J7036J5703p353j613Q937o392J734J341Q57p274
3938C201j8601j2599j0154n658N445J0071M544K977O135R863O343k3245M018k07
3924a7867J1557J2070n755M128J1578p495j0825l531l142R684J3126n818j19L140
3910A0731M914L564J557n427j2018r144O661o180r048R502P948K169N17m526l086
3895a866q188P091J4773j678k4209r574J0373J7623K907n320M708L450J3004l474
$$ y = [2191, 6187, 4589, 6172, 6686, 11710, 12906, 18531, 6282, -7046, -11224, -18154, -9512, -5944, -6299, 2291, 5826, 6844, -4333, -24827, -26974, -10309, -6480, -18308, -12146, -3276, -12152, -10415, -9496, -17752, -16811, -11143, 658, 8457, 16344, 6843, -2858, -10601, -5998, -4163, -5546, -10618, -16184, -14837, -1822, -1449, -3511, -13719, -19078, -19775, -2739, 12964, 5611, 3998, 12935, 6543, 8277, 9618, 10475, 3201, -15400, -27999, -38153, -43811, -38366, -28295, -23751, -20774, -14639, -4776, 1567, -21678, -17660, -17867, -6310, 5760, 5, 4133, 15711, 8216, -2609, -6140, -9282, 402, 13528, 7710, 7591, 10731, 15645, 19209, 20766, 15339, 3321, -5823, 838, -5342, -14390, -4888, 3060, 5229, 5746, 1220, -1866, -10054, -2963, 11810, 10132, -14077, -23651, -13278, 4345, 7252, 1932, 6640, 10090, 23094, 19620]
3881A9620j2432O296k101m153k053n971J0459J2583n118r063j2296p832L268N559
3867c234L108q492K970J3303j560Q356O021n578m993m852J253r48m792m068P209
3852C703q03j2577m564k614o667N153J1748P139o54J5411q875k3180R106J5944
3838H270J2360j9035j2156K335j0103L188J0200m986L666K2628J27j0326j5610
3825i442M871M917l874k902j0856Q231Q696L032k132M583p744k010J1515M60Q982
3810A6327j3031O275J2821j6613j963l315K5939L276j0397p685k128q362j1918
3797a0774M947J2185Q319m304M971q605j7614M101j672L408p552p051J0744K0523
3783A1626J5440Q63j1629k227J130j5566j4507r745R786Q893J2740J1902r117
$$ y = [19620, 7188, 13484, 11383, 7230, 5177, -794, 9665, 22248, 17130, 8067, -4229, -12061, -8793, -3234, -126, -8618, -5648, 7655, 6095, 14451, 20472, 14894, 9901, 5049, 6302, 5354, 562, -3506, 3703, 2900, -9677, -14241, -16855, -23522, -18369, -6621, 518, -136, 15275, 6400, -16780, -7674, 8270, 20630, 1595, -10561, -8226, -18329, -15141, -4941, -9927, -6261, 16367, 16494, 6168, -9442, -4571, 346, -3528, -6430, -17286, -9055, -359, 2673, 541, 5124, -2620, -4630, 6885, 7345, 16327, 3296, 9571, 22392, 5779, 3816, 501, 26440, 29716, 19319, 11634, 9506, 1144, -10774, -5827, 6358, 14677, 10373, 15344, 6739, -10875, -6774, -8446, -5038, -12590, -19641, -8897, 11626, 27066, 27929, 16300, 14073, 15203, -363, -14870, -24615, -14829, -5936, 6804, 18706, 9589]
3770I589R806l455k280q308q090R080n020M506N218J0823n931j6275j1337N677
3756e997n629j742Q605J7601l973j0031j6458n24n882n37Q082J5769N983j754
3742C513K343j4954J1489J0530m484p71k624n167m086R863J610l273p724M643
3728I08j4496m38J0523o891o638J2679R441l367j3846J6914J0803m772p006P425
3714A1239p252n801n34o362P187J956N706l599r76j0328j0412o21r42R053k838
3699a4524n808K679J1561J575P04N541R594p960M514m35p021m676n485N066K719
3684a956J9258J760M269O230k910P112K572j3495j0379m892m683L572J398j2533
3670d677q668J904R170J308R778L093j4559k6070L343J4444J1127P297k092o200
$$ y = [9589, 19395, 15940, 13660, 5352, -2738, 6342, 1322, 5828, 11046, 21869, 15938, -337, -11674, -5997, -11626, -13368, -4763, 12838, 8865, -1166, -17624, -18148, -24030, -24567, -16485, -716, 5267, 3513, 5856, -9098, 2391, 12921, 8437, 7666, 5042, -125, -4211, 5652, 7262, 3989, -3735, 908, -13588, -14026, -3503, -10394, -17032, -4353, 5088, 1721, -12125, 4789, 15592, 10820, 3814, 11239, 3987, -1814, -2348, -8710, -1523, 433, 6139, 2540, 1564, -8764, -19176, -19797, -20739, -11686, -14524, -20332, -17653, -6092, -4517, -3813, 1728, 11322, 3362, 7876, 7441, 420, -4256, -9741, -4675, -1956, 17302, 19062, 23331, 29561, 26651, 33763, 36335, 22840, 12461, 7569, 2886, 6458, 7856, -4677, -13345, -11441, -2271, -963, 8815, 11908, -2651, -28721, -25378, -10934, 193, 7490, 5398, -802]
3656h02l183k492n331o45O433R894L251m473p858j2465J6256J7890n5j5202K931
3641D149R77P461k3k20k860o177l258m729P144o87j2864j0545O801M947K248R276
3625A640P592j5645r030j726J3978L649q330n986L299K950J455m60j1913m317
3611b2844j06J2451M798n142l027J1190P340J3006Q730p109p237j0449M64l528
3597a463q587l598j494P481J0453O678P637Q513j4704l289J8562j38k1889j9317
3583a5155n158j1764J2142P045R63l271L320J3253K0311l93j1379j3879j339M014
3569a290j028L687J307q255n579M824K481M079q010n650J5514R728M534j3368
3555B974r096J6701J1970r584j1514Q77N299n146o492r333m391J7961O604O029
$$ y = [-802, -3985, -6477, -11808, -12453, -6020, 3874, 7125, 2652, -5206, -17671, -1415, 16475, 16420, 1218, 4149, 5126, 12587, 12564, 12344, 9484, 3307, 49, -4680, 2464, 1777, -11087, -21632, -14831, -9884, -7636, 1640, 9232, -6413, -15443, -17169, -3191, 458, -7872, -13858, -10559, -7609, -6154, -6614, -18527, -22844, -22950, -10499, -5701, -10843, -13870, -2680, 4660, 17666, 26396, 19287, 12050, 1601, 2065, -1463, -10050, -13648, -15142, -7661, 2792, 9470, 17107, 25620, 10916, 7627, 26189, 26051, 4162, -15155, -20313, -32077, -19935, -12890, -11927, -15198, -11878, 1375, 21686, 21293, 9914, -3965, -5304, -1290, -2318, 1369, 2676, -5579, -11158, -6334, -3853, 226, -7784, -13434, 2080, 11808, 16342, 2974, -6122, 10579, 22549, 12965, 1451, 2328, 7627, 2481, -4011, -13344, -17735, 226, 6830, 12859]
3541A2859J670o224o928r748j4398m383O621O048o547m642J2862J0228j0751j268
3527a4601K114L118R741O336n929L63J3191J330m992m634L000N060n813j2001
3513c717m228l882l376o031N301K040k524O853L557m42N205p170M632J27k859
3498f514R114J3594J1946r890K520N39j0992M95m471j3774L547N705K56j597N628
3483F106m008N614j767J935j7293l395K3577M589k407m131l908o076n060Q682
3469B458k250j792K385J8265j375l507l747j943m000q411p886J1345K2943N174
3455B7659j810k1637j0841J5519r864j3894j439p660J5360O067p075m415M480
3442i550l78k098O933K852m26L679j2078r234J0873K0072l84J1765J4162l104
$$ y = [12859, 14529, 8305, 1377, -8371, -22769, -27152, -20531, -14483, -21030, -25672, -12810, -2582, -13333, -14601, -12487, -9369, 372, 6708, 779, 1142, 14333, 15663, 10671, 6037, 9037, 14097, 8284, -3717, -7945, -11827, -15203, -21234, -15933, -13893, -16417, -9564, -6007, -6449, -1244, -8414, -3782, -3655, -6514, 2600, 16194, 28140, 18250, 20770, 21309, 10317, 10812, 6341, -7433, -3886, 1819, 2075, 478, 6106, 2098, 7712, 5945, 7880, -9413, -12808, 10769, 15358, 12951, 8820, 4912, -1164, -6224, 2458, 208, -1584, 801, 19066, 17691, 14184, 10437, 8494, 4494, -3917, -11803, -458, 22485, 27659, 25849, 4212, -6629, 8890, -974, -14868, -16307, -23967, -8607, -2540, -9615, -14030, -9550, -9928, -12026, -5093, -2241, -2667, 1012, -11066, -20300, -9427, 10645, 10261, 22026, 36188, 33084]
3428C3084j4960q973j1942j3785J9181J4794n750j2696J3030k0384L589M404m812
3415e220K777N208O98P168J1839l055N19n132q667n074j543M945j112r004M255
3400a398J5045R049m502p675j0569p826N181P067J4772O313j1968j2223N071q109
3386a772l024N592N952m797j2225P611P679Q543R620p414M526Q115m905p591N012
3371B0922P72n251L632L569n550l538o348j614n736N837k050o525j2736O089J996
3356f531J4000J0506k737m627p866L140p969q58O047K1322M312r668J464l236
3342A7299j6142k457k878L906r04j51N119J0193K871j3264p312r68O397k483j0452
3327a1226m707J4187m460n375Q306K371j046O826J693m692J863R823n588L649
$$ y = [33084, 18124, 9151, -2791, -16576, 2605, 17399, 11649, -1047, 11983, -8401, -4812, -408, -5220, -2443, 2765, 3463, 10631, 22470, 19415, 19934, 14802, 6135, 1061, -482, 4463, 3351, -5653, -1398, 13647, 22696, 18194, 10519, -50, -7876, -2695, 4372, 19144, 25457, 13489, 1266, 6337, -1772, -4796, 796, 6748, 1951, -10274, -2663, 5016, 13559, 23179, 15765, 20291, 28406, 23501, 15910, 20922, 21694, 16443, 20075, 23644, 18094, 14556, 8208, 6594, 858, 6695, 4645, -1880, -14616, -8527, -6531, 7469, 17975, 15238, 10611, 2745, 5885, -2084, -2942, 3105, 24427, 28739, 19071, 20535, 17299, 1157, -1300, -4178, -272, -1176, -1327, 3792, 13985, 16856, 3592, -3720, -4688, 1709, -774, -11226, -15933, -1746, -6206, -11581, -3275, -904, -1950, 4876, 6569, 1877, 3740, 13563, 7975, 11624]
3313A1624L786o445j5820j4183J4199J3l725M551M534m904n376K874J7382r642
3299a132J3293j103m711r103j357Q473J0723n59j603O499m170j6987q867K815
3285g789K122n518Q84K332J0589K319o713j4090n621M751O82k071o646L652K992
3270a8125J3255j278j229P241K757k39L190l006O341m545n365n52K726J8030L800
3255B3001k381l019K780j6852j8605k284N572K395O7L691R18l687o88m226l021
3240a6339M821j388p667M311j919j783J4240J7384J2436K845r906M652R419n935
3226B5171j6034j1137J1162p07J688o219j313L600K4104J0231p206j0681j7613
3213E046q81O382M085l730j0476l571J683J258J5715l781j4207l328Q079J1552
$$ y = [11624, 15410, 8965, -6855, -21038, -6839, -6826, -10551, -6000, -1466, -6370, -11746, -8872, 8510, -1132, 12161, 11058, 6347, -2756, -4113, 4360, 15083, 14524, 12921, 19420, 15250, -1737, -10604, -7789, -5667, -11185, -10301, -7969, 2620, 4939, -1774, -15864, -21485, -16734, -16052, -18123, -24769, -21117, -18125, -4870, -6148, -7377, -136, 2621, 2382, 5572, 2566, 8907, 4362, -1003, -1555, 1171, 19201, 23001, 20620, 17601, 20381, 3529, -15076, -17360, -11788, -9393, -9326, -5635, -4717, -8404, -9092, -13318, -16339, -11518, -12906, -20573, -16262, -18181, -19964, -5724, 11660, 24096, 26941, 17035, 21687, 31106, 25171, 9137, -2000, 9162, 8455, 10143, 3924, 2611, 6211, 30315, 40546, 33340, 22659, 5046, 4165, 10547, 14632, 10902, 426, -3145, -1462, -204, 15511, 11730, -2477, -5805, 2274, 13826]
3199A3826n386j763J2509l904m717n276N239M320j0388q609k397o932j3003o374
3185c2855N696N348l533J6259J1118J950J90K822O372l663q89pL593J877j1669
3170B609j3545p185K250J5278N597M865m862j3519q331j828R219l267Q293L219
3156a207l700j1144r55J6972M193p116o285K419N797P867m484J169m570m113N525
3141C68o102K677j52J081J0342j8792j4301M278J6310m732N299J6098P397o398
3127A3373p153j6141J1783J0444J588J55J570q078k270j3960j3797J2372K176
3114g938J487l417l324m556J0118J6271P773O409k560j4870q022P429n449Q271
3100G622j653K340O80K6816J276n610L138n869j7158p446R70N61L747P151P631
$$ y = [13826, 8440, 6677, 19186, 15282, 10565, 5289, 10528, 14848, 4460, -4149, -6546, -13478, -26481, -32855, -27159, -21811, -25344, -9085, 2033, 3983, 4173, 6995, 13367, 9704, 8815, 8808, 12401, 14278, 2609, -10936, -18121, -15871, -593, 5004, 9869, 5007, -8512, -16843, -18671, -9452, -12719, -4426, -1207, -4907, -16051, -17006, -34, 4159, -2957, -9242, -6823, -1026, 6841, 2357, 3526, -1044, -5157, 368, -5734, -3057, -3209, -2128, 8214, -10578, -24879, -20601, -4291, -9023, -3724, 12374, 19771, 13373, 6220, -9921, 1862, 12306, 13894, 14049, 15619, 7541, 5271, -8689, -22486, -10114, -7938, -6451, -9868, -13192, -17748, -7630, 8641, 16414, 22823, 20263, 5393, -2629, 4800, -649, 7622, 5969, 8309, 8989, 35805, 37081, 31471, 34609, 28740, 11582, 4136, 5106, 5667, 9414, 16565, 24196]
3085B4196l036n369j1217j2685N850J3930J211j5509m598L66q449L426Q846j695
3071d733p339O156o92P389M554o872O385q995j1510K174L333J4686K472p728J7842
3056A7122J3983j9026j1506N877L591r940l758k608N398n091l551P090r233p341
3042a8993J3307J3464N523p384r672P60j1400n101J1213M262q412p514Q446o34
3028a2135Q428N228k171L427O492P726n707o816n489J605m122J657l922N305q100
3013h594j584J1110m001j1557K193J7570N067j823K13M642L242P182j905j2019
2999I736O733l00o409o100p176M880L608k712m669O275R069n775j213p864P348
2984E431L620P277K127l508l604j0604J2830j4524k1673J0837J0307M621p785
$$ y = [24196, 21160, 15791, 4574, -8111, -2261, 11669, 12880, -2629, -7227, -6861, -15310, -11884, -3038, -4733, -12072, -5916, -6608, 781, 5335, -1537, 4848, -4147, -15657, -13483, -10150, 4536, 7008, -720, 17122, 31105, 12079, 573, 6450, 10041, 101, -3657, -6265, -867, -5958, -9509, -2419, -11652, -18993, -5686, 7778, 13301, 5917, -3755, -2995, -14395, -19496, -8283, -4021, -12433, -19947, -11501, -12135, -3707, 1521, -650, 2777, 9269, 16995, 11288, 4472, -1017, 588, -3534, -1877, -5799, -494, -8594, -10178, 932, -3069, -14626, -12433, 5137, 10204, 8381, 8594, 13236, 16478, 23660, 21755, 9736, 16469, 16169, 9760, 3660, -3516, 1364, 4972, 2260, -2409, 3866, 12935, 7160, 5947, -1917, 5431, 9051, 16328, 18455, 14947, 11343, 739, 13569, -955, -22628, -11791, -1484, 3137, -4648]
2971d648L083m375L838p364J388J705j396l771R090p120p539l682K530L629Q154
2956f478J4700O419q301j4988j4290j326R313K002JO471L409K92Q119j066q025
2941c748k939o442r910l170J0175R749O369J0758j0628j8374o755r541L158J8457
2927a2841J1507K583K999j404q331M014R895j0444q654Q171J138P321J1507K673
2913B0134m415k0237q488J5500J2193l38k259L159q240P103j0116K502j541R024
2899A3981k03p80k067k717O920J0403o974p142p427j411p105q484j1987J559K2414
2884a020P397o937p53L956L616N200q041j3215M726k409L549J4879l335j5518
2870g905q984j392J8119l82o498j3963j054O351Q345R064o647L24J2133O959q948
$$ y = [-4648, -1565, -5940, -2102, -9466, -8078, -6373, -7769, -11540, -2450, -9570, -17109, -20791, -18261, -14632, -6478, 8222, 14641, 6340, -8648, -22938, -24264, -14951, -12949, -12948, -6477, -3068, -2776, 5343, 4277, -3748, -6687, -13129, -23039, -26209, -16034, -6285, 84, 10842, 214, -18160, -24915, -34456, -31298, -12841, -1334, 1249, 4248, 2844, -5487, -1473, 8422, -2022, -10676, -2505, -1367, 5954, 17461, 20134, 15719, -4518, -13006, 2494, 14687, 14349, 12090, 15249, 7009, 14112, 3996, 6498, 4957, 13981, 13778, 12998, 10931, 8214, 15134, 25537, 18563, 11421, 3994, 2583, -4522, -13006, -24993, -23434, -1020, 6377, -560, -1313, 2643, 6259, 11459, 3418, -9797, -5071, -7480, -3931, 10948, 7613, -7905, -16889, -18281, -162, -544, -7042, -21005, -22059, -15708, -7363, 1701, -4946, -4622, 7511, 14470, 5522]
2855E522K35J999k095Q347M370K375p025q877k381l717j588n809M797M268L056
2840C477J291j557J2827M143m381m459p136L779k623k71O689Q213o937n995q036
2825i76q993p585q40R187j0561Q943K540K117j834p190Q87N860j229N283L58o092
2809a0125j2664q675J439K4028J4821k075o413j670R584M919j395p4P061l875
2795A4886j8563J2172J2254j0943q379P878m453q687q353J4377k511n10p905j2157
2781b0894J425P099k322Q037J4422k5599j5695O023O055M147M737Q288K26j0978
2767a5029o187p998r643J2987J4701j24j0769r484J1242O336K951m274j865R792
2753g364K344n820J0035J4519n51j3083p82P411O276o857p546J406n998j031L18
$$ y = [5522, 5757, 7756, 5661, 14008, 18378, 20753, 13728, 4851, 2470, -1247, -2835, -8644, -3847, 421, 3477, 4768, 3211, 16038, 20181, 15800, 11341, 4205, 7984, 5361, 5090, 11779, 19992, 13055, 7060, -976, -9969, -17554, -18394, -9207, -19768, -10825, -8285, -6168, -8002, -15192, -14305, -8445, -9674, -4391, -4033, -10125, -22789, -31464, -30025, -5997, 8824, 6749, 336, -1334, 8250, 13169, 11774, 11700, 18761, 14886, -3677, 8495, 20749, 9806, 1427, 9305, 4852, -3835, -12188, 2189, -322, -832, -8737, -20894, -19469, -12370, -14692, -6655, 7767, -17832, -33527, -27504, -21449, -17302, -12565, -4277, -4051, -15029, -21216, -29214, -38857, -25870, -11169, -11293, -22062, -31546, -20304, -13968, -11017, -15291, -17156, -7364, -5020, -10840, -805, 13714, 13163, 80, -702, 6709, 12985, 6128, -1418, -12, -6010, -7041, -6723]
2738f723j2735L000J5514M8r752K784P764n485P16O590p332j020n80m17J5739
2723H111J0236l920p688j0594n942J859P84N875o75J0191k674r396j0257M03J5801
2708B114K544qp037m535K622N125K101k212q215J857J1307n590m381j775o749
2693a2832r933j8047O956K0919P280p94R867R809n722k3934k781P773J2804Q950
2679A0315j2069q313q8O714J4904R121q595j4362l765J389m640o164R970J3779
2665H196J0512r403o945k765k887n411J7455P175l567L497L322o689q813Q945
2651A2622k470m115p582L024p921r563k909J1505J1291N337n347j3911L139n64
2637g464K516m80K073K43p726P590P465o826J203k030o730J363J609o425K467
$$ y = [-6723, -19458, -16458, -944, -896, -10648, -7864, -100, -5585, -4869, 1721, -5611, -6631, -7211, -7628, 8111, 18347, 14427, 6739, -3855, -9797, -7938, -7154, -1279, -1954, 8237, 5563, -3833, -14090, -13687, 2114, 4658, 4650, -2387, -6922, -4300, 825, 2926, 714, -7501, -5644, 5663, 73, -4308, -6083, -12832, -22765, -40812, -33856, -12937, -5657, -6451, 3416, 13225, 7503, -16431, -19212, -11439, 1365, 10315, -1754, -10067, -10155, -3441, 11463, 20584, 11989, -2373, -6138, -4749, -9389, -15553, -5583, 8196, 18708, 9305, 2360, -405, -3292, -8703, 8752, 15927, 12360, 15857, 19179, 12490, 3677, 12622, 10152, 6037, -1545, 1479, -6442, -16005, -18914, -7409, 3882, 9219, 3872, -10039, -6900, -7464, -4948, -5428, -3355, -3112, -10838, -3248, 4217, -2609, -1406, -3436, -10166, -8803, -7194, -13619, -11152]
2622a1152j97l434K400k266J1042J7171p806q706L686m213R132L161k890j5134
2608i206p467l16J4231L358q839M505j4387r095M506R780L160j950J1052j966
2594b634N424j634r610l17n377P302R032J2380K124j2620j6859K021J965K753
2580f050j728L187P553J926j4595k944K550L356k645j393N711M984L038j6186
2566a3236j7118J3727J0654L812k800m267M164J2446p871R618k767j4362k629
2553a0629p730R19J0986Q803j670p821J743J2867J602K160j979l512j951p454
2539c666M131q700j5639J475J6909R281Q68j041L672n639J3j658j0263j1034K15
2524b1076J5276K985l358J0097Q290R570m204j1765o166L405Q059j419k866M665
$$ y = [-11152, -11349, -14783, -12383, -14649, -3607, 13564, 5758, -2948, 738, -3475, 5657, 8818, 5928, -9206, -16673, -16989, -2758, 600, -8239, -3734, -18121, -27216, -22710, -12930, -9770, -11720, -668, -2634, 2790, 1156, -8454, -8771, -14148, -6846, 2186, 14566, 16690, 4070, -12789, -10768, -8803, -6050, -7778, -4591, 2962, 4888, -9707, -12651, -10101, -6745, -9390, -10783, -5072, -88, 2950, -13236, -30354, -16627, -5973, -2161, -4961, -9228, -5064, 7382, -489, 9129, 6362, -8000, -10629, -18359, -17440, -6454, 2349, 679, -7142, -5399, 7468, 9070, 11230, 9251, 5739, 3788, -3666, 465, -8235, -23874, -22399, -5490, 3791, 4659, 3618, 7290, 1651, 1664, 6, -10257, -21291, -21076, -5800, -2815, -6173, 3924, 12214, 21784, 17580, 5815, -351, 3054, 11113, 9694, 6828, 11493]
2510A1493P158K949j5351O029J135j0535L966j056j1227n701M074K718l052J3688
2496F288M887J412n986j1656m433M7N581Q89o060J2263m481J377J292p903l728
2481a0211N439l355L33j787m575J4372Q519j2283q354p123O016J2244N047N306
2467I588p699j2457M836K5155k20j3224r238K1N91N973K484n722m48J0361Q490
2452A8491o003m40m126p89J184o190n550O440k263j628n143J547O351m768l274
2437f161J8985n266K820M583l578p805Q2j091J649M735j1060n46j159J650k77
2422b439J3479N021j026N897n892o236k684K235j301M882l709n879l14L160m156
2407A038j103o860j0991J3118J6202N768O216N852p59M148n915j4670L800J601
$$ y = [11493, 18651, 21600, 6249, 12278, 13413, 2878, 6844, 5788, -5439, -11140, -7066, -4348, -7400, 6288, 11175, 12587, 6601, -5055, -9488, -9441, -3860, -2971, -9031, 3232, -1249, 128, 1420, -6483, -10211, -4772, -8127, -7794, -9581, -14156, 216, 8735, -3548, -11902, -19025, -13009, -765, 4282, 9588, 1889, -10568, -5732, 19423, 19203, 5979, -3259, -3238, -2647, 3326, 5810, 88, -360, 10001, 18491, 12488, 12048, 7922, 7133, 8317, 2127, -3423, 3017, 754, -874, -6017, -4470, 1881, -2887, -6161, 12824, 7558, 10378, 14961, 11383, 3578, 3660, 2569, 4218, 8953, -2107, -2653, -3812, -2162, -2439, 11040, 16061, 15035, 20932, 15040, 8804, 6120, 8355, 7054, 11936, 8227, 2348, 2034, 5194, 1038, -65, -6925, -17916, -4798, 11404, 17172, 23388, 29240, 28481, 32629, 26714, 12044, 15844, 17445]
2393A7445R29q264M344n812L646K762q388j0703k602R387J2456j065j3528N380
2379E987n408k495J2144n890j1231j321P008J3232m911K533P95n324q403r272
2365a2556r161r539Q148K1605j301j3570q16M646J0145P645J958j5893n78j095
2351a0362p102J2904j704R395K082Q226j4228o934N080J3089m355r276K527q796
2337i454M465J0426k753k876P38p182j1073L954M869m733J5436M785j0563k1770
2323b5731J784J5663M227l789K729J0064J0517k434j890J0601l762l74R898n800
2309B1703m951p087L892m586j2859J3548p204j0506J457J1899l245m538P941j282
2295D182j1980M085J714q313q712J1658R213J709n048j278k217J5159K876m417
$$ y = [17445, 18374, 10110, 14454, 8642, 12288, 15050, 6662, -4041, -6643, 2744, 15200, 14135, 607, 5987, 579, -1916, 10228, 4338, -6893, -8214, -1206, 12026, 7115, 9648, 10443, 5119, -3284, -12556, -21717, -31256, -23108, -1503, -2804, -16374, -17190, -12544, -2399, 5246, 7204, -8689, -9267, -10362, -17464, -4560, -6264, 3131, 5213, 13439, -789, -7723, -2643, 10446, 6091, -3185, -658, -9454, -4989, 5437, 2684, -192, 546, -6636, -17709, -13755, -8886, -13619, 1817, 6602, -3961, -25731, -23947, -8284, -4057, -7846, -5117, 4947, 15464, 13030, 11140, 21741, 17979, 17605, 27503, 21703, 16752, 9665, 13557, 8971, -3888, 9660, 2456, -8050, -6593, 5306, 2061, -2477, 5464, 4182, -7798, -3713, -1999, -10312, -19024, -7366, 1847, 3556, -1492, -2770, -4987, 10172, 13048, 8631]
2281H631O376L990j5687j1080p388j624k333R213P160J980O220k424p870k681
2267g517J249r588J0034Q705P332j723j350p29L697R261q459p331j498O889j3967
2252d995k68M342l718O234Q360Q886l819j0881K234P596r34k3313K898J2008J0667
2237A5297r85L568k389m671J0170j328j5222M608J364N414K411k174r194L846
2223A0715M780k942m444o138j1769o825P04M241L091m208R503M388k491o488j0402
2208a8285m475O384K0807L658J2786k615Q829q011j5391j0773p088p748K182N347
2194a4393L05L762K0652K275q832J0766P554Q475q999r819k793J123K598n528
2180G146j1723M169J7802o124m809P399q584k221P088N676N773n877J876m796
$$ y = [8631, 15007, 18997, 3310, -7770, -15158, -16782, -19115, -9902, -2742, -762, 5458, 3034, -4836, -7517, -6268, -15856, -5822, 2883, 10215, 8492, 7142, 6413, 10110, 19371, 10912, 3581, 2083, 8972, -4995, -5263, -921, -4639, 1595, 9955, 18841, 15022, 4141, 6375, 13971, 13037, -10276, -7378, 4630, 15297, 14312, 17880, 15491, 10820, 20990, 19662, 4440, 9048, 10412, 15826, 18237, 16063, 6869, 10715, 15495, 12553, 8109, 1971, -9798, -16623, -15919, -11678, -8587, -12795, -3292, 1096, -1395, -7883, -18285, -22760, -16376, 4431, 8089, 20875, 18260, 27089, 19078, 3687, -7086, -14174, -21922, -19740, -14393, -14088, -10326, 10326, 12601, 3769, 14535, 22089, 30564, 21565, 11746, 8953, 10076, 12674, 7146, -4577, -408, 17394, 11270, 6461, 13860, 5276, 3055, 10143, 15819, 21592, 15715, 17591, 12795]
2166A2795p905K988o315l760m330M686o040k029n150k498k352J083J4735R575
2152E483J426o054R108j7071r630Q882O233J2210J1922q688r258j60p947j1828
2138a5372L249J1450m326O573L327Q74p61k188J1204J8440k056j3409j2097p465
2124b557P96J567P611R564Q364J985k3783l166r620N963o808Q993J5781j4811
2110a21n18J0014J0020p084k483m512O673N449j4575p966q03k929J0461M715j3159
2095f818o813M211N776M872K54M267J226j1678P21J8573K907j6216j309J4544
2081A4517J1736n618j769m100q243J3830r7l460j618n367l738M171j0454l998
2067d208L823q57O915k19j3777j1277k0J4643j746J4925Q923j1232q954P805o64
$$ y = [12795, 4890, 7878, 1563, -2197, -6527, -1841, -7881, -9910, -15060, -17558, -19910, -18827, -4092, 5483, 6909, 855, 9963, -7108, -16738, -7856, -1623, 10587, 22509, 13821, 4563, 4403, -3544, -15372, -12123, -673, -4999, 1574, 4901, 5775, 5014, 2826, 14030, 32470, 30414, 17005, 4908, -2557, -1761, -194, 7417, 16981, 25345, 27330, 3547, 381, -9239, -3276, -10084, -1091, 14690, -121, -639, 9375, 19395, 12311, 9828, 5316, 11989, 17438, 2863, -5103, -5906, -8835, 1626, 6341, -6818, -13631, -9420, -3644, 1228, 1482, 5749, 6975, -4703, -3982, 14591, 17498, 1282, -27, 14517, 26253, 20635, 18866, 14766, 6523, 20353, 20256, 16796, 15178, 9811, 6073, 10244, -210, -4208, -385, -1242, 5673, 5454, -8323, -19600, -19620, -4977, -6723, 8202, 17125, 5893, -3061, 4744, 4080]
$$ [...]
##END NTUPLES=NMR SPECTRUM
##END=
