##TITLE=Analysis number 316923
Compound Code btb 10355
Project Code adrs
Chemist Name prosynth
##JCAMPDX= 6.0         $$ Bruker NMR JCAMP-DX V2.0
##DATA TYPE= NMR SPECTRUM
##DATA CLASS= NTUPLES
##ORIGIN= Bruker BioSpin GmbH
##OWNER= nmr
$$ XWIN-NMR		Version 3.5
$$ Wed Feb  1 15:07:23 2006 GMT Standard Time (UT+0h)  MAYBRIDGE\nmr@NMR_250MHZ
##.OBSERVE FREQUENCY= 250.131544655141
##.OBSERVE NUCLEUS= ^1H
##.ACQUISITION MODE= SIMULTANEOUS (DQD)
##.ACQUISITION SCHEME= undefined
##.AVERAGES= 16
##.DIGITISER RES= 18
##SPECTROMETER/DATA SYSTEM= dpx250
##.PULSE SEQUENCE= zg30
##.SOLVENT NAME= CDCl3
##.SHIFT REFERENCE= (INTERNAL, CDCl3, 0, 16.522)
##AUDIT TRAIL= $$ (NUMBER, WHEN, WHO, WHERE, WHAT)
$$ ##TITLE= Audit trail, XWIN-NMR		Version 3.5
$$ ##JCAMPDX= 5.01
$$ ##ORIGIN= Bruker BioSpin GmbH
$$ ##OWNER= nmr
$$ C:\u/data/dgb/nmr/ADRS/15490/pdata/1/auditp.txt
$$ ##AUDIT TRAIL=  $$ (NUMBER, WHEN, WHO, WHERE, WHAT)
(   1,<2006-02-01 15:06:59.58 +000>,<MAYBRIDGE\nmr>,<NMR_250MHZ>,
      <created by zg, POWCHK disabled, PULCHK disabled
       configuration hash MD5:
       84 BC 41 DB A1 6E 1D 46 DA 25 12 A5 C1 ED C5 3A
       data hash MD5: 64K
       29 26 0E 00 72 12 F2 2F FB 09 B9 B5 63 EB 58 DF>)
(   2,<2006-02-01 15:07:14.61 +000>,<MAYBRIDGE\nmr>,<NMR_250MHZ>,
      <Start of raw data processing
       ef LB = 0.3 FT_mod = 6 PKNL = 1 SI = 32K 
       data hash MD5: 32K
       9D 47 2B D2 CD 1B 5D 8B DF FC 22 4A D3 89 5D 15>)
(   3,<2006-02-01 15:07:16.47 +000>,<MAYBRIDGE\nmr>,<NMR_250MHZ>,
      <apk 
       data hash MD5: 32K
       C8 1B 82 8E 5B 7C 2A 15 90 3F B2 B1 31 46 59 09>)
(   4,<2006-02-01 15:07:17.19 +000>,<MAYBRIDGE\nmr>,<NMR_250MHZ>,
      <abs ABSG = 5 
       data hash MD5: 32K
       FE B9 5B 23 15 42 8D E9 C5 1F 2F A5 8A B8 23 78>)
$$ ##END=
$$ 
$$ hash MD5
$$ CF 1A F0 21 04 F0 30 A5 75 87 C0 B9 68 1F D7 CB
##$RELAX= 
##$RELAX= 
##$RELAX= 
##$RELAX= 
##$RELAX= 
##$RELAX= 
##$RELAX= 
$$ Bruker specific parameters
$$ --------------------------
##$DU= <C:\u>
##$EXPNO= 15490
##$NAME= <ADRS>
##$PROCNO= 1
##$TYPE= <nmr>
##$USER= <dgb>
##$AMP= (0..31)
100 100 100 100 100 100 100 100 100 100 100 100 100 100 100 100 100 100 
100 100 100 100 100 100 100 100 100 100 100 100 100 100 
##$AQSEQ= 0
##$AQ_mod= 3
##$AUNM= <au_zg>
##$AUTOPOS= <29 >
##$BF1= 250.13
##$BF2= 250.13
##$BF3= 250.13
##$BF4= 250.13
##$BF5= 500.13
##$BF6= 500.13
##$BF7= 500.13
##$BF8= 500.13
##$BYTORDA= 1
##$CFDGTYP= 0
##$CFRGTYP= 5
##$CHEMSTR= <none>
##$CNST= (0..31)
1 1 145 1 1 1 1 1 1 1 1 1 1 1 1 1 1 1 1 1 1 1 1 1 1 1 1 1 1 1 1 1 
##$CPDPRG= <>
##$CPDPRG1= <>
##$CPDPRG2= <>
##$CPDPRG3= <>
##$CPDPRG4= <mlev>
##$CPDPRG5= <mlev>
##$CPDPRG6= <mlev>
##$CPDPRG7= <mlev>
##$CPDPRG8= <mlev>
##$CPDPRGB= <>
##$CPDPRGT= <>
##$D= (0..31)
0 1 0 0 0 0 0 0 0 0.06 0 0 0 0 0 0 0.0002 0 0 0 0 0 0 0 0 0 0 0 0 0 0 
0 
##$DATE= 1138806418
##$DBL= (0..7)
120 120 120 120 120 120 120 120 
##$DBP= (0..7)
150 150 150 150 150 150 150 150 
##$DBP07= 0
##$DBPNAM0= <>
##$DBPNAM1= <>
##$DBPNAM2= <>
$$ [...]
##$SUBNAM7= <"">
##$SUBNAM8= <"">
##$SUBNAM9= <"">
##$SW= 20.6930455092707
##$SWIBOX= (0..15)
0 0 3 0 0 0 0 0 0 0 0 0 0 0 0 0 
##$SW_h= 5175.983436853
##$TD= 65536
##$TD0= 1
##$TE= 293.16
##$TE2= 300
##$TE3= 300
##$TEG= 300
##$TL= (0..7)
0 120 120 120 120 120 120 120 
##$TP= (0..7)
150 150 150 150 150 150 150 150 
##$TP07= 0
##$TPNAME0= <>
##$TPNAME1= <>
##$TPNAME2= <>
##$TPNAME3= <>
##$TPNAME4= <>
##$TPNAME5= <>
##$TPNAME6= <>
##$TPNAME7= <>
##$TPOAL= (0..7)
0.5 0.5 0.5 0.5 0.5 0.5 0.5 0.5 
##$TPOFFS= (0..7)
0 0 0 0 0 0 0 0 
##$TUNHIN= 0
##$TUNHOUT= 0
##$TUNXOUT= 0
##$USERA1= <user>
##$USERA2= <user>
##$USERA3= <user>
##$USERA4= <user>
##$USERA5= <user>
##$V9= 5
##$VALIST= <valist>
##$VCLIST= <CCCCCCCCCCCCCCC>
##$VD= 0
##$VDLIST= <DDDDDDDDDDDDDDD>
##$VPLIST= <PPPPPPPPPPPPPPP>
##$VTLIST= <TTTTTTTTTTTTTTT>
##$WBST= 1024
##$WBSW= 4
##$XGAIN= (0..3)
0 0 0 0 
##$XL= 0
##$YL= 0
##$YMAX_a= 552282
##$YMIN_a= -463982
##$ZGOPTNS= <>
##$ZL1= 120
##$ZL2= 120
##$ZL3= 120
##$ZL4= 120
##$ABSF1= 16.522
##$ABSF2= -4.171173
##$ABSG= 5
##$ABSL= 3
##$ALPHA= 0
##$AQORDER= 0
##$ASSFAC= 0
##$ASSFACI= 0
##$ASSFACX= 0
##$ASSWID= 0
##$AUNMP= <proc_1d>
##$AZFE= 0.1
##$AZFW= 0.1
##$BCFW= 0
##$BC_mod= 0
##$BYTORDP= 0
##$COROFFS= 0
##$CY= 12.5
##$DATMOD= 1
##$DC= 0
##$DFILT= <>
##$DTYPP= 0
##$F1P= 14.0000005364418
##$F2P= -0.99999901652339
##$FCOR= 0.5
##$FTSIZE= 32768
##$FT_mod= 6
##$GAMMA= 0
##$GB= 0
##$INTBC= 1
##$INTSCL= 1
##$ISEN= 128
##$LB= 0.3
##$LEV0= 0
##$LPBIN= 0
##$MAXI= 10000
##$MC2= 0
##$MEAN= 0
##$ME_mod= 0
##$MI= 0
##$NCOEF= 0
##$NC_proc= -6
##$NLEV= 6
##$NOISF1= 0
##$NOISF2= 0
##$NSP= 0
##$NTH_PI= 0
##$NZP= 0
##$OFFSET= 16.522
##$PC= 1
##$PHC0= 103.4364
##$PHC1= 1.461291
##$PH_mod= 1
##$PKNL= yes
##$PPARMOD= 0
##$PSCAL= 4
##$PSIGN= 0
##$REVERSE= no
##$SF= 250.13
##$SI= 32768
##$SIGF1= 0
##$SIGF2= 0
##$SINO= 400
##$SIOLD= 32768
##$SREGLST= <1H.CDCl3>
##$SSB= 0
##$STSI= 32768
##$STSR= 0
##$SW_p= 5175.98343685301
##$SYMM= 0
##$S_DEV= 0
##$TDeff= 65536
##$TDoff= 0
##$TI= <Analysis number 999999
Compound Code 99
Book Reference 9
Project Code 9>
##$TILT= no
##$TM1= 0
##$TM2= 0
##$TOPLEV= 0
##$USERP1= <user>
##$USERP2= <user>
##$USERP3= <user>
##$USERP4= <user>
##$USERP5= <user>
##$WDW= 1
##$XDIM= 32768
##$YMAX_p= 391209666
##$YMIN_p= -795896
$$ End of Bruker specific parameters
$$ ---------------------------------
##NTUPLES= NMR SPECTRUM
##VAR_NAME=  FREQUENCY,     SPECTRUM/REAL,   SPECTRUM/IMAG
##SYMBOL=    X,             R,               I
##VAR_TYPE=  INDEPENDENT,   DEPENDENT,       DEPENDENT
##VAR_FORM=  AFFN,          ASDF,            ASDF
##VAR_DIM=   32768,         32768,           32768
##UNITS=     HZ,            ARBITRARY UNITS, ARBITRARY UNITS
##FACTOR=    0.157963299565203, 1,           1
##FIRST=     4132.6476996994, 0,             0
##LAST=      -1043.33573715361, 0,           0
##MIN=       -1043.33573715361, -795896,     0
##MAX=       4132.6476996994, 391209666,     0
$$ Real data points
##PAGE= N=1
##DATA TABLE= (X++(R..R)), XYDATA
$$ [...]
23328c151j6947j10773j49029K3328R4991j17122k49670K5750J41684j6174P8886
23317b98227J93665R7900O1686N1646j4754q7195j93365r4050K222K07842J4868
23306e7762J4436J6105J63862r7935j50438R5725m843j49776L780R1493j72357
23295b47710k14890J13489J83140m9077K8439J56951n268N5341J12005J79995
23285C12415r5201q7976n4564k17408k77356n3461J19481J29834M6672k5491l1062
23274b34117P5625J16756j45571N2509J14850K31841q7703j19551L5746K868j1466
23263C1787J95545m7374j87334j13996j67651J67001K33453M6648r8594N1627
23253A11112m0301j23480j40628L3185k1679J27560J10273q2924j40120R4121
$$ y = [-3151, -20098, -130871, -279900, -256572, -161581, -278703, -528373, -502623, -360939, -377113, -298227, -104562, -6662, 55024, 106670, 91916, 4721, -188644, -282694, -280472, -72630, -57762, -43326, -27221, 136641, 38706, -111732, -16007, -20850, -170626, -166846, -75353, -247710, -462600, -349111, -165971, -215048, -186609, -29658, -34926, 20415, 132420, 312415, 217214, 129238, 74674, -142734, -420090, -473551, -354070, -224236, -177564, -203055, -234117, -158492, -41736, -187307, -134798, -19948, 211893, 124190, 4639, 40385, 43253, 31787, 227332, 179958, -7376, -121372, -289023, -122022, 111431, 158079, 59485, 111112, 70811, -52669, -193297, -160112, -181791, -54231, 56042, -26882, -167002, -72881]
23243g2881k5304m0161K5657K31469m4615j20312R1137q4864l8323R2380o4914
23232e0731J56370J79053l9439J907J554M7930j45932j19452j15348j35749L9356
23221a80481N9572J67752K9121J08226k7595o3982m3501J00400J50105J9207k2271
23210B96553j27980r347j10332j55632j78959k24106J23564J56287M4317J00495
23200h5140j7457L1765j17112L8068J77911R4086j41412k2015R6279O490j67507
23189a06044o084K29249m6128n745L3848j3684J19678n5182m6891o9360n8402
23178b4745l8274J20294p4242j0646o1030L6127K50413l9242k20325p7761J29948
23167i483J8080j28651J8963M6848P2600J34430N7809m4048N9027j2047N4211
$$ y = [-72881, -98185, -138346, -112689, 118780, 74165, -46147, 44990, -39874, -78197, 14183, -50731, 105639, 284692, 245253, 247160, 248714, 296644, 150712, 31260, -84088, -219837, -180481, -120909, 46843, 75964, 184190, 156595, 92613, 49112, 149512, 299617, 318824, 296553, 168573, 159226, 48894, -106738, -285697, -509803, -386239, -229952, -185635, -85140, -102597, -70832, -187944, -149876, 28035, 122121, -19291, -41306, 54973, 61463, -106044, -112128, 117121, 70993, 65248, 99096, 85412, 205090, 149908, 103017, 33657, -24745, -63019, 57275, -16967, -27613, -88643, -52516, 197897, 158655, -61670, -139431, -9483, 8597, -120054, -101091, -54243, 18357, 152787, 210596, 166548, 225575, 213528, 267739]
23156B67739m4912j24207K635j33513m3543M8998J45463K32983n8049k64450j9322
23145I822K16057K9360j6679j32055n2130L4324J67044J1825j24589k46173l779
23134a06973K8756j8766r0110J0144j09200K6487J54597P5708M2263j14795L4450
23123f7439N0937k8928M775k8534N9191j9086q625j6337j04869K42640J34548
23112B18273q173j13032j19002k0166O0940K7856l38500L948K39085J01872K8137
23101H1238J62935N6248j97937j91837j3031K9938j50290n3834J06111J9854o0269
23090b10874N178J58359J10581J2855m7895o2860K5210j11092Q1927j34224r9146
23079b71981P6442R2394J34734J42475L2596j70018j28973k62930m4920k0602
$$ y = [267739, 222827, 98620, 101255, -32258, -75801, -26803, 118660, 351643, 293594, 29144, 9822, 225879, 255239, 238560, 106505, 54375, 88699, 255743, 267568, 142979, -103194, -106973, -78217, -96983, -187093, -176949, -286149, -259662, -105065, -29357, 12906, -101889, -67439, -16502, -45430, -40655, -69189, -9998, -29084, -37709, -54046, -158915, 83725, 218273, 210100, 97068, -21934, -42100, 18840, 46696, -291804, -287856, -48771, 53101, 81238, 244173, 300421, 102484, -89353, -102384, -72446, -222736, -276570, -170459, -150605, -210874, -205696, -47337, 63244, 76099, 28204, -34656, -9446, -120538, -38611, -172835, -271981, -195539, -103145, 31589, 174064, 206660, 36642, -92331, -355261, -400181, -420783]
23069d20783Q7061K52815R1577j53609q8412J19700J63010Q9328k7585j66398
23059e3296n770r0316p7992l9212N3060N5237J74528j6336K311J64286P2887N0539
23047B89926o5279j39353l13460K4959J09651j90762l4977J55912J14421m0463
23037h9425J32008Q2641M1558R9031q2809k92420k3222J05680j13334J95716P6127
23026A31551Q5993j15377J16363M7869k7996J38543m4252Q4882r4198j13440j07507
23015A02431L9624r3019j02448k3974m5903K18179J76242r6747j86254k26426
23005b38295l1209R7393j85892J4995q8003J71905M9871P4857J34302J63903J42930
22994C06757n119j1968j90770k80469j72704R012O8258N4326j88965n1852O7619
$$ y = [-420783, -333722, -80907, 10670, -142939, -231351, -111651, 51359, 140687, 113102, -53296, -59066, -149382, -227374, -266586, -213526, -158289, 16239, -97, 2214, 166500, 239387, 289926, 224647, 85294, -228166, -203207, -93556, -284318, -319295, -163383, -48962, -89425, 42583, 125224, 166782, 265813, 183004, -109416, -132638, -26958, -140292, 55424, 131551, 217544, 102167, 218530, 266399, 238403, 376946, 332694, 417576, 323378, 209938, 102431, 142055, 49036, -53412, -77386, -123289, 94890, 271132, 174385, -11869, -238295, -269504, -172111, -358003, -343008, -431011, -259106, -209235, -134378, -76, 163827, 306757, 301638, 289670, 98900, -181569, -354273, -345261, -277003, -222677, -411642, -463494, -395875]
22983c95875N8468R7356K5585K295k8768P0191K22143k1856m6084J10085m2201
22972E1339N5950n819r3887r3441O1301M591j53518R6705l7997k1207K4728n3011
22960a64266J27132J90628n9171o3500N0768n3447q3249M108K17190k8145k8067
22949A09981K23750K8349j03829q3461k58546K509J00065Q5298r3122p6745j5310
22938h1061j94577o2682J33284j5622K90184L98293j33428j45383Q4089j93977
22928G9120p7877k362Q853M953k80029l3757J43808L20228J30957N1633j22692
22917B22835j35166j16562J01060J02790k16007n7331l1263K26413P0934K7763
22907A95466L4574L0369K49q9328M325o2490k20240L528o9132m595l7615J36893
$$ y = [-395875, -337407, -240051, -214466, -212171, -240939, -170748, 51395, 29539, -16545, 93540, 51339, 107289, 101470, 7583, -85858, -24557, -19966, -173484, -76779, -114776, -135983, -111255, -164266, -37134, 153494, 94323, 30823, 81591, 28144, -55105, -50997, 166193, 138048, 109981, 333731, 362080, 258251, 174790, -83756, -81247, 18818, 104116, 10994, -65751, -81061, -275638, -338320, -205036, -220658, 69526, 467819, 334391, 189008, 273097, 79120, 1243, -1119, 7734, 12687, -267342, -301099, -157291, 162937, 293894, 345527, 222835, 87669, -28893, 72167, 174957, -41050, -98381, -129644, 96769, 167703, 195466, 230040, 260409, 260658, 171330, 175655, 113165, -107075, -103547, -172679, -177274, -214889, -77996]
22895g7996J95476k832J37969J78186q3682k15060q8400j17401j13530p8463r9827
22884c65560J42634K53988K9101k3038j7810J00588n9851N3826L6785j06426J09525
22873A53762K53729k32104p2855R1646J57627O4070j67860j92141P974K08918
22863B72766J4561j03644j35073K772N3915K9310k27134J5587J76717J03201r6295
22852A06683r9116j2934K70887k8504k9443j11462j23964O1477J652R7629m6878
22841H6027l0711p3945O4526k1402j36873o7300L9127R8515J36316K2394J40800
22830B57474J16165j80342k47885q7997j85242J29159K97219M7983R9625K1782
22820B67941q8774l20092q4124O4913K54858J61111j52824k62369o2856K21753
$$ y = [-77996, 117480, 114648, 252617, 430803, 347121, 132061, 43661, -73740, -187270, -265733, -365560, -222926, 31062, 60163, 37125, 19315, 119903, 60052, 113878, 150663, 44237, 153762, 407491, 175387, 102532, 194178, 351805, 415875, 248015, 55874, 63848, 272766, 287327, 183683, 48610, 51382, 105297, 134607, -92527, -76940, 99777, 202978, 106683, 7567, -5367, 265520, 237016, 207573, 96111, -27853, 33624, 35276, 132905, 86027, 55316, -18629, 45897, 24495, -112378, -179678, -140551, -42036, 94280, 116674, 257474, 373639, 193297, -54588, -142585, -327827, -198668, 98551, 146534, 246159, 267941, 179167, -140925, -225049, -160136, 94722, 255833, 103009, -159360, -222216, -463]
22810d63J63740K2229n5194K00435j587j36508M2367j24086j69384P2947J04974
22799A19470j6346J36296J52038p5345j94998N5682j935k79242O4885R4748j91288
22788a36035J46477J46248J7225j59295l4943J16162P8267o0800j21451q4682
22778i2827j21445K34049O1367j15259L1269J33091j44388q8259J32544J47808
22768A77950l9059j53865l0965j03553o8029j5879m8338P3699O4194K880J4903
22757a26062J94441J37921J22586r7914j39735r8627K8657j49139j25184J83234
22747f9822j18780L1037K94147k3017M8518K15283q340l17765n8992O3845m3049
22736A3065L9965J40687n8663k00901m3511O3281k0110j45098J21438K27398O5366
$$ y = [-463, 163277, 185506, 130312, 330747, 329160, 192652, 235019, 110933, -58451, 14496, 119470, 103124, 239420, 391458, 316113, 121115, 176797, 174862, -104380, -39495, 55253, -136035, 10442, 156690, 173915, 14620, -20323, 95839, 174106, 113306, -8145, -92827, -214272, 19777, 81144, -34115, -2846, 130245, -14143, -102402, 30142, 177950, 138891, -14974, -45939, -149492, -217521, -233400, -281738, -208039, -143845, -140965, -126062, 68379, 206300, 328886, 230972, 91237, -7390, 21267, -127872, -253056, -69822, -188602, -157565, 136582, 113565, 162083, 377366, 369026, 51261, -7731, 56114, 13065, 53030, 193717, 135054, -65847, -109358, -46077, -66187, -211285, -89847, 137551, 202917]
22725B02917L827J1223p8311j65646R3269K3694k5364R1099J10568K2975J1984
22714C02235L1323n5088k32754k57328Q8260L91389N4375N2711p1170K7338l06429
22703B4862q2132m5862R9322n8423K50830L269R6092m9069m6357l522j10982r7772
22691a9744m979k11317L0848K36122M9083j61787j52622k03828K54690K72906
22681H9372j36319k23306K7504M4078J8534K12733q3396j6791J71377q0928q6242
22670f3384j62616p31R8553j34366k3576K5409k5185J65578J15869l0596j49212
22659a84257l76J51678L21820n3736k74524j14560J33844k0175j56454q7571Q4291
22648b00020J14637m4255k31018p6507N1056J77004J86746j75935m4231P0331
$$ y = [202917, 206744, 217967, 139656, -25990, 67279, 90973, 65609, 156708, 267276, 290251, 302235, 333558, 278470, 45716, -211612, -123352, 268037, 322412, 375123, 303953, 331291, 24862, -57270, -103132, -3810, -62233, 188597, 191866, 287958, 238889, 192532, 189010, 78028, -19744, -24723, -236040, -205192, 30930, 80013, -81774, -234396, -438224, -183534, 89372, -46947, -270253, -242749, -198671, -180137, 32596, -50800, -67591, 103786, 22858, -63384, -226000, -226731, -128178, -262544, -286120, -260711, -285896, -120318, -4449, -35045, -184257, -184633, -32955, 288865, 235129, -39395, -153955, -20111, -40286, -196740, -284311, -200020, -85383, -129638, -360656, -437163, -386107, -209103, -22357, -198292, -242523, -172192]
22638a72192N0282j3144j3726Q2735J40695j86785k85725j3542J85890K10643
22628a4869l7169M5121J07908J08807j34947K3544o6855n1341j40960p8376M9895
22617a89242Q7347K19519R1684J11202j8075l3023l948k3898j1154J43430J91788
22606E65630n024j18340j638j14465j44249R6850P0058j18082j54027m1733o584
22595B8396L6026M8485L9946p7381Q5650M5033r2664q6992j59028P3602N9276
22584C49p7521O0743J42545Q4736R5297L0051j53177p7386Q8263j35591q6271
22573b7962l2804m5468J9355L3047Q0968J36025j40872M684j09440l3858J32855
22562A6530r8975j56992k4610K41689N4409j06968r7381j550j36375N7145J85445
$$ y = [-172192, -121910, -135054, -148780, -66045, 74650, -112135, -397860, -411402, -225512, -14869, -52038, -6917, 100991, 209798, 74851, 98395, 31540, -19801, -160761, -239137, -189242, -101895, 117624, 209308, 320510, 302435, 269412, 265464, 241566, 230412, 373842, 565630, 560606, 442266, 440628, 326163, 181914, 278764, 348822, 230740, 76713, 34980, 28396, 64422, 112907, 152853, 75472, 161122, 206155, 113491, 26499, -132529, -58927, 349, -77172, -16429, 126116, 210852, 306149, 336200, 183023, 105637, 193900, 58309, -27962, -60766, -106234, -86879, -53832, 27136, 163161, 22289, 26973, -82467, -116325, 16530, -82445, -239437, -264047, -22358, 32051, -74917, -172298, -173848, -310223, -253078, -67633]
22551f7633L3119J27188J8252M9183q5715M8360L2440l1852R466J21284j64717
22540H9375n2777O0018j2945m5373j36893k35761j99261o5003L5835M9958K66788
22529b46039J02677R4039M4602j79833L2345Q5109J74323J02442Q4719j69246
22519A25138J9920j31642l5004M6058J23532K1602m6539M6957r9990j41890M2935
22508b8923j38698N0124l4395j08636J54861Q2279q8277Q2401K31211j32684r7266
22497b8003k15432J3345Q289j8173N1025O6569J60702J05152J29564n719p7192
22486A90127j46567l61225j28532K57682L8854j9744J95292J63543J08037M2773
22476C40240j84729r7138n3322o5981q3870o8455R0474N3190k09337j73096m2983
$$ y = [-67633, -34514, 92674, 110926, 160109, 74394, 122754, 155194, 123342, 132808, 254092, 89375, 36598, 96616, 83671, 38298, -98595, -334356, -533617, -598620, -562785, -512827, -246039, -143362, -49323, -4721, -184554, -152209, -67100, 107223, 209665, 294384, 125138, 145058, 13416, -21588, 24470, 148002, 169604, 123065, 170022, 70032, -71858, -28923, -167621, -117497, -151892, -260528, -105667, -23388, -111665, -29264, 201947, 69263, -28003, -243435, -230090, -221801, -239974, -188949, -122380, 38322, 143474, 273038, 267319, 190127, 43560, -317665, -446197, -188515, -149661, -169405, 25887, 189430, 297467, 340240, 155511, 58373, 5051, -60930, -144800, -213255, -122781, -69591, -278928, -452024, -495007]
22465d95007J62002J37075J33154j79785j68718r4392K54791J56844J16538j8294
22455D208O526J6061j88164N8097R5531r2899j75478K85815J49221J8491q6621
22444I0788j12596j3097p7723p16j54632l6221J54650R2778K32359L5865j57067
22433E4388j80782Q4945K05515J79346M0400j1329q8908l25629r4627J24094N4749
22422D2162l8975o1633J60869j09304k4939O8309P3228J49933J4276j9116o3190
22411A91620j41315l02953j16627N2132R0616J09557R0109l3035j27145k01881
22401c88922r7010J69489K27590K04693K32234l1662K4371j73063l20008L7057
22391a15231J28233j07436N7269j99755J05604M44851p9619j9189L3894k5127
$$ y = [-495007, -333005, -195930, -62776, -242561, -411279, -505671, -250880, -94036, 22502, 4208, 10734, 26795, -161369, -103272, -7741, -100640, -276118, 9697, 158918, 177409, 90788, -21808, -34905, -112628, -113344, -267976, -304197, -149547, -56769, 175590, 211455, 54388, -126394, -41449, 164066, 343412, 383812, 372483, 283575, -42054, -136681, -12587, 42162, 3187, -58446, 102423, -6881, -31820, 36489, 109717, 259650, 273926, 254810, 191620, 50305, -252648, -369275, -317143, -226527, -116970, -26861, -59896, -187041, -388922, -485932, -316443, -88853, 115840, 348074, 316412, 340783, 167720, -152288, -115231, 13002, -94434, -37165, -236920, -131316, 313535, 233916, 214727, 248621, 223494]
22381B23494N9748n5048j25196j37801K52744J16750j94404k76748j01050M5554
22371a91957J54989K2515j32292J0644K8249m3448p4809Q1109M0914N1098j7065
22360g0053n4355J32798J04647L0126j11138j25379J93003J80130m6120p2698
22350A60961l6417j29275m5673q7240K37201Pj14320J80435j11461k78743K2578
22339b01947P0395N4488r0769J7406M7079J45855L03456J10826j71382N8547j13929
22328B30025j31697P658O7427n8592Q2526K03294p6783j39139j45343k7213J81274
22317A93437N5574j15613j41358Q5887m0246r9453K3354K19170K6215R426m8438
22306A67955m9787j29639n1575n4296k12415q2729J51062J35787J05047k4905
$$ y = [223494, 283242, 228194, 102998, -34803, 217941, 334691, 140287, -136461, -237511, -191957, -36968, -14453, -146745, -136101, -107852, -151300, -226109, -145000, -104086, -52988, -70053, -124408, 8390, 113037, 143163, 32025, -93354, 99649, 279779, 233659, 160961, 124544, -4731, -50404, -137644, 99557, 99564, -14756, 165679, 54218, -224525, -201947, -131552, -77064, -167833, -150427, -103348, 42507, 345963, 456789, 285407, 343954, 230025, 98328, 105986, 173413, 114821, 197347, 400641, 323858, 184719, 39376, 12163, 193437, 249011, 133398, -7960, 77927, 37681, -61772, -38418, 180752, 206967, 216393, 167955, 118168, -11471, -63046, -117342, -329757, -412486, -261424, -125637, -20590, -45495]
22296d5495M0596J84992J07524j42938j38750l0803R2233J22235J2307r8600P131
22285A10432R7405N1581m16383j37437L8571R6854O930R9056k5258J30295J22160
22274A74206k3441j39740M3058N3020J85281J5213j25676P5404J35470J38497
22264E31292j28490j88399m5888k03788j28463J10164O8329N2704j69512J4162
22254h7889r6259k23870P3148J21300J43628L1803J78753J0998j34665j27547
22244a10600k16688n4897J00727K41236J2771m5986k6060J65193L2139q4115J02524
22233A16244J26837K19815l7839o3519k27058j17699l677j04984L5141J11428
22223E4689J84691r7074J458Q9531O4988o9998q0294j17915k7721j152k5540l8814
$$ y = [-45495, -4899, 180093, 287617, 144679, 5929, -24874, 67359, 189594, 201901, 103301, 110432, 207837, 259418, -156965, -294402, -255831, -158977, -152047, -52991, -78249, 52046, 174206, 150765, 11025, 54083, 107103, 292384, 307597, 181921, 257325, 392795, 531292, 402802, 214403, 168515, -35273, -163736, -53572, 14757, 67461, -102051, -87889, -184148, -408018, -334870, -213570, -69942, -38139, 140614, 151612, 16947, -110600, -327288, -382185, -281458, -40222, -27451, -73437, -99497, 65696, 97835, 13720, 116244, 243081, 462896, 425057, 361538, 134480, 16781, 13104, -91880, -56739, 54689, 239380, 142306, 143764, 233295, 298283, 228285, 147991, 30076, 2355, 1203, -24337, -63151]
22211f3151j04108P5850N7833J7898O6196N6987l5894P1834M8339M0470M3913
22200B76167L7477j50146n9206J07932J1626l1979j87058l579q6298j19990l2695
22189b37749Q3066j00474K9917O4379J65158R3130k1990l6725k31385n2717l4493
22178b79883K13355J82339n6520J9523P7993M3640j11418L3306N0215r7508j30053
22167e5011p0546k043K40726o5072l4608J03705K15714j55553j42685N9416q896
22156H5147n1600m4093J34467M9628r3041o144K46227J85481M2323q2474j55280
22145C10641j42567J10305j76912j74804j02116K00921O3143o9711P341L6713
22135F2954o9741j80551q9001j07331K52647K09946J27906J52786J0151k87158
$$ y = [-63151, -167259, -91409, -33576, -15678, 50518, 107505, 71611, 143445, 191784, 232254, 276167, 313644, 163498, 104292, 212224, 223850, 191871, 4813, 1234, -85064, -205054, -237749, -154683, -255157, -225240, -160861, 4297, 97427, 75437, 38712, -192673, -245390, -279883, -66528, 115811, 59291, 78814, 156807, 200447, 89029, 122335, 172550, 75042, -55011, -125557, -127600, 113126, 48054, 13446, 117151, 332865, 177312, 34627, 94043, 85147, 33547, -10546, 123921, 173549, 80508, 74364, 320591, 506072, 548395, 465921, 310641, 168074, 278379, 101467, -73337, -175453, 25468, 88611, 18900, 26241, 62954, -6787, -187338, -276339, -383670, -131023, 78923, 206829, 359615, 369766, 82608]
22125H2608l3527J94638K4878R5299o9197j60666Q094L800j31462j20307J81513
22114G5671Q0082l1762K12144j79261l36071M5736R9734M2425J314J22771n6082
22103G6701r1276l04913o5214L7468J70386O4935q8967k9429j6355J06719K50073
22092A10128J06464j51352q4834L3587p8488k20994K35407J36813j11362j42240
22082a66871J98489M0639p903k11230j56751N6080J73619J49230O2712j03734
22072C4280m9794l4866M6641M4442j97631l45854J78411Q2916J6514J13667J25561
22061A4287j42427n444J14927j1439P6566p6945p0575R9453J63398l0841k03808
22050g2848j7740q1753j51734J02804j41610k19886K36329R756J23696R6102n7230
$$ y = [82608, 49081, 243719, 268597, 363896, 294699, 134033, 142127, 145927, 14465, -105842, 75671, 155753, 123991, 336135, 156874, -179197, -133461, -33727, 8698, 10012, 132783, 76701, -14575, -319488, -384702, -347234, -176848, -111913, -200880, -230309, -246664, -139945, 110128, 216592, 65240, -19594, 13993, -64495, -285489, -50082, 86731, -24631, -166871, 31618, 72257, 64354, -146876, -303627, -247547, -73928, 75302, 138014, 34280, -15514, -50380, -3739, 40703, -156928, -502782, -324371, -241455, -224941, -111274, 14287, -128140, -133584, -18657, -30096, 46470, -30475, -101050, -1597, 161801, 130960, -72848, -90588, -172341, -324075, -221271, -362881, -582767, -346438, -336682, -212986, -116884, -174114]
22039a74114M492l8610R3745q3622o5332J5311j21455K2532J45595J33993J12171
22028D4706P7719N8699j13201k8006J2988q7824n3634k2492J18623J93574O7720
22017B68872k55547l7789Q0700J41748j0091N5190J96256j15392k20413q9414
22007A4120p8759J34589l073q4166j07435m3353K34086J25012l0074Q9383k7550
21996B22780j15068K4434J48832O7382j64568j77714J58024L32K0733j63761m0480
21985a9074q1319l0523m3957O6915K8142J0415n0393n9006J36416n3360n4279
21974a50023q8303j77277K7473K66153M1719o7258N3334j29516j14627r0936J69228
21963b60033L13295K75904n0361j49835k39884j38815K3220j34238r8586r579
$$ y = [-174114, -169622, -208232, -114487, -198109, -263441, -248130, -369585, -347053, -201458, -67465, 44706, 122425, 181124, 67923, 39917, 52905, -34919, -88553, -111045, 7578, 201152, 268872, 13325, -24464, 56236, 197984, 187893, 243083, 439339, 323947, 103534, 14120, -64639, 69950, 66877, -17289, -124724, -168077, 66009, 191021, 160947, 250330, 222780, 107712, 132146, 280978, 348360, 183792, 6078, 164102, 164434, 185167, 21406, -19074, -100393, -130916, -174873, -107958, -79816, -69401, -119794, -178800, -42384, -95744, -150023, -238326, -415603, -388130, -121977, -80258, -147516, -94182, -223698, -338325, -429261, -260033, 53262, 329166, 278805, 128970, -110914, -249729, -226509, -360747, -459333, -468912]
21953d68912K96228N7574N8188J0316j38148P4749J75826N9686J39475n9867j14646
21942I0469J62847M6267M527j78642k07156q9227q4839r9183r7926Q7578J45659
21931b19626R1874o1724j8210P9377j1327j91150l2994J9093j4098J90802Q5669
21920h2314j13358K25699K45813r9744j42616j77099N4760j4040m2687M0402P3168
21909c2016n9308j77934j6372J66714K12104J03132k6071p9134J27924q8173M7188
21898A78054O2926J11017J21174J8857r9408J63090l4060j92803k79986l0414
21888A8447K07196Q4367O6123j82046j01277O9028m4726r4984j63000j71676Q3648
21877b28900J49422L1353J79043n1836l0987n5916p6311m3J86127K63062l4022
$$ y = [-468912, -172684, -115110, -56922, -46606, -184754, -110005, 65821, 125507, 264982, 205115, 90469, 253316, 299583, 304110, 125468, -81688, -170915, -255754, -354937, -452863, -365285, -219626, -127752, -189476, -207686, -128309, -139636, -330786, -363780, -344687, -358785, -167983, -82314, -195672, 30027, 275840, 176096, 33480, -143619, -88859, -102899, -145586, -105184, -32016, -91324, -269258, -285630, -118916, 93188, 196320, 170249, 91115, 219039, 130866, 178054, 240980, 351997, 473171, 492028, 392620, 555710, 521650, 328847, 48861, 18447, 225643, 310010, 376133, 194087, 92810, 161838, 117112, 22128, -140872, -312548, -228900, -79478, -48125, 130918, 79082, 48095, -7821, -84132, -84175, 101952, 365014, 330992]
21866C30992J6164Q686j2232J13210j8633k3722R3065p4774k17213j46110K4970
21855I4403J34519j11712J9586n2015j2028O473j39066k2319M3876j6872Q6162
21844C1007J28902j72621n9777K4925J1763J2917J7841J52537j12525j40272j39711
21833b45014j02337J26168P0442m1655J45376K65489O5375j63590j21409M4264
21823D3109j6518q2193N1284l6739k48383J48253J04622j8632j6544J06769j8362
21812A6666n0472J1321o7162j4568Q6529J79045K51725j06675j42815j88821r0264
21801a15491n3457R1600l4295R8441J8600q2506R166J09477j01951p9914J77687
21790C7357J19615k4497q0677q6908J10484j81006o3072K25k2066k5330l8869
$$ y = [330992, 347156, 355842, 343610, 456820, 438187, 414465, 507530, 432756, 215543, 69433, 94403, 228922, 117210, 136796, 84781, 72753, 79226, -59840, -82159, -38283, -55155, 31007, 159909, -12712, -72489, -47564, -35801, -22884, -5043, 147494, 34969, -105303, -245014, -347351, -221183, -150741, -192396, -47020, 218469, 283844, 120254, -1155, 43109, 26591, -55602, -4318, -41057, -289440, -141187, -36565, -55197, -71741, 35028, 16666, -33806, -22485, -89647, -104215, -17686, 161359, 413084, 306409, 163594, -25227, -115491, -168948, -77348, -111643, -13202, 5398, -77108, -67942, 41535, -60416, -140330, 37357, 156972, 132475, 51798, -35110, 75374, -105632, -168704, -168479, -190545, -215875, -254744]
21779b54744J27262J47605p995j03304N7940O0249l9904J86379M5507j62091j47679
21768i0775j203L2499J00104p9139l6652m173K5244R2726j0724q3579J2700Q5141
21756D2169O9160q5751L2217q4965P7611j13544j19202J15788p7832M4329K0193
21745g9827J22393l6706j37757J3056k6327J94764m2593k13754j36097J46206
21735a96642K04702M3240P7837l1056O2575P3818J02340q1650J2977K38090j62021
21724C44210j88620p5610R8632N0996r3146j70279O3674J23505o5205m8422k47989
21713b08254o1264l3941J60655J50215P980K254O8292j01801j33018M4117K6997
21702g7768q7127j9159q4553q0691J46413P4872J52261K23190L5771l05393N38
$$ y = [-254744, -127482, 20123, 12128, -91176, -33236, 27013, -12891, 173488, 218995, 56904, -90775, -91978, -59479, 40625, -38514, -75166, -79339, -54095, 38631, 27907, -55672, -42972, 42169, 111329, 25578, 57795, -27170, 50441, -63103, -182305, -66517, -144349, -100020, -79827, 42566, 5860, -131897, -118841, -145168, 49596, 7003, -206751, -342848, -196642, 8060, 51300, 129137, 98081, 160656, 234474, 336814, 255164, 268141, 506231, 344210, 155590, 79980, 178612, 229608, 136462, -33817, 29857, 153362, 88157, 39735, -208254, -269518, -303459, -142804, 7411, 15391, 17645, 85937, -15864, -148882, -104765, -77768, -164895, -184054, -268607, -349298, -202885, -128013, 24248, 247438, 283209, -22184, -21646]
21691b1646N0660l2190N5395o7158K0171o4067j32681Q5632L3187k44066J63558
21680a53205J31979L4617j38586k068J49663q1025r0994q2649j52894N891R0567
21669b88704K85154m6617l2793L3487j43084j22544L2854K77543J0728m5854J24329
21658H4499L8338j46115p9934Q8454J71699k5904j97860N9285l7873p5674j20573
21647b41658J00242J18086m4403j52117j6955j28269J33932M32288J40369j09293
21637B32222o1610K3049r5000J37644N6795n5490j63148j39340N6455j27453R2202
21626d3674N5379m1855k02983r56K7565J50424J55358r1818p3059J85110J62874
21615B82365j4825N1501j06689k75620Q2729J10678J09583l15846k11112r755
$$ y = [-21646, 29014, -3176, 52219, -14939, 5232, -58835, -191516, -105884, -72697, -316763, -153205, -21226, 13391, -125195, -127263, 22400, -58625, -149619, -232268, -385162, -379271, -288704, -3550, -50167, -82960, -49473, -192557, -315101, -282247, -4704, 6024, -39830, 84499, 122837, -23278, -103212, -14758, 156941, 131037, -66823, -7538, -45411, -121085, -241658, -141416, -23330, -67733, -219850, -236805, -365074, -231142, 201146, 341515, 232222, 170612, 193661, 98661, 236305, 293100, 237610, 74462, -64878, -8423, -135876, -43674, 11705, -30150, -233133, -234089, -206524, -56100, 99258, 7440, -65619, 119491, 282365, 267540, 319041, 212352, -63268, 19461, 130139, 239722, -76124, -287236, -296991]
21605b96991R2369K95214L6576q3715o9371j24051r0648J04739M3652Q7253J01561
21594I6588P6107j47064k38253P6947L48813m086J0854j2920k7631J66675O9040
21583D15070j15623k61603j39143K54825J36474l6761j53580r6348J3522j0493
21573F340Q8767J07535r620J14615K8724L4039j14136j01593k9435J25769J41955
21562C92960j61800m1595j06894R7022j58314n9468j43099m0659P6723J02931
21552d2193J00675P6296k3123J8099k7930j17365j405M6969m8564o0308O7795
21541a1054l2347j17851P6770J37619J9675n9882l6411P092P9043O6232o6487
21530F2399r527o4056n8297J3115L0722n9790j35584l3533j4510K06454o4708
$$ y = [-296991, -204622, 90592, 127168, 43453, -25918, -149969, -240617, -135878, -92226, -4973, 96588, 172695, 25631, -212622, -135675, 213138, 209052, 219906, 206986, 179355, 346030, 415070, 299447, 37844, -101299, 153526, 290000, 253239, 99659, 3311, 16833, 6340, 95107, 202642, 193022, 307637, 336361, 370400, 256264, 154671, 125236, 251005, 392960, 231160, 189565, 82671, 179693, 21379, -38089, -181188, -221847, -145124, -42193, 58482, 134778, 111655, 129754, 101824, -15541, -16946, 30023, -18541, -78849, -11054, -43401, -161252, -84482, 53137, 72812, 12930, -23481, -16389, 62654, 128886, 62399, 52872, -11184, -69481, -56366, -25644, -85434, -221018, -254551, -269061, -62607, -127315]
21519a27315J5803j9123Q2888j32082k78232j14576R1893K64570J5780q4980m8814
21508c34188K4040J50027K7430L8630J84586j5178j59343j28257o8034j564j20085
21497d01936L1412K82243q5062j33765J34959R5476N6104j15753n6185R2407R9390
21486g10L5645J2580j8171l2133J11051l7920j06634k3556r0839K6505o1645j65842
21474c51669O2138K65381J69165j54431J18533j57537j01432J13385r1730n7203
21464a85400O8187R9861L7642J79266N6295j8422k8470l3916r6893Q2392o8811
21453I1731P6367Q0375k23057k65495k4648M6327q9768k393J45569O3847J6656
21442h4489j23553q9211l0418P7163K86502K50314N2505j9378N383j46457j12018
$$ y = [-127315, -111512, -130635, -47747, -179829, -458061, -572637, -480744, -216174, -200394, -285374, -334188, -310148, -160121, -132691, -94061, 90525, 75347, -83996, -212253, -280287, -281851, -401936, -370524, -88281, -173343, -307108, -172149, -76673, -20569, -136322, -192507, -100100, -710, 34935, 47515, 29344, -2789, 108262, 70342, -36292, -59848, -150687, -124182, -185827, -351669, -289531, -24150, 145015, -9416, 109117, -48420, -149852, -36467, -128197, -185400, -117213, -17352, 20290, 199556, 255851, 237429, 208959, 175043, 78150, 160542, 91731, 168098, 248473, 25416, -240079, -264727, -218400, -308168, -310561, -164992, -101145, -84489, -208042, -297253, -327671, -250508, 35994, 286308, 338813, 319435, 324818, 178361, 66343]
21431F6343Q87p487J31969j2043r5075J90013M134j51261l1334N6919R705N321
21419A68091R2066o8306j00408m7691P7151J72347n0478r6462r6477k21401M9861
21408a21707R1920M9585j88451o6156K52639K07444n5569j31471O8488N7443M5945
21397B10110L2898J8320k122J33821O8435k73905L2034Q5150k46141m5967J40986
21386A53619N7075M8895J5800j18146l6128l8294k27905k5220K27605J78945k1615
21375B14631l0378J8098m0730K4614R775m66M1946r3767k62818m0730J4676J14673
21363c0476P3002J4219j06499j72047p474K08802J79010J71347q4989m18215l07082
21352d80402K19520K46327P1709J4680J8004N4097N8334m7648j45544L0351J1797
$$ y = [66343, 67230, 59743, 191712, 179669, 84594, 274607, 278741, 127480, 96146, 153065, 162770, 168091, 260157, 191851, 91443, 43752, 120903, 293250, 242772, 146310, 49833, -171568, -121707, -29787, 19798, -168653, -234809, 17830, 225274, 169705, 38234, 106722, 164165, 210110, 243008, 261328, 259206, 393027, 461462, 187557, 219591, 304741, 58600, 12633, 153619, 210694, 259589, 275389, 157243, 121115, 82821, -145084, -170304, 57301, 236246, 214631, 184253, 202351, 161621, 186235, 196010, 195544, 237490, 143723, -119095, -159825, -145149, -30476, 42526, 56745, -49754, -221801, -229275, -20473, 158537, 329884, 244895, -173320, -480402, -260882, -14555, 57154, 71834, 89838, 143935, 202269, 154621, 9077, 39428, 51225]
21341E1225J63606l3037k87746j7406J83169J1274m4604o9153q7125j35467m9346
21330c14610J02796O4812o3212O2713R3781o0217j11652K2415J30550m2398j05906
21319b20928m2319K1714J27810k7659p7256R5110J01993P3412J89412o6312p60
21308A74217r9210r0200n6676l0821J2414O8925q6300L4931O1821q6769r6868
21297a94536N243o678k4059J3659J75956L1461j20065q5489P1144J96434P0679
21286A33749j59255k02702j51862J65382J2050n1793J28541J30051k291r3653
21276i1783P4760J06544N0329k11803j91631J17296J01708O9019Q9432P6558k92295
21265a01866j42806J79791J01562J2394k30968K5584r1653R8718J6442K7818J2829
$$ y = [51225, 214831, 181794, -105952, -123358, 59811, 71085, 26481, -42672, -129797, -265264, -314610, -211814, -147002, -210214, -147501, -53720, -113937, -225589, -203174, -72624, -115022, -220928, -263247, -241533, -113723, -141382, -218638, -123528, -21535, 51877, 241289, 174977, 174217, 75007, -15193, -71869, -102690, -90276, -21351, -107651, -72720, -10899, -97668, -194536, -189293, -195971, -220030, -206371, -30415, 1046, -119019, -204508, -133364, 63070, 133749, -25506, -228208, -380070, -214688, -202638, -254431, -125890, 4161, 1870, -91783, -17023, 89521, 139850, -71953, -263584, -146288, -44580, 24439, 113871, 190429, -101866, -244672, -64881, 36681, 49075, -181893, -156309, -247962, -149244, -132802, -104984, -92155]
21254i2155J85573J37297O779j69057p2256K47708L7467j99260n6160r1286j35690
21243b01040k4497j24960M5819J20320P8823L0513l1236J83187N899j08519N0592
21232B4901n1921o4763j80559K88469K79300K73386o063j27623l62511O1848J701
21221A36165q8990p4965k27278j24823J66445J25064N9652J27717j2089m3566
21211D3332K4564K7495J11458P06l7107j06004m1226k03938j64228K0592J95585
21200a28771J73894j50301K2575j15425q8332J746J02905N34549L3961k24242
21190A62559k28256n0712p5588r3378J09904J10632J5033M4430J08820O4631j24291
21179D3784J5965j08180j8153J42778n8042J01329k914K4031l77Q2503N4850q3959
$$ y = [-92155, 93418, 230715, 237494, 68437, -3819, 243889, 281356, 82096, 25936, -65350, -201040, -225537, -350497, -304678, -184358, -105535, -75022, -106258, 76929, 82828, -25691, 24901, -27020, -91783, -272342, 16127, 295427, 568813, 562750, 435127, 72616, 134464, 136165, 47175, -27790, -255068, -379891, -213446, -88382, -28730, 98987, 86898, 43332, 67896, 95391, 206849, 207555, 170448, 64444, 23218, -180720, -344948, -324356, -128771, 45123, -105178, -82603, -198028, -286360, -284614, -181709, 352840, 386801, 162559, -65697, -116409, -191997, -285375, -175471, -64839, -49806, -5376, 103444, 168075, 43784, 59749, -48431, -66584, 76194, 18152, 119481, 116567, 140598, 140221, 222724, 277574, 193615]
21167A93615k67852j51292l7550q4356L6265K42999q8098j96946j7467K59934
21157a10748J45488R5001k66472k33794Q4483P7338J8175K6374J08054L4972p7035
21146i8164Q717O4570R1131o367K6029l0684R1497K920l36060j27762r9232q1769
21134d95174J4221L7001R6999J67156J25084k535J25715J57563k3032m7298j33483
21123B2217k04147P967J48129r3095n4540N5713l9778J57125K71177j33862j42984
21112f078j41145K36929l8236j10098j83627l1791N6180R5990L53972M9793l7592
21101B44297o5084j89592q486J53340p3245m8601M2328l133J21849j45284m4247
21090a5858o9754L1915M7139J3649o6690J1622l44328j09818K26481L04458n7743
$$ y = [193615, -74237, -225529, -263079, -347435, -311170, -68171, -156269, -353215, -370682, -110748, 34740, 129741, -136731, -370525, -286042, -208704, -190529, -164155, -56101, -21129, -98164, -89447, -24877, 66254, 59887, 85916, 55232, 146729, 149649, -186411, -314173, -413405, -495174, -480953, -443952, -346953, -179797, -54713, -57248, 68467, 226030, 202998, 155700, 22217, -181930, -173963, -25834, -118929, -173469, -117756, -157534, -409, 270768, 136906, -6078, -147223, 89706, 51470, -58628, -242255, -274046, -217866, -121876, 232096, 281889, 244297, 179213, -10379, -18865, 134475, 61230, 12629, 54957, 51824, 173673, 28389, -15858, -85612, -53697, -6558, 7091, -59599, -47977, -392305, -502123, -275642, 28816, -28927]
21079b8927j91387k25616J08838J43086O6491k5183r090P0512j0642j824J35728
21068C1986n0165O6554o206m716J35126Q0569l766j19145n7901j18557k56887
21057c03108j7227N1916J24466J01034J98805K11399j4159L1819j03385r5368
21047A86192o2027j90187p6983P034m6741j4828p0141r3271r933j24256R2186
21036d02955J88807J35794l1702p3317O4915J826L2385L1098K2981n1632k6063
21025a07863r6801o539m3330Q1859o8733N6752J82603M0775N8260J11693Q898
21014B17574O6668j90356j63690J13638J06770N7445l0737k2436k0550j41821
21004g495j27303N4782j93700k00654J59933J18639O9643O8330J6866k8776P040
$$ y = [-28927, -220314, -445930, -337092, -194006, -127515, -152698, -161788, -91276, -101918, -103742, 31986, -18179, 48375, 42169, 37453, 172579, 253148, 249382, 130237, 72336, -46221, -303108, -320335, -268419, -143953, -42919, 155886, 367285, 353126, 384945, 281560, 186192, 124165, -66022, -143005, -135971, -182712, -197540, -267681, -360952, -370885, -495141, -402955, -214148, -78354, -110056, -183373, -118458, -116632, -84247, -53149, -30168, -81800, -107863, -204664, -211203, -254533, -172674, -241407, -184655, -2052, 38723, 96983, 208676, 217574, 284242, 93886, -69804, 43834, 150604, 208049, 177312, 154876, 134326, -7495, -134798, -80016, -273716, -474370, -314437, -195798, -126155, -57825, -40959, -69735, -62695]
20993f2695r1397k8221J38079J27734j36549j01676j1966k3783q71m759j1951
20982b08055R5292K3377J18373J25899o446K795j42392l349j1392j0463J32015
20971A15654J11677K78756r2457m806j11252j77381J17781r000M2012j12295j40394
20960A8295r328N5942M1628k07470k08392R100J02422p5082m0539K02405J73839
20949F2820J02811Q931k80898j18528J66315P3603p8271N76O3900j39629K7428
20938a10942R2784P6781j09211q6813J74229K30189K8092q4838o442K146m3138
20927A62837n8915o0405j71743r0181N1533J28041J10889J4100j04340J45585
20917A27401K51813l1127q7255j03260j03887p6837M4481k10691j50660K48524
$$ y = [-62695, -154092, -182313, -44234, 83500, -53049, -154725, -166691, -190474, -191345, -196104, -208055, -112763, -89386, 28987, 154886, 148440, 151235, 8843, 5494, -5898, -16361, 115654, 227331, 506087, 413630, 408824, 297572, 120191, 237972, 228972, 270984, 158689, 18295, 8967, 64909, 106537, -100933, -309325, -300225, -197803, -272885, -313424, -111019, 62820, 165631, 174562, -106336, -224864, -58549, 15054, -63217, -62641, 1259, -138370, -110942, -18158, 58623, -50588, -137401, 36828, 267017, 295109, 210271, 203829, 205975, 162837, 103922, 43517, -128226, -218407, -166874, -38833, 72056, 86156, -18184, 127401, 379214, 348087, 260832, 157572, 53685, -23152, 21329, -189362, -340022, -91498]
20907i1498J54539q4559m4132j60469P6701J81091O3278L9008q9066m6340J896
20896D49k3255R2818J3171m2492p0039K08873p3773k56676L376K14042P7082q5651
20884E7925k1203k4108J05668J16079o2859J47946j0505o1400j9517j38714K9252
20873A18564q4756Q4398j22901m4578L1124J47798K45928r0909j51416k2500j36705
20862b5953l6788J35763j15706j23365o60Q4992J55172K6458O1050P7885k38331
20851E17j55976j76285P6794o6859n8777J40992j0186J77579L7502j43029j742
20840a79470Q9591M3462j47037p6383R3090O54j1460l8872r2067j22510K98681
20829a42321K55133m7059n7811J16730J40358Q5722j76952n579P4292r5906k52012
$$ y = [-91498, 63041, -21518, -65650, -226119, -149418, 31673, 94951, 133959, 44893, -1447, 449, -22806, 70012, 83183, 40691, -29348, 179525, 105752, -150924, -147548, 66494, 143576, 57925, 36722, 12614, 118282, 234361, 171502, 319448, 308943, 247543, 228026, 89312, 118564, 33808, 118206, -4695, -49273, -18149, 129649, 375577, 284668, 133252, 110752, -25953, -62741, 73022, -42684, -166049, -166709, -81717, 73455, 99913, 160963, 238848, 517, -155459, -331744, -254950, -321809, -380586, -239594, -249780, -72201, -34699, -177728, -179470, -89879, -46417, -193454, -269837, -176747, -176093, -187553, -226425, -318492, -441002, -142321, 112812, 65753, 7942, 124672, 265030, 350752, 173800, 168221, 242513, 146607, -105405]
20818a05405k2333J49564l5214N7549l2801Q0016K2124k8539L3407O0738J25267
20807C04373j85242j83822j62113p4150J70756m3485K038J29874n0018K7414k1046
20796h5421O8680Q0395J1100J21893J6558j46797m3300m0132k3592J27969J29133
20785B16486j36960q2594L6948P4400k3993l1380J05689m9178r6376J56262P8779
20774B48083j66283r0410M1359j74940k0021O7809l586j14991L4124m9771j7472
20763b46099J07096M7916l4963l6784L5012N8143j18045k42402J33689K40677
20753e5760k9424Q631n3484p0975o7198J46674J50122j9545j04466j24843J40803
20742g9465J08605p1994j28052N5611q6728R4084J4671p7145j78844j02701J58398
$$ y = [-105405, -127738, 21826, -13388, 44161, 11360, 91376, 113500, 84961, 118368, 179106, 304373, 119131, -64691, -226804, -300954, -130198, -173683, -171645, -41771, -91789, -64375, -85421, -16741, 63654, 74754, 196647, 213205, 66408, 23108, -17024, -40616, 87353, 216486, 79526, -3068, 33880, 108280, 84287, 52907, 158596, 109418, 13042, 169304, 248083, 81800, -8610, 32749, -142191, -162212, -94403, -97989, -212980, -178856, -228627, -246099, -139003, -91087, -126050, -162834, -127822, -69679, -187724, -430126, -296437, -55760, -85184, -76553, -130037, -201012, -268210, -121536, 28586, 9041, -95425, -220268, -79465, 29140, -42854, -170906, -115295, -202023, -107939, -93268, -170413, -349257, -451958, -293560]
20731b93560J15619J20249q7243K12247J46692J70945k0839j83503j59702j7240
20721C665k1062O3729p6514j99338j1817m8086m226n7238j11871k6222L3314K10445
20709b45221N477j18118j16970n4503K05803j48270j85297k0515K00327k4338
20699e01625k18109n7977K66462J17160R1107P860k10535O5398J51741R2494L941
20688a92083L3935L8991J1336P0613J68753j1791o547l2156j25527q179K45657
20677A93002q8577j42371k32830m888M38347K63279l8827j3149k1938j0471n7419
20666B84158j95478j32762J10773N1127k8269K02371k1347j28695j06455M9614
20656H5037J18999n1452q8773l21007j30896N4419J29629K11023M1858m1059j01738
$$ y = [-293560, -177941, -57692, -144935, 67312, 214004, 384949, 364110, 180607, 20905, 3665, -17397, 46332, -30182, -229520, -241337, -289423, -293649, -350887, -462758, -488980, -455666, -245221, -239744, -357862, -474832, -529335, -323532, -471802, -657099, -677614, -477287, -501625, -719734, -777711, -511249, -394089, -302982, -295122, -505657, -440259, -288518, -196024, -192083, -158148, -119157, -107821, -37208, 131545, 119754, 113207, 81051, -44476, -52655, 193002, 104425, -37946, -270776, -275664, 162683, 425962, 387135, 373986, 352048, 341577, 284158, 88680, -44082, 66691, 117818, 89549, 291920, 270573, 141878, 35423, 85037, 204036, 152584, 63811, -257196, -388092, -333673, -204044, 6979, 48837, 7778, -93960]
20645i3960L68405K05438j76325k32699n584j00552J78909N5789K967j98928p6106
20634g2646k10047j41632J34059Q3270J34883R1485O3714O2559j67548r3016o4871
20623a79790O2982L9528J80628O1698j405r7109j06042N5978J52937Q0774j25001
20612A25178J23812m3416q6737O0014k19154j00228J19630J46598J34641j44802
20602A15536r3824R6693J9131j37823K6006K47321o1074j42112R3358J05605O4707
20591C33524n3525j35563r4101J36180k2884J75330M710j06996j8592j31914j61045
20580g4876j0897N8782J55462P496k50776K6760L5741K4233O4939j09333j13241
20569a85710J85201L01835m076o8743l6326q4148K6408k39594k883R4943K326
$$ y = [-93960, 274445, 479883, 303558, 70859, 65275, -35277, 143632, 199421, 202388, 3460, -72646, -282693, -424325, -290266, -206996, -72113, 19372, 83086, 145645, -21903, -114919, -179790, -116808, -77280, 103348, 165046, 163641, 66532, -39510, 16468, 169405, 250179, 125178, 248990, 205574, 118837, 178851, -40303, -140531, -20901, 125697, 260338, 115536, 21712, 118405, 137536, -287, 25719, 273040, 211966, 69854, 163212, 268817, 333524, 279999, 144436, 50335, 186515, 163631, 338961, 343671, 236675, 218083, 86169, -74876, -85773, -26991, 128471, 135967, -114809, -88049, -52308, -28075, 36864, -72469, -185710, -509, 301326, 297250, 228507, 192181, 108033, 134441, -105153, -108036, -13093, -10767]
20558a0767R6966j9055k24227n9129J90516J14885K42267j56176J7357j31070
20548F1567p6404K7410K9031k0933j04795R9403Q5477j77116Q5223P6593j23334
20537c7878n5817j11568r6017j20672L8946J66351R9177j06615k44946L3770K62771
20526a72498J37679J3082J1403j55240m4831j3083o9858J839J4440k1996J91473
20515a07590J34280N9873N4606Q6778n4251q036l11655j11615j6972K41167J99282
20504A65867j64290j73221n1754J44301J01283J19636K098m2133j4266P2745j26636
20493C3630M2888J21939J078j0351j62635M782K4712j24627k03746l8518K3130
20482b87718K48275J37565L13504K4338k36408j41522O2356J21733j3906j12966
$$ y = [-10767, 86199, 67144, -157083, -216212, -25696, 89189, 331456, 175280, 192637, 61567, -14837, 12573, 41604, 20671, -84124, 15279, 100756, -76360, 8863, 85456, -37878, -93695, -205263, -301280, -421952, -383006, -216655, -117478, -224093, -469039, -435269, -172498, -34819, -21737, -10334, -165574, -210405, -223488, -293346, -291507, -277067, -299063, -107590, 26690, 86563, 141169, 227947, 173696, 165660, -145995, -257610, -274582, -33415, 165867, 1577, -171644, -223398, -79097, 22186, 141822, 143920, 101787, 87521, 160266, 33630, 76518, 198457, 199535, 189184, 26549, 31331, 56043, -68584, -272330, -310848, -287718, -39443, 98122, 411626, 435964, 199556, 58034, 120390, 242123, 228217, 115251]
20472A15251j6291R3301L2639M8520N0765k60995k15701r9897J9675K807J58991
20461g0935Q3246J55068J02223j66730n8118o8958l8667J23460J11683Q8006k7537
20450B32741j58825N6221k8511l9095O9180J09153K634o9052k5621O3945k246
20439B10524k00857r8285j1276J77295n520k02139o9365R8330N5742J43334J32785
20428B30568k3376k79980j28820l4151m874J21815Q2178r2139j5928Q9378L6153
20417a9176j31809J7994J02283J11690K596k32303K4807R9663l9226P8117M5633
20406F0269j69366J28463K09332j6048Q5011O3050p460j10403k20581j04773m0997
20395a23503K5956J73050J10264q2926j59252j37219k1563J14947j01487K991
$$ y = [115251, 98960, 192261, 224900, 273420, 324185, 63190, -152511, -252408, -232733, -229926, -70935, 12311, 167379, 269602, 102872, 44754, -24204, -62871, 60589, 172272, 260278, 232741, 73916, 130137, 101626, 62531, 131711, 240864, 243498, 174446, 148825, 212770, 210524, 9667, -88618, -99894, 77401, 71881, -130258, -199623, -101293, -45551, 97783, 230568, 207192, -72788, -201608, -235759, -240633, -118818, -36640, -128779, -144707, -55329, -19176, -150985, -132991, -30708, 80982, 83578, -148725, -123918, -24255, -63481, 14636, 60269, -109097, 19366, 228698, 212650, 297661, 360711, 353251, 242848, 22267, -82506, -123503, -97547, 75503, 185767, 102841, -56411, -193630, -215193, -100246, -201733, -198742]
20385a98742J69381J96702J38809l17793l08473j42595N2126J45345j40483J25026
20375b80697J64246l5377j59284K1912J14008L05606j28946k01873J62050J15684
20365G7329j66662l7948L0165l4973M652Q3446J34730J42317p2485k36399J56279
20354H0451n8480M1045N7243j8751k6983K4639k590k7095J72589m5236k16515
20343a9683m9566R3280k5295K0839L486K29241M1732k90486j21130J67716J30802
20332A80936P0846J1370j24780q6068j53306k3837j2718K0291M8443O7046k6425
20321b8202R0006K1867n359p1473o6998o4844J01969M0720j57989j12875J75410
20310g7768J2631O3031j46691N0376J62406P3134r0841l8770j5957Q9633K8572
$$ y = [-198742, -29361, 167341, 306150, -11643, -320116, -462711, -410585, -265240, -405723, -280697, -116451, -151828, -311112, -289200, -175192, 130414, 1468, -200405, -38355, 77329, -89333, -127281, -97116, -132089, -127437, -43991, 90739, 233056, 160571, -75828, 80451, 21971, 63016, 120259, 101508, 74525, 99164, 96574, 69479, 242068, 196832, -19683, -69249, 24031, -1264, 19575, 23061, 252302, 294034, 3548, -117582, 50134, 180936, 251782, 263152, 138372, 52304, -101002, -124839, -137557, -117266, -68823, -1777, -28202, 61804, 83671, 78312, 6839, -60159, -125003, -23034, 17686, -140303, -253178, -77768, -65137, -2106, -148797, -98421, 63985, 137119, 46278, 7508, -8449, 81184, 109756]
20299A09756j140j67614J00869P1516p1319m771l2953P5385k79652j39998J03214
20288b36707J63856J34943J37394m007j35920M8555j39874k32862O8716J14078
20278h1828n8164J39029J77621m3050k14977j70982k83240r8641J47081K72997
20268b14154K86188O4100k62Q2403j14756q2521n6034J45184K8250J27730O1405
20257C27533r9453r4578l1604l15778j75894o9615J44956K55360N6064l2945N269
20246c0685j28920K6625j52755P0495Q8479J29955L1326p1848j28242P5276o7578
20235a57872K7763Q4154M4780M6548k2588k7249K6763j77425j31030K19859K5482
20224d0815K62106k5846k12487j66746O0454K24768J3552R5549j56705j74252
$$ y = [109756, 108616, -58998, 41871, 113387, 42068, 37297, 4344, 79729, -199923, -339921, -236707, -72851, 62092, 199486, 195479, 59559, 108114, -31760, -264622, -195906, -81828, -139992, -963, 176658, 133608, -81369, -252351, -535591, -634232, -487151, -214154, 72034, 136134, 135872, 218275, 103519, 20998, -35036, 110148, 138398, 266128, 327533, 228080, 133502, 101898, -213880, -389774, -459389, -314433, -59073, -3009, -35954, -30685, -159605, -132980, -285735, -215240, -126761, 3194, 34520, -37328, -165570, -90294, -157872, -130109, -45955, -1175, 45373, 22785, -4464, 22299, -155126, -286156, -66297, -40815, 221291, 195445, -17042, -183788, -123334, 101434, 114986, 210535, 53830, -120422]
20214a20422j41545J53546R9602L1654O6645Q9160R0964k9727k36819o1275Q8262
20203C0045Q6891J5658q0779j12392q2602o1649m5025M2120R4711J00412J59339
20192A46729j65807j51490P4007K42994J9802N1639Q5074l7709k68869k71342
20182b74972J36148L26266J16996Q081P8827j02478j47918L0196j06172j69778
20172a04804K2021r1453j16723R5931K90504M4885j16036o6569k3064O4178L2645
20161C1515M2297k236m4789K8943M5936q1459M4634J21297L1875m8005Q3445l7572
20149B15881j34431j48884N9646Q6254o3704N1636K2833Q9768M1063k47732j44650
20138a72320j15765k9832K41484J65042p4010K10926r5886m9164K807O0348J10814
$$ y = [-120422, -261967, -108421, -8819, 22835, 89480, 178640, 269604, 239877, 3058, -58217, 30045, 116936, 132594, 51815, -60577, -143179, -204828, -249853, -207733, -113022, -12610, 146729, -19078, -170568, -96561, 146433, 166235, 217874, 302948, 265239, -3630, -274972, -138824, 187442, 304438, 312519, 391346, 288868, 140950, 171146, 64974, -104804, -82783, -174236, -290959, -195028, 95476, 140361, 24325, -42244, -65308, -1130, 31515, 73812, 71576, 26787, 55730, 101666, 20207, 64841, 186138, 218013, 170008, 253453, 215881, 81450, -67434, -7788, 78466, 14762, 66398, 89231, 178999, 220062, -27670, -172320, -288085, -317917, -76433, 88609, 14599, 225525, 129639, 80475, 83282, 143630, 254444]
20127B54444n0836j61240J75417N9446k15490n5515L9277O7606q7698q0047l07764
20116c62400j8534J33395o9518J27211L33187n9673j89054O3009J30621j23792
20106c5548k53207j28588J92597R2546j47966K7065J60486j16854P428J56729
20096d5312O7035P4048j5569n8421J37654O9628k01909j90679j71939J63094O0743
20085a11627j60870O5134m5848N5297j0823J26343K17636j1158m1679J569p00
20074H3274J32535j7250j32595j83348o1681R0926M6574j15191j10553k7876j4828
20063c10013J06694q1464M9761K42447p3828k96385M6723P7037k7112Q4853N3917
20052a27370R6165L12897M4114j05901k49813j67308p8230J0672K39312K33133
$$ y = [254444, 203608, 42368, 217785, 277231, 61741, 6226, 45503, 113109, 25411, -54636, -362400, -380934, -247539, -317057, -189846, 143341, 83668, -105386, -42377, 88244, -35548, -288755, -417343, -224746, -132200, -280166, -253101, -92615, -209469, -202041, -45312, 21723, 95771, 80202, 21781, 159435, 229063, 27154, -163525, -335464, -172370, -111627, -272497, -207363, -253211, -197914, -208737, -82394, 135242, 124084, 82405, 83974, 83274, 215809, 198559, 65964, -117384, -179065, -88139, -41565, -156756, -267309, -295185, -310013, -203319, -284783, -235022, 7425, -66403, -362788, -316065, -239028, -266140, -181287, -127370, -31205, 281692, 325806, 219905, -29908, -197216, -275446, -264774, -25462, 207671]
20042B07671m2303R5865k31152j01085K09011J91842r1462j3122k64641j7154
20032e6530m5219L5355J53991J10443L5657j61818j31973K5134j44942P4086R1924
20021a3892O6176j51754N0414J15541j56217j76561m554J30177L5088k16860j59655
20010d82097p465Q9639K21808m1037J31214R8589P6374n4284m4838o0825L8225
19999c4697j4500o9726j28371K0803O7626j27631Q5132J29486J0122J3825J00988
19988E3057J34851J61639l151l10840k35755L5870J76150J52002m4171Q1469P9867
19977B80988k10965j97625k19648K12593R5576m6595j17809j32247l1760R5558
19967b71934Q4557J56275J42280k7879p7696j180R1175l092j18316j14640J97609
$$ y = [207671, 165368, 261233, 30081, -71004, 138007, 329849, 238387, 225265, -39376, -56530, -101749, -66394, 87597, 198040, 233697, 71879, -60094, -34960, -179902, -105816, -13892, 52284, -99470, -49056, 66485, -89732, -266293, -270847, -140670, -105582, -322442, -482097, -489562, -399923, -178115, -219152, -87938, 10651, 87025, 32741, -12097, -72922, -34697, -49197, -118923, -247294, -226491, -158865, -286496, -201364, -71878, -61756, -47931, 53057, 187908, 349547, 346396, 35556, -200199, -164329, 11821, 163823, 119652, 201121, 280988, 70023, -127602, -347250, -134657, -39081, -85676, -203485, -335732, -367492, -271934, -187377, -31102, 111178, 83299, 5603, 4423, 95598, 92506, -25810, -140450, 57159]
19956E7159K01180j53848N7723j01745l2058J6884j0906K85118K11418N6600k07804
19945C79721k14575j20997O5761K8695k24542j29699K42378J20464p7812j75600
19935a06206r270r2888K8030J87633J79282J32120L7177j0281j62666o4165k40610
19924a21844o87J54140J47596k8435j24702j64735J55320j12770m8780k04081
19914c48978L4480K39216P1999n5056p5203r6718n8535m1977O9939J47067J87428
19903G3662Q7858k43136p3342K03150k1530k18707J9888M826j24979O4085j0362
19892b38587k518J67353Q9532m4354J04904p3729N553j28580n7809q379m8400
19881b35014O1086L70358J90995p7554k37343N0737k5853l8670Q6035J0355j12615
$$ y = [57159, 258339, 104491, 162214, 60469, 28411, 45295, 34389, 319507, 530925, 587525, 379721, 165146, 44149, 109910, 138605, -85937, -215636, 26742, 147206, 69394, -106206, -115476, -208364, -180334, 7299, 186581, 318701, 355878, 345597, 182931, 118766, -121844, -122531, 31609, 179205, 150770, 26068, -138667, 16653, -96117, -144897, -348978, -314498, -75282, -3283, -58339, -133542, -230260, -288795, -330772, -260833, -113766, 73662, 161520, -81616, -154958, 48192, 26662, -192045, -172157, -167331, -292310, -228225, -238587, -241105, -73752, 15780, -28574, 76330, 2601, 8154, -120426, -178235, -186614, -235014, -173928, 196430, 387425, 309871, 72528, 123265, 97412, 58742, 144777, 155132, 42517]
19870D2517k01083J6556J81331J23400j34683l2034j77871N4489o9275J58113
19860c8540P9942j33454N5182q6161k06904j35836N5692K04449J70078j9093M0434
19849a4211J17008j45789q8428K4256k1642j65588Q5891K52444j34578J4954k1406
19838i7089J25818R7108O4665k03876n8799k1560m9942j0620Q0069K23781j8910
19827A30645j20163P2722k63276j07152K56135R8832k16459j42395R0497K22539
19817B1925O1432N5683j6145k15672J6060J249n0560j5914J84691O8204r4643
19806A6310L2852k4671j99891L1526j58385J7382K88157J73837n5255m1941l5710
19795D4211j7699J45028k2957j11506j45464M1247l2931j01836j17090J2037j30759
$$ y = [42517, -158566, -142010, 39321, 162721, 28038, -3996, -181867, -127378, -196653, -38540, 41402, -92052, -36870, -123031, -329935, -465771, -410079, -205630, -35552, -54645, -14211, 102797, -42992, -131420, -107164, -128806, -294394, -208503, 43941, -90637, -75683, -97089, 28729, 125837, 190502, -13374, -72173, -93733, -143675, -154295, -74226, 149555, 130645, 10482, 83204, -180072, -287224, -31089, 67743, -148716, -291111, -200614, 21925, 83357, 139040, 122895, -92777, -76717, -75468, -126028, -141942, 42749, 110953, 16310, 49162, 24491, -175400, -143874, -302259, -284877, 3280, 177117, 121862, 79921, 44211, 26512, 171540, 148583, 37077, -108387, -67140, -100071, -201907, -318997, -306960, -437719]
19784d37719J00680J24357O3258J25351J32880K9363p0696j81183N133K18454
19774A09878o8743j9914K5457J58540J30269k08947l9436N0921m3406R382o8845
19763C5156j56152j46362O9346J28971Q5371k1451J61197J29817o9367o3783R4396
19752B47139O2618j05339j02777k16351P0096K38696J04255l4397j15431p7698
19742G0811l115q2077p772q7544j08589N2693J39128j4108k4471J08257j4100
19731B9113r3040j62345k906P9949M9797N4075R9766R9307q925k27686J0035R6704
19719B3844M1828j61987j51629n727J34051J98411j33490N9004J55250K699p8211
19708H4043j49739p1732r7136j61779N4507Q6322J05146M2246j59188J83749L17804
$$ y = [-437719, -337039, -212682, -149424, -24073, 108807, 138170, 67474, -113709, -108576, 109878, 41135, 21221, 46678, 205218, 335487, 126540, 87104, 138025, 94619, 104001, 35156, -120996, -267358, -198012, -69041, 16330, -5121, 156076, 285893, 216526, 152743, 247139, 309757, 204418, 101641, -114710, -44614, 194082, 298337, 263940, 148509, 70811, 67696, -14381, -22153, -109697, -218286, -165593, -26465, -40573, -65044, 43213, 29113, -63927, -226272, -229178, -149229, -99432, -45357, 54409, 153716, 144791, -82895, -72860, 23844, 65672, -96315, -247944, -253671, -119620, 78791, -54699, 4305, 159555, 162254, 84043, -65696, -137428, -234564, -396343, -341836, -255514, -150368, -108122, -267310, -83561, 234243]
19697B34243k17516J08407Q0550j02612k03855j97716J24010J80031O3360L7140
19687A06042k31441K8545J09397J12644K7496k60540p2808j58732L6173K89103
19677a4121Q0585j9320N3664o995J37484l13030k34808K33589K54612M1673J46008
19666C59341N7371j31567r3165j13960j22380J19639K21701L3921r2954j62666
19656G5281L5808J02291j74499j92092j20916O65O9033K3981p65l3657o8201J25179
19644a57892J07499R6632p0996k19705j54703K73546P9321o3018o9326o2401K5437
19633b15606o7466J82127P5938j4283Q9607p2158M4734o5549J29914J19423j43913
19622F2768p3173j22550l0442l2709N0008M0876l2575M4847o9691j72085J17691
$$ y = [234243, 16727, 125134, 205684, 103072, -100783, -298499, -174489, 5542, 68902, 106042, -125399, -96854, 12543, 125187, 152683, -107857, -180665, -339397, -303224, -14121, 66464, 47144, 100808, 93813, 231297, -81733, -316541, -82952, 171660, 213333, 359341, 416712, 285145, 191980, 78020, -44360, 75279, 296980, 330901, 237947, 75281, 111089, 213380, 38881, -153211, -274127, -273462, -204429, -180448, -181213, -214870, -283071, -157892, -50393, 46239, -24757, -244462, -399165, -125619, -46298, -109316, -178642, -241043, -215606, -283072, -100945, -25007, -39290, 50317, -21841, 22893, -42656, 87258, 206681, 62768, -10405, -132955, -163397, -196106, -146098, -105222, -137797, -92950, -162641, -334726, -217035]
19611b17035J77869J26075j34866P2432j01560l0781j1988l1208k518J664J36250
19600a5666M7646M7094j0378P2494m2389j22824j84211n174L7302k7224K28707
19589B5377P6964Q0736j63187q1563J36964j38973R195p8223j22445L1690K26997
19578C532O0605j89821p1959J61509Q2623p3280j28324K01153J05108j44238j05259
19567i8351j8888K61265J00499n4197K205o8491K9466p9703J98488j23279j84378
19556c5364j5527O5386L6657L3699j62777j69758j11933J75850K54350n3971r5153
19545g8541o9504J19300L1960m4293m1107k9303p3305K7566K56871k245q5145
19534A2254l6132Q675n3742l1757O5289n8553k0750J77502j03927k75429R589
$$ y = [-217035, -39166, 86909, -47957, 24475, -77085, -107866, -119854, -151062, -153580, -151916, -15666, 31980, 79074, 68696, 141190, 98801, -24023, -208234, -213408, -176106, -203330, 25377, 102341, 183077, 19890, -61673, 75291, -63682, -54487, -132710, -255155, -223465, 3532, 64137, -125684, -197643, -36134, 46489, -26791, -155115, 46038, 151146, 6908, -98351, -117239, 144026, 244525, 190328, 192533, 124042, 153508, 73805, 272293, 149014, -35364, -50891, 14495, 51152, 84851, -77926, -247684, -359617, -183767, 70583, 16612, -78541, -148045, -28745, 3215, -41078, -82185, -111488, -184793, -157227, 99644, 97399, 12254, -23878, -15203, -68945, -100702, -35413, -93966, -114716, 62786, -41141, -316570, -306981]
19523c06981J18958O9810J18947K44665q9298j55261j11465n9268J74166N5008
19513E9281k5846n8147r7824N7098J06702R7283l5165p8674J7917j57430R505
19502a05300J72123M9519j33122L2777J02255q7093l6007N7448M2364K3133l9371
19491G8726K7455M8267K52450r416j69316j92019j18377k9046j44268R1346J52135
19480a2063j71141k99163R4565J99008J51237n7230j8126j1446P5532K1011r8260
19469a26076J8388k2326K1764j21881j28421J51359J3092j49302J19978n482j2568
19458b41475R0119j34586o1452K00789L5244J2273n1547o9395j19894J2789L7562
19447b89573o8908r5241j47835K4631K37805K45483K58158J4460K564o5049p5386
$$ y = [-306981, -188023, -118213, 734, 245399, 156101, 840, -110625, -169893, 4273, 59281, 33435, -24712, -122536, -65438, 41264, 138547, 103382, 24708, 42625, -114805, -105300, 66823, 116342, -16780, 15997, 118252, 31159, -4848, 52600, 94964, 118097, 78726, 106181, 154448, 406898, 397482, 228166, 36147, -82230, -111276, -255544, -164198, -12063, -183204, -482367, -387802, -188794, -37557, -94787, -112913, -124359, -48827, -27816, -126076, -107688, -130014, -108250, -230131, -358552, -207193, -194101, -343403, -223425, -228907, -241475, -151356, -285942, -347394, -146605, -111361, -99088, -150635, -220030, -339924, -327135, -289573, -358481, -453722, -601557, -576926, -339121, -93638, 164520, 178980, 181544, 116495, 41109]
19436D1109N0319k5115j4109Q5526N0046n3325k09102n43J41887R9183j28309
19425C7567j99284J32399K1713J24849k3029k10931l6483J65246K25377J90210
19415D27634j70108j4949j109l09294q6176J08437j63605K4667q7147J95704K36553
19404A60607j44199r9994J10707Q447J05645L3078L1507R1276j25268j38653J05639
19393A38792K08344q8898k36441j18258n7180j73086R5010L48476k4607k04534
19383a12382k29027J5683j7248Q9967Q4068j96028J14254J66274j5953l8711l9730
19372a78833j05931r0527l0364J09496J26704J32254j57543K494J08644j28784
19362b12390j16164O3970N1657K41642j11392k1227O1699j43617n8717P7752J04103
$$ y = [41109, 91428, 66313, 52204, 137730, 187776, 134451, -74651, -75194, 66693, 165876, 37567, -161717, -29318, -7605, 117244, 94215, -116716, -153199, 12047, 237424, 427634, 257526, 242577, 241468, -67826, -154002, -45565, -209170, -184503, -271650, -75946, 160607, 16408, -83586, 27121, 35568, 141213, 174291, 205798, 297074, 171806, 33153, 138792, 347136, 258238, 21797, -96461, -153641, -326727, -231717, 116759, 92152, -112382, -341409, -325726, -342974, -253007, -168939, -364967, -250713, -84439, -100392, -139103, -178833, -284764, -375291, -405655, -296159, -169455, -37201, -194744, -192250, -83606, -212390, -328554, -264584, -212927, 28715, -82677, -103904, -42205, -185822, -244539, -166787, -62684]
19351f2684J2369R6985p3367J32728J37392j6422j33561j08292N5247J62689M5823
19340B48907p9191j2944p492r6469J26972O1949J08476n7986q1813k05014m7194
19329d1799M5242p0630J0429m5960J1790J96051J02080p2737k19908j20072R1939
19318a13575N6332L31838J470j95950p9753j14499k19023R9107J24310J90055
19308H0312k17124j56951j24965P0988J98148K78629j42206j29809J58397J35711
19298A51130j29231J5279K49094L462j31670k04451j06505N7264j03617J6264
19288a82981P3404j05583J38736j2879k45761J29061O9897m4847P3980Q7525o0965
19277h0413q184L3207P4060j3144l34515j10613J88943J93366N8665l5340j08494
$$ y = [-62684, -50315, 46670, -26697, 106031, 243423, 227001, 93440, -14852, 40395, 203084, 248907, 169716, 156772, 149280, 52811, 179783, 241732, 350208, 292222, 210409, 5395, -41799, 3443, -67187, -56758, -102718, -90928, 105123, 207203, 134466, -85442, -205514, -113575, -57243, 274595, 276065, 80115, 362, -114137, -333160, -234053, -109743, 80312, -136812, -293763, -418728, -347740, -149592, 129037, -13169, -142978, 15419, 151130, 21899, 37178, 286272, 289734, 158064, -46387, -152892, -95628, -199245, -182981, -109577, -215160, -76424, -89303, -335064, -206003, -136106, -180953, -106973, -19448, -80413, -88597, -55390, 18670, 5526, -328989, -439602, -250659, -57293, 1372, -33968, -142462]
19266a42462l7325q0977j00173J81169p955J21927p416m4972R1348K1440O8689
19255F3293O8171j92062k19836j53382P8535J87094K2239J72334Q7844k5525K6198
19244A14903k199N7704j8840J76144q7996J50764J11632p5387L9964j14823J01408
19233D53274k04333l46397P1679J52988K331j30592j82444P1290p6336j02543
19223b91083N7902K38024K19015k8039J6744K689l38242j72352j02901K90290
19213a07953K59984K62994r5073j41559j49262j52845J59401K20141J20509J1018
19203C87355j89030m6873Q3662l2627r2591j94192j49946j38932l9069J40495
19193b71748L14891n1139l00449p1642M8024P2136Q9002J5627m416r3071k3384
$$ y = [-142462, -179787, -260764, -360937, -179768, -187723, -65796, -73212, -118184, -26836, -5396, 63293, 131464, -60598, -280434, -433816, -355281, -168187, -145948, 26386, 114230, 88705, 114903, 112704, 170408, 151568, 327712, 239716, 390480, 502112, 426725, 466689, 351866, 453274, 248941, -97456, -25777, 127211, 129542, -1050, -183494, -112204, -188540, -291083, -233181, 4843, 223858, 195819, 212563, 215252, -122990, -295342, -398243, -107953, 152031, 415025, 319952, 178393, 29131, -123714, 35687, 255828, 376337, 387355, 198325, 151452, 235114, 202487, 109896, -84296, -234242, -373174, -412243, -271748, 43143, -7996, -308445, -380087, -332063, -259927, -170925, -155298, -159714, -252785, -276169]
19182b76169K57414K64214j14547j65807m1829j07782n3737l6630J19470j2182
19172a67585J28699q5364O3966m6136Q1104M1825L8277k611l3645j13236N7478
19161c7228K48617K09906K5397j30004k15351k21601k096n9168l2330J26188K08723
19150A21053J49599q143k18642k26493K4102K95665j3697j93725q9471L3907j2792
19139a38637m2050m9502j02844J54751J92812k97906K6981L20481j15509J16876
19129F5453K4955j62285J1787n2438j7538p9498N7631o5300q3277J80764J28235
19118H489L6759Q4097J24647n0647j51048L3836K02267J89943j001r9469j96505
19107A81368j88272J39688j28744j57304j71814J24024J66755q1395K3983n7183
$$ y = [-276169, -18755, 245459, 130912, -34895, -76724, -184506, -238243, -274873, -155403, -167585, -38886, -124250, -60284, -106420, -25316, 16509, 54786, 52175, 18530, -94706, -37228, 211389, 421295, 446692, 316688, 101337, -120264, -122360, -181528, -213858, -87670, 121053, 270652, 262509, 43867, -182626, -158524, 137141, 123444, -70281, -159752, -125845, -138637, -180687, -230189, -333033, -178282, 14530, -283376, -256395, 64086, -51423, 65453, 90408, -71877, -60090, -112528, -130066, -209564, -151933, -217233, -300510, -119746, 8489, 45248, 129345, 253992, 203345, 52297, 86133, 288400, 478343, 477342, 377873, 181368, -6904, 132784, 4040, -153264, -325078, -201054, -34299, -115694, -91711, -148894]
19097a48894k34016p7790K38129J9841L7263O6705J1784M3715P85q5130j50536
19086b78144J40533J84562r4747r0526R78Q9247l2531k2313r7698N5239o5387
19075b10787J24071J71888o2694n6177K8691M5436o0840r1303j42451j76379J27545
19064c03000M6057O7041J10242J15858L471j69335J69201K4393j33079j7622k93184
19053c79957p594L8798L8275L6084N3521J35778L25234Q4688j59922J14896m2090
19042B37711l83206j94184j11683l1580J20246J84954P3633r877N9499j38474
19032a92961k2228J63963J92994k03006j97325l4130R077K26952J77484n6423
19022F4397j79409o592j52194J62939P8100K1389J32517k11710q4703q9295j47936
$$ y = [-148894, -382910, -460700, -222571, -202730, -165467, -98762, -86978, -43263, -42478, -127608, -278144, -137611, 46951, -47796, -138322, -137344, -48097, -80628, -102941, -200639, -145400, -210787, -86716, 85172, 22478, -33699, -5008, 40428, -20412, -111715, -254166, -430545, -303000, -256943, -189902, -79660, 36198, 39669, -129666, 39535, 63928, -69151, -86773, -379957, -387551, -348753, -310478, -274394, -220873, -85095, 240139, 324827, 164905, 279801, 237711, -145495, -339679, -451362, -482942, -362696, -177742, -104109, -113986, -54487, -192961, -215189, -51226, 141768, -61238, -258563, -292693, -283616, -56664, 120820, 64397, -115012, -121604, -273798, -110859, -32759, -11370, 121147, -90563, -175266, -264561, -412497]
19011d12497Q3033J96168J75391O9604K9329j63325j81787J91054N0266j32546
19001i5310k4489j5282L7125p6521P706M0351N7890j01952k26389M202J40684
18990b51985J34378O9959J03984O0079L1688l4856j81632k06245Q9244P449r8802
18979b76739k999K8510K2256M6529j3817L4788N9953n2320J16509J56917J341
18968A20928j0289k0873M3941l18690k13475m4269L02791N9551r8831r6317J88574
18957h6959J19870r2027p6855J19239J81539J6259j39674j49240R0613j40835
18947a58070j0057N5032K77889l3130k3040R092q8434r0530M8317m7599m3660
18936a04190m930m8917p9702K2976k2009J04092K28923K5605k69055k27658L8601
$$ y = [-412497, -329464, -133296, 42095, 111699, 141028, -22297, -204084, -13030, 37236, -95310, -119799, -135081, -97956, -174477, -166771, -126420, -68530, -170482, -396871, -392669, -251985, -117607, -47648, 56336, 116415, 148103, 113247, -68385, -274630, -185386, -177937, -276739, -279738, -251228, -228972, -182443, -196260, -161472, -101519, -153839, -37330, 119587, 120928, 110639, 89766, 133707, -184983, -398458, -442727, -139936, -80385, -179216, -275533, -86959, 32911, -59116, -135971, -16732, 164807, 181066, 41392, -107848, -17235, -158070, -168127, -113095, 164794, 131664, 108624, 117716, 29282, -61248, -12931, -60530, -104190, -109120, -158037, -237739, -214763, -236772, -132680, 96243, 121848, -147207, -374865, -336264]
18925c36264Q0035l2297J13881J83049Q5660j03095j20842l35792J90372L30450
18915E5157m8120K515o963j41121k09305J48135P2618J40784Q0509J09968m7799
18904A56378o5879n5214j05022k8715R0838R7348r4768k54160q5131J40071R9697
18893a04557j48999R2032J19028q2974j12302k9314J49631J34096k06291J9439
18883a70211K11788J78467q3007m2350m188j16473p9683P3420n9192M249j0952
18872i8132O230M6739N1988J20801L9700p0376j05724m375J01632j35310j1319
18861e8146K6404K17245R1262J62482k7828k4486O0321j02956j20901n3960o3947
18850A05490l6570J08985m0670j78676R4032J45823j8389J63569M1014r9698q6295
$$ y = [-336264, -256229, -288526, -174645, 8404, 94064, -9031, -129873, -465665, -275293, 55157, 7037, 9552, 2589, -138532, -347837, -199702, -127084, 13700, 94209, 204177, 156378, 90499, 35285, -69737, -98452, -7614, 89734, -5034, -259194, -344325, -204254, -104557, -253556, -161524, -42496, -125470, -237772, -267086, -117455, 16641, -189650, -170211, 41577, 220044, 137037, 94687, 90499, -25974, -105657, -32237, -91429, -87180, -98132, -91902, -45163, 6825, 127626, 167326, 96950, -8774, -13149, 88483, -46827, -58146, -31742, 185503, 276765, 439247, 411419, 386933, 447254, 344298, 223397, 169437, 105490, 68920, 177905, 137235, -41441, 52591, 198414, 180025, 343594, 384608, 284910, 198615]
18839A98615j58278k02216j53544Q2849Q9870K0615r9084o5356K4034q2252J15840
18828b28907J89624N9362p7547r1700Q5351M120O0020O359P7875k46040l86909
18817e48392J98170K62081O988j62001J7221J97092J38824p4572P137k40004j2575
18806b10031n5979j47577r0671J58924J33522M2668n5822J981k1433M348p9403
18795c19473m3509K21410j03012j95825K8215J38017K25878J92733k03324j68251
18785b27141r4539R643p9521N6214K27294R6839M4364k3170m6956k2066m4938
18774a03977K72036J36415K55199J55946J72378K95634N35677K08059k35152o39305
18764A052910m84331k25058q0938p9304p440j1142O4776j1013o8843p2020O8052
$$ y = [198615, 40337, -161879, -315423, -232574, -142704, -122089, -221173, -286529, -262495, -344747, -228907, -39283, 20079, -57468, -149168, -63817, -59697, 323, 6682, 84557, -161483, -548392, -350222, -88141, -81153, -243154, -225933, -28841, 109983, 35411, 42548, -197456, -210031, -266010, -413587, -504258, -345334, -211812, -169144, -224966, -222985, -244418, -240070, -319473, -362982, -141572, -244584, -440409, -412194, -274177, -48299, 144434, -58890, -227141, -321680, -312037, -391558, -335344, -108050, -11211, 33153, 9983, -36973, -59039, -103977, 168059, 304474, 559673, 715619, 887997, 1183631, 1719308, 1927367, 1692215, 1052910, 568579, 343521, 262583, 183279, 175839, 164697, 229473, 218460, 149617, 77597, 145649]
18753A45649j51729m1326N5597J07534j00490J41678J18005k50679j84925J07205
18743e3481R1290O7376j90341j52707j9814m6841n8177j48480o1847J942J68591
18732d02489J89472J94147l3593q8480k883j101J14556K3954q8439j18947l1949
18721b45752m1342M562R3500J05137Q639p5666o7136m1461Q3752O1921J32263
18710A8417K1075o792K10590J6742r7445J3780m7897o1226o3411K05852J79727
18699C89412O501j63885j56550j26151j84699L3091J37390N652o6932q8391l2014
18688b46576j6779l5953J22133K5647J8281k05812O2018J32259p156M6629r2774
18677a98083q5534n3866L2198J16814O8951J8882J18004j70642n3435m7713L6507
$$ y = [145649, -6080, -47406, 8191, 115725, 15235, 156913, 274918, 24239, -160686, -53481, 37809, 105185, -85156, -237863, -257677, -304518, -362695, -511175, -573022, -571080, -402489, -213017, -18870, -52463, -140943, -143826, -144927, -30371, -6417, -94856, -213803, -245752, -287094, -282532, -189032, -83895, -75256, -150922, -218058, -259519, -175767, -113846, 18417, 39492, 32700, 243290, 260032, 162587, 176367, 128470, 67244, 3833, 209685, 389412, 395913, 232028, 75478, -50673, -235372, -202281, -64891, -59239, -126171, -214562, -246576, -263355, -299308, -177175, -151528, -133247, -339059, -277041, -144782, -151938, -105309, -198083, -283617, -337483, -305285, -188471, -119520, -100638, 17366, -153276, -206711, -254424, -217917]
18666b17917r5654Q3482J54374J39633Q6767P4106M6633j11830j82762k62065
18656b85233k33932J28558J75044M8411n4872N6600L9159j17090J5831l5401K75152
18645A2227J24720m5660K6724r0116p1510j58387Q608J35286K05824K2256j55756
18634A4216n5040J30690r8861p6760q0556J9135k2560K8482L5116K44143J99346
18623C37351J51871j58288k51988k32033j56726M9234N7421L38028J53219q5381
18613B02708J54633N7312j34135k76098j55285J85985k5835p3878j98647R838
18603b53402k6251j14962Q8341L30426k0116K8285l374k6960O2178q83p102n051
18591E1129k96707Q5575J020J09338J29775r3550k5757n3749J69555R8053n3434
$$ y = [-217917, -313571, -230089, -75715, 63918, 150685, 224791, 271424, 159594, -23168, -285233, -519165, -390607, -215563, -167152, -222024, -165424, -126265, -243355, -227524, -262925, 12227, 136947, 91287, 118011, 27895, -43615, -202002, -193394, -58108, 147716, 169972, 14216, -40824, 89866, -8995, -85755, -166311, -147176, -169736, -141254, -106138, 138005, 337351, 489222, 330934, 78946, -153087, -309813, -260579, -203158, 134870, 288089, 202708, 357341, 414653, 280518, 4420, -150865, 35120, 9285, -64593, -263240, -253402, -279653, -394615, -306274, 24152, 4036, 32321, 28947, 1987, 64165, 63282, 56180, 51129, -245578, -160003, -158983, -49645, 80130, -13420, -39177, -92926, 76629, 174682, 121248]
18580A21248l0332N0816j69408k17243n9229J47428o5274k85974J56788K42774
18570a08406j88895j15523j19460k17984n023K42836K2069k9380N6911Q7514M7606
18559c27735J38719J22435j32335O1001K53813N6053r8804q7786K4517l9100n0443
18548g9665j26458q0567q552J28999L28989K04627j20055k13044M6607j02294
18538b1413l44028J44716K43707M7348L7842j00144P4K2554m4675M974j16546
18527a25591o3926Q1790M6298O0823J27388K53901Q3159j62849L6280J06936j47512
18516B96697q3931J89608J42121j68953O5812L25327L78040N65152L80763J22510
18506B213146p070J4218J21709K4216j15938j68664j03476Q0351p7376l09672
$$ y = [121248, 90916, 141732, -27676, -244919, -304148, -156720, -221994, -507968, -351180, -108406, -297301, -412824, -532284, -750268, -755291, -512455, -490386, -519766, -462855, -375341, -327735, -189016, -66581, -198916, -137915, 115898, 171951, 73147, -14639, 9878, -29222, -79665, -206123, -286690, -295242, -166243, 162746, 367373, 247318, 34274, 80881, -21413, -365441, -220725, 22982, 70330, 108172, 8028, 8102, 30656, -14019, -9045, -125591, -189517, -107727, -61429, -606, 126782, 380683, 463842, 300993, 337273, 444209, 296697, 212766, 402374, 544495, 375542, 441354, 766681, 1144721, 1709873, 2090636, 2213146, 2206076, 2220294, 2342003, 2366219, 2250281, 2081617, 1978141, 2058492, 1981116, 1671444]
18496A671444k16725q2352o9026k34068j43797M948j14191J20106p5111M0396
18486I01624j6325k00995k56151k11361K22525J95917j84267k3578r5661k76973
18476E4755Q378J87049K01739j88070j07656K7685K24099K37709j17815M3024
18466E70897J04021N3668o3335l3979K7168J37614K4486J18482K50222K89132
18456A478376K69638J40889N2793K92115M62599L87860J47769j45492l30760j68324
18446B587463k51614k03926l40411j43150k39547k68968j76089m18359l2630J30150
18436F42919M8543J06019j42687l59441j35416m0786L00813J37172m8203r6809
18426D12124l2399K5596q2372p3976J06220m710j58959k09336j3378M8388K43515
$$ y = [1671444, 1454719, 1372367, 1303341, 1069273, 925476, 930424, 816233, 936339, 861228, 901624, 885299, 684304, 428153, 216792, 439317, 635234, 450967, 427389, 331728, 54755, 63133, 250182, 451921, 263851, 156195, 183880, 407979, 645688, 527873, 570897, 674918, 728586, 665251, 631272, 658440, 796054, 820540, 939022, 1189244, 1478376, 1748014, 1888903, 1941696, 2233811, 2696410, 3084270, 3232039, 3086547, 2755787, 2587463, 2335849, 2131923, 1791512, 1648362, 1408815, 1139847, 963758, 545399, 512769, 642919, 691462, 797481, 654794, 295353, 159937, 119151, 419964, 557136, 508933, 412124, 379725, 405321, 322949, 248973, 355193, 350483, 191524, -17812, -31190, 17198, 260713]
18415B60713M652N1126L1365L95728P168l04200k27398n0126J03125K8628o988
18404B93793l6357o3062j47880j26633q4448O5129j8863j37011K13658J98146
18394A56472J17281J4797k30750q1434n4508M5329L7562j08001l18399J23025
18384b98626P2455j76177M360J03148j22750K26228l1243j88184O9757J11118
18374b29914P5563m4039P0110M4936K7798Q966k33874j12563J71116J74967J70199
18363A23265J43754N8406j58797r1098j05726k2357p0108o900p447J15618J10436
18352H9046o7117K5161J9828J20093M1630k21080j9047J63049l5911p1262m1307
18341C083m6022j05451r1052q0899q957J00120K608r2175L3729l9889J35968K63728
$$ y = [260713, 265365, 316491, 347856, 743584, 750752, 446552, 219154, 169028, 272153, 300781, 293793, 257436, 194374, 46494, -80139, -164587, -99458, -118321, -255332, -41674, 156472, 273753, 288550, 57800, -23634, -78142, -32813, 4749, -103252, -421651, -298626, -226171, -402348, -397988, -294840, -417590, -191362, -222605, -410789, -341032, -229914, -154351, -198390, -128280, -83344, -55546, -46580, -280454, -393017, -221901, -46934, 123265, 267019, 325425, 166628, 75530, -30196, -52553, -122661, -129561, -137008, -21390, 89046, 21929, 47090, 66918, 187011, 228641, 7561, -11486, 151563, 115652, 44390, 3083, -42939, -148390, -239442, -320341, -329298, -229178, -226570, -318745, -285016, -324905, -188937, 74791]
18329G4791L0339j32574m6348K12398k3547k36445R3007N8905o5851r7837p9979
18318b13141K7678J10994N6509J88093K15861p2930m4406R1462q0763k25851k468
18307E1038P5211n6347L2054m7263q7174j72761l5285J31408K4015j61267O109
18296b40262J35909n8293J497l2881L9039j8416K7152P402Q0369J02465o5614
18285b1633q7718n801R3917J03435j902J14052J10762j51703q1442j9136q7514
18274c4683p3243l1189J34454K81222R9096j45541j85505o492j12922q7899j59665
18263c22367j9813J14297O7858J97840Q8612n2572n9168M5568p7349l2272j1214
18252f0580o8015J59501J40285p4964j48451l27865J10243K59577p0370Q6925
$$ y = [74791, 105130, -27444, -73792, 138606, 115059, -121386, -28379, 30526, -35325, -133162, -213141, -185463, -74469, -17960, 170133, 385994, 313064, 268658, 360120, 279357, 53506, 51038, 126249, 69902, 101956, 54693, -32481, -205242, -240527, -109119, -85104, -246371, -240262, -104353, -162646, -161149, -194030, -154991, -173407, -146255, -138853, -58484, 43981, -21633, -109351, -115152, -21235, 82200, 80298, 194350, 305112, 153409, 71967, 52831, -34683, -107926, -139115, -4661, 276561, 375657, 230116, 44611, 38119, -74803, -162702, -322367, -342180, -227883, -160025, 37815, 126427, 73855, 14687, 60255, -17094, -49366, -60580, -128595, 30906, 171191, 96227, -52224, -380089, -269846, -10269, -80639, 6286]
18242F286J35141k91475j83029M6489L38310L8395q6005N8540M9852p1494m6667
18231e657J13804K9928N1728O383L6935P5635o2190j06002l9835j36360n2330
18220h7961n4713J42786K4451N4281o970r2172k1854q125J57466O7659j83718
18209h870j60384r2739J02078P9438Q0102l2770k0738L9497J06755j06388J9213
18198E194l026J4149M4483J56839P9990k21753k75278J10381K32543L9112J10109
18187B92743R6179j4948k3181J05677l03856k25432P1653J1313n7978N8325O2997
18176G3492J50232N1289R8392J7289l6730k24547N5344k6670l7716L6143J01224
18165B57742k2343q1395L5731q3725j57853J88696J72261k46499J08203J47933
$$ y = [6286, 141427, -150048, -333077, -286588, 51722, 90117, 4112, 62652, 112504, 41010, -5657, 108147, 138075, 189803, 196186, 233121, 308756, 246566, 140564, 100729, -35631, -87961, -142674, 112, 24563, 78844, 71874, -20298, -42152, -50277, 107189, 174848, -8870, -169254, -261993, -159915, -80477, -375, -33145, -53883, -14386, 92369, -14019, 5194, 2168, 16317, 60800, 217639, 297629, 75876, -199402, -89021, 143522, 182634, 292743, 388922, 373974, 350793, 456470, 152614, -72818, -1165, 10148, -47830, 10495, 73492, 223724, 275013, 373405, 390694, 353964, 129417, 184761, 158091, 120375, 156518, 257742, 235399, 154004, 189735, 106010, -51843, 136853, 309114, 62615, 170818, 318751]
18155C18751J6739O4777P4483J5984n4815Q1651k3916r3449J2670O4089J24541
18144F01505J49176N0560J62945K36707M491J1569J5577j50828o9271j64293Q4112
18133I32250K07004K06283K31950K69431L78343M31393K10239K12700L66147O74306
18123D120046O93006P59830J387447J791562K079858K524984L530378M936083
18115B1823194P182558J0897008J8462125L3954155O8006006J23248922J07635698
18108C91209666j3336165j04411714j13210187o3349154l1216838j7274075j0594986
18101C7816547p227202n284968m136896l064223k352804j630240j476947j354014
18093A1289253j355750j036633r61135q50985n66184o18217n31292m49591k59282
$$ y = [318751, 335490, 400267, 474750, 490734, 435919, 517570, 493654, 400205, 412875, 476964, 601505, 750681, 801241, 964186, 1200893, 1205384, 1216953, 1232530, 1081702, 1012431, 848138, 932250, 1139254, 1345537, 1577487, 1846918, 2225261, 2656654, 2866893, 3079593, 3445740, 4120046, 4813052, 5572882, 6960329, 8751891, 10831749, 13356733, 16887111, 21823194, 29005752, 39902760, 58364885, 92319040, 160325046, 283573968, 391209666, 377873501, 273461787, 160251600, 96902446, 65685608, 48411533, 37816547, 30589345, 25304377, 21167481, 18103258, 15750454, 14120214, 12643267, 11289253, 9933503, 8896870, 7935735, 7084750, 6518566, 5900349, 5369057, 4919466, 4660184]
18084D660184l48502n9417P9267p5454j95443l06232l30428l72455l57848j88429
18074B505243p5007r2882j12751j68975j6701K06851j78154j26119k54935l60460
18064A326110p6657k39840r1312J1341L6852j99j36898N0088J43958K7336o7200
18053I83579j54205j57617L6270M8570l1582M8801p5250J2442J0022n2090j41500
18042E27440k60634J20438R6254J9226J09608k743R021j16601L1177j03019P3994
18031E04161q0056k38096j5669J12483O5730L2445k1196K32660l6742r7322L1149
18020D89547j41794J6210j2910q0012j22455P2820J5939j59662j80731N6969J75831
18009A29752m0435q205J33801P5036L2949J8350K3372j31721j3598j56599J0889
$$ y = [4660184, 4311682, 4252265, 4331532, 4256078, 4060635, 3754403, 3423975, 3051520, 2693672, 2505243, 2430236, 2337354, 2224603, 2055628, 2038927, 2245778, 2067624, 1941505, 1686570, 1326110, 1249453, 1009613, 918301, 929642, 966494, 966295, 829397, 879485, 1023443, 1050779, 983579, 829374, 671757, 708027, 756597, 725015, 773816, 698566, 711008, 721030, 668940, 527440, 266806, 387244, 483498, 502724, 612332, 609589, 618610, 502009, 533186, 430167, 504161, 424105, 186009, 170340, 282823, 348553, 380998, 359802, 592462, 555720, 458398, 489547, 347753, 363963, 351053, 271041, 148586, 221406, 237345, 77683, -103048, -46079, 129752, 89317, 81112, 214913, 289949, 322898, 341248, 364620, 232899, 219301, 62702, 73591]
17998G3591l2479q3476n7285J50894j2081q5159r4132j46061M8927J2221R8819
17987a26221J44498J21929J34191j87505j57358P11R7933K22636J70715R6570
17977E18099J62387r9772k68728j62670L6926q1408J12902M5972q4702R379J31928
17966C20313J5880p4905Q1053P7003q5538k22970M0566l5725j09897N5809J57895
17955B19484J8836P6587Q812L7684Q1289k20473k70351J4918R7214O9620Q2395
17944B16015R0120m4252p1434r7585M6452k27610J52450n2399Q1535J26248N3252
17933B72792L2903k48880j34711P9082J33060O1144l8646m7354j07126M1514J31206
17922A74984k91161r0845J24174O0533N0258J01500O2626P716j95994o5733R5582
$$ y = [73591, 41112, -42364, -99649, 51245, 39164, -45995, -140127, -286188, -237261, -225040, -126221, 18277, 140206, 274397, 86892, -70466, -69755, 28178, 250814, 421529, 518099, 680486, 580714, 311986, 149316, 186242, 104834, 217736, 263708, 179006, 188385, 320313, 336193, 261288, 342341, 419344, 333806, 110836, 151402, 115677, 5780, 61589, 219484, 238320, 314907, 323719, 361403, 442692, 222219, -48132, -33214, 64000, 133620, 216015, 306135, 261883, 190449, 92864, 139316, -88294, 64156, 11757, 93292, 219540, 272792, 305695, 56815, -77896, 1186, 134246, 195390, 156744, 109390, 2264, 43778, 174984, -116177, -207022, -82848, -22315, 27943, 129443, 192069, 199785, 3791, -61942, 33640]
17911C3640J53783l2124Q6112K4696l26147q959K02776J6905R3611o1513j66574
17900A6206k34497j50515J00844K43566J01893o0252o3838j20385q3926O7840
17890a83064K37396p0076j30857k6675J9106P5674P6860R7794P0717j98717k1982
17879e3824J09919k3800J16409J33749J4706k21232M833j5956p1527j66526J4005
17868a59244J60477J3546J28223K15204m1507j74329j7509J7117K0866J41914
17858C04758m5826k04079j64193K2524n931P9878L9908L5188j4514O529l3521
17847B0721K2468p9748J3033k2911p8733o8875J7262K21559n7737k66010O7535
17836b11436J11482L2095J5955k61315j38412Q2044N9326o2557J75115J42775
$$ y = [33640, 187423, 155299, 241411, 266107, -60040, -68999, 133777, 150682, 244293, 182780, 16206, -218291, -368806, -267962, -24396, 77497, 17245, -46593, -166978, -250904, -183064, 54332, -15744, -146601, -173276, -154170, -78496, -1636, 96158, 166875, -31842, -53824, 56095, 32295, 148704, 282453, 297159, 75927, 80760, 64804, -6723, -173249, -159244, 1233, 14779, 143002, 358206, 316699, 142370, 124861, 141978, 162844, 304758, 258932, 54853, -109340, -86816, -92747, -12869, 27039, 62227, 47713, 54242, 20721, 43189, -36559, -23526, -46437, -125170, -194045, -176783, 44776, -12961, -278971, -211436, -99954, -67859, -51904, -313219, -451631, -369587, -310261, -372818, -197703, -54928]
17826e4928O5829J30728Q1471J4853o3174k77909l9527J55222L7490P601r2112
17815c4456k00638k82091J31203K66538P0333k8334K04836q4048r7316j12725
17805a66698j58696N4899L5952J24369k836K70753K39373Q6779K1175L6564m7116
17794D94518j02831q0516j41154n3163j77023j49197m5123N117J40457L10460
17784B01545O3765l29173j9373M4423l7836N6430J03317j66268o7450k9451J3655
17773a66416N0088J29520j70367q733K55980O0300J7544j87534r3037m3846j30235
17762b86736M078J94876M8445K6729k69717j21875j39849P7398N2171J46177J30448
17751a37855L6173Q7131J91050Q9454j48959L2608J84817k14422L3605J087o7885
$$ y = [-54928, 10901, 141629, 223100, 237953, 174779, -103130, -142657, 12565, 50055, 57656, -34456, -235094, -517185, -385982, -119444, -49111, -77445, 127391, 43343, -53973, -166698, -325394, -270495, -234543, -110174, -113010, 157743, 397116, 483895, 505070, 541634, 494518, 391687, 311171, 170017, 116854, -60169, -209366, -254489, -249372, -108915, 201545, 265310, -63863, -83236, -38813, -76649, -20219, 83098, -83170, -150620, -180071, -166416, -116328, 13192, -157175, -165908, 90072, 150372, 167916, -19618, -112655, -156501, -286736, -282658, -87782, -39337, -12608, -282325, -404200, -544049, -466651, -414480, -268303, -137855, -101682, -14551, 176499, 265953, 116994, 149602, 334419, 119997, 153602, 154689, 86804]
17740H6804j6255O3794O8096k7643j85115k4495K9029J9210N4680N946P0485J5992
17728A60528j26473j98964J50707J42351j30903J33260J06630k1301N6540j37435
17718A34940k49373R9123J90466Q9027p2748k74265R9966K32124j7863j00795
17708A30602k97510j15819N0205K03984J40511p3087j47996L3795J6674p3166
17698a31807J3367Q9572m7873J91747O7236m7222j57791k6551L2412K6581j19050
17687a09379j20310Q3490l1637O7334J6983o0757r5620O9557o3195q019J53703
17676i7850M0156m5740K2181j53357O1189L3455j66064K8479P0752R064Q5925
17665a11810J23968J05249o4209j74360q0921J4855j01124j0985K3020K18735
$$ y = [86804, 70549, 134343, 202439, 174796, -10319, -34814, -5785, 13425, 68105, 74051, 144536, 160528, 34055, -164909, -14202, 128149, -2754, 130506, 237136, 215835, 272375, 134940, -114433, -15310, 175156, 264183, 191435, -82830, 17136, 249260, 231397, 130602, -166908, -282727, -232522, -28538, 111973, 38886, -109110, -75315, -58641, -131807, -118440, -28868, -76741, 115006, 182242, 135020, -22771, -49322, -16910, 9671, -109379, -229689, -146199, -177836, -110502, -93519, -154276, -249896, -180339, -243534, -251553, -97850, -57694, -103434, -81253, -234610, -173421, -139966, -306030, -277551, -206799, -197735, -111810, 12158, 117407, 53198, -121162, -202083, -187228, -288352, -299337, -276317, -57582]
17655e7582J29735k41887j92661Q5669M8719J04097J63186L7388p4355Q6169J70045
17644B58523q3557j33921J7597q3602m742k1855k40957n7248K63701K66761M5278
17633B25978J43818J551l7467o9899j71929r5802m7013j36715J91282R0743P4783
17622A69330k31244j59719P3014J52249J56047o8177j3119j3230K11680J1041
17612B87872k47091q6276J00053j42249k50425J0701j10751q094K25871K48762
17602B8373m5011M935J69622p5221j1829L0493p1648J69710J24685P1093k8260
17591C66942j39662k34561j43632k6423l8962J66354Q0587p6656j1180n3418j10971
17580b21582R1265J54862j06177k07394K11812J52462q7332j97738l4271m1413
$$ y = [-57582, 72153, -169734, -362395, -276726, -228007, -123910, 39276, 76664, 2309, 88478, 258523, 174966, 41045, 58642, -24960, -29702, -51557, -292514, -349762, -86061, 180700, 225978, 369796, 371347, 333880, 263981, 92052, -3750, -50763, -187478, 3804, 94547, 169330, -61914, -221633, -148619, 3630, 159677, 91500, 78381, 65151, 276831, 287872, 40781, -45495, 54558, -87691, -338116, -327415, -438166, -446260, -220389, 28373, -16638, -11703, 157919, 82698, 70869, 101362, 29714, 199424, 324109, 395202, 366942, 227280, -7281, -150913, -177336, -216298, -49944, 30643, -46013, -57193, -110611, -221582, -130317, 24545, -81632, -289026, -77214, 75248, -12084, -209822, -244093, -285506]
17570b85506L68039L23282P1798j18500K35618J9935J5410j31812J1464P097L0322
17559E47147K51111m3649p0006J53254N109K667Q4219K11440K72580M40698M19184
17548B273754P5789q8477K04518K58980R8239m2542k27650l50534j55004r0796
17538A956277l80792l80704k26260q4291p089J09734o7736j05991j06191j60812
17528E46145n4291J67425L8686j46206j34063l8348J17957K0088j00775l28141
17518H8477p2492K24214M3437K7451j62606j72689j41101J56543K82143L00350
17508E73727J00693N6970J07988r2934p1280O8166M0438K8135j49097N0218K67185
17497I80209M36961L86912K02115l761J78109K62255O1953r8157q2350O8087j77078
$$ y = [-285506, 82533, 405815, 477613, 359113, 594731, 614666, 630076, 498264, 509728, 516825, 547147, 798258, 754609, 684603, 837857, 842966, 845633, 929852, 1141292, 1413872, 1854570, 2273754, 2349543, 2261066, 2465584, 2724564, 2822803, 2780261, 2552611, 2202077, 2047073, 1956277, 1575485, 1194781, 968521, 884230, 877141, 986875, 919139, 813148, 706957, 546145, 491854, 659279, 697965, 551759, 417696, 379348, 497305, 517393, 416618, 88477, 15985, 240199, 283636, 311087, 148481, -24208, -165309, -8766, 273377, 573727, 674420, 731390, 839378, 746444, 675164, 743330, 783768, 811903, 662806, 713024, 980209, 1417170, 1804082, 2006197, 2002436, 2180545, 2442800, 2504753, 2406596, 2324246, 2392333, 2215255]
17486B215255j78965l22978k69354j43871O5077J60341k95963m03186l49642p2480
17476D04234P9809L357M0277n6828j74777j69445J5754N6690r3893K0270J12983
17465B38431J35786q3527j79189j32121R4119J83621N2575j08245j89097o3556
17455e1203Q6360J63346P6996r8762q9741j0538k3856m7350K23127L47684J35266
17444G11329N21164P96807K20752k53360o47532n92147j82541o3489k16564j92603
17434A01816k9503J24557n8665k35690J24682p8553j71294k5623j11461j04224
17424d63958K7832J6800O1944L0358j82112r6795K25060K23280J19131m9633n4102
17413a42195m7054J71636L938q6999k9216J57292M9022J7711r4341j78340l08777
$$ y = [2215255, 2036290, 1713312, 1443958, 1300087, 1365164, 1525505, 1229542, 826356, 476714, 404234, 484043, 487400, 527677, 470849, 296072, 126627, 142381, 199071, 105178, 125448, 238431, 374217, 290690, 111501, -20620, 73499, 257120, 309695, 201450, 12353, -51203, 35157, 198503, 275499, 176737, 86996, 76458, 52602, 5252, 228379, 576063, 711329, 1232493, 2029300, 2250052, 1996692, 1349160, 757013, 574472, 510983, 294419, 101816, 72313, 196870, 138205, -97485, 27197, -51356, -222650, -248273, -359734, -463958, -436126, -419326, -357382, -327024, -509136, -605931, -380871, -157591, -38460, -88093, -142195, -189249, -17613, -13675, -100674, -129890, 27402, 76424, 94135, -206, -178546, -487323]
17402d87323O1523Q8150J5002J0922O8249J30005P4941j47663r1896j04559K00118
17391a82531J16209J22527m3114j44737j68325j1588J22444J1014L2261R8973
17381d6867j83076L2692k0806j31565J72708j3654Q6032l057r5231j01939P9945
17370b24818L983J05321J3529l4965l090K0801J21223J42128P0990L0980k22989
17359B3093m5246K0599p1550J3954J26983j90855j58687N4806J29151K43766N6390
17348B02404k23647N9676L43L8859j9002j01091j29586K40066K36346R215j965
17337C11618J2742Q1409k7659k06807O9559j6874j47410m778N0023j7639r1369
17326A2815n0717J4474P9087k66332m4872J25398J65676k8705n681l807K5127
$$ y = [-487323, -425800, -337650, -322648, -311726, -243477, -113472, -38531, -186194, -278090, -382649, -182531, -66322, 56205, 13091, -131646, -299971, -311559, -189115, -178101, -145840, -46867, -229943, -197251, -218057, -349622, -176914, -190568, -104536, -107593, -202824, -304763, -224818, -220835, -115514, -101985, -136950, -140040, -119239, 1984, 144112, 215102, 246082, 23093, -22153, -1554, -73104, -59150, 67833, -123022, -281709, -226903, -97752, 146014, 202404, -21243, 38433, 38776, 77635, 58633, -42458, -172044, 68022, 304368, 313583, 311618, 324360, 405769, 378110, 171303, 240862, 223988, 76578, 71800, 121823, 104184, 12815, -37902, -23428, 55659, -210673, -255545, -130147, 35529, 6824, 1143, -2664, 22463]
17315B2463m0782j63410j14151J03496J78675j6759j96562P6736J61036J3165
17305B3907P0900j32662r4009r3582J26500n3911n8811j19574Q5378J42139J1991
17294i1734m4409k77587L6255K21002L2898m6942R5419p7491p4822J09932J11748
17283e731k33757j82798j14276J4114J78341J42948J30376p3480M7395J98741
17273A01873J59431J8625p6280M7881j69385k86912O2835J5417l6243m9250M8494
17262a63514J84530M7696q4178j65103L579j14463K33221j3962k20569N927J36147
17251a50689j8556L9144j82185J4105J45379J82565J30620P9721k17758j46840
17241a24494k7711L8068q7928j84230k8574K16762P5259j30550q902J27616K10762
$$ y = [22463, -18319, -181729, -295880, -192384, -13709, -30468, -227030, -150294, 10742, 23907, 94807, -37855, -131864, -225446, -98946, -152857, -211668, -331242, -245864, -103725, -91734, -136143, -413730, -377475, -156473, -123575, -170517, -75098, -152589, -227411, -117479, -5731, -239488, -422286, -536562, -522448, -344107, -201159, -70783, -144263, -96868, 101873, 261304, 279929, 203649, 251530, 82145, -204767, -141932, -126515, -162758, -212008, -163514, 21016, 68712, -15466, -180569, -176990, -291453, -58232, -72194, -292763, -286836, -150689, -169245, -130101, -312286, -298181, -152802, 29763, 160383, 240104, 22346, -124494, -152205, -114137, -202065, -386295, -414869, -198107, -122848, -253398, -262300, -134684, 76078]
17230G6078j13195j45235K2919J9680j6171P5384J29792J11647K9766j62063n9629
17219c1027j86181j49014k5154n2762N0918K22488K01237r9692p7550k4814q894
17208a80445P2188M6866P715J0825N4761p8932m4913N5342N6834p1648K49628
17197A78221L6587k69476m1682K30333O4553l2831r3538o8260j3120J19730n5093
17186E5424m5927j96958M91l4378L8949n5035j04558L22067K38512N4101K3026
17175B95714m3524o0860p1719L3887k75870j34255m1180J19771R0956j56433j28128
17164c71641J54201J94805q9325N8054n215j75363k13378l1743j5504K0226J07146
17153c67737M8786k03623M0535K70583N5053k5839p572l9758j81877q5468J71819
$$ y = [76078, -37117, -182352, -159433, -139753, -155924, -80540, 49252, 160899, 190665, 28602, -31027, -217208, -366222, -391376, -444138, -393220, -170732, 30505, -69187, -146737, -171551, -180445, -108257, -61391, -53676, -42851, 11910, -67022, -111935, -56593, 241, -71407, 178221, 214808, -54668, -96350, 133983, 198536, 165705, 72167, 3907, -9213, 110517, 55424, 9497, -187461, -186970, -221348, -182399, -237434, -341992, -19925, 218587, 272688, 295714, 252190, 191330, 119611, 153498, -122372, -256627, -297807, -178036, -87080, -243513, -371641, -217440, -22635, -111960, -53906, -59121, -234484, -447862, -479605, -495109, -474883, -367737, -318951, -522574, -482039, -211456, -156403, -182242, -189814, -229572, -411449, -496917, -325098]
17142c25098P109n2416j47741P5234L4287Q6777J36287p3533j68311J81757J51584
17131i4064p3019j74368K4759K06030J53215L6347Q4628K9714m7839j55687j5226
17120b5510j3804O429R488R5187j3928j5994K5639p0486K1528j42820J90871O6907
17108A33507r4766j81398R60k50543k8628P7852J46533J00151J26801n8531L6528
17097H466J71147J0927m6964K7601j10619q8910J00377R4297j7414L6690M2481
17086B28079j40966J907l9033J196L7349l419j13894N4341M4310R4013J22730
17075B86613R8448R644K7282j47397p3599o2306j46176j0917K24959J99740O9667
17064D75958j30144o1539p6511J2024j35999J5791j61888j87142j8128L5241j44139
$$ y = [-325098, -317989, -370405, -518146, -442912, -408625, -321848, -185561, -259094, -427405, -245648, -94064, -167083, -341451, -316692, -110662, 42553, 78900, 163528, 193242, 145403, -10284, -25510, -39314, -32885, -23397, 71790, 57862, 41868, 67507, -2979, 18549, -124271, 66600, 133507, 38741, -142657, -141697, -392240, -420868, -343016, -196483, -96332, 30469, -28062, 8466, 179613, 190540, 143576, 171177, 60558, -28352, 72025, 166322, 148908, 185598, 228079, 87113, 89020, 49987, 51183, 88532, 85113, -28781, 25560, 69870, 163883, 286613, 385061, 394705, 421987, 274590, 200991, 138685, -7491, -18408, 206551, 406291, 475958, 345814, 284275, 207764, 219788, 83789, 99580, -62308, -249450, -267578, -232337, -376476]
17053c76476M3332k278J43230J06574J3231R1231j3858K7731L0268l0588r1630
17042e9233q2540J68970r614j30005P3178Q7048M9186j46056m7719N7574L3279
17031e932N5474J00973P365j62689N5891Q4962R4201o7992j34800j55534J88378
17020F0297J15073o9389p0286P758N3801Q0163J22519P4176j73897q2477J35859
17009B53597J43137j0557R911q4130k06274K5873k28667j63378K91329K82080
16999C12921M5708o4689k05501j26069J69191Q7070m3240K6942K2407q0318n6293
16988H8129P5506k1082j61153j6680m7875j98595m3689J88152o5357o0683j32854
16977c96181J06002L12184J57030r0313k9175P0885j8955P9455R1195j7407k06806
$$ y = [-376476, -333144, -335422, -192192, -85618, -72387, 18844, 4986, 32717, 62985, 32397, -59233, -141773, 27197, 17583, -112422, -39244, 47804, 96990, -49066, -96785, -39211, -5932, 49542, 150515, 157880, -4809, 51082, 136044, 230245, 162253, 27453, -128081, 60297, 175370, 105981, 35695, 43453, 97254, 177417, 299936, 374112, 200215, 117738, 253597, 396734, 386177, 396088, 311958, 105684, 131557, -97110, -260488, 30841, 312921, 358629, 293940, 88439, -37630, 131561, 218631, 175391, 202333, 224740, 144422, 88129, 163635, 142553, -18600, -35280, -83155, -281750, -325439, -137287, -202644, -263327, -396181, -290179, 22005, 179035, 88722, 59547, 130432, 111477, 190932, 282127, 264720, 57914]
16966E7914k1768j42248J13340O3098J14597J09344j07851j56942l2324j14809
16956a17649j48249P6390J46807j26722r8301J17542J60773J28893q8735j45424
16946i4675j9980K1139J24691j27078j12050J46415k7024j7861J36706J9190m3871
16935E602O3081O3476J3767j46234j64953k334J18844O5012j23237k10269N744
16924c11501J2784K16198J59931J0992N8416j37295j87054j00031o4318p1327
16914d13205K01331N00639K43399n3035k47217j93983N4684o9554j84474J8932
16904a42483J74058K2989j12953R6564P6670M4591j0257r6529j80552l6764j4029
16893a78695l1884j57078j16644P9591J26954K12193P7239j06865o0613J6895
$$ y = [57914, 36146, -106102, 7238, 70336, 184933, 294277, 186426, 29484, -2840, -117649, -265898, -189508, -42701, -169423, -267724, -150182, 10591, 139484, 50749, -94675, -114655, -93516, 31175, -95903, -207953, -61538, -88562, -106423, 30283, 49473, 5602, 68683, 132159, 145926, -308, -165261, -167595, -48751, 16261, -106976, -317245, -311501, -298717, -82519, 77412, 88404, 146820, 9525, -177529, -277560, -341878, -413205, -211874, 288765, 532164, 479129, 231912, 37929, 92613, 23059, -161415, -142483, 31575, 54564, -58389, 38175, 114845, 159436, 149179, 52650, -127902, -164666, -178695, -210579, -367657, -484301, -404710, -277756, -65563, 11676, -95189, -155802, -138907]
16883a38907k0422n3173M6340j88595p3331P0319J00324P8547J32390M3960K4078
16872B1530n8720O5328O8164j00285j41955j41764q3679J08505J54702L5636L3730
16861c8808j9911J131P5378q9039m0629N4201j7714j40076q1597J03206N1699
16850a42159O6163J51499m1131j38328k0749K28203L9485P4339k37503j20233
16840a40414N9214J36280O7137k6053j38051m5349O9789Q763J1201K8071p1237
16829d0649L9857q9520q4100M4098J64976L3179n2640n1824J0428q501J1326j02852
16817a26222Q4319j24823J5373K29769o5572O7702J41675j11419r8871K158l4028
16806a9939j5515n483j6562P1295R0573k99009p051K37031K7727p5199L975m5448
$$ y = [-138907, -159329, -212502, -166162, -354757, -428088, -357769, -257445, -178898, -46508, -2548, 21530, -37190, 28138, 96302, -3983, -145938, -287702, -371381, -262876, -108174, -72538, -38808, -58719, -57588, 17790, -71249, -111878, -57677, -75391, -215467, -297064, -193858, -142159, -75996, 75503, 34372, -103956, -124705, 103498, 142983, 217322, -20181, -140414, -81200, 55080, 122217, 96164, -41887, -87236, -17447, -8684, 2517, 30588, -40649, -792, -90312, -174412, -130314, 34662, 67841, 15201, -36623, -26195, -34696, -23370, -126222, -41903, -166726, -151353, 78416, 12844, 80546, 222221, 110802, 11931, 14089, -19939, -35454, -40937, -57499, 13796, 104369, -194640, -201691, 35340, 63067, -12132, -8157, -53605]
16794e3605m210o7547J2018J27337j31283k01288k8832O891M32694K08556l8580
16783B62151n4352J4154K0951m1680N1254k98388k13808J6420R0473K69682j56137
16772c9280j51707R5861J29636j87473j21102R5709m1094K0045P0368m4430J56021
16761a7446J28328M7315m9181j65936J11660K14616J1254j76856n2916l7159J27286
16750A40965J85581j38158n5784N2618j843j63529o7727j51000J66681J7125j1465
16739b6536J75330o3139L2965Q1228j40427k23027m2728J91783l3297R5839n6187
16728h196m774J9757O663p0820M2333n3526j61155K9646J64252J26788M837L4673
16716A30478Q960P5243L0789p2217j8494m0127N1958J24794m8396K6253j3495
$$ y = [-53605, -57815, -125362, -113344, 13993, -117290, -318578, -347410, -340519, 92175, 300731, 262151, 207799, 221953, 242904, 201224, 252478, -45910, -259718, -243298, -152825, 116857, -39280, -190987, -95126, 34510, -152963, -274065, -178356, -219450, -199405, -129037, -173467, -17446, 110882, 158197, 109016, -56920, 54740, 269356, 280610, 103754, 50838, 13679, 140965, 326546, 188388, 132604, 185222, 183379, 19850, -47877, -198877, -32196, -15071, -26536, 148794, 85655, 118620, 199848, 59421, -163606, -206334, -14551, -47848, 47991, -8196, -12970, 6787, 13450, -57370, -15037, -68563, -229718, -200072, -35820, 90968, 95805, 130478, 139438, 214681, 245470, 173253, 154759, 114632, 166590, 291384, 242988, 269241, 255746]
16705B55746j30750n9193j25386l2849L2565o3235j08574j07301J56510K20817
16695C8350J52670j19352o5254q6039l33437j4317o0389l4978J76917N9363j47629
16684d34095J13441J38235j12028J75181Q0345r7693k31275K5463j4853J32308
16674b24971J71758Q4138o1699k005o4983j71749l6887J86729K73131R7228l0180
16663B20510k9624j72898q1117J00463j98272j59482K27519R2466Q2129q0157
16653A537l4650J62335k6371j58294j167m1958m6103l6347N3554k0376J64937
16642A7097P6692k44184p6966J1728j46825j8908N9179p8231L7949K44793k6919
16631a44595M1398J59518q6808j23783O1368L5194j36840M3448J7113J61117J28500
$$ y = [255746, 124996, 65803, -59583, -92432, -59867, -123102, -231676, -338977, -182467, 38350, 191020, 71668, 6414, -79625, -413062, -427379, -487768, -522746, -345829, -286466, -434095, -320654, -182419, -294447, -119266, -38921, -136614, -367889, -342426, -357279, -224971, -53213, 30925, -30774, -32779, -97762, -269511, -306398, -119669, 153462, 250690, 220510, 190886, 17988, -63129, 37334, -160938, -320420, -92901, -435, 81694, 1537, -33113, 129222, 102851, -55443, -56610, -98568, -144671, -181018, -127464, -147840, 17097, 93789, -150395, -227361, -215633, -362458, -381366, -322187, -400418, -362469, -117676, -144595, -103197, 56321, -30487, -154270, -92902, -57708, -194548, -151100, -133987, 27130, 155630]
16620A55630J19006N9287L7759j46707j02699k09135r8860j08936J26618Q0005
16610h8032j0114L12134m1838M8910M6263j86787j7757O4830m1847n6756o4407
16599c5401m9450j10886Q1681J72136P6248l4806N3748J1838m9853L8907j765
16588A52397j14818l4908L9000j68517j14858j01289K0964j08763j1694L18554
16578a23932k2298o7124j56189j3656O6030J24440J57646J02693J7332j38053
16568e3111j0885r7979j05631L6522O5417m5486j42785K57833R7751k36854k9644
16557b64852j1458K23369J43121k00906j38583J50049P7826K6477R0164J19063
16547B14270J02215k03420J13218J50113r9330j65264J29743J02846j23984o2445
$$ y = [155630, 274636, 333923, 371682, 224975, 122276, -86859, -185719, -294655, -168037, -88032, -98146, 213988, 172150, 221060, 267323, 80536, 62779, 127609, 85762, 29006, -35401, -84851, -195737, -114056, 58080, 134328, 99522, 153270, 165108, 115255, 154162, 152397, 37579, 2671, 41671, -126846, -241704, -342993, -322029, -430792, -442486, -123932, -146230, -213354, -369543, -383199, -317169, -192729, -35083, 67610, 84942, -53111, -63996, -161975, -267606, -231084, -165667, -211153, -353938, -96105, 1646, -235208, -264852, -276310, -52941, 90180, -110726, -249309, -99260, -21434, 5043, 95207, 214270, 316485, 113065, 226283, 376396, 277066, 111802, 241545, 344391, 220407, 157962]
16537A57962j58843j67900o5175J58924o0467r7161k25529J36844K78134O6130
16527B2919K7170n3684m6026l57749j75707J01343K22478J53310O651M0817m605
16516f3083o916J76553O5374l7883q2699l0283L6527p809M1369L5518J31390k7015
16504B31043j2740J4711l216j6639j36520J7803j4347n0121j27040j60737K52140
16493e663K34129j74329l0008Q0408K1446j82651l75647p9256K65363J19949K17778
16482I1519P4385j07678j0147J80427O689j97428K18298L9260o0505o1614J88705
16471C61911K45048M5353j85947j03605q9474L48J14778Q7702o7518L487J2767
16460D24850K91726K24078J27798J54801P9863N9317N0561m5559j48928p7399
$$ y = [157962, -881, -168781, -233956, -75032, -135499, -232660, -458189, -321345, -43211, 22919, 50089, -3595, -49621, -407370, -583077, -481734, -259256, -105946, -99295, -58478, -63083, -69999, 106554, 171928, 134045, 51346, 21063, 57590, 49781, 91150, 126668, 258058, 231043, 218303, 233014, 229798, 213159, 76639, 94442, 80095, 29974, -97066, -257803, -5663, 228466, 54137, 24129, 104537, 125983, -56668, -432315, -511571, -246208, -126259, 91519, 165904, 58226, 48079, 228506, 235195, 37767, 256065, 295325, 234820, 173206, 361911, 606959, 652312, 466365, 362760, 273286, 273634, 388412, 476114, 408596, 412083, 424850, 716576, 940654, 1068452, 1223253, 1303116, 1362433, 1412994, 1367435, 1218507, 1141108]
16450A141108k2259K8421l2978j28903J86013O7382m192q4674r7704J119P2179
16439A125512r3348k36408k42178j06746O8856k0344N9979j52174k57192Q8099
16429B34056K06474K63869j13770j40852l1253J59517P943r9684j59740j1685
16419C14875J3065j02897k85078j00173J73654o3821J41177K56258M792k46672
16409A05180R9162N4353q1375k31111O40r2411Q9297R8792K3891q3251J9796Q5900
16397H8863j23963l7093O0249n2475j1916o4475j54781J29976q7943m7131l8299
16386c38988O807m4737O0641K7277n6716p7913J10040J7750J3575J56963n8867
16375a84168J0344J4482o9499M2145J29518J20899O6530O3641l5590j45352J19116
$$ y = [1141108, 1118849, 1147270, 1114292, 985389, 1171402, 1238784, 1234592, 1149918, 1052214, 1053333, 1125512, 1032164, 795756, 553578, 446832, 515688, 495344, 555323, 403149, 145957, 234056, 440530, 704399, 590629, 449777, 418524, 578041, 585984, 486300, 326560, 314875, 327940, 225043, -60035, -160208, 13446, -50375, 90802, 347060, 351852, 105180, 204342, 258695, 177320, -53791, -53151, -145562, -56265, 42527, 66418, -16833, 2963, 88863, -35100, -72193, -11944, -64419, -76335, -140810, -295591, -165615, -253558, -300689, -338988, -332181, -376918, -316277, -289000, -345716, -423629, -313589, -295839, -282264, -125301, -184168, -173824, -159342, -228841, -186696, -57178, 63721, 130251, 193892, 158302, 12950, 132066]
16364A32066K792l2389k3636j40836K32554L6263k02635P7391O9143j35777J32046
16353A46982J07844k44650q2019k7920J55431j69729r6716N3796J40498J04217
16343H7734r497j57619n9366j89894r6951K4760K99152J39076L0947j36558J39623
16332G1407n8799j75423J33175k45063j81090K55522N1596J03831J65120K4629
16322A44905m2875J6178N37j52809j37274J23743Q6460R2605j57861l10394j10319
16311d47104R7474m4887J33398J33997J61197Q0275q730L7535n2880J42769k7801
16300B05243j25823q9325q389M8515L05917R0799n8210k41589j44803q1368J26003
16289B6970J44131M4162k50182n3961k0822k15231M8281J11363Q2875J26834K22490
$$ y = [132066, 134858, 102469, 78833, -62003, 170551, 206814, 4179, 81570, 150713, 14936, 146982, 254826, 10176, -71843, -99763, 55668, -114061, -210777, -156981, -16483, 87734, 78237, -79382, -138748, -328642, -425593, -400833, -101681, 37395, 68342, -68216, 71407, 12608, -162815, -29640, -274703, -455793, -200271, -148675, -44844, 120276, 144905, 102030, 118208, 118745, -34064, -171338, -47595, 38865, 131470, -26391, -336785, -447104, -349630, -394517, -261119, -127122, 34075, 114350, 105620, 143155, 90275, 233044, 205243, 79420, -9905, -18294, 30221, 336138, 426937, 368727, 127138, -17665, -99033, 26970, 171101, 215263, -34919, -88880, -109702, -324933, -276652, -165289, -82414, 44420, 266910]
16278B66910m686j99954j98107O1610R0840N542q0919j31828J00674K26672L8006
16267A74760m166n4587l56840r5250Q7591P7701M6490j29032J30470K70016Q4506
16256B31659o8214l7806o332o3197J41460q2195k04038q0780k11449Q5028K03867
16245i1997J91655M2965m1393k8770j13186k4763J46552J07952j46776n0524n3093
16234f1378j02753j07924R9262L4831L5196K8342O456n3420J54900K37156J03778
16223C74446Q0591n2728j98799k71798j06883J78938O5770p8730m3128j2084J50615
16212H6210q3987Q4401j21914j3129j822J4905K14636m8875M0966o4229k18189
16201a11027o5216J56400p8169J31233L9111k19373L9332k2161j5758j5498J07710
$$ y = [266910, 262224, 62270, -135837, -74227, 16613, 22155, -58764, -190592, -89918, 136754, 174760, 170594, 116007, -240833, -336083, -248492, -170791, -124301, -253333, -122863, 147153, 231659, 163445, 125639, 119307, 56110, 197570, 115375, -88663, -169443, -380892, -295864, -91997, 99658, 142623, 101230, 72460, -40726, -65489, 81063, 189015, 42239, -8285, -61378, -164131, -272055, -172793, -137962, -102766, -74424, -67968, -121388, 33512, 270668, 374446, 455037, 402309, 203510, -68288, -175171, 3767, 69537, -9193, -52321, -64405, 86210, 2223, 86624, -35290, -48419, -50241, -35336, 179300, 130425, 171391, 107162, -111027, -176243, -19843, -98012, 33221, 72332, -147041, -107709, -129870, -145628, -161126, -53416]
16190e3416k5767r7018l1862M7843K03442K29566l9113j86231p8515p6552L1549
16179g6074J4442j19369k04461J28573K34638n4943j09238m1583K9829L24135
16169A25949j15870l8571N2817l8723N2995J53572P7918J86434j58226l16516
16159a8221j3446O944j61794r1647l6511J92408M4429o1486j29228J54476N3462
16148f0614n8121m2365m386J23865J91642j1804k64492q5651l823J9506k9878
16137b26121J67891J78534j19187N9643J2433q8778m1488K9438n8685J64362L8442
16126A16484k9949j9393k17812J5259L6536q066O2329o1196j07836k119J78952
16115c6811l1013n6360j37981P777J80238j33263N87o3623K08800J04561r9758
$$ y = [-53416, -79183, -176201, -208063, -160220, 43222, 272788, 233675, 47444, -31071, -107623, -76074, -61632, -181001, -385462, -256889, -22251, -77194, -186432, -228015, -198186, 125949, 10079, -28492, 24325, -14398, 38597, 192169, 270087, 456521, 298295, -18221, -31667, -24723, -186517, -278164, -314675, -122267, -77838, -139324, -268552, -114076, -60614, -118735, -161100, -165486, -41621, 150021, 138217, -126275, -211926, -215749, -196243, -226121, -58230, 120304, 1117, 60760, 73193, -15585, -57073, -27635, -86320, 78042, 116484, 86535, 67142, -150670, -135411, -98875, -106941, -44612, -105808, -213644, -215763, -36811, -67824, -124184, -262165, -254388, -74150, -207413, -206826, -270449, -61649, 42912, -56846]
16104e6846P5861N9835J24942K4158o241O8787p1356K4792r4170j52517M877J72758
16092A74880J44829j15796m8409m2283n1223N1626O4311q2709p2248N7860M2718
16081A23556J34558K075q1667j24704o8957j4607N4406n1647m7577j41139j12483
16070c28186J23890P3811K63516J81296J0190j48884j10037J43971j18988O6213
16060A56792j54j90536J45914j2477K135Q2974l1338j96619j47110j27813J0804
16049c07428k26259L1979L6947K15580J78581l3748J68880o2038p5160r7593j18515
16038b88774Q0753k2959J47231J36061K22612n099j39977k03011j38974k15816
16028d27953J3837O8515L0049M0752J55085R2458l1997q5171L8612J13394q6735
$$ y = [-56846, 19015, 78850, 203792, 227950, 221709, 290496, 219140, 243932, 149762, -2755, 2122, 174880, 319709, 203913, 155504, 113221, 61998, 113624, 177935, 95226, 22978, 80838, 123556, 258114, 260189, 178522, 53818, -15139, -29746, 24660, -26987, -74564, -215703, -328186, -204296, -130485, 133031, 314327, 324517, 175633, 65596, 209567, 90579, 156792, 156638, -33898, 112016, 99539, 101674, 184648, 153310, -43309, -190419, -318232, -307428, -533687, -501708, -464761, -249181, -70600, -104348, 64532, 2494, -72666, -170259, -288774, -208021, -230980, -83749, 52312, 274924, 269825, 129848, -73163, -212137, -427953, -414116, -345601, -315552, -274800, -119715, -27257, -59254, -144425, -105813, 7581, -79154]
16017g9154j15443N133L9524l254O045K746J7866j04979O369n505J21926N6516
16005e2210Q0782L0154J01178L9759j54383j34142k10218j651R1067q3594j63943
15994d57201J68720K66601j1965K1025J65360j96193j82313J51666Q8142k20927
15984b07085j38373l8840J19110K07204R9593j17318o1848r4717J26993M3842
15974f1439l8768Q4971K24282Q6322k0595J6440P4063j29006k44931N4522J91658
15963B37519j20583r5809q5223m0238P9204J31440J24762L4271n3448j41167j93683
15952a22955Q5888j2080k2178l1624M929Q4776J77674q2803J8463O1432J10621
15941B72143l3336k07307j90881q1516K33021K13589j00348M8893J77218l2316
$$ y = [-79154, -194597, -189464, -149940, -153194, -147149, -144403, -126537, -231516, -225147, -230652, -108726, -52210, 28572, 58726, 159904, 199663, 45280, -88862, -299080, -300731, -209664, -293258, -457201, -288481, -21880, -33845, -12820, 152540, -43653, -225966, -74300, 13842, -207085, -345458, -384298, -265188, -57984, 41609, -75709, -137557, -232274, -105281, -61439, -100207, -15236, 209046, 295368, 274773, 291213, 365276, 236270, -8661, 45861, 237519, 116936, 21127, -64096, -104334, -25130, 106310, 231072, 265343, 211895, 70728, -122955, -37067, -49147, -71325, -102949, -98020, -13244, 164430, 81627, 100090, 161522, 272143, 238807, 31500, -159381, -240897, -7876, 205713, 105365, 154258, 331476, 299160]
15931B99160j85333k3083k17103j37131K69239J64784r4355o6437J63510N5237
15921B28488j03847j09142Q5448L04949J64883k29702k27125k8519M8099l0877
15911A02655J66359J15354j90209l8723o6826M8640j05295M1882J61367J9233
15901B54437l21278k31276P3899j2859j50346m7742J57771K3876M5437k08080
15891d16161K9534J73664k1654o1406K16065O1185o5381K36464q3082j27978J14041
15880E5291Q7453j68943J2158o7281j10774J56202J20682J30814M7523j52358
15870A10767j7397Q3898k7278m0618q1825k10737j19382J9402L2495P869K1380
15859b21426Q9071j25687J1905J95963L1315J69443j43253j11238O3510L00247
$$ y = [299160, 113827, 90744, -126359, -263490, 5749, 170533, 76178, 9741, 173251, 228488, 124641, 15499, 100947, 405896, 570779, 341077, 113952, 85433, 133532, 102655, 269014, 384368, 194159, 155436, 88610, 137250, 31955, 73837, 235204, 254437, -66841, -298117, -224218, -237077, -387423, -435165, -277394, -253518, -208081, -416161, -386627, -212963, -234617, -296023, -79958, -18773, -84154, 152310, 69228, -58750, 55291, 142744, -26199, -14041, -81322, -192096, -35894, 84788, 215602, 263125, 110767, 93370, 177268, 149990, 109372, 27547, -183190, -302572, -283170, -250675, -242806, -221426, -132355, -258042, -246137, -50174, -18859, 150584, 7331, -103907, -40397, 259850]
15849B59850j04454j32870j24758p4181R5130J75739N0379r4263k1510n0661n5768
15838g7367J62726M3428J1724p1880k72103L5243Q6669r681J47357L5621R553
15827A01290J92957m7917j36535N1577k3063O7778P5141M5910j02768Q7167o1177
15816B50360J8232O9926j46762j49210j63996j08763O3251j4165l8851L2275O1266
15805a26437Q0534J42090l7428k29315j10854Q7654J55407J51822K45026P0330
15795D28829O2629k74688q8700k0525r069O8981J7081j78161j93367k13409P6059
15784c24340j116M2088K04207J47675J69489J246o9455r2356m6435j07542p9707
15773a56246J3373o7221l0895K16645K37915O9695j52624q4906k7058Q1127P3159
$$ y = [259850, 155396, 22526, -102232, -176413, -81283, 94456, 144835, 50572, 29062, -21599, -77367, 85359, 128787, 140511, 68631, -203472, -168229, -81560, -91241, 56116, 91737, 101290, 294247, 246330, 109795, 161372, 138309, 206087, 281228, 327138, 224370, 311537, 250360, 268592, 338518, 191756, 42546, -121450, -230213, -166962, -181127, -219978, -187703, -126437, -45903, 96187, 58759, -170556, -281410, -193756, -38349, 113473, 358499, 428829, 491458, 216770, 128070, 107545, 98476, 167457, 184538, 6377, -186990, -400399, -324340, -325456, -283368, -79161, 68514, 238003, 239249, 169794, 77438, 31003, -76539, -156246, -142873, -210094, -240989, -24344, 213571, 283266, 130642, 45736, 18678, 99805, 172964]
15762A72964M6748j79309j80693P3958K19967P8243N1535R588j42877Q936J52177
15751C11237L5284j25619k93902j02887j33870J20655J99023L0718P4865J15180
15741B30684L1243q8905j57655j5873j33980J13149J31203r1853J03539j7636
15731A03916j48980j13263p3162R4699P0665J5206M0228o1605K1070K51844L6345
15720B36963K17539P7304k58966q6070r7454j74051k3157R3791j50051N1667J44485
15709C2000K0386k74832j90059J83434K09007L9419J5672n7835J1978j53157q4226
15698b48213O9964J30618J98851j0618k78883j45526j55495J00702J39884r0007
15688b88723j9135J53961O5699J14473J77558j04571k27013j49962L3787R6478
$$ y = [172964, 219712, 40403, -140290, -66332, 153635, 231878, 283413, 293001, 150124, 159060, 311237, 346521, 220902, -73000, -175887, -309757, -189102, 9921, 40639, 115504, 230684, 261927, 173022, 15367, -506, -134486, -21337, 109866, 18013, 121552, 103916, -45064, -158327, -231489, -136790, -66125, -50919, -10691, -72296, -51226, 200618, 236963, 454502, 531806, 272840, 186770, 89316, -84735, -107892, -14101, -164152, -112485, 32000, 52386, -222446, -412505, -229071, -20064, 19355, 35027, -22808, -10830, -163987, -248213, -178249, -47631, 151220, 140602, -138281, -283807, -439302, -338600, -198716, -288723, -307858, -153897, -88198, 26275, 203833, 99262, -127751, -277713, -243926, -147448]
15678a47448j2551j26447J82399L64578R1202p5433n0442k44542n9300J03817
15668B5833l894j74475o586J05092k1270R1780J19182j11595r6883r7417o7071
15657b37304J38450O8955M1807J06844j8915j45314k1255J01698l1716J58700
15647A61950r9162m5011Q8402p2548j35984k1282J36504R3352j90160m8442J11155
15636b1226M5329R6558p38Q1892J06494P311P6377k7110l15101M7179r8481J4704
15624A3188R1371J7850K6755J82072k28631k15727o1351J15720J92472J85167
15614C18886j69398k88380j82058J47915N0802R3861Q0637j8697J13089Q2831
15604B29488k9159J4578J8900L9499J77096K0521j84767k0876j89866k13892O5779
$$ y = [-147448, -159999, -286446, -104047, 260531, 351733, 276300, 225858, -18684, -77984, 25833, 21939, -152536, -159122, -54030, -75300, 16480, 135662, 24067, -72816, -170233, -237304, -98854, -29899, 11908, 118752, 99837, -45477, -66732, 34966, 3250, 161950, 62788, 17777, 106179, 33631, -102353, -123635, 12869, 106221, -83939, -132381, -21226, 24103, 120661, 119923, 201815, 308309, 315620, 391997, 364887, 49786, 96965, -1516, 13188, 104559, 122409, 149164, 331236, 102605, -113122, -174473, -58753, 133719, 318886, 149488, -138892, -320950, -173035, -122233, -28372, 52265, 33568, 146657, 229488, 200329, 214907, 233807, 273306, 450402, 470923, 286156, 265280, 75414, -138478, -72699]
15593g2699J59763J0797k11020N8489O4919q7242O133K40448K19386L1594j99267
15582B21301J7982q302j48621j35934j30018J06002J39548R4130j05012r1025
15572c9949p1592p3359J98226J29727m8208j01547L4364P1610J1082r8687J5054
15561B6721k3514O9380J3664K2050Q7803j93333l0808q2443j90802J64505J48945
15550A2168K6853o1818k6297K65675L4252j10437M6283l4032l49479J06556K41972
15539A51696m0828p7282j8954J51408J21219n3059O5900l4516n7888q297P9026
15528B78425O5247j82975q6524J8432m480N1211j01167j96489m3500l8848j4491
15517b55159K9474O5943K22897j64883j39847R6097J61871J50098o3865j01842
$$ y = [-72699, 87064, 97861, -113159, -54670, 10249, -76993, -70860, 169588, 388974, 420568, 221301, 239283, 230981, 82360, -53574, -183592, -77590, 61958, 156088, 51076, -39949, -111541, -184900, 13326, 143053, 94845, -6702, 27662, 99272, 110354, 11667, 26721, 3207, 72587, 86251, 108301, 196104, 2771, -28037, -110480, -301282, -136777, 12168, 39021, -22797, -49094, 216581, 250833, 140396, 186679, 152647, -196832, -90276, 151696, 110868, 33586, 14632, 166040, 287259, 234200, 300100, 265584, 207696, 199399, 278425, 343672, 160697, 74173, 92605, 88125, 139336, 38169, -158320, -201820, -240668, -255159, -225685, -159742, 63155, -101728, -241575, -145478, 16393, 166491, 102626, 784]
15507G84m6934n9775k9358L03648l1252k61253j46592J37355J66349J75780N5102
15496B63854j24818P248p403j10463p309j00441j8485P8878K31566j57318j33215
15485g7906k996J1538P8173p8506l61544L3205M45825P6823l26619M5551J66216
15474I760J93491Q8182r2387j73890q3853R5619p343j02766q0309M5964J25790
15463A8258m9868j18982k0968O7692K8183k2008M0428P125m5822n824q4639J75434
15451a0991J75821j58023j18293O7056n9293Q807l3014P2275M0463r4273q0480
15440a89945K648j06690J6634K07450M9160k6925p5710j51394r6082j05870N8089
15429d18635K42027P5480J54802N8433k48154k21938R8719M0964J03468R327Q8348
$$ y = [784, -46150, -105925, -135283, 168365, 137113, -124140, -270732, -133377, 32972, 208752, 263854, 139036, 146284, 138881, 28418, 21109, -79332, -97817, -18939, 212627, 55309, -77906, -80902, -69364, 8809, -69697, -431241, -398036, 47789, 124612, -202007, -156456, 9760, 203251, 291433, 199046, 25156, -58697, 36922, 29579, -73187, -153496, -107532, 18258, -31610, -150592, -171560, -103868, -75685, -97693, -57265, -50140, -95962, -101786, -186425, -10991, 164830, 6807, -111486, -44430, -103723, -94916, -127930, -55655, -15192, -109465, -189945, -187297, -293987, -277353, -69903, -20743, -47668, -123378, -274772, -370854, -476724, -418635, -176608, -101128, 53674, 112107, -136047, -357985, -259266, -218302, -114834, -105507, -17159]
15418a7159R9715k4596n1208N3257J17501k0237k50433j01267J5624J08247J23366
15407E2810J05757J16304J11285k46896o5046K20920J79647k9143N5708j17998
15397C83348j02439k24490o152p2621j5062j1232k44204J45303K79799N8193M9268
15386B39711k26198k08805N8367R7980q9691O0975k08659J02655J72104l5303
15376c6864k15543j44278L10997L97510j10770M5587k15889j91699R927j87386
15366c38408j84790k3982J17545J14466J12909p6613m8593J04555O4410J12803
15356d5698J46800k0611j21053R3562j4784L8909J08646N5259l0333l428m5206
15345A62063P1091J4664K9149j71996M8826J52175k84791j44894k6892p7854M7719
$$ y = [-17159, 82556, 57960, 6752, 60009, 177510, 157273, -93160, -194427, -178803, -70556, 52810, 158567, 274871, 386156, 139260, 74214, 295134, 474781, 445638, 501346, 383348, 280909, 56419, 50267, -22354, -37416, -48648, -292852, -147549, 132250, 190443, 239711, 13513, -195292, -136925, -38945, -128636, -67661, -276320, -173665, -1561, -36864, -252407, -396685, -85688, 311822, 201052, 246639, 30750, -160949, -151022, -338408, -523198, -547180, -429635, -315169, -202260, -278873, -327466, -222911, -158501, -45698, 101102, 80491, -40562, 53000, 38216, 77125, 185771, 241030, 210697, 207269, 162063, 233154, 247818, 276967, 104971, 153797, 305972, 21181, -123713, -150605, -228459, -180740]
15334a80740J08396O1799J464l4547k73269j62059J57160R6768L0934q2012N8734
15323b17372J31163k6197p811k1184R9539R429L0901N7826n3602L1400r5567J7920
15311d3555P3833J9711j7859p2207l9126p7762R4213J18345M3641N8752R0529
15300B48515K6542j43485j28683J6721j36341k00461j2132K18834Q4706N2464
15290B6680m4013k4111j32865n1895K52937R4177O7225m4226j95805Q5565J43367
15279A77036r0242N2021k3094j02340Q3523q293J995K2647L1907j6901j37856
15268i597Q8510J67558N7435q7688k27785o4256J7865j26154l9277J45359J38717
15257F0687J08629k47954l616L3669O9801J21828n7674k12700l3230J62838K2615
$$ y = [-180740, -72344, -10545, -9081, -43628, -316897, -478956, -321796, -225028, -194094, -276106, -217372, -86209, -112406, -120217, -141401, -41862, -32433, -1532, 56294, 2692, 34092, -61475, -43555, 30278, 49989, 32130, -40077, -79203, -156965, -62752, 55593, 99234, 157986, 248515, 275057, 131572, 2889, 19610, -116731, -317192, -329324, -110490, -25784, 26680, -17333, -41444, -174309, -226204, 26733, 120910, 188135, 143909, -51896, 33669, 177036, 86794, 138815, 115721, 13381, 96904, 88611, 90606, 113253, 145160, 128259, -9597, 78913, 246471, 303906, 216218, -11567, -75823, -57958, -184112, -223389, -78030, 60687, 169316, -78638, -82254, -48585, 21216, 143044, 85370, -127330, -160560, 2278, 24893]
15246B4893r6552j37711n5970P7134l8902k404K1288j31709k75928K66119J90996
15235a58746P5368P8797Q776k75411j72042K52555J34231k52668j03046J86994
15225b25192L3979J38779J7439j10042r3702j18105K36315J68388k23339k03203
15215c78683R5526J78109J42786j29081L328R1349P9562L38427J10193l08391
15205B23125j30508j25387O8364K8742P64j03354p4934J53285K188N7924Q5210
15194A85419q7666K6884j54269j6150M6816R058m0887m9647n4422k28121K43393
15183a19592J33469M5821N773K06066J3671j14643R2131Q5039n8533k22714j58779
15172i2291J45283J69017j84861j20541P3571J61477Q7727o7171j93261j30077
$$ y = [24893, -71659, -209370, -265340, -188206, -227108, -229512, -208224, -339933, -615861, -349742, -158746, -83378, -4581, 4195, -271216, -443258, -190703, -56472, -309140, -412186, -225192, -191213, -52434, -34995, -145037, -238739, -356844, -120529, 47859, -175480, -378683, -283157, -105048, 37738, -91343, -88015, 3334, 82896, 421323, 531516, 223125, 92617, -32770, 35594, 64336, 65100, -38254, -113188, 40097, 42285, 100209, 185419, 97753, 124637, -29632, -45782, 1034, 10092, -30795, -80442, -134864, -362985, -119592, 13877, 59698, 65471, 271537, 285208, 170565, 262696, 347735, 289202, 66488, -92291, 52992, 222009, 37148, -83393, -9822, 151655, 239382, 172211, -21050, -151127]
15162a51127J78682R3636j77599j05066K883J27808J63474j9368j12205j13188
15152a12070O431J41250K55260M9445m8629j14026j85296M269J326L1615L5489
15141F5064k64692J5046K36666J85674k92717k23732m7886n7714J38137K25430
15131b0724R7137R2761K7927M9077L4118K5310N4632p2713j90449l8857o8744
15120a0525J07236m5845l09048j09342K63939J55517M3415k808o1779j19669o0707
15109a49616J92139Q473q1243l417j1582P5714O9161R1619K8623n3051Q6682p5968
15097A77534j36858J416J25336m9772j00450m200j02793r1002m1365Q8432m6857
15086a80579L6869J95325K13528l7615j03228K3245o4136j58168j14307j20419
$$ y = [-151127, 27555, 121191, -56408, -161474, -158591, -30783, 132691, 113323, 1118, -112070, -105639, 35611, 290871, 340316, 291687, 177661, -7635, -3366, -2040, 29575, 65064, -199628, -184582, 52084, 237758, -54959, -278691, -326577, -384291, -246154, -20724, 76413, 169174, 197101, 246178, 280296, 305606, 360238, 287525, 97076, 58219, -10525, 96711, 50866, -258182, -367524, -103585, 51932, 95347, 92539, 30760, -88909, -149616, 42523, 50996, -30247, -33664, -45246, 30468, 99629, 191248, 219871, 166820, 253502, 177534, 40676, 42092, 167428, 117656, 17206, 13006, -89787, -180789, -222154, -133722, -180579, -143710, 51615, 265143, 227528, 124300, 147545, 83409, -74759, -189066, -309485]
15076c09485J40263L38496J45597j54053k06896L4755j8269n825J2006q2230J15535
15065I894j7046o6485j44858J2085K55869K38153j16374l52295o4090M490j5356
15054b56013J41538l8488j0595l7551N3514j398K09903K62590l6345p9383j71203
15043C6569p9530j28537J03116J59378l2474o1061k19428p1190J04082j16019
15033c05094n4639J89309J11516J21364j17235j7157m6804O0768J34373N5316
15023A31717k02677k52134J3272K25645O0955R3277j40610j05182n4884k7193
15013b57814J75790o3876r4024n0036K9895J70372N9100l4417j2275n1198K68338
15002A39855J47320k3999k51478m9292p2868j4576R4779j9924o0174J02810o7362
$$ y = [-309485, -169222, 169274, 314871, 160818, -46078, -11323, -29592, -35417, -23411, -105641, 9894, -7152, -73637, -218495, -206410, 49459, 287612, 171238, -181057, -245147, -240657, -256013, -114475, -152963, -163558, -201109, -147595, -148993, 60910, 323500, 287155, 207772, 36569, -42961, -171498, -68382, 90996, 58522, -2539, -221967, -293157, -189075, -305094, -359733, -170424, -58908, 62456, -54779, -71936, -118740, -57972, 76401, 131717, -70960, -323094, -309822, -84177, -23222, 70055, -70555, -175737, -230621, -257814, -82024, -145900, -239924, -289960, -260065, -89693, -30593, -65010, -77285, -128483, 139855, 287175, 263176, 11698, -37594, -110462, -125038, -30259, -50183, -110357, -7547, -74909]
14991g4909J0188j32274N4800n0018J1274q3902P188J01174n0242j9392K6119
14980a99994R7114j36458j2385J98836P025J65160n3410K5539O3247K00637o9752
14969B85559j57943j24542k02902r1737R5139M540p9833J62189K76774k10407
14959d3163j58394J44800J67320r0440l6913J11264K51028n9738j20681j09704
14949E5379O2183k2792j26058L9045J50845J52229Q4103l8277n5048o6684J30024
14938C64949q2341j05286l8738J36973J08781M3415K6514k41539q8518J7660k83992
14927a42122j26325j888O8467K19450K50139r4619N0422K2816j78662j79323K6375
14916h5270j32458M0623L8937J99584J79181j77582j23704j3746m208R4173l7986
$$ y = [-74909, -64721, -196995, -142195, -192213, -180939, -264841, -257653, -156479, -206721, -226113, -199994, -102880, -239338, -251723, -52887, -45862, 119298, 65888, 91427, 154674, 355311, 285559, 127616, 3074, -199828, -291565, -196426, -191886, -271719, -109530, 167244, -43163, -201557, -56757, 110563, 20123, -16790, 94474, 345502, 285764, 165083, 55379, 117562, 94770, -31288, 7757, 158602, 310831, 394934, 356657, 301609, 234925, 364949, 282608, 177322, 138584, 275557, 384338, 427753, 454267, 212728, 124210, 141870, -142122, -268447, -270335, -201868, 17582, 267721, 173102, 223524, 246340, 67678, -111645, -85270, -217728, -177105, -138168, 61416, 240597, 63015, -60689, -74435, -78643, 15530, -22456]
14905b2456m383K8974K8600r3147K05817J1260n2159k2947j59164j82388l848
14894b65841J3851o5589J58209P213n4081o5828P2168N5640n8024J1580P4392
14883a16310N4303Q0661L5597J35193j52926o9626J1399j90187J10283K63282
14873A61669K42770n025j83054k41616J24785M3953J15342j37006m8024m8311
14863B5483j04253l2991j17774o4642n1533O864J28653K25566K16650J57169j43784
14852B45408j12959J8853k51287j32206N4387K1111M2408L35316J75487k9798
14842C66720j30256q1881K29481M969o8311k74435j52305k00871n8584J37310
14832b28163K03234J33084j75628m0067j6780J06551r3221Q3899P1426R2207k959
$$ y = [-22456, -26839, 2135, 30735, -62412, 143405, 154665, 102506, 79559, -79605, -261993, -265841, -251990, -317579, -159370, -152157, -206238, -272066, -199898, -144258, -202282, -190702, -116310, -62007, 18654, 54251, 189444, 36518, -33108, -21709, -211896, -101613, 161669, 404439, 399414, 216360, -25256, 99529, 143482, 258824, 121818, 73794, 25483, -78770, -111761, -229535, -294177, -345710, -338846, -210193, 15373, 232023, 389192, 245408, 132449, 151302, -99985, -232191, -177804, -156693, -114285, 221031, 396518, 366720, 236464, 154583, 384064, 389033, 320722, 46287, -106018, -306889, -365473, -228163, -24929, 108155, -67473, -107540, -124320, -17769, -110990, -27091, 44335, 136542, 133583]
14821A33583r8647J36379J2515r3991P6214Q6935R757k9709l6603m7377j36908
14810A2148k5625j45719k3440J39188j09580j31317K9534q1040K3839K79306K2390
14799a0316k35483r5104J99755K6946J454J19143r0315l1477N5906O4526P1035
14788G6070M8685P7616L5353o9805k98286j44462M2098K31857L469j52016r7111
14777b46532l3555R499Q7125J16262J59008m23j38534J88249j4277r0608N4487
14766I0701K5379L4606o5772p2136j04988J12110J7661K4167j8863L1276m6628
14755B7513N0480J78714j74161j66675j20135m4294l2519K00347J11046P0206
14745A00522J39068j10502J9959j21576j98609P2590j09286o0986J34603N664
$$ y = [133583, 34936, 171315, 183830, 89839, 166053, 252988, 262745, 233036, 196433, 149056, 12148, -13477, -159196, -182636, -43448, -153028, -284345, -254811, -335851, -312012, -32706, -10316, -245799, -340903, -141148, -114202, -112748, 6395, -83920, -115397, -59491, 5035, 76070, 124755, 202371, 237724, 167919, -130367, -274829, -232731, -874, 2595, -149421, -246532, -280087, -270588, -183463, -67201, 91807, 91384, -47150, 141099, 126822, 36214, 90701, 116080, 150686, 84914, 12778, -92210, 19900, 37561, 61728, 42865, 74141, 27513, 77993, 256707, 82546, -84129, -204264, -248558, -281077, -80730, 30316, 100522, 239590, 129088, 149047, 27471, -171138, -98548, -207834, -268820, -134217, -128553]
14735a28553P0185n6673j50505o5938l7790J76383K89923p0364j90771J35336
14725b8767K32486q013j27118j36558j53226q0297J81472R0238j657J14032j33589
14714e0997l34950o4220o5831p6843J28762J59904J44063Q0628R8695r842J4856
14703B4225j01246l19441J481K47493k4183m0814j53296J23583J31696L81R0495
14692a9626Q6155m5086n3649j18814q511p8935K49546J87837j86405k75522J26936
14681a36074q0061k19688J16567J78283l6574P227M2621J8902J58003K05097j9145
14670B35158m5893r4996O4q4914j15799j11926J17115J76025j51394p6967k1122
14659a74649j5142R3948J71706L17096J59577j59973o6114j84682j06191k1706
$$ y = [-128553, -58368, -115041, -265546, -331484, -369274, -192891, 97032, 26668, -164103, -28767, 203719, 195706, 68588, -67970, -221196, -301493, -120021, -29783, -31440, 82592, -50997, -385947, -450167, -515998, -592841, -464079, -304175, -160112, -79484, 19211, 9369, 24225, -77021, -396462, -394981, -147488, -171671, -212485, -365781, -242198, -110502, -110121, -19626, 66529, 21443, -32206, -151020, -159531, -238466, 11080, 198917, 12512, -263010, -136074, -216135, -435823, -319256, -140973, -177547, -170320, -127699, -108797, 49206, 254303, 235158, 189265, 94269, 94333, 9419, -106380, -218306, -101191, 74834, -76560, -153527, -174649, -189791, -95843, 75863, 392959, 552536, 392563, 326449, 141767, 35576, 13870]
14649A3870N2537R4511M5641l7233j27732R6451N5596O0835N6741J3811n0289
14638B74739r0317K2025j53899j13469M7108L5067m7262j54775J9752K0872N7845
14627h2314o079j70809p4827J06432N4915o8845L8894j5812M8579o7887R5833
14616a41920P8744n7250L8148J42280J79185O9010o5664L6526j11796j76778p0709
14605h0224Q2149L6430R9602q1027M0116j8035j28998r0462m2451K69141Q5839
14594A72080l00056N2623J27005p3253j66577O8533J57513Q8483k8145K1517m8635
14583G1088j49739k16124J1144J86812J15432j48084k9764K70957J16267l2188
14573A95801M8725j36259j35080k2052m1610j11942N6592J58334J14290J4469
$$ y = [13870, 66407, 160918, 206559, 169326, 41594, 138045, 193641, 254476, 311217, 325028, 274739, 184422, 206447, 52548, -60921, -13813, 21254, -26008, -180783, -161031, -140159, -82314, -88393, -259202, -334029, -227597, -172682, -241527, -202633, -218445, -169866, -237753, -141920, -63176, -120426, -82278, 60002, 239187, 308197, 242533, 279059, 167263, -9515, -80224, 1925, 38355, 137957, 56930, 97046, 79011, -49987, -140449, -182900, 86241, 172080, -127976, -75353, 51652, -21601, -188178, -119645, 37868, 126351, 98206, 119723, 71088, -78651, -294775, -283631, -96819, 18613, -129471, -159235, 111722, 227989, 195801, 244526, 108267, -26813, -48865, -90475, -202417, -145825, 12509, 126799, 141268]
14563A41268Q5473j46024p9909j51113l1189P1769j92661n4468J59072J40543
14553e7239j06939k0041K7481n3413l6285Q283j3037j32112J98007K41165J11420
14542A67290j47904m7109p2637j64560J72216J47564M9121k09987J1784P4669
14532a9553j0197j87314l6153K78132l2724m8894R8196l2748j4741J29768N2633
14521A76405q3885k01431Q7352J19092o5321j1740k01718J04900J74853j56325
14511e7818p8219K81570m1126J11549L349l34575o8443r8722k04094L3404J47179
14500c05946L488k7864K30222J02924J77055l8184R1943m2148k15198J15010J63672
14489B54974j08885N4784O5744n952r3901o353p7009M6497p6698r7765J13511
$$ y = [141268, 226741, 80717, 808, -150305, -181494, -109725, -302386, -356854, -197782, -57239, -164178, -184219, -156738, -210151, -246436, -238153, -251190, -383302, -185295, 55870, 167290, 19386, -27723, -100360, -264920, -92704, 54860, 103981, -106006, -94222, -19553, -29750, -217064, -253217, 24915, -7809, -56703, 41493, 8745, -5996, 123772, 176405, 92520, -108911, -21559, 97533, 32212, 20472, -181246, -76346, 98507, -57818, -136037, 145533, 104407, 215956, 219305, -115270, -183713, -282435, -486529, -453125, -305946, -302458, -330322, -100100, 2824, 179879, 141695, 233638, 191490, -23708, 91302, 254974, 146089, 200873, 266617, 260665, 166764, 160411, 83402, 129899, 53201, -44564, 68947]
14478F8947J51289l3916K0077J1218k9562p3540k09907j31032j1324o1638j50409
14467d49797P6561R9249J34758R2460R5920j25372q9248r3525J0543j12674m1347
14456d02472N6184O7302Q4082J4653J47875J21405K8870k7585N797n2685K1903
14445F5329j54011O9303J38532k11399m2891P8493P8253l0955j91176j7673M7896
14434a70299J29668K65980n2207P7547m8545k31891j58395o4959k0040J61833
14424a11308J71682J52784N953j44447k14682l45466j12227L4624L5425R9196
14414d28466Q6991J37849M6200J88228N4310J0006j12376M3114l0319j06019J17745
14403G263M2261M9371n2980k0117j04332n8651l1339N108L3643j8096r7440k054
$$ y = [68947, 220236, 186320, 206397, 217615, 188053, 114513, -95394, -226426, -237750, -299388, -449797, -373236, -273987, -139229, -46769, 49151, -76221, -165469, -258994, -248451, -361125, -402472, -346288, -278986, -194904, -180251, -32376, 89029, 117899, 90314, 96111, 43426, 65329, -88682, -19379, 119153, -92246, -135137, -56644, 21609, -9346, -200522, -218195, -170299, -40631, 225349, 173142, 250689, 202144, -29747, -188142, -253101, -273141, -111308, 60374, 213158, 219111, 74664, -140018, -485484, -597711, -563087, -527662, -428466, -341475, -203626, -157426, 30802, 85112, 95118, -17258, 25856, -4463, -110482, 7263, 49524, 98895, 45915, 25798, -78534, -137185, -168524, -163416, -129773, -147869, -245309, -247363]
14391b47363J51722o4629r1167P1686O1756K1651L1815J14269L9316j73826J35088
14380E0318j54647j09939N0779Q7693N4418j05160M5930m6321P8707K16111l127
14369A64762k45023j07461j65877q6593J03756J76227J17029R0045J32981N0006
14359B29852j01789l8118j3278J5017Q2620J3287j99959m7754M3355p2809j16637
14348b06213J5889m8453j3563J05386J15851p2444r8440k2905k6508n5179O2539
14337b44040J47778J22833q1253L8019J44657k5744q6291m9564J69862K5557K9294
14326A91108j42757p8198k011r3024J69268M9105l19237q2652K05651P1724L3399
14315B376j08378n3724J11342P0271k05313J1321J62751J14099L1731k33578j41026
$$ y = [-247363, -95641, -160270, -251437, -179751, -117995, -96344, -64529, 49740, 89056, -84770, 50318, -104329, -214268, -163489, -75796, -21378, -126538, -80608, -126929, -48222, 167889, 164762, -80261, -187722, -353599, -440192, -336436, -160209, -43180, 46865, 179846, 229852, 128063, 89945, 76667, 91684, 174304, 187591, -12368, -60122, -16767, -89576, -206213, -190324, -238777, -252340, -146954, -31103, -103547, -201987, -224892, -251400, -306579, -244040, -96262, 26571, -54682, -16663, 127994, 102250, 15959, -33605, 136257, 161814, 191108, 48351, -29847, -31858, -124882, 44386, 93491, -225746, -308398, -102747, -31023, 2376, -106002, -159726, -48384, 21887, -183426, -172105, -9354, 104745, 136476, -97102, -238128]
14304b38128l9739J12238J06302J77786J00586j11397P308k4865O1954K25332
14294C77377j18371k15863J6893J01274q4560O7051k06697j06909N2160m0649
14284a58294o3611K62566J67298p4057j31314N4197j38898j0031j76600k6020
14274b94764J71107J64391j95581O6920J7635R5811J28904k72733k9953R5050
14264e3213r8425p604L8203p7725n0775q670J6784P4167J82449P3900k19654o3076
14252a93639K54181l235J59676j39104j73650r8826J54223m036M6783J23787M9916
14241A76076l6098m4358n3424l0250J85454o1678j21173n5819j16065o2286P5900
14230a43721Q3108J09234j37657K3026O3301l7924j72601o4416J67481K17292
$$ y = [-238128, -277867, -165629, -59327, 118459, 219045, 107648, 114956, 90091, 152045, 377377, 259006, 43143, 60036, 161310, 76750, 143801, -62896, -169805, -117645, -158294, -221905, 40661, 207959, 133902, 2588, 56785, -82113, -92144, -268744, -294764, -123657, 40734, -154847, -87927, -70292, 25519, 154423, -118310, -148263, -53213, -151638, -159242, -121039, -198764, -249539, -258209, -241425, -167258, 15191, 89091, -130563, -193639, 60542, 57307, 216983, 77879, -95771, -194597, -40374, -44410, 2373, 126160, 176076, 139978, 95620, 42196, 11946, 197400, 135722, 14549, -41270, -157335, -219621, -143721, -60613, 48621, -89036, -66010, -2709, -40633, -213234, -277650, -110169, 107123]
14220A07123K118p7168J15346J50961k6248o889j66126o4383K2816k40114l860
14209a86424J31625k6692j87436O0073l930L6562N1295Q7968J6312K8742N5531
14198F3626j12933j5902o3466m5208j71716J3547J40739J62055J27211p4820k90375
14187b67242K1798K68638O9411l2064r05j43593m8937j03170j59973L1769L08608
14176e5660Q7323j85453m4442J05585P3442r250K3016q6147q0214K04485J07397
14165A40082k415j53806r2820L6459K21946R4696m1469l8191j97347k30080P4696
14154a88249k9774R450n6234J7872k3553K05771M2391n7517J45077R3608r1291
14143F7551o1071o10k005N4950j76477K5442J04743J02804p5889j94746Q8329
$$ y = [107123, 109241, 32073, 147419, 298380, 272132, 265243, 99117, 34734, 57550, -182564, -186424, -54799, -81491, -268927, -208854, -212784, -176222, -124927, -36959, -20647, 8095, 63626, -49307, -65209, -128675, -173883, -345599, -332052, -191313, -29258, 97953, 23133, -267242, -245444, 23194, 92605, 60541, 59636, -83957, -132894, -236064, -396037, -364268, -55660, 31663, -153790, -198232, -92647, -19205, -28455, -5439, -91586, -171800, 32685, 140082, 137667, -16139, -108959, -72500, 149446, 244142, 202673, 164482, -32865, -262945, -188249, -218023, -208573, -264807, -246935, -270488, -64717, -22326, -79843, 65234, 158842, 67551, 6480, 5870, 3865, 58815, -117662, -92220, 12523, 115327, 39438, -155308, -66979]
14132f6979J36208L5938m1463J50602Q1988j99792l8683k4450j94978Q1060K80139
14121A99590k11653k57125K0384K22179L1839p8198R990L4152k4419J1067J26003
14110H3809J00263o6978P2827R299j52699r8988r127J52737K20786K339j58555
14099A55713j34902k76332r4544Q5000Q4483j727l4869J61498m689R6513K0858
14088E7002r9574J09909k0460j21454P7379j4914l3200K0242J59276R4209l74677
14077a46262n7926J50963L7522q7088r6816K05323P8018R0464J45073j6283l01274
14066A714n3927O5643J7023j49585J24010n1763N5641j6819j75016O6049j001
14055a18031j7380n6468n4648k07235O472K67386J37925O1448r5147m7219j65454
$$ y = [-66979, 69229, 105167, 63704, 214306, 296294, 96502, 57819, 33369, -161609, -80549, 199590, -12063, -269188, -248804, -26625, 5214, -72984, -62994, -28842, -53261, -42194, 83809, 184072, 117094, 189921, 199220, 46521, -52467, -61594, 91143, 311929, 314268, 155713, 20811, -255521, -350065, -265065, -180582, -182309, -217178, -55680, -60369, 36144, 57002, -42572, 67337, 46877, -74577, 2802, -12112, -45312, -25070, 134206, 228415, -146262, -204188, -53225, -15703, -102791, -199607, 5716, 83734, 174198, 319271, 302988, 1714, -52213, 13430, 30453, -119132, 4878, -46885, 8756, -8063, -183079, -117030, -118031, -135411, -191879, -246527, -453762, -447290, -179904, -41979, 19469, -75678, -122897, -288351]
14044b88351J20919O7505M706J43826Q9660N2300m2041j14737j27858J44229K56691
14033C06849P5652k6282n832j58241k6652l0354k12067J50507J44841m9931p8583
14022H9907j63017O3946k0562j10428J41912K0296j43264l6729K7042K71646K9299
14011A70048k8400m7156P0948N7979j9151R8956j83467j37552N6554n249q6436
14000e2926o727K0262J09315O0067O2823j539k59535j01316J19304l0995p8843
13989a60110j1789J41936K95850l444j97253j05284P3079k9874j41426o0825K2964
13978a76176Q5118R1140j2409K9226L3193j88755N1651J52098o128j62430p3911
13967a77383n6217l7867K30539Q9212k63778m9543k7076R3396Q9701l4203Q7164
$$ y = [-288351, -167432, -99927, -95221, 48605, 138265, 190565, 148524, 33787, -94071, 50158, 306849, 382501, 356219, 350387, 192146, 165494, 135140, -76927, 73580, 218421, 168490, 89907, -73110, -9164, -29726, -140154, 1758, 22054, -121210, -157939, -130897, 140749, 170048, 141648, 94492, 165440, 223419, 204268, 303224, 119757, -17795, 38759, 33510, -52926, -59653, -39391, 69924, 129991, 192814, 191275, -68260, -169576, -50272, -81267, -160110, -171899, -29963, 265887, 262443, 65190, -40094, 32985, 3111, -138315, -199140, -176176, -91058, 82, -12327, 16899, 50092, -138663, -87012, 65086, 58958, -103472, -177383, -233600, -271467, -40928, 48284, -215494, -265037, -292113, -198717, -109016, -143219, -56055]
13956e6055J40857L0326l4339M0662Q4756n7154q7072j46920l3116P3879j98884
13945b43060m9817J26625J93466M3556p2884j97977R1042J22268J05038n3067
13935F5190L2780P0286O2166r8122l28791j18924O9769q003K48425J31646r4656
13924C1766q9992o2474O7294r4403J96723J04376j31233j35926M7259O2119N7883
13913E3392K84492j11696j53298J59800L9374o1800j21924q0151m9009J35683
13903I4863J68127P1159p1281j08920q7220l5506M3083p4968K21752N7058l54435
13892g6288J3532Q4193L1562o4261j7413l1199J72371P5331k21984r0359N6383
13881f8132M5972J31328J03031j11633P6826j75224j97822l3651P2662q691J74454
$$ y = [-56055, 84802, 115128, 80789, 121451, 206207, 149053, 61981, -84939, -118055, -44176, -243060, -292877, -166252, 27214, 70770, -2114, -200091, -109049, 13219, 118257, 65190, 97970, 168256, 230422, 132300, -196491, -315415, -245646, -253649, -5224, 126422, 31766, -58226, -120700, -53406, -147809, 48914, 153290, 22057, -113869, -66610, -4491, 53392, 337884, 226188, 72890, 232690, 272064, 210264, 88340, 8189, -40820, 94863, 262990, 334149, 262868, 153948, 66728, 31222, 74305, -663, 221089, 278147, -76288, -62756, 21437, 52999, -11262, -28675, -59874, 112497, 187828, -34156, -124515, -68132, -22160, 109168, 212199, 100566, 177392, 2168, -195654, -229305, -156643, -165334, 9120]
13870I120N8961o2025J4415n397j8993J47003K12227P444j95062j52552J78388
13859A93529j44371j61365J11039K1508j31121j94312J74657j33922J41695J88597
13849F5934Q4652N1229k52836p1794J4138J78719Q0270n8477J31268q134p4016
13838A40953j40690Q414P1703j59147k06718J9208j31728P1957K5771n7508J91104
13827a66681m2680P696j0013K36828J96940n0196p055p6047p292J15353K9541
13816B26394m6116k29400l30624j10185J47061J9565j50610L2841L07953J73706
13806D0585L6659M5530j49408k3280N5345P553j1597p435j47266J91512J06995
13795A45193k6420n5780R6984q687R393M9149j91573j94696l4633K14395r5766
$$ y = [9120, 68081, 6056, 20471, 15074, -3919, 143084, 355311, 362755, 167693, 15141, 193529, 49158, -112207, -1168, 20340, -110781, -305093, -130436, -264358, -122663, 65934, 150586, 201815, -51021, -122815, -108677, 70042, 150312, 91835, 223103, 214969, 140953, 263, 8677, 80380, -78767, -285485, -266277, -398005, -326048, -300277, -357785, -166681, -209361, -201665, -211678, 25150, 222090, 171894, 164839, 88792, 81500, 196853, 226394, 180278, -49122, -379746, -489931, -342870, -323305, -473915, -441074, -133121, 40585, 77244, 122774, -26634, -49914, 5431, 12984, 1387, -6048, -153314, 38198, 145193, 118773, 62993, 159977, 151290, 160683, 209832, 18259, -176437, -211070, 3325, -92441]
13784i2441j37056o2385J1429J56025O181J31229J00536m0114k70031J7859Q6087
13773i2681N2890J29336m3713r7497M2678Q5434k27754p1456p4431N2091q9272
13762c34375P3123l592p1436n9180M5387O1533Q5510J21401J62337O3198j33201
13751A0705J36890M722p4111M3036J75496r0678L1459j2238j34687j5398L3179
13740A08375j78174L20516J77238O748m91101j88364k3504J59120K19846j21256
13730a0556K3927K6611J809l1900J04795o4053Q8019l2648k90845K17289P6737
13719A09185j09706o841m1923o1504j25482j00399M7184P3267K88497k7397K4639
13708F9520J6857k1362p1664n6501j90817L9004p2726K584J32701P5271k7351
$$ y = [-92441, -229497, -291882, -280453, -124428, -118247, 12982, 113518, 73404, -196627, -178768, -92681, -39791, 89545, 45832, -51665, -8987, 76447, -151307, -222763, -297194, -245103, -334375, -261252, -264844, -336280, -395460, -350073, -288540, -203030, -81629, 80708, 143906, 10705, 147595, 152317, 78206, 121242, 296738, 206060, 237519, 225281, 90594, 75196, 108375, -69799, 250717, 427955, 434703, -56398, -244762, -268266, -109146, 110700, -10556, 13371, 39982, 41791, 9891, 114686, 50633, 138652, 106004, -184841, 32448, 109185, -521, -7362, -49285, -110789, -236271, -336670, -289486, -216219, 72278, 44881, 69520, 86377, 65015, -6649, -63150, -253967, -214963, -287689, -285105, -152404, -77133, -104484]
13697a04484j15559o3668m4406O8738L5111K0421N5576L26211M615q787j8968
13686A54800j40403o8609j52760P485P4136o6044j24176J44180K09044J986q1247
13675d1608K22346J73540N6270r0607j90323k11638n9420J1283J18331K4174r6794
13664h4446j32699J9104r6173k1176J27298M0747M8122m433J10388P5347M6925
13653A29004P4665o6465M5880K2620k5227K5773l16666j29744J49174N2408K18020
13642A79442j72263r4125R7244J2406j84711p1205J61571o9463j6112j8787R820
13631a66183K51301k26702j16677p8840J76785J70392k36314Q5530L28870J35440
13621C23602M9844n666j0561j73594j50980l8102J1374J04004j8951j83785j01430
$$ y = [-104484, -220043, -283711, -328117, -259379, -224268, -203847, -148271, 177940, 182555, 173768, 154800, 14397, -54212, -206972, -199487, -125351, -191395, -315571, -171391, 37653, 39639, -41608, 180738, 354278, 410548, 319941, 129618, -82020, -141440, -130157, -11826, 12348, -84446, -217145, -198041, -294214, -315390, -188092, -147345, -99223, -103656, 6732, 82079, 129004, 203669, 137204, 183084, 205704, 180477, 206250, -110416, -240160, -90986, -38578, 179442, 7179, -86946, 10298, 22704, -162007, -233212, -71641, -141104, -157216, -176003, -166183, 85118, -141584, -258261, -337101, -160316, 10076, -226238, -140708, 188162, 323602, 373446, 367780, 357219, 183625, 32645, -5457, 5917, 109921, 90970, -92815, -194245]
13610a94245j40327L6791J33592N4282q1737m244j58501P1807J33993j21943J75603
13599i4929K15126M2452J23831Q8894J81605q7755p7976k50218j49918J0817j01727
13588i9798k7712J75641J77780N2601p8715j48405j38559J39208K4681q2738J92978
13577A86962O0037j05997M743r0960J15080P8151q4421r2233k4510Q2684J04312
13566B33848j3892n610Q1393j06469k4130J87147L0182k2627m0145o8435L5993
13555B87255p2553l44585J4467K96457P877M0819J0331o6201O0676K9676p4004
13544A90215j85941J58328M47527K60536p46J91815p9793j60526m2703n6746m1284
13533F80682J33144O431j89183L4481J22931K8462m7327k5687k2520K3356P6525
$$ y = [-194245, -334572, -297781, -164189, -109907, -191644, -195888, -354389, -282582, -148589, -270532, -94929, 120197, 162649, 286480, 375374, 556979, 469224, 391248, 141030, -8888, 1929, -99798, -127510, 48131, 225911, 278512, 199797, 51392, -87167, 52041, 76722, -6016, 186962, 246999, 141002, 145745, 54785, 169865, 248016, 163595, 71362, 46852, 129536, 233848, 219956, 214346, 295739, 189270, 165140, 352287, 382469, 359842, 319697, 251262, 287255, 214702, -129883, -115416, 181041, 188918, 229737, 240068, 173867, 234543, 264219, 190215, 4274, 162602, 610129, 870665, 869919, 1061734, 981941, 821415, 778712, 721966, 680682, 813826, 820257, 631074, 665555, 788486, 816948, 769621, 743934, 721414, 744770, 821295]
13522H21295n9387k28699J5817N1071J80960r090j51984J36101J34652k6858L5857
13511H99735r5477q7496k08718m417K29914J29342k69273o047O6991j22835O693
13500E38412p4947k60883j59380Q2664J4684L9945J67080N590J32098j07703k82014
13489I5546j7831k8773l5752k8760J6258M1951R825N8731j15796k34749l6874
13478b76224o9817J10756J13754o7425r4632O2924J01439q4621N4224r777R8999
13467f0400R103k23756J02215R1001Q6572J10028o9593j10661o1372K16305j14107
13456b4665q4883l496j47537l4450J71952J33456L57608p0084k51350j73946J3974
13445a13421L1710l7079q1340J06747N564R8194Q9042P4423j67025p965j3456
$$ y = [821295, 761908, 533209, 549026, 600097, 781057, 771967, 619983, 756084, 890736, 863878, 899735, 804258, 716762, 508044, 503627, 733541, 862883, 593610, 587563, 654554, 531719, 538412, 463465, 202582, 43202, 125866, 140550, 180495, 347575, 353165, 485263, 377560, 95546, 77715, 48942, 13190, -15570, 688, 42639, 52464, 111195, -4601, -239350, -276224, -346041, -235285, -121531, -188956, -283588, -220664, -119225, -203846, -149622, -159399, -60400, -51297, -275053, -172838, -81837, 4735, 114763, 45170, -65491, -126863, 89442, -24665, -109548, -113044, -260581, -295031, -123079, 10377, 367985, 297901, 46551, -127395, -113421, -81711, -118790, -200130, -93383, -87819, 10375, 99417, 173840, 6815, -1150, -14606]
13434a4606Q5930J6101l1367q7385J58018m4129j68057p6251K35096J14216q5917
13423A01649J01374L5519l1221j00725j72380K2397L4465j21286M8606K0339q153
13412f9416J35527l6888m9750J76422K32641j07321j87915l8232o8113K049M554
13401f442j99885J9303O7715Q4447J64069J42329P4586n1087o4316q5159K2751
13390A68311p00j198l1894P5037k02114l03161J45937R4128K0043J77438J2336
13379A54163m9863K0199j0870J21013p7439n6844J3342k27955j97728L23424L3923
13368D5365P7880N2298q2764R8094J32219p6442K8925k4370j9271q0596j1746
13357A39592p5778q371J9934l1923j19585R5191M6302j2114j19837O1865N3756
$$ y = [-14606, 71324, 87425, 56058, -31327, 126691, 82562, -85495, -161746, 73350, 187566, 101649, 203023, 238542, 207321, 106596, -65784, -43387, -8922, -130208, -81602, -61263, -69416, 66111, 29223, -20527, 155895, 388536, 281215, 93300, 55068, -13045, -10996, -6442, -206327, -187024, -119309, -34862, 129207, 271536, 346122, 295035, 230719, 145560, 168311, 167611, 166413, 134519, 209556, 7442, -295719, -149782, -55654, -35611, 141827, 154163, 104300, 124499, 113629, 234642, 157203, 100359, 113701, -114254, -311982, 11442, 45365, 123245, 175543, 92779, 190873, 323092, 246650, 275575, 251205, 231934, 151338, 139592, 63814, 55443, 75377, 43454, -76131, 19060, 65362, 53248, -66589, -4724, 49032]
13346D9032r5466O6799r2975l6593M5613o5708K00704J05291J62089K16454l2709
13335E22531o0391m3852p8472k7576m1073j17829J60117m7867o474O443J9303
13324B84860k7324k02756j37115J26678L70137M1213k14589K0458O4362n6392
13314B69532J3921m8094J85257J42894q8642k16128k36759J1762K04424K05395
13304D43562l3091P5769j84799k9424J3577J4639Q6499j25600j54869J13215J00120
13293C19598J18012j23702n9687k97136j31916N6259O7275Q9212J94750J25411
13283C58076J06677k9437k02788l3220L1989k59497o4709J36745j10231k2189
13273h8584P5838J23421P7877l1990n9911l0090J40387J59586R3359p0255k22332
$$ y = [49032, -46434, 20365, -72610, -109203, -63590, -129298, 71406, 176697, 338786, 555240, 522531, 462140, 418288, 339816, 312240, 271167, 153338, 313455, 265588, 259114, 265557, 284860, 257536, 54780, -82335, 44343, 414480, 455693, 241104, 261562, 325924, 269532, 283453, 235359, 420616, 563510, 474868, 258740, 21981, 33743, 238167, 443562, 410471, 486240, 301441, 272017, 285594, 300233, 386732, 261132, 106263, 219478, 319598, 437610, 313908, 254221, -42915, -174831, -118572, -51297, 37915, 232665, 358076, 464753, 435316, 232528, 199308, 231297, -28200, -92909, 43836, -66395, -88584, -12746, 110675, 188552, 156562, 96651, 66561, 206948, 366534, 459893, 389638, 167306]
13262A67306j25896p1621J8101j61803j41499M3629J15562K14090R795j10933
13252d3269k15051O3023J57410J32804j3849L6804J42640m3630K24891o8050k20688
13241A53035m9306l5007J49564L7712r0342O5296N3156O5316J50685j57363j44809
13230A97937k53440m6764M9330j6910q5660p5031j3347J08214R6318J30477K7382
13219A18506m0834l5399J52657O7037L2667j45315J25420J15618j16397m0269
13209B33691K5556J07952K26223j2555K4972J9915n9629j09413j69581O3562P4387
13198D25080j30450M9203n2180J41580j5685R9741N877m1836m9261j05072m3876
13187B83121j3744p9960J75264M2107q1073Q9763N0953Q8596N1097J4566m9456
$$ y = [167306, 41410, -30211, -12110, -173913, -315412, -271783, -156221, 57869, 67664, -43269, -258320, -195297, -37887, 94917, 81068, 117872, 260512, 216882, 441773, 373723, 153035, 103729, 68722, 218286, 255998, 165656, 230952, 284108, 349424, 500109, 342746, 197937, -55503, -102267, -52937, -69847, -155507, -230538, -243885, -135671, -39353, 91124, 118506, 77672, 42273, 194930, 261967, 294634, 149319, 274739, 390357, 273960, 233691, 259247, 367199, 593422, 580867, 605839, 625754, 566125, 456712, 287131, 350693, 425080, 294630, 343833, 291653, 433233, 417548, 517289, 523166, 481330, 432069, 326997, 283121, 269377, 189417, 364681, 406788, 325715, 415478, 466431, 555027, 606124, 620690, 571234]
13176E71234J3359K60839j41035j60033k7569J69353O3067j02253j78918j35964
13166C32080R5380K33949J37113k6941O6703j78505n7035J06613K8471J38681
13156H76509j2246P3194J35492k4806Q0474K4749J42046j50872J2538J8559J95415
13145A371052K93601J689n4043K05880K43015J66743K10799K77036K56153L55875
13135C327800L23616M59587L94393M60887O21927O07076O25360R29859J254409
13126I004914J213245J307789J365590J390615J268295J451412J170125J023176
13118A9195161R28610R25427Q26119J088453J536554J782552K228237K905915
13110C1417028L302922L792823L991086M380538M585731M445033L900158L370367
$$ y = [571234, 584593, 845432, 704397, 544364, 516795, 686148, 749215, 646962, 468044, 332080, 427460, 661409, 798522, 771581, 838284, 659779, 602744, 709357, 737828, 876509, 864263, 937457, 1072949, 1048143, 1128617, 1153366, 1295412, 1144540, 1157078, 1175637, 1371052, 1664653, 1666342, 1612299, 1818179, 2061194, 2227937, 2438736, 2715772, 2971925, 3327800, 3651416, 4111003, 4505396, 4966283, 5588210, 6195286, 6820646, 7750505, 9004914, 10218159, 11525948, 12891538, 14282153, 15550448, 17001860, 18171985, 19195161, 20123771, 21049198, 21875317, 22963770, 24500324, 26282876, 28511113, 31417028, 34719950, 38512773, 42503859, 46884397, 51470128, 55915161, 59815319, 63185686]
13102F3185686K874477K333124J852075J456142J063495J356331J113132J502600
13094G6737062K143087K656072L180013M209966N119777N233540N499298N487568
13086A10266383N378616M825247L852198K967649K016929N52446n77764j713058
13078A27568646k093552k472596k791602k194572j577448o42214N27702J403275
13070A17727639K198548L130808L440745L370565K559864J624688O17294q01909
13062A33868242k529397l955916n049404n736282o379960o306719n897441n069501
13054I2943622m423864l340176k184843j426650q09789k16071n1435j81601n34893
13045G9774300j187900j910378k783713l438502m091686m841768n011052n271359
$$ y = [63185686, 66060163, 68393287, 70245362, 71701504, 72764999, 74121330, 75234462, 76737062, 78880149, 81536221, 84716234, 88926200, 94045977, 99279517, 104778815, 110266383, 115644999, 120470246, 124322444, 127290093, 129307022, 129859468, 129281704, 127568646, 125475094, 123002498, 120210896, 118016324, 116438876, 115796662, 116324364, 117727639, 119926187, 123056995, 126497740, 129868305, 132428169, 134052857, 134670151, 133868242, 131338845, 127382929, 122333525, 116597243, 110217283, 103910564, 98013123, 92943622, 88519758, 85179582, 82994739, 81568089, 80758300, 80542229, 80490794, 80309193, 79774300, 78586400, 76676022, 73892309, 70453807, 66362121, 61520353, 56509301, 51237942]
13037E1237942n052994m535503l892722l263575k726135k131094j601691j119207
13029B6915021p43428o10610p08516p37515p48885r90522j532576j808538j991217
13020A7043214j779236j695007j683302j485236j205317j112052j019387p61571
13012F302106n07587n34529n06840m26793m54081j57541j27566k00210j97558
13003C189401m06827k92651k05932N4138O5095k9977j07664k37342P7693k02407
12993A903527j71402j64811M4788J8403m0119O7625J24498r6348k70374k49072
12983A166715k01932k23752o5310m9794K21612J22036n4502K24050R1523n898
12973A224748j05724l56165m6014J57307K1298k56924k31183l1217J34014J0585
$$ y = [51237942, 46184948, 41649445, 37756723, 34493148, 31767013, 29635919, 28034228, 26915021, 26171593, 25560983, 24852467, 24114952, 23366067, 22375545, 20842969, 19034431, 17043214, 15263978, 13568971, 11885669, 10400433, 9195116, 8083064, 7063677, 6302106, 5794519, 5259990, 4753150, 4326357, 3872276, 3714735, 3587169, 3386959, 3189401, 2782574, 2489923, 2283991, 2338129, 2403224, 2373247, 2265583, 2028241, 2105934, 1903527, 1732125, 1567314, 1612102, 1630505, 1590386, 1658011, 1782509, 1686161, 1415787, 1166715, 964783, 741031, 675721, 625927, 847539, 969575, 915073, 1139123, 1230646, 1224748, 1119024, 762859, 716845, 874152, 895450, 638526, 407343, 376126, 510140, 520725]
12963E20725K09686K05091k71651j01178p9777J04430J33988l9952J58146J50017
12953I89525j24940k03269l1096o0615L438J8752m3246j28900o6109k03556q811
12942A41173J66391L04736J8305j58160J9636j1630L7768J54864j13281j57320
$$ y = [520725, 730411, 935502, 663851, 562673, 482896, 587326, 721314, 681362, 839508, 989525, 864585, 661316, 630220, 569605, 573043, 591795, 548549, 419649, 353540, 149984, 141173, 307564, 612300, 630605, 472445, 492081, 480451, 518219, 673083, 559802, 402482]
$$ [...]
##END NTUPLES=NMR SPECTRUM
##END=
