##TITLE=Analysis number 315179
Compound Code btb 10371
Project Code adrs
Chemist Name hajos
##JCAMPDX= 6.0         $$ Bruker NMR JCAMP-DX V2.0
##DATA TYPE= NMR SPECTRUM
##DATA CLASS= NTUPLES
##ORIGIN= Bruker BioSpin GmbH
##OWNER= NMR
$$ XWIN-NMR		Version 3.5
$$ Thu Nov 10 11:23:41 2005 GMT Standard Time (UT+0h)  MAYBRIDGE\NMR@NMR_250MHZ
##.OBSERVE FREQUENCY= 250.131544655141
##.OBSERVE NUCLEUS= ^1H
##.ACQUISITION MODE= SIMULTANEOUS (DQD)
##.ACQUISITION SCHEME= undefined
##.AVERAGES= 16
##.DIGITISER RES= 18
##SPECTROMETER/DATA SYSTEM= dpx250
##.PULSE SEQUENCE= zg30
##.SOLVENT NAME= DMSO
##.SHIFT REFERENCE= (INTERNAL, DMSO, 0, 16.522)
##AUDIT TRAIL= $$ (NUMBER, WHEN, WHO, WHERE, WHAT)
$$ ##TITLE= Audit trail, XWIN-NMR		Version 3.5
$$ ##JCAMPDX= 5.01
$$ ##ORIGIN= Bruker BioSpin GmbH
$$ ##OWNER= NMR
$$ C:\u/data/dgb/nmr/ADRS/12140/pdata/1/auditp.txt
$$ ##AUDIT TRAIL=  $$ (NUMBER, WHEN, WHO, WHERE, WHAT)
(   1,<2005-11-10 11:23:15.36 +000>,<MAYBRIDGE\NMR>,<NMR_250MHZ>,
      <created by zg, POWCHK disabled, PULCHK disabled
       configuration hash MD5:
       62 19 C7 07 E1 42 D1 B7 37 6C 3D D0 77 39 F9 E6
       data hash MD5: 64K
       30 E9 17 34 F9 A3 2F 4B 65 C3 F3 73 85 DD 25 BC>)
(   2,<2005-11-10 11:23:28.99 +000>,<MAYBRIDGE\NMR>,<NMR_250MHZ>,
      <Start of raw data processing
       ef LB = 0.3 FT_mod = 6 PKNL = 1 SI = 32K 
       data hash MD5: 32K
       00 59 69 76 23 51 8D 39 B9 3A C7 98 91 C1 DB 27>)
(   3,<2005-11-10 11:23:31.44 +000>,<MAYBRIDGE\NMR>,<NMR_250MHZ>,
      <apk 
       data hash MD5: 32K
       87 BA 88 14 34 FC B6 EC DE 6F E9 BF 91 E3 43 B2>)
(   4,<2005-11-10 11:23:32.52 +000>,<MAYBRIDGE\NMR>,<NMR_250MHZ>,
      <abs ABSG = 5 
       data hash MD5: 32K
       2A 91 D8 D1 B6 C9 D8 F7 6C B9 46 D1 11 6D 1D 64>)
$$ ##END=
$$ 
$$ hash MD5
$$ 22 4F 25 5F BA DE 93 C8 63 E3 43 8E 67 C3 7D A1
##$RELAX= 
##$RELAX= 
##$RELAX= 
##$RELAX= 
##$RELAX= 
##$RELAX= 
##$RELAX= 
$$ Bruker specific parameters
$$ --------------------------
##$DU= <C:\u>
##$EXPNO= 12140
##$NAME= <ADRS>
##$PROCNO= 1
##$TYPE= <nmr>
##$USER= <dgb>
##$AMP= (0..31)
100 100 100 100 100 100 100 100 100 100 100 100 100 100 100 100 100 100 
100 100 100 100 100 100 100 100 100 100 100 100 100 100 
##$AQSEQ= 0
##$AQ_mod= 3
##$AUNM= <au_zg>
##$AUTOPOS= <12 >
##$BF1= 250.13
##$BF2= 250.13
##$BF3= 250.13
##$BF4= 250.13
##$BF5= 500.13
##$BF6= 500.13
##$BF7= 500.13
##$BF8= 500.13
##$BYTORDA= 1
##$CFDGTYP= 0
##$CFRGTYP= 5
##$CHEMSTR= <none>
##$CNST= (0..31)
1 1 145 1 1 1 1 1 1 1 1 1 1 1 1 1 1 1 1 1 1 1 1 1 1 1 1 1 1 1 1 1 
##$CPDPRG= <>
##$CPDPRG1= <>
##$CPDPRG2= <>
##$CPDPRG3= <>
##$CPDPRG4= <mlev>
##$CPDPRG5= <mlev>
##$CPDPRG6= <mlev>
##$CPDPRG7= <mlev>
##$CPDPRG8= <mlev>
##$CPDPRGB= <>
##$CPDPRGT= <>
##$D= (0..31)
0 1 0 0 0 0 0 0 0 0.06 0 0 0 0 0 0 0.0002 0 0 0 0 0 0 0 0 0 0 0 0 0 0 
0 
##$DATE= 1131621794
##$DBL= (0..7)
120 120 120 120 120 120 120 120 
##$DBP= (0..7)
150 150 150 150 150 150 150 150 
##$DBP07= 0
##$DBPNAM0= <>
##$DBPNAM1= <>
##$DBPNAM2= <>
$$ [...]
##$SUBNAM7= <"">
##$SUBNAM8= <"">
##$SUBNAM9= <"">
##$SW= 20.6930455092707
##$SWIBOX= (0..15)
0 0 3 0 0 0 0 0 0 0 0 0 0 0 0 0 
##$SW_h= 5175.983436853
##$TD= 65536
##$TD0= 1
##$TE= 295.16
##$TE2= 300
##$TE3= 300
##$TEG= 300
##$TL= (0..7)
0 120 120 120 120 120 120 120 
##$TP= (0..7)
150 150 150 150 150 150 150 150 
##$TP07= 0
##$TPNAME0= <>
##$TPNAME1= <>
##$TPNAME2= <>
##$TPNAME3= <>
##$TPNAME4= <>
##$TPNAME5= <>
##$TPNAME6= <>
##$TPNAME7= <>
##$TPOAL= (0..7)
0.5 0.5 0.5 0.5 0.5 0.5 0.5 0.5 
##$TPOFFS= (0..7)
0 0 0 0 0 0 0 0 
##$TUNHIN= 0
##$TUNHOUT= 0
##$TUNXOUT= 0
##$USERA1= <user>
##$USERA2= <user>
##$USERA3= <user>
##$USERA4= <user>
##$USERA5= <user>
##$V9= 5
##$VALIST= <valist>
##$VCLIST= <CCCCCCCCCCCCCCC>
##$VD= 0
##$VDLIST= <DDDDDDDDDDDDDDD>
##$VPLIST= <PPPPPPPPPPPPPPP>
##$VTLIST= <TTTTTTTTTTTTTTT>
##$WBST= 1024
##$WBSW= 4
##$XGAIN= (0..3)
0 0 0 0 
##$XL= 0
##$YL= 0
##$YMAX_a= 487665
##$YMIN_a= -385479
##$ZGOPTNS= <>
##$ZL1= 120
##$ZL2= 120
##$ZL3= 120
##$ZL4= 120
##$ABSF1= 16.522
##$ABSF2= -4.171173
##$ABSG= 5
##$ABSL= 3
##$ALPHA= 0
##$AQORDER= 0
##$ASSFAC= 0
##$ASSFACI= 0
##$ASSFACX= 0
##$ASSWID= 0
##$AUNMP= <proc_1d>
##$AZFE= 0.1
##$AZFW= 0.1
##$BCFW= 0
##$BC_mod= 0
##$BYTORDP= 0
##$COROFFS= 0
##$CY= 12.5
##$DATMOD= 1
##$DC= 0
##$DFILT= <>
##$DTYPP= 0
##$F1P= 14.0000005364418
##$F2P= -0.99999901652339
##$FCOR= 0.5
##$FTSIZE= 32768
##$FT_mod= 6
##$GAMMA= 0
##$GB= 0
##$INTBC= 1
##$INTSCL= 1
##$ISEN= 128
##$LB= 0.3
##$LEV0= 0
##$LPBIN= 0
##$MAXI= 10000
##$MC2= 0
##$MEAN= 0
##$ME_mod= 0
##$MI= 0
##$NCOEF= 0
##$NC_proc= -3
##$NLEV= 6
##$NOISF1= 0
##$NOISF2= 0
##$NSP= 0
##$NTH_PI= 0
##$NZP= 0
##$OFFSET= 16.522
##$PC= 1
##$PHC0= 88.15897
##$PHC1= -23.22011
##$PH_mod= 1
##$PKNL= yes
##$PPARMOD= 0
##$PSCAL= 4
##$PSIGN= 0
##$REVERSE= no
##$SF= 250.13
##$SI= 32768
##$SIGF1= 0
##$SIGF2= 0
##$SINO= 400
##$SIOLD= 32768
##$SREGLST= <1H.DMSO>
##$SSB= 0
##$STSI= 32768
##$STSR= 0
##$SW_p= 5175.98343685301
##$SYMM= 0
##$S_DEV= 0
##$TDeff= 65536
##$TDoff= 0
##$TI= <Analysis number 999999
Compound Code 99
Book Reference 9
Project Code 9>
##$TILT= no
##$TM1= 0
##$TM2= 0
##$TOPLEV= 0
##$USERP1= <user>
##$USERP2= <user>
##$USERP3= <user>
##$USERP4= <user>
##$USERP5= <user>
##$WDW= 1
##$XDIM= 32768
##$YMAX_p= 354442505
##$YMIN_p= -411646
$$ End of Bruker specific parameters
$$ ---------------------------------
##NTUPLES= NMR SPECTRUM
##VAR_NAME=  FREQUENCY,     SPECTRUM/REAL,   SPECTRUM/IMAG
##SYMBOL=    X,             R,               I
##VAR_TYPE=  INDEPENDENT,   DEPENDENT,       DEPENDENT
##VAR_FORM=  AFFN,          ASDF,            ASDF
##VAR_DIM=   32768,         32768,           32768
##UNITS=     HZ,            ARBITRARY UNITS, ARBITRARY UNITS
##FACTOR=    0.157963299565203, 1,           1
##FIRST=     4132.6476996994, 0,             0
##LAST=      -1043.33573715361, 0,           0
##MIN=       -1043.33573715361, -411646,     0
##MAX=       4132.6476996994, 354442505,     0
$$ Real data points
##PAGE= N=1
##DATA TABLE= (X++(R..R)), XYDATA
$$ [...]
16163B25019L927K9034J5280K614O848k072j381L709m052j5268L093J849O981
16150B75581r04O68J172K6030p671j0742j1470j5025N881l552J254l908m569j7360
16136B35385q174P243K0303p334j8165q509N139P625L811k4323R679p174m190
16123B11316j664P810N01r664q081o819J785J6389j1356j3821j3119J18p249J1593
16109A77739K228J112j2081o720J657L514L861j6747j4026N557l41L28p460J55
16095A38776j920J1592j1112l573j457N572L142N333K912p514O906J155j944R775
16081A57643J6239q796j1853k4187p857N889K3214n96j8220K901L573J6075k3510
16068A30515l0354P974R969P102J7378O802r460m36j9086J2457Q144j7119n027
$$ plain form
16163 225019 228946 257980 273260 275874 282722 280650 279269 282978 278926 263658 266751 268600 275581
16150 275581 274677 275345 276517 302547 294876 284134 272664 257639 263520 259968 261222 257314 252745 235385
16136 235385 227211 234454 254757 247423 229258 220749 225888 233513 237324 213001 222680 215506 211316
16123 211316 209652 217462 217963 208299 200218 193399 195184 211573 200217 186396 173277 173395 166146 177739
16109 177739 179967 181079 168998 162278 163935 167449 171310 154563 140537 146094 145753 146081 138621 138776
16095 138776 136856 148448 137336 133763 132306 137878 141020 146353 149265 141751 148657 149812 147868 157643
16081 157643 173882 165086 153233 129046 121189 127078 150292 149696 131476 134377 137950 154025 130515
16068 130515 100161 108135 118104 125206 142584 149386 139926 139490 120404 132861 141005 123886 118859
16055A18859n083l237M085J2796J0093J1239J5748k3034j4746j3696k216q98J664
16042A11574J1263J68k590P762J781k4555J2203K5311O094M577k140N43R86J081
16028A54058J3689J795p964k9089k5653M227j1117L911M167n48K681K120N307
16015A17584K6194n567k3431K3697K0620L113r808k6216k0361j200j390q944M009
16002I8300R579L868N218O525q179m12o79P977J3106o242k7775j1896j987L239
15988I0642r393p532O535J794L413K332P042J5478L60q218r93O530O155r299j2418
15973I2428k3623j7574J4879J0472K674J4282R622l281k0051Q256L887j5147J453
15960G8277M414N28J6116J3782j7537j667R018m83m492M323J534n88P479j2490
$$ plain form
16055 118859 113776 110539 114624 127420 137513 148752 164500 141466 126720 113024 110808 109910 111574
16042 111574 122837 123005 120415 128177 129958 105403 117606 142917 149011 153588 151448 151991 152977 154058
16028 154058 167747 169542 161578 132489 106836 111063 99946 103857 108024 107476 110157 112277 117584
16015 117584 143778 138211 114780 138477 159097 162210 152402 126186 105825 104625 103235 94291 98300
16002 98300 107879 111747 116965 123490 115311 114899 114220 122197 135303 129061 101286 89390 87403 90642
15988 90642 81249 73717 80252 82046 85459 87791 94833 110311 110671 102453 101460 107990 114145 104846 92428
15973 92428 68805 51231 66110 76582 79256 93538 103160 99879 79828 88084 91971 76824 78277
15960 78277 82691 83219 99335 113117 95580 93913 102931 102448 97956 102279 103813 103225 110704 98214
15946I8214M52L948m269o096L147j9016j4532L73K5534J4722J957o953r306P787
15932I5962K1527j5190j2541j1371r84N061J2729o342j0351n482K3262p726j6643
15919G1911J4605J9296j3667q060j829N640j075n936M070k176q311N883J2137
15906I2488k5214j0391L4K08l57J481q41j2036J2097J9887q478Q287J68l898J5989
15891H9424K2032L701k5380j2732q728m037m366O23k774P206j5955O910L265J4606
15877G3795N283l4067m937K0408M869m647Q276o06N280J0654m290q441j1299m869
15863E5409J1729M451Q819k084J550j960q008M875J3339l538n110O58j564O460
15849H5026j5956j0296l30r027o67M449J1276J1401J1054j4834k9043j0894O943
$$ plain form
15946 98214 98666 102614 98345 92249 95396 76380 61848 62221 87755 102477 104434 97481 88175 95962
15932 95962 117489 102299 89758 78387 77403 82464 95193 88851 78500 73018 96280 88554 71911
15919 71911 86516 105812 92145 84085 82256 87896 86821 80885 84955 82779 74468 80351 92488
15906 92488 67274 56883 56917 57125 56768 58249 57408 45372 57469 77356 68878 77165 77333 73435 89424
15891 89424 111456 115157 89777 77045 68317 64280 59914 60537 57763 64969 49014 55924 59189 73795
15877 73795 79078 45011 40074 60482 65351 60704 68980 68374 73654 84308 80018 71577 60278 55409
15863 55409 67138 71589 80408 78324 79874 77914 69906 74781 88120 84582 79472 80130 78566 85026
15849 85026 69070 58774 58444 49417 48750 53199 64475 75876 86930 72096 43053 32159 39102
15836C9102K4640j7918k6957P631J6354P943p301Q686q03J4268R47J732K391L243
15822G3958O037J002L801j5277j1879J6700K849K401l198q08o074j4997J6474
15809G0989j35o263n961Q967K574N479J505j8283M349J2195K314K155J0143j9522
15795G0506Q549J0578q931k3636q656m00j1116k2517M580J2767o09Q286r317O850
15781C6934J8733J1378J9106J4028k0584j6564j3123M208R214j9881j1400K5465
15769E7514Q910p484J2312J1526r157k260k2768k3543l332J367k041l725L4961
15756E2280Q064J642J0037J4574J1982j1875k9349j4036J5821o49n079k875l044
15743D7493l888L311m0o127m072P097j1105J3341N766k651J3803p135j5138o154
$$ plain form
15836 39102 63742 45824 18867 26498 42852 50795 43494 52180 51377 65645 66592 68324 70715 73958
15822 73958 79995 80997 84798 69521 57642 74342 77191 79592 76394 75586 69512 54515 70989
15809 70989 70854 64591 58630 67597 70171 75650 77155 58872 63221 75416 77730 79885 90028 70506
15795 70506 79055 89633 80702 57066 48410 48010 36894 14377 18957 31724 31115 39401 30084 36934
15781 36934 55667 67045 86151 100179 79595 63031 49908 54116 63330 43449 32049 57514
15769 57514 66424 58940 71252 82778 73621 71361 48593 25050 21718 23085 21044 17319 52280
15756 52280 60344 61986 72023 86597 98579 86704 57355 43319 59140 58491 53412 50537 47493
15743 47493 43605 46916 46876 40749 36677 43774 32669 46010 51776 49125 62928 55793 40655 34501
15729C4501L085J8714J0188J2896Q206j1332j1059q058l726N017P944p812o034
15716E2530j3650L394J0408K565j3259j3379J4883M880k90l905K824R026r92L421
15702E8456j4356O661J423O393l425j4992k3774J6109K8456j3264l161k813M092
15689D5805q63Q931j888j2850m59p218J3629k978M359n213q214l417J0426K2340
15675F2390m022j4196N647p476o825Q102O080r535J0366k404m638o320n717j8016
15661A3436O877J8649K881o823O754K733q970p738M323k276Q202J1618K732n257
15647D7141m597K981J0026K7127L885j7533q154q366o966L00k3328j6212J5829
15634B2133l86O904q307j4312n126m124M531J9544J2016M485J604j9093M758J4691
$$ plain form
15729 34501 37586 56300 66488 79384 87590 76258 65199 57141 53415 58432 66376 58564 52530
15716 52530 38880 42274 52682 55247 41988 28609 43492 48372 48082 44177 47001 56027 55035 58456
15702 58456 44100 50761 52184 58577 55152 40160 16386 32495 60951 47687 44526 41713 45805
15689 45805 44942 53873 51985 39135 38676 31458 45087 42109 46468 41255 33041 29624 40050 62390
15675 62390 58368 44172 49819 42343 35518 43620 49700 40165 50531 48127 43489 37169 31452 13436
15661 13436 20313 38962 41843 35020 41774 44507 35537 27799 32122 29846 38048 49666 52398 47141
15647 47141 42544 45525 55551 82678 86563 69030 60876 52510 45544 45844 22516 6304 22133
15634 22133 21747 28651 20344 6032 906 -3218 1313 20857 32873 37358 38962 19869 24627 39318
15620C9318R946j2399K911K2378M739k882k1692N556J361j1887j4722p359o678
15607H590P627Q098M685Q938M806M754o588j2092k20p68O063O882J8060j818j6479
15592D0538m188j6402j349l850J2492M547j6J1330M751j3278k4571p904L596k885
15578B811N632J702P447P913J0508N179j6737M078M342q21O306j3515n069P85
15564B0561Q834q244j3719P02P773J1376K7393j6956j580Q790j1257p958l113
15551B2602P594J0085J657j3545j3626o695J2433J2922o90L796k445j1402p831
15538A4855m349J1223N562n025o950n183m582N242J8772m503J0322k670L762n598
15524C0878k1236j852m369N143J2903Q427N781p973J1293J0122j0780k875k711
$$ plain form
15620 39318 49264 36865 39776 62154 66893 64011 42319 47875 49236 37349 22627 15268 8590
15607 8590 16217 24315 29000 37938 42744 47498 40910 28818 28598 27830 33893 40775 58835 57017 40538
15592 40538 36350 19948 18599 14749 27241 31788 31772 43102 47853 34575 10004 2100 5696 2811
15578 2811 8443 10145 17592 25505 36013 41192 24455 28533 32875 32054 38360 24845 19776 20561
15564 20561 29395 21151 7432 8134 15907 27283 54676 37720 36140 44930 33673 25715 22602
15551 22602 30196 40281 41938 28393 14767 8072 20505 33427 32737 36533 34088 22686 14855
15538 14855 10506 21729 27291 22266 15316 10133 5551 10793 29565 25062 35384 32714 36476 30878
15524 30878 9642 7790 3421 8564 21467 29894 35675 27702 38995 49117 38337 35462 32751
15511C2751J0192L83M745P966J3432Q4K641P94j4923j121J1303j9136r711J6779
15497E6179J2308j2883l6177l2290J5221K3383k699j678Q578O006J6287J374N875
15484E9484N072j7930L726k4667p551K515Q312j0801k7111J5966K5937p211j2099
15471A3642l815O748N751p10l193O1j0053o425P288J3799k017j0977M750J5418
15457C0267L757n767K192j5520j7208k543J2594k549N953N046m338Q722R019J5759
15443D5384M371J3581j5427k6569q418o749P889N276J774P161j484k385P595m132
15429B7867j5140J9868n073k5398j7811K2176J5326J2248J6809j297j2848j3279
15417B3448j4529J6243p256P387m944J94q346K9606J7343j0236k9196j1337P02
$$ plain form
15511 32751 42943 43326 48071 56037 69469 69553 72194 72988 58065 56944 68247 49111 39400 56179
15497 56179 68487 55604 19427 -12863 2358 25741 23042 21364 29942 35948 52235 53609 59484
15484 59484 64556 46626 50352 25685 18134 20649 28961 18160 -8951 7015 32952 25741 13642
15471 13642 9827 16575 22326 21616 18423 18484 8431 2006 9294 23093 21076 10099 14849 30267
15457 30267 34024 28257 30449 14929 -2279 -4822 7772 5223 11176 16222 11884 20606 29625 45384
15443 45384 49755 63336 47909 21340 12922 6173 14062 19338 21112 28273 26789 24404 31999 27867
15429 27867 12727 32595 27522 2124 -15687 6489 21815 34063 50872 49575 36727 23448
15417 23448 8919 25162 17906 25293 20349 20543 12197 41803 59146 48910 19714 8377 9079
15404I079q808P948M921o366R088l185m022J3352J2271p416k0634j8584R402J0848
15390G894J2853P787n17J3640l035k3419J424K891Q465L067P156J5938r052j8659
15376B6433k1346j3388J0310O582m353J6842J9482n867N240o538j7952j6377J7537
15363A6605l195k3451r242J8009K3857J5278m277n813r162m183j2664k528j966
15350b732M289J239J781O28N981N050J0773J2426o162q290j2003k30l861L330
15336A2219n324k8286r356M437K1234J0076J7163P129J4433R928m800K364r816
15323D1401j356j2525l730l489J102R891j6340j446Q950P558J4168p294J679j4503
15309B4066o586q981l618M003l050k881r668n228q815M871P81K411L170j971O783
$$ plain form
15404 9079 271 8219 13140 6774 15862 12677 8655 22007 34278 26862 6228 -12356 -2954 7894
15390 7894 20747 28534 28017 41657 38622 15203 16627 19518 27983 31050 38206 54144 45092 26433
15376 26433 5087 -8301 2009 8591 4238 21080 40562 34695 39935 33397 15445 -932 16605
15363 16605 13410 -10041 -19283 -1274 22583 37861 33584 27771 18609 14426 1762 -766 -2732
15350 -2732 1557 2796 4577 5205 11186 16236 27009 39435 33273 24983 12980 12750 8889 12219
15336 12219 6895 -21391 -30747 -26310 -5076 5000 22163 29292 43725 53653 48853 51217 41401
15323 41401 40045 27520 23790 20301 21403 31294 14954 13508 22458 30016 44184 36890 38569 24066
15309 24066 17480 8499 4881 8884 5834 2953 -6715 -11943 -20758 -15887 -15106 -12695 -9525 -11496 -4713
15294d713N303r16O312q324n334J9572J6300j51J158p54j6459p883L946r889k192
15279d024j12l55J1030L606J3417l437j2323k8041j4059J0873L35M533L607J2763
15265b187P434L319p874j379K2852n456j353J8330k015J8894k6061k5807p486
15252h789K2231j68j8724M263j2409l662M734l420k5919J1857K4074K058P85J64
15238b925n350J4196J9325j8934M521K5035n258o007n039N376j1052p08j1551
15225A629j4206j8675n1k55J8847M711L767Q943n86L195n022R013K726J0739k878
15210B1897j3646j2252p573M386J7914K9541n153j4008j509M308r316p499j3496
15197f406j3849L905J6876k550r939J6823O150J5499j3946p251O254k976j0820
$$ plain form
15294 -4713 590 -326 5986 -2338 -7672 11900 28200 28049 29207 28453 11994 4111 8057 -1832 -4024
15279 -4024 -4136 -4491 6539 10145 23562 20125 7802 -20239 -34298 -23425 -23090 -18557 -14950 -2187
15265 -2187 5247 8566 692 -687 22165 16709 15356 33686 31671 50565 24504 -1303 -8789
15252 -8789 13442 13274 -5450 -1187 -13596 -17258 -12524 -15944 -41863 -30006 -5932 -3874 -3089 -2925
15238 -2925 -8275 5921 25246 6312 10833 35868 30610 24603 19564 24940 13888 13180 1629
15225 1629 -12577 -31252 -31303 -31558 -12711 -8000 -4233 4710 4124 7319 2297 11310 14036 24775 21897
15210 21897 8251 -4001 -11574 -7188 10726 40267 35114 21106 19597 23905 14589 7090 -6406
15197 -6406 -20255 -16350 526 -2024 -11963 4860 11010 26509 12563 5312 11566 8590 -2230
15184b230R135K3082j666k5295p940J7298O117P729K0119J962k0261j1726o234
15171A0090M253M183j5361j5449J4564N271P300O969l530p919k5979O547J5K566
15157f480O314M829J3191j4138k833K4466J3454o194k0289K696J1508M452o216
15144B4760k1118m190M018j076p545j1122L37M742j7283J2581J4016k4j1137p36
15130a3777K8595P4k4040m534q039J2940M128N350P751K058o397Q12J0402q870
15116F453j8224j3873O821J5254Q558q9o033k596K8807O817j5652l695N502K528
15102B0578j2656k0149n386J8165Q247J1977j3506K26L917k684j329m423q563
15089e586N997J2999Q845O468P16O690j2122j5217N953l263j2734j3128m776K0887
$$ plain form
15184 -2230 6905 29987 28321 3026 -4914 12384 18501 26230 46349 48311 28050 16324 10090
15171 10090 14343 18526 3165 -12284 2280 7551 14851 21820 18290 10371 -15608 -9061 -9046 -6480
15157 -6480 -166 4663 17854 3716 883 25349 38803 32609 12320 15016 26524 30976 24760
15144 24760 3642 -548 3470 2394 -5151 -16273 -15936 -11194 -28477 -15896 -1880 -1904 -13041 -13777
15130 -13777 14818 14892 -9148 -13682 -21721 -8781 -4653 697 8448 10506 4109 4921 15323 6453
15116 6453 -11771 -25644 -18823 -3569 4989 4900 -1133 -3729 25078 31895 16243 12548 18050 20578
15102 20578 7922 -12227 -17613 552 8799 20776 7270 7496 11413 8729 7400 2977 -5586
15089 -5586 411 13410 22255 28723 29439 36129 24007 8790 14743 11480 -1254 -14382 -19158 1729
15075A729J6106n292j4414M672J6396k135j4296p617o509j4093n090J5444J4009
15062a090k0391l6005j575M9347J3861J647p657M412j9419M145M716o545n063
15049a9617j0556J4348J9016L93j3929l674M843J7475j6568j3389P581J4347M220
15036D490q731k669j1519o263P282N637L034o084j6015M52n85O968J7817J7618
15022A1432l697j0120q76K1791N016j9606k661J2925L470J585j4008L044m579
15009C716q184R932R227P593J7515Q541m334l1286o852J395N91j4193o722J3589
14995E28J602m217j948k499l382n117P677K1411M594j9612k5171Q406P327J3031
14981B630L914O76k4389L432K2147Q087j1584j8172r625j5841L472j3147R367
$$ plain form
15075 1729 17835 12543 -1871 2801 19197 17062 2766 -4851 -11360 -25453 -30543 -15099 -1090
15062 -1090 -21481 -57486 -59061 -9714 4147 5794 -1863 2549 -16870 -12725 -8009 -14554 -19617
15049 -19617 -30173 -15825 3191 3584 -10345 -14019 -9176 8299 -8269 -21658 -14077 270 4490
15036 4490 -4241 -6910 -18429 -24692 -17410 -11773 -8739 -14823 -30838 -30386 -30971 -24003 -6186 11432
15022 11432 7735 -2385 -3261 18530 23546 3940 1279 14204 17674 19259 5251 8295 3716
15009 3716 -4468 5464 14691 22284 39799 48340 44006 12720 5868 7263 7854 -6339 -13061 528
14995 528 2130 -2087 -4035 -6534 -9916 -15033 -7356 14055 18649 -963 -26134 -17728 -10401 2630
14981 2630 6544 7220 -17169 -13737 8410 16497 4913 -13259 -22884 -38725 -35253 -48400 -39033
14968c9033L1410K3810m817j7064j3267M126R4l907o610pM878J0086K7742j1579
14954E862q579J995j7951r975Q906J1121K445j355r223j6280j1679K6839J2246
14941e628K953j421k541j3787k304J6318J1998R823j0425j6699O930k589J682
14928e690K1664P949k845o728p779p92k5409j7800p634O430J6913l213O736L0271
14914A2073Q71j9252n721j972j2512L857P429k30k694N87K757q09P774N321n396
14899g917J777j2848j928J1223Q246m19n092Q211j103J0155J0817j0701m180m914
14885A327l312k4011o66j4884q32J2543J7716J1741R700n205M172K319n965K036
14871F679Q241J3718j8703o895M775O889n806m626M320R581p13J2695n058k672
$$ plain form
14968 -39033 -7623 16187 11370 -5694 -18961 -14835 -14741 -18648 -25258 -25265 -20387 -10301 17441 5862
14954 5862 -2717 -722 -18673 -28648 -19742 -8621 -6176 -7531 -16754 -33034 -44713 -17874 -5628
14941 -5628 -2675 -4096 -6637 -20424 -22728 -6410 5588 15411 4986 -11713 -4783 -7372 -5690
14928 -5690 15974 23923 21078 14350 6571 5779 -19630 -37430 -45064 -38634 -21721 -24934 -18198 12073
14914 12073 12944 -6308 -12029 -14001 -26513 -22656 -15227 -15457 -18151 -17564 -14807 -15616 -7842 -2521 -7917
14899 -7917 -6140 -18988 -20916 -9693 -1447 -1866 -6958 1253 150 10305 21122 10421 6241 1327
14885 1327 -1985 -25996 -26662 -41546 -42378 -29835 -12119 -378 9322 4117 8289 10608 4643 6679
14871 6679 14920 28638 9935 3040 7815 14704 8898 4272 8592 18173 17460 30155 25097 22425
14857B2425j2587o359N559j679O844j2909o953j2956k686j528l454n531p961L956
14843c5819l507K3636K672j0986J5616P323J365J142o951p115j86j3349M303Q329
14829a3527M311J2825j3236l703j889j9713j683P749R393P636r214o131P364P519
14815a2299O188r77K507r625m871n49K0479m715n15N718o05R542J2775j2337j5186
14800d470n132K667L19M435j6135j8743J5479J6386j1789Q786J2117O184j0666
14787e62o76r504n940j3680j7416O620J4964K0007o02k22O455l490J64L219n280
14772e943O933J3240M534r464n367j0572j1010K0916J531j137j4633q135j212
14759b0319j520K2527R919j1479P387K446l769O478J715j4801k7917Q42L1397
$$ plain form
14857 22425 9838 3479 9038 7359 14203 1294 -5659 -18615 -21301 -22829 -26283 -31814 -39775 -35819
14843 -35819 -39326 -15690 -13018 -24004 -8388 -1065 300 1442 -5509 -12624 -12810 -26159 -21856 -13527
14829 -13527 -9216 3609 -9627 -13330 -15219 -34932 -36615 -28866 -19473 -11837 -21051 -27182 -19818 -12299
14815 -12299 -6111 -7088 -4581 -14206 -19077 -19626 853 -3862 -4377 1341 736 10278 23053 10716 -4470
14800 -4470 -9602 -6935 -6616 -2181 -18316 -37059 -21580 -5194 -16983 -8197 3920 10104 -562
14787 -562 -1238 -10742 -16682 -30362 -47778 -41158 -26194 -6187 -6789 -7011 -556 -4046 -3882 -663 -5943
14772 -5943 990 14230 18764 9300 3933 -6639 -17649 3267 4798 3661 -10972 -19107 -20319
14759 -20319 -21839 688 10607 -872 6515 8961 5192 11670 13385 -1416 -29333 -28491 2906
14746B906k473j698M884j0379j0372R680J931j719J315P142j794M467k611O260
14732G539k119O715j773k3639J539J4131j5323N95R912Q488l230j7122m1595J493
14718e4389j392J6807R742q000J0242r436J422N326K019j5832K3074J5435m498
14705i480n381k257R51J1437P487o599K586Q888L544o613j5296n756q802J7246
14691h045j1257j2420k634m775N224J3797R276O546o035K418Q891p903k5614q031
14677d0562J2148m46R816m696k0516j161J9944K9202O014j8207m855K3834P049
14664A7564P471q218l964j6775P684O881j6218p771j490r319J3419l533j3201
14651b7470k4160J3801J5406j985J084N449o73P140q915l088J3741J2444j2336
$$ plain form
14746 2906 433 -1265 3619 -6760 -17132 -7452 -5521 -7240 -5925 1217 -577 3890 1279 7539
14732 7539 5420 12135 10362 -13277 -11738 2393 -12930 -12335 -2423 6065 2835 -14287 -55882 -54389
14718 -54389 -55781 -38974 -29232 -37232 -26990 -36426 -35004 -29678 -27659 -43491 -20417 -4982 -9480
14705 -9480 -14861 -17118 -16167 -4730 2757 -3842 -1256 7632 11176 4563 -10733 -16489 -25291 -8045
14691 -8045 -19302 -31722 -34356 -39131 -33907 -20110 -10834 -4288 -10323 -7905 986 -6917 -32531 -40562
14677 -40562 -28414 -28860 -19044 -23740 -44256 -45417 -25473 3729 9743 -8464 -13319 10515 17564
14664 17564 25035 16817 12853 -3922 3762 10643 -5575 -13346 -14836 -24155 -10736 -14269 -27470
14651 -27470 -51630 -37829 -22423 -24408 -23324 -17875 -18548 -11408 -20323 -23411 -9670 2774 -9562
14638i562o05R398n039k500K026J857M675J0390P388J662J745M421L288j7298
14624A1846k6562J6780K966M690J0249p535k1392j5738P323O430J2191J0996k5032
14611a2788K759J4100j6940N266J7997J087j1252J4338J9980J5658k4784j3142
14599A2279N833m69j2971p079M770N133j4347l981r60J0018j442l098j3746K984
14585a7076Q024j070m787j7917n728o097R375K2083j1607o722J2808J4572l127
14572g269J0004R684N618j6389j4328m711j3718j7781n959K0575J0076m098n582
14559c3878J1209Q05K961N915j1758P479M146j1767P793L619O275N527n829J0353
14545B850k507l807k112o729O032M002M065j320L420k1959j7916m808P242K5794
$$ plain form
14638 -9562 -10167 -769 -5808 -8308 -6282 -4425 250 10640 18028 19690 21435 25856 29144 11846
14624 11846 -14716 2064 5030 9720 19969 12434 -8958 -24696 -17373 -10943 1248 12244 -12788
14611 -12788 -10029 4071 -12869 -7603 10394 11481 229 14567 34547 50205 25421 12279
14599 12279 18112 17643 4672 -2407 2363 7496 -6851 -10832 -11792 -1774 -3216 -6314 -20060 -17076
14585 -17076 -9052 -10122 -14909 -32826 -38554 -44651 -35276 -13193 -24800 -31522 -18714 -4142 -7269
14572 -7269 2735 12419 18037 1648 -12680 -17391 -31109 -48890 -54849 -34274 -24198 -28296 -33878
14559 -33878 -22669 -21864 -18903 -12988 -24746 -17267 -13121 -24888 -17095 -13476 -7201 -1674 -7503 2850
14545 2850 343 -3464 -5576 -12305 -6273 -2271 1794 474 3894 -18065 -35981 -40789 -33547 -7753
14531g753R409j7146j93J458Q718r20j1265j0971j1879m902K6966J8743m56j1692
14517a1883q444P566p877J604J2296M65n20r934j8177j965J6455K7709N008O611
14503A8914P84j2950j7232j05J3710J0541p530n197o604K849M369M443q409j2314
14489a4731k005K454L315p23l591j0033M571J8876R705j607o117J332k4590j8712
14475d1856K2166K7781N232j4729q485K1456J528j5844q734J2377j4597m662K4115
14462E748P17p533P797K830J6646J3003q72j0856k1872k5018o332J7397Q950J5584
14448A6189m039j4063j554j0970J0191L912j74N042q561k0946J0710Q239R568
14435C544j2385M021q184M81n319j0156Q673J4247J7190n842j7962J2562J5342
$$ plain form
14531 -7753 1656 -15490 -15683 -14225 -5507 -6427 -17692 -28663 -40542 -45444 -18478 265 -191 -11883
14517 -11883 -20327 -12761 -20638 -19034 -6738 -6273 -6793 -16727 -34904 -36869 -20414 7295 12303 18914
14503 18914 19698 6748 -10484 -10589 3121 13662 6132 935 -5669 -2820 1549 5992 -2417 -14731
14489 -14731 -16736 -14282 -10967 -11690 -15281 -25314 -20743 -1867 7838 6231 114 1446 -23144 -41856
14475 -41856 -19690 8091 13323 -1406 -9891 11565 13093 -2751 -11485 892 -13705 -18367 5748
14462 5748 6465 -1068 6729 9559 26205 39208 38336 27480 5608 -19410 -25742 -8345 605 16189
14448 16189 12150 -1913 -3467 -14437 -4246 -334 -508 4534 -4027 -24973 -14263 -6024 3544
14435 3544 -8841 -4820 -13004 -12523 -17842 -27998 -19325 -5078 12112 6270 -11692 870 16212
14422A6212k787j482l881j1039j2241N687p350n563J0693K291J165J9k634m221
14408a5131l992o065R893J5172n740m515j2160Q485Q034q3j7568K033Q168k39
14394a3708M571L50j4800M154J4327Q985q655K054j3762J8922L662Q555L146q023
14380I778M099p962n191q507k4298J10J0478r608K007J9614q34k4307l825M157
14366c4289O621K640N677O62q913m877K903n072L123J626N021P518J6455K1491
14352B0586K0717p564J346k35p19n117k982l740j1285j1256q843J792Q04J8459
14338A1963p842j869M015j1715n154J3770J5053j172q028N63r31m170q264J1942
14324H161Q632k4122j0403R460k195P444o094k6750l466Q319K2102K0634p941
$$ plain form
14422 16212 13425 11943 8062 -2977 -15218 -9531 -16881 -22444 -11751 -9460 -8295 -8276 -10910 -15131
14408 -15131 -19123 -25188 -15295 -123 -5863 -10378 -22538 -14053 -6019 -6102 -23670 -21637 -13469 -13708
14394 -13708 -9137 -8787 -23587 -19433 -5106 3879 -4776 -2722 -16484 2438 6100 14655 17801 9778
14380 9778 13877 5915 724 -7783 -32081 -31971 -21493 -31101 -29094 -9480 -10314 -34621 -38446 -34289
14366 -34289 -27668 -25028 -19351 -18689 -27602 -32479 -29576 -34648 -31525 -29899 -24878 -17360 -905 20586
14352 20586 41303 33739 35085 34850 34131 29014 26032 22292 11007 -249 -9092 -7300 -6496 11963
14338 11963 4121 2252 6267 -5448 -10602 3168 18221 17049 9021 9584 8653 4483 -3781 8161
14324 8161 16793 -7329 -17732 -8272 -10467 -3023 -9117 -35867 -39333 -31014 -8912 11722 3781
14311C781k370k961q847K372Q635l120J46K584j5499K189L7484N566n414K76l6705
14296a1883j090N288j5193N178o755l100M628O528Q02P833P022R194O821r8Q054
14281B3229J2290l659r841j9274j0103j6568j3262K2077R452J6385P319l175Q019
14268B2889q420l596R419M220M232j4893j248n477L028j0784J610j4776o692J6024
14254d464K2835Q384o6m704j3215p252j094j0466J5433j408N191n738M160K608
14240A0204j64j1349Q500J1479J307Q562j4112k1602J4534J3976j1900K5005K1173
14227E5613j9027k7086L864j776K97n204M22o83R209J9286R678j89j0148q003
14213B6253j4188M784Q560r725J381L487l473K92j5087j5632j633P587J2616J2190
$$ plain form
14311 3781 1411 -1550 -10397 -8025 610 -2510 -2364 220 -15279 -13090 24394 29960 24546 24822 -11883
14296 -11883 -12973 -7685 -22878 -17700 -24455 -27555 -22927 -16399 -15597 -7764 -742 8452 15273 15175 23229
14281 23229 35519 31860 22019 2745 -7358 -23926 -37188 -15111 -5659 10726 18045 14870 22889
14268 22889 14469 10873 20292 24512 28744 13851 12603 7126 10154 -630 980 -13796 -20488 -4464
14254 -4464 18371 26755 26689 21985 8770 1518 424 -10042 5391 3983 9174 3436 7596 10204
14240 10204 10040 -1309 7191 18670 19977 28539 14427 -7175 7359 21335 9435 34440 55613
14227 55613 36586 9500 13364 11588 11885 6681 7103 6420 15629 34915 44593 44404 34256 26253
14213 26253 12065 16849 25409 15684 17065 20552 17079 17371 2284 -13348 -14981 -7394 5222 17412
14199A7412m140j47l541j9151J3301K0845Q845o011j1289r01j965j5957N693J0579
14185A3573j5134j4806J7430J1850l784j9835j3660j2823L998P544J0886R569
14173e192J8461J6752R958J319p921J1471m254j0497j8403L231O20J1818L622
14160C0985p894o369J420k329j8713m657o737q344Q189L897j4118j5140Q591J7239
14146a3980J8741m73L266O361l423k102n631N811q091J945J2853J3452L746J450
14132C3925J1795K80n848n669j057J0459k476M874J863J4889J3427j8467k5675
14119C2320M812O362j4286k222n743p663J5572k458m265K040k745m038Q548Q688
14105C4922Q564J1671R072j1469q61N259j3404r165q63j3601M209M597J3584R036
$$ plain form
14199 17412 13272 13125 9584 -9567 3734 24579 33424 27413 16124 15223 13258 -2699 2994 13573
14185 13573 -1561 -16367 1063 12913 9129 -10706 -24366 -37189 -33191 -25647 -14761 -5192
14173 -5192 13269 30021 39979 41298 33377 44848 40594 30097 11694 14925 15545 27363 30985
14160 30985 23091 16722 18142 15813 -2900 -7557 -14294 -22638 -14449 -10552 -24670 -39810 -31219 -13980
14146 -13980 4761 4288 7554 13915 10492 8390 2759 8570 479 2424 15277 28729 32475 33925
14132 33925 45720 46000 40152 34483 33426 43885 41409 46283 48146 63035 76462 57995 32320
14119 32320 37132 43494 29208 26986 21243 13580 29152 26694 22429 24469 21724 17686 26234 34922
14105 34922 43486 55157 64229 52760 51899 57158 43754 34589 33726 20125 24334 28931 42515 51551
14091E1551o034o782j5615q744J9180o819j2553J0429N338M068q44o558J1672
14078C8289J843l415j2205J1518K4051k039k8663K756J32o237q850Q300j2238
14065A3242N571J9450L610J0265N819q101j095M91J6701K917r213N173R586r372
14051F5044m674j679p734Q517j3690K949K2550l308o255k1071P324K6386K201
14038G6560k5867p557K4250o083q267M376M094R06M093j519r030k1598j5282j0897
14024H179Q754J7074m963Q614K3675J744K749n226q586J1039P746R577j1096j5690
14010E3590J3829j38m161N729J4843n012K073r3j0543k394Q03o826J2471L65j4990
13995E9546m66M751K903j8950J2853K749j464j1375j3199M152o399J3439Q610
$$ plain form
14091 51551 45517 38735 23120 14376 33556 26737 14184 24613 29951 34019 33175 26617 38289
14078 38289 40132 36717 24512 36030 60081 58042 29379 32135 32267 26030 17180 25480 13242
14065 13242 18813 38263 41873 52138 57957 49856 48761 49252 65953 68870 59657 64830 74416 65044
14051 65044 60370 58691 50957 59474 45784 48733 71283 67975 61720 40649 47973 74359 76560
14038 76560 50693 43136 67386 61303 53036 57412 61506 62412 66505 64986 55956 34358 19076 8179
14024 8179 16933 34007 29044 37658 61333 63077 65826 60600 52014 63053 70799 80376 69280 53590
14010 53590 67419 67281 63120 68849 83692 78680 80753 80660 70117 67723 68526 61700 74171 74536 59546
13995 59546 59080 63831 66734 47784 60637 63386 61922 50547 37348 41500 35101 48540 57150
13982E7150K281l011K0925O455J2244l735j8744k8569P110J8331l373n903k778
13969E8383o03L683J1369J3540j44n563l417m991P761M980O110l794r75L946K588
13954I2873o232j123J5716O00o963k2299K523L0897J2394P192m58l907p882n485
13940A07846j2404J0035Q604N875o2J1030j2934j7535l012k1391K406L757Q856
13927I1071K0801m425j0109j3649L802J9787J7163n042j6547J1379P136m34p878
13914A13055L334L020R00k504k85P872n315M554J9108K733j0186q728L523j1401
13900A19680M64J2484m114j1213j1267O036K8405k407L45j2392M397J2604m92
13887A42530M445J0902k3760L97J9063J0951J3896k0699l1674j812K4796J4035
$$ plain form
13982 57150 59431 56420 77345 83800 96044 92309 73565 44996 52106 70437 67064 61161 58383
13969 58383 57780 61463 72832 86372 86228 80665 77248 72257 80018 84998 91108 87314 86339 90285 92873
13954 92873 86641 85518 101234 101834 94871 72572 75095 105992 118386 125578 125120 121213 113331 107846
13940 107846 95442 105477 114081 119956 119894 130924 117990 100455 97443 76052 78458 82215 91071
13927 91071 111872 107447 97338 83689 87491 107278 124441 119399 102852 114231 121367 120933 113055
13914 113055 116389 119409 120309 117805 117520 125392 120077 124631 143739 146472 136286 127558 131081 119680
13900 119680 120144 132628 128514 117301 106034 112070 140475 138068 138413 126021 130418 143022 142530
13887 142530 146975 157877 134117 134514 153577 164528 178424 157725 126051 124239 149035 163070
13875A63070Q203N717L014k654K806j2142l755J1963p481j8353p553J3287L283
13862A59405K792m610K807K2699L128j0000j019Q35q74r90O227K7847N289o541
13848B06995j4073p425O724J0724r464l731l577K392N49J5140j3489k630q758
13835A79377K271J2882J2766J271m759N987R631M569P195k436P711k42K049k029
13821B36243l979J9278M292o067j6812r159J0607J3211l205j054O215P48o31J8343
13807B68030N625L926j2189l156P91m883n828l874J0659J2650O946j9765p056
13794B51876m66q51p142J2359M221P359J8080J122j0785j2822P200J5286K0853
13781C06290J0382o508o157j5238n112N642N801L256j3494o68J241L9J0087J3287
$$ plain form
13875 163070 171273 176990 180004 177350 180156 168014 164259 176222 168741 150388 142835 156122 159405
13862 159405 162197 157587 160394 183093 186221 176221 175202 176037 175163 174173 180400 208247 213536 206995
13848 206995 192922 185497 192221 202945 193481 189750 186173 188565 189114 204254 190765 188135 179377
13835 179377 181648 194530 207296 208567 203808 209795 219426 223995 231190 228754 236465 236223 238272 236243
13821 236243 232264 251542 255834 249767 232955 223796 234403 247614 244409 243355 249570 250318 249687 268030
13807 268030 273655 277581 265392 262236 263027 258144 252316 248442 259101 271751 278697 258932 251876
13794 251876 251410 250559 243417 255776 259997 267356 285436 286558 275773 262951 270151 285437 306290
13781 306290 316672 310164 304007 288769 283657 289299 295100 298356 284862 284194 285435 285474 295561 308848
13767C08848q149J6202J9616r04K708N207m767j1629M540J2147P013L103L805
13754C57740J1267j1825J921r31j0406P878o737Q216K4301J3834J3519j0141k7046
13741C71590J383J6180P535R26k10J4774o080N22K875R071O734J396J5444J2564
13727D54704N250n53Q166J2304j6054j0905J2365l723j1772M957J4278K1679J9262
13714E09958J2727J567j9592q901q180k492N076q687o137J0736K1079O931J2243
13701E26328J0454K668L044L78n107J3695J2106J3917J0058J580q224n537M334
13688E79694M476L475l910O417j302P646n950m786Q469L4952K1685J5113J797
13675F67776M847l023J4320J0154j5635J7888L942n204J5405k133r008j343J1497
$$ plain form
13767 308848 300699 316901 336517 335613 338321 343528 338761 327132 331672 343819 350832 353935 357740
13754 357740 369007 357182 359103 358172 347766 355644 348907 357123 381424 395258 408777 398636 371590
13741 371590 372973 389153 396688 397614 397404 412178 406098 406620 409495 418566 425300 426696 442140 454704
13727 454704 459954 459401 467567 479871 463817 452912 465277 461554 449782 454739 469017 490696 509958
13714 509958 522685 524252 504660 495759 487579 485087 490163 481476 475339 486075 507154 514085 526328
13701 526328 536782 539450 542494 542872 537765 551460 563566 577483 587541 589121 580897 575360 579694
13688 579694 584170 587645 583735 590152 588850 596496 590546 585760 594229 629181 650866 665979 667776
13675 667776 672623 669600 683920 694074 678439 696327 700269 695065 710470 708337 699329 697986 709483
13662G09483M520J1748J5504N33K1468J4301j5766p882K1013O513J3542J0358
13650H05335P599k497P216K270q435l810J8925L847O637K814J2372J5058K9420
13637H96751Q754m345O409K2516J9455L400kN580J0519J2183Q018Q519l683J319
13623I95393l361p908Q194M5201K5608K0018j548J1029L612O435N997j4211J919
13610A096378L8528L6461l838k912k444N985J3350J2223R704R875n63K7263L2537
13597A272547K3239M078J5857J5093O785j8067R434L4917J8308J5892K4720L2101
13585A454904q09P957K0665K9127L5859J1999m20R687J8070R799J8756K8134L0228
13572A673956K7699K3585P906K950n661L8647L8648L947K5025O508J7965K5189
$$ plain form
13662 709483 714003 725751 741255 741788 763256 777557 761791 753909 774922 781435 794977 805335
13650 805335 812934 810437 817653 819923 811488 807678 826603 830450 837087 839901 852273 867331 896751
13637 896751 905505 901160 907569 930085 949540 952940 952938 958518 969037 981220 989238 997757 994074 995393
13623 995393 992032 984124 992318 1037519 1063127 1083145 1081597 1092626 1096238 1102673 1108670 1094459 1096378
13610 1096378 1134906 1171367 1167529 1164617 1162173 1168158 1181508 1193731 1203435 1213310 1212747 1240010 1272547
13597 1272547 1295786 1299864 1315721 1330814 1337599 1319532 1328966 1363883 1382191 1398083 1422803 1454904
13585 1454904 1454095 1462052 1482717 1511844 1547703 1559702 1559282 1568969 1587039 1596838 1615594 1643728 1673956
13572 1673956 1701655 1725240 1733146 1736096 1730435 1769082 1807730 1811677 1836702 1843210 1861175 1886364
13560A886364K6506J7070K6114J8061J1372J9043K9697K7691K0040J0427J9033
13549B111418K530J6322M6359M0426N963K4720L4213L4721K1497K8900K6813K5402
13537B419284L6851L2246K9772K0332M3470M0049L2121Q905K2274M2786L2159
13526B760249K2501M2135L5166J5783L5631K3335K5878O0362M0977L3826L9767
13515C135610L6207M1175N6853N0113M7618N3972L3287K9439N7140M5029K8192
13504C614635M1891M6222L9773M8422N1878N0068L4189M8966O7649O2067M9112
13493D154872N3101M6467O0715P0103O0543P0222N9646M2715M9566N7814N8116
13482D783880P2303P0320M3128P2535Q0373P3603O5925P7966Q4396R4306O0670
$$ plain form
13560 1886364 1912870 1929940 1956054 1974115 1985487 2004530 2034227 2061918 2081958 2092385 2111418
13549 2111418 2113948 2130270 2176629 2217055 2223018 2247738 2281951 2316672 2338169 2367069 2393882 2419284
13537 2419284 2456135 2488381 2518153 2538485 2581955 2622004 2654125 2663030 2685304 2728090 2760249
13526 2760249 2782750 2824885 2860051 2875834 2911465 2934800 2960678 3021040 3062017 3095843 3135610
13515 3135610 3171817 3212992 3269845 3319958 3367576 3421548 3454835 3484274 3541414 3586443 3614635
13504 3614635 3656526 3702748 3742521 3790943 3842821 3892889 3927078 3976044 4043693 4105760 4154872
13493 4154872 4207973 4254440 4315155 4385258 4445801 4516023 4575669 4618384 4667950 4725764 4783880
13482 4783880 4856183 4926503 4969631 5042166 5122539 5196142 5262067 5340033 5424429 5518735 5579405
13471E579405P0357Q2362Q4946P6202Q4347Q7504Q6189Q3473R8883P1820P4077
13460F479565R0757R9742Q3625P9394R6726J19863J05005J16253J36989J09310
13450G517229J06116R7022J02010J10090J09977R4052J04466J23162J05210J16571
13440H585905J12078J03824J11132R9448J17824J34567J40284J32793J06350J16635
13430I760840J22906J17339J20966J28914J20259J38075J43516J19233J02594
13421A0874642J15543J30620J07990J19824J14882J24359J41167J00385R2549
13412A1921961J16102J25205J31880J12006J09508R8429R2560R4080J05597P6879
13402A2984207R9678Q2837Q1154R3618P4759P7132R4067P0702N2998N4207M2209
$$ plain form
13471 5579405 5649762 5732124 5817070 5893272 5977619 6065123 6151312 6234785 6333668 6405488 6479565
13460 6479565 6570322 6670064 6753689 6833083 6929809 7049672 7154677 7270930 7407919 7517229
13450 7517229 7623345 7720367 7822377 7932467 8042444 8136496 8240962 8364124 8469334 8585905
13440 8585905 8697983 8801807 8912939 9012387 9130211 9264778 9405062 9537855 9644205 9760840
13430 9760840 9883746 10001085 10122051 10250965 10371224 10509299 10652815 10772048 10874642
13421 10874642 10990185 11120805 11228795 11348619 11463501 11587860 11729027 11829412 11921961
13412 11921961 12038063 12163268 12295148 12407154 12516662 12615091 12707651 12801731 12907328 12984207
13402 12984207 13083885 13166722 13247876 13341494 13416253 13493385 13587452 13658154 13711152 13765359 13807568
13391A3807568M1226N1728M7727L6245K5375K2880K6016L1483K6176k661q519
13380A4105244j2451k743r705j5589N273j0309k2521l9475l2099l8292n4045o0616
13368A3812672l6391m2041n4293o0633n9705q1817p9424r8370p0841q4735q5919
13357A3058503p1520r1741j28619r0509p1236j03276j02112r9087q8224r1150
13347A2121029j08965j32974j16476j10206j02443j21557j24123j12286j14433
13338A1077566j03207j03957j20207r7397j08644j35551j30664j04187j00265
13329A0073487r9091j06237j14324j20663j00931j07365j03590r6206q6720r2071
13319I046289j08757j05032j31279j12568r1362j02109j06257r4520q5690q7607
$$ plain form
13391 13807568 13848794 13900522 13948249 13984494 14009869 14032749 14058765 14090248 14116424 14113763 14105244
13380 14105244 14092793 14090050 14080345 14064756 14070029 14059720 14037199 13997724 13965625 13927333 13873288 13812672
13368 13812672 13776281 13734240 13679947 13619314 13559609 13477792 13398368 13299998 13229157 13144422 13058503
13357 13058503 12986983 12895242 12766623 12676114 12604878 12501602 12399490 12300403 12212179 12121029
13347 12121029 12012064 11879090 11762614 11652408 11549965 11428408 11304285 11191999 11077566
13338 11077566 10974359 10870402 10750195 10652798 10544154 10408603 10277939 10173752 10073487
13329 10073487 9974396 9868159 9753835 9633172 9532241 9424876 9321286 9225080 9138360 9046289
13319 9046289 8937532 8832500 8701221 8588653 8497291 8395182 8288925 8194405 8108715 8021108
13309H021108q6460j02436j07587r4765r3095q5846r1343r7506j02626p5608p1533
13298G012303o6333q9872p6669p8357o9593o8773p7520p5708q0759p3697q6964
13287F168058r6997o3645n1543o8490p7732q7140o5451l8793o5337o9818n5255
13276E427857p2661n8670n0322m4041m0937n1000o1228m6195p1169p6783m2577
13265D812274m1946l6059n5872o7233l2922l3865m4693o7573p5111m5806l3103
13254D278091l0915l5002l3637m9412n1957l8578m2641l4737l6974m9905l6029
13243C838304k6794l5679m3638k9093l7653l7141l4775k6142l9075l6559m4852
13232C446903m0656k7722l1101k2559l4898k5835l7589n2612l5591j6177j3495
$$ plain form
13309 8021108 7934648 7832212 7724625 7629860 7536765 7450919 7359576 7262070 7159444 7083836 7012303
13298 7012303 6945970 6856098 6779429 6701072 6631479 6562706 6485186 6409478 6328719 6255022 6168058
13287 6168058 6071061 6007416 5955873 5887383 5809651 5722511 5657060 5618267 5552930 5483112 5427857
13276 5427857 5355196 5296526 5246204 5202163 5161226 5110226 5048998 5002803 4931634 4854851 4812274
13265 4812274 4770328 4734269 4678397 4611164 4578242 4544377 4499684 4432111 4357000 4311194 4278091
13254 4278091 4247176 4212174 4178537 4129125 4077168 4038590 3995949 3961212 3924238 3874333 3838304
13243 3838304 3811510 3775831 3732193 3703100 3665447 3628306 3593531 3567389 3528314 3491755 3446903
13232 3446903 3406247 3378525 3347424 3324865 3289967 3264132 3226543 3173931 3138340 3122163 3108668
13221C108668k8843k8060l1898k9309l4406l1403N022j6694m2587m3917j3714
13210B812859j0464k0241k9251k7666k5233m5300l2404j6226k8988k8915n011
13199B543160K36q845k4380j5153k6774m0750j2323j4902k5477j8598l4130k9446
13187B292618j4251r253j1703J2919j5701l4192k2222j1471k2123j173n088j6397
13175B141963q502j8886j6451k217jk4933m5654m5235j5328R905K353k0721l0841
13162A925452l4441k9696L123K5240l824m4523k6029p715R376j5169j0327j5181
13150A776286j3964k04k4241l8267j1878J5494n258l5386k2188k1748k3200j0574
13138A584872j412l692l357k2120r132p883J0885m883k8237l5351K660J3596n677
$$ plain form
13221 3108668 3079825 3051765 3019867 2990558 2956152 2924749 2929771 2913077 2870490 2826573 2812859
13210 2812859 2802395 2782154 2752903 2725237 2700004 2654704 2622300 2606074 2577086 2548171 2543160
13199 2543160 2543396 2534551 2510171 2495018 2468244 2427494 2415171 2400269 2374792 2356194 2322064 2292618
13187 2292618 2278367 2269114 2257411 2270330 2254629 2220437 2198215 2186744 2164621 2163448 2158360 2141963
13175 2141963 2133461 2114575 2098124 2095907 2095906 2070973 2025319 1980084 1964756 1974661 1977014 1956293 1925452
13162 1925452 1891011 1861315 1864438 1889678 1885854 1841331 1815302 1807587 1816963 1801794 1791467 1776286
13150 1776286 1762322 1762118 1737877 1699610 1687732 1703226 1697968 1662582 1640394 1618646 1595446 1584872
13138 1584872 1583460 1579768 1576411 1554291 1545159 1537276 1548161 1543278 1515041 1479690 1482350 1495946 1490269
13125A490269l444j0066k6959j6483j2991j1165P63P036J0474q211k5827k9573
13113A363823j0763j3721Q563K991r581k6178J4356J93l646j3876j4382k4309
13101A273470j789o218j3762p946m013o593J642j04j025j4102J746j0505k8572
13088A182229j8273K435j452j9019n488m335N109j1926O133o036L995Q9j2981
13075A120480n089j4367j9186Q825J1372j8019l510l813j1854rm407l813q535
13062A048075l203O307J345O647k2712k1717M977J0760j256m594j6974r910P676
13049A005421k80K937j6552q429j1337j6162k7917m171j9649l928J2352n359j0302
13036H96624J7136r784k384J470m541m925j8628M06j291q041m962L093j2760n568
$$ plain form
13125 1490269 1486825 1476759 1449800 1433317 1420326 1409161 1409924 1416960 1427434 1419223 1393396 1363823
13113 1363823 1353060 1339339 1347902 1350893 1341312 1315134 1329490 1329683 1326037 1312161 1297779 1273470
13101 1273470 1271681 1265463 1251701 1243755 1239742 1233149 1234791 1234687 1233662 1219560 1221306 1210801 1182229
13088 1182229 1163956 1166391 1164939 1145920 1140432 1136097 1141206 1129280 1135413 1129377 1133372 1133461 1120480
13075 1120480 1115391 1101024 1081838 1090663 1102035 1084016 1080506 1076693 1064839 1064830 1060423 1056610 1048075
13062 1048075 1044872 1051179 1052524 1059171 1036459 1014742 1019719 1030479 1029223 1024629 1007655 997745 1005421
13049 1005421 1005141 1008078 991526 983097 971760 955598 927681 923510 903861 899933 912285 906926 896624
13036 896624 913760 903976 901592 903062 898521 893596 874968 875374 874083 866042 861080 864173 851413 845845
13022H45845M893l714q947l580O136J999j953R376N998j2337k2687p830j2025
13009H01174J1009l217o261M136j1600l556q19j0456r207j757j1027k413P038
12996G63044P610j696j2375j943j5966j5277q300M019p509J4808O8j7652k1887
12983F86944k866J7801J6267l934R360j993j044n266J927P765k772l0963r246
12970F81980m02j1521n35N728k454j5546j7586j0936J6611J7766j1130j0961N108
12957F46122N120o292n008J3139j3572R63L639N210q697j3539j3853q192r240
12944E95800j1121J1104P694J188J108M234k6076j0245L135R776R163j2323k413
12931E81024R026n841O059n905J664m783p711p340o190o805Q787J8141n055l815
$$ plain form
13022 845845 850738 847024 838077 834497 840633 842632 840679 850055 856053 843716 821029 813199 801174
13009 801174 812183 808966 802705 806841 795241 791685 790866 780410 771203 769446 758419 756006 763044
12996 763044 770654 768958 756583 754640 738674 723397 715097 719116 711607 726415 726483 708831 686944
12983 686944 684078 701879 718146 714212 723572 721579 720535 715269 717196 724961 722189 691226 681980
12970 681980 681578 670057 669522 675250 672796 657250 639664 628728 645339 663105 651975 641014 646122
12957 646122 651242 644950 639942 653081 639509 640472 644111 649321 640624 627085 613232 605040 595800
12944 595800 584679 595783 603477 604665 605773 610007 583931 573686 576821 586597 595760 583437 581024
12931 581024 590050 584209 590268 584363 586027 581244 573533 566193 560003 553198 561985 580126 575071 571256
12917E71256j447o389r712j3063p866j5471o190N438N342J9359L925j4258j7712
12904E13212j848P292K010l21k4787K4564M036n853j9077n755O454R861j1722
12891D98066j581j585j2582O28J6379j308j239M734J162k896j2909J5335J0137
12878E12341j3534j1353p512j510J4313L149j22K171q167l507J154P293n778o182
12864D82756k4426j6574N563J4319L833n049R73J9811j561n577k3552k7592p082
12851D15842j5330M376K1997N086k658J3064l096p588R060J1811m458l401N788
12838D50493n096j6157m016K784J3779J2017j2623M743R765j3020P391q472k3800
12825D17788j781J8866R914j2358k3423k1018L030j701J2078M228N664O805J08
$$ plain form
12917 571256 569809 563420 553708 540645 532779 517308 511118 516556 521898 541257 545182 530924 513212
12904 513212 511364 518656 520666 520345 495558 520122 524158 518305 499228 493473 499927 509788 498066
12891 498066 496485 494900 482318 482946 499325 498017 496778 501512 502674 499778 486869 502204 512341
12878 512341 498807 487454 479942 478432 492745 495894 495772 497943 489776 486269 487423 494716 488938 482756
12864 482756 458330 441756 447319 461638 465471 460422 461395 481206 479645 474068 450516 422924 415842
12851 415842 400512 404888 426885 431971 429313 442377 439281 431693 440753 452564 448106 444705 450493
12838 450493 445397 429240 425224 428008 441787 453804 441181 445924 455689 442669 450060 441588 417788
12825 417788 416007 434873 444787 432429 409006 387988 391018 389317 401395 405623 411287 418092 418200
12812D18200k0816P873j982K372J940K996q426K1201L709o29j1065j7310q655
12799C89408n049k473P220j1094M931L3612K3938j0473j768j0608k0750k0715
12787C76179Q871m59o627m519j0213J873m824O780j5769L644J9131o570j0554
12774C56943O010J6546K1379R772j0416R36K884o806k2798m68j0846m805K231
12761C60562J4969j414r859O14n211j0762K238J0740p868l100L851M344P19n362
12747C54461k0255r341o897R50K1372N582P404J884j5752p924k737R854K931M986
12733C46518N849m942r276n442j2682k486j068K034J1565J0081L529R502j3964
12720C39218o193J986J9047j9698j5054M620j3386n097K556L562k952J3025P225
$$ plain form
12812 418200 397384 405257 403275 405647 407587 410583 402157 423358 427067 426438 415373 398063 389408
12799 389408 384359 381886 389106 378012 382943 416555 440493 430020 428252 417644 396894 376179
12787 376179 385050 384591 377964 373445 363232 365105 360281 367061 351292 354936 374067 367497 356943
12774 356943 362953 379499 400878 410650 400234 401170 404054 397248 374450 373982 363136 358331 360562
12761 360562 375531 374117 364258 364872 359661 348899 351137 361877 354009 350909 354760 359104 359823 354461
12747 354461 334206 324865 317968 318918 340290 345872 353276 355160 339408 331484 328747 338601 341532 346518
12733 346518 352367 347425 338149 332707 320025 317539 316471 318505 330070 340151 343680 353182 339218
12720 339218 333025 335011 354058 334360 319306 323926 310540 305443 307999 311561 308609 321634 328859
12707C28859J5006j8841o685P459k86j6828k464J6852k630m241r465l598J7360
12694C20498J1933M928j5599K225Q478P135J4644j0737p862j195j1453j915l536
12681C17544p757J205l867k4613J4556J8097m888j3728k3782o969K1296N512j7729
12668B74877L148O947J776j2592l893k870K1576K3537K1983j5657l5301j5310
12656B68221j2414P552J9482J97J2261q545M437J7436J3917J1982r358P380j9368
12643C13180k091O902j3861n276J4388p77j0886j4306J3735k219k1977j0628J1676
12630B77860L245j0716j895J1299q78m852P048o564L24q118r946j4482J8649Q210
12616B69184K3528J9951J2303P615M03j3671k0639q457P146q253n966j686J288
$$ plain form
12707 328859 343865 325024 318339 325798 325512 308684 306220 323072 320442 316201 306736 303138 320498
12694 320498 332431 337359 321760 323985 332463 339598 354242 343505 335643 334448 322995 321080 317544
12681 317544 309787 310992 307125 282512 297068 315165 310277 296549 272767 265798 287094 292606 274877
12668 274877 278025 284972 286748 274156 270263 267393 288969 312506 334489 318832 283531 268221
12656 268221 255807 263359 282841 283038 295299 286754 291191 308627 322544 334526 325168 332548 313180
12643 313180 311089 317991 304130 298854 313242 312465 301579 287273 301008 298789 276812 266184 277860
12630 277860 281105 270389 268494 279793 278915 274063 281111 274547 274871 266753 256807 242325 260974 269184
12616 269184 292712 312663 324966 332581 332984 319313 298674 290217 297363 289110 283144 281458 282746
12603B82746O712p355l142J3757Q601j2475m428M071J1181J121j4193k230o71
12590B83695j013j6141m863J6742Q326j0839k4553J2973K3250j2355j5847Q149
12578B67524K4988J1388k3625j256J1914J98O155j1235j9440q968O811Q45m778
12565B60521m364j740P55J1301J0383p501K597m282O383P383q798k3782r563J1555
12551B50848O319p167L0147j1932j4580o873k268Q613J910J7036M432p051j2482
12538B56952N098p122j1850J7863K0106j6056j4847O840j408l776J764Q469P12
12525B62745j3322m560L9552J0211j1999k8274r26L545J4139J1093k619j6976
12513B62609j7444p908Q044P706L337Q67J2475J1770l335n914J211j270j0321
$$ plain form
12603 282746 289458 282103 278961 292718 301319 288844 284416 288487 299668 300789 286596 284366 283695
12590 283695 282682 266541 261678 278420 286746 275907 251354 264327 287577 275222 259375 267524
12578 267524 292512 303900 280275 279019 290933 291131 297286 286051 266611 257643 264454 265299 260521
12565 260521 256157 254417 255172 266473 276856 269355 271952 267670 274053 281436 272638 248856 239293 250848
12551 250848 257167 250000 280147 268215 253635 246762 244494 253107 255017 272053 276485 269434 256952
12538 256952 262050 254928 243078 260941 281047 264991 250144 256984 255576 251800 253564 262033 262745
12525 262745 249423 244863 284415 294626 282627 254353 253427 256972 271111 282204 279585 262609
12513 262609 245165 237257 245301 253007 256344 257211 269686 281456 278121 272207 273418 272148 261827
12500B61827o496M1k866J9308M290p214o874J7485l150j9037l1050r885R514j008
12486B24885P389M598J4833K1790j4489j1746J6802p648l634J5617l113J910R628
12473B76822j7837R7M829p32J0848N583j560j961j6410k0941m106K763j729J217
12459B36883J2087J864n244Q758J8357Q588k1692j3272j0652K496J6763k077o568
12446B46291j2939L360J6813K3187K4505j4367m916n74Q596K1675l736r191o034
12433B92670n212j4482k0449q631R026R332N901J888r740n670N945Q822k363n95
12419B66442q180R787J3597R484o788j9350l871K3407m183j3373N346O28m457
12406B68489k542J290m843J5812m043N115o0k223n107P85m491O87j0750m292P093
$$ plain form
12500 261827 255331 255372 252506 271814 276104 268890 262016 279501 276351 257314 226264 216379 225893 224885
12486 224885 232274 236872 251705 273495 259006 247260 264062 256414 252780 268397 265284 267194 276822
12473 276822 258985 259082 263911 263179 274027 279610 278050 276089 259679 238738 234632 237395 235666 236883
12459 236883 248970 250834 245590 254348 272705 281293 259601 246329 235677 238173 254936 252859 246291
12446 246291 233352 236712 253525 276712 301217 286850 281934 281360 289956 311631 307895 298704 292670
12433 292670 287458 272976 252527 243896 252922 262254 268155 270043 260303 254633 260578 269400 267037 266442
12419 266442 258262 268049 281646 291130 284342 264992 261121 284528 280345 266972 272318 272946 268489
12406 268489 265947 267237 262394 278206 274163 279278 279218 276995 271888 272673 268182 268869 258119 253827 260920
12391B60920O888J0878j941K4697m808k602q834r892Q352L763j5329k0866k561
12378B48665j1279J049p23N556J8607k625m271N089R255L215L150M219j9536l875
12364B56496K708M56J004J0814O852j0770n807k519L257J6786O779l93k079L650
12350B87234j1158Q618O809m091k85M698J0157q907k999j6985K0125L166q13J2151
12336C07720L976n249L530J1015k8250r358K2857J257n48r828j2631R571J8895
12323C12957q719o287j3251O1j351K3240K0058n681q650j561r226j9123k191O56
12309B80932p25L32J4372J6115O147p57O188o511k533m073J1500j5943m735L330
12295C03639L1248m947L926m8j4243j5969m047J5710N14n356l51j0177j928K4442
$$ plain form
12391 260920 267808 278686 276745 301442 296634 294032 285198 275306 283658 287421 272092 251226 248665
12378 248665 237386 238435 237712 243268 261875 259250 254979 260068 269323 272538 275688 279907 260371 256496
12364 256496 259204 259660 260664 271478 278330 267560 261753 259234 262491 279277 286056 285663 283584 287234
12350 287234 276076 284694 291503 287412 287127 291825 301982 293075 290076 273091 293216 296382 295569 307720
12336 307720 311696 306447 309977 320992 292742 283384 306241 307498 306950 297122 284491 294062 312957
12323 312957 304238 297951 284700 284761 283410 306650 326708 321027 312377 310816 301590 282467 280276 280932
12309 280932 280207 280539 294911 311026 317173 316416 322604 316093 313560 309487 320987 305044 300309 303639
12295 303639 334887 329940 333866 333818 319575 303606 299559 315269 315783 310427 310076 299899 297971 322413
12281C22413M190j9155Q539Q612P640j4782K827k47L932J0827N147J6833J089
12268C57865p469k264o015N576J2836j1220k257J9144J5803J822J1221K888O245
12255D04175J38p68k574j3576k7867O276J3927K729n124o491M638J423j0663J6507
12241C82750J0910m10M816j1498J0032o581j1448j176M14m775O278k67J8213O700
12227D03958j0887m09p807l370J7115m631j3131q064J1194K8171K760l080N627
12214D17446P637n845l256j1735L987J1905o584q458J3040J6198Q571k351r172
12201D31383j0821K5697j4094j4228k891r02P028K981Q499K220p067J3809K7106
12188D68720J0835o208j814l101j1839P296K025j0029O506O326N724O326k311
$$ plain form
12281 322413 326603 307448 315987 324599 332239 317457 320284 320037 323969 334796 339943 356776 357865
12268 357865 350396 348132 342117 347693 360529 349309 347052 366196 381999 383821 395042 397930 404175
12255 404175 404313 403545 400971 387395 359528 365804 379731 382460 377336 370845 375483 376906 366243 382750
12241 382750 393660 393250 398066 386568 396600 390019 378571 377395 377809 373034 379312 379045 397258 403958
12227 403958 393071 392662 384855 381485 398600 393969 380838 372774 383968 412139 414899 411819 417446
12214 417446 425083 419238 415982 404247 408234 420139 413555 405097 418137 434335 442906 440555 431383
12201 431383 420562 446259 432165 417937 415046 414144 421172 424153 432652 434872 427805 441614 468720
12188 468720 479555 473347 471533 468432 456593 463889 465914 455885 462391 468717 474441 480767 478456
12175D78456J1770J0996n756o964l876M29K011R738J7400N129J061j6748O298
12162E09944J2578M748O629l231N667N986M624m431p110K1169J6316K6762O685
12149F06336j0166k530J1785O18j7572L697J0520Q116J8058J1618p002P222J3409
12136F54109N661q00L886J1788j5617j2328Q268J6978j33L508J243r379j171k420
12122F63593J881K1195K1307l375j0955o145J2114k80K728j0386L205N796n68
12109G00110J2747L0465P261o332j5386K6758J9415J8764J1097L1179J7378K2179
12097H75635K5820J2857R209K3862K8684K1158K6646j3167p059J583j1913j5120
12085I78195K270j5115l309j2632j6460j2857P409L146j930m087k813m675k804
$$ plain form
12175 478456 490226 501222 495466 488502 484626 485055 487066 496804 514204 519333 520394 503646 509944
12162 509944 522522 527270 533899 530668 536335 542321 546945 542514 535404 556573 572889 599651 606336
12149 606336 596170 593640 605425 606043 588471 592168 602688 610804 628862 640480 633478 640700 654109
12136 654109 659770 658970 662856 674644 659027 646699 654967 671945 671812 675320 676563 667184 666013 663593
12122 663593 665474 686669 707976 704601 693646 687501 699615 699335 702063 691677 694882 700678 700110
12109 700110 712857 743322 750583 744251 728865 755623 775038 793802 804899 836078 853456 875635
12097 875635 901455 914312 923521 947383 976067 997225 1023871 1010704 1003645 1005228 993315 978195
12085 978195 980465 965350 962041 949409 932949 920092 927501 930647 928717 924630 921817 917142 914338
12072I14338K2643J5152j9217j5343O898J5483M446J6398j4321K180Q483Q803
12060I65943J8616K2664m636J4639K323J2740L3607K0653L5066J6228L2268K6923
12048A197034L4676J9854o174j8054J99o439j8026j2915l657j8557j3783Q49n315
12035A149692r732k1145K061J6111Q753N824J4219P632M681J052j6587j1001J1314
12022A162874J2940J4382o238L653j4266Q806J0855O990N861M2694Q285j687Q158
12009A263307O149p520J8488K2949J5093J6309J8473j5594r676M35j1287P775
11997A324901R683j873k391Q98K471K6151J8232K638J7050m191j6692j3848j4162
11984A348867p138p450n077O789l077J7402J4533K1233J907J63n257P088J0141
$$ plain form
12072 914338 936981 952133 932916 917573 924471 939954 944400 960798 946477 948657 957140 965943
12060 965943 984559 1007223 1002587 1017226 1019549 1032289 1065896 1086549 1121615 1137843 1170111 1197034
12048 1197034 1231710 1251564 1245390 1227336 1227535 1221096 1203070 1190155 1186498 1167941 1154158 1155007 1149692
12035 1149692 1139960 1118815 1120876 1136987 1145740 1151564 1165783 1173415 1178096 1179148 1162561 1151560 1162874
12022 1162874 1175814 1190196 1183958 1187611 1173345 1182151 1193006 1199996 1205857 1248551 1256836 1255149 1263307
12009 1263307 1269456 1261936 1280424 1303373 1318466 1334775 1353248 1337654 1327978 1328413 1317126 1324901
11997 1324901 1334584 1332711 1330320 1331218 1333689 1359840 1378072 1380710 1397760 1393569 1376877 1363029 1348867
11984 1348867 1341729 1334279 1329202 1335991 1332914 1350316 1364849 1386082 1387989 1388152 1382895 1389983 1400124
11971A400124J6012J876K835l1757l0685m256M0691M3723n340l0550l2366N505
11959A375812J6812N150k870K0462J7279O606J5779L960k0476j3248P099J4830
11947A447195j8386j9242p609L491k3750J016P844R75Q476L549R354k452k09r315
11933A400937j514N063J5637j9698r329j206j0723j1812q711P27J1769o171q702
11920A356267j7552j2034j052J4893j2912L636P83k0630O255m610J635j6277q707
11907A289695L339l963j3167o029m415j1839j0245K901j1388j2018k373J2213
11895A232711j4168l0139k71j278R44M908L41m492j951j2490k0888j9843n388
11882A127996o544k3316M672J0944N95q68r001j2966j4730j4487n792O638j4745
$$ plain form
11971 1400124 1416136 1418012 1420847 1389090 1358405 1354149 1394840 1438563 1433223 1402673 1370307 1375812
11959 1375812 1392624 1397774 1394904 1415366 1432645 1439251 1455030 1458990 1438514 1425266 1432365 1447195
11947 1447195 1428809 1409567 1401958 1405449 1381699 1382715 1390559 1391534 1400010 1403559 1412913 1410461 1410252 1400937
11933 1400937 1399423 1404486 1420123 1400425 1391096 1389890 1379167 1367355 1358644 1359371 1371140 1364969 1356267
11920 1356267 1338715 1326681 1325629 1340522 1327610 1331246 1332029 1311399 1317654 1313044 1314679 1298402 1289695
11907 1289695 1293034 1289071 1275904 1269875 1265460 1253621 1243376 1246277 1234889 1222871 1220498 1232711
11895 1232711 1218543 1188404 1188133 1186855 1187799 1192707 1193048 1188556 1186605 1174115 1153227 1133384 1127996
11882 1127996 1121452 1098136 1102808 1113752 1114347 1113479 1104478 1091512 1076782 1062295 1056503 1063141 1048396
11869A048396j275j9594o830n717j3356k732q014r55j900n584J036k0874J0330
11856I72931L0316o509k3758j5000o456l709j5151p408J38J0360j3193l1849m0665
11843H50047J912J4187J6259K804l937j2012j3604l3025j2254r369j206j252j0954
11830G87596j154k705J3350m147k6763k4953k1287J6199J8396J4888n878q286
11818G55256k308k0291j494P217J1764r852j5626r899j0400j3284P627j1935j1009
11805F75766j4751p640j5946o539K7392m352J509o270j0009k6756j3353q465j6078
11792E74508k9825q399q669M231K524R388O699K64r004j2161o116N032N682L886
11778E38040r49k0307r113j0381o828q73j2679r280O23j1416M752N606K458n892
$$ plain form
11869 1048396 1047121 1027527 1020697 1014980 1001624 998892 990878 989923 988023 982439 983475 962601 972931
11856 972931 1003247 996738 972980 957980 951524 947815 932664 925256 925394 935754 922561 890712 850047
11843 850047 851959 866146 882405 885209 881272 869260 855656 822631 810377 801008 799802 798550 787596
11830 787596 786442 783737 797087 792940 766177 741224 719937 736136 754532 769420 763542 755256
11818 755256 752948 732657 731163 738380 750144 740292 724666 714767 704367 691083 698710 686775 675766
11805 675766 661015 653375 637429 630890 658282 653930 655439 649169 639160 612404 599051 590586 574508
11792 574508 544683 536284 527615 531846 534370 543758 550457 550721 541717 529556 523440 528472 534154 538040
11778 538040 537091 516784 507671 497290 490462 489589 476910 467630 468253 456837 461589 467195 469653 463761
11764D63761k412K1895J0067k5261j8298N923J0103j4413k7914M825n694m855
11752D17727J9662J9978j6758j6497o955O43n273j1999k1359p870J1820n514k1942
11739C55663j746J1369l68J4178j203q561k845r36p630o784r485k755J9102j3009
11725C44990p47J2817n617M148J0885p935J2745j7973o672l04r991o333J1418
11712C41431K486K599j3135j1595k2027r199m770L930j6501j0788L175J5014J0645
11699B91265O229o717k7274j1982j6120P395k497l631P097J3100j6217J574L428
11686B45650o608l932K155lj8008m072r8J6333n209L876K805k138o097J8190J4591
11671B57435o139k2947N631J8783q378l225j1553K494j0197L464J0142K109j8063
$$ plain form
11764 463761 461349 483244 493311 468050 449752 455675 465778 451365 423451 428276 422582 417727
11752 417727 437389 457367 440609 424112 417157 417800 412527 400528 379169 371299 383119 377605 355663
11739 355663 353917 365286 364918 379096 377893 369332 366487 365551 357921 351137 341652 338897 357999 344990
11725 344990 344243 357060 351443 355591 366476 358541 371286 353313 346641 346337 336346 330013 341431
11712 341431 343917 346516 333381 321786 299759 290560 285790 289720 273219 262431 265606 280620 291265
11699 291265 297494 290777 263503 251521 235401 242796 240299 236668 243765 256865 240648 242222 245650
11686 245650 239042 235110 237265 237262 219254 215182 215084 231417 226208 230084 232889 230751 224654 242844 257435
11671 257435 251296 228349 233980 252763 244385 241160 229607 232101 221904 225368 235510 237619 219556
11658B19556J1870m166j1142n987o27K64l28q255j1826J6077R201j4713J675K546
11644B04145k30O602j3365q903j3412l054K2560J1225j1314j2034j4782j2465
11632A54973N758R909k088J0179R125k7794j0623O029J0108L037R763j2840j4872
11619A50664j941n100O146R079K536P677j5027j7944K011O698n212o048j8183
11606A15356k4255J4778J5180R342r205k0803o593K0190J0620P245r427p962n365
11593A09101q591K29K369K84J874R584J2797j9708k0513J1147J5838j0298j343
11580A02770J0508K020J4950m274k158n149l451p381k174n35J77Q650J543J996
11566A17492k2054k484K5018j160o725J427J5527n575j7837j0820k217M169M555
$$ plain form
11658 219556 231426 227260 216118 210131 209504 209768 209440 201185 189359 205436 214637 199924 201599 204145
11644 204145 203915 210517 197152 188249 174837 171783 194343 205568 194254 182220 167438 154973
11632 154973 160731 170640 168552 178731 187856 160062 149439 155468 165576 168613 178376 165536 150664
11619 150664 148723 143623 149769 158848 161384 169061 154034 136090 138101 144799 139587 133539 115356
11606 115356 91101 105879 121059 130401 121196 100393 93800 113990 124610 131855 122428 114466 109101
11593 109101 100510 100739 103108 103392 105266 114850 127647 107939 87426 98573 114411 104113 102770
11580 102770 113278 115298 130248 125974 123816 118667 115216 107835 105661 105126 105303 113953 115496 117492
11566 117492 95438 92954 117972 116812 110087 111514 127041 121466 103629 92809 90592 94761 99316
11553I9316j4037n784M943J1366r231o514J5P639Q344p19k654j548j0495k727
11539G7914o457J0928Q635j339j5558j1420N006P112r62m613K340P500J6691J0276
11525A06053J3242q898k7775k263p773j5253p182J3683J2453K290j5207O17m134
11512E9853p740O645l836O229J146k523o26j241j666j799Q87p119J2326M574j5264
11497D9846j4470J1676J1956n991J1007j1853l2375O518K0867M708M688o978p272
11484D2327M042J634P151Q137j645l179j7644j0975r473J2523L5958M13k4226
11471D5043j7884O16P247l969J9106P187k342k6077m68q942m018N370J7156J4791
11457E2816j3341m815L750k071k161N609j931j0003L550L815K1357j2171j3096
$$ plain form
11553 99316 85279 79495 84438 95804 86573 80059 80074 87713 96057 95338 92684 91136 80641 77914
11539 77914 71457 82385 91020 89681 74123 62703 67709 74821 73859 69246 71586 79086 95777 106053
11525 106053 119295 110397 82622 80359 72586 57333 50151 63834 76287 78577 63370 63987 59853
11512 59853 52113 58758 54922 61151 62297 59774 59148 57907 56241 54442 55329 48210 60536 65110 49846
11497 49846 35376 47052 59008 53017 64024 52171 19796 26314 47181 51889 56577 49599 42327
11484 42327 46369 48003 55154 63291 61646 58467 40823 29848 20375 32898 68856 69269 45043
11471 45043 27159 27775 35022 31053 50159 57346 55004 28927 28459 19517 15499 20869 38025 52816
11457 52816 39475 34660 38410 36339 34178 39787 37856 27853 31403 35218 56575 44404 31308
11444C1308n634k338j0413j1265J6182L683N079K1822Q143q281j3151j0210P58
11431B5683J3333p09L84k4770j7416K6117K679q95J2855j800j9756m293k629j2573
11417c790L903J8469j3535k706Q600q011m459K87K727P089J7972O294o201o521
11403B0118J4497l335j2934r175K299l427N092p707r162O777N203o322j7371L181
11389a2266R132o042J9512N648jJ5469Q87k5083k6650J7836J3949Q027O541o1
11375B6898k486k2308j1953J770l1J2149Q47r407m036j671l146j9723J720O457
11361b4920R018j2060J4388J1398o429m395m327J7436K6568J153j1518j1843o525
11348b056k080Q790J9788j1515j4791r971J9388J8514M681l0272j8768P341J0149
$$ plain form
11444 31308 25674 23336 12923 1658 17840 21523 26602 48424 56567 48286 35135 24925 25683
11431 25683 39016 38307 38691 13921 -3495 22622 25301 24406 37261 35461 15705 11412 8783 -3790
11417 -3790 113 18582 5047 2341 10941 2930 -1529 -1242 1485 8574 26546 32840 26639 20118
11403 20118 34615 31280 18346 9171 11470 8043 13135 5428 -3734 3043 8246 1924 -15447 -12266
11389 -12266 -3134 -9176 10336 15984 15983 31452 32339 7256 -19394 -1558 12391 20418 26959 26898
11375 26898 24412 2104 -9849 -8079 -8110 4039 4886 -4521 -8557 -10228 -13374 -33097 -31377 -24920
11361 -24920 -15902 -27962 -13574 -2176 -8605 -13000 -17327 109 26677 27830 16312 4469 -2056
11348 -2056 -4136 4654 24442 12927 -1864 -11835 7553 26067 30748 476 -18292 -10951 -802
11335h02J4882n585m50o971j6217p469O060n741Q574k757L678J6176L90j7770
11321a4002j5691J6619k876L366k985j0181K360O220k0706n166P72K2041j70k3842
11307d4241K579l582J6496K8529K6146M196k4357j3443r521n473O630o943j1255
11294c4239m494R21J7166J2020p284q441P784j8571q808q04J0364J2185p20K0159
11280b762Q766k300j2190l441j5577j1214J1191Q252K479l248J2432M150l500
11267f962p006j2049j4136m210J9460J8114J0370m25Q918p985m133l192R989M373
11253A1126o620j6115l409k224k559J9142L094j3351j4990J4397O778r622o907
11240b1260L639j066j4587J1027J0079k2999k4303o306N577J6906J0337J2639
$$ plain form
11335 -802 14080 8495 8045 1074 -15143 -22612 -16552 -22293 -13719 -16476 -12798 3378 3768 -14002
11321 -14002 -29693 -13074 -15950 -12584 -15569 -25750 -23390 -17170 -37876 -43042 -42270 -20229 -20399 -44241
11307 -44241 -41662 -45244 -28748 -219 25927 30123 5766 -7677 -17198 -22671 -16041 -22984 -34239
11294 -34239 -38733 -37812 -20646 -8626 -15910 -24351 -16567 -35138 -43946 -44750 -34386 -22201 -22921 -2762
11280 -2762 6004 3704 -8486 -11927 -27504 -38718 -27527 -19275 -16796 -20044 -7612 -3462 -6962
11267 -6962 -13968 -26017 -40153 -44363 -24903 -6789 3581 3156 12074 4089 -44 -3236 6753 11126
11253 11126 4506 -11609 -15018 -17242 -19801 -659 2435 -10916 -25906 -11509 -4731 -14353 -21260
11240 -21260 -17621 -18687 -33274 -22247 -12168 -35167 -59470 -65776 -60199 -43293 -32956 -20317
11228b0317Q902j2652j1921p894L537O527J0212K484n758j323J3380P863J885
11215e075o685P800N236J733k922j004j8884o132o047K372k681r384l715K524
11201d2864m802n537J4493J9509l097r070j3727j78J1085Q744r063M76J8599J509
11187a3923j5213j5246J4815j8604J0945N969n784j0436K091N3j194q54j7283
11174f4664L985N961J2790J7339o404j0630j9059r014j691n981J1810M511j692
11161f2739N012J5095J0495m91j0416m171J1300m242j2946n997L005o632L583
11148e9144K988P555L192J1080Q295J637J4055J2650Q235k1494l7461r961J2089
11135d6284J1527P645j0916J1740J4387o117P97j0544k0092q311Q056k7334m377
$$ plain form
11228 -20317 -11415 -24067 -35988 -43882 -40345 -33818 -23606 -21122 -26880 -28203 -14823 -6960 -5075
11215 -5075 -11760 -3960 1276 3009 87 -917 -19801 -25933 -31980 -29608 -32289 -41673 -45388 -42864
11201 -42864 -47666 -53203 -38710 -19201 -22298 -31368 -45095 -45273 -34188 -25444 -34507 -34031 -15432 -13923
11187 -13923 -29136 -44382 -29567 -48171 -37226 -31257 -37041 -47477 -45386 -45333 -46527 -47381 -64664
11174 -64664 -60679 -54718 -41928 -24589 -30993 -41623 -60682 -69696 -71387 -77368 -65558 -61047 -62739
11161 -62739 -57727 -42632 -32137 -32628 -43044 -47215 -35915 -40157 -53103 -59100 -56095 -62727 -59144
11148 -59144 -56156 -48601 -45409 -34329 -26034 -24397 -10342 2308 10543 -10951 -48412 -58373 -46284
11135 -46284 -34757 -27112 -38028 -26288 -11901 -18018 -17221 -27765 -47857 -56168 -48112 -75446 -79823
11122g9823K7783K5525j0354k0051j4182M212O706p462k41P099m073M780J0801
11109d9280j329j0603R745M61j3390p71j3566l937J9862K860n554J062J9052r870
11095e5258k2710R319M310Q619N913j3306k0530M758J1474J6197O301L383N101
11082c6429j1j888j600l751K361r129k0063p046J0941O618j4995q934m551j3539
11068a02016R039j987j0122n096N945K0197K2005K9520l155j1961k5469O034n84
11055f7650J408m688j3430M226K0760K1018J315j3927L125Q185J1170j0062J5817
11042b2733m329j737l981L84J158J526l325J8926J4746L397q306l715J111L808
11028c070P265O916N720R006J3083j733j2758L652O024N72N987J6929O44K3373
$$ plain form
11122 -79823 -52040 -26515 -36869 -56920 -71102 -66890 -60184 -67646 -67887 -60788 -64861 -60081 -49280
11109 -49280 -50609 -61212 -51467 -51006 -64396 -65167 -78733 -82670 -62808 -59948 -65502 -64440 -45388 -55258
11095 -55258 -77968 -68649 -64339 -55720 -49807 -63113 -83643 -78885 -67411 -51214 -44913 -41530 -36429
11082 -36429 -36440 -38328 -39928 -43679 -41318 -50447 -70510 -77556 -66615 -59997 -74992 -83926 -88477 -102016
11068 -102016 -92977 -94964 -105086 -110182 -104237 -84040 -62035 -32515 -35670 -47631 -73100 -67066 -67650
11055 -67650 -66242 -70930 -84360 -80134 -59374 -38356 -37041 -50968 -47843 -39658 -28488 -38550 -22733
11042 -22733 -27062 -28799 -32780 -32396 -31238 -29712 -33037 -14111 635 4032 -4274 -7989 -6878 -3070
11028 -3070 4195 11111 16831 25837 38920 37187 24429 28081 34105 34677 40664 57593 58237 81610
11014H1610P487l582O786j9347j6118j3197j1306j8033J6624J2857q734J0446
11002D5493J0043n283o865r885n613j3196l5502l877J5433P47J1966P365o70j9251
10988i095l677l34j4986j9542J6800j5230m611N739j739j1289j3162N88K1992
10975d8546K2597j7518j8271K329k16J780m800l187O973J3372J1078r545j4753
10962e8707j097P038N202J2172M355j8956K643P503pj8960n437o167j9829J1101
10948g9146J760j0575p055J1816R26J1970k635n201j1927o219J9335n188M178
10935g7961j399m769J3872p927L766K2409K957k2808j7069Q103J091R567n764
10922g5932J2581P436m564k4104j2199j7556J9739O256N922r8j1128r474M524
$$ plain form
11014 81610 89097 85515 92301 72954 56836 43639 32333 14300 30924 43781 35047 45493
11002 45493 55536 50253 43388 33503 27890 14694 -20808 -24685 -9252 -8505 3461 10826 10156 -9095
10988 -9095 -12772 -13106 -28092 -47634 -30834 -46064 -50675 -44936 -46675 -57964 -71126 -70538 -48546
10975 -48546 -25949 -43467 -61738 -59409 -59625 -57845 -62645 -65832 -58859 -45487 -34409 -43954 -58707
10962 -58707 -59804 -52766 -47564 -35392 -31037 -49993 -47350 -39847 -39854 -58814 -64251 -70418 -90247 -79146
10948 -79146 -77386 -87961 -95016 -83200 -82274 -70304 -72939 -78140 -90067 -96286 -76951 -82139 -77961
10935 -77961 -79360 -84129 -70257 -78184 -74418 -52009 -49052 -71860 -88929 -80826 -79735 -70168 -75932
10922 -75932 -63351 -55915 -60479 -84583 -96782 -114338 -94599 -88343 -82421 -82519 -93647 -103121 -98597
10909i8597J2147J1194O273L964M696j9764l0646N526K1383n60j5618L566N482
10896i0954J1244J1747L484k7660k5257K7997K5312o467j1326J4950P206o737
10884f6461j9830q466J7890K832k4974j579M631L958q218j782J8342o616J554
10871h8719J5908l643j2312R394L807j8065K155J3549M922J1310K519k981j0162
10858g2318j9535l292o542m970J7634Q68k164J6967J2097J7787l022k0311O415
10845f0386j2926R760J1884j362j4921j0458q177j9502K316N025J9142J2393O069
10832f1143J019m821m931j1616j2507k299o680J7167K1643l771m179j9435m529
10819i6082P61o630P92j9771j0685K193N767j6162N054l408J2790L0327r180m20
$$ plain form
10909 -98597 -86450 -75256 -68983 -65019 -60323 -80087 -110733 -105207 -83824 -84384 -100002 -96436 -90954
10896 -90954 -79710 -67963 -64479 -92139 -117396 -89399 -64087 -70554 -81880 -66930 -59724 -66461
10884 -66461 -86291 -94757 -76867 -74035 -99009 -100588 -95957 -91999 -100217 -101999 -83657 -90273 -88719
10871 -88719 -72811 -76454 -88766 -79372 -75565 -93630 -91475 -77926 -73004 -61694 -59175 -62156 -72318
10858 -72318 -91853 -95145 -101687 -106657 -89023 -88155 -90319 -73352 -61255 -43468 -46490 -66801 -60386
10845 -60386 -73312 -63552 -51668 -53030 -67951 -78409 -86586 -106088 -103772 -98747 -79605 -67212 -61143
10832 -61143 -60124 -64945 -69876 -81492 -93999 -96298 -102978 -85811 -64168 -67939 -72118 -91553 -96082
10819 -96082 -95321 -101951 -101159 -120930 -131615 -129422 -123655 -139817 -134763 -138171 -125381 -95054 -104234 -104654
10805a04654J6653K415j3418j0370q22J2503o251j2034k1811R543P957M481p501
10792a23309l568P231n059K277L580J4315m430k4219P758J2537J2035J511p934
10779a07275O901j04L550Q553m482q821L818p930j0990j5252k8615J3119J6301
10766a31227L193J3324K0282M713R82j867P858J8115j7619j3324M390j846R345
10753h3681J996q997k8595q606n058J6237J5896K817K928Q697Q487j381l308R624
10739g2944m187j4918n876j1382l042O037K282q252j4954j1264L790J4462K406
10726a17842M853J0676O781J3194J187K723J0313J5m084j8183R63p510o087p077
10712a10078M044n144J751m25j0579l456j935Q941o56j2408M768J7681J0156j6856
$$ plain form
10805 -104654 -88001 -85586 -99004 -109374 -110196 -97693 -103944 -115978 -137789 -128246 -120289 -115808 -123309
10792 -123309 -126877 -119646 -124705 -122428 -118848 -104533 -108963 -133182 -125424 -112887 -100852 -99341 -107275
10779 -107275 -100374 -100478 -96928 -88375 -92857 -101678 -97860 -105790 -116780 -132032 -160647 -147528 -131227
10766 -131227 -128034 -114710 -94428 -89715 -88733 -90600 -82742 -64627 -82246 -95570 -91180 -93026 -83681
10753 -83681 -81685 -90682 -119277 -127883 -132941 -116704 -100808 -97991 -95063 -86366 -77879 -79260 -82568 -72944
10739 -72944 -77131 -92049 -97925 -109307 -112349 -106312 -104030 -112282 -127236 -138500 -134710 -120248 -117842
10726 -117842 -112989 -102313 -95532 -82338 -81151 -78428 -68115 -68100 -72184 -90367 -89404 -96914 -103001 -110078
10712 -110078 -106034 -111178 -109427 -109852 -120431 -123887 -125822 -116881 -117537 -129945 -125177 -107496 -97340 -114196
10698a14196j5000k2186q090q877r137J2917m869J1749J2383O23P749q240j4456
10685a59630m829j405j5540J0899Q066r406J1464J9136M646j0822N21J5117J0668
10672a21115P296J2360K8959O099j2636P113J5961J168J482q310j1738k168o156
10659h1685l428N848k3984l578J2905O78j0077r170j5665j0666J5806J3793k680
10646a11903P330K3907K9699J2200j4952M044K5615j3022k043M61J2416K6164
10634h4p43J1143K0026J5312K1081R689J9039N2911N6829M5717O5018O0070N4971
10621D30979N7749P2752Q6733J56287J93833K41552L57271M70786O04124P84800
10611C456866R88207J186785J287906J218570R27406M95400L5670l08669m25234
$$ plain form
10698 -114196 -129196 -151382 -159472 -168349 -177486 -164569 -169438 -157689 -145306 -144683 -136934 -145174 -159630
10685 -159630 -164459 -165864 -181404 -170505 -162439 -171845 -160381 -141245 -136599 -147421 -146900 -131783 -121115
10672 -121115 -113819 -101459 -72500 -66401 -79037 -71924 -55963 -54795 -53313 -61623 -73361 -75529 -81685
10659 -81685 -85113 -79265 -103249 -106827 -93922 -93244 -103321 -112491 -128156 -138822 -123016 -109223 -111903
10646 -111903 -104573 -80666 -50967 -38767 -53719 -49675 -24060 -37082 -39125 -38664 -26248 -84
10634 -84 -827 10316 30342 45654 66735 76424 95463 148374 205203 250920 315938 376008 430979
10621 430979 488728 561480 648213 804500 998333 1239885 1597156 2067942 2672066 3456866
10611 3456866 4445073 5631858 6919764 8138334 9065740 9561140 9596810 9288141 8862907
10602H862907l28809p632M65838J040566J637275K115939K193879J675492P15356
10593A8370811k74423r38741j154202r70193m05311M05095J292790K124704K667575
10584B1118105K586381J672125J81752j246826k168759k495174k272155j617155
10576A5758294p51929J10020Q38279J255995J151217M81032n17244j431242j975181
10567A4919241k077643j843755j356959q30403l30358O2126K20482J42353j55219
10558H749865n45687q84969j081776j121479j036544q59772o42677m66740l76675
10549A733546k65197j96464j66622j31209r9109j04645r1536q2753p2440n6136
10539D67435m9016k4608l1658l5124j7158m1833j2614k047m231o276k4831R829
$$ plain form
10602 8862907 8534098 8526466 8992304 10032870 11670145 13786084 15979963 17655455 18370811
10593 18370811 18096388 17157647 16003445 15033252 14627941 15033036 16325826 18450530 21118105
10584 21118105 23704486 25376611 25558363 24311537 22142778 19647604 17375449 15758294
10576 15758294 15006365 15116385 15954664 17210659 18361876 18842908 18325664 16894422 14919241
10567 14919241 12841598 10997843 9640884 8810481 8480123 8542249 8762731 8905084 8749865
10558 8749865 8204178 7319209 6237433 5115954 4079410 3219638 2576961 2110221 1733546
10549 1733546 1468349 1271885 1105263 974054 874945 770300 678764 596011 523571 467435
10539 467435 418419 393811 362153 327029 309871 268038 255424 253377 249146 242870 218039 227868
10527B27868K644j9404K630J2607Q546L087k648k399n215j8521j5577j4382j6082
10514A63154j2120R130k3120m1994j2451j043l909K746n605m374n679J6606K6625
10501A07966j7254k0298M683p957j8097o230K1890K4512j0951j8558P645o940
10489F0411j42R874j3014p847Q523J6222p845O572J7359p018l600O582J3348J7580
10475A17005K6262L4963K3548K4480N7552N0520M5354N5370Q6857J41775J70514
10464H34200J94037K22160K47014K28632J61485R9408M1689p6851j52907k26006
10454A572861k58638k56796k08190j59571j33458r2341n5964l8240m0313k9576
10444B99774m5658m1465l9621l4648l215k0997l1967j5942j1276Q105j5880k4246
$$ plain form
10527 227868 230512 211108 213738 226345 234891 237978 235330 232931 227716 209195 193618 179236 163154
10514 163154 151034 160164 137044 95050 82599 81556 77647 80393 74788 70414 64735 81341 107966
10501 107966 90712 70414 75097 67140 49043 42813 64703 89215 78264 59706 67351 60411
10489 60411 60269 70143 57129 49282 57805 74027 66182 72754 90113 83095 79495 86077 99425 117005
10475 117005 143267 178230 201778 226258 283810 334330 379684 435054 521911 663686 834200
10464 834200 1028237 1250397 1497411 1726043 1887528 1986936 2028625 1951774 1798867 1572861
10454 1572861 1314223 1057427 849237 689666 556208 463867 407903 369663 329350 299774
10444 299774 254116 212651 173030 138382 135167 114170 82203 66261 54985 63090 47210 22964
10432B2964j6264K1263R31j3594r982j2875K781j535R070k552j562n936p589J169
10418a3711J6203J6802j1054K089O296j912j5244J0633n139m5029m1341j2492
10406i3899m3877p4345o9074o6137m5683j8381k50M7027N5712Q6083P9325O3131
10394h0368N3449L6825K1029M031L274P288o127k8841r875J5303q970j5777j7660
10381b6419J308Q198J5059j4887j0173R175K3186j4662j2934P974k672k680Q989
10368a0538R940J9075K7168N197J6285K4886o89N934O646j0099N838j5067k9248
10355E5328j89K839l0693j0796J8468L0359K3464K3132N013K4784L1342J7444
10343A90495L1326L6836N2585M3111j0892m8480m6399l7629l0649k9958l9364
$$ plain form
10432 22964 6700 27963 28894 15300 5318 -7557 -4776 -6311 2759 207 -1355 -7291 -14880 -13711
10418 -13711 2492 19294 8240 10329 16625 14713 -531 10102 4963 -40066 -81407 -93899
10406 -93899 -137776 -212121 -281195 -347332 -393015 -411396 -411646 -364619 -308907 -222824 -143499 -80368
10394 -80368 -26919 9906 30935 34966 38240 45528 39401 10560 685 15988 7018 -8759 -26419
10381 -26419 -25111 -16913 -1854 -16741 -26914 -17739 5447 -9215 -22149 -14175 -16847 -19527 -10538
10368 -10538 -598 18477 45645 50842 67127 92013 91324 97258 103904 93805 99643 84576 55328
10355 55328 55139 57978 27285 16489 34957 65316 88780 111912 116925 141709 173051 190495
10343 190495 221821 258657 311242 354353 343461 294981 248582 210953 180304 150346 110982
10332A10982j9535q591J8088K8021K3213L2285L787J3567J3800K7164K3218J1383
10320B77382K2750M3919M4249L6638K5758J1941O082J7918j8467j4876j7085l0388
10308D05821m5877k8097o502r888r035j0043k7443o815J87l577L803M829M788
10295B72151P962J0998J6328J2160q820q731o702K766J8990J8085K0766Q161K4216
10282C88330J6937K3713K0621L0732L4941L0297L3449J9072J2375K3980K3622
10271F58069N2355M8402N0889L8955L5301N0456P8488O4512P2306Q6679N3377
10260A289789N1196M6219O0577L6943L6995M1061M2345O6068P5998J10186J29654
10249A987031J54680J96597K51435K72687K62570K70495K88992L08093L59986
$$ plain form
10332 110982 91447 82856 100944 128965 152178 184463 188250 201817 215617 242781 265999 277382
10320 277382 300132 344051 388300 424938 450696 462637 468719 486637 468170 453294 436209 405821
10308 405821 359944 331847 325345 315457 306422 296379 268936 262121 262308 258731 262534 267363 272151
10295 272151 280113 291111 307439 319599 310779 302048 295346 298112 317102 335187 355953 364114 388330
10282 388330 405267 428980 449601 480333 515274 545571 579020 598092 610467 634447 658069
10271 658069 710424 758826 809715 848670 883971 934427 1012915 1077427 1149733 1236412 1289789
10260 1289789 1340985 1387204 1447781 1484724 1521719 1562780 1605125 1671193 1747191 1857377 1987031
10249 1987031 2141711 2338308 2589743 2862430 3125000 3395495 3684487 3992580 4352566
10240D352566L74417M33454N07324N84217P05343Q32700R23967J013985J068714
10231A0796687J128463J181837J268218J434626J711625K083622K642008L435363
10223B5682449M447627N759271P567539J0015534J3468657J8322863K4906526
10216A10170466L3237312M2054700M8376083M8567332M0716484K5566698N753430
10209C54442505j5240737l3002128m3619079m6362558m3211589l6627299k8885059
10202A07494056k1864870j6367236j2314004r384454p291237n714343m526420
10195C0031492l611650k860815k278971j835075j504627j286055j160538j116520
10187A4377241j124788j111192j065432r48804q63318p27715n97115n21265m28946
$$ plain form
10240 4352566 4726983 5160437 5667761 6251978 6957321 7790021 8713988 9727973 10796687
10231 10796687 11925150 13106987 14375205 15809831 17521456 19605078 22247086 25682449
10223 25682449 30130076 35889347 43456886 53472420 66941077 85263940 110170466
10216 110170466 143407778 185462478 233838561 282405893 323122377 348689075 354442505
10209 354442505 339201768 306199640 262580561 216218003 173006414 136379115 107494056
10202 107494056 85629186 69261950 56947946 47563492 40272255 34557912 30031492
10195 30031492 26419842 23559027 21280056 19444981 17940354 16654299 15493761 14377241
10187 14377241 13252453 12141261 11075829 10127025 9263707 8535992 7938877 7417612 6988666
10178F988666l30212k95547k96050k75929l13995l02073k96008k87533k47778
10169D343541k24629j81933j67935j53277j25050j04474j17713r9751q3283o4221
10159C021275m2268n5520p1145p3593q3834q4507q0139q6380p2692m3887m6189
10148B281121l6190l3260l8765n7558m0744l8363m2658k7956r706j5333m4486
10137A896102k9707k2545o874j2405l1687j4066L698j5707k9634M689Q918r048
10125A741734k870J83N040j0830M041J968J2357j0398M187J6511J2027L3646L5017
10112A842613M7730N6130O9267N6479P7562Q7973P5050Q3626P9262R7842J32065
10101B705599J46700J42309J38602J67104J78778J88454K14451K26904K37817
$$ plain form
10178 6988666 6658454 6362907 6066857 5790928 5476933 5174860 4878852 4591319 4343541
10169 4343541 4118912 3936979 3769044 3615767 3490717 3386243 3268530 3168779 3085496 3021275
10159 3021275 2979007 2923487 2852342 2778749 2694915 2610408 2530269 2443889 2371197 2327310 2281121
10148 2281121 2244931 2211671 2172906 2115348 2074604 2036241 1993583 1965627 1955921 1940588 1896102
10137 1896102 1866395 1843850 1836976 1824571 1792884 1778818 1782516 1766809 1737175 1741864 1750782 1741734
10125 1741734 1738864 1739047 1744087 1733257 1737298 1739266 1751623 1741225 1745412 1761923 1773950 1807596 1842613
10112 1842613 1890343 1946473 2015740 2072219 2149781 2237754 2312804 2396430 2475692 2573534 2705599
10101 2705599 2852299 2994608 3133210 3300314 3479092 3667546 3881997 4108901 4346718
10092D346718K37297K81368L12924L65966M35663M97655N77727O74500P60923
10083H490741R05885J003513J125105J277992J431922J625785J849599K164576
10075A9875118K652779L280490M159274N406006P189614R870305J3789500J9447782
10067H5670868K7224377L6591702M5065287M8540865M4396980L4010431K1047144
10060C42547654O927618r165505k5766730l8582913m4789402m4793084m0254988
10053A46122650l2821219k4780686j8040171j3088618r637334p265130n609474
10046C4880018m410461l542909k930174k428186k054198j738948j525919j371985
10038A4877238j263034j168110j099154j028210r02432p64202o63111n84479n01696
$$ plain form
10092 4346718 4584015 4865383 5178307 5544273 5979936 6477591 7055318 7729818 8490741
10083 8490741 9396626 10400139 11525244 12803236 14235158 15860943 17710542 19875118
10075 19875118 22527897 25808387 29967661 35373667 42563281 52433586 66223086 85670868
10067 85670868 112895245 149486947 194552234 243093099 287490079 321500510 342547654
10060 342547654 349475272 340309767 314543037 275960124 231170722 186377638 146122650
10053 146122650 113301431 88520745 70480574 57391956 47754622 40489492 34880018
10046 34880018 30469557 26926648 23996474 21568288 19514090 17775142 16249223 14877238
10038 14877238 13614204 12446094 11346940 10318730 9416298 8652096 7988985 7404506 6902810
10029F902810m37630l77034l16294k66705k26391j77910j46922j37724j63147
10020D653053j76919j78953j90720j91518j97059j67316j54277j38885j62619
10011C094787j24687r0256p7073q2994o9940n5222m5143m3263p2444p9973m4740
10000B309052k8628k4489K774R968L3150K4158O806n577J2289o229n9292p7666
9988B196316r2284j05747j02615q3312q4649p7937o0312l6568k8113l6316m5690
9977A442773m3135j5956k1089l3350k5092k5971l9778k2836p376j7819k5395l9427
9965A125549k5170k4572j9269o631j9994j6958k0318P434m754k3918r336L508
9953I65571m393p19l664L012J5497Q142O432Q811q518j086L0542J6748J30r186
$$ plain form
10029 6902810 6465180 6088146 5771852 5505147 5278756 5100846 4953924 4816200 4653053
10020 4653053 4476134 4297181 4106461 3914943 3717884 3550568 3396291 3257406 3094787
10011 3094787 2970100 2879844 2802771 2719777 2649837 2594615 2549472 2506209 2433765 2353792 2309052
10000 2309052 2280424 2255935 2258709 2268677 2301827 2325985 2332791 2327214 2339503 2333274 2273982 2196316
9988 2196316 2104032 1998285 1895670 1812358 1727709 1649772 1589460 1552892 1524779 1488463 1442773
9977 1442773 1399638 1383682 1362593 1329243 1304151 1278180 1238402 1215566 1208190 1190371 1164976 1125549
9965 1125549 1100379 1075807 1056538 1049907 1029913 1012955 992637 1000071 995317 971399 962063 965571
9953 965571 961178 960459 956795 959807 975304 983446 989878 998689 990171 989085 1019627 1036375 1036505 1027319
9939A027319J6574L7778J4228j1412k9817n2225n7700o9498o9994n1530m5108
9928G08615l5419k2043N50o428k0153o650M576M777R84r166j6020l337J1277J878
9914F13441J0775O297j2336j8236k4509o160j772j1500k5460j5660k319j0462
9902E02099J036K8008O262l017J8226j0781k1206P739J0847o755j4778l616L474
9889E17538q166r963r795L965j5276o782r493o669k6705K919J0267L2744L3615
9876E08199L6953M6631N0349Q1953P8541M5282q284j9204l2458m1348o1123o1673
9864F23818m4408n8408n0490l2796k1311k2498j826j899j4668R709J5126Q705
9852D09054R794j4213M091J2569n525j7788m421O797l684r201n730K6487J2805
$$ plain form
9939 1027319 1043893 1081671 1095899 1084487 1054670 1002445 944745 875247 805253 753723 708615
9928 708615 673196 651153 651703 645275 625122 618472 623048 627825 628809 619643 603623 600286 611563 613441
9914 613441 624216 630513 618177 599941 575432 569272 567500 556000 530540 514880 512561 502099
9902 502099 503135 531143 537405 534388 552614 541833 520627 528366 539213 532458 517680 514064 517538
9889 517538 509372 499409 489614 493579 478303 471521 462028 455359 428654 431573 441840 474584 508199
9876 508199 545152 591783 642132 724085 802626 847908 839624 820420 787962 746614 685491 623818
9864 623818 579410 521002 470512 437716 416405 393907 392081 390182 375514 385223 400349 409054
9852 409054 418848 404635 408726 421295 415770 397982 393561 400358 396674 387473 381743 408230 421035
9839D21035O810P284n125k0675q131l68J1796R599M986j6552k6231R510M601n237
9825C93302K732J1733J417K345K3202L1399M6393N5536M7314P1656Q4200J26164
9813H97393J60375K18434K52425K52179K03827J42967L4744o2088j54353k13955
9803A731948k39248k39190k08472j43167j22632r6972o4128n9622m7009l0662
9793D80846k9424k3481k6593j8606j4740J516J8246o782r112k6318j0717L509
9781C38344j5402j1988j3666M659k578R560N810L744l569j005m992o836L009J411
9767C06501j2190k3648j3562j4932j2121j213k1212q410k268O973M273j3132r354
9754A85705R440J4917j46L412j757N440K005j0902k8796J644K7347K8447L9895
$$ plain form
9839 421035 427845 435129 430004 409329 401198 400830 412626 422225 427211 410659 384428 393938 398539 393302
9825 393302 396034 407767 409184 411529 434731 466130 512523 568059 615373 687029 771229 897393
9813 897393 1057768 1276202 1528627 1780806 1984633 2127600 2162344 2100256 1945903 1731948
9803 1731948 1492700 1253510 1045038 901871 779239 682267 618139 558517 511508 480846
9793 480846 451422 427941 401348 382742 368002 369518 387764 380982 371870 345552 334835 338344
9781 338344 322942 310954 297288 301947 299369 308929 314739 318483 314914 313909 308917 302081 305090 306501
9767 306501 294311 270663 257101 242169 230048 228835 207623 199213 196945 203918 208191 195059 185705
9754 185705 195145 210062 209916 213328 211571 217011 219016 208114 179318 180962 208309 236756 276651
9741B76651J2333K7P064r039q587n339k3P626p12j996m446j9702j0292P958j381
9726B50142o848O067O98k1764J860J808J654l310P97N058N778p546j1448J3475
9712B36421K3292J0422r443k3337l7246Q977M068r744J1287M830j109p08k603
9699B15107Q609Q09k0200J28J4505K2906K9038m621m496m321o899j5530M194l238
9685B35991p020j4547r590k530j328M857J0072L0662K6234j30P049P547K0406
9672C07673J5120J9775j0697L364L3973O7623O5151Q6227J17577J89889K13707
9661A109382K26234K43323K18279J37687P0053m244r7972j88709k30509k17012
9651A266512k08408j92235j53506j11378n7796m5386l9304k4719m7060k4203m6912
$$ plain form
9741 276651 288984 289011 296075 287036 278449 273110 273087 280713 280001 278005 273559 253857 243565 251523 250142
9726 250142 243294 249361 250059 228295 230155 231963 233617 230307 231104 236162 241940 234394 222946 236421
9712 236421 259713 270135 260692 237355 200109 209086 213154 203410 214697 219527 218418 217710 215107
9699 215107 223716 224525 204325 204453 218958 241864 270902 266281 261785 257464 250565 235035 239229 235991
9685 235991 228971 214424 204834 202304 200976 205833 215905 246567 272801 272671 279720 287267 307673
9672 307673 322793 342568 331871 335235 369208 436831 501982 588209 705786 895675 1109382
9661 1109382 1335616 1578939 1797218 1934905 2004958 2000714 1902742 1714033 1483524 1266512
9651 1266512 1058104 865869 712363 600985 543189 497803 458499 433780 386720 362517 315605
9640C15605k7774m256j0590j0021j8457l2818r155l240l1420j4249J0379M028
9628A68032J3296J8000j8163q157j5523n170J6900L103l2097k1148J2724Q676
9616A40473J7418K669j3713p182J809m784j7192K474J2832K584k983M171p982
9603A30594r162j6738n209j116j1770j0070o741K3699J9626K4986J3965R310L0696
9590A92070J0185J3153P144j9801j1802R776K256j031k405k9503k6339O304k14
9577A49793j2170j217l0J0137j031r416P947k970J851R084r730q711L881K3462
9563A60880J3825R896k2315k3368j3551N190K3208K989o900K1652M114j1176J314
9550A65758j178k1177n62m986R936O344K604k0645p290K2368R624j8591j3140
$$ plain form
9640 315605 287831 283575 272985 262964 244507 211689 202534 199294 167874 153625 164004 168032
9628 168032 181328 199328 181165 173008 157485 152315 169215 172318 140221 119073 131797 140473
9616 140473 157891 160560 146847 139665 141474 136690 119498 121972 134804 137388 134405 138576 130594
9603 130594 121432 104694 99485 98369 86599 76529 69788 93487 113113 138099 152064 161374 192070
9590 192070 202255 215408 222552 202751 190949 200725 202981 201950 199545 170042 143703 150007 149793
9577 149793 137623 136406 136376 146513 145482 136066 144013 141043 142894 151978 142248 133537 137418 160880
9563 160880 174705 184601 162286 138918 125367 130557 153765 156754 149854 171506 175620 164444 165758
9550 165758 164580 143403 142841 137855 147791 154135 156739 136094 128804 151172 160796 142205 129065
9537A29065p151P604O003J1145j1624j0393J4202r633p338K927k565k242R928
9524A29928P911M254j079M060m455k0428m984m572j5846j6491n59J1997o747j018
9510H1971N354J5582N116j0626M471P816M780K1593Q918m929j774j7310p993l157
9496A09812P996j8315p95j956J0215j371l536M219m381p269J413k406j1554l399
9482G8673m757Q623P369J7852j377Q441p885J1696K1117l154q812l600q40k5644
9468I7702N881Q505R99P844q895j2110J2604J0932m532q049j4543n156r236l453
9454G8493J608Q463J2125M788j4783r121J7152J995J5005Q876M576k874j8969
9441A07334O683l921O829n240J0509J0918R9q986j5040j7627M896r778j147M919
$$ plain form
9537 129065 121914 129518 135521 146666 135042 124649 138851 129218 121880 124807 122242 120000 129928
9524 129928 137839 142093 141014 145074 140619 120191 115207 110635 94789 78298 77739 89736 82989 81971
9510 81971 87325 102907 108023 97397 101868 109684 114464 136057 144975 140046 138272 120962 112969 109812
9496 109812 117808 99493 98698 96742 106957 105586 102050 106269 101888 94619 96032 93626 82072 78673
9482 78673 73916 82539 89908 107760 106383 114824 106939 118635 139752 136598 127786 124186 123346 97702
9468 97702 103583 112088 113087 120931 112036 99926 112530 123462 118930 110881 96338 91182 81946 78493
9454 78493 80101 88564 100689 105477 90694 81573 98725 100720 115725 124601 129177 126303 107334
9441 107334 114017 110096 116925 111685 122194 133112 133211 124225 109185 91558 96454 86676 85529 90448
9427I0448J4565N778l828k2581j0291L245r256j0317K8687J0765j1372J7636J8070
9414A21549J907k5323J3483O062j1394j2810o459J3388M218k940j5929j1414R25
9401G5263k907n168q756K561n333L719K1214Q87q126m156r546m222j4918R292
9387D9804J1133j7498J0505L1455J1155j044p641O397J233j180j3031L052o673
9374G7667o227K3788J3628j6010o251j2581q404r414k980J2017n013j1769J991
9361E0442J7767J9081p628j1747l786J3908K0857M307j625l489j544j4350l524
9348G8669J1087r731j0132l182O975Q075l438r534m335L796K0394K5379K688l723
9334A12988j4318j5252l276j5248j3063l081l147M101M539J2093j0265P849M423
$$ plain form
9427 90448 105013 110791 106963 84382 74091 77336 68080 57763 86450 97215 85843 103479 121549
9414 121549 123456 98133 111616 117678 106284 93474 87015 100403 104621 101681 85752 74338 75263
9401 75263 72356 67188 58432 60993 55660 59379 80593 81480 73354 69198 59652 55430 40512 49804
9387 49804 60937 43439 53944 85399 96554 95510 87869 94266 95499 94319 81288 84340 77667
9374 77667 71440 95228 108856 92846 86595 74014 65610 56196 53216 65233 60220 48451 50442
9361 50442 68209 87290 79662 67915 64129 78037 98894 103201 101576 98087 96543 82193 78669
9348 78669 89756 80025 69893 66711 73686 81761 78323 68789 64454 68250 88644 114023 116711 112988
9334 112988 98670 83418 80142 64894 51831 48750 45603 49704 54243 66336 56071 63920 68343
9321F8343j7977j0449j584J5500J4937J717K3906K7160O42j340j8632r702n442
9308H7079L295j5856j8178l064J8053K704K940j3624P879j5288Q2M770P191J4716
9294H2699L320q810r509J080J1876n855k0291j2715K3175K4316j4815j973K0955
9281I3453j7746j6993j0492r064J1129k907K1211J7834R217j5041j1296L361K596
9268G5262o470q424k18J233j0524l58J2131m643k800J2155J088n68j9801j2860
9254C5203m023J1224K130k845J050J3422L466p923l583p795j3376j3625j6819
9241c494P867J0866J7064J7262M634l134M447j0500M305J7642j0936M54r9O621
9227F2999J371r691q016L397J1980N310k010J1125k550p905L606J0044O279j257
$$ plain form
9321 68343 50366 39917 38333 53833 68770 70487 94393 121553 122195 120855 102223 92521 87079
9308 87079 90374 74518 56340 53276 71329 74033 76973 63349 71228 55940 56022 60792 67983 82699
9294 82699 86019 77209 67700 68780 80656 74801 54510 41795 64970 89286 74471 72498 93453
9281 93453 75707 58714 48222 39158 50287 47380 68591 86425 95642 80601 69305 72666 75262
9268 75262 68792 60368 60150 61383 50859 50501 62632 57989 55189 67344 68432 67864 48063 35203
9254 35203 31180 42404 44534 41689 42739 56161 59627 51704 48121 40326 26950 13325 -3494
9241 -3494 4373 15239 32303 49565 54199 51065 55512 45012 49317 66959 56023 56477 56378 62999
9227 62999 64370 54679 46663 50060 62040 67350 65340 76465 73915 66010 69616 79660 85939 84682
9213H4682j267L460j8913J2366N86k0605j5246j3059L549k253P365J943O290J7913
9199F6811r656Q73l386o913N181J050O53l044M698L293m97M3j5009m772j0948
9184B8377J8641K3678j336k3350l31J8170J0625o963j1593j1818K370P319K274
9171E6063J421K470k5362j3564J1634J6782P587k119O269j620l7400j3896J8100
9158B6365j343n066j4133J0119K0450Q920r009R4r901J1839J0707k767r201P427
9144D4501p977P566j9877P621O290j956k075r4l088L577Q621K1581J0240j5038
9130E9892j1810J514R430j4484j7321O549l574M810K1937j2458j850J1210j0613
9117D3232m814J625m036j5203p524J2920K911R80K688J4359R330j0295Q4J7152
$$ plain form
9213 84682 83415 86875 67962 80328 80914 60309 45063 32004 35553 33300 40665 42608 48898 66811
9199 66811 57155 58028 54642 47729 52910 53960 54613 51569 56267 59560 59063 59106 44097 39325 28377
9184 28377 47018 70696 69360 46010 45679 63849 74474 67511 55918 44100 46470 53789 56063
9171 56063 57484 59954 34592 21028 32662 49444 57031 54912 61181 59561 22161 8265 26365
9158 26365 25022 19956 5823 15942 36392 45312 36303 36397 26496 38335 49042 46275 37074 44501
9144 44501 36524 44090 24213 31834 38124 36168 34093 33999 30911 34488 43109 64690 74930 59892
9130 59892 48082 49596 59026 44542 27221 33770 30196 35006 56943 44485 42635 53845 43232
9117 43232 38418 40043 36007 20804 13280 26200 29111 30091 32779 47138 56468 46173 46257 63409
9103F3409m405j9958P833K673J320M939k0125l845K951l638J3219j6006m834l129
9089B0404P829J2684N325J5367R04m909q978j2455J7936L884p452M392p684K793
9075E0040J0343j5519l845J671j629m472n716J2246K2517m737j5651j4402J1350
9062D2196p183J863P822J0670L398j5786O522O225j6105j9060j5383K586J0616
9049A8381L8066L701j5797j1794k678P466J0092k3046q188J0195k620K3219J4420
9036F1417o497q662M855p333k4513M042K1845r3J3233K088k3970o594j3683k850
9022A3285M075M918R405O149N762j420j3836K1245q253o357N999J9280j3179p189
9008C9884k186q478P242Q457Q706J855k1641r1M119J2335J2491p227m467J824
$$ plain form
9103 63409 59004 39046 46879 49552 50872 55811 35686 31841 34792 31154 44373 28367 23533 20404
9089 20404 28233 40917 46242 61609 62513 57604 48626 36171 54107 57991 50539 54931 47247 50040
9075 50040 60383 44864 41019 42690 41061 36589 30873 43119 65636 60899 45248 30846 42196
9062 42196 35013 36876 44698 55368 58766 42980 49502 55727 39622 20562 5179 7765 18381
9049 18381 56447 60148 44351 32557 29879 37345 47437 24391 16203 26398 23778 46997 61417
9036 61417 54920 46258 51113 43780 19267 23309 45154 45061 58294 60382 36412 29818 16135 13285
9022 13285 17360 22278 31683 37832 43594 42174 28338 49583 41330 34973 40972 60252 47073 39884
9008 39884 37698 29220 36462 44919 53625 55480 33839 33748 37867 50202 62693 55466 50999 52823
8994E2823j058j6398j4078J0578K0269J3073k836l2433j0958j1366O163O533p952
8981A2360N311J7007k1364o363j0151L594Q931J0890O466M950m028k438j2942
8968A2223k1631k048J4965Q59O926J699J2999J5192q603j2734j562K1741J2265
8955E2291j573l440m822J4553j264p485j7186j0485J9782j1358j1407m546J9472
8942C2532P592j795r704O791k302P336j386o52o109o511j719l273J4123O714j474
8927D0163m121K762k648l807R42j54O90l634j2707j0684J3568q50k763R571N238
8912C1566j3620q036J2754r295J1073L108r701p288J0123J7092R793L98n876M77
8898D2568q056k493Q157R561J1150n411p242k834r496j4130L559Q785J3610j9159
$$ plain form
8994 52823 51765 35367 21289 31867 52136 65209 62373 29940 18982 7616 13779 20312 12360
8981 12360 17671 34678 13314 6951 -3200 394 9325 20215 26681 31631 27603 25165 12223
8968 12223 -9408 -11456 3509 4368 11294 12993 25992 41184 32581 19847 18285 40026 52291
8955 52291 50718 47278 42456 57009 55745 48260 31074 20589 40371 29013 17606 13060 32532
8942 32532 40124 38329 28625 35416 33114 40450 39064 38412 32303 25792 24073 20800 34923 41637 40163
8927 40163 36042 38804 36156 32349 33291 33137 33827 30193 17486 6802 20370 19520 16757 26328 31566
8912 31566 17946 9910 22664 13369 24442 27550 17849 10561 20684 37776 47569 47967 42091 42568
8898 42568 34512 32019 40176 49737 60887 55476 48234 45400 35904 21774 25333 34118 47728 28569
8884B8569j2795R762Q428J9208k1006j2213M804q185k2k703m942J2789n011j16
8870A6567q424P406j2866M323P876P570l816j6512J3145K5572J4155N456J720
8857F2172q412k4422j0112j1652q733O33k691P568j1613o439K1883J5761m135
8844A9808O786K7262J56k7187j7348n053K5981Q314p936j6423n294J1752J0803
8831C1621o09N504j0904j3185J429J9871M200j636j0779r909L575J158j4825J3953
8817A9464J4388o270m832J0342k0915J558J5101M197j030J0640L095K011J077
8804D8826n504m915n821j3665n733k874j94l682q500K0535p423j3743K1131N875
8790B4313j4187j2455j2754R257J010q5P764J1965J521J0276q542r907L118Q324
$$ plain form
8884 28569 15774 25536 33964 53172 32166 19953 24757 16572 16550 13847 8905 21694 16683 16567
8870 16567 8143 15549 2683 7006 14882 22452 18636 2124 15269 40841 54996 60452 62172
8857 62172 53760 29338 19226 7574 -1159 -526 -3217 4351 -7262 -13701 8182 23943 19808
8844 19808 26594 53856 54012 26825 9477 4424 30405 38719 30783 14360 9066 20818 31621
8831 31621 31012 36516 25612 12427 13856 33727 37927 36291 25512 15603 19178 20336 5511 19464
8817 19464 33852 27582 22750 33092 12177 13735 28836 33033 32003 42643 45738 47749 48826
8804 48826 43322 38407 32586 18921 13188 10314 10120 6438 -2062 18473 11050 -2693 18438 24313
8790 24313 10126 -2329 -15083 -5826 -4816 -4901 2863 14828 16349 26625 18083 8176 11294 19618
8776A9618n079q214K193J3212N986k393r157k4841k13K0562J111j3346j029K0939
8762A9349Q108r035j64q03j913M464J7273J72j509J4050o094j7287j2537J3325
8748B7399N143L482K494j3091l156Q181j6957k8087j0626K0954K3192k944n778
8735A0206J2642M333J1247l141K432m590j2599L33o083N625M259J5055J2988j3787
8721C8920m586l048m709j3849j4841J760M90N233Q150J9049k3521j0829R603J3851
8707B1673Q701J0584O123n70j31j1947Q233K0512r778j5369o449j1295j3745n758
8693G84j4073P636J6032J4635L23p033J1245k460n304P675j158j4771q973j0262
8679e704p569J4097M550M000J8318K2182J067j6655j7147J0255K7120o763n883
$$ plain form
8776 19618 14539 6325 8518 21730 27716 25323 16166 -8675 -8888 11674 12785 -561 -1590 19349
8762 19349 27457 18422 18258 17455 15542 20006 37279 37451 35942 49992 43898 26611 14074 27399
8748 27399 32542 36024 38518 25427 22271 30452 13495 -14592 -25218 -4264 18928 15984 10206
8735 10206 22848 27181 38428 35287 37719 33129 20530 20863 14780 20405 24664 39719 52707 38920
8721 38920 34334 31286 26577 12728 -2113 -353 137 5370 13520 32569 9048 -1781 7822 21673
8707 21673 30374 40958 47081 46511 46380 34433 42666 63178 53400 38031 31582 20287 6542 784
8693 784 -13289 -5653 10379 25014 25337 18304 29549 27089 21785 29460 28302 13531 4558 -5704
8679 -5704 -13273 824 5374 9374 27692 49874 50941 34286 17139 27394 54514 47751 41868
8666D1868J778J4358N886j3688j3067p354J691n5j0063j215m425N037m468l868
8652A2415J367j4952q165K1042R995J8669J5927j1006j1429o475J708N161j9472
8639A4785p424L2901J8107j0735j3897j0758j3775j2186j4505R560K0715Q9j401
8626A1476K987J3250q280L386K479M41j3523j0042q104J4911J3195J6489J365
8613D0030M532P193j6591m478l203Q255K187l063K737j1215l775J2463j4821j772
8599A8479k200O53K010o263J8419P68j4152j1603J1616J3186J0763j0582k1340
8586I754j7172K024j5607R612J4454J4880O914MN318J34k8708j5407N38J9438
8572F176K8944J2214j184p520j2439j2392j0417J7001J7630L187q023j99j1706
$$ plain form
8666 41868 43646 58004 63890 50202 37135 29781 31472 31417 21354 20139 15714 20751 16283 12415
8652 12415 13782 -1170 -9335 11707 21702 40371 56298 45292 33863 27388 29096 34257 14785
8639 14785 7361 40262 58369 47634 33737 22979 9204 -2982 -17487 -7927 12788 12877 11476
8626 11476 14463 27713 19433 22819 25298 25739 12216 2174 -5930 8981 22176 38665 40030
8613 40030 44562 51755 35164 30686 27483 35738 37925 34862 37599 26384 22609 35072 20251 18479
8599 18479 16279 16932 18942 12679 31098 31866 17714 6111 17727 30913 41676 31094 9754
8586 9754 -7418 -5394 -21001 -11389 3065 17945 24859 24863 30181 30315 1607 -13800 -13262 6176
8572 6176 35120 47334 46150 38630 26191 13799 3382 20383 38013 41200 33177 32978 21272
8559B1272j0172o821O99M101J335L907J1521R938q96j2054O519q430L199M871
8545B8989p842n420R447J5932K3062l180L185Kr986J080J081n428k1396M862j1619
8530B2769K121n593J1204m021k111j2494J061k532O352J124j2973O986j3217M730
8516C406L321j595J4870K93j6368q35J1850L153L526j6462N428P950l905m576
8502A0056k593J604P38p570n448l4l604K3013k043j190k2657m583J5661J400N341
8487H091j176M124m515m326j366K299N977j2541O613K746J4056J523r230q923
8473C352j0541m467P991l455J3297K314R226K0948q468j7257r145j2551K23P164
8459a369Q490Q881K383r818n683j4516n649J7584m091p459J654O826J8816N425
$$ plain form
8559 21272 11100 4279 4978 9079 10414 14321 25842 35780 34884 22830 29349 20919 24118 28989
8545 28989 21147 15727 25174 41106 64168 60988 64173 64175 54189 55269 56350 50922 29526 34388 22769
8530 22769 24890 19297 30501 26480 24369 11875 12936 10404 16756 17880 4907 11893 -1324 3406
8516 3406 6727 5132 20002 20295 3927 3092 14942 18095 21621 5159 10587 18537 14632 10056
8502 10056 7463 9067 9805 2235 -3213 -3247 -6851 16162 14119 12929 -9728 -14311 1350 2750 8091
8487 8091 6915 11039 6524 2198 832 3131 9108 -3433 3180 5926 19982 21505 12275 3352
8473 3352 -7189 -11656 -3665 -7120 6177 8491 17717 38665 30197 12940 3795 -8756 -8533 -1369
8459 -1369 7121 16002 18385 8567 2884 -11632 -17281 303 -3788 -11247 -9593 -2767 16049 21474
8445B1474j1315n199K6692K8589j7771o373k279M17j593l466l928j269P728r181
8431B2526n648Q1J1883l883j5182N279j1929K458j257Q010N418J588k4794j0663
8417a6113N108K2260K1729j0586j0229k0876J1866J7954K2865l280j7960j9453
8405C285j2104K021J7399L118J4482j334j656j1900j1006n617N726P644n423Q606
8391A3241j8585Q790J7541p716j0172j0871K07j565j5448l853J0888J6706o36
8378a473j0507l555J2125J1932k024J36j0380k8207l728J5927J9552J8336L932
8365B2066N093K20j2055j9760j8503O311K0731L748m850r908J304o663J2180J2855
8351A2769l545J2337k194j8411j3330N366J3952J98R038J8286J9007L6360O1074
$$ plain form
8445 21474 10159 4960 31652 60241 42470 36097 33818 34235 32642 29176 25248 23979 31707 22526
8431 22526 16878 16959 28842 24959 9777 15056 3127 5585 4328 12338 17756 19344 -5450 -16113
8417 -16113 -11005 11255 32984 22398 12169 -8707 3159 21113 43978 40698 22738 3285
8405 3285 -8819 -6798 10601 13719 28201 26867 25211 13311 2305 -3312 2414 10058 4635 13241
8391 13241 -5344 3446 20987 13271 3099 -7772 -7565 -9130 -24578 -28431 -17543 -837 -1473
8378 -1473 -11980 -15535 -3410 8522 6498 6634 -3746 -31953 -35681 -19754 -202 18134 22066
8365 22066 27159 27379 15324 -4436 -22939 -16628 4103 7851 3001 -6907 -5603 -12266 -86 12769
8351 12769 9224 21561 19367 956 -12374 -7008 6944 7142 16180 34466 53473 89833 150907
8338A50907O2114J16488J62075J55556O8745o6531j09984j26484j30570j07987
8328A74329o6074l4532n532k6033k8295r344J2571J8014J1994K469j3538R588
8316D5617m858j2520J1022Q961J0785j875J0854J0685k440o357L535j33J185j4085
8302F0376j3137L008O451J2982K1342L3091M2390O4926J19837J98859L15142L12534
8290A177801J76148n1715k05028k34687k41257k16566j30771p3758p4200l1028
8280I4939k9729j2185L6k00M201P35o363r877j1083j0575k088J1660M858J0674
8266D5003j3759j8792j4774q690Q618K1904k320J3160J6456J0484r425N832R071
8253F2768R018N650K0796N3571Q5025J13536J61940J09480Q408o3767j16544j32029
$$ plain form
8338 150907 213021 329509 491584 647140 715885 649354 539370 412886 282316 174329
8328 174329 108255 73723 68191 42158 13863 4519 17090 35104 47098 49567 36029 45617
8316 45617 40759 28239 39261 48222 59007 57132 67986 78671 76231 69874 73409 73276 74461 60376
8302 60376 47239 50247 56698 69680 91022 124113 166503 231429 351266 550125 865267 1177801
8290 1177801 1353949 1302234 1097206 862519 621262 404696 273925 200167 125967 94939
8280 94939 65210 53025 53061 52861 57062 57797 51434 41557 30474 19899 17811 29471 34329 45003
8266 45003 31244 12452 -2322 -11012 -2394 19510 17190 30350 46806 57290 47865 53697 62768
8253 62768 71786 77436 98232 151803 236828 350364 512304 621784 630192 566425 449881 317852
8241C17852j04630o6752n7537j4954k5805o017j0923q66K0165R513k5053k7069
8229G924R520M45r908j2041J926p457k629J323R841r460k477J3879J4640l23M556
8214A9759P181q504q365l437M996J0938Q960K293j6505m08j5996j5082J4031K7647
8200B7508o1O589l845j6281q596o087K7545J541j2046j7487j6782P282K0281J5231
8186B4792J239j7219q157o205J1190m646m384k41M539K1492K1336o764k3020j5737
8172a785j3584Q143J638j656p133L315j549P17n752M532J0267J1785m784k1636
8158a7482J569J0401j866k734J4235R342j4766l762R696k3893j6281O935J2183
8145a6423l656J5857R537r310K740J5046O208j4629M18l606k880J1581k765k731
$$ plain form
8241 317852 213222 146470 88933 73979 48174 42157 31234 30368 50533 60046 34993 7924
8229 7924 17444 17889 7981 -4060 -2134 -9591 -12220 -10897 -1056 -10516 -12993 886 15526 15203 19759
8214 19759 26940 18436 10071 6634 11630 22568 31528 33821 17316 16908 912 -14170 -139 27508
8200 27508 27447 34036 30191 13910 5314 -773 26772 28313 16267 -1220 -18002 -10720 9561 24792
8186 24792 26031 8812 655 -5550 5640 994 -3390 -3631 908 22400 43736 36972 13952 -1785
8172 -1785 -15369 -7226 -5588 -7244 -14377 -11062 -12611 -11894 -17646 -13114 -2847 8938 4154 -17482
8158 -17482 -15913 -5512 -7378 -10112 4123 13465 -1301 -5063 4633 -19260 -35541 -28606 -16423
8145 -16423 -20079 -4222 5315 -3995 -1255 13791 19999 5370 5788 2182 -698 10883 8118 5387
8131E387p476n344JJ7693K175r319q287k075J4027K937o75r8r311P1j0496l206
8115a3996O47m858O070J0191k3116j954o853R68J159R829J1334P528R447J0100
8101A6496M113J3997n86k2165p87O898j2219j7021j2311j6030j0999M455M0035
8088f124K4138j519n665m711n928j9539m88J2903N028n091k95j2559M773J1036
8074d041M764q213M751J7444l475p797J0407Q422q59q567l036J8779k080n027
8060B1472k2303J025j8029n807R759J7251K9293N637o32n701j2407k0396j5260
8047a6098N089J2564M686r018j514R832J7363j8179k144J6089K301O59k1610l546
8033c526J8629J4949k6751j0915J9172R362j1096l274m645p428K0303Q131j3515
$$ plain form
8131 5387 -2089 -7433 -7432 10261 12436 3117 -5170 -7245 6782 9719 9044 8946 -365 -294 -10790 -13996
8115 -13996 -13349 -18207 -12137 -1946 -25062 -27016 -33869 -32901 -31742 -21913 -10579 -3051 6396 16496
8101 16496 20609 34606 34020 11855 11068 17966 5747 -11274 -23585 -39615 -50614 -46159 -6124
8088 -6124 18014 16495 10830 6119 191 -19348 -19836 -6933 -1905 -6996 -7291 -19850 -15077 -4041
8074 -4041 723 -7490 -2739 14705 11230 3433 13840 22262 21403 12836 9800 28579 26499 21472
8060 21472 -831 194 -17835 -23642 -13883 3368 32661 38298 37666 31965 19558 -838 -16098
8047 -16098 -11009 1555 6241 -2777 -4291 5541 22904 4725 2581 18670 20971 21630 20 -3526
8033 -3526 15103 30052 3301 -7614 11558 20920 9824 6550 1905 -5523 14780 22911 9396
8020I396o243J925j0405J0268P629l173o839J814j3087j572M706o281q667j121
8006b1650L238m247J3921J9593j0458J060q634j5284k3692m444J4273J9575J0453
7993f296L575J7724J5224j27j9884r258O973j2544k4018k811l296p55j084O754
7979b9823R798j021J1870K4077K4273j0515r309j6760N651J3209j5295j4557m828
7966a3230o498J3019J1827Q632o296L309j0008j7208O201O466J4805m605J224
7953G638O743J9940j90j6300k7586J8699P037j4603r81N480K573j8949O899J4009
7939A0409K2396j6482j9556Q072J0010J0151J750j1845p381j8764k7952l116K0147
7926b2161J4280N482L881J1504Q622J0759r779j3632K707o9o132J4417R748j1286
$$ plain form
8020 9396 3153 5078 -5327 4941 12570 9397 2558 4372 -8715 -10287 -5581 -11862 -20529 -21650
8006 -21650 -18412 -22659 -8738 10855 397 1457 -7177 -22461 -46153 -50597 -36324 -16749 -6296
7993 -6296 -2721 15003 30227 30100 10216 958 7931 -4613 -28631 -31442 -34738 -35493 -36577 -29823
7979 -29823 -20025 -21046 -9176 14901 39174 28659 19350 2590 8241 21450 6155 -8402 -13230
7966 -13230 -19728 -6709 5118 13750 7454 10763 755 -16453 -10252 -3786 11019 6414 7638
7953 7638 14381 34321 34131 17831 -9755 8944 15981 1378 397 5877 8450 -10499 -3600 10409
7939 10409 32805 16323 -3233 4839 14849 25000 26750 14905 7524 -11240 -39192 -42308 -22161
7926 -22161 -7881 -2399 1482 12986 21608 32367 22588 8956 11663 11594 5462 19879 29627 18341
7912A8341o581J7226J1946n211j5808o029j439R606o402k0046p027l090L870N190
7898e454l274K896L006O582p504O594J2211q519j1190J338K6201L331j7394K823
7884A1647q580m735K804P573q712K357m605J3581l203j2305m324q863l320J4142
7870f543K070k8496K774J5807l20r75R966m086q42K276P595J2857P550L240n180
7855A7693R532k243p389j3486j0932O210j789p871m137P200q729J538j2373J737
7841b5039J3079k93r560j4775q538k656p605J3923K5007J6559J2302r038r845
7828f479j3297j5532K194J3563Q397j875l22o799m944J9848J1419K9887J0657
7815D6717r709n751m061k1949j0936j4638l435R137J2421J800j084o317j1406
$$ plain form
7912 18341 11760 28986 40932 35721 19913 13884 12445 22051 15649 -4397 -11424 -14514 -10644 -5454
7898 -5454 -8728 -5832 -2826 3756 -3748 2846 15057 6538 -4652 -3314 22887 26218 8824 11647
7884 11647 3067 -1668 1136 8709 -3 2354 -2251 11330 8127 -4178 -8502 -17365 -20685 -6543
7870 -6543 -4473 -32969 -30195 -14388 -14708 -15683 -5717 -9803 -10645 -8369 -774 12083 19633 22873 17693
7855 17693 27225 24982 17593 4107 -6825 -615 -2404 -10275 -14412 -7212 -15941 -14403 -26776 -25039
7841 -25039 -11960 -12253 -21813 -36588 -45126 -47782 -55387 -41464 -16457 102 12404 3366 -6479
7828 -6479 -19776 -35308 -33114 -19551 -11154 -13029 -13351 -20150 -25094 -5246 6173 36060 46717
7815 46717 37008 31257 27196 5247 -5689 -20327 -23762 -14625 -2204 -404 -1488 -7805 -19211
7802a9211R351L628J4874J1424J3040j6036j3079O515Q068j3945k350M885j839
7789E325j2807j77l312l288j3022J8559m143j0963j694k1782L589K5331J368M412
7775a2604o08N12k453j759j2976P439J3821J5785k5087q069N210J0955J0895J0091
7761A1152O480j179L172R726k1077o125L213j1503M128J89j3774J191j1338l505
7747b9250r037J1840P55q958J8206J5061Q78j7396j1058J0827J2737P661P503
7734I769j0865m857N523L961L040j0039O026R245j0198l859J4576j2970o742Q372
7720I82K1756R07L899p790j3486k442O736p552l395j4785J2647m126j4184l438
7706b4271o931P367J2365J4970N211M58r960l44j1000l270K3733P394k4404q965
$$ plain form
7802 -19211 -9860 -6232 8642 20066 33106 17070 3991 10506 18574 4629 2279 7164 5325
7789 5325 -7482 -7659 -10971 -14259 -27281 -8722 -12865 -23828 -25522 -47304 -43715 -18384 -17016 -12604
7775 -12604 -13212 -12700 -15153 -16912 -29888 -22449 -8628 7157 -17930 -25999 -20789 -9834 1061 11152
7761 11152 17632 16453 19625 29351 8274 2149 5362 -6141 -2013 -1824 -15598 -14407 -25745 -29250
7747 -29250 -38287 -26447 -25692 -34650 -16444 -1383 -505 -17901 -28959 -18132 -5395 2266 9769
7734 9769 -1096 -5953 -430 3531 6571 -3468 2558 11803 1605 -2254 12322 -648 -7390 982
7720 982 22738 23645 27544 19754 6268 3826 10562 3010 -385 -15170 -2523 -6649 -20833 -24271
7706 -24271 -31202 -23835 -11470 3500 8711 9169 -791 -1135 -12135 -15405 8328 15722 -8682 -17647
7692a7647J0473l194o705J9968L3617o334k8462k9092O737K996j3252J0832J3544
7679f519j6684N063p399K423l010R203J546L422p4J3071M248n690k0540k977j1752
7664c5669O161L112J7825J5194j2670k871k4739j2148K1591K858k094J5240M36
7651g774O722k604j5351l870l061q411N311j988J5842J8361j0408j4425J6802
7638d854O56m971Q61p249j6456m309r375J3339J5856l385K865o453o470J0831
7624a9114K7924O257j7657o746J1780K867N060l116n728l349P687p304k693Q68
7610c264j7309k2279J2979J8784J0383N037j4961J0566J2778J2245n811k1205
7598b057j0905l098j105j3631N032L9470K326n350J0771J2140J659l665k8263
$$ plain form
7692 -17647 -7174 -10368 -17073 2895 36512 30178 1716 -27376 -20639 -17643 -30895 -20063 -6519
7679 -6519 -23203 -18140 -25539 -23116 -26126 -16923 -15377 -11955 -12029 1042 5290 -400 -20940 -23917 -35669
7664 -35669 -29508 -26396 -8571 6623 -6047 -8918 -33657 -45805 -24214 -21356 -23450 -8210 -7774
7651 -7774 -1052 -3656 -19007 -22877 -25938 -34349 -29038 -31026 -15184 3177 -7231 -21656 -4854
7638 -4854 -4198 -9169 -8308 -15557 -32013 -36322 -45697 -32358 -16502 -19887 -17022 -23475 -29945 -19114
7624 -19114 8810 15067 -2590 -9336 2444 5311 10371 7255 1527 -1822 5865 -1439 -4132 -3264
7610 -3264 -20573 -42852 -29873 -11089 -706 4331 -10630 -64 12714 24959 19148 -2057
7598 -2057 -12962 -16060 -17165 -30796 -25764 13706 16032 10682 21453 33593 35252 31587 3324
7585C324k8524j5458J4775K3804J1214k910l4309o000K1400J6816O283k732m654
7572C029K0172O418j7636m403J0354l971J0167q203k663j3324o098o46j1209J354
7558a6659J4024j387j8086j8247N623K618n067J110L550L0262R536Q97p486K995
7544C683k093q105k348M510J5555J7092j9060n687K216J5901N43j0866j3828N8
7530b429q117J2498R347j0247p002r17n355K4789o934j0446L049r357m79k367
7516a3967j2941m376N552J8468r664o762J3995q141k4312n598J0361j5621J5026
7503c7980K3665K2506r101K890L270k1157r998J1611o331o794O501n911R69N538
7489b0322n817J0649P774J0575J2865j3201q353k500J2638j1831q132J1811J726
$$ plain form
7585 3324 -25200 -40658 -25883 -2079 9135 6225 -28084 -34084 -12684 4132 10415 7683 3029
7572 3029 23201 29619 11983 7580 17934 13963 24130 15927 13264 -60 -6158 -6804 -18013 -16659
7558 -16659 -2635 -4022 -22108 -40355 -34732 -32114 -37181 -36071 -32521 -2259 7277 8174 688 3683
7544 3683 1590 -6515 -8863 -4353 11202 28294 9234 3547 5763 21664 22207 11341 -2487 -2429
7530 -2429 -10546 1952 11299 1052 -5950 -6867 -12222 12567 5633 -4813 -1764 -11121 -11600 -13967
7516 -13967 -26908 -31284 -25732 -7264 -16928 -23690 -9695 -17836 -42148 -47746 -37385 -53006 -37980
7503 -37980 -14315 8191 -910 1980 5250 -15907 -25905 -14294 -20625 -27419 -20918 -26829 -25860 -20322
7489 -20322 -26139 -15490 -7716 2859 15724 2523 -5830 -8330 4308 -7523 -15655 -3844 -2118
7476b118P313j6200j0377O842j3264n578m787Q117J2473J0971M572J3704J4810
7463B6478j523k0113K15k282j889j6667r845J1680K3923J4421j7463j993j642
7450C300j1055k3686l018K836p309j4971O36R626N284K754j241M538L883m957
7436c3380n09O304N684R051Q607P136J8103j6066j0223N972Q133J2409J621o878
7422A5964j838k3771j3311M329j5230J1365P873j2093k809R816L964P626p536
7409a5651R18m843J662k549K7571J0349k6509j5656J6903R547j544n874N319J1634
7395A1277r88l477j3523n336J2731n93l529p921j146L299n440L528L743R232n930
7380d073j1183O810O067j4537J66l828R192J569J3697J7237j2596R732m576k800
$$ plain form
7476 -2118 5195 -11005 -21382 -14540 -27804 -33382 -38169 -30052 -17579 -6608 -2036 11668 26478
7463 26478 24955 4842 5057 2775 886 -15781 -25626 -13946 9977 24398 6935 4942 3300
7450 3300 -7755 -31441 -34459 -31623 -38932 -53903 -53267 -43641 -38357 -35603 -36844 -32306 -28423 -33380
7436 -33380 -33889 -27585 -21901 -12850 -4243 2893 20996 4930 -5293 679 8812 21221 22842 15964
7422 15964 14126 -9645 -22956 -18627 -33857 -22492 -14619 -26712 -29521 -19705 -15741 -8115 -15651
7409 -15651 -14733 -19576 -17914 -20463 7108 17457 -9052 -24708 -7805 1742 198 -5676 -357 11277
7395 11277 10289 6812 -6711 -12047 684 91 -3438 -11359 -12505 -9206 -14646 -11118 -7375 1857 -4073
7380 -4073 -15256 -8446 -2379 -16916 -16750 -20578 -11386 -9817 3880 21117 8521 18253 13677 10877
7366A0877j2227j2439k905k966p88L252K6334j3123O839l352J9097n203j6641
7353c245o613m506j3500N891j1940j448J235K1900P164q1j6346N720n57J0128
7339f198k711o206O10K7161n665k0350L109k974J307Q291q991K702o342J1340
7325d917J8343n920j235j4932j1589j1009q998K6943J7371k4686j7812K4296J5224
7312A079k35m918L346M025l489j801j9695j3324o934K4503Q603M215n211L919
7298e917j2710j8360J2271J0868j190n708J1524M047k0913q634M627R914J986
7285a8195J2013j2049j9114O657J6573J2152j8151l31J2809J7281j0715j2939
7273a4009j3456j7836k748J8565Q642N731j0255j4259m705K0281L2392J8313m60
$$ plain form
7366 10877 -1350 -13789 -16694 -19660 -20448 -17196 9138 -3985 2854 -498 18599 13396 -3245
7353 -3245 -9858 -14364 -27864 -21973 -33913 -35361 -34126 -12226 -5062 -5143 -21489 -15769 -16326 -6198
7339 -6198 -8909 -15115 -14505 12656 6991 -13359 -10250 -13224 -11917 -3626 -12617 -9915 -16257 -4917
7325 -4917 13426 7506 6271 -8661 -20250 -31259 -40257 -13314 4057 -20629 -38441 -14145 1079
7312 1079 844 -4074 -728 3297 -192 -1993 -21688 -35012 -41946 -17443 -8840 -4625 -9836 -5917
7298 -5917 -18627 -36987 -24716 -13848 -15038 -20746 -9222 -5175 -26088 -34722 -30095 -20181 -18195
7285 -18195 -6182 -18231 -37345 -30688 -14115 -1963 -20114 -20445 -7636 9645 -1070 -14009
7273 -14009 -27465 -45301 -48049 -29484 -20842 -15111 -25366 -39625 -44330 -24049 8343 26656 26196
7260B6196j7598j4730j0373o936j4292J2276P184P50p569q434L460J2168K187
7247a5711K1699J7104k3803p021P779j487P488P240j4211p587J2453n795j3464
7234a5316k1949R745J3314r57M915N921j1289J3872m690j4749p490r884L800J6036
7220a8721K4084J2345p389j5985m838j456j0948J1960J4477J2163n066j6399l982
7207i755j2677n609J9055J4620k692O262l072m719J8253J415l499r023o694J1494
7193A3359j674Q88k3730q198P896R834J1665J622j3372J3182j4468o118J999K767
7179d348k648M286J467J0344j0412o563j7267N660J4605l107j333N756O557J5235
7165A8232J3880p120j2646j2898k4256L686J0260j5123K619Q39J8796N914j3811
$$ plain form
7260 26196 8598 -6132 -16505 -23441 -37733 -25457 -18273 -17523 -25092 -33526 -30066 -17898 -15711
7247 -15711 5988 23092 -711 -7732 47 -1440 6048 13288 -923 -8510 3943 -1852 -15316
7234 -15316 -37265 -27520 -14206 -15163 -10248 -4327 -15616 -1744 -6434 -21183 -28673 -38557 -34757 -18721
7220 -18721 5363 17708 10319 -5666 -10504 -11960 -22908 -10948 3529 15692 10626 -5773 -9755
7207 -9755 -22432 -28041 -8986 5634 2942 9204 6132 1413 19666 21081 17582 8559 1865 13359
7193 13359 11685 12573 -11157 -19355 -11459 -1625 10040 11662 -1710 11472 -2996 -9114 -7115 -4348
7179 -4348 -6996 -2710 -1243 9101 -1311 -7874 -25141 -19481 -4876 -7983 -9316 -3560 2997 18232
7165 18232 32112 24992 12346 -552 -24808 -21122 -10862 -25985 -23366 -22527 -3731 2183 -11628
7152a1628j0623n120Q927Q193j5735p967j1165J4037k00P438O226j6188p474J1655
7138b9624J700J9744K1783o871O72L426j746j3726j3327J6689J0698k1932q03
7125a3317P945r310L490m360k478J0128N826p2R429K955j3270O324n7j8737j0036
7110b5540J2935q065R77J3548o265q693N530J843J4224j2288J0346j845m667K636
7096e324j2876p511p621O581J5308p140j6571N441j0895J1406N928N715J810Q196
7082g553j7141k3202l855K6140J9009O071L032R959J1190l186j0442j240j1911
7069c129r950R190p203j0770J215J536Q504n429o554L375L349j586J2220J4551
7055I319j4627j9206K471J8209q215n176j823N656K1638J3401j3956j1928L853
$$ plain form
7152 -11628 -22251 -27371 -18444 -10251 -25986 -33953 -45118 -31081 -31281 -23843 -17617 -33805 -41279 -29624
7138 -29624 -27924 -8180 13603 6732 7404 10830 9084 -4642 -17969 -1280 9418 -12514 -13317
7125 -13317 -5372 -14682 -11192 -15552 -18030 -7902 -2076 -2148 7281 10236 -3034 3290 3233 -15504 -25540
7110 -25540 -12605 -20670 -19693 -6145 -12410 -21103 -15573 -13730 494 -11794 -1448 -3293 -7960 -5324
7096 -5324 -18200 -25711 -33332 -26751 -11443 -18583 -35154 -29713 -40608 -29202 -23274 -17559 -15749 -7553
7082 -7553 -24694 -47896 -51751 -25611 -6602 -531 2501 12460 23650 20464 10022 8782 -3129
7069 -3129 -13079 -3889 -11092 -21862 -20647 -19111 -10607 -16036 -22590 -19215 -15866 -17452 -5232 9319
7055 9319 -5308 -24514 -22043 -3834 -12049 -17225 -19048 -13392 8246 21647 7691 -4237 -384
7042c84j628o248N769k4364j0407J6239P663Q03l518J0948p467J378J0456J0604
7028I844j3167q578J3009n645j0581m179j5721O229P397J5333j2296l800O196
7015a5959K1326l179M917K769j4072j7589J0231J1529j3180j7347L165L330n226
7002b9285j8437L1024Q95J009r885O565N600l021r724M974K1514J6131j08p074
6988A0178j047j2066J7264k2951J735N485q939j8212M566J4820P235R001J4871
6975B1940j2524l2376j988J6946K5211r765j7745r802j0772l630N060J1704M983
6962a2758k0929P355K2025n2l359q377j619J0902M759K80L126q584n890l038m270
6947b0429o164j9236j299m174J022Q738J2305J62j7129q126K8940J2387K686j136
$$ plain form
7042 -384 -2012 -8260 -2491 -26855 -37262 -21023 -13360 -12557 -16075 -5127 -12594 -11216 -760 9844
7028 9844 -3323 -11901 1108 -4537 -15118 -19297 -35018 -28789 -21392 -6059 -18355 -22155 -15959
7015 -15959 5367 2188 7105 9874 -4198 -21787 -11556 -27 -13207 -30554 -27389 -24059 -29285
7002 -29285 -47722 -16698 -15803 -14794 -24679 -18114 -12514 -15535 -25259 -20285 1229 17360 17252 10178
6988 10178 9131 -2935 14329 -8622 -6887 -1402 -10341 -28553 -23987 -9167 -1932 7069 21940
6975 21940 9416 -22960 -24948 -8002 17209 7444 -10301 -20103 -30875 -34505 -29445 -17741 -12758
6962 -12758 -33687 -26332 -4307 -4359 -7718 -16095 -17714 -6812 -2053 -1773 1353 -7231 -13121 -16159 -20429
6947 -20429 -26593 -45829 -47128 -51302 -50280 -41542 -29237 -29075 -46204 -54330 -25390 -13003 -10317 -11453
6933a1453j5783K978p04J0731J9J326P070J5127p131j9759N986j7337M61j06M641
6918b3934m428q033M917j0227k128M217L031J6897J452L544R357j267J459L133
6904b010q288J402L337L238m722k4508j2837J9422J6185m412j8168J0092j604
6891b2873j1702J1420J2609N663n651J60J0798N534m868j5401k996m933R029M259
6877h952N736l700J256j2557k182J25l060J2751J4744n249L610p400j6021Q056
6863a2843J9132K876L715J5198K3605j4535q702p801k6974j6365K359o615J397
6850b5553o632J6289N963k102J1066j1955K952j461R903R599l506j1330k946L365
6836f348n717n267k993j201J0326J548j6137O333K577O957j980p611K335N371
$$ plain form
6933 -11453 -27236 -24258 -24962 -14231 -14212 -12886 -5816 9311 2180 -17579 -11593 -28930 -28469 -28575 -23934
6918 -23934 -28362 -36395 -31478 -41705 -43833 -39616 -36585 -19688 -18236 -14692 -5335 -6602 -5143 -2010
6904 -2010 -10298 -8896 -5559 -2321 -7043 -31551 -44388 -24966 -8781 -13193 -31361 -21269 -22873
6891 -22873 -34575 -23155 -10546 -4883 -10534 -10374 424 5958 1090 -14311 -17307 -22240 -13211 -8952
6877 -8952 -3216 -6916 -5660 -18217 -20399 -20274 -23334 -10583 4161 -1088 2522 -4878 -20899 -12843
6863 -12843 6289 9165 12880 28078 51683 37148 28446 20645 -6329 -22694 -20335 -26950 -25553
6850 -25553 -32185 -15896 -9933 -12035 -969 -12924 -9972 -11433 -1530 8069 4563 -6767 -9713 -6348
6836 -6348 -12065 -17332 -20325 -21526 -11200 -9652 -25789 -19456 -16879 -9922 -11902 -19513 -17178 -11807
6822a1807M137M42o003m674K834O158q655n433j4232r588M782K2403J1055n25
6808i106K1662K234j0637j2461p174R004j022J339Q035K5472N508j5186k0623
6795b955k278n678J4092J5764J3624j4754j878j1006o655k224J8335N493j2125
6782G755j4511m819P781l029j6523R703k877K109l301j648Q737j5461K763Q403
6768a4918j8515J3897j1348k1113R105J2784K2408j7641j8627K4850J0393P172
6756a553j0889r066Q125r533J11Q235J6728J2671q402m374n034p169L440q857
6742a5567l130J6040q257j1707M376J5550j660k0500o062L378p02p207o807l33
6728d2588O901K2789J3601r207j145k838q117q546K5683K0146J0936j9582j7147
$$ plain form
6822 -11807 -7670 -7228 -13231 -17905 -15071 -8913 -17568 -23001 -37233 -46821 -42039 -19636 -8581 -9106
6808 -9106 12556 14790 4153 -8308 -15482 -6478 -7500 -6161 1874 27346 32854 17668 -2955
6795 -2955 -5233 -10911 3181 18945 32569 17815 15937 4931 -1724 -3948 14387 19880 7755
6782 7755 -6756 -11575 -3794 -6823 -23346 -13643 -16520 -14411 -17712 -19360 -10623 -26084 -23321 -14918
6768 -14918 -33433 -19536 -30884 -51997 -42892 -30108 -7700 -25341 -43968 -19118 -8725 -1553
6756 -1553 -12442 -21508 -13383 -22916 -22805 -14570 2158 14829 6427 2053 -2981 -10150 -6710 -15567
6742 -15567 -18697 -2657 -10914 -22621 -18245 -2695 -4355 -24855 -30917 -27539 -28241 -35448 -42255 -42588
6728 -42588 -35687 -12898 703 -8504 -9649 -12487 -20604 -29150 -3467 16679 27615 8033 -9114
6715i114j6089r84j399P828N986M586j9078k0137J8815J4128m034j2366R856k482
6701b4484n204n230O16N006J7033J990k944j988j0688j676j9309j6318o57M061
6687e9792J9566M151j4080k3K7189J6139J1472M018P272k0089o830m86m689q011
6673b4193p805O333K2105n306J1903p496k1447j2852N579J6396R492J851P85j1921
6659a6576J0626J5700o672j8897J2603J7901k2619n099J0499p946j1762j781J5976
6646h047P096j3579O855R562j0525j391J5883l673o689K1525q771j7421k298M7
6632a1426j2940M590K828l65j2206j2077N408J0767J2132j5951k504K454P618
6619b1672J7808J2190L660k4979j835K627R158r26r54J139n20m90k009O898o101
$$ plain form
6715 -9114 -25203 -26187 -27586 -19758 -13772 -9186 -28264 -48401 -29586 -15458 -19492 -31858 -22002 -24484
6701 -24484 -29688 -34918 -34302 -29296 -12263 -10273 -13217 -15205 -25893 -27569 -46878 -63196 -63853 -59792
6687 -59792 -40226 -36075 -50155 -50178 -22989 -6850 4622 8640 15912 -4177 -11007 -11493 -16182 -24193
6673 -24193 -31998 -25665 -3560 -8866 3037 -4459 -25906 -38758 -33179 -16783 -7291 -5440 -4655 -16576
6659 -16576 -5950 9750 3078 -15819 -3216 14685 -7934 -13033 -2534 -10480 -22242 -24023 -8047
6646 -8047 -951 -14530 -7675 1887 -8638 -10029 5854 2181 -4508 17017 8246 -9175 -11473 -11426
6632 -11426 -24366 -19776 -16948 -17313 -29519 -41596 -36188 -25421 -13289 -29240 -31744 -29290 -21672
6619 -21672 -3864 8326 11986 -12993 -14828 -12201 -3043 -3969 -4923 -3784 -4304 -4794 -6803 95 -6006
6604f006J565o866K412j384M947N583K477m060Q07k097j2018K208m981n074j402
6589b3889k456K1288M946k5446o398J3001j066n85Q821O227O094O868K223j6298
6575f670j8005Q98N735o417L026o792j756k371Q957J6288q343m911L783j529j2601
6560c0708R345L699m081L80J2228K2638O599r414n58n233N117M928j9543k0809
6546b5412r736J5797j448k113j932N732N701P302k613O712N146O930K298m720
6532G644k4785P47O459o918O801J1055n259K6912l43k1262Q531j381n186l75P936
6517A0576J2086r268j0225k435J5211j112j5611o25j4376k176K9353k495m790
6504D113j0715K664J0029j5875j7167q953J7010O497O048o908r723n376M449J1863
$$ plain form
6604 -6006 -4441 -11307 -8895 -10279 -5332 251 2728 -1332 -525 -2622 -14640 -12432 -17413 -22487 -23889
6589 -23889 -26345 -5057 -111 -25557 -31955 -18954 -20020 -20605 -11784 -5557 537 7405 9628 -6670
6575 -6670 -24675 -23777 -18042 -24459 -21433 -28225 -29981 -32352 -23395 -7107 -15450 -20361 -16578 -18107 -30708
6560 -30708 -21363 -17664 -21745 -21365 -9137 13501 20100 10686 10128 4895 10012 14940 -4603 -25412
6546 -25412 -35148 -19351 -20799 -22912 -24844 -19112 -13411 -6109 -8722 -2010 3136 10066 12364 7644
6532 7644 -17141 -16394 -9935 -16853 -10052 1003 -4256 22656 22313 1051 9582 8201 3015 2640 10576
6517 10576 22662 13394 3169 734 15945 14833 -778 -1403 -15779 -17955 11398 8903 4113
6504 4113 -6602 -3938 6091 -9784 -26951 -35904 -18894 -12397 -6349 -13257 -22980 -28356 -23907 -12044
6490a2044J478j1320j239L0499j1266Q5J3858q844J7007O228j4613j0331P574
6477G072p98j9959k7138J6081Q41j3984J3519N783L278L702J3328k240k696q258
6463a1469l451j0474j755J4567J7223O74n365j2580k0915l984N925J4928j29j3256
6449c0061n710j008M178k929l59K7179J1422j7859p705M169J51J1247Q658Q317
6435I690j9143J8343N262l617o793m8J099p196o505L215L062j6773j17R7k3839
6420d3263l703J3895J1299k65j008N816p277k887K962m103l758o77K0837K3247
6406A1115n716m505J640q380N36R063r885K873j026j0284j3243Q954q901q376
6392c6135J2516l882L371J826L181J458J2177k1989p253l777M601R542R667Q084
$$ plain form
6490 -12044 -10566 -21886 -23125 7374 -3892 -3807 10051 1207 18214 24442 9829 -502 7072
6477 7072 6274 -13685 -40823 -24742 -23901 -37885 -24366 -18583 -15305 -11603 1725 -515 -3211 -11469
6463 -11469 -14920 -25394 -27149 -12582 4641 5315 -50 -12630 -33545 -37529 -31604 -16676 -16805 -30061
6449 -30061 -35771 -36779 -32601 -35530 -35889 -8710 2712 -15147 -22852 -18683 -18532 -7285 1373 9690
6435 9690 -9453 8890 14152 10535 3742 3694 4793 -2403 -8908 -5693 -2631 -19404 -19521 -19424 -43263
6420 -43263 -46966 -33071 -21772 -22037 -23045 -17229 -24506 -27393 -24431 -28534 -32292 -32969 -12132 11115
6406 11115 5399 894 2534 -5846 -5310 3753 -6132 -3259 -4285 -14569 -27812 -18858 -27759 -36135
6392 -36135 -23619 -27501 -24130 -22304 -19123 -17665 -5488 -27477 -34730 -38507 -33906 -24364 -14697 -6613
6378f613N319l0460j3790Q089Q182J6444j415j669l244l996p397j7186J5396O916
6364b5424K5835J3808j2554j3859N482K022j8949r350N694N644P494j0724p712
6351c2593o428J4503J3707O923l542l065n869j1789L687K0197l075J0238J6526
6338A9420k204K239q990p112q592l092L333J7937Qn57l638K542p78r396k0287
6323a9167K921K983o627P417j628m616L962o227N286j8797K4381l442j4235k2
6309b7811J6593J9211j3229q563Q230J8383L839j0946k3335K347J0507r421P082
6296g113J6832n056j3698J697R870j7976j4023J7237L337q708m318j4963N065
6283c1817K0586J9815J629j1074j2740R130Q02j4148O629J0673N081m865J2001
$$ plain form
6378 -6613 -1294 -31754 -45544 -37455 -29273 -12829 -14244 -15913 -19157 -23153 -30550 -47736 -32340 -25424
6364 -25424 411 14219 1665 -12194 -6712 -4690 -23639 -32989 -27295 -21651 -14157 -24881 -32593
6351 -32593 -39021 -24518 -10811 -3888 -7430 -10495 -16364 -28153 -24466 -4269 -7344 2894 19420
6338 19420 17216 19455 10465 3353 -5239 -8331 -4998 12939 12947 12390 8752 11294 10516 1120 -19167
6323 -19167 -16246 -13263 -19890 -12473 -14101 -18717 -14755 -20982 -15696 -34493 -10112 -13554 -27789 -27811
6309 -27811 -11218 7993 -5236 -13799 -5569 12814 16653 5707 -17628 -15281 -4774 -14195 -7113
6296 -7113 9719 4663 -9035 -7338 2532 -15444 -29467 -12230 -8893 -17601 -21919 -36882 -31817
6283 -31817 -11231 8584 10213 -861 -13601 -4471 -3669 -17817 -11188 -515 4566 -299 11702
6270A1702k8665j6221J8487K3495j0878n917p455o528l663k3941r179K0094K155
6257c6514K4591P89q316J2641j4576L959J8247n026J5169J3756r921p912N731
6244A2618P358j6009J0960j3303k2899k371q160J1829K2137p723j2593J0779n916
6231a3293j5094j0413J34J184J9686k0439j0461L0133j2530R745J1375j479K269
6218i183m449q978m721O437n690l252Q378J5176K0216K580r242K094j2230K81
6204b583q141J1711J5207l469j4315R261J4450j1860k9090J291r396R751L6350
6191A9167J744l6677m455J2232j3190m508K2437R344P175J039k103j7073j2086
6178a6954O467l771J3899O541p950j5001k137K5159J6896Q42p35q576q662k8645
$$ plain form
6270 11702 -16963 -33184 -14697 8798 -2080 -7997 -15452 -21980 -25643 -49584 -58763 -38669 -36514
6257 -36514 -11923 -11134 -19450 -6809 -21385 -17426 821 -4205 10964 24720 14799 6887 12618
6244 12618 19976 3967 14927 1624 -21275 -23646 -31806 -19977 2160 -5563 -18156 -7377 -13293
6231 -13293 -28387 -38800 -38666 -37482 -17796 -38235 -48696 -18563 -31093 -21348 -9973 -11452 -9183
6218 -9183 -13632 -22610 -27331 -20894 -26584 -29836 -21458 -6282 13934 16514 7272 9366 -2864 -2583
6204 -2583 -10724 987 16194 12725 -1590 7671 22121 10261 -18829 -17538 -26934 -17183 19167
6191 19167 20911 -15766 -20221 -7989 -21179 -25687 -3250 6094 13269 14308 12205 -4868 -16954
6178 -16954 -10487 -14258 -359 6182 -1768 -16769 -18906 6253 23149 23991 23256 14680 6018 -22627
6164b2627m045J5296m808k2917M730l730q183R303Q401L398J0740r65L723J3951
6150B267j8522n868k694J2376N671n572J0394R311J1651j2005r959q003j0856
6137b1809O374J2070J4817J233j6701j5495m254j7116j2120N895L607K317q807
6124d9989q67J0284Q940Q010J3839J0118M104j2971j2119j2257r890k84K5940
6111a7142J0051R861j0202k0306k402K151n611J6033J3574j2931m178j229J4091
6098h240J0339N572M020L740j2432O686o24n887Q824j989r796J3065l69j1502
6084A407j1921O866O529j1403l259O995j0278M189j2269J0440j453N7K7048j7362
6070d414j1711j9718j2994P309L1541J8755r587l638p327q582r762L409m926L807
$$ plain form
6164 -22627 -26672 -11376 -16184 -39101 -34371 -38101 -46284 -36981 -28580 -25182 -14442 -15407 -11684 2267
6150 2267 -16255 -22123 -24817 -12441 -6770 -12342 -1948 7363 19014 7009 -2950 -10953 -21809
6137 -21809 -15435 -3365 11452 12685 -4016 -19511 -23765 -40881 -53001 -47106 -43499 -41182 -49989
6124 -49989 -50856 -40572 -31632 -23622 -9783 335 4439 -8532 -20651 -32908 -42798 -43082 -17142
6111 -17142 -7091 2770 -7432 -27738 -30140 -27989 -33600 -17567 -3993 -16924 -21102 -22331 -8240
6098 -8240 2099 7671 11691 15431 2999 9685 9061 3174 11998 10009 213 13278 12909 1407
6084 1407 -10514 -3648 2881 -8522 -11781 -4786 -15064 -10875 -23144 -12704 -14157 -14100 12948 -4414
6070 -4414 -16125 -35843 -48837 -41528 -9987 8768 -819 -4457 -11784 -20366 -30128 -26719 -31645 -27838
6056b7838K167J2538Q602n094m548M835Q763p08l838p385Q866J087p777k839k371
6041a5540K3597M242J158o604j9626l812q851J8116K1946j7827k55J2667k5337
6028a6126j4267J7531M410q496P494k704l279o917n242l681k911O5J2792J838
6014a9493l386p307J1058P674j4379j0635q355J3734N12O688J5561J2802r351
6001d877j5308J3360N842o694L048o415j688m433J5075J3241k182j7866r710o155
5987b4762p685O327l063n594k262J9018J1292R375m191j4051k404N677J5873P140
5973A0690j5305m627q855j631L996J7205Q40o506P476j0652j2423n361J7547L358
5959d248l017o843l972q006l261q596N646Q434N864N328J905n437L533J1743r259
$$ plain form
6056 -27838 -25671 -13133 -4531 -9625 -14173 -9338 -575 -1283 -5121 -12506 -3640 -2553 -10330 -13169 -15540
6041 -15540 8057 12299 13457 6853 -12773 -16585 -25436 -7320 14626 -3201 -3456 9211 -16126
6028 -16126 -30393 -12862 -8452 -16948 -9454 -12158 -15437 -22354 -27596 -31277 -34188 -34123 -21331 -19493
6014 -19493 -22879 -30186 -19128 -11454 -25833 -36468 -44823 -31089 -30577 -23889 -8328 4474 -4877
6001 -4877 -20185 -6825 -983 -7677 -4629 -11044 -12732 -17165 -2090 11151 8969 -8897 -18607 -24762
5987 -24762 -32447 -26120 -29183 -34777 -37039 -18021 -6729 2646 -1545 -15596 -18000 -12323 3550 10690
5973 10690 -4615 -9242 -18097 -19728 -15732 1473 2313 -4193 3283 -7369 -19792 -25153 -7606 -4248
5959 -4248 -7265 -14108 -18080 -26086 -29347 -37943 -32297 -23863 -17999 -12671 -10766 -16203 -12670 -927 -10186
5944a0186k864M149j1398l010J274L926j5519n595M774L382Q652R620j1107j1805
5930c5707J3759J0603J7055k245m983J8453j9181j0302n809q118q197J7174J1526
5917e972k696p051O436M274j0239j2183K1813j105q046p975k4266M42J7450K91
5903b8827L959J5373J0839K19j4180j0952q985J284L41j4839K3509O250p745O030
5889a7724K819o719R495p178k1598o248q02J4817k344j4404J7648J4821K5515
5876H098m595k0073q386P216K1907Q460j0028j7701j8619J4281R164j068R320
5863b024J3835M05n045n666j0914j3211K932M139j1655R828J6240o26p185J270
5849g677J4294J346k2736k66R97J4707J2770j0009j361j1653j0818Q708N765J54
$$ plain form
5944 -10186 -13050 -8901 -20299 -23309 -22035 -18109 -33628 -39223 -34449 -31067 -22415 -12795 -23902 -35707
5930 -35707 -21948 -11345 5710 3465 -1518 16935 -2246 -12548 -18357 -26475 -34672 -17498 -5972
5917 -5972 -8668 -15719 -9283 -5009 -15248 -27431 -5618 -6723 -14769 -22744 -47010 -46568 -29118 -28827
5903 -28827 -24868 -9495 1344 1563 -12617 -23569 -32554 -31270 -30929 -45768 -22259 -16009 -23754 -17724
5889 -17724 -14905 -21624 -12129 -19307 -40905 -47153 -47955 -33138 -35482 -49886 -32238 -17417 8098
5876 8098 3503 -16570 -24956 -17740 4167 12627 2599 -15102 -33721 -19440 -10276 -11344 -2024
5863 -2024 11811 12216 7171 1505 -9409 -22620 -19688 -15549 -27204 -17376 -1136 -1762 -8947 -7677
5849 -7677 6617 7963 -14773 -15039 -14042 665 13435 3426 2065 -9588 -20406 -11698 -5933 -5779
5835e779k026k721L129Q163r260j8241j5393J2366J1618K628J2343R067o393J6708
5821A6209J3384r617j6024j4370m623J3434m96n119j0017L43J1550O8l072l649
5807a1999k513n167r709J1986J1766K980J0879L67M315j6932p01P880j7007q894
5793b2749L047N532r522Q658K2514L037k9683J0336O620J923J0316R789n825j4428
5779d35L234j9477n863K5886O257l829K97n363j1364k126n164K806r30J1585J1676
5764G190J0933r089q342j7791j8605J2981K4866m042j8762Q014J068O640M306
5751f33j3719k257J2299Q875k781r399q798N797J1687N034J1420j2926l835M50
5737A214k1265q322j3277O909J8056J9046N346L4468l538j2794j0148n594j606
$$ plain form
5835 -5779 -7805 -10526 -7397 766 -8494 -26735 -42128 -29762 -18144 -15516 -3173 5894 -499 16209
5821 16209 29593 19976 3952 -10418 -15041 -1607 -2103 -7222 -17239 -16896 -5346 -5278 -8350 -11999
5807 -11999 -14512 -19679 -29388 -17402 -5636 -2656 8223 8590 12905 -4027 -4728 3152 -13855 -22749
5793 -22749 -19702 -14170 -23692 -15034 7480 10517 -19166 -8830 -2210 -287 10029 19818 13993 -435
5779 -435 2799 -16678 -22541 3345 9602 5773 6070 707 -10657 -12783 -17947 -15141 -16071 -4486 7190
5764 7190 18123 9034 692 -17099 -35704 -22723 2143 -1899 -20661 -12647 -11579 -4939 -633
5751 -633 -14352 -16609 -4310 4565 1784 -7615 -16413 -10616 1071 6105 17525 4599 764 1214
5737 1214 -20051 -28373 -41650 -34741 -16685 2361 7707 42175 38637 25843 15695 10101 8495
5724H495j1082l384n246Q054M000j0117j2202k358J122N239r335o588k200j486
5710c7088r328j314J3378J8946o649J2947J088M15j9736N8K2460l374j0808r786
5696b8791r746J0773J0758J2732j442K044J616o683J0378j4077k4270M464L4281
5683B037m462k0355j0661l17N34M628j3569P740J1756J7328J1715j1648j8110
5670b3384J5288Q488k329J0851j2319k216K0191J6455Q477k7878j7627k3770J1667
5657a8106J7041J6981n500j0828m067k865P019p42L328J081K415J0394j420J19
5643A4850L39p653J1279k485J595J1656j916k2963j0873n141O241J5618j504j8485
5629i442O27J71j4086j6971o797J0867J0537R707Q277q433P978K0746J289j3817
$$ plain form
5724 8495 -2587 -5971 -11217 -3163 837 -9280 -21482 -23840 -22718 -17479 -26814 -33402 -35602 -37088
5710 -37088 -46416 -47730 -34352 -15406 -22055 -9108 -8020 -7605 -27341 -27283 -4823 -8197 -19005 -28791
5696 -28791 -38537 -27764 -17006 -4274 -5716 -3672 -2056 -8739 1639 -12438 -36708 -32244 2037
5683 2037 -2425 -22780 -33441 -33758 -33224 -28596 -42165 -34425 -22669 -5341 6374 -5274 -23384
5670 -23384 -8096 392 -1937 8914 -3405 -5621 14570 31025 39502 11624 -6003 -29773 -18106
5657 -18106 -1065 15916 10416 -412 -4479 -7344 -325 -1067 2261 3342 5757 16151 14731 14850
5643 14850 15189 7536 18815 16330 17925 29581 27665 4702 -6171 -11312 -5071 10547 9043 -9442
5629 -9442 -8815 -8644 -22730 -39701 -46498 -35631 -25094 -15387 -7110 -15543 -7565 13181 14470 653
5615F53K434J1879o977q934k2625j1692J6222l329j0699p257j2285J6816N748
5602c0046j5101K951J8599L677J7584Q967r963k2773N204n33j5567n338o440M368
5588d4411K1896K4601J2682m945q258k7329J9954J9017K447o115J094j912K921
5575A1642k4713j2172j0951p266J3684j4160M642L0074q72j7149j500J3396J0988
5562d357j4200j6090m643O541L364J5213R243n978O36n975j6180R397N319J804
5548a5906M308j2484r709J7228o250J49P106n018j1102m965J6578J4264J78q23
5534f446m777k1147k142N544J2297J4448J530P497l268n781l362Q21l829J3863
5520E248M936o369K971P458R626k4172q660N843j0806j7545L748O778J2255N2
$$ plain form
5615 653 3087 14966 7989 -945 -23570 -35262 -19040 -22369 -33068 -40325 -52610 -35794 -30046
5602 -30046 -45147 -42196 -23597 -19920 -2336 6631 -3332 -26105 -20901 -21434 -37001 -42339 -48779 -44411
5588 -44411 -22515 2086 14768 9823 1565 -25764 -5810 13207 15654 9539 10633 8721 11642
5575 11642 -13071 -25243 -36194 -43460 -29776 -43936 -39294 -9220 -10092 -27241 -28741 -15345 -4357
5562 -4357 -18557 -34647 -39290 -32749 -29385 -14172 -4929 -10907 -10271 -16246 -32426 -23029 -17710 -15906
5548 -15906 -11598 -24082 -33791 -16563 -22813 -22664 -15558 -20576 -31678 -36643 -20065 -5801 -5623 -6446
5534 -6446 -11223 -32370 -34512 -28968 -16671 -2223 -693 6804 3536 -2245 -5607 -4786 -8615 5248
5520 5248 10184 3815 6786 14244 23870 -302 -8962 -3119 -13925 -31470 -27722 -20944 -8689 -8637
5506h637J450m386N043J5902j6448L482J5811j2563j3150p82R624J1881l655k472
5492A100j964j919k3458j0456J4484Q866J2746J7287j3053n036m82j5536J928
5479a5493L085J2417N784j9511P669J3204j6983j8135l056J4906n447N820J3420
5466b320J188j272j6608m194j4802j0401J684R093K5524L2712j0068j8061j0630
5453a8155n415j5136K910J0419J4939J1833K1521j6796j2554R738j225K520k043
5440B556j2846N42p469O36Q119P49j6870j1709j276K0191K8470L776k5052r353
5426a9536J4791L710j5511o238R935J9021J2477o021n759P628o803o537J7857
5413A9014j1911j5021J26J917O897j1782j1325K437r803J49k41R636K072q65J5800
$$ plain form
5506 -8637 -7187 -11573 -6530 9372 -7076 -3594 12217 -346 -13496 -14278 -4654 7227 3572 1100
5492 1100 -864 -2783 -26241 -36697 -22213 -13347 -601 16686 3633 -1403 -1885 -17421 -15493
5479 -15493 -12408 9 5793 -13718 -6049 7155 -9828 -27963 -31019 -16113 -21560 -15740 -2320
5466 -2320 -1132 -2404 -19012 -23206 -38008 -48409 -46725 -37632 -12108 20604 10536 -7525 -18155
5453 -18155 -23570 -38706 -35796 -25377 -10438 1395 22916 6120 -6434 3304 2079 4599 2556
5440 2556 -10290 -9748 -17217 -16581 -8462 -7713 -24583 -36292 -37568 -17377 11093 14869 -10183 -19536
5426 -19536 -4745 -1035 -16546 -22784 -12849 6172 18649 12628 6869 14497 7694 1157 19014
5413 19014 7103 -7918 -7792 -5875 1022 -10760 -22085 -19648 -29451 -29302 -29543 -19907 -17835 -18700 -2900
5398b900J8348M824N085m234j073m601j3739j0011n219j1589J1835L4729j2161
5385I294k3811R790k250N282J5329m41r722q411Q32r526j4081r523P921Q431q866
5370b9752j334j289Q334Q213O732P343m739R63J7321Q434j2729j5472l191q472
5356a9638j0699p244K717J9203K0023q155k1732m79J3987j022q505l144j171J1040
5342a4819K781J0416J5495r738k4367k9854J1947L144Q933J9182N838k142J2676
5329I492o074k2508j2683P535R025L717j0799j2839k944L829J752L993Q755o255
5315b6004k0581p67L352l563p37J8119J5502J0769j3067k169K5084m463k7797
5302b6322M533O960j0181J4938M574n143p761j6403O108K2072l756j007Q425J3166
$$ plain form
5398 -2900 15448 20272 25357 21123 20050 15449 1710 -8301 -13520 -25109 -13274 21455 9294
5385 9294 -14517 -4727 -6977 -1695 13634 13193 3471 -4940 -4108 -13634 -27715 -37238 -29317 -20886 -29752
5370 -29752 -31086 -32375 -24041 -15828 -9096 -1753 -6492 -5529 11792 20226 7497 -7975 -11166 -19638
5356 -19638 -30337 -37581 -34864 -15661 4362 -3793 -25525 -26004 -12017 -13039 -21544 -24688 -25859 -14819
5342 -14819 -12038 -1622 13873 4135 -20232 -50086 -38139 -34995 -26062 -6880 -1042 -3184 9492
5329 9492 3418 -19090 -31773 -24238 -15213 -11496 -22295 -35134 -38078 -34249 -32497 -28504 -19749 -26004
5315 -26004 -46585 -47352 -44000 -47563 -48300 -30181 -14679 -3910 -16977 -19146 5938 1475 -26322
5302 -26322 -21789 -14829 -25010 -10072 -5498 -10641 -18402 -34805 -28697 -6625 -10381 -11388 -2963 10203
5288A0203k2238j020J0005K125J612M270k0000l386K190k533J8170Q667l059M333
5274I339Q023J123p869o532p760M129J9503J0830m039j9251j9248q637o432k357
5260b9178O465J4338J9127m136K123k2505j2198R650n859j0875l068J5995J4252
5247e869J739k5454p059m550J4033K7146M044j8897M348J6279m83k2219j4785
5234c1727R037J1606J3549k140J359N4n889J5252K899J287J4909O502k0142k3583
5220g027j2715J187J1181J5801J501r791j1571l865J459J7509n660j6833o395
5207b5219J1683J5718l669N924N443r369j0587k2409M901K942j944J599j8873
5194d3860p466O830K539N323J1398J2823R443O770J6037r572m361j1996J1798
$$ plain form
5288 10203 -12035 -13055 -3050 -925 687 4957 -15043 -18429 -16239 -18772 -602 8065 5006 9339
5274 9339 17362 18485 10616 4084 -3676 453 19956 30786 26747 7496 -11752 -20389 -26821 -29178
5260 -29178 -22713 -8375 10752 6616 8739 -13766 -25964 -16314 -22173 -33048 -36116 -20121 -5869
5247 -5869 -4130 -29584 -36643 -41193 -27160 -14 4030 -14867 -10519 5760 5277 -16942 -31727
5234 -31727 -22690 -11084 2465 325 1684 1738 -4151 11101 14000 15287 30196 36698 16556 -7027
5220 -7027 -19742 -18555 -7374 8427 9928 137 -11434 -15299 -13840 3669 -1991 -18824 -25219
5207 -25219 -13536 2182 -1487 4437 9880 511 -10076 -32485 -27584 -24642 -26586 -24987 -43860
5194 -43860 -51326 -44496 -41957 -36634 -25236 -12413 -2970 3800 19837 10265 5904 -6092 5706
5181E706p857J239N209j1787k111k256j755J8996K10n105r8L624o570Q699j054
5166E090j4926K00j0295J0765J8879k244R009K556j8038j4032J7005j3801k615
5153a2447j2678p33j1296J3740n6J1843q737k5824m566j930K1798J5475K194j2064
5139b5281o948N869j886j863K538j140r759J0904J3952J6875j0376O906n18j0583
5125a1310P068j1030J8379R819j5875j1046k633K147j4897J0800L897o03J4150
5112a134k1338j291L315j954J6041j1624r880K6096K0919J6279j7146k3398n026
5099a0141m152Q678l067j6251J0233K5563L529j886j5287j1771k519P158o157
5086a6070N860J6334n516j3702k090J3580q694J756k308J549n217J7296q104m791
$$ plain form
5181 5706 -2151 -912 4297 -7490 -9601 -11857 -13612 5384 5594 489 391 4015 -2555 6144 5090
5166 5090 -9836 -9636 -19931 -9166 9713 7469 16478 19034 996 -13036 3969 -9832 -12447
5153 -12447 -25125 -25858 -37154 -23414 -23470 -11627 -20364 -46188 -50754 -52684 -30886 -15411 -13217 -25281
5139 -25281 -32229 -26360 -28246 -30109 -27571 -28711 -38470 -27566 -13614 3261 -7115 -209 -727 -11310
5125 -11310 -4242 -15272 3107 12926 -2949 -13995 -16628 -14481 -29378 -18578 -14681 -15284 -1134
5112 -1134 -22472 -23763 -20448 -22402 -6361 -17985 -27865 -1769 19150 35429 18283 -5115 -10141
5099 -10141 -14293 -5615 -8682 -24933 -14700 10863 14392 12506 -2781 -14552 -17071 -9913 -16070
5086 -16070 -10210 6124 608 -13094 -15184 -1604 -10298 -8542 -10850 -9301 -14518 2778 -5326 -10117
5072a0117P413R976j129j0526M638N255p685q133j0638Q584M282J98R637J1385
5058A3140O639j8408k5623j362R558n624j6339J8605J548l489q867j1503O513
5045c5212O856m381L197O594R528Q126r97p849j378J1334L668Q859k726P820L611
5030A7050j1183p678J3307n437j1820K652L358K4428J0168o587j6365k523M714
5017A4084p985j6608j5022j299J1601L18J164J3733j2859K21L997l243j718J3804
5003A88Q647M170j0879q93o95p924O494J919j0804j4713J2116m828J117R201J491
4988e393J5828r995j2327K1830K0656j7487r827j671N075l106o949m506p899N309
4974a0462N401q878p436N534p968k708K0586K9354j6200j8887R693R967k409n31
$$ plain form
5072 -10117 -2704 7272 6143 -4383 255 5510 -2175 -10308 -20946 -12362 -8080 -7882 1755 13140
5058 13140 19779 1371 -24252 -25614 -16056 -21680 -38019 -19414 -17866 -21355 -30222 -41725 -35212
5045 -35212 -28356 -32737 -29540 -22946 -13418 -5292 -6289 -14138 -15516 -4182 -514 8345 5619 13439 17050
5030 17050 5867 -1811 11496 6059 -5761 -3109 249 24677 34845 28258 11893 9370 14084
5017 14084 6099 -10509 -25531 -26830 -15229 -14911 -13747 -14 -12873 -12652 -8655 -11898 -13616 188
5003 188 8835 13005 2126 1233 538 -7386 -892 1027 -9777 -24490 -12374 -17202 -16085 -6884 -5393
4988 -5393 10435 440 -11887 9943 30599 13112 3285 1614 6689 3583 -3366 -7872 -15771 -10462
4974 -10462 -5061 -13939 -21375 -15841 -23809 -26517 -5931 23423 7223 -11664 -1971 7996 5587 5056
4960E056K2422N685j3171k7598j7543K9016n508j8061p143m194m812P028J2207
4947a6616P132J353k5368l736L0662N149m330P629J5685Q418J6816r818j9127
4934A3849k4056j606J626l495L919N359N324j454m319Q498J4618q979j0427j1609
4920a2752M698K3082N065j0663j3407J0994O899o89l798j054K723q691k1072p257
4906b5922l875J8989K3969O554k4284j2641P402J4422j0206O969m149o638J9146
4893I736K4173p35j6381M85J391j1576p020k0448j4321R411J4588K2522M24j3280
4879a031K606J290k2928q157J3313J8918N299j2839j3746j2594R395Q34k6984
4866d6624o256K5697M0557N483N561j4142k8421j3789R112J807p68m49j2178R204
$$ plain form
4960 5056 27478 33163 19992 -7606 -25149 3867 -1641 -19702 -26845 -31039 -35851 -28823 -16616
4947 -16616 -9484 -8131 -33499 -37235 -6573 -1424 -5754 1875 17560 25978 42794 32976 13849
4934 13849 -10207 -11813 -10187 -13682 -9763 -4404 920 -534 -4853 3645 18263 9284 -1143 -12752
4920 -12752 -8054 15028 20093 9430 -3977 7017 13916 13227 9429 8375 11098 2407 -18665 -25922
4906 -25922 -29797 -10808 13161 19715 -4569 -17210 -9808 4614 -5592 1377 -2772 -9410 9736
4893 9736 33909 33174 16793 17278 18669 7093 73 -20375 -34696 -25285 -10697 11825 12249 -1031
4879 -1031 1575 2865 -20063 -28220 -14907 4011 9310 -3529 -17275 -29869 -20474 -19640 -46624
4866 -46624 -52880 -27183 13374 18857 24418 10276 -18145 -31934 -22822 -21015 -21783 -22232 -34410 -25206
4852b5206J8016J0486K275L775L140P423L17l0595j3939p355J6361J2469j734
4839d567L36K6308J0637k4098j3014K3337K9251M977j0755k9192k5487l350J751
4826a3866j7903m176n938o895K0486R357L9659l67j7582j8806L276K0517j1756
4813c994p936J5588n433q059k1691p728m309n431J5370J9961J3693J896o71m602
4799c346p424n15k257J566M517P909o941O941J7701P973O424j7959q661J319P952
4784A5199j3670M223J0265j2965n282J7221Q982K175l860j7045J119J9662j3612
4771A2412j9355N91K6762j4486n691q702K483r448j5637O349K2584O830j4193
4758i501l972j3826J6960m965q63J1674R623J7312l765j1055O28l2109q209K1145
$$ plain form
4852 -25206 -7190 3296 5571 9346 12486 19909 20226 -10369 -24308 -31663 -15302 -2833 -4567
4839 -4567 -4231 22077 32714 8616 -4398 18939 48190 53167 42412 13220 -12267 -15617 -13866
4826 -13866 -31769 -35945 -41883 -48778 -28292 -18935 20724 20357 2775 -16031 -12755 7762 -3994
4813 -3994 -11930 3658 -1775 -9834 -31525 -39253 -43562 -48993 -33623 -13662 31 1927 1256 -3346
4799 -3346 -10770 -11285 -13542 -11976 -7459 450 -6491 450 18151 26124 32548 14589 5928 7247 15199
4784 15199 1529 5752 16017 3052 -2230 14991 23973 26148 22288 5243 6362 26024 12412
4771 12412 -6943 -6352 20410 5924 233 -8469 -5986 -15434 -31071 -24722 -2138 4692 -9501
4758 -9501 -13473 -27299 -10339 -15304 -16167 -4493 5130 22442 18677 7622 8250 -23859 -32068 -10923
4744a0923J9908N412o165J0024m277r167R248O955K122j3502k382o569n051j1004
4730a5371K438K686M099M572rK046R341J9079J534n585K023l752J857j3339j8241
4715f622r968O583j0349P377J4072P266n755m813j572M033r614J499n499q498
4701b1860R635l950N747K366R205J2079j174o103l992N961r766j4622k1139n55
4687c8168N988n794P769N692L480O08l325M828J6070P95j0904j037M907k69J3480
4672D120r022J148J3958m699k4514O78r443l735O233J3062o0j3347q340O719Q581
4657a8661M35q6n466J7409P177J6151m67K169j5387n607M469R137J3188m172l027
4642A7262j4594o428O979N970J371m598J1189P716j7304o620j0413N205P00p284
$$ plain form
4744 -10923 8985 14397 8232 18256 13979 4812 14060 21015 23137 9635 7253 684 -4367 -15371
4730 -15371 -12933 -10247 -6148 -1576 -1585 461 9802 28881 30415 24830 26853 23101 24958 11619 -6622
4715 -6622 -16590 -10007 -20356 -12979 1093 8359 2604 -2209 -3781 252 -9362 -7863 -13362 -21860
4701 -21860 -12225 -16175 -10428 -8062 1143 13222 12048 5945 1953 7914 -1852 -16474 -37613 -38168
4687 -38168 -32180 -37974 -30205 -24513 -21033 -20425 -23750 -18922 -2852 -2057 -12961 -13998 -9091 -9360 4120
4672 4120 -4902 -3754 10204 5505 -19009 -18331 -27774 -31509 -25276 -12214 -12274 -25621 -33961 -27242 -18661
4657 -18661 -18226 -18312 -23778 -6369 808 16959 16492 18661 3274 -2333 2136 11273 24461 20289 17262
4642 17262 2668 -3760 3219 9189 10560 5962 17151 24867 7563 943 -9470 -4265 -3565 -10849
4628a0849L64K4764M902m097p733k0500J5813k914j0024j4406J8716k611k851
4615a1426K2640N883J968K849p601j7078M073l317j0034j8357r215N741j4588
4602d8462Q449J6915K2381J3307r294o591Q858p08J267j1805j4188M886J2560
4589b425J2087q037L018j3840k1450m272J5834Q973R018L986N134O384j0433j7460
4575a3483m870J317K1011j416n50P741Q574j4533j6604P663J8643R806j40r479
4561A3680l3960r508K537j3390M974J0974J0727r510j1015K2941M048K1288p548
4548F238j2928j562j631j7155J201K1735q861J9245J5909k531j9018j6384j8111
4535c3853j092K812n316j006Q544J7883k454j7018J2042K9335m737k6701J179
$$ plain form
4628 -10849 -10485 14279 19181 15084 7351 -13149 2664 -250 -10274 -24680 -5964 -8575 -11426
4615 -11426 11214 17097 19065 21914 14313 -2765 1308 -2009 -12043 -30400 -39615 -33874 -48462
4602 -48462 -40013 -23098 -717 12590 3296 -3295 5563 4855 6122 -5683 -19871 -14985 -2425
4589 -2425 9662 1625 4643 -9197 -30647 -34919 -19085 -10112 -1094 2892 8026 14410 3977 -13483
4575 -13483 -18353 -17036 3975 2559 2009 9750 18324 3791 -12813 -5150 13493 23299 23159 13680
4561 13680 -20280 -29788 -27251 -40641 -35667 -24693 -13966 -23476 -34491 -11550 -7502 13786 6238
4548 6238 -6690 -8252 -9883 -27038 -25837 -4102 -12963 6282 22191 19660 642 -15742 -33853
4535 -33853 -34945 -32133 -37449 -38455 -29911 -12028 -14482 -31500 -19458 9877 5140 -21561 -20382
4522b0382m910J0417k0494L637L661J4776J0885k729M931k5019k2001L260M938
4509c9030J5210J4087k359j7458q156N579J9536J0357q464m066p295l413K6173
4496G01Q827k1007p306m60Q0K1352J547N820Q868N810r659O15p768j7307m419
4481a4306J0065L962j2927k1871M653K522o553J502K4607j079r591J836K4827
4468G647J7199j8509j6423n706q841J2144L764n402j1235j4880J3776J2667L857
4455i942J0728k974m487n33l602j0011r407J0975J3927N63J990j7807n359K0373
4441e566Q265r019M717k228p773k5345Q85N87J5741k95q482L008J2841J3997L470
4426D803N717K2061Q823j2466m510M86k979j6466j0960r26J0474K0550m364j6424
$$ plain form
4522 -20382 -25292 -14875 -35369 -31732 -28071 -13295 -2410 -5139 -208 -25227 -47228 -43968 -39030
4509 -39030 -23820 -9733 -12092 -29550 -37706 -32127 -12591 -2234 -10698 -14764 -22059 -25472 701
4496 701 9528 -11479 -18785 -19245 -19165 2187 3734 9554 18422 24232 14573 15188 7420 -9887 -14306
4481 -14306 -4241 -279 -13206 -35077 -30424 -27902 -34455 -32953 -8346 -9425 -19016 -17180 7647
4468 7647 24846 6337 -10086 -15792 -24633 -12489 -8725 -14127 -25362 -40242 -26466 -13799 -9942
4455 -9942 786 -2188 -6675 -7208 -10810 -20821 -30228 -19253 -5326 -4763 -2773 -20580 -25939 -5566
4441 -5566 2699 -6320 -1603 -3831 -11604 -36949 -36064 -35477 -19736 -20031 -28513 -25505 -12664 1333 4803
4426 4803 10520 32581 41404 28938 24428 24914 21935 5469 -5491 -6417 4057 24607 20243 3819
4412C819j9699o942Q946q580p086J4976O056K5671J4972j5120j0683j541j727
4399C062J099j5529j052N740K61Q775o008M405N340m99l482j949r574j5818l527
4384b8756j904K723R477l569K308J494Q114j26L565J0830m828k8507j7169J1987
4370c4361K4434J1027J0432j8719J6962M453j3144j9471J3662K3773m950k968
4358A1130o096j5607m0R063l247j6344k69J2204J9648J842n991o560q640j1386
4344b0293J4673Q475J2500P728L434j693o06j9472m028n819k006J3366l725o122
4330c588P976M752J6902j0090O284o643k0631k2252L456N333k1794J446J2152
4317b6697R794K6473j268j6134o61K0507N819j0677q76O606J7565J471l1398p459
$$ plain form
4412 3819 -15880 -22822 -13876 -22456 -29542 -14566 -8510 17161 32133 17013 6330 4789 3062
4399 3062 4161 -11368 -12420 -6680 -6419 2356 -3652 753 6093 5594 2112 163 -9411 -25229 -28756
4384 -28756 -30660 -27937 -18460 -22029 -19721 -18227 -10113 -10239 -6674 4156 -672 -29179 -46348 -34361
4370 -34361 -9927 1100 11532 -7187 9775 14228 1084 -18387 -4725 19048 14098 11130
4358 11130 5034 -10573 -10613 -1550 -4797 -21141 -21410 -9206 10442 12284 6293 -267 -8907 -20293
4344 -20293 -5620 2855 15355 23083 26517 24824 24218 4746 718 -5101 -7107 6259 2534 -3588
4330 -3588 4388 9140 26042 15952 22236 15593 -5038 -27290 -23834 -18501 -40295 -38849 -26697
4317 -26697 -16903 9570 8302 -7832 -8493 12014 17833 7156 6280 12886 30451 31922 524 -6935
4303f935Q44r207K2099J4758R639O014n945j4066j3462K187j2962j6653m640J22
4289b8207J324P020K3218K6376j562j5644L81j0325q365k527k2243k993O530J3935
4275a3082L829k756m096q9q110R642P498K5028j568n198j2004l724L990J147N529
4260F036j2608k4932m557J4476m984J597q13R661l789P373K336r53r252O289L286
4245a0834k645j2185j070j1390j4709J4381K4202M884l159o034k0598j621N292
4232c5486K6092Q465j5656N080m448n284j0382p854R860J4710J3080M730L155
4219F062j0504j2963o53J3106J7478j2213r88J3241n463K3681n914j8328J339
4206G881n420L23q999N696j6862m060P821Q213R850L79j0406o804k933J2465l384
$$ plain form
4303 -6935 -6091 -15298 6801 21559 31198 37212 31267 17201 3739 5926 -7036 -23689 -28329 -28207
4289 -28207 -26883 -19863 3355 29731 28169 12525 12906 2581 -5784 -8311 -30554 -33547 -27017 -13082
4275 -13082 -9253 -12009 -16105 -16194 -24304 -14662 -7164 17864 16296 11098 -906 -4630 -640 507 6036
4260 6036 -6572 -31504 -36061 -21585 -26569 -24972 -25785 -16124 -19913 -12540 -10204 -11157 -20409 -14120 -10834
4245 -10834 -13479 -25664 -26734 -38124 -52833 -38452 -14250 -9366 -12525 -18559 -39157 -40778 -35486
4232 -35486 -9394 -929 -16585 -11505 -15953 -21237 -31619 -39473 -29613 -14903 -1823 2907 6062
4219 6062 -4442 -17405 -18058 -4952 12526 313 -675 12566 7103 30784 24870 6542 7881
4206 7881 2461 2784 -6215 -519 -17381 -21441 -13620 -5407 4443 4822 -5584 -12388 -15321 -2856 -6240
4191f240R76N541J3659o302j1838j0114J3454J7587j1980j7638m582M2Q717l654
4177a2372n162J6097J1972K0672j7960m888J347k519Q028J007j0460j5317n105
4164a4660N238k419L939K242k198l798K887P734l122k1235M540R368j8831J7134
4150a3181L2840J369j028O987r589j1816q235J222K0542J929n538K420m35j3504
4136C983N390k801j711Q725j1529M80M764J169J503j2571j3148J735r140o22J7333
4121f440O607m408j313K525J749J8815J1954L787K498q348k2615k1444q710m813
4107c0156J732Q924R807O150K8988j5847j6066q172J4976j1824R284J258j59p837
4093h942J701K495J973L91O865J0479M934q172k736k9253j2339j521j497J5476
$$ plain form
4191 -6240 -5264 277 13936 7634 -4204 -14318 -864 16723 4743 -12895 -17477 -17435 -8718 -12372
4177 -12372 -17534 -1437 10535 31207 13247 8359 9706 7187 15215 16222 5762 -9555 -14660
4164 -14660 -9422 -11841 -7902 -5660 -7858 -11656 -8769 -1035 -4157 -25392 -20852 -11484 -30315 -13181
4150 -13181 19659 21028 20000 26987 17398 5582 -2653 -1431 19111 21040 15502 17922 17487 3983
4136 3983 9373 6572 4861 13586 2057 2537 7301 8470 9973 -2598 -15746 -14011 -23151 -23773 -6440
4121 -6440 167 -4241 -5554 -3029 -1280 17535 29489 33276 35774 27426 4811 -16633 -25343 -30156
4107 -30156 -28424 -19500 -9693 -3543 25445 9598 -6468 -14640 336 -11488 -2204 -946 -1105 -8942
4093 -8942 -7241 -4746 -2773 -2382 4483 14962 19896 11724 8988 -20265 -32604 -34125 -35622 -20146
4079b0146J3266j3168J3555M798M743R494L301j8641o525J4848J7320m749k037
$$ plain form
4079 -20146 -6880 -20048 -6493 -1695 3048 12542 15843 -2798 -9323 5525 22845 18096 16059
$$ [...]
##END NTUPLES=NMR SPECTRUM
##END=
