##TITLE=XTC-966_3
##JCAMPDX= 6.0         $$ Bruker NMR JCAMP-DX V2.0
##DATA TYPE= NMR SPECTRUM
##DATA CLASS= NTUPLES
##ORIGIN= BRUKER
##OWNER= patiny
$$ 1.79 TOPSPIN		Version 3.0
$$ 2012-05-19 16:59:10.827 +0200  patiny@icmbsg005
$$ Compression mode = diff/dup
##.OBSERVE FREQUENCY= 400.13188181139
##.OBSERVE NUCLEUS= ^1H
##.ACQUISITION MODE= SIMULTANEOUS (DQD)
##.ACQUISITION SCHEME= undefined
##.AVERAGES= 16
##.DIGITISER RES= 23
##SPECTROMETER/DATA SYSTEM= spect
##.PULSE SEQUENCE= zgpr
##.SOLVENT NAME= D2O
##.SHIFT REFERENCE= INTERNAL, D2O, 1, 11.69961
##AUDIT TRAIL= $$ (NUMBER, WHEN, WHO, WHERE, PROCESS, VERSION, WHAT)
$$ ##TITLE= Audit trail, TOPSPIN		Version 3.0
$$ ##JCAMPDX= 5.01
$$ ##ORIGIN= Bruker BioSpin GmbH
$$ ##OWNER= patiny
$$ $$ /opt/data/patiny/nmr/XTC-966_3/11/pdata/1/auditp.txt
$$ ##AUDIT TRAIL=  $$ (NUMBER, WHEN, WHO, WHERE, PROCESS, VERSION, WHAT)
(   1,<2012-05-19 16:59:09.299 +0200>,<patiny>,<icmbsg005>,<go>,<TOPSPIN 3.0>,
      <created by zg
	started at 2012-05-19 16:57:23.390 +0200,
	POWCHK enabled, PULCHK disabled,
       configuration hash MD5:
       77 C7 B7 C4 10 F4 BA 30 64 2E BB 52 82 F2 DA 41
       data hash MD5: 32K
       7D 93 03 ED 83 3F A0 9E E2 99 1A 41 63 88 66 9F>)
(   2,<2012-05-19 16:59:09.694 +0200>,<patiny>,<icmbsg005>,<audit>,<TOPSPIN 3.0>,
      <user comment:
       ICON-NMR User ID: patiny
       data hash MD5: 32K
       7D 93 03 ED 83 3F A0 9E E2 99 1A 41 63 88 66 9F>)
(   3,<2012-05-19 16:59:10.363 +0200>,<patiny>,<icmbsg005>,<proc1d>,<TOPSPIN 3.0>,
      <Start of raw data processing
       ef LB = 0 FT_mod = 6 PKNL = 1 SI = 16K 
       data hash MD5: 16K
       FD 03 ED 38 E2 84 16 F1 B1 09 61 FA EB 46 2D 45>)
(   4,<2012-05-19 16:59:10.470 +0200>,<patiny>,<icmbsg005>,<proc1d>,<TOPSPIN 3.0>,
      <apk 
       data hash MD5: 16K
       35 93 AD BF BD 6B 2B 42 E3 32 2A 45 44 81 1B E5>)
(   5,<2012-05-19 16:59:10.496 +0200>,<patiny>,<icmbsg005>,<proc1d>,<TOPSPIN 3.0>,
      <abs ABSG = 5 
       data hash MD5: 16K
       00 12 9B A9 A3 0D E0 F6 20 40 AA DA C3 80 28 F6>)
$$ ##END=
$$ 
$$ $$ hash MD5
$$ $$ 8E 17 EE F4 80 1C B1 F2 70 F3 8B 00 33 30 8F 5B
##$RELAX= 
##$RELAX= 
##$RELAX= 
##$RELAX= 
##$RELAX= 
##$RELAX= 
##$RELAX= 
##$RELAX= 
##$RELAX= 
##$RELAX= 
##$RELAX= 
##$RELAX= 
##$RELAX= 
$$ Bruker specific parameters
$$ --------------------------
##$DATPATH= </opt/data/patiny/nmr>
##$EXPNO= 11
##$NAME= <XTC-966_3>
##$PROCNO= 1
##$ACQT0= -9.16730304209974
##$AMP= (0..31)
100 100 100 100 100 100 100 100 100 100 100 100 100 100 100 100 100 100
100 100 100 100 100 100 100 100 100 100 100 100 100 100
##$ANAVPT= -1
##$AQSEQ= 0
##$AQ_mod= 3
##$AUNM= <au_zgglp>
##$AUTOPOS= <24 >
##$BF1= 400.13
##$BF2= 400.13
##$BF3= 400.13
##$BF4= 400.13
##$BF5= 400.13
##$BF6= 400.13
##$BF7= 400.13
##$BF8= 400.13
##$BYTORDA= 0
##$CAGPARS= (0..11)
0 0 0 0 0 0 0 0 0 0 0 0
##$CFDGTYP= 0
##$CFRGTYP= 9
##$CHEMSTR= <none>
##$CNST= (0..63)
1 1 1 1 1 1 1 1 1 1 1 1 1 1 1 1 1 1 1 1 1 1 1 1 1 1 1 1 1 1 1 1 1 1 1 1
$$ [...]
##$TE2= 0
##$TE3= 0
##$TE4= 0
##$TEG= 300
##$TE_PIDX= 1
##$TE_STAB= (0..8)
2 2 0 0 0 0 0 0 0
##$TL= (0..7)
120 120 120 120 120 120 120 120
##$TP= (0..7)
150 150 150 150 150 150 150 150
##$TPNAME0= <>
##$TPNAME1= <>
##$TPNAME2= <>
##$TPNAME3= <>
##$TPNAME4= <>
##$TPNAME5= <>
##$TPNAME6= <>
##$TPNAME7= <>
##$TPOAL= (0..7)
0.5 0.5 0.5 0.5 0.5 0.5 0.5 0.5
##$TPOFFS= (0..7)
0 0 0 0 0 0 0 0
##$TUNHIN= 0
##$TUNHOUT= 0
##$TUNXOUT= 0
##$USERA1= <>
##$USERA2= <>
##$USERA3= <>
##$USERA4= <>
##$USERA5= <>
##$V9= 5
##$VALIST= <>
##$VCLIST= <>
##$VD= 0
##$VDLIST= <>
##$VPLIST= <>
##$VTLIST= <>
##$WBST= 1024
##$WBSW= 4
##$XGAIN= (0..3)
0 0 0 0
##$XL= 0
##$YL= 0
##$YMAX_a= 7313590
##$YMIN_a= -4798634
##$ZGOPTNS= <>
##$ZL1= 120
##$ZL2= 120
##$ZL3= 120
##$ZL4= 120
##$ABSF1= 11.69961
##$ABSF2= -2.293603
##$ABSG= 5
##$ABSL= 3
##$ALPHA= 0
##$AQORDER= 0
##$ASSFAC= 0
##$ASSFACI= 0
##$ASSFACX= 0
##$ASSWID= 0
##$AUNMP= <save_auto_nonLDAP.pm>
##$AXLEFT= 0
##$AXNAME= <>
##$AXNUC= <1H>
##$AXRIGHT= 0
##$AXTYPE= 0
##$AXUNIT= <>
##$AZFE= 0.1
##$AZFW= 0.1
##$BCFW= 0
##$BC_mod= 0
##$BYTORDP= 0
##$COROFFS= 0
##$CY= 15
##$DATMOD= 1
##$DC= 0
##$DFILT= <>
##$DTYPP= 0
##$ERETIC= no
##$F1P= 0
##$F2P= 0
##$FCOR= 0.5
##$FTSIZE= 16384
##$FT_mod= 6
##$GAMMA= 0
##$GB= 0
##$INTBC= 1
##$INTSCL= 1
##$ISEN= 128
##$LB= 0
##$LEV0= 0
##$LPBIN= 0
##$MAXI= 10000
##$MC2= 0
##$MEAN= 0
##$ME_mod= 0
##$MI= 0
##$NCOEF= 0
##$NC_proc= -5
##$NLEV= 6
##$NOISF1= 0
##$NOISF2= 0
##$NSP= 0
##$NTH_PI= 0
##$NZP= 0
##$OFFSET= 11.69961
##$PC= 1
##$PHC0= 87.74125
##$PHC1= 2.039936
##$PH_mod= 1
##$PKNL= yes
##$PPARMOD= 0
##$PPDIAG= 0
##$PPIPTYP= 0
##$PPMPNUM= 2147483647
##$PPRESOL= 1
##$PSCAL= 0
##$PSIGN= 0
##$PYNMP= <proc.py>
##$REVERSE= no
##$SF= 400.13
##$SI= 16384
##$SIGF1= 0
##$SIGF2= 0
##$SINO= 0
##$SIOLD= 16384
##$SPECTYP= <>
##$SREGLST= <1H.CDCl3>
##$SSB= 0
##$STSI= 16384
##$STSR= 0
##$SW_p= 5599.10414333707
##$SYMM= 0
##$S_DEV= 0
##$TDeff= 32768
##$TDoff= 0
##$TI= <>
##$TILT= no
##$TM1= 0
##$TM2= 0
##$TOPLEV= 0
##$USERP1= <>
##$USERP2= <>
##$USERP3= <>
##$USERP4= <>
##$USERP5= <>
##$WDW= 1
##$XDIM= 16384
##$YMAX_p= 413547268
##$YMIN_p= -1057792
##$CURPLOT= <Cups-PDF>
##$CURPRIN= <$Cups-PDF>
##$DFORMAT= <normdp>
##$LAYOUT= <+/1D_X+nopp.xwp>
##$LFORMAT= <normlp>
##$PFORMAT= <normpl>
$$ End of Bruker specific parameters
$$ ---------------------------------
##NTUPLES= NMR SPECTRUM
##VAR_NAME=  FREQUENCY,     SPECTRUM/REAL,   SPECTRUM/IMAG
##SYMBOL=    X,             R,               I
##VAR_TYPE=  INDEPENDENT,   DEPENDENT,       DEPENDENT
##VAR_FORM=  AFFN,          ASDF,            ASDF
##VAR_DIM=   16384,         16384,           16384
##UNITS=     HZ,            ARBITRARY UNITS, ARBITRARY UNITS
##FACTOR=    0.3417421962486, 1,             1
##FIRST=     5598.76240114082, -64321,       -27784
##LAST=      0,             -11622,          -85979
##MIN=       0,             -1057792,        0
##MAX=       5598.76240114082, 413547268,    0
$$ Real data points
##PAGE= N=1
##DATA TABLE= (X++(R..R)), XYDATA
$$ [...]
12170D58021j64453O849J2054L014j34341J35646j15870r4948Q4454G4844J18314
12159A93158r1043A5921K10812j02567P8767D6023M5149c5339F4828j720L81O5356
12147A28845i1627I2702J1991B0175K0697K2184C1466N9651C9224g4184M757B4170
12134a6991j5558F6684P7546b904n302q5404c6641G6342c0610l8410A27854B4049
12121g1499L1226l4f082j2081B0079J9975f2754l5830G59J06267j0963F997d4465
12107C0108H941L0191a0876r5447A3133b8968R230q7113a6306N673k880j3980
12095b7493l3100K006F801J3019Q0134c2393l6198c0897C4400j3284e3794C98
12082a13750A8865d4752J8457B0692i2014k662a7849D5813M2015A0964h3126A4558
$$ plain form
12170 458021 293568 300417 312471 315485 181144 316790 200920 105972 190426 74844 193158
12159 193158 102115 15921 226733 124166 202933 46023 91172 -35339 64828 63108 63489 128845
12147 128845 -91627 92702 104693 20175 40872 63056 31466 91117 39224 -74184 -69427 24170
12134 -16991 -32549 66684 144230 -2904 -8206 -93610 -36641 76342 -30610 -69020 127854 24049
12121 -71499 -40273 -40307 -6082 -18163 20079 40054 -62754 -98584 759 107026 96063 6997 -44465
12107 30108 8941 39132 -10876 -106323 13133 -28968 -19738 -106851 -16306 -10633 -13513 -27493
12095 -27493 -60593 -58587 6801 19820 99954 -32393 -68591 -30897 34400 21116 -53794 398
12082 -113750 18865 -44752 -26295 20692 -92014 -94676 -17849 45813 87828 10964 -83126 14558
12069e3269B2180g7161D3193j9044h45j10880H9593i3955A1994d5201I168L309
12057A2477h326p8807B4542M0897d001A14541c4201e899q7863p058J9247J3478
12045f8095D3284h1213A12575f8117b2071i759m0218D205R6219d4419R646H4870
12032D2433m567d3207a9708j34577H4049a002n0085k7658c8776F9248b5962I4565
12019H5447K1690m6322k5324d2815P516a4508I0087Q5509a7843m5718B8445N0687
12007G9132k5320g555l3577I4181f267A12615m6370k3883a06015A1015i3515b5090
11994C9337N5836N8066A8800J38295C0588O9152C9035h6485A47252k3689k3871
11983I9692H934N2987K9223o093K43241I6064P1475j3182L9501Q0682j2532j9384
$$ plain form
12069 -53269 22180 -77161 43193 24149 -845 -111725 89593 -93955 11994 -45201 9168 12477
12057 12477 -8326 -87133 24542 65439 -4001 114541 -34201 -5899 -93762 -100820 -81573 -68095
12045 -68095 43284 -81213 112575 -68117 -22071 -9759 -49977 4205 100424 -44419 -34773 84870
12032 42433 37866 -43207 -19708 -154285 84049 -1002 -51087 -78745 -38776 69248 -25962 94565
12019 85447 107137 60815 35491 -42815 -35299 -14508 90087 175596 -17843 -63561 28445 79132
12007 79132 53812 -7555 -41132 94181 -6267 112615 66245 42362 -106015 11015 -93515 -25090
11994 39337 95173 153239 18800 157095 30588 99740 39035 -86485 147252 123563 99692
11983 99692 8934 61921 91144 85051 328292 96064 167539 154357 193858 274540 262008 242624
11971B42624K4958R5516M0931j08548J48512K5296q6460J93509J70915J96017
11961I43270L81892J88833k6558N6010q7173N1800J76693M96846O90404P30158
11951C602175R68172J040737J636507J986674L368395P546175J6737281K9861608
11943F6747724L5203792K3229192j0567751l7696644l5846644j8680571q291159
11936A4097939l758265k396647j499012j236255j272365n69410p28127m50127
11928B187731n03248J3575k48087K05000K09690j47231j91459n15332k16705o7046
11918G26888q2076j48182q4941j22219Q373n9981J11311n8752p8602j1327m5122
11907A55370L3625n0135P8545N4688q3885q7172k7722M3230m850L1871k8740J14702
$$ plain form
11971 242624 267582 363098 404029 295481 443993 469289 382829 576338 747253 943270
11961 943270 1325162 1513995 1487437 1543447 1456274 1508074 1684767 2181613 2872017 3602175
11951 3602175 4570347 5611084 7247591 9234265 12602660 20148835 36886116 66747724
11943 66747724 101951516 125180708 114612957 76916313 41069669 22389098 14097939
11936 14097939 10339674 7943027 6444015 5207760 3935395 3365985 2637858 2187731
11928 2187731 1684483 1698058 1449971 1654971 1864661 1717430 1525971 1010639 793934 726888
11918 726888 644812 496630 411689 289470 297843 237862 349173 290421 211819 200492 155370
11907 155370 188995 138860 217405 272093 188208 101036 73314 116544 111694 143565 114825 229527
11895B29527A7688b4179H5980O5459n7808k8086K1820i8885b6350H190c8689d130
11882C609J01974B7026A0385b8874a002B2327O9005f6970p665E0164A6588N71
11870A7159J760d1099O630O834I7147b5976L437m9410l5406A6529o165a8259D6719
11856g2006L4256h779k7938J129H1408P6736e1113A4851L110e1242C7147d2669
11843B6697N7238C8134M8800d1916p0860b9263E8305e4189b6377D271g9132K9477
11831d9655K349a3908k0152m9566l8245d2318G1842c538m9714n0560A4187a5915
11818C6573a0943d40o9993b0205q2947J7776g665B6476R177i4647b8195j91314
11806b19509a1729n3220R454B2149c8862D9377B600L2962a72106A064b1924D1692
$$ plain form
11895 229527 17688 -24179 85980 151439 93631 65545 87365 -98885 -26350 8190 -38689 -4130
11882 3609 105583 27026 10385 -28874 -1002 22327 91332 -66970 -74635 50164 16588 17159
11870 17159 18919 -41099 -34469 -27635 97147 -25976 -22539 -71949 -107355 16529 10364 -18259 46719
11856 -72006 -37750 -8779 -36717 -35588 81408 158144 -51113 14851 17961 -51242 37147 -42669
11843 26697 83935 38134 86934 -41916 -112776 -29263 58305 -54189 -26377 4271 -79132 -49655
11831 -49655 -47306 -13908 -34060 -83626 -121871 -42318 71842 -3538 -53252 -103812 14187 -15915
11818 36573 -10943 -440 -70433 -20205 -103152 -85376 -7665 26476 35653 -94647 -28195 -219509
11806 -219509 -11729 -64949 -55495 22149 -38862 49377 2600 35562 -172106 1064 -21924 41692
11793F6385a11508J2500B0124K5707a3825C6039q889c6554m3917A23461f7714
11781D564c5401I1171A3093h491l4836d017A9597e8448a5068o544k9559n0745
11769a01916B9544d0972J5597k2330K611j8384k4445o2116A55259C285g1742I4447
11756B8749b63A5599a30583L0410C8800A4291a07248n756N0018k2189K6883r3344
11744a51636N0627g970p643e30B3259f2262J2814C0955a61481c7697A169i1290
11731F8287i2428L2934b8977A7790b0333F0777f329G591O5332b4105k873E3470
11718d5528E1098a03066A1148b5001F4465h7645A8774J0252e4455D6704A8376
11706a12303a8587A8557b5844o4241m3805L111B4111N6091a01989D8263c4545
$$ plain form
11793 66385 -111508 -99008 20124 45831 -13825 36039 27150 -36554 -80471 123461 -67714
11781 4564 -35401 91171 13093 -8491 -43327 -4017 19597 -58448 -15068 -21612 -51171 -101916
11769 -101916 29544 -40972 -25375 -47705 -45094 -63478 -87923 -150039 155259 3285 -71742 94447
11756 28749 -263 15599 -130583 -100173 38800 14291 -107248 -113004 -62986 -85175 -58292 -151636
11744 -151636 -101009 -7970 -15613 -530 23259 -62262 -49448 30955 -161481 -37697 1169 -91290
11731 68287 -92428 -59494 -28977 17790 -20333 60777 -6329 7591 72923 -24105 -26978 53470
11718 -45528 51098 -103066 11148 -25001 64465 -87645 18774 29026 -54455 46704 18376
11706 -112303 -18587 18557 -25844 -90085 -133890 -130779 24111 80202 -101989 48263 -34545
11694a7870A5690b1686M757e881B9488a2579k9429G7142l7081K0824A7348J08875
11682A26223B5240i1799A1892Q474a06262B6597j0014h8435l7195e4263p256b1847
11669e9193A6140J04436b3909n8861B0989h7366a785B885d436C0419b081l8192
11657d0273G6864d3250D8093f8585E0878l494J03767c6402F0731A3413g1230a4565
11644c9945a6638k1635o2118A60121c3316j7328K0466B7318R824b3697k980D9329
11631c0074H4635C7865N335J51049J09531K08779J53783N6682k31377p1438r3117
11620C27092p8164q8204F8030n081R0948p0987e5179B662R940G77P9483J5930
11608I6190J4441O6056K9049D6141J69119G5000Q0639D9016K45025I7852J45820
$$ plain form
11694 -17870 15690 -21686 -16929 -5881 29488 -12579 -42008 77142 40061 60885 17348 126223
11682 126223 25240 -91799 11892 20366 -106262 26597 16583 -88435 -125630 -54263 -61519 -21847
11669 -59193 16140 120576 -23909 -82770 20989 -87366 -1785 2885 -4436 30419 -2081 -40273
11657 -40273 76864 -43250 48093 -68585 50878 47384 151151 -36402 60731 13413 -71230 -14565
11644 -39945 -16638 -38273 -100391 160121 -33316 -50644 -30178 27318 37142 -23697 -26677 49329
11631 -30074 84635 37865 43200 194249 303780 512559 666342 723024 491647 420209 327092
11620 327092 248928 160724 68030 62949 153897 82910 -55179 2662 12602 777 80260 96190
11608 96190 110631 176687 205736 46141 215260 75000 155639 49016 294041 97852 243672
11597B43672q7326n099L2585B820K5429c4293j7304C1559G54N493R6764B0410
11584A21482k9607N7456j7425l5957K5106C1667j2844K8132K2689A7827e2591
11572B2191I661d1076l8869J8560B6739A3286A36J2621d2279C4183a2112B2054
11559F1802d5686C3766a7310C3742a27417B2649J3675g6370j7701c7718j7038
11548e4756A18004c234r6832J3012b6800F5480d8957m873K4152n0921A59166i7372
11535g6510A267Q8578e0357l8272K5988m4920E883d3087B2049a746j9258o0126
11523h1130A2389a24822c4625A20230d763j1179p4094D9821i360I851K8903R5274
11511A34028o0843l3688f1749E3461Q869d1460P635k9376d142A16725l7052B3630
$$ plain form
11597 243672 156346 151247 183832 2820 28249 -34293 -51597 31559 754 6247 103011 20410
11584 121482 91875 149331 131906 95949 121055 31667 18823 46955 69644 17827 -52591
11572 22191 9661 -41076 -79945 -61385 26739 13286 136 12757 -42279 34183 -12112 22054
11559 61802 -45686 33766 -17310 33742 -127417 22649 36324 -76370 -94071 -37718 -54756
11548 -54756 118004 -3234 -100066 -87054 -26800 65480 -48957 -53830 -29678 -80599 159166 -97372
11535 -76510 1267 89845 -50357 -88629 -62641 -107561 5883 -43087 22049 -1746 -21004 -81130
11523 -81130 12389 -124822 -34625 120230 -4763 -15942 -90036 49821 -9360 9851 38754 134028
11511 134028 73185 39497 -61749 53461 62330 -41460 -33825 -63201 -4142 116725 79673 23630
11498d6592E0173J6022f9455B391J06416C3707g1422k2066D3318b6675F0565E434
11485a30821M6121C4759e6392I9870I395i716r0353D0420O455e0177J8301E0931
11472a31350B2543a2436j34431I015J859f6405c1636p6176B7908J13387f5548
11460g8770C1270a5301q8432c6174H4210j668f8292A16084j6996e5786D8318M4968
11448I3286a01225b3293A318b5029m235D7031a8629o3008Q568c1775l0259F1183
11435A9258N1429b9129j5660C6490J07097E3232h1008B0725P2638l9030B6976
11423h8016B8644n492N3492c4145j7302j9645H853P221a9994A2044R4329L470
11411A09843d3013J8807B3700q202c2060P409C9849K0302i39H062M9720O6877
$$ plain form
11498 -46592 50173 66195 -69455 2391 108807 33707 -71422 -93488 43318 -26675 60565 5434
11485 -130821 -84700 34759 -56392 99870 9395 -9716 -100069 40420 46875 -50177 -31876 50931
11472 -131350 22543 -12436 -146867 9015 10874 -66405 -31636 -107812 27908 141295 -65548
11460 -78770 31270 -15301 -103733 -36174 84210 82542 -68292 116084 99088 -55786 48318 93286
11448 93286 -101225 -23293 1318 -25029 -29264 47031 -18629 -81637 -73069 -31775 -62034 61183
11435 19258 70687 -29129 -44789 36490 143587 53232 -81008 20725 93363 54333 26976
11423 -88016 28644 23152 76644 -34145 -51447 -71092 8853 16074 -19994 12044 106373 109843
11411 109843 -43013 -24206 23700 15498 -32060 -24651 39849 60151 -939 8062 57782 124659
11399A24659a0872A13621M1651l3634J35730j3557J80283n1999K33492J18251
11389G23838J28458L27306K21505M95104N53426J023109L418037M929117P239977
11380A9059877L945250Q14341j492513l715253p304120m990724k097300o28014
11372C591544j40913J3687N98534J690585L926439N418453O755474L181187j376878
11363B3658112k444060l645152o853439r82413K925042N599700M538410J777072
11355B4573272j857465l630080o002855n917561k578349r33413k53701K5296K18528
11346C643672J070665L045704M645477O815786L035018m55583j870616l424608
11338A6505515p622754m179851j755467p65663m41457l06123k35551l34808j15240
$$ plain form
11399 124659 -10872 113621 155272 121638 257368 243811 424094 372095 605587 723838
11389 723838 852296 1179602 1401107 1896211 2449637 3472746 6890783 11819900 19059877
11380 19059877 23005127 23819468 22326955 18611702 11307582 6316858 4219558 3591544
11372 3591544 3450631 3464318 4062852 5753437 9679876 15098329 21853803 25034990 23658112
11363 23658112 21214052 17568900 10715461 9733048 12658090 18257790 22796200 24573272
11355 24573272 22715807 19085727 13082872 7165311 4586962 3653549 3399848 3425144 3643672
11346 3643672 4714337 7760041 12405518 19221304 22256322 21800739 19930123 16505515
11338 16505515 8882761 4702910 2947443 2181780 1740323 1434200 1198649 863841 748601
11329G48601j29234p7766p7796k8645j30560n9931J06822j58632N9875q0675q066
11318A63993j895M5862f009B21028j08403m1054A7347J87266l2671q1291M2074
11307A32725F3271g461A08367k1253A5246h903B4108j0177g4810P884j08929I533
11294A60793c5802D7210g0623I2112a42889F0963a8145q4655c0236g624l4290
11283d1914A3744a01043o116G7845f4639L900c0103G7592a27683J7927a0539p7580
11271h8119K2563j6617K3046B2241h3127D5048a40412e8618o2989b7863F3559
11259E3426g8343c1789c86q8732D491b9436p596n884a2287A4016J07416i867m1784
11246e1651l561q564G7578B0778a1197D6730G261i615k946A04476f0051n668D386
$$ plain form
11329 748601 619367 541601 463805 435160 304600 244669 351491 192859 252734 172059 163993
11318 163993 162098 207960 -6009 221028 112625 71571 17347 204613 171942 90651 132725
11307 132725 63271 -7461 108367 87114 15246 -8903 24108 13931 -74810 -66926 -175855 9533
11294 160793 -35802 47210 -70623 92112 -142889 60963 -18145 -102800 -30236 -7624 -41914
11283 -41914 13744 -101043 -107159 77845 -64639 -60739 -30103 77592 -127683 -109756 -10539 -88119
11271 -88119 -65556 -82173 -59127 22241 -83127 45048 -140412 -58618 -121607 -27863 63559
11259 53426 -78343 -31789 -386 -89118 4491 -29436 -37032 -42916 -12287 14016 121432 -9867 -51651
11246 -51651 -55212 -63776 77578 20778 -11197 46730 7261 -9615 -12561 104476 -60051 -65719 4386
11232F6P5212h4972E9990J9747g9644j03154H4562f2192k9867a1690o9148c8747
11219e1010C3839e5719F8986A4997a1377n4851b4500k6764a8469A03254C3448
11207b573l8783A1622b1891L813B300b395r345J615A1953b8706m2755c251j02310
11194a05561H759h696P97o4567k8958D3162c7669I621g2469E42K4000A0364a0315
11180a34321J6856a9267j00900a7249o3595A51h2921B4467L6384P323k2880i971
11167b3984j056F9203e1361K5566o5620q0890P1173a4848k4885C5158k755f1614
11154a5801r2949c0207K543E7421a38524B7887D444a75699g6281D6123j6219M6179
11142G6083A9388J2003a4251A4591f8711D1871c3031G3457B7606P8340j8618O8298
$$ plain form
11232 66 75278 -84972 59990 79737 -79644 -182798 84562 -62192 -92059 -11690 -80838 -38747
11219 -51010 33839 -55719 68986 14997 -11377 -66228 -24500 -51264 -18469 103254 33448
11207 -2573 -41356 11622 -21891 -18078 2300 -2395 -11740 -10125 11953 -28706 -71461 -3251 -105561
11194 -105561 8759 -8696 -7899 -72466 -101424 43162 -37669 9621 -72469 542 24542 10364 -10315
11180 -134321 -117465 -19267 -120167 -17249 -80844 151 -82921 24467 60851 68174 45294 -9971
11167 -23984 -25040 69203 -51361 -25795 -91415 -172305 -101132 -14848 -39733 35158 32403 -61614
11154 -15801 -108750 -30207 -27664 57421 -138524 27887 4444 -175699 -76281 46123 29904 76083
11142 76083 19388 31391 -14251 14591 -68711 41871 -33031 73457 27606 105946 87328 155626
11130A55626E2815j446F165L1349c0521j246H110b243H4505K284N0971l1694K3372
11117A29438c8920B20757H358a9190A05583N1910p6818O4563N6361K5643H7386
11105A10177d4530J8334A1354K5902a5202G1853Q499A1280R98J02427j2814l5157
11093F6734J75553q9767C9082b8965e274k810C3551L3630j2294A8739J9578K3680
11081F1997a74382b5451m6398K1973l1346A4457f3786H1438a00253b3116E9964
11069g381l5590m6991o4626c9997D3837N9900A6448g8594E2372e9854Q077j5598
11057f7375A47257c8577F2103h8321C9855D140O3028A085d4459J5517G8984n241
11045G3743L3685B9775i3664j8589e4513j1649j2795F671M3542i3876M2475D0490
$$ plain form
11130 155626 52815 51369 6165 37514 -30521 -31767 8110 -2243 84505 86789 137760 106066 129438
11117 129438 -38920 220757 8358 -19190 105583 157493 80675 145238 201599 227242 87386
11105 110177 -44530 -26196 11354 37256 -15202 71853 80352 11280 12278 114705 101891 66734
11093 66734 242287 152520 39082 -28965 -5274 -8084 33551 67181 54887 18739 38317 61997
11081 61997 -174382 -25451 -71849 -49876 -81222 14457 -63786 81438 -100253 -23116 59964
11069 -7381 -42971 -89962 -154588 -39997 43837 103737 16448 -78594 52372 -59854 -51777 -67375
11057 -67375 147257 -38577 62103 -88321 39855 4140 67168 1085 -44459 -28942 78984 73743
11045 73743 107428 29775 -93664 -112253 -54513 -66162 -78957 6671 50213 -93876 -51401 40490
11032A9720a2204k6326n8800G7661a94920a6496j1153j5343G8699a72619b3248
11020F8125C2098P121h3651L8400o147A8877a14649L8285r8913g7730k507L3676
11008d6561J4834A5062j623N4531B4323b9750k5769A5522e2851o46k8649C7412
10995e1875F5515c5560D9564N146d4151C61c4323h771k8939e411k6282E8608d8250
10981e2990n2966p2984a9195n2375B0533a2685p091B0817a885r8801H6141b9228
10968E4596N7012b359A09866a8886E8094b5490m331k2427j8335b3058C7234j5048
10956B2186a6921j5410B2359f0820F5242c6347J7094B0839M0168h3869j8915Q127
10944i4657m0760F3005a06642B4595a68744P6814E8438d7606A3750Q5251A6207
$$ plain form
11032 19720 -12204 -38530 -97330 77661 -194920 -16496 -27649 -42992 78699 -172619 -23248
11020 68125 32098 39219 -83651 -45251 -51398 18877 -114649 -76364 -175277 -77730 -80237 -46561
11008 -46561 -31727 15062 13439 67970 24323 -29750 -55519 15522 -52851 -53497 -82146 37412
10995 -51875 65515 -35560 49564 54710 -44151 361 -34323 -8771 -37710 -5411 -31693 58608 -48250
10981 -52990 -105956 -178940 -19195 -71570 20533 -12685 -19776 20817 -1885 -100686 86141 -29228
10968 54596 111608 -2359 109866 -18886 58094 -25490 -29821 -52248 -70583 -23058 37234 22186
10956 22186 -16921 -32331 22359 -60820 65242 -36347 -19253 20839 61007 -83869 -102784 -94657
10944 -94657 -135417 63005 -106642 24595 -168744 -91930 58438 -47606 13750 99001 16207
10932h3611E4449a17168E394c1438h97C895a2435j5067m7800c2025f98A42160
10919D2308a04912J0633g958j7067C0344f1628m9036c6995A3430J2898h3029G0356
10906b0351p458C3570a12216A07983E3273e8504o896J1159b5221j10100O4625
10895g0696E3679R695e6575E0792i3040B3133d4489G6752a38341B8140f5429F8377
10882h3249g230A796J4018c3252l567r4218K7091p7091G9567c6212E1762c6665
10869d5009B9103f6692G2114e7854B5475a08601A02975k4804c9876R326b192G0991
10856i032F7059b1163j723J0931A25643h8051d1164o2168k5580b0209o6261c7205
10843f3112q5959a4502A4720G041K1651B129a30762E2986g9534J5163m5766m8152
$$ plain form
10932 -83611 54449 -117168 5394 -31438 -897 3895 -12435 -27502 -75302 -32025 -698 142160
10919 42308 -104912 -94279 -7958 -25025 30344 -61628 -110664 -36995 13430 26328 -83029 70356
10906 -20351 -27809 33570 -112216 107983 53273 -58504 -65400 -54241 -25221 -135321 -70696
10895 -70696 53679 63374 -56575 50792 -93040 23133 -44489 76752 -138341 28140 -65429 68377
10882 -83249 -7230 1796 15814 -33252 -36819 -131037 -103946 -181037 79567 -36212 51762 -36665
10869 -45009 29103 -66692 72114 -57854 25475 -108601 102975 78171 -39876 -30550 -2192 70991
10856 -9032 67059 -21163 -22886 -11955 125643 -88051 -41164 -103332 -128912 -20209 -86470 -37205
10843 -63112 -149071 -14502 14720 7041 28692 2129 -130762 52986 -79534 -64371 -110137 -158289
10831a58289C4803O8663g9462B6332e1072B6902e7998a7532B3573H988a6997j2187
10819b9184h517A6811g8241C321d0297A09762i4892B4697k047b06E7945A8857
10806A18755A8808g4568J6425i593D2038B647P5698l5155G174N1112h0102i04
10793a71682F6490c6480B2346b6366C158i9031J3842b5589i092B7664a278B2527
10780b3432K4A6527o771d373I4158i2482L7866p832C3933K4079A7552P961i7714
10766e8994b9310B5357P570L9930g0371I8236a13665j5459c365o0232k5468b9606
10753A45843d5737a3194A00589D9341o597M8975g2754n8489J9125B3823h9088
10741a2606n1483G949f3180L0909A5535f4247A1966c9207C5764h7874b5988r487
$$ plain form
10831 -158289 34803 103466 -79462 26332 -51072 26902 -57998 -17532 23573 8988 -16997 -29184
10819 -29184 -8517 16811 -78241 3321 -40297 109762 -94892 24697 22650 -206 57945 18857
10806 118755 18808 -74568 -58143 -9593 42038 2647 78345 43190 7174 58286 -80102 -904
10793 -171682 66490 -36480 22346 -26366 3158 -99031 -85189 -25589 -9092 27664 -1278 22527
10780 -23432 -23408 16527 9756 -4373 94158 -92482 -54616 -62448 33933 58012 17552 25513 -97714
10766 -58994 -29310 25357 32927 72857 -70371 98236 -113665 -129124 -3365 -63597 -89065 -29606
10753 145843 -45737 -13194 100589 49341 42744 91719 -72754 -131243 -112118 23823 -89088
10741 -12606 -64089 7949 -63180 -32271 15535 -64247 11966 -39207 35764 -87874 -25988 -35475
10729c5475B6493d1580A0421a59449g1824A07241A9400g6229M943C7220A984b4638
10716a36438A9189K8177j2851b7830p3965C6004j5635e6920G960a33567L3652
10705i9915a0154D6064E89d0394J4673p6649A05909g1618a9347j9595a6208m5954
10693f2162B0693P7061a25240f263q3262d1949A36145h6642C476g8295j8911c0697
10680A50818d8987a6625p2180A0230J3275i1847B4051d1347E0450r763K0398b6618
10667b3425F776a42126A1518f242o7288L3091C3998b13057d2427J9488m817E4173
10654C9019e3866E0345m124A2732i6195H30K6269d2522m2062B06677C4466c3284
10641c9433j5466K5020C8240h1178A1027b4295g381j55621f4682n3529d4022J9174
$$ plain form
10729 -35475 26493 -41580 10421 -159449 -71824 107241 19400 -76229 -71286 37220 1984 -24638
10716 -136438 19189 47366 34515 -27830 -101795 36004 20369 -56920 7960 -133567 -99915
10705 -99915 -10154 46064 589 -40394 -25721 -102370 105909 -71618 -19347 -38942 -16208 -62162
10693 -62162 20693 97754 -125240 -6263 -89525 -41949 136145 -86642 3476 -78295 -97206 -30697
10680 150818 -48987 -16625 -88805 10230 23505 -91847 24051 -41347 50450 40687 61085 -26618
10667 -23425 6776 -142126 11518 -6242 -73530 -40439 33998 -213057 -42427 -22939 -27756 54173
10654 39019 -53866 50345 46221 12732 -96195 830 27099 -42522 -84584 206677 34466 -33284
10641 -39433 -54899 -29879 38240 -81178 11027 -24295 -7381 -163002 -64682 -118211 -44022 -24848
10629b4848o5607C7871d008D8024b5743a1632B9861a5516j05962H8244a11970
10617d8601k9398e89D2726h9274M2945G0863a45045f6191E1331a6544C0494j2307
10605A8187k783h5202a0534l007A40312b3687l8778l7678a2578G4695p180e9549
10592a3492j9918Q651A612g1673B0184c4283C7305b7869F2922C0019f142l1299
10580c7441q1766i710m8342A7183f4990f682j0663l4948a0020B3011g385l6137
10568d3522E5974P0510f8379L1314J4840m4116J1251m6028d7098H122b8833B3491
10555E0435a3359H1973f7177A13680c6142o6747H3634a16669L5391A38354m7453
10544I0901b9443j32892G9336i5017C349J6321r402K1520a40359A6478N3286I025
$$ plain form
10629 -24848 -90455 37871 -4008 48024 -25743 -11632 29861 -15516 -121478 88244 -111970
10617 -48601 -77999 -589 42726 -89274 -46329 70863 -145045 -66191 51331 -16544 30494 18187
10605 18187 15404 -85202 -10534 -13541 140312 -23687 -62465 -100143 -12578 74695 67515 -59549
10592 -13492 -33410 -24759 1612 -71673 20184 -34283 37305 -27869 62922 30019 -6142 -37441
10580 -37441 -119207 -9710 -58052 17183 -64990 -6682 -17345 -52293 -10020 23011 -7385 -43522
10568 -43522 55974 126484 -68379 -37065 -22225 -66341 -55090 -101118 -47098 8122 -28833 23491
10555 50435 -13359 81973 -67177 113680 -36142 -102889 83634 -116669 -81278 138354 90901
10544 90901 -29443 -162335 79336 -95017 3349 19670 10268 31788 -140359 16478 69764 9025
10531b2598O431j01064D2215j8195a38384I1884m5452c8051l3120A7176a43793
10519a16355A21809i5683B8474a4762k8080O746E6190j8853a17505c2011o4696
10508i6707o5711E4156A4253a554j14978e122C3819J0286d0586D8836b2875J0633
10496a2242C8027h7395k1374a0105E1161h2088A17313C3252j0332J0281j2657
10485B0544f4162q0882a3446o6151l2759c9586q438n3655G5268h6616b5943j0942
10473c6885m9825J3309e215A45505i2586C4590c4125d53j3079I920K0945J9964
10461E0829d3357A8832d8244j441J8039j32720a4873q257l9352C7418J702E100
10448b320k887m4320G0357e4980n5729b4808k525r5731D833N1476f8700A5390
$$ plain form
10531 -22598 -16167 -117231 42215 24020 -138384 91884 46432 -38051 -71171 17176 -143793
10519 -116355 121809 -95683 28474 -14762 -42842 -36096 56190 37337 -117505 -32011 -96707
10508 -96707 -162418 54156 14253 -1554 -116532 -5122 33819 44105 -40586 48836 -22875 -12242
10496 -12242 38027 -87395 -108769 -10105 51161 -82088 117313 33252 22920 33201 20544
10485 20544 -64162 -145044 -13446 -79597 -112356 -39586 -48024 -101679 75268 -86616 -25943 -36885
10473 -36885 -86710 -73401 -5215 145505 -92586 34590 -34125 -453 -13532 9920 30865 50829
10461 50829 -43357 18832 -48244 -49685 -31646 -164366 -14873 -23130 -62482 37418 39120 5100
10448 -2320 -5207 -49527 70357 -54980 -110709 -24808 -27333 -123064 4833 56309 -68700 15390
10435E5069d1732N306o8807h518B9453m353N8555j2518a3350o4930I084e1542
10422G2074a55849f4067G3437A4019a3878k7319l060n794G1909d6026o8041G8443
10409c9542i731B6507K8881j8439L2786d5490j07841g0863K3637P02G9637a04725
10396c7974b263j4313A2346e1350k6999P284K8509H3688b8036k2591I5622a00199
10383c3645C85c2759k7411j709h990r865B0534c1841D7309a37340K7713M7728
10371f1899K6667F931a1139B7740b0150p8118D1093f2485j04845I6568a56434
10359a21324d662F3177B1843g0217B7671f626m904j18341e0244A17544a45067
10347a8782D5617b8347A7150J393a14926a6981H522J20316i0006A8178B888L9607
$$ plain form
10435 55069 -41732 -36426 -105233 -8518 29453 25100 83655 71137 -13350 -78280 9084 -51542
10422 72074 -155849 -64067 73437 14019 -13878 -41197 -44257 -50051 71909 -46026 -114067 78443
10409 -39542 -9731 26507 55388 36949 69735 -45490 -153331 -70863 -47226 -46524 79637 -104725
10396 -37974 -2263 -16576 12346 -51350 -78349 -71065 -42556 83688 -28036 -50627 95622 -100199
10383 -33645 385 -32759 -60170 -61879 -8990 -18855 20534 -31841 47309 -137340 -109627 -61899
10371 -61899 -35232 6931 -11139 27740 -20150 -98268 41093 -62485 -167330 96568 -156434
10359 -121324 -4662 63177 21843 -70217 27671 -6626 -11530 -129871 -50244 117544 -145067
10347 -18782 45617 -28347 17150 18543 -114926 -16981 8522 128838 -90006 18178 2888 42495
10335D2495e746k5899j4182l852k2518G487a3741k2146B1083r25K073P57d6870
10321a32524a5723p457H9912K5109f7331k7948k9794j802g394q7261c2798N704
10309b7094j6756G5022a3780o4768b75I9737g5342c6851D068d9960P013R23O241
10296c5783n0052k2938c8354l8442j3745a7460m7792i986l2879c39p040p5364
10284h2743A6929c2093I5754h008j21635r1500F425N4878B9170K3753h6481l9854
10272a26335B0204d5832C5550m012e828r302M86m6831F0985d3177j3333C0956
10259f3153F2487l82j0655k3999N816a02505A01547i449A21851d3473K396q5389
10247a26466J6470E8465a1900E1671j710D987f0230l339k9085C8601O4750n563
$$ plain form
10335 42495 -5746 -31645 -45827 -49679 -72197 7487 -13741 -35887 21083 20158 22231 22988 -46870
10321 -132524 -15723 -23180 89912 115021 -67331 -95279 -125073 -126875 -7394 -94655 -32798 -27094
10309 -27094 -43850 75022 -13780 -78548 -275 99737 -75342 -36851 4068 -49960 -42947 -42024 -35783
10296 -35783 -85835 -108773 -38354 -76796 -90541 -17460 -65252 -9986 -42865 -339 -7379 -82743
10284 -82743 16929 -32093 95754 -8008 -129643 -221143 6425 61303 29170 52923 -86481 -126335
10272 -126335 20204 -45832 35550 31538 -5828 -15130 -14644 -61475 60985 -43177 -56510 30956
10259 -63153 62487 62105 51450 27451 33267 -102505 101547 -9449 121851 -43473 -41077 -126466
10247 -126466 -109996 58465 -11900 51671 49961 4987 -60230 -63569 -92654 38601 103351 97788
10235I7788l4827e9521C230J4797g2247A3913M8816g8425I0629g2456b9547C9767
10222A5209a38154F9676c4302A0382c8008G045d9976K1072p1100B5907a23445
10210D5836f4967M546m6475k2353E2112f0013A0470J3252N0364i5856B3217f260
10197h8819C032N8583N1591E1437a22944k8249C9582a03833I5567e1121A3752
10185I721J9014e2867m0512J2311g029m7094K6697l9182B7975f8016b2432D1033
10172E7969e8061P366J6373B2089E799h9876c7910B3845c9357k0718o9287k400
10160a31762D682h448l0993A6099F125a35684q428E9381a35768A03962E0341J22987
10148A73328f4464J5281n2617A6058a9982C0729n0O36M7625d8017b1210n6811
$$ plain form
10235 97788 62961 -59521 3230 18027 -72247 13913 62729 -78425 90629 -72456 -29547 39767
10222 15209 -138154 69676 -34302 10382 -38008 7045 -49976 -28904 -100004 25907 -123445
10210 45836 -64967 -60421 -106896 -129249 52112 -60013 10470 23722 74086 -95856 23217 -6260
10197 -88819 3032 61615 113206 51437 -122944 -151193 39582 -103833 95567 -51121 13752
10185 9721 28735 -52867 -93379 -81068 -7029 -54123 -27426 -66608 27975 -68016 -22432 41033
10172 57969 -58061 -50695 -34322 22089 5799 -89876 -37910 23845 -39357 -60075 -129362 -131762
10160 -131762 4682 -8448 -39441 16099 6125 -135684 -144112 59381 -135768 103962 50341 173328
10148 173328 -64464 -49183 -101800 16058 -19982 30729 30679 31315 78940 -48017 -21210 -78021
10136g8021A8952J4842J36262A2515Q2011b2741A08241e6233O799a015l852D5596
10123c2598b192j51269A2892B34g9026n381c046j64308A10433h824j14460N5304
10111f7980J5731p419F1048h4539K3029j08803E5995c2664D7366a05863b45r7675
10099i7920d3412r0156N0427K9774c768E6727d0933j19399C4732j6586a578k3553
10087b5131j1733m0834F5497C476K6126a5440C0740J7306A9261f5082l5147M2594
10075e7635n548C9664a4378f925m897j0964d595A9607g0756E6164i4547g958p6492
10062h4450b416r7689A07726B3512Q1521E1256d5078A8451c8119C5991g8291L7928
10050d0363J8881p0888d0703p5698C1441a11074J760G0164A757e8097n565B1484
$$ plain form
10136 -78021 18952 33794 170056 12515 94526 -22741 108241 -56233 -49434 -1015 -4867 45596
10123 -32598 -2192 -153461 12892 234 -79026 -84407 -3046 -167354 110433 -8824 -123284 -67980
10111 -67980 -52249 -59668 61048 -84539 -61510 -170313 55995 -32664 47366 -105863 -245 -97920
10099 -97920 -43412 -133568 -83141 -53367 -3768 56727 -40933 -160332 34732 18146 -1578 -25131
10087 -25131 -36864 -77698 65497 3476 29602 -15440 30740 48046 19261 -65082 -100229 -57635
10075 -57635 -63183 39664 -14378 -6925 -11822 -22786 -4595 19607 -70756 56164 -94547 -7958 -84450
10062 -84450 -2416 -100105 107726 23512 105033 51256 -45078 18451 -38119 35991 -78291 -40363
10050 -40363 -21482 -92370 -40703 -116401 31441 -111074 -109314 70164 1757 -58097 -63662 21484
10037d5239B185a48321e3492d231k3641k0884B2612G8e6132l7535D9971b1027
10024i2772G2391k4312P8392h7329C0909a89893c2141p0060B5227O3821g2118
10012b3847C9276J5876c8133I0209C2321a9557m7686b4829H2108a4484B3358a9921
9999a8310P241m2242D2501c3337n7325c7478A9192L8772d0410c444E2732b5765
9986B5024e3368a4714c731o6152D1216h2308F5354h893p9765a1102G6762i1456
9973i2575J4574D5016j6255N7645C6099h9593F1613B5208g0518j5337m0100l541
9961a29496G0584c6104r252J6366m1542a9719f90A08017B137e2977q1697b6000
9948B5997a58203A8455b5543J1766k370p8859A5266h0691a5173B1710h64A6841
$$ plain form
10037 -45239 2185 -148321 -53492 -4231 -27872 -48756 22612 78 -56132 -93667 49971 -21027
10024 -92772 72391 48079 126471 -87329 30909 -189893 -32141 -102201 25227 89048 -72118
10012 -23847 39276 55152 -38133 90209 32321 -19557 -67243 -24829 82108 -14484 23358 -19921
9999 -18310 -11069 -53311 42501 -33337 -90662 -37478 19192 57964 -40410 -3444 52732 -25765
9986 25024 -53368 -14714 -3731 -69883 41216 -82308 65354 -8893 -88658 -11102 76762 -91456
9973 -92575 -78001 45016 28761 86406 36099 -89593 61613 25208 -70518 -85855 -125955 -129496
9961 -129496 70584 -36104 -45356 -28990 -70532 -19719 -690 108017 2137 -52977 -134674 -26000
9948 25997 -158203 18455 -25543 -13777 -16147 -95006 15266 -80691 -15173 21710 -864 16841
9935a9035j6331m9014C1422e9884B3149h7439b0507j06541E4183e7502A3007a11879
9922I325K9843b5203n1887D4M2534c5844p233a733B1711M436f9418l3633J0190
9909i2861E1402J3332J1653c9723D124M8313A2764a3627j16593B9795a12499b5041
9896b1179q9621J9840J8060K5091k1513K8889k3225c1524q0963d1686A31382f4061
9883e3032C4050N4778b1304p2782J1008a3176j04940c1862j7349M001r0800A834
9870a0738E5704i1399B7384K7870j3678I687e759k1235c984C8397i5591c5156
9857A67217a10311I3565b2808o1116o5936C576i7660J3610A38a33853G3700A2287
9844a2021C3114i1720E2534K9328l8915d0680j460k4477A09924a9149k2908B4972
$$ plain form
9935 -19035 -35366 -84380 31422 -59884 23149 -87439 -20507 -127048 54183 -57502 13007 -111879
9922 9325 39168 -25203 -77090 44 42578 -35844 -43077 -1733 21711 26147 -69418 -103051 -92861
9909 -92861 51402 64734 76387 -39723 4124 52437 12764 -13627 -130220 29795 -112499 -25041
9896 -21179 -110800 -90960 -72900 -47809 -69322 -40433 -63658 -31524 -112487 -41686 131382 -64061
9883 -53032 34050 88828 -21304 -94086 -83078 -13176 -118116 -31862 -49211 -45210 -136010 1834
9870 -10738 55704 -91399 27384 55254 41576 9687 -5759 -26994 -3984 38397 -95591 -35156
9857 167217 -110311 93565 -22808 -83924 -149860 3576 -97660 -84050 138 -133853 73700 12287
9844 -12021 33114 -91720 52534 81862 42947 -40680 -42140 -66617 109924 -19149 -42057 24972
9831A15081i4309c89A107g0426n8241p553c2250M003G4387l6244a3424H4245e4146
9817F4100A8936n052h3520H230O3738e8188b5356H7696c8684L039l4465n258p7777
9804a53145e4592k560A7291E388K9782L1442a23722L442C7813J7228l239B4474
9791d3611B0833d148C0263e3258m2174C5435d8943J8680k22A0327f8858A08059
9778a20185A10168a47367f7937l0678A9643i6579F131J37524g8409L7721c555
9766b3761m0306J4537A20232i5636m0816a7617B1432b918C2763b1329n3395i300
9753b3494A4685D596A384N6166h2070k1435c1658j1068l8381m4026E6026a91383
9740a58208b1114B2978f9424b7965A24046a857j4529r5970B2971b1062p7106P319
$$ plain form
9831 115081 -94309 -389 1107 -70426 -128667 -136220 -32250 -28247 74387 38143 -13424 84245 -54146
9817 64100 18936 13884 -83520 8230 71968 -58188 -25356 87696 -38684 -35645 -70110 -75368 -153145
9804 -153145 -54592 -57152 17291 5388 35170 66612 -123722 -120280 37813 55041 51802 24474
9791 -43611 20833 -4148 30263 -53258 -95432 35435 -48943 -30263 -30485 10327 -68858 108059
9778 -120185 110168 -147367 -67937 -98615 19643 -96579 6131 143655 -78409 -40688 -3555
9766 -23761 -64067 -49530 120232 -95636 -136452 -17617 21432 -2918 32763 -21329 -74724 -9300
9753 -23494 14685 4596 1384 57550 -82070 -103505 -31658 -42726 -81107 -125133 56026 -191383
9740 -158208 -21114 22978 -69424 -27965 124046 -1857 -16386 -112356 22971 -21062 -98168 -90849
9728i0849I967K8087j0736a11375K2142J023F2012e9556b1780F1083a16493G9635
9715A23135c7284j17250L5795a2864K712K225B9271b5956D4643N5289f6114l6863
9703a02977b985k2293j17396B8472a3584l2377r4465f7405A5340P0770i8158k802
9691a00960I0326A7998d291m5293j0925n804E947d431o4811B3084a07327A6167
9678C9376J6345f7656J2291I6810f3500A38025a8350j64950Q9840m6042A6777
9666F8727g2834K1104F344c9554e170C4869b4653m302B6765K8142d028A6890c4629
9652g0243A9458k111h7145N792a4218q9337I566g0268C9696e2036n0617B34O7056
9639F7290a0464C8884K6017N238b0779q2158b8048J2565E5968d5727E6976O1781
$$ plain form
9728 -90849 9967 38054 27318 -111375 -89233 -88210 62012 -59556 -21780 61083 -116493 79635
9715 123135 -37284 -154534 -118739 -12864 -10152 -7927 29271 -25956 44643 99932 -66114 -102977
9703 -102977 -2985 -25278 -142674 28472 -13584 -45961 -140426 -67405 15340 86110 -98158 -100960
9691 -100960 90326 17998 -4291 -49584 -60509 -66313 5947 -4431 -69242 23084 -107327 16167
9678 39376 55721 -67656 -55365 96810 -63500 138025 -18350 -183300 -93460 -139502 16777
9666 68727 -72834 -51730 6344 -39554 -5170 34869 -24653 -28955 26765 54907 -4028 16890 -34629
9652 -70243 19458 17347 -87145 -81353 -14218 -103555 9566 -70268 39696 -52036 -102653 234 67290
9639 67290 -10464 38884 64901 70139 -20779 -102937 -28048 -15483 55968 -45727 56976 118757
9627A18757c9585h196m909j17585a8115C6641b0848m4625D2463g5524B849a92826
9614d1891k5971E33P5864C429M6816L5524e3402p3450F3483b4224o0257j0142
9602i4623c0561D6976f0885l10f084r712A933J6877D116c8650A83233e47A25268
9588a20243d6730l985J2692L03k1242l7860m4610D046a5005j7043J5311k7166
9576d3903l7891K2066H469g7938a9370A632a21477e6761A7344c6593j5948j07801
9564a60342g6343k4396A09116j1391d4074D6541d458C3213a70953a3597j675p2693
9552h7965H298J2047d0621C1285D332J5273L8265c772b02D836L7262j460a01533
9538a5137o5455G0318i7471J1984J7522A5169a01103L2856A8005d5488k4175b9552
$$ plain form
9627 118757 -39585 -8196 -13105 -130690 -18115 36641 -20848 -65473 42463 -75524 2849 -192826
9614 -41891 -67862 533 76397 3429 50245 85769 -53402 -126852 63483 -24224 -84481 -94623
9602 -94623 -30561 46976 -60885 -61195 -6084 -15796 1933 18810 4116 -38650 183233 -547 125268
9588 -120243 -46730 -50715 -38023 -37720 -58962 -96822 -141432 4046 -15005 -32048 -16737 -43903
9576 -43903 -81794 -59728 8469 -77938 -19370 1632 -121477 -56761 17344 -36593 -52541 -160342
9564 -160342 -76343 -100739 109116 97725 -44074 46541 -4458 33213 -170953 -13597 -15272 -87965
9552 -87965 8298 20345 -40621 31285 4332 19605 57870 -3772 -202 4836 42098 40638 -101533
9538 -15137 -80592 70318 -97471 -85487 -67965 15169 -101103 -68247 18005 -45488 -69663 -29552
9525E0838f347p7375r2267F4918g0094A00245A805a3348C7794a09017J1686j6421
9513a13752e0515o610F568K1658b8280N674g984A17971i685F0866a2273C5979
9500a811r3971n812L4334D7433G408i4731H3478c3069G749f0133M511H426f7870
9486b1970G8941e4702C8985b5763B2378N4722b4230e581G936J71817a4796r2990
9474a07786c5413a3586j07054D8735A5631a27375a8843D9251i3401A24777B5709
9462C427e4339j1404j7469K5941K4968a3559d454I1381f1380C5448K635h4086
9449b1512F2806i1603c2723K273k8012a8015j19304M3809f671C6916r964i9369
9436a6190C829i7613K8330C8620g2561F2595a3399C0344a2741A30349B063g0743
$$ plain form
9525 50838 -6347 -83722 -175989 64918 -70094 100245 1805 -13348 37794 -109017 -97331 -113752
9513 -113752 -50515 -57125 6568 28226 -28280 -22606 -7984 117971 -9685 60866 -12273 35979
9500 -1811 -95782 -101594 -67260 47433 7408 -94731 83478 -33069 7749 -60133 -55622 8426 -67870
9486 -21970 78941 -54702 38985 -25763 22378 77100 -24230 -5581 7936 179753 -14796 -107786
9474 -107786 -35413 -13586 -120640 48735 15631 -127375 -18843 49251 -93401 124777 25709
9462 3427 -54339 -65743 -83212 -57271 -32303 -13559 -4454 91381 -61380 35448 38083 -84086
9449 -21512 62806 -91603 -32723 -30450 -58462 -18015 -137319 -93510 -6671 36916 26952 -99369
9436 -16190 3829 -97613 -69283 38620 -72561 62595 -13399 30344 -12741 130349 2063 -70743
9423a18255b8348k3360K5530C8593a8235l0695g977j0804F688g9858E6340p36
9411E5604k7301e0420k2972R870j6260I2080l1283B2139J1496L1625b899b0o9490
9398f9510a0894F6075e3471R3A26846f9708A8539a29749A3982a7392B1305J5406
9386C6711O1977b0466k2680o727F1454A6889b3575k4452j1666d383C1846h3894
9373h1598D72K05711B681J01085f273n1901Q413I809a18409a9161n1264C9944
9360h5682L2753m0348B8848d3718B9814c0731q9238A7635a53857i931l396p8945
9348i2272A01737f5978c2504F9929b7017m3170A24280c449C7589h2463J6290G4165
9335e7570q536A0537B900Q6082h7928H6883d8990B5824M1718C0968b0685q4342
$$ plain form
9423 -118255 -28348 -51708 -26178 38593 -18235 -48930 -7977 -18781 6688 -79858 56340 55604
9411 55604 28303 -50420 -73392 -63522 -79782 92080 60797 22139 33635 65260 -2899 -20 -69510
9398 -69510 -10894 66075 -53471 -53378 126846 -69708 18539 -129749 13982 -17392 21305 36711
9386 36711 98688 -20466 -43146 -49873 61454 16889 -23575 -48027 -59693 -4383 31846 -83894
9373 -81598 472 206183 2681 103766 -6273 -58174 -49761 9809 -118409 -19161 -70425 39944
9360 -85682 -52929 -93277 28848 -43718 29814 -30731 -119969 17635 -153857 -9931 -13327 -92272
9348 -92272 101737 -65978 -32504 69929 -27017 -70187 124280 -3449 37589 -82463 -66173 74165
9335 -57570 -66106 10537 2900 88982 -87928 86883 -48990 25824 67542 30968 -20685 -105027
9323a05027B2793h6614J7510A03424b0992g853c443H4866h1964D823P943J4483
9311B7249e5549A355i3843m7604B1830F056R306a8649n2481J1391B9177i5989
9298f7359a5740D6576a14374M3962b8629j14768B2077c3849l2429G230b7439A42604
9285h2122n9856G2939j9758b9532j3628B9898d699q0294D9855r916b0006B6295
9272H994h7402A88118F2364d3959m231q298B7669a38947I0809d2102o8975n568
9260a16645B7029d4288a4735b53C0296g9710C7906j8463d2997C5717e5744C0536
9247A9883e4310D0382a7369k6942A06225l0794d9378A7955m218M5015g652n9401
9235f7053n968B7982c2833n6384k9253B2588c2015N898i276B0788C743J15929
$$ plain form
9323 -105027 22793 -86614 -69104 103424 -20992 -7853 -3443 84866 -81964 4823 12766 27249
9311 27249 -55549 1355 -93843 -141447 21830 6056 15362 -18649 -71130 -59739 29177 -95989
9298 -67359 -15740 46576 -114374 -70412 -28629 -143397 22077 -33849 -66278 7230 -27439 142604
9285 -82122 -141978 72939 53181 -29532 -43160 29898 -4699 -84993 49855 39939 -20006 26295
9272 8994 -87402 188118 62364 -43959 -48190 -56488 27669 -138947 90809 -42102 -111077 -116645
9260 -116645 27029 -44288 -14735 -253 30296 -79710 37906 19443 -42997 35717 -55744 30536
9247 19883 -54310 40382 -17369 -44311 106225 75431 -49378 17955 13737 58752 -7652 -67053
9235 -67053 -73021 27982 -32833 -89217 -118470 22588 -32015 -26117 -9276 20788 3743 119672
9223A19672d8642K3318b356o258I943c5176l1680C5423A1477b1527j4780j61J2126
9210b4342q6613c9713C1429M967c2839D2262q524F871d6957A7671a68662Q2288
9198h6374I545d181m98F8690h1577E8583g4161b8518B0835N1388g3545b271j3776
9185a6047r295a2487D5316c5910I6117b7879H2186e6733a2048l436A07256C6573
9172a3407C9646b2994j19955E0646O1748b4046b924r1271M1794i035n8815C1207
9159h3937d813j5309G3888h2198a4152j07528A12976d0515o8494M7668b3190C3139
9146B2991i2675B311o07d0186D1927J2992k6850f5254E7860k6358a8239G1528
9133i3627R695o2631A07055d401n1548l2151K7970N698B6058e1376c628j46105
$$ plain form
9223 119672 -48642 -25324 -2356 -8614 9943 -35176 -66856 35423 11477 -21527 -36307 -36468 -24342
9210 -24342 -110955 -39713 31429 36396 -32839 42262 33738 6871 -46957 17671 -168662 -86374
9198 -86374 9545 -4181 -4679 68690 -81577 58583 -74161 -28518 20835 72223 -73545 -2271 -16047
9185 -16047 -25342 -12487 45316 -35910 96117 -27879 82186 -56733 -12048 -15484 107256 36573
9172 -13407 39646 -22994 -142949 50646 112394 -24046 -2924 -94195 -52401 -9035 -67850 31207
9159 -83937 -4813 -20122 73888 -82198 -14152 -121680 112976 -40515 -109009 -61341 -23190 33139
9146 22991 -92675 2311 1704 -40186 41927 54919 28069 -65254 57860 31502 -18239 71528
9133 -93627 -83932 -146563 107055 -4401 -55949 -88100 -60130 -54432 26058 -51376 -3628 -149733
9121a49733A14365g5366c0347i662C2263a19617A0198d16C8190A7388L3011A1917
9108a1758j08309m6612c8899r70q6888C9432K1504A0630e5395i797r0843d1469
9095e0618F8918e2140i308m5319r8174N1393A5032a5394k9912a2156p9125D6396
9082e1866Q704k2588j1597H3188a17696D9241h1152j1330j5654j2811H4027a3274
9069e1795a3503G6515f0823C3401b8568n586a2959p8478c2690A20144J04217f8806
9056h2972B7049h491q8352C6594b4679j73321d499j8776m1803I2288j5589b6083
9043h6157L8767F9964f7607I1005b9152E2616L8919i7140A6933f632K749A617
9030g6337l8746M0360a4105l7375A7286Q6456a3730E435N311d3448G7157M0909
$$ plain form
9121 -149733 114365 -75366 -30347 -9662 32263 -119617 10198 -416 38190 17388 50399 11917
9108 -11758 -120067 -166679 -38899 -39869 -126757 39432 60936 10630 -55395 -9797 -100640 -41469
9095 -50618 68918 -52140 -9308 -54627 -152801 -101408 15032 -15394 -45306 -12156 -91281 46396
9082 -51866 -43162 -65750 -77347 83188 -117696 49241 -81152 -92482 -108136 -120947 84027 -13274
9069 -51795 -13503 76515 -60823 33401 -28568 -34154 -12959 -91437 -32690 120144 224361 -68806
9056 -82972 27049 -8491 -96843 36594 -24679 -198000 -4499 -23275 -65078 92288 76699 -26083
9043 -86157 -47390 69964 -67607 91005 -29152 52616 91535 -97140 16933 -6632 -3883 1617
9030 -76337 -115083 -74723 -14105 -51480 17286 103742 -13730 5435 10746 -43448 77157 118066
9018A18066B5899d7974H4842h570A1886e001j57576a0883k1083k2202A00158B9446
9005I833i6123K5820j0928d04k4689P077l5492H154c3866B4907A0922J7623e6549
8991F5799A5607a18686b0072n1857D5067g6850j0616A213i644q4896B6186g6068
8978E0793J08841h7851C771a27704l4916C8715a8546G159i1755a0044k7226q364
8966d5634a6739o0643a1218A03321d6968A7214m069a9889p8660E1286M6735l0247
8954F7774k9202a6532k6584A10829m2844C833a63662b7361m1341j06127F0685
8942H495g7006a9851n5514K9442b240C8352f3778D7848j0706J9819a31965A5983
8929a9829A0246L3092i2227d4293j2030j8331I8194c5346C6808a815D364e4506
$$ plain form
9018 118066 25899 -47974 84842 -8570 11886 -5001 -162577 -10883 -31966 -54168 100158 29446
9005 9833 -96123 -70303 -81231 -404 -25093 -18016 -53508 8154 -33866 24907 10922 28545 -56549
8991 65799 15607 -118686 -20072 -71929 45067 -76850 -87466 1213 -9644 -94540 26186 -76068
8978 50793 159634 -87851 3771 -127704 -162620 38715 -18546 7159 -91755 -10044 -37270 -45634
8966 -45634 -16739 -77382 -11218 103321 -46968 17214 13145 -19889 -98549 51286 98021 67774
8954 67774 38572 -16532 -43116 110829 67985 3833 -163662 -27361 -68702 -174829 60685
8942 8495 -77006 -19851 -75365 -45923 -2240 38352 -63778 47848 37142 56961 -131965 15983
8929 -19829 10246 43338 -92227 -44293 -56323 -74654 98194 -35346 36808 -1815 4364 -54506
8916c2283m026J7317f441B391N4600d0944C0626M8751A905f0347a1933j7593i252
8902B8133f1023k6664l1576e5940J7238B8291f7083m5367P955C7058c4286B4767
8889c9610j1404n7726B0265c486m827E6841f6310A9029O1746a6657A8150d7309
8876C3484A6367a18930f171j48701H4102c6421C1625c0975M733c218B3014J4101
8864C7115g972D1305A5033h93k0669B4711g844l3381o3367C364K3144e6082a167
8850A10808a6610M911n9373j5527h409F0187R264c8750J8181I4618h2734P95I5365
8836c8439k00614D0637j9759a18294C1341f6271B1141h19D4892K9310C0029A4332
8823E3306K2147c530j2405g791C9047A7891e662j08420h173l8348f273B8031o306
$$ plain form
8916 -32283 -36309 -18992 -6441 2391 56991 -40944 30626 79377 1905 -60347 -11933 -29526 -9252
8902 28133 -61023 -87687 -119263 -55940 -38702 28291 -67083 -112450 -104495 37058 -34286 24767
8889 -39610 -51014 -108740 20265 -3486 -8313 56841 -66310 19029 80775 -16657 18150 -47309
8876 33484 16367 -118930 -6171 -154872 84102 -36421 31625 -30975 -26242 -3218 23014 37115
8864 37115 -7972 41305 15033 -893 -21562 24711 -7844 -41225 -104592 3364 26508 -56082 -1167
8850 110808 -16610 -11699 -71072 -86599 -8409 60187 69451 -38750 -20569 94618 -82734 -81939 95365
8836 -38439 -239053 40637 20878 -118294 31341 -66271 21141 -819 44892 74202 30029 14332
8823 53306 75453 -3530 -15935 -7791 39047 17891 -5662 -114082 -8173 -46521 -6273 28031 21725
8810B1725b3984E5384d527q104o170j97564h837C0894b3330D8225e3033J4147
8798c8886D9363j234d0258G453e9375J8211F4425P0841i9591C106h484j0996A13130
8784A8699F143e6996h522L106m825A07924R767n2992j4606a20011e4914b3330
8771A5158c4868C8648i7699E0840e594A0160J88293k2791b4654J703j05720D3709
8758e7791O937j1458B0326N5504P2074i0459L5133a030k6975C4292Q8176h4160
8745g9560L6842l1443k5080A03753M7578D6175i899q9006n1158c3077l5122G0751
8732h9090I3074k6009a12602L0247c4234H5830c7189G1068c5798j6926D9383g9870
8719b3044i06j5410G1495j543D722Q7099m2904a7351A8268d9765l606C8441e7123
$$ plain form
8810 21725 -23984 55384 -4527 -12631 -18801 -216365 -8837 30894 -23330 48225 -53033 -38886
8798 -38886 49363 48129 -40258 7453 -59375 -41164 64425 135266 -99591 3106 -8484 -19480 113130
8784 18699 6143 -56996 -8522 -5416 -10241 107924 117691 64699 50093 -120011 -54914 -23330
8771 15158 -34868 38648 -97699 50840 -5594 10160 198453 175662 -24654 -22951 -128671 43709
8758 -57791 -50854 -62312 20326 75830 147904 -90459 -55326 -1030 -28005 34292 122468 -84160
8745 -79560 -42718 -74161 -99241 103753 151331 46175 -9899 -98905 -150063 -33077 -68199 70751
8732 -89090 93074 67065 -112602 -82355 -34234 85830 -37189 71068 -35798 -52724 49383 -79870
8719 -23044 -906 -16316 71495 69952 4722 91821 48917 -17351 18268 -49765 -53371 38441 -57123
8705A18393g9302q86r626K6023J3059I446f0561A8129N9957a7471A62007f2898
8692E0095a1416p0633I468d6195D1243a26702F2879k8664j041P5972P718g4446
8679A1868d9087B2204m194e3353D4765a4411j09745f020l0793m427f323B8905
8666a00206B0416f0841K1670l7195L5168C8137F215a13092g876B0728i0091b3508
8653a8769m2428G385m77a01193h64j43413A1393g9931q3960e8284A7107c571E5902
8639e973A28802a3550l0884l9191l4948N6794F5158a38904B2147a8038k97a980
8626e9315p7581b8716G68L9817I052f7320A1087a7682F4591e8467C2776K761d939
8612g6604E5100j7971a2922G4438j5639a27249M8829A0115L7231G568O803c548
$$ plain form
8705 118393 -79302 -80188 -89814 -63791 -50732 9446 -60561 18129 78086 -17471 162007 -62898
8692 50095 -11416 -82049 9468 -46195 41243 -126702 62879 34215 33174 109146 116864 -74446
8679 11868 -49087 22204 18010 -53353 44765 -14411 -124156 -6020 -36813 -41240 -6323 28905
8666 -100206 20416 -60841 -39171 -76366 -41198 38137 6215 -113092 -7876 20728 -90091 -23508
8653 -18769 -61197 7385 6908 -101193 -864 -144277 11393 -79931 -163891 -58284 17107 -3571 55902
8639 -5973 128802 -13550 -44434 -83625 -118573 -61779 65158 -138904 22147 -18038 -18335 -1980
8626 -59315 -136896 -28716 768 40585 9052 -67320 11087 -17682 64591 -58467 32776 35537 -4939
8612 -76604 55100 37129 -12922 74438 58799 -127249 -78420 10115 47346 7568 14371 -3548
8599a27766d9039F9941f468I6848C8634Q2739C4254a09580N3679J8564N374C1146
8586f4175A19444f8076b092j67778e5386E228d6450b0670k3787a7061j9492l8777
8574g5330c7601R718o6342G4072N647b1076B0561a6863j19593O2379o4368c8672
8561D499O3986B5831b307p9519H6241a24148e9496N138r4508D2947A2884J5379
8549B8263b9239F8564B2624J5963a08799G2194f2932G8839C0435j0443a3668F3894
8536E304b8094o3239j4871M8979C7344j474O821g5555m2566b4428C473g592l3821
8523d1413B5025m16b4620C1877i4504A01099b723F0424a17125H8224C8040a1420
8510c9326G132N9579j6843J1489c4585o2667b0399j5336J3409j73614g1792J940
$$ plain form
8599 -127766 -49039 69941 -6468 96848 38634 121373 34254 -109580 -55901 -37337 -31963 31146
8586 -64175 119444 -68076 -2092 -169870 -55386 5228 -46450 -20670 -44457 -17061 -36553 -75330
8574 -75330 -37601 -27883 -94225 74072 79719 -21076 20561 -16863 -136456 -74077 -138445 -38672
8561 4499 68485 25831 -2307 -81826 86241 -124148 -59496 -54358 -148866 42947 12884 28263
8549 28263 -29239 68564 22624 38587 -108799 72194 -62932 78839 30435 19992 -13668 63894
8536 5304 -28094 -91333 -106204 -57225 37344 35870 42691 -75555 -118121 -24428 3473 -7592 -41413
8523 -41413 25025 24609 -24620 31877 -94504 101099 -2723 60424 -117125 88224 38040 -11420
8510 -39326 7132 66711 49868 61357 -34585 -97252 -20399 -35735 -22326 -195940 -71792 -69852
8498f9852R728e2p0346k1129K8814j8167G9966A1119c679A0044c3750J5869o9370
8485h7251G8809a05733A12230E1509b7353H7520a49464F502h5774E642d6831A6727
8472g648j3851j3064G9462g3312c0051C1237d8771A175L3180K2937A3474L13e0093
8458i5627A01015C0031a14903M9924b8876G6882a5355D6150f3823o0932E979K5080
8446C1059a35916A3812K5143a01578C854L043e3832D2525N17f1450A9208f2430
8433e8698n0874B0170J65895i6738A06557b2767l5766G1956p030g2031a4067D0639
8420f9991A5799i33H873R9943d3306C0501a15641e5100C5138F697h1237b6749
8407A45418e4553L191D4346i6747A24587f6511m1944D0800i0649d1814i693M678
$$ plain form
8498 -69852 -60124 -52 -70398 -91527 -62713 -80880 79966 11119 -3679 10044 -33750 -17881 -87251
8485 -87251 78809 -105733 112230 51509 -27353 87520 -149464 6502 -85774 5642 -46831 16727
8472 -7648 -21499 -34563 79462 -73312 -30051 31237 -48771 1175 34355 57292 13474 13787 -50093
8458 -95627 101015 30031 -114903 -64979 -28876 76882 -15355 46150 -63823 -124755 5979 31059
8446 31059 -135916 13812 38955 -101578 3854 6897 -53832 42525 43042 -61450 19208 -62430
8433 -58698 -109572 20170 186065 -96738 106557 -22767 -58533 71956 64926 -72031 -14067 40639
8420 -69991 15799 -933 8873 108816 -43306 30501 -115641 -55100 35138 6697 -81237 -26749
8407 145418 -54553 -51362 44346 -96747 124587 -66511 -108455 40800 -90649 -41814 -9693 -5015
8395e015o7579E0009B4483L4947h1696b2338l6620o945n023J4691k1914c5770
8382a5314C5756J291J4732K4869j4004d380o0700k0819c4278a6769A9294d4942
8369a60736F905N077f8025j1782p0703a6779p2912B4227L8456h464B1017d8426
8356D2963a12174G3641b4946E5235J5773c9622a1295B4906d8618D9628i4025A4892
8343F591L3466f002l5503B8658J1709A0941M8329L77a00276J9413M960D9292B898
8329c3334n3696a5471G0813j0036a14537F3888c6192k4788O533A20253f4439A2335
8316B9449g5759n2885F3846g9740j5313A1998a22137a9197m5041a6076j7715m1605
8304g5396B0754a6869n3839A6138c8742A5492a989k08677g6636l6447B7171b5595
$$ plain form
8395 -5015 -72594 50009 24483 59430 -81696 -22338 -58958 -65903 -70926 -56235 -78149 -35770
8382 -15314 35756 37047 51779 76648 62644 -4380 -65080 -85899 -34278 -16769 19294 -44942
8369 -160736 6905 11982 -68025 -79807 -150510 -16779 -89691 24227 62683 -8464 21017 -48426
8356 42963 -112174 73641 -24946 55235 71008 -39622 -11295 24906 -48618 49628 -94025 14892
8343 6591 40057 -6002 -41505 28658 40367 10941 59270 59647 -100276 -80863 -75903 49292 2898
8329 -33334 -87030 -15471 70813 60777 -114537 63888 -36192 -60980 -54447 120253 -64439 12335
8316 29449 -75759 -128644 63846 -79740 -95053 11998 -122137 -19197 -64238 -16076 -33791 -75396
8304 -75396 20754 -16869 -70708 16138 -38742 15492 -1989 -210666 -76636 -113083 27171 -25595
8291C8109a09441A20531d8096Q559l5946R330j3678b4821j5058A1749b0353n9504
8279g9857E629e2206C9580L8556j4919a00341l5056h125l8143q4633N5012C6297
8266i010F7502a8062m1288a7107A07730c782D1011a24833D9079a3816j7926p9557
8254a11299k0235E9029e8429D6097g230n3453A0428d7538C1995J17228o8787N230
8242H5666f1337H4257a5590M793E6278A5148Q6983a113F5696M1125L4368a66234
8229G9230P2948b7829C9064j276K39303o5889H3160L7966L6646k9315l6094N9220
8217A51583b4598B1237O6047b2450A02146F149c3210I2321O0129B3446a0448B3225
8204E620M4215J10210g4660a4711o9743L8776q081l6524L9857a8959l40718j51853
$$ plain form
8291 38109 -109441 120531 -48096 -39537 -75483 -66153 -79831 -24821 -39879 11749 -20353 -79857
8279 -79857 5629 -52206 39580 78136 63217 -100341 -135397 -8125 -46268 -130901 -75889 36297
8266 -9010 67502 -18062 -59350 -17107 107730 -3782 41011 -124833 49079 -13816 -31742 -111299
8254 -111299 -131534 59029 -58429 46097 -7230 -60683 10428 -47538 31995 149223 80436 85666
8242 85666 -61337 84257 -15590 -10797 56278 15148 102131 -1113 65696 106821 141189 -166234
8229 79230 152178 -27829 39064 37788 277091 211202 83160 121126 157772 128457 92363 151583
8217 151583 -24598 21237 87284 -22450 102146 6149 -33210 92321 152450 23446 -10448 23225
8204 5620 49835 160045 -74660 -14711 -84454 -45678 -53759 -90283 -50426 -18959 -359677 -511530
8192e11530N6443o02705a38474A23235E7348k3397h0500b2949D2146e7493F5140
8180D164d9650A05790J09207G8783M1185E5644j2912N0462L2876R7576A03768
8168A53459n4772P7800o0335l6239l7261J29684o9616K1619K2608l0738n804L8507
8156A48912l372L7967r216l2764J8200K032R8774o2921p349C5496K74965n4260
8144B56201j08502C3192L1206P4006M5734r0734O2124O5571N9827k8066F5186
8132E9384J98135p780A06004J31030r4820L1257P1577o639F8875K63932H4419
8120B29537l3753k5323o1015M810K0918O835c2460A77893d1587B38536L4663q8575
8108A84624F1252k933R261O7099B7608R136L1889l302c2550D9215J45190m0537
$$ plain form
8192 -511530 -455087 -1057792 -138474 123235 57348 33951 -80500 -22949 42146 -57493 65140
8180 4164 -49650 105790 214997 78783 119968 55644 42732 93194 126070 223646 103768
8168 153459 98687 176487 116152 79913 42652 172336 102720 124339 146947 116209 110405 148912
8156 148912 145540 183507 174291 141527 159727 161759 260533 197612 190263 35496 310461 256201
8144 256201 147699 33192 64398 138404 184138 93404 155528 221099 280926 252860 65186
8132 59384 257519 249739 106004 237034 142214 173471 245048 238409 68875 332807 84419
8120 229537 195784 170461 109446 114256 135174 142009 -32460 177893 -41587 238536 273199 184624
8108 184624 61252 58319 67580 134679 27608 36744 68633 65331 -32550 49215 194405 153868
8096A53868H833J40621I112J3622O8297b003I0839N1104L0766K474H3499Q0204
8084A63703C446J06061K5051A1332K1115Q0763D9583K8865a7032A43440a2355
8072A53472N926E5323J29079A0918J1120J75627I6097B2907c2668F3783O8837
8061A32620n9854I931J38470K907d7134H5718l2625M2427P982Q9777K256I4141
8048C1461O9199l7323e304F804J4442G931i9951A08803i2187D8417P2255B5089
8035C706K7396K8904k6255i8665A3129J19785D9707c0864E1695r196a24561G2992
8022F8074k0079i2724A72529G1039J1903B4441h2850E961N6658k1158R996R7820
8010A49277B5958a11690F1778O56P5251C105b1958j7493H8555j2069i8442A41789
$$ plain form
8096 153868 8833 149454 9112 22734 91031 -2003 90839 141943 172709 175183 83499 163703
8084 163703 3446 109507 134558 11332 32447 113210 49583 78448 -17032 143440 -12355
8072 153472 159398 55323 184402 10918 22038 197665 96097 22907 -32668 63783 132620
8061 132620 72766 9931 148401 151308 -47134 85718 53093 95520 103502 193279 195535 94141
8048 31461 100660 63337 -5304 6804 21246 7931 -99951 108803 -92187 48417 120672 25089
8035 3706 31102 60006 33751 -98665 13129 132914 49707 -30864 51695 42499 -124561 72992
8022 68074 47995 -92724 172529 71039 82942 24441 -82850 5961 62619 41461 51457 149277
8010 149277 25958 -111690 61778 62434 137685 3105 -21958 -39451 88555 76486 -98442 141789
7997B8627k517K8150c6963I8278r775l5643J11560B0410P3747B1352J30873R7388
7985B49613j15413P331C7313J05905n5049N883A8500A14J48785n1823K5959L9100
7973A62135h4276A02039l792B5644N4505d3016A69566l7942B5483R1541K4077
7962A41101l8273L8096n6145j2022C1812Q3187J8099J39594o0897r53K4256r9837
7950A35261J39405A25508P5986J22766q8782K1461Q8381J48275o8731J01769j1548
7939E15085P3328L4096Q9326J78853k7943L59225J70454K16407O22159N21746
7929B752736Q07287J522114K334846L469463L743285K463446l47501k294991l350037
7920A1100648j839604k07880J689017L414969M330771L226379O4522l725801n175064
$$ plain form
7997 28627 26110 54260 -36963 98278 88503 52860 164420 20410 94157 21352 152225 249613
7985 249613 134200 141531 37313 143218 88169 94052 18500 114 148899 97076 123035 162135
7973 162135 -84276 102039 98247 25644 80149 -43016 169566 131624 25483 117024 141101
7962 141101 102828 140924 84779 72757 31812 114999 133098 272692 211795 210842 235098 135261
7950 135261 274666 125508 201494 324260 235478 256939 345320 493595 424864 526633 515085
7939 515085 588413 622509 711835 890688 862745 1221970 1392424 1608831 2230990 2752736
7929 2752736 3560023 5082137 7416983 10886446 14629731 17093177 16745676 14450685 11100648
7920 11100648 9261044 9053164 10742181 14157150 18487921 21714300 21778822 18053021 12877957
7911A2877957m532953k705468j353884r72500n77384n56772j79648j94140j71001
7902A634207o4979K7202J3754J63044M3609L01229K32003L82638L45701K69699
7892C348107L20713L81795Q35212J269305K161703L008049L991452M180249L289738
7883B2786323K251326K104220K982348L794457L240736J398268r46974k210035
7875C5400669k701568l669627m162515m016402l289539j687962r05680k36480
7867A4730896q09515j221036j280564n01256N12683J868222K742615L071126J654768
7858B0767939p40070k657160k497991j616021l25645Q37242J363120O94680k17473
7849A5608621j813439k499312k232561j342052o92623k02947J49125K92018j76415
$$ plain form
7911 12877957 8345004 5639536 4285652 3313152 2735768 2178996 1999348 1805208 1634207
7902 1634207 1569228 1596430 1610184 1773228 1816837 2118066 2350069 2732707 3078408 3348107
7892 3348107 3668820 4050615 4885827 6155132 8316835 11324884 15316336 19496585 22786323
7883 22786323 25037649 27141869 30124217 33918674 37159410 38557678 37610704 35400669
7875 35400669 32699101 29029474 24866959 20850557 17561018 15873056 14967376 14730896
7867 14730896 13921381 12700345 11419781 10918525 11431208 13299430 16042045 19113171 20767939
7858 20767939 20027869 17370709 14872718 13256697 12931052 13768294 15131414 15826094 15608621
7849 15608621 13795182 11295870 9063309 7721257 7028634 6825687 6974812 7266830 7090415
7840G090415R4555K00533Q32364Q91491K38179p41595j099877m91752L39669R05990
7830H259972J911743J797650Q31986n94841k056520j995005j580012q19919k2973
7821E732081M41627O12444Q6474p11149j406549j392622q52504m99686m37479
7812A572637l40633j50355k78365J9402k7507k40613p8805O018J0671j75923q922
7801C07605q1731p5488J99701j17809n7994Q8152m0622k5340r5045k4976M6679
7790A23132L7107J08503r4747h64A21865m6627C7245c8175F772P7389J1316l0679
7778F4798R9342c9682A51570n3827D3951J05361B7593L1490O2502A1169L3263
7767D4432L7930A1269Q9158A4385J78614c7816D9753e9157A48003D1266K3475
$$ plain form
7840 7090415 7184970 7385503 8217867 9109358 9347537 8605942 7506065 7014313 7353982 8259972
7830 8259972 10171715 11969365 12801351 12206510 10149990 8154985 6574973 5755054 5732081
7821 5732081 6173708 6786152 6872626 6161477 4754928 3362306 2509802 2010116 1572637
7812 1572637 1232004 1081649 803284 822686 795179 554566 475761 481779 492450 316527 307605
7801 307605 225874 150386 350087 232278 174284 262436 221814 196474 101429 76453 123132
7790 123132 160239 268742 173995 -864 121865 75238 37245 -38175 6772 84161 95477 64798
7778 64798 164140 -39682 151570 97743 43951 149312 27593 59083 121585 11169 44432
7767 44432 82362 11269 100427 14385 192999 -37816 49753 -59157 148003 41266 64741
7756F4741b5351D1601e4531A76425f0459H7303c0651B4969P2130a07683I7069
7744a30347b3952F1832F505O0173e905r4632A24091f6486F1204J47745H7630m1013
7732D6617a3853B7145J08156E5503M5944k7361c0087D4982J3416b0750G2474M8752
7720A21226M106m1261k3875O2441j8864j9719O0248E2170J09024r644K4268q1705
7708I4113k3841j7157J35978j7420L2999F3763J11594J00338j08196M6297l7262
7697A76534q2019r169Q5628P0387G9500J77700A27695L7324O5266L8354p2909
7686A95730J12454I7975K66698j18381J38251Q2037j27292J42252R7990j23785
7676D55745K06456j13824J59497M5449o8036J51011q5834J13307J1884R8229k6621
$$ plain form
7756 64741 -25351 41601 -54531 176425 -60459 87303 -30651 24969 97099 -107683 97069
7744 -130347 -23952 61832 6505 66678 -5905 -100537 124091 -66486 61204 208949 87630 46617
7732 46617 -13853 27145 135301 55503 101447 74086 -30087 44982 58398 -20750 72474 121226
7720 121226 125332 84071 60196 122637 103773 84054 144302 52170 161194 151550 175818 94113
7708 94113 70272 53115 189093 171673 204672 63763 175357 275695 167499 213796 176534
7697 176534 94515 85346 170974 241361 79500 257200 127695 165019 230285 268639 195730
7686 195730 308184 97975 364673 246292 384543 466580 339288 481540 579530 455745
7676 455745 662201 548377 707874 753323 685287 836298 750464 863771 875655 973884 947263
7665I47263q123K57859J39470K64707L23887L17754N46966R15063J045001J533243
7655F283090J997006K309792K507082K639988K579582K095704J029292j027387
7647B0414149k814161l560441k633637j745564j307108j120780r84192p01011
7639E547255m86453m68349k31991l67662l4796J66327K24417M42902Q50521J508298
7629G150469L246222N091614O484052N233400R76361m502717o771160n544249
7621A1363992l231299j871403r22051o49558m13520n5985R6668N92192P33878
7612E642914J695572L094669N174259O342781M594196k99226n153850o723265
7604A4368050m933002k768606j537448q60763n84987l44480j05016Q0353J83467
$$ plain form
7665 947263 939140 1196999 1336469 1601176 1925063 2242817 2789783 3704846 4749847 6283090
7655 6283090 8280096 10589888 13096970 15736958 18316540 20412244 21441536 20414149
7647 20414149 17599988 14039547 11405910 9660346 8353238 7232458 6248266 5547255
7639 5547255 5060802 4592453 4360462 3992800 3958004 4124331 4348748 4791650 5642171 7150469
7629 7150469 10396691 15488305 21972357 27205757 28182118 23679401 16908241 11363992
7621 11363992 8132693 6261290 5339239 4689681 4276161 4220176 4316844 4909036 5642914
7612 5642914 7338486 10433155 15607414 21950195 26544391 26245165 21091315 14368050
7604 14368050 9435048 6666442 5128994 4268231 3683244 3338764 3233748 3314101 3497568
7595C497568K18885J51803K77079L94482Q22770P81670R93302J377162J462345
7586I977066J567408Q44527o40056j011120r45431l84450m87202j071138j488517
7577F361087j760880j155730r72754o27853l05921l97249q1082j80064k47371
7568F32183o3501m2274J7002P4327j16240N9173L4658r8568q3716j98270J69810
7557C84584j35350J16965j67071K9795P741n1249M2275l9445l2401k1011Q4817
7546B19650G2783l1408O0656B0354J09750A9503f481A74039F2381C199O8097N113
7534G6409k649k3892h098F27O3541g6908I2920m1331J3228O3794D8732M5195b7980
7520I5645N6411n2563D2708E391M0699K200b0388A18365E263K0479J14695o1191
$$ plain form
7595 3497568 3716453 3868256 4145335 4539817 5362587 6144257 7137559 8514721 9977066
7586 9977066 11544474 12389001 11748945 10737825 9792394 9407944 8920742 7849604 6361087
7577 6361087 4600207 3444477 2471723 1843870 1537949 1140700 1059618 879554 632183
7568 632183 568682 526408 543410 617737 501497 560670 595328 496760 413044 214774 384584
7557 384584 249234 366199 199128 228923 236664 185415 227690 188245 155844 134833 219650
7546 219650 72783 41375 102031 20354 130104 19503 -6481 174039 62381 3199 71296 76409
7534 76409 73760 49868 -8098 627 64168 -76908 92920 51589 64817 128611 48732 93927 -27980
7520 95645 152056 99493 42708 5391 46090 48290 -20388 118365 5263 25742 140437 79246
7508G9246K4713M8756G6121f835H4838c3318A29774R46A7164g9651c541F3763
7495b6682J946O18P024A02747m5998G111L6039j4758O0598L1961m7598a4621Q84
7482a3737A411R3025L2864A909g1434H881c3130F5577c0045G7489b4443F1913
7469A59702b7326o4955A03853a8645I4536g7193A07773J1522k4429j0919l9255
7458D4692d1390F5426b9202E1234Q9787K8885f5306D4838E526J21263E7941e5687
7445A46391B0805J42954k2091F8888j5303M4486J25012p7304J6204D1657J15108
7434A56765R11N38C7385K7685J7952k4385A1043Q8798D0303J68596M5591l247
7422B51243j4322q6883l1205J95779A24112L06146B04949R0497j4553J3895J14546
$$ plain form
7508 79246 103959 152715 76121 -6835 84838 -33318 129774 130720 17164 -79651 -3541 63763
7495 -26682 -24736 -24118 -17094 102747 56749 7111 43150 28392 88990 120951 73353 -14621 -13737
7482 -13737 1411 94436 127300 1909 -71434 8881 -33130 65577 -30045 77489 -24443 61913
7469 159702 -27326 -92281 103853 -18645 94536 -77193 107773 119295 94866 83947 44692
7458 44692 -41390 65426 -29202 51234 141021 169906 -65306 44838 5526 126789 57941 -55687
7445 146391 20805 163759 141668 68888 53585 98071 223083 145779 161983 41657 156765
7434 156765 157676 158214 37385 65070 83022 58637 11043 99841 40303 208899 254490 251243
7422 251243 236921 150038 118833 314612 124112 430258 204949 295446 280893 294788 409334
7411D09334j46210J47920j77448J27926p2422L2112P1929j87115J51684O1237
7401D18947K87381k45737k3181j37611Q7370p5096K0009r6253O9248l7524R7199
7390C64752j03981Q0224j3065N9926n1415q5330J4997j10038l7673Q1792K8759
7379B28948n9501M4866r397n650H8099J4364J07186l1709o2324R112P3170G6347
7366A84655k4139C2023O1079M8134F5593R601Q8757j0754q353k4745m0381I156
7353A86421C1163f279F8931N9516Q801A3301K05444m9158K4563N8664A05981N9925
7341A65906L6307i940A06619N4140F0265i2319I1556j5265J05898C6967O6397
7330A03364m6368J42291O8443m2133p6259N3141K7852A02884K1770D9402O4923
$$ plain form
7411 409334 263124 411044 233596 361522 289100 321212 393141 206026 357710 418947
7401 418947 706328 460591 437410 299799 387169 312073 332082 235829 305077 267553 364752
7390 364752 260771 340995 327930 387856 336441 251111 266108 156070 118397 200189 228948
7379 228948 169447 214313 204916 199266 88099 102463 209649 177940 115616 124728 197898 76347
7366 184655 160516 32023 93102 141236 65593 75194 163951 153197 144844 120099 79718 9156
7353 186421 31163 -6279 68931 128447 137248 13301 218745 169587 194150 252814 105981 165906
7341 165906 202213 -9940 106619 160759 60265 -92319 91556 76291 182189 36967 103364
7330 103364 56996 199287 267730 225597 149338 202479 230331 102884 124654 49402 114325
7319A14325M8808m7705D4449Q9909n5410R9691n3467K1314J75356I8533J56585
7308B55118k8161J09044A37170J05654j21028P8199J1425K1415k8303r8287R3055
7297A99300L8546E4286M1710R4718n0660F433J65136k3643O3318j03511j1520
7286I6213Q9933r493M5541J2202K9461o9055o8060J23639I1007M1084O381K1555
7274A60027G5416J32988p4249R1086I6424J90848J304j24023J9222R6054l8189
7263B41640J0022P8765j5889J68015q7958K76601j07448J61148J70219M11546
7253A306661M72284M68209M8672n05795m02742m06487j85634J06875n0681J16984
7243I68346K96911K31680N01912N24296O93459J21081k64196k90113k95158k71095
$$ plain form
7319 114325 163133 115428 44449 134358 78948 178639 125172 146486 321842 98533 255118
7308 255118 226957 336001 137170 242824 121796 199995 211420 232835 204532 106245 199300
7297 199300 237846 54286 95996 190714 140054 6433 171569 147926 211244 107733 96213
7286 96213 186146 176653 222194 234396 263857 194802 126742 250381 91007 132091 138472 160027
7274 160027 75416 208404 134155 225241 96424 287272 288576 164553 183775 279829 241640
7263 241640 251662 330427 314538 482553 394595 671196 563748 724896 895115 1306661
7253 1306661 1778945 2247154 2295826 1790031 1387289 980802 795168 902043 851362 968346
7243 968346 1265257 1496937 1998849 2523145 3216604 3337685 3073489 2783376 2488218 2217123
7233B217123l47637j23939k06039j69985J3278M2981P312K30265J94355L35488
7223B193202O56338O60423Q28929R01512P33466Q23177J819268L628940N934394
7214A8179649P072074M976795j10222m484457l198591Q02657M235694M324734
7206C1798333J571027k799888m142927j356752J834971N005908N842356M633855
7198D2386883K633065J759357K015774L591279N906133P478277N523409l028263
7190F8265914j2867528j5953504j1028105n567032k276540L70671L084980N600764
7182B9629620O123117L577230N44999j003459L41291q09172n481750r198688p873794
7173A5849394m792344k799880j553658p96000l02649k59431n20407r00325o54151
$$ plain form
7233 2217123 1869486 1745547 1539508 1369523 1382801 1425782 1433094 1663359 1857714 2193202
7223 2193202 2849540 3509963 4338892 5240404 5973870 6797047 8616315 12245255 18179649
7214 18179649 25251723 30228518 30118296 25633839 22435248 23237905 27473599 31798333
7206 31798333 33369360 30569472 26426545 25069793 26904764 31910672 37753028 42386883
7198 42386883 45019948 46779305 48795079 52386358 58292491 65770768 71294177 68265914
7190 68265914 55398386 39444882 28416777 22849745 20573205 20943876 24028856 29629620
7182 29629620 35752737 39329967 39874966 38871507 39212798 38403626 32921876 23723188 15849394
7173 15849394 11057050 8257170 6703512 5907512 5604863 5345432 4825025 3924700 3270549
7164C270549p42133l62604l60186o4720k68853P2272k4998J8418L82654P51275
7154B671674Q96779J020974K2673o40357j254354q61720l94375l63937L2174p5497
7144A054034l15020J06609Q2949L47621L74414K93460J8911j86030n28864l12364
7134I35720k51681j84781p9877o0635j37228J04835l4291n2572o3196L7218J370
7123B14882Q4955n0639q8733P5505l3232m8108K0039j9719J62310A56657O0276
7112B16933m7041p6894J30540k3464C5086K31637I1059Q747L6592n6961A5628
7100H1396O967N0611M996m4216N1369k6824j8583k2436K5654j966m7319B3303
7087A28179J35415j26465J77O3163M7559n8316H8776J11866O4014E0713M6110
$$ plain form
7164 3270549 2528416 2165812 1805626 1740906 1472053 1544325 1519327 1537745 1920399 2671674
7154 2671674 3568453 4589427 4612100 3971743 2717389 1855669 1461294 1097357 1129531 1054034
7144 1054034 739014 845623 928572 1276193 1650607 1944067 1962978 1776948 1248084 935720
7134 935720 684039 499258 419381 358746 221518 326353 292062 239490 176294 213512 214882
7123 214882 299837 249198 160465 235970 202738 154630 174669 154950 317260 156657 216933
7112 216933 169892 92998 223538 200074 35086 266723 91059 99806 136398 79437 15628
7100 81396 88363 138974 143970 99754 151123 124299 105716 83280 108934 106968 59649 23303
7087 128179 263594 137129 137306 200469 248028 189712 88776 200642 264656 50713 96823
7076I6823J25252B7658J29817A1786O3622J13279R0028j21493F9169P7057j1814
7065A34412E5788J06775L9728o0393P1915M3517j17810K6997m04O0124l9674m9314
7053A37249O0267N1676q8384J47523E3532J20175R0128K306k8472r6021J2143
7042A53791k9987L2956A8666J91161G130K63491n3827l7497j7478m8156N6747
7031A70410m8609K8438P7207m7827p2480P1426E2977J77901D4806O7003Q5201
7020A97010r6155l5875J65006j02117O3908E9025J3303N3998K9513L7547O194
7009A99580J5933I8886n411L4923M1404P3743J4344j01951J36285J14192j22976
6998B83439M6467J942r8059O3335o8990J11887j59928R3319J19756j73464J09351
$$ plain form
7076 96823 222075 27658 157475 11786 75408 188687 278715 157222 69169 146226 134412
7065 134412 55788 162563 202291 141898 213813 257330 139520 166517 166113 226237 186563 137249
7053 137249 197516 249192 160808 308331 53532 173707 263835 266141 237669 141648 153791
7042 153791 123804 156760 18666 209827 7130 270621 216794 179297 161819 113663 170410
7031 170410 121801 150239 227446 179619 107139 178565 52977 230878 44806 111809 197010
7020 197010 100855 64980 229986 127869 191777 59025 72328 126326 155839 193386 199580
7009 199580 215513 98886 93475 128398 169802 243545 257889 155938 292223 406415 283439
6998 283439 329906 331848 233789 297124 228134 340021 180093 273412 393168 219704 329055
6987C29055J4921M2914q4456K26334p4845n5024l335P6188k6985R1826n699o2476
6975D68418q3163p4158j5962n2426R3283r0025J00937j41451J21917J098j9303
6964C09165K1459m9315J02813j27559j689m9391H8954P5319n56R1539l2922H3821
6951B68959j03808N8244A03520Q8834L2172k1027R5888q4539R8318j28903n9633
6940A24630J25221m776j13362N6073J2725o0360R9569k5435M5085n4339M9918
6929B54949q3730K709P4136M3325m7980N5997j7774L5572Q2368p5422k5371M7296
6917C46075n9050R6574J42060Q5129M12875M42177N28232K83951o3203o66616
6907A548204o49576k52078n9694j68153K3746L1624j71415J08438o3175k1507
$$ plain form
6987 329055 343976 386890 302434 528768 453923 398899 395564 471752 444767 536593 530894 468418
6975 468418 385255 311097 295135 242709 335992 245967 346904 205453 327370 328468 309165
6964 309165 330624 281309 384122 256563 254874 205483 88954 164273 163717 255256 222334 83821
6951 268959 165151 223395 103520 192354 224526 203499 299387 214848 313166 184263 124630
6940 124630 249851 245075 131713 187786 200511 140151 239720 214285 259370 205031 254949
6929 254949 171219 173928 248064 291389 243409 299406 281632 317204 399572 324150 298779 346075
6917 346075 287025 383599 525659 610788 1023663 1465840 1994072 2278023 2214820 1548204
6907 1548204 898628 646550 586856 418703 442449 474073 302658 411096 347921 326414
6897C26414m2976L4844J396O2349j05926Q0112q832Q153m6367K3372O8900A42805
6884C14734q041n9732l2221l6820J72633m674q7663N1998m5450L0078L8358A58659
6871C12541Q773M4422Q01l0078l0412l0190k152J30023j18206K1269l7944P7577
6859C46424R8978j30924J12019o7675M3956q8649J24485m0330o2637j18511J17001
6848C34137J3179j3502Q5255j37724J004m3665M762J62409q8467n9965O7073K5529
6836C50025R5873j01914l8585N2822l0927p8257J07393j05204K30312P762j32836
6825C56464l8325P2048J73397l6535K6123q0931j06828J95998j86796O8307m548
6814D38374K3153K0563j23000J9472O4578j17249J43028B21004O2830K913K04870
$$ plain form
6897 326414 283438 318282 319678 382027 276101 356213 347381 355534 309167 332539 401439 142805
6884 314734 306693 246961 214740 177920 350553 345879 258216 310214 264764 294842 333200 158659
6871 312541 321314 365736 366537 336459 306047 275857 273705 403728 285522 306791 268847 346424
6859 346424 445402 314478 426497 358822 402778 314129 438614 398284 335647 217136 334137
6848 334137 347316 333814 419069 281345 282349 238684 243446 405855 317388 257423 324496 350025
6836 350025 445898 343984 305399 358221 327294 249037 356430 251226 481538 489300 356464
6825 356464 318139 390187 563584 527049 553172 472241 365413 561411 374615 442922 438374
6814 438374 461527 482090 359090 378562 443140 325891 468919 221004 283834 286747 491617
6803D91617j80523K64998k45672N7955j54434J43212p8126J21719o9059Q6560
6793D38247m7561N1045j46822N9035M6664N8247j00434K2983m0279J32847N5374
6782E29346j06291K5981K5347K6M3630O8982m7973k09231J35892m8083K5428p1478
6770C71576N5059n2025K43767o5688m1552P6423O8473j9215R157P2843j6949r0893
6758F10976J07026j03726J9965J07721j60456J16934R77m852O8045N1680K6950
6747H41240J2437n1120J00823p7570P5903q422J28700r9392P5391n4434J94310
6736A137866j23426J52475J17063M6333M1684J98572M6816K30240J25984J28504
6726B102111K64717M73067K31812J87648K02264N81075N04934N52533O83951R38591
$$ plain form
6803 491617 311094 576092 330420 388375 233941 377153 299027 420746 351687 438247
6793 438247 390686 441731 294909 353944 400608 458855 358421 381404 341125 473972 529346
6782 529346 423055 449036 474383 474409 518039 587021 539048 329817 465709 417626 443054 371576
6770 371576 426635 374610 618377 552689 511137 587560 656033 636818 645975 718818 701869 610976
6758 610976 718002 614276 634241 741962 581506 698440 699417 694565 762610 814290 841240
6747 841240 853677 802557 903380 825810 901713 893291 1021991 922599 997990 943556 1137866
6736 1137866 1014440 1166915 1283978 1330311 1371995 1570567 1617383 1847623 1973607 2102111
6726 2102111 2366828 2839895 3071707 3259355 3461619 4042694 4547628 5100161 5784112 6722703
6716F722703J363077J647966J998852K802627L906451N424177P826912J1100501
6708D2793266J8580761M0292842Q4101438J10115065R7375420j4832374j20510443
6701B57915975j18288617n8311286k5973514j4649726j0028969o276736m431892
6694A9955235l398576l122873k730808j908117j374142r45871q47258n97850m14459
6685D615281m53541k45699j50621k94213r7645k32223K2198j20310j5749j93204
6675B834274j1634l4330J0750K15127J18623J80696J0566K95646L40081L70417
6665D330216N15797M51579P21938N69602Q64051J149356J235978J198949J210093
6656A2247559Q37210O08425L96437J04587o7753J47224J66179l5153l31766m97169
$$ plain form
6716 6722703 8085780 9733746 11732598 14535225 18441676 23865853 31692765 42793266
6708 42793266 61374027 101666869 185768307 295883372 393258792 378426418 257915975
6701 257915975 139627358 81316072 55342558 40692832 30663863 24387127 19955235
6694 19955235 16556659 13433786 10702978 8794861 7420719 6474848 5627590 5029740 4615281
6685 4615281 4161740 3916041 3765420 3471207 3373562 3141339 3163537 3043227 3027478 2834274
6675 2834274 2822640 2788310 2799060 3014187 3132810 3313506 3324072 3619718 3959799 4330216
6665 4330216 4846013 5297592 6019530 6589132 7453183 8602539 9838517 11037466 12247559
6656 12247559 13084769 13693194 14089631 14194218 14126465 14273689 14439868 14404715 14072949 13575780
6646A3575780r52847j203453j214486j202860j014310q70150p29825o29348l40904
6637E417597k12466k91609j32056k7692K5248R1172L3807J84552N11399K11042
6627E810994O56896N90105P24798J029560J072208J336816J707182J835204J975151
6618A6738914K084457J643940J409290J060454Q24883N95840N46237N25154N04249
6609B5933418n2020r12359j809341k482009k517229k449472j933295j485319j265752
6600A1026622q75498l65271j80335M51657N93493M09526J33446n15186n44680
6591A0133774m23500m95866n28265o47594q51955q53326m68938m00097q6760o6962
6581E310511M08373K82054O39177P02378J121273Q67637O30634O94904O41996
$$ plain form
6646 13575780 12622933 11419480 10204994 9002134 7987824 7117674 6387849 5758501 5417597
6637 5417597 5205131 4913522 4781466 4753774 4779022 4870194 4904001 5088553 5599952 5810994
6627 5810994 6467890 7057995 7782793 8812353 9884561 11221377 12928559 14763763 16738914
6618 16738914 18823371 20467311 21876601 22937055 23761938 24357778 24904015 25429169 25933418
6609 25933418 25881398 24969039 23159698 20677689 18160460 15710988 13777693 12292374 11026622
6600 11026622 10151124 9785853 9605518 10057175 10650668 11060194 11193640 10678454 10133774
6591 10133774 9710274 9214408 8686143 8038549 7186594 6333268 5864330 5464233 5377473 5310511
6581 5310511 5718884 6000938 6640115 7342493 8463766 9331403 9962037 10656941 11298937
6572A1298937J178462J756722K230562J949306N71007r38648k028416k024417
6564A3993515j832377r41350n29281K043P76635J031238J844289K854376L172049
6555B0371137L125722K435122N95009J0918l53756j006202j539429k568660k569516
6546A8500345k345237j465569n59072k03746N06969J010383J675436K505499K922709
6537B2547717K859049K133604M93946j222076k178099k413739k041547j700589
6529A8478266q97150m77826R2217P39464J107299J305799J642565J574156J111725
6520B4676515K41927l69694j246541j602967j646731j477695r77150p17117j74277
6511A6706270J89548P41366R69952J240306J090039P33560O50700P50600N76812
$$ plain form
6572 11298937 12477399 14234121 16464683 18413989 18984996 18046348 16017932 13993515
6564 13993515 12161138 11219788 10690507 10692550 11469185 12500423 14344712 17199088 20371137
6555 20371137 23496859 25931981 26526990 26537908 26184152 25177950 23638521 21069861 18500345
6546 18500345 16155108 14689539 14130467 13926721 14433690 15444073 17119509 19625008 22547717
6537 22547717 25406766 27540370 28034316 26812240 24634141 22220402 20178855 18478266
6529 18478266 17581116 17103290 17195507 17934971 19042270 20348069 21990634 23564790 24676515
6520 24676515 24918442 24548748 23302207 21699240 20052509 18574814 17597664 16880547 16706270
6511 16706270 16895818 17637184 18607136 19847442 20937481 21671041 22321741 23072341 23649153
6502B3649153J084745J451821K197019K454884L110211L704461M538484N972777
6494D8163555Q450918J3716922K7299921O7545241J04497395J17728222K6145094
6487D13547268p8781242j48584401p9164324l4939973j7333489j1368088p666892
6480C5708859m931235l990557k969016k325889j711156j216960n83855o5922J38634
6471A8052903M89175Q81966R48847J008678Q83544L57892j85421o02092p74344
6462B1061148q22198p41604p15082p04502r34603r54031j165399j172995j581754
6453A2268980j215432j187849r41524p80115o54604n27345m59421n68039l27645
6444E607006j77678k14728j65575O0159j26552r6975K04120J27710K27139Q9033
$$ plain form
6502 23649153 24733898 26185719 28382738 30837622 33947833 37652294 42190778 48163555
6494 48163555 56614473 70331395 97631316 165176557 269673952 387402174 413547268
6487 413547268 334766026 186181625 107017301 72077328 54743839 43375751 35708859
6480 35708859 30777624 26787067 23818051 21492162 19781006 18564046 17980191 17914269 18052903
6471 18052903 18542078 19424044 20372891 21381569 22265113 22623005 22437584 21835492 21061148
6462 21061148 20238950 19497346 18782264 18077762 17143159 16189128 15023729 13850734 12268980
6453 12268980 11053548 9865699 8924175 8144060 7489456 6962111 6502690 5934651 5607006
6444 5607006 5429328 5214600 5049025 5109184 4982632 4885657 5089777 5217487 5444626 5533659
6434E533659J44972L51535N08750M83036O50743N57792O15164K71482L1435j09136
6424I039432n73987q82196o01794r01743o13819p36650n04285o44082k75267m49340
6414B856269l25457l67810n3595j94243j45798k81375r912J8848k12217J2381
6404A297091o3609j08379J9633r8966K1754j47294j04912O8987j28434n293l8350
6393G12228R4183k44551O1143n7373j30097Q4133P1816j23586j1849M9551J1911
6382E17509r8587J9771K070Q9259j54131J16087k6886m6358l4959r860q868q6382
6370B78665j01475Q6920Q8002o3851M8632M2393j47347P6791K1046l8384j0312
6359B81080O7881j00619L0403J99333r2210l1252j01055m0733M7843L4083E5745
$$ plain form
6434 5533659 5678631 6030166 6538916 7021952 7672695 8230487 8845651 9117133 9148568 9039432
6424 9039432 8465445 7583249 6981455 6079712 5465893 4729243 4224958 3580876 3305609 2856269
6414 2856269 2530812 2163002 2109407 1915164 1769366 1487991 1478079 1496927 1284710 1297091
6404 1297091 1233482 1125103 1144736 1045770 1067524 920230 815318 884305 755871 750578 712228
6393 712228 806411 561860 623003 565630 435533 519666 591482 467896 456047 505598 517509
6382 517509 418922 438693 440763 530022 375891 491978 465092 418734 383775 373915 365047 278665
6370 278665 177190 264110 352112 288261 336893 379286 231939 308730 329776 291392 281080
6359 281080 348961 248342 278745 478078 385868 354616 253561 212828 260671 294754 55745
6347B54782r5003m7644J37698m2616O8106N8180m4659R7102q6087q9111j3985
6336A96763Q5954p7070M1366J1481O5635q880l7593j00071L8122k7868J23069
6325C10908q1438j2868K2536N5661M0278j01404J47378j32300l7886N8855I7108
6313B70021n8352k5009O647R640J15778q3322M6485j32687J75830q1985l4382
6302B08664O4050K4147A17633K1675M7688m9661J49845m7357M1998J3882o3675
6291B32028M5606j225k2857J03530L2419K9879l769R9618L0887Q1901P8195L32825
6279A039037N10771O56601M17819j42834p38521k71895o0867J54980J00302J12432
6269A777825j05577n36056j53583k82834j27002r6548j1238j27886R2091o7928
$$ plain form
6347 254782 159779 112135 249833 207217 275323 333503 288844 385946 299859 210748 196763
6336 196763 282717 205647 247013 258494 324129 315249 277656 177585 215707 187839 310908
6325 310908 229470 216602 239138 294799 335077 233673 381051 248751 210865 269720 97108
6313 270021 211669 186660 193307 202947 318725 235403 281888 149201 325031 243046 208664
6302 208664 272714 296861 117633 139308 186996 137335 287180 239823 281821 295703 232028
6291 232028 277634 276409 253552 357082 389501 419380 415611 515229 546116 628017 706212 1039037
6279 1039037 1549808 2206409 2624228 2481394 1742873 1470978 1410111 1565091 1665393 1777825
6269 1777825 1672248 1136192 982609 699775 572773 476225 464987 337101 429192 361264
6259C61264j02150M3214j1935p7662Q5875q821n9478j12104k0445J79502m7967
6248B29293J33267j19926H5143J22972l6518M073l4101n0049J26669E0118P8985
6237A29103j1995P8208E7704j4893J09442m3328m3185K613l0379P0186O3286p077
6225A64369o2127k4213k5249N2102J0822P8021J6212m8659M2669m8504G0113M1979
6213A12092J9745O7956r926F0789O2660L0069j1217o3560P8518k2281L4412H1496
6200A76310o506p5666J07552G0027J9165C9353N0723P601K8074n1854B8565J14418
6188A42983r870E1017O6372N6519M0671p439F4971j8429A0982J78832H3629B6585
6175A10306J18996B7828J08471J11960F5076J0557J14086L5403r9829M6146c1138
$$ plain form
6259 361264 259114 302328 290393 212731 298606 289785 230307 118203 97758 277260 229293
6248 229293 362560 242634 85143 208115 171597 175670 141569 91520 218189 50118 129103
6237 129103 117108 195316 57704 42811 152253 108925 65740 68353 37974 108160 171446 164369
6225 164369 102242 78029 52780 104882 115704 193725 209937 161278 203947 155443 70113 112092
6213 112092 131837 199793 189867 60789 123449 153518 142301 78741 157259 134978 169390 81496
6200 176310 169804 94138 201690 70027 89192 39353 90076 97677 125751 73897 28565 142983
6188 142983 133113 51017 117389 173908 214579 207140 64971 46542 10982 189814 83629 26585
6175 110306 229302 27828 136299 248259 65076 75633 189719 225122 125293 171439 -31138
6163A45066o1691P8906j3380K9898A0572J91974Q5977A42100L2872L4747o6784
6152A42935M2707K4281p6127O9586K8777H6879K45037j37155J11202j32292J62087
6141C35758J5434K1297j17958j8270q351L3720J39132J7356j11147J55637j46108
6130C16500Q549O3017k7351j0078J49660j68716J61693j13104O3934O4297O3203
6119E71604j73885N9925P7608L4758n9763J00801k01720K21737j62770R9759J12602
6108F80656M1070P2695N3247L0119n1549P3809L3800R8769M3344J49166L3406
6097A258532k6451K18221J7213Q4444N1047Q6920K25732K24687R814K99488K03095
6086B652742L36082J77582L09275L47026P11968O47554O83770P68864Q73057J458520
$$ plain form
6163 145066 83375 162281 148901 178799 10572 202546 288523 142100 174972 209719 142935
6152 142935 185642 209923 133796 203382 232159 86879 331916 194761 305963 173671 335758
6141 335758 351192 372489 254531 236261 227910 261630 400762 418118 306971 462608 316500
6130 316500 325049 388066 360715 350637 500297 331581 493274 380170 444104 508401 571604
6119 571604 397719 457644 535252 570010 510247 611048 409328 631065 468295 568054 680656
6108 680656 721726 794421 847668 877787 826238 900047 933847 1032616 1075960 1225126 1258532
6097 1258532 1232081 1450302 1467515 1551959 1603006 1689926 1915658 2140345 2150159 2449647 2652742
6086 2652742 2988824 3166406 3475681 3822707 4534675 5182229 5865999 6634863 7507920 8966440
6076H966440J492346K002779K427596L168610M232687N581883P755334J0640403
6068D6268078J5478315K4160119M0364156O1039351P0859243N1703240j853307
6061C08019195n7916748p5497020n7017634l5424257k1720945j4332477j0322204
6054C5787910p439842n719527m145235l271422k584026j840292j536982j145862
6046H104722j105877q09432p01135n58174n72453l95292n14177k39329k22958
6037B985895k71642k68361l89599K5000j05352j41862k30614j13620j14032J3143
6027A388956p6550K2764k69308k784k373j13662o3735j06275r4151m3914L2403
6016F71371m443r1332R676j27711j9213Q2723k8055J4436j19577o7598p4819J52481
$$ plain form
6076 8966440 10458786 12461565 14889161 18057771 22290458 27872341 35627675 46268078
6068 46268078 61746393 85906512 126270668 187310019 258169262 309872502 308019195
6061 308019195 250102447 174605427 117587793 82163536 60442591 46110114 35787910
6054 35787910 28348068 22628541 18483306 15211884 12627858 10787566 9250584 8104722
6046 8104722 6998845 6189413 5488278 4930104 4357651 3962359 3448182 3208853 2985895
6037 2985895 2714253 2445892 2056293 2081293 1975941 1834079 1603465 1489845 1375813 1388956
6027 1388956 1312406 1335170 1065862 1063078 1060705 947043 883308 777033 682882 638968 671371
6016 671371 666928 575596 585272 457561 438348 521071 493016 507452 387875 320277 245458 397939
6004C97939A96463Q9808j4455L5338k1719j20709R0142H1792J34838A01448J15255
5993B16703R89H4420N5305K7970C5866K94241C9794j3536J12173n8413J23299
5982B03317p2331n4295O098J8619J1312n4346k3868M7603C267Q2180e7106m1079
5970i8185d429A17053A9456h5885F3881d3911F6061d5271C9914j3807k796i6016
5957b0251p3813a1808j15927d1793b573p222j6956g215q9102b8782j66414O3195
5945a32001L5954F8948h2350D269O636h3345K5172K9082D8965d9556a0270I2430
5932a9554G8984l8079b2117B4179K0695e1944F6918F315i2866C7083b9273B9618
5919a05553d0094a7268A4816b3885D5020G960a40214I9463e937A6828i6317J5425
$$ plain form
6004 397939 196463 286271 271816 307154 285435 164726 254868 81792 216630 101448 216703
5993 216703 217692 84420 139725 167695 35866 330107 39794 26258 138431 80018 203317
5982 203317 130986 76691 82789 101408 112720 58374 34506 82109 3267 85447 -57106 -98185
5970 -98185 -4429 117053 19456 -85885 63881 -43911 66061 -45271 39914 26107 23311 -96016
5957 -20251 -94064 -11808 -127735 -41793 -2573 -9795 -26751 -7215 -96317 -28782 -195196 -132001
5945 -132001 -96047 68948 -82350 4269 10905 -83345 -58173 -29091 48965 -49556 -10270 92430
5932 -19554 78984 40905 -22117 24179 44874 -51944 66918 6315 -92866 37083 -29273 29618
5919 -105553 -40094 -17268 14816 -23885 45020 7960 -140214 99463 -5937 16828 -96317 -80892
5907h0892j2609M802B3780R005N8647A6060L0927c8485n3968c7845j8491m182
5895f0518A8887i0354A0391c2456a1233j2079k494j6053j14693a528n473E521
5882a3451m3743D5863b110D6105L005H806L3723c616r659n39A0441O9087J9155
5869I8683K1926a47150B2551j1175a23561N1484m1389A03028C7632A7452J30792
5858A48244K6767o3553J42223J54239l997R5965L00350L33483L60408J1977j76350
5847A329756l06465D95579q9564j06241n2426o7826R4768A36181C0158J00852
5837A31010E8187b6461A069L4511i270F4400i7462A0367h310j11247M4375F3247
5824a60506a0338p7679b8709n2246c5910A22630a09950C5005N0948n066g44E8976
$$ plain form
5907 -80892 -93501 -88699 23780 32785 91432 16060 46987 -38485 -92453 -37845 -56336 -60518
5895 -60518 18887 -90354 10391 -32456 -11233 -23312 -25806 -41859 -156552 -1528 -7001 5521
5882 -13451 -57194 45863 -2110 46105 49110 8806 42529 -3616 -13275 -13814 10441 79528 98683
5869 98683 120609 -147150 22551 11376 -123561 -72077 -113466 103028 37632 17452 148244
5858 148244 175011 111458 253681 407920 403923 499888 800238 1133721 1494129 1506106 1329756
5847 1329756 1023291 495579 406015 299774 247348 179522 274290 136181 30158 131010
5837 131010 58187 -26461 1069 35580 -9270 64400 -97462 10367 -8310 -119557 -75182 63247
5824 -160506 -10338 -88017 -28709 -80955 -35910 122630 -109950 35005 85953 80887 -744 58976
5811d6729j1151q8289L8058J2218F5284B4187f4416J2353a0329C2579h1599K7864
5799e3735a799A5957e2582l6158D8483a50381j673a416C4099a26676J9177P85
5787a06714b4305k3047r0799e5397m2140b5877j9734G3728h8873m3677a0955n7233
5775f8188E818i1953a3451j64559D470J7567f060n1684o8287b0718K147G9360
5762a8969j13903c6520k1448b5714I5933a27069K6935J626j1616M4326r9367a3087
5749a29358k7216P8183b4151J2041l5493n2000j8091L0782k6982F9122a77373
5737a40820M4437J8654m5512L5600K6436i765j6803j18976c6812n1471b9348m7538
5725g6886b7786n7702a6078L993L513H5610c8432p1104k5623a1359H9285b08495
$$ plain form
5811 -46729 -57880 -146169 -108111 -95893 65284 24187 -64416 -52063 -10329 32579 -81599 -53735
5799 -53735 -1799 15957 -52582 -88740 48483 -150381 -152054 -1416 34099 -126676 -107499 -106714
5787 -106714 -24305 -47352 -138151 -55397 -97537 -25877 -45611 73728 -88873 -132550 -10955 -68188
5775 -68188 5818 -91953 -13451 -178010 4470 22037 -6060 -57744 -126031 -20718 -18571 79360
5762 -18969 -132872 -36520 -57968 -25714 95933 -127069 -100134 -98508 -110124 -65798 -165165 -13087
5749 -129358 -156574 -78391 -24151 -12110 -47603 -99603 -117694 -86912 -113894 69122 -177373
5737 -140820 -96383 -77729 -123241 -87641 -61205 -9765 -26568 -145544 -36812 -88283 -29348 -76886
5725 -76886 -27786 -85488 -16078 -12085 -8572 85610 -38432 -109536 -135159 -11359 89285 -208495
5712e409D7687e2689A6255A103c199C5356f1595J970m867F7083J4067e9203n7435
5699a16638K3228j5803A648i7135f024q6181E3938a91164E1246a03395a7116q6456
5687a03572C5599i1061c1248a3992D9164g3158c2922B0272e3924E8810h2279C5456
5674h2796E153f913m6834J4818g883j28100c9514a4282j64613Q1584F6038b2452
5661f9135j866C1822a7842D1111h3245a9665j2170l8001a0497j1633k3703j435
5649d7268C7896N8172d4612o1645f921n5679p8106B767d0193j3971l9181K0903
5637g2442q3266N6917L9749j39529J0945c3580F4445d7632p5420G890i8620J6052
5625h2568j1436a5142C3641d1184K0350r368j27057l1801i4505p5164O9595c9469
$$ plain form
5712 -5409 47687 -52689 16255 1103 -3199 35356 -61595 -59625 -64492 67083 81150 -59203 -116638
5699 -116638 -93410 -109213 1648 -97135 -6024 -92205 53938 -191164 51246 -103395 -17116 -103572
5687 -103572 35599 -91061 -31248 -13992 49164 -73158 -32922 20272 -53924 58810 -82279 35456
5674 -82796 5153 -6913 -53747 -38929 -7883 -135983 -39514 -14282 -178895 -97311 66038 -22452
5661 -69135 -71001 31822 -17842 41111 -83245 -19665 -31835 -69836 -10497 -22130 -45833 -47268
5649 -47268 37896 96068 -44612 -106257 -6921 -62600 -140706 2767 -40193 -54164 -93345 -72442
5637 -72442 -155708 -98791 -59042 -198571 -187626 -33580 64445 -47632 -123052 7890 -98620 -82568
5625 -82568 -94004 -15142 33641 -41184 -20834 -30202 -157259 -189060 -94505 -169669 -100074 -39469
5612f4053r7473J9371a0612A87315i6168k982l781E9000b8603E7391a58669P4350
5600h4319A2141b8030B1854k743d1106J1283H4503L0920a21355M0075K4460j60436
5588b17256a5100p9294M7016n6618a5855p7587D9537B010d7668B44c0708o500
5576c7208j5630B9653i8960c5180C0337d0608c792J665n2137B9906N1610a49502
5563e3897J9022G919d8239J6705p6576C1619N5542f7891C1727f1837b697D1424
5550i240k8873p0622c7804j4900n7237L6444e170I1583A9093c5010O929l981E840
5536B0695Q511b6207l6744C8055D356i2120D3392G435a12701o7874b0772A785
5523c8551A07168i037G113J3168a01334e0216K1775o767J5441E7755J5330a000
$$ plain form
5612 -64053 -161526 -142155 -10612 187315 -96168 -99150 -102931 59000 -28603 57391 -158669 -84319
5600 -84319 12141 -28030 21854 19111 -41106 -29823 84503 115423 -121355 -81280 -56820 -217256
5588 -217256 -15100 -94394 -47378 -103996 -15855 -93442 49537 2010 -47668 244 -30708 -37208
5576 -37208 -52838 29653 -98960 -35180 30337 -40608 -3792 -2127 -54264 29906 81516 -149502
5563 -53897 -34875 7919 -48239 -31534 -108110 31619 87161 -67891 31727 -61837 -2697 41424
5550 -9240 -38113 -108735 -37804 -52704 -109941 -73497 -5170 91583 19093 -35010 -28081 -32062 5840
5536 20695 29206 -26207 -62951 38055 4356 -92120 43392 7435 -112701 -180575 -20772 1785
5523 -38551 107168 -9037 7113 20281 -101334 -50216 -28441 -35208 -19767 57755 73085 -1000
5510b0263R212A48875o6510C4927M3414f5464F5331d2644A44309l9574l1707B5312
5497A16216l4460P2907d472E5732L6833B8229P3638K3517E6773k6546Q9864K9057
5485A49148F7728A2490k296J25331E3338J4781J72478I3498k1516a3605G2632
5473A73713q4101O9389n1641D3144d0497D9439J04720g355A57812j8886k1931
5462A16995G514J95827D6290P9316k1890C1699K1776O1248P5519F4129j2798a6434
5449g827H1506a4615G1618K7291a8678j1593F5611h1547B8226h3986C4630J48893
5437A83523o4695D9845f8981G2171c0912I2785f3744F6245f1284F2379K7057K3416
5425A12852a0512N007A40667o0705c1928F541c558o8359A17851e072m4925a4586
$$ plain form
5510 -20263 -11051 148875 82365 34927 78341 -65464 65331 -42644 144309 104735 73028 25312
5497 116216 81756 154663 -4472 55732 92565 28229 101867 125384 56773 30227 120091 149148
5485 149148 67728 12490 10194 135525 53338 68119 240597 93498 71982 -13605 72632
5473 173713 89612 159001 107360 43144 -40497 49439 154159 -7355 157812 138926 116995
5462 116995 7514 203341 46290 125606 103716 31699 53475 114723 190242 64129 51331 -16434
5449 -7827 81506 -14615 71618 98909 -18678 -30271 65611 -81547 28226 -83986 34630 183523
5437 183523 118828 49845 -68981 72171 -30912 92785 -63744 66245 -61284 62379 89436 112852
5425 112852 -10512 -5505 140667 79962 -31928 6541 -3558 -71917 117851 -5072 -49997 -14586
5412C3280c5792A00702e1941C2823A0052L6343b0079H9137a3102c312j12820e2794
5399i550A05406e7926G7986h9827b4704A38780k9650h875H7664D3487q724J9262
5387E4025k573N1782b5245E4887m392g0002D9339K2997A5217c2378A68176A1686
5374A43430h504D7968d9178A04186a1866C16016j50244M0198a5610H5586P2401
5363A57987K897j761E9439L7769k7686R3894L4623m6554L822K277j8898J8899
5351A57585o6359M9826R61N6519J7257k6291q620l6002J03352K6209m703J01064
5339C70798A76403J19225M8789j3866q7899N0486J5969n7593P7563l220n8996
5328B66861O838J42333m6312q4279N358P599p2538n4419J73908M0306p3632k5606
$$ plain form
5412 33280 -35792 100702 -51941 32823 10052 46395 -20079 89137 -13102 -3312 -116132 -52794
5399 -9550 105406 -57926 77986 -89827 -24704 138780 109130 -8875 87664 43487 34763 54025
5387 54025 51452 103234 -25245 54887 50495 -70002 49339 72336 15217 -32378 168176 11686
5374 143430 -8504 47968 -49178 104186 -11866 316016 165772 205970 -15610 85586 157987
5363 157987 160884 159123 59439 97208 69522 163416 198039 151485 155307 157584 138686 157585
5351 157585 91226 141052 142013 198532 215789 189498 180878 144876 248228 274437 269734 370798
5339 370798 176403 295628 344417 330551 242652 293138 309107 251514 329077 325857 266861
5328 266861 273699 416032 369720 285441 290799 298398 225860 171441 345349 385655 312023 286417
5316B86417j40251J33865j5649N359O423P299q9785P9733J9806L0409A46763R8156
5304B44919Q6010j10244J35220A33911o2741J38991j2178m7051J11367j17770
5294A44529j3786Q1564o2758R548J4618j5194p5723O3000D8720O6750J31050I4608
5281A79970K3184p8005e7025B15945G7208P4444r712j3889l2860D6486J19503
5270A65989E4891m229A6224J62652l5437J9617l6351Q797k3322K6237O2660q5939
5258A15138k4735Q0562q2553C8512O0580F48J26808l336m6032Q1557k4873H3J38722
5245A38805m0876k3161C0352P9102a059n2437A11756D7460N5699r389M2621B0062
5232I6909B5886N8300l9306L5093Nl2058J8742l1609j645q195M5565r490J26048
$$ plain form
5316 286417 146166 280031 264382 269741 276164 283463 193678 273411 293217 323626 146763 244919
5304 244919 330929 220685 355905 133911 71170 210161 197983 150932 262299 144529
5294 144529 130743 212307 149549 159097 173715 158521 82798 145798 48720 115470 246520 94608
5281 179970 203154 125149 -57025 215945 77208 151652 141940 128051 95191 46486 165989
5270 165989 54891 50662 16224 178876 143439 163056 126705 135502 112180 138417 201077 115138
5258 115138 90403 170965 88412 38512 99092 648 127456 124120 78088 159645 134772 83 138805
5245 138805 97929 74768 30352 109454 -1059 -53496 111756 47460 103159 93770 136391 20062
5232 96909 25886 84186 44880 79973 79978 47920 66662 35053 33408 25213 70778 61288 187336
5219A87336n048J7816G9837k8909O0503C7156O7569B9741J41919A5976O6923g7606
5206A20391D5089P1023p138j7206m604k5245L552B7706P8841d8396E930K1362
5194B7292J3952f3743D2208P9283m1343J8091C2341q666J11378d600I8762b9210
5181B1606c7730B0117L1859A7787c9054F3748A4353B6g7812E8226J8039h1024
5168E5749c7297D9851e4615o391o0094N0238A9049M8130h6987d0405e515D0956
5155a26426L8515K4908I4062b0028B6582L7494f0993G4474H672i5700L9543E6024
5142a23406j0001f3470D7599A8368O8236N5679C965Q734c0071A11056e2789m4363
5130i7152a8719q8046l4258a020m9987A9827K8311L3980a59048a3001n0376c0477
$$ plain form
5219 187336 182288 200104 79837 50928 111431 37156 104725 29741 171660 15976 82899 -77606
5206 120391 45089 116112 108974 91768 87164 61919 65471 27706 106547 -48396 5930 27292
5194 27292 41244 -63743 42208 121491 80148 98239 32341 23675 135053 -4600 98762 -29210
5181 21606 -37730 20117 51976 17787 -39054 63748 14353 26 -77812 58226 76265 -81024
5168 55749 -37297 49851 -54615 -61006 -121100 -70862 19049 67179 -86987 -40405 -5515 40956
5155 -126426 -87911 -63003 94062 -20028 26582 64076 -60993 74474 8672 -95700 -56157 56024
5142 -123406 -133407 -63470 47599 18368 86604 142283 3965 12699 -30071 111056 -52789 -97152
5130 -97152 -18719 -106765 -141023 -1020 -51007 19827 48138 82118 -159048 -13001 -63377 -30477
5117B8456O8082k8c5734C0651g110l9912A73951f9290c2363k7279K4005A26207
5104e6094b2699D6277J34465o1750D8583G626c2911D7260d9460R564a9042C7384
5091B1207L900d7410A54040D7118f1660H3174d1655h756A4722c9382M540r224
5079d4066A0898b922j354B3749j1388K4188j4236c3325d298p3432D398c0663l2723
5066f3386G523N1021b4640B6819d1242A38618b4439A6726J5495Q18A2676k296
5054A0380L0540O4521l4765l1371L0731Q704M2278c7956I2546M1017o0053N711
5042G9221l8336J87813A07276J0606L0525N4496C8416r964P4995J12905O161q8475
5030A34038K0092n6384P5449Q3182l3308r660j6016N9635m6839J29123A60423
$$ plain form
5117 28456 96538 96510 -35734 30651 -7110 -47022 173951 -69290 -32363 -59642 -35637 126207
5104 -56094 -22699 46277 180742 118992 48583 7626 -32911 47260 -49460 -39896 -19042 37384
5091 21207 25107 -47410 154040 47118 -61660 83174 -41655 -8756 14722 -39382 -34842 -44066
5079 -44066 10898 -2922 -4276 23749 12361 36549 22313 -33325 -4298 -77730 4398 -30663 -63386
5066 -63386 7523 58544 -24640 26819 -41242 138618 -24439 16726 32221 33039 12676 10380
5054 10380 40920 105441 70676 39305 70036 78740 121018 -37956 92546 133563 73510 79221
5042 79221 40885 228698 107276 117882 148407 202903 38416 28452 103447 216352 222513 134038
5030 134038 154130 97746 173195 256377 223069 213409 197393 257028 210189 339312 160423
5018C16331j0839j01867R0517L2777o0954m6316K993P9934m836J00686p3748K0730
5006C45408n4970O4592O2804L092K9620J3025k3214r3339R8925k6115k9034O051
4994C96845l1527J09199n2769p1395j4563L1813l8459m0024Q6213R0378m6273
4983D19438n4201O4970l4988n4227N0802q0530M1260l2075P8106K6906j85946
4972B39515J76396j5344j00315J7652M8434l2495J2516l0142l7351J51683o0643
4961C69906k3835q258m157O317p8633P7403m8724j364o7773L0347k1763k0833
4949B08633J09399l8734j30752K7136L1988o9332J26823n1467k9700O2676P732
4938B54402l2878j04267Q9800J02253q509A09913k3059P7806m1961K8305J23961
$$ plain form
5018 316331 305492 203625 294142 326919 265965 219649 222642 302576 297740 398426 324678 345408
5006 345408 290438 355030 417834 420926 450546 463571 440357 347018 445943 419828 390794 396845
4994 396845 365318 474517 421748 350353 335790 367603 329144 289120 375333 465711 419438
4983 419438 365237 430207 395219 340992 391794 311264 352524 320449 398555 425461 239515
4972 239515 415911 400567 300252 317904 366338 333843 346359 316217 278866 430549 369906
4961 369906 346071 337813 333656 339973 261340 338743 290019 288655 220882 251229 229466 208633
4949 208633 318032 279298 148546 175682 207670 138338 265161 213694 183994 246670 254402
4938 254402 221524 117257 207057 309310 300801 109913 86854 164660 122699 151004 274965
4927B74965n0308n2533F6149J03300H142Q9518G384J37534m8450K3150e0790I7834
4914A06753L1687E7012J19152I529C263L498O1086i963F1943J24013C1880J43777
4902A75657B9832Q6353n2437A178c7686A23644k6229K6200n8072j8709K7396C1644
4889i7508E5831K7677A5322P5070a0058m9953A9654a32732c2190l1341A02924
4877F6096J5830k1539B1382d3803F7907j7950A6585d0786B1233a58063a5982m1671
4865e7653Q86B9662a08343A49890a5894j13349N1336b3886D4806d9423A09779
4853e1563A43724E8478j5391M4137A7641Q4364f9600F2489j5982d0973A27038
4841I1618C7100d6537F7770A119L6154G316N099k172Q3755l8389a03106a1745
$$ plain form
4927 274965 224657 172124 66149 169449 8142 97660 7384 144918 96468 119618 -50790 97834
4914 106753 138440 57012 176164 9529 3263 6761 67847 -9963 61943 185956 31880 175657
4902 175657 29832 116185 63748 1178 -37686 123644 97415 123615 65543 46834 74230 31644
4889 -97508 55831 83508 15322 90392 -10058 -60011 19654 -132732 -32190 -63531 102924
4877 66096 81926 60387 21382 -43803 67907 49957 16585 -40786 21233 -158063 -15982 -57653
4865 -57653 -56767 29662 -108343 149890 -15894 -129243 -77907 -23886 44806 -49423 109779
4853 -51563 143724 58478 43087 87224 17641 102005 -69600 62489 46507 -40973 127038
4841 91618 37100 -46537 67770 1119 37273 7316 12415 10243 93998 55609 -103106 -11745
4828A02070J02238A00775D087M6701c9423A8155O0248d5163I1367A29a0281k30972
4816b41253C5141i404F2284g6273j27m1218f181B0693Q9810E3240f5551j1544
4804g7095A61897g8600A0189d214m1370g01l3764J6950G9267f0152D6284A1805
4791I280L7998K0279c6637A826L2427q885b3946F0101g7626E3693L5214l7730
4779E1177a1848B3245N4296f8744A69250D4961j8321O7135B1216L549J05261B6020
4766C1408f1407j4234A58115K291g0110E1379J3443R917B9217h030A04633d2805
4753H5996C1216L9026L6661L0718H840J7546K5315D936J9756J84710C4342Q495
4741D2837a4742A11323l2555j5078b1355F5179B5021J15755k7094A7373G647Q1978
$$ plain form
4828 102070 204308 100775 4087 50788 -39423 18155 78403 -45163 91367 129 -10281 -241253
4816 -241253 35141 -9404 62284 -76273 -76400 -117618 -6181 20693 110503 53240 -65551 -77095
4804 -77095 161897 -78600 10189 -4214 -45584 -701 -34465 -17515 79267 -60152 46284 11805
4791 9280 47278 67557 -36637 1826 34253 25368 -23946 60101 -77626 53693 88907 51177
4779 51177 -11848 23245 77541 -68744 169250 44961 26640 93775 21216 24765 130026 26020
4766 31408 -61407 -75641 158115 160406 -70110 51379 64822 74739 29217 -8030 104633 -42805
4753 85996 31216 70242 106903 137621 8840 26386 51701 4936 24692 209402 34342 42837
4741 42837 -14742 111323 78768 63690 -21355 65179 25021 140776 113682 17373 7647 89625
4729H9625k4717h3351b9888A1160L8630J0435K1850J01969p6665J3895b92A06538
4716A20656C0521K1202O2443k7821m2250Q7122E0870N0301c0897I869R1052N1197
4704A52118K4473g4042A55609C7884K0610n702a4573A56199m8958C7624J82227
4693B19851I6230J6840l1674O2692l3868k3881B1242J33718j0964l5767j4757
4682I3472L6550k6084A2016J33733j8336K614o3748J54821C8240N9101M4405J087
4670A42833l3976P8729p1525B4310J19546K4803J22420E7750c3103A75864J32367
4659C08231j13227l9841G7378P2043K1054n2550D0976K7519O2790q734B9665J02629
4647A32294Q8304J4591D8920J62008r3063R1685l0583K5464o4345M9231l231J1224
$$ plain form
4729 89625 64908 -83351 -29888 11160 49790 60225 82075 184044 107379 121274 -292 106538
4716 120656 30521 51723 114166 86345 44095 131217 50870 101171 -30897 9869 100921 152118
4704 152118 176591 -74042 155609 37884 58494 52792 -14573 156199 107241 37624 219851
4693 219851 96230 113070 81396 144088 110220 86339 21242 154960 143996 108229 93472
4682 93472 130022 103938 12016 145749 127413 130027 66279 221100 38240 97341 141746 142833
4670 142833 108857 187586 116061 24310 143856 168659 291079 57750 -33103 175864 308231
4659 308231 195004 155163 77378 149421 170475 117925 40976 68495 131285 122551 29665 132294
4647 132294 220598 235189 48920 210928 117865 209550 178967 204431 140086 189317 186086 197310
4635A97310D7818J10603j7560K4148l7709o847J7148K0178j719G2117L1005R0300
4623A93422K3855j05699K3781N0078j7499k7755J1492D3348J7379R4320o9048
4612H5999M9233N0404a3652D5632j6885Q6661f2838A34291F145N5967M2993K1140
4600A26245P161R8559D4967P9823J04006j11068K5017E194K25889A2278P7640
4589H9918B3262N5426J32639H7170O8461B0963K3296J56287a1551A74486l0027
4578A44459m4626D4246o005Q1864Q6647E2336L0747C0235I569A542J90957E7373
4565F5548O3409j9664n1422J9379C5544K8320Q3381b0057A72564E9607j3663J16870
4553A62814G9497R2371m1246l8054c6131j9042F292J0954R6022m0500l908K9008
$$ plain form
4635 197310 47818 158421 140861 165009 127300 120453 137601 157779 156060 72117 103122 193422
4623 193422 217277 111578 135359 185437 167938 140183 151675 43348 60727 155047 85999
4612 85999 135232 185636 -13652 45632 28747 115408 -62838 134291 6145 62112 105105 126245
4600 126245 133406 231965 44967 124790 228796 117728 142745 5194 231083 12278 89918
4589 89918 23262 78688 211327 87170 155631 20963 44259 200546 -11551 174486 144459
4578 144459 99833 44246 38241 120105 206752 52336 83083 30235 9569 1542 192499 57373
4565 65548 128957 109293 57871 77250 35544 63864 147245 -20057 172564 59607 45944 162814
4553 162814 79497 171868 130622 92568 -36131 -55173 6292 17246 113268 72768 68860 97868
4541I7868B6016K9117O7300l0933l4744k4000A1339Q8760O5969k336B1459M9653
4529G1112J4595M1564g7051J2157a7602p6015I2338C9001Q8158B4031J1516j1289
4517B4258J35028p7316K8112B1253J59475F8021e2010A3049N5248B6916e2092
4505I8754c3957A42204o0996B1805J2695J5289j9818P0051C288f5322D2690k805
4493C9885A7914L8368A2570R1071j0559B1144a6237J703B6336N0261F138M3236
4481D9374l878g9955a1369H7688a70750A15161j9107k6819b4623B0752M1804R1605
4469A54161n9352B8438J19908D0903O973Q1506A6820M6121L5165A2564M4851J8557
4457G5972g5952J1776A17281m4531N9466D1679O9461k3093p132N3584L591C0147
$$ plain form
4541 97868 26016 55133 122433 91500 56756 32756 11339 100099 166068 163732 21459 71112
4529 71112 85707 127271 -77051 -64894 -17602 -93617 92338 39001 127159 24031 35547 24258
4517 24258 159286 81970 110082 21253 180728 68021 -52010 13049 68297 26916 -52092
4505 98754 -33957 142204 81208 21805 34500 49789 29971 100022 3288 -65322 42690 39885
4493 39885 17914 56282 12570 103641 93082 21144 -16237 -14534 26336 76597 6138 49374
4481 49374 45496 -79955 -11369 87688 -170750 115161 96054 69235 -24623 20752 62556 154161
4469 154161 94809 28438 148346 40903 47876 129382 16820 62941 98106 12564 57415 75972
4457 75972 -75952 -64176 117281 72750 132216 41679 111140 88047 80915 134499 138090 30147
4444I7823D732L2150k048P1750b6715F7544j8786j583j9097J32950F0000B8831
4431A07042b7073A4951N9875N6679J0962E911Q2328b101n022E1702a18457A92393
4418I2439l3282M7155d6506B4903c719B7504f0177B7379J02888o3065B1958Q4647
4406A06605B8081L7816r215j5971g2519B6922b3912H3608d1270c297j8174n5934
4394g7405A2228A384K1329m741D117K518J2401g0490b0686l9779G4478b023A716
4380C3182Q5505a52195M80M8644B915e7987A3378Q5343D4912J2631a13038N5275
4368e7763A3799l843O0527a68708e3696n5993B0675e473n2341A4631f7959F8622
4355B1564R3156c9426A02178b333j4743o1853K3738F8338l1453d0234G419c2566
$$ plain form
4444 97823 4732 36882 34834 106584 -26715 67544 48758 47175 28078 161028 60000 28831
4431 107042 -27073 14951 74826 131505 142467 5911 88239 -2101 -7123 51702 -118457 192393
4418 92439 59157 106312 -46506 24903 -3719 27504 -60177 27379 130267 67202 21958 106605
4406 106605 28081 65897 56682 40711 -72519 26922 -23912 83608 -41270 -3297 -21471 -77405
4394 -77405 12228 1384 22713 17972 4117 6635 19036 -70490 -20686 -60465 74478 -2023 1716
4380 33182 118687 -152195 -151715 -103071 2915 -57987 13378 98721 44912 57543 -113038 -57763
4368 -57763 13799 9956 70483 -168708 -53696 -109689 20675 -5473 -57814 14631 -67959 68622
4355 21564 114720 -39426 102178 -2333 -17076 -78929 -55191 68338 36885 -40234 7419 -32566
4342C9019J2255h9113L928J476F6938b37127G8452g9439I696i029m7843B2237
4329a5656E815a13398e6632j31137f7386k6390d3550k2820b2273r211n8921n230
4317i5635b0612F7102i0445M416a0927A9881b12816E1749J1212a23349a1234k231
4305a3465o3267B6130g7748C442M4165O23f4595J1574Q545A8978m372e9144k2064
4292h1208J7470m1370A04354p617k9870a46017g2475I3099e8357j9633k8105a9132
4279d1782K480F6234j5726h3335b4793j6007N813E5717E567i865F0010k1484c38
4265b6901D465b0203A8863a6045K533j156j1029D4311f0456b2400m8415k6944
4253i7759b9906A8785g5228A3439e0602F5460a19339N2092D1681i4772c1085o5235
$$ plain form
4342 39019 51274 -89113 -85185 -83709 66938 -237127 78452 -79439 9696 -9029 -56872 22237
4329 -15656 5815 -113398 -56632 -187769 -67386 -93776 -43550 -66370 -22273 -31484 -90405 -95635
4317 -95635 -20612 67102 -90445 -86029 -10927 19881 -212816 51749 62961 -123349 -11234 -13465
4305 -13465 -76732 26130 -77748 3442 47607 48230 -64595 -53021 -44476 18978 14606 -59144 -81208
4292 -81208 -63738 -105108 104354 96737 66867 -146017 -72475 93099 -58357 -77990 -106095 -19132
4279 -41782 -39302 66234 50508 -83335 -24793 -40800 -34987 55717 5567 -9865 60010 38526 -338
4265 -26901 4465 -20203 18863 -16045 -13512 -14668 -25697 44311 -60456 -22400 -70815 -97759
4253 -97759 -29906 18785 -75228 13439 -50602 65460 -119339 -67247 41681 -94772 -31085 -96320
4241i6320a539q5101D9458a00349d1863n4072I4736a30230l8604A21741f8779
4229a6631A2516J5199g7044m5090I6178g5885E8436K3989C3964f8269m855B4521
4216F7494c9980A14937g6821M528h532E535f2030q2625m4173I0447a55759l11
4204a56070D5156b1026E7141b7667e497r785G0583c6039J6339k9196b4171j4303
4192c8474J518p3376m823H3255l2256Q058O78L0038B5778O4695D988R8943h197
4178b1330n592B2432Q4457l8421J9060i01k8468m4398C5652i839l3528G4738b4373
4164E8789a36846O8094D9380g0554H045a5139F5420N5451n1461p381B9102A892
4151A79035F398Q9909Q4942J67906M3125k0366n7709A07455A3621L2210J00587
$$ plain form
4241 -96320 -1539 -86640 49458 -100349 -41863 -95935 94736 -130230 -168834 121741 -68779
4229 -16631 12516 27715 -77044 -122134 96178 -75885 58436 82425 33964 -68269 -73124 24521
4216 67494 -39980 114937 -76821 -72293 -8532 5535 -62030 -144655 -188828 90447 -155759 -156070
4204 -156070 45156 -21026 57141 -27667 -5497 -15282 70583 -36039 -19700 -48896 -24171 -38474
4192 -38474 -36956 -110332 -115155 83255 50999 59057 59735 89773 25778 90473 4988 103931 -8197
4178 -21330 -26922 22432 106889 68468 87528 -901 -29369 -73767 35652 -9839 -43367 74738 -24373
4164 58789 -136846 -68752 49380 -70554 8045 -15139 65420 120871 69410 62029 29102 1892
4151 179035 6398 96307 181249 349155 392280 371914 314205 107455 13621 45831 146418
4140A46418F6718a10098M1230b7487C8024d2765P753I6288J4150B5761J00417
4129A26178R4691J08670J51486j46230p7510D6766L6736M4299m396i455j0085
4118a9540l3431E5155b6920D0301A8757Q8089B3437P4881e0949p7811E6103A1281
4105C1327R7021k2228e2867B1436J26476k4755F0087J0993J1935j2985d9333G8509
4092G4704n824N9972j6313N7636E6678Q5943G407J26613j3771q570J2554D3243
4079A16828R1065L8862p1199L5814o023J7520n8404O1033p6575p571P6957o3308
4067A54999N2794J9666o4637M2911P0658j6808n9808n0692R9988m4728M4846J686
4055B50875J18005n4259N5613Q2288m8596K3546J5513J90359O3334J01994p5490
$$ plain form
4140 146418 66718 -110098 -68868 -27487 38024 -42765 -35012 96288 110438 25761 126178
4129 126178 220869 329539 481025 334795 257285 46766 83502 127801 123405 -9455 -19540
4118 -19540 -52971 55155 -26920 40301 18757 106846 23437 98318 -50949 -128760 56103 11281
4105 31327 128348 106120 -52867 21436 147912 123157 60087 71080 83015 70030 -49333 78509
4092 74704 68880 128852 112539 170175 56678 142621 7407 134020 120249 111679 124233 43243
4079 116828 207893 246755 175556 211370 205347 222867 164463 225496 148921 141350 218307 154999
4067 154999 207793 227459 162822 205733 276391 259583 199775 149083 249071 204343 249189 250875
4055 250875 368880 314621 370234 452522 403926 427472 442985 633344 696678 798672 723182
4044G23182p445K8811r0827L1335j85423j83427k5080Q9424k6436j02133L8088
4033B90069L4512I8317O050J4443M034E2538L6610C0709K5746c3071e697K299
4021c398J274A26174b7120F0328A7175o071c4695C9749a9207A30087H808K7894
4009C6702J6695a28494a405o8767A0808b1399m103q5423a4630F5614O66e1000
3996g1141n3802B1994O0557h9061b9430g434p6429I1850g357k2510p7604M2912
3984f4559n1633D2474J2467a00592F2872J6696a74439d0746D0119g3086E309e6049
3971b4033p6520a788G1541l656R0654N6579J20865q342A36362B5332f0090l4106
3959i4196J8236J1041A01485L4497o4748a4148n4820A2383c9067D8115P6583Q9301
$$ plain form
4044 723182 715737 744548 653721 685056 499633 316206 291126 380550 354114 251981 290069
4033 290069 324581 98317 104367 118810 122844 52538 89148 30709 56455 -33071 -5697 -3398
4021 -3398 -2124 126174 -27120 60328 17175 11104 -34695 39749 -19207 130087 8808 36702
4009 36702 53397 -128494 -1405 -70172 10808 -21399 -25502 -110925 -14630 65614 66280 -51000
3996 -71141 -124943 21994 82551 -89061 -29430 -7434 -83863 91850 -7357 -29867 -107471 -64559
3984 -64559 -116192 42474 54941 -100592 62872 79568 -174439 -40746 40119 -73086 5309 -56049
3971 -24033 -100553 -1788 71541 67885 158539 215118 335983 327641 136362 25332 -60090 -94196
3959 -94196 -75960 -64919 101485 135982 71234 -14148 -68968 12383 -39067 48115 124698 213999
3947B13999J52020k2874j36070j03470A6233d9863r4189H0061E762a33012b6589
3935E1876A4574M9558L3940a8228F7874J02854m5115b1975a0131o6618d333p2541
3923g6874b7558J02a2319k4130E4024f3394b8704m5704A8044J00344B7295K5695
3911E2990N2127k1629b2196k1663l8988A22f2267B9073J7313b1691C579d7805
3898a0998A5375a38514c8312q7165J2154D0936h3299F4233f1141m3254K6142K6578
3886e1675F093h5860o1736g3534Q913C6708b8600o6199J5964a7065D1461d5569
3873a58545G0509c0200a3099r3846C7075P953e864j35425a4135q010o706a1852
3860A9025b4094F9156B4815f8679L0482M696A9189b2975q0055b1871h061H2694
$$ plain form
3947 213999 366019 343145 207075 103605 16233 -49863 -144052 80061 5762 -133012 -26589
3935 51876 14574 64132 98072 -18228 67874 170728 125613 -21975 -10131 -76749 -4333 -76874
3923 -76874 -27558 -27456 -12319 -36449 54024 -63394 -28704 -74408 18044 118388 27295 52990
3911 52990 105117 83488 -22196 -43859 -82847 122 -62267 29073 46386 -21691 3579 -47805
3898 -10998 15375 -138514 -38312 -125477 -113323 40936 -83299 64233 -61141 -104395 -78253 -51675
3886 -51675 6093 -85860 -147596 -73534 -64621 36708 -28600 -94799 -78835 -17065 41461 -45569
3873 -158545 70509 -30200 -13099 -106945 37075 45028 -5864 -141289 -14135 -22145 -28851 -11852
3860 19025 -24094 69156 24815 -68679 -38197 -33501 19189 -22975 -103030 -21871 -8061 82694
3847f6910B515K3941b25348h6670K899D0826Q1396a75230L6554K6569c1373l3142
3835f4515A03535m1906a49118f9129m7335c0192C1923M5366i0475n821b9074k4616
3823e3690m5611M2008j0567j0316D678M4013C62b4971l2863J276K7963m2899B4758
3809d6567G0783b0449l729k0990q264B2616f8234r360E5680a2623l752r6540c9266
3795g5433b0357k4259m4261F311a639j06257L6497K3373r8278G978k373a9118
3782f5826J4070J1179F6310C705L9296a62687d1131a4435E5935a4927j14417M5040
3770h4304M0466Q394m9451b8671I3014d1328n2408b7937A1742c9136k6509e711
3757a24771d1507D3904c1298o7362E350c4008J0471I7296C882a02780a7033r0935
$$ plain form
3847 -66910 2515 26456 -225348 -86670 -83771 40826 122222 -175230 -138676 -112107 -31373 -64515
3835 -64515 103535 61629 -149118 -69129 -116464 -30192 31923 77289 -90475 -96296 -29074 -53690
3823 -53690 -99301 -57293 -67860 -78176 4678 48691 362 -24971 -57834 -56558 -28595 -71494 24758
3809 -46567 70783 -20449 -24178 -45168 -53432 22616 -68234 -77594 55680 -12623 -16375 -112915 -39266
3795 -75433 -20357 -44616 -88877 6311 -1639 -107896 -71399 -48026 -146304 7978 5605 -19118
3782 -65826 -51756 -40577 66310 3705 43001 -162687 -41131 -14435 55935 -14927 -129344 -84304
3770 -84304 -43838 -35444 -84895 -28671 93014 -41328 -93736 -27937 11742 -39136 -65645 -5711
3757 -124771 -41507 43904 -31298 -98660 5350 -34008 -23537 97296 3882 -102780 -17033 -107968
3745a07968q9406c6194f565j18242C8404d7360F3378a9010o5389k088r517b2580
3732c9538j6372F1272h5829m0453d6645D209M6239G201h8889b9538l0004k2261
3720h1803E1150c0031o4768b9844q5919a110j56223a0237k4584C4464K7205a47948
3707g9438K1076F3874c2988A3516d5034J8279k2574C6489a4478l8709a147C0262
3694a55669L2229c1049a3829r5328d8207q5606E6220a4879j3000A9870f9049h009
3681e3829F2683E558a2932l3262k4709k371n9504d8659r991H9419a17283c0698
3668g4947c5155A0792O4024e9734K1872j4237m0166L5851k3983c6633H8162l4785
3656E3377b8455q3650d9633a7758K091q155E3890j3095a17552F9110a03595c7293
$$ plain form
3745 -107968 -197374 -36194 -6565 -124807 38404 -47360 63378 -19010 -84399 -86487 -96004 -22580
3732 -39538 -55910 61272 -85829 -126282 -46645 4209 50448 7201 -88889 -29538 -59542 -81803
3720 -81803 51150 -30031 -94799 -29844 -115763 -1110 -157333 -10237 -34821 34464 61669 -147948
3707 -79438 -58362 63874 -32988 13516 -45034 -26755 -49329 36489 -14478 -53187 -1147 30262
3694 -155669 -123440 -31049 -13829 -109157 -48207 -133813 56220 -14879 -27879 19870 -69049 -8009
3681 -53829 62683 5558 -12932 -46194 -70903 -73274 -132778 -48659 -58650 89419 -117283 -30698
3668 -74947 -35155 10792 74816 -59734 -37862 -52099 -92265 -56414 -80397 -36633 88162 53377
3656 53377 -28455 -112105 -49633 -17758 -15667 -23822 53890 40795 -117552 69110 -103595 -37293
3643b7117J261h078j1858i189o5286a0602G0936j6052J6086J684f0853b6440l5350
3630f1790J9789A7483i2534D3255a0995k9674b357m4575j16773O9384B2775c1802
3617F9868d6112l931k9568D7620b5896D6469B474d1277A2036f5352h695C579q5
3604C494d532I974J27717D8798a3483A1556g0959A4956M3465k3416J6911j7247
3592C4669f4522A62878b6510C164J85213A6195R8762p632M141P5887o0731o102
3580A20520J20364m2250D0962Q3783d2898g964H3593C7196a1169E712kc4075j7560
3567e1635I7458j4311l0900k1678A4376n050M040P4761a48199j259D8810a3022
3554B3344N1840a3634A4988a00953C9342g9428a6484k7515Q307J2251B5821a7463
$$ plain form
3643 -27117 -25856 -8078 -19936 -9189 -74475 -10602 70936 54884 70970 72654 -60853 -26440 -61790
3630 -61790 -42001 17483 -92534 43255 -10995 -40669 -2357 -46932 -163705 -94321 22775 -31802
3617 69868 -46112 -50043 -79611 47620 -25896 46469 2474 -41277 12036 -65352 -8695 3579 3494
3604 3494 -4532 9974 137691 48798 -13483 11556 -70959 14956 58421 35005 51916 34669
3592 34669 -64522 162878 -26510 3164 188377 16195 114957 107325 111466 187353 126622 120520
3580 120520 240884 198634 40962 124745 -42898 -7964 83593 37196 -11169 5712 5710 -34075 -51635
3567 -51635 97458 83147 52247 30569 14376 9326 13366 88127 -148199 -149458 48810 -13022
3554 23344 75184 -13634 14988 -100953 39342 -79428 -16484 -43999 -35692 -23441 25821 -17463
3541E8735B4938b2100O715k39A36941b8218E958b7078n9552A16605a12521N2601
3529e9920o6064e6377B98a3363o0038k8671D0982a3703G8802g828p4427B5212
3516b345p0636j8752n9614a2152B1112P6347e2163P242D9c8594J0123r0413L6473
3503h2411K3303j00391b2287q1728M4759o6627e8878D1759i7388n077J3844G8229
3490G4321C901L0412e4797n684r527a6175C6617b4706n1990a1630o8103E800J9086
3477B4886g5661A3305a3149l9315C1043N642g0079n296D1969d0380p0840K2667
3465h8553j019M1824e395k4193n0691a2399n0428L0670f591m8427m2943D7831
3452g0146B8214d8980E5318k7073e6135j10204g7633L6566H2017d3653a5222p5779
$$ plain form
3541 58735 24938 -22100 -15385 -15624 136941 -28218 5958 -27078 -86630 116605 -112521 -59920
3529 -59920 -125984 -56377 298 -13363 -73401 -102072 40982 -13703 78802 -7828 -82255 25212
3516 -2345 -72981 -91733 -151347 -12152 21112 97459 -52163 -44921 49 -38594 -28471 -118884 -82411
3503 -82411 -59108 -159499 -22287 -104015 -59256 -125883 -58878 41759 -97388 -102465 -88621 78229
3490 74321 3901 34313 -54797 -60481 -70008 -16175 36617 -24706 -76696 -11630 -79733 5800 24886
3477 24886 -75661 13305 -13149 -52464 31043 36685 -70079 -75375 41969 -40380 -111220 -88553
3465 -88553 -89572 -47748 -5395 -29588 -80279 -12399 -62827 -32157 -6591 -55018 -97961 47831
3452 -70146 28214 -48980 55318 28245 -56135 -166339 -77633 -41067 82017 -43653 -15222 -91001
3440i1001F0650a0697j29292b2864J0530k0452F9983e8836F490C15K3586a12452
3427A7828f1526E7445A3569M7136f0139H5109d1423b482A9523O4657K172c6914
3414g1997a4920l8618C6976c6193A5303b10291R1791b3310j05475N4248L0225
3403d4312F9914i397k9329H2301f8934l4433a7215d568E68g0408o5152B7993a31687
3389b9793C3133a9248J066n9351H252f6625j1050B7074g2594b9458j0426n039
3377d4923C1325a22511A8959f4571G5744i0083D8010c9913I0328c2195J4575k7538
3365d5158F8871k2849a00557b4373j12550O4751A4948n648a43576E2616a7479
3353d0414q0156D5159e2558B2823c1349o865G8079h4774d322q6027M3717F6265
$$ plain form
3440 -91001 60650 -10697 -139989 -22864 -12334 -32786 69983 -58836 6490 315 23901 -112452
3427 17828 -61526 57445 13569 60705 -60139 85109 -41423 -2482 19523 84180 86352 -36914
3414 -71997 -14920 -53538 36976 -36193 15303 -210291 -118500 -23310 -128785 -74537 -44312
3403 -44312 69914 -9397 -38726 82301 -68934 -103367 -17215 -4568 568 -70408 -135560 27993 -131687
3389 -29793 33133 -19248 -18182 -77533 8252 -66625 -77675 27074 -72594 -29458 -39884 -44923
3377 -44923 31325 -122511 18959 -64571 75744 -90083 48010 -39913 90328 -32195 -17620 -45158
3365 -45158 68871 46022 -100557 -24373 -136923 -72172 14948 9300 -143576 52616 -17479
3353 -40414 -120570 45159 -52558 22823 -31349 -38214 78079 -84774 -4322 -90349 -46632 66265
3340e7962R287A02054i6627B3002b0317A4526e6140j01200a7793o2124E8826b7506
3327e4673D7753B0307b2448D0210h0585o3567A00093l1476h6156K8865E1521I733
3314d2011J6380j62790Q4468N241J1559D6348C946Q4534e8918K4787A1761b63887
3301I1048D1124A1243B758f8368c245H0818a1510p5132p8218L1415c0891p807
3289c8698I001b134l3793r7705d757A1413e4174D603J04223d621j3547E1143L1192
3276H2335l8902A6160i3294n2305F2673a22201M1555B359e767q0832J3135k1877
3264i5341L4199R332b1600m2698L800l1447b3016o5282p6817L6574I8753k7449
3252G1304C3529F514K0775b9126E220a23928G9579A7544l193d3761A76458c7712
$$ plain form
3340 -57962 -48675 102054 -96627 23002 -20317 14526 -56140 -157340 -17793 -79917 58826 -27506
3327 -54673 47753 20307 -22448 40210 -80585 -144152 100093 68617 -86156 -57291 51521 9733
3314 -42011 -25631 -188421 -103953 -98712 -87153 46348 3946 88480 -58918 -34131 11761 -263887
3301 91048 41124 11243 2758 -68368 -3245 80818 -11510 -86642 -164860 -133445 -30891 -38698
3289 -38698 9001 -2134 -35927 -133632 -4757 11413 -54174 4603 108826 -4621 -18168 51143 82335
3276 82335 43433 16160 -93294 -145599 62673 -122201 -80646 2359 -5767 -86599 -73464 -95341
3264 -95341 -61142 -51810 -21600 -64298 -60498 -91945 -23016 -88298 -165115 -128541 98753 71304
3252 71304 33529 6514 27289 -29126 5220 -123928 79579 17544 14351 -43761 176458 -37712
3239F9596e1982E418g3640a3461p9888L8264J7672A5025a43150F7627k5659h0042
3226e221D2462a16607L3044j4883E7708a83570D3477L3567j0657E488J54485C8208
3213f5991e873j14016e5175J9001m850O401r581o7576F6581a4606n9993M277k3192
3200i3514B534b1076j28718b3048j35395E7776c4025o2850d2512f634o8425K4613
3188e0446E5273f725A16634h0800j7902e395j30841C9647a2589q522G167d4405
3175a43691d0947J0879m4125J901L1699C7565a2526m8880C224f7043H1121h2713
3162f4090Q797a1833b526I029f8669J1109a1121j02533E5736e8556K7345q609
3150c9820J5666K409j1903l2774A6651f4283j30376h5557L0697A14114f7822c570
$$ plain form
3239 69596 -51982 5418 -73640 -13461 -93349 -55085 -37413 15025 -143150 67627 41968 -80042
3226 -5221 42462 -116607 -83563 -98446 57708 -183570 43477 77044 66387 5488 159973 38208
3213 -65991 -5873 -119889 -55175 -36174 -41024 -34623 -44204 -111780 66581 -14606 -74599 -70322 -93514
3200 -93514 2534 -21076 -149794 -23048 -158443 57776 -34025 -96875 -42512 -6634 -75059 -50446
3188 -50446 55273 -6725 116634 -80800 -98702 -5395 -136236 39647 -12589 -21111 7167 -44405
3175 -143691 -40947 -30068 -74193 -72292 -40593 37565 -12526 -61406 3224 -67043 81121 -82713
3162 -64090 -55293 -11833 -2526 9029 -68669 -57560 -11121 -113654 55736 -58556 -31211 -39820
3150 -39820 -24154 -21745 -33648 -66422 16651 -64283 -194659 -85557 -54860 114114 -67822 -3570
3137g1307C5773a61765d5155N070D0841b7406o9811l286A07464B7297f6751l2086
3125i8837J9032c1750A31667e0220P11q052b5217q6381G9054c1153A03416B2863
3112D6359A2871h016m144p8230A01788B6990a76716h567k7021B1022a06163j7454
3100a23617b7770m893A4120a66880G1815g1313R622p5442N7557c3753j6488p7281
3088a27522B5406C414h6649C3706J90465B9450e080A16292k0844b6611l2334G0971
3075c6392D5408k0498a8289j9242p387m3991E8324d6886B3070a50756N5448M5779
3063d9529l2129E1016h0629K4241K3658G9070h7831a6458o0667A03016f8435j1618
3051h0053H8189C3104L8269c1857A04436A8641d2285m5663L7491o5311A5104O3119
$$ plain form
3137 -71307 35773 -161765 -45155 -40085 40841 -27406 -97217 -100503 107464 27297 -66751 -98837
3125 -98837 -79805 -31750 131667 -50220 -49509 -57561 -25217 -111598 79054 -31153 103416 22863
3112 46359 12871 -8016 -12160 -90390 101788 26990 -176716 -8567 -35588 21022 -106163 -123617
3100 -123617 -27770 -32663 14120 -166880 71815 -71313 -61691 -137133 -79576 -33753 -50241 -127522
3088 -127522 25406 3414 -86649 33706 224171 29450 -5080 116292 95448 -26611 -58945 70971
3075 -36392 45408 24910 -18289 -37531 -44918 -88909 58324 -46886 23070 -150756 -95308 -49529
3063 -49529 -81658 51016 -80629 -56388 -32730 79070 -87831 -16458 -77125 103016 -68435 -80053
3051 -80053 88189 33104 71373 -31857 104436 18641 -42285 -87948 -50457 -115768 15104 78223
3039G8223g5131J9364L364p1712K7937g714B2438a5946l4273b1647k818H391e6677
3025c887j35013O2359b9455j6701L713B4825f4398b6433D4744d7609A5782J6182
3013C1964c7435j09958B6626b5814H8848g7047K7194B5008d2285j3334b3015m8317
3001g1332B4179L6216i0297M1510D342b9165C0787P81c7377j02298C4753f4949
2988a40855C7821e1809b5552A045M2797d0344G5597b5010C4835K5404k6620L5506
2976F9125k7685R5983d3671f026p3758K1245b5859P838G9987b9877r254n763p8258
2963a23152C4678f4073C4544a12762N236I8336i1372K1069m3415b4472J0013n6755
2951g1214K2918D392e4279a1700o3340B2169d0514E7110A2791b8811B1175j508
$$ plain form
3039 78223 -75131 -55767 -52403 -124115 -96178 -7714 22438 -15946 -50219 -21647 -24465 8391 -56677
3025 -3887 -138900 -76541 -29455 -46156 -42443 24825 -64398 -26433 44744 -47609 15782 31964
3013 31964 -37435 -147393 26626 -25814 88848 -77047 -49853 25008 -42285 -55619 -23015 -71332
3001 -71332 24179 60395 -90297 -48787 4342 -29165 30787 31568 -37377 -139675 34753 -64949
2988 -140855 37821 -51809 -25552 1045 43842 -40344 75597 -25010 34835 60239 33619 69125
2976 69125 41440 137423 -43671 -6026 -79784 -58539 -25859 -18021 79987 -29877 -39131 -44894 -123152
2963 -123152 34678 -64073 34544 -112762 -107526 98336 -91372 -70303 -113718 -24472 -14459 -71214
2951 -71214 -48296 4392 -54279 -11700 -75040 22169 -40514 57110 12791 -28811 21175 19667
2939A9667K3702M5134j2914a27296M5416D1275K7080i212j13659p87N489F79N2589
2926E3268B3382a26455J677c9309a5355j30063G9534A5136a06008B3052i6128
2914f3582C0599g5985o0507A100h8604p4268C7959P1271b9869G1592O392g828
2901a39009j9568a7936n0273C4513a1326N179l0524j00994M3074J4849B2807h204
2888e4633L403A0154c5252D7461g0759k5510G3a33044A5553M7173e6725j1060
2876f7785D6538f4013b1797m2099k508a8100I3509m6615a6529B4461I238a15011
2863F3402a34550c2982E5688a08601L5371n8210M7933b8572D5531h8286K5818
2852f2468k9848b8040E994K2941D782K2145G594f8409l5791a0495g20j39447a6128
$$ plain form
2939 19667 43369 88503 75589 -127296 -81880 41275 68355 -9212 -122871 -123658 -118169 679 53268
2926 53268 23382 -126455 -124778 -39309 -15355 -145418 79534 15136 -106008 23052 -96128
2914 -63582 30599 -75985 -136492 1100 -88604 -162872 37959 109230 -29869 71592 77984 -7828
2901 -139009 -158577 -17936 -68209 34513 -11326 -6147 -36671 -137665 -94591 -79742 22807 -8204
2888 -54633 -51230 10154 -35252 47461 -70759 -96269 73 -133044 15553 62726 -56725 -67785
2876 -67785 46538 -64013 -21797 -63896 -66404 -18100 93509 46894 -16529 24461 9238 -115011
2863 63402 -134550 -32982 55688 -108601 -73230 -131440 -83507 -28572 45531 -88286 -62468
2852 -62468 -92316 -28040 5994 28935 4782 26927 7594 -68409 -104200 -10495 -720 -140167 -16128
2838h3860b3174k9656k3614c4018P317m0025F10J4467h317l2304R602j2446j08560
2825a52025D5490i4102A0371b5077J0160j1855o9397E5177f8257A57528c8469
2813e0696b0271o0180b5462P730D3823c6945E871c4192p3184B385b6630E0650
2800d182k1488m9123j0578K423D9790b0141o0141D5170c5193H264J52890a46770
2787i2510F5174a7417d622C6811a30923F3822l0646a9216n8989J4001K4026C2001
2774A821J12244A4063J39745B7079c9852A5009P0415A9408c0293C2932M2816d0198
2761a3559l1279a6475j30672H4810C7345M204d4545D464e4574E844a38217b7435
2748d410F2901h3641a8363q1869k177D1638J6173c8614I560J133f4677o8007m525
$$ plain form
2838 -83860 -23174 -52830 -76444 -34018 -26701 -66726 610 15077 -8317 -40621 -31019 -43465 -152025
2825 -152025 45490 -94102 10371 -25077 -14917 -26772 -96169 55177 -68257 157528 -38469
2813 -50696 -20271 -80451 -25462 -17732 43823 -36945 5871 -34192 -107376 2385 -26630 50650
2800 -4182 -25670 -74793 -85371 -82948 49790 -20141 -80282 45170 -35193 8264 161154 -146770
2787 -92510 65174 -17417 -4622 36811 -130923 63822 33176 -19216 -78205 -64204 -40178 32001
2774 1821 114065 14063 153808 27079 -39852 15009 85424 19408 -30293 32932 75748 -40198
2761 -13559 -44838 -16475 -147147 84810 37345 41549 -44545 4464 -54574 5844 -138217 -27435
2748 -4410 62901 -83641 -18363 -100232 -102409 41638 57811 -38614 9560 10693 -64677 -132684 -137209
2735a37209N6740A2496h052C0798J6298c7863a2884F3285e7305D7471c4305F2645
2722b2716D9067a0186k9338n6674I233e4020J7890p0739A5115g6108R014G1271
2709H1102C3199e7167I4887b3381C5774J7654h5442K9008q1629E8595a2780q711
2697b1491l1128B1899g45m6675A2213F23R6921d7100o0257c4421R234p203j13084
2684a45474I2411l3711d7430B6553a25942C6608h6052K8305D1992A139h0792J670
2672g9122B4606N8764h3151c7900D4942c3813m875Q421k05770C6143d6252g999
2659B1427P5833d9338a6n7862B0920c730l7562r721A0410a1028r6689D098J00842
2646A04940a8842h210A6981c2818j152A50179F2729d4913D9570f6295L754C1776
$$ plain form
2735 -137209 -80469 12496 -8052 30798 47096 -37863 -12884 63285 -57305 47471 -34305 62645
2722 -22716 49067 -10186 -39524 -96198 9233 -54020 -36130 -106869 15115 -76108 -67094 71271
2709 81102 33199 -57167 94887 -23381 35774 53428 -85442 -56434 -138063 58595 -12780 -21491
2697 -21491 -52619 21899 -745 -47420 12213 623 97544 -47100 -107357 -34421 -25187 -32390 -145474
2684 -145474 92411 58700 -47430 26553 -125942 36608 -86052 -57747 41992 1139 -80792 -79122
2672 -79122 24606 83370 -83151 -37900 44942 -33813 -38688 -30267 -236037 36143 -46252 -7999
2659 21427 97260 -49338 -16 -57878 20920 -3730 -41292 -51013 10410 -11028 -107717 4098 104940
2646 104940 -18842 -8210 16981 -32818 -33970 150179 62729 -44913 49570 -66295 -62541 31776
2633h7126J060A18039n2532h1918i575m9732j2395M527I14b0451E264j075P0199
2620G4388b8329J2518I129a08243K9870j8938D2028A3719K0475R902B982b1520
2607C3104N0456K7177M751D4718c4069I1813a7994I51J18483i9103F406g5628
2594a02493c281n294r0819A08529h4633k3437E5657d8957J1302A17407E1160a69394
2581d6658D7435h0973E904L5686g4310D6834a03668e1464F5061k1682j4821A3658
2568a9193F4050h0839B3591L90g6585K1700J5656m0238a7322k0897F8701f4497
2555A08155a08993D772a02060K5078b0352r9604K8444I2726f0987D7164a14158
2543C3278Q650R409g8500f433A01502i9188L3689b6795k8862a9595o1678C6969
$$ plain form
2633 -87126 -86066 118039 65507 -81918 -9575 -59307 -71702 -67175 914 -20451 5264 4189 74388
2620 74388 -28329 -15811 9129 -108243 -78373 -97311 42028 13719 34194 44096 2982 -21520
2607 33104 83560 110737 115488 44718 -34069 91813 -17994 951 119434 -99103 6406 -75628
2594 -102493 -3281 -8575 -99394 108529 -84633 -108070 55657 -48957 -37655 117407 51160 -169394
2581 -46658 47435 -80973 5904 41590 -74310 46834 -103668 -51464 65061 43379 28558 13658
2568 -19193 64050 -80839 23591 23981 -76585 -54885 -39229 -79467 -17322 -38219 68701 -64497
2555 108155 -108993 4772 -102060 -76982 -20352 -119956 -91512 92726 -60987 47164 -114158
2543 33278 41928 51337 -78500 -6433 101502 -99188 -65499 -26795 -55657 -19595 -81273 36969
2530F3375c7742M508A31776c3602J4747l7923D4516N8587A983a7831q4635L1123
2518g1343A08178b0964r2709C1179b1345k9607c575A33593e2392J5405m5563a839
2505C087R2975C9870B746J3208g9048b9987q9665c7571J0130k6187D0150c3511
2492g7375B8636a3889j63803o9749A47676D7123O8860R17e6976r195b7266m1377
2480f8643B9435J7460A7951c1328O395o4301E4963b6074E2804g1184H5572A3009
2467a8579k2016G7183i3672C883M1693a9222B9091i0455B3375a37015D6828g9601
2454d1525A2802l384c6791m1288L4884A2153J769e8729P629a0671k0674n2914
2442h4259j655B2642i2567K857p3141A1776f3393j9405L4835n148D4862o382A4786
$$ plain form
2530 63375 -37742 -33234 131776 -33602 -18855 -56778 44516 103103 1983 -17831 -102466 -71343
2518 -71343 108178 -20964 -113673 31179 -21345 -50952 -3575 133593 -52392 -36987 -82550 -1839
2505 3087 96062 39870 2746 15954 -79048 -29987 -119652 -37571 -27441 -53628 40150 -33511
2492 -77375 28636 -13889 -177692 -247441 147676 47123 115983 116900 -56976 -66171 -27266 -68643
2480 -68643 29435 46895 17951 -31328 -24933 -89234 54963 -26074 52804 -71184 85572 13009
2467 -18579 -40595 77183 -93672 3883 45576 -19222 29091 -90455 23375 -137015 46828 -79601
2454 -41525 12802 9418 -36791 -78079 -43195 12153 13922 -58729 -51100 -10671 -31345 -84259
2442 -84259 -85914 22642 -92567 -89710 -162851 11776 -63393 -82798 -47963 -53111 44862 38480 14786
2428C1190j0334P1557B829O7285B3186c894A7639K0995e7465f684A4804a06268
2415C509P4651c9527h764p5194L760E9442k7911e0894B1545j0509N7505m027a698
2401d6196l3107A3148c1992D0582e553j9804j32405a0977E2621g8526E504R2863
2389I8367b2435m6090A7171b8132F975O6863B0613h4720A2194e555o01n6701G1480
2375G0855d3819m0666B1546c3449c539A4635K0837O044c9750F6608B8401a7378
2362a6942B0332K814A0511J7545a2124j00691J0765c28D0821f2425C182L5994
2350C9176j3614f4481C2493c7420J3354j16215e6525K2239C5260O6789j1672e2278
2337C0659E373L5451J1404c7407o4672A022e4942B2674c919n5155C2989P0227
$$ plain form
2428 31190 20856 92413 2829 70114 23186 -3894 17639 38634 -57465 -6684 14804 -106268
2415 3509 78160 -39527 -8764 -83958 -80198 59442 31531 -50894 21545 11036 68541 64514 -1698
2401 -46196 -79303 13148 -31992 40582 -5553 -25357 -157762 -10977 52621 -78526 5504 98367
2389 98367 -22435 -68525 17171 -28132 6975 73838 20613 -84720 12194 -5555 -6156 -62857 71480
2375 70855 -43819 -84485 21546 -33449 -3539 14635 35472 41516 -39750 66608 28401 -17378
2362 -16942 20332 23146 10511 28056 -12124 -112815 -102050 -328 40821 -62425 3182 39176
2350 39176 25562 -64481 32493 -37420 -24066 -140281 -56525 -34286 35260 102049 90377 -52278
2337 30659 5373 40824 52228 -37407 -102079 1022 -54942 22674 -3919 -59074 32989 103216
2325A03216A0612B489Q499a06548A3828a10541a5798p600j2890D230d2900B6788
2312D4241d9356A6180a84p8223G2720f017r619j32472B0129c7593j1985J4285
2300c5293k4388K7767k2620A01102h9162h10r9921c0547m8687E790d1819J2337
2288b9482H580M1747i4729l6667G1882A875c9683k0956A10542b2231G118P1538
2276G8656a52245e3947r075j1016m0254G5203f5817A7225c4246j351G1150d0893
2263b8170G0731h2976c8319B6132n138h1356A60050p5965c938A8355e8376A2129
2250G8012b3830G7748l59f9299K452M291D4748M3312A0860a4148l2029H7439j3583
2237G3856a6296k609k2861n4155A4793d1443I0502l5099Q0597e8063f801n0213
$$ plain form
2325 103216 10612 2489 10988 -106548 13828 -110541 -15798 -23398 -36288 4230 -42900 26788
2312 44241 -49356 16180 -184 -78407 72720 -6017 -15636 -148108 20129 -37593 -49578 -35293
2300 -35293 -59681 -31914 -54534 101102 -89162 -810 -100731 -30547 -79234 5790 -41819 -29482
2288 -29482 8580 50327 -94729 -131396 71882 1875 -39683 -60639 110542 -22231 7118 78656
2276 78656 -152245 -53947 -63022 -74038 -114292 75203 -65817 17225 -34246 -35597 71150 -40893
2263 -28170 70731 -82976 -38319 26132 20994 -81356 160050 84085 -3938 18355 -58376 12129
2250 78012 -23830 77748 77389 -69299 -66847 -62556 44748 88060 10860 -14148 -46177 87439 73856
2237 73856 -16296 -18905 -41766 -95921 14793 -41443 90502 55403 136000 -58063 -6801 -57014
2225e7014C235K2265L3334J21692e9719J9735j5775J8944A5612d2485o4801i279
2212i1818C4765j1439b1238k8460b0060I85L7973d2732A0396a0122l9882A13262
2199H8648B3505a3233j15540e649A4049L642e6101l1113B6389M057M8668a6685
2186h2428A22531A8648i8576B5441J8728E175f6031J7921a7313p0750f820j570
2174h390o281n9855E17i4164B0804c3732J0618E2061g4789K6778C7059a17202
2161H4548B3060K2738h6502K6962G8109D471b683r0744l84j6494C5923L0370d0492
2147H2701c6845j211I0591e7545j8553A0056f1388K9047A9284i6044d6804j05095
2135a51899D1056A7009c6307C3240a06846G6210k4463P4545l8260B7274i7491
$$ plain form
2225 -57014 3235 25500 58834 180526 -59719 -39984 -55759 -36815 15612 -42485 -107286 -9279
2212 -91818 34765 23326 -21238 -49698 -20060 985 38958 -42732 10396 -10122 -50004 113262
2199 88648 23505 -13233 -128773 -5649 14049 17691 -56101 -87214 26389 30446 79114 -16685
2186 -82428 122531 18648 -98576 25441 44169 5175 -66031 -48110 -17313 -88063 -6820 -8390
2174 -8390 -14671 -74526 517 -94164 20804 -33732 -23114 52061 -74789 -48011 37059 -117202
2161 84548 23060 45798 -86502 -59540 78109 4471 -2683 -93427 -93811 -110305 35923 66293 -40492
2147 82701 -36845 -38056 90591 -57545 -76098 10056 -61388 -32341 19284 -96044 -46804 -151899
2135 -151899 41056 17009 -36307 33240 -106846 76210 51747 126292 88032 27274 -97491
2123A00437D7137a357B7231O1639H590Q8715B897a00471c9163g128B3463n424
2111A8039a47439F7024c7934I394P945a03896a9835B0760J13560D7468c4915B8591
2098A45292g7611k3304e439l4153C6197j0957o384J41073h1008L3054D7666e3698
2085d8561l5400k8951K6239l7873J6834D2457k0437d7073D1886J2326g434m9878
2073e7312A7699R1043b2338l0094C3342J4251C587d2357B3106n116f109l7321
2061d3430i653E1786a07169B9618a51099L2692A28557f117A7113j863J1967B506
2048a12779F2806h8586E1688c6802H8569C8351a2232H4989g596p4529l0062a0598
2035e851l1677J3509B3140R677a9786m7777n533D2256a8106C6180j6134d3020
$$ plain form
2123 100437 47137 -1357 27231 88870 8590 97305 2897 -100471 -39163 -7128 23463 18039
2111 18039 -147439 67024 -37934 9394 17339 -103896 -19835 20760 134320 47468 -34915 28591
2098 145292 -77611 -100915 -5439 -39592 36197 25240 18856 159929 -81008 -47954 47666 -53698
2085 -48561 -83961 -112912 -86673 -124546 -107712 42457 22020 -47073 41886 54212 -7434 -57312
2073 -57312 17699 108742 -22338 -52432 33342 47593 3587 -42357 23106 17990 -6109 -43430
2061 -43430 -9653 51786 -107169 29618 -151099 -118407 128557 -6117 17113 15250 27217 2506
2048 -112779 62806 -88586 51688 -36802 88569 38351 -12232 84989 -7596 -82125 -112187 -10598
2035 -5851 -37528 -24019 23140 32817 -19786 -67563 -73096 42256 -18106 36180 20046 -43020
2022B9354K9951c7374F0083Q574B7285P2157l9096e7724a5483j33561A25048a04443
2009f7053C4158L1149a05748M1820B2827c5085f472E3371c5849H5019c7503r7739
1997a35242F14a4144C4063I439d3366A22516B408a3442A1195c5825H673P4821
1985H3494b6625C3006f6210n4631G908b4878j1191A2163O4860A1405d6735c133
1972f3875K00p60A55968A6714R7469D4112J0449c9404D1916j6313K1287B2306
1959b3356H7874e6021H9723e137n1439D0083e3441A6003O820c74G4983G156O7997
1946G5153c8188m4399J8408j07855b0203D5745b5875D7094c0180n8877c5107I4321
1933H1678f3238J2400a4561O486j011c131q3743A04728b8516G4981a2216j2948
$$ plain form
2022 29354 59305 -37374 60083 68657 27285 99442 60346 -57724 -15483 -149044 125048 -104443
2009 -67053 34158 65307 -105748 -63928 22827 -35085 -6472 53371 -35849 85019 -37503 -135242
1997 -135242 614 -14144 34063 9439 -43366 122516 2408 -13442 11195 -35825 8673 83494
1985 83494 -26625 33006 -66210 -120841 7908 -24878 -36069 12163 77023 11405 -46735 -3133
1972 -63875 -63675 -64435 155968 16714 114183 44112 54561 -39404 41916 25603 46890 22306
1959 -23356 87874 -56021 89723 -5137 -56576 40083 -53441 16003 22823 -374 74983 7156 75153
1946 75153 -38188 -82587 -64179 -172034 -20203 45745 -25875 47094 -30180 -89057 -35107 94321
1933 81678 -63238 -50838 -14561 -8075 -9086 -3131 -86874 104728 -28516 74981 -12216 -25164
1921b5164B5800R3941a4767F4990f7165J0044i020M080D5867D203a8631j3681
1909c2312E6298k4454c4065n2362i325G5843A6710J31204g6054b3284o2166B6475
1896d157G6213e0490b4791C6235R766J1871f41I2366k9614a4024o0745B5979a8007
1882b9164D9231a24137e1171E9876g0954m4324M9869I382h0004I7813G301h4798
1869h4764C5633j3574a26730I8397g3391D557a52870d1899D6962a23591I3441
1857B4678P9051f4052C4553L0789j7181i8596B3426L5438a01501E4275H120P926
1845A6046i789o8326a2681A13316g1484A8384f3874K8751B829h3184a1072B7103
1832B0555a9597M00F2897A1908g8002a929A01501A4710J29673B3932b16581a8530
$$ plain form
1921 -25164 25800 119741 -14767 64990 -67165 -57121 -9020 -4940 45867 4203 -18631 -32312
1909 -32312 56298 31844 -34065 -86427 -9325 75843 16710 147914 -76054 -23284 -85450 26475
1896 -4157 76213 -50490 -24791 36235 46001 57872 -641 92366 62752 -14024 -74769 25979 -18007
1882 -29164 49231 -124137 -51171 59876 -70954 -115278 -65409 9382 -80004 97813 7301 -84798
1869 -84764 35633 22059 -126730 98397 -73391 4557 -152870 -41899 46962 -123591 93441
1857 24678 103729 -64052 34553 65342 48161 -98596 23426 58864 -101501 54275 8120 16046
1845 16046 -9789 -78115 -12681 113316 -71484 18384 -63874 -35123 2829 -83184 -11072 27103
1832 20555 -19597 -19197 62897 11908 -78002 -1929 101501 14710 144383 23932 -216581 -18530
1819G400L8455h7551B3946F451b8739B9613g1275l655D5187c702B2993a14554
1806H0289d2477A36902d1916p3309E7854O09f5890A01430A713L7446g4598J4188
1794f0410J4264j8754A2314L4005a04941G9381Q768H773N2302d3339F7832d4259
1781A8410i8460c5537l0168B6882a47306A01901j8416g0438a1329I2907G808J2835
1769B0643g6545D1372A4820J04820C4112j2018R9278f6172B3747L0395k5924P160
1757C5378H008l749g02B3926f9155F2492a18220E2625i4831I8161a03626G0457
1744a18423c3904E0957h385l630C4987b9544A05906E488i7847j7819M0053I2131
1731d4374G8735g0503a0797n7290J3498m3822A2048a03494a4624D3222c4128D8837
$$ plain form
1819 7400 45855 -87551 23946 6451 -28739 29613 -71275 -74930 45187 -3702 22993 -114554
1806 80289 -42477 136902 -41916 -115225 57854 58463 -65890 101430 1713 39159 -74598 -60410
1794 -60410 -46146 -64900 12314 46319 -104941 79381 88149 8773 61075 -43339 67832 -44259
1781 18410 -98460 -35537 -65705 26882 -147306 101901 83485 -70438 -11329 92907 7808 20643
1769 20643 -76545 41372 14820 119640 34112 22094 121372 -66172 23747 54142 28218 35378
1757 35378 8008 4259 -702 23926 -69155 62492 -118220 52625 -94831 98161 -103626 70457
1744 -118423 -33904 50957 -8385 -12015 34987 -29544 105906 5488 -97847 -115666 -75613 92131
1731 -44374 78735 -70503 -10797 -68087 -54589 -98411 12048 -103494 -14624 43222 -34128 48837
1718C3243j334Q248b9682l5263H5953b2342C5587B868g370B722P5261H701L0696
1705C9397b9773p3224A4399e9601D0965L9611g0808B4668L8458B6235K9800M7602
1693A03637a0439B7766f9236n7829N6477B8151L5777A3348M338P4026a3257M954
1681h303j3468B5646a3446H7107c3944B7165j626a4670H7753l0026j0789B2396
1668a11019d1550B5605a61365b0539C9512a16246M5878K1069C5213j6936c0411
1656A05972D5035A1276R188a25740D086f5293A05704c9932r5520N2853n5067n3856
1644a91522E3607j3948a53222b2832B2536f6568C3180K0537A1793b9797f595F2628
1631c9456H8447O4907H950c5350E7502K7562B2126a13277E7626f771q2721K8562
$$ plain form
1718 33243 31909 40157 -29682 -64945 85953 -22342 35587 2868 -7370 2722 77983 8701 39397
1705 39397 -29773 -102997 14399 -59601 40965 80576 -70808 24668 63126 26235 56035 103637
1693 103637 -10439 27766 -69236 -127065 -70588 28151 63928 13348 17686 91712 -13257 -8303
1681 -8303 -21771 25646 -13446 87107 -33944 27165 25539 -14670 87753 57727 46938 22396
1668 -111019 -41550 25605 -161365 -20539 39512 -116246 -70368 -49299 35213 18277 -30411
1656 105972 45035 11276 20464 -125740 4086 -65293 105704 -39932 -135452 -82599 -137666 -191522
1644 -191522 53607 39659 -153222 -22832 22536 -66568 33180 53717 11793 -29797 -6595 62628
1631 -39456 88447 153354 8950 -35350 57502 85064 22126 -113277 57626 -6771 -89492 -60930
1619f0930A4439e8277b0279j1587m547k2900A33289a14184D6516j2054j054M6837
1607H0245c4605l7793b7632E1775o727a14590d0081A62211D234a4395n9512F9942
1594g2967f680R79A17141e4911J0087A7792c067o187G805e9751J0676k743p865
1581e9683b1798n4606L4985G4710c6044D6892a5177l699H6964F404M1360e28D1210
1567C4910H89b3250b303F9461b3959n1535I175h308A7935J4910A1943P0070B2088
1553A7587b0843q1374I3775i9297H5231C649c9864j1871F8489g8443G0285Q569
1541G8854J3832f2912B2671K5689c9654A868b2886I1003P2083c4528C6492K5480
1529F1972f5377E24N4277B3028c5515b394k7399A5746e7370J0019j0040D8189
$$ plain form
1619 -60930 14439 -58277 -20279 -31866 -36413 -59313 133289 -114184 46516 34462 33408 80245
1607 80245 -34605 -72398 -27632 51775 45048 -114590 -40081 162211 4234 -14395 -73907 69942
1594 -72967 -6680 -5701 117141 -54911 -44824 17792 -3067 -9254 7805 -59751 -49075 -51818 -59683
1581 -59683 -21798 -76404 -41419 74710 -36044 46892 -15177 -18876 86964 6404 47764 -528 41210
1567 34910 889 -23250 -2303 69461 -23959 -75494 9175 -8308 17935 32845 11943 82013 22088
1553 17587 -20843 -102217 93775 -99297 85231 3649 -39864 -51735 68489 -78443 70285 78854
1541 78854 92686 -62912 22671 48360 -39654 1868 -22886 91003 163086 -34528 36492 61972
1529 61972 -65377 524 54801 23028 -35515 -2394 -29793 15746 -57370 -47351 -57391 48189
1516H708g121G8106a343n8276G0865K5015k9735L0509J3352e2717R212l0878L0652
1503d3731A3958O9448e5383b4389R234H2752c0409l6099Q501M074G2870g1980
1490G6558a30598E9932B412a0738A326b8477q998H3678c4619C0942J4906a6325
1477a17298A10428B542K1250k131N9250A80b6229n3406D6241a62312B7034c760
1464g9615a0891F9147B8693L2811M4072D3730d7517n5613N0925b0660m7606c2593
1451h2154G2846H957h350p1299h814n0989C5668d690C395J2389J01566b032m86
1438b518I6300d5037i717A71922d5251B7934c8876F8328l937J2245A3625D998
1425h3206Q544A01157j1264j6259d5487F4386B7326h6844L4426A05084a12553
$$ plain form
1516 8708 -7121 78106 -1343 -59619 70865 95880 66145 96654 110006 -52717 -43505 -74383 -43731
1503 -43731 13958 83406 -55383 -24389 -15155 82752 -30409 -66508 -58007 -53933 72870 -71980
1490 76558 -130598 59932 2412 -10738 1326 -28477 -37475 83678 -34619 30942 45848 -16325
1477 -117298 110428 2542 23792 21661 80911 180 -26229 -79635 46241 -162312 27034 -3760
1464 -79615 -10891 69147 28693 61504 105576 43730 -47517 -103130 -52205 -20660 -68266 -32593
1451 -82154 72846 8957 -8350 -79649 -8814 -59803 35668 -4690 3395 15784 117350 -2032 -2518
1438 -2518 96300 -45037 -9717 171922 -45251 27934 -38876 68328 64391 76636 13625 4998
1425 -83206 -74662 101157 89893 73634 -45487 64386 27326 -86844 -52418 105084 -112553
1413D4501a1560k2606b413C620K3462P943N8369b0158H2315A4499a9195o075A29222
1399b2138A4690h7001D8416j6561A3851J50681F5816b0265n1762k8703D101J89240
1387A93341A2825g6290A51933a1821l9360K3168H5888l3441j5775i928j10170
1376a20098B87g776k7888G2729d863H8500N0913B0892J9133g8507E954J9973O2703
1363H8630J4388b5919o5144E3668K5308B4673M090A068J0034K1860a3196j328
1351a4524H6965h449o79k5241A35066m0250c1694J3039j3315j6652j3272r830
1339g1724H9621P463b04791Q8059a3533q0188D5972J0873L1702l9350b8059L86
1327b7673B6313J4775J41106c6526r2301f2471A6346b4048F5868A7959a8369A462
$$ plain form
1413 44501 -11560 -34166 -2413 3620 27082 35025 93394 -20158 82315 14499 -19195 -25270 129222
1399 -22138 14690 -87001 48416 31855 13851 164532 65816 -20265 -72027 -100730 4101 193341
1387 193341 12825 -76290 151933 -11821 -51181 -28013 85888 52447 36672 -9928 -120098
1376 -120098 287 -7776 -35664 72729 -4863 88500 139413 20892 40025 -78507 5954 25927 88630
1363 88630 103018 -25919 -91063 53668 78976 24673 28763 1068 11102 32962 -13196 -14524
1351 -14524 86965 -8449 -9128 -34369 135066 94816 -31694 -18655 -31970 -48622 -61894 -71724
1339 -71724 89621 97084 -204791 -116732 -13533 -93721 45972 56845 88547 49197 -28059 -27673
1327 -27673 26313 41088 182194 -36526 -128827 -62471 16346 -24048 65868 17959 -18369 1462
1314A33562o3142A09J63827n6124d0095k5825a1975p2144D7327g020j7305F5034
1301H2862l9851P2144f9814H9309B7747l649L9161d0338B1839R371d3085g021
1288C6203b964D0570o606d1507j0812A18624d1763J6114j8307a9246E6433j4521
1276D1912a1962A30693N3108f285A02740D4582j1971B025P3461a5903j37382C7738
1263G1810G407a5075n0218B0390Q1265a8675p4602Q385J4892A29544a45859O6306
1251g9553C8186a9722F8455M9286d5043B9997j3013d4559C5151b4943B11507i1419
1238E4747c7767A9854Q3064d8685o902A8345g8370D8961b2384k1487k8815g62
1225E2770a31677B4016d9256a423A0267d7525B1623b9612B389K3670b2784g616
$$ plain form
1314 133562 70420 109 163936 107812 -40095 -65920 -11975 -84119 47327 -7020 -24325 65034
1301 82862 43011 115155 -69814 89309 27747 24098 63259 -40338 21839 31210 -43085 -7021
1288 36203 -2964 40570 33964 -41507 -52319 118624 -41763 -25649 -43956 -19246 56433 41912
1276 41912 -11962 130693 183801 -6285 102740 44582 32611 2025 75486 -15903 -153285 37738
1263 71810 7407 -15075 -65293 20390 101655 -18675 -93277 -84892 -70000 129544 -145859 -79553
1251 -79553 38186 -19722 68455 117741 -45043 29997 16984 -44559 35151 -24943 211507 -91419
1238 54747 -37767 19854 102918 -48685 -55587 18345 -78370 48961 -22384 -43871 -72686 -762
1225 52770 -131677 24016 -49256 -1423 10267 -47525 21623 -29612 2389 26059 -22784 -7616
1212i2918H4686a18527E5399e4252j2414h42r0993J4681A21800o0763R098P6355
1200A46490n8816f5123J4142D503M8665c4405C7369R0171j8450g8205a6996n3426
1188g0422b8927j3665H78N8781I641L1080c2536H1571a7005j2188B1350M2217
1176F3567g6953b8690A86201b3308F4876e5866a1567M209D396Q1981j7838j9624
1164D8915P2939g0451b4289G1101f672G2235c4020A1196N2222c1323H1404b8678
1151A9602R98a17027d4012r268G471h6322D8775a58719A8002f8460j0029A3113
1138H9510l1226a0050j6728B2063g4936a1764J608A6583L3166R2905a761D7471
1125E3141g056D6567L1767l0303f3356o0332E4412b4982G5017N4682E189b890
$$ plain form
1212 -92918 84686 -118527 55399 -54252 -66666 -842 -91835 -77154 121800 61037 70135 146490
1200 146490 87674 -65123 -50981 4503 53168 -34405 37369 127540 109090 -78205 -16996 -70422
1188 -70422 -28927 -42592 878 59659 9641 40721 -32536 81571 -17005 -29193 21350 63567
1176 63567 -76953 -28690 186201 -23308 64876 -55866 -11567 -7358 4396 86377 68539 48915
1164 48915 121854 -70451 -24289 71101 -6672 72235 -34020 11196 63418 -31323 81404 -28678
1151 19602 20600 -117027 -44012 -53280 7471 -86322 48775 -158719 18002 -68460 -78489 13113
1138 89510 58284 -10050 -26778 22063 -74936 -11764 -10156 16583 49749 142654 -1761 47471
1125 53141 -7056 46567 78334 48031 -63356 -123688 54412 -24982 75017 129699 5189 -2890
1112a21148E6779G336J9845d5363o739D9026e135H5854A9134L033a45404b0497
1099A0600J39155o7845f3510a9698r536l6042F194J10769D0238L9945j8517L431
1087F5097j2647a46303c2245F1502J33b9427j1811n0241A616b8684C2183j3510
1075A8673j835l144d8184k5757J0298J8475C8822J08394A7066g5716G9515a8113
1062A21601D2592M9645c0836m601j7804A089L6026d4704A7836L876g7036L5915
1050d1121A2740e3881H3380c1298a1694o6606L3058f012n3346K9485D4802F355
1037g4960l652a288j3556r4089A07247C1616N0482g2946J6192b1458A6744R8259
1025A15003B6724a21545A685L586a0414A24882A6600m874d4389e575p2873A1863
$$ plain form
1112 -121148 56779 7336 27181 -45363 -52102 49026 -5135 85854 19134 22167 -145404 -20497
1099 10600 149755 81910 -63510 -19698 -29234 -65276 6194 116963 40238 80183 61666 65097
1087 65097 52450 -146303 -32245 61502 61635 -29427 -41238 -91479 1616 -28684 32183 18673
1075 18673 16838 13694 -48184 -73941 -63643 -45168 38822 147216 17066 -75716 79515 -18113
1062 121601 42592 92237 -30836 -35437 -53241 1089 37115 -44704 17836 21712 -77036 -41121
1050 -41121 12740 -53881 83380 -31298 -11694 -78300 -45242 -6012 -59358 -29873 44802 6355
1037 -74960 -78612 -1288 -14844 -108933 107247 31616 82098 -72946 -56754 -21458 16744 115003
1025 115003 26724 -121545 1685 5271 -10414 124882 16600 11726 -44389 -5575 -78448 11863
1012A8651O3641o007e3142A6391a2640A33299j4999o247a9039F8253c9753A20116
999E0309J2954P553a5990j28906F2057k1020Q3636c6416B6147b393I3482a5194
986H7886l7194a2115l071o0441c513q642I0542f0584J1165a8975C4199A5434c4582
972F2711J1972j1861g9695H5175c8007B7434A0643L0931L800G312L4830J7645
960E9787L1148h9534c0510C0792e3610l048A0814K8719O5996f355m2649l7855
948h6859A75207G6855a14526b2810i025C8895l817d9188D9814j9668f1213D3826
935E9926B6666d3176c782F3558g224k7883m065G9069n442A099a3258F4798d8069
921A38170A2080K9232K0201L3934a6360n4158G1041N5881A538f2944k2059F1403
$$ plain form
1012 18651 82292 76285 -53142 16391 -12640 133299 118300 112053 -19039 68253 -39753 120116
999 50309 63263 70816 -15990 -144896 62057 41037 124673 -36416 26147 -2393 93482 -15194
986 87886 50692 -12115 -15186 -75627 -3513 -12155 90542 -60584 -49419 -18975 34199 15434 -34582
972 62711 74683 62822 -79695 85175 -38007 27434 10643 41574 45374 7312 42142 59787
960 59787 90935 -89534 -30510 30792 -53610 -56658 10814 39533 105529 -6355 -49004 -86859
948 -86859 175207 76855 -114526 -22810 -9025 38895 35078 -49188 49814 30146 -61213 43826
935 59926 26666 -43176 -3782 63558 -7224 -35107 -39172 79069 73627 1099 -13258 64798 -48069
921 138170 12080 41312 61513 95447 -16360 -70518 71041 126922 1538 -62944 -85003 61403
908g080p9578B7541J6004f1598J7927F5241B7828o367K2624e5920b1684k6430
896d8114f316E5152A8937b0696B2374a7027C6832J8035b3912k3390I2305b0501
883e7278C398c678A2851M0800J1647q037M5152m4440K6189h7901D8417B1491L0702
870E2193K9653k6166A7788g8647G3192C5705D689b932A6658o017M8053q658c4805
856D1208o952G661P8466m0812a8321A44928D9665M0498C280N1260f7671D3874
843A3964J0409G649d2720g061H6347B3165O570h2451g17n013A0669e995C0532
829a147A3091d5946J010K1296o040C2497o132g4793A704L8436a4777j0452F5509
815B564d9961D0006A8052J00818a0279K621l0153o650A5123b6350p4166L7433
$$ plain form
908 -7080 -86658 27541 43545 -61598 -43671 65241 27828 21461 44085 -55920 -21684 -48114
896 -48114 -6316 55152 18937 -20696 22374 -17027 36832 54867 -23912 -47302 92305 -20501
883 -57278 3398 -3678 12851 53651 65298 57261 102413 57973 84162 -87901 48417 21491 52193
870 52193 81846 55680 17788 -78647 73192 35705 4689 -2932 16658 10641 58694 50036 -34805
856 41208 34256 7661 86127 45315 -18321 144928 49665 90163 3280 54540 -67671 43874
843 13964 24373 7649 -42720 -7061 86347 23165 29735 -82451 -717 -5730 10669 -5995 30532
829 -1147 13091 -45946 -44936 -23640 -29680 32497 26365 -74793 1704 40140 -14777 -25229 65509
815 2564 -49961 40006 18052 118870 -10279 -7658 -37811 -44461 15123 -26350 -100516 -63083
803f3083F0185h6958a219A3903M3959d1500G495c4438A8199i429I1411j0454a785
789A2213R3570d2664B6351f7492C6184f995C4819L3413j9848a1744L030l832I1989
775a21679G2529N5796N4220c3021C3399f0679n8392e8939j7076C5042M3134L6999
763A15175C6971P729e949G6942M179j412H711b0336n4204I4045J8574B7971K900
750C0871d5050K690a5724m9725D4098C576J1980E593N5462J9312c2118F695P5874
737H2569f0330a3034D498f092n3698E6741d6712B4282c7089F7199g4970L6110
725c8860k6962E9036A1760g249G4016B6008K3052a52297b150o6691A17959b9724
712H28K6039c090j19053E7698c5155B6334H603a0307D5851f1507B1612P4730f668
$$ plain form
803 -63083 60185 -86958 -1219 13903 57862 -41500 7495 -34438 18199 -9429 91411 80957 -1785
789 12213 105783 -42664 26351 -67492 36184 -6995 34819 68232 48384 -11744 -8714 -12546 91989
775 -121679 72529 128325 182545 -33021 33399 -60679 -119071 -58939 -76015 35042 78176 115175
763 115175 36971 44700 -5949 76942 81121 79709 8711 -20336 -74540 94045 112619 27971 30871
750 30871 -45050 -42360 -15724 -65449 44098 3576 15556 5593 61055 80367 -32118 6695 82569
737 82569 -60330 -13034 4498 -6092 -59790 56741 -46712 24282 -37089 67199 -74970 -38860
725 -38860 -65822 59036 11760 -7249 74016 26008 49060 -152297 -2150 -68841 117959 -29724
712 828 26867 -3090 -122143 57698 -35155 26334 8603 -10307 45851 -61507 21612 96342 -6668
698c3012j619E9137A8521a7004k863C161N5656a184I0579g762j34115f4200m5711
685a09911a7526D5704d9553b4656o7759B3971g2388B5230L2007B792L7992K4419
673F5203o966l096M0748d3224C3887c5284I9035m7389k2188d035c52k2108o4845
660h7305C5230k993d7661a3797A1182M1725p753r441J5000M1779m5911a5196j7561
647c2757C2240F614a09174d6881J6407A4770J780a7436n3944p839B5858M2333
635F8191f05n8693R465J2592b665q6046B719g5795b7623B3825b130A64355c0897
621a50724L9696H332a0155l2953i386I1837a226C7394J8836d90G9037d2087A90767
607e5327A3816i9347D5824a74612d4067m5418a468D795f7496A09146a99370a6908
$$ plain form
698 -33012 -34631 59137 18521 -17004 -19867 3161 58817 -1184 90579 -7762 -141877 -64200 -109911
685 -109911 -17526 45704 -49553 -24656 -92415 23971 -72388 25230 57237 2792 40784 65203
673 65203 58237 55141 95889 -43224 33887 -35284 99035 51646 29458 -4035 -352 -22460 -87305
660 -87305 35230 32237 -47661 -13797 11182 52907 45154 35713 50713 92492 46581 -15196 -32757
647 -32757 32240 6614 -109174 -46881 -30474 14770 16550 -17436 -71380 -79219 25858 68191
635 68191 -605 -59298 -49833 -37241 -2665 -88711 2719 -75795 -27623 23825 -2130 164355 -30897
621 -150724 -111028 8332 -10155 -43108 -9386 91837 -1226 37394 56230 -490 79037 -42087 190767
607 -55327 13816 -99347 45824 -174612 -44067 -89485 -1468 4795 -67496 109146 -199370 -16908
594g2545C0457g2989D2881P651L491j0345N2407C0728a00396C979c168I390a4903
580C3726D088P2108k8100A0193f9464A4367D038N5530h0972B1646P272b2587l8886
567f1473K0732C0967d7186A56204f2960D883Q3660c2564j6668A25573n2930B0493
554F7094a15872i331A10031g436A51097C1269L5834k2926M552b1918G7341e3062
541a33660A31827C8802H877d6234B1968b1631C11J87817E9954I241L59K0507L22
$$ plain form
594 -72545 30457 -72989 42881 50532 54023 43678 96085 30728 -100396 3979 -3168 9390 -14903
580 33726 4088 76196 48096 10193 -69464 14367 4038 59568 -80972 21646 28918 -22587 -61473
567 -61473 -40741 30967 -47186 156204 -62960 4883 88543 -32564 -49232 125573 72643 20493
554 67094 -115872 -9331 110031 -7436 151097 31269 67103 44177 48729 -21918 77341 -53062
541 -133660 131827 38802 8877 -46234 21968 -21631 311 188128 59954 9241 9600 30107 30429
$$ [...]
##END NTUPLES=NMR SPECTRUM
##END=
