##TITLE=Analysis number 316870
Compound Code btb 12321
Project Code adrs
Chemist Name stores
##JCAMPDX= 6.0         $$ Bruker NMR JCAMP-DX V2.0
##DATA TYPE= NMR SPECTRUM
##DATA CLASS= NTUPLES
##ORIGIN= Bruker BioSpin GmbH
##OWNER= nmr
$$ XWIN-NMR		Version 3.5
$$ Mon Jan 30 14:42:51 2006 GMT Standard Time (UT+0h)  MAYBRIDGE\nmr@NMR_250MHZ
##.OBSERVE FREQUENCY= 250.131544655141
##.OBSERVE NUCLEUS= ^1H
##.ACQUISITION MODE= SIMULTANEOUS (DQD)
##.ACQUISITION SCHEME= undefined
##.AVERAGES= 16
##.DIGITISER RES= 18
##SPECTROMETER/DATA SYSTEM= dpx250
##.PULSE SEQUENCE= zg30
##.SOLVENT NAME= CDCl3
##.SHIFT REFERENCE= (INTERNAL, CDCl3, 0, 16.522)
##AUDIT TRAIL= $$ (NUMBER, WHEN, WHO, WHERE, WHAT)
$$ ##TITLE= Audit trail, XWIN-NMR		Version 3.5
$$ ##JCAMPDX= 5.01
$$ ##ORIGIN= Bruker BioSpin GmbH
$$ ##OWNER= nmr
$$ C:\u/data/dgb/nmr/ADRS/15380/pdata/1/auditp.txt
$$ ##AUDIT TRAIL=  $$ (NUMBER, WHEN, WHO, WHERE, WHAT)
(   1,<2006-01-30 14:41:57.95 +000>,<MAYBRIDGE\nmr>,<NMR_250MHZ>,
      <created by zg, POWCHK disabled, PULCHK disabled
       configuration hash MD5:
       62 19 C7 07 E1 42 D1 B7 37 6C 3D D0 77 39 F9 E6
       data hash MD5: 64K
       DA 68 27 27 1E 99 FC A6 00 A5 10 F7 79 69 8F B4>)
(   2,<2006-01-30 14:42:20.20 +000>,<MAYBRIDGE\nmr>,<NMR_250MHZ>,
      <Start of raw data processing
       ef LB = 0.3 FT_mod = 6 PKNL = 1 SI = 32K 
       data hash MD5: 32K
       9B D8 67 3A 1A 61 DC EB 8C CD E6 61 31 47 28 EB>)
(   3,<2006-01-30 14:42:23.99 +000>,<MAYBRIDGE\nmr>,<NMR_250MHZ>,
      <apk 
       data hash MD5: 32K
       8E FE FA A7 A1 16 1E A0 2A 8F 02 DA D3 EA A0 43>)
(   4,<2006-01-30 14:42:25.37 +000>,<MAYBRIDGE\nmr>,<NMR_250MHZ>,
      <abs ABSG = 5 
       data hash MD5: 32K
       9E DA 9F 19 BD 0B 96 5D 71 2C DF 18 66 33 E0 DB>)
$$ ##END=
$$ 
$$ hash MD5
$$ F0 2A 0B DE 33 25 C2 92 A9 3C 7D E7 5A DA DF FA
##$RELAX= 
##$RELAX= 
##$RELAX= 
##$RELAX= 
##$RELAX= 
##$RELAX= 
##$RELAX= 
$$ Bruker specific parameters
$$ --------------------------
##$DU= <C:\u>
##$EXPNO= 15380
##$NAME= <ADRS>
##$PROCNO= 1
##$TYPE= <nmr>
##$USER= <dgb>
##$AMP= (0..31)
100 100 100 100 100 100 100 100 100 100 100 100 100 100 100 100 100 100 
100 100 100 100 100 100 100 100 100 100 100 100 100 100 
##$AQSEQ= 0
##$AQ_mod= 3
##$AUNM= <au_zg>
##$AUTOPOS= <38 >
##$BF1= 250.13
##$BF2= 250.13
##$BF3= 250.13
##$BF4= 250.13
##$BF5= 500.13
##$BF6= 500.13
##$BF7= 500.13
##$BF8= 500.13
##$BYTORDA= 1
##$CFDGTYP= 0
##$CFRGTYP= 5
##$CHEMSTR= <none>
##$CNST= (0..31)
1 1 145 1 1 1 1 1 1 1 1 1 1 1 1 1 1 1 1 1 1 1 1 1 1 1 1 1 1 1 1 1 
##$CPDPRG= <>
##$CPDPRG1= <>
##$CPDPRG2= <>
##$CPDPRG3= <>
##$CPDPRG4= <mlev>
##$CPDPRG5= <mlev>
##$CPDPRG6= <mlev>
##$CPDPRG7= <mlev>
##$CPDPRG8= <mlev>
##$CPDPRGB= <>
##$CPDPRGT= <>
##$D= (0..31)
0 1 0 0 0 0 0 0 0 0.06 0 0 0 0 0 0 0.0002 0 0 0 0 0 0 0 0 0 0 0 0 0 0 
0 
##$DATE= 1138632114
##$DBL= (0..7)
120 120 120 120 120 120 120 120 
##$DBP= (0..7)
150 150 150 150 150 150 150 150 
##$DBP07= 0
##$DBPNAM0= <>
##$DBPNAM1= <>
##$DBPNAM2= <>
$$ [...]
##$SUBNAM7= <"">
##$SUBNAM8= <"">
##$SUBNAM9= <"">
##$SW= 20.6930455092707
##$SWIBOX= (0..15)
0 0 3 0 0 0 0 0 0 0 0 0 0 0 0 0 
##$SW_h= 5175.983436853
##$TD= 65536
##$TD0= 1
##$TE= 293.16
##$TE2= 300
##$TE3= 300
##$TEG= 300
##$TL= (0..7)
0 120 120 120 120 120 120 120 
##$TP= (0..7)
150 150 150 150 150 150 150 150 
##$TP07= 0
##$TPNAME0= <>
##$TPNAME1= <>
##$TPNAME2= <>
##$TPNAME3= <>
##$TPNAME4= <>
##$TPNAME5= <>
##$TPNAME6= <>
##$TPNAME7= <>
##$TPOAL= (0..7)
0.5 0.5 0.5 0.5 0.5 0.5 0.5 0.5 
##$TPOFFS= (0..7)
0 0 0 0 0 0 0 0 
##$TUNHIN= 0
##$TUNHOUT= 0
##$TUNXOUT= 0
##$USERA1= <user>
##$USERA2= <user>
##$USERA3= <user>
##$USERA4= <user>
##$USERA5= <user>
##$V9= 5
##$VALIST= <valist>
##$VCLIST= <CCCCCCCCCCCCCCC>
##$VD= 0
##$VDLIST= <DDDDDDDDDDDDDDD>
##$VPLIST= <PPPPPPPPPPPPPPP>
##$VTLIST= <TTTTTTTTTTTTTTT>
##$WBST= 1024
##$WBSW= 4
##$XGAIN= (0..3)
0 0 0 0 
##$XL= 0
##$YL= 0
##$YMAX_a= 427429
##$YMIN_a= -623516
##$ZGOPTNS= <>
##$ZL1= 120
##$ZL2= 120
##$ZL3= 120
##$ZL4= 120
##$ABSF1= 16.522
##$ABSF2= -4.171173
##$ABSG= 5
##$ABSL= 3
##$ALPHA= 0
##$AQORDER= 0
##$ASSFAC= 0
##$ASSFACI= 0
##$ASSFACX= 0
##$ASSWID= 0
##$AUNMP= <proc_1d>
##$AZFE= 0.1
##$AZFW= 0.1
##$BCFW= 0
##$BC_mod= 0
##$BYTORDP= 0
##$COROFFS= 0
##$CY= 12.5
##$DATMOD= 1
##$DC= 0
##$DFILT= <>
##$DTYPP= 0
##$F1P= 14.0000005364418
##$F2P= -0.99999901652339
##$FCOR= 0.5
##$FTSIZE= 32768
##$FT_mod= 6
##$GAMMA= 0
##$GB= 0
##$INTBC= 1
##$INTSCL= 1
##$ISEN= 128
##$LB= 0.3
##$LEV0= 0
##$LPBIN= 0
##$MAXI= 10000
##$MC2= 0
##$MEAN= 0
##$ME_mod= 0
##$MI= 0
##$NCOEF= 0
##$NC_proc= -2
##$NLEV= 6
##$NOISF1= 0
##$NOISF2= 0
##$NSP= 0
##$NTH_PI= 0
##$NZP= 0
##$OFFSET= 16.522
##$PC= 1
##$PHC0= 245.7146
##$PHC1= 5.213297
##$PH_mod= 1
##$PKNL= yes
##$PPARMOD= 0
##$PSCAL= 4
##$PSIGN= 0
##$REVERSE= no
##$SF= 250.13
##$SI= 32768
##$SIGF1= 0
##$SIGF2= 0
##$SINO= 400
##$SIOLD= 32768
##$SREGLST= <1H.CDCl3>
##$SSB= 0
##$STSI= 32768
##$STSR= 0
##$SW_p= 5175.98343685301
##$SYMM= 0
##$S_DEV= 0
##$TDeff= 65536
##$TDoff= 0
##$TI= <Analysis number 999999
Compound Code 99
Book Reference 9
Project Code 9>
##$TILT= no
##$TM1= 0
##$TM2= 0
##$TOPLEV= 0
##$USERP1= <user>
##$USERP2= <user>
##$USERP3= <user>
##$USERP4= <user>
##$USERP5= <user>
##$WDW= 1
##$XDIM= 32768
##$YMAX_p= 470527645
##$YMIN_p= -396601
$$ End of Bruker specific parameters
$$ ---------------------------------
##NTUPLES= NMR SPECTRUM
##VAR_NAME=  FREQUENCY,     SPECTRUM/REAL,   SPECTRUM/IMAG
##SYMBOL=    X,             R,               I
##VAR_TYPE=  INDEPENDENT,   DEPENDENT,       DEPENDENT
##VAR_FORM=  AFFN,          ASDF,            ASDF
##VAR_DIM=   32768,         32768,           32768
##UNITS=     HZ,            ARBITRARY UNITS, ARBITRARY UNITS
##FACTOR=    0.157963299565203, 1,           1
##FIRST=     4132.6476996994, 0,             0
##LAST=      -1043.33573715361, 0,           0
##MIN=       -1043.33573715361, -396601,     0
##MAX=       4132.6476996994, 470527645,     0
$$ Real data points
##PAGE= N=1
##DATA TABLE= (X++(R..R)), XYDATA
$$ [...]
19216A35315j4863J067l492m942q704O704N391J1440K206N9o178L098Q260Q390
19202A43751M247J4162N912R077P759J8842L7905N4319O7533O2083N8824N0430
19190E34844O6475M9337M0635M8562L5050K5780O4567R8184Q3414N3595J9255
19179A119698O000L160L5030N5412Q4001J07104J54575K00726K72254L97652N53054
19168B988666P96040J228918J999640L345435N271434O167609M501478K538149
19160B8837369P81710j124700j095192J754471M266317K946761N78637j987679
19152C4957694n466956p399886o566358m371283k708663j753372j180599q08252
19144D702325n32132l17528j72607j22288r8645o7620n0986m9268j1915m47m981
$$ y = [135315, 120452, 121519, 118027, 113085, 104381, 111085, 116476, 127916, 130122, 130181, 124003, 127101, 135361, 143751, 147998, 162160, 168072, 177149, 184908, 203750, 241655, 295974, 363507, 425590, 484414, 534844, 601319, 650656, 691291, 739853, 774903, 800683, 865250, 963434, 1046848, 1100443, 1119698, 1125698, 1128858, 1163888, 1219300, 1303301, 1410405, 1564980, 1765706, 2037960, 2435612, 2988666, 3784706, 5013624, 7013264, 10358699, 15630133, 21797742, 26299220, 28837369, 29619079, 28494379, 27399187, 29153658, 33419975, 36366736, 36945373, 34957694, 29490738, 22090852, 15524494, 11153211, 8444548, 6691176, 5510577, 4702325, 4170193, 3852665, 3680058, 3557770, 3459125, 3391505, 3340519, 3291251, 3279336, 3278889, 3273908]
19133C273908R103K5983P0695J27871J90313K28969K65445L09577M08622O31993
19123E542479J010338J556156K428713L895643N940111P604703P965610P522071
19115D3465824O591716N621297N405825L417006l13813k114511n04241J253397
19107F2822500P52776m54053m238126r799955j2364682j0526340p087057m522898
19099A4582165l015457k107773j515923j086064p62929n43142m09183l54750l10882
19090D476062k64255j79240r9470q3507j21172j59391j61792r4630j1797K3021
19080C323829K1346J1344K3370P9500J72447L14688N45444Q76655J409741K305650
19070I084014L761240N436406N816312L857530J115966L85281K070203L519344
$$ y = [3273908, 3283011, 3308994, 3379689, 3507560, 3697873, 3926842, 4192287, 4501864, 4910486, 5542479, 6552817, 8108973, 10537686, 14433329, 20373440, 27978143, 35943753, 43465824, 50057540, 55678837, 61084662, 64501668, 64187855, 62073344, 61569103, 62822500, 63575276, 63121223, 58883097, 49083142, 36718460, 26192120, 19105063, 14582165, 11566708, 9458935, 7943012, 6856948, 6094019, 5550877, 5141694, 4786944, 4476062, 4211807, 4032567, 3933097, 3849590, 3728418, 3569027, 3407235, 3312605, 3300808, 3323829, 3345175, 3356519, 3379889, 3459389, 3631836, 3946524, 4491968, 5368623, 6778364, 9084014, 12845254, 18281660, 24097972, 27955502, 29071468, 29456749, 31526952, 35046296]
19062C5046296K589889k02534k987751m305292l583787j678870o96541j796942
19054B2384468l689492m442968l765199k606379j703140j161664q36556o15580
19046C563490m53548l24212k52931k10983j98212j75332j19754q3228p8268q8339
19036A578683r8295j13029j00481p9016n2126n4440p6330r3116p3859o2639n3124
19025G22228l2650m3675m4724m1249l8160l8093l4493k8897k4872j9692q859k0636
19013C46228k3572j1510j4952j5565j0291q100j3286j1054p664k856j29n647p744
19000B13858q903j0516j8481q905k361q017n988L286M715o781m337l592P390K4133
18986A75501J0154j538p429m25K096M236L299K065J0658R767r525m765o508j7402
$$ y = [35046296, 37636185, 37433651, 34445900, 30140608, 26556821, 24877951, 24181410, 22384468, 18694976, 14252008, 10486809, 7880430, 6177290, 5015626, 4179070, 3563490, 3109942, 2785730, 2532799, 2321816, 2123604, 1948272, 1828518, 1745290, 1667022, 1578683, 1480388, 1367359, 1266878, 1187862, 1135736, 1081296, 1004966, 911850, 837991, 775352, 722228, 689578, 645903, 601179, 559930, 521770, 483677, 449184, 420287, 395415, 375723, 366864, 346228, 322656, 311146, 296194, 280629, 270338, 262238, 248952, 237898, 230234, 227378, 227249, 221602, 213858, 204955, 194439, 175958, 167053, 164692, 156675, 150687, 153973, 158688, 151907, 147570, 143978, 151368, 175501, 185655, 184117, 176688, 176263, 178359, 182595, 185894, 187959, 198617, 208384, 198859, 194094, 187586, 170184]
18972A70184J365k464q903p940m894o375p969j848j818j673m376q721j7389J121
18958I8300M71j8653n286n278j5864Q942L24l247r405j4506m626P057J3275k722
18944D8782p242k10j384N894J1331L468N200L353O35J099R829P967M423o304j881
18929H4960K827J0356Q867n920j0393J361j74r52r650k621j0011j1372J2327Q924
18915G8529q261j5522j1442O066n630n862p02J2638P863J45n075M70n262l861
18901D4094Q83O204o589j3883l666k360M494K154j73J938J569L503o342K380M112
18886C8318J1526j2915p888Q296N274J295k886q783L954M855n17q58Q28O893M798
18871E2190j026j0463J947N758j3183j4531n042K800R234R29R44p014l974M108
$$ y = [170184, 171549, 169085, 160182, 152242, 147348, 140973, 133004, 131156, 129338, 127665, 123289, 114568, 97179, 98300, 98771, 80118, 74832, 69554, 53690, 62632, 62956, 59709, 50304, 35798, 31172, 38229, 51504, 48782, 41540, 41330, 39946, 45840, 57171, 60639, 65839, 69192, 69827, 70926, 80755, 88722, 93145, 86841, 84960, 87787, 98143, 107010, 101090, 90697, 92058, 91884, 90932, 81282, 78661, 68650, 57278, 69605, 78529, 70268, 54746, 43304, 49370, 43740, 37878, 37176, 49814, 57677, 57822, 52747, 53217, 47955, 44094, 44977, 51181, 44592, 30709, 27043, 24683, 29177, 31331, 31158, 33096, 34665, 38168, 31826, 34206, 38318, 49844, 36929, 29041, 37337, 42611, 43906, 41020, 32237, 36191, 41046, 40529, 39671, 40499, 47392, 52190, 51164, 40701, 42648, 48406, 35223, 20692, 15650, 18450, 27684, 28613, 29557, 22543, 18569, 22677]
18857B2677M647L512J603r177j1576J254L964O033l47j606p332j274P977R165
18843B9520N082q337o350N041L090M44O472o487K818Q733p006k749o11P867J583
18828C9110k760m481Q931M345j107J593P088K048j2749n785O359Q693N465J638
18814E8388O946J6089K3534K4805K4088Q677n945j5834k8588j8250j5856j1476
18802F6578m503o060O908J2425K2404K2400L3129K9732J1722O352L252N896O317
18789B16552m973m049p837j4868k4211l3591k4619j0735p677j1365L837J7306
18777I3770K5620L1238J4659O155K287j9393k4339l1215k3015l602P344k358J2008
18764H9159K7756K6487k724k8897m7204j5200p897l522N36o448q937L055j877
$$ y = [22677, 27324, 30836, 32439, 23262, 11686, 12940, 16904, 22937, 22590, 20984, 13652, 12378, 20355, 29520, 34602, 26265, 19915, 24956, 28046, 28490, 34962, 28475, 31293, 40026, 33020, 30271, 29660, 37527, 39110, 36350, 31869, 40800, 45145, 44038, 45631, 52719, 54767, 42018, 36233, 42592, 51285, 56750, 58388, 65334, 81423, 104957, 129762, 153850, 162527, 156582, 140748, 112160, 93910, 78054, 66578, 62075, 56015, 62923, 75348, 97752, 120152, 153281, 183013, 194735, 201087, 204339, 210235, 216552, 211579, 207530, 199693, 184825, 160614, 127023, 102404, 91669, 83992, 72627, 76464, 93770, 119390, 150628, 165287, 171442, 173729, 154336, 129997, 98782, 75767, 72165, 79509, 77151, 89159, 116915, 143402, 140678, 111781, 64577, 49377, 41480, 37958, 38494, 32046, 23109, 26164, 24287]
18751B4287r230J563J802k773l942O212n30j1121l737O724O915q791p639p098
18737g358p979R901M960R84J086m187j444M355P535P426M15j0150K043L141L88
18722A1116O898N398M46p881o523q622n03o717J2705Q584o901r284k292L074M890
18707D388J91m696k84R56R70M415m943j5957n168J5145J7684P804m870l45L124
18692A8414P720N261j1278r452J714j0643n590m460l383M960N901j117r637k181
18678a3771J876M347J1042M119O17K650K605o104J417J0301r921n435J1007Q424
18664B3174Q22N184j686j1657m802P28k539K113Q088j0704K186J1150P018N958
18650C5033J3818J3291K2245L4336L8679L2503n9q234k0467j806N409M699L807
$$ y = [24287, 15057, 16620, 18422, 15649, 11707, 17919, 17389, 6268, 2531, 9255, 16170, 7379, -260, -7358, -15337, -5436, -476, 508, 1594, -2593, -4037, 318, 7853, 15279, 15694, 5544, 7587, 10728, 11116, 18014, 23412, 23858, 15977, 9454, 832, 329, -6388, 6317, 14901, 8000, -1284, -3576, -502, 4388, 4579, -117, -401, 555, 1525, 5940, 997, -14960, -20128, -4983, 12701, 20505, 15635, 15290, 18414, 26134, 31395, 20117, 10665, 12379, 1736, -3854, -8314, -11697, -6737, -836, -1953, -11590, -13771, -11895, -7548, 3494, 7613, 8230, 10880, 13485, 7381, 8798, 19099, 9178, 3743, 14750, 23174, 23996, 29180, 27494, 15837, 11035, 11763, 9224, 11337, 19425, 8721, 10907, 22057, 29075, 35033, 48851, 62142, 84387, 118723, 157402, 189905, 189846, 181612, 161145, 159339, 164748, 169447, 173254]
18637A73254K042j2333l0886l6664k7271o911q836j2085p741k12L759J644k015
18624C5745j3765J256J1417L818R27M670n112M351J2889R2r629J844K8095K5695
18610A02293K3401J9321P304Q387J2547K8043J6747M479N370P506J7624M0174
18598B93196K9627J654k1809k9078l0769j9104N069K943j9j8421k4754l0254l2841
18585A25440l2138k4018q454n462o293j4749l178J1492N65n310n566k040j802
18572B8487j625M104N108K963Q964l387J175J2952j55L183K0218L3612K7895J6186
18558A59680p721M660K3351J5768J4430J5051q192k5051r440k352j8876k1970
18546A39338l4153k4604j1792j7228j0772p30n167m085J411K369j529j127L11
$$ y = [173254, 175296, 162963, 132077, 95413, 68142, 61231, 52395, 40310, 32569, 32357, 36116, 37760, 35745, 21980, 23236, 34653, 38471, 39398, 44068, 38956, 43307, 56196, 56288, 46659, 48503, 76598, 102293, 125694, 145015, 152319, 160706, 173253, 201296, 218043, 222522, 227892, 235398, 253022, 293196, 322823, 324477, 302668, 273590, 242821, 223717, 228786, 231729, 231710, 213289, 188535, 158281, 125440, 93302, 69284, 60830, 55368, 49075, 34326, 31148, 42640, 43205, 37895, 32329, 30289, 28487, 26862, 30966, 36074, 39037, 48001, 44614, 45789, 58741, 58586, 61769, 81987, 115599, 143494, 159680, 151959, 156619, 179970, 195738, 210168, 225219, 217027, 191976, 182536, 180184, 161308, 139338, 105185, 80581, 68789, 51561, 40789, 40059, 34892, 30807, 32218, 34587, 33058, 31931, 32242]
18533C2242m716j808p807K755R629K079o664R077J6707P249p15j1262k171J2413
18519E7008J2966L3288N1938N7866K2047j8609n3974m9246l4698l0106j4241q321
18507B5918o925m301P013k950m929o45J366N154j267J265m977J768Q39N964J4171
18492C7464l393k601L478J939N767K179j99r190j5673p151L244M595k182k87O366
18477B4356P489O332K628N771J8492J8778L8313N7019O7828P1539M7768j811k8017
18464C36485o1048o1474m9394m5906k9970j1823r696r399M897j378j2712m994
18452D3588p794l37l002J512N8N744P242j2646n048K090j869l015N590N263J288
18437C8664j5527o858R09r08r69M96p256q585Q568J0739J3366P901M918L239j024
$$ y = [32242, 27526, 25718, 17911, 20666, 30295, 32374, 25710, 34787, 51494, 58743, 58028, 46766, 44595, 57008, 69974, 103262, 155200, 213066, 235113, 216504, 162530, 113284, 78586, 48480, 34239, 25918, 18993, 14692, 21705, 18755, 13826, 13181, 14547, 19701, 18434, 19699, 14722, 16490, 17329, 23293, 37464, 34071, 31470, 34948, 36887, 42654, 44833, 44634, 35444, 19771, 12620, 15864, 20459, 18277, 17990, 24356, 31845, 38177, 40805, 46576, 65068, 83846, 122159, 179178, 247006, 318545, 366313, 364502, 336485, 275437, 213963, 164569, 118663, 88693, 76870, 67174, 57775, 62672, 61294, 48582, 43588, 35794, 35457, 32455, 33967, 34025, 39769, 47011, 34365, 29317, 31407, 29538, 26523, 32113, 37376, 38664, 23137, 16279, 17188, 16280, 15311, 15807, 8551, -34, 8534, 19273, 32639, 40540, 45458, 48697, 47673]
18422D7673R174K0410K3643L6484L0179j348l7653m1105j7350r186k444m059j0323
18409D4095L696P642m043j4883j2166j1854K102O821q331k188L574j066O470Q736
18395B8605P469q297n16J2595o91k408O684L472P562n012p792o607j0396k270
18381B2398r199J297P720J716L621k306o416Q768J0627Q849n39r727p358j497
18367B7954O407J219P22p112j4611j3515p836J2015R861J8624K5098K2747L1616
18354A13189L2797R844N977K296J7438J8224J3414m830l0771l2165K653M727N507
18341A58300j9823l2040j6214n975o261j240K943j133j1040q880M66m576m974
18328D9553o814n620k92j290L233N160J5629J7805K0803L394j5486M169Q296o350
$$ y = [47673, 56847, 77257, 100900, 137384, 167563, 166215, 128562, 87457, 70107, 60921, 58477, 54418, 44095, 47791, 55433, 51390, 36507, 24341, 12487, 14589, 21410, 13079, 10891, 14465, 13399, 19869, 28605, 36074, 27777, 27261, 39856, 39165, 36757, 43441, 46913, 54475, 49463, 41671, 35064, 24668, 22398, 13199, 14496, 22216, 23932, 27553, 25247, 18831, 27599, 38226, 47075, 46536, 36809, 29451, 27954, 34361, 35580, 36302, 29190, 14579, 1064, -6772, 5243, 15104, 33728, 58826, 81573, 113189, 145986, 155830, 161807, 164103, 181541, 199765, 213179, 208349, 177578, 145413, 148066, 152793, 158300, 138477, 106437, 90223, 84248, 77987, 76747, 79690, 78557, 67517, 58637, 59103, 54527, 49553, 42739, 37119, 36827, 35537, 38770, 43930, 59559, 77364, 98167, 101561, 86075, 90244, 98540, 92190]
18314I2190k944N590j292P244L613J980q438M217M196o809N558R485O104K1216
18300A41910L2261K8070J1527P756M040J2859K0784J6719k300k1559k0816j116
18288B30135M744j1351k3654k4121j0999j8033m976M884R43O124l83R62m883J0750
18274A60142O432K857P441J7248J3757R801Q764J7990J0576Q222N496K1318K6679
18261C16723K9072L7408O2987P3667Q4447Q4799Q7634P0052M2030J4663j0827
18250H92655k7152q085L2487P1186J02714J34987J77081K17384K46366L04763
18240B144386L83723M72730O42791R44579J456896K327119L712839N234306N688862
18231B3008231M343495J972716o72589l284420m865336m689300l371501j921662
$$ y = [92190, 89246, 94836, 93544, 100788, 104401, 106381, 97943, 102160, 106356, 99547, 105105, 114590, 120694, 141910, 174171, 202241, 213768, 221524, 225564, 238423, 259207, 275926, 273626, 252067, 231251, 230135, 234879, 223528, 199874, 175753, 164754, 146721, 141745, 146629, 147572, 153696, 153313, 154275, 149392, 160142, 166574, 169431, 176872, 194120, 207877, 217678, 226442, 244432, 255008, 263230, 268726, 290044, 316723, 345795, 383203, 446190, 519857, 604304, 689103, 776737, 846789, 888819, 903482, 892655, 865503, 857418, 889905, 961091, 1063805, 1198792, 1375873, 1593257, 1839623, 2144386, 2528109, 3000839, 3643630, 4588209, 6045105, 8372224, 12085063, 17319369, 23008231, 27351726, 29324442, 28651853, 25367433, 20502097, 15812797, 12441296, 10519634]
18223A0519634p98503J32659J122746K402791M091859N592835N684838M279329
18215C3028188K491484R67966J95184M19456O59155M4533j379908l413550n347847
18206B7664661n923827m938335l335252j961168q89448P8962J194255K695121
18198A4584969M452676N358252M379220K123830n21856l258093n232302n495377
18190A6391319m365357k969178j956221j327032r33566o92671n49542m51164l77470
18181B769118l12970k61007k07633j66270j32327j09401r4700m7977j7451p253
18171A412129k3325m7823q2340j02697j16032j24146j12721r5614o4145l7896
18161F05390k9068k5630l4438k9911k7224q636p993j4539k0846l3047l4566j5926
$$ y = [10519634, 9721131, 9853790, 10976536, 13379327, 17471186, 23064021, 28748859, 33028188, 35519672, 36487638, 36682822, 37102278, 37761433, 37805966, 36426058, 33012508, 27664661, 21740834, 16802499, 13467247, 11506079, 10616631, 10695593, 11889848, 14584969, 19037645, 24395897, 28775117, 30898947, 30377091, 27118998, 21886696, 16391319, 12025962, 9056784, 7100563, 5773531, 4839965, 4147294, 3597752, 3146588, 2769118, 2456148, 2195141, 1987508, 1821238, 1688911, 1579510, 1484810, 1436833, 1419382, 1412129, 1388804, 1340981, 1258641, 1155944, 1039912, 915766, 803045, 707431, 643286, 605390, 576322, 550692, 516254, 486343, 459119, 450483, 442490, 427951, 407105, 374058, 339492, 323566]
18149C23566p811j6418k2770p817m926j5145j1933j2632j1440j155J1085K0954
18137B43558K1878K914j865j931l747k908J035n760l040J2127J0562L1627M9393
18124C53843N3421L8139J8431J1758J4448R325J0130K1941K2593N1789R7778J28942
18112H32538J86288K67819M22545P11693J220021K246808M230749O124203L188029
18103A9430693k620449n342433m301189k415582j362638q49409n74508m07634
18095A556851k97168k16942j63060j08886n9206k7647Q296J5791J231k7997m4777
18084F36486n7394n9458m1406l7795l8735k3296l0699l3448k5872j3678j412k0160
18072B53133j2562o626j451J0883J2060J0146R172o302l962Q189o830j7609k4633
$$ y = [323566, 315755, 299337, 276567, 268750, 263824, 248679, 236746, 224114, 212674, 211519, 222604, 243558, 265436, 268350, 266485, 264554, 260807, 257899, 258934, 253174, 250134, 262261, 272823, 304450, 353843, 407264, 445403, 463834, 475592, 490040, 499365, 509495, 531436, 554029, 605818, 703596, 832538, 1018826, 1286645, 1709190, 2420883, 3640904, 5887712, 10118461, 16242664, 19430693, 16810244, 11467811, 7166622, 4751040, 3388402, 2538993, 1964485, 1556851, 1259683, 1042741, 879681, 770795, 711589, 683942, 692238, 708029, 709260, 681263, 636486, 579092, 519634, 478228, 440433, 401698, 378402, 347703, 314255, 288383, 274705, 273293, 253133, 240571, 233945, 232494, 243377, 255437, 265583, 274755, 268453, 264491, 272680, 265850, 248241, 223608]
18059B23608j5416j4040j0952m204N786q704j5823q115O159J9464J2751J3286
18047B03800P798K194P522K271J195J6433M2410O8282P8196J07140J24822O8013
18035G30076l1887q9946o9299l5819n159J4958L3902N2022P9532P9339R3232J04304
18023I55255J16564J58239K21375L09209M13403N73082Q32443J260523K006168
18014F846261L338664N723403R436230J1319877M747810n519247j0268519q580588
18006A7043891n284850l175297k023545j373268r54267p09133n54383m38679l35551
17997B194918k62505j93962j33208r5046n9467j8312L7224J04152J50289J37467
17987A861550O3781P763m2304j06107j43360j37851q4473j5993M7300J15584J41704
$$ y = [223608, 208192, 194152, 183200, 178996, 184782, 176078, 160255, 152140, 158299, 177763, 190514, 203800, 211598, 213792, 221314, 223585, 224780, 241213, 283623, 351905, 430101, 537241, 662063, 730076, 698189, 608243, 538944, 503125, 497966, 512924, 546826, 598848, 678380, 757719, 850951, 955255, 1071819, 1230058, 1451433, 1760642, 2174045, 2747127, 3579570, 4840093, 6846261, 10184925, 15908328, 25344558, 36664435, 41412245, 35892998, 25624479, 17043891, 11759041, 8583744, 6560199, 5186931, 4232664, 3523531, 2969148, 2530469, 2194918, 1932413, 1738451, 1605243, 1510197, 1450730, 1432418, 1469642, 1573794, 1724083, 1861550, 1925331, 1933094, 1890790, 1784683, 1641323, 1503472, 1418999, 1403006, 1450306, 1565890, 1707594]
17976A707594J70036K12540K46940L22374M43833O07283Q62695J239287J847905
17967G660487K894485M773915Q124418J3065498J5747760J1180231K548214p838059
17959E8156949j3920084j3629029r574415n878148l701468k473053j733394j271096
17951E976262r78362p70651o02325m73460l73197k92306k21935j72929j25369
17942A965728q2136k4752N0044P6267M8433K6877j6199p9083j50891j91501j63283
17931A459504r6072m3920q521K4246L8300N3354P4680J20950J97017K87055L81625
17920B488218N51118Q20999J300237K161849L686352O345805R453882P752557
17912C4561017q29360p731467q557933n794589l422593k112219j384809r54848
$$ y = [1707594, 1877630, 2090170, 2337110, 2659484, 3103317, 3710600, 4573295, 5812582, 7660487, 10554972, 15328887, 23453305, 36518803, 52266563, 63446794, 65995008, 58156949, 44236865, 30607836, 21033421, 15155273, 11453805, 8980752, 7247358, 5976262, 4997900, 4227249, 3624924, 3151464, 2778267, 2485961, 2264026, 2091097, 1965728, 1883592, 1858840, 1908884, 1985151, 2033584, 2060461, 2044262, 1965179, 1814288, 1622787, 1459504, 1363432, 1319512, 1310991, 1335237, 1373537, 1426891, 1501571, 1622521, 1819538, 2106593, 2488218, 3039336, 3860335, 5160572, 7322421, 11008773, 17354578, 26808460, 34561017, 33731657, 26000190, 17442257, 11647668, 8225075, 6112856, 4728047, 3773199]
17904C773199o78917n14579m07885l11094k50698k16193j71493j18281r1691q5322
17894I27046q0324o5889n4557k9573o816K4447P3946M9451l9783r8953j03487
17883E95508o8007l3323l0844m1071k7692k8208j9494k4612l0148k7397r820j530
17871B53362r282m316j0033j0779j8530L50p726j2420m541j4945j629n386j680
17858A52445o11r076j3946j4599j0757j2897j7K321j5489l475m366J51L891pq15
17843G2753n193m114j1932m807L941M503J2979J8357J7558J0435K2982J4131K356
17830A53949M929j4950k1856j0545k072k74M943N072j071j7130r940L888q517
17817H6426j7209q33Q229j1420k625P919J2209J1681m792o426k6103k1399m281
$$ y = [3773199, 3094282, 2579703, 2171818, 1860724, 1610026, 1393833, 1222340, 1104059, 1012368, 927046, 846722, 780833, 726276, 696703, 689887, 714334, 788280, 837731, 797948, 698995, 595508, 527501, 494178, 463334, 422263, 394571, 366363, 346869, 322257, 292109, 264712, 254892, 253362, 244080, 239764, 229731, 218952, 200422, 200772, 193046, 180626, 176085, 161140, 159511, 154125, 152445, 151834, 142758, 128812, 114213, 103456, 90559, 90542, 92863, 77374, 73899, 69533, 69684, 73575, 73568, 72753, 67560, 63446, 51514, 46707, 50648, 55151, 68130, 86487, 104045, 114480, 137462, 151593, 153949, 158878, 143928, 122072, 111527, 109455, 109181, 114124, 119196, 118125, 100995, 91055, 94943, 86426, 69217, 68384, 76613, 65193, 62568, 70487, 82696, 94377, 89585, 83159, 57056, 35657, 31376]
17804C1376J52K413K435O006j433q587n290j609K296J2630J2724p60p060o660
17790C8633P56O474k139J983M994J4247J4101J1640p235j0416j1549R36o625k183
17776E3617L169L597l792l286o976m901O446N327R357q056r678l613j3710K843
17762C0344R536L797J0573j2501r322k004m716l071L278m589m05J784J444j173
17748B2975l450p955m763J56N237J0023j546l797j367n651K793L130j702M240
17734A8323J611L093n789p03j7874K687J8035J4400l188n869o701J013P301n25
17720B5814l997j971M34j835K424j1561m061J4367R720l441j096j700L372m735
17706B1734o170q050l498L737O672O28J845j819j80p333o510K998O204p88P560
$$ y = [31376, 31528, 33941, 36376, 42382, 40949, 32362, 27072, 25463, 27759, 40389, 53113, 52353, 45293, 38633, 39389, 45863, 43724, 45707, 50701, 64948, 79049, 90689, 83454, 73038, 61489, 62425, 55800, 53617, 56786, 60383, 56591, 53305, 46329, 41428, 47874, 53201, 62558, 54502, 44824, 41211, 27501, 30344, 39880, 43677, 54250, 41749, 32427, 30423, 25707, 22636, 25914, 21325, 20920, 22704, 24148, 22975, 19525, 11570, 6807, 6963, 12200, 22223, 20677, 16880, 15513, 9862, 12655, 15785, 14083, 18323, 19934, 23027, 17238, 16535, -1339, 1348, 19383, 33783, 30595, 24726, 18025, 19038, 26339, 25814, 21817, 19846, 20280, 18445, 20869, 9308, 5247, 19614, 29334, 25893, 24797, 23097, 26469, 21734, 15564, 7514, 4016, 7753, 14425, 15053, 16898, 15079, 14899, 7566, 1056, 4054, 10258, 9470, 17030]
17691A7030l049j0760L540J0680K028J116J0586P717l163r843j0396l230k385
17678I871N927L260j476M831K813L55K011l263m121j166J0266o65J014J027m06
17663C0278J623Q02L631L901J1880k317O349J8504L3688L8123N3940L1090n055
17650B26437k6549k1262j0920k594J7377K0658J2561j537l174j515J6837K4985
17638B51304K5390K287k3071j6936J0224L2516N0864L7128Q738k0387l1576k3373
17626C03108j5729p412q024j5787r841r235M199O542M247J357j8565k8328l0503
17613A76029j3561O660M718J3281J6294j9832l6272k5978l2846j4343j4019o882
17601E3249q83j0094l855n321K359n181O61O951N37J4r256l594K075N191l07n219
$$ y = [17030, 13981, 3221, 6761, 17441, 19469, 20585, 31171, 38888, 35725, 25882, 15486, 12256, 9871, 15798, 19058, 17582, 22413, 25226, 25581, 27592, 24329, 20208, 19042, 29308, 28643, 29657, 30684, 30278, 31901, 32703, 36334, 40235, 52115, 49798, 56147, 74651, 108339, 146462, 200402, 231492, 226437, 199888, 178626, 167706, 165112, 182489, 203147, 215708, 214171, 210997, 209482, 226319, 251304, 276694, 278981, 255910, 238974, 249198, 281714, 332578, 369706, 378444, 358057, 326481, 303108, 287379, 279967, 271943, 256156, 246315, 237080, 241279, 247821, 252068, 253425, 234860, 206532, 176029, 162468, 169128, 173846, 187127, 203421, 183589, 147317, 121339, 88493, 74150, 60131, 53249, 52366, 42272, 38417, 33096, 35455, 30274, 30935, 37886, 38423, 38437, 29181, 25587, 27662, 32853, 32546, 27327]
17585B7327r979l655l224p106j4829K990l495l95M725K811j252J4429N848J5l56
17570A3854K090J226n274j420q785n717L073J0589%m803q43J7086j596q572P330
17555A8238p622J646Q76l394M379M54J455p264k780m22o88J056j010k656m140
17540a872P43P023Q349o232L262j484r179j757j06P934M299r30n820J803R170
17525A5203M282J48N97P981J111j606l977J110o808q39o330l671o669n359J2195
17510G368j886l492M749J4430J1941J0084J0966J1098J7664M5423M9967K1664
17498A99976j2858m5241m8568l0642j8364q508M195O619n100k2311j2033K622
17486I787J1949j0192p998j05M105N674j126Q10J267J0549J3407K232j2639k212
$$ y = [27327, 17348, 13693, 10469, 3363, -11466, -8476, -11971, -12366, -7641, -4830, -6082, 8347, 14195, 14210, 13854, 15944, 17170, 11896, 10476, 1691, -4026, -953, 9636, 9636, 4833, 3990, 21076, 19480, 10908, 18238, 10616, 12262, 13138, 9744, 14123, 14577, 16032, 8768, 5988, 5566, 4878, 5934, 4924, 2268, -1872, -1129, 5894, 14243, 8011, 11273, 9789, 610, -1147, -1253, 6681, 10980, 10050, 4230, 6033, 15203, 19485, 19633, 20230, 28211, 29322, 27716, 23739, 24849, 18041, 17202, 10872, 7201, 532, -4827, 7368, 5482, 1990, 6739, 21169, 33110, 43194, 54160, 65258, 82922, 128345, 178312, 199976, 187118, 141877, 93309, 62667, 44303, 35795, 39990, 46609, 41509, 19198, 7165, 9787, 21736, 11544, 3546, 3441, 7546, 13220, 12094, 12904, 14171, 24720, 38127, 40359, 27720, 25508]
17472B5508j090L771M79j2256j625l688N575o163q24n4q14O941N160J0104P992
17457C9016J4899K0073K2638K7806O9460P9954O7016K0852k6394o3552p3588o1083
17445A37097l7423j6354j129O588P204P141J9632K0082j0621l6241l4622j4641
17433D6713o020q645q60J949k878l866L318J192j3121l504K65K771q571P120J8661
17418C4524P525j1953j8453n794O188O742M106O93L228J0335r74o469J5324J3778
17404E8800K8280N2146N1655N862k3088m8420l6825k0637j3220j8203p288M410
17392C3472o470l609J617M745L084l51r179j690l222k168j705P164K499k089k372
17377A9726L576r1o273n311Q63J108m517M211j762O833K22n887n850R08R292J87
$$ y = [25508, 24418, 28189, 28668, 16412, 14787, 11099, 16674, 10511, 9687, 9633, 8819, 15760, 20920, 31024, 39016, 53915, 73988, 96626, 124432, 193892, 273846, 340862, 361714, 335320, 271768, 198180, 137097, 99674, 83320, 82191, 88779, 95983, 103124, 122756, 142838, 132217, 95976, 61354, 46713, 40693, 32048, 31188, 33137, 30259, 26393, 29711, 30903, 17782, 14278, 14543, 17314, 8743, 15863, 34524, 42049, 30096, 11643, 5849, 12037, 18779, 22885, 23578, 26806, 37141, 36167, 29698, 45022, 58800, 87080, 139226, 190881, 196743, 173655, 125235, 88410, 67773, 54553, 36350, 29062, 33472, 27002, 23393, 25010, 29755, 32839, 32488, 23309, 21619, 18397, 16229, 14524, 21688, 24187, 22098, 19726, 23302, 23211, 16938, 11627, 12490, 13598, 9081, 13292, 11530, 18363, 18585, 12698, 6848, 7756, 17048, 17235]
17361A7235O673R951j997l665r34j2639n194j467N523J3532Q17m313K565P615
17347C3702M217n557P274J0730k594j7635r396P667J3517M613M185p978q221j4388
17333B0136L419n20j1355j54Q045Q194o152k194O680M477J931m589k010l594J2413
17318C4727o883m140o484j465P633n692o21j575n179j250J2399M808K604o779
17304B2103o361l932j607k684Q058O853n769m066Q531j0451n598m444O526R738
17290A6897l648l03J780j457R307M194r738r768J4779M83m068R16k316k492j716
17275A2850L725j0140k536O001j544K755O661p03J440Q89O415O493Q715j586J4559
17260E3994P30j9585k7283j1262l786Q836Q909P435N603J296P21P05Q90O476m720
$$ y = [17235, 23908, 33859, 31862, 28197, 27263, 14624, 9430, 7963, 13486, 27018, 27835, 23522, 26087, 33702, 37919, 32362, 39636, 50366, 47772, 30137, 20741, 28408, 41925, 46538, 50723, 42745, 34524, 20136, 23555, 23035, 11680, 11526, 19571, 27765, 21613, 19419, 26099, 30576, 32507, 27918, 25908, 22314, 34727, 27844, 23704, 17220, 15755, 23388, 17696, 17075, 15500, 10321, 9071, 21470, 26278, 28882, 22103, 15742, 11810, 10203, 7519, 15577, 22430, 16661, 12595, 21126, 10675, 5077, 633, 7159, 16897, 13249, 12946, 14726, 13269, 22576, 26770, 17032, 7264, 22043, 22526, 18458, 19374, 17058, 14566, 12850, 16575, 6435, 3899, 9900, 8356, 11111, 17772, 17069, 18509, 19398, 25813, 32306, 41021, 39435, 53994, 54724, 35139, 7856, -3406, -7192, 1644, 10553, 17988, 23591, 24887, 25608, 26313, 27203, 33679, 28959]
17245B8959o124r871J742N233N647n015j2097j3943k1909j4632p049L048J3550
17232c2461J8510J6994J5723J0017P4j566p142j089j3385j8197j2694j0446p761
17219d3423L734J6429K3677Q060K871j961j0525N258K7856K6336J220r149j156
17206D9227J0727m560q280o187j5702p793N80l302l900J6287K7559J4702J447
17193G0805L358M439n466n125R294q85j5209m359R934R946J761j6026m44J4665
17179G6688J1777K871M015J7909J7385L5603K3454k129k3649N53R355J3320R865
17166A97017p035k0233o261q97J2089K6594J6873N722m425K992J7514J7127J8198
17153B75275Q262n810j5391k2444o226M948J3892j79r046q034O676J8302J6801
$$ y = [28959, 22835, 12964, 14706, 19939, 25586, 20571, 8474, -5469, -27378, -42010, -49059, -46011, -32461, -13951, 3043, 18766, 28783, 28857, 27291, 20149, 19060, 5675, -12522, -25216, -35662, -43423, -39689, -23260, 417, 8477, 11348, 9387, -1138, 4120, 31976, 58312, 59532, 50383, 49227, 59954, 55394, 47114, 40927, 25225, 17432, 18012, 14710, 10810, 27097, 54656, 69358, 70805, 74163, 78602, 73136, 68011, 77305, 76420, 61211, 56852, 66786, 76732, 78493, 62467, 62023, 76688, 88465, 91336, 95351, 113260, 130645, 166248, 189702, 187573, 163924, 164477, 173832, 187152, 197017, 189982, 169749, 163488, 162591, 174680, 201274, 218147, 223869, 219444, 222436, 239950, 257077, 275275, 283537, 277727, 262336, 239892, 233666, 238614, 252506, 252327, 243281, 235247, 241923, 260225, 277026]
17140B77026K9225K8310O165J896J6652J8989J8313J3530J9532L8476N4529N9693
17128E82336N4435L4637L7265O1778O6629O4924N2000N5985J13485J51102J43498
17117A418074J21454J33543J89575K55215L31934M45731O33053R68731J474580
17108E971890K299206L739698O082636Q448690P601295J809067m825503p506072
17100B3620907o266373l944028k241305j158719l12962N59034J647046L229781
17092A5133381N614332Q264153Q256809L296192l011685n219541k514537K349533
17084C2168637N469093L316666k943192p653066p951335n690945l471175k007800
17076A1236883r84138j36544P47747J880481L610833O067341P724648N255685
$$ y = [277026, 306251, 334561, 340726, 342622, 359274, 378263, 396576, 410106, 429638, 468114, 522643, 582336, 636771, 671408, 708673, 770451, 837080, 902004, 954004, 1009989, 1123474, 1274576, 1418074, 1539528, 1673071, 1862646, 2117861, 2449795, 2895526, 3528579, 4497310, 5971890, 8271096, 12010794, 18093430, 26542120, 34143415, 35952482, 31126979, 23620907, 17354534, 13410506, 11169201, 10010482, 9697520, 10256554, 11903600, 15133381, 20747713, 29011866, 37268675, 40564867, 37553182, 32333641, 29819104, 32168637, 37637730, 40954396, 38011204, 30358138, 22406803, 16715858, 13244683, 11236883, 10252745, 10116201, 10863948, 12744429, 16355262, 22422603, 30147251, 35402936]
17068C5402936j205106o607829p679565n833405l740015k382351j603190j145630
17060E205845q60506o48115m87518l63478k46301j71886j30461j25563j53668
17051B018349j65833j57483j48489j46186j50911j32604j07367p6671m2703k7913
17041H62189j7565k2170m3052n8637o1932o4487m2117l4433l2946l1345k3747
17030D29758k1536k0021k6617k8964q971K231l582j8120k5686j8303r925p757
17018B42507n549j0196j4801j0239q589o974p921o693L361Q172Q438j5600q519
17005A67397k31j6326j4205m400q33o883n227j1290J75j83l207j4301n779N316
16991I0023o55Q245j223O31m677j1104j347k794q781r235j1236m188O318K317
$$ y = [35402936, 34197830, 27590001, 19910436, 14077031, 10337016, 7954665, 6351475, 5205845, 4345339, 3697224, 3209706, 2846228, 2599927, 2428041, 2297580, 2172017, 2018349, 1852516, 1695033, 1546544, 1400358, 1249447, 1116843, 1009476, 932805, 890102, 862189, 844624, 822454, 779402, 720765, 658833, 594346, 552229, 517796, 484850, 453505, 429758, 408222, 388201, 361584, 332620, 323649, 325880, 322298, 304178, 278492, 260189, 250264, 242507, 236958, 226762, 211961, 201722, 193133, 186159, 178238, 171545, 174906, 183078, 191516, 175916, 167397, 167166, 150840, 136635, 132235, 131402, 124519, 119292, 108002, 108177, 107994, 104787, 90486, 84707, 90023, 89368, 97613, 96390, 97021, 92344, 81240, 79893, 77099, 68318, 59083, 47847, 43659, 49977, 52294]
16977E2294J6754J9121J3841K634r36k9j5931m850N96l597j1365j880Q136K55
16963G5043j365J307J1522R724k91l246M601Q476J4641K45o872j545p468j3217
16949I1555k3302j1453j039j2423J145P215O690J9208J0908J1559j968q162k369
16936H7564p821j9082j5130q512k130j495RO10k652Q416j0209p275P464K40k542
16921B7455j4463l11L336J094O38K361J2939Q89n461n582j6422o951J606P572
16907H700j0773Q415J6937J296K159p56N950q7k605K618r144M09l999K303n709
16892A5714k187K325n96o047M117O530O283Q641j97L35p955J2370j643j2649p452
16877A7589n028n64K213O354K620O65m304K180L188P46n151m973p376J39M409
$$ y = [52294, 69048, 88169, 102010, 104644, 103708, 103679, 87748, 82898, 83494, 79897, 68532, 66652, 74788, 75043, 73678, 74985, 86507, 96231, 95940, 92694, 97295, 105771, 120412, 120657, 113785, 112240, 104772, 91555, 68253, 56800, 55761, 43338, 44483, 51698, 58388, 77596, 88504, 100063, 98095, 89933, 87564, 79743, 60661, 45531, 37019, 34889, 33394, 33403, 34013, 31361, 39777, 29568, 22293, 29757, 29997, 27455, 12992, 12681, 16017, 17111, 17749, 20110, 33049, 33938, 28477, 22895, 6473, -478, 1128, 8700, -2073, 6342, 23279, 24575, 26734, 25978, 31928, 31841, 29236, 31854, 22710, 23119, 19120, 21423, 15714, 13527, 15852, 15256, 9209, 13326, 19856, 26139, 34780, 34583, 34918, 26963, 39333, 37690, 25041, 17589, 12561, 11997, 14210, 20564, 23184, 23849, 19545, 21725, 24913, 25659, 20508, 15535, 8159, 8298, 12707]
16862A2707L063l617o674j992m221P540N638J3500N61r100m811r643J914N876
16848A0741R294Q08J648k991j01j978p680L379P705k394n735M571K126p380K312
16833A4325K776J816q1o081p759l304N205J114r377O829M878k678j132o413Q602
16818H720N469K007L43R58O099J0944j0380r353M66l703N21M152n315K406l582
16803I752n391N412L289j8501o631J3893J2173K374l240K893j69R90L099r23O018
16788B5038l068j346J659q658j2022m819M998J027J920j684k763j555n088l568
16774i929J2301O069j4967j163J3685M023m354n637j1837j0652O607J8021O665
16761H832J484k21n571l17l973M480Q583P550j089o0o75L564n164j693m736q586
$$ y = [12707, 15770, 12153, 5479, 3487, -734, 6806, 12444, 25944, 26505, 17405, 12594, 2951, 4865, 10741, 20035, 20843, 22491, 19500, 19399, 17421, 9741, 13120, 20825, 18431, 12696, 17267, 19393, 12013, 14325, 17101, 18917, 18836, 12755, 4996, 1692, 6897, 8011, -1366, 5463, 10341, 7663, 6531, 118, 8720, 14189, 16196, 16539, 17497, 23596, 34540, 24160, 14807, 15273, 11570, 12091, 16243, 10928, 13334, 9752, 4361, 9773, 13062, -5439, -12070, 1823, 13996, 16370, 13130, 16023, 15854, 16844, 19943, 19020, 25038, 21970, 20624, 22283, 13625, 1603, -3216, 1782, 2809, 4729, 3045, 282, -1273, -6361, -9929, 2372, 8441, -6526, -7689, 5996, 10019, 5665, 28, -11809, -22461, -15854, 2167, 8832, 10316, 10095, 4524, 4207, 234, 4714, 13297, 20847, 19758, 19698, 19023, 22587, 17423, 15730, 10994, 2408]
16745B408o447j574J2450J1328q646l170O30j2469m955K286Q657K846N564J3207
16731B2115p949j1515j1580L29j445J376R810J0478k203l51J0135M313n275o211
16717A2027l103o265J44o755j537J739M390n10K310m023l048k232j376L347R997
16702E105M021Q348j450j3451n157K124L760j0292N604N300N085k698p845k099
16688c645N200L417q969O369K358m113j335O214l75q827j3669O108R199P071L599
16673H602m899j5647p570k169Q301M922m215m239O413L853j216L788k322L31J0390
16658D323n616k951l6j022P096k958J213l512j0188j0378R047J3167Q255R986
16644A6426m312o680j931J691p954j3339o655J1861l372R569J4401N09r739L80
$$ y = [2408, -4039, -5613, 6837, 18165, 9519, 6349, 6979, -5490, -10445, -8159, 498, 3344, 8908, 22115, 14166, 2651, -8929, -8600, -10045, -8669, 1141, 11619, 9416, 9065, 19200, 23513, 18238, 12027, 8924, 2659, 2803, -3952, -5489, -3750, 640, 130, 2440, -1583, -4631, -6863, -8239, -4892, 5105, 9126, 17474, 16024, 2573, -2584, -460, 3300, -6992, -1388, 3912, 8997, 6299, -1546, -3645, 1555, 4972, -3997, 2372, 4730, 617, -718, 5496, 5121, -3706, -17375, -11267, -2068, 5003, 8602, 3703, -11944, -19514, -21683, -13382, -8460, -12675, -16914, -10501, -6648, -7864, -4076, -6398, -6067, 4323, -1293, -4244, -4280, -5302, 1794, -1164, 49, -3463, -13651, -24029, -14982, -1815, 6440, 16426, 12114, 5434, 3503, 5194, -2760, -16099, -22754, -10893, -14265, -4696, 9705, 10214, 475, 855]
16630H55p381j838k846Q990K668M17p12Pm835O138J0924K233j1142j365P317j87
16614I243l964m652j2501m18M283O550M563K747L445O018L069j4821M38m153j3886
16599a4039J005J1110M524J361O115o689l839k134l950K705K952O060J311n952
16585E40l315J494j161K437l023L316O014m292r485n465j982l756M771P087L697
16570c123M684M344k556K733n942j030J1125O355k253p902o461L659J4671J0996
16556B9300R695M225J4062J2449J4367M2442N0034K5949j1563l6751l1069k2526
16544A00614j7263r949j2352r009M666K2653K9646L3728L8595J9181L296j6063
16532A87743j4902p898J9166L5697J3052l1552n6046m7201l0391p114Q993J987
$$ y = [855, -6526, -8364, -11210, -2220, 448, 865, 153, 160, -4675, 1463, 12387, 14620, 3478, 2113, 9430, 9243, 5279, 627, -11874, -12292, -8009, -1459, 3104, 5851, 9296, 15314, 18383, 3562, 4000, -153, -14039, -13034, -1924, 2600, 3961, 10076, 3387, -452, -2586, -6536, -3831, -879, 5181, 6492, 540, -2775, -1281, -2442, -5, -3028, 288, 6302, 2010, -7475, -12940, -14922, -18678, -13907, -6820, -3123, 1561, 5905, 3349, 6082, 140, -890, 10235, 16590, 14337, 6435, -26, 3633, 18304, 29300, 38995, 43220, 57282, 69731, 84098, 126540, 176574, 202523, 190960, 154209, 123140, 100614, 83351, 73402, 61050, 52041, 56707, 79360, 109006, 142734, 181329, 200510, 203806, 187743, 172841, 164943, 184109, 219806, 232858, 201306, 145260, 98059, 67668, 60554, 69547, 71534]
16520G1534L281L248J4166K1908L8206L5561Q121k6587m6631m9741l0749q047
16508C4270p919m690j875l42o288J636m331p337J259k867j2392o05J3889P415
16494I823N959K864M161J162j1972j1444m355l600M36L659L462P911N298k731
16480A0633p873m509O905j915p448k465L29R617M313n323l29O39O708N511n433
16465I360j1783o400N277K711R081J660P053p31r590j2069o200m181M545M515
16451f752M577M30k18O13R67J726K341P174N426P173j0491j4014p747M696J0647
16436F548j3301k886R903O079K009L151k230k47o360m19r08o635j2015O719J4653
16421D061M31J767n66o643J284K086m14J1925l389j3022o470l665J0539K323k611
$$ y = [71534, 74815, 78063, 92229, 114137, 152343, 187904, 196025, 169438, 122807, 73066, 42317, 34270, 26351, 21661, 19786, 19444, 13156, 14792, 10461, 3124, 4383, 1516, -10876, -11481, 2408, 9823, 15782, 18646, 22807, 23969, 11997, 553, -3802, -7402, -6966, -3307, 155, 8066, 13364, 10633, 2760, -1749, 5156, 3241, -4207, -6672, -6343, 3274, 7587, 2264, 1935, 2574, 9282, 14793, 9360, -2423, -8823, -3546, -835, 8246, 9906, 16959, 16228, 6638, -5431, -11631, -15812, -11267, -6752, -2175, -1745, -1963, -1350, -383, 1343, 3684, 10858, 16284, 23457, 12966, -1048, -8795, -4099, 6548, -6753, -9639, 264, 6343, 8352, 11503, 9273, 9026, 2666, 2247, 1339, -5296, -17311, -10592, 4061, 4492, 6259, 5693, -950, 334, 2420, 2006, 13931, 10542, -2480, -8950, -12615, -2076, 247, -2364]
16406b364L086O1m937o67n675k085l490K609M34k689J0118k607J530o47l921L219
16390h025O143K924k342M517K928l668j067n157o817J1197j887q528K609R279
16376B106O321p28o501J80k961O03k338l941L508J381l268k510L79l655m121J680
16360a3865K263L928M507n054n765Q157J527N654K546J484k264q621q28J2110
16346E779k111j0770q998J0378R411Q68p087j9142l262Q341K072K922l626Q051
16332g174J1691O19j1048m058l754P641Q69M274p290L264J237J217n332N397p29
16317c176j0998m927N019J794N975J273N787K356N803j652K161q649J839r592
16303f987k660Q04J820j0759m010M461P303j157r684M485O114J661J165l018q422
$$ y = [-2364, 722, 783, -4154, -4821, -10496, -12581, -16071, -13462, -13028, -15717, -5599, -8206, -6676, -7323, -11244, -8025, -1882, 1042, -1300, 3217, 6145, 2477, 1410, -3747, -10564, 633, -1254, -9782, -7173, 2106, 8427, 7699, 1198, 1378, -1583, -980, -3318, -7259, -3751, -2370, -5638, -8148, -7769, -11424, -15545, -13865, -11602, -7674, -3167, -8221, -13986, -5829, -4302, 1352, 3898, 5382, 3118, -5503, -6331, 5779, 3668, -7102, -16100, -5722, 3689, 4557, -2530, -21672, -24934, -16593, -14521, -11599, -15225, -7174, 4517, 5136, -5912, -9970, -13724, -6083, -5214, -940, -8230, -4966, -3729, -2512, -7844, -2447, -3176, -14174, -19101, -14082, -12288, -6313, -5040, 747, 3103, 8906, 7254, 9415, 766, 2605, -6987, -9647, -8843, -7023, -17782, -21792, -17331, -10028, -11185, -20869, -16384, -10270, -8609, -7444, -10462, -18884]
16288a8884J2054P875k212r389J571M73Q952L723N663o985R591j132j2246q101
16274i047o583m911P027P483L30n180l621M461J66O471K973q18O654M001K246
16259A1652n42J378o500m551K89J645k461p110O71K42o477l971m111J1146P453
16244a247m517M011P238k451o442j1M22k059N900op141q542k176j70R6N950k940
16227a4085J189J5160k291o366P331p654m828Q130M511R895j3468o180l686Q58
16213a1484M897R137K593l497l100J589n026n069p674l141L977j096q002Q652
16199a7244M410j591R3J0050P06P199N851n811K466k081j1403j1533k53M579N499
16184i063J373l393M597K967N185L743j684Q92P86J448O9j0300j4444N573J072
$$ y = [-18884, -6830, 1045, -1167, -10556, -8985, -8512, 440, 4163, 9826, 2841, 12432, 11300, -946, -9047, -15630, -20541, -13514, -6031, -5701, -10881, -14502, -10041, -9875, -3404, -431, -1249, 5405, 9406, 11652, 11110, 12488, 5988, 1437, 1726, 3371, 910, -6200, -5529, -5287, -11764, -15735, -19846, -8700, -1247, -5764, -1753, 5485, 3034, -3408, -3419, -2997, -5056, 844, 838, -6303, -14845, -17021, -17191, -17095, -11145, -14085, -12896, 2264, -27, -6393, 938, -6716, -11544, -3414, 1097, 10992, -2476, -8656, -12342, -11484, -6587, 2550, 5143, 1646, -1454, 135, -4891, -9960, -17634, -20775, -16798, -17894, -25896, -17244, -12834, -14425, -14332, -4282, -3576, 3623, 9474, 3663, 6129, 4048, -7355, -18888, -19141, -14562, -9063, -7690, -11083, -6486, -3519, 1666, 5409, 3725, 4617, 5403, 6851, 6920, -3380, -17824, -12251, -11179]
16169a1179N211M269n004p491Q079j06q001o50M005J855O546p41n212J4721q99
16154E403r457m381k022Q507O350n860J224m821J1469j456p818r830k567R782
16140e477K352k860m901m609L149L432m23m869R566N688L415o477p543m652J1701
16125b508J1198n070l49m914l926k958K5J295Q757J160l694M243k884n368l648
16110h641L170O8j093k155k08M211M532q702n42M779L873J46j508M821P920q84
16094I787j3292k872J788M697j1085r202J035J1971o128q957N876k755O211N453
16080g473O006m296j574K553N876n488j3541L070J0337L123m618o64K232J0590
16066F133J1471j3081o270M168p83p474N944L963P73n993j0294m19R131P483K098
$$ y = [-11179, -5968, -1699, -6703, -14194, -6115, -6221, -14222, -14872, -10867, -9012, -2466, -3207, -8419, 6302, 5403, -4054, -8435, -10457, -1950, 4400, -1460, -236, -5057, 6412, 4956, -2862, -12692, -15259, -5477, -3125, -5985, -10886, -15495, -12346, -8914, -9337, -14206, -4640, 1048, 4463, -2014, -9557, -14209, -2508, 8690, 3620, 3271, -1643, -5569, -8527, -8502, -7207, 1550, 2710, -984, 3259, 375, -4993, -8641, -5471, -5403, -6496, -8651, -8859, -4648, -116, -8818, -9360, -4581, -708, -562, -2070, 2751, 10671, 9787, -3505, -6377, -4589, 108, -10977, -20179, -19144, -7173, -13301, -22258, -16382, -19137, -12926, -7473, -1467, -5763, -7337, -4784, 1092, -4396, -17937, -14867, -4530, -1407, -6025, -6689, -4457, 6133, 17604, 4523, -1747, 2421, 1638, -5836, 108, 4071, 4844, -1149, -11443, -11862, -2731, 4752, 6850]
16051F850k201m096J251P773P90m965O79J2011p567p789n938k10q310N447K201
16036d074M457J844O782j1643m567M528q35m438Q86O836k157m92K004K938R796
16021A1865Q325m372l967o403j79j588k100m922j314m893n176L368P631J3162
16007I437N430P185l842j3146j0675l216L857K398O607n656l75l65J786j471j161
15992c207j300M716J0377m6o267j413p44j1399j242N179J215R158K373R3j1213
15977c720r832j058k029K14p38l987M588L386Q782N199j288R982L549r663n102
15962a717q640m184K060m778k171J1938N438m798q029m993N50N195k325L727Q226
15947d501K294k500m548l319j069J418N238M889O083k780l225j726q355n155p387
$$ y = [6850, 4649, 553, 1804, 9577, 10367, 5402, 6081, 18092, 10525, 2736, -3202, -3412, -11722, -6275, -4074, 383, 2227, 9009, -2634, -7201, -2673, -3508, -7946, -7060, -224, -2381, -2873, -869, 2069, 11865, 20190, 15818, 11851, 5448, 5269, 3681, 1581, -3341, -4655, -9548, -14724, -11356, -3725, 9437, 14867, 22052, 18210, 5064, -5611, -8827, -4970, -2572, 4035, -1621, -1996, -2361, -575, -2046, -3207, -4507, 209, 10586, 10540, 4273, 2860, 2116, -9283, -10525, -5346, -4131, 5027, 7400, 7493, -3720, -13552, -14610, -16639, -16425, -17163, -21150, -16562, -13176, -4394, 805, -483, 9499, 13048, 3385, -1717, -10357, -14541, -12481, -17259, -19430, -7492, -2054, -6852, -14881, -19874, -19324, -14129, -16454, -12727, -4501, -2207, -4707, -9255, -12574, -13643, -12225, -6987, -2098, 3985, 1205, -2020, -3746, -12101, -17256, -24643]
15932b4643J3514l673L992M598J794m755q624K242L830J3353R888o179K85l71
15918E251m08q16k242o953l796J466j390o485K57J2845L079J454r371q163L484
15903a1788LN813k039Q438J050m4j3055J40R580N069M69k698R383j1165j9763
15888b0607M218Q097o89n337L605N723o135P20l708N485O083J0867l338Q4l626
15873A442p140l63M316l250K179O874K848N867o051j1902l866R133K290n696n08
15858c827m264o33N194J657k325K362O518k850q423m291L339L222m00L967J2529
15843A1775P806k102n550l414r69k360R52m915r549R00L276r22l429O40o666n50
15827a5077J5893J0730l26q587r667q727L2O449J6303o602k866J089K7p386n144
$$ y = [-24643, -11129, -14802, -10810, -6212, -4418, -9173, -17797, -15555, -11725, 1628, 11516, 5337, 5622, 5251, 4843, 4027, 1785, -5168, -8964, -7498, -8888, -15373, -15116, -2271, 808, 2262, -7109, -15272, -11788, -11785, -5972, -8011, 427, 1477, 1433, -11622, -11482, -1902, 3167, 3636, 938, 10321, -844, -20607, -16389, -8292, -8981, -14318, -10713, -4990, -11125, -10405, -14113, -8628, -2545, 8322, 4984, 5068, 1442, -5698, -6061, -1745, -4995, -2816, 4058, 6906, 12773, 6722, -5180, -9046, 87, 2377, -3319, -3827, -8091, -8724, -3530, -1873, -4198, -1836, 4682, 1832, -6591, -10882, -7543, -4321, -4721, -754, 11775, 19581, 17479, 11929, 8515, 7546, 5186, 6138, 1223, -8326, -7426, -4150, -5072, -8501, -7861, -14527, -15077, 816, 11546, 11220, 2633, -7034, -15761, -15729, -9280, 7023, 421, -2445, -1356, -1329, -8715, -13859]
15812a3859L842J0657N500n042N863P677M328o2K079m050o990j158L584p459Q237
15797A3147O540j0092p47r283q053K439M751k179n854O46O39K857q88L519K931
15782C73M622K433k286p466n062L576L570K589R33j36j954n716K246l485j1131
15767a6894O588J2690K311l918j2034L033J0424P636M992L9n343n770o629K42
15753b633M711l282O99N896L965k168o16n621j0158L303o317M524j38k021l017
15738a2873K913k748j0577O544M138K64N777M405K551J783p328j0061N353O952
15724b907K864k472m139J219p08o296j945j105K442M954j749N21L515O916m812
15709c702k92l549o31J684N951N459p67o73M922N782m093j8517r439r26M978J7892
$$ y = [-13859, -10017, 640, 6140, 1098, 6961, 14638, 18966, 18904, 20983, 16933, 9943, 8785, 12369, 4910, 13147, 19687, 9595, 8848, -435, -8488, -6049, -1298, -3477, -9331, -8685, -8046, -5189, -6077, -2558, 373, 4995, 7428, 5142, -2324, -7386, -3810, -240, 2349, 3282, 3146, 1192, -4524, -2278, -5763, -16894, -10306, 2384, 4695, 777, -11257, -8224, 2200, 9836, 14828, 14867, 9524, 3754, -2875, -2633, 2078, -1204, -505, 5391, 9356, 7188, 6572, 951, -9207, -5904, -12221, -7697, -7835, -9856, -12873, -9960, -12708, -23285, -16741, -12603, -12339, -6562, -2157, 394, 2177, -5151, -15212, -9859, -2907, -43, -2515, -6654, -5435, -6143, -12439, -14384, -15489, -13047, -8093, -9842, -9321, -5806, 1110, -3702, -3994, -7543, -8174, -6490, -539, 4920, 4153, 3480, 8402, 14184, 10091, -8426, -17865, -18791, -13813, 4079]
15693D079K243j256k347j2832j168N550O041J135K468j925j0906q40R84J824L758
15678c192j402o491m297j872M715P14l930P092L628o553J944r04J8376O864P197
15663B1889j3437o842m724n200k405o441N694o46k862m669J115O294k83m221M872
15648a1866L91l497p737l146M365P881m128l804O703l864m292L937P94N380K298
15633a0585n289M934Q396k218M662m618k689M703k134k807k336J0424k109k213
15619c879l458o268J2482J180j361K834M030l405p260l766m245p259l256L45K434
15604b0852K49J016J6044m344j0160R486J8409l190r833k752n015o978M170O940
15590f810K553J798k671N683j612j1624J822K195M245j831K606k374K646K752
$$ y = [4079, 6322, 5066, 2719, -10113, -11281, -5731, 310, 1445, 3913, 1988, -8918, -9758, -8774, -6950, -3192, -4594, -11085, -15382, -17254, -12539, -11825, -15755, -8663, -5035, -11588, -9644, -10548, 7828, 14692, 21889, 8452, 1610, -3114, -8314, -10719, -17160, -11466, -12112, -14974, -19643, -18528, -12234, -12517, -16738, -11866, -11475, -14972, -22709, -25855, -21490, -13609, -17737, -21541, -14838, -18702, -22994, -19057, -18263, -12883, -10585, -15874, -10940, -2544, -4762, -100, -4718, -7407, -2704, -4838, -7645, -9981, 443, -1666, -3879, -7337, -13605, -1123, 57, -1304, 1530, 5560, 2155, -5105, -8871, -13116, -20375, -23631, -23286, -20852, -20603, -19587, -3543, -7887, -18047, -8561, 9848, 6658, -3175, -5927, -10942, -17920, -13750, -6810, -4257, -2459, -5130, 553, -1059, -12683, -10861, -8666, -4421, -6252, -3646, -6020, -3374, -622]
15576f22K003k344j5138j3206O698J5267P644l414q452pK563M235K565O398l666
15561E24j556n833M564L173k835J867Q95r595o799oJ737n010O982P116N371m80
15545A15p700K698J79o728p937L023N568l890N111J0508l173l779j2377j911O739
15530a3554l018J613O448Q890j1071l239Q56J721l485k569O45M691k280M593O849
15515b910m81P09m3m749M876M470M36l010p563k021N615K611j795l371O37Q13
15499e776M339J1125M794j5448r146L516l58n29j008J1662O509k115p360l599
15485c394j797P80r10N053n321k975M230p628l614L766K109J654k509l015L606
15470i965n310M124O838r600o833Q359M430J741k341q738J5591N816l113p825
$$ y = [-622, 1381, -963, -16101, -29307, -22609, -7342, 302, -3112, -11564, -11571, -9008, -4773, -2208, 4190, 524, -1032, -6865, -2301, 872, -1963, -96, 799, -8796, -15595, -15601, -13864, -18874, -11892, -4776, 595, 115, -7585, -4887, -4708, -11436, -19373, -16350, -10782, -14672, -9561, 947, -2226, -6005, -18382, -20293, -13554, -16572, -14959, -8511, 379, -10692, -13931, -13075, -11354, -14839, -17408, -16763, -12072, -14352, -9759, -2910, -3391, -2682, -2725, -7474, -2598, 1872, 2308, -702, -8265, -10286, -4671, -2060, -3855, -7226, -6589, -5776, -1437, 9688, 14482, -966, -10112, -6596, -6954, -7483, -8491, 3171, 9680, 7565, 205, -3394, -5191, -4411, -5321, -268, -5589, -8564, -4334, -11962, -15576, -11810, -9701, -8047, -10556, -13571, -9965, -15275, -11151, -4313, -13913, -20746, -12387, -7957, -6216, -8557, -17295, -1704, 4112, 999, -6826]
15456f826j1568N492K716j217l511L314N251Q64M478Q0p673o920j138m373k474
15441b3505k726R719R442K224O003m421N287L889M195m287n189j7254J17J9427
15427B921n014j1656l215l811K51R122J615K226k685L881m482k576l509o522k928
15412b6382J1985O714O005J284j604j0716m018O855M047N780n026k912M168J0976
15398G156m080O70o244m149j751K049m714k559k460O707K819N863M399M749K527
15383A0982P627j858j5551n489N77J011l879Q0R84j626k390O516o941j395o385
15368a7737l993O718M172l582L279J0069P939p48j1796j4394Q725J0578O181l291
15354B120L14p16l890L84k326o598P07l14j965n422q33N441L937M59J076J27k693
$$ y = [-6826, -18394, -12902, -10186, -11403, -14914, -11600, -6349, -5485, -1007, -927, -8600, -15520, -16658, -21031, -23505, -26231, -16512, -7070, -4846, 1157, -3264, 2023, 5912, 10107, 5820, 631, -16623, -16506, 2921, -2093, -13749, -16964, -20775, -20524, -11402, -9787, -7561, -10246, -6365, -10847, -13423, -16932, -23454, -26382, -14397, -7683, -1678, -394, -1998, -12714, -16732, -9877, -5830, -50, -5076, -7988, -3820, 7156, 3076, 3746, -2498, -6647, -8398, -6349, -11063, -13622, -16082, -9375, -6556, -693, 3706, 8455, 10982, 18609, 16751, 1200, -4289, -3712, -2701, -6580, -6500, -5516, -7142, -9532, -3016, -9957, -11352, -17737, -21730, -15012, -10840, -14422, -11143, -1074, 6865, 6117, -5679, -20073, -11348, -770, 5411, 2120, 2434, 1718, -2172, -1788, -4114, -10712, -10005, -10319, -12284, -17706, -18539, -13098, -9161, -8702, -7626, -7499, -10192]
15337a0192M94J503L541J3n407j265Q06O019K740L455K444l346o688q077n096
15322a9056K934J5586N470o348j2727p013k598J2727J5042n399p815j915q86O560
15308e438J436n558k590J4422K453j0204j971K730J235M165N493M048k021m625
15294C575j045K541l085n06m108r44M818n456P525Q151k544r700J1352O550N093
15279B2217k804o980j0345l96l029o254k650J0915j980j1390j0789N284J2643
15266e558M250r651j695J065o28j539N308j314l794M290J601n803j673j317N14
15251a5944J1538J2171m113p053M81n46O801J1470j681m509m455l772o283M699
15237a196j904Q70m21k927K685l872N45L902p153J973o398j1058k203K367N09
$$ y = [-10192, -9698, -8195, -4654, -4641, -10048, -11313, -10507, -4488, -1748, 1707, 4151, 805, -5883, -13960, -19056, -16122, -536, 4934, -1414, -14141, -21154, -23752, -11025, 4017, -1382, -9197, -11112, -11998, -5438, -4002, -9560, -12150, 2272, 4725, -5479, -7450, -4720, -3485, 680, 6173, 10221, 8200, 3575, 2530, 5071, 1986, 1480, -2628, -3572, 1246, -4210, 3315, 11466, 8922, -778, 10574, 17124, 22217, 19413, 12433, 2088, 1692, -1337, -7591, -10241, 674, -1306, -12696, -23485, -18201, -5558, -1308, -10959, -12654, -11589, -12217, -13756, -8448, -9762, -13556, -9266, -7665, -13468, -15141, -16458, -15944, -4406, 7765, 3652, -3401, -2920, -3466, 3335, 14805, 13124, 8615, 4160, 388, -5895, -1196, -3100, -2230, -2651, -5578, -2893, -6765, -6220, -2318, -9471, -7498, -13896, -24954, -27157, -24790, -24281]
15222b4281R90O116P985m070M883J0459M875J0870r928j0831L938O4p246l748
15208i924m943l698l707J0951J7434k209n457j335j705l064M866M111j986j292
15194a958L242P288L879k468q059j0121p898p38O927N081q806O92J257j431l970
15179a7083N383P902N718l796p266n976K420n953M584K379o121N369K244j281
15165a1477n86K531J3122m282j6773j100M94p536P212K187M506K052P656M812
15151B818m393J459J034j769m31j3164N526m488k471m942k826N110R891J3217
15137D571p235k184O916P727M219l69j9585M363Q840M189r18R747K412j1625k711
15122H357O506R258j0507j0862j1081J163J230N030N816L23J430O347m035r955
$$ y = [-24281, -23291, -17175, -9190, -13260, -8377, 2082, 6957, 17827, 7899, -2932, 1006, 1070, -6176, -9924, -14867, -18565, -22272, -11321, 6113, 3904, -1553, -2888, -4593, -7657, -2791, 1320, -666, -1958, 1284, 8572, 12451, 9983, 1924, -8197, -16095, -16833, -9906, -4825, -13631, -12939, -11682, -13113, -17083, -11700, -3798, 1920, -1876, -9142, -15118, -12698, -18651, -14067, -11688, -17809, -12440, -10196, -11477, -12063, -9532, 3590, -692, -17465, -18565, -18071, -25607, -18395, -16208, -11702, -9650, -1994, 2818, -1575, -116, 918, -851, -1282, -14446, -8920, -13408, -15879, -20821, -23647, -18537, -8646, 4571, -2664, -4848, 2068, 9795, 14014, 13645, -5940, -1577, 7263, 11452, 10534, 20281, 22693, 11068, 8357, 14863, 24121, 13614, 2752, -8329, -7166, -5936, -906, 4910, 5233, 6663, 13010, 8975, -980]
15108i80j725n660o67l731l409k785M329K563P233j975n850j4360k194O527K519
15093b0165J3509O39O32l202P095j923m265J758n57o645K319q03l37L924N83n72
15077h010J078j752K147L652O526P024m645p543K028J36j927R76L88Q422l585
15062D915j1479O054j226L89J3332o674q145M32K002o047p019Q80o5L613L150
15047e888O114j963R66m602p904j4126n841J487J2930M976O733m01M034j753o696
15032a1934k390l181L122K492J0721J0787J171k706j1303N12M770P70l44o83J012
15017B816j1158p391o010l246N730L437R44j1194o316P365Q499P830N256Q356
15003D918o999p433k810Q620Q628j509l017N437p907q339j344m36N07n252k929
$$ y = [-980, -2705, -8365, -9032, -12763, -16172, -18957, -14628, -12065, -4832, -6807, -12657, -27017, -29211, -22684, -20165, -6656, -6017, -5385, -8587, -1492, -3415, -7680, -5922, -6479, -13124, -10805, -11608, -11945, -8021, -7438, -8010, -6932, -8684, -6537, -2885, 3641, 10665, 6020, -1523, 505, 641, -1286, -310, 78, 8500, 4915, -6564, -510, -1736, -1347, 11985, 5311, -2834, -2402, -400, -6447, -13466, -12586, -12651, -9038, -5888, 226, -1737, -771, -5373, -13277, -27403, -33244, -31757, -18827, -13851, -7118, -7519, -3485, -5238, -11934, -14324, -17505, -14383, -11891, -1170, 9617, 10788, 8082, -3221, -2709, 2061, 2831, 2487, 1804, 2816, -8342, -15733, -21743, -24989, -19259, -15822, -14878, -26072, -32388, -25023, -16524, -8694, -3438, 4918, -2081, -9514, -12324, -3704, 4924, 3415, 398, 5835, -2072, -10411, -11755, -12191, -11684, -16936, -19865]
14988a9865J3501J2265N90j270q58K470l593r966n702O607J1709p314p897N214
14974d109n25K922J844q17O188L377K443O395l140r383k096m05p794l312p613
14959a6025N329k415k158j386N397N791k749n819o418JJ7280Q352j992L496j08
14944F576q943n430m694K272m510K179J036k704j856r55k033l993J1395N967P08
14929d985l619Q99N096J245l324o927J0648Q165L188o314N797l248m368L114j065
14914D302J228J348p073N90q339o922M320M193M567N246q42J863o836p993j3234
14899b3582R995M810n48N643m39r213L22K520P871O836R31j3369k292J1126r559
14884h948m820M450N399j0095o000N990Q343L41k129N207O407M739M630j0556
$$ y = [-19865, -6364, 5901, 6491, 5221, 4363, 6833, 3240, -6726, -12428, -5821, 5888, -1426, -9323, -4109, -4634, -1712, 132, -685, 5503, 8880, 11323, 17718, 14578, 5195, 3099, 2694, -5100, -8412, -16025, -10696, -13111, -15269, -16655, -11258, -5467, -8216, -14035, -20453, -20452, -3172, 5180, 3188, 6684, 6576, -2367, -7797, -12491, -10219, -14729, -12550, -11514, -14218, -16074, -17029, -19062, -23055, -11660, -5693, -4985, -8604, -7705, -2609, -1364, -4688, -11615, -967, 7198, 10386, 4072, 9869, 6621, 2253, 5367, 4302, 5530, 6878, -195, 395, -7944, -14866, -10546, -6353, -1786, 3460, 2618, 4481, -2355, -10348, -23582, -13587, -8777, -9325, -3682, -4121, -13334, -13012, -10492, -2621, 4215, 5146, -8223, -10515, 611, -8948, -13768, -9318, -3919, -14014, -20014, -14024, -5681, -5340, -7469, -2262, 4145, 8884, 13514, 2958]
14870B958j881P238L531n165q462o447k177J218J664k035K667k202l604K594P184
14855b919Q619L687m372p504q676K932p142l165L46Q154j1614n741M069M875J0241
14840h210J1147J916o826k081R91L697p187o063K914O155m911j0360K622M029
14826a2167M740m692O78l676J498M183k954k381r425K578N552J202L831K144K353
14811f536j307o578p595P854P941p401k830P587J0549J071l491j3272J47J108
14797a2753o941M019J5029M880n165n686l709l965o101k908N306K160M833p85
14783a1786r02N8n260l112Q288Q128K376r22k806r04L802k093K548L198L364m015
14767c8N343L752p851o070K431L042J188M945p94p585r147R59Q398k349K065m522
$$ y = [2958, 1077, 8315, 11846, 6681, -1781, -8228, -10405, -9187, -7523, -9558, -6891, -9093, -12697, -10103, -2919, 5700, 9387, 5015, -2489, -11165, -8233, -15375, -18540, -18194, -10040, -21654, -27395, -23326, -18451, -8210, 2937, 4853, -1973, -4054, -3063, 634, -6553, -12616, -9702, -3547, -8458, -18818, -16196, -12167, -7427, -12119, -11441, -15117, -13619, -9436, -12390, -14771, -24196, -21618, -16066, -14864, -11033, -8889, -6536, -7843, -14421, -22016, -14162, -6221, -13622, -16452, -8865, 1684, 2755, -736, -14008, -13861, -12753, -19694, -15675, -646, 4234, -931, -6617, -10326, -14291, -20392, -23300, -17994, -15834, -11001, -11786, -12688, -12630, -17890, -21002, -12714, -4586, -2210, -3132, -5938, -6842, -3040, -5133, -2585, 613, 3977, -38, 5305, 9057, 1206, -4864, -2433, 609, 1797, 6742, 5948, -1637, -10784, -9825, -1427, -3776, -1711, -6233]
14751f233p927j259J492N918j409J553L913m244k267q485k343k136o876r80J2135
14736a9148O356M966k257J25L11L115M59K091p619n494m855L787R06P413j423
14721a1267k043O55j002J712r33l432P581Q415k778L011O407L956O605j4705q641
14706f459j395k56K660j52K536M224q16J789Q079n615j0315r471M224N763L494
14691a710J355P233O135m646j6681q285N426J357N248L883L160K11o477j788j786
14676g365n233Q158J3386N40o193m442K44l76l585K01J268j78p599j0788r364
14661c1326J963R99m095P779J4051J650o164q743m014l313J838N255N318L345
14647a5457P096P208k617r087K943L255J4103J519o710R97L452l643o116k723
$$ y = [-6233, -14160, -15419, -13927, -8009, -9418, -7865, -3952, -8196, -10463, -18948, -21291, -23427, -30303, -31283, -19148, -12792, -7826, -10083, -9958, -9647, -6532, -6073, -3982, -11601, -17095, -21950, -18163, -17257, -9844, -11267, -13310, -12655, -13657, -11945, -12878, -16310, -8729, -314, -3092, -81, 6326, 10282, 16887, 2182, -6459, -7854, -8110, -5450, -5602, -3066, 1158, 342, 2131, 10210, 4595, -5720, -15191, -10967, -5204, -1710, -355, 6878, 13013, 8367, -8314, -16599, -11173, -9816, -4568, -685, 2475, 2686, -3791, -5579, -7365, -12598, -4440, 8946, 9486, 3293, -1149, -905, -1281, -4866, -4665, -3397, -3575, -11174, -21962, -31326, -29363, -28364, -32459, -24680, -10629, -8979, -15143, -23886, -27900, -31213, -29375, -24120, -18802, -15457, -8361, -1153, -3770, -12857, -9914, -6659, 7444, 8963, 2253, 3250, 6702, 3059, -3057, -5780]
14633e780r862m089O445O742m871o112o789R231J2032J125L666o950j295N100
14619a407P0L920J457k806k367l850M98N341J632n915l893j722N977M046q228
14604g247p397J855m15p11O039p598k122J2005Q04p882k777o039P306P193o229
14589a3215L386o95j271l930n276j058J2433R50k200m434J929l498M72M816R038
14574b553j814m729M875o213M610P565R76k642j2330n096n618j303O48k615o350
14559c2589j799J4184O660m225Q424Q311J1886l08q099j687j700l662o006j729
14545a2339j1339R90Q336P270m636M065O454k338j2033K863Q150L406j846m160
14531g157o999Q31L085J685J44L383K916N672j3721o543q524l43M819J930J1033
$$ y = [-5780, -15642, -19731, -13286, -6544, -11415, -17527, -24316, -15085, -3053, -1928, 1738, -5212, -6507, -1407, -1337, 2583, 4040, 1234, -1133, -4983, -4485, 856, 2488, -3427, -7320, -9042, -3065, 981, -7247, -14644, -12789, -13204, -13915, -7876, -15474, -17596, -5591, -4787, -12669, -15446, -21485, -14179, -6986, -13215, -9829, -10524, -11795, -15725, -21001, -22059, -9626, -8676, -10876, -15310, -13381, -16879, -16407, -11591, -2553, -4367, -9096, -4221, -10434, -5824, 1741, 2717, 75, -12255, -17351, -22969, -24272, -23624, -26239, -32589, -34388, -20204, -13544, -17769, -9345, -1034, 10852, 10544, 2445, 758, -942, -4604, -10610, -12339, -23678, -22688, -14352, -7082, -11718, -7653, -1199, -3537, -15570, -12707, -4557, -1151, -2997, -7157, -14156, -13325, -10240, -8555, -8411, -5028, -2112, 3560, -10161, -16704, -25228, -25571, -20752, -18822, -7789]
14516g789Q542l319k068K742j686N175l964n56q459N46L663k186r448k268Q024
14501a3051O461j681M31n917k607N349P153n10k408k790Q20k02n888J425M315
14486i100l850J824J097j462L677L972N189n772Q6J889n335p730J609K746L966
14471g194j875q820r35N307J979L27J195M483j1304N334J0244k35n208l28n100
14456a2130M635Q479m249L125M597o238O42j087L821K494n89K204M1j2122L23
14441f054l531J451j076j883M12Q695K751k679n351n714Q144L679J193k442K189
14426b16M547J435j0793O365j736k0674J03N399K629L998L002K840m555J956J3436
14411G736L450q347p651L979J910r4J325k324j0462P019M498P15j259j609L202
$$ y = [-7789, 753, -2566, -4634, -1892, -3578, 1597, -2367, -2923, -11382, -10836, -7173, -9359, -18807, -21075, -13051, -6590, -8271, -7840, -13757, -16364, -11015, -3862, -4372, -6780, -9570, -8750, -8952, -14840, -13415, -9100, -12950, -11126, -10029, -11491, -7814, -3842, 1347, -4425, -4339, -2450, -7785, -15515, -13906, -11160, -7194, -9069, -17889, -18824, -13517, -11538, -11211, -10016, -5533, -16837, -11503, -1259, -1494, -6702, -7030, -12130, -7495, 984, -3265, -140, 4457, -1781, -1139, -2226, 1595, 4089, 3500, 5704, 5745, -6377, -6054, -9585, -8134, -9210, -11093, -10681, -1986, 765, -1914, -7265, -12979, -4835, -1156, 37, -2405, -216, 4331, 5766, -5027, 1338, -398, -21072, -20969, -15570, -12941, -8943, -5941, -3101, -7656, -5700, 7736, 11186, 2839, -4812, -833, 1077, 983, 2308, -16, -10478, -3459, 1039, 1754, 495, -1114, 2088]
14396B088m219M283k926j9440p786J1855J3370L605q373k750J899k144J053L282
14382f203M16j1N719O45j2619K442J1011k210k690J067o799j426N081l766q201
14367a7544M579J0394M820o572l813m19J3634N731r286q18k113K060L88o410L062
14352b307J087p12M919R232o996j3870N554l749q286J681J3066R87l54M719J304
14337F275L023o941j5429l737L238k694n170Q337m576l505J105M982k08L729l00
14322a1871r867j0302R33J8676O448L477K584l132l193n949P25j246q360o460
14308b7537M652J1859N157J1363M761l183j2558l768r38O917k057n89o510k225
14294a4656n719M052M101Q829n639m525K812M726j508p895n262l464O034O314
$$ y = [2088, -2131, 2152, -774, -20214, -28000, -16145, -2775, 830, -7543, -10293, -8394, -10538, -9485, -6203, -5787, -5798, -79, 566, -12053, -9611, 1400, -810, -3500, -2433, -9232, -10658, -5577, -9343, -17544, -12965, -2571, 2249, -4323, -8136, -8555, 5079, 10810, 1524, 706, -1407, 653, 1041, -5369, -2307, -1220, -1932, 2987, 12219, 5223, -8647, -3093, -6842, -15128, -13447, -381, 606, 252, 4971, 6275, 9298, 2357, -13072, -16809, -13571, -16265, -21435, -13098, -17674, -21179, -20074, -15092, -15300, -11571, -11871, -21738, -32040, -31107, -12431, -5983, -2506, 78, -3054, -6247, -12196, -11471, -12717, -21077, -27537, -22885, -11026, -5869, 5494, 10255, 7072, -5486, -9254, -10192, -3275, -5332, -5921, -12431, -14656, -20375, -16323, -12222, -3393, -9032, -13557, -10745, -6019, -7527, -15422, -20684, -24148, -18114, -11800]
14280a1800L781M878O0j1150m551M305K332l54M911M788j006k615o243o537k592
14265b1793J0760L502k232l741J3506M072K277j1386j0016J1424k471r195L702
14252a1591R965L359M21j0871n796K197j415M156L807P666j619n727K5J2283l510
14237C350o33n90m671k741n895M485J699J277m184m466M097Q036K949j325p091
14222e703q75l619l125k585j139l095P261R511L738q501M30j5j066N62N39M473
14206c209L306k383l191q474P364J3395O442k004m231o747n936m735K680O746
14192i77o409k311M964P286r20m44J396o837K129l820K126P295K356l719J006
14177C121n898m238j019L891o680Q744J3589m300p97m787p336J74K371O479N104
$$ y = [-11800, -8019, -3141, -3081, -14231, -18782, -14477, -12145, -12499, -7588, -2800, -3806, -6421, -12664, -19201, -21793, -11033, -7531, -9763, -13504, 2, 4074, 6351, -5035, -15051, -3627, -6098, -15293, -11591, -1626, 1733, 2154, -8717, -14513, -12316, -13731, -9575, -5768, 1898, 279, -5448, -5423, 6860, 3350, 2717, 2127, -2544, -5285, -11180, -6695, -4996, -3719, -7903, -12369, -8272, -236, 2713, 1388, -5703, -6578, -10197, -13322, -15907, -17046, -20141, -12880, -3369, 369, -8132, -7702, -7717, -8783, -8221, -7682, -3209, 97, -2286, -5477, -13951, -6587, 6808, 13250, 11246, 7015, 268, -5668, -10403, -7723, -977, -7386, -9697, -4733, 2553, 1633, 1189, 2585, -4252, -2123, -5943, -3817, 3478, 5834, 2115, 3121, -2777, -7015, -8034, -4143, -10823, -2079, 11510, 7210, 6413, 1626, -5710, -5536, -3165, 3314, 8418]
14162H418o648q133K22P069l456m940l303P154J207J795k283o501M26O194k15
14147b994n228j568L687R459l823j0453O379J2013Q049p782j0971J292Q727j1281
14133d494q038J21K151P458Q327l342l743m131q48l512q420N833O402k41O36J376
14117d465J003J186o950p487l425J0000J4401J599j6800j440M484o44L364p670
14103a2844n433l405J270J0010M430n7K357Q471j440K372p251p324n384K300N102
14088f826n57j0738n476p57j903M988Q480M909l969O919J5113j849n032j343K54
14073B213O28j628j5858j1828M043J1584Q60j94N071k442l183O984J953K352O40
14058A195Q498M167p275m917l379p807m306k142N905J244R81K109N629l096n017
$$ y = [8418, 1770, -6363, -6141, 928, -2528, -7468, -10771, -3617, -2410, -615, -2898, -9399, -8973, -2779, -2994, -8222, -9790, -6103, 3356, -467, -10920, -4541, 7472, 15521, 7739, -3232, -1940, 6787, -4494, -12532, -12411, -10260, -2802, 5525, 2183, -1560, -5691, -6539, -10051, -18471, -12638, -6236, -6477, -5841, -4465, -3462, -2276, -9226, -16713, -20138, -10138, 4263, 5862, -10938, -12378, -7894, -8538, -5174, -12844, -18277, -21682, -20412, -10402, -5972, -6029, -3672, 4799, 3359, 5731, -1520, -8844, -14228, -11928, -6826, -7383, -18121, -23597, -24354, -26257, -21269, -12789, -7880, -11849, -4930, 10183, 8334, 3302, 1959, 2213, 2841, 1213, -14645, -26473, -22430, -10846, -9986, -10180, -5109, -7551, -10734, -3750, -1797, 555, 1195, 9693, 13860, 6585, 1668, -1711, -9518, -13824, -15966, -10061, -8817, -7836, -5727, -98, -3194, -8211]
14043h211P438M383K554k701K51k213n560M360K131q485m124M790O88j0161j262
14028a6122L829k523P077j0202o386j543Q943k597K064K106k265N52j800J91Q021
14013a0655L134n301k308l450q302Q59O843K158L320K808L653J287M993r191k384
13998a2536L897n669j0512k61P721L028p870L692J205o533O038P654l616l161
13984a6923R24R396l942P808O799J0653R03q071k238J132k687M357l842j582l220
13969e33L229L537J108j190O377l258o474J408l632l458n602r639p690L566P287
13954a4964J0958k149q685M464Q985M254R705J366j473r719l934m356M68k094
13940g174O656J1167j1150j0190J592P681K669j3688n143o19P471N89M750K027
$$ y = [-8211, -773, 3610, 6164, 3463, 3714, 1501, -4059, 301, 2432, -6053, -10177, -5387, -4699, -14860, -16122, -12293, -14816, -7739, -17941, -24327, -25870, -16927, -19524, -17460, -15354, -17619, -17067, -18867, -18676, -10655, -7521, -12822, -15130, -18580, -26882, -26023, -19180, -17022, -13702, -10894, -7241, -5954, -961, -10152, -12536, -8639, -14308, -24820, -25081, -17360, -14332, -22202, -18510, -17305, -23838, -17800, -10146, -13762, -16923, -15999, -6603, -10545, -2737, 4062, 14715, 15618, 7547, 5309, 6441, 3754, 8111, 4269, 2687, -533, 2696, 6233, 7341, 6151, 12528, 9270, 2796, 4204, 572, -2886, -8488, -18127, -25817, -22251, -14964, -4006, -6155, -14840, -10376, -1391, 2863, 12568, 13934, 12461, 2742, -1192, -5548, -5080, -7174, -518, 10649, -501, -10691, -9099, -1418, 1251, -12437, -17580, -18199, -10728, -10139, -5389, -3362]
13926c362j122m160J434j189O683J583r098k433k66L547J0910p83K709O43q487
13911c391j4068L271P178O176N504J62m469m644r974j574L340J438J5186N042
13897I177o627K399M506P209M37n266J258m74k406j3457o177Q521k977L250K646
13882B019j253J037M750k279r055K997O454P612j230m724M724M115n546o108r843
13867f330O397R437n658J022l447j659j045q404J85O865L431k498q556p472P637
13852a0095K179l875M91P900M594l73L73J447R09J386r839l440Q82k544M933M653
13836d19l659n050J0480R239j504k018l727l064M516N414L15p881l256j196L364
13821A554p157j247N429n993J956P977r684k3860L958Q038K2030R209J544k209
$$ y = [-3362, -4484, -8644, -7210, -8399, -1716, -133, -9231, -11664, -11930, -8383, 2527, 1744, 4453, 5096, -3391, -17459, -14188, -7010, -834, 4670, 4832, 363, -4281, -14255, -15829, -12489, -11051, 4135, 9177, 2550, 4949, 9455, 16664, 17101, 11835, 13093, 12619, 10213, -3244, -9421, -900, -3877, -627, 2019, 766, 1803, 6553, 4274, -4781, -1784, 4670, 12282, 11052, 6328, 11052, 15167, 9621, 3513, -6330, 67, 9504, 3846, 4868, 1421, -238, -1283, -9687, -9502, -2637, 794, -1704, -10260, -17732, -10095, -7916, -11791, -11300, -3400, 1194, 821, 1194, 2641, 3550, 4936, -4903, -8343, -7461, -10005, -5072, -419, -4078, -9128, 1352, 10591, 9087, 7069, 3342, 278, 4794, 10208, 10523, 2642, -614, -1810, 1554, -5603, -6850, -1421, -7414, -5458, 2519, -7165, -31025, -27067, -19029, 3001, 12210, 13754, 11545]
13807A1545K196M407K524j2719n423K77n01m962j1150K077J1822J319n298J110
13793b776l203j0558N914R617L959q107M616n445J501J424J151Q466k348n871
13779a660L48j187L577m413l149j967O402J0503N496J286j0489Q014m877o189
13765A695j1870m03J0117J5897n922j2028o448L910P435j544p793N723P658m858
13751A569o467m812J989k708l857L420K517R517N306j680k64M716l016o159j0906
13736a0835J158J2450M188n642o608j1862J0847l01q656n120P444J6502q80q942
13722f257q191L625o831K529O400K524o581M132M727O160k756j897K784j342l895
13707d869l39J530K05N848J1419P000r7l795k808q270o089k955R788L147L639
$$ y = [11545, 13741, 18148, 20672, 7953, 2530, 2807, 2306, -2656, -13806, -11729, 93, 1412, -3886, -2776, -5979, -16537, -10623, -1006, 2953, -5154, -538, -5983, -4482, -3058, -1907, 6559, 4211, -1660, -1312, -2499, 1078, -3335, -6484, -8451, -2049, 8454, 13950, 15236, 4747, 12761, 7884, 1695, -10175, -10578, -461, 15436, 9514, -2514, -8962, -5052, 2383, 839, -6954, -1231, 6427, 1569, -4898, -9710, -7721, -10429, -14286, -10866, -8349, 1168, 6474, 4794, 4530, 9246, 6230, 71, -10835, -9677, 2773, 6961, 1319, -5289, -17151, -6304, -6605, -15261, -20381, -12937, 3565, 2685, -6257, -14448, -10823, -17654, -15125, -8725, -6201, -12782, -8650, -3923, 2237, -519, -2416, 368, -974, -4869, -5208, -3678, -3473, 2375, 13794, 20794, 20697, 16902, 14094, 5824, -265, -3220, 6568, 9715, 13354]
13692A3354m745j1113o876m236k270P098r10j182O329K727J190l145N95K338k374
13677c220r150M915M176j0152l110Q659R854J5352P75j2379k21n294L913K230
13663F348j1143r123j953J3745M073Q297J1184M707j291M068n633j0853m924L055
13649A0557q02j6034j0472j764m33j2020J6636J4772n487n438K794n410j817J1488
13635c430M295m907N930K244j730M72p043n001O26Q026K198l270l9L418n809j2850
13619a6870n220K400J229R29k446M222J2867M955L350Q343J748j0892m697m872
13605d954j930J01j196q18p130N955J5139m605L230q03J027K777l60K524o90l320
13589D947k632p07m245M281L020N495o012j162O926k82M302o802l965m108k393
$$ y = [13354, 8609, -2504, -9380, -13616, -15886, -8788, -9698, -10880, -4551, -1824, -634, -3779, -3184, -846, -3220, -12370, -7455, -3279, -13431, -16541, -7882, 1972, 17324, 18099, 5720, 5499, 205, 4118, 6348, -4795, -13918, -15871, -2126, 1947, 10244, 21428, 26135, 24844, 28912, 23279, 12426, 7502, 10557, 9755, -6279, -16751, -18515, -18948, -30968, -14332, 440, -5047, -10485, -7691, -13101, -14918, -3430, 865, -4042, 1888, 4132, 2402, 2874, -4169, -9170, -8544, -518, 1680, -1590, -1629, 1789, -4020, -16870, -22090, -19690, -18461, -17532, -19978, -15756, -2889, 2066, 5416, 13759, 15507, 4615, -82, -4954, -6884, -6783, -7979, -8797, -15927, -9972, 5167, 562, 3792, 2989, 4016, 6793, 6433, 8957, 8267, 4947, 2315, 1608, -2637, 1644, 4664, 10159, 4147, 2985, 9911, 9629, 13931, 7129, 3164, -944, -3337]
13574c337N64j4203o671N654P046K641J2787L742j980J74K036N25q585k668Q790
13559F515j204M18J199J380L066l330j53k534n065r98J363J036J705q345K954
13544a993K195K326o509q606m473O972J3947Q048j2434k442n507o27k16L185L376
13529b758P902K959j632L690l712l849l114K51j215J523j281m572K208j06J0632
13514F926M396n870k061M606q66p231o770O195l939Q91L691O054R99K043K208
13499A1272j858j95K510l154l301n398M098K308m535M920J540j622q003K187P01
13484A470L256P872m535Q695k923p968J96o615l73R800J7503j871L934o009p999
13469A4433l047l166M87j261k650k170p263K726J2699J22L303N099j87o513O72
$$ y = [-3337, -2773, -16976, -23647, -17993, -10947, -8306, 4481, 8223, 6243, 6417, 8453, 8978, 393, -2275, 6515, 5311, 5729, 6928, 8308, 11374, 8044, 7891, 5357, 292, -706, 657, 1693, 3398, -4947, -1993, 202, 2528, -3981, -12587, -17060, -10088, 3859, 11907, -527, -2969, -8476, -9103, -9319, -6134, -2758, 5144, 8103, 6471, 10161, 6449, 2600, -514, -263, -1478, 45, -1236, -5808, -3600, -3706, 6926, 11322, 5452, 3391, 7997, 7131, -100, -6870, -675, -4614, -3723, -32, 6022, 7021, 9064, 11272, 9414, 9219, 11729, 8575, 5274, -124, 3974, 6282, 1747, 6667, 8207, 6585, -1418, 769, 1470, 4726, 12598, 8063, 16758, 13835, 5867, 6063, -552, -925, 8875, 26378, 24507, 28441, 22432, 14433, 11386, 8220, 8707, 7446, 4796, 2626, -4637, -1911, 10788, 10910, 14213, 19312, 19125, 12612, 13284]
13454A3284j524l430o58O871J0355Q774j163n003j6194j1845j736J1091P214N551
13440B1587N631j06n368j964N194R066n230j5794m372l295j983j367J6870Q994
13426B7863l649J685J523R340j731o381p102N716J4524K856N470J4056O343P631
13412G8144O184P208J3451K2051M2943L6784M3115R1608J63275K88101N04634
13401A297498P09428M85449j58615n93932o00013l88430k31760j43667q0435n4436
13391B41087m6487k8563j1617j5125j1330j9117k0210p524j8139j2366k615m173
13379D3821o837m718l03P078O956P834j324l558K52m574p94o272j5602M795M116
13364C0870J654J176J108P005N736q099M686o96q630J658q556q771j472J723j298
$$ y = [13284, 11760, 8330, 7672, 14543, 24898, 33672, 32509, 27506, 11312, -533, -2269, 8822, 16036, 21587, 27218, 27112, 21744, 19780, 24974, 34040, 28810, 13016, 8644, 5349, 3366, 1999, 18869, 27863, 24214, 25899, 27422, 36762, 35031, 28650, 21548, 27264, 41788, 44644, 50114, 64170, 70513, 78144, 84328, 91536, 104987, 127038, 169981, 206765, 249880, 341488, 504763, 792864, 1297498, 2006926, 2492375, 2333760, 1739828, 1139815, 751385, 519625, 375958, 295523, 241087, 194600, 166037, 154420, 139295, 127965, 108848, 88638, 81114, 62975, 50609, 47994, 43821, 36984, 32266, 31963, 39041, 45997, 53831, 52507, 48949, 49201, 44627, 43833, 37561, 21959, 26754, 30870, 32524, 33700, 34808, 41813, 47549, 39450, 44136, 43440, 34810, 36468, 27912, 19141, 17669, 19392, 18094]
13349A8094N67K179p230j3419m300P399L436m840L752J5097J2926K00M158q203
13335B9816r537P177R105K266l994l642K484o344M437l345r80J885L473M386M137
13320D1324J411q565k352l657K939L403N898R097j0600q379N229K046j2101k958
13306B2735L728J0049k435j1097m658k740k300J3567J1426J586r604j2977j07
13293A7173J3982P149J793m058J115m343k407n082M517Q865J2402R323j4183k2122
13279B4124N074J0213J6776R261L186j1970j6983n357O351N300Q986l782l609
13266D7570j0462O42O411Q606K73m473k637j1330L24O050P349N115L632k813K278
13251E6535o143j3890m620O155J0865K4624K4477N492L227j3237j9529k6726j7824
$$ y = [18094, 18661, 20840, 13610, 191, -4109, 3290, 6726, 1886, 5638, 20735, 33661, 33861, 38019, 29816, 20279, 27456, 36561, 38827, 34833, 31191, 33675, 27331, 31768, 28423, 27443, 29328, 32801, 37187, 41324, 42735, 34170, 31818, 28161, 31100, 34503, 40401, 49498, 38898, 30519, 35748, 37794, 25693, 22735, 26463, 36512, 34077, 22980, 18322, 15582, 13282, 26849, 38275, 39861, 30257, 17280, 17173, 31155, 38304, 40097, 36039, 37154, 32811, 30404, 25322, 29839, 38704, 51106, 60429, 46246, 24124, 29198, 39411, 56187, 65448, 68634, 56664, 39681, 34324, 40675, 45975, 54961, 51179, 47570, 37108, 37750, 44161, 52767, 53040, 48567, 45930, 34600, 34924, 40974, 48323, 53438, 57070, 54257, 56535, 50392, 36502, 31882, 38037, 48902, 73526, 98003, 103495, 106722, 93485, 73956, 47230, 29406]
13238B9406m682q496M769l327o679M249p031L160o585n624m436J485m433M542
13224c682J2130L231n292L449M922q575n399j295L369o52j0863L050J0497J1840
13210A6730J3597J6990K0107K008m687o337M078J4048P172J3061J285J5500L3209
13197A46761R855M831K0020K4342K4558j6345l3812k2897l802M21k5863m2793
13185H5276l5869j1209K4693J7993Q68q390J0067M918j0484o222k735j4623p260
13172D7023O186K935N455M548j687j2932j3168L397n339r888J1147k567j5366
13159A9744j4557K961O897K0484J9651M614j4107p685O636J0378R866J3411J1276
13146H9569n791k876j6804k5938k2252j5098j6653n026K3268M0597M4018K3715
$$ y = [29406, 24724, 16228, 20997, 17670, 10991, 15240, 8209, 11369, 4784, -840, -5276, -3791, -8224, -3682, 8448, 11679, 6387, 9836, 14758, 6183, 784, -511, 2858, 2206, -8657, -5607, 4890, 16730, 30327, 47317, 67424, 69432, 64745, 58408, 62486, 76534, 83706, 96767, 98052, 113552, 146761, 156616, 161447, 181467, 205809, 230367, 214022, 180210, 157313, 153511, 153932, 128069, 85276, 49407, 38198, 62891, 80884, 81752, 73362, 83429, 88347, 77863, 71641, 68906, 54283, 47023, 53209, 56144, 61599, 66147, 64460, 51528, 38360, 41757, 36418, 26530, 37677, 35110, 19744, 5187, 8148, 15045, 35529, 55180, 59794, 45687, 38002, 44638, 55016, 64882, 78293, 89569, 83778, 80902, 64098, 38160, 15908, 810, -15843, -20869, 2399, 42996, 87014, 110729]
13134A10729k320J0510M267j3787j7444k9931m8213M987K7587O03j7548j019J3347
13121D1768M649K629q05J4926J7177J3548O377J0710k761o345p922P86L863k779
13107I5821o124K241J1635K6994J8392J0183o598J844R472O465K5718N5502M7061
13094B98606m1959j25977j19475o3411j9917r931J3935J6235J7085o038j6565
13083e7412j1241j148O474J3698O720j0088j3693n045j3081k5551k6965l7535
13071a74867n8048q7439p6247J4830J78644L13321K31578M1603j0585j2357j3931
13060C46502k4342k5250k8625l5358j9624k4131j5910O466P210J2097Q649o382
13048B01302p986o569L578l242k401J4196J7384N110k103L729J3746n829q131
$$ y = [110729, 108409, 118919, 123186, 109399, 91955, 62024, 13811, 18798, 46385, 46988, 29440, 28421, 41768, 46417, 49046, 48241, 63167, 80344, 93892, 100269, 110979, 108218, 101873, 93951, 94737, 98600, 95821, 89697, 91938, 103573, 130567, 148959, 159142, 152544, 154388, 163860, 170325, 196043, 251545, 298606, 256647, 130670, 11195, -52216, -72133, -82064, -68129, -51894, -34809, -40847, -57412, -68653, -69801, -63327, -49629, -42909, -52997, -66690, -71735, -84816, -110367, -137332, -174867, -232915, -320354, -396601, -381771, -203127, 110194, 341772, 383375, 372790, 360433, 346502, 322160, 296910, 268285, 232927, 213303, 189172, 173262, 179728, 186938, 199035, 207684, 201302, 193316, 186747, 190325, 187083, 184682, 198878, 216262, 221372, 219269, 222998, 236744, 230915, 222784]
13035B22784p819O69q715l072M627J7462Q787K584j941J1905K3994K0315P564
13022B99144o340j6205j7432j7113JJ6184j703j4932j6678m389J7133K2762J4199
13009B74631O634J685j2592j618J2752O264J352j931j7283m1219j5421K0244M9758
12996B83256O1170M2454M5243M3026J325j8419r463R532K9678N0257O6861N7431
12984F62351N7830K8707O998J2843K2681P0683P6653M6952K7254N2952Q2722O3376
12972A212002M6166O7711P1314J31011J93308K01124K14176K28472K16493J65990
12962B747767J84879K78927L54567L72161M22053N14902P10714R68502J257238
12953G811710J562761J942477K281371K271696K148522K570726L570907N227911
$$ y = [222784, 214965, 215634, 206919, 203847, 208474, 225936, 234723, 237307, 235366, 247271, 271265, 291580, 299144, 292804, 276599, 259167, 242054, 242055, 258239, 256536, 241604, 224926, 220537, 237670, 260432, 274631, 281265, 282950, 270358, 268740, 281492, 287756, 289108, 287177, 269894, 228675, 213254, 233498, 283256, 344426, 386880, 432123, 475149, 476474, 458055, 448592, 458124, 487802, 538059, 604920, 662351, 720181, 748888, 755886, 768729, 791410, 862093, 938746, 985698, 1012952, 1065904, 1148626, 1212002, 1258168, 1325879, 1397193, 1528204, 1721512, 1922636, 2136812, 2365284, 2581777, 2747767, 2932646, 3211573, 3566140, 3938301, 4360354, 4875256, 5585970, 6554472, 7811710, 9374471, 11316948, 13598319, 15870015, 18018537, 20589263, 24160170, 29388081]
12945B9388081Q091299J2944513K1278687L6407834O4387850J08589780J33087602
12938D14175646N6351999o0895798j18781440j01331532o1702814l6442667k3029637
12931F8343757j5508342j0817751p588933n277569l587253k614097k609150k738191
12923A7602471k379033j809907j403421j209605j110279r94932q63961o88880
12915G142453o00426n69882n17305m20416l34042k71336k30648j67509j41856
12906C889033j69321j96201j98327k01174j94516j96897k10049k01859j72159
12897B148530j37994j29765j30046j53311j38068j02630o7346l4181j3441m3416
12887A198332n5719n2385o4847p1763n3995k0690O721K4345K1888k736k7978n0486
$$ y = [29388081, 37479380, 50423893, 71702580, 108110414, 172498264, 281088044, 414175646, 470527645, 409631847, 290850407, 189518875, 127816061, 91373394, 68343757, 52835415, 42017664, 34428731, 29151162, 25563909, 22949812, 20340662, 17602471, 15223438, 13413531, 12010110, 10800505, 9690226, 8695294, 7831333, 7142453, 6542027, 5972145, 5454840, 5034424, 4700382, 4429046, 4198398, 4030889, 3889033, 3719712, 3523511, 3325184, 3124010, 2929494, 2732597, 2522548, 2320689, 2148530, 2010536, 1880771, 1750725, 1597414, 1459346, 1356716, 1289370, 1255189, 1241748, 1198332, 1142613, 1090228, 1025381, 953618, 899623, 878933, 885654, 909999, 931887, 929151, 901173, 850687]
12875H50687o4421m9815j4572j5170k2503j6593k0966k9727k2072L65J5017L9523
12863F49753M9245M3818O7230J46028K71985M95801O94820L78088k78025o44010
12853A874733n56906l37773j86277j27809r9647o9358l2921k0076j3575n943k7072
12842C97376l7915l1191k2460j1095o094r840j3551j4554j746J7475m008j0684
12830B51713j7916j5492j079k506l25N297M171l443J6460K3992J5065J0188k3628
12817B62497o6215m8232j0805j1203K7721P7060J53132K24313J05004l7225r4199
12806E81848q1342m4719j6403k2478l2972k4322r305o022j5735j7303j7l519o221
12793C01490n280j3932j3384o313M504K0899J7191N864j3160o2197j25022j22373
$$ y = [850687, 786266, 736451, 721879, 706709, 684206, 667613, 646647, 616920, 594848, 595213, 610230, 649753, 698998, 742816, 810046, 956074, 1228059, 1723860, 2418680, 2796768, 2518743, 1874733, 1317827, 980054, 793777, 665968, 566321, 496963, 464042, 443966, 430391, 424448, 397376, 359461, 328270, 305810, 294715, 288621, 278781, 265230, 250676, 248930, 266405, 262397, 251713, 233797, 218305, 217226, 214720, 214395, 219692, 223863, 220420, 236880, 260872, 275937, 286125, 262497, 196282, 148050, 137245, 126042, 153763, 230823, 383955, 608268, 713272, 676047, 581848, 500506, 455787, 439384, 416906, 383934, 359612, 350307, 344285, 328550, 311247, 311230, 307711, 301490, 296210, 282278, 268894, 262581, 267085, 287984, 305175, 311039, 297879, 235682, 110660, -11713]
12781a1713m0508L1918L4451J3911J3043J5959J3099j436p35J3354K0648Q695
12769A10686o733j1476l21j0054q087q765r495p003K204R171J3833J7595K3156
12756A14711L4872N9230O8521M1961j7908m9297l4100L328J9808j8005o1646n8372
12744A03103l8732j6787p894q096K5055L7229M1446K2031L020k0849k9310j7648
12732I2568l0630k9477j4176M596M445j703J3186J4212N977q229k0850J8466K7402
12719G5787K4788O682k847k0555j7547J925j208j823k402l223m72j8732k419J4669
12705E2623J1939o94j5257j7372o07L314J07l653j911p086n295P677R735l523
12691B9997J965L017l933k550R841J8424K28o497j925M577k090J483M919q365
$$ y = [-11713, -52221, -20303, 14148, 28059, 41102, 57061, 70160, 68724, 67989, 81343, 101991, 110686, 103953, 92477, 92156, 82102, 74015, 65250, 55755, 48752, 50956, 60127, 73960, 91555, 114711, 149583, 208813, 277334, 319295, 301387, 252090, 217990, 221318, 241126, 223121, 161475, 103103, 64371, 47584, 39690, 31594, 56649, 93878, 135324, 157355, 160375, 139526, 110216, 92568, 61938, 32461, 18285, 22881, 27326, 25623, 38809, 53021, 58998, 50769, 29919, 48385, 75787, 100575, 107257, 104410, 83855, 66308, 68233, 67025, 65202, 62800, 59577, 59105, 40373, 37954, 52623, 64562, 63868, 48611, 31239, 30632, 33946, 34053, 30400, 28489, 21403, 16108, 23785, 33520, 29997, 31962, 34979, 31046, 28496, 38337, 56761, 56989, 50492, 48567, 53144, 51054, 52537, 57456, 49091]
12677D9091l993r520r438n24p20k791o859M407L19P458l508j47Q045J1925J2049
12662E5794J6843k300R22k216L670J396J596r096m445M435J4433M490j498J0913
12648I4937q038j6763k091k228o85q549n740j0254P225J1416p311j5031j0520
12635B6368k3836j6304j1574j571J8658K5953K5563K6539P774k0811j5537k661
12623C8561o397j1194q7J503P746K745n399k881P975J1918m528j1479l583Q509
12609C3409J4852L367K364P677m91n954P975m133n13J794m703j1684j211J0121
12595E2870p718k0033r214J868L239R104J9068K346r296k345m120l333j492p673
12581B3271J167P37M480K0836M091P08O67n965k333q319J183M859J3131L827L079
$$ y = [49091, 45098, 35578, 26140, 25616, 24896, 22105, 15246, 19653, 19972, 27430, 23922, 23775, 31820, 43745, 55794, 72637, 70337, 71259, 69043, 72713, 74109, 75705, 66609, 62164, 66599, 81032, 85522, 84024, 94937, 86899, 70136, 68045, 65817, 65132, 56583, 50843, 40589, 47814, 59230, 51919, 36888, 26368, 2532, -13772, -25346, -26917, -8259, 17694, 43257, 69796, 77570, 56759, 41222, 38561, 32164, 20970, 20883, 22386, 30132, 32877, 27478, 24597, 32572, 44490, 39962, 28483, 24900, 33409, 48261, 51628, 53992, 61669, 61178, 55224, 63199, 59066, 58553, 60347, 55644, 43960, 42749, 52870, 45152, 25119, 15905, 17773, 21012, 30116, 49184, 51530, 42234, 39889, 35769, 32436, 30944, 23271, 24438, 25175, 29655, 50491, 54582, 55290, 55957, 49992, 47659, 39340, 40523, 45382, 58513, 62340, 65419]
12566F5419O281P466p738r578Q2k166j789J096j143l054o656j0943n144J554J955
12551C5642r314o580O895N852m083k669J941O231L827O992M926L97r92n229M310
12536D8146L22n878p788R211L346r079q34j447p55n6q92l235R44J938L262q105
12520B9100o754j655J294r444J451J1924P032m457L225q689J0469J704o117K627
12506C1710L600l874k521j207M903L352N364P726O365p868j232k035p90l317j529
12491C8647n259l715j2035O191J1115J8208J3921n151Q881J7945J3129J0770Q013
12478A20660J3023K2017L9543N9421Q9004J48137K37765M18914O59264O31742
12468B439490L9495n13418o32450m58073k70063j62990j07136q1316l7601j4607
$$ y = [65419, 71700, 79166, 71428, 61850, 61932, 59766, 57977, 59073, 57930, 54876, 48220, 37277, 32133, 33687, 35642, 26328, 19748, 26643, 32495, 28412, 25743, 27684, 33915, 37742, 44734, 49660, 50057, 49065, 43836, 48146, 48468, 42590, 34802, 44013, 47359, 38280, 37446, 35999, 35244, 35188, 34296, 31061, 32005, 33943, 37205, 29100, 22346, 20691, 21985, 12541, 13992, 25916, 32948, 28491, 31716, 23027, 33496, 35200, 29083, 31710, 35310, 31436, 28915, 27708, 32611, 35963, 41327, 49053, 55418, 47550, 46318, 44283, 43493, 40176, 38647, 33388, 29673, 17638, 23829, 34944, 53152, 67073, 61922, 70803, 88748, 101877, 112647, 120660, 133683, 155700, 195243, 254664, 343668, 491805, 729570, 1148484, 1807748, 2439490, 2478985, 1965567, 1333117, 875044, 604981, 441991, 334855, 253539, 215938, 201331]
12458B01331k4810l0474k2469j3285j5090m376o605q919l455J794q775j265M367
12445F7969J973P145k214O141J5257P956K2540M7294O0481O4306M2109r412n7026
12432B74519o4381n6950l8365k0439j4521j2466j1509j0984k763R648J0187q089
12420E3887j7719J425J537L564l748o631k120k750q764J1042Q698k321n028q125
12406B2947k689L175J272j787K538n09r17k841l772O11J162m669k569P484Q87
12391B0323K265J233Q43k839q837l960j637j557M409k131M981j575J402p62m928
12376G230j602K713j742l711Q577J67m314l271j1376J287M812k107p869J0184
12362a022L729L341l092p985r649L4P400P318L187J673l518K761M783Q573m564
$$ y = [201331, 176521, 146047, 123578, 110293, 95203, 90827, 84222, 75303, 71848, 73642, 64867, 63602, 67969, 69942, 77087, 74873, 81014, 96271, 104227, 126767, 174061, 234542, 298848, 340957, 331545, 274519, 210138, 153188, 114823, 94384, 79863, 67397, 55888, 44904, 42141, 51789, 61976, 53887, 36168, 37593, 39130, 42694, 38946, 32315, 30195, 27445, 18681, 29723, 38421, 36100, 31072, 22947, 20258, 23433, 24705, 22918, 25456, 24947, 24030, 21189, 17417, 18028, 19190, 14521, 11952, 19436, 20323, 22588, 23821, 24664, 21825, 12988, 9028, 7391, 5834, 10243, 8112, 13093, 11518, 12920, 12158, 7230, 5628, 8341, 6599, 2888, 11465, 11632, 7318, 4047, -7329, -6042, -1230, -3337, -11206, -1022, 2707, 6048, 2956, -5029, -14678, -14644, -7244, 74, 3261, 4934, 1416, 4177, 8960, 17533, 12969]
12347A2969l235l208N570j737j850N816M174o041k297R323j120o217r99j2202
12333a054j807P81n644m608m642R345J0270P310L651k511j673j0318l182N403
12319A321P522J007L021r114k130m645k815k50k593K689J1657Q990P421J78N675
12304B7934k77q275j0203l872j2644m021P001P516J0020N810j3977l801N129J2994
12290A9334J4773N180j0245n112j2278j1830n921J2796K990o49J5727L926l763
12277B4928M915R53L602m214n928n389j1250j806k362Q10j359o669L847N253K459
12262G790o483N42R560J986j2562j637K77P110J1788k752m984o193N011Q027p409
12247A0071q190o207p036P8m112N930P844P196P94k115m470p858N713R117p809
$$ y = [12969, 9734, 6526, 12096, 10359, 8509, 14325, 18499, 12458, 10161, 19484, 18364, 12147, 11148, -1054, -2861, -2080, -7724, -12332, -16974, -7629, 2641, 9951, 13602, 11091, 9418, -900, -4082, 1321, 8843, 9850, 12871, 3757, 1627, -3018, -5833, -6083, -8676, -5987, 5670, 14660, 22081, 22259, 27934, 27657, 19382, 9179, 5307, -7337, -11358, -4357, 3159, 13179, 18989, 5012, 1211, 6340, 19334, 34107, 39287, 29042, 23930, 11652, -178, -6099, 6697, 9687, 9038, 24765, 28691, 24928, 29843, 30796, 34398, 30184, 24256, 18867, 7617, 5811, 3449, 4259, 2900, -3769, 78, 5331, 7790, 1307, 1849, 11409, 13395, 833, -804, -527, 6583, 18371, 15619, 10635, 4442, 9453, 17480, 10071, 1881, -4326, -11362, -11284, -15396, -9466, -1622, 5574, 6368, 4253, -217, -8075, -2362, 6755, -1054]
12232a054n94j3102o466N950j428j962K648N114Q211J2149P601n741k648j6295
12218g617K558K792n842L167J2690j96o602n845j570K776m488R308N643L411j3137
12203b952j2653M190p41N009N110l895J5090M252q291R76l027m004M156O086k763
12188F543j344k355L847P258J956m67j1965o661N025L247k760L323M145n881n545
12173a634P838O688j3616j4174J401J0607l100o319q040m864j157J0155M513k10
12159a1912L762M450j693q148j648N71L436O108N925l509n021J135K510O397r44
12144A419K037K439n520r685p807J631R81P29P624J0553M058j2437q069n45J511
12129a1081M375J837r088j655l802J3149N497o025l90K976k698M75K107Q64O293
$$ y = [-1054, -1648, -14750, -21216, -15266, -16694, -18656, -16008, -10894, -2683, 9466, 17067, 11326, 8678, -7617, -5059, -2267, -8109, -4942, 7748, 7552, 950, -4895, -6465, -3689, -8177, 1131, 6774, 10185, -2952, -15605, -11415, -12156, -7147, -2037, -5932, 9158, 13410, 5119, 6095, 3068, -936, 3220, 9306, 6543, 5199, 2844, 6691, 13949, 15905, 15438, 3473, -3188, 1837, 5084, 2324, 5647, 9792, 3911, -1634, 6204, 12892, -724, -14898, -13497, -2890, -5990, -12309, -20349, -25213, -26370, -16215, -11702, -11912, -8150, -3700, -5393, -13541, -15189, -14618, -11182, -5074, 851, -2658, -7679, -6544, -4034, 2363, 1419, 3456, 5895, 375, -9310, -17117, -15486, -14505, -13776, -6152, 4401, 8459, -3978, -12047, -12592, -11081, -6706, -4869, -13957, -15612, -19414, -6265, -768, -6793, -7183, -4207, -6905, -6430, -4323, -3459, 2834]
12114B834N852M817j0922K685J4247k58j1497j1304q915M222P58R69N503O35Q897
12099H523R305j823j998M035L021J45n958r138m243O207k330m55n131n310m298
12084i448j937l814o327N525R480o384L587J3318N117N608o83o933p265O92l243
12069b707n246L305j943J404O839j279L279o325k766K942m602p660k515o53n18
12054a8445R241J0815l558l845L538K72L465m085R95P534k594r70N413J399K218
12039A1393J744r074p777k558j6K227Q419J172K795K125q92M170J659k932k745
12024I710n834O188j825L166J835k733l032j882M258N502k510m307o43N589k776
12009A0706j5446p027k337K658J2871M608j0090o227J201O749J5489K352J69Q10
$$ y = [2834, 8686, 13503, 2581, 5266, 19513, 19255, 7758, -3546, -12461, -8239, -7481, -6512, -1009, -374, 8523, 17828, 16005, 14007, 18042, 21063, 21208, 15250, 6112, 1869, 8076, 5746, 5291, 160, -5150, -9448, -11385, -15199, -21526, -16001, -6521, -12905, -9318, 4000, 9117, 14725, 14042, 7109, -156, 536, -2707, -7953, -4648, -6591, -5187, 1652, 373, 3652, -2673, -5439, -2497, -7099, -14759, -17274, -17927, -18445, -9204, 1611, -1947, -5792, -2254, -1982, 1483, -2602, -1607, 5927, 3333, 2363, 7776, 9175, 11393, 13137, 4063, -3714, -6272, -6288, -4061, 4358, 5530, 8325, 10450, 9558, 13728, 15387, 12455, 9710, 3876, 10064, 8239, 11405, 13240, 10507, 7475, 5593, 9851, 15353, 12843, 8536, 7893, 13482, 10706, -4740, -11767, -14104, -11446, 1425, 6033, -4057, -10284, -9083, -2334, 13155, 15507, 15676, 16486]
11995A6486n252p012l486o24n063m177M352N378n977N518q07m089P349O782j182
11980H196m064J935m676j877M526O234M90k041j0941j797R188J900J212k338k868
11965C079j4813J895Q385R413L685N187k373J232L679m209n129k3989r033Q314
11951a4677J4529R409J677j0319o755M751J982j437J64K952L89p104j047J219
11937d267l460o519O097N557R78j3765k165M545Q682L446k691n824l765Q712J158
11922c281l348j895j2062Q507J4391P152O80n031n332l151M480K631q010p774
11908a2043r726J0024J797l045L792K265M292O172j0143j6851k033J0196J2252
11895c051J353p52n587N420O45P48P386j072j8994k572J1820O482j025j3279K523
$$ y = [16486, 11234, 4222, 736, 112, -4951, -9128, -4776, 602, -5375, 143, -664, -4753, 2596, 9378, 8196, 4132, 6067, 1391, -486, 4040, 10274, 10764, 8723, -2218, -4015, 5173, 7073, 8285, 5947, 3079, -11734, -9839, -1454, 7959, 11644, 16831, 14458, 15690, 19369, 15160, 10031, -13958, -22991, -14677, -148, 9261, 10938, 619, -6136, -1385, 597, -840, -676, 2276, 2665, -4439, -5486, -4267, -7727, -14246, -8149, -2592, -1614, -15379, -17544, -12999, -4317, -871, -3562, -9386, -13151, -4439, -3281, -6629, -8524, -20586, -12079, 2312, 9464, 10144, 5113, -219, -3370, 1110, 3741, -4269, -12043, -21769, -11745, -9948, -12993, -9201, -6936, -2644, 3528, -6615, -23466, -25499, -15303, -3051, -1698, -2450, -8037, -2617, -1972, -1224, 6162, 5090, -13904, -16476, -4656, 1826, 801, -12478, -9955]
11880i955M146m709M189O746m083M620L738j2525o808n432o3Q912Q467O35p964
11865a0086J223N362J980j257M675k258l999m208K101M197q086J394L883k540
11851g619j362M349Q253p486l818j671q61j247K117O396L277j220j0450r972O396
11836a4918J051j121Mk020j90q16k953R383J0241P505k073P139p677r581O928
11821I02J895N087O004n873m310l53N024k134l082N320j867m088o575j900q64
11806f814N205J840M906m080P392P281n552o694L522p12r55o280j664l783q5m208
11790a0681K695J0071K645P195n384k973j897p004Q474Q124o676l453L766r939
11776e037n812R237q78j847n446n373J2M096J0203L501l398L266N254J999P429
$$ y = [-9955, -5809, -10518, -6329, 417, -3666, 954, 4692, -7833, -14641, -20073, -20136, -11224, -2757, -2122, -10086, -8863, -3501, -1521, -2778, 1897, -361, -4360, -8568, -6467, -2270, -10356, -8962, -5079, -7619, -8981, -4632, 3621, -3865, -7683, -9354, -10215, -11462, -9345, -2949, 328, -892, -11342, -21314, -14918, -13867, -14988, -14984, -17004, -17194, -18010, -20963, -11580, -1339, 6166, 4093, 11232, 3555, -6026, 902, 2797, 7884, 13888, 8015, 3705, 3352, 8376, 6242, 3160, 8480, 6613, 2525, -4050, -5950, -6814, -1609, 231, 5137, 1057, 8449, 15730, 10178, 3484, 7006, 6294, 5339, -941, -2605, -6388, -6473, -10681, -7986, 2085, 4730, 11925, 6541, 3568, 1671, -5333, 3141, 11265, 4589, 1136, 4902, -5037, -10849, -1612, -2490, -4337, -9783, -15156, -15144, -11048, -845, 2656, -742, 2524, 7778, 9777, 17206]
11761A7206l983m545l518k796n388j2972j512J034R424M617R291k657j4748j3305
11747b3852R117J2590L027p17p879k917J0421O562J1839J673r540n431k75l041
11733A577k870M302l031p996M40k302O497K911L331j0966m022P489l893K444J437
11718d652l630L003J1086j972p179L820j627j380P476J2886N56j336L13j2913
11704D451j119k162r428j378m391O159L806O703n151k418o604J456J0892N391
11690F207L384o493n513j0423j295J805M577M798L866m183N039L412j543j3008
11676i370k352O660R288j69O582J1917m60o702n404Q86j505n693j1514J416l470
11661i890j992N540P239r0K630K75q164j2652M242O177K278P842O332l539k891
$$ y = [17206, 13223, 8678, 5160, 2364, -3024, -15996, -17508, -16474, -7050, -2433, 6858, 4201, -10547, -23852, -14735, -2145, 882, 165, -7714, -10631, -210, 6352, 18191, 19864, 10324, 4893, 4618, 1577, -1293, 3009, -22, -8018, -7578, -9880, -3383, -472, 2859, -8107, -12129, -4640, -8533, -6089, -4652, -8282, -5279, 5807, 3835, -3344, 476, -1151, -2531, 4945, 17831, 18387, 17051, 17364, 4451, 3332, 1170, -8258, -9636, -14027, -7868, -4062, 2641, -2510, -4928, -11532, -10076, 816, 6207, 9591, 3098, -2415, -12838, -14133, -12328, -7751, -2953, 913, -3270, 1769, 5181, 3638, -9370, -11722, -5062, 4226, 4057, 10639, 22556, 22096, 15394, 9990, 10876, 9371, 3678, -7836, -6420, -9890, -11882, -6342, 897, 807, 3437, 3712, -4452, -17104, -12862, -6685, -4407, 3435, 9767, 6228, 3337]
11646C337n546n490K666l280j909Q743n415l571n381K72J0628l734j1265m329
11632b4274Q304Q481O564P789M377l88J967n741n629j90n911q891j08L814L147
11617f689J836k78K779k160m275J63N223J9594K416j0242j2837N652L6M914K785
11602H917q45o906Q138M228k965k062K87j0367l127J408M929m123n434n066r285
11587b2273q27K915J5488P378K298k174m806m356M768R88m516l780O647Q95l950
11572e305p379o145l516N071O312J02k441k584K532J177N558N04l556L119J008
11557e543k566n520N526n770R458P928j0647m741o654n70J0879R114m559k654
11543f319M209o26R817n426k381L456M414M837J587j1492r881O452j112q361l42
$$ y = [3337, -2209, -7699, -5033, -8313, -10222, -1479, -6894, -10465, -15846, -15574, -4946, -8680, -19945, -24274, -15970, -7489, -925, 6864, 11241, 10853, 12820, 7079, 1450, 1260, -4651, -13542, -13650, -9836, -6689, -4853, -5131, -2352, -4512, -8787, -8624, -3401, 16193, 18609, 8367, -4470, 1182, 1218, 6132, 8917, 8072, 1166, 9304, 13532, 10567, 8505, 8792, -1575, -4702, -3294, 1635, -2488, -7922, -12988, -22273, -23100, -20185, -4697, 2681, 4979, 2805, -2001, -6357, -1589, -601, -5117, -8897, -2250, -1355, -5305, -12684, -18829, -22345, -17274, -10962, -10860, -13301, -15885, -13353, -12176, -6618, -6114, -9670, -6551, -5543, -8109, -13629, -8103, -13873, -4415, 3513, -7134, -11875, -18529, -19099, -8220, 894, -3665, -6319, -2110, -2736, 7081, 1655, -726, 2730, 7144, 11981, 13568, 2076, -7805, -1353, -2465, -10826, -11168]
11528a1168m779k332j241L500P925R963L838O136M263n42p706o363j115K4K761
11513C164J1r782j796J0461j515q216l147J4122P278l164j0793o111M233K903
11499b352m107m134q078q848K770k794r22M378J1110J1685M137L09M088l374j3183
11484i315r501R258J905J339M885l724p525L521P030n235p333k005N072K447K216
11469f965K731R96O685O663L398o903m395J089j1086j0516k338N767J0106P138
11455B370J304M574K064k430n391j240N614j4521n962K609o55N036O840l879m551
11440h218K987J514P2j1235j789J959R586J1379L07k149l767k957L879K219p21
11425C066k97o164j923K669J151j435N21m713N258O4J2087n189r150M925r90q014
$$ y = [-11168, -15947, -18279, -19520, -16020, -8095, 1868, 5706, 11842, 16105, 15563, 7857, 1494, 379, 403, 3164, 3175, -6607, -8403, 2058, 543, -7673, -10820, 3302, 10580, 7416, -3377, -9488, -5255, -2352, -6459, -10593, -18671, -27519, -24749, -27543, -28465, -24087, -12977, -1292, 2845, 3154, 7242, 3868, -9315, -18816, -9558, -7653, -6314, -1429, -5153, -12678, -9157, -2127, -7362, -14695, -16700, -11628, -9181, -6965, -4234, -3238, 3447, 10110, 13508, 6605, 2210, 3299, -7787, -18303, -20641, -14874, -4768, 2370, 3674, 8248, 10312, 7882, 2491, 1251, 6865, -7656, -13618, -11009, -11664, -6628, 212, -3667, -8218, -5231, -3717, -3645, -14880, -16669, -14710, -5124, 6255, 6562, 4413, 646, -2311, 1568, 3787, 3066, 2769, -3395, -5318, -2649, -1498, -2933, -2412, -7125, -1867, -1803, 10284, 5095, -4055, 870, -120, -8134]
11409h134k251P424P575n515m538j359K0137K406j2159j1411q107Q83R341P466
11395A758N715L931j115j2337p666N483p634k760J874J273O333J73j0148O200
11381h920L613R672J1871O95L251M775j039q231j0165n500n439L649J0982O861
11367A6075p884n825L931O029j935m72j963N927k153K614J648q648p013l032L029
11352C28k364O491J287j3260q43O786L772l569J0150N326n578L331P4P63J211
11337A3905o314k276Q651p066l573O986J936K763k08N131k573p992o438P54k166
11322A520p323O907l07J723O875Q72o35J936K123j259O988N177k314K000q71j3291
11306A0121n160j652o968p701K392R451L564J893N695q344j1496l378L422m05
$$ y = [-8134, -10385, -2961, 4614, -901, -5439, -6798, 13339, 15745, 3586, -7825, -15932, -15049, -5708, 1758, 7473, 11404, 10289, -2048, -9714, -4231, -11865, -14625, -12751, -11478, -5145, -4972, -15120, -8920, -5307, 4365, 16236, 16931, 20182, 24957, 23918, 15687, 5522, 22, -5417, -1768, 9214, 16075, 8191, 2366, 6297, 12326, 10391, 9919, 7956, 13883, 11730, 14344, 15992, 7344, 331, -2701, 328, -2036, 4455, 5742, -7518, -8361, -1575, 2197, -1372, 8778, 14104, 8526, 11857, 11931, 12694, 13905, 7591, 5315, 13966, 6900, 3327, 10313, 12249, 15012, 14804, 19935, 17362, 9370, 2932, 3686, 1520, -5803, 1104, 797, 2520, 9395, 10267, 9632, 11568, 13691, 12432, 19420, 24597, 22283, 24283, 23412, 10121, 4961, 3309, -3659, -11360, -8968, 483, 4047, 5940, 11635, 3291, -8205, -11583, -8161, -8566]
11292h566o660J2046K748l596P850Q190p582r278k55K180J0109Q51o551N197K417
11277I100r414j7934j2870J5528J1829R679j0912r488k069R661J4293K779k736
11264G446P994k1q078n401j0005J08Q722l454r76r200R01J588O36O713m34j971
11248e432O100N525J374k341m608L224p086m295N933p37k021n429o437k588O795
11233a2023O50r090K008l63N15J853Q44P101L103k275J524L91q034J065q52j976
11217a5559n348J606K276j607Q158M02P416n724J518j1413j528P990R074J433
11203a306o208J581l649o98o381R166J3362r21n184j4345n922K559J0857n309
11189a2398J1477J2070o164q984J347L383J1059M393j2834r715J364k963J899
$$ y = [-8566, -15226, -3180, -432, -4028, 3822, 12012, 4430, -4848, -5103, -2923, 7186, 8037, 1486, 6683, 9100, -314, -18248, -31118, -15590, -3761, 5918, -4994, -14482, -16551, -6890, 7403, 10182, 7446, 15440, 15419, 7341, 1940, -8065, -7957, 765, -2689, -3665, -12865, -11964, -10376, -9740, -3027, -3461, -5432, 668, 6193, 7567, 5226, 618, 3842, -3244, -7539, -1606, -2343, -4364, -9793, -16230, -18818, -12023, -11373, -20463, -18455, -18818, -18303, -16450, -15606, -8505, -5402, -7677, -6153, -5762, -13796, -12731, -13583, -15559, -20907, -19301, -17025, -18632, -10474, -10072, -2656, -8380, -6862, -18275, -19803, -11813, -2739, -1306, -7514, -5933, -9582, -10280, -16661, -7495, 5867, 4946, -238, -14583, -20505, -17946, -7089, -12398, -921, 11149, 4985, -3999, -2652, 731, 11790, 16183, 3349, -6366, -5002, -7965, -6066]
11176f066k137M078J362j031k037L983K965p919n141l025m639J1855J5217n036
11162B429q530N654L575K589L137l76k268m282l676j0737q86m587J40N103K05
11147a2510P077L155K171O089O57j271J680r763q288J2118P932r178J395Q911
11133A0175q593j0035k638J165J2030M842n033r090k334M310O1q88L600L477K616
11118C665L20o622j207k965R655J0877R12j0327j4265R945K110q678K359J825
11104b396r280r656N661P465K299L32K127M029J078k239j969L75q091l511J864
11089a1912k203M896R086M354J951K820p33O30p99k072l332m247l671K378L683
11074H29m563q990K188J1792J4803q778j2401Q472K879l717N70p875l792r591
$$ y = [-6066, -8203, -4125, -2763, -3794, -5831, -1848, 1117, -6802, -11943, -14968, -19607, -7752, 7465, 2429, -6101, -447, 3128, 5717, 8854, 8478, 6210, 1928, -1748, -12485, -13371, -17958, -17818, -12715, -12510, -5433, -2278, -107, 5982, 6639, 5368, 7048, -2715, -11003, 1115, 9047, -131, 1264, 10175, 1582, -8453, -11091, -9926, 2104, 6946, 1913, -7177, -9511, -5201, -5140, -6028, -2428, 1049, 3665, 3985, -2637, -3844, -6809, 2846, 13723, 14635, 4308, -9957, -12, 2098, -6580, -4221, -2396, -11676, -21332, -15671, -8206, -5907, -5575, -3448, 581, 1659, -580, -2549, -2174, -10265, -13776, -11912, -14115, -9219, -133, 4221, 6172, 8992, 8259, 8889, 8090, 6018, 2686, -1561, -5232, -2854, 829, -3734, -12724, -10536, 1256, 16059, 7281, -5120, 3352, 6231, 2514, 3084, -4791, -8583, -18174]
11060a8174N917O276M108R705q583p558P51J577O910N368n256m720q24Q926K962
11045G385l986p745j945K51N375P831L873l234j0094j2897j697Q167R96M6J264
11030f410L131j0590n028R35n506L849J1042J1414o41n29m708N18o169l309L221
11015h780Q827p635j108L491L157N734m47m652L86O26R949P496j071p823k062
11000F088j45j0075p820L723J0673j933p35K369m72q185O14L449J2543l294p607
10985h07j0374L888k441n224j357N822N959k509j051O333N593M510K566o220j3654
10970h966L458J495N706K531k120N139J266l964j6633M802K181j5150m298P859
10956a6694N041J50P633Q14K759j0584M459K160O561M013j0453N230k02J441n168
$$ y = [-18174, -12257, -5981, -1873, 7832, -751, -8309, -7558, -5981, 929, 6297, 1041, -3679, -4503, 4423, 7385, 3399, -4346, -6291, -6040, -665, 7166, 11039, 7805, -2289, -15186, -16883, -8716, -7720, -7674, -6410, -3279, -13869, -18897, -17962, -23468, -19619, -8577, 2837, 2196, 1667, -3041, -2523, -8692, -12001, -8780, 47, -7588, -8696, -5205, -2048, 3686, 3239, -1413, -1027, -401, 9548, 17044, 15973, 8150, 6088, 5943, -4132, -11952, -8229, 2444, 511, -224, 2145, 1673, -6512, -5898, -2449, 10094, 6800, -807, -11181, -7293, -9734, -14958, -16315, -10493, -4534, -7043, -8094, -1761, 3832, 8342, 10908, 4688, -8966, -5508, -4013, 1693, 4224, 2104, 7243, 8509, 4545, -12088, -7286, -5105, -20255, -24553, -16694, -11653, -11503, -3870, -3056, -297, -10881, -6422, -4262, 2299, 6312, -4141, 1089, 887, 2328, -2840]
10941b840J874Q984p569j2471n640K737P472j572j56J1157L689o056n456L550
10927b297M553k297K40l726j464n7L083L8j056o073q102N326J4941j388M829L332
10911I882r16j0685N18N810Q146r6j0377l520J754J817L345J543M997k893L958
10896A3283n510n605J4447K560j187n081n222j028r689j810Pm653M638R005N026
10881I181m736o897n547L327M302L812l998m660k199N113K625n372r60R163n946
10866b792L690J0368p157j1338k578O824N975K84n899p997j0928k693N162R620
10852i459Q199K685M658M184N033l341q588n325O885o94j0666j877l603j855P108
10837f656m969n296O399O321O607k130j3210j0889l259K683M469j00L030P963
$$ y = [-2840, -966, 8018, 449, -12022, -17662, -14925, -7453, -9025, -9181, 1976, 5665, -391, -5847, -2297, 2256, -41, 199, -3527, -4991, -5048, -1965, -1927, -2983, -9056, -17158, -11832, 3109, 1721, 6550, 9882, 8966, -1719, -1201, 4609, 12755, 12659, 2282, -1238, 516, 2333, 5678, 7221, 12218, 9325, 13283, 7773, 2168, 16615, 19175, 17988, 12907, 7685, 6657, -3032, -4842, -4835, -9488, -4850, 4155, 9181, 4445, -2452, -7999, -4672, -370, 3442, -556, -5216, -7415, -2302, 323, -5049, -6009, 3154, -2792, 898, 11266, 4109, -7229, -9807, -2983, 2992, 3276, -2623, -10620, -21548, -24241, -19079, -9459, -1260, 1425, 6083, 10267, 15300, 11959, 3371, -1954, 4931, 4237, -6429, -8306, -11909, -13764, -6656, -11625, -16921, -10522, -4201, 2406, 276, -12934, -23823, -27082, -24399, -19930, -20030, -17000, -9037]
10823i037o03L918m647o518n516L63R839L798l482n67K502K864p840L242k59j0882
10807b2825N594R805J7284l449j4510o126k491J5330Q143R965j0855q400J307
10794a228J707K786k295k989n139J244l308n136l703M421N128n942R41J3373P86
10779F46l614j1735k202N979J4001N052o198Q367o371j1126r4p85p57m023r161
10764b2021P793N411q39N651J533j345k088m532O99M545M675j3122J017J0706
10750a917R863l469q213N358l846R49J52R691N211r306j343l831n846R26k738
10735h359o739J738J537j655J288K252N179K206L765N546O490r967q665M930k503
10720b957l575J498J2677R807o899n726M230N197j0501k772K466J19R694L400
$$ y = [-9037, -9640, -5722, -10369, -16887, -22403, -22040, -12201, -8403, -11885, -12452, -9950, -7086, -14926, -11684, -11943, -22825, -17231, -7426, 9858, 6409, -8101, -14227, -16718, -1388, 6755, 16720, 5865, -2535, -1228, 479, 3265, 970, -2019, -7158, -5914, -9222, -14358, -18061, -13640, -8512, -14454, -13513, -140, 646, -2968, -14703, -16905, -10926, 3075, 8127, 1929, 10296, 3925, -7201, -7295, -8080, -8837, -12860, -22021, -14228, -8817, -9656, -4005, -2472, -3817, -5905, -10437, -9738, -5193, -518, -13640, -12623, -1917, 7946, 4477, -3736, 1622, -2224, -1275, -1123, 8568, 13779, 4473, 3130, -701, -6547, -5621, -8359, -15098, -13360, -11823, -13478, -12190, -9938, -4759, -2553, 1212, 6758, 13248, 3281, -5384, -454, -2957, -6532, -5034, 7643, 17450, 10551, 4825, 9055, 14252, 3751, 979, 3445, 3564, 13258, 16658]
10706A6658j1565m680j336j460J899j665P252k762j775p666j0564J2050N412p777
10692g979n910N586j240O294J1259j20j909J417j598n825j643K576O135j606q947
10677c510n488q62N092J3677J3309J476j4071j3466j8240p921K401P65M059L614
10663a9165P558J0701l544n732N50Q289k139j878k952o568R06O914R046l118n798
10648f930m104p480l999n126L078K932N365P808J882M587p572J743J4588k492
10634D280m134K841L22j369j148j0383o155M49j081M733J0995K838K848k266j477
10619A293R503L100O564j1208p100O910m724j2172j1153L706Q607M807J4688O79
10605A3500j0844n980o076k397J101R510J0775j714j9153j1123P609J5346R873
$$ y = [16658, 5093, 413, -923, -2383, -484, -2149, 5103, 2341, 566, -7100, -17664, -5614, -202, -7979, -13889, -8303, -9543, -3249, 8010, 7890, 5981, 7398, 5800, -25, -1668, 908, 7043, 5437, -3510, -8998, -9860, -4768, 8909, 22218, 23694, 9623, -3843, -22083, -30004, -27603, -26838, -22779, -19165, -11607, -906, -4450, -10182, -9632, -1343, -3482, -5360, -8312, -14880, -13974, -7060, 1986, -1132, -6930, -11034, -18514, -22513, -27639, -24561, -21629, -16264, -8456, -6574, -1987, -9559, -7816, 6772, 4280, 146, 2987, 3309, 1940, 792, -9591, -15746, -15297, -16378, -11645, -650, 2188, 5036, 2770, 1293, 10796, 13896, 20460, 9252, 2152, 9062, 4338, -7834, -18987, -15281, -6674, -1867, 12821, 13500, 2656, -3324, -9400, -11797, -10696, -1186, 9589, 7875, -11278, -22401, -14792, 554, 10427]
10592A0427l335p50J914J808L089n894j1836l297K261Q475p440o855L559N714
10578b160Q04K018O659N366l041j2969n760N435k85N740N606k833J900J0884J0727
10563B8091o88Q646Q090P948R254J66l245m669n191n282R03Q141M936k927j4616
10548C9557j1852j1247k384P949J27p887o457j7826K64P217J407k65m75j755k143
10533e770N256j694k487J124O991j0989k872N025J1856O437J078j4774j0698j458
10519a2975p67J594J072j709J066K53J0325j374k36P11P44L995l206M653Q604
10504A2750m423j6627n679J1023j780L793J0105k307L499M251l572k790J409L052
10490A2704O39O796L564n830j2261l535O738m967m339k482j32Q585J089p608K190
$$ y = [10427, 7092, 6342, 8256, 10064, 13153, 7259, -4577, -7874, -5613, 2862, -4578, -11433, -7874, -2160, -1356, 662, 7321, 12687, 9646, -3323, -9083, -3648, -3933, 1807, 7413, 4580, 6480, 17364, 28091, 27403, 36049, 44139, 52087, 61341, 61507, 58262, 53593, 48402, 43120, 44023, 52164, 57100, 54173, 39557, 27705, 16458, 14074, 22023, 22150, 14263, 7806, -10020, -9756, -2539, -1132, -1397, -1872, -3627, -5770, -514, -2208, -4695, -3571, 3420, -7569, -10441, -5416, 6440, 12877, 13955, -819, -11517, -12975, -13742, -12148, -11076, -12785, -11719, -11466, -1141, -2515, -2751, -2040, -1296, 2699, -507, 4146, 12750, 8327, -8300, -13979, -2956, -4736, -943, 9162, 6855, 10354, 14605, 11033, 8243, 9652, 12704, 13343, 20139, 23703, 17873, 5612, 2077, 8815, 3848, -491, -2973, -3105, 5480, 6569, -1039, 1151]
10475A151n603l051P91j813j386o376P63J779L531j91J398J0715Q32p946n649
10460a1055L513O163M434j3727Q632N554n548o053K944Q394J0268k549o902J33
10446D201n124l688j1830J0221J8210J3297j984p960O7q23k418l411n107j978
10432A673P329P757J3350M743J7181K1839J0722N836L535L837l481p581n00p537
10418G8703k2190j7936m330j0278p159o411j873m463q687m940KJ037K81o345O883
10403g706J2190L685r531j156J5649m18L61l852m461N780l046m201q887N05l1
10388e119m750Q32K235L546o54R93l150J5418J4224m789j4133r995P780J1705
10374A4143K897n049J468L4J234K077j170j0803J2641p953r865n725K301O937
$$ y = [1151, -4452, -7503, -6712, -8525, -9911, -16287, -15524, -13745, -10214, -10405, -9007, 1708, 2540, -5406, -11055, -7542, -1379, 3055, -10672, -2040, 3514, -2034, -8087, -5143, 3251, 13519, 10970, 4068, 4201, -923, -4611, -16441, -6220, 11990, 25287, 23303, 15343, 15410, 14587, 12169, 8758, 3651, 1673, 9002, 16759, 30109, 34852, 52033, 73872, 84594, 90430, 93965, 97802, 94321, 86740, 86240, 78703, 56513, 38577, 34247, 23969, 16810, 10399, 8526, 4063, -4624, -9564, -9562, -8525, -8244, -14589, -7706, 4484, 8169, -1362, -2518, 13131, 12713, 13074, 9222, 4761, 10541, 7495, 3294, -5593, -5088, -5119, -9869, -9037, -6802, -3256, -3910, -2917, -6067, 9351, 23575, 18786, 4653, -5342, 2438, 14143, 17040, 11991, 13459, 13493, 14727, 16804, 15634, 4831, 17472, 9519, -346, -6071, -3770, 3167]
10360C167k727k176k677k345l046p56L795P382J323q99J636J065L908q560J199
10345B89M228M03J640n444p728L914n142O54J1386M066K564n571n222K491J565
10330D093L09M225M283R55J73Q054L700o493q082L606O568n957K641K781j961
10315A8895Q58o53K096P028K021r092k0304K959L200k025o174J612O446K074l401
10300E540M443K325n188n532l950m111q042O888J928l336J849J0448Q765l297
10286H730r408m093R142K0083J5952J346k886K68p804L028q70m823R574N139R347
10271E2725M860j0501j254m299l452n655j0401m474N649O50j0284n406K411J852
10257A2421l542n936q607O77J2806l634j1519M937Q144J268j50r034r849M213
$$ y = [3167, 440, -1736, -4413, -6758, -9804, -10560, -6765, 617, 1940, 1041, 2677, 3742, 7650, -910, 289, 4517, 4920, 6560, 1116, -6612, -2698, -7840, -7186, 4200, 8266, 10830, 5259, 37, 2528, 4093, 4402, 8627, 12910, 13865, 14038, 22092, 25792, 19299, 11217, 14823, 21391, 15434, 18075, 20856, 18895, 19753, 19100, 21196, 28224, 30245, 21153, 849, 3808, 7008, 4983, -1191, 421, 6867, 8941, 5540, 9983, 12308, 7120, 1588, -2362, -6473, -14515, -7627, -5699, -9035, -7186, 3262, 12027, 8730, -678, -4771, 4371, 24454, 40406, 41752, 38866, 39134, 31330, 34358, 33488, 28665, 38239, 43378, 52725, 57585, 47084, 45830, 41531, 38079, 32424, 22023, 17549, 23198, 23848, 13564, 8158, 10569, 12421, 8879, 2943, -5664, -4987, 7819, 4185, -7334, -2397, 5747, 7015, 6865, -2169, -12018, -7805]
10243g805J337J567K507l749M78J1824N970O218j531J638k142m87j1412N964M528
10228A4905M083L525k904R307J4351O058p815j2047j4219n151j282m911j0953
10215g053J0950P719O351p814q764l631n37n793n355R086N421l171K157M00l863
10200c897L19j327P37K204L433j323m574n398J1772J2639j252p329k842K788q55
10185E095j671L508m321j163P282J0491O81m075m929j1246l519O394L323M071
10171I921j007j210m088Q84n87L820L573K835m635j004j301j119j812l542N826
10156F554O366j567r453j4J247j820k083L862m94M83k909n509J832J2752M116
10141A3363o087j5156Q867O672J825K417Q04m417J661n951j821M18j735K833N348
$$ y = [-7805, -6468, -4901, -2394, -6143, -5665, 6159, 12129, 18347, 16816, 18454, 16312, 15825, 4413, 10377, 14905, 18988, 22513, 19609, 28916, 43267, 49325, 41510, 29463, 15244, 10093, 8811, 3900, -7053, 3897, 11616, 17967, 10153, 1389, -2242, -2779, -8572, -13927, -4841, 580, -2591, -434, -34, -3897, -3578, -4905, -4168, -1964, 1469, 146, -4428, -9826, 1946, 14585, 13333, 6004, 3162, 5950, 5095, 3424, 6932, 2611, 1448, 8730, 19221, 19902, 15827, 10898, -348, -3867, 2527, 5850, 9921, 8914, 7704, 3616, 4500, 3913, 7733, 11306, 14141, 9506, 8502, 7201, 6082, 4270, 728, 6554, 12920, 11353, 1900, 1886, 3133, 1313, -770, 3092, 2598, 3081, 172, -5337, -3505, 9247, 13363, 7276, -7880, 987, 7659, 9484, 11901, 12705, 8288, 9949, 3998, 2177, 2595, 860, 3693, 9041]
10126I041L117k102n928k503o591l541R547J0936k518p417l631O367O346O312
10112A7435R523k288q993j322o286m999r960j817o81O136J0082J957P616Q65j1149
10097F119j6663q878k71R167P39N445l13O409n044K834N509J749L000k968M881
10082A1715N722K068o646m293k3q893j425J0660N163J0109n841q05K463L094N460
10067B8528J835k969K196j291k719n553l979q380J079N468R285M858K729R420
10053D0507m81P838R325k673J822N256K130J332j4957j7545k340q084o008J167
10039A7289R358j866j1633j0813J956j832N177J410j262j492J0124L926q134k635
10025I573k367m791O68J1039O43o145m190r770J262M057N669k108j953n209L322
$$ y = [9041, 12158, 10056, 4128, 1625, -4966, -8507, 1040, 11976, 9458, 2041, -1590, 4777, 11123, 17435, 26958, 24670, 15677, 14355, 8069, 3070, -6890, -8707, -9388, -3252, 6830, 8787, 16403, 17268, 6119, -10544, -19422, -19693, -10526, -9787, -4342, -4655, 1754, -3290, -456, 5053, 6802, 9802, 6834, 11715, 17437, 19505, 12859, 8566, 8543, -350, -1775, 8885, 14048, 24157, 18316, 17511, 19974, 23068, 28528, 30363, 27394, 29590, 28299, 25580, 20027, 16048, 7668, 8747, 14215, 23500, 28358, 31087, 40507, 40026, 47864, 57189, 54516, 56338, 61594, 63724, 65056, 50099, 32554, 30214, 22130, 16122, 17289, 26647, 24781, 13148, 2335, 4291, 2459, 7636, 9046, 7784, 6292, 16416, 20342, 12208, 9573, 7206, 2415, 3083, 14122, 14765, 8620, 4430, -5340, -4078, -21, 5648, 3540, 1587, -3622, -300]
10010c00M801O511k154j954k155j754j005n608J83P109K279n197k105N48N657
9995D856O586j025q960j13J087N03L212O045N487J0692P413o87j5044q139m501
9980G412j647P333J87m045k318j1145K371R817M291J977k908l050L508J0059j2967
9965H875k561O585L363r156o614o472j901L726J0212P808N628k562n692J155k702
9950I692j1131P59N766J1118k713L13J533k483J487m385m627m671J1026N58j1223
9935A019m410k818J0133P892J4553K890o619q25j072k817K557n058k526M06M340
9920A7645p691j965J2946n259L297K557n899o509m908o06M435R396O037k79p121
9905A6076q499O133L534k877P07o337J899k205L323L684q384r522L477K918N352
$$ y = [-300, 4501, 11012, 8858, 6904, 4749, 2995, 1990, -3618, -3435, 3674, 5953, 756, -1349, -801, 4856, 11442, 10417, 1457, 1344, 2431, 2934, 6146, 12191, 17678, 28370, 35783, 35096, 20052, 11913, 7412, 5765, 13098, 13285, 9240, 6922, -4223, -1852, 7965, 12256, 14233, 11325, 8275, 11783, 21842, 8875, 6314, 12899, 16262, 7106, 492, -5980, -7881, -4155, 6057, 13865, 19493, 16931, 11239, 12394, 9692, -1439, -680, 5086, 16204, 13491, 13804, 15337, 12854, 14341, 9956, 5329, 658, 11684, 12242, 1019, -3391, -6209, 3924, 11816, 26369, 29259, 22640, 21815, 20743, 17926, 20483, 15425, 12899, 13305, 17645, 9954, 7989, 20935, 15676, 18973, 21530, 15631, 9122, 4214, 3608, 8043, 17439, 23476, 23197, 16076, 7577, 13710, 17244, 14367, 15074, 8737, 10636, 8431, 11754, 15438, 7054, -2468, 1009, 3927, 9279]
9890I279J213L008l299j344K163K778L28k273n263q564K498j990r14q452J602
9875i230J0048P169Q88p24P498P333O738p497j4522r512Q743J4060l103n694o71
9860A1524O676P774j2154p174O638Q932j216n461r956R000J220p168j1799m97
9846c661M030N981J774N231M703k088O11K795M775q474O306M768j044q137j0779
9831F791o994K677L490L969O572k635j016k417J128L172M437J440j0099n474m615
9816D26m092r35O113K890o818J04M995m415R028K882m590n314K625L904O598Q903
9800B2304l736o799j471J340m897k280K546J262J087L718o667j977N915Q401r988
9785H758J00R444n319j001n476o162m478K602R292M950O684L153n231j0673K361
$$ y = [9279, 10492, 13500, 10201, 8857, 11020, 13798, 14126, 11853, 6590, -1974, 524, -1466, -2380, -10832, -9230, 818, 7987, 8875, 8151, 15649, 22982, 29720, 22223, 7701, -1811, 6932, 20992, 17889, 12195, 11524, 18200, 25974, 13820, 6646, 13284, 22216, 21000, 15539, 5583, 14583, 15803, 8635, -3164, -3661, 369, 6350, 8124, 13355, 18058, 15970, 16581, 19376, 24151, 15677, 21983, 26751, 25707, 17570, 6791, -203, 2474, 5964, 9933, 16505, 13870, 12854, 10437, 11565, 14737, 19174, 20614, 10515, 5041, 426, -3666, -4601, 1512, 4402, -2416, -2312, 2683, -1732, 7296, 10178, 5588, 274, 2899, 6803, 13401, 22304, 18568, 11769, 10298, 11638, 6741, 4461, 7007, 8269, 9356, 13074, 6407, 4430, 10345, 18746, 8758, 8858, 18302, 12983, 11982, 6506, 344, -4134, -1532, 7760, 12710, 19394, 22547, 17316, 6643, 9004]
9770I004m187M005l149l315Q38j243L325R875l278l689J130k760L718M276m611
9755I939l829M547Q76o037M075N407J890k816k182K516O759O700n574p840J081
9740A5512J784N578k836l256l132J0293M81n755Q066L318J023J140j03q501j3026
9725A0586m925M516P806k321p510L785O001q92R334m793j1066N95L30K945l323
9710A1068m7q202K789l12M237j20Q263m177k269o378l635R355N914k800r119r021
9694d454R909M756r039m106P050K705O322P531k640l703J274K000m497m70J3270
9679B5908K200k709j1256M44L832J101O533l905L941o069l108q710j994L926J4045
9664B4179l77k681n946N428N392l145m876j206q41N479o575q128k032J4076K41
$$ y = [9004, 4817, 8822, 5673, 2358, 3196, 1953, 5278, 15153, 11875, 8186, 9316, 6556, 10274, 14550, 9939, 6110, 10657, 11533, 5496, 9571, 14978, 16868, 14052, 11870, 14386, 21145, 27845, 22271, 14431, 15512, 17296, 22874, 20038, 16782, 13650, 23943, 24424, 18669, 26735, 30053, 31076, 32216, 32113, 23612, 10586, 5661, 10177, 17983, 15662, 8152, 11937, 17938, 17046, 26380, 21587, 10521, 11116, 11446, 14391, 11068, 11021, 2819, 5608, 5296, 9533, 9413, 17676, 13499, 11230, 4852, 1217, 10572, 16486, 13686, 4567, -4454, 5455, 10211, 1172, -2934, 4116, 6821, 13143, 20674, 18034, 14331, 15605, 17605, 13108, 12638, 25908, 28108, 25399, 14143, 14587, 18419, 19520, 26053, 22148, 26089, 20020, 16912, 8202, 6208, 10134, 24179, 23802, 21121, 15175, 20603, 25995, 22850, 17974, 16768, 15927, 21406, 14831, 6703, 4671, 18747, 18988]
9649A8988m959J4167q152m858k950p241p156P890J0890j614M921p194n332r811
9635b411M13J8023P875k155k390p170m153k304N820O542k805K743Q522L61j756
9620B5155J852m997l338P390L835r289n064J0242m45J320N036N85j3624m116O704
9605B1246j559L775O03q034J611J639L882O370K94j3595j4147o929M246N826R220
9590A4448l695M37R243Q172l619o917l689N51P222j981j44n942j460J0840L954
9575B7420J0129O32m429q718j3220m719J1114M981m912K388n373R821J574o004
9561B0684M83r921o982j98M948L840N352k660k842L931Q541l971o428N538O413
9546B6728k611O108M484k520q408j3501j39R085P289P103o677P117M902j5894
$$ y = [18988, 14029, 28196, 20044, 15186, 12236, 4995, -2161, 5729, 16619, 15005, 19926, 12732, 7400, -2411, -1998, 16025, 23900, 21745, 19355, 12185, 8032, 5728, 11548, 18090, 15285, 18028, 26550, 26911, 25155, 27007, 22010, 18672, 26062, 29897, 20608, 15544, 25786, 25341, 26661, 31697, 32282, 18658, 14542, 21246, 19687, 23462, 24065, 16031, 17642, 19281, 23163, 29533, 29827, 16232, 2085, -4844, -598, 5228, 14448, 10753, 11190, 20433, 28605, 24986, 18069, 14380, 14931, 22153, 20172, 20028, 14086, 12626, 23466, 27420, 37549, 38181, 33752, 25034, 11814, 7095, 18209, 23190, 18278, 20666, 15293, 25114, 26688, 20684, 21167, 11246, 4264, 4066, 9014, 12854, 18206, 15546, 12704, 16635, 25176, 21205, 14777, 20315, 26728, 24117, 30225, 34709, 32189, 23781, 10280, 10141, 19226, 26515, 33618, 26941, 34058, 38960, 23066]
9532B3066p766k12l241L784L644j027M728k469j3085n626L898J0382m042m707
9518G327L227J1367O161R770M305j143l001j964j820P506O805j853j3463j7937
9504A5287o381K438K29R571O311n544m63O744J2453J037j717J89j529n71l422
9489C4632l662l061m080j170p673j7789k181O097L777M335R358R594O252j0030
9475B4399l890Q422J631o234n076J15J643m008Q112J2310j45p344m334l310R027
9460C1318J6l234Q206P300J897j401N29R57M868r041k055K359k101K241n895j33
9444C5831L886M528m264k224q503k001J1806K264n125J215k251m429j1626q420
9430A0687M001O599q14j125J571P041N461m425l627j31L130j49O73m914n7R750
$$ y = [23066, 15300, 15088, 11847, 15631, 19275, 18248, 22976, 20507, 7422, 1796, 5694, 16076, 12034, 7327, 10554, 21921, 28082, 37852, 42157, 41014, 38013, 36049, 34229, 41735, 48540, 46687, 33224, 15287, 8906, 11344, 11573, 21144, 27455, 21911, 21448, 28192, 40645, 41682, 39965, 40154, 38625, 38054, 34632, 30970, 27909, 23829, 22659, 14986, -2803, -4984, 1113, 4890, 9225, 18583, 28177, 34429, 24399, 20509, 28931, 30562, 24328, 19252, 19367, 21010, 17002, 25114, 37424, 37279, 29935, 25601, 22291, 31318, 31334, 28100, 36306, 43606, 45503, 44102, 44631, 45588, 50456, 41415, 39360, 41719, 39618, 41859, 35964, 35831, 39717, 44245, 39981, 37757, 29254, 27253, 39059, 41323, 36198, 37413, 35162, 30733, 19107, 10687, 14688, 21287, 20473, 19348, 20919, 27960, 33421, 28996, 25369, 25238, 28368, 28219, 28892, 23978, 23921, 33671]
9414C3671N053M711n381j4324l035P893k802j762M804L425M383J134n20M427o814
9399C4863j967N899J95j4182l256P120J496p870K686K849p308j216M217J0435
9385C3961K388r016j4637l178K539Q492Q992M621p011m625K2P441r279R34R237
9370C0881K933k120O146K11p001n707j220K927k045L819J304m266n93l35P278
9355C2212N505J429m723j878N327M232K176K362n612p786k223j690O920K777n208
9340C3820J967M422M826j597p095r645l895J189M876l153k370J542M750L700J211
9325C4548l312n415m001N750M681p924o975k962J981Q097J887k928N995O902P243
9310D3567O763L002j195m137n01m034j5068o74J464J003J774P063m940p971K53
$$ y = [33671, 38724, 43435, 38054, 23730, 20695, 28588, 25786, 24024, 28828, 32253, 36636, 37770, 37250, 41677, 34863, 32896, 38795, 38990, 24808, 21552, 28672, 30168, 22298, 24984, 27833, 20525, 19309, 23526, 33961, 36349, 27333, 12696, 9518, 12057, 20549, 29541, 34162, 27151, 22526, 22548, 29989, 20710, 21644, 30881, 33814, 31694, 37840, 38051, 31050, 25343, 24123, 27050, 25005, 28824, 30128, 25862, 25269, 24934, 32212, 37717, 39146, 34423, 32545, 37872, 42104, 44280, 46642, 41030, 33244, 31021, 29331, 36251, 39028, 33820, 35787, 40209, 45035, 43438, 36343, 26698, 22803, 23992, 28868, 25715, 23345, 24887, 29637, 33337, 34548, 31236, 25821, 21820, 27570, 32251, 24327, 17352, 14390, 16371, 24468, 26355, 23427, 29422, 36324, 43567, 50330, 53332, 52137, 48000, 47499, 43465, 28397, 27723, 29187, 30190, 31964, 39027, 34087, 26116, 26369]
9295B6369L722J330M932k773n893n954P781p07K868o00K739k557j194M570J139
9280C5772N831P731n657j0354l815O020r45J636J84l095j909j561k456j998J0897
9265C6281k812J387M664o427o773o004J3316M199J0655p607j5333j3577j813k724
9251G432Q027M982O924k084r9l37j557L810K528l628k303L000Q06K44m684j120
9235B1941M536N034l900p010J233n223O453J6896j190j0863r46M153J050K140
9221C4304J0022k010l158j569o557j0590J392J384J4917L612o220K206p237m586
9207B5910j322N605O843j19o21p507K626J163j907m13l72P15o366L936J0626m619
9191C4178j630N002Q94P194m613R85J873k497m914l924J809n637K044L085l378
$$ y = [26369, 30091, 31421, 36353, 33580, 27687, 21733, 29514, 28807, 31675, 31075, 33814, 31257, 30063, 34633, 35772, 41603, 49334, 43677, 33323, 29508, 35528, 34583, 36219, 36403, 33308, 31399, 29838, 27382, 25384, 36281, 33469, 34856, 39520, 33093, 26320, 20316, 33632, 37831, 48486, 40879, 25546, 11969, 10156, 7432, 15459, 20441, 27365, 25281, 25182, 24845, 23288, 27098, 29626, 25998, 23695, 26695, 27501, 27745, 23061, 21941, 26477, 31511, 27611, 20601, 21834, 16611, 23064, 39960, 38770, 27907, 26961, 31114, 32164, 34304, 44326, 42316, 39158, 37589, 31032, 20442, 21834, 23218, 38135, 41747, 35527, 37733, 30496, 25910, 24588, 30193, 37036, 36917, 36296, 28789, 31415, 32578, 30671, 30258, 29886, 30601, 24235, 28171, 38797, 34178, 32548, 37550, 38444, 45638, 41025, 42010, 43883, 41386, 36472, 32548, 34357, 28720, 30764, 33849, 30471]
9176C0471p369k363Q703N815N85L087n269n296k793M295L35o709l418J075j197
9161A9952K586N611o011k676j542q65k797k450M178Q161R105P080k484j0227n133
9146B2488K380M218O563j422l775L499j820p682o755J1784J3252l972j260l247
9132C4251J308N228o918m716j52o25j0233Q089l32J825j279J678r942n884n903
9117F395J085J2055J747L116k808j466l004k828M201K354J736N60m641k233j1676
9102D593p119O928k065m185N056k0J346K568K853K818L208P960P02m706K428L789
9086B6154k668j0085J335P168O710m495j1512j4233Q94L887l833J3116R688K8
9072B2154r029K771k552r87j328R505R880m231R242k012m355p704l48M623j5308
$$ y = [30471, 23102, 20739, 29442, 35257, 35842, 38929, 33660, 28364, 25571, 29866, 30201, 23492, 20074, 21149, 19952, 22538, 28149, 22138, 19462, 17920, 17055, 14258, 11808, 15986, 24147, 33252, 40332, 37848, 27621, 22488, 24868, 29086, 35649, 34227, 30452, 33951, 32131, 24449, 17694, 29478, 42730, 38758, 37498, 34251, 35559, 40787, 33869, 29153, 29001, 28376, 18143, 26232, 25900, 27725, 26446, 28124, 18182, 12298, 6395, 7480, 19535, 21282, 24398, 21590, 20124, 17120, 14292, 18493, 20847, 22583, 23143, 18502, 16269, 4593, -2526, 4402, 2337, -1848, 3208, 3188, 4534, 7102, 9955, 12773, 15981, 23941, 24643, 19937, 22365, 26154, 23486, 13401, 14736, 21904, 28614, 24119, 12607, -1626, -732, 3155, -678, 12438, 22126, 22154, 13125, 15896, 13344, 12357, 11029, 20534, 30414, 26183, 35425, 33413, 29058, 21354, 21006, 25629, 10321]
9057A0321j2956O995M911M410q36p742J3330J0843r221j4468l261L652R974L592
9043A9544j1150m231L273j89j361j1574L62M841K95M082Q309P865N221k400k50
9028B2637J60n890k667l585n16K654k146M533n9j337q861n630o673R172J0578
9013A2370N196J276j045p417J160J2824r153j5045L667L984O260K141j0600j483
8999D135O526N068P597Q75j2011m602L584o149j678n65M055R406O011r024l877
8984I351N060K265l555j8497l60R186O409N151q480p623J652j333M171K239L850
8969I486J406K010O803o167k080P392O067n383o471M18o849m963l527O498k63
8954D377J560O575j638m929P706K029j846J455j001q09l506m301N770M881M442
$$ y = [10321, -2635, 4360, 9271, 13681, 12845, 5103, 18433, 29276, 20055, 5587, 2326, 5978, 15952, 19544, 8394, 4163, 7436, 7247, 5886, -5688, -5326, -485, -190, 3892, 12201, 20066, 25287, 22887, 22637, 22797, 16907, 14240, 10655, 10139, 12793, 10647, 15180, 15121, 13784, 4923, -707, -7380, 1792, 12370, 17566, 18842, 17797, 10380, 11540, 24364, 15211, 166, 3833, 7817, 14077, 16218, 5618, 4135, 10661, 15729, 23326, 24201, 12190, 7588, 11172, 5023, 3345, 2780, 6835, 16241, 22252, 13228, 9351, 14411, 16676, 13121, -5376, -5736, 3450, 9859, 15010, 6530, -1093, 559, -774, 3397, 5636, 9486, 10892, 12902, 19705, 13538, 11458, 18850, 24917, 19534, 13063, 13481, 6632, 1669, -1858, 4640, 4377, 5937, 12512, 10874, 5945, 13651, 15680, 13834, 15289, 14288, 13479, 9973, 5672, 11442, 16323, 20765]
8939B0765j1060o05m5k390k226R29J3065M809p793M86M880m261J501l854M628
8924A8829P207L766k719n919r551Q964n456j4238j475R102N205n624m620J113
8910D584J236K803J514P741j134l306n613q733p931k006K206K957k953P046J2772
8895A1183L715o548j2592j2195K329J442l357R346O208J3390K43p270m949R58
8881A903N575j096p333l129Q102N547o87r292m135m789K201J471l878n313J1407
8866c446O690J0794K03o093M146J068p435n106M556J194j394J1888N597j0103
8852A2559o065n183J547J2726j143l458M041l880p747j976j3737n728J3484O693
8838B133o017K125R480M453q16k623M803j646r940J619N760K535k222M530l861
$$ y = [20765, 9705, 9100, 9055, 6665, 4439, 5368, 18433, 23242, 15449, 15935, 20815, 16554, 18055, 14201, 18829, 26036, 29802, 27083, 21164, 11613, 20577, 15121, 883, -592, 8510, 13715, 8091, 3471, 4584, 5820, 8623, 10137, 17878, 16744, 13438, 7825, -908, -8839, -10845, -8639, -5682, -8635, -1589, 11183, 14898, 8350, -4242, -16437, -14108, -12666, -16023, -6677, -469, 12921, 13164, 5894, 945, 1903, 7478, 6382, -951, -4080, 4022, 9569, 8882, -410, -4545, -9334, -7133, -5662, -9540, -14853, -3446, 3244, 14038, 14241, 8148, 12294, 13362, 5927, 821, 5377, 6571, 5177, 17065, 22662, 12559, 6494, 1311, 2858, 15584, 14441, 10983, 15024, 11144, 3397, 1421, -12316, -18044, -4560, 2133, -3884, -1759, 7721, 12174, 11358, 8735, 13538, 11892, 1952, 3571, 9331, 11866, 9644, 14174, 10313]
8823A0313L816Q331l973n570q274M728N902P578j0147q710j631l33L928K772M966
8808A3696P893m037m477j3192q318P359Q727R86j146J13O204N137M114j0458J147
8793A3748j960l706o637M012P857j543P127O420k245M60O700l409m837m448J872
8778A9411j108n055J916L605P621R765l357p962j0110J363P708q272o027P78j1
8763A0265L475m377o930J023O195J0922n957p704q33q556o387K817J7875K0125
8749C1953J2995o000j3146l342O904j866J801k818j2571j362P193j171K203L943
8735B4716q044l546J4381J3133j326k155L129J0060k344m460l22k751j2311m267
8721B3893P952L926q106j956O182L536J0283j232M40R846k658q490l914N496O584
$$ y = [10313, 14129, 22460, 18487, 12917, 4643, 9371, 15273, 22851, 12704, 3994, 2363, 2030, 5958, 8730, 13696, 21589, 17552, 13075, -117, -8435, -1076, 7651, 8637, 7491, 7604, 13808, 18945, 23059, 12601, 13748, 11788, 8082, 1445, 5457, 13314, 11771, 18898, 25318, 23073, 23533, 30233, 26824, 21987, 17539, 19411, 18303, 13248, 15164, 18769, 26390, 36155, 32798, 24836, 14726, 16089, 23797, 15525, 9498, 10276, 10265, 13740, 9363, 2433, 3456, 9651, 20573, 14616, 6912, 6079, -2477, -8864, -6047, 11828, 31953, 44948, 38948, 25802, 22460, 29364, 27498, 29299, 26481, 13910, 12548, 19741, 18570, 20773, 24716, 16672, 13126, 27507, 40640, 39314, 37159, 40288, 50348, 48004, 43544, 43222, 40471, 28160, 23893, 31845, 35771, 27665, 25709, 31891, 35427, 45710, 44478, 44918, 54764, 52106, 43616, 39702, 45198, 51782]
8706E1782l292N678J668N178L934O417O19N954R453o723q036p932r619J089j0065
8691D6105Q4k173j294P145O797l91j2754p75P403J3972j0561j0831l350k447l165
8676C3765K879M674R538L382J687k4n499j457q91J236J1500K810L030j06m642
8661F1882j3566r503K313M096k934m074K258R876Q981j030j384P154J963k589
8647F3443m834RR206L145Q4L190N08o596Q896J4236L707K29J1504J2513O187J2615
8631A38042O979k538J2844J6999J7400J9682K5738K8565L0821K2935J4642K180
8619C34289k4077l4996l7736j7481j6689k6037k7021k3520j9039q469o102j0117
8607H3005M053j0132j4749j1112m46j765r676p718R05R327K993L685N19j0043
$$ y = [51782, 48490, 54168, 55836, 61014, 64948, 71365, 71984, 77938, 87391, 80668, 72632, 64700, 55081, 56170, 46105, 46189, 44016, 42722, 49867, 56664, 56273, 43519, 42744, 50147, 64119, 53558, 42727, 39377, 36930, 33765, 36644, 41318, 50856, 54238, 55925, 55901, 50402, 48945, 48054, 49290, 60790, 63600, 66630, 66524, 61882, 48316, 38813, 41126, 45222, 42288, 38214, 40472, 50348, 59329, 58299, 56915, 64069, 66032, 63443, 58609, 58618, 67824, 70969, 71053, 74243, 74751, 68155, 77051, 91287, 94994, 95223, 106727, 119240, 125427, 138042, 145021, 142483, 155327, 172326, 189726, 209408, 235146, 263711, 294532, 317467, 332109, 334289, 310212, 275216, 237480, 219999, 203310, 177273, 150252, 126732, 107693, 99224, 93122, 83005, 87058, 76926, 62177, 51065, 50619, 48854, 39178, 31460, 32365, 41692, 44685, 48370, 48889, 38846]
8593C8846q158j908M70p548J510R722M745N393j0282m320p388q559L32N590J119
8578A9564O08l004N159n389n62J2534j761q754l629n655J063J1877J1608rm839
8563B8811k844m221n035p31K405j454m004L493M845k091k10N506Q278q171r347
8548A5230L63n074L112N850N58j734Q265K287L208k552o564p949m311J326k296
8533I719j0011l612P718J1193J588q323o097j912j913k412L867j807o779k9O178
8518b632m65K168M533O254l284o655m955M451l823p59Q705N946J173M2N794J0040
8502B6533k981j0173r919L736M164n408k68K526o777o72R49l651k13K614J4000
8487A4460J9237O317m079j2248r59q999o676n226o685L848j714j0434n078P615
$$ y = [38846, 30688, 28780, 29250, 21702, 23212, 32934, 37679, 43072, 32790, 28470, 21082, 12523, 12855, 18445, 19564, 20172, 17168, 22327, 16938, 16376, 28910, 27149, 18395, 14766, 9111, 10174, 22051, 33659, 33650, 28811, 25967, 21746, 16711, 15980, 18385, 16931, 12927, 16420, 21265, 19174, 18964, 24470, 32748, 24577, 15230, 15593, 10519, 13631, 19481, 20039, 18305, 26570, 28857, 32065, 29513, 22949, 15000, 10689, 12015, 9719, -292, -3904, 3814, 15007, 16595, 8272, 2175, 263, -1650, -4062, -195, -2002, -8781, -8810, -2632, -3097, -929, 3604, 9858, 6574, -81, -5036, -585, -4408, -5167, 3538, 9484, 10657, 10699, 16493, 26533, 23552, 13379, 3460, 7196, 11360, 5952, 5684, 8210, 1433, 761, 1710, -1941, -2154, 460, 14460, 33697, 40014, 35935, 23687, 22728, 13729, 7053, 1827, -4858, -1010, -2724, -13158, -18236, -10621]
8473a0621R909L958m76K345k866n103L502k038L958P47K662r081L501M813q385
8458c175m271q75L69m712L070L230Q57j450M765K035j698P819L680k44l189j92
8442F019N501n85o638j2248l305M919P032N697p474j074J3112K782n190j1125
8428b577J762O849J125K551j492j1208m86Q295J4326m57N69p826j444m21k210
8413G356k136J457P83r17M314n143o066J907J783r14m415j261j0804R76J4370
8398A290Q177j05K08L189L600l953r03q184l931J391J1110K9p916J07R42M135
8382I186j0435q282n629O775J8855O68M22P511m859o506l343n897Q573M867l662
8367H244k880j415L29l696l520O623R693k363o552o940L528M789r733K450O748
$$ y = [-10621, -712, 3246, 2770, 5115, 2249, -2854, 648, -1390, 2568, 3315, 5977, -3104, 397, 5210, -3175, -7446, -8321, -7952, -12664, -9594, -6364, -5507, -6957, -2192, -157, -1855, 5964, 9644, 9400, 6211, 6019, 11520, 10935, 4297, -7951, -11256, -6337, 695, 6392, -1082, -2156, 10956, 13738, 8548, -2577, -815, 6034, 7159, 9710, 8218, -2990, -3476, 4819, 19145, 18688, 19257, 11431, 9987, 9566, 7356, 5220, 6677, 7460, 6543, 10857, 5714, -352, 1555, 3338, 2424, -1991, -3252, -14056, -13080, 1290, 9467, 9362, 9570, 12759, 16359, 12406, 11503, 3319, -612, 779, 11889, 11918, 4002, 4109, 5051, 9186, -1249, -9531, -15160, -8385, 10470, 11138, 11560, 19071, 14212, 7706, 4363, -1534, 7039, 11906, 8244, 5364, 3949, 4278, 582, -2938, 3685, 13378, 11015, 4463, -2477, 1051, 5840, -3893, -1443, 5305]
8352E305L581P155n15q436o669m362L370M76O219p50N34l058j0873o099N162J2856
8336C896J790l729L584K192l76J745o897j351R384P296j783j4632m367K00P36
8321b312m770L504j982J4J2277J1894L845k020o744p844j781L570O294K684j88
8306A6441O104K571J279k151j1633j47l545J769K543r140l334J2635l581j9178
8292i367K014J727K932M674M414N43L678K759j2056K428Q128q714m576o034P320
8277a30J0448N37m681j942l292K166N814L466n214l915m788j068j056k757m580
8262a0992l360N016J2546M144m975m465j226M448l483J46k230J3775K190p044
8248D490p048n638M615M558L912L921k908J906o189k464N447L068M366q580q785
$$ y = [5305, 8886, 16041, 15526, 7090, 421, -3941, -571, -95, 6124, 5374, 5908, 2850, -8023, -14122, -8960, 3896, 5686, 1957, 5541, 7733, 7357, 9102, 2205, 854, 10238, 17534, 15751, 1119, -3248, -3048, -2312, -7082, -3578, -5560, -5546, 6731, 18625, 22470, 20450, 13706, 5862, 4081, 7651, 13945, 16629, 16441, 22545, 25116, 26395, 24244, 12611, 12464, 8919, 10688, 13231, 4091, 757, 13392, 9811, -9367, -7353, -5626, -2694, 1980, 6394, 6937, 10615, 13374, 1318, 3746, 11874, 3160, -1416, -7450, -130, 10318, 10855, 6174, 4232, 940, 3106, 8920, 12386, 7172, 3257, -1531, -2599, -3655, -6412, -10992, -14352, -9336, 3210, 7354, 2379, -2086, -3312, 1136, -2347, -2201, -4431, 9344, 11534, 4490, -2558, -8196, -3581, 977, 4889, 8810, 5902, 7808, 1619, -845, 4602, 7670, 12036, 3456, -5329]
8233e329O39O64k0q10n117O853N953Q584N00j3791l707o088N788M260p222n551
8217a4394N098L457L01R382m120j7516k933J8613O770N032Q418M841o899q868
8203G182o041n419q82m878J450J5638k536n849J2462L786k709k789R182j102L315
8188B0810q975o979n856q693L540Q886r34o864K831m01m44P877M832j0897q793
8173a0060r474J2088Q325J2039M709m020j5228j2446N451l536J708K476M68R476
8159A976L045p31J684K31m514k797K859Q51j0251j039J0160O411q027m63K034
8144A429k024l14L65J5477j264m357q564m333O849J4311M970m171m798M486m862
8129A3200p006j796n421J578l155l122l845N780R281Q297M896n285o309k226M536
$$ y = [-5329, -4690, -4026, -4046, -4856, -9973, -3120, 2833, 11417, 11917, -1874, -5581, -11669, -5881, -1621, -8843, -14394, -9296, -5839, -5538, 3844, -276, -17792, -20725, -2112, 4658, 9690, 18108, 22949, 16050, 7182, 1141, -4278, -5160, -10038, -8588, 7050, 4514, -1335, 11127, 14913, 12204, 9415, 18597, 17495, 20810, 11835, 4856, -1000, -9693, -6153, 2733, 1799, -5065, -2234, -2635, -3079, 4798, 9630, -1267, -10060, -19534, -7446, 879, 12918, 17627, 13607, -1621, -14067, -8616, -12152, -10444, -7968, -7500, 1976, 5021, 4290, 5974, 6205, 1691, -1106, 1753, 2604, -7647, -8686, 1474, 7885, -142, -605, 1429, -595, -909, -544, 14933, 13669, 9312, 748, -3585, 3264, 17575, 22545, 18374, 13576, 18062, 13200, 6194, 4398, -1023, 555, -2600, -5722, -9567, -3787, 5494, 13791, 18687, 13402, 7093, 4867, 9403]
8114I403K278m089N023L020n893m123r219J017l51N628o61P775M858m127N094
8099A5633j490o976p826k342N040l188o760J1052N977L981J0746K765j1891m34
8085A4287O61k249J357N748K568O177R72o188n930J0065j621j3811r256j316R991
8070A1455J1560l872n94P991J15q769k660o514N578Q505R747O05j221j009j0111
8055B0806N52J5513P584n051q488l126J934J4464N213l697K532j482j0379J468
8041C7843Q577m694k694j933l266J338L2K018L93K937J549K845m19o769k078j084
8025C4595J731O598k040q211l891n539k894J1508o736n484N943J1941j4003r881
8011A3637M130J1629n756q051l605j2194o271J2394P530K794J9361J4919n111
$$ y = [9403, 11681, 7592, 12615, 15635, 9742, 5619, -3600, -2583, -2934, 2694, 2033, 9808, 14666, 10539, 15633, 14143, 7167, -659, -3001, 2039, -1149, -7909, 3143, 9120, 13101, 23847, 26612, 14721, 14287, 14948, 12699, 14056, 19804, 22372, 28549, 29521, 23333, 17403, 27468, 25847, 12036, 2780, 1464, 11455, 23015, 19143, 18549, 26540, 26655, 17886, 15226, 8712, 14290, 22795, 32542, 33147, 31926, 30917, 20806, 21358, 36871, 44455, 39404, 30916, 27790, 29724, 44188, 49401, 45704, 48236, 46754, 36375, 37843, 46420, 41726, 39032, 37099, 33833, 35171, 35203, 37221, 37614, 40551, 42100, 44945, 44526, 37757, 35679, 34595, 36326, 42924, 40884, 32673, 28782, 23243, 20349, 31857, 25121, 19637, 25580, 37521, 23518, 13637, 17767, 29396, 23640, 15589, 11984, -210, -6481, 5913, 13443, 16237, 35598, 50517, 45406]
7998D5406l775j0863j551l363j597O068J4935k810o794L034O143R42K417m059
7984D4133L456n233j1528k047O878J1843j846j2588j2699J058l354r490j4685
7971f102q62J808J647J1141J0849j365n964M266m701J364J205o767k774O150J4303
7956B4198P489p379j384P913o431m59M361N823j7428m569R98P667k819o625P955
7941A9310L526j4767j5340r482M972J3983M097o315N561j353J070N386J856M708
7927A7212o605o461J1368J530K621q062j394o276K675q485q223Q347J1719M052
7913A4018L525l498q866M754N094K389k036j2724m112m813n522Q156M513q736
7899g858L842O103m215j881o927M998n060m388O333J1239J124J00q657K122J0153
$$ y = [45406, 41631, 30768, 29217, 25854, 24257, 30325, 45260, 42450, 35656, 38690, 44833, 45775, 48192, 44133, 47589, 42356, 30828, 28781, 35659, 47502, 45656, 33068, 20369, 21427, 18073, 8583, -6102, -6964, -5156, -3509, 7632, 18481, 17116, 11152, 15418, 10717, 12081, 13286, 6519, 3745, 9895, 24198, 31687, 24308, 22924, 30837, 24406, 23947, 28308, 34131, 16703, 12134, 13132, 20799, 17980, 11355, 19310, 22836, 8069, -7271, -16753, -11781, 2202, 6299, -16, 5545, 4192, 5262, 10648, 12504, 17212, 10607, 4146, 15514, 17044, 19665, 11603, 10209, 3933, 6608, -1877, -10100, -1753, 9966, 14018, 17543, 14045, 5179, 9933, 15027, 17416, 15380, 2656, -1456, -6269, -11791, -3635, 878, -7858, -4016, 2087, -2128, -4009, -10936, -5938, -10998, -15386, -9053, 2186, 3310, 3410, -5247, -3125, 7028]
7884G028o101P574M431n898l031L699Q687p162p556j0297o216M315J2324J2284
7870A4081k957p929K219Q944j157j462k740j295j145m057L590l199l856J2054
7856A1091K841m661j1017n288M957j901M689l718J2262n915n005j96N748J472
7842E359L204k13k759J783R79j04p904n353l336L604j733L126m506m664N390j0660
7826a7787K638P407P634j309J992j52j558n941o705l015M061J120k879O501K552
7811e441R433P619j2769J750J228K329j020j892r08n092R67l669N745l934j1229
7796a6883N629o82L183J222N58L649n690J345M293K228O00J415l720L010L181
7781C338r229n887k654m377J1628P926m021K657J0211L864p026r477n8L076N701
$$ y = [7028, 927, 8501, 12932, 7034, 4003, 7702, 16389, 9227, 1671, -8626, -14842, -10527, 1797, 14081, 11124, 3195, 5414, 14358, 13201, 11739, 8999, 7704, 6559, 2502, 6092, 2893, -963, 11091, 13932, 9271, -1746, -7034, -2077, -3978, 711, -3007, 9255, 3340, -1665, -1861, 3887, 5359, 8563, 8350, 5591, 7374, 8353, 8249, 345, -5008, -8344, -4740, -6473, -3347, -7853, -12517, -7127, -17787, -15149, -7742, -108, -1417, 575, 423, -1135, -7076, -13781, -16796, -12735, -11615, -14494, -7993, -5441, 3992, 11611, -1158, 592, 1820, 4149, 3129, 1237, 329, -4763, -3796, -7465, -1720, -5654, -16883, -11254, -11936, -8753, -7531, -6973, -3324, -9014, -7669, -3376, -1148, -548, 867, -2853, 157, 3338, -5891, -11778, -14432, -18809, -7181, 745, -3276, -619, 9592, 13456, 6430, -3047, -3105, -29, 5672]
7766E672m231n308j364m560m709L914Q997o703j57J2732R215k729j276K777m248
7751H022j321k616L35k232m172l485n371Q079J0572r4p777P18K024Q37j327K838
7735E030K706O068m438j2485J047J852O276J0535K994o241l417m923J0186j159
7721A4031n710j200m739j639q554l15j0754o506K902k685P814J3519Q501m741
7707g6j1520n267l18J1234k656l731K622O782m927O15l16O191N368M219q2j1134
7691b996l582O6P916M748l292l951l204j303n401M960o485O531J0774l890k385
7676a494o75j1248L027L456m810N735r04o57L756M962P277L151p488j8869Q273
7661f508M645K743O478J597q461m399p977k5N813K105j0511l364P614J0272N075
$$ y = [5672, 1441, -3867, -5231, -9791, -14500, -10586, -1589, -8292, -8449, 4283, 13498, 10769, 9493, 12270, 8022, 6701, 4085, 4420, 2188, -1984, -5469, -10840, -2761, 7811, 7717, -60, 658, 2682, 3519, 2192, 5030, 7736, 13804, 9366, -3119, -2072, -220, 6056, 16591, 19585, 13344, 9927, 5004, 15190, 14031, 8321, 7121, 2382, 743, -7811, -8126, -18880, -25386, -22484, -25169, -17355, -3836, 4665, -76, -11596, -16863, -17181, -5947, -8603, -12334, -9712, -2930, -7857, -7242, -7558, -1367, 4001, 8220, 8138, -2996, -6578, -6512, 1404, 6152, 2860, -1091, -4295, -5598, -10999, -6039, -12524, -5993, 4781, 891, -1494, -2169, -13417, -10390, -6934, -11744, -6009, -6913, -7570, -3814, 1148, 8425, 11576, 4088, -14781, -6508, -1863, 880, 7358, 8955, 494, -3905, -11882, -11907, -6094, -3989, -14500, -17864, -10250, 22, 5097]
7646E097n97L510J558l887M442k76k932k252J157J26m317j6863o616K508J9453
7631A11J4726M234J800o920j058p620l556m86n422q454M082P063k682m064k9P754
7615e21p076j3199J640o60k745P518Q158R182n553J887o877l622R579Q25L258
7600A794J478k74P282o095O3p601k251l180Q11J0642N765r680k760R825J595j425
7584E989l754n813R14J0006j4936q199R081l16J08N253J549j0383L654l640L307
7569g180O782J438o494N178J301M505Q49j3408p925Q49P114R791O265k545r959
7554c439p657r80L062n84n564k604K767M332K949j449j0498K65J5247k889k575
7539i617L212J1959O707l561m259k964q816j34J0622r04m823q81K127n678k836
$$ y = [5097, 4500, 8010, 9568, 5681, 10123, 9847, 6915, 4663, 5820, 5946, 1629, -15234, -21850, -19342, 111, 14837, 19071, 20871, 13951, 12893, 5273, 1717, 1231, -4191, -12645, -8563, -1500, -4182, -8246, -8275, -521, -7597, -20796, -19156, -19816, -22561, -15043, -6885, 2297, -3256, -1369, -8246, -11868, -2289, -1464, 1794, 3272, 2998, 10280, 4185, 4248, -3353, -5604, -8784, -7973, 2669, 8434, -1246, -4006, 5819, 7414, 5989, 2235, -3578, -2664, 7342, -7594, -15793, -6712, -7028, -6920, -1667, -118, -10501, -6847, -10487, -7180, -398, 1040, -5454, -276, 1025, 5530, 6379, -7029, -14954, -14105, -6991, 2800, 9065, 6520, -3439, -11096, -12076, -9014, -9598, -15162, -17766, -14999, -10667, -7718, -9167, -19665, -19400, -4153, -7042, -9617, -6405, 5554, 12261, 8700, 4441, 1477, -7339, -7473, 3149, 2245, -2578, -3459, -1332, -7010, -9846]
7524i846p242m185J4109J6832Q595j2766k081n875l644J983L124M59j633M222
7510B052j312j5318M0N854K623M011L729L712j2024l168k725K868l592L56N52
7495a2342L7p24l192j192L637l810J651om712l01N008M123R829O639m918q248
7479h521L025J429M69n5n804M173J343n091m681j20M041P750Q02p15r95j916P499
7462B633n939K710j831r217k108L065K473K439l69P893M706n741j0621j261l846
7447a5014J810M866L150M708J1222J207m128o963R44k100k844l317l131k889N697
7432f782j039M095j4320o76N923J565N050j732p78M921Q661p18n432K166q21l975
7416c892K161P857l405o006N136l176m892l64J773O229K690o36j5965r50O021
$$ y = [-9846, -17088, -21273, -7164, 9668, 18263, 5497, 3416, -2459, -6103, -4120, -996, -537, -2170, 2052, 740, -14578, -14538, -8684, -6061, -2050, 1679, 5391, -6633, -9801, -12526, -9658, -13250, -12894, -12342, -12305, -13029, -16221, -17413, -13776, -17586, -15935, -15941, -20653, -20954, -15946, -11823, -1994, 4645, -273, -8521, -5496, -4067, -3598, -3653, -9457, -5284, -3941, -9032, -13713, -13833, -9792, -2042, -1240, -1955, -2950, -4866, 2633, -3306, -596, -2427, -11644, -13752, -10687, -8214, -5775, -6144, 1749, 6455, 714, -9907, -11168, -15014, -13204, -8338, -5188, -480, 10742, 11949, 7821, 858, 1802, -298, -3142, -6459, -9590, -12479, -6782, -7821, -3726, -18046, -18722, -12799, -11234, -6184, -7916, -8694, -3773, 4888, 4170, -1262, 904, 83, -3892, -1731, 6126, 2721, -3285, 1851, -1325, -6217, -6581, -4808, 1421, 4111, 3475, -12490, -13440, -7419]
7401g419R948O449K572k625J004J457j0432r154k204J0228J393J999k847L143
7387C512L508n205m318R969J495R7q370k834m045M201L611M115J333L845K467
7372A3381q360N36K195L51l076j4621k422N190j2459m50O475K504K960k869N88
7357a0077P35n866m932o359m789q427N222O472Q423Q00O504Q63j0197L044Q297
7342a0287J1190Q624R23o566l559K170O637j703N37N735m691L533n041m104k601
7327G97p656m3j774L936P278j538m986J954l063m800M828Q80m161J486j531L385
7311e008L787L41Q869k158j2685q787p578j194Q933J8283Q474J531K255m393m757
7296E913P26n669j1584j0362m84r13l483J136N040N555O740N565M695r978K770
$$ y = [-7419, 2529, 8978, 11550, 8925, 9929, 11386, 954, -8200, -10404, -176, 1217, 3216, 369, 3512, 7020, 1815, -2503, 7466, 8961, 9058, 688, -2146, -6191, -1990, 1621, 5736, 7069, 10914, 13381, 5021, 5557, 7752, 8103, 5027, -9594, -12016, -6826, -19285, -19735, -13260, -10756, -7796, -10665, -10077, -9342, -15208, -20140, -26499, -31288, -39715, -34493, -28021, -19598, -18798, -12294, -11431, -21628, -18584, -10287, 903, 9527, 10450, 3884, 325, 2495, 9132, 7429, 7966, 13701, 9010, 12543, 7502, 3398, 797, -6859, -6902, -8676, -4740, 2538, 1000, -3986, -2032, -5095, -9895, -5067, -4187, -8348, -6862, -8393, -5008, -1221, -880, 7989, 5831, -6854, -15641, -23219, -24413, -15480, 2803, 11277, 12808, 15063, 10670, 5913, 6639, 970, -10614, -20976, -21460, -22373, -25856, -24720, -19680, -14125, -7385, -1820, 2875, -7103, -4333]
7281d333O184k75m440j888m116N937J6173O182k09J691l643j4242o042J319Q999
7266G297l302m052O620M605K902m786p994N268J2118j51j0265j3196k723Q548
7252H89m325q050P032O230l851j223J910M35k069K774M51j2037p986M02M720J0316
7236d382k662p845k115q096Q055J4669R668J463l833k522N78R311M796j92j056
7221A5837j5722p115j509O425J011m953J298q496Q905J1840N015L041L414Q83
7207A9874n930n136r784K994K002n164j447K754O307J434l002o022K701k825q095
7192i339k178Q07J0031O048p298q315k25N153n920R910J2148m066l683K591J4
7177E678n68M400R875K76k726m545m564J995m730j722j476j59r903j078L844Q016
$$ y = [-4333, 1851, 1576, -2864, -4752, -8868, -2931, 13242, 19424, 19215, 20906, 17263, 3021, -3021, -1702, 7297, 3995, -57, 6563, 11168, 14070, 9284, 1290, 6558, 18676, 18525, 8260, -4936, -7659, 889, -3436, -11486, -4454, 1776, -2075, -3298, -1388, -953, -3022, -248, 203, -11834, -19820, -19418, -14698, -4382, -7044, -14889, -17004, -25100, -17045, -2376, 7292, 8755, 4922, 2400, 2978, 12289, 17085, 16893, 15837, 115, -7000, -8509, -2084, -1073, -6026, -4728, -13224, -4319, 7521, 12536, 15577, 18991, 19874, 13944, 8808, -976, 2018, 4020, -1144, -2591, 163, 6470, 7904, 4902, -1120, 1581, -1244, -9339, -11517, -10710, -679, 5369, -1929, -10244, -10469, -5316, -11236, -1326, 10822, 6756, 3073, 5664, 5678, 5110, 9510, 19385, 19661, 16935, 12390, 7826, 9821, 5091, 3369, 1893, 1734, -8169, -9247, -5403, 2613]
7161B613L831k594l023j477Q868n207j833k494L445n90m246J148N411m035k192
7146b375K151r625q101L898O965K730k702J43O780P204j3001l747n408m262J4819
7131d531L803l845m175J620Q99j0710j696r65O203J033J2291N685m204k089r419
7116a0100r987P92p402L825K406L287L97O615Q233K25j2733L434Q140Q236n894
7101e26n106k503K836k994J265l725O352k069m131m152M564Q805n74J266l24l475
7085d491J171P450r09r53p494l72k201M152m178m992K928O133M171j0653l516
7070a3754j636M334N194P690q69l119K003l149K431l376n16O90L308n064o079
7055a1912j1781q297N953L785R086J3263Q031M02k055j295K56r583P122J224P028
$$ y = [2613, 6444, 3850, 827, -650, 8218, 3011, 1178, -1316, 2129, 1539, -2707, -1559, 3852, -183, -2375, -224, -9849, -17950, -14052, -7087, -4357, -7059, -6916, -136, 7068, -5933, -9680, -15088, -19350, -4531, -728, -4573, -8748, -7128, -6229, -16939, -18635, -19600, -13397, -12364, -73, 5612, 1408, -681, -10100, -20087, -19295, -26697, -22872, -20466, -17179, -16782, -10167, -1934, -1709, -14442, -11008, -2868, 5368, -526, -5632, -8135, -5299, -8293, -7028, -10753, -4401, -6470, -10601, -14753, -10189, -1384, -1958, -692, -1016, -4491, -3320, 4130, 3221, 2268, -5226, -5598, -7799, -3647, -7825, -12817, -9889, -3756, 415, -10238, -13754, -15390, -11056, -5862, 1828, 959, -2160, -157, -3306, -875, -4251, -4767, -4077, -769, -5833, -11912, -23693, -31990, -26037, -22252, -13166, 97, 8128, 8530, 6475, 5180, 5436, -4147, 2975, 4199, 11227]
7040A1227k222N902M338j3927m335J891K973j0620n174M83O162p73L847J219j987
7025i96Ln766l913j0228n747L955J0617R787P505K309J841J220J33k644p746j2891
7009a2561O448N273l069Q99l49j0495P62K856m049j507K606K212O314M816N40
6994F96k356p051Q638J0888k242o180r012k492O03J1609N130j1537j030k517J001
6979e852R719Q00L293n336n280o287K11J2109q98j5026P72O419q102j843P688
6964g613J759J235m222j003J1645O070l691q995L110k670J106N106N381l352m128
6949b62o756N181J0715n845j910k100q778j047n0N553L941n841p937L081Q041
6934d014J290m141k956J0001n95K155k088L662o475N529L10r33J790R16o990J870
$$ y = [11227, 9005, 14907, 19245, 5318, 983, 2874, 5847, -4773, -9947, -9464, -3302, -4075, -228, 991, -996, -993, -6759, -10672, -20900, -26647, -22692, -12075, -2288, 5217, 7526, 9367, 10587, 10720, 8076, 330, -12561, -6113, -840, -3909, -3010, -3359, -13854, -13092, -10236, -14285, -15792, -13186, -10974, -4660, 156, 696, -1660, -8711, -73, 10815, 8573, 2393, -6619, -9111, -8508, 3101, 8231, -3306, -4336, -6853, -5852, 3867, 4667, 7960, 2624, -2656, -8943, -8732, 3377, 2479, -12547, -11775, -5356, -13458, -15301, -7613, -5854, -4619, -8841, -9844, 1801, 7871, 4180, -4815, -1705, -4375, -3269, 1837, 7218, 3866, -262, -7018, -1837, 8878, 3033, 1123, -977, -9755, -10802, -10852, -5299, -1358, -7199, -15136, -12055, -4014, -2724, -6865, -9821, 180, -415, 1740, -348, 3314, -3161, 2368, 2678, 1745, 3535, 4451, -2539, -669]
6918f69O228N933k022j3285j0219j315Q028m008J539R491j737k270k560K80J1012
6903D426J1969j3480o399P044M552j3170r359R296M417K383J2239M12j0048j568
6889B714n872l449J979m861l82N277L622k855n60j0283Q460L310J395r62o878
6874i345P03l745k396J629k004K514n883q7n901K306R336K966m913m51K088p213
6858b0396m779k871M206P382J2532K288l971K179J1243j891M628o354r552K450
6844b906m273l977P30R078N673j1440p429P714j2742M504J4860J2762K521p373
6830G702q981J195m213j592M803J2940O175m082j1805R69L80j367l19k076k473
6815b744P449l539K415k851j3218m3M87M148J0801J1570l270j0349J274n219N630
$$ y = [-669, 5559, 11492, 9470, -3815, -14034, -15349, -7321, -11329, -9790, -299, -2036, -4306, -6866, -6586, 4426, 16395, 2915, -3484, 3560, 8112, -5058, -14417, -5121, -704, 1679, 13918, 14330, 4282, 2714, -3158, -6607, -4628, -9489, -9871, -4594, -972, -3827, -4387, -14670, -6210, -2900, -1505, -2467, -9345, -8642, -12387, -14783, -13154, -15158, -12644, -18527, -18614, -24515, -22209, -12873, -9907, -14820, -15271, -13183, -20396, -25175, -28046, -23840, -16458, -3926, -1638, -5609, -3430, 7813, 5922, 10550, 4196, -5356, -2906, -7179, -11156, -10426, -1348, 4325, -7115, -14544, -6830, -19572, -15068, -208, 12554, 15075, 7702, -1279, -84, -4297, -5889, -1086, 11854, 18029, 13947, 2142, 3111, 3491, 2124, 1805, -271, -2744, 4705, 1166, 3581, 730, -12488, -12531, -12044, -7896, 2905, 14475, 11205, 856, 2130, -3089, 2541]
6800B541j430k430M367m406p251j474M143M589o575M964J908k75R31m73j236J354
6784g53k902N834N795o753J914M050l781p703P87K43m392N344R052J7768n386
6769A9117j9084m058l99j866O264M011l571k552Q93j518o031j1676k868Q210R864
6754e264M307j372r42k96k200k089m012K786P908P115P541k506m605j950o11j572
6738B238l040n522l029Q972L720L114j3025m328j224l997k562P464k984O708l034
6723a0529R129J8644k42j8325k099N824L311J169O157n244p167o469n960m321
6709a6122n069Q845j94O779J903n033j390j095L865J3470q114l714N551o302o127
6694a2747K72N80N074P721N166n958k95p504R974m871q38N882L279j1006p169
$$ y = [2541, 1111, -1319, 3048, -1358, -8609, -10083, -5940, -1351, -7926, -2962, -1054, -1329, -398, -871, -2107, -753, -3655, 2179, 7974, 1221, 3135, 7185, 3404, -4299, -3512, -3269, -7661, -2317, 6735, 24503, 19117, 33, -4025, -4424, -6290, -26, 3985, 414, -2138, -1245, -2763, -8794, -20470, -23338, -15128, -5264, -957, -2329, -3271, -3567, -5767, -7856, -11868, -9082, -1174, 5941, 13482, 10976, 6371, 4421, 3810, 2238, -802, -6324, -9353, -381, 3339, 6453, -6572, -10900, -12124, -16121, -18683, -11219, -14203, -7495, -10529, -1400, 17244, 17002, -1323, -3422, 2402, 5713, 6882, 13039, 7795, 628, -5841, -11801, -16122, -21191, -12346, -12540, -5761, -3858, -8891, -10281, -11376, -7511, 5959, -2155, -5869, -318, -6620, -12747, -12475, -11895, -6821, 900, 6066, 108, -187, -7691, 2283, -2588, -3426, 2456, 5735, -5271, -12440]
6679a2440Q503L756J1718K746j0246n422k116l474Q158K102l971L761j972K412
6665C515L823o046j035n503m05N448k055j054j160k738K867O294q270m856j647
6650a2822J360O483m769l450N770J3776J494k370j0120R367R680N258q373j0306
6636I78q879m305j260J201N829K758L536N489j217q656n557o9J5534J370r670
6621b918k495R352p122j493N955R611P92j4449k000O899o225j1491M196L075p131
6606a5444O700J2476L524K803O78M071j103q641o819l903m957J357J0077K560
6592C379k921r481n020l580l88J0673J4822Q223K684m685m115l96K243j063n182
6577E193n518l469j009l866j510M015R7l67K008P898m574n510m585k157J13M637
$$ y = [-12440, -3937, -181, 11537, 14283, 4037, -1385, -3501, -6975, 1183, 3285, -686, 3075, 1103, 3515, 7338, 1292, 257, -5246, -5651, -203, -2258, -3312, -4472, -7210, -4343, 1951, -6319, -11175, -12822, -11462, -4979, -9748, -13198, -7428, 6348, 7842, 5472, -4648, 4719, 14399, 19657, 11284, 978, -7901, -12206, -13466, -12265, -6436, -3678, -142, 5347, 4130, -4526, -10083, -10152, 5382, 6752, -2918, -5413, 3939, -3183, -4676, 1279, 10890, 11682, -2767, -4767, 2132, -4093, -15584, -11388, -8313, -15444, -8744, 3732, 7256, 10059, 10737, 14808, 13705, 5064, -1755, -5658, -10615, -9258, 819, 3379, 458, -9023, -14043, -17623, -18011, -7338, 7484, 15707, 18391, 13706, 9591, 9195, 11438, 10375, 5193, -325, -3794, -4803, -8669, -10179, -6164, -6067, -6434, -4426, 3472, -1102, -6612, -11197, -13354, -13241, -8604]
6561h604J585M559P17o509K604N942q015m060J2940j273l343P058K591l237M037
6546F992K213M90K352M298p023o918M086J941J2755J891l168q254q581m63m835
6531b224k232M305J0351o24j1128m808q466n454L551J259O443Q833P53J250N82
6516B391j57M48o567l170k481m27J339K833P945l211k146q511k65K407J741j47
6500g978M827M213j057j1431P99j333l326m395O015L21M380J0683P138j021n401
6485B434M681n658q857k591J3291L970p039m152Q54J439N532K09L003o748k238
6470a870O519K390j5150j3519M757o54N248Q647J5290k183n367l575k12m497j333
6455e509q64p423M57K799J745m43K419k148o404m955j045J3924O563q023Q062
$$ y = [-8604, -7019, -2460, -1743, -8252, -5648, 294, -7721, -11781, 1159, -114, -3457, 3601, 6192, 2955, 6992, 9205, 9695, 12047, 16345, 9322, 2404, 6490, 8431, 21186, 23077, 19909, 11655, 3074, 2611, -2224, -4456, -151, 10200, 9576, -1552, -6360, -14826, -20280, -16729, -15470, -9027, -194, 559, 1809, 2391, 2234, 2682, -3885, -7055, -9536, -9963, -8624, -5791, 2154, -1057, -3203, -11714, -11979, -9572, -7831, -7978, -3151, 1062, 5, -11426, -10627, -11960, -15286, -19681, -13666, -13345, -8965, 1718, 8856, 7835, 2434, 7115, 1457, -7400, -9991, 3300, 7270, 231, -3921, -3067, -1628, 3904, 4113, 7116, 368, -1870, 4649, 7039, -8111, -21630, -16873, -17527, -12279, -3632, 11658, 9475, 4108, 533, 321, -4176, -5509, -6373, -13796, -13339, -10540, -8795, -9238, -6819, -8967, -15371, -20326, -21371, -7447, -884, -8907, -845]
6440h45M63M200k954j6205M603J1551n403n266J586L680N02m374J424K784k581
6425f835j259M950P457K767l588j2642J869J655P127j227n35o446q432j048l67
6410a6554J8629o684k310R50L757Q807p815k993j197r138o366k652J0649K603
6396a0314R547R47n790o560L991J126n12J0298Q085j453o012o147P097j944j5995
6381a3636K951K649j272m921J0462O595L349l479k502J713n379K51k519M590k000
6366c148j668k035Q241j428l480k8j84M172l894p715k122K755P37L30K477N702
6350a288q312K683J090M614P22Q246p900j2193Q686k489M538k683n171J757J4847
6335G147O64k972n081j0495n633J1528J108J6q46o728M182L920J318r329j5598
$$ y = [-845, -382, 3818, 864, -15341, -10738, 813, -4590, -9856, -8270, -4590, -4088, -8462, -7038, -4254, -6835, -8094, -3144, 4313, 7080, 3492, -9150, -7281, -5626, 1501, 274, -261, -6707, -15139, -16187, -16554, 2075, -4609, -6919, -5969, -2212, 6595, -1220, -4213, -5410, -14548, -20914, -23566, -12917, -10314, -767, 180, -5610, -12170, -8179, -7053, -7565, 2733, 10818, 9365, 3353, -2794, 4303, 2359, -13636, -10685, -8036, -9308, -14229, -3767, 2828, 6177, 2698, 196, 1909, -3470, -3219, -5738, -1148, -3148, -4816, -6851, 1390, -38, -3518, -3546, -3730, 442, -3452, -11167, -13289, -10534, -9797, -9467, -6990, -1288, -9600, -6917, -5827, -1213, -491, 7755, -145, -12338, -3652, -6141, -1603, -4286, -9457, -7700, 7147, 7811, 4839, -242, -10737, -16370, -4842, -3734, -3718, -4564, -11292, -7110, -3190, -1872, -11201, -26799]
6320b6799m753J303P598Q360J8683Q074j0377L41j148j540L55k414k073p966N000
6305g356L931L046j0426j0947N461J2349Q254r705j0863M275O519j2916o467P247
6291a7598P100M299Q392M612j5950m720J2210N681k1376j010J3225k319M8L679
6277c727m841k275n406o317o628P178R556r28m201k095q875J156R192l80n37o705
6261b5833J823J4364M967N949K983M730m152q131j422M750K899L217n730l779
6247c365K152J3397j467j3872n016K263K461j0296L022N249P63K880J0301P263
6233A5735n202j0267j2811M218J112J233kN05L479M105k080P626j563K28Q501
6218A4817M873n550r567j365K69r389l725k667K009L372N861r614J883Q986J95
$$ y = [-26799, -31552, -30249, -22651, -14291, 4392, 12466, 2089, 2430, 1282, -258, 97, -2317, -4390, -12356, -7356, -3425, -379, -10805, -21752, -16291, -3942, 4312, -5393, -16256, -11981, -5462, -18378, -24845, -17598, -10498, -6199, 2193, 6805, -9145, -13865, -1655, 4026, -17350, -18360, -5135, -7454, -7406, -3727, -8568, -10843, -16249, -22566, -29194, -22016, -12460, -13388, -17589, -19684, -28559, -27403, -18211, -18591, -19128, -25833, -24010, -9646, -4679, 1270, 4253, 8983, 4831, -3300, -4722, 28, 2927, 6144, 414, -3365, -1213, 12184, 10717, -3155, -8171, -5908, -3447, -13743, -10721, -5472, -4709, -1829, 8472, 15735, 10533, 266, -12545, -8327, -7215, -5982, -5984, -5479, -2000, 2105, 25, 7651, 6088, 6316, 14817, 19690, 14140, 4573, 3208, 3477, -5912, -9637, -12304, -10295, -6923, -1062, -10676, -8793, 193, 388]
6203C88K513J706r207j3201j072J09Q791j050k072O242O882M863J206L501J298
6188A0897j4648n866K013k197q511n645L569K225O974O020r94p45N583L466K362
6173D503k966m198j1615O025L813k820J098M004J199n11L085L716O183k179q039
$$ y = [388, 2901, 4607, -4600, -17801, -18873, -18764, -9973, -11023, -13095, -6853, 29, 4892, 6098, 9599, 10897, -3751, -9617, -7604, -9801, -18312, -23957, -20388, -18163, -11189, -5169, -6163, -6908, -1325, 2141, 4503, 1537, -2661, -14276, -8251, -4438, -7258, -6160, -2156, -957, -1468, 1617, 5333, 11516, 9337, 1298]
$$ [...]
##END NTUPLES=NMR SPECTRUM
##END=
