##TITLE=Analysis number 315501
Compound Code btb 12757
Project Code adrs
Chemist Name cyclan
##JCAMPDX= 6.0         $$ Bruker NMR JCAMP-DX V2.0
##DATA TYPE= NMR SPECTRUM
##DATA CLASS= NTUPLES
##ORIGIN= Bruker BioSpin GmbH
##OWNER= NMR
$$ XWIN-NMR		Version 3.5
$$ Tue Nov 22 10:05:30 2005 GMT Standard Time (UT+0h)  MAYBRIDGE\NMR@NMR_250MHZ
##.OBSERVE FREQUENCY= 250.131544655141
##.OBSERVE NUCLEUS= ^1H
##.ACQUISITION MODE= SIMULTANEOUS (DQD)
##.ACQUISITION SCHEME= undefined
##.AVERAGES= 16
##.DIGITISER RES= 18
##SPECTROMETER/DATA SYSTEM= dpx250
##.PULSE SEQUENCE= zg30
##.SOLVENT NAME= DMSO
##.SHIFT REFERENCE= (INTERNAL, DMSO, 0, 16.522)
##AUDIT TRAIL= $$ (NUMBER, WHEN, WHO, WHERE, WHAT)
$$ ##TITLE= Audit trail, XWIN-NMR		Version 3.5
$$ ##JCAMPDX= 5.01
$$ ##ORIGIN= Bruker BioSpin GmbH
$$ ##OWNER= NMR
$$ C:\u/data/dgb/nmr/ADRS/12800/pdata/1/auditp.txt
$$ ##AUDIT TRAIL=  $$ (NUMBER, WHEN, WHO, WHERE, WHAT)
(   1,<2005-11-22 10:05:09.60 +000>,<MAYBRIDGE\NMR>,<NMR_250MHZ>,
      <created by zg, POWCHK disabled, PULCHK disabled
       configuration hash MD5:
       62 19 C7 07 E1 42 D1 B7 37 6C 3D D0 77 39 F9 E6
       data hash MD5: 64K
       7B 5A 6A BD CF 5C CF 2E 32 59 34 76 78 22 E7 74>)
(   2,<2005-11-22 10:05:21.46 +000>,<MAYBRIDGE\NMR>,<NMR_250MHZ>,
      <Start of raw data processing
       ef LB = 0.3 FT_mod = 6 PKNL = 1 SI = 32K 
       data hash MD5: 32K
       05 68 B4 D7 B9 12 54 76 BB 77 8E B5 F5 9D 92 E1>)
(   3,<2005-11-22 10:05:23.37 +000>,<MAYBRIDGE\NMR>,<NMR_250MHZ>,
      <apk 
       data hash MD5: 32K
       B3 62 6E 60 5F B1 89 C7 16 27 9C B6 70 F4 7D CB>)
(   4,<2005-11-22 10:05:24.34 +000>,<MAYBRIDGE\NMR>,<NMR_250MHZ>,
      <abs ABSG = 5 
       data hash MD5: 32K
       D2 94 6D C5 D3 56 83 EE 2B C6 25 F6 1C 26 4A 76>)
$$ ##END=
$$ 
$$ hash MD5
$$ AA 3F 02 1B C6 4A C1 D2 E7 0A 62 4D D6 41 2E 3C
##$RELAX= 
##$RELAX= 
##$RELAX= 
##$RELAX= 
##$RELAX= 
##$RELAX= 
##$RELAX= 
$$ Bruker specific parameters
$$ --------------------------
##$DU= <C:\u>
##$EXPNO= 12800
##$NAME= <ADRS>
##$PROCNO= 1
##$TYPE= <nmr>
##$USER= <dgb>
##$AMP= (0..31)
100 100 100 100 100 100 100 100 100 100 100 100 100 100 100 100 100 100 
100 100 100 100 100 100 100 100 100 100 100 100 100 100 
##$AQSEQ= 0
##$AQ_mod= 3
##$AUNM= <au_zg>
##$AUTOPOS= <9 >
##$BF1= 250.13
##$BF2= 250.13
##$BF3= 250.13
##$BF4= 250.13
##$BF5= 500.13
##$BF6= 500.13
##$BF7= 500.13
##$BF8= 500.13
##$BYTORDA= 1
##$CFDGTYP= 0
##$CFRGTYP= 5
##$CHEMSTR= <none>
##$CNST= (0..31)
1 1 145 1 1 1 1 1 1 1 1 1 1 1 1 1 1 1 1 1 1 1 1 1 1 1 1 1 1 1 1 1 
##$CPDPRG= <>
##$CPDPRG1= <>
##$CPDPRG2= <>
##$CPDPRG3= <>
##$CPDPRG4= <mlev>
##$CPDPRG5= <mlev>
##$CPDPRG6= <mlev>
##$CPDPRG7= <mlev>
##$CPDPRG8= <mlev>
##$CPDPRGB= <>
##$CPDPRGT= <>
##$D= (0..31)
0 1 0 0 0 0 0 0 0 0.06 0 0 0 0 0 0 0.0002 0 0 0 0 0 0 0 0 0 0 0 0 0 0 
0 
##$DATE= 1132653908
##$DBL= (0..7)
120 120 120 120 120 120 120 120 
##$DBP= (0..7)
150 150 150 150 150 150 150 150 
##$DBP07= 0
##$DBPNAM0= <>
##$DBPNAM1= <>
##$DBPNAM2= <>
$$ [...]
##$SUBNAM7= <"">
##$SUBNAM8= <"">
##$SUBNAM9= <"">
##$SW= 20.6930455092707
##$SWIBOX= (0..15)
0 0 3 0 0 0 0 0 0 0 0 0 0 0 0 0 
##$SW_h= 5175.983436853
##$TD= 65536
##$TD0= 1
##$TE= 294.16
##$TE2= 300
##$TE3= 300
##$TEG= 300
##$TL= (0..7)
0 120 120 120 120 120 120 120 
##$TP= (0..7)
150 150 150 150 150 150 150 150 
##$TP07= 0
##$TPNAME0= <>
##$TPNAME1= <>
##$TPNAME2= <>
##$TPNAME3= <>
##$TPNAME4= <>
##$TPNAME5= <>
##$TPNAME6= <>
##$TPNAME7= <>
##$TPOAL= (0..7)
0.5 0.5 0.5 0.5 0.5 0.5 0.5 0.5 
##$TPOFFS= (0..7)
0 0 0 0 0 0 0 0 
##$TUNHIN= 0
##$TUNHOUT= 0
##$TUNXOUT= 0
##$USERA1= <user>
##$USERA2= <user>
##$USERA3= <user>
##$USERA4= <user>
##$USERA5= <user>
##$V9= 5
##$VALIST= <valist>
##$VCLIST= <CCCCCCCCCCCCCCC>
##$VD= 0
##$VDLIST= <DDDDDDDDDDDDDDD>
##$VPLIST= <PPPPPPPPPPPPPPP>
##$VTLIST= <TTTTTTTTTTTTTTT>
##$WBST= 1024
##$WBSW= 4
##$XGAIN= (0..3)
0 0 0 0 
##$XL= 0
##$YL= 0
##$YMAX_a= 571369
##$YMIN_a= -518954
##$ZGOPTNS= <>
##$ZL1= 120
##$ZL2= 120
##$ZL3= 120
##$ZL4= 120
##$ABSF1= 16.522
##$ABSF2= -4.171173
##$ABSG= 5
##$ABSL= 3
##$ALPHA= 0
##$AQORDER= 0
##$ASSFAC= 0
##$ASSFACI= 0
##$ASSFACX= 0
##$ASSWID= 0
##$AUNMP= <proc_1d>
##$AZFE= 0.1
##$AZFW= 0.1
##$BCFW= 0
##$BC_mod= 0
##$BYTORDP= 0
##$COROFFS= 0
##$CY= 12.5
##$DATMOD= 1
##$DC= 0
##$DFILT= <>
##$DTYPP= 0
##$F1P= 14.0000005364418
##$F2P= -0.99999901652339
##$FCOR= 0.5
##$FTSIZE= 32768
##$FT_mod= 6
##$GAMMA= 0
##$GB= 0
##$INTBC= 1
##$INTSCL= 1
##$ISEN= 128
##$LB= 0.3
##$LEV0= 0
##$LPBIN= 0
##$MAXI= 10000
##$MC2= 0
##$MEAN= 0
##$ME_mod= 0
##$MI= 0
##$NCOEF= 0
##$NC_proc= -4
##$NLEV= 6
##$NOISF1= 0
##$NOISF2= 0
##$NSP= 0
##$NTH_PI= 0
##$NZP= 0
##$OFFSET= 16.522
##$PC= 1
##$PHC0= 73.82684
##$PHC1= 1.592867
##$PH_mod= 1
##$PKNL= yes
##$PPARMOD= 0
##$PSCAL= 4
##$PSIGN= 0
##$REVERSE= no
##$SF= 250.13
##$SI= 32768
##$SIGF1= 0
##$SIGF2= 0
##$SINO= 400
##$SIOLD= 32768
##$SREGLST= <1H.DMSO>
##$SSB= 0
##$STSI= 32768
##$STSR= 0
##$SW_p= 5175.98343685301
##$SYMM= 0
##$S_DEV= 0
##$TDeff= 65536
##$TDoff= 0
##$TI= <Analysis number 999999
Compound Code 99
Book Reference 9
Project Code 9>
##$TILT= no
##$TM1= 0
##$TM2= 0
##$TOPLEV= 0
##$USERP1= <user>
##$USERP2= <user>
##$USERP3= <user>
##$USERP4= <user>
##$USERP5= <user>
##$WDW= 1
##$XDIM= 32768
##$YMAX_p= 395302089
##$YMIN_p= -318130
$$ End of Bruker specific parameters
$$ ---------------------------------
##NTUPLES= NMR SPECTRUM
##VAR_NAME=  FREQUENCY,     SPECTRUM/REAL,   SPECTRUM/IMAG
##SYMBOL=    X,             R,               I
##VAR_TYPE=  INDEPENDENT,   DEPENDENT,       DEPENDENT
##VAR_FORM=  AFFN,          ASDF,            ASDF
##VAR_DIM=   32768,         32768,           32768
##UNITS=     HZ,            ARBITRARY UNITS, ARBITRARY UNITS
##FACTOR=    0.157963299565203, 1,           1
##FIRST=     4132.6476996994, 0,             0
##LAST=      -1043.33573715361, 0,           0
##MIN=       -1043.33573715361, -318130,     0
##MAX=       4132.6476996994, 395302089,     0
$$ Real data points
##PAGE= N=1
##DATA TABLE= (X++(R..R)), XYDATA
$$ [...]
14909B4641m1094j4325K7086J5922l2710j0163O606m899N842j2869J6671P979
$$ 24641 -16453 -30778 -3692 12230 -20480 -30643 -24037 -28936 -23094 -35963 -19292 -11313
14897a1313J783j1905R477j2023k87J0890N849j1600O016K1556j2612q734r662
$$ -11313 -9530 -21435 -11958 -23981 -24268 -13378 -7529 -19129 -13113 8443 -4169 -12903 -22565
14884b2565J9075J986J0521k78j8944K4125M651j0359l946n995k2386j0181m881
$$ -22565 -3490 -1504 9017 8739 -10205 13920 18571 8212 4266 -1729 -24115 -34296 -39177
14871c9177K9208L364N4O240q346q203J2574k3825k0627N164J9180j0868L820
$$ -39177 -9969 -6605 -6551 -311 -8657 -16860 -4286 -28111 -48738 -43574 -24394 -35262 -31442
14858c1442q783K7132J7696o784j834K225J2477j285k3924o643K6260j3583Q333
$$ -31442 -40225 -13093 4603 -2181 -4015 -1790 10687 9402 -14522 -21165 5095 -8488 -155
14845a55o045o794J3817K5754m089p212j0410j3328O398J5406O534K9075N08k470
$$ -155 -6200 -12994 823 26577 22488 15276 4866 -8462 -2064 13342 19876 48951 49459 46989
14831D6989j7720k6300k4636J842m314K5009O642l1163j3066L185o23n57J5936
$$ 46989 29269 2969 -21667 -19825 -24139 870 7512 -23651 -36717 -33532 -34155 -34712 -18776
14818a8776k343o755j172Q847K473j4367Q10J5618R751Q798l5228n1262L367K9785
$$ -18776 -21119 -27874 -29046 -20199 -17726 -32093 -31283 -15665 -5914 2884 -32344 -83606 -80239 -50454
14804e0454J4460k1518j7716J8453K3856K9706r082k2209M87L551k286j654K0431
$$ -50454 -35994 -57512 -75228 -56775 -32919 -3213 -12295 -34504 -34017 -30466 -32752 -34406 -13975
14791a3975m033K953M1726M523K9930j3261l9340q878r337j2342q406J3504J0734
$$ -13975 -18008 -15055 26671 31194 61124 47863 8523 -355 -9692 -22034 -30440 -16936 -6202
14778f202K728O982l173Q268K147K1337n296j0967k4098j3930Q496J213O274j808
$$ -6202 -3474 3508 335 8603 10750 32087 26791 15824 -8274 -22204 -13708 -12495 -6221 -8029
14764h029k3040M228N432M502o201J5480p242J0793L757j4095K2925j1805l1566
$$ -8029 -31069 -26841 -21409 -16907 -23108 -7628 -14870 -4077 -320 -14415 8510 -3295 -34861
14751c4861j3153N544K8114j9408m821K0156o214J210K5537r169j4770j6619J7644
$$ -34861 -48014 -42470 -14356 -33764 -38585 -18429 -24643 -23433 2104 -7065 -21835 -38454 -20810
14738b0810j0216k905P829J3452J8463k2977k7425j493K2660o750N566K603j4824
$$ -20810 -31026 -33931 -26102 -12650 5813 -17164 -44589 -46082 -23422 -30172 -24606 -22003 -36827
14725c6827J1251L9611n371k5320p636n519k876L8174K0472M170J437k7231n297
$$ -36827 -25576 14035 8664 -16656 -24292 -29811 -32687 5487 25959 30129 31566 4335 -962
14712i62j1421m886J7495N295L249j5702k5346l315K8661K5241k5564m6845j4313
$$ -962 -12383 -17269 226 5521 8770 -6932 -32278 -35593 -6932 18309 -7255 -54100 -68413
14699f8413m387J0277L0779O328j6044K4751P035j3078K8114Q321m556o826j377
$$ -68413 -72800 -62523 -31744 -25416 -41460 -16709 -9674 -22752 5362 13683 9127 2301 924
14686I24j6375q7j4947n302q720K2221L878p751p276J4915L912n075p494j2998
$$ 924 -15451 -15538 -30485 -35787 -44507 -22286 -18408 -26159 -33435 -18520 -14608 -19683 -27177 -40175
14672d0175J1398m341P205k0323P399K6064P121o238j1415l0807j8826Q666K3954
$$ -40175 -28777 -33118 -25913 -46236 -38837 -12773 -5652 -11890 -23305 -54112 -72938 -64272 -40318
14659d0318J0983o059J6886o098o123p106J512K4066J160k5876k1836j5791N780
$$ -40318 -29335 -35394 -18508 -24606 -30729 -37835 -36323 -12257 -11097 -36973 -58809 -74600 -68820
14646f8820M883L1959p124J3385J2496j6879J1241j3727R68L667L513j3455K202
$$ -68820 -63937 -31978 -39102 -25717 -13221 -30100 -18859 -32586 -31618 -27951 -24438 -37893 -35691
14633c5691K7593n415k09K0066Q342j7460p034k1290J0089K7372L405k2343j9263
$$ -35691 -8098 -13513 -13722 6344 14686 -2774 -9808 -31098 -21009 6363 9768 -12575 -31838
14620c1838K866K3723p826l995j4520r364p599J134L272J3094k0469R7K4687p776
$$ -31838 -28972 -5249 -13075 -17070 -31590 -40954 -48553 -47419 -44147 -31053 -51522 -51425 -26738 -34514
14606c4514R783N568k6405o892N206J7447k378J6242J3773k8619k3657N617J79
$$ -34514 -24731 -19163 -45568 -52460 -47254 -29807 -32185 -15943 -2170 -30789 -54446 -48829 -48650
14593d8650o043J6095q983k2115q915R323O661J8467m527N203J4745J4474j5015
$$ -48650 -54693 -38598 -47581 -69696 -78611 -69288 -62627 -44160 -48687 -43484 -28739 -14265 -29280
14580b9280j5544M296J9025j6589J2081J6508m7k5485J349q63o087J5066K6087
$$ -29280 -44824 -40528 -21503 -38092 -26011 -9503 -9550 -35035 -33686 -34549 -40636 -25570 517
14567E17L368j6172L81k8m87n400j0854J5278K6730L860m5934m77O480J6343J665
$$ 517 3885 -12287 -11906 -11934 -12421 -17821 -28675 -13397 13333 17193 -28741 -29218 -22738 -6395 -4730
14552d730k090r200j0634j2170L975K793J0957J0163M930R165l585m1576J3579
$$ -4730 -6820 -16020 -26654 -38824 -34849 -32056 -21099 -10936 -6006 3159 -426 -42002 -28423
14539b8423L1258p439l6415q54M848K5314K0230l1339l2847m933J4087J0893L1210
$$ -28423 2835 -4604 -41019 -41873 -37025 -11711 8519 -22820 -55667 -60600 -46513 -35620 -4410
14526d410J2156J7428j5871j2068L783j825r572j1472j0675p066J0861J6063N689
$$ -4410 7746 25174 9303 -2765 1018 -807 -10379 -21851 -32526 -39592 -28731 -12668 -6979
14513f979j9047Q170q112P297K7567l761j7026j6028K63K6600j877r316O831J0961
$$ -6979 -26026 -17856 -25968 -18671 8896 5135 -11891 -27919 -27656 -1056 -2933 -12249 -5418 5543
14499E543j0254j3285j9066K213p344O525r386K999J3456N708Q79N869j1510q218
$$ 5543 -4711 -17996 -37062 -34849 -42193 -35668 -45054 -42055 -28599 -22891 -22012 -16143 -27653 -35871
14485c5871j2974k1808K883L7568J0505J4038J189j4057n881j0164J7779j3979
$$ -35871 -48845 -70653 -67770 -30202 -19697 -5659 -4470 -18527 -24408 -34572 -16793 -30772
14473c0772l56K0736N797m3968L846K3903J2412j3282j3748Q971R035L2962j711
$$ -30772 -31128 -10392 -4595 -48563 -44717 -20814 -8402 -21684 -35432 -26461 -17426 15536 13825
14460A3825k1101k8937j0084J9000L413K922P632P378n596n299K458J663j7979
$$ 13825 -7276 -36213 -46297 -27297 -23884 -20962 -13330 -5952 -11548 -16847 -14389 -12726 -30705
14447c0705p487J1575M216J7164L0237j8719j8932M581j5804j5248J2585m549
$$ -30705 -38192 -26617 -22401 -5237 25000 6281 -12651 -8070 -23874 -39122 -26537 -31086
14435c1086J1618q842l8308j4030K6473L3841j205q361J4209J3406M421K2691
$$ -31086 -19468 -28310 -66618 -80648 -54175 -20334 -21539 -29900 -15691 -2285 2136 24827
14423B4827j1479k6618J314K5871j8631k4292k2006J9558L1741J380r623l373
$$ 24827 13348 -13270 -11956 13915 -4716 -29008 -51014 -31456 285 1665 -7958 -11331
14411a1331R7l930O839J8581J1554k5724J236K366k2665k5535j4568J9652K3952
$$ -11331 -11234 -15164 -8325 10256 21810 -3914 -2678 -312 -22977 -48512 -63080 -43428 -19476
14398a9476l474Q540J6708J0072Q210l9422p005j0917L369L3972K8029k2504j6259
$$ -19476 -22950 -14410 2298 12370 20580 -18842 -25847 -36764 -33395 577 28606 6102 -10157
14385a0157n9J9174k8712r236J1511j5982j4894p589l1009J827J2923J1047J1120
$$ -10157 -10216 8958 -19754 -28990 -17479 -33461 -48355 -55944 -86953 -85126 -72203 -61156 -50036
14372e0036L515n881M05J1477k1680L0815K1176J2080P702r407j0061j4386J7175
$$ -50036 -46521 -52402 -51997 -40520 -62200 -31385 -10209 1871 9573 166 -9895 -24281 -7106
14359g106L8438K1556j9009j8888q109N440j2109l4456j9934Q476L4083K5127
$$ -7106 31332 52888 33879 14991 6882 12322 213 -34243 -54177 -45701 -11618 13509
14347A3509l138K8591L583j6046l8885l7448N551K0742J2396J9457J162M776j0499
$$ 13509 10371 38962 42545 26499 -12386 -49834 -44283 -23541 -11145 8312 9474 14250 3751
14334C751k8649j2917l1382l497J9505O712k768K4911K8962j5702j1789K6990
$$ 3751 -24898 -37815 -69197 -72694 -53189 -46477 -49245 -24334 4628 -11074 -22863 4127
14322D127J4285j244m0142l7986L851L0507K78j0644k720p080q19K3617K0201
$$ 4127 18412 17168 -22974 -60960 -57109 -26602 -26324 -36968 -39688 -46768 -47587 -23970 -3769
14309c769j63r280N674K2103K8993k4638j5044K442r946M08j3260k4575j3153
$$ -3769 -3932 -13212 -7538 14565 43558 18920 3876 6318 -3628 -3220 -16480 -41055 -54208
14296e4208K6629M0181o107J1999N160k0330j1294L213k0091j4321J5612j7050
$$ -54208 -27579 12602 6495 18494 23654 3324 -7970 -4757 -24848 -39169 -23557 -40607
14284d0607L7522j6821M559j144O529R238J2984j591k0694r65J1458j1014m762
$$ -40607 -3085 -19906 -15347 -16491 -9962 -724 12260 10669 -10025 -10990 468 -10546 -15308
14271a5308L880j3523j4346p345K2427J7784J3298j7635M306K4134K476P235o703
$$ -15308 -11428 -24951 -39297 -46642 -24215 -6431 6867 -10768 -6462 17672 20148 27383 20680
14258B0680j1695J4825j1402m5494j9013R791L2076J6802j1707j210K616k1647
$$ 20680 8985 23810 12408 -33086 -52099 -42308 -10232 6570 -5137 -6347 -3731 -25378
14246b5378J5629K1524o784k157r941r64L340L093R515M888R302k958m935O773
$$ -25378 -9749 11775 4991 2834 -7107 -8071 -4731 -1638 7877 12765 22067 19109 14174 20947
14232B0947L534m0021P67M264o052M695j1611j537K1928K3455J0496j2932j0056
$$ 20947 24481 -15540 -14773 -10509 -16561 -11866 -23477 -25014 -3086 20369 30865 17933 7877
14219G877L503O266M888j9664j1375o910l348J4573j8110m175m993l6564R047
$$ 7877 11380 17646 22534 2870 -8505 -15415 -18763 -4190 -22300 -26475 -31468 -68032 -58985
14206e8985J0681K5269K3679p434J593l898J4491J3214J5966J4861j2374j7509
$$ -58985 -48304 -23035 644 -6790 -5197 -9095 5396 18610 34576 49437 37063 19554
14194A9554J5106n217k2290j2521J2826j384J218P82K0901J9566j0959k8019J066
$$ 19554 34660 29443 7153 -5368 7458 6074 7292 8074 28975 48541 37582 9563 10629
14181A0629J5845N422j2512k1582J718q089k8032O461J2101R711J2550J332j0126
$$ 10629 26474 31896 19384 -2198 -480 -8569 -36601 -30140 -18039 -8328 4222 5554 -4572
14168d572m5067m245J2729J6337l511N346r076J1759J3524j821q050K1184k68
$$ -4572 -49639 -53884 -41155 -24818 -28329 -22983 -32059 -20300 -6776 -8597 -16647 4537 4269
14155D269k6411k032J3744k334j1608J051j1660O880j3299J7959R105J0171M037
$$ 4269 -22142 -24174 -10430 -12764 -24372 -23321 -34981 -28101 -41400 -23441 -14336 -4165 -128
14142a28j0709p350K4639M884l7206L945K1219k0677j055J7742J6669K882k6714
$$ -128 -10837 -18187 6452 11336 -25870 -21925 -706 -21383 -22438 -4696 11973 14855 -11859
14129a1859l829J7654L7235K9354k1227j0802L2k043p963L664j322n785j9629
$$ -11859 -15688 1966 39201 68555 47328 36526 36558 34515 26552 30216 28894 23109 3480
14116C480m854J055j3494J879j462p690K4059M223J2415k592O090J6403j7900
$$ 3480 -1374 -319 -13813 -11934 -13396 -21086 2973 7196 19611 17019 23109 39512 21612
14103B1612n169M323L832l96j4230k408m333J5102L0857J5312k5442N861O664
$$ 21612 16443 20766 24598 24202 9972 7564 3231 18333 49190 64502 39060 44921 51585
14090E1585k4540j6275L3805J4651J651l889l557J1686j792j1881k935P77p524
$$ 51585 27045 10770 44575 59226 60877 56988 53431 65117 63325 51444 48509 49286 41762
14077D1762J3802M532k2236k0190N374l4877j7160J7799L0804k558j3890J37K2919
$$ 41762 55564 60096 37860 17670 23044 -11833 -28993 -11194 19610 17052 3162 3299 26218
14064B6218O544L6240o080k5270j5484K5821K0968j8136j3119o421L1885O426
$$ 26218 32762 69002 62922 37652 22168 47989 68957 50821 37702 31281 63166 69592
14052F9592j9045P789j1583r925L643J9461R446L3407r318l182J6873j7888k0682
$$ 69592 50547 58336 46753 36828 40471 59932 69378 102785 93467 90285 107158 89270 68588
14039F8588k6573o327K0285J5106m07N56j2939l403j966L475K4097J2630j0723
$$ 68588 42015 35688 55973 71079 70672 71228 58289 54886 52920 56395 80492 93122 82399
14026H2399M297k735o531j4677O845l215l633p587k4056M083K1657L0507l985
$$ 82399 86696 83961 77430 62753 69598 66383 62750 55163 31107 35190 56847 87354 83369
14013H3369J0265K1402J5153j4131J2493K6249j2581j9723k6904Q315J0527J1650
$$ 83369 93634 115036 130189 116058 128551 154800 142219 122496 95592 103907 114434 126084
14001A26084K240k6943o519N782j5048j9349J4235J0476J7711m086j8172J3653
$$ 126084 128324 101381 94862 100644 85596 66247 80482 90958 108669 104583 86411 100064
13989A00064j1497j9713K1300J5127L141j5166p210K1465K3672l4293j9256R91
$$ 100064 88567 68854 90154 105281 108422 93256 86046 107511 131183 96890 77634 78625
13977G8625J493r768m063J3417L3282M713k1824j7547J3287J8803K0658k5854
$$ 78625 80118 70350 66287 79704 112986 117699 95875 78328 91615 110418 131076 105222
13965A05222k1653M39l622p114k090J9213R247Q091q01J0236K4253R791k756j9437
$$ 105222 83569 84008 80386 73272 71182 90395 99642 107733 106932 117168 141421 151212 148456 129019
13951A29019O512J0313M437o385J4063K3942K5014K4021p208k179L9543L7668
$$ 129019 135531 145844 150281 143896 157959 181901 206915 230936 223728 221549 261092 298760
13939B98760L278m88l090O182Q921k1291P282K9539P423K758m410L0290K4903
$$ 298760 302038 301550 298460 304642 313563 292272 299554 329093 336516 339274 334864 365154 390057
13926C90057k8916j6743j9539J1223N91Q878J570J3554k0249R044Q456K5814J7262
$$ 390057 361141 344398 324859 336082 336673 345551 347121 360675 340426 349470 357926 383740 401002
13913D01002j9223K845J3912j6801j8748j7090j631K0796L6721p4r429J7448K2667
$$ 401002 381779 384624 398536 381735 362987 345897 344266 365062 401783 401709 392280 409728 432395
13900D32395n124N627N98O953M3723M909j3324J8081J4828J3076J9339Q880O095
$$ 432395 427271 432898 433496 440449 484172 489081 475757 493838 508666 521742 541081 549961 556056
13887E56056o201j8616j3594l958K3319J2898K0152K1652p954J0485M3613L6072
$$ 556056 549855 531239 517645 513687 537006 549904 570056 591708 583754 594239 637852 673924
13875F73924k762m735O484K4465K0413J7469L711o697K1378K999L171K7413J7842
$$ 673924 671162 666427 672911 697376 717789 735258 738969 732272 753650 756649 759820 787233 805075
13862H05075q932K9185L2407J6242J7704J8388J1751o648P017J3599L1138J9185
$$ 805075 796143 825328 857735 873977 891681 910069 921820 915172 922189 935788 966926 986111
13850I86111L3660K1394j1094J1540K8125M6042K6252L1621J6604J078J6563J2403
$$ 986111 1019771 1041165 1030071 1041611 1069736 1115778 1142030 1173651 1190255 1191333 1207896 1220299
13838A220299J5955M8387M9262K7663K9922M1292J9512K2809M3273P4865N9611
$$ 1220299 1236254 1284641 1333903 1361566 1391488 1432780 1452292 1475101 1518374 1593239 1652850
13827A652850K6615L4323M4499M6046N9744N4676K1722P6656R5322P2727N5683
$$ 1652850 1679465 1713788 1758287 1804333 1864077 1918753 1940475 2017131 2112453 2185180 2240863
13816B240863P1046Q0262J02741O3275O3347J01934J09020J21058J13035J00573
$$ 2240863 2311909 2392171 2494912 2558187 2621534 2723468 2832488 2953546 3066581 3167154
13806C167154J09283J25863J26585J16108J35598J86948J55909J75098K11480
$$ 3167154 3276437 3402300 3528885 3644993 3780591 3967539 4123448 4298546 4510026
13797D510026J69454K19035K18785K59185K45573K72981K84337L22505L44412
$$ 4510026 4679480 4898515 5117300 5376485 5622058 5895039 6179376 6501881 6846293
13788F846293L63557M06959M35891M31496M52876N01578N98145O59177P03024
$$ 6846293 7209850 7616809 8052700 8484196 8937072 9438650 10036795 10695972 11398996
13779A1398996P45679Q00565Q54549R16282J063156J176571J274416J399398J502075
$$ 11398996 12144675 12945240 13799789 14716071 15779227 16955798 18230214 19629612 21131687
13770B1131687J660983J802547J971375K172816K269695K503375K691625K824511
$$ 21131687 22792670 24595217 26566592 28739408 31009103 33512478 36204103 39028614
13762C9028614K950074L042025L058333K990605K859441K608450K246968J747231
$$ 39028614 41978688 45020713 48079046 51069651 53929092 56537542 58784510 60531741
13754F0531741J146548N12316j47758p89754j403563j954495k317885k611484
$$ 60531741 61678289 62190605 62042847 61253093 59849530 57895035 55577150 52965666
13746E2965666k843837k930517k908085k848071k755633k649494k472554k328353
$$ 52965666 50121829 47191312 44283227 41435156 38679523 36030029 33557475 31229122
13738C1229122k188845k021447j886825j711227j554225j434425j343785j222843
$$ 31229122 29040277 27018830 25132005 23420778 21866553 20432128 19088343 17865500
13730A7865500j122989j048754r60014q82823p82774p49645o49764o35143o26407
$$ 17865500 16742511 15693757 14733743 13850920 13068146 12318501 11668737 11033594 10407187
13721A0407187n46054n14939m77557m15104l93828l87802l54181l20742l19691
$$ 10407187 9861133 9346194 8868637 8453533 8059705 7671903 7317722 6996980 6677289
13712F677289k88770k81544k70763k36698k40957k10619j71227j90273j91138
$$ 6677289 6388519 6106975 5836212 5599514 5358557 5147938 4976711 4786438 4595300
13703D595300j98785j78501j67003j28468j18640j23963j39430j22673p8392r0946
$$ 4595300 4396515 4218014 4051011 3922543 3803903 3679940 3540510 3417837 3339445 3248499
13693C248499j05972q1367r0892j06459j16367j06144m7305r7310q0839k5254
$$ 3248499 3142527 3061160 2970268 2863809 2747442 2641298 2593993 2496683 2415844 2390590
13683B390590o6567r9297p8064q9610o8589l7421k6069m6792m2843n2680l2678
$$ 2390590 2324023 2224726 2146662 2057052 1988463 1951042 1924973 1878181 1835338 1782658 1749980
13672A749980k6232k3589l8203n0321k8041k3829l7334m0069k3343l1654l9567
$$ 1749980 1723748 1700159 1661956 1611635 1583594 1559765 1522431 1482362 1459019 1427365 1387798
13661A387798j7272j7504m7401n3233m015l0138l8623j8736j6393m2794k0881
$$ 1387798 1370526 1353022 1305621 1252388 1248373 1218235 1179612 1160876 1144483 1101689 1080808
13650A080808k1206j2467m6966k2080N273k211l2619l3923k9434k2801J4641L728
$$ 1080808 1059602 1047135 1000169 978089 983362 981151 948532 914609 885175 862374 877015 880743
13638H80743j8111l1980j3711k3846k2818k4210j8471k0110J2391J2960j2097
$$ 880743 862632 830652 816941 793095 770277 746067 727596 707486 719877 732837 720740
13627G20740m668J263k3296l4547j6896N384J6834m1983j3193k0746j3632K5183
$$ 720740 716072 717335 694039 659492 642596 647980 664814 622831 609638 588892 575260 600443
13615F00443n850j2111j4883K1686O308j6494l7608k1255K1059L6277j0686m0843
$$ 600443 594593 582482 567599 589285 595593 579099 541491 520236 541295 577572 566886 526043
13603E26043r418K3532J5607l0334j4226n263L014l7220o074k5650r096m681p306
$$ 526043 516625 540157 555764 525430 511204 505941 508955 471735 465661 440011 430915 426234 418928
13590D18928l962J5138j7364k3428L39k6611j8512l80j2566k6729l039J6360n729
$$ 418928 414966 430104 412740 389312 389651 363040 344528 344148 331582 304853 301814 318174 312445
13577C12445j2863J4721N553j9794j2969k7891J0196L1781O612j3811q695J0962
$$ 312445 299582 314303 319856 300062 287093 259202 269398 301179 307791 293980 285285 296247
13565B96247L0909J3971J023P189K938O317O053j8419k298K1938r127k3511r000
$$ 296247 327156 341127 342150 349339 352277 358594 364647 346228 343930 365868 356741 333230 324230
13552C24230K4363K2668j3544M535J5977l0868l9721j3709j2482L1108N5932j0423
$$ 324230 348593 371261 357717 362252 378229 347361 307640 293931 281449 312557 368489 358066
13540C58066N844K3403m730r620j2460j8460k0962j7333p777J6236O422k5074
$$ 358066 363910 387313 382583 372963 360503 342043 321081 303748 295971 312207 318629 293555
13528B93555k4641j6275J0434K5450K0600j7772k4983K601k677K6967J077l4760
$$ 293555 268914 252639 263073 288523 309123 291351 266368 268969 266292 293259 294336 259576
13516B59576j3655j0002Q350J4701j3706K4831r586j5039j0613l0163j5624L0783
$$ 259576 245921 235919 244269 258970 245264 270095 260509 245470 234857 204694 189070 219853
13504B19853l332R124j4131k5674O832K9563j298j0185k4300J237L1276k0576
$$ 219853 216521 225645 211514 185840 192672 222235 220937 210752 186452 187689 218965 198389
13492A98389m155L071J1903O663L1849j4297j9246j7065j033N270p4j9497k3511
$$ 198389 194234 197305 209208 215871 247720 233423 214177 197112 196079 201349 201275 181778 158267
13479A58267J8680M088Q376K860j3875j5599j4580j5287K0259J4227R68m579M403
$$ 158267 176947 181035 189411 192271 178396 162797 148217 132930 153189 167416 168384 163805 168208
13466A68208j2911J983k202j0834J9521j2228R836k111k3300Q873R663O992j3653
$$ 168208 155297 157280 155078 144244 163765 151537 161373 159262 135962 144835 154498 161490 147837
13453A47837l3965p416M728k286J3325K4330j306k0902j3217K3264K9027k1960
$$ 147837 113872 106456 111184 108898 122223 146553 145247 124345 111128 134392 163419 141459
13441A41459q160O675L886l408j0585J1421P669Q670j6466J1897K3107J4851j932
$$ 141459 133299 139974 143860 140452 129867 141288 148957 157627 141161 153058 176165 191016 189084
13428A89084J7769j7733m8316k5093r860j049j0965j1780L0143J9505K1939j3057
$$ 189084 206853 189120 140804 115711 105851 104802 93837 82057 112200 131705 153644 140587
13416A40587p027k231J4260k2197o479j5981r71J9843K3990n891q830l8994k2387
$$ 140587 133560 131329 145589 123392 116913 100932 99961 119804 143794 137903 129073 90079 67692
13403F7692k5649J834k2638k994K8754L0131N603j944o32J3980L8918k893l4108
$$ 67692 42043 43877 21239 18245 46999 77130 82733 80789 80157 94137 133055 130162 96054
13390I6054J4067j5325m352j7347j1147Q3J2690L810r665k1349L807L4147J2688
$$ 96054 110121 94796 90444 73097 61950 62033 74723 78533 68868 47519 51326 85473 98161
13377I8161K779k7411j5226J6616l2856J2644j803n924L2587K4681k1180K0154
$$ 98161 100940 73529 58303 74919 42063 54707 52904 46980 79567 104248 83068 103222
13365A03222J3026J1448O51l7097l3364k0295j4707K4993J1542L866j4298l5089
$$ 103222 116248 127696 128347 91250 57886 37591 22884 47877 59419 63285 48987 13898
13353A3898K1678K7578J1993J1662j170k0832M273m372p739N427P377n282k385
$$ 13898 35576 63154 75147 86809 85639 64807 69080 64708 56969 62396 69773 64491 62106
13340F2106K9026m336m2965p865K3277M247k1126j0037J9977J9778N46J7875j3418
$$ 62106 91132 86796 43831 35966 59243 63490 42364 32327 52304 72082 72628 90503 77085
13327G7085o110k5147m800O148p52j105l835M066K618J9837j6397J4164J9923
$$ 77085 70975 45828 41028 47176 46424 45319 41484 45550 48168 68005 51608 65772 85695
13314H5695r874o293j1346l108J38r689r412J051M235j0064q090J3414J543j2891
$$ 85695 75821 69528 58182 55074 55212 45523 36111 37162 41397 31333 23243 36657 38200 25309
13300B5309J3459K9389j056q672j9292N211j9154L0482k666n173J5748J3604j3679
$$ 25309 38768 68157 67101 58429 39137 44348 25194 55676 53010 47837 63585 77189 63510
13287F3510Q624J2156k0669m2326j7142J7886k396J2008Q599o210J3024J2427
$$ 63510 72134 84290 63621 21295 4153 22039 19643 31651 40250 34040 47064 59491
13275E9491O215j1480j5963K5863o413l0440l6464o014L9883K0259P061J0964
$$ 59491 65706 54226 38263 64126 57713 27273 -9191 -15205 24678 44937 51998 62962
13263F2962j2803O604Q372K3442k596j0964j7429K719l3888j2034P864K2581J8607
$$ 62962 50159 56763 65135 88577 85981 75017 57588 60307 26419 14385 22249 44830 63437
13250F3437r134l7646k2094N0266L0946o209j8129K5085J5697j3604k2801k4506
$$ 63437 54303 16657 -5437 44829 75775 69566 51437 76522 92219 78615 55814 31308
13238C1308o917J5231J303l179J0265O378Q198J6101P51k254P65k1087j7734j3728
$$ 31308 24391 39622 40925 37746 48011 54389 62587 78688 79439 77185 77950 56863 39129 25401
13224B5401k1549P225L441P037K9759N55o293o175o723m570o975K4086J2343k0888
$$ 25401 3852 11077 14518 21555 51314 51869 45576 39401 32678 28108 21133 45219 57562 36674
13210C6674l3169J4554M803K035N462l335j550L4126J5168J4578j2556j7746n848
$$ 36674 3505 18059 22862 24897 30359 27024 25474 59600 74768 89346 76790 59044 53196
13197E3196k0132j0961p9J0848J4587K2521k0143l6507j7555p869L276M3177J6765
$$ 53196 33064 22103 22024 32872 47459 69980 49837 13330 -4225 -12094 -8818 34359 51124
13184E1124L325m719J3538O852K9062k3958m5727j7548K0275J0593m832l8304
$$ 51124 54449 49730 63268 70120 99182 75224 29497 11949 32224 42817 37985 -319
13172c19k0569j2450K895m63K2544K5274J5650K8577j6949j6480J2756j22O083
$$ -319 -20888 -33338 -30443 -30906 -8362 16912 32562 61139 44190 27710 40466 40344 46427
13159D6427p029r165j8004j199N941J9320K7682o836o249J2791P273k1306k8059
$$ 46427 39398 30233 12229 11030 16971 36291 63973 57137 50888 63679 70952 49646 21587
13146B1587j5888k300Q901L006o139k3380k6363k5229R951L1931K6526J0007p074
$$ 21587 5699 3399 12300 15306 9167 -14213 -40576 -65805 -55854 -23923 2603 12610 5536
13133E536J4903R985J8240J06K670k1068j4670J5746K323K65k0883J0358k5454
$$ 5536 20439 30424 48664 48770 51440 30372 15702 31448 33771 34036 13153 23511 -1943
13120a943M021M4058J7660J3855j5489k7489Q54J8223P925q711k1969j4460o406
$$ -1943 2078 46136 63796 77651 62162 34673 35527 53750 61675 52964 30995 16535 10129
13107A0129K1688J6084j4997j1745K953q651m199K1410j731l482j1779p294R397
$$ 10129 31817 47901 32904 21159 24112 15461 11262 32672 30941 27459 15680 8386 17783
13094A7783m96Q227N043j9983j6774m845J078j1771N306J4330J0901o710j5389
$$ 17783 17287 25514 30557 10574 -6200 -11045 -9967 -21738 -16432 -2102 8799 2089 -13300
13081a3300p45J1911M8070J5646K3529j5445j5845M075l0645j4443R143L669k1757
$$ -13300 -14045 -2134 45936 61582 85111 69666 53821 57896 27251 12808 21951 25620 3863
13068C863j4784J2314j665J491K1253j693k7638J1233j7638K3590J9490J2665
$$ 3863 -10921 1393 -272 1219 22472 20779 -6859 4374 -13264 10326 29816 42481
13056D2481J44k1453R467J8136O212L180j3774k2714O780K0379m41N520R873l1464
$$ 42481 42625 21172 30639 48775 54987 58167 44393 21679 28459 48838 48397 53917 63790 32326
13042C2326k5710j4891j128J7579j634J1772K8938K9297l5735k0316j5900M771
$$ 32326 6616 -8275 -9403 8176 6542 18314 47252 76549 40814 20498 4598 9369
13030I369K2614j2689j0204K0515K1771J6007j3413j8167j4745n894p840J9505
$$ 9369 31983 19294 9090 29605 51376 67383 53970 35803 21058 15164 7324 26829
13018B6829O693j4052J619M1n678k978P409r775L121N922o056J2376K1704J3307
$$ 26829 33522 19470 21089 21130 15452 12474 19883 10108 13229 19151 13095 25471 47175 60482
13004F0482J449N410j4518K29j87n265l8539J52K3570p159j0589n417n037k861
$$ 60482 61931 67341 52823 53052 52865 47600 9061 9213 32783 25624 15035 9618 4581 1720
12990A720K454J7528J9895L550M206n96K883j5293j5615k0411K4315L276j8608
$$ 1720 4174 21702 41597 45147 49353 48757 51640 36347 20732 321 24636 27912 9304
12977I304j8965M79Q79J9882K163o815j2110J115k1500o03J9450M355j2272l130
$$ 9304 -9661 -9182 -8303 11579 13742 6927 -5183 -4068 -25568 -26171 -6721 -2366 -14638 -17768
12963a7768J3926Q688J9817k6533l8497j4559o853J4487J4559J4909R542j2759
$$ -17768 -3842 4846 24663 -1870 -40367 -54926 -61779 -47292 -32733 -17824 -8282 -21041
12951b1041K2399J0261j2096l476j2515k4543q73L3915K5565M842J2801j6371
$$ -21041 1358 11619 -477 -3953 -16468 -41011 -41884 -7969 17596 22438 35239 18868
12939A8868j4948J121p573k237M1894O265l4783j607J1877L420m987r73q634j1460
$$ 18868 3920 5041 -2532 -4769 37125 43390 8607 7000 18877 22297 17310 16337 7703 -3757
12925c757o600J3604k032K5348O05k4840m098k8q011J2471J3820l637p067k362
$$ -3757 -10357 3247 1215 26563 27168 2328 -1770 -1798 -9809 2662 16482 12845 5778 3416
12911C416j3155j3037N612k076K58J0046j1656K9049K1579k7352l3264j0121r115
$$ 3416 -9739 -22776 -17164 -19240 -18982 -8936 -20592 8457 30036 2684 -30580 -40701 -49816
12898d9816J3145N771K3413J5844K0351m090o701j3184J1464K131K844J3935P847
$$ -49816 -36671 -30900 -7487 8357 28708 24618 17917 4733 16197 18328 21172 35107 42954
12885D2954L7271J6826j5470j7258l8501q132N301j99l7883j5380R731J0315n228
$$ 42954 80225 97051 81581 64323 25822 17690 22991 22792 -15091 -30471 -20740 -10425 -15653
12872a5653k7875J4474K5984r805J0493J250l897l230Q777j0299P901N19J0309
$$ -15653 -43528 -29054 -3070 -12875 -2382 -1132 -5029 -8259 518 -9781 -1880 -1361 8948
12859H948j4258p415J7084J1592k9362k895j0741k2339L326K2641N117j2039j7566
$$ 8948 -5310 -12725 4359 15951 -13411 -16306 -27047 -49386 -46060 -23419 -18302 -30341 -47907
12846d7907L5131K0062j5000q262l394n178k6945N173K8006L72J64J1908o312
$$ -47907 -12776 7286 -7714 -15976 -19370 -24548 -51493 -46320 -18314 -17942 -17778 -5870 -12182
12833a2182l463p744j5402P052N395J5246J8959Q627k9297o324J1273J9880m0793
$$ -12182 -15645 -23389 -38791 -31739 -26344 -11098 7861 16488 -12809 -19133 -7860 12020 -28773
12820b8773j1680M413j4363L0468J0503K1680J9543J0320L700k3440n867J4972
$$ -28773 -40453 -36040 -50403 -19935 -9432 12248 31791 42111 45811 22371 16504 31476
12808C1476j2727N206o7j317J897r19J8294J5379l4810L373o460j4274j8136J2119
$$ 31476 18749 23955 23888 22571 24468 23549 41843 57222 22412 25785 19325 5051 -13085 -966
12794i66R049m470k541j0276j9664j1551j873q1J9019J2072J600j2378L0290J416
$$ -966 8083 3613 1072 -9204 -28868 -40419 -42292 -42373 -23354 -11282 -9682 -22060 8230 9646
12780I646k0825j1628k5613q85o941K1687L0755K599Q505o490L740J5243J6266
$$ 9646 -11179 -22807 -48420 -49305 -56246 -34559 -3804 -1205 7300 810 4550 19793 36059
12767C6059J828j2765J2720n570k7232J2123J5155j3695l4657k5561J758p745
$$ 36059 37887 25122 37842 32272 5040 17163 32318 18623 -16034 -41595 -39837 -47582
12755d7582L577J5027J8262m318N569j7698j5754N775k3977j5257K4036K6380
$$ -47582 -44005 -28978 -10716 -15034 -9465 -27163 -42917 -37142 -61119 -76376 -52340 -25960
12743b5960j2274m5716j37K4902M1442o059k4398J7658K5229L5171P40j4403j0108
$$ -25960 -38234 -83950 -84087 -59185 -17743 -23802 -48200 -30542 -5313 29858 30598 16195 6087
12730F087n192k652J244K3836n39J4342j5508k1344m5681j1769J699r10K8107
$$ 6087 895 -1757 -513 23323 22784 37126 21618 274 -45407 -57176 -55477 -56387 -28280
12717b8280K578r229K4912J0448J7871Q635q664j6844j7575K576j8729K8431L4777
$$ -28280 -25702 -34931 -10019 429 18300 26935 18271 1427 -16148 -13572 -32301 -3870 30907
12704C0907K1614k7270k9809O873j4528k0949r311K3182o574Q227L422O006M5322
$$ 30907 52521 25251 -4558 2315 -12213 -33162 -42473 -19291 -25865 -17638 -14216 -8210 37112
12691C7112o994l5368k5636j4819n906J4204K9040J6807k2663j0761l46J4288
$$ 37112 30118 -5250 -30886 -45705 -51611 -37407 -8367 8440 -14223 -24984 -25330 -11042
12679a1042M67J9855J1416k0620r011k0835m760o089J1254j6242O408M7552L635
$$ -11042 -10575 9280 20696 76 -8935 -29770 -34530 -40619 -29365 -45607 -39199 8353 11988
12666A1988j3119q88J1110o539J9946R304k4765k5721j3117l802M2065J3263k0221
$$ 11988 -1131 -2019 9091 2552 22498 31802 7037 -18684 -31801 -35603 6462 19725 -496
12653d96k8699J3795N997N89J4718j6350o875r276o100L359L0021K5745k341l8410
$$ -496 -29195 -15400 -9403 -8814 5904 -10446 -17321 -26597 -32697 -29338 683 26428 24087 -14323
12639a4323l4662J32j0797J1201K664K4874J4100j8428o029L933n285P030L2831
$$ -14323 -48985 -48853 -59650 -48449 -45785 -20911 -6811 -25239 -31268 -27335 -32620 -25590 7241
12626G241K696L466m3640j2722K9395J6914k0699j8226R677J4425L610K0250L3488
$$ 7241 9937 13403 -30237 -42959 -13564 3350 -17349 -35575 -25898 -11473 -7863 12387 45875
12613D5875r925j9975l577k2702j101K9959O54k4946j9111q70j6429m487l2903
$$ 45875 35950 15975 12398 -10304 -11405 18554 19208 -5738 -24849 -25719 -42148 -46635 -79538
12600g9538j033J1044J5164K2027J8586P398j6409L113m36J824J1131Q576j0124
$$ -79538 -80571 -69527 -54363 -32336 -13750 -6352 -22761 -19648 -20084 -18260 -7129 1447 -8677
12587h677k964j9643j7168l658J3191k50j084N223L4391J0946k5623k3434j8432
$$ -8677 -11641 -31284 -48452 -52110 -38919 -39169 -40253 -35030 -639 10307 -15316 -38750 -57182
12574e7182j1898M2274K2740k6061J2262P921K0123K1252n861J167J3518j2515
$$ -57182 -69080 -26806 -4066 -30127 -17865 -9944 10179 31431 25570 26737 40255 27740
12562B7740k9508j0063n007p892L340q708N019J7342K41l1329l348K3524K3073
$$ 27740 -1768 -11831 -16838 -24730 -21390 -30098 -25079 -7737 -7496 -38825 -42173 -18649 4424
12549D424j3332R98Q252j4357L873K0326R999K8479J6929o938k9876r355J572
$$ 4424 -8908 -7910 342 -14015 -10142 10184 20183 48662 65591 58653 28777 19422 20994
12536B0994J7839m721j4663j1965L255J0617j3545J4898J4462p885k806p32j434
$$ 20994 38833 34112 19449 7484 10739 21356 7811 22709 37171 29286 26480 25748 24314
12523B4314j0001l045q507Q856k871N957K769k0141J2544J1838K373l555j0955
$$ 24314 14313 11268 2761 11617 8746 14703 17472 -2669 9875 21713 24086 20531 9576
12510I576J3293p302k6963O214n508K2528K0897K75k2111j0624j7512J8440q338
$$ 9576 22869 15567 -11396 -5182 -10690 11838 32735 33010 10899 275 -17237 1203 -7135
12497g135k8240j6654P026K9938J5964q801O040J8077k5189L640Q878J9633J8753
$$ -7135 -35375 -52029 -45003 -15065 899 -7902 -1862 16215 -8974 -5334 3544 23177 41930
12484D1930k8473r270j7556k8395j8559K1117L8022K1930k242j7501o607J6036
$$ 41930 13457 4187 -13369 -41764 -60323 -39206 -1184 20746 18504 1003 -5604 10432
12472A0432l100j1105j0451R635K7828J0845l4887J5826j3942j6323L721J4146
$$ 10432 7332 -3773 -14224 -4589 23239 34084 -803 15023 1081 -15242 -11521 2625
12460B625P460j6465j3764J3001j6633k986k4057l796L4295J8835j1745P814J734
$$ 2625 10085 -6380 -20144 -7143 -23776 -26762 -50819 -54615 -20320 -1485 -13230 -5416 -3682
12447c682k780J6131K7710n609j8193Q092J4432m711L588o826n662j4850j1803
$$ -3682 -6462 9669 37379 31770 13577 21669 36101 31390 34978 28152 22490 7640 -4163
12434d163n390r924J53J5342M680J4034J440q229J1783q398R790J0210p678m0906
$$ -4163 -9553 -19477 -19324 -3982 698 14732 16172 7943 19726 11328 21118 31328 23650 -17256
12420a7256O465K8707n491j126l679q496j3446J3687R040J6536P006P351L279
$$ -17256 -10791 17916 12425 11299 7620 -876 -14322 -635 8405 24941 31947 39298 42577
12407D2577m04l1306j7565O34j3633K0245Q204j4840R966J6800j0103j7410j0391
$$ 42577 42173 10867 -6698 -6064 -19697 548 8752 -6088 3878 20678 10575 -6835 -17226
12394a7226K402K1303K4835j5691j7132K391J1555n561r751j4469r596J7915l4
$$ -17226 -14824 6479 31314 15623 -1509 882 12437 6876 -2875 -17344 -26940 -9025 -9059
12381i059r770j067J4167J3846M055l697m286Q727O907j0660J8857R829k2643
$$ -9059 -18829 -19896 -5729 8117 12172 8475 4189 12916 19823 9163 28020 37849 15206
12368A5206j9661j3435k791j5866J6675K0973R851n730Q616l2636K3805J2834
$$ 15206 -4455 -17890 -20681 -36547 -19872 1101 10952 5222 13838 -18798 5007 17841
12356A7841K5373j3550l2465r903l820K5146P283k2734o933O326L9264k711l6301
$$ 17841 43214 29664 -2801 -12704 -16524 8622 15905 -6829 -13762 -7436 31828 29117 -7184
12343g184P555j724k4333j6124L7559R344J2291J4649R379j4147k0059J6107J8980
$$ -7184 371 -1353 -25686 -41810 -4251 5093 17384 32033 41412 27265 7206 23313 42293
12330D2293J0610R203j2615l3728j6740L6375J4239m937N424L460n417j8439j9473
$$ 42293 52903 62106 49491 15763 -977 35398 49637 44700 50124 53584 48167 29728 10255
12317A0255L3281L761k3103j3723l943J7358K1143J4251l477J2019j9588j6993
$$ 10255 43536 47297 24194 10471 6528 23886 45029 59280 55803 67822 48234 31241
12305C1241k0478j5494L425L3079M207j872l9319L1J838K3052J2617k9517r812
$$ 31241 10763 -4731 -1306 31773 35980 34108 -5211 -5180 -3342 19710 32327 2810 -7002
12292g002L9800R553k3906K7035J662m65M517j0509k4413j2423P777J7084j2571
$$ -7002 32798 42351 18445 45480 47142 46677 51194 40685 16272 3849 11626 28710 16139
12279A6139R895Q320Q342j8779K167M07J5706n664j5633j330n949J6347N3479
$$ 16139 26034 34354 42696 23917 26084 26491 42197 36533 20900 19570 13621 29968 83447
12266H3447J969l3260k0954j8013j0724J0382P837L760O401R455r71j4677q186
$$ 83447 85416 52156 31202 13189 2465 12847 20684 24444 30845 40300 39329 24652 16466
12253A6466p747P14p507j796O893J7720n819j121K3015K7482N197j3404Q464n362
$$ 16466 8719 9433 1926 130 7023 24743 18924 17803 40818 68300 73497 60093 68557 63195
12239F3195r452P723j9051K0121L8776K3416K676p761l6548j7667k3273j0884
$$ 63195 53743 61466 42415 62536 101312 124728 127404 119643 83095 65428 42155 31271
12227C1271o244q527J6790J7415J3957M44q469k2366j0289K9538n544j2098l5142
$$ 31271 25027 16500 33290 50705 64662 65106 56637 34271 23982 53520 47976 35878 736
12214G36Q406K5527Q189K7967j5889j0161j078M0654q171j1310N686K677k864
$$ 736 9142 34669 42858 70825 54936 44775 43697 84351 76180 64870 70556 73233 70369
12201G0369J3921J220n907J5127m7213k2406J9325K722K2481M0613J7371j750
$$ 70369 84290 85510 79603 94730 47517 25111 44436 47158 69639 110252 127623 125873
12189A25873j8859J222J2030J5017k6480J0433p793J395J891K921o340j8617l4108
$$ 125873 107014 108236 120266 135283 108803 119236 111443 112838 114729 117650 111310 92693 58585
12176E8585J0208O1747K4891k9681l5110M924j3901P935J2804J0225L135l237
$$ 58585 68793 130540 155431 125750 90640 95564 81663 89598 102402 112627 115762 112525
12164A12525j5140l5605J5002K2057k9775O678N585j6284L4521K685j0818P22
$$ 112525 97385 61780 76782 98839 69064 75742 81327 65043 99564 102249 91431 92153
12152I2153J2070L192k467L081N411K4537k3881J075K2132J5188K2972P83K519
$$ 92153 104223 107415 104948 108029 113440 137977 114096 115171 137303 152491 175463 176246 178765
12139A78765M488k414R072L510k5661m444K4978p25k061L0132J495Q60j968j1684
$$ 178765 183253 180839 189911 193421 167760 163316 188294 187569 185508 215640 217135 217995 216027 204343
12125B04343o657P42P25O421J3310l333j5244m58q559j5369L0336J5909o445k301
$$ 204343 197686 198428 199153 205574 218884 215551 200307 199849 191290 175921 206257 222166 215721 213420
12111B13420J2049K4887J7412j7438p951L4196k66k7654M631R951j3919k6484
$$ 213420 225469 250356 267768 250330 242379 276575 276309 248655 253286 263237 249318 222834
12099B22834J2062K0400K1208K6964p682q990p254m861K738j9052M2033K0751
$$ 222834 234896 255296 276504 303468 295786 286796 279542 274681 277419 258367 300400 321151
12087C21151k7778O990j8697K140M2457J2914J4023J3416M271J0012k177n868
$$ 321151 293373 300363 281666 283806 326263 339177 353200 366616 370887 380899 378722 372854
12075C72854N562K3217K9818J2033j1685l842k119r58J8196L2524J6295j98P287
$$ 372854 378416 401633 431451 443484 431799 427957 425838 424880 443076 475600 491895 491697 498984
12062D98984j1902k025J0100J7997L1259J7992J9916p334j3571j6197L636J3778
$$ 498984 487082 485057 495157 513154 544413 562405 582321 574987 561416 545219 548855 562633
12050E62633L9235K3876K2789j6311j7338m474K4437N0051J220J0105r382r175
$$ 562633 601868 625744 648533 632222 614884 610410 634847 684898 686118 696223 686841 677666
12038F77666J9962K0766K9070K5406K0168J6781N363J0206K3638K1150J6127q952
$$ 677666 697628 718394 747464 772870 793038 809819 815182 825388 849026 870176 886303 877351
12026H77351R317J3807J7138L2975K3639P771K7593J7689J6102N0945K4323R027
$$ 877351 886668 900475 917613 950588 974227 981998 1009591 1027280 1043382 1094327 1118650 1127677
12014A127677Q091J7154K7305K7942J8835Q263N3841M3913M0046K8286K1364O0650
$$ 1127677 1135768 1152922 1180227 1208169 1227004 1235267 1289108 1333021 1373067 1401353 1422717 1483367
12002A483367N7026L4384M275L8204Q1432O9979M3439K7425L2272N9585M7458
$$ 1483367 1540393 1574777 1579052 1617256 1698688 1768667 1812106 1839531 1871803 1931388 1978846
11991A978846P5389O7460L5848O4253R1372Q4070P0616R1362R5388Q9669O7500
$$ 1978846 2054235 2121695 2157543 2221796 2313168 2397238 2467854 2559216 2654604 2744273 2811773
11980B811773P0643R0901P5589Q0162R1972J10804J10003J05404R8850J15568
$$ 2811773 2882416 2973317 3048906 3129068 3221040 3331844 3441847 3547251 3646101 3761669
11970C761669J38212J56879J45472J29120J50912J40301J27241J34026J28235
$$ 3761669 3899881 4056760 4202232 4331352 4482264 4622565 4749806 4883832 5012067
11961E012067J39023J55294J56212J46759J67875J76099J70659J65644J72035
$$ 5012067 5151090 5306384 5462596 5609355 5777230 5953329 6123988 6289632 6461667
11952F461667J62012J62969J72326J53847J44391J28423J08209J17743J31438
$$ 6461667 6623679 6786648 6958974 7112821 7257212 7385635 7493844 7611587 7743025
11943G743025R3584O6909O6551N6792N2868L3217K353j7014l5483n0594m0143
$$ 7743025 7836609 7903518 7970069 8026861 8079729 8112946 8115299 8098285 8062802 8012208 7972065
11932G972065m0896q2727j17627j22865j09615q8828j23103j17570j17968j64319
$$ 7972065 7931169 7848442 7730815 7607950 7498335 7409507 7286404 7168834 7050866 6886547
11922F886547j93792j50447j42532j49484j62464j73356j42107j50008j62113
$$ 6886547 6692755 6542308 6399776 6250292 6087828 5914472 5772365 5622357 5460244
11913E460244j50267j53412j56416j70231j54184j66202j32193j25825r1048j31118
$$ 5460244 5309977 5156565 5000149 4829918 4675734 4509532 4377339 4251514 4160466 4029348
11903D029348j29916j06398j29917j14932r7874p8771q7321r8360q9721j42227
$$ 4029348 3899432 3793034 3663117 3548185 3450311 3371540 3284219 3185859 3096138 2953911
11893B953911j07504o0094o0990p8434o4073o0797p8388p7596p5517n7759o3786
$$ 2953911 2846407 2786313 2725323 2646889 2582816 2522019 2443631 2366035 2290518 2232759 2168973
11882B168973n9183n9197n6060o7179m8202m4352o1859k6684n5807l7992m3942
$$ 2168973 2109790 2050593 1994533 1927354 1879152 1834800 1772941 1746257 1690450 1652458 1608516
11871A608516k3879j6517n7406p3432j6367k7645n2031o220j0760l9092l1470
$$ 1608516 1584637 1568120 1510714 1437282 1420915 1393270 1341239 1335019 1324259 1285167 1253697
11860A253697k7891k5984l6065k8358j4624k0992k2192l1003m6982r467j3821
$$ 1253697 1225806 1199822 1163757 1135399 1120775 1099783 1077591 1046588 999606 990139 976318
11849I76318l0127k5520k1158k8129l3006q630j6650m036j3473l2561Q980Q325
$$ 976318 946191 920671 899513 871384 838378 829748 813098 809062 795589 763028 772008 780333
11837G80333j5437l4641j9477j0048j9354j6186n839j4990J7101o016k7462m7685
$$ 780333 764896 730255 710778 700730 681376 665190 659351 644361 661462 655446 627984 580299
11825E80299j6291L2532j7122k4082j3624J2768j0202o1k3443k7651m655q984
$$ 580299 564008 596540 579418 555336 541712 554480 544278 544217 520774 493123 488468 479484
11813D79484m160J0934l630j4958L811k753k1165N275Q382K599k6176l0180j1362
$$ 479484 475324 486258 482628 467670 471481 468728 447563 452838 461220 463819 437643 407463 396101
11800C96101L730l0831l6068J540J8640M865Q729r28j990L621j1634j7502j3294
$$ 396101 399831 369000 332932 334472 353112 357977 366706 365778 363788 367409 355775 338273 324979
11787C24979j8704k6768j1486P20J2659P921m354j7661o118K0768J2032m03j8934
$$ 324979 306275 279507 268021 268741 281400 289321 284967 267306 261188 281956 293988 293585 274651
11774B74651p583q620Q437M8318k6295k5438J0326k0264k1449q291N512j1108
$$ 274651 267068 258448 266885 315203 288908 263470 273796 253532 232083 223792 229304 218196
11762B18196M665j6766J6J06k3842J1124J9421o102J3575L848l0200q797Q884
$$ 218196 222861 206095 206111 206217 182375 193499 212920 206818 220393 224241 194041 185244 194128
11749A94128N557j2543J4726J4192j9083j1579j5182l7778K7789J6712k9135Q237
$$ 194128 199685 187142 201868 216060 196977 185398 170216 132438 160227 176939 147804 156041
11737A56041K0420K6688j7233m7864J9616R810K4366O517m920m2386k1587N185
$$ 156041 176461 203149 185916 138052 157668 167478 191844 198361 193441 151055 129468 134653
11725A34653j7786O851O769j3929L8082L3973j3200l1046j7086P470J3498j7764
$$ 134653 116867 123718 130487 116558 154640 188613 175413 144367 127281 134751 148249 130485
11713A30485j3282j0218k136j6659j9536K1340K0105n419O096J012J7299n222
$$ 130485 117203 106985 104849 88190 68654 89994 110099 104680 110776 111788 129087 123865
11701A23865j4800O553J2064R555j2892j0915k0389j4222M4979J0261n177j1542
$$ 123865 109065 115618 127682 137237 124345 113430 93041 78819 123798 134059 128882 117340
11689A17340P362M489l1160j0456j0900P377j3025k4620K0732M7444j0509o997
$$ 117340 124702 129191 98031 87575 76675 84052 71027 46407 67139 114583 104074 97077
11677I7077j1012J8516J439l0263N245j3117J4230Q456j2018J1944k3865k2665
$$ 97077 86065 104581 106020 75757 81002 67885 82115 90571 78553 90497 66632 43967
11665D3967p8K0384K482J2860J3311J445j8653l7865J042L4865j232j4495J8518
$$ 43967 43889 64273 66755 79615 92926 94371 75718 37853 38895 73760 72528 58033 76551
11652G6551q83k1935j1109K6408l740k2531J35L6572J227k4186m266J2289j6205
$$ 76551 75668 53733 42624 69032 65292 42761 42896 79468 80695 56509 52243 64532 48327
11639D8327r234N29N401j381j2665q378L2m991n66O697k351j0867j7711J9905
$$ 48327 39093 39622 45023 43642 30977 22599 22631 17640 17074 23771 21420 10553 -7158 12747
11625A2747K2258K0361J6570j6619j625K0141J7278k3527o709j3866j827p823
$$ 12747 35005 55366 71936 55317 53692 73833 91111 67584 60875 47009 45182 37359
11613C7359q160K3526j524j3314P623q552j7120j294o281Q088r314J9080P588
$$ 37359 29199 52725 51201 37887 45510 36958 19838 18544 12263 20351 11037 30117 37705
11600C7705J3138J3895P239p831j4190o384J0753k62o737j4695l664K641J5004
$$ 37705 50843 64738 71977 64146 49956 43572 54325 54063 47326 32631 28967 31608 46612
11587D6612L3326j0628k4321j6524J984l910j0801k5165L106n763J8033J0581
$$ 46612 79938 69310 44989 28465 30449 26539 15738 -9427 -6321 -12084 5949 16530
11575A6530k023j1497J1577J4804K865l318n031J2477j82R948J6119K256o133
$$ 16530 14507 3010 14587 29391 32256 28938 23907 36384 36202 46150 62269 64525 58392
11562E8392j0106j654J7838j8472j4345M325p746P2P585O290k7298q68j9534O835
$$ 58392 48286 46632 64470 45998 31653 35978 28232 28304 35889 42179 14881 14013 -5521 1314
11548A314k9894L102K3333J1089n551J366Q643K172q765j2377p181o60M065J296
$$ 1314 -28580 -25478 -2145 8944 3393 4759 13402 15574 6809 -5568 -12749 -13409 -9344 -8048
11534h048k083j3699R103j4063P792R738L580J1964K213K640o212k1261j9240
$$ -8048 -10131 -23830 -14727 -28790 -20998 -11260 -7680 4284 6497 9137 2925 -18336 -37576
11521c7576P959K0264Q172r210Q343l330J4109k6831K369K5230K5440K0344k1178
$$ -37576 -29617 -9353 -1181 -10391 -2048 -5378 8731 -18100 -15731 9499 34939 55283 34105
11508C4105K755K58k5438l0876n588M343l613N424Q035p566j1534m764L12N736
$$ 34105 36860 37118 11680 -19196 -24784 -20441 -24054 -18630 -10595 -18161 -29695 -34459 -34147 -28411
11494b8411j6510L918R549K0217K3207j2133P300j0576j6506j8792M970P295J4496
$$ -28411 -44921 -41003 -31454 -11237 11970 -163 7137 -3439 -19945 -38737 -33767 -26472 -11976
11481a1976k919m605K881K7187L785J4849K1889k2777l5678k3104Q231K9606J1623
$$ -11976 -14895 -19500 -16619 10568 14353 29202 51091 28314 -7364 -30468 -22237 7369 18992
11468A8992j8513l4742M981J2561q927j1320L887Q572K2595P308p364Q247K0582
$$ 18992 479 -34263 -29282 -16721 -25648 -36968 -33081 -24509 -1914 5394 -1970 6277 26859
11455B6859o06r159L2267m980O798j2504r008m503J3350N276k9555n218n902j2533
$$ 26859 26253 17094 49361 44381 51179 38675 29667 25164 38514 43790 14235 9017 3115 -9418
11441i418L568J1233K212J2187J0466J40k142P451k8006k1221J7774L0954j935
$$ -9418 -5850 5383 7595 19782 30248 30388 28246 35697 7691 -13530 4244 35198 33263
11428C3263k5234l0794n392K0689R129P380j4457j8966l981j9726Q232O909Q702
$$ 33263 8029 -22765 -28157 -7468 1661 9041 -5416 -24382 -28363 -48089 -39857 -32948 -24246
11415b4246J8556j2237k438Q108L501l1993j7132K6060K704O53K4148J1790l6074
$$ -24246 -5690 -17927 -20365 -12257 -8756 -40749 -57881 -31821 -29117 -28464 -4316 7474 -28600
11402b8600J6164P925j4989o127L242P15j1802Q514Q042K9691k1846k0876j491
$$ -28600 -12436 -4511 -19500 -25627 -22385 -21670 -33472 -24958 -16916 12775 -9071 -29947 -31438
11389c1438r996r203K710P246J5951J3148J0145r78p448j5619J7205o719L561
$$ -31438 -41434 -50637 -47927 -40681 -24730 -11582 -1437 -2415 -9863 -25482 -8277 -14996 -11435
11376a1435k918J8885L185j1895m744J4796k2236J1482J4595l4486j849J7199
$$ -11435 -14353 4532 7717 -4178 -8922 5874 -16362 -4880 9715 -24771 -26620 -9421
11364i421L3159k9655l2430J1866K0683j2494j3847K3813m809m139J6599O115
$$ -9421 23738 -5917 -38347 -26481 -5798 -18292 -32139 -8326 -13135 -17274 -675 5440
11352E440k0030q200j5483j5572K1743K3649J7945k1362l8506J2976J5969K752
$$ 5440 -14590 -22790 -38273 -53845 -32102 -8453 9492 -11870 -50376 -37400 -21431 -18679
11340a8679J4031j1870l8652J0157J3351L3135j3315j8903K5662K4525j8682j275
$$ -18679 -4648 -16518 -55170 -45013 -31662 1473 -11842 -30745 -5083 19442 760 -515
11328e15r992K2373K4826j4728k3714m665j1667j9977j8134n924r960j2937j9528
$$ -515 -10507 11866 36692 21964 -1750 -6415 -18082 -38059 -56193 -62117 -72077 -85014 -104542
11315a04542J8802J9670J9377Q754q456L124J504M974J3377L3209J1182l1569
$$ -104542 -85740 -66070 -46693 -37939 -46395 -43271 -41767 -36793 -23416 9793 20975 -10594
11303a0594j8946J9370J409k2814o370N204q667J443j8505P992j2549K3310L1676
$$ -10594 -29540 -10170 -8761 -31575 -37945 -32741 -41408 -39965 -58470 -50478 -63027 -39717 -8041
11290h041K1809K464J166K3666Q362l4694k1267L631n220l1384r623M973J8664
$$ -8041 13768 16232 17398 41064 49426 14732 -6535 -2904 -8124 -39508 -49131 -44158 -25494
11277b5494J2767l207k1712M616L9083l1277k9725K9022J2056k5633r590o289
$$ -25494 -12727 -15934 -37646 -33030 6053 -25224 -54949 -25927 -13871 -39504 -49094 -55383
11265e5383j2603o066K2876L9096j486j3885J2494J9172j4292n026N527J5551
$$ -55383 -67986 -74052 -51176 -12080 -13566 -27451 -14957 4215 -10077 -15103 -9576 5975
11253E975k211K6787n788r689k1953j382o917r953j9728l4807k0645J2851L1292
$$ 5975 3764 30551 24763 15074 -6879 -8261 -15178 -25131 -44859 -79666 -100311 -87460 -56168
11240e6168K4880L626O7j1183P774m020L14j845M948J4389J5107p011j3437k9730
$$ -56168 -31288 -27662 -27595 -38778 -31004 -35024 -34710 -36555 -31607 -17218 -2111 -9122 -22559 -52289
11226e2289J783R083J1118L0249j1245j459N742k2785o701O580j3420k2540J3685
$$ -52289 -50506 -41423 -30305 -56 -11301 -12760 -7018 -29803 -36504 -29924 -43344 -65884 -52199
11213e2199l816Q788p517J3728J0495m988q665n30J6497l44j0905j7615K324j6528
$$ -52199 -56015 -47227 -54744 -41016 -30521 -35509 -44174 -44704 -28207 -28551 -39456 -57071 -54747 -71275
11199g1275l100P886R123l677J722P214J4649M689J0433j8986k0694O575J9530
$$ -71275 -74375 -66489 -57366 -61043 -59321 -52107 -37458 -32769 -22336 -41322 -62016 -55441 -35911
11186c5911J3411l3N110K625q918l2333o845J7333J8131J8575J8414j1946j4265
$$ -35911 -22500 -22533 -17423 -14798 -23716 -56049 -62894 -45561 -27430 -8855 9559 -2387 -16652
11173a6652k1369m7980j2172m664L8475K1468K574L8270l519q837J1335M874k7971
$$ -16652 -38021 -86001 -98173 -102837 -64362 -42894 -40320 -2050 -5569 -14406 -3071 1803 -26168
11160b6168J0347K1357q753L9668k4461n3427j3785l446j1235k8907o470M5238
$$ -26168 -15821 5536 -3217 36451 11990 -41437 -55222 -58668 -69903 -98810 -105280 -60042
11148f0042K7678L546K7103j043k8735k1483n143K7851K0992m99k5600j1901k853
$$ -60042 -32364 -28818 -1715 -2758 -31493 -52976 -58119 -30268 -9276 -9775 -35375 -47276 -50129
11135e0129J7944K1691j211j9996j7160k5185r780l576K6163R249k353J9106p602
$$ -50129 -32185 -10494 -11705 -31701 -48861 -74046 -83826 -87402 -61239 -51990 -54343 -35237 -42839
11122d2839k1531L26j3510K5748K7179q867J0640j0589j4201J0686Q452k1100
$$ -42839 -64370 -64044 -77554 -51806 -24627 -33494 -22854 -33443 -47644 -36958 -28506 -49606
11110d9606J18J4134L0169m0132k3829l990P136P387j686r7M1974K0512j9962
$$ -49606 -49488 -35354 -5185 -45317 -69146 -73136 -66000 -58613 -60299 -60396 -18422 2090 -17872
11097a7872j8772n690J8403k011k3242m166n217O682l168M2582p315k2366k0063
$$ -17872 -36644 -42334 -23931 -25942 -49184 -53350 -58567 -51885 -55053 -12471 -19786 -42152 -62215
11084f2215o365N201j3J5272J8760K7970j379k7480j1378O284j1508L2k2938M24
$$ -62215 -68580 -63379 -63392 -48120 -29360 -1390 -2769 -30249 -41627 -35343 -46851 -46819 -69757 -69333
11070f9333N642J0106J2112j7706j756J4890p61k6273J59M6351J2029k3737l5455
$$ -69333 -63691 -53585 -41473 -59179 -60935 -46045 -46806 -73079 -72920 -26569 -14540 -38277 -73732
11057g3732k0678k1145J8372N4803J9357o138o601Q523p175o281k2495j9R740
$$ -73732 -94410 -115555 -97183 -42380 -23023 -29161 -35762 -27239 -34414 -40695 -63190 -63209 -53469
11044e3469R980Q379K61J8567O780L9518J1007j8749j1713M68K2549L001j1562
$$ -53469 -43489 -35110 -34849 -16282 -9502 30016 41023 22274 10561 11029 33578 36579 25017
11031B5017l8340m708J1252L0647K2639m695Q166j590j4565N942J0886L4129q088
$$ 25017 -13323 -18031 -6779 23868 46507 41812 49978 48388 33823 39765 50651 84780 76692
11018G6692j2174J9462K8199O0760Q027J522P649j2117l4117q091m2024j1013
$$ 76692 64518 83980 112179 172939 180966 182488 190137 178020 143903 135812 93788 82775
11006H2775l48J2234Q102r784o133J4819l470n92K035j544j8349j6167l1315q491
$$ 82775 82427 94661 102763 92979 86846 101665 98195 97603 99638 98094 79745 63578 32263 23772
10992B3772m012J3345P577m395J4934j4392k7962q267l348j6121J2309J2231l821
$$ 23772 19760 33105 40682 36287 51221 36829 8867 600 -2748 -18869 -6560 5671 1850
10979A850q742M085l4806m0635l2249j2071J3800N5929K1919m0017k4423K6904
$$ 1850 -6892 -2807 -37613 -78248 -110497 -122568 -108768 -52839 -30920 -70937 -95360 -68456
10967f8456K5773J9111k5550P616Q736j8410j0668k9609n617K3283J7632L7495
$$ -68456 -42683 -23572 -49122 -41506 -32770 -51180 -61848 -91457 -97074 -73791 -56159 -18664
10955a8664O33r703j684J1735n715m3713N824J122J5589O83k2018J0347p088J85
$$ -18664 -18031 -27734 -29418 -17683 -23398 -67111 -61287 -60165 -44576 -43893 -65911 -55564 -62652 -62467
10941f2467M02K1087J2267J3980O548J2774p267j2219K979J253P927K872J6006
$$ -62467 -62065 -40978 -28711 -14731 -8183 4591 -2676 -14895 -11916 -10663 -2736 136 16142
10928A6142j7280l0465m613q942K730k355j1525J0571o352r611J7292M554r646
$$ 16142 -1138 -31603 -36216 -45158 -42428 -44783 -56308 -45737 -52089 -61700 -44408 -39854 -49500
10915d9500J734r735J0915J9497J2200k854J1248J111j2792J846q606j7654k0996
$$ -49500 -47766 -57501 -46586 -27089 -14889 -17743 -6495 -5384 -18176 -16330 -24936 -42590 -63586
10902f3586l081J0347j5736J2935Q904m187M730O830Q592M539j4452J1269o903
$$ -63586 -66667 -56320 -72056 -59121 -50217 -54404 -49674 -42844 -34252 -29713 -44165 -32896 -39799
10889c9799j8431J4314m221J4016J1095j069O71J0387j417m694k8253r319K324
$$ -39799 -58230 -43916 -48137 -34121 -23026 -24095 -23424 -13037 -14454 -19148 -47401 -56720 -54396
10876e4396l4958r311L765P27J5457J8114K0023m842K5651J1114K439p938k8488
$$ -54396 -89354 -98665 -94900 -94173 -78716 -60602 -40579 -45421 -19770 -8656 -6217 -14155 -42643
10863d2643k5006m637r570L0185L5456J3654r018j8115j7484m168q136R306N791
$$ -42643 -67649 -72286 -81856 -51671 -16215 -2561 -11579 -29694 -47178 -51346 -59482 -50176 -44385
10850d4385K983j0439j7859p834k6103J6934M8995K0988o050N385J7328k6223
$$ -44385 -41402 -51841 -69700 -77534 -103637 -86703 -37708 -16720 -22770 -17385 -57 -26280
10838b6280P551J2790r320R262n247j6172j6171j6859m102Q59K2884j0665n182
$$ -26280 -18729 -5939 -15259 -5997 -11244 -27416 -43587 -60446 -64548 -63689 -40805 -51470 -56652
10825e6652J4349L2135r486J2537M623j6100O616k7233q831K0949O566l2912j721
$$ -56652 -42303 -10168 -19654 -7117 -2494 -18594 -11978 -39211 -48042 -27093 -20527 -53439 -55160
10812e5160J2404M296j3775j4427r740p080m130J003P193J4186k3335n004K2408
$$ -55160 -42756 -38460 -52235 -66662 -76402 -83482 -87612 -86609 -79416 -65230 -88565 -93569 -71161
10799g1161j5874R154Q232k856j4352k9797J3012r259J4172K166K7637L3309j0919
$$ -71161 -87035 -77881 -69649 -72505 -86857 -116654 -103642 -112901 -98729 -96563 -68926 -35617 -46536
10786d6536L360n698k48p064K157P590p895l689O486N719n517K779Q027j4027
$$ -46536 -43176 -48874 -49122 -56186 -54029 -46439 -54334 -58023 -51537 -45818 -51335 -48556 -40529 -54556
10772e4556K920K3121K3760P783j6199j3262j618j2136j5818O999R492N208Q354
$$ -54556 -51636 -28515 -4755 3028 -13171 -26433 -28051 -40187 -56005 -49006 -39514 -34306 -25952
10759b5952J7797J4014K5125k2927k9644K5128J2826Q247J194K0705j9995j8230
$$ -25952 -8155 5859 30984 8057 -21587 3541 16367 24614 25808 46513 26518 8288
10747H288k6455k124K6162J7386o371P136j6127j1052j3194p588K1242Q035j2835
$$ 8288 -18167 -20291 5871 23257 16886 24022 7895 -3157 -16351 -23939 -2697 5338 -7497
10734g497M870K1645K1186k1954n026r136l4285j2467K7922K9200K4296o464L652
$$ -7497 -2627 19018 40204 18250 13224 4088 -30197 -42664 -14742 14458 38754 32290 35942
10721C5942j7666P054J6126l7203k7359j674L3885O932J7298J250R230L0160k960
$$ 35942 18276 25330 41456 4253 -23106 -24780 9105 16037 33335 34585 43815 73975 71015
10708G1015l1903m8751j1424K554p737k895j1704J1825M0764K5788k8566o199
$$ 71015 39112 -9639 -21063 -18509 -26246 -29141 -40845 -29020 11744 37532 8966 2767
10696B767j5331J0571J3738J9354j609n672j7317R635M648J2717L4282m7787l6222
$$ 2767 -12564 -1993 11745 31099 29490 23818 6501 16136 20784 33501 67783 19996 -16226
10683a6226L6799N989j292L076k6962N985k0964j3878J0943j3359J6491M5031
$$ -16226 20573 26562 25270 28346 1384 7369 -13595 -27473 -16530 -29889 -13398 31633
10671C1633K1333n387m762m0792k4230P657R697J5146K291N134l62K3768k0704
$$ 31633 52966 47579 42817 2025 -22205 -14548 -4851 10295 12586 17720 17358 41126 20422
10658B0422M395P865N799R954K7552j3094k3006k5758j6696j5396o789K8409M734
$$ 20422 24817 32682 38481 48435 75987 62893 39887 14129 -2567 -17963 -24752 3657 8391
10645H391J2475K6957K4072K5160N809J4615J5754K278N63K3680J593M1930J514
$$ 8391 20866 47823 71895 97055 102864 117479 133233 135511 136074 159754 161347 203277 204791
10632B04791J1769J0770K4922K3912J3007K4398O2044P1436P6365P2790N4428
$$ 204791 216560 227330 252252 276164 289171 313569 375613 447049 523414 596204 650632
10621F50632N9508Q3209J43628J39440J52859K31465K93090M08464O19018Q11246
$$ 650632 710140 793349 936977 1076417 1229276 1460741 1753831 2162295 2781313 3592559
10611C592559J082663J448731J835434K020823J686097R51478J66806l90335n50665
$$ 3592559 4675222 6123953 7959387 9980210 11666307 12617785 12784591 12394256 11843591
10602A1843591l45701J29661Q44243J704838K745744L714874M043260L106157
$$ 11843591 11497890 11627551 12471794 14176632 16922376 20637250 24680510 27786667
10594B7786667J067603r33629k116329k341252j778990p02670O31778K077881
$$ 27786667 28854270 27920641 25804312 23463060 21684070 20981400 21613178 23691059
10586B3691059L556821M812618M974591L185161J8949k825037m395988m555679
$$ 23691059 27247880 32060498 37035089 40220250 40239199 37414162 33018174 28462495
10578B8462495l644754k305576r26273M37768J658323K505015K474578J087961
$$ 28462495 24817741 22512165 21585892 22023660 23681983 26186998 28661576 29749537
10570B9749537j083282k877972l705776l607816k874338j877314j008353k81550
$$ 29749537 28666255 25788283 22082507 18474691 15600353 13723039 12714686 12433136
10562A2433136L03962N86807M80695o8954r26166j633415j931461j840874j539472
$$ 12433136 12737098 13323905 13804600 13735646 12809480 11176065 9244604 7403730 5864258
10553E864258j198348q92787o48062m72537l84863l06423k43339j91962j40808
$$ 5864258 4665910 3773123 3125061 2652524 2267661 1961238 1717899 1525937 1385129
10544A385129j51679j22272q9911r0166o1145o7581p2383o6080o9276l4174o7113
$$ 1385129 1233450 1111178 1021267 931101 869956 802375 729992 663912 594636 560462 493349
10533D93349l2422m1712k1708R189k7054m0461j9926k0126l4027p920j0006j1145
$$ 493349 460927 419215 397507 406696 379642 339181 319255 299129 265102 257182 247176 236031
10521B36031r243o910l4234r060Q343k0705p831J0338J778j5701o583j0715j5536
$$ 236031 226788 219878 185644 176584 184927 164222 156391 166729 168507 152806 146223 135508 119972
10508A19972j842P966j681l0024r169K3994K9902j1960m3729k1290j3604J9005
$$ 119972 118130 126096 124415 94391 85222 109216 139118 127158 83429 62139 48535 67540
10496F7540L4330p6j1248k2804k9345l852K8467J8996q727k399j692p740k0499
$$ 67540 101870 101794 90546 67742 38397 34545 63012 82008 73281 70882 69190 61450 40951
10483D0951J5721K858K0869J7481j3192k0894l821N005p640M098k532J2308M162
$$ 40951 56672 59530 80399 97880 84688 63794 59973 64978 57338 61436 58904 71212 75374
10470G5374j0039j0308q615k147J782j6261Q01K3234j0603K4897K4777j033J6155
$$ 75374 65335 55027 46412 44265 46047 29786 30587 53821 43218 68115 92892 91859 108014
10457A08014J5641Q468O554j3209R624J1162k6542p488R991p3J0238K428k0170
$$ 108014 123655 132123 138677 125468 135092 146254 119712 112224 122215 122142 132380 134808 114638
10444A14638K985J001K3105J2523J2660J0765j8292R626J654k0802j2043k05K4467
$$ 114638 117623 118624 141729 154252 166912 177677 159385 169011 170665 149863 137820 137615 162082
10431A62082L562J3360j2065k6547J575K4374Q434N631J5014j7656p704J112K138
$$ 162082 165644 179004 166939 140392 141967 166341 174775 180406 195420 177764 170060 171172 173310
10418A73310K6620K1319J6804o108J2550k515O345k0242Q509J6543J7618j5585
$$ 173310 199930 221249 238053 231945 244495 241980 248325 228083 236592 253135 270753 255168
10406B55168k682J7628J1232K3857k502r125J2931L6142n318k2996k2889M436
$$ 255168 252486 270114 281346 305203 302701 293576 306507 342649 337331 314335 291446 295882
10394B95882N4147O2056R338K1972m078L51m084L720L826N78k0887j4282J9152
$$ 295882 350029 412085 421423 443395 439317 439668 435584 439304 443130 443708 422821 408539 427691
10381D27691J2980j0397j6858J6167j1826k1201J3568k9933k4102q073K5197L2593
$$ 427691 440671 430274 413416 429583 417757 396556 410124 380191 356089 348016 373213 405806
10369D05806m269l4939m2547N979k642k611k0781k4387P048J9832k3196m0008
$$ 405806 401537 366598 324051 330030 327388 324777 303996 279609 286657 306489 283293 243285
10357B43285l6610j5524Q636K4074J8270q156r516j7749k7856k206k1088j1628
$$ 243285 206675 191151 199787 223861 242131 233975 224459 206710 178854 176648 155560 143932
10345A43932m848j4518q537R134J5933j4260j8927N80j4345j3385L630p060o208
$$ 143932 139084 124566 116029 125163 141096 126836 107909 108489 94144 80759 84389 77329 71121
10332G1121M041j3647J865J0186K601l177k5292j7682j0092j288j0975K0287K0883
$$ 71121 75162 61515 63380 73566 76167 72990 47698 30016 19924 18636 7661 27948 48831
10319D8831R252k5699q903k4212j4579m87K0952L5530K1884N070l1449k837Q657
$$ 48831 58083 32384 23481 -731 -15310 -15797 5155 40685 62569 67639 36190 33353 42010
10306D2010L3730O760m3725l0208m2891P335M833l229L773p731r175q739r149
$$ 42010 75740 82500 38775 8567 -34324 -26989 -22156 -25385 -21612 -29343 -38518 -47257 -56406
10293e6406M347J1775J0733K4321l635k3996L234J3761K457j4362Q57K8734M937
$$ -56406 -52059 -40284 -29551 -5230 -8865 -32861 -29627 -15866 -13409 -27771 -26914 1820 6757
10280F757o751K182j1110j0113m686J0106J6442k28l1291p217J3438L3982L9324
$$ 6757 6 2188 -8922 -19035 -23721 -13615 2827 2599 -28692 -35909 -22471 11511 50835
10267E0835K9159p466l7004k8576l953K6686J1441K1746L1284n148r420n687O434
$$ 50835 79994 72528 35524 6948 2995 29681 41122 62868 94152 89004 79584 73897 80331
10254H0331r734n736Q421l537k1498j8446j6587n262m568J6058K1331l821k3412
$$ 80331 70597 64861 73282 69745 48247 29801 13214 7952 3384 19442 40773 36952 13540
10241A3540o118j7971M331J7481K625j3159l044J0740N523L868J7477J3429K1171
$$ 13540 7422 -10549 -6218 11263 13888 729 -2315 8425 13948 17816 35293 48722 69893
10228F9893J024j1925q545Q432j4562l2696p797j1549k6489K4320K9951K3442
$$ 69893 70917 58992 50447 58879 44317 11621 3824 -7725 -34214 -9894 20057 43499
10216D3499p779m709j7566L562K1253j9017M49j9185K2593J764j5925k2693K2655
$$ 43499 35720 31011 13445 17007 38260 19243 19692 507 23100 24864 8939 -13754 8901
10203H901J0284o113k3171n867j3525l0985l82K6487J0261q693m537j0884q436
$$ 8901 19185 13072 -10099 -15966 -29491 -60476 -60858 -34371 -24110 -32803 -37340 -48224 -56660
10190e6660K097k2657r187J6722J4223J3249n840j3825J334o546K7436P316L4886
$$ -56660 -54563 -77220 -86407 -69685 -55462 -42213 -48053 -61878 -60544 -67090 -39654 -32338 2548
10177B548K5808j7919m2767J0423M2650L7n844J772J5055K6615R687Q125J917
$$ 2548 28356 10437 -32330 -21907 20743 20780 14936 16708 31763 58378 68065 76190 78107
10164G8107K3506K2663k548L3605J0436K6078L4103K3145K4697K4945j7894k8270
$$ 78107 101613 124276 121728 155333 165769 191847 225950 249095 273792 298737 280843 252573
10152B52573J195R493o088J559M1518L8324K4809O703m6803j0710K6727j8302
$$ 252573 253768 263261 257173 258732 300250 338574 363383 370086 323283 312573 339300 320998
10140C20998J8986M0168j158J5234K4455Q078l0578l0164j0533j5294L401J9397
$$ 320998 339984 380152 378994 394228 418683 426761 396183 366019 355486 340192 343593 362990
10128C62990N281L750P710k084K5454K6334j1475q723j7761k7716j3125K1498
$$ 362990 368271 372021 379731 377647 403101 429435 417960 409237 391476 363760 350635 372133
10116C72133K6286K3126r092k8979q914q856j0099j1446J5770L0482K1407k4363
$$ 372133 398419 421545 412453 383474 374560 365704 355605 344159 359929 390411 411818 387455
10104C87455j4744M6898J2232K0409K1313l566j8868m64J887j8410N847J7466
$$ 387455 372711 419609 431841 452250 473563 469997 451129 450665 452552 434142 439989 457455
10092D57455Q422K409J7870j2034K8295j289j0192J0714R969L0669K8315k772
$$ 457455 465877 468286 486156 474122 502417 501128 490936 501650 511619 542288 570603 567831
10080E67831N976J0983l1603j0039J5645J3689J3086j4404J8425j0021R341K3981
$$ 567831 573807 584790 553187 543148 558793 572482 585568 571164 589589 579568 588909 612890
10068F12890J0350k410m597L1592L5838K6574k845J6729M1606K9995K8356N121
$$ 612890 623240 620830 616233 647825 683663 710237 707392 724121 765727 795722 824078 829199
10056H29199K6159L3263M3693O6558N3556O9760R3197P6258O0368O5319P9179
$$ 829199 855358 888621 932314 998872 1052428 1122188 1215385 1291643 1352011 1417330 1496509
10045A496509J04621J21055J43106J95101J84069J93168K23522K24250K51780
$$ 1496509 1601130 1722185 1865291 2060392 2244461 2437629 2661151 2885401 3137181
10036C137181K87261L01903L16475L31946L74542L44289L79329M31898M34756
$$ 3137181 3424442 3726345 4042820 4374766 4749308 5093597 5472926 5904824 6339580
10027F339580M61077M76222N43871N63313O27869P03612P89358Q47213R16708
$$ 6339580 6800657 7276879 7820750 8384063 9011932 9715544 10504902 11352115 12268823
10018A2268823J004698J072854J142233J173666J209692J248217J274025J264292
$$ 12268823 13273521 14346375 15488608 16662274 17871966 19120183 20394208 21658500
10010B1658500J263813J239106J224389J213042J210183J211562J252723J348522
$$ 21658500 22922313 24161419 25385808 26598850 27809033 29020595 30273318 31621840
10002C1621840J422785J509321J619327J734857J843997J993363K097508K167121
$$ 31621840 33044625 34553946 36173273 37908130 39752127 41745490 43842998 46010119
9994D6010119K141330K176506K063481J929454J785481J575236J379511J176195
$$ 46010119 48151449 50327955 52391436 54320890 56106371 57681607 59061118 60237313
9986F0237313J017534R31941Q21843P99670Q06113Q33514R43989J039195J180849
$$ 60237313 61254847 62186788 63008631 63808301 64614414 65447928 66391917 67431112 68611961
9977F8611961J279328J329688J399012J338125J231344J044609Q10128N21241
$$ 68611961 69891289 71220977 72619989 73958114 75189458 76234067 77044195 77565436
9969G7565436K00450j12590m56913p20433r64517j117489j217068j257328j171118
$$ 77565436 77765886 77653296 77196383 76475950 75511433 74393944 73176876 71919548 70748430
9960G0748430j087798r54200q80309p93506p22529o61745o60232p46053q32518
$$ 70748430 69660632 68706432 67826123 67032617 66310088 65648343 64988111 64242058 63409540
9951F3409540j009352j222850j423374j613709j774578j964066k075091k132175
$$ 63409540 62400188 61177338 59753964 58140255 56365677 54401611 52326520 50194345
9943E0194345k136774k097867k018742j918126j814039j695732j559588j456686
$$ 50194345 48057571 45959704 43940962 42022836 40208797 38513065 36953477 35496791
9935C5496791j397711j351531j291303j267456j257686j258274j277387j303520
$$ 35496791 34099080 32747549 31456246 30188790 28931104 27672830 26395443 25091923
9927B5091923j336943j357288j352665j350156j288809j200807j137771j121103
$$ 25091923 23754980 22397692 21045027 19694871 18406062 17205255 16067484 14946381
9919A4946381j033655r46503q49429p85317p40851o72612o13634n66836n37131
$$ 14946381 13912726 12966223 12116794 11331477 10590626 9918014 9304380 8737544 8200413
9910H200413m94044m52081m52883m33767m16534l89017l54619l45029l38737l09622
$$ 8200413 7706369 7254288 6801405 6367638 5951104 5562087 5207468 4862439 4523702 4214080
9900D214080k88301k44755k56291k56125k20199j97510j93911j79112j76264j49882
$$ 4214080 3925779 3681024 3424733 3168608 2948409 2750899 2556988 2377876 2201612 2051730
9890B051730j26829q1165r4122j28178j23372q7774n0107p7548p6038k1280l6316
$$ 2051730 1924901 1843736 1749614 1621436 1498064 1410290 1360183 1282635 1206597 1185317 1149001
9879A149001m0465l1492l9089o8457n3998m1202k2185j514n9976l3803K91j9465
$$ 1149001 1108536 1077044 1037955 969498 915500 874298 852113 850599 790623 756820 757111 737646
9867G37646j9512J1810j5804k8634N457m32l08m777r457m4170n5290j7019K0036
$$ 737646 718134 729944 714140 685506 690963 690531 690223 685446 675989 631819 576529 559510 579546
9854E79546n161j2441m072n0163k2474l5676l449M452k5880J9078K0263P286q748
$$ 579546 574385 561944 557872 507709 485235 449559 446110 450562 424682 443760 464023 471309 462561
9841D62561J46j5723j228j794k2666j6042m4886m1765n90j0922r670l167J4323
$$ 462561 462707 446984 445756 443962 421296 405254 360368 318603 318013 307091 297421 294254 308577
9828C08577l250k6139k0591J259K3199L3623J708j9007l890k603j2428R30k7822
$$ 308577 305327 279188 258597 259856 283055 316678 318386 299379 295489 292886 280458 281388 253566
9815B53566l1839J3355K0299j1198k7689J3739J5261J1326m416O725K1111R906
$$ 253566 221727 235082 255381 244183 216494 230233 245494 256820 252404 259129 280240 290146
9803B90146j2728K2327L0929r530J2204q404j5496N880K802r158L2623j4763j1290
$$ 290146 277418 299745 330674 321144 333348 324944 309448 315328 318130 308972 341595 326832 315542
9790C15542k460J2957J2146J4394K3298j5248k56q108p64j8957J1485J050J3928
$$ 315542 313082 326039 338185 352579 375877 360629 360373 352265 351501 332544 344029 345079 359007
9777C59007J8118L7566J1012L532p905j860K2662o89r814j4546J7590J1504P55
$$ 359007 377125 414691 425703 429235 421330 419470 442132 441443 431629 417083 434673 446177 446932
9764D46932n160J3698O878M632J1855L2873L8321J2092m022J7190M2759L5965
$$ 446932 441772 455470 462348 466980 478835 511708 550029 562121 558099 575289 618048 654013
9752F54013L3242L339j4905J1933J4674O010Q788K133m484j439r060q026j3941
$$ 654013 687255 690594 675689 687622 702296 708306 717094 719227 714743 713304 704244 696218 682277
9739F82277j5897l2503q667K2590j461p524L2962r123P456o994l0114o602k6158
$$ 682277 666380 633877 625210 647800 646339 638815 671777 662654 670110 663116 633002 626400 600242
9726F00242l5926K726j0833j6944m7229m5947l2344k292m681k578J2776J6951
$$ 600242 564316 567042 556209 539265 492036 446089 413745 411453 406772 404194 416970 433921
9714D33921k8437n4712r010j2134p353K6285J6415k9766l0374k0880j8738J5125
$$ 433921 405484 350772 341762 329628 322275 348560 364975 335209 304835 283955 265217 280342
9702B80342m557m2178l5443N258k4753P69J5345J805L5390K7777J5542k2313j1962
$$ 280342 275785 233607 198164 203422 178669 179438 194783 196588 231978 259755 275297 252984 241022
9689B41022N320j484k7634p897m237j032L2598K1911k1160K857o732j4427R56
$$ 241022 246342 244858 217224 209327 205090 204058 236656 258567 237407 240264 233532 219105 220061
9676B20061k23l149N775k5947q875N08J101L231p714j4330j1534L4019L2060m20
$$ 220061 219838 216689 222464 196517 187642 188150 189251 192482 184768 170438 158904 192923 224983 224563
9662B24563Q366N3509j2355k8043J65K7621L0064K4000o950J5879K3814j566L5492
$$ 224563 232929 286438 274083 246040 246205 273826 303890 327890 320940 336819 360633 359067 394559
9649C94559M2046O1065O3227Q0855R3940J84196K68769M36857P17544P74251J50724
$$ 394559 436605 497670 560897 641752 735692 919888 1188657 1625514 2343058 3117309 3268033
9638C268033l08625m46493m78236l14505j83752p0906k0770J5347L8961p822k1467
$$ 3268033 2959408 2512915 2034679 1720174 1536422 1465516 1444746 1460093 1499054 1491232 1469765
9627A469765J2114M0242K3248L1634K2672l78n56K0794M3137R165M9947O1312
$$ 1469765 1481879 1522121 1545369 1577003 1599675 1599297 1598741 1619535 1662672 1671837 1721784 1783096
9615A783096N5692O3885O2406O5230M7202L4244J4450m399J767j2344l6245m5022
$$ 1783096 1838788 1902673 1965079 2030309 2077511 2111755 2126205 2121806 2123573 2111229 2074984 2029962
9603B029962q7226r8218p4806j13727j24441r5854j12945q7859j01462r1114r9996
$$ 2029962 1942736 1844518 1769712 1655985 1531544 1435690 1322745 1234886 1133424 1042310 942314
9592I42314r4571m0651k4858o5615m0646m1941k0227k2346l1434j2666o148M528
$$ 942314 847743 807092 782234 716619 675973 634032 613805 591459 560025 547359 541211 545739
9580E45739K0302J1417j0856n4940r178J5083q738j3314J2537K1981O650J4180
$$ 545739 566041 577458 566602 511662 502484 517567 508829 495515 508052 530033 536683 550863
9568E50863J7190k51N231l1189J5303L6148j3901k0646Q651J2774K4593K9583
$$ 550863 568053 567802 573033 541844 557147 593295 579394 558748 567399 580173 604766 634349
9556F34349j7077n286p513O176l595o926J9369P261J137O554O668l82L226K5450
$$ 634349 617272 611986 604473 610649 607054 600128 619497 626758 627895 634449 641117 640735 643961 669411
9542F69411K7468j7797k9085j1380j3498q363j8248J3573P972J712l3631J7987
$$ 669411 696879 679082 649997 638617 625119 616756 598508 612081 620053 621765 588134 606121
9530F06121K4145O212J5384j7638q244n892p359m570j8345k5588l2705j437l0000
$$ 606121 630266 636478 651862 634224 625980 620088 612729 608159 589814 564226 531521 530084 500084
9517E00084K1083J7530l7106M261J5692j6689l7140j2489O518N517m994l086L2274
$$ 500084 521167 538697 501591 505852 521544 504855 467715 455226 461744 467261 462267 459181 491455
9504D91455j2679K2504L025m7736l4066l1897K0743L0860L6149j2294P236K1438
$$ 491455 478776 501280 504305 456569 422503 390606 411349 442209 478358 466064 473300 494738
9492D94738J325K5375L5280O205J3556N3651K1042j968l498M5104P3521L4253
$$ 494738 496063 521438 556718 562923 576479 630130 651172 649204 645706 690810 764331 798584
9480G98584L0028N2540N7539Q1791P2230N3183O0893K5149K2094P0545Q0223O6016
$$ 798584 828612 881152 938691 1020482 1092712 1145895 1206788 1231937 1254031 1324576 1404799 1470815
9468A470815K8762O022n03K2841J4700R310K4133P968j2446l5518j6383P27R463
$$ 1470815 1499577 1505599 1505096 1527937 1542637 1551947 1576080 1584048 1571602 1536084 1519701 1520428 1529891
9455A529891r658o352l7157k5344q67Q058q179k4790k3577n3287m3166l6849p8973
$$ 1529891 1520233 1513881 1476724 1451380 1450513 1458571 1450392 1425602 1402025 1348738 1305572 1268723 1189750
9442A189750o7948p9896p3563p6979q9178m6389l3853n2117p9015p0205n9959
$$ 1189750 1121802 1041906 968343 891364 802186 755797 721944 669827 590812 520607 460648
9431D60648k9156l3888n5335l7449m893j6185l5552m1853j4656k622M363N067
$$ 460648 431492 397604 342269 304820 299927 283742 248190 206337 191681 189059 193422 198489
9419A98489J9776J7712L6374m745j6477K3181L6676L0497J2430P5034P4912K7897
$$ 198489 218265 235977 272351 267606 251129 274310 310986 341483 353913 428947 503859 531756
9407E31756n429K3595K0752J950l308K2062O1499M0780K2878N137M8954R4210
$$ 531756 526327 549922 570674 572624 569316 591378 652877 693657 716535 721672 770626 864836
9395H64836R7919Q5947N5155O2089O2724J05326R5731O3740N7517M0867M7090
$$ 864836 962755 1048702 1103857 1165946 1228670 1333996 1429727 1493467 1550984 1591851 1638941
9384A638941L9516M6165L7496q987j7145j0478K1379q211j2139m3610M142J6512
$$ 1638941 1678457 1724622 1762118 1753131 1735986 1725508 1746887 1738676 1726537 1682927 1687069 1703581
9372A703581n839k4841l4031j7586n082M062J0909J4000j222L238k243j1709k943
$$ 1703581 1697742 1672901 1638870 1621284 1616202 1620264 1631173 1645173 1643951 1647189 1644946 1633237 1630294
9359A630294o401Q852L3340K3195J8371M1899K9421K365J1566M0140Q148J6849
$$ 1630294 1623893 1632745 1666085 1689280 1707651 1749550 1778971 1781336 1792902 1833042 1841190 1858039
9347A858039P656J5306P642K4827L3199K8562K6105N8516K4061L0709Q0237O5507
$$ 1858039 1865695 1881001 1888643 1913470 1946669 1975231 2001336 2059852 2083913 2114622 2194859 2260366
9335B260366P4505O1783O1359O8327P4743R0588Q6499Q9118O7417J43104J29700
$$ 2260366 2334871 2396654 2458013 2526340 2601083 2691671 2778170 2867288 2934705 3077809 3207509
9324C207509J28930J54161J79754K23715K43129K58659L16185L62090L49837L40723
$$ 3207509 3336439 3490600 3670354 3894069 4137198 4395857 4712042 5074132 5423969 5764692
9314E764692L51014L76817L53104K85661K52540J94873J24144M1807J38q9266
$$ 5764692 6115706 6492523 6845627 7131288 7383828 7578701 7702845 7744652 7744790 7655524
9304G655524r4800q9329n7813m5808l2197Q858M1460R1327J27945J74313J69482
$$ 7655524 7560724 7471395 7413582 7367774 7335577 7344435 7385895 7477222 7605167 7779480 7948962
9293G948962J57199J24286P5784K9354l1451o5656j16074j57109k11595k52492
$$ 7948962 8106161 8230447 8306231 8335585 8304134 8238478 8122404 7965295 7753700 7501208
9283G501208k62433k19354k04794j61132j35579q8200q2317l8998k8825l56K2563
$$ 7501208 7238775 7019421 6814627 6653495 6517916 6429716 6347399 6308401 6279576 6279220 6301783
9272F301783O0535O8307J18968J37585J81748J91953J87394K15297L28110L36254
$$ 6301783 6362318 6430625 6549593 6687178 6868926 7060879 7248273 7463570 7791680 8127934
9262H127934L66390M52428N11579N60375O14297O89421P49878R05139R86277J105592
$$ 8127934 8494324 8946752 9458331 10018706 10633003 11322424 12072302 12977441 13963718 15069310
9252A5069310J256929J410350J613729J860589K160480K528942K909566L368063
$$ 15069310 16326239 17736589 19350318 21210907 23371387 25900329 28809895 32177958
9244C2177958L928389M578595N307625O106855P023874P987650Q948466R953752
$$ 32177958 36106347 40684942 45992567 52099422 59123296 67110946 76059412 86013164
9236H6013164J0863237J1737263J2518118J3148090J3593494J3799636J3755234
$$ 86013164 96876401 108613664 121131782 134279872 147873366 161673002 175428236
9229A75428236J3331839J2505904J1287356R651787P767548N777237L933973K409578
$$ 175428236 188760075 201265979 212553335 222205122 229972670 235749907 239683880 242093458
9221B42093458J337566P53115O59317J043996J898118L108118M681625O515538
$$ 242093458 243431024 244184139 244843456 245887452 247785570 250893688 255575313 262090851
9213B62090851Q508617J0611253J2612496J4427673J5766847J6403665J6075480
$$ 262090851 270599468 281210721 293823217 308250890 324017737 340421402 356496882
9206C56496882J4635838J2063249Q343726L762394j326174o469178j1270716j5421634
$$ 356496882 371132720 383195969 391539695 395302089 393975915 387506737 376236021 360814387
9198C60814387j8777652k1321781k3006895k3888767k4078425k3732425k2855117
$$ 360814387 342036735 320714954 297708059 273819292 249740867 226008442 203153325
9191B03153325k1570929j9977208j8180815j6326619j4497290j2737204j1100139
$$ 203153325 181582396 161605188 143424373 127097754 112600464 99863260 88763121
9184H8763121r686065q425937p304010o345610n499744m825126m224841l669084
$$ 88763121 79077056 70651119 63347109 57001499 51501755 46676629 42451788 38782704
9176C8782704l196425k833977k501282k185430j946465j699343j474600j270378
$$ 38782704 35586279 32752302 30251020 28065590 26119125 24419782 22945182 21674804
9168B1674804j095240r68460q53067p28007o36650n40646m54600l80553k91756
$$ 21674804 20579564 19611104 18758037 18030030 17393380 16852734 16398134 16017581 15725825
9159A5725825k29028j36199n8689K5104O9524J40369K38812K91600L19580L37968
$$ 15725825 15496797 15360598 15301909 15327013 15396537 15536906 15775718 16067318 16386898 16724866
9149A6724866L39024L80746L40383K73174K47061J60153M0122m3243r5717j32468
$$ 16724866 17063890 17444636 17785019 18058193 18305254 18465407 18505529 18462286 18366569 18234101
9139A8234101j88017k10537j57930j57255j41463r2995l6878Q202M2245P7285
$$ 18234101 18046084 17835547 17677617 17520362 17378899 17285904 17249026 17257228 17299473 17376758
9129A7376758J06749R0832Q7129P4729O728q6409j85792k37147l21906m16473
$$ 17376758 17483507 17574339 17661468 17736197 17742925 17656516 17470724 17233577 16911671 16495198
9119A6495198n17996n16913n14367n41390n48568n31278m51723m31117l86892
$$ 16495198 15977202 15460289 14945922 14404532 13855964 13324686 12872963 12441846 12054954
9110A2054954l09998k43010j75192j10584n9113P13M8184J42678K41174K97462
$$ 12054954 11744956 11501946 11326754 11216170 11157057 11157770 11205954 11348632 11589806 11887268
9100A1887268L40251M25724N18984O26041P13424Q28891R73736J115826J279429
$$ 11887268 12227519 12653243 13172227 13798268 14511692 15340583 16314319 17430145 18709574
9091A8709574J428495J664887J949908K257290K549393K953634L405017L915098
$$ 18709574 20138069 21802956 23752864 26010154 28559547 31513181 34918198 38833296
9083C8833296M521734N230499O004114O840743P797803Q802067R824128J0887073
$$ 38833296 43355030 48585529 54589643 61430386 69228189 78030256 87854384 98741457
9075I8741457J1883704J2720289J3424824J3857505J3978559J3641705J2831365
$$ 98741457 110625161 123345450 136770274 150627779 164606338 178248043 191079408
9068A91079408J1483718R625068P402443N057279K705318N64279j136255k318002
$$ 191079408 202563126 212188194 219590637 224647916 227353234 227917513 226781258 224463256
9060B24463256l039981l293856l117595k615351j841585r61134L8739J021178
$$ 224463256 221423275 218129419 215011824 212396473 210554888 209593754 209632493 210653671
9052B10653671J789609K290867K540681K404903J854640Q70741n19683k365707
$$ 210653671 212443280 214734147 217274828 219679731 221534371 222405112 221885429 219519722
9044B19519722m571489p048572r525920j1794855j3553611j4561399j4751054
$$ 219519722 214948233 207899661 198373741 186578886 173025275 158463876 143712822
9037A43712822j4315985j3408018j2160518j0807336r511790q295997p178680
$$ 143712822 129396837 115988819 103828301 93020965 83509175 75213178 68034498
9030F8034498o235306n482943m770700m185503l671660l172666k712784k335073
$$ 68034498 61799192 56316249 51545549 47360046 43688386 40515720 37802936 35467863
9022C5467863j975762j613637j252922r66089o57033l42838k5734K71734O12148
$$ 35467863 33492101 31878464 30625542 29659453 29002420 28659582 28633848 28905582 29517730
9013B9517730R55343J261183J606546J946502K313029K681419K963717L207208
$$ 29517730 30473073 31734256 33340802 35287304 37600333 40281752 43245469 46452677
9005D6452677L450419L560316L570591L509663L320588K988008K594621K167860
$$ 46452677 49903096 53463412 57034003 60543666 63864254 66852262 69446883 71614743
8997G1614743J721109J321913R91654Q12004P36779Q49580J137422J547628K038923
$$ 71614743 73335852 74657765 75649419 76461423 77198202 78047782 79185204 80732832 82771755
8988H2771755K541478L028303L448264L685408L712664L490967L026171K399875
$$ 82771755 85313233 88341536 91789800 95475208 99187872 102678839 105705010 108104885
8980A08104885J525730N50970l84132j302225k067413k680955l113970l350052
$$ 108104885 109630615 110181585 109797453 108495228 106427815 103746860 100632890 97282838
8972I7282838l413806l335895l158834k845419k488926k182062j971066j795875
$$ 97282838 93869032 90533137 87374303 84528884 82039958 79857896 77886830 76090955
8964G6090955j701149j723077j856476k026416k210493k446410k676121k871252
$$ 76090955 74389806 72666729 70810253 68783837 66573344 64126934 61450813 58579561
8956E8579561l008920l064869l082541l085619l094505k986070k896198k850971
$$ 58579561 55570641 52505772 49423231 46337612 43243107 40257037 37360839 34509868
8948C4509868k730888k542088k395039k277899k086720j880296j688082j560906
$$ 34509868 31778980 29236892 26841853 24563954 22477234 20596938 18908856 17347950
8940A7347950j407244j243561j093713r91421q67386p75678o92621o42282n83590
$$ 17347950 15940706 14697145 13603432 12612011 11744625 10968947 10276326 9634044 9050454
8931I050454n02816m33137l96698l66256l17456k85651k59503k46105k03442j59052
$$ 9050454 8547638 8114501 7717803 7351547 7034091 6748440 6488937 6242832 6039390 5880338
8921E880338j65958j36693j28909j04795r8868j10527j03503j15103j10950j00122
$$ 5880338 5714380 5577687 5448778 5343983 5245115 5134588 5031085 4915982 4805032 4704910
8911D704910r0293j05513j02747r3730q3387o5910m1745l2318j0952j1647l1955
$$ 4704910 4614617 4509104 4406357 4312627 4229240 4163330 4121585 4089267 4078315 4066668 4034713
8900D034713l4678l1225j0753l6949n2727q4224q6510o6244o5329q4016j22989
$$ 4034713 4000035 3968810 3958057 3921108 3868381 3784157 3697647 3631403 3566074 3482058 3359069
8889C359069j31122r0425q9928j04167p7442n0945k8911o1979p3576n4475l5027
$$ 3359069 3227947 3137522 3047594 2943427 2865985 2815040 2786129 2724150 2650574 2596099 2561072
8878B561072k5754k6308j2762J160m0317m6296k9412m8940m2797n3333q6482n2237
$$ 2561072 2535318 2509010 2496248 2497408 2457091 2410795 2381383 2332443 2289646 2236313 2149831 2097594
8866B097594m9112l8779j8998l8390n5783o5554n2161k3246J5556j728K022j4924
$$ 2097594 2048482 2009703 1990705 1952315 1896532 1830978 1778817 1755571 1771127 1769399 1771421 1756497
8854A756497J4640k334O789J8249J1236K4449L114k3204k708k2890k5579p871
$$ 1756497 1771137 1768803 1775592 1793841 1805077 1829526 1832640 1809436 1806728 1783838 1758259 1750388
8842A750388k1906k1131k2206l7466j0585J4798J3636J9770j6624j9108n228K4384
$$ 1750388 1728482 1707351 1685145 1647679 1637094 1651892 1665528 1685298 1668674 1649566 1644338 1668722
8830A668722K8000j157L7594O5471O5280L0916N2314N8736O9503K8461K0697J5293
$$ 1668722 1696722 1695565 1733159 1798630 1863910 1894826 1947140 2005876 2075379 2103840 2124537 2139830
8818B139830Q232p12J1134K8256N509j7630j8379k2677j360K1633M1794n008k1044
$$ 2139830 2148062 2147350 2158484 2186740 2192249 2174619 2156240 2133563 2132203 2153836 2195630 2190622 2169578
8805B169578K850N6760K4104J2913L3717M3837K0002R79K1108M8629L3944K8422
$$ 2169578 2172428 2229188 2253292 2266205 2299922 2343759 2363761 2364740 2385848 2434477 2468421 2496843
8793B496843O6408M1475J8954j5283L193j8191j8255k9453l2939l0931p9899q6852
$$ 2496843 2563251 2604726 2623680 2608397 2611590 2593399 2575144 2545691 2512752 2481821 2401922 2315070
8781B315070p1922j15948j18577r9396j25073j00734o6716m8190n9083p6341n5960
$$ 2315070 2243148 2127200 2008623 1909227 1784154 1683420 1616704 1568514 1509431 1433090 1377130
8770A377130n4288m4895l8840m3204l7703l9783j2522K789q615k7221o069n7015
$$ 1377130 1322842 1277947 1239107 1195903 1158200 1118417 1105895 1108684 1100069 1072848 1066779 1009764
8758A009764n3234j2630j251j2879j8916k9270r147J0960p62k1716o842J6037
$$ 1009764 956530 943900 942649 929770 910854 881584 872437 883397 882635 860919 854077 870114
8746H70114j2026q47N22N660j1879j9440l7804J0844L8553j2443k8040o909J440
$$ 870114 858088 857241 857763 863423 851544 832104 794300 805144 843697 831254 803214 796305 797745
8733G97745j1569Q481J963r298m539j3763j9556o897L886J8459J3558Q089k0789
$$ 797745 786176 794657 796620 787322 782783 769020 749464 742567 746453 764912 778470 786559 765770
8720G65770m3301j8530K855k5146J0451K7777J1150p571R932J1501o391l9125
$$ 765770 722469 703939 706794 681648 692099 719876 731026 723455 733387 744888 738497 699372
8708F99372j4614K382p268Q366j2428j0861J8197N693k4929j8261n326P835R055
$$ 699372 684758 687140 679872 688238 675810 664949 683146 688839 663910 645649 640323 648158 657213
8695F57213k8201J993K8031j135l603k3280K379J7947J340N8l384P206R664J0203
$$ 657213 629012 631005 659036 657901 654298 631018 633397 651344 652684 652742 649358 656564 666228 676431
8681F76431K0605M005J1968r291Q035K1793M4838P6264N6517N1811K4866N5413
$$ 676431 697036 701041 713009 703718 711753 733546 778384 854648 911165 962976 987842 1043255
8669A043255O6233P6887O2863L4936O7468L7889M0488N2302K7776K2060K8003
$$ 1043255 1109488 1186375 1249238 1284174 1351642 1389531 1430019 1482321 1510097 1532157 1560160
8658A560160R792J3932j5192J0482L165k8338j9474J0234J4659L208Q790k2285
$$ 1560160 1569952 1583884 1568692 1579174 1582339 1554001 1534527 1544761 1559420 1562628 1571418 1549133
8646A549133L1019P493l4852l3686J6491r771j4024j4352m9432m0975j4275p0619
$$ 1549133 1580152 1587645 1552793 1519107 1535598 1525827 1511803 1497451 1448019 1407044 1392769 1322150
8634A322150o8198n0991m2554n9483p9697o5415k6273k9460j8428r584o9805p2841
$$ 1322150 1253952 1202961 1160407 1100924 1021227 955812 929539 900079 881651 872067 802262 729421
8622G29421k0552Q456n897k2599j5401l7303j1268r981j8588k7275Q101q933J1113
$$ 729421 708869 717325 711428 688829 673428 636125 624857 614876 596288 569013 577114 568181 579294
8609E79294L6421K1910q253R777K4686L7617o663J2216J9475o486J5471l6879
$$ 579294 615715 637625 629372 639149 663835 701452 694789 707005 726480 719994 735465 698586
8597F98586j1924J3487J9802J2133K4905J7480l4923k0413J0138L4414L0683J9108
$$ 698586 686662 700149 719951 732084 756989 774469 739546 719133 729271 763685 794368 813476
8585H13476K2961K4376r928R459N865k1162k9560J1607J5196J3549L8769j4889
$$ 813476 836437 860813 850885 860344 866209 845047 815487 827094 842290 855839 894608 879719
8573H79719j9416j815p807n627j3773m501l0549j0339k66k3806j2991r362j3288
$$ 879719 860303 858488 850681 845054 831281 826780 796231 785892 785626 761820 748829 739467 726179
8560G26179r748j6527k2363l7230j9938n427j3388j8841n136J20q107m8854k1942
$$ 726179 716431 699904 677541 640311 620373 614946 601558 582717 577581 577701 569594 520740 498798
8547D98798J7132O034m2830r123k6871q256J2445j7588J053K5628j6532j0508
$$ 498798 515930 521964 479134 470011 443140 434884 447329 429741 430794 456422 439890 429382
8535D29382j6546k0373q037o595M465Q6R129j5292j7722L828o224k9823K727L6206
$$ 429382 412836 392463 384426 377831 382296 382382 391511 376219 358497 362325 356101 326278 329005 365211
8521C65211J6257j3752l1007j1741q434j755N295l443K4964l874k8860j1118M760
$$ 365211 381468 367716 336709 324968 316534 314779 320074 316631 341595 337721 308861 297743 302503
8508C02503j0102j1484O551l5734K6161J0074R597k853j2384J1143J8232J2528
$$ 302503 292401 280917 287468 251734 277895 287969 297566 294713 282329 293472 311704 324232
8496C24232K3093l2275l5865o199m821l869j821K9257M345k7833J950J9121j8623
$$ 324232 347325 315050 279185 272986 268165 264296 262475 291732 296077 268244 270194 289315 270692
8483B70692l0404R695j096j9445k2018J4340J1397J631J8103j7944j5578N1052
$$ 270692 240288 249983 248887 229442 207424 221764 233161 234792 252895 234951 219373 270425
8471B70425L3959O32J1038M935m6479j9041J7051k1474j2332j695j5129O733J3875
$$ 270425 304384 305016 316054 320989 274510 255469 272520 251046 238714 237019 221890 228623 242498
8458B42498P130p431J0361J1284J4349K2280j366j8545p339r85O851k0631j4264
$$ 242498 249628 242197 252558 263842 278191 300471 299105 280560 273221 272236 279087 258456 244192
8445B44192j3201J190R238k6698L120J7279o47j793J8210K5696J0312K175M79
$$ 244192 230991 232181 241419 214721 217841 235120 234473 232680 250890 276586 286898 289073 289552
8432B89552j8171j5266L427o081k2993J4404K928j01O276R257j6773J951j2792
$$ 289552 271381 256115 259542 253461 230468 244872 247800 247699 253975 263232 246459 248410 235618
8419B35618O691M714j7575j583k3536k260M2048j4404n32J2027J471j6644M379
$$ 235618 242309 247023 229448 227865 204329 202069 244117 229713 229181 241208 242679 226035 230414
8406B30414k310j1441k2401j8415K648J4310L2250L4129k4196n114k1114k0807
$$ 230414 228104 216663 194262 175847 178495 192805 225055 259184 234988 229874 208760 187953
8394A87953K3542K3422M448r174q369k682r52R819m633j9841j7483J6362J2522
$$ 187953 211495 234917 239365 230191 221822 219140 218188 228007 223374 203533 186050 202412 214934
8381B14934p883j9383k3520J6004M473n843R718Q514L2408r658j6674J0859j756
$$ 214934 207051 187668 164148 180152 184625 178782 188500 197014 229422 219764 203090 213949 212193
8368B12193j7242o581Q907J039j1927j1675J3653M160J3512n288j9298R446M991
$$ 212193 194951 188370 197277 198316 186389 174714 188367 192527 206039 200751 181453 190899 195890
8355A95890j4601p884K0606L3953m548J132j3439k0455j9587j4601l447m750J3791
$$ 195890 181289 173405 194011 227964 223416 224548 211109 190654 171067 156466 153019 148269 162060
8342A62060J8904L5370K0015k7949j6965r50q493J7377l333j5687J906J0244j8771
$$ 162060 180964 216334 236349 208400 191435 190485 181992 199369 196036 180349 182255 192499 173728
8329A73728n16R864k7783P625K3849J2530o15O500j0478n581k0370o843J3990
$$ 173728 173212 183076 155293 162918 186767 199297 198682 205182 194704 189123 168753 161910 175900
8316A75900J5473r73k7406j1846l565l2773J3718K2051J8741j0276N879k4987
$$ 175900 191373 190400 162994 151148 147583 114810 128528 150579 169320 159044 164923 139936
8304A39936J1010J8103L847q032j1305J8501j7543l430O489P188J603K514k534
$$ 139936 150946 169049 172896 164864 153559 172060 154517 151087 157576 164764 166367 168881 166347
8291A66347k3799r174J578P329r741p025J2547O944m112N736j2515Q398J0582
$$ 166347 142548 133374 134952 142281 132540 125515 138062 145006 140894 146630 134115 142513 153095
8278A53095p723n966R988J2268r124k5002k072Q08p629l58J5231n008L470L5741
$$ 153095 145372 139406 149394 161662 152538 127536 125464 126272 118643 118285 133516 128508 131978 167719
8264A67719o721l460k122j0318k1036r786P817J949K3127L948l5615L283L047
$$ 167719 160998 157538 155416 145098 124062 114276 122093 124042 147169 151117 115502 118785 121832
8251A21832o928K0826n070R205p552o700j0631J725J0128L5318j9680j2525K5452
$$ 121832 114904 135730 130660 139865 132313 125613 114982 116707 126835 162153 142473 129948 155400
8238A55400L0172j1767j9656l0943J0259L4333O434K584K521j0600q59M7p378
$$ 155400 185572 173805 154149 123206 133465 167798 174232 176816 179337 168737 167878 167925 160547
8225A60547l2989P408m114R5m79K294l002K0143K279k1358j762K3449j9000k8285
$$ 160547 127558 134966 130852 130947 130468 132762 129760 149903 152182 130824 129062 152511 133511 105226
8211A05226l7302K14N550K7162L740r486J7147j5339L71q848K5166M1955n728
$$ 105226 67924 68138 73688 100850 104590 95104 112251 96912 97283 88435 113601 155556 149828
8198A49828k4273J4712K1374j9509m3727j4832K2350J2293o325k3938K21K885
$$ 149828 125555 140267 161641 142132 98405 83573 105923 118216 111891 87953 88174 91059
8186I1059o29q505o911K1558M401L4668J9388j1404n658m736N370N546j6889j7532
$$ 91059 90430 81925 75014 96572 100973 135641 155029 143625 137967 133231 138601 144147 127258 109726
8172A09726J4245K6019j7074m1852R251N2929L174l5465J1448R364j0272K7903
$$ 109726 123971 149990 132916 91064 100315 153244 156418 120953 132401 141765 131493 159396
8160A59396p95O581l6813k9199k3253O6R786J8140K0095O616L299k0976p488k3949
$$ 159396 158601 165182 128369 99170 75917 75983 85769 103909 124004 130620 133919 112943 105455 81506
8146H1506J586p041j906M6153R462n166j9727j6602K3584J1083J3150M925K2810
$$ 81506 83092 76051 74145 120298 129760 124594 104867 88265 111849 122932 136082 141007 163817
8133A63817Q404n998j9527k3801n109J4811p522R94J4057q419j4666R50r61L321
$$ 163817 172221 166223 146696 122895 117786 132597 125075 126069 140126 131707 117041 117991 117030 120351
8119A20351M239j5329m131R921j2349M685l378L6957N532m0147j2544K4010K4397
$$ 120351 124590 109261 105130 115051 102702 107387 104009 140966 146498 106351 93807 117817 142214
8106A42214J1553k0328J073Q627r433l1139l04L303j8511p3J7887k6975k815J044
$$ 142214 153767 133439 134512 143139 133706 102567 102263 105566 87055 86982 104869 77894 75079 76123
8092G6123K1271Q86M2368P720j3462k0594j7428j4090L818K1105j0972m405O695
$$ 76123 97394 98280 140648 148368 134906 114312 96884 82794 86612 107717 96745 92340 99035
8079I9035O508J6036J2934n01o796j7481n784J6608l456k1830k489l38j4456J7531
$$ 99035 105543 121579 134513 134012 127216 109735 103951 120559 117103 95273 92784 92446 77990 95521
8065I5521J0349J2587k3186l5987K253K9732L6071k3987k8413k2579P943J4756
$$ 95521 105870 118457 95271 59284 61537 91269 127340 103353 74940 52361 60304 75060
8053G5060J1142J3459J5239l97k0640j9681k133J4065P256J5283j2948k4943R822
$$ 75060 86202 99661 114900 114503 93863 74182 72049 86114 93370 108653 95705 70762 80584
8040H0584M775K964K1376L538q290j9401N226r20p604J0110j7037J717J8797k119
$$ 80584 85359 88323 109699 113237 104947 85546 90772 89852 82248 92358 75321 77038 95835 93716
8026I3716n450J4962j0437N395k52l330J0028k0988N83J0694R671j06k304j2888
$$ 93716 88266 103228 92791 98186 97934 94604 104632 83644 84227 94921 104592 104486 102182 89294
8012H9294L23M540p157K3J7495k9219k7119Q463J8174J6606J441j2306M489N666
$$ 89294 89617 94157 87000 87023 104518 75299 48180 56643 74817 91423 92864 80558 85047 90713
7998I0713q525p064K222J3751N16j4077j7218n715J3783J536j6297O746J3361
$$ 90713 82188 75124 77346 91097 91613 77536 60318 54603 68386 69922 53625 60371 73732
7985G3732P831M660K0521K9099q552l0450o301K784j2891Q221j9474L131J3074
$$ 73732 81563 86223 106744 135843 127291 96841 90540 93324 80433 88654 69180 72311 85385
7972H5385L6758p560j3054l4306M938N3001K708m4646k2258q844K1076J3541J7352
$$ 85385 122143 114583 101529 67223 72161 125162 127870 83224 60966 52122 73198 86739 104091
7959A04091k0413l7984j4912K256L0048J9599j2756j7303k0634K49K3984J1916
$$ 104091 83678 45694 30782 33038 63086 82685 69929 52626 31992 32241 56225 68141
7947F8141J1133m133j7045O159J5417O646L283j2592j2510O413j1162J0124K5325
$$ 68141 79274 75141 58096 64255 79672 86318 89601 77009 64499 70912 59750 69874 95199
7934I5199j0029j3468J0222j1654o134j2493j0J5651K5463K735p861j6108K5390
$$ 95199 85170 71702 81924 70270 64136 51643 51633 67284 92747 95482 87621 71513 96903
7921I6903J0288J093j7302J064K824L545J666j6651l623M650o89l506K3041k907
$$ 96903 107191 108284 90982 92046 94870 98415 100081 83430 79807 84457 83768 80262 103303 100396
7907A00396J5297p494k1350k2515N917j1352k2167J381K1949L239j1452N676P887
$$ 100396 115693 108199 86849 64334 70251 58899 36732 38113 60062 63301 51849 57525 65412
7894F5412J6872pn644J313r728K075L600q0J7971J2633k7618k4041m705j2237
$$ 65412 82284 82277 76633 77946 68218 70293 73893 73813 91784 104417 76799 52758 48053 35816
7880C5816k5452L1288K2635P797J2840k4911l5934j209L474j3985k758K9575K236
$$ 35816 10364 41652 64287 72084 84924 60013 24079 22870 26344 12359 9601 39176 41412
7867D1412L873K5131l603j2048J0890K0207N60P167Q82m7155j1920K7591J0972
$$ 41412 45285 70416 66813 54765 65655 85862 86422 93589 94471 47316 35396 62987 73959
7854G3959r013L081N786k9454J5136j4045k6430M90J2296K738J9855R101j7197
$$ 73959 64946 68027 73813 44359 59495 45450 19020 19510 31806 34544 54399 63500 46303
7841D6303M866K173K0318P01j7871j962J1742K1571Q078J034j6632o379k310l5785
$$ 46303 51169 53342 73660 74361 56490 54528 66270 87841 95919 96953 80321 73942 71632 35847
7827C5847m15R035L7903K1465k1417j2770K4605o561j8250J802K1663l713k6448
$$ 35847 35432 44467 82370 103835 82418 69648 94253 87692 69442 71244 92907 89194 62746
7814F2746j7471M277K1596K4528j9825j3563K3873J825l7093N482J2573K540R74
$$ 62746 45275 49552 71148 95676 75851 62288 86161 87986 50893 56375 68948 71488 72462
7801G2462k2144m5882l4570R209L1201K999J2220J989j1010j5878K3722K0243
$$ 72462 50318 4436 -30134 -20925 10276 13275 25495 27484 16474 596 24318 44561
7789D4561K4611j6175j1444L6793K4379l2675k2268Q19o539q810L2366J482L326
$$ 44561 69172 52997 41553 78346 102725 70050 47782 48601 42062 33252 65618 67100 70426
7776G0426O036m6753P53K1860M7559J502k8398j7099J3801J1861k7429j4638L0302
$$ 70426 76462 29709 30462 52322 99881 101383 72985 55886 69687 81548 54119 39481 69783
7763F9783K1884l571k7164k479j4247k3891j383J2290k981M381k296k3956q260
$$ 69783 91667 88096 60932 58453 44206 20315 18932 31222 28241 32622 30326 6370 -1890
7750a890K4010K4336J8654L228k4935J713K0303k454J6933Q269m601l4255j3336
$$ -1890 22120 46456 65110 68338 43403 45116 65419 62965 79898 88167 83566 49311 35975
7737C5975k3314Q449K2553J1809L199j5955k9692j0123M4714Q914m049o525L371
$$ 35975 12661 21110 43663 55472 58671 42716 13024 2901 47615 56529 52480 45955 49326
7724D9326l462l8372Q68K5847J6198l520K5268p247p523P008p785r579l993O272
$$ 49326 45864 7492 8360 34207 50405 46885 72153 64906 57383 64391 56606 47027 43034 49306
7710D9306J4658O07j4520p09k9062k0949K7024L3357K1157k352J1930p745k9983
$$ 49306 63964 64571 50051 49342 20280 -669 26355 59712 80869 78517 90447 82702 52719
7697E2719j4830L1808K6644j5447j084l675j8949J6070O656k6969m946j512O750
$$ 52719 37889 69697 96341 80894 79810 76135 57186 73256 79912 52943 47997 46485 53235
7684E3235j2425r7L2K0682J3880p580j0988j7964k0299k4530J3553l463M120L4930
$$ 53235 40810 40713 40745 61427 75307 67727 56739 38775 18476 -6054 7499 4036 8156 43086
7670D3086K9433M496J2080J0456j3579l3519J60K9334J5690k2583J3595J7294
$$ 43086 72519 77015 89095 99551 85972 52453 52613 81947 97637 75054 88649 105943
7658A05943j1265j9736k689L0211j3580k1896k2j5224k7308J3025J4234k3435
$$ 105943 94678 74942 72253 102464 88884 66988 66966 51742 24434 37459 51693 28258
7646B8258K7921K1983l643j559k7614j3064J7263o093J5121J1038p755p898L6768
$$ 28258 56179 78162 74519 72960 45346 32282 49545 43452 58573 69611 61856 53958 90726
7633I0726K867K214L983L152P086j1635n2044J31Q628p604J4373L0314J2019j520
$$ 90726 93593 95807 99790 102942 110028 98393 46349 46480 55108 47504 61877 92191 104210 102690
7619A02690j9773k5712j7214m837J3961m086Q180K1090J6044P769l763k2426j7759
$$ 102690 82917 57205 39991 35154 49115 45029 53209 74299 90343 98112 94349 71923 54164
7606E4164j1944L1648l976n0316m675j9552J5975K6291Q846k105L557J2700K146
$$ 54164 42220 73868 69892 19576 14901 -4651 11324 37615 46461 44356 47913 60613 62759
7593F2759r229j4565J946J5609o752l983n914r174N568K9107Q816r331J6563L1495
$$ 62759 53530 38965 40911 56520 49768 45785 39871 30697 36265 65372 74188 64857 81420 112915
7579A12915j8263n2802j4099M1786j6301m555j8207K2369L58j2771k0347r996
$$ 112915 94652 41850 27751 69537 53236 48681 30474 52843 53201 40430 20083 10087
7567A0087o59K0362J4302K831k4415k3527P018M202K3518K9799J5688j5519j8689
$$ 10087 9428 29790 44092 46923 22508 -1019 5999 10201 33719 63518 79206 63687 44998
7554D4998k5935J0617P836Q892j0435j5792q132o319k7852k2096K1939K7705M998
$$ 44998 19063 29680 37516 46408 35973 20181 12049 5730 -22122 -44218 -22279 5426 10424
7541A0424p810j0732L3260K375n231p732K4398K0283r14k652n357o402K091l281
$$ 10424 2614 -8118 25142 27517 22286 14554 38952 59235 58321 55669 50312 43910 46001 42720
7527D2720J3889J6743R820j0996k2329j2671J2701K0921j3277l113r117L473n126
$$ 42720 56609 73352 83172 72176 49847 37176 49877 70798 57521 54408 45291 48764 43638
7514D3638J6195J9627k021J3602Q72l0545l0255J8012m359j6614l800L96j5190
$$ 43638 59833 79460 77439 91041 91913 61368 31113 49125 44766 28152 24352 24748 9558
7501I558J6712R085k4586k188J3730J0085L3413n396j331q701m610j8685J3009
$$ 9558 26270 35355 10769 8581 22311 32396 65809 60413 59082 50381 45771 27086 40095
7488D0095j1491o88K6594K2104k3277l810p032j2370Q417J9290R321n720k0218
$$ 40095 28604 27916 54510 76614 53337 49527 42495 30125 38542 57832 67153 61433 41215
7475D1215r487J339J4210J5360j0734r543k8910Q73R002j60k7457j4403L4520
$$ 41215 31728 33067 47277 62637 51903 42360 13450 14323 23325 23165 -4292 -18695 15825
7462A5825K6271o07k3514j0765K2141K4969J0537k4710l1879j6423K1565O665
$$ 15825 42096 41489 17975 7210 29351 54320 64857 40147 8268 -8155 13410 20075
7450B0075J1545K9007m97j2406l769j0403k4991N27r167j081J9355J8870r187
$$ 20075 31620 60627 60130 47724 43955 33552 8561 9088 -79 -1160 18195 37065 27878
7437B7878k3128k1139M185L0917J7391O806L0344J0826k8209n416j0983k0536
$$ 27878 4750 -16389 -12204 18713 36104 42910 73254 84080 55871 50455 39472 18936
7425A8936j760J7248J1665J1958p094o560L179N008Q302k6506k1329n987N135
$$ 18936 17176 34424 46089 58047 50953 44393 47572 52580 60882 34376 13047 7060 12195
7412A2195j3897m336L7446L5725M812P057o334k3508j3425K227q76J9496j0186
$$ 12195 -1702 -6038 31408 67133 71945 79002 72668 49160 35735 37962 37086 56582 46396
7399D6396J1026o322J0942J3891j5560J0619L0732J2443k9806n0064k866j532
$$ 46396 57422 51100 62042 75933 60373 70992 101724 114167 84361 34297 31431 29899
7387B9899L223R473Q198J5968K0406J354m8336J098M338o123j500K486m429Q674
$$ 29899 33122 42595 50793 66761 87167 88521 40185 41283 45621 39498 37998 40484 36055 44729
7373D4729M7425r816J272j7903q978J358j8111J2043p594l410J183P138k310j5907
$$ 44729 92154 82338 83610 65707 56729 58087 39976 52019 44425 41015 42198 49336 47026 31119
7359C1119j4868l616k166O119J3288r547n759L815j4515Q980J4239j2496j6572
$$ 31119 16251 12635 10469 16588 29876 20329 14570 18385 3870 12850 27089 14593 -1979
7346a979k682J5471K6455J5229j5118p302J4249m1670j3935L0322K0939K395j9246
$$ -1979 -4661 10810 37265 52494 37376 30074 44323 2653 -11282 19040 39979 42374 23128
7333B3128j2403n890p134J1460J751j8764J3967L6672K5026j9023n590J4649J4905
$$ 23128 10725 4835 -2299 9161 10912 -7852 6115 42787 67813 48790 43200 57849 72754
7320G2754O172j1592l1064j0357m312p240J4902K2744M848r40J2969K8366o80
$$ 72754 78926 67334 36270 25913 21601 14361 29263 52007 56855 55915 68884 97250 96570
7307I6570j6661l0082Q821k8749j1043J7148J9803M596K208j9897M602j0503p788
$$ 96570 79909 49827 58648 29899 18856 36004 55807 60403 62611 42714 47316 36813 29025
7294B9025j6273m140J9217j3078j8437J0931M592J0971K0814L8759r822j8269
$$ 29025 12752 8612 27829 14751 -3686 7245 11837 22808 43622 82381 72559 54290
7282E4290j3420j244J6480K0819J0078n042m2429o3954j5649J9390K5225L9501
$$ 54290 40870 39626 56106 76925 87003 81961 39532 -24422 -40071 -20681 4544 44045
7270D4045p02l435O798j9237l95J5767J0313m745k8017J1657M3481L79k1484M073
$$ 44045 43343 39908 46706 27469 27074 42841 53154 48409 20392 32049 75530 75909 54425 58498
7256E8498l699k3179k257j1965l033k9014J6997l453J3042j742J0712K0471O487
$$ 58498 54799 31620 29363 17398 14365 -14649 2348 -1105 11937 10195 20907 41378 47865
7243D7865N674k6983k593J5199K4747K3985M036l3481j8430R430J5496k4254l3377
$$ 47865 53539 26556 23963 39162 63909 87894 91930 58449 40019 49449 64945 40691 7314
7230G314o107l95N87J377M967l279j468L785M184N95J1026k538r463R835o098
$$ 7314 1207 812 1399 2776 7743 4464 2996 6781 10965 11560 22586 20048 10585 20420 14322
7215A4322K5051K1940j0845l5882l4577p690J7987K6579O612O735q930q795L176
$$ 14322 39373 61313 50468 14586 -19991 -27681 -9694 16885 23497 30232 21302 12507 15683
7202A5683m126J3955J2255J526M226l2257j2526m801K2086Q929k3409N703K7057
$$ 15683 11557 25512 37767 39293 43519 11262 -1264 -6065 16021 24950 1541 7244 34301
7189C4301K6814O082l3160o890J2900Q767r696j5995N942j1763j7701K3432K3486
$$ 34301 61115 67197 34037 27147 40047 48814 39118 23123 29065 17302 -399 23033 46519
7176D6519k3623N857J6076O730n04J8356J7500j1794l4203j9777J3370R740n668
$$ 46519 22896 28753 44829 51559 51055 69411 86911 75117 40914 21137 34507 44247 38579
7163C8579n799K225J3159l1632k2430j4977R790J7553P457r033K1999L4440J763
$$ 38579 32780 35005 48164 16532 -5898 -20875 -11085 6468 13925 4892 26891 61331 63094
7150F3094M344j7857j5909j7229N179J0845j8002N420l5513r126K9466L2346r775
$$ 63094 67438 49581 33672 16443 21622 32467 14465 19885 -15628 -24754 4712 37058 27283
7137B7283N523J2475J8255q970n8809j5686j8687L2632K7214R689m272P894J1097
$$ 27283 32806 45281 63536 54566 -4243 -19929 -38616 -5984 21230 30919 26647 34541 45638
7124D5638n067k0150p146L370J1080j4583k1126l109J3238l687R993K0633j8141
$$ 45638 40571 20421 13275 16645 27725 13142 -7984 -11093 2145 -1542 8451 29084 10943
7111A0943l515J3029l072j4883J5668J2861Q037j0211N828j0983K4213N503n975
$$ 10943 7428 20457 17385 2502 18170 31031 39068 28857 34685 23702 47915 53418 47443
7098D7443p09j1966J4663K2377J2192m913l0215j6292l6154j0301K2759K9144
$$ 47443 46734 34768 49431 71808 84000 79087 48872 32580 -3574 -13875 8884 38028
7086C8028N942j7151k0539j0374J3275L555k1152l566N0175M906j3389q327r956
$$ 38028 43970 26819 6280 -4094 9181 12736 -8416 -11982 38193 43099 29710 21383 11427
7073A1427J7115J9568j4782l6802j8596M4609K5652q05m607p296k5956p972N022
$$ 11427 28542 48110 33328 -3474 -22070 22539 48191 47386 42779 35483 9527 1555 6577
7060F577J6333r38p87J36k2324P065L5428K2237k4894r7K1006M046k1718k1731
$$ 6577 22910 21972 21185 21321 -1003 6062 41490 63727 38833 38736 59742 63788 42070 20339
7046B0339q732o086j4402J3801J5236j3240Q278j932J1278J3389j7930k562R248
$$ 20339 11607 5521 -8881 4920 20156 6916 15194 13262 24540 37929 19999 17437 26685
7033B6685K9819Q649j6569k3901j7185k499j7291J6058J7135j4228j8833L152
$$ 26685 56504 65153 48584 24683 7498 4999 -12292 3766 20901 6673 -12160 -9008
7021i008J5760P739L77p033q503M0624J6465l2253r039j1917N791l0517j0759
$$ -9008 6752 14491 14868 7835 -668 39956 56421 24168 15129 3212 9003 -21514 -32273
7008c2273q922j8939Q23K3305J2496m992J6093j838l451j3020J552J2808O739
$$ -32273 -41195 -60134 -59311 -36006 -23510 -28502 -12409 -14247 -17698 -30718 -29166 -16358 -9619
6995i619K9323R216N47J3344O25k784k4114m0914p809O623J8362l296L835L2046
$$ -9619 19704 28920 29467 42811 43436 40652 16538 -24376 -32185 -25562 -7200 -10496 -6661 25385
6981B5385J4004q483J4533K0887j0701j6164j4812p562j4099n98n829K658r890
$$ 25385 39389 30906 45439 66326 55625 39461 24649 17087 2988 2390 -3439 -781 -10671
6968a0671J3149P759K3471j1551l8125K358L027N94k2179O753J8856Q376M330
$$ -10671 2478 10237 33708 22157 -15968 -13610 -10583 -9989 -32168 -25415 -6559 1817 6147
6955F147L9231J2977o319r330k5377j2729R946N20l438J0537O401Q320K211J6741
$$ 6147 45378 58355 52036 42706 17329 4600 14546 15066 11628 22165 28566 36886 39097 55838
6941E5838l435l1497l1676j0022l402K0602K0530J8122k397J3468L7812l2921
$$ 55838 52403 20906 -10770 -20792 -24194 -3592 16938 35060 32663 46131 83943 51022
6929E1022k6549r340m4234N48J5081J3049K8240K4264p17k6889j8531L4357J8632
$$ 51022 24473 15133 -29101 -28553 -13472 -423 27817 52081 51364 24475 5944 40301 58933
6916E8933M21l6366r134k1867r090q348J8091J810m165r985J6718R997R84l2435
$$ 58933 59354 22988 13854 -8013 -17103 -25451 -7360 -5550 -9715 -19700 -2982 7015 7999 -24436
6902b4436j2271J3862l1077K563O112J7079R775j080Q121J3062N248J7173K552
$$ -24436 -36707 -22845 -53922 -51359 -45247 -28168 -18393 -19473 -11352 1710 6958 24131 26683
6889B6683q510P8j0182J0373J4503j1288j2447j7723K1046k429K148N119j8346
$$ 26683 18173 18251 8069 18442 32945 21657 9210 -8513 12533 10104 12252 17371 -975
6876i75m879J1790J9549l299j5708M852L248j0039j2049Q175O270k8346k3341
$$ -975 -5854 5936 25485 22186 6478 11330 14578 4539 -7510 665 6935 -21411 -44752
6863d4752K2770K9497L6921O845l0302k6924Q200Q660K0475L2999o406l1347j5053
$$ -44752 -21982 7515 44436 51281 20979 -5945 2255 10915 31390 64389 57983 26636 11583
6850A1583J4611o273j4353q359L8228J9884m379j3608K0822K986j221j924k4579
$$ 11583 26194 19921 5568 -2791 35437 55321 50942 37334 58156 61142 59921 57997 33418
6837C3418k8884k579J6045K869J8699O871K7780j6482k2208J79q371k0848J1505
$$ 33418 4534 1955 18000 20869 39568 46439 74219 57737 35529 35708 27337 6489 17994
6824A7994J2195j471q086M027K1665k4939k1673J2920j80j411k494L148j8594
$$ 17994 30189 28718 20632 24659 46324 21385 -288 12632 12452 11041 8547 11695 -6899
6811f899m278J8363J7826M988j8796j2888l967M221J8228L9315j383O01j1319
$$ -6899 -11177 7186 25012 30000 11204 -1684 -5651 -1430 16798 56113 54730 55331 44012
6798D4012j868J3498J1904j9505k2134j5485o819J0019k1990o552R06L4554J7367
$$ 44012 42144 55642 67546 48041 25907 10422 3603 13622 -8368 -14920 -14014 20540 37907
6785C7907r019j550O233k2278K642n130o187J911J0590L544j3422l268Q435m843
$$ 37907 28888 27338 33571 11293 13935 8805 2618 4529 15119 18663 5241 1973 10408 5565
6771E565J0596o87k6570k1990N795K8818M192K4525K3986p26R873m3624n5000
$$ 5565 16161 15474 -11096 -33086 -27291 1527 5719 30244 54230 53504 63377 19753 -35247
6758c5247L5168K5687J2244m347L128m602L933J0121n781k7275j1516j1458j2365
$$ -35247 -79 25608 37852 33505 36633 32031 35964 46085 40304 13029 1513 -9945 -22310
6745b2310M142K2570J4010k4630j543M999J6214J3872q188P116J6003j0724J3575
$$ -22310 -18168 4402 18412 -6218 -7761 -2762 13452 27324 19136 26252 42255 31531 45106
6732D5106M5m265j1191j3151J4543m744r141k8129J832O927r648q316J5832J4221
$$ 45106 45151 40886 29695 16544 31087 26343 17202 -10927 -9095 -2168 -11816 -20132 -4300 9921
6718I921j1548p207K9960o225j1769N262P805Q945N709l1147k2126j0951m848
$$ 9921 -1627 -8834 21126 14901 3132 8394 16199 25144 30853 -294 -22420 -33371 -38219
6705c8219Q727K0458P185j2982m977O553r816J1137r569p409K0007M432r169n452
$$ -38219 -29492 -9034 -1849 -14831 -19808 -13255 -23071 -11934 -21503 -28912 -8905 -4473 -13642 -19094
6691a9094K2953q899M500O863M608L8879n84j3380j2543r441j4771K2274J8963
$$ -19094 3859 -5040 -540 6323 10931 49810 49226 35846 23303 13862 -909 21365 40328
6678D0328j8610p43p740l279j0906K109O597M520L2970k1989j8837K668j6495
$$ 40328 21718 20975 13235 9956 -950 1159 7756 12276 45246 23257 4420 7088 -9407
6665i407p658N10J0018K4857m293O239j702l675J7523L7590k3118j6146J615J50
$$ -9407 -17065 -16555 -6537 18320 14027 20266 18564 14889 32412 70002 46884 30738 32353 32503
6651C2503j7180O405J3185n69O672K7618q042k789j5510r992k0890J0310J0355
$$ 32503 15323 21728 34913 34344 41016 68634 60592 57803 42293 32301 11411 21721 32076
6638C2076k0162M875K0437j0423l0528k8551K4280L0331o112j1669R085J7362
$$ 32076 11914 16789 37226 26803 -3725 -32276 -7996 22335 16223 4554 13639 31001
6626C1001J816k0609k23j1536L777K2430L322k5265l737K7207j6048j0565l888
$$ 31001 32817 12208 11985 449 4226 26656 29978 4713 976 28183 12135 1570 -2318
6613b318L023N406K4163k2025j2433K0866K755j4536r525J1129l640J5840K0269
$$ -2318 705 6111 30274 8249 -4184 16682 19437 4901 -4624 6505 2865 18705 38974
6600C8974K190j9955R239L0496m07k1662k4114k494J8582j2373R688J4413L42
$$ 38974 41164 21209 30448 60944 60537 38875 14761 12267 30849 18476 28164 42577 42919
6587D2919l7919k1811n865K9407K3035k078k3786o851K6677K5821j3413k1751
$$ 42919 5000 -16811 -22676 6731 29766 27688 3902 -2949 23728 49549 36136 14385
6575A4385j3832j8192l980K49L2247L1145O647l04j1828j1626p332O115M369j7156
$$ 14385 553 -17639 -21619 -21370 10877 42022 48669 48365 36537 24911 17579 23694 28063 10907
6561A0907j6391p57j0966k335j483o335J4506K8484j970m2242j0637J5591K3414
$$ 10907 -5484 -6241 -17207 -19542 -21025 -27360 -12854 15630 13660 -28582 -39219 -23628 -214
6548b14J2357K3078k6031r671p399j3058O247K1067p84q60l452j3804j2728r417
$$ -214 12143 35221 9190 -481 -7880 -20938 -14691 6376 5592 4732 1280 -12524 -25252 -34669
6534c4669K3691k0422j3222O73o391j0572N828L4421P079r156K0844O574k2542
$$ -34669 -10978 -31400 -44622 -43949 -50340 -60912 -55084 -20663 -13584 -22740 -1896 4678 -17864
6521a7864o351L9394K9663p223j8570k2762r266q270j4503J5291J5118K2288M547
$$ -17864 -24215 15179 44842 37619 19049 -3713 -12979 -21249 -35752 -20461 -5343 16945 21492
6508B1492j1260J374J514k304j4163j3769J0658k2574J4793K721J6356J6210K9658
$$ 21492 10232 11606 13120 10816 -3347 -17116 -6458 -29032 -14239 -11518 4838 21048 50706
6495E0706n667o051N703k8211j1424j6406n531M766K1338k84k3387r114K167j5306
$$ 50706 45039 38988 44691 16480 5056 -11350 -16881 -12115 9223 8939 -14448 -23562 -21395 -36701
6481c6701O978L9392R392J831K8939M886j1489j6731Q207k0882j5796j4855o852
$$ -36701 -29723 9669 19061 20892 49831 54717 43228 26497 34704 13822 -1974 -16829 -23681
6468b3681J2395J4900K1381J3753l3046l6066J2893j2190O401J9901K1004J6242
$$ -23681 -11286 3614 24995 38748 5702 -30364 -17471 -29661 -23260 -3359 17645 33887
6456C3887J3558O855k8219m3330j7871l583j5612J6465M1016o138j7735o957Q009
$$ 33887 47445 54300 26081 -17249 -35120 -38703 -54315 -37850 3166 -2972 -20707 -27664 -19655
6443a9655J4136J6069n414J3614J4365J3844J1833r669O796P538N237j1548k2427
$$ -19655 -5519 10550 5136 18750 33115 46959 58792 49123 55919 63457 68694 57146 34719
6430C4719j3939j6529J2777K7530l5505j3866m868K1372J2747J4342J262l8603
$$ 34719 20780 4251 17028 44558 9053 -4813 -9681 11691 24438 38780 40042 1439
6418A439k8720j041J8358j1388J7340J1157j3031J5187K0247Q835l4574r428P474
$$ 1439 -27281 -28322 -9964 -21352 -4012 7145 -5886 9301 29548 38383 3809 -5619 1855
6405A855j0548j6533n211j2584j8120K1471M6383J7945J2170P405k4768k9622
$$ 1855 -8693 -25226 -30437 -43021 -61141 -39670 6713 24658 36828 44233 19465 -10157
6393a0157j2174p360Q828L4376k3957m4079j3444J5079R66O186k1528J3K6487
$$ -10157 -22331 -29691 -20863 13513 -10444 -54523 -67967 -52888 -51922 -45736 -67264 -67251 -40764
6380d0764K2551L054m213Q274J7918J0647l205j612K3260L148k8560O94J3816
$$ -40764 -18213 -15159 -19372 -11098 6820 17467 14262 12650 35910 39058 10498 11192 25008
6367B5008o973M68Q104j365L883l090J360J2535K6695j5086l4795n21K666j778
$$ 25008 18035 18503 26607 25242 29125 26035 27395 39930 66625 51539 16744 16223 18889 17111
6353A7111j1625J4323L873k0672P153J0839n24k7355k6418M192J8712K2289o274
$$ 17111 5486 19809 23682 3010 10163 21002 20478 -6877 -33295 -29103 -10391 11898 5624
6340E624m430p989J5019l854L904K595J1263J0750p531j9455q206M1614j140k2334
$$ 5624 1194 -6795 8224 4370 8274 10869 22132 32882 25351 5896 -2310 39304 38164 15830
6326A5830J3019r316K716k7366j6281k632J7809L0851J3379j1625O698J8450r730
$$ 15830 28849 19533 22249 -5117 -21398 -24030 -6221 24630 38009 26384 33082 51532 41802
6313D1802l2915r386m637j1186J0181j5937J0860J5426K5892N21p476j4829k2386
$$ 41802 8887 -499 -5136 -16322 -6141 -22078 -11218 4208 30100 30621 23145 8316 -14070
6300a4070r944K5344o745j8683K0671J8374N3914n544l3702r660q013j4846J0430
$$ -14070 -24014 1330 -5415 -24098 -3427 14947 68861 63317 29615 19955 11942 -2904 7526
6287G526J0032p369m134K6378K235l8145k2683J7035N935j6245j0331K4705K5753
$$ 7526 17558 10189 6055 32433 34668 -3477 -26160 -9125 -3190 -19435 -29766 -5061 20692
6274B0692q163j2188J4441J513K2128K7680n2222l5185L9982Q613J731p19k2578
$$ 20692 12529 341 14782 16295 38423 66103 13881 -21304 18678 27291 29022 28303 5725
6261E725j7669j6637J3890J578J6347j6053j2961J3976r740J9499L777L58j6974
$$ 5725 -11944 -28581 -14691 -13113 3234 -12819 -25780 -11804 -21544 -2045 1732 2090 -14884
6248a4884k0795Q827Q444j5180R033J4450L67m059J6919j7972K509J4007K371
$$ -14884 -35679 -26852 -18408 -33588 -24555 -10105 -9738 -13797 3122 -14850 -12341 1666 4037
6235D037r092P973o758j2749N231J4586K915j4842k6843J3675J9850j3172l3839
$$ 4037 -5055 2918 -3840 -16589 -11358 3228 6143 -8699 -35542 -21867 -2017 -15189 -49028
6222d9028J0612J7502K759J586j2261j7600n230K4191J4835p789K1558J2783j7982
$$ -49028 -38416 -20914 -18155 -16569 -28830 -46430 -51660 -27469 -12634 -20423 1135 13918 -4064
6209d064J922K0031j1587J174O736k217j1576l1216K3816K8711o518J4824J866
$$ -4064 -2142 17889 6302 7476 14212 11995 419 -30797 -6981 21730 15212 30036 31902
6196C1902r570j0286j6431J458L1603K1855j7027l923j1885l1595j2300P880K0374
$$ 31902 22332 12046 -4385 -2927 28676 50531 33504 29581 17696 -13899 -26199 -18319 2055
6183B055p970j9927J6223J5377M347R862J1502J2171k4527J2145J867P955k0335
$$ 2055 -5915 -25842 -9619 5758 10105 19967 31469 43640 19113 31258 33125 41080 20745
6170B0745J9743j9325j2274K0544R364P257r934r595m962j4456J3695n45j6044
$$ 20745 40488 21163 8889 29433 38797 46054 36120 26525 21563 7107 20802 20257 4213
6157D213J1856K8210J7341l0987j2599j6679j3961J260J3202j8153L666j2468
$$ 4213 16069 44279 61620 30633 18034 1355 -12606 -11346 1856 -16297 -12631 -25099
6145b5099O623J9390M314q546k7913o992L1950K314K817q674L795m932k4077j1190
$$ -25099 -18476 914 5228 -3318 -31231 -38223 -6273 -3959 -1142 -9816 -6021 -10953 -35030 -46220
6131d6220k117K2343l127j2746L131M055K2674J1840R678M44J5796K3079k5152
$$ -46220 -48337 -25994 -29121 -41867 -38736 -34681 -12007 -167 9511 9955 25751 48830 23678
6118B3678j9351j5805n083q62P816P497m140j9028k6735J8778L6364O828j0687
$$ 23678 4327 -11478 -16561 -17423 -9607 -2110 -6250 -25278 -52013 -33235 3129 9957 -730
6105g30j7889M610O207P153J0390j7625p294J985q779J1339J5744K7459O202l7040
$$ -730 -18619 -14009 -7802 -649 9741 -7884 -15178 -13193 -21972 -10633 5111 32570 38772 1732
6091A732l7506K555j9333K572J0718l569k127O534L7956L727n4871q898J7446
$$ 1732 -35774 -33219 -52552 -49980 -39262 -42831 -44958 -38424 -468 3259 -51612 -60510 -43064
6078d3064K3965O7m585Q149J3724J344j1811l0509l2346J1855N2000K0870p669
$$ -43064 -19099 -19032 -23617 -15468 -1744 -400 -12211 -42720 -75066 -63211 -11211 9659 1990
6065A990J0892O56j9901k7919o705J2269J5026l707N474N51k374m950J5218j4001
$$ 1990 12882 13538 -6363 -34282 -40987 -28718 -13692 -17399 -11925 -11374 -13748 -18698 -3480 -17481
6051a7481l013j862J5378K3246j7019j9088M083j3170P25K7853M445j6598J4468
$$ -17481 -20494 -22356 -6978 16268 -751 -19839 -15756 -28926 -28201 -348 4097 -12501 1967
6038A967o397k033J6504N683l630J218K5138o56r383l466k4221p232J6566Q143
$$ 1967 -4430 -6463 10041 15724 12094 13312 38450 37794 28411 24945 724 -6508 10058 18201
6024A8201q391j0205M842M418K5958O060k1241N335r410l7957n127K3458J1487
$$ 18201 9810 -395 4447 8865 34823 40883 19642 24977 15567 -22390 -27517 -4059 7428
6011G428J3972n8j2233j0701k1721j7483m813K6819K0961J7679k5878k3139l368
$$ 7428 21400 21342 9109 -1592 -23313 -40796 -45609 -18790 2171 19850 -6028 -29167 -32535
5998c2535J4795m370M954j7411k1912J0245J8283K0275q871o496J7663j3252k071
$$ -32535 -17740 -22110 -17156 -34567 -56479 -46234 -27951 -7676 -16547 -23043 -5380 -18632 -20703
5985b0703k005k0290M174J1418J3759j7113l855K6428O88j5255K1840J5667k4180
$$ -20703 -22708 -42998 -38824 -27406 -13647 -30760 -34615 -8187 -7499 -22754 -914 14753 -9427
5972i427m0169j5639J5017N484j7196O526K7051K0747j189l4957K2488K1748j5856
$$ -9427 -49596 -65235 -50218 -44734 -61930 -55404 -28353 -7606 -8795 -43752 -21264 484 -15372
5959a5372j2635J5349Q773K589o32k0854k9381L523L494K7797J4840j8071K453
$$ -15372 -28007 -12658 -3885 -1296 -1928 -22782 -52163 -48640 -45146 -17349 -2509 -20580 -18127
5946a8127R984k338P063r969l963M113n726J8264j4429j9495q305J5123J5269
$$ -18127 -8143 -10481 -3418 -13387 -17350 -13237 -18963 -699 -15128 -34623 -42928 -27805 -12536
5933a2536J9738L172J987k0528k2945J5490q758j3357r42k1572m103n651l769
$$ -12536 7202 10374 12361 -8167 -31112 -15622 -24380 -37737 -38679 -60251 -64354 -70005 -73774
5920g3774k2384K1170K4537K0653L187J4585L719J2556J1498J0491r186M751K6263
$$ -73774 -96158 -74988 -50451 -29798 -26611 -12026 -8307 4249 15747 26238 17052 21803 48066
5907D8066J3716j1693p372m716m7370j8258J2374o048J3559R462q465j8818N716
$$ 48066 61782 50089 42717 38001 -9369 -27627 -15253 -21301 -7742 1720 -6745 -25563 -19847
5894a9847j907m117K7961M979J7145Q306m586o668j0010j6186j0286q352L5430
$$ -19847 -21754 -25871 2090 7069 24214 32520 27934 21266 11256 -4930 -15216 -23568 11862
5881A1862J0168N138j5505j541j1338J268Q259J6086J9952r818J080Q956Q796
$$ 11862 22030 27168 11663 10122 -1216 52 8311 24397 44349 34531 35611 44567 53363
5868E3363j2680j4183K1882j0480n573Q53k8172k3556J166J8102M3031J1019j3395
$$ 53363 40683 26500 48382 37902 32329 33182 5010 -18546 -17380 722 43753 54772 41377
5855D1377m6421p968L1194K0964k8511J2483k004m057P628K0148L0j1531m4099
$$ 41377 -5044 -13012 18182 39146 10635 23118 21114 17057 24685 44833 44863 33332 -10767
5842a0767k1888k618J0809Q709J591m88J4526j2367j3842P403J3214J4249K2456
$$ -10767 -32655 -35273 -24464 -15755 -14164 -14652 -126 -12493 -26335 -18932 -5718 8531 30987
5829C0987R170o995L260Q474k3098l157j6307k0562P349R739N512j0052Pp387
$$ 30987 40157 33162 36422 44896 21798 18641 2334 -18228 -10879 -1140 4372 -5680 -5673 -13060
5815a3060l7270q039Q771K6349O1L0159l131k1816k3147K7457L3849k0203l6366
$$ -13060 -50330 -58369 -49598 -23249 -23188 6971 3840 -17976 -41123 -13666 20183 -20 -36386
5802c6386j8896L7544L0162P415L007j9666k925J2206K887p480j4759P014K0794
$$ -36386 -55282 -17738 12424 19839 22846 3180 255 12461 15348 7868 -6891 123 20917
5789B0917J6716R403l8716K595J3614j8814q599J396k4540j4406j49L5195M77
$$ 20917 37633 47036 8320 10915 24529 5715 -2884 -1488 -26028 -40434 -40583 -5388 -4911
5776d911J6141L694j1019k4168K012J3065m8J9904K4917j7855l5258M826P332
$$ -4911 11230 14924 3905 -20263 -18251 -5186 -5234 14670 39587 21732 -13526 -8700 -1368
5763a368l3592J7382J4442l926n721K1074J9051K4525r925l0392j226N377K4811
$$ -1368 -34960 -17578 -3136 -7062 -12783 8291 27342 51867 41942 11550 10324 15701 40512
5750D0512j3519k5400J2759O517J4424l4150j6732K6556L8292L0137J823j680
$$ 40512 26993 1593 14352 20869 35293 1143 -15589 10967 49259 79396 81219 79539
5738G9539J180J3934j5950l5005j8474j4421j6590j7363K4330J7807j2932R018
$$ 79539 80719 94653 78703 43698 25224 10803 -5787 -23150 1180 18987 6055 15073
5726A5073k5827k3158J1568J1496P504q49j2360j3588M675O525j9O404J2083n728
$$ 15073 -10754 -33912 -22344 -10848 -3344 -4193 -16553 -30141 -25466 -18941 -18960 -12556 -473 -6201
5712f201r789J317q702l375K8752L1075M773K98j2336j3915k0961J9449R752M130
$$ -6201 -15990 -14673 -23375 -26750 2002 33077 37850 38148 25812 11897 -9064 10385 20137 24267
5698B4267k6091k7917N06J7578j0470j0806l423j2290J4947J5665R655N623j1111
$$ 24267 -1824 -29741 -29235 -11657 -22127 -32933 -36356 -48646 -33699 -18034 -8379 -2756 -13867
5685a3867o407L63o306j2717L280J0972J1407K502K4436m551l3749K340J4755
$$ -13867 -20274 -19911 -26217 -38934 -35654 -24682 -13275 -10773 13663 9112 -24637 -22297 -7542
5672g542Q572j1588k8099Q521J1599L1233J8082r824j1214j6409k124m2555M163
$$ -7542 1030 -10558 -38657 -30136 -18537 12696 30778 20954 9740 -6669 -8793 -51348 -47185
5659d7185J6133j2350l353J5531m388n370K0535K4124J7747j2629j4367j269K0200
$$ -47185 -31052 -43402 -46755 -31224 -35612 -40982 -20447 3677 21424 8795 -5572 -6841 13359
5646A3359K8478O654j0433k7592k5346j4779J4343p902J814J0240J7882K2468
$$ 13359 41837 48491 38058 10466 -14880 -29659 -15316 -23218 -21404 -11164 6718 29186
5634B9186j0961k4435J977r47l2907Q297L2619l1731k9022Q53L0865J6288j5987
$$ 29186 18225 -6210 -4233 -5180 -38087 -29790 2829 -28902 -57924 -57071 -26206 -9918 -25905
5621b5905K498j1353O063k527p070M138J7058K4327J7052J3274k7527j7732m646
$$ -25905 -23407 -34760 -28697 -31224 -38294 -34156 -17098 7229 24281 37555 10028 -7704 -12350
5608a2350l3674j2994Q660M3034P175k1080k9565J4746J3737k7440j5716M782
$$ -12350 -46024 -59018 -50358 -7324 -149 -21229 -50794 -36048 -22311 -49751 -65467 -60685
5596f0685N124J6194K0464J6622m046J968L684K619m0298J9829K2682M108R938
$$ -60685 -55561 -39367 -18903 -2281 -6327 -4359 -675 1944 -38354 -18525 4157 8265 18203
5583A8203k2953j2452r075J5314J5781m946L490j4420k1479J8178J3123n026j7506
$$ 18203 -4750 -17202 -26277 -10963 4818 -128 3362 -11058 -32537 -14359 -1236 -6262 -23768
5570b3768p412J423p05L602J4945j7067l4286o381K9044K3064l65j1705O498K0071
$$ -23768 -31180 -29757 -30462 -26860 -11915 -28982 -63268 -69649 -40605 -17541 -17906 -29611 -23113 -3042
5556c042J8117k0305k1965j0274L458L793L020m241j9702J9112K5943j4271j1447
$$ -3042 15075 -5230 -27195 -37469 -34011 -30218 -27198 -31439 -51141 -32029 -6086 -20357 -31804
5543c1804N875J2617p240K0751L987n380p480L419q951k6L66j8080P722J6990
$$ -31804 -25929 -13312 -20552 199 4186 -1194 -8674 -5255 -14206 -14232 -13866 -31946 -24224 -7234
5529g234P267l738j7331J8639k7846j9270j8999L758L6380J1159l133p906K532
$$ -7234 33 -3705 -21036 -2397 -30243 -49513 -68512 -64754 -28374 -17215 -20348 -28254 -25722
5516b5722J5833k0078M446R459J567J767J3782N281k6374j9682j0775L0083J3427
$$ -25722 -9889 -29967 -25521 -16062 -14495 -12728 1054 6335 -20039 -39721 -50496 -20413 -6986
5503f986k232q344J2331j1923j5276P230k189M026K5717q863k737P068P041O645
$$ -6986 -9218 -17562 -5231 -17154 -32430 -25200 -27389 -23363 2354 -6509 -9246 -2178 4863 11508
5489A1508j1894k3197j25J9849J5215p884l0187q684P096K3541j5411k92r983
$$ 11508 -386 -23583 -23708 -3859 11356 3472 -26715 -35399 -28303 -4762 -20173 -20465 -30448
5476c0448j7884J2222N632J0304l149o763R718j9786J0927K4141N554P309q664
$$ -30448 -48332 -36110 -30478 -20174 -23323 -30086 -20368 -40154 -29227 -5086 468 7777 -887
5463h87k4241J1098j1782m2017K8195M5997L3552j1943j2351q263M242l2728j6029
$$ -887 -25128 -14030 -25812 -67829 -39634 6363 39915 27972 15621 7358 11600 -21128 -37157
5450c7157k0848K4659M3082K265l0138l1300k0429j2336K8522N1915Q821q431
$$ -37157 -58005 -33346 9736 12001 -18137 -49437 -69866 -82202 -53680 -1765 7056 -1375
5438a375J1746J669k9613j9883J4537J4985J567L888j3254l0373j1102P108L1102
$$ -1375 10371 12040 -17573 -37456 -22919 -7934 -6367 -2479 -15733 -46106 -57208 -50100 -18998
5425a8998k0698o322Q145J7530j7712j7869J6181J7169K791O554K4969n670K074
$$ -18998 -39696 -46018 -37873 -20343 -38055 -55924 -39743 -22574 -19783 -13229 11740 6070 8144
5412H144m051k7856N643J8408K419l5574J482K2919l649M212K7898r122l179k0325
$$ 8144 4093 -23763 -18120 288 2707 -32867 -31385 -8466 -12115 -7903 19995 10873 7694 -12631
5398a2631o785K6522J9401r503Q798m5033l6511j094J4422n60K8345L6986j875
$$ -12631 -19416 7106 26507 17004 25802 -19231 -55742 -56836 -42414 -42974 -14629 22357 20482
5385B0482k2647j5008q206J0808P741L219n451P587K7087O767k4701k9345r430
$$ 20482 -2165 -17173 -25379 -14571 -6830 -3611 -9062 -1475 25612 32379 7678 -21667 -31097
5372c1097k268J4451K4924P701n256k769K4399n848l987j942l3420p453J0645
$$ -31097 -33365 -18914 6010 13711 8455 5686 30085 24237 20250 18308 -15112 -22565 -11920
5359a1920K5487J0725j8770r702k400L066p618J136J9046r460J3423J7488j9908
$$ -11920 13567 24292 5522 -4180 -6580 -3514 -11132 -9996 9050 -410 13013 30501 10593
5346A0593j4906k3877j6224J5551L1556K7402r18J1931j7002l5566j5416J3781
$$ 10593 -4313 -28190 -44414 -28863 2693 30095 29177 41108 24106 -11460 -26876 -13095
5334a3095K7248j8803k3509k6359j107k72K7063L8505J6594m2870l2009K1908
$$ -13095 14153 -4650 -28159 -54518 -55625 -55897 -28834 9671 26265 -16605 -48614 -26706
5322b6706J3101k130j5752O055J5529q132J4722Q247J1159j6484j7704m6015J0649
$$ -26706 -13605 -15735 -31487 -25432 -9903 -18035 -3313 4934 16093 -391 -18095 -64110 -53461
5309e3461R999l454R020J0428P502J5967m589n754O337L495j9615J1351Q781o647
$$ -53461 -43462 -46916 -37896 -27468 -19966 -3999 -8588 -14342 -8005 -4510 -24125 -12774 -3993 -10640
5295a0640J1325J9576m4426j5198M14J1709J4772k6009n8O517K1016J409M138
$$ -10640 685 20261 -24165 -39363 -38949 -27240 -12468 -38477 -38535 -32018 -11002 -9593 -5455
5282e455J3423j2334o506j7237j1741J034O679J1452J8988J6025J5993J7854j4572
$$ -5455 7968 -4366 -10872 -28109 -39850 -38816 -32137 -20685 -1697 14328 30321 48175 33603
5269C3603m0750j7838L4742j5552j2319J1412j242o551K104N338J3667Q393J316
$$ 33603 -7147 -24985 9757 -5795 -18114 -6702 -7944 -14495 -12391 -7053 6614 15007 16323
5256A6323m271j11k4499M007j1645O993j3221K546L2963J2335k1926k0750k4993
$$ 16323 12052 11941 -12558 -8551 -20196 -13203 -26424 -23878 9085 21420 -506 -21256 -46249
5243d6249J869L0142J6610j9129N532j5980l914k1292j5103J8824K3924j0453
$$ -46249 -44380 -14238 2372 -16757 -11225 -27205 -31119 -52411 -67514 -48690 -24766 -35219
5231c5219R026K4989N196j1181r668k974L200O495m437J485J0364P120J6389k482
$$ -35219 -26193 -1204 3992 -7189 -16857 -19831 -16631 -10136 -14573 -13088 -2724 4396 20785 18303
5217A8303k6689O63K9523k3830l4392J4360r10j6154K1178L590R26j1358o199
$$ 18303 -8386 -7723 21800 -2030 -36422 -22062 -22972 -39126 -17948 -14358 -13432 -24790 -30989
5204c0989J7474J0377j8460J7756K0566k6464K582K9331K416k507j270K785J2665
$$ -30989 -13515 -3138 -21598 -3842 16724 -9740 -7158 22173 24589 22082 20812 23597 36262
5191C6262J945j7842k2260M333j3099k6921J4851M2032J0917l5296m137M816j5479
$$ 36262 38207 20365 -1895 2438 -10661 -37582 -22731 19301 30218 -5078 -9215 -4399 -19878
5178a9878J7320K756j3764m218J1530o299r918M096L1500q565k0481J3773J2238
$$ -19878 -2558 198 -13566 -17784 -6254 -12553 -22471 -18375 13125 4560 -15921 -2148 10090
5165A0090J4806j8065j7601J272K672K812R212L186m557m39L851j4115j3756L2518
$$ 10090 24896 6831 -10770 -9498 -6826 -4014 5198 8384 3827 3388 7239 -6876 -20632 11886
5151A1886j2650r716j8280j8372J1657J3197J1908L965J0585K754l194k2156l3234
$$ 11886 -764 -10480 -28760 -47132 -35475 -22278 -10370 -6405 4180 6934 3740 -18416 -51650
5138e1650m662Q85l0010j2367L8086K1404Q12J2070l254M464j5349k8264J4983
$$ -51650 -56312 -55427 -85437 -97804 -59718 -38314 -37502 -25432 -28686 -24222 -39571 -67835 -52852
5125e2852J5685J0504K3598L6360m967j0187l3623j5201J0718K0040K6672Q650
$$ -52852 -37167 -26663 -3065 33295 28328 18141 -15482 -30683 -19965 75 26747 35397
5113C5397o706l4798P18l3278k1345M287K551J957M647J6579J1157o085l137J972
$$ 35397 28691 -6107 -5389 -38667 -60012 -55725 -53174 -51217 -46570 -29991 -18834 -24919 -28056 -26084
5099b6084j0721L247K2596M4299k3747j4752j5678K847L6937K1194j6696J4241
$$ -26084 -36805 -33558 -10962 33337 9590 -5162 -20840 -17993 18944 40138 23442 37683
5087C7683l375l6543q604r707M723j523Q731K1075J2154K887j7745p575k400k4563
$$ 37683 34308 -2235 -10839 -20546 -15823 -17346 -8615 12460 24614 27501 9756 2181 -219 -24782
5073b4782j3463K2899L3374K0854J616j9577j600j4673p369j3761L793j9979J2774
$$ -24782 -38245 -15346 18028 38882 40498 20921 19321 4648 -2721 -16482 -12689 -32668 -19894
5060a9894L0460N304k993j2636o779j167l4120J3213K7152O233K0702P300l5744
$$ -19894 10566 15870 12877 241 -6538 -7705 -41825 -28612 -1460 4773 25475 32775 -2969
5047b969j4987J5060k5744m106J6426J8262k3755j1418K2058K6682j0565k1087
$$ -2969 -17956 -2896 -28640 -32746 -16320 1942 -21813 -33231 -11173 15509 4944 -16143
5035a6143j1657L47L2448J0342P045q252J2098j7683k1337o219P315j1861j2051
$$ -16143 -27800 -27453 4995 15337 22382 14130 26228 8545 -12792 -19011 -11696 -23557 -35608
5022c5608K3992J8749k0418p897J0860P152J5972k131m0241L612Q22j060k0719
$$ -35608 -11616 7133 -13285 -21182 -10322 -3170 12802 10671 -29570 -25958 -25136 -26196 -46915
5009d6915K6635J3212n979j3127l128j575M666J847m41K3388J7818Q139M967n18
$$ -46915 -20280 -7068 -13047 -26174 -29302 -30877 -26211 -24364 -24805 -1417 16401 24540 29507 28989
4995B8989j8625J0451k9295j1301p570j509J5240J878L045L5655N476l3083j4116
$$ 28989 10364 20815 -8480 -19781 -27351 -28860 -13620 -11742 -8697 26958 32434 -649 -14765
4982a4765J532K242J1425J4605r316l2000P148K7334J5080L484n707k5725l874
$$ -14765 -13233 -10991 434 15039 5723 -26277 -19129 8205 23285 26769 21062 -4663 -8537
4969h537j0555j3194j8131M533R506K3715J0870k8247m003J6472r714O149N001
$$ -8537 -19092 -32286 -50417 -45884 -36378 -12663 -1793 -30040 -34043 -17571 -27285 -21136 -16135
4956a6135j1724N895K7871J5379k205M172j2082l3496J135K7063j722L408K1844
$$ -16135 -27859 -21964 5907 21286 19081 23253 11171 -22325 -21190 5873 4151 7559 29403
4943B9403j3406p435j9437O535Q401q634j4485L8747k612k1317o115M170P527
$$ 29403 15997 8562 -10875 -4340 4061 -4573 -19058 19689 17077 -4240 -10355 -6185 1342
4930A342j7149J2661N44k4889p527L9624J7088n6854k7836J330J041J1927j9174
$$ 1342 -15807 -3146 -2602 -27491 -35018 4606 21694 -35160 -62996 -61666 -60625 -48698 -67872
4917f7872p395K6027J9226j8300J7808J3640J5447L5170k2426l1323K999m942
$$ -67872 -75267 -49240 -30014 -48314 -30506 -16866 -1419 33751 11325 -19998 -16999 -21941
4905b1941K7429O915k3124J5569K2214n614k4477j4035K9019J9471N046o459l0579
$$ -21941 5488 12403 -10721 4848 27062 21448 -3029 -17064 11955 31426 36472 30013 -566
4892e66j3358N749p709J1068K8364k0179R110J2711p768p362k779j5040j4425
$$ -566 -13924 -8175 -15884 -4816 23548 3369 12479 25190 17422 10060 7281 -7759 -22184
4879b2184j3633J0926O305k3213l194K9391P537J6063J4863L2314J5541k2936
$$ -22184 -35817 -24891 -18586 -41799 -44993 -15602 -8065 7998 22861 55175 70716 47780
4867D7780m0539j1493J1755J0611J9350Q900k821j3911l0499k9008k280K4844
$$ 47780 7241 -4252 7503 18114 37464 46364 43543 29632 -867 -29875 -32155 -7311
4855g311R667k3394J4482J0566o363oj868j4813P20J1674J6920Q050j4645k0016
$$ -7311 2356 -21038 -6556 4010 -2353 -2359 -4227 -19040 -18320 -6646 10274 18324 3679 -16337
4841a6337j8320J4493J4771R805j568j4416Q407J5242N527p294j9474o407k4863
$$ -16337 -34657 -20164 -5393 4412 2844 -11572 -3165 12077 17604 10310 -9164 -15571 -40434
4828d0434k65L296J3683K0852M1M40O523k0494j9693L4368j8798J4875J2014M58
$$ -40434 -40699 -37403 -23720 -2868 -2827 -2387 4136 -16358 -36051 -1683 -20481 -5606 6408 6866
4814F866k9452k2500J9223J9834O321j6063k0278J3242m411l586k87Q110M973
$$ 6866 -22586 -45086 -25863 -6029 292 -15771 -36049 -22807 -27218 -30804 -31091 -22981 -18008
4801a8008J1658J8209K838j2916k0629k4539J2479L4402L3426O949j8606q319
$$ -18008 -6350 11859 14697 1781 -18848 -43387 -30908 3494 36920 43869 25263 16944
4789A6944R024j0886o471j7948k7773J5421J6013k2948k215n204o143J0628M266
$$ 16944 25968 15082 8611 -9337 -37110 -21689 -5676 -28624 -30839 -36043 -42186 -31558 -27292
4776b7292P332j824k3492o196J7788L4950p152l2958j588O558q282K5466L3827
$$ -27292 -19960 -21784 -45276 -51472 -33684 1266 -5886 -38844 -40432 -33874 -42156 -16690 17137
4763A7137Q130q874Q33m5390n641J4901m805m965K4407J6303K0110l122l1145
$$ 17137 25267 16393 17226 -28164 -33805 -18904 -23709 -28674 -4267 12036 32146 29024 -2121
4750b121j7737j9406K6381L9974j366m2631j4822Q577k0900j3064j4659R140J7071
$$ -2121 -19858 -39264 -12883 27091 25725 -16906 -31728 -23151 -44051 -57115 -71774 -62634 -45563
4737d5563K0621P723r667r526q182j0343J1492j468Q619R467K1903R074k3685
$$ -45563 -24942 -17219 -26886 -36412 -44594 -54937 -43445 -44913 -36294 -26827 -4924 4150 -19535
4724a9535l1653K6506L1588L3119J6524j4585n2382q418K3720j0974m5956J334
$$ -19535 -51188 -24682 6906 40025 56549 41964 -10418 -18836 4884 -6090 -52046 -50712
4712e0712K3457J2469J7596J904K961j4894r35P496o395j2127j098K3563j492
$$ -50712 -27255 -14786 2810 4714 7675 -7219 -8154 -658 -7053 -19180 -20278 3285 1793
4699A793k8028j0553L2031J3916k321L718K239K7198j2223k5889J4907K3476j1004
$$ 1793 -26235 -36788 -4757 9159 6838 10556 12795 39993 27770 1881 16788 40264 29260
4686B9260j8266L2553j1528l6753k1252j242J3428L431j7557J1434J1111M308
$$ 29260 10994 43547 32019 -4734 -25986 -27228 -13800 -10369 -27926 -16492 -5381 -1073
4674a073r860r47o052r118p493l594J2843M61J6623O017j642R133O084J0886l8115
$$ -1073 -10933 -11880 -17932 -27050 -34543 -38137 -25294 -24833 -8210 -2193 -3835 5298 11382 22268 -15847
4659a5847j6166L043n021j5847L889O280J528j020j9299L7660J2004j9507J5789
$$ -15847 -32013 -28970 -33991 -49838 -45949 -39669 -38141 -39161 -58460 -20800 -8796 -28303 -12514
4646a2514K2076o58P54j5283J8458J7854l7980j5068m164j427p263N378l27J2382
$$ -12514 9562 8904 9658 -5625 12833 30687 -7293 -22361 -26525 -27952 -35215 -29837 -30164 -17782
4632a7782L091J1068J9120j8974O079m562j068j4654N046R939q23R235N943J3050
$$ -17782 -14691 -3623 15497 -3477 2602 -1960 -3028 -17682 -12636 -2697 -3520 5715 11658 24708
4618B4708J1116n231l1178k4252j639J5046K2094q534N728R338K581j4106j5445
$$ 24708 35824 30593 -585 -24837 -26476 -11430 10664 2130 7858 17196 19777 5671 -9774
4605i774j4820P863L929M337J1600L87k9306j6552J750L6137K916r502L390q214
$$ -9774 -24594 -16731 -12802 -8465 3135 3522 -25784 -42336 -40586 -4449 -1533 -11035 -7645 -15859
4591a5859O738n196r896J0883K3578J2271k1155l4649L5895L3881M528j7263o92
$$ -15859 -9121 -14317 -24213 -13330 10248 22519 1364 -33285 2610 36491 41019 23756 23064
4578B3064J7840j3312M110L691P460L204j2397k2627J005p217j5428k0012j584
$$ 23064 40904 27592 31702 35393 42853 46057 33660 11033 12038 4821 -10607 -30619 -32203
4565c2203j7954k004N419J2483L555J0164k3743P631r69J278J8787K3614o495
$$ -32203 -50157 -52161 -46742 -34259 -30704 -20540 -44283 -36652 -37621 -36343 -17556 6058 -437
4552d37K044j5636j4024j6789r779J7158M1759J2665n632k2111j2415Q643J3623
$$ -437 1607 -14029 -28053 -44842 -54621 -37463 4296 16961 11329 -10782 -23197 -14554 -931
4539i31J0757l622n237k1359k4688J6198K9447k9011k057n65J4554Q535K588K178
$$ -931 9826 6204 967 -20392 -45080 -28882 565 -28446 -30503 -31068 -16514 -7979 -5391 -3213
4525c213r803j661Q485J427J4459N964j4082j5878M486K6005K5558j6478l7625
$$ -3213 -13016 -14677 -6192 -4765 9694 15658 1576 -14302 -9816 16189 41747 25269 -12356
4512a2356J0983n565j3238K5390J3058j8780P969R585j2937p96k2089k4499P699
$$ -12356 -1373 -6938 -20176 5214 18272 -508 7461 17046 4109 3313 -18776 -43275 -35576
4499c5576Q276j7652J1434L0197N030O270J073J5956M220j6488J9024r797k8311
$$ -35576 -27300 -44952 -33518 -3321 1709 7979 9052 25008 29228 12740 31764 21967 -6344
4486f344j5501R105j3178k5103j5551Q050K8781l86j280P179K087o71Q03l137
$$ -6344 -21845 -12740 -25918 -51021 -66572 -58522 -29741 -30127 -31407 -24228 -22141 -22812 -22009 -25146
4472b5146m5m335K211r9k2297J6488K7576l325k0569L966P204J0629K8777M439
$$ -25146 -25191 -29526 -27315 -27414 -49711 -33223 -5647 -8972 -29541 -25575 -18371 -7742 21035 25474
4458B5474j8846j3281J5820J6427p593L701j7007p083L1409J7646m300m0853k4871
$$ 25474 6628 -6653 9167 25594 18001 21702 4695 -2388 29021 46667 42367 1514 -23357
4445b3357k3004J1331Q353j1009j5151P446L0086m9p361j62K238J0133P430Q285
$$ -23357 -46361 -35030 -26677 -37686 -52837 -45391 -15305 -15354 -22715 -22877 -20639 -10506 -3076 5209
4431E209J7124O526k6097j7965O979O050j4359j8550m372m06O554R430O650k632
$$ 5209 22333 28859 2762 -15203 -8224 -2174 -16533 -35083 -39455 -39861 -33307 -23877 -17227 -19859
4417a9859K4178L7707K95k4146l3594P039J5658k7832j1497l292r19L127J1885
$$ -19859 4319 42026 42321 18175 -15419 -8380 7278 -20554 -32051 -35343 -36262 -33135 -21250
4404b1250j6696j3477j21J5951J9298N91j3620J3521L0495Q259r43j1692j7801
$$ -21250 -37946 -51423 -51544 -35593 -16295 -15704 -29324 -15803 14692 22951 22008 10316 -7485
4391g485M481K329K0410l507j1108J205J731r362K08K0729p528j3523j6470j8399
$$ -7485 -3004 -675 19735 16228 5120 6325 8056 -1306 -1098 19631 12103 -1420 -17890 -36289
4377c6289M737J0639J780P420L3211J0931J9455r631l7517k5085j2111J3435o40
$$ -36289 -31552 -20913 -19133 -11713 21498 32429 51884 42253 4736 -20349 -32460 -19025 -19665
4364a9665o172j5588k3010j7202J8658J0774L3464J3783j8485L89Q958J6357m863
$$ -19665 -25837 -41425 -64435 -81637 -62979 -52205 -18741 -4958 -23443 -23054 -14096 2261 -2602
4351b602j7241j2392J0512J0993M281L8885l282j7880j0614k267J6103j2768k0595
$$ -2602 -19843 -32235 -21723 -10730 -6449 32436 29154 11274 660 -1607 14496 1728 -18867
4338a8867j560o878K617Q051K8500q463j5333Q28k457l7230J2535M1408j759p129
$$ -18867 -20427 -27305 -24688 -16637 11863 3400 -11933 -11105 -13562 -50792 -38257 3151 1392 -5737
4324e737k1364n877l926q137J8607j655l813L368K0481N237J284n298l594K683
$$ -5737 -27101 -32978 -36904 -45041 -26434 -28089 -31902 -28534 -8053 -2816 -1532 -6830 -10424 -7741
4310g741O406k2958j9237J4109J8926J5533m3937J029J6530Q590j340k3215J1370
$$ -7741 -1335 -24293 -43530 -29421 -10495 5038 -38899 -37870 -21340 -12750 -14090 -37305 -25935
4297b5935J6910J800m012L983P229M613j725k9810l844o420M466R403n762K176
$$ -25935 -9025 -7225 -11237 -7254 -25 4588 2863 -26947 -30791 -37211 -32745 -23342 -29104 -26928
4283b6928P18O616K2827K5471K5652j9518k5432l4586k3196p656p782J0334L827
$$ -26928 -26210 -19594 3233 28704 54356 34838 9406 -25180 -48376 -56032 -63814 -53480 -49653
4270d9653P476K3849K8693o471O67k0587j4805Q764p356l185K970N299J7235J281
$$ -49653 -42177 -18328 10365 3894 4561 -16026 -30831 -22067 -29423 -32608 -29638 -24339 -7104 -5823
4256e823J5654M905O985m629k4963k0471J5852k7201j4459O075L0013j2315j5412
$$ -5823 9831 14736 21721 17092 -7871 -28342 -12490 -39691 -54150 -48075 -18062 -30377 -45789
4243d5789o983J8069Q093K5455L022r552L530J229j7051q362k7560l766J7344
$$ -45789 -52772 -34703 -26610 -1155 1867 -7685 -4155 -2926 -19977 -28339 -55899 -59665 -42321
4230d2321J7281K1057R430k5694n586Q684J0438L235K4819j7986l3311q114J3070
$$ -42321 -25040 -3983 5447 -20247 -25833 -17149 -6711 -3476 21343 3357 -29954 -38068 -24998
4217b4998j8868K5151J2630k9414K7582K9682l4j4058k0866k5132Q835M4631M396
$$ -24998 -43866 -18715 -6085 -35499 -7917 21765 21731 7673 -13193 -38325 -29490 15141 19537
4204A9537n907o9O317m552j4842L321j3897K2008K070m1155J2650J5262j2680
$$ 19537 13630 13561 19878 15326 484 3805 -10092 11916 13986 -27169 -14519 743 -11937
4191a1937j4839L3034K4876k0399k9584n844L1860J3568j6945P720K048K966m076
$$ -11937 -26776 6258 31134 10735 -18849 -24693 7167 20735 3790 11510 13558 16524 12448
4178A2448J762n820N432k4389k059J7666O24M827j0409k8439r686J3662K6990
$$ 12448 14210 8390 13822 -10567 -12626 5040 5664 10491 82 -28357 -38043 -24381 2609
4165B609J296j6109l4780r256L3516K2018l492J0390j7710j1019J3644k7348O123
$$ 2609 3905 -12204 -46984 -56240 -22724 -706 -4198 6192 -11518 -22537 -8893 -36241 -30118
4152c0118L2883L988K527j34j7205m102q020l911M0410K0294j1622q98L924j0105
$$ -30118 2765 6753 9280 9146 -8059 -12161 -20181 -24092 16318 36612 24990 24092 28016 17911
4138A7911k5279j9297j1197l38L3252J8246k6518L644o190q186O450k390n984
$$ 17911 -7368 -26665 -37862 -38200 -4948 13298 -13220 -9576 -15766 -23952 -17502 -19892 -25876
4125b5876Q244O682O887O391K1766j307l1716k4519k7972K2162L1665J9960j449
$$ -25876 -17632 -10950 -4063 2328 24094 22787 -8929 -33448 -61420 -39258 -7593 12367 10918
4112A0918m572k0130j6073k5358J2280L9522m040l9118k4860j8735M335K3069
$$ 10918 6346 -13784 -29857 -55215 -42935 -3413 -7453 -46571 -71431 -90166 -85831 -62762
4100f2762K8604J6633k354M949n977k2293J0723J3463l767N553J133R769r446
$$ -62762 -34158 -17525 -19879 -14930 -20907 -43200 -32477 -19014 -22781 -17228 -16095 -6326 -15772
4087a5772l236J5717j0098N010N058J0814m631k3992k3098P255L3306K3891K2804
$$ -15772 -19008 -3291 -13389 -8379 -3321 7493 2862 -21130 -44228 -36973 -3667 20224 43028
4074D3028j6090j0173j1953m747L112r895j27k0095K3233P015k2322j1250K2138
$$ 43028 26938 16765 4812 65 3177 -6718 -6845 -26940 -3707 3308 -19014 -30264 -8126
4061h126k335o503j5705k6352l972L8502K7514J440j7014j7197M845j025K0306
$$ -8126 -10461 -16964 -32669 -59021 -62993 -24491 3023 4463 -12551 -29748 -24903 -25928 -5622
4048e622L949j8063l942R383J3945l369N164r690j8138K532O43L725L3771j436
$$ -5622 -1673 -19736 -23678 -14295 -350 -3719 1445 -8245 -26383 -23851 -23208 -19483 14288 12852
4034A2852p499L853j334q619l5906l4988j2288L0748K7551p3k0558j9156Q591
$$ 12852 5353 9206 7872 -747 -36653 -71641 -83929 -53181 -25630 -25703 -46261 -65417 -56826
4021e6826J8389j9739J0208J2463P856j3341L514J9464n489q890J5433J684J427
$$ -56826 -38437 -58176 -47968 -35505 -27649 -40990 -37476 -18012 -23501 -32391 -16958 -15274 -13847
4008a3847J8220j3292m0625K320L925L2180J3074j1873L975j6950J6963K3343
$$ -13847 4373 -8919 -49544 -47224 -43299 -11119 1955 -9918 -5943 -22893 -5930 17413
3996A7413m625m809J3450k4030j5140J8034j5498k4518j698J8271J0018j49l040
$$ 17413 12788 7979 21429 -2601 -17741 293 -15205 -39723 -41421 -23150 -13132 -13281 -16321
3983a6321J5052K368k1166l195L7044j5178j8180m974l1663j5937J6533K5017
$$ -16321 -1269 1099 -20067 -23262 13782 -1396 -19576 -24550 -56213 -72150 -55617 -30600
3971c0600P44l2904j1250M1568M2801J3170k018j0929j1623J9894P099j7638j1574
$$ -30600 -29856 -62760 -74010 -32442 10359 23529 21511 10582 -1041 18853 25952 8314 -3260
3958c260n011R723k7585k3439L3253K4974N105n85j0317K5059K5109n603k8697
$$ -3260 -8271 1452 -26133 -49572 -16319 8655 13760 13175 2858 27917 53026 47423 18726
3945A8726m0076j7682R646O462r281j4294j0945J8507l143J251R647Q649M792
$$ 18726 -21350 -39032 -29386 -22924 -32205 -46499 -57444 -38937 -42080 -40829 -31182 -22533 -17741
3932a7741j5406O993L051R001k577j2679J1475J1517k296k917o942K0521K3933
$$ -17741 -33147 -26154 -23103 -14102 -16679 -29358 -17883 -6366 -8662 -11579 -18521 2000 25933
3919B5933q168k0313j1410k2628j0369L4953K0063k9932j8866j8312m325J3028
$$ 25933 17765 -2548 -13958 -36586 -46955 -12002 8061 -21871 -40737 -59049 -63374 -50346
3907e0346L1809J6728j2459J7302r841k3646k7335J937J0286M0170N268R270k8749
$$ -50346 -18537 -1809 -14268 3034 -6807 -30453 -57788 -55851 -45565 -5395 -127 9143 -19606
3894a9606n502Q296q822o854M318K0210k1578Q048K525n684J4096P60K6283K2592
$$ -19606 -25108 -16812 -25634 -32488 -28170 -7960 -29538 -21490 -18965 -24649 -10553 -9793 16490 39082
3880C9082l29j0500n584j5280l0329J3577r683n815R135j0065j257K7357j494
$$ 39082 38753 28253 22669 7389 -22940 -9363 -19046 -24861 -15726 -25791 -27048 309 -1185
3867a185k6355j48Q909p333J690J6164J1864j1623J3762L635j6104l935l835Q543
$$ -1185 -27540 -27688 -18779 -26112 -24422 -8258 3606 -8017 5745 9380 -6724 -10659 -14494 -5951
3853e951L675J1492k047j5285k5643k3507M037j1493J7233k5758P554K5629J8763
$$ -5951 -2276 9216 7169 -8116 -33759 -57266 -53229 -64722 -47489 -73247 -65693 -40064 -21301
3840b1301J838j2759j1308N800J5520o19K3596l930j1930m1222J5115j325J8910
$$ -21301 -19463 -32222 -43530 -37730 -22210 -22829 767 -3163 -15093 -56315 -41200 -42525 -23615
3827b3615R489N349P29J6377q32j8220j7416n574J7970K8812m946j1350l639k1197
$$ -23615 -14126 -8777 -8048 8329 7497 -10723 -28139 -33713 -15743 13069 8123 -3227 -6866 -28063
3813b8063k0189K6353o997N386L1094J790P33J3518J2452j7610j3272k674J4566
$$ -28063 -48252 -21899 -28896 -23510 7584 9374 10107 23625 36077 18467 5195 2521 17087
3800A7087j4999m812k0190j7206L3615P055N024j8268j2191j6389j7111K1485
$$ 17087 2088 -2724 -22914 -40120 -6505 550 5574 -12694 -24885 -41274 -58385 -36900
3788c6900K411j5225J6140J6184j939J0737j299r181J9589j9292j3878K3280K4455
$$ -36900 -34489 -49714 -33574 -17390 -19329 -8592 -9891 -19072 517 -18775 -32653 -9373 15082
3775A5082n822j1754O690j5724j1528J7815j913k0882Q140L96J5059J4791J5219
$$ 15082 9260 -2494 4196 -11528 -23056 -5241 -7154 -28036 -19896 -19500 -4441 10350 25569
3762B5569M741m676j2659k7350K373K7281J6423J2556j5262k0746j8323k8336
$$ 25569 30310 25634 12975 -14375 -12002 15279 31702 44258 28996 8250 -10073 -38409
3750c8409K335R290J8284Q243k6108k7228R336j9028r733K1464J4917K3037j3800
$$ -38409 -36074 -26784 -8500 -257 -26365 -53593 -44257 -63285 -73018 -51554 -36637 -13600 -27400
3737b7400k168J453Q269m38K7993k333l429J79k1080j3796m748j0343r676R89
$$ -27400 -29568 -28115 -19846 -20284 7709 5376 1947 2126 -18954 -32750 -37498 -47841 -57517 -56528
3723e6528p721J9396L6723k070j3478j1134o515M5019j74l653p964q464K8833
$$ -56528 -64249 -44853 -8130 -10200 -23678 -34812 -41327 3692 3518 -135 -8099 -16563 12270
3710A2270j6705m3549J6074j0757J0663J039M423K333K7770o741k1571k7121Q150
$$ 12270 -4435 -47984 -31910 -42667 -32004 -30965 -26542 -24209 3561 -3180 -24751 -51872 -43722
3697d3722J9599P185o82n084M690N902L4048o077k2138m482N610p734K4531j4872
$$ -43722 -24123 -16938 -17620 -22704 -18014 -12112 21936 15859 -6279 -10761 -5151 -12885 11646 -3226
3683c226J6964m006k4296p069p188J205K4482K3461M692J6962j0501o884k2757
$$ -3226 13738 9732 -14564 -21633 -28821 -27616 -3134 20327 25019 41981 31480 24596 1839
3670A839j8389k063n562q288j1736j4995p443r706J8516j3382j2805K5288O116
$$ 1839 -16550 -18613 -24175 -32463 -44199 -59194 -66637 -76343 -57827 -71209 -84014 -58726 -52610
3657e2610o214j1358L6881K8629K068q527j2250J780j1722J256Q006J2097J3424
$$ -52610 -58824 -70182 -33301 -4672 -2604 -11131 -23381 -21601 -33323 -32067 -24061 -11964 1460
3644A460J0307j0046r798J4483J0309l310P500k2481m5778j7322K4732L5593j8079
$$ 1460 11767 1721 -8077 6406 16715 13405 20905 -1576 -47354 -64676 -39944 -4351 -22430
3631b2430j4118O363m616j88K876j4857k618j5031K2993K3596J8071L294k4026
$$ -22430 -36548 -30185 -34801 -34989 -32113 -46970 -49588 -64619 -41626 -18030 41 3335 -20691
3618b0691j4142K7079J9222m637J2110q979k4969J2632K4791n578j3743r682N777
$$ -20691 -34833 -7754 11468 6831 18941 9962 -15007 -2375 22416 16838 3095 -6587 -810
3605h10o334m758j4492N000J5624L118k3878p460j8264K234K489J7755j2111J8225
$$ -810 -7144 -11902 -26394 -21394 -5770 -2652 -26530 -33990 -52254 -50020 -47531 -29776 -41887 -23662
3591b3662K388k38J102j424m613J2738J8428L381q147n1002m225J9552J3264L4859
$$ -23662 -21274 -21512 -20410 -21834 -26447 -13709 4719 8100 -47 -51049 -55274 -35722 -22458 12401
3577A2401j2093m421J8244J732j6414J1003M04M45k3407n118j4439j5323K1454
$$ 12401 308 -4113 14131 15863 -551 10452 10856 11301 -12106 -17224 -31663 -46986 -25532
3564b5532J2537o519j0343P951J6049J6246L181j1710q778O8J7223J7199k171
$$ -25532 -12995 -19514 -29857 -21906 -5857 10389 13570 1860 -6918 -6850 10373 27572 25401
3551B5401o417k3497j4357K0593K354m559j6477J5844J9534j1718R3l792J2964
$$ 25401 18984 -4513 -18870 1723 4077 -482 -16959 -1115 18419 6701 6794 3002 15966
3538A5966j9327P465N205j4237J4194K4538o659l1168J629R136k048r368k343
$$ 15966 -3361 4104 9309 -4928 9266 33804 27145 -4023 -2394 6742 4694 -4674 -7017
3525g017m210j94J0238j2184q806n347M92O750k330Q666J3066k6343j7204K6475
$$ -7017 -11227 -11421 -1183 -13367 -22173 -27520 -27028 -20278 -22608 -13942 -876 -27219 -44423 -17948
3511a7948N697J5109N771K4865o805k2416k8428j1186J8497J5924L2541M642j4272
$$ -17948 -12251 2858 8629 33494 26689 4273 -24155 -35341 -16844 -920 31621 36263 21991
3498B1991q659l062l8154n0663J6799M334J4526L0321K6803k2082k8848l4726
$$ 21991 13332 10270 -27884 -78547 -61748 -57414 -42888 -12567 14236 -7846 -36694 -71420
3486g1420N939K9142J6493Q895j419P703J0804q959k4423j9138j3056p621J2888
$$ -71420 -65481 -36339 -19846 -10951 -12370 -4667 6137 -2822 -27245 -46383 -59439 -67060 -54172
3473e4172L7302K3993m93j9210k2060l0988N497O893J9921J4902j4584j8159J9227
$$ -54172 -16870 7123 6630 -12580 -34640 -65628 -60131 -53238 -33317 -18415 -32999 -51158 -31931
3460c1931K5054M249M18K5514K6069o5j7618m0907l0461J6417L7632m74l0996
$$ -31931 -6877 -2628 -2210 23304 49373 49308 31690 -9217 -39678 -23261 14371 13897 -17099
3447a7099k5267J0972n358j4637L7981K5477O862q947k2741p776L106j5764k67
$$ -17099 -42366 -31394 -36752 -51389 -13408 12069 18931 9984 -12757 -20533 -17427 -33191 -33458
3434c3458R145k6889o951J5271r485J1884J5548J4576j8753j0613K5835J0090
$$ -33458 -24313 -51202 -58153 -42882 -52367 -40483 -24935 -10359 -29112 -39725 -13890 -3800
3422c800P957J2012k8907k37k255p063r430l891m570N661K0432P853J0244J1654
$$ -3800 4157 16169 -12738 -12975 -15230 -22293 -31723 -35614 -40184 -34523 -14091 -6238 4006 15660
3408A5660j1545k5433m4058L825L3722K5533j4663K938j47J1451J0214J3395K3398
$$ 15660 4115 -21318 -65376 -61551 -27829 -2296 -16959 -14021 -14168 -2717 7497 20892 44290
3395D4290l4940r031Q063Q934o277n584J3547L513j8078M275r163P808J7604l5968
$$ 44290 9350 319 8382 17316 11039 5455 19002 22515 4437 8712 -451 7357 24961 -11007
3381a1007j4495J1388L3431o574k1085j4133j1534n036p516l0915J6168K9772
$$ -11007 -25502 -14114 19317 12743 -8342 -22475 -34009 -39045 -46561 -77476 -61308 -31536
3369c1536R11l2844j6742j02m064J8069M0850K0274J2441J7133j4762m501n822
$$ -31536 -30625 -63469 -80211 -80313 -84377 -66308 -25458 -5184 7257 24390 9628 5127 -695
3356f95k2594K895j612Q965L1421Q043l0862q564J7661L0507J690j6318l0490
$$ -695 -23289 -20394 -22006 -13041 18380 26423 -4439 -13003 4658 35165 36855 20537 -9953
3343i953j7382P188K0342J414K19o324j0531r469k5381J1456J9475j795L9321
$$ -9953 -27335 -20147 195 1609 1828 -4496 -15027 -24496 -49877 -38421 -18946 -20741 18580
3330A8580M076K5241M16j4611n164L27j0215j9543q889R499k1828j2051J6830
$$ 18580 22656 47897 48313 33702 28538 28865 18650 -893 -9782 -283 -22111 -34162 -17332
3317a7332K036K9394J0696L813j7977j0665j4681r585K705P057q842J6186j474
$$ -17332 -15296 14098 24794 28607 10630 -35 -14716 -24301 -21596 -14539 -23381 -7195 -8669
3304h669k5688k38N047k373L108J1302J8688j3767j105k2428k4613K886K7790
$$ -8669 -34357 -34595 -29548 -31921 -28813 -17511 1177 -12590 -13695 -36123 -60736 -57850 -30060
3291c0060J8861K9045K5874j7149P58k1441N820k5425J070j7407j0055J119O725
$$ -30060 -11199 17846 43720 26571 27329 5888 11708 -13717 -12647 -30054 -40109 -38990 -32265
3278c2265j6864K0211P930L163L663L957j1536M367k156l809K1772m637k3294
$$ -32265 -49129 -28918 -20988 -17825 -14162 -10205 -21741 -17374 -19530 -23339 -1567 -6204 -29498
3265b9498l6602k6497o423K0587K2743N852j3639p87P464K8692M460r307p193
$$ -29498 -66100 -92597 -99020 -78433 -55690 -49838 -63477 -64264 -56800 -28108 -23648 -32955 -40148
3252d0148J9051K2608j1533q691k06l120k9390j5255j0157L6941L1352J7573Q250
$$ -40148 -21097 1511 -10022 -18713 -18919 -22039 -51429 -66684 -76841 -39900 -8548 9025 17275
3239A7275j2271n438j2013k439j08R875j230q638K956p911q959j6323k6278N145
$$ 17275 5004 -434 -12447 -14886 -14994 -5119 -6349 -14987 -12031 -19942 -28901 -45224 -71502 -66357
3225f6357P097J8663J0918j6805l765J2617J2591J8167l8704k9511Q892J4635
$$ -66357 -59260 -40597 -29679 -46484 -50249 -37632 -25041 -6874 -45578 -75089 -66197 -51562
$$ [...]
##END NTUPLES=NMR SPECTRUM
##END=
