##TITLE=Analysis number 315943
Compound Code btb 13048
Project Code adrs
Chemist Name stores
##JCAMPDX= 6.0         $$ Bruker NMR JCAMP-DX V2.0
##DATA TYPE= NMR SPECTRUM
##DATA CLASS= NTUPLES
##ORIGIN= Bruker BioSpin GmbH
##OWNER= NMR
$$ XWIN-NMR		Version 3.5
$$ Thu Dec  8 13:53:56 2005 GMT Standard Time (UT+0h)  MAYBRIDGE\NMR@NMR_250MHZ
##.OBSERVE FREQUENCY= 250.131544655141
##.OBSERVE NUCLEUS= ^1H
##.ACQUISITION MODE= SIMULTANEOUS (DQD)
##.ACQUISITION SCHEME= undefined
##.AVERAGES= 16
##.DIGITISER RES= 18
##SPECTROMETER/DATA SYSTEM= dpx250
##.PULSE SEQUENCE= zg30
##.SOLVENT NAME= CDCl3
##.SHIFT REFERENCE= (INTERNAL, CDCl3, 0, 16.522)
##AUDIT TRAIL= $$ (NUMBER, WHEN, WHO, WHERE, WHAT)
$$ ##TITLE= Audit trail, XWIN-NMR		Version 3.5
$$ ##JCAMPDX= 5.01
$$ ##ORIGIN= Bruker BioSpin GmbH
$$ ##OWNER= NMR
$$ C:\u/data/dgb/nmr/ADRS/13610/pdata/1/auditp.txt
$$ ##AUDIT TRAIL=  $$ (NUMBER, WHEN, WHO, WHERE, WHAT)
(   1,<2005-12-08 13:53:32.92 +000>,<MAYBRIDGE\NMR>,<NMR_250MHZ>,
      <created by zg, POWCHK disabled, PULCHK disabled
       configuration hash MD5:
       62 19 C7 07 E1 42 D1 B7 37 6C 3D D0 77 39 F9 E6
       data hash MD5: 64K
       22 68 DC 40 8C A7 E9 CB E0 3F 56 15 58 47 81 EC>)
(   2,<2005-12-08 13:53:46.68 +000>,<MAYBRIDGE\NMR>,<NMR_250MHZ>,
      <Start of raw data processing
       ef LB = 0.3 FT_mod = 6 PKNL = 1 SI = 32K 
       data hash MD5: 32K
       3C CC 28 FE 2B 06 54 F5 2E 05 88 0E F2 50 87 0C>)
(   3,<2005-12-08 13:53:48.57 +000>,<MAYBRIDGE\NMR>,<NMR_250MHZ>,
      <apk 
       data hash MD5: 32K
       C0 FD 0F D2 B8 E1 E6 97 EF 43 11 85 B4 22 C2 F6>)
(   4,<2005-12-08 13:53:49.32 +000>,<MAYBRIDGE\NMR>,<NMR_250MHZ>,
      <abs ABSG = 5 
       data hash MD5: 32K
       C2 EA 39 F3 CC 2B 28 FF 5A A7 52 7A EA 5D 0C 22>)
$$ ##END=
$$ 
$$ hash MD5
$$ D0 B2 8F F0 1A EB B7 00 8F 3E DF 31 96 F9 20 D1
##$RELAX= 
##$RELAX= 
##$RELAX= 
##$RELAX= 
##$RELAX= 
##$RELAX= 
##$RELAX= 
$$ Bruker specific parameters
$$ --------------------------
##$DU= <C:\u>
##$EXPNO= 13610
##$NAME= <ADRS>
##$PROCNO= 1
##$TYPE= <nmr>
##$USER= <dgb>
##$AMP= (0..31)
100 100 100 100 100 100 100 100 100 100 100 100 100 100 100 100 100 100 
100 100 100 100 100 100 100 100 100 100 100 100 100 100 
##$AQSEQ= 0
##$AQ_mod= 3
##$AUNM= <au_zg>
##$AUTOPOS= <24 >
##$BF1= 250.13
##$BF2= 250.13
##$BF3= 250.13
##$BF4= 250.13
##$BF5= 500.13
##$BF6= 500.13
##$BF7= 500.13
##$BF8= 500.13
##$BYTORDA= 1
##$CFDGTYP= 0
##$CFRGTYP= 5
##$CHEMSTR= <none>
##$CNST= (0..31)
1 1 145 1 1 1 1 1 1 1 1 1 1 1 1 1 1 1 1 1 1 1 1 1 1 1 1 1 1 1 1 1 
##$CPDPRG= <>
##$CPDPRG1= <>
##$CPDPRG2= <>
##$CPDPRG3= <>
##$CPDPRG4= <mlev>
##$CPDPRG5= <mlev>
##$CPDPRG6= <mlev>
##$CPDPRG7= <mlev>
##$CPDPRG8= <mlev>
##$CPDPRGB= <>
##$CPDPRGT= <>
##$D= (0..31)
0 1 0 0 0 0 0 0 0 0.06 0 0 0 0 0 0 0.0002 0 0 0 0 0 0 0 0 0 0 0 0 0 0 
0 
##$DATE= 1134050011
##$DBL= (0..7)
120 120 120 120 120 120 120 120 
##$DBP= (0..7)
150 150 150 150 150 150 150 150 
##$DBP07= 0
##$DBPNAM0= <>
##$DBPNAM1= <>
##$DBPNAM2= <>
$$ [...]
##$SUBNAM7= <"">
##$SUBNAM8= <"">
##$SUBNAM9= <"">
##$SW= 20.6930455092707
##$SWIBOX= (0..15)
0 0 3 0 0 0 0 0 0 0 0 0 0 0 0 0 
##$SW_h= 5175.983436853
##$TD= 65536
##$TD0= 1
##$TE= 294.16
##$TE2= 300
##$TE3= 300
##$TEG= 300
##$TL= (0..7)
0 120 120 120 120 120 120 120 
##$TP= (0..7)
150 150 150 150 150 150 150 150 
##$TP07= 0
##$TPNAME0= <>
##$TPNAME1= <>
##$TPNAME2= <>
##$TPNAME3= <>
##$TPNAME4= <>
##$TPNAME5= <>
##$TPNAME6= <>
##$TPNAME7= <>
##$TPOAL= (0..7)
0.5 0.5 0.5 0.5 0.5 0.5 0.5 0.5 
##$TPOFFS= (0..7)
0 0 0 0 0 0 0 0 
##$TUNHIN= 0
##$TUNHOUT= 0
##$TUNXOUT= 0
##$USERA1= <user>
##$USERA2= <user>
##$USERA3= <user>
##$USERA4= <user>
##$USERA5= <user>
##$V9= 5
##$VALIST= <valist>
##$VCLIST= <CCCCCCCCCCCCCCC>
##$VD= 0
##$VDLIST= <DDDDDDDDDDDDDDD>
##$VPLIST= <PPPPPPPPPPPPPPP>
##$VTLIST= <TTTTTTTTTTTTTTT>
##$WBST= 1024
##$WBSW= 4
##$XGAIN= (0..3)
0 0 0 0 
##$XL= 0
##$YL= 0
##$YMAX_a= 453203
##$YMIN_a= -389085
##$ZGOPTNS= <>
##$ZL1= 120
##$ZL2= 120
##$ZL3= 120
##$ZL4= 120
##$ABSF1= 16.522
##$ABSF2= -4.171173
##$ABSG= 5
##$ABSL= 3
##$ALPHA= 0
##$AQORDER= 0
##$ASSFAC= 0
##$ASSFACI= 0
##$ASSFACX= 0
##$ASSWID= 0
##$AUNMP= <proc_1d>
##$AZFE= 0.1
##$AZFW= 0.1
##$BCFW= 0
##$BC_mod= 0
##$BYTORDP= 0
##$COROFFS= 0
##$CY= 12.5
##$DATMOD= 1
##$DC= 0
##$DFILT= <>
##$DTYPP= 0
##$F1P= 14.0000005364418
##$F2P= -0.99999901652339
##$FCOR= 0.5
##$FTSIZE= 32768
##$FT_mod= 6
##$GAMMA= 0
##$GB= 0
##$INTBC= 1
##$INTSCL= 1
##$ISEN= 128
##$LB= 0.3
##$LEV0= 0
##$LPBIN= 0
##$MAXI= 10000
##$MC2= 0
##$MEAN= 0
##$ME_mod= 0
##$MI= 0
##$NCOEF= 0
##$NC_proc= -4
##$NLEV= 6
##$NOISF1= 0
##$NOISF2= 0
##$NSP= 0
##$NTH_PI= 0
##$NZP= 0
##$OFFSET= 16.522
##$PC= 1
##$PHC0= 79.86491
##$PHC1= 21.39651
##$PH_mod= 1
##$PKNL= yes
##$PPARMOD= 0
##$PSCAL= 4
##$PSIGN= 0
##$REVERSE= no
##$SF= 250.13
##$SI= 32768
##$SIGF1= 0
##$SIGF2= 0
##$SINO= 400
##$SIOLD= 32768
##$SREGLST= <1H.CDCl3>
##$SSB= 0
##$STSI= 32768
##$STSR= 0
##$SW_p= 5175.98343685301
##$SYMM= 0
##$S_DEV= 0
##$TDeff= 65536
##$TDoff= 0
##$TI= <Analysis number 999999
Compound Code 99
Book Reference 9
Project Code 9>
##$TILT= no
##$TM1= 0
##$TM2= 0
##$TOPLEV= 0
##$USERP1= <user>
##$USERP2= <user>
##$USERP3= <user>
##$USERP4= <user>
##$USERP5= <user>
##$WDW= 1
##$XDIM= 32768
##$YMAX_p= 299809843
##$YMIN_p= -546229
$$ End of Bruker specific parameters
$$ ---------------------------------
##NTUPLES= NMR SPECTRUM
##VAR_NAME=  FREQUENCY,     SPECTRUM/REAL,   SPECTRUM/IMAG
##SYMBOL=    X,             R,               I
##VAR_TYPE=  INDEPENDENT,   DEPENDENT,       DEPENDENT
##VAR_FORM=  AFFN,          ASDF,            ASDF
##VAR_DIM=   32768,         32768,           32768
##UNITS=     HZ,            ARBITRARY UNITS, ARBITRARY UNITS
##FACTOR=    0.157963299565203, 1,           1
##FIRST=     4132.6476996994, 0,             0
##LAST=      -1043.33573715361, 0,           0
##MIN=       -1043.33573715361, -546229,     0
##MAX=       4132.6476996994, 299809843,     0
$$ Real data points
##PAGE= N=1
##DATA TABLE= (X++(R..R)), XYDATA
$$ [...]
27453 -135323 -93783 -120043 -67501 -63426 -133933 -28159 193160 227450 148215 47922 7438
27442 7438 -62542 -189137 -144681 -132110 -96759 -29938 12216 80947 111795 107788 184760 296594
27430 296594 362020 267923 122391 -30260 -21287 -122444 -82371 -18652 -68642 3989 76582
27419 76582 -56476 -58052 138912 148999 96069 -44803 -61433 -57523 -191791 -171299 -126774
27408 -126774 -78270 -177790 -48970 65185 31576 5406 -35080 -107755 -126548 -122927 -90336
27397 -90336 -23056 50903 4962 -23928 34678 69779 16359 11980 93439 80915 8660 -68689
27385 -68689 -104874 -29032 -75378 -91007 -95051 36200 28852 -34596 -14016 -40498 40285 78001
27373 78001 12045 -100785 -79297 -30963 105411 162306 129898 167477 93484 81960 91854
27362 91854 -4062 -22332 114908 272403 241219 273296 73290 -54780 -64192 -13974 10737
27351 10737 116230 66392 115604 189643 123808 119603 126414 114917 72943 38406 -61566 -152738
27339 -152738 -102555 -22990 -32845 -49529 -61865 10634 64524 40103 24615 58460 137986 244059
27327 244059 266208 53557 -96050 -54966 45402 43344 -4801 81477 130734 -62297 17555
27316 17555 13308 55628 -28786 -87391 -86960 -89522 89353 131877 126504 171115 183548 142030
27304 142030 92170 -23050 -23323 -39024 -194261 -244421 -4892 189181 279511 143252 11485
27293 11485 50318 421 43391 158852 273168 152061 110149 -809 3762 -6405 82628
27282 82628 71481 -13498 30041 125317 78465 18253 -30586 -91238 -21899 -65945 -103625 -38839
27270 -38839 -8554 42289 85084 80429 -11286 -5399 17341 -51834 -6800 24666 104407 159723
27258 159723 210249 154748 27671 -26986 -24968 160485 132391 18960 4312 22057 -51324
27247 -51324 -12437 -20237 48364 93009 18304 31451 -16754 -77171 -14879 106926 194167 206015
27235 206015 282262 184470 56805 16154 18955 1189 69028 -68646 -64495 55125 167984
27224 167984 206664 264039 248432 193263 178321 159452 168578 159472 107787 78520 92846 17679
27212 17679 89634 217093 116442 1573 -74482 -35731 10703 -10142 -47161 -46209 27165
27201 27165 25058 -17632 -97148 -116833 -14692 67537 35726 112899 126982 60708 38531 116959
27189 116959 52183 11213 -114079 -145120 -111957 -30762 11046 1144 69249 74411 -67820
27178 -67820 -133116 -76599 36526 41532 -71600 -47616 43724 48965 52102 -77581 -210717
27167 -210717 -255151 -102537 20151 187989 293900 216222 65573 -58408 -126512 -76894
27157 -76894 8026 14660 133034 140814 -9973 -41921 59838 48275 -106002 -111563 256
27146 256 73224 20863 -150438 19957 118083 83318 1285 -41162 -44102 12067 151609 142853
27134 142853 26673 -13808 286 45381 41171 73032 141731 114314 98596 40582 384
27123 384 19223 42157 49000 36645 -63301 -123074 -162274 -42309 19320 25688 -5990 -94820
27111 -94820 -125208 -66703 1056 12777 -7379 4611 85208 79314 174527 209514 84028 100386
27099 100386 137856 84760 96800 176703 202882 236054 63573 34228 28285 72899 76869 155829
27087 155829 238235 310444 179906 105897 87360 67544 -67389 -147223 -87387 -31823 -22873
27076 -22873 -75450 -150872 -73219 16803 34476 18561 -4541 122709 187153 105247 -2651
27065 -2651 -53028 -36594 116397 161602 18640 -85095 -31309 -49474 -51599 -96407 -135739
27054 -135739 -111757 26074 29303 66816 26614 -34006 -50986 64537 101743 59207 77130
27043 77130 -39273 -63420 59254 198828 182184 12552 -19049 -35244 -20709 11120 74505
27032 74505 149231 156011 78042 66877 23971 -25025 18169 54242 27545 47902 193735 244096
27020 244096 140588 -4991 -114565 -100111 2649 64806 -44536 -128316 -123504 -61587 -51655
27009 -51655 -78666 54097 138754 79129 21311 -19067 -74540 -74891 -21346 9445 106611 70641
26997 70641 -25472 -71895 -39496 -55139 -78730 -62877 -106839 -99183 -2344 -18877 -34896 -43473
26985 -43473 -55553 22103 123310 163183 9678 -69984 -146864 -125957 -121165 -23417 -50057
26974 -50057 2833 93728 20522 -15530 -33580 -22367 137466 104314 -144047 -198592 -153053
26963 -153053 -16120 -12441 -42762 -23080 47333 95020 40209 -3210 -340 -6070 -62526 -111117
26951 -111117 -118203 -179024 -186939 -312095 -279315 -238557 -203612 -169213 -47104 -92590 -26952
26940 -26952 70679 20846 104943 133640 50059 -50691 -89920 -21820 48652 34196 3692
26929 3692 -32198 -47061 -64064 -82477 -26612 49632 61860 118257 108241 82156 131945 143804
26917 143804 88643 57885 -35984 -51082 -109297 -175894 -166165 -18338 82469 370 21874
26906 21874 67322 -33527 -48715 -7531 -25133 -166667 -165371 -146687 -155817 -19982 35671
26895 35671 97885 -11675 -132048 -63655 -62301 23113 95879 148108 236837 173504 46508
26884 46508 -17210 -10662 -110963 -116330 -127257 5978 91755 6 -13331 -62664 -60251 -105143
26872 -105143 -80286 -41204 -110136 -43952 86343 148200 61342 34967 82708 -24855 -40045
26861 -40045 -10655 96111 184648 128211 180998 149199 52501 -22388 16039 72571 123873
26850 123873 137273 143010 111990 20779 -101650 -123927 -112664 -90717 -54570 -65392 -5903
26839 -5903 149555 296139 259149 66215 57908 68971 217484 218442 100212 95239 91266 137738
26827 137738 263425 191017 27126 -25416 24156 -51265 -119939 -164023 -114455 -131435 -85568
26816 -85568 20694 138603 92919 26234 52439 76821 45637 51026 114496 100168 -91809
26805 -91809 -60118 18446 -81413 -129863 -141580 -6139 60254 163455 81198 3719 21034
26794 21034 66872 -45176 -139655 -167894 -110816 -33386 16041 5364 -14277 34373 -17900
26783 -17900 -14911 46915 45652 14317 102572 14549 -46281 -98133 -43647 -94477 -136831 -21947
26771 -21947 -8431 -55423 -24117 -57985 -57657 476 -23895 76476 -3544 -6122 61355 124017
26759 124017 35235 -94599 -100472 -54070 -29994 25654 -16016 9954 32998 140733 202539
26748 202539 183749 57110 410 57939 158762 196830 213340 171802 134745 49041 -74553
26737 -74553 -33045 -10511 -3198 172126 169741 56685 48733 85908 -10026 -104313 -44022 79915
26725 79915 105764 167396 225040 221767 274300 325908 339354 266049 67512 -53338 -116499
26714 -116499 -38545 61610 69489 72599 150892 140042 119308 140345 11394 -3451 -63354
26703 -63354 -88316 -101859 -122978 -87803 -33883 -84918 -20596 78989 109985 -46379 -11453
26692 -11453 68343 100713 76282 33039 108253 130353 53698 -70025 -189734 -43461 49929
26681 49929 41938 105719 195721 197937 96187 14597 -112041 -10571 43331 69749 142842
26670 142842 37989 34785 77857 -12161 -73081 27741 25118 -19641 -39595 -19809 83479
26659 83479 50222 34200 36261 75908 55277 109109 160934 78823 -12447 -160965 -158165 -114922
26647 -114922 -119554 -259576 -263272 -97773 42246 60594 -2497 -7764 72318 108417 47519
26636 47519 -1555 20176 -25246 17289 -49317 -31367 16780 56292 -63465 -129907 -223346
26625 -223346 -120631 -127907 -48854 -152527 -214594 -215009 3151 20408 -140419 -163301 -140855
26614 -140855 -89424 -76624 -109435 -36443 48117 73021 -25473 -13503 24223 51863 133974
26603 133974 232529 255447 239198 65316 -16029 76056 221004 126653 -71561 -101483 73253
26592 73253 165995 98866 -93511 -241345 -183719 -81881 54733 107197 11566 -3405 66947
26581 66947 117827 117428 14831 -116912 -87514 105086 169975 133672 -72178 -50128 -12019
26570 -12019 78964 91610 61316 -283 141 138135 77466 56305 -32708 -147557 -131934 -58138
26558 -58138 -11732 105582 94479 -44224 -73552 -121204 -143925 -65090 58261 134932 668
26547 668 49095 78112 72602 116434 36644 57383 47536 20681 -71633 -127106 -73224 -102039
26535 -102039 -83800 48877 106323 28751 -8359 41663 137740 107498 68837 -118451 -155602
26524 -155602 -120665 -53975 -60018 -74980 -150997 -82149 -9077 174598 124190 443 -4718
26513 -4718 153142 170574 199775 207345 237473 258660 181152 83249 122624 55252 28171 62831
26501 62831 22210 -74883 43849 132112 14732 -40485 -19181 38109 20835 -114795 -241189
26490 -241189 -117674 -42732 -201721 -275973 -316748 -227123 -154581 -96685 -80815 -53197 5912
26479 5912 -11477 -2434 -4567 -9331 50569 84593 163088 220762 179493 178516 152680 237006 275017
26466 275017 277907 194503 112723 38427 -14716 -37253 -67965 -141843 -79053 501 77947 91027
26454 91027 6229 95058 124503 -6916 -28565 -8488 29992 -10987 23182 165897 142044
26443 142044 21777 -131381 -136440 -141964 -104540 -188607 -99517 -23240 62549 120754 92914
26432 92914 106300 165015 216913 168504 77805 -24751 -54058 -124635 -67561 26806 832
26421 832 11970 -33703 -58828 -64202 -68380 -19361 178659 241130 138526 17774 18370 -57672
26409 -57672 -96360 -91982 1786 52400 115253 8874 33195 83799 128285 216432 147647 18154
26397 18154 35690 53312 40251 12120 104908 159873 111442 67840 33671 134430 139914 83048
26385 83048 45776 90005 204039 81422 31477 12844 -9178 66374 130822 63710 80370
26374 80370 22628 73099 31600 86114 173827 206527 118481 44971 86375 94202 20460 79037
26362 79037 80952 -16242 -37792 -89223 13626 15828 -114251 -110091 -150832 -94316 26172 -70109
26350 -70109 -90556 45235 55468 -87845 -202200 -134419 -120409 -106236 -10704 78665 225849
26339 225849 185689 -39334 -98688 -43855 -109947 -211457 -143532 -63231 -55990 -113419 -147079
26328 -147079 -83602 -6382 17216 122386 42448 30652 42678 86838 13400 54563 124242
26317 124242 96525 72158 -33267 -58063 -8631 21050 51033 -18305 -22217 -63998 66242
26306 66242 88649 -46480 -101274 -132983 -104087 -215288 -167260 4395 87302 85190 44702
26295 44702 -44855 -100875 -9085 51975 122518 107721 87346 97922 45630 79906 97610 161712
26283 161712 53735 -134247 -169492 -159766 -13039 5145 -15854 87793 -45795 -91235 39107
26272 39107 137428 146363 142852 43680 -23587 110730 124322 76785 75555 24483 18420 -10826
26260 -10826 -28227 36558 68351 110558 88683 102370 59554 -5191 33351 24893 62272 14628
26248 14628 114694 139781 57616 -27364 -126399 -96163 -106 145178 203745 130070 -46535
26237 -46535 -142007 -21279 -24661 -9913 -3110 -44559 -71144 -126713 -159638 -175445 -156708 -170240
26225 -170240 -8939 155115 108898 -11612 -41637 -49343 -151437 -125637 -127545 -163048 -91778
26214 -91778 -114845 -87152 90976 25335 -65028 14623 49139 180 -60215 -110819 39896
26203 39896 103083 -2637 79569 146791 127673 171312 157726 77085 -77748 -39527 -13655
26192 -13655 -79937 -46776 4810 38483 115647 113014 102003 190338 220210 237091 74505 17611
26180 17611 -32138 -53990 48446 80890 99959 159348 116025 -16595 -3367 -32347 -139809
26169 -139809 -98951 -52602 -52834 52483 47604 11209 94460 122453 66601 9959 17897 -84902
26157 -84902 -68819 81663 123885 -22481 -20307 -10816 -42100 2783 1984 -16144 1102 -58468
26145 -58468 -9039 24448 16851 -47897 -18381 156818 232988 144365 21049 -20295 43001
26134 43001 128869 131800 53332 72802 124122 234572 237545 134095 -44407 -55430 -22512
26123 -22512 -22603 -17723 -11880 -19823 -55655 -54727 -36381 -132018 -277811 -363744 -331136 -151704 -182437
26110 -182437 -178495 -87033 -57365 -32649 -80144 42332 69997 35165 -33500 -49638 16097
26099 16097 -53793 -108428 -231702 -263828 -167899 -63289 -69722 -133438 -177197 -82120 28902
26088 28902 62750 60975 -133653 -217549 -140550 -56158 -80757 -122360 -113637 -110310 -56265 -113191
26076 -113191 -121151 -42079 28399 129587 162497 35710 34566 111012 124656 131702 70009 -3667
26064 -3667 65521 28968 75216 49694 6455 -3545 -24320 23990 25683 -91903 -98644 -127285
26052 -127285 -103972 -81026 -11381 82542 29670 -11008 -36073 -71978 -50209 -62938 -83913
26041 -83913 -30372 -108857 -156690 -125676 -171480 -164115 -48435 -20732 -16054 70405 151236 178164
26029 178164 142043 1021 -114864 -227145 -213648 -157889 -134185 -38537 7826 72406 10067
26018 10067 -25969 4750 53757 71157 110196 103151 156733 140953 20609 -17763 59670 72781
26006 72781 195539 187944 122191 107977 158892 86710 19503 -28896 10333 139551 200443
25995 200443 134945 -623 -51257 4156 -73140 -198528 -207707 -205673 -233989 -230155 -262836 -181528
25983 -181528 -110142 -24305 48448 81648 -9806 -28312 -8257 -5177 -94902 -76599 -91611 -73597
25971 -73597 -24060 41459 84999 183850 65271 -54047 -82891 31541 84810 68593 -69266
25960 -69266 -197811 -281502 -232717 -128797 -133834 -165099 -171389 -181627 -231202 -208645 -128529 -68142
25948 -68142 -26778 -125893 -68151 -947 25927 -29848 -35645 -1569 74136 218663 178478 52047
25936 52047 26976 33309 -62424 -98651 -152483 -50457 -97347 -272970 -275993 -323405 -162736
25925 -162736 -83205 -38863 -43454 -55615 38282 -17831 -27086 -66210 -93073 42437 74522 40676
25913 40676 101086 25097 8188 -60148 -132301 -98661 -24971 14877 87616 110391 96149 24201
25901 24201 36062 73158 -53714 -95597 -75391 67616 158611 107079 -64786 -53745 -38440
25890 -38440 -146035 -139858 -28812 26041 -16915 -121373 -174258 -208748 -125103 9435 40771
25879 40771 -34362 -62991 -16579 39699 135338 13268 41608 172133 142310 172917 146558
25868 146558 63633 -40571 -23628 -123901 -245220 -123208 -149738 -152615 -124271 50006 78727
25857 78727 -53106 23571 -23133 67040 115249 -99918 -210849 -226153 -114455 -39507 -154910
25846 -154910 -163334 -72956 -31648 -95536 -170943 -171879 -175976 -338181 -335427 -319486 -327313 -281373
25834 -281373 -193805 -82942 5406 131498 208329 215677 183688 120718 40169 -68609 34697
25823 34697 101898 91717 3499 -79265 -216637 -165415 -72276 -32097 -62510 -97843 -26387
25812 -26387 -127225 -129367 -58905 -56099 -10183 -57627 -92335 -136742 -70058 37106 -21098 -71174
25800 -71174 -26305 54808 62950 21196 23235 102222 117520 40091 -92606 -66250 70977 -32465
25788 -32465 18001 19230 21925 -15017 19948 101383 58135 -22724 2416 127012 71297 116884
25776 116884 187186 138354 131191 72737 37095 1134 -42041 -34558 -43877 -11079 26581 144745
25764 144745 166522 44985 -562 71670 41242 76006 76254 -51754 -37563 -83929 -125437
25753 -125437 -183692 -288876 -232124 -155932 -175526 -102498 2379 23967 41831 38118 15868
25742 15868 27032 -11959 21724 117517 83569 10588 6822 114058 170320 139257 132151 -19669
25730 -19669 -122978 -167269 -221585 -176160 -25346 34227 17856 45537 4290 27023 64695
25719 64695 109986 91737 164742 193550 248919 116734 -23284 -109207 -119902 -91922 -138366
25708 -138366 -192932 -179036 -122822 -96299 -132916 -206843 -187224 -5433 -23307 -80786 -120229
25697 -120229 -22143 33516 109607 103848 177523 249578 155732 60026 14588 -25400 42355 19237
25685 19237 -19408 41339 68302 54605 71862 -52857 -121378 25355 161130 121345 -38856
25674 -38856 -94673 -3135 147294 3360 -204299 -167279 -61255 13588 -50860 -100342 -145876
25663 -145876 -273151 -223812 -184582 -186115 -136745 -56423 -13946 -3438 -70978 -127337 -46633
25652 -46633 -178292 -195395 -8525 97003 80366 33043 -33964 33846 51352 16693 25988
25641 25988 -633 -23050 -14860 -22781 -67764 -141029 -113729 36722 81047 139522 133321 -6120
25629 -6120 -51295 -35473 -63941 -144143 -163781 -141378 -15549 -87890 -294593 -255567 -126090
25618 -126090 -102414 5263 -59367 -287208 -208794 -181976 -122364 -118082 -44309 -73414 -12390
25607 -12390 93002 165646 135176 25576 -25465 19732 76565 68617 -77097 -189997 -146814
25596 -146814 -74415 65172 62001 91546 120326 221891 149915 81647 92107 108018 -38864
25585 -38864 -125956 -198277 -55357 -23644 49265 33022 9460 63985 1386 -21317 47805
25574 47805 47499 79192 138930 129854 -1790 -107078 -30484 -35019 -116220 -107004 -70464 -71626
25562 -71626 1188 33071 70538 108262 -95317 -200574 -139574 -79391 -47294 -99530 -150951
25551 -150951 -65445 113674 213661 169597 92799 35026 -37359 -100330 -160951 -148095 -76571
25540 -76571 936 2789 -151412 -125451 9425 61889 75593 56259 123319 146944 104502
25529 104502 92248 6544 -46647 -131835 -14296 74287 46939 15185 11831 -21591 -45023
25518 -45023 2764 39308 8233 1932 -33978 -73134 -126542 -100709 -42941 6721 -18392 -138094
25506 -138094 -106848 -32035 78498 122887 110822 148735 203884 172712 95099 100645 19483
25495 19483 54114 175042 239271 56089 -34442 -40001 -16906 40375 32253 44263 -31679 -141855
25483 -141855 -146425 -137481 -168445 -174598 -181225 -38085 54378 67960 105769 7252 20412 -40297
25471 -40297 -47115 -48135 -26212 122 51420 125950 121126 52669 6821 -37808 -103615 -104790
25459 -104790 -64605 79329 98341 129708 91246 -26140 -108711 -188051 -145886 -108885 15995
25448 15995 52688 94845 131815 190934 192266 185154 125204 56716 45829 15461 -150801 -165485
25436 -165485 22020 154995 83109 42509 -3634 -106180 -174358 -181437 -33606 107849 130673
25425 130673 60130 84522 52171 -55188 -270876 -115379 -50598 -107959 -68746 -26557 4607
25414 4607 33903 17174 -26524 16488 -18597 -48359 -142869 -235380 -184054 -22671 -78577 -200858
25402 -200858 -288577 -183355 -59805 -35695 -139963 -145716 -172512 -146888 -80169 -138067 -4640
25391 -4640 160506 113733 109493 118390 101235 69273 82931 36271 10280 -62832 -60999 -6532
25379 -6532 39567 92936 92655 116597 142804 206512 222818 153530 75036 46574 -17164 -39104
25367 -39104 6054 -39582 -11205 73963 256114 204474 165733 61933 13548 29008 -37687
25356 -37687 -83432 -140719 -195666 -175286 -65082 -91891 -75380 -71021 -92658 -183721 -87398 -92854
25344 -92854 -94068 -67962 14726 52371 -51423 -113564 -50876 -40039 6937 -70974 -107669 -29676
25332 -29676 -52458 10044 127226 196013 126447 148040 53158 3310 39191 28116 18590 92427
25320 92427 155361 109817 45118 -71096 -41689 -11601 2475 -26099 -55926 16080 91999
25309 91999 22203 -109861 -223308 -150296 -39715 37377 -4538 -157083 -169774 -160188 -227203
25298 -227203 -120564 -103685 -106190 -98690 -184435 -234857 -97222 13283 -25125 -74251 -65909
25287 -65909 -35847 16167 16499 160899 203981 117729 20742 -85588 1627 87406 67070 150346
25275 150346 205343 287296 304670 238367 161633 66210 52442 -118284 -297045 -154899 -83344
25264 -83344 -148904 -112130 -63480 -60776 -58887 -18425 -9462 -9271 -28513 63744 10535 -75562 -159806
25251 -159806 -128276 261 78106 185438 235324 97413 68720 -63044 -161558 -181267 -181184
25240 -181184 -97016 -18674 -30864 -35657 -58342 -100396 -163876 -78534 -59611 -94008 -120961 42181
25228 42181 127738 110467 108664 40216 -119712 -95534 12322 -42827 -68297 14400 -133439
25217 -133439 -100593 48689 11056 -23253 -38837 -34523 119008 171877 47490 -132341 -94806
25206 -94806 21641 89805 18983 18947 38985 14571 37394 23349 -39279 -64584 -110280 -31319
25194 -31319 -103620 -92447 -28660 -131138 -134362 -154403 -65302 -3842 -1919 -245 -86116 -54881
25182 -54881 25708 23257 14793 -39775 -68945 -77044 -39706 -16211 -56465 -29252 9241 104409
25170 104409 138009 167364 204119 136405 20066 -30246 7702 -8157 -2614 72105 70156 16445
25158 16445 51618 97326 -11273 -154107 -90963 -21324 -38071 -84729 -57961 -182670 -77338
25147 -77338 -43035 31372 59121 -57966 -1269 -400 -41737 -96670 -42869 39755 131415 162549
25135 162549 245850 225484 198357 158891 70199 19132 -25423 -42145 -33256 -36355 -30805 36319
25123 36319 65532 38808 -39020 -67749 -19714 40253 47881 1826 -9143 27698 74965 57877
25111 57877 12488 -39929 -22197 -16800 -66001 -55100 37141 145628 220284 306041 302793 268400
25099 268400 323778 316596 275287 114367 128213 109266 27968 -24407 -79475 -65332 -146540
25088 -146540 -153625 15405 96155 94656 33537 -69193 -146037 -60874 -5892 -72191 -100202
25077 -100202 -66495 54485 44946 43567 80475 120845 116499 70715 97522 -44965 -36563 63280
25065 63280 -52348 -235536 -198098 -184928 -47734 -3597 24921 12362 57281 145225 218262
25054 218262 184040 60024 -3166 -30213 8431 96454 60722 20547 88056 74191 27602
25043 27602 111993 108108 17646 -7165 -150504 -91645 63765 35913 -13166 -35372 -53857
25032 -53857 -75407 -128269 -152582 -36502 78150 -27355 -82264 -119023 12972 65582 -75725
25021 -75725 -92600 -79387 -96610 -87543 -31461 -15537 -68510 -13057 72441 94196 -103260 -244287
25009 -244287 -166631 -231120 -76296 33128 -21238 -7600 -16116 -126212 -264608 -265488 -193886
24998 -193886 -86422 -39194 15626 43656 44979 8968 39254 25374 -87404 -171440 -214498
24987 -214498 -163474 -79826 30626 186049 170633 48196 32533 70114 71843 6511 56622
24976 56622 50945 73232 181874 198455 228203 218742 161815 178793 149812 165424 4691 -92186
24964 -92186 -65892 -18013 -21803 49283 132381 152180 115325 76537 80911 152945 154326 83214
24952 83214 111817 158544 66895 -30511 -26776 -105149 -215213 -208643 -149732 -29752 -6137 11860
24940 11860 -16612 -52569 -146953 -100802 -84682 987 -25198 -30914 11678 35660 -38411 -172
24928 -172 143652 46544 -51852 -47913 -75338 -48594 -79405 -86345 -72607 -93663 -136396 -46152
24916 -46152 -125874 -94906 -43860 -69401 -120484 -177156 -145819 -67061 -77407 -60050 67254
24905 67254 131295 658 -77305 96204 58007 50070 58829 -35789 -47566 -91165 -144268 -206850
24893 -206850 -142400 -58275 22013 107061 133718 12400 -118582 -141733 -129992 -128132 -58922
24882 -58922 45747 87199 134972 221092 246512 231612 166225 178548 64383 23606 122596
24871 122596 133349 -13027 -162755 -179751 -142110 -79746 -67305 -114029 -242567 -211799 -113651
24860 -113651 14472 58922 66714 26756 8416 -52779 -93570 4538 100580 82499 -63306
24849 -63306 -232384 -136849 -6627 -66866 -128910 -25877 118159 16354 13417 -16859 -60889
24838 -60889 -81428 -80951 -146165 -122729 -218474 -226888 -204676 -137415 -87289 -31379 56099 29034
24826 29034 -100415 -93553 -138426 -158076 -142457 -101456 -38958 69486 153817 33620 22344
24815 22344 67935 42607 60398 33014 -128130 -161102 -83532 -11339 -80604 -45790 10784
24804 10784 -15868 61263 104117 12924 -8445 103438 136066 113586 59737 88025 40594
24793 40594 90020 13390 11146 41346 33542 18856 -101643 -161452 -83619 -36447 87967 135563
24781 135563 162583 83092 11003 -14374 17845 -14441 -91769 -106941 -152474 -164510 -196011
24770 -196011 -132081 -82584 -41467 28435 109349 121582 110385 -14699 27359 -3302 -57795
24759 -57795 -119048 -173858 -64163 21613 93163 130000 85066 116206 159238 56361 29674
24748 29674 29211 114146 92493 146826 171694 154006 74803 -66954 -125399 -46834 -66706 -92534
24736 -92534 -132015 -89284 70136 -2049 -82581 21837 78651 180853 276763 134470 79504
24725 79504 -49353 -102690 -215931 -197027 -108079 62607 210263 140821 70384 30994 -58272
24714 -58272 -59515 46576 19167 -125387 -68520 69594 144530 236688 264513 174711 111445
24703 111445 153539 114066 60686 71224 50514 74028 187424 189418 235362 246740 167491
24692 167491 236000 248184 166528 52289 -12685 -66333 -138882 -166110 -223868 -274399 -206494
24681 -206494 -142645 -200094 -149801 8090 86461 74016 156625 136930 23188 92107 124413
24670 124413 71643 -39648 -29853 89979 25513 -19331 -87871 -6471 -47476 -48593 -83105
24659 -83105 -183578 -182793 -135523 -145371 -34995 -37034 -107080 -96525 -88299 -29738 19791 31413
24647 31413 -31087 -38992 53473 107623 74857 131014 165799 15190 13163 17261 -39491 -169297
24635 -169297 -44469 5353 -77217 -122706 -91403 -11182 28771 33266 42391 78134 159187 53222
24623 53222 -12243 67993 91622 27429 -50373 -101676 -88115 -3258 125343 163357 330282
24612 330282 301289 139389 -80469 -215808 -125710 -68549 -155928 -234637 -175537 -118566 -156657
24601 -156657 -211407 -247015 -146564 -129489 -225846 -189797 -112274 -53246 -6274 7403 -55947
24590 -55947 -97198 -62643 21621 99480 84948 113044 90337 20595 40036 -63247 -142727
24579 -142727 -172958 -107277 -84610 -44341 49173 20600 -22721 115002 -35994 -71131 -53614
24568 -53614 -30453 -37969 -148695 -152165 37118 42744 113785 176918 255683 198997 123772 26102
24556 26102 -471 -28240 -54593 116034 142993 130799 211534 121901 -11090 5898 140183
24545 140183 123102 75724 231168 293797 226524 238971 138884 2507 -550 43000 40093
24534 40093 -11374 -82560 -119071 -25009 78190 -9749 -105015 -83865 -45682 32738 -11493
24523 -11493 -67094 -110751 -179422 -165865 -191598 -198660 -211466 -145704 -72499 -7564 18603 39444
24511 39444 96908 55303 -22025 48745 66153 86243 107811 96000 125038 56057 36748 116952
24499 116952 38309 -86324 -93311 -38586 11850 -19787 141925 79004 -5011 -48223 -10287
24488 -10287 -62244 -82751 -46128 -175171 -191093 -191195 -213133 -52249 14430 13947 66798 138585
24476 138585 117454 115828 94944 144088 129399 122460 127842 79915 15611 102886 140049 104996
24464 104996 94517 142452 -59173 -135020 -43949 -25160 -152786 -89169 -12641 -6206 5241
24453 5241 -14843 94080 70945 -50040 -130504 -78048 10746 57630 81512 79701 123877 121730
24441 121730 99254 188569 256568 242392 171895 239465 154005 76656 85526 167072 119517 143199
24429 143199 186758 79242 14735 94403 114438 -56850 -26920 72484 66654 -667 -36283
24418 -36283 -101799 -54924 -77785 -115658 -171258 -120105 -83385 -108702 -49113 36538 -89206
24407 -89206 39365 114277 54029 46069 -35202 -164324 -256066 -233197 -128047 -20161 51821
24396 51821 66570 184540 115389 86563 127771 17334 15259 49661 80082 105164 113136 73827
24384 73827 8534 -6995 24978 93951 194970 110368 91202 153060 196714 139705 52035
24373 52035 -52979 -68080 -37638 -42104 6975 173128 199030 101101 160673 152399 71195 -15149
24361 -15149 -49378 -83662 -49812 180821 152687 40805 -8115 -121918 -15696 26985 6463
24350 6463 4134 -58124 -129244 -203038 -204189 -53506 57839 -30068 -86107 -51107 -177016 -239572
24338 -239572 -175364 -152690 -156036 -88245 -53178 -84273 -73290 -103740 -144552 -145987 2708 -29150
24326 -29150 -99130 -66675 -37161 -94336 -135933 -42002 43791 77675 -31919 -103334 -102007 -110990
24314 -110990 -39100 82591 46165 -93533 -176376 -79919 61615 95546 101585 103118 156472
24303 156472 5677 24464 96355 90371 -32964 -25584 -50140 -68362 -64752 -55435 2190 -4513
24291 -4513 4161 -11714 -40780 -64103 -139799 -292917 -353777 -373928 -220499 -76734 -34132
24280 -34132 -1294 7829 -115738 -120896 -66830 -105452 -51528 -60017 -61659 22919 67037 99696
24268 99696 23689 -894 37913 90917 111383 38201 -85443 -46698 -172 -55188 -85855
24257 -85855 -51693 -8992 1066 -70329 -167455 -122880 -110305 -51117 75833 40874 -12886
24246 -12886 3147 -34264 66693 96058 -5652 -14760 7255 4493 -73395 -113681 -63550 25150
24234 25150 49325 114970 -67760 -74982 28195 -13658 -16481 -7574 -28841 49125 82097 31234
24222 31234 -109886 -244720 -238086 -113833 -205852 -205591 27708 101296 69393 -14864 99503
24211 99503 168371 120812 63265 100567 106935 118789 204076 154452 104740 82036 96226 23089
24199 23089 -19515 6098 68789 15393 44986 142776 98222 11232 -39110 28717 -49108 -104540
24187 -104540 -128844 -150769 -218167 -160123 5606 141598 280542 337348 225810 76234
24177 76234 4383 50659 28234 -1076 37530 115849 56540 -37638 11519 -88 -13587 -43196
24165 -43196 -20514 -84031 -89626 -42442 -87263 -100768 -73439 -35553 96118 188126 132070 50171
24153 50171 9428 -45794 -102447 -169786 -248448 -205171 -193286 -99047 14726 80138 87207 51729
24141 51729 -15734 -140008 -191662 -58538 50197 118713 96606 91890 234129 206281 161827
24130 161827 29949 -43380 -1811 48865 108 -79797 -40777 -28344 -36660 -158730 -230708
24119 -230708 -188804 -155237 -47658 16051 34084 135128 264161 236402 140397 73188 119244
24108 119244 65686 37830 52120 -73781 -174512 -78937 33908 160825 112950 74061 31498
24097 31498 24843 -5635 -78595 -147245 -149365 -63416 -87893 -101303 -70195 51675 132743 105321
24085 105321 72090 -28146 -16562 -116426 -178375 -140126 -204070 -135222 32752 19637 -9588
24074 -9588 -47910 -133670 -172548 -166595 -64811 16399 -8199 -104751 -54327 128244 104314 70992
24062 70992 61046 60019 -6076 -64871 -21090 -40754 -3505 25913 64236 12963 -60845 -32454
24050 -32454 25515 113797 110043 202132 145881 -48228 -231035 -294026 -325800 -255225 -228109
24039 -228109 -173437 -148999 -149791 -104875 -95773 -56318 -8201 32427 24032 145428 115739 97969
24027 97969 138364 51284 -36071 -24996 16797 88194 8663 -79212 -48666 -11024 57895 -24107
24015 -24107 -48542 -36790 61271 -34739 -24495 91236 159694 55803 -140842 -117417 -10765
24004 -10765 2750 -24736 -24234 -59347 -68366 -17924 67496 64131 -18372 -20346 -45712 17981 137155
23991 137155 169853 186324 76886 -250 48908 91921 79979 23882 53367 99000 42827
23980 42827 102167 178160 42403 -25007 -7917 36297 121148 128273 35434 -71533 -80716 -23455
23968 -23455 -109327 -137969 -109759 -47729 -7432 51480 100607 17932 39511 43372 -16806 -11762
23956 -11762 -14982 -14471 32907 49861 45534 50352 -19580 -110944 -109287 -38942 49166 62611 -4018
23943 -4018 -95507 -74464 -40996 27868 -34662 -37728 -76077 -13586 127945 -21688 -84608 -73763
23931 -73763 -50064 -75231 -138182 -161417 -83732 -25929 11416 13117 18644 106310 155016 135654
23919 135654 156562 154572 88721 -61009 24079 28319 -77621 -116501 -231689 -233394 -111588
23908 -111588 -61863 -64612 -49028 -55340 18215 -79497 -100580 -43344 -80469 -157865 -81664 -111941
23896 -111941 -57296 -95022 -123295 -51302 -84977 -155676 -164525 -201126 -123468 -131508 -78926 -20404
23884 -20404 -15402 -175234 -172892 -101542 -69176 -11393 -175209 -145809 -53328 -29786 7570 160445
23872 160445 252055 210161 21566 -33045 73283 92961 71529 95655 96767 149990 101806
23861 101806 111631 169086 147467 83535 106008 -2019 -116840 -9698 30907 8637 48997
23850 48997 206424 254745 245981 192058 161408 111763 -7566 -76731 -40878 -30737 -103381
23839 -103381 -167815 -91691 -85614 -113926 -2186 204968 367876 458895 395211 222494 34675
23828 34675 52521 150732 178250 192786 55832 -1317 28442 52276 -24409 48359 15157
23817 15157 2768 -13312 -143836 -186845 -65467 16245 -47932 -128451 -202443 -296111 -207493
23806 -207493 -122985 -94203 -132480 -82849 -103186 -152492 -67737 79676 62210 -98502 -14052
23795 -14052 -13486 14173 7769 98502 68268 -43497 -18495 13353 10134 1299 -17531 -3560
23783 -3560 63198 69859 136718 95453 182604 98408 55448 -56715 -43092 -87329 -33990 20446
23771 20446 79453 61886 56288 9164 79665 139982 215601 168960 156476 28985 -26458 145086
23759 145086 22244 -117655 -97793 -53810 65465 53325 10799 42571 -40689 -82954 -108591
23748 -108591 -163425 -95977 -21632 -116230 -97968 -6879 -15596 16281 15103 -51088 -51730 -43304
23736 -43304 -26217 -39688 -69618 -97087 21006 82297 173094 81200 505 46915 63856
23725 63856 -33643 -61588 -21110 -38750 -56146 -137545 -216335 -244255 -82020 -191769 -209563
23714 -209563 -202396 -190437 -57462 43353 62034 41665 19079 -14501 -40294 -62946 -67366
23703 -67366 -26995 74108 83222 -11959 -21225 -123683 -138281 -60411 95542 115046 46157
23692 46157 12217 9058 -17143 -23254 2544 -10448 -2519 -105720 -14784 45519 3325 32223
23680 32223 -46486 -144494 -89985 -39659 -70282 7852 121838 75569 -11409 101725 64298
23669 64298 30575 54681 59611 88317 37318 39705 55051 93638 86702 72301 25174 -37703
23657 -37703 -109254 -16479 9972 -140997 -171588 -149068 -107825 -206556 -148571 -156421 -130972 67466
23645 67466 52265 -36338 -88205 -35299 -72942 29381 93423 134894 146843 108662 59734
23634 59734 -70564 -138620 -95800 -2617 109902 162752 172742 160602 -249 -22213 59152
23623 59152 268610 215521 163449 57309 -64664 -77543 -40584 -33290 -43360 -53866 -72989
23612 -72989 -116725 -105125 19380 4790 10272 53020 -45185 -62632 -36130 3356 26241 23565
23600 23565 27165 -89212 -36628 -123426 -154162 -108221 -86841 -112610 -78536 -159792 -35723
23589 -35723 38495 41941 29435 130001 171656 111459 103790 141903 73658 83899 164993 231252
23577 231252 206214 150092 -1943 -85615 -136507 -68885 -135509 -214314 -188784 -158391 -45361
23566 -45361 -6646 -72888 -62560 9470 137111 177467 66394 27364 53634 6661 -70949
23555 -70949 -53614 -4355 70284 51839 13124 -67524 -22130 -15643 -38521 69518 77952 -47574
23543 -47574 -200564 -297314 -126845 -104722 -88233 -59393 -40367 76586 -5233 -54626 -103840
23532 -103840 -65572 -20409 -83673 -146527 -123764 -59676 61321 134614 27618 57164 65900
23521 65900 4799 19536 58875 113183 220949 228209 55079 -4901 -27917 -82444 9056
23510 9056 61894 -1972 -103085 -181692 -187495 -168012 -123221 -90025 12143 -67022 -163550 -70570
23498 -70570 -102697 -95520 -81270 -61432 -24096 -10061 23804 103750 40921 -23461 -88245 -103784
23486 -103784 -11384 -75982 -71843 -10780 -19788 14381 69816 108297 89867 6311 -103227 31493
23474 31493 70890 625 -38122 -116356 -115585 82745 176141 49537 60309 59513 39612 37987
23462 37987 50702 -3967 24679 130528 116146 44958 -53131 20830 127713 176756 78360
23451 78360 59327 58448 101059 141941 71506 96150 -35336 30048 67700 27806 -22747 34069
23439 34069 73604 -13305 -67828 20340 93250 -12886 1201 113796 100966 55947 39701
23428 39701 10949 -68279 -161207 -123152 27133 41342 -15121 -94126 -168678 -159393 -91995 38685
23416 38685 -21190 22455 -34336 -75971 47194 76616 128181 96185 8945 55424 13519
23405 13519 55515 134200 161653 108678 -44522 -72161 -61077 -5847 40709 32360 26659 79785
23393 79785 61571 -28934 -59989 -111472 -199420 -147349 -55285 -44125 -141909 -81518 -6226 32041
23381 32041 25205 -57464 -78797 -121585 -189837 -134945 -57833 -590 60950 -102403 -35062 79007
23369 79007 22311 -29882 -41037 -98520 -6571 -6278 14964 -23268 -60601 -69406 -108808 -110864
23357 -110864 16263 37363 54371 4041 18960 60915 -21925 39666 89291 130829 83605
23346 83605 -47259 -28991 64625 161675 192233 110463 59686 -7935 -40843 20030 -41485
23335 -41485 -83126 -63345 -47514 -11077 2517 3740 100432 119065 -23041 -164886 -161065 -99995
23323 -99995 -78788 -47737 77692 85238 24250 42113 60807 -16003 -20694 96757 96694 34014
23311 34014 -32338 -45124 -120986 -170938 -245474 -244814 -163424 -59797 -14673 21143 -106114 -124836
23299 -124836 -99235 -65138 -56197 -39622 -73791 -16087 -30785 -50921 -79908 16431 -125021
23288 -125021 -70353 33321 17613 27753 1014 18715 286 -32888 -10415 -24924 47728
23277 47728 4767 -15315 28880 61348 14702 -71188 -252625 -256588 -107833 -82756 -123819
23266 -123819 -99337 -172370 -288600 -297946 -246238 -197284 -182836 -137146 -268 78312 -12563
23255 -12563 -11430 -106327 -87329 -89254 -246533 -232138 -73864 -5454 -133743 -98530 -4369
23244 -4369 -4337 -9916 -13110 -886 -63692 -172883 -118925 -104217 -150753 -176839 -150325 -160129 -124902
23231 -124902 -201645 -216637 -129665 -129088 -113217 -112025 -33650 22667 54267 -10408 173112 163669
23219 163669 143610 174833 235966 87807 21382 57087 116639 101587 128111 41918 7648
23208 7648 15951 20196 -43435 27513 100136 103788 109901 88461 3405 55190 43478 -9240 -189000
23195 -189000 -204247 -94712 -20835 6390 -16687 -40196 -49593 6740 132362 167171 264987
23184 264987 259652 46399 -25360 -92463 -15740 -20857 27596 -77142 -138394 -62460 44714
23173 44714 118653 17639 -3437 -26188 -111281 -141724 -16691 54735 60979 -1955 73501
23162 73501 153577 98775 83829 94415 54387 51847 121171 126587 -8214 -125299 -102185 -4727
23150 -4727 102536 143226 150196 57193 -21782 -64435 -72218 -50289 72775 91003 16696 -18827
23138 -18827 -73907 -94272 -128788 -110441 -134431 -25605 -75804 -66061 -27522 36436 12151 33401
23126 33401 -92 51995 94137 183117 135953 106952 129310 228844 239718 232930 134736 -15076
23114 -15076 6373 59002 39672 115934 57956 23298 19130 -16309 -133799 -115396 -7197
23103 -7197 153448 167533 200628 157766 70443 108442 128885 -142121 -195959 -225194 -154247
23092 -154247 -59250 127768 228224 197365 3646 -38659 5522 30005 51510 8373 74612
23081 74612 175817 191736 92380 68596 -20457 -22997 6585 -6659 10192 71147 23165 -34336
23069 -34336 -8184 -95434 -118826 -31110 63951 175514 127809 -13726 -93321 -50944 -68639
23058 -68639 24079 48230 -32411 -40146 -6715 -6650 25893 2476 89589 98691 19659 104036 55985
23045 55985 33628 11747 -7261 18241 196008 265056 243320 258313 250694 218097 199902 216518
23033 216518 82564 -19040 45878 -5934 11515 120195 180894 163978 150321 156492 134827
23022 134827 193542 230439 234888 139063 -19657 -97556 -109398 3956 61283 80539 117726
23011 117726 -42624 -94376 22672 48577 -29971 -90779 -103664 13787 -11432 -2430 -56823
23000 -56823 -31364 22933 18355 24724 174702 263130 172794 61295 24428 50957 58353 18094
22988 18094 -5336 26666 40743 -70571 -28659 -97229 -76392 -42070 -25521 -5972 59606
22977 59606 70890 85459 128330 97247 74214 31384 -71488 -132988 -48167 55943 1741
22966 1741 -37459 -130644 -192573 -214373 -157173 -151444 -147943 -109686 -79030 -163484 -196060 -84894
22954 -84894 -80096 21466 101354 33843 -48895 27789 55608 86521 90463 68904 89709 170974
22942 170974 178165 85327 -7280 -50921 -42641 3772 19159 48916 -92211 -144603 -189405 -118931
22930 -118931 -58900 -33958 -79758 -65508 -90529 -130893 -51584 44832 -38229 34296 226420
22919 226420 270321 103598 -35015 27745 84818 16217 -97495 -41371 -12862 -55239 -40795
22908 -40795 -57678 -100078 -21009 -12194 -30771 9927 35831 13898 -38611 -146730 -287998
22897 -287998 -164948 -158015 -183551 -90363 -48220 -55754 -91745 -79277 -67360 -78915 79118
22886 79118 80379 26676 52933 19360 26438 20968 1277 -7065 -104518 -68697 -51202 -89669
22874 -89669 -184178 -194538 -127181 -66422 -96236 34154 151472 174711 78333 6220 -18966
22863 -18966 -65571 -84375 -37699 38863 48301 43643 30283 57453 147096 164530 80121 -32874
22851 -32874 -143873 -102127 -151886 -153513 -86685 33647 12063 -67774 -156512 -78115 -102583
22840 -102583 -34112 37902 58125 68420 77225 -39262 -31199 -34933 -111843 -175762 -152726 -87418
22828 -87418 -87034 -109842 -52462 -131687 -142874 -110864 -44038 -62277 6022 28158 127987 134666
22816 134666 896 -63689 41572 103508 178902 175720 18480 43012 15187 -53955 -6404
22805 -6404 -24392 31555 -6242 -40088 -16329 45673 138941 90014 104230 126231 98181 13905
22793 13905 20361 59066 217384 221290 69871 -3510 31596 133188 131487 82062 -187292
22782 -187292 -241193 -136804 -45849 -51320 -163137 -123030 -39568 -71488 -18584 43735 -66449
22771 -66449 -78184 33592 100523 103127 19798 -55858 -136078 -183133 -222445 -52980 1805
22760 1805 -38641 14614 82316 -54073 -228137 -183842 -75211 -76901 -110869 -83129 24131
22749 24131 150032 25113 -92880 -87171 7778 70958 99082 9330 -55089 107754 64877
22738 64877 -32995 -11472 12957 53410 79909 78181 155707 160036 155248 72336 110401 49137
22726 49137 -97762 -31311 69195 139296 85815 65090 44593 -33820 80668 115039 85329
22715 85329 -56116 -138802 -149218 -106952 -60437 -53624 -82474 16742 -24751 47104 136852 124817
22703 124817 -31102 -116800 -168630 -199222 -53492 54909 13645 -36001 -59904 -57381 -80419
22692 -80419 -84498 -101435 -71650 11962 39974 69726 -16902 -11901 -1564 59231 -2750 -118238
22680 -118238 -105398 -130379 -95745 15212 135850 112518 -188707 -250474 -161588 -78175 -36243
22669 -36243 -64743 -111403 -102563 -95919 -114587 -56183 583 96157 62384 -43673 -5890 7285
22657 7285 -10839 40090 -32471 13334 61780 139207 90463 88906 69963 112147 11189 -49502
22645 -49502 -98516 7806 41477 5444 82846 60229 36365 -2915 243725 276588 51996
22634 51996 74536 93645 -838 -18122 -27975 -137032 -158661 -163477 -112025 -73822 -57512 -32803
22622 -32803 -94352 2404 161366 198159 106115 4861 26100 -84030 -155447 41994 40470
22611 40470 -103073 -154511 -161230 -141623 -166438 -134613 -166755 -231769 -270531 -158726 -124200
22600 -124200 -114762 -95105 -29886 46705 147693 155479 135897 139545 89120 1736 620 -16016
22588 -16016 11075 77338 -47255 -26273 23538 50654 45296 37749 73366 89159 -82901 -188278
22576 -188278 -335565 -396431 -323864 -189645 22043 104019 63195 -65246 -73990 -125256 -84826
22565 -84826 -82485 -103115 -64942 -53605 -101723 -70107 -151396 -268157 -182322 -12619 91486
22554 91486 10205 54020 92929 131599 104862 87326 83934 14949 21409 136956 201633 199287
22542 199287 100086 28102 21922 23644 50057 64058 56830 -37345 -41036 21063 105494 268304
22530 268304 267481 44394 -127505 -210509 -243286 -271722 -282654 -177598 -34161 28627 100420
22519 100420 50696 57062 5101 -39726 -56388 -22765 16763 -33754 -127473 -88770 -37593 -27757
22507 -27757 199592 182620 148673 107493 108296 14855 -62980 -43547 -123849 -148845 -146478 -106954
22495 -106954 -52282 -48444 60113 136696 64050 68452 23496 9047 18217 -98108 -23312 -6613
22483 -6613 -164162 -92692 -54841 -12165 18177 -37602 -90416 -46055 35437 -14013 -135603
22472 -135603 -225621 -239922 -177424 -90823 -57427 -14562 -35059 -104908 -105333 -111866 -29239 -6678
22460 -6678 -109721 -160640 -247397 -111406 52793 48909 106689 213104 202280 76949 93173
22449 93173 75620 115509 93393 40571 -12621 -126833 -273966 -232014 -185353 -167250 -72143
22438 -72143 -51593 62879 96380 130404 186430 182894 101912 91210 58123 46578 140310 57372
22426 57372 -36406 -89853 -93948 39027 233234 246175 156312 120240 125735 100824 48502 -41013
22414 -41013 -52779 44200 54806 -5773 -22965 -38841 61199 183212 61367 -80137 -63860
22403 -63860 -83337 -69096 -25083 45340 103013 6583 -74621 -34101 43854 113736 163490 77338
22391 77338 40000 -44402 -103604 49033 90185 74194 88951 118636 55706 49836 91310 132805
22379 132805 129867 111233 122381 92983 -17260 -92030 -114746 -89405 4803 -63793 1298
22368 1298 33712 -100110 -202006 -182138 -134758 -99005 -44885 -105435 -164336 -70543 -34919
22357 -34919 -112489 -80464 -181700 -177691 -65847 -10630 -38274 41601 120951 149289 152600 167755
22345 167755 168904 182119 136019 58143 72244 -7425 -49607 -13334 10803 -41617 -13026 -55316
22333 -55316 -105137 -171276 -229229 -165995 -117903 -54126 -10638 62069 103066 20082 -53433 26414
22321 26414 131043 116844 50808 21470 -11825 -97530 -144437 -146223 -121276 5123 110271
22310 110271 4695 49133 122754 99349 86891 187479 225680 49259 -134440 -129532 -248
22299 -248 70499 -14129 -19468 69004 -9068 -57470 -6822 -310 -112816 -58039 11476 -31259
22287 -31259 -98174 -139334 -132761 -73235 -11232 -65686 -31089 20663 49253 87140 66204 -13554
22275 -13554 -159704 -155425 -135750 -11909 -51417 -115318 -240330 -156721 -79409 -43465 61347
22264 61347 102100 101610 -131685 -217004 -98472 48981 -10691 -91618 -28769 7254 -88345
22253 -88345 -148930 -51064 24089 29194 -76643 -37126 7408 8489 -88344 -88121 -106936 -105383
22241 -105383 15418 86880 62346 29624 -6507 16513 99888 38983 -20897 -56014 -124261
22230 -124261 -200758 -172643 -6342 120387 97907 73593 106906 127600 64923 124274 165085
22219 165085 83676 16808 86064 126222 160558 129138 59403 28153 81428 170753 173680 -2592
22207 -2592 -9160 -15570 10932 -45124 -89151 -114996 -118147 -194329 -88412 87013 -18915 -22587
22195 -22587 76860 -57757 -107677 -43063 -72613 -163616 -232734 -293655 -232697 -174907 -133712
22184 -133712 -61178 10181 40229 21861 77026 135003 49279 -86506 -110297 -52305 95631
22173 95631 62935 8356 -17791 -72002 26464 97031 26359 -128936 -125041 -38730 10592 -1839
22161 -1839 14018 -72674 -148721 -125356 -139612 -58866 52919 41833 26962 -74062 -99919
22150 -99919 -13229 -12780 -49976 -48405 -22774 -18026 43234 15325 70739 -85073 -276452 -221329
22138 -221329 -30494 -14893 -51287 -43319 -33944 -38442 47837 92652 93929 -51171 -30300 -83885
22126 -83885 -167641 -122704 -62516 29733 -5623 40463 -10328 -62598 -124899 -91601 -72564 -57598
22114 -57598 66673 44001 3432 51855 108213 24810 -151590 -173055 -160302 -123076 -26007
22103 -26007 32996 -16274 -32308 89134 206956 120459 137245 82338 30985 -86421 -106450
22092 -106450 3121 70783 126869 172226 205921 174416 69715 18583 51018 104854 134861
22081 134861 166808 123440 -50039 22929 135198 137969 192799 248996 152778 198893 55780
22070 55780 -137387 -165891 -81922 -40977 26864 235003 257521 269992 168600 91511 94043
22059 94043 6195 -33175 75876 48180 -34940 -40060 -31605 -50958 -138738 -166311 -176140 -90381
22047 -90381 -96672 -95146 -19010 -11165 -16886 26878 38732 -13361 -15963 75200 77758 26236 79511
22034 79511 93601 19751 40249 84194 -43514 -114555 -79213 -82469 -25016 18970 8915 -107735
22022 -107735 -46896 60181 166874 239961 177669 130929 107984 144447 121646 66009 25210
22011 25210 75380 9461 -60398 -68349 -153780 -163707 -115176 -97511 -96031 10051 60487 2736
21999 2736 -152543 -139250 -69317 462 -31121 -6944 -49087 -93163 -97192 -64453 -47979 -108733
21987 -108733 -114915 -49060 -58691 -65117 -180573 -192426 -157321 -40268 169961 85421 -100319
21976 -100319 -195019 -205496 -306700 -318541 -180606 -165427 -185355 -106763 -87034 -134309 -270870
21965 -270870 -328767 -167363 4377 -4816 -11197 64124 89186 -136810 -140432 -30099 -31852
21954 -31852 68454 -2227 -110457 -73458 -69987 -84644 127480 147323 83863 61029 -63208
21943 -63208 -50087 10943 50731 60403 -19665 3700 74575 78969 -15181 -57450 -196632 -204667
21931 -204667 -76775 -40234 -112953 -116403 -58977 -32416 100017 60903 -25159 -6442 112023
21920 112023 140584 132648 126651 183155 55342 -26982 -64384 -19566 -8681 27292 -78000
21909 -78000 -87153 -73787 -94963 -84098 -144792 -120027 5997 -73154 -207597 -211698 -72499
21898 -72499 -9147 21939 116097 189083 113381 46626 -43140 5569 54538 103861 151482 150271
21886 150271 68675 72086 173967 122710 12139 38102 -31247 -157804 -51790 -8927 39873
21875 39873 59186 75917 88085 117333 161489 -23175 -74158 -44764 -19709 90970 35457
21864 35457 44541 200686 145320 137046 156628 85185 47761 -10507 92881 92370 125524 173727
21852 173727 200877 153691 117763 121609 39579 57412 143799 183135 64212 -26013 -129077
21841 -129077 -103958 -51889 13986 -96908 -129168 -145494 -30090 -25729 -130017 -165783 -204076
21830 -204076 -171108 -102449 1236 46644 57476 11504 31784 -23086 -32498 -117473 -122737 -117010
21818 -117010 -14931 140118 107888 90197 66787 140458 228623 224533 166999 56097 -19312
21807 -19312 -89675 10451 163312 262793 193613 126698 173704 200040 -2059 -85424 70392
21796 70392 37576 30579 136418 203483 220788 157277 92749 64779 51379 123863 121780 105531
21784 105531 32760 50726 126985 72634 42376 73688 -2382 39331 130129 140286 93114
21773 93114 130765 79697 -68048 -131918 -40098 -27863 -102721 -126626 -77989 -130150 -156069
21762 -156069 -101127 -47225 58965 161398 184921 124178 -27486 -103212 -21489 -3119 75426
21751 75426 44540 41806 30817 9901 -64944 -160243 -37611 16796 70514 239720 252684
21740 252684 71259 -13399 85249 151498 26950 -82164 -55895 -5999 83390 101455 75384
21729 75384 71579 86267 20449 -101213 -215188 -150914 -118718 -217839 -274083 -340492 -276004
21718 -276004 -36930 -47504 -61625 -4491 -27083 -73411 52782 98078 80246 69360 84628
21707 84628 22570 -54742 -99886 -38028 -26245 104722 11734 -115403 -150845 -180534 -166624
21696 -166624 -142874 19996 153669 116331 -10944 47003 138538 84502 149537 232093 62976
21685 62976 -2349 132439 259472 117757 -31655 -2658 -6776 -176738 -192525 -225692 -257710
21674 -257710 -160834 -35549 19531 106838 148863 110043 72991 52715 134300 156337 70210
21663 70210 -33551 -56285 63479 137418 76309 71612 59144 32461 2462 -37672 54196
21652 54196 119705 18104 3962 62817 -27274 11821 88946 101266 234269 231038 60239
21641 60239 5843 25411 102742 83697 118742 133653 135912 90291 6658 -26313 -58421 28524
21629 28524 -41496 22617 75871 5384 -85060 36842 47728 43713 39079 54227 30834 58635
21617 58635 -3089 -50292 -21702 36660 92710 74291 38901 28129 128499 106487 31966
21606 31966 59706 -2563 -101964 -191174 -228974 -312810 -293076 -164236 11753 8124 -17006
21595 -17006 -94380 -159755 -85428 -64591 -28889 -13712 40908 28004 4523 48280 -55955
21584 -55955 -110422 -664 106664 131098 155013 180561 305044 258518 160827 80294 95154
21573 95154 213669 97736 118330 129899 46784 58087 66428 145482 182449 48108 -8595
21562 -8595 -109925 -141452 -168359 -111259 -115655 -78942 -4110 -69382 2192 -92379 -109237 -40721
21550 -40721 -75843 -90517 27258 59468 123914 146467 211137 147642 56824 76397 43684
21539 43684 52101 95265 120538 109677 52234 -41747 -42470 -38919 -91335 -79516 -33162 63385
21527 63385 -10538 -12409 -107409 -121688 -24679 53513 61548 116086 102623 75714 192926 249430
21515 249430 204854 126142 26259 -61780 1096 -27920 -7438 103624 105284 82314 125589
21504 125589 148580 161290 164272 115639 98734 106345 60271 30211 -52053 -116588 -107354 -57455
21492 -57455 25762 62690 79753 107474 17712 1387 5233 46925 123106 155451 164360 194900
21480 194900 150941 53316 -42789 -26790 -20476 -152819 -142184 -205799 -299463 -167321 -49827
21469 -49827 -5068 -2248 -78116 -93462 -136732 -81827 -11986 -10576 85033 56278 74770 78873
21457 78873 49413 11731 -55470 -188390 -251594 -200204 -221320 -211215 -81473 -31194 -26119
21446 -26119 21022 19532 -10094 41333 146506 202993 96087 25140 6158 201598 278582
21435 278582 -41354 -118860 23398 -24041 -100561 -76100 -51173 18338 31285 22975 -18027
21424 -18027 -83487 -79574 3384 117388 -59867 -236853 -209389 -62138 57631 120818 150539
21413 150539 33821 -57175 -56428 -24396 -1338 52042 182876 220847 187873 -48292 -46348
21402 -46348 28679 108348 37178 20745 -52803 43442 131567 21770 -38524 -44100 -32838 -78569
21390 -78569 -124143 -185277 -80261 38168 76066 98684 51223 -34902 -152287 -173273 -65092
21379 -65092 -88799 -115838 -122250 -212529 -196072 -89401 -16654 37141 32688 -26711 -31624 35670
21367 35670 52811 79188 86365 24842 45673 53260 19232 109010 40121 -56443 -102178 -96064
21355 -96064 -97778 -34029 -179720 -10604 281012 242975 140700 33960 -82107 -31537 -9223
21344 -9223 24549 159560 153716 134075 227092 137018 53026 -25647 -53996 9675 -38272 -56392
21332 -56392 -51725 -49583 -42191 -17127 -12346 -7015 -8643 -85191 -113862 -23875 -28218 -66597 -204676
21319 -204676 -216635 -40729 95931 131462 61722 -6494 35173 127340 106953 60272 13222
21308 13222 47566 -27087 -16821 -7285 -10449 20085 80892 136602 199444 50723 -162319 -238674
21296 -238674 -231681 -267383 -289575 -202448 -160663 -217991 -216495 -184886 -224322 -159654 -85597 -88547
21284 -88547 36960 116215 111557 -17955 39316 216549 232626 145895 114880 134727 87433
21273 87433 127950 126587 16395 -154100 -144364 -75465 -164964 -162471 -34177 -59666 6201 112741
21261 112741 9566 -17481 -22348 13026 47663 46358 -3336 -118048 -148590 -122923 -90971
21250 -90971 -102638 56642 125576 114741 9779 -75141 -46653 -23038 25434 124184 180566
21239 180566 133599 -4106 -59864 -21581 -48575 -79052 -20455 -37539 35091 63754 -72820
21228 -72820 -137074 -33801 -37507 -9743 91614 160470 182149 181626 38787 -41135 -49753 -43791
21216 -43791 99489 117595 -26618 -69797 -148052 -168280 -8153 76464 53429 -67129 -44693
21205 -44693 -56620 -100542 -3311 60783 31894 80322 74750 67968 88070 51926 -63110 -141225
21193 -141225 -84918 -102582 -150437 -206899 -228953 -323960 -277704 -209881 -60023 -65132 -125241
21182 -125241 -84962 10936 -19477 86513 56748 -5520 36373 128794 132648 76268 185776
21171 185776 214241 190185 70568 -15690 -67261 39718 176640 179002 128152 6259 -45266
21160 -45266 -74186 -89590 -146457 -258266 -150536 -64012 -64723 -144401 -142120 -14200 85089 75659
21148 75659 66847 78857 106401 -39258 -119930 -52903 8464 -71129 -98264 -129602 -83615 -14587
21136 -14587 10601 30042 104954 118810 17153 -41270 -256637 -266201 -253812 -116223 -133783
21125 -133783 -107678 -85757 -109383 -113860 -154317 -82145 7115 -38768 -111001 -219744 -195133
21114 -195133 -68298 16430 78644 77095 136165 28142 89275 107887 98534 136692 94419
21103 94419 119258 86452 85623 172470 197993 183373 99932 8345 5506 7562 47026 148501
21091 148501 121602 200508 109952 -14472 -41515 -93732 -137452 -130442 -169667 -178612 -169769 -136041
21079 -136041 -229014 -181825 -13579 118214 66095 -69034 -42055 -117454 -167542 -196176 -159497
21068 -159497 -81082 -68950 -161253 -145823 -158313 -301430 -125644 -79253 -133558 -113826 -86244
21057 -86244 -8423 50178 113342 165406 167635 107524 126011 190367 208645 112955 108572 163825
21045 163825 130012 52447 73521 123774 162385 164478 282182 237254 168400 166689 170224 114556
21033 114556 4397 144743 71822 43319 57188 -132296 -155959 -40065 -96318 -71442 -6995
21022 -6995 -68041 -44157 -53730 2457 -817 28966 -33839 -104563 -72560 29379 -42677 -160606
21010 -160606 -91479 -59638 -128278 -54410 -21132 24896 -4852 -21052 -49699 -69764 -116952
20999 -116952 -178322 -128097 97743 119160 49966 -15179 25372 -36707 39918 69031 61551
20988 61551 -43004 -155695 -261594 -299966 -169436 -117897 -169468 -199410 -249907 -224085 -154432
20977 -154432 -126835 -108244 -121860 -60810 -43873 -106941 -139651 -133153 -176876 -246578 -190768 -133678
20965 -133678 -162516 -84792 -37107 -39699 -2476 -41756 -190718 -312281 -169136 -71847 -164310
20954 -164310 -183762 -177921 -255417 -202414 -87411 -40438 -112681 -166347 -146538 -137014 -72391 -25893
20942 -25893 126704 112573 106029 105722 100251 81335 82619 -29027 -108227 -150309 -51691 -58669
20930 -58669 -39608 20874 -8579 5308 -111418 -109569 -73788 -69220 -216669 -419872 -287455
20919 -287455 -65298 -31346 -16774 -72853 -75504 -73630 -197509 -91842 107547 114463 45750
20908 45750 39589 65469 -30105 -54340 -659 34648 -6715 10833 75425 20591 -49426 -200419
20896 -200419 -279817 -200077 -175729 -172162 -101702 -90779 -17564 1077 -16221 -133688 -116879
20885 -116879 -100276 -73240 -82553 -16229 86584 35329 131515 148814 98557 53226 -14513
20874 -14513 42299 138016 186515 56215 1970 34611 26764 -19742 -25211 -25575 -51280 -75949
20862 -75949 -29911 -65984 -95136 -71007 -18154 -43142 -103602 -81004 -20764 33730 87462 38189
20850 38189 89650 110233 20252 53053 128187 -40152 -147596 -72747 6941 -52707 -47626
20839 -47626 -67030 -72277 -3851 -62792 -7694 -16320 -25702 23474 98226 73825 -15679 13565
20827 13565 -50760 -142625 -90531 -154360 -168823 -90152 -104722 -107721 -57412 45141 80696 142725
20815 142725 95860 -58001 -156526 -137003 -180778 -184694 -38752 22483 40590 -41486 10115
20804 10115 19289 71275 114518 -34745 15228 49028 148305 158608 130116 54719 139157 144521
20792 144521 -3096 -118603 -241870 -170397 -156603 -58875 -28533 11639 16095 169314 156995
20781 156995 89321 37645 95633 144849 96723 10486 -110024 -154167 -88114 -59056 29284
20770 29284 59103 -16806 -103001 -125431 13854 149861 75952 97540 84456 20126 49562
20759 49562 24172 31896 141106 209286 63661 -32613 -66899 -53798 -120754 -252063 -236022
20748 -236022 -197592 -43512 -141315 -139024 21318 154824 111154 26398 6847 -48634 -89281
20737 -89281 -56141 -36626 25841 14793 41360 76100 32295 5294 78207 94629 36418 30359
20725 30359 24286 67764 30470 25829 79888 81214 57076 -1931 37319 105470 220317 147932
20713 147932 77489 132913 57876 81916 187001 237819 217804 163843 101603 28443 -10004
20702 -10004 58256 107729 101803 118261 65926 64368 3168 12501 99888 161750 156207 132152
20690 132152 90464 4490 -7677 39119 109431 82605 56084 -6474 -18732 97229 47453
20679 47453 86435 35754 -3779 21290 17594 64909 58188 48769 -73761 -137488 -169483 -150316
20667 -150316 -201965 -41068 49761 52769 57810 24006 -28178 -70367 -9449 -2084 -15547 2745
20655 2745 -61765 -88715 -5018 -33331 35532 131462 62310 4690 -42787 -136757 -98353 -47721
20643 -47721 -14602 48330 96810 31120 -46077 48450 132513 196327 94966 -5342 63309
20632 63309 46241 79145 6179 43945 8944 -65897 -73395 -124195 -110117 -144094 -60383 13924
20620 13924 12723 -91762 -91438 -29214 33297 66327 58875 51670 -31574 -126190 -166727 -46256
20608 -46256 -16457 58077 53415 -53859 -118890 -67567 81665 125567 201302 213962 70297
20597 70297 30002 53682 -108885 -18301 41416 142907 4262 -106087 -157394 -106896 35300
20586 35300 98350 63137 95547 190867 224379 183457 82841 9961 -60986 -47053 -50294 -55850
20574 -55850 -25644 -109201 -155540 -87765 -18376 82997 161633 120600 -29647 -59285 61584
20563 61584 147431 132689 53750 -7224 -1294 87861 69617 -91626 -134951 -159482 -69096 -17645
20551 -17645 14701 78395 132638 65270 -5188 12635 118078 175753 135710 166853 67116
20540 67116 22808 88889 18386 -13351 -125315 -119010 -52943 29500 72253 29378 -95583
20529 -95583 -51163 -38695 31852 7227 44232 23789 99991 185948 229826 166052 29734
20518 29734 -10350 -50106 -93787 42273 116264 183540 254472 141069 -481 -34797 -40412
20507 -40412 -23051 -18293 -31910 -49761 -99155 -123343 -47130 -72151 -123421 9768 21675 -130778
20495 -130778 -179640 -109914 -59587 7351 85839 49579 59015 83278 24213 111950 134399 160357
20483 160357 -12975 -90882 -72735 -57880 61404 144116 126261 50141 -56379 75058 152329
20472 152329 134255 170037 33845 49057 113920 144615 90212 130619 209823 192320 50580
20461 50580 -58048 3688 -1624 -126967 -167895 -169593 -78669 5352 56326 150810 37052
20450 37052 -40562 25653 33854 49013 89746 118838 72732 47223 20432 98728 174763 92204
20438 92204 -73707 614 -73615 -227311 -165027 -105250 -165247 -47608 8406 -17999 33194
20427 33194 -17089 3321 -23158 -57370 -33084 35314 14084 31741 -2902 -202181 -203046 -77985
20415 -77985 70635 70077 138871 135015 165680 89165 -82904 -17195 -71097 -139166 -82497 -53432
20403 -53432 -64114 -36787 152401 210420 90684 92960 168882 147693 49764 -51361 -25865
20392 -25865 -15064 -114789 -83157 8994 15827 -56385 -62437 40210 57273 -37838 -106575 -208165
20380 -208165 -249178 -198784 -98242 13947 59704 67473 -33587 7486 -119529 -174367 -257125
20369 -257125 -241863 -193034 -123136 47976 -11418 55938 -582 -81499 -205323 -201008 -117184
20358 -117184 -157486 -149487 -147218 -51987 1289 4225 13670 38895 -53082 7437 120110 128400
20346 128400 51174 98064 79832 -40290 31605 86358 36385 121528 152776 25674 -146659
20335 -146659 -159202 -177500 -199399 -86825 169092 280554 92683 15019 87575 102797 -5590
20324 -5590 44475 50474 20409 -5144 19766 -98316 -129032 -106178 -87725 -98244 -121565 -89844
20312 -89844 -11471 110939 75378 95001 149783 198456 174948 88831 11743 84532 75916 -46400
20300 -46400 -116542 -79899 3509 -65166 -71459 -6076 123932 144916 -25953 -15258 2009
20289 2009 213082 343759 274826 194879 144303 193903 138278 123793 66911 29339 83803
20278 83803 118658 175133 189486 146166 99126 30128 111321 144131 108084 28042 -40886 30097
20266 30097 82600 21340 61744 163840 96578 -13318 101095 105360 206513 256441 134954
20255 134954 109256 92536 31809 -28261 -89286 -86378 56456 114923 164613 44585 -146146
20244 -146146 -50744 49870 15955 -53797 -26846 -66846 -132866 -112146 -7889 -32979 -129520
20233 -129520 -193593 -77890 41645 17988 -29487 139987 237779 134144 21742 133300
20223 133300 86771 -32685 -110432 -156586 -87095 -109831 -209147 -136791 -41488 -14499 57903
20212 57903 99292 159046 44672 37468 16973 42670 50479 -6219 -36409 87316 38698 -71008
20200 -71008 -101 79143 83035 -36966 -55226 -67843 -48503 -42740 -29765 17857 13591 21941
20188 21941 12365 -115572 -22303 93625 136315 76515 38958 -133531 -113174 -28353 -46481
20177 -46481 -137730 -241104 -240191 -172416 -207222 -210989 -117909 -141539 -49200 7099 66735 100498
20165 100498 21137 -21500 50333 55554 22636 -17544 -91994 -116441 -183673 -173212 -88107 1036
20153 1036 -68049 -115109 -137563 -136085 -34202 105927 109439 23076 -94185 -144247 -45512 -50796
20141 -50796 -64418 -8216 9683 51114 78182 183205 127788 1030 -17232 -110788 -162509
20130 -162509 -170338 -195030 -215721 -143661 -155356 -141404 -209494 -155101 -60762 -67084 -51762 -60385
20118 -60385 -167528 -242332 -139046 -117392 -117672 -105495 38716 60553 86589 159433 186586
20107 186586 123069 64636 19912 71866 156498 123086 107292 128313 183199 192130 92615 59373
20095 59373 26100 -38740 -68528 -11659 21893 129523 164063 -3363 -150184 -182394 -125277
20084 -125277 -81113 -36478 -102697 -289733 -344959 -252817 -215023 -184458 -257830 -148092 -43988
20073 -43988 -24343 39156 -8371 -87147 -87763 -29101 67560 83104 51270 -28365 -52631 -97794
20061 -97794 -108245 24837 168946 87628 56413 76411 64788 32525 28157 5327 65405
20050 65405 63569 -22472 -69650 -5105 -89047 -72694 660 -42298 -148375 -163235 -135269 -59184
20038 -59184 -8921 -2707 23488 5684 113293 183308 225253 184190 109797 115402 88435 106334
20026 106334 146737 166907 163916 145564 49994 -76071 -200081 -99894 14972 -28441 -40051
20015 -40051 -57794 -47349 -32040 -52491 -14818 -33953 -26862 -19406 91818 162074 151241 78080
20003 78080 148526 26521 -21126 -83721 -183170 -78515 -64130 13641 23730 50498 16329
19992 16329 -36598 -60675 -103324 -101453 19207 12609 -54258 -97899 -33346 -165331 -196454 -16773
19980 -16773 88422 78774 72166 55036 22836 79714 139616 74744 93695 97127 117801 38417
19968 38417 49959 77028 -9008 -150014 -120413 -94543 -127197 -105419 -31090 45017 53289 94856
19956 94856 -7821 -137569 -193412 -76229 9738 -108363 -121559 -10627 112434 113002 6011
19945 6011 -38261 56190 80596 38146 -71935 -206404 -154648 -149378 -172696 -133067 -25137
19934 -25137 78856 65123 26788 -2861 -11632 4570 -125490 -118677 -75799 -119683 -224491
19923 -224491 -242409 -183352 6059 -5162 76001 56360 42556 162209 207956 128243 49936
19912 49936 -1298 -105105 -128583 -63092 64908 78792 61533 27746 -6593 55504 115905
19901 115905 95943 65051 24237 -22381 -38131 -118564 -135945 -116070 -69406 -18316 -113442
19890 -113442 -101785 70781 196911 215313 83254 15541 25143 57684 50276 111345 253612
19879 253612 199124 76187 -1982 -34316 29918 135790 296264 351122 340251 233188 136358
19868 136358 103447 88682 32805 -62599 -178550 -134106 -5350 -20369 -53244 -36934 -948
19857 -948 76261 -14273 -42138 -90569 -63369 -69779 -83863 -34123 -33038 -73165 -88439 -87708 -104079
19844 -104079 -130622 -177554 -35205 22389 87438 86507 12101 -93262 -49091 -95233 -152482
19833 -152482 -86895 -97442 -139585 -146493 -235629 -272926 -137066 -28605 61917 148135 95436
19822 95436 73110 95639 132962 194023 255039 243169 176449 188512 143850 174195 162453 48904
19810 48904 -12116 -172959 -127272 -103740 -239975 -179220 -77338 -145158 -247870 -104593 89627
19799 89627 145706 -10789 -83299 -145234 -81619 -69164 -66677 106088 173617 193204 137248
19788 137248 163073 196262 161929 20147 61289 14988 -183605 -284177 -190405 -74423 -231269
19777 -231269 -226549 -8609 94298 9865 67237 187113 134220 49290 109311 243874 305470
19766 305470 236639 220565 166405 89572 97247 22507 -127248 -134332 -126059 -111611 -51509 20984
19754 20984 42273 15093 18173 34838 56099 189178 202145 199627 237704 335011 317032 201223
19742 201223 190457 220595 169521 94342 17169 -78610 -8963 61584 54138 -16297 -48045 -13820
19730 -13820 117235 187757 50782 -52338 33772 64621 4892 -87646 -71675 17115 65656
19719 65656 99664 181760 104342 -52267 -98602 -124766 -187505 -72673 86287 57035 37665
19708 37665 -7638 62417 144408 107417 -83092 -155096 -50939 36599 -59896 -74795 -51341
19697 -51341 -44870 -38683 -10989 35521 144821 145968 226797 353393 460672 368769 267815
19686 267815 152360 181552 273834 248061 151624 75882 82765 126556 133006 76273 94215 115229
19674 115229 67148 37688 17124 32926 -69741 -129697 -20066 -19407 -11363 1936 58280 78717
19662 78717 156733 60473 -29035 47737 112514 136863 133841 104835 129495 155881 110954 -36361
19650 -36361 -139116 -94916 -59164 -3308 -39732 33925 106240 150738 105921 -9950 63361
19639 63361 177166 172757 127303 30794 27161 -66587 13591 115255 -13207 -17718 -144363
19628 -144363 -151592 -130676 -126068 -68032 -68488 10297 -26589 -66793 -40115 72507 107055 75964
19616 75964 -101739 -175680 -94569 -94621 -63821 -31019 -23230 -29677 54228 62597 28194 7797 24037
19603 24037 83861 132890 7796 -8955 30381 -9742 -58206 -147049 -201703 -107410 -55275
19592 -55275 55894 27120 -71555 -176288 -88180 -24993 -106044 -143404 -84388 -102252 -96823
19581 -96823 -112984 -94176 -99797 -56750 37157 12865 -10706 100328 87325 -36066 -77871
19570 -77871 -46176 -146628 -57905 -87606 -38248 56007 72876 93331 -7307 -54445 30762
19559 30762 137254 221697 245917 245510 232563 229912 152668 114208 92518 75596 102009 119289
19547 119289 131542 82550 20898 -84112 -150701 -120690 -91338 -12845 -35933 -96964 -71902
19536 -71902 6390 -31135 -34896 -764 -21268 -66525 -57281 -12297 13532 -100686 -119671 -89821
19524 -89821 -124440 -143143 -33282 -76626 -108187 -99606 -128205 -122859 -91304 -84196 -155790 -202132
19512 -202132 -145364 -10513 -85510 -131535 -76369 -23147 -120402 -206579 -204412 -306195 -409247
19501 -409247 -361699 -220055 -31726 -5043 -100517 -100285 -43717 -32659 -22601 -79327 -140458
19490 -140458 -102594 87517 87087 26334 8134 33309 59711 38326 -62728 -61426 -131782 -122937
19478 -122937 -703 87161 161952 109602 62571 -13814 -77231 5908 165278 165900 191480
19467 191480 271462 285913 239647 131551 46059 80995 146372 216181 190194 181292 128794
19456 128794 57775 84686 121420 105214 134895 127993 40655 -90796 -44158 -54855 -69195
19445 -69195 -74589 -90547 -117525 -133107 -33729 66977 124572 173662 94960 2842 -44303 -53184
19433 -53184 4496 106330 253063 232047 212112 188465 11209 9591 46531 9792 11007
19422 11007 82211 58436 -142 -20423 34433 118022 154195 168028 107453 139498 148783 129780
19410 129780 138754 49171 -24185 -34152 -119257 -128752 -41250 33634 13287 -8520 -106367 -177122
19398 -177122 -157774 -16788 -18902 -145208 -123543 23658 29360 72496 132045 29581 55306
19387 55306 181654 240846 164581 -48702 -83006 -89160 -86595 -18558 -2683 -78673 -88190 -121045
19375 -121045 -34368 176757 170774 -5630 13252 171123 110232 82083 182468 163977 95114
19364 95114 125984 24366 -95593 -136641 -196511 -147259 -132013 -38972 -85740 -103260 9617
19353 9617 -48249 -151958 -101923 -86178 -67989 -68856 -10792 -2622 -56321 9932 72150 105641
19341 105641 170129 179814 38137 17133 32054 130572 110154 -36232 -18819 -2409 -38251
19330 -38251 26240 -70540 -158267 -68199 -53680 -122799 -47762 2632 20536 63623 31331 -43705
19318 -43705 -14888 29011 -25924 -26946 138808 98913 -58037 16355 3222 5291 -20678 -112802
19306 -112802 -45476 138877 145580 82225 87912 148241 213796 194676 -1511 16006 23339 -107692
19294 -107692 -137687 27128 212298 177988 68917 2281 38078 83332 61301 86893 106808
19283 106808 233119 220403 185536 119396 107206 135212 83758 -293 -123966 -122237 -18009
19272 -18009 123920 159722 239147 206208 122822 155049 179831 138223 99042 76820 192864
19261 192864 101392 591 79896 -12409 -4436 -5986 -42084 -101901 -76696 -22794 37592 77899
19249 77899 89141 122195 186508 36617 -39047 -123181 -136052 -38536 87153 4368 26868
19238 26868 44203 41805 -141855 -159420 -56401 -82101 -37848 48537 27059 -75999 -44010
19227 -44010 1186 99769 50212 -63195 -106300 -141503 -131961 51770 144212 112060 139475
19216 139475 224374 191458 163157 88265 -7442 -79745 20731 37757 -58283 32290 135882
19205 135882 191952 135289 89911 100008 152084 110506 174864 285183 254284 229980 204839
19194 204839 258057 259792 116346 128483 130541 66529 -81393 -86589 36246 16614 -22124
19183 -22124 82119 161554 62548 -15933 17124 94392 198972 141596 -33452 8400 19188
19172 19188 49985 5511 -25578 -68657 -68153 -37607 63779 127010 140870 201603 234336 326283
19160 326283 328218 235236 98536 -18400 23667 85564 62123 -23799 -34361 71221 50348
19149 50348 -27961 -61160 4459 -41060 -111294 -77712 -46243 -106329 -72437 -92397 -112680 -81171
19137 -81171 3927 -8238 -36397 -99808 -170001 -87296 -25849 -47847 27589 -5747 -12729 -71664
19125 -71664 -73590 -34480 65411 107563 -16222 33768 -65505 -123815 -44639 79392 131707
19114 131707 80432 110288 179914 110493 147845 126083 82865 70301 7159 -119420 -144607
19103 -144607 -148938 -91337 -8788 116027 112923 23105 45631 90388 8211 -6077 -27656 -67314
19091 -67314 -91563 -29671 -31295 72446 13659 -113200 -184070 -162644 -144814 -65663 -69029 -93972
19079 -93972 27319 64868 216155 204875 152628 10816 9886 134684 44269 -66408 29124
19068 29124 40412 8052 -21820 -61837 33271 45563 15841 -33992 -56728 -186402 -153305
19057 -153305 -64676 -73395 -75650 35088 141618 190199 194014 120774 17304 -133754 -94491
19046 -94491 -30105 -78495 -22710 49596 153160 197382 241351 179525 43650 -12621 46634
19035 46634 210774 311092 217956 129705 40142 69695 133909 122559 141967 128200 227855
19024 227855 240550 214519 251165 309466 324912 361714 323589 344139 267562 217100 175274
19013 175274 153774 149389 101040 52729 58524 136842 170595 110244 69210 80462 -50234 -30050
19001 -30050 180620 203527 90396 -3240 96159 138965 141189 185054 58294 -37842 -670
18990 -670 69883 121053 -27162 -54358 8992 50126 72109 153206 282310 286420 380309 356328
18978 356328 320862 195492 244724 237147 165153 97513 133898 92128 51039 5302 76105
18967 76105 -25049 6177 17871 -106555 -160560 -154733 -100363 -38581 -45594 4855 -52737 -70210
18955 -70210 65482 34443 26795 105917 75974 54308 32188 134534 183810 304036 257705
18944 257705 125281 169427 247273 261142 212220 114157 99501 157218 125411 18076 68600
18933 68600 167205 212232 236229 383398 250712 53417 84170 185261 166312 216164 248638
18922 248638 259063 282891 262412 190410 180133 92203 149356 157883 116401 126919 32161 -15487
18910 -15487 -10527 -97496 -35679 54446 18010 163382 190972 160639 215280 205152 220326 166612
18898 166612 103063 39270 109749 132511 31664 87226 131649 102671 93166 134011 230319
18887 230319 219504 156666 33896 24471 -17027 54545 148671 218945 227173 310794 226867 218105
18875 218105 274270 288630 138184 66033 167436 179419 175862 188497 150263 111739 195602
18864 195602 122604 146975 255299 259914 222987 196067 158925 218078 195150 190825 207224 202906
18852 202906 305732 309352 108810 110158 234642 277223 112977 84014 216876 197263 227894
18841 227894 272229 198526 161764 222744 248674 250186 164721 179086 261912 377762 515535
18830 515535 467479 426501 513779 394104 329154 412807 375405 301290 285630 392834 442304
18819 442304 424211 535637 638787 746891 832237 907444 881504 868380 916319 916021 974375
18808 974375 958316 889256 818997 894774 957580 818075 839393 902283 914132 979853 1027546
18797 1027546 988017 906894 903555 921438 965675 1089059 1130364 1082697 1014273 941242 983191
18786 983191 1026528 927967 870790 957531 1013082 974560 906639 781874 655266 758194 688526
18775 688526 491713 443596 655567 666689 614167 543590 561939 581069 600660 779049 1225424
18764 1225424 1508696 1574701 1541929 1302072 1027691 684729 453275 430745 465126 436838
18754 436838 420381 491237 420317 350595 274111 231742 371727 413570 425813 466191 456308
18743 456308 459255 428206 442598 331139 237111 162024 123033 86871 96088 206964 241548
18732 241548 208475 150687 136334 115331 131542 97821 25201 143557 150440 176313 232519
18721 232519 236903 157894 46809 5257 101384 108065 53425 116409 106467 147403 112029 137617
18709 137617 257708 256624 128721 148080 227937 282876 307590 225192 170731 151554 104803
18698 104803 120625 70749 59548 56076 -3064 26434 69359 142565 129635 147852 163955 192881
18686 192881 127853 41846 87403 187153 155881 160309 162294 85505 107653 107172 69831 137445
18674 137445 169279 117406 109260 166081 160791 198962 242625 290916 329014 334404 313678 302883
18662 302883 236208 148193 71362 132116 105312 -24129 13173 136556 145046 206476 222768
18651 222768 206138 78854 4388 -16194 31830 53418 66972 113113 107644 225838 179997
18640 179997 123031 154686 270185 295725 258118 198930 158257 234807 271431 304608 258835
18629 258835 104905 104452 164808 129309 48860 104255 167025 177893 142220 153013 76786 42881
18617 42881 117501 157152 218570 211495 135645 97664 -44618 74375 201083 256631 338234
18606 338234 277536 216697 245698 374118 400954 362207 296495 371697 387622 379949 366661
18595 366661 335128 360987 407176 331423 179860 166924 331892 516688 698330 894126
18585 894126 966541 984928 920308 838346 713176 548111 440943 370480 226208 240093 245430
18574 245430 215624 190509 104315 11682 61978 149504 258659 298164 316282 244004 101553
18563 101553 44306 66846 118421 221765 263126 289579 314860 316401 391967 424924 378724
18552 378724 295473 253552 314104 336663 205597 278638 437783 498657 495263 547839 796662
18541 796662 1034007 1024036 1085828 1001510 827963 701844 623046 639165 639679 698429 801834
18530 801834 1051338 1037463 978363 866780 833690 784961 682267 497028 367838 392032
18520 392032 390015 285330 172341 241287 267265 209929 66125 92664 160365 115648 255892
18509 255892 246697 243987 150819 153151 302784 311027 333341 264211 231425 360629 302240 193413
18497 193413 189597 187686 267622 311739 188958 147947 284903 340651 338040 293075 295555 506715
18485 506715 846241 984583 988689 1022932 1060991 1046824 1192591 1328463 1369133 1484012 1606684
18474 1606684 1657569 1396212 1050698 975694 870502 655282 516909 495258 593494 530687
18464 530687 326504 381123 463669 429584 413942 488889 575654 487767 546343 393174 151702
18453 151702 258777 327359 359257 282954 339856 405795 399086 461178 526879 577109 637229
18442 637229 682907 721362 847299 745632 760997 977973 1182653 1260041 1161483 1144485 1213006
18431 1213006 1058523 966518 811094 579124 544548 661343 834386 950603 1171130 1423010
18421 1423010 1637442 1735160 1751721 1836576 1873500 1716959 1545311 1387332 1160061 870620
18411 870620 734304 720815 684192 684992 782063 676114 676594 650464 673047 716642 737739 699332
18399 699332 812623 878329 928878 1056013 1387400 1948124 2724172 3946780 5700585 6916763
18389 6916763 7345639 7531303 7914197 8285846 8250848 7844262 7405579 7070224 6790839 7042941
18379 7042941 7455798 7144000 6413103 5857892 5152934 3920822 2696605 2077770 1690710
18370 1690710 1393379 1286088 1128599 1117819 1130339 1122491 1067323 1050953 951760 895544 839954
18359 839954 695630 806027 898085 855905 889948 1073164 1197364 1431044 1801003 2470273
18349 2470273 3382554 4323099 5153451 5586188 5411475 4862090 4073482 3367558 2596002
18340 2596002 1970883 1506514 1197277 981406 885561 730470 620959 540762 556154 584801
18330 584801 549618 591490 581226 528657 497367 473184 601118 602881 547982 534064 594667
18319 594667 554241 470616 492933 513892 581268 524124 449477 445024 392678 371907 440230 551917
18307 551917 558324 447514 402640 447539 393698 400877 462791 471031 435602 573391 739636
18296 739636 779902 689115 740893 980487 1328746 1582322 1732005 1780739 1661523 1415454
18286 1415454 1346388 1129303 860412 704859 697834 728872 662184 489838 557827 755381
18276 755381 801355 732814 783460 703432 717023 563133 478380 418585 262141 278614 461593
18265 461593 538699 445551 310005 275548 235031 199844 174571 306977 384638 452350 478793
18254 478793 493297 414358 370679 424532 487107 497143 481739 522208 404553 497726 555935
18243 555935 463969 371861 384368 310223 401131 587366 538755 484844 450403 437254 479797
18232 479797 580409 699271 628041 472451 494620 521855 557672 616560 573048 523269 561964
18221 561964 662190 717912 725651 785670 732963 715982 796113 732408 619488 580561 628261
18210 628261 761505 846506 812676 697426 730370 774958 722554 694493 595872 528458 458065
18199 458065 549527 703178 681981 672804 743821 812672 823462 850319 830436 839841 793090 766183
18187 766183 607607 451128 460291 524871 604834 600210 674262 766654 780288 867234 869567 986817
18175 986817 1114157 1266693 1386562 1510998 1569354 1563165 1485408 1292059 1296500 1273463 1161036
18164 1161036 1070616 1120306 1288773 1253129 1272030 1313298 1289470 1230972 1105078 1098368 1227141
18153 1227141 1298187 1412410 1389789 1357402 1452844 1550215 1617258 1587304 1635777 1673624 1710104
18142 1710104 1794302 1801505 1784163 1766357 1753614 1964913 2205177 2206059 2368379 2558304 2544335
18131 2544335 2587780 2713683 2814521 2975204 3128097 3392573 3752636 4083964 4462873 4794143
18121 4794143 5259909 5677067 6254983 6949513 7793999 9035949 10683457 12684266 15722354
18112 15722354 19958237 25855116 35078666 51464377 84999912 146136730 192147699
18105 192147699 193354258 176345622 162789803 134287045 88481486 54268879 37116279
18098 37116279 28659616 24172482 21836888 20897169 21002260 22092513 24227204 28058460
18090 28058460 34612958 46548690 67494951 90224906 97583679 92947280 85526691 74938308
18082 74938308 57141485 39876509 29347694 23722469 19989894 16843507 14360537 12365152
18074 12365152 10699133 9310986 8339726 7885425 7579274 7261383 7125809 7097237 7197524
18065 7197524 7056279 6779067 6655557 6519685 6550866 6656292 6966951 7391592 7951139 8606089
18055 8606089 9297259 10131204 11148494 12130141 13189642 14539926 16588356 19798045 24911826
18046 24911826 34055391 50903631 74919103 89415861 89807756 84700155 78393512 65801761
18038 65801761 50375736 40972673 38444066 40870220 47866596 61663054 87757770 132666312
18030 132666312 178751029 192983374 183445509 168286211 145517597 108152695 72457253
18023 72457253 50186207 37939531 30466244 25326453 21718530 18919582 16373244 14279796
18015 14279796 12929157 11969720 11216980 10563468 9947879 9679172 9371420 8930701 8577195
18006 8577195 8471916 8497590 8590652 8720525 8866462 9118588 9567651 10121637 10860536 12026760
17996 12026760 13911158 16394556 19684021 23888903 29692330 38261931 52105285 76599428
17988 76599428 120552158 179919687 213594938 211510302 195423899 175207965 138341425
17981 138341425 93477899 61353466 43340953 33389848 27153053 22782637 19491129
17974 19491129 16753569 14325909 12391779 10898502 9771820 8996399 8340245 7713750
17966 7713750 7177208 6791633 6510033 6456575 6457036 6401939 6281413 5975384 5725754 5662526
17956 5662526 5568484 5457944 5660289 6147234 6766641 7119393 7118321 7070142 6996982 6981880
17946 6981880 7013384 7074662 7196867 7524938 7959018 8385160 8900986 9483239 10230793 11158933
17936 11158933 12462048 14329203 16593224 19293674 23074613 28773634 36645741 48137761
17928 48137761 66572342 101066096 161862885 218334285 235805513 237329639 252350111
17921 252350111 281298639 299809843 280838664 246374405 217468457 187092105 137247766
17914 137247766 89531539 61013546 45628749 36536813 30772607 26602750 23143555
17907 23143555 20147421 17766311 16203832 14833582 13361226 11992104 10983231 10115489
17899 10115489 9511911 9071338 8564435 8251795 8061110 7891647 7602167 7141300 6726599
17890 6726599 6478591 6085985 5626486 5335741 5202624 5154265 5201064 5254425 5391577 5556058
17880 5556058 5857353 6506851 7423221 8388060 9702577 11622050 14310060 18200651 23691436
17871 23691436 32562601 49551219 79903844 106190857 111924422 109847539 113618391 120931315
17863 120931315 121374980 108789644 93401680 81878382 69871861 50558894 32837427
17856 32837427 22685283 17045478 13521635 11279881 9748028 8555546 7411464 6551070
17848 6551070 5949966 5374416 4751352 4312573 3965089 3520694 3209163 2991994 2846976
17839 2846976 2606295 2550919 2456506 2274476 2096698 1996994 1849180 1620204 1332597 1284429
17829 1284429 1211501 1091692 989254 921677 818388 636362 464481 369626 301511 229746
17819 229746 257887 346153 405128 317533 240258 217906 159569 104362 -62049 -113458 -102821
17808 -102821 -79521 -125046 -173377 -209833 -293756 -265171 -112301 -54143 -131233 -142942 -224903
17797 -224903 -116642 -4568 -76447 -116493 -109180 -179998 -91102 4792 -34030 -17534 -50989
17786 -50989 -114958 -239313 -207791 -146317 -187102 -309620 -435104 -402500 -268196 -338907 -330503
17775 -330503 -264911 -33214 188744 184495 171938 152305 48530 79061 199099 217436 195212
17764 195212 40504 -7728 60277 128166 140201 -11135 -128965 -251657 -136490 -222053
17754 -222053 -296171 -414437 -464191 -362405 -182339 -121274 -89543 47228 41158 -114788 -253001
17743 -253001 -185494 -274632 -319429 -353044 -352761 -514766 -482289 -386896 -390132 -460118 -436321 -392514
17731 -392514 -422187 -433671 -307281 -271399 -183755 -66063 20084 34000 6984 21722 118784
17720 118784 123444 21372 -83573 -70441 -14469 41040 4429 -9318 56476 73153 120371
17709 120371 63034 10061 22743 28013 23628 10868 49214 72382 131886 129095 -69714 -176396
17697 -176396 -150235 -194051 -173066 2865 -152462 -385676 -281516 -230017 -313179 -255474 -231750
17686 -231750 -232914 -229745 -224943 -137233 -172517 -295214 -307228 -243158 -187336 -210749 -179526 -93062
17674 -93062 -93126 -141737 -201411 -197933 -150817 -134902 -7021 69845 8600 -120404 -133568 -49482
17662 -49482 -67710 -57798 -28938 -121751 -264688 -325428 -314591 -138764 -93110 -136625 -81715
17651 -81715 -143707 -168850 -168690 -289825 -286588 -252574 -222754 -237524 -240371 -350129 -363068 -242013
17639 -242013 -244639 -257993 -101159 -94729 -167629 -111343 -69596 -183795 -285737 -293752 -101516
17628 -101516 -52604 -78257 -82707 -204527 -272447 -275812 -164900 -143036 -145826 -254850 -208014
17617 -208014 -88585 -77201 -198359 -369027 -437237 -347187 -256646 -181955 -235793 -268563 -287201
17606 -287201 -294163 -227432 -152194 -87734 -69965 -86219 6566 68530 -23397 -46791 24430 -5137
17594 -5137 -36797 -22478 -122048 -208515 -184872 -327250 -352904 -309075 -345487 -290382 -153766
17583 -153766 -29623 -84850 -249328 -256664 -79601 38377 -75988 -92084 -133864 -126135 -71112
17572 -71112 106741 238348 451443 622948 636697 617268 602480 539997 439206 190751
17562 190751 90947 66625 38744 16009 14309 -25488 -111147 -173295 -172848 -162055 -141275 -100313
17550 -100313 -117717 -103573 -13782 -24230 -58514 -78400 -119811 -124606 -152124 -203770 -297920 -312328
17538 -312328 -277889 -267650 -160127 -113849 -98844 16316 -8434 -110787 -175073 -88839 61222
17527 61222 162113 361109 735040 771901 710325 763195 570624 260547 26316 14705
17517 14705 39855 95693 122771 177825 245382 340535 344571 378821 291320 124318 -2398
17506 -2398 35419 66510 6836 -70121 -117871 -140258 -227169 -214988 -125932 -73731 43979 -53651
17494 -53651 -89589 -60450 -92832 -113484 -147125 -93554 -52740 -28071 -11867 -47649 18819 -91182
17482 -91182 -114265 24162 121717 60076 13600 3303 82832 190619 136408 -42559 -40470
17471 -40470 146903 338614 449062 533092 652747 740463 613052 484027 386760 165158
17461 165158 39857 65396 85443 141762 61163 70727 40662 92256 118616 99249 173245
17450 173245 140720 -22878 -128620 -190256 -147732 -52912 151902 373966 497798 670986
17440 670986 808528 916370 886518 803217 711837 460758 252658 116490 14513 4095
17430 4095 -88631 -250970 -267191 -151102 -149911 -137780 -145314 -273750 -250326 -217871 -213392 -88558
17418 -88558 15048 28493 -139937 -156149 -154703 -173996 -142015 -164979 -145019 -158439 -71856
17407 -71856 4655 -20649 -44441 -65904 -64724 -117460 -112108 -69297 -38619 -125220 -140630 -174922
17395 -174922 -232376 -147959 -117730 -59909 23602 -35670 147117 151500 78562 57104 -10458
17384 -10458 52545 122345 -230 4782 172086 484990 756947 846117 1040299 1272004 1413629
17373 1413629 1282040 1010191 857053 566837 311027 88436 -76850 -108100 5928 -10359
17363 -10359 -87261 -51527 2750 -21101 -75133 -82455 -46165 -29364 -50955 -129193 -50531 -94198
17351 -94198 -52818 -12838 9100 33734 23626 -27707 -119420 -221997 -191843 -137288 -177905
17340 -177905 -210258 -233726 -246632 -187616 -119037 -76681 -93283 -146863 -125274 -151715 -151413 -41185
17328 -41185 -53781 -76549 -5911 9121 72511 226691 409199 634472 868498 1041050 1199677
17317 1199677 1393535 1192104 907502 770730 613970 306466 203525 174961 -56217 -73530
17307 -73530 10395 94723 100603 17663 -53135 -191142 -167634 -67288 -89220 -110481 -96568
17296 -96568 42509 79164 -62111 -253643 -288599 -241493 -219665 -160399 -99828 -131027 -131942
17285 -131942 -41414 -88970 -174817 -164112 -86751 -66959 -106894 -68333 -28755 -192659 -268523
17274 -268523 -262258 -222805 -5781 -70197 -298846 -240959 -246895 -278465 -131499 20957 -31383
17263 -31383 -103539 -177754 -192111 -164194 -45737 -23752 -53948 -153094 -201659 -100897 20346
17252 20346 -37158 -38194 42225 -10136 -86350 -62540 -25909 14183 -37200 10015 20150 3735
17240 3735 -79424 -119547 -71419 -11469 -986 44334 -75601 -38595 13419 63842 -74629
17229 -74629 -172738 -138441 -174379 -155947 -83238 -128547 -100894 30831 -57243 -56255 -145963 -193289
17217 -193289 -59081 18002 23131 -1844 24514 55642 53293 60532 118317 123666 81767 -48985
17205 -48985 -60763 -5851 -23773 57733 128495 50267 -37268 -84030 85631 135988 230625
17194 230625 369449 525852 825267 887595 824699 907766 893515 849555 886540 830164 673273
17183 673273 643664 565806 427427 381240 312641 218758 69285 -9885 -27758 -31999 -30133
17172 -30133 -67211 -27354 20615 90501 -44463 -155936 -197158 -129886 -135025 -163725 -195681
17161 -195681 -153011 -161510 -128711 -34778 -10054 60083 76142 100623 173490 182358 464100 740512
17149 740512 795597 771157 817754 928113 981640 998403 932590 873766 843436 809161 689403
17138 689403 495506 371255 252408 163906 135316 173036 225597 118558 92451 55639 32398
17127 32398 90053 34065 21818 58191 -15521 -116901 -202190 -196964 -197058 -32247 23722 70355
17115 70355 156685 116719 48245 21270 47792 68614 151233 163441 42000 -98854 -4244
17104 -4244 157086 86378 116642 125636 35134 126443 208528 216907 104090 24172 80656 38314
17092 38314 -42405 -35797 -77352 -183507 -222801 -188363 -163791 -147702 -78429 -25177 -30582 -91106
17080 -91106 -40582 704 -190805 -309462 -305338 -378938 -245510 -137743 -207508 -305636 -303621
17069 -303621 -204401 -175197 -109532 -28854 8841 76403 91649 20248 -5124 20107 -10903
17058 -10903 66826 147376 132040 159505 159598 118741 155346 208050 172144 140688 97811 -48484
17046 -48484 -10410 176049 256123 109596 4155 -55550 953 -40824 -20351 -43346 -45285
17035 -45285 -148795 -139325 -41944 64616 80834 321 28307 -6980 -12478 -36476 -199185
17024 -199185 -258069 -233970 -198441 -146181 -77291 -45038 33767 65616 119086 67477 16563
17013 16563 34198 51776 34693 26005 -5397 -86319 -75084 -19105 29911 -6516 -58771 -67940
17001 -67940 77333 253532 110503 7219 -89426 -140332 -11531 93233 138657 90136
16991 90136 228685 195827 124732 187325 227017 176805 93863 86337 61182 71285 119477 131958
16979 131958 150660 148521 210369 122860 -26110 -85986 20778 79706 123024 -35381 -234760
16968 -234760 -248371 -257131 -104743 -47113 2943 96265 42344 -18462 -29056 -22011 21916 61118
16956 61118 130968 165262 -3271 -110722 -64563 -18945 -7983 19785 -27545 -55431 148749
16945 148749 217297 101176 -4076 -10011 31308 11951 52393 42273 50424 40241 214732
16934 214732 216393 103582 -82646 -76195 6128 93986 103358 41355 85896 5777 14959 8115
16922 8115 15263 -91905 -143582 -82454 -27219 -67762 -179798 -249731 -184627 -79304 29909
16911 29909 -52676 -76555 22581 92852 48488 72332 106940 179410 126166 4356 3709 -43615
16899 -43615 -82198 -73087 72983 58497 -51986 -132473 -165327 -227546 -185123 -100099 -77079
16888 -77079 -124804 -112407 -63479 -113964 -203846 -45312 69266 23425 18830 -12246 -62622
16877 -62622 -111438 -193302 -34831 164331 265667 231963 244626 223510 65487 40779 147572
16866 147572 198500 211402 209692 159072 123573 35640 -83788 -213407 -133720 -35476 7596
16855 7596 2442 -3495 91947 6787 -27968 22722 63446 24434 -26592 -44222 28818 108735
16843 108735 151522 188859 99370 33665 -106125 -208024 -168029 -2085 127143 84225 188035
16832 188035 269613 372599 412169 320311 331246 354150 326755 252409 87010 80478 283448
16821 283448 392217 278919 279345 322946 346279 417560 419291 347659 355512 369171 533644 735161
16809 735161 937099 995838 872925 694696 645513 444543 314418 295226 218097 175790
16799 175790 176311 209322 147975 106684 235809 397792 404692 326224 325532 312946 301821 346896
16787 346896 383217 358151 395547 352720 250510 239438 186868 184494 265679 202043 245277
16776 245277 367186 462764 536712 533642 483466 493293 562451 528685 556401 555186 509219 474676
16764 474676 461254 508824 584618 636158 496544 431337 473480 545685 594618 534267 639518
16753 639518 681021 684640 663869 653439 778971 764918 846056 962104 910293 912242 843017
16742 843017 816365 941491 877852 826715 983058 978090 952906 949511 935527 922443 1026223
16731 1026223 1194816 1314686 1368612 1467326 1591799 1600890 1535171 1602679 1736983 1861586
16721 1861586 2018571 2425243 2900987 3275846 3430522 3599349 4117077 4595454 4971539
16712 4971539 5245500 5462459 5543003 5525335 5373457 5434680 5553377 5915602 6544272 7242345
16702 7242345 8059193 9235871 10788940 12964435 16040431 20494696 26701908 35963274
16694 35963274 51256268 78608833 123207468 163435616 177727713 180771921 191251002
16687 191251002 207919602 214555560 199385517 175811599 155146484 132168773 98367622
16680 98367622 66949752 47295514 35992256 29192889 24604876 21275740 18671554 16731101
16672 16731101 15287401 14348359 13799971 13371973 13038770 12796833 12570042 12552339 12382567
16663 12382567 12006854 11751676 11574724 11714967 11978933 12401035 13180148 14665765 16855328
16654 16855328 19925041 24535747 31579111 42483291 61983471 98057259 142982786
16647 142982786 164626975 167905277 173180544 187947868 200979917 194552912 173861726
16640 173861726 152523363 134232153 106284106 73254928 49864252 36343614 28183571
16633 28183571 22742431 18987405 16116983 13787664 12025780 10739480 9750179 8774306
16625 8774306 8006616 7500878 7232793 6989634 6744785 6620140 6563845 6234345 5665902 5286223
16615 5286223 4966079 4496329 3827597 3257345 2874511 2543215 2124799 1865294 1698150
16606 1698150 1532583 1389339 1414366 1407758 1290221 1094644 968169 975129 853707 746062
16596 746062 580973 508904 493043 536468 614735 638014 567013 457387 322208 248690 193510
16585 193510 151633 170805 53758 -54611 -70873 -32377 29388 31538 -44640 24445 176789
16574 176789 120497 54980 174781 291203 295752 170079 129438 21851 -75153 -86968 10488
16563 10488 25952 64274 93509 41963 45109 -59774 -110525 -126897 -30702 36348 74132 94057
16551 94057 118215 120229 34082 18551 -53681 -247108 -248107 -196523 -154927 -78182 -71394 43284
16539 43284 112004 171452 165123 149691 156228 94467 55643 67279 109356 181188 190851 252506
16527 252506 390567 417156 451100 570523 491094 314918 347090 365328 261858 164131 -72713
16516 -72713 -248235 -275750 -277332 -142248 -113690 -83006 -89451 -80476 -69725 -27664 41481 -86270
16504 -86270 -220202 -253312 -276854 -179921 -155116 -130855 -49627 -114630 -218388 -140400 -96560
16493 -96560 -42881 101879 182095 197151 304132 267836 171330 125556 216043 127066 75130
16482 75130 86493 65337 96243 208494 71273 -49624 -138327 -170769 -136134 -489 6441
16471 6441 27943 -7399 -134530 -256048 -293679 -297140 -243561 -289407 -299444 -341528 -357191 -305818
16459 -305818 -280918 -199830 -114891 -135220 -164387 -195691 -83244 111001 14732 -76197 -48852
16448 -48852 -46800 -89010 -101672 21089 110800 4412 27563 140344 128212 116823 -90973
16437 -90973 -132860 -15040 34571 -29801 71257 179908 86888 25058 -120527 -210147 -209169
16426 -209169 -141622 -64531 -71861 -56057 -8939 41516 114074 30290 -67179 -86008 -74269 -134279
16414 -134279 -97769 -83922 -65070 -58537 -10582 39822 -5256 46816 -15287 -38529 -5185 -75643
16402 -75643 -64967 -90093 -48077 -27340 -62356 -195348 -212098 -60712 62217 66871 -32182
16391 -32182 -31540 43092 105228 165266 144977 71613 12548 -104512 -137432 -216275 -148811 -33507
16379 -33507 -48073 -51118 9054 -103762 -195458 -192972 -53601 4156 -84473 -86920 -56234 -62485
16367 -62485 -40035 -44664 -114901 -8350 55884 57130 10873 -4094 -14369 -98788 -203274 -287644
16355 -287644 -341610 -364265 -165910 -103296 -37132 -124882 -246400 -229959 -102672 -18694 19356
16344 19356 -19073 -71565 52549 95998 -86318 -237907 -175245 -215057 -235255 -75190 2426
16333 2426 -60587 -191503 -325826 -224628 -192740 -96801 8414 -4418 -60419 -42560 -72144
16322 -72144 -108012 -88482 -98701 -117555 -103468 -149921 -100183 -58512 6650 -33784 -78220 -98652
16310 -98652 -134530 -143528 -172112 -39167 -74742 -265837 -218683 -75830 -135103 -170081 6940
16299 6940 22119 24020 30390 -57651 -150254 -189760 -142736 -178517 -167053 -188489 -244427 -242096
16287 -242096 -130238 -98589 -91111 -77606 -100785 -201465 -115366 14629 -2050 27177 28836
16276 28836 1029 48931 -62142 -99692 -92811 -169729 -180367 -107889 -21272 -79536 -155424 -52895
16264 -52895 54526 64728 60531 438 48106 -95957 -239527 -237791 -174240 -127372 -20762
16253 -20762 -15371 114033 146844 90739 -2143 -12839 -70455 -15166 2151 -122709 -231144
16242 -231144 -221461 -155161 -174964 -177079 -187246 -264987 -183591 -146084 -6886 -53342 -122659 -233300
16230 -233300 -272862 -260405 -323483 -169105 -153862 -220292 -97326 -3778 -19505 -74985 -140364
16219 -140364 -66944 -17199 -58411 -51551 -186222 -206801 -67634 39966 28967 -75722 -94995
16208 -94995 -117026 -143530 -175050 -86116 -67917 -62649 -48287 -118747 -180736 -120136 10527 133474
16196 133474 -30267 -91387 -39014 -37514 -24298 24381 49164 -1670 16007 253434 438614
16185 438614 643664 762323 845583 937928 1000972 1084777 1115065 886468 692975 615270 426074
16174 426074 335079 367765 363510 330326 197067 13911 -143712 -107043 -88659 -225139 -266637
16163 -266637 -291773 -277253 -218581 -109305 -14476 -28641 -39415 -63181 -16007 -42904 -28426
16152 -28426 -50389 78799 53334 -29207 -382 29412 11222 163919 263391 426554 586846
16141 586846 787455 1090102 1094514 1057854 1109007 1078170 927400 807008 734207 678811 445460
16130 445460 223761 150071 169739 211122 134248 145708 170889 88227 -63821 -15829 -65621
16119 -65621 -148660 -132161 -208551 -162027 -43975 -41291 -66725 -54712 -3253 8147 29206 19965
16107 19965 -162623 -251401 -261763 -197051 -121245 -87662 -37752 6866 86753 109382 169835
16096 169835 136287 45319 -14071 -15239 -66204 -122638 -116958 -140074 -77501 -71378 -152448 -158169
16084 -158169 -108725 -48984 -97070 -204560 -272307 -114736 -183060 -239151 -202447 -43311 26284
16073 26284 -12225 36650 15823 -63174 -172530 -169312 -120017 -150362 -153613 -88595 -91815 -112357
16061 -112357 -92107 -108004 -34195 -112819 -139654 -57733 118975 33839 -65498 -48290 -118543
16050 -118543 -261573 -303529 -184177 42263 145873 76356 -95427 -118653 -232839 -173140
16040 -173140 -93310 -117934 -115218 -163569 -112780 -32892 -55376 -48172 45728 48773 59328 -7512
16028 -7512 -291669 -356849 -429968 -372440 -320315 -254776 -219640 -174285 -127363 -103410 -82113 -31555
16016 -31555 -102514 -96076 -64842 -55183 35518 16441 14699 8055 -63126 -164671 -124424 -110548
16004 -110548 -47933 -43584 -152380 -209234 -305277 -350210 -308032 -162052 -120833 -86039 -20171
15993 -20171 -21631 -108439 -99951 -80293 -62298 -58485 22850 20654 36797 133164 59332 -62780
15981 -62780 -137763 -135451 -168438 -118362 -103830 -176564 -103080 -51785 72456 180717 176883 169779
15969 169779 115051 82900 -52853 -141919 -61726 -108874 -163144 -62235 -66767 -228853 -267374
15958 -267374 -318344 -256365 -120592 -89631 -63794 -56034 -92676 -134040 -67016 -54614 -151044
15947 -151044 -136670 -97936 -76501 -22573 -35281 -18278 49132 7305 -86314 -157699 -201737
15936 -201737 -138658 -126591 -125543 -75530 -124970 -138240 -68872 97477 93029 -14091 -160713
15925 -160713 -206272 -159104 -115630 -136334 -132823 -212952 -288859 -395945 -268138 -191582 -22076
15914 -22076 62416 -60462 -145135 -76304 -12405 41342 139920 132183 97099 52849 -52239
15903 -52239 -62156 -43650 -82541 -133452 -278799 -339479 -371409 -268715 -103739 -32940 44937
15892 44937 -66483 -13174 -13881 -93365 -75810 -61090 -66904 16268 16985 -20421 81727 213309
15880 213309 158132 76606 22119 -62869 11829 128508 151564 173530 184466 143127 117953
15869 117953 89723 213850 301958 286570 229312 158915 12268 -108828 -116204 -30136 -61752
15858 -61752 -137100 -111454 -140480 -208682 -59258 -59188 -158904 -261455 -194397 -109978 -127153 -97688
15846 -97688 21380 42801 105311 133051 -15522 -140067 -180027 -126661 -130132 -106919 -86964
15835 -86964 -69794 -54514 -44054 40175 46555 30505 -49686 -131620 -120885 -177832 -167093 -92486
15823 -92486 -141093 -105173 -113670 7387 -13199 -26464 -24621 -31147 -63688 -109776 -152824 -197975
15811 -197975 -266010 -221600 -241766 -179252 -148532 -83356 -103540 -102491 -62204 9213 89819 8704
15799 8704 -44016 -31692 -59079 -107344 -100149 39442 73568 64425 6209 -121661 -224522 -204661
15787 -204661 -172916 -14763 97410 63568 36102 -68271 -153592 -178987 -154508 -100982 -91104
15776 -91104 6686 -38818 -47406 -17790 -24579 -101504 -24487 -4471 -7583 -159873 -290939 -224977
15764 -224977 -42773 98791 144798 -23106 -104801 -18721 106919 122233 36166 79642 -11677
15753 -11677 -104696 -145176 -279441 -259223 -178768 -212925 -383337 -330029 -196116 -16948 80181
15742 80181 22926 14392 27040 9239 47513 40930 28695 -49531 -192716 -115733 17201 36906
15730 36906 37104 39986 -96926 -132532 -213973 -218223 -140972 -81508 45332 61680 62139 29233
15718 29233 7902 24381 -176814 8825 69129 8745 81573 82417 17955 -122557 -154424
15707 -154424 9694 -9399 -8740 -154725 -145462 -92080 -111480 -41311 44824 98597 79960 210372
15695 210372 131081 74024 55225 123001 109141 42451 -63105 -126983 -55945 107499 314044
15684 314044 319150 201638 152281 71360 -142408 -189677 -233925 -269701 -230756 -77293 20488
15673 20488 22949 -71943 -54900 -125926 -204953 -121753 -231032 -145205 -131119 -250979 -110770
15662 -110770 33764 -108898 -163326 -240345 -132638 51 -6238 -123840 -202330 -250650 -228728
15651 -228728 -210454 -106468 -67006 -72639 -172062 -149815 -189397 -161449 -129886 -202085 -133941
15640 -133941 -67690 -21693 -26385 -66008 -40302 -24818 -49336 -40571 -157135 -200922 -176276 -118813
15628 -118813 -136155 -108605 -94703 22025 10170 -79299 -108284 -164753 -158962 -67577 53931
15617 53931 -63628 -199219 -111841 -101684 -167980 -52328 36943 -84053 -101853 -121876 -92731
15606 -92731 -36870 4433 85166 11998 87021 46527 27837 -33721 -65199 11629 -73979 -39819
15594 -39819 41463 76456 -24479 -117961 -152888 -183961 -224057 -139642 -163117 -152071 -25814
15583 -25814 36798 -57326 17436 14150 -133851 -112598 -94649 -142592 -153685 -6574 25165
15572 25165 -75832 -70285 -33831 29475 44688 70603 149024 180642 230651 125720 60745
15561 60745 47514 49295 -62699 -64946 5229 3087 3126 -48214 -55559 5368 15468 77060 58863
15548 58863 120735 176583 52379 -215 -132385 -153813 -151590 -101270 7132 57725 30650
15537 30650 -28523 -37257 -75191 -79749 -79943 -19648 -71675 -128338 -141667 -87384 -109314 -46377
15525 -46377 -77097 -145596 -49760 95818 94853 -29305 -81334 -224660 -283595 -229415 -164480
15514 -164480 -91707 -71593 -101893 -65006 -43474 -52765 -42265 -80663 -156471 -195566 -201269 -159557
15502 -159557 54680 132561 56278 -54972 -119575 -12309 83318 58927 14711 -27790 -56502
15491 -56502 -57073 18992 37095 127053 81335 16659 111154 215935 151172 124534 157267 64242
15479 64242 -39711 -67571 59462 148574 204762 108228 37936 44924 57956 -107202 -128496
15468 -128496 -93604 13228 163292 141065 64554 -102364 -207680 -235856 -264408 -224254 -186794
15457 -186794 -26054 62586 85657 -26390 -2753 2001 32716 94860 32490 -31067 -108768
15446 -108768 -89944 -119308 -109746 -116153 -80395 26132 -20514 -112347 -240659 -220103 -144237
15435 -144237 -218016 -263095 -197847 -206936 -95171 -139701 -136935 63880 150050 85512 -67204
15424 -67204 -77809 -110235 5869 87290 -22832 28264 96754 67622 56040 92762 204111
15413 204111 143458 137507 102153 42292 10612 19563 64203 48191 -90285 -191259 -169930
15402 -169930 -64465 -92590 -59756 -114097 -100323 -31319 -34074 -75465 -14355 27951 -86134
15391 -86134 39833 185049 155042 128846 83074 50649 26607 121871 94827 -98671 -78429
15380 -78429 -37553 8267 -93122 -47772 -90365 -86509 -4600 -61571 -162207 -69063 28057
15369 28057 146671 178657 62346 -3645 -76716 -148322 -238069 -292636 -315583 -394974 -316394
15358 -316394 -251218 -197029 -151928 -124625 -93578 -7818 -31170 14199 60290 90940 58992
15347 58992 63918 115802 58600 37581 52018 -22409 -110362 -69603 -22331 51778 41279 -70298
15335 -70298 -66551 -110710 -238518 -286858 -246140 -117678 -151457 -303893 -304462 -164562 -169799 -106225
15323 -106225 -61903 90274 98779 15909 -91731 -181782 -60088 36786 -257 134859 247701
15312 247701 153382 -13229 -139341 54894 114353 128355 144948 84657 81832 195899 191603
15301 191603 155902 59331 -64075 -148263 -109951 8253 12550 -47648 -115759 -90310 -16052
15290 -16052 -78628 -150745 -77821 -81569 -58495 75986 10573 -74974 -148910 -146898 -106113 -86603
15278 -86603 -40699 -13153 123230 89924 35941 37896 -42915 -112975 -191000 -91551 -26974 -5497
15266 -5497 10107 7044 -29369 -112270 -14715 31006 4930 -35238 44912 122935 56525 14172
15254 14172 -43082 -26062 49122 146006 53519 -127729 -136161 -52187 -63859 -62251 -135685 -103944
15242 -103944 15834 -5001 57354 73388 42640 -21690 -59636 -159023 -125241 -207877 -203820
15231 -203820 -196743 -188769 -16892 97838 115757 76212 82177 124021 151136 33832 -143784
15220 -143784 -122477 -73237 -54604 -114433 -89193 -83400 -31491 47620 139780 155011 130871 7865
15208 7865 -75704 -67431 -83142 -55129 -62689 2811 74295 73197 39671 -84388 -146784 -92729
15196 -92729 -104847 -94515 -114182 32310 30998 -64562 -165942 -89228 -141148 -192716 -118049
15185 -118049 -132203 -166818 -32257 87683 89135 74987 164594 187502 52473 73658 59288
15174 59288 -125491 -155487 -121374 -43051 103192 136837 57377 88122 125045 68012 101534
15163 101534 191090 189830 153961 83708 189758 215389 136251 96407 76820 77424 43544 -5007
15151 -5007 76790 88070 141582 110393 85488 35773 -3256 12090 85909 29823 33407 97349
15139 97349 24168 -127935 -227092 -83383 44359 41269 -22672 -33271 -13736 -6594 -89955
15128 -89955 -104057 -61485 -20252 65304 33373 -104572 -137039 -149657 -71259 28243 15477
15117 15477 -8408 -7414 -28582 -120969 -119610 -797 82840 79043 108804 68455 -64626 -37737
15105 -37737 11454 16556 92873 156239 130276 127493 183392 117009 89917 65904 174821 152285
15093 152285 56304 -17548 58192 138090 94695 89024 99209 98559 220663 215687 214711 156301
15081 156301 140370 120176 126158 228962 214883 275526 194023 188801 144894 90598 77845 65166
15069 65166 38234 75240 64339 58762 162674 164116 66993 34447 -40020 30357 42655 -40442
15057 -40442 -69585 -51971 65610 136213 125645 39887 -39370 7088 54332 48595 -11346 -123214
15045 -123214 -5183 82981 23633 -97483 -164803 -29916 109352 37726 -63259 -83386
15035 -83386 -36346 11037 157286 196592 65216 50989 -81177 -103003 29437 34166 150423
15024 150423 218788 266212 246812 339091 349224 258721 162396 76726 20442 -6689 -95396
15013 -95396 -114649 -164361 -196920 -45289 77481 37091 43879 62477 89556 116652 182020
15002 182020 267419 258581 169162 181326 192184 155426 63724 14338 -13757 -45057 -133394 -161020
14990 -161020 -34984 10583 4584 -18502 29685 35867 23016 106531 142901 108914 57276 6005
14978 6005 60285 142478 148173 147235 199783 58175 -103877 -47019 12261 -55515 -124745 -89675
14966 -89675 -27258 96378 133837 108455 99524 84142 154282 161666 152217 108169 81413 62450
14954 62450 42283 8474 -69036 41173 188294 125159 120303 133206 109010 45284 -59653
14943 -59653 17496 3245 -39224 79443 125183 123010 63932 101201 94371 109107 124733 124073
14931 124073 93804 74957 -47086 -101236 12303 70092 100720 147725 131063 137922 66967
14920 66967 64329 84404 50304 82170 232467 185885 -12146 90438 163930 72647 -14631
14909 -14631 -2453 84023 116283 23986 70267 154623 272317 252793 199166 151049 20262
14898 20262 92937 75081 75011 5658 -28343 42869 87922 159252 168693 132649 129826 130550 11821
14885 11821 2877 79721 203042 277667 198266 195651 219337 224757 279461 127737 -28887 10251
14873 10251 45912 34095 119072 117269 43401 118916 177322 -39355 -38283 -6432 59455 54831
14861 54831 28155 234856 177448 133296 154056 99001 72727 124964 142048 198434 216715
14850 216715 170070 169036 127973 55900 -13008 160226 304330 177386 129335 245617 290341
14839 290341 212651 126153 128174 120159 151398 139254 115215 142416 107862 18198 16282 108487
14827 108487 199674 193361 102269 63102 123260 165142 203267 200415 223023 259447 206558 209828
14815 209828 228053 354557 436808 384824 378945 308782 338844 280169 251036 284737 427329
14804 427329 427102 256921 155219 136162 180471 279786 301962 348983 288595 193937 252841
14793 252841 207339 229177 183059 213112 216599 262552 182674 180560 212706 199116 136808 200053
14781 200053 292535 296633 341966 276389 150115 226402 202101 136876 103099 56623 100505
14770 100505 91243 162829 124501 10194 -660 33358 142743 150098 203470 258880 270884
14759 270884 259425 270675 334373 350380 256711 264865 152393 208302 210107 97707 -40183
14748 -40183 34929 141578 53039 -27276 -55796 62359 143769 70471 74882 33655 -32013
14737 -32013 -119705 37682 224088 270915 335335 206086 175468 212388 226335 283229 298115
14726 298115 313428 315449 286530 310562 225615 278948 224122 112027 -48980 -116904 -53758
14715 -53758 -24669 98964 131732 245995 285285 230191 139038 13128 51503 86368 219219
14704 219219 269633 294875 194639 171968 259368 359295 353772 360532 307660 212305 79050
14693 79050 111643 240559 352403 397053 262319 199971 263538 233341 200667 242985 253125
14682 253125 258545 195010 118177 172655 185931 229287 223982 176011 153639 78867 159672 231684
14670 231684 283784 315147 206642 137887 131050 195465 164526 105830 129896 312348 428531
14659 428531 380789 362200 340554 272589 253513 246673 238111 176860 228685 253805 315804 345389
14647 345389 359066 319302 324908 276893 344221 388400 327737 242268 320656 353273 223343
14636 223343 169360 163997 151294 112215 101938 132480 212844 373491 399271 324599 289863
14625 289863 243825 330229 310814 404277 323891 299296 233778 257062 299219 346354 402110
14614 402110 323806 215982 245894 277561 310709 272369 203706 181858 135711 132039 217508
14603 217508 361358 374880 319662 216066 201641 234571 222127 206592 188151 200723 274582
14592 274582 252424 200399 321145 237299 186881 291941 292703 371801 298428 201696 249199
14581 249199 231969 334101 461693 390602 358975 387304 388196 322314 362485 363104 359883 362369
14569 362369 346167 375197 428095 489648 547585 627055 675806 613103 550829 488777 461698
14558 461698 437362 380624 464135 442854 416014 385757 287992 191723 307674 354535 308386
14547 308386 275788 427387 410655 280529 388802 507096 436323 423427 455858 421516 460666
14536 460666 457145 417232 251414 268556 337486 258411 370026 475343 432270 368635 338913
14525 338913 355891 408280 400059 392596 361447 339054 297630 276564 337755 314010 284918 339911
14513 339911 398283 369827 354662 474512 467593 363801 232120 178878 240764 358861 361961
14502 361961 519665 561934 606040 627516 599882 475799 526880 485430 377001 360063 431882
14491 431882 442733 425850 474757 641559 692936 573161 483678 287941 234276 313808 424637
14480 424637 493094 539795 593198 587819 563896 601337 572119 574425 518889 432230 460564 425189
14468 425189 443115 416104 479443 517215 573160 676253 662057 635368 532580 500582 556062
14457 556062 630332 521423 487361 453845 437446 470571 482330 421958 427439 599049 671842
14446 671842 691720 617863 509537 401841 500347 609065 636895 597468 647944 747457 773714
14435 773714 797620 758957 621640 563466 613639 591328 488478 524347 656331 734159 745579
14424 745579 732726 685868 643122 670258 660293 675290 682040 666965 758217 879161 890049 737010
14412 737010 663796 707505 630424 657375 755460 848708 770973 722868 725075 649144 648331 736042
14400 736042 766839 804551 849345 820582 747969 759897 730581 742359 634762 611138 613687
14389 613687 527318 576012 638962 787276 755548 648611 614126 611602 621307 653492 622215
14378 622215 672895 817776 784460 765313 816558 727156 660236 818250 960053 931109 953370
14367 953370 961111 852635 775709 710516 839589 931279 888325 822619 768350 716064 720684
14356 720684 747749 865285 924833 870127 878490 781209 691833 860353 993592 976773 1086819
14345 1086819 998101 954533 825971 852100 881913 925064 980827 933070 876802 800623 909337
14334 909337 962938 1007657 1126485 1124005 1161549 1241708 1247662 1308314 1255609 1181129 1179336 1240492
14322 1240492 1135622 1011746 914535 1011338 1212859 1128357 1044065 989648 970063 925515 969693
14311 969693 1087627 1035780 971857 987614 914422 941311 981269 1108878 1182163 1158932 1097581
14300 1097581 1022721 1070024 1155789 1223419 1149541 1155190 1089648 1035239 1048752 1112306 1076181
14289 1076181 1094989 1144267 1209728 1225638 1281073 1295112 1231644 1310741 1356350 1378197 1382765
14278 1382765 1309673 1210300 1196235 1248949 1258227 1238166 1177853 1124310 1079557 1020046 1008168
14267 1008168 996544 1056402 1158476 1209073 1249267 1353083 1438641 1488708 1545654 1426433 1312106
14256 1312106 1351408 1359061 1504671 1562533 1455873 1330850 1392041 1424045 1506466 1558970 1515190
14245 1515190 1515441 1543831 1594112 1568021 1484085 1438226 1462061 1451765 1534242 1516938 1463728 1422087
14233 1422087 1465701 1527685 1513420 1563230 1702143 1794473 1794413 1706276 1762142 1750739 1804443 1862575
14221 1862575 1794687 1752449 1786216 1854561 1928907 1864629 1829743 1827707 1921268 1940175 1776117
14210 1776117 1791264 1812618 1829841 1812550 1822763 1818763 1860189 1950453 2080322 2033452 2077649
14199 2077649 2035111 1937033 1883651 1917888 1971103 1930996 1998149 2048871 2076526 2190228 2245841
14188 2245841 2191027 2154122 2120271 2209080 2316439 2330720 2300843 2295986 2212923 2325580 2407405
14177 2407405 2369527 2358544 2220482 2205579 2332874 2411145 2370303 2359614 2360557 2350781 2359444 2487259
14165 2487259 2734607 2725243 2644867 2737932 2771615 2726593 2715478 2881538 3015075 2936519 3055243
14154 3055243 3197549 3114817 3087765 3117212 3107951 3111355 3292442 3537430 3755739 3800040 3810482
14143 3810482 3960939 4042941 4087956 4037170 3974934 3977801 3966199 3927825 3835100 3702739 3666962
14132 3666962 3594254 3533899 3509878 3504410 3536352 3671091 3707691 3686948 3533752 3389718 3437055
14121 3437055 3518614 3663921 3722693 3733474 3730508 3624601 3636510 3655519 3689721 3811140 3910660
14110 3910660 4023724 4051899 4055806 3914213 3934997 4067509 4178359 4240721 4194013 4199831 4146472
14099 4146472 4175515 4273712 4408184 4393260 4483272 4581096 4530894 4488625 4617186 4722964 4793264
14088 4793264 4782543 4787355 4822049 4835608 4889639 4887504 5030615 5057335 4968995 4919241 4936698
14077 4936698 5084693 5109588 5163239 5227759 5231615 5338899 5405846 5511635 5472173 5422239 5435497
14066 5435497 5461856 5520881 5567590 5624103 5656546 5752729 5737729 5880557 6057126 6157954 6205004
14055 6205004 6241857 6378269 6458616 6475649 6515830 6583375 6620032 6643146 6664829 6747440 6928992
14044 6928992 7141755 7169136 7179622 7213521 7270452 7300693 7404665 7556709 7720533 7773622
14034 7773622 7851139 7895918 7945049 7950212 8117988 8257163 8385028 8538535 8538190 8565604 8679062
14023 8679062 8792477 8949220 9139943 9224357 9198155 9259926 9420181 9443063 9656758 9899627
14013 9899627 9917352 10009375 10164673 10356016 10356869 10433429 10569747 10713245 10815447 10962259
14003 10962259 11196897 11331673 11439786 11610431 11783117 11920301 12130032 12350245 12535136
13994 12535136 12721966 12797162 12917559 13093257 13307113 13474287 13624323 13744376 13916776
13985 13916776 14070686 14279499 14398240 14584905 14895332 15089642 15363079 15673133 15886175
13976 15886175 16117070 16298618 16517256 16751692 17098596 17264078 17506438 17759167 17911977
13967 17911977 18173773 18401898 18593151 18954197 19298059 19549118 19869663 20110216 20341047
13958 20341047 20524780 20767439 21122069 21564997 21977946 22218594 22527483 22764540 23056543
13949 23056543 23444159 23772685 24120245 24615270 25100304 25528231 26085868 26661636 26952611
13940 26952611 27185522 27692291 28175990 28432967 28880176 29417237 29969412 30295989 30797418
13931 30797418 31319160 31843777 32248842 32686917 33272676 33866181 34289945 34818453 35320943
13922 35320943 35693244 36167181 36650970 37156634 37762304 38372515 38885234 39458676 39999028
13913 39999028 40584614 41141298 41806071 42494270 43081303 43536962 44017521 44467112 44984666
13904 44984666 45505882 46056279 46619965 47255380 47797427 48327939 48827030 49443031 49925714
13895 49925714 50407070 50910866 51348827 51801297 52206940 52520328 52855999 53297352 53692801
13886 53692801 54020249 54391794 54726477 54951484 55223679 55500998 55717408 55957845 56194980
13877 56194980 56500889 56734491 56917484 56939443 57110973 57253226 57265499 57200491 57079002 56954928
13867 56954928 57067041 57046026 56801668 56524006 56211181 56096274 55794158 55439108 55113402
13858 55113402 54851374 54493051 54211046 53861839 53628772 53251466 52776572 52321993 51926622
13849 51926622 51556147 51091680 50512184 50052490 49472958 48937427 48463777 47945222 47366021
13840 47366021 46902818 46378861 45855081 45329940 44868637 44491553 43850028 43263232 42720418
13831 42720418 42173438 41436820 40792716 40186736 39726916 39327223 38802506 38362317 37941469
13822 37941469 37438524 36799303 36133069 35593630 35189321 34725629 34155289 33528519 33024436
13813 33024436 32573781 32141507 31768001 31402705 30918528 30474845 30056134 29544783 29082582
13804 29082582 28652238 28160563 27720438 27415418 27088006 26693002 26364440 25945905 25402540
13795 25402540 24988043 24613109 24338723 23976592 23605514 23185374 22723650 22440197 22104751
13786 22104751 21751766 21435600 21035977 20675920 20445075 20241588 19987990 19780729 19504577
13777 19504577 19298709 19082224 18798167 18571506 18319964 18066376 17867348 17591620 17406272
13768 17406272 17322009 17125667 16991053 16622054 16082041 15764849 15546503 15373224 15200242
13759 15200242 15045365 14927568 14704558 14528420 14437654 14294156 14149906 13842504 13560529
13750 13560529 13350684 13007214 12869156 12904313 12658939 12522263 12524148 12454285 12277169 12216133
13740 12216133 12052888 11776438 11525873 11429230 11310282 11084080 10894219 10708087 10677451 10600831
13730 10600831 10465827 10382453 10271866 10132191 10079520 9982303 9906013 9876872 9784378 9648756
13720 9648756 9469275 9327276 9257604 9142316 9108454 9020750 8965416 9045240 8911954 8801098
13710 8801098 8767395 8610923 8377279 8180450 8171708 8195294 8069953 7939763 7829996 7728900
13700 7728900 7722244 7722483 7633587 7500359 7354062 7121349 7069039 7126043 7106800 7044112 7034123
13689 7034123 6956550 6830167 6834006 6862136 6822023 6676613 6614734 6555490 6297067 6210203 6126930
13678 6126930 6015370 5962384 5986812 5960078 5967218 5878970 5731527 5779625 5817187 5783904 5761196
13667 5761196 5838928 5788655 5801267 5822560 5644344 5508196 5633303 5629384 5527041 5469350 5391481
13656 5391481 5349750 5258284 5168342 5017451 4917055 4863757 4793991 4837616 4811928 4711892 4621303
13645 4621303 4619683 4700781 4696330 4623467 4465928 4354477 4344596 4327344 4387293 4348563 4290240
13634 4290240 4221631 4302698 4348597 4301843 4306456 4169811 4194571 4327814 4211636 4177136 4145703
13623 4145703 4057635 4065317 3968344 3949845 4085122 4045031 3961916 4027840 4038854 3924377 3810271
13612 3810271 3779349 3838037 3939970 3889057 3968319 4093143 4193171 4177141 4193007 4167562 4254926
13601 4254926 4251507 4105554 4075996 3986455 4052184 4026078 3900944 3785984 3642667 3460214
13591 3460214 3351209 3292355 3231117 3249212 3367954 3307889 3144059 3046048 3099462 3080944 3157317
13580 3157317 3113393 3062349 3009801 2955736 2881001 2894096 2930840 2908126 2880494 2792934 2728013
13569 2728013 2606051 2582965 2643008 2690791 2818815 2766425 2624877 2652833 2655081 2555188 2502025
13558 2502025 2411377 2324817 2369925 2432714 2408966 2402138 2482768 2520519 2498622 2462881 2500614
13547 2500614 2551801 2501885 2374904 2304986 2313768 2318190 2254324 2202713 2266258 2300048 2251004
13536 2251004 2340177 2378574 2407309 2413521 2410575 2456254 2409973 2300545 2201462 2181506 2094181
13525 2094181 2137237 2101972 2014036 1936086 1926172 1887545 1917404 2005928 2102515 2064500 1909452
13514 1909452 1856245 1874638 1787039 1713121 1626516 1674576 1912023 1936514 1826537 1802998 1739857
13503 1739857 1784986 1811018 1867457 1795850 1836046 1818411 1767336 1678844 1673891 1618288 1660413
13492 1660413 1700023 1624745 1643228 1572105 1650904 1788561 1689621 1683623 1733319 1730674 1655915
13481 1655915 1689652 1711122 1710125 1722676 1707165 1807986 1845279 1894404 1744617 1601708 1523491
13470 1523491 1563460 1588461 1550581 1560589 1434753 1447034 1458726 1444087 1490759 1572022 1696212
13459 1696212 1536298 1383784 1402849 1433930 1455173 1506848 1369095 1277981 1306814 1312268 1298517
13448 1298517 1286951 1353671 1333069 1367082 1372341 1242179 1220004 1223200 1173776 1250946 1262178
13437 1262178 1175313 1186346 1221700 1228922 1238971 1244332 1177567 1276250 1396622 1527635 1422778
13426 1422778 1430172 1433433 1360018 1342200 1287173 1213257 1204530 1251252 1265353 1255865 1191193 1164604
13414 1164604 1095760 1177080 1233513 1252503 1356440 1362671 1326238 1374851 1343879 1178066 1125871
13403 1125871 1128545 1158481 1088884 1165341 1304893 1341392 1238093 1224766 1179722 1228656 1225422
13392 1225422 1150833 1154168 1184698 1182011 1113631 1048921 1003830 951091 1011936 1007749 1050400 997556
13380 997556 954810 946043 929275 919151 1090208 1177161 1176065 1087878 1084350 1040711 980730 970625
13368 970625 851387 821480 938795 1021322 1007168 969308 1078313 1050385 872935 834714 882134
13357 882134 822504 806351 834251 868920 925828 968141 802347 759687 756431 705888 747472
13346 747472 742117 754312 732252 796065 912042 850837 715985 633394 571549 540425 703005
13335 703005 773570 858699 999720 1100869 997025 899553 908403 852892 816949 895308 985776
13324 985776 979794 913655 912605 816589 634079 592414 697521 773806 875376 803115 713465
13313 713465 716219 658170 621295 827397 866298 787096 726132 698335 696890 670666 639536 736770
13301 736770 604172 555917 654933 749996 618182 411924 346390 468572 633696 667769
13291 667769 708339 838733 772319 647971 662910 813832 885578 864674 745829 641150
13281 641150 489702 575777 658052 705311 773178 752088 705302 739348 797030 852565 743347
13270 743347 654677 595123 588758 682823 681803 770040 730182 807829 787689 748023 804791 782263
13258 782263 795635 711971 729525 662271 525654 468309 538650 525648 449576 495871 421858
13247 421858 456175 585447 609839 566348 547753 576387 613391 650078 582745 627863 613339
13236 613339 606110 657058 753099 687814 648118 611103 587375 600932 537660 558915 469168 418264
13224 418264 472269 605074 606469 550737 501300 456216 458436 473488 497514 630799 628161 567238
13212 567238 499233 565917 597314 495556 459113 603324 646648 667302 654140 587986 342143
13201 342143 361238 494085 636540 643440 672005 665254 548955 456199 579721 638903 564340
13190 564340 532653 478227 441840 448126 440512 440461 516227 628528 589455 485342 431975 403932
13178 403932 438316 434203 396195 502344 632227 535453 447114 474417 523625 582605 558971
13167 558971 519298 342750 278847 464668 533703 561118 638280 567709 542412 426826 470795
13156 470795 459742 341044 399791 546583 697426 585594 476958 475202 473788 517404 545271
13145 545271 512717 587882 576775 470766 507568 515268 440305 418439 549426 530382 536778
13134 536778 501505 411563 377449 515838 554798 510537 541310 536009 513370 492507 535363
13123 535363 425182 354239 430375 375638 370594 307294 345656 355725 298745 256428 338836
13112 338836 452925 347833 258291 324177 277427 232233 192206 274549 344078 468713 621887
13101 621887 621506 431099 453794 373085 346721 263670 201855 213373 307048 227138 169515 222019
13089 222019 314099 396871 444075 403719 451759 429169 396162 382182 463266 469926 478404 566347
13077 566347 537471 464667 507561 337048 212819 242388 290898 397402 532418 467387 441741
13066 441741 469674 535752 537981 567519 617525 398563 208945 165559 175508 338256 333386
13055 333386 405751 371088 372173 485776 436862 344703 307561 337240 330519 328239 427782 463195
13043 463195 391347 445628 516875 464376 386080 251124 275881 299789 280639 361209 385083
13032 385083 349889 386033 423091 349171 307227 255650 141289 168251 210930 201403 177699
13021 177699 181510 162978 176351 283866 277483 266624 110280 -12076 52497 98475 163151
13010 163151 249022 249413 244661 143328 39502 86366 191612 128186 -62502 -143697 -69516
12999 -69516 79352 167158 249762 303724 290949 223664 269470 292004 245761 193890 148195
12988 148195 129645 66764 77995 -31840 38318 173179 275449 462822 551146 485221 450781
12977 450781 413837 328100 314045 342281 415960 341108 150075 71065 66326 109050 136607
12966 136607 145491 168473 243664 254460 169107 139672 248214 302780 145632 190841 200023
12955 200023 199338 215760 182698 168900 146054 154481 159796 159655 195079 230451 278201 319995 251147
12942 251147 145946 51096 92734 149131 246313 298293 199340 271484 293669 230490 212631
12931 212631 309393 209142 173397 202385 281770 297577 263227 267543 195832 249978 333984
12920 333984 304177 220866 167526 139579 189741 352368 384758 334277 169287 158838 296992
12909 296992 213709 276824 278610 269561 183645 119650 121201 33350 80508 134395 102476 162996
12897 162996 181969 154335 124975 13717 94866 89684 53738 6525 79088 161136 35958
12886 35958 47856 35790 158227 328834 253981 150347 137577 182019 139916 188412 235439
12875 235439 283948 195930 118707 154290 131075 131379 246605 234860 187871 279513 365798 354876
12863 354876 369519 401310 230946 103012 160620 250330 276201 182499 110806 108545 191464
12852 191464 274597 339063 292049 223357 156530 164655 298690 309487 307460 323753 325413 288822
12840 288822 224800 209440 259260 269082 279737 134979 59685 128989 113591 79965 13518
12829 13518 -48433 25233 99372 151294 237171 185759 192604 62251 -49693 -51671 90502
12818 90502 117610 119557 170671 239730 243002 198856 258545 249344 346137 338570 270734 276232 269754
12805 269754 198894 83626 117612 175850 96386 57757 213708 299468 168802 139563 167844
12794 167844 117446 94891 16490 -40007 -9244 104918 223190 213325 193954 123906 131371
12783 131371 129664 97669 139522 237604 218165 123426 188438 111722 177089 219198 258355 166251
12771 166251 26857 -7413 102966 109781 66686 32693 35739 33350 22977 100395 259914
12760 259914 193552 209639 169081 170974 170753 190817 155761 132725 57718 -43860 8452 -70509
12748 -70509 12985 95161 156036 139363 214241 235333 238022 223326 137611 115028 190312 190965
12736 190965 173126 136745 124674 200047 272226 283027 275261 110264 82458 10848 -14246
12725 -14246 30703 52647 216859 293853 322452 216641 167882 130296 144571 110177 45287
12714 45287 22289 43473 34020 54075 113952 191848 265112 212692 292148 309788 258058 192614
12702 192614 133059 190108 77121 33908 62253 47634 54139 147526 61667 -59501 -38477
12691 -38477 -70887 27747 79065 22210 3707 -121743 -191215 -146137 -162108 -103769 -35710
12680 -35710 -12851 -6413 -62052 -123677 -82554 -7297 -29034 33485 117107 223417 212830 153591
12668 153591 41866 -2750 -75184 -17044 147195 203624 287401 240909 282761 212064 75396
12657 75396 -4521 -27402 29027 5958 738 -46612 -123389 -88946 51730 166929 271383
12646 271383 285980 228122 126405 106526 206537 233540 311606 375262 310822 159417 192243
12635 192243 90617 58599 160303 335209 430225 332826 181674 35290 75574 63517
12625 63517 18384 -2361 124825 72143 78037 79430 15738 -89750 41216 181917 156245
12614 156245 179529 311706 313176 168879 134144 226682 231893 187203 149417 207904 187287
12603 187287 54660 40041 37852 -44776 -36795 -2075 53896 41117 63633 2245 -89 28410
12591 28410 40582 42812 63239 77744 133669 167802 147532 48817 80571 -32287 -59169 -93413
12579 -93413 -38480 49119 83700 123004 80997 109387 20856 118579 183628 146879 680
12568 680 -108422 -27024 -25753 -93582 -77872 34684 125505 39443 -68760 28244 146304
12557 146304 306829 349623 316314 189401 87716 50719 -136101 -128191 4696 62095 104705
12546 104705 133847 76783 -41004 -43913 -23530 75487 58904 -17540 15027 -103244 -140468
12535 -140468 -43849 45943 80432 44419 -84077 -173669 -107066 -61910 47517 39595 -741
12524 -741 94443 82816 173411 135294 112994 181661 199620 155444 131247 83176 44780 56631
12512 56631 3546 -88213 -80281 26037 187751 166205 55740 101868 161034 188466 215502
12501 215502 311248 293277 335266 274052 66588 -35139 61777 222076 209192 177939 151049
12490 151049 200708 156246 88870 122268 205058 255236 292067 264991 204114 222982 188443
12479 188443 225753 225501 245405 237864 184671 188742 259234 267779 208989 211810 191160 85240
12467 85240 50969 82743 99659 48043 24973 68639 53181 112361 58631 104950 97358 131891
12455 131891 62614 -31735 -48143 -59501 15686 201120 288478 255296 169001 179383 118002
12444 118002 55634 -88302 -152240 -129174 -98083 -9348 164526 186781 150450 165558 297372
12433 297372 238386 100100 109547 30348 173310 211998 136050 4052 -124489 -87952 -107268
12422 -107268 -125316 -131192 -198765 -49253 83863 54876 110447 135384 191915 157975 77054
12411 77054 62536 129680 196388 134798 116320 93200 15899 -40593 -112702 -7727 26695
12400 26695 97001 118609 116519 29234 31954 144790 141015 -23389 -57685 53832 102467 105866
12388 105866 116405 89025 196304 203495 268386 160154 185153 114794 149511 285423 279357
12377 279357 265710 283621 191053 124593 122585 207491 236128 130295 74894 102473 86470
12366 86470 110867 113800 156440 99422 -54766 -100245 -102549 -53679 -28884 -63077 -121654 -53749
12354 -53749 -648 40480 74461 -20152 -46411 35848 -29311 -12706 160636 204982 104025
12343 104025 9578 29439 33481 -39928 -179509 -121300 29948 106229 296097 103579 -37267
12332 -37267 9290 64261 153724 193546 169076 124058 55457 -94097 -36536 37376 194155
12321 194155 265041 123002 -48756 -194898 -144312 -155907 -208603 -184198 -167643 -214511 -162285
12310 -162285 -3172 -104722 -134348 -89125 -96438 -33241 50550 120097 127082 39963 23675
12299 23675 48067 102257 270632 186727 79683 2623 109756 155801 166433 132247 117894
12288 117894 14947 -9357 -22147 23503 54071 117333 89465 79651 123750 134368 -1170
12277 -1170 -98395 -162035 -200389 -7750 28334 50670 63118 54497 40048 -68014 112064
12266 112064 220878 239641 258200 252873 176395 63467 -39754 36020 193695 268519 117972
12255 117972 79144 117874 91746 51805 -11144 -11206 43468 -51519 -132980 15640 15130 -16722
12243 -16722 -43421 -51422 31475 137942 176644 208720 169282 145461 230076 360915 315303
12232 315303 154083 48154 99843 188167 195678 136107 -11421 -17557 1621 57134 56396 116429
12220 116429 85708 80799 163965 67014 -64264 -78091 -51332 -59205 -70566 -15371 92922
12209 92922 151102 145590 183909 204324 118185 22910 -41357 16993 43489 -55996 -65982 -77338
12197 -77338 -138510 -111049 47521 54929 103794 60658 19793 76966 170742 258963 191520 -51617
12185 -51617 -180874 -44098 77948 143591 166369 141778 46816 -47928 40801 155889 141929
12174 141929 96860 116598 -115414 -175145 11142 40672 -72772 -64389 -42590 -36373 19177
12163 19177 74257 9222 61967 145323 28348 -54147 -159221 -76051 -27888 -84039 -83277 -13158
12151 -13158 34906 64658 135573 153443 -26397 -148963 -111938 -148474 -196513 -146849 -101586
12140 -101586 -52336 -34628 -57307 -94954 -22414 112493 57339 29412 58676 -25480 -35854
12129 -35854 -85527 -5854 94022 91110 106310 42436 10838 113975 197943 275972 352519 326665
12117 326665 247014 109878 -55262 55304 93095 109606 117415 15927 48918 67398 77012
12106 77012 34480 -138569 -209054 -85359 39875 78489 -34508 -41856 -18847 -12 -15451
12095 -15451 -36020 -110800 -67484 5802 -58595 -73084 -131878 -44619 -8702 -16311 -74366 -1099
12083 -1099 29610 -29736 -54252 45501 -8614 42429 213245 171121 3200 13548 129791
12072 129791 238519 275918 250908 166310 132532 113145 143348 226943 205638 102099 28925
12061 28925 75120 142246 173778 50633 104754 143038 114680 164977 282589 359470 302391
12050 302391 255233 352730 332367 156225 136021 121010 46897 -92626 -195724 -184503 -118678
12039 -118678 -1164 -27532 -42374 -38202 -69426 -87032 -24133 -1892 161363 215773 210104
12028 210104 197393 110740 42814 -66308 -129355 -62456 -25313 28644 29589 -60869 -117192 36005
12016 36005 144764 149334 60447 942 979 73291 81957 21564 -6116 -31669 -71658 -106013
12004 -106013 -47517 112417 84686 -57415 -90763 -104867 -172763 -88866 73317 217832 101728
11993 101728 -1277 47144 -18692 -6064 59150 67962 99726 73800 -49163 888 144569
11982 144569 224526 390656 477704 446185 381365 159104 44468 29047 -23229 -6016 1980
11971 1980 76914 34651 -10434 4163 44203 -48667 -17380 -45895 -108835 12269 136977
11960 136977 276478 247419 147092 81465 64490 98175 128781 94200 9545 -102549 -75383
11949 -75383 -61666 -70392 -166078 -186261 -97710 10132 18699 -22958 5712 -39210 -106970 -161956
11937 -161956 -135090 -128556 -129341 -215187 -195723 -188761 -227729 -222613 -110802 -123208 -122671 13986
11925 13986 -5158 33671 26509 1692 -32159 4306 -112352 -110293 32695 109093 158109 209385
11913 209385 157859 -64329 -54157 99188 52234 -92339 -126032 -79108 -22578 38877 75108
11902 75108 108376 62955 -70627 -71249 64409 175598 129980 -30455 12274 41227 51312
11891 51312 45523 -7155 77861 115431 132100 3608 6927 135560 193916 184023 119463 19873
11879 19873 -94054 -111683 20617 164109 129778 131032 -21904 -12413 108017 67344 13014
11868 13014 -91287 -93223 61358 167736 160685 101350 -1340 14553 -31868 -74424 -123630
11857 -123630 -8323 70350 89797 61482 -44900 38329 -78623 -114433 -83269 -38990 -62945
11846 -62945 16101 84385 67829 60282 126877 166378 159397 207761 278172 207222 39651 41177
11834 41177 69634 36141 24094 88775 55891 50559 66711 10461 -57325 -59317 47478 -36762
11822 -36762 -30254 44288 47780 124375 90157 86557 -55156 -100678 7669 -5287 -13848 52616
11810 52616 131265 100809 85584 112233 166899 212285 85744 -63602 -60349 28867 -43867
11799 -43867 -108715 -25208 53022 111210 39037 -53330 -13854 -2741 56397 -38 -38957 143701
11787 143701 237046 231126 209921 174525 219124 272349 123403 51538 131187 204406 265767
11776 265767 204251 168141 46814 -116190 -84581 27378 74965 71400 31433 57884 99289
11765 99289 66594 82173 171388 83871 -46532 -46940 18769 -37108 -202811 -124238 13393
11754 13393 57407 88567 62892 59896 86704 -9928 -45723 -22645 -37806 -38665 15496 144205
11742 144205 149514 63698 34934 48990 5592 22234 10084 127945 176945 46327 -147909
11731 -147909 -189347 -250536 -249115 -131059 216 5640 -115214 -177580 -267866 -80559 44635
11720 44635 70477 53507 -16186 -34189 -130761 -53281 113598 125900 157282 166541 165112 -27173
11708 -27173 -64604 14655 -113678 -216090 -136488 -176530 -219414 -170661 -180816 -124300 -100107
11697 -100107 -82959 -172845 -239880 -277088 -341832 -269968 -210653 -158540 -63386 -125877 -96965
11686 -96965 -72268 -38972 38792 24222 -64404 -109522 -30668 7428 -10341 2795 -53317 62876
11674 62876 78814 125259 97509 84431 20282 -4513 -35660 -121738 -49108 49169 90815 92579
11662 92579 96124 31723 33523 92437 187824 187267 103590 36953 20514 7025 77951 115344
11650 115344 90541 -7264 29649 70684 -85436 -46821 -18694 -36376 -7269 -97969 -191092
11639 -191092 -229740 -82110 8795 -4586 67944 91434 28606 18615 75043 -22407 -42608
11628 -42608 38525 46466 95629 97796 15198 8172 84171 171310 65071 5440 102063 158569
11616 158569 130809 133686 48372 49635 103282 28018 -81808 -81463 46524 172204 129161 86020
11604 86020 -1518 -82552 -55725 -13366 60505 -20144 5649 94051 196110 209804 277228
11593 277228 180461 15128 63635 94864 110962 198514 181636 90226 36677 33114 19620
11582 19620 6543 19345 75694 134326 133262 104048 73684 137981 177381 165941 150018 118540
11570 118540 144407 260209 198349 95066 71025 36819 69831 91481 132622 98543 72244
11559 72244 20726 95148 194267 208571 155610 171370 244140 292535 238238 134548 130159 207966
11547 207966 291956 342596 373449 330225 169999 23263 -43393 -101888 -58032 90111 181513
11536 181513 196699 106002 80190 58018 -37509 134729 119325 22108 18930 25479 42144 38119
11524 38119 -132463 -18464 178908 79163 -63220 48904 -61164 -121947 21633 167878
11514 167878 144365 57243 92839 34396 -3766 -14585 -88146 9381 110845 146378 134995
11503 134995 95504 254805 372982 391839 328482 192296 119541 54560 -118375 -248553
11493 -248553 -215301 -178149 -119015 -128381 -156167 -82773 236 57548 -10463 -90297 -78392 12722
11481 12722 12360 -95068 -137731 -24945 -15705 86845 255824 330824 314026 143355 20682
11470 20682 -64766 -17050 111630 51495 -117725 -111897 -255337 -251050 -59421 68723 58586
11459 58586 203 -25317 -153283 -276140 -198998 -137766 -156085 -204911 -55416 7464 -93181
11448 -93181 -113458 -132236 -29819 -53675 -38888 -104076 -113099 -52899 36999 146594 163717
11437 163717 140534 6784 60763 87285 107861 81238 59128 84396 45938 41208 115961
11426 115961 186412 169040 114109 222693 205985 176017 123882 79610 186210 258583 165094
11415 165094 -45456 -79425 -20034 46952 22354 -23116 28763 29314 33262 -38991 -203164 -167922
11403 -167922 -117855 -98789 10177 -24920 -38035 -123190 -16828 196309 217584 205841 75155
11392 75155 -64462 -101132 -79343 79217 71083 86243 19462 37805 57910 87480 17869
11381 17869 -18314 49801 105482 58107 -133543 -124065 -43912 -91964 -111215 -78672 -53020 81577
11369 81577 136474 129409 117300 53275 -66547 -103660 -28104 89144 -4342 -52092 69200
11358 69200 53351 88476 210561 125814 36148 -14171 -28615 20682 -62363 -120903 -121966 -39165
11346 -39165 -43514 -46547 -91590 -172732 -186601 -63154 -110283 -139289 -118947 18734 61884 51239
11334 51239 140866 159336 170538 -349 -16423 20742 33226 -64184 -20079 -76119 -32590
11323 -32590 54943 43969 -17806 -101293 -82096 -71981 56554 131337 35429 -22123 4032
11312 4032 -24939 -14933 -15985 -45782 -26294 -98105 -100035 -34549 26540 10715 -19748 -76213
11300 -76213 -2186 -85444 -82738 -107986 -28381 -33840 -76213 -156032 -140394 -21854 82546 107838
11288 107838 35924 -3732 70094 95460 78935 86648 52525 61499 152427 75509 22794 42
11276 42 54243 -10102 -76992 -90061 -79707 -176606 -151191 -36694 -8924 -39889 -70321 -104468
11264 -104468 -54845 -90687 -205436 -151824 -52819 79498 108325 -32725 -27397 -55177 -114096
11253 -114096 -64433 44603 97264 146892 127003 -102924 -92603 2250 2479 -159633 -235854
11242 -235854 -75391 -42671 2806 54054 21923 -7369 -68259 -34582 -19863 -53883 -126390
11231 -126390 -104714 -52057 21434 -36585 -129094 -82930 811 -29641 -97534 -111608 -100224
11220 -100224 -52184 -8813 1988 -27839 -151849 -104786 -10774 79007 29451 -174160 -280821
11209 -280821 -299642 -302724 -267821 -165419 -123298 -48981 -67059 -123674 -149275 -153519 -89600 71026
11197 71026 67868 -2030 47825 35311 -84321 -61626 -108063 -98155 -98749 -35886 92093 91852
11185 91852 25016 -76258 -69176 43257 -22127 -100554 -40992 87713 723 -20021 -24633
11174 -24633 -51757 -81547 -15761 51879 33753 75995 -20913 -6360 -29632 -25275 -73138 -146310
11162 -146310 -68494 60143 73924 -50528 -60333 -143601 -98557 129903 196456 131374 5094
11151 5094 -36096 48725 140792 119437 54005 22966 48610 156849 188865 192649 148842 190064
11139 190064 283071 336910 355960 331206 283186 199234 97044 72716 80079 -10822 94597
11128 94597 22997 -85407 -175434 -55892 64118 55733 98209 121968 40523 -27142 -69955
11117 -69955 -89452 38094 244621 277201 140665 34623 -49188 80049 84587 113527 103604
11106 103604 72096 13505 68863 49111 54684 87168 60002 46907 21474 -48775 -47544 -24000
11094 -24000 104564 184012 139678 70378 2341 -71127 -37478 63575 141936 207766 251444
11083 251444 192326 247185 217923 184432 87240 -95461 -101096 12795 86727 242348 246633
11072 246633 242605 141950 37486 52817 61774 16111 28906 23768 -33732 18804 78636 26076
11060 26076 22486 15942 -64049 -91794 64054 173822 200329 272606 252253 114086 25280
11049 25280 5999 62817 97849 161319 113131 62240 6352 -27037 -113596 -87644 17829
11038 17829 5759 -35006 66237 17647 -44192 -14577 -97081 -80415 -53462 -11237 11627
11027 11627 79713 -19508 -69159 -84897 -267576 -255183 -106557 -60227 -100671 -128718 -119544
11016 -119544 -40107 25811 86848 105128 80749 71441 52790 38232 61726 -18342 -54458 -23217
11004 -23217 122337 72520 -38914 -68961 -45681 94414 115883 108738 111631 121509 65933 53481
10992 53481 -17330 -123246 -158393 -77471 -128873 -191533 -241118 -241739 -213084 -136792 -98050 -174640
10980 -174640 -261123 -117778 3327 -204029 -325548 -213064 -117140 20359 6717 38069
10970 38069 -68577 -140157 -141400 -165155 -43387 40908 -28589 -158360 -218697 3202 70295
10959 70295 102259 13137 -4256 85081 106664 71522 103391 257325 265647 168681 94973 88567
10947 88567 54476 -47997 -147261 -153421 -109480 -110132 -76832 33406 9034 -35044 12393 -22155
10935 -22155 -75653 -5430 29391 43784 148460 149897 60783 -44878 60802 89084 105224
10924 105224 -49793 -69716 -158811 -157370 -169777 -159792 -33270 -7549 -38937 -69819 -63911 504
10912 504 -21804 30259 92177 100502 140 -89323 -133047 -104286 -11522 -36241 41573 45292
10900 45292 55875 62741 94065 86460 -78299 -45807 22570 192270 212480 153327 54325 -54281
10888 -54281 7990 79908 60488 -21337 -121276 -115383 -97851 51651 140775 61883 -87062
10877 -87062 -95440 -46381 -82712 -102696 -110053 -107135 -11905 -29010 4798 68307 -8549 -128859
10865 -128859 -88403 -4134 68707 -39976 9933 8077 -17275 38043 78233 141900 179310
10854 179310 176490 225967 268755 79511 -21056 81706 13783 126791 111547 44076 -4932
10843 -4932 -131562 -137047 -121321 39815 133265 11712 -164280 -106448 -64193 24480 102092
10832 102092 110751 37951 149566 164556 73248 107720 139100 253383 114353 131089 183192
10821 183192 104888 84884 -84684 -200396 -198002 -57079 -124505 -217108 -337132 -304863 -155519
10810 -155519 -89868 -48535 -78229 -84276 18659 -28610 -103973 -46034 -22811 -28816 -45165 -19419
10798 -19419 4994 117223 56027 -3931 32468 107894 124425 106839 128985 16752 17740 38452
10786 38452 -31102 -144133 -150638 -159403 -173629 -90208 -34539 -31672 -132563 -146972 -17583 6652
10774 6652 19278 80930 179547 70705 12569 27946 -6670 -54408 -163692 -146182 -86835
10763 -86835 -141921 -58912 -5280 17884 37564 47350 151655 109572 -947 3156 -39526 42350
10751 42350 104332 48647 46227 101475 67272 -5307 58051 90318 11444 -41756 -94217 -125034
10739 -125034 -74257 -179723 -182925 -120645 -63105 52385 72085 -37948 -203222 -149504 -128826
10728 -128826 -99335 21257 150320 203002 196803 105652 78834 107025 113529 166504 21806
10717 21806 -71863 -89562 -131229 -104976 57550 82319 134933 118492 -34381 -53387 -102832
10706 -102832 -164657 -220002 -178660 -10933 -9073 -138251 -147307 38236 131475 91225 80966
10695 80966 8065 -89087 -178133 -256956 -156397 -104276 -30024 -39287 -8469 1972 80973 53727
10683 53727 28498 -139982 -156778 -50057 51956 77370 151400 250076 263300 225195 209769
10672 209769 134142 166193 76399 -53577 -92584 -4712 24378 -53820 -135407 -147950 19827
10661 19827 141182 140240 37353 111023 155585 45782 67624 -28217 6889 -6924 -29784
10650 -29784 40228 8363 -34726 -63268 -51719 -19753 -939 18862 -54593 -76126 29539
10639 29539 54569 120516 110085 96045 102380 57201 12369 23720 14143 -3285 -77683 -98464
10627 -98464 -73556 -25188 -17104 -26814 -83724 -109919 -115850 -46657 -125398 -189230 -158639 -143179
10615 -143179 -72311 -53974 -39735 -39026 -110096 -41187 -51400 -74288 -198113 -180725 -196688 -182480
10603 -182480 11142 89291 38535 31768 -41569 -128917 -192635 -190346 -99475 -103319 -105880 -71395
10591 -71395 -21364 -70497 -138067 -112532 -122815 -50888 -76558 -220424 -267365 -133951 -133147 -223981
10579 -223981 -292372 -291958 -297217 -309979 -196675 -110031 -17993 104440 264185 344000 243137
10568 243137 80055 -8272 13071 6902 -60396 -81731 -48114 46558 21318 -51634 -57165 -47919
10556 -47919 -100366 68339 196545 202572 107001 93677 70926 88692 -24488 -97840 -80835
10545 -80835 -34492 -43270 35260 98163 105714 43232 19838 2312 42782 43197 45378 122702 133008
10532 133008 145098 87238 89889 164783 144768 33019 -94188 -50127 -206 45713 103217
10521 103217 128593 47864 53870 27954 -54142 -143863 -147145 -226648 -197367 -13233 56794 74964
10509 74964 5150 88788 63693 -204216 -292921 -144232 -65063 -30226 -42823 -33917 -138246
10498 -138246 -181242 -112111 -65231 -143271 -133590 -11390 -31413 -10087 81914 -80537 -105774
10487 -105774 -110131 26494 52145 -4116 44529 2577 -18555 -74599 -116372 -80014 -66737
10476 -66737 -46063 -103327 -154363 -164655 -77634 -122456 -214786 -271709 -343226 -276762 -60931
10465 -60931 -11830 -168121 -120980 -92804 -186640 -135489 5716 44471 -43966 -49498 -133656
10454 -133656 -164515 -147820 -37806 85440 -4895 -43219 16369 203737 169150 -2494 -54375
10443 -54375 -15877 61019 146298 55886 26316 63618 111034 70567 -49417 -124062 3151
10432 3151 52341 -18213 4681 151079 149134 47484 -23272 -33028 23404 -1545 -44932 20007
10420 20007 -7017 -101883 -186692 -93138 68449 111287 84368 72139 185217 103497 -55199
10409 -55199 -78445 -5259 100895 203528 122446 26170 -48153 -135662 -89737 46205 62774
10398 62774 50685 5804 14313 49884 11502 -36388 -68181 -15149 134845 87145 42289 92326
10386 92326 51732 -12329 -112026 -170288 -85690 -27127 -112577 -67587 -114927 -151903 -165163 -102281
10374 -102281 -147882 -140427 -103208 2147 202 -62703 -42930 5497 -6983 6540 -48716 -138784
10362 -138784 -40809 -32976 -22330 13156 62521 26628 38939 79990 66224 106291 166446 2406
10350 2406 -104595 -89408 -63279 -57604 -58350 -133709 -102629 -47883 -22461 51815 83155 149595
10338 149595 160592 215036 198502 196603 163958 64300 52107 -15533 -26594 -87312 -136365 -148112
10326 -148112 -110337 -112825 -131540 -25602 -106275 -89712 -160586 -166214 -273288 -356051 -298975
10315 -298975 -285197 -170334 -44405 -140554 -80706 -76893 -102591 -39705 -24327 -3162 6788
10304 6788 -64740 -35671 -86045 -64281 -135032 -291454 -272863 -99749 -8738 -88014 -113396
10293 -113396 -14909 41079 37894 42869 91722 19655 -48622 -111452 -117130 -131132 -134210 -66337
10281 -66337 -144328 -86961 10305 55826 126100 50382 -64336 -109861 -62763 7230 -84054
10270 -84054 -95378 10589 71709 31720 33604 -21791 -130438 -184108 -41013 -11 -39580
10259 -39580 -3753 62441 143220 127220 11597 -43741 26856 140981 11124 -119025 -146829
10248 -146829 -69006 39293 45264 -86103 -206223 -161848 -201441 -122362 -83509 -146844 -100713
10237 -100713 -41820 -11105 -49737 -127742 -107779 -116830 -53172 -54734 -78053 -15479 -9973 -13346
10225 -13346 132129 117058 68739 72028 26366 -45060 -32886 8277 -74638 -49263 97898
10214 97898 179874 167468 72933 -17833 -89864 -78373 -20861 30634 62311 -34551 -56956 -62411
10202 -62411 -125208 -220675 -188409 -76046 -120734 -128177 -126663 -67809 -41929 -109847 -224580 -120908
10190 -120908 -17218 -45385 -59168 -56868 -55481 -32960 -1279 -128750 -183327 -93088 7084
10179 7084 -44898 -23509 -86719 -243417 -198174 -24112 80233 8819 -77630 -92708 -153503
10168 -153503 -181862 -41146 11131 -15908 -132600 -140676 -60427 30359 15406 135263 69296
10157 69296 -106227 -154447 -142091 -36704 -96425 -127728 -126225 -125096 -124922 -77203 -127070 -265235
10145 -265235 -205786 -126007 -149056 -163245 -128514 -80190 -110647 -126084 -102128 -77691 -80269 -67342
10133 -67342 -57465 -25867 17307 -56452 -106959 -23200 43215 128338 58316 14528 -24989 -133075
10121 -133075 -204178 -88872 38331 40179 -38910 -1406 112815 235884 94641 -15454
10111 -15454 100811 171906 106226 18172 54910 54336 53011 89075 110897 53798 561 -39391
10099 -39391 -86198 -205577 -66917 -115434 -322552 -339815 -198939 -141470 -73087 -30173 57345
10088 57345 44256 117159 63899 91178 26474 -19936 -38223 -18060 -35034 -115306 -135244 -119096
10076 -119096 -153227 -122108 -65093 -107435 -155521 -156756 -202055 -166391 -142231 -129753 -62888 -26272
10064 -26272 -21494 -41686 -11879 -513 -33410 90943 50579 -2547 -134620 -104565 23529
10053 23529 54169 -30998 -94588 -62331 -57840 -89906 -28789 75807 46719 -15048 51672 -7307
10041 -7307 -67437 -54463 -55037 10973 -52334 -65030 -14244 27059 148410 135239 104015 134569
10029 134569 69660 -45028 -69765 -90113 -49783 -157833 -199074 -171299 -171958 -128270 -183253
10018 -183253 -105915 -1934 92710 66667 33051 176177 318157 225411 39514 65533 163869
10007 163869 137889 94525 53857 -23726 -16664 120947 191077 138275 96563 58917 48523
9996 48523 -88199 -134908 -38843 30196 40766 -44927 -91245 -89541 -25860 37944 -28420 -185505
9984 -185505 -167008 -88187 -70102 -75188 -59348 -59321 38003 107468 28696 7702 88388 82694 166982
9971 166982 143887 -39065 -51927 -73859 -49641 -125007 -194968 -98086 54173 175790 105577
9960 105577 31906 44626 73542 76870 -61357 -3762 97549 65090 -46203 -46190 -75921 -135427
9948 -135427 -50232 72129 -15125 -98943 -188907 -118426 -116745 -223003 -321836 -362180 -249856
9937 -249856 -126532 -56901 44163 -59702 -129525 -78478 -38622 -86282 -101773 43682 188922
9926 188922 58049 -89581 -176717 -194833 -69282 -63321 16259 70027 15893 -60144 25945
9915 25945 139420 159751 -72392 -54486 57282 21919 -120609 -244104 -201009 -147210 -139736
9904 -139736 -125085 -94091 33030 26543 40406 72418 21736 -23383 -1259 -137345 -246235
9893 -246235 -323400 -277349 -199655 -90915 40177 30442 32898 22766 -7223 -152607 -207563
9882 -207563 -164408 -125089 -151568 -110628 -71267 -21304 81687 86560 44035 -26278 -16768 -21954
9870 -21954 -126119 -104337 -75494 -92543 -132990 -96779 -128882 -189349 -80246 7282 25986
9859 25986 2990 97578 94097 2398 -114580 -109333 -52515 14397 131039 156920 158997 160361
9847 160361 172823 -29318 -62097 -107903 -208412 -298207 -166614 10987 88816 58111 51037
9836 51037 59099 20266 -30394 -94430 -176706 -159676 -250145 -293015 -218030 -244057 -171573 -14481
9824 -14481 124195 136625 87966 68880 106196 198940 121818 19917 8842 -13030 -102618
9813 -102618 7341 113299 61423 58160 130983 106812 196608 237222 -1823 -121265 -54057
9802 -54057 -21511 -145924 -65550 42536 -4871 10489 119746 94993 115047 49687 -15237
9791 -15237 32413 118475 82604 53899 81236 44948 -5505 -30174 46361 79194 14195 62479
9779 62479 129907 107055 113715 120082 68559 61328 83304 23321 -35515 -4050 -8289 -35351 45685
9766 45685 27899 -16155 -32202 79662 171509 164686 48923 -60279 -114079 -228828 -240482
9755 -240482 -197871 -224043 -202790 -197392 -34510 36221 21066 76112 111785 -54568 -29633
9744 -29633 82069 100485 43654 52742 16073 -38652 -30870 75550 193033 174287 58440
9733 58440 43172 28877 -10229 73789 141059 116942 14076 -46363 -102024 -170491 -214425 -232998
9721 -232998 -257253 -197613 -183828 -165402 -2755 42207 -46205 -76160 -14248 -52212 -99240
9710 -99240 -100851 -112029 -139118 -192408 -178362 -103393 -94447 -65457 -62219 -25641 89679 82682
9698 82682 -61084 91967 115432 28195 -57272 13141 -55123 51814 -36512 -189690 -129912
9687 -129912 -96636 -71278 -88693 -123986 -163905 -135831 -34369 -57839 -176947 -68134 79066
9676 79066 -65800 -266936 -296854 -252735 -218043 -120794 -57044 -102433 -892 112187 93184
9665 93184 70711 54747 -65353 -260591 -332477 -265629 -306243 -278063 -179798 -135239 -181735
9654 -181735 -88436 -97616 -115712 -97263 -145264 -252544 -163359 -76183 -149379 -134782 -73701 -78870
9642 -78870 24460 25757 -147935 -252310 -281769 -220803 -215023 -80094 -102069 -304351 -275369
9631 -275369 -286506 -187225 -28920 43136 18442 5532 47912 38627 -17232 -64341 -85933 -181094
9619 -181094 -201754 -163588 -124906 -148669 -77650 26508 122772 114884 11075 -92613 -15733
9608 -15733 15339 6087 9275 -59398 -116311 -88177 -22621 22604 108501 58502 88158 53593
9596 53593 173031 295812 267740 150834 56629 2754 51996 120226 82460 64651 92034
9585 92034 260577 283443 175107 97993 57493 8399 -106639 -120779 -62440 -15614 21451
9574 21451 29782 8553 23102 -63775 -69076 -35144 -61983 -82864 -155520 -130498 -142865 -77812
9562 -77812 24346 112579 100799 81815 45455 20157 -12554 18009 66638 59450 59169 29604
9550 29604 -119027 -236900 -179455 -149090 -132678 -76465 -42530 -32392 10759 31256 -13522
9539 -13522 -35734 -45778 -32396 -12707 -85219 -130001 -150067 -119667 -56660 55251 172960
9528 172960 126242 69874 -81917 -134732 -177191 -136625 -86922 -120851 -66636 54026 -30730
9517 -30730 -85687 -50135 36981 18666 -70632 -132549 -189956 -158810 -127899 -21567 61684 73795
9505 73795 2819 -85500 -146327 -255571 -205057 -159629 -81098 -30035 -140349 -94705 -47771
9494 -47771 -77277 -127576 -106525 -153283 -205837 -134937 10922 -20490 -121683 -175123 -27712
9483 -27712 121703 163689 73440 41524 126217 105713 27025 1354 -22416 -95935 -64199 -141876
9471 -141876 -155759 -52380 -41596 -17283 -47871 -15120 -70895 -70950 -50999 -20083 -20692 -186258
9459 -186258 -304793 -221401 -171773 -125899 -24237 46986 -70767 -141811 -110675 -152069 -79721
9448 -79721 -71532 -8295 -87925 -97128 -89464 -99617 -34174 -66276 -98208 -46970 -50550 -90777 17071
9435 17071 24463 82345 47952 -58211 -93022 7095 -90745 -251463 -246570 -217220 -181341 -197276
9423 -197276 -175511 -102154 -79137 -50584 -25782 -115666 -204419 -280913 -234414 -158992 -66268 -16652
9411 -16652 -45029 -2794 83278 38976 1590 27027 51417 47824 51009 18418 12734 683
9399 683 -58963 -47104 -44944 -41810 -170799 -253438 -111729 20864 10690 -102258 -162185 -103090
9387 -103090 -167713 -134414 -60696 57130 81245 27811 -124211 -168905 -137470 -202798 -208344
9376 -208344 -192605 -135079 -70067 -180606 -182501 -72953 -81367 -82067 -14826 -68536 -81606 31519
9364 31519 83657 21528 -112620 -169196 -187087 -155112 -152868 -122785 2489 -1368 -91857 -93010
9352 -93010 -256549 -322009 -118756 -44852 -127160 -188646 -198048 -169839 -216506 -163389 -145085 -144964
9340 -144964 -107904 -60947 100911 116869 17046 27823 111936 137084 43428 25506 62229
9329 62229 79076 90072 -11958 -101209 12090 -50417 -82066 -187274 -222950 -124095 -101509
9318 -101509 -236653 -300407 -170024 -86097 -175754 -172121 -36541 -8885 -108189 -150050 -58470
9307 -58470 75000 108843 39743 47474 336 18535 -8157 -168886 -211104 -142666 -49921 -23755
9295 -23755 15362 -40127 -35631 3966 68575 91497 11889 30958 95231 21965 53183 42796
9283 42796 49480 18715 3730 -38131 -24795 3194 22586 35245 32999 21611 -32517 -185197
9271 -185197 -135238 -76051 90743 26688 -102874 -30339 57579 111461 70501 -13606 -19149
9260 -19149 161980 92060 40090 25934 14856 -27694 -603 -40479 -103570 -11242 83424 120403
9248 120403 56174 25960 11317 50299 -20952 -167942 -183695 -158504 -17965 199072 128347
9237 128347 66947 64056 131760 193463 118992 136369 44341 -40374 -41347 53744 123489 44080
9225 44080 22471 201212 215672 154758 145096 155439 146414 62784 -80936 -143452 -157225 -59324
9213 -59324 12629 134537 156267 96420 110123 72807 95658 97423 22536 -10534 47120 178078
9201 178078 210680 161727 98871 -9684 -52695 -52098 37816 124629 101514 178507 167607 83983
9189 83983 -16915 17353 58798 14248 130696 272315 95678 -20235 -23154 177287 227722
9178 227722 151761 42733 14680 7585 112283 128343 204089 198585 107977 167680 313492
9167 313492 166034 84564 64851 26193 97412 210307 272465 257385 380858 422060 488028
9156 488028 546573 639698 697875 759677 865154 962156 1161121 1420961 1611773 1955530 2425171
9145 2425171 3095896 3991404 5102244 6901340 9632763 13490176 19085462 25204300 29281740
9136 29281740 30422673 29324200 26681646 22356988 17207808 12863132 9743423 7587050
9128 7587050 6169714 5152219 4412414 3839524 3356988 2922709 2695811 2405756 2063439
9119 2063439 1833477 1703565 1636821 1616279 1499029 1343072 1304818 1182934 984687 853067
9109 853067 702484 590510 551743 576963 534385 638282 669275 652284 640861 659551 732416
9098 732416 495445 397312 379015 366892 336988 354558 448192 361282 205199 183972 290764
9087 290764 201577 163874 205509 166348 162847 149150 226500 297202 406434 387086 320297 172084
9075 172084 104708 102627 101379 76729 143463 257531 190612 145120 165447 123993 133811 260282
9063 260282 311997 247725 114786 139310 134181 124528 130022 242588 312632 249563 166567 75145
9051 75145 101911 245172 299677 232530 238903 206736 8488 -133799 -2566 50140 -27005
9040 -27005 -29759 -31377 -5828 5125 -29033 -207476 -254997 -150585 -32108 -64191 -13363 132983
9028 132983 152725 82640 61069 18657 -2419 -71020 -58976 -69398 -74078 20469 41540 10740
9016 10740 15154 76197 131017 158411 207488 261750 150537 150780 144185 -10533 -70273 -95809
9004 -95809 -79802 -49550 -55882 -115789 -15113 34972 98083 158728 49467 40784 88958 -54079
8992 -54079 -147033 -19493 47068 126908 127011 24010 51799 144799 78398 39288 111758 194117
8980 194117 207763 214064 254036 252382 130374 48232 107007 156442 183389 150975 1915 -71419
8968 -71419 -25329 -11250 -24400 -41652 -42092 -6731 50035 32172 68208 235934 165383 136665
8956 136665 196783 264006 235287 80222 15097 -20137 25990 116981 185634 212719 236825
8945 236825 285679 334176 185476 54219 126754 137171 114585 71600 129989 81208 40070
8934 40070 100331 144087 126486 204971 192591 169975 70188 44116 20861 -6780 51983 151470
8922 151470 37850 -5419 40103 89487 142660 84979 -83311 -229018 -228615 -158749 -107372
8911 -107372 -81419 -21282 26663 1286 74653 83159 22956 -43260 -83054 -58745 3362 25053
8899 25053 -89157 -196845 -201023 -35732 -54599 -129003 -179870 -160021 -127630 -3223 29654
8888 29654 -50342 -6304 -76300 -53210 -100506 -215894 -156350 -327553 -284492 -203162 -214193
8877 -214193 -263800 -253381 -143641 -61441 -62585 -59470 -59865 -74531 -63102 -7532 98473 68095
8865 68095 30619 -82964 -126953 -99149 -108685 -33296 22816 -18346 -19330 -19586 8170 77935 233169
8852 233169 229718 83211 -27888 30047 108697 111165 149801 217243 230524 110840 -36649
8841 -36649 -42409 33545 -129847 -78047 -54394 -62330 -3927 -97995 -85215 49475 18899 -142346
8829 -142346 -107851 -74542 59961 122772 8077 -78180 -13707 233959 187985 12245 -62425
8818 -62425 -86030 -10780 31710 -25516 -138825 -139676 18926 35254 83480 59488 -23999 -34694
8806 -34694 -96348 -14903 23762 -38409 -32157 -23331 -23026 -42714 -33712 25195 30603 -10213 19967
8793 19967 101085 301059 423249 406113 260455 146066 99552 57801 84508 185837 280565
8782 280565 258453 197061 73949 75555 88819 142659 71960 73483 143845 204519 173938 156090
8770 156090 88501 -32425 -40161 -4410 147127 245984 245771 38483 -57975 9607 105992 169175
8758 169175 -9072 -210932 -186855 -144581 -72168 -60379 -18422 76571 166691 250423 126516
8747 126516 101251 94375 -6834 -66758 -43455 -59779 -1499 105056 -33167 -173354 -196169
8736 -196169 -117198 -66301 -8486 47261 75415 100623 95437 -80999 -65876 -11075 101621
8725 101621 94095 -51411 -101315 -54506 135321 159765 154972 109888 81648 -40067 -78467
8714 -78467 8740 49425 26879 73932 67377 -81349 -128372 -257603 -123913 -53960 -43533
8703 -43533 -89922 -114881 -86448 -30714 -49855 28409 24494 83293 32909 2571 -1721 -59554
8691 -59554 -71293 -94624 -53779 21767 -19925 -67557 -50364 21881 49791 33817 65024 8470
8679 8470 67696 75458 83744 69534 4460 -37025 -34200 46409 73679 -4608 -31612 13527 -4593
8666 -4593 15796 62031 53052 -37158 -8807 65367 45280 -65591 13414 188044 121249 -51563
8654 -51563 7952 98102 32880 56364 109939 89074 169124 232491 284155 247310 138337 77521
8642 77521 11481 -6058 85480 182561 119043 107008 151442 151775 57148 34847 50732 120817
8630 120817 57000 74713 174521 233394 171836 128719 204253 250788 239172 189857 177062 259982
8618 259982 177694 26140 54594 -8410 22301 130655 68752 -19066 71265 187410 180956
8607 180956 162769 165653 174545 64528 -37224 88184 249426 273689 161267 149764 269602
8596 269602 432975 465644 454976 441995 348886 345654 414918 569765 621959 556170 633157
8585 633157 762106 768871 702837 763201 721037 650016 471678 366269 367718 319711 206524
8574 206524 218855 144985 154566 281250 255562 159412 57141 31691 -27854 -5322 116633
8563 116633 138130 195088 242398 223428 218715 156979 133954 212069 128674 162013 181605 114097
8551 114097 112891 24260 41640 -25634 123396 219197 157402 99321 78718 81814 106998 106969
8539 106969 61214 25567 -136694 -145436 -72424 -131056 -192081 -194090 -128460 -24678 18285 -44849
8527 -44849 47805 146368 156791 128466 112168 116142 -16089 11874 134714 213300 189417 184926
8515 184926 201769 74155 -21379 107432 142992 152788 145592 66530 58176 229597 333236
8504 333236 235044 124405 37742 20757 67554 90733 -24062 -95149 -26425 -120828 -88619
$$ [...]
##END NTUPLES=NMR SPECTRUM
##END=
