##TITLE=Analysis number 316228
Compound Code btb 13063
Project Code adrs
Chemist Name stores
##JCAMPDX= 6.0         $$ Bruker NMR JCAMP-DX V2.0
##DATA TYPE= NMR SPECTRUM
##DATA CLASS= NTUPLES
##ORIGIN= Bruker BioSpin GmbH
##OWNER= nmr
$$ XWIN-NMR		Version 3.5
$$ Fri Jan  6 08:35:04 2006 GMT Standard Time (UT+0h)  MAYBRIDGE\nmr@NMR_250MHZ
##.OBSERVE FREQUENCY= 250.131544655141
##.OBSERVE NUCLEUS= ^1H
##.ACQUISITION MODE= SIMULTANEOUS (DQD)
##.ACQUISITION SCHEME= undefined
##.AVERAGES= 16
##.DIGITISER RES= 18
##SPECTROMETER/DATA SYSTEM= dpx250
##.PULSE SEQUENCE= zg30
##.SOLVENT NAME= CDCl3
##.SHIFT REFERENCE= (INTERNAL, CDCl3, 0, 16.522)
##AUDIT TRAIL= $$ (NUMBER, WHEN, WHO, WHERE, WHAT)
$$ ##TITLE= Audit trail, XWIN-NMR		Version 3.5
$$ ##JCAMPDX= 5.01
$$ ##ORIGIN= Bruker BioSpin GmbH
$$ ##OWNER= nmr
$$ C:\u/data/dgb/nmr/ADRS/14330/pdata/1/auditp.txt
$$ ##AUDIT TRAIL=  $$ (NUMBER, WHEN, WHO, WHERE, WHAT)
(   1,<2006-01-06 08:34:39.15 +000>,<MAYBRIDGE\nmr>,<NMR_250MHZ>,
      <created by zg, POWCHK disabled, PULCHK disabled
       configuration hash MD5:
       62 19 C7 07 E1 42 D1 B7 37 6C 3D D0 77 39 F9 E6
       data hash MD5: 64K
       CC 4F A0 F6 90 7F D4 31 73 A5 A5 62 50 82 7A 04>)
(   2,<2006-01-06 08:34:55.43 +000>,<MAYBRIDGE\nmr>,<NMR_250MHZ>,
      <Start of raw data processing
       ef LB = 0.3 FT_mod = 6 PKNL = 1 SI = 32K 
       data hash MD5: 32K
       E3 60 CB D3 46 B4 A5 35 64 61 5D 08 4E DD A3 94>)
(   3,<2006-01-06 08:34:57.37 +000>,<MAYBRIDGE\nmr>,<NMR_250MHZ>,
      <apk 
       data hash MD5: 32K
       C5 9F A8 3E C4 B8 79 BC 8C 69 C8 B2 BD 1B E0 5F>)
(   4,<2006-01-06 08:34:58.15 +000>,<MAYBRIDGE\nmr>,<NMR_250MHZ>,
      <abs ABSG = 5 
       data hash MD5: 32K
       B4 9E 7A 5C 49 EE A9 F5 6E 5D 6B 6D 84 13 B9 1C>)
$$ ##END=
$$ 
$$ hash MD5
$$ 5F F9 A7 B8 49 67 A9 2C 58 FC 23 D9 BE 05 F8 63
##$RELAX= 
##$RELAX= 
##$RELAX= 
##$RELAX= 
##$RELAX= 
##$RELAX= 
##$RELAX= 
$$ Bruker specific parameters
$$ --------------------------
##$DU= <C:\u>
##$EXPNO= 14330
##$NAME= <ADRS>
##$PROCNO= 1
##$TYPE= <nmr>
##$USER= <dgb>
##$AMP= (0..31)
100 100 100 100 100 100 100 100 100 100 100 100 100 100 100 100 100 100 
100 100 100 100 100 100 100 100 100 100 100 100 100 100 
##$AQSEQ= 0
##$AQ_mod= 3
##$AUNM= <au_zg>
##$AUTOPOS= <8 >
##$BF1= 250.13
##$BF2= 250.13
##$BF3= 250.13
##$BF4= 250.13
##$BF5= 500.13
##$BF6= 500.13
##$BF7= 500.13
##$BF8= 500.13
##$BYTORDA= 1
##$CFDGTYP= 0
##$CFRGTYP= 5
##$CHEMSTR= <none>
##$CNST= (0..31)
1 1 145 1 1 1 1 1 1 1 1 1 1 1 1 1 1 1 1 1 1 1 1 1 1 1 1 1 1 1 1 1 
##$CPDPRG= <>
##$CPDPRG1= <>
##$CPDPRG2= <>
##$CPDPRG3= <>
##$CPDPRG4= <mlev>
##$CPDPRG5= <mlev>
##$CPDPRG6= <mlev>
##$CPDPRG7= <mlev>
##$CPDPRG8= <mlev>
##$CPDPRGB= <>
##$CPDPRGT= <>
##$D= (0..31)
0 1 0 0 0 0 0 0 0 0.06 0 0 0 0 0 0 0.0002 0 0 0 0 0 0 0 0 0 0 0 0 0 0 
0 
##$DATE= 1136536478
##$DBL= (0..7)
120 120 120 120 120 120 120 120 
##$DBP= (0..7)
150 150 150 150 150 150 150 150 
##$DBP07= 0
##$DBPNAM0= <>
##$DBPNAM1= <>
##$DBPNAM2= <>
$$ [...]
##$SUBNAM7= <"">
##$SUBNAM8= <"">
##$SUBNAM9= <"">
##$SW= 20.6930455092707
##$SWIBOX= (0..15)
0 0 3 0 0 0 0 0 0 0 0 0 0 0 0 0 
##$SW_h= 5175.983436853
##$TD= 65536
##$TD0= 1
##$TE= 294.16
##$TE2= 300
##$TE3= 300
##$TEG= 300
##$TL= (0..7)
0 120 120 120 120 120 120 120 
##$TP= (0..7)
150 150 150 150 150 150 150 150 
##$TP07= 0
##$TPNAME0= <>
##$TPNAME1= <>
##$TPNAME2= <>
##$TPNAME3= <>
##$TPNAME4= <>
##$TPNAME5= <>
##$TPNAME6= <>
##$TPNAME7= <>
##$TPOAL= (0..7)
0.5 0.5 0.5 0.5 0.5 0.5 0.5 0.5 
##$TPOFFS= (0..7)
0 0 0 0 0 0 0 0 
##$TUNHIN= 0
##$TUNHOUT= 0
##$TUNXOUT= 0
##$USERA1= <user>
##$USERA2= <user>
##$USERA3= <user>
##$USERA4= <user>
##$USERA5= <user>
##$V9= 5
##$VALIST= <valist>
##$VCLIST= <CCCCCCCCCCCCCCC>
##$VD= 0
##$VDLIST= <DDDDDDDDDDDDDDD>
##$VPLIST= <PPPPPPPPPPPPPPP>
##$VTLIST= <TTTTTTTTTTTTTTT>
##$WBST= 1024
##$WBSW= 4
##$XGAIN= (0..3)
0 0 0 0 
##$XL= 0
##$YL= 0
##$YMAX_a= 569597
##$YMIN_a= -436879
##$ZGOPTNS= <>
##$ZL1= 120
##$ZL2= 120
##$ZL3= 120
##$ZL4= 120
##$ABSF1= 16.522
##$ABSF2= -4.171173
##$ABSG= 5
##$ABSL= 3
##$ALPHA= 0
##$AQORDER= 0
##$ASSFAC= 0
##$ASSFACI= 0
##$ASSFACX= 0
##$ASSWID= 0
##$AUNMP= <proc_1d>
##$AZFE= 0.1
##$AZFW= 0.1
##$BCFW= 0
##$BC_mod= 0
##$BYTORDP= 0
##$COROFFS= 0
##$CY= 12.5
##$DATMOD= 1
##$DC= 0
##$DFILT= <>
##$DTYPP= 0
##$F1P= 14.0000005364418
##$F2P= -0.99999901652339
##$FCOR= 0.5
##$FTSIZE= 32768
##$FT_mod= 6
##$GAMMA= 0
##$GB= 0
##$INTBC= 1
##$INTSCL= 1
##$ISEN= 128
##$LB= 0.3
##$LEV0= 0
##$LPBIN= 0
##$MAXI= 10000
##$MC2= 0
##$MEAN= 0
##$ME_mod= 0
##$MI= 0
##$NCOEF= 0
##$NC_proc= -3
##$NLEV= 6
##$NOISF1= 0
##$NOISF2= 0
##$NSP= 0
##$NTH_PI= 0
##$NZP= 0
##$OFFSET= 16.522
##$PC= 1
##$PHC0= 82.88106
##$PHC1= 11.14197
##$PH_mod= 1
##$PKNL= yes
##$PPARMOD= 0
##$PSCAL= 4
##$PSIGN= 0
##$REVERSE= no
##$SF= 250.13
##$SI= 32768
##$SIGF1= 0
##$SIGF2= 0
##$SINO= 400
##$SIOLD= 32768
##$SREGLST= <1H.CDCl3>
##$SSB= 0
##$STSI= 32768
##$STSR= 0
##$SW_p= 5175.98343685301
##$SYMM= 0
##$S_DEV= 0
##$TDeff= 65536
##$TDoff= 0
##$TI= <Analysis number 999999
Compound Code 99
Book Reference 9
Project Code 9>
##$TILT= no
##$TM1= 0
##$TM2= 0
##$TOPLEV= 0
##$USERP1= <user>
##$USERP2= <user>
##$USERP3= <user>
##$USERP4= <user>
##$USERP5= <user>
##$WDW= 1
##$XDIM= 32768
##$YMAX_p= 431731739
##$YMIN_p= -162008
$$ End of Bruker specific parameters
$$ ---------------------------------
##NTUPLES= NMR SPECTRUM
##VAR_NAME=  FREQUENCY,     SPECTRUM/REAL,   SPECTRUM/IMAG
##SYMBOL=    X,             R,               I
##VAR_TYPE=  INDEPENDENT,   DEPENDENT,       DEPENDENT
##VAR_FORM=  AFFN,          ASDF,            ASDF
##VAR_DIM=   32768,         32768,           32768
##UNITS=     HZ,            ARBITRARY UNITS, ARBITRARY UNITS
##FACTOR=    0.157963299565203, 1,           1
##FIRST=     4132.6476996994, 0,             0
##LAST=      -1043.33573715361, 0,           0
##MIN=       -1043.33573715361, -162008,     0
##MAX=       4132.6476996994, 431731739,     0
$$ Real data points
##PAGE= N=1
##DATA TABLE= (X++(R..R)), XYDATA
$$ [...]
14327C3169l603M075r62r734po418m704l156K3368j1618k0218o892M697K5638
14313B3635P157p700P52K5692J8790j1445k2703j3572K3321p846n962k6700j7527
14300a4108K2012P639l12j0857j271J0714J4969P260o029l9933j0841K2798K6554
14287B8595p338k0170r526J7576R911j2188J1312J393k4654J0655J9671j471j6902
14274F864j4115k2088K7554R610l3954J2367N3428K0959M230O584P309J603j4187
14261F6164p768j2115j614J1116j2643r457K0311K7259J7997K0268j7416m0117
14249F1985l5037k061J2994j8326m0404j0650K7226N657J1968R044k2187J0717
14237A0926j763L0880K2730Q08l3016j1400N933j3869l8898K2362J3257N917q927
$$ plain form
14327 33169 29566 33641 32679 22945 22938 16520 11816 8660 32028 20410 192 -6700 -2003 23635
14313 23635 30792 23092 23844 49536 68326 56881 34178 20606 43927 36081 30119 3419 -14108
14300 -14108 7904 15543 15231 4374 3103 13817 28786 36046 30017 -9916 -20757 2041 28595
14287 28595 21257 1087 -8439 9137 19048 6860 18172 19565 -5089 5566 25237 23766 6864
14274 6864 -7251 -29339 -1785 7825 -26129 -13762 39666 60625 64855 71439 78748 80351 66164
14261 66164 58396 46281 44667 55783 43140 33683 53994 81253 99250 119518 102102 61985
14249 61985 26948 24887 37881 19555 -20849 -31499 -4273 1384 13352 22396 209 10926
14237 10926 9163 40043 62773 63581 30565 19165 25098 11229 -27669 -5307 7950 13867 4940
14224D940J4486l0266P057J7661J2442r713j4051j3473q528r000j5277j0799J8449
14211c6072K6766K6157J0494Q229J5779J1842j0027j3415j9687q060J0007p101
14199A4912k4728j5247J2062J3344J5264O671k066L1490m581k6546j6275p848
14187c548J9942P614R234j0945J0405O098k8096k1957P359K2768K9154N507M607
14174E8142Q177K0666N02j4751k1058m1168k6219J2463L7549k5746R122J3544
14162C1223R172j7154p439j1545j6284q508J1289O013K5766j8667J519K2628P321
14149C5334P840L012l880j79j0790P082M0410K3478j3229l7918k8288k691M187
14136B4368l2923p784J566O235o132M2572Q398l4292j0418K2215M3467j1323j2113
$$ plain form
14224 4940 19426 -10840 -3783 13878 26320 16607 2556 -10917 -19445 -28445 -43722 -54521 -36072
14211 -36072 -9306 16851 27345 35574 51353 63195 53168 39753 20066 12006 22013 14912
14199 14912 -9816 -25063 -13001 343 15607 22278 20212 51702 47121 20575 4300 -3548
14187 -3548 16394 24008 33242 22297 32702 38800 10704 -11253 -3894 18874 48028 53535 58142
14174 58142 66319 86985 87487 72736 51678 10510 -15709 -3246 34303 8557 17679 31223
14162 31223 40395 23241 15802 4257 -12027 -20535 -9246 -3233 22533 3866 5385 28013 35334
14149 35334 43174 46186 42306 42127 31337 38419 78829 102307 89078 51160 22872 20181 24368
14136 24368 -8555 -16339 -14773 -8538 -14670 27902 36300 2008 -8410 13805 57272 45949 33836
14123C3836N024J9955m185J4020Q898l7716J0571L8706p980j8553n828o382l1401
14110A8965P072P05J6914j6797k5830k1542J5988M4398J9094J2766p5o914M411
14097F9155J5717p354l1808l7291M299J7979J8959K1695j0386Pq430l130J2685
14084F2097o67p721O001J1178q129J1160j1158l3039k974R432J0216r532J1434
14071D8298p262n609k444J7257r769j6939o354J4421Q872j4632k50O286j1749
14058B0126L638n233l229l498K61J6250K3168p117k7525N347l183K3231J3727
14045E5963j1840Q498K2932L8269J1355m3461k4525k9877N741m207K0432M711
14033E3991j2386K1976K172j6314K94o025k1066J6329L984K819l1516l75L3095
$$ plain form
14123 33836 38860 58815 54630 68650 77548 39832 50403 89109 81129 62576 56748 50366 18965
14110 18965 26037 26742 43656 26859 1029 -20513 -4525 39873 58967 71733 71658 64744 69155
14097 69155 84872 77518 45710 8419 12718 30697 49656 71351 60965 60972 52542 49412 62097
14084 62097 61430 53709 59710 70888 62759 73919 62761 29722 26748 36180 46396 36864 48298
14071 48298 41036 35427 32983 50240 40471 23532 17178 31599 40471 25839 25589 31875 20126
14058 20126 23764 18531 15302 11804 12065 28315 51483 44366 16841 22188 19005 42236 55963
14045 55963 44123 52621 75553 113822 125177 81716 57191 27314 33055 28848 49280 53991
14033 53991 41605 63581 65753 49439 49733 43708 22642 38971 42955 45774 14258 13883 46978
14020D6978P068o569j1237k3012K3246L6983J7742k5764j0746K5169j5578k1824
14008D2456j8670L604J3065M260J614J3918J7208j3057k1766j2875k1729o140
13996A888L1996J2707J2113k374m0163k9962K0167K958k4531M772L2681O859j7899
13983A1212J9335j783K973N474J4968J5599J6895M227J5992j9532k6826R359J6891
13970H4784q532l1077K402K9410N727J519q42n522M3097m352l6360l7715j9190
13957B3349J7821j58K2750j0491J3730J98j976j5812J7289L0209K4467m5094r015
13944F7267r909K9804J510j7622J5860K4353K4243j8070n788j7927o3035J1392
13932D2078J8866j6535K9582K7189J9703m3965l5648J7763j710j78J6407J6903
$$ plain form
14020 46978 54046 47477 36240 13228 36474 73457 91199 65435 54689 79858 64280 42456
14008 42456 23786 27390 40455 44715 46329 60247 77455 64398 42632 29757 8028 1888
13996 1888 33884 46591 58704 56330 16167 -13795 6372 9330 -15201 -10429 22252 29111 11212
13983 11212 30547 28764 31737 37211 52179 67778 84673 88900 104892 85360 58534 67893 84784
13970 84784 76252 45175 47577 76987 82714 84233 83391 77869 120966 116614 80254 42539 23349
13957 23349 41170 41012 63762 53271 67001 67199 65223 49411 66700 96909 121376 76282 67267
13944 67267 57358 87162 88672 71050 86910 111263 135506 117436 111648 93721 30686 42078
13932 42078 60944 44409 73991 101180 120883 76918 41270 59033 57323 57145 73552 90455
13920I0455j9700l9392o923J56r626l767L552j6284q402m080K5144o440L916K8950
13906C7559J4432o643j0515M486K1499J469Q722l844L1949n342N109k3999k7854
13893D7028j4880J1296n471K7814J5794j0938j5429J7517K0595j9613r582p00
13881F3431j8812J5076K3465J2079R206J9743J6809Q018K487k4145J2460K3369
13869A63186J9203J1877J3300O3222K2021n568k7968n285M624j5645k2175m101
13857B16691J644j5195l7542q476r42m11r581Q706j3835o209L5174j3636K052
13844A58440J0039K9668J7404K1606J5259J4422j3620m1748j1467J567K416K8314
13832B32300J8807R221o012j2622L2900q396j5278L0675O8724Q9553J11634J06885
$$ plain form
13920 90455 70755 31363 24440 24596 14970 11203 14755 -1529 -9931 -14011 11133 4693 8609 37559
13906 37559 51991 45348 34833 39319 60818 62287 71009 67165 99114 93772 98881 74882 47028
13893 47028 32148 43444 37973 65787 81581 70643 55214 72731 93326 73713 64131 63431
13881 63431 44619 59695 83160 95239 104445 124188 140997 149015 151502 127357 139817 163186
13869 163186 182389 194266 207566 270788 292809 287241 259273 253988 258612 242967 220792 216691
13857 216691 218335 203140 165598 157122 156180 155769 146188 154894 141059 134850 170024 156388 158440
13844 158440 168479 198147 215551 237157 252416 266838 253218 211470 200003 201570 203986 232300
13832 232300 251107 260328 254316 241694 274594 266198 250920 281595 350319 439872 551506 658391
13820F58391Q8064N6439N7042k004k401m7280j24823j31558q6027q5161m5633
13809C35049k1399l3401k8236k7377p402L500j3404J253r119K3181L8277Q873
13797B69795O630n234p858k8777L4215L5498O415j8298j5165k527j3004M87J5225
13784B77402N828K7122K4233O438K5719M0111M7305Q7095J05677J22827J11195
13773H80952L6229L034m146p0312j50181j24747j13915p8982m5482O917n483N855
13761C39739m4882r125J0452l9627l2269r067m336o70j6290k3669J2606M408K887
13748A90157L185k4469r725L660j3141k56k755J1877q324k6833j6719p348M5888
13735A45197N2008K2641L249J5811K1758L8764M3757L972J0152n625k3416l0261
$$ plain form
13820 658391 746455 802894 859936 857932 855531 808251 683428 551870 465843 380682 335049
13809 335049 313650 280249 252013 224636 217234 220734 207330 208583 199464 222645 260922 269795
13797 269795 276425 271191 263333 234556 268771 304269 310684 292386 277221 274694 261690 262177 277402
13784 277402 283230 310352 334585 341023 366742 406853 454158 541253 646930 769757 880952
13773 880952 917181 920215 916069 845757 695576 570829 456914 377932 332450 339367 333884 339739
13761 339739 294857 285732 296184 256557 224288 215221 210885 210215 193925 170256 182862 187270 190157
13748 190157 193342 168873 159148 162808 149667 149411 146656 158533 150209 123376 106657 99309 145197
13735 145197 197205 219846 223095 238906 260664 299428 343185 347157 357309 351684 328268 298007
13723B98007o7694l4798r401j1667m9215j672j107L199j2211j2232j0435J2419
13711A03193J6213j4966l4313j1094j5334K5444L7359o354R731r934J2867m549
13699A08263j3263M497J7542l250n504r913j1394K862l6735k8083M6078L4743
13687A05843K2950L0627l2344j6315J0774J2122K487L4539L56l6375m3268R06
13675I2302J1383o967j5861j058K3057J0725m008K2387J7184j3864k311k4709
13663A08260j8624k4208p732K1408L1998K9231K2199J2783R807K1208N3651j3350
13651B46631j7026R123O890j6680m9333k7898J5872K0340L5965J4102m5250j2587
13639A80149J2061l576M258j8508N526j9558J6820k2322l5010p688J043k575j3118
$$ plain form
13723 298007 230313 195515 186114 174447 125232 123560 122453 125652 113441 101209 90774 103193
13711 103193 119406 104440 70127 59033 43699 69143 106502 100148 109879 99945 112812 108263
13699 108263 95000 99497 117039 113789 108285 98372 86978 89840 53105 25022 71100 105843
13687 105843 128793 159420 127076 110761 121535 133657 136144 170683 171039 134664 91396 92302
13675 92302 103685 96718 80857 79799 102856 113581 109573 131960 149144 135280 132969 108260
13663 108260 89636 65428 57696 79104 111102 140333 162532 175315 185122 206330 259981 246631
13651 246631 229605 238728 245618 228938 179605 151707 167579 187919 223884 237986 192736 180149
13639 180149 192210 188634 192892 174384 179910 160352 177172 154850 119840 112152 113195 110620 97502
13626I7502Q794J1522L669M5488K7152l5156j0612K1736p041J8871q146J3886
13614A87665J6573K4677N4709K9537M2465n064j2356J5495K3800K083k9575J3145
13602C63154J3314l2968k0554o050j0237k1346j7219l352k708J2395k3619m865
13590B45945J53K9877J5444J2298r60Q43J367m76J82l6606k461J5096n124K4803
13576C00381J8485m9912k8328N672L4758O742Q463o212Q258P246N265K9330l713
13563C36435q234N0590L097j2901L1442K0985J4144q204l0042l6592j6134Q494
13551C53080j0372k3715K1891M911N702j9649l9811J940K8680K0452K0979j2894
13539C51194J7708K6083j4754j029N516j713j7566n661j346r012J3281J3693J9868
$$ plain form
13626 97502 106296 117818 121487 166975 194127 158971 148359 170095 163054 181925 173779 187665
13614 187665 204238 228915 283624 313161 355626 350562 338206 353701 377501 379584 350009 363154
13602 363154 376468 343500 322946 316896 306659 285313 268094 264742 262034 274429 250810 245945
13590 245945 246098 275975 291419 303717 302757 303600 304967 304491 304673 268067 265606 280702 275578 300381
13576 300381 318866 268954 240626 246298 281056 287798 296261 290049 298307 305553 310818 340148 336435
13563 336435 328201 378791 381888 368987 400429 421414 435558 427354 397312 360720 344586 353080
13551 353080 342708 318993 340884 345795 351497 331848 292037 293977 322657 343109 364088 351194
13539 351194 368902 394985 380231 379202 384718 383005 365439 359778 358432 349420 362701 376394 396262
13526C96262L968j5530L008k2131r863O321J0288j4573j1322J8905Q62K4089j7874
13513C72410j8642O922J0974j8651K2901n548J2657r453J4799J6551J0977q970
13501D06927j6429r264Q028K2870Q699m124O235K1795M3224J1350J6242r927N209
13488E10835K1224K9512M246M4629N7635L3633j7946l2385l347J9369J9155m3350
13476F43210o0389k1588K3512R9672J24975J66273K20728K45701J26764j19935
13466A448923k26619j96801j01490p1808l3207j0345J321P508J8316J0906M302
13455H51006J0271j2989j9629L333J6568K5202M1564J0794N8500O3183J2542l498
13443A056847r01J4566P5697R0823R1955P2967L8141L3647O2465L1091M9N016
$$ plain form
13526 396262 400230 384700 387708 365577 355714 362035 372323 357750 346428 365333 366195 390284 372410
13513 372410 353768 360690 371664 353013 375914 370366 383023 373570 388369 404920 415897 406927
13501 406927 390498 381234 389262 412132 420831 416707 422942 444737 487961 499311 515553 505626 510835
13488 510835 532059 561571 565817 610446 668081 701714 683768 651383 648036 667405 686560 643210
13476 643210 582821 561233 584745 684417 809392 975665 1196393 1442094 1568858 1448923
13466 1448923 1222304 1025503 924013 852205 818998 808653 809974 817482 835798 846704 851006
13455 851006 861277 848288 828659 831992 848560 873762 915326 926120 984620 1047803 1060345 1056847
13443 1056847 1055946 1070512 1146209 1237032 1328987 1401954 1440095 1473742 1536207 1567298 1567347 1572363
13431A572363l6275L4383J16444K03148K92807M12941O02383Q59978P79353Q5572
13421D923097l80387m54852k85083r0532l9519N329J0135R3024J82524L04138
13411D267874M13772N27221P02192R15937J233985J681910K175286K849988L946114
13402A8714279N861357P811115O612689J941568r15771j49357J851033Q8422m914198
13393C6901137p530083p364264n567716l628199k346646j557472r83168o03044
13385G320545l76157k32950k5357J80947M21803O85290Q10185Q32199K97602l21892
13375I592215l96064j28038K82982O69989J015117J250554J202520J044805R28246
13366A5462326R73916J220389J632963K172823K984250M230446O061188Q833659
$$ plain form
13431 1572363 1536088 1570471 1686915 1890063 2182870 2595811 3198194 4058172 4837525 4923097
13421 4923097 4542710 4087858 3802775 3712243 3672724 3678053 3688188 3781212 3963736 4267874
13411 4267874 4681646 5208867 5911059 6826996 8060981 9742891 11918177 14768165 18714279
13402 18714279 24575636 32386751 38999440 40941008 40025237 39875880 41726913 41815335 36901137
13393 36901137 29371054 22006790 16439074 12810875 10464229 8906757 7923589 7320545
13385 7320545 6944388 6711438 6686081 6867028 7288831 7974121 8784306 9616505 9914107 9592215
13375 9592215 9196151 9068113 9351095 10021084 11036201 12286755 13489275 14534080 15462326
13366 15462326 16436242 17656631 19289594 21462417 24446667 28677113 34738301 43571960
13358D3571960J3157815J9394866K6309474K7173578J3362473j682556l182529
13351A38105081K324947j186180j6345986k3824405k2131021j5343696q297141
13344E3301599l329526p16086n96361k293093m533685n720097n325942l978986
13336B6807823k320188o61574P88390J709990J264787m57305j773314j972880
13328B3385729j312695m73616K53441J106149K261622L661438M860884N033515
13320C8776467M500831M046696K927844J897081K171991L648108O408055J0087894
13312G4464967J4654646K1118167K7353732K2442725P132864J552214K226782
13305A70946097n908735k1818235k8564384k6661027k0778324j4693619j0014280
$$ plain form
13358 43571960 56729775 76124641 102434115 129607693 142970166 141287610 138105081
13351 138105081 140430028 139243848 122897862 99073457 76942436 61598740 53301599
13344 53301599 49972073 49255987 48659626 46366533 41832848 36112751 30786809 26807823
13336 26807823 24487635 23826061 24614451 26324441 27589228 27131923 25358609 23385729
13328 23385729 22073034 21599418 21852859 22959008 25220630 28882068 33742952 38776467
13320 38776467 43277298 47323994 50251838 52148919 54320910 57969018 64377073 74464967
13312 74464967 89119613 110237780 137591512 160034237 167167101 168719315 170946097
13305 170946097 165037362 143219127 114654743 87993716 67215392 52521773 42507493
13298D2507493o497069l796611j633326j53605M7919j256035k422238k558106
13290B4238422j834759n92386Q54836K205869K894835K563041J907091J968832
13282C4205781J769193j91371k742492m222207m333077l453396k281348j230942
13274A7520141l16251N80015J572050K638056L499300L419608K381713K143188
13266C3437820L807161O789850P489119L570007O80900K8298k601211o618894
13258D6583050q320237p929222o377552m815485l762587l010737k334085j795580
13250H237565j354640j016443p61867o01505m83323l75224k65153j99500j09454
13241C070456O060J61957L74314O31002N96651j17295o89282p90557o42249m13060
$$ plain form
13298 42507493 36010424 32213813 30580487 30426882 30474801 29218766 26796528 24238422
13290 24238422 22403663 21811277 22666113 24871982 27766817 30329858 32236949 34205781
13282 34205781 35974974 35783603 33041111 28818904 24485827 21032431 18751083 17520141
13274 17520141 17203890 17783905 19355955 21994011 25493311 28912919 31294632 33437820
13266 33437820 37244981 44034831 51523950 55093957 55774857 55803155 53201944 46583050
13258 46583050 38262813 30333591 23956039 19140554 15377967 12367230 10033145 8237565
13250 8237565 6882925 5866482 5104615 4503110 4019787 3644563 3379410 3179910 3070456
13241 3070456 3076516 3238473 3612787 4243789 4840440 4723145 4033863 3243306 2601057 2187997
13231B187997k41590j52464r1664p1949q4856n3246j4508N5584Q2028J41182J76651
13220A933165R3727p5396k04389k73546k07133j43972o8240L3036P5393J26788
13210A289433J77121K05583J89919J6068j66970k61151k56890j86702j28664j12772
13200G64975l7435r943m470L3033J4955Q9534J83909K45760J92922l8973j88759
13189A245508k24707k08309j75330j02443n6599k198K802l9386p3339n3732q0169
13178B32098o1696q1027m2673L5875K0960M048k7577l2628J5120L2242K0206n726
13166A09222J5139O797J7013n231j5731K5451L7073L3111m292J1590L648k7765
13154B06025p3926k7763m09M954R350k1772l9515K929M9010K3274k7592j0377
$$ plain form
13231 2187997 1946407 1793943 1702279 1630330 1545474 1492228 1477720 1533304 1615332 1756514 1933165
13220 1933165 2026892 1951496 1747107 1473561 1266428 1122456 1054216 1087252 1162645 1289433
13210 1289433 1466554 1672137 1862056 1878124 1711154 1450003 1193113 1006411 877747 764975
13200 764975 727540 717597 713127 746160 761115 850649 1034558 1280318 1473240 1434267 1245508
13189 1245508 1020801 812492 637162 534719 478120 475922 478724 439338 365999 312267 232098
13178 232098 170402 89375 46702 82577 103537 107585 80008 47380 62500 94742 114948 109222
13166 109222 124361 131158 148171 142940 127209 152660 189733 222844 218552 230142 233790 206025
13154 206025 132099 104336 103927 108881 118231 96459 56944 59873 108883 132157 104565 94188
13142I4188J4781j3252j2191N484J7980j9841l8699j3343N965l223r914J949l35
13129B9549L677m419J1936k6460j7949o151j0414J6165J794n497J5133J75J0021
13116A7560j0580P952K2520J6531r074l7643l7842O327J7785L878k3686J1493
13104a4779K2200n393r960k1970J4785O424l3237p362J2607P481q232k8957O106
13091f0287K0413K8963o24L055L050k1033k5337K8175k5846l9458j584J7916J7587
13078e5010j2512L1877K2443j3849p649k1230m109l247q996Q429k2540J1922n777
13065h0248j9452k5564j1134L6499L0251m547K6262L955k2547K6829R909k7662
13053e7449j7216l632M690J5577j4985K0709J3436J5842L3816l483R754J0873
$$ plain form
13142 94188 108969 95717 83526 89010 106990 87149 48450 35107 41072 37849 27935 29884 29549
13129 29549 33226 28807 40743 14283 -3666 -9817 -20231 -4066 -2272 -7769 7364 7539 17560
13116 17560 6980 14932 37452 53983 44909 7266 -30576 -24249 -6464 -2586 -26272 -14779
13104 -14779 7421 2028 -7932 -29902 -15117 -8693 -41930 -49292 -36685 -29204 -37436 -66393 -60287
13091 -60287 -39874 -10911 -11535 -8480 -5430 -26463 -51800 -23625 -49471 -88929 -90513 -72597 -55010
13078 -55010 -67522 -35645 -13202 -27051 -34700 -55930 -60039 -63286 -72282 -63853 -86393 -74471 -80248
13065 -80248 -99700 -125264 -136398 -99899 -69648 -74195 -47933 -43978 -66525 -39696 -29787 -57449
13053 -57449 -74665 -78297 -73607 -58030 -73015 -52306 -38870 -23028 10788 7305 17059 27932
13041B7932j1765j7464l59K867O200o774l3100J2476L596P712N066l3280k3521
13028f0414j5145M931K1956J3745J1049j1194j3126k4226R013L0604K8768K0636
13016A6597m373k5436k9900k5513J549j7143l0977j3118l3694K314L4172k0241
13004a45763K8428M6122M7229N4012J7544K381J0849R883j8472l0512j6794j1077
12992f170j6302L8501l874o63K4823l125n685k1943M685J5257K5328Q076k3397
12979C5511k4465k926J1227k0451j6961l9371k0718K3903K3089K7972L0506K1468
12967D8784J0727j5950o9218r093q275m390r746L3169j4060k8073J6831K9527
12955a9767Q916L7556J4165N82Q921J4853J8748l2505k4492r578p400p055L752
$$ plain form
13041 27932 16167 -1297 -1656 1211 7411 637 -32463 -19987 -16391 -8679 -3613 -36893 -60414
13028 -60414 -75559 -70628 -48672 -34927 -23878 -35072 -48198 -72424 -63411 -32807 -4039 16597
13016 16597 12224 -13212 -43112 -68625 -67076 -84219 -115196 -128314 -162008 -159694 -125522 -145763
13004 -145763 -117335 -71213 -23984 30028 47572 49953 60802 70685 52213 21701 4907 -6170
12992 -6170 -22472 16029 12155 11492 36315 33190 27505 5562 10247 25504 50832 58908 35511
12979 35511 11046 8120 19347 -1104 -18065 -57436 -78154 -54251 -31162 -3190 27316 48784
12967 48784 59511 43561 -25657 -34750 -43025 -47415 -57161 -23992 -38052 -66125 -49294 -19767
12955 -19767 -10851 26705 40870 41452 50373 65226 83974 51469 26977 17399 9999 2944 6696
12942F696r823k3465m315K8831J2642n937R005p307L0567M4259M255K3616K5411
12929A34435K834K7203K5452L4819M854k8880k1536J8136o927n4076j9710j2257
12917A04347N092j6526k0693J686l0144J9064k4929p6218L609o714K1564K9339
12905I477N633K4617k094j768R081K248j4109p571k8225q566L0350L7123j7402
12892C8794l1629J2688L6297J8190k4443K4235O4836O6490L5131Q3496J41578
12881D65663J30767P6978N443j4206P862j6447p8983j18344j07384r2480n1386
12870B07483k7861m1060m5186j304L5537L811j2088K9468n362j8149l615K5098
12858A46772J6621K4725P006j594o260k6319J75k7997l8582j1425K3735O9773
$$ plain form
12942 6696 -3127 -26592 -30907 -2076 10566 4629 13634 6327 36894 81153 85408 109024 134435
12929 134435 137269 164472 189924 224743 229597 200717 179181 197317 190390 136314 116604 104347
12917 104347 109439 92913 72220 73906 43762 62826 37897 -38321 -34712 -41426 -19862 9477
12905 9477 15110 39727 37633 35865 44946 47194 33085 25514 -2711 -11277 19073 56196 38794
12892 38794 7165 19853 56150 74340 49897 74132 138968 205458 240589 324085 465663
12881 465663 596430 673408 678851 664645 672507 656060 577077 458733 351349 258869 207483
12870 207483 179622 138562 93376 92072 127609 131420 119332 148800 143438 125289 121674 146772
12858 146772 163393 188118 195124 193530 187270 160951 161126 133129 94547 83122 106857 176630
12846A76630K6378N227j8778J4004K0147K2472J7036Q5836O0676O9525J31396
12835F10549J26834M8046K35k2054n3828q8535n8762n1950q9978n8273k9278k0149
12823C12857m6001o363k0757j1168j9356j5805k814l161L180j7302l3724k3428
12811A16158m5026j1994Q315J8105L7597q420j4094K2357P723K563k3888k9262
12799H0134n087j758j0532N0085M7577K254O614J6088L1974K5168L6737p59R76
12786B79471K0666l9692n1367k8711o723j5716l3958J8234q694j4835j3087j3034
12774I2554r465k1705J1462o147j0630j6568K092k7426n0622K158K7938K4653
12762A8294K7688j8213k9791j7840j3367j2033K3193L3056n672J1356J0396m3346
$$ plain form
12846 176630 203008 208235 189457 203461 223608 246080 263116 348952 409628 479153 610549
12835 610549 737383 785429 785664 763610 709782 621247 562485 510535 420557 362284 333006 312857
12823 312857 266856 260493 239736 228568 209212 193407 190593 187432 190612 173310 139586 116158
12811 116158 71132 59138 67453 85558 123155 114735 100641 122998 130721 133284 109396 80134
12799 80134 75047 73289 62757 112842 160419 162673 169287 185375 217349 242517 279254 278495 279471
12786 279471 300137 260445 209078 180367 173644 157928 123970 142204 133510 118675 105588 92554
12774 92554 83089 61384 72846 66699 56069 39501 41593 14167 -36455 -34297 -6359 18294
12762 18294 45982 27769 -2022 -19862 -33229 -45262 -22069 10987 5315 16671 27067 -16279
12750a6279k0500j6934Q400L1918J8982J1339j1193K2667l266q724j2752l1644
12738b7986Q08K3391k8322j8228J5177J0235j4532j5136r731M389j2269K1786
12726e0418R691K3140j1884J0261J5493n535j1211o515q284J4499J4682J0083
12714D002P016K3828K383j4441j6620k0550J0370J8991n4601j7525R513k028L8786
12701a0876K827N190J7152l0522l9946r409M7646J671J4488p758k5886j2545N759
12688d2209r363K0163k215J2135j0522j6511K0191K3366P535j0238o982j3965
12676b8615k5956q889J5982j4481J5599M2899J7569p41K4492o973j7484J321m806
12663I917k9087o349K994r094J5745M2975j6811k698r362k35K945N117j6850J7143
$$ plain form
12750 -16279 -36779 -53713 -45313 -13395 5587 16926 5733 28400 25134 16410 3658 -27986
12738 -27986 -27178 -3787 -32109 -50337 -35160 -24925 -39457 -54593 -64324 -59935 -72204 -50418
12726 -50418 -40727 -17587 -29471 -19210 -3717 -9252 -20463 -26978 -35262 -20763 -6081 4002
12714 4002 11018 34846 37229 22788 6168 -14382 -4012 14979 -39622 -57147 -47634 -49662 -10876
12701 -10876 -8049 -2859 14293 -16229 -56175 -65584 -17938 -16267 -1779 -9537 -35423 -47968 -42209
12688 -42209 -51572 -31409 -33624 -21489 -32011 -48522 -28331 -4965 2570 -7668 -14650 -28615
12676 -28615 -54571 -63460 -47478 -61959 -46360 -3461 14108 13367 37859 30886 13402 14723 9917
12663 9917 -19170 -25519 -22525 -31619 -15874 27101 10290 7592 -1770 -2005 940 6057 -10793 6350
12649F350p161o710o925M4039K6553k4698k8454k0514k6359l725K1206R761K4927
12636H290O199P749P098k5607m2263k773J9782L2815P875P742K4525P2552N5529
12623A79513L2554j0489n6514k4280K827l4333r726k429n373J5633j1388j9887
12611E6108m5904k1307k5889L1036L5649r625k3617O396R994j5927m1537q610
12599e3233J0668J1025p383n790L976J6270j6082J8389K0774j8232l924L329P892
12586a2321J5559j5552n577J30K2235J2214R265N598J671N084P887J6553k1896
12573D0850l0897j7768r55r646K196p402l862n1j2870J4315K0004r558n093K6009
12559E272k695m5168k4311J6549M2690L5813l2601n693J0322Q428Q658l342m076
$$ plain form
12649 6350 -811 -7521 -14446 29593 56146 31448 2994 -17520 -43879 -47604 -26398 -16637 8290
12636 8290 14489 22238 29336 3729 -38534 -41307 -21525 11290 19165 26907 51432 123984 179513
12623 179513 212067 201578 145064 120784 123611 89278 79552 77123 71750 87383 75995 56108
12611 56108 10204 -11103 -36992 -5956 29693 20068 -3549 2847 12841 -3086 -44623 -53233
12599 -53233 -42565 -31540 -38923 -44713 -40737 -24467 -40549 -22160 -1386 -19618 -23542 -20213 -12321
12586 -12321 3238 -12314 -17891 -17761 4474 16688 25953 31551 33222 38306 46193 62746 40850
12573 40850 9953 -7815 -8770 -18416 -16220 -23622 -27484 -27535 -40405 -26090 -6086 -15644 -20737 5272
12559 5272 2577 -42591 -66902 -50353 -7663 28150 -4451 -10144 178 8606 17264 13922 9846
12546I846J0680q62J172j4122j4522J404K1031j0610j1084K933o169K0638J1523
12533B1858Q477J5145N979l1229j1690k5085P830J7434R848J4769J1875k6720
12521A8491J7201q58n186q347j0139Q208K6416J4380l017m4565m3240K6371J0213
12508E928m734J1670J9540j4281j1910q319q828j4072P831J1912L033J3056Q74
12495A1700K0713K1958k744o880j3561j723k0485p028M891j7267K1760M4028J2854
12482F8216O741j1643k4281j6124j855l103p889j6419J7420K944j539Q347m697
12469A6118M051n648p812k2632J4371j5263J1353J5011k6579j0089K8922L3217
12457C5020l4548Q360J7728j2376p985P825j6179l763j3479K647J4218k0902j2295
$$ plain form
12546 9846 20526 19664 20836 6714 -7808 -6404 14627 4017 -7067 -4134 -10303 10335 21858
12533 21858 30335 45480 51459 20230 8540 -16545 -8715 8719 18567 33336 45211 18491
12521 18491 35692 34834 29648 21301 11162 19370 45786 60166 57149 12584 -30656 -4285 5928
12508 5928 1194 12864 32404 18123 6213 -2106 -10934 -25006 -17175 -5263 -2230 10826 11700
12495 11700 32413 54371 51627 44747 31186 29463 8978 1950 6841 -10426 11334 55362 68216
12482 68216 74957 63314 39033 22909 21054 17951 10062 -6357 11063 14007 12468 20815 16118
12469 16118 20169 14521 6709 -15923 -1552 -16815 -5462 9549 -17030 -27119 1803 35020
12457 35020 472 8832 26560 14184 6199 14024 -2155 -5918 -19397 -16750 -2532 -23434 -35729
12444c5729j791o829j1547o732K9838J9527j1996l809p842L0201K8373J6997q097
12431C0564j1543n210k8677l4728K619K3375O820j3830j5349j1719L0047R245
12419a8386K635r619O743J4563j2766p852K8252J9643N644k8395k1768q917j1778
12406d2001J1961Q708n170j2498N364N492K688j278L0699L1919k7515l0307j6704
12393c8642N465J2412k5881r909O268L225q082M02Q756N418o573K142l219p14
12379d8932m269l827K2089K2629L9510R239o393j1913K458Q020m4352r205K0295
12366d651M566k5759k0956N853M890Q568m94M429K4956j7114j8684j5869j1488
12353f1753K7084K5528m470o441k977j5996j7561K966J062O32k2337J0941K9390
$$ plain form
12444 -35729 -37520 -44349 -55896 -62628 -32790 -13263 -25259 -29068 -36910 -6709 21664 38661 30564
12431 30564 19021 13811 -14866 -49594 -46975 -23600 -16780 -30610 -45959 -57678 -27631 -18386
12419 -18386 -15751 -25370 -18627 -4064 -16830 -24682 3570 23213 28857 462 -21306 -30223 -42001
12406 -42001 -30040 -21332 -26502 -39000 -33636 -28144 -25456 -26734 3965 35884 8369 -21938 -38642
12393 -38642 -33177 -20765 -46646 -56555 -50287 -47062 -55144 -54742 -45986 -40568 -47141 -44999 -48218 -48932
12379 -48932 -53201 -57028 -34939 -12310 27200 36439 30046 18133 20591 28611 -15741 -24946 -4651
12366 -4651 -85 -25844 -46800 -40947 -36057 -27489 -27983 -23554 1402 -15712 -34396 -50265 -61753
12353 -61753 -34669 -9141 -13611 -20052 -23029 -39025 -56586 -53620 -52558 -51926 -74263 -63322 -33932
12340c3932J1717r127J1764J2735k3031J252j2094l150M120k156K1384L688k7088
12327d3918j9275K3463R906o62J5662K6391q135q814L7185J5421j6233P194p133
12314C1052j4738N229M848k461m098m4156j5048K4210R197j8915k9773j2642M7660
12301a9635K0709K4411k5200o1419j5472J8361J9434K2791M0835l1047k2355K8102
12289d85j3323j6956r35L564j206k5771j410K2042O056k1197m296L0871K7318
12276D272j2320p866j3816r768J6265q807j2609j2732J7693J8991L476k4451k0509
12263f2181R5j3j1660L6278M3397J2340j8716q109k4868m731l516j6910j0907
12250f9501K4633L4461k668j3247k0266J7557j558J7547p604j5989j1889K5393
$$ plain form
12340 -33932 -22215 -31342 -19578 -6843 -29874 -28622 -40716 -43866 -39746 -41902 -20518 -16830 -43918
12327 -43918 -63193 -39730 -29824 -30486 -14824 11567 3432 -5382 31803 47224 30991 38185 31052
12314 31052 16314 21543 26391 23930 19832 -24324 -39372 -15162 -5965 -24880 -54653 -67295 -19635
12301 -19635 1074 25485 285 -61134 -76606 -58245 -38811 -16020 24815 -6232 -28587 -485
12289 -485 -13808 -30764 -31699 -28135 -29341 -55112 -56522 -34480 -28424 -49621 -53917 -23046 4272
12276 4272 -8048 -15914 -29730 -39498 -23233 -32040 -44649 -57381 -39688 -20697 -17221 -41672 -62181
12263 -62181 -62086 -62099 -73759 -37481 5916 18256 -460 -8569 -33437 -38168 -41684 -58594 -69501
12250 -69501 -44868 -10407 -13075 -26322 -46588 -29031 -30589 -13042 -20646 -36635 -48524 -23131
12238b3131M593j8929k5201K6306M7275n829k5984q905k8763j993J3888j2763
12226e9436K0067M4806L3298j0259m1662j2672k691O949J077p599P300j171l236
12213b5229N33K552O009J2482l0987k6082j396K085J3989J2843p56L293L9992
12200I328j0413l4949k6493M621L3293K4879q890j4179p497j663L3024O587k0841
12187a3193J3658K3086l878j6956l961j266j6209J022M102J3897J0481N852l5377
12174a8742r863J5928j896l8784R259k533J0890k0927N136p57q11N114J4707J3063
12160b0216j6172j4994K881n653K8012Q431J048q349R865M1008l2080j5908J7494
12147d633J8092n233m1155J9503J4494n908j842j1569R116L6575j936k125Q02
$$ plain form
12238 -23131 -18538 -37467 -62668 -36362 10913 5084 -20900 -29805 -58568 -60561 -46673 -59436
12226 -59436 -39369 5437 38735 28476 -13186 -25858 -28549 -21600 -20523 -28122 -20822 -21993 -25229
12213 -25229 -24696 -22144 -16135 -3653 -34640 -60722 -62118 -60033 -46044 -33201 -33957 -30664 9328
12200 9328 -1085 -36034 -62527 -57906 -24613 266 -8624 -22803 -30300 -31963 1061 7648 -13193
12187 -13193 465 23551 19673 2717 -1244 -2510 -18719 -17697 -13595 302 10783 16635 -18742
12174 -18742 -28605 -12677 -14573 -53357 -44098 -46631 -35741 -56668 -51532 -52289 -53100 -47986 -33279 -20216
12160 -20216 -36388 -51382 -48501 -54154 -26142 -17711 -16663 -25012 -15147 25861 -6219 -22127 -4633
12147 -4633 13459 8226 -32929 -13426 1068 -4840 -6682 -18251 -9135 27440 25504 23379 24181
12134B4181j3733n4822K4487L8712j467k1334l8017j6671L0869L0328k938q770
12122i175j7498K3511J7425j0754q064k8884O398J3203j7084k78J4683J8082L04
12109A869M179l061k8874J250J3549M312j2811K237J5819L092J8942j3541l1022
12096b4060k401m153n6841K2603J6934R569j793L67p81Q371M490M749J6199N943
12082h04j8500j9280O888J4095O512m528l462q254o757L1607J5309j4110j952
12069c236j7562k7168j8167K1500K1570J3633Q048k0310k73l711J4984O150j5333
12056a9875q292j1125O833K9586J2349j416k6559O675J6460j8777J0974K4625
12044B1458K5725J8497l090n2794k4737J905o305j288p99o614K028J6666j1120
$$ plain form
12134 24181 10448 -44374 -19887 18825 17358 -3976 -41993 -58664 -27795 2533 -405 -9175
12122 -9175 -26673 -3162 14263 3509 -4555 -33439 -27041 -13838 -30922 -31200 -16517 1565 1869
12109 1869 6048 2987 -25887 -24637 -11088 -6776 -19587 -17350 -1531 1561 20503 6962 -24060
12096 -24060 -26461 -30614 -87455 -64852 -47918 -38349 -40142 -39775 -40556 -32185 -27695 -22946 -6747 -804
12082 -804 -19304 -38584 -31696 -17601 -11089 -15617 -19079 -27333 -34090 -2483 12826 -1284 -3236
12069 -3236 -20798 -47966 -66133 -44633 -23063 -9430 -1382 -21692 -21965 -25676 -10692 -4542 -19875
12056 -19875 -28167 -39292 -32459 -2873 9476 8060 -18499 -11824 4636 -14141 -3167 21458
12044 21458 47183 65680 62590 9796 -14941 -13036 -19341 -20629 -21428 -28042 -26014 -9348 -20468
12031b0468k328K3004q055k3804p07N168J0757J1942N130j767o392N058p590q83
12017a0935k8927k3341K8908K5479J2245M520q345p559J0613q733K3378P208k1263
12004C248p286K1587O289j3799j0074J339J2839J8430r667j6016n214p432N208
11991e48m715J589J6001R558q173r401J5418j9540l6696J9646K418k3320j6727
11978e4490J0516L1668N085r90p307J8300J5711j5689j4158j8697j6377J2089
11966c4339r29m545K4958j8178l0182j1847L898L6649J2456N845K2175m01o565
11953a005L406k1634j4549j9707k1644J7550J8311l211l5149Q508L2465k5561
11941f2220j5392J5744J6171L489j9538R911O2441J2216k9543l4714k3247Q538
$$ plain form
12031 -20468 -22796 208 -7847 -31651 -32358 -27190 -16433 -4491 639 -1128 -7520 -2462 -10052 -10935
12017 -10935 -39862 -63203 -34295 -8816 3429 7949 -396 -7955 2658 -6075 17303 24511 3248
12004 3248 -4038 17549 23838 10039 -35 1304 14143 32573 22906 6890 1676 -5756 -548
11991 -548 -5263 -3674 12327 21885 13712 4311 19729 189 -36507 -16861 -14443 -37763 -54490
11978 -54490 -43974 -12306 -7221 -8211 -15518 2782 18493 2804 -11354 -30051 -46428 -34339
11966 -34339 -35268 -39813 -14855 -33033 -63215 -75062 -71164 -34515 -22059 -16214 5961 5560 -1005
11953 -1005 2401 -19233 -33782 -53489 -75133 -57583 -39272 -42483 -77632 -69124 -36659 -62220
11941 -62220 -77612 -61868 -45697 -42208 -61746 -51835 10606 22822 -6721 -41435 -64682 -56144
11929e6144J3673j2163j9689K943N017J2854J0136P134J4355L5674K4152j5686
11917B2256o798l1275p203K1476J7747J949j191k3330k4330j2848R971j5654J7266
11904c1964L9416k2318k5780j5912K4962M754j3859n364k88L3203J4207k191J6647
11891A5513k9909n5635K13N2456J1548o8l07n286l2970J8046p684O649L1603R617
11877A3786l4052l6734j3965O699L4698K529k2907J2994n375L3015O487j1531
11865a4356p85j2984k2792J2906J2404j3005R739j5257j4874p154o754K6008K4048
11852b2856l830k3459K085J3881O991K5718p737j0446L0878k228j8330K175j1670
11839a8828l415M8255J8968k1702n762oj5572K760j3354J3658J5094p233m981
$$ plain form
11929 -56144 -42471 -54634 -74323 -71380 -66363 -53509 -43373 -36239 -21884 13790 37942 22256
11917 22256 15458 -15817 -23020 -1544 16203 18152 16961 -6369 -30699 -43547 -33576 -49230 -31964
11904 -31964 7452 -14866 -40646 -56558 -31596 -26842 -40701 -46065 -46353 -13150 1057 -1134 15513
11891 15513 -14396 -70031 -69818 -17362 -5814 -5882 -6189 -11475 -44445 -26399 -34083 -27434 4169 13786
11877 13786 -20266 -57000 -70965 -64266 -29568 -27039 -49946 -36952 -42327 -9312 -2825 -14356
11865 -14356 -15141 -28125 -50917 -38011 -25607 -38612 -28873 -44130 -59004 -66158 -72912 -46904 -22856
11852 -22856 -26686 -50145 -48060 -34179 -27188 -1470 -9207 -19653 11225 8997 -9333 -7158 -18828
11839 -18828 -22243 26012 44980 23278 17516 17510 1938 4698 -8656 5002 20096 12863 7882
11826G882j7908P403O071m464m452k531n02J168M727J4508L280j1305k1369r553
11812b7045j2661J2323Q602p520k534l7612Q209M8720J7761q118l323K3708K706
11799B3216J1406r997l6908j5935q666O218o423J3708K7680K0592q173K863m103
11786A5478r889Q549l197m525K1165K9374k0277n9962l6230P898K1113K9341K187
11773A025K5736K927j715n418k4672j9472O552k7282j4063P184K7010J2324L1813
11760B1949k2750m3050j3533j7886L0817K0624k3614L994R676J2982m678o003
11748c1472O845J9018J8616Q045k7876K840K7093J3163j829k4321l0434k9368
11736d9680l082J930J2449N182j2494p125L8535O654j7805J1526L0798M2613J1090
$$ plain form
11826 7882 -10026 -2623 3448 -1016 -5468 -7999 -8501 -7333 -2606 11902 15182 3877 -17492 -27045
11812 -27045 -39706 -27383 -18781 -26301 -28835 -66447 -58238 -9518 8243 125 -3198 20510 23216
11799 23216 34622 24625 -12283 -28218 -36884 -30666 -37089 -23381 4299 24891 16718 19581 15478
11786 15478 5589 14138 10941 6416 27581 56955 36678 -23284 -59514 -51616 -30503 -1162 1025
11773 1025 26761 29688 27973 22555 -2117 -21589 -15037 -42319 -56382 -49198 -22188 -9864 21949
11760 21949 -801 -43851 -57384 -75270 -44453 -23829 -47443 -43449 -33773 -20791 -25469 -31472
11748 -31472 -24627 -5609 13007 21052 -6824 -3984 23109 36272 34443 10122 -20312 -49680
11736 -49680 -52762 -50832 -38383 -33201 -45695 -52820 -14285 -7631 -25436 -13910 16888 59501 70591
11723G0591J7m7117j6001m366j5877j3085j4804J7061K4854k6624L530o73j146
11710b3640J5641L4694R90J640j9317q158n530j1484L670k7484j6372K013R356
11697d3981J2696K79m087K4275p08K686J9400j7997k8384k0266N416L685Q16L8747
11683g423K8938k9154q997j382P602O102o270j9256j8025n709k510K8560K2945
11670d579l591q908p750k276k0200M778K160L266R219L612J907L731K2330j2012
11656h313l4951k2884K8291J7797q635j2487k925J7704R595Q958J1975O426j5093
11643d542N969j2134J590k820N70J4353m7673q604J5766J4367q607l407J1623
11630b3549J3787l1600j6455o19j036J5421L7024n569Q084k1717j7526O969L358
$$ plain form
11723 70591 70608 23491 7490 3124 -12753 -25838 -40642 -23581 1273 -25351 -21821 -22494 -23640
11710 -23640 -7999 26695 27685 29325 10008 1850 -3680 -15164 -11494 -38978 -55350 -53337 -43981
11697 -43981 -31285 -31006 -35093 -10818 -11526 -8840 10560 -7437 -35821 -56087 -50671 -46986 -46170 -7423
11683 -7423 21515 -7639 -16636 -18018 -10416 -4314 -10584 -29840 -47865 -53574 -56084 -27524 -4579
11670 -4579 -8170 -17078 -24828 -27104 -47304 -42526 -40366 -37100 -27881 -24269 -22362 -18631 3699 -8313
11656 -8313 -43264 -66148 -37857 -20060 -28695 -41182 -44107 -26403 -16808 -7850 4125 10551 -4542
11643 -4542 1427 -10707 -9117 -11937 -11367 2986 -44687 -53291 -37525 -23158 -31765 -35172 -23549
11630 -23549 -9762 -41362 -57817 -58436 -59472 -44051 -7027 -12596 -4512 -26229 -43755 -36786 -33428
11617c3428J0712m2048j45M2201J6630J3104r92r511K417p163k7558J2701J3306
11604i774j7047O459K3759k48P68j5274k2977k1160j7283J0818K1409L6400kk7842
11590c1994m767p392K384K2392j1615M435J8730J0767P024Q388k0248k488l1388
11577c5772J9805R617k3017K295R223J5563j4305j7415q169K5788o321m485K5100
11564b093M270j6177k1417Q874J3253p777m849q961K2536J6616K525k171j2371
11551g742k0158m313q62j8388L284P549K2607Q608l326K0256j8328l2118j1777
11538e4708J2631O624J4015K4229L4854j3183l6902k5332K0353L7050L2023j2718
11526C8936l9871O739j6880j0036K9154J4546k3108K789K4992j4536j5560j3795
$$ plain form
11617 -33428 -22716 -64764 -64909 -22708 -6078 7026 6034 -3477 -1060 -8223 -35781 -23080 -9774
11604 -9774 -26821 -20362 3397 3149 3917 -11357 -34334 -55494 -72777 -61959 -40550 -4150 -4152 -31994
11590 -31994 -36761 -44153 -41769 -19377 -30992 -26557 -7827 2940 9964 18352 -1896 -4384 -35772
11577 -35772 -15967 -6350 -29367 -27072 -17849 -2286 -16591 -34006 -42175 -16387 -22708 -27193 -2093
11564 -2093 2177 -14000 -35417 -26543 -13290 -21067 -25916 -34877 -12341 4275 6800 4629 -7742
11551 -7742 -27900 -32213 -33075 -51463 -48179 -40630 -18023 -9415 -12741 7515 -10813 -42931 -54708
11538 -54708 -42077 -35453 -21438 2791 37645 24462 -12440 -37772 -17419 19631 51654 38936
11526 38936 -935 5804 -11076 -21112 8042 22588 -520 2269 27261 12725 -2835 -16630
11514a6630k2445k1776K527K8127K0698j24k7489k7970m105k1118R008Q240o335
11501g9392n100K6553J5130K9144j2161n754J8616M2048L7062j411n090k3533
11489C6112j3484Q63k5427k0322K060q413R319J1631L161j2541j9074J7436M007
11476a4672P641J1947K0042j0156r765q106j6648k7952K4734J9693J8138K5654
11464D0550j1375J3029j8005k2614j4314l4032L398O561J221l243n1254J0299
11452g9779L5411L7475j3967k7781K015L578N254J7081L2767j422k8238j0930
11440b8536Q441o619k057q412k012k856K617J0728J471N984R426K3029m314j0730
11426c840P686L537l3668k2284K6165K1410J2928j3351N152L503j5020j1512K235
$$ plain form
11514 -16630 -39075 -60851 -58324 -30197 -9499 -9623 -37112 -65082 -69187 -90305 -81297 -73057 -79392
11501 -79392 -84492 -57939 -42809 -13665 -25826 -31580 -12964 29084 66146 64735 59645 36112
11489 36112 22628 23491 -1936 -22258 -20198 -28611 -19292 -7661 -4500 -17041 -36115 -18679 -14672
11476 -14672 -7031 4916 24958 14802 5037 -3069 -19717 -47669 -22935 -3242 14896 40550
11464 40550 29175 42204 24199 1585 -12729 -46761 -43363 -36802 -35581 -38824 -90078 -79779
11452 -79779 -44368 -6893 -20860 -48641 -46626 -43048 -37794 -20713 12054 10632 -17606 -28536
11440 -28536 -20095 -26714 -28771 -37183 -39195 -42051 -39434 -28706 -27235 -21251 -11825 11204 6890 -3840
11426 -3840 3846 7383 -26285 -48569 -22404 -994 11934 -1417 3735 7238 -7782 -19294 -17059
11413a7059n165K387J9089j6026J610J0388P299j1894p758L8646k4850j5341K0167
11400A493m429p797k618l4720n801L5063P710N785p737q493n592R480j5370Q208
11386b4818P712M570k326n290l881J5648R51J7651Q46M199j4350k7183J3313r20
11372a3878m631M6620p962L1791k1826n1142r375J1616j0792J330K566J0949P228
11359g506O950j8362l3892j1598L6573J9907j8096N786n717r593J3883n281J1103
11346a5843p696m12M385J787j8854k397J6388M211j596j3350l529k112L2897r408
11332a5529j2888J2506J3511K0796j743m1008l4533j192K3324J4382K9480J2702
11320A9808l0337l598M3346o520j3188L2281J4048m4817k9048k511M5717j6670
$$ plain form
11413 -17059 -22224 -19837 -748 -16774 -15164 -4776 2523 -9371 -17129 21517 -3333 -18674 1493
11400 1493 -2936 -10733 -13351 -48071 -53872 -18809 -11099 -5314 -13051 -21544 -27136 -17656 -33026 -24818
11386 -24818 -17106 -12536 -14862 -20152 -24033 -8385 -7434 10217 11063 15262 912 -26271 -12958 -13878
11372 -13878 -18509 28111 20149 51940 30114 -21028 -30403 -18787 -29579 -28249 -25683 -14734 -7506
11359 -7506 -556 -18918 -52810 -64408 -27835 -7928 -26024 -20238 -25955 -35548 -21665 -26946 -15843
11346 -15843 -23539 -23951 -19566 -17779 -36633 -39030 -22642 -18431 -20027 -33377 -36906 -39018 -6121 -15529
11332 -15529 -28417 -15911 -2400 18396 16653 -24355 -58888 -60080 -36756 -22374 7106 19808
11320 19808 -10529 -14127 29219 22699 9511 41792 55840 11023 -18025 -20536 25181 8511
11308H511k8317j0380J3307o999k2828K3764R050m791m360K1062L2874J5063J5210
11295F1166p964m0394j5862j4774R270q190j0792J7867j3326j7719K2255K9832
11283A1369k4599j8291k5133j2173J4154J90L1999J4737p613n061l316j5305j606
11270d0648L7278J2175J3254L302k5624l8168j2350K774J8943R890m256l9605
11258f3035l340P835m970p99L0308R526J3039R011J1243m565l0890j3616L1448
11245h805J2724k0376N903M0881K458l6491p281k2513J090Q894j9653p085m759
11232e5013m280J6697Q429J7460r944l977J9890L0576q399j9430O60L2663J1774
11219C7106J713J0216j5223j3120R494k585j4059o3879j5590J1811J1752R177
$$ plain form
11308 8511 -19806 -30186 -16879 -23878 -46706 -22942 -13892 -18683 -23043 -1981 30893 45956 61166
11295 61166 53202 12808 -3054 -17828 -8558 -16748 -27540 -9673 -22999 -40718 -18463 11369
11283 11369 -13230 -31521 -56654 -68827 -54673 -54483 -22484 -7747 -15360 -20421 -23737 -39042 -40648
11270 -40648 -3370 8805 22059 25361 -263 -38431 -50781 -48007 -29064 -19174 -23430 -63035
11258 -63035 -66375 -58540 -63510 -64309 -34001 -24475 -11436 -2425 8818 4253 -26637 -40253 -8805
11245 -8805 3919 -16457 -10554 30327 32785 -3706 -10987 -33500 -32410 -23516 -43169 -50254 -55013
11232 -55013 -59293 -42596 -34167 -16707 -26651 -30628 -10738 19838 11439 -7991 -7331 25332 37106
11219 37106 38819 49035 33812 20692 30186 27601 13542 -50337 -65927 -54116 -42364 -33187
11207c3187K0225J0985J3826J7104k760k8369M075j1085r107J3507j7158j7391
11195c9335Q951J7237k244J6571O106j8341P50J4138R30k0633k4489p612j2300
11182f0271J7550j3023l834J8975K5430K904l352J196q213P501N40M1709N399
11169C2511k9560m7928l010j1654J4086K7667K033o82M719M582n099K19L672k82
11155h726L1811J4159k5301j7965P613j7956k5840l565J1131l399J2722j6195
11143d1511k1758m738n976j091L9402J8649k3088M934j9774j768J9062K0619J6011
11130a027r276j4216j296P867j7006j1768K0167q151k0114L9562L0166q196m613
11117B099L911J3152N819j86r930m240j5837J4911K4853K2782j0090l8885o186
$$ plain form
11207 -33187 -12962 -1977 11849 28953 26193 -2176 1899 -9186 -18293 -4786 -21944 -39335
11195 -39335 -30384 -13147 -15391 1180 7286 -11055 -10305 3833 4763 -15870 -40359 -47971 -60271
11182 -60271 -42721 -55744 -59578 -40603 -15173 -12269 -15621 -14425 -22638 -15137 -14597 27112 32511
11169 32511 2951 -44977 -47987 -59641 -45555 -17888 -15855 -16537 -11818 -7236 -12335 -12116 -8444 -8726
11155 -8726 23085 37244 11943 -6022 1591 -16365 -42205 -45770 -34639 -38038 -25316 -41511
11143 -41511 -63269 -68007 -73983 -75074 -35672 -17023 -40111 -35177 -54951 -56719 -37657 -17038 -1027
11130 -1027 -10303 -24519 -25815 -17948 -34954 -46722 -26555 -34706 -54820 -15258 14908 6712 2099
11117 2099 6010 19162 24981 24795 14865 10625 -5212 9699 34552 57334 47244 8359 2173
11104B173J2419M337m298n366Q460K1551j0629k3748k3645J594R923M566J1869
11091I206J5587j1009k6103k790O881o47J1641L640M064n064j5227J0146K0641
11078B0966m7278j7062K3046J6480K4966k6606m746L146J2110p665J3891J3218
11066B4466k307j4559j5935k1921j1311J0998n154k2733Q3J6008M723J5829K9119
11053G306q76J3069j5790j4267K230K967p966k9127m4341J9080K3368q826l0083
11040h3256l588M2361M795j3685j5058K0603N4420K7553M997k836p62l32q219
11027B6993l091J3750j434l8401k8538j4552Q60K0543j0198l6432J2315K0369
11015c7816K6203p370K6171J1443n606j9823n273j9693j4924l475K1424J6581
$$ plain form
11104 2173 14592 18929 14631 9265 17725 39276 28647 4899 -18746 -17152 -7229 -2663 9206
11091 9206 24793 13784 -12319 -15109 -8228 -8875 2766 6406 10470 5406 -9821 325 20966
11078 20966 -26312 -43374 -20328 -3848 21118 -5488 -10234 -7088 5022 -2643 11248 24466
11066 24466 22159 7600 -8335 -30256 -41567 -30569 -35723 -58456 -58373 -42365 -37642 -21813 7306
11053 7306 6430 19499 3709 -10558 -8328 -5361 -13327 -42454 -86795 -67715 -44347 -53173 -83256
11040 -83256 -86844 -44483 -39688 -53373 -68431 -47828 6592 34145 39142 36306 35544 35212 26993
11027 26993 23902 37652 36218 -2183 -30721 -45273 -44413 -23870 -34068 -70500 -58185 -37816
11015 -37816 -11613 -18983 7188 18631 13025 -6798 -12071 -31764 -46688 -50163 -28739 -12158
11003a2158K1114J3442k2385k976k6232l8025j2962L1269L0750R748M925J3012
10991I522J1114j5576l1162k6180K4159j0160M029M012k610J9195l349O038N367
10978e601L71j7747k3429J9655J2258K6359q479R030N003r77m181k9612l6882
10965e4232m5436j9690K7485M6669K9701j726m022J8033J5056p193J5940j8263
10953B322j1037j4736j9569K8230r92m986r727J5314M232K47J6830m052j9325
10940a7249J7526L7032J7157p783j2063l5332k5024L5152L0251Q615n88R036l4159
10927B2571L359K253N910k8108j3517J4847k6762m9133j3304L0995N5776J9910
10915B4797k5214m0351j4808J6430L6118J7883r501q499o136p348m0607j3510
$$ plain form
11003 -12158 8956 22398 13 -2963 -29195 -67220 -80182 -48913 -18163 -8415 -3490 9522
10991 9522 20636 5060 -26102 -52282 -28123 -38283 -34254 -30242 -32852 -13657 -17006 -10968 -5601
10978 -5601 -5230 -22977 -46406 -26751 -14493 11866 3387 12417 17420 16443 12262 -17350 -54232
10965 -54232 -99668 -119358 -91873 -45204 -15503 -17229 -21251 -3218 11838 4645 20585 2322
10953 2322 -8715 -23451 -43020 -14790 -15782 -20768 -30495 -15181 -10949 -10702 6128 2076 -17249
10940 -17249 277 37309 54466 46683 34620 -712 -25736 9416 39667 48282 47694 56730 22571
10927 22571 25930 28183 34093 5985 -7532 7315 -19447 -68580 -81884 -50889 4887 24797
10915 24797 -417 -40768 -55576 -39146 -3028 14855 5354 -3145 -9281 -16629 -57236 -70746
10903g0746K3745J764r36j6005q855J9740M1793M889k961j7916R076P664M2374
10890C3626J947K023j7725q810M78j1107J0391p766m930L0945J4143j0535k2942
10877I738j1047Q126K17J8173K5648k7789k5464P333k8657M20J3268N630K5958
10864B1554O955m26k9115m1634J7434J5603J8810P489l0176j1498K122P654N15
10851a4713M222O080p108k0227j6403k6203J8859J1713J8202J7749m937Q556M023
10838a87J9913l1274J5P434J246l897Q60J8121j3585j6672J7950K0171l6233j970
10824a8108J1375N766k9748k4966J0567j9189M2579K2846l623J7834M46n112o466
10811D201k5092j7516n452j4445L8953N7026K1315k0989o222Q056k559j9257j5829
$$ plain form
10903 -70746 -47001 -45237 -46173 -62178 -71033 -51293 -9500 -4611 -7572 -25488 -16412 -8748 33626
10890 33626 35573 37596 19871 11061 11539 432 10823 3057 -1873 29072 43215 32680 9738
10877 9738 -1309 6817 7034 25207 50855 23066 -2398 4935 -23722 -23302 -10034 -4404 21554
10864 21554 28509 28083 -1032 -42666 -25232 -9629 9181 16670 -13506 -25004 -22882 -15228 -14713
10851 -14713 -10491 -4411 -11519 -31746 -48149 -74352 -55493 -43780 -25578 -7829 -12766 -4210 -187
10838 -187 19726 -11548 -11533 -4099 -2853 -6750 -5890 12231 -1354 -18026 -76 20095 -16138 -18108
10824 -18108 -6733 -967 -30715 -55681 -45114 -64303 -21724 1122 -2501 15333 15779 10667 4201
10811 4201 -20891 -38407 -43859 -58304 -19351 37675 58990 38001 31779 39835 37276 18019 2190
10798B190J079r006J4411k2001j0783m279L0536J0691L875K5655N003k504j2876
10785C1991p549o884R292j0184K523K676N443o741O345M740J091l018j5640q717
10771E368j5989k5322o375L1460R693J8952M3445O199m41K1657L0028j8244k2056
10758G8375j021j2957m867k0490k5538j3960k0502J7056j363k2698k4099K8004
10746b4060J2712K2346J7750k1079l3580Q323J136J5606K8161M484N779q457k0431
10733H690j6576K4155K0917N627k046k9452R771L0114K3896r380j0386K3299p163
10720G1466q555J1033K6336J7208p981p330l8268k0449K0835R32m267k993k0088
10707C7879J36R356O281k7551n409K793M071J0875O3833J6206k4243J1159q268
$$ plain form
10798 2190 3269 -5737 8674 -13327 -24110 -28389 2147 12838 16713 42368 47371 44867 31991
10785 31991 24442 17558 26850 16666 19189 21865 27308 20567 26912 31652 32743 29725 14085 5368
10771 5368 -10621 -35943 -42318 -10858 -1165 17787 61232 67431 66990 88647 118675 100431 78375
10758 78375 77354 64397 59530 39040 13502 -458 -20960 -3904 -5267 -27965 -52064 -24060
10746 -24060 -11348 10998 28748 7669 -25911 -17588 -16452 -846 27315 31799 37578 29121 8690
10733 8690 -7886 16269 37186 42813 40767 11315 21086 51200 75096 65716 55330 78629 71466
10720 71466 62911 73944 100280 117488 109507 102177 63909 43460 64295 65227 60960 57967 37879
10707 37879 38015 47371 53652 26101 20692 23485 27556 38431 102264 118470 94227 105386 97118
10694I7118K6942J0333p696m42j4766m2799k0281j3477K2015K6030l0290k3653
10682B9034K3951L0504O838j2707J9708O919r765l3104m760j7319q459j2614N799
10669B4025L6161K1842J1420q479j3217J3895k1774q240p625K86P344J9379L4577
10656A09594r26j8085l038k0622J4088K2095Q241k2810k9273L948L5769K0239
10644A19220N554p639m847k9207k8557j7993j765J6024J3405J5440k3482l8194
10632A7959J6974M0181M1272L8200k443Q613O101M723k6914m7108m1197k2022
10620C4339j2286N583J5319j6947m060n771k3774k934L8728N4332j1684l8088
10608C2757j3551q152N0202J1009m075O88l5439k219M905K4017L1858j9111J9443
$$ plain form
10694 97118 124060 134393 126697 126255 111489 68690 48409 34932 56947 82977 52687 29034
10682 29034 52985 83489 90327 77620 97328 104247 94482 61378 56618 39299 30840 18226 24025
10669 24025 60186 82028 93448 84969 71752 85647 63873 55633 48008 48294 55638 75017 109594
10656 109594 108668 90583 87545 66923 81011 103106 111347 88537 59264 63212 98981 119220
10644 119220 124774 117135 112288 83081 54524 36531 34766 50790 64195 79635 56153 17959
10632 17959 34933 75114 116386 154586 152143 160756 166857 171580 144666 97558 56361 34339
10620 34339 22053 27636 42955 26008 21948 16177 -7597 -10531 28197 82529 70845 32757
10608 32757 19206 11054 61256 72265 68190 68878 33439 31220 36125 60142 92000 72889 92332
10595I2332K5574L0968J5580J7712P300m0273l7243j510j5070k2104q131k3201
10583D1934k3953J3885K3844M636j66J7549m0166m2537q396N23K9860L3279K3662
10570G3954J7929k2152k5161J291K9166J1839J2728j3568l605j030n076k831J7194
10557I0678j3574j1916L504N655J6112J3648m186j6332J1090Q133k3401J010J6542
10544I6963J9261O699l664m849P945q005j2791P173J1128j4963p646Q539k0707
10531H5083R838r637L926k4866p308q489N55R171r401J290J368o647k0765L4032
10517E8150L8132m3213J6210L4547K7749J324m1776n835J2474j3911r368J7739
10505I2222M13L3478N955m9798l3821N3056N1631j2029j4792K130j3352q344j4614
$$ plain form
10595 92332 117906 148874 164454 182166 189466 149193 111950 110440 95370 73266 65135 41934
10583 41934 17981 31866 55710 60346 60180 77729 37563 -4974 -13370 -12847 17013 50292 73954
10570 73954 91883 69731 44570 45861 75027 86866 99594 86026 82421 81391 76315 73484 90678
10557 90678 77104 65188 68692 74347 90459 104107 99921 83589 94679 102812 79411 80421 96963
10544 96963 116224 122923 119259 114410 122355 114350 101559 108732 119860 104897 97251 105790 85083
10531 85083 94921 85284 89210 64344 57036 48547 49102 58273 48872 50162 51530 44883 24118 58150
10517 58150 96282 53069 69279 103826 131575 132899 91123 85288 97762 83851 74483 92222
10505 92222 92635 126113 132068 82270 48449 101505 153136 141107 126315 128445 115093 106749 92135
10492I2135K602j7881K4J3507l551j7457N005j5582J1695j34r603R940j5271k4596
10478C0833o710J132K1250K1610J1872J2008J1657J2317m3775j7608Q89q636N068
10465E1907J5833P912N3441m843j9607p351k748L2535k995J0463K7737M4285M7344
10452B53913K9954K0943O729j4868k6211l5065m8826j4134J857j6523p849p698
10440A42222J669L4519K2461P722j281Q143j2290O414M2826P8429M7686N4668
10428D33188L4358O6387L0095l7514n7152o1317n7824m2471k2013k8656J1761
10417B68842j4152m1904l349k4729n177L3998J027m913J3906K4375K910k1995
10405B28839l116j2895O999j3589n05K2907K8617J6730K3906R105K5568M1889
$$ plain form
10492 92135 94737 76856 76880 90387 86836 69379 74384 58802 70497 70363 60760 70700 55429 30833
10478 30833 24123 25255 46505 68115 79987 91995 103652 115969 72194 54586 55475 46839 51907
10465 51907 67740 75652 129093 124250 104643 97292 94544 127079 124084 134547 162284 206569 253913
10452 253913 283867 304810 311539 296671 270460 235395 186569 172435 174292 157769 149920 142222
10440 142222 143891 178410 200871 208593 207312 215455 203165 209579 252405 330834 378520 433188
10428 433188 467546 533933 564028 526514 469362 408045 350221 307750 285737 257081 268842
10417 268842 254690 212786 209437 184708 179531 213529 214556 209643 223549 247924 250834 228839
10405 228839 225723 212828 219827 206238 205733 228640 257257 273987 297893 306998 332566 374455
10393C74455P1790Q1811O2997O1771K8206k2971n8262m1050k1105K3141N62Q331
10381E69676J4352J9105J1001M2756N5975M3208M4690R5366J51525K12426L02326
10370A562406M09244N15523M69085J51930j76189l43151l14959k51910j57246
10361A864733j28028m5610N9429J37836J60882L8769j74935k14032j75753j08317
10351A414974n7872N932N2127R2028J64675K26804L35824N18424P05136Q66820
10341D324872Q00400M91430Q3631l78052o33904o00515l47492k2711L07708O95276
10331D720643Q36156L89607l55990q31657r15644o98600m65214k61785j62045
10322B255471q7054k7021k1841L5725Q6573J38751J91814K78895L81308N13028
$$ plain form
10393 374455 446245 528056 591053 652824 681030 658059 599797 558747 537642 560783 561345 569676
10381 569676 584028 603133 614134 656890 712865 756073 800763 896129 1047654 1260080 1562406
10370 1562406 1971650 2487173 2956258 3108188 2931999 2588848 2273889 2021979 1864733
10361 1864733 1736705 1691095 1750524 1888360 2049242 2088011 1913076 1699044 1523291 1414974
10351 1414974 1357102 1363034 1415161 1507189 1671864 1898668 2234492 2752916 3458052 4324872
10341 4324872 5125272 5616702 5700333 5322281 4688377 4087862 3740370 3717659 4025367 4720643
10331 4720643 5556799 5946406 5590416 4758759 3843115 3144515 2679301 2417516 2255471
10322 2255471 2168417 2141396 2119555 2155280 2241853 2380604 2572418 2851313 3232621 3745649
10312C745649O75092J005366J430760J883043J909435J304477Q10587R26510J149422
10303A4840341Q61655m080j003526j498813j288319o50366J11032N91375N27287
10294A2486586L24154M69161J026691J394579P16385n92407j254151j049349k69783
10285A3251866Q23247J787524J612847L3398j299417j787195j691853j179931
10277A1550486n27238K35922J057859J990326K776819K788618J450468o18250
10269B0705010j992524k075460j347247o77394o96099j085356j133377p65307
10261A0932246q4132O16801J204607J234363R55609Q39499M87853k29217n71806
10252A5385823k87719M13628Q34803M08614j27989m7448O86706J975581L496555
$$ plain form
10312 3745649 4420741 5426107 6856867 8739910 10649345 11953822 12764409 13690919 14840341
10303 14840341 15701996 15697916 14694390 13195577 11907258 11256892 11367924 11959299 12486586
10294 12486586 12810740 13279901 14306592 15701171 16417556 15825149 14570998 13521649 13251866
10285 13251866 14075113 15862637 17475484 17508882 16209465 14422270 12730417 11550486
10277 11550486 11023248 11259170 12317029 14307355 17084174 19872792 21323260 20705010
10269 20705010 18712486 16637026 15289779 14612385 13916286 12830930 11697553 10932246
10261 10932246 10848114 11464915 12669522 13903885 14859494 15698993 16186846 15957629 15385823
10252 15385823 15098104 15511732 16346535 16755149 16627160 16579712 17266418 19241999 22738554
10243B2738554M618242M035282J560374q05600j703760j777490k556869l717515
10235B2391218m077032l601710k692483j804777j154515o54453l17946J0638L20372
10226H419312O49487J027512J581385K319267L333897M385034M951098M540199
10218C1207191K364762j070081l564493m145072l280530k139240j792434j950292
10210A5629811j838914j401574p15835K7734L43297p8633r29692j480083j529482
10201H026629j243129q59444n05687k43367n8564J04616K97926N89506J027441
10192G135927J533740J800773J087258l37056j151291j179770o65297O4288O64664
10183H953236P49045L78288j21896q62937j470382j533423j305492r51650o73014
$$ plain form
10243 22738554 27356796 31392078 32952452 32146852 30443092 28665602 26108733 22391218
10235 22391218 18314186 14712476 12019993 10215216 9060701 8406248 8088302 8098940 8419312
10226 8419312 9068799 10096311 11677696 13996963 17330860 21715894 26666992 31207191
10218 31207191 33571953 32501872 28937379 24792307 21511777 19372537 17580103 15629811
10210 15629811 13790897 12389323 11673488 11701222 12044519 11965886 11036194 9556111 8026629
10201 8026629 6783500 5924056 5418369 5175002 5116438 5221054 5518980 6108486 7135927
10192 7135927 8669667 10470440 11557698 11220642 10069351 8889581 8224284 8288572 8953236
10183 8953236 9702281 10080569 9958673 9095736 7625354 6091931 4786439 3834789 3161775
10174C161775m70813l44246k32721j34768p3160o8342p5139l4284L93J2558L1383
10163A772636N1395O8919J20569K40354K90254M23771O34256Q20179R12904R16044
10153F251281O41642m8493o44009q23193o66906l61201j32686j13722k95849m82763
10143C324101n58595n12609l58164k71877k15092j69942j15724m7702m1900q0383
10133I52113n6318j6692j0622o244K0568L0619M0422M7838J12996J22083J70342
10122A407105K20565K82556L83586L49103J40745j21794l38344m19992l70724
10113A532806k63197k45361j57326p9380q8327o9621j1780m5440j0116N5765K6993
10102F45016K784j9678n1059K732K0525J0021l5428n856M8995N5582N8231p011
$$ plain form
10174 3161775 2690962 2346716 2113995 1979227 1906067 1837725 1762586 1728302 1728695 1741253 1772636
10163 1772636 1824031 1892950 2013519 2253873 2544127 2967898 3602154 4422333 5335237 6251281
10153 6251281 6892923 6844430 6200421 5377228 4710322 4349121 4216435 4102713 3806864 3324101
10143 3324101 2765506 2252897 1894733 1622856 1407764 1237822 1122098 1074396 1032496 952113
10133 952113 895795 879103 868481 862237 882805 913424 953846 1001684 1114680 1236763 1407105
10122 1407105 1627670 1910226 2293812 2642915 2783660 2661866 2323522 1903530 1532806
10113 1532806 1269609 1024248 866922 787542 699215 629594 617814 572374 562258 618023 645016
10102 645016 647800 628122 577063 579795 600320 610341 574913 569057 618052 673634 731865 724854
10090G24854k0457M4085R6921J05454J38258J77795K52286L59055M34263L50361
10080B662875J04201j64429l58015l66924k89523k00360j23158o7256K088N2604
10070A252103J17829J28156K43694L21673L61343N00560M34652J84952l859p4415
10060C466688n582N5205m5930k21531k87455k41714q2035Q8979K40682K48168
10050C215475M7080k47529m28907m51560l92160k92614k00125j45493j23762j22773
10040H57632p5430n8423n5441p7151l6700o589j5574J2717N308q101M7728J0050
10028F00026o203j2859k5149m9199o4832l3662N2913K2854j1247j251j285q504
10016D61602P350K0943O8391L8159L6447O7039P6289O1104R6546J04560J51211
$$ plain form
10090 724854 704397 748482 845403 950857 1089115 1266910 1519196 1878251 2312514 2662875
10080 2662875 2767076 2602647 2244632 1877708 1588185 1387825 1264667 1197411 1199499 1252103
10070 1252103 1369932 1498088 1741782 2063455 2424798 2925358 3360010 3544962 3541103 3466688
10060 3466688 3461106 3516311 3470381 3248850 2961395 2719681 2637646 2726625 2967307 3215475
10050 3215475 3262555 3015026 2586119 2134559 1742399 1449785 1249660 1104167 980405 857632
10040 857632 782202 723779 668338 591187 554487 547898 532324 545041 550349 542248 589976 600026
10028 600026 593823 580964 555815 506616 441784 408122 461035 483889 472642 471391 470106 461602
10016 461602 468952 489895 558286 596445 632892 699931 776220 837324 933870 1038430 1189641
10005A189641K28016L07233L76559M03953K56331m2490k76251l48208l07624k38899
9995A548261j93107j03653l4627k2764k5736J596M7935J18265J67472J51124K03479
9984A858245K88644M14105N94732Q63000J149980J338654J064409M23593k65430
9975G729932p50652j034108j065461q84678o32684m28514k33146o325J29528K01768
9965C025660J75453k5422k08305k68188k33950j10690j0793J13114K06155L79556
9955C042590N24078O92207R88636J305132J363448R86335M74292k86881j083839
9946H005998j424698j277913r38759n94622l31547j56046l6335J02525J84040
9937C532643K23098L18389M79902O95130R72203J340898J941829K487628K389082
$$ plain form
10005 1189641 1417657 1724890 2101449 2505402 2761733 2719243 2442992 2094784 1787160 1548261
9995 1548261 1355154 1251501 1216874 1194110 1168374 1169970 1217905 1336170 1503642 1654766 1858245
9984 1858245 2146889 2560994 3155726 4018726 5168706 6507360 7571769 7995362 7729932
9975 7729932 6979280 5945172 4879711 3995033 3362349 2933835 2700689 2694364 2823892 3025660
9965 3025660 3201113 3175691 2967386 2699198 2465248 2354558 2343765 2456879 2663034 3042590
9955 3042590 3566668 4258875 5247511 6552643 7916091 8902426 9376718 9089837 8005998
9946 8005998 6581300 5303387 4364628 3770006 3438459 3282413 3246078 3348603 3532643
9937 3532643 3755741 4074130 4554032 5249162 6221365 7562263 9504092 11991720 14380802
9928A4380802J448028N53764l09000j073964j323727r86973l19416M70062J038983
9919A3878559R10008K94049P6368M61753J137389J368770R52581O82596Q63202
9910B0625275O48752o90364k149599k680088k355135j596391p25069J17391Q26228
9901A2021000J068610P93254L72878l26337p81359o34361J8876J026541K057410
9892A5616512K620020J699102k82496j720692k071776j609975q94260j94627N14294
9883A3676102J390669K306831K470316J323156j3828l88434j86413k70152m76171
9874A9832076m85240n23132n26415l7769O36351P72752N44670O28952N83503Q8732
9864B1514480p59491j363029j260995j125280j581964j815657j500522q66272
$$ plain form
9928 14380802 15828830 16382594 16073594 14999630 13675903 12688930 12369514 12839576 13878559
9919 13878559 14788567 15082616 15158984 15620737 16758126 18126896 19079477 19762073 20625275
9910 20625275 21274027 20583663 18434064 15753976 13398841 11802450 11077381 11194772 12021000
9901 12021000 13089610 13882864 14255742 13929405 13148046 12513685 12532561 13559102 15616512
9892 15616512 18236532 19935634 19653138 17932446 15860670 14250695 13356435 13161808 13676102
9883 13676102 15066771 17373602 19843918 21167074 21153246 20764812 20578399 20308247 19832076
9874 19832076 19346836 18823704 18297289 18259520 18895871 19668623 20213293 20842245 21425748 21514480
9864 21514480 20754989 19391960 18130965 17005685 15423721 13608064 12107542 11241270
9856A1241270k56052J09011L35564Q00277J441738J838966J309974L29251M4677
9847A7194676M54868M15173q91631k127570k397805j961384j214727n87778k26171
9838H657651j91618r7333K14000O89314J344196K071597K311340J481126O1000
9829A6541273j018374j449379j375577j047558n01686j03385k66243o12025o83870
9820I483176m09375J12504O67069R71152P08005N824m51740l63872m8561l19282
9810A0354900j069622j501017j433868j076202o76721l16506O253L34120O86035
9801E307372O93649J13702n70275q94196r40325p41940m90889k79631j73408q5108
9791A938951p1554q2391p0150k8673Q961O8260J86734K42884L99621O68860Q09240
$$ plain form
9856 11241270 10985218 11094229 11429793 12230070 13671808 15510774 16820748 17149999 17194676
9847 17194676 17649544 18064717 17173086 15045516 12647711 10686327 9471600 8883822 8657651
9838 8657651 8466033 8368700 8582700 9272014 10616210 12687807 14999147 16480273 16541273
9829 16541273 15522899 14073520 12697943 11650385 11148699 11045314 10779071 10167046 9483176
9820 9483176 9073801 9186305 9853374 10824526 11532531 11538355 11086615 10722743 10674182 10354900
9810 10354900 9285278 7784261 6350393 5274191 4597470 4280964 4287217 4621337 5307372
9801 5307372 6001021 6114723 5544448 4650252 3709927 2967987 2477098 2197467 2024059 1938951
9791 1938951 1867397 1785006 1714856 1686183 1695144 1763404 1950138 2193022 2592643 3261503 4070743
9780D070743O90750L28328n4978m91777p69056p55367n91426l84049k57264j50069
9770A635835o0104L0233J23216K08814K92144L06158K79648J30437j19198l42441
9760B484742l81140l38052j83032M43M5659J71779K73063L84286L80672J07066
9750B945486k49265m16239m36891l32615k31094j34856j02610n7434m0696m0637
9740I03149n8287j10439j33131q8871r502k6909j1569n9246m4239k5083p904n000
9728C22969j2498J9315j7880l6184j9938j451j8395j5419L2156j689m2890j0608
9716A97488r442r595m953q149p655J2763K3677j3440j8986R101O078Q962L563
9703A89412j2053j2960j9017n870n118J0902K9972J8042R5531P8448N3991N4527
$$ plain form
9780 4070743 4761493 5089821 5034843 4543066 3774010 3018643 2427217 2043168 1785904 1635835
9770 1635835 1575731 1605964 1729180 1937994 2230138 2536296 2815944 2946381 2827183 2484742
9760 2484742 2103602 1765550 1582518 1582961 1628620 1800399 2073462 2457748 2838420 2945486
9750 2945486 2696221 2279982 1843091 1510476 1279382 1144526 1041916 984482 943786 903149
9740 903149 844862 734423 601292 512421 502919 476010 464441 405195 360956 335873 327969 322969
9728 322969 310471 329786 311906 275722 255784 254333 235938 220519 252675 250986 208096 197488
9716 197488 188046 178451 173498 165349 157694 170457 194134 180694 161708 170809 176887 185849 189412
9703 189412 177359 164399 145382 139512 134394 145296 175268 193310 288841 367289 421280 475807
9691D75807r467n5674k9458n8464p0757o8174l5080q231J877K1180N2261N4674
9679B70494J5279L971n214k7416l3281j0723m1026l6922m1457j0111M062l297
9667H4359j6410J5340q849j0164M455o429m379J2280j0280k0471r282K3688K5250
9654G9108k1465j3708k6636o710Q125J7154L7216J6203j4335k1740M444p103k6603
9641B3950k2462J1428m304Q592l385r595N109Q265J9762m880O048M805l7591j9273
9627a3531r652n810J3545M935l182K3720R876j3914J0052J382J5870N51l903l334
9613B6605N054r130m1117l610J8921L3737P286q076j9605j1414o095J1660j6867
9600a2651K3464J0425j2836K3120L455k1635K2086j6743J708J9863k4446l3723
$$ plain form
9691 475807 466340 410666 381208 322744 251987 183813 148733 140502 142379 163559 215820 270494
9679 270494 285773 289744 284530 257114 223833 213110 172084 135162 93705 83594 87656 84359
9667 84359 67949 83289 74440 64276 68731 62302 57923 70203 59923 39452 30170 53858 79108
9654 79108 57643 43935 17299 10589 18714 35868 73084 89287 74952 53212 57656 50553 23950
9641 23950 1488 12916 8612 17204 13819 4224 9333 17598 37360 32480 38528 43333 5742 -13531
9627 -13531 -23183 -28993 -15448 -10513 -13695 10025 19901 5987 16039 17421 33291 33842 29939 26605
9613 26605 31659 22529 -18588 -22198 -3277 30460 37746 29670 10065 -1349 -7444 4216 -12651
9600 -12651 10813 21238 8402 31522 34977 13342 35428 18685 20393 40256 15810 -17913
9588a7913m51K4519J1615k5528k6502N7405K2923n391l119l2k712J5314O009J4800
9574G0937n516j8067m734j4012k8620j3758M6682K0513l154L1510q54k9936J5823
9561F6814J2280k3916j2206o326K6163K337J208k0400J4052K3389Q74P02m165
9548H0806k0596j0943K9345j2911k3310j4922k1986j5413M875R059K1647k697
9536B2954k1333n766J1893J0881K7508J1061J199Q638K7624j4602j3532r060j4806
9523D2659J7006J3809j0665Q289J951R037o789k6188P093K7946j2263k638n689
9510F3558j0719O383R941J7007K0724o828N296j5317j8881m054J5973J3052l496
9497I2639q641k7333K1902J4532r075J1368j8881k063r982k8258J833K3477J2968
$$ plain form
9588 -17913 -18364 6155 17770 -7758 -34260 23145 46068 40677 37558 37526 34814 50128 56137 70937
9574 70937 65421 47354 42620 28608 -12 -13770 32912 53425 50271 81781 80927 50991 66814
9561 66814 79094 55178 42972 36646 62809 65146 66354 45954 60006 83395 84269 84971 80806
9548 80806 60210 49267 78612 65701 42391 27469 5483 -9930 -5055 4004 25651 22954
9536 22954 1621 -4145 7748 18629 46137 57198 58397 67035 94659 80057 66525 57465 42659
9523 42659 59665 73474 62809 71098 73049 82086 75297 49109 56202 84148 71885 69247 63558
9510 63558 52839 59222 69163 86170 106894 100066 105362 90045 71164 67110 83083 96135 92639
9497 92639 83998 56665 78567 93099 84024 95392 76511 74448 64466 36208 38041 61518 74486
9484G4486J8668K0132Q607N095J156L3878K950m695j7335J9058P765J214r467
9471A61512k7024j1025k9950j8055J7877R888L761J2208l879k0002j8893q548
9459F7870j6138p811k566o99J501l656l409O450L0875J2307j4617J1270p028M3893
9445A18242K4658J5377L1179l3840n9706k934O846L041J691j1248k3866k5290
9433D4150j1821J7871L2745J9159J5524J3344j2024l144o1041O85K1363K2239
9421I9050N616l212k1980p390k917R594m383J5036P145o316j4727J116j579J4446
9407H9499j0545k2109M467R157l0939l5433L5231K3851k16r112k3519m947m658
9394B0727J6584N7308j331k9351j7625J4169l970k1778L333j4387J0114J8247
$$ plain form
9484 74486 93154 113286 121893 126988 128144 162022 164972 160277 142942 162000 169765 170979 161512
9471 161512 134488 123463 93513 75458 93335 103223 106984 119192 115313 95311 76418 67870
9459 67870 51732 43921 41355 40656 42157 38501 35092 41542 72417 84724 70107 81377 74349 118242
9445 118242 142900 158277 189456 155616 95910 92976 99822 102863 104554 93306 69440 44150
9433 44150 32329 50200 82945 102104 117628 130972 118948 115804 54763 55448 76811 99050
9421 99050 104666 101454 79474 72084 69167 78761 74378 89414 96559 90243 75516 76632 75053 89499
9407 89499 78954 56845 61312 70469 39530 4097 39328 63179 62963 53851 30332 25385 20727
9394 20727 37311 94619 93288 63937 46312 60481 56511 34733 38066 23679 33793 52040
9382E2040j762K027m380j026n728Q486l469k331l914j2607m450L543K0010l9245
9368G194J7163J6814N763J1921k0570J7711n387k4067q176m665L10O201k2601
9355b389M082K9164n081k7186l044K4992K2693K2217J4481k0830k6239M788n68
9342C7080q571J0923K6034k1687k6059Q946n786m316j3364k291M721J8317J9451
9329D3398M180l1263j0991K7596m71k3906Q054L6224K1475J2132J4873J647k9319
9316G3629l4914o203L066J2586j457q050M79j5731O15k2505L6J1809n258J6405
9302B4507J8285J5983J6874R23j2270l0627k5618J1291L0717k9401j8941M0523
9290D2246K9821Q378R02P902j3275q225j3338k1001k793L6427Q228k5377K2353
$$ plain form
9382 52040 50278 52305 47925 46899 41171 49657 46188 43857 39943 27336 22886 26429 46439 7194
9368 7194 24357 41171 46934 58855 38285 55996 50609 26542 18366 13701 14011 20212 -2389
9355 -2389 1693 30857 25776 -1410 -4454 20538 43231 65448 79929 59099 32860 37648 37080
9342 37080 28509 39432 65466 43779 17720 26666 20880 16564 3200 909 5630 23947 43398
9329 43398 47578 16315 5324 32920 32449 8543 16597 52821 74296 86428 101301 102948 73629
9316 73629 38715 32512 35578 48164 46707 38657 39136 23405 24020 1515 1551 13360 8102 24507
9302 24507 42792 58775 75649 76572 64302 33675 8057 19348 50065 20664 1723 42246
9290 42246 72067 80445 81347 89249 75974 67749 54411 33410 30617 67044 75272 49895 72248
9277G2248k708l1157K257K3630l8004l0787Q892L0526J2513j2635l8527j5528
9265a9280P370K5962n794O742J6744K5161N557J0292K077l8459k7098K0451K8808
9252E8533n271J5911J5682l2077k0740O168J596J1922n347k5222n8461L5169M8633
9239D6496N4273n587k1810m368k2792l0103J3129j7073l6264r139K9757L3399
9227B9918R081j1876J334k834j0783J2513J1567j0411j6768j1093R80J1246P742
9214B0616j2321j5565P71j916N376L2494K9476O74j4537j7911m414l1896L379
9201e774K374l951j6431K9362j491k4181q77K4659K5943K3296P302j0982j3489
9188C5760n184j0912r063Q763J6726j2037q876o367k0426L3740o03j6196J4635
$$ plain form
9277 72248 69540 38383 40640 64270 26266 -4521 4371 34897 47410 34775 -3752 -19280
9265 -19280 -11910 14052 8258 15000 31744 56905 62462 72754 74831 36372 9274 29725 58533
9252 58533 53262 69173 84855 52778 32038 38206 39802 51724 46377 21155 -37306 -2137 46496
9239 46496 100769 95182 73372 69004 46212 16109 29238 12165 -24099 -33238 -3481 29918
9227 29918 38999 27123 28457 25623 14840 27353 38920 28509 11741 648 1628 12874 20616
9214 20616 8295 -7270 -6499 -8415 -3039 29455 58931 59605 45068 27157 22743 -9153 -5774
9201 -5774 -3400 -7351 -23782 5580 4089 -20092 -20969 3690 29633 52929 60231 49249 35760
9188 35760 30576 19664 10601 19364 36090 24053 15177 8810 -11616 22124 21521 5325 19960
9175A9960J6514j715l0532m579R626K2359J9566k5313O980K4704K424k7665O144
9162C8473L733K3907J4772j2432l080M210n331k0078J4586K4971K2875k2745l3897
9149D9964N102O705O873K2856J5076N262l0251K181J948Q007Q751J3406J563K8269
9135A45712K2435J6339J2866J2175L4044O9502O3286J26668J89942K60485K61258
9124A214712M8460j38483k23486k12866j58179o9416k9105K8012M1891J6452N1450
9113E69442J15405J12981J23525J86052K67813L49830N75712Q44004J191049J395281
9103E731094R64811j72471j067819j313565j167269q15719n54450l81517k38144
9094I84951j44421j33558r8762n9643j7720k3187M069R726R496O4535Q0853J44463
$$ plain form
9175 19960 36474 34759 4227 -352 9274 31633 51199 25886 32866 57570 59994 32329 38473
9162 38473 42206 66113 80885 68453 65373 69583 64252 44174 58760 83731 106606 83861 49964
9149 49964 55066 61771 68644 91500 106576 111838 81587 83768 85716 93723 102474 115880 117443 145712
9135 145712 168147 184486 197352 209527 243571 313073 376359 503027 692969 953454 1214712
9124 1214712 1263172 1124689 901203 688337 530158 460742 431637 459649 501540 517992 569442
9113 569442 684847 797828 921353 1107405 1375218 1725048 2300760 3144764 4335813 5731094
9103 5731094 6695905 6523434 5455615 4142050 2974781 2159062 1604612 1223095 984951
9094 984951 840530 706972 608210 548567 530847 507660 511729 521455 530951 595486 676339 820802
9082H20802L34205N28084N21210J21853k96020m63495m50976l40557k37889j36570
9072D00647q1055j8748l4178m9200k8278j8901M184k288M258J881o038l858p310
9059A61116J1089Q215q390k3008r406j661L12J4535M845p809k189k9836p753r720
9045A00340k6430k0058J8096P2768P3401N8540L3722Q0018J53892K05727K04182
9034I54198J16926j10275k27340j86978j30927n7370n5956k3235j0081J3556J0700
9023B93218j5553m4453j8272p171r993l4201m558o668j0880p1l99j7317m9253
9010G4429J0769r751O325j24O202J7703m8733n5613j761J1923L3487j7057M121
8997C1920J3624K3792p86m982j2018k3930J8382K0096N719k7013q7288k4802Q5621
$$ plain form
9082 820802 1155007 1683091 2204301 2326154 2030134 1566639 1115663 775106 537217 400647
9072 400647 319592 300844 266666 217466 189188 170287 174471 172183 176441 178322 172284 168426 161116
9059 161116 172205 180420 172030 149022 139616 137955 138267 152802 157647 149838 147649 117813 110060 100340
9045 100340 73910 53852 71948 144716 218117 276657 310379 390397 544289 750016 954198
9034 954198 1071124 960849 733509 546531 415604 358234 302278 279043 268962 282518 293218
9023 293218 277665 233212 214940 207769 197776 163575 159017 152349 141469 141398 140999 123682 74429
9010 74429 85198 75447 81772 81648 87850 105553 56820 1207 -554 11369 44856 27799 31920
8997 31920 45544 69336 68550 63568 51550 27620 46002 66098 71817 44804 -42484 -67286 18335
8984A8335J08240N8290P2077Q4848M4523j7033k0506k4177l2089j7845l7377l6383
8972B00903J7757j4524j4908l0983l2760j93J9453J5098l3454l4501K465K0421
8960A14774m365j0548k0638J1776J7258L0980j1069j4726o584k1819l922N9078
8948A40195L4914j229q108l7420j5312n664j1789P343J9032M9592N4439M8840
8936B74833P1075M3458n31J8749m461l3091l0748l8660m0007M28m0719j9852M519
8923B04993j6784k2882L297j2801j6754J3601l0011j5436M905L5357M7272N0901
8911B45658J1422o300J207k8161j2389r641l3244j9057l6095J8636J4245Q070
8899A54351J8792N388l13j1230J9443j0669j2384K1010K0580L9486k234n434L0360
$$ plain form
8984 18335 126575 184865 256942 341790 386313 369280 348774 324597 292508 274663 237286 200903
8972 200903 218660 204136 189228 158245 125485 125292 144745 159843 126389 91888 94353 114774
8960 114774 110409 99861 79223 90999 108257 139237 128168 113442 106858 85039 81117 140195
8948 140195 175109 173880 165772 128352 113040 107376 95587 102930 121962 171554 225993 274833
8936 274833 345908 389366 388835 407584 403123 370032 339284 300624 260617 261045 220326 200474 204993
8923 204993 188209 165327 168624 155823 139069 152670 122659 107223 112128 147485 194757 245658
8911 245658 257080 250780 251987 223826 211437 201796 168552 149495 113400 132036 146281 154351
8899 154351 173143 178531 178218 166988 186431 175762 163378 184388 204968 244454 242220 236786 267146
8886B67146O960j0130k6529q696N155r190q298J1777m782r491j4925r954p600
8873A81443O186l2559m5940m1706j9901N1731Q7826J04280N4503K212j2551r736
8861C25788P694Q395j7557m0662j2584O1371O6265P1931J3141o0803j35487j09534
8849A77958n1532j0916N2389K4396L229M886k8828J3355J5575j695l5460l7484
8837A25873L2272L940J1396M5244M0450J9891K0931L2877k1270r718M292k0806
8825B85372j7899m26J8947K1406J0706N2707M6097J487M7355J8759J3496O3245
8813E61252M6236L9742M8483P6021J07264O7667o8910k76312k60414j06767J0651
8802B44913O0142L1021j1917J2278J3621O024j747j6560J0363L7615J4198k3517
$$ plain form
8886 267146 274106 263976 237447 228751 233906 224716 216418 228195 223413 213922 198997 189043 181443
8873 181443 187629 155070 109130 67424 47523 99254 187080 291360 345863 348075 335524 325788
8861 325788 333482 341877 324320 283658 271074 332445 398710 470641 483782 422979 287492 177958
8849 177958 126426 115510 167899 192295 195524 200410 171582 184937 200512 198817 163357 125873
8837 125873 158145 162085 173481 218725 259175 279066 299997 332874 311604 301886 306178 285372
8825 285372 267473 267047 285994 307400 318106 370813 416910 418397 465752 484511 498007 561252
8813 561252 607488 647230 695713 771734 878998 946665 877755 601443 341029 234262 244913
8802 244913 305055 336076 324159 336437 350058 356082 354335 337775 348138 385753 399951 376434
8790C76434J4426M2990M3584O5168M8134J6056k4310J6696M3336L3247k9151j2791
8778F33819k3923K577P4959R7118P4766M7376J15104R5094P2946M0843J7099L0692
8766A278470N6175J14446J22995R7359J5762p6770p4032q423O1793Q0664P2782
8755A741221P8901J00716J44476J72708J90835J84669K19416K68380K53966L19004
8745C674292L89482M23849M42781N06681O06087Q38773J031816J311909J432991
8736A0658661J423835J572746J956606K655474L774675N372454P769965J1454432
8728D6638848J7659528K8476191M4633413N3093426K2557329k3525043m4047657
8721A45486035m3890603l2344903k0767375j2920806q120369n318522l641574
$$ plain form
8790 376434 390860 433850 477434 542602 590736 606792 582482 599178 642514 675761 646610 633819
8778 633819 609896 612473 687432 784550 859316 906692 1021796 1116890 1189836 1230679 1247778 1278470
8766 1278470 1334645 1449091 1572086 1669445 1685207 1608437 1534405 1525982 1587775 1668439 1741221
8755 1741221 1820122 1920838 2065314 2238022 2428857 2613526 2832942 3101322 3355288 3674292
8745 3674292 4063774 4487623 4930404 5437085 6043172 6881945 7913761 9225670 10658661
8736 10658661 12082496 13655242 15611848 18267322 22041997 27414451 35184416 46638848
8728 46638848 64298376 92774567 137407980 190501406 213058735 189533692 145486035
8721 145486035 101595432 69250529 48483154 35562348 27441979 22123457 18481883
8714A8481883k571997j928795j421248r50851n55718m22207m60021m74164m07991
8705I288891k83901j25343L3599J53423K98265M61755O13114P18254Q22394J019717
8695A3000168J331804J749816K320199K646342K645695K809904L469926M720894
8687C4694748O687522R600109J3755913K0351417L1411303N1201875Q4985930
8680B52688817J16130604O2912318m1632715q8928943r2885162o9094303m3998774
8673I5191842k7083794j6797476j0961998p512048n312015l901848k815618j906093
8665A8900952j157162p71760q97928r48345o81650k41254r1211m33193q55034
8656A2823415j016292q61463n47827l07394q0346J88414L78852O04352Q49836
$$ plain form
8714 18481883 15909886 13981091 12559843 11608992 11053274 10631067 10171046 9696882 9288891
8705 9288891 9004990 8879647 8913246 9066669 9364934 9826689 10439803 11158057 11980451 13000168
8695 13000168 14331972 16081788 18401987 21048329 23694024 26503928 29973854 34694748
8687 34694748 41382270 50982379 64738292 85089709 116501012 167702887 252688817
8680 252688817 368819421 431731739 390099024 301170081 208284919 139190616 95191842
8673 95191842 68108048 51310572 40348574 32836526 27524511 23622663 20807045 18900952
8665 18900952 17743790 16972030 16074102 15125757 14444107 14202853 14111642 13678449 12823415
8656 12823415 11807123 10945660 10397833 10090439 10010093 10198507 10577359 11181711 12031547
8647A2031547J093041J204035J309799J580310K166942L110224M460973O402389
8639C3359260R393452J4336472K2791861L6588785N0399728L6705576r284064
8632A94291070l8626581m4650209l5909915k3712405j4684494r125180n857006
8625B1725280l922916k674449j810080j069335l70721J36249K4023q12493j446142
8616I779416j599162j379687j006580p11718n24137m42664l67271l14139k52725
8607C181333j76750j71005j54062j30775p9729r2912j28233j08715p1069j18189
8597A949894j58441j68539j75994r9401l1459J1156j3838l9180l8108k1593m1108
8586A173389k5456L0039L0453K7655J2898j913k5130l8858J242J3235M6286Q6381
$$ plain form
8647 12031547 13124588 14328623 15638422 17218732 19385674 22495898 26956871 33359260
8639 33359260 42752712 57089184 79881045 116469830 166869558 203575134 194291070
8632 194291070 155664489 111014280 75104365 51391960 36707466 27582286 21725280
8625 21725280 17802364 15127915 13317835 12248500 11877779 12014028 12038051 11225558 9779416
8616 9779416 8180254 6800567 5793987 5082269 4558132 4115468 3748197 3434058 3181333
8607 3181333 3004583 2833578 2679516 2548741 2469012 2376100 2247867 2139152 2068083 1949894
8597 1949894 1791453 1622914 1446920 1347519 1316060 1327216 1313378 1274198 1236090 1214497 1173389
8586 1173389 1147933 1177972 1208425 1236080 1248978 1247065 1221935 1183077 1184319 1197554 1243840 1330221
8574A330221l0176r3243j35818r4214m5999m0974l5399k3390J5122l7125n5183
8563G53822j4793r919L7618K5982r287o314l9147l3262N0348J06394J8594j38214
8551G41822k67292k20977j17262r368L2719J6266K4729J3810L1091P0659N5323
8540C71520J9493n385O409M8482R110M827K3043j0109J1103L7444K1618n3132
8528D84423o9176m6156m8227j4464L3196O4513J6960k7354m98j9844n127l0339
8516C37907j0569K6185P02N194J3755j3710m308M2222k63l1237q1468j18818m7557
8503A18035M3528N4863J1716r790j6338j8666j9681k0736o1845k4470K213L0428
8491H9257N0886M4079M4510K6118k4042m3245k4932j905Q424q69k9504Q642L269
$$ plain form
8574 1330221 1300045 1206802 1070984 976770 930771 889797 854398 831008 846130 809005 753822
8563 753822 739029 729110 766728 792710 783423 777109 737962 704700 755048 861442 880036 741822
8551 741822 474530 253553 136291 126923 159642 175908 200637 214447 245538 316197 371520
8540 371520 391013 385628 392037 440519 449629 454456 477499 467390 478493 515937 537555 484423
8528 484423 415247 369091 320864 306400 339596 404109 421069 393715 393217 373373 368246 337907
8516 337907 327338 353523 354225 359419 373174 359464 355156 397378 397115 365878 284410 165592 118035
8503 118035 161563 216426 228142 218352 202014 183348 163667 142931 81086 56616 58829 89257
8491 89257 140143 184222 228732 254850 230808 187563 162631 160726 169150 168281 138777 147419 150688
8478A50688J1283N875j1927J6683k667l6290J0070j584j3953k6830k3097R148
8466H7399L0432k0315P804J6170N370J4406L58j7600P127L8391Q534l5730l2135
8453A10211k266p214m2199j6870K1313J6730K1630K1494L9427K7839j0992o183
8441A72920m9319j4746J778J4839k3471l1301k4837p697J5618M805Q916L9109
8429A06614K2747k7818n7530l3540J1363j7926j7098j7751L8408J6027M3055O5019
8417A31570K9383M4234l96l7421r850k4439m2843k4064j0081J0835N653k2879
8405D9702m2424K5476J7825k781K8032J4496P498j2097k6066q860J055L37J130
8392E3323l215m1738J0750M0851j956j9572j1482j5118r117m354j0111k0156o723
$$ plain form
8478 150688 161971 167846 155919 172602 169935 133645 143715 142131 128178 101348 78251 87399
8466 87399 117831 97516 105320 121490 126860 141266 141624 124024 131151 169542 178076 142346 110211
8453 110211 107945 100731 58532 41662 62975 79705 101335 122829 162256 190095 179103 172920
8441 172920 123601 108855 110633 125472 102001 70700 45863 38166 53784 58589 67505 106614
8429 106614 129361 101543 44013 10473 21836 3910 -13188 -30939 7469 23496 66551 131570
8417 131570 160953 205187 204791 167370 157520 133081 90238 66174 56093 66928 72581 49702
8405 49702 7278 32754 50579 47798 75830 90326 97824 85727 59661 50801 51856 52193 53323
8392 53323 50108 8370 19120 59971 58015 38443 26961 11843 2726 -1628 -11739 -31895 -38618
8379c8618k0701j7775j4284K264O0868Q4183P8601N8077J2231l3539j0342j9621
8367A41344l8000l4675J2888M0146K4051J576j6448k687j7268k5712l2099J4481
8355F7597K3357Q886l1017q799l788J6455q114J6425Q187K4k0948m931j753j725
8341E9856j5024L026k545j2896k3480l985P793o548K5912o202j6876L8376P3826
8328A21233Q2799R3288J7534N017L954N5430P4068J41631K37739K88939R8223
8317A219855j14947k11128k27906j91746j23926o3215k6501o389l3475r206p923
8306B03493k3785k3540j1574k2336J4747L1735j752J1053n976o1071p770j334
8294A01890K641K7211J1003L919K063J2632K0578J5145k4177P628L6383L0042
$$ plain form
8379 -38618 -59319 -77094 -91378 -89114 -28246 55937 134538 192615 204846 171307 160965 141344
8367 141344 103344 68669 81557 121703 145754 147330 130882 128195 110927 85215 53116 67597
8355 67597 90954 99840 68823 60024 56236 72691 64577 81002 89189 89213 68265 63334 61581 59856
8341 59856 44832 47858 45313 32417 8937 4952 12745 6197 32109 25907 9031 47407 121233
8328 121233 204032 297320 314854 319871 323825 379255 453323 594954 832693 1121632 1219855
8317 1219855 1104908 893780 665874 474128 350202 286987 260486 254097 220622 211416 203493
8306 203493 179708 156168 144594 122258 137005 168740 166988 178041 172065 110994 103224 101890
8294 101890 104531 131742 142745 146664 148727 161359 181937 197082 172905 180533 216916 246958
8282B46958J7577M7685Q8187M7507P6806J49748K80693M42820O00472L16270k25925
8271B088798m66903m95479l35816k01376j53289q0941m1431m9220k1467j740j7146
8260B23990m5872l2864J0388P677J385J039K4414j0064l5560p464o171J265l5149
8247I7014K717j0534M821J6378K5292R05j6958J3814P824k9961J6069O986L1731
8234A66098N0707N0234Q3873J32820J79042K71570J80546n8096j97891k33098
8224F25805j75322r9007o5431o8127n3244l9122j1076j995j0574J3796O72l3363
8212H3012m561K2574J4021l678p091j2574p54K6554J9215j2660k8661J3548k5549
8199H3396m780j4315m303r312J1990K6227j1818k1665k2012Q59J3951N55j6384
$$ plain form
8282 246958 264535 312220 400407 447914 524720 674468 955161 1397981 1998453 2314723 2088798
8271 2088798 1621895 1126416 790600 589224 435935 354994 313563 264343 242876 241136 223990
8260 223990 178118 145254 155642 163319 164704 165743 190157 180093 144533 137069 130898 132163 97014
8247 97014 99731 89197 94018 110396 135688 136593 119635 133449 141273 111312 127381 134367 166098
8234 166098 216805 267039 350912 483732 662774 934344 1114890 1056794 858903 625805
8224 625805 450483 351476 286045 217918 164674 125552 114476 112481 101907 115703 116375 83012
8212 83012 78451 101025 115046 111368 104277 91703 90949 117503 136718 124058 95397 108945 83396
8199 83396 78616 64301 59998 50686 62676 88903 77085 55420 33408 34267 48218 48773 32389
8186C2389J1265K396l6260N944l604k6458L3589J0633K1452L5765n452l6781j164
8173D3714o355j187l3032j0429L5531O4177L1128l5051k6507r525j2143q813J6336
8160D7844m270l5279J524K0707J7248j300l4814k2369L115o805j3758K9837J1800
8147A3480Q750J0317m990L316R443j8344L1345q341K603o67J2333L891J4642J072
8133G8850m709L315r605p180k3616K006J2447k8211k4668o417J6450k238O622
8120A3046J5509l1125J0256K4263K7011J5368k0536L537n691o898J2215j3553
8108D3402l161M2343J0493K252j8228l5391Q720n154n946J4337P687R22j106J2932
8094G4102J0645k7644j1151r508k1495j1781M811p980J7990K4035J847j3729p223
$$ plain form
8186 32389 43654 46050 9790 15734 12130 -14328 19261 29894 51346 87111 81659 44878 43714
8173 43714 37359 36172 3140 -7289 28242 92419 123547 88496 61989 52464 40321 31508 47844
8160 47844 43574 8295 9819 30526 47774 46474 11660 -10709 -7594 -14399 -28157 1680 13480
8147 13480 22230 32547 27557 30873 40316 21972 53317 44976 47579 46912 59245 63136 77778 78850
8133 78850 74141 77456 67851 60671 37055 39061 51508 23297 -1371 -7788 8662 6424 13046
8120 13046 28555 -2570 7686 31949 58960 74328 53792 57329 51638 44740 56955 43402
8108 43402 40241 82584 93077 95329 77101 41710 50430 45276 39330 53667 61354 62276 61170 74102
8094 74102 84747 57103 45952 36444 14949 3168 7979 -1 17989 42024 43871 30142 22919
8081B2919J3334m029K5581J0135l4645k7308l2172M5122J0131k7932k251j4134
8069a5249j0991j0306P983J9198q753O331L1779k727k127r299L195K9965J2301
8056E1300l9087j1158K0695R251J2282l3828j1292P121N870J8009J090j430l0162
8043a339L17j357j3935O621o885j2249K2926K0808L111p6k1563k2523K3737K9545
8029B7138J5714k3373k407q211M917L45k8073j1534J9651r651p230J5621j76K8734
8015B1465m464K55j1609K4920l131j8354j2249J1593J1323k0939k7267J3255m900
8002b0102j6746J41K6108j3384J158j7258j0375N4377L8249j5925l587k1858J9239
7989B0037L8042j0223k3182j6202M682J7171n130J833l439k0307p876L398K638
$$ plain form
8081 22919 36253 32224 57805 67940 33295 5987 -26185 18937 29068 1136 -1115 -15249
8069 -15249 -26240 -36546 -28563 -9365 -18118 -11787 19992 17265 15138 5839 9034 38999 51300
8056 51300 12213 1055 21750 31001 43283 9455 -1837 5284 11154 29163 30253 28823 -1339
8043 -1339 -1022 -2379 -16314 -9693 -16578 -28827 -5901 14907 18018 17942 -3621 -26144 -2407 27138
8029 27138 42852 19479 17072 8861 13778 14123 -13950 -25484 -5833 -15484 -22714 -7093 -7269 21465
8015 21465 17001 17256 5647 30567 27436 9082 -3167 8426 19749 -1190 -28457 -15202 -20102
8002 -20102 -36848 -36707 -10599 -23983 -22825 -40083 -50458 3919 42168 26243 22656 798 20037
7989 20037 58079 47856 24674 8472 13154 30325 25195 27028 23589 3282 -4594 -1196 1442
7976A442m333M2266K2607k5666j3430Q067p707J4754o644j949R644J4209o556
7963D6704l0350q101j688K5030J313j4967J9588J3516p976j7798j2969j3621K2442
7950B1123n350j0848k5504K54k1M1586M2611j5450j4967P658K642j0603l533J830
7936C1428l235J4354L676Q626K5548m5625j4934j0739J2641j1912j3401L3016
7924B9443J4259N446L1608M474J3552r463j3241m5602k3379J4640J9713p973j6019
7911A7458j3338r677P271j1926R772K0282m015P398j5872K2237J8549k2406m0219
7898a4486k0550J0171K7057K760q434L4899J6014j3788j9344l669J0282q669r684
7885B559j5282P301L80j5087O314O389r092o716J6362M9120K7692k8671j7175
$$ plain form
7976 1442 -2891 39375 61982 36316 22886 30953 23246 38000 31356 29407 39051 53260 46704
7963 46704 16354 8253 6565 31595 32908 17941 37529 51045 43069 25271 12302 -1319 21123
7950 21123 15773 4925 -20579 -20325 -20346 21240 63851 48401 33434 41092 43734 33131 29598 31428
7936 31428 28193 42547 46223 54849 80397 34772 19838 9099 21740 9828 -3573 29443
7924 29443 43702 49148 80756 85230 98782 89319 76078 30476 7097 21737 41450 33477 17458
7911 17458 4120 -5557 1714 -10212 -440 19842 15827 23225 7353 29590 48139 25733 -14486
7898 -14486 -35036 -24865 2192 4952 -3482 31417 47431 33643 14299 10630 20912 12243 2559
7885 2559 -12723 -5422 -5042 -20129 -13815 -7426 -16518 -23234 -6872 42248 69940 41269 24094
7872B4094J9012K4360p262J9331j3372k1411k0755q009k600K8104J939n237k06
7859C7988K075j6472k2486j9043j454J9280J8720j6446l0042J89K2093L199J550
7846h49K0640k0308o640Q01r6j6720n775j1540K636J4758P702q28n725J4849K2611
7831A5516k0813K3745K2370r339l1495k3913J8447L1563o333q955J7951L049J5520
7818D7313j0404k8963J3219j829m705J5365K4714J2731q208q878k2420l2311K4092
7805A9716L2312J9489R250r554j6906p532K661K459j984j0488k8722r702J3567
7792A4566M1475M0562j3898k0655q613j7340rk0262l5197k1740k733o51j828Q24
7778d5499O701K4556J4403P182n458j8331k925o946m110L3458J4335O356J8817
$$ plain form
7872 24094 43106 67466 60204 79535 66163 44752 23997 15988 13388 41492 43431 38194 37988
7859 37988 40063 23591 1105 -17938 -19392 -112 18608 2162 -27880 -27691 -5598 -2399 -849
7846 -849 19791 -517 -7157 -6356 -6452 -23172 -28947 -40487 -37851 -23093 -15391 -16219 -21944 -7095 15516
7831 15516 -5297 18448 40818 31479 -16 -23929 -5482 26081 19748 10793 28744 31793 47313
7818 47313 36909 7946 21165 19336 14631 29996 54710 67441 59233 50355 27935 -4376 19716
7805 19716 52028 71517 80767 71213 54307 46775 49436 51895 49911 39423 10701 999 14566
7792 14566 56041 96603 82705 62050 53437 36097 36088 15826 -19371 -41111 -43844 -44495 -46323 -45499
7778 -45499 -38798 -14242 161 7343 1885 -16446 -19371 -26317 -30427 3031 17366 23722 42539
7765D2539O725J75K7280J874m0485l4284J9579r001L056L572j0772j2860j5273
7752a7875k8726l5215K6341J2783K4196J9981o31j6937j9666L0451R076m071l442
7739c735J5085j8047j9300M765J0344M032K976q428j2088j1391J4063J445p830
7726b8109l3180j466J7081L8001J3691M62k1126q125J6640Q931j2330N988L222
7713c20M620K331J4826J3621J0874Q577K5639k230n0101q510J7846o979m943m405
7699B0846n483k0483j6053p886L3459J4710j7676j0686J2865L6426J3973k6329
7687B7683K5273j8284k2262J874J477k11q834P180n013o011O135o667J1885J5340
7673B9565j2819n20J4382n374j8990n007P770j8357k038K1183M766K3258j287
$$ plain form
7765 42539 49264 49439 76719 78593 38108 3824 23403 14402 17458 21030 10258 -2602 -17875
7752 -17875 -46601 -81816 -55475 -42692 -18496 1485 854 -16083 -35749 -5298 3778 -293 -3735
7739 -3735 11350 -6697 -25997 -21232 -10888 -6856 -3880 -12308 -24396 -35787 -21724 -20279 -28109
7726 -28109 -61289 -62755 -45674 -7673 6018 6480 -14646 -22771 -6131 2800 -9530 -3542 -320
7713 -320 4300 6631 21457 35078 45952 54529 80168 77938 27837 19327 37173 30194 25251 20846
7699 20846 15363 -5120 -21173 -29059 4400 19110 1434 -9252 3613 40039 54012 27683
7687 27683 52956 34672 12410 14284 15761 15550 6716 13896 8883 2872 9007 2340 14225 29565
7673 29565 16746 16226 30608 25234 6244 1237 9007 -9350 -11388 9795 14561 37819 36532
7660C6532k1539O604J0057k5302j3124J7937K2394J7158j8283j2314l916j7738
7648a534J5237K1389Q969j2764k717m1007j4889J0585J7976o650l162p233J5015
7635g85K3315j4810k2595N05Q216o628J7676J1118M730L01K0111j1788K2196O691
7621E8253l7018k1819r555K2584q214K83K4969l753j0309J6784n006l2004J0200
7608E395K7822j4365l4856k104J0804n656J9450J675r801l8000k9648R627K0455
7595c9202L893j752K6627L4095P635N417j7957J2234M023p114p696k766J3094
7582C0531k1401k9945K2448K0105n143k8790J0759K9485J1140j9617r511j5740
7570e679j1058r075J6350K9852K546k6020R581J7129k89r67M551l330r848J493
$$ plain form
7660 36532 14993 21597 31654 6352 -6772 11165 33559 50717 32434 20120 16204 -1534
7648 -1534 13703 35092 44061 31297 28580 -12427 -27316 -16731 1245 -5405 -8567 -15800 -785
7635 -785 22530 7720 -14875 -14370 -6154 -12782 4894 16012 20742 21043 41154 29366 51562 58253
7621 58253 21235 -584 -10139 12445 4231 4514 29483 25730 15421 32205 27199 -4805 5395
7608 5395 33217 18852 -16004 -18108 -7304 -12960 6490 8165 -1636 -39636 -69284 -59657 -39202
7595 -39202 -35309 -37061 -10434 23661 31296 36713 18756 30990 35013 27899 20203 17437 30531
7582 30531 9130 -20815 1633 21738 16595 -12195 -1436 28049 39189 19572 10061 -5679
7570 -5679 -16737 -25812 -9462 20390 22936 -3084 6497 23626 23337 22370 26921 23591 13743 15236
7556A5236r624R734J59k1901j9130p138J6668J6539J8323M0304J4831j5740m147
7543E4114k5520k048j6822J4695K2821K519q634k627l135j4133O504l993j3479
7530A0262J0970r811k6454J6543K6150j2199j2265K3020n916m663L83l0230k7427
7517d1637L533K0099J9066K4840j7572j6731o69J0688O282M644K659J9214Q241
7504D2657j1158K0870O931k2230k5041N594m254j5915q846r088K0111P298l2811
7491b5882j1625J6752l947r365j9077L300K6806M6028n070k5671j200o619r689
7478b5259r358J1779J8540l868K7862k927j9259R479N649j0966K077R703R78K7558
7464D1988l370j9658j8986k1464q832K7306L6610K9647j473o2557k3081L0441
$$ plain form
7556 15236 5612 15346 15505 -6396 -25526 -32664 -15996 543 18866 59170 74001 58261 54114
7543 54114 28594 26546 9724 24419 47240 49759 41125 38498 35363 21230 27734 23741 10262
7530 10262 21232 11421 -15033 1510 27660 15461 3196 26216 20300 15637 16020 -14210 -41637
7517 -41637 -38104 -18005 1061 25901 8329 -8402 -9071 1617 7899 12543 15202 34416 42657
7504 42657 31499 52369 59300 37070 12029 17623 13369 -2546 -11392 -20480 -369 6929 -25882
7491 -25882 -37507 -20755 -24702 -34067 -53144 -49844 -23038 22990 17920 -7751 -8951 -15570 -25259
7478 -25259 -34617 -22838 -4298 -8166 19696 16769 -2490 6989 12638 1672 3749 13452 14430 41988
7464 41988 38618 18960 -26 -21490 -30322 -3016 33594 63241 61768 -789 -23870 6571
7452F571J5915J6689k227j7676j3735O41K283k1643j0291J336J4663j70q192J9122
7438C286K3344k4900m754n129l229P532P608L394J7706n399R537k3318j0245j6979
7424b1546j9827J1065K7286N696o530J2738K8998k6357n5114j0696L0857K4044
7412F14K8574Q953K72j7390K0160r339k4581J9951P066m7K4589j2511K5188O69
7398G2168m921k661n2222L975J5176r800j7860o786j2567K9830L3262j009M946
7385E1531k4155m2874O222K1561k0430m799j1779K8695P827l766j1067N167m502
7372b369j1747n896R878J7872O098j6365J2192J3051j216j6626j8024M527K8834
7359B0209j3354l4767r869L7365K1105J0102l83j6048k9888o023j8806j5775k0210
$$ plain form
7452 6571 22486 39175 36948 19272 5537 6178 8461 -13182 -23473 -22137 -7474 -7644 -15836 3286
7438 3286 26630 1730 -3024 -8153 -11382 -3850 3758 7152 24858 19459 28996 5678 -4567 -21546
7424 -21546 -41373 -30308 -3022 2674 -3856 8882 37880 11523 -43591 -54287 -23430 614
7412 614 29188 38141 38413 21023 41183 31844 7263 27214 34280 34233 58822 46311 71499 72168
7398 72168 67247 64586 12364 16339 31515 21715 3855 -2931 -15498 14332 47594 46585 51531
7385 51531 27376 -15498 -9276 12285 -8145 -12944 -24723 3972 11799 8033 -3034 2133 -2369
7372 -2369 -14116 -20012 -10134 7738 13836 -2529 9663 22714 21498 4872 -13152 -8625 20209
7359 20209 6855 -27912 -37781 -416 20689 30791 30408 14360 -15528 -21551 -40357 -56132 -76342
7346g6342K869P872K8672L3329Q616J4150K9659J6875l0434n0905j3987N203l005
7333b7428L302P348P757K0247K9094J0311m3429j0411K3272J2560n230r115j0724
7320G554j728k6907L59Q316J2552l1186n624L476m472J7626L402L4139J4167k6453
7306E221k7036j5636r846Q193N515K6258K9751J0334K2429Q471l9757j9739j9601
7293a5443J1329M3362J1917o402k9484k1613Q80O676J1218l4341m0873N3881K3613
7280A4720J7693j630k7833r903P810K3942L0278j5779l6367j8903P769J3291m7
7267E041J3332K1421k6496l4421j264K5639L333L5444K2745l7767j248J426N196
7254C2381j5320n3919O294J9757P644j5102L71l900J2446Q853P112k97J89j8104
$$ plain form
7346 -76342 -73473 -65601 -36929 -3600 5016 19166 48825 65700 35266 -15639 -29626 -24423 -27428
7333 -27428 -24126 -16778 -9021 11226 40320 50631 7202 -3209 20063 32623 27393 18278 7554
7320 7554 5826 -21081 -20722 -12406 146 -31040 -36664 -33188 -37660 -20034 -16632 17507 31674 5221
7306 5221 -21815 -37451 -47297 -39104 -33589 -7331 22420 32754 55183 63654 23897 4158 -15443
7293 -15443 -4114 39248 51165 44763 15279 -6334 -5454 1222 12440 -21901 -62774 -8893 14720
7280 14720 32413 30783 2950 -6953 857 24799 55077 39298 2931 -15972 -8203 5088 5041
7267 5041 18373 39794 13298 -21123 -22387 3252 6585 42029 64774 27007 25759 27185 32381
7254 32381 17061 -36858 -30564 -10807 -3163 -18265 -17894 -21794 -9348 -495 6617 6320 6509 -11595
7240a1595o547L3998L3977n283k8044j2248j2528R252Q43N089j2525p45j0270
7227a6626O428N5343O009k2288r817N146j6708K2229P859K324K200j8256l2807
7214h964J1490P218j1995j6472M370l02K1895J2936K1131J5344n898l8452k1570
7201i269Q823q590J5642J960l0999J5287K5723n784n903L976k0593j5627N32J0370
7187a4452R390K4015j1060o672r822j9511L6869K9372M969k4644l1302k2734K3023
7174a2559l864Q360J2788j3965k4443j0802l603J6547L3368r783l4004K8920L2752
7161A9712j1393o011q626J0799j1965N158K9970r759l0581K2647L7558J8274l3007
7148C2776k9135K685K1649N967l71q398J1767k8324k18K8979R94k3935k503j5794
$$ plain form
7240 -11595 -18142 15856 49833 44550 16506 4258 -8270 982 1825 6914 -5611 -6356 -16626
7227 -16626 -10198 45145 51154 28866 19049 24195 7487 29716 37575 39899 42099 23843 -8964
7214 -8964 2526 9744 -2251 -18723 -14353 -14655 7240 20176 41307 56651 50753 12301 -9269
7201 -9269 -446 -9036 6606 8566 -22433 -7146 18577 12793 6890 10866 -9727 -25354 -24822 -14452
7187 -14452 -5062 18953 7893 1221 -8601 -28112 8757 38129 43098 18454 -12848 -35582 -12559
7174 -12559 -16423 -8063 4725 -9240 -33683 -44485 -48088 -31541 1827 -7956 -41960 -13040 19712
7161 19712 8319 2308 -6318 4481 -7484 -2326 27644 17885 -12696 9951 47509 65783 32776
7148 32776 3641 6326 27975 33942 33571 25173 36940 8616 8398 37377 38371 14436 11933 -3861
7134c861J0088n649l9843J8254L4528r101j8309J8249O376N56j8624k4033j1659
7121d3028K361L7166K0209N634P498k691j5660n011j8445j325K0951q238K859
7108B280J2026r339J1313K6560j8341n500J685j4654J3245j62o699j0443k6524
7095b4553j1013K1743M5741l573q670l470k3343j716p120J9255J9146K133o076
7082A8484j2465J3906N888k0212k1594J989K5380j9895k8066J1129M088j7888
7070c9256j1718R860J1217J8671K9750k829K1533l2641k1683q118j5217k3300
7058f3731j2100M3629J6947k7320j1288L6892N0000j5657k0594r819p758j0928
7046c1727J3040K9295R875Nm782m127J7947k8058l0035j4675k9588J3885M9920
$$ plain form
7134 -3861 6227 578 -39265 -21011 13517 4416 -13893 4356 10732 11288 -7336 -31369 -43028
7121 -43028 -40667 -3501 16708 22342 29840 27149 11489 6478 -11967 -13292 7659 -579 2280
7108 2280 14306 4967 16280 42840 24499 18999 20684 6030 19275 19113 12414 1971 -24553
7095 -24553 -35566 -13823 31918 28345 19675 16205 -7138 -8854 -15974 3281 22427 24560 18484
7082 18484 6019 19925 25813 5601 -15993 -14004 11376 -8519 -36585 -25456 -21368 -39256
7070 -39256 -50974 -41114 -29897 -11226 18524 15695 37228 4587 -17096 -25214 -40431 -63731
7058 -63731 -75831 -32202 -15255 -42575 -53863 -16971 33029 17372 -3222 -13041 -20799 -31727
7046 -31727 -18687 10608 20483 20488 15706 11579 29526 1468 -28567 -43242 -72830 -58945 -9025
7033i025J6035m001j0204k007J3371R810p00j7694M700j3399L5359L3088O490
7020F1823J9018k8223k7280j9142K4458k8936p641J4467J9262j1553K5732J6840
7008E8825j9963j9217p478P405p085k5651J6815O698p329K773o673l906K0574
6995A5788k6905j7509K4509K080k701o172J872R108M151P228L477p899k1779k4297
6981c9049J104L2981J8244l1260p104j4909m66J3959p305Q784O209j6806k0284
6968e5902K2608J7427J0795L3175n20o996j9285l3456J2162J6122q886J6628l378
6955D94j1921m51K995J168l1141J3300j7675J7422L5421p223j433K2180J328k8391
6941c927m293J409J4111K4651k540P944j2853k6591p399J1068J6201J4541J4187
$$ plain form
7033 -9025 7010 3009 -7195 -9202 4169 13979 13279 -4415 285 -13114 22245 55333 61823
7020 61823 80841 52618 25338 6196 30654 1718 -5923 8544 27806 16253 41985 58825
7008 58825 38862 19645 12167 19572 12487 -13164 3651 10349 3020 5793 -880 -4786 15788
6995 15788 -11117 -28626 -4117 -2037 -4738 -10910 -9038 70 4221 11449 14926 7027 -14752 -39049
6981 -39049 -37945 -4964 13280 -17980 -25084 -39993 -40459 -26500 -33805 -25021 -18812 -35618 -55902
6968 -55902 -33294 -15867 -5072 28103 27583 20587 1302 -32154 -19992 -3870 -12756 3872 494
6955 494 -11427 -11878 -8883 -7715 -38856 -25556 -43231 -25809 9612 2389 956 23136 24464 -3927
6941 -3927 -8220 -6811 7300 31951 29411 37355 24502 -2089 -9488 1580 17781 32322 46509
6928D6509j4290n6210k6886j59M3722K2673J5082M005j2237K99K1724o323j6603
6915B1306p384o724J2161k1263Q050N214k4156k7212J4518K3068L4245j460k0313
6902A0050N351j4981j8878j8892J7625Q359j136p903J5593K4474j5108k025Q800
6889A1329j5014m9104J600J5884K3073J5500J8339K1074Q386l2983m962K6235
6877C9357n311p688k7642j2426J4860K270n563K8309K6437K1624l113r666j7236
6864D4212j6078n270m1075N531J0501R966R143P353k032j7091k0913J4507L513
6851B267J74j5278k073q426L0164j5726l1222q286K6106J7445o22k865J5066K858
6837I582r967j5664J3666m176J3555J397m363J769J9455J7021k5515j4297L2316
$$ plain form
6928 46509 32219 -23991 -50877 -51036 -7314 15359 30441 34446 22209 22508 44232 37909 21306
6915 21306 13922 7198 19359 -1904 6146 11360 -12796 -40008 -25490 -2422 31823 30363 10050
6902 10050 15401 420 -18458 -37350 -19725 -11366 -12502 -20405 -4812 19662 4554 2529 11329
6889 11329 -3685 -52789 -51189 -35305 -12232 3268 21607 42681 51067 18084 13122 39357
6877 39357 34046 26358 -1284 -13710 1150 3420 -2143 26166 52603 74227 71114 61448 44212
6864 44212 28134 22864 -18211 -12680 -2179 7787 16930 24283 22251 5160 -15753 -1246 2267
6851 2267 2441 -12837 -14910 -23336 6828 -8898 -40120 -48406 -22300 -4855 -5477 -8342 6724 9582
6837 9582 -385 -16049 -2383 -6559 6996 8393 4030 5799 25254 42275 16760 2463 34779
6824C4779K6804l2755k506m649J3531R533r004m9019j7195K6928K1496J180m2162
6811b3039p920K1408Q41j1046O45m063l216P589K1828L821j6022j3046k4913k7002
6797g4135K4431J5410K8401k267j1988J3845J6425j9312k2346L7943K679K0607
6785B9693r249j0544J5923J7878r841Q847j5205k409J317j4751j6700K8974L3326
6772E7259O759J3349n469k1599j7937j6143k8979j8214K4400J3327p824K3290
6760B2219j325o58p812J3413J4794p485r62J4580r604k3131p748L224K712j0499
6746A718P926L279K8176n538J0998J2853j6671L333j9111k1305m1092J3344L360
6733a8730K2105k0071J634J2550K506j2971O988K856Q71p685K214J7101r986q826
$$ plain form
6824 34779 61583 28828 26322 21673 35204 44737 35733 -13286 -30481 -3553 17943 19123 -23039
6811 -23039 -30959 -9551 -8710 -19756 -19111 -23174 -26390 -18801 3027 6848 -9174 -22220 -47133 -74135
6797 -74135 -49704 -34294 -5893 -8160 -20148 -6303 10122 -9190 -31536 6407 9086 29693
6785 29693 20444 9900 25823 43701 33860 42707 27502 25093 26410 11659 -5041 23933 57259
6772 57259 64018 77367 71898 50299 32362 16219 -12760 -30974 -6574 6753 -1071 22219
6760 22219 20894 20236 12424 25837 40631 33146 32184 46764 37160 14029 6281 9505 12217 1718
6746 1718 9644 12923 41099 35561 46559 59412 42741 46074 26963 5658 -35434 -22090 -18730
6733 -18730 3375 -16696 -15062 -2512 -6 -12977 -5989 -3133 -2262 -9947 -7733 9368 -618 -9444
6719i444o469o692O821N942J6555j4928j4604L2180L8649j1716j8085n935k9611
6706a7337j0525J8285j2367J0498R317O618N318j8582R558K7264l3355k838J1306
6693C160j1981k3330L7710L2521j6506j1270J6100m30k8921M69l905R724R963
6680A3304k6614K380N796L7048Q657O076P974k9589l0068l6241j9407J6199J3562
6667c0923N353L3997K1678l772k5625k5614j1223J0373J4300P472L7515Q331j7621
6654B4241Q246K360j8758J0411o357k6611N261M288k0775l0609M927J8436J0135
6641a4805J0209K7896K0330n277k6500O460m712j5997n042J691k1266p525K1772
6628a2766J3235N612J1312o371j290Q594J5602m866k2131j699m552o144l3875
$$ plain form
6719 -9444 -15913 -22605 -15784 -9842 6713 -8215 -22819 9361 48010 36294 18209 12274 -17337
6706 -17337 -27862 -9577 -21944 -11446 -2129 4489 9807 -8775 783 28047 -5308 -8146 3160
6693 3160 -8821 -32151 5559 38080 21574 10304 26404 25974 -2947 -2478 -6383 3341 13304
6680 13304 -13310 -10930 -5134 31914 40571 46647 54621 25032 -5036 -41277 -60684 -44485 -30923
6667 -30923 -25570 8427 30105 26333 708 -24906 -36129 -25756 -11456 -3984 33531 41862 24241
6654 24241 32487 34847 16089 26500 20143 -6468 -1207 3081 -17694 -48303 -43376 -24940 -14805
6641 -14805 -4596 23300 43630 38353 11853 18313 13601 -2396 -7438 -5747 -27013 -34538 -12766
6628 -12766 469 6081 17393 11022 9732 18326 33928 29062 6931 5232 680 -5464 -39339
6615c9339J6290L0876J0028j0897R257L8903k7370j9498J7595n315P634L520r108
6602B2576n46N252p236o362J7297l1707j5971Q240K736l044M308q637Q215O356
6588A477M8939M199l7032j2056p377k7657o029K3421j1398n435O633j1218K9878
6575c655K3617k0863m822Q465K7848j9643k5182J9152J0091K826j8823M645j6187
6562a2531k8709K3543J4289L4667O015l7362m1825j6744P082K725l424L5087N2038
6549C4851l630k4598P326m1985k0907L1283L8018o444l795J1651m891j0982j4871
6536h974m3810n353L3004K6779j8838o76J7255r097N269K0238K4282j4721j6843
6523H515l1886k2008j3416J2074K2229K8999K5523p683j3734k3193m7907J4309
$$ plain form
6615 -39339 -23049 7827 17855 6958 16215 55118 27748 8250 25845 20530 28164 31684 22576
6602 22576 22030 27282 20046 13684 30981 -726 -16697 -8457 -5721 -8765 -4457 -13094 -4879 1477
6588 1477 50416 54615 17583 5527 -1850 -29507 -35536 -12115 -23513 -28948 -22315 -33533 -3655
6575 -3655 19962 -901 -5723 2742 30590 10947 -14235 4917 15008 17834 -989 3656 -12531
6562 -12531 -41240 -17697 -3408 31259 37274 -88 -41913 -58657 -51575 -48850 -52274 -17187 34851
6549 34851 31221 6623 13949 -28036 -48943 -17660 20358 13914 10119 21770 16879 5897 -8974
6536 -8974 -52784 -58137 -25133 1646 -17192 -17868 -613 -9710 -4441 15797 40079 25358 8515
6523 8515 -23371 -45379 -58795 -46721 -24492 4507 30030 22347 8613 -14580 -62487 -48178
6511d8178J2864m419K9849K0032L51j7299M713j4447l1057R622M755K9319j0402
6498a4297K176M417j1576J8277Q785q207j2940n61L2020k4473n144Q017K1268
6485A7762J8323p583j091o8p477P000j6943j0091k4169q42L9929K2154j3109n805
6471A7990j774n168q313n468L439k7132K1521M9490M193l7747O51O919m969l468
6457A0164L4729M343j4993k6943j924J2262k0797j8995j1765M177j898o688J4172
6444b4156K3801K8973j6011k5482k0267P290l560K981j880n554J5036k469j2782
6431c4080j2553q411L3000K5852k6324m227R163J0629k3320j1232J4879K1735
6419d889L029j2981M104M554J8198J4771k3636k3016J7072L4167J9166L597O292
$$ plain form
6511 -48178 -35314 -39733 -9884 10148 10499 -6800 -2087 -16534 -47591 -37969 -33214 -3895 -14297
6498 -14297 -12121 -7704 -19280 -1003 7782 -425 -13365 -13926 18094 -6379 -11523 -3506 17762
6485 17762 36085 28502 27411 27343 19866 26866 9923 -168 -24337 -25179 14750 36904 23795 17990
6471 17990 16216 11048 2735 -2733 706 -26426 -4905 44585 48778 11031 11682 18601 13632 10164
6457 10164 44893 49236 34243 7300 5376 17638 -3159 -22154 -33919 -29742 -31640 -38328 -24156
6444 -24156 -355 28618 12607 -12875 -33142 -25852 -29412 -26431 -28311 -33865 -18829 -21298 -34080
6431 -34080 -46633 -55044 -22044 3808 -22516 -26743 -17580 -6951 -30271 -41503 -26624 -4889
6419 -4889 -1860 -14841 -10737 -6183 12015 26786 3150 -19866 -2794 31373 50539 54136 60428
6406F0428q323q633q246J8099k7592J4580J0128P418K2377n4816o0557k3635Q288
6393e0484L9540J9464r932j6290P199J6427J596L0894l905m0456p21J6902m479
6380E755J770j5432l809j5493L1401L3221n758Q642j6218k9244J7170j8836J3213
6367F382J6565j4462l3600l282j9821Q841J8805L1460k738J2547J9104j888k7497
6354A0416j736j5994o242J8833j6387P42K7312l489k2374k7463K251K5885K1689
6341A3443l216j7885l809K8325K6627J5715l578l5905l5939l311m352l7642J5661
6328d5866L1358p245J5688o940Q509j8931L0058K9449q354j4202K0034k3415K24
6315A0367K2342k8259L50N703j2835L159l533J9360m472L633j476J111j1182m617
$$ plain form
6406 60428 52105 43472 35226 53325 25733 40313 50441 57859 80236 25420 -35137 -58772 -50484
6393 -50484 -10944 8520 -1412 -17702 -10503 5924 7520 38414 34509 -5947 -6668 10234 5755
6380 5755 7525 -7907 -11716 -27209 4192 37413 31655 40297 24079 -5165 12005 -6831 6382
6367 6382 22947 8485 -25115 -28397 -48218 -39377 -20572 10888 8150 20697 39801 37913 10416
6354 10416 8680 -7314 -13556 5277 -11110 -10368 16944 13455 -8919 -36382 -34131 -8246 13443
6341 13443 10227 -7658 -11467 16858 43485 59200 55622 19717 -16222 -19533 -23885 -61527 -45866
6328 -45866 -14508 -21753 -6065 -13005 -4496 -23427 6631 36080 27726 13524 33558 10143 10367
6315 10367 32709 4450 4800 10503 -2332 827 -2706 16654 12182 15815 14339 15450 4268 -349
6301c49k814k0913k6554J6669K3198m019j816L723m85l6254j3815K7912J6139
6288a9378j3584J8651K8554r27j3699l6j3044k9557K562R400M2452m799k8317
6275b1722j080l196K9082K8298L132n164k3045l3077k0801P599L1905N1149M567
6262D7647j3729k0967n5172J2210M4504k762m73J577j885l0828j0241J3820m64
6249a6763J9194O471L458J1479k3130p228j2259j1853o840j9246n917L7855L5222
6236A0443p906j1370l3714N681M1572K0381N92r29q749j0064q698M377J8364J9536
6222C9516k4865k610K2462L1177J1599j4974L538l8325m1106J1292K8981R22k0714
6209F893L6734J1974q341l7261k9396j878K2455K7074J1296j2514l4315N132J5659
$$ plain form
6301 -349 -3163 -24076 -50630 -33961 -10763 -14782 -16598 -12875 -13360 -49614 -63429 -35517 -19378
6288 -19378 -32962 -14311 14243 13316 -383 -419 -13463 -43020 -40458 -31058 11394 6595 -21722
6275 -21722 -22802 -25998 3084 31382 34514 29350 6305 -26772 -47573 -39974 -8069 43080 47647
6262 47647 33918 12951 -42221 -30011 14493 11731 11258 12835 10950 -19878 -30119 -16299 -16763
6249 -16763 2431 8902 12360 23839 709 -6519 -18778 -30631 -37471 -56717 -62634 -24779 10443
6236 10443 2537 -8833 -42547 -36866 4706 25087 25679 24750 16001 5937 -2761 1616 19980 39516
6222 39516 14651 12041 34503 65680 77279 62305 65843 27518 -13588 -2296 26685 27607 6893
6209 6893 43627 55601 47260 9999 -19397 -21275 1180 28254 39550 27036 -7279 -2147 13512
6196A3512m958o589J7282l348P73j0208p27j0622l0651J5149K4409k1177k8364
6183d5519r598K8218M0705j1928j6816M537K5249M6209J1124l974n0013k2028
6171c834n365j0933J2348k1802o736q538j3601K1172J2513J9182J2214o293k570
6158b243R803n607N263k6651M607J1614N716N958L1688j4359k8501m2405k6130
6145g1247J1019J8344K731K1469J8268p130n251K874J8164j2710m163L8786K2000
6132E3154l7801k1219k2273k308J3345J7201j3747l3593O679J3693K055R147N450
6119a0217j1367K072l689J6308J7016N422J8794l3288o801m687K0188l4187O657
6106a7779J9624L5275K0185k3074j5598k5962k0600k7879j0653J0538J8611M6095
$$ plain form
6196 13512 8554 1965 19247 15899 16672 6464 5737 -4885 -35536 -20387 4022 -17155 -45519
6183 -45519 -55117 -26899 13806 1878 -14938 -10401 14848 61057 72181 68207 18194 -3834
6171 -3834 -9199 -20132 -7784 -29586 -36322 -44860 -58461 -37289 -24776 -5594 6620 327 -2243
6158 -2243 7560 1953 7216 -19435 -14828 -3214 2502 8460 40148 25789 -2712 -45117 -71247
6145 -71247 -60228 -41884 -39153 -17684 584 -6546 -11797 -8923 9241 -3469 -7632 31154 53154
6132 53154 15353 -5866 -28139 -30447 -17102 99 -13648 -47241 -40562 -26869 -24814 -15667 -10217
6119 -10217 -21584 -19512 -23201 -6893 10123 15545 34339 1051 -5750 -10437 9751 -24436 -17779
6106 -17779 1845 37120 57305 34231 18633 -7329 -27929 -55808 -66461 -55923 -37312 8783
6094H783M6722R649l4620l724k0436l343J568j1316Q108K8006l0137k3212J6106
6081g846M0279K3403J022j3530J046j1085l8602o920Q63L1661J0935j9147k9963
6068a7884j4901J5400k779r953J6236j3664J1987J8034P841m132k3715n481K81
6055b2730J9144K0939K257l2745j5728m298J2787k835J0814K3J0286j1662N247
6042h501P620K7034L697j2525k7684j0200j3292j2959j7285L8217J3007l797l417
6029b0085j4795J8545o151q315J3540j3383Q933j4093j1601l014j1650J1462K4695
6016b5912J7903N015M4842K1410n805j8257m635k137k1419k2813j2149K3012k822
6003c767j6774J0194k386K8550j8466l5977q74m14L9111J9360k1376p452J3189
$$ plain form
6094 8783 55505 65154 30534 26810 6374 3031 4599 -6717 1391 29397 -740 -23952 -7846
6081 -7846 32433 55836 56858 43328 44374 33289 -5313 -12233 -11370 20291 31226 12079 -17884
6068 -17884 -32785 -17385 -20164 -30117 -13881 -27545 -15558 2476 10317 6185 -17530 -23011 -22730
6055 -22730 -3586 17353 19610 -13135 -28863 -33161 -20374 -23209 -12395 -12372 -2086 -13748 -8501
6042 -8501 -881 26153 29850 17325 -10359 -20559 -33851 -46810 -64095 -25878 -12871 -16668 -20085
6029 -20085 -34880 -16335 -22486 -30801 -17261 -30644 -21711 -35804 -47405 -50419 -62069 -50607 -25912
6016 -25912 -8009 -2994 41848 63258 57453 39196 34561 32424 11005 -11808 -23957 -945 -3767
6003 -3767 -20541 -10347 -12733 15817 -2649 -38626 -39500 -39914 -803 18557 -2819 -10271 2918
5990B918J7146m022n080p640j8513J4927M834k0811K1531O715M279j767l5018
5977b0501R996L0881j1526k8288J7849K7382M307k0588j3761j401K1387Q06o192
5964A0351j0770R801J8273j257l1869J6469j797Q750j3045k5651J2420J2484K82
5951D441p294J3071j7993L063J4455j0043J4175J0151o928n515K1486K1338K3035
5938G7442j1681o0021k0007k1798k0160L8184K8891O709j0017q906Q09N628k1653
5925a6580l0910j3009K3001L8603J9416p868k5152p161L553o677j4229N611M109
5912b7293k3120k715J4388L1420N214M659K0524Q399j5717k1827j134J323j7681
5899b3560o959J4115J157J2557n521p505M6018l51o55J6098L2500k6672l2328
$$ plain form
5990 2918 20064 16042 10962 3322 -15191 -264 4570 -16241 5290 12005 16284 14517 -20501
5977 -20501 -10505 20376 8850 -19438 -1589 25793 30100 9512 -4249 -5650 15737 16543 10351
5964 10351 -419 9382 27655 26398 -5471 10998 9201 17951 4906 -20745 -8325 4159 4441
5951 4441 -2853 10218 -7775 -4712 9743 -300 13875 24026 17098 11583 33069 54407 77442
5938 77442 65761 5740 -14267 -36065 -56225 -18041 10850 17559 7542 -1364 -555 5073 -16580
5925 -16580 -47490 -60499 -37498 1105 20521 12653 -12499 -19660 -16107 -22784 -37013 -31402 -27293
5912 -27293 -50413 -53128 -38740 -7320 -2106 2553 23077 31476 15759 -6068 -7202 -5879 -23560
5899 -23560 -30519 -16404 -15247 -2690 -8211 -15716 30302 29951 29296 45394 77894 51222 18894
5886A8894k1319J3380K3415l2601J632j4259l3323P669N905J9149J5227k832k666
5873a729J513j1878j1922l985Q149L224K7950K438j6035j3485j377K0904K6622
5860C0389J9056j6105k0408K252p565j1270j5868k2585P029n464J375o91L4482
5847e373j899l567k530K5326k1685L896k1049j9153J2091j8886n16J6496K1780
5834a5069J2043P169k9925j1719J2023l514o894O909J6698K647l3921J256M7278
5821D981K1422r127k6090R329r094l2776r538N0478M7869J4995j3844j7614j3791
5808A7200j5094P317L704j5425k6509q068M1368J4001R720r55k0950p558J0693
5795I444j5072P190J258m157l688J0678n652N884N396j999r741k583P697J6998
$$ plain form
5886 18894 -2425 10955 34370 1769 3401 -10858 -44181 -36512 -30607 -11458 3769 937 -1729
5873 -1729 -216 -12094 -24016 -28001 -19852 -16628 11322 13760 -2275 -15760 -17137 3767 30389
5860 30389 49445 33340 12932 15184 7619 -3651 -19519 -42104 -35075 -40539 -39164 -39855 -5373
5847 -5373 -7272 -10839 -13369 11957 -9728 -5832 -26881 -46034 -33943 -52829 -53345 -36849 -15069
5834 -15069 -3026 4143 -25782 -37501 -25478 -28992 -35886 -28977 -12279 -9632 -43553 -42297 4981
5821 4981 26403 17276 -8814 515 -8579 -41355 -50893 -415 47454 62449 48605 30991 17200
5808 17200 2106 9423 13127 -2298 -28807 -36875 4493 18494 28214 27259 6309 -1249 9444
5795 9444 -5628 1562 2820 -1337 -5025 5653 1 5885 11281 9282 -459 -3042 4655 21653
5781B1653p427J6694n748K1543m462j4839L543j8635m3087k3195L2101L59l323
5768b4823j3511R21J5007K4124J7499k9499j6118Q90J6388n12J1540J5068P959
5755B4933Q488m142j1384p015p38J875m028k318J9383J0189L959m930j5659p038
5741A1575j5088P407J9920R356o737k3175j5857j1210O494L2608J7651j3325k7266
5728g647K257J7541J7841M149j1008l9884j6318j0722P975J2270J8781O248J8047
5715A9530R514k2952m1378k1049K2871j5230m64L6532M481p078j0436m245j7788
5702d7692Q10J8940k2009J1996L4481K072n466q75R534l758q290j2361R28N368
5688a6322J5768P400k3566j2276L7881J3187K7038r420l8139m64k346N883j4594
$$ plain form
5781 21653 14226 30920 25172 46715 42253 27414 30957 12322 -30765 -53960 -21859 -21500 -24823
5768 -24823 -38334 -37413 -22406 1718 19217 -10282 -26400 -25510 -9122 -9634 1906 16974 24933
5755 24933 33421 29279 17895 10880 10142 12017 7989 5671 25054 35243 39202 34272 18613 11575
5741 11575 -3513 3894 23814 33170 26433 3258 -12599 -23809 -17315 15293 32944 19619 -7647
5728 -7647 -5390 12151 29992 34141 23133 -16751 -33069 -43791 -35816 -23546 -4765 1483 19530
5715 19530 29044 6092 -35286 -56335 -33464 -48694 -49158 -12626 -8145 -15223 -25659 -29904 -47692
5702 -47692 -46882 -27942 -49951 -37955 -3474 -1402 -6868 -7743 1791 -1967 -10257 -22618 -21690 -16322
5688 -16322 -554 6846 -16720 -28996 8885 22072 49110 39690 1551 1087 -1259 4624 -9970
5675i970j7538k390M503J962n941O215L5628M804J5990J3540j3987j4855j061
5662A6900j1147p256r391L335J1710M921K67J0908P705J3250p423j2818M450J6913
5648D2324O029p539l5478l551k4039O599j0612q244j4834J8537L2858M546o414
5635A82K219J7240J4338k7664j2370K203p435j3280L754L006j387j2234K1470
5622i958J6814j1102o68k340j0234L2858K6245k3767J2389K6965M639k491j1780
5609D7570N080J864k6954o466l6703O06J3865j192J2509M4864L6714j4580m2788
5596C4389j0940Q831M168M791j8535j7378k90k4520J4922K4082p258L415K3473
5583C9150j1113r88j8258k6108k122j4198L628J9095J7857k655n946M0075j5798
$$ plain form
5675 -9970 -27508 -29898 -25395 -23433 -29374 -23159 12469 17273 33263 46803 32816 17961 16900
5662 16900 5753 -1503 -10894 -7559 4151 9072 9339 20247 27952 41202 33779 20961 25411 42324
5648 42324 48353 40814 5336 1785 -22254 -15655 -26267 -34511 -49345 -30808 2050 6596 182
5635 182 2401 19641 33979 6315 -6055 -3852 -11287 -24567 -20813 -17807 -19194 -31428 -9958
5622 -9958 6856 -4246 -4914 -7254 -17488 15370 41615 17848 30237 57202 61841 59350 47570
5609 47570 52650 54514 27560 21094 -15609 -15003 -1138 -2330 10179 55043 91757 77177 34389
5596 34389 23449 32280 36448 41239 22704 5326 5036 -19484 -4562 19520 12262 15677 39150
5583 39150 28037 27049 8791 -17317 -19439 -33637 -30009 -10914 6943 4288 -1658 38417 22619
5570B2619l364J2216n352K46j0062j6044r434J2451J7303k115k564l646J9851
5557C2105K1438q214l4734k6269j045J324j3007n237J8610j1555K5515J1577N61
5544A1069j4125P613K191j6225J9999J5523q170P671j0499j8656K693o583J1352
5531C853J783K3287j7450k9346J4556K3513m083j385P440K9989j6319n4398P420
5518a1140J5107N094K112p427L4247K5794n8949j2304l530m2791K6749K6457j3354
5505a3935j2173L532L3205K9156J3369m8248j1835j5459k6311p631K6306J5636
5493a4388n311M0769J8943k2374k7377J1219J084Q121J1339J5287j465l9211k2997
5480b6361K2421J6743K6305j39K9080K573K6769J1723k4870k6319k3830K071l48
$$ plain form
5570 22619 19255 31471 26119 26365 16303 259 -9175 3276 20579 18464 15900 12254 32105
5557 32105 53543 45329 10595 -15674 -16719 -15395 -28402 -33639 -15029 -26584 -1069 10508 11069
5544 11069 -3056 4557 6748 -9477 10522 26045 17875 25546 15047 -3609 -916 -7499 3853
5531 3853 5636 28923 11473 -17873 -3317 20196 16113 14728 22168 52157 35838 -18560 -11140
5518 -11140 3967 9061 11173 3746 37993 63787 4838 -7466 -10996 -53787 -27038 -581 -13935
5505 -13935 -26108 -22576 10629 39785 53154 4906 -6929 -22388 -48699 -56330 -30024 -14388
5493 -14388 -19699 21070 40013 17639 -9738 1481 2565 10686 22025 37312 35847 -3364 -26361
5480 -26361 -3940 12803 39108 38969 68049 70622 97391 109114 84244 57925 34095 36166 35818
5467C5818j6972k6158k38J6738J3515J5388m565l744l4262j4380N51N129k7732
5454d0912J7207K8334J2481q11K8689l4254k184J3772J6577L225j3038o31j1288
5441A7167j5829r890l450J4647j6217L3359K3212n4L012N83J0445Q715j5689l2846
5427A7165n20O298n6913l9063K3136K7403J576k6594L2158K523j1964K6963k6263
5414b4095L086P326R702o558R279K2237j9291r639k417j2940K5182J5448O909
5401B4229J0226r629k4319M177N536j3491j3996O827o524J967q255q316J1888
5388a9680r659O979j1098r258j1497j358K8583n283m051L826P640J3758J3750
5375B652j9803j347o284k6877J3008L2802J8500j5948m935k3210j2227J1826K4641
$$ plain form
5467 35818 18846 -7312 -7550 9188 22703 38091 33526 29782 -4480 -18860 -18309 -13180 -40912
5454 -40912 -23705 4629 17110 16299 44988 10734 8550 22322 38899 42124 29086 28455 17167
5441 17167 1338 -8552 -12002 2645 -13572 19787 42999 42945 45957 46540 56985 65700 50011 17165
5427 17165 16645 22943 -33970 -73033 -49897 -22494 -20918 -47512 -15354 -12831 -24795 2168 -24095
5414 -24095 -21009 -13683 -3981 -10539 -1260 20977 1686 -7953 -10370 -23310 1872 17320 24229
5401 24229 34455 24826 507 4684 10220 -3271 -17267 -10440 -16964 -14997 -23252 -31568 -19680
5388 -19680 -29339 -22360 -33458 -42716 -54213 -55571 -26988 -32271 -36322 -32496 -24856 -11098 2652
5375 2652 -17151 -18498 -24782 -51659 -38651 -5849 12651 -3297 -8232 -31442 -43669 -31843 -7202
5362g202m13K652K2590K4090k7079j3390k341J6627N238j0137k6230n437J7686
5349c346J8356n982k7920k5654J9502J3992K1421j0345k1999P697L4993N056k1729
5336D042Q684O983l842K2031j1103j9849k4089l8517l4373m241J5251L2007M8797
5323A781P135N767j4456J2267M835j7914r301K0347j3606o008l562j7648r586
5310c9949M4611J6219j5165l4099p93J7172K5294L3991L441l3599j4499o991j4315
5297a8682k806k1899j4292J6624J8858J5081j1839l4637J2073M3569K4787k1192
5285E645k0407j7092J1008K0005p462k0415q996J1360R498J2020l1851K0917J9838
5272D068j4632j7308K2917K8798R649K6962K160j7598l868l2984l0378J3753j914
$$ plain form
5362 -7202 -7615 -4963 17627 41717 14638 1248 -1093 15534 20772 10635 -15595 -21032 -3346
5349 -3346 15010 9028 -18892 -44546 -25044 -11052 10369 24 -21975 -14278 20715 25771 4042
5336 4042 12726 19709 15867 37898 26795 6946 -17143 -55660 -90033 -94274 -79023 -47016 1781
5323 1781 8916 14683 227 12494 17329 -585 -9886 10461 -3145 -9153 -12715 -30363 -39949
5310 -39949 4662 20881 5716 -28383 -29176 -12004 13290 47281 50722 17123 2624 -4367 -18682
5297 -18682 -21488 -43387 -57679 -41055 -22197 -7116 -18955 -53592 -41519 2050 26837 5645
5285 5645 -14762 -31854 -20846 -841 -8303 -28718 -37714 -26354 -16856 -4836 -36687 -15770 4068
5272 4068 -10564 -27872 -4955 23843 33492 60454 62614 45016 41148 8164 -22214 -8461 -10375
5259a0375J1290j1644l240r931M1499r075p476k3114J6365J7437j8777L4424O119
5246C3502k5196n255m420K757M144j901J3122J4201n892n837M546O610j3565J1705
5232B8521j1741k0373k2651K893J4330p764J0060j0705j2675n207J9682j4469
5220c0099r873j47k089Q104k015j2536J5909N668J6164N1890Q519j8766q829L958
5206B5858Q52j1554O447j2490J5008k236k0529M635j3569m3503j4180k969K1871
5193d6359L7858K2615O599k1927J5455K4109k0200j3994q524j956J634J1093M9585
5180E5988N54l6124l1921J1048K363J718M929p797J9539O463j4946j3082L096
5167A828n468j7597k5547K5230Q508j0708j215Q067J403J0821L916p518O873j1932
$$ plain form
5259 -10375 915 -10729 -13969 -23900 17599 8524 1048 -22066 -5701 11736 -7041 27383 33502
5246 33502 8306 3051 -1369 1388 5532 3631 16753 30954 25062 19225 23771 30381 16816 28521
5232 28521 16780 -3593 -26244 -23351 -9021 -16785 -6725 -17430 -30105 -35312 -15630 -30099
5220 -30099 -39972 -40119 -42208 -34104 -36119 -48655 -32746 -27078 -10914 40976 49495 30729 21900 25858
5206 25858 26710 15156 21603 9113 24121 21885 1356 5991 -7578 -51081 -65261 -68230 -46359
5193 -46359 -8501 14114 20713 -1214 14241 38350 18150 4156 -4368 -6324 -4690 6403 55988
5180 55988 56542 20418 -11503 -455 1908 3626 8555 758 20297 26760 11814 -1268 1828
5167 1828 -3640 -21237 -46784 -21554 -13046 -23754 -24969 -16902 -15499 -4678 -762 -8280 -1407 -13339
5153a3339k6559K211K7571Q490k1244p251J1879k74n716J4112M563L4210j0071
5140A8582l1722R265K7151J1252j0940N376O537J6804n594l2230k0942J703J5581
5127A0823L35m2428l150J1455K3939J2681o91j2193Q338q716k7002p22J4079J0498
5113b754q951P017O691j0771J3885O988l0435l4202j4852J1850L729L3098J9362
5100F55J8073m69k4849q478J8451K8983K446k1282k2637J355k6250j7542J1523
5087d0021k0073J7764M5973J1506j1507M4785L3269k3989l8490l801K01M246N294
5074B5157k948k7853k0476k386R642K4480M985J7330j1469j0251J8796L8913m072
5061E9848l1308k3001R262k605r561q651J6638K3183k1573J6684l9272q269L0092
$$ plain form
5153 -13339 -39898 -37687 -10116 -1626 -22870 -30121 -18242 -18516 -24232 -10120 -5557 28653 18582
5140 18582 -13140 -3875 23276 34528 23588 28964 35501 52305 46711 14481 -6461 -4758 10823
5127 10823 11158 -31270 -34420 -22965 974 13655 12964 771 9109 393 -26609 -27331 -13252 -2754
5113 -2754 -11705 -4688 2003 -8768 5117 12105 -18330 -52532 -67384 -55534 -51805 -18707 655
5100 655 18728 18259 -6590 -15068 3383 32366 34812 13530 -9107 -7752 -34002 -51544 -40021
5087 -40021 -60094 -42330 3643 15149 3642 48427 81696 57707 19217 15416 15617 19863 25157
5074 25157 22209 -5644 -26120 -28506 -18864 5616 10601 27931 16462 6211 25007 63920 59848
5061 59848 28540 5539 14801 12196 2635 -6016 10622 33805 12232 28916 -10356 -18625 11467
5048A1467p776j0920Q302J5881M852M908j5991l0658k1064R191K8232L9576N09
5035C6509k9882j8875K1211j0133k2305J2664K6505m207M071J877k4786k9613
5023c6964j1937k0060J7157K4634O71L891L100J4674K0667O444L740r29J6145
5010D1233k4961l6870j0655m533J5243q100q572j517k7382J3558L2719J3768k4658
4997c0727k2577N993K0199J5281J4482k0447k5564J0352K6422l471K4247j8494
4985d304k8302K8648J2372Q761j338o731p45J789R678K330p129M843l3113m335
4971a7576K0981q740n306k3218l2778J4689L8066K6311J3846j184J13r763o463
4958H978j4764l7314O185m719J1718J0577L4644J9776k229J5561K2929P93p183
$$ plain form
5048 11467 3691 -7229 1073 16954 21806 26714 10723 -19935 -40999 -31808 -3576 36000 36509
5035 36509 6627 -12248 8963 -1170 -23475 -10811 15694 11487 15558 17435 -7351 -36964
5023 -36964 -48901 -68961 -51804 -27170 -26499 -22608 -19508 -4834 15833 22277 26017 25088 41233
5010 41233 16272 -20598 -31253 -35786 -20543 -28643 -37215 -38732 -66114 -52556 -19837 -6069 -30727
4997 -30727 -53304 -47311 -27112 -11831 2651 -17796 -43360 -33008 -6586 -10057 14190 -4304
4985 -4304 -32606 -3958 8414 17175 15837 9106 8361 10150 19828 22158 15029 19872 -13241 -17576
4971 -17576 3405 -5335 -10641 -33859 -66637 -51948 -13882 12429 26275 25091 25204 15441 8978
4958 8978 -5786 -43100 -36915 -41634 -29916 -19339 15305 35081 32852 48413 71342 72135 64952
4945F4952r080l5099m1716J440L6433l687k886J3273J1378J3245k4162j9511o555
4932a975p011J6726J958J4679K9418P098l9941k2754J7692L7166M945N566J9092
4919H2659R75l7064k1452j3772o38j1416l961J924j1278J0653j0720l6303K2397
4906b7996K5829K9274J2327J5425k1184l0868j2379k4549k371K1642O900M301
4894c649R898O536l620o927N865j7854l6404Q073K1917K888Q38k025K2849J2786
4880B1171r254k2981j6648Q711k1476j2080L6131Q888k6344k728Q841K1371R950
4867C552j2791k2226j159j7450J8572M0728j0017J5011k974k6534O428J019n613
4854a3454Q983J4293J507j7778j3444p807K1147K8774j4152L2964Q653l0261j0846
$$ plain form
4945 64952 55872 20773 -20943 -19503 16930 13243 10357 23630 35008 48253 24091 4580 -1975
4932 -1975 -8986 7740 9698 24377 53795 60893 20952 -1802 15890 53056 58001 63567 82659
4919 82659 83634 46570 25118 11346 10708 -708 -4669 -2745 -14023 -3370 -14090 -50393 -27996
4906 -27996 -2167 27107 39434 54859 33675 2807 -9572 -34121 -36492 -14850 -7950 -3649
4894 -3649 6249 12785 9165 2238 8103 -9751 -46155 -38082 -16165 -13277 -12439 -14464 8385 21171
4880 21171 11917 -11064 -27712 -19001 -40477 -52557 -16426 -7538 -33882 -36610 -27769 -6398 3552
4867 3552 -9239 -31465 -32624 -50074 -31502 9226 -791 14220 11246 -15288 -8860 -7841 -13454
4854 -13454 -4471 9822 11329 -6449 -19893 -27700 -6553 22221 8069 41033 49686 19425 8579
4841H579l5414k2945J7062R446K8744J0493j7143n0824j1030J0631L692K6746
4829b1963L265l584l5866R68K5093J5155J4431j8596K115L9940L4178j1322r190
4816C4624l9880j774K5275R888l9328k9293K3376K5088j5083m656J2865L483J2239
4803A6824L393l224q439q066k4941J226L2381j886r521n791j6207j83N16o618
4789c0536j3440N189K4600O247j7080J9176l803j2636Q079K965k402j1871k0864
4776d6376j3479P364N3541Q001k950M984j5281k8258j9402K6137J2246m964k2521
4763d0958L1028J8350j8365j4875N076P789J850m0286O974J0679K0551J1636J768
4750A217j9642j4758j2122K104Q430K2820M3467j871j1547j9002j6126p438J8603
$$ plain form
4841 8579 -26835 -49780 -32718 -23272 5472 15965 -1178 -52002 -63032 -52401 -48709 -21963
4829 -21963 -18698 -22282 -58148 -57180 -32087 -16932 -2501 -21097 -18982 20958 55136 43814 34624
4816 34624 -5256 -7030 18245 28133 -11195 -40488 -17112 7976 -7107 -11763 1102 4585 16824
4803 16824 20217 16993 8554 488 -24453 -23227 9154 7268 -2253 -8044 -24251 -24434 -23918 -30536
4789 -30536 -43976 -38787 -14187 -7940 -25020 -5844 -9647 -22283 -14204 -11239 -13641 -25512 -46376
4776 -46376 -59855 -52491 1050 9051 6101 11085 -4196 -32454 -51856 -25719 -13473 -18437 -40958
4763 -40958 -9930 8420 -9945 -24820 -19744 -11955 -10105 -50391 -43417 -32738 -12187 -551 1217
4750 1217 -18425 -33183 -45305 -43201 -34771 -11951 31516 29645 18098 -904 -17030 -24468 -5865
4737e865k0805j4555L1582O732j3415M706J6476m556l4435J1891k600j1073j5738
4724e1655k35M415L2605J5167p008R586K0301l29k3467k2261J4152J0046j1320
4711a0003j0267m9354K7384J5632k0488J8365P982l640j8121j2910j5326M486
4699f6260J7256J2289N013J9510L1879j1883j9205k5399J155O912M860L5202K2393
4686C3722R889J5785r401J2174k7914m3811j3998J1292J601l444j0465K7378N819
4673H627K1458K499n4272k2175J7808J8002K0972K3634J8433K140j9618j1403
4661B6105j6068j2587P241K4508m772l9547k1975L1637L9224N885p008k9415j6094
4648a2866o412j1913K9069p73l165Q791o894j9097k3857K5978K7617j2397K8119
$$ plain form
4737 -5865 -26670 -41225 -9643 -2911 -16326 -11620 4856 300 -34135 -22244 -24844 -35917 -51655
4724 -51655 -51890 -47475 -14870 297 -6711 2875 23176 22847 -620 -22881 -8729 1317 -10003
4711 -10003 -20270 -69624 -42240 -26608 -47096 -28731 -20749 -24389 -42510 -55420 -70746 -66260
4699 -66260 -49004 -36715 -31702 -12192 19687 7804 -11401 -36800 -35645 -28733 -23873 11329 33722
4686 33722 43611 59396 49995 62169 34255 -9556 -23554 -12262 -10661 -14105 -24570 2808 8627
4673 8627 30085 32584 -21688 -43863 -26055 -8053 12919 36553 54986 57126 37508 26105
4661 26105 10037 -2550 4691 29199 24427 -15120 -37095 -5458 33766 39651 32643 3228 -12866
4648 -12866 -19278 -31191 -2122 -2895 -6060 2731 -4163 -23260 -47117 -21139 6478 -5919 22200
4635B2200K8739j6839l6669o952K1474l048j6641j5689j7713R644K4554Q693j860
4622a07K200j0490p823k4095N42j8620L733l697M69K0002j1337J616N904J1923
4608b9780J1659p312J8309N442o190j9753R981K7428M775L1085K1686l6358k2922
4595H050k679k5498j8675J1632L7304J357K8621J0606m759j6723o538m763l2042
4582a4107k7069K3321J5523J8872J3868l5660l6372K3075O744j053J8884k4835
4570a8809k6499J6220L2026R782j0018K622l1658m329N521P270K0324J5108n290
4557A2270j0462Q315j7554j8592J4964j9077k4047J982J3680K3893K638K2615
4545A0625M7591J3859k0317o002k3155k3919k9101r402k1079O280R764j395L5193
$$ plain form
4635 22200 50939 34100 -2569 -9521 11953 8905 -7736 -23425 -41138 -31494 -6940 1753 -107
4622 -107 2093 -8397 -16220 -40315 -39773 -58393 -54660 -58357 -57888 -37886 -49223 -47607 -41703 -29780
4608 -29780 -18121 -25433 -7124 -1682 -7872 -27625 -17644 9784 14559 45644 67330 30972 8050
4595 8050 5371 -20127 -38802 -27170 10134 11491 40112 50718 45959 29236 22698 17935 -14107
4582 -14107 -41176 -17855 -2332 16540 30408 -5252 -41624 -18549 -11805 -12858 6026 -18809
4570 -18809 -45308 -29088 2938 12720 2702 5324 -26334 -30663 -25142 -17872 2452 17560 12270
4557 12270 1808 10123 -7431 -26023 -11059 -30136 -54183 -52201 -38521 -14628 -11990 10625
4545 10625 58216 72075 51758 45756 22601 -1318 -30419 -39821 -60900 -54620 -44856 -46251 -11058
4532a1058J5849K2157p2l0512j1578j1691j2842l952J5509K1658M348k2377n620
4519c0181n130O652M920J4858j3421K112k2440J1319L1382j1142j7270k00N536
4506b3005N1788J5903l4654m0944J2371l514j4650J0519m262j6846j92J5792K5519
4493f175L3928K3232J7177j218p117k0451k780k630k528k4311N159N557J7836
4480C5679l9856k3921J7432K3609K3763J5478j5803j0673k9315k2902l5969L154
4468e9324L6986K2580k4871j5939j0732N059R601J7332J2531K9996J1930k4878
4456A0271j4111l0122N28K1791K2523J0274L1809m29j1086k2302r906P894J7474
4443C4608J1630l1465Q658J0694k4355l3123j7803k5814q752N828L977K6873L8517
$$ plain form
4532 -11058 4791 26948 26876 -3636 -15214 -26905 -39747 -43699 -28190 -6532 -2184 -24561 -30181
4519 -30181 -35311 -28659 -23739 -8881 -22302 -20190 -42630 -31311 71 -11071 -28341 -28541 -23005
4506 -23005 28783 44686 10032 -30912 -18541 -22055 -36705 -26186 -30448 -47294 -47486 -31694 -6175
4493 -6175 27753 50985 68162 66944 59827 39376 36596 33966 31438 7127 12286 17843 35679
4480 35679 -4177 -28098 -10666 12943 36706 52184 36381 25708 -3607 -26509 -62478 -59324
4468 -59324 -22338 242 -24629 -40568 -51300 -46241 -36640 -19308 -6777 23219 35149 10271
4456 10271 -3840 -33962 -33434 -11643 10880 21154 52963 52534 41448 19146 9240 17134 34608
4443 34608 46238 14773 23431 34125 9770 -23353 -41156 -66970 -75722 -69894 -65917 -39044 -527
4430e27K2763J6964Q258j6754q307o588j4674k2764j3665r965K3501J7652R82
4417c124K9339j3259p503l0340m277O794K3279J3967n112j6642j4606J3925J8809
4404A1250J6726j3954m2297L2182J5547Q440k9703k2290L956j2327j1406q308
4392e2184J5036J4963R419o28K0035L104J1402J2314r19l4924P902r304j9200
4379b2984O866K4726K991k9816k9393J682L7986K7041r048k3374j8851K195n491
4366c5470M041Q138K0587o953j7601N27m857l221j7092R822p078K0948K609P255
4352a8345M069q997O750j1934j1211m448K8975m234j3154K168K7488n691P561
4339a003j0809l1350L717m097K1678L1060L656j2774L690n670L008N299k270L0182
$$ plain form
4430 -527 22236 39200 47458 30704 22397 15809 1135 -21629 -35294 -45259 -21758 -4106 -3124
4417 -3124 26215 12956 5453 -24887 -29164 -22370 909 14876 9764 -6878 -21484 -7559 11250
4404 11250 27976 14022 -28275 3907 19454 27894 -1809 -24099 -20143 -32470 -43876 -52184
4392 -52184 -37148 -22185 -12766 -13394 6641 9745 21147 33461 32542 -2382 5520 -3784 -22984
4379 -22984 -16118 8608 11599 -18217 -47610 -45928 -7942 19099 10051 -13323 -32174 -29979 -35470
4366 -35470 -31429 -23291 -2704 -9657 -27258 -26731 -31588 -34809 -51901 -42079 -49157 -28209 -25600 -18345
4352 -18345 -14276 -23273 -16523 -28457 -39668 -44116 -15141 -19375 -32529 -30361 -2873 -8564 -1003
4339 -1003 -11812 -43162 -39445 -43542 -21864 9196 12852 78 3768 -1902 1106 6405 4135 34317
4325C4317R449N625j9122j2777l4480j0753P380q488n140J4820R710k7734j7259
4312e4452K0804J6956m01J7606n931k4229j3368J5476j0541j662J2068K7971J1987
4299A2284M447K4676j0807L643p815k35k4079q337P774q031J8253k0893l422K3770
4285A1228K48R859p647k737J1385k341K023j2795k249j4920l1455j9910J9311
4272d0000K2358L6191K1619N27j586m7952k8946J7390K2756p038j4420M399j4966
4259b9668R501j7680l1135Q553K152J5967j2827M609j1N091J0192J8510J4962
4246a784L0182m2925k1428K019L1391K6937J5958J844k6735o682m283J4168j1267
4233G395p67j4999j613j9142k159M6428K2594l0706j8960l620K2970L4224Q446
$$ plain form
4325 34317 43766 49391 30269 17492 -16988 -27741 -20361 -28849 -33989 -19169 -9459 -37193 -54452
4312 -54452 -33648 -16692 -17093 513 -5418 -29647 -43015 -27539 -38080 -39742 -27674 297 12284
4299 12284 16731 41407 30600 34243 26428 26193 2114 -6223 1551 -6480 11773 -9120 -12542 11228
4285 11228 11476 21335 13688 10951 22336 19995 22018 9223 6974 -7946 -39401 -59311 -40000
4272 -40000 -17642 18549 40168 40695 39109 -8843 -37789 -20399 2357 -4681 -19101 -14702 -29668
4259 -29668 -20167 -37847 -68982 -60429 -58277 -42310 -55137 -50528 -50539 -45448 -35256 -16746 -1784
4246 -1784 28398 -14527 -35955 -33936 -2545 24392 40350 42194 15459 8777 4494 18662 7395
4233 7395 6628 -8371 -9984 -29126 -31285 15143 37737 7031 -11929 -15549 7421 41645 50091
4220E0091j6601k8900J9012L1757p117l0868j8756J904Q344j3900j2729K1754
4208C991J3033j1611l627j6292J2556J7770K355j1048O251l4538j8564j625L0706
4195a0643K8587l203j3768j1538j2930j9552P1K8382L1306j151j3294J2499L3848
4182D8614k6585j8035j8371K1596J5592k2423n863J5056R272q891P298K9880k5256
4169B1884j1722o064p079j5081k7075K9332J7459q929j603J2020J1348k7036l6573
4156d9119m178J4481L7954J2903M671j0612k5229O47J2271n095j8929K692l0493
4143e8036K31J5581J5647J816j6529K6326K9430k4656M524J1241j0446l4564J072
4130c8363q62K0623J7489n150K639M556J4973K5964l4136j3039L8994j0190j1478
$$ plain form
4220 50091 33490 4590 23602 55359 48242 17374 -1382 522 8866 -5034 -17763 3991
4208 3991 17024 5413 1786 -14506 -1950 15820 18175 7127 13378 -21160 -39724 -41349 -10643
4195 -10643 17944 14741 973 -10565 -23495 -43047 -42976 -14594 16712 15561 2267 14766 48614
4182 48614 22029 3994 -14377 7219 22811 388 -5475 9581 18853 9962 17260 47140 21884
4169 21884 10162 4098 -2981 -18062 -45137 -15805 1654 -7275 -8878 3142 14490 -12546 -49119
4156 -49119 -53297 -38816 -862 12041 16712 6100 -19129 -18482 -6211 -11306 -30235 -27543 -58036
4143 -58036 -57805 -42224 -26577 -24761 -41290 -14964 14466 -10190 -5666 5575 -4871 -39435 -38363
4130 -38363 -39225 -18602 -1113 -6263 -3624 932 15905 41869 7733 -5306 33688 23498 12020
4117A2020k1463P411J9995J4323l986p386l5054j9113p921J1208K6403j508M592
4104d79J5876j5198l3724p741Q758N0066K3316n909k5538j4099K364J3172R060
4091A9924N207M762K199J1315k0539l9043k5854j0748q140J2252J8512M3479K5137
4078C8463k5060o038N631J9658j8501J4840r626j3381o830L151k9003o45J6798
4065a0543K4166K456l580J5350K1595M216j238l0940L740r786k203J0588J8359
4052D2180J8783L834J1568r088j7433j1799j0527J1478o711L256l6938l7005k5490
4039f3892K2077R960j222Q370l74R295P854j5325J5592q361j8190n834p588n951
4025e3589J8716L4894J2092M093L6760L270k951k2162R190n222j4090m6925j292
$$ plain form
4117 12020 -9443 -2032 17963 32286 28300 20914 -14140 -33253 -41174 -29966 -3563 -5071 -479
4104 -479 15397 199 -33525 -41266 -32508 17558 40874 34965 9427 -4672 -2308 10864 19924
4091 19924 25131 29893 32092 43407 22868 -16175 -42029 -52777 -60917 -48665 -30153 13326 38463
4078 38463 13403 7365 12996 32654 14153 28993 19367 5986 -844 2307 -26696 -27341 -10543
4065 -10543 13623 16079 12499 27849 49444 53660 52422 21482 25222 15436 13233 23821 42180
4052 42180 60963 64797 76365 67277 49844 38045 27518 38996 32285 35541 -1397 -38402 -63892
4039 -63892 -41815 -31855 -33077 -24707 -25081 -15786 -7932 -23257 -7665 -16026 -34216 -40050 -47638 -53589
4025 -53589 -34873 21 12113 16206 52966 56236 53285 31123 40313 35091 21001 -25924 -27216
4012b7216J0040J5125J5216j3520J3066q37j621L40J5708k1797l0977J8499o577
3999a4551m45L2790J2616m475k0390n745j0393Q391J3620j3011P021q804R177
3986E801Q058j3470k5043K621l503m328J9367j3285r68K335o099O286R969J9348
3972G089J0597k7821k2132m34j959j1489l5971j0484J2625Q584J0889j425L5361
3959b6570K3738j9645j7372m461M816J3590m31J9753J8411K2091j2067J550J6675
3946D0078l664n4098k0072J0940N022K5006L459M500j2010k1713k5258P088J3130
3933b7592r570O913L8226j5157k0630k2002K5681L1651J9504p819j0924P459l434
3920A2306K5585J2961k5151j4224l4797k7142j1136O071l799K223J8974J5486
$$ plain form
4012 -27216 -17176 -2051 13165 -355 12711 11874 10253 10593 26301 4504 -26473 -7974 -14551
3999 -14551 -14996 17794 30410 25935 5545 -200 -10593 -2202 11418 -1593 5428 -3376 5801
3986 5801 13859 389 -24654 -22033 -25536 -29864 -10497 -23782 -24750 -22415 -28514 -22228 -12259 7089
3972 7089 17686 -10135 -32267 -32701 -34660 -46149 -82120 -92604 -79979 -71395 -60506 -61931 -26570
3959 -26570 -2832 -22477 -39849 -44310 -39494 -25904 -26335 -6582 11829 33920 21853 23403 40078
3946 40078 36414 -17684 -37756 -26816 -21794 3212 6671 11171 -839 -22552 -47810 -40722 -27592
3933 -27592 -37162 -30249 7977 -7180 -27810 -49812 -24131 7520 27024 19205 8281 15740 12306
3920 12306 37891 50852 25701 11477 -23320 -50462 -61598 -55527 -59326 -57103 -38129 -22643
3908b2643L2443L553r951p473J6025M152k9515L63j994k3873J526L2526l234k3080
3894c1175K167K0436j1023J9501K4606j5585j9530J5299k369K412n452k380J0878
3881G785M5146Q483j3849p721j7425J9502K0486r016l5823J061o016j9787R461
3868B287J6084K8623L475K912m9142m6041P634J3966J9896K3068J1178J7867j0381
3855D1426m4490l1007J084N100K3664J3509k1030K681r682p712L0258M2157l5529
3842A0429j5095N123R620j0480j8982P839j2290j8243L5522J6699k9943m906K7714
3829C007J0676r611P238k3133J951O474J049M141L96p692j585k2291p486L2901
3815c965N9515K6743k2251l6231j1816j8481K1617J0125O978J6132m365K039m6908
$$ plain form
3908 -22643 9800 13353 3402 -4071 11954 16106 -13409 -13046 -15040 -38913 -37387 -4861 -8095 -31175
3894 -31175 -29008 -8572 -19595 -94 24512 8927 -10603 4696 2327 4739 -713 -3093 7785
3881 7785 52931 61414 47565 39844 22419 41921 62407 53391 17568 18629 12613 -7174 2287
3868 2287 18371 46994 50469 53381 4239 -41802 -34168 -20202 -306 22762 33940 51807 41426
3855 41426 -3064 -34071 -32987 -27887 -4223 9286 -11744 -9063 -18745 -26457 3801 45958 10429
3842 10429 -4666 457 10077 -403 -19385 -11546 -23836 -42079 -6557 10142 -19801 -24707 3007
3829 3007 13683 4072 11310 -11823 -9872 -3398 -2349 1792 2188 -5504 -7089 -29380 -36866 -3965
3815 -3965 55550 82293 60042 23811 11995 -6486 15131 25256 32234 48366 44001 46040 -868
3802h68m9527k6212J007K7890N4242R984q147k2083P158O659j0328r385o897L085
3788b3422J6474L4745p206k1918K5208L1546j1301k7783n455J0502q413j0347
3776B630l1107j0488o833J535J0596o677K1794K8712o570k5489N835M239l072
3763a4895p935k8816J5865L3988k3516m790J5796L7097M8008j8425k6116l999
3751B2262k1529N268k645L2045k4650k2538J3037K6742j2663l9147o55K6526J6652
3738A8705o522k5612j4623Q280K6120K4931j9261j5287P353k342J3795k386P36
3725A3887n380j7999J2559J7269j5401k0352k0931M643Q136J8143M751k726M643
3712A242J670R939J6945k4544l0271P740J9216J1586j5060j6241K6255L4785l4540
$$ plain form
3802 -868 -50395 -76607 -75600 -47710 6532 16516 8369 -13714 -6556 103 -10225 -19610 -26507 -23422
3788 -23422 -6948 27797 20591 -1327 23881 55427 44126 16343 10888 21390 12977 2630
3776 2630 -28477 -38965 -45798 -44263 -33667 -40344 -18550 10162 3592 -21897 -16062 -11823 -14895
3763 -14895 -22830 -51646 -35781 -1793 -25309 -30099 -14303 22794 70802 52377 26261 22262
3751 22262 733 6001 3356 35401 10751 -11787 1250 27992 15329 -23818 -24473 2053 18705
3738 18705 12183 -13429 -28052 -19772 6348 31279 12018 -3269 4084 1742 15537 13151 13887
3725 13887 8507 -9492 3067 20336 4935 -15417 -36348 -31705 -23569 -5426 -675 -3401 1242
3712 1242 2912 12851 29796 5252 -25019 -17279 1937 13523 -1537 -17778 8477 43262 8722
3699H722l8688Q38P663k0244J7684M6222K0325k6757k8691J332j0029j2143j1509
3686d5275n391J8072L8856K1987L1691l703j516j1944k6337k6436j9287j2438
3674d1721j751m686M582J1467K7601M6860J8839J4373k8944k0992k1507n714L766
3661B173P106J2570K675j5939l2760K456Q577J1669K4586L705j5046q54J3768
3648B4686o493j2999J901j6069P092K1385o121j9947j1103m226J3938K0359j3188
3635g85M776q700j2771n251m698k227K5567K0784J0522j1356k2545k1337K9199
3622A178J5145k4734j5223n724Q862M6173J1026k2809R272o439l211o183J7980
3609B5313M04J3885K071l0935j9750j7356R019K4170l1899k6803M0602K2351j0371
$$ plain form
3699 8722 -29966 -29128 -21465 -41709 -24025 22197 42522 15765 -12926 -11594 -21623 -33766 -45275
3686 -45275 -50666 -32594 6262 28249 59940 56237 54721 42777 16440 -9996 -29283 -41721
3674 -41721 -43472 -48158 -43576 -32109 -4508 42352 61191 75564 46620 25628 4121 -1593 2173
3661 2173 9279 21849 24524 8585 -24175 -21719 -13142 -1473 23113 26818 11772 10918 24686
3648 24686 18193 5194 7095 -8974 -1882 19503 13382 -6565 -17668 -21894 -7956 12403 -785
3635 -785 3991 -4709 -17480 -22731 -27429 -29656 -4089 16695 27217 15861 -6684 -28021 1178
3622 1178 16323 -8411 -23634 -29358 -20496 25677 36703 13894 23166 16727 13516 7333 25313
3609 25313 25717 39602 41673 10738 -9012 -26368 -17349 6821 -25078 -51881 -11279 11072 701
3596G01j4602L5362J6580J0460l2639j6302L8528Q783j48R10k7547k3862N022
3583A246N542M318J3282o192k4637N333K0914n776j3427J0569p211j2140m988
3570a3167J7976L4156J5473k1791n0975j5094L5906m067r172J693R445O359j154
3557E588K973J1731m268j4427J0377k263j4618l82k4687J7991q637L062J4383
3544c177r902j1082p001j197k500o613j9092K1014N1194K8538k2949k8510P934
3531c343N66P406k3017J4065m046J2727j6323l0457K207J9690p833j8741k356
3518d9455K5798N2173j0039j4981J756j4319l6462p540k178j2136P336P331J00
3505e2616J2967L304M1798O986O632k0065k974k0088J3942K3641k3580P007J2226
$$ plain form
3596 701 -13901 21461 38041 48501 15862 -440 38088 46871 46723 47633 20086 -3776 1246
3583 1246 6788 11106 24388 18196 -6441 -1108 19806 14030 603 11172 3961 -8179 -13167
3570 -13167 4809 38965 54438 32647 -18328 -33422 2484 -1583 -10755 -9062 383 6742 5588
3557 5588 8561 20292 16024 1597 11974 9711 -4907 -5289 -29976 -11985 -20622 -17560 -3177
3544 -3177 -13079 -24161 -31162 -32359 -34859 -41472 -60564 -39550 11644 40182 17233 -11277 -3343
3531 -3343 -2777 4629 -18388 -4323 -8369 4358 -11965 -42422 -40215 -20525 -28358 -47099 -49455
3518 -49455 -23657 28516 18477 3496 5252 -9067 -45529 -53069 -55247 -67383 -60047 -52716 -52616
3505 -52616 -39649 -36345 5453 12439 19071 -994 -3968 -24056 -10114 13527 -10053 -3046 9180
3492I180q685o515K3834J6274J5048j6194q013k4981j3673J3766r30j652k0034
3479b2575j3150k09J7446K7558K0819p946m333k1932k3368n254K7066K1381M0916
3466E6419j75l2381k5136j4947j1546J3345J2414p446N05r593j9504M311K0603
3453a3131K6098K1005J094l1145l2169K0307J7522m4128l6316K2347L4825j1943
3441b5634K2878R080k6656L019O818j4924q706J4945P292l4997p128L3879J6767
3428c367j301J8499K337k4198l0904J4493J9478n531k3184J3868M1636r912j4775
3415b861l284K185j2433r459J9203Q083P249j5879j9405Q892j5176q447j813k6015
3401f9160K9139K3395j8448K2903N166N458j1070j5648n852r777K5372J2434J4237
$$ plain form
3492 9180 495 -6020 17814 34088 49136 32942 24929 -52 -13725 41 -889 -2541 -22575
3479 -22575 -35725 -35934 -18488 9070 29889 21943 17610 -4322 -27690 -32944 -5878 15503 56419
3466 56419 56244 23863 -1273 -16220 -27766 -14421 -2007 -9453 -8948 -18541 -38045 -33734 -13131
3453 -13131 12967 33972 35066 3921 -28248 -7941 9581 -34547 -70863 -48516 -13691 -25634
3441 -25634 -2756 6324 -20332 -17313 -10495 -25419 -34125 -19180 -11888 -46885 -54013 -20134 -3367
3428 -3367 -4668 13831 16168 -8030 -38934 -24441 -4963 -10494 -33678 -19810 21826 11914 -2861
3415 -2861 -6145 -3960 -16393 -25852 -6649 1434 8683 -7196 -26601 -17709 -32885 -41332 -43145 -69160
3401 -69160 -40021 -16626 -35074 -12171 -7005 -1547 -12617 -28265 -34117 -43894 -18522 -6088 8149
3388H149j017O852k102n548O497J2305n158k5169j6710k7042j1938O944J6572
3375c7365P131j5550l1J3716J1051R044k835J3504N7977L0790k4373l8399m2654
3362a7994J393R052K5942l809k8379K978J795k1774k983K8560K3739J562p640
3349A2442K3476j4961M501O350j7361l6796q796K3897m162j639J5339q6o026j2132
3335a5954p802K8788N321K9963K9562P799N067k0318k2641M246q078k3845R942
3322B2050K4823k4364r194k3433L0569j0028l7983p029J942K6603N0322r237j9995
3309A5046j7875l1046m7146n499J8277L0597J4011N812j866J6276m441J2992J8232
3296B3370p20Q995j9840o325n161q517q301J0928J1053K1504M43k407l1949p361
$$ plain form
3388 8149 7132 13984 11882 6334 12831 25136 19978 -5191 -21901 -48943 -60881 -53937 -37365
3375 -37365 -30234 -45784 -45815 -32099 -21048 -12004 -14839 -1335 56642 87432 63059 24660 -17994
3362 -17994 -16601 -7549 18393 14584 -13795 -10817 -9022 -30796 -33779 -5219 18520 20082 12442
3349 12442 35918 20957 25458 31808 14447 -22349 -31145 -7248 -11410 -13049 2290 2204 -3822 -15954
3335 -15954 -23756 5032 10353 40316 69878 77677 82744 62426 39785 44031 35953 12108 22050
3322 22050 46873 22509 13315 -10118 20451 10423 -27560 -34589 -32647 -6044 44278 35041 15046
3309 15046 -2829 -33875 -81021 -86520 -68243 -37646 -23635 -17823 -19689 -3413 -7854 5138 23370
3296 23370 22650 31645 11805 5480 319 -8198 -16499 -5571 5482 26986 27429 25022 -6927 -14288
3282a4288j3452K3925pJ295r573p123m004o415j2274j6897L2268K9529K4427J295
3268B8706l1438j7288q172j2137K6355J1002K933J7643N003j9729j5095o982l9911
3255e9110L508J7302K0995J514k4418M565L0317M2109o143m2023K917l190N336
3242f321L597J8442k8043L910L3075j4225L011j4983J5839j910N678Q81N973K906
3228B7830n411k1877p730K0639l333J3390K9219q503n716j3102n3145o755J2431
3215b2063k5592l7135P361K3518Q947K0010P733J4833K275m386m729k8116J1474
3202b5870k306J0726R616M1884l547k236k5204k5891M904K5942j9629l2840j5338
3189e9789m230k4112K1321J7890n770m667K5505M362M0140J1099j3290Q369m4041
$$ plain form
3282 -14288 -27740 -3815 -3822 -2527 -12100 -19223 -23227 -29642 -41916 -58813 -26545 2984 27411 28706
3268 28706 -2732 -20020 -28192 -40329 -13974 -2972 -39 17604 22607 2878 -12217 -19199 -59110
3255 -59110 -55602 -38300 -17305 -15791 -40209 -35644 -5327 36782 30639 -11384 -8467 -11657 -6321
3242 -6321 -2724 15718 -12325 -8415 24660 10435 13446 -1537 14302 12392 18070 18951 24924 27830
3228 27830 22419 542 -7188 13451 10118 23508 52727 44224 38508 25406 -27739 -34494 -22063
3215 -22063 -47655 -84790 -77429 -53911 -44964 -24954 -17221 -2388 -113 -4499 -9228 -37344 -25870
3202 -25870 -28176 -17450 -7834 34050 30503 28267 3063 -22828 -17924 8018 -11611 -44451 -59789
3189 -59789 -64019 -88131 -66810 -48920 -54690 -59357 -33852 -29490 10650 21749 8459 16828 -27213
3176b7213J6114J3944k9382k037k0470j6118J9576K4056r202m271M207K0151M0164
3163B9519J1620Q114l8572k0237l339K4981K5017K646j4998j7551m7079p219J3333
3150c3765K2296o062J628J2084K0960j5979k8738N745J0399J1662J0415m751l8135
3137c2241k4539J1064P318L1276J9611l2067m8734M726K7375L0571M266r691R532
3124a533p963l261m691j070m980J0406J1018K596K3097K9415m0195k5630L331
3111i460M93M1611p720q78J4944K3098l8998j9644l0562J1076K3428N834m341
3098H881j0618m563l5426q258L312K3463J8848j805R580j0652o305J124m569J892
3084a5096K4507j2831j0851R821J4661K9467L2055k0390j9839k4025K2732k8362
$$ plain form
3176 -27213 -11099 2845 -26537 -28574 -49044 -65162 -45586 -21530 -30732 -35003 -30796 -10645 29519
3163 29519 41139 49253 10681 -9556 -12895 12086 37103 39749 24751 7200 -39879 -47098 -33765
3150 -33765 -11469 -17531 -15903 -3819 17141 1162 -27576 -21831 -11432 230 10645 5894 -32241
3137 -32241 -56780 -45716 -38398 -7122 12489 -19578 -68312 -63586 -36211 -5640 -1374 -11065 -1533
3124 -1533 -9496 -12757 -17448 -18518 -23498 -13092 -2074 522 23619 53034 12839 -12791 -9460
3111 -9460 -8967 32644 24924 24046 38990 62088 23090 3446 -27116 -16040 7388 13222 8881
3098 8881 -1737 -6300 -41726 -49984 -46672 -23209 -4361 -6166 3414 -7238 -13543 -12419 -16988 -15096
3084 -15096 9411 -3420 -14271 -4450 10211 39678 71733 51343 31504 7479 30211 1849
3072A849l7749K0078K6147K1529k600k4092J268J7150O173j340R409k0022m254
3059A3546J5909J1917l2190j6489l2231K4000j442n163k7988q043r168k4608q634
3046a00584K0938L4892K1896K7006m989j5197k8855J2013J8125K3770M334R76
3034A4325J7250j871k1721k3768K04j6316p764j6974N358P021K4547j8379l0331
3021f8419O118J3738K8108O573n789k5559L617J459J0353M270L2842J0376j2774
3008D913m1785K867q966k1835J8715O202J6354J5062J937J6598J1453k1083j8234
2995a7802r545n00K0415O011j348j4502k2027j14L388L2557j3438M085r164l11
2981b2295J353J0501J5L4684k54j0937N3Q977l5200j0380J0726R284L2073Q688
$$ plain form
3072 1849 -35900 -15822 10325 31854 29254 5162 6430 23580 29753 28413 37822 17800 13546
3059 13546 29455 41372 9182 -7307 -39538 -15538 -16980 -22143 -50131 -58174 -67342 -91950 -100584
3046 -100584 -79646 -44754 -22858 4148 -841 -16038 -44893 -32880 -14755 9015 13349 14325
3034 14325 31575 29704 7983 -15785 -15581 -31897 -39661 -56635 -51277 -44256 -19709 -38088 -68419
3021 -68419 -62301 -48563 -20455 -13882 -19671 -45230 -41613 -40154 -29801 -25531 7311 17687 4913
3008 4913 -36872 -34005 -42971 -64806 -46091 -39889 -23535 -8473 -6536 10062 21515 432 -17802
2995 -17802 -27347 -27847 -7432 -1421 -2769 -17271 -39298 -39412 -36024 -3467 -16905 -12820 -21984 -22295
2981 -22295 -20942 -10441 -10426 24258 24004 13067 13120 22097 -13103 -23483 -12757 -3473 28600 37288
2967C7288l9797l015L1668J4807O64R931J7610j9531j9748j5910p947Q203n789
2954H434m364J9559O441m73Q706k041m5743j7573k016P871K9765Q31l9976j340
2940c1919J9976K3214l6577j9421J1387J2879O917J0041J1829r056j7658L0066
2928A1678K7613k4814l0312J2278J190m605J3155L295J9307p757j4164q970J0360
2915H254L5787K8096l4874m2064j6345J2840j0933Q443Q854l8868J3745M0824
2903A3759L4284j7345k5519k1411M941O289J5630k967m1226j5245K9366K2491
2891C047J2922p094l3020j3913k426M288L159J7011J1823N955j8007k1060J852
2878c5463K1156R387J6845K0537j3528P276Q148J1565j6233k7105j840l76k7177
$$ plain form
2967 37288 -2509 -5524 26144 40951 41615 51546 69156 49625 29877 13967 6020 14223 8434
2954 8434 4070 23629 30070 29597 38303 36262 -9481 -27054 -29070 -21199 8566 9397 -30579 -31919
2940 -31919 -11943 11271 -25306 -44727 -33340 -20461 -13544 -3503 8326 -730 -18388 11678
2928 11678 39291 14477 -15835 -3557 -2367 -6972 6183 9478 28785 21028 6864 -2106 8254
2915 8254 44041 72137 37263 -4801 -21146 -8306 -19239 -10796 -1942 -40810 -27065 13759
2903 13759 48043 30698 5179 -16232 -11291 -5002 10628 7661 -33565 -48810 -19444 3047
2891 3047 15969 8875 -24145 -38058 -40484 -36196 -33037 -16026 -4203 1752 -16255 -37315 -35463
2878 -35463 -14307 -4920 11925 32462 18934 26210 34358 45923 29690 2585 745 369 -26808
2865b6808r662L6742K6056Q928r259k7475k5962J5309k292J1926j2953J1823K5191
2852B1564j5974j6319j2046o917J0972M413m832O745K8316J0340m0505l9188J3927
2839c9504j996r794K936R211K5889K0283K464J978o233k5452J3189J3355K1046
2826B7372R115k2852K8629p239l1469r957j7253J1969J1628J7391Q375l939j2384
2813I386r259l1999m545o801K9145K2036j4013P112J9339J1834l1109n369J9886
2800A5643k7270j3201n424m548L1980J5939K0515L319J6546l3311j7583Rk5531
2787b2917k8155j493J5133J7654L3678j7549k0740j3319K986j4420k5476M0025
2775c4593J8975J9845M774m5741l9415Q042L0666J7861k0364P655J0737J1734
$$ plain form
2865 -26808 -36470 272 26328 35256 25997 -1478 -27440 -12131 -14423 -2497 -15450 -3627 21564
2852 21564 5590 -10729 -22775 -29692 -18720 -14307 -19139 -12394 15922 26262 -14243 -53431 -39504
2839 -39504 -41500 -51294 -48358 -39147 -13258 7025 9489 11467 5234 -20218 -7029 6326 27372
2826 27372 36487 13635 42264 35025 3556 -6401 -23654 -11685 -57 17334 25709 21770 9386
2813 9386 127 -31872 -36417 -43218 -14073 7963 -6050 1062 20401 32235 1126 -4243 15643
2800 15643 -11627 -24828 -30252 -34800 -2820 13119 33634 36953 53499 20188 2605 2614 -22917
2787 -22917 -51072 -52565 -37432 -19778 13900 -3649 -24389 -37708 -34722 -49142 -74618 -34593
2775 -34593 -15618 4227 9001 -36740 -76155 -68113 -37447 -19586 -39950 -32295 -21558 -9824
2763i824M207p52K2770l4988Q687Q825L0619j0440j0424J0632K1736r267R163
2750D0944J5495N828k1257R018J2616L776m414k0577j1780J8675K711K7281J874
2737H0190k7499k5651k7122j6759q626J0038k0979j508J3163l816K5381K4934
2725B1746M044k5735m932R429K494Q735J6917O633M569q602j9817K232R791M74
2711B7978r064j9605K381Q575j9086j8342J4285J9013J225j3615K4852r364k1001
2698a1768J7468J0867J8051L3681r407j1178k5716k5500J6755l499n064l768j1929
2685a1007j5693j3573K585k2050J1989J0863P68j3633j338J502J9126l789L492
2672c0758j0123K0854L8150K087j2376O489m1448J1623P20j342j0225k0954J7692
$$ plain form
2763 -9824 -5617 -6369 16401 -18587 -9900 -1075 29544 19104 8680 19312 41048 31781 40944
2750 40944 56439 62267 41010 50028 62644 66420 62006 41429 29649 48324 51035 78316 80190
2737 80190 52691 27040 -82 -16841 -25467 -15429 -36408 -37916 -24753 -28569 -3188 21746
2725 21746 25790 55 -4877 4552 7046 15781 32698 39331 43900 35298 15481 17713 27504 27978
2711 27978 18914 -691 1690 10265 -8821 -27163 -12878 6135 7360 -6255 18597 9233 -11768
2698 -11768 5700 16567 34618 68299 58892 47714 21998 -3502 13253 9754 4690 922 -11007
2685 -11007 -26700 -40273 -37688 -59738 -47749 -36886 -36118 -49751 -51089 -49587 -30461 -34250 -30758
2672 -30758 -40881 -20027 18123 20210 7834 14323 -27125 -15502 -14782 -16124 -26349 -47303 -29611
2659b9611J3036N33j1853L3617O977j3335K1959P495p700J7388j6095l1164K6927
2646A8174K6743l0008l2112R561L2380j0399l5961L1723K702l6211l1864O695
2634d8577J6967J5052q726J1830o20m554L898j607J1003N146k355K006J9684M600
2620B3747k0440j3170P3k781J6928K075J596j0364j5647j8200r104K1930L3378
2607A0021J7423M29k3635r25L0813O075j7832J443J5601j4191n606P990Q663r087
2593B7182j963J4212M063M861j1543q782k72j7765p489j1819Q956O052o076j76
2579e59K7568J4108J947j2538j4029j1327p085j2817k4551l627K7218n259K0625
2566c26L834J102K719N243o446L257K6272J8740O89l7269J0455L973n369j4942
$$ plain form
2659 -29611 -16575 -16042 -27895 5722 12699 -636 21323 28818 21118 38506 22411 -8753 18174
2646 18174 44917 14909 -17203 -7642 24738 14339 -21622 10101 12803 -23408 -55272 -48577
2634 -48577 -31610 -16558 -25284 -13454 -14074 -18628 -14730 -16337 -5334 -188 -2543 -537 19147 23747
2620 23747 3307 -9863 -9790 -12571 4357 6432 8028 -2336 -17983 -36183 -45287 -23357 10021
2607 10021 27444 27873 4238 3313 34126 40201 22369 23812 39413 25222 19616 27606 36269 27182
2593 27182 25219 39431 43494 48355 36812 28030 27758 9993 2504 -9315 -359 5693 -383 -559
2579 -559 27009 41117 43064 30526 16497 5170 -1915 -14732 -39283 -42910 -15692 -20951 -326
2566 -326 3508 4610 7329 12572 6126 9383 35655 54395 55084 17815 28270 32243 26874 11932
2552A1932l4668M583J6795R598j5946J2737m010q918J574j1696j2583k527J2231
2539b0898L4632k1496k3542O020J383P787J5349K2800K1490k9729l2067M786j7655
$$ plain form
2552 11932 -22736 -18153 -1358 8240 -7706 5031 1021 -7897 -6323 -18019 -30602 -33129 -20898
2539 -20898 13734 -7762 -31304 -25284 -23901 -16114 -765 22035 43525 13796 -18271 -13485 -31140
$$ [...]
##END NTUPLES=NMR SPECTRUM
##END=
