##TITLE=Analysis number 126068
Compound Code btb 14323
Book Reference 314595
Project Code adrs
Chemist Name stores
##JCAMPDX= 6.0         $$ Bruker NMR JCAMP-DX V2.0
##DATA TYPE= NMR SPECTRUM
##DATA CLASS= NTUPLES
##ORIGIN= Bruker BioSpin GmbH
##OWNER= NMR
$$ XWIN-NMR		Version 3.5
$$ Thu Oct 20 13:22:24 2005 GMT Daylight Time (UT+1h)  MAYBRIDGE\NMR@NMR_250MHZ
##.OBSERVE FREQUENCY= 250.131544655141
##.OBSERVE NUCLEUS= ^1H
##.ACQUISITION MODE= SIMULTANEOUS (DQD)
##.ACQUISITION SCHEME= undefined
##.AVERAGES= 16
##.DIGITISER RES= 18
##SPECTROMETER/DATA SYSTEM= dpx250
##.PULSE SEQUENCE= zg30
##.SOLVENT NAME= DMSO
##.SHIFT REFERENCE= (INTERNAL, DMSO, 0, 16.5096)
##AUDIT TRAIL= $$ (NUMBER, WHEN, WHO, WHERE, WHAT)
$$ ##TITLE= Audit trail, XWIN-NMR		Version 3.5
$$ ##JCAMPDX= 5.01
$$ ##ORIGIN= Bruker BioSpin GmbH
$$ ##OWNER= NMR
$$ C:\u/data/dgb/nmr/ADRS/11130/pdata/1/auditp.txt
$$ ##AUDIT TRAIL=  $$ (NUMBER, WHEN, WHO, WHERE, WHAT)
(   1,<2005-10-20 13:22:04.99 +100>,<MAYBRIDGE\NMR>,<NMR_250MHZ>,
      <created by zg, POWCHK disabled, PULCHK disabled
       configuration hash MD5:
       62 19 C7 07 E1 42 D1 B7 37 6C 3D D0 77 39 F9 E6
       data hash MD5: 64K
       1F F0 A9 C0 86 DD BD 99 B2 58 C7 FE F8 79 03 2F>)
(   2,<2005-10-20 13:22:15.72 +100>,<MAYBRIDGE\NMR>,<NMR_250MHZ>,
      <Start of raw data processing
       ef LB = 0.3 FT_mod = 6 PKNL = 1 SI = 32K 
       data hash MD5: 32K
       1F 17 88 D9 14 2F 93 EB 55 65 F5 30 DF 1A 8E 68>)
(   3,<2005-10-20 13:22:17.38 +100>,<MAYBRIDGE\NMR>,<NMR_250MHZ>,
      <apk 
       data hash MD5: 32K
       82 56 64 85 D0 62 9C CD 61 3E 0F 06 7E 19 BA 04>)
(   4,<2005-10-20 13:22:18.05 +100>,<MAYBRIDGE\NMR>,<NMR_250MHZ>,
      <abs ABSG = 5 
       data hash MD5: 32K
       0A 92 6D F9 DB D4 7A 4C DE 14 DB CA 0E D4 A2 78>)
$$ ##END=
$$ 
$$ hash MD5
$$ 4F 3C E3 D8 EC 14 07 12 D7 74 CF F3 CA A7 AC 18
##$RELAX= 
##$RELAX= 
##$RELAX= 
##$RELAX= 
##$RELAX= 
##$RELAX= 
##$RELAX= 
$$ Bruker specific parameters
$$ --------------------------
##$DU= <C:\u>
##$EXPNO= 11130
##$NAME= <ADRS>
##$PROCNO= 1
##$TYPE= <nmr>
##$USER= <dgb>
##$AMP= (0..31)
100 100 100 100 100 100 100 100 100 100 100 100 100 100 100 100 100 100 
100 100 100 100 100 100 100 100 100 100 100 100 100 100 
##$AQSEQ= 0
##$AQ_mod= 3
##$AUNM= <au_zg>
##$AUTOPOS= <35 >
##$BF1= 250.13
##$BF2= 250.13
##$BF3= 250.13
##$BF4= 250.13
##$BF5= 500.13
##$BF6= 500.13
##$BF7= 500.13
##$BF8= 500.13
##$BYTORDA= 1
##$CFDGTYP= 0
##$CFRGTYP= 5
##$CHEMSTR= <none>
##$CNST= (0..31)
1 1 145 1 1 1 1 1 1 1 1 1 1 1 1 1 1 1 1 1 1 1 1 1 1 1 1 1 1 1 1 1 
##$CPDPRG= <>
##$CPDPRG1= <>
##$CPDPRG2= <>
##$CPDPRG3= <>
##$CPDPRG4= <mlev>
##$CPDPRG5= <mlev>
##$CPDPRG6= <mlev>
##$CPDPRG7= <mlev>
##$CPDPRG8= <mlev>
##$CPDPRGB= <>
##$CPDPRGT= <>
##$D= (0..31)
0 1 0 0 0 0 0 0 0 0.06 0 0 0 0 0 0 0.0002 0 0 0 0 0 0 0 0 0 0 0 0 0 0 
0 
##$DATE= 1129810924
##$DBL= (0..7)
120 120 120 120 120 120 120 120 
##$DBP= (0..7)
150 150 150 150 150 150 150 150 
##$DBP07= 0
##$DBPNAM0= <>
##$DBPNAM1= <>
$$ [...]
##$SUBNAM7= <"">
##$SUBNAM8= <"">
##$SUBNAM9= <"">
##$SW= 20.6930455092707
##$SWIBOX= (0..15)
0 0 3 0 0 0 0 0 0 0 0 0 0 0 0 0 
##$SW_h= 5175.983436853
##$TD= 65536
##$TD0= 1
##$TE= 295.16
##$TE2= 300
##$TE3= 300
##$TEG= 300
##$TL= (0..7)
0 120 120 120 120 120 120 120 
##$TP= (0..7)
150 150 150 150 150 150 150 150 
##$TP07= 0
##$TPNAME0= <>
##$TPNAME1= <>
##$TPNAME2= <>
##$TPNAME3= <>
##$TPNAME4= <>
##$TPNAME5= <>
##$TPNAME6= <>
##$TPNAME7= <>
##$TPOAL= (0..7)
0.5 0.5 0.5 0.5 0.5 0.5 0.5 0.5 
##$TPOFFS= (0..7)
0 0 0 0 0 0 0 0 
##$TUNHIN= 0
##$TUNHOUT= 0
##$TUNXOUT= 0
##$USERA1= <user>
##$USERA2= <user>
##$USERA3= <user>
##$USERA4= <user>
##$USERA5= <user>
##$V9= 5
##$VALIST= <valist>
##$VCLIST= <CCCCCCCCCCCCCCC>
##$VD= 0
##$VDLIST= <DDDDDDDDDDDDDDD>
##$VPLIST= <PPPPPPPPPPPPPPP>
##$VTLIST= <TTTTTTTTTTTTTTT>
##$WBST= 1024
##$WBSW= 4
##$XGAIN= (0..3)
0 0 0 0 
##$XL= 0
##$YL= 0
##$YMAX_a= 319164
##$YMIN_a= -417778
##$ZGOPTNS= <>
##$ZL1= 120
##$ZL2= 120
##$ZL3= 120
##$ZL4= 120
##$ABSF1= 16.50964
##$ABSF2= -4.183533
##$ABSG= 5
##$ABSL= 3
##$ALPHA= 0
##$AQORDER= 0
##$ASSFAC= 0
##$ASSFACI= 0
##$ASSFACX= 0
##$ASSWID= 0
##$AUNMP= <proc_1d>
##$AZFE= 0.1
##$AZFW= 0.1
##$BCFW= 0
##$BC_mod= 0
##$BYTORDP= 0
##$COROFFS= 0
##$CY= 12.5
##$DATMOD= 1
##$DC= 0
##$DFILT= <>
##$DTYPP= 0
##$F1P= 14.0000005364418
##$F2P= -0.99999901652339
##$FCOR= 0.5
##$FTSIZE= 32768
##$FT_mod= 6
##$GAMMA= 0
##$GB= 0
##$INTBC= 1
##$INTSCL= 1
##$ISEN= 128
##$LB= 0.3
##$LEV0= 0
##$LPBIN= 0
##$MAXI= 10000
##$MC2= 0
##$MEAN= 0
##$ME_mod= 0
##$MI= 0
##$NCOEF= 0
##$NC_proc= -6
##$NLEV= 6
##$NOISF1= 0
##$NOISF2= 0
##$NSP= 0
##$NTH_PI= 0
##$NZP= 0
##$OFFSET= 16.50964
##$PC= 1
##$PHC0= -83.55402
##$PHC1= 14.19873
##$PH_mod= 1
##$PKNL= yes
##$PPARMOD= 0
##$PSCAL= 4
##$PSIGN= 0
##$REVERSE= no
##$SF= 250.130003091337
##$SI= 32768
##$SIGF1= 0
##$SIGF2= 0
##$SINO= 400
##$SIOLD= 32768
##$SREGLST= <1H.DMSO>
##$SSB= 0
##$STSI= 32768
##$STSR= 0
##$SW_p= 5175.98343685301
##$SYMM= 0
##$S_DEV= 0
##$TDeff= 65536
##$TDoff= 0
##$TI= <Analysis number 999999
Compound Code 99
Book Reference 9
Project Code 9>
##$TILT= no
##$TM1= 0
##$TM2= 0
##$TOPLEV= 0
##$USERP1= <user>
##$USERP2= <user>
##$USERP3= <user>
##$USERP4= <user>
##$USERP5= <user>
##$WDW= 1
##$XDIM= 32768
##$YMAX_p= 519669427
##$YMIN_p= -1121367
$$ End of Bruker specific parameters
$$ ---------------------------------
##NTUPLES= NMR SPECTRUM
##VAR_NAME=  FREQUENCY,     SPECTRUM/REAL,   SPECTRUM/IMAG
##SYMBOL=    X,             R,               I
##VAR_TYPE=  INDEPENDENT,   DEPENDENT,       DEPENDENT
##VAR_FORM=  AFFN,          ASDF,            ASDF
##VAR_DIM=   32768,         32768,           32768
##UNITS=     HZ,            ARBITRARY UNITS, ARBITRARY UNITS
##FACTOR=    0.157963299565203, 1,           1
##FIRST=     4129.55623920062, 0,            0
##LAST=      -1046.42719765239, 0,           0
##MIN=       -1046.42719765239, -1121367,    0
##MAX=       4129.55623920062, 519669427,    0
$$ Real data points
##PAGE= N=1
##DATA TABLE= (X++(R..R)), XYDATA
$$ [...]
23298B71375l2210j37157k74338J46533m9812j32729j3788P1757R2913J10090
23288E2634q1558K4456j38066q4624J99077j28588j4075J03910K50943l2676k55958
23277a04525N3660k004N9569j07256K34321n4315l07847l7660k00478P3613p5953
23266d68875L6002R8601n7375j3778o6478k4257m7248J48432K59589M3126p1036
23255a63297k74247m8143K60644N3319k61726l4914L1739J02421j90750j36883
23245f61837J08495J99221P2380j35543k2529J39621N7240O5512m8260k05414
23235d31114k61211O7100L08249j33297Q6273K55111l00785L7013J60451J5237
23225a96973M7247J51111L0798O9482k0730k80519j00062L0986M4820j76765r8220
$$ plain form
23298 271375 239165 102008 -172330 -25797 -75609 -208338 -222126 -150369 -57456 52634
23288 52634 -28924 -4468 -142534 -227158 -28081 -156669 -170744 -66834 184109 151433 -104525
23277 -104525 -50865 -52869 6700 -100556 133765 79450 -228397 -266057 -466535 -392922 -468875
23266 -468875 -432873 -334272 -391647 -405425 -471903 -496160 -543408 -394976 -135387 -92261 -163297
23255 -163297 -437544 -485687 -225043 -171724 -433450 -468364 -436625 -334204 -524954 -661837
23245 -661837 -553342 -354121 -281741 -417284 -439813 -300192 -242952 -177440 -225700 -431114
23235 -431114 -692325 -625225 -316976 -450273 -364000 -108889 -409674 -372661 -212210 -196973
23225 -196973 -149726 1385 32183 101665 80935 -199584 -299646 -268660 -223840 -400605 -498825
23214d98825M25r2427k9874O7736L01563Q5854Q927j83153j27404K84943K00873
23203A8638j15464N8314K69987p2082j76265j72231m5984q1125k34928j61686
23193g12826M02454J51812j23583q4178k6873K82665k4939K0902J84113j75941
23183a06394k32522O3976J80827K06176j58847k57664O619J28640r3387r7802
23173c60378Q3161Q1717M4681r0155L4062p271k9006P7693P1990J03547R0956
23162A00997L259k07294j98131K31153J21091J00628j90811k34470K75542j62287
23152a60323j79752J63207R2427Q4482L6128l2166j63909K14421K68328j63940
23142A58903j26847k7460j6566j29659j05191j0716M5884M308L9422R4467n63
$$ plain form
23214 -498825 -498400 -590827 -620701 -552965 -251402 -165548 -156621 -339774 -467178 -182235 18638
23203 18638 -96826 -38512 231475 159393 -16872 -189103 -235087 -316212 -551140 -712826
23193 -712826 -310372 -158560 -282143 -366321 -393194 -110529 -135468 -114566 69547 -106394
23183 -106394 -338916 -274940 -94113 112063 -46784 -304448 -297829 -169189 -262576 -360378
23173 -360378 -277217 -195500 -150819 -240974 -206912 -214183 -243189 -165496 -93506 10041 100997
23162 100997 104256 -103038 -301169 -70016 51075 151703 -39108 -273578 1964 -160323
23152 -160323 -340075 -176868 -84441 41 36169 4003 -159906 54515 322843 158903
23142 158903 32056 4596 -11970 -141629 -246820 -257536 -211652 -207344 -167922 -73455 -74018
23131g4018M540K345m1114j30891q4091K75079J15608K3545j85416j60860o7554
23120c22827M1583k6162J88222P1709J95899K28922n5389k01536k4279p6409P4681
23109I4414j7458Q8834m533J6736Q4196l28307p2177P6114K21887k73474k27264
23098c41032k9000J66168L05618J17021k48731m62760O4703L98089J72881l3730
23088A09227j19551m06037j62188L22891O2923j04276j63577j13613R9308J31921
23078c42972K69623O7052k68865j86520J11942Q4513j89627P7415K53537K17265
23068I3363q6911O8801J55948j32374m11558p8472P6822J26580M0049l05193J5023
23057d37922J31778J41362j60357p3666Q2265K00696p81o0414m77457k0517J38746
$$ plain form
23131 -74018 -69478 -67133 -108247 -239138 -323229 -48150 67458 91003 -94413 -255273 -322827
23120 -322827 -281244 -307406 -119184 -47475 148424 377346 321957 120421 96142 19733 94414
23109 94414 76956 165790 161257 177993 262189 -66118 -138295 -62181 159706 -113768 -341032
23098 -341032 -370032 -203864 101754 218775 -29956 -492716 -428013 -29924 142957 109227
23088 109227 -10324 -416361 -578549 -255658 -192735 -297011 -460588 -574201 -474893 -342972
23078 -342972 -73349 -6297 -275162 -461682 -349740 -265227 -454854 -377439 -123902 93363
23068 93363 6452 75253 231201 98827 -312731 -391203 -314381 -187801 -147752 -452945 -437922
23057 -437922 -306144 -164782 -325139 -398805 -316540 -115844 -116625 -177039 -654496 -675013 -536267
23046e36267O9944l6329K6965J28854K59117j4821J03474n6042j39628o6102p2833
23035c33668M8993J47850Q7680O2472K02975j3532L8081l4626J70950j30691j78330
23024F8154l43012N5918l138p8309K43872O8948P3473J64029K08993J3607n6769
23013D15766j36429j52750r9941O9775K20531n5502k31015J1142j24485l27266
23003d10174j5490N0415J16329K73970q321n5092j6480O0968j66702L1114K59734
22992A20271L7143l65216J70749l560j83775N082k9176J30444J92271j10745J54672
22981A18160K12341l90642m17795M1805J32041J19378P8853m5970M0262M8982
22971f2585k6628N4926J45974J06496k54655K9044K30849k11062k63373l7986
$$ plain form
23046 -536267 -466323 -502652 -475687 -346833 -87716 -102537 937 -55105 -194733 -260835 -333668
23035 -333668 -284675 -136825 -49145 13327 216302 202770 240851 206225 377175 246484 68154
23024 68154 -274858 -218940 -222078 -300387 -56515 12433 85906 249935 458928 472535 415766
23013 415766 279337 126587 26646 96421 316952 261450 30435 41577 -82908 -410174
23003 -410174 -425664 -375249 -258920 15050 6729 -48363 -64843 -3875 -170577 -139463 120271
22992 120271 157414 -207802 -37053 -40613 -224388 -219306 -248482 -118038 74233 -36512 118160
22981 118160 330501 -60141 -477936 -436131 -304090 -184712 -105859 -151829 -111567 -62585
22971 -62585 -89213 -34287 111687 218183 -36472 -7428 223421 12359 -251014 -289000
22961b89000L16427L10108n7834j40933k19130J81385J66957j05524j29338l0912
22951B206j3071j43254Q322M8008Q8083J5403k8459q1064q9096J61909O5186j47303
22939a13130k58482J13930J52320k11169p4819J39216J03646M6084m5911j40607
22929b88922K48963J81532J68001R2441q231r626p806r1633k41832p5102j83754
22918b15969o3031P0725j08363M0932m505q6288N2414R9566N1926j51174J4496
22907b99271L09097M6508l0976k53688o4009o917k36582K98091M19114q7531k64256
22896a70420k16094j8089J40796J53250n602q383j56184j48230l3340o5017R5039
22885d32274K22595R2626R1635k501O6677L0986P9708K33194j14733m01696Q4989
$$ plain form
22961 -289000 27427 337535 279701 138768 -80362 101023 267980 162456 33118 2206
22951 2206 -10865 -154119 -145797 -97789 -9706 5697 -22762 -103826 -192922 -31013 34173 -113130
22939 -113130 -371612 -257682 -105362 -316531 -391350 -252134 -148488 -102404 -148315 -288922
22929 -288922 -39959 141573 309574 402015 393784 384158 376352 284719 42887 -32215 -215969
22918 -215969 -279000 -208275 -316638 -275706 -280211 -366499 -314085 -214519 -162593 -313767 -299271
22907 -299271 9826 56334 25358 -228330 -292339 -299256 -535838 -237747 181367 93836 -170420
22896 -170420 -386514 -404603 -263807 -110557 -116159 -124542 -280726 -428956 -462296 -527313 -432274
22885 -432274 -209679 -117053 -25418 -27919 38758 69744 149452 382646 267913 -133783 -48794
22874d8794K55856J7031n3487J55972o1273k84129j61313J28538k56362P7527
22864b30434K84626q5798k08905J45015n4022j26902j12681J15520R7364J31672
22854d4545j15208L81256J21087j63633j34044k41514K17887J08829r7630j66738
22844a34253K90172Q0676p9855j51253j30852O7605j37521l3770m51483l72507
22834a053041L99962M73435N5108K0117J19356m9922K33556K00311R3034k84326
22824B07590j38797J46825l79180n0702K37139j50969o3863J03733K14951l0675
22814I6052M0805J82353K36003p3549l57995k93785n8497J23425J82049Q8042
22804A64903L13992k15208k18796j8834L8493k07684j15002j16723R3562k93541
$$ plain form
22874 -48794 207062 224093 170606 326578 265305 -18824 -180137 -51599 -307961 -230434
22864 -230434 54192 -31606 -240511 -95496 -149518 -276420 -389101 -273581 -176217 -44545
22854 -44545 -159753 221503 342590 178957 44913 -196601 21286 130115 32485 -134253
22844 -134253 155919 236595 156740 5487 -125365 -57760 -195281 -229051 -680534 -1053041
22834 -1053041 -653079 -179644 -124536 -104419 14937 -34985 198571 398882 491916 207590
22824 207590 68793 215618 -163562 -214264 22875 -128094 -191957 -88224 126727 96052
22814 96052 136857 319210 555213 481664 123669 -170116 -228613 -105188 76861 164903
22804 164903 478895 263687 44891 26057 64550 -143134 -258136 -374859 -281297 -574838
22794e74838J5653J25039k0032q076O8265K16917O6166O5693P7582M1369m9080
22783B4658O0560O7976O2375K5783m8550j02495K8589k73069j64916P8162J6256
22772b24671O8258M4134M8444k796m0769J10828M5167M5094l8340j68544k59618
22761c72813L0784l806K4072J51563J97635L0795n7520j18757j49857j99419J50207
22750c17116q3732J09900q6859L5125L06107j73528k76555k19673J40203P5669
22740d90459K65266L51681K89062m619l81526j37407r905P011j46718J01335j00922
22729b57201j98833k05365J67927J57908K2899m3380J4992K92964k09362k20455
22719d77906P5577L4970j02363J56481n3637j19503R8753K50559M3061J16664
$$ plain form
22794 -574838 -559185 -434146 -454178 -462254 -393989 -177072 -110906 -45213 32369 73738 24658
22783 24658 85218 153194 215569 241352 192802 90307 118896 -154173 -319089 -240927 -224671
22772 -224671 -156413 -112279 -63835 -66631 -107400 3428 48595 93689 55349 -113195 -372813
22761 -372813 -342029 -345835 -321763 -170200 27435 58230 710 -118047 -267904 -467323 -317116
22750 -317116 -400848 -290948 -377807 -342682 -36575 -210103 -486658 -706331 -566128 -490459
22740 -490459 -225193 126488 415550 410931 29405 -108002 -117907 -110896 -257614 -156279 -257201
22729 -257201 -456034 -661399 -493472 -335564 -312665 -356045 -341053 -48089 -257451 -477906
22719 -477906 -402329 -367359 -469722 -313241 -366878 -486381 -387628 -137069 -94008 22656
22709B2656N7490j76285l36413k1925R5081p7570o2223J79689J84180O4309M6847
22698b4164q3449K4241K61803j78757j23747J07012K94112R8762P9682k79047
22688A76448p7309P6487j08328k34733O0778r1576R6384r1594l52828l1570q9675
22677f67516k5548O7396P7680m9638j0153p575J09153J13463P3100p3384j01172
22666d94194Q3517m2562J21715J22917k01160k89385Q7536J84042J18883K88331
22656b0360J38270j1848j17395K28611l5530r1242J39610j75177n9660m0888L1122
22645a4487J945l3505o3262p8330K10022L0763o13r9474k32228N6705K4149j49098
22633c47413M7979J21827J56491J01998R0348J57328O8622J22527k79143l05789
$$ plain form
22709 22656 80146 -96139 -432552 -454477 -359396 -436966 -499189 -319500 -135320 -71011 -24164
22698 -24164 -107613 -83372 178431 -326 -124073 -17061 277051 375813 455495 176448
22688 176448 99139 175626 67298 -167435 -106657 -198233 -101849 -193443 -546271 -577841 -667516
22677 -667516 -693064 -625668 -547988 -597626 -607779 -615354 -506201 -392738 -319638 -393022 -494194
22666 -494194 -410677 -453239 -331524 -208607 -409767 -699152 -611616 -427574 -308691 -20360
22656 -20360 117910 106062 -11333 217278 181748 90506 230116 54939 -4721 -45609 -14487
22645 -14487 -12542 -46047 -109309 -187639 22383 53146 52533 -46941 -279169 -222464 -198315 -347413
22633 -347413 -299434 -177607 -21116 80882 171230 328558 397180 519707 240564 -65225
22623f5225j3665l350o0035K07695o7888l5344j73147M1251R6307k8467L09534
22612B07666j72321m14762j72206K82137o5989j2288j50183K9888K21741L06912
22602F0595J84069J20724j43528j72318J33603P8094J37123m5302o6775Q6636
22592C72921O6896l06875m65505k8785O4586l8562J23028J79326k28933j04515
22582c66418K55647J07904L368l67079k09323P5827K39775K9198K0403q746M9173
22571a70271p7174j45496k05922J13051K01313J64347J97543k42638j74353K9144
22561c10456K60776l30359k67600J02630J11669L73246J38952m02141p2946J70380
22551b25849k4597J8320j42115L1412R2060N4970n9106J3651P3815L6538J6741
$$ plain form
22623 -65225 -78890 -82240 -142275 65420 -2468 -37812 -210959 -169708 -73401 -101868 207666
22612 207666 35345 -379417 -551623 -269486 -335475 -347763 -497946 -468058 -246317 60595
22602 60595 244664 365388 221860 49542 183145 261239 398362 353060 286285 372921
22592 372921 439817 132942 -332563 -361348 -296762 -335324 -212296 -32970 -261903 -366418
22582 -366418 -110771 -2867 501 -366578 -575901 -500074 -260299 -231101 -210698 -219444 -170271
22571 -170271 -247445 -392941 -598863 -485812 -284499 -120152 77391 -165247 -339600 -310456
22561 -310456 -49680 -380039 -647639 -545009 -433340 -60094 78858 -323283 -396229 -225849
22551 -225849 -250446 -232126 -374241 -342829 -250769 -195799 -254905 -241254 -167439 -130901 -114160
22540a14160M396M0241l3579j33672R1508J07193J12969J14810k46880k04521
22530b61695m3615j8898J93825m4872j61360K95775j9758n0276k28204K53411
22520h5667L86015K0904k7967j54442j76661n0962q5207J68727Q573O2213J16644
22509A82170K30771j69136j78114r9261m3092K76235J78850j52280n66p7358k96954
22498a48735J35634Q402j77215j66217K80416J87028j32844N1479o2327k28439
22488b52818r4702j82815o3735J41151o5700J06926J21674K99091l324K69519
22478B75267K95680m15405o2560j05411j70197j82382Q8598p089j84236l65145
22468h32880k88487J90877L24553K11232J95584j4640K99410L0434K5024p56j93371
$$ plain form
22540 -114160 -109764 -69523 -103102 -236774 -145266 -38073 74896 189706 -57174 -261695
22530 -261695 -305310 -324208 -130383 -175255 -336615 -40840 -60598 -110874 -339078 -85667
22520 -85667 300348 321252 293285 138843 -37818 -88780 -173987 -5260 3313 65526 182170
22509 182170 412941 243805 65691 -33570 -76662 199573 378423 226143 225577 148219 -148735
22498 -148735 -13101 -4699 -181914 -348131 -67715 119313 -13531 37948 -24379 -252818
22488 -252818 -347520 -530335 -594070 -452919 -518619 -411693 -290019 9072 5748 275267
22478 275267 570947 155542 92982 -12429 -182626 -365008 -276410 -283499 -467735 -832880
22468 -832880 -1121367 -930490 -605937 -394705 -199121 -213761 85649 116083 141107 140351 -53020
22457e3020j91372j84770J48349P2380R7439J19789k46976p539o8949q3440L64725
22446c3384J89349j48378p1550J76474k2036j51588j15501p7100o4212j62870
22436d80796J20799K05411j21219k95882J74095L30845j6111K2285J7061j02580
22426a46092j951o0135l3033J06759N737K51497K0940q1833M7786l25196P3219
22415a42302J17587j87739J59237Q1924q2744L0990J85173o9466K0999J21095
22405B34754J93377p760r1217q3505Q4813M8903J4523p2137k38068j62204K93292
22394B14771k20175q7779M6406R6866J5245j5072l3707P1586O3944l00047j31884
22383b79846J61418o6169k513k84417m0946J70897K10768K13966k22313k11427
$$ plain form
22457 -53020 -244392 -429162 -280813 -208433 -110994 8795 -238181 -245720 -314669 -398109 -33384
22446 -33384 155965 7587 -63963 112511 90475 -61113 -176614 -253714 -317926 -480796
22436 -480796 -359997 -154586 -275805 -571687 -397592 -66747 -82858 -60573 -43512 -146092
22426 -146092 -148043 -208178 -241211 -134452 -128715 122782 143722 61889 109675 -215521 -142302
22415 -142302 -24715 -212454 -53217 28707 -54037 -23047 162126 92660 113659 234754
22405 234754 428131 420371 329154 245649 330462 379365 393888 321751 83683 -78521 214771
22394 214771 -5404 -93183 -46777 50089 65334 50262 16555 88141 152085 -147962 -279846
22383 -279846 -118428 -184597 -187110 -471527 -512473 -341576 -130808 83158 -139155 -350582
22373c50582P9230J62452k11077k8986J20259J21837O5418j8182J29427j48713
22363g8917j08996k20682k00934o2500P4429L48195M0568q5282M5100J50482J60870
22352F2333J37340j40510J14291J6276J42513J16930j40480l14086l50362N7272
22342b98483j6353r0444q3698J88665R6060Q270J1899L47916L11578j29554q0416
22331B65440j26132k15491k9786l00733P5696N4218O0773n6263J56856L17640
22321B02218n7019j18506m9773q7006k15261j50332L5252K38698M3538K8744K6957
22310a02490O1494j66590k10692M01751J56250q5369j60081Q579k2061o8634l36352
22299e24195K89576L51221O564M2783k07269k34557k9360K66418P2811m5699j1323
$$ plain form
22373 -350582 -271352 -108900 -319977 -348963 -228704 -106867 -41449 -59631 69796 -78917
22363 -78917 -187913 -408595 -609529 -672029 -597600 -249405 -208837 -294119 -249019 -98537 62333
22352 62333 199673 59163 173454 189730 332243 449173 308693 -5393 -355755 -298483
22342 -298483 -314836 -405280 -488978 -300313 -204253 -195983 -184084 163832 475410 345856 265440
22331 265440 139308 -76183 -105969 -406702 -331006 -276788 -216015 -272278 -115422 202218
22321 202218 145199 26693 -23080 -110086 -325347 -475679 -440427 -201729 -158191 -129447 -102490
22310 -102490 -40996 -207586 -418278 -16527 139723 54354 -105727 -97148 -119209 -187843 -524195
22299 -524195 -234619 116602 123166 165949 -41320 -275877 -305237 -38819 33992 -11707 -23030
22288b3030j90413j11392J41174K22629K09044l07269q5752N9718j56449m7232
22278b88972j30653R2677r0164q9237K26283K88567j68141Q911o9347J88650j14144
22267a45570r1360j26275r539n8677J51273Q2315q2544k1897J09754k7139j59557
22256c79216Q3779o5817k14073N869K12440k32676q4807J81150J69870J47195
22246a76286O384k3491K2071M1306P8897J2732m4358k50975j00736J74707M8159
22235b11590J47741N8817k10737k31583j05142j3779q5468M56443P113k31235
22225d19420P0515R9311r5300Q8489m5284K69113o100j02418q9997J12244R4323
22214b4524J48468p4515M5851k5368J02253j85358k79643M448O1080j24026J89636
$$ plain form
22288 -23030 -213443 -324835 -183661 38968 248012 -59257 -145009 -85291 -241740 -288972
22278 -288972 -419625 -326948 -417112 -506349 -280066 8501 -159640 -150729 -220076 -31426 -145570
22267 -145570 -236930 -363205 -372744 -431421 -280148 -197833 -280377 -302274 -192520 -219659 -379216
22256 -379216 -295437 -361254 -575327 -569458 -357018 -589694 -674501 -493351 -323481 -176286
22246 -176286 -169902 -193393 -171322 -130016 -51119 -38387 -82745 -333720 -434456 -259749 -211590
22235 -211590 -63849 -5032 -215769 -447352 -552494 -566273 -651741 -195298 -188185 -419420
22225 -419420 -348905 -249594 -344894 -256405 -301689 -32576 -38676 -141094 -231091 -118847 -24524
22214 -24524 123944 49429 95280 69912 172165 -13193 -292836 -288388 -227308 -351334 -161698
22203a61698L01284j33754m87941j78086J46285K29739J59461J3498m7620j92412
22193c51244k47678o9829L55017J7337j05968J39983l7990q350k8810j43728M483
22182d76777J61033J92797O3044P420o9119J03576q8673J25520J93288k16389
22172d280k62546j1222K79269J30564j56618j19227r8682K34766J03318j1372
22162H3970J10223k08126n0990J31086n795j51325j3962j60962J16963J58102
22152I184K11508j2544J21755j21536j31127j34586K07778k63079k7865L1982
22142a08530J22873M1914j23232L27188N6416k24306l69037J30926K75654r3851
22132C6015m1351l7685l41082q8970L96905K83983m24628L4803M39268l4596j34218
$$ plain form
22203 -161698 139586 5832 -482109 -660195 -513910 -284171 -124710 -111212 -158832 -351244
22193 -351244 -598922 -668751 -313734 -296397 -402365 -262382 -300372 -308722 -337532 -481260 -476777
22182 -476777 -315744 -122947 -59903 -52483 -121602 -18026 -106699 18821 212109 -4280
22172 -4280 -266826 -278048 1221 131785 -24833 -144060 -242742 -7976 95342 83970
22162 83970 194193 -13933 -64923 66163 60368 -90957 -104919 -265881 -148918 9184
22152 9184 220692 208148 329903 208367 77240 -57346 150432 -112647 -140512 -108530
22142 -108530 14343 56257 -66975 260213 316629 92323 -276714 -145788 129866 36015
22132 36015 -5336 -43021 -384103 -473073 -76168 207815 -216813 -182010 257258 222662 88444
22121H8444j46783j67923j47943j43598J8214L8909K50150K56087k250K63720
22111C07027j87161j10332j48784j41811N054j51918O1539P0061p6798J31088
22101b42035O0356J16391J04333j56062j14452j26031l3825p834K5022J16052
22091b58085J17739j60369k86206J52444q897J15355r3207K3077p700J19069r961
22080b96741l7422K6781J62537j24726p1551m8586j51554l1719j9907K48173J84371
22069a60344j7277J5853j07045J659J6915J84684R2657L8268Q3867m933l30921
22058a86617J6566j0921J3922n9253j56339L6197P2376j22610j07650K5146O2573
22047d16610J55583J6189j88662l47783q1839K18966K09375N3856Q0386M5310
$$ plain form
22121 88444 -58339 -226262 -374205 -517803 -499589 -460680 -210530 45557 43307 307027
22111 307027 119866 9534 -139250 -281061 -276007 -427925 -366386 -296325 -373123 -242035
22101 -242035 -181679 -65288 39045 -117017 -231469 -357500 -391325 -399159 -374137 -258085
22091 -258085 -140346 -300715 -586921 -434477 -443374 -328019 -421226 -398149 -405849 -286780 -296741
22080 -296741 -334163 -307382 -144845 -269571 -341122 -389708 -541262 -572981 -592888 -344715 -160344
22069 -160344 -177621 -161768 -268813 -267154 -250239 -65555 27102 65370 149237 144304 -186617
22058 -186617 -170051 -180972 -167050 -226303 -382642 -346445 -274069 -396679 -504329 -479183 -416610
22047 -416610 -261027 -244838 -433500 -781283 -863122 -644156 -434781 -380925 -300539 -255229
22037b55229k2919J23610J22289K8312K73821n1066j3708l17008K0151j49705
22027b41452J09987K16080l09430j98275J04291J57534J35082J54321j0237j35009
22017a7108R147j02592J54199l910j54958j94843J131o5992j65476J16389q7842
22006e11855J54478R6273J17143j20410Q2930K77457j38430Q3809K92741J406
21996C35542l36657k79494O4924J84490k15026j2375j33087j62021k7555J0151
21986e71108J58636J777n8369K42825K31380q452Q4093L25117K43939j10606m75524
21975F3708j67482m0738j5457j13273O0268N63404Q2813k58923j53042k24472
21965b03194m8521O659M18656J15528l26201o3856J46910p6289m4849Q462q8637
$$ plain form
22037 -255229 -278148 -154538 -32249 -3937 269884 218818 205110 -111898 -91747 -241452
22027 -241452 -131465 84615 -224815 -423090 -318799 -161265 -26183 128138 117901 -17108
22017 -17108 -7961 -110553 43646 39736 -115222 -310065 -308934 -374926 -540402 -424013 -511855
22006 -511855 -357377 -261104 -143961 -264371 -181441 96016 -42414 41395 334136 335542
21996 335542 -1115 -280609 -215685 -31195 -246221 -258596 -391683 -553704 -581259 -571108
21986 -571108 -412472 -410695 -469064 -226239 5141 -3311 80782 405899 649838 539232 63708
21975 63708 -103774 -144512 -159969 -273242 -212974 350430 433243 174320 21278 -203194
21965 -203194 -251715 -245056 173600 289128 -37073 -100929 45981 -30308 -75157 -66695 -155332
21954a55332j22883O5082K92079J79279j43642j02399k360p078J64274J52758
21944C19778k19881j82450q2450N3132K1798J09792P7170j00268k36558q1053
21934c20990j6569J35818k41030j11483J55197J73423K26771M4540l02067k66425
21924e22815R2559K96502j2095o9788j59251K31582Q2954J67784o2118j58558
21914a13244l8506j02606K19511O8846n8477k05796j66903L75996K09241j33972
21904E4090J19799j13786J16665k5568M1118J03544k2775n8680M4677j77593L8808
21893A20299J25573M7222k86832J46648r4102k7661j30881l2574j18776K9504
21883b21580J53797J40602l7991j67929j77387r2204n1774J74543n4128j38059
$$ plain form
21954 -155332 -278215 -213133 78946 258225 114583 12184 9824 2746 167020 319778
21944 319778 99897 -82553 -165003 -111871 -90073 19719 96889 -3379 -239937 -320990
21934 -320990 -337559 -201741 -442771 -554254 -399057 -225634 1137 45677 -256390 -522815
21924 -522815 -430256 -133754 -145849 -215637 -374888 -143306 -60352 107432 45314 -113244
21914 -113244 -151750 -254356 -34845 34001 -24476 -230272 -397175 -21179 188062 54090
21904 54090 173889 60103 176768 151200 192318 295862 273087 214407 259084 81491 120299
21893 120299 245872 293094 6262 152910 58808 31147 -99734 -132308 -251084 -221580
21883 -221580 -67783 72819 34828 -133101 -310488 -402692 -454466 -279923 -334051 -472110
21873d72110J04653J49661j251K17388L5232n5983l17531L4506Q7642n6896J65392
21862a09297L06871L4002l43143j8981o7939o2504Q0189L6r3356j0636J44521
21851a40237J10337J27135j49175N705j65812L8771P2891N0213J51011r3033l08815
21840c01009q3661j04510N6842J76211j8108p4487K49214n5539j49474M0606o3955
21829c27870j4161p8629j47660j07682J59749L3221K18271Q4030K88252j37653
21819c0132R7623J16222j5413k4187r8902j00321j61950j64586K12313N6756l6082
21808a48659J19545J03628K0718j23363j89248r9989K922p3805Q9753P0155J86338
21797d2005Q1386j5246k31652P5664N0633j32161k09004j77290n946J51103J2498
$$ plain form
21873 -472110 -367457 -217796 -219047 -1659 33573 -22410 -339941 -305435 -217793 -274689 -109297
21862 -109297 197574 231576 -111567 -130548 -198487 -260991 -180802 -180766 -274122 -284758 -140237
21851 -140237 -29900 97235 -51940 -46235 -212047 -173276 -100385 -50172 100839 7806 -301009
21840 -301009 -384670 -489180 -432338 -256127 -274235 -348722 -99508 -155047 -304521 -263915 -327870
21829 -327870 -342031 -420660 -568320 -676002 -516253 -483032 -264761 -180731 107521 -30132
21819 -30132 67491 183713 168300 144113 45211 -55110 -217060 -381646 -169333 -112577 -148659
21808 -148659 -29114 74514 95232 -28131 -217379 -317368 -314446 -388251 -298498 -228343 -42005
21797 -42005 39381 24135 -207517 -131853 -81220 -213381 -422385 -599675 -605621 -454518 -442020
21786d42020K18210J26931j9029l5884J6997l7236J19333l01713K1815J40312
21776a92284o5137j3545R7655m1898J1003M6539o1731K21668J35617q9979k00613
21765a52705j98883P2935p7947J89684l0489k24478J33286J82432l24212k18689
21755f49066Q1829K07295J99142p6505j73427j01603K57099J5637J87381q8415
21745a40633J55444M8221j92633P2088J9252N3865l55065k18897j28723Q0212
21735f06869K09154J16773L92626M18l47677k5158M40842J48012p5660J44464
21725C96925l7108p2840m7163j72902l0672K7682p9253j65971k88313M1677J44788
21714b83150M5487J80003M56512j06770j10413R465k42645r5564L2052m9281j58194
$$ plain form
21786 -442020 -223810 -96879 -115908 -151792 -134795 -172031 -52698 -354411 -332596 -192284
21776 -192284 -257421 -270966 -173311 -215209 -204206 -157667 -219398 2270 137887 47908 -152705
21765 -152705 -351588 -278653 -356600 -166916 -197405 -421883 -288597 -106165 -430377 -649066
21755 -649066 -567237 -359942 -160800 -237305 -410732 -512335 -255236 -239599 -52218 -140633
21745 -140633 14811 63032 -129601 -57513 -38261 15604 -339461 -558358 -687081 -606869
21735 -606869 -397715 -280942 111684 112102 -235575 -260733 180109 328121 252461 396925
21725 396925 359817 286977 239814 66912 36240 63922 -15331 -181302 -469615 -427938 -283150
21714 -283150 -237663 -57660 398852 292082 181669 191134 -51511 -147075 -115023 -164304 -322498
21703c22498J01358J86856j13417k22414L3739j47649j63295J95746K67715k68891
21693d52750j56030M60108J10480p1496J34469P9717m106m2077l01138l28737
21683e71560j02432J4344J47266p3233J93477Q7829K15875K34156J37208K15086
21673D98016j35549k69619j80349m936j37680J4525M0391Q8645J44195R2040K6672
21662A76351L3009j69155Q3440K48753k34547j08952J37372m2126k2149J376j51243
21651d7871j15401j45406k41337L30953K93570j08007J21973J1885k09106l9805
21641a48552k5173k08689J44621K72415P7890k36165L1726L19675K2599k17535
21631C2812j40225l47578L22426L21727j23259k55150K32144j5375j67643j89086
$$ plain form
21703 -322498 -221140 -34284 -147701 -370115 -336376 -484025 -647320 -451574 -183859 -452750
21693 -452750 -608780 -148672 -38192 -109688 24781 104498 100392 58315 -242823 -571560
21683 -571560 -673992 -659648 -512382 -585615 -392138 -304309 -88434 145722 282930 498016
21673 498016 362467 92848 -87501 -92437 -230117 -215592 -175201 -86556 57639 149679 176351
21662 176351 209360 40205 123645 372398 137851 28899 166271 124145 101996 103372 -47871
21651 -47871 -163272 -308678 -550015 -219062 74508 -33499 88474 100359 -108747 -148552
21641 -148552 -173725 -382414 -237793 34622 112512 -123653 -91927 227748 250347 32812
21631 32812 -107413 -454991 -132565 189162 65903 -189247 42897 27522 -140121 -329207
21621c29207J34556J20803k13280O5442K1130N7024J43731J40716L1440k25124
21611e2769k00444J9166l7797j89318k9984K58516K58816K4748O1370K67898R9091
21600D79293j48886o8099J41980k39598k74672k6694n984Q4421k11751j68138
21590d38128N0143J63762j737j1375O1551J84556J56073j91091n6339j22185j79548
21579c84318J45725k6266k2343J13338l5177J71289j26805k81366r200J35167
21569c19956L80471Q0229l5199q8626Q6961J38569J76547r4286l81285k0124J04915
21558B8216P3398R0048M2159r2738k64278j79894J44559l8009o9885j8330J13480
21547a71274j6134j83869j0499R3470m9775K4689L02883O7790j94109k34664O870
$$ plain form
21621 -329207 -194651 -73848 -287128 -221686 -200556 -143532 199 140915 172355 -52769
21611 -52769 -253213 -234047 -271844 -461162 -491146 -232630 26186 50934 112304 380202 479293
21600 479293 330407 262308 404288 164690 -109982 -136676 -142660 -58239 -269990 -438128
21590 -438128 -387985 -224223 -225960 -237335 -175784 8772 164845 -26246 -82585 -204770 -384318
21579 -384318 -238593 -264859 -287202 -173864 -209041 -37752 -164557 -445923 -455123 -319956
21569 -319956 60515 140744 105545 16919 103880 242449 418996 324710 -56575 -76699 28216
21558 28216 101614 191662 233821 141083 -123195 -303089 -158530 -196539 -266424 -284754 -171274
21547 -171274 -187408 -371277 -381776 -288306 -338081 -313392 -10509 57281 -136828 -371492 -364622
21536c64622r0967J86595J30893j72447m02629q3687L54609J57140Q6698K2006
21526a76411J61573p1614K1677J06383L4667k0364k65511j78062r2143K34656
21516b45149J92490q6235l38617j48787J33485K97737L87449j05057j22289j37854
21506a72827M7550k53388K53167r9647k26461L34058J8886j69301P9673Q9061
21496i9229p7421k21599j53854j91237K30261J18273j45923J34830J44617J12231
21486a49051J88694n1324j64052j49163m0198r8327o1019L44324K19156J46772
21476A85812N6723J985l59188k29572O7123M4313j10226o0994J99004K88376m2829
21465D0527j43186j01481J04636j5428o2050n2141N2855j87572N1011O161K58085
$$ plain form
21536 -364622 -455589 -268994 -138101 -310548 -713177 -796864 -442255 -285115 -198417 -176411
21526 -176411 -14838 -86452 -64775 41608 76275 55911 -209600 -387662 -479805 -245149
21516 -245149 -52659 -138894 -477511 -626298 -492813 -195076 192373 87316 -34973 -172827
21506 -172827 -125277 -378665 -125498 -225145 -451606 -117548 -98662 -267963 -188290 -99229
21496 -99229 -176650 -398249 -552103 -743340 -513079 -394806 -540729 -405899 -261282 -149051
21486 -149051 39643 -11681 -175733 -324896 -365094 -463421 -524440 -180116 39040 185812
21476 185812 242535 244520 -114668 -344240 -277117 -232804 -343030 -404024 -205020 83356 40527
21465 40527 -102659 -204140 -99504 -114932 -176982 -229123 -176268 -363840 -312829 -306668 -48583
21454d8583m3296Q2645J71637j20763m9507o0085n46197j29910K47155M03311
21444i3593k78942k58407Q9637K00843j695K20710K03727j49993p5696l78167
21434e21576Q5927L59334q2613j19670J11299K9852k87667k14759K29808K4594
21424c85471r725j4280P0903l7184L8116J72590L14212o8626j42649m6071j75907
21413b84092l47573j20902J69743K12347j08680Q5403m1069J9687N6676K30929
21403a27531J45304k24873k50215P0654k2106J48260J7411j03417r3428j01117
21393e41058L7998O6600J32948l1533J95480J46137k96518j33705M5231Q2300
21383b96120l2343k28343j77764j09921L2727M11195L24493J79255j15817k8746
$$ plain form
21454 -48583 -91879 -9234 162403 41640 -7867 -67952 -614149 -744059 -496904 -93593
21444 -93593 -372535 -630942 -541305 -340462 -342157 -121447 82280 -67713 -143409 -521576
21434 -521576 -435649 -76315 -158928 -278598 -167299 -137447 -425114 -639873 -410065 -385471
21424 -385471 -395196 -409476 -338573 -375757 -337641 -165051 149161 80535 -62114 -108185 -284092
21413 -284092 -631665 -752567 -582824 -370477 -479157 -393754 -434823 -415136 -358460 -127531
21403 -127531 17773 -207100 -457315 -386661 -408767 -260507 -243096 -346513 -439941 -541058
21393 -541058 -503060 -436460 -303512 -335045 -139565 6572 -289946 -423651 -378420 -296120
21383 -296120 -328463 -556806 -734570 -844491 -811764 -400569 -76076 103179 -12638 -41384
21373d1384j45147K8979m0036r2030j17688j145r4818J02850J95923K073l2865
21362b35288k4816K09936j06103q0684j28169R3369J66559l0479J88709J06167
21352A59201L7173p2667k73962K746J09022k00385p3661J0765j33301q0583K56809
21341b58843L28139j20775k12611l463K82565K76429P1953l01036k60056O1728
21331a35970j94179j10277L02494K04734j16839j83237k8712K57034m9049r6596
21321a50597J93192q2879j13075j19483N6050o7552J23462p1987O0872k64684
21311d36681o2447L41499R6960j51538k9079J67581k9532k10682L16019K39007
21301B41107l0523r3431j08486j51139k30371J86978L01518Q8572l4825J72746
$$ plain form
21373 -41384 -186531 -157552 -197588 -289618 -407306 -408451 -503269 -400419 -204496 -202423 -235288
21362 -235288 -260104 -50168 -156271 -236955 -365124 -271755 -105196 -135675 53034 159201
21352 159201 196374 123707 -150255 -147509 -38487 -238872 -312533 -301768 -435069 -515652 -258843
21341 -258843 69296 -51479 -264090 -267553 15012 291441 363394 62358 -197698 -135970
21331 -135970 -330149 -440426 -137932 66802 -50037 -233274 -261986 -4952 -54001 -150597
21321 -150597 42595 -40284 -153359 -272842 -216792 -284344 -160882 -232869 -171997 -436681
21311 -436681 -499128 -157629 -60669 -212207 -241286 -73705 -103237 -313919 2100 241107
21301 241107 210584 117153 8667 -142472 -372843 -185865 115653 204225 169400 342146
21291C42146k028k17430j20343L4221J53389N4122p5209N0791n2628O6177j24855
21280A08353L1198L39554K81592r0153k84163k44313K10215J02334k53343j81361
21270A9913l63497j69625J29210M48087L6814l16991j93042k14415N9593K78250
21260b85703N3522l2389L36300j69603j71552L35617J48087k11184J18887Q0545
21250B02527K96899k72340l83880j67187l618j23000J6634L53342o0462j83615
21240c24700Q3136o3469J03007j61132O7349k2353N5461p8876j27070q5484q1226
21229f35357k9090K7201L67364J95687K8790k29963k05572l0635O5949Q6873J01831
21218b56922J10560K34117K52582j69161k24163Q0268n55095j79286P7446J53270
$$ plain form
21291 342146 340118 122688 2345 36566 189955 244077 168868 219659 167031 233208 108353
21280 108353 139551 479105 760697 670544 386381 142068 352283 454617 201274 19913
21270 19913 -343584 -513209 -383999 64088 100902 -216089 -409131 -623546 -563953 -285703
21260 -285703 -232181 -264570 71730 -97873 -269425 66192 214279 3095 121982 202527
21250 202527 499426 227086 -156794 -323981 -327599 -450599 -433965 -80623 -141085 -324700
21240 -324700 -241564 -305033 -202026 -363158 -295809 -318162 -262701 -341577 -468647 -554131 -635357
21229 -635357 -664447 -637246 -269882 -74195 -45405 -275368 -480940 -511575 -445626 -358753 -256922
21218 -256922 -146362 87755 340337 171176 -52987 27281 -527814 -707100 -629654 -476384
21208d76384K40611J23011m07924Q6839L68379K47340M07516q4091n02790k41768
21198b39261J79985j25674J11144J8970l32188L03759K47159l37732j31051o5886
21188c70775R2311J92692J03987j66747J18332N5728p8216l4718J45738O2833
21178A21165j31223m0436q9919q026L356j00633l10090o9940k39122J78734K51466
21167d34668K13963K21683j47081p9023O2989J08863j84075j06253K11461j41937
21157b74078L11714K45781k52105j58444n7132q5357q4861J64449J72101J66766
21147A48834k66597J02839O9866R6288J71955l1593q3741M331O8262l01097m60886
21136d81539J6704K87018R2470j44804r446K72019R5803N6591j99448j36477o4673
$$ plain form
21208 -476384 -235773 -112762 -520686 -433847 -65468 181872 589388 505297 2507 -239261
21198 -239261 -59276 -184950 -73806 -54836 -387024 -83265 163894 -173838 -304889 -370775
21188 -370775 -278464 -85772 18215 -148532 -30200 25528 -52688 -87406 58332 121165
21178 121165 -10058 -50494 -140413 -148439 -145083 -245716 -555806 -625746 -864868 -686134 -434668
21167 -434668 -220705 978 -146103 -225126 -162137 -53274 -237349 -343602 -132141 -274078
21157 -274078 37636 283417 31312 -127132 -184264 -269621 -354482 -190033 -17932 148834
21147 148834 -117763 -14924 54942 151230 323185 291592 207851 212182 280444 -20653 -481539
21136 -481539 -464835 -177817 -85347 -230151 -239597 32422 128225 184816 -14632 -151109 -215782
21125b15782j80589j5872l69799Q2293K69705J57371M3690j66228l62576J0496
21115g47291K83029O3031r0056k5851K31209M35j3191j5799L1420n070R5090J86663
21103f381O716j0886O0482o7923q403J51752J15931j06258r6764K5909p2480J50427
21091A42122p7407k36882m45082l7536J49862J64969M7989K0089Q8584m8761L3533
21080a98520P3743K2429J95149K41766k66371m56998k41053K52819j08841o4489
21070e50366k41938l826J51219P2587M13339Q2217q5269j8244Q9765j4227J15050
21059A0307J5319l8340k68690l48273Q2421q6092J17485Q961K57557K65449k15407
21048a99303l19606j21905j45862J24680K69318O5953r2308j27791R673J43496
$$ plain form
21125 -215782 -396371 -412243 -782042 -699749 -430044 -272673 -228983 -395211 -757787 -747291
21115 -747291 -464262 -401231 -491287 -517138 -285929 -285494 -298685 -314484 -283064 -288134 -193044 -6381
21103 -6381 335 -10551 49931 -17992 -26395 125357 241288 135030 38266 64175 -8305 142122
21091 142122 64715 -172167 -617249 -654785 -504923 -339954 -291965 -271876 -183292 -232053 -198520
21080 -198520 -124777 -102348 92801 334567 68196 -388802 -629855 -377036 -485877 -550366
21070 -550366 -792304 -796130 -644911 -572324 -158985 -76768 -162037 -180281 -90516 -104743 10307
21059 10307 25626 -12714 -281404 -629677 -547256 -633348 -515863 -506902 -249345 16104 -199303
21048 -199303 -518909 -640814 -786676 -661996 -392678 -326725 -419033 -546824 -537151 -393655
21038c93655Q9685q4422M6909L06893K61807J40626r3875k55746k21260R0076
21028a12962j41273l7667M385L12893O9834J8951k17583l18427Q3404J86521R465
21017a42459k5752P5975r2746J08093J01366L00463J71114r1038j04077j73354
21007A27585J035m8515J14358K56673l7419k52772j23316l20184n6850L21210
20997a8195R4229o9516m4514J52255K09011K8810J5596n3259j09463q5288j18437
20986A229j6824k45543M0468K35293O6206j52801J6504K7956J46609j76217p727
20975f4847j12251j12322k09783K08852L62275J37923r3174j56265k19955O8518
20965a91029K04008m059M4309j89134j24621J30024M47041o5905k22730k82142
$$ plain form
21038 -393655 -303970 -388392 -341483 -34590 227217 367843 273968 18222 -203038 -112962
21028 -112962 -254235 -291902 -287517 25376 95210 114161 -103422 -421849 -338445 -151924 -142459
21017 -142459 -168211 -92236 -184982 -76889 24477 324940 496054 405016 300939 127585
21007 127585 128620 80105 194463 451136 413717 160945 37629 -282555 -339405 -18195
20997 -18195 76034 6518 -37996 114259 323270 352080 367676 314417 204954 119666 1229
20986 1229 -15595 -261138 -220670 14623 80829 -71972 -55468 -27512 119097 -57120 -64847
20975 -64847 -177098 -289420 -499203 -290351 71924 209847 116673 -39592 -259547 -191029
20965 -191029 12979 8920 53229 -135905 -260526 -130502 316539 250634 27904 -254238
20955b54238K26287k080p5419m6029k19004j82569M5316K65430K43665o102l26677
20944c31420P6923K07940K05344q060m3466j83833p3147j81170j59364K24446
20934b65807j3963k24141K19958j4542l3487K4453R2343j74609P5549j07537l63720
20923g85503k17374J98458J17154J60633K22379M0528j62943j45744n1103J02645
20913e20870J05676K22554r4377k6784K40214L9562J32221j9021j95028k15361
20903c31214p1557l8591l18741R9193M94719J79551j43683P061l06859j98044
20893f28165K33314M21566K41797k13063o7722P5582k75932j47798L7174P1438
20883b51809J80948Q7984j15701l5221J08405j46234j74423L28440L75443j13468
$$ plain form
20955 -254238 -27951 -30031 -105450 -151479 -370483 -553052 -507736 -242306 1359 -4743 -331420
20944 -331420 -254497 -46557 158787 150727 107261 -76572 -149719 -330889 -490253 -265807
20934 -265807 -279770 -503911 -283953 -298495 -331982 -307529 -215186 -389795 -314246 -421783 -785503
20923 -785503 -1002877 -804419 -687265 -526632 -304253 -263725 -426668 -572412 -623515 -520870
20913 -520870 -415194 -192640 -287017 -313801 -73587 -34025 98196 79175 -115853 -331214
20903 -331214 -402771 -441362 -760103 -660910 -166191 13360 -130323 -123262 -430121 -628165
20893 -628165 -394851 26715 268512 55449 -12273 63309 -212623 -360421 -323247 -251809
20883 -251809 -70861 17123 -98578 -133799 -25394 -171628 -346051 -17611 357832 244364
20873B44364j76927k00585l3120j89794L73072K34080j50499j61668L2827J37177
20863A08927o1974J13329n6358m8471J00149j95521k34439j17619J45005l051
20853b50023k56098J3849m221p9563K05879K85193j00545m9119K1847L16671m9701
20842E4169l8821K41511k43185r5949L12796J38300n1856k27878k34512p7804
20832b23229J5848M4412k9836j11812N5280L41172r3392k51671j79364l1713K16067
20821b48238J96389p3152M4337L42273K8346m54886m91914j94419K94299K81414
20811b75551M0260K18484K65162L3753N8268K354P3179l55027k53279m13044j00369
20800g05810J06384L93702M30748K10761k7089q8719j84533j56823o5344l6787
$$ plain form
20873 244364 67437 -133148 -166268 -356062 17010 251090 100591 -61077 -28250 108927
20863 108927 46953 160282 103924 55453 155602 -39919 -274358 -391977 -246972 -250023
20853 -250023 -506121 -492272 -496493 -576056 -370177 -84984 -185529 -234648 -212801 103870 54169
20842 54169 15348 256859 13674 -82275 230521 368821 316965 89087 -145425 -223229
20832 -223229 -207381 -162969 -192805 -304617 -249337 91835 -1557 -253228 -432592 -464305 -248238
20821 -248238 -51849 -125001 -80664 261609 289955 -164931 -656845 -851264 -556965 -275551
20811 -275551 -235291 -16807 248355 282108 340376 342730 415909 60882 -192397 -605441 -705810
20800 -705810 -599426 -205724 225024 435785 408696 319977 135444 -21379 -86723 -123510
20790a23510P4265j7091j71652k47849K07165Q5911K6571M4448R6296J37174n3203
20779E8525P0769K1022k84968j92981P2845J29785j64500O465K48048K56561q127
20768B13444j29368q1975p4370j15064K6852j2429N1304k49695m4272J49695K20788
20757d5090J42528l9552n4396N1202K02138j36872j27784j07875m8270n3054m314
20746b21339P0150K18787L23100k11571j47347o7776K210O2243M7294j80088K9199
20735g5138P3373l67639J01098n7582k50114o3338J6798n3765J61291O4291K3155
20724d27570J97319J83323j25989n0141K51496K53534o7758o9849J51859r8777
20714A97447M5702K257m8506j60429M8385o2074j26688j64468j32689O1214p3157
$$ plain form
20790 -123510 -49245 -66336 -237988 -485837 -278672 -192761 -166190 -121742 -25446 111728 58525
20779 58525 129294 150316 -134652 -327633 -254788 -125003 -289503 -283038 -34990 221571 213444
20768 213444 84076 2101 -72269 -187333 -160481 -172910 -121606 -371301 -415573 -265878 -45090
20757 -45090 97438 57886 3490 54692 256830 119958 -7826 -115701 -163971 -217025 -221339
20746 -221339 -151189 67598 390698 179127 31780 -35996 -33786 28457 75751 -104337 -75138
20735 -75138 -1765 -369404 -268306 -325888 -576002 -639340 -622542 -676307 -515016 -450725 -427570
20724 -427570 -230251 -46928 -172917 -223058 28438 281972 214214 144365 296224 197447
20714 197447 243149 245406 196900 36471 84856 22782 -103906 -268374 -401063 -339849 -413006
20703d13006Q0054J62245m6816q7064n998K90959K34489O7627j94780j84025N2321
20692d3994J60431o9616m06636k17280k2447J07840p5966M929K12809J81752N6712
20681a11466K84007j66621l8899j06700j76272j87218M8658J12527P19j1324K84084
20670f8505K0362j96253k19337j20943Q8814L45263l2841j8757J44518O3119l19499
20659c14059j61532R4837j04442R7433k2151j89725O1723M84446J91688m5291
20649I2927k26642J39298L3354r6716K9782J02142J29437J0513k94366k36234
20639c16505J24305N3509K83144o9737j75323L4305J62342j30926j42367j8377
20629a95630r4181j0437J32822L8696J31022J15342j44939J6198J46632L478k0961
$$ plain form
20703 -413006 -332952 -170707 -217523 -304587 -310585 -19626 214863 282490 87710 -96315 -43994
20692 -43994 116437 46821 -359815 -577095 -599542 -491702 -567668 -562739 -349930 -168178 -111466
20681 -111466 172541 5920 -32979 -139679 -315951 -503169 -454511 -341984 -341265 -352589 -68505
20670 -68505 -48143 -244396 -463733 -584676 -495862 -150599 -183440 -202197 -57679 5440 -314059
20659 -314059 -475591 -380754 -485196 -387763 -409914 -599639 -537916 -53470 138218 92927
20649 92927 -133715 5583 38937 -57779 -27997 74145 203582 214095 -80271 -316505
20639 -316505 -192200 -138691 144453 74716 -100607 -66302 96040 -34886 -177253 -195630
20629 -195630 -289811 -300248 -167426 -128730 2292 117634 -27305 -11107 135525 139003 118042
20618A18042O5224L5756k61056k45229O6118L15143J96989k5320k74451J00929
20608I2145K5704j61018l68307N8863R4260K10666J10133j98721K5974J7121k10701
20597c03881q3935L6613J79038J90768Q6582l04838j15068k0220O9495M03011
20587A37565J87811r5104k26256J22753J00031j05604K2034j50801j55523j02214
20577b65308j31779L32080R5973j60171q1880J91886K02885j08022k02252P5681
20567e0907k34895j50643K12700J73659M0516p5638p3173O9012K5048k46540k29382
20556e40243n7509L26054R3411k24711K69665m2367l36191q2219K62354n2058
20546c83814M7238P4255L15642O3147j61826j92570j2668K0101N7250k5256q7612
$$ plain form
20618 118042 183266 219022 -42034 -287263 -221145 93998 290987 265667 -8784 92145
20608 92145 117849 -43169 -411476 -352613 -258353 -47687 62446 -136275 -110301 -93180 -303881
20597 -303881 -387816 -351203 -172165 18603 105185 -199653 -314721 -334941 -265446 137565
20587 137565 325376 230272 4016 126769 226800 121196 143230 -7571 -163094 -265308
20577 -265308 -397087 -65007 30966 -129205 -211085 -19199 183686 75664 -126588 -50907
20567 -50907 -285802 -436445 -223745 -50086 -9570 -85208 -158381 -89369 -64321 -310861 -540243
20556 -540243 -597752 -271698 -178287 -402998 -133333 -175700 -511891 -594110 -331756 -383814
20546 -383814 -336576 -262321 53321 116468 -45358 -237928 -250596 -230495 -173245 -198501 -286113
20535b86113j06934N8490Q1318O3209r3361J6049n4444J39533r1011j708o318
20524b81290k99123L6621K76643J70689M7346O323k0110j77463j78314m9993K62617
20513b06054J30447p4100n586j72047l8896L15038L74104k39585k57005K6761
20503a46923k78869j787L07191K49795J11616j37800p3699r0271l8893l6866q1372
20492b17878K28674K67512o1440l30986k01332k97901k2432q3324Q9919J89830
20482d39358m5635J57859J41360n2636k26414P0139M24083M7240R4224q9749q7470
20471f357M469l80483R3752J64850J75168j07320Q7500J33946j49539j49350J76146
20460D2782J71943l1729l09179j32864J24213J57471P3834l7578Q7246J42423
$$ plain form
20535 -286113 -393047 -334557 -253239 -190030 -283391 -267342 -321786 -182253 -273264 -274972 -281290
20524 -281290 -580413 -543792 -267149 -96460 -49114 -42791 -62901 -240364 -418678 -468671 -206054
20513 -206054 -75607 -149707 -155293 -327340 -366236 -51198 322906 83321 -173684 -146923
20503 -146923 -425792 -427579 -120388 129407 241023 103223 29524 -60747 -99640 -136506 -217878
20492 -217878 10796 278308 216868 -114118 -315450 -613351 -635783 -719107 -629188 -439358
20482 -439358 -484993 -327134 -185774 -238410 -464824 -394685 29398 76638 170862 81113 -6357
20471 -6357 -1888 -382371 -288619 -123769 51399 -55921 31579 165525 15986 -133364 42782
20460 42782 214725 182996 -126183 -259047 -134834 22637 96471 58893 146139 288562
20450B88562P3913k44862k26791l08146m1681R2763o0014j21893L46248J61734
20440d0167j19359J29713J93785K04909L7659l36828k44192L714J46692q975j42775
20429a75824J44847J48981k42790j00304R6446j19234K7137K2089k5919J46455
20419g8116J61734K3351j47341k1363P7140j35429r6080J15558j77332N1714p5525
20408c01689j04841k1744J83386l4657p571J28293Q0123J31925l4383k16854M515
20397a93497Q3609j5482J5030k734k98827j55912j31857K41961L16980N1137k11904
20386c01496j67128p8776k3675J93427J52919R7772N5963m8822j0643n234n704
20375a41397K51707j7085j74833k58246Q7352J22735r7273J0802n8846J05252
$$ plain form
20450 288562 362475 117613 -109178 -417324 -459005 -366242 -426256 -548149 -201901 -40167
20440 -40167 -159526 -29813 163972 368881 406540 69712 -174480 -170766 -24074 -33049 -175824
20429 -175824 -30977 118004 -124786 -225090 -128644 -247878 -220741 -198652 -224571 -78116
20419 -78116 83618 106969 -40372 -61735 15405 -120024 -216104 -100546 -277878 -226164 -301689
20408 -301689 -406530 -428274 -244888 -279545 -287116 -158823 -78700 53225 18842 -198012 -193497
20397 -193497 -109888 -125370 -110340 -113074 -411901 -567813 -699670 -457709 -140729 -89592 -301496
20386 -301496 -468624 -547400 -571075 -377648 -224729 -126957 -70994 -119816 -130459 -135693 -141397
20375 -141397 110310 93225 -81608 -339854 -252502 -129767 -227040 -216238 -275084 -169832
20365a69832O1130k70591N651L21067K48995k44687j43626k28234j81128J25681
20355d75574k9180L24010K78332K32866k10976p267N5806N3051j59500k38136
20345a76568j20721J67480P6528K6890j89535k08429j4635P193N8001R8424o9966
20334c45338J25577J2893J000j88759J83691K16904j04886m27020l09935J04478
20324g31395N47080K40671j04776n3707J55688L15837l90870l348n7820J27732
20314D5092J42586K82076j43259j37406R396j98410j34906J70017J20055K501
20304A57742J8727j72048Q2290q2809l83576r7077K6830J48113J25195O650K6636
20293a43327r539M7191N3784Q8551o073j58588k27135n8228j95807m0281L09779
$$ plain form
20365 -169832 -108702 -379293 -373642 -52575 196420 -48267 -191893 -420127 -601255 -475574
20355 -475574 -504754 -180744 97588 330454 119478 112211 168017 221068 61568 -176568
20345 -176568 -297289 -129809 -53281 -26391 -215926 -424355 -438990 -431797 -373796 -275372 -345338
20334 -345338 -219761 -206868 -205868 -394627 -210936 5968 -98918 -525938 -835873 -731395
20324 -731395 -184315 56356 -48420 -102127 53561 369398 -21472 -24820 -82640 45092
20314 45092 187678 469754 326495 189089 198485 75 -134831 35186 155241 157742
20304 157742 176469 4421 86711 3902 -379674 -476751 -449921 -301808 -176613 -169963 -143327
20293 -143327 -152866 -105675 -51891 36660 30587 -128001 -355136 -413364 -609171 -649452 -339673
20282c39673O504j61498M0993K08890m35928J47454L83411j41854o3205K17895
20272a37011J79012k5319J6937j89268j17681J60637j670M2213J00134o1677j98115
20261b31808N32J39837m452j92236j03143r0626j8471Q9554J21653L5554J58640
20250i4966k76729O709j59437M0278L04012L41651O8850q8137k39844j37260K74946
20239D0073J16458N3190j47439j41238l7211o9230m2933r6237K64725j8346q3796
20228a61984j30257R887L40612n9981j19009o0142K89075r987k9387P3540r3632
20217D8735K30138K9600k53144o5004J43149L6719k20442j31740P6823l7119o6954
20206b09239j19296j86911k93200J69262J66643K98976R697j03390J27386K15369
$$ plain form
20282 -339673 -333169 -494667 -453674 -244784 -680712 -533258 -149847 -291701 -354906 -137011
20272 -137011 42001 16682 33619 -155649 -273330 -112693 -114363 -72150 27984 -33693 -231808
20261 -231808 -231276 -91439 -95891 -288127 -391270 -481896 -500367 -410813 -289160 -253606 -94966
20250 -94966 -371695 -364986 -524423 -484145 -180133 161518 230368 142231 -97613 -234873 40073
20239 40073 156531 209721 62282 -78956 -116167 -185397 -228330 -324567 -59842 -78188 -161984
20228 -161984 -292241 -282354 58258 -1723 -120732 -180874 108201 98214 68827 142367 48735
20217 48735 278873 308473 55329 -9675 133474 170193 -50249 -181989 -105166 -142285 -209239
20206 -209239 -328535 -515446 -808646 -639384 -472741 -173765 -164068 -267458 -140072 75297
20196G5297j64855J27384J79801j99954j41053J06653J9408J96738j09386J12122
20186B02155L64860L6223j09863n21752m24305K06954l1886K8266j43880m7412
20176d40640K80220R7468J790o0059j37656J29701K95758N5253k45397p5104N329
20165i3337N1651m7028R5184j580j70193J98547J20207j64091L0541O6858k30913
20154a44154q5507j67072j40877J6383q909K04412J29182j51747K9793r2940J79699
20143b31737K72013o8905n7266q6295J22346n6214P7781j26730r6026k2218j43996
20132d17247j00470K12697Q228q8527j38968r3654O6305J13950J69059Q2938j15489
20121c01178j30414j38884q879R8990k5785l0233j15410k5306j02460k8174L13477
$$ plain form
20196 75297 -89558 37826 217627 17673 -123380 -16727 2681 199419 90033 202155
20186 202155 567015 603238 493375 -28377 -452682 -245728 -277614 -249348 -393228 -440640
20176 -440640 -160420 -62952 -61162 -121221 -258877 -129176 166582 221835 -23562 -98666 -93337
20165 -93337 -41686 -88714 6470 4890 -165303 33244 153451 -10640 19901 86759 -144154
20154 -144154 -229661 -396733 -537610 -521227 -530136 -325724 -196542 -348289 -318496 -411436 -231737
20143 -231737 40276 -28629 -85895 -172190 -49844 -106058 -28277 -155007 -251033 -273251 -417247
20132 -417247 -517717 -305020 -296792 -385319 -524287 -617941 -551636 -437686 -268627 -185689 -301178
20121 -301178 -431592 -570476 -579355 -480365 -506150 -536383 -651793 -677099 -779559 -807733 -494256
20110d94256L02073J56800K60710M8186N6267j71377R3328n241l663k0950k85627
20099f3750n5102J02770p7516j71582l6582P4049J93054p8269K8698J96452J15806
20088B28028J78306k46241j97880J71578J7595J64084n2864J33596K4530k35544
20078A85188p0427j29785J0656O3481j861r5247j79698o0733P612K59526J96011
20067A84723P8402l4423j9753j43304k1364o7490L220j25928R308m6016r6391
20056b79016J8654O6501m1948j24318J70861j12129l18797J61963K94040K8482
20046a35707j23459J09480J22138l3751k60511o9780P3138J02257q9005M9545
20036b55655J54354n1557K68688j49308m0996J86850k66375j14293J74221K08880
$$ plain form
20110 -494256 -192183 -35383 225327 273513 329780 158403 251731 246490 242827 221877 -63750
20099 -63750 -118852 -16082 -93598 -265180 -301762 -227713 -34659 -112928 -84230 112222 228028
20088 228028 406334 160093 -37787 133791 151386 315470 262606 396202 420732 185188
20078 185188 114761 -15024 -4368 59113 57252 -37995 -217693 -278426 -270814 -11288 184723
20067 184723 263125 228702 208949 65645 44281 -23209 -19989 -145917 -136609 -182625 -279016
20056 -279016 -260362 -193861 -235809 -360127 -189266 -301395 -620192 -458229 -164189 -135707
20046 -135707 -259166 -149686 -27548 -61299 -321810 -391590 -318452 -216195 -305200 -255655
20036 -255655 -101301 -152858 115830 -33478 -74474 112376 -153999 -268292 -94071 114809
20026A14809J32887R6020o9701k46183l40192Q9579Q7621J75300J52963p8563
20016A14540l71161l4406j6280J87776P9871R8193J15534j77700j6222J71j09526
20005a29210N6884N315J62991j35564l876M15945Q0269j67393o4335p6525N2235
19994A96736J78485n5155k21178l67529P9005O8475j91138j81106k60843L0007
19984g24241L08232K03579p849R1274o2471k12295J17275L46692Q4632k2450J43995
19973B66373J30484j2433k60357l60842j5701l9621J19835M8568L0982m1958K6508
19962a08162j6621J4685r093N0099J12656p3066j78311k26882J01037j3476j47640
19951d94774N0032J05643N7594J45125J18553J09550j56423j11357L4816q4925
$$ plain form
20026 114809 247696 343716 274015 27832 -312360 -222781 -135160 40140 193103 114540
20016 114540 -256621 -291027 -307307 -119531 -39660 58533 174067 -3633 -19855 -19684 -129210
20005 -129210 -72326 -67011 95980 -39584 -43460 372485 452754 285361 221026 144501 196736
19994 196736 375221 320066 98888 -268641 -189636 -121161 -312299 -493405 -754248 -724241
19984 -724241 -416009 -212430 -220279 -129005 -191476 -403771 -286496 60196 144828 122378 266373
19973 266373 396857 384424 124067 -236775 -252476 -292097 -172262 -123694 -92712 -134670 -108162
19962 -108162 -124783 -110098 -119191 -69092 43564 -29502 -207813 -434695 -333658 -347134 -494774
19951 -494774 -444742 -339099 -281505 -136380 -17827 91723 -64700 -176057 -141241 -226166
19941b26166Q2639J88400k58916k63367J91201J97162o0741M8602P0385k27765
19931b58566p9576K37258J40185j61507k5563M6739Q2303n2834m03165q3517L16922
19920b41321j19803j25675K03794K8153k6333j04609J53304K32983k24035j57232
19910c80774J17314k4460r0833j03273O0352O5906J68057J6316j21285j6297O6634
19899b42343J88626Q1022l5455j15680n224j80397k36992J37703J91411j08089
19889c25418J96008J27603J87467L06929k22398m71564r4879n2015R6285o3013
19879c14995M84629P2435j69271k37908q9446J46265j31001n5271L29517K66608
19869C01562j48684p7344R4579j30614q4486k11226J6670j5337j35914P759L78053
$$ plain form
19941 -226166 -143527 44873 -214043 -477410 -286209 -89047 -149788 -101186 -30801 -258566
19931 -258566 -338142 -100884 39301 -122206 -147769 -101030 -18727 -71561 -474726 -558243 -241321
19920 -241321 -361124 -486799 -283005 -254852 -281185 -385794 -232490 493 -223542 -380774
19910 -380774 -263460 -287920 -378753 -482026 -421674 -355768 -187711 -171395 -292680 -308977 -242343
19899 -242343 -53717 27305 -8150 -123830 -129054 -309451 -546443 -408740 -217329 -325418
19889 -325418 -129410 -1807 185660 492589 270191 -201373 -296252 -348267 -251982 -314995
19879 -314995 169634 242069 72798 -165110 -254556 -108291 -239292 -294563 34954 301562
19869 301562 152878 75534 170113 39499 -44987 -256213 -239543 -254880 -390794 -383035 -4982
19858d982K90098o1101N0409O3944l71621j92475J56219l802j27462K0139N6196
19847a24438p5681p112j13367j20984J77796K69124j80485R8469J50337J31555
19837B05214K1144l50037j7334L4557J66362J42699N4554K0542l4703j97962k16513
19826a71477j30768J78810K83139J09831j63999j75456K51973J18647M50J25649
19816D26799p3765j99981J286o2995q4932p0434l1277O2824R3873m1289r2654
19805g2545j12246j25685K57702P45J1782O2683K5602m0007j28229J34160m6141
19794c2179J84664K05475O290l34871k81935m8083M6822K23659k9711j2732j14285
19783a86886J79715J1047n7496J34707p691o1073r7336r1847P8397J8219K14875
$$ plain form
19858 -4982 285116 224015 274424 338368 -33253 -225728 -69509 -73311 -200773 -180634 -124438
19847 -124438 -200119 -207231 -320598 -441582 -263786 5338 -175147 -76678 73659 205214
19837 205214 226358 -123679 -141013 -106456 59906 202605 257159 277701 242998 45036 -171477
19826 -171477 -302245 -123435 159704 269535 105536 -69920 182053 300700 301150 426799
19816 426799 353034 153053 154339 91344 6412 -64022 -95299 -32475 61398 20109 -72545
19805 -72545 -184791 -310476 -52774 -52029 -40247 22436 48038 8031 -120198 13962 -32179
19794 -32179 152485 357960 364250 29379 -252556 -300639 -253817 -30158 -59869 -72601 -186886
19783 -186886 -7171 3876 -53620 81087 73396 12323 -85013 -176860 -98463 -80244 134631
19772A34631J34565j76854k15532q1474l0566n1660K90753K26735p5634J05625
19762B60589k01710j61017l1936l08334q9579r8892M2474j11395K07010K06857
19752b85933n7795J05600J58368K84433q916j70907L624O6362q5773k85067j65948
19741d41952m3150J34061J85084q8060o2469Q7638J26708J34696J55244M473q7792
19730A04481l3324J52123J23052l34792j38016J91781P556k22401m05486p5387
19720f30413M18355Q6544k14606O3071K04354P741l8817J68582l7682P3717j7902
19709H2944k30338l18883p2471j20868Q3089J72518J12172J84683J28207r908
19699A1145J53919j7814l86505n3555p1159K545K33198N4270l25034J2964K70256
$$ plain form
19772 134631 269196 92342 -123190 -204664 -235230 -286890 3863 230598 154964 260589
19762 260589 58879 -102138 -134074 -442408 -531987 -630879 -588405 -699800 -492790 -285933
19752 -285933 -343728 -238128 -79760 204673 195757 24850 28474 94836 9063 -276004 -441952
19741 -441952 -485102 -351041 -165957 -254017 -316486 -228848 -102140 32556 187800 192273 104481
19730 104481 71157 223280 346332 11540 -126476 65305 72861 -149540 -555026 -630413
19720 -630413 -212058 -125514 -340120 -277049 -72695 -64954 -103771 64811 27129 100846 82944
19709 82944 -147394 -466277 -538748 -659616 -576527 -404009 -291837 -107154 21053 11145
19699 11145 165064 147250 -239255 -292810 -363969 -361424 -128226 -73956 -398990 -386026 -115770
19688a15770J54161k8172o7467J58447k107K0980n650j2569J91634M5707o4132
19677B75062k00891J49095l3402k72188J3658p7043l6892J15523P7810p2360j09324
19666a70952P5061K32829K5707k942J94222q7072k49678J78395L9999j95365j96030
19655a55826q8559K61859J44888j66121n9279k31041j5416J00279K08543O7258
19645F6585m1673l29431j11174j05660J96014J31301J02855j04563J4988K78882
19635I8124R9517j21248j17793K7080J86954k5775j44683m3541J12429K5336l04249
19624b07849O7203J27540k1524J07136j24255l11245Q8911m3374p1775M32844
19614D3612K52329l5148q9041r3937P1905l34832k06748L94841L24592r7647K4721
$$ plain form
19688 -115770 38391 10219 -57248 101199 99092 120072 114422 101853 293487 339194 275062
19677 275062 74171 223266 189864 -82324 -68666 -145709 -182601 -67078 10732 -61628 -170952
19666 -170952 -95891 136938 162645 159703 353925 266853 17175 195570 235569 40204 -155826
19655 -155826 -244385 17474 162362 -3759 -63038 -294079 -309495 -209216 -673 66585
19645 66585 24912 -304519 -415693 -521353 -325339 -194038 -91183 -195746 -180758 98124
19635 98124 197641 76393 -41400 -14320 172634 146859 2176 -41365 71064 96400 -207849
19624 -207849 -140646 -13106 -34630 72506 -51749 -362994 -274083 -317457 -389232 43612
19614 43612 295941 260793 171752 77815 149720 -185112 -391860 2981 327573 229926 254647
19603B54647j7551k07954l0780p1239k67043j18396P9011O7713k02916r043K90629
19592b32922K54603o5464m060j40134r3643k5253L36466K39448J39013k47347
19582A60707J54598K73874J26214j71988m20246L1200J02665k9569j4010j89084
19572B4361l91236j03282J96643L3545m8406J13666J03384K40252r9964r7497
19562b8534P4218J22502K9176k71913m0621J66093N3862j95242k3881n4207J28831
19551c9716m1177R5615M2717j89747L5694L9640r8129J82395N9092k08937j01403
19540b23956J12652N4737K3272j85102k3028O9914J13449J24589L0219o6551M0551
19529G0746j79225q1541J06682j49969L3893L8711K31415Q9113K8502j18554J4416
$$ plain form
19603 254647 237096 29142 -1638 -72877 -339920 -458316 -379305 -311592 -514508 -523551 -232922
19592 -232922 21681 -43783 -47843 -187977 -281620 -306873 29593 269041 408054 160707
19582 160707 315305 589179 715393 543405 123159 154359 257024 227455 213445 24361
19572 24361 -366875 -470157 -273514 -239969 -288375 -174709 -71325 168927 68963 -28534
19562 -28534 45684 168186 197362 -74551 -115172 50921 104783 -90459 -114340 -168547 -39716
19551 -39716 -80893 14722 57439 -132308 -96614 -56974 -155103 27292 86384 -122553 -223956
19540 -223956 -111304 -56567 -33295 -218397 -241425 -171511 -58062 66527 96746 30195 70746
19529 70746 -108479 -190020 -83338 -233307 -199414 -160703 70712 159825 188327 69773 84189
19518H4189m4076L8614J00848K79413J31189L12839J82228J45520J42317K03753
19508A576834K80818O05083L71173n31983p18527o57253m41940o8905l45570k41086
19498a71356L6857K53160K52799J08259J0337M4549l44750l41518J0782J12130
19488b8751j03350J23782L00888j05507k84155J41432J9356R1653J45475J17110
19478D17933k74408k83711O6953J96037Q5743l39432k39939q8289L2161R9965
19468c26987L3371J89896L9585k54450M9262J60889p4807O393J44839J92946O3779
19457B24716J67717P3734j68153o9755j91768k41560j60696J31622J08645K92840
19447A67342J6298j34880k0616k503K76324l8308j17400p6716p4988o4241j80807
$$ plain form
19518 84189 40113 78727 179575 458988 590177 903016 1085244 1230764 1373081 1576834
19508 1576834 1857652 2462735 2833908 2301925 1583398 926145 484205 415300 69730 -171356
19498 -171356 -134499 118661 371460 479719 490056 534605 189855 -151663 -140881 -28751
19488 -28751 -132101 -8319 292569 187062 -97093 44339 63695 155348 300823 417933
19478 417933 143525 -140186 -73233 122804 208547 -130885 -370824 -459113 -426952 -326987
19468 -326987 -293616 -103720 -64135 -318585 -269323 -108434 -183241 -176848 -32009 160937 224716
19457 224716 392433 466167 298014 228259 36491 -205069 -365765 -234143 -125498 167342
19447 167342 183640 48760 28144 25641 301965 263657 146257 69541 -5447 -69688 -250495
19436b50495P0120j02611N312N9462L42448M55578J80824M2167L592l41712j17721
19425C46964J31376M1286J30246j78193j12412j38044j86088J6471L097j67690
19415a12987k07243l35856J79528K67555l6625R9156R8595L2227J28071O2490
19405A74911Q6724M5778j24342k86226p8067l00462P3736l42L5870p6341K3557
19394d25204K42336L12645j57545j85980j08574J24463L9202r6363k04057Q8070
19384c71007K71553J44440m4012J57822l7322n8264m212n1847m0623J9777L24032
19373C10337j87137n0502k43507r5335j78070J10777K07901J7839p9190n9690
19363b46577J60198J54311j77904m6277J72229O9729K16495j77262N6449r2035
$$ plain form
19436 -250495 -180375 -282986 -277674 -218212 124236 579814 760638 802805 806397 464685 346964
19425 346964 478340 519626 649872 471679 359267 221223 35135 51606 54703 -112987
19415 -112987 -320230 -656086 -476558 -209003 -245628 -146472 -47877 -15650 112421 174911
19405 174911 261635 307413 183071 -103155 -181222 -481684 -407948 -408290 -372420 -448761 -425204
19394 -425204 -182868 129777 -27768 -213748 -322322 -197859 -158657 -255020 -459077 -371007
19384 -371007 -99454 44986 974 158796 121474 63210 58998 7151 -33472 -13695 310337
19373 310337 123200 72698 -170809 -266144 -444214 -333437 -125536 -107697 -186887 -246577
19363 -246577 -86379 67932 -109972 -156249 15980 85709 302204 124942 181391 89356
19353H9356K538n9650r1072j8419r5793J1490J04558P7820p1993k32641j78973
19342d62779J02233J9219j16405J43886P5359Q0775K36498K01140j6348Q9338
19332C52916J92823m9276q2565l11420j76932Q0436j30198P7446L08352m965K9708
19321B86325N0914J5967P1108j86096j37955l326j27376j49576R0536J87846j7640
19310H0727J69187r0091l99045l5331K45550p4018O9813O731J01528L717Q0958
19299A59726j00441q6310p2239j15010m208K00746K05384K2697j5732j54399k89133
19288b48919Q9878R33L3863L66844J93432J36043k35099l57102l2889J63701l9478
19277G1207j3620p3995j6658K17535k27223j19727l07883K24826K71825N9318
$$ plain form
19353 89356 91894 32244 -58828 -77247 -173040 -161550 -56992 20828 -51165 -283806 -462779
19342 -462779 -360546 -341327 -457732 -313846 -238487 -157712 78786 279926 263578 352916
19332 352916 545739 496463 413898 102478 -74454 5982 -124216 -46770 261582 256617 286325
19321 286325 337239 353206 424314 238218 100263 96937 -30439 -180015 -89479 98367 80727
19310 80727 249914 159823 -239222 -274553 -29003 -103021 -33208 -26477 75051 78768 159726
19299 159726 59285 -27025 -99264 -214274 -218482 -17736 187648 210345 194613 40214 -248919
19288 -248919 -159041 -158108 -124245 242599 436031 572074 336975 -20127 -53016 110685 71207
19277 71207 57587 -16408 -33066 184469 -42754 -162481 -470364 -245538 26287 85605
19267H5605q2058l1036J62293N8201n39060k58449J90321K48396K43373k8382
19257D9204j51555q2593N9137j71011R6101J22514N1693J46192j3028k45936K12893
19246G3611l3365p6377q5144J28481J04519J9888k19617j68181J45694j36064
19236b46555l69446P5974L23151J60030K32492K25467k18848k41434K114N7484
19226D29j03831q3543P3374j33825k13408j34182J79935j940Q9771K54712J10962
19215C8454p4477o1589K0884j65896J0136Q3050J46963J92804J46667j69823n11877
19204c44704j39060j0431j04120O644K14020J25674J67018J42862K10234K4528
19194B92665L4497n7833j33843j31313J3186k20625m6654j4825l7875N0928j5613
$$ plain form
19267 85605 3547 -27489 134804 193005 -346055 -604504 -414183 -165787 77586 49204
19257 49204 -102351 -184944 -125807 -296818 -200717 -78203 -26510 119682 106654 -139282 73611
19246 73611 40246 -36131 -121275 7206 111725 131613 -88004 -256185 -110491 -246555
19236 -246555 -616001 -540027 -216876 -56846 175646 401113 182265 -59169 -57055 429
19226 429 -103402 -186945 -113571 -247396 -460804 -594986 -415051 -416991 -327220 -72508 38454
19215 38454 -36023 -97612 -76728 -242624 -232488 -149438 -2475 190329 336996 167173 -344704
19204 -344704 -483764 -494195 -598315 -591671 -377651 -251977 -84959 57903 268137 292665
19194 292665 327162 269329 135486 4173 17359 -203266 -249920 -264745 -302620 -251692 -267305
19183b67305p2063K47433J97343Q5354J30385n7906l00076k15153j50231J81471
19173b20748J02792O9718J48518j35493K44096K59459J35260l690j48596k40912
19163B10404k47904o3202l22263k8673K9879K53996P1302M8114j94286r6625J0028
19152c29230j10247r785J74453j27256J229P7735Q1877j28872K21494L81859J37760
19141C71017j07788j87778J41853k69522o2368j76062k24186p1929K56436l7552
19131c67879L0372L58345J00393L14045o0734k97598R9706j11134R2409j45523
19121A2402k16998J04198J56084L15301j59473J92984K19757n2662k61038j10620
19111A99935j8101j95931j77040J21225J31487j13142M0371K52762L05721r6223
$$ plain form
19183 -267305 -339368 -91935 105408 190762 321147 263241 -36835 -251988 -402219 -220748
19173 -220748 -117956 -48238 100280 -35213 208883 468342 603602 599912 451316 210404
19163 210404 -37500 -100702 -422965 -451638 -421759 -167763 -96461 -48347 -242633 -339258 -329230
19152 -329230 -439477 -449262 -274809 -402065 -400836 -323101 -241224 -370096 -148602 233257 371017
19141 371017 263229 75451 217304 -52218 -114586 -290648 -514834 -586763 -330327 -367879
19131 -367879 -337507 20838 121231 435276 374542 76944 176650 65516 157925 12402
19121 12402 -204596 -100398 55686 370987 211514 404498 624255 571593 310555 199935
19111 199935 181834 -14097 -191137 -69912 61575 -51567 -11196 241566 547287 451064
19101D51064k52240n9331K81138J04378O5963j04421P3376J13053K22576L53330
19091A248886M48043N34067O26600J099895J929608L211993M656794N083137J706360
19082B0545383l794685n203320l690949k227906j560011o46981j83861n99218
19074B638452l92817q2310K9438M0371R442j20035k23255j80877j48884j52961
19064A416564k51693r9356l86016k1920j87087N117l2335j32011J88343m8127
19054D51479j94902J67250q069N0820j53076o8506l40419j01503K15858K21307
19044B40239K46884k74833j53088r775R8703P6444J66964j9708k24264k6132J97097
19033C18531L5388j33445P159l3015P0292J18030j43773l02982J61541J34390
$$ plain form
19101 451064 198824 139493 420631 525009 590972 486551 559927 672980 895556 1248886
19091 1248886 1696929 2230996 2857596 3957491 5887099 9099092 13755886 18839023 20545383
19082 20545383 16750698 11547378 7856429 5628523 4068512 3421531 3237670 2638452
19074 2638452 2245635 2163325 2192763 2233134 2242576 2122541 1899286 1718409 1569525 1416564
19064 1416564 1164871 1065515 679499 657579 470492 475609 443274 311263 499606 451479
19054 451479 256577 423827 415758 466578 313502 244996 -95423 -196926 18932 240239
19044 240239 487123 212290 59202 49427 148130 224574 391538 371830 147566 121434 318531
19033 318531 353919 220474 227633 194618 264910 382940 239167 -63815 97726 232116
19023B32116N368N0168k04890K01429L2270L5044L05954J36417J23053j02098
19013H14831k65409m7181J28107J46253n0364Q9035K45360R4374M67155J058552
19003B680713J069686J525046K286252L642181N474991N592043O90872m947048
18995A8014736n339385l413128k514100j683866j043390o99665j12961m23473
18987B784768m14502j77384j20416J97678k18161k34736q8826l7372n91002k85883
18977H14164M3040j24723Q9229j58154j23740j96662j30310J74966Q072O1192
18967D57074n6329q1784j36960O433l7705K31019L61091n5116k06729k01943j1568
18956B67483J0370k7819j27939K3875n0946j92606j7316L64265J93429L5389n7176
$$ plain form
19023 232116 237484 287652 82762 284191 316461 351505 657459 793876 916929 814831
19013 814831 549422 502241 630348 776601 726237 815272 1060632 1155006 1622161 2680713
19003 2680713 3750399 5275445 7561697 11203878 16678869 22270912 22961784 18014736
18995 18014736 12675351 9262223 6748123 5064257 4020867 3321202 3208241 2784768
18987 2784768 2370266 2192882 2072466 2270144 2051983 1817247 1728421 1691049 1100047 814164
18977 814164 857204 732481 821710 663556 539816 343154 212844 387810 395882 457074
18967 457074 400745 318961 182001 188434 150729 381748 742839 687723 480994 279051 267483
18956 267483 277853 250034 122095 145970 95024 -97582 -114898 249367 442796 478185 421009
18945D21009N3995j96076j07073M0447J12196j59589J8340L7168J8490R049p5930
18934A72026K09463J68146k10395K3869k51861p0550K72657l5124j01243q5845
18924I1143N0745K21831k89701l94715n0578J86101K30978J03979K16628K30671
18914E97082j52189l15902k2712L70074J90343l2804l52391k07195j04097K32378
18904B02587J91252J58234l85591j73323J28283J32766j03409o7265M351M4045
18894A31930Q6774m2545m5297L3296j89379j28903o1148K34198L58258p9146l2713
18883B65325K80560p867j64797J35477p6806l64103K2680J8213K2577N890k196
18872A34953Q2349L7317j67032O0287l9414R5511J7745L2756J82146M5813k2961
$$ plain form
18945 421009 475004 278928 171855 212302 324498 164909 183249 220417 238907 247956 172026
18934 172026 381489 549635 339240 363109 111248 40698 313355 278231 176988 91143
18924 91143 141888 363719 74018 -320697 -371275 -185174 45804 149783 366411 597082
18914 597082 444893 128991 106279 476353 666696 633892 281501 74306 -29791 202587
18904 202587 393839 552073 166482 -6841 121442 254208 150799 83534 87885 131930
18894 131930 218704 176159 130862 164158 -25221 -154124 -215272 18926 377184 298038 265325
18883 265325 545885 538018 373221 508698 431892 67789 90469 108682 131259 137149 134953
18872 134953 217302 254619 87587 147874 108460 203971 221716 254472 436618 482431 459470
18861D59470k0733k55881j81830q4683O117K01414J92859l0628m4224k6042J11914
18850C27753j02734m4273J35932k46850j17224J63865J21685k16413o3348L49282
18840C07675j16367l4064J74666P2029L3858k64617p0113j67108K9744J23632
18830H9335Q0544K99048q6473j04714j88155m4367J86878K3223J06335N5498k30580
18819A86572k06120N088k23681J35091J83188o4739j22057j31496J34358M5738
18809e8058J17038J40728P6573k235J63359j1235q793L8339p3247j31639o6111
18798A84719j00365J51532n7998m4531R6854j35576J87744P3978K4721r3375K9378
18787C17081Q4476K4407l55864k80877o491K29296L82925m8591k53953l87408
$$ plain form
18861 459470 438737 182856 1026 -83657 -77540 123874 316733 286105 241881 215839 327753
18850 327753 225019 180746 316678 69828 -47396 116469 238154 21741 -41607 307675
18840 307675 191308 157244 331910 403939 437797 173180 103067 -64041 -34297 89335
18830 89335 169879 468927 382454 277740 89585 45218 232096 255319 361654 417152 186572
18819 186572 -19548 -14460 -238141 -103050 80138 15399 -106658 -238154 -103796 -58058
18809 -58058 58980 199708 276281 274046 437405 426170 417377 455716 382469 250830 184719
18798 184719 84354 235886 177888 133357 230211 94635 282379 356357 381078 287703 317081
18787 317081 401557 425964 70100 -210777 -217268 12028 394953 346362 92409 -294999
18777b94999j70725j50908j28795J4979K99098J32801M4279n5562j4750m6658
18767c71240j78197O9178K15194O8621J22412K71867K07369K14051K95710M08713
18757A323678L02556J79634J24299m3899m7362l09936j77120M437k29394o7478
18747A059415p3224j44832l16654j10231R9621P1366L2638p3089O7840q166m8037
18736E56647j33128j63085j66231n8137O5302J08080j69957k07828o9337J78717
18726e8957M21596r1616k57483k6640r508k59103Q2517K14103N3847o3992k14833
18715b10069J59661j023j6046J76944J17124J19092j16431j17585k35030k87685
18705d11048K0139L88364J7263k35263J14971k872r5011n6171r9814J30460K82296
$$ plain form
18777 -294999 -465724 -616632 -745427 -730448 -431350 -298549 -254270 -309832 -324582 -371240
18767 -371240 -549437 -480259 -265065 -196444 -74032 197835 405204 619255 914965 1323678
18757 1323678 1626234 1805868 1930167 1886268 1838906 1528970 1351850 1356287 1126893 1059415
18747 1059415 986191 841359 524705 414474 514095 585461 618099 545010 612850 604684 556647
18736 556647 423519 260434 94203 36066 101368 209448 39491 -168337 -237674 -58957
18726 -58957 362639 271023 13540 -13100 -22608 -281711 -199194 14909 68756 4764 -210069
18715 -210069 -50408 -51431 -67477 109467 226591 345683 229252 111667 -123363 -411048
18705 -411048 -390909 -2545 14718 -220545 -105574 -108446 -203457 -259628 -359442 -228982 53314
18694E3314K81922j62997j44685J18254j420N8822L07566j61447n85172k74337
18684e10180J07905K0614K94694K21551j97888r1111K58231l3923n1035M2561
18674F1419q547J01975J4333R6872k7430j42421m9380J00241r2602k93644L9559
18663a99625R8703J01619L50176O2594J58247N32274N13808L39760K86085J71241
18653B414882j94082l80974j35349j81595l62295j40798o6387r3207R1690l4016
18643I17869k57956j73866j22653k20447k6134K78379P2053j7384p8715j40247
18633B30899J77846M328n7993p3281k63350k38224K05234J56007k49529K83433
18623A75370K34148o7337Q0822n8798k21086j39334J52221J22126J6485j25273
$$ plain form
18694 53314 335236 172239 27554 145808 144388 203210 510776 349329 -235843 -510180
18684 -510180 -402275 -381661 -86967 134584 -63304 -154415 103816 69893 18858 61419
18674 61419 52872 154847 169180 266052 238622 96201 46821 147062 54460 -239184 -199625
18663 -199625 -100922 697 350873 413467 571714 1103988 1617796 1957556 2243641 2414882
18653 2414882 2220800 1839826 1704477 1522882 1160587 1019789 953402 860195 951885 917869
18643 917869 659913 486047 363394 142947 116813 395192 467245 449861 371146 230899
18633 230899 408745 413073 355080 281799 18449 -219775 -14541 141466 -108063 175370
18623 175370 409518 342181 423003 364205 143119 3785 156006 278132 294617 169344
18613A69344n7860j33234L1680j61045J04536K76907j05673k26861k25451L6407
18603b91250K05498L42076j68604j10334p659O7115K07686J55113k04031j03465
18593I2145k05325j31058j13318K23208K70345Q2444l25373J65766J0201l6575
18583C2460J17011J41108k9890k11962P145K9526L1421j09193R9034j08912J22554
18572A20302r5416j89267j42559j5220L95730J39887m0853p9194K16006M1780
18562C51196l7634j64062N3857K6237J30568j13635j2213M9902j96057j66042
18552g7883J89886J74684j33434j71388M1149j726k03600K1771P7950J34790j53378
18541a01179K4064K62242J13650j89848k79234k4984J28132J13383J12696j55041
$$ plain form
18613 169344 111484 -21750 9930 -151115 -46579 230328 124655 -102206 -327657 -291250
18603 -291250 -85752 256324 87720 -22614 -30273 36842 244528 399641 195610 92145
18593 92145 -113180 -244238 -357556 -134348 135997 218441 -106932 58834 69035 32460
18583 32460 149471 290579 260689 48727 55872 85398 116819 7626 106660 -2252 120302
18572 120302 24886 -164381 -306940 -322160 73570 213457 172604 93410 309416 351196
18562 351196 313562 149500 203357 229594 360162 246527 234314 284216 88159 -77883
18552 -77883 112003 286687 153253 -18135 23014 21288 -182312 -160541 -82591 52199 -101179
18541 -101179 -77115 185127 298777 108929 -170305 -195289 -67157 46226 158922 3881
18531C881K9308J98603J24770l9325j5036K03521r4957J2144k32160j69317P5795
18520I7227N8494J12016P6182j41013M1117K07430q1372k13274k12883J24933
18510F8857J28516N5940O6387K32225m120L7163O4657l34451j48310j35920j82797
18499a51853j19333K30559J78594L7862L41344J55983k24950K13652L3690j41801
18489E53747k48778k0929J58830j21464J20835j86546j92865P3547M7213j01811
18479H1779k15890j49459J95075K22511L42879M2161j67390Q274l6479K5553O6096
18468D15110q5203q1834n0530L5178q4174j99951k3975N18047J81622j79889j40092
18457C04309q1439J0458p6520K36804L22299R1651q5081p9826k87141j84311J395
$$ plain form
18531 3881 33189 231792 356562 317237 302201 505722 410765 422909 190749 21432 97227
18520 97227 155721 267737 343919 202906 244023 451453 370081 156807 -56076 68857
18510 68857 197373 253313 319700 551925 547805 584968 649625 315174 166864 30944 -151853
18499 -151853 -271186 -40627 137967 175829 517173 673156 448206 661858 695548 553747
18489 553747 304969 284040 442870 321406 442241 255695 62830 136377 183590 81779
18479 81779 -134111 -283570 -88495 134016 476895 519056 351666 359940 323461 349014 415110
18468 415110 329907 248073 197543 232721 148547 -51404 -75379 442668 624290 444401 304309
18457 304309 222870 233328 156808 393612 715911 807562 722481 642655 355514 171203 172598
18446A72598K32873J46710n7073j46095j79725j56081K17861K13194Q644r1799
18436C61107k18295j46127M21587J70152j96186J84071J11132k76546l28711J3431
18426I5615R8254j60482m6463J31102L1136L22796L6427P1686J57840k84006j14198
18415C39707J26269Q0634Q0353N4663J52611N1436j45027j49884k68522q7283
18405B34957n6779K13033J28131k26443j65715J84123P3456K06130l905q4091
18395E02897j20141k06554Q6646K62998N6431O754l31638J12452J81722o8416
18385D83151K91289J94699j04883r7129r4526l30166o9579R3348j21016L209j24347
18374A24050j13853J80972L53208J77842j08645P8563J47547p257K14741M5606
$$ plain form
18446 172598 405471 552181 495108 349013 169288 13207 231068 444262 452906 361107
18436 361107 142812 -3315 418272 588424 392238 576309 687441 410895 82184 95615
18426 95615 193869 33387 -13076 118026 149162 471958 508385 580071 737911 453905 339707
18415 339707 465976 546610 626963 681626 834237 885673 740646 590762 322240 234957
18405 234957 178178 391211 519342 292899 127184 311307 384763 590893 586988 502897
18395 502897 382756 176202 262848 525846 582277 589031 257393 369845 551567 483151
18385 483151 774440 969139 864256 767127 672601 342435 272856 366204 245188 248397 124050
18374 124050 10197 191169 544377 722219 613574 692137 839684 832427 1047168 1092774
18364A092774p9330j77870k14966J23137p0375l457j23723m4477K82432K92958
18354A077103j04000k71756j95493N5892O1726K3332k21803K0066J37062O0974
18344F43103J6718K79766J80559K129r4660J766J96269N0840j33769j67686j27077
18333H47958j73723k09023L25128N7174J05075J02904j16818j64060j49861k0048
18323F04706k8443K52296K38410k62980j95361m1850J19801K48903P208j71565
18313G71125k7934J6548Q3774J85346O527j09990J36169k01815k6425N1364j93153
18302F91536J65421K42012p600M9486K87858r255j24865j22130Q6251J62246J97596
18291A618556N437k10531n5669r3187K58696N7466K074m066J20662J30905p3871
$$ plain form
18364 1092774 1013444 835574 620608 743745 673370 669913 546190 501713 784145 1077103
18354 1077103 973103 701347 505854 561746 623472 646804 425001 445067 582129 643103
18344 643103 659821 939587 1120146 1122275 1027615 1029381 1225650 1276490 1142721 975035 847958
18333 847958 674235 465212 790340 847514 952589 1055493 938675 774615 624754 604706
18323 604706 576263 828559 1066969 803989 608628 566778 686579 935482 942690 771125
18313 771125 743191 759739 843513 1028859 1035386 925396 1061565 859750 833325 884689 691536
18302 691536 856957 1098969 1091369 1140855 1428713 1419458 1294593 1172463 1258714 1420960 1618556
18291 1618556 1623993 1413462 1357793 1264606 1523302 1580768 1582842 1578776 1699438 1830343 1756472
18280A756472p3986K04796J72694K2444L20356L0683q0996K48073k2367O6876
18270B645045n0682K22385J76330K2060K65249O08256O58941M74275L86219N59068
18260E967146P21093Q74414P16106K76579K7002L63732P97129J133774J587926
18251A2464901J779912K016553K883027L107136M461122O631575R423122J3731017
18243E6498365K0283795L1220607M7637365O8322331R0005585Q3328623P868776
18236D05165447p6839504r0710025o6460330m2967578k7772054j8160960j2322832
18229F9932164q461914o239906m188834k590186j632292j952622l181326m066729
18221C7618355m079993l523978k816385k183062j939452k199925k373546k032458
$$ plain form
18280 1756472 1682486 1887282 2059976 2082420 2402776 2433459 2352463 2600536 2578169 2645045
18270 2645045 2594363 2816748 2993078 3015138 3280387 3888643 4547584 5021859 5408078 5967146
18260 5967146 6688239 7562653 8278759 8555338 8582340 8946072 9743201 10876975 12464901
18251 12464901 14244813 16261366 19144393 22251529 26712651 33344226 42767348 56498365
18243 56498365 76782160 108002767 155640132 223962463 313968048 397296671 405165447
18236 405165447 328325943 237615918 171155588 128188010 100415956 82254996 69932164
18229 69932164 61470250 55230344 51041510 48451324 46819032 44866410 41685084 37618355
18221 37618355 33538362 30014384 27197999 25014937 23075485 20875560 18502014 16469556
18213A6469556j730010j478435j094050j088818q81457r12990q47242p36099n69298
18204G131157n82717m66420m48170j74420N3134l65271k34844k27708l31395k60097
18194D093249j21608p6507j57131k1194k11820r2294j13545M2557q1943P8211
18184C337975Q8797O5842m45139l3022m9366l3544M08248J99409J29627K45869
18174C914696K58808N4350L84213M67418K21934O72354J619257K351311L084962
18165A3029303M596368N121644K063245k701972l769731k392418j060943l14209
18157A4571287j05420m35059l71422J56448O92758J510480K278090L003934L235404
18148B4536500L270715M072052N842203Q637591J2687641J9218379K8908973M4695457
$$ plain form
18213 16469556 14739546 13261111 12167061 11078243 10196786 9283796 8436554 7700455 7131157
18204 7131157 6548440 6082020 5633850 5459430 5512564 5147293 4912449 4684741 4353346 4093249
18194 4093249 3971641 3895134 3738003 3716809 3504989 3412695 3299150 3341707 3259764 3337975
18184 3337975 3426772 3492614 3047475 3014453 2965087 2931543 3339791 3539200 3668827 3914696
18174 3914696 4173504 4227854 4612067 5079485 5301419 5973773 7593030 9944341 13029303
18165 13029303 17625671 22747315 24810560 22108588 18338857 15946439 14885496 14571287
18157 14571287 14465867 14030808 13659386 13815834 14508592 16019072 18297162 21301096 24536500
18148 24536500 27807215 31879267 37721470 46359061 59046702 78265081 107174054 151869511
18140A51869511O6439684R3301992J14024893Q1416581k8278206j07542217j03860452
18133B67371786p2710728m6939490l0050580j9998087j3821326r852548p342987
18126F6656040m896537l060739k013377k352452l961152n217605n188338m052101
18118C5913739l363538k857993k764772k878042k803047j952363j900681k017676
18110A5375627j768963j504007j317104q82985p33227q49836q74820k95388m01372
18101F747925m70132m69893j48819m70328p19483n74222l44107k74395m60873
18092B815673n5691k06500L8545j6526p8793l09453l60139L0724n3826j57580
18082A646434O1448k7164R4689O2215P0447Q1246k35419J07044K93091J85722
$$ plain form
18140 151869511 218309195 311611187 425636080 507052661 478774455 371232238 267371786
18133 267371786 194661058 147721568 117670988 97672901 83851575 73999027 66656040
18126 66656040 61759503 58698764 56685387 54332935 50371783 45154178 39965840 35913739
18118 35913739 32550201 29692208 26927436 24049394 21246347 19293984 17393303 15375627
18110 15375627 13606664 12102657 10785553 9902568 9169341 8319505 7444685 7149297 6747925
18101 6747925 6277793 5807900 5659081 5188753 4469270 3895048 3550941 3276546 2815673
18092 2815673 2759982 2553482 2592027 2575501 2496708 2187255 1827116 1857840 1804014 1646434
18082 1646434 1707882 1680718 1775407 1837622 1908069 1989315 1753896 1860940 2154031 2339753
18072B339753M5729K91030M56219P75921J568410K300882L268856M992632N770117
18063B1809549K981911l686768n844491m670517l017129k116703j307081p66065
18055C382706k78346k51680l35406J42032K37098J976m1454j19704l69471l56171
18045B011580l43206J54650K632q4721k35578j40660n23o6038m99751o813J03342
18034H94914j70702j73948L5813J45736l46276o6327L67212P8688j06110Q0560
18024G39560P9168J82158M2013j28317k11403N4888P4715p0455M7623K4488j46031
18013F88407n2674P3971r2343l08137j27146K5327N1472M9116N1932L5290r4983
18002C00232j89589j64802o6157R1270J29032j07682O5744J78393R1021m1004
$$ plain form
18072 2339753 2385482 2676512 3132731 3908652 5477062 7777944 11046800 16039432 21809549
18063 21809549 24791460 21104692 15260201 10589684 7572555 5455852 4148771 3382706
18055 3382706 3104360 2852680 2517274 2659306 2896404 2898380 2856926 2737222 2367751 2011580
18045 2011580 1668374 1823024 1825656 1740935 1505357 1364697 1364174 1298136 798385 791572 894914
18034 894914 724212 550264 586077 731813 385537 319210 686422 765110 659000 739560
18024 739560 818728 1000886 1042899 914582 703179 758067 832782 762327 809950 834438 688407
18013 688407 635733 709704 617361 309224 182078 207405 258877 307993 359925 395215 300232
18002 300232 110643 -54159 -120316 -29046 99986 -7696 58048 236441 327462 286458
17992B86458k09133j95562P6532O7095j03483K2879J64093j04335K82007J97836
17982D84387K24002O8192Q7179k06153J77248k39142m18242q3499j68265J0886
17972f3407N0758l8932K95099l2137n0629j93691k39656q5829j8817K41406j00944
17961b36779J13649J47280N3761O5202j66182Q7116J45441j26736j84034j24782
17951b26064R6427L54704K27620r1305j69501q1345k45211J73900j3577j50030
17941a24382j63847R2076K93287M3865j59240m0605j36693Q3792J05147N1396
17931D4796R7482O0507j80467o5486J73881M05999o8132l39037k28833p0096K0966
17920a48420k23463j29610J56395J77522N2459J18092O1403q9951l7919K39062
$$ plain form
17992 286458 77325 -118237 -41705 25390 -78093 -55214 108879 4544 286551 484387
17982 484387 708389 776581 863760 657607 834855 595713 177471 93972 -74293 -63407
17972 -63407 -12649 -51581 243518 211381 160752 -32939 -272595 -358424 -377241 -135835 -236779
17961 -236779 -123130 24150 77911 143113 -23069 64047 209488 82752 -101282 -226064
17951 -226064 -129637 225067 452687 361382 191881 110536 -134675 39225 25648 -124382
17941 -124382 -288229 -196153 97134 140999 -18241 -58846 -195539 -111747 -6600 44796
17931 44796 142278 202785 22318 -43168 130713 536712 468580 129543 -99290 -169386 -148420
17920 -148420 -371883 -501493 -345098 -167576 -115117 2975 64378 -25573 -63492 175570
17910A75570J76532K85325l3082k62210r6217j18884J57488o651K20272R2988
17900E91131j93531l15344j28576K23269K91964J12201j53844o9729l9864Q8092
17890D05769k32747l87069o971j67437K17787Q2261m8158K66478L58428J67685
17880F56026j8492O315J30505J08162J20666K32760J85225N21613M07542Q71678
17870C222000J223337J964976K953455M276539N509763M634675q87133n689281
17862A7208331n220808l263988j950600j205709q14805p20497m18338r0649R3117
17853C616054j08243r3437L10741L04550n7325o1322j21080n47209l53826m45209
17843B443694n43483n40408k22590M303q3973l1335j85855M388L912k63484n632
$$ plain form
17910 175570 352102 637427 604345 342135 245918 127034 284522 277871 498143 591131
17900 591131 397600 82256 -46320 176949 468913 581114 427270 357541 317677 405769
17890 405769 173022 -214047 -221018 -388455 -170668 -88407 -136565 129913 488341 656026
17880 656026 637534 643849 774354 882516 1003182 1235942 1421167 1942780 2350322 3222000
17870 3222000 4445337 6410313 9363768 13640307 19150070 23784745 22897612 17208331
17862 17208331 11987523 8723535 6772935 5567226 4752421 4031924 3613586 3522937 3616054
17853 3616054 3507811 3414374 3725115 4029665 3972340 3911018 3789938 3242729 2888903 2443694
17843 2443694 1900211 1359803 1137213 1141516 1057543 1026208 840353 844741 848653 585169 579537
17832E79537K1154J35703M40J24007j34441q7795N2177n9069p1237k4387j23446
17821D12643j12297k10464J27097L20715K67985L71703j49626j06639l5041j28021
17811G58055r8491l22482j26419J12004J85945P3950k24307l4973j66197J9101
17801A76186j30524K98014M55787m5835N405j64247k32812n279N10875J15805
17791I83375k58641P2232L59934J28875L93336O54762M87927R34182J573060K749468
17781H078510L934091N037773L812400j698760n230561m149784k442777j451428
17773E889464j256678r50501n01112k24847j14631m81494l57250K2615K6910M9616
17763B102092k70458k53745l07098m07848j82156L3052m8343K05390j85237k22557
$$ plain form
17832 579537 600691 736394 736834 860841 726400 638605 690782 631713 560476 536089 412643
17821 412643 300346 89882 216979 537694 805679 1177382 1027756 921117 886076 758055
17811 758055 659564 337082 210663 322667 508612 582562 358255 323282 157085 176186
17801 176186 45662 343676 799463 753628 759033 594786 361974 356695 867570 983375
17791 983375 724734 796966 1156900 1285775 1679111 2333873 2821800 3755982 5329042 8078510
17781 8078510 12012601 17050374 20862774 19164014 13933453 9783669 7340892 5889464
17773 5889464 4632786 3682285 3181173 2956326 2841695 2360201 2002951 2025566 2052476 2102092
17763 2102092 1831634 1577889 1270791 862943 680787 713839 665496 870886 685649 463092
17753D63092j22814J35606J05036J72094K92966K89500J38723j07969M0929m7852
17743A359311o16926k24853N4294J07485m6606j32980k71878K12299J39986l50528
17733B29604m21313J9848K28976L5262m944p0918L7515j15651K22242J34275K50222
17722E45118M91133L53086K76816K14545o2715l1366q1254j33272k69237l37508
17712I65346k54081j60309k00052R4686j2367p2405J58311K14938k95429k26888
17702B11750N0777J5795k11603p1625m2136m5707R1892K08040k61293j23784L74532
17691A96638L42202k43384l05572q2662N3439N9734M9943J82180L1488k44124
17681C9882j91002j14702P8105j00501K6784L56006p8901k52320j94487J83243
$$ plain form
17753 463092 340278 475884 580920 753014 1045980 1335480 1474203 1366234 1407163 1359311
17743 1359311 742385 517532 571826 679311 632705 499725 227847 440146 580132 229604
17733 229604 -191709 -171861 57115 92377 87433 16515 54030 -61621 160621 294896 545118
17722 545118 1036251 1389337 1666153 1880698 1817983 1786617 1705363 1572091 1302854 965346
17712 965346 711265 550956 350904 445590 433223 360818 519129 734067 438638 211750
17702 211750 262527 278322 66719 -4906 -47042 -92749 -857 207183 -54110 -177894 196638
17691 196638 538840 295456 -10116 -92778 -39339 20395 70338 252518 284006 39882
17681 39882 -151120 -265822 -187717 -288218 -261434 94572 15671 -236649 -431136 -247893
17671b47893J81468j77842r045J07633P0450J56884j3854O0814m384r6136q1260
17660e3165J21079K11921J19996L078j92106k77870M1776R5599P695k42314M558
17649a59753m1838J28847K45694M9369J73449k3098j35216l35637q4650J32311
17639e0522l5366L3825o704m5913K99325K99546K1871q690j08110l30224Q7054
17628A56092J02567n2163k03813J90919R4183J74842R4245O00456O75194K01487
17618B034009j54951j34412o9695j53483j02838l56294m7397o4054l4948N8209
17608I74146J0365k5199j07766q029j30062k07503O3941J9173k80810q5748J16502
17597C39010M0160j35833j65831j92412R410N4605K64232J70535o3407Q0964K9789
$$ plain form
17671 -247893 -66425 -244267 -253312 -145679 -75229 81655 67801 128615 124231 28095 -53165
17660 -53165 67914 279835 399831 402909 210803 -67067 -25291 70308 78003 -164311 -159753
17649 -159753 -201591 -72744 172950 222319 395768 372670 237454 -98183 -182833 -50522
17639 -50522 -85888 -52063 -58767 -104680 194645 494191 516062 507372 399262 69038 156092
17628 156092 258659 206496 2683 193602 287785 462627 556872 1157328 1832522 2034009
17618 2034009 1879058 1744646 1674951 1521468 1418630 1062336 1014939 950885 915937 974146
17608 974146 984511 959312 851546 843517 713455 505952 569893 589066 308256 222508 339010
17597 339010 379170 243337 77506 -114906 -105496 -50891 213341 383876 320469 401433 431222
17586D31222K03063J6631p5328j17487l79087p0377M6601M00326k4911J3281J57681
17575F01615N4410j93880J88458M2623k6399K28639r3463k69598m5637O2326k52449
17564B96645j48034m4333P4804J08415o0861k53226K9832J97707j52806l6072
17554A2071J98257n4098j90276k130J82127J44191j17177P7600j2665J03799K51460
17543E93159O4065k2762n8007k19210k65334n8124k12953J46322M52240L0067
17533D49463l43462M4221J40168J5585M2119j52203n548J85785J05991r256J33598
17522F06461j01156j01043J9670R4792J21212L3414j47156r5072p1849K1181j47132
17511B33322k9188K87950m4730j23503J15903r6412j72810j05297J65024K03968
$$ plain form
17586 431222 634285 650916 575588 458101 79014 8637 55238 455564 430653 443934 601615
17575 601615 656025 462145 650603 693226 666827 895466 802003 532405 486768 549094 296645
17564 296645 148611 104278 179082 287497 226636 -26590 3242 200949 48143 12071
17554 12071 210328 156230 -34046 -36176 145951 290142 172965 250565 237900 341699 593159
17543 593159 657224 634462 576455 357245 91911 33787 -179166 -32844 419396 449463
17533 449463 106001 150222 290390 305975 348094 195891 190343 376128 482119 472863 606461
17522 606461 505305 404262 423932 518724 639936 673350 526194 431122 359273 380454 233322
17511 233322 204134 492084 447354 323851 439754 343342 170532 65235 230259 434227
17501D34227m1147j41188q9627Q8525L65927O2050j37104o3573N1728M36095J5364
17490I81277l01256Q4575J15060p8091J21435L07351M3349j10014j14926l91425
17480F57335k60996j39350j66132K43996M51877j8357j37961j28559k18255k9907
17470B53691J32064P73o2606L8057J24452j51578M6972k69394J23038J76349J57868
17459E69686N5119K84902p4784j09544N0184M8754J34743m6734l00619Q383n7362
17448E62728J36852k8124k17110K26432L9925k43033o8526K98476N8443k18289
17438E47774k37461M6662J31020J58074j61348J15192J05582q7825m7760J00449
17428F70359k46882k12675K0985k10963j51225K63626L77470K72803J83215j03593
$$ plain form
17501 434227 393080 251892 162265 250790 616717 678767 541663 478090 529818 965913 981277
17490 981277 680021 764596 879656 801565 923000 1230351 1273700 1163686 1048760 657335
17480 657335 396339 256989 90857 334853 786730 768373 630412 501853 283598 253691
17470 253691 385755 386528 323922 361979 486431 334853 381825 112431 235469 411818 569686
17459 569686 624805 909707 834923 725379 775563 824317 959060 912326 611707 620090 562728
17448 562728 699580 671456 454346 680778 720703 477670 409144 707620 766063 547774
17438 547774 310313 356975 487995 646069 484721 599913 705495 617670 569910 670359
17428 670359 423477 210802 231787 20824 -130401 133225 510695 783498 966713 863120
17418H63120j67118J15793K33037q4178j34441J03927J14408k43276J99746j26742
17408H74276k50992j74237J73176m348K65935K60709q3590l23706R1956M38590
17398A267769k0889m941N3295l5037j18178l9353K50112P638R909P920k43356
17387A134889j91539n0809L543K76757K9030K19195J85711L72409J25253k44303
17377A860136k05827l8594M3555J49953L22556N9170J14284R4829p0612L66933
17367B696383K91286J86892L13055k6962O152J53522J04923O10305N79656N43689
17357E458901L79601N35442R00095J203785J480503J049116L68145p4033N81711
17348A1883266O57682J263244J951722K317637L071923M607999O042940P832726
$$ plain form
17418 863120 696002 811795 1044832 960654 826213 930140 1044548 801272 1001018 874276
17408 874276 623284 449047 622223 617875 883810 1144519 1060929 737223 829179 1267769
17398 1267769 1246880 1241939 1295234 1260197 1142019 1102666 1352778 1360416 1370325 1378245 1134889
17387 1134889 943350 892541 896084 1172841 1201871 1421066 1606777 1979186 2104439 1860136
17377 1860136 1654309 1615715 1659270 1809223 2131779 2190949 2305233 2400062 2329450 2696383
17367 2696383 2987669 3174561 3487616 3460654 3466806 3620328 3725251 4335556 4915212 5458901
17357 5458901 5838502 6373944 7274039 8477824 9958327 11007443 11375588 11301555 11883266
17348 11883266 12540948 13804192 15755914 18073551 21145474 25753473 31796413 39629139
17340C9629139J0633122J5969464K5070743L9840260O1802943R0189999J20548814
17333D03684484J11440628M544315j07479761j19018982q4210757n3020836l3066986
17326A22872105k1462011j4502296r885606o933064m608830l841521l151787k843033
17318E5643957l723639m231920l743472l424818k831614j979540j175534K87326
17310C4820746K221816L854852J380258n241817p518046n862902l816321k794068
17302A7044518k063088j711596j258552n77895p96271m98836n38671o00704n30186
17293H468719o09622p23195o04233o36024m42891k49987k78200k35254n24751
17284D164562j71873N8209j75327n18755k01544K61309o9806k32733j10163l60356
$$ plain form
17340 39629139 50262261 66231725 91302468 131142728 192945671 283135670 403684484
17333 403684484 515125112 519669427 412189666 293170684 208959927 155939091 122872105
17326 122872105 101410094 86907798 77022192 70089128 65480298 61638777 58486990 55643957
17318 55643957 51920318 47688398 43944926 40520108 37688494 35708954 34533420 34820746
17310 34820746 37042562 40897414 42277672 37035855 29517809 23654907 19838586 17044518
17302 17044518 14981430 13269834 12011282 11433387 10637116 10138280 9599609 8998905 8468719
17293 8468719 7859097 7135902 6531669 5895645 5452754 5202767 4924567 4689313 4164562
17284 4164562 3992689 4050898 3875571 3356816 3155272 3416581 3346775 3114042 3003879 2643523
17274B643523Nr111q892L6446K96469j13292J59814J45334J5052l6254K49743
17263C378837K31455J94373J01500J46189L08142K76984M56644J86453K18869
17254E499446K20749O96204R75662R51002N52657L27064L69911J103838R77585
17245A1674118J584380K352400K923749M020334M960991O755633R497854J4767390
17237E8536849K3545537L6832951N5787224Q0980844J01789439P1513114l2542330
17230C96443628r9193690q8522955n8450649l6366158k2706613j4696307r710959
17223F6796297o998895m780163l489475k450585j797222k145915l388756l955500
17215C7789786l264193k574616j795243j139179l6884J662106K972963J513880
$$ plain form
17274 2643523 2643528 2634417 2625525 2661971 2958440 2845148 3004962 3150296 3165348 3129094 3378837
17263 3378837 3610292 3804665 3906165 4052354 4360496 4637480 5094124 5280577 5499446
17254 5499446 5720195 6416399 7392061 8343063 8895720 9222784 9592695 10696533 11674118
17245 11674118 13258498 15610898 18534647 22554981 27515972 34271605 43769459 58536849
17237 58536849 82082386 118915337 174702561 255683405 357472844 428985958 396443628
17230 396443628 297249938 208726983 150276334 113910176 91203563 76507256 66796297
17223 66796297 59797402 55017239 51527764 49077179 47279957 45134042 41745286 37789786
17215 37789786 34525593 31950977 30155734 29016555 28979671 30641777 33614740 35128620
17207C5128620m051531o131748n229702l603924k352495j446845j537524j174180
17199I600671q35395q32395l71584j82864l79133o14063m47850j88431l50464
17190E398492o58961n97042m13230k46014k20331k06282r5082j13181o1141q8989
17180B698239k12482k03952k12999n1900k20713l68993k65146j46369p6219q5825
17170H53641l3375P7291L0073j52604j12566r2276m8241J5963K51107J30814k468
17159I17359k83931l27395j38181J09096L07066J7803p9987l9246j67385K360
17149C17559L91116P8962j7075q1545O60P6838j3176P6022M0395K84415P3065
17138A227236l39748k10865J61038p0050k09390K92829P3628M8181M0019J95692
$$ plain form
17207 35128620 31077089 24945341 19715639 16111715 13759220 12312375 10774851 9600671
17199 9600671 8765276 7932881 7561297 7378433 6999300 6385237 5937387 5748956 5398492
17190 5398492 4739531 4142489 3729259 3483245 3262914 3056632 2961550 2848369 2787228 2698239
17180 2698239 2485757 2281805 2068806 2016906 1796193 1427200 1162054 1015685 939466 853641
17170 853641 820266 897557 927630 775026 662460 570184 521943 537906 789013 919827 917359
17159 917359 633428 306033 167852 276948 584014 601817 521830 482584 315199 317559
17149 317559 708675 787637 770562 689017 689677 766515 753339 829361 869756 1154171 1227236
17138 1227236 887488 676623 837661 767611 558221 851050 924678 972859 1012878 1208570
17128A208570M12237M45692P63059J400238K273022K313322l37870k281188j901101
17119D295981j143218o49257k76853l81163l56078l67515j41931N3974K8539K21836
17109A284315K24076L27178k30799n2880m71247k45764J78140j53773q3839j42802
17099F32605j77114n835j04846o0569K73202K90082J02166p3249k98552o8143
17089E09747j21380r9262J24149J86658k89976l8840L76863j18064j53847R6559
17079D72607J95508K09378r0011p6645L6118l28234j20868j61815M8266J61505
17069C45809j85561m5774Q4125J43426J89211j6556j08859m4201q1362k21690
17059E8568O4766j45172j73773n8806p9094o1508K02398j87958k6415O0444J04940
$$ plain form
17128 1208570 1620807 2066499 2829558 4229796 6502818 8816140 8478270 6197082 4295981
17119 4295981 3152763 2503506 2226653 1845490 1489412 1121897 979966 1033940 1062479 1284315
17109 1284315 1508391 1835569 1604770 1551890 1080643 834879 1013019 859246 775407 632605
17099 632605 455491 449656 344810 284241 557443 847525 949691 876442 577890 509747
17089 509747 388367 289105 413254 599912 309936 271096 647959 529895 376048 472607
17079 472607 668115 877493 787482 710837 746955 418721 297853 136038 184304 345809
17069 345809 160248 114474 198599 342025 531236 514680 405821 361620 280258 58568
17059 58568 123334 -21838 -195611 -254417 -333511 -395019 -192621 -380579 -406994 -346550 -241610
17048b41610K79601j75967k4218l7696O6919J74512J19946j99606J69637J13944
17038B45462J69013J11108j84494k06893j96919j18199j03208m3170R6356K97230
17028F6286o8413J337k43588r4615J74118j41654J10933J80149Q5859R9023J21082
17017B90517R3705P81J61856J19964j77450l19817l33261R9491J51348L05744
17007C92878j68143k38118j22265J83758J5618j79305j33977J38459J84610J83849
16997B57364L49918j17364m99642j00722J48031K36078J54949k5051K2648n5096
16987C71113r6846J26972j58488K2066J02600k32966J10361R2183m7494K18010
16977E07511j44188p7473L53985J2893n3491p0261k48382l9472L0807J32470k18876
$$ plain form
17048 -241610 37991 -137976 -162194 -199890 -132971 41541 161487 -38119 131518 245462
17038 245462 414475 525583 341089 134196 -62723 -180922 -284130 -327300 -230944 66286
17028 66286 -2127 -790 -244378 -338993 -164875 -306529 -195596 -15447 70412 169435 290517
17017 290517 384222 385003 546859 666823 489373 169556 -163705 -64214 87134 392878
17007 392878 224735 -13383 -135648 48110 63728 -115577 -249554 -111095 73515 257364
16997 257364 607282 489918 -9724 -110446 37585 273663 428612 403561 426209 371113
16987 371113 274267 401239 242751 264817 367417 134451 244812 336995 289501 507511
16977 507511 363323 285850 639835 652728 599237 528976 280594 241122 271929 404399 185523
16966A85523K1899J48807Q2894j27223Q8267j41832k66793J36240J35377l1247
16956B31912N0058o6532M1844K36677m9914p0654k97806l47129q4828L45042J98063
16945A86733p3228J5288J57508J66253j91329r6753o9385J4128m5210J07966R4921
16934B66892k43994k29181M5375J46803k12653q7591J64366p69j29087M27592
16924A47753K75801r9952L0803J22945J25869m4857j22830j26558K7215R6062
16914D32251Q323k5046O6119j00436j18860Q1026r5251J13797R460j26971j47038
16903I7374J8295O2589R6718k34336j52129j11466k11037L8085K45172K14766
16893F4031j46966J7027l8463l8300K12205L0281J23857J56923m9102R2072r5892
$$ plain form
16966 185523 207422 356229 439123 311900 400167 258335 -8458 127782 263159 231912
16956 231912 281970 215438 257282 493959 444045 373391 75585 -271544 -356372 -11330 186733
16945 186733 113505 128793 286301 452554 261225 164472 95087 109215 64005 171971 266892
16934 266892 22898 -206283 -160908 -14105 -226758 -314349 -149983 -150752 -279839 147753
16924 147753 423554 323602 354405 477350 603219 558362 435532 308974 336189 432251
16914 432251 440574 415528 481647 381211 262351 343377 248126 361923 371383 244412 97374
16903 97374 115669 178258 274976 40640 -111489 -222955 -433992 -395907 -150735 64031
16893 64031 -82935 -65908 -104371 -142671 69534 99815 223672 380595 331493 423565 327673
16882C27673k21317r1590M056j5806J34255P7317k43708J56015K1881L8118q9638
16871I7256k68204p4851L22118K38460k66879p9657j48598n3997K47557K98592
16861C11797j05674J9224j82651j62165K29653J79701L9857P534K9951l1129l37266
16850a168N4019J56553p1390M9041K0744n4475j77025k99414l1496R4691j49528
16839d09448K2080P069L7060M8330K34972j7924J45861K53017j12532k01667l20612
16828c13794K363j35492J02756L49835l7570p7944j50876j44514k8126K90499
16818a42863J58873l9282k03976j34045L90886L15168L99776l00134L22153O41387
16808A407943L00843K55786k12193o39450m49568j74762J89616M5743j46303Q9772
$$ plain form
16882 327673 106356 14766 18822 3016 137271 214588 -29120 126895 148776 186894 97256
16871 97256 -170948 -245799 76319 314779 47900 -31757 -180355 -234352 13205 311797
16861 311797 206123 225347 42696 -119469 110184 289885 329742 337276 367227 336098 -1168
16850 -1168 52851 209404 138014 187055 207799 153324 -23701 -323115 -354611 -259920 -409448
16839 -409448 -387368 -380299 -343239 -294909 -59937 -77861 68000 321017 208485 6818 -313794
16828 -313794 -311431 -446923 -344167 5668 -31902 -109846 -260722 -405236 -433362 -142863
16818 -142863 16010 -23272 -227248 -361293 29593 344761 744537 444403 766556 1407943
16808 1407943 1708786 1964572 1752379 1112929 663361 488599 678215 723958 577655 667427
16798F67427r1369j56056k67033O2608J45497j29309j33286J74286j22659j32377
16788A7729r5682j0266q2292J74604L1092K60552k54616j36321M9435L7856J98437
16777A90528K17774l05504j24499l27199j3798J40961Q5013l6762M4765L3100
16767i5621M01728J44868j86560n4610J60350n7265k60941j6728L09347o3885
16757B80683j20085j51414j1096j01848j64074K22820J74022J04472k87062j78505
16747b32087l7771J25092R4105J09783K86953J32416k89399k75466k7649J86903
16737G2880J52695j94599j05302R3846j19415m8271j48999R915R2615k89735j38771
16726f23141Q8429K94412K83469L6427N754K1259j10173m8588J70990n2788j31251
$$ plain form
16798 667427 576058 420002 152969 215577 361074 231765 98479 272765 150106 17729
16788 17729 -77953 -88219 -170511 4093 35185 295737 41121 -95200 -45765 -7909 190528
16777 190528 408302 102798 -21701 -348900 -362698 -221737 -136724 -173486 -128721 -95621
16767 -95621 306107 450975 264415 209805 370155 312890 51949 35221 344568 280683
16757 280683 160598 9184 -1912 -103760 -267834 -45014 129008 233480 -53582 -232087
16747 -232087 -269858 -144766 -50661 59122 346075 478491 189092 -86374 -114023 72880
16737 72880 225575 30976 -74326 19520 -99895 -148166 -297165 -287250 -194635 -484370 -623141
16726 -623141 -534712 -240300 43169 79596 85350 106609 -3564 -52152 118838 66050 -65201
16715f5201P180J48096J53932P3033K24768K68239L15179R5998K43004N9797j69278
16704A354747l14870l17866k06676j52590p1799j60034l382O7083j3764j1786
16694A69063k1580k91610j22417K31027j25794j42402J05991K61853R2991q1745
16684G5377J00945o6822l8545N302j6245j13923m1645J53554m7212m3013R9847
16673F7620J6523P6381o8397p1139l767j40563J8127R126j91904j09370J2901
16662c84462J14067L67152m3148n2598k51222k84310J54432K00169k50438j23502
16652e53860J33430j73759J24187M46967K34584j42378j50587k9474m8509k29454
16642c88853Q786K34188J55971Q8627k62916j16651J38948l8850R3253L12715
$$ plain form
16715 -65201 -58021 90075 244007 317040 541808 810047 1125226 1221224 1464228 1524025 1354747
16704 1354747 1039877 722011 515335 362745 290946 130912 127530 194613 180849 169063
16694 169063 147483 -144127 -266544 -35517 -161311 -303713 -197722 64131 157122 75377
16684 75377 176322 109500 70955 76257 60012 -53911 -95556 57998 10786 -32227 67620
16673 67620 84143 160524 92127 20988 17221 -123342 -105215 -96089 -287993 -397363 -384462
16662 -384462 -270395 96757 53609 1011 -250211 -534521 -380089 -179920 -430358 -553860
16652 -553860 -420430 -594189 -470002 -23035 211549 69171 -81416 -110890 -159399 -388853
16642 -388853 -380067 -145879 10092 98719 -164197 -280848 -141900 -180750 -87497 225218
16632B25218M1829J1555n3715Q4265l4666r7981J26163k92149k30272J45553L9639
16621c4561j00669J55058J21046n0591k90898J07163J62914q3571l9042j84994
16611b38145k05547K38098J57201j40324p0847r1361O6134r6085O9213j28128
16601d39791k40755N1337R2487J05263O6517J21232k2505R3036K4305k3323j02021
16590b74218j76316p6084J04516K28999K68988k72399J5508L49614J84465k39581
16580A13492k87451L3524j8211m7853Q56q759J518j1089J5783l75982j00988K3757
16568f61403K20651j04628J8389J7057M6633N3623J50089Q1520J29781L442Q6499
16557D1653K2201J17451q2154k53356n4715r2214N0791m1719p6813J06389M898
$$ plain form
16632 225218 267047 278602 224887 309152 274486 176505 302668 10519 -219753 -74200 -34561
16621 -34561 -135230 19828 140874 90283 -200615 -93452 69462 -14109 -53151 -238145
16611 -238145 -443692 -205594 -48393 -188717 -259564 -350925 -284791 -380876 -311663 -439791
16601 -439791 -680546 -629209 -536722 -431459 -364942 -243710 -266215 -173179 -148874 -172197 -274218
16590 -274218 -450534 -526618 -422102 -193103 75885 -196514 -181006 168608 353073 113492
16580 113492 -173959 -140435 -158646 -206499 -205643 -214402 -212884 -223973 -208190 -584172 -685160 -661403
16568 -661403 -440752 -545380 -526991 -509934 -463301 -409678 -259589 -178069 -48288 -44846 41653
16557 41653 63854 181305 99151 -154205 -208920 -301134 -250343 -292062 -368875 -262486 -257588
16546b57588p2336M5928L81J28914L3323j41711k07674M31958K30049M5911j08353
16535A28802n8246k74569k01636J56432J13920j10125j69923p136l0016K71618
16525a80879J00256J35533J04192L3272l02964N4907j28021j78726K10215K65209
16515A12994k40197p5352P3398j46579Q7707J23962j93593j23726K0880K93024
16505f7482j28749k08771Q0688K56108j9347k05865q899L800j80971L8178K35089
16494b06221M7302R4867q2874J6354o5762k87170p5M3877o5937j8504p1794K22599
16482c73338J42653l69831N7132J76561L9664L1904J7522J88026N3118p4191p5115
16471a85895O75M6377Q9869O9030J28195r271j31274j17740k6244p748r7312K16478
$$ plain form
16546 -257588 -329924 -283996 -283615 -154701 -121378 -263089 -470763 -38805 191244 237155 128802
16535 128802 70556 -204013 -405649 -249217 -135297 -245422 -415345 -422481 -452497 -180879
16525 -180879 -80623 54910 159102 192374 -110590 -55683 -183704 -362430 -152215 112994
16515 112994 -127203 -202555 -129157 -275736 -188029 -64067 -257660 -381386 -360506 -67482
16505 -67482 -196231 -405002 -324314 -68206 -87553 -293418 -302317 -298517 -479488 -441310 -206221
16494 -206221 -158919 -64052 -146926 -130572 -196334 -483504 -483579 -439702 -505639 -524143 -595937 -373338
16482 -373338 -230685 -600516 -543384 -366823 -327159 -295255 -277733 -89707 -36589 -110780 -185895
16471 -185895 -185220 -138843 -48974 20056 148251 138980 7706 -110034 -136278 -144026 -241338 -24860
16459b4860q532m13014j66735Q3776J37389K5594M8928J93620k93955J0331J30114
16448b77344J74474L38852j9913j64193O4693J12073l07970k6006K30000k09547
16438h4881m9174K7288J38585l9137r213m9569Q4480J74495O0449K46272K54012
16427G53607k31998l53560k05461l23581Q6643K21271J06829j43210l39235N8167
16417c70528J81267j14848J55520N6331j74132k47191P2841J99056K79224j7466
16407B0074k12275j3108j00418N2938o1978j15870J11111m7782p2510m7105J08919
16396c78004K07283N1085k42131j33796j82507J6600K43621J14944p3665l90301
16386g66871k1922L17958J70201p4911J60530k4394K38749J173K9802L5417j2953
$$ plain form
16459 -24860 -33392 -446406 -613141 -529365 -391976 -366382 -317454 -123834 -417789 -407458 -277344
16448 -277344 -102870 235982 216069 51876 116569 228642 -79328 -105334 124666 -84881
16438 -84881 -134055 -106767 31818 -7319 -16532 -66101 18379 192874 253323 499595 753607
16427 753607 521609 168049 -37412 -360993 -274350 -53079 53750 -89460 -428695 -370528
16417 -370528 -189261 -304109 -148589 -92258 -266390 -513581 -440740 -241684 37540 20074
16407 20074 -192201 -205309 -305727 -252789 -314767 -430637 -319526 -367308 -439818 -486923 -378004
16396 -378004 -170721 -119636 -361767 -495563 -678070 -661470 -417849 -302905 -376570 -766871
16386 -766871 -788793 -470835 -300634 -375545 -215015 -239409 -660 513 30315 65732 52779
16375E2779q7734k9409j51076q2137J07044L8343o8161p3836J5388L33991L30705
16364C85897m2718j92185r6058p1455j69179P9302R8776K0702K30300k2224k56820
16353c5662k07281P1040M955Q1525K09455m5640m8958j98799j64974J21244O8
16342b13027k31754J01734Q0166j34717j42435O9305J97729L38116O0289l82911
16332b57505n7216L69771O0962L6034k91210J90222j40812Q2237J46116j56k68021
16321a29578l41370k34624J53433J13916K25342K74045O6010j80690j8403J54521
16311H2602L3765j36151o2326L4182J66708l06654j3347L12169K00560k45581
16301F5927l00502m6474K35257o3137k45589J32299J4616J48497K07482k29724
$$ plain form
16375 52779 -34955 -64364 -215440 -297577 -190533 -152190 -220351 -294187 -278799 55192 385897
16364 385897 343179 150994 54936 -16519 -185698 -106396 -7620 13082 243382 221158 -35662
16353 -35662 -242943 -171903 -166948 -85423 124032 78392 29434 -169365 -334339 -213095 -213027
16342 -213027 -444781 -343047 -262881 -397598 -540033 -470728 -272999 65117 125406 -257505
16332 -257505 -314721 55050 116012 152046 -139164 51058 -89754 -7517 138599 138443 -129578
16321 -129578 -470948 -705572 -552139 -438223 -212881 61164 127174 -53516 -71919 82602
16311 82602 116367 -19784 -82110 -47928 118780 -187874 -201221 110948 311508 65927
16301 65927 -234575 -281049 -45792 -108929 -354518 -222219 -207603 -59106 148376 -81348
16291h1348o3692k10892j74856N480L22442J48447O4915k61381k3193K19383j43460
16280a98155m2367K8518J0260j78722k7808L95178N9284j81608R3208P2682O0097
16269I0567m5504R1086J4407k0264n6569j73980N6886N6221j60387q290J22434
16258c3393P3789k40111J65277L2408j64278O0648J40716J16419j4476j67213
16248c0214j86815J84021J11517p8296l79098j83043L18286L64375R9765j60901
16238E9597j4899K19220Q3821K8392l4714r1754Q8638Q9156j26352m0953j18772
16227A41380k51135j06723J21373n8682k62745q4008L93692j06440M298N2588
16217a56402L47554o7214j68163k14076o2584J24052J40156J22150j34350l68007
$$ plain form
16291 -81348 -145040 -355932 -530788 -525308 -202866 -54419 10496 -250885 -274078 -54695 -198155
16280 -198155 -240522 -212004 -201744 -380466 -408274 -13096 46188 -135420 -42212 30470 90567
16269 90567 45063 136149 150556 130292 73723 -100257 -43371 12850 -147537 -155827 -33393
16258 -33393 40396 -199715 -34438 -2030 -166308 -105660 35056 151475 136999 -30214
16248 -30214 -217029 -33008 78509 213 -378885 -561928 -243642 120733 220498 59597
16238 59597 44698 263918 347739 376131 341417 249663 338301 427457 301105 260152 141380
16227 141380 -109755 -216478 -95105 -153787 -416532 -500540 -106848 -213288 -208990 -156402
16217 -156402 191152 123938 -44225 -258301 -320885 -196833 -56677 65473 -68877 -436884
16207d36884k13239o948J00121J42718J5687m0581n679J00037J38789J8110k38158
16196d26027n1081j1934j15484N6206O3799J72182K30470j01544R6755J58866
16186G2208l2275l41507N8193K73627q0533R7187o3929k27781P6283l8935m5183
16175b52645K38914P1379j30329m2474R3106R3171l9259j30196k53011j44390
16165d95734P8389j71955j61562K3265K803K01964K42595k46387L31705Q666j30115
16154c16366k6018L5490k53360J19956K58204R6534M9647j89726O0681K9788J16714
16143a8456k9510K34072j52125k46917J2238K45316N9852j8880R4851K8141j58920
16132D9662O5679o435k16702r8113m1593K57073Q0275P3556R878j83592P916Q8423
$$ plain form
16207 -436884 -650123 -657071 -556950 -414232 -398545 -439126 -444805 -344768 -205979 -187869 -426027
16196 -426027 -477108 -489042 -604526 -548320 -484521 -312339 -81869 -183413 -86658 72208
16186 72208 39933 -301574 -243381 30246 -50287 46900 -17029 -244810 -168527 -207462 -252645
16175 -252645 -13731 57648 -72681 -115155 -22049 71122 31863 -98333 -351344 -495734
16165 -495734 -417345 -589300 -750862 -727597 -724794 -522830 -280235 -526622 -194917 -186251 -316366
16154 -316366 -342384 -306894 -560254 -440298 -182094 -85560 -35913 -225639 -164958 -135170 -18456
16143 -18456 -47966 186106 33981 -212936 -200698 44618 104470 85590 180441 208582 49662
16132 49662 115341 108906 -107796 -205909 -247502 9571 89846 163402 173280 -10312 -2396 86027
16120H6027k4023k16286j48225J46428N3966J66849L0178J79712J91737k69605
16110A96758l57892j07520Q3162M6481m1607o63M2917j58085l4967J34903O0812
16099a35701O6021Q9050r6364l83778j89113N9852O7512J51519L49995K23067
16089B02060j07475j24382N5069J03647n1553j43387j17721L993M1156J21162
16079a7431j4746N4237j39780m1236r1083m5540j21910K59055J90265m5285o710
16068b0164k12305l0997K93990J85545o1741r9430j92399j30796k44054j72721
16058f85072K0151L04446J53601j31386J8399r4020J12301J03132L3392j86211
16048c51267k7852K95501J28438q8532q9611Q1496q9320r1111J23598j25028o1547
$$ plain form
16120 86027 62004 -154282 -302507 -156079 -102113 64736 94914 274626 466363 196758
16110 196758 -161134 -268654 -185492 -139011 -180618 -181281 -138364 -296449 -331416 -196513 -135701
16099 -135701 -69680 19370 -76994 -460772 -649885 -590033 -522521 -371002 -21007 202060
16089 202060 94585 -29797 25272 128919 77366 -66021 -183742 -179749 -138593 -17431
16079 -17431 -32177 22060 -117720 -158956 -250039 -295579 -417489 -158434 31831 -13454 -20164
16068 -20164 -232469 -263466 30524 216069 154328 54898 -137501 -268297 -512351 -685072
16058 -685072 -664921 -360475 -206874 -338260 -319861 -413881 -301580 -198448 -165056 -351267
16048 -351267 -379119 -83618 44820 -43712 -133323 -51827 -141147 -232258 -108660 -233688 -295235
16037b95235J78663J05687N938n8158p5298P6984j54218K41039K59295j09815
16027A74882j52821k9820J67607K02727N0599l09554o6913L26689L3004r241r9463
16016B87696j31388j57009J64835j1665j92013q9806J38442o8813N8654R0206
16006H9139k60546l2497K83700Q7862j17905j62675j01375O4221p5870q327J46656
15995h7617K49312J75958j05021Q136j64480j62282J00900J73661j36009j09387
15985e6829j63902j54875l2721J14113K29937j5853j26222m1780O1241O9022M2933
15974g4936K09N668k0188J34647K59186r034k10632j39192Q9228K49440j54577
15963A29819j48167q265J80599J36571j48759j68766j01898k2555R9489L12237
$$ plain form
16037 -295235 -116572 -10885 -4947 -63105 -138403 -61419 -215637 25402 284697 174882
16027 174882 22061 -7759 159848 362575 413174 103620 36707 363396 396400 387159 287696
16016 287696 156308 -701 164134 152469 -39544 -129350 9092 -59721 -1067 89139
16006 89139 -171407 -203904 79796 167658 49753 -112922 -214297 -150076 -225946 -234273 -87617
15995 -87617 161695 337653 232632 240768 76288 -85994 14906 188567 52558 -56829
15985 -56829 -220731 -375606 -408327 -294214 -64277 -80130 -206352 -248132 -186891 -117869 -74936
15974 -74936 -74727 -69059 -89247 45400 304586 295552 84920 -54272 34956 284396 129819
15963 129819 -18348 -26613 153986 290557 141798 -26968 -128866 -151421 -51932 260305
15953B60305J56339j25049k54428j73090j34067j72379j32571K6868j18676q5968
15943g52716K57315K78610o0423p917p2670J80266K77393j97673J07368K01743
15933B11296o9145r2652j25260p9055J1507O9087n6843p9310k5550K0936L2886
15922a82103n9291l40510l0271J86823K02348J58526k5685K0236J87439L9758
15912A57270j22811m45228k01432P7643J39129K18725J4881N1292m3849j0562
15902a64942L26242N4706j13897k14872o6338J692r3785J96757P2357J43504J61081
15891C02505J71946m3945j12631r7035k8810j46588M8826j86675N284N7696L3773
15880D346r710l0583J03436j8336R109O657J14633K56030o2008j37097K7835L204
$$ plain form
15953 260305 416644 291595 37167 -135923 -269990 -442369 -574940 -548072 -666748 -752716
15943 -752716 -495401 -216791 -277214 -285131 -357801 -177535 99858 -97815 9553 211296
15933 211296 142151 49499 -75761 -154816 -143309 -74222 -131065 -210375 -235925 -214989 -182103
15922 -182103 -241394 -581904 -612175 -425352 -223004 -64478 -90163 -69927 117512 157270
15912 157270 34459 -410769 -612201 -534558 -395429 -176704 -161823 -110531 -154380 -164942
15902 -164942 161300 216006 102109 -112763 -179101 -177409 -271194 -74437 -2080 141424 302505
15891 302505 474451 430506 317875 220840 192030 45442 94268 -92407 -87123 -29427 4346
15880 4346 -5364 -35947 67489 49153 58262 64919 179552 435582 373574 236477 264312 267516
15868B67516L5081j04323J681Q1079K6813k91836p2810J58746j8713K75349j70388
15857A88195k2236R0246r9712j4816R3264l8407R4826j26770j8602j26520K37586
15846B57054R4573j88116j1000j84488j34103j5722R6782N8871p884K52999K81245
15835E00211k31784j37148L30580L2814l46782o1434O6537l1996o7790J9205j33015
15824f0602j77834K4616R4511n6294j45131J3333Q3622j729K7080L15758J03789
15813B21119l7846J05400p8658O9390j44224j9825L0597k97524j5720Q4991J54492
15802G2192n5287j60226K09105J36015l55j19729q7166k04243M2627L9161l78631
15791e06537q1226K79194J08993L67869j01555p9367J49346k5970j80526n4496
$$ plain form
15868 267516 302597 198274 199955 281034 307847 16011 -56799 101947 83234 358583 188195
15857 188195 165959 256205 156493 141677 234941 196534 291360 164590 145988 19468 257054
15846 257054 351627 163511 152511 -31977 -166080 -181802 -85020 -26149 -34033 218966 500211
15835 500211 268427 131279 461859 494673 147891 86457 152994 120998 53208 72413 -60602
15824 -60602 -238436 -213820 -119309 -175603 -320734 -307401 -223779 -225508 -198428 117330 221119
15813 221119 183273 288673 210015 279405 135181 115356 145953 -151571 -167291 -82300 72192
15802 72192 16905 -143321 65784 201799 201444 81715 -5451 -209694 -167067 -127906 -506537
15791 -506537 -587763 -308569 -199576 168293 66738 -12629 136717 110747 -69779 -124275
15781a24275O7124p0149R4123L33742J87562j35029n04751l26828n1850K58958
15771b71373j35231j56158J76780K11232O0387k45227K6897M15202J75175k98849
15761d1165q3075J32976L3394J39105l4931q974k16005o9075L16344J6567J9160
15750B04321J90831P9996m5481k69262k8107k5544j24629o6742j50706L2950K95978
15739I3605l07649j62984j716K55439K14703K0530j96690j95118p7279R4688J3604
15728b48867j23044J61653K80876j23854l28094j16875K89202K30919Q0438O4851
15718A67205j2330j18633R5620P0770j20791R9235R6025j58147k68509m3764J12808
15707h0511r6526Q2031O449k32847J34115N01061L19799K09082k00518k82655
$$ plain form
15781 -124275 -57151 -127300 -33177 300565 488127 353098 -151653 -478481 -530331 -271373
15771 -271373 -406604 -562762 -385982 -174750 -114363 -359590 -332693 82509 257684 -41165
15761 -41165 -124240 8736 42130 181235 146304 137330 -78675 -147750 168594 185161 204321
15750 204321 395152 475148 429667 160405 132298 106754 -17875 -84617 -235323 -202373 93605
15739 93605 -214044 -377028 -378744 -123305 91398 111928 -84762 -279880 -357159 -262471 -248867
15728 -248867 -371911 -210258 70618 -53236 -381330 -498205 -209003 21916 102354 167205
15718 167205 154875 36242 131862 202632 81841 181076 277101 118954 -149555 -193319 -80511
15707 -80511 -177037 -95006 -88557 -321404 -187289 313772 633571 842653 642135 359480
15697C59480j14224P5164r6301j61257k37180J5970m3685j62667q1982K63266
15687a83416L36872K58064j88896j9305l5020k56643o296L45615q1897j71424
15677b346J26947J20558L9586K331N94j83596O0681N7310j38741P7789J11779
15666B72892K60660j89578k55590N3695J92591k6420k01113N5949Q2982j33013
15656A13055j96114l5855J23841n2280j12881J06154j00066K4849l8338L0571
15646a37064J48887j81646k83268J9787K29348J41343P5330r2316K35329L07739
15636D63469j53829j09979j91330j05288J29781j93894L20587J62270m4612j31110
15626A46065j87055o0247l0116K06333n242k20126l6379k08412m1683M31740R5750
$$ plain form
15697 359480 245256 320420 224119 62862 -174318 -158348 -202033 -364700 -446682 -183416
15687 -183416 153456 411520 222624 203319 168299 -88344 -94640 250975 169078 -2346
15677 -2346 124601 245159 284745 287076 287670 104074 164755 222065 83324 161113 272892
15666 272892 533552 343974 88384 142079 334670 308250 107137 163086 246068 113055
15656 113055 -83059 -118914 4927 -47353 -160234 -54080 -154146 -129297 -167635 -137064
15646 -137064 11823 -169823 -453091 -433304 -203956 -62613 12717 -79599 155730 463469
15636 463469 309640 199661 8331 -96957 32824 -161070 159517 321787 277175 146065
15626 146065 -40990 -101237 -131353 74980 69738 -150388 -186767 -395179 -436862 -5122 90628
15615I0628r578K80871J4295p2390J74185L21961R8885l01060j51197j1527k6346
15604D08727k17789j11967j99274L931p2677n102O3568K92323K04208K33904L5839
15593F35691q7049j26853o3878M1726K15419j52498k22432k25663p4292j46270
15583b06099K09122R2435j06289k93364J89378K17732O088J06647m56992m05339
15573f46681K17072R4561K05983J6544j433P1503r243j4220n5416k22888J26142
15562b18076K48806j87092l97025K20614K37350j19136M3468R6603p4591l1719
15552a80798J57508n9707k72439M61109J14998o9792m14062j66855J09826J62237
15542a57975J42043J29699q9111m91259Q042l8408J29492N6435K35930K57844
$$ plain form
15615 90628 81050 361921 376216 303826 478011 799972 898857 597797 446600 435073 408727
15604 408727 190938 78971 -120303 -116372 -189049 -194151 -130583 161740 365948 599852 635691
15593 635691 548642 421789 357911 399637 615056 462558 240126 14463 -59829 -206099
15583 -206099 3023 95458 -10831 -304195 -114817 102915 109003 215650 -241342 -646681
15573 -646681 -429609 -335048 -129065 -112521 -113954 -42451 -51694 -65914 -121330 -344218 -218076
15562 -218076 30730 -156362 -553387 -332773 -95423 -214559 -171091 -74488 -149079 -180798
15552 -180798 -23290 -82997 -355436 105673 220671 150879 -263183 -430038 -320212 -157975
15542 -157975 -15932 113767 24656 -466603 -458561 -496969 -367477 -311042 -75112 182732
15532A82732J53403n3221M461j97617l577k54005n3567j6642j0741j32577o2482
15521d43833L3444R079J94384P9691j14592R0621K23455L18908J13508j26643
15511C78022L0391p4510n1917k65134k92165j4250L5499J59316q9454j1150j78652
15500c74004n666K38413J9992r8825j12675j03928J13159K6999J7328o527p737
15489b93471n8542K43471P1322J09297r4430J25983J8449K3285n9695j33852J12462
15478F4279J84298J0835l72237J07445j09841k59300L6907L90279L9773j65629
15468g3191j94673R0183q46l91909l31254P6712M04669L31368K5572n1361K1301
15457i3429J41230k24463K01N4723Q5519o8868l9927J09195j90644n9999K79685
$$ plain form
15532 182732 336135 282914 287375 89758 86181 -167824 -221391 -238033 -248774 -381351 -443833
15521 -443833 -410389 -401310 -206926 -127235 -241827 -151206 72249 391157 504665 378022
15511 378022 408413 333903 281986 16852 -275313 -289563 -254064 -94748 -184202 -195352 -374004
15500 -374004 -379670 -141257 -121265 -220090 -332765 -436693 -323534 -296535 -279207 -285734 -293471
15489 -293471 -352013 -108542 -37220 72077 -22353 103630 122079 145364 85669 -48183 64279
15478 64279 248577 259412 -112825 -5380 -115221 -374521 -337614 52665 92438 -73191
15468 -73191 -267864 -177681 -178527 -570436 -901690 -824978 -420309 -88941 -63369 -114730 -93429
15457 -93429 47801 -176662 -176461 -121738 -36219 -105087 -145014 -35819 -226463 -286462 -6777
15446f777L01802J57664L8130n03911n08548R1774K87063M50540K20432k43357
15436B84812l34460J850J6391m7000p535M554o2359j61522j06786J9306K90414
15425a02335R4092J20356O3319j54353o6550r013l34121r3668J25433K07722K04955
15414E5837J59944k94055k69386L56642K74571n7823j18105l26169j11702J92935
15404a37311J77800j59523k29604q1743Q2051J02578K4750j15232J24690j60618
15394c72162J14326j40342L2083J50976k5591o9705N2436j32842m7288m9855L44495
15383a43469R5726l41789l9936J23735K12216p6401j05335J11917M67006R6877
15373D00547J20107m7511O4275j40577l45387l39776R0366K3466N8654k7047k8184
$$ plain form
15446 -6777 295025 452689 490819 -13092 -521640 -429866 -142803 307737 528169 284812
15436 284812 -49648 -47798 -31407 -78407 -85942 -81388 -143747 -305269 -412055 -392749 -102335
15425 -102335 -8243 112113 175432 21079 -45471 -54484 -388605 -482273 -356840 -149118 55837
15414 55837 215781 -78274 -347660 8982 283553 225730 107625 -218544 -330246 -137311
15404 -137311 40489 -119034 -348638 -430381 -348330 -245752 -221002 -336234 -211544 -372162
15394 -372162 -257836 -398178 -366095 -215119 -240710 -310415 -257979 -390821 -438109 -487964 -143469
15383 -143469 -47743 -389532 -429468 -305733 -93517 -169918 -275253 -163336 303670 400547
15373 400547 520654 473143 537418 396841 51454 -288322 -197956 -174490 -115836 -142883 -171067
15362a71067J10540M2161j22800j49114J02914n9341R0390j7739J07707J45968
15352G9619N7463r8078k2662J79980N7412j3340m3173M3086j08221j89132l0952
15341h7998K09049m7417l50940l2941k8872J46181K51287L4258j20924J27312
15331I8995Q4539M7066j02068J39578R7854k15359j80505j4522R9657L7023Q1396
15320A73654j30137j33726R3906m3428k1808k63770r9417j14006M74451L58866
15310B94585K1464l90170j66121J23748K827l2901j08919p3642P2768L0919J43769
15299h1673J31005j6635j74328R3873O3484r5407O0746J0668J75688J75395j68809
15288A74007l25495l6748j39038K26629K89048L66093L33337k56880j70116k13152
$$ plain form
15362 -171067 -60527 -18366 -141166 -290280 -187366 -246707 -156317 -174056 -66349 79619
15352 79619 137082 39004 16342 196322 253734 240394 197221 240307 132086 -57046 -87998
15341 -87998 121051 73634 -277306 -310247 -339119 -192938 58349 92607 -28317 98995
15331 98995 183534 230600 128532 268110 365964 150605 -29900 -44422 55235 92258 173654
15320 173654 43517 -90209 3697 -39731 -61539 -325309 -424726 -538732 -64281 294585
15310 294585 316049 -74121 -240242 -116494 -113667 -146568 -255487 -329129 -256361 -225442 -81673
15299 -81673 49332 32697 -141631 -47758 15726 -79681 -18935 -8267 167421 342816 174007
15288 174007 -151488 -188236 -327274 -100645 188403 554496 887833 630953 460837 247685
15278B47685j21032j07086j52396O8627p6328j20517L00949N1702q7738j46819
15268a42953j72444K08445J06882l5559K42186m0890r957j38639o0950j8954O0070
15257b763j40776j07325q0274k8943J28334j10240l5863M16865J78355J16145
15247C33515r3659j4725k45020J25665Q4464p9307j22969m01762j57524j44839
15237g16161k14513J14092M43692L17268j62386j29618O5279J66187j18529m6155
15227b80844k7509k60497K111J78734j87213K6787J78008L28492J14050Q4861
15217A56980j34401k31217L8343k2356l1823j84796q4772J98351l3709j92735
15207e22135q114M2592K04213J39701j17592J89829M03893J19792l7421l06212
$$ plain form
15278 247685 126653 19567 -132829 -64202 -140530 -261047 39902 91604 3866 -142953
15268 -142953 -315397 -106952 -70 -35629 206557 165667 155710 17071 -43879 -62833 -2763
15257 -2763 -143539 -250864 -331138 -360081 -231747 -341987 -377850 39015 217370 333515
15247 333515 239856 225131 -19889 105776 190240 110933 -12036 -413798 -571322 -716161
15237 -716161 -930674 -816582 -372890 -55622 -218008 -347626 -282347 -116160 -234689 -280844
15227 -280844 -308353 -568850 -566739 -388005 -575218 -548431 -370423 -41931 72119 156980
15217 156980 22579 -208638 -170295 -192651 -224474 -409270 -494042 -295691 -329400 -522135
15207 -522135 -530249 -487657 -283444 -143743 -261335 -71506 332387 452179 414758 108546
15197A08546j09651q9885j71986O5584J72774j58302n2224J57342M1281J45563
15187A09042l3303k35834j15886j22453J41857K57401J211j19621O9567l5670
15177h3689j45442j47239L55243J33034k03468o4340J23423m0342R2845P7564
15167I7589m5789j15842J94315j55206l05989K31734k8752l28181l3038K18738
15157b70421K67417j71888l1265n3378R2046J3409K50697J55490J61663o642k90966
15146A16162j5949K60302k27771J65799P0837j85814k16484j3618p5875j888k11010
15135c35309o7620O2487J15986P7474J61758M4990n8142k53719k63674j52353
15125f68122J35256M37935J6524k70566K71660K6037j17254j47097K46891n9873
$$ plain form
15197 108546 -1105 -90990 -262976 -197392 -24618 -182920 -235144 -77802 -36521 109042
15187 109042 75739 -160095 -275981 -398434 -256577 824 2035 -117586 -48019 -83689
15177 -83689 -229131 -376370 -21127 111907 -91561 -155901 -32478 -72820 20025 97589
15167 97589 51800 -64042 130273 -24933 -330922 -99188 -127940 -456121 -489159 -270421
15157 -270421 -3004 -174892 -206157 -259535 -167489 -154080 96617 252107 413770 407128 116162
15146 116162 100213 360515 132744 298543 369380 183566 -32918 -46536 -122411 -124299 -335309
15135 -335309 -402929 -340442 -224456 -146982 14776 59766 1624 -252095 -515769 -668122
15125 -668122 -532866 -94931 -78407 -348973 -77313 -51276 -168530 -315627 -68736 -128609
15115a28609P4512O5645j80214J51507K06430k17483l13257J06453P9553Q9137
15105f6326k698j78725L8884J76095l2437k50254k08061J50904Q6081J76902L4260
15094g5375k81766o3346K51421M12360q693m06948r2177k0734L09107K95359r6275
15083B22933O3282K29483l5518j96538L1681k601q4976l57834k07211J31480N4808
15072a51011M572r8137J92448J79488j28102l20211L6363K59793j52190k70614
15062d47601o0873K47614J19746Q9485P8703P9120J28257j03073n9872o0956j14779
15051a04229j60403J54799K26815P2378j04551p4371P2790k76654j7484L83640
15041A72730J71823j13538m34066j89777L36396j03501r9536J51341P2687j91802
$$ plain form
15115 -128609 -54097 11548 -168666 -17159 189271 -28212 -341469 -235016 -155463 -66326
15105 -66326 -69024 -247749 -208865 -32770 -65207 -315461 -523522 -372618 -286537 -109635 -75375
15094 -75375 -357141 -420487 -169066 243294 234601 -172347 -264524 -285258 23849 319208 222933
15083 222933 286215 515698 480180 283642 315323 312722 227746 -130088 -337299 -205819 -151011
15072 -151011 -146439 -244576 -52128 127360 -742 -320953 -284590 -24797 -176987 -447601
15062 -447601 -508474 -260860 -141114 -51629 27074 106194 234451 131378 71506 10550 -104229
15051 -104229 -264632 -109833 116982 189360 84809 10438 83228 -193426 -210910 172730
15041 172730 344553 231015 -203051 -392828 -56432 -159933 -259469 -108128 -35441 -227243
15031b27243j37143o6213M1508N5723K23902N0395j32237K00335p9977j00874
15021a71824j50148r9984j3115K81675O0362k57423j79529J61856L04269m950
15011f8811O3309M9677j49582j19723J71507j9908n5773j18942J93538L95320
15001C40612R7945q3521m51904m39386m0369l6787M02470o8523K1373L4397J97696
14990b5997k8051o5845P9965k02791P1124P4247n0544J31853J07969j51672J7564
14979d2178K82713R7629M0316k991J09419J42773k0964r7792K77719o8966J3925
14968G31603r0319k91874j8824j68494j70025j80901J7778K00275J28571j0547
14958A47243j1214O4525k13943l3950j0668K98427J40335M3816q1767j75043k52971
$$ plain form
15031 -227243 -364386 -430599 -389091 -333368 -109466 -59071 -191308 9027 -70950 -171824
15021 -171824 -321972 -421956 -435071 -153396 -93034 -350457 -529986 -368130 -63861 -68811
15011 -68811 -5502 44175 -105407 -225130 -53623 -73531 -129304 -248246 -54708 340612
15001 340612 438557 355036 -96868 -536254 -576623 -613410 -210940 -279463 -258090 -223693 -25997
14990 -25997 -54048 -119893 -39928 -242719 -171595 -97348 -147892 -16039 91930 -59742 -42178
14979 -42178 240535 338164 378480 375489 484908 627681 606717 508925 786644 717678 731603
14968 731603 641284 349410 330586 162092 -7933 -188834 -171056 29219 157790 147243
14958 147243 136029 200554 -13389 -47339 -58007 240420 380755 424571 342804 167761 -85210
14947h5210J41385J57505j93004l5170K08588P1495n9984O2480m8055j98114j95876
14936a73960k05208K36028N7591p6149P2448K5557k25622n1157O8727J2521K16789
14925d2435N286r7462n4097l1287L2179o4120j44947o5877O1305K37690r5596
14914b59361j29684p8885J61821L48000J9007k24204j41586j18950J00786K97255
14904b5801K24286L5698j75907j07622M4031J21645j79111j8156K9348K10858
14894A59269J34966J53636j4879n3142J18378j23391j35968k27342n6763k0502
14884f5738J16484j07524P6795j82176j04848J46203L53762Q9720k46372j00057
14874b3751q0825j59149j80353p6590j26905n9943M20071K67254j79427K22693
$$ plain form
14947 -85210 56175 213680 20676 -14494 194094 265589 205605 268085 220030 21916 -173960
14936 -173960 -379168 -143140 -85549 -161698 -89250 -63693 -289315 -340472 -271745 -259224 -42435
14925 -42435 -37149 -134611 -188708 -219995 -187816 -251936 -396883 -462760 -401455 -163765 -259361
14914 -259361 -389045 -467930 -306109 41891 60898 -163306 -304892 -423842 -323056 -25801
14904 -25801 198485 234183 58276 -49346 -5315 116330 -62781 -80937 -51589 159269
14894 159269 294235 447871 432992 379850 498228 374837 238869 11527 -45236 -65738
14884 -65738 50746 -56778 20017 -162159 -267007 -120804 232958 322678 76306 -23751
14874 -23751 -104576 -263725 -444078 -520668 -647573 -707516 -287445 -20191 -199618 23075
14864B3075N5958J3391j16060j1832j41936j62425m0798P6887j57778n0366J82984
14853c28900l644k296l4563M363O6589p8841J51991k163R5401j32723k3005L5673
14841b52118O9444J94105q2713O8746K41195L622j45134j51469J03012j93756
14831a45066J40665K10196J20197o7784k72110k02680L7346k71801Q3448M41467
14821G3878p8575j73557J0707n7417r320N7335o1542k83n2349j9754J72564J1211
14809a27102K7707m3452k1897J61595J14284j72205l5318m9447k96509j39913
14799e82257J03907K77855K55260L1580j50113n3543k52035k58706r9964J09879
14789f18137K75846Q2629K20514K1501J62869K4807j00237j08123j13205K0976
$$ plain form
14864 23075 79033 92424 -23636 -35468 -177404 -339829 -380627 -303740 -461518 -511884 -328900
14853 -328900 -332544 -334840 -369403 -365040 -298451 -377292 -225301 -227464 -132063 -264786 -287791 -252118
14841 -252118 -182674 11431 -71282 -2536 238659 242281 97147 -54322 48690 -145066
14831 -145066 -4401 205795 325992 258208 -13902 -216582 -179236 -451037 -367589 73878
14821 73878 -4697 -178254 -167547 -224964 -234284 -176949 -238491 -238774 -291123 -310877 -138313 -127102
14809 -127102 -99395 -142847 -164744 -3149 111135 -61070 -96388 -145835 -442344 -582257
14799 -582257 -478350 -200495 54765 86345 -63768 -117311 -369346 -628052 -728016 -618137
14789 -618137 -342291 -259662 -39148 -17647 145222 170029 69792 -38331 -151536 -130560
14779a30560O5937L8027J25715J89658j96357j51180j67952j58851J42790J81118
14769f1655P7571K06335J29167k17381p2885J5343j29251p6679P8521J30966R4086
14758A74138L322M7339n354j37855n9169N792j5476r844J25876Q1604k5779N7842
14746B42436l2457j95082p4020J78675N2770r746j80314k40124K22417L1250j13824
14735a18019j3990m9872J08419J04330M5150n7306j47168k1557L18027K16136
14725C84150q3440l875j33561L4313o141j00365o6404k7524k79016K7340j3329
14714b67852l4220K49058K92644N6350k20147m55763j63660j82795k7854N254
14704g48985N04028L25921j3108j73544k34248k84163J3010R708J70260p5400
$$ plain form
14779 -130560 -64623 -26596 99119 288777 92420 -58760 -226712 -385563 -242773 -61655
14769 -61655 15916 222251 351418 134037 61152 76495 -52756 -129435 -50914 80052 174138
14758 174138 177460 224799 219445 81590 22421 28213 12737 2893 128769 210373 184594 242436
14746 242436 209979 14897 -59123 119552 172322 162576 -17738 -257862 -35445 -4195 -118019
14735 -118019 -132009 -181881 -73462 30868 76018 18712 -128456 -150013 168014 384150
14725 384150 300710 296835 163274 197587 191446 91081 24677 -2847 -281863 -254523 -267852
14714 -267852 -302072 -53014 239630 295980 75833 -379930 -543590 -726385 -754239 -748985
14704 -748985 -244957 80964 67856 -105688 -339936 -624099 -611089 -601381 -431121 -506521
14694e06521j32100N00486L80788J3599J23660J91556j98948n48704j03258J95871
14684h3571K57564J39555k20365k81249J16081J97185p3336j98814r6788J57156
14674h6582j0637J63550J19356k84427m3669K30039q5770l21526j15844L7454
14664c98056K1389k7542J65230Q0073l770L5405L9919L03209R3769j8672j12407
14653A78547J20297R0723k83315j83958J61577N5328p2516j20856M0431J12967
14643I9225R8332j58324n494K43609K07440J16058J71810J7575k63391l31718
14633A95122p7122Q8992K7015O1835J12263J43899j99711k85470j17351k64978
14623c15506Q6792K73094J98984o913K47640M38907N9823m02031j41058M6130
$$ plain form
14694 -506521 -638621 -138135 242653 256252 379912 571468 372520 -176184 -279442 -83571
14684 -83571 173993 313548 93183 -188066 -71985 125200 51864 -146950 -243738 -86582
14674 -86582 -97219 66331 185687 -98740 -142409 87630 1860 -319666 -435510 -398056
14664 -398056 -376667 -404209 -238979 -158906 -162676 -127271 -87352 215857 309626 290954 178547
14653 178547 298844 389567 106252 -77706 83871 139199 66683 -54173 -13742 99225
14643 99225 197557 39233 33739 277348 484788 600846 772656 790231 526840 195122
14633 195122 118000 206992 234007 295842 408105 552004 352293 66823 -50528 -315506
14623 -315506 -228714 44380 243364 236451 484091 922998 982821 580790 439732 485862
14613D85862j73757j55570j61622j14249j20450k53914R9040K61891m1829R0247
14603h4351j20397j78598k9034J12716K64554L4988J6182j164K5097K4046R2603
14592A56642j22881K50495J81886l70495j18196J11065R5039K8546r7142n6375
14582E8584K11285j6685j91339k4436Q4905o5090J37169J22066n28113j55864
14572c67518P1885J61260K01910K93779J37661k48877k37618K13509K81568J21988
14562F29547l06278j48373j00800k6693n363Q349J32842K4265P9554m6679j95689
14551D4682p1308K06516K46514P1360J85881k27808j45224j95069l04858j15825
14541c05139J4887J93450n9960J63236L4345L748l0887j51208O7540m7320l9302
$$ plain form
14613 485862 312105 156535 -5087 -119336 -239786 -493700 -394660 -132769 -174598 -84351
14603 -84351 -204748 -383346 -412380 -299664 -35110 -122 16060 14896 39993 64039 156642
14592 156642 33761 284256 466142 95647 -22549 88516 183555 212101 114959 58584
14582 58584 269869 253184 61845 37409 122314 57224 194393 316459 -211654 -367518
14572 -367518 -295633 -134373 67537 361316 498977 250100 12482 225991 507559 629547
14562 629547 323269 174896 74096 47403 42040 50389 183231 207496 287050 240371 44682
14551 44682 -26626 179890 426404 497764 683645 455837 310613 115544 -189314 -305139
14541 -305139 -290252 -96802 -156762 6474 40819 44567 13680 -137528 -69988 -117308 -156610
14530a56610j92891j76993K73790Q6527r7849J2402M5736K89992Q1452k02142
14520c6586J2573J60169J52696L7799O8310j62508j43541R5524J02783j54262
14510A32957P0110q5505M2314Q4584j05572j46049j05816M5453J45051M7886k18810
14499i3397j17273J15888J83649r6661k3246J66612Q828J80438J8308r4092R572
14488B58626P8234j17146j9344p4558M9841j2152K31524j14171k41843k31567
14478a92556J46521j46386k32588K18829K02084j06099J18609J70262N1075J2874
14468B42625J68883K00111k27497p6217K92511k43904j57045j01562J4599l23456
14458b10952l07168K49983K83764J31150l03524k14119O3631O2570J50551J75396
$$ plain form
14530 -156610 -349501 -526494 -252704 -166177 -264026 -251624 -205888 84104 165556 -36586
14520 -36586 -24013 136156 288852 326651 394961 232453 88912 184436 287219 132957
14510 132957 203067 117562 159876 244460 138888 -7161 -112977 -67524 77527 125413 -93397
14499 -93397 -210670 -94782 88867 -7794 -31040 135572 144400 324838 343146 249054 258626
14488 258626 336860 219714 200370 125812 175653 163501 395025 280854 39011 -192556
14478 -192556 -46035 -192421 -425009 -206180 -4096 -110195 8414 178676 229751 242625
14468 242625 411508 611619 384122 307905 600416 356512 199467 97905 112504 -210952
14458 -210952 -518120 -268137 15627 146777 -156747 -370866 -307235 -244665 -94114 81282
14448H1282q4445j98216N5957P2180m7400p5304J88247J85189k18321p9612J86391
14437F5948L30579l7812k94880k35675J22979L30502J34631j6050j0239K8427
14427D18410J8724j9276k75612j24476K3407J70319K54911J1350p1071J6093j22864
14416B99915l17298j76872J15870K60933j26821j68840K17906J59125l48884m37149
14406e22115Q7422K20660P9691k5586J86434n6803j75129J53510J87525j16126
14396A9483J67675L06298p5346Q311O3987j50872p4880l50769P6506k2765k48219
14385b80591r226R4424k0573R7768P7924j44170Q1301m2902j15323K2915j77489
14374d15942M2864K26121P0163P2611K05314J36490j74563l36729k01906n0190
$$ plain form
14448 81282 -3163 -201379 -145422 -73242 -120642 -195946 -7699 177490 -40831 -120443 65948
14437 65948 396527 358715 63835 -171840 -48861 281641 416272 400222 389983 418410
14427 418410 437134 417858 142246 17770 41177 211496 466407 477757 406686 422779 299915
14416 299915 -17383 -194255 -78385 182548 55727 -113113 104793 263918 -84966 -522115
14406 -522115 -434693 -214033 -134342 -159928 26506 -30297 -205426 -51916 135609 19483
14396 19483 187158 493456 418110 426421 490408 339536 264656 -86113 -9607 -32372 -280591
14385 -280591 -289817 -195393 -215966 -118198 -40274 -184444 -103143 -146045 -261368 -238453 -415942
14374 -415942 -373078 -146957 -76794 -4183 201131 337621 163058 -173671 -375577 -425767
14364d25767K01169L07100K7782L3002J42784l7944k17243K1902j32810j50280
14354b30305J15643J79351J177J072K13854K79868r810j47598l88945l63749P5846
14343b73596J14244K53083L67772J33919j42986m3098K6059J1164J00554K21423
14333G68538j27489k80797l16527j98437K28879P5433O303q5612K7403r6114L1178
14322C2758K68867J30281P6453j40181k35603J12769k40992p9781q4843Q0143
14312h0129K51153j57382J08961J4939j7084n7019N0063J4942J85249j31130j95159
14301a2596o6716K03273O0929j30420l6570K0534j511J08574J42074L78783K48898
14290I15252k34442j37551j12528m66504k96250K39124K03693j54671l6159J35641
$$ plain form
14364 -425767 -224598 82502 110284 143286 286070 248126 30883 52785 -80025 -230305
14354 -230305 -114662 64689 65866 66938 280792 560660 550850 403252 14307 -349442 -273596
14343 -273596 -159352 93731 461503 595422 452436 409338 435397 446561 547115 768538
14333 768538 641049 360252 43725 -154712 74167 149600 155903 70291 97694 1580 32758
14322 32758 301625 431906 508359 368178 132575 245344 4352 -75429 -160272 -80129
14312 -80129 171024 13642 122603 137542 120458 63439 113502 128444 313693 182563 -12596
14301 -12596 -79312 123961 184890 54470 17900 38434 36923 145497 287571 666354 915252
14290 915252 680810 543259 430731 -35773 -332023 -92899 110794 -43877 -80036 55605
14280E5605O3412j45666P4230K9814r8702J32340J70070q3183J23432J29440J46308
14269E97100J59736k10602k36263o6164j18895o3523n8957L33540K49584j86877
14259C98679j63501k3396k47024m7869J42223R1743K57235n0192j09402j74313
14249G4183M9077O0933J89657j07086j34843J48141n8899L7244j00186k13481
14239e5260k2860L36324J15092r6510j707J18745J16624Q7343j08490k30469K9410
14228B88242p2862m02289j08248R5219l9064j41521K56165J56635j1747n7034
14218c6504L47489J04825q1647k87787j88799J83662L77573J43849l8643j23454
14208D00564l41430l12559N8111Q6988R2651j37982K14949L63457p457R6318j86868
$$ plain form
14280 55605 119017 -26649 47581 77395 -21307 111033 281103 197920 321352 450792 597100
14269 597100 756836 546234 309971 243807 124912 61389 2432 335972 585556 398679
14259 398679 235178 211782 -35242 -83111 59112 150855 408090 357898 248496 74183
14249 74183 123260 184193 373850 266764 131921 280062 221163 258407 158221 -55260
14239 -55260 -78120 258204 373296 276786 275079 393824 510448 597791 489301 258832 288242
14228 288242 215380 -186909 -295157 -199938 -239002 -380523 -124358 32277 20530 -36504
14218 -36504 310985 415810 334163 46376 -142423 41239 418812 562661 524018 400564
14208 400564 59134 -253425 -195314 -108326 -15675 -153657 61292 424749 417292 513610 326742
14197C26742j24445J23565R3422j72793l42266m4311M1311l3239O7497l6720K19080
14186A17843J37230K41052k04125j43164r3535M4453K12697L12429j73859j44294
14176C06727J32702n6885q2686m1671J38425P5024R6396L9691j8579j60647k09018
14165B19479K03942K81189q3655k47926j52013J57800J7527K68824J16056m25646
14155C55577l85433j86340j57741K35048L50743J27562J95986J11283M3995r8893
14145E91787K33295k09722p3538k69789l07841o7266J48378j5340K03408K07535
14135D40907k71625m32604k40668K56031R8722J7364L14488j2505J22845J90108
14125D83063k26801l7865J13959K91750o9207k67596n764J75231o9548L5778J92697
$$ plain form
14197 326742 202297 325862 419284 246491 -95775 -140086 -98775 -132014 -64517 -101237 117843
14186 117843 255073 496125 292000 148836 55301 99754 312451 624880 451021 306727
14176 306727 439429 382544 299858 258187 396612 471636 568032 607723 589144 428497 219479
14165 219479 423421 704610 620955 373029 221016 378816 396343 665167 781223 355577
14155 355577 -29856 -216196 -373937 -138889 211854 339416 535402 646685 690680 591787
14145 591787 825082 615360 541822 272033 -35808 -103074 45304 29964 233372 440907
14135 440907 169282 -263322 -503990 -247959 -149237 -131873 182615 170110 292955 483063
14125 483063 256262 218397 332356 624106 554899 287303 281539 456770 387222 423000 615697
14114F15697k7384m71330k66035J63627K03609P2726j17819m10140J74213K60217
14104A97381M8804J99405K35080M549j23873j45642n7147k7837J36799J19047
14094E86566j93813O5784K23877k21713o597q557l4768q7841K9597m7814j36874
14083A67847j21884j15176j41061J99816J33315J10347J03644k3468k24613L9291
14073A28058j43312k41656p4512M01069L43075J14670K1306K78505o0439O1299
14063H28063q3307q0794j65660l06097J6668j04063j40917J89973J59313J51218
14053D64397j82177j34143l750m5348J33773K42081J3470n52574J64371Q8568
14043A88668r1328J35830J00304M7411O0272l9065r5140K63255N3563q4010j61715
$$ plain form
14114 615697 588313 116983 -149052 14575 218184 290910 173091 -237049 -62836 197381
14104 197381 246185 445590 680670 685219 561346 415704 358557 330720 467519 586566
14094 586566 392753 458537 682414 460701 454104 445547 410779 322938 352535 304721 167847
14083 167847 45963 -69213 -210274 -10458 122857 233204 336848 313380 88767 128058
14073 128058 -15254 -256910 -331422 69647 412722 527392 548698 827203 766764 828063
14063 828063 744756 663962 498302 192205 208873 104810 -36107 153866 313179 464397
14053 464397 282220 148077 144327 98979 232752 474833 488303 -64271 100100 188668
14043 188668 97340 233170 333474 380885 441157 402092 306952 570207 623770 539760 378045
14032C78045k8676j60249j6612j40395O183J84192J60617N2370j26446j05122
14022B03907q7143q6651q6066L68702O0489L6883q593k79511j80775K2359K73593
14011B37194K1652L482o4394k26627l4226q3107m9171P2029J43563J45674L79574
14000E45643R2625j00952J01501q9268J23880L0743k16300m6507L1144l7822n7914
13989C76773R2634m1575j64129J13511n2006Q1757j1969q5488j67415J80313L43846
13978F66252J51413r4176j02905j45876k70199J22518J02266j89540j7628K13116
13968D35241r2894j81953k33927k9153J39389J05598J28514O3826Q1817l42843
13958G3615J95729J81994O4944j14874j86313P0074R2536j37306M3579o0158J74597
$$ plain form
14032 378045 349369 189120 172508 32113 38296 222488 383105 435475 309029 203907
14022 203907 116764 30113 -55953 312749 373238 410121 401528 122017 -58758 -36399 237194
14011 237194 258846 262328 197934 -28693 -62919 -146026 -195197 -123168 20395 166069 545643
14000 545643 638268 537316 638817 549549 673429 704172 487872 441365 472509 434687 376773
13989 376773 469407 427832 263703 377214 325208 406965 394996 309508 142093 322406 666252
13978 666252 817665 723489 620584 474708 204509 327027 429293 239753 222125 435241
13968 435241 342347 160394 -73533 -102686 36703 142301 270815 334641 416458 73615
13958 73615 269344 451338 516282 401408 215095 285169 377705 240399 283978 223820 398417
13947C98417k92136J5285J35690k76430m4395J36243J55933j8415J7939R3503
13937C21634K42143J37960j69888k38092l8895P7824R4565P7895J0409o8239k68005
13926A79311j74513J93683J97319K9306k19001m6656J33991K39220j09162j95002
13916B28496P1465q6257L4361q1180l7507J27633K76598K15754m5435k8701R8922
13905G74149l42957j15461o7294j26279q0092k0906J05991k4357K18760K94496
13895F16050j46246m4652j49726k34271J07886K2250M6255J40161j15954j77040
13885F4713J24694K22473k6560L87049j58984j28865j79334m6053K03322j32194
13875C30261k7478J17776K73879L3321J86384J01161j71755q8545j14033j1965
$$ plain form
13947 398417 106281 121566 257256 -19174 -63569 72674 228607 210192 228131 321634
13937 321634 563777 701737 531849 293757 254862 332686 427251 505146 515555 447316 179311
13926 179311 4798 198481 395800 425106 206105 159449 293440 532660 423498 228496
13916 228496 299961 213704 248065 166885 129378 257011 533609 749363 703928 675227 774149
13905 774149 431192 315731 248437 122158 42066 21160 127151 102794 321554 616050
13895 616050 469804 425152 275426 41155 149041 171291 217546 357707 241753 64713
13885 64713 189407 411880 385320 772369 613385 484520 305186 259133 462455 330261
13875 330261 302783 420559 694438 727759 914143 1015304 843549 755004 640971 629006
13865F29006p4001k62786k44695J1861M6477L48864J72672K3419n0052k43228
13855C57537j32033K36217R9988R8617J09877J45548K28525j78470k87735k892
13845F75179J52208j43551m5687k03780P4009m6099k11937j44555q3963J40779
13835A62603r3454J25561K02042K71178J6303J18216J62368j44353r4844J5464
13825G41084l2234j85753j33347j78609k17188J8511R1213Q0232J20513K01011
13815E05433J91699J87294l81998j08118r027J03770j1134j40843j37838m9181
13805A50057J28779J14137K87206K31768j23127k48181l45684K6155J81062L4929
13795D37101o6206J32252m6420k66357O5371J80571K7689m6527k04964j86551
$$ plain form
13865 629006 555005 292219 47524 59385 105862 454726 627398 650817 600765 357537
13855 357537 225504 461721 561709 660326 770203 915751 1144276 965806 678071 675179
13845 675179 827387 683836 638149 434369 508378 462279 250342 105787 21824 162603
13835 162603 69149 194710 396752 667930 684233 802449 964817 820464 725620 741084
13825 741084 708850 523097 389750 211141 -6047 12464 103677 183909 304422 505433
13815 505433 697132 884426 502428 394310 385283 489053 477919 337076 199238 150057
13805 150057 278836 392973 680179 911947 788820 540639 194955 221110 402172 437101
13795 437101 370895 503147 456727 190370 255741 436312 464001 417474 212510 25959
13785B5959q1834L77099K45522J73170j8009j63239q9700q0769n6866j06076K8439
13774B53696K6260j8289p2579j5170Q5140J38816l5951R8234P7224j65118J7581
13763C89844L01990J19674k80089m733P5624m2009k25387j58535K1197j18235
13753G9341m0538K78006J62379j29581r8545n1580K29278J90892j13984Q8584
13743E94252r2346j95023r5019J88972j82695J9005L00723l6486j46143K18185
13733E73425J87957l9168L3180N1859o2265j91199j29250k06915j63228K50583
13723C04979K34366R4003o0271k35282K51944J00983j93547l30610P5046R7666
13713C39277J55065k8610J49777L331K4640q3052k68320j67202O2514J6156M8503
$$ plain form
13785 25959 -55875 321224 566746 739916 721907 558668 468968 388199 331333 225257 253696
13774 253696 279956 261667 189088 173918 259058 397874 361923 460157 537381 372263 389844
13763 389844 691834 811508 531419 526686 602310 560301 334914 176379 197576 79341
13753 79341 38803 316809 479188 349607 251062 199482 428760 619652 505668 594252
13743 594252 501906 306883 211864 400836 218141 237146 537869 501383 355240 573425
13733 573425 761382 722214 755394 807253 744988 553789 424539 217624 54396 304979
13723 304979 539345 633348 573077 337795 589739 690722 497175 166565 241611 339277
13713 339277 494342 465732 615509 618840 643480 560428 292108 124906 187420 203576 252079
13702B52079J53952M2752K71k1706j73477P4575K18107j968r6557o4462j24885
13691B58681J25213O3891k0899k08070N3165K24692J88580J56085p1756j94634
13681E74948k40032j54586J16172K38856J08530j98446j44689J01305q7898j59873
13671A54287r1785J05519J31545l144K05269J6257J04765j98141K0452O9590j3099
13660E01515n543k11831j47990K2275K19592j8901K03270L39863N0785j33959
13650H19076k69873J1618j5780P591O7213J96464L6615l10269j6292j2515R0343
13639F04191M3975J73999n0599J566K5879J60968L5800k60714j60996j80050q6457
13628C07562k37211J8186J29002K40025K42403j37345p1081k2765o4942J90236
$$ plain form
13702 252079 406031 448783 449054 427348 253871 328446 546553 544585 448028 383566 258681
13691 258681 383894 447785 426886 218816 271981 496673 685253 841338 769582 574948
13681 574948 334916 180330 296502 535358 643888 445442 300753 402058 314160 154287
13671 154287 62502 168021 299566 296422 501691 517948 622713 424572 445024 514614 501515
13660 501515 495972 284141 136151 158426 378018 359117 562387 902250 953035 819076
13650 819076 549203 560821 545041 552632 619845 816309 852924 542655 526363 513848 604191
13639 604191 648166 822165 771566 773132 799011 959979 995779 735065 574069 394019 307562
13628 307562 70351 88537 217539 457564 699967 562622 491541 468776 403834 594070
13618E94070p0173L7904r1244j22848J46017J59755r1450k75772N8707o8102J28667
13607D05531M16419j09151j36083j06415M4246m3411j80741k80836k14974J71060
13597c4355K78236K50210P3698O6555o6505K4178J39631M9459K33191J43017K2104
13586A179419j74589j83250q461j84744p9988l5590p545J10698J76346Q4031J10149
13575I86476o9808o3920M0948K88292n6912k78823k73455N6108L37624L01279
13565A267809k72206j77252J39324j18553l57098k56951o5163p5462K48758J81197
13555E14403O1833K28763J95137k20650j72512K30920J36546K6810n4435l03892
13545F42923j27462m6745O3461J94004k9785j05821K2419n3953J12701l829J03362
$$ plain form
13618 594070 523897 561801 470557 347709 493726 653481 562031 286259 344966 276864 405531
13607 405531 821950 712799 576716 470301 514547 471136 290395 9559 -205415 -34355
13597 -34355 243881 494091 567789 634344 567839 592017 731648 781107 1014298 1157315 1179419
13586 1179419 1004830 821580 813119 628375 548387 512797 505252 615950 792296 876327 986476
13575 986476 916668 852748 893696 1181988 1125076 846253 572798 628906 966530 1267809
13565 1267809 995603 818351 957675 839122 482024 225073 159910 84448 333206 514403
13555 514403 576236 804999 1000136 779486 606974 837894 974440 1001250 946815 642923
13545 642923 515461 468716 532177 726181 696396 590575 612994 559041 671742 667913 771275
13534G71275O8848L34028l65355k97084J08632J5386L15257k0320l32181j31971
13524D66515J24955J59927l88385J2742L27121n908O0879k22271j15488J12021
13514E32108J11430K34831R4297j09384o4808J50971P9875K7495p8501r3244j3398
13503H71672r8987k27712j25652r7197j25287J23321K99626P2299K1412q2255
13493F31240j08378n352Q3722K10093R3172j86882j64119o907j4542p7228N4941
13482E09760M9383k6307L57696j59215L6894J26692K6806J01499J30862j46289
13472A007781j80577Q0925k469l0926O766j03214k25171Q7825K12705n9895j62785
13461F30965k8096J69269J89577L70269l6075J37121P0277K31416k62483k95521
$$ plain form
13534 771275 840123 1174151 808796 511712 620344 635730 950987 930667 598486 466515
13524 466515 591470 751397 363012 375754 702875 696967 757846 535575 420087 532108
13514 532108 643538 878369 972666 863282 798474 949445 1029320 1056815 978314 885070 871672
13503 871672 772685 544973 419321 322124 196837 320158 619784 692083 713495 631240
13493 631240 522862 517510 601232 811325 904497 717615 553496 546589 532047 454819 509760
13482 509760 559143 532836 890532 731317 768211 894903 921709 1023208 1154070 1007781
13472 1007781 827204 908129 905660 874734 881500 778286 553115 640940 853645 793750 630965
13461 630965 602869 772138 961715 1331984 1295909 1433030 1503307 1734723 1472240 1176719
13451A176719P3673J42064m6683L8256k08915j80896l2771N227k0025R7253k34198
13440H09704q9142K8518k2893j40902P8403p578j47871R5569M58111m785l58391
13429F98743j0312O00j46055j73908N3946k7174p4804L3720K6851R59J36038J97877
13417G16481n449m9753L57036J92261j41818l26653j98975K57937K35197m4187
13407I92077j18876L02046J1497J38284L6113J10028J11602j06568k18376q5955
13397A171872k32506q2949J727J5969q3456L9920L1261j77462q1518N06708J73491
13386A283057L5894K45651m7452l13481N6486j9255K53213k28658m0781j95829
13376A028845N2598K9813K6127l57599k44438J64072K38016K34879L5322k4545
$$ plain form
13451 1176719 1250392 1392456 1345773 1384029 1175114 994218 961447 966674 946649 1043902 809704
13440 809704 720562 749080 726187 585285 663688 656110 508239 603808 1061919 1057134 698743
13429 698743 688431 689031 542976 369068 423014 395840 321036 354756 381607 382566 518604 716481
13417 716481 711032 661279 1018315 1210576 1068758 742105 543130 801067 1036264 992077
13407 992077 873201 1175247 1186744 1325028 1361141 1471169 1582771 1476203 1257827 1171872
13397 1171872 939366 856417 858144 874113 790657 830577 861838 684376 602858 1109566 1283057
13386 1283057 1318951 1564602 1517150 1203669 1260155 1240900 1494113 1265455 1224674 1028845
13376 1028845 1081443 1111256 1137383 779784 535346 699418 937434 1172313 1207635 1183090
13366A183090o3243j49109j67711L7071j22412l2127J87394J74703N9192k55583
13356H51265o2146J59236j6859m619j7257k6240j15456P831L3203n2115O9001
13345H25844J02080j46478J14188Q2321J00910O1086J4624J7724j9820k25997
13335I26482j93893P3376K45203M3236j60512J00302N4388k2273M7442O7236k12451
13324I68536j37635j22980m2499l7756J96059N5912P3328J06280L02042o9236
13314A292051k05106k28390K1008k50663L05858K12473K34693q8582k49531p3504
13304I70307J01477J24614K18853l09226k52191m3675J14332K28475q7880q1416
13294I83670J20053J94493P5478m8008L7926k27199k71163K96336J88938Q2399
$$ plain form
13366 1183090 1119847 970738 803027 840098 717686 685559 872953 1047656 1106848 851265
13356 851265 789119 948355 931496 926877 909620 883380 767924 775755 808958 756843 825844
13345 825844 927924 781446 895634 977955 1078865 1139951 1154575 1172299 1152479 926482
13335 926482 732589 805965 1051168 1094404 933892 1034194 1088582 1066309 1113751 1180987 968536
13324 968536 830901 707921 665422 627666 823725 879637 952965 1059245 1361287 1292051
13314 1292051 1086945 858555 879563 628900 934758 1147231 1381924 1293342 1043811 970307
13304 970307 1071784 1196398 1415251 1106025 853834 810159 924491 1152966 1065086 983670
13294 983670 1103723 1298216 1373694 1325686 1363612 1136413 865250 1161586 1350524 1432923
13284A432923j24943k12181j9863j85115k37514j75872K05710L05275l7875k25042
13274G25503K63743J03297j10196l51752J53349K86734R4595j08736j63960m3284
13264H49293p870M6538l5623m3799K5819K07223K15685K194m918k56094k52567
13253G45881m0149j0591J14048J33757N2013J70093J33319r0963j39161j25747
$$ plain form
13284 1432923 1307980 1095799 1075936 890821 653307 477435 683145 988420 950545 725503
13274 725503 989246 1092543 982347 630595 783944 1070678 1165273 1056537 892577 849293
13264 849293 841423 887961 852338 808539 834358 1041581 1257266 1259460 1254542 998448 745881
13253 745881 705732 695141 809189 942946 994959 1165052 1298371 1207408 1068247 942500
$$ [...]
##END NTUPLES=NMR SPECTRUM
##END=
