##TITLE=Analysis number 317418
Compound Code cd 01521
Project Code qc-cat
Chemist Name combi-blocks
##JCAMPDX= 6.0         $$ Bruker NMR JCAMP-DX V2.0
##DATA TYPE= NMR SPECTRUM
##DATA CLASS= NTUPLES
##ORIGIN= Bruker BioSpin GmbH
##OWNER= nmr
$$ XWIN-NMR		Version 3.5
$$ Mon Feb 20 12:15:27 2006 GMT Standard Time (UT+0h)  MAYBRIDGE\nmr@NMR_250MHZ
##.OBSERVE FREQUENCY= 250.131544655141
##.OBSERVE NUCLEUS= ^1H
##.ACQUISITION MODE= SIMULTANEOUS (DQD)
##.ACQUISITION SCHEME= undefined
##.AVERAGES= 16
##.DIGITISER RES= 18
##SPECTROMETER/DATA SYSTEM= dpx250
##.PULSE SEQUENCE= zg30
##.SOLVENT NAME= DMSO
##.SHIFT REFERENCE= (INTERNAL, DMSO, 0, 16.522)
##AUDIT TRAIL= $$ (NUMBER, WHEN, WHO, WHERE, WHAT)
$$ ##TITLE= Audit trail, XWIN-NMR		Version 3.5
$$ ##JCAMPDX= 5.01
$$ ##ORIGIN= Bruker BioSpin GmbH
$$ ##OWNER= nmr
$$ C:\u/data/dgb/nmr/ADRS/16280/pdata/1/auditp.txt
$$ ##AUDIT TRAIL=  $$ (NUMBER, WHEN, WHO, WHERE, WHAT)
(   1,<2006-02-20 12:15:02.92 +000>,<MAYBRIDGE\nmr>,<NMR_250MHZ>,
      <created by zg, POWCHK disabled, PULCHK disabled
       configuration hash MD5:
       84 BC 41 DB A1 6E 1D 46 DA 25 12 A5 C1 ED C5 3A
       data hash MD5: 64K
       D2 4E CC 01 09 3E 60 63 71 BE 51 76 12 F8 BE B7>)
(   2,<2006-02-20 12:15:17.20 +000>,<MAYBRIDGE\nmr>,<NMR_250MHZ>,
      <Start of raw data processing
       ef LB = 0.3 FT_mod = 6 PKNL = 1 SI = 32K 
       data hash MD5: 32K
       A8 28 E2 B7 2A F4 2D 0A C6 F2 45 FC F7 C3 0E 80>)
(   3,<2006-02-20 12:15:18.92 +000>,<MAYBRIDGE\nmr>,<NMR_250MHZ>,
      <apk 
       data hash MD5: 32K
       AF AD 06 0F 19 78 C6 30 86 49 DB 4D 86 BE D3 AE>)
(   4,<2006-02-20 12:15:19.73 +000>,<MAYBRIDGE\nmr>,<NMR_250MHZ>,
      <abs ABSG = 5 
       data hash MD5: 32K
       8B DF 17 24 86 3F 89 6F 30 EA 47 D8 78 9C EA 22>)
$$ ##END=
$$ 
$$ hash MD5
$$ 3F BA 88 EA C3 B5 94 A3 2C C8 E5 F3 37 07 D9 FA
##$RELAX= 
##$RELAX= 
##$RELAX= 
##$RELAX= 
##$RELAX= 
##$RELAX= 
##$RELAX= 
$$ Bruker specific parameters
$$ --------------------------
##$DU= <C:\u>
##$EXPNO= 16280
##$NAME= <ADRS>
##$PROCNO= 1
##$TYPE= <nmr>
##$USER= <dgb>
##$AMP= (0..31)
100 100 100 100 100 100 100 100 100 100 100 100 100 100 100 100 100 100 
100 100 100 100 100 100 100 100 100 100 100 100 100 100 
##$AQSEQ= 0
##$AQ_mod= 3
##$AUNM= <au_zg>
##$AUTOPOS= <19 >
##$BF1= 250.13
##$BF2= 250.13
##$BF3= 250.13
##$BF4= 250.13
##$BF5= 500.13
##$BF6= 500.13
##$BF7= 500.13
##$BF8= 500.13
##$BYTORDA= 1
##$CFDGTYP= 0
##$CFRGTYP= 5
##$CHEMSTR= <none>
##$CNST= (0..31)
1 1 145 1 1 1 1 1 1 1 1 1 1 1 1 1 1 1 1 1 1 1 1 1 1 1 1 1 1 1 1 1 
##$CPDPRG= <>
##$CPDPRG1= <>
##$CPDPRG2= <>
##$CPDPRG3= <>
##$CPDPRG4= <mlev>
##$CPDPRG5= <mlev>
##$CPDPRG6= <mlev>
##$CPDPRG7= <mlev>
##$CPDPRG8= <mlev>
##$CPDPRGB= <>
##$CPDPRGT= <>
##$D= (0..31)
0 1 0 0 0 0 0 0 0 0.06 0 0 0 0 0 0 0.0002 0 0 0 0 0 0 0 0 0 0 0 0 0 0 
0 
##$DATE= 1140437702
##$DBL= (0..7)
120 120 120 120 120 120 120 120 
##$DBP= (0..7)
150 150 150 150 150 150 150 150 
##$DBP07= 0
##$DBPNAM0= <>
##$DBPNAM1= <>
##$DBPNAM2= <>
$$ [...]
##$SUBNAM7= <"">
##$SUBNAM8= <"">
##$SUBNAM9= <"">
##$SW= 20.6930455092707
##$SWIBOX= (0..15)
0 0 3 0 0 0 0 0 0 0 0 0 0 0 0 0 
##$SW_h= 5175.983436853
##$TD= 65536
##$TD0= 1
##$TE= 294.16
##$TE2= 300
##$TE3= 300
##$TEG= 300
##$TL= (0..7)
0 120 120 120 120 120 120 120 
##$TP= (0..7)
150 150 150 150 150 150 150 150 
##$TP07= 0
##$TPNAME0= <>
##$TPNAME1= <>
##$TPNAME2= <>
##$TPNAME3= <>
##$TPNAME4= <>
##$TPNAME5= <>
##$TPNAME6= <>
##$TPNAME7= <>
##$TPOAL= (0..7)
0.5 0.5 0.5 0.5 0.5 0.5 0.5 0.5 
##$TPOFFS= (0..7)
0 0 0 0 0 0 0 0 
##$TUNHIN= 0
##$TUNHOUT= 0
##$TUNXOUT= 0
##$USERA1= <user>
##$USERA2= <user>
##$USERA3= <user>
##$USERA4= <user>
##$USERA5= <user>
##$V9= 5
##$VALIST= <valist>
##$VCLIST= <CCCCCCCCCCCCCCC>
##$VD= 0
##$VDLIST= <DDDDDDDDDDDDDDD>
##$VPLIST= <PPPPPPPPPPPPPPP>
##$VTLIST= <TTTTTTTTTTTTTTT>
##$WBST= 1024
##$WBSW= 4
##$XGAIN= (0..3)
0 0 0 0 
##$XL= 0
##$YL= 0
##$YMAX_a= 330743
##$YMIN_a= -438413
##$ZGOPTNS= <>
##$ZL1= 120
##$ZL2= 120
##$ZL3= 120
##$ZL4= 120
##$ABSF1= 16.522
##$ABSF2= -4.171173
##$ABSG= 5
##$ABSL= 3
##$ALPHA= 0
##$AQORDER= 0
##$ASSFAC= 0
##$ASSFACI= 0
##$ASSFACX= 0
##$ASSWID= 0
##$AUNMP= <proc_1d>
##$AZFE= 0.1
##$AZFW= 0.1
##$BCFW= 0
##$BC_mod= 0
##$BYTORDP= 0
##$COROFFS= 0
##$CY= 12.5
##$DATMOD= 1
##$DC= 0
##$DFILT= <>
##$DTYPP= 0
##$F1P= 14.0000005364418
##$F2P= -0.99999901652339
##$FCOR= 0.5
##$FTSIZE= 32768
##$FT_mod= 6
##$GAMMA= 0
##$GB= 0
##$INTBC= 1
##$INTSCL= 1
##$ISEN= 128
##$LB= 0.3
##$LEV0= 0
##$LPBIN= 0
##$MAXI= 10000
##$MC2= 0
##$MEAN= 0
##$ME_mod= 0
##$MI= 0
##$NCOEF= 0
##$NC_proc= -4
##$NLEV= 6
##$NOISF1= 0
##$NOISF2= 0
##$NSP= 0
##$NTH_PI= 0
##$NZP= 0
##$OFFSET= 16.522
##$PC= 1
##$PHC0= 233.0034
##$PHC1= 12.67922
##$PH_mod= 1
##$PKNL= yes
##$PPARMOD= 0
##$PSCAL= 4
##$PSIGN= 0
##$REVERSE= no
##$SF= 250.13
##$SI= 32768
##$SIGF1= 0
##$SIGF2= 0
##$SINO= 400
##$SIOLD= 32768
##$SREGLST= <1H.DMSO>
##$SSB= 0
##$STSI= 32768
##$STSR= 0
##$SW_p= 5175.98343685301
##$SYMM= 0
##$S_DEV= 0
##$TDeff= 65536
##$TDoff= 0
##$TI= <Analysis number 999999
Compound Code 99
Book Reference 9
Project Code 9>
##$TILT= no
##$TM1= 0
##$TM2= 0
##$TOPLEV= 0
##$USERP1= <user>
##$USERP2= <user>
##$USERP3= <user>
##$USERP4= <user>
##$USERP5= <user>
##$WDW= 1
##$XDIM= 32768
##$YMAX_p= 488309334
##$YMIN_p= -295895
$$ End of Bruker specific parameters
$$ ---------------------------------
##NTUPLES= NMR SPECTRUM
##VAR_NAME=  FREQUENCY,     SPECTRUM/REAL,   SPECTRUM/IMAG
##SYMBOL=    X,             R,               I
##VAR_TYPE=  INDEPENDENT,   DEPENDENT,       DEPENDENT
##VAR_FORM=  AFFN,          ASDF,            ASDF
##VAR_DIM=   32768,         32768,           32768
##UNITS=     HZ,            ARBITRARY UNITS, ARBITRARY UNITS
##FACTOR=    0.157963299565203, 1,           1
##FIRST=     4132.6476996994, 0,             0
##LAST=      -1043.33573715361, 0,           0
##MIN=       -1043.33573715361, -295895,     0
##MAX=       4132.6476996994, 488309334,     0
$$ Real data points
##PAGE= N=1
##DATA TABLE= (X++(R..R)), XYDATA
$$ [...]
18364A53101L3883j901K5368m334K975O0384N4512K6100M7105K0773m772l951
18352D09243R7500J31214J59703Q64L5250l9180R810j442k6434q0342j71082q9364
18340D35740n5600j9606l2740r762l3697k722K2161Q9914p3226L8048O5980l709
18328D20781j07056n3720P5825o0374m7651M9721M3535n0434k7483k3187M0538
18317B60495N7941o3890n3714o2470n4491m891M7012J12349M2879K448O5880J4711
18305C64259L5638M9532j7516m9805j09914l1463L6809O3512o9737k9236M9833
18294B91912R6490K384n9745o5965j4820P0292K0918M779M3292J36950P2847p9014
18282E20320j15041o246n302O2434j5324k5706K1758O6797K6063K8711n0704p3746
$$ y = [153101, 186984, 185083, 210451, 206117, 209092, 269476, 323988, 350088, 397193, 417966, 413194, 409243, 506743, 637957, 797660, 798524, 833774, 794594, 804404, 802962, 776528, 696186, 525104, 435740, 380140, 360534, 327794, 318032, 284335, 281613, 303774, 393688, 320462, 358510, 424490, 420781, 313725, 260005, 335830, 275456, 227805, 277526, 321061, 270627, 243144, 219957, 260495, 318436, 254546, 200832, 138362, 83871, 78980, 125992, 238341, 281220, 283668, 349548, 364259, 399897, 449429, 431913, 382108, 272194, 240731, 277540, 341052, 271315, 242079, 291912, 388402, 390786, 331041, 265076, 250256, 320548, 341466, 346245, 389537, 526487, 599334, 520320, 405279, 399033, 393731, 456165, 440841, 415135, 436893, 503690, 529753, 558464, 507760, 434014]
18270D34014L7822K6893k4791L2601K4926n5339j18613m0864M6036K0375L3426
18259D16486M6325J43812O2191p0278m4042j05067m6614N4061P5568J5798j1764
18248E36476n4752M3121j4925q0786q752M4689J14144J317J1299L9538O3029J14956
18236H09354K6178m4901P469P0864Q8524O73j8427L7732K5162p947P9861K7506
18224A102048j3279P5427J07851J20188Q7052J77103J18836J04748J92720J74701
18214B247395K46085K50445K01830K53968K29255L10009K18641J49179J06682
18205D213489J23473K28028L00191L25623L64862M54823N46457O81466Q87573
18196H125985J186470J420857J836933K513647L388283M454915N940208P797975
$$ y = [434014, 471836, 498729, 473938, 506539, 531465, 476126, 357513, 316649, 362685, 383060, 416486, 462811, 606623, 668814, 598536, 554494, 449427, 402813, 456874, 532442, 548240, 536476, 481724, 524845, 509920, 429134, 420382, 465071, 579215, 580532, 591831, 631369, 694398, 809354, 835532, 790631, 798100, 868964, 957488, 958161, 939734, 977466, 1002628, 994681, 1074542, 1102048, 1088769, 1164196, 1272047, 1392235, 1479287, 1656390, 1775226, 1879974, 2072694, 2247395, 2493480, 2743925, 2945755, 3199723, 3428978, 3738987, 3957628, 4106807, 4213489, 4336962, 4564990, 4865181, 5190804, 5555666, 6010489, 6556946, 7238412, 8125985, 9312455, 10733312, 12570245, 15083892, 18472175, 22927090, 28867298, 36665273]
18188C6665273J0075110J2655242J5000078J6637268J7000554J5446661J1684755
18181A35164941N888808r93227p551000j2550825j5225053j5481308j4164161
18174G5088175j1863283r645537p822384o288454n161012m341643l593210l068601
18166B3304051k688838k332210j947798j714185j579232j260361j009471p68723
18158A0003233p22619o74067n81605m33143m72537n06694m65047m80436l38440
18149E328645l76979m53441m04080l77481m70721l73601k67339k40871j99539
18140B164593k22691k32013j32802k8819n7217j77413j22029r2187j02217j1918
18130I85287q3031j370R833p5105j13170l5452j03315k4719j1728p4689n5490
$$ y = [36665273, 46740383, 59395625, 74395703, 91032971, 108033525, 123480186, 135164941, 141053749, 140060522, 132509522, 119958697, 104733644, 89252336, 75088175, 63224892, 53579355, 45756971, 39468517, 34307505, 29965862, 26372652, 23304051, 20615213, 18283003, 16335205, 14621020, 13041788, 11781427, 10771956, 10003233, 9280614, 8606547, 8024942, 7591799, 7119262, 6612568, 6147521, 5667085, 5328645, 4951666, 4498225, 4094145, 3716664, 3245943, 2872342, 2605003, 2364132, 2164593, 1941902, 1709889, 1577087, 1548268, 1491051, 1313638, 1191609, 1099422, 997205, 985287, 902256, 900886, 910719, 835614, 722444, 686992, 583677, 558958, 547230, 472541, 417051]
18119D17051K2156J9989J04m5100j01560q1745m5032Q475m7734m7336m6775k5280
18107B7213N0697n9964K9869R537Q6197k785p7437o7344M1600L1230p6488n2971
18095f0646N291J1537J2347j0929J10744J9020J8755r5891m7972m6437L8226M6422
18083D67l6922K2364M5186k6897n6624o0713j5213Q8886O6517m0957l7553J0041
18071d1418L0864J5192l9930O272Q7078j3632p3127O2114k256O233q2459p1073
18059a16142M7764l3220l3922K2297K4840L4578O8265j3373j04740m5994J5199
18048a34448J1990K7027L0689K9258P1071j9542M5341O8322p2626r2567l4431
18037f9916l0533N4781r74N7384k4054q5262j23821k8588k6345N299P4829R4577
$$ y = [417051, 439207, 459196, 459300, 414200, 312640, 230895, 185863, 194338, 146604, 99268, 52493, 27213, 77910, 17946, 47815, 57352, 143549, 140764, 63327, -4017, 37583, 68813, -7675, -60646, -55355, -43818, -31471, -42400, 68344, 87364, 106119, 10228, -37744, -84181, -45955, 467, -36455, -14091, 31095, 4198, -52426, -113139, -128352, -39466, 27051, -13906, -51459, -41418, -10554, 4638, -35292, -29020, 58058, 44426, -28701, 33413, 31157, 37390, -45069, -116142, -68378, -101598, -135520, -113223, -88383, -53805, 14460, 1087, -103653, -149647, -134448, -122458, -95431, -64742, -35484, 35587, 16045, 61386, 129708, 57082, -35485, -69916, -100449, -45668, -46642, 10742, -13312, -98574, -222395, -250983, -277328, -272029, -197200, -102623]
18025a02623p669N6460j0777K6124J18120M2538n7717L6370K1952q486j7000J3588
18013A10880o3601p0712n0737l0274j6891j1447L7367n0358M1977P4970L3842
18002E016k3767m0986N4898k7532j5693N693m5318O4641P3058k3707k800L8018
17990F1521q441o5511o1190K1226j9162m9291k0553K3750J4772K1275j3139o0885
17978a55628L4659Q9539k1703k2678k4166m3172J6883N4741R347o8766K2196L5501
17966g3247k532J3620j2325o869M5096O4896p6892q9223K2393L0032K4022J10567
17954D9538K5704m5994L4074r797J05833j3389r0962J1052Q0673J413r4238o8707
17942a4800M1904P5813j9331p0121k7231N8836M9959K1093k1688j01474j0342
$$ y = [-102623, -110292, -53832, -64609, -38485, 79635, 122173, 64456, 100826, 122778, 114292, 97292, 110880, 47279, -23433, -74170, -104444, -121335, -132782, -95415, -145773, -103796, -28826, 5016, -18751, -59737, -4839, -32371, -48064, -42371, -87689, -23048, 50010, 26303, 23503, 61521, 53080, -12431, -73621, -52395, -71557, -120848, -141401, -117651, -102879, -81604, -94743, -155628, -120969, -31430, -53133, -75811, -99977, -143149, -126266, -71525, -62178, -130944, -108748, -73247, -75779, -62159, -74484, -81353, -36257, 28639, -48253, -137476, -115083, -85051, -61029, 49538, 75242, 29248, 63322, 53525, 159358, 145969, 55007, 66059, 146732, 148145, 53907, -14800, 27104, 102917, 83586, 13465, -13766, 45070, 95029, 116122, 94434, -7040, -17382]
17931a7382J2257Q972K3459J7302n5237r6398P286N3228l2075j25958K4818M7664
17919a32064O7378M8183l6595q470j9428O8618K6938l4330l1936P816Q5973K1564
17907F3647l1539L5171k4052j07424j8938N3156O6570m9730J5558L4211q144k8098
17895C88l9733j2069n8711M600k80J4460K2715p0712l0656O5176K99N4022J587
17882d8914J18972J8836J2259N3375j07381o4195O1215k7386r1254N9713K0855
17871F095k8164O73j5160l9014j0135L4468k3193j6102Q3770K5541n3955l3547
17859f8723Q3430P4501l0482K5134J1587n0976o1873J6982N7906k7354m0511J7153
17847F774O3104O7401q1586r2015j6826J56962P7296j6735n6636j30805n8266
$$ y = [-17382, -5125, 3847, 27306, 44608, -10629, -107027, -99741, -46513, -78588, -204546, -179728, -132064, -64686, -16503, -53098, -61568, -80996, -12378, 14560, -19770, -51706, -43890, 42083, 63647, 32108, 67279, 43227, -64197, -83135, -29979, 36591, -13139, 2419, 36630, 28486, 388, -39345, -51414, -110125, -105525, -105805, -91345, -68630, -139342, -169998, -104822, -104523, -50501, -48914, 70058, 88894, 101153, 154528, 47147, -17048, 44167, 16781, -74473, -14760, 6095, -22069, -21396, -36556, -75570, -85705, -51237, -74430, -90532, -6762, 18779, -35176, -68723, 14707, 89208, 58726, 83860, 95447, 44471, -17402, -420, 57486, 30132, -10379, 6774, 69878, 137279, 55693, -36322, -53148, 103814, 181110, 164375, 107739, -23066, -81332]
17836h1332J11850J5180Q571j4377n5214M7641J05972j65067r2356J01753J15108
17825I7729R1896J2625o5568p3956q260k3737l5473m149p4001j16395Q6870P429
17813a04990Q5804J4460L5423K8925n8519k3842l2620r1387L3960J5643M1792
17802e5351J10714l2937R585O1662J14240l9255r092N6901j02454j36556L0821
17791H278N3540r8447P695K1031K1881K8410p2620j12026K2976M3393j20037m9044
17779b44970Q3983P5985n5465J2916K4855p4958K5455Q8401J05530k979n0716
17768a1963p2359k1230J9879J8778j0563l0924K1443K6799L9752J4560J2997m9373
17756d2204m3736N6185p1374l2927O250l2278O330L6232O0831r685l0127l8858
$$ y = [-81332, 30518, 45698, 54269, 39892, -15322, 32319, 138291, -26776, -119132, -17379, 97729, 189625, 202250, 136682, 62726, 54466, 30729, -4744, -8893, -82894, -199289, -112419, -104990, -19186, -4726, 30697, 59622, 1103, -22739, -55359, -146746, -112786, -97143, -55351, 55363, 22426, 32011, 93673, 207913, 168658, 159566, 216467, 114013, -22543, 8278, 61818, -36629, -28934, -7903, 13978, 42388, -30232, -142258, -119282, -75889, -195926, -244970, -160987, -85002, -140467, -127551, -102696, -177654, -152199, -63798, 41732, 38753, -11963, -84322, -105552, -85673, -66895, -77458, -108382, -86939, -60140, -20388, -5828, 7169, -42204, -85940, -29755, -101129, -134056, -127806, -160084, -153754, -117522, -56691, -66376, -96503, -135361]
17744a35361j2557P7804M2415n3487p0941L6440j3536K6120J02814O0470o7015
17733f834j30297k6159j4766J11094K9688L7146L5591P358J7272k3906j8282j1395
17721F510n8480P373O4934r899n7668m3455P0445n8040n6715O0312N5674j0365
17709b9374K3495L0193l4381k6426j5988m3886M8732m4820p786M5785J1899o3382
17697a05939j4731m4531r5868M6989R2952J5434M0138k6788m3148m7576n5657
17686b38725J02655J15086P4958M2638M6889p3452j31682o6610J01671L1647m1708
17675c6633M6291J4722n3680J27389N120p3906J17467N5084J9099J2751J36353
17664C70057J78820J34871j3121j554L974l7275o4243j03942j16711m2202j05240
$$ y = [-135361, -147918, -70114, -27699, -81186, -152127, -115687, -129223, -103103, -289, 60181, -6834, -137131, -163290, -178056, -66962, -37274, -128, 35463, 42821, 60093, 36187, 17905, 6510, -51970, -44597, 20337, 10438, -47230, -90685, -20240, -78280, -134995, -74683, -19009, -29374, -5879, 24314, -10067, -36493, -52481, -96367, -47635, -92455, -100241, -54456, -42557, -105939, -120670, -165201, -261069, -214080, -121128, -105694, -65556, -92344, -135492, -183068, -238725, -136070, -20984, 53974, 96612, 143501, 70049, -61633, -128243, -26572, 5075, -36633, 9658, 24380, -29300, 98089, 103209, 29303, 146770, 201854, 220953, 233704, 370057, 548877, 683748, 670627, 669073, 673047, 635772, 571529, 467587, 350876, 308674, 203434]
17653B03434p5411r726N8717L2210q418m8403M145r7773j2657J0395R823l4439
17641C1897k1780M1695K299r465k8410Q2736J5913l0257L9639O5889k3020K7090
17629A94226M3901r106p4893j6418n2888K785J9247k1136o0878q2175P6896O1981
17617H1542l4103L0530L1290q0842l6439n1446J8128L2334P9237j2469L2745L4272
17605A24779k4725r4240L1897P5573M3089K335k7062p3621n8083k6494j5432K4753
17593a7231K8801L7329K0545j3897q6627M9233N5756K3232m5341q1227K5402J4198
17581A0173o9414O753J2573K3334k6670R618j2052m5585J8907Q0636L8670L1240
17569G8183n2275j3635L5049K1133o4284j00734n3345P3357J16058n6966J9003
$$ y = [203434, 128023, 118297, 177014, 209224, 200806, 152403, 156548, 58775, 46118, 56513, 66336, 31897, 10117, 51812, 54111, 44646, 16236, 98972, 114885, 84628, 124267, 190156, 167136, 194226, 238127, 229021, 154128, 137710, 84822, 87607, 106854, 85718, 24840, -57335, 19561, 81542, 47439, 77969, 109259, 28417, -8022, -59468, -41340, -9006, 70231, 57762, 90507, 124779, 100054, 5814, 37711, 113284, 156373, 158708, 131646, 58025, -58, -26552, -41984, -17231, 11570, 48899, 69444, 55547, -31080, 18153, 73909, 97141, 51800, -29427, -4025, 10173, -59241, -52488, -39915, -16581, -43251, -33633, -45685, -91270, -72363, 8273, 46943, 78183, 25908, 12273, 47322, 68455, 4171, -96563, -149908, -76551, 39507, -17459, 1544]
17558A544O7263K9815r192m1405J8790m7820k1751p2176k5358O0426K7306m218
17546a6776m7647K017O0614J7899l2239n550M9049m3457n6174l992o8914l4646
17534a79816M9649K7330k7056l0322k48M0791N1624k5853l1388r745j110P7240
17522e8904Q4226L7047r292Q872l8042o1521L963N7741p0705q8195m7887J9404
17510a63293J53038N4911J4775j3651P8461O3619N123l9433j30987k9158j6566
17499b3161l7397q647M2462k6022n593Q0107K9173k4120m087M8448L9286l1556
17487G8893m6531m5091J5496N9663N5482o3437q5439M3459L4155j2640r985m3926
17475a9901m183N1382P781q9543k5647O8915m3541O942P275k4697N6654N5333
$$ y = [1544, 68807, 98622, 89430, 48025, 66815, 18995, -2756, -74932, -100290, -39864, -12558, -16776, -64423, -62406, -1792, 16107, -16132, -21682, 27367, -16090, -72264, -76256, -145170, -179816, -130167, -102837, -129893, -160215, -160463, -119672, -68048, -93901, -125289, -135034, -136144, -58904, 25322, 62369, 53077, 61949, 23907, -37614, -33651, 24090, -46615, -134810, -182697, -163293, -10255, 44656, 59431, 45780, 124241, 187860, 192983, 153550, 22563, -6595, -23161, -60558, -69205, -26743, -52765, -58358, 21749, 50922, 26802, 22715, 71163, 110449, 78893, 32362, -12729, 2767, 62430, 117912, 54475, -30964, 12495, 46650, 34010, 24025, -19901, -24084, 27298, 35079, -54464, -80111, -11196, -54737, -47795, -40520, -65217, -8563, 46770]
17463D6770K8878n644L774k5975n9925K4940M6809n8936n6349q5752P3133R6049
17451B7772M4575n0229r1567n0723l5856j695L5100j8344l3602q370j1966K7577
17439a67328J4006J07431O6222J180L7593N0022J3936k0992m3884k4084J7898
17428E2000Q9584M7948m6440j27861k6062l8289O5978k7860j7011N2298M775r7177
17416f8117q1568M664J24412L0958K294p135k8176l9575L2004K0000J1260Q675
17404I696j9353p733J7205k0958j8739k8670L7812Q1501j6875k6772k738M4073
17392D8449Q660M585k7478q6293q8831K8103l0384J21952R3896J5749p6748n2761
17380d1101k2746n0435k9986N2959J03266o2112r9583O002J00830N8802o1969
$$ y = [46770, 75648, 70004, 73778, 47803, -12122, 12818, 59627, 691, -55658, -141410, -68277, 27772, 72347, 22118, -69449, -120172, -156028, -157723, -122623, -140967, -174569, -182939, -194905, -167328, -153322, -45891, 20331, 21511, 59104, 109126, 123062, 102070, 58186, 34102, 52000, 141584, 189532, 143092, 15231, -10831, -49120, 16858, -11002, -28013, 24285, 29060, -68117, -149685, -145021, -20609, 10349, 12643, 5508, -22668, -62243, -30239, -10239, 1021, 9696, -9657, -17390, -185, -21143, -39882, -68552, -30740, 50761, 33886, 7114, 4376, 48449, 57109, 61694, 34216, -52077, -140908, -112805, -143189, -21237, 72659, 88408, 11660, -41101, -63847, -114282, -144268, -91309, 11957, -50155, -149738, -143736, -42906, 15896, -46073]
17369d6073l2087M5757j8083j25610o9352M5460L0746O0751L4727N8836N920k8220
17357c7228N5106L6231o1742j07996L4403N5710K8609K0072o361K81j591p3505
17345e8011k2107N2102O6630R203j4127r4027m2493J3105J8468O7904K1195N0998
17333F8840k4110q5004K8577K4229N727l5198L7231m9793K7937J8841r021p7842
17321f9586j09832m4445l8812j781M3139O3510N3706J1268Q9919N3308O84m4364
17309F714j03162j7660M2415L780m5230q3546K5806K2355M4817L4872L6351m51
17297c2939j7968l9241n4917L9964K5504M7844j1695j7505P880l6600P1849K0414
17285B590n9104l2277L9438L1388l0363p832l0605O6331Q3993l0169q2400r9496
$$ y = [-46073, -78160, -32403, -50486, -176096, -245448, -199988, -169242, -108491, -73764, -14928, -9008, -37228, 17878, 54109, -7633, -115629, -81226, -25516, 3093, 23165, 16804, 17085, 15494, -58011, -80118, -28016, 38614, 47817, 33690, -60337, -102830, -89725, -71257, -3353, 17842, 68840, 44730, -40274, -11697, 12532, 18259, -16939, 20292, -29501, -1564, 17277, 8256, -69586, -179418, -223863, -262675, -264456, -221317, -157807, -104101, -92833, -2914, 50394, 51078, 6714, -96448, -114108, -71693, -67913, -113143, -196689, -170883, -148528, -103711, -68839, -32488, -32939, -50907, -90148, -145065, -105101, -79597, -31753, -43448, -60953, -53073, -89673, -17824, 2590, -56514, -88791, -49353, -17965, -48328, -56160, -86765, -20434, 63559, 33390, -49010, -148506]
17273a48506m7877r0271P8906P0611P9734J22220K3829j4964R546l5756k4719
17262B2753l4158m3735M8388M1354q765k4253P064K3809P0880l418p9112j58O5495
17249H6144l3785o9828L8914N2174j2288n2959j2572L5344L2275r8232j05693
17238a40506N70K7464O9073l27j9398o1726N7693M0629p914n5387K3306O3020
17226c503n6413k9033Q276m7100L9483P946O612n9939q690M128L3508O3896l1835
17213g2664K4876N3321k4574n2992q2304j6443R9349J6836K427K4254m3466J3928
17201e7452M5037L6260m9465k7724M0467M1898k6397l5483j14125k9296J60660
17190a5620L6387m0979l1580M8982P3052p965n8979j9427n4585j4454l0150j4821
$$ y = [-148506, -196383, -286654, -207748, -137137, -57403, 64817, 88646, 73682, 83228, 47472, 22753, -11405, -55140, -6752, 34602, 25837, 1584, 8648, 32457, 103337, 99919, 20807, 20649, 86144, 52359, -17469, 21445, 73619, 61331, 8372, -4200, 31144, 63419, -34813, -140506, -139936, -112472, -43399, -43726, -63124, -124850, -67157, -26528, -34442, -89829, -66523, -3503, -59916, -88949, -80673, -127773, -88290, -80344, -73732, -133671, -142361, -138233, -104725, -40829, -72664, -47788, 5533, -19041, -72033, -154337, -170780, -71431, -54595, -52168, -27914, -71380, -57452, -12415, 23845, -25620, -53344, -12877, 29021, 2624, -32859, -146984, -176280, -15620, 20767, -20212, -51792, -2810, 70242, 62277, 3298, -16129, -70714, -85168, -115318, -130139]
17178a30139Q8755J31288K1934j3167j0953p2510l5967j3004P1477j13517J4494
17167f1309O9659M1810p1513k1484J02189K2590n238j1908m0807k3747n1945K3197
17155b8506L3922J9206P1605p542n0009N0637K1391j57472n2083P543M6016l133
17143d8425o9676L8606N9823L0864l8128N2475j825k7202O7635J3802m1317m8487
17131a1855r8582p480J9240K8672Q7985R433r8277o7742j1835K6276n2417N5145
17119a21437q897O0984J02918Q0811p900n6248L1153n8242j04433j3687N8346
17108c6632j2978o255J5414P196K9577m6750p75o575L9982J4470K3480K2551l313
17095C9392k7700K3601o3065l3319j8634j16738k4655Q7046K7762M0672r1346
$$ y = [-130139, -41384, 89904, 111838, 98671, 87718, 15208, -20759, -33763, 37714, -75803, -61309, 8350, 50160, -21353, -42837, 59352, 81942, 76704, 64796, 23989, 242, -51703, -28506, 5416, 24622, 96227, 88685, 38676, 89313, 110704, -46768, -98851, -91308, -45292, -48425, -118101, -79495, -19672, 11192, -26936, 25539, 23714, -3488, 64147, 77949, 36632, -11855, -110437, -117917, -98677, -70005, 17980, 27413, -70864, -138606, -150441, -124165, -176582, -121437, -130334, -69350, 33568, 114379, 106479, 50231, 81384, 23142, -81291, -94978, -36632, -49610, -55865, -40451, -33255, -3678, -50428, -51203, -57778, -17796, -3326, 20154, 42705, 39392, 11692, 35293, -27772, -61091, -79725, -196463, -221118, -134072, -106310, -65638, -156984]
17084a56984R2N4048K5003O0833M1171J4737p1497m1545m764k8361n3623P2851
17072h8039J84722Q0379n7911p4581K4989m355K2L614p5564K509L112L0757K6905
17059E6559k9758l7860N89o5235o2759j6865J1169J20486J45638k2221m878l3743
17047F1122o4173O4790j6104M4182l567n2341m4356J9963K7451O3014O461l1643
17035G4799j7685L7479k9300k3292p6655O048J6758M3892k8007p6692j16264K8709
17023a60210l511P4279R0127r2567N193Q4321O1827J5388M4355O0295j51425m0272
17011a2200k5282m8726L4475P6009n867o7221m7966n7854j8097J05708R3867l6011
16999i165J8367L48L6578J0610k7825l7537l3087r677J01483p154j16096j5179
$$ y = [-156984, -156892, -102844, -77841, -17008, 24163, 38900, -32597, -74142, -78906, -107267, -160890, -88039, 96683, 177062, 119151, 44570, 69559, 65204, 65226, 68840, -6724, -4215, -1103, 29654, 56559, 26801, -11059, -10470, -75705, -138464, -155329, -144160, -23674, 121964, 99743, 94865, 61122, -3051, 61739, 45635, 89817, 86250, 33909, -10447, 9516, 36967, 99981, 106442, 74799, 57114, 94593, 65293, 42001, -34654, -28606, -11848, 32044, 4037, -72655, -188919, -160210, -163721, -89442, 685, -91882, -86689, -2368, 59459, 74847, 119202, 179497, 28072, -12200, -37482, -86208, -51733, 24276, 18409, -48812, -96778, -154632, -172729, -67021, 26846, -9165, 9202, 9550, 46128, 56738, 28913, -8624, -41711, -51388, 50095, 42941, -73155, -88334]
16987h8334L5445q5210p149P4116Q2155J0897N5686M0418o9328n6792l2063n5002
16975i5161J547L9598m0637K0457J52236p3310l6583K7299m9561O7058K8637q6863
16963d5283p2943k5949o947O6973J02035o5117m9252L5181M1946K1538J1472r117
16951D537P786m7969K9570J39205j3870n1730k2271q0623o1205j6798K7967k7297
16939a12698k755m0365j0921j4180R417m2086M8238J60515j1500p2586k5164J7305
16927i6780l3428J4503K7562L8430m3640l9301L8363N0055J2382K6117J8752k7148
16915a4133k8792n4330j29244p318K2659M4734J11773M6949J9443k1223l7796
16904d7278Q966k283J8900O0841q3599j04630j0995k7832M5688N0280J550j461
$$ y = [-88334, -52889, -138099, -145248, -71132, 11023, 21920, 77606, 118024, 48696, -8096, -40159, -95161, -93614, -54016, -94653, -74196, 78040, 4730, -31853, -4554, -54115, 12943, 41580, -45283, -118226, -144175, -151122, -84149, 17886, -47231, -96483, -61302, -19356, 2182, 13654, 4537, 12323, -35646, -6076, 133129, 119259, 67529, 45258, -35365, -96570, -113368, -85401, -112698, -115453, -155818, -166739, -180919, -171502, -213588, -165350, -4835, -16335, -88921, -114085, -96780, -130208, -115705, -88143, -49713, -93353, -132654, -94291, -44236, -31854, -5737, 13015, -14133, -42925, -97255, -226499, -233817, -211158, -166424, -54651, -7702, 11741, -9482, -47278, -38312, -40595, -21695, 39146, -44453, -149083, -160078, -187910, -142222, -91942, -90392, -91853]
16892i1853J31470N1131j9777K4244l4417k1772q7285r13K1139m5589j3098J7795
16880f8925j18711o7812N6812M3531j0856J2758k4855l2897K8533l46M6096M2728
16868i3944J1485l3995k6497J24343J09277K0510J8222m4625j42179O335K3623
16857b7445q0991p2753l0744M6027K6462k3843j7299n837M6119J8985P8019k3597
16845f6897Q7490L8268p0960q8764o0227j5764J02379M1498k6716k6360N7718
16834b8335k2253p8278k281k6780L363m6171m0471J9660J26591J50170j4039o0497
16822a9321K6721q317k6344k5500m2079Q515P3324j348j0141r18q80r752m9874
16809h5914p3231J4939J0318P0631L0955n481k8060m2809N2396O6166N0933l1572
$$ y = [-91853, 39617, 90748, 70971, 95215, 60798, 39026, -48259, -49172, -28033, -73622, -86720, -68925, -187636, -255448, -198636, -155105, -165961, -153203, -178058, -210955, -182422, -182768, -136672, -93944, -82459, -116454, -142951, -18608, 90669, 111179, 129401, 84776, -57403, -51068, -27445, -108436, -181189, -211933, -165906, -139444, -163287, -180586, -186423, -140304, -121319, -43300, -66897, 20593, 58861, -12099, -100863, -161090, -176854, -74475, -32977, -59693, -86053, -28335, -50588, -128866, -131147, -157927, -154564, -200735, -241206, -221546, -94955, 55215, 41176, -19321, 7400, -917, -27261, -52761, -94840, -86325, -13001, -14349, -24490, -25408, -26288, -36040, -85914, -159145, -144206, -133888, -63257, -32302, -37783, -65843, -108652, -56256, 9910, 60843, 29271]
16797B9271r7447J5727L3711M957j3494N4632P7804j2450o3774l5588K2793l8967
16785b2825m2067M1769K1766P9572L3357p0461j19214k2611O5047N1538K0264
16774C6135m0963n2167K8091P034n5719o754P2493J6743n8528L5576N1246n99
16762C2588K3149j3407j10336P187N2837R9805N9642r7671m6101Q6666M9779J9134
16750A63272m4688P2294j2451j28047p8692K7059R9582K248m3243l0202o5271
16739c8139J3628J03722j63660j03754J23344P8978K9365l3508j6950O9210M2235
16728A04471n053k7932L3482m02r5519k3372l3697k9690l0102p2352M2521J06799
16716c0846M512q7854n3572M4304l0727k7489K6258N7149k0825L82J3886K0619
$$ y = [29271, -68176, -52449, -18738, -13781, -27275, 27357, 105161, 92711, 28937, -6651, 16142, -22825, -64892, -23123, -1357, 78215, 111572, 41111, -78103, -100714, -35667, 15871, 36135, -4828, -56995, -28904, -21870, -77589, -84343, -11850, 4893, -53635, -18059, 33187, 32588, 55737, 42330, -68006, -60819, -7982, 91823, 151465, 53794, 7693, 94359, 144138, 163272, 118584, 190878, 178427, 50380, -28312, -1253, 98329, 100577, 57334, 27132, -38139, -24511, 79211, -84449, -188203, -64859, 14119, 43484, 9976, -6974, 62236, 104471, 99418, 71486, 104968, 104566, 9047, -14325, -48022, -77712, -107814, -180166, -137645, -30846, -26334, -114188, -167760, -123456, -154183, -181672, -155414, -98265, -119090, -118708, -104822, -84203]
16704h4203l2837Q2157O0331j13424n5585m088p3816k278J97713R7555o4545j17600
16692a10620J9008J2813r7603J0689J28986K9868J8873K561L8897K0602p2358
16681A716r4283n0685M7042J20651n1048J882k2782q1819J1968l7486M2487j7699
16669a30056P4717O0525l9373J9384l3867p7683n942n6679J328M8861L1970O769
16657a00046L1376P1402Q5691k2790q2379j9106l5566p290J7310q221j1759l675
16645h5053R0418J0062n2869n7674K8480N6973k5347K17l1259P7321j6273r139
16633a4143k9860n7602P7876N7239o4104L7150P1137K1292k6497j05596j26267
16622a59375k6689L8927R1072O4666J8918o3230O0003L4830O68r31j3703o9044
$$ y = [-84203, -117040, -34883, 25448, -87976, -143561, -147649, -221465, -223743, -26030, 71525, 6980, -110620, -91612, -78799, -176402, -165713, -36727, -6859, 12014, 14575, 53472, 74074, 1716, -92567, -143252, -96210, 24441, -26607, -24725, -47507, -129326, -117358, -154844, -112357, -130056, -55339, 5186, -34187, -14803, -48670, -126353, -132295, -188974, -187646, -138785, -106815, -100046, -68670, 2732, 88423, 65633, -16746, -35852, -71418, -78708, -61398, -69619, -81378, -85053, 5365, 15427, -37442, -95116, -66636, -9663, -35010, -34793, -66052, 11269, -5004, -14143, -44003, -101605, -23729, 33510, -30594, 6556, 77693, 98985, 72488, -33108, -159375, -186064, -147137, -56065, 8601, 27519, -35711, 24292, 59122, 59790, 58859, 45156, -23888]
16610b3888k8573k3401l4336k0344O3734j2259o5730j11521L6235J51174J15965
16599D7056j4954o6011l9772p7381L017K0126J034Q1357j7955l4062N186M0088
16587e2271L815l4418L3923N2400l215k3874j6718K8001J3578J8916p399m4337
16575c1599O0852j798L4007N6102r9653p5742P3905J00593o5228p2378j0511k421
16563c3871l3004m1770N9820M6484j0001l3756k0083m3226J7774j90p0404J4601
16551a47626R4212K3163k0892K4514N06J0530M8541j3368N1310j8342j8897L8681
16539G2332n7052r9031P2022j2059k7477k0620l9455n138m3794n1901Q8421M6331
16527g7421J01108K8217m616k5546l4456L8167n0983o0910M3508K2266j1089o4092
$$ y = [-23888, -52461, -75862, -110198, -130542, -66808, -79067, -144797, -256318, -220083, -68909, 47056, 32102, -33909, -73681, -151062, -148045, -127919, -126885, -45528, -63483, -97545, -92359, -52271, -48456, -82874, -48951, 3449, 234, -23640, -40358, -12357, 1221, 20137, 12738, -31599, 29253, 27455, 61462, 117564, 17911, -57831, 16074, 116667, 51439, -20939, -31450, -33871, -66875, -108645, -48825, -2341, -12342, -46098, -66181, -109407, -91633, -91823, -162227, -147626, -53414, -30251, -51143, -26629, -26123, -15593, 32948, 19580, 70890, 52548, 33651, 72332, 15280, -83751, -11729, -23788, -51265, -71885, -111340, -116478, -160272, -212173, -123752, -77421, 23687, 51904, 47288, 21742, -12714, 25453, -25530, -86440, -42932, -20666, -31755, -95847]
16515i5847m6001J8865R4268M0117j90M7022K1888L065K3241n6399q3512k0799
16503e4282l9536J2906J7332L4650L6858l7667n4110p2856p516J7385N3753O3989
16491b9094L6386l6962q9405N6008Q6915Q990j42044m2377J06667L2634j06780
16480a19062m7273J0528N2712M6233n9410n7716J01875J13663l2337r5367j3665
16469i9819R8367R5192R743j02950n013J4275J0494n225m1437j0822p702j850
16457d6747k6898n7259O7505J9308L0000P6858M3034j10879j11684O5388M755
16446d6619m9283m9198J6357J02413J01888M8822n7118r7673k6710k7530Q928
16435g5723L1054J343l3535n8954k2918K7471M0434M3697p264l895N6450L5781
$$ y = [-95847, -141848, -122983, -28715, 11402, 11212, 58234, 80122, 83187, 106428, 50029, -33483, -54282, -93818, -80912, -63580, -28930, 7928, -29739, -83849, -156705, -164221, -146836, -93083, -29094, 7292, -29670, -119075, -63067, 23848, 32838, -109206, -151583, -44916, -12282, -119062, -166335, -155807, -103095, -56862, -116272, -173988, -72113, 41550, 9213, -86154, -99819, -1452, 93740, 103483, 533, -4480, 9795, 20289, 15064, -26373, -37195, -44897, -46747, -73645, -130904, -63399, -44091, -14091, 62767, 105801, -5078, -116762, -51374, -46619, -95902, -145100, -128743, -26330, 75558, 124380, 67262, -30411, -57121, -84651, -75723, -44669, -43326, -76861, -135815, -158733, -131262, -90828, -47131, -54395, -58290, -1840, 33941]
16423C3941q3011J4986o9739N435k236l8268M9037L4028m8855J7612O6500K4794
16411D224K3803J3077L373J6758j08080l0991L3887k1692r263R3735o4473L658
16399d1984P5867n3148o2377l5333L8848j464k7331J6394j4054P0391L1449J1810
16387I068L4634Q329K1267j36380j73102l4175L4290Q5530J40653j3839k5993
16376d9718L8979J6025K2837L0402k1936O8776K2864N950k6434k5415k8348n7081
16364c099J3666Q0888P825j1960k4108O8117K6601k2995o2539j17871r6287J2873
16352a28889M3292R739k2914N3187L4597L7245m7127L6367j7321j6860K8115j0258
16340h27L740J8691P8428l1621J0392N8253N969k2962N9504P8773M8455J8094
$$ y = [33941, -49070, -34084, -103823, -98388, -100624, -138892, -89855, -55827, -104682, -87070, -20570, 4224, 28027, 41104, 44477, 61235, -46845, -77836, -43949, -65641, -74904, 18831, -45642, -41984, 33883, -19265, -81642, -116975, -78127, -79591, -106922, -90528, -104582, -34191, -2742, 9068, 43702, 52031, 73298, -63082, -236184, -270359, -236069, -150539, -9886, -23725, -49718, -10739, 5286, 28123, 58525, 36589, 105365, 128229, 134179, 107745, 82330, 53982, -3099, 10567, 91455, 99280, 87320, 63212, 131329, 157930, 134935, 72396, -45475, -141762, -128889, -85597, -75858, -98772, -45585, -10988, 26257, -20870, 15497, -1824, -18684, 9431, -827, 2913, 21604, 100032, 68411, 78803, 137056, 143025, 120063, 179567, 258340, 306795, 324889]
16328C24889j4824j7519K5892q7893q9224n4370O371q660j1523k0366n9695k8956
16316c5878P599O6788J4239Q005L3088j2630j8098N8773j998m8637p2820q3343
16304h4912J0216J1279P570o5388j7128L5753R1713k2955l5940q426R2772J1626
16292B6180p1991Q086N3116p582K32j5822p355J2944p7735Q2175J8898j2431Q3619
16279I2334N1539j14439j26785l7262N9401k8050k1390J1353L7260J02754O8937
16268I5652k2552K9626L4174k1816O8288k322r1070M8937p2720m9345r063R630
16256A7419l5339k6584J26753m2852J6250O2409L4231n4937Q22n7021j5540K9315
16244E4926M0563M590M4379n6665j07002j19010j16198K2008J00339O2306p7186
$$ y = [324889, 310065, 292546, 318438, 230545, 141321, 86951, 93322, 84662, 73139, 52773, -6922, -35878, -28279, 38509, 52748, 60753, 93841, 81211, 63113, 121886, 119888, 71251, -1569, -84912, -74696, -63417, -55847, -121235, -138363, -102610, -10897, -33852, -69792, -78218, 14554, 26180, -45811, -37725, 15391, 7809, 8041, -7781, -15136, -2192, -79927, 2248, 21146, 8715, 92334, 143873, 29434, -97351, -134613, -75212, -103262, -124652, -113299, -76039, 26715, 95652, 73100, 102726, 136900, 115084, 183372, 181050, 89980, 138917, 66197, 16852, 7789, 17419, -17920, -44504, 82249, 39397, 55647, 118056, 152287, 97350, 98172, 41151, 25611, 54926, 95489, 100079, 144458, 87793, -19209, -138219, -254417, -232409, -132070, -69764, -146950]
16233a46950j4798M8371r531l1654R541K7153q401L1271J1834K4896R0213M9507
16221H1452L3827k0365j25510N702J07744o8337j06989L1236O8413M1182l0522
16210A7833o4255m8703O977L9122O7540n3143q779Q5148O2285j27998o0755R427
16198g5301R6115Q6359P2021m1966k746o0978q2865n5986k9648M1935r286J2830
16186d9516P9727J7710m2877K4074N6992p627k0858J0609M0721M0774r4128j1981
16174D3620j6598m9579l7165j4350r0706N5350J15279M487l0095K1024p7674n133
16162h1540J47013Q648k4829K0214M8458n7116o1771n5852k9252R6538N1412j5390
16150D6533k4129m0791p2656n9001k2520M9629L4565L0626L8694O7165M3382q2836
$$ y = [-146950, -161748, -113377, -122908, -154562, -145021, -117868, -126269, -94998, -83164, -58268, 31945, 81452, 115279, 94914, -30596, -24894, 82850, 14513, -92476, -61240, 7173, 48355, 17833, -46422, -95125, -88148, -49026, 18514, -34629, -43408, 41740, 104025, -23973, -84728, -75301, 20814, 107173, 179194, 137228, 134482, 73504, -9361, -65347, -94995, -53060, -62346, -49516, 30211, 47921, 5044, 29118, 86110, 78483, 57625, 68234, 108955, 149729, 55601, 43620, 27022, -22557, -59722, -74072, -164778, -109428, 5851, 10338, -19757, 1267, -76407, -81540, 65473, 74121, 49292, 69506, 117964, 60848, -923, -56775, -86027, 10511, 61923, 46533, 22404, -18387, -91043, -150044, -172564, -122935, -88370, -57744, -19050, 48115, 91497, 8661]
16138H661l327P9148p1542k9115l4435N5840p035l9208P1306M894o7820K6082
16126f551O0987m0463n2823J1569K8642r8121j8482P4605L8394k9159L1752M3863
16114D4213N696O2940K3695j28014j22446p3275k6512Q2003J53116M1336m6553
16103A6199O191L6567Q9092k1029l9424n5135p7088J0664J803L3490j125k8009
16091b7804K8184R3077N4970j14094p8278j3242N1235p167K2219m8567r0611J8073
16079a12005K1287m8699n4318N1262m0941j4921J6776N1473K0087J15041J20005
16068A25047P7175o6727j62237O8051l5923q9519n4509L4243J33011K9134p6275
16057a8529K813l1549M3568R9172K8949r183j2279p984J007p5327r7385l6543
$$ y = [8661, 5334, 84482, 12940, -16175, -50610, 5230, -1805, -41013, 30293, 35187, -32633, -6551, 54436, 13973, -38850, -27281, 1361, -96760, -115242, -40637, -2243, -31402, 350, 44213, 49909, 112849, 136544, 8530, -113916, -187191, -213703, -131700, 21416, 62752, 16199, 22390, 58957, 148049, 127020, 87596, 32461, -44627, -33963, -32160, 1330, 205, -27804, 380, 93457, 148427, 34333, -43945, -57187, -5952, -13119, 9100, -39467, -130078, -112005, -90718, -139417, -193735, -142473, -183414, -198335, -181559, -130086, -109999, 5042, 125047, 202222, 135495, -26742, 41309, 5386, -84133, -138642, -104399, 28612, 57746, -18529, -15716, -47265, -3697, 95475, 124424, 115241, 102962, 94978, 95985, 20658, -76727, -113270]
16045a13270j4341J9840K5876k2859j5495K5137K2453J9202k6320m6976j6582
16034a43335L09N6087j344O7348K8910m2809N7907k3951m1974N8734N0248k6511
16022C9619l6479P7317M683l2902l8282l9571r528m880j255m0774m669N8095m2602
16009g1228k7249K3445l3674L3144N3476L6827N388R7653M2380m295l4386k753
15997A18728p8346p5102k1882L0650j3524P2304N3857k6112k371r5484P5956M422
15985D3096p9494j8494j3015ml5549K3308k8081K279j1108L5180r0333O6477Q7551
15972a8187J4805l89M4773Q6293o3406o5487k5064l969j1208q6474j5780L9947
15960a04146M998O1615Q323j0469O2069n0521n1721l57k7360q0159L3287J73188
$$ y = [-113270, -127611, -107771, -81895, -104754, -120249, -95112, -72659, -53457, -79777, -126753, -143335, -143026, -86939, -88283, -20935, 7975, -34834, 23073, -878, -42852, 15882, 66130, 39619, 3140, 80457, 85140, 52238, 13956, -25615, -35143, -40023, -41278, -82052, -86721, -28626, -71228, -98477, -75032, -108706, -75562, -22086, 14741, 20129, 117782, 160162, 155867, 121481, 118728, 40382, -34720, -56602, -25952, -39476, 32828, 86685, 60573, 58202, -37282, 38674, 43096, -36398, -54892, -67907, -67911, -103460, -80152, -108233, -105954, -117062, -81882, -172215, -105738, -18187, -3382, -3771, 41002, 127295, 63889, -1598, -26662, -30631, -41839, -128313, -144093, -104146, -99148, -37533, -29210, -39679, 22390, -28131, -79852, -80209, -107569, -187728, -154441, 18747]
15948A8747J6052j1797j6614o828l618j4517j1610l7676M2986O773k4332o8996
15936a11430k921O6916N8376O4952j0211k7887L3972l2566j44790J4346O7050
15925b4193o344k6006j2495j4642o058n8307k3970J20909J29563R2081q0270p1264
15913A9004n1991M5022j8803j1721k5076j7604L1252M0290q674n1601J1975M9693
15901A1766o7408j1238J3138m2514n9776n6895K2891N3366P0314R481L6605j8730
15889c9000o6695O4277P2401j3701j8848K9966L1970o7549n0088L1681L8571r596
15877C389m8054k4701n1998o3927K4641J02257L2300K4923L382L88o1880R0247
15865C0967O4007j2089L434m5073m1735J2688j1238n4422n0372R6506L9467J9806
$$ y = [18747, 34799, 23002, 6388, -440, -4058, -18575, -30185, -67861, -24875, -18102, -42434, -111430, -114351, -47435, 10941, 75893, 65682, 37795, 71767, 39201, -105589, -91243, -24193, -30537, -56543, -69038, -83680, -89738, -148045, -172015, -51106, 78457, 170538, 90268, 19004, -32987, 12035, -6768, -18489, -43565, -61169, -29917, 10373, 1699, -49902, -37927, 11766, -55642, -66880, -53742, -96256, -156032, -212927, -190036, -136670, -66356, -56875, -20270, -39000, -105695, -41418, 30983, 17282, -1566, 28400, 60370, -7179, -57267, -25586, 12985, 3389, -44665, -69366, -121364, -185291, -160650, -58393, -26093, -1170, 2212, 2600, -59280, 30967, 94974, 82885, 86319, 41246, -489, 12199, 961, -53461, -103833, -7327, 32140, 51946]
15853E1946O106J7840K9927m9731j16524m9400M5984O1870n1000o5445p5217o5997
15841b59641M6231M3190L9525r030L8126N0479O1986K0818k6930n2553O725J34994
15829I3920M4896p6862J1908q8277m6068N0660L4178M5759l506m0703q9163j3248
15817g6506p1020R2627N4789p3185m6659o3459P345L6131N9214Q8508O4092J1702
15805H3579j8741r4614k4112N095l4078J2379J5883l0018K3302p30R457L4520
15793a8078j3838n8203l1293L363N8847o6719n1890K3655N3978L9574O6811M2432
15781D8639j8118l9542n9160m3968k9911M7267L813J07774N5645J2506l5282j18777
15769f9114n4738Q8627J25608K851q843M6224N2915q2844q6450j0901L577R711
$$ y = [51946, 58052, 75892, 105819, 56088, -60436, -109836, -63852, -1982, -52982, -118427, -193644, -259641, -213410, -170220, -130695, -139725, -101599, -51120, 10866, 31684, 4754, -47799, -41074, 93920, 138816, 61954, 73862, -14415, -60483, -9823, 24355, 70114, 66608, 25905, -63258, -76506, -147526, -54899, -110, -73295, -119954, -183413, -176068, -139937, -80723, 7785, 71877, 83579, 64838, -29776, -53888, -48793, -82871, -70492, -54609, -84627, -61325, -62055, -52598, -18078, -31916, -90119, -121412, -118049, -59202, -125921, -177811, -154156, -100178, -60604, 6207, 48639, 30521, -9021, -68181, -112149, -142060, -94793, -90980, 16794, 72439, 84945, 49663, -69114, -123852, -35225, 90383, 93234, 84391, 130615, 183530, 100686, 14236, 3335, 6912, 16623]
15757A6623k2597m567J5011q202r9178K3707L8476N4133J13216M815l7302M2410
15745A36545n9979k9660j7136p3672l459N4117M1592j747m2430m372J3998n565
15733H232K5409M0883K4816l3121m4378L747j0530r226k3135L3586M896J9476
15721D0655P7548K6572r976o3585Q004l0695m6872K4278P0777j138l6516q6538
15709b7486l0523M518O3677L3054p0728J0964P0764k5630J9994L6396O0583J0826
15697A56409l7311m5693n854j7831O2595n780J6320p2427q9834j9244l0747L7889
15685e1508M6148N8002n4434o9868l4111j19297o0215J14794P8898m0641j3391
15674a45623K1074J159R1594O0961J12430n0495n0990o363l9590m3640K8737M632
$$ y = [16623, -5974, -10541, 4470, -3732, -102910, -79203, -40727, 13406, 126622, 131437, 94135, 136545, 76566, 46906, 29770, -43902, -47361, 6756, 48348, 46601, 4171, -201, 13797, 8232, 33641, 74524, 99340, 66219, 21841, 25588, 15058, 5832, -17303, 16283, 21179, 40655, 118203, 144775, 134799, 71214, 79218, 48523, 1651, 25929, 96706, 95568, 59052, -27486, -58009, -53491, 10186, 43240, -27488, -16524, 54240, 28610, 48604, 85000, 145583, 156409, 119098, 73405, 67551, 49720, 112315, 106535, 122855, 50428, -39406, -58650, -89397, -51508, -5360, 52642, -1792, -71660, -105771, -225068, -285283, -170489, -91591, -132232, -145623, -124549, -123390, -31796, 29165, 141595, 91100, 40110, 33747, -5843, -49483, -20746, -16114]
15662a6114M4236k7747J9057Q0527r4561l9220q055N3053j0648l7807j5116m6052
15650i8447j00945P3892M8179n351m7252J1092J30579q961j09212r017J5267O223
15638i3953N1897J0550L2033l9905K6741K4557L7298l2461M8399M0634n3207n5940
15626c357m2720j797l8350M014P0219k7883j7636q693p728J3053P0113n2552m3059
15613h6376j5237L1912L0870L2716n5786J2826o674j9533l235k3475N2405P90
15601d8797N295J5727P1273l8389J8016O4331K8381r3022j23840K1667R9489n165
15589A4966l7821J4434M6925l637o5620N3650P6391j6389j4336q8477k0294J7313
15577b2895K9282K4890q858n2721j7591N1280L4706r3580j1285O7216m414M103
$$ y = [-16114, 28122, 375, 19432, 99959, 5398, -33822, -41877, 11176, 528, -37279, -52395, -98447, -199392, -125500, -77321, -82672, -129924, -118832, 11747, 2786, -106426, -115443, -100176, -93953, -42056, -31506, 527, -39378, -12637, 11920, 49218, 16757, 65156, 105790, 52583, -3357, -46077, -47874, -86224, -82210, -11991, -39874, -57510, -66203, -73931, -60878, 9235, -43317, -86376, -101613, -69701, -38831, -6115, -61901, -49075, -55749, -75282, -78517, -101992, -49587, -48797, -43502, -27775, 43498, 5109, 23125, 87456, 115837, 22815, -101025, -79358, 20131, 14966, -22855, -8421, 38504, 34867, -30753, 22897, 99288, 82899, 68563, -19914, -40208, -22895, 6387, 31277, 22419, -30302, -47893, 3387, 38093, -55487, -66772, 444, -3970, 133]
15565A33k1489k7009p3385K3291N3495l3423k8583L6722P3140o50l9047P7185
15553D0380n9416q1771m680O9206O9045K848l4929O3220J265k6758J1012M6281
15541I5703r2230P1371k5844k3873k621M6634n7240J426N3490k8525l0178k3227
15529a5114p5212o272n012n4002J9397M1758k16r087M390k5230n645l8384M5588
15516a23041l9115r178k6377O3312o2142K7065P7800R4304J0069l8272q5700N3580
15504e7695P0384l3821M3486p69j00608j2102J14660M8631j7468K705n959j7353
15492C4091O5753n2j16017J1520R3208l4897K5330l804p9067n0003O2512M4435
15480E3009n4421p8949O0242o8172n7086k1416L5686P2475N8558k7025n5258o2427
$$ y = [133, -21356, -48365, -121750, -98459, -44964, -78387, -106970, -70248, 2892, 2242, -36805, 40380, -19036, -100807, -105487, -36281, 32764, 35612, 683, 63903, 65168, 38410, 49422, 95703, 3473, 74844, 49000, 25127, 22506, 69140, 11900, 13326, 66816, 38291, 8113, -15114, -90326, -96598, -101610, -155612, -136215, -94457, -94673, -103760, -99370, -124600, -130245, -168629, -123041, -162156, -171334, -197711, -134399, -196541, -169476, -91676, 2628, 12697, -25575, -111275, -57695, 12689, -21132, 22354, 21585, -79023, -91125, 23535, 72166, 54698, 57403, 51444, 34091, 99844, 99792, -16225, -4705, 88503, 53606, 78936, 75132, -3935, -53938, 8574, 53009, -1412, -80361, -20119, -88291, -145377, -166793, -131107, -58632, -74, -27099, -82357, -144784]
15468a44784P0310M5668q7096p7739J7011L2392Q7932m5163m0039J8428O079Q3503
15456c3498L7899L162R7413o419q7367n6039j09453Q8408M9384k9735q77j4257
15444f1379r400k9005k8274N9572M6378K7566M666L7455m0776j25741L6830P4782
15432g326l5927K4381L6194n4836j00986P5931K7303J5083P492n6594j0442P7661
15420b066K1605m4714p1794o80K469M7280j4090j6473p7843l7998n6533L2463
15408b18374O5591M4393K1855j634L758N0240N2118j2714q2958j4335Q1521K3013
15396A2474k1790l1292K2628O0227O2100n5252l816L1409r821j5757J9614q7337
15384a6613K7779Q2046k6985l9907k5100p4158k6919j2689L4102J22134n9363
$$ y = [-144784, -74474, -28806, -115902, -193641, -176630, -144238, -56306, -101469, -141508, -123080, -117001, -33498, 4401, 7563, 104976, 98557, 11190, -44849, -154302, -65894, -16510, -46245, -47122, -61379, -70779, -99784, -128058, -68486, -22108, 5458, 10124, 47579, 6803, -118938, -82108, -7326, -43253, -18872, 17322, -37514, -138500, -62569, -35266, -20183, -12691, -69285, -79727, -2066, 19539, -25175, -96969, -97649, -95180, -47900, -61990, -78463, -156306, -194304, -250837, -218374, -152783, -108390, -86535, -88169, -84411, -34171, 17947, 5233, -77725, -92060, -10539, 12474, -9316, -40608, -17980, 42247, 104347, 49095, 45279, 76688, 66867, 51110, 70724, -16613, 11166, 93212, 66227, 26320, 1220, -72938, -99857, -112546, -78444, 43690, -15673]
15373a5673M996q627j3279N0982K6286K2370j0670r0289k7214L3213j0751j3558
15361e2214n289L1357m886K1343J0055n4416N3690L604j1848o982J9197k8800
15349b5189j6449r572M8838l2870n671q599M5602k1149o711L7483p1871O20O8354
15336B816Q9289j1103j2840k0368M319l2811m5097l6828K1815p8216J500k0035
15324a37559P3978K7763J8713q275K7094K892M8847P145k4103l1935r9500m5178
15312a40118j6138L7334L9997L4778l4295K0706L8440n2779L8725L8833k509M5074
15300D8048O091J2767L8615p0145j06375j9189N1723j2862k8512K7458P3883L3447
15288E4949J4097k9593j6069L1611o3167N5460M8064k3444n6071k7492N9853K619
$$ y = [-15673, -10677, -19304, -32583, 18399, 44685, 67055, 56385, -33904, -61118, -27905, -38656, -52214, -57503, -26146, -31032, -9689, 366, -54050, -360, 3244, -8604, -15586, 3611, -25189, -41638, -51210, -2372, -35242, -40913, -49512, -3910, -25059, -31770, 5713, -66158, -65538, 2816, 92105, 81002, 68162, 47794, 52113, 19302, -25795, -62623, -40808, -119024, -117524, -137559, -63581, -35818, -17105, -25380, 1714, 4606, 53453, 60598, 36495, 4560, -94940, -140118, -156256, -118922, -78925, -44147, -78442, -57736, -19296, -72075, -33350, 5483, 2974, 48048, 54139, 66906, 105521, 35376, -70999, -90188, -38465, -51327, -79839, -52381, 21502, 54949, 69046, 39453, 23384, 54995, -8172, 47288, 95352, 71908, 15837, -11655, 48198, 50817]
15276E0817n9616O180R3708L5469j12j03864m3006L8980L6573l8114K4883l857
15264C8041k0727L7271K6827j6507P183K3073p3173r0993J1616P5698L8725j8296
15252C8738l5314K1896j1138k8844L5540l2704o7579m0509N8117O9641K3288l044
15240B8088l4800N6741M0887j2597n8609K318m6262q3145K3635J08052L1630K619
15228E8557L586J0591J7443J4075l8807j13782l9145M1493j6740k7837N964R6618
15216A2016m7521o2052L6688N0471j2478q120q831r040L0573O2428K0838m7893
15204A7079n2086p0598L4844P6930O6343N5004Q9731o5799r1701l6089R858P2480
15192A05996n4186Q5453l123p4269q506K8957P0469n179J4590r6564j21827L5734
$$ y = [50817, -8799, -2619, 91089, 126558, 126446, 22582, -20424, 18556, 55129, 17015, 41898, 38041, 17314, 54585, 81412, 64905, 72088, 95161, 21988, -69005, -57389, 18309, 57034, 38738, 3424, 25320, 14182, -14662, 20878, -11826, -79405, -119914, -61797, 7844, 31132, 28088, -6712, 50029, 90916, 78319, 19710, 22028, -24234, -107379, -83744, 24308, 55938, 58557, 62143, 72734, 90177, 104252, 65445, -48337, -87482, -45989, -62729, -90566, -84602, 12016, -35505, -97557, -60869, -10398, -22876, -30996, -39827, -48867, -18294, 44134, 64972, 17079, -35007, -105605, -70761, 6169, 72512, 127516, 217247, 151448, 59747, 23658, 33516, 105996, 51810, 137263, 134140, 59871, 51365, 80322, 150791, 145612, 160202, 63638, -58189, -22455]
15180b2455n363M7530M9593k9119j07183l2319j7890l7004M1613L6198O3745R0438
15168G7784K0024j29905r9607O06P6780N8484j3429K05P883O153R3063j4817K6668
15155A09892l8761l081p7793q6439M0900M3369M0620j7731n3792k1005M2546k5460
15143d6735R956l9881K2382M5757P5230J4972o4419J3381l6349l4537M1219J0773
15131A1749o3504M1096K5862m1194O4453q9117q9923N3800J07717M8808m3985
15120B5762j00965P622M2594P3139k8637q8414l0429R2712Q9665L7323J5601k8076
15108A07897o0664m2293l9630j1445j9355n0865j2013J4074m3232J0472K5046
15097a22008K194j8139K5930j8631J2911K7834K4947p468M6276J9677Q836r259
$$ y = [-22455, -27818, 19712, 69305, 40186, -66997, -99316, -117206, -154210, -112597, -76399, -12654, 77784, 97808, -32097, -131704, -131098, -54318, 4166, -9263, -9058, -1175, 4978, 98041, 83224, 109892, 71131, 68050, -9743, -96182, -55282, -11913, 28707, 10976, -42816, -63821, -21275, -46735, -36779, -76660, -54278, -8521, 66709, 81681, 17262, 30643, -5706, -40243, 976, 11749, -51755, -10659, 15203, -25991, 38462, -50655, -140578, -86778, 20939, 69747, 25762, -75203, -67581, -24987, 48152, 19515, -68899, -99328, -6616, 83049, 120372, 135973, 107897, 47233, 4940, -34690, -46135, -65490, -116355, -128368, -114294, -157526, -147054, -122008, -119814, -137953, -112023, -130654, -117743, -89909, -64962, -72430, -26154, -6477, 2359, -6900]
15085f900K8248J9888J00867q024o2999M8032M676O3002J8018j21576J9505k2870
15073G9867j388n408m6109n5794n2416M3625J15159M6387j0307n0612n5134j5062
15061g192P8894j8480r6729J0652l4182n4681M259l7472N5129Q3911J9681q0740
15049g6950R598K1669m2444m3454K7361l2967L5881K8035M6731j0608n0642L2638
15037e5152l062j4615P1741N5861o876M3314r278j03757K1302k7263M199N1152
15025B7566J15208o8117j10631k6183L8801P0180k9221j03731k0493K9702L0513
15014d6406M3413l3474R5922J981m7187n0395K4474l3967n2989P9816J3398n12
15002e926j6698n971M752j6437o198N8546J3018K6383M2816K9561R646k0863n1696
$$ y = [-6900, 21348, 41236, 142103, 134079, 71080, 119112, 123788, 186790, 204808, 83232, 102737, 79867, 78479, 73071, 26962, -28832, -81248, -37623, 77536, 123923, 113616, 63004, 7870, -7192, 71702, 53222, -43507, -32855, -67037, -121718, -117459, -154931, -99802, -15891, 3790, -76950, -67352, -45683, -88127, -131581, -104220, -137187, -101306, -73271, -26540, -37148, -87790, -55152, -58214, -72829, -1088, 54773, 47897, 91211, 81933, -21824, -522, -27785, -23586, 27566, 142774, 74657, -35974, -62157, -23356, 46824, 17603, -86128, -106621, -76919, -46406, -2993, -36467, 59455, 61436, 14249, -36146, -11672, -45639, -98628, -18812, -5414, -5926, -22624, -28595, -23843, -40280, -46478, 12068, 25086, 51469, 94285, 123846, 133492, 112629, 60933]
14989F0933L3236r7350k5693j5296K667J01636k0233q4270j1250J22281R6022
14978A62683l0057j07290l2668q399J2265N728l1158k2282Q0929L0607r9320p6771
14966a15733P080o7482Q606N7452O8914J0049j6433J0732j7127j9268J9036J4818
14954c9356o3428r2632J6188K3380K3274J3229j7039l8794j6506o001J14805M8293
14942c4587M9155j9704k264p973q3110k2089J14169J0051m0772K5045l4565j9442
14930f6086Q1648R379n1662L1767k5242l4386L9413L6782l7101N7142O4987j6434
14918I0207j6738K6366M299p1236n1269K6135Q149q7049j5962N8688j9683K2956
14906b5137J9855o6062o2874M9546N1678K3057M2186N3629o4102k4789m768J5243
$$ y = [60933, 94169, -3181, -28874, -44170, -41503, 60133, 39900, -44370, -55620, 66661, 162683, 132626, 25336, -7332, -15731, -3466, 2262, -28896, -51178, 29751, 60358, -38962, -115733, -108653, -176135, -167529, -110077, -41163, -31114, -47547, -36815, -53942, -73210, -54174, -39356, -102784, -195416, -179228, -155848, -132574, -119345, -136384, -175178, -191684, -197685, -82880, -34587, 14568, -5136, -7400, -15373, -98483, -120572, -6403, 3648, -37124, -12079, -46644, -66086, 15562, 24941, -26721, 5046, -20196, -54582, -15169, 21613, -15488, 41654, 106641, 90207, 73469, 99835, 104134, 32898, -18371, 7764, 15913, -71136, -87098, -28410, -48093, -25137, -5282, -71344, -134218, -84672, -32994, -9937, 32249, 85878, 21776, -3013, -7781, 7462]
14894G462P5211L4236K6266o1369m1231L5307o9755p1598Q4279Q4686m0423o8989
14882e918l308L4575k9871K246k6802q1141K6789k2985R2081O0590j07661j39286
14870b00691j9303J27258K3564L4428n068k5093J7645J18959L2608J6632l0102
14859I0837m8940j07769n5865j7310R4031O0271j19417o5896R2020L8062q473
14848d8449K328J3959O7701P190k1508l9829o2478K4874N8613P4125o278L0900
14836A01148J5638m9972n0239J7101q239J0386o0799P0659m5140n6935J24878
14825F8486P1402n8290j76930o9303M1007N3910J15229L2634m6369m5248j2297
14814b5769N1523O3329m9838l6938K1869l8256J1869K3360j8160M8251J1186M9623
$$ y = [7462, 82673, 116909, 143175, 81806, 40575, 75882, 6127, -65471, 18808, 103494, 63071, -5918, -9226, 25349, -4522, -2276, -29078, -110219, -83430, -106415, -14334, 46256, -61405, -200691, -219994, -92736, -69172, -34744, -39812, -64905, -47260, 71699, 104307, 120939, 90837, 41897, -65872, -121737, -139047, -45016, 15255, -104162, -170058, -78038, -39976, -48449, -46121, -32162, 35539, 42729, 21221, -18608, -81086, -56212, 2401, 76526, 70248, 101148, 116786, 66814, 16575, 33676, 25437, 35823, -24976, 45683, 543, -56392, 68486, 139888, 81598, -95332, -164635, -123628, -69718, 45511, 78145, 31776, -13472, -25769, 25754, 89083, 39245, 2307, 24176, -14080, -2211, 21149, 2989, 51240, 62426, 112049]
14802A12049K3103j02375n3378M1120m3438j9572k5072j4507J31271J3535L5710
14791I8446L3449m8572P311q306m1445n761K8508k3667J0304n2005j41726P9162
14779f4302J25409j6720j9771J7928N8714k3400L1182K4521r528n3967q8100L6597
14767A8563L9711r709j16074k8909Q7794j0923Q8918R2966j0430m4962o3964Q402
14755E1383L9173j1469r487n2242k2814o6522J33860k4958r6545l0638j9073m0756
14743a50088P5542k0843M407J07430Q7513q505p8704l0776N0738m9971l045K7698
14731A1396J01982j2931j47295l7369O925n3775k0181P8649L5586k9634M6938
14720a9709M815o1459n915R330k1143L5940k790N1425J06544k8157L4206k8779
$$ y = [112049, 135152, 32777, -20601, 20519, -22919, -42491, -67563, -82070, 49201, 62736, 98446, 131895, 83323, 90634, 82328, 40883, 35122, 63630, 39963, 50267, -1738, -143464, -64302, 61107, 44387, 24616, 42544, 101258, 77858, 109040, 133561, 124033, 70066, -18034, 18563, 58274, 48565, -67509, -96418, -8624, -19547, 69371, 162337, 151907, 106945, 42981, 51383, 90556, 79087, 69600, 17358, -5456, -71978, 61882, 36924, -59621, -90259, -109332, -150088, -74546, -95389, -90982, 16448, 103961, 95456, 16752, -14024, 36714, -13257, -16302, 11396, 113378, 100447, -46848, -84217, -77292, -131067, -151248, -72599, -37013, -66647, -19709, -14894, -76353, -82268, -72938, -94081, -58141, -60931, -9506, 97038, 68881, 103087, 74308]
14708G4308l8703l9990M8685R2557J4947n8253J9152n1626K3311L1851n7527o0413
14696a701m261j4697n0405J4581j14959m6506K4969M9368O3618L7619M5907j4087
14684a0554n1164k9965M994Q369j0574O364J8501J5213J4584N4055N7507M4853
14672A22183O5701o6169q3340j6482p912N8006O5927k7163p5712o9953p810l7012
14660g9736L3890j3366N5257Q4747j3033K0120J6903j6318q2539q6929k4768k1869
14648a27641K7597Q7958j569o3985q982L9191k502l087l2173J8152L5364O6900
14636C5223o631l4181l2741K3644K5239j127L6851l1262r8325j6490Q1194R439
14624i167j4942J9696J9092M697M9834L0169o0463Q198l2866l7990j0778j2491
$$ y = [74308, 35605, -4385, 44300, 136857, 151804, 93551, 112703, 61077, 84388, 116239, 58712, -1701, -5962, -20659, -71064, -56483, -171442, -217948, -192979, -143611, -79993, -42374, 3533, -10554, -61718, -91683, -86689, -78320, -88894, -82530, -64029, -48816, -34232, 19823, 77330, 122183, 187884, 121715, 38375, 21893, 13981, 71987, 137914, 110751, 35039, -34914, -42724, -79736, -45846, -59212, -3955, 80792, 67759, 87879, 104782, 88464, 5925, -81004, -105772, -127641, -100044, -12086, -13655, -77640, -86622, -47431, -49933, -53020, -85193, -67041, -31677, 35223, 28592, -5589, -38330, -14686, 10553, 9426, 46277, 15015, -83310, -99800, -18606, -9167, -24109, -4413, 14679, 19376, 69210, 99379, 38916, 47114, 14248, -23742, -34520, -47011]
14612d7011q6443n6555K5735J0674N6710N2784j0097L3135j9034J7895P2196Q5451
14600A35440J7356N8612l3173r2335K1008l1765j3377J052m0865l4771j8426k1103
14588e2347P6283o754O7506o0675j32765l6211O6198O4827J4878j14620L9145
14577g4535O5377p5236j6973J7147j171M053j3095J10434P3775k7178k6106P85
14565C7277j7996m2821O059J6305j489L2000N2644K3602j6540j01864j62781k537
14553a78141R1320m749n5243L7875P2417L6710j3124o5058J8187k4051k0838n762
14541a10457q3374P3739J7248N2774K1045j06046L5001J7735q2882L8114J1806
14530a15297l2639J0401M435P3984J1108J6925J7915m6084M554o7508k9917O1152
$$ y = [-47011, -133454, -190009, -164274, -153600, -96890, -44106, -54203, -21068, -40102, -22207, 49989, 135440, 152796, 211408, 178235, 85900, 106908, 75143, 61766, 62818, 21953, -12818, -31244, -52347, 23936, 17182, 84688, 24013, -108752, -144963, -78765, -13938, 940, -113680, -74535, -9158, -84394, -101367, -84220, -85391, -81338, -94433, 16001, 89776, 62598, 36492, 37277, 19281, -23540, -17481, -1176, -2665, 29335, 81979, 105581, 89041, -12823, -175604, -178141, -86821, -91570, -146813, -108938, -36521, 189, -12935, -77993, -59806, -83857, -104695, -110457, -193831, -120092, -102844, -50070, -29025, -135071, -100070, -82335, -165217, -127103, -115297, -147936, -137535, -133100, -59116, -48008, -31083, -13168, -59252, -54698, -122206, -152123, -90971]
14518i0971K9703j9385l4896O834j795J5820J21670j2044k8827N1246k9449l7765
14506b9859k8459O1507J9116K0949m6025m4783N3286K9425j18396J254N6471J9204
14494f310k341P0333J5994K2459j3847j9839l6472m9902m7896l4475p1996L3246
14482a41046M0401M3534M3536J07589L8860q3674r0789j04300m2773N2826R4480
14471d1356J9773R9549k3725j07221K16O0949L7575n636J25145L3707n2267k4451
14459A22258m5416l8706L9821l3607n3249o9174O011J8316K1031L0857L4853k9536
14447C459r257q0069P568J18338j6599q7861m540P7658N39m3811P8581J5472p5025
14434a5547N681K7488Q00L6513j01587m3592L4195O9819L2824m4309j8466L6002
$$ y = [-90971, -61268, -80653, -115549, -108715, -110510, -94690, 26980, 14936, -13891, 37355, 7906, -29859, -58318, 3189, 22305, 43254, -2771, -47554, 5732, 35157, -83239, -81985, -25514, -6310, -8651, 61682, 77676, 100135, 86288, 66449, 29977, -19925, -67821, -102296, -174292, -141046, -100645, -57111, -13575, 94014, 132874, 49200, -41589, -145889, -188662, -135836, -41356, -21583, 77966, 54241, -52980, -52764, 8185, 45760, 40124, 165269, 198976, 146709, 122258, 76842, 38136, 77957, 44350, -8899, -78073, -72062, -53746, -32715, -1858, 32995, 3459, -5798, -85867, -78299, 40039, 23440, -64421, -68961, 8697, 9236, -34575, 44006, 59478, -15547, -9866, 17622, 18422, 54935, -46652, -90244, -56049, 13770, 46594, 2285, -16181, 19821]
14422A9821L4395j0557j5117o9058K0919N970N6528P3642o069j04630j8539k209
14410a4904n098K9696L8036L8678j0011m1888j6038p9670o6621K4607J8505M9179
14398c5529K9683m6239O8911n0272p6941M3126N5934J2088N649k14L60M0220N4444
14385A01220q0313L4597J7017j10042m1771j9096o3582m3540K9188Q9707P8168
14374h447k811p8631l0837N6703n8730J082N8678m59N9187k0351k0092J1637K6836
14361f235q771l2415n3537M4417Q2358K4828j8681m5886q3964m7768J41489L5031
14349C0866l6873m5089Q0124K5625k1498j00549j7131N1219m4001m1180N4624
14338f3863J5614L4954P6025r2647m6072L5770M5104M2534k3058n9264k4252P8233
$$ y = [19821, 54216, 43659, 28542, -40516, -19597, -13627, 42901, 116543, 110474, 5844, -12695, -14904, -20002, 9694, 47730, 86408, 76397, 34509, 18471, -61199, -127820, -103213, -84708, -35529, -5846, -52085, 16826, -33446, -110387, -67261, -11327, 761, 6410, 6196, 6556, 46776, 101220, 20907, 55504, 72521, -37521, -79292, -98388, -161970, -205510, -176322, -86615, -8447, -11258, -89889, -120726, -64023, -122753, -121671, -62993, -63452, -4265, -24616, -44708, -33071, -6235, -15006, -47421, -100958, -56541, 25817, 50645, 31964, -13922, -97886, -145654, -4165, 30866, -6007, -51096, 29028, 54653, 33155, -67394, -84525, -33306, -77307, -118487, -63863, -48249, -13295, 62730, -29917, -75989, -40219, 4885, 47419, 24361, -34903, -59155, 19078]
14326A9078K5660o9383K0914O0046j7852m0165o7559k8836P1548L9492l799o561
14314B583k5511k7420l6412k9446J1042M3257R9029N5468p4559j9480l2588J30940
14302I6903P3509n2139o5920l6879O6363J9583j7798M8181m0786q2702m8671K639
14290c7717R483R7806m8305J4924K4055j063j14232l0871R3487O951k7853M2159
14278B8824m97p630n9653l1288L5285L1585L4542K3002K8681m449k1535k4533
14266C2334J2224l9024j6092m1302k8790m2710k5122K3446l7344o8876L9798K4851
14254a66607j9293O6885M5131L3443M077j6113k2288k0970N8779M1434J01766
14243A06244n764o0242J1916M1093Q1168l987l1677r0043k8313K7771m136M8358
$$ y = [19078, 44738, -24645, -3731, 56315, 38463, -1702, -69261, -98097, -26549, 12943, 9144, 2583, -22928, -50348, -86760, -116206, -105164, -61907, 37122, 92590, 18031, -1449, -34037, 96903, 170412, 118273, 52353, 15474, 81837, 101420, 83622, 131803, 91017, 8315, -40356, -37717, -28234, 69572, 21267, 36191, 60246, 59183, -55049, -85920, 7567, 14518, -13335, 28824, 28327, 20697, -38956, -70244, -34959, -3374, 31168, 54170, 82851, 78402, 56867, 32334, 44558, 5534, -10558, -51860, -80650, -123360, -148482, -125036, -162380, -231256, -191458, -166607, -185900, -119015, -73884, -40441, -36364, -52477, -74765, -95735, -36956, 4478, 106244, 100480, 40238, 52154, 93247, 174415, 170428, 138751, 48708, 20395, 48166, 44030, 92388]
14231I2388K9858j9950j8370R7133L250o3791p377J2120k4980l7528m3451l7488
14219a8186K9563J8916J9329M3629R816p1945M3095n4291N7585M3537j16447j10229
14207a05628j5991k0719J5245L5956R7374K9899l7130o2347p595L8759P9n8125
14195i0223K4598J30780k9766j85097R7202J44714m447k4110n8490J4166O6312
14184H5639L8535n4916j28019Q1668L4211l0523j6146p2873o0238K5183N9755
14173c7724j6498j4741k5113m5153J2645L301J58909J31640n932k5715p4189n7417
14161D013n374M1205J3881j33960o4896P3632J13700J2336J6512m833q3767j5335
14149c2886l8945k6412N8865L8558k4471k6318j874k7377P3797J05261j6215j14779
$$ y = [92388, 122246, 102296, 83926, 181059, 184309, 120518, 113141, 125261, 100281, 62753, 19302, -18186, 11377, 30293, 49622, 93251, 103067, 31122, 74217, 19926, 77511, 121048, 4601, -105628, -121619, -142338, -127093, -91137, 6237, 36136, -994, -63341, -70936, -32177, -32098, -90223, -65625, 65155, 35389, -149708, -52506, 92208, 87761, 63651, 5161, 19327, 85639, 124174, 69258, -58761, 22907, 57118, 26595, 10449, -62424, -122662, -97479, -37724, -54222, -68963, -94076, -139229, -126584, -123283, 35626, 167266, 161334, 135619, 61430, 4013, -1361, 39844, 53725, -80235, -145131, -71499, 42201, 54537, 71049, 66216, -17551, -32886, -71831, -98243, -39378, -820, -25291, -51609, -53483, -80860, -7063, 98198, 81983, -32796]
14137c2796k3368o4220L703Q1162O5424Q4725N4504L2007q0620j7053j2514M3583
14125A34537n3469P098M3154K190k6417l2088k8810l8260n6026j5928L9232J8840
14113e947P9053P0607m0075n4904M0443k651L8042j8143o955n0369o2049K5639
14101A2691L1785o4027M6009Q0175Q5835K6866p484r9548p4330j0583m0707O2653
14089D9335K2814K1461q5030L4j3118m7838o8993N2164P1321o2873m4242M8391
14077e6574o268K0234j0954l720L491o4755j5902J1252L0820O7257n46o1927M7009
14064d0583J20163K1623n0574N941Q738o1294N9788N1488n461p3400p4351n0030
14052h7952p582Q976J6698L0512N2174n756j09276j9757l7483J15496J06804n9289
$$ y = [-32796, -56164, -120384, -116681, -35519, 29905, 114630, 169134, 201141, 120521, 103468, 90954, 134537, 81068, 88166, 131320, 133510, 107093, 75005, 46195, 7935, -48091, -64019, -24787, -5947, 73106, 143713, 103638, 48734, 89177, 86526, 124568, 106425, 99470, 49101, -12948, 12691, 44476, -19551, 26458, 106633, 192468, 219334, 211850, 112302, 37972, 27389, -13318, 49335, 72149, 93610, 8580, 8614, -4504, -52342, -121335, -69171, 2150, -60723, -104965, -56574, -62842, -42608, -53562, -57282, -53791, -118546, -134448, -123196, -92376, -25119, -25665, -87592, -40583, 79580, 101203, 50629, 56570, 65308, 4014, 63802, 115290, 109829, 36429, -37922, -87952, -95534, -86558, -69860, -39348, 12826, 7070, -102206, -121963, -159446, -43950, 62854, 3565]
14040C565l0775L0951J051m3305m683K2054n0678Q3996J02247o403J4680p9843
14028D2857l2245J16502J5566L6953O2995q5521j28481j2564K482P8917L49o0977
14016C6833O518J1037J4119l1168L6285q868p6118k1278N7011Q2174o7511j30237
14004i1203O3022P5363j4838L745J6602J04685K9454l1650N1889J3044r0018q9857
13992D0238M3734k889m5447r861l010P5104j4892k9673l5152j430J9003l5932
13980b07l2218J6125J8901K3542J7414N8218J4789k7439q143j0042N4436N9641
13968A85017j6833j45874K64N2711m0173o9237L1136P6170l7359j33949J9067
13957g9060N7288O1045m966q836m8827r4860K381Q3329M8734k2599n305Q1011
$$ y = [3565, -27210, 3741, 4792, -38513, -43196, -21142, -71820, 12176, 114423, 108020, 122700, 42857, 10612, 127114, 142680, 179633, 242628, 157107, 28626, 16062, 18544, 97461, 97810, 36833, 43351, 54388, 68507, 37339, 73624, 64756, -11362, -32640, 24371, 106545, 39034, -91203, -28181, 47182, 32344, 36089, 52691, 157376, 186830, 155180, 207069, 220113, 130095, 40238, 83972, 81083, 35636, 25775, 22765, 97869, 82977, 53304, 18152, 16722, 35725, -207, -32425, -16300, 2601, 26143, 43557, 101775, 116564, 89125, 80982, 70940, 125376, 185017, 168184, 22310, 22574, 75285, 35112, -34125, -2989, 73181, 35822, -98127, -79060, -21772, 39273, 34307, 25471, -23356, -118216, -115835, -32506, 16228, -6371, -11676, 69335]
13945F9335J6190p8823q4391j2439N4385J17193j0271J7660o3105J8957P0383
13934A15074K6443k3970m9777n3474Q670J870M0688l5651J7158j4175k5768M3662
13922E0750O5K3542K7971N6773l1023n0333j4319l7791Q563O7345P6143n83l1071
13909A46032l9547J1189L2499k2740O884K6700M8406n8098j44203m0247k899J5721
13897b0303J8721Q0863l3588r8015K5234L2939O1732L0299M124R3212p3613j27999
13885f394q583K2595K7717L8407O4858M6235q6073k46662p2050Q7725J10090K484
13873a9651o8067R102P7933J5820Q4009N8103K9144l6143j5044K4321j6987N147
13861A47687J1351o3339o1104o7692n559M0855Q9560J01752Q448p8232o2030m7824
$$ y = [69335, 85525, 6702, -77689, -90128, -35743, 81450, 71179, 88839, 25734, 44691, 115074, 141517, 117547, 67770, 14296, 22966, 24836, 65524, 29873, 47031, 32856, 7088, 50750, 50815, 74357, 102328, 159101, 128078, 77745, 63426, 25635, 34198, 101543, 177686, 177103, 146032, 106485, 117674, 150173, 127433, 134317, 161017, 209423, 151325, 7122, -33125, -36024, -20303, -1582, 79281, 45693, -52322, -27088, 5851, 67583, 97882, 102006, 195218, 121605, -6394, -14977, 7618, 35335, 73742, 138600, 184835, 98762, -147900, -219950, -132225, -22135, -19651, -87718, -78616, -683, 15137, 99146, 157249, 186393, 150250, 135206, 159527, 142540, 147687, 159038, 95699, 34595, -33097, -38656, 2199, 91759, 193511, 201959, 123727, 61697, 13873]
13849A3873j0090j2009R7589p6395M6328M0421k4294n8064p2451o8367j6945O0399
13837h0005O8436J0033n992J0537J5628J9489N7541L9545j7868l0302L3939R1881
13825B12862r3950m2456J6607l2016r299k6343J2J8367j9195J8078L6883P499
13813H7049m1721l5068M3176J23354j0333k4192L9289O5066r1794Q074m4680M623
13801A22843J8758L3049J5270k0112P840L3141m0631j1625J9672R5697J20670
13790C94572K3650j5086r388K7843R1342J72404J34588Q9890J40316O7595N4469
13779A172195K5258j43003j40803l9791k9476N0209m0470j98304q8052j56470
13769D11293m6845N079n8474P0773K3570j25840j17093l4707k0067m532K0182
$$ y = [13873, 3783, -8226, 89363, 12968, 59296, 99717, 75423, 17359, -55092, -123459, -140404, -80005, -11569, -1536, -7528, 3009, 18637, 38126, 95667, 135212, 117344, 87042, 120981, 212862, 118912, 76456, 93063, 61047, 51748, 25405, 25417, 43784, 24589, 42667, 79550, 87049, 45328, 10260, 53436, 176790, 166457, 142265, 181554, 246620, 154826, 162900, 118220, 122843, 141601, 174650, 189920, 169808, 177648, 210789, 170158, 158533, 178205, 273902, 394572, 418222, 403136, 393748, 421591, 512933, 685337, 819925, 909815, 1050131, 1117726, 1172195, 1197453, 1054450, 913647, 873856, 844380, 894589, 854119, 655815, 567763, 411293, 364448, 369527, 311053, 381826, 405396, 279556, 162463, 127756, 107689, 103157, 123339]
13758A23339N0307K6049l4159N690K9204M3123l6944j5171p1540r7571j5030M3022
13746E0319K1433j7906O3178j2418l3741K6806M9520K9030j0889k6014r4948q5135
13734d0765j7749J1541Q255L2244M0353N7256j7138l9935k5466J5894K6165R2289
13722A42944L8920l3725j7846j2284k548q7221L9950J53742M6819p9543m2163
13711A47045k0824L7288j5889R776O4454j3899j18994o9014M4343P243K9556P7047
13699A78132j5277q2413L1872P7841Q648K8404O573n6995m342k3020L3039L5587
13687B18049m3158j879L7608j7011N350j573m7139N5204K9943o3912q2067J1584
13675A00999L7277J9356J6764m294L3615n3641m8665K0952n079j1828n3421N074
$$ y = [123339, 173646, 199695, 165536, 171226, 200430, 243553, 206609, 191438, 119898, 22327, 7297, 50319, 71752, 53846, 117024, 104606, 70865, 97671, 147191, 176221, 165332, 139318, 44370, -40765, -58514, -46973, -38718, -6474, 33879, 91135, 73997, 34062, 8596, 24490, 50655, 142944, 181864, 148139, 130293, 118009, 115461, 28240, 68190, 221932, 268751, 189208, 147045, 126221, 163509, 147620, 157396, 221850, 207951, 88957, 19943, 64286, 71529, 101085, 178132, 162855, 80442, 112314, 190155, 198803, 227207, 233780, 176785, 172443, 149423, 182462, 218049, 174891, 173012, 210620, 193609, 198959, 197386, 150247, 205451, 235394, 171482, 89415, 100999, 138276, 157632, 174396, 170102, 203717, 150076, 101411, 122363, 117284, 105456, 52035, 57109]
13663E7109L2447j13521q633L3355J0305l4432K1180L1317j0438K0422M0918k4118
13651E5911l8108j5444R8400P8389N4885L0375k2475R890k0134J388K8103J4260
13639B75440p0440o8424P5771m4762J2206J3646p4162q878J3596J4888J2555o464
13627A44972p1653K486N6542N5884l758j04350k3181J0880l4489n8183R0429J7715
13615H3294P3673K5570k7889k4735m850M759o6439K7974R5585J4787r3416K7804
13603A36117J6795K5635N077N6077J4107n7768J0656J3477L6285M2069L4520n2747
13591B80300q8243N0629m5313n3681r2834j0548L8811m5066l1809J5561K5450
13580D3257N0713P4480k1883K7269K6495p1128P646l0053k2891M501J9694M6948
$$ y = [57109, 89556, -23965, -32598, 757, 11062, -23370, -2190, 29127, 18689, 39111, 80029, 55911, 17803, 2359, 100759, 179148, 234033, 264408, 241933, 251823, 231689, 233077, 261180, 275440, 205000, 136576, 212347, 167585, 179791, 193437, 119275, 110397, 123993, 138881, 151436, 144972, 73319, 75805, 132347, 188231, 184473, 80123, 56942, 67822, 33333, -24850, 65579, 83294, 156967, 182537, 154648, 129913, 125063, 129822, 63383, 91357, 186942, 201729, 108313, 136117, 152912, 178547, 183624, 239701, 253808, 196040, 206696, 220173, 256458, 298527, 333047, 280300, 192057, 242686, 197373, 143692, 50858, 40310, 79121, 34055, 2246, 17807, 43257, 93970, 168450, 146567, 173836, 200331, 129203, 136849, 106796, 83905, 88406, 108100, 155048]
13568A55048j6050q4996K0953O875M4601l8968k9775J6143o7479p171J05680Q5539
13556A90400L9624l9757q8685p842K7927k2014p3275L6045L2985j9444q457o4029
13544C478j3381P9284P4586J2967p4252J3026J7544k6724J6694N344J2536K3033
13532A44135j0477q376q0883N0632J8928M3659K8954n5156m0359J0276J19095
13521B20428O9552M5970M4528j24847n1046k9745k6978p1382M2584P9549R465
13510B08078l8674n4037K1066L2597m0167N6586O9540o1677j8748N3336J12199
13499C40099P3482K4306N4932K3961L3820k5472k4233m6802j00016j8674J9021
13488C54424j3069p438L5912J4969l8893l6830L8971N6458J42496l3127m9844
$$ y = [155048, 138998, 54002, 74955, 81830, 126431, 87463, 57688, 73831, 6352, -819, 104861, 190400, 230024, 190267, 101582, 93740, 121667, 99653, 26378, 62423, 95408, 75964, 67507, 3478, -9903, 69381, 143967, 156934, 82682, 95708, 113252, 86528, 103222, 108566, 121102, 144135, 133658, 125282, 44399, 95031, 113959, 157618, 186572, 131416, 91057, 101333, 220428, 289980, 335950, 380478, 255631, 204585, 174840, 147862, 76480, 119064, 198613, 208078, 169404, 115367, 136433, 169030, 128863, 185449, 254989, 193312, 174564, 227900, 340099, 413581, 437887, 492819, 516780, 550600, 525128, 500895, 454093, 354077, 335403, 354424, 341355, 333917, 369829, 384798, 345905, 309075, 348046, 404504, 547000, 513873, 464029]
13477D64029N5381P101p0950m6785k9333M2366K1044P274R8244J08282k3295l213
13465F30145l6639p7835J3961N8245M3093l4380l2307m9987n3212j7950J25834
13454E68968M1800P0514N9554L8684P1834o9720m5995p701m9124M1728j9198q9815
13442F11529j9253O1495R9087J3283j4164j1981p5893l8604O7125J09154L6052
13431H37830J1219m634J9495M163p1133l55k2551n7182r7891n0656p3500L5382
13419E30187Q5212R7415J18191N0147O4673Q0139n7474o8622J02346L3842r7527
13408I38529K6722J65068k5826N624J28704j2885l729P6092P247J78037J70102
13397A653685R0560R9970J917o9071k1163M0149L0085R8256R2866J70823J65116
$$ y = [464029, 519410, 526511, 455561, 408776, 379443, 421809, 442853, 450127, 548371, 656653, 633358, 630145, 593506, 515671, 529632, 587877, 630970, 596590, 564283, 514296, 461084, 443134, 568968, 610768, 681282, 740836, 779520, 851354, 781634, 735639, 727938, 678814, 720542, 701344, 611529, 592276, 653771, 752858, 766141, 751977, 739996, 664103, 625499, 692624, 801778, 837830, 849049, 844415, 863910, 868073, 796940, 796585, 774034, 716852, 618961, 568305, 494805, 530187, 615399, 712814, 831005, 881152, 945825, 1025964, 968490, 899868, 1002214, 1036056, 938529, 965251, 1130319, 1104493, 1110117, 1238821, 1225936, 1222207, 1298299, 1305546, 1483583, 1653685, 1744245, 1844215, 1846132, 1777061, 1755898, 1796047, 1826132, 1924388, 2017254, 2188077, 2353193]
13386B353193J61927O8002J15145K75638K79872K26737K73512M01601M16052L31223
13376D902902K77866K47924K21902J42489K33493M46345M54964M87697O22281
13367H037863P58997Q47175Q17054Q76275J018848J085576J184742J505207J692614
13358A7824351K063880K691646L268762L996068N196078O831209R045139J2271487
13350F3188620J6692930K2006573K7923278L3251925L6141030L4830569K8135912
13343B62170837J6164931J030655j3557404k4904200l1658881l2910043k9477078
13336A46858817k3687434j8024331j3681156j0840473r033529p852473o939840
13329E6799581o179015n327799m685468m128945l508133k988207k706589k322985
$$ y = [2353193, 2515120, 2583122, 2698267, 2973905, 3253777, 3480514, 3754026, 4155627, 4571679, 4902902, 5180768, 5428692, 5650594, 5793083, 6026576, 6472921, 6927885, 7415582, 8037863, 8796860, 9644035, 10461089, 11337364, 12356212, 13441788, 14626530, 16131737, 17824351, 19888231, 22579877, 25848639, 29844707, 35040785, 41871994, 50917133, 63188620, 79881550, 101888123, 129811401, 163063326, 199204356, 234034925, 262170837, 278335768, 279366423, 265809019, 240904819, 209245938, 176335895, 146858817, 123171383, 105147052, 91465896, 80625423, 71591894, 63739421, 56799581, 50620566, 45292767, 40607299, 36478354, 32970221, 29982014, 27275425, 24952440]
13321B4952440j985554j824990j720915j587840j502680j328177j139158r51648
13313A2911478p61934p21666p27690n35974m62887l84192m06363n47894o45646
13304G717232o01456n80050n94114n21579l71999l62546k59924j60948j86590
13295D078026k38310k30368k41876j43862j18322K5749N7200q47N0947J15867
13285C354204J03460K10768K30905J45534M8324r9995k07539k41034l50463l52819
13275B841345l72793k34659j66142j51756j41317j74418j06415j8956q0528j19343
13265A275018j17485p1221l5834m0912Q275o2973J5814L2825m8222l024n5500
13254H96761j25256j7956r1195j33775M1919J65062O9527j5652j4096n5395k6511
$$ y = [24952440, 22966886, 21141896, 19420981, 17833141, 16330461, 15002284, 13863126, 12911478, 12149544, 11427878, 10700188, 10164214, 9701327, 9317135, 8910772, 8362878, 7717232, 7115776, 6535726, 5941612, 5420033, 5048034, 4685488, 4425564, 4264616, 4078026, 3839716, 3609348, 3367472, 3223610, 3105288, 3131037, 3188237, 3187390, 3238337, 3354204, 3457664, 3668432, 3899337, 4044871, 4093195, 3993200, 3785661, 3544627, 3194164, 2841345, 2468552, 2233893, 2067751, 1915995, 1774678, 1600260, 1493845, 1474889, 1394361, 1275018, 1157533, 1086312, 1050478, 1009566, 1017841, 954868, 970682, 1003507, 955285, 952261, 896761, 771505, 753549, 662354, 528579, 570498, 735560, 805087, 789435, 775339, 719944, 693433]
13243F93433R070J3662j0667N84P6290j7970K5130l9921m438N8274J24356R2076
13231A019879K03137K25661K75704K95538L70840K05923P9144k7937j48377k14495
13221B285017l42954l04661k58966j41883j07653j02138j4242k8489q1710p7604
13211H24717p4858p4188r5466L4364j2312o0655k765n8803k2004Q4191j8925p3961
13199D49335L7656q1647m1421l2521l9459N2488J5824n8611k4864l4863q5533
13188A56384l7763R2017J18403Q1875O6672O0383L7618m6434l2018M3650L4069
13177E74856R472n5465q1641j13712K9582l759j9691n9792r747R374P795J1394
13165B98666Q4105N5757k559p1821j9988L0480m7192j6162l378j4383n544P263
$$ y = [693433, 702503, 716165, 705498, 706082, 782372, 764402, 789532, 749611, 745173, 803447, 927803, 1019879, 1223016, 1448677, 1724381, 2019919, 2390759, 2596682, 2675826, 2647889, 2499512, 2285017, 1942063, 1637402, 1378436, 1236553, 1128900, 1026762, 1012520, 984031, 902321, 824717, 749859, 675671, 580205, 614569, 602257, 541602, 538837, 480034, 458030, 542221, 523296, 449335, 486991, 405344, 363923, 331402, 291943, 344431, 360255, 301644, 276780, 241917, 156384, 118621, 210638, 329041, 410916, 477588, 537971, 575589, 529155, 497137, 540787, 574856, 584328, 528863, 447222, 333510, 363092, 359333, 339642, 279850, 270103, 279477, 287272, 298666, 382771, 438528, 435969, 364148, 344160, 374640, 327448, 311286, 307908, 293525, 287981, 295244]
13153B95244P8933L4931J0445j10943j9176J4297p0242P3723P8810N5631O293
13142D47946p4865p3397Q0484n1327m0620l4451k0790j1758j6410N8944N7529
13131C21285j7950p7965L6915P7475N359O976R326r966K2506K9830k0286k5229
13119C58276J3954j6726k0891m7059J1304K5471M304l4729q9320k4619l4932N8665
13107B03698J05505L6243j12830k1930j0144k9769p370N6228Q3923K4123m7305
13096B80372O9416P6759N4811k7847K7037n2892j98522J191Q1344l093m906m7956
13084B55714J129M0236J3855K0590M2574M4842O1216L7165M2355R6219m6053k2753
13072E87089l9682L1468p1427j17051k9583j7662M3181k8700m2829N6545q036
$$ y = [295244, 374177, 409108, 419553, 308610, 289434, 303731, 233489, 307212, 386022, 441653, 447946, 373081, 299684, 380168, 328841, 288221, 253770, 232980, 221222, 204812, 263756, 321285, 303335, 225370, 262285, 339760, 345119, 352095, 361421, 351455, 373961, 403791, 383505, 358276, 372230, 355504, 334613, 287554, 298858, 324329, 328633, 293904, 204584, 179965, 145033, 203698, 309203, 345446, 232616, 210686, 200542, 170773, 163403, 219631, 303554, 327677, 280372, 349788, 426547, 481358, 453511, 480548, 427656, 229134, 230325, 311669, 308576, 303670, 255714, 256843, 297079, 310934, 331524, 374098, 418940, 480156, 517321, 559676, 655895, 609842, 587089, 547407, 578875, 507448, 390397, 360814, 343152, 386333, 357633, 314804, 371349, 363313]
13061C63313K8243L0480J2843K205L611P1816K2999o0801j9778l6217n2858M1459
13049D07315P495M0690k807R3277J3764q0884q1442l4155L3289J9439L4359J081
13037D51421k378L9093j0643R684J398n2563J3437k3353P0868L5704k6346l6775
13025D69547n1932p608l6077O0442J7566M0485M7846k9834N4972K1196J2098o3683
13013E35018n3051j9006r5017l5747L366o9518M0551N5469L8451L5103J5408k780
13001D48247L0682o674o350L3919J2250J4280r714R23o3688k4615J9891q5236
12989C63915j1388P382l8235n4642N5304M50P2432L5875n0210J32963J40827O3783
12977G18456J86396J43943o5154q3974j08876r5911L3658o275J7802l3354o0164
$$ y = [363313, 391556, 422036, 434879, 437084, 440695, 512511, 535510, 474709, 454931, 418714, 365856, 407315, 414810, 455500, 452693, 545970, 559734, 478850, 397408, 363253, 396542, 415981, 450340, 451421, 449043, 488136, 477493, 487177, 488575, 436012, 449449, 426096, 496964, 532668, 506322, 469547, 417615, 410007, 373930, 434372, 451938, 492423, 540269, 510435, 565407, 586603, 598701, 535018, 481967, 462961, 367944, 332197, 335563, 266045, 306596, 362065, 400516, 435619, 451027, 448247, 478929, 472255, 465905, 499824, 512074, 526354, 516640, 517563, 453875, 429260, 449151, 363915, 352527, 359909, 321674, 267032, 322336, 322786, 395218, 431093, 380883, 513846, 654673, 718456, 904852, 1048795, 983641, 899667, 790791, 694880, 728538, 722263, 740065, 706711, 646547]
12966F46547K1053J08732Q97l6455N2499l423J4158L4385j2265l1960o6227q1128
12954F46813N577J07332n0509N8194Q3706J28019K8401Q0878P4832L5521m4230
12943A154534m9305k8774r638n7434k3702k3309M4714m34m2370n9150K6934M9095
12931I81161L8220l4723L7712L4271J8088J01456J29403J18251K02040K5453O8269
12920A719601J32148N3713P8825J8559J22676K0522r6400j7209m5445k5802J1905
12909A973093J7341R4053J30649J41269J77797R9523J8909N5194J50181N8079
12899B916088M9310M9540q0229n7659l7048q636k8123l6110l9745j28615j9269
12888B579504k4193m0769J560M1942M3244N3878j1325M6462J34625J71170Q5735
$$ y = [646547, 667600, 776332, 777229, 740774, 793273, 789850, 804008, 838393, 826128, 794168, 727941, 646813, 652390, 759722, 709213, 767407, 851113, 979132, 1007533, 1088411, 1163243, 1198764, 1154534, 1105229, 1076455, 1066817, 1009383, 985681, 962372, 1007086, 1006652, 964282, 905132, 932066, 981161, 1019381, 984658, 1022370, 1056641, 1074729, 1176185, 1305588, 1423839, 1625879, 1651332, 1719601, 1851749, 1905462, 1984287, 2002846, 2125522, 2146044, 2049644, 2032435, 1986990, 1961188, 1973093, 1990434, 2084487, 2215136, 2356405, 2534202, 2633725, 2652634, 2707828, 2858009, 2916088, 2965398, 3014938, 2934709, 2877050, 2840002, 2831366, 2803243, 2767133, 2727388, 2598773, 2579504, 2555311, 2514542, 2516102, 2558044, 2601288, 2655166, 2643841, 2690303, 2824928, 2996098, 3081833]
12877C081833M7194J07920J36445J13851M458O7965J71124O6439Q9318J88701
12867D075248N6284K99178L87614L61405M04978M62531L99500K89641K28150K23317
12857G187846J78961J95737J61687J64231J72704K53895L17004L73137L73687
12848I378889N82279P53467Q49285Q96240J163676J337234J507392J899175K165511
12839B0533148K539509L036796L701768M507886N432041O725941Q531302J1524226
12831F6532617J5829946K1984564L0358724M1296454N3627480O4740805O9818361
12824C64188951O4289119M4935314J3035521k3190142n2728253o6737963o4382522
12817B79410025n1916593l7943697k7041284k0166451j6111727j3746168j2128214
$$ y = [3081833, 3129027, 3236947, 3373392, 3487243, 3491701, 3559666, 3730790, 3797229, 3886547, 4075248, 4131532, 4430710, 4818324, 5179729, 5584707, 6047238, 6446738, 6736379, 6964529, 7187846, 7366807, 7562544, 7724231, 7888462, 8061166, 8315061, 8632065, 9005202, 9378889, 9961168, 10714635, 11563920, 12460160, 13623836, 14961070, 16468462, 18367637, 20533148, 23072657, 26109453, 29811221, 34319107, 39751148, 46477089, 55008391, 66532617, 82362563, 104347127, 134705851, 176002305, 229629785, 294370590, 364188951, 428478070, 473413384, 486448905, 463258763, 410530510, 343792547, 279410025, 227493432, 189549735, 162508451, 142342000, 126230273, 112484105, 100355891]
12810A00355891j0882895r545286q297674p300920o441589n443397m563318l801943
12802D4078869l165943k645206k335654k117380j952224j818637j484484j323646
12794B7235695j103244q18465m96333k74644m2542J89042M86634Q11825J129889
12785B7117857J616580K125527K620849L153093L921839M924470O447032Q570567
12777F0497814J1844942J6559237K3289606L2290722M3860483N6512435O6845616
12770C11700855P0115445O1986289L9376601N130144l1072186n7544108o8162131
12763C31530909o3233362m9641783l5703590k5519732j9439401j5731730j3560803
12756A08700508j2022591j0676517r418728q361982p422695o571553n750191m959044
$$ y = [100355891, 89472996, 79927710, 71630036, 64329116, 57887527, 52444130, 47880812, 44078869, 40912926, 38267720, 35932066, 33814686, 31862462, 30043825, 28559341, 27235695, 26132451, 25313986, 24817653, 24543009, 24500467, 24689509, 25176143, 25987968, 27117857, 28734437, 30859964, 33480813, 36633906, 40555745, 45480215, 51927247, 60497814, 72342756, 88901993, 112191599, 144482321, 188342804, 244855239, 311700855, 381816300, 443802589, 483179190, 488309334, 457237148, 399693040, 331530909, 268297547, 218655764, 182952174, 157432442, 137993041, 122261311, 108700508, 96677917, 86001400, 76582672, 68220690, 60797995, 54226442, 48476251, 43517207]
12748D3517207m300959l839543l186113k722992k460257k116932j907709j784310
12740B1198392j688048j397040j241284j133335r83060q26218p52368p99905q50453
12731A1526681o73324o39250p71438o86910n34584n41803n91314l71096k63795
12722F453167l38388l55305k77261k41907l02630k78851k07273j93178j68729
12713D089645r9842q4455p8258j37805j83347j64775j15774n3668j23483j50788
12703B897450o1173j27219j28755k25638j56964j38569j06167j4377m2972j4409
12693A881207L112j15459j63184k3808l5704j8000J9947n903l055o3939l6277
12682A438937L2864J8250O6209k9414m2027J4540J1987o518j40312j76532r9518
$$ y = [43517207, 39216248, 35376705, 32190592, 29467600, 27007343, 24890411, 22982702, 21198392, 19510344, 18113304, 16872020, 15738685, 14755625, 13929407, 13177039, 12377134, 11526681, 10853357, 10214107, 9442669, 8755759, 8221175, 7679372, 7088058, 6716962, 6453167, 6114779, 5759474, 5482213, 5240306, 4937676, 4658825, 4451552, 4258374, 4089645, 3989803, 3905348, 3827090, 3689285, 3505938, 3341163, 3225389, 3171721, 3048238, 2897450, 2836277, 2709058, 2580303, 2354665, 2197701, 2059132, 1952965, 1938588, 1895616, 1881207, 1884319, 1768860, 1605676, 1581868, 1546164, 1528164, 1548111, 1542208, 1539153, 1475214, 1438937, 1471801, 1490051, 1556260, 1526846, 1484819, 1499359, 1511346, 1504828, 1364516, 1187984, 1088466]
12671A088466o6959n6904l1544o6486k713J15475J40617J29706N9042L1814O790
12660A347304m751q3948p7851k0381m7914M6141O4112O1L3176k5164K0479Q141
12648A259405j21572q5372l8983m334n3729j9692O928L6219J5049J1702j18771
12637H86850q0807m8325K8659m554p5081m1391j1421R1447M2573q150r836m082
12625G65882j6923l9678o8504O0735k9951j0179j65641j17428m0010n325j7351
12614C15627j26783P1437K44746J04092O1785P0308L8823M853j7042p069m2722
12603G18055n5494k1642m255j659k5266R926n8125J3890K0640K5393k2510j15833
12591D83120o3628N2904P5511J6834m6335j7633K1635J07665N2807m6123j4137
$$ y = [1088466, 1021507, 964603, 933059, 866573, 863860, 979335, 1119952, 1249658, 1308700, 1340514, 1347304, 1342553, 1258605, 1180754, 1160373, 1112459, 1158600, 1222712, 1222773, 1255949, 1230785, 1251264, 1259405, 1137833, 1052461, 1013478, 1009144, 955415, 935723, 942651, 978870, 993919, 1005621, 886850, 806043, 757718, 786377, 781823, 706742, 665351, 653930, 745377, 787950, 779800, 769964, 765882, 748959, 709281, 640777, 701512, 671561, 661382, 495741, 378313, 338303, 332978, 315627, 188844, 260281, 505027, 609119, 670904, 741212, 780035, 784888, 767846, 760777, 718055, 662561, 640919, 636664, 635005, 609739, 619665, 561540, 575430, 596070, 621463, 598953, 483120, 419492, 472396, 547907, 564741, 518406, 500773, 522408, 630073, 682880, 636757, 622620]
12580F22620k78r449Q913p5588L036J0914j8507R3806o0199p6319k2334J0330
12568D86945J09147P6081Q576l8173P4436J49101K1358m4397m0624j01088p6997
12557F24365j5981L6364m5814r1985rL8370O7331K775M0590J3512l0373N051P7626
12544G21822N0909p2997m2994K1811j12659j84319l7222M993O9085J00593m8378
12533D70644j27680l2105J5271M4732k9653o2996n9406O5626j7391O6097P2446
12522D05585O3758o5663l4191m2109R1399J2754j51678j19579L1565J12484M4655
12511C48980l6030N0064Q4842l3583r3548O4718N8865k3129m786q857r1118o3766
12499B52652L8773J8519n9591n6686l0697J1019L3547l2404j0866j0557L9801
$$ y = [622620, 622342, 612893, 621806, 546218, 549254, 560168, 541661, 635467, 575268, 498949, 476615, 486945, 596092, 672173, 680749, 642576, 717012, 866113, 887471, 843074, 802450, 701362, 624365, 608384, 644748, 598934, 506949, 506940, 545310, 612641, 615416, 656006, 669518, 639145, 644196, 721822, 772731, 699734, 656740, 678551, 565892, 381573, 344351, 349344, 418429, 519022, 470644, 342964, 310859, 326130, 370862, 341209, 278213, 218807, 284433, 267042, 333139, 405585, 469343, 403680, 369489, 327380, 418779, 431533, 279855, 160276, 191841, 304325, 348980, 312950, 363014, 447856, 414273, 320725, 385443, 444308, 421179, 416393, 407536, 316418, 252652, 291425, 309944, 250353, 193667, 162970, 173989, 207536, 175132, 164266, 153709, 193510]
12488A93510Q5909Q8115p349k4526n7110J2897J6788j8134J5547j6373o6998p5066
12476A47210J6858l4066J3939N9695J6175j09220m2993M1046J01045Q2181m4898
12465B46972m4853j3005j3992J8492k2510r4155K5022J01458O7741m0924r3502
12454A36744R5532P8014j5780j13617m3440L4691M0373j18144q296j491N3285
12443A37871M0603r5596q031J25633R3297J1495J809l1292m6521M9483Q3135j36347
12431B25539l1967m6960l7266J853j546k899M4050L8273N2518k318o0003J6780
12419A96054O4313N4544m7605j56409m9130M2714k380j4584k1960q6624K7892
12408F825L8345K4681R8665K6052q3621k1803M2611j5892K3049j2285j3291M5632
$$ y = [193510, 279419, 367534, 360185, 335659, 278549, 291446, 308234, 290100, 305647, 289274, 222276, 147210, 164068, 130002, 143941, 203636, 219811, 110591, 67598, 108644, 209689, 291870, 246972, 202119, 189114, 175122, 193614, 171104, 76949, 101971, 203429, 271170, 230246, 136744, 232276, 310290, 294510, 180893, 137453, 172144, 212517, 94373, 86077, 84586, 137871, 178474, 82878, 74847, 200480, 293777, 305272, 307081, 275789, 229268, 278751, 361886, 225539, 193572, 146612, 109346, 111199, 109653, 106754, 150804, 189077, 241595, 239277, 179274, 196054, 260367, 314911, 267306, 110897, 61767, 104481, 102101, 87517, 65557, -21067, 6825, 45170, 69851, 168516, 194568, 110947, 89144, 131755, 115863, 138912, 126627, 113336, 158968]
12396A58968m603m5719J9403L7093M2363L6235n3471r178J11596L0280N4117j2115
12384C64969j45516m7781L5066p6528q5787J301K8329M1621M917M1525l6730J07292
12372B32678P3467m8828N3097K1521L4465Q8583P7746K922P0915J28479J76726
12361I11771K26949K79921K89232K84277J39221K8690j06242j16743l03418k33420
12351A400238k09338k04480p5311j46658j22924P8008M6513n6775k510l5869j36916
12340E33978L696k703n1705k9122l7159k5699p056p7881l2466j4787p2641k9741
12328A56714J217J4989K1973N521k5297n8152K4814J1485L0795P869J19159M7977
12316C59064j03358m7535P3770M9368Q34N9589J56919R6302K36734K77109L58211
$$ y = [158968, 154365, 108646, 128049, 165142, 207505, 243740, 190269, 181091, 292687, 322967, 377084, 364969, 219453, 171672, 206738, 130210, 44423, 45724, 74053, 115674, 120591, 162116, 125386, 232678, 306145, 257317, 310414, 331935, 366400, 454983, 532729, 535651, 606566, 735045, 911771, 1138720, 1418641, 1707873, 1992150, 2131371, 2160061, 2053819, 1937076, 1633658, 1400238, 1190900, 986420, 911109, 764451, 641527, 719535, 766048, 709273, 706763, 670894, 533978, 537674, 534971, 483266, 454144, 416985, 391286, 384230, 306349, 273883, 259096, 186455, 156714, 157931, 172920, 194893, 200414, 175117, 116965, 141779, 153264, 184059, 191928, 311087, 359064, 255706, 208171, 281941, 331309, 332143, 391732, 548651, 644953, 881687, 1158796, 1517007]
12305A517007L68914K57511J04026m7732j35023j59339k68770l15054k12486k25453
12295H83601j52987q1891q778l8116q0832M91P06n3411j476l1274n5328J2698
12283C93403m5133n3725j00640j1711O1066k5943o4910j5354P738M214l6868K6412
12271A38549L5355K4647k846K2712M4565k8498Q367J5285l3866l4325J0243k576
12259A97612j5432n4508k6122l0404O0084L2667l3480n5481P9318K5906K0660
12248B00820m1263j5096L7523n165n3074o3423n7935J1080N5861L4898l491r2170
12236H565r9847J06715O2531K4112o7031n2223j3033K9302L9595o4716J0676J32397
12224A17043o811J9968Q781n885K6801L2608K0667l4190l3820m3737L3545M0289
$$ y = [1517007, 1885921, 2143432, 2247458, 2199726, 2064703, 1905364, 1636594, 1321540, 1109054, 883601, 730614, 648723, 639945, 601829, 520997, 521488, 522194, 468783, 467307, 436033, 380705, 393403, 348270, 294545, 193905, 182194, 243260, 217317, 152407, 137053, 144791, 149005, 112137, 138549, 173904, 198551, 195705, 218417, 262982, 234484, 242851, 258136, 224270, 189945, 200188, 197612, 182180, 127672, 101550, 71146, 131230, 163897, 130417, 74936, 154254, 180160, 200820, 159557, 144461, 181984, 176819, 123745, 60322, 2387, 13467, 69328, 104226, 100735, 8565, -91282, 15433, 77964, 102076, 35045, -17178, -30211, -909, 38686, -26030, -15354, 117043, 110232, 130200, 138981, 133096, 159897, 192505, 213172, 178982, 145162, 101425, 134970, 175259]
12212A75259n5303l1181K6899n5687M6667j0372m9213m9972J4478J8980L9422
12201F9977m6130k9254O4866J20020P306m8685P4600l7940m0536M6847j47o92
12189A80232K9702O901o57k2286J256k7340L3425j15534m6738p3707n2725J5854
12177g1617N3529O7294J5562L6450R213J6928m6903n6586q959Q959P2194N8586
12165A54650L3829L7938j17261o4866Q1253l0720m1212l6940M4597M3623O7247
12154A72138l349j23331j39125N317R2258Q1330N0766N4995n5534r909Q395k2194
12142A11757n7917j3858R1875N1801j16047J0312O9408n7174l8915j0008R487
12131E0721J5405k1261K2351j00329n6253j3603Q305k2243q455o24J0266N8391
$$ y = [175259, 119956, 88775, 115674, 59987, 106654, 96282, 47069, -2903, 11575, 30555, 69977, 23847, -5407, 59459, 179479, 186785, 138100, 212700, 174760, 134224, 181071, 180924, 180232, 209934, 216835, 216178, 193892, 195148, 167808, 201233, 85699, 38961, -34746, -87471, -71617, -18088, 49206, 64768, 101218, 110431, 127359, 80456, 23870, 14911, 23870, 96064, 154650, 188479, 226417, 109156, 44290, 125543, 94823, 53611, 16671, 61268, 104891, 172138, 168789, 45458, -93667, -88350, 3908, 85238, 136004, 190999, 135465, 125556, 133951, 111757, 53840, 39982, 131857, 183658, 67611, 77923, 147331, 90157, 51242, 41234, 50721, 66126, 44865, 67216, -33113, -89366, -102969, -94664, -116907, -125362, -125986, -115720, -57329]
12119e7329J6822P5701N7786p1669q806j9019P334J9593j3490N185L7453K977
12107E2538l6550k2257P2240K5470o5848l0154q2309M1910P5891K4721r3679l1983
12095g0010j7336q9207j8112M2251P3665L8255p887J8377K9991m9292o2816M6231
12083f5890k5243N3669P4816k1382j7868O0321L110j07366K3860j2493J2982j5853
12071c7337k4829J22563J60223J10558L2724K1389j07253r2126l0215m2145o6500
12060D7052L2519l7619J8971Q9819k6314m0239J297P7952M442L2138N4296r453
12048B44861l8922r187j02032j4864N1250M4583J1817k6171k6807M6407R1212
12037B72147L6041l5495l8464J0219O7712N7871l1510m8974j3888m450o20l8003
$$ y = [-57329, -40507, 35194, 92980, 21311, 12505, -6514, 820, 20413, 6923, 12108, 49561, 52538, 15988, -6269, 65971, 91441, 25593, -4561, -86870, -44960, 30931, 55652, -38027, -70010, -87346, -176553, -194665, -152414, -78749, -40494, -48381, -30004, -13, -49305, -112121, -65890, -91133, -37464, 37352, 15970, -1898, 58423, 61533, -45833, -21973, -34466, -21484, -37337, -62166, 60397, 220620, 331178, 363902, 385291, 278038, 185912, 155697, 113552, 47052, 79571, 41952, 60923, 150742, 124428, 84189, 85486, 163438, 167880, 200018, 254314, 244861, 205939, 196752, 94720, 79856, 131106, 175689, 187506, 161335, 134528, 180935, 272147, 308188, 272693, 234229, 244448, 312160, 370031, 338521, 289547, 275659, 271209, 270589, 232586]
12025B32586m3485n006L6480N0793j2431J1282q339q601P1496P247j08165j07626
12013A16231j7796N5807N7536L3102L9189m5373k74j5709m7735L2299K3955j1425
12001B19807K7333R4595K4953r0086o6936O6422J5078J0774K6580q610M7989N9753
11989D27652l5090r1649J4974L5490J0572m6529P2618J7060k0085J6531k5594
11978C75950q4187k8159L3858P5819J18127J07757M2498L5765K720J3107L5935
11967G29190P0016J12208j7510o0478p1039o6831r7883j1640o0209J2273J58148
11956F96245J78747N5247l4988J13658K3141j286J17198R1658O9634J62145P1558
11945A542957Q6444N5505R2690J10154J57163J92006J87758K53660K18776K80392
$$ y = [232586, 189101, 184095, 220575, 271368, 258937, 270219, 261880, 253279, 324775, 332022, 223857, 116231, 98435, 154242, 211778, 244880, 284069, 238696, 238422, 222713, 174978, 207277, 231232, 219807, 247140, 341735, 366688, 276602, 209666, 276088, 291166, 301940, 328520, 319910, 367899, 427652, 392562, 300913, 315887, 351377, 361949, 315420, 388038, 405098, 385013, 401544, 375950, 291763, 263604, 297462, 373281, 491408, 599165, 641663, 677428, 680148, 693255, 729190, 799206, 911414, 893904, 833426, 762387, 695556, 597673, 586033, 525824, 538097, 696245, 874992, 930239, 895251, 1008909, 1032050, 1030764, 1147962, 1239620, 1309254, 1471399, 1542957, 1629401, 1684906, 1777596, 1887750, 2044913, 2236919, 2424677, 2678337, 2897113, 3177505]
11935C177505L67093L74528L72980M47621N31205O13011P97153R27486J180324
11926H788906J489455J892150K524050L206828M211495N907302Q199096J1334025
11918D7553307J5179901J9195306K2208624K1998923J7274273P901540m936064
11911A46375810j6823155k2672712k1352221j6436324j1650878q274029o100253
11904D3066238m943110m385905l961024l582781l121299k761153k288504j901939
11896A6120523j672506j436498j237405j076643r61295q63090p92759p18867o04112
11887F757348n20160m16765l96985m08859k67385l72135m32324k91464k21850
11878C429421j58558j66453k20336j95588j08332j61638j57016j13143r2813o6944
$$ y = [3177505, 3544598, 3919126, 4292106, 4739727, 5270932, 5883943, 6681096, 7608582, 8788906, 10278361, 12170511, 14694561, 17901389, 22112884, 28020186, 36219282, 47553307, 62733208, 81928514, 104137138, 126136061, 143410334, 151311874, 146375810, 129552655, 106879943, 85527722, 69091398, 57440520, 49166491, 43066238, 38123128, 33737223, 29776199, 26193418, 23072119, 20310966, 18022462, 16120523, 14448017, 13011519, 11774114, 10697471, 9736176, 8873086, 8080327, 7361460, 6757348, 6237188, 5820423, 5423438, 5014579, 4747194, 4375059, 3942735, 3651271, 3429421, 3270863, 3104410, 2884074, 2688486, 2580154, 2418516, 2261500, 2148357, 2055544, 1988600]
11868A988600p6120p3917o2856r1345j59846q3703j25096j00821j11259k804j8298
11857A082535r992o5684j375n1975j00779j19059l9592J1490Q769n1888n9890
11846F02560j05118n4309J925N766j6938N4098p8280p1527j113L8609K047K7161
11834D04881j1234L2121o054o129l7527j2439m4202l5731K6159k2844r751J5608
11822B92858M6389K667k266J2183l2289n5332O661j1806K5873j4938j4835Q1146
11810C36311Q9934q6763m9746k5874j08113J605k9262m4959k6744Q9577M7263
11799A93229M8294n0158n6755l2225O7612P308L86j4957j09877m3204k8383M8458
11787B9728J9807K3709O2426P7277k1417p3007n1296k3065m1215j3794J6076J00511
$$ y = [1988600, 1912480, 1838563, 1775707, 1684362, 1524516, 1440813, 1315717, 1214896, 1103637, 1100833, 1082535, 1072543, 1006859, 1005484, 953509, 852730, 733671, 694079, 705569, 714338, 662450, 602560, 497442, 443133, 445058, 450824, 433886, 487984, 409704, 338177, 337064, 375673, 377720, 404881, 393647, 425768, 419714, 413585, 376058, 363619, 319417, 283686, 309845, 287001, 277250, 292858, 339247, 341914, 339648, 351831, 319542, 264210, 270871, 259065, 284938, 270000, 255165, 336311, 426245, 339482, 289736, 263862, 155749, 157354, 128092, 83133, 56389, 145966, 193229, 241523, 191365, 134610, 102385, 169997, 177305, 177691, 162734, 52857, 9653, -18730, 29728, 49535, 73244, 135670, 212947, 191530, 118523, 67227, 44162, 2947, -10847, 5229, 105740]
11775A05740N4610K0429j9693L9466Q1925O0522l9430j3162n2635K5641l7872
11764B25541l3617l4915P446J2837n6133j00773k3500J17932M2083M5582Q128
11753B10611k7503o7860l5812J6932m8274L7473J05398N0410o7789K0167J05793
11742B99546k2715r1525p7256j1913P9683J00825K4055l7497m7959j7501j1930
11731A85813j2185p1828n22M2126k402k6053r8457j9141K8567N1870R8165K7589
11719B03542k8161q1289L6m2993J8206j1137q4711Q5075r017n1909j7869M4792
11707B4565R4381l0485o1891l1252m7815L3885M5310k8474n2952j4803J20155
11696E0624K2187Q9129J7964K0144k9224j16614K520j9226n6391K0022J8633L232
$$ y = [105740, 160350, 180779, 161086, 200552, 282477, 342999, 303569, 290407, 237772, 263413, 225541, 191924, 157009, 164455, 177292, 121159, 20386, -3114, 114818, 156901, 202483, 210611, 183108, 115248, 79436, 96368, 48094, 85567, 190965, 241375, 173586, 193753, 299546, 276831, 185306, 108050, 96137, 175820, 276645, 300700, 263203, 215244, 197743, 185813, 173628, 101800, 101278, 143404, 141002, 114949, 16492, -2649, 25918, 77788, 175953, 203542, 175381, 94092, 94128, 51135, 69341, 58204, -26507, 58568, 49551, -2358, -20227, 24565, 118946, 88461, 26570, -4682, -52497, -18612, 26698, -1776, -54728, -69531, 50624, 72811, 161940, 179904, 200048, 170824, 54210, 56730, 37504, -18887, 1135, 19768, 23000]
11684B3000p3181j11376Q7361J26120P1691n2522n2587O3989Q6481l9164q9446
11673D0366n24m5125j103N120l0584O3437L1376K1047J9818Q3529L4226j12168
11661A09415q3253k9986N0221J19643j7205j554k5668J641k7339j09635N3525
11650C9805J21444K7163q8593m9456N0976J7472l8965q461j2197Q0419j0920o1056
11638F7631K5732K049M0096R2687o1342M361k4390l3529m5657K5135k4545q0482
11626a2254J7538O44K2776R4863M3471O505k8567M4094K975M998n1868J8982Q482
11613A72639n240o4977N6O5128j195o2476P564Q7958k1888n8666J7799l587j4600
11600A18515K9255J605l4034l1922l5803j3643K9769L5432R7066k8021n3396K5270
$$ y = [23000, -50181, -161557, -74196, 51924, 123615, 71093, 18506, 82495, 168976, 129812, 40366, 39842, -5283, -6386, -1266, -31850, 31587, 62963, 84010, 103828, 187357, 221583, 109415, 26162, -3824, 46397, 166040, 148835, 147281, 121613, 123254, 95915, -13720, 39805, 161249, 188412, 99819, 50363, 101339, 118811, 79846, 71385, 59188, 139607, 128687, 67631, 93363, 95412, 135508, 228195, 166853, 171214, 146824, 113295, 67638, 92773, 68228, -12254, 5284, 5928, 28704, 123567, 167038, 173543, 144976, 189070, 192045, 197043, 145175, 164157, 172639, 167399, 102422, 102478, 167606, 166411, 103935, 111499, 199457, 177569, 118903, 136702, 133115, 118515, 147770, 149375, 115341, 83419, 47616, 33973, 63742, 99174, 196240, 168219, 114823, 140093]
11588A40093l7358p4139j2442L5303N1398l4838o2184k9755L7534K2848L9164
11577G5624L3718p5390j4143K8150J9475k8985P359j9843j5104j3286P6453L5027
11565A09055j8364m3483o9959l3499J6221o384o856m2460k4725P5973P5280J5143
11553D5942K6202L2457l9846l1424M0107n2094j01500J6260L4749K5994L6403
11542C3250P339j7115j2950M0849o400L7899p6070k2464M4367J2315j5063j5537
11530A0420k2996K6543P5493K3700l717k3398p3855k7202k2377o28O1429K4591
11518D8003j8058l5292k5761M9689j3386m178o974l3219Q897n7071n0912P2239
11506f6023M9311M7097n9683L3156M9217k3948K8644O3952J6492m6157j7534J8801
$$ y = [140093, 102735, 28596, 16154, 51457, 102855, 68017, 5833, -23922, 13612, 36460, 75624, 109342, 33952, 19809, 47959, 67434, 38449, 45808, 25965, 10861, -2425, 74028, 109055, 90691, 47208, -22751, -56250, -40029, -46413, -53269, -95729, -120454, -44481, 30799, 45942, 72144, 104601, 64755, 33331, 73438, 21344, -80156, -63896, -29147, -3153, 33250, 40589, 23474, 10524, 51373, 44973, 82872, 6802, -15662, 28705, 41020, 25957, 10420, -12576, 13967, 89460, 113160, 109443, 86045, 12190, -15012, -37389, -38017, 23412, 48003, 29945, -5347, -31108, 18581, 5195, 1017, -5957, -39176, -30279, -87350, -138262, -66023, -16712, 30385, -29298, 3858, 53075, 29127, 57771, 121723, 138215, 92058, 74524, 93325]
11494I3325K3103L8393j00494l9559R2577K2434M0405J2448q6247o0188m0975
11483d778m8098P756J0128k2240P1816J00679j5716n4213m6357k4058p520J1259
11471b1342n4524m5604k3918J01443P2776j9412J5672l9467L7608O9131L8194
11460A30557K9407m8164j7931J9915o456o7531q4046K9051O0768l7041k7900M3177
11448B3806n3161o9710J30046K2145n2439j5282L2451N5684P2139L1132J1068
11437A87879l342o1852n2471j2419l2202K327m4728j462q629k7794k8097q54R8507
11424A4863k7638n1150p0199J53893J11842K0575p9358j07673m516q979l6352
11413h4692l4864O0678O2732p9978K1656O9768L8539l9796R167M0681Q3753l681
$$ y = [93325, 116428, 154821, 54327, 14768, 107345, 129779, 170184, 182632, 96385, 36197, -4778, -52876, -45120, -34992, -57232, 14584, 115263, 99547, 45334, -1023, -25081, -32601, -21342, -75866, -121470, -145388, -43945, 28831, 9419, 25091, -14376, 23232, 92363, 130557, 159964, 111800, 93869, 113784, 107328, 39797, -44249, -15198, 45570, 8529, -19371, 23806, -29355, -99065, 30981, 53126, 687, -14595, 17856, 73540, 145679, 176811, 187879, 184537, 122685, 70214, 57795, 25593, 27920, -16808, -18270, -26899, -54693, -82790, -83644, 14863, -12775, -63925, -134124, 19769, 131611, 152186, 72828, -34845, -39361, -48340, -84692, -119556, -58878, 3854, -76124, -54468, 15300, 53839, 14043, 23210, 63891, 147644, 143963]
11401A43963p800o5188l9912l4704J5050O450l0166J12665m899o0554m7635j8494
11389c1224O1224K1264k5573k6794n387k2989o1111P260k9302Q803L396J0032
11377i0401R3393K9506K7952o2667K5651j6073n9228J7130L1771m3504n2907j9127
11365a18504n6791N6823Q5991J8163J6384q6158J028L8041J13453k0618r4410
11354d6598m7286l384L1897m1683K9833N2566P5611N2864n2715o2310P3654K4986
11342H7435k6832j1536K7417q68j0805k5661J9942M5666l1079K9794n1232k6806
11330B5435K1915L9411l536o2379K0655J31624j5211r3812K5209L4383m6287r7065
11318a9658O4633N5935j01453k9935L75L497J4867J5725m58J7473p1120j24501
$$ y = [143963, 136163, 70975, 31063, -3641, 11409, 17859, -12307, 100358, 95459, 34905, -12730, -31224, 30000, 51264, 25691, -1103, -6490, -29479, -90590, -83330, -112632, -103829, -100433, -90401, 2992, 32498, 60450, -2217, 23434, 7361, -51867, -34737, -2966, -46470, -99377, -118504, -175295, -118472, -32481, -14318, 2066, -84092, -83064, -45023, 68430, 47812, -46598, -93884, -97268, -65371, -107054, -77221, -24655, 50956, 103820, 51105, -11205, 62449, 87435, 60603, 49067, 76484, 75616, 64811, 39150, 59092, 104758, 73679, 103473, 52241, 25435, 47350, 86761, 83225, 20846, 41501, 173125, 157914, 64102, 89311, 123694, 77407, -19658, 44975, 100910, -543, -30478, -30103, -26606, -11739, 3986, 3528, 21001, -50119, -174620]
11306a74620J3587Q0793o665k6895J4844M7631l0483m8039m161N9384K8093j0886
11294e7417m7195K3254m6017K0558K5807O4511L7832j5588o4986o2072M4705Q8316
11282A1708K1364Q4999Q19l1857j0010P1537J2974R344p2364l1656L7566L0556
11270A34980r4366p2887j3108j2028K8632N0457n402L600r568K4155j8629m4130
11258b8294j00916o1455R3145N0818l2297Q9341K2708o0258p743J0705K3687N2728
11246E2169j4502P6387l1359k6113R366m1471L1429O381j9700N801M4323m0688
11234E2023j03018n8472n1052j383J52902M7970l9564J2804K7152p959J1481o9247
11222b6363k7397J158M6319n0776O8307M9318j18361j709J13409o4985j7347Q800
$$ y = [-174620, -161033, -80240, -86905, -113800, -98956, -51325, -81808, -129847, -134008, -74624, -46531, -57417, -104612, -81358, -127375, -106817, -81010, -16499, 21333, 5745, -59241, -121313, -76608, 11708, 33072, 118071, 118890, 87033, 77023, 148560, 161534, 170878, 98514, 66858, 104424, 134980, 40614, -32273, -45381, -57409, -28777, 21680, 16278, 19878, 10310, 34465, 15836, -28294, -129210, -190665, -97520, -46702, -78999, 10342, 33050, -27208, -34951, -24246, -559, 52169, 37667, 114054, 82695, 56582, 65948, 24477, 55906, 62287, 42587, 48388, 92711, 52023, -50995, -109467, -160519, -161902, -9000, 38970, -594, 12210, 39362, 31403, 42884, -26363, -53760, -52602, -6283, -57059, 11248, 60566, -57795, -59504, 53905, -11080, -28427, -19627]
11210a9627K4514R0910J2164M0164o0613k0835O847p868o1630q7133o61j9979
11198a03747l0291N7860K7094O1236M632q1979Q7723k3215M3428k862o3139o0475
11186h3735l4851O8836L6929k9659M2929q1015l6980P4592O6145k4614K2458P2382
11174I3417l0575p8338J7464J15446K7588O579j4270r8397K1789J1810l101L0954
11162A00366O2093k4161j22105q0259n1094L8956k6882k4204l2293N5663J32820
11151B8900n016p263L6630p5945K4324n8902J8436J12744M1886m0709j36380K8731
11139c2564L6895m838m177j9808J16211J15122l062j01358j4681k8967l860J8642
11127G3555n8500p4609l4933Q2341J06026o9444J3506L777j8710k8921o3593k8234
$$ y = [-19627, 4887, 95797, 107961, 148125, 87512, 66677, 73524, 65656, 4026, -83107, -83768, -103747, -134038, -76178, -49084, 12152, 16784, -65195, 22528, -687, 42741, 39879, -23260, -83735, -118586, -49750, -12821, -42480, 449, -80566, -117546, -42954, 23191, -1423, 21035, 93417, 62842, -15496, 1968, 117414, 145002, 151581, 137311, 38914, 60703, 72513, 69412, 100366, 162459, 138298, 16193, -64066, -115160, -76204, -103086, -127290, -159583, -103920, 28900, 23884, 16621, 53251, -22694, 1630, -57272, -38836, 73908, 115794, 75085, -61295, -32564, 4331, -507, -4684, -24492, 91719, 206841, 203779, 102421, 87740, 58773, 54913, 73555, 15055, -59554, -94487, -12146, 93880, 24436, 37942, 41719, 23009, -5912, -69505, -97739]
11115i7739j5443K0607M4501r756l374j7930Q7472l7009L539J2184j20228l0219
11103a63395M2801k184O7231M4222l559j5325j6600l6335N5492L6726q3312j3803
11091h8041K0065l2790P0462R4903k2915o7749j5641l3020L254j0431l5656L3820
11079h3739Q4524M9746q2124j12157l15K6126l526P3997L5632M9281k0118M4288
11067F1615m7812l1509M1L4538L8376n7871K997m6514n9944K7598M5740L3323
11055E78q04n0802k2938o951N5110L969R2378L9726L3838k7689Q152K9705K8606
11042A82878k3382o0259J4214P8398J35183L3062j9608J9397K886o29K1308m5330
11030C38118l8706j26985M5768J17738O7212J16567K1051P928q9290r4493k4214
$$ y = [-97739, -113182, -92575, -48074, -57830, -61204, -79134, 8338, -28671, -25132, -12948, -133176, -163395, -120594, -122778, -55547, -11325, -14884, -30209, -46809, -83144, -27652, 9074, -74238, -88041, -67976, -100766, -30304, 64599, 41684, -26065, -41706, -74726, -71472, -81903, -117559, -83739, 785, 50531, -31593, -143750, -144065, -117939, -121465, -47468, -11836, 37445, 17327, 61615, 13803, -17706, -17665, 16873, 55249, -2622, 375, -46139, -106083, -78485, -32745, 578, -226, -51028, -73966, -80917, -25807, -21838, 70540, 110266, 144104, 116415, 124567, 154272, 182878, 159496, 99237, 113451, 191849, 327032, 360094, 340486, 359883, 362769, 362140, 383448, 338118, 299412, 172427, 218195, 335933, 403145, 519712, 540763, 548691, 459401, 364908, 340694]
11019C40694k7318J20194P2902Q5253P4713P8387Q54p8543l9683J8589j14118
11008E31924j02418K7935l1760P953l3825N9325N9648R372o5880n7046j2757k6233
10996C66238l0063l6914M9185J3865l1511j7146R4951O728m2222j5185n3997R66
10984C04895r8042j08564J489J7328P2098K7830q9578l8322n6141M6115M8526
10973A27634n870n2205o5522o9197L8916M1676K5512k4048r8883P23J22219Q6440
10961A27395q880q2600o0677j9862R5452M7966N7580l0748k988p0827o5276k7119
10949d0584j3940m6697Q9240n1952m3350K1364m0238n9817m9470K527J22553O6389
10937d3975R1227K8476p2580J7799P3143m3587p8740K0151O1777J1195k8673o9656
$$ y = [340694, 313376, 433570, 506472, 591725, 666438, 744825, 745679, 667136, 627453, 646042, 531924, 429506, 457441, 425681, 433634, 399809, 459134, 518782, 528154, 462274, 405228, 392471, 366238, 336175, 299261, 348446, 362311, 330800, 313654, 408605, 415333, 373111, 357926, 303929, 304895, 206853, 98289, 99778, 117106, 189204, 217034, 127456, 89134, 32993, 79108, 127634, 121764, 69559, 4037, -65160, -26244, 15432, 40944, 16896, -81987, -81264, 40955, 127395, 118515, 35915, -24762, -44624, 50828, 98794, 156374, 125626, 122638, 51811, -13465, -40584, -54524, -101221, -11981, -63933, -107283, -85919, -126157, -185974, -235444, -232917, -110364, -43975, 47252, 75728, 3148, 20947, 94090, 50503, -28237, -8086, 53691, 64886, 36213, -33443]
10925c3443j26351J875J60086O6164K6774o0023l0295j7027K3624j9034j7863
10914b5513j12344O218R5488L9880N9308O2411k7342k6215k4101j1375L9933k1555
10902E4793o0903O0378J1307n8923K5541j9575q5924k6139O5281J14371J677n6634
10890B5250k2569Q157N696R2490K2292k1462j1499n7768r24l798l1429P683n4043
10877d1924p870j9553l3243m2972R0298N7915k9477m1944j4243M5607K4383k1002
10865c4025L0805l5365L2815j3257l9236R85m4914J2273L5263J00812O6882j9765
10853I3273N9926l1083N8101K4067n2114M2895r8962l1018M6177q802J7977p905
10841A12532j1099L604J4593k8661J5645J3548j0816j07560j2994N7017R2175
$$ y = [-33443, -159794, -157919, 2167, 68331, 95105, 35082, 4787, -12240, 11384, -7650, -25513, -137857, -131639, -36151, 3729, 63037, 125448, 98106, 71891, 47790, 36415, 76348, 54793, -6110, 54268, 65575, 6652, 32193, 12618, -73306, -99445, -34164, 80207, 81884, 25250, 2681, 10838, 16534, 109024, 131316, 109854, 98355, 40587, 39663, 35865, 4436, 12119, -41924, -49794, -69347, -102590, -145562, -55264, 2651, -26826, -68770, -83013, -37406, -13023, -34025, -3220, -38585, -5770, -19027, -58263, -57278, -102192, -89919, -54656, 46156, 113038, 93273, 153199, 122116, 180217, 204284, 152170, 195065, 96103, 65085, 111262, 102460, 120437, 112532, 101433, 105037, 119630, 90969, 106614, 120162, 109346, 1786, -11208, 45809, 137984]
10830A37984m1810p223L4648J93k4450O440K0597j3724n9181l8196Q622J25658
10818A49558N4309K2765m2622o2198J6937r5957o3111K6208P21o4401k6126M41
10806h3476N3398M4147O6215J5905l1228n7258l2829J9572L4017J4602j2762K604
10794C2907p2142L79K5049k8186o9700Q3730J77644J4314j25104q9080N7976P9950
10782H7737p1797o385O7757k4740j14794j5988L4888P8099L1984r72j2332n5026
10770a569M4723L8751m0993q5362k0747o290p9756J08244K3884r0641M0563K3751
10758d5442j9003P7396J9789m1030n6452p401Q7502J17984o4470j8410K5164j3610
10746F2017l3224L3110L54m2647L1378O5556K7942p156P6040j8525K9076M6448
$$ y = [137984, 96174, 88951, 123599, 123792, 99342, 105782, 126379, 112655, 53474, 15278, 23900, 149558, 203867, 226632, 184010, 121812, 138749, 42792, -20319, 5889, 6610, -57791, -83917, -83476, -30078, 14069, 80284, 96189, 64961, 7703, -25126, -5554, 28463, 43065, 30303, 32907, -39235, -38856, -13807, -41993, -111693, -27963, 149681, 163995, 38891, -50189, 7787, 87737, 15940, 9555, 77312, 52572, -62222, -78210, -43322, 34777, 66761, 65789, 53457, -1569, 43154, 81905, 40912, -44450, -65197, -71487, -151243, -42999, -19115, -109756, -69193, -45442, -64445, 12951, 32740, -8290, -64742, -72143, 15359, 133343, 68873, 50463, 75627, 62017, 28793, 61903, 62257, 19610, 50988, 116544, 144486, 137330, 213370, 194845, 223921, 270369]
10734B70369o7607m734n0380p1932m1665j2142L9476R3225j9263o2171M8524O4215
10722A85915J5546j2107k5780J4859O9060N8373p40m9752m4236J4905J8684q8615
10710A56112j3953R6647m3129j10747N7928L2704O468J5803n0125M7202O1636
10699B56546M5644k743K192l8428n0571M1027o8265K0996Q2867L9241q3418o1279
10687A83809L8464K5378N172L158n7450M2564K2904j1033k2621K4411Q3182j9342
10675C18596J7676P8715j02790j04171K2810N6547o370J2747K19M2171N5933p706
10663C84377J7132o8923j3996N3682M6314l4006m6369m141k8693p5244j7183M2487
10651B55437Q0658J18242L8044q749j1257J03115P4203P4318J01569J02155J54025
$$ y = [270369, 202762, 198028, 147648, 75716, 34051, 21909, 61385, 154610, 135347, 73176, 121700, 185915, 201461, 189354, 163574, 178433, 247493, 305866, 305126, 255374, 211138, 226043, 244727, 156112, 142159, 238806, 195677, 84930, 142858, 175562, 182030, 197833, 147708, 194910, 256546, 302190, 299447, 301639, 263211, 212640, 253667, 185402, 206398, 289265, 328506, 245088, 183809, 222273, 247651, 252823, 255981, 198531, 241095, 263999, 252966, 230345, 254756, 337938, 318596, 336272, 414987, 312197, 208026, 230836, 287383, 281013, 293760, 293979, 336150, 392083, 384377, 401509, 332586, 318590, 372272, 418586, 384580, 338211, 334070, 305377, 230133, 212950, 255437, 336095, 454337, 492381, 483632, 472375, 575490, 649693, 724011, 825580, 927735, 1081760]
10640A081760N4986J7013n4898l6996K440l047J4581k3187M0281M0990J33393
10629A267316J14185J36452J94488K53973K28143L26796L43299K21413J50335
10620C236400K06979K54198M99386O57510R76599J287469J617708K240293K872599
10611A3849141L499921M319868M711657M772733M290663L152294J709947M13354
10603D0719578j06007L97163J739880L656139N738945P610334Q933011Q879840
10595G7568883P271535M019307N6730l032741m223349k946683n9151L282744O516191
10586H8453466R187508J0644412R927111O664323J562006m357702q935790j0331924
10578A02813410q840268n591881k081489J044032L337320M253122L644795J207725
$$ y = [1081760, 1136746, 1153759, 1098861, 1061865, 1064305, 1061258, 1075839, 1052652, 1092933, 1133923, 1267316, 1381501, 1517953, 1712441, 1966414, 2194557, 2521353, 2864652, 3086065, 3236400, 3443379, 3697577, 4196963, 4854473, 5831072, 7118541, 8736249, 10976542, 13849141, 17349062, 21668930, 26380587, 31153320, 35443983, 38596277, 40306224, 40719578, 40613571, 41010734, 42750614, 46406753, 52145698, 59756032, 68689043, 77568883, 84840418, 88859725, 88916455, 85883714, 81660365, 78713682, 78654531, 81937275, 88453466, 97640974, 108285386, 118212497, 124876820, 126438826, 122081124, 113145334, 102813410, 93973142, 88381261, 86299772, 87343804, 90681124, 94934246, 98579041, 99786766]
10570I9786766k444023o271243q840809r373321p956155n615783l507789j657554
10562E4120089m60346j53364n17879j556019l011078m462628n391995n417057
10554C3149723m919310l953386l107754k530603k098610j743070j546088j339129
10546A1911773j195202r91831r50762q32474p11416n72993n13471m63991m67940
10537E211693l79266m37084l71128k72307k95425j05651k15419k09033k27583
10528B698797j61517j51496j72360r6268j32657j62651j18372j1958J9533j52534
10518A558517j88806n5669j3988m2098j37843j04551n4266j8483p64o1908k0821
10507H59320l265k5271k6501j8062j20934j27328k138J2187K2760N8038Q6672
$$ y = [99786766, 97342743, 91071500, 82230691, 72857370, 64901215, 59285432, 55777643, 54120089, 53659743, 53506379, 52988500, 51432481, 48421403, 43958775, 38566780, 33149723, 28230413, 24277027, 21169273, 18638670, 16540060, 14796990, 13250902, 11911773, 10716571, 9724740, 8773978, 7941504, 7230088, 6657095, 6143624, 5679633, 5211693, 4832427, 4395343, 4024215, 3751908, 3456483, 3350832, 3135413, 2926380, 2698797, 2537280, 2385784, 2213424, 2117156, 1984499, 1821848, 1703476, 1691518, 1711051, 1558517, 1369711, 1314042, 1300054, 1257956, 1120113, 1015562, 961296, 942813, 942049, 880141, 859320, 856055, 830784, 804283, 786221, 665287, 537959, 535821, 548008, 570768, 628806, 715478]
10496G15478p3840j01984j09855m072J5809l0542J8517M0367J6216N9289p0617
10485D74766m6550k2802n8338j0450o952J4225J3455K1283m762J255n5758o9003
10473B50369l5928M660O3803l6942l3975j6855K9005M6842j3094K5859J8171j2198
10461B89717j5304J0656m1796l162k2856k4525r0305l379K7779M6946M1667j4946
10449B00492j086L9855o565j06245J9456L6184m09J13597K3643j54215p1724m0178
10437E2805M6496Q7719L7544l8676P6091k0614m684k7321j0151K8841p1072o4981
10425I1997O7396M2878r1504J7746L3164m9583m6558M894p474P3953j7758K7601
10413A46752m3903r0188p5239l5982R3644Q7471J32805k5229M2244J6413o195
$$ y = [715478, 641638, 539654, 429799, 425727, 441536, 410994, 429511, 469878, 486094, 545383, 474766, 428216, 405414, 347076, 336626, 329674, 343899, 357354, 378637, 373875, 375130, 319372, 250369, 214441, 219101, 282904, 245962, 211987, 195132, 224137, 270979, 257885, 283744, 301915, 289717, 274413, 285069, 243273, 240111, 217255, 192730, 102425, 99046, 126825, 173771, 215438, 200492, 199406, 239261, 232696, 126451, 145907, 182091, 181682, 295279, 318922, 164707, 92983, 52805, 99301, 187020, 224564, 185888, 261979, 241365, 236681, 209360, 199209, 228050, 156978, 91997, 159393, 202271, 110767, 128513, 161677, 112094, 65536, 70430, 62956, 136909, 119151, 146752, 102849, 12661, -62578, -98560, -4916, 82555, 215360, 190131, 232375, 248788, 242593]
10402B42593r7631J477Q5490L6242L2421l8000q4027k8819J640K0263J35697J26967
10390D34313j9223r9116m3537n2676N7039K9317j52827p1158R0083J1729K4970
10379B08914N8838n478m0928N200J1621m1179l3687l576l7009k9346p271O7167
10367A53266l4254l3003O033k9612q2949N9613N9225l1087j9900n2343J8632M1673
10355E5294M8466J10383O3551j25799r5494P084M9523K3966P2429l5191p6987
10344I7225K5231J7740m3644N556p8267J4538R6868R261p0647l1212J5738J34152
10332A92539K8073l5465K0360K7339J34574K1111j13185j19416O941M4366l2332
10321A74905n3238K1193l1697K8424M2575j05521p1810r2751P8137N6734K1197
$$ y = [242593, 144962, 146439, 231929, 268171, 300592, 262592, 178565, 149746, 151386, 171649, 307346, 434313, 415090, 315974, 272437, 219761, 276800, 306117, 153290, 82132, 172215, 183944, 208914, 267752, 262274, 221346, 226546, 238167, 196988, 163301, 159725, 122716, 93370, 86099, 153266, 119012, 86009, 92042, 62430, -20519, 39094, 98319, 67232, 47332, -5011, 13621, 55294, 103760, 214143, 277694, 151895, 56401, 63485, 113008, 136974, 209403, 174212, 97225, 122456, 140196, 96552, 102108, 23841, 38379, 135247, 144508, 73861, 42649, 58387, 192539, 220612, 185147, 205507, 232846, 367420, 388531, 275346, 155930, 162871, 207237, 174905, 121667, 142860, 111163, 139587, 182162, 76641, 4831, -87920, -9783, 46951, 68148]
10310F8148o6016o01O8847K8656p406n2546O9663O3076m4519m5165q2706k1685
10298b2254Q9299K3533Q0565k084n5402q6110J5642L9622o1729M0389k167J9177
10286G8481n3413O133R1018l3251m1370m3022K6068M640p922k6415j8955J5116
10274b892j28382l7809L2327J04626J81187J04798p1981j27727m7714l8566N1131
10263A8998J34899L6789l2778n8021M0059M0163Q245J0863M5184o7134J3179l4322
10251A56124q396R3183p598j59410r7621k9376Q5507p332p311o5398k8229j6940
10239i2797q0515Q3516M1725M7381k6611L7888R253J2203n8514j9594j0683o8287
10227a25035K2915L4749o1574K6237Q5756N2680l343N7413J6987L1303n0387k9087
$$ y = [68148, 2132, 1531, 70378, 99034, 91628, 39082, 108745, 171821, 127302, 82137, -569, -22254, 67045, 90578, 171143, 169059, 113657, 27547, 43189, 82811, 21082, 61471, 59304, 78481, 25068, 31201, 122219, 88968, 47598, 4576, 30644, 35284, 27362, 947, -18008, -2892, -131274, -169083, -136756, -32130, 149057, 253855, 181874, 54147, 6433, -32133, 18998, 153897, 190686, 157908, 99887, 139946, 180109, 188354, 199217, 244401, 177267, 190446, 156124, 147728, 240911, 233313, 73903, -23718, -53094, 32413, 25081, 17770, -47628, -75857, -92797, -173312, -89796, -48071, -690, -27301, 10587, 19840, 32043, -26471, -46065, -56748, -125035, -102120, -67371, -128945, -102708, -16952, 35728, 32385, 89798, 106785, 138088, 87701, 58614]
10215E8614k8472n2776R6477M4950J6835n0380n5197Q226K6862j2181k7915P656
10203C2699J232o4104Q1542O9690j1029l9333R126O209N8219o0217R856M5049
10191A38939r884j8562j3147l7443m9173o9124J0125l299K7145M3668m1004j1715
10179c3474J6294Q6465R6416J1039K100k6963N6134Q3250o5586l9855j6147J068
10167A70741L6279Q0988J7882l3527N762N4792j4056j5100N0451J03767M3089
10156E01068l5006n8329M0598R4966Q7919l1735j8364P8616R3010K4824n4979
10145G22588l1537j2481o5086o7468K8156L525p2691L5285P1309P2557J1101q14
10133F94444j0331N8734j7555m5320j4777l0967m0581j36986m9874K1808j11787
$$ y = [58614, 30142, -22634, 73843, 118793, 135628, 85248, 30051, 38277, 65139, 52958, 25043, 32699, 33931, -30173, 51369, 121059, 110030, 70697, 79823, 86032, 144251, 84034, 93890, 138939, 129055, 110493, 97346, 59903, 10730, -58394, -48269, -51568, -24423, 19245, -21759, -33474, -17180, 69285, 165701, 176740, 178840, 151877, 208011, 291261, 225675, 185820, 169673, 170741, 207020, 288008, 305890, 272363, 278125, 332917, 318861, 303761, 354212, 457979, 501068, 466062, 407733, 448331, 543297, 631216, 599481, 581117, 659733, 752743, 777567, 722588, 691051, 678570, 613484, 546016, 574172, 577697, 505006, 540291, 611600, 684157, 695258, 694444, 684113, 742847, 725292, 679972, 665195, 634228, 593647, 456661, 406787, 428595, 316808]
10122C16808r959K8019j1984o7996J6221J7105o8468n5024k5707p0116k6626M4815
10110H7088L7171l5544m0042n8087j3955M766M4513J9068M6853l5888q3087o7195
10098i4339n0994K432O432P754L6844M7845P1628Q3429n254j8253k6178N1046
10086A12392N1693q214q475m1242p2867q2211k3189k6797L5616N2076k4225j6357
10074e1800n1580N760J6299n630l8202M4754K8875n3212r7189K7243R0589N5190
10062b8903k4800m4425L9367Q808N9467O8105J8297m5760n8555K3883J0570J3457
10050C9511o8550l4184K690L2693P2823O0408j7843L296o516K229R055O5148k1086
10037A39674l767l6644m6627L862L8480J4690M5360p499l863J5538j0490j18483
$$ y = [316808, 306849, 334868, 322884, 254888, 271109, 288214, 219746, 164722, 139015, 68899, 42273, 87088, 124259, 88715, 48673, -9414, -23369, -18603, 25910, 44978, 91831, 55943, -27144, -94339, -145333, -142901, -136469, -128715, -91871, -44026, 27602, 111031, 105777, 87524, 61346, 112392, 164085, 155871, 147396, 106154, 33287, -48924, -72113, -98910, -63294, -11218, -35443, -51800, -103380, -97620, -81321, -86951, -125153, -80399, -51524, -104736, -201925, -174682, -84093, -28903, -53703, -98128, -58761, -49953, 9514, 77619, 95916, 50156, -8399, 15484, 26054, 39511, -29039, -63223, -60533, -27840, 44983, 105391, 87548, 90844, 84328, 86557, 95612, 160760, 139674, 135907, 99263, 52636, 56498, 94978, 109668, 155028, 147529, 143666, 159204, 148714, 30231]
10025C0231p1671M457J9898J3074O3826M7469l900n9137l6771l2598N8161J9725
10013E2764m1934l5123N7104Q4935L7149j31141o9758m6314P1583P9110K5730
10002H4105M4230p676l3035o7581K6813R615l3610j14N945m8329j06711j1574
9990a37922J52083O7275O4676o0787m1035p1944k9215J1445O3196Q3541k2165
9979G9148j4143m6366M2937M455l0501l8807n2452r4243o1558l141O6441N9223
9967h9007o5989P0966L4403p6716l9674Q8416M3833l2041l2562k3272M9082N6029
9955a6532R1933L8352o3661p0952L3256M5963Q3090n7893r4888m8407m3385R53
9943a02171L95Q955M7478N2914m3493J07306P9347p4023j2628M8877k7038m8123
$$ y = [30231, -41440, -36983, -17085, -4011, 59815, 107284, 103384, 44247, 7476, -25122, 33039, 52764, 10830, -24293, 32811, 117746, 154895, 23754, -46004, -92318, -20735, 58375, 84105, 128335, 120659, 87624, 20043, 46856, 56471, 22861, 22747, 28692, -19637, -126348, -137922, 14161, 81436, 146112, 85325, 44290, -27654, -56869, -45424, 17772, 101313, 79148, 65005, 18639, 61576, 66031, 35530, -3277, -55729, -149972, -211530, -214671, -148230, -89007, -154996, -84030, -49627, -126343, -166017, -77601, -33768, -65809, -98371, -121643, -72561, -16532, 75401, 113753, 50092, -20860, 12396, 58359, 141449, 83556, -11332, -59739, -103124, -102171, -101776, -92821, -45343, 7571, -35922, 71384, 150731, 76708, 64080, 112957, 85919, 37796]
9931C7796j01484O2806R1126N7420J3669j10945k3706K1456O6638j8036m7253
9920D9487n2049p1534O9822K0774N0184J10981l8338n3180p4876n1942J6122R163
9908a5386P064l6412j1845N5151k571J9252N1895l3171J1503l1037N5480O543
9896G6466l3271k1628L9396j4088p5163M1473J855N598l0031p200K5925O2303
9884G1635q989r7603m7199k1630J8844M8892r511o5708M016L9819J30767K4387
9872H7720k7133K0701q9441o6209J7723M8913k6982J4602j8183q2324J8074P8230
9860b4309L0413o407k1642N6395m0632j08199O3101M7048m7755m2610M482J7948
9848g2167Q7345j5075L2681p1735n0720P7085J7453j2932m4393Q6746j7409l6025
$$ y = [37796, -63688, -882, 90244, 147664, 161333, 50388, 26682, 48138, 114776, 96740, 49487, -2562, -74096, -4274, 16500, 66684, 177665, 139327, 86147, 11271, -40671, -24549, -15386, -8322, -44734, -56579, -1428, -3999, 15253, 67148, 33977, 45480, 14443, 69923, 76466, 43195, 21567, 60963, 46875, -28288, 13185, 15040, 20638, -9393, -16593, 9332, 71635, 62646, -34957, -82156, -103786, -84942, -36050, -45561, -111269, -107253, -67434, 63333, 87720, 60587, 81288, -8153, -74362, -56639, -7726, -34708, -20106, -38289, -120613, -102539, -24309, 6104, -303, -21945, 34450, -6182, -114381, -51280, -4232, -51987, -94597, -90115, -72167, 15178, 103, 32784, -38951, -89671, -12586, 4867, -8065, -52458, 34288, 16879, -19146]
9836a9146P1146L3694o2250J5700K9341l4596M5914P2273L7321j0062m9043j30527
9824b35j56277j18236O919N6140L2603P4457P7137O8229N9378m4771o4994J7532
9812G882J8397q118K1049j6924M0767k562J0556o7117j9219j561J9626P6967M0810
9799A20553l3059J7394J00332L0885K6453L3673p2476n7619l2008l5765j5274
9788H3089L9904K4601l4896m1940L0762l4226n139J8335O8086N8344M3314l6506
9776B13728k8233M807n0905o7930j01811m2558Q4702P227n064q106L1066m2899
9764e976K4443J6480k0206k81q7591J958J0016j4849M757L3995R2310J3091j9117
9751D9030P7204k8560p9432K845m8816m5415J7224M6228K0470l9279m7247K4712
$$ y = [-19146, 52000, 85694, 23444, 39144, 68485, 33889, 79803, 152076, 189397, 179335, 130292, -235, -156512, -274748, -267829, -211689, -179086, -104629, -27492, 40737, 100115, 55344, -9650, 7882, 26279, 18161, 39210, 22286, 63053, 60491, 71047, 3930, -15289, -16850, 2776, 79743, 120553, 87494, 104888, 205220, 236105, 262558, 296231, 223755, 166136, 134128, 98363, 83089, 122993, 147594, 112698, 70758, 101520, 67294, 62155, 80490, 148576, 206920, 250234, 213728, 185495, 190302, 139397, 71467, -30344, -72902, 11800, 19027, 13963, 5857, 36923, -5976, 18467, 34947, 14741, 14460, -73131, -71173, -61157, -76006, -71249, -37254, 55056, 68147, 49030, 126234, 97674, 18242, 21087, -27729, -73144, -55920, -9692, 10778, -28501, -75748, -51036]
9739e1036j1525L1614L617K3153j198q3795n9144q430L1152R1106O0434j4457
9727A1491n5497j5888L0893k7549L9760K4397l6519O793L4062M6872L1101L4790
9715A24706o7209m8682n0405k3365P11k0557O3469J52453l4357p0594O4388o3492
9703B7066n8341N5738n6549J9845K8671M2382p735M2170l0120q2566q7J6559o2891
9690f5858K0868L5044K4370J733J3534n9031k0170R2626Q2119q2987o7336j250
9678b6338L3249N511n5902P40q633J0355o822J8111M1296j4118l1679Q9372l2305
9665B2837n5613n7306M5149Q9393N4317O5816m4358j0624m4863J1879q8603K273
9653i703R2829J703L9323J08530R8345J67473J90539K80033L34568K58887K75542
$$ y = [-51036, -62561, -30947, -27330, -4177, -5375, -89170, -148314, -156744, -125592, -34486, 25948, 11491, -44006, -59894, -29001, -56550, -16790, 7607, -28912, -22119, 11943, 58815, 89916, 124706, 57497, 8815, -41590, -64955, -64244, -84801, -21332, 131121, 96764, 26170, 90558, 27066, -31275, 24463, -32086, -12241, 16430, 58812, 51077, 93247, 63127, -19439, -19526, -2967, -65858, -44990, -9946, 14424, 16157, 29691, -29340, -49510, 43116, 125235, 42248, -25088, -26338, 6911, 12422, -43480, -42740, -51373, -41018, -47840, -29729, 11567, -2551, -34230, 55142, 22837, -32776, -90082, -44933, 44460, 98777, 164593, 120235, 109611, 64748, 76627, -11976, -9703, 83126, 84829, 124152, 232682, 331027, 498500, 689039, 969072, 1303640, 1562527, 1838069]
9642A838069l4645l27104m43137k41194j82110k23529j42275l1432L7385n9820
9632A90208l9250k1940n4571J2680k660j6788M4096l8919K8974j1101O7057O0441
9620B18227N13m315J169J9172L613k7495j3128j00587m1824q3674L388P4409J2603
9607F2071r3695L605N6032L5093K737j9022L0818O173m1372m5750n3260L4564
9595b2006k6650J3673J881k307j2073l8393M3873M6399k3567J2273j2293l9565
9583e8755N4784o83n7990k9263L954r532j1146m629j8916Q0903L6634j06748P2121
9570d9266J39777J3108p4690o5721j9578N6061O8101n1497m3100J6858j1352r7596
9558a18895n551K8870n0694p0013K6758O6948n592O5724j477n3167o905J8327
$$ y = [1838069, 1803424, 1476320, 1033183, 791989, 609879, 386350, 244075, 212643, 250028, 190208, 150958, 129018, 74447, 87127, 84467, 67679, 111775, 72856, 101830, 90729, 157786, 218227, 218740, 214425, 215594, 234766, 238379, 210884, 197756, 97169, 55345, -28329, -24941, 49468, 62071, -31624, -28019, 28013, 63106, 65843, 46821, 77639, 83812, 42440, -3310, -56570, -22006, -48656, -34983, -33102, -35409, -47482, -85875, -42002, 4397, -19170, -6897, -19190, -58755, -3971, -4654, -62644, -91907, -87953, -97485, -108631, -113260, -132176, -51273, -14639, -121387, -49266, 90511, 103619, 28929, -36792, -56370, -309, 67792, 16295, -26805, -9947, -21299, -118895, -124446, -95576, -146270, -216283, -189525, -122577, -128169, -62445, -63922, -117089, -123994, -105667]
9546a05667j5635O0952L4421L8791N740p5140j20750p0032L0037L2711N4345K0204
9534a10023Q7824O086m0009j9784l3422N5903l6517k053R7227N3201p867l6507
9522A4059J1551Q3669J02431q967j17443k3851J5121l7138j06488J9501R0427
9511D2872o4O4541M547n3211K6361M2832k2226p4059j15160L3176K9796l4372
9499e4967J7666p2138J544K2839Q1011m057K0478Q561m2160p0574l033R4602J03381
9486A03153J0773L5377p7998K405M4168P0344l1533j19292p913J985m3527K3589
9474A1531J2698o6553M5896M5451j1935p9960m8036j103p320R302K2726K9150
9462c8153K7114j0823M135l563L5033O8920k9778q0518j4655J7711j2143m3591
$$ y = [-105667, -121302, -60350, -25929, 12862, 18602, -56538, -177288, -247320, -217283, -184572, -130227, -110023, -22199, -16113, -56122, -75906, -109328, -53425, -89942, -91995, 5232, 58433, 50566, 14059, 25610, 109279, 211710, 202743, 85300, 61449, 76570, 39432, -67056, -47555, 42872, 42808, 107349, 111896, 58685, 85046, 127878, 105652, 31593, -83567, -50391, -20595, -54967, -37301, -109439, -107895, -85056, -4045, -8102, 12376, 20937, -21223, -91797, -94830, -228, 103153, 113926, 149303, 71305, 73710, 117878, 188222, 156689, 37397, 29484, 31469, -12058, 11531, 24229, -42324, 3572, 49023, 37088, -42872, -90908, -92011, -99331, -90029, -67303, -38153, -11039, -21862, -17727, -21290, 13743, 82663, 52885, -27633, -42288, -24577, -36720, -80311]
9450h0311M9145N4963K3972M3098N1516o8083m0191l844l3847p3127J1327J7904
9438d7478m2209J8262O9876J6422M4020R124m9749r5262l6955m2728K473M6954
9426a07250L4036R188N1909l5973N9342J5624j8178j5221J81358Q9574j00110
9415A64299j24259m3577J03330j500r6038m967L1854K4266p9052p3784M7113J52783
9403A00468J22528n1712o5119p7480r0285o3432J147N1218J7304r9820k0710J2198
9391a63695j863K8531k8506R4370O6769p873j5595J358L0512P283Q9266J3018
9379A13575m0818o647j6460q2699k6531k677P1347l86K8071m1129j1704L5136
9367A9078o4836p6236Q325n341P8126R8861k2971o817o4694J7382N1533j4334
$$ y = [-80311, -31166, 23797, 47769, 90867, 142383, 74300, 34109, 30265, -3582, -76709, -65382, -47478, -89687, -71425, -1549, 14873, 58893, 68017, 18268, -76994, -113949, -156677, -154204, -107250, -73214, -64026, -12117, -48090, 11252, 26876, 8698, -6523, 174835, 264409, 164299, 40040, -3537, 99793, 98293, 2255, -2712, 29142, 53408, -25644, -99428, -52315, 100468, 222996, 171284, 106165, 28685, -61600, -125032, -123885, -72667, -55363, -155183, -175893, -163695, -165558, -137027, -165533, -71163, -4394, -12267, -27862, -26504, 4008, 11291, 100557, 113575, 72757, 66110, 49650, -33049, -59580, -62257, 9090, 8704, 36775, -4354, -16058, 19078, -45758, -121994, -113669, -119010, -40884, 57977, 35006, 28189, -36505, -19123, 32410, 18076]
9355A8076k0985K8044r2914J9087L1767P6403k8183o5679m7171K9691l3590j3398
9343i8852m059q8337K7631Q4528k949m3217m0795N3534J23309J09074j2053r2865
9331A4949m7571M0893N1553R2633R9964j25955p6146j8268j22409j14674j2524
9320b17555Q0240l8074n4333L1411J04527j2042k4986J4033Q1510O2404J2269
9309C9404o0188p0895O9582L1180O2147N7023k9696m6691k9854k6926n2337k5223
9297h2474r287n0026j9446L3099n3047k1470Q1515L8169K7237O0391N9600k8141
9285C6120j1439L6511K7743K2451J0346o8475k1829r146n7995o0238M4836J38624
9273H7509n1586n9416k4729J3039p2161o6009n4474P2566K8823N6212O8709l9642
$$ y = [18076, -2909, 25135, -67779, -48692, -16925, 59478, 31295, -34384, -81555, -51864, -85454, -98852, -102911, -191248, -163617, -79089, -82038, -125255, -166050, -112516, 10793, 119867, 107814, 14949, -32622, 8271, 59824, 152457, 252421, 126466, 50320, 32052, -90357, -205031, -217555, -137315, -175389, -229722, -198311, -93784, -105826, -130812, -116779, -35269, 27135, 39404, -20784, -91679, -22097, 9083, 71230, 128253, 98557, 51866, 22012, -4914, -57251, -82474, -91761, -141787, -161233, -128134, -181181, -202651, -121136, -82967, -55730, 4661, 64261, 36120, 24681, 61192, 88935, 111386, 121732, 53257, 31428, 22282, -35713, -95951, -51115, 87509, 35923, -23493, -48222, -35183, -107344, -173353, -227827, -155261, -126438, -70226, -1517, -41159]
9261d1159l2130R2085O8044j9888j268n7650J4945M3260j858m297n3470r9161
9249i2547j3447M7417M7495M8849K1256m695K462K1689M0359l0956m0243K3721
9237G1360q4470j0713P6112l5460O3634O484j27755q085J7277P718q5608k6856
9225a36362Q0937N9947J26014q0271q6082j8715K3866K7942J4873O5210M4121
9214A21480n0768q7998p648L0391J26583M993l9749q642J9844n9849m8721n1579
9202e1663L8600J2004k2420k3275j0174R6152R6420n9205m0509K9366j25851j09837
9190a70392Q9849N4472L5803p9174k5412M6345P945r614l6006M5167M4023L4152
9178C7158m9203K2325j4026K0280l4572j8136k4533l4280P9548j2086n6368K9183
$$ y = [-41159, -73289, 18796, 86840, 66952, 65684, 8034, 22979, 66239, 64381, 60084, 6614, -92547, -105994, -58577, -11082, 37767, 59023, 54328, 56790, 78479, 118838, 87882, 47639, 71360, -13110, -23823, 52289, 16829, 80463, 86947, -40808, -48893, -31616, -23898, -109506, -136362, -55425, 4522, 130536, 50265, -35817, -54532, -30666, -2724, 12149, 77359, 121480, 70712, -17286, -24934, 5457, 132040, 137033, 97284, 88642, 108486, 48637, -84, -51663, -13063, -1059, -23479, -46754, -56928, 39224, 135644, 76439, 35930, 65296, -60555, -170392, -80543, -26071, 9732, -69442, -94854, -48509, -40564, -50178, -86184, -41017, 3006, 37158, -12045, 10280, -3746, 16534, -18038, -36174, -60707, -94987, -15439, -27525, -83893, -54710]
9166e4710M1820P551N3935k6771J1661P0658J9677r1377q2865M198J08328k5123
9154C6982q6951J6708K5768k3161K4364m9660m4161r60Q1120R279o3725l9693
9142a14090l2811O3530N4187j6318q0478R3269O5370l2478r477N7466J06822m3930
9130A11062r8026M312L5015M5976l6462q3408o3993Q9656J5543r393j2337j3975
9118a6030j8826J5006M345J09549k4587j56264m3981J4707m1008l235Q4502L6180
9106c9642Q3377N6490j4862M768l7659q6718n9292Q5608O3982j0869j3886M2390
9094G3687l5560n7224N7278J575k7088R583L7210n9638j6449N300J10879J4088
9082A13641o4198m4504n5931J5177k0938j9666L2385N0554N2646l4966q5330Q000
$$ y = [-54710, -12890, -5339, 48596, 21825, 33486, 104144, 123821, 32444, -50421, -46223, 62105, 36982, -49969, -33261, -7493, -30654, -6290, -55950, -100111, -101071, -19951, -10672, -74397, -114090, -146901, -83371, -29184, -45502, -125980, -32711, 32659, 181, -9296, 48170, 154992, 111062, 13036, 17348, 52363, 98339, 61877, -21531, -85524, 4132, 19675, 10282, -2055, -16030, -34856, -19850, -15505, 94044, 69457, -86807, -130788, -116081, -157089, -160324, -75822, -39642, 43735, 100225, 85363, 90131, 52472, -34246, -93538, -7930, 56052, 45183, 31297, 73687, 38127, -19097, 38181, 39756, 12668, 22251, 59461, -177, -16626, -11326, 99553, 113641, 49443, 4939, -50992, -35815, -56753, -76419, -44034, 6520, 59166, 24200, -61130, -53130]
9070e3130J03391L578j2572l4574k7577K8585l7966n0925n7829J7164m1153O4621
9058i8387J32749N0155l9151p2340m7819j1439M7827n7312j09451j4616O5661
9047a54123R4219J02625O8582J1664O7072m4830p9402j178k4488j1105M144q5123
9035e1943l5377L4679R1930N8158m1076O1109j3618J2527m7351o1838n3516M1852
9023d464O6662J5298n589o5073K8146R6658K1927j4417j2894j9977O1829K3161
9011A91267k4377o5785j32050p7639J9657J5230o9859l1455J16085O2186m125
9000h65k328j9602m4019N0864k7412k0718n819J14076P2873p6214q605O5744M4093
8987A42068q2016j06862O520p250j3002K1464K2011J0480N1748l0915l6115k502
$$ y = [-53130, 50261, 53839, 41267, 6693, -20884, 7701, -30265, -81190, -139019, -121855, -163008, -98387, 34362, 84517, 45366, -26974, -74793, -86232, -38405, -95717, -205168, -219784, -154123, -59904, 42721, 111303, 122967, 190039, 145209, 65807, 64629, 40141, 29036, 33180, -51943, -87320, -52641, 39289, 97447, 56371, 117480, 103862, 116389, 69038, 7200, -46316, -4464, 62198, 77496, 71907, 6834, 34980, 131638, 153565, 139148, 126254, 106277, 168106, 191267, 166890, 101105, -30945, -108584, -88927, -73697, -143556, -175011, -58926, 3260, -865, -3193, -22795, -66814, -15950, -43362, -64080, -69899, 44177, 117050, 40836, 32231, 97975, 142068, 60052, -46810, -40290, -47540, -60542, -39078, -17067, -6587, 45161, 14246, -21869, -24371]
8975b4371K12m2935N7672j7989l5399J3434P2072J3710P3498N8899q3669p5879
8963I255m4972j3374r639J4772O711J2638l4800q25j5116j2391K958q781l0164
8950a23728K4148J1078l2120K95P9959O2711O317o0991p0562L6351m8749P223
8938a08068P5927j5460N0931P5512P2880j01891M5659J06290l503n1902k685o649
8926A37041M94L7916j22513j8626L3168m0339q5708m6925Q7385J4401N9531m8003
8914G822q099o5835J9392M1368p7003N3868O7862k2863K0284Q5271O6474k0614
8902A67927J063m637n7442j91282o3486j0624J0137M7160M5182K6873K6714O1295
8890E8880k7138j5952n8321r640j0717J351P7062Q611L9740l924n7521J2091L0153
$$ y = [-24371, -24159, -67094, -9422, -27411, -62810, -49376, 22696, 36406, 109904, 168803, 85134, 9255, -35717, -49091, -58730, -43958, -37247, -24609, -59409, -60234, -75350, -87741, -84783, -93564, -123728, -99580, -88502, -120622, -120327, -40368, 22343, 28660, -32331, -102893, -66542, -115291, -108068, -32141, -47601, 3330, 78842, 151722, 49831, 95490, 201780, 198277, 146375, 143690, 137041, 137535, 175451, 52938, 34312, 67480, 27141, -58567, -105492, -18107, -3706, 55825, 7822, -277, -66112, -46720, -5352, -82355, -28487, 39375, 16512, 36796, 122067, 188541, 167927, 168990, 164353, 106911, -84371, -147857, -158481, -148344, -101184, -56002, -29129, -2415, 58880, 31742, 15790, -42531, -52171, -62888, -61537, 15525, 24136, 63876, 59952, 2431, 14522, 44675]
8877D4675N284k3789l2578R3259J6973n5626k1878n2844j5503J8486R7520K5o4882
8864I122p9166p0483P5184N4831K5818J821L4224L9371k8890p1916o8778p3752
8852a52614L5784j5500o7696R799M7693N7767P3515P2026P9857l0283l6949k404
8840G0995l2467K486k7099n129L3156j210o6060J01519K1513o628l4906m7121
8828I049j9411M9988P7696L1464m7043p1642l3111n6059J5637O3558J8067k4837
8816A3356l3285K8228P8183R6996n9008o1435p2356j4175j03256m3148J51691
8805a8209O9848j3866o8361K2719N9046o473q7608m7801N7552L5828o9411n6652
8793a23388K9384M4190K5997L2141j8840q4298O2204O6620L2173N6429m0621r0248
$$ y = [44675, 49959, 26170, -6408, 86851, 103824, 48198, 26320, -26524, -42027, -23541, 73979, 74004, 9122, -70044, -140527, -65343, -10512, 15306, 17127, 51351, 90722, 61832, -10084, -78862, -152614, -116830, -132330, -200026, -190227, -142534, -84767, -11252, 60774, 140631, 110348, 73399, 70995, 38528, 41014, 13915, 8786, 41942, 40732, -25328, 76191, 97704, 91076, 56170, 9049, -10362, 39626, 117322, 148786, 101743, 30101, -3010, -59069, -43432, 20126, 38193, 13356, -19929, 8299, 86482, 183478, 124470, 63035, -9321, -23496, -126752, -169900, -18209, 51639, 37773, -30588, -7869, 51177, 44704, -42904, -90705, -33153, 2675, -66736, -123388, -94004, -49814, -23817, 8324, -10516, -94814, -32610, 34010, 66183, 122612, 81991, -8257]
8781h257K812o7305k9017Q6673J23354m2913r7494J9671j3597L8290j2255k207
8769b245J8216m3332k7442n62J9610r036k3215l1087q951N8410N5973M6523j7810
8756C5052m6239K0951L7175L3222M337n6735o7656J21487Q8991j03498o6717J2238
8744A2608m2808o4346P7823J6316K2152L7108K4128q2512j16416L0947P6187N3207
8732D4394l3905j5185j9248q223J8183m50k2177n898J734J0111k9282J5856O2243
8719A8153M8044Q0213P2038J3530p9030o7408q5993Q541N1741J4578J38m5979
8707B8566M8697M9531O5956m251k4374j307Q588q4936j12945o9566K7614j159
8695f9586j7614K6127l647N9768L7951m7311K255P025m9435J6482J16971K5411
$$ y = [-8257, -5445, -72750, -101767, -15094, 108260, 65347, -32147, -12476, -26073, 12217, -38, -2245, 15971, -27361, -54803, -55365, -35755, -44791, -68006, -99093, -108044, -49634, 6339, 52862, 35052, -11187, 9764, 46939, 80161, 84498, 27763, -39893, 81594, 170585, 67087, 370, 12608, -30200, -94546, -16723, -407, 21745, 58853, 82981, 469, -115947, -85000, -8813, 44394, 10489, -4696, -23944, -32167, -13984, -14434, -36611, -42509, -40775, -30664, -59946, -44090, 18153, 66197, 146410, 218448, 231978, 152948, 85540, -453, 8088, 59829, 74407, 74545, 28566, 77263, 126794, 192750, 188499, 164125, 162818, 171406, 86470, -26475, -96041, -68427, -69586, -87200, -61073, -64720, -4952, 32999, -14312, -12057, -5032, -54467, -37985, 78986, 104397]
8683A04397j11845J0841k4690L0015K9188K3043M673M94J6825J01955q7430n8463
8671C9003l7281j567M9966m0082N0464O058j9387n2267l8087J5924n1055K1626
8659e6685j4482p2500Q1112L0932p0126n6137K5710P3800Q596j1644N903N9230
8647C709O9711p6497q5933O2940J32695j00115n5555K1074K558j1928j0168k1576
8635f9085N9945M3014Q455R5201j3909o0635R0986o3358n0798m9713q3314r244
8623a02455J8418J17036j7055K852J5528l3198k0678j0003P4190m1803j8140O29
8611a4679N6207L0514m2262L3048k2496r582k2589j0271N1639L9238j19442N6737
8599B6062Q9894q9783J7708N5643q4055l8841J2339k086J8672Q3571P4838q6063
$$ y = [104397, -7448, 3393, -21297, 8718, 37906, 60949, 65622, 66116, 82941, 184896, 97466, 39003, 1722, 155, 50121, 10039, 60503, 66561, 47174, -5093, -43180, -27256, -78311, -56685, -71167, -143667, -62555, -31623, -101749, -157886, -132176, -58376, -49780, -61424, -55521, 3709, 73420, -3077, -89010, -26070, 106625, 6510, -49045, -27971, -25413, -37341, -47509, -69085, -9140, 33874, 42329, 137530, 123621, 62986, 153972, 90614, 39816, -9897, -93211, -102455, -84037, 32999, 15944, 18796, 34324, 1126, -19552, -29555, 44635, 2832, -15308, -14679, 41528, 72042, 29780, 62828, 40332, 30750, 8161, -2110, 49529, 88767, -30675, 26062, 115956, 26173, 43881, 99524, 15469, -23372, -11033, -13119, 5553, 89124, 163962, 77899]
8587G7899j01352J9765J8921k8112N4166Q417j067k1822K950K1770o8360p80N3158
8574C5553R944Q824J04665j4279o0862k5576n3080l290P5003o0403j4986O1060
8562F2573o468N798o877j9253O9386r902j00487J2074N5046k120l8510J909N2457
8549G5626P3197l715j00275l8786m4444j27382L4444K6479J6119M8068q4828j8270
8537a43767P6796l2545n6242l372J1580Q7960R6796m3519k8736J4827n5118m9934
8525a25274l0947K5437P9035J45836J0544j4924k3346j984p3159l2254k9186Q372
8513f1850K980P833l7652m0677N9672L9824o762N4835O6238k7795n5232m6416
8501d5002J4422K3060p3945n10Q5088j5684k3889m0845J11871Q5765m0466r4090
$$ y = [77899, -23453, -3688, 15233, -12879, 41287, 49704, 48637, 26815, 29765, 51535, -16825, -17605, 35553, 45497, 54321, 158986, 144707, 83845, 58269, 5189, 1899, 76902, 16499, 1513, 62573, 56105, 61903, 55026, 35773, 105159, 95257, -5230, 6844, 61890, 59770, 21260, 23169, 75626, 148823, 145108, 44833, 6047, -38397, -165779, -131335, -104856, -88737, -40669, -125497, -143767, -66971, -99516, -155758, -159130, -147550, -59590, 37206, -6313, -35049, -20222, -75340, -125274, -156221, -130784, -51749, 94087, 104631, 89707, 66361, 64377, -8782, -41036, -70222, -61850, -58870, -51037, -88689, -129366, -69694, -29870, -36632, 18203, 84441, 56646, 1414, -45002, -30580, -7520, -81465, -81975, 3113, -12571, -36460, -77305, 34566, 120331, 79865, -14225]
8489a4225k1334J7830l0603m6197J01795Q193J7603m1322p0035M1995O3289J4869
8477D1858j17n693L0508j34205r7609J6727O0993O9501K4973l3380o8518l0253
8465a25215M2311J39335k1834j2401R925K9193l8865n131p4373o0834N625l0911
8453a43175j0465j5837M3427R5693K902P5788J3931m8216m7489O2144J5616m7824
8441c505o6239j130J03083J644M1638N1379o5753o9346N9886M205o1255K0684
8429A5291l0107N1361j9755Q004j5895o3338k3101L9254N1652m721P6075r1754
8417g034k4596o5660J011M1412O2467l4234m7841p809L8719K6913N6635j7050
8405B2933L5673j38825j11985R2524R5699o231j4365J3914j0012m035M1387l204
$$ y = [-14225, -35559, -17729, -48332, -94529, 7266, 15459, 33062, -8260, -78295, -36300, 26989, 41858, 41741, 36048, 66556, -67649, -165258, -148531, -87538, -18037, 6936, -26444, -94962, -125215, -82904, 56431, 34597, 22196, 32121, 61314, 22449, 17318, -57055, -117889, -112264, -143175, -153640, -169477, -126050, -30357, -27455, 48333, 62264, 14048, -33441, 28703, 44319, -3505, -69744, -70874, 32209, 33853, 75491, 126870, 61117, -8229, 51657, 55862, -5393, 15291, -14816, 36545, 16790, 24794, 8899, -54439, -77540, -38286, 13366, 8645, 84720, -7034, -31630, -97290, -96279, -54867, 7600, -26634, -74475, -82284, -43565, -16652, 39983, 22933, 58606, -80219, -192204, -99680, -3981, -10212, -24577, -10663, -20675, -24710, 16677, 13473]
8393A3473J14472P7350q6815j36488p1802j0589J48441l5030p6226J667j3126
8382g4673P845j8746n368J126P4126N0686j05546K4643k4150q1640N4014J00327
8370B644L0764j6825n5191L6812J02825L6512j4634p5640l077q900L6028K3365
8358I4683l2076p1996l4462M0350l0126K7107L0540J7560j1148l4170k2709N4831
8346B8384P0832k0865L1847k0645j6278o6383R105j3561q0778L5155K7243K4779
8334H835n4112j12613k2000O7422R3905R1944n9574p408l1170j3309P6726j9713
8322A8933j114M3459K3761j03173p2230M9757R2277j7342n0702l1161o962o0701
8310a15198M8731N3989M4768n3300l7739n4354L3367k7934p0143L4399R3037J10460
$$ y = [13473, 127945, 205295, 118480, -18008, -89810, -100399, 48042, 13012, -63214, -61547, -74673, -66828, -85574, -90942, -89816, -15690, 34996, -70550, -45907, -70057, -151697, -97683, 2644, 33408, 16583, -38608, -1796, 101029, 137541, 122907, 47267, 44190, 35290, 71318, 94683, 62607, -9389, -43851, -3501, -33627, -6520, 24020, 41580, 30432, -3738, -26447, 28384, 99216, 78351, 110198, 89553, 73275, 6892, 15997, 2436, -78342, -43187, -15944, 8835, -45277, -157890, -179890, -112468, -18563, 73381, 13807, 6399, -24771, -38080, 38646, 18933, 17819, 61278, 85039, -18134, -90364, -40607, 51670, 34328, -16374, -47535, -54497, -115198, -66467, -12478, 32290, -21010, -58749, -113103, -79736, -107670, -177813, -143414, -50377, 60083]
8298F0083M344q7989J0684k2388N0352M1414o1457k4581n6968j7933j2320M2493
8286g4266J40559k832j6710k2659O2376J5045o2592k4647K7124K451k6681l1065
8274a3897P8177N6854J31899q3070j36947q3672j2616m6930q136O1621K6139L4522
8262C944P1107O8326p2172k7327P371m2634K2960L0704K0969L1393j08020j53751
8250a47130J1605J2301m2806p3656J43549J20969m6204Q7266k0049q5024L0866
8239h313O7241o5896k7126K3029J1811k1926o011k690L4318K5036J3912K1217
8227F4602L1690J4539m660j50004r9360q460O1566l3260O6672J00465O6588p4143
8215C6235j7407Q5052O9013n6792o1229P188l2683O8501N8253n9283J398l5525
$$ y = [60083, 64427, -23562, -12878, -35266, 15086, 56500, -4957, -29538, -86506, -104439, -116759, -74266, 66293, 63461, 46751, 24092, 86468, 101513, 38921, 14274, 41398, 43849, 17168, -13897, 64280, 121134, 253033, 169963, 33016, -50656, -63272, -110202, -118338, -56717, -30578, 3944, 75051, 143377, 71205, 43878, 51249, 8615, 31575, 62279, 83248, 114641, 6621, -147130, -135525, -123224, -166030, -239686, -96137, 24832, -21372, 65894, 45845, -39179, -8313, 58928, -6968, -34094, -11065, 746, -21180, -27191, -29881, 4437, 29473, 43385, 64602, 96292, 110831, 106171, -43833, -143193, -151653, -90087, -123347, -56675, 43790, 110378, 36235, 18828, 103880, 172893, 116101, 54872, 62060, 29377, 97878, 156131, 96848, 98246, 62721]
8203F2721m6987k63m829l3914Q087m3182k2328L9510J47024J5989k2236m2426
8191E7166l6498l0789L5649O8564l9431Q225j5092J626q4151L1491Q2825N5296
8179A34881m4625r2732l3957N5736j1640o5362l4317N8604O1952j4328k6452j673
8167a3913k4658k4708j8752Q2584R5831K1316k2587r8345j76850m9305L9885N8234
8155a31268P4968L4906P060q7475o3025K9550l7753L0261N9034J1514o0789p565
8143a40582J08030N8810m4228p233k3692m7084J5940n41p6030N9553l83k9204
8131a26644J174O8180K3837N985n3268n866P1955k3293k1921k9019J6869k7173
8119i9184M6198P4358Q7668o056k7800r7627N4215J04831R91o0895j35284m4948
$$ y = [62721, 15734, 15471, 10642, -23272, -15185, -58367, -80695, -41185, 105839, 121828, 99592, 57166, 20668, -10121, 25528, 94092, 54661, 62886, 47794, 49420, -34731, -3240, 79585, 134881, 90256, -2476, -36433, 19303, 7663, -57699, -92016, -33412, 28540, 14212, -12240, -13913, -38571, -63279, -82031, 553, 96384, 117700, 95113, -3232, -180082, -229387, -189502, -131268, -56300, -21394, -14334, -101809, -164834, -135284, -173037, -142776, -83742, -72228, -133017, -140582, -32552, 26258, -17970, -25203, -48895, -95979, -80039, -80580, -156610, -97057, -97440, -126644, -125470, -57290, -33453, -27468, -80736, -86602, -14647, -37940, -59861, -88880, -72011, -99184, -52986, 21372, 109040, 102984, 75184, -22443, 31772, 136603, 137594, 76699, -58585, -103533]
8107a03533O0707P285M2581q863L5138l8449L4771j4196j0380o583k9889l2675
8095f4086m4702k6161P5828L3222j2695R4803O4977j06907o8456k9098K4614l7724
8083i6385l0548k1945K1034K0321O4983M2955n0658M2362Q9677o5122m3496N9934
8071C3112O3476o3604j7899Q2977l2669O0228j9710o0158p6963J01722Q5923O482
8059A62917j32714o6646L8554l6200K8179R346l241N4923J8690o7432J2333l2389
8047a3680j2221j7876K2861K8469l489J3146n6692o5686L9250M1908N8793O3574
8035I8357m3278j03696n6854O0555j5352m2511J5315M1030L5260j6607K712N6803
8023C1734J19265k8020m8019K0962L2526n4495k1138O6530p019p7031L0998Q689
$$ y = [-103533, -42826, -35541, 7040, -1823, 33315, -5134, 29637, 15441, 5061, -1522, -31411, -64086, -108788, -134949, -59121, -25899, -38594, 56209, 121186, 14279, -54177, -83275, -58661, -96385, -126933, -148878, -127844, -107523, -42540, 415, -50243, -7881, 81796, 16674, -26822, 33112, 96588, 32984, 15085, 98062, 65393, 125621, 105911, 45753, -31210, 70512, 156435, 162917, 30203, -36443, 2111, -34089, -5910, 3436, 195, 55118, 73808, 6376, 18709, -13680, -25901, -43777, -20916, 7553, 4064, 17210, -39482, -105168, -65918, -24010, 34783, 98357, 55079, -48617, -105471, -44916, -60268, -102779, -87464, -46434, -11174, -27781, -25069, 31734, 150999, 122979, 74960, 95922, 128448, 73953, 52815, 119345, 112326, 35295, 66293, 74982]
8011G4982m6399n0091R5741j0420j34534j0214L9705O8772n4923l4096L5356K6809
7999F88k7714K3842l6874k0096j8109j940L607K7305j2949O4262N4773j5952q5024
7986d4181O2944O604n2936O7519M3382N647o3901r6828n0288N8577K8045N9483
7974B4067J418j01475j31827k7862O7707Q1101J08322L2858p1823l5750L3097
7963b0167Q5529j8568K7817J0623r9866l2871J13629N7521p4798o5094O4328M4632
7951I2715k1981k7623m2432k1890l7391R562n532J8700k8908j0444K2856J4014
7939c8354L9774j0759k3261P0413R6741r187O3867j27113r6465J0026k6257n2527
7927a03102J6853J03200K1152n0421o9675Q6382N3988n3549Q480M1832j5305L0864
$$ y = [74982, 28583, -21508, 74233, 63813, -70721, -80935, -41230, 27542, -27381, -61477, -26121, 688, -27026, -3184, -40058, -60154, -78263, -80203, -76596, -49291, -62240, 2022, 56795, 40843, -44181, 18763, 25367, -27569, 39950, 83332, 88979, 25078, -71750, -122038, -63461, -35416, 24067, 25485, -75990, -207817, -235679, -167972, -86871, 21451, 54309, -17514, -53264, -20167, 65362, 46794, 74611, 85234, -14632, -47503, 66126, 123647, 48849, -16245, 48083, 92715, 70734, 43111, 679, -21211, -58602, -49040, -54572, -35872, -64780, -75224, -52368, -38354, 1420, -9339, -32600, 37813, 134554, 125367, 189234, 62121, -34344, -24318, -50575, -103102, -86249, 16951, 38103, -12318, -81993, 4389, 58377, 4828, 13308, 55140, 39835, 70699]
7915G0699k4809k7228o2421q5460n0943j7516Q7187N8202l3371M7194K968N5351
7903A9853J13133n0443j05116m4452r4502j3763J7007M8909J63450J13207M1608
7892B08891k4973j15371j01761O3580K1655J2420k1298k2665k0374j8065O2640
7881D4679J7844p7412m6520n3922M9967O8763L491N474L3283L3970K0164p2820
7869B6961m3192R788J1151o7537k1949n9612N9847Q0452l1418o2724k362N6632
7857d3963K8355j3502j8816k1228n5820j8859P8607N2560k4831j7459L7963L9193
7845B2200k2127P0682j4539j9534n050j2769m7912m3594l7462j2055R1091M2655
7833A1586N0386L8695n1642p2818J7329r466P95k1790j7768n874k526m1599K3705
$$ y = [70699, 45890, 18662, -43759, -129219, -180162, -197678, -110491, -52289, -85660, -38466, -35498, 19853, 132986, 82543, -22573, -67025, -161527, -175290, -158283, -109374, 54076, 167283, 208891, 183918, 68547, -33214, 30366, 52021, 64441, 43143, 20478, 104, -17961, 44679, 62523, -14889, -61409, -115331, -65364, 3399, 6890, 12364, 45647, 79617, 99781, 26961, -16231, -6443, 4708, -62829, -84778, -144390, -84543, -4091, -35509, -98233, -100595, -43963, -15608, -29110, -47926, -69154, -124974, -143833, -65226, -12666, -37497, -54956, -16993, 22200, 73, 70755, 56216, 36682, 31632, 18863, -29049, -72643, -110105, -122160, -31069, 11586, 61972, 100667, 49025, -23793, -6464, -15930, -15135, -36925, -54693, -60567, -63093, -104692, -80987]
7820h0987j2407K8286r296L3120O8631L9751n5546j7637L6528L3797j6571q8745
7808d1076m1222m997J29632N8429j13485J2982L7936J4903j1925K0819r4411L3757
7796A342N3353L3372n1836j8832k4193l5629N1566J08879k3857m5686j02478k8370
7784h2369O9694J11716L8469p2577o8049J9658J3586O9830J8483J1005K0048j17154
7772C2340j12160o4481N0772K5749k0558q562m70M5221M5861M7998N1960J3761
7760A07431j1n1839q5409n9567k7326l6326n2380O3858L8589P3934J5172n0423
7748f4297J31020J00545m9977p3046K0557L9644j1790p1925q5613N9305J463m4486
7736d8600m5069M156K2491j06046R046O6627o393k3335N2035P5530p1137o6048
$$ y = [-80987, -93394, -65108, -74404, -41284, 27347, 67098, 11552, -6085, 30443, 64240, 47669, -41076, -82298, -87295, 42337, 100766, -12719, 263, 38199, 53102, 41177, 61996, -32415, 1342, 54695, 88067, 36231, 17399, -6794, -42423, 9143, 118022, 94165, 48479, -53999, -82369, -12675, 99041, 137510, 64933, -3116, 16542, 30128, 99958, 118441, 129446, 149494, 32340, -79820, -144301, -93529, -67780, -88338, -96900, -97370, -52149, -6288, 41710, 93670, 107431, 107420, 55581, -29828, -89395, -116721, -153047, -205427, -141569, -102980, -29046, -13874, -64297, 66723, 167268, 117291, 44245, 64802, 104446, 92656, 20731, -64882, -5577, -4114, -48600, -93669, -89513, -67022, -173068, -164022, -97395, -103788, -127123, -75088, 442, -70695, -136743]
7724a36743J13105J42687n859N6707l2106n0847j09j937j289J1840m3561r721
7712D2167n1919k3582j6624L0175N5281L8120R3935k1283n4713o4567q346J2925
7700C1569q251p4512N4038l0062M794L5898p615n3497j7346j3624N6922K2031
7688C45l8946j6588l2390L2282n0861m9717L0496J28803J0814j28550k7030P9010
7676f2332K2768O1667l3656o5245M2800j8740l9831o8436p748p469k6228l6490
7664b38940L1698N0715Q7284L5340Q561Q246P9969k8772o2616P1875L799o8640
7652b1481l1826N662J6888M5544O0058o5989j3296J9955n4314p0611j5061J4348
7640a10123m147N8707K4184k3188L4334n9779Q4899J12999p7174J8906J8337k2607
$$ y = [-136743, -23638, 119049, 113190, 169897, 137791, 86944, 86835, 84898, 83609, 95449, 51888, 42167, -9752, -33334, -49958, -19783, 35498, 73618, 167553, 146270, 91557, 26990, 18644, 31569, 23318, -51194, 2844, -27218, -22424, 13474, 5859, -47638, -64984, -78608, -21686, 345, -38601, -55189, -87579, -55297, -106158, -155875, -125379, 3424, 14238, -114312, -141342, -62332, -39564, 22103, -11553, -76798, -33998, -52738, -92569, -161005, -168753, -176222, -202450, -238940, -207242, -156527, -69243, -33903, -25342, -17096, 62873, 34101, -28515, 43360, 47159, -21481, -53307, -47645, -30757, 14787, 74845, 8856, -4440, 15515, -38799, -109410, -124471, -110123, -114270, -55563, -31379, -54567, -20233, -80012, 4887, 117886, 40712, 59618, 77955, 55348]
7628E5348l4537N8482m1328q1143J3504M1844n1217j0136O5122L4250k8151q8317
7616f6279q0291K6720M7499k0277R6703l7961j5114Q9221Q008N7449R471j4667
7604A00482k1754M0536j4314q8389j01401j8893k7866J7416J8306K1675m228O0976
7592a7454K0777J8403L3712J7303n570m8730m4745j9508n768K4151J8136O3102
7580E3809P3177M8641j6528q4104j07867m9370r2908J6673J39515R0582l4856
7569C6764n0612p981L3094J07522k1942j09226n8784O7808L5327m0091l4403Q7261
7557D4737J6977n7909j18962l0453J08405M6736O820M417l8491k7975q039J8959
7545c4778l0142p3075q0381L7148P2473K1639j6835m9130P5387N0764J8016K2983
$$ y = [55348, 20811, 79293, 37965, -43178, -29674, 12170, -39047, -49183, 15939, 50189, 22038, -66279, -146570, -119850, -72351, -92628, 4075, -33886, -49000, 40221, 48229, 105678, 115149, 100482, 78728, 119264, 104950, 16561, -84840, -103733, -131599, -114183, -95877, -74202, -78430, -17454, 3323, 21726, 55438, 72741, 67171, 18441, -26304, -45812, -51580, -27429, -9293, 53809, 126986, 175627, 159099, 74995, -32872, -82242, -175150, -158477, -18962, 71620, 36764, -13848, -21829, 11265, 118787, 96845, -12381, -71165, -3357, 31970, -8121, -42524, 44737, 61714, 3805, -115157, -145610, -37205, 9531, 16351, 20768, -17723, -45698, -53737, -34778, -64920, -137995, -218376, -181228, -108755, -87116, -103951, -153081, -77694, -26930, -8914, 14069]
7533A4069j7995M624M101m4317k0732K7476q565J7005O1027P304O0923p948j54785
7520e7813m0188N6434j0057J6947k265m6481l8666O2183J05697J5052n4040j227
7508E576K5971M6561j18268p4898p370M4046j4522L4618m3678p744R0581J5677
7496c450k123M0071J08018Q866p4544k3784r224j24876K5386J03238K0686O490
7484G4754o820n5462l2168L9631o888J7651n0556r7908J4786j5681J990K8178
7472h8493K4625J5699J1511O130N2200L2285m6891L3006l0649k0944L1216n676
7460A4019l9131J8923o6417m8318m2157P6447J59842M380n8744k8654k4364M7904
7448A3730N1838M7669j3676o3335j35169o8887L4799J04363Q064J7312K6565n9847
$$ y = [14069, -3926, 698, 4799, -39518, -60250, -32774, -41339, -24334, 36693, 43997, 104920, 96972, -57813, -98001, -41567, -51624, -34677, -36942, -83423, -122089, -59906, 45791, 60843, 6803, 5576, 31547, 78108, -40160, -115058, -122428, -78382, -92904, -58286, -101964, -109708, -19127, -3450, -5573, 34498, 142516, 151382, 76838, 53054, 43830, -81046, -55660, 47578, 68264, 74754, 67934, 12472, -19696, 19935, 13047, 30698, -19858, -117766, -102980, -118661, -116671, -88493, -63868, -48169, -36658, -30528, 21672, 53957, 7066, 40072, 9423, -11521, 19695, 14019, -25112, -6189, -72606, -120924, -163081, -86634, 73208, 77588, 18844, -9810, -34174, 13730, 65568, 113237, 99561, 36226, -98943, -167830, -133031, -28668, -20604, -3292, 23273, -36574]
7436c6574K9702J35436K2500L8496j17701j32979j4565m8311J7501O2443Q7033
7425D2981M3207J6672j17950O3008J16719p2334j36895k38O7881L8469o8864p800
7413a5144K9531n0764K6329q264n9119m7240M487L8919l6970L1186O3486K8043
7401D480j2892j1327K5456L1819J0036J5719O706k3743o1499L2787Q1947J7327
7389A16816q5199m3665M4734q945M5784J5941K3040j09463n1704l9711j2615m6425
7377a51412J2814J14169M8478j6000N9618j0413l4596k4903l0127m3654K5143
7366e0883K194K3741j5707l7838L7231J19407M7216l309m9552J9804m0736o3585
7354a2017R548o0942q3369L2345O4998M016L0881K7256p0735m235M648R3156J02967
$$ y = [-36574, -6872, 128564, 151064, 189560, 71859, -61120, -75685, -123996, -106495, -44052, 42981, 86188, 102860, -15090, 47918, 164637, 92303, -44592, -44830, 23051, 61520, -7344, -15144, 14387, -36377, -10048, -18312, -77431, -124671, -120184, -81265, -118235, -87049, -23563, 4480, -8412, -19739, 5717, 37536, 47572, 63291, 69997, 46254, -15245, 17542, 99489, 116816, 31617, -12048, 32686, 23741, 69525, 85466, 108506, -957, -52661, -92372, -104987, -151412, -138598, -24429, 24049, 8049, 67667, 57254, 22658, -2245, -32372, -76026, -50883, -48689, -24948, -40655, -78493, -41262, 78145, 125361, 122052, 72500, 92304, 51568, -12017, -2469, -63411, -146780, -114435, -49437, -45421, -14540, 12716, -58019, -62254, -57606, 35550, 138517]
7341A38517k6573o5382J0982O6159M1499l6924r1874o2190L2073K9837Q4478j1274
7329A09328m6116m9306n7857n8498k4179m5445N0262o548J23968R768L8953k4143
7317B0187k6720M6911o9070L1289K0585o4339M3759P1060M5554n2064m2224r9737
7305g4809k5661Q3048K7983N3672P9021K5323r3271j6612n0729j03960l0652P3674
7293e2973J07768P570J4115m5906l8757k3512l7544P326J1319l5277K0382j1230
7281g6719O1411M1677j8555l5175K7754L6655j9050p617J2309L9811n7987o3065
$$ y = [138517, 111944, 46562, 57544, 123703, 165202, 128278, 36404, -25786, 6287, 36124, 120602, 109328, 63212, 13906, -43951, -102449, -126628, -172073, -121811, -128359, -4391, 5377, 44330, 20187, -6533, 40378, -28692, 2597, 23182, -41157, 2602, 73662, 119216, 67152, 24928, -74809, -100470, -17422, 10561, 64233, 143254, 168577, 75306, 58694, 7965, -95995, -126647, -52973, 54795, 62365, 76480, 30574, -8183, -31695, -69239, -61913, -50594, -85871, -65489, -76719, -15308, 26369, 7814, -27361, 393, 37048, 17998, 10381, 22690, 62501, 4514, -58551]
$$ [...]
##END NTUPLES=NMR SPECTRUM
##END=
