##TITLE=Analysis number 315367
Compound Code cd 04371
Project Code adrs
Chemist Name fudan
##JCAMPDX= 6.0         $$ Bruker NMR JCAMP-DX V2.0
##DATA TYPE= NMR SPECTRUM
##DATA CLASS= NTUPLES
##ORIGIN= Bruker BioSpin GmbH
##OWNER= NMR
$$ XWIN-NMR		Version 3.5
$$ Wed Nov 16 15:13:18 2005 GMT Standard Time (UT+0h)  MAYBRIDGE\NMR@NMR_250MHZ
##.OBSERVE FREQUENCY= 250.131544655141
##.OBSERVE NUCLEUS= ^1H
##.ACQUISITION MODE= SIMULTANEOUS (DQD)
##.ACQUISITION SCHEME= undefined
##.AVERAGES= 16
##.DIGITISER RES= 18
##SPECTROMETER/DATA SYSTEM= dpx250
##.PULSE SEQUENCE= zg30
##.SOLVENT NAME= CDCl3
##.SHIFT REFERENCE= (INTERNAL, CDCl3, 0, 16.522)
##AUDIT TRAIL= $$ (NUMBER, WHEN, WHO, WHERE, WHAT)
$$ ##TITLE= Audit trail, XWIN-NMR		Version 3.5
$$ ##JCAMPDX= 5.01
$$ ##ORIGIN= Bruker BioSpin GmbH
$$ ##OWNER= NMR
$$ C:\u/data/dgb/nmr/ADRS/12500/pdata/1/auditp.txt
$$ ##AUDIT TRAIL=  $$ (NUMBER, WHEN, WHO, WHERE, WHAT)
(   1,<2005-11-16 15:12:58.07 +000>,<MAYBRIDGE\NMR>,<NMR_250MHZ>,
      <created by zg, POWCHK disabled, PULCHK disabled
       configuration hash MD5:
       62 19 C7 07 E1 42 D1 B7 37 6C 3D D0 77 39 F9 E6
       data hash MD5: 64K
       B6 52 C5 12 A2 CC D8 90 00 34 18 F9 24 69 81 A5>)
(   2,<2005-11-16 15:13:09.23 +000>,<MAYBRIDGE\NMR>,<NMR_250MHZ>,
      <Start of raw data processing
       ef LB = 0.3 FT_mod = 6 PKNL = 1 SI = 32K 
       data hash MD5: 32K
       38 61 E6 DC 19 33 CC 72 B0 97 80 A0 4A F2 A9 5A>)
(   3,<2005-11-16 15:13:11.06 +000>,<MAYBRIDGE\NMR>,<NMR_250MHZ>,
      <apk 
       data hash MD5: 32K
       CF FA 05 62 3D D0 E8 74 E0 FE FF 70 9B 9D 59 6B>)
(   4,<2005-11-16 15:13:11.79 +000>,<MAYBRIDGE\NMR>,<NMR_250MHZ>,
      <abs ABSG = 5 
       data hash MD5: 32K
       4C 16 09 13 A7 15 33 7F 24 27 00 A4 A1 18 05 C8>)
$$ ##END=
$$ 
$$ hash MD5
$$ 59 A8 6E 22 FA 1A 1D 7E 66 1F 8E 6B B1 0B D0 73
##$RELAX= 
##$RELAX= 
##$RELAX= 
##$RELAX= 
##$RELAX= 
##$RELAX= 
##$RELAX= 
$$ Bruker specific parameters
$$ --------------------------
##$DU= <C:\u>
##$EXPNO= 12500
##$NAME= <ADRS>
##$PROCNO= 1
##$TYPE= <nmr>
##$USER= <dgb>
##$AMP= (0..31)
100 100 100 100 100 100 100 100 100 100 100 100 100 100 100 100 100 100 
100 100 100 100 100 100 100 100 100 100 100 100 100 100 
##$AQSEQ= 0
##$AQ_mod= 3
##$AUNM= <au_zg>
##$AUTOPOS= <42 >
##$BF1= 250.13
##$BF2= 250.13
##$BF3= 250.13
##$BF4= 250.13
##$BF5= 500.13
##$BF6= 500.13
##$BF7= 500.13
##$BF8= 500.13
##$BYTORDA= 1
##$CFDGTYP= 0
##$CFRGTYP= 5
##$CHEMSTR= <none>
##$CNST= (0..31)
1 1 145 1 1 1 1 1 1 1 1 1 1 1 1 1 1 1 1 1 1 1 1 1 1 1 1 1 1 1 1 1 
##$CPDPRG= <>
##$CPDPRG1= <>
##$CPDPRG2= <>
##$CPDPRG3= <>
##$CPDPRG4= <mlev>
##$CPDPRG5= <mlev>
##$CPDPRG6= <mlev>
##$CPDPRG7= <mlev>
##$CPDPRG8= <mlev>
##$CPDPRGB= <>
##$CPDPRGT= <>
##$D= (0..31)
0 1 0 0 0 0 0 0 0 0.06 0 0 0 0 0 0 0.0002 0 0 0 0 0 0 0 0 0 0 0 0 0 0 
0 
##$DATE= 1132153977
##$DBL= (0..7)
120 120 120 120 120 120 120 120 
##$DBP= (0..7)
150 150 150 150 150 150 150 150 
##$DBP07= 0
##$DBPNAM0= <>
##$DBPNAM1= <>
##$DBPNAM2= <>
$$ [...]
##$SUBNAM7= <"">
##$SUBNAM8= <"">
##$SUBNAM9= <"">
##$SW= 20.6930455092707
##$SWIBOX= (0..15)
0 0 3 0 0 0 0 0 0 0 0 0 0 0 0 0 
##$SW_h= 5175.983436853
##$TD= 65536
##$TD0= 1
##$TE= 295.16
##$TE2= 300
##$TE3= 300
##$TEG= 300
##$TL= (0..7)
0 120 120 120 120 120 120 120 
##$TP= (0..7)
150 150 150 150 150 150 150 150 
##$TP07= 0
##$TPNAME0= <>
##$TPNAME1= <>
##$TPNAME2= <>
##$TPNAME3= <>
##$TPNAME4= <>
##$TPNAME5= <>
##$TPNAME6= <>
##$TPNAME7= <>
##$TPOAL= (0..7)
0.5 0.5 0.5 0.5 0.5 0.5 0.5 0.5 
##$TPOFFS= (0..7)
0 0 0 0 0 0 0 0 
##$TUNHIN= 0
##$TUNHOUT= 0
##$TUNXOUT= 0
##$USERA1= <user>
##$USERA2= <user>
##$USERA3= <user>
##$USERA4= <user>
##$USERA5= <user>
##$V9= 5
##$VALIST= <valist>
##$VCLIST= <CCCCCCCCCCCCCCC>
##$VD= 0
##$VDLIST= <DDDDDDDDDDDDDDD>
##$VPLIST= <PPPPPPPPPPPPPPP>
##$VTLIST= <TTTTTTTTTTTTTTT>
##$WBST= 1024
##$WBSW= 4
##$XGAIN= (0..3)
0 0 0 0 
##$XL= 0
##$YL= 0
##$YMAX_a= 360843
##$YMIN_a= -286591
##$ZGOPTNS= <>
##$ZL1= 120
##$ZL2= 120
##$ZL3= 120
##$ZL4= 120
##$ABSF1= 16.522
##$ABSF2= -4.171173
##$ABSG= 5
##$ABSL= 3
##$ALPHA= 0
##$AQORDER= 0
##$ASSFAC= 0
##$ASSFACI= 0
##$ASSFACX= 0
##$ASSWID= 0
##$AUNMP= <proc_1d>
##$AZFE= 0.1
##$AZFW= 0.1
##$BCFW= 0
##$BC_mod= 0
##$BYTORDP= 0
##$COROFFS= 0
##$CY= 12.5
##$DATMOD= 1
##$DC= 0
##$DFILT= <>
##$DTYPP= 0
##$F1P= 14.0000005364418
##$F2P= -0.99999901652339
##$FCOR= 0.5
##$FTSIZE= 32768
##$FT_mod= 6
##$GAMMA= 0
##$GB= 0
##$INTBC= 1
##$INTSCL= 1
##$ISEN= 128
##$LB= 0.3
##$LEV0= 0
##$LPBIN= 0
##$MAXI= 10000
##$MC2= 0
##$MEAN= 0
##$ME_mod= 0
##$MI= 0
##$NCOEF= 0
##$NC_proc= -4
##$NLEV= 6
##$NOISF1= 0
##$NOISF2= 0
##$NSP= 0
##$NTH_PI= 0
##$NZP= 0
##$OFFSET= 16.522
##$PC= 1
##$PHC0= 84.71103
##$PHC1= 3.091856
##$PH_mod= 1
##$PKNL= yes
##$PPARMOD= 0
##$PSCAL= 4
##$PSIGN= 0
##$REVERSE= no
##$SF= 250.13
##$SI= 32768
##$SIGF1= 0
##$SIGF2= 0
##$SINO= 400
##$SIOLD= 32768
##$SREGLST= <1H.CDCl3>
##$SSB= 0
##$STSI= 32768
##$STSR= 0
##$SW_p= 5175.98343685301
##$SYMM= 0
##$S_DEV= 0
##$TDeff= 65536
##$TDoff= 0
##$TI= <Analysis number 999999
Compound Code 99
Book Reference 9
Project Code 9>
##$TILT= no
##$TM1= 0
##$TM2= 0
##$TOPLEV= 0
##$USERP1= <user>
##$USERP2= <user>
##$USERP3= <user>
##$USERP4= <user>
##$USERP5= <user>
##$WDW= 1
##$XDIM= 32768
##$YMAX_p= 362824615
##$YMIN_p= -375058
$$ End of Bruker specific parameters
$$ ---------------------------------
##NTUPLES= NMR SPECTRUM
##VAR_NAME=  FREQUENCY,     SPECTRUM/REAL,   SPECTRUM/IMAG
##SYMBOL=    X,             R,               I
##VAR_TYPE=  INDEPENDENT,   DEPENDENT,       DEPENDENT
##VAR_FORM=  AFFN,          ASDF,            ASDF
##VAR_DIM=   32768,         32768,           32768
##UNITS=     HZ,            ARBITRARY UNITS, ARBITRARY UNITS
##FACTOR=    0.157963299565203, 1,           1
##FIRST=     4132.6476996994, 0,             0
##LAST=      -1043.33573715361, 0,           0
##MIN=       -1043.33573715361, -375058,     0
##MAX=       4132.6476996994, 362824615,     0
$$ Real data points
##PAGE= N=1
##DATA TABLE= (X++(R..R)), XYDATA
$$ [...]
$$ plain form
23144 44021 52009 -36398 32570 -14936 -83731 -117895 -88316 -75602 -31991 -131999 -145068 -20755
23132 -20755 41425 -31469 -23826 28788 55434 134996 182010 179743 158560 163698 117235 104977
23120 104977 152339 187145 138936 65767 58392 100679 72809 11271 40992 70493 93533 83758
23108 83758 41552 -69677 -87979 -130672 -163221 -128368 -132114 -155755 -178996 -221797 -196298 -157145
23096 -157145 -90945 -73411 -7733 10229 -110818 -157205 -72279 -53678 -23185 -16027 -7984 -9785
23084 -9785 -17931 7212 14430 4847 -63644 -107540 -108395 -80989 -93212 -173917 -234689 -147123 -47680
23071 -47680 -35174 -109961 -86719 -124235 -97760 -83336 -72108 -90255 -120985 -120145 -55471 -16354
23059 -16354 14233 -31217 -7063 55677 -70348 -93093 30258 -13362 184 99648 89369
$$ packed form
23144D4021P988q8407O8968m7506o8795l4164K9579J2714M3611j00008j3069J24313
23132b0755O2180p2894P643N2614K6646P9562M7014k267k1183N138m6463j2258
23120A04977M7362L4806m8209p3169p375M2287k7870o1538K9721K9501K3040r775
23108H3758m2206j11229j8302m2693l2549L4853l746k3641k3241m2801K5499L9153
23096a57145O6200J7534O5678J7962j21047m6387Q4926J8601L0493P158Q043j801
23084i785q146K5143P218r583o8491m3896q55K7406j2223q0705o0772Q7566R9443
23071d7680J2506p4787K3242l7516K6475J4424J1228j8147l0730Q40O4674L9117
23059a6354L0587m5450K4154O2740j26025k2745J23351m3620J3546R9464j0279
$$ plain form
23048 89369 -25802 -65674 -21505 10990 57707 94365 97542 93374 64435 -9087 -105044 -162539
23036 -162539 -177197 -125780 -74801 -73496 -142391 -112306 -42808 -89489 -99479 -118558 -104866 -12201
23024 -12201 61929 121147 68604 21743 56920 120409 127130 126282 116525 41714 -27265 -112122
23012 -112122 -106486 -5344 60011 38955 35619 12336 -3102 77804 38289 -5189 -14296 35779
23000 35779 -39038 -105447 -104445 -697 12394 -26080 -50490 -118045 -95251 -63850 -1849 21897
22988 21897 -21059 -25969 -3012 -55896 -124418 -107648 -67757 -23923 -43381 -103517 -17408 27779
22976 27779 -23538 -165253 -204894 -191274 -117203 -57122 -82597 3134 71000 86994 51221
22965 51221 -5436 -35814 -85049 -102903 -87396 -113461 -156352 -137258 -157178 -103551 -60091 -40216
$$ packed form
23048H9369j15171l9872M4169L2495M6717L6658L177m168k8939p3522r5957n7495
23036a62539j4658N1417N0979J305o8895L0085O9498m6681r990j9079J3692R2665
23024a2201P4130N9218n2543m6861L5177O3489O721q48r757p4811o8979q4857
23012a12122N636J01142O5355k1056l336k3283j5438Q0906l9515m3478r107N0075
23000C5779p4817o6409J002J03748J3091l8474k4410o7555K2794L1401O2001K3746
22988B1897m2956m910K2957n2884o8522J6770L9891M3834j9458o0136Q6109M5187
22976B7779n1317j41715l9641J3620P4071O0081k5475Q5731O7866J5994l5773
22965E1221n6657l0378m9235j7854J5507k6065m2891J9094j9920N3627M3460J9875
$$ plain form
22953 -40216 -10632 -106188 -101899 -56099 -78717 -23804 -50283 -39899 63505 -1686 -13250 -24200
22941 -24200 -41133 42171 144094 168659 170498 162302 99446 -26606 -66988 -64395 -9335 -83023
22929 -83023 -53989 -38049 -74318 -109040 -53712 4247 6710 51911 71412 102583 54964 42151
22917 42151 -1015 11019 -19731 -49884 14534 31903 -34767 -35343 -52648 -33448 -41186 -35031
22905 -35031 -20397 -13127 -67316 -35892 23213 42243 13743 48267 88775 52090 18319 49633
22893 49633 24910 -52961 -15915 63114 24800 47369 91431 49317 56178 71453 134776 151037
22881 151037 74905 50597 38008 45594 73272 29166 40311 77815 86311 94380 11603 -45117
22869 -45117 -13326 47759 -9630 2218 42372 8393 -35024 -50783 21646 29216 62560 27523
$$ packed form
22953d0216K9584r5556M289M5800k2618N4913k6479J0384J03404o5191j1564j0950
22941b4200j6933Q3304J01923K4565J839q196o2856j26052m0382K593N5060p3688
22929h3023K9034J5940l6269l4722N5328N7959K463M5201J9501L1171m7619j2813
22917D2151m3166J2034l0750l0153O4418J7369o6670n76j7305J9200p738O155
22905c5031J4634P270n4189L1424N9105J9030k8500L4524M0508l6685l3771L1314
22893D9633k4723p7871L7046P9029l8314K2569M4062m2114O861J5275O3323J6261
22881A51037p6132k4308j2589P586K7678m4106J1145L7504Q496Q069q2777n6720
22869d5117L1791O1085n7389J1848M0154l3979m3417j5759P2429P570L3344l5037
$$ plain form
22857 27523 7021 -4812 -45313 -69744 -45620 -101974 -125845 -101147 -68393 -46792 -18166 -44847
22845 -44847 -8225 -14765 -121234 -175406 -146774 -65753 -56243 -25391 1493 -36262 -15862 29113
22833 29113 55183 46673 1943 -8091 40819 63414 95277 119229 94856 158771 207898 164709
22821 164709 79791 34507 -2339 12022 -38010 -88306 -8699 -13780 -49651 27617 60388 34709
22809 34709 48604 26127 -30274 29280 46201 -3847 -26214 -108426 -55948 -32477 -88709 -123507
22797 -123507 -87026 19472 34234 -24811 -25821 -30023 -53914 -95206 -70812 -30756 -27554 -443
22785 -443 27516 -5387 -25900 -6296 54864 -83675 -86491 -60983 -20874 24801 47420 18711
22773 18711 -71263 -106482 -77532 16673 -58696 -20226 43872 88545 81092 123378 61123 34621
$$ packed form
22857B7523k0502j1833m0501k4431K4124n6354k3871K4698L2754K1601K8626k6681
22845d4847L6622o540j06469n4172K8632Q1021R510L0852K6884l7755K0400M4975
22833B9113K6070q510m4730j0034M8910K2595L1863K3952k4373O3915M9127m3189
22821A64709q4918m5284l6846J4361n0032n0296P9607n081l5871P7268L2771k5679
22809C4709J3895k2477n6401N9554J6921n0048k2367q2212N2478K3471n6232l4798
22797a23507L6481J06498J4762n9045j010m202k3891m1292K4394M0056L202K7111
22785d43K7959l2903k0513J9604O1160j38539k816K5508M0109M5675K2619k8709
22773A8711q9974l5219K8950R4205p5369L8470O4098M4673p453M2286o2255k6502
$$ plain form
22761 34621 -20367 28059 37182 -33045 -104667 -160368 -109760 -47704 -69985 -63405 -48727 2394
22749 2394 59057 -2717 -6645 5181 33384 32054 61750 78242 23337 -67186 -6616 77100
22737 77100 37893 -33224 -106685 -80247 -141770 -192415 -175806 -144327 -24565 23560 66676
22726 66676 26611 -106783 -105769 -1979 26347 612 4949 -10904 16432 77907 157674 150982
22714 150982 100647 104725 63356 8083 -24081 -68022 -80479 -30003 -39236 -48574 -62935 -51484
22702 -51484 -107143 -90658 -33344 14628 30756 -2972 -30083 -5843 18705 62360 93485 120084
22690 120084 190627 164431 32555 36419 25927 25800 -44028 -45916 -69154 -86987 -32246 41453
22678 41453 103020 54170 64004 40238 -8393 92710 72101 -5261 -6460 -67644 -143905 -142132
$$ packed form
22761C4621n4988M8426R123p0227p1622n5701N0608O2056k2281O580J4678N1121
22749B394N6663o1774l928J1826K8203j330K9696J6492n4905r0523O0570Q3716
22737G7100l9207p1117p3461K6438o1523n0645J6609L1479J19762M8125M3116
22726F6676m0065j33394J014J03790K8326k5735M337j5853K7336O1475P9767o692
22714A50982n0335M078m1369n5273l2164m3941j2457N0476r233r338j4361J1451
22702e1484n5659J6485N7314M7972J6128l3728k7111K4240K4548M3655L1125K6599
22690A20084P0543k6196j31876L864j0492j27o9828j888k3238j7833N4741P3699
22678D1453O1567m8850R834k3766m8631J01103k0609p7362j199o1184p6261J773
$$ plain form
22666 -142132 -163919 -97171 -1080 23703 -31230 -73548 -68454 -45310 106579 23562 -13446
22655 -13446 70326 70724 85548 9947 -19579 -30917 12545 1528 -29665 -93448 -45235 -38199
22643 -38199 -77526 -48628 -60226 -26851 1170 -83466 -144313 -81021 -65879 -33658 26 -38132
22631 -38132 25864 71190 75942 33153 5464 7812 16682 -2543 -26658 9237 5207 -104043
22619 -104043 -153178 -158330 -117876 -137104 -112089 -69346 -129442 -131131 -105659 -121547 -104461 -41374
22607 -41374 41341 8641 -462 -83187 -115039 52178 97453 64444 -4392 -35463 -49312 -39193
22595 -39193 -26550 -66389 14323 65829 69621 38511 -14783 -116903 -154928 -152592 -92093 -70585
22583 -70585 -70126 -84866 -120038 -125441 -129542 -96091 -103561 -93142 -6349 88840 81994 27353 -2399
$$ packed form
22666a42132k1787O6748R6091K4783n4933m2318N094K3144J51889q3017l7008
22655a3446Q3772L98J4824p5601k9526j1338M3462j1017l1193o3783M8213P036
22643c8199l9327K8898j1598L3375K8021q4636o0847O3292J5142L2221L3684l8158
22631c8132O3996M5326M752m2789k7689K348Q870j9225k4115L5895m030j09250
22619a04043m9135n152M0454j9228K5015M2743o0096j689K5472j5888J7086O3087
22607d1374Q2715l2700r103q2725l1852J67217M5275l3009o8836l1071j3849J0119
22595c9193J2643l9839Q0712N1506L792l1110n3294j02120l8025K336O0499K1508
22583g0585M59j4740l5172n403m101L3451p470J0419Q6793R5189o846n4641k9752
$$ plain form
22570 -2399 -12722 11157 37836 46573 17290 683 25853 35117 14606 39720 90359 31213
22558 31213 -44097 -37596 20074 76861 68927 21591 -16129 3849 28650 48212 14966 -32780
22546 -32780 -99882 -141545 -100626 9038 72457 60213 -24757 -130254 -109096 -58096 -94764
22535 -94764 -30307 14216 24342 46501 115687 103945 69796 47046 -29431 -101648 -188381 -170961
22523 -170961 -124202 -144479 -145719 -103122 -124974 -105750 -78964 -85726 -139400 -129237 -41715 11515
22511 11515 21162 22556 -17061 -53973 -71777 -62891 -80558 -58134 -86538 -79100 -92835 -106953
22499 -106953 -107749 -89834 -116102 -117612 -114114 14047 47887 30570 -14100 3374 -32049 -76013
22487 -76013 -64026 -18274 110572 151061 89798 36381 -30468 -51866 -51983 -16770 -18698 16597
$$ packed form
22570b399j0323K3879K6679Q737k9283j6607K5170R264k0511K5114N0639n9146
22558C1213p5310O501N7670N6787p934m7336l7720J9978K4801J9562l3246m7746
22546c2780o7102m1663M0919J09664O3419j2244q4970j05497K1158N1000l6668
22535i4764O4457M4523J0126K2159O9186j1742l4149k2750p6477p2217q6733J7420
22523a70961M6759k0277j240M2597k1852J9224K6786o762n3674J0163Q7522N3230
22511A1515R647J394l9617l6912j7804Q886j7667K2424k8404P438j3735j4118
22499a06953p96J7915k6268j510L498J28161L3840j7317m4670J7474l5423m3964
22487g6013J1987M5752J28846M0489o1263n3417o6849k1398j17L5213j928L5295
$$ plain form
22475 16597 36114 22047 -27682 -40015 -52068 -5123 24228 -26419 25224 86295 100432 13976
22463 13976 -81791 -62339 -8335 -2577 56247 187791 176281 104996 97060 117014 32575 -16184
22451 -16184 -68753 -82044 -55078 -88899 -96449 -97439 -54710 -49172 -119578 -40470 77509 106241
22439 106241 12500 -27048 -74819 -73890 -37457 -106171 -120070 -76569 14130 25120 30665 11813
22427 11813 -32224 22744 70826 45828 67123 61028 54620 54275 44786 -13914 -69163 -60582 -59697
22414 -59697 -133311 -194297 -112966 -16232 35891 43963 -80391 -175153 -146371 -92034 -91677 -108226
22402 -108226 -7295 80834 86509 12580 22812 38194 24568 -59731 -139354 -120501 -52249
22391 -52249 -59981 -83565 -71139 -24609 -57289 -171686 -207486 -210082 -205487 -171415 -163436 -99075
$$ packed form
22475A6597J9517j4067m9729j2333j2053M6945K9351n0647N1643O1071J4137q6456
22463A3976r5767J9452N4004N758N8824J31544j1510p1285p936J9954q4439m8759
22451a6184n2569j3291K6966l3821p550r90M2729N538p0406P9108J17979K8732
22439A06241r3741l9548m7771R29L6433o8714j3899M3501R0699J0990N545j8852
22427A1813m4037N4968M8082k4998K1295o095o408l45r489n8700n5249Q581Q85
22414e9697p3614o0986Q1331R6734N2123Q072j24354r4762K8782N4337L57j6549
22402a08226J00931Q8129N675p3929J0232J5382j3626q4299p9623J8853O8252
22391e2249p732k3584J2426M6530l2680j14397l5800k596M595L4072P979O4361
$$ plain form
22379 -99075 -78808 -66543 -5815 24728 30583 60606 35414 61805 64364 39816 -55702 -146066
22367 -146066 -74757 -37322 -40863 -32764 65372 90206 74527 -11643 -59945 -96372 -17472 43258
22355 43258 90594 130433 113602 24143 -25407 12852 -48320 -16094 149305 143972 25791
22344 25791 30311 122651 132347 80229 3694 30894 77533 99085 145810 203031 178166 103253
22332 103253 92904 106678 78446 18602 58964 72933 6520 57533 95516 42700 40864 104795
22320 104795 82297 2898 4485 15452 -9817 -68660 -113227 -84638 -48905 -37211 41816 4187
22308 4187 -24652 34352 28083 77224 57958 -78210 -75358 -22335 -43235 -6015 90874 84424
22296 84424 33709 -4839 -51478 -40006 36898 20648 124155 126791 32534 -21882 9926 75827
$$ packed form
22379i9075K0267J2265O0728L0543N855L0023k5192K6391K559k4548r5518r0364
22367a46066P1309L7435l541Q099R8136K4834j5679q6170m8302l6427P8900O0730
22355D3258M7336L9839j6831q9459m9550L8259o1172L2226J65399n333j18181
22344B5791M520R2340R696n2118p6535K7200M6639K1552M6725N7221k4865p4913
22332A03253j0349J3774k8232n9844M0362J3969o6413N1013L7983n2816j836O3931
22320A04795k2498p9399J587J0967k5269n8843m4567K8589L5733J1694P9027l7629
22308D187k8839N9004o269M9141j9266j36168K852N3023k0900L7220R6889o450
22296H4424n0715l8548m6639J1472P6904j6250J03507K636r4257n4416L1808O5901
$$ plain form
22284 75827 93356 53626 13208 40880 81491 123095 67913 1795 -2929 5541 -28554 -54701
22272 -54701 -22163 1756 -56051 -96030 -97943 -109413 -142629 -128380 -5344 22478 -9043 -5015
22260 -5015 -67288 -86614 -86194 -112623 -115018 -90971 -127264 -20770 5657 -60658 -14015 40347
22248 40347 54617 52108 88666 46650 106361 82427 84144 88626 12370 13341 -19694 -37782 -49587
22235 -49587 -58912 -122097 -128187 -3401 3713 -109060 -168515 -83296 -49877 -46868 -17439 56534
22223 56534 47155 27977 34299 44323 123234 123879 32946 41017 76892 9428 -35478 -11704 -13659
22210 -13659 -44685 38319 35934 18908 18633 -4324 -57761 -36036 51857 89580 43110 31301
22198 31301 -40142 -77127 -108244 -64607 -36988 -20853 39543 171699 174396 111940 13159 4093
$$ packed form
22284G5827J7529l9730m0418K7672M0611M1604n5182o6118m724Q470l4095k6147
22272e4701L2538K3919n7807l9979j913j1470l3216J4249J23036K7822l1521M028
22260e015o2273j9326M20k6429k395K4047l6293J06494K6427o6315M6643N4362
22248D0347J4270k509L6558m2016N9711k3934J717M482p6256R71l3035j8088j1805
22235d9587r325o3185o090J24786P114j12773n9455Q5219L3419L009K9429P3973
22223E6534r379j9178O322J0024P8911O45r0933Q071L5875o7464m4906K3774j955
22210a3659l1026Q3004k385j7026k75k2957n3437K1725Q7893L7723m6470j1809
22198C1301p1443l6985l1117M3637K7619J6135O0396J32156K697o2456r8781r066
$$ plain form
22186 4093 -44525 -119548 -149467 -112443 -70026 -35569 25139 35530 68012 18695 -44331 32752
22174 32752 56187 7723 2314 -1494 79099 107121 -2462 -25220 36916 99741 70934 -848
22162 -848 -37722 -35656 -42512 -61827 33513 62501 24658 -14185 -82639 -78140 65295 47120
22150 47120 53883 17773 63902 171386 193389 162748 44782 -30881 -106412 -37006 30936
22139 30936 80046 119196 20669 -24542 14525 66685 64355 78260 -1284 -6218 42462 21665
22127 21665 -44019 -26384 -68174 -30723 55354 99190 147048 108569 11219 -18252 42373 11895
22115 11895 -541 -101299 -68641 20923 32457 34348 49772 -32139 -91991 -85435 -129049 -94848
22103 -94848 -34525 41686 90135 89865 12996 31705 39293 7897 -18568 19130 -10104 -7443
$$ packed form
22186D093m8618p5023k9919L7024M2417L4457O0708J0391L2482m9317o3026P7083
22174C2752K3435m8464n409l808Q0593K8022j09583k2758O2136O2825k8807p1782
22162h48l6874K066o856j9315R5340K8988l7843l8843o8454M499J43435j8175
22150D7120O763l6110M6129J07484K2003l0641j17966p5663p5531O9406O7942
22139C0936M9110L9150r8527m5211L9067N2160k330J3905p9544m934M8680k0797
22127B1665o5684J7635m1790L7451Q6077M3836M7858l8479r7350k9471O0625l0478
22115A1895j2436j00758L2658Q9564J1534J891J5424q1911n9852O556m3614L4201
22103i4848O0323P6211M8449k70p6869J8709P588l1396k6465L7698k9234K661
$$ plain form
22091 -7443 -29685 6955 -12876 111172 164824 68013 -41958 -25553 11337 -25924 -31178 -8557
22079 -8557 -63130 -137219 -93230 -26811 -22686 12515 -10294 2079 26278 71380 109732 104211
22067 104211 94827 79143 29152 35286 36121 -32284 -15276 -1321 -72409 -47861 -39795 887
22055 887 53246 29272 -85630 -87434 -65871 -59118 -48445 6361 88723 88507 10714 -46809 -106439
22042 -106439 -174370 -181623 -111585 -39712 -114406 -169247 -116272 -27287 -23482 -29198 -40701 -4535
22030 -4535 50031 120088 111471 43301 27309 -68097 -94925 -87364 -53702 69709 28325 -92594
22018 -92594 -184978 -125359 -128483 -123803 -161156 -118472 -105987 -43512 -61655 -14044 -8982 -46308
22006 -46308 -81101 -44565 -34887 -28735 -67169 -112186 -27095 -12880 -16937 -8605 7008 27864
$$ packed form
22091g443k2242L6640j9831J24048N3652r6811j09971J6405L6890l7261n254K2621
22079h557n4573p4089M3989O6419M125L5201k2809J2373K4199M5102L8352n521
22067A04211r384j5684m9991O134Q35o8405J7008J3955p1088K4548Q066M0682
22055H87N2359k3974j14902j804K1563O753J0673N4806Q2362k16p7793n7523n9630
22042a06439o7931p253P0038P1873p4694n4841N2975Q8985L805n716j1503L6166
22030d535N4566P0057q617o8170j5992r5406k6828P561L3662J23411m1384j20919
22018i2594r2384N9619l124M680l7353M2684J2485O2475j8143M7611N062l7326
22006d6308l4793L6536R678O152l8434m5017Q5091J4215m057Q332J5613K0856
$$ plain form
21994 27864 -1177 186 -50716 -82258 -9309 67323 37539 44168 15466 -4016 -46408 -28332
21982 -28332 54977 38204 -46060 -47297 -57990 -84173 -97736 -201381 -250898 -233620 -156868 -159802
21970 -159802 -116967 -119076 -51012 -7089 -28243 -32154 23974 10993 36065 59238 94330 94862
21958 94862 25196 22214 -5768 -85058 5834 158131 204443 289862 185692 54727 50534
21947 50534 22981 -81765 -93537 -76456 -24798 25807 2492 -30486 -46367 -75185 -94937
21936 -94937 -133630 -112926 -149097 -68118 88637 116371 98445 44286 -6486 -72167 -78158 -60204
21924 -60204 -41231 7689 -6160 -64219 -113895 -107584 -91387 -77505 -62760 13863 -40870 -132982
21912 -132982 -84621 -49244 -85524 -98446 -123741 -38194 17296 73574 139548 105920 3322
$$ packed form
21994B7864k9041J363n0902l1542P2949P6632k9784O629k8702j9482m2392J8076
21982b8332Q3309j6773q4264j237j0693k6183j3563j03645m9517J7278P6752k934
21970a59802M2835k109O8064M3923k1154l911N6128j2981K5072K3173L5092N32
21958I4862o9666k982k7982p9290R0892J52297M6312Q5419j04170j30965m193
21947E0534k7553j04746j1772J7081N1658N0605k3315l2978j5881k8818j9752
21936i4937l8693K0704l6171Q0979J56755K7734j7926n4159n0772o5681n991J7954
21924f0204J8973M8920j3849n8059m9676O311J6197J3882J4745P6623n4733r2112
21912a32982M8361L5377l6280j2922k5295Q5547N5490N6278O5974l3628j02598
$$ plain form
21901 3322 19117 4584 86069 80393 -7626 -5011 13277 75276 34925 -15318 30116 72915
21889 72915 136479 91608 18238 -19353 7897 33903 -45206 -90880 -64856 -30371 -13189 -22874
21877 -22874 -37371 16520 25053 -58091 -75972 -21845 -15412 -106556 -156619 -124625 -52166 -37308
21865 -37308 -68026 -69633 -81612 -57107 19802 -19224 -16120 118429 81950 -21467 26312 55949
21853 55949 -4931 -115849 -143318 -128181 -25799 -508 51312 -23001 -75917 -42754 8859
21842 8859 35007 21498 31229 25661 -7409 -45565 10414 36349 43309 136314 143731 59241 117217
21829 117217 148411 136127 69338 61040 -30498 -8187 16843 -11263 24429 -5737 -8504 315
21817 315 -77646 -141241 -34528 27654 -27207 -23469 -129834 -141892 -108282 -20861 6405 9892
$$ packed form
21901C322J5795j4533Q1485n676q8019K615J8288O1999m0351n0243M5434M2799
21889G2915O3564m4871p3370l7591K7250K6006p9109m5674K6024L4485J7182r685
21877b2874j4497N3891Q533q3144j7881N4127O433r1144n0063L1994P2459J4858
21865c7308l0718j607j1979K4505P6909l9026L104J34549l6479j03417M7779K9637
21853E5949o0880j10918k7469J5137J02382K5291N1820p4313n2916L3163N1613
21842H859K6148j3509R731n568l3070l8156N5979K5935O960R3005P417q4490N7976
21829A17217L1194j2284o6789q298r1538K2311K5030k8106L5692l0166k767Q819
21817C15p7961o3595J06713O2182n4861L738j06365j2058L3610Q7421K7266L487
$$ plain form
21805 9892 35361 96068 81758 68996 73466 65152 98963 185327 302086 260245 216189 167597
21793 167597 130178 92847 27056 13947 41373 -5959 -91244 3335 111223 36981 92119
21782 92119 84587 1512 -11471 -14745 -11823 -52587 -104874 -53281 -37604 -27014 7337 11774
21770 11774 5621 -24924 -85845 -106240 -78755 -80790 -101965 -140426 -126489 -118444 -143742 -184050
21758 -184050 -118758 -93637 -84001 -35070 -15309 5575 -43001 -88108 -49898 -31143 -46354 -9544
21746 -9544 -34701 -30457 -89598 -78913 -85187 -101279 -130972 -96033 -24979 109010 39729 -77113
21734 -77113 -32893 15220 39907 5766 1312 -29989 -41216 3314 40059 59992 42588 102785
21722 102785 147497 149315 145659 178243 135235 46024 24352 120874 128964 119601 89985 36859
$$ packed form
21805I892K5469O0707j4310j2762M470q314L3811Q6364J16759m1841m4056m8592
21793A67597l7419l7331o5791j3109K7426m7332q5285R4579J07888p4242N5138
21782I2119p532q3075j2983l274K922m0764n2287N1593J5677J0590L4351M437
21770A1774o153l0545o0921k0395K7485k035k1175l8461J3937Q045k5298m0308
21758a84050O5292K5121R636M8931J9761K0884m8576m5107L8210J8755j5211L6810
21746i544k5157M244n9141J0685o274j6092k9693L4939P1054J33989o9281j16842
21734g7113M4220M8113K4687l4141m454l1301j1227M4530L6745J9933j7404O0197
21722A02785M4712J818l656L2584m3008q9211k1672R6522Q090r363k9616n3126
$$ plain form
21710 36859 86222 69251 19810 27196 30629 -13665 -35436 -31208 -70938 -80311 51686 73785
21698 73785 53334 42365 56624 -13783 -68167 -117137 -60592 -67196 -43712 22091 24341 -16907
21686 -16907 83899 158021 159942 184279 88583 121096 114104 58062 119291 136324 111932 110752
21674 110752 111924 144063 84595 -42892 -47256 28594 10807 -4088 -845 17749 -824 -57354
21662 -57354 -104505 -137275 -156734 -139573 -170305 -149269 -161174 -174987 -149203 -70934 -58497 -30436
21650 -30436 -46959 -62921 -67083 -25092 19496 40856 76999 -42617 -62654 -129118 -169457 -146775
21638 -146775 -120366 -34896 -7271 38091 64602 25176 -93107 -118792 -89603 -82192 -26174
21627 -26174 -24212 -23094 -119964 -148728 -133508 -79266 14021 30507 32716 92665 123896 146896
$$ packed form
21710C6859M9363j6971m9441P386L433m4294k1771M228l9730r373J31997K2099
21698G3785k0451j0969J4259p0407n4384m8970N6545o604K3484O5803K250m1248
21686a6907J00806P4122J921K4337r5696L2513o992n6042O1229J7033k4392j180
21674A10752J172L2139n9468j27487m364P5850j7787j4895L243J8594j8573n6530
21662e7354m7151l2770j9459J7161l0732K1036j1905j3813K5784P8269J2437K8061
21650c0436j6523j5962m162M1991M4588K1360L6143j19616k0037o6464m0339K2682
21638a46775K6409Q5470K7625M5362K6511l9426j18283k5685K9189P411N6018
21627b6174J962J118r6870k8764J5220N4242R3287J6486K209N9949L1231K3000
$$ plain form
21615 146896 169422 122943 62572 19937 85239 102462 97177 84191 35196 9015 -45106 -127532
21603 -127532 -132412 -72584 -9519 21942 -20831 -33007 -72463 -23963 -58907 -150114 -189871 -136031
21591 -136031 -113393 -79005 -6925 31757 23110 -1387 46287 77141 -5904 -23361 -40089 -79082
21579 -79082 -123850 -97603 -27425 -78040 -151764 -61422 -56590 15537 35695 48278 -6951 -60310
21567 -60310 -111453 -198968 -210701 -269564 -166026 -12230 89527 51821 166777 229001 183242
21556 183242 143931 63499 24834 -17545 20126 -61234 -50022 62456 165548 211051 83443
21545 83443 848 -52172 -32371 -64636 -40827 10773 34989 22522 -30973 8179 96126 43236
21533 43236 -7117 109809 56750 -1195 -48175 -61990 -21838 29626 65737 75055 -22818 20421
$$ packed form
21615A46896K2526m6479o0371m2635O5302J7223n285j2986m8995k6181n4121q2426
21603a27532m880N9828O3065L1461m2773j2176l9456M8500l4944r1207l9757N3840
21591a36031K2638L4388P2080L8682q647k4497M7674L0854q3045j7457j6728l8993
21579g9082m4768K6247P0178n0615p3724R0342M832P2127K0158J2583n5229n3359
21567f0310n1143q7515j1733n8863J03538J53796J01757l7706J14956O2224m5759
21556A83242l9311q0432l8665m2379L7671q1360J1212J12478J03092M5503j27608
21545H3443q2595n3020J9801l2265K3809N1600K4216j2467n3495L9152Q7947n2890
21533D3236n0353J16926n3059n7945m6980j3815M0152N1464L6111R318r7873M3239
$$ plain form
21521 20421 76253 79135 54927 55694 22694 26956 -13219 -73187 -31256 -45394 -98772 -81684
21509 -81684 -33674 -15400 -34342 -95598 -41077 17192 -37762 -40737 2846 41160 101260 152027
21497 152027 7030 -110740 -119802 -133612 -148864 -64642 -32807 -69358 -117318 -153106 -55189
21486 -55189 48965 196425 203990 80454 -19677 -6445 32297 151461 147689 80319 68144
21475 68144 101915 152096 81764 12686 -79692 -62769 16401 22452 50680 78575 53345 41048
21463 41048 38148 97660 134192 148027 219326 296442 239616 156278 103023 143888 193656 179842
21451 179842 147695 153730 30607 -17396 -28518 -100017 -80372 -54485 -73231 -108264 -24352
21440 -24352 -45293 1239 121041 85829 -71455 -28371 20951 28463 23501 -39427 -41148 7649
$$ packed form
21521B0421N5832K882k4208P67l3000M262m0175n9968M1931j4138n3378J7088
21509h1684M8010J8274j8942o1256N4521N8269n4954k975M3583L8314O0100N0767
21497A52027j44997j17770r062j3810j5252Q4222L1835l6551m7960l5788R7917
21486e5189J04154J47460P565j23536j00131J3232L8742J19164l772o7370j2175
21475F8144L3771N0181p0332o9078r2378J6923P9170O051K8228K7895k5230j2297
21463D1048k900N9512L6532J3835P1299P7116n6826q3338n3255M0865M9768j3814
21451A79842l2147O035j23123m8003j1122p1499J9645K5887j8746l5033Q3912
21440b4352k0941M6532J19802l5212j57284M3084M9322P512m962o2928j721M8797
$$ plain form
21428 7649 74188 128560 155254 149724 54537 108696 85468 -79867 -86954 -4141 9802 -19233
21416 -19233 52780 96119 152789 147035 89649 -24535 -50307 -25564 51811 120403 69460 47221
21404 47221 4963 -322 24972 -28444 -43408 -26544 -61510 -59414 -4848 -20729 -64405 -58671
21392 -58671 -40830 38037 115133 147043 168597 63425 -13112 -61235 -61419 -127819 -50504 24876
21380 24876 33683 12494 -83745 -60749 4532 10138 -5450 -20011 -90906 -108027 -15757 48441
21368 48441 63846 4810 -49613 -40177 -21768 -51307 -670 27800 -13014 -73695 -111990 -84245
21356 -84245 -86807 -125678 -170721 -109493 -86565 23793 85040 144357 102179 -12758 -30847
21345 -30847 -57079 12866 75678 115038 105658 52481 136292 48636 -15066 49336 -45758 -116054
$$ packed form
21428G649O6539N4372K6694n530r5187N4159k3228j65335p087Q2813J3943k9035
21416a9233P2013M3339N6670n754n7386j14184k5772K4743P7375O8592n0943k2239
21404D7221m2258n285K5294n3416j4964J6864l4966K096N4566j5881m3676N734
21392e8671J7841P8867P7096L1910K1554j05172p6537m8123j84o6400P7315P5380
21380B4876Q807k1189r6239K2996O5281N606j5588j4561p0895j7121R2270O4198
21368D8441J5405n9036n4423R436J8409k9539N0637K8470m0814o0681l8295K7745
21356h4245k562l8871m5043O1228K2928J10358O1247N9317m2178j14937j8089
21345c0847k6232O9945O2812L9360r380n3177Q3811q7656o3702O4402r5094p0296
$$ plain form
21333 -116054 -49374 14573 7452 437 16760 -16904 -36173 44943 55830 10589 -2854 61646
21321 61646 30114 -18285 -24791 1491 -90240 -142876 -89616 -67711 1428 75523 103580 44650
21309 44650 -18285 -63231 -24342 19299 -9687 -52529 -70228 -62520 -13941 6867 20394 40833
21297 40833 19536 11942 36686 -5535 46784 21198 -2350 71270 4880 -115122 -113087 -63683
21285 -63683 3357 22938 52769 47928 -9328 5611 68956 54 -16905 39779 99347 76481
21273 76481 40637 76891 73287 41602 34945 86373 126270 50344 10417 41640 -30575 -85784
21261 -85784 -113111 -98552 -121673 -158188 -114828 -62156 -27333 -5234 47476 79684 122904 150427
21249 150427 129116 152607 168927 115663 11809 -16166 -11483 -58595 -8457 1152 9539 -30548
$$ packed form
21333a16054O6680O3947p121p015J6323l3664j9269Q1116J0887m5241j3443O4500
21321F1646l1532m8399o506K6282r1731n2636N3260K1905O9139P4095K8057n8930
21309D4650o2935m4946L8889M3641k8986m2842j7699P708M8579K0808J3527K0439
21297D0833k1297p594K4744m2221N2319k5586k3548P3620o6390j20002K035M9404
21285f3683O7040J9581K9831m841n7256J4939O3345o8902j6959N6684N9568k2866
21273G6481l5844L6254l604l1685o657N1428L9897p5926l9927L1223p2215n5209
21261h5784k7327J4559k3121l6515M3360N2672L4823K2099N2710L2208M3220K7523
21249A50427k1311K3491J6320n3264j03854k7975M683m7112N0138R609Q387m0087
$$ plain form
21237 -30548 -47194 69231 113404 75320 56287 -3075 -2307 55120 103101 68291 37727 31890
21225 31890 10992 89175 105381 90738 1310 -23926 39953 8171 -69628 -133906 -133182 -61686
21213 -61686 -15725 -483 -40541 -8082 30751 -14718 -59713 -32718 -395 -18755 2431 67976
21201 67976 128374 134310 129085 129331 88486 33763 99501 127955 163157 249462 163080 52636
21189 52636 39036 32843 78754 71063 20475 21150 -14279 -58968 -160227 -214818 -120194 -150675
21177 -150675 -136540 -46828 -95636 -82858 -4036 17053 -2284 6193 64665 55521 59046 -22253
21165 -22253 -116646 -104668 -27951 -54676 -129777 -170095 -160291 19263 57030 71636 56951 28588
21153 28588 23338 -19204 22030 -29805 -59486 -12139 69546 127362 110653 84909 100891 15604
$$ packed form
21237c0548j6646J16425M4173l8084j9033n9362P68N7427M7981l4810l0564n837
21225C1890k0898P8183J6206j4643q9428k5236O3879l1782p7799o4278P24P1496
21213f1686M5961J5242m0058L2459L8833m5469m4995K6995L2323j8360K1186O5545
21201F7976O0398N936n225K46m0845n4723O5738K8454L5202Q6305q6382j10444
21189E2636j3600o193M5911p691n0588O75l5429m4689j01259n4591R4624l0481
21177a50675J4135Q9712m8808J2778P8822K1089j9337Q477N8472r144L525q1299
21165b2253r4393J1978P6717k6725p5101m0318R804J79554L7767J4606j4685k8363
21153B8588n250m2542M1234n1835k9681M7347Q1685N7816j6709k5744J5982q5287
$$ plain form
21141 15604 -78581 -165255 -161797 -69203 -41537 -87291 -45676 -34411 48505 77901 99775 103275
21129 103275 -20325 -44730 -123630 -154125 -54852 -37871 -61766 -171228 -178076 -66070 -65909
21118 -65909 -61806 398 73240 35523 49017 93641 28324 -38806 -53809 -15796 -13612 -59935
21106 -59935 -93112 -20140 -11771 -16547 13419 -42314 -26840 39634 106112 60642 -6184 -48913
21094 -48913 -42730 -82664 -51181 -25591 -63897 22780 68716 89760 41515 17952 93291 90957
21082 90957 117959 71550 -4383 13506 63492 44349 24 7323 -31800 -56221 -63281 -47668
21070 -47668 -58676 -56792 33532 -13743 -26149 6189 40863 -30299 -40964 -39152 -12828 -63888
21058 -63888 -19404 83710 95396 -8458 -39986 -38028 -42214 -43789 15117 27271 -39242 90956
$$ packed form
21141A5604r4185q6674L458R2594K7666m5754M1615J1265Q2916K9396K1874L500
21129A03275j23600k4405p8900l0495R9273J6981k3895j09462o848J12006J61
21118f5909M103O2204P2842l7717J3494M4624o5317o7130j5003L8013K184m6323
21106e9935l3177P2972Q369m776K9966n5733J5474O6474O6478m5470o6826m2729
21094d8913O183l9934L1483K5590l8306Q6677M5936K1044m8245k3563P5339k334
21082I0957K7002m6409p5933J7889M9986j9143m4325P299l9123k4421p060J5613
21070d7668j1008J884R0324m7275j2406L2338L4674p1162j0665J812K6324n1060
21058f3888M4484J03114J1686j03854l1528J958m186j575N8906J2154o6513J30198
$$ plain form
21046 90956 84249 12459 -45945 -71855 52333 117879 66168 16294 71211 136730 98354 116779
21034 116779 89907 20396 30683 48818 101317 100074 -5815 20164 30623 59242 95757
21023 95757 22777 -18579 -34700 -23275 -110988 -107067 -56890 27318 113053 143506 129831 45434
21011 45434 -25676 3462 -3466 60597 132653 111505 30203 -11131 -78853 -143329 -91192 10511
20999 10511 131943 172537 168797 149409 4608 -10136 68267 184394 166851 174228 177057 109409
20987 109409 10706 -62476 5632 -78519 -74555 -33084 47170 89858 54078 43991 106101 85676
20975 85676 -5552 84940 54683 62549 118881 125978 83578 11240 6348 3536 101142 73733
20963 73733 54746 -18201 3217 152036 103130 -92450 -100747 -79758 16211 97624 86006
$$ packed form
21046I0956o707p1790n8404k5910J24188O5546n1711m9874N4917O5519l8376J8425
21034A16779k6872o9511J0287J8135N2499j243j05889K5979J0459K8619L6515
21023I5757p2980m1356j6121J1425q7713L921N0177Q4208Q5735L0453j3675q4397
21011D5434p1110K9138o928O4063P2056k1148q1302m1334o7722o4476N2137J01703
20999A0511J21432M0594l740j9388j44801j4744P8403J16127j7543P377K829o7648
20987A09409r8703p3182O8108q4151L964M1471Q0254M2688l5780j0087O2110k0425
20975H5676r1228R0492l0257P866N6332P097m2400p2338m892k812R7606k7409
20963G3733j8987p2947K1418J48819m8906j95580q297K0989R5969Q1413j1618
$$ plain form
20952 86006 44110 78387 98309 125264 59288 -66497 -40202 -1497 -42484 -42626 43703 93057
20940 93057 36308 -8591 15530 -5451 -7748 8517 -43823 -112847 -83468 -65279 27873 60941
20928 60941 13010 46231 158892 93182 -55273 -55825 -10486 37178 69709 92165 -16744
20917 -16744 -32882 60270 93283 65878 53407 -65711 -56752 30434 89339 122435 64957 99120
20905 99120 127602 102610 45259 46146 92698 44997 82560 99364 62803 28487 20641 104020
20893 104020 246312 233582 133235 93651 37304 -35316 -19443 -45505 -113073 -127349 -77838
20882 -77838 -21648 -11816 33557 91699 77739 -4274 -3286 -69424 26164 89408 85054 152561
20870 152561 81448 20683 34495 -19118 -99252 -38389 23507 20537 88125 104104 43772 50800
$$ packed form
20952H6006m1896L4277J9922K6955o5976j25785K6295L8705m0987j42Q6329M9354
20940I3057n6749m4899K4121k0981k297J6265n2340o9024K9379J8189R3152L3068
20928F0941m7931L3221J12661o5710j48455n52M5339M7664L2531K2456j08909
20917a6744j6138R3152L3013k7405j2471j19118Q959Q7186N8905L3096n7478L4163
20905I9120K8482k4992n7351Q87M6552m7701L7563J6804l6561l4316p846Q3379
20893A04020J42292j2730j00347l9584n6347p2620J5873k6062o7568j4276M9511
20882g7838N6190R832M5373N8142j3960q2013R88o6138R5588O3244m354O7507
20870A52561p1113o0765J3812n3613q0134O0863O1896k970O7588J5979o0332P028
$$ plain form
20858 50800 86928 33526 4693 -21367 -24619 31809 45957 29292 7871 25081 -3583 75093
20846 75093 214453 187713 95670 80508 75481 43154 105082 117642 123797 93352 156377 245308
20834 245308 243971 24437 -62975 -9908 74226 18397 -113992 -87412 -63217 22466 104568
20823 104568 40207 36463 95885 105484 83530 119111 24768 -11881 -48632 48785 96254 102871
20811 102871 54002 49587 -12162 -46984 -51268 -3000 -21584 -7295 -25612 23968 46168 18391
20799 18391 23742 102101 114778 77893 40363 7510 9963 57611 97004 181689 131983 87617
20787 87617 79618 57054 45175 49920 56378 64689 94277 128006 169333 128038 74049 80918 100597
20774 100597 34635 8877 -10583 -67362 -102602 -52636 32954 14771 17753 105580 133690 119013
$$ packed form
20858E0800L6128n3402k8833k6060l252N6428J4148j6665k1421J7210k8664P8676
20846G5093J39360k6740r2043j5162n027l2327O1928J2560O155l0445O3025Q8931
20834B45308j337k19534q7412N3067Q4134n5829j32389K6580K4195Q5683Q2102
20823A04568o4361l744N9422R599k1954L5581r4343l6649l6751R7417M7469O617
20811A02871m8869m415o1749l4822m284M8268j8584J4289j8317M9580K2200k7777
20799A8391N351P8359J2677l6885l7530l2853K453M7648L9393Q4685m9706m4366
20787H7617p999k2564j1879M745O458Q311K9588L3729M1327m1295n3989O869J9679
20774A00597o5962k5758j9460n6779l5240M9966Q5590j8183K982Q7827K8110j4677
$$ plain form
20762 119013 129967 181320 129245 70080 38815 -132889 -217917 -164551 -92856 -50277 -21720
20751 -21720 3324 25281 23641 9686 44159 19709 35633 23572 -82966 -63177 -35457 -28282
20739 -28282 65238 148393 150994 167315 176484 180664 172541 78272 34432 29685 -6470 3905 11703
20726 11703 33294 84896 117541 57331 -4489 -32540 57671 84535 75240 27111 -13016 70039
20714 70039 241797 208955 165543 162611 127723 141722 193211 125843 106094 77087 39507 54495
20702 54495 99725 51433 3938 -5418 10042 21535 -4264 32597 21768 -15649 -1939 104767
20690 104767 111404 108179 108494 37060 4017 3088 21967 29050 -56615 -43835 -67183 -7981 112184
20677 112184 210775 135232 106760 75211 41176 38074 17679 -9158 43677 46207 8856 59755
$$ packed form
20762A19013J0954N1353n2075n9165l1265j71704q5028N3366P1695M2579K8557
20751b1720K5044K1957j640j3955L4473k4450J5924j2061j06538J9789K7720P175
20739b8282R3520Q3155K601J6321R169M180q123r4269m3840m747l6155J0375P798
20726A1703K1591N1602L2645o0210o1820k8051R0211K6864r295m8129m0127Q3055
20714G0039J71758l2842m3412k932l4888J3999N1489o7368j9749k9007l7580J4988
20702E4495M5230m8292m7495r356J5460J1493k5799L6861j0829l7417J3710J06706
20690A04767O637l225L15p1434l3043r29J8879P083q5665J2780k3348N9202J20165
20677A12184R8591p5543k8472l1549l4035l102k0395k6837N2835K530l7351N0899
$$ plain form
20665 59755 86381 106120 178102 121393 156259 229838 70332 -2165 8563 21562 1404
20654 1404 -27595 -48378 37201 61899 40111 15496 38938 99349 199838 237028 186638 133517
20642 133517 163352 195679 356109 345691 214626 146153 72515 130882 145563 90544 40145
20631 40145 96193 168246 188105 211947 199473 224575 208244 246534 312901 300516 214459 69640
20619 69640 42087 160494 257507 282294 302795 174803 89281 68182 19616 24155 61356
20608 61356 169780 237091 255316 330562 286383 295552 263546 304600 520181 616122 730767
20597 730767 860229 970124 1072911 1246714 1414890 1610074 1767145 1814096 1712147 1643742
20587 1643742 1658086 1700397 1757392 1615577 1418877 1219331 1047049 872492 771857 628894
$$ packed form
20665E9755K6626J9739P1982n6709L4866P3579j59506p2497J0728J2999k0158
20654A404k8999k0783Q5579K4698k1788k4615K3442O0411J00489L7190n0390n3121
20642A33517K9835L2327J60430j0418j31065o8473p3638N8367J4681n5019n0399
20631D0145N6048P2053J9859K3842j2474K5102j6331L8290O6367j2385q6057j44819
20619F9640k7553J18407R7013K4787K0501j27992q5522k1099m8566M539L7201
20608F1356J08424O7311J8225P5246m4179R169l2006M1054K15581R5941J14645
20597G30767J29462J09895J02787J73803J68176J95184J57071M6951j01949o8405
20587A643742J4344M2311N6995j41815j96700j99546j72282j74557j00635j42963
$$ plain form
20577 628894 490676 378875 362204 335972 247459 152030 163246 141103 139288 140469 74921
20566 74921 79268 90019 147542 182682 170879 112712 92038 47430 3198 77569 131878 140948
20554 140948 139511 92451 46985 74384 76716 104919 93133 123577 176068 234951 226004 196999
20542 196999 225444 229674 250489 260205 211513 142206 101384 48997 56837 48020 105658 115734
20530 115734 105206 12433 65937 136099 138900 102742 55554 30165 86230 95737 -44091 -30993
20518 -30993 26399 62574 32495 40989 50849 44741 128892 214623 198389 211652 203487 219271
20506 219271 229167 244280 144835 101631 132866 145751 111206 115989 62029 55873 85326 58416
20494 58416 105602 135741 163263 169709 69498 117788 154541 90225 86955 71538 98124 83663
$$ packed form
20577F28894j38218j11801j6671k6232q8513r5429J1216k2143j815J181o5548
20566G4921M347J0751N7523L5140j1803n8167k0674m4608m4232P4371N4309R070
20554A40948j437m7060m5466K7399K332K8203j1786L0444N2491N8883q947k9005
20542A96999K8445M230K0815R716m8692o9307m0822n2387P840q817N7638J0076
20530A15734j0528r2773N3504P0162K801l6158m7188k5389N6065R507j39828J3098
20518c0993N7392L6175l0079Q494R860o108Q4151Q5731j6234J3263q165J5784
20506B19271R896J5113r9445m3204L1235J2885l4545M783n3960o156K9453k6910
20494E8416M7186L0139K7522O446j00211M8290L6753o4316l270j5417K6586j4461
$$ plain form
20482 83663 138897 255703 288476 255045 172604 106970 72658 54393 91662 114567 135955
20471 135955 121040 61975 32287 19658 -8639 -18434 -67305 -81401 -100548 -125184 -35103 111231
20459 111231 137740 199764 232406 156024 73645 99615 120398 78829 103418 158692 162264 167027
20447 167027 209951 226866 216595 123019 75787 155868 229198 279997 219579 166169 166237 204245
20435 204245 172210 77434 68135 149875 146035 122262 184828 170588 144945 171553 194992 171673
20423 171673 193094 218196 140969 78315 74950 185448 279187 332314 270681 214949 273912
20412 273912 253729 163941 118409 97689 107193 126239 125978 148514 133673 160827 292827 211384
20400 211384 159505 169278 226035 332494 315586 202068 108736 21371 -14959 -8319 43135
$$ packed form
20482H3663N5234J16806L2773l3431q2441o5634l4312j8265L7269K2905K1388
20471A35955j4915n9065k9688j2629k8297r795m8871j4096j9147k4636R0081J46334
20459A11231K6509O2024L2642p6382q2379K5970K0783m1569K4589N5274L572M763
20447A67027M2924J6915j0271r3576m7232Q0081P3330N0799o0418n3410O8L8008
20435B04245l2035r4776r299Q1740l840k3773O2566j4240k5643K6608K3439k3319
20423A71673K1421K5102p7227o2654l365J10498R3739N3127o1633n5732N8963
20412B73912k0183q9788m5532k0720R504J9046k61K2536j4841K7154J32000q1443
20400B11384n1879R773N6757J06459j6908j13518r3332q7365l6330O640N1454
$$ plain form
20389 43135 114780 75945 13340 -22738 23347 48440 64048 95395 172823 259577 262540 214748
20377 214748 185045 182314 155491 167339 211129 269165 394769 342670 228944 187721 127706
20366 127706 142483 130711 171443 97949 54156 105607 100464 91875 103963 17629 45939 128001
20354 128001 72232 59741 64620 141390 188278 152590 150657 225293 181791 213123 263896 304118
20342 304118 284684 318085 396076 263397 168081 136515 96363 97911 193407 281357 239868
20331 239868 200044 164834 182628 178567 254064 382174 313048 193495 204250 205625 205582 169208
20319 169208 168344 179930 155448 237196 307515 464132 570097 578480 539350 498139 390039
20308 390039 318389 318093 374306 425141 515774 482522 437497 372166 376901 385077 394569 345185
$$ packed form
20389D3135P1645l8835o2605l6078M6085K5093J5608L1347P7428Q6754K963m7792
20377B14748k9703k731k6823J1848M3790N8036J25604n2099j13726m1223o0015
20366A27706J4777j1772M0732p3494m3793N1451n143q589J2088q6334K8310Q2062
20354A28001n5769j2491M879P6770M6888l5688j933P4636m3502L1332N0773M0222
20342C04118j9434L3401P7991j32679r5316l1566m0152J548R5496Q7950m1489
20331B39868l9824l5210J7794m061P5497J28110o9126j19553J0755J375m3l6374
20319A69208q64J1586k4482Q1748P0319J56617J05965Q383l9130m1211j08100
20308C90039p1650k96N6213N0835R0633l3252m5025o5331M735Q176R492m9384
$$ plain form
20296 345185 282345 277110 240059 299804 286163 179360 138862 180309 199429 267667 272119 235489
20284 235489 258112 216436 251974 254593 229431 254201 259407 289941 253223 182951 203395 310695
20272 310695 330326 378877 406856 367886 303898 217696 108204 95849 137196 191934 272664
20261 272664 328196 316464 246927 156712 106361 158331 195814 169524 87166 95580 171277 201798
20249 201798 239951 235026 181071 242145 306114 314359 384477 437757 456900 521470 538493 616961
20237 616961 609703 551915 462013 492551 577553 548725 526387 519674 532891 535063 556902 534540
20225 534540 588142 564526 512205 548024 583094 544778 515106 489910 558991 601163 538754
20214 538754 421241 281811 286711 397754 454541 499119 457882 439045 411204 394464 376642
$$ packed form
20296C45185o2840n235l7051N9745j3641j06803m0498M1447J9120O8238M452l6630
20284B35489K2623m1676L5538K619k5162K4770N206L0534l6718p0272K0444J07300
20272C10695J9631M8551K7979l8970o3988q6202j09492j2355M1347N4738Q0730
20261B72664N5532j1732o9537r0215n0351N1970L7483k6290q2358Q414P5697L0521
20249B01798L8153m925n3955O1074O3969Q245P0118N3280J9143O4570J7023P8468
20237F16961p258n7788q9902L0538Q5002k8828k2338o713J3217K172K1839k2362
20225E34540N3602k3616n2321L5819L5070l8316k9672k5196O9081M2172o2409
20214E38754j17513j39430M900J11043N6787M4578m1237j8837k7841j6740j7822
$$ plain form
20203 376642 423571 437296 411998 386221 359238 417378 379776 390175 474242 505782 477101
20192 477101 447341 509585 578937 614499 609334 588876 527641 528068 528382 486127 604640 659204
20180 659204 711334 740199 743329 763410 732878 706305 590618 515224 487557 570659 639944
20169 639944 719226 704432 711298 727486 772877 789019 772817 782067 772934 800055 845179 864898
20157 864898 963391 962580 892867 892095 921872 911972 837349 810640 903852 985277 965987 895622
20145 895622 932926 1049753 1122313 1143239 1177503 1122077 1033541 1136503 1204171 1192609 1191268
20134 1191268 1198824 1191803 1181576 1201514 1206031 1231964 1301057 1344758 1446152 1538855 1479423 1523850
20122 1523850 1573860 1626534 1604759 1642951 1740700 1799981 1806552 1795476 1889262 1950429 1986554
$$ packed form
20203C76642M6929J3725k5298k5777k6983N8140l7602J0399Q4067L1540k8681
20192D77101k9760O2244O9352L5562n165k0458o1235M27L14m2255J18513N4564
20180F59204N2130K8865L130K0081l0532k6573j15687p5394k7667Q3102O9285
20169F39944P9282j4794O866J6188M5391J6142j6202R250r133K7121M5124J9719
20157H64898R8493q11o9713p72K9777r900p4623k6709R3212Q1425j9290p0365
20145H95622L7304J16827P2560K0926L4264n5426q8536J02962O7668j1562j341
20134A191268P556p021j0227J9938M517K5933O9093M3701J01394R2703n9432M4427
20122A523850N0010N2674k1775L8192R7749N9281O571j1076R3786O1167L6125
$$ plain form
20111 1986554 2064439 2146955 2245778 2328775 2336151 2488140 2565159 2690936 2748031 2955780 3116443
20100 3116443 3317936 3599619 3841151 4058811 4442123 4680822 5006336 5279041 5567751
20091 5567751 5781105 6012082 6277356 6634128 7013374 7357671 7762417 8213171 8711713
20082 8711713 9418368 10263381 11163755 12161984 13198626 14434758 15923209 17656089 19515441
20073 19515441 21778474 24710638 28518371 33561546 40756711 51005019 64619813 81513446
20065 81513446 100971265 123298854 149375980 178673315 210250303 239986910 265840774
20058 265840774 287503878 303156368 313794213 317694244 314028516 302724177 283224391
20051 283224391 259053635 232518075 205347162 178085359 151029133 125595093 103130929
$$ packed form
20111A986554P7885Q2516R8823Q2997P376J51989P7019J25777N7095K07749J60663
20100C116443K01493K81683K41532K17660L83312K38699L25514K72705K88710
20091E567751K13354K30977K65274L56772L79246L44297M04746M50754M98542
20082H711713P06655Q45013R00374R98229J036642J236132J488451J732880J859352
20073A9515441K263033K932164L807733N043175P195165J0248308J3614794J6893633
20065H1513446J9457819K2327589K6077126K9297335L1576988K9736607K5853864
20058B65840774K1663104J5652490J0637845L900031l665728j1304339j9499786
20051B83224391k4170756k6535560k7170913k7261803k7056226k5434040k2464164
$$ plain form
20044 103130929 84210723 68676470 56249065 46289737 38346916 32259989 27568989
20037 27568989 23917781 20957146 18533013 16537832 14869041 13412686 12019553 10836982
20029 10836982 9736643 8912156 8196088 7558956 7088481 6685494 6323858 6015451 5666044
20020 5666044 5291824 5002705 4762639 4529327 4242126 3959737 3613337 3250623 2918085
20011 2918085 2604796 2277274 1985189 1735507 1553302 1497636 1418623 1303058 1094889 871409
20001 871409 943002 1010529 957584 884942 726269 562012 455067 438832 383370 397223 283283
19990 283283 146975 91866 52700 75077 47021 54395 71546 42970 22184 129828 125360
19979 125360 115226 160203 199329 120535 53440 -10862 -59988 -44370 -48041 -50903 -34606 -1418
$$ packed form
20044A03130929j8920206j5534253j2427405r959328p942821o086927m691000
20037B7568989l651208k960635k424133j995181j668791j456355j393133j182571
20029A0836982j100339q24487p16068o37132m70475m02987l61636l08407l49407
20020E666044l74220k89119k40066k33312k87201k82389l46400l62714l32538
20011B918085l13289l27522k92085k49682j82205n5666p9013j15565k08169k23480
20001H71409P1593O7527n2945p2642j58673j64257j06945j6235n5462J3853j13940
19990B83283j36308n5109l9166K2377k8056P374J7151k8576k0786J07644m468
19979A25360j0134M4977L9126p8794o7095o4302m9126J5618l671k862J6297L3188
$$ plain form
19967 -1418 14870 10143 34445 82355 191361 202915 93911 41640 41319 21915 49861 80596
19955 80596 10713 -51773 22128 -69258 -102282 -27473 36369 39775 76205 148248 216904 276210
19943 276210 397750 512050 593407 736931 904339 1068905 1271377 1319168 1296300 1398611
19933 1398611 1486195 1489244 1482902 1465814 1419740 1282750 1127929 1025610 831883 762713 699140
19922 699140 625901 463626 401830 279560 165797 53121 -16075 -1112 45843 89145 79527
19911 79527 42358 20145 50117 94899 85595 80201 150788 202428 237181 175478 144946 109419
19899 109419 86823 44864 -11029 -4863 -100356 -158121 -177728 -112069 -170760 -229636 -188170 -221937
19887 -221937 -205060 -188452 -141830 -131559 -171840 -218283 -197354 -161278 -137319 -96598 -58050
$$ packed form
19967a418J6288m727K4302M7910J09006J1554j09004n2271l21j9404K7946L0735
19955H0596o9883o2486P3901r1386l3024P4809O3842L406L6430P2043O8656N9306
19943B76210J21540J14300Q1357J43524J67408J64566K02472M7791k2868J02311
19933A398611Q7584L049o342j7088m6074j36990j54821j02319j93727o9170o3573
19922F99140p3239j62275o1796j22270j13763j12676o9196J4963M6955M3302r618
19911G9527l7169k2213K9972M4782r304n394P0587N1640L4753o1703l0532l5527
19899A09419k2596m1959n5893O166r5493n7765j9607O5659n8691n8876M1466l3767
19887b21937J6877J6608M6622J0271m0281m6443K0929L6076K3959M0721L8548
$$ plain form
19876 -58050 -22148 -45662 -100135 -172674 -81604 26407 64913 14167 -14741 -24902 -24859 33374
19864 33374 206468 286857 319302 381282 449740 556992 628550 732182 832195 1046901 1214703
19853 1214703 1403650 1646938 1944724 2243265 2468108 2631466 2741785 2841271 2892866 2962168
19843 2962168 2920772 2879537 2760836 2482192 2251268 2040322 1774886 1587013 1290285 1021907
19833 1021907 856487 674125 476090 375467 337634 268082 252464 328431 311787 132599
19823 132599 -28507 -72319 -54747 -4087 -75127 -65502 -59652 -23275 24960 79468 111456 76370
19811 76370 -63058 -76720 -123528 -62434 -123531 -36570 51961 21792 -27510 3666 -30062
19800 -30062 -40366 -35946 -54052 -65800 -106797 -126132 -67099 -746 -19133 -23497 -101959 -149234
$$ packed form
19876e8050L5902k3514n4473p2539R1070J08011L8506n0746k8908j0161M3N8233
19864C3374J73094Q0389L2445O1980O8458J07252P1558J03632J00013K14706J67802
19853A214703J88947K43288K97786K98541K24843J63358J10319R9486N1595O9302
19843B962168m1396m1235j18701k78644k30924k10946k65436j87873k96728k68378
19833A021907j65420j82362j98035j00623l7833o9552j5618P5967j6644j79188
19823A32599j61106m3812J7572N0660p1040R625N850L6377M8235N4508L1988l5086
19811G6370j39428j3662m6808O1094o1097Q6961Q8531l0169m9302L1176l3728
19800c0062j0304M420j8106j1748m0997j9335N9033O6353j8387m364p8462m7275
$$ plain form
19788 -149234 -118263 -92251 -48096 -5544 19401 -2152 -67937 -90436 -107309 -117738 6138
19777 6138 90832 100015 25740 29013 57700 -8945 -55892 -47 27191 32564 -16363 -556
19765 -556 5644 -5644 15029 -37832 -59554 -46080 12714 -491 13496 2293 11969 82124
19753 82124 53774 20910 23944 -36719 -74377 -66830 -56504 71295 161590 224602 267377 248706
19741 248706 191501 140695 157993 171461 263475 289270 238023 290625 319315 409670 476848
19730 476848 489279 547540 566639 517774 583183 568186 506381 475657 413901 479367 472941 317911
19718 317911 221984 177496 56101 -38477 20282 1185 -115985 -65711 12609 47858 24297
19707 24297 -13784 -15666 -26503 -29192 -70479 -45292 -26583 -28337 24143 -24601 -97143 -10037
$$ packed form
19788a49234L0971K6012M4155M2552K4945k1553o5785k2499j6873j0429J23876
19777F138Q4694R183p4275L273K8687o6645m6947N5845K7238N373m8927J5807
19765e56O200j1288K0673n2861k1722J3474N8794j3205J3987j1203R676P0155
19753H2124k8350l2864L034o0663l7658P547J0326J27799R0295O3012M2775j8671
19741B48706n7205n0806J7298J3468R2014K5795n1247N2602K8690R0355O7178
19730D76848J2431N8261J9099m8865O5409j4997o1805l0724o1756O5466o426j55030
19718C17911r5927m4488j21395r4578N8759j9097j17170N0274P8320L5249k3561
19707B4297l8081j882j0837k689m1287K5187J8709j754N2480m8744p2542Q7106
$$ plain form
19695 -10037 33663 -46474 -110684 -144290 -46979 12985 -12147 -48325 -40053 -20282 -42822 -25586
19683 -25586 -34697 -102342 -106223 -38514 -23125 -24338 -3139 -12540 -41569 -35729 69008 65514 -1250
19670 -1250 24953 -31685 -41879 43079 132483 104604 76424 20272 -35884 -80119 -65712 -71605
19658 -71605 -115682 -221986 -287132 -192617 -28674 43809 14465 -31312 34856 78776 108500
19647 108500 26803 -92460 -24679 -63781 22852 135173 112831 55534 -17598 -107615 -123586
19636 -123586 -121635 -150944 -37943 -57352 -181531 -183537 -90806 -80783 -47448 -7712 15510
19625 15510 14246 -8687 -8176 -4396 -81897 -172653 -241806 -178294 -96909 49333 100488 18765
19613 18765 -33436 -51730 -40315 2051 -3835 23420 -36034 -46169 45376 4990 43913 48595
$$ packed form
19695a0037M3700q0137o4210l3606R7311N9964k5132l6178Q272J9771k2540J7236
19683b5586r111o7645l881O7709J5389j213K1199r401k9029N840J04737l494o6764
19670a250K6203n6638j0194Q4958Q9404k7879k8180n6152n6156m4235J4407n893
19658g1605m4077j06304o5146R4515J63943P2483k9344m5777O6168M3920K9724
19647A08500q1697j19263O7781l9102Q6633J12321k2342n7297p3132r0017j5971
19636a23586J951k9309J13001j9409j24179k006R2731J0023L3335L9736K3222
19625A5510j264k2933N11L780p7501r0756o9153O3512Q1385J46242N1155q1723
19613A8765n2201j8294J1415M2366n886K7255n9454j0135R1545m0386L8923M682
$$ plain form
19601 48595 29864 126615 165167 111235 21899 -28410 -23327 -88576 -109538 -103701 -101961 -125274
19589 -125274 -102668 -106063 -102593 -42314 -23128 -28709 4574 -72805 -114932 -78330 -69030 -155483
19577 -155483 -278088 -236215 -133676 -59991 -8362 36618 110805 92939 49793 114739 21090
19566 21090 -7919 18428 -383 -68600 -115754 -64735 -69657 -97139 -74846 -51722 -8147 -44187
19554 -44187 -80227 -9627 24701 -7667 -87091 -65230 32724 -25702 -69272 -36557 -10428 -33570
19542 -33570 -18708 -4583 159467 202868 251047 167004 38856 91248 58460 66399 84095
19531 84095 126936 166909 256520 347505 485562 602455 730244 912408 1103619 1263722
19521 1263722 1421444 1555859 1561095 1603292 1691131 1665655 1609826 1594124 1519610 1349113 1181074
$$ packed form
19601D8595j8731R6751L8552n3932q9336n0309N083o5249k0962N837J740k3313
19589a25274K2606l395L470O0279J9186n581L3283p7379m2127L6602R300q6453
19577a55483j22605M1873J02539P3685N1629M4980P4187j7866m3146O4946r3649
19566B1090k9009K6347j8811o8217m7154N1019m922k7482K2293K3124M3575l6040
19554d4187l6040P0600L4328l2368p9424K1861R7954n8426m3570L2715K6129k3142
19542c3570J4862J4125J64050M3401M8179q4043j28148N2392l2788P939J7696
19531H4095M2841L9973Q9611R0985J38057J16893J27789J82164J91211J60103
19521A263722J57722J34415N236M2197Q7839k5476n5829j5702p4514j70497j68039
$$ plain form
19510 1181074 902006 754126 643639 473955 372494 361367 371984 331145 356423 250190
19500 250190 183011 146164 53000 74832 188114 198499 159438 139885 154686 113515 36830
19489 36830 -70272 -97554 -51639 -26316 -28393 -31164 -27453 -54474 -62883 -16420 67287 87365
19477 87365 80769 126383 143072 86564 64256 64844 18435 41872 82358 -3492 -58906 -38584
19465 -38584 -60373 -72175 -96583 -32964 -50005 -28397 11245 17072 58637 62405 43043 8075
19453 8075 -29137 -87172 -70356 -15272 29590 9614 -2319 7647 -121760 -60966 29801 -28414
19441 -28414 -138842 -115674 -50824 15816 28345 -12969 -56126 -37796 -21274 -7002 34901
19430 34901 101670 80642 -19423 -115748 -108142 -53457 -68838 -97186 -96558 -57862 18110 -6999
$$ packed form
19510A181074k79068j47880j10487j69684j01461j1127J0617m0839K5278j06233
19500B50190o7179l6847r3164K1832J13282J0385l9061j9553J4801m1171p6685
19489C6830j07102k7282M5915K5323k077k771L711k7021q409M6463Q3707K0078
19477H7365o596M5614J6689n6508k2308N88m6409K3437M0486q5850n5414K0322
19465c8584k1789j1802k4408O3619j7041K1608L9642N827M1565L768j9362l4968
19453H075l7212n8035J6816N5084M4862j9976j1933R966j29407O0794R0767n8215
19441b8414j10428K3168O4850O6640J2529m1314m3157J8330J6522J4272M1903
19430C4901O6769k1028j00065r6325P606N4685j5381k8348O28L8696P5972k5109
$$ plain form
19418 -6999 7569 13270 37127 13036 -46919 -19307 54608 89867 86535 41573 51036 54176 24906
19405 24906 49192 73481 80723 71531 23438 -57894 -31662 12392 12992 22281 -58562 -209469
19393 -209469 -193331 -94262 -47204 -128532 -122282 25837 80571 2761 -48830 -23581 51706
19382 51706 74666 82649 8805 -16862 20074 -34765 -35705 45787 116329 36345 -67358 -32676
19370 -32676 4777 50390 11627 -43265 12875 -51582 -117290 -96308 -68659 -19752 -29001 -50418
19358 -50418 -117652 -120092 -123178 -98531 -80203 -120311 -43393 27626 74588 116295 156507 91663
19346 91663 69345 2107 -1229 -2367 58720 72334 22593 -44596 -76493 -19481 44415 42795
19334 42795 11433 67821 116946 103071 51289 -29727 -61994 -114932 -164930 -128818 -71676 -4586
$$ packed form
19418f999J4568N701K3857k4091n9955K7612P3915L5259l332m4962R463L140k9270
19405B4906K4286K4289P242r192m8093q1332K6232M4054O00R289q0843j50907
19393b09469J6138R9069M7058q1328O250J48119N4734p7810n1591K5249P5287
19382E1706K2960P983p3844k5667L6936n4839r40Q1492P0542p9984j03703L4682
19370c2676L7453M5613l8763n4892N6140o4457o5708K0982K7649M8907r249k1417
19358e0418o7234k440l086K4647J8328m0108P6918P1019M6962M1707M0212o4844
19346I1663k2318o7238l336j138O1087J3614m9741o7189l1897N7012O3896j620
19334D2795l1362N6388M9125j3875n1782q1016l2267n2938m9998L6112N7142O7090
$$ plain form
19322 -4586 -25711 -70651 2922 10190 -27809 -91224 -36204 -84283 -147898 -103390 -83359 6013
19310 6013 77024 103196 46093 -421 -21919 -25601 -43261 -1594 31387 61657 3289 -7141
19298 -7141 28276 119926 179926 99907 24810 39331 -635 -24225 -17630 -9983 -9014 5456 -48702
19285 -48702 48744 155966 166316 85911 53304 115680 98641 15517 -13257 -14404 6824 -14068
19273 -14068 -44189 -115708 -44141 78925 45083 -39795 -8986 -37977 -48359 -2983 7887
19262 7887 77190 49553 51109 -6908 24751 115961 147170 122395 127268 104062 35146 -28376
19250 -28376 -43563 -81581 -36887 25302 112116 120046 32576 -22065 -45958 -23515 31449 91705
19238 91705 112419 150864 95818 -38725 -85596 -94607 54299 38273 -21581 -5587 110904
$$ packed form
19322d586k1125m4940P3573P268l7999o3415N5020m8079o3615M4508K0031Q9372
19310F013P1011K6172n7103m6514k1498l682j7660M1667L2981L0270n8368j0430
19298g141L5417R1650O0000q0019p5097J4521l9966k3590O595P647R69J4470n4158
19285d8702R7446J07222J0350q0405l2607O2376j7039q3124k8774j147K1228k0892
19273a4068l0121p1519P1567J23066l3842q4878L0809k8991j0382M5376J0870
19262G887O9303k7637J556n8017L1659R1210L1209k4775M873k3206o8916o3522
19250b8376j5187l8018M4694O2189Q6814P930q7470n4641k3893K2443N4964O0256
19238I1705K0714L8445n5046j34543m6871r011J48906j6026n9854J5994J16491
$$ plain form
19227 110904 128985 114906 51476 19098 59760 56921 68540 84989 25137 -29752 -51567 785
19215 785 21050 13109 -6697 -38368 -59195 -60801 -86587 -95302 -67101 27283 69649 114340 145503
19202 145503 138362 79261 70310 60194 46720 110032 159996 123776 82350 55607 111519 123741
19190 123741 28126 37237 127582 108816 83656 71500 10180 -68562 -81022 -85029 -65066 -42306
19178 -42306 20276 83209 64015 -10018 -14007 91389 207667 182024 89547 59391 71653
19167 71653 107339 54318 44982 34947 -7446 91464 60854 -35639 -45020 19356 105065 130126
19155 130126 68431 118075 178651 150706 38882 -13393 -68705 -22608 59167 57184 55876 -30071
19143 -30071 -71592 -41733 -14120 -109943 -48954 20006 993 48991 85109 26466 -99302
$$ packed form
19227A10904J8081j4079o3430l2378M0662k839J1619J6449n9852n4889k1815N2352
19215G85K0265p941j9806l1671k0827j606k5786q715K8201R4384M2366M4691L1163
19202A45503p141n9101q951j0116j3474O3312M9964l6220m1426k6743N5912J2222
19190A23741r5615R111R0345j8766k5160j2156o1320p8742j2460m007J9963K2760
19178d2306O2582O2933j9194p4033l989J05396J16278k5643r2477l0156J2262
19167G1653L5686n3021r336j0035m2393R8910l0610r6493r381O4376Q5709K5061
19155A30126o1695M9644O0576k7945j11824n2275n5312M6097Q1775j983j308q5947
19143c0071m1521K9859K7613r5823O0989O8960j9013M7998L6118n8643j25768
$$ plain form
19132 -99302 -88831 11607 98615 138943 212157 232162 211769 184865 133482 76941 -13161
19121 -13161 -70302 -119790 -118052 -88352 -78034 -96850 -72307 -13453 88107 59846 32464 56982
19109 56982 142058 143427 151218 76690 -494 28292 -14243 7362 2611 -43670 -61760 -47033
19097 -47033 -44059 -84268 -22968 28127 92043 83741 27340 -29135 -28571 19788 164448 270584
19085 270584 273974 210186 121567 23437 -22797 -83106 -28930 108247 145203 83174 138161
19074 138161 177755 154010 84880 61372 59401 43163 18201 79735 118538 108937 110203 148610
19062 148610 144576 48975 -106643 -115947 -82094 -65219 -73654 -37402 13244 -22323 -79042 -97083
19050 -97083 20435 37894 -57593 -85036 -110869 -85129 -38774 -82027 -95969 -169582 -142713
$$ packed form
19132i9302J0471J00438Q7008M0328P3214K0005k0393k6904n1383n6541r0102
19121a3161n7141m9488J738K9700J0318j8816K4543N8854J01560k8261k7382K4518
19109E6982Q5076J369P791p4528p7184K8786m2535K1605m751m6281j8090J4727
19097d7033K974m0209O1300N1095O3916q302n6401n6475N64M8359J44660J06136
19085B70584L390o3788q8619r8130m6234o0309N4176J37177L6956o2029N4987
19074A38161L9594k3745o9130k3508j971j6238k4962O1534L8803r601J266L8407
19062A48610m034r5601j55618r304L3853J6875q435L6252N0646l5567n6719j8041
19050i7083J17518J7459r5487k7443k5833K5740M6355m3253j3942p3613K6869
$$ plain form
19039 -142713 21445 59439 13991 -2919 -44355 99233 136711 136559 7778 -147060 -223421
19028 -223421 -176958 -143781 -119212 -81060 -75111 -13613 -2430 -40236 -8699 12780 -28626 -31858
19016 -31858 62716 77136 1400 -7163 -75131 -121683 -124262 -40231 -13361 -34890 -41788 -9560
19004 -9560 -20470 -33432 -62867 -56076 17272 57879 92122 72773 71963 100312 108626 185966 213420
18991 213420 199367 37443 -50319 -52713 -72067 -58591 -9878 130769 185074 111298 46591
18980 46591 43686 56761 13805 3192 90032 157525 159467 208112 244227 213919 132018 140256
18968 140256 134030 138442 108966 140868 92003 59633 84765 113446 145701 53449 87000 48191
18956 48191 25674 23390 -44529 -17025 40867 64918 65306 107119 69053 44115 35437 32539 30625
$$ packed form
19039a42713J64158L7994m5448j6910m1436J43588L7478j52j28781j54838p6361
19028b23421M6463L3177K4569L8152N949O1498J1183l7806L1537K1479m1406l232
19016c1858R4574J4420p5736q563o7968m6552k579Q4031K6870k1529o898L2228
19004i560j0910j2962k9435O791P3348M0607L4243j9349q10K8349Q314P7340K7454
18991B13420j4053j61924q7762k394j9354J3476M8713J40647N4305p3776o4707
18980D6591k905J3075m2956j0613Q6840O7493J942M8645L6115l0308q1901Q238
18968A40256o226M412k9476L1902m8865l2370K5132K8681L2255r2252L3551l8809
18956D8191k2517k284o7919K7504N7892K4051L88M1813l8066k4938q678k898j914
$$ plain form
18943 30625 68670 68297 96418 126841 122980 78698 74136 60849 32974 69985 83712 88326 37637
18930 37637 14462 5634 40058 -4102 -70283 -23758 52042 61625 76354 54303 -12092 25305
18918 25305 75781 65356 13001 -45811 -26917 53117 20335 30547 9416 -47837 -32818 -31794
18906 -31794 61560 73788 118173 221839 155535 60860 45759 45301 154205 136171 87164 40184
18894 40184 35657 65807 165063 158038 144888 197655 167398 134655 100354 15414 34813 -2226
18882 -2226 19415 76102 109629 77281 57952 114088 144313 119808 74466 74351 78508 129229
18870 129229 163215 59181 76268 48090 69183 2061 12860 37647 37655 90250 140564 121820
18858 121820 149036 86834 111282 169273 163824 140100 101914 14466 -15469 -24444 14273 82310
$$ packed form
18943C0625L8045l73K8121L0423l861m4282m562j3287k7875L7011J3727M614n0689
18930C7637k3175q828L4424m4160o6181M6525P5800R583J4729k2051o6395L7397
18918B5305N0476j0425n2355n8812J8894Q0034l2782J0212k1131n7253J5019J024
18906c1794R3354J2228M4385J03666o6304r4675j5101m58J08904j8034m9007m6980
18894D0184m527L0150R9256p025j3150N2767l0257l2743l4301q4940J9399l7039
18882b226K1641N6687L3527l2348j9329N6136L0225k4505m5342j15M157N0721
18870A29229L3986j04034J7087k8178K1093o7122J0799K4787QN2595N0314j8744
18858A21820K7216o2202K4448N7991n449k3724l8186q7448k9935q975L8717O8037
$$ plain form
18846 82310 115640 91036 52018 73864 110451 167808 176695 148392 91422 72241 3437 -12131
18834 -12131 77602 71792 64639 107552 172793 189733 136095 135887 124927 116243 62628 108135 110023
18821 110023 110817 153805 151169 167942 111275 145538 210278 160168 156854 218965 183813 160846
18809 160846 246334 174151 56198 108779 119201 123751 108564 115582 149041 76740 34427 43364
18797 43364 47588 87088 95733 72375 12905 47511 62057 100591 149505 178225 157090 133867
18785 133867 131449 89691 80075 44955 7071 -43388 -10784 94837 192302 280007 290554 283851
18773 283851 223342 163148 224109 200179 286734 383138 357936 420637 560511 820518 905130
18762 905130 823275 694719 561976 469144 389198 312160 209450 190621 265689 279675 250411
$$ packed form
18846H2310L3330k4604l9018K1846L6587N7357Q887k8303n6970j9181o8804j5568
18834a2131Q9733n810p153M2913O5241J6940n3638k08j0960q684n3615M5507J888
18821A10023P94M2988k636J6773n6667L4263O4740n0110l314O2111l5152k2967
18809A60846Q5488p2183j17953N2581J0422M550j5187P018L3459p2301m2313Q937
18797D3364M224L9500Q645k3358n9470L4606J4546L8534M8914K8720k1135k3223
18785A33867k418m1758r616l5120l7884n0459L2604J05621R7465Q7705J0547o703
18773B83851o0509o0194O0961k3930Q6555R6404k5202O2701J39874K60007Q4612
18762I05130q1855j28556j32743r2832p9946p7038j02710j8829P5068J3986k9264
$$ plain form
18751 250411 246599 236790 235381 117034 38909 69436 104454 105090 159545 176486 99053 19021
18739 19021 -825 106769 259219 240535 203908 162978 146046 95648 26768 9243 22670
18728 22670 27516 29619 83181 224247 299839 263858 268355 286819 249323 141274 34541 108625
18716 108625 95807 90604 59870 61834 66373 73112 44175 16460 49908 67236 96453 64467
18704 64467 55896 98106 116608 139823 121730 97876 58016 90036 116783 108297 74217 91981
18692 91981 62079 41268 139077 199455 180319 152780 119757 106358 122769 104729 110811 50508
18680 50508 81226 203009 233591 209084 68033 43384 114784 135089 92093 151156 125358
18669 125358 126425 136611 129115 122162 153002 171630 272816 199584 123069 124931 178896 211762
$$ packed form
18751B50411l812r809j409j18347p8125L0527L5018O36N4455J6941p7433q0032
18739A9021j9846J07594J52450j8684l6627m0930j6932n0398o8880j7525J3427
18728B2670M846K103N3562J41066P5592l5981M497J8464l7496j08049j06733P4084
18716A08625j2818n203l0734J964M539O739k8937k7715L3448J7328K9217l1986
18704F4467q571M2210J8502K3215j8093k3854l9860L2020K6747q486l4080J7764
18692I1981k9902k0811R7809O0378j9136k7539l3023j3399J6411j8040O082o0303
18680E0508L0718J21783L0582k4507j41051k4649P1400K0305m2996N9063k5798
18669A25358J067J0186p496o953L0840J8628J01186p3232p6515J862N3965L2866
$$ plain form
18657 211762 207967 260944 200107 89355 22144 50352 61676 46941 38028 88274 165012 139020
18645 139020 154721 126340 154281 55710 -18047 45328 24659 67974 111953 117166 94346 134812
18633 134812 124915 112984 68330 25356 43046 118271 131607 125394 87208 132469 200638 127060
18621 127060 99580 130718 177205 174491 148646 118376 140447 108031 30857 66175 155541 165158
18609 165158 127410 90838 88078 75893 128416 188286 178097 182452 224445 207962 89621 48079
18597 48079 -41732 57783 162018 201388 205791 207181 188622 135867 146633 159749 158508 143743
18585 143743 143979 168931 221632 183935 142344 126986 128662 185944 193052 98264 66226 169316
18573 169316 224392 242895 240083 207734 234298 200298 189380 152926 102345 115335 142438 213287
$$ packed form
18657B11762l795N2977o0837j10752o7211K8208J1324j4735q913N0246P6738k5992
18645A39020J5701k8381K7941r8571p3757O3375k0669M3315M3979N213k2820M0466
18633A34812r897j1931m4654m2974J7690P5225J3336o213l8186M5261O8169p3578
18621A27060k7480L1138M6487k714k5845l0270K2071l2416p7174L5318Q9366R617
18609A65158l7748l6572k760j2185N2523N9870j0189M355M1993j6483j18341m1542
18597D8079q9811R9515J04235L9370M403J390j8559n2755J0766J3116j241j4765
18585A43743K36K4952N2701l7697m1591j5358J676N7282P108r4788l2038J03090
18573A69316N5076J8503k812l2349K6564l4000j0918l6454n0581J2990K7103P0849
$$ plain form
18561 213287 230330 187891 141087 136817 142190 42777 60046 21002 11481 76062 191955 243835
18549 243835 201570 167071 141503 172251 197642 187184 238580 250321 223623 215108 161712 199979
18537 199979 273701 211301 97429 57528 122749 181871 153100 156510 201129 263595 255090 274652
18525 274652 251114 266358 235545 114984 -10688 18067 42325 54527 114480 212802 273630
18514 273630 244053 182840 239213 248807 255741 321043 280473 213018 153741 178817 203889 190820
18502 190820 200599 210901 209562 233602 226802 218430 257675 267340 231605 187241 180638 251661 235884
18489 235884 187963 196088 121875 87032 112530 144766 81043 82050 168344 183320 255204 263953
18477 263953 144266 78509 110034 172417 191517 225409 218376 147589 120953 143050 273398
$$ packed form
18561B13287J7043m2439m6804m270N373r9413J7269l9044r521O4581J15893N1880
18549B43835m2265l4499k5568L0748K5391j0458N1396J1741k6698q515n3396L8267
18537A99979P3722o2400j13872l9901O5221N9122k8771L410M4619O2466q505J9562
18525B74652k3538J5244l0813j20561j25672K8755K4258J2202N9953R8322O0828
18514B73630k9577o1213N6373R594O934O5302m0570o7455n9277K5076K5072j3069
18502A90820R779J0302j339K4040o800q372L9245R665l5735m4364o603P1023j5777
18489B35884m7921Q125p4213l4843K5498L2236o3723J007Q6294J4976P1884Q749
18477B63953j19687o5757L1525O2383J9100L3892p033p0787k6636K2097J30348
$$ plain form
18466 273398 367936 449341 400982 291689 284824 249728 218248 162893 140615 114276 96596
18455 96596 157016 209326 234081 221227 225071 253168 267592 256943 222736 178522 167904 246594
18443 246594 311591 356997 463793 454765 423281 403713 300248 211329 160258 176951 149698
18432 149698 156075 140708 235730 225335 189037 173543 216489 186707 220243 329660 314375
18421 314375 273745 259183 290354 253451 145468 106949 147512 234977 195672 150018 131603
18410 131603 135403 189054 275932 287576 227254 237833 258552 229965 180778 135897 123487 164587
18398 164587 207388 193776 262209 261531 278985 258549 218552 270406 321679 246163 119679 170081
18386 170081 181379 171476 194556 224994 311003 372389 380072 351574 318442 260604 220359 236337
$$ packed form
18466B73398R4538Q1405m8359j09293o865l5096l1480n5355k2278k6339j7680
18455I6596O0420N2310K4755j2854L844K8097J4424j0649l4207m4214j0618P8690
18443B46594O4997M5406J06796r028l1484j9568j03465q8919n1071J6693k7253
18432A49698O377j5367R5022j0395l6298j5494M2946k9782L3536J09417j5285
18421C14375m0630j4562L1171l6903j07983l8519M0563Q7465l9305m5654j8415
18410A31603L800N3651Q6878J1644o0322J0579K0719k8587m9187m4881j2410M1100
18398A64587M2801j3612O8433o78J7454k0436l9997N1854N1273p5516j26484N0402
18386A70081J1298r903K3080L0438Q6009O1386P683k8498l3132n7838m0245J5978
$$ plain form
18374 236337 229576 188349 176157 196193 234828 185537 192633 218564 207027 201521 220723 212613
18362 212613 233059 328181 300969 226598 262513 300156 312245 337264 410094 435155 342723
18351 342723 358892 382364 378115 383143 464011 499342 418070 297050 364995 453355 399685 363093
18339 363093 304824 244331 254497 294059 309517 275431 218096 249860 282770 259833 195458
18328 195458 213323 227877 246275 254106 299711 343537 329978 342210 268875 261070 324540 389837
18316 389837 359741 300121 264283 243850 306847 372758 348529 313229 371090 421281 369755
18305 369755 322674 339411 325037 329766 278924 256571 240803 239342 233073 224129 259051 378058
18293 378058 357811 317959 361007 423842 347664 267887 293881 283969 301674 341716 300222 323200
$$ packed form
18374B36337o761m1227j2192K0036L8635m9291P096K5931j1537n506J9202q110
18362B12613K0446R5122k7212p4371L5915L7643J2089K5019P2830K5061r2432
18351C42723J6169K3472m249N028Q0868L5331q1272j21020O7945Q8360n3670l6592
18339C63093n8269o0493J0166L9562J5458l4086n7335L1764L2910k2937o4375
18328A95458J7865J4554J8398P831M5605M3826j3559J2232p3335p805O3470O5297
18316C89837l0096n9620l5838k0433O2997O5911k4229l5300N7861N0191n1526
18305C69755m7081J6737j4374M729n0842k2353j5768j461o269q944L4922J19007
18293C78058k0247l9852M3048O2835p6178p9777K5994r912J7705M0042m1494K2978
$$ plain form
18281 323200 373474 449061 436121 344894 330560 348514 361820 404568 516735 651951 657557
18270 657557 646002 518414 514206 610707 699770 671631 590535 429950 460950 424404 357448
18259 357448 425539 452609 424458 388737 407288 437863 419289 360210 392562 526325 639174
18248 639174 537771 488541 485055 474329 460638 447446 446973 440090 389613 465407 520444 566832
18236 566832 500017 440638 423792 459870 507865 480025 441842 400061 404264 361602 448427 494773
18224 494773 463339 395107 379251 457961 399239 376869 338295 366343 422307 437188 493218
18213 493218 508094 521747 536030 499882 477212 442172 468433 477154 478889 523572 501417 456047
18201 456047 517455 572654 573047 599506 511533 481085 490741 553817 635843 618845 759486 927450
$$ packed form
18281C23200N0274P5587j2940r1227j4334J7954J3306M2748J12167J35216N606
18270F57557j1555j27588m208R6501Q9063k8139q1096j60585L1000l6546o6956
18259C57448O8091K7070k8151l5721J8551L0575j8574n9079L2352J33763J12849
18248F39174j01403m9230l486j0726j3691j3192m73o883n0477P5794N5037M6388
18236E66832o6815n9379j6846L6078M7995k7840l8183m1781M203m2662Q6825M6346
18224D94773l1434o8232j5856P8710n8722k2370l8574K8048N5964J4881N6030
18213D93218J4876J3653J4283l6148k2670l5040K6261Q721J735M4683k2155m5370
18201D56047O1408N5199L93K6459q7973l0448R656O3076Q2026j6998J40641J67964
$$ plain form
18189 927450 953790 970533 1021480 1170857 1309673 1481542 1661246 1842487 1989214 2163851
18179 2163851 2352674 2416445 2460591 2415144 2356705 2243230 2013501 1800673 1634842 1403011
18169 1403011 1212809 1163016 1021661 969595 897364 831910 762443 728328 729477 703084 867746
18158 867746 958706 926562 861766 825493 757930 785785 839334 834543 821175 866453 861234 779142
18146 779142 780811 837116 775860 825900 998507 1036641 1001783 1070397 1134508 1173453 1169114 1187407
18134 1187407 1309230 1463671 1560827 1632873 1780834 1818007 1850689 1967840 2250170 2508291
18124 2508291 2621177 2882710 3129682 3494953 3904657 4309605 4781323 5488101 6401554
18115 6401554 7564311 8869718 10779789 13465689 17357878 23279625 32918178 50651312
$$ packed form
18189I27450K6340J6743N0947J49377J38816J71869J79704J81241J46727J74637
18179B163851J88823O3771M4146m5447n8439j13475k29729k12828j65831k31831
18169A403011j90202m9793j41355n2066p2231o5454o9467l4115J149k6393J64662
18158H67746R0960l2144o4796l6273o7563K7855N3549m791j3368M5278n219q2092
18146G79142J669N6305o1256N0040J72607L8134l4858O8614O4111L8945m339J8293
18134A187407J21823J54441R7156P2046J47961L7173L2682J17151K82330K58121
18124B508291J12886K61533K46972L65271M09704M04948M71718P06778R13453
18115F401554J162757J305407J910071K685900L892189N921747R638553J7733134
$$ plain form
18107 50651312 86455184 142671257 159644569 128052814 103289342 87959741 70439425
18100 70439425 49163281 31888587 21457515 15613293 12067443 9726082 8119559 6816528
18092 6816528 5790774 5017614 4440011 3915162 3471640 3093964 2837440 2596518 2387094
18083 2387094 2250396 2088866 1857215 1731660 1606615 1402390 1332704 1245489 1023174 919737
18073 919737 944722 986607 935362 890395 879259 848605 841236 828865 829751 852760 941634 963593
18061 963593 870792 718509 611612 547855 583431 626253 563047 491998 436283 439887 524271
18050 524271 497251 473050 391267 453695 443438 418240 447075 426042 358822 323003 281209
18039 281209 245130 277339 284496 265822 357474 433653 417050 314369 321780 439513 411656
$$ packed form
18107E0651312L5803872N6216073J6973312l1591755k4763472j5329601j7520316
18100G0439425k1276144j7274694j0431072n844222l545850k341361j606523j303031
18092F816528j025754p73160n77603n24849m43522l77676k56524k40922k09424
18083B387094j36698j61530k31651j25555j25045k04225o9686q7215k22315j03437
18073I19737K4985M1885n1245m4967j1136l0654p369j2371Q86K3009Q8874K1959
18061I63593r2801j52283j06897o3757L5576M2822o3206p1049n5715L604Q4384
18050E24271k7020k4201q1783O2428j0257k5198K8835k1033o7220l5819m1794
18039B81209l6079L2209P157j8674R1652P6179j6603j02681P411J17733k7857
$$ plain form
18028 411656 398238 378005 327275 331895 448008 481132 478776 492289 474195 426526 382691 335372
18016 335372 374677 355139 356656 412205 379311 350319 360672 361848 368304 292986 231133 298507
18004 298507 346238 439689 544086 482077 386017 330787 249218 254950 374907 303061 263075
17993 263075 338597 354349 352378 338054 354171 327828 369219 429051 467197 516711 541971 442800
17981 442800 499222 539013 504052 455212 345310 326925 338673 362949 395518 346028 319668
17970 319668 369335 363311 352518 358799 412343 429286 363816 328872 292944 239619 214395 308063
17958 308063 327996 303860 352135 413229 532427 586253 582994 544977 507143 427676 411504
17947 411504 320430 315814 404605 372372 385196 352241 412826 501864 597102 631252 531053
$$ packed form
18028D11656j3418k0233n0730M620J16113L3124k356J3513j8094m7669m3835m7319
18016C35372L9305j9538J517N5549l2894k8992J0353J176O456p5318o1853O7374
18004B98507M7731R3451J04397o2009r6060n5230q1569N732J19957p1846l9986
17993B63075P5522J5752j971j4324J6117k6343M1391N9832L8146M9514K5260r9171
17981D42800N6422L9791l4961m8840j09902j8385J1748K4276L2569m9490k6360
17970C19668M9667o024j0793O281N3544J6943o5470l4944l5928n3325k5224R3668
17958C08063J9933k4136M8275O1094J19198N3826l259l8017l7834p9467j6172
17947D11504r1074m616Q8791l2233J2824l2955O0585Q9038R5238L4150j00199
$$ plain form
17936 531053 516886 504688 490339 471654 533178 468808 549818 545531 488307 490338 453495 427139
17924 427139 442433 454204 449083 441932 420343 421801 445378 430346 528926 625702 710362 776596
17912 776596 720325 631835 633151 644237 565491 547194 704533 844139 810088 768710 867375
17901 867375 843129 738252 720192 682895 700116 700033 683187 688437 700170 655233 615827 572029
17889 572029 503772 513026 572263 616345 601365 562696 553098 535359 534063 587341 625281 631639
17877 631639 667157 599268 636214 638746 630331 668077 633877 579078 572896 609740 645329 613308
17865 613308 571851 591342 604378 625333 681672 547869 450344 413556 394441 428271 472401
17854 472401 464003 447335 538965 588067 559501 511616 485492 426988 445828 549999 596265
$$ packed form
17936E31053j4167j2198j4349j8685O1524o4370Q1010m287n7224K031l6843k6356
17924D27139J5294J1771n121p151k1589J458K3577j5032R8580R6776Q4660O6234
17912G76596n6271q8490J316J1086p8746j8297J57339J39606l4051m1378R8665
17901H67375k4246j04877j8060l7297J7221q3j6846N250J1733m4937l9406m3798
17889E72029o8257R254N9237M4082j4980l8669r598j7739j296N3278L7940O358
17877F31639L5518o7889L6946K532q415L7746l4200n4799o182L6844L5589l2021
17865F13308m1457J9491J3036K0955N6339j33803r7525l6788j9115L3830M4130
17854D72401q398j6668R1630M9102k8566m7885k6124n8504J8840J04171M6266
$$ plain form
17843 596265 675425 699135 696382 672410 761207 851487 845473 862492 916272 868598 799673 775461
17831 775461 831328 880968 938008 968252 974700 940855 875683 874793 903384 948661 949485 999025
17819 999025 1020515 1021456 979354 953731 930191 952851 1019537 1005733 1051168 1033326 938505 879493
17807 879493 797086 864435 874461 902992 833402 907965 1050470 1056937 962301 936996 938735 986044
17795 986044 1102381 1095689 1031310 978200 1028288 1087741 1030667 962909 912815 894305 970571
17784 970571 1033758 1025498 1049865 1017329 1071161 1108943 1106968 1101634 1026290 1070433 1032468 1013131
17772 1013131 1045409 1044553 1051234 1063735 1063978 1115291 1207946 1221789 1206241 1230026 1202083 1278700
17760 1278700 1317754 1229848 1230611 1283536 1286865 1335472 1388208 1300007 1230345 1274602 1289737 1327316
$$ packed form
17843E96265P9160K3710k753k3972Q8797R0280o014J7019N3780m7674o8925k4212
17831G75461N5867M9640N7040L0244O448l3845o5172q90K8591M5277Q24M9540
17819I99025K1490R41m2102k5623k3540K2660O6686j3804M5435j7842r4821n9012
17807H79493q2407O7349J0026K8531o9590P4563J42505O467r4636k5305J739M7309
17795I86044J16337o692o4379n3110N0088N9453n7074o7758n0094j8510P6266
17784I70571O3187q260K4367l2536N3832L7782j975n334p5344M4143l7965j9337
17772A013131L2278q56O681J2501K43N1313R2655J3843j5548K3785k7943P6617
17760A278700L9054q7906P63N2925L329M8607N2736q8201o9662M4257J5135L7579
$$ plain form
17748 1327316 1398916 1461728 1497542 1518452 1599698 1560143 1417191 1372700 1434975 1557026 1673022
17737 1673022 1682679 1622235 1592589 1599993 1607420 1658431 1651877 1618917 1747751 1807325 1790281 1717015
17725 1717015 1779942 1946517 2012208 2011994 1983391 2046009 2077061 2121244 2142815 2175004 2181781 2365017
17713 2365017 2378588 2310341 2351690 2488470 2577118 2541827 2502889 2562440 2720298 2862937 2977265
17702 2977265 3102910 3234064 3299834 3358145 3462660 3547359 3581549 3676107 3830321 4010466
17692 4010466 4131667 4285447 4517707 4790207 5200303 5574185 6058253 6562686 7011988
17683 7011988 7606450 8368454 9286320 10226847 11219052 12240978 13410746 14533495 15675828
17674 15675828 16897951 18280141 19790228 21387419 23334689 25616070 28240557 31404041
$$ packed form
17748A327316P1600O2812L5814K0910Q1246l9555j42952m4491O2275J22051J15996
17737A673022R657o0444k9646P404P427N1011o554l2960J28834N9574j7044p3266
17725A717015O2927J66575O5691k14k8603O2618L1052M4183K1571L2189O777J83236
17713B365017J3571o8247M1349J36780Q8648l5291l8938N9551J57858J42639J14328
17702B977265J25645J31154O5770N8311J04515Q4699L4190R4558J54214J80145
17692D010466J21201J53780K32260K72500M10096L73882M84068N04433M49302
17683G011988N94462P62004R17866R40527R92205J021926J169768J122749J142333
17674A5675828J222123J382190J510087J597191J947270K281381K624487L163484
$$ plain form
17666 31404041 35321857 40346683 46911324 55911905 68912561 87581967 111452089 136596197
17658 136596197 166219679 204473203 247973631 283764008 310478352 338635124 357976422
17651 357976422 362824615 351987396 338677662 315457424 277717118 237417201 201350337
17644 201350337 168272565 133883868 103517993 80519718 63298634 49957790 40055029
17637 40055029 33291386 28629152 25191369 22453151 20439756 18893432 17377476 16066967
17629 16066967 14934172 13793880 12662276 11441965 10341293 9338944 8418967 7570053
17621 7570053 6784810 6041852 5428354 4924332 4516396 4142738 3843165 3614304 3407783
17612 3407783 3144482 2964671 2814377 2537739 2277874 2151313 2066959 1953984 1878378 1751008
$$ packed form
17666C1404041L917816N024826O564641R000581J3000656J8669406K3870122K5144108
17658A36596197K9623482L8253524M3500428L5790377K6714344K8156772J9341298
17651C57976422M848193j0837219j3309734k3220238l7740306m0299917l6066864
17644B01350337l3077772l4388697l0365875k2998275j7221084j3340844r902761
17637D0055029o763643m662234l437783k738218k013395j546324j515956j310509
17629A6066967j132795j140292j131604j220311j100672j002349r19977q48914
17621G570053p85243p42958o13498n04022m07936l73658k99573k28861k06521
17612C407783k63301j79811j50294k76638k59865j26561q4354j12975p5606j27370
$$ plain form
17602 1751008 1663535 1612118 1581761 1481237 1381838 1297280 1222143 1230418 1115944 968593 875111
17591 875111 740348 688416 651106 656620 679142 652900 639017 605034 588443 633410 684246
17580 684246 654493 685425 653978 617796 639846 552240 549538 550795 589212 534830 461604 437883
17568 437883 404128 517376 494108 424132 424638 433737 515631 537547 594811 578088 600792 556242
17556 556242 495619 414540 400353 413844 437041 433292 502028 577222 630187 633108 585987 560570
17544 560570 536917 454830 485840 530666 557654 576111 527483 524555 636330 625790 567652
17533 567652 580670 638471 739570 761392 780302 873889 924093 901027 844584 772653 835650
17522 835650 901263 870443 805815 684357 697661 706219 649874 594919 551394 536997 585738
$$ packed form
17602A751008q7473n1417l0357j00524r9399q4558p5137Q275j14474j47351r3482
17591H75111j34763n1932l7310N514K2522k6242j3883l3983j6591M4967N0836
17580F84246k9753L0932l1447l6182K2050q7606k702J257L8417n4382p3226k3721
17568D37883l3755J13248k3268o9976N06R099Q1894K1916N7264j6723K2704m4550
17556E56242o0623q1079j4187J3491K3197l749O8736P5194N2965K921m7121k5417
17544E60570k3653q2087L1010M4826K6988J8457m8628k928J11775j0540n8138
17533E67652J3018N7801J01099K1822J8910R3587N0204k3066n6443p1931O2997
17522H35650O5613l0820o4628j21458J3304Q558n6345n4955m3525j4397M8741
$$ plain form
17511 585738 617069 621232 607797 699784 702175 665499 715343 761296 806597 860709 759238 678874
17499 678874 675700 680572 652830 653961 715435 690449 698191 626745 594147 508187 501166 520007
17487 520007 472739 427405 449091 511593 551338 562036 618748 644075 601880 639180 647008 643359
17475 643359 634597 613743 603717 620627 648810 677858 659769 580884 611938 609036 624259 687750
17463 687750 781435 818396 859279 787291 814894 992049 917855 927442 1009635 1129077 1185220
17452 1185220 1242232 1304865 1469623 1571183 1575319 1671612 1776981 1834983 1768255 1726780 1772652
17441 1772652 1850841 2057546 2112000 1949332 1690152 1596635 1525626 1347998 1150364 1099697
17431 1099697 1092829 1015434 993091 968453 831608 848042 909471 998356 1110253 1120706 1051709
$$ packed form
17511E85738L1331M163j3435R1987K391l6676M9844M5953M5301N4112j01471q0364
17499F78874l174M872k7742J131O1474k4986P742p1446l2598q5960p021J8841
17487E20007m7268m5334K1686O2502L9745J0698N6712K5327m2195L7300P828l649
17475F43359q762k0854j0026J6910K8183K9048j8089p8885L1054k902J5223O3491
17463F87750R3685L6961M0883p1988K7603J77155p4194R587Q2193J19442N6143
17452A185220N7012O2633J64758J01560M136R6293J05369N8002o6728m1475M5872
17441A772652P8189K06705N4454j62668k59180r3517p1009j77628j97634n0667
17431A099697o868p7395k2343k4638j36845J6434O1429Q8885J11897J0453o8997
$$ plain form
17420 1051709 1024123 991344 991469 1026056 1007462 972060 998511 971862 905364 850816 863039 963078
17408 963078 953182 1000434 1024010 970051 941774 939335 925684 954189 967796 912776 952660 998262
17396 998262 978496 986079 1003135 1072565 1174845 1110834 985500 962278 988867 952883 894090
17385 894090 865929 887566 955893 1062527 1193345 1150209 1098396 1051537 1054199 1105760 1091035
17374 1091035 1108179 1146387 1160530 1140316 1139761 1067061 1088036 1110532 1173723 1195438 1176304 1198609
17362 1198609 1206251 1263671 1303351 1303162 1240721 1315278 1325169 1249129 1103137 1111875 1178580 1197531
17350 1197531 1261487 1315960 1325710 1274667 1209225 1246078 1315561 1341290 1390335 1426323 1357872
17339 1357872 1312851 1367970 1352888 1306859 1300461 1274450 1283715 1312835 1333159 1228035 1277626
$$ packed form
17420A051709k7586l2779J25L4587j8594l5402K6451k6649o6498n4548J2223J00039
17408I63078r896M7252K3576n3959k8277k439j3651K8505J3607n5020L9884M5602
17396I98262j9766P583J7056O9430J02280o4011j25334k3222K6589l5984n8793
17385H94090k8161K1637O8327J06634J30818m3136n1813m6859K662N1561j4725
17374A091035J7144L8208J4143k0214n55p2700K0975K2496O3191K1715j9134K2305
17362A198609P642N7420L9680j89o2441P4557R891p6040j45992Q738O6705J8951
17350A197531O3956N4473R750n1043o5442L6853O9483K5729M9045L5988o8451
17339A357872m5021N5119j5082m6029o398k6011R265K9120K0324j05124M9591
$$ plain form
17328 1277626 1324924 1236515 1193342 1240146 1191845 1220163 1278172 1287372 1343167 1357934 1288721
17317 1288721 1312155 1389207 1402744 1397659 1422120 1405551 1356666 1342884 1370858 1402783 1411228 1485959
17305 1485959 1396578 1316261 1348062 1331946 1359671 1429650 1430886 1359269 1271389 1214392 1172906
17294 1172906 1248836 1407775 1427118 1416816 1443821 1505801 1460682 1420467 1432633 1491012 1486482
17283 1486482 1499237 1518863 1495669 1406462 1360140 1439536 1414519 1351818 1377473 1407898 1466276
17272 1466276 1477320 1463251 1459663 1518197 1660945 1742875 1683464 1630435 1609285 1659071 1613879
17261 1613879 1621017 1642988 1656950 1671041 1641339 1659395 1616469 1668976 1698678 1672210 1641023
17250 1641023 1602952 1618826 1681583 1701778 1690382 1684948 1630577 1630956 1699508 1731997 1755519 1809090
$$ packed form
17328A277626M7298q8409m3173M6804m8301K8318N8009R200N5795J4767o9213
17317A288721K3434P7052J3537n085K4461j6569m8885j3782K7974L1925Q445P4731
17305A485959q9381q0317L1801j6116K7725O9979J236p1617q7880n6997m1486
17294A172906P5930J58939J9343j0302K7005O1980m5119m0215J2166N8379m530
17283A486482J2755J9626k3194q9207m6322P9396k5017o2701K5655L0425N8378
17272A466276J1044j4069l588N8534J42748Q1930n9411n3029k1150M9786m5192
17261A613879P138K1971J3962J4091k9702J8056m2926N2507K9702k6468l1187
17250A641023l8071J5874O2757K0195j1396n434n4371L79O8552L2489K3522N3571
$$ plain form
17238 1809090 1870973 1916662 1893376 1845929 1764486 1760482 1877821 1885519 1840086 1915641 1916394 1892051
17226 1892051 1898725 1885432 1977761 2031362 2089706 2070583 2025093 2019610 2125490 2172650 2082146
17215 2082146 1980805 1918111 1925599 1889291 1888810 1901655 1927423 1960407 1983391 1972868 2094571
17204 2094571 2174408 2109015 2066330 2106569 2066017 2069713 2065191 2115167 2111233 2225848 2238572 2195239
17192 2195239 2179754 2223081 2219951 2228588 2284831 2307482 2324710 2293793 2247157 2291422 2272440 2145852
17180 2145852 2096273 2183838 2333954 2419526 2431846 2412402 2426521 2445197 2546720 2632916 2664370
17169 2664370 2575819 2504509 2539571 2629200 2587211 2568406 2630148 2589170 2584256 2603341 2575974
17158 2575974 2551569 2544720 2472697 2460279 2453295 2458216 2512634 2602429 2753637 2762179 2752022 2680820
$$ packed form
17238A809090O1883M5689k3286m7447q1443m004J17339P698m5433P5555P53k4343
17226A892051O674j3293R2329N3601N8344j9123m5490n483J05880M7160r0504
17215B082146j01341o2694P488l6308m81J2845K5768L2984K2984j0523J21703
17204B094571P9837o5393m2685M0239m0552L696m522M9976l934J14615J2724m3333
17192B195239j5485M3327l130Q637N6243K2651J7228l0917m6636M4265j8982j26588
17180B145852m9579Q7565J50116Q5572J2320j9444J4119J8676J01523Q6196L1454
17169B664370q8551p1310L5062Q9629m1989j8805O1742m0978m914J9085k7367
17158B575974k4405o849p2023j2418o984M921N4418Q9795J51208Q542j0157p1202
$$ plain form
17146 2680820 2741447 2723080 2690756 2780495 2856768 2911549 2900625 2828161 2867716 2865825 2931705
17135 2931705 2946188 2995758 3068107 3069619 3098220 3248111 3399960 3636177 3827478 4022570
17125 4022570 4210870 4383588 4517475 4642581 4876742 5004309 5083005 5023236 5035838 4925103
17115 4925103 4685233 4456400 4272189 4100132 3960629 3803879 3700349 3623761 3587894 3599136
17105 3599136 3523662 3480586 3422956 3365274 3458121 3527369 3526163 3524832 3496692 3432123 3506505 3568790
17093 3568790 3478731 3548998 3580910 3593825 3620019 3628577 3672393 3731253 3808830 3809149 3852645 3883816
17081 3883816 3885655 3922938 3957919 3922901 3967839 3990602 3941691 3970181 3910700 3944264 4000830
17070 4000830 4049711 4068590 4128127 4125221 4110225 4073737 4100170 4131366 4261614 4291352 4271315
$$ packed form
17146B680820O0627j8367l2324Q9739P6273N4781j0924p2464L9555j891O5880
17135B931705J4483M9570P2349J512K8601J49891J51849K36217J91301J95092
17125D022570J88300J72718J33887J25106K34161J27567P8696n9769J2602j10735
17115D925103k39870k28833j84211j72057j39503j56750j03530p6588l5867J1242
17105C599136p5474m3076n7630n7682R2847O9248j206j331k8140o4569P4382O2285
17093C568790r0059P0267L1912J2915K6194Q558M3816N8860P7577L19M3496L1171
17081C883816J839L7283L4981l5018M4938K2763m8911K8490n9481L3564N6566
17070D000830M8881J8879N9537k906j4996l6488K6433L1196J30248K9738k0037
$$ plain form
17059 4271315 4217099 4299846 4387457 4368500 4455922 4502779 4507796 4539845 4609865 4595045 4550235
17048 4550235 4593428 4642245 4658831 4710998 4688893 4678231 4716022 4734153 4749711 4719147 4774189
17037 4774189 4938090 5038697 5183084 5185460 5091767 5044113 5041221 5029888 5028977 5073316 5176789
17026 5176789 5201148 5222727 5207017 5297731 5406140 5428057 5456788 5433224 5394066 5458439 5594271
17015 5594271 5664436 5648246 5606637 5635262 5704455 5769452 5822342 5742641 5727844 5816573 5972595
17004 5972595 5938071 5851365 5811048 5902575 5990182 6073001 6169090 6299761 6373364 6409378 6469191
16993 6469191 6445512 6394509 6394262 6518650 6646832 6695315 6703198 6704788 6735510 6734532 6790313 6850913
16981 6850913 6843078 6903298 6923743 7024284 7122539 7255191 7374511 7387514 7433279 7464256 7449226
$$ packed form
17059D271315n4216Q2747Q7611j8957Q7422M6857N017L2049P0020j4820m4810
17048D550235M3193M8817J6586N2167k2105j0662L7791J8131J5558l0564N5042
17037D774189J63901J00607J44387K376r3693m7654k892j1333r11M4339J03473
17026E176789K4359K1579j5710R0714J08409K1917K8731k3564l9158O4373J35832
17015E594271P0165j6190m1609K8625O9193O4997N2890p9701j4797Q8729J56022
17004E972595l4524q6706m0317R1527Q7607Q2819R6089J30671P3603L6014N9813
16993F469191k3679n1003k47J24388J28182M8483P883J590L0722r78N5781O0600
16981F850913p835O0220K0445J00541R8255J32652J19320J3003M5765L0977j5030
$$ plain form
16970 7449226 7534632 7594417 7667041 7656366 7757889 7796392 7741154 7729390 7861732 7953446 8020048
16959 8020048 8104017 8271930 8381468 8489235 8469571 8496491 8558620 8623304 8610584 8570235 8627825
16948 8627825 8693427 8847808 8928088 8946750 8982606 9124115 9307466 9393805 9367177 9419509 9601527
16937 9601527 9626884 9657682 9665293 9728639 9835460 10001254 10078494 10159876 10317603 10352761 10438363
16926 10438363 10513454 10642942 10708697 10778817 10862465 10944696 11081595 11206964 11318638 11387335
16916 11387335 11404166 11531223 11710067 11728145 11707268 11845741 11920694 11999107 12101094 12173861
16906 12173861 12285112 12413802 12484739 12575300 12683646 12814820 12998342 13131124 13263610 13312052
16896 13312052 13436993 13544725 13693955 13824379 13952781 14051157 14206179 14353332 14463370
$$ packed form
16970G449226Q5406N9785P2624j0675J01523L8503n5238j1764J32342R1714O6602
16959H020048Q3969J67913J09538J07767j9664K6920O2129O4684j2720m0349N7590
16948H627825O5602J54381Q0280J8662L5856J41509J83351Q6339k6628N2332J82018
16937I601527K5357L0798P611O3346J06821J65794P7240Q1382J57727L5158Q5602
16926A0438363P5091J29488O5755P0120Q3648Q2231J36899J25369J11674O8697
16916A1387335J6831J27057J78844J8078k0877J38473P4953P8413J01987P2767
16906A2173861J11251J28690P0937R0561J08346J31174J83522J32782J32486M8442
16896A3312052J24941J07732J49230J30424J28402R8376J55022J47153J10038
$$ plain form
16887 14463370 14620992 14708547 14814153 14910243 15022028 15189906 15405110 15596811 15717574 15778660
16877 15778660 15882316 16078652 16215137 16357044 16503221 16668319 16703158 16831459 17098774
16868 17098774 17381634 17600970 17781777 17900967 18029375 18164623 18303065 18509814 18680568
16859 18680568 18855427 19011879 19125865 19327007 19548833 19681165 19928192 20114529 20244007
16850 20244007 20418802 20590459 20793911 20963903 21114891 21232813 21390368 21665197 21877650
16841 21877650 22086527 22273005 22479768 22721957 23009048 23187856 23313343 23462546 23668219
16832 23668219 23997426 24263002 24482361 24680032 24845954 25012521 25230735 25369666 25598390
16823 25598390 25838667 26061541 26370254 26596054 26775237 26955510 27249931 27549779 27809043
$$ packed form
16887A4463370J57622Q7555J05606R6090J11785J67878K15204J91701J20763O1086
16877A5778660J03656J96336J36485J41907J46177J65098L4839J28301K67315
16868A7098774K82860K19336J80807J19190J28408J35248J38442K06749J70754
16859A8680568J74859J56452J13986K01142K21826J32332K47027J86337J29478
16850B0244007J74795J71657K03452J69992J50988J17922J57555K74829K12453
16841B1877650K08877J86478K06763K42189K87091J78808J25487J49203K05673
16832B3668219L29207K65576K19359J97671J65922J66567K18214J38931K28724
16823B5598390K40277K22874L08713K25800J79183J80273K94421K99848K59264
$$ plain form
16814 27809043 27991428 28247629 28386071 28499315 28704338 29019786 29273239 29531230 29648990
16805 29648990 29836257 30152782 30378663 30536167 30765690 30999512 31269551 31496528 31639423
16796 31639423 31941300 32156591 32291991 32505079 32695769 32862364 33069259 33307126 33521543
16787 33521543 33640445 33770772 33989986 34318693 34593625 34891971 35091309 35160260 35254937 35389760
16777 35389760 35581205 35815991 36049381 36130925 36186136 36356654 36490552 36536363 36672434 36847670
16767 36847670 36983202 37077454 37055165 37064348 37204808 37363846 37433592 37480417 37570133 37541151 37588202
16756 37588202 37656926 37667568 37695633 37779136 37816196 37760467 37751208 37795265 37863915 37979319 37987698
16745 37987698 37968044 37970773 37973387 37947518 37835615 37766167 37651737 37579850 37502119 37390527 37234962
$$ packed form
16814B7809043J82385K56201J38442J13244K05023L15448K53453K57991J17760
16805B9648990J87267L16525K25881J57504K29523K33822K70039K26977J42895
16796C1639423L01877K15291J35400K13088J90690J66595K06895K37867K14417
16787C3521543J18902J30327K19214L28707K74932K98346J99338O8951R4677J34823
16777C5389760J91445K34786K33390Q1544N5211J70518J33898M5811J36071J75236
16767C6847670J35532R4252k2289R183J40460J59038O9746M6825Q9716k8982M7051
16756C7588202O8724J0642K8065Q3503L7060n5729r259M4057O8650J15404Q379
16745C7987698j9654K729K614k5869j11903o9448j14430p1887p7731j11592j55565
$$ plain form
16734 37234962 37049622 36965478 36888398 36822157 36774998 36636163 36503021 36346252 36254328 36081422
16724 36081422 35793213 35647924 35500094 35394925 35245289 35082562 34962628 34693469 34510414
16715 34510414 34404470 34258473 34144796 33907162 33619874 33438778 33355620 33109274 32917380
16706 32917380 32688450 32419832 32260486 31950080 31688312 31556196 31371851 31166776 30925903
16697 30925903 30648410 30335869 30064047 29887068 29613108 29303224 29085675 28907529 28770962
16688 28770962 28602954 28391657 28142346 27871267 27625755 27412988 27131511 26830633 26601350
16679 26601350 26438456 26317150 26054750 25747609 25561579 25320786 25107814 24872682 24667652
16670 24667652 24384933 24153772 23965374 23737623 23516557 23309109 23046780 22848821 22624080
$$ packed form
16734C7234962j85340q4144p7080o6241m7159j38835j33142j56769r1924j72906
16724C6081422k88209j45289j47830j05169j49636j62727j19934k69159j83055
16715C4510414j05944j45997j13677k37634k87288j81096q3158k46346j91894
16706C2917380k28930k68618j59346l10406k61768j32116j84345k05075k40873
16697C0925903k77493l12541k71822j76979k73960l09884k17549j78146j36567
16688B8770962j68008k11297k49311k71079k45512k12767k81477l00878k29283
16679B6601350j62894j21306k62400l07141j86030k40793k12972k35132k05030
16670B4667652k82719k31161j88398k27751k21066k07448k62329j97959k24741
$$ plain form
16661 22624080 22396982 22248004 22108312 21798711 21605064 21439325 21259546 21052435 20856875
16652 20856875 20567836 20290993 20042645 19858225 19774372 19731292 19583752 19269633 19005154 18822560
16642 18822560 18651594 18530485 18350411 18129514 17988189 17824471 17618744 17456797 17257715
16633 17257715 17122024 16930131 16789592 16630692 16451012 16341613 16212415 16050762 15933780
16624 15933780 15813798 15614324 15467228 15321951 15215122 15063907 14887178 14668507 14499078
16615 14499078 14427607 14304689 14161016 14060862 13913815 13767313 13614092 13567028 13432167 13233276
16605 13233276 13157820 13068005 12902885 12782777 12663612 12575725 12445438 12317997 12219020 12086454
16595 12086454 12023195 11924754 11832456 11663420 11547678 11450533 11418793 11276434 11147040 11012214
$$ packed form
16661B2624080k27098j48978j39692l09601j93647j65739j79779k07111j95560
16652B0856875k89039k76843k48348j84420q3853m3080j47540l14119k64479j82594
16642A8822560j70966j21109j80074k20897j41325j63718k05727j61947j99082
16633A7257715j35691j91893j40539j58900j79680j09399j29198j61653j16982
16624A5933780j19982j99474j47096j45277j06829j51215j76729k18671j69429
16615A4499078p1471j22918j43673j00154j47047j46502j53221m7064j34861j98891
16605A3233276p5456q9815j65120j20108j19165q7887j30287j27441r8977j32566
16595A2086454o3259r8441r2298j69036j15742r7145l1740j42359j29394j34826
$$ plain form
16585 11012214 10908099 10816783 10667128 10532088 10447148 10435977 10448124 10388205 10346775 10226182
16575 10226182 10081710 9984258 9954156 9920310 9914440 9721390 9506080 9525466 9481970 9446454 9372025
16564 9372025 9224051 9206877 9181014 9122487 9028801 8937218 8819501 8810418 8674183 8592247 8560578
16553 8560578 8545001 8525574 8458205 8436135 8356552 8202417 8089527 7988210 7914994 7982128 7947842
16542 7947842 7809218 7773145 7764877 7688299 7576288 7501728 7428738 7254084 7229330 7255507 7231930
16531 7231930 7251794 7243084 7201382 7097072 7113688 7142912 7092935 6943886 6875243 6842804 6814300
16520 6814300 6773620 6730962 6694351 6662736 6637622 6604299 6605963 6643096 6599635 6508094 6366791
16509 6366791 6272436 6260223 6275027 6234539 6176646 6060075 6008279 5970348 6050659 6076533 6130435
$$ packed form
16585A1012214j04115r1316j49655j35040q4940j1171J2147n9919m1430j20593
16575A0226182j44472r7452l0102l3846n870j93050k15310J9386m3496l5516p4429
16564I372025j47974j7174k5863n8527r3686r1583j17717r083j36235q1936l1669
16553H560578j5577j9427o7369k2070p9583j54135j12890j01317p3216O7134l4286
16542G947842j38624l6073q268p6578j12011p4560p2990j74654k4754K6177k3577
16531G231930J9864q710m1702j04310J6616K9224m9977j49049o8643l2439k8504
16520F814300m0680m2658l6611l1615k5114l3323J664L7133m3461r1541j41303
16509F366791r4355j2213J4804m0488n7893j16571n1796l7931Q0311K5874N3902
$$ plain form
16498 6130435 6180662 6058425 5926055 5888506 5801677 5602248 5616815 5740505 5668986 5580607
16488 5580607 5633399 5655045 5627573 5564464 5468504 5409809 5507120 5534428 5420288 5359201 5272204
16477 5272204 5171182 5180321 5230257 5321169 5306316 5182060 5105329 5073503 5081404 5180879 5203731
16466 5203731 5102359 5000501 4952207 4958127 5037994 5018735 4950056 4979633 4985581 4991367 4973800
16455 4973800 5012773 5057872 5123144 5186119 5225679 5261723 5341420 5464510 5584299 5632644 5801866
16444 5801866 5938780 5962363 5947315 5867568 5718829 5502789 5293132 5153853 5035882 4913947
16434 4913947 4701113 4501807 4369334 4277373 4242816 4199858 4083222 4047846 4031127 3947719
16424 3947719 3922439 3899380 3900051 3875732 3824397 3738270 3715439 3710774 3679539 3762456 3727059 3610536
$$ packed form
16498F130435N0227j22237j32370l7549q6829j99429J4567J23690p1519q8379
16488E580607N2792K1646k7472o3109r5960n8695R7311K7308j14140o1087q6997
16477E272204j01022R139M9936R0912j4853j24256p6731l1826P901R9475K2852
16466E203731j01372j01858m8294N920P9867j9259o8679K9577N948N786j7567
16455D973800L8973M5099O5272O2975L9560L6044P9697J23090J19789M8345J69222
16444E801866J36914K3583j5048p9747j48739k16040k09657j39279j17971j21935
16434D913947k12834j99306j32473r1961l4557m2958j16636l5376j6719q3408
16424C947719k5280k3059O71k4319n1335q6127k2831m665l1235Q2917l5397j16523
$$ plain form
16412 3610536 3536172 3506526 3450621 3434524 3364905 3276318 3268996 3305182 3319155 3284662 3177842
16401 3177842 3183694 3188905 3166898 3224674 3271573 3226714 3127837 3145070 3169751 3145202 3148119 3148021
16389 3148021 3209646 3124181 3018677 2961153 2900482 2886781 2906298 2814658 2755590 2759640 2769688
16378 2769688 2834765 2899283 2864732 2753943 2775661 2797607 2713493 2660189 2623729 2578980 2547647
16367 2547647 2477997 2447731 2525400 2542280 2522142 2472698 2449283 2416430 2436562 2496084 2524501
16356 2524501 2469011 2421438 2433762 2483434 2411015 2280662 2201800 2178515 2272940 2222095 2223409
16345 2223409 2225193 2225016 2270169 2347989 2274921 2300315 2226002 2201242 2165674 2167274 2162892 2160697
16333 2160697 2254170 2200280 2132014 2104722 2058957 2131105 2096680 2044924 2033172 1970364 1988676
$$ packed form
16412C610536p4364k9646n5905j6097o9619q8587p322L6186J3973l4493j06820
16401C177842N852N211k2007N7776M6899m4859r8877J7233K4681k4549K917r8
16389C148021O1625q5465j05504n7524o0671j3701J9517r1640n9068M050J0048
16378B769688O5077O4518l4551j10789K1718K1946q4114n3304l6460m4749l1333
16367B547647o9650l0266P7669J6880k0138m9444k3415l2853K0132N9522K8417
16356B524501n5490m7573J2324M9672p2419j30353p8862k3285R4425n0845J314
16345B223409J784j77M5153P7820p3068K5394p4313k4760l5568J600m382k195
16333B160697R3473n3890o8266k7292m5765P2148l4425n1756j1752o2808J8312
$$ plain form
16322 1988676 2029297 2037815 2012741 1952281 1864333 1832786 1832286 1836615 1886706 2015923 2011499 2001744
16310 2001744 2010412 1960687 1910250 1819036 1835259 1792131 1804430 1812369 1878769 1889090 1930727 1817874
16298 1817874 1752593 1786084 1719204 1641932 1737691 1815730 1724195 1691590 1669179 1712271 1724177
16287 1724177 1752562 1741809 1651730 1578202 1586914 1547355 1480935 1500450 1567329 1571704 1560673 1543645
16275 1543645 1493121 1472427 1538478 1585079 1442259 1382413 1468067 1566574 1578775 1557073 1450581
16264 1450581 1411880 1532674 1580585 1598365 1547831 1561860 1574315 1517578 1501428 1441603 1391068
16253 1391068 1386476 1384090 1410097 1409324 1341499 1320750 1249655 1285272 1318758 1345327 1247817 1202492
16241 1202492 1232129 1380557 1403946 1321072 1359122 1328951 1301060 1266994 1269419 1332871 1352802
$$ packed form
16322A988676M0621Q518k5074o0460q7948l1547n00M329N0091J29217m424r755
16310B001744Q668m9725n0437r1214J6223m3128J2299P939O6400J0321M1637j12853
16298A817874o5281L3491o6880p7272R5759P8039r1535l2605k2411M3092J1906
16287A724177K8385j0753r0079p3528Q712l9559o6420J9515O6879M375j1031j7028
16275A543645n0524k0694O6051M6601j42820n9846Q5654R8507J2201k1702j06492
16264A450581l8701J20794M7911J7780n0534J4029J2455n6737j6150n9825n0535
16253A391068m592k386K6007p73o7825k0749p1095L5617L3486K6569r7510m5325
16241A202492K9637J48428K3389q2874L8050l0171k7891l4066K425O3452J9931
$$ plain form
16230 1352802 1293765 1279993 1214773 1198143 1220423 1176828 1149011 1172229 1225549 1241421 1308519
16219 1308519 1433683 1440582 1390895 1248519 1230689 1254740 1210530 1152970 1190836 1189235 1143339
16208 1143339 1118917 1163684 1216767 1223069 1147310 1123796 1129524 1165140 1183057 1159486 1226702 1219841
16196 1219841 1193201 1174411 1162366 1149186 1172059 1186602 1143785 1141148 1160324 1148822 1118609
16185 1118609 1005981 965561 944682 1049016 1104715 967557 991195 1025597 945493 941713 955215
16174 955215 919499 914982 919479 979703 966897 923618 955780 947619 882070 884443 944303 905404
16162 905404 891784 827343 824053 846759 911860 913688 962336 958145 965220 982787 993793 903166
16150 903166 847744 790644 811867 829375 900604 964461 898356 837457 800218 775975 801334
$$ packed form
16230A352802n9037j3772o5220j6630K2280m3595k7817K3218N3320J5872O7098
16219A308519J25164O899m9687j42376j7830K4051m4210n7560L7866j601m5896
16208A143339k4422M4767N3083O302p5759k3514N728L5616J7917k3571O7216o861
16196A219841k6640j8790j2045j3180K2873J4543m2817k637J9176j1502l0213
16185A118609j12628m0420k0879J04334N5699j37158K3638L4402q0104l780J3502
16174I55215l5716m517M497O0224j2806m3279L2162q161o5549K373N9860l8899
16162I05404j3620o4441l290K2706O5101J828M8648m191P075J7567J1006r0627
16150I03166n5422n7100K1223J7508P1229O3857o6105o0899l7239k4243K5359
$$ plain form
16139 801334 865617 913209 823697 770563 797488 881290 838535 748730 796537 890952 848080
16128 848080 775643 829342 755756 688254 754677 754701 788872 813945 900534 944902 895615 824004
16116 824004 768096 766052 802954 850391 911197 933905 860248 806098 767574 729916 745193 747117
16104 747117 751230 768401 760957 764533 739012 669590 630789 653689 682090 723555 688067 687314
16092 687314 714247 684713 625784 619475 730799 808184 794377 807022 828172 836090 710295
16081 710295 647804 609395 679831 668263 723758 760303 789974 751297 653328 718252 781316
16070 781316 765845 698845 618499 639096 630946 603123 580585 578579 639892 650148 638775 588517
16058 588517 551592 550740 499483 522420 571216 688800 690399 625451 574743 502516 455141 475887
$$ packed form
16139H01334O4283M7592q9512n3134K6925Q3802m2755q9805M7807R4415m2872
16128H48080p2437N3699p3586o7502O6423K4L4171K5073Q6589M4368m9287p1611
16116H24004n5908k044L6902M7437O0806K2708p3657n4150l8524l7658J5277J924
16104G47117M113J7171p444L576k5521o9422l8801K2900K8401M1465l5488p53
16092F87314K6933k9534n8929o309J11324P7385j3807J2645K1150P918j25795
16081G10295o2491l8409P0436j1568N5495L6545K9671l8677r7969O4924O3064
16070G81316j5471o7000q0346K0597q150k7823k2538k006O1313J0256j1373n0258
16058E88517l6925q52n1257K2937M8796J17584J599o4948n0708p2227m7375K0746
$$ plain form
16046 475887 605540 633210 549796 560823 591301 561573 529064 508443 535307 574060 568690
16035 568690 589415 652122 601556 638656 553491 602689 662678 740032 763981 629930 586114
16024 586114 542336 477666 532107 626838 653020 580821 558173 591969 616746 632473 594340
16013 594340 615867 633569 643289 757032 891146 874219 766441 749994 788945 815176 800401
16002 800401 800723 830742 821842 845058 928034 1043157 1187140 1295493 1357186 1522944 1838230
15991 1838230 2198718 2517248 2824367 3202179 3560653 3844656 4022706 4094834 4048072 3936075
15981 3936075 3757018 3445279 3094998 2747345 2397085 2060422 1810379 1629324 1473783
15972 1473783 1295316 1098259 928919 852258 800288 828093 834047 827462 750119 726498 705916
$$ packed form
16046D75887J29653K7670q3414J1027L0478k9728l2509k0621K6864L8753n370
16035E68690K0725O2707n0566L7100q5165M9198N9989P7354K3949j34051m3816
16024E86114m3778o4670N4441R4731K6182p2199k2648L3796K4777J5727l8133
16013E94340K1527J7702R720J13743J34114j6927j07778j6447L8951K6231j4775
16002H00401L22L0019q900K3216Q2976J15123J43983J08353O1693J65758L15286
15991A838230L60488L18530L07119L77812L58474K84003J78050P2128m6762j11997
15981C936075j79057l11739l50281l47653l50260l36663k50043j81055j55541
15972A473783j78467j97057j69340p6661n1970K7805N954o585p7343k3621k0582
$$ plain form
15961 705916 651813 690691 700356 663770 545800 515905 440978 481063 543134 483717 504017
15950 504017 504645 520213 550738 503615 472328 426176 400811 366117 420243 514888 531260 549710
15938 549710 534787 550620 471888 424874 362404 345230 305880 397384 433828 481065 527224
15927 527224 496218 466366 433288 469109 501594 410121 461025 526755 466129 439700 389190
15916 389190 318541 299518 261356 289755 309885 342678 325183 289461 267830 366639 380129
15905 380129 317213 250768 263550 231574 256888 328836 314818 268534 270360 373753 373378 309061
15893 309061 390686 408319 384040 276609 258331 278082 370569 471276 531565 435552 357872
15882 357872 316773 276181 273172 289046 278889 345980 433952 442145 395848 349819 286199 328914
$$ packed form
15961G05916n4103L8878R665l6586j17970k9895p4927M0085O2071n9417K0300
15950E04017O28J5568L0525m7123l1287m6152k5365l4694N4126R4645J6372J8450
15938E49710j4923J5833p8732m7014o2470j7174l9350R1504L6444M7237M6159
15927E27224l1006k9852l3078L5821L2485r1473N0904O5730o0626k6429n0510
15916C89190p0649j9023l8162K8399K0130L2793j7495l5722k1631R8809J3490
15905C80129o2916o6445J2782l1976K5314P1948j4018m6284J826J03393l75o4317
15893C09061Q1625J7633k4279j07431j8278J9751R2487J00707O0289r6013p7680
15882C57872m1099m0592l009J5874j0157O7091Q7972Q193m6297m6029o3620M2715
$$ plain form
15870 328914 451455 463693 432121 458417 426012 394579 422905 401247 327339 267967 245024
15859 245024 272917 292677 379148 374914 297676 300907 337405 383939 435651 346647 265929 295646
15847 295646 464362 452914 255083 160250 210855 262437 303656 293651 268586 221788 255965
15836 255965 244995 271305 268250 321420 383364 344169 388994 388596 370760 341334 250058 212267
15824 212267 260531 262294 350753 327028 278370 286919 287115 177383 170247 204422 259989 166538
15812 166538 163491 172237 199416 187442 148437 221235 205870 117761 175175 199431 194077 198338
15800 198338 254368 187470 228857 300386 294514 312534 259779 214950 241989 318102 348833 295068
15788 295068 249178 193001 179884 153259 145422 161791 204256 161784 185035 183447 237672 266817
$$ packed form
15870C28914J22541J2238l1572K6296l2405l1433K8326k1658p3908n9372k2943
15859B45024K7893J9760Q6471m234p7238L231L6498M6534N1712q9004q0718K9717
15847B95646J68716j1448j97831r4833N0605N1582M1219j0005k5065m6798L4177
15836B55965j0970K6310l055N3170O1944l9195M4825l98j7836k9426r1276l7791
15824B12267M8264J763Q8459k3725m8658Q549J96j09732p136L4175N5567r3451
15812A66538l047Q746K7179j1974l9005P2798j5365q8109N7414K4256n354M261
15800A98338N6030o6898M1387P1529n872J8020n2755m4829K7039P6113L0731n3765
15788B95068m5890n6177j3117k6625p837J6369M2465m2472K3251j588N4225K9145
$$ plain form
15776 266817 289907 247944 252112 267178 263243 268233 221537 261479 305288 246116 225762 209499
15764 209499 177080 267055 293435 241096 167856 163892 152745 181889 236765 274884 240268 245578
15752 245578 197257 173775 169557 148316 159416 112600 128435 178222 248381 329910 364500 289157
15740 289157 199869 142362 113662 137366 154058 191753 240198 167184 181743 251728 239304
15729 239304 313150 347003 263690 122160 61005 112430 225629 253575 327653 223910 175033
15718 175033 254028 296449 277702 281266 224876 196512 161804 213570 268966 212984 158567 127741
15706 127741 161077 234175 246046 230108 221113 196899 196950 237752 249075 276889 362169 345280
15694 345280 255484 182382 284142 241359 205376 162695 97638 100694 159006 230494 236436 237798
$$ packed form
15776B66817K3090m1963M168J5066l935M990m6696L9942M3809n9172k0354j6263
15764B09499l2419Q9975K6380n2339p3240l964j1147K9144N4876L8119l4616N310
15752B45578m8321k3482m218k1241J1100m6816J5835M9787P0159Q1529L4590p5343
15740B89157q9288n7507k8700K3704J6692L7695M8445p3014J4559O9985j2424
15729B39304P3846L3853q3313j41530o1155N1425J13199K7946P4078j03743m8877
15718A75033P8995M2421j8747L564n6390k8364l4708N1766N5396n5982n4417l0826
15706A27741L3336P3098J1871j5938q995k4214N1M0802J1323K7814Q5280j6889
15694C45280q9796p3102J01760m2783l5983m2681o5057L056N8312P1488N942J362
$$ plain form
15682 237798 309798 270670 203029 261749 275584 182090 120722 137740 120273 209098 288543
15671 288543 278362 272287 230788 209082 235189 250945 181983 110214 70635 92399 86265 129910
15659 129910 209500 176264 134061 68298 68633 119579 154242 182937 210957 253926 267105 166133
15647 166133 81079 206469 236155 193951 193891 96348 -18558 37183 84710 -22858 59200
15636 59200 237406 195798 134891 121077 142487 213597 129703 133724 186950 186613 144643 137080
15624 137080 142174 86135 49036 -15691 118589 117547 22459 -30935 80844 153975 134486
15613 134486 79084 144751 139366 103533 102212 107879 146315 182708 135855 145191 155417 202020
15601 202020 114557 -22946 -6802 63462 78348 148324 107214 -17911 -41354 -67934 -26073
$$ packed form
15682B37798P2000l9128o7641N8720J3835r3494o1368J7018j7467Q8825P9445
15671B88543j0181o075m1499k1706K6107J5756o8962p1769l9579K1764o134M3645
15659A29910P9590l3236m2203o5763L35N0946L4663K8695K8020M2969J3179j00972
15647A66133q5054J25390K9686m2204o0r7543j14906N5741M7527j07568Q2058
15636E9200J78206m1608o0907j3814K1410P1110q3894M021N3226l37m1970p563
15624A37080N094n6039l7099o4727J34280j042r5088n3394J11779P3131j9489
15613A34486n5402O5667n385l5833j321N667L8436L6393m6853R336J0226M6603
15601B02020q7463j37503J6144P0264J4886O9976m1110j25125k3443k6580M1861
$$ plain form
15590 -26073 94022 125323 46381 43870 74144 146209 135171 55518 -29946 -68833 -38509 80079
15578 80079 109253 200364 221925 211834 168714 210364 204767 202116 240695 262627 143258 22325
15566 22325 -24142 -44986 67027 44862 -1028 5425 -36182 23187 71537 -27605 -35649 4010
15554 4010 56502 108230 151464 160137 177620 181069 116188 73630 1054 -2715 14527 42417
15542 42417 118547 182560 243290 243829 166303 112768 218467 291442 162552 139675 157616 115668
15530 115668 69679 104679 101385 -1477 -3213 -77024 -62075 45914 1176 -61503 -15439
15519 -15439 50628 124509 109354 96059 87770 139506 208652 212472 174368 132468 37186 -29019
15507 -29019 13712 -18753 -4863 -10099 -8899 68998 90300 3650 -13700 -29765 6048 35221
$$ packed form
15590b6073J20095L1301p8942k511L0274P2065j1038p9653q5464l8887L0324J18588
15578H0079K9174R1111K1561j0091m3120M1650n597k651L8579K1932j19369j20933
15566B2325m6467k0844J12013k2165m5890O453m1607N9369M8350r9142q044L9659
15554D010N2492N1728M3234Q673J7483L449o4881m2558p2576l769J7242K7890
15542D2417P6130O4013O0730N39p7526n3535J05699P2975j28890k2877J7941m1948
15530A15668m5989L5000l294j02862j736p3811J4949J07989m4738o2679M6064
15519a5439O6067P3881j5155j3295q289N1736O9146L820l8104m1900r5282o6205
15507b9019M2731l2465J3890n236J200P7897K1302q6650j7350j6065L5813K9173
$$ plain form
15495 35221 43212 25465 1864 -24573 -23564 -1580 41385 185803 194971 134981 49495 9023
15483 9023 973 6397 15498 -55062 -52667 -14242 4428 14070 69905 40592 66924 81991 41558
15470 41558 41532 141 48070 93338 74406 121534 142060 92226 118841 88694 25566 65226
15458 65226 117273 115808 108702 34893 -12796 -9178 -48422 -96527 -48138 23852 12281 40532
15446 40532 67640 57809 -2292 4340 72575 37339 -27250 -43345 -22887 19607 89903 66843
15434 66843 5589 59582 -6889 -64403 -32960 -12869 -7340 42738 29135 61436 52374 38718
15422 38718 42197 35998 -904 24237 35693 40739 73182 108401 127860 97336 308 -27852
15410 -27852 3764 25608 20519 96244 97341 110541 34055 36179 62280 38358 43681 31696
$$ packed form
15495C5221P991j7747k3601k6437J009K1984M2965J44418R168n9990q5486m0472
15483I023q050N424R101p0560K395L8425J8670R642N5835k9313K6332J5067m0433
15470D1558k6m1391M7929M5268j8932M7128K0526m9834K6615l0147o3128L9660
15458F5226N2047j465p106p3809m7689L618l9244m8105M8389P1990j1571K8251
15446D0532K7108r831o0101O632O8235l5236o4589j6095K0458M2494P0296k3060
15434F6843o1254N3993o6471n7514L1443K0091N529N0078j3603L2301r062j3656
15422C8718L479o199l6902K5141J1456N046L2443L5219J9459l0524r7028k8160
15410b7852L1616K1844n089P5725J097J3200p6486K124K6101k3922N323j1985
$$ plain form
15398 31696 -1677 -12060 88031 145816 133952 56575 -8790 40345 86649 173826 117474
15387 117474 30731 -23848 -79315 94289 301973 339194 151634 57880 38970 -5169 15536
15376 15536 93458 112408 146889 103629 135595 59776 5104 21114 97212 208288 225623
15365 225623 116226 128785 103678 57408 65646 63976 48036 18081 43534 39811 21571 60154
15353 60154 115126 149396 184823 146170 58558 59177 95444 93810 68321 -44058 -60073 5604
15341 5604 17569 16298 -2401 -74531 -78776 -37801 72587 118269 154818 98599 16193 53661
15329 53661 4468 100963 97487 92243 119276 115390 114420 121946 63097 98268 151747 156663 83577
15316 83577 143569 184802 183684 201997 244272 107433 100241 96610 97006 22669 80976 88123 -14935
$$ packed form
15398C1696l3373j0383J00091N7785j1864p7377o5365M9135M6304Q7177n6352
15387A17474q6743n4579n5467J73604K07684L7221j87560r3754j8910m4139K0705
15376A5536P7922J8950L4481m3260L1966p5819n4672J6010P6098J11076J7335
15365B25623j09397J2559k5107m6270Q238j670j5940k9955K5453l723j8240L8583
15353F0154N4972L4270L5427l8653q7612O19L6267j634k5489j12379j6015O5677
15341E604J1965j271j8699p2130m245M0975J10388M5682L6549n6219q2406L7468
15329E3661m9193R6495l476n244K7033l886r70P526n8849L5171N3479M916p3086
15316H3577N9992M1233j118J8313M2275j36839p192l631L96p4337N8307P147j03058
$$ plain form
15303 -14935 -21491 16403 53043 40071 39896 20333 -21593 -50355 -94826 -134426 -47931 3150
15291 3150 -38155 102565 134072 175328 157132 159807 60756 44728 156227 204066 168110 46205
15279 46205 1905 -1790 -51866 -41278 16116 22418 -55350 -66975 -45205 -30749 -32001 289
15267 289 -11185 15719 86700 -24120 -137099 -181183 -137669 -85138 -11544 45775 -18944 -97446
15255 -97446 -47331 47866 13688 65682 113318 175708 180197 184671 203148 244210 242030 224376
15243 224376 173284 131143 99956 8406 -50468 -17589 54125 110745 113678 168929 98833 38439
15231 38439 85657 167983 110929 -7531 -100862 -92362 -118639 -144966 -211485 -171671 -110568 -63365
15219 -63365 -21777 59645 6508 9582 123093 159467 154135 101715 13408 -27132 50389 78903
$$ packed form
15303a4935o556L7894L6640j2972j75j9563m1926k8762m4471l9600Q6495N1081
15291C150m1305J40720L1507M1256j8196K675r9051j6028J11499M7839l5956j21905
15279D6205m4300l695n0076J0588N7394O302p7768j1625K1770J4456j252L2290
15267B89j1474K6904P0981j10820j12979m4084M3514N2531P3594N7319o4719p8502
15255i7446N0115R5197l4178N1994M7636O2390M489M474J8477M1062k180j7654
15243B24376n1092m2141l1187r1550n8874L2879P1714N6620K933N5251p0096o0394
15231C8439M7218Q2326n7054j18460r3331Q500k6277k6327o6519L9814O1103M7203
15219f3365M1588Q1422n3137L074J13511L6374n332n2420q8307m0540P7521K8514
$$ plain form
15207 78903 74795 126678 123423 -3639 -37054 -32663 -21652 819 -18043 -61490 -73326 -149086
15195 -149086 -73088 36543 73788 43174 92782 128089 53621 -70007 -69616 -49969 -60667
15184 -60667 -12860 -8455 -70013 -82786 -31625 24543 39072 21577 56434 22984 -1366 -60305
15172 -60305 -25409 40854 21805 34058 22672 -46005 -19172 8778 -2085 1407 55641 41362
15160 41362 44118 42830 83529 145066 102862 74808 76904 117344 74896 38005 -5252 38918
15148 38918 132869 212913 255324 110589 43139 71744 3823 -59019 -91274 -10696 88496
15137 88496 99779 46690 36911 16390 22496 75052 148921 195185 219046 209027 189820 161773
15125 161773 99504 42192 65541 68141 89528 63990 -70087 -96004 11541 94137 133662
$$ packed form
15207G8903m108N1883l255j27062l3415M391J1011K2471j8862m3447j1836p5760
15195a49086P5998J09631L7245l0614M9608L5307p4468j23628L91J9647j0698
15184f0667M7807M405o1558j2773N1161N6168J4529j7495L4857l3450k4350n8939
15172f0305L4896O6263j9049J2253j1386o8677K6833K7950j0863L492N4234j4279
15160D1362K756j288M0699O1537m2204k8054K096M0440m2448l6891m3257M4170
15148C8918R3951Q0044M2411j44735o7450K8605o7921o2842l2255Q0578R9192
15137H8496J1283n3089r779k0521O106N2556P3869M6264K3861j0019j9207k8047
15125A61773o2269n7312K3349K600K1387k5538j34077k5917J07545Q2596L9525
$$ plain form
15114 133662 86517 109306 155301 132996 81163 41255 30455 122758 139201 52515 96001
15103 96001 172313 152955 130535 76252 40477 17719 -5458 -16245 -19896 18987 -8278 2387
15091 2387 -10504 -21732 40489 25611 -66149 -162621 -164507 -151620 -131678 -41251 -978 60458
15079 60458 48760 -12934 -76600 -90828 -107013 -99210 -142327 -141934 -51682 -16825 -17316 -51976 -132292
15066 -132292 -138919 -99809 -20295 -46061 -92465 -125615 -145759 -105418 -50294 -42705 -31939 -3374
15054 -3374 -21780 -60892 -45465 59623 110853 188447 184697 126569 104706 161281 131902 145736
15042 145736 129196 154817 205597 168729 171763 156062 82832 11932 -14089 31314 2273 -56592
15030 -56592 -100190 -93449 -82507 -60294 6380 -22619 -34914 -62426 -40512 -42952 -60257 -106125
$$ packed form
15114A33662m7145K2789M5995k2305n1833l9908j0800R2303J6443q6686M3486
15103I6001P6312j9358k2420n4283l5775k2758k3177j0787l651L8883k7265J0665
15091B387j2891j1228O2221j4878r1760r6472j886J2887J9942R0427M0273O1436
15079F0458j1698o1694o3666j4228j6185P803m3117L93R0252L4857m91l4660q0316
15066a32292o627L9110P9514k5766m6404l3150k0144M0341N5124P589J0766K8565
15054c374j8406l9112J5427J05088N1230P7594l750n8128k1863N6575k9379J3834
15042A45736j6540K5621N0780l6868L034j5701p3230p0900k6021M5403k9041n8865
15030e6592m3598O741J0942K2213O6674k8999j2295k7512K1914k440j7305m5868
$$ plain form
15018 -106125 -2256 47880 -352 -12745 -44467 -86032 -91800 -77896 -75176 -48000 -28261 -39309
15006 -39309 -3024 123599 158448 114694 83212 40529 -58567 -154954 -118429 -45971 -60409
14995 -60409 -25993 19207 15549 12418 -66478 -161876 -139356 -77510 -29463 13161 22052 43334
14983 43334 22040 -23245 1643 91517 69646 81829 82529 28201 -86553 -92715 -126908 -67243
14971 -67243 -3914 6164 -7083 27912 62257 45796 -18630 -21443 80057 152400 89753 158862
14959 158862 137188 -23336 -43647 141 11607 30889 -46198 -67170 -82888 -181510 -152910
14948 -152910 -40188 81531 137772 106976 44391 5264 -85652 -50897 73920 150064 146763
14937 146763 60361 35484 -10128 -31681 -40353 -66604 17872 -43805 -97796 -46815 18381 -72417
$$ packed form
15018a06125J03869N0136m8232j2393l1722m1565n768J3904K720K7176J9739j1048
15006c9309L6285J26623L4849m3754l1482m2683r9096r6387L6525P2458j4438
14995f0409L4416M5200l658l131p8896r5398K2520O1846M8047M2624Q891K1282
14983D3334k1294m5285K4888Q9874k1871J2183P00n4328j14754o162l4193N9665
14971f7243O3329J0078j3247L4995L4345j6461o4426k813J01500P2343o2647O9109
14959A58862k1674j60524k0311M3788J1466J9282p7087k0972j5718r8622K8600
14948a52910J12722J21719N6241l0796o2585l9127r0916L4755J24817P6144l301
14937A46763q6402k4877m5612k1553q672k6251Q4476o1677n3991N0981O5196r0798
$$ plain form
14925 -72417 -160899 -128953 -54540 -13310 28811 33952 -46414 -91630 -28376 -37326 -52989 -22666
14913 -22666 3897 -50520 -75450 -48677 62167 67368 -30894 -114358 -71892 -33822 -11189 40869
14901 40869 56486 47960 22623 -59208 -39351 -27705 7910 84133 112618 42231 -66426 -8285
14889 -8285 -28031 -74242 -75610 -25983 -59669 -95736 -50294 45892 120094 112079 -214 -93987
14877 -93987 -25300 16672 35920 -35812 9834 30721 49453 57721 42501 23213 564 -55021
14865 -55021 -27966 954 490 -85289 -62947 15002 -22720 7435 -13348 -9697 -15804 -1205
14853 -1205 99649 139650 118806 59418 29831 36930 12672 115749 145829 69294 27855 15436
14841 15436 18548 29566 104971 134608 84462 46625 94935 164521 175744 81650 56410 22451
$$ packed form
14925g2417q8482L1946P4413M1230M2121N141q0366m5216O3254q950j5663L0323
14913b2666K6563n4417k4930K6773J10844N201r8262q3464M2466L8070K2633N2058
14901D0869J5617q526k5337q1831J9857J1646L5615P6223K8485p0387j08657N8141
14889h285j9746m6211j368M9627l3686l6067M5442R6186P4202q015j12293r3773
14877i3987O8687M1972J9248p1732M5646K0887J8732Q268j5220j9288k2649n5585
14865e5021K7055K8920m64q5779K2342P7949l7722L0155k0783L651o107J4599
14853a205J00854M0001k0844n9388k9587P099k4258J03077L0080p6535m1439j2419
14841A5436L112J1018P5405K9637n0146l7837M8310O9586J1223r4094k5240l3959
$$ plain form
14829 22451 61625 150127 141105 127883 44612 85357 86270 -5028 -40395 41343 27239 -41591
14817 -41591 -72685 -61584 1405 -32700 -100719 -81420 -36782 -66512 -15384 32007 82267 28606
14805 28606 18614 30239 33256 74351 84155 19009 53087 -25906 -98348 -67019 -40982 -102199
14793 -102199 -126076 -82118 -22616 -103754 -183995 -108761 -43579 -26416 -102368 -102698 7250 55464
14781 55464 35240 15713 -13550 -16374 -29316 -50691 -82315 -89258 -325 19088 -4505 -16291
14769 -16291 32671 133419 114379 44230 14967 19310 15653 39456 2576 -21791 -89011 -89054
14757 -89054 -27325 -19988 -48816 27560 130517 83245 78602 4287 -47781 2686 -20009 -55965
14745 -55965 -80556 -95746 -64258 15802 6731 10622 19131 -57735 -133269 -197574 -163873 -124567
$$ packed form
14829B2451L9174Q8502r022j3222q3271M0745R13r1298l5367Q1738j4104o8830
14817d1591l1094J1101O2989l4105o8019J9299M4638k9730N1128M7391N0260n3661
14805B8606r992J1625L017M1095R804o5146L4078p8993p2442L1329K6037o1217
14793a02199k3877M3958N9502q1138q0241P5234O5182J7163p5952l30J09948M8214
14781E5464k0224j9527k9263k824j2942k1375l1624o943Q8933J9413k3593j1786
14769a6291M8962J00748j9040p0149k9263M343l657K3803l6880k4367o7220m3
14757h9054O1729P337k8828P6376J02957m7272m643p4315n2068N0467k2695l5956
14745e5965k4591j5190L1488Q0060r071L891Q509p6866p5534o4305L3701L9306
$$ plain form
14733 -124567 -72372 -47063 -29242 -3586 14218 90552 106917 119547 66782 42589 -35754
14722 -35754 -98407 -178335 -149221 -136447 -57491 -28771 11819 -82993 -141759 -121234 -99371 -61090
14710 -61090 -25060 -73285 -133919 -42398 28095 13884 -58004 -64798 -20863 29407 43711 4817
14698 4817 72385 62066 41386 75369 39626 -46284 -102922 -101374 -146687 -45229 -28380 -55253
14686 -55253 -45661 -117824 -123332 -48255 -5716 -24231 23460 -15889 -30502 -11838 -12506 -11069 -70570
14673 -70570 -12042 -50234 -41352 55149 53979 -9015 -67953 -45930 -81257 -159014 -205550 -134706
14661 -134706 -23049 -43701 -33803 13700 -64360 -69027 -64904 -72759 -80451 -105534 -59600 1570
14649 1570 -1632 7949 -47395 -31106 -32042 3685 72801 84778 109933 160599 154928 107796 -52989
$$ packed form
14733a24567N2195K5309J7821K5656J7804P6334J6365J2630n2765k4193p8343
14722c5754o2653p9928K9114J2774P8956K8720M0590r4812n8766K0525K1863L8281
14710f1090L6030m8225o0634R1521P0493j4211p1888o794M3935N0270J4304l8894
14698D817O7568j0319k0680L3983l5743q5910n6638J548m5313J01458J6849k6873
14686e5253R592p2163n508P5077M2539j8515M7691l9349j4613J8664o68J437n9501
14673g0570N8528l8192Q882R6501j170o2994n8938K2023l5327p7757m6536P0844
14661a34706J11657k0652R898M7503p8060m667M123p855p692k5083M5934O1170
14649A570l202R581n5344J6289r36L5727O9116J1977K5155N0666n671m7132j60785
$$ plain form
14636 -52989 -89661 -118611 -146345 -133884 -103209 -51176 15251 31512 54910 119694 90126 116489
14624 116489 77964 17480 -17342 -40709 -42626 -33864 -47677 -62408 17653 49994 29549 2384
14612 2384 6596 27961 -43415 -52845 44656 129171 68520 55681 -27006 -93073 -49711 -118448
14600 -118448 -80813 -29043 -22250 -40367 -118220 -158902 -45815 91688 93248 46790 -7289
14589 -7289 -76017 -99008 -72855 -10324 30664 24687 -13523 9925 135883 141391 95815 76464
14577 76464 16575 -30585 -67218 -100272 -12149 58515 75156 -78334 -150727 -65528 -9574
14566 -9574 5179 -26514 -38808 -104933 -141523 -78748 -79642 -122088 -59342 57478 38050 -38682
14554 -38682 -128496 -148794 -171197 -145438 -41649 30589 -28005 17690 -53554 -103320 -134921
$$ packed form
14636e2989l6672k8950k7734J2461L0675N2033O6427J6261K3398O4784k9568K6363
14624A16489l8525o0484l4822k3367j917Q762j3813j4731Q0061L2341k0445k7165
14612B384M212K1365p1376r430R7501Q4515o0651j2839q2687o6067M3362o8737
14600a18448L7635N1770O793j8117p7853m0682J13087J37503J560m6458n4079
14589g289o8728k2991K6153O2531M0988n977l8210K3448J25958N508m5576j9351
14577G6464n9889m7160l6633l3054Q8123P0664J6641j53490p2393Q5199N5954
14566i574J4753l1693j2294o6125l6590O2775q94m2446O2746J16820j9428p6732
14554c8682q9814k0298k2403K5759J03789P2238n8594M5695p1244m9766l1601
$$ plain form
14543 -134921 -74583 -81992 4151 14343 -20840 -13340 33379 30741 14806 -15375 40796 48443
14531 48443 20838 -67411 -60052 -26012 -58210 -78621 -40285 12271 26545 -9627 13731 27907
14519 27907 51765 29656 -4234 46374 87128 86080 80745 95775 74463 -26530 -93860 -82846
14507 -82846 -44138 -26263 15458 63542 51299 13500 61401 135881 89809 80523 78186 54103
14495 54103 24475 -5003 -16413 36237 120732 130066 112298 64707 20793 49157 106565 104159
14483 104159 83984 94156 76727 -9952 -86327 -93274 -87992 -103730 -121318 -133317 -12755 15859
14471 15859 11170 -64780 -171155 -243322 -215340 -130939 -55208 -59022 -54496 -50388 -123320 -131045
14459 -131045 -126123 -130271 -81042 -14223 37761 -1379 -16602 5316 67632 81454 63006 35127
$$ packed form
14543a34921O0338p409Q6143J0192l5183P500M6719k638j5935l0181N6171P647
14531D8443k7605q8249P359L4040l2198k0411L8336N2556J4274l6172K3358J4176
14519B7907K3858k2109l3890N0608M0754j048n335J5030k1312j00993o7330J1014
14507h2846L8708J7875M1721M8084j2243l7799M7901P4480m6072r286k337k4083
14495E4103k9628k9478j1410N2650Q4495R334j7768m7591m3914K8364N7408k406
14483A04159k0175J0172j7429q6679p6375o947N282j5738j7588j1999J20562K8614
14471A5859m689p5950j06375p2167K7982Q4401P5731l814M526M108p2932p725
14459a31045M922m148M9229O6819N1984l9140j5223K1918O2316J3822j8448k7879
$$ plain form
14447 35127 -83213 -106018 -76418 -75184 -72681 31174 -5332 -80326 -41820 -2203 65229 168606
14435 168606 117420 30778 -6000 29586 118223 97519 111912 105175 111229 146383 102290 5727
14423 5727 -15879 -77712 -10675 34242 58504 79148 30650 10752 66617 136997 134639 151343
14411 151343 93143 125170 129289 23360 -9749 -5169 -8383 70356 92710 26820 -5156 28847
14399 28847 -47610 -95803 -33823 -40648 -5403 16411 31060 12652 -9201 1441 -32648 -17253
14387 -17253 15045 70569 65729 80117 54893 31458 -11382 -53502 -30974 19152 56936 18643
14375 18643 22049 58482 116341 112186 -64360 -56886 34135 58862 4548 48485 22646 5381
14363 5381 38241 33964 100179 106289 45264 77111 84929 -8189 -98697 -108076 -66665 75349
$$ packed form
14447C5127j18340k2805K9600J234K503J03855l6506p4994L8506L9617O7432J03377
14435A68606n1186q6642l6778L5586Q8637k0704J4393o737O054L5154m4093r6563
14423E727k1606o1833O7037M4917K4262K0644m8498j9898N5865P0380k358J6704
14411A51343n8200L2027M119j05929l3109M580l214P8739K2354o5890l1976L4003
14399B8847p6457m8193O1980o825L5245K1814J4649j8408k1853J0642l4089J5395
14387a7253L2298N5524m840J4388k5224k3435m2840m2120K2528N0126L7784l8293
14375A8643L406L6433N7859m155j76546P474R1021K4727n4314M3937k5839j7265
14363E381L2860m277O6215O110o1025L1847P818r3118r0508r379M1411J42014
$$ plain form
14351 75349 99865 44511 155884 208280 223113 189490 162507 197566 179215 129809 132598 181944
14339 181944 130439 147436 81548 33002 52564 69418 103581 101165 42642 91818 159576 150939
14327 150939 94123 105244 167749 232298 271504 198323 268658 323584 288641 187126 111427
14316 111427 125359 148592 139013 135676 83598 3592 48502 58616 55271 104077 91534 36274
14304 36274 35498 99084 123753 134967 117493 38582 -1362 111721 184827 212582 237619 184662
14292 184662 177538 153102 166907 185961 125854 119302 130413 83145 120925 6135 117156
14281 117156 296507 258968 86960 79953 106828 58251 43131 93600 164879 178290 231707
14270 231707 348737 259791 221302 115872 23187 -25401 -69110 -23640 -58600 -27270 -55086
$$ packed form
14351G5349K4516n5354J11373N2396J4833l3623k6983L5059j8351m9406K789M9346
14339A81944n1505J6997o5888m8546J9562J6854L4163k416n8523M9176O7758q637
14327A50939n6816J1121O2505O4549L9206p3181P0335N4926l4943j01515p5699
14316A11427J3932K3233r579l337n2078q0006M4910J0114l345M8806j2543n5260
14304C6274p76O3586K4669J1214j7474p8911l9944J13083P3106K7755K5037n2957
14292A84662p124k4436J3805J9054o0107o552J1111m7268L7780j14790J11021
14281A17156J79351l7539j72008p007K6875m8577j5120N0469P1279J3411N3417
14270B31707J17030q8946l8489j05430r2685m8588m3709M5470l4960L1330k7816
$$ plain form
14259 -55086 -95629 38425 119827 237470 258813 283571 197146 195331 186078 144175 107767 69381
14247 69381 31846 102273 128860 -2229 -240 59011 38339 19425 -17403 32483 75310 115660
14235 115660 112479 111224 21761 -30196 -42763 -56671 -45207 -3824 41652 61512 39083 -81128
14223 -81128 -63157 621 104550 160163 115318 109111 149370 186607 149229 67360 104400 124484
14211 124484 89310 -17507 -38431 -34551 -3106 57418 108795 57232 32947 29473 15296 93337
14199 93337 78132 81480 89488 69655 70632 62547 99372 97718 23362 28866 70374 41506 75576
14186 75576 93623 157044 143932 21126 -84565 -87252 -83502 -49761 19063 4193 -54400 3572
14174 3572 23987 16342 -21672 -81322 -94473 -29863 15365 12732 -17071 -4165 26075 10530
$$ packed form
14259e5086m0543J34054Q1402J17643K1343K4758q6425j815r253m1903l6408l8386
14247F9381l7535P0427K6587j31089J989N9251k0672j8914l6828M9886M2827M0350
14235A15660l181j255q9463n1957j2567j3908J1464M1383M5476J9860k2429j20211
14223h1128J7971O3778J03929N5613m4845o207M0259L7237l7378q1869L7040K0084
14211A24484l5174j06817k0924L880L1445O0524N1377n1563k4285l474j4177P8041
14199I3337j5205L348Q008j9833R77q085L6825j654p4356N504M1508k8868L4070
14186G5576J8047O3421j3112j22806j05691k687L750L3741O8824j4870n8593N7972
14174C572K0415p645l8014n9650j3151O4610M5228k633k9803J2906L0240j5545
$$ plain form
14162 10530 92755 96266 79122 -6412 -39394 -6423 -5508 50850 40565 809 -97011 -30033
14150 -30033 -36067 -59274 -65323 -50879 -53672 10553 65136 25215 -30459 -80894 -102041 -64844
14138 -64844 44219 119090 177851 183234 204789 221415 176635 157398 111123 52856 56857 -574
14126 -574 -21314 51358 -640 66323 92965 89562 98403 140921 74745 48124 83878 57776
14114 57776 7103 33762 2164 4283 22154 59008 124614 133665 3894 -37302 13802 56765
14102 56765 84087 50599 85761 7226 -22500 35413 95939 45878 -37675 -34490 -41719 41292
14090 41292 33517 -1162 -19772 -27249 41791 1962 -16388 -67531 -114887 -104491 -117404 -1559
14078 -1559 10924 50482 38845 -23651 -11005 54170 2277 -16321 6704 10223 44362 82747
$$ packed form
14162A0530Q2225L511j7144q5534l2982L2971R15N6358j0285l9756r7820O6978
14150c0033o034k3207o049J4444k793O4225N4583l9921n5674n0435k1147L7197
14138f4844J09063P4871N8761N383K1555J6626m4780j9237m6275n8267M001n7431
14126e74k0740P2672n1998O6963K6642l403Q841M2518o6176k6621L5754k6102
14114E7776n0673K6659l1598K119J7871L6854O5606R051j29771m1196N1104M2963
14102E6765K7322l3488L5162p8535k9726N7913O0526n0061q3553L185p229Q3011
14090D1292p775l4679j8610p477O9040l9829j8350n1143m7356J0396j2913J15845
14078a559J2483L9558j1637o2496J2646O5175n1893j8598K3025L519L4139L8385
$$ plain form
14066 82747 76972 69585 61022 11747 -55387 -106275 -4252 76958 68211 19638 37672 13565
14054 13565 13446 -20358 -94952 -4014 26010 72447 -27673 -104905 -125731 -85514 -21936 11227
14042 11227 -37439 -71420 -58536 11482 102609 112502 136386 145248 242689 227417 177529 144756
14030 144756 42401 56407 65502 47388 108458 160656 172256 121629 98352 48555 2063
14019 2063 58885 83747 92438 76117 70550 76334 101984 136809 138015 105471 91675 162236 179557
14006 179557 182232 95512 90523 82906 115568 179043 262316 211002 197802 204233 250001 314406
13994 314406 391738 333487 273664 221488 206009 152718 178476 206494 189162 82957 95542
13983 95542 117352 189932 248935 358468 391880 408575 302663 286974 345652 436018 373155
$$ packed form
14066H2747n775p387q563m9275o7134n0888J02023Q1210q747m8573J8034k4107
14054A3565j19l3804p4594R0938L0024M6437j00120p7232k0826M0217O3578L3163
14042A1227m8666l3981J2884P0018R1127R893K3884Q862R7441j5272m9888l2773
14030A44756j02355J4006R095j8114O1070N2198J1600n0627k3277m9797m6492
14019B063N6822K4862Q691j6321n567N784K5650L4825J206l2544j3796P0561J7321
14006A79557K675q6720m989p617L2662O3475Q3273n1314j3200O431M5768O4405
13994C14406P7332n8251n9823n2176j5479n3291K5758K8018j7332j06205J2585
13983I5542K1810P2580N9003J09533L3412J6695j05912j5689N8678R0366o2863
$$ plain form
13972 373155 291230 310857 293378 273754 302573 323737 289371 328512 455694 495206 466702
13961 466702 429150 438633 394624 413494 408077 434947 488993 449960 413183 524557 659918
13950 659918 667550 611341 529978 441436 516051 631852 656371 686555 811031 885451 825607
13939 825607 772651 740535 668069 749197 800296 862478 842008 870652 942032 958319 952950 969500
13927 969500 908303 923461 896675 898526 934493 954256 947874 1004536 1039856 1062656 1080277 1088039
13915 1088039 1048072 1059606 1074954 1045882 1052966 1011024 991509 1052661 1093403 1061927 1043707
13904 1043707 970793 939612 948651 923773 920873 867264 812400 852019 809763 765129 732089 741523
13892 741523 750115 741663 725538 715822 701971 765821 731651 745882 746400 665484 564483 511869
$$ packed form
13972C73155q1925J9627j7479j9624K8819K1164l4366L9141J27182L9512k8504
13961D66702l7552R483m4009J8870n417K6870N4046l9033l6777J11374J35361
13950F59918P632n6209q1363q8542P4615J15801K4519L0184J24476P4420n9844
13939H25607n2956l2116p2466Q1128N1099O2182k0470K8644P1380J6287n369J6550
13927I69500o1197J5158k6786J851L5967J9763o382N6662L5320K2800J7621P762
13915A088039l9967J1534J5348k9072P084m1942j9515O1152M0742l1476j8220
13904A043707p2914l1181R039k4878k900n3609n4864L9619m2256m4634l3040R434
13892G41523Q592q452j6125r716j3851O3850l4170J4231N18q0916j01001n2614
$$ plain form
13880 511869 471340 500007 538703 444234 351293 377617 503091 434107 371018 401597 379530
13869 379530 308119 253659 266965 332577 328504 378334 494367 428410 295348 232361 175815
13858 175815 258841 242605 166186 122511 185326 352699 377351 391322 345819 222619 131696
13847 131696 219130 266007 181992 135923 165867 201074 184145 145516 163475 210027 195699
13836 195699 221006 208014 194695 177632 157069 199546 240778 236443 219559 156706 113524 170753
13824 170753 106019 16678 67888 125265 162598 161903 158369 162227 124907 186796 182222 172885 86388
13811 86388 43214 29392 86782 33121 91640 114562 15423 6332 -49701 -43473 -67575 -70518
13799 -70518 -35533 42399 55098 -28068 2968 41668 -18481 -11432 12937 16622 88729 98617
$$ packed form
13880E11869m0529K8667L8696r4469r2941K6324J25474o8984o3089L0579k2067
13869C79530p1411n4460J3306O5612m073M9830J16033o5957j33062o2987n6546
13858A75815Q3026j6236p6419m3675O2815J67373K4652J3971m5503j23200r0923
13847A31696Q7434M6877q4015m6069K9944L5207j6929l8629J7959M6552j4328
13836A95699K5307j2992j3319j7063k0563M2477M1232m335j6884o2853m3182N7229
13824A70753o4734q9341N1210N7377L7333o95l534L858l7320O1889m574r337q6497
13811H6388m3174j3822N7390n3661N8519K2922r9139r091n6033O228k4102k943
13799g0518L4985P7932J2699q3166L1036L8700o0149P049K4369L685P2107R888
$$ plain form
13787 98617 -34087 -166611 -208491 -126188 25182 47184 -41375 -25218 5780 68984 211811
13776 211811 268421 243497 255630 242831 116221 64332 108239 110410 138707 112865 49266
13765 49266 -78036 -72850 3883 20192 93186 113824 32088 -69236 -44435 -39817 -13310 16261
13753 16261 35148 56419 89833 49088 -44913 -121249 -119983 -45642 -34963 -114559 -173199 -145314
13741 -145314 -148943 -37401 37440 3495 -64245 -167026 -106504 -24749 37178 -11021 -72249
13730 -72249 -102877 -92869 -61452 10055 9076 -3075 -13271 -799 -3553 37884 -24481 -56877
13718 -56877 19561 101959 33972 -16262 -53456 -22222 52883 -91120 -109665 -15211 26396
13707 26396 -50286 -86948 -78985 -65503 35020 10556 -66610 23780 36241 15246 -96458
$$ packed form
13787I8617j32704j32524m1880Q2303J51370K2002q8559J6157L0998O3204J42827
13776B11811N6610k4924J2133j2799j26610n1889M3907K171K8297k5842o3599
13765D9266j27302N186P6733J6309P2994K0638q1736j01324K4801M618K6507K9571
13753A6261J8887K1271L3414m0745r4001p6336J266P4341J0679p9596n8640K7885
13741a45314l629J11542P4841l3945o7740j02781O0522Q1755O1927m8199o1228
13730g2249l0628J0008L1417P1507r79j2151j0196J2472k754M1437o2365l2396
13718e6877P6438Q2398o7987n0234l7194L1234P5105j44003j8545R4454M1607
13707B6396p6682l6662P963J3482J00523k4464p7166R0390J2461k0995j11704
$$ plain form
13696 -96458 -81731 -134808 -120794 -61754 -46071 -92034 -89283 -61937 -66444 -126044 -105773 -45678
13684 -45678 -17335 5239 10429 -41637 -13081 52648 109947 132816 62419 -40443 -79569 -124228
13672 -124228 -131142 -110386 -81967 -60257 -64921 -88251 -93150 -48753 -13258 -57543 -103170 -212415
13660 -212415 -150891 -47233 -16139 107217 144613 136904 109600 140338 152931 72720 -59428
13649 -59428 -16967 146190 169631 71386 49888 -4414 -12099 -494 52415 42415 -16162 -58824
13637 -58824 -74314 -120282 -113373 -79557 -49375 -3549 -17159 -52846 -38133 -2720 2079 72102
13625 72102 39537 -122269 -185731 -153205 -117319 -82574 -28543 -31539 -28032 -10958 32718 12498
13613 12498 -22878 -66532 -87215 -12985 -7017 -87824 -38756 13217 84114 54039 -28272 -18055
$$ packed form
13696i6458J4727n3077J4014N9040J5683m5963K751K7346m507n9600K0271O0095
13684d5678K8343K2574N190n2066K8556O5729N7299K2869p0397j02862l9126m4659
13672a24228o914K0756K8419K1710m664k3330m899M4397L5495m4285m5627j09245
13660b12415O1524J03658L1094J23356L7396p709k7304L0738J2593q0211j32148
13649e9428M2461J63157K3441r8245k1498n4302p685J1605N2909j0000n8577m2662
13637e8824j5490m5968O909L3816L0182M5826j3610l5687J4713L5413M799P0023
13625G2102l2565j61806o3462L2526L5886L4745N4031k996L507J7074M3676k0220
13613A2498l5376m3654k0683P4230N968q0807M9068N1973P0897l0075q2311J0217
$$ plain form
13601 -18055 33461 57662 33579 -3161 -12215 -26808 -114103 -90986 -37690 -72600 -103993 -29863
13589 -29863 58070 61044 -3947 -65883 -64115 -4306 67529 7449 -22489 -18698 32336 33387
13577 33387 27583 -57613 -79405 -37441 -51319 -30629 -36138 -112478 -117570 -130852 -79569 14357
13565 14357 48700 -18474 -121793 -117466 -88879 10116 10470 -3570 -39664 -1553 30434 5771
13553 5771 541 -29294 -91846 -95722 -99767 -87606 -26231 17658 -8916 43028 62758 5446
13541 5446 -34849 -51608 -104263 -183162 -205993 -136732 -72339 -86986 -125941 -147369 -55159 -41705
13529 -41705 -51782 -70176 29592 101628 104297 22358 -47534 -111671 -100458 -76930 -89150 -122614
13517 -122614 -221281 -184001 -49394 -85397 -127723 -123253 -146101 -98283 -76439 -47842 -138200
$$ packed form
13601a8055N1516K4201k4083l6740r054j4593q7295K3117N3296l4910l1393P4130
13589b9863Q7933K974o4991o1936J768N9809P1835o0080k9938L791N1034J051
13577C3387n804q5196k1792M1964j3878K0690n509p6340n092j3282N1283R3926
13565A4357L4343o7174j03319M327K8587R8995L54j4040l6094L8111L1987k4663
13553E771n230k9835o2552l876m045J2161O1375M3889k6574N1944J9730n7312
13541E446m0295j6759n2655p8899k2831O9261O4393j4647l8955k1428R2210J3454
13529d1705j0077j8394R9768P2036K669q1939o9892o4137J1213K3528j2220l3464
13517a22614r8667L7280J34607l6003m2326M470k2848M7818K1844K8597r0358
$$ plain form
13506 -138200 -67719 -39280 -102077 -88852 -59141 -67014 -34359 -70357 -46047 -96281 -189731 -192504
13494 -192504 -129724 -57292 -3054 -18015 -15613 25709 73576 44059 70285 66910 75964 140153
13482 140153 100998 69088 123279 77479 84638 102570 42434 101132 55843 -64619 -70363 -44643
13470 -44643 -44789 -39178 -93542 -92916 -115571 -101707 -145142 -157917 -51434 -8993 -37582 -77122
13458 -77122 -161949 -87788 102982 70067 51940 60140 81210 64503 103091 85899 -24287
13447 -24287 -60861 -78207 -22143 -49174 -7086 -26742 7931 -19307 -80579 -98366 -170542 -190785
13435 -190785 -197845 -108927 -57160 -46131 -93161 -89492 -122400 -106155 -142212 -145247 -90361 -106048
13423 -106048 -85957 -52161 -42323 26529 -3939 52212 60369 -61916 -92619 -16776 11830 50472
$$ packed form
13506a38200P0481K8439o2797J3225K9711p873L2655l5998K4310n0234r3450k773
13494a92504O2780P2432N4238j4961K402M1322M7867k9517K6226l375R054O4189
13482A40153l9155l1910N4191m5800P159J7932o0136N8698m5289j20462n744K5720
13470d4643j46N611n4364O26k2655J3864m3435j2775J06483M2441k8589l9540
13458g7122q4827P4161J90770l2915j8127Q200K1070j6707L8588j7192j10186
13447b4287l6574j7346N6064k7031M2088j9656L4673k7238o1272j7787p2176k0243
13435a90785p060Q8918N1767J1029m7030L669l2908J6245l6057l035N4886j5687
13423a06048K0091L3796R838O8852l0468N6151Q157j22285l0703P5843K8606L8642
$$ plain form
13411 50472 90683 19358 -49027 -86149 -93497 -148277 -195049 -151976 -160072 -209497 -208483 -143011
13399 -143011 -69603 -127548 -119225 -99756 -61462 -66384 -131277 -104705 -134800 -165836 -154048 -125401
13387 -125401 -62938 -66577 -141544 -118798 -23520 -73082 -80533 -56966 -5512 -47726 -79703 -66733
13375 -66733 -103505 -86011 -68866 -58757 -6895 16927 -51787 -72582 -86268 -82216 -19193 -17334
13363 -17334 -24767 -12936 -11452 -33733 -78202 -82586 -107864 -110257 -174436 -187231 -103888 -91392
13351 -91392 -121516 -92555 -58665 -71913 -88770 -117720 -114740 -35651 -60861 -96034 -11993 -53405
13339 -53405 -109741 -82440 -49766 8210 4287 -28190 -74654 -97543 -145373 -108147 -65645 -96274
13327 -96274 -192319 -186809 -122034 -130477 -97777 -115493 -49529 -109467 -222710 -237042 -192270 -148192
$$ packed form
13411E0472M0211p1325o8385l7122p348n4780m6772M3073q096m9425J014O5472
13399a43011P3408n7945Q323J9469L8294m922o4893K6572l0095l1036J1788K8647
13387a25401O2463l639p4967K2746R5278m9562p451K3567N1454m2214l1977J2970
13375f6733l6772J7494J7145J0109N1862K3822o8714k0795j3686M052O3023J859
13363a7334p433J1831J484k2281m4469m384k5278k393o4179j2795Q3343J2496
13351i1392l0124K8961L3890j3248j6857k8950K980P9089k5210l5173Q4041m1412
13339e3405n6336K7301L2674N7976l923l2477m6464k2889m7830L7226M2502l0629
13327i6274r6045N510O4775q443L2700j7716O5964n9938j13243j4332M4772M4078
$$ plain form
13315 -148192 -103326 -100065 -115227 -107388 -200554 -104118 -72111 -125978 -138283 -86865 -92103 -141527
13303 -141527 -90734 -54882 -53423 -55370 -23811 -64411 -16266 33933 -60487 -53435 -8578 62473
13291 62473 193287 182337 59263 -7348 3687 -26131 -118830 -89946 -45692 -37593 9314
13280 9314 -17942 -49801 8471 42622 3649 -32228 -33736 -48080 -38173 -102953 -65532 -79592
13268 -79592 -106808 -110360 -21211 38859 17524 -55587 -171762 -199323 -166232 -168857 -144629 -87024
13256 -87024 -19477 -43272 -46624 17263 -14251 -39059 -39720 -67538 -102311 -78914 530 -85835
13244 -85835 -124793 -114503 -37856 -4219 -35880 -98731 -89590 16686 40750 413 -1450 66380
13232 66380 41728 16448 -38579 -124409 -142976 -115926 -136569 -217718 -143801 -77448 -41952 582
$$ packed form
13315a48192M4866L261j5162P839r3166R6436L2007n3867j2305N1418n238m9424
13303a41527N0793L5852J459j947L1559m0600M8145N0199r4420P052M4857P1051
13291F2473J30814j0950j23074o6611J1035k9818r2699K8884M4254Q099M6907
13280I314k7256l1859N8272L4151l8973l5877j508j4344R907o4780L7421j4060
13268g9592k7216l552Q9149O0070k1335p3111j16175k7561L3091k625K4228N7605
13256h7024O7547k3795l352O3887l1514k4808o61k7818l4773K3397P9444q6365
13244h5835l8958J0290P6647L3637l1661o2851R141J06276K4064m0337j863O7830
13232F6380k4652k5280n5027q5830j8567K7050k0643q1149P3917O6353L5496M2534
$$ plain form
13220 582 -26614 -72120 -44169 -16515 -41353 -16944 132424 130981 50797 16028 38753 167772
13208 167772 335954 371162 250340 248880 278708 221340 272658 204989 168272 178132 134328
13197 134328 57574 64062 151213 81415 53322 98963 143146 173803 140840 58540 10351 -45719
13185 -45719 -108513 -96475 -99945 -74506 -17259 870 -39415 -76940 39229 72459 2195 28146
13173 28146 45751 99638 134722 95824 22894 76311 203992 348082 464605 638468 843173
13162 843173 1049696 1107178 1016431 798544 670513 520392 402079 322757 159646 161074
13152 161074 166638 76752 104074 179891 101924 24680 -20361 -48663 -28938 21147 13666 81532
13140 81532 164070 149275 77200 -6007 -49031 3334 -8963 108207 160693 103053 73128
$$ packed form
13220E82k7196m5506K7951K7654k4838K4409J49368j443q0184l4769K2725J29019
13208A67772J68182L5208j20822j460K9828n7368N1318o7669l6717R860m3804
13197A34328p6754O488Q7151o9798k8093M5641M4183L0657l2963q2300m8189n6070
13185d5719o2794J2038l470K5439N7247J8129m0285l7525J16169L3230p0264K5951
13173B8146J7605N3887L5084l8898p2930N3417J27681J44090J16523J73863K04705
13162H43173K06523N7482r0747k17887j28031j50121j18313p9322j63111J428
13152A61074N564q9886K7322P5817p7967p7244m5041k8302J9725N0085p481O7866
13140H1532Q2538j4795p2075q3207m3024N2365j2297J17170N2486n7640k9925
$$ plain form
13129 73128 -14618 -113968 -68132 75415 138995 275161 404114 444493 364563 416209 565104
13118 565104 761803 961530 1064873 1067780 926344 679370 480057 385142 263796 119471
13108 119471 -22546 -20451 37529 51556 55221 16273 -49377 11663 35090 9984 -26722 -126131
13096 -126131 -111558 24205 26228 17575 -21277 -16952 -59503 -102507 -84760 14804 51830 93739
13084 93739 82052 -24290 -139012 -88560 36885 141384 98915 80342 32435 -26496 4842
13073 4842 95554 212316 264106 302113 386795 317414 241801 244442 240967 204031 129077 147477
13061 147477 93022 54845 46337 51395 -40261 -18299 -19648 773 -15766 -139022 -39824 3442
13049 3442 11310 -11279 -12429 74553 105905 81108 21257 -56113 -66833 -35356 17856 20107
$$ packed form
13129G3128q7746r9350M5836J43547O3580J36166J28953M0379p9930N1646J48895
13118E65104J96699J99727J03343K907j41436k46974j99313r4915j21346j44325
13108A19471j42017K095N7980J4027L665l8948o5650O1040K3427k5106l6706r9409
13096a26131J4573J35763K023q653l8852M325m2551m3004J7747R9564L7026M1909
13084I3739j1687j06342j14722N0452J25445J04499m2469j8573m7907n8931L1338
13073D842R0712J16762N1790L8007Q4682o9381p5613K641l475l6936p4954J8400
13061A47477n4455l8177q508N058r1656K1962j349K0421j6539j23256R9198M3266
13049C442P868k2589j150Q6982L1352k4797n9851p7370j0720L1477N3212K251
$$ plain form
13037 20107 -28920 4779 -22796 -15069 12896 19017 56000 74844 61501 97625 72965 44085
13025 44085 8201 -14784 -32304 -78224 -56015 22550 -11296 41241 17224 -54887 -3780 51876
13013 51876 15064 -8282 -86866 -175764 -182688 -151654 -82885 -85890 -20661 -69385 -62163 -46828
13001 -46828 -20103 28706 74638 26863 -26855 9746 22707 1338 -33313 -57898 -21258 24667
12989 24667 46685 -3624 -39241 -7485 -24640 -53695 -2947 -46778 -48631 -12505 47637 84557
12977 84557 65377 84723 50218 -38187 -15064 -5608 42549 68893 27326 4376 2984 -117109
12965 -117109 -263446 -241186 -146531 -67562 -111745 -106892 -25957 22818 59384 -13283 -134587
12954 -134587 -202026 -165913 -95708 60934 70478 33592 21011 72613 146817 130678 143054
$$ packed form
13037B0107m9027L3699k7575P727K7965O121L6983J8844j3343L6124k4660k8880
13025D4085l5884k2985j7520m5920K2209P8565l3846N2537k4017p2111N1107N5656
13013E1876l6812k3346p8584q8898o924L1034O8769l005O5229m8724P222J5335
13001d6828K6725M8809M5932m7775n3718L6601J2961k1369l4651k4585L6640M5925
12989B4667K2018n0309l5617L1756j7155k9055N0748m3831j853L6126O0142L6920
12977H4557j9180J9346l4505q8405K3123R456M8157K6344m1567k2950j392j20093
12965a17109j46337K2260R4655P8969m4183M853Q0935M8775L6566p2667j21304
12954a34587o7439L6113P0205J56642R544l6886j2581N1602P4204j6139J2376
$$ plain form
12943 143054 41840 -45191 -24616 66765 107419 99844 35245 23974 -36722 -73068 -75647 11827
12931 11827 -19837 -91413 -159442 -190534 -110826 -62455 -94038 -120202 -67296 -57432 -83159 -48177
12919 -48177 -148132 -253517 -122530 -38916 -62122 -58648 -64416 -93850 -26144 20409 61676 73834
12907 73834 39190 -83831 -136273 -72955 -9987 -86528 -175826 -145566 -112734 -66991 -124069
12896 -124069 -129592 -81805 -26124 -92239 -192499 -151973 -8890 26749 29738 6390 -27032
12885 -27032 98698 250802 295708 307950 431406 476527 449684 336525 278473 226697 105098
12874 105098 87636 23629 -59783 -48187 -22326 31312 5243 -32589 -5288 -51129 6272
12863 6272 74231 57471 36639 106085 38917 143657 204671 140072 82995 118362 10533
$$ packed form
12943A43054j01214q7031K0575R1381M0654p575o4599j1271o0696l6346k579Q7474
12931A1827l1664p1576o8029l1092P9708M8371l1583k6164N2906R864k5727L4982
12919d8177r9955j05385J30987Q3614k3206L474n768k9434O7706M6553M1267J2158
12907G3834l4644j23021n2442O3318O2968p6541q9298L0260L2832M5743n7078
12896a24069n523M7787N5681o6115j00260M0526J43083L5639K989k3348l3422
12885b7032J25730J52104M4906J2242J23456M5121k6843j13159n8052n1776j21599
12874A05098j7462o4007q3412J1596K5861N3638k6069l7832K7301m5841N7401
12863F272O7959j6760k0832O9446o7168J04740O1014o4599n7077L5367j07829
$$ plain form
12852 10533 -53780 -32685 -47197 15481 96234 146122 159456 153439 212209 288565 279088 243035
12840 243035 252506 247358 271670 342504 376319 397955 463856 532422 632600 795462 884080
12829 884080 1145123 1585332 2203888 3277822 4892906 6468156 7433215 7614918 7043865
12820 7043865 5958805 4951664 3921020 2878855 2008587 1353219 972642 782753 661075
12811 661075 614483 605521 532756 379401 330110 296071 218592 229778 224363 127325 103396 78779
12799 78779 26867 102406 98764 24215 -29232 -47087 -96133 -113282 -81129 -133675 -95067 2454
12787 2454 9501 -52576 -51743 24208 58577 96859 57685 30974 24249 69250 163470 144050 50544
12774 50544 -19992 -109663 -89405 -49964 -5161 -14610 -763 48971 7591 -3992 88473 79952
$$ packed form
12852A0533o4313K1095j4512O2678Q0753M9888J3334o017N8770P6356r477l6053
12840B43035R471n148K4312P0834L3815K1636O5901O8566J00178J62862Q8618
12829H84080K61043M40209O18556J073934J615084J575250R65059J81703n71053
12820G043865j085060j007141j030644j042165q70268o55368l80577j89889j21678
12811F61075m6592q962p2765j53355m9291l4039p7479J1186n415r7038k3929k4617
12799G8779n1912P5539l642p4549n3447j7855m9046j7149L2153n2546L8608R7521
12787B454P047o2077Q33P5951L4369L8282l9174k6711o725M5001R4220j9420r3506
12774E0544p0536q9671K0258L9441M4803r449J3847M9734m1380j1583R2465q521
$$ plain form
12762 79952 -7598 -17539 33328 115610 -73 -60594 30968 175152 195316 60821 40162
12751 40162 1225 47678 37322 108078 73556 -9654 -90016 -53434 -61825 -126821 -65301 11171
12739 11171 86165 110834 100337 97100 23801 -23090 -18667 -21289 -163117 -207701 -141567 -194187
12727 -194187 -255996 -223531 -161789 10981 92410 937 -118264 -102239 -8532 41647 -14023
12716 -14023 -132071 -170500 -89931 16348 2844 -84296 -72047 -84728 -60618 -47283 38858
12705 38858 39360 -21991 -77544 -28658 -16202 -60050 -128831 -67574 -92386 -51867 32925 10293
12693 10293 -13581 9745 41732 64188 121413 91910 51028 51627 100837 90205 -12429 -81479
12681 -81479 -122570 -162933 -210974 -168724 -202009 -261948 -182177 -80031 -114845 -154547 -144408
$$ packed form
12762G9952q7550r941N0867Q2282j15683o0521R1562J44184K0164j34495k0659
12751D0162l8937M6453j0356P0756l4522q3210q0362L6582q391o4996O1520P6472
12739A1171P4994K4669j0497l237p3299m6891M423k622j41828m4584O6134n2620
12727a94187o1809L2465O1742J72770Q1429r1473j19201J6025R3707N0179n5670
12716a4023j18048l8429Q0569J06279j3504q7140J2249j2681K4110J3335Q6141
12705C8858N02o1351n5553M8886J2456m3848o8781O1257k4812M0519Q4792k2632
12693A0293k3874K3326L1987K2456N7225k9503m0882N99M9210j0632j02634o9050
12681h1479m1091m0363m8041M2250l3285n9939P9771J02146l4814l9702J0139
$$ plain form
12670 -144408 -174321 -102790 -71734 -58257 -23351 -21238 278 31734 36731 36454 -503 -27861
12658 -27861 -37076 -15673 -19187 -59877 -101982 -110177 -73129 -55836 -72189 -45835 -19753 -4552
12646 -4552 -23854 -1492 -18820 -30779 -275 -24416 -77339 -79617 -67719 -49677 35462 -16261
12634 -16261 -13634 2015 -19014 34913 -17879 28409 18134 -87316 -114368 -30367 18245 139578
12622 139578 146383 68373 -4429 -19614 -6204 -18745 -33200 75705 60840 84024 108056
12611 108056 83573 45069 -25440 -46985 -32316 13312 7452 -57535 -40345 -12397 25673 41006
12599 41006 29576 -39808 -96136 -71412 -72019 -16478 -3775 -149550 -172122 -66115 23297 78820
12587 78820 79350 24817 -4563 -21201 -9361 -62348 -30260 -10042 -4893 7404 395 -70637
$$ packed form
12670a44408k9913P1531L1056J3477L4906K113K1516L1456M997k77l6957k7358
12658b7861r215K1403l514m0690m2105q195L7048J7293j6353K6354K6082J5201
12646d552j9302K2362j7328j1959L0504k4141n2923k278J1898J8042Q5139n1723
12634a6261K627J5649k1029N3927n2792M6288j0275j05450k7052Q4001M8612J21333
12622A39578O805p8010p2802j5185J3410j2541j4455J08905j4865K3184K4032
12611A08056k4483l8504p0509k1545J4669M5628n860o4987J7190K7948L8070J5333
12599D1006j1430o9384n6328K4724o07N5541J2703j45775k2572J06007Q9412N5523
12587G8820N30n4533k9380j6638J1840n2987L2088K0218N149J2297p009p1032
$$ plain form
12575 -70637 -110560 -100444 -116182 -90810 -64678 -61718 -81761 -115721 -55866 -67700 -124781 -150872
12563 -150872 -104691 -7076 27295 -39313 -31077 31918 18582 -36244 -16666 -45973 2323 69673
12551 69673 96273 84723 9187 -44659 -68786 -85733 -119057 -111663 -83023 -137435 -131283 -59515
12539 -59515 -29925 -37625 -120062 -281980 -375058 -341995 -233206 -183437 -102466 -99759 -155205 -177802
12527 -177802 -93682 4430 12240 47845 130946 113398 81211 61893 -3447 -27387 -34169 -91362
12515 -91362 -150206 -96102 7720 108227 131593 75106 76074 98667 37352 37999 52918 -70918
12503 -70918 -194447 -199544 -173539 -71830 -38552 4859 -120652 -159420 -106227 17333 19177
12492 19177 -27898 -33049 20602 7469 -40345 -68308 -84716 -87656 -98656 -114825 -176796 -180186
$$ packed form
12575g0637l9923J0116j5738K5372K6132K960k0043l3960N9855j1834n7081k6091
12563a50872M6181R7615L4371o6608Q236O2995j3336n4826J9578k9307M8296O7350
12551F9673K6600j1550p5536n3846k4127j6947l3324P394K8640n4412O152P1768
12539e9515K9590p700q2437j61918r3078L3063J08789M9769Q0971K707n5446k2597
12527a77802Q4120R8112P810L5605Q3101j7548l2187j9318o5340k3940o782n7193
12515i1362n8844N4104J03822J00507K3366n6487R68K2593o1315O47J4919j23836
12503g0918j23529n097K6005J01709L3278M3411j25511l8768N3193J23560J844
12492A9177m7075n151N3651j3133m7814k7963j6408k940j1000j6169o1971l390
$$ plain form
12480 -180186 -222791 -231341 -165509 -114427 -40724 -61156 -5976 50190 122623 102531 58398 -54300
12468 -54300 -64000 -62950 -120005 -171050 -123290 -100881 -69710 -69945 8394 104358 49975 -46328
12456 -46328 -68051 -31891 -29455 -96396 -95574 -37055 -8276 -41546 -67411 -75410 -105908 -155953
12444 -155953 -147976 -91119 -53901 -80421 -43653 -67624 -61613 -12704 -7835 2160 -67029 -34969
12432 -34969 -50878 -20894 -59454 -95711 -33362 -61214 -42416 -34379 -101698 -77641 44463 31771
12420 31771 16261 39928 70270 -1135 -40643 -52937 14485 33948 37637 -8525 -88204 -91192
12408 -91192 -90864 -103554 -156382 -125357 -54129 8772 89908 82797 33041 -39832 -41074 -58994
12396 -58994 -78421 -52138 153 88833 109523 97736 48892 -29736 -64575 4561 -7123 -68154
$$ packed form
12480a80186m2605q550O5832N1082P3703k0432N5180N6166P2433k0092m4133j12698
12468e4300r700J050n7055n1045M7760K2409L1171k35P8339R5964n4383r6303
12456d6328k1723L6160K436o6941Q22N8519K8779l3270k5865p999l0498n0045
12444a55953P977N6857L7218k6520L6768k3971O011M8909M869R995o9189L2060
12432c4969j5909K9984l8560l6257O2349k7852J8798Q037o7319K4057J22104j2692
12420C1771j5510K3667L0342p1405l9508j2294O7422J9463L689m6162p9679k988
12408i1192L28j2690n2828L1025P1228O2901Q1136p111m9756p2873j242j7920
12396e8994j9427K6283N2291Q8680K0690j1787m8844p8628l4839O9136j1684o1031
$$ plain form
12384 -68154 -70294 -56988 -53702 -72840 -127409 -128606 -78921 24668 16576 12018 10453 -18033 -12003
12371 -12003 7422 -97754 -50150 -67381 -158228 -76393 -48914 -67254 -69383 -137108 -127521 -106787
12359 -106787 -96968 -104769 -88711 -77072 -39128 46804 11543 17597 -1219 -63216 -154667 -129721
12347 -129721 -54270 -31039 79975 103484 25005 -4258 8624 35924 71110 90999 3267
12336 3267 -34136 21626 131746 141807 76641 21157 5718 -33809 -48209 -35783 -47513 -42709
12324 -42709 -26035 -3417 -15481 -40530 -58932 -220109 -195008 -129078 -89008 -64578 -55397 -67634
12312 -67634 -171443 -140934 -127044 -170763 -169611 -184574 -111984 -76653 -66215 -127393 -179966 -142662
12300 -142662 -69061 -84128 -81710 20624 5889 -14740 -72652 -78029 -110796 -31158 22451 80931
$$ packed form
12384f8154k140J3306L286j9138n4569j197M9685J03589q092m558j565k8486O030
12371a2003J9425j05176M7604j7231r0847Q1835K7479j8340k129o7725R587K0734
12359a06787R819p801J6058J1639L7944Q5932l5261O054j8816o1997r1451K4946
12347a29721P5451K3231J11014K3509p8479k9263J2882K7300L5186J9889q7732
12336C267l7403N5762J10120J0061o5166n5484j5439l9527j4400J2426j1730M804
12324d2709J6674K2618j2064k5049j8402j61177K5101O5930M0070K4430R181j2237
12312f7634j03809L0509J3890m3719J152j4963P2590L5331J0438o1178n2573L7304
12300a42662P3601j5067K418J02334j4735k0629n7912n377l2767P9638N3609N8480
$$ plain form
12288 80931 25624 -10619 54923 20061 -15771 -24173 -94273 -102450 -29708 -3891 -91950 -135694
12276 -135694 -177776 -52533 56368 34800 13781 2389 63396 53070 -9781 -47707 -69610
12265 -69610 -145356 -169574 -134166 -112294 -97186 -121202 -88897 -55610 -107606 -137072 -24507
12254 -24507 41031 25324 52709 44488 35851 23095 15143 20005 9913 27333 -3043 16962
12242 16962 67889 89820 146647 83742 -50093 -137812 -49564 98921 156330 141801 59626
$$ packed form
12288H0931n5307l6243O5542l4862l5832q402p0100q177P2742K5817q8059m3744
12276a35694m2082J25243J08901k1568k1019j1392O1007j0326o2851l7926k1903
12265f9610p5746k4218L5408K1872J5108k4016L2305L3287n1996k9466J12565
12254b4507O5538j5707K7385q221q637j2756p952M862j0092J7420l0376K0005
12242A6962N0927K1931N6827o2905j33835q7719Q8248J48485N7409j4529q2175
$$ [...]
##END NTUPLES=NMR SPECTRUM
##END=
