##TITLE=Analysis number 313698
Compound Code cd 05257
Project Code adrs
Chemist Name endeavour
##JCAMPDX= 6.0         $$ Bruker NMR JCAMP-DX V2.0
##DATA TYPE= NMR SPECTRUM
##DATA CLASS= NTUPLES
##ORIGIN= Bruker BioSpin GmbH
##OWNER= NMR
$$ XWIN-NMR		Version 3.5
$$ Mon Sep 19 10:30:39 2005 GMT Daylight Time (UT+1h)  MAYBRIDGE\NMR@NMR_250MHZ
##.OBSERVE FREQUENCY= 250.131544655141
##.OBSERVE NUCLEUS= ^1H
##.ACQUISITION MODE= SIMULTANEOUS (DQD)
##.ACQUISITION SCHEME= undefined
##.AVERAGES= 16
##.DIGITISER RES= 18
##SPECTROMETER/DATA SYSTEM= dpx250
##.PULSE SEQUENCE= zg30
##.SOLVENT NAME= CDCl3
##.SHIFT REFERENCE= (INTERNAL, CDCl3, 0, 16.522)
##AUDIT TRAIL= $$ (NUMBER, WHEN, WHO, WHERE, WHAT)
$$ ##TITLE= Audit trail, XWIN-NMR		Version 3.5
$$ ##JCAMPDX= 5.01
$$ ##ORIGIN= Bruker BioSpin GmbH
$$ ##OWNER= NMR
$$ C:\u/data/dgb/nmr/ADRS/9640/pdata/1/auditp.txt
$$ ##AUDIT TRAIL=  $$ (NUMBER, WHEN, WHO, WHERE, WHAT)
(   1,<2005-09-19 10:30:20.81 +100>,<MAYBRIDGE\NMR>,<NMR_250MHZ>,
      <created by zg, POWCHK disabled, PULCHK disabled
       configuration hash MD5:
       62 19 C7 07 E1 42 D1 B7 37 6C 3D D0 77 39 F9 E6
       data hash MD5: 64K
       BA BE 0E B2 12 40 4B 30 45 7F 33 0E F4 90 F8 6C>)
(   2,<2005-09-19 10:30:32.71 +100>,<MAYBRIDGE\NMR>,<NMR_250MHZ>,
      <Start of raw data processing
       ef LB = 0.3 FT_mod = 6 PKNL = 1 SI = 32K 
       data hash MD5: 32K
       79 4D 94 D9 7E 25 E7 70 38 4A 5D FA 52 8A 70 E4>)
(   3,<2005-09-19 10:30:34.35 +100>,<MAYBRIDGE\NMR>,<NMR_250MHZ>,
      <apk 
       data hash MD5: 32K
       EA BF 1F D6 3B 86 86 30 0A DA C1 85 F7 3B E8 07>)
(   4,<2005-09-19 10:30:35.08 +100>,<MAYBRIDGE\NMR>,<NMR_250MHZ>,
      <abs ABSG = 5 
       data hash MD5: 32K
       4B CE 5A C2 49 84 BA 13 4D 72 5B 76 F7 79 E0 E3>)
$$ ##END=
$$ 
$$ hash MD5
$$ 25 7A 42 45 D5 4C 31 1C 58 74 16 9E CD 43 72 83
##$RELAX= 
##$RELAX= 
##$RELAX= 
##$RELAX= 
##$RELAX= 
##$RELAX= 
##$RELAX= 
$$ Bruker specific parameters
$$ --------------------------
##$DU= <C:\u>
##$EXPNO= 9640
##$NAME= <ADRS>
##$PROCNO= 1
##$TYPE= <nmr>
##$USER= <dgb>
##$AMP= (0..31)
100 100 100 100 100 100 100 100 100 100 100 100 100 100 100 100 100 100 
100 100 100 100 100 100 100 100 100 100 100 100 100 100 
##$AQSEQ= 0
##$AQ_mod= 3
##$AUNM= <au_zg>
##$AUTOPOS= <9 >
##$BF1= 250.13
##$BF2= 250.13
##$BF3= 250.13
##$BF4= 250.13
##$BF5= 500.13
##$BF6= 500.13
##$BF7= 500.13
##$BF8= 500.13
##$BYTORDA= 1
##$CFDGTYP= 0
##$CFRGTYP= 5
##$CHEMSTR= <none>
##$CNST= (0..31)
1 1 145 1 1 1 1 1 1 1 1 1 1 1 1 1 1 1 1 1 1 1 1 1 1 1 1 1 1 1 1 1 
##$CPDPRG= <>
##$CPDPRG1= <>
##$CPDPRG2= <>
##$CPDPRG3= <>
##$CPDPRG4= <mlev>
##$CPDPRG5= <mlev>
##$CPDPRG6= <mlev>
##$CPDPRG7= <mlev>
##$CPDPRG8= <mlev>
##$CPDPRGB= <>
##$CPDPRGT= <>
##$D= (0..31)
0 1 0 0 0 0 0 0 0 0.06 0 0 0 0 0 0 0.0002 0 0 0 0 0 0 0 0 0 0 0 0 0 0 
0 
##$DATE= 1127122220
##$DBL= (0..7)
120 120 120 120 120 120 120 120 
##$DBP= (0..7)
150 150 150 150 150 150 150 150 
##$DBP07= 0
##$DBPNAM0= <>
##$DBPNAM1= <>
##$DBPNAM2= <>
$$ [...]
##$SUBNAM7= <"">
##$SUBNAM8= <"">
##$SUBNAM9= <"">
##$SW= 20.6930455092707
##$SWIBOX= (0..15)
0 0 3 0 0 0 0 0 0 0 0 0 0 0 0 0 
##$SW_h= 5175.983436853
##$TD= 65536
##$TD0= 1
##$TE= 295.16
##$TE2= 300
##$TE3= 300
##$TEG= 300
##$TL= (0..7)
0 120 120 120 120 120 120 120 
##$TP= (0..7)
150 150 150 150 150 150 150 150 
##$TP07= 0
##$TPNAME0= <>
##$TPNAME1= <>
##$TPNAME2= <>
##$TPNAME3= <>
##$TPNAME4= <>
##$TPNAME5= <>
##$TPNAME6= <>
##$TPNAME7= <>
##$TPOAL= (0..7)
0.5 0.5 0.5 0.5 0.5 0.5 0.5 0.5 
##$TPOFFS= (0..7)
0 0 0 0 0 0 0 0 
##$TUNHIN= 0
##$TUNHOUT= 0
##$TUNXOUT= 0
##$USERA1= <user>
##$USERA2= <user>
##$USERA3= <user>
##$USERA4= <user>
##$USERA5= <user>
##$V9= 5
##$VALIST= <valist>
##$VCLIST= <CCCCCCCCCCCCCCC>
##$VD= 0
##$VDLIST= <DDDDDDDDDDDDDDD>
##$VPLIST= <PPPPPPPPPPPPPPP>
##$VTLIST= <TTTTTTTTTTTTTTT>
##$WBST= 1024
##$WBSW= 4
##$XGAIN= (0..3)
0 0 0 0 
##$XL= 0
##$YL= 0
##$YMAX_a= 491663
##$YMIN_a= -590219
##$ZGOPTNS= <>
##$ZL1= 120
##$ZL2= 120
##$ZL3= 120
##$ZL4= 120
##$ABSF1= 16.522
##$ABSF2= -4.171173
##$ABSG= 5
##$ABSL= 3
##$ALPHA= 0
##$AQORDER= 0
##$ASSFAC= 0
##$ASSFACI= 0
##$ASSFACX= 0
##$ASSWID= 0
##$AUNMP= <proc_1d>
##$AZFE= 0.1
##$AZFW= 0.1
##$BCFW= 0
##$BC_mod= 0
##$BYTORDP= 0
##$COROFFS= 0
##$CY= 12.5
##$DATMOD= 1
##$DC= 0
##$DFILT= <>
##$DTYPP= 0
##$F1P= 14.0000005364418
##$F2P= -0.99999901652339
##$FCOR= 0.5
##$FTSIZE= 32768
##$FT_mod= 6
##$GAMMA= 0
##$GB= 0
##$INTBC= 1
##$INTSCL= 1
##$ISEN= 128
##$LB= 0.3
##$LEV0= 0
##$LPBIN= 0
##$MAXI= 10000
##$MC2= 0
##$MEAN= 0
##$ME_mod= 0
##$MI= 0
##$NCOEF= 0
##$NC_proc= -2
##$NLEV= 6
##$NOISF1= 0
##$NOISF2= 0
##$NSP= 0
##$NTH_PI= 0
##$NZP= 0
##$OFFSET= 16.522
##$PC= 1
##$PHC0= 135.4825
##$PHC1= 4.781151
##$PH_mod= 1
##$PKNL= yes
##$PPARMOD= 0
##$PSCAL= 4
##$PSIGN= 0
##$REVERSE= no
##$SF= 250.13
##$SI= 32768
##$SIGF1= 0
##$SIGF2= 0
##$SINO= 400
##$SIOLD= 32768
##$SREGLST= <1H.CDCl3>
##$SSB= 0
##$STSI= 32768
##$STSR= 0
##$SW_p= 5175.98343685301
##$SYMM= 0
##$S_DEV= 0
##$TDeff= 65536
##$TDoff= 0
##$TI= <Analysis number 999999
Compound Code 99
Book Reference 9
Project Code 9>
##$TILT= no
##$TM1= 0
##$TM2= 0
##$TOPLEV= 0
##$USERP1= <user>
##$USERP2= <user>
##$USERP3= <user>
##$USERP4= <user>
##$USERP5= <user>
##$WDW= 1
##$XDIM= 32768
##$YMAX_p= 356162730
##$YMIN_p= -38303
$$ End of Bruker specific parameters
$$ ---------------------------------
##NTUPLES= NMR SPECTRUM
##VAR_NAME=  FREQUENCY,     SPECTRUM/REAL,   SPECTRUM/IMAG
##SYMBOL=    X,             R,               I
##VAR_TYPE=  INDEPENDENT,   DEPENDENT,       DEPENDENT
##VAR_FORM=  AFFN,          ASDF,            ASDF
##VAR_DIM=   32768,         32768,           32768
##UNITS=     HZ,            ARBITRARY UNITS, ARBITRARY UNITS
##FACTOR=    0.157963299565203, 1,           1
##FIRST=     4132.6476996994, 0,             0
##LAST=      -1043.33573715361, 0,           0
##MIN=       -1043.33573715361, -38303,      0
##MAX=       4132.6476996994, 356162730,     0
$$ Real data points
##PAGE= N=1
##DATA TABLE= (X++(R..R)), XYDATA
$$ [...]
19758a172Q00j711q62k254J671L934p73l682j809J439J966R90q85M95K022N73
19742G42k672j846R17q6J799J47j830p37k082J77Q09J84n16J45P56J747M8j475
19724c773N44J924R04K49N19l383j961L184J851j051p05J780L57k91K61j86j094
19707h71j048o93l82j144r5L79K731p38l20Q03Q30L83N50j791L1K89m77l1j753
19688c347P37Q57J154N57k15k198o98l49p7J04j089P34M83P62O28O22j560m447
19670g342N31J744J75j392J055O45R20K44M28J625K592k404j138p1O26n56N51
19653a767p18J931O65J058l150L6q73J89M01J683L099j533l453o23P67R27Mq13
19635b170R61K943J361r21j840q37M15Q01l210l549J462J249K13j758q08K597
$$ plain form
19758 -1172 -372 -2083 -2945 -5199 -3528 406 -367 -4049 -5858 -4419 -2453 -1463 -2348 -1853 169 742
19742 742 -1930 -3776 -2859 -2945 -1146 -999 -2829 -3566 -5648 -5471 -4662 -4478 -4994 -4849 -4093 -2346 -2298 -3773
19724 -3773 -3229 -1305 -401 -152 367 -3016 -4977 -1793 58 -993 -1698 82 439 148 409 223 -871
19707 -871 -1919 -2612 -2994 -4138 -4233 -3854 -1123 -1861 -2181 -1378 -548 -165 385 -1406 -1375 -1086 -1563 -1594 -3347
19688 -3347 -2610 -1753 -599 -42 -257 -2455 -3153 -3502 -3579 -3475 -4564 -3830 -3347 -2585 -1957 -1335 -2895 -7342
19670 -7342 -6811 -5067 -4892 -6284 -5229 -4584 -3664 -3420 -2992 -1367 1225 -1179 -2317 -2388 -1762 -2318 -1767
19653 -1767 -2485 -554 111 1169 -1981 -1945 -2818 -2629 -2228 -545 2554 1021 -2432 -3055 -2288 -1361 -1357 -2170
19635 -2170 -1209 1734 3095 2174 334 -503 -88 713 -2497 -6046 -4584 -3335 -3122 -4880 -5688 -3091
19619c091K566j147O89K73j227P3L026J550l678n39j946j522J855L406J051k755
19603a416k80K352K006k512O68j61k023j787o63J420j57L68M06n77j919J071J593
19586a611j265J432q29n18j444J521J720l00j87R09M81J325j240j310j809k71
19570c396J55J746K105J99l211N58J702l18j244k530p36R44J313Q68M2N74K169
19553I40j429j179L77j572j576N39J441k516Q72M09J9M38K127p4J534j014L79
19536b85L93M09o89j85Q24R18p80j595j229M95R36J260r06P83j040l06J265J554
19518A822J10j322j524n91J626K53j023J129P50q77N19J314o59j308j017n15j077
19501b390P74o36l41K396J498K229j214j975k167L2M378J647j810j291J30j67
$$ plain form
19619 -3091 -525 -1672 -983 -710 -1937 -1864 1162 2712 -966 -1505 -3451 -4973 -3118 288 1339 -1416
19603 -1416 -1696 656 2662 150 818 657 -1366 -3153 -3816 -2396 -2553 -2185 -1779 -2356 -4275 -3204 -1611
19586 -1611 -2876 -1444 -2273 -2791 -4235 -2714 -994 -1294 -1481 -572 -91 1234 -6 -1316 -3125 -3396
19570 -3396 -3241 -1495 610 809 -2402 -1844 -142 -460 -1704 -4234 -4970 -4026 -2713 -1845 -1803 -1229 940
19553 940 -489 -1668 -1291 -2863 -4439 -3900 -2459 -4975 -4103 -3694 -3675 -3237 -1110 -1184 350 -664 -285
19536 -285 108 517 -172 -357 467 1385 605 -990 -2219 -1724 -788 472 -434 349 -691 -997 268 1822
19518 1822 1932 610 -914 -1505 121 374 -649 480 1230 353 872 2186 1527 219 -798 -1313 -2390
19501 -2390 -1616 -2252 -2593 -197 1301 3530 2316 341 -1826 -1794 2584 4231 2421 1130 1260 1093
19485A093j638J642p9l96J580R6L12j415j864K63J853Q57j804l851n43j726R78
19468d642J270J143k58R7k80k012q71L73R22J870o77O11K121J334L127L40k552
19451A916j420M75K66p65k43n67j79p78K00p34j827j773K484K467l37p94n89J100
19433a098J145K36R33n01j056k2q96j093J17j227R55J632r62k89K276J946M93
19416B589p7j900j621j620J041K118m35j217j029J477K733Q43p71k200k110ll13
19399b495p63R25J557j202K068K469O33p16l284J20M28K450k42k042O72N11o90
19382C99j848K574J196j42P55J052j620k352k745j712K142K53j126m89K163L148
19366A648l6J25j979r29k403k46k099J019j12K739J317N73J438J757Q6k470q00
$$ plain form
19485 1093 -545 1097 1018 622 2202 2298 2610 1195 -669 -406 1447 2304 500 -3351 -3894 -5620 -4642
19468 -4642 -3372 -2229 -2487 -2390 -2670 -4682 -5553 -5180 -4258 -2388 -3065 -2454 -333 1001 4128 4468 1916
19451 1916 496 971 1237 472 229 -338 -517 -1295 -1095 -1829 -3656 -5429 -2945 -478 -815 -1609 -2198 -1098
19433 -1098 47 283 1216 715 -341 -363 -1259 -2352 -2235 -3462 -2507 -875 -1837 -2126 150 2096 2589
19416 2589 2512 612 -1009 -2629 -1588 530 95 -1122 -2151 -674 2059 2902 2131 -69 -2179 -2182 -2495
19399 -2495 -3258 -2333 -776 -1978 90 2559 3192 2476 -808 -688 -260 2190 1948 -94 578 1089 399
19382 399 -1449 1125 2321 2179 2934 3986 2366 14 -2731 -4443 -2301 -2048 -3174 -3663 -1500 1648
19366 1648 1612 1737 -242 -1171 -3574 -3820 -5919 -4900 -5012 -2273 -956 -383 1055 2812 2898 428 -372
19349c72k92L53J85j157l47O74q06j283j626j06J139M04M94O31k386l06m6K904
19331a943K453o65k59M37q65j358Q47J137M12j19j297O63m51j458l35L36j48l38
19313b951k39J558M72r80J078l75j773J156R29J632k377j146P37n07O09j24J280
19296a021j224j605J378J694K721j829O4M04j99q62j361L56L56J43L40j419K63
19279a801O53N55Q40J789K477n24k494l311l20J879J807m30P01m17N34k996k22
19262a280J472j245o72k433n24J518M52j162J577m27n64J326M98r98l70J095J954
19245B17J541o8k04k097k119m48n91J859K359j3k78j187j459N58M85M88p22l29
19227b008Np77K525j462j39K670K11j746j730k016l56K123J159K538L16j211j837
$$ plain form
19349 -372 -664 -311 -126 -1283 -1630 -956 -1762 -3045 -4671 -4777 -3638 -3234 -2740 -2109 -4495 -4801 -4847 -1943
19331 -1943 510 -155 -414 23 -842 -2200 -1353 -216 196 77 -1220 -557 -1008 -2466 -2801 -2465 -2613 -2951
19313 -2951 -3190 -1632 -1160 -2140 -1062 -1437 -3210 -2054 -1125 507 -1870 -3016 -2279 -2786 -2177 -2301 -1021
19296 -1021 -2245 -3850 -2472 -778 1943 114 178 582 383 -479 -1840 -1484 -1128 -985 -645 -2064 -1801
19279 -1801 -1148 -593 247 2036 4513 3989 1495 -1816 -2136 -257 1550 1120 1821 1404 1938 -1058 -1280
19262 -1280 192 -1053 -1725 -4158 -4682 -3164 -2712 -3874 -2297 -2724 -3288 -1962 -1464 -2462 -2832 -1737 217
19245 217 1758 1690 1486 -611 -2730 -3178 -3769 -1910 449 436 158 -1029 -2488 -1930 -1445 -957 -1679 -2008
19227 -2008 -2003 -2780 -255 -1717 -1856 814 1025 -721 -2451 -4467 -4823 -2700 -1541 997 1313 102 -1735
19210a735k283J60L271J84J32K648K417r3l556j219m74L3k797J066J504j925k02
19193b869R25j811J171K788p46L95L312M35j537p40M79J726j362j643m71K762
19177B814M24o18J648J365K02J626r18k754N5L39M22m46l34Q95r5J678k994l066
19159B43l720q24J477k6J952J118L350n3o93q01j366M76K147Q44l11r65j549n0
19141A249j209q29k515j451J588K665J341j283M98J126k046J108L550K754K363
19126H909j034j217P6K121J877j096j658J60L72j936j443j504j368j000m76j859
19110a076K19J286q9j156N82J718J431Q01k342Q07M52j267p10J603J42k29J081
19093C253k67j14P9J648J865j406k922P58j903J128J693K922j91q85Q5q14p86
$$ plain form
19210 -1735 -4018 -3858 -587 -403 -271 2377 4794 4701 1145 -74 -548 -515 -3312 -2246 -742 -2667 -2869
19193 -2869 -1944 -3755 -2584 204 -542 -147 3165 3600 2063 1323 1802 3528 2166 523 52 2814
19177 2814 3238 2620 4268 5633 5835 7461 6543 3789 3844 4183 4605 4159 3825 4720 4625 6303 3309 243
19159 243 -3477 -4301 -2824 -2850 -898 220 3570 3517 2824 2023 657 1133 3280 4124 3813 2848 1299 1249
19141 1249 40 -789 -3304 -4755 -3167 -502 839 -444 54 1180 -866 242 3792 6546 8909
19126 8909 7875 6658 6734 8855 10732 9636 7978 8138 8510 6574 5131 3627 2259 1259 783 -1076
19110 -1076 -857 429 340 -816 -234 1484 2915 3716 1374 2181 2633 1366 656 2259 2401 2172 3253
19093 3253 2986 2872 2951 4599 6464 5058 2136 2894 991 2119 3812 6734 6543 5658 5743 4929 4143
19076D143K799M031J282j39j172n153k241q76j70N61k193j17O48k047j447k96
19060b387J155O94K927K810Q36L903q72k539j314J426K79k786j851q55j399K001
19044B028q69q47J257P07P92j158j399o75J386J989J440Q88j979m93q14l123q32
19027a702K254J669l74L02K649M18R20L08j127k068R82K255J761K047K58J364
19011A1916q29j157J783J269J82K265N501L501M799P372R270J0770J9093K4307
18997A00042M4669O2419N9211M4454J0627k8872m9969n8260n1756l8964k4120
18986F9481j3144j1099p251o582n450n597l711j533J65j739q44j539QK019K779
18971A5963k2m6j509o55J531j261J0K99J392j578r93j192m44L16R67l139k471
$$ plain form
19076 4143 6942 10973 12255 12116 10944 5791 3550 2674 2504 3065 872 755 1403 -644 -2091 -2387
19060 -2387 -1232 -538 2389 5199 6035 9938 9066 6527 5213 6639 6918 4132 2281 1426 27 2028
19044 2028 1159 312 1569 2276 3068 1910 511 -164 1222 3211 4651 5539 3560 3067 2253 -870 -1702
19027 -1702 552 2221 1847 2149 4798 5216 6136 6444 5317 3249 4231 6486 8247 10294 10552 11916
19011 11916 11087 9930 11713 12982 13164 15429 20930 24431 29230 36602 45872 56642 75735 100042
18997 100042 144711 207130 266341 310795 321422 292550 242581 184321 132565 93601 69481
18986 69481 56337 45238 37987 31405 25955 20358 16647 15114 15279 13540 12696 11157 11165 13184 15963
18971 15963 15941 15895 14386 13731 15262 14001 14011 14310 15702 14124 13131 11939 11495 11811 12778 9639 7168
18954G168K996J112K928O68K791L367K574N496M748R688J3850K2172L1010M8411
18940A58979O5654O4646M3092J32m0329n6732o0058m9642l3703j9132j3754j1090
18928D8063p438p803j0205o882r82M545j50j014j967J026J535K274j114j376n45
18913A7967j081j981j258j110n88k185j481P48J619q60k386J602J604M42l106
18898G946p11p06J671J924j225L64J743j280l88k595j563j496k05k765j006J665
18882A373l76O21J224J122J258Q75r55J555O07n61j708K12J662j563k123K774
18866E997M096K426K719q21k733l810n761k515R22Kj001J011L496M253J018J414
18850A0713J871Q65k452j788r91k47K61K70l21j200K545J55J87j367N82RJ032
$$ plain form
18954 7168 10164 11276 14204 14872 17663 21030 23604 29100 33848 43536 57386 79558 110568 158979
18940 158979 224633 289279 332371 332503 292174 235442 175384 125742 92039 72907 59153 48063
18928 48063 40625 32822 22617 15735 14753 19298 19148 18134 16167 17193 18728 21002 19888 18512 17967
18913 17967 16886 14905 13647 12537 11949 9764 8283 9031 10650 9790 7404 9006 10610 11052 7946
18898 7946 7235 6529 8200 10124 8899 9263 11006 9726 9338 6743 5180 3684 3479 714 -292 1373
18882 1373 997 1618 2842 3964 5222 6097 5142 6697 7304 6743 5035 5247 6909 5346 3223 5997
18866 5997 10093 12519 15238 14417 11684 7874 2113 -402 520 522 -479 532 4028 8281 9299 10713
18850 10713 12584 13449 10997 9209 8218 7971 8232 8502 8181 6981 9526 9681 9868 8501 9083 9092 10124
18833A0124J114p23j072k853j107O32l953J472L49J72J064M79J89K396K419q88
18817I814k893k778L548L150j819j199J628L830J375Q44j174n70l859m763l715
18802A419L96J741L422K062J600m04K364N20j90L59K054l90Q76n66L33J884O56
18785A8136J685J337J983O25j313j890l820m544l395m237k702J968L829P60J31
18770H553j10K238L150N549L914L20Q16l956n163l700k894o91q35k248Q61J377
18754G181K184j55j376j594R30Q99K50J331J947r15J840J103j198r53m49J008
18738A2033j03K53J984K793P24j404q53L075K594N59K370K611K171O48J078K83
18722C0816k000k742m301k948k348j05J280o37J079k529j005j504k194k025k329
$$ plain form
18833 10124 11238 10515 9443 6590 5483 6115 2162 3634 3983 4155 5219 5698 5887 8283 10702 9814
18817 9814 6921 4143 7691 10841 9022 7823 9451 13281 14656 15500 14326 13756 9897 5134 1419
18802 1419 1815 3556 6978 9040 10640 10236 12600 13120 12930 13289 15343 14953 15829 15263 15596 17480 18136
18785 18136 19821 21158 23141 23766 22453 20563 16743 12199 8804 4567 1865 3833 7662 8422 8553
18770 8553 8443 10681 13831 19380 23294 23614 24430 20474 15311 11611 8717 8026 7191 4943 5804 7181
18754 7181 9365 9210 7834 6240 7170 8069 8319 9650 11597 10682 12522 13625 12427 11474 11025 12033
18738 12033 11930 12183 14167 16960 17684 16280 15427 18502 21096 21655 24025 26636 28807 29455 30533 30816
18722 30816 28816 26074 21773 18825 16477 16372 17652 17015 18094 15565 14560 13056 10862 8837 6508
18707F508k202J277K335j73n56J004m53m79l271J05K47L43M424L927K118j740
18691A3414j359k671j352P22K041J583M50L448k98k422j413j423L65P08L167K291
18675A7251J368L311K572K048n26K647O077O497L611N327M812N646J712j604n628
18660E5121m041l751R18Q33j999m466j995j886lJ462L608M586O202J3832J7018
18645H5439K2600M0414N2908N8708M7309J9918j3325m3633n7144n1031l4911k3185
18633A04067j1204l038N36O80K387M757J1571K2276K9440M3697O0131N4674L7236
18620C57210Q572k3842m5026n5796m7995l4004k0107j0446j498R563K2878L9946
18608A99455N9879J02871J76840K34416K06930J73910O6965j23408j83987k13441
$$ plain form
18707 6508 4306 5583 7918 7745 7189 8193 7740 7261 3990 4095 4342 4685 9109 13036 15154 13414
18691 13414 12055 9384 8032 8754 10795 12378 12828 16276 15978 13556 12143 10720 11085 11793 14960 17251
18675 17251 18619 21930 24502 26550 26024 28671 34748 41245 44856 50183 54995 60641 62353 60749 55121
18660 55121 51080 47329 48247 49080 47081 42615 40620 38734 38731 40193 43801 48387 54589 68421 85439
18645 85439 108039 148453 201361 260069 307378 327296 313971 270338 213194 162163 127252 104067
18633 104067 92863 89825 90361 91041 93428 98185 109756 132032 161472 205169 265300 319974 357210
18620 357210 365782 341940 296914 241118 193123 159119 139012 128566 127068 136631 159509 199455
18608 199455 259334 362205 539045 773461 980391 1154301 1221266 1097858 913871 700430
18598G00430k09584j43886q5858m8293l1157j7670j2889j4596j5425k2212k0294
18587G8566r550k938k17J727n94J885N248N200N569M710K342J137k626m033j250
18572H5176j501N99K058O597N208N805L112P908J2841J3280J5934K1667L0211
18559B08895M0099O2805R8050J64372K84505M19944M13115L47818K07518j36519
18549B110602l25537l79732m13226l05147j83679j14610p7289n0338l2597k1274
18539B07173j0607j283J527m455j4887j6982j9197j1719n011L134P780M852M302
18526A44627M254L082L251M957R71L371M154J847j684K465M084O142R120R177
18512A99818J1106J2258J3371J2024J1650J4110K1139K5878L5787M9984P6851
$$ plain form
18598 700430 490846 346960 261102 212809 181652 163982 151093 136497 121072 98860 78566
18587 78566 69016 66078 65861 67588 66994 68879 74127 79327 84896 89606 91948 93085 90459 86426 85176
18572 85176 83675 84274 86332 92929 98137 103942 107054 114962 127803 141083 157017 178684 208895
18559 208895 248994 311799 409849 574221 858726 1278670 1691785 2039603 2247121 2110602
18549 2110602 1785065 1405333 992107 686960 503281 388671 311382 261044 228447 207173
18539 207173 196566 195283 196810 192355 177468 160486 141289 129570 124559 127693 135473 140325 144627
18526 144627 148881 151963 155214 160171 161142 164513 168667 170514 168830 171295 175379 181521 190641 199818
18512 199818 210924 223182 236553 248577 260227 274337 295476 321354 357141 407125 483976
18501D83976R9518R7902P8835M1067M855J558K0885Q4908J74360K55036K87284
18490A630184K81259K11930R9390J0490n6167o0011k700R3584K36910M18102N93341
18479C456312P13156Q08647Q76313J021536J349466K001512L425975O301652J0718822
18470C0673391J2839315J0526933N475207k834683r061456j1330931j1518060
18463B4769716q225797n069015l166102k040350j334960r14406o53544m99947
18455B865595l97214l10566k26333j18266K2903K09580L77580K87346P9603n3166
18445B737062k43552l13961k33539j60267r0619j2527O9589J87508K41030J25743
18435B306467K171r6896k15975k15604j40226o6139J0325P8712J38443K06916
$$ plain form
18501 483976 583494 681396 760231 801298 806153 807711 828596 913504 1087864 1342900 1630184
18490 1630184 1911443 2123373 2222763 2233253 2177086 2117075 2114375 2207959 2444869 2862971 3456312
18479 3456312 4169468 4978115 5854428 6875964 8225430 10226942 13652917 19954569 30673391
18470 30673391 43512706 54039639 59514846 56680163 47618707 36287776 24769716
18463 24769716 16543919 11474904 8308802 6268452 4933492 4019086 3365542 2865595
18455 2865595 2468381 2157815 1931482 1813216 1836119 2045699 2423279 2710625 2790228 2737062
18445 2737062 2493510 2179549 1946010 1785743 1695124 1682597 1752186 1939694 2180724 2306467
18435 2306467 2308638 2211742 1995767 1780163 1639937 1573798 1584123 1662835 1801278 2008194
18425B008194L08543M23330N38231O88096R01087J246233J783922K703779M491597
18416A5093012P959759J2797840J4233395J1151781M885672m496797j0519407
18409E1105255j2839769j2422448q551213n259758l300709k129497j404965r65343
18401D231553o84106n08624l58825k00366j49732j84803j83689k00536k00885
18392A559987j38171q3796o9191q1683n6644k679O5695O3738K1518k0470j02090
18381A156214j51394j52118j32352j19048r3298o2262m3458l5196l0178k6658
18371C10252k3372k0483j5193j3865r167q422j1430p245l347l495l993k785m276
18358A83179k465k646m485p394o151n054o481m527k545l352p517j2442j2935j0618
$$ plain form
18425 2008194 2316737 2740067 3278298 3966394 4867481 6113714 7897636 10601415 15093012
18416 15093012 23052771 35850611 50084006 61235787 66121459 61624662 51105255
18409 51105255 38265486 25843038 17291825 12032067 8731358 6601861 5196896 4231553
18401 4231553 3547447 3038823 2679998 2479632 2329900 2145097 1961408 1760872 1559987
18392 1559987 1421816 1338020 1268829 1187146 1130502 1127823 1193518 1257256 1278774 1258304 1156214
18381 1156214 1004820 852702 720350 601302 508004 445742 402284 367088 336910 310252
18371 310252 286880 266397 251204 237339 228172 219750 208320 201075 197728 194233 190240 187455 183179
18358 183179 180714 178068 173583 166189 160038 154984 148503 143976 141431 138079 130562 118120 105185 94567
18344I4567m454n57N297L957J938j071n614p554l906l959k534m840m78K219k58
18329G2753J886L054O00l64K84o75M12K149K760k17p34N68r9k499m605l624n322
18312F6327m930l646J268L783j021P40L86j460J262R82L940L783p41K374M072
18297G7119K319M44J81j857k049n812p778q433n005m011m322k83P8M289N541J491
18281E1912n44l022n896q093k251L292N850O680J364J533L598j937n070m240R02
18266D4078N53k960J379P468O496P718K466j292p332o195l302J459M619Q845Q185
18251G2185O562P148K187k799p633q227q716j634k233J989L566M150K455K420
18237G1420K086J496J157N521R807J1135J3366N974k310j1373k1071k1836j4703
$$ plain form
18344 94567 90113 89556 94853 98810 100748 99677 94063 86509 82603 78644 76110 71270 70792 73011 72753
18329 72753 74639 77693 78293 77929 78213 77538 77950 80099 82859 82642 81908 82476 82377 79878 75273 71649 66327
18312 66327 61397 57751 59019 62802 61781 62521 62907 61447 62709 63691 67631 71414 70673 73047 77119
18297 77119 79438 79882 80063 78206 76157 70345 62567 54134 49129 45118 40796 40513 40591 44880 50421 51912
18281 51912 51368 48346 42450 34357 32106 35398 41248 47928 49292 50825 54423 52486 47416 43176 44078
18266 44078 44631 41671 43050 50518 57014 64732 67198 65906 58574 52379 49077 50536 55155 64000 72185
18251 72185 78747 85895 88082 85283 77650 69423 60707 59073 56840 58829 62395 66545 69000 71420
18237 71420 73506 75002 76159 81680 91487 102622 115988 121962 119652 108279 87208 65372 50669
18224E0669j1186r484l096N633O948J1987J4950J1910O252M35l317k693p36R0
18210G8362n85o512l235j256J086j211j524J88K094R1j398p07M844N551N016L529
18194H4333P679O336N340J942M18J707k59K303K899M420N031L279M621O191N624
18179A41864K809J880L379M189P705Q619R028P476O483J0706Q031R904Q963J0369
18165B41405J3590J9020J9381K4282L0794L4270L7989N3334P1565P8212O9661
18154F93503M5317J0891j1126j5768l201K6163N9347R3277J24029J48469J68187
18143A339088J79767J78617J72244J77391K03884K76757L88447N14787O58848
18134D089830Q34725J122661J667393K705926M607242P564166J0614753J1556192
$$ plain form
18224 50669 39483 29999 26903 32536 39484 51471 66421 78331 84583 85018 81701 79008 78272 78362
18210 78362 77777 71265 68030 66774 67860 66649 65125 65313 67407 67498 66100 65393 70237 75788 80804 84333
18194 84333 92012 98348 103688 105630 106048 107755 107496 109799 112698 117118 122149 125428 130049 136240 141864
18179 141864 144673 146553 149932 154121 161826 170445 179473 186949 193432 204138 212169 222073 231036 241405
18165 241405 254995 274015 293396 317678 348472 382742 420731 474065 545630 623842 693503
18154 693503 738820 749711 738585 722817 719616 745779 805126 898403 1022432 1170901 1339088
18143 1339088 1518855 1697472 1869716 2047107 2250991 2527748 2916195 3430982 4089830
18134 4089830 4924555 6047216 7714609 10420535 15027777 22591943 33206696 44762888
18126D4762888R268903M047116k619708p851708j0345838j0165009p866119n156716
18118A4073809l117526j777673q94294k61236K68902Q34020J644095K980516N268999
18109A9019612Q692139J2060848J2774434R248573K760390m396269r997314j2215895
18101C7946518j1226436q388694n485974l442595k186540j445458j013827p56568
18093D000426n82086m46932l32717k47178j99506j93636k11158k20946k11554
18084A354713j79251j35068r4671n8407k8153k815R682M728j7852n0718p8391
18073G23797q6410p8948o4583m6547l2290k1901k1658k0253j9926j9542j6001
18062B95738j0531r070r517j3018j4080j1911j0283n011n781q542r703n564j708
$$ plain form
18126 44762888 54031791 58078907 55459199 47607491 37261653 27096644 19230525 14073809
18118 14073809 10956283 9178610 8284316 8023080 8291982 9126002 10770097 13750613 19019612
18109 19019612 27711751 39772599 52547033 61795606 64555996 60159727 50162413 37946518
18101 37946518 26720082 18331388 12845414 9402819 7216279 5770821 4756994 4000426
18093 4000426 3418340 2971408 2638691 2391513 2192007 1998371 1787213 1566267 1354713
18084 1354713 1175462 1040394 945723 887316 859163 856348 866030 870758 852906 802188 723797
18073 723797 637387 558439 493856 447309 415019 393118 371460 351207 331281 311739 295738
18062 295738 285207 276137 266620 253602 239522 227611 217328 212317 206536 197994 188291 182727 181019
18049A81019q3Q1l204n926n976p400n556n575k908l613n942o679m563j467M273
18034A26481J133j407p90k826p3Q30j896k499o718o655q934n685n941l363k595
18019G9062j253K12J839K746L511M341J433J523l34r26M893K086J557j21l522
18004I7047n672o545p684p504r28N73L637M170o23p15m26j430J910L649Q126J4583
17988A02168K5348L6712M5133L5465P793j5071l5633m4137l4038k1668j1498j0470
17976H0104n420q456o796k764j118L472N245J2768K1725L1656L5349K7787Q878
17963B02430j0629k7338l0773k3780j8994j3586r962j1653n203k997k527l363
17951D1625m574m73M576P485P630R932J2721Q745J0529J9826L5375N2208N3725
$$ plain form
18049 181019 180936 181017 177813 171887 165911 158511 152955 147380 144472 140859 134917 128238 123675 122208 126481
18034 126481 127614 126207 125417 122591 122518 123348 121452 118953 112235 105580 96646 90961 85020 81657 79062
18019 79062 77809 78021 79860 82606 86117 90458 91891 93414 93080 92154 97047 99133 100690 100569 97047
18004 97047 91375 84830 77146 69642 68714 69287 72924 77094 76471 75756 75330 73900 75810 79459 87585 102168
17988 102168 127516 164228 209361 244826 252619 237548 201915 157778 123740 102072 90574 80104
17976 80104 74684 66228 59432 56668 55550 59022 64267 77035 98760 130416 165765 193552 202430
17963 202430 191801 164463 133690 109910 90916 77330 67368 55715 50512 47515 44988 41625
17951 41625 37051 36578 41154 48639 56269 66201 78922 87667 98196 118022 153397 205605 259330
17938B59330M1984J4309j9249l9745m4450k9205n947J5759K4802J7226l533k0725
17926B10556l4772l8406k9028k0181j3400q514o409l476k651l789j159P96P037
17913E6604J7374K5373L1401L0068J7318k053j9821k7112k5636k1135j3536j1312
17901E7533n029j286j250m87J634K591P30L519L405J504Q24K805M602R426J6860
17886I7381L5327N5582P2065P1956N0234R494l7716o2283o8081n6421l7297k4279
17874A05962j8218j3812r911n174o193k032k430p115l468k616n222l313N6K653
17860B9167M181O12J942L155J346J676N83J7k815k130k521q18l403l230m73j505
17844B5784j140k748j787N093J906k148J041L583j404k689j330p66N68K372K22
$$ plain form
17938 259330 301314 315623 296374 256629 212179 182974 177027 192786 217588 234814 231281 210556
17926 210556 175784 137378 108350 88169 74769 66255 59846 56370 53719 49930 48771 49567 56604
17913 56604 73978 99351 130752 160820 178138 176085 156264 129152 103516 82381 68845 57533
17901 57533 52504 51218 49968 49481 51115 53706 54436 57955 61360 62864 63688 66493 71095 80521 97381
17886 97381 132708 188290 260355 332311 382545 392039 354323 292040 223959 167538 130241 105962
17874 105962 87744 73932 64021 58847 52654 50622 48192 41077 37609 34993 29771 26458 26514 29167
17860 29167 33348 33960 35902 39057 40403 42079 42662 42679 39864 37734 35213 34395 30992 27762 27289 25784
17844 25784 24644 21896 20109 25202 27108 24960 26001 29584 28180 25491 24161 23395 23963 26335 26557
17829B6557K456L646M09l679j043k805j663J227J773M62p48M35j92j446j739l750
17813A9900m650n276k772r24M07K369J092K414K90J131L291Q89K116N052N051
17798C0380K525R59m321o105n362k711k191k180n38J058O20j645j261o29P60M27
17782I786j496j409k71J707K081J357Q85l232k909J810J989K209K119M128p9j380
17766A7295K89P65j994j644j983l07j41o38J395K359L64r04k84q3l183k802L08
17749H812Q21M523L798o68j615K70q28K623K349j126J830j278k457p62j633j373
17733A3286J284L886L553J118K218J456k11k399J033q94j801j517j12j665j264
17718A7971K17l831j996l425n48L385M668N304J742j94j648j126k86k200l858
$$ plain form
17829 26557 29013 32659 33068 29389 28346 25541 23878 25105 26878 27340 26592 27027 26835 25389 23650 19900
17813 19900 15250 9974 7202 6278 6685 9054 10146 12560 12850 13981 17272 18161 20277 25329 30380
17798 30380 32905 33864 29543 23438 18076 15365 13174 10994 10456 11514 12134 10489 9228 8599 9359 9786
17782 9786 8290 6881 6610 8317 10398 11755 12640 9408 6499 8309 10298 12507 14626 18754 18675 17295
17766 17295 17584 18349 16355 14711 12728 12421 12280 11642 13037 15396 15760 14856 14572 14489 11306 8504 8812
17749 8812 9633 14156 17954 17286 15671 15941 15113 17736 20085 18959 20789 19511 17054 16292 14659 13286
17733 13286 14570 18456 22009 23127 25345 26801 26590 24191 25224 24330 22529 21012 20900 19235 17971
17718 17971 18188 14357 12361 8936 8388 11773 16441 21745 23487 23293 21645 20519 20233 18033 14175
17703A4175l353J17L31J006n64m396m175j495j297J996J06J606J980j98k114k167
17687A558j843K22n6J098J938J589L56R16M118N087J65p17n24J177K666L724J609
17670B3083j253j5K668k798n361R28L965L411k06m77p08J723r44j999J124M70
17654B3611k107j461K278L342O08j789L110j60k599J129K963k938o939k863J363
17639A7548R74M231r50m488k778R04J89j394j109L673K204O65L024K682R33J100
17623B7408J230j216p67M34M124J755K125J0426J0397N868R234J4366K0674L1559
17609A37617M1600M9057M8540L0628L15k2536l7962m5848l9261k6073j7776j1628
17597A06673j0065p406m311o46O312J4293K5337L9185N7381O3100N5598L1487
$$ plain form
17703 14175 10822 10939 11270 12276 11712 7316 3141 1646 349 2345 2451 4057 6037 5839 3725 1558
17687 1558 -285 -63 -119 979 2917 4506 4862 5778 9896 14983 15148 14431 13907 15084 17750 21474 23083
17670 23083 21830 21815 24483 21685 16324 17252 21217 24628 24422 23945 23237 24960 24016 22017 23141 23611
17654 23611 21504 20043 22321 25663 26271 24482 27592 27432 24833 25962 28925 25987 19048 16185 17548
17639 17548 18522 22753 21803 17315 14537 15441 15630 14236 13127 16800 19004 19669 22693 25375 26308 27408
17623 27408 28638 27422 26655 27089 31213 32968 35093 45519 55916 61784 71018 85384 106058 137617
17609 137617 179217 228274 276814 307442 307757 285221 247259 201411 162150 136077 118301 106673
17597 106673 96608 89202 84891 84245 90557 104850 130187 169372 226753 289853 345451 376938
17585C76938m801l6862n4803n8231m7429l3257k3674j3304j0959j3449j2586m910
17573F2673n675m773l177k410j622m120j146J782q51Q64o43J510L869J537j273
17558D6545J56K809L568m96L144R80n08K483L59m60N22M05K482N737R667P417
17542H4810Q013K199p912p607q097j707J464L791J657K826J34J919O429L764M360
17527I6043L445M765R387J0647R354J0522J903m060k940N03K460K447R147J1235
17513A64858J5118K5043M4113N9005M7142K1914L426j5491k6163j9254j0698l483
17501C05530N315J2338K0246K9591L9510M5519N4907P3551R4356J18439J26212
17490I25514J29122J14753R5358J05904J45160K18857L13882M16357N58907P94273
$$ plain form
17585 376938 372137 335275 280472 222241 174812 141555 117881 104577 93618 80169 67583 62673
17573 62673 56998 52225 49048 46638 45016 40896 39750 41532 40681 41545 40902 42412 46281 47818 46545
17558 46545 46701 49510 53078 52582 55726 56706 56198 58681 59040 58580 59102 59507 61989 67726 77393 84810
17542 84810 92823 95022 87110 79503 71406 69699 71163 74954 76611 79437 79571 81490 87919 91683 96043
17527 96043 99488 104253 113640 124287 133641 144163 146066 142006 139066 139569 142029 144476 153623 164858
17513 164858 179976 205019 249132 308137 355279 377193 380619 365128 338965 319711 309013 305530
17501 305530 310845 323183 343429 373020 412530 458049 512956 586507 680863 799302 925514
17490 925514 1054636 1169389 1264747 1370651 1515811 1734668 2048550 2464907 3023814 3818087
17480C818087J190882J915890L289412N704816Q323307P700123L280037r54027
17472C4268527m718382p478306o822097m631133k880837j747812j005812n12449
17464D471699j93257K8404K52531N48594J006287J796622L214170N562424P807512
17455B4494986O678798K341448j546126n060184p293522o329822m235426k654324
17447F395828j660769j046371o75614m55772l17706k16837j54494j17129p9794
17438A671342n8087m7681k2895j625J0979J4595K0422N0710J03072J77502K65034
17427B183368L64383N04785P34166J123748J839175L182571N440888P598947O520933
17418B9492964K355445j356180m705095o846164n916271l915147k414810j454400
$$ plain form
17480 3818087 5008969 6924859 10214271 15919087 24242394 31942517 35222554 34268527
17472 34268527 29550145 22071839 15249742 10618609 7737772 5989960 4984148 4471699
17464 4471699 4278442 4306846 4559377 5107971 6114258 7910880 11125050 16687474 24494986
17455 24494986 31173784 33515232 31969106 26908922 19615400 13285578 9050152 6395828
17447 6395828 4735059 3688688 3013074 2557302 2239596 2022759 1868265 1751136 1671342
17438 1671342 1613255 1565574 1542679 1541054 1552033 1566628 1587050 1637760 1740832 1918334 2183368
17427 2183368 2547751 3052536 3786702 4910450 6749625 9932196 15373084 22972031 29492964
17418 29492964 31848409 30492229 25787134 18940970 13024699 9109552 6694742 5240342
17410E240342q29570m12780j49099M3002K46764N24275R65004J726897L087003
17401A0441838N292225P131591N621270J542747j863152m998969o676213n478686
17393A1012651l555343k202247j375900q74253n70387l94150k89059k09647j63462
17384A378203j38075j18253j15237j17277j11005j03018q4239o4182m9775l8786
17374D38356l0086k4762k5090k0985j7005j1370J035J4435K6996K1649L172j4203
17362C62142l1544m0863l4439k3636j9030j1788j0678j1613q220q568q991j0930
17350A41842q568n840p014k857O01l922o571k614o70p65l169j513l828r98j241
17335I2873k107k024l703m268o000l300j455k308K599J530Jk423l014p85j998
$$ plain form
17410 5240342 4410772 3997992 3848893 3891895 4138659 4662934 5627938 7354835 10441838
17401 10441838 15734063 22865654 28486924 30029671 28166519 23167550 16491337 11012651
17393 11012651 7457308 5255061 3879161 3004908 2434521 2040371 1751312 1541665 1378203
17384 1378203 1240128 1121875 1006638 889361 778356 675338 591099 526917 477142 438356
17374 438356 408270 383508 358418 337433 320428 309058 310093 324528 351524 373173 376345 362142
17362 362142 330598 289735 255296 231660 212630 200842 190164 178551 170331 161763 152772 141842
17350 141842 133274 127434 120420 117563 118164 114242 107671 105057 104387 103622 100453 98940 95112 94114 92873
17335 92873 90766 88742 85039 80771 74771 71471 70016 67708 70307 71837 71838 69415 66401 65616 63618
17320F3618j553l254n002l751K380J734k99J40m40n41k828j248P99O44L965n09
17304E3855l102J127q96J116J55j729k567k262n690k435K99R54J618K086O72k294
17288D0907j104k73m141k811m031k769L937O705K657J386K800J153m174o769k918
17273C0555j642l171R45j603l057l53P58k047o318m227r85J717M507K876L611
17258B1566N351K474k798k755k196q2j180l125K78J475L567J370m68R60N99m629
17242B0407l528K210L591R66j026K215K533k598l043o14j01M73l861m227l166
17227A0231K567P493N753L761K304j494M6m304l474k007q4k26k210j418j807j483
17211A3648P92k285Q48M03J013K786M090K712K985L699j135l916n056l905j773
$$ plain form
17320 63618 62065 58811 53809 50058 52438 54172 53873 54013 53573 53032 50204 48956 49755 50399 54364 53855
17304 53855 50753 51880 50984 52100 52255 50526 47959 45697 40007 37572 37871 38825 40443 42529 43201 40907
17288 40907 39803 39530 35389 32578 28547 25778 29715 36420 39077 40463 43263 44416 40242 33473 30555
17273 30555 28913 25742 26687 25084 22027 21674 22432 20385 14067 9840 8855 10572 15079 17955 21566
17258 21566 26917 29391 26593 23838 21642 21560 20380 17255 17533 19008 22575 23945 23477 24437 25036 20407
17242 20407 16879 19089 22680 23646 22620 24835 27368 24770 21727 21113 21012 21485 17624 13397 10231
17227 10231 12798 20291 26044 29805 32109 30615 30661 26357 22883 20876 20792 20566 18356 16938 15131 13648
17211 13648 14440 12155 13003 13406 14419 17205 21295 24007 26992 30691 29556 25640 20584 16679 14906
17196A4906Q03J525Q82k299K023L434J419J635M012Q20k701k781j869k593K82
17181A9498j113J368L409M51k4j301n56k290J94P88J440N83l75L950J551j719
17165B5854l956l536l410l665m067l229K802M556p42k053J85J140R29J625R35
17150A3368N565J994j83J87j870k926l576o262l780j482J677J519j300j024K3
17135A930J278R45pJ743R84L116o95k513l91J596P06q77Q16Q2p8j951j703q94
17117D087K059L248J243Q40J598n00k363Q8N43l650l422r83J327m67j887j445
17101C16o1p50J120j298P2L689K638J731J583M39K361l67l732m688k731j963k424
17084d065J19o26K092J176Q34n68N17j172J525K393n80k719J283J141N11J461
$$ plain form
17196 14906 15709 17234 18116 15817 17840 21274 22693 24328 28340 29160 26459 23678 21809 19216 19498
17181 19498 18385 19753 23162 23613 23589 22288 21732 19442 19636 20424 21864 22447 22072 26022 27573 25854
17165 25854 21898 18362 14952 11287 7220 3991 6793 11349 10607 8554 8739 9879 10808 12433 13368
17150 13368 18933 20927 20744 20931 19061 16135 12559 6297 2517 1035 2712 4231 2931 1907 1930
17135 1930 3208 4153 4146 5889 6873 9989 9294 6781 6390 7986 8692 7815 8631 8713 8635 6684 4981 4087
17117 4087 6146 9394 10637 11477 13075 12575 10212 10300 10843 7193 3771 2788 4115 3648 1761 316
17101 316 255 -495 625 -673 -601 3088 5726 7457 9040 9479 11840 11473 7741 3053 322 -1641 -4065
17084 -4065 -3946 -4572 -2480 -1304 -470 -1038 -521 -1693 -168 2225 1645 -1074 209 1350 1861 3322
17068C322K32j286n21K67p20k334N87K913J933M20J250M3L18P68N59J929J4l234
17050F460k776l069j593J598J578n78j752K43K461O97M85K099j692l707j119J728
17034A063J418J80k18j086J157j35k042j115j560O99R20J630k029r5q37J432M16
17017b02k031O02N82J991L826J442j656j175K604o69J0J159M232Q57M51M09k934
17000I498k886k529k661J48n09L80K149J071J330L15k121J04K934j063m23J324
16984G061K79J328L350j473k186k439k413J53K465M284m43j25K433j143k951n44
16968G636M580L222J799L189L569N903J0538J7412K6373L5851L4381J8917k009
16955A71361k1327l1414l0626k0734j5946j0809m044k882j772K21K960L711L946
$$ plain form
17068 3322 3554 2268 1747 2014 1294 -1040 -453 2460 4393 4813 6063 6106 6424 7192 7751 9680 9694 6460
17050 6460 3684 615 -978 620 2198 1620 -132 111 2572 3269 3754 5853 4161 454 -665 1063
17034 1063 2481 2661 2443 1357 2514 2379 337 -778 -2338 -1639 -719 911 -1118 -1213 -2050 -618 -202
17017 -202 -2233 -1631 -1049 942 4768 6210 4554 3379 5983 5314 5324 6483 10715 11572 12023 12432 9498
17000 9498 6612 4083 1422 1570 1061 1441 3590 4661 5991 6306 4185 4289 7223 6160 5737 7061
16984 7061 7340 8668 12018 10545 8359 5920 3507 3660 6125 10409 9966 9841 12274 11131 8180 7636
16968 7636 12216 15438 17237 20426 23995 29898 40436 57848 84221 120072 154453 173370 171361
16955 171361 150034 118620 87994 67260 51314 40505 36461 33579 31807 32028 34988 38699 42645
16942D2645P741J5457K6338L3355K8248J3053n495k4576l0358k7278k1706j2734
16930D4690q497p306m133l005m198p54m2j136k935q33j729k396k170K99K246J951
16914A0052J747R27K335K530J182J041L366Q867J1385J6978K6599L3050K9179
16901A49238J4369m139k0060l0857k9717k1061j2250q329m245l293P00J932L34
16888C2622K962O007R897J4575K2850L1829K6855Q604r192k2369k7932k5526j8394
16875E2788j4675o858o981n485j987k184k202Qo62k922N27j980j820J331Q37L07
16859H042%q54L61j634k711k24Q22k204J188N003J498m79m466j249o01l16m61
16842A715L97q6n87J363J77J223R62j336l67K447J61n1j87q0j812k439L54L30
$$ plain form
16942 42645 50386 65843 92181 125536 153784 166837 161342 136766 106408 79130 57424 44690
16930 44690 36193 28887 24754 21749 17551 16797 16755 15619 12684 11851 10122 7726 5556 5855 8101 10052
16914 10052 11799 12726 15061 17591 18773 19814 23180 32047 43432 60410 87009 120059 149238
16901 149238 163607 159468 139408 108551 78834 57773 45523 37194 32949 29656 30356 32288 32622
16888 32622 35584 41591 51488 66063 88913 120742 147597 156201 147009 124640 96708 71182 52788
16875 52788 38113 31255 24274 18789 16802 14618 12416 12424 11762 8840 9367 7387 5567 6898 7735 8042
16859 8042 8042 7188 7549 5915 3204 2980 3802 1598 2786 7789 9287 8808 4342 3093 2492 2176 1715
16842 1715 2112 2026 1439 2802 2979 4202 5164 3828 3461 5908 6069 6018 5831 5751 3939 1500 1854 2184
16824B184j225o4k614N84J360l73r84J854L213L24m289j850L531J410J705J493
16808F259j500j899k427j16K640j07j553K617K549J688k187j345l591j649n45
16793a166q35K334K485k322j725o2l978k027J436R3p10L122L799R33J803J93k853
16776E20l361J235M10M0R23J789J82m55k228j710O9N19j593J126J915P98J88J533
16758A900j43j154J115J210r1L04q08O73J293l84m48o41p06j754l40R56j401p45
16740a164J214J479k30j220k071j353j877K771N58N48Q99K047n61k502J374K726
16724B638K107N44r97j398j421j222n56j061j196J81K36O15J252j553p41P46K289
16707D63J75k850M52J278O62p05M06R58J223m8r27k117j496j214j254K010L437
$$ plain form
16824 2184 959 895 -1719 -1135 225 -148 -1132 722 3935 4259 -30 -1880 1651 3061 4766 6259
16808 6259 4759 2860 433 317 2957 2850 1297 3914 6463 8151 5964 4619 1028 -621 -1166
16793 -1166 -2001 333 2818 496 -1229 -1291 -5269 -7296 -5860 -5767 -6477 -3355 444 1377 3180 3373 520
16776 520 -2841 -1606 -1196 -1156 -233 1556 1738 1283 -945 -2655 -2586 -2067 -3660 -2534 -619 179 367 1900
16758 1900 1757 603 1718 2928 2837 3141 2333 3006 4299 3915 3467 2826 2120 366 26 982 -419 -1164
16740 -1164 50 1529 1299 79 -1992 -3345 -5222 -2451 -1893 -1345 -446 1601 1040 -1462 -88 2638
16724 2638 4745 5289 4292 2894 1473 251 -305 -1366 -2562 -2381 -2145 -1530 -278 -1831 -2572 -1826 463
16707 463 638 -2212 -1760 -482 180 -525 -119 839 2062 2014 1087 -1030 -2526 -3740 -4994 -2984 453
16690D53l92j775J631K565J589n01J137k520k258J002J44r69o42o25q29P4j977
16673c893j708K272L313j207q98J803K921n9j84n73Q44q74j757J914L73R08P95
16656C990q70j600o35Q3J66j106p13r14Q35J734J258o19O58K567q50o43J49J927
16638E417k270k606k129L90n06K765K332j103o82n93K02j90j630K76j734j186
16622c247J833N13J84J083Q64m2j015m28L64k7P23k93j926O31N01L247q14j017
16604A134j305O01N00j297j510J283j013J163j136j717p22K688K548O2p77p34
16588b32J269l71j13J155j899o3r77j484j04K307K463r4k642l825r83O01L341
16571a651K97o87r36l77J694j473r9P31m62M80m61N22J063O76j104K89M62N36
$$ plain form
16690 453 61 -1714 -83 2482 4071 3570 4707 2187 -71 931 1075 106 -536 -1161 -1990 -1916 -3893
16673 -3893 -5601 -3329 -16 -1223 -2121 -318 2603 2544 2360 1787 2631 1757 0 1914 2287 3195 3990
16656 3990 3120 1520 885 968 1134 28 -685 -1599 -764 970 2228 1609 2267 4834 3984 3341 3490 5417
16638 5417 3147 541 -1588 -1198 -1704 1061 3393 2290 1608 1015 1217 1027 -603 -327 -2061 -3247
16622 -3247 -1414 -901 -717 366 1230 1188 173 -255 109 82 805 512 -1414 -783 -282 2965 2151 1134
16604 1134 -171 430 930 -367 -1877 -594 -1607 -444 -1580 -3297 -4019 -1331 1217 1279 502 -232
16588 -232 1037 666 553 1708 -191 -254 -1231 -2715 -2819 -512 1951 1857 -785 -4610 -5593 -4992 -1651
16571 -1651 -1354 -2041 -2977 -3354 -1660 -3133 -3232 -2501 -2963 -2483 -2944 -2422 -1359 -683 -1787 -1498 -1036 -500
16553e00P54K41k05o74k208j324J195K95K63k4N73O31J576J825J544j310j960
16536F92J486j042l281J92L48l37l50O76r11J308Q95R2J175K759K98j386k616
16519bk5K245k285j801n31j177k309j14K773J935K855K206K000R12m20k406k534
16502A322q31k726m96L732R46j291l37r65n80q77j026L67K16J431K045L51J66
16485A447J918j33k311m15L650K521k81j224k7j199k579p91J435j308J200L414
16469E317j039r94j393Q08K516j32k580l196k034J138L298N59j200O44J914j68
16453C458l635j822R90j407j686K16L301O73K2K779P40k837j278J88J840j30j736
16436c24q33J885O72j617j303Q4j913n64r45J573J852J252k51k35j570j415K09
$$ plain form
16553 -500 254 495 290 -384 -2592 -3916 -2721 -2426 -2163 -2187 -1614 -983 593 2418 3962 2652 692
16536 692 2178 1136 -2145 -1953 -1605 -1942 -2292 -1616 -2527 -1219 -324 -232 943 3702 4000 2614 -2
16519 -2 -27 2218 -67 -1868 -2399 -3576 -5885 -5999 -3226 -1291 1564 3770 5770 6682 6262 3856 1322
16502 1322 491 -2235 -2731 1001 1947 656 319 -646 -1226 -2103 -3129 -2762 -2546 -1115 930 1281 1447
16485 1447 3365 3232 921 506 4156 6677 6396 5172 5145 3946 1367 576 2011 703 1903 5317
16469 5317 4278 3284 1891 2699 5215 5083 2503 -693 -2727 -1589 1709 2268 1068 1712 3626 3458
16453 3458 -177 -1999 -1009 -2416 -4102 -3886 -585 88 110 2889 3629 792 -486 -298 1542 1412 -324
16436 -324 -1157 728 1400 -217 -1520 -1436 -3349 -3913 -4858 -3285 -1433 -181 -432 -667 -2237 -3652 -3443
16419c443M99K305J349O91K19n63l23M19k665j512j745K99j23K809K126J582l67
16402A557j6n42o07p0j434j917J283K091L165j261o80l67J215k232p23M2K64K152
16384A920j757j423l289K659K008q47l8j142J874l99q45K12J81M21Q34J290p76
16367H83k715L03K04n24Q53P39j118k207k86J621J658j070J20p14L40N72J784
16350D43K4n32K03J797n5p05j383J059o60l77j966j821L69J219J495k70k504m72
16332d136j839K846J107M71j173j194K257J750j986n96P18j332n5j200j450J582
16316d230K49j282k17J432K02J383K88o01K441k35p22j240J045J622j554j769
16300c188P14J106J479N44M81P03p53J283n73k599o86L9p20j732J950K015P0k79
$$ plain form
16419 -3443 -2944 -639 710 1401 1620 1057 734 1153 -1512 -3024 -4769 -4470 -4593 -1784 342 1924 1557
16402 1557 1541 999 392 322 -1112 -3029 -1746 345 3510 2249 1569 1202 2417 185 -538 -496 -232 1920
16384 1920 163 -1260 -4549 -1890 118 -729 -767 -1909 -35 -434 -1279 -1067 -886 -465 369 1659 883
16367 883 -1832 -1529 -1325 -1849 -996 -257 -1375 -3582 -3868 -2247 -589 -1659 -1539 -2253 -1913 -1341 443
16350 443 467 -65 138 1935 1880 1175 -208 851 191 -186 -2152 -3973 -3604 -2385 -890 -1160 -3664 -4136
16332 -4136 -5975 -3129 -2022 -1551 -2724 -3918 -1661 89 -1897 -2493 -1775 -3107 -3162 -4362 -5812 -4230
16316 -4230 -3981 -5263 -5480 -4048 -3846 -2463 -2175 -2776 -335 -570 -1292 -2532 -1487 135 -1419 -3188
16300 -3188 -2474 -1368 111 655 1136 1839 1086 2369 1796 -803 -1489 -1450 -2170 -3902 -1952 63 133 -146
16282a46N6j086l01K449J203R82j274l623K242J159j040J881n34m887l241J851
16266d309L14p76J820K129J458J153K76p70k811Q00J912j146j598J19K102K226
16250B899J141l98k322N21n76j245r3n44J678J160j355j903J899K71j618j905
16234b390j972J167M89j35N28P52J75k09P07p5J052J208J950j238p83r26k0M16
16216F96p77J796p5j764k041r60K27l00m9Q71j144O23j491l17J80J069J482m85
16198b459J93j430o76J088k10M44L98P26K05k20J694O57j258K549J382k400n52
16181A31j062m9J90J219j862k709j96L346m8R9L8P41n16K35M29k76j167l21J073
16162g05n71J426k9L33q16l307P72J351Q61k583o65J36j836N53K173J306k0j18
$$ plain form
16282 -146 -90 -1176 -1477 972 2175 3157 1883 -1740 502 1661 621 2502 1968 -2919 -6160 -4309
16266 -4309 -3995 -4771 -2951 -822 636 1789 2065 1295 -1516 -716 1196 50 -1548 -1429 673 2899
16250 2899 4040 3642 1320 1841 1265 20 -73 -617 1061 2221 866 -1037 862 1133 -485 -2390
16234 -2390 -4362 -3195 -2706 -2841 -2313 -1561 -1386 -1595 -888 -963 89 1297 3247 2009 1226 300 280 696
16216 696 -81 1715 1640 -124 -2165 -3125 -2898 -3198 -3247 -2376 -3520 -2897 -4388 -4705 -4525 -3456 -1974 -2459
16198 -2459 -2266 -3696 -4372 -3284 -3494 -3050 -2652 -1926 -1721 -1941 -247 410 -848 1701 3083 683 131
16181 131 -931 -980 -790 429 -1433 -4142 -4338 -992 -1040 -941 -903 -162 -678 -443 -14 -290 -1457 -1778 -705
16162 -705 -1276 150 121 454 -362 -3669 -2897 -1546 -685 -3268 -3933 -3797 -5633 -5080 -2907 -1601 -1621 -1739
16144a739r63r54j374J057l97J177J642j880l58k273J444Q10J296J339P35N03
16128F5j065J17l77j694J579m07j465J809L155n61j719P68r60k281r02l90L721
16111f07R05k237j956J412J550M72j203j775J592P06P00k83j568L74J636L31k313
16094b264j164J399K602N93j195k098j451k52K00L321R43j921r55J61J010L81
16078f90n14o35qK95J117J719N41k031k664J562J266J441J272k259q01L49J186
16061A146J281n23j051P28L58j86k617j507J143M63R4M08j634J038J75j768r39
16044c391N69J23p20N7R14j046k510R85m17r14J599L742L33k679j473j47K073
16027b902K72j363Q54J498R53j290R37j54J819j642n35m02J61J694J501M89k173
$$ plain form
16144 -1739 -2702 -3656 -5030 -3973 -4370 -3193 -1551 -3431 -3789 -6062 -4618 -3808 -2512 -1173 -438 65
16128 65 -1000 -883 -1260 -2954 -1375 -1782 -3247 -1438 1717 1156 -563 205 -755 -3036 -3938 -4328 -607
16111 -607 298 -1939 -3895 -2483 -933 -461 -1664 -3439 -1847 -1141 -441 -724 -2292 -1918 -282 49 -2264
16094 -2264 -3428 -2029 573 1166 -29 -2127 -3578 -3830 -3630 -309 634 -1287 -2242 -2081 -1071 -690
16078 -690 -1204 -1839 -1847 -1552 -435 1284 1825 -206 -2870 -1308 -42 1399 2671 412 -389 -40 1146
16061 1146 2427 1904 853 1581 1939 1753 -864 -2371 -1228 -765 -671 -263 -1897 -859 -684 -2452 -3391
16044 -3391 -2822 -2699 -3419 -3362 -2448 -3494 -6004 -5019 -5436 -6350 -4751 -1009 -676 -3355 -4828 -4975 -2902
16027 -2902 -2630 -3993 -3139 -1641 -688 -1978 -1041 -1195 624 -1018 -1553 -1955 -1794 -100 1401 1890 -283
16010b83j212K102J863j769k863j114M85J620l77M53K700J742K46J453j81j866
15994B999r35j496j801k209J107J711l97J599K049R3k366k977j255K189O9K27
15978a393j143J13k627j25M31q89j45q43j287J787J229J755J500p18J41j99J459
15961i54J214k362r90J647L070K134k593q13Q23l583k157j485J970J685q77k90
15945c561J719O12Q93K596l49l3l156l087R04Q30K447K255P75k183o81j458n19
15928a996K149R22jr3Q14O21J015j366j341K268q45k576j209K20K696K934p19
15911C493K075j52p67j297j435J49J690P10M54Q53q99k024L78j953k033j744j564
15894d066k93J106J323O02J117J152j545r29J544j694q05K066J763k86j521L80
$$ plain form
16010 -283 -1495 607 2470 701 -2162 -3276 -2791 -1171 -1548 -1095 1605 3347 3593 5046 4865 2999
15994 2999 2064 568 -1233 -3442 -2335 -624 -1021 578 2627 2720 354 -2623 -3878 -1689 -1620 -1393
15978 -1393 -2536 -2423 -5050 -5175 -4744 -5633 -5778 -6621 -7908 -6121 -4892 -3137 -1637 -2355 -2214 -2413 -954
15961 -954 260 -2102 -3092 -1445 1625 3759 1166 353 1176 -2407 -4564 -6049 -4079 -2394 -3271 -3561
15945 -3561 -1842 -1230 -337 2259 1910 1877 -1279 -4366 -3462 -2632 -185 2070 2845 662 -19 -1477 -1996
15928 -1996 153 1075 1074 981 1795 2416 3431 2065 724 2992 2147 -429 -1638 -1418 1278 4212 3493
15911 3493 5568 5416 4649 3352 1917 2066 3756 4466 4920 5773 4874 2850 3228 1275 -758 -2502 -4066
15894 -4066 -4359 -3253 -1930 -1328 -211 941 -604 -1533 11 -1683 -2488 -422 1341 1055 -466 -86
15878h6L86N02K158J777j998N27J097K73m13j275k359q89k248o39o58K040R31
15861h74k35k744p76J862j588j199p0K645K077k488N29K604J192j150j507J068
15845f54J411j93L38j079o37J336l26L70n43j002J073r14j855J302Q29j136o33
15828b313J243J601j35O75m14K05o19m43j463K46j303J816J451Q74j037M28J111
15811A923j0k868m60k57N9L61j528r62L65K065J562J6o5k014j769P17J699o31
15793a797l47k52J071j11Q80j04l377k12N96K31Q63j242j1L40m684L64J462P33
15775e597K614M401p50k706p06K456n05o8j424m91K706J054L09J695k16N24N46
15758C842j81P11l09j226N23j150L09K74K71j760N46L17j559K27n84l81L50k524
$$ plain form
15878 -86 300 802 2960 4737 2739 3266 4363 4636 4223 2948 589 -300 -2548 -3187 -3845 -1805 -874
15861 -874 -1109 -3853 -4629 -2767 -4355 -5554 -5624 -2979 -902 -3390 -2861 -257 935 -215 -1722 -654
15845 -654 757 564 902 -177 -814 522 196 566 23 -979 94 -820 -2675 -1373 -544 -1680 -2313
15828 -2313 -1070 531 396 1071 657 862 243 -200 -1663 -1417 -2720 -904 547 1421 384 812 1923
15811 1923 1913 -955 -1415 -1672 -1613 -1252 -2780 -3742 -3377 -1312 250 266 201 -1813 -3582 -2865 -1166 -1797
15793 -1797 -2144 -2396 -1325 -1436 -556 -660 -4037 -4249 -3653 -3422 -2559 -3801 -3812 -3472 -8156 -7792 -6330 -5597
15775 -5597 -2983 1418 668 -2038 -2744 -288 -793 -861 -2285 -2776 -70 984 1293 2988 2772 3296 3842
15758 3842 3661 4372 4063 2837 3360 2210 2519 2793 3064 1304 1850 2167 608 835 251 -130 220 -2304
15740b304O50j487p61J963n80M61p6j542k007L14K052K368K113K630j956j901
15724f3l08K44N43L59j46m065l20r95J404p36m01K145j526O89Q20K569j394k192
15706c373j268P07L149q5k370N7K261J168k644j966k39R31l71K393J089p01j06
15689a368m50Q49J368M98l48L80J523O17R5L1k569R91j262j220M81R98j068j45
15671e99j008p03n9J086k403m04Q60R99K633N20K98n46J756O0k060q6M25K61j310
15652b80l155L92J679Q83K297O54l74k765o10K620j517P34J258j093M98J42j14
15635A249J56j170j508M20J358J875R57p10q16k32K78j034j012j549r70o98j188
15618d594j882K86Q8J988J414J029j166J280N9J888j24Jj163P20R07k524q33r91
$$ plain form
15740 -2304 -1654 -3141 -3902 -1939 -2519 -2058 -2134 -3676 -5683 -5369 -3317 -949 1164 3794 1838 -63
15724 -63 -371 -127 416 775 629 -3436 -3756 -4751 -3347 -4083 -4484 -2339 -3865 -3176 -2356 213 -1181 -3373
15706 -3373 -4641 -3934 -785 -870 -3240 -3183 -922 246 -2398 -4364 -4603 -3672 -4043 -1650 -561 -1262 -1368
15689 -1368 -1818 -969 399 897 549 929 2452 3069 3164 3195 626 1617 355 -865 -384 614 -454 -599
15671 -599 -1607 -2310 -2369 -1283 -3686 -4090 -3230 -2231 402 922 1220 674 2430 2490 430 344 769 1030 -280
15652 -280 -3435 -3043 -1364 -481 1816 2470 2096 -669 -1279 1341 -176 558 1816 723 1221 1363 1249
15635 1249 1405 235 -1273 -853 505 2380 3337 2627 1811 1579 1857 823 -189 -1738 -2708 -3406 -4594
15618 -4594 -6476 -6190 -6102 -4114 -2700 -1671 -2837 -1557 -1498 390 266 267 -896 -176 731 -1793 -2626 -3617
15600c617r82l207K583K441J314J228J389q95k888o10J380q3q12o1N49j060J592
15583a739J804j092n28J181R23j046j248m59J779j796q89J327J31R40o96k20j271
15566b899N9O21J60q22K042p48P38K47k403j20J492J261J473j647J94j036j481
15549b869k300J540J978j38q41J415K778J124K67P28o09j092j339J96j599n19
15533a280L678J417j923l490j191p03P14j21J022K89j334Q57M43k261R25j51m23
15516c532q26J791k36j52O78J422J239o62l112k46L4RP75j345r36J427J620N38
15498a514J669K081K620N69J72l518j612q5K348j301r11j65o97p17L67L45j262
15481a611l516M80J252J034l61P00m88n11K060j529o37j456K29N99O18N24M46
$$ plain form
15600 -3617 -4599 -7806 -5223 -2782 -1468 -240 1149 254 -2634 -3244 -1864 -1947 -2759 -2820 -2271 -3331 -1739
15583 -1739 65 -1027 -1555 -374 549 -497 -1745 -2204 -425 -2221 -3110 -1783 -1652 -712 -1408 -1628 -2899
15566 -2899 -2840 -2219 -2059 -2881 -839 -1587 -849 -602 -3005 -3125 -1633 -372 1101 -546 -352 -1388 -2869
15549 -2869 -5169 -3629 -1651 -1789 -2630 -1215 1563 2687 2954 3682 3073 1981 642 838 -761 -1280
15533 -1280 2398 3815 1892 -1598 -2789 -3492 -2778 -2899 -1877 -1588 -2922 -2065 -1622 -3883 -2958 -3109 -3532
15516 -3532 -4358 -2567 -2803 -2955 -2277 -855 384 -278 -3390 -3636 -3602 -3593 -2818 -4163 -5099 -3672 -2052 -1514
15498 -1514 155 2236 4856 5425 5597 2079 467 382 2730 1429 518 353 -344 -1061 -694 -349 -1611
15481 -1611 -5127 -4647 -3395 -2361 -2722 -2022 -2510 -3021 -961 -2490 -3127 -4583 -4354 -3755 -3137 -2613 -2167
15464b167j106j007K696J495m819p7J313M17k949j065K284K574L323j98j888k590
15448c764LK521J186q57j226j280J627L818j414j327R26K692j9j415j439l27l36
15431f31k226n88K93K211Q29O11q12j578l99L7J08l99n41N9K750J270j620n95
15413a221j042n02J089n15k34j292J719J973j662J588j776q47K47J083j648P29
15397b311K767q94n54R17K083k483M56K185l856j76L16J301l84j022p58n35p72
15380c720k488n5L620K205p92J098K198k1J163L53j412k12q70kk935j942Q2J650
15362b080r80k182k045K171J077j037J941J547p67M8K844m01k103J229J578r04
15346f4j209L88K38L84J321L54O49j158j814j436r17M41J034q07J272K31N12J71
$$ plain form
15464 -2167 -3273 -4280 -1584 -89 -4908 -4985 -3672 -3255 -6204 -7269 -4985 -2411 912 714 -1174 -3764
15448 -3764 -3761 -1240 -54 -911 -2137 -3417 -1790 2028 614 -713 213 2905 2886 1471 32 -295 -631
15431 -631 -2857 -3445 -3152 -941 -112 499 -313 -1891 -2290 -2253 -2145 -2544 -3085 -3026 -276 994 -626 -1221
15413 -1221 -2263 -2765 -1676 -2191 -2425 -3717 -1998 -25 -1687 -99 -1875 -2722 -2475 -1392 -3040 -2311
15397 -2311 456 -438 -992 -75 2008 -475 -19 2166 -1690 -1866 -1550 -249 -633 -1655 -2413 -2948 -3720
15380 -3720 -6208 -6263 -2643 -438 -1230 -132 2066 2045 3208 3561 2149 1937 1067 1065 -1870 -3812 -3730 -2080
15362 -2080 -3060 -5242 -7287 -5116 -4039 -5076 -3135 -1588 -2355 -2307 537 136 -1967 -738 840 -64
15346 -64 -1273 -885 -647 -263 1058 1412 2061 903 -911 -2347 -3264 -2823 -1789 -2596 -1324 -1093 -581 -410
15328d10L134K168j423k996L14L01j295j165k067k035N21R38p89O02N94J087J85
15311b336O38M42j102P76L402P93r72o90k778Q19Q94J139N97L286j650k426k141
15294a309j073J201K207K6j973q36L80m17m95K558n49O63O89k936m15J984o84
15277i79j732M83N74L220J648K194r23j490j234k805j526q50k432PK961L956q56
15260B16j775k83P94J353J275j189J470J834j287k514j115K2M07j73R58K200K033
15243D226L29q15l224k466j606L96l1k738J645K93l70J618M14m59p83p88n88K471
15225b476J818j156o44K239J628j777r68j954j655k54J897K067J762P94k840m14
15209a933l216J552K971J297M78r13q78J098m59O78j98m224J531K828k195l000
$$ plain form
15328 -410 2724 4892 3469 473 787 1088 -207 -1372 -3439 -5474 -4953 -4015 -4804 -4202 -3608 -2521 -2336
15311 -2336 -1698 -1256 -2358 -1582 1820 2613 1641 951 -1827 -1008 -114 1025 1622 4908 3258 832 -1309
15294 -1309 -2382 -1181 1026 1052 -921 -1757 -1377 -1794 -2289 269 -280 383 1072 -1864 -2279 -295 -979
15277 -979 -2711 -2228 -1654 1566 3214 5408 4485 2995 1761 -1044 -2570 -3420 -5852 -5845 -2884 1072 216
15260 216 -1559 -1842 -1048 305 1580 391 1861 3695 2408 -106 -1221 -1199 -792 -965 -7 2193 4226
15243 4226 4555 3740 516 -1950 -3556 -3160 -3191 -5929 -4284 -3991 -4361 -2743 -2329 -2788 -3571 -4359 -4947 -2476
15225 -2476 -658 -1814 -2458 -219 1409 -368 -1336 -3290 -4945 -5199 -3302 -1235 527 1321 -1519 -1933
15209 -1933 -5149 -3597 -626 671 1149 236 -642 456 -3 675 477 -3747 -2216 612 -1583 -4583
15193d583J115K25o65J155p3N94J160O59J302j098R78j538k647j971J935K909
15177e43j926o51O59J448J777q51k008q29j451l63M62J711N01q09O47J317M76
15160d33r34J450K869J122r08J437k469j309q27l74M45j275M87j187J554J335
15144I83r1L96m84k726k756Q96J52j237L78K578J521j842j745J35k773o68N48
15127f735J316P13R22L529R70O45M64M35L52O83R01j412k398j390M6Q16k08L60
15109Ik464M76J74k69q48P21M8j362o47m37J315m10J405K227J868j693j633r17
15091b437m3K742n28m00J938J154N03j132J036P93k152K49J0J564P06n41j12l579
15073b29k847J173N92j153j3Q75l94q51k21J196J128R82l22r81M4j765J202O17
$$ plain form
15193 -4583 -3468 -3243 -3908 -2753 -2826 -2232 -1072 -413 889 -209 769 -769 -3416 -5387 -3452 -543
15177 -543 -2469 -3120 -2461 -1013 764 -87 -2095 -2924 -4375 -4738 -4276 -2565 -2064 -2873 -2226 -909 -433
15160 -433 -1367 83 2952 4074 3166 4603 2134 825 -2 -376 69 -1206 -719 -1906 -352 983
15144 983 892 1288 804 -1922 -4678 -3782 -3630 -4867 -4489 -1911 -390 -2232 -3977 -3842 -6615 -7283 -6735
15127 -6735 -5419 -4706 -3784 -255 715 1360 1824 2259 2611 3294 4195 2783 385 -1005 -959 -143 -351 9
15109 9 -2455 -1979 -1805 -2074 -2922 -2201 -2153 -3515 -4162 -4599 -3284 -3694 -2289 -62 1806 113 -1520 -2437
15091 -2437 -2480 262 -266 -666 1272 2426 2929 1797 2833 3626 1474 1723 1733 3297 4003 3462 3350 -229
15073 -229 -3076 -1903 -1311 -2464 -2477 -1602 -1996 -2847 -3068 -1872 -744 238 -84 -1065 -1021 -2786 -1584 -967
15055i67J670J594l155k664J357L241N72Q2n74j498J549N81K80j201j165j211
15039a509l86k17L19J176J080Q60P07l35j712l250p03J281j51j309R8K68j076
15022d859q7K328K401N56J698M85k017P66o51j471l06O83l80J99K159l02j893
15005f91p13K42J40j579j16P21K174K471n98k502K5K919j747k416O0J556O8L15
14987C29o78l9K797j435m43j368J122j412K79L06k79Q94M52O20q83J243q34j52
14969E19k510K84j973r69k37n89J412K561K351k091m099q34Q73q9k421L398L426
14952i88k157O52J079J089M19p85k80j087K002K635K93q85p7k401k4J93k46j801
14934b369N63K540k07O38n89j060o15R44N09J137o19L01J524K54k801J851K652
$$ plain form
15055 -967 703 2297 -858 -3522 -2165 1076 1648 1730 1156 -342 1207 1788 2068 867 -298 -1509
15039 -1509 -1895 -2112 -1793 -617 463 1323 2030 1695 -17 -3267 -3970 -2689 -2840 -4149 -4051 -3783 -4859
15022 -4859 -4946 -2618 -217 339 2037 2522 505 1271 620 -851 -1157 -474 -854 -655 1504 1202 -691
15005 -691 -1404 -1162 -1022 -2601 -2717 -1996 178 2649 2051 -451 -426 2493 746 -1670 -1610 -54 14 329
14987 329 -349 -388 2409 974 531 -837 285 -1127 -848 -542 -821 73 525 1145 262 1505 671 519
14969 519 -1991 -1707 -3680 -4649 -4886 -5475 -4063 -1502 849 -1242 -5341 -6175 -5302 -5391 -7812 -4414 -988
14952 -988 -3145 -2493 -1414 -325 94 -691 -971 -2058 -56 2579 2872 1987 1910 -491 -515 -322 -568 -2369
14934 -2369 -1806 734 527 1165 576 -484 -1099 -155 354 1491 872 1173 2697 2951 150 2001 4653
14917D653p64k109k492j507j417J039J606j158K56J454k3k36j666J391R61j79
14901a91j784j468P66L789K35n88J380K532J200j758k65J092j526k468k614l923
14885e591Q93K518l21J18J932K540O12M86P55j40j36K33p03k213J191N38M6j444
14867A314r67j245l2j366j270K81j4J591J633j32J919J071j084m525J679R25O47
14850D25J074l25l04j451J266m02j078J469J61O59j484j005M14j311K093J562
14834A763l61K345j193j455J4n26k58M19l80M27k156P13L33O51K32j34J539J069
14816C042r30j251l108j113N70K785J523l96q13j225Q0p13j74R77J393k42l365
14799b960j48R02J965K138J800K889r91k329k100m8n61j285o3J292J054N17q74
$$ plain form
14917 4653 3889 1780 -712 -2219 -3636 -2597 -991 -2149 -1893 -439 -462 -698 -2364 -973 -12 -191
14901 -191 -1975 -3443 -2677 1112 1347 759 2139 4671 5871 4113 3848 4940 3414 946 -1668 -5591
14885 -5591 -4698 -2180 -2501 -2383 -451 2089 2701 3187 3942 3802 3666 3899 3196 983 2174 2712 2758 1314
14867 1314 347 -898 -930 -2296 -3566 -3285 -3299 -1708 -75 -207 1712 2783 1699 -2826 -1147 -222 425
14850 425 1499 1174 870 -581 685 283 -795 674 835 1494 10 -995 -581 -1892 201 1763
14834 1763 1402 3747 2554 1099 1113 587 329 748 368 795 -1361 -648 -315 336 568 434 1973 3042
14816 3042 2112 861 -2247 -3360 -2790 -5 1518 1122 309 -916 -836 -1549 -1723 -746 647 405 -2960
14799 -2960 -3108 -2206 -241 1897 3697 6586 5595 3266 1166 1118 557 -728 -791 501 1555 2072 1198
14782A198k111J92R94L791q98J350J02l606j038J675q91j264k418J00L602J100
14766A878k307J24O20q5j215j61J644Q80j380l10j369J72n67O81L23L41j44L295
14748B420K420r6j371l189J492J763J565j390l18k648m71k45r7P3Q93K627J369
14731D797Q12N99l319l694o86J050J65j139p80j188N46K376K264j142j29O53P3
14714A258N6K93q19j478J414l61K20m5j568n34J716j907n037J487L128J597n60
14697a140J057J828j234j187K169K683Q82P30j00k683J37P39J299J735o52k114
14681D149M01q20j722j962J43M63J286j295O19n50k63l30K2n36k18J060l48Q03
14663I02J603L30j279j800j43J461l80j542o84j889O83O5K289P6P24l89r8j435
$$ plain form
14782 1198 -913 -721 273 4064 3166 4516 4618 1012 -26 1649 758 -506 -2924 -2824 778 1878
14766 1878 -429 -305 315 230 -985 -1146 498 1378 -2 -312 -1681 -1509 -2076 -1395 -1072 -731 -875 2420
14748 2420 4840 4744 3373 184 1676 3439 5004 3614 3296 648 177 -68 -165 -92 801 3428 4797
14731 4797 5609 6208 2889 -805 -1491 -441 -276 -1415 -2195 -3383 -2837 -461 1803 661 532 1185 1258
14714 1258 1314 1607 788 -690 724 363 583 538 -1030 -1564 152 -1755 -6792 -5305 -2177 -580 -1140
14697 -1140 -83 1745 511 -676 1493 4176 5058 5788 5688 3005 3142 3881 5180 6915 6263 4149
14681 4149 4550 3730 2008 46 189 652 1938 643 1262 712 449 119 141 -395 -613 447 99 902
14663 902 2505 2835 1556 -244 -387 1074 694 -848 -1532 -3421 -2738 -2673 -384 -308 416 27 -71 -1506
14645a506J042Q27j076J237O70L62j222j012J876j356o41M56j157q81J504J675
14629G98Q80J611J512j538J41J32N73j727q81j969L31R09J483j41j392J91j24
14612G89j500j788P87K513j215j093J241J457J250j753K69N85k091j933k191M50
14596d223K760J792J867J522j1o25J401M21j001j321j143j393j329K881l38k613
14580a353j158K092J729j308l500j784l643J537L099K84N71M23K73J085j620p44
14564d017J986m6K462K051j125n91q4K42K30J022J435j766j464j61K087K080j541
14547B800j737o04m89P17j97J253j121m62N64j233j163N15m1J563j965N16l17
14530a401J112J487j47J491j464L1n03m94J766J75j50q70O00R00Q16P30j031q45
$$ plain form
14645 -1506 -464 363 -713 524 1194 1556 334 -678 1198 -158 -799 -343 -1500 -2381 -877 798
14629 798 1678 3289 4801 3263 3404 3536 4109 2382 1501 -468 -137 772 2255 2114 722 913 789
14612 789 -711 -2499 -1712 801 -414 -1507 -266 1191 2441 688 957 1542 -549 -2482 -4673 -4223
14596 -4223 -1463 329 2196 3718 3707 3082 4483 4904 3903 2582 1439 46 -1283 1598 1260 -1353
14580 -1353 -2511 -419 1310 2 -3498 -5282 -8925 -7388 -4289 -4005 -3434 -3011 -2738 -1653 -3273 -4017
14564 -4017 -2031 -2077 385 2436 1311 720 636 878 1108 2130 3565 1799 335 174 2261 4341 2800
14547 2800 1063 459 -30 687 490 1743 622 160 724 -509 -1672 -1157 -1198 365 -1600 -1084 -1401
14530 -1401 -289 1198 1051 2542 1078 1109 606 112 1878 2053 1903 1033 1633 2533 3349 4079 3048 2203
14512B203j770j120J537Q26L654P25j904j414l498p31P70j821j80O88K839J110
14496A914L00j020K934K653q86r85j010n46m1p05L97N19L65r7J99k128j200j788
14478a125o17J418J384l52l913J668J95K05j798J496J772L40n66j808L023J938
14462C260k7j461o89J685J183n76k97J608J472j73j019p17j857r88J456q71N71
14445B560L78Q32j195M0R54N93k234m55J432n61k88N49j83K20j545j259j104M66
14427h00l9Q71J421J916L43K74r77k974L1O26P28Q01J81L717O00k444J621m87
14409E409n415j821K506K531J737K42l551N78N20r32K16r11M2J04J355J339K42
14392D191k3o13j641j841j277J199J537k65J864k22j74O67J31J219K247j820k637
$$ plain form
14512 2203 433 -687 850 1676 5330 6055 4151 2737 -761 -1492 -722 -2543 -2723 -2035 804 1914
14496 1914 2214 1194 4128 6781 5895 4910 3900 3354 3313 2608 3005 3524 3889 3792 3991 1863 663 -1125
14478 -1125 -1742 -324 1060 708 -3205 -1537 -1342 -1137 -2935 -1439 333 673 107 -1701 1322 3260
14462 3260 3233 1772 1083 2768 3951 3375 3078 4686 6158 5985 4966 4249 2392 1404 2860 1989 2560
14445 2560 2938 3770 2575 2615 3569 4162 1928 1473 2905 2344 2056 2605 2422 2642 1097 -162 -1266 -800
14427 -800 -839 32 1453 3369 3712 3986 3009 35 66 692 1420 2221 2402 6119 6719 4275 5896 5409
14409 5409 -6 -1827 679 3210 4947 5189 1638 2216 2736 1804 2020 1109 1151 1255 2610 3949 4191
14392 4191 4168 3555 1914 73 -1204 -5 1532 1267 3131 2909 2735 3402 3533 4752 6999 5179 2542
14375B542k565j49M18n62Q07j48J622J202j919M7k068Q05R15K74J700K337l52
14358D906j927k102q49J855P27k160J150N3j165J150q38O60R11j057j67p81j429
14341a063p38j198K95J249K020p21j411j12L614J947l031l077K20j236J654j238
14325b826J690J524m20j104N07n05R09K356O95j176J246R90J722j274l623N8l17
14308D52k25J746Q90J288r29M18l082k360j529p79k00J517L483J695J775N98q57
14291C901m74r38j165L31P41J347J60L23j556r53O23J200L03p77P43k252q5O29
14273B101J188J883j987o96Q33O78J408k969k674P72J245j228n69K412K047j505
14257B939J028j088J039p32Q12L85k579N3j643R83L522J076M07j297k287j59M98
$$ plain form
14375 2542 -23 -172 246 -316 491 343 1965 3167 1248 1295 -773 32 947 1221 2921 5258 4906
14358 4906 2979 877 28 1883 2610 450 1600 1653 488 1638 800 1460 2371 1314 1147 366 -1063
14341 -1063 -1801 -2999 -2704 -1455 565 -156 -1567 -1679 1935 3882 851 -2226 -2006 -3242 -1588 -2826
14325 -2826 -1136 388 -32 -1136 -629 -1134 -225 2131 2826 1650 2896 3886 5608 4334 711 769 452
14308 452 227 1973 2863 4151 3222 3640 558 -1802 -3331 -4110 -4310 -2793 690 2385 4160 4758 3901
14291 3901 3427 2489 1324 1655 2396 3743 3903 4226 2670 1717 2340 3540 3843 3066 3809 1557 1472 2101
14273 2101 3289 5172 3185 2489 3322 4000 5408 2439 -235 537 1782 554 -15 2397 4444 2939
14257 2939 3967 2879 3918 3186 3998 4383 1804 1857 214 1197 4719 5795 6202 4905 2618 2459 2957
14240B957K467m39k532N46j189o21j188L40r65j672N69K355K086J851P44K01j386
14223D124j504J7N85Q85q62J522r00q25k321O15J413q1K331k5j742o85K188o79
14205D056j291k843K373M09k360J095J262m74K671J49j541J59K342j892j296p61
14189B058j585K20M43J749n34j681r07K097J247J888j684k039r08k56J843r96
14173I55K444J064nQ15l85r15J058J149k184k481r74J173j192m42k28L297k770
14156C79l144R53K531Q1l193m16K253J237N55J415J500L379j023j721k265m169
14140a648P74l56J486l05j015R51J545O44J842p67l92l31k784J983L49k00o99
14123A077j677j724J459L674n52j094j179J646M575K884m647j531R23j655j90
$$ plain form
14240 2957 5424 4985 2453 2999 1810 1189 1 341 -624 -2296 -1727 628 2714 4565 5309 5510 4124
14223 4124 2620 2637 3222 4107 3245 4767 3867 3042 721 1336 2749 2668 4999 4974 3232 2547 4735 4056
14205 4056 2765 -78 2295 2704 344 1439 2701 2227 4898 5047 3506 3665 6007 4115 2819 2058
14189 2058 473 693 1136 2885 2351 670 -237 1860 3107 4995 3311 1272 364 108 1951 955
14173 955 3399 4463 4458 5273 4888 3973 5031 6180 3996 1515 541 1714 522 80 -148 3149 379
14156 379 -2765 -1812 719 800 -2393 -2809 -556 681 1236 2651 4151 7530 6507 4786 2521 -1648
14140 -1648 -874 -1230 256 -49 -1064 -113 1432 2076 3918 3151 2759 2428 -356 1627 1976 1776 1077
14123 1077 -600 -2324 -865 2809 2257 1163 -16 1630 6205 9089 4442 2911 3834 2179 1989
14108A989J048J856N16Q50k534k153R97k745k008J141M291J517J817q14J989M43
14092H200k511j727K669r15k012J087j081l621Q9J679n6K69j498M97p9n10P64
14075A244J002r67NL6J502N10P83J263L91k44n80L08l59j000k57l01j604k569
14057h37K159L089P66m62Q89J399M25j136j194j872k770j410O18K284M58K074
14041D480K23j607j149J685K97J27K310L41j798j315L9j77l141K747M368j54N84
14024G860o26j436K359n73Q15J680N30j691m142R30K182j245j839k604j12J548
14008C636j460j1O96K057R7j323k06n76J666K234j171k106J920Q8R5n97j119l98
13990C522N0N96Q53O8j019j826O60J086J687J949J808M90j435j416k797j842O78
$$ plain form
14108 1989 3037 4893 5409 6259 3725 1572 2569 -176 -2184 -1043 3248 4765 6582 5768 7757 8200
14092 8200 5689 3962 6631 5716 3704 4791 3710 89 178 1857 1801 2070 572 1069 990 480 1244
14075 1244 2246 1279 1284 1320 2822 3332 4115 5378 5769 5525 4945 5253 4894 3894 3637 3336 1732 -837
14057 -837 1322 4411 5177 4715 5604 7003 7428 6292 5098 3226 456 -954 -336 1948 2406 4480
14041 4480 4703 3096 1947 3632 3929 4056 6366 6707 4909 3594 3633 3456 315 3062 7430 7276 7860
14024 7860 7234 5798 8157 7584 8399 10079 10609 8918 4776 5706 7888 6643 4804 2200 2088 3636
14008 3636 2176 2165 2861 4918 5015 3692 3486 2910 4576 6810 5639 3533 5453 5541 5636 5039 3920 3522
13990 3522 3572 4168 5021 5089 4070 2244 2904 3990 5677 7626 9434 9924 8489 7073 4276 2434 3112
13973C112l312o64L593K323J434j673L3J162M60k191j120R09J447M57J515J03
13957G588k958o96m34M69J361r68rj349J639J603n48j849Q34k34o40K055n62j465
13939C837k217R76n99k150K298N325m0k043Q9j095K201P04j641j658K719k06r90
13922E510J305L249J273j745j417j542k912j871L73q35J4J144P7Q59K184j264
13906D402N52R37K808J990k414l327j9p28j1J13j35J61J309K544o70N37P1P08
13888H828k33m77l112n55P87j70K196K150r22j456m47O24Q91N00R59K26r56o08
13870H225J72P23j485o54N61k095K2P16M18J023l94m76m15j915J627K526Q48j290
13852H137Q52K702o75m005n85J121N92J22N53R07j544k308r6o5k053K757K429
$$ plain form
13973 3112 -200 -864 2729 5052 6486 4813 4846 6008 6468 4277 3157 4066 5513 5970 7485 7588
13957 7588 4630 3934 3500 3969 5330 4362 4353 3004 4643 6246 5698 3849 4683 4449 3809 5864 5302 3837
13939 3837 1620 2596 1997 -153 2145 7470 7430 5387 5476 4381 6582 7286 5645 3987 6706 6500 5510
13922 5510 6815 10064 11337 9592 8175 6633 3721 1850 2223 1388 1402 2546 2623 3482 5666 4402
13906 4402 4954 5891 8699 10689 8275 4948 4929 4201 4190 4303 4168 4329 5638 8182 7512 8049 8120 8828
13888 8828 8595 8118 5006 4451 5238 5068 7264 9414 8492 7036 6589 7213 8104 8604 9563 9789 8833 8225
13870 8225 8397 9120 7635 6981 7542 5447 5469 6185 6603 7626 7232 6756 6341 4426 6053 8579 9427 8137
13852 8137 8989 11691 11016 7011 6426 7547 8139 8261 8814 9721 8177 5869 5773 5708 3655 6412 8841
13835H841J95K984q77J52Q40k429m033p15r43l112p17K778N25M79M110J563l46
13818I295j867k37k052m8l14J036j1K305n28j886j122j465K015K926q93j597J030
13801F587o72J992q23k462K494j543j931k379K018N37J377L249N19k205P5N17
13785G350K747N34j165k611j847J07K031K119J023j401l708J72J533q67K745R40
13769I702K106J308L28l01l966k582j371n70J516j466M7j91K645K021J345p04
13753I867k310q87L202K380O23k496p82j005K75J211N56k261j251J704Q0M88J253
13736A0647J261j917k482j713L053M54J06r40j355K34j399M01q53l275j94J118
13720C146K102M05K050j09o14R95J845J05j138k825j820o09L452J271Q46k86N14
$$ plain form
13835 8841 9036 12020 11143 11295 12135 9706 5673 4958 4015 903 186 2964 3489 3968 8078 9641 9295
13818 9295 7428 7191 5139 5091 4777 5813 5802 8107 7579 5693 4571 3106 5121 8047 7154 5557 6587
13801 6587 5915 7907 7084 4622 7116 5573 3642 1263 3281 3818 5195 8444 8963 6758 6833 7350
13785 7350 10097 10631 9466 6855 5008 5115 7146 9265 10288 8887 5179 5351 6884 6017 8762 9702
13769 9702 11808 13116 13444 13143 9177 6595 5224 4654 6170 4704 4751 4560 7205 9226 10571 9867
13753 9867 7557 6670 9872 12252 12875 10379 9597 8592 8867 10078 10634 8373 7122 8826 8906 9394 10647
13736 10647 11908 9991 7509 5796 8849 9303 9409 8469 7114 7348 5949 6350 5497 2222 2028 3146
13720 3146 5248 5653 7703 7594 6980 7975 9820 9925 8787 5962 4142 3533 6985 8256 9102 8816 9330
13703I330j364j832k75K25j534o07j19m40P60R2R16R71k29J016K180j038j526
13686F526j73J110J801k535r69K46P27K84r74K195K89Q91J688J383M27j551j02
13669A1263k889l902p80p48P92K071M331J162p66n60j603l499p12L108M48j653
13653F063j898K03M11J639K825j183o97k33N49k202k796J795N480J179r42j208
13637H985p32J019J103q18K455P85N65L07q42j562n8m65J45Q3O23J141j294k012
13619I428m59J016p77N27p60j122N10j913j764j395J144L625K569J012j009l43
13603A0289Q06J108J995K421J617j464j268K211p03k533K88k127j636n51l074
13588G379J928K301L112K65K685J633j379j891N75R91R62N8k308r94j627j641
$$ plain form
13703 9330 7966 6134 5859 6084 4550 3943 3824 3384 4144 4236 5152 6123 5894 6910 9090 8052 6526
13686 6526 6353 7463 9264 6729 5760 6006 6733 7017 6043 8238 8527 9418 11106 12489 12916 11365 11263
13669 11263 8374 4472 3692 2944 3736 5807 10138 11300 10534 9974 8371 4872 4160 7268 7716 6063
13653 6063 4165 4368 4779 6418 9243 8060 7363 7130 7679 5477 2681 4476 9956 11135 10193 8985
13637 8985 8253 9272 10375 9557 12012 12797 13362 13669 12827 11265 11207 10742 10887 10970 11593 12734 11440 9428
13619 9428 8969 9985 9208 9735 8975 7853 8363 6450 4686 3291 4435 8060 10629 11641 10632 10289
13603 10289 11095 12203 14198 16619 18236 16772 15504 17715 17012 14479 14767 12640 11004 10453 7379
13588 7379 9307 11608 14720 14985 17670 19303 17924 16033 16608 17599 18561 18619 16311 15317 13690 12049
13572A2049l518J104L696K098K521l211l984K307M942K722k115l706M65j033N52
13557A4889n51p16L61p88k66J074K598j3j090k128k978Q76n58m237j76qR58K428
13539I675L496L218q37l52j692j79J292o84N5o70j480k169O21J917k745K576L438
13522A5480L080J745j333k088n14l16Q92k050k186k46N64J059j98j794K421J221
13506A5737k689q93K54K157j95k344N2J081j211K87k317j809J046K334K875L58
13490A4723o97P48K49r63j79p53N77L45P76K89J676p92J770J501r84j065k387
13473A4834M46N70k44P96j665o26k18M65L266O17J880r63m409m05J654n37n09
13456A4952J884J301j344L08J181j79l086M87j294M8O69K397J943K275J895j355
$$ plain form
13572 12049 8531 9635 13331 15429 17950 14739 10755 13062 18004 20726 18611 14905 15370 14337 14889
13557 14889 14338 13622 13983 13195 12929 14003 16601 16588 15498 13370 10392 11268 10710 6473 6297 6289 7247 9675
13539 9675 13171 16389 15552 15200 13508 13329 14621 13937 13992 13322 11842 9673 10294 12211 9466 12042 15480
13522 15480 18560 20305 18972 16884 16370 16054 16946 14896 12710 12464 13028 14087 13889 12095 14516 15737
13506 15737 13048 12155 12409 14566 14371 12027 12079 13160 11949 12236 9919 8110 9156 11490 14365 14723
13490 14723 14026 14774 15023 14060 13881 13128 13705 14050 14826 15115 16791 15999 17769 19270 18286 17221 14834
13473 14834 15280 15850 15606 16402 14737 14111 13893 14358 17624 18241 20121 19158 14749 14344 15998 15461 14952
13456 14952 16836 18137 16793 17101 18282 18103 15017 15504 14210 14258 14927 17324 19267 21542 23437 22082
13440B2082R23j744k098l84j62k921j547K375K176M11J373M96m0K725N22L30J59
13423B4676j847k945j734K159r62k132n4P21N84j267j464J916J140k645k996K393
13407A5543P04l275l303J144J720n89K387K593L416J830k71L52J52j33Q58l68
13391B2760j409P23K363k028l962j133O21k889K75M774l08r99J250L377j095j165
13375B1155O65m26k292k248j690j42j157J449L440J719j500j762k790O71L104
13360A8196l16j251P02M116k57j302R01L096M069j247Q30L598m48o735m062J696
13344B1586Q85j768J225O353K318P7j178N98J677j49n31j093j724n197o036k812
13328A4231O79J920L971k37l531N50j218q83L456j304m33j808O61L467M095K76
$$ plain form
13440 22082 23005 21261 19163 18779 18617 15696 14149 16524 18700 19111 20484 20980 20940 23665 24187 24517 24676
13423 24676 22829 19884 18150 20309 19347 17215 17161 17882 18466 17199 15735 17651 18791 16146 13150 15543
13407 15543 16247 12972 9669 10813 12533 11944 14331 16924 20340 22170 21899 22251 22403 22270 23128 22760
13391 22760 21351 22074 24437 22409 18447 17314 17935 15046 15321 20095 19787 18788 20038 23415 22320 21155
13375 21155 21820 21394 19102 16854 15164 15022 13865 15314 18754 20473 18973 17211 14421 15092 18196
13360 18196 17880 16629 17331 21447 21190 19888 20789 23885 27954 26707 27537 31135 30687 23952 19890 21586
13344 21586 22471 20703 21928 28281 30599 30676 29498 30096 31773 31624 31093 30000 28276 23079 17043 14231
13328 14231 14910 16830 20801 20564 17033 17583 16365 15482 18938 17634 17201 15393 16054 19521 23616 23892
13312B3892j256K62J746J699J177N1j092j204k628k110j759j347J443M82l22Q61
13296A9895J610L924O31J466L817K390j464j403k679J54J4o18q50L02J061j70
13280B8080Q51j899j92J543k492p32N131N608L25N61L746K696k12P38P81k835
13264D1698l619j630M042K444Q57j350k738j092J226J811K896K077K215Q699R939
13249F7475J0010J3274J0676K454l650o108k044K615P264J0569Q017N692P946
13236A34190R147J4137K4990M2120O5656J09227J90594L34829N23272N05627J84433
13225B138222p3033l01849m98994m20339k67523j61147j00943o4192m3046k8410
13215A78746j9207j2361q698p712j413L397k744p338j0866j5462j0984k544O48
$$ plain form
13312 23892 22636 22898 24644 26343 27520 27571 26479 25275 22647 20537 18778 17431 18874 19356 19034 19895
13296 19895 21505 25429 26060 27526 31343 33733 32269 30866 28187 28341 28355 27737 26887 27189 28250 28080
13280 28080 28931 27032 26840 28383 25891 25159 30290 35898 36223 36784 40530 43226 43014 43752 44533 41698
13264 41698 38079 36449 40491 42935 43792 42442 39704 38612 39838 41649 44545 46622 48837 57536 67475
13249 67475 77485 90759 101435 103889 100239 94131 92087 94702 101966 112535 120552 126244 134190
13236 134190 143337 157474 182464 224584 290240 399467 590061 924890 1448162 1953789 2138222
13225 2138222 2065189 1763340 1264346 844007 576484 415337 314394 250202 207156 178746
13215 178746 159539 147178 138480 130768 129355 132752 130008 122670 111804 96342 85358 82814 83462
13202H3462M360O275K34p091o441n922n477k184l86J03p07k286l167l460j936
13187E5377k411m166j969j318k846l275l658m255l263j685n15L260O783M013N95
13172D0667j63K11k643l504n009j089R10J951k24j511L168P976O050N56o233q814
13156C2299k767m68j2430o647Q795J1538K308N07M779K643J029J460N664O775
13142E5485P024k963k597K701K026j231k116j92j405l376k248j529o86P34K22
13127D9849N28M482K536J827J55k025k24o15K84J262l65J6k405k650j083j040
13111E0532n81J8K287J113J82L006J522K655K271M209M486L636K863J470K570
13096H2239K189j758k034r73j464p11r29l699j320L534N377M756O021N953P899
$$ plain form
13202 83462 87822 94097 94331 87240 80799 74877 69400 67216 66830 66933 66226 63940 60773 57313 55377
13187 55377 52966 48800 46831 45513 42667 39392 35734 31479 28216 26531 26016 29276 36059 40072 40667
13172 40667 40504 40715 38072 34568 29559 28470 29380 31331 31107 29596 32764 40740 46790 47346 41113 32299
13156 32299 29532 29064 16634 9987 18782 30320 32628 33135 37914 40557 41586 43046 48710 55485
13142 55485 62509 59546 56949 59650 61676 60445 58329 58137 56732 53356 51108 49579 48893 49627 49849
13127 49849 50377 54859 57395 59222 59377 57352 57128 56513 56797 58059 57694 57710 55305 52655 51572 50532
13111 50532 49951 49969 52256 53369 53551 56557 58079 60734 63005 67214 71700 75336 78199 79669 82239
13096 82239 84428 82670 80636 79663 78199 77488 76559 72860 71540 75074 80451 85207 91228 97181 105080
13081A05080P104M558P414J1687J1463l158k0337l0115k6365k6514k2968n182
13069A2667N249R342O133R198Q072R0l387m310m232L18K739J549L521L463K786
13054E3198L263J940R68K938j510j20K891N465L151M905K942K143j047j148k434
13039G7545l498J752M143N955Q478J1492J4193J7228K3721L0828M1905N9327P8361
13026C71430J22603J95615L02932L97907L62298J81939k7601k14195l22144l10914
13016A059870k36276j68165j14465q4269q6536p2844l2010l5249l1677j9266j4636
13005A64477j2819j1808p821r668p361l796r33l182r738j0780j0527n929j197
12992F8918L276N700N065j19l309j2266j0740l693J877N381P032O181O683M979
$$ plain form
13081 105080 112184 116742 124156 135843 147306 144148 123811 93696 67331 40817 17849 12667
13069 12667 17916 27258 33391 42589 50661 50751 47364 43054 38822 39140 41879 43428 46949 50412 53198
13054 53198 56461 58401 59369 62307 60797 60677 63568 69033 72184 77089 80031 82174 81127 79979 77545
13039 77545 74047 75799 79942 85897 94375 105867 120060 137288 161009 191837 233742 293069 371430
13026 371430 494033 689648 992580 1390487 1752785 1934724 1907123 1692928 1370784 1059870
13016 1059870 823594 655429 540964 456695 370159 297315 265305 230056 198379 179113 164477
13005 164477 151658 139850 132029 122361 115000 111204 110271 107089 97351 86571 76044 70115 68918
12992 68918 72194 77894 82959 82840 79531 67265 56525 52832 54709 60090 67122 73303 79986 84965
12978H4965k28L00n041p561k663k500l555q89M684J2344K5184K1216R474J655
12964A37385o853r076r758n361N865K2137K5803Q142o92R120K8164J5146o866
12951B13156k7335k1676j5742j8685j4908j1304j2141o616j720n10M566Q433O800
12938A02318J1083J0246N457R04J15j57j211J522P856J1118R901P082L057j677
12924A67614p65M190J1617K0558L4363L8967J0214m418j4054k2830j5477j2765
12912B17214j6273j6227j1009n636p251j064O800Q603Q874J3969J6075J9448K2057
12899B55580K0573J7234P586O693M440J652J3508J9702K7862O1062R1768N7091
12887E84751J8769N509q1385j05561n3605k0484j5520k1640k5927k9520k4022
$$ plain form
12978 84965 84737 85037 79996 72435 69772 67272 63717 62828 67512 79856 105040 126256 135730 137385
12964 137385 130532 121456 111698 106337 112202 134339 160142 168284 167592 176712 204876 220022 213156
12951 213156 185821 164145 148403 129718 114810 103506 91365 84749 83029 82519 87085 95518 102318
12938 102318 113401 123647 129104 130008 130123 129966 128755 130277 138133 149251 159152 166234 169291 167614
12924 167614 166849 171039 182656 203214 237577 276544 286758 282340 268286 245456 229979 217214
12912 217214 200941 184714 173705 168069 160818 159754 166554 175157 184031 198000 214075 233523 255580
12899 255580 276153 293387 300973 307666 312106 313758 327266 346968 374830 435892 527660 584751
12887 584751 603520 609029 527644 422083 368478 347994 332474 310834 284907 255387 231365
12876B31365j5925q718M62P113J3412J6334J8339J3528K260n923p132p179r348
12863B48588n485Q7L252P566J3886J3300J1201J6750J8273J9065K2402K3919J8029
12850D10833J2870P862O42o662k218P680Q228N093M210P918R379N219k633K936
12836D71357N085Q749K5465L3990L2999K9088K4092J4387J9701L1321L8896M8204
12824G83334N0580O0290O1204N0974M3734M6751M1975J7972Q081J5144R663J2026
12812A201728K7447L7980M9291P1164R1779J01013J05894J06074J09005J24288
12802B025663J31267J70658K46576L39741M57995O75172J041475J614853K136581
12793H839981K084073J525805M68346q19559j486759j660801j384636p94115k67698
$$ plain form
12876 231365 215440 206722 207184 214297 227709 244043 262382 275910 278170 272247 265115 257936 248588
12863 248588 243103 243190 246442 254008 267894 281194 292395 309145 327418 346483 368885 392804 410833
12850 410833 423703 431565 432207 425545 423327 431007 439235 444328 448538 456456 465835 471054 468421 471357
12836 471357 476442 485191 510656 544646 577645 606733 630825 645212 664913 696234 735130 783334
12824 783334 833914 894204 955408 1006382 1050116 1096867 1138842 1156814 1164895 1180039 1189702 1201728
12812 1201728 1229175 1267155 1316446 1387610 1479389 1580402 1686296 1792370 1901375 2025663
12802 2025663 2156930 2327588 2574164 2913905 3371900 4047072 5088547 6703400 8839981
12793 8839981 10924054 12449859 12918205 12098646 10611887 8951086 7566450 6772335 6504637
12784F504637O7770K97897M95055O76483R02625J176704J515981K014179K361260
12775A6012591K494694K954992L671277M816089O916472J0018581J4718361K2713643
12767H4316700L7158522O2048449Q8202346O9754987J4681726j5207796l9544878
12760C01410056p3972029p0253284m8495028l1501206k0503656j3502286r099897
12753C4082670o193460m071930k663504j656769l55261P95063K43731j063952
12745A9116588j758825k837691l238768k394593j574289j053019p75262o21062
12737D863079n05615m36327l87412l30403k66337k24777j91911j48521j18436
12728B253340j00931j05617j03959p7757p5739r7284j04649j00880r6665p4561
$$ plain form
12784 6504637 6572407 6870304 7365359 8041842 8944467 10121171 11637152 13651331 16012591
12775 16012591 18507285 21462277 25133554 29949643 36866115 46884696 61603057 84316700
12767 84316700 121475222 183523671 271726017 341481004 356162730 340954934 301410056
12760 301410056 227438027 157184743 108689715 77188509 56684853 43182567 34082670
12753 34082670 27889210 23817280 21153776 19497007 19141746 19936809 20180540 19116588
12745 19116588 17357763 14520072 11281304 8886711 7312422 6259403 5484141 4863079
12737 4863079 4357464 3921137 3533725 3203322 2936985 2712208 2520297 2371776 2253340
12728 2253340 2152409 2046792 1942833 1865076 1789337 1692053 1587404 1486524 1389859 1315298
12718A315298o0517n7209n7659n9738o3064n4372m9633m7624l6224j7536j889
12707H09833K356Q770O656k398j3698j3611j0523j0626j4025j2158m442N217L5641
12694G86992O4327N2176K2697j3049o8276j05529q8527n5588l9507k5359j4485
12683E15872j5657j3304r859r457j4367k0494j9952j0950l0N086R149O683K227
12670D24947K004K111k027o277j983o99j135J532j74l753j93N724O967J6194K1687
12655D64925J5520K733o471n924n732j75J2160J6341J4371J3021Q842n698j5312
12642E08601k7415m4019l2927k831J9461K1106N0669N9633J5205Q951L4611M2467
12630F53512L9951L3388J7302K904q80L959J6467L0010L6747L3397K8510K3909
$$ plain form
12718 1315298 1254781 1197572 1139913 1080175 1017111 962739 913106 865482 829258 811722 809833
12707 809833 812189 820959 827615 825217 811519 797908 787385 776759 762734 750576 746134 751351 786992
12694 786992 851319 903495 926192 913143 844867 739338 650811 595223 555716 530357 515872
12683 515872 500215 486911 477052 467595 453228 432734 412782 401832 401802 406888 416037 422720 424947
12670 424947 426951 429062 427035 420758 418775 418076 416941 418473 418299 414546 414353 420077 427044 443238 464925
12655 464925 480445 483178 476707 470783 465051 464876 477036 493377 507748 520769 529611 523913 508601
12642 508601 481186 437167 404240 401409 420870 441976 492645 552278 567483 576434 611045 653512
12630 653512 693463 726851 744153 747057 746177 750136 766603 796613 833360 866757 895267 919176
12618I19176J9732J3462J1926J6505K4635L6218M1237L7207L2842L7901M3841
12607A234682L7380O3325R5630J16450J20339J22342J37679J50992J66001J73031
12597B417851J72899J77933J87325K14613K60240L17550L84576M60924N39435
12588E133346O26272P38516Q87064J100296J395748J701919J890534J992404K215620
12579A7681719K676394L510482M894455O934117R893061J4473706K2178771L5457708
12571A17700413N5489507P1708944O1853206K8208216n298002l2301901n5218514
12564B42141869o3157373n2336642l6461454k4276209j6216348j1061953p751274
12557C0880616n518241l935005k915955k367905k069343j883292j732895j486693
$$ plain form
12618 919176 938908 952370 964296 980801 1005436 1041654 1082891 1120098 1152940 1190841 1234682
12607 1234682 1272062 1335387 1431017 1547467 1667806 1790148 1927827 2078819 2244820 2417851
12597 2417851 2590750 2768683 2956008 3170621 3430861 3748411 4132987 4593911 5133346
12588 5133346 5759618 6498134 7385198 8485494 9881242 11583161 13473695 15466099 17681719
12579 17681719 20358113 23868595 28763050 35697167 45590228 60063934 82242705 117700413
12571 117700413 173189920 244898864 306752070 334960286 329662284 297360383 242141869
12564 242141869 178984496 126647854 90186400 65910191 49693843 38631890 30880616
12557 30880616 25362375 21427370 18511415 16143510 14074167 12190875 10457980 8971287
12549H971287j185038r25926p25324n71945m62005l90725l47976l10694k86696
12540C764958k75849k57819k26499k00143j64867j33871j14576j03556j06037
12531B181741j04163r9004r7818r9130r7813r1516p8222o6707n4276m9743n1862
12520A291487n5743n5586n0887n0218m1843k7752k3190j7320j0209j5795k5036
12509I17908l1845l1207k9572k2399j7208k3106k4298k3277k4245j8814j0510
12498F61427l176J205p33j1554j7530j8432k1613k1942k1754j7245j8070j7077
12486D93506j3315q769j1537j8929j9086j5495j2624p925M67N357N196R056N296
12473D11198p93l010j656l465k410l138j1282j5838j7765j8096j2044m709J14
$$ plain form
12549 8971287 7786249 6860323 6134999 5563054 5101049 4710324 4362348 4051654 3764958
12540 3764958 3489109 3231290 3004791 2804648 2639781 2505910 2391334 2287778 2181741
12531 2181741 2077578 1978574 1880756 1781626 1683813 1592297 1514075 1447368 1393092 1343349 1291487
12520 1291487 1235744 1180158 1129271 1079053 1037210 1009458 986268 968948 958739 942944 917908
12509 917908 886063 854856 825284 802885 785677 762571 738273 714996 690751 671937 661427
12498 661427 658251 659456 658723 647169 629639 611207 589594 567652 545898 528653 510583 493506
12486 493506 480191 471422 459885 440956 421870 406375 393751 385826 386293 391650 396846 405902 411198
12473 411198 410405 407395 405739 402274 399864 396726 385444 369606 351841 333745 321701 316992 317106
12460C17106J650O481J1414O983L107m356j5008k5069k1121j6751k1514k2398
12448B20524j7389k0153l0584k7258j3881n816K502J7440K7178J2471n855p607
12436A51572o432r679j4398r769m042r36J801N939Q634P383Q145R190M958J159
12422A53525k448q618j1335j4642j4215j6708j9488j8200j3559r767n616K378
12410B1307J2933K2640K2871J2995L281k181l137K320L988M639R720N892K291
12397A19559l266m629j622K812M648P213N917N383L664O161K606n157j1250j0974
12383A21065j3686j7534k1855k7035k5239j3333KJ3721L0848L2237J8069J1079
12371A08339O248q576k0964j8290j1033q545n724M744J4670J7836J2747R645M981
$$ plain form
12460 317106 318756 325237 336651 343634 346741 342385 327377 302308 281187 264436 242922 220524
12448 220524 203135 182982 152398 125140 111259 105443 107945 125385 152563 165034 159179 151572
12436 151572 145140 135461 121063 111294 107252 106316 108117 114056 122690 130073 138218 147408 152366 153525
12422 153525 151077 142459 131124 116482 102267 85559 66071 47871 34312 24545 18929 21307
12410 21307 34240 56880 79751 92746 96027 93846 90709 93029 97017 101656 111376 117268 119559
12397 119559 116293 111664 110042 112854 117502 124715 130632 136015 139679 145840 148446 143289 132039 121065
12383 121065 107379 89845 67990 40955 15716 2383 2385 16106 46954 79191 97260 108339
12371 108339 114587 106011 85047 66757 55724 47179 41455 46199 60869 78705 91452 101097 106078
12358A06078J944m847j2073q032l030L88K571J583N247J0239J1314P659K441l506
12344A17976n450r427q234k254r39j053L004L079m92L15K042n08M200Q133K807
12329A13199K104J694p001j0659r794o511K421L356N691J2261J1280O458L055
12316A27554k014j0445j1591j0025o992K16O740N572L207P296J2996J1669J4497
12303A48680J5993J5894K1448L2565M8429P2176J12363J81934L12142N01242N13513
12292A976379K01054o5679k82191m95456m34730k80936j69531j05881o6767m5113
12282B31149k9984j7082j1813q899p04K879m301q435j0944j0239j3819p683n609
12269A04516q064o913m570P03l07K012O511M934J668k669j2764k4340k6449k3392
$$ plain form
12358 106078 108022 103175 91102 83070 80040 80428 82999 84582 89829 100068 111382 119041 121482 117976
12344 117976 112526 103099 94865 92611 91672 90619 93623 96702 96210 96525 98567 98059 102259 110392 113199
12329 113199 115303 116997 109996 99337 89543 83032 85453 88809 94500 106761 118041 124499 127554
12316 127554 125540 115095 103504 93479 86487 86703 93443 99015 102222 109518 122514 134183 148680
12303 148680 164673 180567 202015 234580 283009 355185 467548 649482 961624 1462866 1976379
12292 1976379 2177433 2111754 1829563 1334107 899377 618441 448910 343029 276262 231149
12282 231149 201165 184083 172270 163371 162667 165546 161245 152810 141866 131627 117808 110125 104516
12269 104516 96452 89539 84969 85672 85365 87377 93888 98822 100490 97821 85057 60717 34268 10876
12255A0876k2985j7852q342K847R129N735N280N094O659N813M427M346N085K00
12241A6312k695O65J722j813k795l163M81M27J323K368J966L34K059K091L805
12226B3087L588Q78K191K600j48j047k847k474k740j918Q52m97n10J483j266j771
12210A9461n25j661J07L92k412j030J672M367J269L584J846J582m25m565j272
12195B2390m96j719J48l882j030L318L504J9j797K477L884K108L68J73M04l686
12179B6183p518m635j112j997K222K342L624j188K710M679Q63q5J767M126K428
12164C4409O67o79o56K162K11j211n76J824J694L87j57j135r6j481k079j237k353
12147B9694k596o879m890k205o14k680j459j221J299K39k241K026j090j375J392
$$ plain form
12255 10876 -12109 -29961 -38303 -35456 -26327 -20592 -15312 -10218 -3559 2254 6681 11027 16112 16312
12241 16312 13617 14282 16004 14191 11396 8233 8714 9141 10464 12832 14798 15132 17191 19282 23087
12226 23087 26675 27553 29744 32344 32196 31149 28302 25828 23088 21170 22022 21525 21015 22498 21232 19461
12210 19461 18936 17275 17382 17774 15362 14332 16004 20371 21640 25224 27070 28652 28227 23662 22390
12195 22390 21894 20175 20323 16441 15411 18729 22233 22252 20455 22932 26816 28924 29292 29465 29869 26183
12179 26183 18665 14030 12918 10921 13143 15485 19109 17921 20631 25310 26173 26088 27855 31981 34409
12164 34409 35076 34397 33741 35903 36114 34903 34327 36151 37845 38232 38075 36940 36844 35363 33284 32047 29694
12147 29694 27098 20219 15329 13124 12510 9830 8371 7150 8449 8688 6447 8473 7383 6008 7400
12132G400j293j341K242N240Q362J1226P470R830O184N706O959P409O628N735
12118H7757Q593J3225K3060L3049M5528O5285J02373J67242K70323L81481L83072
12107A580988K28475O242j96941l40180l56228k71544j80641j16721p5567n4166
12097B23717l9458l0185k3361j8333j9269j4644j1219r575r105k760k800k014
12085D0994O6j674j692j172O88q92Q64j230J42k61m522n202m888k033N84J459
12069B1231K091J19k748j900j620r24k152L048J629J216L697K458P25J8k726k456
12053B1706j434n96N51K311o07m345l627j762p32j688k100k173l696J925K528
12038F261r57K284L271J457K797J371q38j2Q7P77J733O23J114Q70k872l799k419
$$ plain form
12132 7400 6107 4766 7008 12248 20610 31836 39306 49136 55320 61026 67985 75394 82022 87757
12118 87757 96350 109575 132635 165684 211212 276497 378870 546112 816435 1197916 1580988
12107 1580988 1809463 1815705 1618764 1278584 922356 650812 470171 353450 277883 223717
12097 223717 184259 154074 130713 112380 93111 78467 67248 57673 48568 45808 43008 40994
12085 40994 41060 39386 37694 36522 37210 36318 37182 35952 36094 35833 31311 26109 21221 19188 19772 21231
12069 21231 23322 23441 20693 18793 17173 16249 14097 17145 18774 19990 23687 26145 26870 26888 24162 21706
12053 21706 20272 19676 20227 22538 21931 17586 13959 12197 11465 9777 7677 5504 1808 3733 6261
12038 6261 5304 7588 10859 12316 15113 16484 15646 15634 15721 16498 18231 18854 19968 20838 17966 14167 11748
12021A1748j260J006J603J001P11N64l29j020J398J389L299J289q62m294l622
12006A2621q76J454k30R47j42Q0j243j022k834j983R44p01r88J033J851K833J387
11989A3131m32J087K553J008K183J303O68J496k764m616j966l088J897M83K98
11974A3241K468R18m683k24P56J357J76l317n383n60q24K910M91K686J482j170
11958A0324o28J379J374J320j833O8k828k763Q69J700q70k283m20j31n60j660
11942C058J37l71K227K914j410o36j800k096k22Q73Q33J704K142k481m93J333
11926E712O33K08J473J928L481l10l150j190n20l56n54r07J06m783l158L188K325
11909D126J12p40j662j95J154j665j750K243K488j705O94J641L241o52k113J6
$$ plain form
12021 11748 10488 11494 13097 14098 14809 15373 15044 14024 15422 16811 20110 21399 20537 16243 12621
12006 12621 11745 13199 12969 13916 13774 13854 12611 11589 8755 6772 7716 7015 6027 7060 8911 11744 13131
11989 13131 12699 13786 16339 17347 19530 20833 21501 22997 20233 15617 13651 10563 12460 12943 13241
11974 13241 15709 16627 11944 11720 12476 13833 14009 10692 5309 4749 3925 6835 7326 10012 11494 10324
11958 10324 9696 11075 12449 13769 11936 12004 9176 6413 7282 8982 8112 5829 5409 5278 4718 3058
11942 3058 3195 2824 5051 7965 6555 5919 4119 2023 1801 2674 3507 5211 7353 4872 4379 5712
11926 5712 6345 6553 8026 9954 13435 13125 9975 8785 8265 7909 7355 6448 6554 1771 -1387 1801 4126
11909 4126 4238 3498 1836 1641 2795 1130 -620 1623 4111 2406 3100 4741 7982 7330 5217 5233
11893E233Q29O87J169p83J990r83k56Q67J257n59l774p87J985k391r13J649k25
11876D995k32R33O0j177Q81J742j900p51J302K008o39p28p38J7j71j56p59p26
11858C961n47J045K737n10l423j294L25J453k03P27R13Q32N84m92j958k033R58
11841C075l9P11K749L97L04J365m17R94k56r01k488J295Q27j398j839J976K455
11824H810k07k69J965O74j084P30j222r33k336j62q82l062K267j409k024L58K114
11807C328J628K32M33j464j384M03R16m87j984j220k086P47J151J025J725R07
11791C870J361l25k483j955r12M35O1K395K66p5p24k89J525J826J602l657k449
11774D72j567K993P80K285K218Q19J83l416j409j994J702K248k874o0k56m50J545
$$ plain form
11893 5233 6062 6749 7918 7135 9125 8142 7886 8753 10010 9451 5677 4890 6875 4484 3571 5220 4995
11876 4995 4763 5696 5756 4579 5460 7202 5302 4551 5853 7861 7222 6494 5756 5773 5602 5446 4687 3961
11858 3961 3414 4459 7196 6686 3263 1969 2294 3747 3544 4271 5184 6016 6600 6108 4150 2117 3075
11841 3075 3036 3747 6496 6893 7197 8562 8145 9139 8883 7982 5494 6789 7616 6218 4379 6355 8810
11824 8810 8603 8334 10299 10973 9889 10619 9397 8464 6128 5966 5084 2022 4289 2880 856 1214 3328
11807 3328 4956 5188 5621 4157 2773 3176 4092 3605 1621 401 -1685 -938 213 1238 2963 3870
11791 3870 5231 4906 2423 468 -444 -9 52 2447 2713 2638 1914 1625 3150 4976 6578 2921 472
11774 472 -1095 1898 2678 4963 7181 8000 8183 4767 3358 1364 3066 5314 2440 2380 2124 1674 3219
11757C219J265oJ328k614J005K397j854k711J119k482k755q11K961N44j491L32
11741e54N54P55J391q85M26J790K1l269j779K529j500l77q50k75J59R86J177L360
11723C659P21j888O09P73L92k1p52l58Q2J5j311J278L513k67q53J317L3R01q27
11704G016j660p87P32l26l182j765J803k21k745q81K093J684o8q82R15K604J949
11687F279j203j521M38j477j828j24J457K224J076J261j761l733l50J003J710
11672C451P86j46k367M99K367L55k761n40L89q77j6N37N54Q46j300P26K942K248
11654G693J53j245j458m74l767l843M23K403M05j221p77K011J570J037P76O2J487
11637E235l28l169k028O61J239J070K808K330l45k024j032N61N46p01p32l15p64
$$ plain form
11757 3219 4484 4478 5806 3192 4197 6594 4740 2029 3148 666 -2089 -2900 61 605 -886 -554
11741 -554 0 755 2146 1261 1687 3477 3498 229 -1550 979 -521 -898 -1748 -2023 -1864 -878 299 3659
11723 3659 4380 2492 3101 3874 4266 4245 3493 3135 3217 3232 1921 3199 6712 6445 5592 6909 6942 7843 7016
11704 7016 5356 4569 5301 4975 1793 28 1831 1610 -1135 -2016 77 1761 1693 811 1726 4330 6279
11687 6279 5076 3555 3993 2516 688 564 2021 4245 5321 6582 4821 1088 738 1741 3451
11672 3451 4237 4091 1724 2223 4590 4945 2184 1644 2033 1156 1140 1677 2231 3077 1777 2503 5445 7693
11654 7693 7846 6601 5143 4669 902 -2941 -2518 -115 290 -931 -1708 303 1873 2910 3686 3748 5235
11637 5235 4907 1738 -290 371 1610 2680 5488 7818 7473 5449 4417 4978 5524 4823 4091 3776 3012
11620C012j441N76R70l76r91n91p61K417j841m71Q68J995M83k167k002j91K894
11603B383J827J384o42j378L6Q8K130m4l15k397j663N62K736J078J356j439k341
11586C361l750k311Q1P57K57n71J494M56M46j176p93o91K090J080k056j068R3
11569b301K062K150K91J26K109J044j75j176j100j734j720k33Q01J179o71J293
11553A945J461p41k323j05P69J939J627j160P12K810p20r85J054j944l133Q48
11537B054J179R70j850j677l9m61K048J197j105J525j631J310j28J022J966J496
11521G876k67l459k823j397L37K341J971K118K81l046j854k023p13j523m8J437
11505g92P49P57K53r81k529K615R50l652l385P47M234J285L590J503K22k014j304
$$ plain form
11620 3012 1571 2147 3117 2741 1750 1159 398 2815 974 503 1371 3366 3849 1682 -320 -511 2383
11603 2383 4210 5594 4952 3574 3610 3698 5828 5784 5469 3072 1409 1971 4707 5785 7141 5702 3361
11586 3361 -389 -2700 -2619 -1862 -1605 -2176 -682 -226 220 -956 -1749 -2440 -350 730 -1326 -2394 -2301
11569 -2301 -239 1911 2202 2328 4437 5481 5306 4130 3030 1296 -424 -657 144 1323 652 1945
11553 1945 3406 2665 342 237 1006 2945 4572 3412 4124 6934 6214 5229 6283 4339 1206 2054
11537 2054 3233 4203 2353 676 637 176 2224 3421 2316 3841 2210 3520 3392 4414 6380 7876
11521 7876 7609 4150 1327 -70 267 2608 4579 6697 6978 3932 2078 55 -658 -2181 -2229 -792
11505 -792 -43 714 967 -14 -2543 72 1022 -2630 -6015 -5268 -1034 251 3841 5344 5566 3552 2248
11488B248r96p25K421J635j496k622J753j551N83J177J533n29n63P77k026j055
11472E64J556J42k681Q86j326k37j223J898L068J046J022r33k944m76J749m77
11456A634k871K0J053l92J554J018q17K186j974j062l198o86L71R08n25k60K083
11439i58j789r96r5j062j533K058L652N08p42Q59J326Q70n58p0p02N98q70j002
11421e06K358K828j710j20N2j933m07p16q04O84L50J757K153r71K00J024M26k725
11403A940k719j582J208L92k449k59P91J954J384q65j194j554J581J019J02k76
11387e27O36M7k52p42L41q23P24N25J57L70L55L78K269k70q82l261l676m80J2
11368e099O83k6L038K320M64P11j3m99q39j067r70n53J86m56m410l68L713L142
$$ plain form
11488 2248 1252 527 2948 4583 3087 465 2218 667 1250 2427 3960 3431 2868 3645 1619 564
11472 564 2120 2262 -419 467 -859 -1096 -2319 -421 2647 3693 4715 3782 838 362 2111 1634
11456 1634 -1237 -1217 -164 -556 998 2016 1199 3385 1411 349 -2849 -3535 -3164 -2256 -2781 -3041 -958
11439 -958 -2747 -3743 -3838 -4900 -6433 -4375 -723 -215 -957 -98 1228 2098 1540 1470 768 1366 496 -506
11421 -506 1852 4680 2970 2850 2902 969 562 -154 -958 -274 76 1833 3986 3015 3215 4239 4665 1940
11403 1940 -779 -2361 -1153 -761 -3210 -3469 -2678 -724 660 -205 -1399 -2953 -1372 -353 -251 -527
11387 -527 109 156 -96 -838 -497 -1320 -596 -71 86 456 811 1189 3458 3188 2306 -955 -4631 -5111 -5099
11368 -5099 -4416 -4442 -1404 916 1380 2091 2078 1579 740 -327 -1297 -1850 -1664 -2120 -6530 -6898 -3185 -43
11350d3K756j303j386J16R22J329r26J166J816K40j030J094j193l46j504j641
11334F7J580Q92o86K888o10k695j535j343p11J489J643l638j061R33K846K012
11318B071R1q89l62j123P64p61j064q21q02M13l97K0p43k33J196L191m84l942
11300c875p39J162L3P70K024K000j47j549j117j679j098K781K692J81L67o64j203
11283f1q83k28J127K162K016P91j301k328r35l804p41m31Q30J543J529J617J334
11266B237O79N74r12M10k297j900r23j404J822K360P10j507p74N35j086O80o29
11249a425P04J298j626J32L243L89k7j074j396N64N7j160j730r89J629J323k92
11232c80M46J301j789p19m01Q15J495K035o95J098J342j052J357r3Q35q93k677
$$ plain form
11350 -43 2713 1410 24 140 1062 2391 1465 2631 4447 4687 3657 4751 3558 3212 1708 67
11334 67 1647 2539 1853 4741 4131 1436 -99 -1442 -2153 -664 979 -2659 -3720 -2787 59 2071
11318 2071 2162 1273 911 -212 552 -209 -1273 -2094 -2896 -2483 -2880 -2860 -3603 -3836 -2640 551 67 -3875
11300 -3875 -4614 -3452 -3419 -2649 -625 1375 1228 -321 -1438 -3117 -4215 -1434 1258 1439 1806 1142 -61
11283 -61 -944 -1172 -45 2117 4133 4924 3623 1295 360 -3444 -4185 -4616 -3786 -2243 -714 903 2237
11266 2237 2916 3490 2578 2988 691 -1209 -2132 -3536 -1714 646 1356 -151 -925 -390 -1476 -796 -1425
11249 -1425 -721 577 -1049 -917 2326 2715 2688 1614 218 782 839 -321 -2051 -3040 -1411 -88 -380
11232 -380 66 1367 -422 -1141 -1542 -727 768 2803 2108 3206 4548 3496 4853 4760 5595 4702 2025
11215B025l067P55J63K39J13O40K122J227j077j960j652J201q95P86J204J843
11199C667j971p50K004k200j505K343L70j738J43L602K806l61l193k387O02J039
11183B471K974O75q5k969j345r62N15r50M78p01m06P60l68j477K58K9J272K948
11165C117J067l189q83K058K67j105n41R7l78k394j586l59L40L265M971N17j555
11148C709j523Q65j990k265q88J576q79q62J782K90P94n15J591k77j187j631M75
11131i35J34K631j027J87O60j043L36m34j361K121q69q21M03L68l12O0n42Q73
11113D29J262j730J81n83J496J904j478j306o24r88L592P24K588m80ML33j641
11096C683K117O24k765j060J33j142o59j275m78m41q53J381J523j558N56J09p21
$$ plain form
11215 2025 -1042 -287 -124 115 228 868 2990 4217 3140 1180 -472 729 -166 620 1824 3667
11199 3667 1696 946 2950 750 -755 1588 1958 220 363 3965 6771 6410 3217 830 1432 2471
11183 2471 5445 6120 6035 3066 1721 759 1274 324 802 101 -305 455 87 -1390 -1132 -1103 169 3117
11165 3117 4184 995 112 2170 2437 1332 791 888 510 -1884 -3470 -3829 -3489 -224 4747 5264 3709
11148 3709 2186 3051 1061 -1204 -2092 -516 -1395 -2257 -475 -185 609 94 1685 1408 221 -1410 -935
11131 -935 -801 1830 803 990 1650 607 943 509 -852 1269 400 -421 -18 350 38 98 -444 429
11113 429 1691 -39 142 -441 1055 2959 1481 175 -449 -1437 2155 2879 5467 4987 4991 5324 3683
11096 3683 5800 6424 3659 2599 2732 1590 931 -344 -822 -1263 -2116 -735 788 -770 -214 -105 -826
11079h26j131N34k113r8J901J296L41l98J463J018k357K13O68l03j12L92K89J958
11061B735n40R32J122p19o14P9o70k100k21L10M3J362J37k897j497J556J158j628
11043a452n47J459L07p78K268J354J128P60m290k581l63K017P82J789j35J570
11027C288K613r49n667j879J164M21l145K88J568k045L28J846L376k13k503J560
11011E1K73j598j164j984L324J847J57j791J004J656J068j938n24q03L01j163
10995a284j541J522K450Q58O54l73r47k82P56R97j210m028j969q53O26K213J648
10978g63J006k059J036J486J48k84k61k819j003k50n6J585J788K858K429j085
10962C756l015l00J43J256j022J17q59N08K548j821J192N41k673k480J565K559
$$ plain form
11079 -826 -1957 -1423 -3536 -3634 -1733 -437 -96 -494 969 1987 -370 -157 511 208 96 488 777 2735
11061 2735 2195 3127 4249 3530 2916 2995 2325 225 4 314 357 1719 1856 -1041 -2538 -982 176 -1452
11043 -1452 -1999 -540 -233 -1011 1257 2611 3739 4499 209 -2372 -2735 -718 64 1853 1718 3288
11027 3288 5901 4952 -715 -2594 -1430 -1009 -4154 -3866 -2298 -4343 -4015 -2169 1207 994 -1509 51
11011 51 324 -1274 -2438 -4422 -1098 749 906 -885 119 1775 2843 905 381 -422 -121 -1284
10995 -1284 -2825 -1303 1147 2005 2659 2286 1339 1057 1813 2810 1600 -2428 -4397 -5250 -4624 -2411 -763
10978 -763 243 -1816 -780 706 854 570 309 -2510 -3513 -3763 -3819 -2234 -446 2412 4841 3756
10962 3756 741 441 584 1840 818 935 76 584 3132 1311 2503 3044 371 -2109 -544 2015
10946B015m24O9j396k810o58o98K835J03K08J473j78j159J252k788j223M042Q87
10929A550J25j22n61j640R64m04q15j038j888j597j354J690K534q12K096K743
10913A471m05j169R68k176m411j053M10K179K865n97m80J252L244J403k306j673
10897d78j586k8j336r73o74J948K809p46q65J958J594j623k553Q18P17k097j513
10880d628l93O84k15M34O13J672r67l34m7J68O2k373J360J345J736L123K267r86
10862C521l54J437K219J513l096k163k068N28J549p00j428r26K09J73J145K858
10846D417O98n59j952l131J29J637o10j207J473j424j327K99K72P5m06q41j5J682
10828g90M70p04L28l14j157J350J14j258O4LJ177L92j089k425l463Q83K74Q68
$$ plain form
10946 2015 1591 1660 264 -2546 -3204 -3902 -1067 -964 -756 717 539 -620 632 -2156 -3379 663 1550
10929 1550 1675 1553 992 -648 316 -88 -903 -1941 -3829 -5426 -6780 -5090 -2556 -3368 -1272 1471
10913 1471 1066 -103 865 -1311 -5722 -6775 -6365 -4186 -1321 -1918 -2398 -1146 2098 3501 1195 -478
10897 -478 -2064 -2092 -3428 -4401 -5075 -3127 -318 -1064 -1929 29 1623 0 -2553 -1735 -1018 -3115 -4628
10880 -4628 -5021 -4337 -4552 -4118 -3505 -1833 -2800 -3134 -3181 -3013 -2951 -5324 -3964 -2619 -883 2240 4507 3521
10862 3521 3167 4604 6823 8336 5240 3077 1009 1537 3086 2386 958 32 241 414 1559 4417
10846 4417 5115 4556 2604 -527 -398 1239 629 -578 895 -529 -1856 -1557 -1285 -1210 -1616 -2457 -2472 -790
10828 -790 -320 -1024 -696 -1010 -2167 -817 -703 -1961 -1897 -1894 -717 -325 -1414 -3839 -7302 -6419 -6145 -5277
10810e277r29J397J897J757L123Q72k860p89q19j153j311L81J04L39m04J041q92
10793c523l0k94J700o98J589J356k401L30J341Q41R12O15k235l21R71n84J717
10776A286k41j388j905j62l37R99M601J216k485j803l26p69j20J794O49k815j3
10759a819K521p31j929j907J014o15J80j99R03J524L254k46l356l73o8L64N94
10742h89J186j516K56j556l65Q34J901Q4M12l29m69M67J664J521n15j618j823
10725g55j862L9J199m38J333K770J543n36l065j647K569N30j574K29J990r41j778
10708c94j24J235J13k557p12P30K733k219p09k024j049K26Q8J304J699K033k9
10691C44j745k95Q8R27k01j469p65nJ352J038r81j950R93J920J543K048r12j576
$$ plain form
10810 -5277 -6206 -4809 -2912 -1155 1968 2840 -20 -809 -1628 -2781 -4092 -3711 -3607 -3268 -3672 -2631 -3523
10793 -3523 -3553 -3847 -2147 -2845 -1256 100 -2301 -1971 -630 211 1123 1738 -497 -818 153 -431 1286
10776 1286 1045 -343 -2248 -2410 -2747 -1748 2853 4069 1584 -219 -545 -1314 -1434 360 1009 -1806 -1819
10759 -1819 702 -29 -1958 -3865 -2851 -3466 -3286 -3485 -2582 -1058 2196 1950 -1406 -1779 -1847 -1483 -889
10742 -889 297 -1219 -963 -2519 -2884 -2050 -149 -65 347 18 -451 16 1680 3201 2686 1068 -755
10725 -755 -2617 -2578 -1379 -1817 -484 2286 3829 3293 228 -1419 1150 1680 106 335 2325 1384 -394
10708 -394 -518 717 830 -1727 -2439 -1709 1024 -1195 -1904 -3928 -4977 -4751 -4663 -3359 -1660 373 344
10691 344 -1401 -1696 -1608 -681 -882 -2351 -3116 -3121 -1769 -731 -1712 -3662 -2669 -749 794 2842 1930 354
10673C54j05J392K700K13p03j332m88o03j16j758k97k135L52J852j15k200l40
10656c329K80O0J22J393Q84j842j57K289n40R81J808n36J6J681j35j843K73J055
10638B460k169r04m43j048K283J590M74K535j884k666q2M70Q24L91O24l12L13
10621B456j429l602j66J003M10K71m02K62P37O27K995M88j260L30r58j656J459
10604A565j065J684J64k086j987O94L53j935L46J209R39K30p4k202R40K036p09
10587A02l32K64l4j485J79J695j062N33j304m49J60p72M28q15K869j32j036j649
10569b840o3N69K008j083K16J407n94K05J291Q9J77J04j69l824j140M99K208L07
10551f33j032k047P46J558K740J185j385k35j247j334J205q09J53Q7j220q48l0
$$ plain form
10673 354 249 1641 4341 4554 3851 2519 2031 1428 1312 -446 -743 -2878 -2526 -674 -789 -2989 -3329
10656 -3329 -3049 -2989 -2867 -1474 -590 -2432 -2589 -300 -840 141 1949 1413 1429 3110 2975 1132 1405 2460
10638 2460 291 -613 -1056 -2104 179 1769 2243 4778 2894 228 146 616 1440 1831 2455 2143 2456
10621 2456 1027 -2575 -2741 -1738 -1328 -1057 -1459 -1197 -460 167 3162 3650 2390 2720 1762 106 1565
10604 1565 500 2184 2348 262 -1725 -1031 -678 -2613 -2267 -1058 -119 111 37 -2165 -1225 811 102
10587 102 -230 34 0 -1485 -1306 389 -673 -140 -1444 -1893 -1733 -2505 -2077 -2892 -23 -155 -1191 -2840
10569 -2840 -2903 -2334 -326 -1409 -1193 214 -380 -175 1116 1205 1382 1486 1317 -2507 -3647 -3148 -940 -633
10551 -633 -1665 -3712 -2966 -1408 1332 2517 1132 897 -350 -1684 -479 -1288 -1135 -1048 -2268 -3116 -3146
10534c146M00l35R91P81P44j134l77j353N57J743j726J708N43J286j365j359J071
10517i71J088j092K46J400o25j926O20O15P13m138k69K716p87j724R84J423P17
10500a010K434O69l13J92k165J276q28j477j662J066j58J493J588q19J060k17
10484A129k30N50o54k330j608M90L163J377P9O97j278k406l329J817J825J801
10468A093J00q80m14j360n93j366j309J556l01q12J887J553K747l49p21P3L22
10451A226K53L0j264m82j862k04L99N22N1O22j053L12L605j191j741J175J585
10434A983O07j423K7Kq09J30J04Q07J685r84P57J706k144l211j746Q08J249M09
10416d3K577J313k409r26j081j096J970m9O31p1m76j75k63J110q72K076K940J00
$$ plain form
10534 -3146 -2746 -3081 -2090 -1309 -565 -1699 -2076 -3429 -2872 -1129 -2855 -1147 -604 682 -683 -2042 -971
10517 -971 117 -975 -729 671 46 -1880 -1260 -645 68 -4070 -4339 -1623 -2410 -4134 -3150 -1727 -1010
10500 -1010 1424 2093 1780 1972 -193 1083 255 -1222 -2884 -1818 -1976 -483 1105 286 1346 1129
10484 1129 899 1449 795 -1535 -3143 -2653 510 1887 1966 2663 1385 -1021 -4350 -2533 -708 1093
10468 1093 1193 313 -101 -1461 -2054 -3420 -4729 -3173 -3474 -4286 -2399 -846 1901 1552 831 904 1226
10451 1226 1479 1509 245 -237 -2099 -2303 -1904 -1382 -1331 -709 -1762 -1450 2155 964 -777 398 1983
10434 1983 2590 1167 1194 1196 387 517 621 1428 3113 2129 2886 4592 2448 -763 -2509 -1701 -452 -43
10416 -43 2534 3847 1438 512 -569 -1665 305 256 887 816 340 165 -98 1012 140 2216 5156 5256
10398E256l857m04O20l63o19K575M29k860k227J545k337q03J356n83j189R75p39
10381c225k58K126j196o25Q27J227j796r20p90K284J659o67P1Q10r89J370J83
10364I1J81O81N2N21k086k238j842M67L65J641L122J040k02j353j943j761k7j048
10346d339K818J473j005j354m39L32p83J944j08O44l098k14K363N81K58o48j90
10329a765M14K852K930m39n56n6j736j828l028j641K774K454j34k1K21J007J204
10312B652O54n77j468J3j42j540Q86L371L058k011l259k716j519M4K993J96j09
10295E26k67r64P80P57j836j761J573Q23j369l42K2l6K05J12P74M19j878J196
10277a266J657j492k064K162L208J71l350K20K016L221j096J379M4K71j576m59
$$ plain form
10398 5256 1399 995 1615 1252 633 3208 3637 777 -1450 95 -2242 -3045 -1689 -2272 -3461 -2486 -3225
10381 -3225 -3483 -1357 -2553 -3178 -2351 -1124 -2920 -3840 -4630 -2346 -687 -1354 -1283 -473 -1462 -92 91
10364 91 272 953 1005 1526 -560 -2798 -4640 -4173 -3808 -2167 955 1995 1793 440 -1503 -3264 -3291 -4339
10346 -4339 -1521 -48 -1053 -2407 -2846 -2514 -3297 -1353 -1461 -817 -3915 -4129 -1766 -1185 -927 -1575 -1765
10329 -1765 -1351 1501 4431 3992 3436 3380 1644 -184 -3212 -4853 -2079 375 241 220 441 1448 2652
10312 2652 3306 2729 1261 1274 1132 -408 478 3849 6907 4896 1637 -1079 -2598 -2554 439 635 526
10295 526 259 -705 75 832 -1004 -2765 -1192 -369 -1738 -2080 -2058 -2094 -1889 -1777 -1003 -584 -2462 -1266
10277 -1266 391 -1101 -3165 -1003 2205 2376 -974 -754 1262 4483 3387 4766 4810 5081 3505 3046
10261C046M79J272j251k850J57J383r35k169n00Q71o38J420J838p70j760L64j61
10244b04l56J92m0K65J942L27J426j436k618N75l54j540J469L388J634j337n159
10227a826k712m45J547J157J03K468K664J116O53j151j839l572n40K194M28K265
10211B510K447k021l747K915L06j049l032o09M369J444J605k597k378Mj45j319
10195a297j71J528j430k559J392Q58J226J850m90j590K585o28r13O74k431k44
10179a640j011q35M81R15J372j828K009J580j808n78K138J219L55n16J337l05
10163B885j103j18P80j746m2J049j36j391j279m83Q59J557k41j761j889j368q52
10146e279J047P87k05k147K272L643n25M88K654M80k842M25N50m39P95j43J172
$$ plain form
10261 3046 3525 4797 3546 696 853 2236 1301 -868 -1368 -497 -1135 285 2123 1353 -407 -43 -204
10244 -204 -560 -368 -408 -143 1799 2126 3552 2116 -502 73 -281 -1821 -352 3036 4670 3333 -1826
10227 -1826 -4538 -4983 -3436 -2279 -2176 292 2956 4072 4725 3574 1735 -1837 -2377 -183 245 2510
10211 2510 4957 2936 -811 2104 2410 1361 -1671 -2280 2089 3533 5138 2541 163 167 22 -1297
10195 -1297 -1468 60 -1370 -3929 -2537 -1679 -453 1397 907 -683 1902 1274 361 1035 -1396 -1640
10179 -1640 -2651 -3486 -3005 -2090 -718 -2546 -537 1043 -765 -1343 795 2014 2369 1853 3190 2885
10163 2885 1782 1664 2444 698 656 1705 1569 178 -1101 -1584 -725 832 591 -1170 -3059 -4427 -5279
10146 -5279 -4232 -3445 -3650 -5797 -3525 118 -407 81 2735 3215 373 798 1348 909 1704 1561 2733
10129B733J447n44j501p24J208k440r07L48J41J345P82r70k84K144J103N90Jj630
10111B842k877j773j878k87J658J649k438j10L15P81R03J12J912n62j973J335
10095c91M75L32j947K7K015j92j213Q8J102j344k088j309r85K108J352J202J108
10078C40q44l07o10L6k481N50R51J786j192k197P77q25R95K740J202J004m70K
10060A457J193O82J37P81m98j275k548l718J437J658L155R41k654n10P13K19k39
10043I31j342P14j16l119j851R49J788J462n86K07R35m03K914j299k292M73k1
10026f56l74l30O81q73n97j209JK388j301j946K737R03L259L5j403l190O46K794
10008A565J68j864j547J189J104J29j277j629j937J478N55J205j52j291o76J787
$$ plain form
10129 2733 4180 3636 2135 1411 2619 179 -728 -380 -239 1106 1888 918 634 2778 3881 4471 4472 2842
10111 2842 -35 -1808 -3686 -3973 -2315 -666 -3104 -3214 -2899 -2118 -1215 -1103 809 247 -1726 -391
10095 -391 84 416 -1531 -1504 511 319 -894 -806 296 -1048 -3136 -4445 -5430 -3322 -1970 -768 340
10078 340 -504 -811 -1421 -1385 -3866 -3316 -2365 -579 -1771 -3968 -3191 -4016 -3021 -281 921 1925 1455 1457
10060 1457 2650 3332 3469 4250 3752 2477 -71 -3789 -2352 -694 2461 3402 748 238 951 1170 931
10043 931 -411 303 187 -2932 -4783 -3834 -2046 -584 -1170 -963 -28 -431 2483 1184 -1108 -635 -656
10026 -656 -1030 -1360 -679 -1552 -2149 -3358 -3357 -969 -2270 -4216 -1479 -576 2683 2718 1315 -1875 -1229 1565
10008 1565 1733 -131 -1678 -489 615 744 -533 -2162 -4099 -2621 -2066 -861 -1013 -2304 -2980 -1193
9992a193J556r40J151K954O67j352r61J75J919j015k013j337j801p37N90J78L256
9975A097Q49j77O85K913J03j67p54j952r4O01k886j101L344Q97j163j465n45J121
9957A306N4j599k84k333j650K337J066l698J54J643J280P50R63j149L84P02r26
9940a000M04j405l382J662L96k03J74N88J585J023j566l11Q05K416K178l39j931
9923A094j438l228M10p48l42J144j549M92r0K60K594K431J768r98l8l271n15j155
9905c179P15J247K373K287O27j927m520k367L003L621J56j504j202j533j087J197
9889b093J354r9j765L85J111L67J479L4m69J389k186k155j830Q1J173J357M99
9872a368l87n63j237J485K772k69o42J866J057Q56j137J985l748l454o0l07K079
$$ plain form
9992 -1193 363 -577 574 3528 4195 2843 1882 2057 3976 2961 948 -389 -2190 -2927 -2337 -2159 1097
9975 1097 1946 1769 2454 5367 5470 5303 4549 2597 2503 3104 218 -883 2461 3358 2195 730 185 1306
9957 1306 1360 -239 -523 -2856 -4506 -2169 -1103 -4801 -4647 -3004 -1724 -974 -11 -1160 -776 -74 -1000
9940 -1000 -596 -2001 -5383 -3721 -3325 -3528 -3354 -2766 -1181 -158 -1724 -2035 -1230 1186 3364 3025 1094
9923 1094 -344 -3572 -3162 -3910 -4252 -3108 -4657 -4165 -4255 -3995 -1401 1030 2798 1800 1762 -1509 -2024 -3179
9905 -3179 -2464 -1217 1156 3443 4070 2143 -2377 -4744 -1741 1880 2036 532 -670 -2203 -3290 -2093
9889 -2093 -739 -838 -2603 -2218 -1107 -740 739 773 304 1693 -493 -2648 -4478 -4397 -3224 -1867 -1368
9872 -1368 -1755 -2318 -3555 -2070 702 433 -209 1657 2714 3570 2433 4418 670 -2784 -2844 -3151 -1072
9855a072K108n15k214q15J727K602J110j824k372j07j138P67J649J865K024k073
9839A722J02J95j337k284L56J200O87j429j344N98K642r53k056j785o20j400K546
9822c160K865j337K12m65m78K101Q88M09k01o51k29J570l6J82j710K18K704O0
9804B942n11N95j859J778j267k227M10K186L788k724k029k7J73q13R27L66l25
9787A383k02P63R07K027k143l173l630j798M80J005K965K911Q47kj790N11K685
9770C746J205k136j207j437j325j34Q11j726J032K557j017r80q72J81K794J495
9754B987j84j106P62j031Q05k468K15J012J925j0l416m79J984J342P18o96O78
9737C038l24J953L00n41j764N84J848l28N25k340k917M74j915N47q0J037k733
$$ plain form
9855 -1072 1036 521 -1693 -2508 -781 1821 2931 1107 -1265 -1372 -2510 -1743 -94 1771 3795 1722
9839 1722 1824 2019 682 -1602 -1246 -46 641 -788 -2132 -1534 1108 155 -1901 -3686 -4306 -5706 -3160
9822 -3160 -295 -1632 -1420 -1885 -2363 -262 626 1035 834 183 -46 1524 1488 1670 -40 178 2882 2942
9804 2942 2431 3026 1167 2945 1678 -549 -139 2047 5835 3111 1082 1055 1228 415 1342 1708 1383
9787 1383 1181 1944 2851 4878 2735 -438 -4068 -5866 -5386 -4381 -1416 1495 2342 2340 550 1061 3746
9770 3746 4951 2815 1608 171 -1154 -1288 -477 -2203 -1171 1386 369 -611 -1483 -1302 1492 2987
9754 2987 2803 1697 2459 1428 2233 -235 -20 992 2917 2907 -509 -988 996 2338 3056 2360 3038
9737 3038 2714 4667 4967 4426 2662 3246 5094 4766 5291 2951 34 508 -1407 -860 -940 97 -2636
9720b636o14N32K685K5j041J673K820L306R18j735j475j389k010j113L8k69J280
9703I95J040L1j596j398l78Q50L35k70K80K326L713j329l4k04K74N16k866m78
9685A807r3J489L02l93L598O03l518k611J87q2m25j057P20J960j637J607K286
9668D743k484K480L38k002q40q74N08K202N83j156N32J317J89N89Q40r5k042L82
9650E210M76l79m02J250R97j081j063m10o96k320k24J874J64j7L4N6P50j074J419
9631D564J499J33n04n20n97r64j00R51N47m55K55M12K83j00K114Q31j560k048
9613D741n80N65j791L68J851N27ll50M67K079J162L39k84J966j315j205r13k58
9595G366Q65J65O88M5M46P6M74l1J092l48L16k581N18J50q92N55J888L827J736
$$ plain form
9720 -2636 -3250 -2718 -33 -8 -1049 624 3444 6750 7668 5933 4458 3069 1059 -54 -16 -285 995
9703 995 2035 2066 470 -928 -1306 -456 -121 -391 -111 2215 5928 4599 4565 4361 4635 5151 2285 1807
9685 1807 1714 3203 3505 3112 6710 7313 3795 1184 1371 1289 864 -193 527 2487 850 2457 4743
9668 4743 2259 4739 5077 3075 2235 1361 1869 4071 4654 3498 4030 5347 5536 6125 6965 6870 4828 5210
9650 5210 5686 5307 4905 6155 7152 6071 5008 4598 3902 1582 1358 3232 3396 3379 3413 3469 4219 3145 4564
9631 4564 6063 6196 5692 5172 4575 3611 3511 4462 5009 4554 4809 5221 5504 5404 7518 8349 6789 4741
9613 4741 4161 4726 2935 3303 5154 5681 5678 5328 5795 7874 9036 9375 9091 11057 9742 8537 7624 7366
9595 7366 8231 8396 9084 9129 9575 9651 10125 10094 11186 10838 11154 8573 9091 9241 8349 8904 10792 14619 16355
9576A6355j087j327j252m58q84j152J86J004K421Q71j33r83p27O23K87n60k47
9559A2937J444J859m27J210J594N68K1J930O90J05j165j762l689J664K490L1J180
9542B0680j9j27j0J250J197o2p0J159J147K312J696J804R81K47K86l53m93j280
9524C0345j277L459N159N625R50J075P67n59L45P91Q67M150K883J09K92R18K503
9507E8402L305J608K270K492K823K391L104L739J598M164N593N480O317L739L978
9492A11003M822M094P695N365M164O240O392J0134P271O351Q196Q991O870O945
9478B04533J0466J0633R892J2091J1793J2194R680O923R526J2351R615O449O731
9465C32877O476N123M222M638o05j48l290m261m780r362r800r567q218j0940j1248
$$ plain form
9576 16355 15268 13941 12689 12231 11347 10195 10381 11385 13806 14677 14544 13561 12834 13457 13744 13184 12937
9559 12937 14381 16240 15813 17023 18617 19185 19206 21136 21826 21931 20766 19004 15315 16979 19469 19500 20680
9542 20680 20661 20534 20524 21774 22971 22909 22839 23998 25145 27457 29153 30957 31938 32185 32471 32118 31625 30345
9524 30345 29068 32527 37686 43311 44261 45336 46103 45544 45889 46680 47547 51697 54580 54689 54981 55899 58402
9507 58402 61707 63315 65585 68077 70900 73291 76395 80134 81732 85896 91489 96969 103286 107025 111003
9492 111003 115825 119919 127614 132979 137143 143383 149775 159909 167180 173531 181727 190718 197588 204533
9478 204533 214999 225632 235524 247615 259408 271602 281282 288205 297731 310082 319697 326146 332877
9465 332877 339353 344476 348698 353336 352731 352583 349293 345032 340252 330890 321090 311523 303305 292365 281117
9450B81117j0080r406r366j1802j3132j3655r780q911p916m493r361r072q906
9437A55237q909p383m782p014o304k699m049o763o028q281l018l212l665l388
9423G9742k439l77l313k592k338m801j571m94l957k246n53l371l214j80j038Q45
9407D8103r48j051k115j257n70j355k245P51l355l081j616K0R18J911m350k666
9391B7094k556K122L807j634k779j056J278n29m668n24K664L94j352k106l275
9376A6880r54r61J105K01j635K252R82j845O54k114N07J712J288j385r52j832
9360A3903o53R23j272j502O83J714j200J20J194j372j341l64m00R62J811J55q67
9343A2494p94J705r41J431Mj025k424j664q40n19K09K535J286J047j126j262q84
$$ plain form
9450 281117 271037 261631 252265 240463 227331 213676 203896 194985 187069 182576 173215 164143 155237
9437 155237 146328 138945 134163 127149 120845 118146 114097 107334 101306 93025 90007 86795 83130 79742
9423 79742 77303 76926 73613 71021 68683 63882 62311 61817 57860 55614 55061 51690 48476 48296 47258 48103
9407 48103 47155 46104 43989 42732 42162 40807 38562 39313 35958 32877 31261 31281 32199 34110 29760 27094
9391 27094 24538 26660 30467 28833 26054 24998 26276 25747 21079 20555 23219 23613 22261 20155 16880
9376 16880 15926 14965 16070 16271 14636 16888 17870 16025 16679 14565 15072 16784 18072 16687 15735 13903
9360 13903 13250 14173 12901 11399 12082 13796 12596 12716 13910 12538 11197 10833 10433 11395 13206 13361 12494
9343 12494 11700 13405 12464 13895 13899 12874 10450 8786 7946 7427 7636 10171 11457 12504 11378 10116 9232
9326I232J405Q00j170j538j249k209J283j808j673N4r11k54L735Q57j073r23j414
9309C144J676j86l595j090K339J484o97k17j034L36k323m10J542K620J243l54
9293D478J112J16R29r19l55o42j594L29k02j669r61k30j60J408L515J341L68k083
9275D781m92J021j839l082l80L094J015j743o24N46J83o45q08J035j221J53O4
9258A058R13J040N17m55k398q33m4K272J249l84j115P51K195q45r29k857J024
9241A159j520J246J289J08J04r98M18o74K012J94k23L40j065r79O57J179j269
9224A978j362p06M40J874J558J46o00j437k80j3o74r88K155j93P68p3k44M05L87
9205C141j795n93q14J764J89N37o84k335j987l007K588J738R70J337Q15K230j345
$$ plain form
9326 9232 10637 11437 10267 8729 7480 5271 6554 4746 3073 3127 2216 1962 5697 6554 5481 4558 3144
9309 3144 4820 4634 1039 -51 2288 3772 3075 2858 1824 2160 -163 -573 969 3589 4832 4478
9293 4478 5590 5706 6635 5716 5361 4719 3125 3454 3252 1583 622 392 232 1640 5155 6496 6864 4781
9275 4781 4289 5310 3471 389 9 3103 4118 2375 1751 2297 2480 1835 1027 2062 841 994 1058
9258 1058 1971 3011 3528 3073 675 -158 -202 2070 3319 2935 1820 2571 4766 3921 2992 135 1159
9241 1159 -361 885 2174 2282 2386 1388 1806 1132 3144 3338 3115 3455 2390 1411 2068 3247 1978
9224 1978 616 -90 350 2224 3782 3928 3328 1891 1611 1598 924 -64 2091 1898 2666 2593 2349 2754 3141
9205 3141 1346 753 -61 1703 1892 2429 1745 -590 -2577 -5584 -2996 -1258 -288 1049 1864 4094 2749
9188B749K712J905r18k091j350r83J449K16N80j719k90p38q72m49J38k25j143
9171a029J281q75k745j188j67K833Q88l068j860K444j262k054Q07M189K580r28
9155a54o09L937J643j122m56k229j518J092K218P41j696k77J185j912P95j306
9139C32m479n83K180Q49p58K017J543l30K96k095p47m64J389M46p94J629R66l393
9121a996k93j167j472j438J445o16K23L181J033K391o17k68J213m51l35m79n8
9104B96M83R47P61J226L24J455R24l427j066L01k167r9J449r37l180L03r64l79
9086c750R91J266N8j260J644P6O29p08L32m78M29K371k05k603j14Q14N21P3J017
9067A103j8r40k88j639J722N44j866J701m37J04J491j51j766j112L74K331J877
$$ plain form
9188 2749 5461 7366 6448 4357 3007 2024 3473 3689 4269 2550 2260 1522 650 201 339 114 -1029
9171 -1029 252 -623 -3368 -4556 -4723 -1890 -1002 -4070 -5930 -3486 -4748 -6802 -5995 -1806 774 -154
9155 -154 -763 3174 4817 3695 3239 1010 -508 584 2802 3543 1847 1570 2755 843 1638 332
9139 332 -4147 -4730 -2550 -1701 -2459 -442 1101 771 1067 -1028 -1775 -2239 -850 -404 -1198 431 1397 -1996
9121 -1996 -2289 -3456 -4928 -6366 -4921 -5537 -5314 -2133 -1100 1291 674 406 1619 1168 833 354 296
9104 296 779 1726 2487 3713 4037 5492 6416 2989 1923 2224 57 -42 1407 470 -2710 -2407 -3371 -3750
9086 -3750 -2759 -1493 -1435 -2695 -1051 -975 -346 -1054 -722 -1200 -771 1600 1395 -1208 -1322 -508 13 86 1103
9067 1103 1085 145 -143 -1782 -60 484 -1382 319 -118 -14 1477 1326 -440 -1552 -1178 1153 3030
9050C030J427J433l73j085q82j332J317L834J268l555j554J197j391j848k220
9035g34R81k90Q06K456k93r65j858l04R48J86K622k98q98l147l289r65J100K077
9017a865J823J661J652l103n051J98L809K878n7O58J91J051P08J647P82m401j873
9000G08j993k509K120M524K300j471k258K34J126L27k216o94q51k528L58K964
8984A41P50n77n83j014j205M5J383K961m72l833q89l05j572K463K881l13j425
8967a564N94J139m97k392j691K709L546J056k078p00o32j078J625K149K530j413
8951C303k593R0j524P02N53J075M33r99p36r24r56r56N72j705j413J547J42J129
8933b260j196J866L256L40K16j478k384o86J459K30r19K40J593N20K451P37r65
$$ plain form
9050 3030 4457 5890 5517 4432 3550 2218 3535 7369 8637 5082 3528 4725 3334 1486 -734
9035 -734 247 -43 763 3219 2926 1961 103 -201 747 933 3555 3257 2359 -788 -4077 -5042 -3942 -1865
9017 -1865 -42 1619 3271 168 -4883 -4685 -876 2002 1945 2603 2794 3845 4553 6200 6982 2581 708
9000 708 -1285 -3794 -1674 2850 5150 3679 1421 1655 2781 3108 892 198 -653 -3181 -2823 141
8984 141 891 314 -269 -1283 -2488 -2443 -1060 1901 1429 -2404 -3293 -3598 -5170 -2707 174 -139 -1564
8967 -1564 -970 169 -328 -2720 -4411 -1702 1844 2900 822 122 -510 -1588 37 2186 4716 3303
8951 3303 710 800 -724 -22 531 1606 2039 1040 304 -620 -1576 -2532 -1960 -3665 -5078 -3531 -3389 -2260
8933 -2260 -3456 -1590 1666 2006 2222 744 -1640 -2326 -867 -637 -1556 -1316 277 797 3248 3985 3020
8916C020k338L26l30k714P84K38j579j685K314L23o63K265L93R79N39j259l78
8899B35q96K608o8k869j808l27K197K5j419q00M06J248J586J242k75j616n05l95
8881a431k65k0J316M56K370j270k240p73j782m08L160M136M42j005l119j126J329
8864b30j92P2J57J095k55K398Q06j703k319J220J778P05K36j893j676j619l75
8847a795j54J108J684L33M66j328m84Q13n34r63m61J283P65j613L05J458R00p80
8829A003k73O19K72p57J413k31k708j881p12Q32N27J285K90J251J79M76J06j930
8811b39k07o51Q66m16J286J164j153j721k458j205J30P57N50m97nj400L78K245
8793b576L80k17k204P83M92J281q47l29J73P97M30P91r5R8l11j81m65j229K193
$$ plain form
8916 3020 682 1008 678 -2036 -1252 -1014 -2593 -4278 -1964 -1641 -2304 -39 354 1333 1872 613 235
8899 235 -661 1947 1879 -990 -2798 -3125 -928 -903 -2322 -3122 -2716 -1468 118 1360 1085 -531 -1036 -1431
8881 -1431 -1696 -1716 -400 56 2426 1156 -1084 -1857 -3639 -4047 -887 3249 3691 2686 -433 -1559 -230
8864 -230 -422 -350 -193 902 647 3045 3851 2148 -171 1049 2827 3532 3768 1875 199 -1420 -1795
8847 -1795 -1949 -841 843 1176 1642 314 -170 643 109 -854 -1315 -32 733 -880 -575 883 1783 1003
8829 1003 730 1349 1621 864 2277 2046 -662 -2543 -3255 -2423 -1896 -611 -321 930 1109 1585 1691 -239
8811 -239 -446 -1097 -231 -647 639 1803 650 -1071 -3529 -4734 -4604 -3847 -3297 -3794 -3799 -5199 -4821 -2576
8793 -2576 -2196 -2413 -4617 -3834 -3342 -2061 -2908 -3237 -3064 -2267 -1837 -1046 -1141 -1043 -1354 -1535 -2000 -3229 -1036
8774a036N95q44L26q8j32j266j565Q87J435K68P60o90J53L644J399j496p38j01
8756A511J165r39j084j6O31j229M1k217j808k93J924o64K094N09j447j546K090
8739a278K856p61p8n30j29j35Q73J947O33j863j895k303k27K338K272Q58K58j446
8721A390j695k984J89K590P52L27l61j888J24m41l21r45k10o56L26P41J548L246
8703A732K388m070k213K69J789J70j679q89j86j400R80K482J292P92Q84K483J325
8686F149k047k781p82J074N44j617k113j94O82K66l482j384L266J223K531q23
8670E12p12K882L85m54j965j336K904P51k561n43J07k318j56j837J272L595K97
8653H23k26P34k502l40j444M01J688L75j408j614K585J244j648K489R48m997j129
$$ plain form
8774 -1036 -441 -1285 -959 -1047 -1179 -2445 -4010 -3123 -1688 -1420 -660 -1350 -1197 2447 3846 2350 1612 1511
8756 1511 2676 1737 653 637 1268 39 80 -2137 -3945 -4238 -2314 -2978 -884 -375 -1822 -3368 -1278
8739 -1278 1578 817 739 209 80 -55 818 2765 3398 1535 -360 -2663 -2890 -552 1720 2578 2836 1390
8721 1390 -305 -3289 -3100 -510 242 569 208 -1680 -1556 -1997 -2318 -3263 -3473 -4129 -3803 -3062 -1514 1732
8703 1732 4120 50 -2163 -1894 -105 65 -1614 -2503 -2689 -4089 -3109 -627 665 1457 2341 4824 6149
8686 6149 4102 1321 539 1613 2157 540 -1573 -1767 -1085 -819 -4301 -5685 -2419 -1196 1335 512
8670 512 -200 2682 3067 2613 648 -688 2216 2967 406 -137 -30 -2348 -2504 -4341 -3069 526 823
8653 823 597 1331 -1171 -1511 -2955 -2554 -866 -491 -1899 -3513 -928 316 -1332 1157 2105 -2892 -4021
8636d021J058J597j113j869J732K092M55lj348j121j305N10R24K371R7k417Q74
8619a487J042Q98M17o88j86L28J369J442J208p79j532L19l0P5L21j92M62o53J499
8600C833K5N91p70l862l013K303K031K624j764J713J779p33L34q16k545r9k028
8583c97j123J899O38J253o66o00l56L39k215j859L379J826K47j297M16j127j344
8566i87n22M918J159n36M81k82l043J857L020j390Q15J451J115K26r83J47o51
8549F795J865J899O75j5j016N45K618K308K201K315o88j822n45R69L21k718k277
8532A3430l026j343j124j422j109J594Q30j005o04J618j429k868P55K867o12m683
8516A869k335J524J139J178N18J308J605k568p45j015j654Q8J323M95J060j68
$$ plain form
8636 -4021 -2963 -1366 -2479 -4348 -2616 -524 -69 -72 -1420 -2541 -3846 -3336 -2412 -41 56 -2361 -1487
8619 -1487 -445 453 870 182 -4 324 1693 3135 4343 3564 2032 2351 2321 2396 2717 2525 2987 2334 3833
8600 3833 3858 4449 3679 -183 -3196 -893 1138 3762 1998 3711 5490 4757 5091 4275 1730 1631 -397
8583 -397 -1520 379 1017 2270 1604 1004 648 987 -1228 -3087 292 2118 2365 1068 1484 357 -987
8566 -987 -1509 3409 4568 4032 4513 4231 1188 3045 6065 4675 5490 6941 8056 8282 7299 7446 6795
8549 6795 8660 10559 11234 11219 10203 10748 13366 15674 17875 20190 19502 17680 17135 18104 18425 15707 13430
8532 13430 10404 9061 7937 6515 5406 7000 7830 6825 6221 7839 6410 3542 4297 7164 6552 1869
8516 1869 -466 1058 2197 3375 3893 5201 6806 4238 3493 2478 824 912 2235 2730 3790 3622
8500C622p94J293J616j724k833j866K59O43J465J267N87m3q62q13o14Ql30J031
8482A912j790O01q56J359K264L94L11j381j433k68k374K60L234K32j225J513k140
8465F13q89J921J172r29j764q07o70r56m534J141N192P86j319q51O31J690k749
8448b322j603J360L966P85P70M12L25j765k879K225N29j857k711K714J939q12
8432A076j010n41m83j655p62N70M01J296k86p0L92J894Q61k204r50R05j219J86
8414a599Q27j248q42k61j431L69J307R79N81M11j64R67J310K893l77j513k080
8397A29q77j263q63k66J969J364J378J171j746k960K327M000J474j395p39l011
8381F92k589n18q33j276J910M85j65K216L151j215j437k68j635m55K850L595j292
$$ plain form
8500 3622 2828 4121 5737 4013 1180 -686 -427 216 1681 2948 3535 3492 2630 1817 1203 1211 881 1912
8482 1912 122 723 -133 1226 3490 3884 4195 2814 1381 1113 -1261 -1001 2233 2465 1240 2753 613
8465 613 -276 1645 2817 1888 124 -683 -1353 -2309 -6843 -5702 -510 276 -1043 -1894 -1263 427 -2322
8448 -2322 -3925 -2565 1401 2186 2956 3368 3693 1928 -951 1274 1803 -54 -2765 -51 1888 1076
8432 1076 66 -475 -958 -2613 -3375 -2805 -2404 -1108 -1394 -1464 -1072 822 1683 -521 -1471 -566 -1785 -1599
8414 -1599 -772 -2020 -2862 -3123 -4554 -4185 -2878 -1899 -1318 -907 -1071 -104 1206 4099 3722 2209 129
8397 129 -748 -2011 -2874 -3140 -1171 193 1571 2742 996 -1964 363 4363 5837 4442 3703 692
8381 692 -1897 -2415 -3248 -4524 -2614 -2129 -2294 -78 3073 1858 421 153 -1482 -1937 913 4508 3216
8364C216k494P88K191J632K177K53l129j931J207j039J063j466j752N16k51n27
8348D54l101j186O96P71J431j098m65R98J903j139L0J007J72K157m36j145N65
8331A614k85K72r47l26k152J27J770l98r23K132J333k104l61J942r78J650J424
8314C790j674L92j097J79J043q64J105j65J01n65k984k465J95K563J329N45K451
8297C879L05j847M31k139j60r28j748q71j469M78K782J774M10k80k077m402r18
8280f780M094R61k051L29K102k76j576J807k69j3r38k054j467J758J753J708n66
8263a478j896J247k51r18J894R23j508J405K072l09r74o93k380J029M0l187n06
8246e490L606K557j719l61L25j674J09K09o41N96L310K34j048j310K13J706k68
$$ plain form
8364 3216 722 1510 3701 5333 7510 7763 4634 2703 3910 2871 3934 2468 716 1232 981 454
8348 454 -2647 -3833 -3137 -2366 -935 -2033 -2498 -1500 403 -736 -706 301 473 2630 2194 1049 1614
8331 1614 1329 1601 654 328 -1824 -1697 73 -325 -1248 884 2217 113 -248 1694 716 2366 3790
8314 3790 2116 2508 1411 1590 2633 1769 2874 2709 2810 2245 -739 -3204 -3009 -446 883 1428 3879
8297 3879 4184 2337 2768 629 469 -459 -2207 -3078 -4547 -4069 -1287 487 897 617 -1460 -5862 -6780
8280 -6780 -2686 -1725 -3776 -3447 -1345 -1621 -3197 -1390 -1659 -1672 -2610 -4664 -6131 -4373 -2620 -912 -1478
8263 -1478 -3374 -2127 -2378 -3296 -1402 -479 -1987 -582 1490 1181 207 -486 -2866 -1837 -1797 -4984 -5490
8246 -5490 -1884 673 -1046 -1407 -1082 -2756 -2647 -2438 -3079 -2483 827 1061 13 -1297 -1084 622 354
8229C54K01P59l57P93j861j484l18j598n08J199L392J617M10j515j155j482J408
8212a45K681J144N68j005k402r41j117K473J716j337k116j008k519N81J578P55
8196a094k600j2N50J005P54J229p23J928N80O48j259J118J78J132K77N11j54r85
8178C083k920K66K20J916R92n315L75o80R94J881L240k101r6m46o50o43J061Q66
8160B043j279j259j219m47O51o88J278J791Q00L74j129k24j593j322J416M79K471
8143B143K203O5j644m7R68q19L50l68k335J015j339p43J652n29k067L04q10r00
8125b901L073L35P61N49r81q81l24k09r56J880J831l30m193K68J506j060j894
8108c526Q52j562j149K331L628L352j448l296r83l229j003M44L493Q72j75J649
$$ plain form
8229 354 555 1314 957 1750 -111 -1595 -1913 -3511 -4019 -2820 572 2189 2599 1084 -71 -1553 -145
8212 -145 2536 3680 4248 3243 841 -100 -1217 1256 2972 1635 -481 -1489 -4008 -3427 -1849 -1094
8196 -1094 -3694 -3706 -3156 -2151 -1397 -168 -891 1037 1617 2265 1006 2124 2302 3434 3711 4222 4068 3083
8178 3083 163 429 649 2565 3557 -1758 -1383 -2063 -1069 812 4052 1951 1855 1409 759 116 1177 2043
8160 2043 764 -495 -1714 -2161 -1510 -2198 -920 871 1671 2045 916 692 -901 -2223 -807 -328 2143
8143 2143 4346 4411 2767 2720 3688 2869 3219 2851 516 1531 192 -551 1101 572 -1495 -1191 -2001 -2901
8125 -2901 172 507 1268 1817 836 -45 -369 -578 -1534 346 2177 1847 -2346 -2078 -572 -1632 -3526
8108 -3526 -2674 -4236 -5385 -3054 574 3926 2478 -818 -1801 -5030 -6033 -5589 -2096 -1224 -1399 250
8092B50L91n07k145l735P47R21P02k127J123j371j327L054L231N45m36j159O4
8075a779K235K990k491J010k677j861R60K017J84J879M31j044k083j655P38J363
8059B17J265j17j806j004r80J180K882J1k962l154R37J402K41J720K004p1l151
8042a386k01j271k94n31qJ401k22j16M41N36j51J851M16k377L35M29J21m34J53
8023a308k79K802R43j556j849k229j437L074j47P59J795j492l435k122M09J936
8007d136R86m67l24J532L28P84K168m55m012m52P26J370K044J954j38Q89k408
7990C89j901J18j809o25pL853J346j233r1r63J04Q01K351K536j506r80P66j343
7972A806o65L47J933O0P28l91L98L15l730j209J235O36m06N52J159r05m48j271
$$ plain form
8092 250 641 134 -2011 -5746 -4999 -4078 -3376 -5503 -4380 -5751 -7078 -4024 -793 -248 -684 -1843 -1779
8075 -1779 456 3446 955 1965 -712 -2573 -1613 404 588 2467 2898 1854 -229 -1884 -1146 217
8059 217 1482 1365 -441 -1445 -2425 -1245 1637 1648 -1314 -4468 -3531 -2129 -1888 -168 1836 1765 -1386
8042 -1386 -1587 -2858 -3152 -3683 -3691 -2290 -2512 -2628 -2187 -1651 -1802 49 465 -1912 -1577 -1148 -1027 -1461 -1308
8023 -1308 -1587 1215 2158 602 -1247 -3476 -4913 -1839 -1986 -1227 568 -924 -4359 -6481 -6072 -4136
8007 -4136 -3150 -3617 -3941 -2409 -2081 -1297 871 416 -3596 -4048 -3322 -1952 92 2046 1908 2797 389
7990 389 -1512 -1394 -3203 -3828 -3835 18 1364 131 40 -923 -819 -18 2333 4869 3363 2383 3149 1806
7972 1806 1141 1488 3421 3481 4209 3818 4216 4531 801 -408 827 1463 1057 1609 2768 1863 1415 144
7954A44q89J469K835P77r13l3j365k232K338k442J027J694l5J708k042J258J47
7937C446l226j789N617L555j461m503j980j474K57K189J566k56k009N60J563q38
7921A217J349J891K67q65k071J240K080J362l84l309j515j733M23L447M579k365
7905E613j483o38p81k78K04N35r26k190J303L893L67j886m496m99Q37K36l95P64
7887A80j78j735j485J143K473K136J688n07J779J581J993j348j783k400r75K044
7871D606m89k381j282J78J076J638l00k982j262J478O99Q83L735j1k181k888j082
7854e65n83p66J006J414K58p27J81J306j663J17j32n00N49J34k415j965K423K209
7836B81J764m76N1j455l988M92N01O69o08p67L163J368n01K14q2L23K191j387
$$ plain form
7954 144 -745 724 3559 4336 3423 3390 2025 -207 2131 -311 716 2410 2375 4083 2041 3299 3446
7937 3446 220 -1569 4048 7603 6142 1639 -341 -1815 -1558 631 2197 1941 -68 492 2055 1217
7921 1217 2566 4457 4724 3859 1788 3028 5108 6470 6086 2777 1262 -471 -48 3399 7978 5613
7905 5613 4130 3492 2711 2433 2637 3172 2246 56 1359 5252 5619 3733 -763 -1262 -425 -189 -584 180
7887 180 2 -1733 -3218 -2075 398 2534 4222 3715 5494 7075 9068 7720 5937 3537 2562 4606
7871 4606 4117 1736 454 632 1708 3346 3046 64 -1198 280 979 1862 5597 5586 3405 517 -565
7854 -565 -1148 -1914 -908 506 764 37 218 1524 -139 -22 -154 -654 -105 29 -2386 -4351 -1928 281
7836 281 2045 1569 1620 165 -3823 -3331 -2830 -2161 -2769 -3536 -373 995 494 708 626 949 3140 1753
7818A753k672m22L027J857J351J371m86j83J130j435l746k656J250L755J535J414
7802F843l053k841j692J39K541l09j22K205O70j958k391l62O29J090p22j233j992
7785b558K37K261K708J480k137j505j031L28K135l53j192j372J387N31q31J787
7769A875K71L91J045L58j575k524n86K87K101k801k019l24N22k139m64j6J48J996
7751c454J092k26n96j337j475j705J485L426R76J434L073J49j269k818k416k44
7735c905J631K388P46L37k03k226l06j285l489J317J683J130j050j80K108J329
7719B5k122k222j756J030L369K648j435k06p50Q20j434j43J855r4k436R23J312
7702f16J743K381j524j463m38Q16J701o46k7k914M16M71k78J228Q94k201o83K249
$$ plain form
7818 1753 -919 -1341 1686 3543 4894 6265 5779 5596 6726 5291 1545 -1111 139 3894 5429 6843
7802 6843 3790 949 -743 -604 1937 1628 1506 3711 4381 2423 32 -330 299 1389 667 -566 -2558
7785 -2558 -2321 -60 2648 4128 1991 486 -545 -217 1918 1565 373 -999 388 919 88 1875
7769 1875 2146 2537 3582 3940 2365 -159 -745 -458 1643 -1158 -3177 -3501 -2979 -5118 -5582 -5598 -5450 -3454
7751 -3454 -2362 -2588 -3184 -4521 -5996 -7701 -6216 -2790 -1814 -380 2693 2842 1573 -1245 -3661 -3905
7735 -3905 -2274 114 860 1197 994 -1232 -1538 -2823 -6312 -4995 -3312 -2182 -3232 -3412 -1304 25
7719 25 -2097 -4319 -6075 -5045 -1676 972 -463 -669 -1419 -599 -2033 -2176 -321 -415 -2851 -1928 -616
7702 -616 1127 3508 1984 521 83 899 2600 1954 1927 -987 -571 -100 -378 850 1744 -457 -1140 1109
7684A109j132n81J37m087k142J360K862l5k001K024J726L77Q08j729j587L232
7668C41J903j625j518M926J210j127N0l758j233l50q28Q18R88k108k293k851L21
7651g134N28K12N42r85J350M59J28J350m01R58j52M90L250M49j575P81r08J007
7633C49J218j938j844j303k144j141k85M51J049J327K434n56l660J643k36j482
7617f118J072J475o77j57J241J893q61m42J143J949j267j720q99j685J389K779
7601h85J412J208k491j259j493O80J052J770Q40Q97r59k540l95j077J038J322
7585h80Q56P7o46o64j059k553l349P58K168k326O71K702O57l41K539k44j06L008
7567A268O04j552j827n29k417k89K326L91n48J368M73J636q1l90m68L259k245
$$ plain form
7684 1109 -23 -604 -467 -4554 -6696 -5336 -2474 -2509 -4510 -2486 -760 -383 425 -1304 -2891 341
7668 341 2244 619 -899 4027 5237 4110 4160 402 -831 -1181 -2009 -1191 -203 -2311 -4604 -7455 -7134
7651 -7134 -6606 -6394 -5852 -6837 -5487 -5028 -4900 -3550 -3951 -2993 -3145 -2655 595 1044 -531 250 -658 349
7633 349 1567 -371 -2215 -3518 -5662 -6803 -7088 -6637 -5588 -4261 -1827 -2383 -6043 -4400 -4636 -6118
7617 -6118 -5046 -3571 -4248 -4405 -3164 -1271 -2132 -2574 -1431 518 -749 -2469 -3368 -5053 -3664 -885
7601 -885 527 1735 -756 -2015 -3508 -2828 -1776 -6 834 1731 772 -1768 -2163 -3240 -2202 -880
7585 -880 -24 53 -593 -1257 -2316 -4869 -8218 -7460 -5292 -7618 -6947 -4245 -3588 -3929 -1390 -1634 -1740 1268
7567 1268 1872 320 -1507 -2036 -4453 -4742 -2416 -2025 -2573 -1205 -732 904 823 433 -35 3224 979
7550I79m253j11K213Q50O07n83j276r13MJ42l39L634J126j071R9L39k833l22J225
7531d83l37k132J845J745P10L9j351j102L63K91j106N66Q60j709r08J092m9O02
7513a064J040J021r47m41l55l66R90l37J924L274j79k002k313K73j093K88J960
7496A673j203q63k279P00J058N05L020O54j657m139n97J895J921m65l223K57J608
7479a135R56o32M83j29M15J993k001j949k574J328m36q72k381K401M031K605J29
7462B232r94m316K351J973j603J45N40o88k228o04J580J748o57o77Q66r44j958
7445c234L32P83k464J0r35K71J417l51P94J173O30j191j587K686K822q73n87M1
7427b63o94K269l031N11K719j051j227J683O67l481j670j039J155o7J618j156
$$ plain form
7550 979 -3274 -3385 -1172 -322 285 -298 -1574 -2487 -2483 -2341 -2680 954 2080 1009 1108 1447 -1386 -1708 -483
7531 -483 -820 -2952 -1107 638 1348 1387 36 -1066 -703 -412 -1518 -952 -92 -1801 -2709 -1617 -1666 -1064
7513 -1064 -24 997 50 -391 -746 -1112 -122 -459 1465 4739 4560 2558 245 518 -575 -287 1673
7496 1673 470 -393 -2672 -1972 -914 -409 2611 3265 1608 -2531 -3128 -1233 688 223 -3000 -2743 -1135
7479 -1135 -179 -811 -328 -457 -42 1951 -50 -1999 -4573 -3245 -3681 -4553 -6934 -4533 -502 2103 2232
7462 2232 1238 -3078 -727 1246 -357 -212 328 -360 -2588 -3192 -1612 136 -521 -1198 -332 -1276 -3234
7445 -3234 -2902 -2119 -4583 -4573 -5508 -5237 -3820 -4171 -3377 -2204 -1574 -2765 -4352 -1666 1156 283 -304 -263
7427 -263 -957 1312 -1719 -1208 1511 460 -767 916 1583 -1898 -3568 -4607 -3452 -3519 -1901 -3057
7411c057j044K201J748l13J450J594o39j484j022l488j585J325J430j288Q54N14
7395b804K03K120J424K762p80l324p85K045J903R76m81k457q16J588K240j083
7379B731p64j360n15l67J134j021k111k235j29J239N98K957J776J297o98j14o03
7362A815j443R64j167j359j150j371J215K027O61k784k312j20K786J081K484P66
7346B093M9J17P51l858q50L11K960K139J264j461n042l305k259J322K171k620
7330f218l571M93N041L357j07Q19K722M6n68o44r22r75r59J105k065l96J795r78
7312b025r96l327j228J831K174O87L548m65l034j018Q43P28K436j23Q13K14j178
7295a20j564m01j096J055j074l6L95L32K410p26o95l14M69l329K58J41N25R66
$$ plain form
7411 -3057 -4101 -1900 -152 -465 985 2579 1940 456 -566 -4054 -5639 -4314 -2884 -4172 -3318 -2804
7395 -2804 -2601 -481 943 3705 2925 -399 -1184 861 2764 3740 3259 802 -14 1574 3814 2731
7379 2731 1967 607 92 -275 859 -162 -2273 -4508 -4637 -3398 -2800 157 1933 3230 2532 2418 1815
7362 1815 372 1336 169 -1190 -2340 -3711 -2496 -469 192 -2592 -4904 -5024 -2238 -1157 1327 2093
7346 2093 2142 2259 3010 -848 -1698 -1387 1573 3712 4976 3515 -1527 -4832 -7091 -5769 -3598 -6218
7330 -6218 -9789 -9296 -4255 -898 -1005 -186 2536 2582 2014 1370 448 -527 -1486 -381 -2446 -2842 -1047 -2025
7312 -2025 -3021 -6348 -7576 -5745 -3571 -2884 664 199 -2835 -3853 -3010 -2282 154 31 844 1058 -120
7295 -120 -1684 -2085 -3181 -2126 -3200 -3236 -2841 -2509 -99 -825 -1520 -1834 -1365 -4694 -4436 -4295 -3770 -2804
7277b804r68k28o59J072J581J711J368J738j428r39j93q17l99k343n80R33k54
7260c209n88J983J170J932K311k647j449p96N56J867p06l240L872J967j809k466
7244a252j251O41K867J066K88k075k126k938K153M5J456j37l28l20R19M23J638
7227A069K297L394J488k020l321j216k069k049J423K67m75K89k633N37j324j835
7211f178k55P24K572M298M760J713J027k835o090l130K2R37l76m90K447L50K93
7194b11R46m72k860l198l38K11K195L455J302L91r87j607R10K497q65L02m49R24
7176B146N27P51J064m881k530l58J578j75j57K609l84k986j901K335J898o13j086
7159b163Q89O33R16K92R1j414K76K05k408j28r94Q18p54o34K4l57L029L66R43
$$ plain form
7277 -2804 -3772 -4000 -4659 -3587 -2006 -295 1073 2811 1383 444 251 -566 -965 -3308 -3888 -2955 -3209
7260 -3209 -3797 -1814 -644 1288 3599 952 -497 -1293 -737 1130 424 -2816 1056 3023 1214 -1252
7244 -1252 -2503 -1862 1005 2071 2359 284 -1842 -4780 -2627 -2582 -1126 -1263 -1591 -1911 -992 -569 1069
7227 1069 3366 6760 8248 6228 2907 1691 -378 -2427 -1004 -737 -1212 -923 -3556 -3019 -4343 -6178
7211 -6178 -6433 -5709 -3137 1161 5921 7634 8661 5826 -264 -3394 -3372 -2435 -2811 -3301 -854 -504 -211
7194 -211 735 263 -2597 -5795 -6133 -5922 -3727 -272 1030 1421 434 -1173 -263 2234 1369 1671 1222 2146
7176 2146 2673 3424 4488 -393 -2923 -3281 -1703 -1878 -2035 574 190 -2796 -4697 -2362 -464 -1077 -2163
7159 -2163 -1274 -641 275 567 658 -756 -480 -275 -2683 -2811 -3805 -2987 -3741 -4375 -4351 -4708 -1679 -1313 -370
7140c70O11o68n24R45K322j720j759k68r56P4K781J928J066j190j162j198K92
7123B04M21j670q79j797j262J00k20K852M232l017o59j528k829M220J438j175
7107a569K564J196J222m579j217J815K96o26L95L100J593j981j185Q87k712r38
7091a739q8J418L243k18j644o61J692Q62m77l674N01k96m23L77j846l999j754
7074h726J927p68j498J385K348J861J595J960j11j104l33k027p69j569K592L241
7058Dk149J435q99k768J163j054O47L090J030r11J326P95l34O2K553J408k010
7041C388j020j569p41J509M066j794l206l043r69M44J274r03N71J051j45O41J556
7024A110J41j275k22R57j363k96J99J343J846k47k654J440J107r79l973J322J474
$$ plain form
7140 -370 241 -427 -951 -6 2316 596 -1163 -1431 -2387 -2313 468 2396 3462 2272 1110 -88 204
7123 204 625 -1045 -1924 -3721 -4983 -4883 -5103 -2251 1981 -1036 -1695 -3223 -6052 -1832 -394 -1569
7107 -1569 995 2191 3413 -1166 -2383 -568 -272 -898 -503 2597 4190 2209 1024 1911 -801 -1739
7091 -1739 -1827 -409 2834 2616 972 311 2003 2865 2388 -1286 -785 -1081 -1504 -1127 -2973 -6972 -8726
7074 -8726 -6799 -7567 -9065 -7680 -5332 -3471 -1876 84 -27 -1131 -1464 -3491 -4260 -5829 -3237 4
7058 4 -2145 -710 -1609 -4377 -3214 -4268 -3621 -531 499 -412 914 1709 1375 1437 3990 5398 3388
7041 3388 2368 799 58 1567 5633 3839 633 -2410 -3379 -2935 -1661 -2564 -1993 -942 -1087 -446 1110
7024 1110 1251 -24 -246 711 -652 -948 -749 594 2440 2193 -461 979 2086 1107 -2866 -1544 -70
7007g0Q32j57p77K5J166j846m61k49Q4j826J272J843L04R31J750j72k104k241
6989a696j184R33r1J327j394k435j257p46L356m4q8l2j168J530K244l90O84j143
6971a594r10K501P82l439m115j525m89J260J354M59J032K767J155M72K795k918
6955d13k58r08k316l65J411O88k70N73M1L055P9j117j515k04Q16M23k5j750J845
6936b10J579l24p44m42J115l16p20K38M77n22j039l05k171j397M75P725Q914O60
6918A2993k256m611o028l628j23J594J485P38q24k988l633J988M436R17r52k27
6902a119m25R22Q79n49r14O49N43R53P98o37j195K09q13J64P40j310N91J308j317
6883e23l52K082M00k033k688p44L321K652k189k596M61J432K1j559R21j801J860
$$ plain form
7007 -70 762 605 -172 -147 1019 -827 -1288 -1537 -1453 -3279 -2007 -164 140 1071 2821 2649 545 -1696
6989 -1696 -2880 -1947 -2038 -711 -2105 -4540 -5797 -6543 -3187 -3231 -3319 -3351 -4519 -2989 -745 -1135 -451 -1594
6971 -1594 -2504 -3 779 -2660 -6775 -8300 -8789 -7529 -6175 -5716 -4684 -1917 -762 -290 2505 -413
6955 -413 -671 -1579 -3895 -4260 -2849 -2161 -2431 -1858 -1817 1238 1317 200 -1315 -1519 -703 -280 -305 -2055 -210
6936 -210 1369 1045 301 -141 974 658 -62 176 653 131 -908 -1213 -3384 -4781 -4306 3419 12333 12993
6918 12993 10737 6126 98 -3530 -3653 -2059 -574 164 -660 -3648 -7281 -5293 -857 60 -892 -1119
6902 -1119 -1544 -622 257 -292 -1206 -557 -14 939 1737 1100 -95 114 -699 -535 205 -1105 -514 794 -523
6883 -523 -875 1207 1607 -426 -3114 -3858 -537 2115 -74 -2670 -2209 -777 -756 -2315 -1394 -3195 -1335
6866a335M046J536M304Q91n191l097n89Q67k774j806K57j0j332K159J185O3j371
6849b197J533K123q04j671k415J196Q90P23J381N67R60j045j689q29j821p67J268
6832b597K283l3j887l052N20P58J601J082J668K097J12j251j759j430q07p57o47
6815d099j571P66J411L550R32l02j867kM23p2J525m77Q21j152l20L04Q62m67N97
6796H62J966K757r77l719p39n85r87j885L83Q6J228J482J771l494p51R57Q82k78
6778a041k942n60K848L820m84k003J99l42P64J540j77J314J323m502k270l47j105
6761c965O00J916j82J933m11j289j331R53k64J49K218J804Q04l83k083J059M14
6744A942k360M09K109L50j289L90Q13R79N47J639K57k003j111m51Q7k109j440
$$ plain form
6866 -1335 2711 4247 8551 9442 4251 1154 565 1432 -1342 -3148 -2891 -2901 -4233 -2074 -889 -826 -2197
6849 -2197 -664 1459 655 -1016 -3431 -2235 -1345 -622 759 1326 2286 1241 -448 -1277 -3098 -3865 -2597
6832 -2597 -314 -347 -2234 -5286 -4766 -4008 -2407 -1325 343 2440 2552 1301 -458 -1888 -2695 -3452 -4099
6815 -4099 -5670 -4904 -3493 57 989 687 -1180 -1182 -759 -831 694 217 1038 -114 -434 -130 732 265 862
6796 862 2828 5585 4608 889 150 -435 -1422 -3307 -2924 -2838 -1610 -128 1643 -1851 -2602 -1645 -763 -1041
6778 -1041 -3983 -4543 -1695 2125 1641 -362 -163 -505 259 1799 1622 2936 4259 -243 -2513 -2860 -3965
6761 -3965 -3365 -1449 -1631 302 -109 -1398 -2729 -1776 -2040 -1891 327 2131 2935 2552 469 1528 1942
6744 1942 -418 -9 2100 2450 1161 1551 2364 3343 3890 5529 5786 3783 2672 2221 2308 199 -1241
6727a241k386L41k01j752n73J251L203R90n81M59J119j232o36j339J628M74k413
6710b889j146P69N25P99L016n33j624k37J217K04J2m42L19j714o90K421j788R83
6692g98J605j521K049r64j021k53n90j405j211K256J194K401R15j72j293k446
6676a254q97J67K880J605j540r62n75n36l361k097M71K639J262j052Q26j875K216
6659b083Q15k166k172Q9R47J118J191L890n25l156k389j577J467N95j67p46j223
6642f092K952J691j77J141J663J327K34n83p66Q11q17r94J301l68K18R44j867
6625F18p05J159j735r06n7j414l326o52N41J249K297M213Q54k335k297k466J98
6608d764K212O49J21m58j247n85J655K717K433l136l050R32R35J882l03j900l536
$$ plain form
6727 -1241 -3627 -3286 -3487 -5239 -5812 -4561 -1358 -368 -949 -490 629 -603 -1239 -2578 -950 -476 -2889
6710 -2889 -4035 -3266 -2741 -1942 1074 541 -1083 -1320 -103 101 113 -329 -10 -1724 -2414 7 -1781 -798
6692 -798 807 -714 1335 371 -650 -903 -1493 -2898 -4109 -1853 -659 1742 2657 2485 1192 -1254
6676 -1254 -2151 -1984 896 2501 961 -1 -576 -1112 -4473 -6570 -6099 -3460 -2198 -3250 -2424 -4299 -2083
6659 -2083 -1268 -3434 -5606 -5517 -4570 -3452 -2261 1629 1104 -2052 -4441 -6018 -4551 -3956 -4123 -4869 -6092
6642 -6092 -3140 -1449 -1626 -485 1178 2505 2739 2156 1390 2201 1384 390 1691 1323 1541 2485 618
6625 618 -87 1072 -663 -1569 -1626 -3040 -6366 -7018 -6477 -5228 -2931 1282 2136 -199 -2496 -4962 -4764
6608 -4764 -2552 -1903 -1782 -2240 -3487 -4072 -2417 300 2733 -403 -3453 -2521 -1586 296 -7 -1907 -5443
6591e443k263J259K536L153K084p67k327l02j859K133R06Q0r90j574N61J530K581
6574A298n79j54m86j383K092P23M08K179q0j449p29P39j662r69K18j566k225q89
6556d514J599K698N26j074j832P65R15J669j735P0L081k434j707R23p95r26l1
6539b802o01L704L47R14Mn15L03J911m11j151J516J475m90K0j574J59J480j356
6521B933n2j587q70j000j935j93J132K03j148R21J522k455k79p81J352K237k9
6504b9J256R38j429J454J455n50k605j574j050l423Q21K100M94k2M36j12M11p29
6486b158L52L026p88p28J195n42K76o46j8k485j95K209J268j723k016j425j191
6469e589J89K593O05L49n15J248J318j741r96K75n58K515j930m096J457r60J524
$$ plain form
6591 -5443 -7706 -6447 -3911 -758 1326 559 -1768 -2070 -3929 -1796 -890 -810 -1800 -3374 -2813 -1283 1298
6574 1298 719 565 79 -1304 788 1511 1919 4098 4018 2569 1840 2579 917 -52 166 -1400 -3625 -4514
6556 -4514 -2915 -217 309 -765 -2597 -1832 -917 752 -983 -913 2168 -266 -1973 -1050 -1845 -2771 -2802
6539 -2802 -3403 301 648 1562 1566 1051 1354 3265 2854 1703 3219 4694 4204 4224 2650 2809 4289 2933
6521 2933 2881 1294 424 -576 -2511 -2704 -1572 -1369 -2517 -1596 -74 -2529 -2808 -3589 -2237 0 -29
6504 -29 1227 2165 736 2190 3645 3095 490 -1084 -2134 -5557 -4736 -2636 -2142 -2164 -1728 -1840 -1429 -2158
6486 -2158 -1806 1220 432 -296 899 357 633 -13 -31 -2516 -2711 -502 766 -957 -2973 -4398 -5589
6469 -5589 -5400 -2807 -2202 -1853 -2368 -1120 198 -1543 -2539 -2264 -2822 -307 -2237 -6333 -4876 -5836 -4312
6452d312J850J606O15J06J103q68j456M08j50r1J676j278p60K297O38n24J066
6435A926j8j01l13k411r02O88j46L37N47o70j312k06K085L061r19k334j147j56
6417a991L89o34r71j117K713O99R86J472K1N97j50J584k72m82q34l98m83L0k670
6398a511j177J33P90o51J036K824Q01k732L26L4k25j724m9L96O92j12j72j409
6380b730j407j04Q8J585J337j557q13J735J236N64r50J55M29p06j808J807L600
6363B461j149j581J323j006j994j98j963Q75JJ165J266k07j881J557J720J258
6347A647K264k647k52O9l34o84n09j911J204J825O53j623K352J367j944J0L5L522
6329E044j398l155j183m97J071J657M91j25k711j279n30M52P24k900j210J541
$$ plain form
6452 -4312 -2462 -856 -241 -135 968 100 -1356 -948 -1098 -1189 487 -791 -1551 746 1384 860 1926
6435 1926 1908 1807 1494 -917 -1819 -1131 -1277 -940 -393 -1063 -2375 -2581 -496 2565 1646 -688 -1835 -1991
6417 -1991 -1602 -2236 -3207 -4324 -1611 -912 74 1546 1567 2164 2014 3598 3326 2844 2010 1612 1129 1159 -1511
6398 -1511 -2688 -2555 -1765 -2416 -1380 1444 2245 -487 -161 -127 -352 -2076 -2125 -1729 -1037 -1149 -1321 -2730
6380 -2730 -4137 -4241 -4153 -2568 -1231 -2788 -3601 -1866 -630 -66 -1016 -861 -432 -1138 -2946 -1139 2461
6363 2461 1312 -269 1054 48 -1946 -2144 -4107 -3232 -3231 -2066 -800 -1007 -2888 -1331 389 1647
6347 1647 3911 1264 1012 1081 747 63 -446 -2357 -1153 672 1325 -298 2054 3421 1477 1487 1522 5044
6329 5044 3646 491 -692 -1189 -118 1539 2030 1905 -806 -2085 -2615 -2163 -1439 -4339 -5549 -4008
6313d008J363J982n7L98o33j742L77M91j458o98Q91j092j409k043k13j103N62
6296h392j094O65K458l93K290J465J508J592r94m12p34J25Q67n92m48L07K294
6279E12J736O62p26q74K748J60N02k07k509k962M10k069j88k922K72J340J603
6262b512K233j180J494O63j471k108q02J093K134J333n82j148j74j63l43j216
6246b749N58J355J099r78k251q31K22J033J043P34Q27j826j165K86k51l22J258
6229a958K032N20q10p61j788r50J744J363j908k850o72M53q06J295J796J752r0
6212a638J243J666M85L59p8n3p35k821j640M90L90N5p81L13K0J342K454k640l510
6193e079J358J355j3J190K297k049k998k23J875Q10j609J070O53j155Q9j024j033
$$ plain form
6313 -4008 -2645 -663 -720 -322 -955 -2697 -2320 -1829 -3287 -3985 -3094 -4186 -5595 -7638 -7851 -8954 -8392
6296 -8392 -9486 -8821 -6363 -6756 -4466 -3001 -1493 99 -895 -1307 -2041 -1916 -1049 -1641 -2089 -1782 512
6279 512 2248 2910 2184 1310 4058 4218 4720 4513 2004 -958 -548 -2617 -2805 -5727 -5455 -4115 -2512
6262 -2512 -279 -1459 35 698 -773 -2881 -3683 -2590 -456 877 295 -853 -1027 -1190 -1533 -2749
6246 -2749 -2191 -836 263 -715 -2966 -3797 -3575 -2542 -1499 -765 62 -1764 -2929 -2643 -2894 -3216 -1958
6229 -1958 74 594 -216 -977 -2765 -3715 -1971 -608 -2516 -5366 -6038 -5585 -6391 -5096 -3300 -1548 -1638
6212 -1638 -395 1271 1756 2115 2037 1984 1249 -1572 -3212 -2722 -2332 -2277 -3058 -2745 -2725 -1383 1071 -1569 -5079
6193 -5079 -3721 -2366 -2379 -1189 1108 -941 -3939 -4162 -2287 -1477 -3086 -2016 -1363 -2518 -2429 -3453 -4486
6176d486J461J707L592K076j353n79k293k947L355j004J55m11r13j620r40J324
6160b876P59J624j8m60J115n61n40J131k165j429K326j584j447J808K178N81j56
6143B86j019j396j503j54K915J281o10j737j822l24l26R67K024J827R24L24j080
6126E77k387R20j37j428j848M49j008K345o68K397L181j81j092R32j137m418k165
6109e668l28J815K318J098qJ232k10j38J140L27P22n133k018J951K285J640j196
6092a71k536J578R81J020k234R77K40j025n18Q08R71m65j640R60K673k2R21l03
6074B215n12l190J022J053Q54n33j616l1Q70J658qJ073l86j407k095O03j223P64
6056h89L371m07j918r76l138j078J425J101r49O11J020K447L70j043M22J205K17
$$ plain form
6176 -4486 -3025 -1318 2274 4350 2997 2418 125 -2822 533 -471 -316 -727 -1640 -3260 -4200 -2876
6160 -2876 -2117 -493 -511 -971 144 -417 -957 174 -1991 -3420 -1094 -2678 -4125 -2317 -139 442 286
6143 286 -733 -2129 -3632 -3786 -871 410 -200 -1937 -3759 -4083 -4409 -3442 -1418 409 1333 1657 577
6126 577 -1810 -890 -1027 -2455 -4303 -3854 -4862 -2517 -3185 -788 2393 2212 1120 2052 915 -3503 -5668
6109 -5668 -5996 -4181 -1863 -765 -773 459 249 111 1251 1578 2300 -2833 -4851 -2900 -615 1025 -171
6092 -171 -2707 -1129 -148 872 -1362 -385 -145 -1170 -1688 -880 91 -374 -2014 -1054 1619 1597 2518 2215
6074 2215 1703 -1487 -465 588 1442 909 -707 -738 132 1790 1782 2855 2469 1062 -1033 -430 -1653 -889
6056 -889 2482 2075 157 -819 -3957 -5035 -3610 -2509 -3458 -2847 -1827 620 990 -53 369 1574 1791
6039A791J192j583k153n72J635R49N43k1o63l503k12K10J328m90r49M779J959
6022D240j026j941N76k242k103J719q4K31j530k30R2p58J615J314P20j373K67
6005e13M41J6M12J264n00J742q33j485k114o49l94k35N7J404J335o2r00M04j668
5986b278J902J280m51o64k701P4j81J716j29q03K180J964j953j762l22J402l41
5969a067K24m37k355J071j639J280J128q48Q40j81J289J507n11L09O88J29o35
5952G92M92J023J11j315r51o18K635J70k832r90J149J480Q23j981j637r02o78
5935c229R22J594M49p66O96J691R21N06j526O09M11J124l83j374P52j218l38J071
5917A912J378K92k821j066L4Q52Q63q20J23L191l063l762o75Q57J935K748k726
$$ plain form
6039 1791 2983 1400 -753 -1325 310 1259 1802 1781 1118 -2385 -2597 -2387 -1059 -1549 -2498 2281 4240
6022 4240 3214 1273 1849 -393 -2496 -777 -861 -630 -2160 -2390 -2298 -3056 -1441 -127 593 -780 -513
6005 -513 -72 -56 356 1620 1120 2862 2029 544 -1570 -2219 -2613 -2848 -2791 -1387 -52 -114 -1014 -610 -2278
5986 -2278 -376 904 453 -211 -2912 -2838 -3019 -1303 -1432 -2235 -55 1909 -44 -1806 -2128 -726 -1067
5969 -1067 -843 -1280 -3635 -2564 -4203 -2923 -1795 -2643 -1803 -1984 -695 812 301 610 1298 1427 792
5952 792 1284 2307 2418 1103 152 -466 2169 2339 -493 -1483 -334 1146 1969 -12 -1649 -2551 -3229
5935 -3229 -2307 -713 -264 -1030 -334 1357 2278 2784 1258 1867 2278 3402 3019 1645 2397 1179 841 1912
5917 1912 3290 3582 761 -305 -271 581 1444 624 747 3938 875 -2887 -3562 -2705 -770 1978 -748
5900g48M06K611J65k754n05J293J488K2l86j119J061J685j340k161r00o9k85M21
5882a115J568J269j093k076r31P40n70k256J055J797r36k526n08O66L415o21J839
5865b83J237P04J339J041j739l505j165j43L029l16k717P57K691k95j379k39M31
5848e52N38J50l71L74J032J85j802k65n5J779o52j727N23J309J472J009k420j462
5830i35J10J662J701R5o05l92l37R25j413k563j039K69j59P88j62j219k75o91
5812d240O70J963L22m73j044l90j94l50J435K498L05j471j440j426J010J386n85
5795b024J08k7J578N49j720j959l32K073K171J832k432k797M48P85M49J477j318
5778a139m340J081K314j27L26k06J152p82r45j343J928L144r11j75k528L64k46
$$ plain form
5900 -748 -342 2269 2434 -320 -825 468 1956 1978 1592 473 1534 3219 1879 -282 -1182 -1251 -1536 -1115
5882 -1115 453 1722 629 -1447 -2378 -1638 -2208 -4464 -3409 -1612 -2548 -5074 -5582 -4916 -1501 -2122 -283
5865 -283 954 1658 2997 4038 2299 -1206 -2371 -2514 515 199 -2518 -1761 930 635 -744 -983 -552
5848 -552 -14 136 -235 139 1171 1356 -446 -711 -766 1013 361 -1366 -843 466 1938 2947 527 -935
5830 -935 -825 837 2538 2633 2028 1636 1299 2224 811 -1752 -2791 -2522 -2681 -1893 -2055 -3274 -3549 -4240
5812 -4240 -3570 -1607 -1285 -1758 -2802 -3192 -3386 -3736 -2301 197 502 -969 -2409 -3835 -2825 -1439 -2024
5795 -2024 -1916 -1943 -365 184 -1536 -3495 -3827 -1754 417 2249 -183 -2980 -2532 -1747 -1298 179 -1139
5778 -1139 -5479 -4398 -2084 -2211 -1885 -2091 -939 -1721 -2666 -4009 -2081 1063 152 -23 -2551 -2187 -2433
5761b433K620k392j180J690J495M65J092J004j178j378k263k273j908K860K773
5746a006j121N27J908L28J140J957N69m65j838j542m76r17k457k069L708J107
5730f47N54J056j693j273k07n56j917m61j25K885J592R99L20J17k520J825K425
5713B374j95j886k14R68O41m623q30J293J369k63l74R54L65m47L32L49n35J3N87
5694a22j023k445J936K220k23j422m16k111J197P30k13J275K040m7k369l190q61
5677e044Q23J255Q77o16J058M46J823J235j712j516K265j157J56j227K53n21Q18
5660g84j45k981r62K505k71P32j266p30N13L459o29J626P86o30L67R82q66l86
5642A320N8j347j522J2J296J325j826j965J09n96l4J750l78L69K14j38J554O26
$$ plain form
5761 -2433 187 -2205 -3385 -1695 -200 265 1357 2361 1183 -195 -2458 -4731 -6639 -3779 -1006
5746 -1006 -2127 -1600 308 636 1776 3733 4302 3837 1999 457 -19 -936 -3393 -5462 -1754 -647
5730 -647 -93 963 -730 -2003 -2210 -2766 -4683 -5144 -5269 -2384 -792 207 527 644 -1876 -51 2374
5713 2374 2179 293 79 1047 1688 -2935 -3765 -2472 -1103 -1366 -1740 -786 -421 -868 -536 -187 -722 -709 -122
5694 -122 -1145 -3590 -1654 566 343 -1079 -1495 -3606 -2409 -1679 -1892 -617 1423 1376 -993 -4183 -5044
5677 -5044 -4221 -2966 -2089 -2705 -1647 -1201 622 1857 145 -1371 894 -263 -107 -1334 -1081 -1602 -784
5660 -784 -929 -3910 -4872 -2367 -2638 -1906 -3172 -3902 -3389 70 -559 1067 1853 1223 1590 2572 1706 1320
5642 1320 1378 31 -1491 -1479 -183 1142 -684 -2649 -2540 -3136 -3170 -1420 -1798 -1429 -1215 -1353 201 827
5624H27r54j24j745J315K047K412j439k261k747P62q83J892J347m97J16K56m132
5607c808o85R09K833m49j266k47q34k12P80J390K251J966N24j562k114q96L92
5590a028J732M06j78j68o08N84j558K118q42l138j357J424m85J469J612L408m34
5573B957k567k127j56n82J057J214j642o23L750J274n73l24J78J784J81m09o40
5556B752l625K08N34j131L01J007J615m54l097k951K62K705J850o25L61m84k745
5539c517j512M50Lj065l92K922n9J368p96R54j45J024L1l427N88j0j93M48j04
5520c432Q00p70r7Q08P11J334J084j325j315J523K075j529o10j73l552L43J039
5503c086J508J278J526n26j618N76q06k215O73K692J840o94k627J182J269k71
$$ plain form
5624 827 -127 -251 -1996 -681 1366 3778 2339 78 -2669 -1907 -2790 -898 449 -48 68 324 -3808
5607 -3808 -4493 -3584 -751 -1200 -2466 -2713 -3547 -3759 -2979 -1589 662 2628 3152 1590 -524 -1420 -1028
5590 -1028 704 1110 932 764 156 740 -818 1300 458 -2680 -4037 -2613 -3098 -1629 -17 3391 2957
5573 2957 390 -1737 -1893 -2475 -1418 -204 -1846 -2469 1281 2555 1982 1658 1836 3620 3801 3392 2752
5556 2752 -873 -665 -131 -1262 -961 46 1661 1207 -1890 -4841 -4579 -1874 -24 -649 -288 -772 -3517
5539 -3517 -5029 -4579 -4576 -5641 -6033 -3111 -3170 -1802 -2598 -1644 -1789 -765 -734 -4161 -3573 -3583 -3776 -3328 -3432
5520 -3432 -2632 -3402 -3499 -2691 -1980 -646 438 -887 -2202 -679 1396 -133 -743 -916 -4468 -4125 -3086
5503 -3086 -1578 -300 1226 700 -918 -342 -1148 -3363 -2690 2 1842 1148 -1479 -297 972 701
5487G01r95k183P74J170n21l74j685k803M64J727K10J375K771m20j73n65j998
5470b525k368L96L964J738M32K86k91o33o88p89J332n22Q73J33J15p8k64j445
5452c34N69Q01K62m46J552Q47L34Q08K179k705r32j534k051J339O2j043M99j27
5434H0J38J448j182j39M15q88j445k076J253K392J351K545j04m29p2j434k210
5417c57J673R80j097m23j82R71M85k58j175j88o76O9M90o71r78m33J284l51k628
5398c465j766K51K874J485j139k094l73n81J296O75J989J464K037k29r5k283j639
5381a593J810J733j136n32J779J730K90O06j862j721l433K922J680o40k492j476
5365b335j210J277J221L58n47j658j9k23r33N49n61R60M01J197J035N59K10J017
$$ plain form
5487 701 -294 -2477 -1703 -533 -1054 -1428 -3113 -5916 -5452 -3725 -3515 -2140 631 211 38 -527 -2525
5470 -2525 -4893 -4497 -533 1205 1637 1923 1632 999 311 -478 854 332 1205 1338 1453 1375 1111 -334
5452 -334 235 1036 1298 852 2404 3251 3585 4393 6572 3867 2935 1401 -650 689 751 -292 207 80
5434 80 218 1666 484 345 760 -128 -1573 -3649 -2396 -4 1347 3892 3788 3359 3287 1853 -357
5417 -357 1316 2296 1199 776 594 1565 2050 1792 617 429 -247 -178 312 -359 -1337 -1770 -486 -837 -3465
5398 -3465 -5231 -4980 -2106 -621 -1760 -3854 -4227 -4808 -3512 -2837 -848 616 2653 2424 2329 46 -1593
5381 -1593 217 1950 814 282 2061 3791 4081 4687 2825 1104 -2329 593 2273 1633 -859 -2335
5365 -2335 -3545 -2268 -1047 -689 -1236 -2894 -2913 -3136 -4069 -3520 -4081 -3121 -2720 -1523 -488 71 281 1298
5347A298j101J58N71k908m064R64K430J240K088r18R54K8j51l44j47r60q14j655
5329c331p07K13O83l2j81L021J107O09J016k110j689Q24m93j777P07j613j497
5312e250J775R80J42p8N46N94J783o73r08O93J04j354M46k005j120J758R74J953
5294C60J340j123j713n59j156L91M28m32r29p65J046J587J260j095k090j04K742
5277h12n86j054J847O32J385L428K859j793l234j547l601k167J686j527J290J315
5261a879R04N90o70o74J281J382R4m22J695O26M72J17j645p36j211M40L34J008
5243A706P17j878j659m06L06O28k461R12k506Q70K753J302m30J53K084R64J133
5226D188q48j473o48q63j312j695j41J490n17j284J174K094j006j126N63j27k145
$$ plain form
5347 1298 197 355 926 -1982 -6046 -5082 -2652 -1412 676 -242 712 740 589 245 98 -862 -1676 -3331
5329 -3331 -4038 -3825 -3142 -3174 -3355 -334 773 1382 2398 288 -1401 -577 -1070 -2847 -2140 -3753 -5250
5312 -5250 -3475 -2495 -2353 -2431 -1885 -1291 492 -181 -1089 -396 -292 -1646 -1200 -3205 -4325 -2567 -1593 360
5294 360 1700 577 -1136 -1695 -2851 -2460 -2032 -2464 -3393 -4158 -3112 -1525 -265 -1360 -3450 -3554 -812
5277 -812 -1398 -2452 -605 27 1412 4840 7699 5906 2672 1125 -2476 -4643 -2957 -4484 -3194 -1879
5261 -1879 -975 -385 -1055 -1729 -448 934 1028 606 2301 2927 3399 3516 1871 1135 -76 364 698 1706
5243 1706 2423 545 -1114 -1520 -1214 -586 -3047 -2135 -4641 -3771 -1018 284 -146 7 2091 3055 4188
5226 4188 3340 1867 1219 356 -956 -2651 -2792 -1302 -1819 -3103 -1929 165 -841 -1967 -1404 -1531 -3676
$$ [...]
##END NTUPLES=NMR SPECTRUM
##END=
