##TITLE=Analysis number 319134
Compound Code cd 10852
Project Code adrs
Chemist Name 2y chem
##JCAMPDX= 6.0         $$ Bruker NMR JCAMP-DX V2.0
##DATA TYPE= NMR SPECTRUM
##DATA CLASS= NTUPLES
##ORIGIN= Bruker BioSpin GmbH
##OWNER= nmr
$$ XWIN-NMR		Version 3.5
$$ Wed May  3 13:44:15 2006 GMT Daylight Time (UT+1h)  MAYBRIDGE\nmr@NMR_250MHZ
##.OBSERVE FREQUENCY= 250.131544655141
##.OBSERVE NUCLEUS= ^1H
##.ACQUISITION MODE= SIMULTANEOUS (DQD)
##.ACQUISITION SCHEME= undefined
##.AVERAGES= 16
##.DIGITISER RES= 18
##SPECTROMETER/DATA SYSTEM= dpx250
##.PULSE SEQUENCE= zg30
##.SOLVENT NAME= CDCl3
##.SHIFT REFERENCE= (INTERNAL, CDCl3, 0, 16.522)
##AUDIT TRAIL= $$ (NUMBER, WHEN, WHO, WHERE, WHAT)
$$ ##TITLE= Audit trail, XWIN-NMR		Version 3.5
$$ ##JCAMPDX= 5.01
$$ ##ORIGIN= Bruker BioSpin GmbH
$$ ##OWNER= nmr
$$ C:\u/data/dgb/nmr/ADRS/3680/pdata/1/auditp.txt
$$ ##AUDIT TRAIL=  $$ (NUMBER, WHEN, WHO, WHERE, WHAT)
(   1,<2006-05-03 13:43:23.29 +100>,<MAYBRIDGE\nmr>,<NMR_250MHZ>,
      <created by zg, POWCHK disabled, PULCHK disabled
       configuration hash MD5:
       84 BC 41 DB A1 6E 1D 46 DA 25 12 A5 C1 ED C5 3A
       data hash MD5: 64K
       C4 DF C3 C4 56 41 6C 46 F8 0B 92 15 FD 84 E3 4E>)
(   2,<2006-05-03 13:43:48.07 +100>,<MAYBRIDGE\nmr>,<NMR_250MHZ>,
      <Start of raw data processing
       ef LB = 0.3 FT_mod = 6 PKNL = 1 SI = 32K 
       data hash MD5: 32K
       06 70 C8 95 CF 07 0C 54 26 FA C0 3F EB 6F 39 CF>)
(   3,<2006-05-03 13:43:52.56 +100>,<MAYBRIDGE\nmr>,<NMR_250MHZ>,
      <apk 
       data hash MD5: 32K
       13 46 94 D6 F2 09 AD 78 88 FB E8 02 9B 52 9C 85>)
(   4,<2006-05-03 13:43:54.29 +100>,<MAYBRIDGE\nmr>,<NMR_250MHZ>,
      <abs ABSG = 5 
       data hash MD5: 32K
       15 77 D6 35 FB E1 E6 B1 E6 65 F6 6F FB 68 5C 06>)
$$ ##END=
$$ 
$$ hash MD5
$$ 59 2D 15 ED 61 2A 9C 53 9D 6E A1 4C 1F 61 66 37
##$RELAX= 
##$RELAX= 
##$RELAX= 
##$RELAX= 
##$RELAX= 
##$RELAX= 
##$RELAX= 
$$ Bruker specific parameters
$$ --------------------------
##$DU= <C:\u>
##$EXPNO= 3680
##$NAME= <ADRS>
##$PROCNO= 1
##$TYPE= <nmr>
##$USER= <dgb>
##$AMP= (0..31)
100 100 100 100 100 100 100 100 100 100 100 100 100 100 100 100 100 100 
100 100 100 100 100 100 100 100 100 100 100 100 100 100 
##$AQSEQ= 0
##$AQ_mod= 3
##$AUNM= <au_zg>
##$AUTOPOS= <26 >
##$BF1= 250.13
##$BF2= 250.13
##$BF3= 250.13
##$BF4= 250.13
##$BF5= 500.13
##$BF6= 500.13
##$BF7= 500.13
##$BF8= 500.13
##$BYTORDA= 1
##$CFDGTYP= 0
##$CFRGTYP= 5
##$CHEMSTR= <none>
##$CNST= (0..31)
1 1 145 1 1 1 1 1 1 1 1 1 1 1 1 1 1 1 1 1 1 1 1 1 1 1 1 1 1 1 1 1 
##$CPDPRG= <>
##$CPDPRG1= <>
##$CPDPRG2= <>
##$CPDPRG3= <>
##$CPDPRG4= <mlev>
##$CPDPRG5= <mlev>
##$CPDPRG6= <mlev>
##$CPDPRG7= <mlev>
##$CPDPRG8= <mlev>
##$CPDPRGB= <>
##$CPDPRGT= <>
##$D= (0..31)
0 1 0 0 0 0 0 0 0 0.06 0 0 0 0 0 0 0.0002 0 0 0 0 0 0 0 0 0 0 0 0 0 0 
0 
##$DATE= 1146660201
##$DBL= (0..7)
120 120 120 120 120 120 120 120 
##$DBP= (0..7)
150 150 150 150 150 150 150 150 
##$DBP07= 0
##$DBPNAM0= <>
##$DBPNAM1= <>
##$DBPNAM2= <>
$$ [...]
##$SUBNAM7= <"">
##$SUBNAM8= <"">
##$SUBNAM9= <"">
##$SW= 20.6930455092707
##$SWIBOX= (0..15)
0 0 3 0 0 0 0 0 0 0 0 0 0 0 0 0 
##$SW_h= 5175.983436853
##$TD= 65536
##$TD0= 1
##$TE= 295.16
##$TE2= 300
##$TE3= 300
##$TEG= 300
##$TL= (0..7)
0 120 120 120 120 120 120 120 
##$TP= (0..7)
150 150 150 150 150 150 150 150 
##$TP07= 0
##$TPNAME0= <>
##$TPNAME1= <>
##$TPNAME2= <>
##$TPNAME3= <>
##$TPNAME4= <>
##$TPNAME5= <>
##$TPNAME6= <>
##$TPNAME7= <>
##$TPOAL= (0..7)
0.5 0.5 0.5 0.5 0.5 0.5 0.5 0.5 
##$TPOFFS= (0..7)
0 0 0 0 0 0 0 0 
##$TUNHIN= 0
##$TUNHOUT= 0
##$TUNXOUT= 0
##$USERA1= <user>
##$USERA2= <user>
##$USERA3= <user>
##$USERA4= <user>
##$USERA5= <user>
##$V9= 5
##$VALIST= <valist>
##$VCLIST= <CCCCCCCCCCCCCCC>
##$VD= 0
##$VDLIST= <DDDDDDDDDDDDDDD>
##$VPLIST= <PPPPPPPPPPPPPPP>
##$VTLIST= <TTTTTTTTTTTTTTT>
##$WBST= 1024
##$WBSW= 4
##$XGAIN= (0..3)
0 0 0 0 
##$XL= 0
##$YL= 0
##$YMAX_a= 247593
##$YMIN_a= -335454
##$ZGOPTNS= <>
##$ZL1= 120
##$ZL2= 120
##$ZL3= 120
##$ZL4= 120
##$ABSF1= 16.522
##$ABSF2= -4.171173
##$ABSG= 5
##$ABSL= 3
##$ALPHA= 0
##$AQORDER= 0
##$ASSFAC= 0
##$ASSFACI= 0
##$ASSFACX= 0
##$ASSWID= 0
##$AUNMP= <proc_1d>
##$AZFE= 0.1
##$AZFW= 0.1
##$BCFW= 0
##$BC_mod= 0
##$BYTORDP= 0
##$COROFFS= 0
##$CY= 12.5
##$DATMOD= 1
##$DC= 0
##$DFILT= <>
##$DTYPP= 0
##$F1P= 14.0000005364418
##$F2P= -0.99999901652339
##$FCOR= 0.5
##$FTSIZE= 32768
##$FT_mod= 6
##$GAMMA= 0
##$GB= 0
##$INTBC= 1
##$INTSCL= 1
##$ISEN= 128
##$LB= 0.3
##$LEV0= 0
##$LPBIN= 0
##$MAXI= 10000
##$MC2= 0
##$MEAN= 0
##$ME_mod= 0
##$MI= 0
##$NCOEF= 0
##$NC_proc= -4
##$NLEV= 6
##$NOISF1= 0
##$NOISF2= 0
##$NSP= 0
##$NTH_PI= 0
##$NZP= 0
##$OFFSET= 16.522
##$PC= 1
##$PHC0= 171.2625
##$PHC1= 12.50105
##$PH_mod= 1
##$PKNL= yes
##$PPARMOD= 0
##$PSCAL= 4
##$PSIGN= 0
##$REVERSE= no
##$SF= 250.13
##$SI= 32768
##$SIGF1= 0
##$SIGF2= 0
##$SINO= 400
##$SIOLD= 32768
##$SREGLST= <1H.CDCl3>
##$SSB= 0
##$STSI= 32768
##$STSR= 0
##$SW_p= 5175.98343685301
##$SYMM= 0
##$S_DEV= 0
##$TDeff= 65536
##$TDoff= 0
##$TI= <Analysis number 999999
Compound Code 99
Book Reference 9
Project Code 9>
##$TILT= no
##$TM1= 0
##$TM2= 0
##$TOPLEV= 0
##$USERP1= <user>
##$USERP2= <user>
##$USERP3= <user>
##$USERP4= <user>
##$USERP5= <user>
##$WDW= 1
##$XDIM= 32768
##$YMAX_p= 523257030
##$YMIN_p= -722792
$$ End of Bruker specific parameters
$$ ---------------------------------
##NTUPLES= NMR SPECTRUM
##VAR_NAME=  FREQUENCY,     SPECTRUM/REAL,   SPECTRUM/IMAG
##SYMBOL=    X,             R,               I
##VAR_TYPE=  INDEPENDENT,   DEPENDENT,       DEPENDENT
##VAR_FORM=  AFFN,          ASDF,            ASDF
##VAR_DIM=   32768,         32768,           32768
##UNITS=     HZ,            ARBITRARY UNITS, ARBITRARY UNITS
##FACTOR=    0.157963299565203, 1,           1
##FIRST=     4132.6476996994, 0,             0
##LAST=      -1043.33573715361, 0,           0
##MIN=       -1043.33573715361, -722792,     0
##MAX=       4132.6476996994, 523257030,     0
$$ Real data points
##PAGE= N=1
##DATA TABLE= (X++(R..R)), XYDATA
$$ [...]
21131 183178 116328 35098 -14748 -72492 -58980 -69113 -83322 -51625 -16782 300870 371497
21120 371497 261091 230622 264334 180936 210594 299176 317630 306436 341179 371755 381728
21109 381728 109884 22974 55248 159998 411067 388337 214915 62050 148433 92395
21099 92395 94172 103823 27574 227134 260788 208055 245691 117112 60097 152523 49502
21088 49502 86650 71857 -68381 -215370 -58071 47392 -98252 -190202 -66130 4426
21078 4426 77410 189017 205429 328372 284959 167066 107158 57087 91728 -8576 -73717
21067 -73717 47632 285520 315117 144316 77903 -4494 -39667 -70523 -122488 -65077 24198
21056 24198 165195 208642 174915 245115 285168 445986 326267 38698 -33365 64979 185561
21045 185561 145767 167192 14180 -76176 -70038 -88750 -114332 -106316 -50452 -107270 -112188 -21411
21033 -21411 293393 292357 265184 407711 289272 172922 175780 271040 241798 223813 321425
21022 321425 195086 95000 71656 -66741 -112506 -99429 53654 177041 294366 156855
21012 156855 12895 48602 59513 41058 177600 226492 272301 223309 113284 201702 192774
21001 192774 101895 187380 338337 354026 270910 359292 329303 405081 405954 261082 127912
20990 127912 205101 187580 -52371 -139300 -199028 -116338 30128 299982 388550 246689 355958
20979 355958 568805 548643 430082 326630 123226 108096 -112180 -125431 -120396 -4365
20969 -4365 76904 -22742 -57521 -183157 -247941 -307171 -231243 -199973 -46393 -31141 -135149
20958 -135149 -77619 18692 8315 52513 159407 15212 -44712 110238 276482 405045
20948 405045 364591 201464 281626 318776 322323 300772 264111 167730 144355 228157 264036
20937 264036 343333 328535 358579 356105 236786 100584 17777 101553 118802 69696 69143 79355
20925 79355 172003 169925 220402 240699 188694 156503 -108286 -115731 -20626 190185 164708 49083
20913 49083 20995 -5770 158620 198716 222806 278156 144837 19452 -97714 -107556 -22483
20902 -22483 71914 51809 5873 87659 12154 -119384 -99962 -84922 7106 222582 326550
20891 326550 404136 367748 398903 313082 239613 290843 283956 137602 175020 118614 138067
20880 138067 310662 284315 275302 247038 26336 -66142 -76441 -117052 -93048 -88173 -15176
20869 -15176 117685 105580 118325 154088 315932 207426 37205 86203 176470 104999 114184
20858 114184 88474 -55143 -173610 -283874 -101479 174540 104833 69681 158376 42304
20848 42304 80239 258299 220683 139099 291937 279080 70626 152077 160353 370891 465155
20837 465155 502153 482212 474845 495592 364410 293604 222919 141330 -66486 -94206 -70053
20826 -70053 83478 96523 115750 204218 324469 377424 278916 142296 175661 235766 107770
20815 107770 -78889 -217684 -211558 -100910 -111089 -180312 -175560 -117822 8144 199938 98179
20804 98179 116449 204073 145338 -50236 -96355 39191 292628 259606 180775 245936 107518
20793 107518 121300 275102 220972 271617 249731 114152 -71874 -76373 -97902 18503 256140
20782 256140 271263 380595 342408 342370 244000 161641 408199 462869 578276 466703 345767
20771 345767 318990 272659 320909 274849 205542 253537 248375 296373 337692 213051 368309
20760 368309 446845 289779 135745 -4366 62204 98152 54629 -3382 83627 218647 224075
20749 224075 226262 162168 280043 193711 78388 178546 320672 339362 391656 352871 221658
20738 221658 188959 34439 119882 249703 319997 148175 180320 249137 382035 446412 468287
20727 468287 433242 224483 170433 334586 266330 43069 -12818 121632 331245 455069
20717 455069 343820 258196 289370 326095 262147 229638 259971 122291 288427 318375 186756
20706 186756 215935 228793 251991 482266 566329 477802 369202 326340 246954 220432 309651
20695 309651 368943 222834 126514 99410 233305 324983 189491 46251 80326 197230
20685 197230 110364 3300 61751 187348 327115 237219 218665 283195 183063 261071 331262
20674 331262 259693 157444 26062 45954 280824 334114 340788 262691 295136 337958 73340
20663 73340 -78296 -28364 213575 222549 229980 198803 462852 565383 533622 188249 102331
20652 102331 59085 60249 191355 191831 71579 2986 -8466 140033 148794 13488 252566
20641 252566 360946 418656 295770 131608 -192847 -200606 -158530 -87839 -128943 16223 27236
20630 27236 28436 93264 130384 162282 133863 50365 -91155 -65956 115831 318338 383523
20619 383523 216274 41795 43456 102896 23936 6174 13838 34085 130471 109772 -80409
20608 -80409 -33288 173796 218127 -25857 64790 99041 210135 183622 143013 77587 56598
20597 56598 34035 22192 72470 213565 197346 159730 72582 32207 56368 -4056 -113004
20586 -113004 -963 -947 62471 247114 264740 187824 129873 63192 116210 -27437 -114193
20575 -114193 -72823 -53202 -111729 -197788 -297731 -61100 114466 241844 84509 -22523
20565 -22523 25255 71487 86612 142908 170119 192446 329803 255088 38706 48289 209035
20554 209035 306959 438220 541820 448882 289884 239510 239170 72747 -124304 -64216 -104332
20543 -104332 -104422 167880 301335 236586 206135 -15230 -119211 32938 147199 175723 111773
20532 111773 24566 146205 124765 -3988 24126 58855 89853 93148 39131 -65307 110057
20521 110057 38131 23149 44158 -17027 99402 84657 57232 186773 315747 510292 537162
20510 537162 262837 270837 194474 43420 178347 303746 281630 261064 238167 113737 -113827
20499 -113827 -147305 -148072 -68690 43425 83238 181011 266265 328248 247450 198085 231277 257380
20487 257380 189271 -54147 -37148 133690 235762 132310 92955 -43784 252664 332619
20477 332619 332779 356117 238785 216900 241057 115100 11208 86959 -59303 -107252 -103778
20466 -103778 89264 217667 -12401 86921 -9660 -126595 -109007 -110199 -206840 -421037 -422634
20455 -422634 -173859 30173 49723 -10334 48784 135811 134589 273280 360709 286604 273883
20444 273883 303000 337585 253311 292929 314282 85189 -99623 -59010 54671 76957 114830
20433 114830 221722 177605 184841 270888 240491 139044 -190433 -110615 12698 115603 66722
20422 66722 78391 -11659 -50037 -121048 24566 139843 10072 -24041 -105907 -59753 -169628
20411 -169628 -125443 68170 96821 -73100 -177444 -139487 -162021 -158155 37598 267722 410605
20400 410605 461584 448721 298875 432556 337745 304325 257883 257486 181722 200649 327138
20389 327138 286540 287215 233044 309283 322838 200844 27498 51255 123978 164345 151784
20378 151784 112264 -186374 -180484 -3027 68277 -30998 37652 -66299 -54488 -41755 -81952
20367 -81952 -171924 -116392 -8452 18979 95592 113801 233712 161094 34690 94263 57705
20356 57705 -75530 -93069 33794 62469 196078 131172 157771 193495 58947 16801 108178
20345 108178 294310 276027 76675 16413 86175 -38319 -131919 -29871 -163782 -260042
20335 -260042 -241251 -215294 -184397 46053 61032 27942 -3209 -135109 -96400 -150455 -37011
20324 -37011 116883 31612 -152882 -222365 -1581 99076 195908 224523 169607 15378 -111574
20313 -111574 74553 45453 53453 -28689 29116 123447 20388 -23830 -49485 -42407 76441
20302 76441 133104 85816 -64032 -101711 259 99286 104209 -4029 -37902 119117 339640
20291 339640 381245 350549 553807 624912 384685 164650 36764 -165049 -63553 -31449
20281 -31449 -49900 16760 88835 76477 108668 9063 8543 10858 139589 164001 18475 -103444
20269 -103444 -211748 -259606 -315119 -341730 -167713 -80969 -86860 -146141 -169257 -381701 -363892
20258 -363892 -240801 -356209 -365882 -240713 -107673 -2485 178136 -31441 -46612 -4308
20248 -4308 31495 -57294 -161426 -77630 297876 332885 277703 -46061 -118654 -172187 -152478
20237 -152478 41405 284373 197747 180654 331033 416427 392139 218562 156891 235428 149802
20226 149802 81376 12492 134584 51163 -5831 13187 -18513 8169 45844 197153 185241
20215 185241 48422 -86175 -25654 -6926 -53337 161394 91474 -119148 30946 274391
20205 274391 141959 -174989 -259318 -105850 11732 68277 171171 199137 211720 121349
20195 121349 8527 -70917 -200031 -250471 4522 174824 114925 157803 70618 133281 -16175
20184 -16175 -104193 11159 110139 7851 -314190 -290597 -118446 8309 -25313 -34555 -90075
20173 -90075 5211 106018 101645 4925 -22985 115236 -87046 295 24486 -67147 -220527
20162 -220527 -147308 -191276 -178130 -138506 -130527 -19592 -42745 -107052 187434 149345 -2424
20151 -2424 -85379 -134995 -109195 -127688 -320408 -245437 -85542 17471 230153 171075 -70465
20140 -70465 -352003 -433468 -183760 77329 -56168 42900 163249 189817 193612 32460 27367
20129 27367 41236 74881 66134 99942 -45303 -50187 -34246 118770 227539 129119 144099
20118 144099 181423 146831 233833 325662 271589 111698 187895 271874 533980 491312 301650
20107 301650 242122 270911 335125 248843 117703 7653 39270 -22302 87226 17547 141347
20096 141347 -54708 -228070 -130942 -45834 -17841 -23762 114437 187265 232084 168703 73561
20085 73561 48126 4151 -60694 75467 49239 1237 38033 227845 234413 156533 273727
20074 273727 305782 277972 183663 274033 438577 474232 301151 240101 208499 182318 252229
20063 252229 196921 -25472 -87975 -128936 -57659 75494 187686 208336 80899 -126114
20053 -126114 -107355 -121399 -76624 20431 196379 106643 -32488 -173594 -117249 -49522 8853
20042 8853 57629 -79039 -120347 -185621 -37587 144689 -30607 -168316 6391 245194
20032 245194 208960 79575 15223 -5851 -53808 -11409 -40192 -101723 -86878 -77167 -61543
20021 -61543 -83297 -203424 -150452 -77669 -205023 -125744 53694 299908 329281 129514 41878
20010 41878 132226 241401 109371 -93398 -90468 -8815 64832 58897 2913 -116399 -91005
19999 -91005 -84273 -254612 -320544 -262985 -168048 -54177 -50912 -163143 -20042 -129158 -139900
19988 -139900 -61093 -66155 -224322 -126724 -34065 14816 73379 48635 82845 175559 186402
19977 186402 263588 140241 -48682 -53499 -89140 55569 264101 226415 76664 98052 213673
19966 213673 160650 115661 -42087 -234321 -297293 -129694 133236 180087 261662 241676 142393
19955 142393 86811 225037 240317 132288 84889 -45663 -235426 -125330 24704 207339
19945 207339 250471 128730 -159646 -182194 -67375 56567 112118 82720 41395 67050 -56448
19934 -56448 -144182 -172669 -104530 -53970 -121888 -113573 -113540 -42108 -74540 -50098 -120316 -240549
19922 -240549 -159527 -35020 101833 210049 164867 37665 -124354 -179333 -85509 -77637 -146470
19911 -146470 -213771 -208248 -145813 -202932 -267742 -56914 106200 96034 240522 440465 312281
19900 312281 95601 35381 -88475 -163198 -35987 -123306 -247189 -212366 -96874 -67626
19890 -67626 90100 91561 116853 164671 120639 66029 -38553 -98279 89158 95744 172073
19879 172073 -26334 -138574 15492 92817 -53145 -194460 -216749 -94076 98281 221054
19869 221054 316535 178384 184958 19980 -87649 -288969 -266634 -40171 181531 335202
19859 335202 365265 282158 210911 108431 -158262 -371545 -276273 -170240 -240723 -304893 -341471
19848 -341471 -167902 -264300 -256606 -47538 21584 142814 129495 57416 221782 195992 73126
19837 73126 86828 97538 166727 249547 253828 297620 276743 361209 278557 146793 -47207
19826 -47207 -156722 -67839 -34908 197567 252828 274264 260023 215555 120907 170356 97040
19815 97040 62015 40077 123507 71106 91826 135853 224924 63612 59692 116653 91587 127067
19803 127067 83249 -6774 -174155 -278854 -155266 -85172 6904 -89838 -155031 -95305 -209111
19792 -209111 -214515 -82804 10775 -7263 -12011 -35609 -24312 -11555 -81433 -111359 10039
19781 10039 82998 -13658 -100686 -84423 -197725 -237456 -212099 -140462 -60469 -192540 -311535
19770 -311535 -111937 -111532 -126053 -155243 -132843 -166452 -54401 -27704 69134 261208 310361
19759 310361 233693 113770 -66551 -70852 51408 2434 -123600 -355871 -257349 34609
19749 34609 63440 -4142 -73355 -60900 81393 48298 -140933 -352757 -422865 -333373 -135003
19738 -135003 -173026 -239132 -178192 44969 257018 202828 20326 -148650 -61466 -103568 -49776
19727 -49776 91174 26001 -10162 -97799 -147597 -87079 -120612 -35298 132777 126219 -18606
19716 -18606 -91175 -24056 72253 47495 -43683 -144696 -224698 -453824 -492784 -405431 -391575
19705 -391575 -273710 -143130 -125180 -116229 -80775 -49587 -25604 24864 -37007 -171475 -295509
19694 -295509 -343837 -231533 -110365 -98810 -107319 -210150 -30359 3806 59000 105547 79740
19683 79740 -136164 -409665 -268414 -206951 -54979 -85415 -125148 -50337 60403 76911 22510
19672 22510 -168249 -85513 209293 188777 161083 29361 -25462 32921 -56261 -20265 56634
19661 56634 -61895 -248007 -264022 -128453 -225065 -279326 -87712 -45947 17262 -60344 -149776
19650 -149776 -93436 -181716 -115836 -28263 -17546 -83313 -30722 127778 -65232 -110965 -72330
19639 -72330 -139360 -168230 -183620 -26972 53652 187916 186571 129607 175108 139784 -59426
19628 -59426 42004 54283 -6854 -49447 -57074 -350614 -370424 -228761 -276592 -326729 -342185
19617 -342185 -365745 -296535 -216596 -149213 -218388 -158632 -20330 -34549 26099 62564 61538
19606 61538 37860 33248 63478 -45196 -84281 -220787 -335255 -186844 -36455 -7190 -192808
19595 -192808 -169715 -111792 -82465 30198 -106470 -125387 -43275 -62557 -10066 51589 55923
19584 55923 121313 45865 -58179 -49794 28847 19910 -65612 -89576 -91403 20537 -22549 -45996
19572 -45996 10127 123957 -19772 -18034 170212 47220 -126710 -109167 -184496 -211429 -140256
19561 -140256 -255877 -206706 -19670 109313 165443 90972 -47824 -53489 -34645 -121101 -223475
19550 -223475 -114999 -131715 -182963 -93056 217127 306308 309409 106808 -43736 40669 -14723
19539 -14723 -19772 20502 42138 -128169 -71225 25752 -176658 -30747 51935 33316 -50627
19528 -50627 -125887 -185696 -140636 -31568 -3832 -7750 -34647 -121128 -210662 -34219 49835
19517 49835 -15720 -37126 87446 278599 -94989 -302528 -340134 -189522 -118620 -127363 61811
19506 61811 62190 -45748 -54157 -185873 -152982 -32556 -85866 68146 162677 242556 272601
19495 272601 269935 244408 95530 32752 -41036 -251003 -227266 -93148 -81372 -80987 39104
19484 39104 61655 -50305 -275623 -197192 -175234 -323656 -422551 -490305 -379585 -113916 125098
19473 125098 211680 41464 96533 117942 169995 120186 -5681 -37942 16710 77118 71637
19462 71637 -8879 66977 92771 -5218 -312410 -238904 -219149 -188998 -160804 -160399 -115120 1226
19450 1226 -39794 -74809 -46487 -39673 -67917 -77278 -130183 -45271 17341 13454 17723 -96159
19438 -96159 -174228 -121954 -4155 222240 253755 181970 36181 20512 57925 -233 -48749
19427 -48749 -86455 -62251 93307 -76129 -149886 -139480 -292518 -299908 -119402 13012 33217
19416 33217 88628 79672 -38174 -163680 -206822 -95024 -3181 -48638 43191 1256 -30590
19405 -30590 -60043 -66632 -48313 -6650 27751 -112432 31185 226920 256273 80792 -15058
19394 -15058 40448 62897 39368 75861 92064 72526 -76767 -149421 -140885 -197580 -105834 -61573
19382 -61573 -17725 -31983 -35967 57328 -22559 -81162 84051 107641 -65826 -295838 -370746
19371 -370746 -249728 -216882 -230463 -188474 -128841 -225928 -258331 -47881 44687 116141 68881
19360 68881 -97678 -219816 -286248 -343461 -270199 -217404 -157652 -78705 103525 149471 103975
19349 103975 36785 -150952 -186847 -167752 -125222 8610 -240204 -388546 -176716 -77682
19339 -77682 -55608 1562 -18773 -285418 -271687 -89753 61899 73195 -49494 -184538 -45048
19328 -45048 -81049 -201935 -123219 -33770 41395 125211 121347 72695 55297 157566 155944 94013
19316 94013 48892 -57685 -135715 -88946 -51408 -140597 -96930 -232802 -179174 -40509 -74627
19305 -74627 -86838 -59039 2072 -36256 -124796 -324403 -205534 -53527 -89591 -96222 -181036
19294 -181036 -303018 -429436 -325688 -182369 -11842 142044 -47280 -90891 -169202 -258072
19284 -258072 -163868 -11688 -100315 24666 3635 -66459 -38117 -19357 -7041 -42827 58787
19273 58787 82845 125841 -6785 -175163 -218086 -180683 -112769 -28732 -67017 11599 33393
19262 33393 54261 -51873 -93378 -27543 41026 99471 -57080 -155809 -18105 1123 -18393
19251 -18393 -62553 -134373 -149818 -215451 -301088 -221500 -98909 34591 175464 92641 -39909
19240 -39909 -267669 -251754 -109171 37482 -108956 -187053 7591 157394 170795 48066
19230 48066 -265515 -334602 -244389 -354273 -426467 -464655 -395668 -197533 27818 70173 12517
19219 12517 60651 -134935 -284910 -204636 -112909 41372 27428 -47003 6483 91030 2467
19208 2467 -80183 -37238 -158778 81542 172440 -15116 -56659 39683 100084 32485 35801
19197 35801 -90483 -144906 -198845 -230661 -71847 63465 20179 -18713 92386 306123 227951
19186 227951 41462 66728 124316 204735 1400 -45420 54378 19362 -160502 -104978 16386
19175 16386 31974 126567 102950 -147278 -133043 -13068 36759 121636 143409 -138930 -286719
19164 -286719 -165471 -93489 -203463 -153572 -200846 -133597 -114408 -36840 564 -137241 -6701
19153 -6701 132120 43190 -186110 -242254 -201273 -285031 -220555 -252913 -297442 -257146 -222225
19142 -222225 -283236 -141072 -75629 -23938 -41022 -204263 -102555 -23873 69087 -61955 -160995
19131 -160995 -65632 89952 73602 -189170 -154356 -87891 -162749 -188119 -96393 -20053 -92543
19120 -92543 -241823 -167836 -86212 -129951 -63686 61888 -30289 35274 132845 56786 -10007
19109 -10007 66198 103900 51863 63662 174527 160940 298825 255574 246179 239427 -69292
19098 -69292 -94858 9733 -32248 22223 16944 197174 180203 307553 293484 233840 326422
19087 326422 184469 183012 160444 162894 106110 173314 244183 -46744 -182311 -258777 -126521
19076 -126521 -70339 -12733 33063 916 -176003 -51047 -37290 -120479 82397 107718 42625
19065 42625 86222 67335 94266 195208 152217 -64439 -37467 101332 99755 28810 -223554
19054 -223554 -297092 -242610 -163968 -44559 -33580 -188569 -248931 -163255 -89006 -172394 -298218
19043 -298218 -195866 -54383 -89150 -111864 -6107 -32682 -98864 -221231 -177874 -128759 -114663
19032 -114663 -80245 -231411 -286944 -358936 -297988 -42488 43204 71557 73223 102726 84191
19021 84191 148735 -74859 -109103 14356 41107 166998 225480 161158 74870 110836 93407
19010 93407 -93226 83916 134049 -21310 -6673 48836 -86977 -113206 -9416 30239 -48628
18999 -48628 81457 48037 -43990 -185023 -191676 -129627 -275983 -314274 -164500 -73383 -198483
18988 -198483 -294389 -288741 -74727 55564 82396 -98279 -173030 -101635 -252223 -220334 -45949
18977 -45949 -62888 -166553 -133763 -30128 30186 72908 145310 85597 -37510 -113263 -52102
18966 -52102 104646 12699 -180919 -316556 -425909 -406759 -298130 -296258 -167762 -102201 -55520
18955 -55520 -145409 -251540 -273891 -136496 -238401 -128013 -118171 -186871 -353155 -311742 -317853
18944 -317853 -218849 -19943 -4069 20489 -30682 -140790 -248795 -101698 -1439 -160466
18934 -160466 -182377 -150710 -196153 -192905 3268 99702 82746 26356 -34996 13156 73187
18923 73187 169904 159043 148384 165056 150563 121812 265570 162409 157183 175234 76963
18912 76963 -85189 17769 20179 91778 -52688 -175879 -249411 -83032 -8369 -82723 -102845
18901 -102845 -146554 -295435 -345541 -154208 70329 170321 140732 52641 118477 25340 -162088
18890 -162088 -189613 -208524 -132611 -194383 -165818 -108131 -63939 -191837 -103874 71766 233344
18879 233344 369665 248885 207074 221321 174646 -97940 -198977 -76197 131978 322950
18869 322950 270715 115098 185138 321891 255044 291962 380722 327352 202920 -34908 -123862
18858 -123862 -267488 -209579 -125786 71753 147595 314538 162269 194970 166844 117229 77105
18847 77105 -44732 9328 128781 69367 111099 -14846 -19005 -142289 -117276 -91512 -152701
18836 -152701 -147166 -117069 -85371 9229 111779 -106527 -328000 -258735 -152191 38791 -76664
18825 -76664 -260248 -287731 -194977 -36536 -8010 -109006 -39027 -28172 -41898 86880 98774
18814 98774 109204 -65021 -45634 -100646 -146459 68151 29110 -94291 -260832 -254357 -229848
18803 -229848 -242939 -100466 -96065 -87743 -28402 -41655 -124920 -193146 -327188 -131167 -34821
18792 -34821 83060 -41723 -202649 -231119 -108972 -174511 -244803 -214767 6924 -56505 -40710
18781 -40710 -90978 -79202 -107103 -206874 -197364 -38882 67014 40135 -149444 -389676 -427103
18770 -427103 -326697 -191798 -191058 -98918 126882 450663 602066 801321 891957 404361
18760 404361 183501 175942 160497 334446 561801 436630 429356 390324 314866 294061 249723
18749 249723 186965 29934 -69555 -151673 -271744 -235003 -118135 185 -104619 -257140
18739 -257140 -166134 -89257 -100561 -22242 34916 23323 211955 319364 197748 88096 94390
18728 94390 9719 -31092 -157910 -289402 -202876 -133194 -232339 -245950 -134147 -45069 -8991
18717 -8991 119116 215602 206899 252585 375393 274710 129362 228979 219842 124725 -21298
18706 -21298 269163 408115 323668 45384 18856 13198 75968 247695 311844 251202 124541
18695 124541 12254 -21695 -140593 -255813 -200530 -180436 -161562 -186797 -137202 -182460 -518022
18684 -518022 -679697 -722792 -532422 -159547 -14774 58239 45166 49597 8435 -157638 -239710
18673 -239710 -70977 -37946 -146048 -59355 -169829 -338660 -501220 -381085 -202274 -54496
18663 -54496 -102076 -67836 71329 -51364 -217156 -149330 -26933 -94993 -211505 -105554
18653 -105554 -169647 -183078 37097 76674 128599 48257 30909 90474 119414 -47899 -172299
18642 -172299 -184899 -195210 -215412 -196200 -78703 -177419 -290362 -381251 -318469 -246677 -226915
18631 -226915 -113849 -46409 52908 113733 -104120 -145571 53245 5703 -99929 -140131 -24296
18620 -24296 -61483 -332776 -391485 -413693 -242803 48589 120658 143780 125034 -10694 -71800
18609 -71800 -801 153341 5580 -162611 -23688 83035 20035 -36112 -32706 -7967 -131391
18598 -131391 -237462 -173347 -132103 -125110 -15838 -39255 -111000 -70346 -92018 -242459 -200381
18587 -200381 40698 82542 -171410 -199690 -221988 -132001 50569 58160 -57384 -117371 -25890
18576 -25890 -50724 -101981 -67974 93376 105323 -146150 -217375 -174537 -173848 -199397 -225064 -28143
18564 -28143 200159 121821 21927 1243 -128424 -242085 -94356 140155 289407 205668
18554 205668 -21859 -223431 -246093 -297941 -60338 7870 -11631 -81296 28067 31499 -209293
18543 -209293 -173483 -60790 -14953 -24016 -25715 67514 35516 175767 224083 51709 -36890
18532 -36890 49077 73117 -62428 -147454 19880 18686 -56204 -151142 -108507 10082 -30074
18521 -30074 21701 38973 68804 202323 292811 174305 178254 252987 409670 138611 25723
18510 25723 99525 249245 163388 16725 -115860 -115720 16949 86929 -46046 -104749 -7901
18499 -7901 -416 102413 123013 -29974 -111342 -197851 -87171 -58583 -27581 -133944 -245145
18488 -245145 -226586 -139240 -13273 67866 33636 -53102 -68897 -1907 14902 52076 32851
18477 32851 12178 63767 69384 123190 87888 -10273 154013 296139 348326 268188 132629
18466 132629 23371 -142896 -80007 36786 -109791 -209363 -209210 -186671 -261630 -226767 -139774
18455 -139774 -189243 -74885 4453 255533 243093 11304 -13234 13241 151631 159907 112718
18444 112718 94204 11683 -204762 -171424 -309356 -170698 4429 -26927 14423 30154 -112188
18433 -112188 -242122 -221379 -203442 -207885 -129260 -82404 -182090 1705 118919 44657 17035
18422 17035 2843 -7004 -152976 -86966 181636 145300 33098 -72830 25716 51267 107280
18411 107280 138358 75200 179274 179638 72425 -26430 -130610 -347847 -206318 40682 195431
18400 195431 347687 302508 126669 111826 110173 98485 126525 129281 171692 99398 48633
18389 48633 -46090 20263 -60425 -211011 -196509 -188674 -46457 157877 187709 9527 -81884
18378 -81884 6200 67213 211814 150967 11472 -77363 -32348 180466 122591 99381 38242
18367 38242 -34278 -166774 -172890 -140101 -1704 202970 308345 334467 283599 208951 63578
18356 63578 120287 281978 349611 259029 88039 -15318 -36774 -142025 -141931 1302 49676
18345 49676 -156191 -21274 50012 92296 151094 133918 239260 355777 338309 226914 95029
18334 95029 173298 61653 -159212 -145314 -146673 -187094 -161318 -137686 -33609 -2953 -79399
18323 -79399 -250154 -239758 -176191 -35927 -98569 -262964 -150293 91639 258442 174825
18313 174825 132105 2370 -154861 69543 155456 146561 140554 -29855 -81936 25111 84039
18302 84039 15643 101922 40052 16456 -107451 -301666 -213897 -20112 42677 99850 57138
18291 57138 -30609 29242 -50638 -175190 -210955 -162196 -104428 23804 -26679 80361 164860
18280 164860 339286 177000 6863 -100278 -24634 57127 25101 -194938 -295278 -275743
18270 -275743 -277125 -95376 16931 -14485 -180001 -195265 -139826 -193154 -102644 -339 17896
18259 17896 -31272 39001 87218 60206 89663 176284 280098 162373 -27189 -172482 -306141
18248 -306141 -394848 -423107 -369926 -266224 172388 515520 363926 237411 139131 36911
18238 36911 -104306 60855 232567 225597 222407 261276 390821 445097 278177 119558 94283
18227 94283 215340 160190 61877 112936 161515 121361 73076 -78981 -108675 -60970 -132715
18216 -132715 -215897 -62912 47892 164222 374300 362412 97796 -65819 -211692 -221316
18206 -221316 45375 211233 297523 273560 212775 295279 290861 237376 87357 59221 120695
18195 120695 194212 244643 174903 208281 126921 64472 159473 289749 203609 102430 26273
18184 26273 43172 -121499 -142557 75697 54249 12589 187078 218833 221942 208583 245808
18173 245808 127611 172226 230705 361018 213675 95921 90925 67548 -50939 21304 219241
18162 219241 275420 387157 267680 127770 184047 298182 329091 469638 496701 526968
18152 526968 551826 506255 667947 523931 377432 561915 558151 530946 742678 913935
18142 913935 995784 755287 641741 529029 678146 808865 1014615 1184741 1173288 1104371
18132 1104371 1262309 1556385 1688738 1615358 1685796 1657800 1714068 1951654 2144748 2210142
18122 2210142 2452096 2963010 3385283 3909604 4625092 5424367 6497678 7910707 9872202
18113 9872202 12768685 16655733 22713807 32431715 48640439 74134516 112231146 164433918
18105 164433918 216802156 220521203 147243081 86824174 57788284 44004067 36352246
18098 36352246 30904993 26496991 23089434 20694793 19011801 17784291 16677002 15489393
18090 15489393 14362507 13673178 13162107 12395892 11656309 11096462 10877389 10807533 10537877
18081 10537877 9968419 9429548 9030496 8711565 8534127 8389415 8416656 8432357 8197992 7931283
18071 7931283 7738019 7399880 7229493 6924895 6502740 6381688 6284666 5959446 5764560 5707810
18061 5707810 5713074 5643548 5478421 5291943 5216495 5168417 5138520 5080800 5026901 5030041 4952180
18050 4952180 4784497 4493451 4327608 4108651 3860676 3819176 3746938 3634551 3574859 3321707
18040 3321707 3134492 3127281 3153063 3019593 2886764 2575292 2511832 2459348 2570564 2527130
18030 2527130 2533280 2682166 2705289 2555825 2458613 2319783 2251553 2261153 2221574 2132010 2119999
18019 2119999 2159941 1983221 1871235 1783179 1791734 1855647 1770372 1741278 1706256 1682293 1544832
18008 1544832 1382629 1486415 1492510 1460187 1380778 1565638 1733372 1793718 1796494 1758792 1751806
17997 1751806 1731530 1686254 1803958 1797759 2028535 2011002 2087141 1904224 1795780 1675464
17987 1675464 1742776 1806449 1779800 1759524 1672766 1500716 1510842 1404836 1347836 1192083 878329
17976 878329 776331 893816 891893 828698 931800 925101 806028 790278 774170 626795 613213
17965 613213 745185 680743 585878 654799 679328 799628 990709 1051131 1126497 1147205 885294
17954 885294 914390 1068430 1017159 1053508 1069551 1039033 1070295 987596 957961 948457 957258 887767
17942 887767 783048 838680 894443 826465 739346 652997 690139 729705 622214 644867 680376
17931 680376 601701 529683 582305 644989 646092 725966 746820 579050 562576 576773 542165
17920 542165 497498 441678 390224 404981 438827 633096 667525 516676 358941 183439 151517
17909 151517 167278 259195 433334 482320 380486 269514 263332 241923 266411 339847 449728
17898 449728 561132 507923 434787 456756 478911 490466 412271 111693 26460 -54016 -96599
17887 -96599 -65755 -149496 42427 -48491 -231197 -279456 -366645 -371171 -186745 -23261 -28760
17876 -28760 41613 151976 201626 252523 395335 386240 340355 361648 334963 381587 279961
17865 279961 48390 -165691 -65721 160856 231991 117352 -83817 -159366 -64396 75126
17855 75126 205296 159083 82662 158506 251799 172908 157875 101018 129908 53602 7992
17844 7992 -124458 -98884 -116132 -128607 -87288 -118422 -26428 200848 216650 39002 -18420
17833 -18420 -35849 -33000 -48484 -125632 -51899 29576 219303 238599 187925 202233 261682 233156
17821 233156 146115 27471 -115950 -233589 -222515 26378 62765 151079 71011 -122234
17811 -122234 -5405 230293 144005 -80847 -61646 -25960 -20375 103778 84844 -108098 -284656
17800 -284656 -321808 -280707 -161720 -18966 253634 274461 101357 -74655 -6523 95110
17790 95110 99503 -21667 28102 129467 91387 123826 191576 149451 105947 138326 51621
17779 51621 52389 -343 -77293 -135677 -207259 -241984 -182919 -230579 -62005 -50435 -145868 -121906
17767 -121906 -141411 -122985 -295949 -391764 -417154 -287552 -336758 -371313 -400768 -310305 -173579
17756 -173579 -212043 -281092 -218128 -249276 25106 255835 238923 182579 127659 -39578 -191541
17745 -191541 -102674 -136862 -175393 -101553 -160277 -129959 -190132 -268125 -274172 -90875 31459
17734 31459 36094 81684 1571 20994 -99528 -213661 -137802 65031 31675 -153797 -270423
17723 -270423 -152759 -144938 -253626 -208670 18077 206624 209561 201186 38594 -71582 -71486
17712 -71486 -64091 -158458 10439 93938 180635 363714 335051 232801 54786 -6693 2612
17701 2612 86663 -32913 17832 -8699 -65045 -146084 -144574 -90028 -172790 -278577 -60189
17690 -60189 24295 48135 121591 2078 -12816 3846 -101410 -265233 -219679 -61476 -10145
17679 -10145 -76787 -130197 -174180 -85367 -196205 -207652 -223849 -159111 -250288 -309255 -312381 -56300
17667 -56300 73857 142226 94867 3121 -184064 -109272 33796 -18945 -46772 39651 -35287
17656 -35287 -68614 70897 195163 216394 77319 -35752 102720 58381 -139780 1203
17646 1203 159414 249171 169746 -15192 -230607 -1980 196060 180123 47936 -26397 -244679
17635 -244679 -238861 -221865 -227024 -48121 -22731 -134938 -68914 -42966 99917 150723 141487
17624 141487 -7671 60949 -4082 -172731 -150923 -49824 -138406 -394530 -618322 -543336
17614 -543336 -228696 -118387 30259 72893 -115324 -261191 -422597 -248609 62535 26358
17604 26358 -128494 -177464 -165133 -181990 -283733 -230943 -295057 -130198 1828 45801 20280
17593 20280 -76055 -126873 -175936 -223390 -277611 -340882 -252708 -228759 -253182 -222880 -77360
17582 -77360 -19333 -287551 -271626 -83317 -73188 -153952 -142829 78927 107299 129121 121634
17571 121634 136157 183716 65409 -14432 -102947 -82990 -120862 -119528 -34977 -15780 -78862
17560 -78862 -83443 -59507 -137157 -181408 -189660 -205766 -252303 -270622 -57378 86414 71499 -105579
17548 -105579 -117546 81742 248741 282197 311658 259872 153615 53878 -60252 -210197
17538 -210197 -331418 -306366 -309972 -187852 -96405 -135010 -52625 -76576 -91442 -163144 -74657
17527 -74657 -98656 -195633 -350431 -425277 -201746 -54206 22588 60336 76155 -100871 -160498
17516 -160498 -122833 -117374 -212780 -133755 -225012 -109193 -64147 -21353 159333 225289 254301
17505 254301 152046 40960 -113679 -243108 -177974 -77228 143606 373138 244175 72761
17495 72761 -25485 61455 202705 90846 82214 160292 142256 -54705 -190158 -183652 -62073
17484 -62073 -57136 -129095 -98819 56084 12974 55616 -62181 34482 270108 251962 136271
17473 136271 81752 -122761 -318013 -288724 -287789 -339583 -348005 -323219 -222171 -345908 -450591
17462 -450591 -474146 -429023 -352233 -114363 -177903 -263038 -165486 -37023 87065 44249 -263909
17451 -263909 -206431 -212778 -164827 -146762 -71188 -137523 -26247 165268 233802 381900 532649
17440 532649 740146 936972 918121 598379 372449 337031 285994 199402 210079 172483 254103
17429 254103 231660 315477 230494 157795 200516 123550 143742 -1445 -48938 9518 26973
17418 26973 99915 20483 -166692 -292394 -303620 -128345 -136659 -174169 -217018 -194489 -50347
17407 -50347 -36601 30171 -25613 -114048 -89023 62041 202779 175081 255280 259103 28095
17396 28095 -35853 -1132 30875 -112213 -206176 93972 55113 119290 41766 62974 117170
17385 117170 291630 395181 227731 117625 152325 103591 65573 -26319 -63786 -80338 -264438
17374 -264438 -167190 -55584 -53006 -36339 6941 -78282 -107378 -136320 -88975 -203746 -116310
17363 -116310 72667 115298 222757 129151 68123 60285 -49142 -109688 5762 152420 96057
17352 96057 83872 180622 110588 6844 -114630 -125026 -108993 -36909 74452 -133684 -116032
17341 -116032 -55178 20039 8369 -99671 -122192 -52206 45741 14643 -71805 -314506 -326188
17330 -326188 -202681 -31392 -79858 -48662 -8036 -113067 -26294 44732 -19102 -39766 -51521
17319 -51521 17512 -61632 -201940 -199139 -30580 -4618 64407 100903 100300 60761 39379 -96138
17307 -96138 -110779 -164761 -244426 -81917 3591 126935 237644 176820 -69416 -68749 -55718
17296 -55718 -163295 -56980 39933 56933 50998 35301 -33668 -154093 -70342 2703 -72904
17285 -72904 22099 164524 88054 42346 -60464 67341 128980 109842 96980 301869 282963
17274 282963 167753 41766 -12634 -175208 -244611 -245192 -72882 -22610 -235205 -288632 -80681
17263 -80681 -26137 -56242 -51015 -146749 -273896 -109622 87810 91895 193771 114255 -103449
17252 -103449 -207715 -198737 -142993 -8735 -47594 -43994 32721 148194 208529 200863 183827
17241 183827 139798 81359 153528 63680 4581 -69674 -240147 -340109 -193556 -215203 -356290
17230 -356290 -220990 -231594 -246173 -288288 -71284 32995 71724 -160140 -118497 -107672 -29555
17219 -29555 58182 45157 132523 178172 -3687 23936 72446 61484 -8037 -169931 -65954
17208 -65954 -172997 -281019 -48350 -18491 -50783 -90804 140825 236428 142781 96310 332023
17197 332023 235300 14836 15604 242363 280203 229332 169885 136339 38612 -8087 43662
17186 43662 313523 317487 255298 90811 -91270 59507 331852 156442 -62946 -62216 86409
17175 86409 88732 -372 8160 64540 144962 98893 -13584 12986 51926 -22099 -27573 -50608
17163 -50608 -146291 -328785 -415593 -325447 -204888 -161504 -117073 37236 67327 37631 106685
17152 106685 128478 72755 7605 33813 30438 85540 122303 -20863 -159785 -174681 -18028
17141 -18028 -24919 25484 87546 17565 -178926 -247277 -280476 -361182 -381884 -358681 -325982 -221180
17129 -221180 -147890 -40521 37428 -10607 -45556 21084 -56327 -109808 -104766 -47924 118840
17118 118840 -16041 -5525 -87141 -51550 -36992 -110274 -81774 34292 58375 -43162 -51790
17107 -51790 -158005 -169592 -161300 -99244 -105449 -138205 -28761 40772 12884 -94534 -184332
17096 -184332 14688 98327 15697 -25577 77382 217477 210607 65643 -127952 -69957 -92501
17085 -92501 -90441 157388 160495 32983 -60429 -65710 -62905 -86728 -97061 2280 15880 -156664
17073 -156664 -269299 -207164 -84022 -55057 -85180 -27007 102583 164379 8242 66692 50587
17062 50587 -7602 90533 24442 -291311 -375427 -171730 -114156 -294883 -427700 -503583 -547721
17051 -547721 -386540 -66595 93744 98293 -29549 -40919 -119187 -354572 -403988 -229531
17041 -229531 -157816 -41116 -42739 -75430 -76441 -20876 -23675 -107264 -101574 -170312 -249403 -198955
17029 -198955 -37743 121398 179874 1424 -86705 -110260 -110636 -244053 -282571 -197578 -290962
17018 -290962 -414194 -311349 -341516 -323786 -308025 -182775 21115 -8718 34868 -101861
17008 -101861 -55815 -62777 119975 110604 59438 -11367 -18733 -63084 28915 17860 -780 -93795
16996 -93795 -147408 -129890 -9916 -40811 -134965 -79581 -152377 -199245 -242666 -235031 -163237 -79104
16984 -79104 133753 175930 -114013 -293169 -220445 -50263 71137 50325 52371 33588 42876
16973 42876 82068 39458 207760 268561 327888 320277 208986 147901 77988 -77285 -83480
16962 -83480 38500 101580 29305 -64725 -110828 -93935 -81067 -58968 190033 131297 55159
16951 55159 -12695 -54879 -84029 -215697 -227630 -254645 -126154 -60753 -89344 825 -9999
16940 -9999 -18099 8817 -129242 -61955 7549 -52868 -126971 -110811 -81806 -110126 -128453 -150338
16928 -150338 -146904 -127920 -86357 -29599 27989 20466 -148302 -80786 -71243 -141350 -40130 -10757
16916 -10757 152302 139806 -63616 -24191 31157 43697 31877 37034 -156593 -235225 -168752
16905 -168752 35940 149939 109190 71882 8711 79143 89958 -36326 -18985 93924 13270
16894 13270 -172824 -344454 -353704 -318154 -326026 -372729 -465273 -349030 -178656 -212055 -156645
16883 -156645 -187995 -129627 -49655 46996 9700 -111529 -243349 -338896 -278165 -240868 -337422
16872 -337422 -379144 -275530 -185465 -101756 130477 203530 206973 143850 -12465 -139027 -145304
16861 -145304 -122074 55314 325911 416525 424470 246506 -31134 -103532 2902 -240969
16851 -240969 -394825 -49159 118743 -164425 -121200 -32492 93797 139915 -91473 -144422
16841 -144422 -267995 -355319 -397268 -225628 -126074 -189254 -180608 -137790 35094 223387 234688
16830 234688 92272 -104912 -143588 -135066 12179 96358 -59383 -228939 -240822 -144623 -298387
16819 -298387 -425103 -349259 -250550 -135668 -116167 -100284 -39014 -46007 -161577 -233082 -184513
16808 -184513 2144 -6009 -160105 -196795 -127968 -87074 21144 211884 198287 219573 82072
16797 82072 84929 -55009 -86677 -178496 -330635 -335840 -138634 -92650 -98795 32724 27309 -60942
16785 -60942 -32700 -139174 -216827 -181273 -106949 -8251 -113874 -72358 -96622 6588 41568
16774 41568 -1405 -43247 -142569 13097 3614 134004 184552 24514 -44624 -61103 56424
16763 56424 -14579 52967 105568 86930 318548 280576 153392 261310 195180 -22299 -143595
16752 -143595 -34796 2344 -175866 -176648 -130706 -21594 -89503 -103314 -208826 -323566 -321298
16741 -321298 -366760 -417632 -286564 -39893 -46728 -115902 -50105 -3727 2721 -6416 -36687 -42405
16729 -42405 -133180 -47162 21351 62308 108884 -159461 -217704 -83181 -32470 39338 -32753
16718 -32753 24490 3524 -108713 -222030 -297320 -382113 -416859 -341313 -155959 -183384 -153150
16707 -153150 5742 -135741 -99808 -25566 -130957 -110606 -21549 112454 128271 176748 73844
16696 73844 40660 48515 -81533 -47642 190124 296085 234607 241695 153792 153775 251202 304899
16684 304899 234949 67972 152131 181736 150696 182895 261185 174753 39081 17002 -40625
16673 -40625 3550 58773 34540 -9787 -19602 -96656 -36554 -65323 -120048 77739 -14805 -289348
16661 -289348 -126034 -105631 -102311 -187653 -207285 -272842 -130660 -107514 -96703 -19737 44799
16650 44799 190239 231446 33446 -91399 -64716 -37741 -48893 -60696 -142259 -263950 -220168
16639 -220168 -28858 532 -112656 -24978 47484 -23871 -48081 -87143 -139298 -309614 -304448
16628 -304448 -415454 -522158 -529081 -438189 -444719 -291145 -265379 -241532 -227910 -180634 -132790
16617 -132790 -229934 -45629 81608 46262 -165704 -231243 -332797 -381845 -213625 -54888
16607 -54888 -19109 -113100 -294241 -233833 -310712 -507831 -514366 -464869 -397683 -491071 -369471
16596 -369471 -224456 -93009 -242769 -145487 -94219 -164421 -186238 -61788 -94749 -39940 -37349
16585 -37349 -114260 -48701 94843 9701 -91482 -99514 -152395 -270534 -268304 -131756 44233
16574 44233 44822 -106004 -73642 85567 215635 233507 43976 7945 209164 410583 334105
16563 334105 198037 63871 -64913 -170124 -47490 163818 66472 122822 20599 -23023
16553 -23023 -78663 -24495 115878 77198 -63824 -69191 -183919 -121058 -62518 70037 151190
16542 151190 170102 148498 128194 204882 209173 43522 -68600 -143906 -227239 -304230 -512741
16531 -512741 -462786 -462227 -372318 -143041 -76738 45177 75022 124933 108375 -59655 -138955
16520 -138955 6598 123704 81280 16580 -22319 75406 203767 216191 226279 1042 -51888
16509 -51888 30795 72293 -23169 97319 134098 -60226 -273426 -286798 -344497 -417711 -204832
16498 -204832 7139 -24681 -33540 -213763 -175917 -157112 -159027 -31110 -83780 -28061 71512
16487 71512 -37352 -110154 -59253 -87177 -193419 -266650 -302841 -283897 -169079 -99096 -115831
16476 -115831 -196023 -256490 -255464 -138370 -162657 -265245 -207223 -147137 -344655 -487557 -343609
16465 -343609 -252277 -126217 -65934 -169243 -383459 -374920 -293898 -213724 -232782 -80502 -8052
16454 -8052 -15747 100386 147560 -11247 98988 298686 113888 -14266 -177985 -211134 -108273
16443 -108273 -60290 -184714 -211753 -267924 -53371 7223 -52029 -148392 -190638 -197044 -169863
16432 -169863 -141934 55343 -131816 -107264 97075 120550 103137 -210055 -336077 -130355
16422 -130355 -206316 -335537 -296492 33140 321649 147640 -41801 22599 134092 169722
16412 169722 -18174 -146284 -146175 83156 145451 194252 82835 -162100 -226480 -134688 -49345
16401 -49345 49042 -89292 -129151 -52671 -15519 -196416 -129027 -108323 -214742 -247342 -233989
16390 -233989 -74739 -70777 -12873 80150 31452 -47321 -122655 -133222 -257844 -518302 -483067
16379 -483067 -458046 -416577 -433224 -271374 1118 161404 96971 65992 106446 80730 140551
16368 140551 140795 -7038 -15482 49077 181608 13803 11250 -21465 -97207 -125758 -81991 -27493
16356 -27493 -66704 26195 57851 -32523 -154025 -202487 -124842 -10096 -15371 56590 110990
16345 110990 -16273 -50618 27037 42089 -28335 -67887 76744 -28397 -73516 -137695 66331
16334 66331 89388 -115938 -261023 -258061 -187193 -47018 137982 340627 281208 35127 6830
16323 6830 -150397 -57044 -4557 -30782 66352 51965 -139165 -204313 -113330 -129509 -225160
16312 -225160 -431119 -366629 -241840 -174361 -187918 -229676 26773 51526 43257 -15593 -146887
16301 -146887 -398401 -483130 -402193 -252372 -296850 -498189 -568234 -561671 -421865 -167995 -143362
16290 -143362 -178024 -169437 -134892 -191515 -122663 -85053 72309 101320 -14936 -145117 -145216 -112930
16278 -112930 -324008 -372378 -317865 -180351 -66463 21108 -47497 -163757 -181114 105253
16268 105253 147192 3326 80219 215483 159988 86062 238111 142898 30952 162665
16258 162665 204512 258518 122380 245104 159533 173588 180966 -20415 -61746 -61533 -82170
16247 -82170 -138596 -3586 -11568 -9798 -20153 -103994 -361107 -212280 -189894 19679 313392
16236 313392 175123 89478 185838 64794 -138603 -41507 80996 104646 -1289 52976
16226 52976 -28764 -56623 -11405 34241 168709 230140 137344 7233 147947 155365 259567
16215 259567 355686 227576 44438 151153 139388 179011 224274 130377 105119 -6689 100133
16204 100133 25120 104729 65326 -62677 -90167 22626 -18664 -273470 -394735 -354324 -265879
16193 -265879 -206468 -124225 -81621 -167221 -98180 -216064 -388508 -284222 -302232 -338199 -123690
16182 -123690 15340 128853 44178 -16777 229073 222443 88029 113571 152336 161559 165793
16171 165793 39509 -108710 -229376 -34942 57861 68017 -133595 -128606 7453 161754
16161 161754 205705 89377 -62919 -154093 -37463 -20573 -48764 48371 48754 86682 -94211
16150 -94211 -239213 -152039 -193031 -321155 -200373 -182599 -239584 -232713 -165622 -242140 -203906
16139 -203906 -236673 -162457 -119708 148600 146799 -184141 -389165 -224331 110411 289560
16129 289560 349286 328445 90115 -69287 -96957 -107706 -91374 88724 222987 271769 223125
16118 223125 81014 -38510 59052 126324 -99975 -162453 -84242 51158 77305 86292 -16650
16107 -16650 -126780 -66230 -7301 3145 -17392 28257 45534 16335 -159043 -157494 -13802
16096 -13802 -153851 -308618 -223716 -127170 -29817 -166983 -136144 -8960 -20024 16898 202080
16085 202080 267206 142487 69322 202707 85606 -68156 28300 169578 192536 174033
16075 174033 215619 276858 346124 413849 432882 404099 288128 302967 190051 228435 155123
16064 155123 192940 201866 137366 58708 87901 47217 -151975 -142976 -116696 -176492 -296801
16053 -296801 -228245 -170885 -198140 -274716 -315256 -50800 202557 191233 83948 -25812 97333
16042 97333 122674 158369 109576 46696 98791 29660 -61755 -6475 149613 97373 89346 -32451
16030 -32451 -178916 -107374 64540 142364 223862 86111 -135676 -147303 -131332 -264970 -166529
16019 -166529 81334 228705 312808 406760 359437 303660 226053 81100 -163182 -104222 38980
16008 38980 -161199 -269951 -222262 16046 173233 108695 66805 -79535 -158090 -144321 -174603
15997 -174603 -98237 58745 156836 257380 237494 89613 -173042 -204751 -147551 -215247 -249923
15986 -249923 -347664 -493236 -506561 -375545 -329034 -360023 -239533 -93943 43100 50416 -59811
15975 -59811 61901 69660 91732 108378 24666 59169 -112134 8022 -16748 -215243 -78452
15964 -78452 -17126 -308074 -337941 -99131 -47747 -32869 -202669 -488474 -380790 -54122
15954 -54122 196373 91367 89543 -33597 -108718 -167212 -207095 -57215 121734 62693 108066
15943 108066 -96538 -41370 -5007 -146000 -184045 -44465 77811 273338 193506 287756
15933 287756 301895 104117 -14026 -38315 -14525 110544 223772 43348 -111921 -177140
15923 -177140 -182743 -204008 -460540 -471267 -284910 29154 153185 78294 132831 132872 -176149
15912 -176149 -199181 58173 248826 203721 29218 -79774 -314513 -376593 -337208 -283908
15902 -283908 -274504 -196717 -293730 -290259 -279503 -209465 -181841 -5150 138084 68502 54618
15891 54618 100744 297503 317127 87041 -144513 -186911 -2492 245304 241901 161203 172270
15880 172270 189276 103723 83149 -28294 -50755 -103704 -352094 -461063 -605560 -515918 -323301
15869 -323301 -206915 -92942 -191377 -234910 -213271 -70125 -15795 -23471 7307 -41905 -117742
15858 -117742 12933 120746 210855 188934 197029 233033 184520 23924 184421 302474 350565
15847 350565 283976 116870 46168 -70598 -137265 -22571 -18388 -182346 -261812 -317754 -333538
15836 -333538 -177087 -221188 -143695 -129458 -205522 -102676 28886 50636 63079 82068 139680
15825 139680 -62844 -119782 -123177 -32735 114069 -137401 -255592 -79760 140660 179160
15815 179160 193237 108758 301119 256748 49868 -74997 -72531 -104498 39380 298229 330759
15804 330759 243271 83716 109966 193848 166625 203887 398144 472159 217661 55335 31737
15793 31737 -37619 -96810 -241478 -359118 -209370 74875 191018 249952 219327 71836
15783 71836 171436 212562 146081 218133 185598 66287 90254 67234 -147431 -269869 -253685
15772 -253685 -279879 -298340 -260726 -172529 55260 113055 -1905 -311 -2440 -21048 72952
15761 72952 201671 219224 80380 25180 164067 244604 65368 -166400 -270952 -18619
15751 -18619 14179 -25288 -90888 52743 69109 -150106 -525367 -642330 -297063 -20791
15741 -20791 4875 12770 -1219 -167019 -375402 -322878 -165414 -200599 -350829 -307652 -252749
15730 -252749 -192802 -236821 -142031 -152484 -164383 -140722 -190562 -167719 9237 211712 21164
15719 21164 32077 27758 -180321 -406905 -478851 -219796 -89089 -226930 -211636 -54705 -33287
15708 -33287 22688 -85649 -183875 -143821 -126857 -117949 -204843 -273321 -132199 -63150 31953
15697 31953 37210 -14630 173029 226733 256661 70304 180887 322894 310654 153594 -41008
15686 -41008 -648 19990 -42574 88854 161201 171618 347447 253890 197293 304770 425298
15675 425298 299058 247471 310807 75705 -63132 -67292 -22545 79464 323599 338074 350289
15664 350289 244200 226145 335759 453797 271559 94614 -31090 52876 40829 119457
15654 119457 203506 274679 82537 -194771 -213196 -186173 -75023 101038 149201 -24171
15644 -24171 -61223 -236006 -291112 -254671 -209079 -335675 -271525 -145279 -184090 -88856 -210888
15633 -210888 -208615 -21853 248029 272379 133615 150494 -27755 -139869 -173306 -330341
15623 -330341 -421461 -599825 -567955 -328692 -141499 -33257 343428 279448 59128 -28920
15613 -28920 -200109 -48082 18607 -90757 6049 101444 38600 43772 -155682 -251331 -236741
15602 -236741 -298803 -216499 -242154 -308854 -308311 -241210 -108468 -73911 -181097 -162125 -121563
15591 -121563 22856 73406 51550 156293 165367 116182 -12105 -160990 -192051 -129333 -150631
15580 -150631 -196288 -194405 -126602 -16675 192497 122677 135541 246694 385779 273653 129115
15569 129115 55599 8645 -161985 26202 109860 169308 285240 216072 -60563 -156823 -145564
15558 -145564 46672 248006 359528 273305 329185 201288 69183 -71095 -35833 -14399
15548 -14399 -43565 -86153 55400 136272 184001 -67097 -179018 -107073 -23993 -67236 -123372
15537 -123372 -227110 -296622 13996 270273 113712 93279 154282 59928 -69282 -120329
15527 -120329 30790 67949 -5027 -156372 -260676 -230039 -15878 -25051 -107448 -39835 -130410
15516 -130410 -93427 -104868 -175675 60115 142518 126380 -12978 -65022 18697 77279 32696
15505 32696 -92454 -155613 -19343 76302 42310 102693 6038 -177305 -168807 -293361 -244190
15494 -244190 -246365 -267800 -136675 -149684 -306350 -369693 -234346 -120171 -97584 -7605 38941
15483 38941 111336 166366 206270 280376 311392 342006 320016 248957 59699 -38761 -110512
15472 -110512 -232700 -265914 -175866 74812 116508 82521 121835 254935 100709 -57499
15462 -57499 -81292 23114 95348 46262 32194 -135892 -290399 -205811 -187516 -111368 27569
15451 27569 97505 65144 125320 163521 -23103 -311736 -299621 -429731 -295056 -192096 -275072
15440 -275072 -334957 -313993 -217986 -117904 -6011 -20598 -65709 -132457 -82006 -62387 168408
15429 168408 210873 160032 110959 82121 137258 145529 181265 213541 142313 64753 -97695
15418 -97695 -242909 -196061 -192001 -347664 -299389 -114301 -71577 -54141 -35509 66379 77268
15407 77268 143955 12661 -123447 -1236 75386 -254 -137843 -237925 -130108 -150466
15397 -150466 -214684 -304007 -304951 -114383 56652 -34935 -159498 -112662 -186984 -210933 -245356
15386 -245356 -174451 -211323 -108423 50232 51184 -106060 -304176 -466848 -201507 -59319
15376 -59319 -173534 -102787 120297 261897 353665 249468 206529 257265 84918 -17852
15366 -17852 -54401 28243 -26935 -1060 178011 207356 49008 91135 173718 160859 249319
15355 249319 140138 -2242 -90458 -127975 -131129 -40824 32507 43195 -20161 -3075 -50869
15344 -50869 8324 46928 -14518 -11486 -40073 -112051 -36840 36536 204018 280731 169114
15333 169114 30143 41692 50470 -44056 75226 117080 160512 21605 -145673 -170432 -113202
15322 -113202 -108090 -37150 714 34425 31774 -51120 -126566 -85875 -60549 -42582 90159 43399
15310 43399 -51 88989 39375 -34854 -69973 80042 75710 -26753 -78260 -87617 -105403 68801
15298 68801 28375 -32348 -36424 -106076 -262307 -413525 -119731 86959 16320 7283 -3639
15287 -3639 -28101 95935 305531 543401 480312 423442 255469 209091 211355 102190 38468
15276 38468 282804 319111 243802 157126 59153 65329 178962 241949 233500 144263 51550 101961
15264 101961 185613 210449 224496 238033 176028 180643 242084 269731 55062 -62217 -20894
15253 -20894 126099 224949 165109 67374 -105652 -184731 -51295 -236013 -287801 -8169 22024
15242 22024 -161435 -141935 -122523 -16646 1520 -24344 -140547 -146786 -76096 35585 85133
15231 85133 105064 84359 47144 42463 -63223 -201676 -154198 -77121 -81417 -33087 115392
15220 115392 83078 -17039 42127 6728 -29471 -88811 -156686 -206593 -226805 -228051 -283049
15209 -283049 -116820 84267 90754 54724 7580 14597 -35020 -125735 -85940 -121830 -53032
15198 -53032 12668 -41335 -74784 -117056 -173862 -41567 -22938 32759 -99261 -321827 -234242
15187 -234242 -294971 -309007 -213083 -280090 -280766 -115819 -93204 8773 90742 1322 2588 177117
15175 177117 179967 105460 96764 20359 -125355 -194615 -274268 -278722 -195173 -152777 -89441 -235327
15163 -235327 -404706 -462474 -368186 -199707 -220196 -153724 -15984 65162 267806 260257 220336
15152 220336 146486 160161 117899 -92612 -22626 30723 -70399 -83382 -46394 -96935 63524
15141 63524 166871 140335 158893 121897 50171 105318 109123 87613 81174 -17193 -74320 65543
15129 65543 203688 115293 133458 319804 316527 327182 211362 201428 269137 228421 125513
15118 125513 29446 131597 115260 41525 151751 124260 -56693 -22570 65071 14891 -58787
15107 -58787 -140114 -110794 -11676 84318 144383 178786 175225 249992 345086 235074 334845 359927
15095 359927 229471 -12565 24366 59233 19356 -130159 -102509 -113889 42097 168445
15085 168445 235294 123195 -133726 -81430 -21167 -57013 61098 122556 219593 297488 411066
15074 411066 559703 620854 545853 715430 844439 880623 1068069 1482469 1692723 1497364
15064 1497364 1193073 1204315 1244407 1187827 1389873 1555720 1310618 1153020 828206 703374
15054 703374 826186 797898 539701 540542 532517 475848 454287 312722 197424 270607 45761
15043 45761 61224 219075 263941 75855 34129 37449 22319 237192 376116 239187 288463
15032 288463 382285 407035 377529 424563 401131 263579 174913 254080 301284 340835 378120
15021 378120 550815 531638 347719 343543 469426 434904 237306 214682 142707 -56486 3818
15010 3818 189529 390946 419185 373976 251096 293235 202181 76128 126656 303476 356863
14999 356863 308603 272062 277921 260040 349010 388811 253390 204523 48307 94905 199530
14988 199530 147586 137115 72882 159752 11198 -49337 35850 190132 105978 36638 135061
14977 135061 111482 199532 177934 36998 129374 -17117 76201 126625 54115 82684 177704
14966 177704 83411 241 -46082 -435 241033 303930 201415 199939 295369 262676 251935
14955 251935 192555 69153 -117779 -130099 34287 200769 229555 -120093 -138578 -177348
14945 -177348 -31257 36503 -32733 -198214 -368783 -342614 -283462 -264108 -263790 -78818 -77380
14934 -77380 35544 8234 14106 -26229 127028 38912 -196414 -341335 -169716 42370 100646
14923 100646 166310 -35800 -93751 -67910 -88886 -142090 -154812 -162254 -108600 -64229 -68974 -163887
14911 -163887 -134255 99160 156644 121504 -23651 -4402 112633 187317 86221 -23437
14901 -23437 -179 15344 12019 104824 -28997 -131601 -110798 -80252 -80280 76489 142023 40349
14889 40349 -48835 69482 311989 367168 430518 423164 390442 271935 273643 141554 172209
14878 172209 358385 233405 171410 121263 132837 77184 149312 104990 83994 49487 -46963
14867 -46963 -69572 -44229 18673 -7257 175358 195549 254790 277059 358040 304478 235965
14856 235965 206917 137891 162913 126695 54135 97465 214142 207222 239200 190892 315920
14845 315920 374121 461126 718674 735277 435058 189295 73618 175913 249889 145472
14835 145472 164437 59574 23738 229149 331766 188677 94229 8560 -14441 137719
14825 137719 314702 298892 172755 50293 -36492 1854 51312 69435 -6342 -48786 80494
14814 80494 70950 154100 217857 166535 194453 261586 190451 66284 163016 96290 -19518
14803 -19518 71749 171658 216999 207696 178108 90615 141498 94558 212620 193939 205991 35953
14791 35953 -187839 -196226 -195569 -66808 20099 50070 100019 121786 -36019 -28971 -15275 114545
14779 114545 123421 37684 2021 -75198 -208792 -226739 -173687 -152932 -15544 326612 387707
14768 387707 149998 -24367 18715 -127677 -131063 -24461 123426 318800 381124 152974
14758 152974 -180056 -140922 41622 81760 -48997 5658 206437 222932 -6020 -67555
14748 -67555 -156339 -71554 25865 -27687 77049 110833 32423 173179 369173 255454 -18463
14737 -18463 -71173 56488 60779 23158 56447 120790 246931 439576 514407 377892 255546
14726 255546 367472 549227 551583 585154 700899 774335 760920 755840 522103 380416 289558
14715 289558 176805 263463 326645 390889 500913 316607 293063 336586 330429 211757 278297
14704 278297 216716 75567 23699 27544 82813 191917 335467 428479 378709 191540 78698
14693 78698 76232 197099 302545 356790 397930 436623 333829 234494 165122 267134 294185
14682 294185 260133 211311 182744 263277 377635 236259 83427 75360 238358 286128 228009
14671 228009 169760 106942 114261 109990 153166 211445 287617 385960 278594 153068 182082
14660 182082 277780 297808 316734 268289 207417 184490 226743 243497 524399 605966 535872
14649 535872 352143 458812 657959 722721 808032 831223 676735 646137 888936 1021212
14639 1021212 916638 997943 1211399 1259719 1223563 1069263 1142639 1313000 1455786 1388126
14629 1388126 1527698 1618735 1701545 2146878 2568500 2706684 2862775 3100697 3478839 3763932
14619 3763932 3984540 4335875 4892371 5515820 6062560 6776193 7929133 9507523 11357506
14610 11357506 13819424 17020733 21672794 28688543 38876212 53505383 73768348 98561088
14602 98561088 122178434 137362780 154535262 188068120 235434219 275237985 270884847
14595 270884847 241932762 238439003 260745826 282569805 263265930 207262034 167812867
14588 167812867 151463929 144033338 129339898 103769367 81461596 67261866 58609312
14581 58609312 52878541 48528667 44902937 41837511 39491961 37340705 35571495 34168061
14573 34168061 32730678 31424127 30272611 29277107 28277164 27297019 26259179 25493760 24620299
14564 24620299 23743679 23010917 22437846 21894994 21271045 20383749 19640538 19254145 18885424
14555 18885424 18331767 17777235 17313553 16912517 16465986 16003419 15510121 15106287 14654640
14546 14654640 14320526 13814399 13544019 13276030 12865568 12663450 12399519 11869213 11599466
14537 11599466 11335309 11161910 11081545 10946018 10491260 10147533 9755058 9562335 9432939
14528 9432939 9329290 9268085 9107314 8913033 8799673 8747287 8570190 8488113 8379536 8074772
14518 8074772 7776964 7491656 7438341 7447253 7465540 7326387 7051997 6795770 6793508 6653487
14508 6653487 6505253 6370459 6324519 6104879 5916415 5985647 6003484 5943201 5897506 5735281
14498 5735281 5567687 5314813 5344445 5177264 4932454 4858124 4945762 4832744 4566178 4435156
14488 4435156 4422035 4332518 4247404 4106835 3978791 4031218 4058707 4026234 4023702 3887928 3700095
14477 3700095 3621999 3682973 3634970 3608305 3645631 3565398 3408920 3171918 2920214 2963576 2874629
14466 2874629 2904784 2856500 2888730 2864965 2669087 2554668 2701079 2658762 2510630 2420227
14456 2420227 2305959 2378546 2438107 2356425 2314874 2321554 2164422 2037735 2076502 2188892 2090276
14445 2090276 1981389 2044079 1873166 1695986 1854693 1923376 1861988 1914802 1908755 1863318 1713369
14434 1713369 1745996 1894906 1983783 1916869 1921242 1886062 1692148 1382045 1337851 1307316 1228438
14423 1228438 1188979 1232254 1254325 1290792 1369976 1335395 1259124 1196237 1162218 1216516 1227194
14412 1227194 1162614 1138530 1252358 1298359 1224580 1296242 1160554 1065645 1064218 960575 885336
14401 885336 722700 866314 866332 759471 770216 682427 696425 792485 1014855 1146523 1007964
14390 1007964 868708 947035 995294 847927 902254 965256 818506 920823 1032305 941089
14380 941089 965685 1054975 1113743 1185124 1174580 1171711 1049651 846445 744008 896201 969196
14369 969196 1005052 972283 784197 617009 564174 435068 364329 475614 579018 579442 742160
14358 742160 700921 732967 822741 870411 815929 742152 564790 407722 259923 297107 643201
14347 643201 691638 616469 615959 618467 444722 365150 340342 302469 434852 422332 394587 524457
14335 524457 601945 712075 502505 236328 354802 504727 479132 349868 300859 264786
14325 264786 222917 319976 468745 373277 217050 173868 173802 138929 192291 221964 156841 155088
14313 155088 165580 145296 68010 -60644 122429 246426 331786 280758 407263 490346 434480
14302 434480 205293 127181 46750 87494 212018 159698 99941 141278 105138 243567 435567
14291 435567 458809 452862 384113 363962 435615 218192 8183 113758 337768 415298 374545
14280 374545 320064 429090 448371 490575 641991 549805 334155 316516 233008 88220 57801
14269 57801 220382 440454 549902 603832 552476 498362 331809 297285 364425 384038 530446
14258 530446 397313 276890 327378 289373 188797 247464 163048 398827 632062 646563
14248 646563 282229 239826 259297 166898 35824 83038 214559 185560 202337 55768 -109133
14237 -109133 -127553 32709 15185 -34237 -21015 100925 172194 131448 57800 -284 -170315
14226 -170315 -133383 100061 59262 -21798 46736 335844 514444 303972 99680 -70674
14216 -70674 32010 249980 201588 422905 647726 470031 381852 406227 361604 336182 274932
14205 274932 334877 337360 256721 329570 307803 134589 158570 241504 242176 304890 329892 264882
14193 264882 135273 66018 15426 62800 293960 428111 423886 340540 340493 258388 274089 314938
14181 314938 198560 151733 210746 125754 -16958 -36050 226746 300748 399799 328609 121021
14170 121021 -26995 26199 264320 452299 395458 269316 216479 232143 284252 257401 277596
14159 277596 255088 236796 232933 145119 126958 264856 268124 155716 81317 72303 11049 94026
14147 94026 188796 159595 242265 225921 133061 105291 57366 147383 295846 257508 285534
14136 285534 213965 164658 286599 407054 486147 515383 543768 699619 778323 915175 1019453
14125 1019453 1044582 1357760 1680426 1754410 1626577 1298111 1190973 1251603 1298298 1061587
14115 1061587 871026 890510 774409 661440 573720 496026 345485 329533 318553 177769
14105 177769 67523 193028 411954 501695 552071 482648 368972 454153 432549 444816 361837
14094 361837 122770 113416 223331 204163 118789 211217 243627 142981 42405 59865 305421
14083 305421 314903 289159 235986 195295 120509 107635 150895 49059 60744 157055 239098
14072 239098 350413 257168 130006 95726 141175 369975 492890 362892 291676 161571
14062 161571 177620 165277 31747 134425 141542 163306 127886 70425 124385 136856 196119
14051 196119 181373 185461 222715 81101 -111404 -284873 -242449 -191154 -193990 -265563 -141239
14040 -141239 55342 139033 116068 36321 -12732 34656 6405 -97664 -129347 14042 27177
14029 27177 169842 208039 -17706 17328 114662 80850 44600 -90756 -203352 -192260 -214780
14018 -214780 -138896 -118710 -137265 -344196 -383107 -100067 114419 206245 59763 -137401
14008 -137401 18216 282393 319106 378098 424553 358919 316422 407324 431988 511407 690955
13997 690955 741654 598186 373765 483817 519957 506360 500259 549394 614449 608248 537981
13986 537981 435562 284819 97542 -185073 -125162 41863 259782 233278 269485 401340
13976 401340 364957 106318 54149 22098 9069 72827 224357 239058 177240 194125 128554
13965 128554 211016 48550 -31309 156489 74357 -30183 107027 101113 16080 -60056 -136676
13954 -136676 10556 -32743 -241400 -300200 -187326 -60935 45443 211142 161407 152845
13944 152845 -10183 -20195 -255294 -277569 -310877 -231333 -201552 -77940 12535 10967 24354
13933 24354 -110558 -146643 -322033 -353253 -228684 -215328 -143858 -22306 31310 44704 -196595
13922 -196595 -167717 -84816 -146073 -134704 -69166 -23598 -68392 185003 327020 214972 66439
13911 66439 193169 230178 192972 77533 92341 -15524 -57757 -4388 104326 68079 78593
13900 78593 200034 364103 391262 275179 91808 -81196 -73639 -69051 -130083 -121587 -78399
13889 -78399 -6148 -89689 -207835 -174779 -97621 -123694 902 93095 -22845 -118994 1651
13878 1651 95589 255176 335954 157350 148973 163227 114107 -86005 -269834 -299198 -158179
13867 -158179 -14800 237345 225639 334419 206392 275784 225571 223649 322363 233075 136787
13856 136787 111552 74121 -9948 175929 161189 35216 -27319 -194559 60569 145219 15493
13845 15493 -56961 -41364 26944 107484 51494 -3937 56889 209226 193614 268307 288278
13834 288278 191918 95881 -210029 -165015 -55174 87085 36445 -205443 -225487 -1496
13824 -1496 -29569 -52319 -193902 -207244 -30685 74293 -10063 245662 470325 391417 242532
13813 242532 268576 199250 145698 198226 248166 214941 4129 -110161 -53626 89569 41697
13802 41697 3102 27122 -240145 -270730 -102154 96877 24556 -131732 -46061 4333 67648
13791 67648 70835 -16687 -117544 -167920 -144521 -128730 -210370 -197592 -187127 -31508 10279
13780 10279 -115067 -93454 46145 57214 11669 48175 84798 155456 209124 166798 162095
13769 162095 90035 -18128 -92258 -56695 -174775 -226192 -182733 -159815 -55080 -153855 -257669
13758 -257669 -199675 40061 17446 -102997 -101153 -150922 -119569 -83595 17457 86512 84952
13747 84952 -10649 -50125 -16812 71477 231106 169040 188877 180958 90006 26940 35077 58818
13735 58818 75970 165896 249057 144161 184807 119215 -44677 126189 125643 89522 -12748
13724 -12748 -138015 -154549 -122100 -119373 95635 217645 347498 332359 176232 148272 176790
13713 176790 83777 289682 376268 311617 400329 476264 527913 314216 206559 217420 166648
13702 166648 348048 441113 364467 307887 415267 441390 402399 340029 277632 191090 56859
13691 56859 13894 -69975 -99556 -110673 -35755 93421 244700 257154 76464 -41479 -28847
13680 -28847 228836 488698 666558 564803 423859 266721 141661 118421 66944 -44987
13670 -44987 -50917 64394 -196741 -249751 -10762 36345 37534 54433 180816 120191 56036
13659 56036 190630 204816 57090 15107 7492 12526 101710 142244 197917 73145 112765
13648 112765 29697 -12709 27807 -58134 -243984 -131376 -86886 -73219 -97179 -88161 -232140
13637 -232140 -132747 -69117 187797 305176 158945 65516 84555 57397 109370 83534 -94948
13626 -94948 -72394 47075 41495 -34779 35218 -1907 -26241 47974 164896 40324 -133323
13615 -133323 -103983 -44049 -91121 -77142 125407 95882 77150 146335 160335 32144 -108361
13604 -108361 -119329 16716 46625 181570 94313 131870 155006 226811 288519 273801 154957
13593 154957 151795 174462 19788 -13742 -22254 -180678 -278163 -182157 -38226 -59390 47876
13582 47876 198983 149387 205369 103650 24891 -9708 130508 206877 134595 43905 112940
13571 112940 119626 -5594 -7756 -56420 -47010 -98900 -107799 -43102 41716 -2155 -217570 -315404
13559 -315404 -158953 -116459 -41201 128885 126787 121649 267491 276647 171393 -77100 -191066
13548 -191066 -7702 -55749 -209420 -130471 3478 -23498 -166170 -67610 -56939 -86083 -614
13537 -614 109552 51102 87406 21112 3027 -173644 -277500 -156160 -49807 -152630 -86795
13526 -86795 -34101 63906 18853 -140292 -229723 -24006 83590 51712 -20375 -81898 -118482
13515 -118482 -135693 -85022 33376 9093 44488 14748 181851 282871 238453 223122 171217
13504 171217 -47494 -179776 -193988 -53067 37292 -52392 40865 49873 5624 -46258 -338998
13493 -338998 -433146 -216370 -177650 -74384 -13121 -65908 -173923 -167919 -127364 -107908 6883
13482 6883 -86787 38738 133111 15283 -37019 -100100 -98538 -116062 -102183 114612 67961
13471 67961 -125730 -117729 -46348 -88268 -181733 -78007 -91334 -75683 31376 -20246 -50853
13460 -50853 -131373 -229682 -296522 -163414 -29410 -102413 -109981 73715 171440 87649 274786
13449 274786 254065 75741 149243 -45402 -121300 49811 -68305 -163484 -103547 14981
13439 14981 76038 -10572 -283236 -264326 -52204 64009 194924 193028 -17755 -172816 16495
13428 16495 179727 5635 -29297 9774 -47666 57231 33118 31497 94892 159237 55050
13417 55050 -15192 -168732 -179536 -17358 129778 207427 182021 106604 104332 303066 364811
13406 364811 157837 -10721 8339 -48128 -67248 -15347 -158423 -326060 -178022 -98341
13396 -98341 -227671 -129593 -143097 -249201 -302497 -265430 -10767 103426 57168 -74832 -101862
13385 -101862 -127356 -77806 -53398 26339 165063 162108 197714 81184 69347 126985 84550
13374 84550 -60093 -60319 -14717 -45064 -112114 -30543 91464 45384 -13198 -110412 -286689
13363 -286689 -320110 -129578 22081 153980 134312 95165 22353 29128 240501 217790 133873
13352 133873 2596 4486 -110899 -205898 -259317 -294677 -138635 4769 5984 -169747 -330187
13341 -330187 -268456 -64588 -120042 -30492 123969 80305 -54199 -102070 -71895 -10347 -102376
13330 -102376 -205391 -92083 -171150 -235633 -182921 -206141 -95931 94333 10190 -71077 -179075
13319 -179075 -215889 -20646 111774 10958 -109397 -77391 20472 -44842 4569 14113 30614
13308 30614 54389 -121045 -199376 -180914 -324056 -418666 -286643 -139533 -229912 -111468 14373
13297 14373 22257 -237382 -402243 -230154 -128446 -46885 -74418 8527 -41961 -120078 -197849
13286 -197849 -245375 -259190 -142825 -70596 23788 120866 180712 12637 -119794 -146195 -347213
13275 -347213 -448472 -109695 58887 79463 85368 49205 133176 61538 168694 187635 83668
13264 83668 -19628 -308039 -310231 -143601 -8832 158972 75456 64699 233814 166926 286701
13253 286701 264316 323796 142393 138767 83261 213767 -4333 -139525 -163567 -216014 -120130
13242 -120130 11451 -86125 -214663 -171618 39094 -108254 -16550 -180171 -356828 -327367
13232 -327367 -99029 -19882 74361 26660 -166332 -272775 -215588 -222149 -329143 -490109 -316306
13221 -316306 -235287 -75569 175644 117480 -99112 -242323 -99376 1770 27546 184290
13211 184290 212033 63572 92175 101632 50901 111618 122371 15014 -83005 -86140 -23938
13200 -23938 -74392 -116659 -65995 -117652 -203210 -73325 102124 194343 133469 -42573 -184959
13189 -184959 -300738 -226560 -217904 -106582 -187053 -310022 -394928 -338719 -311045 -220385 -123630
13178 -123630 -148480 -100193 -68465 -40488 -155928 -231716 -211149 -157382 -33098 -62591 -9277
13167 -9277 25791 26933 -127958 -99339 -190357 -325864 -112744 35159 7924 -27313 20190
13156 20190 228577 170334 7645 38792 101406 112140 198555 309660 400373 270125 107287
13145 107287 -90177 25783 177876 22879 59238 15493 73744 32959 82441 180397 172714
13134 172714 115668 149456 137472 260435 216004 -33989 -145515 -104535 -136359 -51518 -37596
13123 -37596 109041 27504 -47824 -23257 66829 351627 253533 64359 22856 116504 124449
13112 124449 -3231 38444 96288 61860 120680 120907 -13077 -92101 10256 172259 144947
13101 144947 193775 -128502 -209476 -17784 199500 263517 353089 404549 352090 167218 -33728
13090 -33728 -113980 88237 195916 96858 -97333 -180578 -99370 69785 108664 90079 3020
13079 3020 85888 82604 83223 273697 53542 -211944 -112979 -38058 -137520 -25878 80956
13068 80956 60071 -1654 -48179 135658 265100 157013 -10176 -180692 -62950 58313
13058 58313 66395 97420 231248 165829 104166 -52332 -60635 172601 199031 129220 24311
13047 24311 111384 215433 214029 53904 82592 94276 31971 60555 -13077 98021 186406
13036 186406 96580 -145004 -75298 -84544 -66163 31292 -23151 -56721 -122064 90404 284206
13025 284206 355833 131236 49784 268980 446225 141247 54483 43876 -127254 -188628
13015 -188628 -159769 -120297 -145807 -149122 -158631 -191852 -94464 86695 92715 -194576 -237193 -146057
13003 -146057 -165098 -213604 -105888 -56532 -110422 -101862 -142815 -30897 110423 136673 128008
12992 128008 107480 56374 -105553 7496 225859 254982 145429 198182 208159 185962 146945
12981 146945 172822 5058 -70561 -40679 119148 114123 45284 -7382 44647 121706 29922
12970 29922 -75167 -77340 -17522 54847 128517 146269 -30196 -48579 -61887 -100061 -86570
12959 -86570 -31987 50371 101056 -56506 -245913 -301340 -387938 -426052 -311216 -306875 -295568
12948 -295568 -261632 -160011 -165016 -276387 -268804 -165883 -128887 -60549 16123 -62155 -69913
12937 -69913 171610 280139 135269 252502 192411 16810 -22660 4663 -65621 -4404 35826
12926 35826 148759 153681 -67692 -122229 -41014 24822 -84326 -143817 -168914 -237657 -263129
12915 -263129 -256594 -282771 -307829 -152944 -170494 -353169 -374939 -441677 -380399 -284924 -196584
12904 -196584 -197837 -194700 -134819 -166174 -175464 -69421 -145247 -237825 -156024 -256765 -406417
12893 -406417 -350154 -118573 -89096 -153369 -185519 -284624 -156057 -234674 -291215 -299130 -343051
12882 -343051 -212907 -124707 -137513 -161695 -99620 9345 -54243 -134829 -10213 1590 -140544
12871 -140544 -342541 -370518 -286108 -120630 29079 91370 144247 2979 -126680 -193821
12861 -193821 -138157 -149263 -220158 -293856 -106675 40580 -80762 -206171 -106913 -141604 -338924
12850 -338924 -98941 101663 34621 -136901 -239780 -115730 -141456 -67590 11764 -61979
12840 -61979 39492 134577 246027 161717 -74079 -161849 -198407 -85551 40141 98477 54360
12829 54360 -9538 -141966 -196647 -191667 -86811 -34153 -34203 -135031 -84411 -118502 -324931 -331497
12817 -331497 -280005 611 39139 -24506 -171158 -185195 -161277 -127925 35300 -1155 118263
12806 118263 178763 9224 -30298 17917 56171 15253 119857 116450 185067 152863 221121
12795 221121 185855 -54194 -89976 -197590 -342816 -258682 13133 128893 69857 -67179
12785 -67179 -34918 95015 145376 52769 -39670 -91151 -70671 -25042 35631 187477 92174
12774 92174 -201161 -317250 -206590 -52136 33823 146139 40188 -123599 -3443 25312
12764 25312 -9520 161771 223903 50836 106285 207323 146862 54877 126169 182575 153014
12753 153014 21061 79975 65989 6932 5490 181139 309257 296936 62338 -76743 -29805
12742 -29805 -63937 -169777 -68402 33668 211238 286177 205623 50804 156532 305447
12732 305447 383982 333770 200614 185949 -82597 -105088 -10688 -107602 -82861 19892 -29676
12721 -29676 -19561 41751 179240 321435 120099 57416 -6745 -98551 91962 287315 251055
12710 251055 96158 153161 70546 -18500 145462 414957 240333 83387 96965 187142
12700 187142 52035 -151531 -207717 -322203 -331432 -185205 39855 -3474 -53450 -96005 -189634
12689 -189634 -85454 10598 45631 101685 108115 143364 90109 -11093 -50140 -107228 -34562
12678 -34562 40096 64323 171431 215320 211029 96835 -136370 -129191 101591 243840 251163
12667 251163 134203 -180687 -142934 -181340 -144526 -60646 -230402 -171238 -286704 -591000
12657 -591000 -520621 -274489 -173540 -8043 -44712 34597 4606 -100023 -109367 11680 254357
12646 254357 271583 124745 91757 74142 136800 212346 64171 -144302 -103557 -86135 -197001
12635 -197001 -35289 50100 44340 -49238 64096 226414 -33233 -112125 84686 124899 210618
12624 210618 159947 41791 136303 214541 167153 150886 91114 50209 82346 120598 80165
12613 80165 90674 131479 302504 261487 89063 -42145 -98357 194641 186924 -74575 -226448
12602 -226448 -440609 -344250 -193389 87885 197632 175130 18937 72388 40985 48741 -76499
12591 -76499 -151434 -126333 -118373 -187843 -161899 -13747 -59904 -124917 -207097 -326078 -249588
12580 -249588 -203128 -127545 -118495 -75629 -87420 -135282 -200724 -182044 -171894 -170788 -95405 -14352
12568 -14352 -716 -150873 -245445 29755 256212 154738 -86936 -108079 -35340 82977
12558 82977 -46936 -27535 53390 15006 -234020 -118794 158770 278032 246896 257255 278728
12547 278728 109139 122581 69966 18854 47275 -9655 -26546 22273 -65084 -152139 -111959
12536 -111959 -39180 -86249 -14388 78675 104380 99294 121648 295729 238092 325937 218550
12525 218550 118752 37470 -49380 -20327 -72516 -1268 24381 36078 12304 -7400 -13681 -77638
12513 -77638 -78747 -83215 -86544 -27485 -64660 -76794 18243 40815 -121758 13791 161700 220074
12501 220074 229447 155756 168736 42923 39870 214750 38980 -198340 -128450 -88928 48334
12490 48334 231346 50266 -21616 104652 114379 170281 150133 -29758 -104952 -175351 -196839
12479 -196839 -133334 65042 115014 77833 -188708 -444197 -232376 -26812 25556 -60890
12469 -60890 -275638 -288186 -200988 -71656 13037 -4725 -187040 -23097 29937 -17714 -202799
12458 -202799 -173613 -79314 105790 106128 -56711 -103589 -203711 -214442 -237427 -288989 -240605
12447 -240605 -140099 34426 -23867 -181108 -200716 -18418 77829 129099 63304 -35603 20259
12436 20259 30900 83558 234711 367003 244565 191816 164315 -22894 -70537 -123971 -89028
12425 -89028 64668 8699 -56157 46522 116814 136568 321176 219902 175553 143293 39508
12414 39508 -65335 -278073 -268767 -205356 31845 107577 54983 -38097 -265800 -284895 -314564
12403 -314564 -230347 -277848 -225439 -36221 46074 122396 142385 275197 231460 169370 183280
12392 183280 242591 274469 200617 5429 -141149 -24003 84845 199353 76778 59676
12382 59676 82818 -3485 9654 -30527 -73735 25707 -100451 -75970 -75940 -115215 -370498 -420058
12370 -420058 -371845 -414321 -247941 -45623 4263 33597 31466 -34173 -40687 -209906 -232839
12359 -232839 -184043 -171965 -264824 -367681 -250863 -319719 -447939 -253899 -27213 1959
12349 1959 -138231 -199196 -97698 101445 54831 -59971 -55706 -26957 12731 3893 55692
12338 55692 105115 -62857 -88936 -106695 -108386 -62735 -117365 -247661 -190377 -131345 -67135
12327 -67135 -67152 -205143 -480483 -421303 -156407 -85968 -9918 62027 -19162 -45221 107006
12316 107006 314535 352311 336124 244080 248706 254900 283548 254824 214457 119567 190317 233244
12304 233244 149299 138825 88138 -19165 239096 584786 854300 1021741 1216778 1640069
12294 1640069 1893928 1738263 1679821 1984001 2331979 2610373 2321174 1703295 1467510 1513730
12284 1513730 1551336 1464079 1192740 971152 750204 633116 511177 530172 655384 485385
12274 485385 246598 55811 62975 277290 191321 86844 70291 533 52805 110969 76475
12263 76475 279881 439735 396921 413443 324090 198368 158379 285305 312146 254837 211438
12252 211438 333393 277950 143773 89228 151849 220856 300826 345707 241033 206451 248583
12241 248583 219358 110277 93301 30733 -167248 -279784 -170929 -192196 -229592 -77858
12231 -77858 47930 97222 330678 341807 232367 112912 142062 257279 338818 310810 339568
12220 339568 377472 247948 132699 111718 206068 180150 236065 248459 131385 52115 -53225
12209 -53225 65360 -39201 -212203 -263390 -278256 -214935 -188155 -151785 -205622 -256706 -89195
12198 -89195 169051 258337 229439 109407 -52383 -178190 -96548 -123616 -19913 135614
12188 135614 79930 9979 11365 -77027 -163966 -680 165423 248450 211795 190736 210967
12177 210967 214209 62854 -41951 -44570 -93304 -13575 82364 -1710 60812 143248 309782
12166 309782 279583 319700 217765 235745 229903 193153 146645 144089 108288 132763 79560 -53445
12154 -53445 -111476 -240811 -217526 -104844 82452 254573 249706 100512 24084 -65593 -131194
12143 -131194 -75211 208540 71711 16218 -211947 -300443 -174537 -18679 22133 -130563
12133 -130563 -160042 -82652 20700 9393 46657 651 -55774 -131373 -136013 -127698 -65263 -12372
12121 -12372 -57263 -110923 -276607 -46684 -29274 -112295 -210767 -149216 -133091 -158691 -44432
12110 -44432 14180 19646 18639 97275 278963 385732 537404 518487 357996 311287 443897
12099 443897 492908 329278 261959 313524 304502 286328 139853 168348 246226 345837 303707
12088 303707 288077 331453 252151 51845 -11718 178694 358362 473218 275641 203442
12078 203442 53742 -19635 -29025 -3873 86105 224134 327299 328977 305133 201114 118186
12067 118186 178007 175521 236808 167500 153922 110125 142871 21893 44308 104837 206509
12056 206509 315101 252767 251158 294067 92615 -44760 -80236 2664 131116 100315 138071
12045 138071 62955 16605 164410 157063 8480 -246848 -289912 -174050 -8779 -78640 -5090
12034 -5090 36487 50573 -69343 67855 289653 180368 -64280 -114701 -159777 -177774 -93706
12023 -93706 111357 204158 125873 250973 396945 256758 133297 26434 -99870 -176308
12013 -176308 -84515 -136437 -68458 59587 71453 133245 147001 222931 190757 219255 447852
12002 447852 489685 234425 254048 503487 410761 238175 250496 175651 40 -31498 76553
11991 76553 280556 393538 463856 306123 123224 194038 365323 526921 688983 680390
11981 680390 758077 537781 420843 606482 724456 704438 696066 523808 390078 308942
11971 308942 220579 83902 84908 183574 135204 148252 196970 332935 449663 322470 188053
11960 188053 -44719 -177920 -138037 -98349 60857 179342 214557 259921 321430 324269 328713
11949 328713 252402 321296 406077 208558 -43347 -2998 196826 578732 460121 405076
11939 405076 488835 405795 368894 522403 479227 346161 290925 216139 401598 370085 311912
11928 311912 538973 444344 361572 316858 88214 -78730 -85562 89531 383149 641728
11918 641728 565937 481836 369186 393066 547004 483369 596978 655462 686582 598612 522532
11907 522532 590318 564261 530967 516483 482488 523803 565904 679019 915437 1083505 953541
11896 953541 847219 754497 823824 835713 1012591 1312183 1535078 1572383 1557876 1579515 1743530
11885 1743530 1861309 2039929 2269643 2432660 2486956 2759136 2977327 3330992 3902973 4385549
11875 4385549 4686642 5069940 5475057 6079861 6650804 7337458 8410060 9550367 10949074
11866 10949074 12709402 15079052 18157868 22064437 27348216 34735901 45693087 62651701
11858 62651701 88299006 125862963 178522718 243629057 302431515 322126885 327262131
11851 327262131 370913383 451516145 523257030 501307038 399652661 337552085 326374974
11844 326374974 330442773 302437612 231729744 170881051 134390459 112865323 99002455
11837 99002455 88764412 80540389 73873341 68625838 64637339 61115189 58068193 55278307
11829 55278307 52847385 50806928 49069912 47350357 45754877 44387774 43075283 41729904
11821 41729904 40463198 39287587 38055708 36838305 35700958 34624313 33741513 32825790
11813 32825790 31812900 30896705 30162114 29201411 28411536 27516266 26520895 25714092 25140403
11804 25140403 24639957 24077316 23558874 23005300 22439775 22019998 21471042 20849986 20256197
11795 20256197 19837097 19408942 18929569 18383741 18030416 17794343 17291395 17048874 16886968
11786 16886968 16368368 15971334 15695116 15231521 15153601 14679746 14186199 13933776 13733567
11777 13733567 13611091 13610558 13239984 12773434 12533213 12215596 12098114 11830250 11558532 11376053
11767 11376053 11341607 11258165 11037577 10838531 10661629 10442890 10276375 10196409 10071699 9694243
11757 9694243 9322378 9179371 9152693 9131280 9021246 8879173 8655448 8295095 8164081 7913760
11747 7913760 7877892 7770847 7781057 7713678 7618709 7483543 7298823 7165805 7196182 7246603
11737 7246603 7076432 6894955 6734051 6775338 6871730 6729138 6625819 6669389 6646977 6511785
11727 6511785 6311445 6136275 5826371 5633292 5489271 5504916 5267528 4943025 4862828 4771927
11717 4771927 4692585 4630268 4333230 4073135 3883826 3987819 4081016 3962004 3853786 3830801
11707 3830801 3844521 3622565 3405214 3397214 3419361 3272301 3225774 3063087 3040379 3026844 2891125
11696 2891125 2864910 3006282 2986030 2969285 2914615 2908042 2805763 2822715 2752584 2714041 2975277
11685 2975277 2899216 2834183 2865663 2852173 2955903 2835305 2599581 2566249 2644905 2709504 2513686
11674 2513686 2249090 2305920 2415981 2423776 2260014 2158048 2036143 2101160 2135051 2132886 2039147
11663 2039147 2007575 2144974 2172801 2319180 2207992 1979953 1699464 1547430 1614447 1705987
11653 1705987 1626144 1544430 1601809 1671251 1496354 1579440 1626444 1622807 1475878 1307416 1483628
11642 1483628 1702661 1540802 1374414 1202383 1256367 1242858 1307150 1352835 1474277 1349306
11632 1349306 1369067 1500069 1362999 1342580 1416357 1366661 1046571 922525 990549 1016234
11622 1016234 1113060 1023268 1010994 1014972 967851 907819 970686 946115 1082935 1174942 992402
11611 992402 965581 871189 787831 923176 803786 660861 735058 786600 862848 1011681 1112546
11600 1112546 1127553 1121282 990433 787085 890185 959959 1034806 951359 860014 815477 788435
11589 788435 728080 675135 727045 686808 587808 510859 463966 516037 712636 645314 473561
11578 473561 379113 390031 347960 316056 378568 396843 386019 440011 261107 198932 219447
11567 219447 154263 130222 328148 504185 646371 685263 741993 717749 672532 636742 562929
11556 562929 502571 568164 601387 619759 556795 475577 433756 457650 357055 334208 384330
11545 384330 340520 332775 323958 174728 293792 501620 441454 191809 98560 166435 212556
11534 212556 326629 538192 495345 335043 406698 405606 459453 581627 427816 222945
11524 222945 247240 257118 271086 335109 407537 337190 339523 400271 498059 342427 309669 501658
11512 501658 651657 472387 362079 236261 158655 155245 189566 218838 276410 418227 407509
11501 407509 116150 95949 116969 70290 221840 273212 212482 115704 160528 240215 211906
11490 211906 309930 361719 388582 440921 312059 265663 289302 310040 333182 340852 245164
11479 245164 154862 378022 465151 458750 315095 326455 311863 316410 339786 353526 212844
11468 212844 91548 16499 85298 148054 63294 27195 -96261 -331818 7630 281138
11458 281138 126578 -73671 7002 202629 226942 156660 146196 385850 389720 305175 139737
11447 139737 40103 92269 61433 11065 24219 11796 87176 57300 49114 174249 186198
11436 186198 129739 180028 317052 301248 221672 218349 85095 74091 -2765 -13264 61322
11425 61322 210799 108786 124762 60090 -8656 -34196 -207609 -201238 -85884 -20744 19812
11414 19812 218646 262246 371957 466163 824333 1363735 1705319 1962731 2038537 2146404
11404 2146404 2313977 2669768 2921508 2392274 1840981 1741119 1776276 1648437 1510481 1175809
11394 1175809 961703 912390 809379 807915 679251 467210 497003 434749 474344 377024 340579
11383 340579 419889 423967 375786 306717 390055 483155 545016 665957 564705 461488 309832
11372 309832 213735 88863 93400 32557 274987 382149 353252 434092 383200 345740 228649
11361 228649 211188 58685 -123104 23797 190880 248453 312564 394925 518424 382464
11351 382464 224980 69458 111283 179941 156983 315227 284792 177916 242287 281948 184051
11340 184051 309616 468711 422133 90551 -25090 45170 -103745 16290 192695 252401
11330 252401 162154 175309 308784 226693 -18400 -35289 121383 265512 234244 345771
11320 345771 204947 44906 50827 134196 148730 85046 28922 -6375 -56510 -15900 -111782
11309 -111782 -196460 -78481 3615 -146941 -166126 -116334 -53374 -92654 -111079 -54820 -32773
11298 -32773 79888 52488 123910 183722 412614 432975 313011 185864 79829 129019 136748
11287 136748 151474 62668 159115 85471 -125780 -132372 -58254 -51918 -236772 -306056 -353025
11276 -353025 -241789 47535 249222 262548 173943 172198 249929 -60662 -151138 -160276 -35204
11265 -35204 96773 53469 55309 113695 21857 -87943 130682 79033 53307 90287 -68038
11254 -68038 -223723 -87323 -79655 -156877 -104908 75039 268981 223060 201155 400320 324988
11243 324988 166964 -18199 80063 226700 186257 84470 34955 -62537 -63374 -72160 -135533
11232 -135533 -131683 2412 131875 252590 119899 163133 279718 292748 250542 208134 237381
11221 237381 169444 151686 91154 178325 179175 77134 55962 185140 118062 57344 59712 247099
11209 247099 269174 139787 149565 76074 274518 206362 81734 121845 40941 40138 205368
11198 205368 166067 154795 205466 335020 361276 340517 250632 181388 107865 121650 89567
11187 89567 24507 -127029 -292786 -523029 -475073 -263009 38709 209761 286495 72047
11177 72047 -94542 -140448 16452 161122 85555 -80110 -210197 -37416 42283 89630
11167 89630 37343 -10804 2919 140981 77668 25264 21694 111292 127860 145792 -45566
11156 -45566 -142487 -155196 -114929 -114973 -82553 39034 36031 -52363 -24705 8293 -3425 106704
11144 106704 -50012 -98306 -110674 -270542 -349100 -442276 -228651 48249 162333 56282
11134 56282 -92956 -29485 56639 74136 -8481 -248357 -306631 -205036 -98359 -79622 -55310
11123 -55310 -188032 -202621 -118791 -261816 -389648 -151119 -57534 -185335 -96365 13488
11113 13488 -10117 -15997 -11053 -62084 -49481 -48268 -105399 125085 191042 230575 128959 30696
11101 30696 191688 89122 -47989 -111984 -266421 -116657 20504 205753 385632 184364
11091 184364 -88585 -33265 95820 24583 15261 -20127 -49580 -2336 27823 -114225 -16628
11080 -16628 71855 5579 -138200 -248671 -150719 -156601 -286143 -68908 172747 75790 83985
11069 83985 134059 -121586 -391797 -458141 -389417 -320524 -284224 -215793 -100042 -3417 72426
11058 72426 239030 276094 229558 121782 86872 -30576 -64807 -125321 -74693 -13290 -25387
11047 -25387 47548 -55536 -92486 81845 136296 81506 49130 59252 66446 63522 -88574
11036 -88574 -55024 -148464 -124662 -184610 -63501 103934 142508 126370 98538 119039 208431
11025 208431 180241 154649 129481 136362 143438 2649 -102984 -228837 -220814 -115947 138963
11014 138963 202203 32674 -9369 38141 15190 -9272 62911 -32560 83775 52253 -141856
11003 -141856 -88967 -37721 67566 64048 57220 -41026 -124736 -78582 147016 248149 154849
10992 154849 165643 -18979 -76469 -94806 -112537 104994 164303 248415 15453 -115440 -111879
10981 -111879 29349 121524 131456 60726 111371 13646 64517 33954 -106547 -98041 23652
10970 23652 185641 162117 180788 116468 186392 231372 262767 154152 129507 34725 -60205
10959 -60205 54590 55302 62561 -63932 -185386 -150479 -34465 -31659 -155437 -129511 -64139
10948 -64139 -9154 -91801 -104716 -15846 -165676 -193746 -311335 -415124 -330998 -97983 -25817
10937 -25817 -23988 45053 108170 76424 -159805 -184090 -131224 180636 159312 206293 300738
10926 300738 300255 175085 -80583 -175258 -91173 143848 133725 132915 185173 257736 105453
10915 105453 37851 -85767 -76908 -30420 104392 65698 97246 56096 35633 -35256 34606
10904 34606 222747 421234 342999 139913 137312 277316 289745 225195 80644 25049 -147129
10893 -147129 -85438 -49837 -23928 -57585 -100043 -129777 44876 125495 16673 159709 123564
10882 123564 -184985 -166335 20021 126730 28113 -91645 46822 136463 240162 297190
10872 297190 395450 244154 -33110 -602 44954 -1020 71128 172598 178316 42545 -73061
10861 -73061 -25844 12973 48025 182890 117522 142444 91343 159125 326461 275541 24923
10850 24923 -129654 -103957 167446 59009 -15722 115776 35230 -180068 -341365 -420727
10840 -420727 -294405 -165891 31836 184881 45074 61789 -38903 207280 331194 282062
10830 282062 248040 71642 -77235 -96079 -33514 -54907 -110265 27282 72578 -16703 -89466
10819 -89466 -217198 -313950 -94231 52595 45406 107772 165230 22032 -16216 135501 257129
10808 257129 91837 63701 110730 91912 137827 188710 26081 -206926 -236339 -180560 -120293
10797 -120293 -97604 -116081 -136020 -128899 -126332 -164572 -35343 173753 216995 359091 199484
10786 199484 -26373 -109339 -92518 -138079 -160241 -322739 -358448 -380002 -267450 -217508 -142123
10775 -142123 -37466 -261080 -263307 -46165 -69328 9296 -69971 -94996 -46770 -291703 -310667
10764 -310667 -268646 -282282 -114776 -59140 76986 68830 -142977 -31628 21041 -88228 -127693
10753 -127693 -55984 81035 126600 227778 356453 109200 -175274 -87441 9625 57171
10743 57171 -51796 -39150 10112 120444 -33724 -236654 -264159 -211704 -206243 -274988 -205355
10732 -205355 -60054 -71061 -210488 -221850 -262026 -371769 -366797 -167408 -39863 106051
10722 106051 -79619 -263375 -375306 -335582 -257717 -126033 -223659 -349001 -271871 -268466 -142160
10711 -142160 -166055 -149071 -47963 5169 -9240 -39004 101444 80389 126857 100951 -8239
10700 -8239 102445 161222 184722 156095 -78420 -184203 -49863 64372 293612 198918 119214
10689 119214 31547 -185561 -259412 -186387 69409 -7403 -159211 -47086 29086 -39162 51490
10678 51490 95916 58352 -26164 -122886 -83783 46795 146069 157428 77532 80984 149345 70963
10666 70963 -2577 -14231 69572 -18236 -81518 -9398 149447 180532 134850 181952 149189
10655 149189 112982 90320 134805 82021 -97768 -42100 5997 -56472 -199366 -154566 67545
10644 67545 210918 188564 83280 17648 -115790 -165925 -89315 -86816 -17955 -10438 -8159 40959
10632 40959 7763 -1768 32565 107687 115111 80815 -2301 -62818 -40138 -71292 -149773 -175537
10620 -175537 -13335 6358 -130500 -184893 -171955 -164791 -193398 -243985 -302240 -336174 -7746
10609 -7746 73238 74861 66180 -36517 11638 4197 13922 -13963 -101529 -215478 -188592 -292130
10597 -292130 -150529 60659 284398 220679 151455 114393 138741 17339 -88967 -31884
10587 -31884 27770 2727 -30641 -92447 85348 15472 -22949 -88573 -39688 83683 96958
10576 96958 728 -125383 -283284 -439279 -285691 -198577 -208935 -151893 -124963 -222812 -358089
10565 -358089 -343396 -321855 -291385 -180514 -68868 -58355 33374 267890 264618 71436 58370
10554 58370 16064 30218 90089 209466 142723 212219 294866 219547 81206 -184844 -135802
10543 -135802 -33682 76821 105969 15904 -74953 -59837 -122762 -181642 -95921 -164172 -151746
10532 -151746 -30025 26328 -100154 -138258 -142324 -252129 -206854 -105196 108880 176786 204913
10521 204913 195728 121149 34922 -8687 -98010 -105402 97437 222084 32912 38628 229206
10510 229206 161363 137808 152175 141005 110360 -62251 -14528 10651 30392 39219 -92984
10499 -92984 -232313 -45357 77246 -24597 -73247 50320 -33071 27740 121353 264696
10489 264696 243707 148247 72837 119557 98267 144340 121254 -105238 -134332 -45219 -58387
10478 -58387 -52193 57695 18375 68268 102819 209730 35261 -33466 8007 -164722 -326814
10467 -326814 -170168 -156200 -238484 -194120 -104419 -70401 -27875 -112743 -166499 -13578 7688
10456 7688 -87452 38589 119811 48227 -53970 24856 -65609 -117136 -97560 32846 88234
10445 88234 85270 152477 270947 177827 190364 254800 265127 201639 -62988 -94978 -35091
10434 -35091 -181820 -240641 -231739 -159604 -220070 -391779 -140635 -40838 -38318 -1755 55962
10423 55962 96712 96631 89281 63280 149557 170804 34219 78816 133238 4574 78285 -8948
10411 -8948 7863 -46389 -21125 -110071 -191385 -369920 -329740 -240588 -161246 -67185 153918
10400 153918 223108 -53589 -152152 -216168 -164813 56135 6540 -27704 -31564 6813 -58342
10389 -58342 -133774 -99121 63997 151103 185972 97807 117798 163969 212003 236911 146107
10378 146107 90236 35198 -72122 -178864 -181028 -80002 -44571 34402 70609 53916 72958
10367 72958 -29855 -107480 -109655 4905 207832 267014 257669 282061 179438 -31178 -134179
10356 -134179 -148325 83560 421794 320192 209511 105417 -64055 -290807 -279833 -39152
10346 -39152 401966 680631 1002791 1153311 1000800 1196204 1559329 1761619 1874081 1946516
10336 1946516 1852337 1669063 1202694 1160567 1020750 999114 897637 628772 570872 474578
10326 474578 437664 535401 561433 639791 351981 181866 185825 212666 282514 232915 181826
10315 181826 168280 358411 546846 554753 514067 422374 364903 254938 21005 -50957 38855
10304 38855 18853 -89981 -164595 -145581 -48604 -30616 57187 187683 79020 220843 477985
10293 477985 358549 221841 179120 112304 167443 338372 304904 303824 350552 466160 578380
10282 578380 561910 378942 466964 333695 88289 -18000 -30254 172083 135714 9730
10272 9730 -126765 -253209 -153597 -148231 -250941 -332910 -152166 48988 -46227 -24587 -121679
10261 -121679 -145296 -122298 36273 189702 165201 139914 252405 277721 233989 158565 7974
10250 7974 -84125 -74976 -5891 -33273 -78597 19445 -25623 163534 60233 -184353 -234284
10239 -234284 -68522 34537 46040 -91858 -163678 -133405 -23016 -69931 -200487 -289709
10229 -289709 -283102 -205534 -143599 -19653 -23646 -94166 -109543 -260354 -159200 -1651 50392
10218 50392 -109188 -220928 -142610 3387 261058 489769 450375 259267 186365 81306
10208 81306 11271 20444 -75045 -140797 -155126 -131668 73906 149223 211042 193235 -87982
10197 -87982 101822 145218 -71574 -76637 5775 -16340 41560 109216 243263 176664 104127
10186 104127 194372 302033 236650 -26062 -94117 82062 83001 47104 65563 19650 -31437
10175 -31437 126849 79667 43658 36307 181526 189356 142789 91335 -66732 47411 135366
10164 135366 98166 133755 214991 84251 2467 -30493 -169143 -212454 -161944 -155263 -52092
10153 -52092 27544 54545 216282 195895 63385 -81631 -194748 -265954 -113637 22491
10143 22491 196113 239341 353181 338134 210230 60309 43725 60712 35254 -72850 -198000
10132 -198000 -74405 -151379 28435 61679 -117608 -127887 -141150 -180404 -156768 -91461 -208841
10121 -208841 -242210 -84914 -82363 -186585 -225856 -191001 -219284 -82137 41237 100548 -57575
10110 -57575 -29716 98915 146051 178298 68542 -54208 3636 -97219 -146120 -206013 -150920
10099 -150920 -163371 -90194 96886 26412 43315 114149 67621 -29585 -174190 -291318 -264012
10088 -264012 -142182 -210096 -261159 -164999 -112566 -137091 -189596 -304952 -227420 -127561 -85863
10077 -85863 -80116 27145 31402 40119 57612 -21957 -252817 -184175 -42221 -23321 22857 11264
10065 11264 43870 137976 248907 189448 134926 180723 178580 131415 114206 242907 3699
10054 3699 -218799 -109446 -43562 -100407 167865 455428 410839 306808 166596 2376
10044 2376 94360 -2411 -21308 -61082 -177623 -209168 -355655 -378021 -77882 79871 -106411
10033 -106411 -224028 -171256 -78053 42035 -38949 -153516 -269870 -112321 -145244 -149989 -80082
10022 -80082 -122243 -120193 -145186 -59059 -220894 -372811 -377424 -264458 -110431 -126667 -47173
10011 -47173 -563 -13537 127832 23729 51647 31296 79503 100906 -59184 -59365 65197
10000 65197 52700 19809 -24463 -154146 -55564 185880 124149 -159370 -171706 -55445 63541
9989 63541 -10939 80281 -66623 -83758 -101490 -9839 177924 -109542 -316035 -316463 -232970
9978 -232970 -227071 -97438 -239523 -290198 -261807 -382257 -428897 -374142 -265084 -42941 148760
9967 148760 313175 388432 292103 87356 -31197 163754 196329 119396 37583 69789 -9043
9956 -9043 41452 50399 60343 29748 -78552 -239965 -421788 -524128 -328760 49315 181000
9945 181000 110304 -44902 89108 188971 214891 177190 144789 294493 120127 155627 118950
9934 118950 41641 -13294 -15148 38601 -26407 -83101 -37021 4515 38753 137018 153408 38154
9922 38154 -62398 -141107 -179030 -121238 -21495 -82213 -51887 168092 193143 218430 139252
9911 139252 131961 305570 250772 168537 139090 200544 290024 173951 193930 206476 73262
9900 73262 169353 322453 514820 535381 434588 249963 45388 24896 23601 -30869 -190466
9889 -190466 -199267 -75517 -79844 -89058 -94756 -11126 109519 107080 120693 237963 218942 117162
9877 117162 151166 66277 240224 79328 -91955 39364 -64139 -92007 -71294 -15266 -65840
9866 -65840 -73645 -131794 -149382 -231360 -57111 -152983 -240019 -165091 -198797 -289900 -267291 -163913
9854 -163913 -37378 -93547 -156226 -162722 -108739 -66930 -144752 -73495 74966 211853 146953
9843 146953 56912 82557 59575 69844 -101411 -228908 -256494 -289276 -286263 -256247 -18034
9832 -18034 40685 57729 39738 -93148 -99669 -227707 -295607 -229671 -207088 -164962 79316
9821 79316 157379 305731 310049 242993 98413 4582 -89876 -212415 -254898 -177918 -52419
9810 -52419 -25958 -112296 -142387 -138243 -26392 217807 228534 -69879 -200900 -162760 -112675
9799 -112675 -24188 13917 -39145 -2494 154673 362517 243246 89742 -68 -80228 23300
9788 23300 -125441 -372961 -566035 -532387 -271121 6233 137278 187556 141107 125969 95449
9777 95449 109315 -3023 -129383 -274145 -396838 -328539 -285361 -39865 224047 257281 279089
9766 279089 323753 159175 34370 -276782 -340154 -116322 -51914 -164911 -206358 -131610 -97872
9755 -97872 -53699 -62006 -98776 -282879 -312891 -97346 101475 98150 117367 79249 -9669 -34177
9743 -34177 -36184 -101031 -72547 -113103 -30204 -50061 -104047 -261068 -300729 -305850 -325744 -436647
9731 -436647 -246492 -85528 -38561 -106794 -5430 269306 268479 102225 -76737 -273215 -197055
9720 -197055 -117799 34075 105618 -9500 -1048 -80041 -225356 -138204 106700 253294 164460
9709 164460 166955 100394 -110706 -175789 -261051 -179668 -15019 -113380 -314513 -384820 -318351
9698 -318351 -210535 -193486 -149133 -192144 -366336 -246183 -138533 -179006 -116363 -36813 41682
9687 41682 54422 -24412 -95167 32481 -45867 -205257 -134893 -91226 -43173 115236 317277
9676 317277 312654 340760 405361 205799 6481 -85762 -145678 -162013 -132441 -157560 -254665
9665 -254665 -263990 -187105 -2207 83609 71994 123897 88495 -51937 -66907 -207643 -201756
9654 -201756 -176952 -305601 -213309 -56496 -155180 -81388 58814 35194 -69540 -208746 -152202
9643 -152202 -183944 -331446 -312955 -109945 -51068 103093 -46488 -157306 -131186 10168
9633 10168 -147553 -341844 -346670 -489122 -356703 -230835 -251857 -229183 -114820 -108479 -98766
9622 -98766 -34602 -153586 -212271 -127708 -165023 -184695 -30865 -90656 -46713 154508 153949 -2271
9610 -2271 -128893 -177386 -205299 -80155 -101221 -24232 205014 260362 94666 -63544 -228754
9599 -228754 -132981 -76735 -96755 -37247 9085 -61667 23991 5585 -166880 -141341 -44320
9588 -44320 31629 41398 -54949 -111561 -32475 36760 69330 71979 98799 -78600 -293245 -302928
9576 -302928 -75456 147202 137638 131708 158778 -29930 -186709 -272534 -299902 -331315 -445360
9565 -445360 -407706 -239768 -202435 -264560 -230966 -170036 -220226 -111023 -91401 -43770 -33618
9554 -33618 -267014 -94242 38437 123055 109276 178016 118213 166636 110059 -64372 -74816
9543 -74816 70134 81935 100245 39056 28945 46542 35679 -8162 -91488 92842 195134
9532 195134 167090 -21825 56508 54160 -169057 -282590 -274081 -277894 -301848 -232926 -79196
9521 -79196 -53522 -5565 69729 117882 274992 82515 -155015 -157279 -290579 -216451 -167916
9510 -167916 -275779 -268697 -67456 -12623 60812 23174 -24587 -82494 -27311 89833 79711
9499 79711 75228 39934 67582 22395 -42744 -93241 -66362 -168836 -139328 -83794 -80222 -57298
9487 -57298 14070 100871 33481 -39465 37951 71761 -61595 -4910 131966 -35564 -101203
9476 -101203 -175579 -113700 12680 42168 151377 111163 131055 246289 1875 -148651 -270001
9465 -270001 -343862 -166207 -107093 28177 180876 206994 114353 167499 202623 209108 274515
9454 274515 234976 124282 73380 18787 76843 56210 -39677 -136044 -129434 7599 -120174
9443 -120174 -53653 119910 51392 -21198 -16460 26343 51371 102379 155014 -88466 -188624
9432 -188624 -103404 57186 -7205 -146974 -175713 -115189 -154384 -111153 -62637 64283 194286
9421 194286 260419 257076 145218 -19979 84134 96378 -179358 -193207 -79734 114527 119606
9410 119606 116907 19284 -11945 -33245 -171176 -188904 -251037 -138507 -125185 -175837 -140519
9399 -140519 -95361 -31257 116816 72263 34811 3187 -78853 -220021 -128358 -240831 -226104
9388 -226104 -62868 -123003 -108024 -49722 -149953 -270113 -182412 -71176 100974 -94051
9378 -94051 -111132 118075 3572 41708 231221 98454 -130420 -179671 -136587 67084 70290
9367 70290 -21803 -33658 -72025 -54413 44085 115534 249989 73909 64833 279084 340779
9356 340779 263550 274024 226385 189824 362376 249371 207127 198276 76942 7095 215205
9345 215205 283122 85365 133040 207687 91496 -171754 -139160 -22718 -28548 -60121 -53275
9334 -53275 -173162 -316738 -220658 -143368 -369938 -321038 -242700 -319788 -265407 -141678 -169442
9323 -169442 -159719 -99901 -145861 -292561 -209014 -186915 -58737 75759 -40769 -128916 -301651
9312 -301651 -456351 -390075 -318458 -256507 -113641 -69028 -186682 -176250 -105072 -4429 32237
9301 32237 -39607 16753 162450 386361 244754 -23736 -89650 60477 110216 173947 186564
9290 186564 247849 275373 137404 176115 182661 53629 74519 42916 -110253 -185873 -91608
9279 -91608 191010 295870 92389 -19030 54883 189040 30392 42306 -37302 -165043
9269 -165043 87887 248949 249002 430857 402767 253314 103682 138464 308496 426159 288694
9258 288694 141489 142559 226218 154082 100881 74120 23287 -72907 128545 199277 61856
9247 61856 108355 180829 154917 1093 -244920 -184372 -62678 86866 278716 179498 84003
9236 84003 -505 -64714 22676 65792 -98080 -159423 -22986 74400 80901 22558 36518 -124563
9224 -124563 -38804 156107 47683 -260799 -295057 -19959 278209 282391 109102 66318 182637
9213 182637 284807 195822 38955 87272 26936 57371 10126 189127 384313 490960 331599
9202 331599 323482 396011 315550 384462 228036 19213 92927 292148 426205 396951 356459
9191 356459 484871 498386 236528 6544 136012 255656 243098 173389 140628 59613 91400
9180 91400 133867 259060 265147 158017 13421 27525 191797 206498 286154 353986 414277
9169 414277 417063 345804 144685 -40182 84470 48995 17091 286227 479467 519426 514491
9158 514491 430087 354857 380646 457647 550329 399822 263236 363031 482175 299511 465761
9147 465761 504305 710915 813709 807384 671167 744178 901766 1007293 1121399 1261057
9137 1261057 1405309 1497678 1512742 1616373 1669143 1589953 1798486 1985593 2089771 2356060
9127 2356060 2698327 2899592 3076979 3417533 3906679 4392908 4975931 5379315 6066644 6883335
9117 6883335 7974785 9308638 10737624 12329339 14366696 16936530 20350538 24704460
9109 24704460 30174766 36955592 44978480 53724709 62063601 68529256 71398882 69823845
9101 69823845 64227249 56600782 48853888 41894193 36085047 31507786 27594022 24460531
9093 24460531 21960895 20026001 18157356 16741467 15599628 14632298 13734883 13050195 12219372
9084 12219372 11411684 10704432 10127784 9801022 9527473 9175503 8890875 8588227 8278798
9075 8278798 7785036 7596869 7605134 7245469 6817405 6501074 6274127 6119456 6103274 5933740
9065 5933740 5623898 5447182 5322598 5184441 5068199 4841385 4619574 4473097 4376082 4411172
9055 4411172 4351417 4256370 4052237 3858792 3871277 3784360 3579357 3593448 3538307 3590053 3490326
9044 3490326 3349056 3239261 3243269 3099896 2880075 2734411 2840111 2947742 2962020 2778846
9034 2778846 2699349 2552115 2571239 2559951 2409006 2213191 2042695 2075058 2138004 2151573 2104231
9023 2104231 2109039 2294143 2273340 2200117 2076195 1922131 1857890 1895744 2000306 2002889 1859855
9012 1859855 1757767 1669869 1769820 1838094 1724877 1448405 1292118 1250999 1265607 1440234
9002 1440234 1489056 1598495 1556892 1474670 1508087 1535796 1488145 1316869 1245930 1330008 1509360
8991 1509360 1564730 1260157 1216144 1206180 1397772 1400705 1288337 1233342 1217698 1154702 1150153
8980 1150153 999825 915950 800628 676816 787497 1085956 1026961 1024255 1117077 1072608 931257
8969 931257 950074 1051856 968486 788087 753401 912208 876065 893974 1001497 783349 493708
8958 493708 363638 514739 686568 624657 556792 705373 762949 911277 899446 802543 683639
8947 683639 784848 735396 790843 732197 728563 685486 978770 1091743 782758 615065 495473
8936 495473 521359 559866 542930 527899 377451 220456 272174 494069 436211 480844 562155
8925 562155 524637 380966 236587 323745 326515 116661 180142 294693 158742 208559 335180
8914 335180 334566 195757 281179 400579 246643 101589 292596 325336 328797 275795 406187
8903 406187 391203 412688 496593 579449 617718 681138 455275 374610 377101 227897 199830
8892 199830 209718 226509 320008 457636 448746 280812 297088 364644 411130 526197 494333
8881 494333 324306 248182 349157 217531 113061 91240 38076 154255 351327 414012
8871 414012 381459 140405 -69362 -59688 -127398 -270408 -217957 -36267 -9849 111093 187437
8860 187437 190662 214348 86794 -4366 55787 33010 100247 -19346 -276297 -211578 -91433
8849 -91433 79662 238349 -32221 -196532 -184283 -163766 -14036 72401 7004 -106887 -206184
8838 -206184 -147327 -25759 71275 -14958 -4089 -5186 -179444 -180444 227659 385872 206147
8827 206147 81680 69837 -17210 36687 183769 226759 172219 79782 273773 242422 -15058
8816 -15058 -95120 -2674 116675 120402 99765 6960 33086 -164387 -263422 -246543 -141427
8805 -141427 -95032 128304 280210 141068 207172 90998 -214573 -170601 70069 3373
8795 3373 -96343 -26608 115218 110120 -27899 56638 128241 163770 188842 237669 329295 210008
8783 210008 -22683 -19783 -59289 -31441 13996 239554 230825 37759 -132594 -37841 12716
8772 12716 229676 405252 432404 472582 276153 199513 164451 234540 170971 -86574 -315235
8761 -315235 -145432 -58566 -4811 -108878 -229401 -129632 42663 123914 255147 254368 309295
8750 309295 339537 17722 -140747 67082 34689 -155871 -295644 -293848 -25616 42692 8919
8739 8919 53990 -105867 -337103 -395021 -268587 -198021 79451 182061 -3509 27084 202690
8728 202690 296926 75984 -92047 -117878 -250303 -85605 -11275 139639 311706 243683
8718 243683 206200 218106 304019 311882 388064 427110 367802 203055 66412 -28654 74352
8707 74352 215894 162873 160476 -49996 -268151 -210518 -218180 -344477 -375373 -368457 -316822 -168810
8695 -168810 14926 71240 98707 71783 146791 205566 179040 221206 233380 59894 45352
8684 45352 196805 8575 -72062 82762 245610 183308 179215 131864 270278 254876 234585
8673 234585 284965 244484 28388 -47702 -62027 45570 250920 321336 123979 21222 143568
8662 143568 26303 116950 266774 407149 292472 169484 178992 246813 107859 108811 57645
8651 57645 -45246 -102119 166606 153572 -152923 -358752 -384437 -331309 -260593 -19128 93043
8640 93043 -13449 -125433 -200476 6570 117787 -29644 -3847 -87742 -130648 25371 10097
8629 10097 -130188 -53223 -48089 170349 231600 83064 -24384 -157392 -211694 -148856 -165251
8618 -165251 -124323 -139131 -147137 86925 74630 -9283 64262 237630 198564 39784 -82124
8607 -82124 -107881 -90746 132422 -22531 -79023 80765 261619 275067 84948 -12714 13340
8596 13340 113606 108910 170582 131244 -16950 52761 -10857 -8520 81414 23895 -70198 12657
8584 12657 115308 62821 51703 98283 46803 -31938 73354 152879 148905 122597 151151 15270
8572 15270 -90253 -127736 71661 67977 -141476 -6359 233983 234385 53960 19315 -6635
8561 -6635 -17495 71864 81252 173918 159723 142779 192969 233256 245513 255106 343704 385374
8549 385374 536379 306545 473883 589353 378359 100841 -54259 -35601 -34069 98987
8539 98987 -79505 -242181 -288559 -142035 12194 65225 38974 -37012 151746 180577 335193
8528 335193 307262 260554 391453 299686 136053 191525 311510 187599 103526 146076 212289
8517 212289 310970 436623 380259 228697 188648 189603 11623 -215616 -129734 -122181 -103469
8506 -103469 -4031 -15836 -138363 -86944 -50679 -110889 -236397 -285475 -317423 -350321 -310898
8495 -310898 -102405 -144044 -270261 -190170 -8477 2973 7226 -4361 -11115 -66712 -19619
8484 -19619 -140743 -105082 132780 182970 164741 204965 89296 -86635 -161137 -194246 -160403
8473 -160403 -204812 -130370 13987 219121 276616 162601 -39969 -9348 -41142 -160786 -36990
8462 -36990 -21472 11177 83251 72457 60959 67513 179223 146426 -68756 -29029 -88073 -109227
8450 -109227 -97821 -164004 -64382 124484 204992 136282 160503 224864 130669 69178 20089
8439 20089 -62383 45733 -3663 -214968 -221763 -67617 -2760 33965 84437 40109 -63402
8428 -63402 18876 -1637 -28170 64481 113777 35850 75528 196737 143621 4417 -317600
8417 -317600 -375470 -114432 -54546 -121630 11804 116657 111631 75983 89234 41190 -75107
8406 -75107 -130973 -188690 -75179 26582 50933 45151 188819 155630 128486 253297 179062
8395 179062 113110 93855 240466 301756 163295 -52573 -12779 -146054 -280628 -263936 -124245
8384 -124245 -219319 -295914 -379193 -376478 -403510 -259387 -32336 -9569 -39566 6437 -59950
8373 -59950 -65344 -291381 -392324 -269070 -233012 -31059 -72660 -52909 82426 158350 236495
8362 236495 93221 -8673 17074 -8714 -64869 -5171 -85396 -76721 -55225 -85015 -46058
8351 -46058 -180947 -206497 -109452 -163916 -182112 -56068 -1170 52557 -5091 -84397 -122563
8340 -122563 -12880 91027 -52167 6299 174606 165548 103786 97646 61362 -202503 -402584
8329 -402584 -295875 -154264 -170600 -161664 -142521 -147970 -5248 63921 -52726 -123843 104583
8318 104583 114071 35892 29235 78844 18330 -67855 -129373 -19941 22451 -25999 -96709 -75133
8306 -75133 -37221 21974 -126621 -257408 -207546 -107374 -143884 -28867 85391 77177 40824
8295 40824 281218 345161 338955 239050 7908 12824 97567 46355 35379 94118 37783 -64228
8283 -64228 -26531 28883 146748 95542 4669 8345 -11019 -91263 -109084 -110756 -84927 177951
8271 177951 253129 127534 19386 -163373 -213544 -207949 -167082 4583 119123 106059 74682
8260 74682 107253 -47182 -39188 -26501 26370 44234 22285 111673 124020 34204 65432 -24506
8248 -24506 -64619 108617 196289 134969 145799 194276 106348 54848 -120199 -50737 84368
8237 84368 -164806 -79022 75157 118716 -1802 105213 88161 126075 149115 174454 204186
8226 204186 128178 280387 400960 186313 26101 74111 200486 213797 253620 221080 249747
8215 249747 127622 -75951 -91779 -134461 -43024 -40776 -179243 -238595 -234075 -107827 -9497
8204 -9497 137051 264990 372646 354320 316414 47983 -119345 -158920 -239048 -242267 -69982
8193 -69982 -23326 46506 -52374 -74070 140655 224687 211283 179344 222343 300466 287203 115119
8181 115119 90980 263782 170928 88605 169058 106389 122254 56121 143254 324842 321136
8170 321136 379479 426965 341259 112490 3760 -133542 -187303 -60190 -6644 -12057 -48246
8159 -48246 -268941 -311400 -297275 -234490 -111690 -125127 -348213 -324479 -149051 -137500 -189528
8148 -189528 -189394 -231337 -327146 -356474 -122959 27803 170375 130925 -171501 -160043 26398
8137 26398 -54070 -51991 -27418 -44023 -120516 -100593 3067 29295 -48240 -45471 -86281 39645
8125 39645 -14763 -23793 -5628 -84541 -32866 40577 35941 -88170 -153562 -267017 -265757 -340286
8113 -340286 -289442 -149286 -150358 -111335 -141251 -114447 -168482 -168529 -164080 -197452 -94161 -91534
8101 -91534 -129011 -28505 163738 97178 211662 273996 84563 12839 -224382 -388459 -220432
8090 -220432 -18393 -36884 -149862 -69322 -68096 -85712 -36219 -63648 -64487 72242 99707 -190224
8078 -190224 -247748 -381344 -486170 -292046 -141161 -1246 91659 213974 223924 312226 323485
8067 323485 352153 277702 140040 -19629 -32751 -180402 -286526 -306867 -409470 -488987 -525270
8056 -525270 -418826 -229000 -222868 -290883 -304583 -271126 -142252 -39580 -88702 -97393 -216124
8045 -216124 -197140 -172172 14403 124229 128451 32629 -75966 -70783 37119 234122 179336
8034 179336 141322 -4483 13517 -30139 5959 48493 150994 28947 21837 -108890 -205375
8023 -205375 -97982 -30561 -111904 -235610 -372747 -394128 -427075 -353845 -304266 -275315 -205918
8012 -205918 -168518 -34226 -69910 -150866 -48659 -67855 45286 203735 264035 49329 -132991
8001 -132991 -149414 -36920 6372 -31893 -97318 -144806 -189797 -188293 -100093 185537 256850
7990 256850 155111 246778 441809 332258 92562 -86896 -62381 -71549 -14149 17554 216984
7979 216984 304877 181805 109724 187531 217376 100351 60448 130353 -88496 -253454 26287
7968 26287 54811 -84365 -144153 -193911 -37142 25065 98891 59361 37716 21920 -43658
7957 -43658 -115202 -128229 -87787 -44177 34878 79785 34999 29201 13919 52838 186225 221575
7945 221575 18745 -181672 -129541 49846 130863 71755 31705 -100103 -135392 -86089 -67434
7934 -67434 -102218 -33517 -72550 -56799 -25551 -112395 -111330 -68588 -37111 89414 167371 273407
7922 273407 297021 148200 127861 142976 34260 -197416 -139422 67569 97580 74451 140027
7911 140027 201470 99643 -26936 133168 191485 227312 203471 123169 120055 94105 176048
7900 176048 30173 5183 152237 159817 115760 348613 544616 530983 313343 69632 184636
7889 184636 158907 3827 -119984 -90970 -93108 -6456 12003 9561 262039 205431 142667
7878 142667 157058 74584 -91511 -10613 -78549 -117984 -118928 -39933 68728 170679 101496
7867 101496 -13241 -22910 23374 -24883 96099 186777 195546 147492 77625 137610 233046 179947
7855 179947 197610 163438 66210 25537 256328 191273 135823 275377 344651 405863 351668
7844 351668 99790 -53666 9735 117916 241610 193440 293113 187020 229348 378799
7834 378799 -244 -66408 63644 -22830 -109525 -31593 11451 -6480 85250 -190063 -241290
7823 -241290 -141269 -140084 -288995 -215598 -113550 -66279 -61081 -111409 -42370 135525 127695
7812 127695 -44031 -221949 -445975 -388147 -388632 -388276 -311833 -138812 -30716 -90307 -118182
7801 -118182 114235 231364 247530 168873 141527 -6773 68369 208591 41416 -60245
7791 -60245 38855 51606 -208811 -236637 -120773 166713 98226 -13578 -2661 199533 144320
7780 144320 -55176 -63193 -100329 -67476 -5227 104373 150079 253091 190130 72049 100497
7769 100497 308462 280287 193742 315539 378598 261192 149944 187377 58084 -104755
7759 -104755 -112966 -91797 -195536 -308249 -296179 -182965 -179773 -137312 -76247 41889 119384
7748 119384 143460 -153248 -162485 2854 -37829 -82728 670 135588 58451 -179728 -193110
7737 -193110 -40024 124803 186884 143953 200869 130099 38207 -26419 48828 113051 64214
7726 64214 -45577 29099 141922 49807 -43822 36959 -28932 21553 31672 130676 92684
7715 92684 -35169 -223677 -225517 -317816 -277695 -186999 -184762 -347990 -293338 -339409 -334720 -300303
7703 -300303 -135224 -149661 -203175 -218742 -267331 -227817 -111695 -26280 90559 -101075 -312663
7692 -312663 -394949 -384117 -388689 -308304 -78327 170876 146850 138810 45334 41121 40643 5664
7680 5664 3893 -105002 -68952 -3584 -46040 -105140 -34915 46536 179206 126671 89147 92505
7668 92505 52164 118210 26173 31952 75228 194468 268655 177579 103695 -36457 -49907 -269206
7656 -269206 -443306 -230943 -238325 -288082 -357648 -349565 -180493 -297801 -447615 -212914 -10922
7645 -10922 102773 155884 147266 67932 151326 70766 -25129 14484 160036 168266 201920 210102
7633 210102 89712 -246509 -380817 -236250 940 -17604 39191 80847 71173 109383 -25442
7622 -25442 -113047 16995 -26791 -72491 -168866 -55016 85414 22180 2523 109466 28449
7611 28449 -171669 -271020 -117046 7619 -11573 -125854 -238913 -125771 -17499 -43723
7601 -43723 -108753 -149237 -220130 -32506 220733 211658 200072 89790 -23569 -152931 -185054
7590 -185054 -234258 -131820 -224015 -217334 -98624 4640 81759 240148 219050 127689 110383
7579 110383 85081 125222 134117 -128811 -106156 62123 -67760 -191777 -238343 -235061 -220553
7568 -220553 -226451 -178433 -160413 -94729 -43398 -19456 -79207 -201068 -230418 -165003 -231458 -90620
7556 -90620 -15409 -37347 -34930 -43038 -129253 -221603 -284196 -191564 -69403 -60459 -83264 -178672
7544 -178672 -7098 42291 142367 185896 232818 119113 44280 -90824 -49325 -69725 -106704
7533 -106704 -50084 21911 92723 49904 -172070 -202936 51862 288554 223419 76640 58350
7522 58350 -69448 -180826 -33455 -7263 26137 231575 293479 217301 10938 -10342 31357
7511 31357 -99463 -86483 67351 14407 -257163 -351678 -197657 9904 69509 34408 -21805
7500 -21805 -65755 32129 29705 94154 -33867 -139341 -178048 -260468 -212329 -207375 -243023 -152785
7488 -152785 -95500 -172235 -141459 -14891 13192 30090 70880 136479 237499 253194 145788
7477 145788 140246 318793 408574 233566 182245 37186 -188038 -233161 152164 368558 298853
7466 298853 301024 180012 26351 151324 235720 135335 -163147 -287863 -102838 180298
7456 180298 318114 435572 335947 260172 381295 323793 180431 17907 -61666 10718 -27107
7445 -27107 -51957 -84711 -144619 -281823 -137064 -82308 -71110 -57301 -25884 173155 210428
7434 210428 171364 195758 50385 130690 338844 299736 124625 -55925 -25500 22015 10043
7423 10043 -103789 -34216 105133 173929 116663 -54408 8709 123543 8343 16675 61734
7412 61734 73917 36401 -13496 -52102 -49863 -114332 -143749 -256004 -102277 22449 31448 78627
7400 78627 -44862 -204691 -52616 -137509 -22252 257647 166502 88537 99967 47186 13434
7389 13434 2634 -120136 -195979 -126538 -52189 165657 235288 159534 55590 143457 363338
7378 363338 381438 310456 142593 16834 -37388 -46512 -43964 -63223 -130886 -187100 -227300 -224688
7366 -224688 -131159 -127271 -347634 -285259 -135014 -4730 132836 126198 110804 65292 63701
7355 63701 -19526 -28962 -187988 -272506 -118841 35304 -39557 -12346 -33688 9137 123808
7344 123808 114128 118811 197099 28705 -116569 93344 152945 141150 123410 4143 137796
7333 137796 124258 38816 -51526 -102207 -78688 -22375 -54876 -240479 -237031 -242501 -237920 -92124
7321 -92124 20057 18419 125463 182504 85429 162546 179636 142749 36087 1724 106559
7310 106559 33018 -28899 -179605 -205658 -123041 1176 159652 250856 240803 210042 -74103
7299 -74103 -232263 -307314 -255068 25301 19281 131295 235779 173125 125315 1872 -31369
7288 -31369 -4311 48783 -67168 70590 -76431 -158548 -125207 -92141 -66577 -154316 -206375
7277 -206375 -155408 -78292 25907 102730 67244 191009 315462 228417 187089 130528 146478
7266 146478 -41698 -65543 34814 19858 3539 -197167 -252565 -417519 -438285 -428169 -94808
7255 -94808 -125727 -219616 -379541 -321943 -134724 83795 -99731 -176850 -85146 19891 46548
7244 46548 61123 -16686 -101679 -88478 -144672 -277919 -149842 -126616 -57174 -81010 -127078
7233 -127078 125303 177495 236100 117236 63380 -5818 19471 52973 7535 -107609 -137446
7222 -137446 15778 103645 56500 -11747 -52706 -134779 -93988 -77799 -271605 -369529 -404362
7211 -404362 -499840 -454741 -300738 -173313 -90000 68458 -65136 -193832 -253176 -29704
7201 -29704 99713 56959 -5868 -58232 -7367 197434 284657 104227 -13549 -144746 -197250
7190 -197250 -293177 -271880 -125477 -165404 -246059 -104019 84048 373030 369654 159875 -29028
7179 -29028 -40442 61187 149760 131711 273492 332024 341756 311775 57780 -130037 -47811
7168 -47811 61021 69577 217386 364638 322496 244016 122474 -87440 -183243 -117754 -29580
7157 -29580 -62180 255197 378557 249767 97459 72174 -89203 -177997 -75886 -105851 -346314
7146 -346314 -193382 -53848 190417 108874 -5396 6003 18880 542 56212 164278 221273
7135 221273 139596 96004 -95125 -182309 -119244 5278 -69574 -133070 -279482 -135471 19841
7124 19841 22603 -35576 -219241 -180914 -34473 -23279 49483 -7227 -14806 90297 215949
7113 215949 79706 131421 93739 87723 148101 76008 -200743 -254920 -128757 -40401 -18107
7102 -18107 -135354 -86632 50293 120957 144696 184334 150345 240951 359018 247616 88574
7091 88574 81223 187571 216957 263001 288231 255570 285234 304521 227814 147442 81926 2011
7079 2011 140086 130732 -68078 -126629 -39325 -19047 39457 34329 79468 47771 78434 -38452
7067 -38452 -18074 -111210 -166604 -192981 -164510 -144225 -108449 -63001 -194940 -191962 -136109 -290774
7055 -290774 -432234 -466382 -276082 -311471 -298489 -215008 -149801 -224890 -256429 -379221 -534277
7044 -534277 -421271 -101115 27184 -71301 -56999 -44211 7999 -75425 -122976 -120159 -77135
7033 -77135 35980 142028 221765 157102 80304 56387 32398 24965 58723 22294 92935 147052
7021 147052 124551 3670 -288 105913 109010 6267 -50803 58448 241706 349603 213379
7010 213379 -36299 38372 294952 307646 185344 61994 175140 189926 100899 74004 -88775
6999 -88775 -158501 -282926 -236388 -244414 -139767 -192427 -280685 -374072 -475400 -396444 -173809
6988 -173809 -149407 -160276 -312846 -309693 -261402 -162517 -131823 -244601 -353689 -380347 -302209
6977 -302209 -146418 -135746 -69192 -150461 -109034 -22933 34280 -31809 116263 273772 335070
6966 335070 316368 248400 185754 -62845 -239196 -139957 -26178 -42434 -23916 -28266 -133868
6955 -133868 -186605 -31387 -88187 -257680 -157077 -74947 -153968 -128332 -111440 24593 159646
6944 159646 58151 -106240 -168361 -100512 -22282 -65144 -75980 -99875 -5877 -189601 -120287
6933 -120287 -35593 19558 33693 -54148 -288613 -379267 -268384 19065 73776 45484 149626
6922 149626 212343 304752 260706 52562 -108450 -125433 5916 154773 -191 -14919 -51164
6911 -51164 -91114 -55748 -83262 -97342 -48870 -15560 39529 -16121 -162907 -195799 -161040 -29417
6899 -29417 143878 -88544 -98910 6052 -194094 -113705 -941 66373 167101 293756
6889 293756 126680 44988 143350 124122 84931 -1817 98060 131417 -67867 -217202 -10649
6878 -10649 51236 -26571 98774 24966 -33710 -31810 209773 340895 182788 145962 151929
6867 151929 138386 223271 268043 238017 52665 3194 149103 179274 174345 -33069 -146510
6856 -146510 17599 -12269 -63935 -79166 -107855 -32374 -74470 4729 210047 347992 243632
6845 243632 132415 -32062 -171172 5469 226246 152039 81561 209839 214268 37968
6835 37968 -114777 -127852 -63899 48108 -146832 -177699 -279101 -117911 62229 51308 53712
6824 53712 -93048 -78114 -29568 -21377 -13371 90538 207828 202066 150422 -106937 -154782 -101007
6812 -101007 -302101 -444847 -348964 -303048 -213455 -136089 -125445 -275670 -322615 -204356 -61234
6801 -61234 -137084 -255481 -211032 -102769 -110610 -87426 -142932 -59463 61178 33113 -63577
6790 -63577 -110490 -184703 -308603 -401036 -290939 -226885 -152589 -18799 -45959 -153054 -81648
6779 -81648 -11011 63933 97010 156205 398760 257702 -12885 -85248 -77411 -123389 -98772
6768 -98772 -183546 -90404 -48807 -303482 -252961 -7631 -94157 -242984 -305046 -231218 -108903
6757 -108903 -183109 -301843 -178433 -156507 -73402 60658 9652 -17384 102837 90063 106798
6746 106798 203144 92338 -36414 -80785 -77037 -14334 59598 120956 85840 -164897 -394574
6735 -394574 -513907 -477524 -450192 -326150 -209949 -7787 16052 107949 123943 -33804 -60082
6724 -60082 -45654 -93955 -16856 -93168 -129526 -48312 -66731 -201100 -203053 -163257 -124409 -160900
6712 -160900 -169663 -135222 26874 -87231 -84655 -147262 -203250 -47628 8219 64149 74113 23930
6700 23930 -63520 85614 137167 21767 12638 76538 19532 -1310 -60705 -149429 -128696 105115
6688 105115 104566 51053 85348 305088 364343 277031 173898 128433 137502 47941 -38552 24718
6676 24718 110114 186139 171649 165198 136590 -60171 -132006 -195045 -201102 -171580 -94985 -53911
6664 -53911 -145998 -171871 -53859 -5000 -16763 40894 130074 8399 13933 60902 56377 61864
6652 61864 127130 -26151 -60396 -17105 68200 46994 106340 200968 110308 -147968 -253769
6641 -253769 -157158 -172234 -162203 -144317 -192974 -122280 -120035 137622 174463 -80800 -239470
6630 -239470 -333855 -303801 -46936 34079 -130868 -153544 -200031 -22196 -117576 -227776 -220709
6619 -220709 -174804 -22806 36363 78462 144954 16738 61628 208240 179166 83985 -184888
6608 -184888 -259653 -107103 -235471 -314725 -397867 -346944 -288126 -91730 -234103 -331913 -257045
6597 -257045 -199505 -337058 -344763 -78319 112236 225387 267086 221526 138406 132860 289012
6586 289012 183970 34537 11545 55223 25923 -23812 -32926 -149064 -85345 84395 30456
6575 30456 124694 96512 15402 206362 213025 57580 27146 -185352 -90306 75809 110741
6564 110741 118192 47759 -82835 -46206 -2235 94303 -15225 -78380 -36525 94466 66447
6553 66447 61911 118390 31672 192411 284858 226086 35618 -19033 175216 207382 128904
6542 128904 116918 124664 81351 62014 -93060 -142864 6851 26540 -73553 -149466 -162199
6531 -162199 -102056 -71238 -79236 -61441 -117604 -36208 65639 234578 145550 -44841 -4422
6520 -4422 -131533 -148008 -97391 29287 -129440 -99382 175948 333675 378526 386284 62658
6509 62658 -223366 -127616 -85545 -130561 -71467 113286 142293 63182 94981 -69103 -285925
6498 -285925 -389441 -476433 -313982 -267499 -88918 68867 94168 -29997 -107389 -117378 -63975
6487 -63975 -73663 -63264 -99905 -18183 -152013 -180238 -12980 29123 -55999 -100762 -110671 91237
6475 91237 49344 65362 56672 60913 -73910 -168460 -265204 -289363 -111333 -13444 -235560 -254166
6463 -254166 -229902 -163867 -59197 7792 61981 111707 83482 93410 103499 139318 302912
6452 302912 428537 257767 31336 82463 80114 113835 197695 192819 320317 353634 149925
6441 149925 137207 117400 144514 159259 -134602 -341566 -232097 -44100 -3874 -90393 -224561
6430 -224561 -193191 -86546 25301 94454 150555 147019 12436 -242729 -379902 -96615 109076
6419 109076 50112 -35539 -106755 -55060 -1980 -13089 -41837 -130261 -81482 -35870 -123846 -125372
6407 -125372 -188868 -116330 125574 159106 64332 -29173 -4223 45402 161654 212226 186960
6396 186960 279698 230123 214306 197334 239556 287620 409759 347876 143258 142547 -8109
6385 -8109 -296864 -261505 -138094 91692 236259 226654 109368 -32141 1665 198109 227103
6374 227103 141814 178463 171663 202342 114642 72339 35380 15672 -73623 203829 309900
6363 309900 139933 61411 98286 13481 28195 115713 165626 16121 -88143 12677 201426
6352 201426 268993 216595 141190 87898 78327 139198 166089 94096 161349 305681 384626 316496
6340 316496 79533 -11062 -2655 -109381 -216677 -250562 -246891 -66027 -31244 40950 113370
6329 113370 146633 65937 -82832 -30515 -177160 -95130 -151708 -85505 66756 -47088 -117998
6318 -117998 32612 129856 225746 217089 153187 -99806 -313884 -198154 56479 275109 190656
6307 190656 84608 85837 111224 145990 -20616 -186012 -202105 -147869 -243572 -312149 -201971
6296 -201971 -98487 -29675 -18066 163014 184973 -97600 -199856 -73180 -22930 56618 -72456
6285 -72456 -108220 -165191 -164135 -174272 -228781 -314654 -409419 -240616 107123 -4512 18942
6274 18942 -5548 4237 -91860 -83217 -103356 -249355 -349855 -406836 -238430 -198329 -268627 -147735
6262 -147735 -79757 18161 158175 49328 -1379 44173 52717 97350 27709 59081 160043
6251 160043 -3607 -173625 -114339 -120452 -289632 -350748 -418750 -170792 44392 157948 332028
6240 332028 428793 411503 175737 -62307 -136450 -101206 -166176 -142286 -130974 -171682 -106748
6229 -106748 -190179 -33121 -29684 -59296 -38025 -20304 34072 51721 55078 -156100 -180381 -6734
6217 -6734 108843 27334 77768 188055 7030 50783 83867 -103402 -183655 -237172 -217310
6206 -217310 -79373 55726 159513 210900 239186 134981 -43583 -20135 87546 41730
6196 41730 36055 -110047 -95217 -189879 -257542 -296305 -186587 68109 87591 -113287 -144871
6185 -144871 -16604 130497 64949 -102717 -171142 -133610 -152839 -89766 -114694 -59541 -113418
6174 -113418 -139357 -218062 -176462 -179187 -285329 -155394 -98787 33673 134354 11484 20191
6163 20191 272341 315476 341241 399067 477131 315630 -31215 -161522 -65592 -55840 -174908
6152 -174908 -177961 -18139 44588 109602 244401 -16304 -21453 -244203 -174721 47135 63522
6141 63522 98521 23656 -25955 120955 171018 178800 183516 81494 70993 129914 204201 132503
6129 132503 110186 -12237 24323 -2678 -204688 -368435 -344845 -239982 -76694 -21923 34082
6118 34082 140086 72699 -54546 -132808 -49495 -16185 -166447 -204430 -117641 -135959 -76495
6107 -76495 -179573 -219203 -184000 -271243 -247931 -212744 106700 203371 105606 -59140 71639
6096 71639 199767 81321 -46017 -124618 -37112 29854 -144907 -246521 -203807 -151505 -132868
6085 -132868 -26569 77277 -9170 -43775 73518 245067 208077 197728 59932 -29192 104196
6074 104196 288752 364966 295028 116541 43223 103402 111879 -30523 -279157 -376346 -403970
6063 -403970 -176712 24620 157201 340555 294756 121237 52452 -31487 14123 80352 102396
6052 102396 -61090 -199037 -206818 696 89227 208513 97242 42072 -18764 139128 306180
6041 306180 194371 58101 -33696 104 -9710 110288 172308 152546 -31345 -49016 217679
6030 217679 299679 174963 92301 -49890 -113994 -116490 -162930 -174131 -113301 -163475 -343747
6019 -343747 -266687 -54212 -76576 -116005 45875 200313 141255 -29402 -194935 -123487 71730
6008 71730 24955 -51567 19853 82214 50403 37678 -40095 -94482 -52010 -67235 80011 163116
5996 163116 132357 56923 -59618 96970 106571 63157 6686 -57430 -91474 -146451 -131502
5985 -131502 -212906 -254651 -271127 -163407 72970 195991 43672 -765 90425 71084 220010
5974 220010 241349 154252 164624 90363 18758 -54796 -30816 -120966 -164030 -176000 -70049
5963 -70049 -131691 -143123 -178049 -281651 -242642 -138723 -112126 -54962 70226 151279 144905
5952 144905 79653 -3987 -17484 68396 55211 101708 95464 85523 127145 -7471 -72892 -126430
5940 -126430 -146709 -49665 27417 -21890 61807 -12222 -72992 -112696 -139243 -96777 -123521 -73642
5928 -73642 78429 234874 319885 288198 198451 -119137 -299713 -193700 -197884 -133204 -179031
5917 -179031 -169815 -137535 -290122 -174553 -63996 -135882 -313717 -344291 -66908 220963 228015
5906 228015 154941 168857 227002 388417 470357 206664 75416 66769 -81095 158909 180762
5895 180762 70659 99310 93397 -48325 -234793 -217150 -91032 -129774 -207319 50282 211445
5884 211445 156207 93073 126746 61318 -73677 -22112 -102518 -137381 -120057 69953 245665
5873 245665 301390 194268 214833 269685 187771 63042 120832 137558 97020 17208 61717
5862 61717 29783 -112392 -211855 -172543 -327945 -272509 -234337 -194649 -230048 -57420 60367
5851 60367 50742 64418 -19051 -98074 -280539 -406617 -379338 -292925 -31877 61621 13545
5840 13545 21271 121771 162349 145830 6298 -43493 -75123 -59196 -15830 240004 296253
5829 296253 359715 265840 64305 13218 -164531 -133512 196202 200390 146312 149650 -32493
5818 -32493 -131037 -282434 -20292 221414 278045 185515 85427 -2636 -26708 -80580 -155695
5807 -155695 -304020 -199164 -5929 35054 -173292 -197089 -83140 -126653 -51871 149729
5797 149729 175560 185377 242332 3743 -114033 79998 265522 226148 120479 15686 4004
5786 4004 63814 123368 61872 162026 194911 63773 20339 26429 105338 32043 -191719 -369198
5774 -369198 -295017 -78258 66798 27338 -6027 137764 259031 289272 173999 -38216
5764 -38216 -106909 -143043 -58130 -4935 -68397 -45213 67777 -4531 -31618 -76188 -139964 -126190
5752 -126190 -66308 90877 117916 132391 89643 30663 83685 24622 -17694 97538 145865
5741 145865 94359 -38092 -149441 -236085 -240921 -287336 -173087 15911 58072 268798 303722
5730 303722 291602 145100 48396 77513 -42588 -20347 43866 72661 34817 28342 94127
5719 94127 59787 334780 300301 159378 144774 -10030 -74299 -64125 127332 160994 237027
5708 237027 138451 21741 -132473 -31886 -47165 -188004 -367635 -188171 -57344 164325
5698 164325 226283 5971 -50383 -33591 27681 -1631 -158917 -233934 -131535 -237239 -314541
5687 -314541 -68330 130983 -22552 -166261 -151563 -97741 -15819 -20764 -156083 -325350 -424698
5676 -424698 -277653 -225926 -260881 -70368 -46275 -162082 -212438 -95509 -85349 -41116 24330
5665 24330 -15420 27326 153273 137139 148197 247981 129065 -87138 -124073 -126464 -148495
5654 -148495 -213186 -126089 -36737 -121408 -175098 -210377 -90868 137061 170952 166445 270630
5643 270630 150806 136377 50080 147024 120057 -77786 -108107 -71846 -281841 -331411 -155753
5632 -155753 112398 157335 232312 229894 293065 75499 -54827 -64847 -197189 -78578 176208
5621 176208 149400 64418 65729 60541 129087 125254 31630 127333 115379 19361 18718 -112772
5609 -112772 -201603 -158192 -129537 -224025 -201946 -64258 97437 72076 107111 43073 -1059
5598 -1059 -25513 -13399 -157526 -279673 -137913 -238811 -350819 -223101 -93287 -72937 -117111
5587 -117111 -47579 -3929 -57422 -84230 -86210 16231 70584 54023 11579 16268 30311 -2354
5575 -2354 9760 -21483 -69873 -45187 -56988 -204713 -178906 -127590 -179000 -143435 -57538 42794
5563 42794 -75796 -123716 -79585 -16539 110825 -71083 -148729 -177742 -179518 -327419 -254532
5552 -254532 -123437 -341392 -317880 -98385 -7729 -70017 -19698 120594 139175 11845 139714
5541 139714 228050 231364 149815 172889 191469 201026 258036 253868 217333 219484 170408 -30571
5529 -30571 -13235 169581 218449 29418 -44876 -109429 -167732 -57396 -54915 -177306 -235173
5518 -235173 -215892 -165372 -58973 -86291 -51024 -101416 -31025 -222976 -298729 -202974 -192291
5507 -192291 -174718 -136903 -188336 -283135 -122419 177427 282657 149702 48151 151662
5497 151662 142211 72207 15031 -29130 50146 29495 -18759 64961 -252 -137870 -79403 45449
5485 45449 59465 150140 196960 94856 -33161 -212253 -171603 -98019 -142073 -176141 13883
5474 13883 43654 93819 -27340 11232 81004 137083 204459 21695 -112231 -137117 -94645
5463 -94645 26093 53524 32793 19073 -164466 -143314 15434 71602 86574 58234 -27008
5452 -27008 -6009 24177 1217 -125793 -183412 555 43680 243566 397573 378729 299885
5441 299885 204303 202045 127850 188754 138757 11382 -67879 -115073 -113107 -123060 -106147 23408
5429 23408 -165062 -7906 -182981 -311881 -171925 -57921 37711 74998 33867 -64645 -71104
5418 -71104 127011 145118 203631 71729 19425 152180 32852 90965 20733 -70155 -123384
5407 -123384 -197332 -316670 -333433 -185935 41819 203975 218392 81344 194373 115228
5397 115228 122610 7118 -16582 -147299 -96853 90728 283102 204076 151344 158831 222694
5386 222694 126290 82830 -62211 -108323 -133538 -68921 -129015 -153795 -62646 -21289 16362
5375 16362 -83494 -235556 -271373 -300566 -301201 -335126 -366012 -223337 -141763 -81621 64340 53998
5363 53998 -61481 -201818 -143649 -90893 -131918 -31545 115778 45957 -88827 25487 6636
5352 6636 -15477 -147055 -224016 -294103 -151998 14695 70549 59898 -31588 5470 139767
5341 139767 72069 -25337 36037 100724 101782 95563 -46575 -80915 -18412 -71576 -48689 -185869
5329 -185869 -128836 84135 57150 49650 -945 27983 -59835 86890 -1500 17189 55882
5318 55882 89136 4516 64092 50534 -109489 -136153 -3835 -22995 24866 14595 119517
5307 119517 288710 298448 40736 -162840 -217977 -89087 1302 56032 148843 216642 260004
5296 260004 308058 287310 206333 211522 140193 22725 -33524 -51276 117848 237526 296593
5285 296593 247512 200511 138931 139586 163493 50419 65213 71200 22979 -8124 -36406 32760
5273 32760 -84249 -91874 83582 223042 119330 112003 -331 -115801 -230744 -149644 -104569
5262 -104569 42344 205204 263270 186869 -23095 123623 -6192 -49805 19207 -36537 1669
5251 1669 -19329 -85557 -65586 79826 120925 132705 229210 68818 -59262 -117212 -128348
5240 -128348 -184495 -296216 -269731 -206595 -96766 -216758 -235354 -16513 -12917 -66145 75323
5229 75323 70583 84320 -16952 -96105 -152158 -229888 -55665 -16968 -63124 -79737 -87726 -67525
5217 -67525 -121945 53555 50347 -56165 -80085 -135930 -177467 -199878 -359233 -391400 -153394
5206 -153394 -140328 -294457 -219435 -75213 -101334 -298129 -266101 -68401 -18488 -216036 -250354
5195 -250354 -313367 -169726 102865 85798 -76433 -137273 -254006 -205018 -216108 -125978 -68982
5184 -68982 -60169 -14032 57888 34793 16777 85122 -74 60009 170628 126435 -17543 49249
5172 49249 64766 95143 64361 126547 318766 439968 305552 -62800 -77469 -76312 1723
5161 1723 79703 158672 138725 58476 227221 293439 114184 23202 140212 109785 91152
5150 91152 193377 436071 274340 163596 170369 -58684 -165397 22773 129463 20222
5140 20222 -64064 -94974 -47859 -341682 -265547 -123350 -69606 -26580 -34624 58099 93443 83099
5128 83099 264253 286616 215918 57326 -130522 -32369 86565 195714 151057 -80656 -77725
5117 -77725 120455 123372 136972 157816 34511 5254 -132429 -54765 -2311 -65632 -14016
5106 -14016 97724 -86736 -94592 -67584 76226 238270 171738 45858 40759 90415 27008
5095 27008 -15535 21126 19889 -73547 -192502 -141268 26473 79608 65124 -27800 134327
5084 134327 190397 173697 166212 257647 417224 490103 402981 164865 22369 24909 94292
5073 94292 -65823 -212918 -270701 -157506 -92121 -132265 -299911 -406456 -277965 -30208
5063 -30208 82379 118507 148874 63568 -72671 -31487 38859 -96083 -98656 -80666 -3009
5052 -3009 56580 71717 -25442 -124351 -191464 -247255 -185069 -60653 45353 195235 96407
5041 96407 20640 133244 138114 92626 -22888 -123591 -150001 -113452 36732 177106 140546
5030 140546 57198 57395 -34143 -225296 -230158 -145902 -131335 -46337 17992 170459 91316 57835
5018 57835 109645 275301 355051 359476 148083 -232728 -473772 -347052 -223659 -180890 -229530
5007 -229530 -278561 -253090 -210586 -159897 1768 29000 47774 183751 189909 279206 206822
4996 206822 -79620 -34110 -12 -92201 -140290 -79494 -74324 188175 292299 100989 40873
4985 40873 1027 81305 40232 -9284 -53607 137281 154908 18207 65981 70097 55241 264128
4973 264128 343501 161237 -87008 -24971 20415 -109724 -146719 18704 -43482 -90730 -28456
4962 -28456 -134928 -75981 -16962 51172 191295 231416 -9273 -213372 -158365 142 49529
4951 49529 -36170 19300 135797 149894 -15385 -110980 125241 143732 -38752 -25048 -143491
4940 -143491 -195390 -208441 -219285 -243450 -312528 -206504 -153468 -32873 120484 168401 115827
4929 115827 128033 115724 109999 74179 51080 -29272 -103680 -219905 -242313 -299759 -153496
4918 -153496 -44146 -52416 6411 101825 98670 46465 -52274 61611 95321 115660 45953 111178
4906 111178 277358 243751 348892 463034 431720 216343 81715 235028 180597 99536
4896 99536 7150 49994 79090 68823 75096 122849 -15676 -132769 -199077 -85898 -22205
4885 -22205 -46050 -154759 -98389 3459 -34553 213406 329885 432149 319903 266044 76732
4874 76732 -2916 -23563 234967 400253 551643 556346 316325 151057 -4984 -11768 -30287
4863 -30287 43869 102091 217169 113736 -99052 -249088 -244315 -274095 -196227 -115174 20851
4852 20851 81649 41471 -63213 -42327 -46987 -111763 -37210 152073 177747 -15003 -54208
4841 -54208 -32377 -42905 -157765 -131711 -37114 -67225 -32178 -119506 -206845 -186356 -35709
4830 -35709 6573 7020 -77329 -28329 -101339 -26122 154972 155634 149007 12237 69698 288859
4818 288859 157391 186336 259102 343187 266803 198037 -46156 -120175 -48507 -37384 -2416
4807 -2416 7145 -65782 -128922 78629 166104 76406 24216 -162851 -144549 -44762 -23368 -57208
4795 -57208 -129511 -77139 -20736 48366 -92355 -148415 128786 197616 89845 151987 179795
4784 179795 148230 201132 157679 -111149 -171931 67734 432373 710459 563126 257224
4774 257224 14982 36783 96894 -200911 -315378 -201531 -321770 -341199 -170029 -190283
4764 -190283 -196721 -115762 94639 242001 251962 124411 -111706 -109618 67353 98609 138434
4753 138434 -72303 -168240 -124298 5511 38403 94633 224644 225251 504 -208673 -148900
4742 -148900 44103 55154 -127965 -345152 -346272 -458745 -253308 -202522 -246983 -206040 -211559
4731 -211559 -50040 -35959 74378 187588 148832 16667 -84401 -162411 -238368 -236263 -173297
4720 -173297 -309244 -322423 -237096 -216665 84754 94974 328437 343781 -5089 -187201 -268177
4709 -268177 -158261 -9347 81587 128823 126903 -8834 -107195 -60253 -165977 -34370 147690
4698 147690 159719 201860 205579 264653 329620 449080 234034 171061 340695 362480 268667
4687 268667 119988 -24311 -105289 -23789 30111 105094 92527 24276 -65392 -65306 -23339 -1745
4675 -1745 100834 141069 115944 171683 272489 243982 167456 160431 75039 14028 4915 -8800
4663 -8800 3075 63606 126435 127938 13487 -31889 -24265 -136602 56992 252173 280255 254467
4651 254467 399361 412711 402648 254351 136477 -1724 42423 -13037 -11123 39329 261002
4640 261002 338532 274071 29371 -121699 4973 215628 301052 162683 94228 238124
4630 238124 240265 263217 123821 -101396 -36829 -51310 32888 190963 161683 68072 -2090
4619 -2090 -76514 -74330 -132355 -93206 37110 154082 -8602 -182144 -157424 90959 104575
4608 104575 139699 172633 96340 43783 23753 145286 160714 166756 84341 -87045 -229905
4597 -229905 -248891 -123940 16318 -61395 -17563 -58495 -8257 -82997 -62801 116191 129914
4586 129914 20692 51907 56824 71472 162634 108678 -16558 40377 -9880 44261 -12805
4575 -12805 -77459 -118776 -136732 3267 28179 79449 36194 -10862 -46893 4274 280237
4564 280237 219518 -63499 -60895 -97346 -111579 -79053 8638 197570 195283 30951 -110261
4553 -110261 -188260 -148326 -255500 -267018 -261183 -245441 -194126 -11450 35999 136057 139162
4542 139162 33301 -28135 6412 2318 177840 194945 -5138 22292 185217 219615 159935
4531 159935 -91375 -152357 -87385 -64839 -5580 118027 260565 107565 110080 229197 246842
4520 246842 177799 273245 159920 -54847 -74886 -51740 151273 225677 51490 74183 -8682
4509 -8682 -242267 -201507 -243889 -132119 -119735 -2363 65803 51539 -5120 -208760 -310366
4498 -310366 -38312 151674 93526 -121370 -82199 208945 25207 5236 146388 247298
4488 247298 159411 158023 195603 87859 215113 96213 714 167376 154760 -86004 -74677
4477 -74677 -143630 -180644 -35139 -32094 34546 -3613 -54112 -150516 -30131 4238 -9136 -20110
4465 -20110 -80491 -876 38402 129652 107170 48729 -170630 -269459 37286 106765 18323
4454 18323 -42153 71333 41452 -72112 15937 -134713 -70713 7450 -103568 -170819 -64946
4443 -64946 -47297 -15327 37246 167232 300098 133736 -13410 -137761 -257436 -128656
4433 -128656 -77524 25622 -63105 -108113 129730 221527 197502 221551 190173 175837 169408
4422 169408 109391 46307 -60776 -80480 -16811 -111862 -28973 -17147 41396 101516 24467
4411 24467 21563 1377 71511 63170 101886 38239 50659 -23555 -279487 -267158 -190519 -39942
4399 -39942 7098 -51347 94725 8016 47536 177653 244368 302581 105149 -91888 -175312
4388 -175312 -266125 -231333 -115230 -77483 -66470 -224233 -294473 -130721 -91913 32662 -9111
4377 -9111 55491 139038 148923 104056 -54213 -45419 -136029 -149239 -83171 -44314 -21144 -29112
4365 -29112 -156756 -268961 -236400 -229041 -330828 -350695 -199236 -54922 -64073 -66473 -116010
4354 -116010 -145432 44847 115183 -146309 -83127 -44885 -165349 -154579 -76207 186823 120900
4343 120900 -77809 -179845 -73868 -89151 -168418 -164240 -118920 -168106 -63351 11765 114881
4332 114881 162639 181659 61300 -19417 18355 37056 -43499 31201 141541 203935 173770
4321 173770 137967 9614 33824 36693 107412 254715 156988 80241 51068 89938 32241
4310 32241 -44801 -171359 -320280 -234023 -216523 -269566 -200585 -268201 -349087 -271503 -233473
4299 -233473 -67083 -101743 -102405 10790 73156 113700 11261 -37897 -288 -73693 -251240
4288 -251240 -78642 -20373 -215976 -265706 -288810 -163646 -46203 -38882 -67444 -78306 -143961
4277 -143961 -80883 -117694 -98027 10544 -121508 -160917 -154155 -220117 -332142 98958 173809
4266 173809 65426 27617 -38255 -192873 -326658 -271686 -271138 -298024 -185953 68735 -19789
4255 -19789 -127385 -289840 -308033 -168942 -2075 -14100 49926 -116187 -198686 -99414 97243
4244 97243 119416 226086 135569 -99111 -319866 -333922 -146962 -101780 -152593 -97385 -283604
4233 -283604 -321799 -438000 -522931 -347212 -60568 -1832 -70438 -276994 -381488 -388442 -337022
4222 -337022 -375832 -343800 -194792 10818 61749 -119417 -194383 -108717 25743 -13122 -138832
4211 -138832 -260535 -303741 -388949 -230314 -113514 -48204 -78067 -62200 -132753 -141956 -240936
4200 -240936 -193467 -367960 -297626 -378045 -325301 -129587 52828 176332 135938 114574 94495
4189 94495 91764 111039 111617 -19732 -150446 -116555 -62117 80473 113237 271708 208228 247465
4177 247465 148558 55721 -109767 -126351 16408 -21841 -78783 29030 96638 187394 181459
4166 181459 -386 -86983 11509 51502 -52696 1392 65201 63701 164044 172496 75336
4155 75336 17590 145910 195373 128522 -25244 -46093 -72944 19512 234732 166889 44058
4144 44058 6510 55778 155749 187221 36071 -41141 -170556 -278105 -205901 90741 82130
4133 82130 -116263 -146253 -99133 26762 171026 219180 93159 2560 105745 266353 186707
4122 186707 15539 23137 153535 67486 81231 69602 -29318 46271 -39719 -197651 -223478
4111 -223478 -102526 -52855 21807 99697 22956 55183 110320 22787 92380 -74253 -43688
4100 -43688 75262 210871 8112 -71546 32044 53035 44546 112725 131072 27150 -33313
4089 -33313 -8278 13681 -42190 -33020 -48888 -100445 -204148 -256876 -383425 -279471 -291337
4078 -291337 -257712 -281511 -290380 -252441 -288799 -204052 -302479 -321550 -229231 -76592 -65557 17522
4066 17522 71604 82186 835 13520 -104006 -91638 -19980 95923 271758 240883 188892
4055 188892 127812 81157 14806 74932 158089 71254 93381 191631 -10797 -65873 30697
4044 30697 86089 74918 94349 8132 -90911 -176524 -184075 -193151 -200192 -67110 80229 143897
4032 143897 278215 355288 297973 403583 396568 286418 344879 20170 -98169 208886 444724
4021 444724 289091 310636 333468 209261 -82882 -339863 -321924 -160366 -137452 -61195 47084
4010 47084 181965 156665 12963 -34096 73927 134677 221068 145659 90339 22082 64177
3999 64177 102600 105671 22293 -18613 -69104 -182674 -276531 -258197 -173955 -229530 -166870 -45352
3987 -45352 -103364 9375 110212 161671 82291 5896 5040 34268 -34704 159937 109202 96783
3975 96783 72723 14721 -169706 -252013 -133588 -239450 -218611 -37752 -2679 -41130 -239872
3964 -239872 -186676 -233682 -208537 -72697 -8792 125627 131543 145299 89199 39195 -5080
3953 -5080 -73555 -157028 -159356 -203136 -208165 -173165 -110558 -182170 -157896 -60797 94005 76939
3941 76939 72159 102217 123656 7087 -173577 -144345 -128285 -135113 -28223 10694 196919
3930 196919 131895 1124 -149117 -333456 -360808 -335533 -395203 -315327 -122293 -63318 -46992
3919 -46992 -88058 -111210 -17461 91578 294923 151040 93027 -630 -33807 36025 -11909
3908 -11909 -75662 -8793 -129959 -242724 -341692 -247461 -122918 -82607 -191853 -313959 -405501
3897 -405501 -215218 -99134 -226440 -188617 -198992 -206465 -73406 20807 13328 160841 123297
3886 123297 -152934 -360443 -453517 -304976 -126274 30156 -12120 56522 -1861 102620
3876 102620 205335 -6608 -210937 -261595 -113256 -173979 -233198 -207143 54937 194573
3866 194573 35438 76705 148416 44695 -17456 -35346 86645 165857 40536 -132977 -103816
3855 -103816 -43601 52074 -63927 -149382 -149279 -134190 38001 105855 -102410 -188471 -97274
3844 -97274 -76763 -23341 61816 207318 170841 37374 11089 84056 148219 305279 263240
3833 263240 48246 -2486 161668 214170 155800 64338 -69647 -176761 -239958 -171980 -87954
3822 -87954 116408 165593 148852 95132 30920 -48342 -226839 6196 148917 36859 -112208
3811 -112208 -110142 -79387 -147870 -152357 15676 79833 97765 153185 -8422 -135039 -136798 -108578
3799 -108578 -66102 9205 112058 20903 75251 87000 67035 -144682 -239341 -142001 -18812
3788 -18812 58960 99423 -136812 -350940 -262481 -197915 -41935 74277 -123770 -211933 -167668
3777 -167668 -71828 23547 220074 310159 264660 178814 -30897 24401 184377 267064 291679
3766 291679 73241 -123117 -113539 -2314 90400 65536 33421 19766 55584 135907 85797
3755 85797 -5102 50512 100820 97663 157800 71422 135423 51331 -81637 -40409 -83139 87598
3743 87598 218350 101146 203635 104877 100786 85187 119965 182669 428191 441872 376685
3732 376685 140729 105499 213903 139374 73031 69893 105431 -7105 17871 -3935 55698
3721 55698 223499 69989 13094 50635 -29568 -166055 -31776 24515 28002 63311 11690
3710 11690 -55479 -126596 -153160 -24649 -30158 -86084 -103621 -34522 219203 405558 417463
3699 417463 277772 239070 104549 -13324 10521 -18549 -34279 -69689 -88928 84319 93865
3688 93865 -70482 22283 -16924 -104980 -122831 -82399 -3438 115453 124131 109737 61711 97419
3676 97419 -137842 -177867 -102284 -267236 -316021 -155790 -149194 -212147 -51918 -125402 -283015
3665 -283015 -232655 -128315 -137055 -83396 36463 97643 41580 -105304 -100525 -52044 -216697
3654 -216697 -246512 -33210 -10464 -118787 -362141 -253681 -203663 -228593 -181478 -168092 -244426
3643 -244426 -273279 -269847 -132899 -57955 -144804 55123 28252 -180773 -57505 175650 155709
3632 155709 145103 121799 63265 155686 189868 152070 28440 140490 126419 40671 -10559
3621 -10559 -69656 10636 112623 76480 44970 -135158 -143271 -39765 -21605 27654 -52191
3610 -52191 -108314 -302706 -320098 -177311 -31070 78100 -6999 19712 -127116 -36948 144007
3599 144007 199374 142766 218468 194895 132370 84952 -95620 -94945 -144507 -33004 5891 56852
3587 56852 166977 81341 -80228 -140347 33007 252723 188998 135014 89688 -1939 -178830
3576 -178830 -137461 54449 40488 108732 143137 -36504 2099 128807 228791 230474 266990
3565 266990 229020 -40413 -167495 -61083 83271 75650 -41063 -81416 -78999 120859 246288
3554 246288 13485 -16526 -12566 -164037 -180554 -193279 -194342 -180115 -184796 -117015 -142215 -112654
3542 -112654 -259773 -220624 -178821 -234385 -259635 -197968 -115731 57113 93344 74853 71253
3531 71253 -45429 -92510 -69026 90473 73976 66909 -1041 -74474 -134447 -89 20350
3520 20350 209409 75528 -22684 -29271 -28281 -191120 -39690 -90247 -309517 -406243 -370952
3509 -370952 -123601 -22960 90011 -47625 129664 272120 240575 203636 201957 -3778
3499 -3778 -116485 8872 85668 112704 286055 325681 360587 389533 173430 108182 -20250
3488 -20250 -68782 -73309 -55561 -11534 43060 290280 525634 528570 397494 249981 101982
3477 101982 -28821 -36519 8532 -30358 -53820 -81195 -223061 -209939 -32544 125686 -80980
3466 -80980 -69599 -72571 171159 353972 368484 228108 149331 98784 -108053 -186667 -109002
3455 -109002 -161209 -104922 -38366 -158037 -289273 -242067 -211894 -73549 207746 255754 138246
3444 138246 64173 98229 -39568 -173321 -366864 -471601 -254286 -78280 108754 230276
3434 230276 151457 20764 -77316 -120784 24440 213134 390748 224962 56774 -38039
3424 -38039 36339 -36945 -12819 209146 165126 21168 117219 135035 219893 252414 71232
3413 71232 3228 106345 133843 144298 -17115 -261791 -293571 -280429 -308180 -82450 14354
3402 14354 -22127 16478 71192 -198474 -319470 -283260 -146783 22397 -5935 -47589 92046
3391 92046 95412 72519 116702 68034 -179895 -220376 -256864 -272303 -272319 -55454 -60597 -71174
3379 -71174 -153624 -94629 -155651 -136033 -219032 -85554 -68834 -120293 117016 245251 377417
3368 377417 319744 228588 54388 103400 48447 -113770 -161696 -70331 53773 -21406 -109638
3357 -109638 -102251 -123426 -35607 100945 103494 -45752 -89882 -62317 -140859 -95921 -178476 -231933
3345 -231933 -189898 -195200 -51642 -104884 -16279 45886 42832 -24199 43458 256232 213727 158228
3333 158228 25659 -31419 -138943 -97443 -39390 175975 277400 39166 156749 270705
3323 270705 122005 -46107 -149775 -133432 -136159 -151883 -214727 -200971 -328114 -306105 -356020
3312 -356020 -161121 -82045 -87921 -12432 -97227 -75408 -13451 71076 -8668 -145364 -108362
3301 -108362 -186634 -257778 -264479 -98046 91552 126604 -5373 -101046 -143227 -82265 -91869
3290 -91869 -33177 207135 249564 222338 21990 -121265 100536 240273 195064 94548 120525
3279 120525 109702 92198 125504 217431 258458 319191 203579 73339 105016 123548 200002
3268 200002 144614 142663 196569 283407 249066 179733 168273 181287 65194 108583 91583 195176
3256 195176 224238 211001 211564 116233 -55928 -31281 6780 32341 -73746 69008 238067
3245 238067 121253 29198 4373 76079 185388 163155 102688 -138794 -135122 43415 0
3234 0 -78466 60764 61757 68761 77172 20668 -2151 -84655 -178527 -98570 57719 191505 114762
3221 114762 13473 30940 371191 316375 98319 43499 64473 80319 42281 119688 53675
3210 53675 -98023 -110049 36330 88969 71833 -150259 -122150 -102161 -116826 -165260 -261224
3199 -261224 -228887 -185297 -101364 7499 249464 63168 7779 171874 186795 117455 66925
3188 66925 102505 16776 -139878 -277474 -217509 -117509 -128625 -30381 4690 -34131 -13919
3177 -13919 -80303 -170172 -152915 -172596 -97345 -43230 15975 -76320 -56193 -32903 -15866 -24520
3165 -24520 164262 114718 63930 123687 129399 35544 -64796 -171968 -202855 19801 387577
3154 387577 312024 109682 79705 105084 130218 199491 231634 126957 144005 155020 71615
3143 71615 127541 223521 299898 205008 117750 182219 96448 128433 -96612 -140162 32241
3132 32241 117388 167146 68787 73128 266039 266570 246449 134878 143703 281366 152808 72152
3120 72152 -38499 -91501 -181316 -363392 -283865 -194345 -299350 -179073 -144403 -96121 96591
3109 96591 172666 77969 122592 198400 87960 -58748 -171252 7077 27648 46404 27477
3098 27477 21716 172344 338390 279519 102127 -293615 -322810 -46868 14070 -129373 -211785
3087 -211785 -50294 -134071 122258 260411 220968 262265 132825 -62908 -26277 -29766 148644
3076 148644 268664 317359 293722 149645 26201 25696 57738 14668 -98881 -116382 -79331
3065 -79331 -102052 -81758 -87272 -99294 -31470 -113409 -98144 -61197 82044 24075 66744 78212
3053 78212 85013 44793 -80977 -17718 148434 69028 -87930 164210 477488 267747 31958
3042 31958 -72984 -120079 -8913 90580 40649 -140876 -73660 104908 -48037 -265628 -293334
3031 -293334 -296467 -147010 -19475 -38697 71915 85569 124649 251045 173890 86500 148412
3020 148412 -30244 -98352 -55881 -141701 -238116 -166787 -130068 59266 258307 140172 31781
3009 31781 -164897 -295873 -316350 -176725 -130908 -94757 -61892 -46585 3500 80961 71582
2998 71582 79501 5102 22555 101898 114069 54932 67564 -159984 -295794 -338719 -184526
2987 -184526 -276471 -293551 -95372 -141432 -197211 -166557 -114039 -97831 -56496 -109670 -155176
2976 -155176 -124624 -66476 -130938 -145247 -111585 -25241 61721 145964 64455 126773 22954
2965 22954 -25248 48288 236550 86821 -180060 -231493 -173472 45079 47114 -50265 -183915
2954 -183915 -180880 8377 60490 -12644 -15756 60383 89450 -33510 -52579 29857 179995
2943 179995 155226 -139697 -245672 -205145 -57629 -68337 -53998 -62479 -25850 -48248 -67869
2932 -67869 75222 -23715 -187748 -42476 107983 120253 151997 -48889 -148689 -94817 -226507
2921 -226507 -244314 -117581 -36006 52231 37865 -42048 36954 161090 307591 264572 229804
2910 229804 83635 78479 3798 -30379 -76986 35333 76419 -126880 -142116 23148 149971
2899 149971 162440 -20972 -261471 -325200 -190391 -51695 -16191 -174281 -223279 -167024 -169752
2888 -169752 -30771 44578 -34737 -59691 -19942 23879 -4009 -18019 149869 161458 82748
2877 82748 125577 148685 -58319 -142359 -73563 16364 -99630 -24464 43687 -43636 -347228
2866 -347228 -199831 19 -153177 -177874 -397621 -548792 -511791 -373221 -238715 -123484
2856 -123484 25189 -46174 37171 119153 58 -41405 116968 210688 236895 220206 43460
2845 43460 24113 128620 167304 15405 -81951 -10462 89208 28714 -54028 135554 199099
2834 199099 192652 288388 319370 329778 324880 144151 9873 162201 -63118 -292604 -353056
2823 -353056 -355967 -301291 -215251 -370188 -443266 -406199 -275458 -107557 13328 10914 -11613
2812 -11613 95267 172898 221620 155204 -10088 27073 -61451 -205644 -211974 -114904 35327
2801 35327 80643 45801 28394 2491 53449 60640 -24592 -130362 -62821 55557 78673 -24610
2789 -24610 -116078 8871 237697 103900 146991 174230 87038 -120467 -107530 -45659 -50726
2778 -50726 -76476 -165020 -91964 -137187 -24618 -5888 -57907 -29693 29475 25175 177170 213178
2766 213178 140093 17650 121682 186924 200186 63054 -92781 -48350 -61177 -325139 -252855
2755 -252855 -90345 105054 84324 74931 272868 245234 223123 31941 56708 312926 297359
2744 297359 125003 -144495 -184198 -182190 -19806 -142667 -228476 -170345 -225910 -187022 -142211
2733 -142211 47129 185409 37811 -118855 72036 108107 -72248 -83257 2541 16129
2723 16129 44179 -14264 -138048 -26360 208614 219114 -36997 -202665 -56772 111924
2713 111924 43576 -79408 40608 213887 327754 288527 178046 15457 -111342 -2623
2703 -2623 180127 251697 224310 144232 -72756 -80240 22696 221215 208385 140676 66533
2692 66533 91478 6650 61297 84428 76333 9458 -147041 -90384 -48675 -60405 -38179 61770
2680 61770 132184 148248 -44475 16347 88171 82501 4718 81516 179577 161505 -88411 -316199
2668 -316199 -176335 -28994 -55194 -94115 -114313 -149629 -276693 -363935 -290942 -299944 -210733
2657 -210733 -276572 -435254 -288705 -21566 29004 2826 157950 138931 103143 -32202 -175596
2646 -175596 -107107 -93360 -178804 -199093 -235890 -185764 -189061 -361846 -457100 -391044 -260152
2635 -260152 -36201 103144 64945 166817 200566 101632 194486 392605 257395 187652 234803
2624 234803 324426 255604 202128 247250 159554 70053 53358 -15069 -2219 134300 148613
2613 148613 8050 -67844 -31801 -5446 65224 147513 64260 75860 71750 65698 -278 43533
2601 43533 87960 77662 228536 180257 235543 228142 103626 19078 -44590 24543 -131308
2590 -131308 -37682 115900 158019 252882 149165 22543 -60821 -165930 -29719 228303
2580 228303 166833 -41267 -49297 63652 19690 -141571 -173962 -95549 99397 177373 146711
2569 146711 106722 -25851 -71828 -17582 64309 127091 118314 130988 157706 218651 221500 134432
2557 134432 -7895 -73176 122798 120431 94010 28062 -116870 92587 193308 24453 134948
2546 134948 109700 34423 47023 -43527 -123319 -42909 266379 254793 56283 20048 -65791
2535 -65791 -181639 -171353 -105250 -2352 -25377 -38045 44450 2938 -157693 -163788 -121706
2524 -121706 -26035 31566 81249 -57654 -246929 -68562 13176 -234920 -130318 -186981 -136652
2513 -136652 57480 231759 268315 302662 354721 298324 261528 206776 155336 178855 127475
2502 127475 -74884 -176338 -21573 -86048 -185857 -208839 -202956 -41801 32781 49216 31850
2491 31850 -40481 -19329 42569 100352 111972 98012 146578 54426 41102 -9396 -10515 49509
2479 49509 135522 67034 35627 -135496 -171657 93264 275764 223061 -21720 -266108 -334271
2468 -334271 -327452 -254364 -6564 184517 158016 47968 -48896 -49972 -111733 -2653 19670
2457 19670 94233 106943 258499 294726 327186 149405 77274 -4172 -43314 50748 145963
2446 145963 -3548 141929 200889 123312 73911 122915 168224 374072 313856 56559 196667
2435 196667 190146 41030 65507 148796 -50822 -67932 -74967 -65495 29831 211076 131412 -26109
$$ [...]
##END NTUPLES=NMR SPECTRUM
##END=
