##TITLE=Analysis number 317307
Compound Code dp 01809
Project Code adrs
Chemist Name vekton
##JCAMPDX= 6.0         $$ Bruker NMR JCAMP-DX V2.0
##DATA TYPE= NMR SPECTRUM
##DATA CLASS= NTUPLES
##ORIGIN= Bruker BioSpin GmbH
##OWNER= nmr
$$ XWIN-NMR		Version 3.5
$$ Wed Feb 15 13:47:58 2006 GMT Standard Time (UT+0h)  MAYBRIDGE\nmr@NMR_250MHZ
##.OBSERVE FREQUENCY= 250.131544655141
##.OBSERVE NUCLEUS= ^1H
##.ACQUISITION MODE= SIMULTANEOUS (DQD)
##.ACQUISITION SCHEME= undefined
##.AVERAGES= 16
##.DIGITISER RES= 18
##SPECTROMETER/DATA SYSTEM= dpx250
##.PULSE SEQUENCE= zg30
##.SOLVENT NAME= CDCl3
##.SHIFT REFERENCE= (INTERNAL, CDCl3, 0, 16.522)
##AUDIT TRAIL= $$ (NUMBER, WHEN, WHO, WHERE, WHAT)
$$ ##TITLE= Audit trail, XWIN-NMR		Version 3.5
$$ ##JCAMPDX= 5.01
$$ ##ORIGIN= Bruker BioSpin GmbH
$$ ##OWNER= nmr
$$ C:\u/data/dgb/nmr/ADRS/16090/pdata/1/auditp.txt
$$ ##AUDIT TRAIL=  $$ (NUMBER, WHEN, WHO, WHERE, WHAT)
(   1,<2006-02-15 13:47:00.07 +000>,<MAYBRIDGE\nmr>,<NMR_250MHZ>,
      <created by zg, POWCHK disabled, PULCHK disabled
       configuration hash MD5:
       84 BC 41 DB A1 6E 1D 46 DA 25 12 A5 C1 ED C5 3A
       data hash MD5: 64K
       CE 17 83 C0 3F 55 C1 09 9B 80 6E A0 CB 77 96 CF>)
(   2,<2006-02-15 13:47:25.41 +000>,<MAYBRIDGE\nmr>,<NMR_250MHZ>,
      <Start of raw data processing
       ef LB = 0.3 FT_mod = 6 PKNL = 1 SI = 32K 
       data hash MD5: 32K
       6E 86 95 8C 84 C9 7E D9 7C 69 2F 31 06 43 E8 57>)
(   3,<2006-02-15 13:47:29.33 +000>,<MAYBRIDGE\nmr>,<NMR_250MHZ>,
      <apk 
       data hash MD5: 32K
       7B 4A E7 CD 3B 71 D9 E1 D3 B4 7D 3E 52 04 A8 FF>)
(   4,<2006-02-15 13:47:30.83 +000>,<MAYBRIDGE\nmr>,<NMR_250MHZ>,
      <abs ABSG = 5 
       data hash MD5: 32K
       F1 40 13 D3 D5 95 4D F6 EE 85 C9 24 86 95 DC 9D>)
$$ ##END=
$$ 
$$ hash MD5
$$ B1 2C 87 F8 5A B2 2C 01 94 52 37 65 BE B1 A9 73
##$RELAX= 
##$RELAX= 
##$RELAX= 
##$RELAX= 
##$RELAX= 
##$RELAX= 
##$RELAX= 
$$ Bruker specific parameters
$$ --------------------------
##$DU= <C:\u>
##$EXPNO= 16090
##$NAME= <ADRS>
##$PROCNO= 1
##$TYPE= <nmr>
##$USER= <dgb>
##$AMP= (0..31)
100 100 100 100 100 100 100 100 100 100 100 100 100 100 100 100 100 100 
100 100 100 100 100 100 100 100 100 100 100 100 100 100 
##$AQSEQ= 0
##$AQ_mod= 3
##$AUNM= <au_zg>
##$AUTOPOS= <31 >
##$BF1= 250.13
##$BF2= 250.13
##$BF3= 250.13
##$BF4= 250.13
##$BF5= 500.13
##$BF6= 500.13
##$BF7= 500.13
##$BF8= 500.13
##$BYTORDA= 1
##$CFDGTYP= 0
##$CFRGTYP= 5
##$CHEMSTR= <none>
##$CNST= (0..31)
1 1 145 1 1 1 1 1 1 1 1 1 1 1 1 1 1 1 1 1 1 1 1 1 1 1 1 1 1 1 1 1 
##$CPDPRG= <>
##$CPDPRG1= <>
##$CPDPRG2= <>
##$CPDPRG3= <>
##$CPDPRG4= <mlev>
##$CPDPRG5= <mlev>
##$CPDPRG6= <mlev>
##$CPDPRG7= <mlev>
##$CPDPRG8= <mlev>
##$CPDPRGB= <>
##$CPDPRGT= <>
##$D= (0..31)
0 1 0 0 0 0 0 0 0 0.06 0 0 0 0 0 0 0.0002 0 0 0 0 0 0 0 0 0 0 0 0 0 0 
0 
##$DATE= 1140011216
##$DBL= (0..7)
120 120 120 120 120 120 120 120 
##$DBP= (0..7)
150 150 150 150 150 150 150 150 
##$DBP07= 0
##$DBPNAM0= <>
##$DBPNAM1= <>
##$DBPNAM2= <>
$$ [...]
##$SUBNAM7= <"">
##$SUBNAM8= <"">
##$SUBNAM9= <"">
##$SW= 20.6930455092707
##$SWIBOX= (0..15)
0 0 3 0 0 0 0 0 0 0 0 0 0 0 0 0 
##$SW_h= 5175.983436853
##$TD= 65536
##$TD0= 1
##$TE= 293.16
##$TE2= 300
##$TE3= 300
##$TEG= 300
##$TL= (0..7)
0 120 120 120 120 120 120 120 
##$TP= (0..7)
150 150 150 150 150 150 150 150 
##$TP07= 0
##$TPNAME0= <>
##$TPNAME1= <>
##$TPNAME2= <>
##$TPNAME3= <>
##$TPNAME4= <>
##$TPNAME5= <>
##$TPNAME6= <>
##$TPNAME7= <>
##$TPOAL= (0..7)
0.5 0.5 0.5 0.5 0.5 0.5 0.5 0.5 
##$TPOFFS= (0..7)
0 0 0 0 0 0 0 0 
##$TUNHIN= 0
##$TUNHOUT= 0
##$TUNXOUT= 0
##$USERA1= <user>
##$USERA2= <user>
##$USERA3= <user>
##$USERA4= <user>
##$USERA5= <user>
##$V9= 5
##$VALIST= <valist>
##$VCLIST= <CCCCCCCCCCCCCCC>
##$VD= 0
##$VDLIST= <DDDDDDDDDDDDDDD>
##$VPLIST= <PPPPPPPPPPPPPPP>
##$VTLIST= <TTTTTTTTTTTTTTT>
##$WBST= 1024
##$WBSW= 4
##$XGAIN= (0..3)
0 0 0 0 
##$XL= 0
##$YL= 0
##$YMAX_a= 516173
##$YMIN_a= -368837
##$ZGOPTNS= <>
##$ZL1= 120
##$ZL2= 120
##$ZL3= 120
##$ZL4= 120
##$ABSF1= 16.522
##$ABSF2= -4.171173
##$ABSG= 5
##$ABSL= 3
##$ALPHA= 0
##$AQORDER= 0
##$ASSFAC= 0
##$ASSFACI= 0
##$ASSFACX= 0
##$ASSWID= 0
##$AUNMP= <proc_1d>
##$AZFE= 0.1
##$AZFW= 0.1
##$BCFW= 0
##$BC_mod= 0
##$BYTORDP= 0
##$COROFFS= 0
##$CY= 12.5
##$DATMOD= 1
##$DC= 0
##$DFILT= <>
##$DTYPP= 0
##$F1P= 14.0000005364418
##$F2P= -0.99999901652339
##$FCOR= 0.5
##$FTSIZE= 32768
##$FT_mod= 6
##$GAMMA= 0
##$GB= 0
##$INTBC= 1
##$INTSCL= 1
##$ISEN= 128
##$LB= 0.3
##$LEV0= 0
##$LPBIN= 0
##$MAXI= 10000
##$MC2= 0
##$MEAN= 0
##$ME_mod= 0
##$MI= 0
##$NCOEF= 0
##$NC_proc= -5
##$NLEV= 6
##$NOISF1= 0
##$NOISF2= 0
##$NSP= 0
##$NTH_PI= 0
##$NZP= 0
##$OFFSET= 16.522
##$PC= 1
##$PHC0= 99.75103
##$PHC1= 4.445252
##$PH_mod= 1
##$PKNL= yes
##$PPARMOD= 0
##$PSCAL= 4
##$PSIGN= 0
##$REVERSE= no
##$SF= 250.13
##$SI= 32768
##$SIGF1= 0
##$SIGF2= 0
##$SINO= 400
##$SIOLD= 32768
##$SREGLST= <1H.CDCl3>
##$SSB= 0
##$STSI= 32768
##$STSR= 0
##$SW_p= 5175.98343685301
##$SYMM= 0
##$S_DEV= 0
##$TDeff= 65536
##$TDoff= 0
##$TI= <Analysis number 999999
Compound Code 99
Book Reference 9
Project Code 9>
##$TILT= no
##$TM1= 0
##$TM2= 0
##$TOPLEV= 0
##$USERP1= <user>
##$USERP2= <user>
##$USERP3= <user>
##$USERP4= <user>
##$USERP5= <user>
##$WDW= 1
##$XDIM= 32768
##$YMAX_p= 392961200
##$YMIN_p= -428194
$$ End of Bruker specific parameters
$$ ---------------------------------
##NTUPLES= NMR SPECTRUM
##VAR_NAME=  FREQUENCY,     SPECTRUM/REAL,   SPECTRUM/IMAG
##SYMBOL=    X,             R,               I
##VAR_TYPE=  INDEPENDENT,   DEPENDENT,       DEPENDENT
##VAR_FORM=  AFFN,          ASDF,            ASDF
##VAR_DIM=   32768,         32768,           32768
##UNITS=     HZ,            ARBITRARY UNITS, ARBITRARY UNITS
##FACTOR=    0.157963299565203, 1,           1
##FIRST=     4132.6476996994, 0,             0
##LAST=      -1043.33573715361, 0,           0
##MIN=       -1043.33573715361, -428194,     0
##MAX=       4132.6476996994, 392961200,     0
$$ Real data points
##PAGE= N=1
##DATA TABLE= (X++(R..R)), XYDATA
$$ [...]
17916A55471J5186J13923n0792P766r5569n4622n2534K3190n6763r1620O7356
17905a9008J26802o3615j3188O5980n3313j57066j903R4005n262M515O7787N0982
17893I6716Q4545P241j49017n607O7380N2555o4628n2688k14072j30040J25738
17882a81877K27090K3134J10087K3526r3476O3940K8941K1206Q3237k56650j7820
17871C1338j1896k8423N1471J20681m8773J8477k1246K2581M527O4643L662K8538
17859B35580N9542l0957J25726m1351p0613j5272O910L5911p7293r5822L7862
17848A70223L4545k2757M1362j6703J8356k4081j1179J31430J40413N1253K7798
17837E40660l0320j14319j7376p8453l9121m7901j17334k3669p8303O5753R2872
$$ plain form
17916 155471 170657 284580 233788 241554 145985 91363 38829 62019 5256 -86364 -19008
17905 -19008 107794 44179 30991 96971 43658 -113408 -115311 -21306 -26568 -22053 45734 96716
17893 96716 181261 188502 39485 33878 101258 153813 89185 36497 -177575 -307615 -181877
17882 -181877 45213 68347 178434 201960 108484 172424 201365 222571 305808 49158 31338
17871 31338 19442 -8981 42490 163171 114398 132875 111629 134210 138737 203380 207042 235580
17859 235580 295122 264165 389891 348540 277927 262655 269565 305476 228183 132361 170223
17848 170223 204768 182011 223373 206670 225026 200945 189766 321196 461609 512862 540660
17837 540660 510340 396021 378645 300192 261071 213170 95836 72167 -6136 59617 152489
17826A52489O5781P5442J3977J8710j3090j97915m7677J40857Q7035K2599Q9786
17815D07994n5068K3253L1996J03862J57957J06135O2470J81333J42999N6566
17805A219497n7544q3656j66258p9757L9173O206L305J7817J6238q1398k5978
17794H07645K8727O2400J31179L50435K70913P1198j0934j03597j26410k04676
17784A276880l04621k47438k02685j06625l9728K992o1270p0864l4475N8808j06604
17773A64370L1899P7256R7848l4882q0872K9130O8744J07922Q7730r2610j17553
17762C38982j66746m9768M4221J99358J73928j07302j07060O5118p8325j36524
17752A75882l0798J23095J12488j04559q8473J4043J15142K7101q2053J5208p8653
$$ plain form
17826 152489 218270 293712 307689 326399 313309 115394 67717 208574 295609 318208 407994
17815 407994 352926 376179 408175 512037 669994 776129 838599 1019932 1162931 1219497
17805 1219497 1161953 1078297 912039 832282 871455 877661 880966 898783 915021 833623 807645
17794 807645 836372 898772 1029951 1380386 1651299 1722497 1711563 1607966 1481556 1276880
17784 1276880 972259 724821 522136 415511 375783 378775 317505 246641 212166 270974 164370
17773 164370 196269 273525 371373 336491 255619 284749 353493 461415 549145 456535 338982
17762 338982 172236 122468 166689 366047 539975 432673 325613 390731 312406 175882
17752 175882 145084 268179 380667 276108 187635 201678 316820 343921 261868 277076 198423
17741A98423L7144O7953M3016J01030l511j17295j60659N3681J07420p5653l4579
17730B16970N6662r875k9925M1008o0745J0951N1388O1053N3122j22758l0059
17719B37792J63600J11677N3409J0030j28763j01522K4507J41002Q1114k9933
17709E62913j57139j06415r270J02713M1210r1392j35127J82220M3867n226p7589
17698C50765J9213N4187R5344O0650R3234r2069J1198O451j11701j52722j0648
17687C23902O0045L658j26192N641J3489M2051M1521j2072j65272p3333J9196
17676A32634N6031p8166l786J38240J33501M1522p5138N8778L1927L6470p538
17665D64475O6905J74752M1574j55350j0992L8598k8253Q2785p3487m9574j9019
$$ plain form
17741 198423 235567 303520 346536 447566 444055 326760 166101 219782 327202 251549 216970
17730 216970 273632 263757 233832 274840 214095 225046 276434 337487 390609 267851 237792
17719 237792 401392 513069 566478 576508 447745 346223 370730 511732 592846 562913
17709 562913 405774 299359 290089 392802 434012 342620 207493 389713 433580 428354 350765
17698 350765 369978 424165 519509 580159 673393 581324 592522 598973 487272 334550 323902
17687 323902 383947 387605 261413 267054 280543 322594 364115 352043 186771 113438 132634
17676 132634 188665 110499 106713 244953 378454 419976 344838 403616 435543 472013 464475
17665 464475 531380 706132 747706 592356 581364 619962 591709 674494 601007 551433 532414
17654E32414p4434N4661P7009L9249J01762Q9362P0017j3003J17935J69638Q2168
17643A246778K6548r1828N0030Q4377l740j93556p4315m9253j56512m6757L5949
17632H27721J16869J09432R933J7752J49379l4955j68242q8967j151r8702o6790
17621G72279R80j62699j24434R3270N4821j07242K6356N5679J26960M0014m041
17610G71943n3043O933J10536J34548J58149L326J7709j1300M4906L9434j74211
17599A048930j39888J43438J16494j2259j3475J14143J249P2098n4724J8831R1293
17588A386130k082K7360P2807j01193l183J3467J27773m4739M5529K17501L04485
17577B043855K68837J00426M1078L67769K80264K36203M05127M12593M30412K86565
$$ plain form
17654 532414 457980 512641 589650 628899 730661 820023 890040 877037 994972 1164610 1246778
17643 1246778 1273326 1181498 1231528 1315905 1312165 1118609 1044294 995041 838529 791772 827721
17632 827721 944590 1054022 1063955 1081707 1231086 1196131 1027889 938922 937771 839069 772279
17621 772279 773259 610560 486126 579396 634217 526975 553331 609010 735970 775984 771943
17610 771943 718900 725833 836369 970917 1129066 1132392 1150101 1138801 1183707 1223141 1048930
17599 1048930 909042 1052480 1168974 1156715 1143240 1257383 1258632 1330730 1276006 1294837 1386130
17588 1386130 1384048 1411408 1484215 1383022 1379839 1393306 1521079 1476340 1521869 1739370 2043855
17577 2043855 2312692 2413118 2454196 2821965 3102229 3338432 3743559 4156152 4586564 4873129
17567D873129J47336K040j46721j41995l00094p5681J41376Q1833J09819J42156
17557D833198K00150M73458N64081N22067N44259O53130Q81889J207566J122465
17548A1002263J493729K008717K434911L348162M493060N951276Q678567J2825671
17540E2236356J8867501K6920255L3937535L3971580K3416256M879699j4662674
17533A79566508k7595018l1760729k9112992k3094005j6496927j1377194p825616
17526C2304027n593311m025971k780607k120311j735447j569083j095113p18084
17518A2666100p37142l31686j01575M4178j0809j9726p8850l32159k73420O9111
17508A0894022L82525M78738L68259K54966q778j71917m0361K13524M02808P03874
$$ plain form
17567 4873129 5020465 5022505 4875784 4733789 4433695 4358014 4499390 4581223 4691042 4833198
17557 4833198 5033348 5506806 6070887 6592954 7137213 7790343 8672232 9879798 11002263
17548 11002263 12495992 14504709 16939620 20287782 24780842 30732118 39410685 52236356
17540 52236356 71103857 98024112 131961647 165933227 189349483 194229182 179566508
17533 179566508 151971490 120210761 91097769 68003764 51506837 40129643 32304027
17526 32304027 26710716 22684745 19904138 17783827 16048380 14479297 13384184 12666100
17518 12666100 11928958 11597272 11495697 11539875 11529066 11509340 11430490 11098331 10824911 10894022
17508 10894022 11276547 11755285 12123544 12378510 12369732 12197815 12157454 12370978 12773786 13477660
17498A3477660P73714Q77986R38066J072417J464905K062750K811247M053085
17490B7531830N581536P799696J1318057J6763557K4444540L4188951M1843475
17483A69471642M0059164K5491706K196597k1154641l5677228l9442490l5371842
17476A05572908k7317710j9383191j3203313r297193o596302m506493l527793
17469B1740913k942568k369154j855620j551593j258950j092025q49591p26195
17461I095217o60710o14766m30468k79415j96692p1774l6244M4705J34104J11142
17451G095099l268j29874l96923n54114p20881n55867m16053j86179k03335k56578
17441C672027j11539Q6538K66724p6305k47541m31265n16523l48613l51550j33765
$$ plain form
17498 13477660 14251374 15129360 16067426 17139843 18604748 20667498 23478745 27531830
17490 27531830 33113366 40913062 52231119 68994676 93439216 127628167 169471642
17483 169471642 209530806 235022512 237219109 216064468 180387240 140944750 105572908
17476 105572908 78255198 58872007 45668694 36371501 29775199 25268706 21740913
17469 21740913 18798345 16429191 14573571 13021978 11763028 10671003 9821412 9095217
17461 9095217 8434507 7819741 7389273 7109858 6913166 6841392 6805148 6849853 6983957 7095099
17451 7095099 7091831 6961957 6565034 6010920 5290039 4734172 4318119 4131940 3928605 3672027
17441 3672027 3560488 3647026 3913750 3837445 3589904 3158639 2642116 2293503 1941953 1808188
17431A808188k4846J33017m1951j69719j06790L3448q0473R189J3111k0112p0650
17420A482412p0073O4637K3878l7759j31193j125N6985N9669J03710J8231N1692
17409A621064J31118l6174j30223l2015K4264N320L596k1710J7579J2847J11816
17398A707482J56748M8384k213N0788l0944j09015j8002j53893j52162p4130M4816
17387A467859o7407j12331L0164K6581m2721p5354o2434N5252Q1246M7094n3660
17376A294289n9552J42253J1712K098O5960J3372j0810l0932j27454o7630J39067
17365A372373J40024J58896L7587Q0542J34161J90955R7974J4618P1353J02729
17355B401212q0899j51239m2193N0441P362K6885P3638J73490R5567l1703o7196
$$ plain form
17431 1808188 1783342 1916359 1874408 1704689 1597899 1631347 1550874 1560063 1573174 1553062 1482412
17420 1482412 1412339 1476976 1500854 1463095 1331902 1330777 1387762 1447431 1551141 1569372 1621064
17409 1621064 1752182 1716008 1585785 1553770 1578034 1583354 1586950 1565240 1582819 1595666 1707482
17398 1707482 1864230 1912614 1910401 1961189 1930245 1821230 1803228 1649335 1497173 1423043 1467859
17387 1467859 1400452 1288121 1318285 1344866 1302145 1226791 1164357 1219609 1300855 1347949 1294289
17376 1294289 1234737 1376990 1388702 1390800 1456760 1470132 1459322 1428390 1300936 1233306 1372373
17365 1372373 1512397 1671293 1708880 1789422 1923583 2114538 2212512 2227130 2298483 2401212
17355 2401212 2320313 2169074 2126881 2177322 2184684 2211569 2285207 2458697 2554264 2522561 2455365
17344B455365J26810k184J32092K37308J60805J16732O8019P6354J31555J24720
17334C627576J40719J15850O4605K57182K6373N6031N1914K00976K46848L78333
17324E166407M92594P34085Q06316R31554R20709O30228O46878Q38310R15112
17315A2082193J108685J461683J762688K010645K400504K963851L814000N151610
17307C2755859P237694J0412136J5213562K2365886L2320385L9708875L5178730
17300A95193127J8902547m436554k4081248l2119593l1339084k5273255j6947931
17293G9898009j0072027m852809p29850L244464P834664J3901647K2589696L4118704
17285A45932498M2406641L6572367J7061624q944410l0656662l9647128l8587720
$$ plain form
17344 2455365 2582175 2579991 2712083 2949391 3110196 3226928 3294947 3371301 3502856 3627576
17334 3627576 3768295 3884145 3948750 4205932 4232305 4288336 4340250 4541226 4788074 5166407
17324 5166407 5659001 6393086 7199402 8130956 9051665 9681893 10328771 11167081 12082193
17315 12082193 13190878 14652561 16415249 18425894 20826398 23790249 27604249 32755859
17307 32755859 39993553 50405689 65619251 87985137 120305522 160014397 195193127
17300 195193127 214095674 209659120 185577872 153458279 122119195 96845940 79898009
17293 79898009 69825982 64973173 64243323 67487787 75322451 89224098 111813794 145932498
17285 145932498 188339139 224911506 241973130 233028720 202372058 162724930 124137210
17278A24137210l1677102k2677124j5290709j0430235p452996n653651m160382
17271B6795011l041436k408055j893963j706710j377864j241164j017172r77013
17263A3131634j024956j095894j070300j006579q04915p11723n97104m99273m82812
17254E838078l85740m06687l60281k21500k78828l87447j45197k09702l24800
17245C117896j93349q6161r6637k62121j53588j63149q4168l3538J8427j4440
17235B049172q6738k16682j02061k0632L8398M6644j4467j22443j00559p8536
17225A392096J7688O2093j51574p3597j33043J1032J66350M1010j19659M6126
17215A258522J32094k0839j68155M092q4821l9495Q3671j7916P0406J69231q051
$$ plain form
17278 124137210 92460108 69782984 54492275 44062040 36609044 30955393 26795011
17271 26795011 23753575 21345520 19451557 17744847 16366983 15125819 14108647 13131634
17263 13131634 12106678 11010784 9940484 8933905 8128990 7417267 6820163 6320890 5838078
17254 5838078 5452338 5045651 4685370 4463870 4185042 3797595 3652398 3442696 3117896
17245 3117896 2924547 2838386 2741749 2479628 2326040 2162891 2078723 2045185 2063612 2049172
17235 2049172 1962434 1745752 1643691 1623059 1661457 1708101 1693634 1571191 1470632 1392096
17225 1392096 1409784 1471877 1320303 1246706 1113663 1124695 1291045 1332055 1212396 1258522
17215 1258522 1390616 1369777 1201622 1205714 1120893 1081398 1165069 1147153 1217559 1386790 1378739
17204A378739j1748o69j03785J0360j8772o757j5968Q0058r0652J7692j2338P1062
17192A297222R0591J8448k73J03237K3620q1331k4030K9828N4083j2939P1235
17181A569691J4069q6807l9982j82376n6507j8874L2743R0528J5598j58563r1485
17170A088035k01227j47446j9052O16n0293O1731r7270o9433M9418J30965n2595
17159F93449J17798P3395n2392N9702m4112p2010O5486j9648M486R8394p8281
17148H46267r2057j2435k0669p2624n3980P6744N8031J0176J8897M1900O4458
17137H64708J4996J9697K8244J3078M5126P0267N3132r1810j75199j14711k3988
17126G03540l4674K1284J26994k9992o578L7188N9781N004J3784j01434j97405
$$ plain form
17204 1378739 1366991 1366322 1262537 1272897 1254125 1247368 1231400 1311458 1220806 1238498 1226160 1297222
17192 1297222 1387813 1406261 1405988 1509225 1532845 1451514 1427484 1457312 1511395 1498456 1569691
17181 1569691 1583760 1496953 1456971 1274595 1218088 1199214 1231957 1322485 1338083 1179520 1088035
17170 1088035 886808 739362 720310 720926 670633 732364 635094 565661 615079 746044 693449
17159 693449 811247 884642 832250 891952 847840 775830 841316 821668 826154 924548 846267
17148 846267 754210 741775 721106 648482 594502 671246 729277 739453 758350 800250 864708
17137 864708 879704 899401 927645 940723 985849 1056116 1109248 1017438 842239 727528 703540
17126 703540 668866 690150 817144 787152 780574 817762 877543 882547 896331 794897 597492
17115E97492Q7833O0472L153J06634k1905O3165L0359R7019j6499P642m0534O8670
17103A043501J7953r9395k853M2464r0554j78690J2416K51837R6091J27006N8711
17092A278487K6916Q6559J03240j07713J893k3340Q506q7050J5740R8542M3997
17081A445777n8610q6415R3177J47494K7894L5831J40587O0619K1076j2616J4583
17070A829397J94842J39891L8601P7077K47613L75088J76926J27389K09272K99821
17060C715917L15746J94061J60391K36096L42515M90441M16152M34804M90779
17051F796902N81661N93574P04135Q96286J282662J663453K103579K650428L206484
17042B0479164M243174N717405Q215685J2036309J7987974K4878024K6836516
$$ plain form
17115 597492 685325 745797 748950 855584 833679 896844 927203 1024222 1007723 1015365 974831 1043501
17103 1043501 1061454 962059 959206 1001670 911116 732426 744842 996679 1092770 1219776 1278487
17092 1278487 1305403 1391962 1495202 1387489 1389382 1366042 1374548 1287498 1303238 1401780 1445777
17081 1445777 1387167 1300752 1393929 1541423 1569317 1605148 1745735 1806354 1827430 1814814 1829397
17070 1829397 2024239 2164130 2202731 2279808 2527421 2902509 3079435 3206824 3416096 3715917
17060 3715917 4031663 4225724 4386115 4622211 4964726 5455167 5871319 6306123 6796902
17051 6796902 7378563 7972137 8676272 9572558 10855220 12518673 14622252 17272680 20479164
17042 20479164 24722338 30439743 38655428 50691737 68679711 93557735 120394251
17035A20394251J5130767l132720j5102397k0509909k0743819j6490795j1157954
17028D8387424o862151l764712j378023O54266K746906N318812R049047J4196689
17020F8348258K0288468K2390704J2386360l936101j4421151j9169246j9593661
17013F6293631j5749354j0947741p284895m880967l256271k161121j692870j567986
17005A8752426j599612j367366j142303q45134l70558j02399N8356P9828K89433
16996A3752671J41717J79344L09524L34972Q34920J250753J723449K270643L065502
16987B3863495M609397O887787J0275151J5156615K0654601K0680146R208223
16980A11335415n237676j3556762j7163242j6508576j2446054q103383m994283
$$ plain form
17035 120394251 135525018 132392298 117289901 96779992 76036173 59545378 48387424
17028 48387424 41525273 37760561 36382538 37036804 39783710 45102522 54151569 68348258
17020 68348258 88636726 111027430 123413790 119477689 105056538 85887292 66293631
17013 66293631 50544277 39596536 32311641 27430674 24174403 22013282 20320412 18752426
17005 18752426 17152814 15785448 14643145 13798011 13427453 13325054 13383410 13463238 13752671
16996 13752671 13894388 14073732 14383256 14718228 15553148 16803901 18527350 20797993 23863495
16987 23863495 28472892 35360679 45635830 60792445 81447046 102127192 111335415
16980 111335415 106097739 92540977 75377735 58869159 46423105 38319722 33325439
16973C3325439k808396q71037O74045K469031M764090Q004917J2458071J7467272
16965G5483432J7927471P697417n650602j3182714j6416717j5856538j2434673
16958C7567076q551945n836911m100293l031957k406595j760949j396710j222448
16950I259268r17157p39005p64989n93532l91714l83889m40619m10650l12446
16941D305267k08693k50094r9512n0630k28976j81770k00598k49044k81973k22174
16931B331803j72199j79390j68534k09027q6403p8328M7862j8669j32404j35836
16921A198875j10471n8052o0705m0058Q100L106O3663J4995p2095o9948n0165
16910H27245q2798Q2556r980j04278l73o3567M909m4760L8332j9289j11934q6592
$$ plain form
16973 33325439 30517043 29646006 30320051 32789082 37553172 45558089 58016160 75483432
16965 75483432 93410903 101108320 95457718 82275004 65858287 50001749 37567076
16958 37567076 29015131 23178220 19077927 16045970 13639375 11878426 10481716 9259268
16950 9259268 8342111 7603106 6838117 6244585 5852871 5468982 5028363 4617713 4305267
16941 4305267 4096574 3846480 3746968 3696338 3467362 3285592 3084994 2835950 2553977 2331803
16931 2331803 2159604 1980214 1811680 1602653 1516250 1437922 1485784 1467115 1334711 1198875
16921 1198875 1088404 1030352 969647 929589 937689 940795 1004458 1019453 947358 877410 827245
16910 827245 744447 827003 817023 712745 712372 648805 653714 608954 647286 627997 516063 429471
16898D29471o87l8129J3993L9375p8805p1441Q9056R9840j5312p1160k3548M7934
16886D20587N0814k2847k94j3417m1022m6316k7832j45881r7712M6961Q4315L420
16874B10776k6362J92566J96166m5368j60360r4323l2477K7610k7755m3123j80530
16863A6820o5497o4639M0944j08793j3881k9704K5593J04445Q1596m6726o9002
16852a28844J0412J51980P9223J21145j2549j49680r6239L4235P5374J44042p306
16841B21793j40333J5135J8041K1848Q796L1646J9430m2391k1338K9578J58880
16830C21085J18291n1396j06796q5228j33579l9651n3386l9603j0122j928J28595
16819D6282Q3465k1135n9985j2328L5342p5873O7868J8695L0522q6081q7353O0449
$$ plain form
16898 429471 428784 390655 404648 444023 365218 293777 382833 482673 467361 396201 372653 420587
16886 420587 471401 448554 448260 434843 393821 347505 319673 173792 76080 123041 207356 210776
16874 210776 184414 376980 573146 527778 367418 273095 240618 268228 240473 197350 16820
16863 16820 -48677 -113316 -72372 -181165 -195046 -224750 -199157 -94712 -13116 -59842 -128844
16852 -128844 -118432 33548 112771 233916 221367 71687 -24552 9683 85057 229099 221793
16841 221793 81460 96595 114636 136484 145280 176926 196356 153965 132627 162205 321085
16830 321085 439376 387980 281184 195956 62377 22726 -30660 -70263 -80385 -82313 46282
16819 46282 129747 108612 48627 36299 71641 -4232 63636 82331 112853 26772 -60581 -132
16807a32j05069k1703J99794J52929O5521M4618M0233p4037r7883o4855J7995
16796A57411J02219L2731K8673J27552J92464J01999J49447J05844J20095J79189
16786A297624p2322k07498j82289j61640j44516K5572Q6849r3411j05986j06113
16776C36270M5327J96746L17104J56724O1482k8811k5613o8141m2195j68594k01691
16765E78608j44082r1627o4606l4076N591o7381r7029j15175M0544l9351N8807
16754C0223L1244L1926R1165m924n5784l8522j4212o7599O0904J1109J5611k4137
16742F7004q5749O0652P1165q1187l077J52078P5290p4352P850r0584M2891O7783
16730B09764L0022j5202j51768q7326M2940j5630m1200P6926P2780o6613m4216
$$ plain form
16807 -132 -105201 -126904 72890 225819 291340 335958 376191 302154 204271 139416 157411
16796 157411 259630 292361 321034 448586 641050 743049 892496 998340 1118435 1297624
16786 1297624 1225302 1017804 835515 673875 529359 554931 641780 548369 442383 336270
16776 336270 381597 578343 895447 1052171 1113653 1084842 1059229 991088 948893 780299 578608
16765 578608 434526 342899 278293 244217 249808 182427 85398 -29777 10767 -28584 30223
16754 30223 61467 93393 184558 179634 123850 85328 71116 3517 64421 75530 91141 67004
16742 67004 -18745 41907 113072 31885 28808 180886 256176 181824 189674 99090 141981 209764
16730 209764 239786 224584 72816 -14510 28430 12800 -28400 48526 121306 54693 10477
16719A0477J28772J32597k9713j63729j26420k6980N7784M0927l7760Q3843J43627
16708B13425Q6363o1874j03367n7205P6666J37532L6764N252k10522j13942p8272
16697f9180k5082K0124j6324Q5040L1351l0500p4708j4826N393P3340j6836p830
16685d0038l8639M4604K5957J22646k6174j48791k9158L0199Q2677k4425R125
16674G983K6291j1129j84234j65208L5622L5932Q6073N6247o6840L1487P2925
16663g4851M7416r3278Q1985J45727o1050j11779O898j6826l6038M344J25400
16652A7948Q2909L773m037p6157q9847j3330Q4696J05755k3826j33507K5301L9947
16640A9625M7772l7093n2791o5902o6752N0665J24974q8405L2075Q6922j79443
$$ plain form
16719 10477 139249 271846 242133 78404 -48016 -74996 -17212 23715 -14045 69798 213425
16708 213425 299788 237914 134547 77342 154008 291540 328304 333556 123034 9092 -69180
16697 -69180 -94262 -74138 -90462 -5422 25929 -4571 -79279 -94105 -88712 -15372 -32208 -40038
16685 -40038 -78677 -34073 -8116 114530 88356 -60435 -89593 -59394 23283 -1142 7983
16674 7983 34274 23145 -161089 -326297 -290675 -254743 -168670 -112423 -179263 -147776 -74851
16663 -74851 -27435 -120713 -38728 106999 45949 -65830 -58932 -75758 -111796 -107452 17948
16652 17948 100857 104630 100593 24436 -65411 -78741 5955 111710 87884 -45623 -20322 19625
16640 19625 67397 30304 -22487 -88389 -155141 -104476 20498 -67907 -35832 51090 -128353
16629a28353j40843K6442J5480k7777J2096Q7106J20814J50477k8614r9342n6880
16618f9394N4416L4644j02282j09501N9716P355J37352P3197j28777o3933k332
16607a09539Q6233J00870n920N9910k9610j06367k9777J3055o9097P8467K09995
16596A98220J3282k00992j117L9216N6834j21601J1066J1842n5539n0135O7282
16585c1642n0357p4918q6842L3298J07746J33840j9608o2551L2421l4644o2341
16574a15598N1768Q6133N5119j11148j54127j1559Q6509O9498M0800j3478J4855
16563a228l7876r1435q6605k8956J26972P4833k2114M2757P8149J4228l0981p8657
16551d0913j8031J6746K0696O675K4708O2041N3120J40110O463r9854k7543P604
$$ plain form
16629 -128353 -269196 -242754 -227274 -255051 -242955 -155849 -35035 115442 86828 -12514 -69394
16618 -69394 -14978 19666 -82616 -192117 -132401 -125046 12306 85503 -43274 -107207 -109539
16607 -109539 -23306 77564 71644 131554 101944 -4423 -34200 -21145 -90242 -11775 198220
16596 198220 211502 10510 9393 48609 105443 -16158 -5092 6750 -48789 -98924 -31642
16585 -31642 -81999 -156917 -243759 -210461 -102715 31125 11517 -51034 -18613 -53257 -115598
16574 -115598 -63830 22303 77422 -33726 -187853 -199412 -112903 -43405 -2605 -16083 -1228
16563 -1228 -39104 -130539 -217144 -246100 -119128 -44295 -66409 -23652 54497 68725 37744 -40913
16551 -40913 -58944 -42198 -21502 -14827 9881 71922 125042 265152 271615 171761 144218 151822
16539A51822J413R5517J30083Q0054P3035Q6o020l3496q1550j25905l4952N150
16527B55237L3187m0192j31586N1485Q2561l9755j8319j18812M5892K29053J78826
16516E27577J19797j2513j46331j23351j08047J1860K2300o2608k421l2119j5769
16505A78375j33148K9956k285j3915J2214n777j3180j33933L0787n783L8243L0183
16493A1737k6249l8782r6657M7202J16553K7233o8061J52443J15075P8172L6077
16482C54743J19558L7756J10680J30585L9949j38664j99109o2771j4406N12p7675
16471C01158o4378L0480r70K4857J9565j01526O371J94871K34863m4209l5009
16460E66073k0868k9340j2237J8275k26469j59223n3989J9069J04005l8852K0601
$$ plain form
16539 151822 153235 248752 378835 458889 531924 532010 525990 492494 410944 285039 250087 255237
16527 255237 288424 248232 116646 168131 250692 210937 192618 73806 119698 348751 527577
16516 527577 647374 634861 488530 365179 257132 268992 291292 228684 226263 194144 178375
16505 178375 45227 75183 72898 58983 71197 65420 52240 -81693 -50906 -56689 -18446 11737
16493 11737 -14512 -53294 -149951 -102749 13804 41037 -27024 125419 240494 318666 354743
16482 354743 474301 512057 622737 753322 793271 654607 455498 392727 378321 378833 301158
16471 301158 236780 267260 266290 291147 310712 209186 215557 410428 645291 601082 566073
16460 566073 545205 515865 503628 521903 295434 136211 82222 101291 205296 166444 187045
16449A87045q5852q9606K2037O9848K0251j9394J71143l1936q5904n5372q3892
16438A8368k4577O213o7598L1240J18057P0416m0092k3254j60626k5466N6706
16427d0613q4318p1780N5809K8263O5418J30540O3218M3909J5201n2690J2943
16416A65900q6129r154J16227O1198q5088j91121j6468L9192K6104O3296M8473
16405A32430j07804M4250o694l9157Q3644p7530j9139j8537r6394M5738O0501
16394A308k5397M9756J33647J42429l662j25894l1282N0762j34462p1932o4944
16383g9671P3544n3561M6440M1592q031L72L6532j6817n5761n0182n2106J12065
16371e584J3680j3298o951J8078J24687j6389r4321L8178J3276J0358j11734n3945
$$ plain form
16449 187045 101193 11587 33624 103472 123723 104329 275472 243536 157632 102260 18368
16438 18368 -6209 4 -67594 -36354 81703 152119 112027 88773 -71853 -97319 -40613
16427 -40613 -124931 -196711 -140902 -112639 -47221 83319 146537 190446 205647 152957 165900
16416 165900 79771 70617 186844 248042 162954 -28167 -44635 -5443 20661 83957 132430
16405 132430 24626 68876 62182 23025 106669 29139 10000 -8537 -104931 -59193 1308
16394 1308 -24089 25667 159314 301743 298081 172187 140905 191667 57205 -14727 -79671
16383 -79671 -6127 -59688 -13248 28344 20313 20685 57217 40400 -15361 -65543 -117649 -5584
16371 -5584 8096 -5202 -12153 5925 130612 114223 19902 58080 71356 81714 -30020 -83965
16359h3965J1687J3868J21228J23197q3831j11881n9410J8240J74367O6447q6876
16348A03071n5883k3751o9126M073M4835k8300l1091r4200n3117J06621P107l9613
16336a29374J34653Q9580L8200j80385j13039M5533J20447J5708k5763N506K3439
16325B4505J2670j22729o0433r1896R6938k044K3758o0866N0715N9579m8031m4365
16313a62199R3686n3030q0868J16289J72021n5704j01179r5666O5815N7931p6779
16302a19683p8056L9705l0452O5382k0889o564J46063j8843j32722J9808j5160
16291a51411p3663O9252J0286J06615J44173M9809j79183p2766K9515o1380J25858
16280b895K7908J18989j6810j66808J0348M5798k0166J2963J1701o0243R6607
$$ plain form
16359 -83965 -72278 -58410 62818 186015 102184 -9697 -69107 -50867 123500 189947 103071
16348 103071 47188 23437 -45689 -41616 3219 -25081 -56172 -150372 -203489 -96868 -89761 -129374
16336 -129374 5279 94859 133059 -47326 -160365 -114832 5615 21323 -4440 1066 24505
16325 24505 37175 -85554 -145987 -237883 -140945 -142989 -119231 -180097 -129382 -69803 -117834 -162199
16313 -162199 -68513 -121543 -202411 -86122 85899 30195 -70984 -166650 -100835 -42904 -119683
16302 -119683 -197739 -158034 -188486 -123104 -143993 -150557 -4494 -23337 -156059 -136251 -151411
16291 -151411 -225074 -155822 -145536 -38921 105252 155061 -24122 -96888 -67373 -128753 -2895
16280 -2895 25013 144002 127192 -39616 -29268 16530 -3636 9327 21028 -39215 57392
16269E7392L7528p3601q5110R7336m2100j57409j62774J78935R8343J08691P0415
16258A27646j36783j41088l8857Q9174K6308m0850L3955J05845j0832j69823N1794
16247a03511k4905j07428J9442J33091J9491j1331J11239j5051L9704P6936j58828
16236b1151K4110m5333j32578l6490R2047M3538M1328N5288r691K7424P5921p1634
16224D2779n5776Q0700j0001k463k1514l3113L116K9721L159J5313r979r0424
16212d8482k2531p5577m1364Q3892K4468j70316j35417M7261J38565L4965L2810
16201a31726j01029p8457J13619J30986J19206M4534l336p8264o0589l7453O8442
16190a4067r3695O3536R9310j7225j64388j07767l937M6832P6382P0791q909j02247
$$ plain form
16269 57392 94920 21319 -63791 33545 -8555 -165964 -328738 -149803 -51460 57231 127646
16258 127646 -9137 -150225 -189082 -99908 -73600 -114450 -80495 25350 14518 -155305 -103511
16247 -103511 -128416 -235844 -216402 -83311 -63820 -75151 36088 21037 60741 137677 -21151
16236 -21151 2959 -42374 -174952 -211442 -119395 -75857 -34529 20759 11068 38492 114413 42779
16224 42779 -12997 67703 57702 55239 33725 612 3728 33449 36608 51921 41942 -48482
16212 -48482 -71013 -146590 -187954 -104062 -79594 -249910 -385327 -338066 -199501 -164536 -131726
16201 -131726 -232755 -311212 -197593 -66607 52599 97133 93797 15533 -45056 -82509 -14067
16190 -14067 -107762 -44226 55084 37859 -126529 -234296 -238233 -191401 -115019 -44228 -53137 -155384
16178a55384n102l0043o308Q3875P0616p6915J0340j1592K6287Q614L4587k4463
16166g5488O7479j0433k5441j41210o6351Q9785P6323N9207N7258M362m6816n2233
16154f3558j43815Q5354O6512J4723q3036J12862n961M887R933J15549o4025l7498
16142A1927k6298l4897P72M7075J10159m3329j5410n3106n1507M174r469K558
16130e7351L4858J7202N2607p8433O0484R6513J34230J42q9125k0955P8997r7541
16118A31628j4971j4692q8103K5786o075r1048L472J00763M5809J0715o0064n6328
16106a3108J05957K1114N0315P1315l2784m345p2181j17609q696l2880r8685p5649
16094b07236J05806J03468O5345J4680M8918m4224J06018l1265j53804o0072n9399
$$ plain form
16178 -155384 -160486 -190529 -196837 -112962 -42346 -119261 -108921 -120513 -94226 -85612 -51025 -75488
16166 -75488 -8009 -18442 -43883 -185093 -251444 -161659 -85336 -26129 31129 35491 -11325 -63558
16154 -63558 -207373 -122019 -55507 -40784 -123820 -10958 -16919 -12032 -2099 113450 49425 11927
16142 11927 -14371 -49268 -48496 -1421 108738 65409 49999 -3107 -54614 -50440 -59909 -57351
16130 -57351 -22493 -5291 47316 -31117 29367 125880 260110 260252 171127 150172 229169 131628
16118 131628 116657 101965 13862 39648 33573 -57475 -54003 46760 92569 103284 43220 -13108
16106 -13108 92849 113963 164278 235593 202809 198464 126283 8674 -22 -32902 -131587 -207236
16094 -207236 -101430 2038 67383 82063 130981 86757 192775 161510 7706 -52366 -111765
16083a11765L9026P0164o171m8975n325l7140Q598r7418R6293J338n5506Q9869
16071e7012j8622j9297n2206J07747J38330N6424j35760j50003J9426K6259k3725
16060a08439J30231j00337n0586L4922j0387J90013l1753j35785J6645N3271n4584
16049f6789J0345K1379J43681J2890J24j29039L159M2378N2215r39M8557m1866
16037I6095P3600Q808N8419o168p7180j55052j8929L2531P001k4318o2458R2590
16025B4939Q754r7536r0792K2602J09274J9274q6371L8552Q3518j5671l613k0680
16013g750j41169L9251q1684M756R2070J5142m9357n1154O3369J95264N1894J1210
16001A41842J6813r6362k6211q3793j21265j8487O6222M1786P8163q1216L0750
$$ plain form
16083 -111765 -72739 -2575 -8746 -57721 -63046 -100186 -91588 -189006 -92713 -91375 -146881 -57012
16071 -57012 -75634 -94931 -147137 -39390 98940 155364 19604 -130399 -110973 -84714 -108439
16060 -108439 21792 -78545 -129131 -94209 -104596 85417 53664 -82121 -65476 -12205 -66789
16049 -66789 -56444 -35065 108616 121506 121630 -7409 -4250 38128 90343 89404 137961 96095
16037 96095 169695 178503 236922 230754 153574 -1478 -20407 12124 19125 -5193 -67651 24939
16025 24939 33693 -63843 -154635 -132033 -22759 -3485 -89856 -51304 32214 16543 12930 -7750
16013 -7750 -148919 -109668 -191352 -186596 -94526 -79384 -128741 -179895 -116526 78738 130632 141842
16001 141842 158655 62293 36082 -47711 -168976 -187463 -121241 -79455 -1292 -82508 -51758
15990e1758Q9904r1344n4408k2180N0069N5083N2791m3013j8068N395n2589k157
15978h2275P117O3024Q2433P7603M6076o439n786k01774m9455m8725K0604N0802
15966d6795O515R2426K2233l9710J4082j04046j35489j6041M5203J04554L454
15955e3614j5487l4504j0856J54316l9728r8076M4606j05573n7601L6120m762
15944a85159K7577m8376k4897n6896k2697O7268J82832k3202k6961J14038O1667
15933F5194l2280J0064O902k3082L525j07059k4213J3051j26453J41960J68338
15922I5947n2177q9675p0370j1950k6371Q5715J07416M2866j09482j59855K7976
15911a59960L1170L4054O5905Q2550J06520p0950j22145j2817m6672M6425k6490
$$ plain form
15990 -51758 38146 -53198 -107606 -129786 -79717 -24634 28157 -14856 -32924 -27529 -80118 -82275
15978 -82275 -75158 -12134 70299 147902 193978 187539 181753 -20021 -69476 -118201 -97597 -46795
15966 -46795 -40280 52146 74379 34669 48751 -55295 -190784 -206825 -161622 -57068 -53614
15955 -53614 -69101 -103605 -114461 39855 127 -97949 -53343 -158916 -216517 -180397 -185159
15944 -185159 -157582 -205958 -230855 -287751 -310448 -243180 -60348 -83550 -110511 3527 65194
15933 65194 32914 42978 49880 26798 30323 -76736 -100949 -87898 -214351 -72391 95947
15922 95947 43770 -45905 -116275 -128225 -154596 -68881 38535 81401 -28081 -187936 -159960
15911 -159960 -128790 -94736 -28831 53719 160239 89289 -32856 -45673 -92345 -45920 -72410
15900g2410R1348o1854n8933J99908K52235j16064k14141j06102L7559N2664Q4388
15889H8598R0532j31324k14641j53757K24720J90994r357j59565k3802J8034J0712
15878f8856J8738Q8238N5820j32741m4641m347p9575J0447L7370K8726j1929Q1243
15866b1507L37M5013N7692M164q0161Q6112J27766q3124j87393J2530K659o2847
15854i8759N3952R098P2809L0363L9214p207j05094k134Q117L484O3661R8227
15842A65731j03588J07580P9464o6800j4854o3000j46455N9046j11895j1984K5135
15831h1620k7953p6874j4525M9554o7343J8597n292R7008J4052q843J15446N5126
15819F7333r144j8444o0771j46920O8663O4227J2812q289r4470L9176j1138P1514
$$ plain form
15900 -72410 18938 -42916 -101849 98059 350294 234230 20089 -86013 -48454 4210 88598
15889 88598 179130 47806 -166835 -320592 -95872 95122 85765 -73800 -97602 -79568 -68856
15878 -68856 -50118 38120 93940 -38801 -83442 -87789 -167364 -156917 -119547 -90821 -102750 -21507
15866 -21507 -21170 23843 81535 85699 5538 91650 219416 136292 -51101 -38571 -35912 -98759
15854 -98759 -44807 -35709 37100 67463 106677 99470 -5624 -7758 359 3843 67504 165731
15842 165731 62143 169723 249187 182387 167533 104533 -41922 17124 -94771 -106755 -81620
15831 -81620 -109573 -186447 -200972 -151418 -218761 -200164 -205456 -108448 -94396 -103239 12207 67333
15819 67333 58189 39745 -21026 -167946 -99283 -35056 -22244 -30533 -125003 -85827 -96965 -25451
15807b5451Q3208m0764K5989M2342K7611K5097j6656j16055k9361P3593L0707
15796H0260N5934P6183r5539j35414p5354M636m0694j4521j7573j74294o4113
15785d00489J05404J33939L9594j2354K3134J14146p4691N426J17637l03o4487
15774a3044p5375p5514k6284J05388j4422m9740P9778J02117J6385O8557J11390
15763B29236K1531j35781j61589n5931p2547L632K2546L2228K4796M0597J23127
15752G1845P3468o5612p6945r4786o7867l411n6833P2379R6382R297N0974q3032
15740g4141l9903P3093R7326j08309K3995K0819J2160K5187J3598r8025M9384
15729d816j13716j31730Q8857Q6676M7937j2294j9380N4794K342j2451j09587
$$ plain form
15807 -25451 57757 16993 42982 85324 112935 138032 121376 5321 -24040 49553 80260
15796 80260 136194 212377 116838 -18576 -93930 -89294 -129988 -144509 -162082 -336376 -400489
15785 -400489 -295085 -161146 -121552 -133906 -110772 3374 -71317 -65891 51746 51443 -13044
15774 -13044 -88419 -163933 -190217 -84829 -99251 -148991 -69213 32904 49289 117846 229236
15763 229236 250767 114986 -46603 -102534 -175081 -171449 -148903 -116675 -91879 -51282 71845
15752 71845 145313 79701 2756 -92030 -159897 -163308 -220141 -147762 -51380 -42083 8891 -74141
15740 -74141 -114044 -40951 56375 -51934 -27939 -7120 5040 30227 43825 -54200 -4816
15729 -4816 -118532 -250262 -161405 -74729 -26792 -39086 -58466 -3672 -1330 -13781 -123368
15718a23368K2588J13484P0154m5100j26969o0609M8468n2705p3828j1131l533
15707b42549J9698j3489N0699k0381O8545R5423L2675m1642q1517M7960P4480
15696a0098j6177o7504q4560k7574J01579M6999n924P2402N4826j26098p1489
15685a33618K6975k3114O8742j35356q2457m9215L6794J10806J8740q132R0783
15674g9052J15548N1184J7344r2636M1785M6938j2675j09272j08168p9031r046
15663b17081Q4563n676M6398O8897K4438m7427k9300n440N157J7817r293J2233
15651e4714j2336o6837P139j9334o7927k1024k9528K5509K9197J04647J07275
15640B067M4023P8835Q153j21574J9278L5456O6448q4307q753k1970m411O8150
$$ plain form
15718 -123368 -100780 12704 82858 37758 -89211 -149820 -101352 -154057 -227885 -239016 -242549
15707 -242549 -222851 -236340 -185641 -206022 -137477 -42054 -9379 -51021 -132538 -84578 -10098
15696 -10098 -26275 -93779 -178339 -205913 -104334 -57335 -63259 9143 63969 -62129 -133618
15685 -133618 -106643 -129757 -61015 -196371 -278828 -328043 -291249 -180443 -161703 -169835 -79052
15674 -79052 36496 87680 105024 12388 54173 101111 88436 -20836 -129004 -208035 -217081
15663 -217081 -132518 -138194 -91796 -22899 1539 -45888 -75188 -80628 -75471 -57654 -66947 -54714
15651 -54714 -67050 -133887 -126748 -146082 -214009 -235033 -264561 -239052 -209855 -105208 2067
15640 2067 46090 124925 133078 11504 30782 66238 132686 48379 39626 17656 13245 81395
15628H1395K2048j09382o658R0300k0K6217K102P8442P277Q9542p1522o515K5313
15615B28539m2546Q3689o0611o9046n3695J6898r8082j24719n2625P79M6544q2939
15603b07814j91776J61290K81867J76964O0933r3955r0572K6444r14M0974K0642
15592A84083q3567j61617n8597m1878o6373N7248J48833N5495r498n9612N2169
15581A6686J4621K5276k416Q5513l817j00424o454k3863m0873j27803P3429J19955
15569B9830J18023n9693j12638p5502j9576O1255M8565K2836L2121m3880m4677
15558d3336o8492k4794j4709R2957n1271J3527R6358M4723o2402m386q1445l6227
15546a39497P4884J23706m2639q5205k8804m244p97l433P3660k3677k0077P246
$$ plain form
15628 81395 103443 -5939 -12597 77703 77683 103900 106002 184444 191721 281263 209741 203226 228539
15615 228539 185993 269682 209071 140025 86330 103228 5146 -119573 -172198 -171419 -124875 -207814
15603 -207814 -399590 -238300 43567 220531 281464 187509 96937 123381 122467 163441 184083
15592 184083 100516 -61101 -119698 -161576 -227949 -170701 -21868 33627 24129 -35483 16686
15581 16686 31307 56583 54167 139680 135863 35439 28985 5122 -35751 -163554 -90125 29830
15569 29830 147853 88160 -24478 -99980 -119556 -58301 -9736 13100 45221 1341 -43336
15558 -43336 -111828 -136622 -151331 -58374 -109645 -96118 240 44963 -17439 -21825 -103270 -139497
15546 -139497 -64613 59093 16454 -68751 -97555 -101799 -102596 -106029 -32369 -56046 -76123 -68877
15534f8877M5120j20019n1648r5627J02624M0059M5807Q1578M1728N7721O9102
15523A47568m6587N690l9419k1715k7250q6694J05513Q3331r0990K3805j2091
15512D1161Q7735Q1367m8825j15230j0838l8701M3229J7307l1399p9987M8283
15501e898M6262r3135o2881J01468O9645n4534L9004O2083P4559r6330l3158L3497
15489H0582J072O331M320j26326o5610r842K1849J44493O9913K838j31758n1128
15477e3266K189P0921N9011J4290o8587m4798l6162q5279r7081k0294l2270M8759
15465b42567J12814K4050k6158l7100Q6601m0619L3609k5765K5239J6639p8272
15454a51529M571J01706J88259o2977r3130P9845o9246r5625p3190L1655J17753
$$ plain form
15534 -68877 -23757 -143776 -195424 -291051 -188427 -148368 -102561 -20983 20745 78466 147568
15523 147568 100981 106671 67252 45537 18287 -68407 37106 120437 29447 53252 41161
15512 41161 128896 210263 161438 46208 35370 -3331 39898 57205 25806 -54181 -5898
15501 -5898 40364 -52771 -115652 -14184 55461 927 39931 102014 176573 80243 47085 80582
15489 80582 81654 87985 92305 -34021 -99631 -109473 -87624 56869 126782 129620 -2138 -53266
15477 -53266 -51077 19844 78855 93145 24558 -20240 -56402 -141681 -238762 -259056 -291326 -242567
15465 -242567 -129753 -105703 -131861 -168961 -82360 -122979 -89370 -115135 -89896 -73257 -151529
15454 -151529 -146958 -45252 143007 80030 -13100 66745 -2501 -98126 -171316 -139661 -21908
15443b1908R900J565m8068O0836J873j58758K5125j0957O668j5841Q5816P4212
15431A0463l0419O195k7378L3743M8518L3278k6870k5595J2402o112p4467k7018
15419g3260q1213J11659J61797P0813j23342K0135N0865M5033K6967M4133l1205
15408B22382j14506q1995j7420p3707M3243O0678k07J2381Q5567L8200o9620M9812
15396A54808K8244m0914m4565N2292p3425N0461L8508R4174l6890j19263J8388
15385A21818K5353K3983o9766l3835n7229K2195k3363M969J38652R8195p8860
15374A72112p3497j33309k9006m186J51121O7798j4428o7398q6428j6550J45175
15363A11404J29814Q017n3241m2931p4047j80351m4471Q7770Q7485j03911j03488
$$ plain form
15443 -21908 -12008 -10443 -58511 2325 4198 -154560 -129435 -140392 -133724 -149565 -63749 10463
15431 10463 -19956 -13761 -41139 -7396 41122 74400 47530 21935 34337 28225 -46242 -73260
15419 -73260 -154473 -42814 118983 189796 66454 86589 137454 182487 209454 253587 222382
15408 222382 107876 25881 8461 -65246 -22003 38675 38468 50849 136416 174616 104996 154808
15396 154808 183052 142138 97573 149865 76440 126901 165409 259583 222693 103430 121818
15385 121818 147171 171154 101388 67553 10324 32519 9156 14125 152777 250972 172112
15374 172112 98615 -34694 -63700 -67886 83235 151033 136605 69207 -17221 -33771 111404
15363 111404 241218 249235 195994 153063 79016 -101335 -145806 -58036 29449 -74462 -177950
15352a77950P9439J63955L3084j37171o330K140K9410J04622K1763l2053o7339
15341A3570n0871L2717o0682p3665l6219L3653K0308l8750j0978Q4904J50802
15330F4789q219q1129j60079L9043J40732P2271L481k9999m435M19l8257L961
15318B578J3954Q9716O6663K4384q7980j12006m0812K3623J70350J4208j0473
15307A54205J21198O2275p7047o5635j56555q4108Q299P3329J22139j42217j61577
15296a45694J71052O1183n4291k9107R9253Q853j8106P3447K9772M8181j7888
15285B26655p8816p9274j8080l3582P6139l4195j4252P964J14208j5959o1070
15274H9738n5159j11264J37663R8107q913o3198j04311K936J11148J14295J11625
$$ plain form
15352 -177950 -98511 65444 98528 -38643 -44973 -42833 -13423 91199 112962 80909 13570
15341 13570 -37301 -4584 -65266 -138931 -175150 -141497 -121189 -159939 -170917 -86013 64789
15330 64789 56570 -24559 -184638 -145595 -4863 67408 70889 40890 36455 36874 -1383 2578
15318 2578 16532 106248 172911 197295 109315 -2691 -43503 -19880 150470 164678 154205
15307 154205 275403 337678 260631 194996 38441 -45667 -37368 35961 158100 15883 -145694
15296 -145694 25358 86541 32250 3143 102396 111249 93143 166590 196362 244543 226655
15285 226655 147839 68565 50485 16903 93042 58847 44595 52559 166767 150808 89738
15274 89738 34579 -76685 60978 159085 150172 86974 -17337 -14401 96747 211042 322667
15263C22667J0817o9282P307L7493r8424k15472Q7224n2751n4238J9614J10341
15252A05296M098n704M0711l4311Q7546J59769l3583k16772l8945L3969n0013
15241E2061k5923m6571J4660L8300j48450m8550q0465J10763J10988O4944J6993
15230E8750q4671J48151j1921j60110O854L7832j09609o2424J67372J09526K6200
15219A25950p2591p6851O5566o4531O3180M440j56801m8776J54388Q7538m1945
15208C9567K1253M0888p34j20667m5929j32738L5673J87075J12833n658o6368
15197F5195M2003l1528O9411r1814n6453L6520p2692o6425N9066L409Q272j6320
15185e1356j40397J19222P9940k301R4475l4604j4242L0552q6586o2362q7319
$$ plain form
15263 322667 333484 264202 271509 309002 210578 -4894 82330 29579 -24659 -5045 105296
15252 105296 109394 103690 144401 110090 197636 357405 323822 107050 68105 102074 52061
15241 52061 26138 -20433 -5773 32527 -115923 -164473 -244938 -134175 -23187 41757 58750
15230 58750 -25921 122230 110309 -49801 -42947 -5115 -114724 -177148 -9776 99750 125950
15219 125950 53359 -23492 42074 -22457 40723 45163 -111638 -160414 -6026 81512 39567
15208 39567 60820 101708 100974 -19693 -65622 -198360 -162687 24388 137221 131563 65195
15197 65195 107198 75670 145081 53267 -3186 33334 -39358 -105783 -46717 -43308 -35036 -51356
15185 -51356 -191753 -72531 7409 5108 99583 64979 50737 81289 -5297 -67659 -154978
15174a54978J6227J1608P2980M3392q2544J0028O8631O907M0213L3774r782l0703
15162B5753l7259K3295r0845o766N4708k7211N1179J04257N5226N24n1663o8396
15150C2802q371O303J15388L2507j71144r6259L3320J8593p5751l2991L2902P4492
15138c8209l4766K0988j83167L5245L7306R1264K4315K9578J53822l1395n4878
15127E0103J3366M9440J67589j571k18064j6295J8538j6551K1753j55238m3902
15116a30832P9585J3491j37142J5593J34195P7003Q0519M0231j7344m9490n8165
15105D7644L5766K2185J25935j45616P4417J21193R0520j53586q1541j43809m2559
15094d9451J7837r7565L9524J67430L3295K1886o8444j5061L6315l9218m3355
$$ plain form
15174 -154978 -138751 -127143 -54163 -10771 -93315 -83287 -14656 -7749 32464 66238 56456 25753
15162 25753 -11506 11789 -79056 -85822 -31114 -58325 -7146 97111 152337 152861 101198 32802
15150 32802 24431 30734 146122 178629 7485 -88774 -55454 -36861 -112612 -145603 -112701 -38209
15138 -38209 -72975 -51987 -235154 -199909 -162603 -71339 -47024 -17446 136376 104981 50103
15127 50103 63469 112909 280498 278927 60863 44568 63106 46555 68308 -86930 -130832
15116 -130832 -51247 -37756 -174898 -159305 -25110 51893 132412 172643 155299 105809 47644
15105 47644 83410 105595 231530 85914 160331 281524 372044 218458 136917 -6892 -49451
15094 -49451 -31614 -129179 -89655 77775 111070 132956 64512 49451 85766 46548 3193
15083C193K755k401o9864L5904j1372q2994J080O7476p2798J11883J98881R2813
15071B74556o6456j07663K3785o6154P5460n434p1560k3936n2453Q342o9p161
15059a8743o2260O8858J1695L1024N1394r8341k8806K1727l6688q641L0926P8600
15047D0745J99991n678o0951K2822r0355o5915n4386j07462p967N4687M0112Q9563
15035E5206J41610p0667j27118j14696j2277o495J9615M1004o536J5542N4534
15024a0278m2352J02483R2939q048n867j9765p6272q7014P8750j16746j03495
15013a95665J95950N2032q9974O192q4549K7983L2973Q3096O0036j07271N0984
15002C1787o5396J670O0357J28192n3261n8984j3619J90015j3661j46382m6847
$$ plain form
15083 3193 5948 3547 -66317 -30413 -41785 -124779 -123699 -56223 -129021 -17138 181743 274556
15071 274556 208100 100437 124222 58068 133528 128094 56534 32598 -19855 -11513 -11582 -18743
15059 -18743 -81003 -12145 -450 30574 81968 -16373 -45179 -23452 -60140 -68781 -37855 40745
15047 40745 240736 235058 174107 196929 106574 40659 -13727 -121189 -129156 -74469 -34357 55206
15035 55206 196816 126149 -969 -115665 -127942 -134437 -114822 -73818 -80354 -64812 -10278
15024 -10278 -52630 49853 142792 134744 128877 109112 32840 -54174 24576 -92170 -195665
15013 -195665 285 52317 -37657 -31465 -116014 -88031 -55058 28038 88074 -19197 31787
15002 31787 -33609 -31939 28418 156610 103349 44365 30746 220761 207100 60718 13871
14991A3871q1732J4014K7515O1117J0310M0496K0070K8906l0039p2771P764j00225
14979f0704R0856L9549j14001o2815O0719O5229j8194q2333L7490k4388n0100
14968a18692K9782K200R4120R0641l7692j2047j7272k8522o8158M02K4717j27362
14956a67883L0970N7108M6383R3637J7741k6252O4912m135n1084J3209O9184o5238
14944G8552n4701N3654p8621M8172J75770L0911j26779j59789J195N6009L6452
14933F0825j20055j32432k7485J46438j6932N6783J31804L5574j29026N8486l384
14922F0596j004l0603O1825j24946j11723M1426K08893O0959J05115L1516n0561
14911B51493j2709n2623j21686m659L7900O4693m2683o9192j09151n1983j16058
$$ plain form
14991 13871 -67861 -53847 -26332 34785 45095 85591 105661 134567 104528 31757 39521 -60704
14979 -60704 30152 69701 -44300 -107115 -46396 18833 639 -81694 -44204 -68592 -118692
14968 -118692 -88910 -86710 7410 98051 60359 48312 31040 2518 -65640 -65238 -40521 -167883
14956 -167883 -136913 -79805 -33422 60215 77956 51704 116616 112481 61397 74606 143790 78552
14944 78552 23851 77505 -1116 47056 222826 253737 126958 -32831 -31636 24373 60825
14933 60825 -59230 -191662 -219147 -72709 -89641 -32858 98946 134520 5494 63980 60596
14922 60596 59592 28989 90814 -34132 -145855 -104429 104464 165423 270538 302054 251493
14911 251493 238784 186161 64475 59816 97716 162409 119726 50534 -58617 -110600 -226658
14900b26658n8733K8893K8689L1350J32022J07160J9898r7429K070L2262n0610
14889e1086j3955L8976K9983M9806Q901l6397n6296k1324L7137j8304N5180O4575
14877H7196l2195M453L3104p0972j3802R2264q8238j95235m7770k2494k2929K0597
14865b56021j2715Q4412Q4428K3905L3603K7082P528q6313P1120o564l8791M1481
14853b6845P6033j9520j14570j262J03388j2160K9221L6859P138l035M0430N6655
14841A72332k0209r5975j03666M6147J35274q793j56404K9226m6150Q4182J07112
14830A43076k6353m262o276M5151J20927N4544p7012m9713L6769L1162K761m9781
14818B20993j01899N2016k6090m7092P4500L6831j30352l0850p4779K9839Q9023
$$ plain form
14900 -226658 -285391 -256498 -227809 -196459 -64437 42723 62621 -34808 -32738 -476 -51086
14889 -51086 -65041 -26065 3918 53724 62625 26228 -30068 -51392 -14255 -32559 22621 87196
14877 87196 55001 59454 92558 21586 7784 100048 11810 -183425 -231195 -253689 -276618 -256021
14865 -256021 -268736 -184324 -99896 -75991 -42388 -15306 -7778 -94091 -22971 -29535 -68326 -26845
14853 -26845 49188 29668 -84902 -86164 17224 5064 34285 71144 78282 75247 115677 172332
14841 172332 152123 56148 -47518 -1371 133903 125110 -31294 -2068 -48218 35964 143076
14830 143076 116723 112461 106185 151336 272263 326807 249795 200082 236851 268013 270774 220993
14818 220993 119094 171110 145020 97928 172428 209259 78907 48057 -26722 3117 92140
14807I2140K393K2046N4662P648p6309J7193l0550k0863K2104o0227k9854j2298
14795a1915l2173J139m9688k1507j40080J19712K01218P2547r3366R7248N0978
14784A94113p6079q2716p4269J25636J11026K3237n1896j32090l0043L570q858
14773A631J36644P7843l0104n3568j08616k8872j6766L2209N9492J780j6494j23559
14761f8380k7489L2023O6909R5071m5325l9631K7394n6271j3507K3209k4665o1568
14749i2230j544Q9912O4128O4533k8343j8149J6466J2607nn5351k0102K579n4720
14736b0219k829J59385n7596q8049r0838Q2036O7466l6707L4938j5310j06280
14725g4003N0551J23298m6137q4484m8982k0569J4460J09098R9425K7506j04936
$$ plain form
14807 92140 94533 116579 171241 178889 102580 119773 89223 68360 90464 30237 383 -11915
14795 -11915 -44088 -42949 -92637 -114144 -254224 -134512 66706 139253 45887 143135 194113
14784 194113 118034 35318 -38951 86685 197711 220948 169052 36962 6919 10489 1631
14773 1631 138275 216118 186014 132446 23830 -5042 -21808 10401 69893 71673 55179 -68380
14761 -68380 -95869 -63846 3063 98134 52809 13178 40572 -15699 -29206 -5997 -30662 -92230
14749 -92230 -93774 -3862 60266 124799 96456 78307 94773 107380 107375 52024 31922 34501 -20219
14736 -20219 -23048 136337 78741 -9308 -100146 -18110 49356 12649 47587 32277 -74003
14725 -74003 -23452 99846 53709 -30775 -79757 -100326 -85866 23232 122657 150163 45227
14714D5227M1411L0701r3037P3814o446j3377p5072o6232Q4032Q0012J6106N8336
14702A75475J69930O5566r2p2768m7661q5332M7892j9976j3920n058l8800L2128
14690B07384O8306j26622j46051J5983N3753J3103o4802L3941q378K8299L6184
14679A11100J4850l3992n4481J5756n4235M4584Q753k856p9777r6727M7198q289
14667h8116n4751l2401q3525K09625R6306K5273q039J18515m1570p2099j20777
14656e1559L384J555R4807M4950M198K7914Q300m2054L6868j30499j5759O6122
14644D8227P3935K7581q880l6179L4199o4948j5521m6550P77j947j1016l2467
14632c2789P310O5548p357j4918R73L558k177o4609o2152N0758q0907m329L71
$$ plain form
14714 45227 86638 117339 24302 98116 91670 78293 3221 -63011 21021 101033 117139 175475
14702 175475 345405 410971 410879 338111 290450 205118 253010 233034 219114 214056 175256 207384
14690 207384 275690 149068 3017 19000 72753 85856 21054 54995 46617 74916 111100
14679 111100 125950 91958 37477 53233 -1002 43582 52335 49479 -30298 -127025 -79827 -88116
14667 -88116 -142867 -175268 -258793 -49168 47138 72411 64372 182887 141317 69218 -51559
14656 -51559 -48175 -46620 48187 93137 97335 125249 133549 91495 128363 -2136 -17895 48227
14644 48227 122162 149743 140863 104684 138883 73935 58414 11864 12641 10694 -322 -32789
14632 -32789 -25479 40069 32712 17794 18767 22325 20148 -44461 -106613 -55855 -136762 -141091 -140720
14619a40720j4063R1581O3213N2217O1577O2337j2921m0632o2906q3475J00266
14608G6474Q5284m8140n3089l2650k5126K6402Q6499o4778m1317j20684J1914
14597i9211P2088m6051J9251n2143k9424R4490J3551o083L8782q9768j25506L5460
14585a74564J05430O1910O8106n5508j26065l0122K3852J10925R9986j9752l8585
14574B5613L9486R8786l5500j71602l4871J65613l0119l1542o2267k561L1575
14563g389Q9632N2474l1644o032m332n3083Q328l1315r7852r352o7672p3451J38462
14550i3226J87018L6217J0330p513L1226p7954p7428K7675R6295R8559k8437j0731
14538A92031j60657r372j2288Q3613Q1172O6669M2272l2240l3992P780k5933j78375
$$ plain form
14619 -140720 -154783 -63202 11 52228 113805 176142 163221 122589 59683 -23792 76474
14608 76474 161758 113618 60529 27879 2753 29155 115654 50876 9559 -111125 -99211
14597 -99211 -27123 -73174 -53923 -106066 -135490 -41000 -27449 -33532 5250 -84518 -210024 -174564
14585 -174564 -69134 -7224 60882 5374 -120691 -150813 -126961 -16036 83950 64198 25613
14574 25613 65099 163885 128385 -43217 -78088 87525 57406 25864 -36403 -38964 -7389
14563 -7389 82243 134717 103073 97041 92709 39626 47954 16639 -81213 -90565 -158237 -231688 -93226
14550 -93226 93792 130009 140339 132826 164052 86098 8670 36345 132640 231199 202762 192031
14538 192031 31374 22002 9714 93327 174499 241168 283440 251200 217208 224988 199055 20680
14526B0680j35792J05276N8321L3052J29977M8499j19055n4272r6852J11519P3786
14515A75139k4528J9992q4482j49656j24634J01035j8475P0088n2587N0115J53829
14504A15836J7499l8276p9654O9069P9381R0240l4748j23064p8188O2638N5563
14493A36296j8618K4401Q8077J13614o8953j36273j53834l2334J01390J32571
14483A86337J463k7382k0407Q6494n8530j08586j01056K5295P2125O6022m3161
14472G8614j53767N5991P8979q737j8020L1698J9500j00640m3121M0956j3123
14461c1670K0175P5071N313j4102O3887M7717j03381j05078J8826P2603j07974
14450e8613l3853Q9238n6699o7298l4396K1329J66956M1993j34239J55053L42
$$ plain form
14526 20680 -115112 -9836 48485 81537 211514 260013 140958 86686 -10166 101353 175139
14515 175139 150611 170603 86121 -63535 -188169 -87134 -105609 -35521 -88108 -37993 115836
14504 115836 133335 95059 15405 84474 163855 254095 219347 96283 18095 80733 136296
14493 136296 117678 142079 230156 343770 274817 138544 -15290 -47624 53766 186337
14483 186337 187800 160418 140011 226505 167975 59389 -41667 -16372 55753 121775 78614
14472 78614 -75153 -19162 59817 51080 33060 64758 84258 -16382 -59503 -18547 -31670
14461 -31670 -11495 63576 68889 54787 118674 166391 63010 -42068 -23242 49361 -58613
14450 -58613 -92466 -3228 -59927 -127225 -161621 -140292 26664 68657 -65582 89471 89813
14439H9813j9269o7101l6411M7805J19320J7801J2186Q452m2329j4950L626p8602
14427D0341K4630P8182J1190j02797k0915L3847l0223M921O2398q8401q7800j36238
14415b10865r7070M1321J66733J37436o073Q3602L4941M9234o9139m0345J4049
14404A03824n5992r9582J21356J9890l1500r3862q1443J25565m7796k4624k7468
14393i1632R999j411N227k3331N6320k0493K5197O5221M0956j17038j67001m364
14381b22350J06387O5060J14524k8691q937n5715o9830K3096J22040P446J29966
14370A82996L1536N1306r2472j31923k3660L6584n6725j82204M5950J04986J05519
14359G1893L9171o7467l6681K0665Q6147k1535o6236K646j04150q9205Q7216R7582
$$ plain form
14439 89813 70544 3443 -32968 14837 134157 151958 164144 172596 130267 115317 118943 40341
14427 40341 64971 143153 154343 51546 30631 64478 34255 39176 101574 13173 -74627 -210865
14415 -210865 -307935 -266614 -99881 37555 31482 115084 150025 199259 130120 89775 103824
14404 103824 47832 -51750 69606 89496 57996 -35866 -117309 8256 -39540 -64164 -91632
14393 -91632 -81633 -83044 -77817 -101148 -44828 -65321 -40124 25097 66053 -50985 -217986 -222350
14381 -222350 -115963 -50903 63621 34930 25993 -29722 -99552 -76456 45584 53030 182996
14370 182996 214532 265838 173366 41443 17783 54367 -2358 -184562 -138612 -33626 71893
14359 71893 111064 43597 6916 27581 113728 92193 25957 28603 -75547 -164752 -77536 20046
14347B0046N169J5851L1812J03189L5290J5523j5256r6468K2043L9162p2173K2702
14335A26890k8801K7248J02909o6072j36697l3899L9944k0539k5514N2296l938
14324C3827o099j06846R4268M7605l5824Q2214n6745p9424k7382L4872o2069k6909
14312a08512J79394o3395R33J3355K2713P3249J558j21223J2534Q3590l184O2943
14300A53955J31360R959J2336n5781r4020j06354j16031l8320M4512O6018J44189
14289A51823j42541n6050O3527p1286r4591Q3235R1534M0873q3215l2819Q2428
14278C2918J77316j05065m8594M496M2976R2306r6431q9311Q5271J47144L411
14267B46437r5074N452p8306K5461J1071L2483M4118O464n6739j08329l87m7074
$$ plain form
14347 20046 25215 41066 72878 176067 211357 226880 211624 115156 137199 176361 104188 126890
14335 126890 98089 125337 228246 162174 25477 -8422 31522 10983 -14531 37765 33827
14324 33827 27728 -79118 15150 62755 26931 109145 52400 -27024 -54406 -19534 -81603 -108512
14312 -108512 70882 7487 8420 21775 44488 117737 119295 -1928 10606 94196 91012 153955
14300 153955 285315 295274 307610 251829 157809 51455 -64576 -102896 -58384 7634 151823
14289 151823 9282 -46768 16759 -54527 -149118 -65883 25651 66524 -16691 -49510 32918
14278 32918 210234 105169 56575 61071 104047 196353 99922 10611 95882 243026 246437
14267 246437 151363 156815 78509 103970 115041 147524 191642 198106 141367 33038 32651 -14423
14255a4423p9748J8250N9069J5364P4760j0973K5832j1407J2208M9069L7680q2563
14243I3118J1808K5656Q3041l0252p5030k4908M4493p913Q0265j1491j47597J6959
14231E8149P3014q1040k4007j03339P0241j6083j44890O0934J04121Q3336J3398
14220I3834O2703k8352j3332j25639p1921P4406L0364N7409j11168M9300K1222
14209C8826j18199P1079M7634P988J0111K356J84183N755J2781p3273p9506j22052
14197a2317P0755L3814J31567N7805q6432j41274n9405R974J77628L8957n3144
14186A67928o517j07808o5771R2641J43555Q9357m9618n234j24544o1224k0546
14175E2219P6883p1888k4669Q7613M3080r302m6080r2612p143J55306J76247m1156
$$ plain form
14255 -14423 -94171 -75921 -16852 -1488 73272 62299 88131 76724 88932 138001 175681 93118
14243 93118 104926 130582 213623 183371 108341 83433 127926 120013 200278 188787 41190 58149
14231 58149 131163 50123 26116 -77223 -6982 -23065 -167955 -107021 -2900 80436 93834
14220 93834 156537 128185 114853 -10786 -82707 -8301 22063 79472 -31696 17604 38826
14209 38826 -79373 -8294 39340 47328 57439 59795 243978 249733 262514 189241 109735 -12317
14197 -12317 58438 92252 223819 281624 195192 53918 -5487 4487 182115 221072 167928
14186 167928 161411 53603 -12168 80473 224028 313385 263767 258533 133989 72765 52219
14175 52219 129102 57214 32545 120158 163238 153936 107856 15244 8101 163407 339654 298498
14163B98498j4919p6116j16515j0051k17297k4811P1743J8849p1565q9174N9605
14152a71753k3935K18103J88562j44334j33993M5660Q2543J5826n7289o6911k155
14141d9676k2861n8661O9138J71341m5335k3574L529n4775j08560Q7555N8693
14130B6814j10098p9104P735J6149L4277k7747K4851J50353O5375j0255J9345
14119A17695j8879l4803J51335M5396j48184K4603p4033j02527n1100P3708K3118
14108F329k5988k3600k2588J72983o4440j43036l008J04362N2822j01526p0962
14097a18652n7709K3933J54797P6053l4704N4678N7462p0620j69991j2579P4996
14086b2336l2074r5503O9052P6353J11291J6798p3071K8132O695J0780K0558L6278
$$ plain form
14163 298498 283579 207463 90948 80897 -136400 -161211 -89468 -70619 -142184 -231358 -171753
14152 -171753 -195688 22415 210977 66643 -67350 -21690 60853 76679 19390 -47521 -49676
14141 -49676 -72537 -131198 -62060 109281 63946 40372 43901 -10874 -119434 -31879 26814
14130 26814 -83284 -162388 -154653 -138504 -104227 -131974 -107123 43230 108605 98350 117695
14119 117695 98816 64013 215348 260744 112560 137163 63130 -39397 -90497 -16789 6329
14108 6329 -19659 -43259 -65847 107136 42696 -100340 -103348 1014 53836 -47690 -118652
14097 -118652 -176361 -152428 2369 78422 43718 98396 155858 85238 -84753 -97332 -22336
14086 -22336 -54410 -149913 -80861 -4508 106783 123581 50510 78642 85337 96117 116675 152953
14074A52953k5094M703O0854l4887r090l8500m2342M6903J2807P264L8948j20218
14062E4301r9455j1773N6760m4563k0225M3800N8652Q962l3428r7434P9181L6044
14050C0822l2849l6253L4095J00493j1039j05613r089P7693J80339k4843n5412
14039A48344O4718M811o4027O3670q2483o4690n7805J36181m1399l5620n1433
14028B0267J8435M1727O2871m1114p8677l1067N3430J29412J3036K8478j62471
14017E4327q4325l7752J54394m6564J8235N2361o0559R35n8851L3611P1245M3119
14005A40176P1435P639j4591M6057m496q3098o3446r5981m5052R0255K4732J39353
13993B12983N212r6009k25338n0348J04383J65906J00436k7096q1961n3426o0077
$$ plain form
14074 152953 127859 132562 193416 158529 149439 110939 68597 115500 128307 135571 174519 54301
14062 54301 -45154 -56927 -167 -44730 -64955 -21155 37497 46459 13031 -84403 -5222 30822
14050 30822 -2027 -38280 -4185 96308 85269 -20344 -29433 48260 228599 203756 148344
14039 148344 213062 217873 153846 217516 135033 70343 12538 148719 107320 71700 20267
14028 20267 38702 80429 143300 102186 23509 -7558 45872 175284 188320 216798 54327
14017 54327 -29998 -67750 86644 40080 58315 110676 50117 51052 -7799 25812 97057 140176
14005 140176 211611 219250 204659 250716 246220 163122 99676 3695 -41357 48898 73630 212983
13993 212983 218195 122186 -103152 -153500 -49117 116789 217225 190129 108168 54742 -5335
13982e335P3640n4473n4898o1854R6013P9523k4402q6231P2237k1086N598p2782
13970e4050P4818J12852K3070L9380l6717j37746O0545Q0199L0609m7986k3772
13959A21202K9722p7159o2328J4793J51963n3j42231Q9489O0425j9885p4081m8064
13947D3793m9364J4773J63404k3587l7092k9947M6230K02784L4741j43777j34526
13936H7432j8122j18980L8124l0179k0676M9219K8722J1015j2343l8305N9401
13925C5308Q2457M1516O0707m2369j8406o8351m7285n191J2888K6037q9770J3233
13913G74N759O635j246o161j9612O5675n10L4015j3060K3391k6553r8926O6318
13900C6499J18575n5987q8475j36966J31291Q265j04544m1393J31838J7922Q1910
$$ plain form
13982 -5335 68305 13832 -41066 -102920 -6907 72616 48214 -38017 34220 13134 18732 -54050
13970 -54050 20768 133620 156690 196070 159353 21607 82152 162351 192960 144974 121202
13959 121202 150924 73765 11437 26230 178193 178140 35909 125398 185823 165938 91857 43793
13947 43793 -5571 9202 172606 149019 111927 81980 128210 330994 365735 221958 87432
13936 87432 69310 -49670 -11546 -41725 -62401 -13182 15540 26555 14212 -24093 35308
13925 35308 117765 159281 219988 177619 159213 90862 43577 38386 51274 77311 -12459 774
13913 774 6533 13168 11922 5761 -13851 51824 51314 85329 72269 95660 69107 -29819 36499
13900 36499 155074 99087 10612 -126354 4937 13202 -91342 -132735 -897 17025 98935
13889I8935P9540j3737N6873j00996q2309K3428r314l1173n3754m4249R8993N1635
13877G3872m1621P2637j34394k9193P6656R1405L2785M9567J4194j20878j96728
13866a11698N7597J7953j5771m2775K8013J26506N0823m376Q8899q0023m73K6319
13854A40994n4603J10172o7142o3249n9427r8607N466J41397J58292j19543j42431
13843d8681Q013n9444O7082J12086M3898o8332k5563L977L9840q6655k4246k1133
13831e9158p5531J05493K8087K2492L2462R9919J13884n4758j47846R4987J54581
13820C14612k3439j42437j0057l9764j2365k3496M3915M6514K7400o6111Q766
13809A23538q1930l1399O6451l2221M9678J84642j3031j6840k2074m0518q0197
$$ plain form
13889 98935 178475 164738 221611 120615 38306 61734 52420 21247 -32507 -76756 22237 73872
13877 73872 32251 104888 -29506 -58699 17957 109362 142147 191714 205908 85030 -111698
13866 -111698 -54101 -36148 -51919 -94694 -66681 59825 110648 106272 195171 115148 114675 140994
13854 140994 86391 196563 129421 66172 6745 -91862 -86396 55001 213293 93750 -48681
13843 -48681 -40668 -100112 -33030 79056 122954 54622 29059 33036 72876 -13779 -38025 -59158
13831 -59158 -134689 -29196 -1109 21383 53845 153764 267648 212890 65044 160031 314612
13820 314612 291173 148736 138679 98915 86550 63054 106969 153483 180883 114772 123538
13809 123538 41608 10209 76660 44439 94117 278759 265728 248888 226814 186296 106099
13798A06099J7123q4365l3078j18662r3352R1157K945r1514N2524J23760L3517
13787F154o7675J5681J63260m27L3041N4748j1479J8143o3875P2108O5174K2831
13775C07684o4617j96722J8024R31J4794N4534k9181O0414o0651m4585P7791L8808
13763A77224j01231j3487l1549J40268M4936q5433P272o4827m5585k3583O3316
13752F7321j3894m0248N0443R632j05514M209j8627o8058L6848M1028N0627J6934
13740C0701P1768N7641O9792N8591J7056K6044k596r3127r4615M5567l1376j23154
13728C2292o7406R0068k0483O4563J28202j60269m9091L0489P4714K3801m4954
13717A01926p9677j05904K2643K6223R4706J11946M6774Q5861j9174m0935m2330
$$ plain form
13798 106099 123222 38857 5779 -112883 -206235 -115078 -112133 -203647 -151123 -27363 6154
13787 6154 -61521 -45840 117420 116993 150034 204782 193303 211446 147571 219679 284853 307684
13775 307684 243067 46345 64369 65300 80094 134628 105447 165861 105210 60625 138416 177224
13763 177224 75993 62506 30957 171225 216161 130728 138000 73173 27588 4005 67321
13752 67321 53427 13179 63622 73254 -32260 -28051 -46678 -114736 -77888 -36860 13767 30701
13740 30701 102469 160110 229902 288493 305549 331593 328997 235870 141255 186822 155446 32292
13728 32292 -35114 54954 34471 99034 227236 66967 17876 48365 123079 146880 101926
13717 101926 22249 -83655 -61012 -34789 59917 171863 218637 304498 285324 244389 202059
13706B02059L6202K7665l7829j17207O2759J42799J9361j66486q9548J8679j9036
13695G9418O2765Q8906l0966p3561j07335l3188J17558K23317N1841P997m0171
13684C46581k0305o7718O5010J5223O0187p8610j32765j16722p225P7484p21K2691
13672A63110L7112j7248K3267L9355N4541k0353j40579M0637L664k3844K1200
13661A80862l1831j79871k6591R6843Q5321j8060j56197L0907J11670l1125l1705
13650C0223o9690r924N4082m585j1110J05924j1968J09999o5409P9723J8989r9267
13638A26987j31832j43471p824M1213Q1928q630J35061P0590k9946j20820J7575
13627C0831K4741k381N3114m1329N5190q304j18042O5035k8287p7354j16723K8158
$$ plain form
13706 202059 238261 265926 228097 110890 173649 316448 335809 169323 79775 98454 79418
13695 79418 142183 231089 200123 126562 19227 -13961 103597 326914 378755 386752 346581
13684 346581 326276 258558 323568 338791 398978 320368 187603 70881 63656 141140 140419 163110
13672 163110 200222 182974 206241 245596 300137 279784 139205 179842 183506 159662 180862
13661 180862 149031 -30840 -57431 39412 124733 106673 -49524 -18617 93053 61928 30223
13650 30223 -39467 -49391 4691 106 -11004 94920 82952 192951 127542 207265 226254 126987
13638 126987 -4845 -148316 -156140 -114927 -32999 -41629 93432 164022 134076 13256 30831
13627 30831 55572 53191 106305 64976 120166 111862 -6180 58855 30568 -46786 -163509 -135351
13615a35351J64373K7681j4618j8835j10170Q2968J28993J9494n1285o1623M2798
13604G4425Q1988m6895L6064J6186j64951n1193K13742N6441n9269q8764j81688
13593a13914L7054O786P3178O5729P2943j6778P2806L2511j297m4643k2589p7123
13581H4663m8280K7102k2336R2683J37915K2872j6412J1030M0015K5837p6834
13570B78255q5064j35652j5832O9312K0333o9292l5752Q9412o7113L7785J67363
13559B53755J24235j19487j13725L0891L6683J17699K5468M2939k29095o6274
13549A03089Q5870j6139n3653q127q7943r0243m4171N7945J18602j2471R9232
13538A51991K987p9054l3663J25072J32754k6774j15522L4655R1106O6558p0517
$$ plain form
13615 -135351 29022 56703 42085 23250 -86920 -3952 125041 144535 93250 31627 74425
13604 74425 156413 109518 145582 161768 -3183 -54376 159366 215807 156538 67774 -113914
13593 -113914 -76860 -70074 3104 68833 141776 124998 197804 230315 229018 184375 161786 84663
13581 84663 36383 63485 41149 133832 271747 294619 278207 289237 329252 355089 278255
13570 278255 193191 57539 41707 111019 131352 62060 26308 115720 48607 86392 253755
13559 253755 377990 258503 144778 175669 212352 330051 355519 398458 169363 103089
13549 103089 188959 172820 119167 111040 23097 -67146 -111317 -53372 65230 52759 151991
13538 151991 154978 75924 42261 167333 300087 273313 157791 192446 283552 350110 279593
13527B79593p0661l83K9332q3515n4726R315K7468n3784L4677P4644R957n881
13515A96036p3750k9921N9892K1495J07250m6659n7850Q141o3140o989P4274K8014
13503B16793k7126j16683l8409Q1029j1155l1255j2440O9427O2034J06363L1467
13492C30045m0265n8329m8178l9708j18658j3131J76790j8618j63946r3717j134
13481h8849J24305J59736L1458j7012Q7258l4222P2289N0582j6973n9841j09593
13470A99138o3504j4612o914K1081R8642k4377M9994l2408l6427j49058M7709
13459H9264r454J10879J66082J7800j14664J03761l497l6414l4136o3890Q3801
13448C09532N4509R747l494K0970k5236r0200o3635j2671l5616q9009m7643l3141
$$ plain form
13527 279593 208932 208549 237881 154366 99640 108955 136423 82639 117316 191960 201917 196036
13515 196036 122286 92365 152257 173752 281002 234343 176493 184634 121494 114505 188779 216793
13503 216793 189667 72984 34575 115604 104449 73194 60754 130181 192215 298578 330045
13492 330045 289780 231451 183273 143565 24907 11776 188566 169948 6002 -87715 -88849
13481 -88849 35456 195192 226650 209638 296896 262674 334963 385545 368572 308731 199138
13470 199138 135634 121022 114108 135189 233831 209454 259448 227040 190613 41555 89264
13459 89264 79810 190689 356771 374571 259907 363668 360171 323757 289621 225731 309532
13448 309532 364041 373788 370294 391264 366028 275828 212193 199522 163906 74897 27254 -5887
13436e887k0253n8099K13634J02862M3717n6659j12664p067R5775j1848o6134
13425A17377Q262O2216J958j58790j42725J1498Q8349K8673m4830j50204J65273
13414a2943Q1772j8122k977k9436j10688J35594J33543N4296m4932R5027K2369
13403C03503P3667p7465j5804k8153M9550K0854j42443o3108K03117Q9342k4959
13392C88101Q07m3270j49169j09928J8251P4752r052p1433j2225M3367J12614
13381B42815m6362k15454q140J12515P9952J57897M5200L2281P9805j46590j04151
13370B29768J95477K40618m6474j99938p5127m708n6827j74658n8410J13369O52
13359A63742l6003j8790r5634K7333Q0358j664J11853J0183q7768j15770m205
$$ plain form
13436 -5887 -26140 -84239 129395 232257 275974 219315 106651 99584 195359 183511 117377
13425 117377 125639 187855 189813 31023 -111702 -100204 -11855 16818 -28012 -178216 -12943
13414 -12943 68829 50707 47730 18294 -92394 43200 176743 231039 186107 281134 303503
13403 303503 377170 299705 283901 255748 305298 326152 183709 120601 323718 413060 388101
13392 388101 388908 345638 196469 86541 104792 179544 170492 99059 86834 130201 242815
13381 242815 196453 -19001 -27141 85374 165326 323223 368423 400704 480509 333919 229768
13370 229768 425245 665863 619389 419451 344324 339616 282789 108131 49721 163090 163742
13359 163742 127739 108949 13315 40648 121006 119342 231195 241378 153610 37840 33635
13348C3635J70782J03626o0741O5673N779j49347O445O8460R258r1922l7302j7323
13336A07023m3383O6129Q0684o9934J6333M8250J646Q218R273j49574o1273O0251
13324G3643Q9032O8334r2610j70915l043Q1559M3818Q5521J23872K13222K9080
13313E41513j46110k23731N0090L0069j8138J17299m4208p7814K259J13670L1460
13302C76359O5418l6717n3214M9939P0572p1454j13117j64372L2303J57259L4405
13291C47381L5409k2091k6227n2960n7287n9627P779m1736J00237j8513j6952
13280A95413m3177K3398J06672M1397K3646N4367J4259q0739m4770l4398k3027
13269B33041P323O1193j04374m2623j7456m5552m2777J3003M7994L0585M0589
$$ plain form
13348 33635 204417 308043 247302 312975 318754 169407 175852 244312 253570 161648 124346 107023
13336 107023 63640 129769 210453 140519 156852 205102 206748 214966 224239 74665 13392 73643
13324 73643 162675 231009 138399 -32516 -35559 46000 89818 175339 299211 512433 541513
13313 541513 395403 171672 221762 251831 233693 350992 306784 228970 231229 344899 376359
13302 376359 441777 405060 351846 401785 472357 400903 287786 123414 155717 312976 347381
13291 347381 382790 360699 334472 281512 224225 164598 172377 130641 230878 212365 195413
13280 195413 152236 175634 282306 323703 347349 401716 415975 335236 290466 256068 233041
13269 233041 240364 301557 197183 154560 137104 91552 48775 61778 109772 140357 180946
13258A80946J321M0692J1134j12677N2623R9197J54322O9930n2472J9821j11N8637
13246E23363R3129K8617r1143j09878n0027J441l0629o0270m4876P9297J12794
13235D51818q620o971l898j6751k3667k8547j3664K2852L8048P7389k3920j60804
13223C03265k4379J00276P4688n511M7038N7580M2311k6435l9569P2128k8584
13212E72808p856P2236P6912j55093O7776P506k5507J792M2691p0364K1472J14064
13200G18437R4282r687j9769p1748o0659k0421K9434J08810J45494J3516P0166
13189I97855J06575K42232K33736K55853J59227J85952K547j73292j14447j72192
13179A724046q8688j05343o5826p3939l9363n9485j37836J5227J0764N5643J36731
$$ plain form
13258 180946 182267 222959 234093 121416 174039 273236 427558 497488 445016 464837 464726 523363
13246 523363 616492 645109 553966 444088 394061 395502 364873 304603 259727 339024 451818
13235 451818 443198 436227 432329 415578 391911 363364 349700 372552 410600 487989 464069 303265
13223 303265 278886 379162 453850 448339 495377 552957 595268 568833 529264 601392 572808
13212 572808 564952 637188 714100 559007 626783 634289 608782 610574 653265 582901 604373 718437
13200 718437 812719 803032 783263 711515 650856 630435 659869 768679 914173 927689 997855
13189 997855 1104430 1346662 1580398 1836251 1995478 2181430 2183977 2010685 1896238 1724046
13179 1724046 1635358 1530015 1464189 1390250 1350887 1291402 1153566 1168793 1179557 1235200 1371931
13168A371931J21791N5512O0976L5764O7777P1730J64898J24651K4582P2410J98087
13157B370109K61160J65308J90169Q1569K4674j24911l40758j81090j93613p1218
13147B181399j05978q8215k5796l5147l8496n8813j33287j49981m5082j0851r1176
13136A398577o9886N6846M6100l1762n823P2206K36391L28220K96389Q4890N632
13125B417780j10404q1346j78604k56133j66610m7461j05882j93896r4036p4131
13115A109277K7060P3286r3342P9302N7714K5420J52849J02640o3791k76796j94524
13104I99095J2348m1390N4139l0978k9564p9101j15543j46366j36396k0785K5634
13093D91093O2582K1162J35643K0504m5414n3808p4456m5643O0887J03046k819
$$ plain form
13168 1371931 1493722 1549234 1610210 1645974 1713751 1785481 1950379 2075030 2099612 2172022 2370109
13157 2370109 2631269 2796577 2986746 3068315 3092989 2968078 2627320 2446230 2252617 2181399
13147 2181399 2075421 1987206 1961410 1926263 1887767 1828954 1695667 1545686 1500604 1489753 1398577
13136 1398577 1328691 1385537 1431637 1399875 1394052 1466258 1702649 2030869 2327258 2412148 2417780
13125 2417780 2307376 2226030 2047426 1791293 1624683 1577222 1471340 1277444 1183408 1109277
13115 1109277 1136337 1209623 1116281 1195583 1253297 1278717 1431566 1534206 1470415 1193619 999095
13104 999095 1011443 970053 1024192 993214 963650 884549 769006 622640 486244 465459 491093
13093 491093 553675 574837 710480 730984 685570 631762 557306 511663 572550 675596 672777
13082F72777O2349j27951m108O2252o2510M4104R2533j17810r8248J748J61163
13071F86299j4968J12188P4938o3263J04106P3171L757N108M4011o2776j35036
13060H27535j18580N9518L3618K695o6598j61559l6234J32554O789q4682J45809
13049G40865R3229j8943j20699K08146O4777j0237j99m3218K0228j3951q0999
13038H38999p4695l6247n5839o7244J10398J44760l5286q0627Q1986J06993K38534
13027A171732r0047j61938l8045P4235K2513r0734r1317Q8333K249j546k0499
13016H64936N0258L4671j32995r6634K3812J35210n8123j57196J4503K7805k6074
13005F80173N3093N4628m2896J16452k7110j49723L9698P536N7498N8989j58051
$$ plain form
13082 672777 735126 607175 603067 665319 602809 646913 739446 621636 523388 525136 686299
13071 686299 671331 783519 858457 795194 899300 972471 976228 981336 1025347 962571 827535
13060 827535 708955 768473 802091 804786 738188 576629 540395 672949 679738 595056 740865
13049 740865 834094 815151 694452 902598 967375 957138 956939 913721 933949 919998 838999
13038 838999 764304 728057 672218 604974 715372 860132 824846 744219 826205 933198 1171732
13027 1171732 1081685 919747 881702 955937 978450 887716 796399 884732 886981 885435 864936
13016 864936 915194 949865 816870 720236 744048 879258 821135 663939 678442 706247 680173
13005 680173 733266 787894 744998 861450 834340 684617 724315 731851 789349 848338 690287
12994F90287q2299N5838J35727O7681J49818L0669p8137K1823n9660j09652L8002
12983H60097J29661L6184j2596q7021k4979J19034N9178r4533j34782K6043O006
12972H82292J73896L0993k7410N9724q939j802k6039l622J8067J248o8016o432
12960A023960Q1386O4995K0984O5039L1395K0088r4470m1420J917Q146l4585o1246
12948A086189J60199K71241J31514K0593n648Q5720J0674R7285J20242J81852
12938B159861J99976L04042J53335J26440N3396k4534k7804q944q1759j96395
12928B657614j64773k02023o2084O1577O1223o8120L5309O2015N8369l2116J20630
12917B527621K06050O7727J25652J75718K3839q6436K6414J3018R6492J00999
$$ plain form
12994 690287 607988 663826 799553 867234 1017052 1047721 969584 991407 931747 822095 860097
12983 860097 989758 1025942 1013346 926325 901346 1020380 1079558 985025 850243 876286 882292
12972 882292 1056188 1087181 1059771 1119495 1110556 1108754 1082715 1079093 1097160 1098408 1030392 1023960
12960 1023960 1105346 1170341 1191325 1256364 1287759 1307847 1213377 1171957 1173874 1182020 1147435 1086189
12948 1086189 1246388 1517629 1649143 1669736 1664088 1749808 1760482 1857767 1978009 2159861
12938 2159861 2359837 2663879 2817214 2943654 2997050 2972516 2944712 2935768 2854009 2657614
12928 2657614 2492841 2290818 2228734 2290311 2351534 2283414 2318723 2380738 2439107 2406991 2527621
12917 2527621 2733671 2801398 2927050 3102768 3126607 3040171 3066585 3079603 3176095 3277094
12907C277094m6650r5877J8830J91095Q0067P9290p895r2350q0546P6412J14670
12896C514140J9600k6962K2307J01629J63678R4641j02239j88505j01866j92143
12886C304280m12855l05626k8472k1686R6639R4324R9185J05044K08405K84113
12876C423351M4183J12553J55961J68397m3204o5740j73623j61428j49482j84336
12866C126632q5835L2066m2520m075j2781m2979N5368j03688m3366p56m0528j26427
12854B711111q5005O0179R6992R3826l7090P1527K12p1605k32651j38115N9886
12843B529267P0278M6626r1146j28210J5187L9896J37522J07880j8796L896k5619
12832B686781J51536P1410m1841r052k54576k02034J6868o2981j15069J04084
$$ plain form
12907 3277094 3230444 3134567 3153397 3344492 3424559 3503849 3495954 3403604 3323058 3399470 3514140
12896 3514140 3533740 3506778 3529085 3630714 3794392 3889033 3786794 3598289 3496423 3304280
12886 3304280 2891425 2585799 2557327 2535641 2632280 2726604 2825789 2930833 3139238 3423351
12876 3423351 3467534 3580087 3736048 3904445 3861241 3795501 3621878 3460450 3310968 3126632
12866 3126632 3040797 3072863 3030343 3026268 3013487 2970508 3025876 2922188 2878822 2878066 2837538 2711111
12854 2711111 2626106 2686285 2783277 2877103 2840013 2911540 2911752 2840147 2607496 2469381 2529267
12843 2529267 2599545 2646171 2555025 2426815 2442002 2481898 2619420 2727300 2708504 2712400 2686781
12832 2686781 2838317 2909727 2867886 2858834 2604258 2402224 2419092 2356111 2241042 2345126
12822B345126M5079p5553r28Q1134J13050l5139O0460Q6627J70326R2496p0644
12811B812034q3201M9646j8019p7550J48952J61313J08506M3408K65484J90179
12801C600752J6827J58568R3761j1320j8154J73383K25792R1582o621n9258P7288
12790D342600K1547O3500J33993P0152O4788R6448J11038J33891J93371R6646
12780E327974R9364K64403K35536J21927J4317K63917L48876L28524K40827L42726
12770G588391L24779M09453L51458L28681L51283M00538M51387M31092M54878
12761A1091940O75544P69926P88381J020977J078656J281516J551805J719923
12753A9978668J905010K094880K430210K807427L005408L278099L920172M763561
$$ plain form
12822 2345126 2390205 2314652 2313724 2394858 2507908 2472769 2533229 2619856 2790182 2882678 2812034
12811 2812034 2728833 2778479 2760460 2682910 2831862 2993175 3101681 3145089 3410573 3600752
12801 3600752 3617579 3776147 3869908 3858588 3840434 4013817 4239609 4331191 4324570 4265312 4342600
12790 4342600 4364147 4427647 4561640 4631792 4696580 4793028 4904066 5037957 5231328 5327974
12780 5327974 5427338 5691741 5927277 6049204 6063521 6327438 6676314 7004838 7245665 7588391
12770 7588391 7913170 8322623 8674081 9002762 9354045 9754583 10205970 10637062 11091940
12761 11091940 11767484 12537410 13325791 14346768 15425424 16706940 18258745 19978668
12753 19978668 21883678 23978558 26408768 29216195 32221603 35499702 39419874 44183435
12745D4183435N989585P557269R867388J3009157J7367331K3314547L0713820
12738A52002532L9379555M7709661N2038539M5574137K5117782j451822k3866052
12731C36504332l8033969m2523479l8934707l1469072k2598749j4264839p101286
12724A41578231p89716M441375Q905049J2575133J5124159J5905542J4918193
12717B12657966J2495320R479529P025471N940006O273263Q709445J2790873J7243729
12709B92615602K0979417K2274701K0488282J4708223N398707n287967j4396819
12702C56780146k0256826k2806657k1988883j8492844j3894257r375774n547468
12695B44417437k875367j806480k891335n577502q977214j2298550j4352856j4584744
$$ plain form
12745 44183435 50173020 57730289 67597677 80606834 97974165 121288712 152002532
12738 152002532 191382087 239091748 291130287 336704424 361822206 360370384 336504332
12731 336504332 298470363 255946884 217012177 185543105 162944356 148679517 141578231
12724 141578231 140788515 145229890 154134939 166710072 181834231 197739773 212657966
12717 212657966 225153286 234632815 241658286 247598292 253871555 262581000 275371873 292615602
12709 292615602 313595019 335869720 356358002 371066225 376464932 371176965 356780146
12702 356780146 336523320 313716663 291727780 273234936 259340679 249964905 244417437
12695 244417437 241542070 239735590 236844255 231266753 222289539 209990989 195638133 181053389
12687A81053389j2719631r460440m755334R00571P478407J5337979K4492383L4525820
12679B36853144M3086438M7017342M1437335K2978992m796003l0105165m5996353
12672C10475730n1868594m9068453m1499083l2905125k5149460j8863273j4235449
12665G6886293j0940497q462363o628070n483652m536199l951938l419626l038991
12657C0424957k708058k438961k065619j862679j699999j560581j372851j184420
12649A5531789r05599q06955p42348o89849p84648p09130o18078n00558m73029
12640I301595n43810n02525m88054m00330k76057k39646k58113l24085k74007
12631E994968k54417k84761r8053j51903k72661j92000j04376k16769j24525p3089
$$ plain form
12687 181053389 168333758 158873318 154117984 155018555 162496962 177834941 202327324 236853144
12679 236853144 279939582 326956924 368394259 391373251 386577248 356472083 310475730
12672 310475730 258607136 209538683 168039600 135134475 109985015 91121742 76886293
12665 76886293 65945796 57483433 50855363 45371711 40835512 36883574 33463948 30424957
12657 30424957 27716899 25277938 23212319 21349640 19649641 18089060 16716209 15531789
12649 15531789 14626190 13819235 13076887 12387038 11602390 10893260 10275182 9774624 9301595
12640 9301595 8757785 8255260 7767206 7366876 7090819 6851173 6593060 6268975 5994968
12631 5994968 5740551 5455790 5357737 5205834 4933173 4741173 4636797 4420028 4295503 4222414
12621D222414j17414q0816K2068j39488j63975q2803n4119p4861p4087j35356
12611C321563o5243k7314R536m1142O8377J1646r2565j43051J6606R765j02789
12600B965389n2786K8568J755k1464o9430j24461r9545K8983p212j22281J3988
12589B541504j57888m7386L2288Q2158K4103j26253j75271j35003p7685k15096
12579A745471k1127j08367P585J19833P8201J73759R8384R6227Q4714J49819k8729
12568B395770j43489J44145R4857J72829J52767J98951M5154j50498m5831R268
12558B873923q6093j93755l55845j79813q204r8988j67691k59461k16324K8065
12548A335814K8551J538J2182J02606N1559J31096J10089n7597m2605J9787j3197
$$ plain form
12621 4222414 4105000 4024184 4046252 3906764 3742789 3659986 3605867 3531006 3456919 3321563
12611 3321563 3256320 3229006 3238542 3197400 3265777 3277423 3184858 3041807 3058413 3068178 2965389
12600 2965389 2912603 2941171 2942926 2921462 2852032 2727571 2628026 2657009 2649797 2527516 2541504
12589 2541504 2383616 2336230 2368518 2450676 2474779 2348526 2173255 2038252 1960567 1745471
12579 1745471 1724344 1615977 1623562 1743395 1821596 1995355 2093739 2189966 2274680 2424499 2395770
12568 2395770 2252281 2396426 2491283 2664112 2816879 3015830 3060984 2910486 2864655 2873923
12558 2873923 2787830 2594075 2238230 2058417 2050213 1951225 1783534 1524073 1307749 1335814
12548 1335814 1364365 1365903 1378085 1480691 1532250 1663346 1773435 1715838 1673233 1693020 1679823
12537A679823j25499O768p4832p5058K8708J63662J16677n0734l3028k777N8498
12526A692208J9228L0236j05117j94652j93268k22382j29191r8648Q8824N9311
12516I46549K04815J55569R523j7069J27839M1043j2968K8971J40561J27664J45609
12505A898106Q8722j10580l7424K8137k0007j01470o1369q9414J38249J96588
12495A929538k3978N7574l1433M1738N4786M9528O4387K6383R1764j77741j37615
12484A944931J19632M7222o196p3489k1944J36179P8797J5020N5539J04486N2560
12473B452737q8452R1227P5593N9667j0298J0372m9965j25502m8430P5936q711
12462B434174j93427l1887J05570O0932R2785q5227o7305k6685J01056K19623
$$ plain form
12537 1679823 1554324 1561092 1486260 1411202 1439910 1603572 1720249 1669515 1636487 1633710 1692208
12526 1692208 1711436 1741672 1636555 1441903 1248635 1026253 897062 798414 887238 946549
12516 946549 1151364 1306933 1316456 1299387 1427226 1468269 1455301 1484272 1624833 1752497 1898106
12505 1898106 1986828 1876248 1838824 1866961 1846954 1745484 1684115 1594701 1732950 1929538
12495 1929538 1905560 1963134 1931701 1973439 2028225 2077753 2142140 2168523 2260287 2082546 1944931
12484 1944931 2064563 2111785 2105589 2032100 2010156 2146335 2225132 2240152 2295691 2400177 2452737
12473 2452737 2364285 2455512 2531105 2590772 2580474 2590846 2540881 2415379 2366949 2442885 2434174
12462 2434174 2240747 2208860 2314430 2375362 2468147 2382920 2315615 2288930 2389986 2609609
12452B609609P8531r3611j03072K2320m8055O5811J11150J30806Q2028j35209
12442B720308j66839m6067J64764K54697r962j36177j20Q1370M6846J02082J65471
12431C176373k3266O2475Q3133l7904J8393K6646o9388j28821m0797J64894K93
12420C232031n7328J8251l5114P9699J42530M3824o189J22233J3413J952o0972
12409C494330N4268J38679J19599P7823l7128m975j1569p3828Q8983J27469j1491
12398C962160J5961J15386O2029M8673L9001o0769N400K9028J02030K0244O679
12387D345822P8814P0115O2024K5379j7110n7176J47412P07N4616J40919P0208
12376D921730Q9584Q8753O3731j11507l4030J60355M0319K1981K5102L1858R4464
$$ plain form
12452 2609609 2688140 2594529 2491457 2513777 2465722 2531533 2642683 2773489 2855517 2720308
12442 2720308 2553469 2507402 2672166 2926863 2916901 2780724 2780604 2861974 2908820 3010902 3176373
12431 3176373 3153107 3215582 3298715 3260811 3279204 3305850 3236462 3107641 3066844 3231738 3232031
12420 3232031 3174703 3192954 3157840 3237539 3380069 3423893 3417704 3539937 3553350 3555302 3494330
12409 3494330 3548598 3687277 3806876 3884699 3847571 3842596 3831027 3757199 3846182 3973651 3962160
12398 3962160 3978121 4093507 4155536 4204209 4243210 4182441 4187841 4216869 4318899 4339143 4345822
12387 4345822 4424636 4494751 4556775 4582154 4565044 4507868 4655280 4655987 4710603 4851522 4921730
12376 4921730 5011314 5100067 5163798 5052291 5018261 5178616 5218935 5240916 5266018 5297876 5392340
12365E392340N7836P8121O1649O6306J23690J82677J46672J33236K9393J29871
12355F401791J14767R5028J7766n8798k6932K61533J80285M8011M3606J32500
12345G209557R6988J50851J56112L4529J59785J52971K04678R4327J82333J25200
12335H567331J71227K55757J59847J65146Q0868J16473J15717K03768J49146K08748
12325A0194028K18298J24118K08360K00821K20871K89118J63909K52594L58998
12316A2231115K89042K06456K06727L56407L17054K25991K68121M39126M21286
12307A4961325L13514K86647M35188L74403M66392L32738M14493M19016M53058
12298A8456774N36261N20078N18607N01786M59544N58555N87024P19250N97093
$$ plain form
12365 5392340 5450176 5528297 5589946 5656252 5779942 5962619 6109291 6242527 6271920 6401791
12355 6401791 6516558 6611586 6629352 6570554 6543622 6805155 6985440 7033451 7077057 7209557
12345 7209557 7306545 7457396 7613508 7648037 7807822 7960793 8165471 8259798 8442131 8567331
12335 8567331 8738558 8994315 9154162 9319308 9400176 9516649 9632366 9836134 9985280 10194028
12325 10194028 10412326 10536444 10744804 10945625 11166496 11455614 11619523 11872117 12231115
12316 12231115 12520157 12726613 12933340 13289747 13606801 13832792 14100913 14540039 14961325
12307 14961325 15274839 15561486 15996674 16371077 16837469 17170207 17584700 18003716 18456774
12298 18456774 18993035 19513113 20031720 20533506 20993050 21551605 22138629 22857879 23454972
12289B3454972O37733P59061Q07228Q35014Q22522P52308Q46190J112122J045334
12280C1072484J061448J187077J157407J136940J194921J124410Q95622R03202
12272C9733511J101223J207880J172831J226249J362019J517382J699820J754713
12264E0775628J670493J866009J999666J942855K066180K003468K074420K147420
12256F6546139K187860K330465K400462K441934K500108K453678K504420K457095
12248H5822161K431254K410628K289336K268738K099758K007866J999745J896984
12240A03226470J597916J643410J496588J107975Q00444O36306O26908K14587
12232A11350604j81594l70124n03732p01655r25347j172293j502995j678912j570154
$$ plain form
12289 23454972 24092705 24851766 25658994 26494008 27316530 28068838 28915028 30027150 31072484
12280 31072484 32133932 33321009 34478416 35615356 36810277 37934687 38830309 39733511
12272 39733511 40834734 42042614 43215445 44441694 45803713 47321095 49020915 50775628
12264 50775628 52446121 54312130 56311796 58254651 60320831 62324299 64398719 66546139
12256 66546139 68733999 71064464 73464926 75906860 78406968 80860646 83365066 85822161
12248 85822161 88253415 90664043 92953379 95222117 97321875 99329741 101329486 103226470
12240 103226470 104824386 106467796 107964384 109072359 109872803 110509109 111136017 111350604
12232 111350604 111169010 110798886 110295154 109593499 108668152 107495859 105992864 104313952 102743798
12223A02743798j653773j720869j903635k149088k209376k272895k497925k618754
12215H5717483k668284k644138k645761k308000k375142k410900k289734k373385
12207F6002139k286180k193947k068640j927497j819090j825449j846566j814978
12199E0219792j478828j401246j581245j650912j541720j435812j377505j338108
12191C8414416j324681j269642j043622r34084q85895r98469j007695r40457q41772
12182B9168099r40000q05667p20237r66948q49447p14561p42425o53272n45294
12173B2230248n43924n98691n23368m79813m93274n57681n65894m92287m00239
12164A7575077l05558l70285l02643m55391n20557l98618l27267l10401l26877
$$ plain form
12223 102743798 101090025 99369156 97465521 95316433 93107057 90834162 88336237 85717483
12215 85717483 83049199 80405061 77759300 75451300 73076158 70665258 68375524 66002139
12207 66002139 63715959 61522012 59453372 57525875 55706785 53881336 52034770 50219792
12199 50219792 48740964 47339718 45758473 44107561 42565841 41130029 39752524 38414416
12191 38414416 37089735 35820093 34776471 33842387 32956492 31958023 30950328 30009871 29168099
12182 29168099 28228099 27422432 26702195 25735247 24885800 24171239 23428814 22775542 22230248
12173 22230248 21686324 21087633 20564265 20084452 19591178 19033497 18467603 17975316 17575077
12164 17575077 17269519 16899234 16596591 16141200 15620643 15222025 14894758 14584357 14257480
12155A4257480l02818l73841l59087l27384j57839j74150l40322l21629k54029
12146A1646381j74960k94125k48740k02256j86037k40354p4191j62166l10732
12137I752820j86982q7342j17064j20104k29196k13935k80171l19777k33081k09672
12127G755496j11741p9645j44041m2951q1543j21804n5688j39410k20797m9622
12117F708254P629j14396n5541L9229k07813r1957q9479k34938k22789j34393
12107E603806K1233p4165r3086m3678k16726j12454M8974L355n0488l1426l5855
12096E019490o9272k58751j36709K7988J3969J524m6873j71310o6354q4886j24077
12085D104739j19046j2131p4161r7130r9122M2401j12490o827K2497r4356k3936
$$ plain form
12155 14257480 13954662 13580821 13221734 12894350 12736511 12562361 12222039 11900410 11646381
12146 11646381 11471421 11177296 10928556 10726300 10540263 10299909 10225718 10063552 9752820
12137 9752820 9565838 9478496 9361432 9241328 9012132 8798197 8518026 8198249 7965168 7755496
12127 7755496 7643755 7564110 7420069 7377118 7295575 7173771 7118083 6978673 6757876 6708254
12117 6708254 6715883 6601487 6545946 6585175 6377362 6285405 6195926 5960988 5738199 5603806
12107 5603806 5625039 5550874 5457788 5414110 5197384 5084930 5133904 5137259 5086771 5055345 5019490
12096 5019490 4950218 4691467 4554758 4582746 4596715 4598239 4551366 4380056 4313702 4228816 4104739
12085 4104739 3985693 3973562 3899401 3802271 3703149 3745550 3633060 3626233 3648730 3554374 3530438
12074C530438j14678p0729J8964l2217j4124M0708j36378m6230m9274m5274j6206
12063C065000j8733N8441j50614p7129K3364M7172l3906o8201m4875o3853l6929
12052B699737n1283k8326j0040j54609m7805J47002J56794J5739j21889o5259
12042B540061p0064j9506K0897M7878Q262Q8547o4784k65609o0150R7425N6022
12031B378979k7352l4008j1856j08278k41063p6636n16m4274p2061M2537K47786
12020B053258M5816m3322p8505N475O260o5440m6258m860J40263L5367q2243p0598
12008A895213N4723m8643j1091N895m5016J30155J8252L3400o5709j09104l8767
11997A819308q4281p3013K9434n798R960N9603j8322Q6116K8948r9269o9390m2640
$$ plain form
12074 3530438 3415760 3345031 3363995 3331778 3317654 3358362 3221984 3175754 3126480 3081206 3065000
12063 3065000 3046267 3104708 2954094 2876965 2900329 2947501 2913595 2845394 2800519 2736666 2699737
12052 2699737 2648454 2620128 2610088 2455479 2407674 2554676 2711470 2727209 2605320 2540061
12042 2540061 2469997 2450491 2471388 2519266 2527528 2616075 2551291 2285682 2225532 2322957 2378979
12031 2378979 2351627 2317619 2305763 2197485 1956422 1879786 1879270 1834996 1762935 1805472 2053258
12020 2053258 2099074 2055752 1977247 1982722 1988982 1923542 1877284 1872424 2012687 2048054 1965811 1895213
12008 1895213 1949936 1901293 1890202 1896097 1851081 1981236 1999488 2032888 1967179 1858075 1819308
11997 1819308 1735027 1662014 1691448 1685650 1695610 1755213 1736891 1823007 1851955 1752686 1683296 1640656
11985A640656j55431p0177n2621L2418L1184L3598Q6099N2563j50889j54762N3226
11974A345864J23685o7583k3760P3637n7272m4545k2917m2156Q1779j085j11549
11963A254098j22352N3298K086N7079M8059n6204l1409N779J36987k5463K8286
11952A350244r146p1880J08975K8152K7330K7934M374n1707l0730r6943j3880
11941A272723n7053K1045r8828l2075n3029j62357l4440J09293J14047J02274
11931A181600O5889m305j10832m0967n310k8052q3934n1988J16419J42288j2556
11920A168252j14262l5666j50470M3697J37339R4563N1832j14821k02226j6953
11910H61285r1843j4709K6433Q1766p326o3242O6013J50116M0164o1442Q0964
$$ plain form
11985 1640656 1485225 1415048 1362427 1394845 1426029 1459627 1545726 1598289 1447400 1292638 1345864
11974 1345864 1469549 1401966 1378206 1451843 1394571 1350026 1327109 1284953 1366732 1365647 1254098
11963 1254098 1131746 1185044 1187130 1244209 1292268 1236064 1204655 1210434 1347421 1321958 1350244
11952 1350244 1341098 1269218 1378193 1406345 1433675 1461609 1465983 1414276 1383546 1286603 1272723
11941 1272723 1215670 1236715 1137887 1105812 1052783 890426 855986 965279 1079326 1181600
11931 1181600 1247489 1243184 1132352 1091385 1086075 1058023 974089 922101 1038520 1180808 1168252
11920 1168252 1053990 1018324 867854 911551 1048890 1143453 1195285 1080464 878238 861285
11910 861285 769442 754733 781166 862932 855606 792364 858377 1008493 1048657 987215 1068179
11899A068179Q9463r2567j8374J2650L9971r5287r5120k2656K2591j5620j13291
11888G79939O5416R036q2080j8871Q435L3161k1622l1474L9045Q8717J7824j02659
11876G84867l8332p5461P0293J29115K8769j26428p5031O854M1982j0923J44887
11865H80592O9120J9623r5489m0491o270l6234q7739P5029K2868l1903N392O0016
11853H34514k958k3748J447J09871M4708m3516l7083j64583l2543K3966R4677
11842H04752k4927l3472r2432M9005J2794j15510P0538J04419j5035L511j28611
11831F35032m7866M225k0657R2927M2135l4290L8051L6430K8577O1072m5096p2356
11819G18184K8188M3585L8986M7854j1648n8597o8763o9897p3684L6178P6451
$$ plain form
11899 1068179 1157642 1065075 1046701 1059351 1099322 1004035 908915 886259 908850 893230 779939
11888 779939 845355 854391 772311 753440 761875 795036 773414 741940 780985 869702 887526 784867
11876 784867 746535 671074 741367 870482 899251 772823 697792 704646 746628 735705 880592
11865 880592 949712 969335 873846 833355 827085 790851 703112 778141 801009 769106 774498 834514
11853 834514 831556 807808 809255 919126 963834 920318 883235 718652 686109 710075 804752
11842 804752 779825 746353 653921 702926 715720 600210 670748 775167 760132 763643 635032
11831 635032 587166 591391 570734 663661 705796 671506 709557 745987 774564 835636 790540 718184
11819 718184 746372 789957 828943 876797 865149 806552 737789 667892 594208 630386 706837
11808G06837Q1484j1263j51315O1078r817n1205j2198J7383K2613Q2882q9965
11797F46514n0084M2769O4879Q3476k0000o7181J23822K3792j72835l3075P1961
11786G14038m2698j1999O5695m857j36309n7308o009J7170P533M850j8368M5333
11774E77071j0849L7389N5722p0609j02631Q8310q437J13111J40690o1906q5708
11763F72153L435j4435J26564l4875l8157L4925N4113j9879P702N9803l6718q6446
11751G28185j3461P5868n7307Q7268J00130p5875m7489J142Q7880p9491o401N5977
11739H56426R9276j129L9652q2600L1509J73111P6067j9570P2230J34399n9120
11728A320251j4163J24276K27051J98301K80192K89189L54169M73743L16379L01136
$$ plain form
11808 706837 788321 777058 625743 686821 677004 625799 613601 630984 653597 736479 646514
11797 646514 596430 639199 704078 787554 767554 700373 824195 847987 675152 642077 714038
11786 714038 671340 659341 725036 720179 583870 526562 520553 537723 545256 550106 531738 577071
11774 577071 566222 603611 659333 588724 486093 574403 565966 679077 819767 757861 672153
11763 672153 675588 661153 787717 752842 714685 749610 803723 783844 791546 851349 814631 728185
11751 728185 714724 790592 733285 820553 920683 844808 797319 798461 886341 806850 800449 856426
11739 856426 955702 954573 994225 911625 943134 1116245 1192312 1172742 1244972 1379371 1320251
11728 1320251 1306088 1430364 1657415 1855716 2135908 2425097 2779266 3253009 3569388 3870524
11718C870524K54769N3289j16181p1907j12559l91231k13058q3620j56497j79482
11708B854047j89273n1954P5673j986J40748J19324P4265K35002K26373R2670
11698C574889o7729r0487j8800n4797r1068J93056K45879K35406K30494J85065
11688D341908J98677J62802L3664k01999k03225k47917j35876j56887q1394l0534
11678C679219m6554j93585k7952O5235j24127j23088k18868k90077j48862r2129
11668B479212j10259N1128K0887l9492P6904J49074K63524L61143K59768K15146
11658C727035J94260k74k4534k068k74657l44842l45431l83956l17028l80671
11648A847834j20885o8282j77952j28033l6839j87148k2824P636j09921O8457
$$ plain form
11718 3870524 4125293 4178582 4062401 3990494 3877935 3486704 3273646 3190026 3033529 2854047
11708 2854047 2664774 2612820 2688493 2686507 2827255 2946579 3020844 3255846 3482219 3574889
11698 3574889 3507160 3416673 3397873 3343076 3252008 3445064 3690943 3926349 4156843 4341908
11688 4341908 4540585 4703387 4737051 4535052 4331827 4083910 3948034 3791147 3709753 3679219
11678 3679219 3632665 3439080 3411128 3476363 3352236 3229148 3010280 2720203 2571341 2479212
11668 2479212 2368953 2420081 2440968 2401476 2478380 2627454 2890978 3252121 3511889 3727035
11658 3727035 3921295 3921021 3896487 3894419 3619762 3274920 2929489 2545533 2228505 1847834
11648 1847834 1726949 1658667 1480715 1352682 1315843 1128695 1105871 1113507 1003586 1072043
11638A072043N2502j73793r9306Q4983J08068k249J34101n014l12242o7656Q0709
11627H72146k6518K5583O8691k2042q6332j8620k1021Q4282l9037O1398N0081
11616I48611L9511q8623j28133o9017M1710J40154P0394K1319j07782K7644J27366
11605A023154n8638j87605r6933l2701J7520N612J53837p5063j82190l1962N6941
11594E91972N8108N809K9575O8247J15297k2186l9315k7578p4734n4847Q8807
11583G39155r6737q6729M9814J5675J3360o1590k603J22060N3017l7453J7406
11572G25375o2876p131P4579J11878m2664j2648k03813p0309R5154J01834o1408
11561F47971j36896J01993J69197k3316J01837R1355k9239p4486k1716q4304J70266
$$ plain form
11638 1072043 1124545 950752 851446 936429 1044497 1042248 1176349 1171335 859093 791437 872146
11627 872146 845628 871211 939902 917860 831528 812908 791887 876169 837132 898530 948611
11616 948611 988122 899499 771366 702349 744059 884213 954607 975926 868144 895788 1023154
11605 1023154 964516 776911 679978 647277 664797 670409 824246 749183 566993 535031 591972
11594 591972 650080 655889 685464 753711 869008 846822 807507 779929 705195 650348 739155
11583 739155 642418 555689 605503 621178 634538 572948 570345 692405 745422 707969 725375
11572 725375 662499 655368 729947 841825 799161 786513 582700 512391 607545 709379 647971
11561 647971 511075 613068 782265 758949 860786 952141 922902 848416 826700 742396 912662
11550I12662K4571k9061j48118k9264J5355K6372m033J07276O6453P9803k00231
11539H21785j06761J734j7107L84J0190O0810J9998j9506m0930M9111J52258J31629
11527A063595j20815j41050k1583N313J7889o0031o4276J21670J04788o7441N349
11516H43408R3396R7712n4406k9949p5799n6128J29125J84714K6268m8880j36751
11505I72710r623K1075j9680j57198j2678J23796Q9189p723J0841N555k1144j1510
11493I83610Q3034Q741P8432N8301O4621K1924M7253j26691j02956j75709j43650
11482G96910q831J19953J55349j0057m076N6421j1029L815J73091K3516m4069
11471A250993N0525j2299j01459j28489L6507K3842j39209N4941P0569J11774
$$ plain form
11550 912662 937233 908172 760054 730790 746145 772517 768484 875760 942213 1022016 821785
11539 821785 715024 716758 699651 700035 710225 771035 791033 771527 730597 779708 931966 1063595
11527 1063595 942780 801730 780147 785460 803349 743318 679042 800712 905500 838059 843408
11516 843408 936804 1034516 980110 950161 874362 818234 947359 1132073 1158341 1109461 972710
11505 972710 963087 984162 964482 807284 794606 918402 1007591 999868 1010709 1016264 995120 983610
11493 983610 1066644 1075385 1153817 1212118 1276739 1298663 1345916 1219225 1116269 940560 796910
11482 796910 788079 908032 1063381 1053324 1049248 1105669 1094640 1098455 1271546 1295062 1250993
11471 1250993 1301518 1289219 1187760 1059271 1095778 1119620 980411 1035352 1105921 1217695
11461A217695J00918R1028m0683J1571N3970J33849N7082K9795P6563N4267K1471
11450A807526J05121P9759m5711J04189J34179o4516j35633k10617j38324j03463
11440A532510J3472N0202M9319l3064L3884m9910L9771J07903J67662J5624M7020
11429A974393R7793R9918R5224N0940J45025J81997J60346K35804K76860J54254
11419C472554j00292P1395p4829j85809r4227l7680m051n37m6963J17646K03695
11408C320902O7888P3908J75042q618l1748k2159o8719l397L0272o9321k88811
11397C175239n8972J21869l265n5397J60669L70605J25104O3255o9973j26973
11387C702161k0434r6215j45884k59085k860o1501n9856R1347L6947q3731M4206
$$ plain form
11461 1217695 1318613 1409641 1368958 1380529 1434499 1568348 1625430 1655225 1731788 1786055 1807526
11450 1807526 1912647 1992406 1946695 2050884 2185063 2120547 1984914 1774297 1635973 1532510
11440 1532510 1545982 1596184 1645503 1612439 1646323 1596413 1636184 1744087 1911749 1927373 1974393
11429 1974393 2072186 2172104 2267328 2318268 2463293 2645290 2805636 3041440 3318300 3472554
11419 3472554 3372262 3443657 3368828 3183019 3088792 3051112 3047061 3046524 2999561 3117207 3320902
11408 3320902 3388790 3462698 3637740 3629122 3597374 3575215 3506496 3503099 3533371 3464050 3175239
11397 3175239 3116267 3238136 3234871 3179474 3340143 3710748 3835852 3899107 3829134 3702161
11387 3702161 3681727 3585512 3439628 3180543 3177683 3116182 3056326 3147673 3184620 3100889 3145095
11376C145095J53158j17601j53702o7041P909J5901l4960M0672J50324K68923
11366C408678K43471N5282J60668M09265K42586O1125j48354p3100K5173K0869
11356D405663l4060J34701M4916J76698N0505J68572J87622J7513M2332J40117
11346E334579K18718J21589J08766J15733J33551K157j14P0856J88030K19228
11336F513093J92071K86274L34939Q3437J90439J92067M55107K84779K80056M18357
11326I230619M80176M98663M20015N51484O45128O70224P21004P03661O66149
11317A4587123R06788R24936Q78946J186742J416613J586621J699937K074891
11309B5262597K498670K894215L114635L649629M476855N388023O478294Q061880
$$ plain form
11376 3145095 3298253 3180652 3026950 2959909 2967818 2983719 2948759 2989431 3139755 3408678
11366 3408678 3652149 3707431 3868099 4277364 4519950 4581075 4432721 4359621 4384794 4405663
11356 4405663 4371603 4506304 4551220 4727918 4778423 4946995 5134617 5152130 5194462 5334579
11346 5334579 5553297 5674886 5783652 5899385 6032936 6035093 6034979 6105835 6293865 6513093
11336 6513093 6705164 6991438 7326377 7409814 7600253 7792320 8247427 8532206 8812262 9230619
11326 9230619 9710795 10209458 10629473 11180957 11826085 12496309 13217313 13920974 14587123
11317 14587123 15493911 16418847 17297793 18484535 19901148 21487769 23187706 25262597
11309 25262597 27761267 30655482 33770117 37419746 41896601 47284624 53762918 61824798
11301F1824798R979674J2893236J6956913K2178655K8947836L6898200M4495021
11294B34174333M8666129M4826871K9906019Q367925j2299413k8163288l6627762
11287B88850814l7810234l3883602k7065308j9419782j1727739m562948K114012
11280A56495213Q024518J2815497J5998095J6306958J3921885R732095M810605
11273B38104866K09051k885258l650426j854489K956106J0317376J9012020K7528715
11265B89737961L3276333L3331782K5514095J1101029n972377k0564655k9360147
11258C37064021l1168785k7201500k0182903j2340812n652877j387004K44894
11251B39375034q84213m008646q520186j3078731j5989558j6559557j4923549
$$ plain form
11301 61824798 71804472 84697708 101654621 123833276 152781112 189679312 234174333
11294 234174333 282840462 327667333 357573352 365941277 353641864 325478576 288850814
11287 288850814 251040580 217156978 190091670 170671888 158944149 154381201 156495213
11280 156495213 164519731 177335228 193333323 209640281 223562166 233294261 238104866
11273 238104866 238313917 235428659 231778233 229923744 232879850 243197226 262209246 289737961
11265 289737961 323014294 356346076 381860171 392961200 386988823 366424168 337064021
11258 337064021 305895236 278693736 258510833 246170021 240517144 239130140 239375034
11251 239375034 238490821 234482175 225961989 212883258 196893700 180334143 165410594
11244A65410594j1445273o974939j525998M478469J0906524J7494801K4255247
11237B02599425L0154595L3737395L2945712K4899361R184750j0612781k7692138
11230B95216319l8074765m1160503l8665488l2652678k6100193k0377317j5704204
11223H2481171j1927261r265083p447722o091435n166543m514497l843595l307865
11215C0917170l005930k591500k234723j973117j764516j425361j080733j045909
11207A5795381r60731j089371q34647p47669p13689n63689n42322m93774p42344
11198I107145o96724m16822l36333m09614l32934l41020l57861j50366k13357
11189E852114j58397q0663k32576l00702j79909k55869j15562j90257k29300j63173
$$ plain form
11244 165410594 153965321 146990382 145464384 149942853 160849377 178344178 202599425
11237 202599425 232754020 266491415 299437127 324336488 333521238 322908457 295216319
11230 295216319 257141554 215981051 177315563 144662885 118562692 98185375 82481171
11223 82481171 70553910 61288827 53841105 47749670 42583127 38068630 34225035 30917170
11215 30917170 27911240 25319740 23085017 21111900 19347384 17922023 16841290 15795381
11207 15795381 14834650 13745279 12910632 12162963 11449274 10885585 10343263 9849489 9107145
11198 9107145 8410421 7993599 7657266 7247652 6914718 6573698 6215837 6065471 5852114
11189 5852114 5693717 5613054 5380478 5079776 4899867 4643998 4528436 4338179 4108879 3945706
11179C945706j75378j29964k89136j26192j3701r3950j74242k40301j1062J1558
11169B703338j87873p1768m652p7684M8210m5722j4592P9386K5589l4497m1422
11158B378313j15887n5324r5364j07090N8141j36398q3216J6039O4667J0313l5721
11147A898473K1995q7913j31065j10820N5951j54226j50324R0828j18689j30469
11137A183741j18316k02565j62659K0687J34255k4076N6996K2116J24729K21660
11127A256568J62060M4964k5039l9914K2604K280K4628j6621M832M0010k0227
11116A456145j15728k2757j5767j29049r9388j05419k28040k37057j91502j81947
11106A29491j49086r6171J11343K49169R8676J7834l1162o060J50584J3324j837
$$ plain form
11179 3945706 3770328 3640364 3351228 3225036 3211335 3117385 2943143 2702842 2691780 2703338
11169 2703338 2515465 2443697 2439045 2361361 2409571 2363849 2349257 2428643 2454232 2419735 2378313
11158 2378313 2262426 2207102 2111738 2004648 2062789 1926391 1843175 1859214 1923881 1934194 1898473
11147 1898473 1920468 1832555 1701490 1590670 1646621 1492395 1342071 1432899 1314210 1183741
11137 1183741 1065425 862860 700201 720888 855143 831067 888063 910179 1034908 1256568
11127 1256568 1418628 1463592 1438553 1398639 1421243 1423523 1448151 1431530 1436362 1476372 1456145
11116 1456145 1340417 1317660 1301893 1172844 1073456 968037 739997 502940 311438 129491
11106 129491 -19595 -115766 -4423 244746 343422 361256 330094 324034 474618 487942 486105
11095D86105k9864m1867K3941l4560m1822o050n0438N7779P3047J4131L6578o1663
11083D25317r2590o2948q5525q4188p2915q1217l0143m6065k1601m1205J69784
11072b3296P781L9979J20366O0777P0378j54417r797L622R4025L2313o106L7008
11060B72633O9320O1178q767l9547J4296J52931q5930j16584p9983J09161J12774
11049D61482k3361j36800j52361L9040n9320j8484K21226N6326j55737n8076Q5505
11038B59440M3527j5342o5668O3978J42890O9150J07713k9615j39920j61873j85552
11027H8728n1410O0389N1273O3604J09789R591J0024J44690n1927p4577o3682
11016B96492l5911J6269K207j721K4339l8332j17439O7409J71003Q8354J8606
$$ plain form
11095 486105 456241 414374 438315 403755 361933 355883 305445 363224 436271 450402 486980 425317
11083 425317 332727 269779 184254 100066 27151 -54066 -84209 -130274 -151875 -193080 -23296
11072 -23296 -15515 24464 144830 205607 275985 121568 111771 115393 209418 241731 235625 272633
11060 272633 341953 403131 394364 354817 369113 522044 436114 319530 239547 348708 461482
11049 461482 438121 301321 148960 188000 128680 110196 331422 387748 232011 173935 259440
11038 259440 302967 287625 221957 285935 428825 497975 605688 576073 436153 274280 88728
11027 88728 37318 97707 148980 212584 322373 331964 341988 486678 434751 360174 296492
11016 296492 260581 276850 279057 277336 301675 263343 145904 213313 384316 472670 491276
11005D91276M1078j46509j18662k899Q4364j47032o6813q26N0478m5792O3888
10994B02551O1022l0264l675n312J63215L1074o3271J64840m0723l6j07996r7801
10982B73624j42366J0382L9873k6543p5436j62410M7857J68187M2782Q8761j0890
10971B53821j23335r0565l6731k6716J7192j2632J6106k8560Q9432J76379J88753
10960D23144j06230o742P5491m5000j01414n4696L3987K7551j36303j71939j4357
10949g6508R9219L3285Q874J8559r4496p4628M8127K4230q1788k2016l0039l6713
10937a83894k4917P0443R352N2298Q7878L322R901M1668o4486M8474j5525K7216
10925F1730R5486q0657j14248n7173m3955M163M6239M6126j13973J5232o5141
$$ plain form
11005 491276 532354 385845 267183 264284 348648 201616 134803 133977 184455 138663 202551
10994 202551 263573 233309 229634 224322 387537 418611 355340 520180 479457 479421 371425 273624
10982 273624 131258 141640 181513 154970 79534 -82876 -35019 133168 175950 264711 253821
10971 253821 130486 39921 3190 -23526 -6334 -18966 -2860 -31420 58012 234391 423144
10960 423144 316914 310172 385663 340663 239249 184553 218540 246091 109788 -62151 -76508
10949 -76508 22711 55996 64870 83429 -11067 -85695 -37568 -13338 -95126 -117142 -147181 -183894
10937 -183894 -208811 -138368 -129016 -76718 11160 14482 24383 66051 1565 50039 34514 61730
10925 61730 157216 76559 -37689 -94862 -138817 -134654 -88415 -42289 -156262 -141030 -206171
10914b06171O220L7413L2957J43687N5244M5660Q4573p7354O273O2097P428p0142
10902A27885k1708K358R9691j33100p2480n54p7542O9505J24287K3653L5911n269
10890A72637k3802M0950R3855K5538L9896q3361p0154Q7432O9779j7199o7271
10879B68300R0970l1188J1416M5752Q2212n8989m9082J9071J50861k6649j11200
10868C91474K38907J56603K18706J22625K13758J49236M2870O4787k1623p1613
10858A505730j20222k03481j42603j82387j34833o8269L1248K4495N4701R3784
10848H58163P4163J61497l0316K2307J31387J22711R7561m6944m6463l6361K2783
10837A330488P8592J54003Q5724R4354K5731Q3039J4702j08905O1855n8908k27531
$$ plain form
10914 -206171 -199951 -162538 -129581 14106 69350 115010 199583 122229 128502 190599 198027 127885
10902 127885 106177 108535 208226 75126 2646 2092 -75450 -5945 118342 141995 177906 172637
10890 172637 148835 189785 283640 309178 349074 265713 195559 282991 352770 335571 268300
10879 268300 359270 328082 339498 385250 467462 408473 359391 378462 529323 502674 391474
10868 391474 630381 786984 1005690 1128315 1342073 1491309 1534179 1598966 1577343 1505730
10858 1505730 1385508 1182027 1039424 857037 722204 653935 685183 709678 764379 858163
10848 858163 932326 1093823 1063507 1085814 1217201 1339912 1437473 1390529 1344066 1307705 1330488
10837 1330488 1409080 1563083 1648807 1743161 1768892 1851931 1866633 1757728 1819583 1760675 1533144
10826A533144j31641j70742o7463k3776O3485n9220l9018R2424J1j36639j33500
10815I27065M4492J6719o1430q4469n4867M2257R1293R0175J46710J10431J64113
10804A432489K26014j3432Q393k6430r7949j88029j89747k51398j22512j42567
10794F34832j34897l9556m6594K6070k9039r1065J6637o6128m0134j77692o6730
10783a4296L1263J4086r2388O8151R9924j4283N338N2761r5648j19759j2284K3205
10771e3930M1403J6183j6991L9065J24781L6452r5773l8995p5685O611J04450
10760H7571O1382j77580o1863P9509m2761L5389k2202K8594j01925j4863N7290
10749g1459m1738J06557k3542r6578M2534J72881L971k10861p7114M8513N468
$$ plain form
10826 1533144 1401503 1230761 1163298 1139522 1203007 1143787 1104769 1197193 1197204 1060565 927065
10815 927065 971557 988276 926846 842377 787510 829767 921060 1011235 1157945 1268376 1432489
10804 1432489 1658503 1645071 1653464 1627034 1529085 1341056 1151309 899911 777399 634832
10794 634832 499935 460379 413785 439855 410816 319751 336388 270260 230126 52434 -14296
10783 -14296 16967 31053 -61335 6816 106740 92457 97795 150556 54908 -64851 -77135 -53930
10771 -53930 -12527 3656 -13335 25730 150511 186963 91190 52195 -23490 -16879 87571
10760 87571 148953 -28627 -90490 -10981 -53742 -18353 -40555 -11961 -113886 -128749 -71459
10749 -71459 -113197 -6640 -30182 -126760 -84226 88655 92626 -118235 -195349 -146836 -141368
10738a41368q605R7527J4168m0942k3125K6967q5392j50663R1610Q0787o0677
10727a99713Q102l783l9345J32769J34239N9848J18001n5561j56421j34644Q1144
10716e5364M2444m2257j378J07458p8439r6610O4501l5057l4596n9016m36Q7158
10704a01592j0745q6627q574K6625j4493j22502k3529n1964J37544R2366N3361
10693a10130o210j15260k3278k3591K0442K5223n686P9465M4756j0970p1463P7867
10681a18835J26731l3253M7899m3007o9144J6644O916J36463P4013q5671j75111
10670a16355N0627M9015q6623j02676n8842L6084K4409J57286J67586p4020q6489
10659c9998j22923m8199L3948K3778L3998M1133J11138L2002m4571r9807m185
$$ plain form
10738 -141368 -149973 -52446 -38278 -79220 -102345 -75378 -160770 -311433 -219823 -139036 -199713
10727 -199713 -191611 -195394 -234739 -101970 32269 92117 210118 154557 -1864 -136508 -55364
10716 -55364 -12920 -55177 -56555 50903 -27536 -124146 -59645 -94702 -129298 -188314 -188750 -101592
10704 -101592 -112337 -198964 -207538 -180913 -195406 -317908 -341437 -393401 -255857 -163491 -110130
10693 -110130 -116340 -231600 -254878 -278469 -258027 -232804 -238490 -159025 -114269 -125239 -196702 -118835
10681 -118835 7896 -25357 22542 -20465 -89609 -72965 -66049 70414 144427 58756 -116355
10670 -116355 -65728 -16713 -103336 -206012 -264854 -228770 -204361 -47075 120511 46491 -39998
10659 -39998 -162921 -211120 -177172 -153394 -119396 -78263 32875 64877 20306 -79501 -83686
10648h3686J4578P7588J2537O6416K1565k04044n5982Q0318p1728L2399L3852
10637g6187J13078p9728n5427j7391N187k8788k9891j8405J17120J96668N08j50247
10625b3503j01751Q3376O1489N4536o046m6676o0371k3541K2282K1880m6170r7469
10613a61964m7289J54235K4467j31131l3971m3772N5903R4376k7664R888Q1103
10602b5819p8636L7576K720Q0091R9672p7792Q379O7637q4989J4484n241k318
10590C5764J5227k2172J4582p7318q349M178O0151r1694r204P1274R5681P7836
10578A65956k9442n0430r7705r546K8491m823k1747j25059j44784n3093J77055
10567a65127R2200O6435J36081K7865k7551j05068q2388o3787M0213K1622J16938
$$ plain form
10648 -83686 -69108 8480 21017 87433 108998 -95046 -151028 -70710 -142438 -110039 -76187
10637 -76187 36891 -42837 -98264 -115655 -110468 -139256 -169147 -187552 -70432 126236 126744 -23503
10625 -23503 -125254 -41878 19611 74147 68101 21425 -38946 -62487 -40205 -18325 -64495 -161964
10613 -161964 -209253 -55018 -30551 -161682 -195653 -239425 -183522 -89146 -116810 -106922 -25819
10602 -25819 -104455 -66879 -64159 15932 115604 37812 46191 113828 28839 43323 38082 35764
10590 35764 50991 28819 43401 -33917 -42266 -38088 22063 -69631 -78835 -7561 88120 165956
10578 165956 136514 86084 -11621 -21167 7324 2501 -19246 -144305 -289089 -342182 -165127
10567 -165127 -72927 -6492 129589 157454 129903 24835 -57553 -121340 -81127 -59505 57433
10556E7433k4451J3863j8183K954J4433l1248m4019o2414J3620n2094j10554J2779
10544b27881J63090P6940j11823j64925P7264J58969R3323j2245j23025j22350
10534a92663Q5481J27632L7174J08203j42790j42873M6989J632P5991j1886r5493
10523a02603o4231l7811k3445O3360J29449P8348J53311j62135K4110J31755j841
10512A88267j17822j3900N8722Q3137p1679o8457j05523j14431M2235k004l9084
10501a60539l9946J47490K51011K6071o2398k4735j48772r5403l889l772P4517
10490d0365J2939j16386o4097J68465Q0624j33318j51458r790J05229J11395K3531
10479a3231j1336o4474l0160Q1762K1770P0290j45028l9351L4569J42880k8473
$$ plain form
10556 57433 32982 46845 28662 31616 46049 14801 -29218 -91632 -78012 -130106 -240660 -227881
10544 -227881 -64791 12149 -99674 -264599 -187335 -28366 64957 52712 -70313 -192663
10534 -192663 -107182 20450 57624 165827 23037 -119836 -72847 -71215 4776 -7110 -102603
10523 -102603 -166834 -204645 -228090 -164730 -35281 43067 196378 34243 58353 190108 188267
10512 188267 70445 56545 115267 198404 126725 58268 -47255 -161686 -119451 -121455 -160539
10501 -160539 -200485 -52995 198016 224087 161689 136954 -11818 -107221 -111110 -114882 -40365
10490 -40365 -27426 -143812 -207909 -39444 41180 -92138 -243596 -253386 -148157 -36762 -13231
10479 -13231 -24567 -89041 -119201 -37439 -15669 54621 -90407 -129758 -95189 47691 19218
10468A9218p4306J4013j74020m0505M877R5487J61004P4917L7604r332p3814m5970
10456a0827K3524k3190O1278N7423M4114o1409j46060l3111O5247P347k0769K2925
10444a3508m9871M1994m5091j0843q153l2019M6762j0738l6931m7340o9388N0011
10432a85115J06328J9385p6672j49986n6757q37J60845J95945N7129K5055j11566
10421a6246j58908p1761J89011J04242q6135r5667J0265N63N4833n7392o6902
10410a94097L3984L2859q676O7119M9217J08046Q11r4764R3443r1720p8569J4303
10398f8044P82O3445L8149M1120j2761j57442J02888N8290j03713j34110j5298
10387a86694R8371m939k7927m8496r2542N0706J57060R2609N879M5343R5052j501
$$ plain form
10468 19218 -55088 -41075 -215095 -255600 -250723 -155236 5768 80685 118289 108957 35143 -10827
10456 -10827 12697 -10493 50785 108208 152322 90913 -55147 -88258 -23011 -15664 -36433 -13508
10444 -13508 -63379 -21385 -66476 -77319 -85472 -117491 -70729 -81467 -118398 -165738 -235126 -185115
10432 -185115 -78787 -59402 -136074 -286060 -342817 -343654 -182809 13136 70265 95320 -16246
10421 -16246 -175154 -246915 -57904 46338 -39797 -135464 -125199 -124636 -69803 -127195 -194097
10410 -194097 -160113 -127254 -135930 -68811 -19594 88452 89263 -5501 87942 -3778 -82347 -68044
10398 -68044 -67262 -3817 34332 75452 62691 -94751 8137 66427 -37286 -171396 -186694
10387 -186694 -88323 -93262 -121189 -169685 -262227 -211521 -54461 38148 44027 89370 184422 182921
10375A82921j58202q9596N3483J4346j26432n5523O2056n4295L9518J29228J33656
10364A31160k036r7367m1355R8213j33939r1868K3283J35907n9090q7909J6131
10353a08870K5333O6404N7411K0542m3260n1532j8940r4652M5526M1545J81058
10342A20565J7628j04364k16700n6467Q5188O3805k3762P6077o3843q2164N9190
10331a24847J21245O3222p1532q9277j19872n2707P6715o197J5290J07810O0587
10320a9563Q6160K8994k5536P2302q220r8503k0845J59082O3967j12000k60461
10309a34623o4151M1178J40661M1914o4985L1576J8680l7826Q7913m658j26628
10298g0949j34192P2614L2453p4683M8994O325o0419l0871N7461Q2511M6089J20542
$$ plain form
10375 182921 24719 -64877 -11394 2952 -123480 -179003 -116947 -171242 -131724 -2496 131160
10364 131160 129124 31757 -9598 88615 -45324 -137192 -113909 21998 -37092 -125001 -108870
10353 -108870 -83537 -17133 40278 60820 17560 -33972 -52912 -147564 -102038 -60493 120565
10342 120565 138193 33829 -182871 -239338 -154150 -90345 -114107 -38030 -101873 -184037 -124847
10331 -124847 -3602 59620 -11912 -101189 -221061 -273768 -197053 -203250 -187960 -80150 -19563
10320 -19563 66597 95591 70055 142357 134137 35634 14789 173871 237838 125838 -134623
10309 -134623 -198774 -157596 -16935 24979 -40006 -8430 10250 -27576 60337 55679 -70949
10298 -70949 -205141 -132527 -100074 -174757 -125763 -119438 -179857 -210728 -153267 -70756 -24667 95875
10286I5875K3014p5096r43j50920m6997O7402J11688n9500l9205L8920j2807O9409
10274B0840k7453l0954l9242m6634j4850l2190K2618k4217K9874J74499L6796
10263F9087q9369K7510j9307M96J4345M3489N4440j23745O214P9270R4514o6991
10251H9953j59648M8410J44027p7013m9699k7494j01984j803l2175l2401R9368
10240a00459m8806N4690J2533L1249P987j1965O7858M6396l8427j30514p4142
10229a83600J20030J55661q496r3102Q8053Q3680j3053o2120q2748k18561N2706
10218a61550q296j6094Q0813R2860n4507o0089o6566O0337q3132j01743P1730
10207b46237J74858l1197n6401l6601r5833k6829K85807K12596j40196j06225
$$ plain form
10286 95875 118889 43793 42850 -108070 -155067 -87665 24023 -35477 -74682 -35762 -48569 20840
10274 20840 -6613 -37567 -76809 -123443 -138293 -170483 -147865 -172082 -142208 32291 69087
10263 69087 -20282 7228 -12079 -11583 2762 46251 100691 -23054 -16840 62430 156944 89953
10251 89953 -69695 -21285 122742 45729 -3970 -31464 -133448 -135251 -167426 -199827 -100459
10240 -100459 -149265 -94575 -82042 -50793 -42806 -54771 13087 59483 21056 -109458 -183600
10229 -183600 -63570 92091 83595 -9507 78546 162226 149173 87053 4305 -214256 -161550
10218 -161550 -169846 -185940 -105127 -12267 -66774 -126863 -193429 -133092 -216224 -317967 -246237
10207 -246237 -71379 -102576 -158977 -195578 -291411 -318240 -32433 180163 39967 -66258
10197f6258J785l9608k0238P5060p5000j3261J95713J14975q05l9976m8564m9716
10185C4107l6527J8516p2105j8081O6370R7012L8561m5690Q5456J774n6749k484
10173A10160l7514n0958L8861l4263p2700J00497J7668L1592k1621j2287j2025
10162E7410J39627p7946j06720R099l8566m9577J6342j301O4902J06294Q985j28746
10150a97n2916J45654L6918M726o9084q9414N4594k3945p849P2115L821j36516
10138f2093n7795O1659m1832J60438Q1411m5538p3603k7317O6398L7055m3600
10127E5183K6955J2270r5507J7497k9016J1672m5260K5987K4612m7513l7848K9929
10115e1039L1082N9066n0166q9952j18997M8014J29776N6197O7484n9624m5176
$$ plain form
10197 -66258 -64473 -104081 -124319 -49259 -124259 -137520 58193 173168 172363 132387 83823 34107
10185 34107 -2420 16096 -56009 -74090 -7720 89292 127853 82163 167619 169393 112644 110160
10173 110160 72646 21688 60549 26286 -46414 54083 71751 103343 81722 69435 57410
10162 57410 197037 119091 12371 21470 -17096 -66673 -50331 -51632 13270 119564 128549 -197
10150 -197 -53113 92541 129459 134185 65101 -24313 30281 6336 -1513 70602 74423 -62093
10138 -62093 -119888 -58229 -100061 60377 141788 96250 22647 -4670 61728 98783 55183
10127 55183 82138 94408 -1099 16398 -12618 -946 -46206 -20219 4393 -43120 -80968 -51039
10115 -51039 -19957 39109 -11057 -101009 -220006 -171992 -42216 13981 81465 21841 -23335
10104b3335j70373J19088J25110J18087k7581r6666O0967J3284p1262J264j9410
10093B9173j00895N5432K6815j3282m38k78P5557Q529p7709q8045q0270J07917
10081e7494J9192q206n547J17870J35849q1528j25949j65552K8808J18840J38147
10070A14430R3364M7586j53609j75496r6635K9958M8080L1276J00117J01195p1926
10059F8340l2665Q1782l8823j8540j26651n8397J495p3596N2591M6935P8365Q1841
10047F2677J3333M750l5431j1920l4648O9434j7087n7391k3272J4376p6842m9853
10035a41874M1268J17192k4549P8942J22501m3264l1023p719q4120R4876k2066
10024A00164K0283j28707j22345j10078o0156M7120Q3911K6410L7966O3018J9683
$$ plain form
10104 -23335 -193708 -74620 50490 168577 140996 44330 105297 118581 47319 48583 29173
10093 29173 -71722 -16290 10525 -2757 -3195 -3473 72084 80613 2904 -85141 -165411 -57494
10081 -57494 -38302 -46508 -52055 65815 201664 120136 -5813 -171365 -142557 -23717 114430
10070 114430 207794 255380 101771 -73725 -170360 -140402 -92322 -61046 39071 140266 68340
10059 68340 35675 117457 78634 60094 -66557 -124954 -123459 -197055 -144464 -97529 -19164 62677
10047 62677 76010 80760 45329 33409 -1239 68195 51108 -6283 -29555 -15179 -92021 -141874
10035 -141874 -100606 16586 -7963 70979 193480 150216 119193 111474 27354 122230 100164
10024 100164 120447 -8260 -130605 -240683 -300839 -253719 -169808 -143398 -105432 -42414 -22731
10013b2731j95057o9748R5154R2506J03252p3113m6732l9249j02667L7361J17275
10002a03749R4392p6651P022J24049J24023k1727j69100j19025j1821P0003m1562
9991a24146N1757J39821l3561O299O3357K821o9395l7946O9587k484r7206o5752
9979i6848P4572Q1241j321p519J9708m5948R7436M0565J60418j0989j52768p713
9967A50834j900l9362o1275O500l7383l0733o8970O71N5090Q4591P3607O9471
9955B01141j4989Q4391J2813n1648j53413K6385K3278j0724P7027k1375n2355
9944A20531j40455n7460M3210J47828k4485l3869j20157N1044P9318N4394n8229
9933F1670J22358p1549k2286L447j47393j23875j7138Q4679R0133m9912Q7199
$$ plain form
10013 -22731 -217788 -287536 -192382 -99876 3376 -69737 -116469 -155718 -258385 -221024 -103749
10002 -103749 -9357 -86008 -78986 45063 169086 147359 -21741 -140766 -152587 -82584 -124146
9991 -124146 -72389 67432 33871 40170 103527 106348 36953 -993 68594 66110 -31096 -96848
9979 -96848 -22276 58965 57644 50125 69833 23885 121321 161886 322304 311315 158547 150834
9967 150834 148934 109572 48297 54797 17414 -13319 -82289 -81618 -26528 58063 131670 201141
9955 201141 186152 270543 283356 231708 78295 104680 127958 117234 194261 172886 120531
9944 120531 -19924 -77384 -34174 113654 89169 55300 -64857 -13813 65505 119899 61670
9933 61670 184028 112479 90193 93640 -53753 -177628 -194766 -110087 -19954 -69866 17333
9922A7333N3683n2567m037J0875n3283m5312J9527J50990l8832k0369Q2137l8319
9910H1826j05761m3260o5977N7421O6229L4315j7606J8440n8106n4723R629l7796
9898a15369R3756J39569O1019J0473j6450r2917j13318N1378M2011J43547r5469
9887A08230k01362k8742N8984J15376K7948j13466j78274N3699P6191J65145M3723
9876A27452l3827J0356o6925r9763j55848L3490J08089Q6932M5099L5860j2266
9865G8649N6989n8486o3324O9839N3557p3113k3876Q3379J04109P3816J6825j7511
9853C00853K40331K58103L43596M77333O44885O37773L97835k20805n57297o03891
9843A918716o12439l91038k65317j89078j892j13876j18401m169n6738j33604
$$ plain form
9922 17333 71016 18449 14412 25287 -27996 -73308 -53781 97209 58377 38008 120145 81826
9910 81826 -23935 -67195 -133172 -75751 -9522 24793 7187 25627 -32479 -87202 -77573 -115369
9898 -115369 -21613 117956 178975 189448 172998 80081 -33237 18141 60152 203699 108230
9887 108230 -93132 -121874 -62890 52486 80434 -33032 -211306 -157607 -81416 83729 127452
9876 127452 93625 103981 37056 -62707 -218555 -185065 -76976 9956 55055 90915 78649
9865 78649 135638 77152 13828 83667 137224 64111 40235 123614 227723 301539 318364 300853
9853 300853 541184 799287 1142883 1620216 2265101 2902874 3300709 3079904 2522607 1918716
9843 1918716 1306277 915239 649922 460844 458952 345076 226675 222506 165768 32164
9833C2164k7656R3000J14914O3221q2521K9088J8075r7660P573m7894l445M5989
9821A44848J2891n1655K9012N9948J9522j04734r3103k2222j426n4132j01762
9810a62813M9369J11403O7263R4257q136N918j0147j10507o4329K0790j5462J5329
9798g065J402R0677o2565k9365N1608n5180J09746K9756J00814n3269j75478m4294
9786d3213j5719P2362M7054M0668m0522l1499M7302J8136J45735j6984j92512
9775C0808j4705k9869q8849J5556K5393r519r839L9781Q8047J23962l0506j87088
9763d6828k5880M124k332n0404j5440J23223J29156m0477j6110r9358q3394j558
9751a25278R3512J85693l5803j91567l332M1437j841N6645M5021m8460n4870O3887
$$ plain form
9833 32164 4508 97508 212422 275643 193122 222210 240285 142625 150198 102304 98859 144848
9821 144848 157739 106084 135096 195044 214566 109832 16729 -5493 -6919 -61051 -162813
9810 -162813 -113444 -2041 65222 159479 151343 157261 147114 36607 -27722 -6932 -22394 -7065
9798 -7065 -5663 85014 22449 -6916 44692 -10488 99258 129014 229828 176559 1081 -43213
9786 -43213 -58932 13430 60484 101152 60630 29131 76433 94569 240304 223320 30808
9775 30808 16103 -13766 -102615 -87059 -61666 -71185 -81024 -41243 46804 170766 140260 -46828
9763 -46828 -72708 -68584 -70916 -121320 -136760 -13537 115619 75142 59032 -40326 -123720 -125278
9751 -125278 -31766 153927 118124 -73443 -76775 -35338 -37179 19466 64487 16027 -38843 25044
9739B5044K4790K7632j4798n3036r3134L4151N7176M8454J7547j74502j5115R1498
9727b4293r7655L1816Q7253q0049o1867P9344J13550L6816q8556l498M3116j06051
9715g0074k4666P8134K8448J10487q7485m4119O1302Q6199L5189K7927O4732j07925
9703A58149j16576r4922k0734j35760K9859P0645n5298O1701K9794q1584k2746
9692a77472j71J3147M0654J2267J25429L1138J9288M2054Q6334K02401J1588j61371
9680B45286l8696j29692l0262j8317j24436o9390M1107M3242m0790J31214m1826
9669c2560m4667L1494m2784j57296m0538J75576N6237N95J29046Q1197n1924P324
9657A11700o0052j9649j46022m5905q8369j3600J41543K23681N3544L3808o4942
$$ plain form
9739 25044 49834 77466 62668 9632 -83502 -49351 7825 56279 73826 -100676 -115791 -24293
9727 -24293 -121948 -90132 -2879 -82928 -144795 -65451 48099 84915 -3641 -7139 35977 -70074
9715 -70074 -94740 -16606 11842 122329 34844 -9275 52027 138226 173415 201342 266074 158149
9703 158149 41573 -53349 -74083 -209843 -179984 -109339 -164637 -102936 -73142 -154726 -177472
9692 -177472 -177643 -164496 -123842 -111575 13854 44992 64280 106334 192668 395069 406657 245286
9680 245286 206590 76898 46636 28319 -96117 -165507 -124400 -81158 -121948 9266 -32560
9669 -32560 -77227 -45733 -88517 -245813 -286351 -110775 -54538 -53943 75103 156300 104376 111700
9657 111700 51648 31999 -114023 -159928 -248297 -261897 -120354 103327 156871 190679 125737
9646A25737m4537j8201o5797q7337L5861J13330P8487o7399J7246M614Q1323P9405
9634B52732M2916q0419j96379m030M5725M8835Q2210k0832j34393q8466j9324
9623g1425L7298J50382J4466j61681j36751l0564J80579O5334j0895J33134L4954
9612B04831j0980k7690p552M4793j25126j11622l478O0449k498l3949K308M0632
9600C0118Q321n2254o9295J17443L0875j02044J2601L9808K7194M8745q4463P4808
9588H1857K13358j3646r6766j31928N9852P484l5035N2753L0933p2488j41873
9577d5499j23059J20721J57158m679M7325p655j23052K7707L5963J7148R5957
9566A98035j79001q2879N4543J12354l7142R7224m3680r7785R591j2101K3454
$$ plain form
9646 125737 81200 62999 -2798 -90135 -54274 59056 137543 70144 87390 92004 173327 252732
9634 252732 295648 215229 18850 14820 60545 109380 191590 170758 36365 -52101 -71425
9623 -71425 -34127 116255 130721 -30960 -167711 -198275 -17696 47638 36743 169877 204831
9612 204831 193851 166161 158609 203402 78276 -33346 -36824 23625 21127 -12822 -10514 30118
9600 30118 38439 -13815 -83110 34333 65208 -36836 -24235 15573 42767 91512 7049 81857
9588 81857 295215 281569 184803 52875 112727 120211 85176 137929 168862 96374 -45499
9577 -45499 -168558 -47837 109321 104642 151967 144312 21260 48967 84930 102078 198035
9566 198035 19034 -63845 -9302 103052 65910 163134 119454 21669 31260 19159 42613
9555D2613o0009Q1560K3712j18625O8091M6214o2277l5111m8768n0445Q3551J48426
9543A18932N842j674j9333L6572j32487l7205k5499J36541P8922r5024K491J13154
9531A81232L9769k5080k9958o0251J4637n7892j2676O0141J6798j08907j09513
9520i1700J02311J32042K250l6541j8454P0815M4159n499j7777l0624J0246J6317
9508A77545n9361n6112K527L5439n881q2273Q3347J01296o8826q3352O3277n8462
9496D9164j51941p473Q8711k6454K9662J37889J3300q9284o3715L3545K14755
9485B28159J36912j09493j65832r3997P4145Q3150n2645M5649N7894P6698m7586
9474B33054j06352N8532m9493j16343o6821j15660J378J04525J21191J81804J04088
$$ plain form
9555 42613 -17396 64164 87876 -30749 37342 83556 21279 -13832 -62600 -113045 -29494 118932
9543 118932 124774 123100 103767 140339 7852 -29353 -54852 81689 160611 65587 68078 181232
9531 181232 221001 195921 165963 105712 120349 62457 49781 109922 126720 17813 -91700
9520 -91700 10611 142653 144903 108362 89908 160723 204882 199383 181606 150982 161228 177545
9508 177545 118184 62072 64599 100038 94157 11884 95231 196527 127701 44349 107626 49164
9496 49164 -102777 -110250 -21539 -47993 -18331 119558 132858 43574 -20141 13404 228159
9485 228159 365071 255578 89746 -4251 69894 153044 100399 146048 203942 280640 233054
9474 233054 126702 185234 135741 19398 -47423 -163083 -161705 -57180 64011 245815 349903
9463C49903p7563j91069j68962n1050J56679J09624l7224p6139L1158Q7069l1213
9452A01213K8514j19805l5252R5549J5828L4914p3191L7017K7658o6511J21884
9441A67818o2361k20490J6346R9752J79540J1648N0362j4756q5128l422o5145
9430G4164r7772J8372K9819J15803K9193m8102m7528J1672K0071J2041L8271j3495
9418A42509J1178l5986m8870o4763J18930q731r6877L0457O5486L9141P4708j8754
9406B08428j37113j86283R077N2145R2785J49413K9427j60947n5083L4260N3808
9395H9917M6270K4729L7025M0419J08282j4863n6020r1748j28959J4293J9438
9384H8783J07394K5775o6279l5540L725N7523K4094j9056j00500J8721L2833J3955
$$ plain form
9463 349903 272340 81271 -87691 -138741 17938 127562 90338 14199 45357 132426 101213
9452 101213 129727 9922 -25330 70219 86047 120961 47770 84787 112445 45934 167818
9441 167818 105457 -115033 -98687 1065 180605 192253 242615 227859 142731 139309 74164
9430 74164 -23608 -5236 24583 140386 169579 121477 73949 85621 105692 117733 156004 142509
9418 142509 153687 117701 68831 4068 122998 114267 17390 47847 113333 152474 227182 208428
9406 208428 71315 -114968 -105891 -53746 39039 188452 217879 56932 1849 36109 89917
9395 89917 136187 160916 197941 238360 346642 331779 275759 184011 55052 69345 88783
9384 88783 196177 221952 155673 120133 123858 181381 205475 186419 85919 104640 137473 151428
9372A51428P7150m9545o8009J7725m3419L0926L4087O1697O8973k3609Q3772L1422
9360C72598P2563p5115j52445j37618M9737K3483j08303q742J17373O8244J12502
9349C34277Q9290m078o9524p1716k3850J4571N5599l8697m3031K4247L0222M6350
9337C43660n7022P8556K5611N4023l0057j8687R2217P7254R6546q1612j43496
9326D36993L963J2684j15983l9466J00227O4440M1331n1678L6949l5581l789J6890
9314D66980K664M5465K1161k3288L5062j42574r7960K3669Q7412l051P031P0523
9302D93094j493o2282M4353J74756R2427n0683j78329m985P5013N0832K1116k6803
9290F27016m1460k11385K7546P8442j8884Q9905J9910n4016R2297L1872J7197
$$ plain form
9372 151428 228578 179033 111024 128749 85330 116256 150343 212040 281013 257404 341176 372598
9360 372598 445161 370046 217601 79983 129720 153203 44900 36158 153531 221775 334277
9349 334277 423567 419489 349965 278249 254399 268970 324569 285872 242841 267088 297310 343660
9337 343660 286638 365194 390805 444828 414771 396084 488301 565555 662101 580489 436993
9326 436993 440956 453640 337657 298191 398418 462858 504189 452511 489460 453879 450090 466980
9314 466980 469644 515109 536270 512982 548044 405470 307510 331179 418591 415540 422571 493094
9302 493094 491601 429319 473672 648428 740855 690172 511843 506858 581871 632703 653819 627016
9290 627016 585556 374171 401717 480159 461275 551180 571090 517074 609371 641243 658440
9279F58440l0762Q7717Q2110M2775m2554q4857O909P2296j7652n6477L9403J600
9267G58948J27213O3608j36665o5685J1226Q4803O7751m8572J03362P8940K5693
9256A070622J19179o2356l6676J58695l4507o5843M657j06435J51090J35211L038
9245A336675l1728K7208m9013K5455J15950J18980O9192M6804k673M7195J410
9234A705455j40232J62561K32439r4190j59107K5310O004J54833K08139P3574
9224B174786J2721n1271O8546J52420n375Q5430R9088K5390J37064N7090K01295
9213B957184l4158n2850J50502N4652n0548J9692J56638J09742P2729Q3212J11864
9202C578659P8957O3534j00427n5832J62152N2094N3354R7558J70766Q6790R3036
$$ plain form
9279 658440 627678 715395 797505 840280 797726 712869 719778 792074 774422 717945 757348 758948
9267 758948 886161 949769 813104 747419 758645 843448 911199 862627 965989 1044929 1070622
9256 1070622 1189801 1127445 1090769 1249464 1214957 1149114 1153771 1047336 1198426 1333637 1336675
9245 1336675 1304947 1332155 1283142 1308597 1424547 1543527 1612719 1659523 1656850 1704045 1705455
9234 1705455 1565223 1727784 1960223 1866033 1706926 1732236 1738240 1893073 2101212 2174786
9224 2174786 2187507 2136236 2204782 2357202 2351827 2437257 2536345 2561735 2698799 2755889 2957184
9213 2957184 2923026 2870176 3020678 3075330 3024782 3044474 3201112 3310854 3383583 3466795 3578659
9202 3578659 3657616 3721150 3620723 3564891 3727043 3779137 3832491 3930049 4100815 4187605 4280641
9191D280641N17q5786l9595J52628K24819J82315J10779J59019J5952J5617r7788
9180D919118q4166n0797k1703m5720r083k1639L162R585Q6465Q2243n235q7216
9168D775014j88301q2443m5367L8193o7265k74421j40757m6008J12867m285j87524
9157C889703q0075r8549j26409M2971j8984k27275j07007L5215o557R2693J8671
9146C414397q2043m8902j66745j68663k23558p248n3233k9161J595l2741p4098
9135B529600k9159j06376j20596o492j61195k14908p4546K5974J11132N6982j20436
9124A889980j40010J2425k4974L9863l4360j23644j56427J23807M1871l7828k09966
9113A380737j80868j26606J3867Q3536J13625R3187j11244r4567k736p784j16791
$$ plain form
9191 4280641 4281158 4195372 4155777 4308405 4533224 4715539 4826318 4985337 5001289 5016906 4919118
9180 4919118 4834952 4784155 4762452 4716732 4707649 4686010 4689172 4698757 4785222 4867465 4862230 4775014
9168 4775014 4586713 4504270 4458903 4497096 4429831 4155410 4014653 3968645 4081512 4077227 3889703
9157 3889703 3809628 3711079 3584670 3627641 3608657 3381382 3274375 3309590 3303033 3395726 3414397
9146 3414397 3332354 3283452 3116707 2948044 2724486 2717238 2664005 2634844 2636439 2603698 2529600
9135 2529600 2500441 2394065 2273469 2266977 2105782 1890874 1816328 1842302 1953434 2010416 1889980
9124 1889980 1749970 1762395 1737421 1777284 1742924 1619280 1462853 1586660 1628531 1590703 1380737
9113 1380737 1199869 1073263 1087130 1170666 1284291 1377478 1266234 1171667 1168931 1161147 1044356
9102A044356j2309L3411r4662J28466k4709q3769K3970j05446l2031p7560k647
9091G97070M4872L4026j07071k3451O7573q123P0503K7630l6015R8871O8674n6067
9079I78492j35934j96955j81297M0042M61m7921q6235J04961K6028q7686r5383
9068C18573R0850R8586K4150O8325l7204j27689r1486k105J3834M8440j037J7710
9056D20947N6686O3476J49780m2636j82982p9436J886k895p1834L0714J2649N3110
9044D09465j843K6804K1069Q32o2734k2201R257O1374p887L2924n4453p0180P7616
9031D20043J6807r1442k0440q5690j17623k0485M8612P8542P4878j03624n6348
9020A43230l8979j10539M5770J54282j9960p6240k0113J04261R1996J248M6049
$$ plain form
9102 1044356 1032047 1065458 970796 1099262 1074553 990784 1014754 909308 877277 799717 797070
9091 797070 841942 875968 768897 745446 813019 804896 875399 903029 867014 965885 1034559 978492
9079 978492 842558 645603 464306 504348 504809 456888 370653 475614 501642 413956 318573
9068 318573 409423 508009 532159 600484 563280 435591 344105 342000 355834 404274 403237 420947
9056 420947 477633 541109 690889 648253 465271 385835 387721 384826 312992 343706 356355 409465
9044 409465 407622 434426 455495 456327 393593 371392 380649 442023 434136 467060 412607 342427 420043
9031 420043 436850 345408 324968 239278 121655 101170 149782 228324 303202 199578 143230
9020 143230 104251 -6288 39482 193764 173804 97564 77451 181712 273708 274956 321005
9009C21005R2382n1852j92696j14037k7857M6173J3436m5786P6920J7708K8774
8998A64170J18493L6305k8675O3663J9940N7552l969p9698j2975l1058K8509n2601
8986B79656j09252n6135m8491L3544N5963L824K1892J00558J50055o5982p4675
8975B90957j62358q543N794M6187n381N0643O1116n2677j5787j0079l9898M2778
8963B02752M221o6913O6080L7977j03695l3364l1625o4674J8855j19834q332P9313
8951a9239l9452J9078k093o7445r072P7905M750R8867J28747M0933J1387k8393
8939B15973o2639n3272p101k3675L5272M1111j8177l1515K5306l0520j15388p8599
8927a03224J44811J8811j08505L3885K5465J42211j4651r7674q773P126M4599
$$ plain form
9009 321005 413387 361535 168839 54802 26945 73118 86554 40768 117688 135396 164170
8998 164170 282663 318968 290293 353956 373896 431448 427479 347781 334806 303748 332257 279656
8986 279656 170404 114269 65778 99322 155285 159109 181001 281559 431614 365632 290957
8975 290957 128599 120056 125850 172037 166656 217299 278415 225738 209951 199872 159974 202752
8963 202752 206973 140060 206140 244117 140422 107058 75433 10759 29614 -90220 -98552 -19239
8951 -19239 -58691 -39613 -41706 -109151 -118223 -40318 -35568 63299 192046 232979 244366 215973
8939 215973 153334 100062 92961 69286 104558 145669 127492 95977 121283 90763 -24625 -103224
8927 -103224 41587 60398 -48107 -14222 11243 153454 138803 41129 32356 39482 84081
8916H4081J43009J04736l2873k01223k4922N1009R0938j3496j06565q1778q5173
8905g2257j2843N7236L1874J4026P4183P21N470O5360o4219m2242p1271N9227
8893D5265J5042K6170m7524q8498n1991N6308M7967M1718k4943j17713q2031Q7549
8881i2681N3832l9887K8308J41481n8870q4367P5225J04196L219l0741j24708
8870b4993j05928J06105Q8401j3109k1474o6072n2437j01474Q5178J48237m4560
8859b126r6116O2608R1473m1987J9105L4703j22755N8016J2499J26097J02758
8848B44275K9756j29553o013j0475p7696j11832p2879O1338Q4711Q1000J30285
8837B22917q500q5641q6449J0387o17L927n235m6964M2408K129O0104k7301o279
$$ plain form
8916 84081 227090 331826 298953 97730 72808 123817 214755 201259 94694 12916 -72257
8905 -72257 -85100 -27864 4010 18036 92219 92940 98410 163770 99551 57309 -13962 45265
8893 45265 60307 86477 38953 -49545 -101536 -45228 2739 44457 19514 -98199 -180230 -92681
8881 -92681 -38849 -78736 -50428 91053 32183 -52184 23041 127237 130456 99715 -24993
8870 -24993 -130921 -24816 63585 50476 29002 -37070 -89507 -190981 -105803 42434 -2126
8859 -2126 -98242 -35634 55839 13852 32957 67660 -55095 2921 15420 141517 244275
8848 244275 274031 144478 138465 127990 50294 -61538 -134417 -73079 11632 92632 222917
8837 222917 214417 128776 42327 52714 52097 56024 50789 3825 46233 48362 108466 81165 74886
8824G4886k9058q7149k0280o6716q887l2206J04254M9705M8886M0473j06880o5780
8812i8752M2258K2127j8253q877J4315k4156q4709o4126J72639J9810K0096K3346
8800A5718l3406J47403L1135m9583o8471j07089J5854k3015P5208L4613m4797
8789f430P4189j3379q6620L8674K9829j7354j0105K5967n2965l5647O1011O6151
8777G3321K4423m98M2476N1486l1987K0649j23032r9947j4888j07180k9390J35721
8765e8846J2449R041J83230n5207r548j5111O467p1105n4033O6933J13553m4847
8753H2976p2866N1921r31L5127k7900O2017N1517M3660o6395k3370q7247l9853
8741H656m1172J2066n8421R307J09887l1682J2085L0321J3626J8147K2198q9807
$$ plain form
8824 74886 45828 -41321 -61601 -128317 -137204 -169410 -65156 -15451 33435 73908 -32972 -98752
8812 -98752 -56494 -34367 -52620 -61497 -47182 -71338 -156047 -220173 -47534 -27724 -7628 15718
8800 15718 -17688 129715 160850 111267 42796 -64293 -48439 -71454 3754 38367 -6430
8789 -6430 67759 54380 -32240 6434 36263 18909 8804 34771 -18194 -53841 7170 73321
8777 73321 97744 97246 139722 191208 159221 179870 56838 -43109 -57997 -165177 -194567 -58846
8765 -58846 -46397 -37356 145874 90667 81119 66008 72475 1370 -52663 14270 127823 82976
8753 82976 10110 62031 61100 96227 68327 130344 181861 225521 159126 135756 48509 8656
8741 8656 -32516 -20450 -78871 -69564 40323 8641 20726 51047 64673 82820 105018 15211
8729A5211r8336m6402J5470l9371J02314P4990l7805m8445l7324M1832N9854O1661
8717F3649L6307l6567Q8583J42984O9895l0822o6750N004n3329n7874L9298M7654
8705B48032L8917o3394j19049o4074m7780l6448J9436L6386M3744j10292j8158
8694g2680J15239j2886j0312J08386L2817N7625l5096k5476R3095R406p1366j0829
8682A77923L5487J87553n0225n6208m3990k26458k7234j689M9851k8594O2422
8671G8838J71255Q5754k3909j35454n6622K7854J0949P4667j20489o6632O7609
8660A13820P1104Q8276O3834J23268j9179o0888j24725k0887l8744O4717J72298
8649D32894J52084J91592J78866J83506R6602p2322j46109j88625k01888j50500
$$ plain form
8729 15211 -83125 -129527 -114057 -153428 -51114 23876 -13929 -62374 -99698 -57866 1988 63649
8717 63649 99956 63389 151972 294956 364851 334029 267279 272283 218954 161080 200378 248032
8705 248032 286949 223555 104506 40432 -7348 -43796 -24360 12026 55770 -54522 -72680
8694 -72680 42559 29673 19361 127747 160564 218189 183093 157617 250712 260118 188752 177923
8682 177923 213410 400963 350738 294530 250540 24082 -3152 -4841 45010 16416 78838
8671 78838 250093 335847 311938 176484 119862 147716 158665 233332 112843 46211 113820
8660 113820 184924 273200 337034 460302 441123 380235 255510 234623 195879 260596 432894
8649 432894 584978 776570 955436 1138942 1235544 1163222 1017113 828488 626600 476100
8639D76100K6456k4400p4635j19271L6704L3469R7827p5025j74350K9199J12622
8628C44696k8011j0622r5943L1241k5829K0687J51895J7712p3795l0893J12531
8617D13669J90055J28218R9207j4543j06850O762Q0984j191q4784N0144P5185
8606H36856N8265J61072J92671J46504K31753M92455J90811m5885r4787j67038
8596B002677k57247k14410k56243k77436k47752j26506N5503N4561p1521m9261
8586F12365J88183j21040r9261Q361n9634m7105n9691J7138R6586R7739M7562
8575F81203q5834q9381n4009p5888L7327Q1885n327p4042k5090R7746R9211J02040
8563F89841j27180M3889q6393l4012O4080k4291J68595K96529K48023r8132j61363
$$ plain form
8639 476100 502556 478156 403521 284250 320954 354423 452250 377225 202875 232074 344696
8628 344696 316685 306063 210120 241361 215532 236219 388114 405826 332031 301138 413669
8617 413669 603724 731942 831149 816606 709756 716518 797502 796311 711527 761671 836856
8606 836856 895121 1056193 1248864 1395368 1627121 2119576 2310387 2264502 2169715 2002677
8596 2002677 1745430 1531020 1274777 997341 749589 623083 678586 733147 661626 612365
8586 612365 800548 679508 580247 588608 528974 481869 422178 439316 535902 633641 681203
8575 681203 595369 505988 451979 376091 413418 495303 489976 415934 390844 488590 587801 689841
8563 689841 562661 606550 520157 486145 550225 525934 694529 991058 1239081 1140949 979586
8552I79586r3373q4348j42116p7074M7850Q3766O4416R4489J23369L23966N58510
8541A879041J017875J169101P61059k08304p27352j001671r01651n06590l62958
8532A118550k93685j79067j98008k2360L6631J1514q5006p6085r4189k4434m5212
8521A48649n0096M6738O3271O5902Q1656Q5667l227q7256m8980J7704m7958J02384
8509C74454K95999M0882L0869J46104L18620M05730M05138Q82300J225315O71867
8499D797278k43592o42255r17589q75711o27946m02773m61665j96299O8937p6060
8489D22325p2400J6528J6161j41607r8079k5499J7218R4418P667k2394m2020k133
8477A70185L2334l0691q4074j5988j00689n4212Q2665l401l9671K3359O5392r6514
$$ plain form
8552 979586 886213 801865 659749 582675 630525 714291 778707 873196 996565 1320531 1879041
8541 1879041 2896916 4066017 4827076 4618772 3891420 2889749 1988098 1481508 1118550
8532 1118550 824865 645798 447790 425430 462061 473575 388569 312484 218295 193861 148649
8521 148649 98553 145291 208562 274464 356120 441787 438560 351304 302324 320028 272070 374454
8509 374454 670453 711335 742204 888308 1206928 1612658 2017796 2900096 4125411 4797278
8499 4797278 4553686 3911431 2993842 2118131 1490185 1087412 625747 429448 498385 422325
8489 422325 349925 366453 382614 241007 142928 117429 134647 229065 236732 214338 172318 170185
8477 170185 202519 171828 87754 71766 -28923 -83135 -470 -3871 -43542 -20183 45209 -51305
8465e1305L1733m5695K5886P3872M0802J592j32567K724j3424o7789J04074J73228
8453A43131L851N4708J38405q052j30843r4500l2463p2540j402R4225Q824J26005
8441B29349J49054q6627j44499J07578J58239J4996j11932j62945n0452j08050
8431e289q6531k8887L7533J10296Q2348r9391l8374M0301j08028j04497K388j2605
8419b10736K0624q792K2523R0763K5091n1949Q0892P8856o5472J7076P6413m3979
8407C1310j24761Q294k033r1674k2102J14843j01678N7311J67118M456L1441M3315
8395A15840o1845K111N2364j00746j37562n7298O7208q495O8577m5375m3335J27266
8383b1290J00040K68o7804Q6951J38733k2015m5249n8086n7295O1872J32538l4550
$$ plain form
8465 -51305 -19572 -65267 -39381 34491 75293 76885 -55682 -52958 -66382 -134171 -30097 143131
8453 143131 146982 201690 340095 332043 201200 106700 74237 1697 295 94520 103344 229349
8441 229349 378403 291776 147277 254855 413094 428090 316158 153213 102761 -5289
8431 -5289 -91820 -120707 -83174 27122 109470 10079 -28295 12006 -96022 -200519 -198131 -210736
8419 -210736 -190112 -198904 -176381 -85618 -60527 -112476 -31584 47272 -18200 -1124 75289 31310
8407 31310 -93451 -85157 -87190 -178864 -200966 -86123 -187801 -130490 36628 41084 72525 115840
8395 115840 53995 56106 108470 7724 -129838 -187136 -119928 -128423 -59846 -105221 -148556 -21290
8383 -21290 78750 79018 11214 98165 236898 214883 169634 111548 54253 116125 248663 214113
8371B14113p4836j8057N1650o8423K7945L8626o4469N2510k7581p0254o9923j15791
8359a24490K1980P1413R4591K8752N6133J6291n4958j8488p5787P6422q8102l1847
8347b8090m3945k2155k4355M7239N8142Q378J5083N9296j1996L851m4706l2427
8335a5685j25274j29152L076J23203r60l0872p2748J3069J63649J84863l1888
8324H1281L9180J16115k4364n4143k0094r5661L3710M9843O5742k9241r2169q1938
8312a1739j48634m0048L6665J00669J14714N8704j34731j7166J67000M8639N0733
8301B24806j08694n1928J37467l6483j20015l0689L0274J16889L9020j14002o7459
8290A9186l0901l0603j02284k1555L0420J49424J65733Q5977p2320o3104K036
$$ plain form
8371 214113 139277 121220 172870 104447 132392 171018 106549 159059 131478 61224 -8699 -124490
8359 -124490 -102510 -31097 63494 92246 148379 164670 109712 91224 15437 91859 3757 -28090
8347 -28090 -72035 -94190 -118545 -71306 -13164 -4786 10297 69593 57597 61448 16742 -15685
8335 -15685 -140959 -270111 -267035 -143832 -144792 -175664 -248412 -235343 -71694 113169 81281
8324 81281 120461 236576 212212 158069 137975 42314 76024 125867 191609 162368 70199 -11739
8312 -11739 -160373 -200421 -163756 -63087 51627 110331 -24400 -41566 125434 174073 224806
8301 224806 116112 64184 201651 165168 45153 14464 44738 161627 200647 86645 19186
8290 19186 -11715 -42318 -144602 -166157 -135737 13687 179420 265397 193077 129973 132009
8279A32009R8474N8928j26396l8329K7220n9085j77010j6750k7617J01486o5056
8268i2126j24526m1134j196R8715p505R674M6308R9993Q2955k557J03043L5165
8256B06809r2018j23550k2647k8269q3057p3242N8806J14224Q1471j06937K1669
8245d6741M4481m2439p388P5389R3627m2356p2755L7617R2228N597q8085m4958
8233D217J02398L2465o4816q6983m2912J9772P6754m7995J7351K618m9610n6485
8221i3226k7646m1861L56J4050J99029J07785j02065n3018k3638J02504K4362
8210A06632m7935M423k9715o221j10331J66693P3123m7887n5626j15777o7266
8199a29887o8673L8361R109J55934O3930O875J3058p5793N7792L9117l7411N2046
$$ plain form
8279 132009 230483 289411 163015 124686 151906 92821 -84189 -100939 -128556 -27070 -92126
8268 -92126 -216652 -257786 -258982 -160267 -167772 -158098 -111790 -11797 71158 68601 171644 206809
8256 206809 114791 -8759 -31406 -59675 -142732 -215974 -157168 -42944 38527 -68410 -46741
8245 -46741 -2260 -44699 -52087 23302 116929 74573 1818 39435 131663 137260 49175 4217
8233 4217 106615 139080 74264 -12719 -55631 -35859 40895 -7100 10251 12869 -36741 -93226
8221 -93226 -120872 -162733 -162377 -148327 50702 158487 56422 3404 -20234 82270 106632
8210 106632 58697 63120 33405 27184 -83147 83546 156669 108782 53156 -62621 -129887
8199 -129887 -198560 -160199 -151090 4844 68774 75649 88707 12914 70706 109823 72412 124458
8187A24458m1704l1024J846k0240P6587j8229j67201l884J07616J05830o3929
8176G0126q1155R758M9371J16430j81257p6606J30488M786j12683k929O1322j27011
8164a39360j08384L9869J17668L2505k3797l755O5296P1159j2608o8172O4836
8153C5257J11517m8022o2169L312M0375L8696l7584m8407K4777R7074N05p6533
8141G8798l1395k2747Q1089J9092n3359k9462m4898j97711n2245P1153J43654
8130c8031J86415p4525l1884L6086j463k6535K8596P8893J42040n6067j9236L4714
8118B59003n4438j13178J09159L6897n8333q8358Q7527Q7242n5779m2055l938
8107A63749j02939K3028k0485j1331o9113p6505m2753P9753M9620p252N178l3323
$$ plain form
8187 124458 82754 51730 53576 33336 109923 91694 -75507 -79391 28225 134055 70126
8176 70126 -11029 -1271 48100 164530 -16727 -93333 37155 41941 -70742 -73671 -12349 -139360
8164 -139360 -247744 -207875 -90207 -57702 -81499 -85254 -19958 51201 38593 -29579 35257
8153 35257 146774 98752 36583 39895 80270 118966 81382 32975 57752 154826 155331 78798
8141 78798 47403 24656 105745 124837 71478 42016 -2882 -200593 -252838 -181685 -38031
8130 -38031 148384 73859 41975 78061 76598 50063 78659 157552 299592 243525 224289 259003
8118 259003 204565 91387 200546 237443 179110 90752 178279 265521 209742 167687 163749
8107 163749 60810 83838 63353 52022 -17091 -93596 -136349 -56596 -6976 -14228 -9050 -42373
8095d2373j04675N4139N7229k1762M0617P7250o857J03637O666j30916k8884L1103
8083C5174K3257N5259P8330O244q1180J05345j25468j33172M9177J12293j07760
8072A7499p315O1532k2492m2633J15196M6315j84197n3132k1020J4612J07549
8061C1914l563K2804Q7295n0423j7750l128j34210N2663J66954J07318M6507j21078
8049A85303p3789K3873p5637l0857N3348J14535O0650J25318m2289p4538j11547
8038A54370q8660P1188n026k1642Q833N341n693l1555m1212q619K27577n2843
8026B12059p6542N8291j17504l4071M2939j3991Q5847R7257l5897o4070M5080
8015A99398M2478p4710l2257M5798J00798N2857k0039P1152r6220J00342J04954
$$ plain form
8095 -42373 -147048 -92909 -35680 -57442 -16825 60425 53568 157205 163871 32955 4071 35174
8083 35174 58431 113690 192020 198264 117084 222429 96961 -36211 12966 125259 17499
8072 17499 10184 71716 49224 6591 121787 168102 -16095 -69227 -90247 -75635 31914
8061 31914 28351 51155 138450 88027 70277 67149 -67061 -14398 152556 259874 306381 185303
8049 185303 111514 135387 59750 28893 82241 196776 257426 382744 340455 265917 154370
8038 154370 65710 136898 131872 110230 119063 124404 118711 87156 45944 37325 264902 212059
8026 212059 135517 193808 76304 42233 85172 71181 157028 254285 218388 154318 199398
8015 199398 241876 167166 134909 180707 281505 334362 314323 385475 289255 389597 494551
8004D94551M56j9104J96194J49921K976l1341K0750o8745n2819o41R3173l2397
7992G52974j14505k83342k17113n8414O089N4846Q4936R3969j0940N4334J52384
7981E15218n791j02959L5157p1341o5373K2196l6843N1247j8206j26175m6173
7970A50957K5039P8836p1088M8701K5444J4298J62323L7833K410p0691L6763Q316
7958D49141k3554L836N7179J50104N559N9156O828o869l3879j4032L3086j2330
7946F74225j93841o2466j1404n7285n6559j2861Q4331k7481N951m506R14o6794
7934B72224M8004J95050l6708q5651R61m7965q1613j8521o8225n3040p9732J41721
7922A86505l0629p2798M9247K7228P6656R8959M5746m7743n4179l9961L1096Q1634
$$ plain form
8004 494551 495007 475903 672097 822018 824994 793653 814403 745658 692839 692198 785371 752974
7992 752974 638469 355127 138014 79600 85689 140535 225471 319440 308500 362834 515218
7981 515218 509427 406468 441625 370284 304911 327107 290264 341511 323305 197130 150957
7970 150957 175996 254832 183744 232445 257889 272187 434510 472343 474753 404062 440825 449141
7958 449141 425587 429423 486602 636706 642265 701421 708249 701380 667501 653469 686555 674225
7946 674225 480384 417918 406514 349229 292670 279809 364140 336659 342610 338104 339018 272224
7934 272224 320228 515278 478570 392919 393880 345915 264302 245781 177556 124516 44784 186505
7922 186505 155876 83078 132325 159553 236209 335168 380914 333171 278992 239031 270127 351761
7910C51761J5099j01327j21119j2362M3524k5037L0443j34739l1188Q1354Q0602
7899A77011L6239j9564K66p758j24999r6944j3368Q5845M2619J3440l0447k70
7887F2070N2197m2j7496o7907J25766M0867l2291p2403L5347J53332q4623m3200
7875A51617N5777j5328m0881n901P6j12119o3067R9314N9279j2502j19212q3870
7863h6817P0268j09946p5383J74743K270r7239P7150l396K5403L1148j7434N9682
7851E0449N2041K04915K7226j10179l0991n7779k536J6551l2937j24427J3935
7840F268O8055N2574r5164p6038P5054P640O4239n9455K0977o2741r1336O871
7828h3056k2742n242M1268J33509o2336J6881O8012Q9214j5576P2002l5799j47306
$$ plain form
7910 351761 366860 265533 144414 132052 175576 150539 180982 46243 15055 96409 177011
7899 177011 213250 193686 193952 186194 61195 -35749 -49117 36728 79347 92787 62340 62070
7887 62070 114267 114225 96729 28822 154588 195455 163164 90761 126108 279440 194817 151617
7875 151617 207394 192066 151185 145284 145360 33241 -29826 69488 128767 116265 -2947 -86817
7863 -86817 -16549 -126495 -201878 -27135 -24865 -122104 -44954 -48350 -22947 8201 -9233 50449
7851 50449 102490 307405 334631 224452 193461 135682 133146 149697 116760 -7667 6268
7840 6268 74323 126897 31733 -44305 30749 38389 102628 43173 64150 1409 -89927 -83056
7828 -83056 -105798 -111040 -69772 63737 1401 18282 86294 175508 159932 231934 196135 48829
7816D8829q7899O7827J8973m4034Q6487M3842q0876K6411P2555m0229l8088N8131
7804A31929K053M1488j17928j5086J7157l6975j36262J1876N6679Q0952L2131
7793F8014M7990K587q0403j23716R5609R4396j00282j71959K3327J85562J6501
7782E7626p6140M1297K3668R4186n7480q0811k9155o0116r038n9160P7403N4091
7770b3629l9257k7305k4867L0424J2921R941k7821L7208l3223m2961J23183J29536
7758A24150q9389m0467K5380N8551o7006j50380o2242K4132R9249J53611R0350
7747A65939N4295n7652p5888o9740J34136K6673j2086k2700J0527m4040j90434
7736h0970n8526N3624N4957K2585j71999P5295M4441m636o1628l7127J38730R9417
$$ plain form
7816 48829 -39070 28757 47730 3696 90183 134025 53149 79560 152115 111886 73798 131929
7804 131929 133982 175470 57542 42456 59613 22638 -113624 -101748 -45069 35883 68014
7793 68014 116004 118591 38188 -85528 10081 104477 4195 -167764 -144437 41125 57626
7782 57626 -18514 22783 46451 140637 83157 2346 -26809 -86925 -95963 -155123 -77720 -23629
7770 -23629 -62886 -90191 -115058 -84634 -71713 -61772 -89593 -52385 -85608 -128569 -5386 124150
7758 124150 34761 -5706 19674 78225 11219 -139161 -201403 -177271 -78022 75589 165939
7747 165939 220234 162582 86694 16954 151090 177763 165677 142977 153504 109464 -80970
7736 -80970 -139496 -85872 -30915 -8330 -180329 -105034 -60593 -65229 -126857 -163984 -25254 74163
7724G4163P2902k6576K8541M5862k5910M5352o653k5533n6386n6895r5555r6726
7712a23414n0553N5878Q1110J5698k8023r6959n415J09323r2572k3358J7849J2297
7700a28139Q5510M6618N4349k4496j56101K94N4571L1910k0734O1192N805J33385
7688A44164O7313j99423l9465M167j5253n2196K2669J53564M6080p4037k2200
7677C5383k0687r1692P6077K3596Q6684n2238j03267M6330o9164n7856P9194L96
7665d7244m8234Ro9293p6218J32409Q2844O4616n557q6037l0272P81O1285j1848
7652c2759l2078N0224L5264M4103J30162K0991m4107P1164p2359p5989n5121p4669
7640c5174K9909K9713K2617k5595O2752o5056r8385l5470q1577n8494N9939L3237
$$ plain form
7724 74163 147065 120489 149030 194892 168982 214334 207681 182148 125762 68867 -26688 -123414
7712 -123414 -173967 -118089 -36979 -21281 -49304 -146263 -151678 -42355 -134927 -158285 -140436 -128139
7700 -128139 -42629 3989 58338 33842 -122259 -121965 -67394 -35484 -56218 4974 10779 144164
7688 144164 211477 12054 -27411 -23244 -38497 -90693 -68024 85540 131620 57583 35383
7677 35383 14696 -76996 -919 22677 109361 57123 -46144 186 -68978 -126834 -47640 -47244
7665 -47244 -95478 -95469 -164762 -240980 -108571 -25727 38889 33332 -52705 -82977 -82196 -20911 -32759
7652 -32759 -64837 -14613 20651 64754 194916 215907 171800 242964 170605 94616 39495 -35174
7640 -35174 -5265 24448 47065 21470 84222 19166 -79219 -114689 -196266 -254760 -194821 -161584
7628a61584N5843m4881k6686m6848k7947N7806K4822P7979j5616J0135k6458k0003
7616a43438j3862m1658j03824k8026P7541R68J11705J14545j4507k6353r717n0006
7604a26632l823Q6249J99k9863K0054N3429P3520r6964n7298Q1658n5794q978
7592f4243Q483j06330m9148J19680K9614j43163m6660J37174N9372N8522k9014
7581b5713N6449J7130m8167p0631n5506r9848N5879L3312l2537J38311M7811O5373
7569H1863J7530L767j9019j30943j10326J4825J4892l789L3827N0923J80927n3122
7557H1355j45862j65983n381m3586J81747P6127m4756J8696m1811O7884j02642
7546a24212n1121k4799l690R2792J39015O5858l7150j67144n3112N2486L6607
$$ plain form
7628 -161584 -105741 -150622 -177308 -224156 -252103 -194297 -169475 -91496 -107112 -96977 -123435 -143438
7616 -143438 -157300 -198958 -302782 -330808 -253267 -252299 -140594 -26049 -40556 -66909 -76626 -126632
7604 -126632 -130455 -44206 -44007 -73870 -53816 -387 73133 -23831 -81129 529 -55265 -64243
7592 -64243 -55760 -162090 -211238 -91558 -61944 -205107 -251767 -114593 -55221 3301 -25713
7581 -25713 30736 47866 -301 -70932 -126438 -226286 -170407 -137095 -169632 -31321 16490 81863
7569 81863 99393 103160 84141 -46802 -157128 -142303 -127411 -131200 -97373 -46450 134477 81355
7557 81355 -64507 -230490 -235871 -279457 -97710 -21583 -66339 -47643 -89454 -21570 -124212
7546 -124212 -175333 -200132 -203822 -111030 27985 93843 56693 -110451 -163563 -111077 -74470
7535g4470L1771M9497J2139m4653K7268K2906P1672n7756r5166L067M0820J31210
7523A18305N2076L7676J1681j31207q4556N8234O6104P4116l2609j13500q4977
7512b8657m812N5563L9981N8033M2044N4303q4163k19215k1314l1434N2007J25457
7500C7793r4587l8385P6687m2702j5988M1960Q5341m4385m4072k6788o4117K7797
7488a01446J06506M0700n2332n8804J44498J32358j39210m5825l944j09021o9739
7477a56259Q552m1576L6184k0907j8480K7488J14097R1707n4936n2756r1113O4411
$$ plain form
7535 -74470 -42699 6798 18937 -25716 1552 24458 96130 38374 -56792 -53725 -12905 118305
7523 118305 170381 208057 219738 88531 3975 62209 128313 202429 169820 56320 -28657
7512 -28657 -33469 22094 62075 120108 162152 216455 132292 -86923 -108237 -139671 -87664 37793
7500 37793 -56794 -95179 -18492 -61194 -77182 -35222 50119 5734 -38338 -65126 -129243 -101446
7488 -101446 5060 45760 -6572 -65376 79122 211480 72270 26445 22501 -86520 -156259
7477 -156259 -147707 -189283 -153099 -174006 -192486 -164998 -50901 40806 -14130 -66886 -157999 -93588
$$ [...]
##END NTUPLES=NMR SPECTRUM
##END=
