##TITLE=Analysis number 313560
Compound Code en 00019
Project Code adrs
Chemist Name endeavour
##JCAMPDX= 6.0         $$ Bruker NMR JCAMP-DX V2.0
##DATA TYPE= NMR SPECTRUM
##DATA CLASS= NTUPLES
##ORIGIN= Bruker BioSpin GmbH
##OWNER= NMR
$$ XWIN-NMR		Version 3.5
$$ Mon Sep 12 17:14:11 2005 GMT Daylight Time (UT+1h)  MAYBRIDGE\NMR@NMR_250MHZ
##.OBSERVE FREQUENCY= 250.131544655141
##.OBSERVE NUCLEUS= ^1H
##.ACQUISITION MODE= SIMULTANEOUS (DQD)
##.ACQUISITION SCHEME= undefined
##.AVERAGES= 16
##.DIGITISER RES= 18
##SPECTROMETER/DATA SYSTEM= dpx250
##.PULSE SEQUENCE= zg30
##.SOLVENT NAME= CDCl3
##.SHIFT REFERENCE= (INTERNAL, CDCl3, 0, 16.522)
##AUDIT TRAIL= $$ (NUMBER, WHEN, WHO, WHERE, WHAT)
$$ ##TITLE= Audit trail, XWIN-NMR		Version 3.5
$$ ##JCAMPDX= 5.01
$$ ##ORIGIN= Bruker BioSpin GmbH
$$ ##OWNER= NMR
$$ C:\u/data/dgb/nmr/ADRS/9390/pdata/1/auditp.txt
$$ ##AUDIT TRAIL=  $$ (NUMBER, WHEN, WHO, WHERE, WHAT)
(   1,<2005-09-12 17:13:52.24 +100>,<MAYBRIDGE\NMR>,<NMR_250MHZ>,
      <created by zg, POWCHK disabled, PULCHK disabled
       configuration hash MD5:
       62 19 C7 07 E1 42 D1 B7 37 6C 3D D0 77 39 F9 E6
       data hash MD5: 64K
       CD 37 91 55 BF 39 73 D6 99 14 47 BE 33 87 C3 29>)
(   2,<2005-09-12 17:14:03.41 +100>,<MAYBRIDGE\NMR>,<NMR_250MHZ>,
      <Start of raw data processing
       ef LB = 0.3 FT_mod = 6 PKNL = 1 SI = 32K 
       data hash MD5: 32K
       97 24 DF D1 43 74 52 7D 37 3A 7C 02 7F 5E 3C 08>)
(   3,<2005-09-12 17:14:05.14 +100>,<MAYBRIDGE\NMR>,<NMR_250MHZ>,
      <apk 
       data hash MD5: 32K
       0A CE A9 FD CA 56 F9 A6 75 24 8D DB C4 34 8B 4C>)
(   4,<2005-09-12 17:14:05.89 +100>,<MAYBRIDGE\NMR>,<NMR_250MHZ>,
      <abs ABSG = 5 
       data hash MD5: 32K
       8E 3A B6 19 AD 87 B4 8C 37 DB 25 74 83 93 A7 AB>)
$$ ##END=
$$ 
$$ hash MD5
$$ 67 47 3E 21 6E 9C 7F F0 20 68 69 56 66 85 A6 D0
##$RELAX= 
##$RELAX= 
##$RELAX= 
##$RELAX= 
##$RELAX= 
##$RELAX= 
##$RELAX= 
$$ Bruker specific parameters
$$ --------------------------
##$DU= <C:\u>
##$EXPNO= 9390
##$NAME= <ADRS>
##$PROCNO= 1
##$TYPE= <nmr>
##$USER= <dgb>
##$AMP= (0..31)
100 100 100 100 100 100 100 100 100 100 100 100 100 100 100 100 100 100 
100 100 100 100 100 100 100 100 100 100 100 100 100 100 
##$AQSEQ= 0
##$AQ_mod= 3
##$AUNM= <au_zg>
##$AUTOPOS= <55 >
##$BF1= 250.13
##$BF2= 250.13
##$BF3= 250.13
##$BF4= 250.13
##$BF5= 500.13
##$BF6= 500.13
##$BF7= 500.13
##$BF8= 500.13
##$BYTORDA= 1
##$CFDGTYP= 0
##$CFRGTYP= 5
##$CHEMSTR= <none>
##$CNST= (0..31)
1 1 145 1 1 1 1 1 1 1 1 1 1 1 1 1 1 1 1 1 1 1 1 1 1 1 1 1 1 1 1 1 
##$CPDPRG= <>
##$CPDPRG1= <>
##$CPDPRG2= <>
##$CPDPRG3= <>
##$CPDPRG4= <mlev>
##$CPDPRG5= <mlev>
##$CPDPRG6= <mlev>
##$CPDPRG7= <mlev>
##$CPDPRG8= <mlev>
##$CPDPRGB= <>
##$CPDPRGT= <>
##$D= (0..31)
0 1 0 0 0 0 0 0 0 0.06 0 0 0 0 0 0 0.0002 0 0 0 0 0 0 0 0 0 0 0 0 0 0 
0 
##$DATE= 1126541631
##$DBL= (0..7)
120 120 120 120 120 120 120 120 
##$DBP= (0..7)
150 150 150 150 150 150 150 150 
##$DBP07= 0
##$DBPNAM0= <>
##$DBPNAM1= <>
##$DBPNAM2= <>
$$ [...]
##$SUBNAM7= <"">
##$SUBNAM8= <"">
##$SUBNAM9= <"">
##$SW= 20.6930455092707
##$SWIBOX= (0..15)
0 0 3 0 0 0 0 0 0 0 0 0 0 0 0 0 
##$SW_h= 5175.983436853
##$TD= 65536
##$TD0= 1
##$TE= 295.16
##$TE2= 300
##$TE3= 300
##$TEG= 300
##$TL= (0..7)
0 120 120 120 120 120 120 120 
##$TP= (0..7)
150 150 150 150 150 150 150 150 
##$TP07= 0
##$TPNAME0= <>
##$TPNAME1= <>
##$TPNAME2= <>
##$TPNAME3= <>
##$TPNAME4= <>
##$TPNAME5= <>
##$TPNAME6= <>
##$TPNAME7= <>
##$TPOAL= (0..7)
0.5 0.5 0.5 0.5 0.5 0.5 0.5 0.5 
##$TPOFFS= (0..7)
0 0 0 0 0 0 0 0 
##$TUNHIN= 0
##$TUNHOUT= 0
##$TUNXOUT= 0
##$USERA1= <user>
##$USERA2= <user>
##$USERA3= <user>
##$USERA4= <user>
##$USERA5= <user>
##$V9= 5
##$VALIST= <valist>
##$VCLIST= <CCCCCCCCCCCCCCC>
##$VD= 0
##$VDLIST= <DDDDDDDDDDDDDDD>
##$VPLIST= <PPPPPPPPPPPPPPP>
##$VTLIST= <TTTTTTTTTTTTTTT>
##$WBST= 1024
##$WBSW= 4
##$XGAIN= (0..3)
0 0 0 0 
##$XL= 0
##$YL= 0
##$YMAX_a= 456052
##$YMIN_a= -475649
##$ZGOPTNS= <>
##$ZL1= 120
##$ZL2= 120
##$ZL3= 120
##$ZL4= 120
##$ABSF1= 16.522
##$ABSF2= -4.171173
##$ABSG= 5
##$ABSL= 3
##$ALPHA= 0
##$AQORDER= 0
##$ASSFAC= 0
##$ASSFACI= 0
##$ASSFACX= 0
##$ASSWID= 0
##$AUNMP= <proc_1d>
##$AZFE= 0.1
##$AZFW= 0.1
##$BCFW= 0
##$BC_mod= 0
##$BYTORDP= 0
##$COROFFS= 0
##$CY= 12.5
##$DATMOD= 1
##$DC= 0
##$DFILT= <>
##$DTYPP= 0
##$F1P= 14.0000005364418
##$F2P= -0.99999901652339
##$FCOR= 0.5
##$FTSIZE= 32768
##$FT_mod= 6
##$GAMMA= 0
##$GB= 0
##$INTBC= 1
##$INTSCL= 1
##$ISEN= 128
##$LB= 0.3
##$LEV0= 0
##$LPBIN= 0
##$MAXI= 10000
##$MC2= 0
##$MEAN= 0
##$ME_mod= 0
##$MI= 0
##$NCOEF= 0
##$NC_proc= -2
##$NLEV= 6
##$NOISF1= 0
##$NOISF2= 0
##$NSP= 0
##$NTH_PI= 0
##$NZP= 0
##$OFFSET= 16.522
##$PC= 1
##$PHC0= -79.53218
##$PHC1= 5.597718
##$PH_mod= 1
##$PKNL= yes
##$PPARMOD= 0
##$PSCAL= 4
##$PSIGN= 0
##$REVERSE= no
##$SF= 250.13
##$SI= 32768
##$SIGF1= 0
##$SIGF2= 0
##$SINO= 400
##$SIOLD= 32768
##$SREGLST= <1H.CDCl3>
##$SSB= 0
##$STSI= 32768
##$STSR= 0
##$SW_p= 5175.98343685301
##$SYMM= 0
##$S_DEV= 0
##$TDeff= 65536
##$TDoff= 0
##$TI= <Analysis number 999999
Compound Code 99
Book Reference 9
Project Code 9>
##$TILT= no
##$TM1= 0
##$TM2= 0
##$TOPLEV= 0
##$USERP1= <user>
##$USERP2= <user>
##$USERP3= <user>
##$USERP4= <user>
##$USERP5= <user>
##$WDW= 1
##$XDIM= 32768
##$YMAX_p= 411825243
##$YMIN_p= -722280
$$ End of Bruker specific parameters
$$ ---------------------------------
##NTUPLES= NMR SPECTRUM
##VAR_NAME=  FREQUENCY,     SPECTRUM/REAL,   SPECTRUM/IMAG
##SYMBOL=    X,             R,               I
##VAR_TYPE=  INDEPENDENT,   DEPENDENT,       DEPENDENT
##VAR_FORM=  AFFN,          ASDF,            ASDF
##VAR_DIM=   32768,         32768,           32768
##UNITS=     HZ,            ARBITRARY UNITS, ARBITRARY UNITS
##FACTOR=    0.157963299565203, 1,           1
##FIRST=     4132.6476996994, 0,             0
##LAST=      -1043.33573715361, 0,           0
##MIN=       -1043.33573715361, -722280,     0
##MAX=       4132.6476996994, 411825243,     0
$$ Real data points
##PAGE= N=1
##DATA TABLE= (X++(R..R)), XYDATA
$$ [...]
19169h273O82K006P567J4505M628j6371j1231K282k053P825j438q910L888L351
19155a542J0966n842q208L056J6995j687j9416q377L443J0336j793K410p215M138
19141b736R355K5m664M8j937R083O757J5620m46p132j4182q040O50o810J3028
19126H619q71k3043j905J871l865l25P268J1540o254q080j867O728K2118p350
19112D584j847m126k321J074P272N284o272j1469j260J0353l391M58L471m852
19098c042j7784M038j1636q608J505Q958J3323q349M878N754J197K890l802N19
19084a0159o457n740R422L015n27N828m240j4046o794o238J2699Q273J3217J0402
19070H655K350k47j301j708n690l9M381J835J0170l229j3821j4192J2664P948
$$ y = [-8273, -7591, -5585, 1982, 16487, 21115, 4744, -6487, -4205, -6258, 1567, 129, -8781, -4893, -1542, 9424, 3582, -4626, -1570, 15425, 13738, -5678, -14055, -10612, -276, -2069, 341, -6874, -2736, 6619, 6644, 1980, 2028, 91, 9174, 15931, 31551, 31105, 23973, 9791, 1751, 2401, -4409, 8619, 7748, -15295, -17200, -15329, -19194, -19519, -12251, -711, -6965, -15045, -16912, -10184, 11934, 4584, 2737, -1389, -3710, -2636, 4636, 9920, 3648, -7821, -9081, 1272, -2119, -1661, 1810, -3042, -20826, -16788, -28424, -37032, -35527, -26569, -13246, -21595, -16717, -10963, -9766, -6876, -10678, -10159, -16616, -22356, -12934, -9919, -10446, -4618, -8858, -22904, -29698, -35936, -23237, -14964, -1747, 8655, 11005, 10758, 9457, 7749, 2059, 2020, 6401, 8236, 18406, 15177, 1356, -12836, -172, 7776]
19056G776q959o901K730j532Q344R150N16J801k623k075l126j193q605j0416n649
19041b0762J2638K1858O168K338m832j3454j2595j369n691J677P373N498M421
19028C268L661q823P40P902j3178O48J2142o828p799L990K357m757P78N252j561
19013b208L061p556j0858n466L070k160j599J1353N740m786m952n941N536J915
18999a4851L506L880n302o531p153j675J1647N975J5368j023q553l990M463l673
18985g912J3763J003j1245J43J8360n63j1077P885J0259n592q416J107J691m111
18971E295p367j0967N277J0445m488j8410M376Q590L057J4020J793o704j0686
18958e769j79M417J6217K600j1788j019l472M235L133J1743n92k3597o350L061
$$ y = [7776, -1183, -8084, -5354, -6886, 1458, 10608, 11124, 12925, 10302, 8227, 5101, 3908, -4697, -15113, -20762, -8124, 13734, 19902, 22240, 17408, 3954, -8641, -10010, -15701, -14024, -6651, -1153, 3268, 6929, -1894, -1154, 6748, -6430, -5782, 6360, -468, -8267, -4277, -1920, -6677, -5899, -647, -2208, 853, -6703, -17561, -23027, -19957, -22117, -23716, -12363, -6623, -11409, -16361, -22302, -16766, -14851, -11345, -7465, -12767, -19298, -26451, -28126, -16479, -10504, 4864, 3841, -4712, -8702, -4239, -7912, 5851, 6854, -4391, -4248, 14112, 13549, 2472, 10357, 20616, 15024, 6608, 7715, 9406, 5295, -2072, -13039, -7762, 2683, -1805, -20215, -15839, -7249, -4192, 9828, 11621, 4917, -5769, -5948, -1531, 14686, 17286, 5498, 4479, 1007, 5242, 8375, 20118, 19526, -4071, -10421, -7360]
18944g360J6894n82j704J833q085k1072J1630P032J1038N51J050j7080p470J4317
18930I92q970j3874l637J9124R083M819n785j4054j3872j1580J0650J5799n09
18917a1814o721L634N419k493O591O824R491K249L856k7173k029K58O94R002P744
18902E532l436j2065j903J233J3023M944j1983n332r970M469R101L902m393N121
18888a757j0489O50J4615O992k3999K448R725L889K669Q927j1429j4009j90J1139
18874h19q6o909R636P677j0522p893j1823R580J7949L766l95k367o170j6381n450
18859b0207J1116P484l894L31k620P044J255n131N103l993M909J0783n222K159
18845I117n391j2712P15J1331M766p597q796n156J1594J0508K253n818J926r775
$$ y = [-7360, 9534, 8952, 7248, 9081, 996, -20076, -8446, -1414, 9624, 10175, 11225, -5855, -13325, 992, -7978, -21852, -25489, -6365, 2718, 7537, 1752, -12302, -26174, -37754, -27104, -11305, -11814, -18535, -14901, -9482, -11975, -5384, 1440, 10931, 13180, 17036, -10137, -12166, -11908, -11214, -2212, 5532, 2096, -9969, -11872, -10639, 2384, 7328, -4655, -9987, -19957, -15488, -6387, -2485, -6878, -1757, -12246, -11596, 3019, 10011, -13988, -11540, -1815, 2074, 4743, 13670, 2241, -11768, -11958, -819, -905, -7814, 1822, 9499, -1023, -8916, -20739, -11159, 6790, 10556, 10161, 7794, 1624, -14757, -20207, -9091, -1607, -5501, -5170, -7790, -746, 509, -4622, 481, -3512, 1397, 12180, 6958, 9117, 3726, -8986, -8271, 3060, 7826, 229, -8567, -13723, -2129, 8379, 10632, 4814, 6740, -3035]
18831c035P449j775M182P069K9M515J236r92k4019r787J4411K994L211l853k529
18816h94K886o089P405M405n943q894n332O068K014n995r920p94N821O220r175
18801a8217J2735P883o296K327M118n124m541K313O011n329k338N717q786k459
18787a1986O400J0669O061L103m159j0001k551r659n867k234J0118J6199M710
18774A0803k72M553Q269m991L307J6107N866K1863L4828J8010j8378k7271k2258
18761E0436j2912j1257o457R72q735p105J274k149m776n489k020j305m578M472
18747i629o12J4537J6210r513M941P407n157J539j3335q942j700r93q919l266
18733a7432M279J0381J0086L707k830n103p130n153N046J0181P097k252o693L019
$$ y = [-3035, 4414, 2639, 6821, 13890, 13919, 18434, 19670, 18678, -5341, -15128, -717, 2277, 5488, 1635, -894, 1992, -4097, 3308, 7713, 1770, -7124, -12456, -6388, -4374, -10369, -20289, -21083, -15262, -9042, -18217, -5482, 2401, -3895, -1568, 2550, -2574, -7115, -4802, 1209, -4120, -6458, -741, -9527, -11986, -5586, 5083, 11144, 14247, 10088, 87, -2464, -12123, -17990, -20224, -10106, 6093, 10803, 10531, 15084, 23353, 18362, 21669, 37776, 43642, 65505, 100333, 118343, 99965, 72694, 50436, 37524, 26267, 19810, 20782, 12047, 4942, 6216, 4067, -709, -6198, -8218, -9523, -14101, -9629, -10241, 4296, 20506, 10993, 15934, 23341, 18184, 19723, 6388, -2554, -4254, -5247, -14166, -17432, -13153, -2772, 7314, 11021, 8191, 3088, -4042, -9195, -4149, 6032, 13129, 10877, 4184, 7203]
18719G203j563j435m133j0846J1302M243O113n899j0941P497J861j1813j1305
18706a9716K788J6418R287j751n053j208J4216P409j188p276q561m91k559p340
18692e025l347r825R646k172k999K301L585P654R31j3063M355o922r948k931K622
18677b5138l450R91Q573N55K361P505J2427J450N775n966j047o755O391J2531
18663A6203P259j7131r97P677j1459k234l838j372J767n962Q271K433n664l740
18649h787m799r661m377J275M826N054m697k186J2272P583R094O452j2136j1809
18635a1896K391J4449K301j3479j3009R364k747K818m853l237M858J0921J3018
18622A0899k251q199j435L100j5651o934o727Q128J3732J992l412p959j948K169
$$ y = [7203, 5640, 4205, 72, -10774, 528, 4771, 10884, 4985, -5956, 1541, 3402, -8411, -19716, -16928, -510, 8777, 7026, 1973, 765, 14981, 22390, 21202, 13926, 5365, 4874, 2315, -5025, -8372, -18197, -8551, -10723, -13722, -11421, -7836, -182, 749, -12314, -7959, -14881, -24829, -27760, -25138, -28588, -27597, -19024, -18469, -16108, -8603, 3824, 5274, 11049, 5083, 4036, -2719, 3672, 16203, 23462, 6331, 5334, 13011, 1552, -682, -4520, -5892, -4125, -10087, -1816, 617, -5047, -8787, -13586, -23247, -27624, -26349, -21523, -16469, -21166, -23352, -11080, -3497, 5597, 12049, -87, -11896, -9505, 4944, 7245, -6234, -19243, -9879, -12626, -9808, -14661, -17898, -13040, -2119, 10899, 8648, 449, -986, 2114, -13537, -20471, -27198, -19070, -5338, -3346, -6758, -14717, -16665, -14496]
18608a4496J4325r65j580J2132J755L617Q226j4975k5K16r600q404P181J1895
18594I302J3199p626q596j5691q80p916K558J96M063J5977K333r980j3637j295
18580a7993q26o222O835O457Q102k959O400K874j417m051M04j2464Q86O251m611
18565a2334m776n51Q933R147J4889l248j4651q127O123O88j7849m167O996Q382
18551a0545j865l662J1815P884R51k831j127j979k195R722L925r543m209j2928
18537a6587J5608J1209r369q170j2265o950J923P184j73R608J3083R312N626L085
18523B3124j4261j5745q335J506l190j500N762p243n004P547R544m337j8430K178
18509b8384M197M497Q275J0906r228j2651P000J2882p978o149J940R054Q052r26
$$ y = [-14496, -171, -1136, -2716, 9416, 11171, 14788, 23014, 8039, 8014, 8230, -1370, -9774, -2593, 9302, 22501, 14875, 6279, -9412, -10292, -18208, -15650, -15454, -11391, 4586, 6919, -3061, -16698, -17993, -18819, -25041, -18206, -11749, -3647, -6606, -206, 2668, 1251, -2800, -2396, -14860, -13974, -7723, -12334, -17110, -17661, -8728, 419, 15308, 12060, -2591, -10718, -4595, -3907, -21756, -25923, -18927, -10545, -12410, -16072, -4257, 3627, 4578, 1747, 620, -1359, -3554, 6168, 10093, 550, -3659, -16587, -979, 10230, 861, -7309, -19574, -26524, -24601, -17417, -17590, -7982, 5101, 14413, 20039, 23124, 8863, -6882, -15217, -13711, -16901, -18401, -12639, -19882, -24886, -17339, -7795, -12132, -30562, -28384, -24187, -19690, -11415, -509, -9737, -22388, -15388, -2506, -10484, -16633, -14693, -5639, 2413, 1487]
18495A487j691L778m549j015J4770Q463l144j0385j446J936Q157O461R340J0864
18481D3026m621k1990k410J796p720L242L706j019o983l06J9742R588m978k9154
18467A919p889J1075J0915r642p303j0314l47o612k682O817J310Q319O820K801
18453E187n22l610l278k87R856n699R457Q072j2297j6691l115R259R142K444j2222
18438d304N282J4573j493j2158O954k198j365K1406j754j5372k668j386o542j767
18424b792P991K5537o93j2372K78O93k022j2697o878J5960M083p819J2016j060
18410B0225j1974j1970m491J1651J0270M237J381L296j0561o412q167j2150J0373
18397d292J4694m64L721j1537j539j966l650k949j7m328r610M919L358L868n42
$$ y = [1487, -204, 3574, -975, -1990, 12780, 21243, 18099, 7714, 6268, 8204, 16361, 22822, 32162, 43026, 38405, 16415, 14005, 15801, 8081, 11323, 15029, 14010, 7027, 6721, 26463, 36051, 31073, 1919, -5970, 5105, 16020, 6378, -925, -11239, -11586, -18198, -20880, -14063, -12753, -4434, 2386, 5187, 4665, 1055, -2223, -2510, 7346, 1647, 11104, 19176, 6879, -9812, -12927, -3668, 5474, 7918, -4304, 978, 15551, 14058, 1900, 8854, 6656, 5291, 26697, 24943, 9571, 6903, 5517, -1025, -2792, 5199, 30736, 30043, 17671, 17949, 18642, 16620, 3923, -2955, 13005, 17088, 9269, 21285, 20225, 8251, -3719, -8210, 3441, 13711, 17948, 19329, 22625, 12064, 5652, -2515, -14665, -4292, 10402, 9938, 13659, 2122, 583, -1383, -5033, -7982, -7999, -12327, -21937, -17018, -13660, -9792, -10334]
18382a0334o021R004P747N762l171R695M881j265N397m704J1336J1438O514K1971
18368F8250L7841O1470N4280J9815k2313m0380m6792m6649l1163j0729j0202p352
18356B6076J933n112q284n211k501n705n589M21J2804o432J630J6942P727K947
18342C1646q21l375P339l805k246n887o837j5550j5064M24j308J2580K2477K7395
18328D6968J8132J4321J3305J9134Q35k0685k3538j0070k1240j8516j552R546
18316B6640o865q156N268L210K765o803q937N745R60K439j1645p512j1793r049
18302b3733k843J7665J2823J3614J6463J5988K211n148j4067k443j5010q921o066
18289E33J3680J2938j4810q731P254J666j3917O146J2851l592j2242o942m583
$$ y = [-10334, -16355, -7351, 396, 6158, 2987, 12682, 17563, 16298, 21695, 16991, 28327, 39765, 46279, 68250, 106091, 167561, 221841, 241656, 219343, 178963, 132171, 85522, 54359, 43630, 33428, 26076, 28009, 22897, 14613, 9402, 6901, 1196, -4393, -3972, 8832, 2400, 4030, 20972, 28699, 31646, 30825, 27450, 34789, 30984, 28738, 22851, 16014, 464, -14600, -14176, -15484, -2904, 19573, 46968, 65100, 79421, 92726, 111860, 112695, 92010, 68472, 58402, 37162, 18646, 17094, 26640, 19775, 11619, 16887, 20097, 22862, 16059, 7122, 12867, 13827, 16266, 4621, -2891, -14684, -23733, -26576, -8911, 3912, 17526, 33989, 49977, 52188, 47040, 32973, 30530, 15520, 6599, 533, 14213, 27151, 12341, 3610, 10864, 12530, -1387, 4759, 17610, 14018, 1776, -5166, -9749]
18276i749o546O547L540q222J3046J0674j2388Q33j6109J1285P692N170J2503
18263A8276n738M677L09J826L935j373m699j726j277J4j0028l866j242J7216Q48
18248A7152J8622L5889N194m609k2261j2435j2795k591l652j8815r686Q756K938
18235A707N809J1337J5739Q167p750k3357j4073R444J3237P065l455o745q891
18222H234K187M110L841L476m243r035m395j4463n243N032K839J4005K566j1151
18208b240l782J867J2708Q902J4140K910p351q093p86J3714Q687p489j9182l385
18194A0620J5650n161l849K478k513N958n594j380j644O694P040j687j7845j1449
18180b682J9258N650J0514J3818j1497k1453J279J0191l939n602N536J2012O446
$$ y = [-9749, -16295, -9748, -6208, -14430, -1384, 9290, -3098, -2265, -18374, -7089, 603, 5773, 18276, 12538, 17215, 17524, 19350, 23285, 21912, 17213, 15487, 14210, 14224, 4196, 330, -912, 16304, 17152, 35774, 71663, 76857, 72248, 49987, 37552, 24757, 22166, 18514, -301, -9987, -1231, 1707, 7516, 18853, 34592, 42759, 35009, 11652, -2421, 7023, 20260, 27325, 23870, 17125, 8234, 10421, 14531, 18372, 21848, 17605, 8570, 4175, -10288, -15531, -10499, -7660, 6345, 8911, -2240, -6022, -4155, 8553, 17455, 31595, 34505, 27154, 19061, 18275, 31989, 40676, 33187, 14005, 10620, 26270, 21109, 17260, 19738, 17225, 23183, 17589, 16209, 14565, 21259, 28299, 26612, 8767, -2682, 16576, 22226, 32740, 46558, 35061, 13608, 14887, 25078, 21139, 15537, 21073, 33085, 39531]
18167C9531q509r752m355j434P552J05M758O021J4853J0383M411L894j4980P263
18153E9741N522r028j116p329k083m165Q246R298O395L059n807N379K2534J3014
18139A03660J5180J3784N030J349P861P44J2959K3447K2592K7980K5692L6781
18127B97059M2294L4074M3200Q2390Q2509J08726J22325J21707J13525J15506
18117A163315J42117J51331J85909K92489M92010Q23788J508113K949842N556125
18108A3265039P930402M521643l360566n846394n222987l852205k462874j485720
18100C486338r22561o42545m68388l26872k38086j59438j25515r5987p7982o2117
18090C66847n7210m5347l8326l4808j3188j2262q567j3585j0275k6433q937j69
$$ y = [39531, 31022, 21270, 16915, 15481, 23033, 23138, 27896, 33917, 48770, 59153, 63564, 67458, 52478, 59741, 65263, 56235, 55119, 47790, 45707, 41542, 49788, 59086, 65481, 68540, 62733, 68112, 90646, 103660, 118840, 132624, 137654, 139003, 146864, 147608, 160567, 184014, 206606, 234586, 260278, 297059, 339353, 373427, 416627, 499017, 581526, 690252, 812577, 934284, 1047809, 1163315, 1305432, 1456763, 1642672, 1935161, 2427171, 3250959, 4759072, 7708914, 13265039, 21195441, 25717084, 22356518, 16510124, 11287137, 7434932, 4972058, 3486338, 2563777, 1921232, 1452844, 1125972, 887886, 728448, 602933, 506946, 428964, 366847, 309637, 264290, 225964, 191156, 177968, 165706, 157139, 143554, 133279, 106846, 97909, 97740]
18078I7740j6839k1364j3215j3M498K237N816M89l127M189k869j5335l328Q488
18064D7367J598l956p071K768P571n171p231M625n711j4343l269K241L973N73
18050B3964o32J289p586j895j2670n573M026N375l332O190R745N537l160q579
18036A2699l62L25k159M403q670K080M401L155m229j072q95j6987j816o77k971
18021a2775J0646O980J1889N013k6298j1455J607j845R773k78q951L431P58N344
18007f161N725J735l288k9N50P214K1256j0728p651j211L12p939n80J300Q991
17992I496r07n724J954k977o461L077L132n180r821p838N538J4688K632j2702
17978a1093j1688o936L708M954J3846o01o519m312n678n99J185O483J8536p188
$$ y = [97740, 80901, 59537, 46322, 46309, 50807, 53044, 58860, 59349, 56222, 60411, 57542, 42207, 38879, 47367, 48965, 45009, 37938, 40706, 48277, 43106, 35875, 40500, 34789, 20446, 17177, 19418, 23391, 23964, 23332, 24621, 17035, 15140, 2470, -3103, 923, 6298, 2966, 9156, 18901, 24438, 21278, 12699, 12337, 12662, 10503, 14906, 6236, 8316, 12717, 15872, 11643, 10571, 9676, -7311, -9127, -9804, -12775, -2129, 4851, 16740, 21753, -4545, -16000, -14393, -16238, -6465, -6743, -15694, -12263, -11505, -6161, -436, 1299, -1989, -2018, -1468, 5746, 27002, 16274, 8623, 7412, 7724, -215, -795, 505, 9496, 8589, 2865, 4819, 1842, -4619, -1542, 1590, -3590, -13411, -21249, -15711, -1023, 1609, -11093, -22781, -29717, -26009, -21055, -7209, -7810, -14329, -18641, -24319, -24918, -23733, -17250, 1286, -5902]
17964e902l024O245r297L527O507n862J2309J3179q747n724l467R351j641k1497
17950a4043o297J2053L245K181L269M387j628J251k501j461N355k434o581O285
17936C081K901p945P396j6940j1239J5576Q413p127j3054q645O263J7902j2188
17923a5606M11l053L657r505r329o495j9898j3736L9347L0485J3340L339M107
17910A7064L910r162j5323j8822O237J1263L634P305R755n170k3556m260R240
17897g885M216q680O171R001k213L572l748l4p960j0775P372O490l565N076j173
17882d135N67Q968J943k1428l89N465O100j0971j1638m351J4178N210J0380L853
17868C752L261q034j781R587L609L071j9909J389J2860P920j6289j9797m212J0962
$$ y = [-5902, -8926, -2681, -11978, -8451, -1944, -7806, 4503, 17682, 8935, 3211, -256, 9095, 7454, -14043, -20340, -8287, -5042, -2861, 408, 4795, 3167, 4418, 1917, 456, 5811, 3377, -3204, 3081, 5982, -1963, 5433, -11507, -22746, -7170, 1243, -5884, -18938, -27583, -21320, -3418, -15606, -15195, -18248, -14591, -24096, -33425, -39920, -59818, -73554, -34207, -3722, 9618, 12957, 17064, 20974, 11812, -3511, -22333, -16096, -4833, -1199, 6106, 15861, 10691, -12865, -17125, -7885, -3669, -12349, -6178, 2823, 610, 4182, 434, 400, -7560, -18335, -10963, -4473, -8038, -2962, -4135, -3568, 5400, 7343, -14085, -14474, -9009, -2909, -13880, -25518, -29869, -15691, -10481, -101, 3752, 7013, -1021, -2802, 6785, 10394, 13465, -6444, -5055, 7805, 15725, -564, -20361, -24573, -13611]
17854a3611J1783L147L606O98r291R303k849j255J381m634k539j040J594o114
17840i821n268J4990R662K658N964j2443j2327P566k09L44N173O491p06n052j3605
17825f583k166M828K784Q486k525o901L437j1736K689j724j782R810n894j135
17811h412l840k090J9300O397L770M485j2697r168J0238j1061r760o249M212R045
17797e830J8396O834m677j6923j2746j889m740j831J7039J1019N364r250l962
17784c196n852j62R475L386j4101r599M121J2472n036K28J636o784m022n903R620
17769a3717M451o355n246k399J4682J0577J897k768K884n640p085j0735J5524
17756c930O149m701k287L416k206l907Q747K155m705j2684j1681J50J6563m919
$$ y = [-13611, -1828, 1319, 4925, 5623, -3668, 5635, 2786, 1531, 2912, -1722, -4261, -5301, -3707, -9821, -15089, -99, 9563, 12221, 18185, 5742, -6585, 981, 772, 1116, 6289, 12780, 12074, 7022, -6583, -8749, -3921, -1137, 7349, 4824, -2077, 1360, -10376, -7687, -9411, -11193, -1383, -7277, -8412, -12252, -14342, 4958, 11355, 15125, 19610, 6913, -2255, 7983, -3078, -12838, -19087, -14875, -5830, 12566, 19400, 14723, -2200, -14946, -16835, -21575, -23406, -6367, 4652, 10016, 766, -3196, -9048, -9210, 265, 3651, -10450, -20049, -15928, -3456, -8492, -8264, -6628, -13412, -17434, -23337, -13717, -9266, -15621, -20867, -23266, -8584, 1993, 3890, 1122, 4006, -1634, -8719, -19454, -3930, 2219, -2482, -4769, -1353, -3559, -7466, 1281, 3436, -1269, -13953, -25634, -25484, -8921, -13840]
17742a3840P523J4643L085p184j1063K72K1396R535j2210R41o308J0403m629n342
17728G222r047o818p205p079Q017p132J0004N153J678N283j730o914n817R19P071
17713f395r904j797J2519J5820K634J65O832k2138j4187l93L826o954J557P828
17699a0587Q420l705K342J9192J0204j3267N11J4133m474j1097p816p433M011
17686D34m494J2355Q839m338j8371k172R093O376R71j1273k7q994l506O988n034
17671a3153p998j2785l882K990K1953M458J961k695m330O729N186N850L295l858
17657C721M65j9448K583J2941P15j567O026j931o643K33r28l448j1975O781Q491
17642c984P203N247O49q97j1896k941J2819J719Q322j561r764r190o658o765J2417
$$ y = [-13840, -6317, 8326, 11411, 4227, -6836, -6564, 14832, 24367, 12157, 13098, 6790, 17193, 12564, 7222, -1825, -8643, -15848, -22927, -14910, -22042, -12038, -6885, -5207, 76, -1654, -8568, -14385, -13466, -6395, -16299, -18096, -5577, 10243, 12877, 13042, 19874, -2264, -16451, -16844, -13018, -19972, -18415, -10587, -2167, -5872, -3530, 15662, 25866, 12599, 13110, 27243, 22769, 11672, 3856, -3577, 434, -4060, 8295, 17134, 12796, -5575, -7747, 1346, 7722, 8693, -2580, -2607, -11601, -15107, -8119, -13153, -21151, -33936, -37818, -34828, -12875, -8417, -6456, -9151, -13481, -6752, -1566, 4284, 7579, 3721, 4186, -15262, -12679, 262, 977, -590, 5436, 3505, -3138, -2905, -3833, -7281, -19256, -12475, -3984, 3219, 8466, 9115, 8218, -3678, -6619, 6200, 7919, 16241, 14680, 4916, -4274, -10932, -17697, -5280]
17627e280O823O747j866R47N689m608j6045j8340o647J0925J1932J2548k256n046
17613d477r730J2088J2603m257r678L454P516o606J763N6J377O427p572j1121
17599h157M528J9061J133j1970m778J2027Q824l530j1996j0664Q40j2835j9730
17586c7247M475J6438K1886m768q147o242n074P678J0230j0413K784K603q10O917
17572C10M319r028Q706j004q968j2396N942Q583j3716j49Q148J520K383q40N437
17557g53J9126M769j0608j0103o373O391K364j3609p347J236L514L396N05M236
17543c256L710m001k212J016k124l094J429N606m89J842K051q634j592L600L49
17528e799K904R432q235P80p433p694N842J6236j798J433j300l23j0600k257N44
$$ y = [-5280, 1543, 8290, 6424, 7371, 13060, 8452, -7593, -25933, -32580, -21655, -9723, 2825, 569, -4477, -14207, -2119, 10484, 6227, -3451, 3, 7519, 913, 2676, 2732, 4109, 10536, 2964, -8157, -3629, 15432, 16565, 4595, -183, 11844, 20668, 17138, 5142, -5522, -4682, -17517, -37247, -32772, -16334, 5552, 784, -7363, -13605, -18679, -11001, -771, -11184, -8400, -5797, -6607, 310, 4629, -4399, 4307, 3303, -5665, -18061, -12119, -3536, -17252, -17401, -9253, -7733, -5350, -6190, -753, 18373, 23142, 12534, 2431, -3942, 2449, 4813, -8796, -16143, -14907, -11393, -7997, -7492, -3256, 454, -3547, -5759, -4743, -6867, -9961, -8532, -2926, -3415, -1573, 478, -8156, -9748, -6148, -5799, -2895, 6537, -1698, -918, -8351, -16045, -10203, 6033, 4235, 5668, 4368, 4045, -6555, -8812, -8268]
17513h268j951J0935N929O765L964p669l906o106o583J0936P95j8622q975k220
17499b4976Q845K3560Q38q324P138p834k976o823N200K0460P962j1654J65L314
17485A4895l019L927l047o574k952o255n33O723l567m329M124O195k371l192n168
17470e143l341J6897O13r645o190M743j742p70L409J0014Q548J349l795p015o18
17455G314R551p20j3656j2313L417J2509R684o124k086J650j98P073K7486L5547
17441G9134L9469Q314k3245k5788l8178k6086j3265l452K504M229p174N17o85
17428c706m709l229N441k639j0707M773M634j3161q390K2920J0716q692J646J546
17414c557M757j8386j57J4453n487m059p832Q705l073l842J520N415P821J6236
$$ y = [-8268, -10219, 716, 6645, 13410, 17374, 9705, 5799, -307, -6890, 4046, 4841, -13781, -22756, -24976, -16131, 7429, 8267, -57, 7081, -753, -3729, -10552, -5352, 15108, 23070, 11416, 11581, 14895, 11876, 15803, 12756, 6182, 3230, -3025, -3558, 3165, -402, -4731, -607, 5588, 3217, 25, -5143, -8484, 8413, 9026, -619, -6809, -2066, -3808, -4578, -1169, 8845, 17393, 18742, 14947, 7932, 7314, 16865, 16145, 2489, -9824, -6407, 6102, 15786, 9662, 7576, 9226, 9028, 16101, 43587, 79134, 118603, 126917, 103672, 77884, 39706, 13620, 355, -3097, -593, 3636, -3538, -3021, -3706, -8415, -11644, -6203, -8842, -19549, -14776, -10142, -23303, -31693, -8773, 1943, -6749, -5103, -3557, 1200, -17186, -17343, -2890, -8377, -12436, -20268, -11563, -14636, -18478, -16958, -11543, -3722, 12514]
17400A2514j1269j3631K767J99n262r853K51N345O552l160Q94j914N231J0607
17386g29J1069n32j435j9180r734J25J0204J0037j0429r33K706j066l836j360
17372a5093l968M325J0752j5250M163J436N498M863K447M707q600J298K028k676
17358d070m214m516k340p174J6586K9255o03o047j12j698j0810m520m463n640
17344a0366K752p648L950K035j11j0820L955J0535p691J3640n833K906O416R97
17330D717j4692j0581j753n54J0238N813o00N310N902R735k891j9422p286Q269
17316g795K870M105N677R462o940j5045j0813K392m38n755M924Q585O359j0446
17302a2858q676K1344L865r147R88M708l157R59j2291Q207K3169J0296n752j5436
$$ y = [12514, 1245, -12386, -9619, -9420, -14682, -24535, -24284, -18939, -12387, -15547, -14653, -16567, -11336, -729, 10340, 9808, 8373, -10807, -20541, -20416, -10212, -175, -10604, -11537, -8831, -9897, -13733, -15093, -19061, -14736, -3984, -19234, -15071, -13635, -8137, -3274, -827, 3880, -4720, -3422, -1394, -4070, -8284, -12800, -15140, -22314, -5728, 23527, 22924, 16877, 16765, 15067, 4257, -263, -4726, -10366, -7614, -15262, -11312, -9277, -9388, -20208, -16253, -5718, -13409, 231, -5602, -2696, 3720, 4717, -9975, -20556, -22309, -22863, -12625, -6812, -7412, -2102, 3800, 13535, 10644, -8778, -16064, -7795, -4925, -820, 4857, 14319, 7379, -7666, -18479, -16087, -16525, -22280, -17356, -8771, -2412, -12858, -21534, -190, 3675, -5472, -4484, 224, -2933, -1974, -14265, -6058, 17111, 27407, 21655, 6219]
17288F219P18o135m239k3j31L800J2618L229o875M624k196j1966n56J0496M122
17273A3705L466Q783Q934m665m198q850Q066j5243j5309n052O821k120k0564M225
17259b2001K2665L535n228N70Q430j384r028O068J0244m977k705o992k986M296
17245E07p262n511K950k209j7307K0550J9089j429j330P22JP196j955p971q565
17230b524M086R830P30m417r228Q790m595m075l70l906N479k666n445R018J429
17215B136Q691L180k1207l501Q278o32q730q773K200L766k475k432J641N85N685
17200a1588l468J0817m216n0N506m314N015j100j1303k583J7170J5467l461j4402
17186b510k413J3657J2585n794j4230n95q982O542J0212q214r797K507n230K773
$$ y = [6219, 6937, 802, -3437, -3460, -3591, 209, 12827, 16056, 9181, 13805, 11609, -357, -913, 9583, 13705, 17171, 25954, 34888, 30223, 26025, 17175, 25241, 9998, -5311, -10363, -3542, -5662, -26226, -22001, 664, 4199, -1029, -459, 7971, 6587, -2441, 3627, 13871, 8894, 6189, -803, -3789, 507, -6755, -12266, -9316, -11525, -28832, -8282, 10807, 9378, 8048, 8770, 8771, 15967, 14012, 6041, -2524, 1562, 11392, 12122, 7705, -1523, 7267, 2672, -1403, -1773, -5679, -200, -2866, -8311, 707, 2136, 10827, 14007, -7200, -10701, -2423, -3055, -11785, -20558, -18358, -14592, -17067, -19499, -17858, -17273, -11588, -15056, -4239, -8455, -8505, -2999, -7313, -2298, -3398, -14701, -17284, -114, 15353, 11892, -2510, -4923, 8734, 21319, 15525, 1295, 700, -8282, -1740, 8472, 258, -9539, -7032, -12262, -9489]
17172i489m64j0375R82L947K8302M153n745L312O402j1663p476R189p590L62K792
17157F639j492o642K392n559l615o490j288N964j0483j059J3985K72m370R693
17143b053k026J838l886n150k636o559N772L315J7324J842k0151m737J0435q821
17129a5493M732l136m778M375P479r26J3301m751j4183Q165n93j5227q435j111
17115c0581J0518J7273N204j864N191J6128J0438n071j228p310k4363K386Q806
17102E527K294K444N667L121o675K906o506m976k118j4178l148L932N328N564
17088h18J3295r566M787k806m194o321O577O472l024o391p405J412k495Q630n81
17073b428l792J0227O844n009p37j218n760P216O085j4986q697L581N940P490
$$ y = [-9489, -9953, -20328, -19346, -15399, 12903, 17056, 11311, 14623, 21025, 9362, 1886, 11075, 3485, 3847, 6639, 5147, -1495, 897, -4662, -8277, -14767, -16055, -10091, -20574, -21633, -7648, -7376, -11746, -2053, -4079, -2241, -6127, -11277, -13913, -20472, -14700, -11385, 5939, 7781, -12370, -17107, -6672, -15493, -10761, -13897, -18675, -14300, -6821, -7747, 5554, 803, -13380, -5215, -5808, -21035, -29470, -30581, -20063, -2790, 2414, 550, 5741, 21869, 32307, 27236, 26008, 18698, -5665, -3279, 5527, 7821, 10265, 15932, 19053, 12378, 15284, 8778, 3802, 1684, -12494, -15642, -11710, -6382, -818, 12477, 2911, 7698, 4892, 698, -5623, 954, 7426, 4402, -1989, -9394, -7982, -10477, -1847, -2428, -6220, 4007, 10851, 5842, 5105, 3887, -1873, 5343, 11428, -3558, -12255, -8674, -2734, 4756]
17059D756J3059P990j3358m525Q389P63j6520n325L680j792k359J1084j708P970
17045A2104J2211j6972j5466j4753r0P508J0748R252l002j7392j4640J3790K525
17032a4177q864J3509J6640n465L740o404o518j8022J162R173K456K906L537R57
17018e370m701J230n794m152K0433J7203p283o766p515j2946j211j3816J5372
17005a5316Q724Q640j774r133l634P193J906k4887J173J2627J831j368K1581R446
16991A7009M03l495K169P441j0090N094j1204m42o3j538p156m369j0558J081P824
16976g894j14L797l779P431n17j3859p943J2133J0336L254J324m652n754l639
16962i876q53J757l643q243j0329k514J2411J2399m313k63P101N107q999p547
$$ y = [4756, 17815, 25805, 12447, 7922, 16311, 17074, 554, -4771, -1091, -2883, -5242, 5842, 4134, 12104, 24315, 7343, -8123, -22876, -22966, -15458, -4710, 4542, 1540, -15852, -30492, -16702, -14177, -23041, -9532, 7108, 1643, 5383, -1021, -7539, -25561, -24399, -15226, -12770, -9864, -6327, -5370, -10071, -8841, -14635, -18787, 1646, 18849, 11566, 4800, -2715, -15661, -16872, -30688, -15316, -6592, 2048, 274, -8859, -12493, -5300, -3394, -28281, -27108, -14481, -12650, -14018, 7563, 17009, 17412, 13917, 16086, 23527, 13437, 18531, 7327, 6885, 6822, 5284, -1872, -6241, -16799, -15718, -7894, -8008, -4211, -7990, -559, -1076, -14935, -22878, -10745, -409, 2845, 4169, -483, -6237, -9876, -10729, -8972, -12615, -20858, -31187, -33701, -21290, -8891, -13204, -13467, -6366, -1259, -10258, -17805]
16948a7805p45k247N002J0499J782o026O181P800K083m535j2740r92O486o457
16934a1714L642J6888j41j6696m105n245J1244K0124m795m734j0447k0800O567
16921b0212j068Q730K1210J018o055m088l91j133p152J223Q449k128J6172K454
16907A7029j4924o849n716j331N950r095o829J0532P991j5751N692J97r210J027
16893b1287J4016Q994N01n992M77J0292n975j7352l252Q546j2591p503J4294K3762
16879F930r742r442J231m600P711O18j551j31k474N58n943Q699L970N474J708
16864C016l681l876m800K335J0185R380j4877k0384o167L126J6699J1010N834
16851G800J112q479J396J1348k659l127k664j929k0158P324P589J7730p295j1205
$$ y = [-17805, -18550, -20797, -15795, -5296, -3514, -9540, -3359, 4441, 6524, 1989, -10751, -11743, -5257, -11714, -8072, 8816, 8675, -8021, -12126, -17371, -6127, 13997, 9202, 4468, -5979, -26779, -20212, -21280, -12550, 8660, 9678, 3623, -465, -856, -1989, -9141, -7918, 531, -1597, 14575, 17029, 2105, -4744, -10460, -11791, -5841, -14936, -21765, -11233, -3242, -18993, -13301, -13104, -22314, -21287, -7271, 1723, 2224, -3768, -3291, 7001, 1026, -16326, -19578, -11032, -23623, -31126, -16832, 6930, -2812, -12254, -11023, -15623, -7912, -7294, -8845, -8976, -11450, -10892, -16835, -8136, -4166, 1308, 3016, -665, -4541, -9341, -7006, 3179, 12559, -2318, -22702, -28869, -25743, -9044, 1966, 7800, 8912, 433, 1829, 13177, 10518, 7391, 4727, 2798, -17360, -10036, -2447, 15283, 7988, -3217]
16837c217m773J2507r74l809k200O904j3038J2687Q964j0775j5525M556L427j913
16823g179l614m12Q968q978j344m995m537P244J462r572L299P23k661R597J8418
16808F419o574o572n111o344j727J4414l588j3715O605N090J928J178J783r120
16794a5334o986J3739J7026N446o114o661K240K06J873p11O117m963j2559q78
16780g559M38P734J265m393k086j1544J7646N277j4209j1282j3418J980K286K640
16766b5225J0429K547Q143J3735J4800l713j7511j4494O365L379M389j027p279
16753e462J728Q625K691M92j233J4633J594r293k866n787m378j91q296k455J9209
16738I011j37l599O736K943p172j669n905M092n232j1775l975J0668j943l678
$$ y = [-3217, -7990, 4517, 3543, -266, -2466, 4438, -8600, 4087, 13051, 2276, -13249, -8693, -5266, -7179, -10793, -11205, -2237, -11215, -12559, -17554, -22091, -14847, -13385, -22957, -19658, -18935, -21596, -11999, 6419, -155, -6727, -11838, -18182, -19909, -5495, -9083, -22798, -16193, -11103, -9175, -7997, -6214, -15334, -22320, -8581, 8445, 13891, 7777, 1116, 3356, 3562, 5435, 4724, 10841, 5878, -6681, -7559, -7121, 613, 1878, -2515, -4601, -16145, 1501, 6778, -7431, -18713, -32131, -30151, -27865, -25225, -14796, -12249, -4106, 9629, 24429, 20716, 3205, -11289, -4924, -1545, 2844, 1817, -5462, -3734, 4891, 7582, 8074, 6841, 21474, 23068, 13775, 10909, 5122, 744, 553, -7743, -10198, 9011, 8874, 5275, 12011, 14954, 7782, 6113, 208, 4300, -932, -12707, -16682, -6014, -7957, -11635]
16724a1635N852J1573k22j197o219P967Q136R98k2650j5972J2643O429p272K03
16710a1366q781J99J1635J1302o670o031r194J1700J408q884j403l276P140J4157
16696A936J01j3810k323q489l781M61J8575P464o426P884J955j2046n650m439
16682a8588q193n364J2060N954p852j817K634l06j1329r78K2365N303J8291K080
16668A4260q972j4682J3675R389p507r707M580k613q648m69q809m370R35N981
16654a6957M463o692O661N303p812J434k724R314j629o158j771l818J0789J8175
16640H578j2786q214P361R124Q109l225J720o277m577j0275n205l124J5224k897
16626f464o953N144k146q94m058L693j495j520J126L53m239o033Q493M338Q49
$$ y = [-11635, -5783, 5790, 5568, 4371, -1848, 6119, 14255, 15253, -7397, -23369, -10726, -4297, -11569, -11366, -20147, -19948, -8313, 2989, -3681, -9712, -18906, -7206, -5798, -14682, -16085, -19361, -12221, 1936, 2037, -11773, -14096, -22585, -26366, -25905, -7330, 134, -6292, 1592, 3547, -8499, -14149, -18588, -26781, -32145, -20085, -14131, -21983, -23800, -21166, -21472, -32801, -33779, -11414, -6111, 12180, 14260, 5288, -9394, 4281, 13670, 6163, -3544, 1036, -1577, -10225, -10694, -19503, -23873, -22938, -16957, -12494, -19186, -12525, -7222, -15034, -13600, -16324, -7010, -8639, -14797, -16568, -20386, -9597, 8578, -4208, -12422, -5061, 4063, 12172, 8947, 10667, 4390, -187, -10462, -15667, -18791, -3567, -6464, -13417, -8273, -10419, -11313, -15371, -11678, -13173, -14693, -13567, -13214, -17453, -23486, -14993, -10655, -9806]
16611i806Q015P860q357K61K196o78p306r994L620M499K625q253J222p724o736
16596b8556o291J0802O971J0572J7485o474j1778m993J044o898M149J4857P85
16583A675m187K463M898j808o650M682Q399j4421J194J9845l354o015m204K450
16569D967j485q054m766k425O464J4872n507j7117N20q56p645R437M527l238p97
16554a1103J1898J151o827m604J096P424P635o867k950R002O830Q027j2267p738
16540G07J0067p24N273j364m839o29M096L590j2127j5245L494J8499R21K590k348
16525A1961j117N85r212q191j0323J1784K473o827J450J1153N997k770j3717j336
16511h090P696J4293k911J210m278M230K411j1094o966n140j1228J0181m346K620
$$ y = [-9806, -1791, 6069, -2288, -2027, 169, -509, -7815, -17809, -14189, -9690, -7065, -15318, -14096, -21820, -28556, -34847, -24045, -17074, -6502, 10983, 4509, -7269, -12262, -11218, -18116, -13967, 890, 1675, -2512, -49, 4849, 3041, -3609, 1073, 9472, -4949, -3755, 16090, 12736, 6721, 2517, 4967, 3482, -4572, -9338, -11763, -5299, 9573, 4066, -13051, -12531, -13387, -21032, -11595, -7068, -10306, -11103, 795, 1946, -4881, -9485, -8389, -965, 6670, -197, -3147, 5855, 12685, 20712, 8445, 707, 10774, 10050, 15323, 13959, 9120, 8491, 12587, 16177, 4050, -11195, -7701, 10798, 11719, 14309, 11961, 10844, 11429, 2217, -5974, -16297, -4513, -2040, -8867, -7417, 3736, 9733, 6963, -6754, -8090, -394, 13899, 10988, 12198, 7920, 12150, 14561, 3467, -3499, -8639, -19867, -9686, -14032, -11412]
16497a1412N265R890J112q486p125M724m482M26k747M375N247N741M081q693j2075
16482a4159P280M595o65l970J874N151j515O740n95o405n396q238M805L426L531
16467c541L318O773J0568Q3j5046j7679j4099Q864K1003N706j0450Q441k009N19
16453B451Q023n527p721j0174R181J6011L312j1085o615K612k907p804M743P997
16439B497P86L092Q803o551l916L512O352j670q631R12Q582J0290n260j7659j359
16424b20J2631k039j2354j6397j6947j0877P225J4055P187J5717J5205K743o069
16411I860m927k930P46l581j2372o028Q169K437o151j72J0375O525p087l03J5207
16396I768L437j9741l396J3465K726K877J52l873r19j5107N085P300J616o562
$$ y = [-11412, -6147, 3743, 4855, -3631, -10756, -6032, -10514, -10088, -12835, -8460, -3213, 2528, 6609, -2084, -14159, -6879, -2284, -2949, -6919, -5045, 106, -1409, 5331, 4736, -1669, -7065, -15303, -10498, -7072, -3541, -223, 6550, 17118, 17201, 2155, -15524, -29623, -20759, 244, 5950, -4500, 3941, 1932, 2451, 10474, 4947, -2774, -12948, -3767, 12244, 15556, 4471, -2144, 468, -2439, -10243, -5500, 2497, 3283, 6375, 15178, 8627, 4711, 8223, 14575, 12905, 4274, 5186, 13768, 24058, 18798, 1139, -220, 12411, 10372, -1982, -18379, -35326, -46203, -38978, -24923, -17736, -2019, 13186, 15929, 9860, 4933, 2003, 2749, -832, -13204, -19232, -11063, -8626, -14777, -14949, -4574, 1951, -5136, -5439, 9768, 13205, -6536, -9932, 3533, 6259, 9136, 9288, 5415, 4496, -10611, -5526, 1774, 3390, -3172]
16382c172J6937L540p733p187j355j359J52N802m816m935J1196J747J213l18j1816
16367b104M47O369N462j1874J77o236k1053J66N230P718J2388M956r07k722J858
16352a25K596K319r791p660K905K795N483L477j5035q756O725n255P940N740n165
16337a1807O557j0203j200M049k726J5210Q180q129Q244K58P852p88n410o372
16323C715m122l812j207j2975P139Q784j072j484K076L472n408L860Q32J41M748
16308D687o997j701Q715L757J4288R759n330p375l989j8269k206J0076o080n468
16294f133j278M642R826P507m318j5271r839j933R015R186j240j184k789n713
16280i522j2473M391O434J0966j4463j0866M864N918O409R414k087n438P741J6317
$$ y = [-3172, 13765, 17305, 9572, 2385, 1030, -329, -177, 5625, 809, -4126, 7070, 8817, 10030, 9712, -2104, -1657, 4712, 10174, -1700, -1523, -7759, -28812, -28646, -23416, -15698, -3310, 1646, 739, -1983, -125, 2471, 4790, -5001, -12661, -9756, -6961, -1478, 1999, -13036, -21792, -15067, -20322, -12382, -6642, -11807, -5250, -15453, -16653, -12604, -15330, -120, 8060, -69, 8175, 8433, 16285, 15497, 10087, 3715, -407, -4219, -5426, -18401, -11262, -2478, -3550, -5034, -2958, 514, -4894, -1034, -202, -61, 4687, -2310, -4011, 4704, 8461, 22749, 32508, 27178, 19803, 15814, -2455, -4661, 5415, -665, -6133, -7411, -2769, 7057, 14564, 10246, -5025, -14864, -16797, -7782, 1404, 164, -1020, -3809, -9522, -21995, -17604, -11170, -204, -14667, -25533, -20669, -14751, -8342, 1072, -1015, -6453, 1288, 17605]
16266A7605J2514j1313j4078r027j401j359o525K538J1709R6o467j7654m967K862
16252b5467J5723J7496r029j4988O853P755j869R133p512k257J5862l401p553
16239G46r205Q87k121p260l203J6115R489j1022q333k043K196J0659q779J392
16225a0482J0958J776r845r001j815L939N437J380J112P82J3565J4735k073j5725
16211D743r160j0102J373P741j546L928k998M509J5965L574n35j6741K366K694
16197E811m804j6640J0019J5162k074r253k3519r650J1315J905J654o46J1577
16184i143R224l758j6172J5604J2599j6310n618J2075o6j5947N729J681o264O191
16170a0175J9743J543n305j096j2429m630N706p811Q053O382l107K0695J3638
$$ y = [17605, 30119, 18806, 4728, -4299, -5700, -7059, -13584, -11046, 663, 759, -5708, -23362, -28329, -25467, -9744, 7752, -1277, -16265, -9412, -1657, -3526, 5607, -1905, -4162, 11700, 8299, 746, -8459, -7572, -9693, -16953, -20156, -4041, 5448, -5574, -13907, -15950, -13754, -3095, -11874, -10482, 476, 2252, -7593, -16594, -18409, -14470, -9033, -7653, -6541, -5759, 7806, 22541, 20468, 4743, -4417, -14519, -13146, -5405, -6951, -3023, -6021, -1512, 14453, 18027, 17492, 751, 3117, 5811, 1007, -15633, -5614, 9548, 7474, -1779, -25298, -34948, -23633, -21728, -20074, -20720, -9143, 81, -3677, -19849, -4245, 8354, -7956, -13574, -1499, -1565, -17512, -11783, -10102, -16366, -10175, 9568, 11111, 5806, 4710, -7719, -12349, -6643, -14454, -6401, -19, -3126, 17569, 31207]
16157C1207n768m463j1927p765j1164j1207L45N829J9014l08j1334J2009J6511
16144B0979l239q154K099j2500M742J8619r55j1934r309Q373M75q431L652l907
16130E10n115j247L154J2479M941j075n513j312p546l026L574Q932p276j484K309
16115B305j04l760p765m551j902m883o363j509J213L092J7222L82j2107N995Q949
16100c786m890k060K0942P175j0368r834k376N141K022m25j1665m448R550n266
16086a0288K631N001O115j2651k2000L750o570j3027J7119J4662L827p90J823
16073a0398O471M811N99o996k261L488j301M819O02K482J109k527J0557l116m098
16058D241O039Q394j3785j3448K014n59K853K01N888Q217P264J104j906r230m16
$$ y = [31207, 25439, 20976, 9049, 1284, -9880, -21087, -20742, -14913, 4101, 3793, -7541, 4468, 20979, 17740, 9586, 11685, -815, 3927, 22546, 21591, 9657, 348, 8721, 9196, 765, 4417, 510, -4605, -5852, -2698, 9781, 14722, 13647, 8134, 6822, -724, -3750, -176, 8756, 1480, -4, 2305, 2201, -1559, -9324, -13875, -15777, -20660, -27023, -28532, -27319, -24227, -7005, -6623, -18730, -12735, -3786, -8676, -10736, 10206, 17381, 7013, -2821, -5197, -56, 1966, 1541, -10124, -14572, -5022, -10288, -7657, -2656, 3459, -9192, -31192, -27442, -34012, -47039, -29920, -15258, -11431, -12221, -10398, -3927, 884, 1483, -5513, -7774, -4286, -5587, -768, -166, 2316, 3425, 898, 11455, 8339, 4241, 10280, 18674, 4889, -8559, -6545, -7104, -4251, -4050, 1838, 10055, 17319, 18423, 16517, 7287, 6871]
16043F871Q00j2186l548o27O643k256J000n280j9469l353K7553K0276p886k038
16029F500j0259j3799n83R986M098R231J015j4004J6356J3218q360N750p568r423
16015B158k01j903r247j2880M943L221k332P105k329j584J149L588k05J2277j611
16000B149r844p559J605M223k168m092J0046M671m778M058r912k777p651j472
15986b3501O991O205M161R848j251l339Q374Q832q525p545l083K307K437K800
15972D711J631m980L567R596M595k248m405j5224o936J1905J7897O507q661p564
15958A0391r846l319N820Q561L831m73q237j073J109J560m914k892P43j0119R769
15943I11q498k780R227K6588P928l592n257r735j5199N722N888j29j2609L06N375
$$ y = [6871, 7671, -4515, -8063, -8690, -2047, -4303, -3303, -8583, -28052, -31405, -3852, 16424, 8538, 6500, -3759, -17558, -18141, -8155, -4057, 5174, 6189, -7815, 8541, 21759, 13399, 19149, 11581, 2158, 1957, 54, -9193, -22073, -17130, -13909, -16241, -9136, -11465, -13049, -11900, -8312, -8517, 3760, 2149, -7695, -15254, -13649, -9426, -11594, -15686, -5640, -969, -5747, -1689, -11601, -14378, -22029, -23501, -16510, -10305, -6144, 3704, 2453, -886, 7488, 16320, 7795, 250, -2833, -526, 1911, 4711, 6342, 1362, 4929, 14525, 19120, 16872, 12467, -2757, -9693, 2212, 20109, 26616, 17955, 10391, 545, -2774, 3046, 11607, 15438, 14965, 6728, 5655, 6764, 8324, 3410, 518, 1261, -8858, 911, -7587, -10367, -1140, 25448, 33376, 29784, 24527, 14792, -407, 5315, 11203, 11074, -1535, -1229, 4146]
15928D146P864p60m841m020j31J2025o995r701r159o637Q830J2034K2434K245
15914B7334k0739p782r817l765N555P62P205J6603p940l644q06j661k825j409
15900b929J344p985j866q188p408R370L995n944O144q545P55r504M068P417O35
15885a8641J309J752l39Q238p570j728K446J3734J6336r233r792K316p067R896
15871A657J1459m079m213J159N164j103j6021j1234M589O227Q860R026L712j1666
15857C537o371j1728Q918O865j6052p95K11l864N874J8113R228j8939p400N7j0235
15842b2581N866K1918Q819n580J22L999N662O17p341j0353l944P26R221J2069
15828A9220J831p853m842n189o352n205q372J3085m516n479K940Q135M019l691
$$ y = [4146, 12010, 11250, 6409, 2389, 2258, 14283, 7288, -2413, -11572, -18209, -9379, 2655, 25089, 27334, 6595, -1187, -11004, -14769, -9214, -8452, -1247, 15356, 7416, 3772, 2966, 1305, -1520, -2929, -1585, -9570, -11436, -19624, -27032, -17662, -13667, -19611, -13467, -22012, -21257, -30761, -26693, -19276, -18641, -17332, -15580, -15919, -7681, -15251, -16979, -14533, -799, 15537, 6304, -3488, -1172, -8239, 1657, 13116, 9037, 4824, 5983, 11147, 10044, -5977, -17211, -12622, -6395, 2465, 11491, 15203, 3537, -2834, -14562, -5644, 1221, -14831, -15626, -15415, -19279, -13405, 4708, 13936, -5003, -12403, -12346, -22581, -16715, 5203, 14022, 8442, 8564, 12563, 18225, 18842, 11501, 1148, -2796, -2070, 7151, 19220, 21051, 13198, 8356, 3167, -3185, -8390, -16762, -3677, -8193, -13672, -10732, -2597, 1422, -2269]
15814b269Q751l573K0l267p091o967Q280R850r054P48J5395k046k18m00l692K5
15798D492J135K923m630L937O535M126q133J477K103K593j566n178n465j1394
15784g045j4810P504n7k103M175M516J480p003J4430j055O145q135j0396M348
15770h006R088K205k622r989J2J626M710P121M393K2444p604j9639n377m459l071
15755i168o712N131O647R803J279Q446Q074j6518q227k868R010J3909n958q142
15741D706j165n50o166J6134K3382j4918j7539o927L407R921N329o144k0036o496
15727a7062j480n878L955q835P993R932J5133Q205K662l172k2201j5463R518K1858
15713E165o15o202j1198K829j2316N87j2658k364J3812M611O559q514L731n165
$$ y = [-2269, 6482, 2909, 2929, -338, -7429, -14396, -6116, 3734, -5320, -4572, 10823, 8777, 8559, 8159, 4467, 4492, 5627, 8550, 3920, 7857, 14392, 18518, 10385, 11862, 13965, 16558, 14992, 9814, 4349, -7045, -21855, -14351, -14408, -16511, -12336, -7820, -6340, -13343, 1087, 32, 6177, -1958, -12354, -8006, 1082, 3287, 665, -9324, -9312, -7686, -2976, 4145, 8538, 30982, 23378, 3739, -1638, -6097, -9168, -15880, -10749, -4102, 5701, 6980, 15426, 23500, 6982, -1245, -4113, 4897, 18806, 12848, 4706, 3541, 2991, -3175, 12959, 36341, 21423, 3884, -3043, 364, 10285, 15614, 9470, -10566, -17062, -18542, -24420, -20465, -29300, -21307, -11375, 3758, 11963, 14625, 11453, -10748, -26211, -16693, 5165, 4550, -1652, -12850, -10021, -22337, -21750, -34408, -36772, -22960, -18349, -11790, -20304, -16573, -21738]
15699b1738o183J1871N024K14k604R967k21o952R921K2422J810j1175j2545r065
15685i254L764Q778Q66j2479r45o917N710J677l109M701m412O345j699L213O586
15670B825k772J330J475K829Q799l549r819O127q088J046Q781K735o404l061N248
15655G502m569j2625l78M927J0787k929n781m630J8350j0206r150R423R32j4299
15641a2646n472N956J084N69N385J4143O020j6246j9788K276K4670J9781j28j6100
15627I504r191k426J0642Q568L84L244o067q335m71J2952J035j978P14j3345k632
15612B598Q093p40L71O049J724J282n614j0288k160n814K256N926R925K980k261
15597A4327j5080o180K769K580p128j0210k507R448Q937m677j0897m430J1761
$$ y = [-21738, -27921, -16050, -11026, -10812, -13416, -3449, -3670, -10622, -701, 21721, 23531, 12356, -189, -9254, -5490, 3288, 4154, -8325, -9270, -16187, -10477, -8800, -11909, -7208, -11620, -5275, -6974, -3761, 2825, 53, 1383, 2858, 5687, 14486, 10937, 1118, 7245, -843, 203, 8984, 11719, 5315, 2254, 7502, 2933, -9692, -10070, -5143, 5644, 2715, -3066, -7696, 10654, 448, -8702, 721, 1653, -12646, -18118, -12162, -11078, -10509, -5124, 9019, 15039, -1207, -20995, -18719, 5951, 25732, 25604, 9504, 313, -2113, 8529, 17097, 17481, 20725, 14658, 6323, 5852, 18804, 19839, 17861, 18575, 5230, 2598, 10691, 9951, 10322, 16371, 18095, 19377, 13763, 3475, 1315, -4499, -2243, 3683, 13608, 16588, 14327, -753, -6933, -4164, -1584, -8712, -18922, -21429, -11981, -3044, -7721, -18618, -23048, -11287]
15584a1287J3799Q432l06J563j0508j5819o76l817J155J2239K959r333L623J8986
15570A1010K898k974m708j9962j407j573J0345j895q250N283k255P991R880m386
15556cJ0657p645j112p485R191m933j3571Q426P935J9109j277R21q21q989p134
15541C269k01P188j0720m479P815M022K202j294m210L909O521o888j909J5261
15527B0486J768m796j3197n654o663K27N39O082p259j3995j013L733J5680N797
15513A735j3942j114J2595o826k128j270J203L711j376j874O42r193M525J8442
15499E130K195l959m044k1450K117J3605N785M878M806J0872j348j1790n033k901
15485a137J3889J0021j3546J0005P678R56j1251r668K580M34L187m139m842q58
$$ y = [-11287, 2512, 10944, 10638, 12201, 1693, -14126, -14802, -18619, -17464, -5225, -2266, -11599, -7976, 11010, 13908, 10934, 6226, -13736, -15143, -16716, -6371, -8266, -16516, -11233, -13488, -5497, 4383, -3, 10654, 3009, 1897, -5588, 3603, -1330, -14901, -6475, 1460, 20569, 19292, 20213, 19392, 10403, 3269, 3068, 10256, -464, -4943, 2872, 6894, 9096, 7802, 3592, 7501, 14022, 7134, 5225, 20486, 22254, 17458, 4261, -1393, -8056, -7829, -7290, -1208, -8467, -22462, -23475, -19742, -4062, 1735, -12207, -13321, -726, -7552, -9680, -10950, -9747, -6036, -7412, -9286, -8644, -17837, -13312, 5130, 7325, 3366, -678, -22128, -20011, -6406, -621, 4257, 9063, 19935, 18587, 6797, 1764, -1137, 12752, 22773, 9227, 19232, 26910, 27866, 16615, 6947, 9527, 9961, 13148, 9009, 4167, 3309]
15471C309O650M254o516L870l890j2492O35Q24L046r548O981J673m819n265l072
15456a4360k357j969Q107j705O880J0245P047k1991m871L355O837o34k414j4271
15442b2101N777J874l01o469J3167J0903n272j2529J387j514J3988J284j0055
15429i861l04K861J3585j2828J22Q825K051M337L982j1482p081r0J6335K829p537
15414E744j414m503M84j3467p993J0980J6141R297P307p084o24j0784j2671M841
15400c746J3487P805j5783m949k669O422n131j3278J132K0984J6116P048m36q433
15386A8569j784L781o467k053J890l037Q448J196j1539j0865j7423L369j677L286
15372a4306Q633o588L010N957O044Q004q687j2663J3254k418J670J076l620p805
$$ y = [3309, 9959, 14213, 7697, 11567, 7677, -4815, -4180, -3356, -310, -9858, -2877, -1204, -6023, -11288, -14360, -16717, -18686, -10579, -12284, -5404, 4841, 11888, -10103, -14974, -11619, -4782, -5416, -7830, -22101, -16324, -14450, -14751, -21220, -8053, 2850, -2422, -14951, -13564, -15078, -1090, 194, -9861, -10165, -7304, 6281, -6547, -6425, 2400, 4451, 8788, 12770, 1288, -5793, -5883, 10452, 13281, 5744, 4330, -173, 311, -13156, -21149, -10169, 5972, 15269, 22576, 15492, 14868, 4084, -8587, -3746, 9741, 17546, 1763, -3186, -5855, 567, -4564, -17842, -16710, 4274, 20390, 27438, 27002, 18569, 16785, 20566, 14099, 12046, 13936, 10899, 19347, 20543, 9004, -1861, -19284, -15915, -17592, -14306, -5673, -12261, -9251, -3294, 2750, 10754, 2067, -10596, 2658, 240, 1910, 2986, -634, -8439]
15358h439p485n620j2187K730J3898J7205J1025l281j2735k749O758K662n182
15345c400O885K137j30Q28J338J92J58J0503J3801j8286J74o043j6190j47j1154
15330a9334m026M465Q996J0023M259N471j0362r855j966J2085P942J2224j3880
15317F042k791J811Q031l65q040J7414J822j9647j4132O459J273j051J553j2211
15303a3832k750N504L4Q447o760p044R734k865r309q143l024J0673k10P733l231
15288a5043J0473o73J1620k718j8790J4123l866q761K510J6850M755k0711j1373
15275b1604R166O750J3478P553J625l398m151k926P28L815Q166O512p95k0874
15261D045j674J366q17l927m110m406M528J193n527j3797K960J3812r56j0350
$$ y = [-8439, -15924, -21544, -33731, -31001, -17103, 102, 11127, 7846, -4889, -7638, -880, 1782, -3400, 3485, 5622, 5492, 6320, 7658, 7850, 8008, 18511, 32312, 14026, 14200, 8157, -8033, -8180, -19334, -23360, -18895, -9899, 124, 4383, 9854, -508, -10363, -12329, -244, 7698, 19922, 6042, 3251, 5062, 13093, 12728, 4688, 22102, 23924, 4277, -9855, -3396, -2123, -3174, -1621, -13832, -16582, -11078, -11044, -2597, -9357, -16401, -6667, -9532, -18841, -26984, -30008, -19335, -19545, -11812, -15043, -4570, -5243, 6377, 3659, -15131, -1008, -4874, -13635, -11125, 5725, 10480, -10231, -21604, -12438, -5688, 7790, 15343, 16968, 13570, 9419, 6493, 7221, 11036, 19202, 25714, 24919, 4045, 2371, 3737, 2920, -1007, -5117, -9523, -4995, -3802, -9329, -23126, -20166, -6354, -7310, -17660]
15247a7660l64J2087M322N839l006k527j6684o22q230o200N470J0202J6429R94
15233E0j171q513o83L671J3361M690m725j45o78k526M598j0048P987J2628R493
15218B7989R259m894j6578j3057j0930j084R042k346J185J855j0791m536l580
15205a8466J9280J1884m680J1050p316q766k052P692K254l12j2576j3513K3683
15192H162J3157j8918o745R598j125j0592M549K230R433j543P117j2659l823J0255
15178I096K364m132N794q27O09j7317r187o780o311L664J1583N621Q836O462k552
15163F923j1866k310K908Q997j775o562r779P960J2386p353q868m691P119Q609
15149A698J471J466L456K145n245j2907m851R194J5076n98J0323j6304k264J0293
$$ y = [-17660, -18024, -5937, -1615, 4224, 1218, -1309, -17993, -18615, -26845, -33045, -27575, -17373, -944, 50, -1121, -9634, -10317, -6646, 6715, 11405, 6680, 6535, 5857, 3331, 7929, -2119, 5868, 18496, 27989, 37248, 32354, 15776, 2719, -8211, -9295, -253, -2599, -1414, 441, -10350, -14886, -18466, 814, 12698, 8018, 19068, 11752, 2986, 934, 8626, 10880, 10568, -2008, -15521, 8162, 21319, 2401, -4344, 5254, 4129, -6463, -1914, 316, 9749, 8206, 15323, 2664, -1159, 9096, 11460, 7328, 13122, 12295, 12904, -4413, -13600, -20380, -26691, -23027, -11444, -5823, 3013, 9475, 6923, -4943, -7253, -4345, 4652, 2877, -3685, -13464, -5504, 6882, -471, -9339, -14030, -6911, 1698, 3169, 4635, 8091, 10236, 4991, -7916, -12767, -3573, 11503, 10905, 21228, 4924, 2660, 12953]
15135A2953o982M678j700j1963p336R23j17j257O47p733O818J8180j599J0934
15121A6446O004j1644j3843o908j3386k218Q946J5343K232O293J1136l799o202
15108H400n866j729q76K752j5499O584Q088m487l051N55J253j3221m327R972Q544
15093b908L330j2437M267j853P197P794P179o673R053J424k112j7036J167O994
15079E386m720J266N666p450J2656l195q847l873j081K1796M593k093j4881k4125
15065a8902O501n893p692K091P873L642L535n686Q277Q374K274N64K540J609q892
15050B15q162J828J3046M023o737K0632L35r552q419n204j0892l193J0553P051
15036E524o543l072j1870J2483J4693P054k502j0589Q411J0021K660j0422j4475
$$ y = [12953, 5971, 10649, 8949, -3014, -10350, -9427, -9544, -10801, -10154, -17887, -11069, 7111, 5512, 16446, 22450, 10806, -3037, -9945, -23331, -25549, -16603, -1260, 972, 7265, 18401, 14602, 8400, 2534, 805, -71, 2681, -12818, -6234, 1854, -2633, -5684, -5129, -3876, -17097, -21424, -11452, -2908, 422, -12015, -7748, -9601, -2404, 5390, 12569, 5896, 14949, 16373, 14261, -2775, -1608, 5386, 666, 1932, 7598, 148, 12804, 9609, 762, -3111, -4192, 17604, 22197, 20104, 5223, -18902, -12401, -18294, -25986, -23895, -16022, -12380, -8845, -14531, -6254, 2120, 4394, 4958, 7498, 9107, 215, -7947, -6119, 6927, 10950, 4213, 24845, 25180, 15628, 7209, 2005, -8887, -12080, -1527, 5524, -1019, -4091, -15961, -3478, 11215, 18269, 15767, 5178, 13589, 23610, 26270, 15848, 1373]
15023A373j1405J2232J7375N458j5104j2439J2094O875o375R70J1813k36J204
15010B3835J132L441o987K875P508p510r245J6768P677K00J1073M703J6967K0353
14996I2790P149J5568P744K1464K7944L8368R2732J76354L36347N68161O31886
14985B016507P0188m42640m86936l98485k70027j41410r2961p8236m5513k6634
14975A03853k8810k1800j1887p612k213p252m838J758O237j3211k777J1340l075
14962A9713m296k807k709j642M12n157j2138O563o226p918J7123M465k662m584
14948a863m440J4247j338j659k447N727o467j850N679l543P995Q127L865m520
14934A7513j2636j583M117r2k265j7411k019J3479r97j346j0733p57Q586M255
$$ y = [1373, -10032, 2200, 19575, 25033, 9929, -2510, 9584, 16459, 10084, 11054, 22867, 22631, 23835, 24967, 28408, 21421, 24296, 31804, 24294, 15049, 31817, 39494, 39694, 50767, 55470, 72437, 92790, 99939, 115507, 123251, 144715, 172659, 211027, 303759, 480113, 816460, 1384621, 2016507, 2086695, 1644055, 1157119, 758634, 488607, 347197, 254236, 176000, 130487, 103853, 75043, 53243, 41356, 33744, 31531, 24279, 19441, 21199, 27436, 14225, 11448, 22788, 19713, 15417, 12610, 9901, 8259, 8671, 3514, -8624, -2061, -8287, -16205, 918, 5383, 2721, -1863, -6303, 7944, 6606, 4947, 2500, 8227, 1760, -90, 5589, 2046, 10041, 18168, 22033, 17513, 4877, 3294, 7411, 7319, 5054, -12357, -14376, -897, -1894, -3240, -13973, -14730, -6144, -1889]
14920a889p48M989M705r89k5550m298K920M688J4155N417q34M312k675J0021L498
14905A7722j2045J971O58m517M246K633l981O45L323j6907o946N383J0573k98
14891B460r924k350R897m667m507O390N42j651o845m325M864M751j5129m740J3207
14876a2027O016j156j569J0538L139j1670o69m731l451J5120O547k73J881p461
14862B34M05l101m280r922p937k466Q301p612j910J6120J0951P746r145m217j322
14847h155O38l907k422J4896p72P571J185q998j0016l033J3278K637Q272j0850
14833C24j0653n810J719N160n226R027Q362p534r259l856j14J5149J2630j577
14819H342j227k218p075Q768k072q319R592P735p241N809n379j923P395K88N566
$$ y = [-1889, -2637, 2352, 7057, 6068, -19482, -23780, -20860, -16172, -2017, 3400, 2566, 6878, 4203, 14224, 17722, 5677, 7648, 8306, 3789, 8035, 10668, 6687, 7332, 10655, -6252, -13198, -7815, 2758, 2460, -7464, -9814, 83, -4584, -9091, -2701, -2159, -3810, -10655, -14980, -10116, -5365, -20494, -25234, -12027, -6011, -7167, -8736, 1802, 4941, -6729, -7398, -12129, -15580, -460, 6087, 5814, 7695, 234, 639, -2462, -6742, -16664, -24601, -27067, -18766, -26378, -28288, -12168, -1217, 6529, -2616, -6833, -8155, -7517, -11424, -13846, 1050, 278, 7849, 9034, 36, -9980, -13013, 265, 2902, 11174, 324, -10329, -16139, -14420, -9260, -14486, -5459, 2903, -4631, -13890, -17746, -17860, -2711, 9919, 8342, 7115, 4897, -2178, 6590, 4518, -3801, 5791, 13526, 6285, 12094, 6715, 4792, 12187, 12475, 18041]
14804A8041J6506l931j4746j5635j0444k86L14K256j0145p569N376O734J1811
14791a718L338m93p337L205O084p29m72o974r249J2752K2513j252j2783n962m234
14776c311N428k492N062Q121J2565k293j6261r452k0478q206J4396J5530m50P628
14762E787N552l655L098K135o672o286k317k345o215m795M619M388J3741k470
14748D565j8931k442J1873n223r654J2988J3761P638r143m355l932n991J1605
14735B759q449j2387O050K270L666K741j81j846J0734j310k726j942K203j960
14721c78n79k24j0389O324P633P633o028P549N354m386q90K032l016n941j3552
14706h858j214P102m258K77J471J8000O503N777m559K730j3181K409k832J444
$$ y = [18041, 34547, 30616, 15870, 235, -10209, -10495, -10181, -7925, -18070, -25639, -20263, -13529, -1718, 1620, 1127, -6210, -3005, 3079, 2350, 1878, -5096, -14345, -1593, 20920, 19668, 6885, 923, -3311, 2117, -375, 4687, 12808, 25373, 23080, 6819, -2633, -23111, -31317, -16921, -1391, -1841, 5787, 11339, 7684, 10782, 12917, 6245, -41, -2358, -4703, -10918, -15713, -11094, -6706, 7035, 4565, -14366, -16808, -4935, -10158, -19812, -6824, 6937, 14575, 5432, 1077, -2855, -8846, 2759, -5690, -18077, -12027, -9757, -6091, -3350, -3531, -5377, 5357, 4047, 1321, -621, 1582, -378, -957, -1181, -11570, -5246, 2387, 10020, 3992, 11541, 16895, 12509, 11619, 13651, 10635, 4694, -8858, -10072, -2970, -7228, -6951, -5480, 12520, 19023, 24800, 20241, 22971, 9790, 12199, 9367, 10811]
14692A0811L80n051J882K766n971n157r61L750k182M193l78j5709j076k863R096
14677f470Q896J4033M850J04n864j81q587j465K773m338n435P137o5m80Q826O292
14661B0026M130j3520j9255J677O186L593n782j6201R887J6087o274K267K2022
14648B4843Q589j160j3343o516j456J2948m143j7573L274l320O72Q351O882J1459
14634B9507l947o179l712o035p848n485m977l972m725L527n75O11o490R28m723
14619b4095P986k400Q448M82k85J108R856l574j8726Q352Q509n008j7638n786
14605c2771K0741O124j013p19J0562o101j505k725l807q05K211M320j132o108
14591a2728J2318K3456m113o548k335p893r249p691Q072j547O766N186R690j476
$$ y = [10811, 11191, 6140, 8022, 10788, 4817, -340, -1301, 2449, 267, 4460, 4082, -11627, -12703, -15566, -6470, 2426, 16459, 21309, 21413, 15549, 15368, 6781, 5316, 8089, 3751, -1684, 5453, 5388, 4908, 13734, 20026, 24156, 10636, -8619, -6942, -756, 2837, -2945, -19146, -9259, 6828, 554, 2821, 24843, 33432, 32272, 18929, 12413, 10957, 23905, 19762, 2189, 5463, 2143, 2815, 11166, 18048, 29507, 25560, 19381, 15669, 9634, 1786, -3699, -8676, -12648, -17373, -13846, -14421, -13810, -20300, -19372, -24095, -16109, -18509, -10061, -9579, -9864, -8756, 1100, -2474, -21200, -12848, -4339, -9347, -26985, -32771, -12030, -5906, -6919, -7638, 2924, -3177, -4682, -7407, -11214, -12019, -9808, -5488, -6620, -12728, -410, 23046, 18933, 12385, 10050, 2157, -7092, -14783, -6711, -8258, -1492, 3694, 13384, 11908]
14577A1908k987r660j270J455m437r352K135Q810J516K385P419j3658M480L08
14563i48j1617r306J2879n33k931j2199l03P793J2847Q239k251m53O855l545p285
14548b758q181J0808o433K168K190L149m31o431K43Q863R96J0615Q378m606q11
14533A7759Q123P085r341j3632n567J4220K040n472Q133l052j4573k0003j916
14520a6196R257J1042J803J727M216k101l309m061j689J477P012N921o831m476
14506C792o360Q718k323j3045l829q581J1442J2607r77k716Q357r737j398Q17
14492c233L294p394m279J7557K963k528R82l003O411q285j3770K481k84o192o33
14477a5913J3731M690k166l721j3417m675r270J1406N135q834P924O887p242M48
$$ y = [11908, 8921, -739, -2009, -554, -4991, -14343, -12208, -3398, -1882, 503, 7922, -5736, -1256, -948, -12565, -21871, -8992, -9525, -12456, -24655, -24958, -17165, -4318, 3921, 1670, 1217, 8072, 4527, -2758, -10939, -131, -6564, -4396, -2206, 943, 512, -5919, -5676, 3187, 4183, 14798, 23176, 18570, 17759, 25882, 32967, 23626, 9994, 4427, 18647, 20687, 15215, 23348, 20296, 5723, -14280, -16196, -6939, 4103, 5906, 7633, 11849, 9748, 6439, 2378, 689, 2166, 9178, 15099, 8268, 3792, -2568, 6150, 3827, -9218, -13047, -21628, -10186, 2421, 1444, -1272, 7085, -2652, -4050, -3233, 61, -7333, -11612, 5945, 8908, 6380, 7362, 4359, 10770, 2485, -11285, -8804, -9088, -15280, -15913, -2182, 2508, 342, -3379, -16796, -21471, -30741, -19335, -14200, -23034, -15110, -8223, -15465, -15017]
14463a5017J3327K83K378p179L548J3780N623p85k649q232r967O478J2215K656
14449A6459J1286n334j4334l349Q037J1045N364j8037K207O031j4166n904j326
14436b021L115J724L832l906K532l06Q355Q221k596r910n82k435L80l147l641
14421c85R085P982n655j629o252j2366q09J6356J6041k817j0387k1467O914P950
14407B561o741N59J023p389l237l084O085J8829P82L555j0855j6801J641J4931
14393A859j333K103K337j9330P742J3560k607q245N587O166P080q436o015J805
14379B273o214k663J1214M538j0523O846o30J895o910j6072n848M333l198K278
14365a8681R936K683j3452N052P192R836k203o224J921J4805N400j6719J641n110
$$ y = [-15017, -1690, -1407, 971, -6208, -2660, 11120, 16743, 15958, 13309, 5077, -4890, 1588, 13803, 16459, 27745, 22411, 8077, 4728, 12765, 23810, 29174, 11137, 13344, 19375, 5209, -695, -2021, 1094, 2818, 6650, 2744, 5276, 4970, 13325, 21546, 18950, 9040, 8458, 6023, 6403, 3256, -385, 8700, 16682, 11027, 9398, 3146, -9220, -10029, 6327, 22368, 19551, 9164, -12303, -5389, 2561, -4180, -3621, -2598, -9987, -13224, -16308, -10223, 8606, 9388, 12943, 2088, -14713, -13072, 1859, 526, 2629, 4966, -14364, -6622, 6938, 4331, -3914, 1673, 7839, 14919, 6483, 468, 2273, -3941, -6604, 4610, 9148, -1375, 5471, 4841, 6736, -174, -16246, -22094, -17761, -20959, -18681, -8745, -6062, -19514, -14462, -7270, 2566, 363, -5861, -3940, 10865, 16265, -454, 1187, -3923]
14351c923j0707J2733J5576L667j2769j0334j0494j694p851O051m080P805J1044
14338d976J0901j555p976J825o087L319j374Q224M953l857l224Q579K501rj4792
14323c548r31R324M930n572o27n102l574M778N315l846J2477N691M43P84o446
14308A4096M19j905l761P926j515j9741m138P518L302j4133k390q287l400M492
14294b1517J3951M770k136o574N964Q236k398J0844m541p516r13L440l273p98
14280b461J1236N11j160j315n259j525m660P224n246j8422n812J8377J0164j1855
14266a0203O468R771N317L838j190J1103p837J858J5116J2916q337j4444k1011
14253C365p394o649O94Q963J2940O553J0263k444k0259L310p12r186j4359r42
$$ y = [-3923, -14630, -1897, 13679, 17346, 4577, -5757, -16251, -17945, -25796, -19745, -23825, -16020, -4976, 5925, 4370, -3606, -1781, -7868, -4549, -5923, 2301, 7254, 3397, 173, 8752, 11253, 11244, -3548, -4479, 4845, 9775, 4203, 3576, -1526, -5100, -322, 4993, 1147, 13624, 19315, 19758, 20542, 14096, 14515, 12610, 8849, 16775, 15260, -4481, -8619, -1101, 2201, -11932, -14322, -22609, -26009, -21517, -7566, -2796, -4932, -11506, -5542, 2694, 296, 11140, 6599, -917, -1830, 1610, -1663, -2461, 8775, 9286, 8126, 6811, 1552, 27, -4633, 2591, -2655, -21077, -26889, -8512, 1652, -10203, -3735, 6036, 11353, 15191, 14001, 25104, 17267, 19125, 34241, 47157, 38820, 24376, 3365, -4029, -10678, -9984, -1021, 11919, 18472, 28735, 26291, 6032, 9342, 8630, -556, -14915, -15857]
14239a5857l543K715n607J5292Q404l754o15M282P740o030J9885j329j0632p332
14225C619n159O431M165P082p156p425J715k589Q321J7259p424n200m524l596
14211E519n886j0757n577J267n61P569O837N594n225m675L918K247K0516J6729
14197C7515j3402j5367m463K954P457q01j2073m074M94Q253Q371R55K961l304
14183A5476j2350K041M003K575j8790o583J2040L356Q935j3144j3531L925L340
14170h707M039R215J361q14J2314j0342o230k256L589j7261K727N494O423k634
14156c082m12m147N945L487p664Q067N46P598r534K722R549p389o870M614J5432
14141A8862K266L991J7312K729j5296j0587k045o647j8628N179Q434M075R230
$$ y = [-15857, -19400, -16685, -22292, -7000, 1404, -2350, -2965, 1317, 9057, 3027, 22912, 21583, 10951, 3619, -1540, 4891, 9056, 16138, 8982, 1557, 3272, 683, 9004, 26263, 18839, 13639, 9115, 5519, -367, -11124, -16701, -15434, -15995, -8426, -1589, 4005, -1220, -5895, -1977, 270, 20786, 37515, 24113, 8746, 4283, 7237, 14694, 13893, 1820, -2254, -1760, 6493, 14864, 15819, 18780, 15476, 3126, 5167, 9170, 11745, -7045, -13628, -1588, 1768, 10703, -2441, -15972, -12047, -8707, -4668, 4547, 5908, 5094, 17408, 7066, 836, -1420, 2169, -15092, -12365, -6871, -448, -3082, -3494, -7641, -1696, 1791, -5873, 2194, 2740, 10338, 804, 3526, 13075, 5686, -1184, 3430, 18862, 21128, 25119, 42431, 45160, 29864, 19277, 17232, 10585, -8043, -2864, 5570, 9645, 18875]
14128A8875L51k762k829L106J162p110k867J970j1240q803o50p55j2414J4066
14114i900J2080J6074p00j1858l247n120m180M193Q707j93J6868j138r892r928
14100A766k255M794K295P680j0443o87j2110O225L366o83M869J11k939R212J7139
14085B8340l756j8264j4135n949J1319j149L328j710P15M389j475j091K390J8470
14071B1422J3200p354j7667m098j4353n48J4237M126J011J1279p410p469m029
14058B347p266J1218j932N591k639j545J056O55Q203n74j5233n893P533K137O003
14043I661M006m500L752L527K035n071q158k424N58M389J3714L598o715q378J172
14028A1166k418p233l265l5N993P178j051L875k860o225j0445N164k051r859p43
$$ y = [18875, 19226, 16464, 13635, 16741, 17903, 10793, 7926, 9896, -1344, -10147, -10797, -11552, -23966, -9900, 2180, 18254, 17554, 5696, 2449, -2671, -6851, -2658, 6049, 5856, 22724, 21586, 11694, 1766, -489, 4305, 6600, 14280, 3837, 3150, -8960, -2735, 631, -52, 4817, 4928, 1989, 11201, 28340, 24584, 6320, -7815, -13764, -2445, -3594, -266, -1976, -1261, 3128, 1653, 562, 2952, 21422, 34622, 27268, 9601, 5503, -8850, -9398, 4839, 8965, 9976, 21255, 13845, 6376, 2347, -4919, 6299, 4367, 9958, 7319, 5774, 6830, 7485, 15688, 15114, -119, -6012, 1521, 3658, 9661, 13667, 9167, 12919, 16446, 18481, 13410, 5252, 2828, 3386, 7775, 21489, 25087, 18372, 9994, 11166, 8748, 1515, -1750, -1785, 4208, 11386, 10335, 14210, 11350, 5125, -5320, -156, -2207, -12066, -12809]
14013a2809N441P557q552l674r953R803P662j364K828N766j103p013O595j466
13999b82m532K245R426l018n663l764M529Q050m719K208J962Q247O879N673m052
13984B3189j2315j087m361n897n167O072J0963O30p565N66k49p266L445L964K205
13969G127l181n884P889k782j2803m072O214j978o883J0223K561P69l886P499
13955H13M383k043J1498N299J0117p047j813j530N23o438m138n142N205j384L598
13940A1901J6151j083j3466j57J09N00j0228m294l705J331R157R390J0202m324
13926B1484J59Q391p768j1380j5643k317N159j8931o779r272p02O692Q330n443
13912b8020R294J7285J2490J2524o338n938Q315j29j6661P252j630j0356J4108
$$ y = [-12809, -7368, 189, -8363, -12037, -21990, -12187, -4525, -5889, -3061, 2705, 1602, -5411, 1184, -282, -4814, -2569, 6857, 3839, -1824, -5588, -1059, 6991, 2272, 4480, 6442, 14689, 21568, 27241, 23189, 10874, 9787, 5426, -471, -5638, 434, 11397, 12027, 4462, 5028, 4779, -2487, 958, 4922, 7127, 3946, -1938, 5951, 3169, -9634, -13706, -7492, -9470, -16353, -6130, -3569, -2800, -6686, 813, 5196, 3153, 14651, 19950, 30067, 23020, 21207, 19677, 20200, 13762, 9624, 4482, 9687, 8303, 11901, 28052, 26969, 13503, 13346, 13455, 13955, 3727, -567, -4272, -2941, 6216, 15606, 25808, 21484, 21643, 30034, 22266, 10886, -4757, -7074, -1915, -20846, -27625, -36897, -37599, -30907, -22577, -28020, -18726, -1441, 11049, 23573, 17235, 11297, 19612, 19483, 2822, 10074, 8444, -1912, 12196]
13899A2196J0886N394L475j0149P641k509j1623j0655J412J016Q703N49j1557
13886D779q247k647m320r731O038l296J3826J4387M575R0m03j587J0172P275j2891
13871A8020j5236r924P459J0597J713j3512m666L372P921O531p350o754m457O749
13857D63J5278k704q803O054J2842M953r694L027n570p246n699K69J3324N02M434
13842B1430Q282o106j3789j2699J756Q788Q474J215R43M663R959j294o538l507
13828B1577q366j234n320k730n906l968M744m69n413n073j971J2931Q952p421
13814C33q713o875p51K380L340j42N275L588J33p162r659j134M49N398O836K974
13798c730L788o511N246J9083Q507j0561j0331O608J102J0240m640j184M807n926
$$ y = [12196, 23082, 28476, 31951, 21802, 29443, 26934, 15311, 4656, 6068, 7084, 15787, 16336, 4779, -3468, -6115, -10435, -20166, -14128, -17424, -3598, 10789, 15364, 15454, 15051, 13464, 23636, 30911, 18020, 2784, -7140, 319, 10916, 12629, -883, -5549, -2177, 5744, 12275, 4925, -1829, -6286, 463, 15741, 13037, 4234, 10288, 23130, 28083, 18389, 21416, 15846, 8600, 2901, 3170, 16494, 16996, 21430, 29712, 23606, 9817, -2882, -1126, 7662, 16136, 17351, 18294, 22957, 32916, 31622, 25084, 21577, 13211, 11977, 6657, 3927, -1979, -5947, -1203, -1672, -7085, -12158, -14129, -1198, 7754, 333, -8380, -15255, -16006, -13626, -10286, -10428, -5153, -1565, -1432, -8594, -18253, -19387, -18938, -13540, -6704, -3730, 58, -6453, -1207, 17876, 26383, 15822, 5491, 12099, 13201, 23441, 18801, 17617, 22424, 16498]
13784A6498k527o747m408O938Q075q929j4746p162K359J0354r358L240L599m218
13770g032j5356p68J2604L730o21N728M490P376m072L546N903M77n953k787l288
13755C977J407m627J626j86j903P781R57k010J058j113J695J5463K424j1202o368
13740H979n335K529m410Q37J0327L743Q847M079m166p407o091l916j581Q461J390
13725A6286n84r36L354r445o12R773M79l077o695K980p298N118R072n860n756
13710F799o044J608K610k0238k036K1170J4072J5666o278m772j5482J799R734
13697A8608L597o921Q475K22J991k050l691k10Q77k356m459k57K608n769n130
13682E535l047M07L245R334Q176L118l416j0904q660n828k012Q291j4309J449
$$ y = [16498, 13971, 7224, 2816, 9754, 17829, 8900, -5846, -13008, -10649, -295, -9653, -6413, -2814, -7032, -22388, -23156, -10552, -6822, -7443, -1715, 2775, 10151, 6079, 9625, 15528, 16005, 10052, 7265, 3977, 5384, 757, 2383, 2197, 294, 8075, 9032, 7022, 8080, 6967, 8662, 24125, 26549, 15347, 8979, 3644, 6173, 1763, 2600, 12927, 16670, 25517, 29596, 25430, 18023, 11932, 8016, 6435, 14896, 16286, 15702, 14766, 18120, 8675, 8063, 17836, 18315, 15238, 8543, 11523, 4225, 9343, 18415, 12555, 6799, 755, 2363, 4973, -15265, -17301, 3869, 17941, 33607, 27329, 22557, 7075, 8874, 18608, 22205, 15284, 23759, 23981, 25972, 23922, 20231, 20021, 20898, 18542, 14083, 13826, 16434, 10665, 5535, 2488, 2895, 6140, 15474, 23650, 26768, 23352, 12448, 3788, -2040, -4052, 4239, -10070, -8621]
13668h621R856n070M248j1625o505K1889K7058j6773j7036r269J1389J2107M314
13655A5962l758o207M921J1216k453l355L97j317J894j165p001p055R503o548
13641E034m862O893J2463J0359j3700j6979q453n39k109N519O197L813P970n504
13627F102J140j206j2402L070J0650J1489O64p785p217k185o584Q150M901L68
13613I155L990J478o316q99K839o133m146m286q067m307P575J0992J3097m146
13599A0826q203M725j109o994o776n429L450N779o14P336J4044j627j0538K836
13585G706L864m268L235Kl376L399P55L123Q362N934j285j0829n751K724k203
13570A1392K720r459k101O396K550k38j2515r562K6594j0330j2026l73O002M848
$$ y = [-8621, 1235, -3835, 413, -11212, -17717, 4172, 31230, 14457, -2579, -11848, -459, 11648, 15962, 12204, 5997, 10918, 22134, 19681, 16326, 16723, 15406, 17300, 16135, 9134, 2079, 11582, 5034, 172, 7065, 19528, 29887, 16187, -792, -9245, -9784, -11893, -6374, -177, 3636, 11606, 6102, 7242, 6036, -6366, -3296, 7354, 18843, 19507, 11722, 4505, 2320, -4264, 3886, 8787, 9155, 13145, 14623, 8307, 7408, 10247, 4114, -32, -4318, -12385, -16692, -9117, 1875, 14972, 10826, 2623, 7348, 6239, -755, -7531, -12960, -9510, -3731, -4345, 2991, 17035, 15408, 4870, 7706, 11570, 7302, 10537, 10539, 7163, 10562, 11317, 14440, 22802, 28736, 27451, 16622, 10871, 13595, 11392, 14112, 4653, 2552, 8948, 11498, 11260, -1255, -10817, 15777, 5447, -6579, -6952, -950, 3898]
13556C898Q689l605j6558j505R341j462L655L917M285l694o711n820j4525o300
13542b6395Q808R719O179k392l125N376n622p441j4712k321J2433J2189q580p713
13528b3597O261K0727R982p277r044m914K0501J183p914N805P055M212J1392l448
13514C0924l163j3227J779k053m185k052K793L601J0513L07o306m969K43p162
13500G043J131k586N158J2847j2598j2050P628j030K114O93P166j583j734J1162
13486B3361n696q369l759l934O559J6794Q029r150r486j029p345q604o854J3467
13472C984J4074j371N249O971M160r568p412k077j7046J0721J2935j929J46O436
13458B5273j730n791o735k752m276o768q191L354j993Q153O470K139N962l755
$$ y = [3898, 12587, 8982, -7576, -9081, 260, -1202, 2453, 6370, 10655, 6961, 250, -5570, -20095, -26395, -17587, -7868, -1689, -4081, -7206, -1830, -7452, -14893, -29605, -31926, -19493, -7304, -15884, -23597, -17336, 3391, 13373, 6096, -2948, -7862, 12639, 13822, 5908, 11713, 18768, 22980, 34372, 30924, 27761, 14534, 16313, 14260, 10075, 8023, 10816, 14417, 24930, 25237, 18931, 13962, 14205, 7043, 8174, 5588, 10746, 23593, 10995, -1055, 6573, 5543, 7657, 8350, 15516, 13933, 12199, 23361, 17665, 9296, 5537, 1603, 8162, 24956, 32985, 23835, 14349, 13320, 5975, -2629, -9483, 3984, 18058, 16687, 21936, 28907, 33067, 23499, 16087, 14010, -3036, 7685, 20620, 18691, 18837, 25273, 23543, 17752, 11017, 8265, 3989, -2779, -10970, -7616, -9609, -1456, 5014, 7153, 13115, 9360]
13444I360o962k689R73j0344J249P722M079O412J3258M740n728n176q19j830n302
13429H943R84M448n848l410K804P08k390N716N927J14J2908P49k206o868j3084
13414I495o487O911K293l000n918Q40J2846j469J537o513R365R105O377l166p771
13399B4445L495Q546j0023J1032J7575q996k5639L798n405j5307M724k273j680
13386D292K3032J4098L339p502r010N468j598q477o417j1216J206M511N596J1272
13372B8594O858l788j326o06j566j1592p092q62P266j0481L13J1940L958N318
13358B6934o748l973R489k173P416n172l808q09M700J91k551m481l196j0807k979
13343B033J6667M892m712l344k441M945M882L087j2596q709r877R999L969k969
$$ y = [9360, 2398, -291, 682, -9662, -8413, -691, 3388, 9800, 23058, 27798, 22070, 16894, 16075, 14245, 8943, 9927, 14375, 8527, 5117, 7921, 8629, 6239, 11955, 17882, 17996, 30904, 31653, 29447, 22579, 9495, 3008, 9919, 12212, 9212, 3294, 4134, 16980, 15511, 17048, 10535, 19900, 29005, 35382, 32216, 24445, 27940, 36486, 26463, 37495, 55070, 46074, 20435, 24233, 18828, 3521, 8245, 5972, 4292, 27324, 41422, 44761, 37259, 28249, 33717, 32119, 23642, 17225, 6009, 7215, 11726, 17322, 28594, 35452, 31664, 30338, 29732, 28166, 16574, 9482, 8620, 15886, 5405, 5718, 17658, 21616, 26934, 20186, 16213, 25702, 23529, 30945, 25773, 21965, 21156, 25856, 26047, 23496, 19015, 15819, 5012, 2033, 18700, 23592, 18880, 15536, 13095, 18040, 22922, 26009, 13413, 4704, -5173, 4826, 8795, 5826]
13329E826o478L013J5457l737j8705j502L058O340N350J3405o289k4426j7863
13316b6551Q096J3356L643m07k059q61M977Q823l127J200J308J989P152l648Q53
13301A4744N850K056N921K842J2306n270m496m389p413p651j421Q23Q032J1874
13287C3808r85m522j7438J240R633P022N019n562l504j0112l102j231q48J3659
13273B3077K460p515M359n272r718j5132N832J2552J864J0415R334m552p888n830
13259A3986J0416J8521j0547j5850K787K126R651r214j1035p946Q926O334L442
13246B1597o211p670J227K659M006n556n694R789J8519L679k106p016j2369n68
13232A4286Q280P42l383r54N790J0322J905r012k563n42K580J463m518o020l507
$$ y = [5826, -652, 2361, 17818, 14081, -4624, -6126, -3068, 3272, 8622, 22027, 15738, -8688, -26551, -18455, -5099, -1456, -1863, -3922, -4783, 194, 9017, 5890, 7090, 8398, 10387, 17539, 13891, 14744, 20594, 22650, 28571, 31413, 43719, 38449, 33953, 29564, 22151, 14500, 13079, 13902, 21934, 33808, 32823, 28301, 10863, 12103, 21736, 28758, 33777, 28215, 24711, 14599, 11497, 10266, 9418, 23077, 25537, 18022, 22381, 17109, 7391, -7741, -1909, 10643, 12507, 22922, 32256, 27704, 19816, 13986, 24402, 42923, 32376, 16526, 19313, 21439, 31090, 21876, 10841, 2895, 11821, 18155, 21597, 15386, 7716, 8943, 11602, 15608, 10052, 4358, 14147, 32666, 36345, 34239, 27223, 14854, 14286, 22566, 23308, 19925, 18971, 24761, 35083, 36988, 27976, 25413, 24871, 27451, 28914, 24396, 18376, 14869]
13217A4869O604m147R574K256j0720m181k137P836j298m31J351L91p018p117J641
13202G473n886o841n113J0612J0230J2483L128J194k900q378k125K672J941M620
13188B3110L408N65o751L450N433r873j8629m74J4892M024o848N285Q028m22J010
13173B6208q37j3078q71L172j0914R400N282k103K156k576L25l30j106l499J6117
13158B7346J4235l465j1565m349K614J5392J650j0918l899r659n019L732Q182
13145B4277R845P587J2579k070n627j0517k979m526Q537J6781l319k1589j0836
13132A8143k059R399R974O92l958j2305M591O393Q421k224J0087O458k623o369
13118D4620p777J546j1356k168J1649n02m736K58J1944J3736j275n712j992j4229
$$ y = [14869, 21473, 17326, 26900, 29156, 18436, 14255, 12118, 19954, 18656, 18225, 19576, 19967, 12949, 5832, 7473, 1587, -5254, -10367, 245, 10475, 22958, 26086, 27280, 24380, 16002, 13877, 16549, 18490, 23110, 26518, 27083, 20332, 23782, 29215, 19342, 713, 239, 15131, 19155, 12307, 17592, 25620, 25198, 26208, 25371, 12293, 11422, 14594, 3680, 13080, 18362, 16259, 18415, 15839, 16164, 15834, 14728, 11229, 27346, 41581, 38116, 26551, 22202, 24816, 40208, 41858, 30940, 27041, 17382, 12363, 16095, 24277, 34122, 41709, 54288, 52218, 46591, 36074, 33095, 28569, 37106, 53887, 50568, 28979, 18143, 16084, 25483, 35457, 36149, 32191, 19886, 24477, 30870, 39291, 37067, 47154, 53612, 50989, 44620, 36843, 38389, 27033, 24865, 36514, 36012, 31276, 31534, 43478, 57214, 55939, 50227, 48235, 34006]
13104C4006N437P064K2501J6792J5682J0074J083l098J022N521K3075L4024K5507
13091A98690J8405L7116N2131P7442J47343K65980M53792N59716L98334k460l54182
13080A852307m58066m09610k87847j87988j26986q8357n5017l1494l3477k9910
13070A43555j9573j274j9339n148j2158k4007j0590J3453J0969j3791k471R449
13058F9075J0546q643j3551j1263l397M220P563o700p200j1268q739R71k153J55
13044A9616J8258K2783J5486r989j8469l526m60o677j2994O397O246R966M827
13031E1464n557j0758Q472J306j4767m296L241J506P124l56n38j410j382Q30l887
13016C0992Q037K1996q81o104Q72N875J687j2140j1265j2967O758l320J4981K892
$$ y = [34006, 39443, 46507, 69008, 85800, 101482, 111556, 112639, 109541, 110563, 116084, 139159, 173183, 198690, 217095, 254211, 306342, 383784, 531127, 797107, 1250899, 1810615, 2208949, 2206489, 1852307, 1394241, 984631, 696784, 508796, 381810, 293453, 238436, 206942, 173465, 143555, 123982, 122708, 103369, 98221, 86063, 62056, 51466, 64919, 75888, 62097, 59626, 69075, 79621, 70978, 57427, 46164, 42767, 46987, 54550, 47850, 40650, 29382, 20643, 21614, 19461, 19616, 37874, 60657, 76143, 66154, 47685, 44159, 43699, 37022, 24028, 30425, 36671, 46637, 51464, 45907, 35149, 43621, 44927, 30160, 25864, 29105, 30611, 37735, 37379, 36841, 35431, 34049, 34879, 30992, 39029, 61025, 60144, 54040, 54912, 60787, 62474, 50334, 39069, 26102, 32860, 29540, 44521, 47413]
13002D7413P399k552k761L395K05m60q783O997o352o752j8953j5465N986J2420
12988B1737J2999j440L0J3039M715o200J6P124p106n277M714j383p384R897J698
12973D7179o26O581K371k763J1511q14j3122j4587p351m141j0845j269J0769O838
12959B9731M01P902J690k855J4685O112n163m25j3019k1633n867J5223J3964J3992
12945E4738J3910J3824P07K41n495m361j921j3734j7322q084p6J2926M743J1977
12931F2073K430l420J323j4896o708n888N715j1131n932J3993J6749j220k631
12918E0457P403j1936o454n917o009P851m126N97K066R1n017Q029J957m561q52
12903C3579Q254l209r178O460J9406J2326J2332K4119K3539L0672N0134L0321
$$ y = [47413, 54812, 52260, 49499, 52894, 53099, 52639, 43856, 50853, 44501, 37749, 18796, 3331, 9317, 21737, 34736, 33296, 33326, 46365, 51080, 44880, 44896, 52020, 44914, 39637, 44351, 42968, 35584, 45481, 47179, 46553, 53134, 55505, 52742, 64253, 63439, 50317, 35730, 28379, 24238, 13393, 12124, 22893, 29731, 30132, 38034, 39724, 36869, 51554, 57666, 52503, 52078, 39059, 17426, 11559, 26782, 40746, 54738, 68648, 82472, 83179, 83420, 77925, 73564, 71643, 57909, 40587, 32503, 32427, 45353, 50096, 62073, 64503, 61083, 62406, 47510, 40802, 34914, 40629, 29498, 23566, 37559, 54308, 53088, 50457, 57860, 45924, 39470, 33553, 27544, 35395, 31269, 31866, 33932, 34023, 29006, 37035, 38992, 34431, 33579, 41833, 38624, 29446, 35906, 55312, 67638, 79970, 104089, 127628, 158300, 208434, 238755]
12891B38755N504r345k9190m0843k3377k3976r714j1474k8323j77k098j5343j5331
12878C5068j1816Q76l241P59J2401J2946M196j1147j9735J115P702N665P780K125
12864D4694o750l870k340j5714M887k476n273j723O063J229J133J790Q874Q832
12850C9356p632J905j4608j2930m083J891o941j7573j7567k392K9766J6952p05
12837E439J90j0227l780j2863n86J7961Q4761J79227K62015K28126R1976m1661
12825H00578q6478r3882j03942q7839n3307l7653k5054k9819j9013K880j608j4373
12813B50490q67k374j0678r887J779o495K7M211j8353j5545j5102k9574k8216
12800A19416j9983j816k796j7725j6253o416K3957M5759M2901M2604K6150Q419
$$ y = [238755, 244259, 234914, 205724, 164881, 141504, 117528, 107814, 96340, 68017, 67840, 65742, 50399, 35068, 23252, 24128, 20887, 21646, 34047, 46993, 51189, 40042, 20307, 21422, 29124, 34789, 42569, 44694, 37944, 34074, 31734, 16020, 20907, 18431, 13158, 11435, 17498, 18727, 19860, 21650, 30524, 39356, 31724, 33629, 19021, 6091, 2008, 3899, -3042, -20615, -38182, -40574, -10808, 6144, 5439, 5629, -4598, -8378, -21241, -21827, -3866, 80895, 260122, 522137, 750263, 842239, 800578, 714100, 620218, 516276, 428437, 375130, 337477, 312423, 282604, 263591, 266471, 264863, 250490, 249623, 247249, 236571, 226684, 228463, 221968, 221995, 226206, 207853, 192308, 177206, 147632, 119416, 99433, 97617, 94821, 77096, 60843, 54427, 78384, 124143, 167044, 209648, 235798, 244217]
12788B44217j6308k5738k9189j0852q240o521J6526K8236K9064J9341K2333J0087
12776B72956Q629Q099J0425J0979k995k504J0036K7430O0088Q0631J10164J16776
12764G10714O2301O848o7244r4212q5313o2264m8802k3062k5438M461n382j4628
12752C57979k549o955P11J6472J3142J8797K8176L0584M7617R6034J65011K00932
12740I65951R0332p8716j49324j64101j47920r0903m6125l0576q882n395n835
12729C28506N527K2299J0139P733r662o930J3338J9386J7121J6483L0209Q771
12717D62920K5663K4005p76j3250j0339J1411P380K706L126L621J0858L1566L0430
12704E89321M2743L2155L1821L2214K6468k1j0355J1403J6448J9072M366K8147
$$ y = [244217, 227909, 202171, 172982, 162130, 153890, 147369, 163895, 192131, 221195, 240536, 262869, 272956, 281585, 289684, 300109, 311088, 308093, 305589, 315625, 343055, 403143, 483774, 593938, 710714, 773015, 779863, 712619, 618407, 533094, 470830, 422028, 398966, 373528, 377989, 372607, 357979, 355430, 348475, 349186, 365658, 378800, 397597, 425773, 456357, 503974, 600008, 765019, 965951, 1056283, 977567, 828243, 664142, 516222, 425319, 379194, 348618, 339736, 334341, 328506, 334033, 356332, 366471, 374204, 364542, 357612, 370950, 390336, 407457, 423940, 454149, 462920, 488583, 512588, 511812, 498562, 488223, 499634, 507014, 509720, 512846, 516467, 527325, 558891, 589321, 632064, 664219, 696040, 728254, 754722, 754701, 744346, 755749, 772197, 791269, 795635, 823782]
12692H23782M0799J2680L5541L2437K4255M2099M3988L4080K9555M2573M8281
12681A210070N5433P6550P3608P8612R6955R1555P8166P0389Q1632Q0674J11073
12670B104717J56243J83293K23330K46148K68338K83598K84815L16402L57561
12661D424445M25847N18018O22713P31324Q46919J008093J260040J596769J985642
12652A3419810K342872K607596K864400L212158L605166L882537M333573N806880
12644D2074992Q951173J4746193K5790469M6268912P7374790J02411017Q2669922
12637D00287468J0971851n8778686q4828962p7505642n8197899l8930125k4917490
12630F8100515j6376543j1348804q285163o384795n029391l964449l077465k350544
$$ y = [823782, 864581, 877261, 912802, 945239, 969494, 1011593, 1055581, 1089661, 1119216, 1161789, 1210070, 1265503, 1342053, 1415661, 1494273, 1591228, 1682783, 1760949, 1831338, 1912970, 1993644, 2104717, 2260960, 2444253, 2667583, 2913731, 3182069, 3465667, 3750482, 4066884, 4424445, 4850292, 5368310, 5991023, 6722347, 7569266, 8577359, 9837399, 11434168, 13419810, 15762682, 18370278, 21234678, 24446836, 28052002, 31934539, 36268112, 42074992, 51026165, 65772358, 91562827, 137831739, 215206529, 317617546, 400287468, 411259319, 352480633, 267651671, 190146029, 131948130, 93018005, 68100515, 51723972, 40375168, 32090005, 25705210, 20675819, 16711370, 13633905, 11283361]
12622A1283361j815111j415107j128346r02095p20861n48588m39865l81349l44511
12613C587528l09269k86304k52181k17520j86563j45728j24429r0772q6787r0098
12603A797877p9167q8019p9038p6420l2420j5455j5666p1203j03386r8545j03264
12592A035294q6407p4797o1443m1815l9407l6925l6392l2336k5951l2395k8448
12581E38978k3432l491l995m1856l7354l0956k5331j3022j583J1272R189R484
12569C87903m463q325j1999P913K1423j0041j0005j3601j0568n013j1581J5028
12557C46671M0857Q6957J34280J61725J32266O2399m7685j25290j26262j11978
12547E53940q8567m2757q212n514n746j7209l1150l1360k0347j8586j5361j0176
$$ y = [11283361, 9468250, 8053143, 6924797, 6022702, 5301841, 4753253, 4313388, 3932039, 3587528, 3278259, 2991955, 2739774, 2522254, 2335691, 2189963, 2065534, 1974762, 1887975, 1797877, 1718710, 1630691, 1551653, 1475233, 1442813, 1427358, 1411692, 1340489, 1237103, 1138558, 1035294, 948887, 874090, 812647, 770832, 731425, 694500, 658108, 625772, 599821, 567426, 538978, 515546, 512055, 508060, 466204, 428850, 397894, 372563, 359541, 357958, 369230, 378419, 387903, 383440, 375115, 363116, 371029, 392452, 382411, 372406, 358805, 348237, 343224, 331643, 346671, 387528, 474485, 608765, 770490, 902756, 965155, 917470, 792180, 665918, 553940, 465373, 422616, 414404, 408890, 403144, 385935, 354785, 323425, 303078, 284492, 269131, 258955]
12535B58955k1586j8756p154O301K215q99J7045J0979n553r854j9318k5700j3599
12522A73076j2517j2831j5401l675j1608n311N857j0349k5552k7430J4017K4751
12510I3027J0836n729n354M64m794O97J967o10j2291j1561n796o526p726j8006
12496B8598p656K222J6905J8132J9097J3146k1124j3456l1130l4630j7304L871
12484b3329Q166L6488M2407K8670R256J0307M705J902l792r690k7067l6878m3777
12471b632l3883k4260P764R008J4354j589j3421j2230j1058j6715j8651k746O121
12458i9938l008k2987j7348j6103k5663l6884o9794r5785j12813j36334q5623
12447g22280N1329J81680K33171J76484J21207N7683R498J900q395q923p783J4155
$$ y = [258955, 237369, 218613, 211459, 217760, 219975, 219076, 236121, 247100, 241547, 231693, 212375, 186675, 173076, 160559, 147728, 132327, 128652, 117044, 111733, 117590, 107241, 81689, 54259, 68276, 93027, 103863, 98134, 92780, 93244, 88450, 89147, 91114, 90504, 78213, 66652, 60856, 54330, 46604, 28598, 20942, 23164, 40069, 58201, 77298, 90444, 69320, 55864, 24734, -9896, -27200, -23329, -15163, 21325, 63732, 92402, 101658, 111965, 116670, 118572, 114780, 105090, 78023, 41145, -2632, -36515, -60775, -53011, -44003, -29649, -31238, -44659, -56889, -67947, -84662, -103313, -106059, -99938, -102946, -125933, -143281, -159384, -185047, -221931, -291725, -387510, -500323, -636657, -722280, -670951, -489271, -256100, -79616, 41591, 99274, 108772, 110672, 102277, 93354, 85571, 99726]
12435I9726K4752J3299n253q194n639M67k125j4676r380p043l108q141J4217J0671
12421I9573p314L513j2852K92m797j0060R079P010j1067l330p26j3862q741K057
12407D8775N400p150o492Q883j614M530N68J1007p35q613P077j780M760k228R351
12392G1739N8O367j7353q376J092O082J1410R934m106m416r68l444K628q545r364
12377E2738j6610k16j325N316J1052M197K349j999m189m292j3345O548K824J761
12363D4809j3765j5284J0665J1015L846L738K98r30O16L587j4507j03J892j0964
12349B4913P256K592j1296j2315n055m031J63K919M541n907m592M536j1370p42
12335h388q172R674J2807k670j598p988L165N554K0570Q769K307j0521j1871n80
$$ y = [99726, 124478, 137777, 132524, 124330, 118691, 119158, 117033, 102357, 92977, 85934, 82826, 74685, 88902, 99573, 92259, 95772, 82920, 83212, 78415, 68355, 77434, 84444, 73377, 70047, 69321, 55459, 46718, 48775, 54175, 47025, 40533, 49416, 47802, 52332, 52900, 63907, 63172, 54559, 61636, 59856, 64616, 62388, 71739, 71797, 78164, 60811, 52435, 53527, 59609, 71019, 80953, 76847, 72431, 71463, 68019, 70647, 62102, 52738, 36128, 35912, 34587, 39903, 50955, 55152, 57501, 55502, 51313, 47021, 33676, 40224, 43048, 44809, 31044, 15760, 26425, 37440, 41286, 45024, 45322, 44392, 45008, 48595, 34088, 33985, 35877, 24913, 32169, 34761, 23465, 11150, 6095, 2064, 2227, 5146, 9687, 3780, -812, 3724, -7646, -8388, -16560, -6886, 5921, 3251, 1653, -6335, -3170, 2384, 22954, 31723, 34030, 23509, 11638, 11058]
12321A1058J0622l861q272O68K372O677J6766J8049n236K0435L641o410j5095
12308E1414j1851j9014j4645n444q580J0538N455R23K0416o807j9912k674J192
12295A011o215k140k156M790J4365J5545R290p936J82P257j4851Q574q534q225
12281A0957M197k973l145q720j3736O09O611J5527O43j1135l550j1576O078L280
12267f933j7236O087J1006L334k274m640m043n913o953J4967J4914n125Q133q5
12253E239j046n644o078P073L779L988n376j788J9521R440q41J294l937k054j6898
12238F672j1075J1091J1320L162m144j801K504R204k399P02q641j3256j901O457
12224G895J911o875k542n361p006j8494m453J1798J7712J2820M666J6552K2050
$$ y = [11058, 21680, 17819, 9547, 10215, 12587, 19264, 36030, 54079, 48843, 69278, 72919, 66509, 51414, 39563, 20549, 5904, 460, -8120, 2418, 7873, 8796, 29212, 22405, 2493, -181, 1011, -5204, -7344, -9500, -4710, 9655, 25200, 34490, 26554, 26736, 33993, 19142, 27716, 19182, 10957, 15154, 12181, 9036, 316, -13420, -12811, -6200, 9327, 9970, -1165, -4715, -16291, -10213, -6933, -24169, -18082, -7076, -3742, -6016, -10656, -14699, -20612, -27565, -12598, 2316, -2809, 5324, 5239, 4193, -1451, -7529, -456, 3323, 7311, 1935, 147, 19668, 29108, 28267, 29561, 25624, 23570, 6672, -4403, 6688, 18008, 21170, 17026, 15225, 17729, 26933, 24534, 25236, 16595, 3339, 1438, 7895, 9806, 2931, 389, -4972, -11978, -30472, -34925, -23127, -5415, 7405, 12071, 28623, 50673]
12211E0673l510j2435k469K296o321j0915n752P307J2252P683J0378J9204K5024
12198I3415K9081K3116J9419J5412R291L2484M5057O4157J23427K04759L40360
12187I99978N06490N11514K03254k21837m40029m40897l57956k34209j46281r3499
12177B86528n8106l2968m2541l0556j9876j7390j1448j2404k1523q73k739j2493
12165B3611j1816J1471K0575M34m396j0339j0774O110O569k062n996L541J684
12152B8612L108n546l015N325O758L916J298p297j0126j318L827o584j60l194
12138A5604n260n854j1388J3700L0484M00N484L5488K9100o074k5978k6303j1208
12125C8195Q09J3718m117j7810j9248r648O678K02j7131k823J0399J0263J5106
$$ y = [50673, 47163, 34728, 32259, 34555, 28234, 17319, 11567, 18874, 31126, 38809, 49187, 68391, 93415, 122496, 145612, 165031, 180443, 189734, 222218, 267275, 331432, 454859, 659618, 999978, 1506468, 2017982, 2221236, 1999399, 1559370, 1118473, 760517, 526308, 380027, 286528, 228422, 195454, 152913, 122357, 102481, 85091, 73643, 61239, 39716, 38843, 36104, 23611, 11795, 23266, 43841, 44275, 39879, 29540, 18766, 24876, 31445, 29383, 23387, 26928, 28612, 31720, 26174, 23159, 28484, 35242, 39158, 40456, 33159, 23033, 21715, 25542, 18958, 18798, 15604, 10344, 4490, -6898, 6802, 37286, 37686, 43170, 78658, 107758, 101684, 75706, 49403, 38195, 39004, 52722, 48605, 30795, 11547, 1899, 8577, 8779, -8352, -11175, -776, 9487, 24593]
12112B4593j73p827n053o814j2436J1138J4003n156j5406r442k256R051m529n174
12098a5481L437p16N543J3777k984r587n42J4444J64r134l102J1013P766l406
12084A1192L226j3389k078Q466m693l765j7892K40J0879R015J6380o61q931q17
12070G172l449N172J66o908j3902K671n513j448J1381R386J0088j5490P16N115
12056E157n942j915P976P906m881o641K814r317m168r491R935J3305L061m038
12042C761j2375o529J0985J6667K162m731l722l61R505k055j4105j0079L124P4
12028g679j3489m747J1586P193P813R33L696o914m064M237K936l339k144m907
12014h889j9110r194K0771J2139K286j0599l97o266n034K101M218O342J36r262
$$ y = [24593, 24420, 16593, 11540, 4726, -7710, 3428, 17431, 12275, -3131, -12573, -14829, -5778, -10307, -15481, -12044, -12760, -7217, 6560, 3576, -6011, -6553, 7891, 8055, -1079, -4181, 6832, 14598, 11192, 14418, 1029, -1049, 7417, 2724, -1041, -18933, -18693, -7814, 1201, 17581, 16920, 7989, 7172, 3723, 8895, 9061, 2153, -11749, -9078, -14591, -16039, -4658, 4728, 14816, -674, 42, 5157, -785, -2700, 5276, 13182, 8301, 1660, 4474, -4843, -9011, -18502, -8567, 4738, 7799, 3761, -8614, -15143, -4158, 12509, 14671, 9940, 6218, 5857, 15362, 13307, -798, -10877, -7753, -7679, -21168, -25915, -14329, -7136, 677, 1610, 5306, -1608, -5672, -1435, 1501, -1838, -3982, -8889, -27999, -37193, -16422, -4283, -1997, -12596, -12993, -19259, -24293, -22192, -17974, -11632, -11496, -20758]
12000b0758J127J6856J3290j6034l877O439L3P13K067N582Q165lj796o408j0453
11985e057K3638Q05o821r412K885p193R765K04m922P22k670J312J553p394k835
11970e420M093K220P42n107k077q627P470K01P416N682m157o962k15P786p146
11955d101j3343J1651J2597j478j4979j0980K868M262J1255O099M314n86J0364
11942A7943P193M0j0017j3604K975M398n027j571J01j0252K875j751n529j0853
11928b3079Q126Q797m296n059P121O497r396p310m341J0109O009J225k850L842
11914d605l896L61R423J0100k849j3424j4019j4047Q266L600k313J5663O932j1386
11900a2194q485K902j736J193J2560J2786K959Q857j526R29j0540j7312r5k433
$$ y = [-20758, -19631, -2775, 10515, -5519, -9396, -2957, -2924, -2211, -144, 5438, 13603, 13600, 11804, 5396, -5057, 18581, 19386, 12565, 3153, 6038, -1155, 8610, 8814, 3892, 4614, 1944, 3256, 4809, -2585, -5420, -1327, 893, 1635, -3472, -5549, -14176, -6706, -6505, 911, 6593, 2436, -4526, -4741, 3045, -4101, -17444, -5793, 6804, 5326, -9653, -20633, -17765, -13503, -2248, 3851, 8165, 7579, 17943, 25136, 25176, 15159, 1555, 4530, 8928, 3901, 2330, 2431, -7821, -4946, -6697, -12226, -23079, -14953, -6156, -10452, -15511, -8390, -1893, -11289, -18599, -22940, -12831, -6822, -5597, -8447, -4605, -8501, -8140, 1283, 11383, 8534, -4890, -18909, -32956, -24690, -21090, -23403, -7740, -808, -12194, -20679, -17777, -19513, -18320, -5760, 7026, 9985, 18842, 17316, 18245, 7705, -9607, -9702, -12135]
11886a2135J2042m247l8J754p719l174L820L304m233L913P776o354O178J8416
11872A9303M326l372j9401N338q985j2574l518P377J6489L564l805n235J4335
11859A3842J1113P69N047k223k0218j3376r256M766N18k50J0160J3033n988k119
11845E818p602m118L908J2758P320j6311n577k890l969J3021J1933n226j4422
11832e357p496L411k839P353J7069J8078n664k5726j2020J2334J5014L023n302
11819A1878J138l033o318K191O651q178o651p132N501k309L391J3168J482n379
11805F400l069P072r411J197J949L125J161K339K500M5r413p886J3029J7548O150
11790C2736j0175n096j0972q582O915N831K85o077K463M535n773j903L440L996
$$ y = [-12135, -93, -4340, -4378, -2624, -10343, -13517, -9697, -6393, -10626, -6713, 1063, -5291, 887, 19303, 23629, 20257, 856, 6194, -2791, -15365, -18883, -11506, 4983, 8547, 4742, -493, 13842, 24955, 25724, 30771, 28548, 8330, -5046, -14302, -9536, -9018, -9268, 892, 13925, 7937, 5818, -1784, -5902, -1994, 10764, 18084, 1773, -3804, -6694, -10663, 2358, 14291, 9065, -5357, -12853, -9442, -12281, -4928, 12141, 30219, 24555, -1171, -13191, -857, 14157, 17180, 11878, 13016, 9983, 3665, 5856, 12507, 4329, -2322, -9454, -3953, -6262, -2871, 10297, 11779, 6400, 3331, 10403, 992, 2189, 4138, 7263, 8424, 10763, 13263, 13308, 3895, -3991, 9038, 26586, 32736, 22561, 17465, 6493, -2089, 4826, 10657, 10942, 4865, 7328, 11863, 6090, 4187, 7627, 11623]
11776A1623j3663n263K887J1642N041M791R292m075m022k938K721j9263r394j147
11762a1768m77J1545J105M617P866K781n179n896j813J308m053J5056P738n227
11748A7603o244j1944n547J7354J7473o23j6766j1937r375L978N175M648L864
11735G659L42q064Q593N935j4305J836r22K134J8905L504j5964j3669R047j179
11721C852K162P257n226o290J3548Q269L710m01j0564q877l689j1817L854j49
11707d361j796j00l38l286J0817Q672J1653J032p885p933J236j0204q339K285
11693h547Q401j972O401l9L366J2444k080M0R791j2502k1873k863J9437m755J602
11678F851m923p583j902M673P947n2m679P744k349k437R651J138L704o688j297
$$ y = [11623, -2040, -7303, -4416, 7226, 12267, 17058, 26350, 22275, 18253, 15315, 18036, -1227, -10621, -11768, -12245, -700, 405, 5022, 12888, 15669, 10490, 4594, 2781, 4089, 36, 15092, 22830, 17603, 11359, -585, -6132, 11222, 28695, 28072, 11306, -631, -10006, -6028, -853, 3795, 7659, 8001, -63, 8530, 14465, 160, 1996, 1074, 3208, 22113, 25617, 9653, -4016, 5031, 3852, 6014, 13271, 8045, 1755, 15303, 23572, 27282, 26881, 16317, 7440, 3751, -8066, -4212, -4361, -6157, -6257, -6595, -9881, 936, 9608, 21261, 22293, 14408, 6475, 7711, -2493, -10832, -8547, -146, -2118, 4283, 4244, 7610, 20054, 17974, 18014, 27805, 15303, -6570, -9433, 10004, 5249, 6851, 1928, -5655, -7557, -2884, 5063, 5011, 332, 8076, 5727, 3290, 12941, 14079, 17783, 11095, 9798]
11663I798Q114Q919j258P52N361K037Q906j0998j1332o539L977K413P050J784
11649B8984j2216l614O246P169n288l755N827J6379j0799j2160r050M573J182
11636A3478m301n773K215k363J0566O988k555j489j431k2067q249l479J2372J104
11622d984J4108p165m49k461j460J2838K1326J1153j2451m751q435k439j2130
11609B700k485M372p069q139R046J3142J0584M416K87L772r675O24Q082P176P806
11594D4639o482j3246r8L079l847n638j939l103p900N95J4554L820m933Q40J1804
11579C2145o729l651q457p280P084r810k977J4917J1184q236l603o748P029j577
11565A3291n373j0116k468R225j1917m281J867l949O824j3582J01N126k486r91
$$ y = [9798, 17912, 26831, 25573, 26325, 31686, 33723, 42629, 31631, 20299, 13760, 17737, 20150, 27200, 28984, 16768, 13154, 19400, 26569, 21281, 17526, 23353, 39732, 28933, 16773, 7723, 12296, 13478, 9177, 3404, 5619, 3256, 13822, 20810, 18255, 16766, 15335, -6732, -14981, -18460, -6088, -4984, 9124, 1959, 1510, -951, -2411, 10427, 31753, 42906, 30455, 25704, 17269, 14830, 2700, 215, 4587, -2482, -10621, -1575, 11567, 22151, 26567, 26854, 30626, 20951, 21575, 29657, 36833, 44639, 38157, 24911, 24813, 27892, 24045, 18407, 16468, 13365, 5465, 6060, 20614, 24434, 19501, 20341, 32145, 25416, 21765, 13308, 6028, 13112, 3302, 325, 15242, 26426, 18190, 14587, 7839, 14868, 13291, 7918, -2198, -4666, 4559, -7358, -11639, -9772, -13721, -6897, -20479, -20378, -15252, -17738, -18729]
11551a8729Q640J4102M491P162O38k469P00M265m462k4337p647J1522k464J1499
11537B911J4298O830o579m812j646j1067j690J3281O791n166K274J17o032n483
11523D027K186J0134j3024o478J220M968N195J7531N699n375J686M60j0388o086
11509A1755R651j0982k1419o788N333R235K3129J1560r328r24o616J2984K97K546
11495C0433O117P30j6474j2239L076O537l569p3p258L708J3958R497j157q521
11481B4765j6718o661j256q158N858j3567k708J5629N820J531j1311o143L52N954
11467f613J0616Q334M509Q898j7366o431K204J584j1271N248R36k703k124m626
11453h805o04n055j0569N773J3861J362M476R73Q323M371k1270o942N471j1295
$$ y = [-18729, -10089, 4013, 8504, 15666, 16304, 13835, 14535, 18800, 14338, -9999, -17646, -6124, -8588, 2911, 17209, 24039, 17460, 12648, 11002, -65, -1755, 11526, 18317, 13151, 15425, 15542, 9510, 4027, 6213, 16347, 3323, -3155, -1935, 3033, 8228, 25759, 31458, 26083, 27769, 28229, 17841, 11755, 21406, 10424, -10995, -17783, -12450, -3215, 19914, 31474, 22146, 21222, 14606, 27590, 27887, 30433, 36550, 37280, 20806, 8567, 11643, 18180, 14611, 14538, 7280, 10988, 24946, 34443, 33286, 24765, 8047, 1386, 130, -8028, -2170, -15737, -18445, -2816, 3004, 4535, -6776, -12919, -12567, -6613, 4003, 12337, 16846, 25744, 8378, 1947, 4151, 5735, -5536, -288, 648, -2055, -4179, -8805, -9409, -14464, -25033, -19260, -5399, -4037, 439, 1412, 9735, 14106, -7164, -14106, -8635, -19930]
11439a9930L376J1080K1939O001n198k0383J305N672L45j2187j1572N559P536
11426f457n927P288J5484R10j2648k233P523J3883j849r827K573j915j5382n680
11412a4257n30n212m83n743R477P708N0J3572O911L2j6014q37r225j0151J188
11397b3514J6587R071O255M992r298N057Q697P325q179k2977J103J5966O936l177
11383A4844k106J8279O646j3177j1200J591J614n927O56P716P061M851M622p419
11369B8051j5058o583L980o535j7020K004R554Q058p043l548K944P307n003j305
11355a97K561J0118k93J319J1787k337j63p248n442r732m824Q544r001p12Q555
11340B935J7931l381m172p714K305J1262r54O363l297r561m344k62N962N009N028
$$ y = [-19930, -16554, -5474, 16465, 22466, 17268, -3115, -1810, 3862, 4207, -7980, -19552, -13993, -6457, -12384, -5096, 10388, 11298, -1350, -3583, 3940, 17823, 15974, 6147, 8720, 6805, -8577, -14257, -14787, -19999, -20482, -26225, -16748, -9040, -8990, 4582, 11493, 11525, -4489, -5326, -14551, -24702, -23514, -6927, 2144, 8399, 13391, 4093, 9150, 17847, 25172, 16993, -5984, -4881, 11085, 18021, 14844, 12738, 31017, 37663, 24486, 13286, 14877, 16491, 10564, 11220, 18936, 25997, 30848, 35470, 28051, 12993, 6410, 10390, 3855, -13165, -11161, -1607, 6451, -592, -4140, -1196, 6111, 1108, -197, 2364, 12482, 12189, 13508, 25295, 22958, 22795, 15547, 10105, 373, -4451, 4093, -4908, -5620, 2935, 20866, 17485, 13313, 5599, 7904, 19166, 18212, 24575, 21278, 11717, 7373, 7111, 13073, 18082, 23110]
11325B3110j686m493M422m299J738r522k753J7391J0694j215p018n917l70j677
11311A8405O99j0141o221N437o831M972J6403O838k932M261O338j2926o164o135
11297A2003n076j2766k064O403k186J4230k041k058L245O474L123J177p533j1996
11283I35p319k844J1920j623n468M894J477Q660l408Q837j025n685K932q868j3265
11268i850j0223q55K5936J9777p898r076Q43j053m019j329q748O656J4594m14
11254A4341p908j131J775M78j0310P22J3904k165n131p997J2072J9988r451m365
11240A4822P238O744J481N29j5867p277k553j0400k172k038J20L360L805P690
11226E482Q69j1527p371M629l034K41m988J0999O790K532O594O369m627o997m594
$$ y = [23110, 21424, 16931, 21353, 17054, 18792, 9270, 6517, 23908, 34602, 33387, 26369, 20452, 20082, 18405, 19104, 8963, 2742, 8179, 1348, 6320, 22723, 29561, 26629, 30890, 37228, 24302, 18138, 12003, 6927, -5839, -7903, -1500, -3686, 10544, 8503, 6445, 9690, 16164, 19287, 20464, 12931, 935, -6384, -9228, 2692, 1069, -4399, 495, 1972, 10632, 7224, 16061, 15036, 9351, 12283, 3415, -9850, -20073, -20928, 5008, 24785, 16887, 7811, 8654, 7601, 3582, 2253, -6495, 161, 14755, 14341, 6433, 5302, 7077, 7555, -2755, -2033, 11871, 9706, 4575, -3422, 8650, 28638, 19187, 14822, 22060, 28804, 30285, 30814, 14947, 7670, 5117, -5283, -7455, -9493, -9373, -6013, -2208, 5482, 6351, -5176, -12547, -7918, -10952, -10711, -15699, -4700, 2090, 4622, 11216, 17585, 12958, 5961, 1367]
11211A367m786R304k12K221l602K568j2241k33J1228O741k962k0578M958J0379
11197D152m96j1134J1294J2172M372n793K585k667m322K910N4L732j69J0952M917
11182C2559j1858k0900q389Q162P075m526K343N289l412l106P22O041Q13R05j505
11167A0213j087K730N676j403M868J9668Q61o796p645r00j0361r678k375J3420
11153A7191M755o416j0147J137K120L720p37p109k874Q68M794N46N993K909P219
11138B3969Q621p029M79L653o232k891n397Q674k03j304m482p782j0940L425j832
11123G29K395l274R712J0613m696j0053J0366J5260Q67j2869j085N782j0606j2412
11109G29l226P644K355q781m607q776m54O304P577J1p933L204K5233J0976J587
$$ y = [1367, -3419, 5885, 5673, 7894, 4292, 6860, -5381, -5614, 5614, 12355, 9393, -11185, -6227, 4152, 3656, -7478, 3816, 15988, 20360, 14567, 17152, 14485, 10163, 13073, 13127, 16859, 16690, 27642, 32559, 20701, -199, -8588, -426, 6649, 2123, 4466, 9755, 6343, 3237, 3959, 10000, 10813, 11718, 10213, 9126, 11856, 17532, 16129, 20997, 40665, 41526, 34730, 27085, 26185, 15824, 6146, 3771, 17191, 21946, 15530, 5383, 6520, 8640, 12360, 11623, 4514, 1640, 2508, 7302, 7848, 13841, 16750, 23969, 32590, 25561, 26040, 29693, 23461, 20570, 15173, 23847, 23644, 22340, 17858, 10076, -864, 2561, 729, 3124, -150, 9562, 20175, 15479, 5426, 15792, 31052, 31919, 19050, 17965, 23747, 13141, 729, -2497, 5147, 7502, -1279, -5886, -14662, -15116, -8812, -1235, -1224, -9157, -5953, 19280, 30256, 31843]
11094C1843l320O0N90j1740p867R397P848J060p568N841N009L42L42n89r796l562
11078A7890q038N669q76O425J1204K96j8881O30l767M28m65M32J3614n570q943
11063A0048l856J1826Q202n532j556P489M226l848L686Q396J314j5571j7392O366
11049A3798R215n407N60N470K875K896K043J563K017j2073m684l566j3318p312
11035e923N716K181K47J2051N93j0885P229q150j41l804O734Q276P399L164j2940
11020A1747r208O030Q729m15R16o909l179j2723p745p637j64J2683Q307n761j120
11005f449J3009N960m362j2119N991J1504o774p883N697O072j0111J0309R194
10992B0038r89p682l768P507J3655N329j6764k280o131r74J4034O264q784K230
$$ y = [31843, 28523, 28583, 29173, 17433, 9566, 18963, 26811, 27871, 20303, 26144, 31153, 31495, 31837, 31248, 21452, 17890, 9852, 15521, 14645, 21070, 32274, 32570, 13689, 14319, 10552, 10980, 10515, 10947, 24561, 18991, 10048, 6192, 18018, 26220, 20688, 19132, 26621, 30847, 26999, 30685, 39081, 40395, 24824, 7432, 13798, 23013, 17606, 18166, 23636, 26511, 29407, 31450, 33013, 35030, 22957, 18273, 14707, 1389, -5923, -207, 1974, 2221, 14272, 14865, 3980, 11209, 3059, 2918, -886, 5848, 14124, 21523, 24687, 11747, 2539, 8569, 17298, 16883, 17799, 10890, 7711, -5012, -12757, -20394, -20558, -7875, 432, -5329, -6449, 6560, 12520, 8158, -3961, 2030, 13534, 6760, -1123, 4574, 10646, 535, 10844, 20038, 19049, 11367, 7599, 15106, 28761, 34090, 17326, 15046, 8915, 7941, 21975, 28239, 19455, 21685]
10978B1685N398j794M908K452O180n969j4499K941K166j2050p492P094J3454N439
10964B9913j0331N243Q833j4515j0926o054J651J8189j5454k633J4411J6167J84
10951C4678k2441k543K387J5349p983n778K133p397L208R633j539P937m714l789
10937A9141K461L869K286J1o290j7618L516J2059J211L971J86p047J4634R422
10923D1812j2585r548p103m973m41P692k998o971J6151J0129j2097O126m392l570
10909A7232M788N037K393p505J2249N809J17Q09J0122J1826J0267P049K944M5
10895H3182R421R072o528L223J4298K921J3069J5642L3767K1158J9321K6106M4534
10882B89186Q0018J26425K20779L75644N34431N10105J75504k53956m70665m47555
$$ y = [21685, 27083, 25289, 30197, 32649, 38829, 32860, 18361, 21302, 23468, 11418, 3926, 11020, 24474, 29913, 19582, 24825, 33658, 19143, 8217, 2163, 3814, 22003, 6549, 3916, 18327, 34494, 34678, 12237, 9694, 12081, 27430, 19447, 13669, 15802, 8405, 11613, 21246, 19707, 27644, 22930, 19141, 21602, 25471, 27757, 27768, 21478, 3860, 7376, 19435, 20646, 24617, 24803, 17756, 32390, 41812, 29227, 19679, 12576, 7603, 7162, 14854, 11856, 4885, 21036, 31165, 19068, 25194, 20802, 17232, 22020, 27057, 29450, 21945, 34194, 40003, 40120, 40929, 51051, 62877, 73144, 80193, 83137, 83182, 92603, 101675, 95147, 98370, 112668, 115589, 128658, 144300, 178067, 199225, 218546, 244652, 289186, 369204, 495629, 716408, 1092052, 1626483, 2136588, 2312092, 2058136, 1587471, 1139916]
10872A139916l28836k32460j59308q8876n2966n5906n5192k6357k4422j3029r652
10861I2912p283k322n43j2323n804M178R875K263k863k533m456n56k26p735M751
10846F7335j0904k329K171N077n271r927j321j313k019n164K581J5992R436K994
10832F7338q493q392j454M015K671l076m518j2028l564M57p832K546Q956l583
10818C3043Q277O835N895o77n70n454J277n589q804J582n800j597p276k14J5184
10803C6112J6082m498j4044K926k048j5542j9019j2682J7432J439k499J2206K749
10790A8614J7483K2066k754k418j3245j5019j1832k0863N575J5189J9556O290
10778C8642K887l532J54O232Q01p753o073N496O097N464M069P958Q392l779j4499
$$ y = [1139916, 811080, 578620, 419312, 330436, 277470, 221564, 166372, 140015, 115593, 102564, 92912, 85629, 83307, 82764, 70441, 64637, 68815, 78690, 80953, 78090, 75557, 71101, 70545, 70319, 62584, 67335, 56431, 54102, 56273, 61350, 56079, 46152, 44831, 43518, 41499, 36335, 38916, 54908, 64344, 67338, 58845, 50453, 48999, 53014, 55685, 52609, 48091, 36063, 32499, 32956, 25124, 27670, 36626, 33043, 41320, 48155, 54050, 53373, 52803, 47349, 48626, 43037, 34233, 35815, 30015, 28418, 21142, 20928, 36112, 52194, 47696, 33652, 36578, 34530, 18988, -31, -12713, 4719, 6158, 3659, 15865, 18614, 36097, 58163, 55409, 52991, 39746, 24727, 12895, -7968, -2393, 12796, 32352, 38642, 41529, 37997, 38151, 44383, 45184, 37431, 31358, 36854, 42951, 48415, 52484, 60442, 68834, 65055, 50556]
10763E0556p304l823J0655q432j2029l675M603q086Q037Q201l865L375l696k154
10749C2363q490J2019M65p441n201L669r590O699O798P961K0168N120M04k40j6999
10734D7705K362J0274j886J9155K0325J1210K9408K8775N8578M0915K835j6529
10722B53127m7886l6909j8151r653j5934j6107j755r370j3188j3558l191j4115
10710E3310J187O457J4399J8914N526j1509j5592j0630J2292L5495M1582N9533
10698B10964M3718j4295m4872m0891m0738k3731k4786l2454j3925k259N598R134
10686C1463P744N108J1110P168j9119q081m683j7089k0827m740M537k0173o720
10673c4302l629J3246M039M56n459j2992j438o56K5560Q6062J79060K56671K29566
$$ y = [50556, 43252, 39429, 50084, 41652, 29623, 25948, 30551, 22465, 30502, 38703, 34838, 38213, 34517, 32363, 23873, 35892, 36357, 28916, 23715, 27384, 17794, 24493, 31291, 39252, 59420, 64540, 64944, 64704, 47705, 50067, 60341, 58455, 77610, 97935, 109145, 138553, 167328, 225906, 266821, 269656, 253127, 205241, 168332, 150181, 140528, 124594, 108487, 106732, 97362, 84174, 70616, 67425, 53310, 54497, 60954, 75353, 94267, 99793, 88284, 72692, 62062, 74354, 109849, 151431, 210964, 254682, 240387, 195515, 154624, 113886, 90155, 65369, 32915, 18990, 16731, 22329, 31463, 39207, 44315, 55425, 62593, 43474, 35393, 30710, 13621, -7206, -11946, -7409, -27582, -34302, -37931, -24685, -20646, -20190, -25649, -38641, -40079, -40735, -15175, 70887, 249947, 506618, 736184]
10660G36184R9272l3930j01528j13519r4397q2311o8010m1747r253k5543j9629
10649B45589r221j0945K150J1379R776j9083k6684k7592o037J6811J1493j7463
10637A80173k970n633j6519k1732q433l831L007k2814k1395o724J3055L4775M5362
10624A66321K2077J5817J7734M430k5089l8322k5868j9243j487J6077K9481L0724
10612A92652L0700J4171M356J4580K088k694N947J6856N014j4940r352J1064J3067
10599B83509K2927L6000N6246P4477L1016k7629n0177l6214l3056k1253k2441
10588C13405j5696j6339k758n654j2787O284K6189J5548P902j2093j3640n650
10576B84711j3673k3901p467m007o528N401l36q888q27r883n209J4248J9946J5262
$$ y = [736184, 835456, 801526, 699998, 586479, 492082, 409771, 341761, 300014, 290761, 265218, 245589, 236368, 225423, 227573, 238952, 248728, 229645, 202961, 175369, 169332, 186143, 197636, 180173, 177203, 171570, 155051, 133319, 124886, 121055, 124062, 101248, 79853, 73129, 86184, 120959, 166321, 188398, 204215, 221949, 226379, 201290, 162968, 137100, 117857, 116370, 132447, 161928, 192652, 223352, 237523, 241879, 256459, 258547, 255853, 261800, 278656, 283670, 268730, 259378, 270442, 283509, 306436, 342436, 398682, 473159, 504175, 476546, 426369, 390155, 357099, 335846, 313405, 297709, 281370, 278612, 272958, 260171, 266455, 292644, 308192, 316094, 304001, 290361, 284711, 271038, 247137, 239670, 235663, 229135, 234536, 234200, 225312, 224485, 214602, 209393, 223641, 243587, 258849]
10562B58849M774J2492J1873K4042J5405J1630J6922J0557J5892K6842J7783J6291
10550D43352J6128K4125N763J816l439r369l796R629J4721J8401J001J1720K6415
10537E56467K6448L9981L9537M2904K0222j541J2410J458J4319K1291K1217K5173
10525H19886J6684J1213K0796L6021L5981M4005L3794L9308M5834M0722M4184
10514A188428O6291O3368O4329Q3985J03987Q9333Q2255P9400Q6391J04704J30222
10503B142693J62421K01570K46898K63405K93406L25721L70687M70592O32635
10494E110028Q58725J067981J016313O87420M51096N03215Q28097J264678J735243
10485A3522796K163370K468341K738287L061675L472600L866799M393091N540266
$$ y = [258849, 263623, 276115, 287988, 312030, 327435, 339065, 355987, 366544, 382436, 409278, 427061, 443352, 459480, 483605, 489368, 491184, 487745, 478376, 474580, 484209, 498930, 517331, 518332, 530052, 556467, 582915, 622896, 662433, 705337, 725559, 724018, 736428, 737886, 752205, 773496, 794713, 819886, 836570, 847783, 868579, 904600, 940581, 984586, 1018380, 1057688, 1103522, 1144244, 1188428, 1254719, 1318087, 1382416, 1466401, 1570388, 1659721, 1741976, 1821376, 1907767, 2012471, 2142693, 2305114, 2506684, 2753582, 3016987, 3310393, 3636114, 4006801, 4477393, 5110028, 5968753, 7036734, 8053047, 8740467, 9191563, 9694778, 10522875, 11787553, 13522796, 15686166, 18154507, 20892794, 23954469, 27427069, 31293868, 35686959, 41227225]
10477D1227225Q260350J3903371K4773253M4782479P5598732J01990640Q5588747
10470C96124797J5700446n5882974q4572681p8497332n9466367l9906298k5358574
10463F8141017j6444015j1450783q484271o453099m952578l848984k976501k268587
10455A1262199j738416j354167j050267p48800m70744j48213J09818J07677k39858
10446E729229o05269p49267o88100n38563l88126k83920k09316j63323j21950
10437A981395j14536j34690j37908j35365j17599r3459p0175m4254m8928m6603
10427A037878l0015n1218n8207n5741m7276l2213j4968n347J2773K7544L6741
10416H19951K4953j0341n5725p8430p1970o8827o6485n3999l9050k0346j5192
$$ y = [41227225, 49487575, 63390946, 88164199, 132946678, 208545410, 310536050, 396124797, 411825243, 355942269, 271369588, 192872256, 133405889, 93499591, 68141017, 51697002, 40246219, 31761948, 25308849, 20356271, 16507287, 13530786, 11262199, 9523783, 8169616, 7119349, 6370549, 5899805, 5751592, 5861410, 5969087, 5729229, 5123960, 4374693, 3686593, 3148030, 2759904, 2475984, 2266668, 2103345, 1981395, 1866859, 1732169, 1594261, 1458896, 1341297, 1247838, 1177663, 1133409, 1084481, 1037878, 1007863, 956645, 898438, 842697, 795421, 763208, 748240, 742893, 755666, 783210, 819951, 844904, 834563, 778838, 700408, 628438, 559611, 493126, 439127, 400077, 379731, 364539]
10405C64539j7066j957j4334j5130m871R298r615j5606j6331j1740n579k0666
10393B40942k8203m849r446j9680J81K0316J6932l433m126M530r919q582n554
10380A89109O07J3382J6226O268P342J652j4025q656k431m234j0194o614m013
10367A84419j1151k5466k5968j1170j1507j4076m974J656J1852M080M009l638
10355I8066o223o612N489R665m401L925l091k0991k0582k3222J1162L3814J4569
10342I1568j1738j5295J3861K023o352l254o629k866l89j6229l814j2319r381
10329A9186J102K828J5708K7510R516r084n155k4080j5889j2186j2599n970R802
10316F89K3852L5034M2013N235N78r262o525j7640j8979j3714L019k4845l9239
$$ y = [364539, 347473, 345516, 331182, 316052, 311181, 320479, 310864, 295258, 278927, 267187, 261608, 240942, 212739, 207890, 198444, 178764, 178945, 199261, 216193, 212760, 208634, 213164, 203245, 194663, 189109, 189716, 203098, 219324, 225592, 232934, 234586, 220561, 211905, 209474, 205240, 195046, 188432, 184419, 173268, 147802, 121834, 110664, 99157, 85081, 80107, 81763, 93615, 97695, 101704, 98066, 91843, 85231, 90720, 100385, 95984, 99909, 96818, 75827, 55245, 32023, 43185, 76999, 91568, 79830, 64535, 78396, 80419, 74067, 70813, 64184, 61318, 60929, 44700, 40886, 28567, 19186, 20288, 23116, 38824, 66334, 75850, 66766, 61611, 37531, 21642, 9456, -3143, -9113, 689, 24541, 59575, 101588, 106823, 107401, 98139, 91614, 73974, 54995, 41281, 44300, 19455, -19784]
10303a9784k1081J642j4944j3308j1553k961j358P161j4774k3420n857L880J1655
10290a04702p010k4715l0855l1392l5273m4732r0603j16800j35125r7256L1703
10279f86760J86563K30382J86023J26594O7326J6718k077L859m688j828J393N30
10267A24035j0177r462j82P084Q866j260o747p902r756k3182r575Q05J3202J4614
10253I0363K615n647p390j0581k389R823n829q939p298P215j1989j5895K52M675
10239C8986j1531N957j630J0048o796N080J2292j462j0052J087L807J7749J1122
10226G4657M168q837j0183j1765Q518M853n409K025j374K412l17M807o469O60
10212E7746O032n286J978l91p466p269j1082n065k358o97N795R794J9455K0546
$$ y = [-19784, -40865, -39223, -54167, -67475, -79028, -81989, -83347, -76186, -90960, -114380, -120237, -116357, -104702, -111712, -136427, -167282, -198674, -233947, -278679, -369282, -486082, -621207, -718463, -686760, -500197, -269815, -83792, 42802, 110128, 126846, 124769, 128628, 123940, 122112, 123505, 124035, 113858, 104396, 104214, 111298, 120164, 118904, 112157, 104255, 94499, 71317, 61742, 62547, 75749, 90363, 92978, 87331, 79941, 69360, 66971, 76794, 70965, 62026, 54728, 61943, 49954, 34059, 34311, 38986, 27455, 33412, 31782, 41830, 35034, 40114, 52406, 50944, 40892, 41979, 45786, 63535, 74657, 78825, 69988, 59805, 48040, 56558, 61411, 56002, 58027, 56653, 59065, 58748, 63555, 57086, 57746, 63778, 58492, 60470, 60079, 52613, 45344, 34262, 29197, 26839, 26142, 31937, 41731, 61186, 81732]
10198H1732n580j1758k776l448j0864p604m976j170m849n723J4976J6366j0370
10185D3956p794P809P884q675K426o809j6518j8869j7686n910n673Q508L0521
10172A3170J1229j1169P64J358o305m452j079M085j2608j682K3765K9369J8768
10159F5213J2288K7546J6506J4618p418k7427k4889k0977o401k5683m958N833
10147B4251K3995K4471O811q949j3831k0539j4379Q26p331k604J93J1282l731
10134B0465L91p01M682P420o920n399Q552P237Q962J6382K021k0222j3368L780
10120C3282k442L292J4867L615r862j2027o741o202O029k081k934l860J3609O258
10106C4803k884l683K625J244J7290J0316L031J3097J7708J8995o589j7317q139
$$ y = [81732, 76152, 64394, 61618, 58170, 47306, 39702, 34726, 33556, 28707, 22984, 37960, 54326, 43956, 36162, 43971, 51855, 43180, 45606, 38797, 22279, 3410, -14276, -20186, -25859, -17351, 13170, 24399, 13230, 13994, 15352, 9047, 4595, 3516, 7601, -5007, -6689, 17076, 46445, 65213, 77501, 105047, 121553, 136171, 128753, 101326, 76437, 55460, 49059, 23376, 18418, 24251, 48246, 72717, 79528, 70579, 56748, 36209, 21830, 22656, 15325, 12721, 12914, 24196, 20465, 20856, 20155, 24837, 32257, 25337, 19938, 28490, 35727, 44689, 61071, 63092, 42870, 29502, 33282, 30840, 34132, 48999, 52614, 42752, 30725, 23984, 17782, 23811, 21730, 18796, 14936, 28545, 34803, 31919, 28236, 30861, 32105, 49395, 59711, 62742, 75839, 93547, 112542, 105953, 88636, 80497]
10093H0497n859k745J3190Q597N462j0369j2012r531j4094j1248M60J319R496
10080E3163J2786J4983N375N451K3648K2573K7266L5767M2244L7618J9181q402
10068B91653j1767j1627K3640L8470R2874J74424L16160M91756N66434L19200
10058B291217j22917m21702m76264l75577k75747j71874j05520p7733m5986l6510
10048A81387k3240k5896r612m08j3018j9922k1432m806n178p558m321m142j6256
10035B5598m862Q178L86O225n906P661J3579J616j4982K076M11p508P65O580p172
10020C2645j1763j2063l696k665r946o407q506P216O191J4312J3638p546q998
10007B412Q211M468o612p670Q209N566J2651r625j386o202l397m90J4214k533
$$ y = [80497, 74638, 71893, 85083, 93680, 99142, 88773, 76761, 67230, 53136, 41888, 42348, 43667, 53163, 65949, 80932, 86307, 91758, 115406, 137979, 165245, 201012, 243256, 280874, 300055, 291653, 279886, 268259, 291899, 330369, 423243, 597667, 913827, 1405583, 1972017, 2291217, 2168300, 1746598, 1270334, 894757, 619010, 447136, 341616, 263883, 217897, 181387, 158147, 132251, 122639, 122231, 109213, 89291, 67859, 63053, 57875, 50317, 45996, 41854, 25598, 20736, 28914, 29300, 35525, 29619, 37280, 50859, 52475, 37493, 39569, 39980, 32472, 33237, 39817, 32645, 20882, 8819, 5123, 2458, -7488, -13895, -22401, -15185, -8994, 5318, 18956, 11410, 2412, 10623, 15091, 8479, 809, 9018, 14584, 27235, 17610, 16224, 10022, 6625, 6135, 20349, 17816]
9993A7816P372k474n53r370L399N28q238j0204M653O669k57J751m480j092N240
9978A0760P681N787L982N870j3637j501k013p200K685O346n401j1427k536N072
9964D468M496j1355r837k945O844J0238J884Q82K627p349j274N202J219O685j0016
9949A769r77K291L889O794j662m137M056j5587j3992J5758J7912o191j4699N68
9935d208M86J897K038n622O629P885K81K190j3316j6055l347P199n3j5161m851
9920c4008J9360J3707q509l905P323j4329j8463R562L850M810R981R43k688R519
9906b847K55n038l305O199N551J42l244J622N408K088J992n713k876j252j2513
9891a3531J953J0904Q171o563r235K770O86l473N290N969R621P565m71M694j977
$$ y = [17816, 25188, 22714, 22161, 12791, 16190, 16718, 8480, -1724, 2929, 9598, 9341, 11092, 6612, 5520, 10760, 18441, 24228, 28210, 34080, 20443, 18942, 16929, 9729, 12414, 18760, 13359, 1932, -604, 4468, 8964, -2391, -12228, -15173, -8329, 1909, 3793, 4675, 7302, -47, -1321, 3881, 5100, 11785, 1769, 792, 3083, 6972, 13766, 12104, 7967, 12023, -3564, -17556, -1798, 16114, 9923, -4776, -4208, -3722, -1825, 213, -5409, 1220, 9105, 9386, 11576, -1740, -17795, -21142, -13943, -13996, -29157, -34008, -14648, -941, -9450, -13355, -6032, -20361, -38824, -29262, -25412, -20602, -10621, -9678, -12366, -2847, -2592, -7630, -10935, -4736, 815, 957, -2287, -665, 4743, 6831, 8823, 3110, 234, -1018, -13531, -11578, -674, 7497, 934, -8301, -5531, -4845, -8318, -3028, 2941, 12562, 20127, 19656, 24350, 22373]
9876B2373m944l89q0L338L361j6601j2768l910j149R06P183L813r334j2579J738
9861a9042L453J0910m893N08J2988j585n543J679P246O706j1718j5928l769M467
9847a4521O987K388J1242K027p391P175Q272J3821K972j1935j9779O724J5234
9834B3216P868j205N23l252j8304k0831J0066J4703K646K694J021n684r064l354
9820A043l050m241J0527J1168K812M13j5956o707O193N876k473o688Q627J372
9806H916n739o832K923J5732J2528L870o640m638o681N695M783K202j3184o70
9792A2265r410p622j0440l294J3691P207N337n411J728p296l816J1258l6q690
9778d529L316n113N99J2150K139q26n210LL222j6317Q85p19m501J2532M222J276
$$ y = [22373, 17429, 17040, 16960, 20298, 23659, 7058, -5710, -9620, -10769, -9863, -2680, 1133, -8201, -20780, -19042, -15589, -4679, -9572, -9064, 3924, 2339, -3204, -1525, 5721, 12427, 709, -15219, -18988, -14521, -7534, -5146, 6096, 8123, 732, 7907, 16179, 30000, 32972, 21037, 1258, 7982, 23216, 31084, 29879, 30402, 27150, 8846, -11985, -1919, 12784, 15430, 18124, 19145, 13461, 4397, 1043, -2007, -6248, 4279, 15447, 18259, 18672, 2716, -3991, 2202, 8078, 5605, -1083, 7544, 8916, 3177, -3655, -732, 15000, 27528, 31398, 24758, 20120, 13439, 19134, 23917, 26119, 12935, 12265, 2855, -4767, -15207, -18501, -4810, 2397, 7734, 2323, 4051, -3245, -7061, 4197, 4161, -4529, -1213, -6326, -5727, 6423, 8562, 7736, 2526, 2529, 5751, -10566, -9681, -10400, -14901, -2369, 1853, 3129]
9762C129l940j489n304j126K0906J3013J526q74q274j1637N981p333M135q470
9748B43r093q654o225m86K166J5614M443p499o409J1262k364j2836J679J1651
9734f508K029M097j421O252O08n835r166R838j903P527J4023J8091j190j6104
9720B0338j2921o768P265P752K266p209q203K948p234j5789n804J1966J1165M788
9706D560J6959N062j837M35r902j3837q685K40N210k721l817j1218p462J4911
9692a2102P288k789P289j1663j0409J4454J2996j101M446o006r245j427J0287
9679B018j1978j2590L869M998K185j632K259p967M813J7810N479K355l733p020
9665H66m309j2185m216n417J0409P45J2650J7023l062Q500l301O28k063J438q442
$$ y = [3129, -811, -2300, -7604, -8730, 12176, 25189, 26715, 25841, 17567, 5930, 11911, 4578, 8713, 243, -8850, -17504, -23729, -24215, -22049, -6435, -1992, -9491, -15900, -4638, -7002, -19838, -18159, -6508, -4479, -382, -1803, 4449, 5057, -778, -9944, -106, -2009, 5518, 19541, 37632, 36442, 20338, 7417, 649, 7914, 15666, 17932, 10723, 2520, 5468, -1766, -17555, -23359, -11393, -228, 4560, 21519, 26581, 24744, 25179, 15277, 1440, -7245, -7005, -1795, -4516, -8333, -19551, -27013, -12102, -4814, -7603, -314, -11977, -22386, -7932, 5064, 3963, 8409, 2403, -6842, -8269, 2018, -9960, -22550, -18681, -13683, -11498, -13130, -10871, -18838, -14025, 3785, 9264, 11619, 7886, 866, -3443, -15628, -19844, -25261, -14852, -14107, -1457, 15566, 12504, 21004, 17703, 18331, 16268, 17706, 9264]
9650I264o591N120N407p7N193P046k486j5327j0217l704J342J806j59P458r352
9635e277o448l83o78K546l042L755M719r908m754L409N339K184J0256J2689j2093
9620B314j3505k263J0038N181K0592p153k8419j7259P433J5111R305L329L668
9607H372N14j6549p187J1783J137n151r200l619N647R089M54m992q864m61J838
9592a7189L564J9846J5013P87k608K510n599j6262J9P701l303p874p075p571N730
9577a2311J2947O532j0815L704L181r831K868q97j942q674q278k930M101L081
9563a9264M123k390O281k518j1225K2853K800p649J2147m792J919j5838o557J0672
9549i438P442M894N462r125J11J0943m682J553Q41q300r304r448M886R968P171
$$ y = [9264, 2673, 7793, 13200, 13123, 18316, 25362, 22876, 7549, -2668, -6372, -5030, -3224, -3383, 4075, -5277, -11725, -12108, -12786, -10240, -13282, -9527, -4808, -14716, -19470, -16061, -10722, -8538, 1718, 14407, 2314, -11191, -13454, -3416, 1765, 22357, 15204, -13215, -30474, -23041, -7930, 1375, 4704, 8372, 8886, -7663, -14850, -3067, -1930, -7081, -16281, -19900, -14253, -5164, -4710, -9702, -18566, -19027, -17189, -13625, 6221, 21234, 22021, 19413, 21923, 16324, 62, 81, 7782, 4479, -3395, -10470, -18041, -12311, 636, 7168, -3647, 57, 3238, -6593, -3725, -4622, -6564, -15238, -23516, -26446, -22345, -19264, -15141, -17531, -11250, -13768, -24993, -2140, 660, -6989, 5158, 366, 2285, -13553, -20110, -9438, -1996, 2898, 8360, -765, -654, 10289, 5607, 7160, 8001, -299, -9603, -19051, -14165, -4197, 2974]
9534B974J6018O781R48j2143r248j1332l040J373o325n187M981N715n580J534
9520a2531J732l641M569M480R143J3731M024j00N063o849j2598N207M503M682
9506B1415o062r404J104L886J773k37Q355J2898l833r004M71N982J978J1771J4875
9491E5968N942J369j6650j1555J425O480J5621K069N640J4024P950J9071L4022
9478A41376L9251R0753J24222J61255J21585J2838q2308j15812j29887j01822
9468B61451p4113m8164l6639q447m829k8726k1773k926o974n45p61m816p038J9355
9454C5055J846j4294p361M739P52m080l420J405R426J842q686J921R621O237o154
9439B8849p26l160j0901m281N990j12L620P318J465j7084m409M127M61J709l762
$$ y = [2974, 18992, 25773, 26721, 14578, 5330, -6002, -9042, -7669, -13994, -19181, -14200, -8485, -14065, -12531, -10799, -14440, -9871, -5391, 3752, 17483, 21507, 21407, 26470, 19621, 7023, 12230, 16733, 21415, 15353, 5949, 7053, 10939, 12712, 12475, 20830, 33728, 29895, 20891, 21362, 27344, 29322, 41093, 55968, 61910, 63279, 46629, 35074, 36499, 42979, 58600, 60669, 66309, 80333, 88283, 107354, 141376, 180627, 271380, 395602, 556857, 678442, 691280, 608972, 493160, 363273, 261451, 187338, 139174, 102535, 94088, 89259, 60533, 38760, 35834, 28860, 28315, 27554, 22738, 15700, 35055, 36901, 22607, 15246, 19985, 20737, 16657, 13237, 14642, 24068, 25910, 17224, 19145, 28766, 35003, 28849, 28123, 24963, 14062, 9781, 15771, 15659, 19279, 26597, 28062, 10978, 6569, 10696, 11157, 12866, 9104]
9424I104Q497K68n928m682K905K40O652J072j820j529o916K174R235J3945N349
9409C8566j5834p663J0159q590p540p79P374Q008j4299j1698l78J3482N693k812
9395A3689o924N355K274L559R845J4643l292q411M733K964J744L788l123m384
9381C6460Q985K458j173j421p242P84n432J414N661O610P289J6578M269j1107
9367F4133J576M218R648J1502M42q789Q849J1442q841K1323J8436m186Q923J6745
9353A55421J2173J0413O728J2866J8992J8869L4183L2096L1674L4602L7438M1334
9341D46789N3274N7902N8948P5604Q9508R2118J13042J22885J50968J97564K42037
9330A700639K90113L98013N45116P25160R48635J168342J258452R82292L41148
$$ y = [9104, 17601, 17869, 11941, 7259, 10164, 10404, 17056, 18128, 16308, 14779, 7863, 10037, 19272, 33217, 38566, 22732, 15069, 25228, 16638, 9098, 8319, 15693, 23701, 9402, -2296, -2674, 10808, 16501, 13689, 6765, 12120, 14394, 17953, 27798, 42441, 39149, 30738, 35471, 38435, 40179, 43967, 40844, 36460, 45445, 47903, 46730, 45309, 38067, 38851, 33419, 34833, 40494, 47104, 54393, 70971, 75240, 64133, 65709, 69927, 79575, 91077, 91519, 82730, 91579, 103021, 94180, 115503, 133939, 129753, 138676, 155421, 167594, 178007, 184735, 197601, 216593, 235462, 269645, 301741, 333415, 368017, 405455, 446789, 500063, 557965, 616913, 692517, 782025, 874143, 987185, 1110070, 1261038, 1458602, 1700639, 1990752, 2388765, 2933881, 3659041, 4607676, 5776018, 7034470, 8016762, 8357910]
9321H357910m05813r28251j130560j092805r48138p59406n89961m60587l76074
9312A666315k74803k17114j75040j23754j21381j06174p7473o5748o1300m1745
9302D01783k5565m0327l3303j8465r352j7707l3990l2558p741m100j0519k0947
9290A47209k2344j4587K886p459j0326K4j714j4521L083p021n105J5196j257r537
9276G4527j4310k3880J1350J8501O882j0198k2963j0499J0128J3475k1241j1318
9264B0454P338J0434l217o188l148m697M443o154J5062N340p275o543j0510J860
9250A7199O279L139M557j186j2983R429m251Q591Q55q777J181l524l816r725K7817
9235C4785j959l537k554k608P516K166k476l124j1774J049J5393o44j7636K437
$$ y = [8357910, 7952097, 7023846, 5893286, 4800481, 3852343, 3092937, 2502976, 2042389, 1666315, 1391512, 1174398, 999358, 875604, 754223, 648049, 570576, 504828, 443528, 401783, 376218, 335891, 302588, 284123, 274771, 257064, 223074, 190516, 182775, 178675, 168156, 147209, 124865, 110278, 113164, 105705, 95379, 95403, 93689, 79168, 82251, 75230, 70125, 85321, 84064, 74527, 60217, 36337, 47687, 66188, 73070, 62872, 39909, 29410, 39538, 53013, 31772, 20454, 27792, 38226, 35009, 28821, 25673, 20976, 25419, 19265, 34327, 39667, 32392, 25849, 15339, 17199, 23478, 26617, 31174, 29988, 17005, 26434, 22183, 30774, 31629, 22852, 24033, 20509, 16693, 6968, 34785, 32826, 29289, 26735, 24127, 31643, 33809, 31333, 28209, 16435, 17484, 32877, 32233, 14597, 17034]
9221A7034P056r903j1126J722J4613M995r570P504N421l774n253O22r655n968
9207C718N492k073k32o535p937N933O92k0248j4309M297l321K231N048O277J993
9192a8974M86J0083K4760R242o307j2951k343J1425N799p169m198j6025m979K463
9178h688M990J489m274n083j3767R98P512M438M472R614j1816l582P956N412O826
9163F497r015q994J544M98o028M216m907j3031j0463N623K7119J7795J3006J3682
9149C7542j1745j9692j3071n536j1695P538N168k875p745J0232O00p788M886K319
9135a1862L520j242L906J609K850J437O443N365k758M6l123p511p598q6K413L078
9119c513K984Q214j1475J778r57J1210Q90j16m265j2827p48J60M660k83J0152
$$ y = [17034, 24090, 14187, 3061, 4783, 19396, 24391, 14821, 22325, 27746, 23972, 18719, 19341, 9686, 3718, 9210, 7137, 6905, 370, -7567, -1634, -942, -21190, -35499, -31202, -34523, -32292, -27244, -20967, -18974, -18488, -8405, 16355, 25597, 19290, 6339, 3996, 15421, 21220, 14051, 9853, -6172, -11151, -8688, -3698, -2209, -6483, -11566, -25333, -24335, -16823, -12385, -7913, 1701, -10115, -13697, -5741, -329, 6497, -2518, -11512, -9968, -9470, -15498, -11282, -16189, -29220, -39683, -34060, -6941, 10854, 23860, 37542, 25797, 6105, -6966, -12502, -24197, -16659, -11491, -14366, -22111, -11879, -11279, -19067, -14181, -11862, -8342, -9584, -5678, -4069, -1219, 218, 6661, 12026, 9268, 9314, 6191, -1320, -8918, -9004, -6591, -3513, -529, 7685, -3790, -2012, -2969, 8241, 9131, 9015, 4750, -8077, -8825, -8665, -4005, -4288, 5864]
9104E864J037j907M978j0446n648k653K3108J5768j1453n84q885M499O490n37
9090A9631K276j2101Q1p467j4361J0131o473j6410J000M188J2072K75L283l138
9076g013K841L851k950J739j542R627Q294l763L545Q176n272n305L365O404r148
9061A2849j6626r218p725Q930K7225O282j862m874P689j6792p734M729j100j3118
9047a1345n184N134p03j419J0228j8018O727j380l334J1289L784j2726N470K268
9033i209q537n188K62j760O588l138M968n751J948r39k33P402K400J2323K752
9018C888l92k580m813N239j774q583q542O424J958J0820J0584K553P027j6231
9004E578m536J143n354Q952p63j648R469J0142O407j3400M968M664j4122j678
$$ y = [5864, 6901, 4994, 9972, -474, -6122, -8775, 14333, 30101, 18648, 18064, 9179, 13678, 20168, 19631, 21907, 9806, 9887, 2420, -11941, -1810, -8283, -24693, -23693, -19505, -7433, -7158, -3875, -7013, -4172, -321, -3271, -1532, -3074, 6553, 14847, 11084, 14629, 22805, 17533, 12228, 15593, 21997, 12849, -3777, -12995, -20720, -11790, 15435, 21717, 19855, 14981, 22670, 5878, -1856, 2873, 1773, -11345, -16529, -11395, -12098, -13517, -3289, -21307, -14580, -15960, -19294, -8005, -4221, -16947, -11477, -9209, -17746, -22934, -22672, -24432, -17844, -20982, -16014, -21765, -19817, -20756, -20989, -13587, -11187, 1136, 3888, 3496, 916, -3897, 1342, -432, -9015, -17557, -11133, -9175, 1645, 12229, 14782, 21809, 5578, 1042, 2185, -3169, 5783, 5020, 3372, 12841, 22983, 29390, 15990, 20958, 25622, 11500, 9822]
8990I822J974j3452n371M94J0875m264J472j2520l636J2153K2049Q731j5005j3238
8976H4l010j398m37j0010K825R646J21M085o290R04j5310j3443J462N926P725
8961a7120p488o493K329J6621M501l117r759L114J0616J1911K373O768M253O286
8947B4795p551j0938j1771k853M354L744L347o656L525N951L516j451j0085N59
8933a514k535M639J724K40N40O225N055j893j3442k3160J185j2849MJ458J2173
8918b2150J6520O631q04q351o974n818Q478K865J434R584J516n327j2889q208
8904b3493m905R050k512N538J3471P353m574J6859K0015j1872q168j2420j7788
8891a3446o682O553O188k939N283L215O662l73l392K392K237k82M029R409R765
$$ y = [9822, 11796, -1656, -7027, -6533, 4342, 78, 1550, -10970, -14606, -2453, 19596, 28327, 13322, 84, -2926, -4324, -4761, -14771, -11946, -2300, -2179, 1906, -4384, -3480, -18790, -32233, -30771, -24845, -17120, -24608, -31101, -28772, -12151, -7650, -10767, -20526, -17412, -6796, 5115, 7488, 14256, 18509, 24795, 17244, 6306, -5465, -8318, -3964, -220, 3127, -3529, -4, 5947, 9463, 8012, -2073, -1514, -4049, 590, 2314, 2554, 3094, 9319, 14374, 12481, -961, -24121, -22936, -35785, -35781, -34323, -22150, -5630, 1001, 197, -8154, -15128, -20946, -12468, -9603, -8169, 1415, 2931, -2396, -15285, -23493, -28398, -19348, -21860, -16322, -2851, 4502, -72, 16787, 36802, 24930, 16762, 4342, -13446, -20128, -13575, -7387, -10326, -5043, -1828, 4834, 4461, 1069, 3461, 5698, 5416, 9445, 18854, 28619]
8876B8619j7878o832j1634j2486R820J2456m885o741n176M850J490L981j816M528
8862a704K977j4506j0283O954J0555k305o637N66J3320J0449o333m745O388N894
8848A0590n081r159J3043M327r926l252L879J13o142j3498J317O118M716n015
8834g970o647k158Q321j060Q63L76J3580Q657o710N314P611Q81j7253p997N568
8819A376m05L011K508o025j8344J34n89R281k309n172J792Q855J1961N019O669
8804A7762j897k1949r65P730P738p967k033j0252j376R191q966j8358J0774K1584
8790A016o681K99k414Q77P768N548l535M45j3348o928L917M267J93r670K620J1298
8774d328M992l853p106j2769j3127K440O796l49l165n574K960J983J342J1641
$$ y = [28619, 10741, 3909, -7725, -20211, -10391, 2065, -2820, -9561, -14737, -9887, -8397, -4416, -6232, -1704, 1273, -13233, -23516, -16562, -6007, -8312, -14949, -14383, -1063, 9386, 3053, -1692, 4696, 10590, 5509, -3650, 9393, 13720, 3794, 542, 4421, 4534, -1608, -15106, -13789, -7671, -2955, -7970, -14617, -16775, -8454, -9514, -8651, -8275, 5305, 13962, 7252, 12566, 20177, 21058, 3805, -4192, 1376, 971, 3982, 6490, 465, -17879, -17745, -18334, -9053, -11362, -16534, -14742, -5887, 6074, 11093, 17762, 15865, -6084, -7049, 681, 8419, 452, -1581, -11833, -13209, -4018, -12984, -31342, -20568, 1016, -5665, -5366, -7780, -6903, 865, 6413, 2878, 3323, -10025, -16953, -13036, -8769, -8576, -18246, -15626, -4328, 664, -3189, -10295, -23064, -36191, -33751, -26955, -27304, -30469, -36043, -33083, -31100, -29758, -18117]
8760a8117J1110k03r339m390j894R923l014M052m822L213J407k099J8315J4284
8746A8426l457q721o484k734l922o381j297j3740j966J3609O322P258J1365k695
8732E583j1035l835J095j0080N066J4228O925j6998n441N523J5910l256o489j32
8718b936r512n26Q525n123l946N761k296M248n686M973P107K662j9885q36J2720
8703d750O078l026P299K179R44n689j1918N50m800K981K0538Q038l223l222m437
8688G542q7l205m775K010P430j079k546O575N080q701j4297j3702Q352M323J5142
8673H062O611J862q75J399l079q635j1828j0425N855J0829o223J072N494M941
8659E060O160m983m715K626J865q862Q94q33j1394J0400K654o824R677L340j3435
$$ y = [-18117, -7007, -7210, -16549, -20939, -22833, -12910, -15924, -11872, -16694, -13481, -12074, -14173, 4142, 18426, 14969, 6248, -236, -2970, -6892, -13273, -14570, -28310, -30276, -16667, -10345, -3087, 8278, 5583, -5452, -9287, -8192, -18272, -13206, 1022, 7947, -9051, -14492, -8969, 6941, 3685, -2804, -2936, -12448, -12974, -4449, -9572, -13518, -7757, -10053, -5805, -11491, -6518, 589, 3251, -16634, -17470, -4750, 1328, -1698, 5601, 7780, 8724, 3035, -8883, -8333, -13133, -10152, 10386, 18424, 15201, 11979, 7542, 7455, 4250, -525, 1485, 8915, 7836, 5290, 11865, 16945, 8244, -6053, -19755, -11403, -7080, 8062, 14673, 16535, 15660, 17059, 13980, 5345, -6483, -16908, -11053, -224, -6447, -5375, 119, 5060, 11220, 6237, 1522, 4148, 6013, -2849, -1955, -2788, -14182, -3782, -1128, -7952, 1725, 5065, -8370]
8644h370L974L19L986o6N231J4610p032P689R497j1922o225p578r894Q046L032
8629E297l341O979o200J803K271k984o75k285L891l244m181Q770o5o683k137M855
8613B071O033k711o767Q474P800q932q734J847L075K007o027j179J8520Q998k682
8598B1793n339r721R358J1402O752J68j4469j657k363j4163R403J2744l095o999
8584A3814j1821J0833M012L041M57R97O55J298J5643p782j230K5025J0863Q806
8570G4611l841M662K248r061j1635j8187Q746K201q482j4366l850q465j172n452
8556G957k022N565k19m21j6965k871L599o314J0588J276l486R764J589K630k833
8541G837k377R182P7O787n074J3547M294l297j4302o377q061n044m001q033M870
$$ y = [-8370, -4396, -4077, -91, -157, 5074, 19684, 12652, 20341, 29838, 17916, 11691, 4113, -5781, 2265, 5297, 1956, 8935, 2735, 4538, 6809, 3825, 3150, 865, 4756, 1512, -2669, 6101, 6036, -647, -2784, 2071, 8104, 5393, -1374, 7100, 14900, 5968, -2766, -919, 2156, 4163, -1864, -3043, 15477, 24475, 21793, 16454, 6733, 16091, 27493, 34245, 34413, 19944, 18287, 15924, 1761, 11164, 23908, 20813, 13814, 1993, 12826, 16838, 19879, 20336, 21333, 21988, 23286, 38929, 31147, 29917, 54942, 65805, 74611, 70770, 75432, 77680, 68619, 56984, 38797, 47543, 49744, 41262, 26896, 23046, 14581, 13409, 7957, 5935, 11500, 11281, 10860, -6105, -8976, -5377, -11691, -1103, 173, -3313, 6451, 8040, 10670, 7837, 5460, 14642, 14719, 21506, 16432, 29979, 34273, 30976, 16674, 10297, 2236, -2808, -6809, -14842, -9972]
8526i972J0272J635J803L840M898Q272Q068J375o738p796n811j2967K616l298
8512c803p834o680N45J1127P283O413n113r410j2598m087l723O076J0544J5384
8498D124k8j2974p335L305J3674J8412M15j4116k084k260p94Q552o345r924m259
8483a1637J864P805R36Q2m897r28j0905j7616R689K4107j1146o432m10m133p470
8468c1091J8506J7624P274m312j6047m689R45J1310N010l114J296m03q389K767
8454c313L289j731J751n124m981P206k036l594N350L14P12m048l022q58L201J1107
8438D223l630N044n243O559R241Q280m241j5352q427P39j377J613o434o837j797
8423a7639Q431j934O917J7947K775k0081J647M315K280o353p079j271P054M565
$$ y = [-9972, 300, 1935, 3738, 7578, 12476, 20748, 28816, 30191, 23453, 15657, 9846, -3121, -505, -3803, -11637, -18317, -17772, -6645, 638, 7051, 1938, -7472, -20070, -24157, -27880, -21804, -11260, 4124, 4096, -8878, -16213, -12908, 766, 19178, 19593, 5477, 3393, 1133, 339, 8891, 2546, -7378, -11637, -9773, -1968, -1032, -950, -5847, -6775, -17680, -35296, -25607, -1500, -12646, -19078, -19488, -23621, -31091, -12585, 5039, 12313, 8001, -8046, -12735, -11790, -480, 4530, 1416, 2712, 2309, -6080, -3313, -24, -1755, -4, -5128, -10109, -2903, -4939, -8533, -3183, -2869, -2157, -6205, -9227, -10085, -6884, 4223, 593, 5637, 394, 6953, 16194, 24474, 20233, 4881, -3546, -2807, -4184, -2571, -9005, -15842, -17639, -9208, -11142, -4225, 13722, 16497, -3584, -1937, 2378, 4658, -1695, -8774, -10045, -2991, 1574]
8409A574K617L584k745k874j0480j590J830R956N991q254r718L142l12R86M636
8394a657l435J459j0845P91M53j518k768R361N292J1022J6947L047m704j0579
8380A2866Q182j369j3944K869j220k772M928l106p380n120o312Lj0699j1957M357
8365c0674M051N092k882r405L654J0995J9413O710K955m024k39K701O128n952
8351H523p820J131J0582L699r490p010o776L474j008J597J474j017M346J8671
8337B0376M570m299q231j9189O69Q220j3721j0257P358J4260j889j542N528l435
8323a582K878j544O787k674n492O458n617M007R700o359j1784L018L570N10o27
8308A249j1548j2290J2204J6510K1483J949k1143j3551o162j8635N856O91Q32
$$ y = [1574, 4191, 7775, 5030, 2156, -8324, -9914, -8084, 1872, 7863, -391, -10109, -6967, -7279, -6293, -1657, -5092, -3633, -14478, -13687, -13234, -14752, -17520, -8159, -2867, 8155, 25102, 28149, 23445, 12866, 21048, 19679, 5735, 8604, 7384, 4612, 9540, 6434, -946, -6066, -12378, -12375, -23074, -35031, -30674, -26623, -21531, -24413, -33818, -30164, -19169, 244, 6954, 9909, 5885, 5646, 8347, 14475, 8523, 703, 1834, 12416, 16115, 6625, -385, -7161, -3687, -4695, -3098, -1624, -2641, 1705, 20376, 24946, 20647, 12416, -6773, -6104, 2116, -11605, -21862, -14504, -244, -2133, -3675, 1853, -1582, 1296, -248, 6539, 3865, -1627, 4831, -786, 3221, 12921, 6562, -5222, -2204, 1366, 1876, 1249, -10299, -22589, -10385, 6125, 27608, 29557, 8414, -5137, -11299, -29934, -24078, -23387, -22555]
8295b2555J0504o17Q554k686J235L648j537M4k503K062O681N55r342j19j049J5228
8279H103M348p867j0957j5575J526J5588K516j4291o78N709l82k68J2659J2745
8265A3176j4860n918J002K344n61m13j0311r328N296Q278N272O612J1416l492
8251H513J6155P935j6109j0528l934k694q287k041o379o974Q458J751N944M995
8237c195l286j4985p786O117O805p568L933J6042L531j0514L320J1916n10j969
8223A851q7l226j3294N957K310R155M289K313q55r456p73L933N43k726m243L392
8207i17J3969o381l349n624m811n862j348m915M906K0178M913n840p940J1964
8193H943Q508r650p20r638j5662r413J3799N255N393R72j038k010J4239N584l863
$$ y = [-22555, -12051, -12668, -4114, -6800, -5565, -1917, -3454, -3410, -5913, -3851, 2830, 3385, -5957, -6076, -7125, 8103, 12451, 4584, -6373, -21948, -20422, -4834, -2318, -16609, -17287, -11578, -11960, -12228, 431, 13176, -1684, -7602, -6600, -4256, -4817, -5230, -15541, -24869, -19573, -11295, -6023, 589, 12005, 8513, 24668, 32603, 16494, 5966, 2032, -662, -8949, -10990, -17369, -24343, -15885, -14134, -8190, -3195, -6481, -21466, -29252, -23135, -16330, -23898, -19965, -3923, -392, -10906, -7586, 4330, 3820, 1851, 1764, -1462, -14756, -8799, -6489, 2666, 6955, 9268, 8413, -1043, -1816, 2117, 2660, -66, -4309, -917, 13052, 6671, 3322, -2302, -7113, -12975, -14323, -19238, -14332, 5846, 10759, 4919, -3021, 8943, 17451, 7801, 7081, -2557, -18219, -27632, -13833, -8578, -3185, -2213, -3251, -5261, 8978, 14562, 10699]
8178A0699r895j266J223l054j6973K286K0238P48o42R72r049j0952N782q564j987
8163b0434O194j867L143j845k436L149m551L658K088o892J4361J564L378j105
8149a595J187J1016R679j2483q244K097K997N728r813J517Q78L949L561l562r31
8134E981o17q024j780j332O714k88m098j0480p783O440N335N022p21L057p170
8119i744J395N704L290k45m152J667J5448j897q645J751Q88J996q903P391p547
8104a603M29P63O51o437o779N078J5386R394P059j1477m788K532j0486J06J2154
8089A1982j1706L949l156M01R52j505M810o979n890p15J1916N163q057K653m488
8074f70k677l010j8953k903J2454N142J541L744j1K044M460Q286M471R05j368
$$ y = [10699, 804, -462, 761, -2293, -19266, -16980, 3258, 4006, 3364, 4336, -4713, -15665, -9883, -18447, -20434, -14240, -16107, -12964, -14809, -17245, -14096, -18647, -14989, -12901, -19793, -5432, -3868, -490, -1595, -408, 10608, 20287, 7804, -440, 1657, 4654, 10382, 569, 2086, 2964, 6913, 10474, 6912, 5981, 5364, -2660, -4440, -5772, 942, 654, -3444, -13924, -21707, -15267, -9932, -4910, -5631, -2574, -9744, -8349, -2645, 645, 400, -3752, -2085, 13363, 11466, 2821, 4572, 5460, 7456, -1447, 5944, -1603, -1174, -411, 240, -6197, -12976, -7898, 7488, 16882, 23941, 12464, 7676, 10208, -278, -172, 11982, 276, 4225, 1069, 1470, 2422, 917, 5727, -1252, -7142, -7857, 4059, 9222, 1165, 3818, -670, -3347, -6357, -25310, -28213, -15759, -10617, -9076, -5332, -5343, -3299, 1161, 9447, 13918, 14823, 13455]
8059A3455j6683k558M143K405j09k59j5632j417L44n846j008J3886J5896o605
8045A2k003J0276Q251o617J468M163j236p058j363K2494K17k7392o637Q482j8235
8030a5178N586J6076J07J598Q96j7310Q764O122j487J6171m495K610n400L280
8016A7340n839q203q747l60Q980K109N776N750J48q261j1643P930Q438j3828j0399
8001a0809J2271k540m013p775P66J866O636Q540O035L156o097O757r98j7866m296
7986h367p3P853p42n634J968J5387n116l594j814J4698m892m7N080k562j318n150
7970E677J0955R871K184j6080j4963r944n263m330j988J3079l710L555J0462J1677
7956A1182q114r316j864R207J1311Q709j784p594o6J055q980k110J8131K11K35
$$ y = [13455, -3228, -5786, -1643, 762, 653, 394, -15238, -16655, -16311, -22157, -23165, -9279, 6617, 12, -1991, 8285, 16536, 9919, 11387, 15550, 14314, 7256, 5893, 28387, 28604, 1212, -5425, 3057, -15178, -9592, 6484, 6591, 8189, 9085, -8225, 539, 6661, 5174, 21345, 16850, 19460, 14060, 17340, 11501, 3298, -5449, -5809, 3171, 5280, 11056, 16806, 16954, 8693, -2950, 4980, 13418, -410, -10809, 1462, -1078, -5091, -12866, -12100, -10234, -3598, 4942, 10977, 14133, 8036, 14793, 13795, -4071, -8367, -8440, -587, -1329, -6963, -4995, 10392, 5276, 1682, -132, 14566, 9674, 9627, 14707, 12145, 10827, 5677, 16632, 26503, 28687, 12607, -2356, -12300, -17563, -21893, -23881, -10802, -14512, -10957, -495, 11182, 3068, -6248, -8112, 1095, 12406, 21115, 19331, 11737, 11671, 12726, 3746, 1636, 19767, 19978, 20213]
7941B0213o835q176N529K07R589J5078q71j1709J1631N588Q579j904j6625j8880
7927A1414q76J538L918J3843K651j6751l338N87k743j5819j5355J69J027J3549
7913f186N397L592L722o233j1451o628K2500J2323j6037q208K514k663K502L864
7899i92R695R612j2441K912M253O844O324m383P197m457j3663o570J2873N85j0408
7884G381n132N482M37n647K618j0764m885K0386l277k417K551l066P209J3282
7870B4158j728l062j5767l665m406m93N987J5852j0477j4523q987j0207M558O616
7856a6144J8206J7783l257j0860j19P322j5997q072M634O080R550J1130N71P253
7842B8080K500j5562L106R653j971j1207M141n317j782O045N06j0192j7193j0285
$$ y = [20213, 13378, 5202, 10731, 10938, 20527, 35605, 34734, 23025, 34656, 40244, 48823, 46919, 30294, 11414, 10538, 12076, 15994, 29837, 32488, 15737, 12399, 12986, 10243, -5576, -20931, -20762, -19735, -6186, -789, 2803, 6525, 292, -11159, -17787, 4713, 17036, 999, -7209, -4695, -7358, -4856, -992, 8703, 18315, 5874, 8786, 13039, 19883, 26207, 21824, 29021, 24564, 10901, 4331, 17204, 17789, 7381, 2249, 7731, 8168, 2521, 5139, -5625, -10510, 9876, 6599, 4182, 6733, 3667, 10876, 24158, 22430, 19368, 3601, -64, -4470, -4963, 1024, 16876, 6399, -8124, -17111, -27318, -22760, -16144, 2062, 19845, 16588, 5728, 5609, 12931, -3066, -11138, -6504, -424, 9126, 20256, 20827, 28080, 30580, 15018, 18124, 27777, 25806, 14599, 18740, 13423, 11641, 17686, 18192, 8000, -9193, -19478]
7828a9478Q88m764K922M720O989J9391J2805j2942q537j1148l764M406K494L305
7814b713P630o001M322R664j6015n742O44n187P805J4987K556k894Q718o58o479
7799A0637l355R217p75j9401o789N794O384J3320r727J404J091K715n285j9031
7785a3801l763K79q399K0138J6879k318j2421p033R388R023J213O844j447M277
7771A8859j0164o091j8981l704J4707M516p859J2254L83p806O958K904j67L177
7757H986P474j5641q015o619q995L373l038K0533J0881O623N05N89j963l893J911
7742A2711m647j0887j7437m799J289Q091K848j5292p254K818P030M948m66k720
7728b3767n258L082J0416J029P73l037l322L283Q080j541j477M809R24o733l671
$$ y = [-19478, -18590, -23354, -20432, -15712, -8723, 10668, 23473, 10531, 1994, -9154, -12918, -8512, -6018, -2713, 4917, -1084, 3238, 12902, -3113, -8855, -8211, -13398, -5593, 9394, 11950, 9056, 17774, 17116, 10637, 7282, 16499, 15724, -3677, -10466, -4672, 1712, 15032, 5305, 6709, 7800, 10515, 5230, -13801, -17564, -17285, -25684, -5546, 11333, 9015, -3406, -10439, -1051, 7972, 9185, 16029, 14582, 18859, 8695, 2604, -16377, -20081, -5374, -858, -8717, 3537, 3920, -3886, 3072, 5976, 5809, 8986, 16460, 819, -7196, -13815, -22810, -19437, -22475, -1942, 8939, 15562, 16067, 16656, 14693, 10800, 12711, 8064, -2823, -20260, -25059, -23770, -15679, -12831, -28123, -35377, -32559, -25529, -20581, -21047, -23767, -29025, -25943, -15527, -14498, -13725, -16762, -20084, -16801, -8721, -10262, -11739, -6930, -6006, -12739, -16410]
7713a6410N999O782K393L533L564r68o746N777k935l231j3024L247k812l472J2033
7698f270J2300L819j3430M812l659j428k538P149Q468p287r386K932P125R48N702
7683I257L714n617j5529j6915N489O594P288r19n841O437Q863q799Q561N03O934
7668A0020j6447j1983m499J1620J0028q523M3o925K155j710J4417J2747K42m815
7654F370J0482J61q603n682r587m9Q350L473j3114r934K493n950r001J1549K0605
7639A563J879r210m609j573J82m591K433m57Q110Q595M152n368q950n120P054
7624e910L187l300J3521J1959k941k5856j942J0484l892j1927j1069j446P731
7611b1401P862P27o68K268N376R610M529R258p420k2386k655R530M97r44J1376
$$ y = [-16410, -10411, -3629, -1236, 2297, 5861, 4893, -1853, 3924, 989, -2242, -15266, -12019, -14831, -18303, -6270, 6030, 9849, -3581, 1231, -2428, -3856, -6394, 755, 9223, 1936, -7450, -4518, 2607, 3555, 9257, 12971, 7354, -8175, -25090, -19601, -13007, -5719, -6638, -12479, -6042, 2821, -5978, 2583, 3086, 10020, -6427, -18410, -22909, -11289, -1261, -9784, -9741, -16666, -14511, -16221, -1804, 10943, 11185, 6370, 16852, 17013, 8410, 2728, -6859, -6908, 1442, 4915, -8199, -18133, -15640, -21590, -30591, -19042, 1563, 3442, -5768, -10377, -11950, -11768, -16359, -13926, -14383, -6273, 2322, 6474, 1106, -7844, -12964, -5910, -2723, -6023, 7498, 19457, 16516, -9340, -11282, -798, -4690, -16617, -27686, -29132, -21401, -13539, -12812, -13480, -11212, -5836, 3774, 8303, 17561, 10141, -12245, -14900, -5370, -4873, -5817, 5559]
7596E559M757j1678n910j0565J1113O870l027o06P619M232P322k177j0781l926
7582a198r247j1811r490m810P505k867K997J4986J2325K994N360k483j961m301
7568b001j5776p870J4160J0237k0230p875J3885L307Q862O74q036p383Q976Q09
7554h261J6459J0586m258j3139m033L455K59o440k68K825P091J970l082M129n340
7539A953l365N14p574k454L440k879j1931j045O143J5631N013o845l296L578n990
7524i107j530p647k678J4563P559K09q026l146p42o641R050l191O384R752m074
7509G35J3240j339n67j6579k9033o623J8825R057P66j6474j0856L170P907L757
7495b4014L939R840J7026M011o29l589j3938p181n561J2309O906J4774M855r495
$$ y = [5559, 10316, -1362, -7272, -17837, -6724, 146, -2881, -3487, 4132, 8364, 15686, 13509, 2728, -1198, -10445, -22256, -31746, -36556, -29051, -31918, -28921, -13935, -1610, 1384, 6744, 4261, 2300, -2001, -17777, -25647, -11487, -1250, -21480, -29355, -15470, -12163, -3301, -2627, -10663, -18046, -9070, -8261, 8198, 18784, 14526, 1387, -2646, 809, 1068, -5372, -5640, -2815, 4276, 6246, 3164, 7293, 1953, -1412, -898, -8472, -10926, -7486, -10365, -22296, -23341, -17198, -1567, 3446, -3399, -6695, -3117, -9107, -10637, -18284, -20962, -6399, 1160, 1369, -6657, -9803, -10545, -17186, -8136, -11327, -4943, 4809, 735, 13975, 12636, 12069, -4510, -33543, -40166, -21341, -12284, -11518, -27992, -38848, -35678, -27771, -24014, -20075, -10235, 6791, 10802, 10173, 6584, -7354, -14535, -20096, -7787, -881, 13893, 18748, 9253]
7481I253j4619K120J926n956o712J655O479N64l284P967j9649n552j653J5798
7467a1663J7873J59o92k199n643N784J5461o349j5876L794L50R689P153j440o167
7452A0234r587j103n438j2584Q681q511n735R176J999N936l857J03J4065K589
7438E968r63L844L499n016p820Q10k44J497R952k061j2128k425J0404p426K147
7423C8o039Q253J542m362J1530%j0967N656p726j9426o496L701p27J0217J0735
7408d071o321j542L384q987l937J74P368P024O939j2667p144K533N125L358P407
7393a357K662J4404p51p822j237o091M83L133j233n149J4736m68n841k297N212
7378H384K151o491o15o269j7576m99m619o826R769J0044J4378J006L314Q709K301
$$ y = [9253, -5366, -3246, -1320, -7276, -13988, -12333, -5854, -5290, -8574, -607, -20256, -25808, -27461, -11663, 6210, 6369, 5677, 3478, -2165, 3619, 19080, 12731, -3145, 649, 999, 10688, 17841, 16401, 10234, 647, -456, -5894, -18478, -9797, -18308, -24043, -14867, -12868, -6932, -10789, -10686, 3379, 5968, 5005, 8849, 12348, 7332, -488, 322, 78, 1575, 11527, 9466, -2662, -5087, 5317, -2109, 38, -6001, 2252, 3794, -568, 10962, 10962, -5, 5651, -2075, -21501, -27997, -24296, -25023, -14806, -4071, -10392, -11934, -8550, -17537, -21474, -21300, -13932, -6908, 31, -12636, -19780, -17247, -12122, -8764, -1357, 1305, 15709, 14958, 7136, 5899, -192, 291, 3424, 2191, -2958, 11778, 11310, 5469, 3172, 8384, 10535, 4044, 3429, -2840, -20416, -20915, -25534, -32360, -22591, -12547, 1831, 2837, 6151, 14860, 17161]
7363A7161n950q248p652j1622M326P706j1569j384J2449J457q563K593L024j2159
7349a8431l10j0419M089o22p204O471L592N214N659L284J800R911m03O354l895
7334E090m877n687n837r105O742J2329N312Q51o556p436l441l240o356j398Q253
7319a5356j005j141J0479M772o592M817M686J808K155J1672L625j0327O14m958
7305E249R89O023p936j984N173j2797j5743N731P888M350P895o473l750J716O285
7290B616m905j119o96j5023j0049N862J4675p610j1067P237J8345J2415N87o025
7276E243o251J435M416j593o864p25M17q517k488j31M95k339N655M686J0231L065
7260F735k136J284l921L615P184r895k3164n155J8108l087r276o113k630J1443
$$ y = [17161, 11211, 2963, -4689, -16311, -11985, -4279, -15848, -17232, -4783, -3326, -11889, -9296, -6272, -18431, -18741, -29160, -25071, -25693, -32897, -26426, -22834, -17620, -11961, -8677, -6877, 3034, 2631, 8985, 5090, 213, -5474, -11311, -20416, -13674, -1345, 3967, 4818, -1738, -9174, -12615, -15855, -22211, -23609, -15356, -16361, -17502, -7023, -2251, -8843, -4026, 660, 2468, 4623, 16295, 19920, 9593, 10207, 5249, 6238, 12261, 4325, 2341, 7514, -5283, -21026, -15295, -7407, -3057, 4838, -1635, -5385, -3669, 2616, -2289, -3408, -4104, -19127, -29176, -23314, -8639, -16249, -27316, -20079, -1734, 10681, 11268, 5243, -1008, 427, 4843, 3250, -3614, -4339, -3922, -12439, -14927, -15058, -14563, -16902, -11247, -6561, 3670, 6735, 4599, 5883, 1962, 5577, 12761, 2866, -20298, -25453, -7345, -10432, -19708, -25821, -28451, -17008]
7246a7008O386R68n443q608J307M729l48J3477K829o598M805L913K339k309K301
7231B740j816q161k302q23J455o697N988p669J32j5528K050J3138K566j2600O559
7216b0968J7994J3566N983M319j421j1772j503N410n392j5709J0552K4155K381
7203B7595j8834k802K912j3506q478o264Q453j1215p891J0287J582J114J6029
7190a018P249K53j0110r394N467k268q019K250P994r99o802j51l033O268j571
7175a3884M558p49N134M177l216J288k573j3726q07M160O504q701p699Q948L762
7160a2824L1J5759j0570n099j609m533l261l903j0317J283j435K399P457n097
7146c1719l155J207J1624j3752j711J0711N710N34L310J796J5890R051J791n870
$$ y = [-17008, -10622, -9654, -15097, -23705, -22398, -17669, -18017, -4540, -1711, -8309, -3504, 409, 2748, 439, 2740, 924, -7237, -9539, -10362, -8907, -15604, -9616, -17285, -17153, -32681, -30631, -17493, -14927, -27527, -20968, -2974, 10592, 16575, 20894, 19473, 7701, 6198, 11608, 6216, -9493, 1059, 25214, 27595, 8761, 5959, 8871, -4635, -13113, -19377, -10924, -22139, -30030, -19743, -18161, -17047, -1018, 6231, 6484, -3626, -13020, -7553, -9821, -17840, -15590, -7596, -8595, -15397, -15548, -18581, -12313, -13884, -9326, -10075, -4941, -764, -3980, -2692, -5265, -18991, -19798, -15638, -9134, -17835, -25534, -16586, -12824, -12793, 2966, -7604, -12703, -14312, -18845, -22106, -26009, -36326, -35043, -36478, -34079, -26622, -31719, -34874, -33667, -22043, -35795, -37506, -26795, -21085, -20551, -17241, -15445, 445, 9496, 11287, 5417]
7132E417n333M740n95M487J428m984Jo027k088O250L943q075n89J044o862K455
7116d788l865N127P270n779l753k273L380P128j068o3l4j530R228m576r032N012
7100C84O757N910K416J1931m864q144K868l162j7404j1717j709j276l063M421
7086a6652Q780M403J556m512k0949j2448J399J7154J4234M305k030N513L058N585
7072I396j5502Q912J372j644N263m279j9413m336j16O253P678m779L07J4827J1766
7057A5705o05j3663M483L712p884j3949k917J745Q022J0627o438M391R723n627
7043G325r006JN349Q258L489K756j4180o720J770P375N248o441k3536m576L26
7028b2562J155J2295N796r090k672J1824J1092l923j2002J0589q729r217M538
$$ y = [5417, 84, 4824, 4229, 8716, 10144, 5160, 5161, -866, -2954, 3296, 7239, -836, -1425, -381, -7243, -4788, -8653, -3526, 3744, -2035, -5788, -8061, -4681, 2447, 1379, 1316, 1282, -248, 8980, 4404, -4628, 384, 7141, 13051, 15467, 27398, 22534, 14390, 17258, 14096, -3308, -15025, -16734, -18010, -21073, -16652, -7872, -3469, -1913, -6425, -27374, -39822, -38423, -21269, -7035, -2730, -4760, 753, 3811, 9396, -6106, 2806, 4178, 2534, 7797, 3518, -15895, -20231, -20347, -14094, -6416, -11195, -10888, 3939, 15705, 15100, 1437, 5920, 9632, 1748, -12201, -15118, -13373, -5351, 5276, -1162, 3229, 12952, 7325, -1681, -1680, 3669, 11927, 15416, 18172, 3992, -2728, -958, 6417, 11665, 5224, -18312, -22888, -22562, -21407, -9112, -3316, -12406, -15078, -3254, 7838, 3915, -8087, 2502, -6227, -15444, -10906]
7015a0906J6628M572j6132r446l008P205j606K662P177N525j799j2345j1534K524
7001b0483J3819Q545j519P313p146m232m034K106n288K671Q667p561n781r741
6987b2664L807q502K518M928M704j59J822J699K557J599J1635J432j235N663o919
6972B885j3279q962K512j644o870J1269k361M731J6100M37n223O588J789o559
6958A413M079l865j3290o033K852J1021K671j1776l483L87M686L916P37m446L779
6943g352K251m434N46n565j19M442j143q446J814Q950L215P352N729l06q191p858
6927i115L771R43l020j059L212m710J0314P470M018O870l870j1076j5126o205
6913a7583o148j3002Q357K0126J3977M232p260Q516M992n433r490r928j0986j643
$$ y = [-10906, 5722, 10294, -5838, -15284, -18292, -11087, -12693, -10031, -2854, 2671, 872, -11473, -23007, -20483, -6664, 1881, 362, 7675, 529, -3703, -7737, -5631, -10919, -8248, 419, -7142, -12923, -22664, -18857, -27359, -24841, -19913, -15209, -15368, -13546, -11847, -9290, -7691, 3944, 5376, 4141, 9804, 2885, -10394, -19356, -16844, -18488, -25358, -14089, -16450, -11719, 4381, 4818, -405, 6183, 7972, 1413, 5492, 1627, -11663, -17696, -14844, -3823, -1152, -12928, -16411, -16024, -11338, -7422, -6685, -11131, -7352, -5101, -9535, -8989, -14554, -14673, -10231, -11374, -19820, -18006, -9056, -5841, 1511, 7240, 6934, -1257, -9115, -5344, -4401, -7421, -8480, -5268, -9978, 336, 7806, 11824, 18694, 14824, 3748, -11378, -17583, -23731, -36733, -28376, -8250, 5727, 9959, 2699, 11215, 16207, 10774, 1284, -8644, -19630, -21273]
6899b1273J9733K277K323p114j0713M101M246L658Q734P210o601k408l741J362
6885A794L207M125N006l097K751q606r064q808j596Q421K0281M204j3243j4017
6871h642k216m274m677p417J3746J4803K158Q004R864K496p416p471j5595k0493
6857b7130J882R510R71n214J3125N389j3648K240m381l123N939j594o594K228
6843b0400O677R238J404J334r322J4962K746n261j984r10M27j1416k912M638K551
6828h228r512J921L364L464n329m620k871k904J2108M972R971m315J725j2201
6814a2455r78P782q505o678j563J6459J1142M984j3408j8247l074J4687J3039
6801C185O034j561j0588n156M044K059j40R022k912q743n807P273P587L99N72
$$ y = [-21273, -1540, 737, 3060, -4054, -14767, -10666, -6420, -2762, 5972, 13182, 6581, 4173, 432, 1794, 5001, 9126, 14132, 11035, 13786, 5180, -3884, -12692, -14288, -5867, 14414, 18618, 5375, -8642, -10858, -15132, -19809, -27226, -13480, 1323, 3481, 11485, 21349, 23845, 16429, 8958, -6637, -27130, -25248, -15738, -14767, -19981, -6856, -1467, -15115, -12875, -17256, -20379, -14440, -16034, -22628, -20400, -13723, -4485, -3081, -1747, -11069, 3893, 6639, 1378, -606, -1516, -1089, -12505, -15417, -10779, -8228, -17740, -15819, -12455, -8991, -14320, -18940, -21811, -24715, -12607, -7635, 2336, -1979, -254, -12455, -13433, -5651, -14156, -20834, -22397, -5938, 5204, 10188, -3220, -21467, -24541, -9854, 3185, 9219, 7658, -2930, -8086, -4042, -1983, -2123, 6899, 3987, -4756, -10563, -3290, 4297, 4696, 5268]
6786E268M048o987r325j785O811p491K2412N476j7363p919j4611j8523M15O375
6772c3199J8804K4775M72j9097j1275J1051K0302k629q773r343m432N581l795
6759a1558j0075K375J1133o16L168r19J1647l753l349L187J343j313j0577K759
6745f548P851K94q263p708M450m090P191N803L972o259O303R070J942j2624j4043
6730a2659J4761Q098j0993r041J300N661N312q149j216m61N592M58p853J782l163
6715a0571R792K934o189J0304L299Q00r88l549N307M359n68J640K1422J2353Q187
6700E8532K3396J2354R15j4895k1252l0543j7597M364O2K723r24j9027j2954j1654
6686b6500N145O216p56P371M68M445j9185k756O437k805Q849K4206J020j0276
$$ y = [5268, 9316, 2329, -6996, -8781, -1970, -9461, 12951, 18427, 1064, -6855, -21466, -39989, -39574, -33199, -14395, 10380, 10852, -8245, -19520, -8469, 11833, 9204, 431, -8912, -13344, -7763, -11558, -21633, -19258, -8125, -8741, -5573, -6492, 5155, 1402, -1947, 1240, 2583, 1270, -9307, -6548, 1303, 1597, -6666, -14374, -9924, -14014, -6823, -1020, 2952, -3307, 2996, 12066, 14008, 1384, -12659, 2102, 10200, -793, -9834, -8534, -2873, 2439, -5710, -6926, -7387, -1795, -1337, -9190, -7408, -10571, -779, 2155, -4034, 6270, 9569, 10369, 9381, 5832, 11139, 15498, 14930, 16570, 37992, 50345, 58532, 81928, 94282, 95197, 80302, 59050, 28507, 10910, 15274, 15336, 18059, 17135, -1892, -14846, -26500, -21355, -15139, -15895, -8524, -8056, -3611, -22796, -25552, -19115, -21920, -13071, 11135, 12155, 1879]
6672A879o91K434k447M835j754k934m565r624k997p101P083K5991N546q81o891
6657G883q45k242l988P2K605m070p091o295J364O296j1536l326L412N025K83N827
6641f626J0654l540J981P737j5004Q137R962o551j417O91k352n51j5244o962O664
6626a2421m087m201N931R472R943q845J802J5860J0915r309j0512r516p630J0714
6612a884M636j0865m389P01n912r827N455J3149O124K205K683k939j5120L965
6598a2018O010N060j0521j0319K425r3q689K360J6238R215j0820r788J3824O990
6584a26K154m658K458P99P359j73p356j358O843j0847n627j367j0311n192M377
6569b3025O109Q328J4679n209k220k422n872r040Q401N021L06Q670L129j7316
$$ y = [1879, 1188, 3622, 1175, 6010, 4256, 1322, -3243, -12867, -15864, -22965, -15882, 10109, 15655, 14774, 7883, 7038, 4796, 808, 880, 3485, -585, -7676, -13971, -12607, -6311, -17847, -21173, -17761, -12736, -12453, -6626, 4028, 488, 2469, 10206, -4798, 3339, 13301, 6750, 5333, 6024, 3672, 3121, -12123, -19085, -12421, -16508, -20709, -14778, -5306, 4637, -4208, -2406, 13454, 24369, 15060, 4548, -4968, -12598, -1884, 2752, -8113, -12502, -11801, -17713, -27540, -22085, -8936, -2812, -607, 2076, -863, -15983, -12018, -6008, -948, -11469, -21788, -19363, -19456, -28145, -25785, -9547, -332, -11152, -20940, -7116, -126, 2028, -2630, -172, 627, 7986, 7813, 457, -901, 5942, -4905, -10532, -11899, -22210, -27402, -23025, -16916, -8588, 6091, 882, -1338, -3760, -9632, -18672, -10271, -5250, -4944, 3726, 6855, -10461]
6555a0461j2172K185N560J732j280j492p075j8632J6244M635J471R409l92r306
6541a9574R41L013L832K78J518l104p789j868K839n162R559R862k825L616k689
6526g553K257R709j834M036n405q211K841K157J462L101j2092j879J3002j499
6512I2N560J4836m284j4465L499k815o210J662L218K117J6277j0616j5727L975
6498b881K400M761o837L72N357J3417L615o63j0498j4115J493Q096l73r381n856
6483a1093k815J5923K113q449o02P164j121k408l993k382j0729J79Q952p078J011
6468a5328L657O597m788j1655m930J1443J0758J4956j4089M539O676l456k15M329
6454H494M920J0004n504j9528R73k076o151o097o299O685J709N597P355J744L618
$$ y = [-10461, -22633, -20448, -14888, -13156, -14436, -15928, -23003, -41635, -25391, -20756, -19285, -9876, -10268, -19574, -18633, -15620, -11788, -11510, -9992, -13096, -20885, -22753, -19914, -25076, -15517, -5655, -8480, -4864, -7553, -5296, 4413, 2579, 6615, 1210, -7001, -4160, -2003, -541, 2560, -9532, -11411, 1591, 92, 5652, 20488, 16204, 1739, 5238, 2423, -3787, -2125, 1093, 3210, 19487, 8871, -6856, -2881, -481, 4280, -2557, -2185, 3172, 16589, 20204, 19541, 9043, -5072, -3579, 4517, 4144, -5237, -11093, -13908, 2015, 4128, -4321, -4923, 2241, 1120, -1288, -5281, -7663, -18392, -18213, -9261, -16339, -15328, -11671, -5074, -9862, -21517, -26447, -15004, -4246, 10710, -3379, 1160, 7836, 4380, 4165, 8494, 13414, 23418, 17914, -1614, -641, -2717, -8868, -14965, -21264, -14579, -12870, -7273, 82, 1826, 5444]
6439E444l61N957R520l619o193K689q01o41j5926m70M740j9025K477N722j520
6424a2007O596l960n304L634J6913Q329J2042q886n505L030L928j2783n123j0111
6410i207O076J1478r05j4913o863m530j439J998K713N779L260J74J2389j273K815
6395G552m719q531m847m476o654K387O865M871K024L457J364M384J4475j589m355
6380A2208P8K535j5455j5838k900P725L520M446k651J2208J816l695j972J577
6366C602o181K377Q843o409q281r917M980K479j3820O577K2346m73j2467o301
6352a2645J0216R559p183j3661N217l590M500N249k0384j2889P369R857m521K035
6338b0871J4861l313q172M054P448j917j6286m666k054P023J3530N746J2602K123
$$ y = [5444, 5083, 11040, 20560, 16941, 10748, 13437, 12636, 11995, -3931, -4401, 339, -18686, -16209, -10487, -12007, -5411, -9371, -14675, -11041, 5872, 14201, 26243, 17357, 11852, 14882, 18810, 6027, 904, -9207, -3131, 8347, 7442, -7471, -14334, -18864, -20303, -18305, -15592, -9813, -6553, -6379, 6010, 4737, 7552, 2833, -5698, -10545, -15021, -21675, -19288, -12423, -7552, -5528, -2071, -707, 3677, 18152, 16563, 12208, 12286, 14821, -634, -16472, -19372, -11647, -8127, -3681, -6332, 5876, 7692, 3997, 2025, 3602, -2579, -202, 8641, 2232, -6049, -15966, -10986, -8507, -22327, -15750, 6596, 6123, -6344, -12645, -2429, 7130, -53, -13714, -8497, -12087, -7587, -2338, -22722, -35611, -28242, -18385, -22906, -20871, -6010, -9323, -17495, -13441, -5993, -7910, -24196, -28862, -30916, -23893, -10363, -4617, 7985, 10108]
6324A0108o473j3275j6886J2191J7776j796j5876J245Q673N690J6218O329j5989
6311G935j7714J909R994k53P519R862j5431j5573N579N837m22o008l001J1438
6297A671P990j61k923l922J485R415J715m988o488o896j0N290p890L779P896j523
6281D440Mm516k59m793l0j837M307M128J0564j1180p107o611J8603J069n998J0376
6265A1160P692m190o206j177n925j1763n72J455M273O262l469N497j0769J332
6251f400N260N103P91o590j4029m961J0294O57Q222M441j500q284M675q825J0581
6236e65l689o74n873K736L766L911P748j2911l041J3279P518o261j2898k13P162
6221eP13q891j473Q854l030m269R54o020o883L096J35N480O76j0944N975j735
$$ y = [10108, 3635, -9640, -26526, -14335, 3441, 1645, -14231, -12986, -4313, 1377, 17595, 23924, 7935, -9779, -7870, 2124, 1871, 9390, 19252, 3821, -11752, -6173, -336, -758, -6766, -9767, 1671, 9661, 9500, 6577, 2655, 4140, 13555, 15270, 10282, 3794, -3102, -3112, 2178, -5712, -1933, 5963, 4440, 4444, -72, -331, -5124, -5154, -6991, -2684, 1444, 12008, 828, -6279, -12890, 5713, 6782, 784, 11160, 18852, 14662, 8456, 7279, 1354, -10409, -10981, -9526, -5253, 1009, -2460, 3037, -7732, -6400, -1140, 3963, 4754, -1836, -15865, -20826, -10532, -9875, -1653, 2788, 1288, -6996, -2321, -11146, -565, -4254, -4928, -10801, -8065, -4299, -388, 7360, -5551, -8592, 4687, 12205, 5944, -6954, -7167, -5, 708, -8183, -9656, -802, -3832, -8101, -7147, -13167, -20050, -16954, -16819, -11339, -10663, -21607, -15632, -17367]
6205a7367K014p984M776J2313J4050m942L472n037p070q089L938m210q778J4224
6191h690J4751J3930K483n087k657m570j1365P0O868K426o954L568j3923j366
6177a0516j982O794o737k4506j6346O206K1305L502M038M51K18n2O845J0480J3184
6162A2884L170j1819j280m119p431L268P808M336J075N911P145r730j0464j5634
6148a4880j2846M351M318M86P201L407M300l92P105j3226k2139J1491J3902K359
$$ y = [-17367, -15353, -23337, -18561, -6248, 7802, 2860, 6332, 1295, -5775, -13864, -9926, -14136, -22914, -8690, 6061, 19991, 22474, 17387, 14730, 10160, -1205, -1135, 5733, 8159, 1205, 4773, -9150, -10516, -12498, -5704, -12441, -36947, -53293, -47087, -25782, -22280, -18242, -17791, -17573, -17625, -10780, -300, 12884, 16054, 4235, 2955, -1164, -8595, -5327, 2481, 6817, 7892, 13803, 20948, 11218, 754, -14880, -27726, -23375, -19057, -18571, -11370, -7963, -3663, -4055, 3050, -10176, -32315, -20824, -6922, -4563]
$$ [...]
##END NTUPLES=NMR SPECTRUM
##END=
