##TITLE=Analysis number 315061
Compound Code fm 00044
Project Code adrs
Chemist Name ugmt ltd
##JCAMPDX= 6.0         $$ Bruker NMR JCAMP-DX V2.0
##DATA TYPE= NMR SPECTRUM
##DATA CLASS= NTUPLES
##ORIGIN= Bruker BioSpin GmbH
##OWNER= NMR
$$ XWIN-NMR		Version 3.5
$$ Fri Nov  4 11:04:09 2005 GMT Standard Time (UT+0h)  MAYBRIDGE\NMR@NMR_250MHZ
##.OBSERVE FREQUENCY= 250.131544655141
##.OBSERVE NUCLEUS= ^1H
##.ACQUISITION MODE= SIMULTANEOUS (DQD)
##.ACQUISITION SCHEME= undefined
##.AVERAGES= 16
##.DIGITISER RES= 18
##SPECTROMETER/DATA SYSTEM= dpx250
##.PULSE SEQUENCE= zg30
##.SOLVENT NAME= DMSO
##.SHIFT REFERENCE= (INTERNAL, DMSO, 0, 16.522)
##AUDIT TRAIL= $$ (NUMBER, WHEN, WHO, WHERE, WHAT)
$$ ##TITLE= Audit trail, XWIN-NMR		Version 3.5
$$ ##JCAMPDX= 5.01
$$ ##ORIGIN= Bruker BioSpin GmbH
$$ ##OWNER= NMR
$$ C:\u/data/dgb/nmr/ADRS/11920/pdata/1/auditp.txt
$$ ##AUDIT TRAIL=  $$ (NUMBER, WHEN, WHO, WHERE, WHAT)
(   1,<2005-11-04 11:03:32.07 +000>,<MAYBRIDGE\NMR>,<NMR_250MHZ>,
      <created by zg, POWCHK disabled, PULCHK disabled
       configuration hash MD5:
       62 19 C7 07 E1 42 D1 B7 37 6C 3D D0 77 39 F9 E6
       data hash MD5: 64K
       CE DD D4 25 31 BC 84 F3 5D EE DE 56 82 B4 32 FC>)
(   2,<2005-11-04 11:03:49.32 +000>,<MAYBRIDGE\NMR>,<NMR_250MHZ>,
      <Start of raw data processing
       ef LB = 0.3 FT_mod = 6 PKNL = 1 SI = 32K 
       data hash MD5: 32K
       DB 94 63 53 20 10 BA 7D 97 EF DF D0 A1 65 09 42>)
(   3,<2005-11-04 11:03:51.61 +000>,<MAYBRIDGE\NMR>,<NMR_250MHZ>,
      <apk 
       data hash MD5: 32K
       49 A8 7B F3 9D 2A A8 69 DF 37 26 7A 6A 99 54 9C>)
(   4,<2005-11-04 11:03:52.82 +000>,<MAYBRIDGE\NMR>,<NMR_250MHZ>,
      <abs ABSG = 5 
       data hash MD5: 32K
       D9 EF 6C 52 D5 07 DD 99 4C DC 6C CD A3 2C 46 2A>)
$$ ##END=
$$ 
$$ hash MD5
$$ D2 8B 9F D8 87 5A 9E F9 F9 66 72 11 54 28 04 12
##$RELAX= 
##$RELAX= 
##$RELAX= 
##$RELAX= 
##$RELAX= 
##$RELAX= 
##$RELAX= 
$$ Bruker specific parameters
$$ --------------------------
##$DU= <C:\u>
##$EXPNO= 11920
##$NAME= <ADRS>
##$PROCNO= 1
##$TYPE= <nmr>
##$USER= <dgb>
##$AMP= (0..31)
100 100 100 100 100 100 100 100 100 100 100 100 100 100 100 100 100 100 
100 100 100 100 100 100 100 100 100 100 100 100 100 100 
##$AQSEQ= 0
##$AQ_mod= 3
##$AUNM= <au_zg>
##$AUTOPOS= <2 >
##$BF1= 250.13
##$BF2= 250.13
##$BF3= 250.13
##$BF4= 250.13
##$BF5= 500.13
##$BF6= 500.13
##$BF7= 500.13
##$BF8= 500.13
##$BYTORDA= 1
##$CFDGTYP= 0
##$CFRGTYP= 5
##$CHEMSTR= <none>
##$CNST= (0..31)
1 1 145 1 1 1 1 1 1 1 1 1 1 1 1 1 1 1 1 1 1 1 1 1 1 1 1 1 1 1 1 1 
##$CPDPRG= <>
##$CPDPRG1= <>
##$CPDPRG2= <>
##$CPDPRG3= <>
##$CPDPRG4= <mlev>
##$CPDPRG5= <mlev>
##$CPDPRG6= <mlev>
##$CPDPRG7= <mlev>
##$CPDPRG8= <mlev>
##$CPDPRGB= <>
##$CPDPRGT= <>
##$D= (0..31)
0 1 0 0 0 0 0 0 0 0.06 0 0 0 0 0 0 0.0002 0 0 0 0 0 0 0 0 0 0 0 0 0 0 
0 
##$DATE= 1131102210
##$DBL= (0..7)
120 120 120 120 120 120 120 120 
##$DBP= (0..7)
150 150 150 150 150 150 150 150 
##$DBP07= 0
##$DBPNAM0= <>
##$DBPNAM1= <>
##$DBPNAM2= <>
$$ [...]
##$SUBNAM7= <"">
##$SUBNAM8= <"">
##$SUBNAM9= <"">
##$SW= 20.6930455092707
##$SWIBOX= (0..15)
0 0 3 0 0 0 0 0 0 0 0 0 0 0 0 0 
##$SW_h= 5175.983436853
##$TD= 65536
##$TD0= 1
##$TE= 295.16
##$TE2= 300
##$TE3= 300
##$TEG= 300
##$TL= (0..7)
0 120 120 120 120 120 120 120 
##$TP= (0..7)
150 150 150 150 150 150 150 150 
##$TP07= 0
##$TPNAME0= <>
##$TPNAME1= <>
##$TPNAME2= <>
##$TPNAME3= <>
##$TPNAME4= <>
##$TPNAME5= <>
##$TPNAME6= <>
##$TPNAME7= <>
##$TPOAL= (0..7)
0.5 0.5 0.5 0.5 0.5 0.5 0.5 0.5 
##$TPOFFS= (0..7)
0 0 0 0 0 0 0 0 
##$TUNHIN= 0
##$TUNHOUT= 0
##$TUNXOUT= 0
##$USERA1= <user>
##$USERA2= <user>
##$USERA3= <user>
##$USERA4= <user>
##$USERA5= <user>
##$V9= 5
##$VALIST= <valist>
##$VCLIST= <CCCCCCCCCCCCCCC>
##$VD= 0
##$VDLIST= <DDDDDDDDDDDDDDD>
##$VPLIST= <PPPPPPPPPPPPPPP>
##$VTLIST= <TTTTTTTTTTTTTTT>
##$WBST= 1024
##$WBSW= 4
##$XGAIN= (0..3)
0 0 0 0 
##$XL= 0
##$YL= 0
##$YMAX_a= 365016
##$YMIN_a= -335628
##$ZGOPTNS= <>
##$ZL1= 120
##$ZL2= 120
##$ZL3= 120
##$ZL4= 120
##$ABSF1= 16.522
##$ABSF2= -4.171173
##$ABSG= 5
##$ABSL= 3
##$ALPHA= 0
##$AQORDER= 0
##$ASSFAC= 0
##$ASSFACI= 0
##$ASSFACX= 0
##$ASSWID= 0
##$AUNMP= <proc_1d>
##$AZFE= 0.1
##$AZFW= 0.1
##$BCFW= 0
##$BC_mod= 0
##$BYTORDP= 0
##$COROFFS= 0
##$CY= 12.5
##$DATMOD= 1
##$DC= 0
##$DFILT= <>
##$DTYPP= 0
##$F1P= 14.0000005364418
##$F2P= -0.99999901652339
##$FCOR= 0.5
##$FTSIZE= 32768
##$FT_mod= 6
##$GAMMA= 0
##$GB= 0
##$INTBC= 1
##$INTSCL= 1
##$ISEN= 128
##$LB= 0.3
##$LEV0= 0
##$LPBIN= 0
##$MAXI= 10000
##$MC2= 0
##$MEAN= 0
##$ME_mod= 0
##$MI= 0
##$NCOEF= 0
##$NC_proc= -5
##$NLEV= 6
##$NOISF1= 0
##$NOISF2= 0
##$NSP= 0
##$NTH_PI= 0
##$NZP= 0
##$OFFSET= 16.522
##$PC= 1
##$PHC0= 71.25191
##$PHC1= 9.440017
##$PH_mod= 1
##$PKNL= yes
##$PPARMOD= 0
##$PSCAL= 4
##$PSIGN= 0
##$REVERSE= no
##$SF= 250.13
##$SI= 32768
##$SIGF1= 0
##$SIGF2= 0
##$SINO= 400
##$SIOLD= 32768
##$SREGLST= <1H.DMSO>
##$SSB= 0
##$STSI= 32768
##$STSR= 0
##$SW_p= 5175.98343685301
##$SYMM= 0
##$S_DEV= 0
##$TDeff= 65536
##$TDoff= 0
##$TI= <Analysis number 999999
Compound Code 99
Book Reference 9
Project Code 9>
##$TILT= no
##$TM1= 0
##$TM2= 0
##$TOPLEV= 0
##$USERP1= <user>
##$USERP2= <user>
##$USERP3= <user>
##$USERP4= <user>
##$USERP5= <user>
##$WDW= 1
##$XDIM= 32768
##$YMAX_p= 371311625
##$YMIN_p= -862595
$$ End of Bruker specific parameters
$$ ---------------------------------
##NTUPLES= NMR SPECTRUM
##VAR_NAME=  FREQUENCY,     SPECTRUM/REAL,   SPECTRUM/IMAG
##SYMBOL=    X,             R,               I
##VAR_TYPE=  INDEPENDENT,   DEPENDENT,       DEPENDENT
##VAR_FORM=  AFFN,          ASDF,            ASDF
##VAR_DIM=   32768,         32768,           32768
##UNITS=     HZ,            ARBITRARY UNITS, ARBITRARY UNITS
##FACTOR=    0.157963299565203, 1,           1
##FIRST=     4132.6476996994, 0,             0
##LAST=      -1043.33573715361, 0,           0
##MIN=       -1043.33573715361, -862595,     0
##MAX=       4132.6476996994, 371311625,     0
$$ Real data points
##PAGE= N=1
##DATA TABLE= (X++(R..R)), XYDATA
$$ [...]
22801i842o7552j47226p3322J93293q8067l5228q989J10395J2869M0637M1562
22790c1470L233o734m9218P0360k04522k4927n044J45748j33711m8419q4680n7994
22778d27378J61418Q1607k5881K77530k1867J26094J03097k07427j93867N0157
22768g6517r7809m3055k2941j20708J40605K97835P5877J38213K16579j43672
22758C64407n2293j68311j99766j0974J48809o3856K7377P200l44342n3084K35137
22747a09696L4465o3688J65842J06241p7137j16633k4911J8182K7381j58418j01498
22736b99870N8531l1882k01617J34291K42901j5052r1703J0701R9223K17474K6519
22725A49516j18094j32652K52319n577j0256K7882j79622k81147n848K5437j0766
$$ plain form
22801 -9842 -77394 -224620 -297942 -104649 -192716 -227944 -236933 -126538 -113669 -73032 -31470
22790 -31470 -28237 -34971 -84189 -13829 -218351 -243278 -248322 -102574 -236285 -284704 -369384 -427378
22778 -427378 -265960 -184353 -210234 67296 45429 171523 274620 67193 -126674 -76517
22768 -76517 -174326 -217381 -240322 -361030 -220425 77410 153287 291500 508079 364407
22758 364407 312114 143803 -55963 -66937 81872 18016 45393 52593 -291749 -344833 -109696
22747 -109696 -75231 -138919 26923 133164 56027 -60606 -85517 -67335 -39954 -198372 -299870
22736 -299870 -241339 -273221 -474838 -340547 -97646 -112698 -204401 -193700 -94477 122997 149516
22725 149516 31422 -101230 151089 145512 135256 163138 -16484 -297631 -303479 -278042 -288808
22714b88808Q6411M8301q1329J24319n1830J43239R2317k64654K0119L28525J11431
22703B68041r6406N3479Q9548K9560J8123j99997M549j84622m0095N5487p021
22692i354O639q6267J2350M10705n1543j46952j80116J35025k7640J76706P6347
22681C15900l26498p4293P3244J48066K30006R658k47883j53194j19058N3608
22671i0444O3085j91744j29602J29892r846R737J19722m6070O7333R7369j29047
22660a09615J5755J53135O0217n6451J244m669m7515J30482p8754n902J00743
22649A58670J24239j05486q8951J19042J11004n6580j36439m908j13543p7132
22639g0084M8592J78620j21803r7954j66270Q323J20869J4536J06361K2690M7273
$$ plain form
22714 -288808 -202397 -154096 -235425 -111106 -162936 -19697 72620 -192034 -171915 156610 268041
22703 268041 171635 225114 314662 344222 362345 162348 166897 -17725 -57820 -2333 -9354
22692 -9354 -2715 -88982 -76632 334073 282530 135578 -44538 90487 62847 239553 315900
22681 315900 -10598 -84891 -11647 136419 366425 376083 128200 -24994 -144052 -90444
22671 -90444 -27359 -219103 -348705 -218813 -228659 -218922 -99200 -145270 -77937 19432 -109615
22660 -109615 -93860 59275 119492 63041 64285 59616 12101 142583 63829 57927 158670
22649 158670 282909 177423 88472 207514 318518 261938 125499 120591 7048 -70084
22639 -70084 -21492 157128 35325 -62629 -228899 -220576 -99707 -85171 21190 43880 91153
22628I1153N281p9997N5161J40235k22502j24362J27462P3482n7411l5508o3784
22617i0790j65507j54474j13225q535L21180L28701J10151j94980j19252k1922
22607a08653O4462j54290j07100R1899J95329L3625j8004K1261j5110Q8110M0799
22596A32328n6458p4752k4734k643J79371J18698Q2172j93026R0504j95844J5374
22585G0990j80261J47538M2226J23648M992J58336r752j43961l08202J03732j31343
22574a22057J16676o5415r1665n9762J81856R4729j87406K0357R9089J6973J64590
22563A67965k1805j39398j88452K58432M6058j25146j58654R8883j49922L18882
22553A06843j24397j72079K42170Q8559N5691l01353j60876J50381K31405R5405
$$ plain form
22628 91153 96434 16437 71598 211833 -10669 -135031 -7569 65913 8502 -27006 -90790
22617 -90790 -256297 -410771 -523996 -532531 -211351 117350 227501 32521 -86731 -108653
22607 -108653 -44191 -198481 -305581 -213682 -18353 15272 -2732 18529 3419 91529 132328
22596 132328 75870 1118 -23616 -26259 153112 271810 353982 160956 251460 55616 70990
22585 70990 -109271 38267 80493 204141 209133 367469 357717 213756 -94446 9286 -122057
22574 -122057 -5381 -70796 -162461 -222223 -40367 54362 -133044 -112687 -13598 3375 167965
22563 167965 146160 6762 -181690 76742 122800 -2346 -161000 -62117 -212039 106843
22553 106843 -17554 -189633 52537 141096 196787 -104566 -265442 -115061 116344 211749
22543B11749k27548l77939K06735K53187J55061k41597k84876r0587K59601J67968
22533C1754k6986q286J39527J39837n3545j04568k68418P7666P0893j52461r3300
22522b47887K42410J91941k24760k39322J08720J10824O3243j18430m3591k2223
22512a79075j6998J74140n3858J05515J04268Q3718k47452k15844k4089m0275
22502c09950M9561J53713J1860L1457l9714m2320J31940J42233J39299j6994J23531
22491C74616l3540j25480j47900r6087P3995K9960l37298R3774J55652J28176
22481A15868j4599p1052J18168o7395p1209q3530j78443j51597m9967J2236N7820
22470c83700l260J38080Q2709j37995J36743J20651j88065j22540P3233J30539
$$ plain form
22543 211749 -15799 -393738 -187003 66184 221245 -20352 -305228 -395815 -136214 31754
22533 31754 4768 -3518 136009 275846 222301 117733 -150685 -73019 -2126 -154587 -247887
22522 -247887 -5477 186464 -38296 -277618 -168898 -58074 5169 -113261 -156852 -179075
22512 -179075 -196073 -21933 -75791 29724 133992 217710 -29742 -245586 -269675 -309950
22502 -309950 -260389 -106676 -94816 -63359 -103073 -145393 -13453 128780 268079 251085 374616
22491 374616 341076 215596 67696 -28391 45604 75564 -261734 -167960 -12308 115868
22481 115868 101269 30217 148385 80990 9781 -73749 -252192 -403789 -453756 -441520 -383700
22470 -383700 -386960 -248880 -166171 -304166 -167423 -46772 -234837 -357377 -284144 -153605
22460a53605J29088J33584j25177m14126O4830Q0953Q5517Q6785k15429k07596
22450e35176j9452J90671K51020J37943Q4605M2943r5438J45732J40582j27372
22440B16058J08084O0752j02313j14285k41829j2259J55744N5337J54711J50592
22430D30592l25986j52051q2789Q8828J32851J30700J72393j33831P075j60581
22420A07201l92793N5255J25902L31560L03333N5978p8372q3694l4422o0159k1880
22409C07909j25148Q984j67021k10126l5057P0770K37925J6677J7368M3081j89246
22398b3884J88002M4772l3066q5797j5239M3258J41847J81443N3697p7079P323
22387D25277j27819j43659k00519j73372P1349k03803o7730o0500m3582J23302
$$ plain form
22460 -153605 -24517 109067 -16110 -430236 -365406 -284453 -198936 -112151 -327580 -535176
22450 -535176 -554628 -363957 -112937 25006 109611 152554 57116 202848 343430 216058
22440 216058 324142 384894 282581 168296 -73533 -85792 69952 125289 280000 430592
22430 430592 104606 -47445 -130234 -41406 91445 222145 394538 260707 267782 107201
22420 107201 -285592 -230337 -104435 227125 530458 586436 508064 424370 389948 329789 307909
22409 307909 182761 191745 24724 -185402 -220459 -149689 88236 104913 122281 165362 -23884
22398 -23884 164118 208890 175824 90027 74788 118046 259893 441336 495033 417954 425277
22387 425277 297458 153799 -46720 -220092 -148743 -352546 -420276 -480776 -524358 -401056
22377d01056N0528R8104N9144j16604j5374j51683l1790J23819P1035K08328K00609
22366I5060N0830J24306j6793j67992j68268J09335j9997m1283j72966P2775O8849
22355f6144R1986N5154j49274J1819L40707j9936m17470m12476o6699L7730J18350
22344d76253J19654J02813o7672q7907K13535L9991J75382M7688m3552j04464
22334h0785k0127J56095K7815r6136j5776K9984r2345k43831K7296R7474l7079
22323b47415K9828n5993l2006L760O9327P1246J9060K61980O2525M1791k4098
22312B00005r6430k82693j37726J31829Q9926O1911J48944j32871j87350P0144
22302a34311J55370O1493J84879p8496m0820j70344r8258K2110J03442o0264r1338
$$ plain form
22377 -401056 -350528 -252424 -193280 -309884 -325258 -476941 -508731 -384912 -313877 -105549 95060
22366 95060 145890 270196 253403 85411 -82857 26478 6481 -34802 -207768 -134993 -66144
22355 -66144 25842 80996 -68278 -56459 284248 264312 -153158 -565634 -632333 -594603 -476253
22344 -476253 -356599 -253786 -321458 -409365 -195830 -155839 19543 67231 23679 -80785
22334 -80785 -100912 55183 82998 -13138 -28914 1070 -91275 -335106 -307810 -210336 -247415
22323 -247415 -217587 -273580 -305586 -301826 -232499 -161253 -142193 119787 182312 224103 200005
22312 200005 103575 -179118 -316844 -185015 -95089 -33178 115766 -17105 -204455 -134311
22302 -134311 21059 82552 267431 188935 148115 -22229 -120487 -98377 5065 -55199 -146537
22291a46537J55159Q4660J53214o5521l23747j06218j7270J88977J30495l33283
22281b80071j99764J80892K52410L3780J0648J2243L9565P531j10766j44521o9594
22270b67647l6044l21621k8383K97132L06501o1590l3337j50547J77654L54672
22260B36790J63075N4406k09538r1282L9263Q3750R3969j98360j15624j3571J9266
22249F2144N778J5200j40122j16919j44768l4815L3687o5792O1329J69882K2881
22238a31515n848K36675M21775J54053l17694j36998l9517L5758j39356l55680
22228b78347k09180K68074K02999k0294K9850j3498K3442J65259k23428l51065
22218d06188l5472M03785J77190o9888k56533K2139m6365j12762o7622J50127
$$ plain form
22291 -146537 8622 93282 246496 180975 -142772 -248990 -266260 -77283 53212 -280071
22281 -280071 -479835 -298943 -46533 -12753 -2105 10138 49703 57234 -53532 -198053 -267647
22270 -267647 -303691 -625312 -653695 -356563 -50062 -111652 -144989 -295536 -117882 236790
22260 236790 399865 454271 244733 153451 192714 276464 370433 172073 56449 42878 62144
22249 62144 67922 83122 -57000 -173919 -318687 -353502 -319815 -385607 -324278 -154396 -131515
22238 -131515 -137363 99312 521087 675140 357446 220448 180931 216689 77333 -278347
22228 -278347 -487527 -219453 -16454 -36748 -6898 -20396 3046 168305 -55123 -406188
22218 -406188 -441660 -37875 139315 69427 -187106 -164967 -211332 -324094 -391716 -241589
22208b41589Q9574P8406j94092m5008P9027K29410k7153K5738L14434J35746M5089
22197D89582l76373k81268j46517l6619q1201o0167k6307L24825Q0158Q2105K83130
22186B51348j33929j59933R9728p4543L5502L0979j55702j32712j17390L5234
22176c21418K7362o451K16456j6087q3464N1123O2896R1660j31101l3616J10560
22165c2080O1219J60733k5678R2710r3901n2336k511L18688K67495J69824j97003
22154F67160k24114j36660p0452K2489l1359l5500r4963l12598j48425K21425
22144a42997K33234k11785k51752q2100n4211k0041J51506L35692K00495L1607
22134A89648q8701j7284J8982L6515O3743L6136J38566J35518k94709k86791j13728
$$ plain form
22208 -241589 -152015 -73609 -267701 -312709 -233682 -4272 -31425 -5687 308747 444493 489582
22197 489582 113209 -168059 -314576 -351195 -432396 -492563 -518870 -194045 -113887 -31782 251348
22186 251348 117419 -42514 57214 -17329 18173 49152 -106550 -239262 -356652 -321418
22176 -321418 -294056 -300507 -84051 -100138 -183602 -132479 -69583 22077 -109024 -142640 -32080
22165 -32080 29139 189872 164194 256904 163003 110667 108156 426844 694339 864163 667160
22154 667160 443046 306386 235934 258423 227064 191564 96601 -215997 -364422 -142997
22144 -142997 90237 -121548 -373300 -455400 -509611 -529652 -378146 -42454 158041 189648
22134 189648 100947 83663 102645 139160 202903 239039 377605 513123 218414 -68377 -182105
22123a82105R9148J43239O137k83541p6056r9371j24340L81637R2817O2820j23575
22112a03190l04734J2657L36694J94596r6281l5173Q4880L5131m1513L3654j32987
22101a6266o5224O3244k4653l10816J06534K11595j91533j15431L76715K05929
22091B40094j49114j10786J69242l8585r283j89032j43384k37302l04814M0682
22081g32282J84929L56512J50129K51164j01730R4351J11439j24304L5638j21841
22071A04005j84394k05972j19323J21719R1974K66227J1440O8789O1543R2426
22061C08434j99571j10920J3692J12455j37444k48817J79683Q2703q2582Q8292
22051E925j70824p2488M5999j11465K2089L78740J46815K1261j43722k01421j05376
$$ plain form
22123 -182105 -82957 60282 66419 -217122 -293178 -392549 -516889 -135252 -42435 20385 -103190
22112 -103190 -407924 -395267 -58573 136023 39742 4569 89449 124580 83067 116721 -16266
22101 -16266 -81490 -18246 -42899 -353715 -247181 -35586 -227119 -342550 34165 240094
22091 240094 90980 -19806 149436 110851 101568 -87464 -230848 -468150 -772964 -732282
22081 -732282 -547353 -190841 -40712 210452 108722 203073 314512 190208 225846 104005
22071 104005 -80389 -286361 -405684 -283965 -191991 74236 85676 154465 216008 308434
22061 308434 108863 -2057 11635 124090 -13354 -262171 -82488 215 -82367 5925
22051 5925 -164899 -237387 -191388 -302853 -280764 97976 244791 266052 122330 -79091 -184467
22040a84467k6001J80743O2590r6421j60621M6101J94526j04560j81188j6793
22030b86091K44999K69011k85857j82056O2031J23038J08702M245k7372J56881
22020A87531J89696j67632j67463j56998k6006K645p6624J84318K61705j64321
22010F6851r1373Q8410K41675m4016k14366m5007J7544K58488J15615j6487k60978
21999A16356o5766j00858j01694Q148l6585J87440n4303J85767q2215o9054M1026
21988B8262k52764M7451K22704M4974n9335J7937j28212p455J53671O9191n1737
21977H4687q4991O7389J21799j78963r7814j89797j05448K57037J50014n7145
21967c3232j30101L4883M9825l7264J25732J07147o8691p7661p661L36846J28065
$$ plain form
22040 -184467 -210468 -29725 32865 -63556 -224177 -178076 16450 -88110 -269298 -286091
22030 -286091 -41092 227919 -57938 -239994 -177963 -54925 53777 58022 30650 187531
22020 187531 377227 209595 42132 -114866 -140872 -138227 -214851 -30533 231172 66851
22010 66851 -24522 63888 305563 261547 47181 2174 19718 278206 393821 377334 116356
21999 116356 50590 -50268 -151962 -143814 -180399 7041 -47262 138505 56290 -12764 28262
21988 28262 -224502 -177051 45653 90627 31292 49229 -78983 -86438 67233 136424 84687
21977 84687 -304 67085 188884 9921 -87893 -277690 -383138 -126101 23913 -33232
21967 -33232 -163333 -128450 -78625 -115889 9843 116990 48299 -29362 -37023 299823 427888
21956D27888j13970j53748k3563n8638j07187O0492K26519P3738Q428l17672j41792
21945a19505j14565O1288K62832L8822k6041q5398M8397q2378J19446N841l02509
21934a93770j44892r8780l0185j8469P4473k0703k6946J02545Q1782P8077o2317
21923b59185K9274r3666o8302l1273j15479J9846L56308M78239o7426j87222o5484
21912d370K64989J31126r4844j95808L9576J38997n5855l23422N981j27323j76348
21901c97301J12478K76586l8716Q1609j79346n142J09674r4090J65464O9961k04671
21890a03494j60112J3407R9133J75570N7397l2959K3137J75034j24117k96122
21880a73126j29564Q7689Q0140L5128J89772L1071l1742J8575j11633m595J77726
$$ plain form
21956 427888 313918 160170 136607 77969 -29218 31274 257793 331531 339959 22287 -119505
21945 -119505 -234070 -172782 90050 128872 102831 17433 65830 -16548 102898 108739 -193770
21934 -193770 -338662 -437442 -467627 -486096 -411623 -432326 -459272 -356727 -274945 -196868 -259185
21923 -259185 -229911 -323577 -391879 -423152 -538631 -518785 -162477 315762 248336 61114 -4370
21912 -4370 260619 391745 296901 101093 140669 279666 223811 -99611 -93630 -220953 -397301
21901 -397301 -284823 -8237 -46953 34656 -144690 -149832 -40158 -134248 31216 101177 -103494
21890 -103494 -263606 -250199 -151066 24504 81901 48942 72079 247113 122996 -173126
21880 -173126 -302690 -215001 -134861 -99733 90039 121110 89368 107943 -3690 -8285 169441
21869A69441K75821J8543l43308q5075q0842J86829N685n4977j65202k20433J81324
21858a12194J22265J5324K27529L5951k21512j64561p5717K287J28994P7437J16247
21847A52050k15513k35047J16954J76919m5272Q3858L9340j31199j43150R4930
21837a06130J94537K34375k00595k45241j33729R1732J99451P0201k5428j67500
21827h8327J59404N6817K2627J15235K95758n0641k16123m60787j02632K17925
21817e0744k10577R0544K24439r3016m9327n0674Q4551M8828k3842J0953L25543
21806C06678j82820j84181k662J52231j12122j96539j93268j25027Q9089O7700
21796c80921J74874J69401j00019J9993J60479J53410p8795l76008k24825J86321
$$ plain form
21869 169441 445262 463805 120497 35422 -45420 141409 147094 92117 -73085 -293518 -112194
21858 -112194 10071 25395 252924 288875 67363 -97198 -172915 -170628 -41634 35803 152050
21847 152050 -63463 -298510 -181556 -4637 -49909 33949 73289 -57910 -201060 -106130
21837 -106130 88407 322782 122187 -123054 -256783 -165051 34400 104601 79173 -88327
21827 -88327 71077 127894 150521 265756 561514 510873 294750 -166037 -268669 -50744
21817 -50744 -261321 -170777 53662 -39354 -88681 -139355 -54804 -5976 -29818 -18865 306678
21806 306678 123858 -60323 -62985 89246 -22876 -219415 -412683 -537710 -448621 -380921
21796 -380921 -206047 -36646 -136665 -116672 43807 197217 118422 -257586 -482411 -296090
21786b96090K29285J63791Q4727j22563K02995Q9785k57375r6642K1896P8090
21776I7899J28286m2721k05439N4438k1287L0130O6079j87137j16370J19443J72885
21765I6206Q6433q1130j33749m0297j37085j18856L11994J94524k84422q1303
21755a87685J64774k15744j84440J44310j32850J09427J19391j34822j4687K00134
21745a32192J04754J73115J15894j78405N3128J26987j82513j18524j69455J33840
21735g3371k9882j8670p8183N3578j32501l864O7727J16001m0430J92275J25293
21724A77973N9625L89009j18558m28204o3747J50239k9491j58355j30512o5563
21714b17584J22967P5905O7891J14896P1165J4984k65387L1702J28487j00219
$$ plain form
21786 -296090 -66805 96986 181713 59150 262145 351930 94555 -2087 19809 97899
21776 97899 226185 183464 -21975 32463 11176 41306 107385 -79752 -196122 -76679 96206
21765 96206 182639 101509 -32240 -72537 -209622 -328478 -16484 178040 -106382 -187685
21755 -187685 -22911 -238655 -423095 -278785 -411635 -302208 -182817 -317639 -332326 -132192
21745 -132192 -27438 145677 261571 83166 136294 263281 80768 -37756 -207211 -73371
21735 -73371 -103253 -121923 -200106 -146528 -279029 -282893 -215166 -99165 -139595 52680 177973
21724 177973 237598 626607 508049 79845 16098 166337 136846 -21509 -152021 -217584
21714 -217584 -94617 -18712 49179 164075 235240 250224 -15163 16539 145026 44807
21704D4807j29004j88336P4046p2895K7004J49433J10859K5862N9582M6350j06846
21693D0862J9970n4627k53833j66815L1836K0195J34632q7408k33699K5447k68
21682e23708J3805o8737j4513L57151K99498L1057L2203j44350M211l1553k61387
21671c06323J03964J07110j43702k85113j53415J11508J44981J34678k370K14029
21661g4653m21Q0220M4539P8457J11577j54253j42813l8654m8847Q0568J23818
21650E9538m8858J01327j91995j25277K04913j96732Q1691p5381J14581o6089
21640a42282K3638j45608l6703o0450r4574J25673J06621m7208J22979J80871
21630C2957j0093J22578p6390n3247K2275j16947K20712k60661L229K4751O8068
$$ plain form
21704 44807 -84197 -272533 -198487 -271382 -244378 -94945 15914 41776 101358 147708 40862
21693 40862 60832 6205 -247628 -414443 -382607 -362412 -227780 -315188 -548887 -523440 -523708
21682 -523708 -509903 -578640 -593153 -236002 63496 94553 126756 -17594 -13383 -44936 -306323
21671 -306323 -202359 -95249 -238951 -524064 -677479 -565971 -420990 -286312 -288682 -74653
21661 -74653 -75074 5146 49685 128142 239719 85466 -57347 -96001 -144848 -64280 59538
21650 59538 10680 112007 -79988 -205265 -352 -197084 -115393 -190774 -76193 -142282
21640 -142282 -118644 -264252 -300955 -361405 -455979 -330306 -223685 -270893 -147914 32957
21630 32957 22864 145442 69052 15805 38080 -78867 141845 -118816 -115587 -90836 -22768
21619b2768K14543J25661j72366q9379J607p3607n8224j20262k07941k19405J64442
21608d57699M02816K43909j0711p1319r0666k63380j16857p6594P9030J91819
21598a69652J68382L8594j31271p0870j69813J09370O7575L5913J3329N0589j91379
21587b49233m4780K80542J29648j14052j09516l09582O6256K08316l380J23023
21577b2758J14431J11610k2543r5583R957k1853j8160K4467K32598J05385J9501
21566D37052l8676p3264k3205l55705k60010K31871j13740k19474k6067O1147
21556c80071K21314L8093j1808J58372O0105r3981J65898p2306j02870j55320
21546a72574Q65R0939q4658l2132K68034R5839n3735r1010j14732l3998J64898
$$ plain form
21619 -22768 191775 317436 145070 55691 57298 -16309 -74533 -194795 -402736 -622141 -457699
21608 -457699 -54883 189026 178315 106996 16330 -247050 -363907 -440501 -361471 -169652
21598 -169652 -1270 37324 -93947 -164817 -334630 -225260 -157685 -121772 -108443 -57854 -249233
21587 -249233 -294013 -13471 116177 2125 -107391 -416973 -350717 -142401 -145781 -22758
21577 -22758 91673 203283 180740 85157 95114 73261 55101 79568 312166 417551 437052
21566 437052 398376 325112 301907 -53798 -313808 -81937 -195677 -415151 -441218 -380071
21556 -380071 -158757 -120664 -132472 25900 86005 -7976 157922 85616 -17254 -172574
21546 -172574 -171709 -80770 -165428 -197560 70474 166313 112578 21568 -93164 -127162 37736
21535C7736J27497R6194j3097K4058j42241j64720j30320Q8577K8631M5011K01949
21524A99275J51776l9503k43430j77003l7345J14809M7022N937k33132N0611J14916
21513d6067k7490J01549j66433k25464K32521J55816j78003j7982J26697J9220
21503b5636J34925R9479j81876l7987L19400j9279n13805p6073J32760j594n502
21492a75188o1089J56079J37003O6632k88545j75711r3422J00332M9044m8348
21482c33213P7420J63594J05028p6922j72335J4308L9971m9476q6395j7056R7871
21471b37205K90333Q2536m9014M795j54243l05704O3462K04J16993Q0225n4307
21460a61925J69601n914k09276Q0391J74199q4387J58094K23191k32499r5186
$$ plain form
21535 37736 165233 261427 248330 272388 130147 -34573 -164893 -76316 -47685 -2674 199275
21524 199275 351051 311548 68118 -108885 -146230 -31421 15601 21538 -211594 -160983 -46067
21513 -46067 -73557 27992 -138441 -363905 -131384 24432 -153571 -171553 -44856 -25636
21503 -25636 109289 208768 26892 -11095 308305 289026 -224779 -300852 -168092 -169686 -175188
21492 -175188 -236277 -80198 56805 123437 -165108 -340819 -434241 -333909 -284865 -333213
21482 -333213 -255793 -92199 12829 -64093 -236428 -222120 -182149 -231625 -318020 -335076 -237205
21471 -237205 53128 135664 86650 91445 -62798 -368502 -305040 -304836 -187843 -107618 -161925
21460 -161925 7676 1762 -207514 -127123 47076 -37311 120783 343974 111475 16289
21450A6289r5607L0245Q334j21741k40273J51955R0431m697J55808j46346k7655
21439a83257o0519K7905J32441K5114m6340K49257Q1478K52727j19912k57031
21429A01863o8869m8050R9778K4579Q2543o1616j93399M2276k4753r5095N6894
21418h3849L2769j45877j72289j31381J63525M07934K49823j96481k21268r0265
21408a87359M8863m1596J7786n7484n2166J59500P3785L9176Q7006J57717J45990
21397C91218k16332k45874j92805J84111J52894j97159q0074Q5868K99231j7378
21387A63700q2591n3978k34085J71855M5818l4068l5150K22916N5500p9810j03854
21376C6253j37930j8212J61848l302Q0813N2197K15421j3786m09953l1707K53480
$$ plain form
21450 16289 -79318 -49073 -40739 -162480 -402753 -250798 -160367 -165064 -9256 -155602 -183257
21439 -183257 -243776 -215871 -83430 -58316 -104656 144601 226079 478806 358894 101863
21429 101863 32994 -15056 84722 109301 191844 130228 -63171 -20895 -45648 -140743 -83849
21418 -83849 -51080 -196957 -369246 -500627 -337102 70832 320655 124174 -97094 -187359
21408 -187359 -138496 -180092 -162306 -219790 -271956 -112456 -38671 505 87511 245228 391218
21397 391218 174886 -70988 -263793 -79682 73212 -123947 -204021 -118153 181078 163700
21387 163700 81109 27131 -206954 -35099 10719 -23349 -58499 164417 219917 140107 36253
21376 36253 -101677 -119889 41959 38657 119470 171667 387088 373302 -36651 -68358 185122
21365A85122J1584j06443P4001q7023j75596j86036L8697k1576l4522J1370J3997
21354b76425J08134L2227J38820P1024k15141j02456o9246Q7836j13750j26675
21344d65652R0466N8811Q7267L90372r2398j74904j75354j01490l1260J42481
21334b71661L9376K3248o1095k20562j36074j4859K29445P6027j2691J30591R8748
21323a19507n2292m6695k0867K73123J96214J69696l523l14898k58450J38581
21313c8618j50961J03319J65959O9729j32049k04168J0444l1306J13134o4813
21303a59330r3255k7738j23365N7677L61593n0788l67341l1123J6552N137K77334
21292a34647R4180j06486k21013K0960O527K31013K53569j64156k33022j09190
$$ plain form
21365 185122 196706 90263 164264 77241 -98355 -284391 -245694 -267270 -301792 -290422 -276425
21354 -276425 -168291 -136064 2756 73780 -141361 -243817 -313063 -225227 -338977 -465652
21344 -465652 -375186 -316375 -229108 161264 68866 -106038 -281392 -382882 -414142 -271661
21334 -271661 -232285 -209037 -270132 -490694 -626768 -641627 -412182 -336155 -348846 -218255 -119507
21323 -119507 -171799 -218494 -239361 33762 229976 399672 396149 81251 -177199 -38618
21313 -38618 -189579 -86260 79699 149428 17379 -186789 -176345 -207651 -94517 -159330
21303 -159330 -252585 -280323 -403688 -346011 15582 -35206 -402547 -433670 -417118 -411981 -134647
21292 -134647 -40467 -146953 -367966 -347006 -340479 -109466 144103 -20053 -253075 -362265
21282c62265J42092m34J45011p1530O2329Q1372j8831j09954M3141P7369m02089
21271d13789j93733M01306M10865j2944k90500k33711R3893L16109M0992j77323
21261e8835N1552K04063K0157j78257R1353j8170j07696J38441R7749j50509j26236
21250c6388j55839p8782K52554K29798J95855k5400k2638o7552r8013j89662K2626
21239B6559J33343j0895j990J1584j92466j27670j33856j03094J65904K19321
21229a3260K9084J32093j69090l23091Q1100L34898P1243K82541M7845j6033J00289
21218E57619k1109j33420k03907J67768j00334l09642j85043J76104J55349j67779
21208f4394J51628J02142K3555j63038N2461p4781k86062j60075J9855L44827
$$ plain form
21282 -362265 -220173 -220607 -75596 -147126 -84797 -3425 -22256 -132210 -89069 -11700 -413789
21271 -413789 -607522 -206216 204649 191705 -98795 -332506 -238613 77496 118488 -58835
21261 -58835 -7283 196780 216937 38680 130033 111863 4167 142608 240357 89848 -36388
21250 -36388 -192227 -271009 -18455 211343 407198 381798 359160 291608 193595 3933 26559
21239 26559 159902 149007 147017 158601 -33865 -161535 -295391 -398485 -232581 -13260
21229 -13260 15824 147917 -21173 -344264 -263164 71734 142977 425518 473363 457330 557619
21218 557619 536510 403090 199183 366951 266617 -43025 -228068 -51964 103385 -64394
21208 -64394 87234 189376 212931 49893 102354 27573 -258489 -418564 -398709 -53882
21198e3882m5486J14830K34750k49177k16934k9399q9266k9366J62693J13948
21188h7289Q0377j8967m5210J31600p2366R3088N0009O2410j61102k7841m6449
21177d1740j03919Q4035M55929Q3253n3686k62356k50573k68956r7528J11778
21167c43763K17400J23389M5970K03353J15782k31306k02483j55424j50250j04602
21157d81934o5328o3927M17736K05008P712j7675k9595O5908j11608m4243K46197
21146A28251l6543m9840j80952M1691J53323K7416r2902j79695m090Q707J4414
21135a70220J11053O1503Q3520q843l3191N1866q7707j2528p6232m9574J93873
21124F3520l8847j87740O6360J72126J06558p0702R8543M636K2022K516k1717
$$ plain form
21198 -53882 -99368 15462 250212 1035 -215899 -245298 -334564 -363930 -201237 -87289
21188 -87289 -6912 -25879 -71089 60511 -11855 81233 131242 193652 32550 4709 -41740
21177 -41740 -145659 -61624 394305 477558 423872 161516 -89057 -358013 -455541 -343763
21167 -343763 -126363 -2974 42996 246349 362131 130825 -71658 -227082 -377332 -481934
21157 -481934 -547262 -611189 -193453 11555 19267 1592 -28003 37905 -73703 -117946 128251
21146 128251 91708 41868 -139084 -97393 55930 83346 -9556 -189251 -193341 -184634 -170220
21135 -170220 -59167 2336 85856 77013 43822 95688 7981 -4547 -80779 -130353 63520
21124 63520 24673 -163067 -96707 75419 181977 111275 209818 214454 236476 238992 217275
21113B17275N652N3062j96620j98942K6808p3851Q9606J92439R0025J0534r6703
21102A19285K83853o8551j01009k30621K1545r8325j40701j00237j3901O0170
21092b68492q0378K8742R2478N1907K7236n1746o9260j7222p0780j5102j28188
21081e00805K02506P6546J2593K04006j09162o018J74535J93551q5430q7339l55914
21070b80931N0964K10922Q6612k36180l0179J42952q5946k3752k42319r4075o3516
21059e65448J36756L1374K44901M14877J03409r5440O1095m15474k92103P659
21049c68394J65906L56920J48357j92197k43973J76750J34568k06311m15392r9596
21039e43362K80539J4067J92236J74557k65268l60125K5959J50327R6159N590
$$ plain form
21113 217275 222927 275989 79369 -119573 -92765 -166616 -77010 115429 205454 215988 119285
21102 119285 403138 334587 233578 2957 24502 -73823 -214524 -314761 -328662 -268492
21092 -268492 -348870 -320128 -227650 -175743 -148507 -200253 -269513 -286735 -357515 -372617 -500805
21081 -500805 -298299 -221753 -209160 -5154 -114316 -120334 54201 247752 162322 74983 -280931
21070 -280931 -229967 -19045 67567 -168613 -198792 -55840 -141786 -165538 -407857 -501932 -565448
21059 -565448 -428692 -397318 -152417 262460 365869 270429 331524 -83950 -376053 -368394
21049 -368394 -202488 154432 302789 110592 -133381 43369 177937 -28374 -443766 -543362
21039 -543362 -262823 -248756 -56520 118037 -147231 -507356 -481397 -331070 -234911 -229321
21029b29321l6990j30370q1005L25789K02153R2476J13030k38957j71256J49429
21019e022j1885j04412m5579K79936O6150j69608j82141o5863J33904J71391j984
21008F4887K08722K04581n7285j63761k11375O4394j6561k04776j19889P5711
20998a55352J8598j31488l0836K75881J47597k06458L1833j89360k722K09732
20988c2575K79021o5627j30972j75403q2013Q6223J76383Q5056M440L6154r9752
20977H0935j72264J20718L5208j36596J53561M936j16388M5929j4642j59366K5353
20966a32616p9874J43395M0824j42899L2822o3737j0840J49104J325j87592O6526
20955a83562P2925K85360K51095k89243j45395j0441k25211j7975m6347j58954
$$ plain form
21029 -229321 -266311 -396681 -477686 -151897 50256 142732 255762 16805 -154451 -5022
21019 -5022 -16907 -121319 -166898 113038 179188 9580 -172561 -238424 -104520 66871 64887
21008 64887 273609 478190 420905 257144 45769 110163 93602 -111174 -231063 -155352
20998 -155352 -136754 -268242 -299078 -23197 124400 -82058 -50225 -239585 -242307 -32575
20988 -32575 246446 180819 49847 -125556 -207569 -121346 55037 140093 144533 180687 80935
20977 80935 -91329 29389 64597 -71999 81562 86498 -29890 16039 1397 -157969 -132616
20966 -132616 -212490 -69095 -28271 -171170 -138348 -202085 -212925 -63821 -62496 -250088 -183562
20955 -183562 -110637 174723 425818 136575 -8820 -19261 -244472 -262447 -308794 -467748
20945d67748J54494Q8983k7261J38818N2253J25792j75924j26402Q1124K66563
20935A10692p6725p7250j65667N8006n0913j68298J48360R3835J09974K67946
20925B49960k3270j77468k01283p6967L3573Q2477j6446j01401o814n2623k02346
20914d92608J35360K60768n1012K59954l9997N0324L6897j26884j65572j8430
20904a51200o3728q2124n9533J20565M30565J09951o7010n9182k5711M5158J40648
20893C38399j06706k27259j50541k01128M7816n5527j66759J1988q8752L03532
20883b94937P4097k11047P6506K23264l0613o4564J11041J39101k0360l4893j30664
20872a63069J22793O0640n286P0227q5305j29491L5127m1849n1069K56524J9163
$$ plain form
20945 -467748 -313254 -224271 -251532 -112714 -60461 65331 -110593 -236995 -155871 110692
20935 110692 33967 -43283 -208950 -150944 -201857 -370155 -221795 -127960 -17986 249960
20925 249960 226690 49222 -152061 -229028 -195455 -112978 -129424 -230825 -237639 -290262 -492608
20914 -492608 -357248 -96480 -147492 112462 72465 122789 159686 32802 -132770 -151200
20904 -151200 -214928 -297052 -356585 -236020 194545 304496 237486 178304 152593 197751 338399
20893 338399 231693 4434 -146107 -347235 -299419 -354946 -521705 -509717 -598469 -294937
20883 -294937 -220840 -431887 -355381 -132117 -162730 -227294 -116253 22848 2488 -32405 -163069
20872 -163069 -40276 20364 15078 85305 0 -129491 -94364 -136213 -187282 69242 88405
20861H8405O8571r3455q9190j05921N3104J83637L32721r4378Q3200j22938l26362
20850b2606j74982J46775r8897O1803L4233j89244j77038j11093j6228j9667K9615
20839e37329j5953J26922J42600m3557J38416o5686k4912m3442L6535J45639L4186
20828a06581l0978J8374r2699r2540J66766Q956r0428J2017p7322N4729O8361
20817a61345p7128M1220J84529J03932l29004K6924R8491n9653N9485J05307n2198
20806e9440r1572J9306j81355k24781K07572L10356M2892l8457j73826J7625J54538
20795a7142J62090J11919j31872o2347J23239N1077j64102k82783p8270K18747
20785f9444J41081k8901j34162l12038m0724R9448L73685j17446j28618J0236
$$ plain form
20861 88405 156976 63521 -25669 -131590 -78486 105151 437872 343494 426694 303756 -22606
20850 -22606 -197588 -50813 -149710 -87907 -53674 -242918 -419956 -531049 -547277 -566944 -537329
20839 -537329 -553282 -426360 -283760 -327317 -188901 -254587 -279499 -322941 -286406 -140767 -106581
20828 -106581 -137559 -119185 -211884 -304424 -137658 -128702 -219130 -207113 -284435 -229706 -161345
20817 -161345 -238473 -197253 -12724 91208 -237796 -210872 -112381 -172034 -112549 -7242 -59440
20806 -59440 -151012 -131706 -313061 -537842 -330270 -19914 22978 -15479 -189305 -171680 -17142
20795 -17142 144948 256867 124995 62648 185887 236964 72862 -209921 -288191 -69444
20785 -69444 71637 42736 -91426 -403464 -444188 -344740 28945 -88501 -217119 -206883
20775b06883j52087o8420K90708L1547j67192p5289m8151J21508R1498O1092J44629
20764B2960n189K6723q0694M8820J35870J9620k94593k19903j78055J11251J76634
20753b36556J94097K42192J1043k2360O4563j32657k29221j354l683L5591Q5124
20742F779K3048o9026J55119k2459k18721j07077n1719o5889L12048K30998K9980
20731B23081k02253R1866J97759j07664j43671J06374p9911k07483j92797K17316
20721i7383K44140k35130j47990j01972J435K20939P9163J4437K53804K81967
20711E13410j79005Q032j13907K15789m3148q9487j37426j57578J60215r0541
20701H6354k67497j03988L1114J33261q3993j53344n0904K8124M8326J16598J26731
$$ plain form
20775 -206883 -358970 -427390 -136682 -105135 -272327 -347616 -395767 -274259 -182761 -121669 22960
20764 22960 17771 44494 -36200 12620 148490 168110 -126483 -346386 -524441 -413190 -236556
20753 -236556 -42459 199733 210776 188416 252979 120322 -108899 -110253 -113936 -78345 6779
20742 6779 29827 -39199 115920 93461 -125260 -232337 -284056 -349945 -37897 193101 223081
20731 223081 20828 112694 310453 202789 59118 165492 85581 -121902 -314699 -97383
20721 -97383 146757 -88373 -236363 -338335 -336900 -115961 -36798 -22361 231443 513410
20711 513410 334405 342437 228530 444319 401171 311684 174258 16680 176895 86354
20701 86354 -181143 -285131 -254017 -120756 -204749 -358093 -408997 -380873 -332547 -215949 -89218
20690h9218O6314M0627J8985N3495O7460k17407J08452q869j38466p6529M6893
20679a28263M6271j03075J84687p0109j17383j73546j16798Q4743J84619n243
20669b14097o0534J7067L9924j52809J9898J98693j1172j14396k05789J17367
20659c65848Q4569M4250L3414j2465j95290p8025J33602L26060K45884j12767
20649A03384l9213j8119J72345R8410k9879n5671k00557j53593P9631o7208J8893
20638i1577K15928J85155q6994L8278O2837j19398N1567R2265N0417j27281j43478
20627A27719j36791M7330k75198J24678J7624j67605m0615J99378J54362J8041
20617F8923L8070j87074j28899p2672K47180K9940j38089k2415J11669p3055J64100
$$ plain form
20690 -89218 -22904 17723 36708 90203 157663 -59744 48708 39839 -98627 -175156 -128263
20679 -128263 -81992 -185067 -380 -70489 -187872 -361418 -478216 -393473 -208854 -214097
20669 -214097 -274631 -257564 -217640 -370449 -350551 -151858 -163030 -277426 -483215 -365848
20659 -365848 -281279 -237029 -203615 -216080 -411370 -489395 -355793 -29733 216151 103384
20649 103384 64171 46052 218397 316807 286928 231257 30700 -122893 -43262 -110470 -91577
20638 -91577 124351 309506 222512 260790 323627 204229 255796 348061 398478 271197 127719
20627 127719 -9072 38258 -236940 -112262 -94638 -262243 -302858 -103480 50882 68923
20617 68923 106993 -80081 -208980 -281652 -34472 -4532 -142621 -165036 -53367 -126422 37678
20606C7678m7796k45039O7144K29852K1524J23634O4156l7028K6310P827l22663
20595g4401P1647O7368j39194Q8300R4071J30630J3424p5580j11186P5472n670
20584A34881k77074j12882J61395M196n7232k9860J3556o2135J55734R0206n5654
20573c4869o9090l3757j86596Q5352J31658J20618J0998k4435j3051J29078n3912
20562F1994j39107O6707q4003M5597J27844j66814Q2470K77863k8919p6850P307
20551A74089k2154k25363q5881R4806R6026j0159J2736J47593N0176k5737Q4606
20540B90738l7286k77200n2369j05802j6726k8493L22980L65339L7828k51672
20530B47337M126r9718J02170j43672p7861j32739k0303j36275R3988M84600Q6428
$$ plain form
20606 37678 -10118 -255157 -188013 41839 63363 186997 251153 214125 240435 248262 -74401
20595 -74401 -2754 64614 -74580 13720 107791 238421 251845 176265 65079 140551 134881
20584 134881 -142193 -255075 -93680 -89484 -146716 -176576 -163020 -225155 -69421 20785 -34869
20573 -34869 -103959 -137716 -324312 -238960 -107302 13316 24314 -121 -13172 115906 61994
20562 61994 -77113 -10406 -94409 -48812 79032 -87782 -5312 272551 243632 166782 174089
20551 174089 151935 -73428 -159309 -64503 31523 21364 34100 181693 231869 206132 290738
20540 290738 253452 -23748 -76117 -181919 -198645 -227138 95842 461181 499009 247337
20530 247337 251463 151745 253915 110243 32382 -100357 -120660 -256935 -162947 321653 408081
20519D08081k58497k26833J30389J63880q4028m3015j17350k6700j49058Q3817
20509a19314j05827J20772J52346j12767J2303Q1155p4140J53655J87647J4739
20499C10569j95190j61197R853P4298n0024j66157R9570P4695j81507l0836j5466
20488b31392R4492K6289K8007j71443r1281K23564K07290r983q0437O6669J51790
20477B13565j89887q3296l7835K2963r6668j12351L8160N0122k44716R8862J90662
20466a50419J1373K9000l14142j40839o0914J65430L4068J73420R5417J29711
20456b7895J12725J81834R5363k21168k08144J09511j7786K5933J55985q0001
20446A26357r1050j54322j21023R4339M6818J65297M8742N2403O1880r2559k81277
$$ plain form
20519 408081 149584 -77249 53140 217020 132992 89977 -27373 -54073 -203131 -119314
20509 -119314 -225141 -104369 47977 -64790 -52487 28668 -45472 108183 295830 310569
20499 310569 115379 -45818 -35965 38333 -11691 -177848 -78278 -3583 -185090 -215926 -231392
20488 -231392 -136900 -110611 -82604 -254047 -345328 -121764 85526 75543 -4894 61775 213565
20477 213565 23678 -59618 -97453 -74490 -171158 -283509 -245349 -195227 -439943 -341081 -150419
20466 -150419 -139046 -110046 -424188 -565027 -625941 -460511 -426443 -253023 -157606 -27895
20456 -27895 84830 266664 362027 140859 -67285 42226 24440 50373 206358 126357
20446 126357 35307 -119015 -240038 -145699 -98881 66416 115158 167561 229441 136882 -144395
20435a44395J12399K43535l4294j63914K1446K8296j46196j06541K11963K15822
20425B38121l5964k37390j08832J07862j52659k10810J68023Q8805r9438q8098
20415c30380K4414R0123l0976N7584O1948J66463m6898k13035M4983j78059R206
20404c44627J55775R5011n376p1385Q8889j7702j24981l2477P3675m6522J97141
20393c2579M04255J14010j12549j52884j90097j56552n5376K6881k4952p0830
20383b50673K8122O3003o270j20612p0038o1673K26654k4776q4347K3114J25610
20372a51886R7722k77797q5818l2049J34940j7934J37631J65165J59162k08979
20362g9843R3961K04882o7943l19174j54426J28796K18538P8131J18895R1955
$$ plain form
20435 -144395 -31996 211539 177245 13331 34777 63073 -83123 -189664 22299 238121
20425 238121 202157 -35233 -144065 -36203 -188862 -399672 -231649 -142844 -242282 -330380
20415 -330380 -305966 -215843 -246819 -189235 -127287 39176 -7722 -220757 -175774 -353833 -344627
20404 -344627 -188852 -93841 -99217 -170602 -81713 -99415 -224396 -256873 -183198 -229720 -32579
20393 -32579 371676 485686 373137 220253 30156 -126396 -181772 -154891 -179843 -250673
20383 -250673 -222551 -159548 -165818 -286430 -356468 -418141 -191487 -216263 -300610 -277496 -151886
20372 -151886 -54164 -331961 -417779 -449828 -314888 -332822 -195191 -30026 129136 -79843
20362 -79843 14118 219000 151057 -168117 -322543 -193747 24791 102922 221817 313772
20352C13772J2701r6232j4304P8106k60552k40877j62190p6422j60916j16174
20342g23088K15058J31357R2265j9633j68478J00276J57891J85185k8987l58222
20332d16376N6884p695m3437L09219l046j66730j64501J00856J99091j03722J76782
20321f2675J13840K20635R0641j80109k08790P0093p4144j53670k03968j12509
20311e00656l0998L3735L2190n5568L1587P280r5740J22181k0702N0992J79595
20300b46104J12721l193K4245Q0969K69888Q0785l7942l04403K2536r6346j59612
20289b56456l58737J48648J66733k1596j8838j5150j2566J07804K59528N7152
20279E6522J1005j42877m054O6245R0579q0N4577j77598l767Q8748k46159J0733
$$ plain form
20352 313772 326473 230241 215937 294043 33491 -207386 -369576 -445998 -606914 -723088
20342 -723088 -508030 -376673 -284408 -304041 -472519 -372243 -214352 -29167 -58154 -416376
20332 -416376 -359492 -367187 -410624 -101405 -104451 -271181 -435682 -334826 -135735 -239457 -62675
20321 -62675 51165 271800 362441 182332 -26458 43635 -30509 -184179 -388147 -500656
20311 -500656 -531654 -497919 -465729 -521297 -489710 -482430 -578170 -455989 -476691 -425699 -246104
20300 -246104 -133383 -136576 -112331 -31362 238526 319311 281369 -23034 -498 -96844 -256456
20289 -256456 -615193 -466545 -299812 -321408 -340246 -355396 -367962 -260158 -630 56522
20279 56522 67527 -75350 -79404 -13159 77420 77340 131917 -45681 -49448 39300 -206859 -196126
20267a96126Q6359Q9172k0072K1025l07640M6791L19151J83256R991k51671O1440
20256D1676K24769p2761q7650K2916N0663l81325k1912L05674j57032K5882L35178
20245B86078O984r0454j15463l1342j86651j87966R6603J28271J70831j52240
20235g5349K8879J84315J30433m06528l79411R6517K02247J82441j81501j20500
20225c38457j67243r8986L13135K75800J75688r195k33296K7974n6378p767R5178
20214b3547P6404J36956J4446L729O0551O2725k25819r5006R1145j09512j64970
20203a72898m2620k2393Q7192j48760j42377n1581J04569q4450P1244J24909P4452
20192b02713n0215k42351o258j83702R9334K61498K40994J03191q7393N264k49842
$$ plain form
20267 -196126 -109767 -20595 -40667 -19642 -327282 -280491 38660 221916 231907 -19764 41676
20256 41676 266445 193684 106034 128950 179613 -201712 -223624 82050 -74982 -49100 286078
20245 286078 293062 202608 87145 55803 -130848 -318814 -222211 -93940 76891 -75349
20235 -75349 -46470 137845 268278 -138250 -517661 -421144 -218897 -36456 -217957 -338457
20225 -338457 -505700 -604686 -291551 -15751 159937 150742 -82554 -54580 -110958 -118725 -23547
20214 -23547 52857 189813 204259 207988 268539 331264 105445 10439 101584 -7928 -172898
20203 -172898 -215518 -237911 -150719 -299479 -441856 -493437 -388868 -473318 -402074 -277165 -202713
20192 -202713 -252928 -495279 -501537 -685239 -585905 -324407 -83413 19778 -67615 -62351 -312193
20181c12193j39584K81345L64557O3528R2365N4681j4426l3138j4903p264j4346
20170C20622j43504k49709J18233P312j40981j43783J94885J24177M9575L3347
20160A70174j41880K538j73328K7753J74432J8465j00183o4153l1838r7788L7839
20149a77969o59l78538l8712L14631M28163J24326J35069J5660R2566j79754m78720
20138a43937J1430K65801R9710r5937p2731k5028J44498p7243o3808O9166J16841
20127B28762p2008r1493o779J71910k04492l10133J62643L9035J548p069k61797
20116c49873J76394J45207k48482J24725J80756j08104k65631j02679J56199J5131
20106b76357M0586J08097K69360j77554L2992J60571J96804k42663n8509J2131
$$ plain form
20181 -312193 -451777 -170432 194125 257653 350018 404699 390273 357135 342232 334968 320622
20170 320622 177118 -72591 45642 52954 -88027 -231810 -36925 87252 136827 170174
20160 170174 28294 30832 -142496 -114743 59689 78154 -22029 -86182 -118020 -215808 -177969
20149 -177969 -178628 -557166 -595878 -281247 146916 271242 406311 421971 514537 334783 -143937
20138 -143937 -132507 133294 233004 137067 64336 39308 183806 106563 42755 111921 228762
20127 228762 156754 65261 58482 230392 25900 -284233 -121590 -82555 -81007 -88076 -349873
20116 -349873 -173479 -28272 -276754 -152029 28727 -79377 -345008 -447687 -291488 -276357
20106 -276357 -235771 -127674 141686 -35868 -2876 157695 354499 111836 53327 65458
20096F5458L431m6134N6052j32687j7485M4375K05651K8102k78581j57420K7009
20085b02229M7341j67788L391K41143K85935j69780K2672q5355j71041p2331j13872
20074c81914J06976N4914J36605J78708J20883j61255j70809q5497j83843j81436
20064e66668J45506K07315J61058J34495K12972j22304j34900j13799j7589J9253
20054g4661M5678j01570n1955n3476j15888J73437L3361J24835J38545j63142
20044d4836j96496q197J91509Q1766j06573J9072r1047J25859k0987j32170m458
20033a86558K86614k4183O84J22750K0954k30978q3870N3990J0889p9517o2176
20022a71401O6488N9694J1786j18009J4451R4998j55577l171J49057p9835k61203
$$ plain form
20096 65458 68889 22755 78807 -53880 -71365 -26990 178661 206763 -71818 -229238 -202229
20085 -202229 -154888 -322676 -319285 -78142 207793 38013 60685 -24670 -195711 -268042 -381914
20074 -381914 -274938 -220024 -83419 95289 216172 54917 -115892 -201389 -385232 -566668
20064 -566668 -421162 -213847 -52789 81706 294678 172374 37474 -76325 -93914 -74661
20054 -74661 -28983 -130553 -182508 -235984 -351872 -178435 -145074 -20239 118306 -44836
20044 -44836 -241332 -249529 -58020 23746 -82827 -63755 -154802 -28943 -49930 -182100 -186558
20033 -186558 100056 75873 76557 199307 220261 -10717 -94587 -40597 -29708 -109225 -171401
20022 -171401 -104913 -45219 -33433 -151442 -136991 -41993 -197570 -200741 -51684 -131519 -392722
20011c92722k6728K53366K05061r1437k59841k45915K91939L12866Q6968j58272
20001b4715k10106k26019o222K62866O6841J01391J48151r9613m1940j23763Q6086
19990f7043R5056j47699P1407k18534M6972M39068j37702j20039l28237M984J14082
19979b47685J5493J64257J14977P5607j37006l18684L8414J70351L5568o2096
19969a50804r4162o6057P241J75891Q0946J98524j83291r9120j1912q2084m8023
19958b72851K0649j3917J57031K0978k40458O6093k6503J44298L27326K36040
19948D18686j89864k26615o9901J57588J45016k9502p5328k3252N6414K4892q4572
19937A03562M5446j30185J84490J93606O4997q0641j06080k04832J80474J30654
$$ plain form
20011 -392722 -419450 -166084 38977 -52460 -312301 -558216 -266277 46589 133557 -24715
20001 -24715 -234821 -460840 -467062 -204196 -137355 -35964 112187 12574 -29366 -153129 -67043
19990 -67043 28013 -119686 -48279 -266813 -219841 219227 81525 -38514 -366751 -361767 -247685
19979 -247685 -232192 -67935 47042 122649 -14357 -333041 -294627 -124276 -88708 -150804
19969 -150804 -244966 -311023 -303782 -127891 -46945 151579 -31712 -130832 -142744 -224828 -272851
19958 -272851 -252202 -266119 -109088 -88110 -328568 -262475 -288978 -144680 182646 418686
19948 418686 228822 2207 -67694 89894 234910 205408 130080 106828 163242 188134 103562
19937 103562 149008 18823 203313 396919 461916 381275 275195 70363 250837 381491
19927C81491O5550o5603k82396k39174p8285Q1643N563j38673k21159p2529O4183
19916d99389K42507J57211J9374K7946j82984K3979P9613N0442L0342J41229o7346
19905B2924j40066J16237j4500p4459j264J27948o708J01333k3264j9779j81739
19894i3337n9254J92531Q9242p6817r3520p3291J28986O2144p3789j32732K04116
19883G4279J28530m674Q8090l1132q5537k88981j12374J50751P7360J49849M8327
19872A94488k28031L12652n8517j17348j8244q031L2186o848K3532o9150K5851
19861H2540q5j31434N7561J61237P9641j32304j06451o1497L33792J28683o1872
19850C49811j68256j17683J6787M795O8380j05690j7223j20464k7524K34373K8918
$$ plain form
19927 381491 447041 381438 99042 -140132 -218417 -136774 -131211 -269884 -491043 -563572 -499389
19916 -499389 -256882 -99671 -80297 -52351 -235335 -211356 -131743 -81301 -50959 90270 22924
19905 22924 -117142 -905 -15405 -89864 -91128 36820 30112 131445 108181 88402 -93337
19894 -93337 -152591 39940 129182 52365 -41155 -114446 14540 76684 2895 -129837 74279
19883 74279 202809 198135 286225 255093 169556 -119425 -231799 -81048 -3688 146161 194488
19872 194488 -33543 279109 220592 103244 85000 76969 109155 102307 125839 56689 82540
19861 82540 82455 -48979 8582 169819 249460 117156 10705 -50792 283000 411683 349811
19850 349811 181555 63872 80659 85454 153834 48144 30921 -89543 -117067 117306 146224
19839A46224K922J5725k22562j42191J40456J13139l6684k8479j62271j18280
19829b92001J71005K18530r7254m1657j73304P9302j10662J31545J12256l8295
19819d0535K04206J11801k38998n9223R3199L2795j98115K1040k19889l61248
19809f54967K17780K58548L6741K6246k08703m4325K03237R4314j16021n2555
19799b39705j2417M6606K32838r6825k15669j43554K36502J01141j6450o2413
19789a69946j70550M1363J87694k0854O4029N3054Q1260p578J20454J42023K1786
19778C42735j91549j75632j15416L08015J17089J4579o5514j41528l0476Q8108
19768A50411o3597m3059J8175L7324J67556J9008j1769n4177j12411k24480J4792
$$ plain form
19839 146224 149146 164871 -57691 -199882 -59426 53713 17029 -11450 -173721 -292001
19829 -292001 -120996 97534 280 -41377 -214681 -135379 -246041 -114496 -2240 -40535
19819 -40535 163671 275472 36474 -22749 70450 103245 -94870 -73830 -293719 -654967
19809 -654967 -437187 -178639 -141898 -115652 -324355 -368680 -165443 -71129 -187150 -239705
19799 -239705 -252122 -205516 27322 -69503 -285172 -428726 -192224 -91083 -107533 -169946
19789 -169946 -340496 -299133 -111439 -132293 -68264 -15210 66050 58472 178926 320949 342735
19778 342735 151186 -24446 -139862 168153 285242 299821 234307 92779 62303 150411
19768 150411 86814 43755 61930 99254 266810 285818 274049 219872 107461 -117019 -102227
19757a02227j1428k9586J43395N6728n6578j6696p3798j35075J53423M7612n2126
19746g6356K29251J43237k10637j27497m6720N2338j6418K7874N835j97586j9517
19735b36196K22840J28217p7285J1091p5334J9782l7431j04736n4147J49492p5476
19724a29183n5474O4700Q4345j96349K1491L7878P39j54679j9672l4376m8337
19713d28917m7450J79314R903p1360L1221K97745J00077m6256j19864N5594j23129
19702a63122l014L0404J27564O8301j12095j66571n7378J01255M29355k3603r3895
19691A37201R3796K9510j30365m5109k8349q4673j81102j91792K29046l112n7299
19680b32248j87928j02184K72493K63977Q0665j18264k4886P1192K60175q9230
$$ plain form
19757 -102227 -113655 -143241 154 56882 304 -16392 -90190 -225265 -71842 -24230 -76356
19746 -76356 152895 296132 85495 -42002 -88722 -36384 -52802 -24928 -19093 -216679 -236196
19735 -236196 -13356 114861 37576 48667 -26667 -6885 -44316 -149052 -203199 -53707 -129183
19724 -129183 -184657 -119957 -35612 -231961 -210470 -172592 -171853 -326532 -346204 -380580 -428917
19713 -428917 -476367 -297053 -287150 -358510 -327289 -29544 70533 24277 -95587 -39993 -163122
19702 -163122 -166136 -135732 -8168 60133 -51962 -218533 -275911 -174656 254699 231096 137201
19691 137201 230997 260507 130142 85033 56684 -27989 -209091 -400883 -171837 -174949 -232248
19680 -232248 -420176 -522360 -249867 14110 94775 -23489 -48375 22817 282992 193762
19670A93762j26256n5589j66512M6259N8014k651o1608K6635q7260J35274Q0157
19659D0225J0666r7867j47843M8583J86313r8556r0098P907J85663l4334K19036
19648B29695n0235k90636o2397L4600j34035J94820K21316r705j03836q9264P1160
19637A1483K7512K7119J18558k58566r1128L16676L3120j27423J31055r0256j12930
19626a4780q0703n04M2014j28807q0683K68093O5288j04327J1397Q3801J81716
19615B42505j55415o3633J37325K3724q9258j90450P7063Q6538J03116r6944J607
19604G6178n8684O9678J89334r4784j13779n2455j93761q3754j10655o1830Q8502
19593c46010K18938J37615R0664q208o2083j61765P2602R3785q222p6746l5293
$$ plain form
19670 193762 67506 11917 -154595 -108336 -50322 -52973 -114581 -87946 -175206 -39932 40225
19659 40225 50891 -46976 -194819 -146236 40077 -58479 -148577 -140670 44993 10659 229695
19648 229695 179460 -111176 -173573 -138973 -273008 -78188 143128 133423 29587 -59677 11483
19637 11483 38995 66114 184672 -73894 -165022 151654 184774 57351 188406 98150 -14780
19626 -14780 -95483 -95987 -53973 -182780 -263463 4630 69918 -34409 -23012 60789 242505
19615 242505 87090 23457 160782 184506 95248 -95202 -18139 68399 171515 74571 76178
19604 76178 17494 87172 276506 181722 67943 15488 -178273 -262027 -372682 -434512 -346010
19593 -346010 -127072 10543 101207 92999 30916 -130849 -58247 35538 27316 -49430 -84723
19582h4723J56107q3619j00701J47478q2954n9191j35063O0585M72110l1848j78691
19571G9490n9049Q3129L8436j84735O8501k28035q4306J4546K91300J83907J06699
19560C09883k96761j00040J73224J3370k32530K8455L55318J07043j99163j38201
19550B0598J7100j53558j58595j42628q197J99568o5848P2323J77720j11614J36036
19539a7095j54665j02115O4067o3487M1670K02332N3303N7275J13939q0353l25684
19528b10813l48924Q3389P5415J8989Q4789K00196J25608J18851J4579k59906
19518i7827m14853o6317J14381M6381J25466J86499J97177j2301j71901n484l6860
19507a35639k2166k5857L3279P6250P8660R3259M0109n1109j10657l5410l4513
$$ plain form
19582 -84723 71384 -12235 -112936 34542 -48412 -107603 -242666 -182081 290029 258181 79490
19571 79490 20441 103570 142006 -42729 25772 -202263 -286569 -272023 19277 203184 309883
19560 309883 13122 -86918 86306 99676 -132854 -104399 250919 357962 158799 20598
19550 20598 37698 -115860 -274455 -417083 -425280 -225712 -291560 -219237 -41517 -153131 -17095
19539 -17095 -171760 -273875 -209808 -273295 -231625 -29293 24010 81285 195224 114871 -210813
19528 -210813 -559737 -476348 -400933 -381944 -297155 -96959 28649 147500 162079 -97827
19518 -97827 -512680 -578997 -464616 -418235 -292769 -106270 90907 78606 -93295 -98779 -135639
19507 -135639 -157805 -183662 -150383 -74133 4527 97786 137895 86786 -23871 -59281 -93794
19496i3794o9468K01318L5404r2725k84286J3871K92936K95544P1181M5668L8073
19485D53722k66367j66623L5452R0854p9117m9555J59146j29469j35364q2923
19475a70244J18144J97272l1097J15533K29573M1303k92853K0182K53231L28543
19465H09587K60610L97968J55514L4115L10484j51949n30449k98440k88455o3109
19455F35876Q053j25574J9023J41784K6320Q9099L29526J40347o5318K21076L52501
19444A772713q8199j87669q9203m4349k19988k94942k04137O1191j34289j19666
19434D51462j04677k53216q7644P6501J03604m2607J3865R0518o4419l2804j05598
19423D4985m0087j00300Q6447K35157J67188j16487k40863Q8817q6746j9921J48641
$$ plain form
19496 -93794 -163262 38056 73460 -19265 -303551 -289680 3256 298800 369981 415649 453722
19485 453722 187355 20732 56184 147038 67921 18366 177512 48043 -87321 -170244
19475 -170244 -52100 145172 114075 229608 459181 500484 207631 227813 481044 809587
19465 809587 1070197 1468165 1623679 1657794 1968278 1816329 1285880 987440 698985 635876
19455 635876 643929 518355 537378 679162 705482 794581 1124107 1264454 1199136 1420212 1772713
19444 1772713 1684514 1496845 1407642 1363293 1143305 848363 644226 705417 571128 451462
19434 451462 346785 93569 5925 82426 186030 143423 157288 247806 183387 150583 44985
19423 44985 4898 -95402 -8955 226202 393390 276903 36040 124857 38111 18190 166831
19412A66831P9318R0653O7149q6364o3718Q2068j6552l9722j35023P6488j13552
19401A07576p6070k1430m4041P8556l6185Q5470J57047N7519j40942q4038J29012
19390B12474r8203R6481m1823j26387k3781J81957k2205n5279n8528K1572J06514
19379A92792n9279r9953p0806j73695J185P1186p8414J88059M4736j55534j64129
19368c03852Q1295J94030l7960o9790k9729P1402J34795J31154j3035j09185k1872
19357B7253L9264J39485Q0669r10q0546j03330O4076J79894Q6094k07463k08397
19346A6089j10561J11848L7277o4702N9670k5277J04264J54710n4972L7335J7886
19335B83567p4004j4925L3560J3515k78627K16136j82117j92412J43131O2599
$$ plain form
19412 166831 246149 336802 403951 317587 253869 335937 319385 279663 144640 221128 107576
19401 107576 31506 10076 -33965 44591 8406 93876 250923 308442 167500 83462 212474
19390 212474 114271 210752 168929 42542 18761 200718 178513 123234 64706 86278 192792
19379 192792 133513 33560 -37246 -210941 -209756 -138570 -216984 -28925 15811 -139723 -303852
19368 -303852 -222557 -28527 -66487 -136277 -166006 -94604 40191 171345 158310 49125 27253
19357 27253 66517 206002 286671 285761 205215 101885 165961 345855 431949 224486 16089
19346 16089 -94472 17376 54653 -10049 49621 24344 128608 283318 228346 265681 283567
19335 283567 209563 194638 228198 241713 -36914 179222 -2895 -195307 -52176 10423
19325A0423j33169R7059K12061j17636J3516J41413l105k07437j07702J0197Q84
19314h3496K5453J9170o0292O0042r4578j39897k42282J10076J38433R4838P6551
19303i5982j27051q2820J84987J30924o6687N1187j1138N1136K26292o1368l19007
19292a19527M944J27499k0703p4862J44009j48443O0520L4696K0860j6971L7041
19281D9063k23547P555L0488j66587J52810M7605L2393j15627l1060J57156K24762
19270A65011P7230o4098K95335k7812k91965j28443P989K4699R1168l7088M5796
19259A57822j43254J82647K26915M5148J04321k94831q1852J54908q0412O8289
19249C39701l4900l26463j12269P9781r9077P5864n0425P0654K01458o7741k033
$$ plain form
19325 10423 -122746 -25687 186374 68738 82254 223667 220562 13125 -94577 -84380 -83496
19314 -83496 -58043 -38873 -99165 -39123 -133701 -273598 -515880 -405804 -267371 -172533 -95982
19303 -95982 -223033 -305853 -120866 10058 -56629 -5442 -16580 34556 260848 199480 -119527
19292 -119527 -114583 12916 -7787 -82649 61360 -87083 -26563 8133 28993 12022 49063
19281 49063 -174484 -166929 -136441 -303028 -150218 -102613 -70220 -185847 -216907 -59751 165011
19270 165011 242241 178143 473478 445666 153701 25258 33247 57946 149114 112026 157822
19259 157822 14568 197215 424130 469278 573599 278768 196916 351824 271412 339701
19249 339701 304801 -21662 -133931 -54150 -153227 -77363 -127788 -57134 144324 76583 74550
19238G4550J65049J54058J12393K35075L7677k80401P669J149j62503j10053j81342
19227E3321o6298Q5818M7470N7065J2170m5142l5433r2633m4102p1237r8837O9650
19215a28188L32167J78998L5312k01370k65813M3526J62668R0087j54725m4077
19205D8585r4888L853P6597N6909k19672J517J12890p004k74241J6954J89161
19194h9339M2833K5907K17085o1288j69628J4972P3122P6648L51869J16894j27721
19183D71354l60717k94347q8785J04720j5546J08031j6643O023J5528N1705l4912
19172e3589N7310p3991n4288n1243j8875K6044K18335N27j3984J19514M9827k7163
19160A78424M1051k58568J68056K05165N7520J61319k03324k19340K07682J7884
$$ plain form
19238 74550 239599 393657 506050 741125 778802 498401 506070 507219 344716 234663 53321
19227 53321 -12977 72841 120311 177376 189546 144404 108971 16338 -27764 -99001 -197838 -128188
19215 -128188 203979 382977 418289 216919 -48894 -5368 157300 247387 92662 48585
19205 48585 -46303 -42450 34147 91056 -128616 -127099 -14209 -21213 -295454 -278500 -89339
19194 -89339 -46506 -20599 196486 135198 -34430 -19458 53664 130312 482181 599075 471354
19183 471354 110637 -183710 -272495 -167775 -183321 -75290 -91933 -85910 -70382 -18677 -53589
19172 -53589 3721 -70270 -124558 -175801 -194676 -168632 49703 50230 36246 155760 205587 178424
19160 178424 219475 -39093 128963 334128 391648 552967 349643 130303 337985 355869
19150C55869M8554J6508j62524j37742j2259L8183J81788j18235j33005K77209
19140C54346J33835J8114J63000l5701P2391O9938p9922o3722L5264k48097J95308
19129F14754K49495J63398q5420n8226J5377j78032m2273J7111J02085j03075
19119F95194j98083l54727O9284K14872Q4714J17115K07265J62570O4918P4834
19109A137956R1255l52773r7888o5621k91298j76765K25557J9633j73271J7374
19099C34159o3168J94683J55019J22116j86135n35l3140j9001o7056J38721j09858
19088D65805j90651J09172J8250K99871J4750R8479J37750K225k66979k52521
19078D36151o0062L3197L6344R9712r832K11226J39314M6369O778K28974J61821
$$ plain form
19150 355869 404423 420931 258407 120665 108406 146589 328377 210142 77137 354346
19140 354346 488181 506295 669295 633594 705985 775923 696001 632279 667543 419446 614754
19129 614754 864249 1027647 942227 884001 899378 721346 679073 696184 798269 695194
19119 695194 497111 142384 211668 426540 511254 628369 835634 998204 1063122 1137956
19109 1137956 1229211 876438 778550 712929 421631 244866 470423 490056 316785 334159
19099 334159 270991 465674 620693 742809 556674 556139 522999 503998 436942 575663 465805
19088 465805 275154 384326 402576 702447 717197 815676 953426 955651 688672 436151
19078 436151 376089 409286 445630 545342 535510 746736 886050 932419 939197 1168171 1329992
19067A329992k35392j88069j64189J56353m7351l86745j75043J61827L49523m6016
19057G54890m81116j01729L14268M84798R5607j72192k31702m51902k99562J51083
19047F2443K53107j80611n8194L287R1158R8570k36041j51878m6616K57555J77528
19036B70308j66949j52738J65235K7697M3161p8754q7637J23827l2661J9681j18274
19025A2896j84787O8276p7211k1321j1920J88324K38159J70977R2676K5533j22459
19014C79143j58445j72878Q0722J33972r7506j2255J16492R0781J58392J15973
19004F34391p2301r2077m5198Q849J41882J44518j53542k52369M7543l8865J03037
18993D25868K83877L08445m9351k8982J87884R6819j44673r9651o0096N043J63249
$$ plain form
19067 1329992 1094600 906531 742342 898695 851344 464599 289556 451383 800906 754890
19057 754890 273774 172045 486313 971111 1066718 894526 662824 210922 -88640 62443
19047 62443 315550 134939 76745 80032 171190 269760 33719 -118159 -164775 92780 270308
19036 270308 103359 -49379 115856 143553 186714 107960 20323 144150 111489 131170 12896
19025 12896 -171891 -103615 -180826 -202147 -214067 -25743 212416 383393 476069 501602 379143
19014 379143 220698 47820 128542 262514 165008 152753 269245 360026 518418 634391
19004 634391 562090 470013 424815 433664 575546 720064 566522 314153 361696 322831 425868
18993 425868 709745 1018190 968839 939857 1127741 1224560 1079887 980236 920140 925183 1088432
18982A088432o1274r4621K05168R4316k93349J72770O2875j60660l1429O8540
18972A050768l627J47052n4048j1776J69215L89453Q0624J71460Q5172m820K71035
18961B290508j8940k0494j9318K42407L43792L14290K20481K85320M92372P73920
18951D904338O84214O23188N75034O79864J032817O58746P00715Q99208R32822
18942A1690946R59243Q49432P92726J211312J495619K009200K800012M088612
18934B5897102N480496P615034J1429252J7025287K6097894M0529815N8050274
18927A92125154O1294357M7975430L3204144j496965l7404764n0281863n1892928
18920A93522565m9412711l5645582k0656519j0466458k667991M317642J2622812
$$ plain form
18982 1088432 1027158 932537 1137705 1232021 938672 1111442 1174317 1013657 982228 1050768
18972 1050768 1047141 1194193 1140145 1128369 1297584 1687037 1767661 1939121 2024293 2019473 2290508
18961 2290508 2271568 2251074 2231756 2474163 2817955 3132245 3352726 3638046 4130418 4904338
18951 4904338 5588552 6211740 6786774 7466638 8499455 9158201 9858916 10758124 11690946
18942 11690946 12650189 13499621 14292347 15503659 16999278 19008478 21808490 25897102
18934 25897102 31377598 38992632 50421884 67447171 93545065 134074880 192125154
18927 192125154 253419511 301394941 334599085 333102120 295697356 245415493 193522565
18920 193522565 144109854 108464272 87807753 77341295 74673304 78990946 91613758
18913I1613758K3607290M0542652O1962829O7859043M9251563L2077979j428456
18906C65486658m2192181n9224044n9610016n6740077m3372394k8664399j8755940
18899E6927607j2586609q832037o352623m503753l022761k327966j450548r77009
18891A6874301j092717j136347r72412j058505j444613j030468o67245q16192
18883H655802o21496q22566p13211p39705p41805p18421q41953k33530n6439j13830
18873C052846j95863q618k0392p7329k18831l7052j72775m9975j1560o8545j19684
18862B072222j89802j5125J9547o6362k0002M700l57833j19861L11438J9082o1467
18851A596537l8356K8751P7400M5628j21336P6028m0010k26500l60779j83039
$$ plain form
18913 91613758 115221048 155763700 217726529 285585572 334837135 366915114 365486658
18906 365486658 323294477 264070433 204460417 147720340 104347946 75683547 56927607
18899 56927607 44340998 35508961 29156338 24652585 21629824 19301858 17851310 16874301
18891 16874301 15781584 14645237 13672825 12614320 11169707 10139239 9471994 8655802
18883 8655802 8034306 7211740 6498529 5758824 5017019 4298598 3456645 3223115 3166676 3052846
18873 3052846 2856983 2848365 2827973 2750644 2531813 2494761 2321986 2272011 2260451 2191906 2072222
18862 2072222 1882420 1867295 1886842 1820480 1800478 1805178 1447345 1327484 1638922 1658004 1596537
18851 1596537 1558181 1586932 1664332 1709960 1588624 1664652 1624642 1398142 1037363 854324
18841H54324K11194K36374m0075J0049q8857k45584k98568j16542J70012q4501
18831F07826o4600m0263J02176Q0414k62753j8044J12966q5701J42461K07253
18821G81735j01977l32813l1129k1272P7372L27943K92782j91047m04575k13259
18811A83760n2792l2860q7L30893J60063M6057K7790J28909M9410k4957J90737
18800A006923K87345q6877r4405K38912j17939j73738l03862J4503K19760l8028
18790I52594k22782r955O2332j4898l9713J51204K39035q3887J07903o989l8300
18779A096544p112p9078o011n6884J59394J98611j62725m44337j11036j26393
18769D60973k22303p3766r4276k47412o415L23519L0917k0735L55717K06970O5874
$$ plain form
18841 854324 1065518 1301892 1261817 1271866 1183009 937425 638857 522315 692327 607826
18831 607826 543226 502963 605139 685553 422800 404756 517722 432021 574482 781735
18821 781735 679758 346945 315816 294544 371916 699859 992641 801594 397019 183760
18811 183760 130968 98108 98021 428914 588977 635034 662824 791733 841143 816186 1006923
18800 1006923 1294268 1207391 1112986 1351898 1233959 1060221 756359 770862 990622 952594
18790 952594 729812 719857 782189 767291 727578 878782 1117817 1033930 1141833 1134844 1096544
18779 1096544 1089432 1010354 1004343 947459 1106853 1305464 1142739 698402 587366 460973
18769 460973 238670 164904 70628 -176784 -183199 140320 171237 150502 506219 713189 779063
18758G79063J2223k1741J4442K5048l23657l63728j83279l8215O8056j0970j49551
18747a92309P5649K61540k0150n7187p2862P3841K20348L11253J26140j72811
18737E53452j11002o9889j10696m4510O5871m6937k22967K06639R9910k47985
18727G1886k87588p4967K75284J19366n8249J48249j52621l1327L17720j2735
18717C15018k04355j49558J4530Q4930P4014l2121J97551L19622K68699j37022
18707G51308j18624j77406j03305L2739J30580K17393L08262k5122l20195j64683
18697E30947j83357j14656j90862r8708L07373J41577k8312k36151K48768L05353
18687F81972J64153J67022K56466K85903M01132M04885O74301O51226P03557Q26001
$$ plain form
18758 779063 791286 769545 783987 809035 485378 121650 -61629 -99844 -31788 -42758 -192309
18747 -192309 -116660 144880 124730 67543 -5319 68522 288870 600123 726263 553452
18737 553452 442450 372561 261865 217355 283226 236289 13322 219961 319871 71886
18727 71886 -215702 -290669 -15385 103981 45732 193981 41360 10033 327753 315018
18717 315018 110663 -38895 -24365 60565 134579 102458 300009 619631 888330 751308
18707 751308 632684 455278 351973 384712 515292 732685 1040947 1015825 695630 530947
18697 530947 347590 232934 42072 -56636 250737 392314 364002 127851 376619 681972
18687 681972 846125 1013147 1269613 1555516 1956648 2361533 3035834 3687060 4390617 5216618
18677E216618N19526L3900l78730m70000m99540l76765k00028J63130O96512Q27248
18667E531871P39309L99193k29718n04704r33601j038181o98264o09234m91664
18658B165007k09046j76591j28436j37039j9434M0154k58064l23898L7839P5735
18648A066227J27637K61587K91611j2961J10734J09098j41564m5665R5478J38923
18638B001105M1926J84182K41315K09326L44395P36255J056480J353034J480963
18629G648981O38962M14694N4375k33729k50531m24043k90674N5685M61222J299931
18619I374873J618983J017708P47757O83663L05662j37191m1386K51602O79936
18610A4501607J196947J970049L152041M749114P485344J1420993J7203302K6545262
$$ plain form
18677 5216618 5736144 5770044 5391314 4921314 4421774 4045009 3844981 4008111 4704623 5531871
18667 5531871 6271180 6670373 6440655 5935951 5002350 3964169 3265905 2656671 2165007
18658 2165007 1955961 1779370 1650934 1513895 1494461 1534615 1276551 952653 990492 1066227
18648 1066227 1193864 1455451 1747062 1734101 1844835 1953933 1812369 1766704 1862182 2001105
18638 2001105 2043031 2227213 2468528 2677854 3022249 3758504 4814984 6168018 7648981
18629 7648981 8287943 8702637 8757012 8523283 8272752 7848709 7558035 7613720 8074942 9374873
18619 9374873 10993856 12011564 12759321 13442984 13748646 13611455 13570069 13821671 14501607
18610 14501607 15698554 17668603 20820644 25569758 33055102 44476095 61679397 88224659
18602H8224659L9511195M4491390K1670002m629704j8326727k9393944l6464796
18595A05082075k9099478j8312095j0884680o170236k821080K82441L596868P665064
18587D9338879J2770659K1004631L2481399L8365911K1472998k795497j6205934
18580A56433046k6061191l3116845k8314063j8908133j2309864q127342m960677
18573B4634931l790961k609833j535131j273907j155110j020862r02247o62718
18565A1684162n11282j60910j23315Q6639M5602J15965N13857P98751J076848
18556A3526317J508739J421611J512117K245696L162743M116091N949575R262307
18548D2705196J4283679K1502178L3152959M7156460M6242170J6655770r099043
$$ plain form
18602 88224659 127735854 172227244 193897246 189267542 170940815 141546871 105082075
18595 105082075 75982597 57670502 46785822 40615586 37794506 38076947 41673815 49338879
18587 49338879 62109538 83114169 115595568 153961479 175434477 172638980 156433046
18580 156433046 130371855 97255010 68940947 50032814 37722950 29595608 24634931
18573 24634931 20843970 18234137 16699006 15425099 14269989 13249127 12346880 11684162
18565 11684162 11172880 11011970 10888655 10975294 11020896 11136861 11650718 12449469 13526317
18556 13526317 15035056 16456667 17968784 20214480 23377223 27493314 33442889 42705196
18548 42705196 56988875 78491053 111644012 158800472 205042642 221698412 212599369
18541B12599369k3076646l5479006l9473406k9754889j8893602j1328466o444147
18534D8149207k860725R06531N000094J0016850J6767115K7452016M1179403M3839479
18526A90449970J8059375q509604k2540576l4186564l9956017l1482575k0497881
18519E1336128j3083460q520224n792621m166417k726099j743244j308215j439333
18511A2556515j432128j150371j294194j061273p48610p21664l56621m87237o87144
18502D617273j76277j36281k11088j14551L19013N01743J00172K12575K12231
18493E324810L37439N89555J66132j37359k53577m05838O239N30420L59566L21190
18483F838577P3339j84407k36222m02054k80980j17551j72880k38124q9910O0265
$$ plain form
18541 212599369 189522723 154043717 114570311 84815422 65921820 54593354 48149207
18534 48149207 45288482 46195013 51195107 61211957 77979072 105431088 146610491 190449970
18526 190449970 208509345 199999741 177459165 143272601 103316584 71834009 51336128
18519 51336128 38252668 29732444 23939823 19773406 17047307 15304063 13995848 12556515
18511 12556515 11124387 9974016 8679822 7618549 6869939 6148275 5791654 5304417 4617273
18502 4617273 4440996 4304715 4093627 3979076 4298089 4799832 4900004 5112579 5324810
18493 5324810 5662249 6251804 6417936 6280577 6027000 5621162 5627401 6157821 6517387 6838577
18483 6838577 6911916 6727509 6491287 6089233 5808253 5690702 5517822 5279698 5189788 5250053
18473E250053o5075o61526m83502l31672p28429n68445p4981o03207l25017N4910
18463A463109K20379k03228l36122R7932J31750j15865k88810J28185N0590n3633
18453A094287j35575J76345J17809K4004J50278P3813j84227M826J39493m1562
18443A419491R9640K55950O83899Q10127P54759L03387n014j59699m22836o43247
18433C096457o13918k41344q8237M9420O57001O11516l4706k29089j79242m00193
18423B627665r27489n14696k12155j3376J03180k17118J12257L577j5078k5613
18413I21154n029k23353k34502J13673J56279M9353j8170j94202p2624N9621Q4854
18402F37054N519P7290J19131l3591k91788J0298L31623r4912l21344J47725p7426
$$ plain form
18473 5250053 5184978 4523452 4039950 3708278 2979849 2411404 2336423 1733216 1408199 1463109
18463 1463109 1683488 1480260 1144138 1242070 1373820 1257955 969145 1097330 1147920 1094287
18453 1094287 958712 1135057 1252866 1276870 1427148 1500961 1316734 1321560 1461053 1419491
18443 1419491 1519131 1775081 2458980 3269107 4023866 4327253 4322239 4162540 3739704 3096457
18433 3096457 2482539 2241195 2152958 2202378 2859379 3470895 3436189 3207100 3027858 2627665
18423 2627665 1700176 1185480 973325 959949 1063129 846011 958268 961845 946767 921154
18413 921154 916125 692772 458270 571943 728222 777575 759405 565203 492579 552200 637054
18402 637054 642573 719863 838994 805403 513615 523913 855536 760624 439280 587005 509579
18391E09579j96535k6956k35588n1176J11730M49033M24178Q6564J73099J45568
18381A389496P7062K6620j07327o1930j26986j32435o9925k08610p5301r970j64915
18370E35779J62221J45551K88335N6525J83368J81702p9054j70723K2073q493
18360A317284m7235l01805k32753j32605j91289p3653k8564M9214l0362m6548
18350B81684J2206r6848j80744o5876j08844N9120P9472K26050l3666R9552j0017
18339B62089j05251m5567N2925q4889m6914j45104J22270L5380J36886Q4362J60502
18328D26689J15521j59139r5622J5106j28498q6858m8097j07158K11938K17665
18318C61547J2915k29806n142k6740K31350k8407k34898k36652n3547j5481K79442
$$ plain form
18391 509579 313044 286088 50500 -676 111054 560087 984265 1070829 1243928 1389496
18381 1389496 1466558 1493178 1385851 1323921 1196935 1064500 994575 785965 710664 700694 535779
18370 535779 698000 843551 1131886 1188411 1371779 1553481 1474427 1303704 1325777 1317284
18360 1317284 1270049 968244 735491 602886 411597 337944 309380 358594 328232 281684
18350 281684 293890 197042 16298 -49578 -158422 -99302 -19830 206220 172554 272106 262089
18339 262089 156838 111271 164196 79307 32393 -112711 9559 44939 181825 266187 426689
18328 426689 542210 383071 287449 302555 174057 87199 39102 -68056 143882 361547
18318 361547 374462 144656 139514 112774 344124 315717 80819 -155833 -209380 -224861 54581
18307E4581K19076p2646q3552R9560Q8338J9830R9673J82423K4863p0891k83482
18296B77773j6690j37351L9715R1641K9459l3218n8184K75299J90343l4269R9702
18285G24220J70789K83908K20532K2865P7820Q2784k5752m41888k24136j6019
18275H75123m2202k11105j47272J3094j13334n7419j31849M4613J34594K02293
18265E66536n8J33488r4700j64368P7043k62214l08872O0728J34383J28357r5040
18254A75283j2185J38999n3510j58141P0384J63311j09922j06807O581Q4059j60289
18243C7763k34561J18911J92133N0013J17238k3687j82830q0199J41529J31778
18233B68088k22363M3808M28613M49452N4760K34065J95600k21224M4477j07539
$$ plain form
18307 54581 273657 201011 117459 217019 305357 325187 424860 607283 632146 561255 277773
18296 277773 261083 123732 163447 255088 284547 251329 193145 468444 658787 624518 724220
18285 724220 895009 1178917 1399449 1422314 1500134 1582918 1557166 1115278 891142 875123
18275 875123 832921 621816 474544 487638 374304 316885 185036 229649 364243 566536
18265 566536 566478 699966 605266 440898 517941 255727 -53145 7583 141966 270323 175283
18254 175283 163098 302097 248587 90446 160830 324141 214219 107412 113993 198052 37763
18243 37763 -196798 -77887 114246 164259 281497 257810 74980 -5219 136310 268088
18233 268088 45725 89533 518146 967598 1022358 1256423 1452023 1230799 1275276 1167737
18223A167737l11257r7486j65783j83631l03345j88137L2765K23077J38358k44639
18213F7659j37814J83856k2916k28252J41374R8919J0370J20086j35861j19214
18203b1793j01316K07098K42441J33020r5311k7031m5108K00946p6548j35939
18193B80459o1008j44502j65620O1770J86490J52606J5997k46392k46939j49446
18183c16585L1573J25908J92755j40753J8672J87847L53886J15614j2590o0900
18173D95427j99200n09O4268J305r0782k77400k47162o4464J3562J43920J37277
18162b3758J40643P0654J27944k11409j15460r8529J48405K8934M0206Q6156k11996
18151a8210N4042K17846l7739n3475n371l9113q6989n3432J28719J13962p1998
$$ plain form
18223 1167737 856480 758994 593211 409580 106235 -81902 -49137 173940 312298 67659
18213 67659 -70155 113701 90785 -137467 3907 102826 113196 233282 97421 -21793
18203 -21793 -123109 83989 326430 459450 364139 337108 292000 492946 416398 280459
18193 280459 219451 74949 -90671 -28901 157589 310195 326192 79800 -167139 -316585
18183 -316585 -285012 -159104 33651 -107102 -88430 99417 453303 568917 556327 495427
18173 495427 296227 295718 359986 361291 270509 -6891 -254053 -318517 -304955 -161035 -23758
18162 -23758 116885 187539 315483 104074 -11386 -109915 38490 67424 107630 193786 -18210
18151 -18210 35832 253678 215939 162464 157093 117980 30991 -22441 106278 220240 148242
18140A48242k40735j07083j3109K71733P8632l5976j58772n6215J13874Q3678
18130H4269P9905Q6920j92137J42850K6509l53138N9084q0847o8178j30177n7036
18119d01976M8478J79101J11023J05938j397r1919j35403R7666O3646q6666K50461
18108A38952K2229O1815R4107P1511j79016r7952J12720J77048j87369n84070
18098c70025j12983J28360R8691j10219l2097L8076L03134L46162J28146J71867
18088E89112o2032l01053k56644j70846J13540K73414P828j36110j51314j61523
18078b55628L36891J91290l2826n4486J97044K16739J05988J15410J41725J6781
18068I78928L903L8632J3817n9937k36227J26470j883l28843o1334o3757j54528
$$ plain form
18140 148242 -92493 -199576 -212685 59048 137680 101704 -57068 -113283 591 84269
18130 84269 164174 251094 58957 201807 228316 -124822 -65738 -146585 -214763 -344940 -401976
18119 -401976 -353498 -174397 -63374 42564 41167 -50752 -186155 -88489 -24843 -111509 138952
18108 138952 161181 222996 317103 388614 209598 111646 224366 401414 214045 -370025
18098 -370025 -483008 -354648 -255957 -366176 -398273 -360197 -57063 289099 417245 589112
18088 589112 527080 226027 -30617 -201463 -87923 185491 193319 57209 -94105 -255628
18078 -255628 81263 272553 239727 185241 382285 599024 705012 820422 962147 978928
18068 978928 982831 1021463 1035280 975343 739116 865586 863703 534860 473526 409769 255241
18057B55241l7416L80276N6946j20516L34365R5548J44248j13028k04116m6322
18047G45226j93183l63317j6406J26607O3371l4143L5295K8692k03249L0780J20255
18036C39928R1753N5551l58037n9153J42501K9873Q7828q131M3904j05447M6550
18025C07120N2323k5809K6717k86J04266J80209R6623k09337p9222J4149M3885
18014E10638L01185K83531K24629K5851l6283j15066j76224k38833l44748j48325
18004B86355K26346K43968o1872j40197J74504Q2771l9243j72988J19519M46838
17994A166001K22091K2097j93043k82514j47941k30991Q1900l8404P485j02363
17984E04318j96173k47075Q1357J5264K3571q1195n3623M8531R8664J59161p0238
$$ plain form
18057 255241 217825 598101 655047 534531 868896 964444 1108692 995664 791548 745226
18047 745226 552043 188726 172320 298927 362298 328155 363450 392142 188893 219673 339928
18036 339928 431681 487232 129195 70042 212543 242416 330244 322113 366017 260570 307120
18025 307120 359443 333634 360351 360065 464331 644540 741163 531826 452604 466753 510638
18014 510638 811823 1095354 1319983 1345834 1309551 1194485 1018261 779428 434680 286355
18004 286355 512701 756669 694797 554600 729104 811875 772632 599644 719163 1166001
17994 1166001 1388092 1410189 1217146 934632 786691 555700 637600 599196 606681 504318
17984 504318 308145 61070 142427 157691 181262 100067 46444 94975 193639 352800 282562
17973B82562J98171Q6825L5839k16063k83680j58451j51424K98254J29455j54408
17963F7080n6574l2211P7304K2703J22877J01557L8921n1678j40807K02012r2118
17952B59066M6989M803q3246j36604J82494o3313j06911l3488J03923r1433p1985
17941A0295l70662M4866J56115R9514j50279l4435K67485L09928k31922N2696
17931A53601N5864m9032O8994K5199k2147K28085L20475j06202j56468J84706
17921G03075L98685k1714o8417j71604l04104j22356L5502j88684m6327J53018
17911C67074k8292k00100K6262J0722J01111J38754P094j05086k28685j34607
17901d5753L8874M0355j8621j83930q2916l3194J40578J47597K37693J33274k6809
$$ plain form
17973 282562 480733 567558 603397 387334 103654 -54797 -206221 92033 221488 67080
17963 67080 10506 -21705 55599 78302 201179 302736 341657 289979 149172 351184 259066
17952 259066 306055 310858 227612 91008 273502 210189 103278 69790 173713 82280 10295
17941 10295 -360367 -315501 -159386 -59872 -210151 -244586 22899 332827 100905 153601
17931 153601 209465 160433 229427 254626 232479 460564 781039 674837 518369 703075
17921 703075 1101760 1080046 1011629 840025 535921 413565 449067 260383 214056 367074
17911 367074 338782 138682 164944 175666 276777 415531 422625 317539 88854 -45753
17901 -45753 -6879 33476 14855 -169075 -251991 -285185 -144607 2990 240683 373957 347148
17890C47148j62361n9027p2476k98812k60248J40413J74750J24320q9734K85189
17880A29162O8037O4004J15119j70246n8758K18214J45286o8962p0725J2109m6118
17869C37122N8388j91343Q160R3841L76103K21142L198j85921j66466j13895K8427
17858D68756k06991j71815k0017n4377Q7817K23322l1866o2377p4693j21457J4187
17847E0489j51164K07597K41451r8071J42452o3285j15124L14794o6789K1817
17837D84167Q3473q2625j45940l5853J16761M7973L1783J06154K8796K09428m6454
17826G97663k98468K2757J02776N9721K3587p3031k31298J19007L65305J58044
17816A046063J0304J39297r0359N825J42402P6374P1182j02685j198K54129L74097
$$ plain form
17890 347148 184787 125760 53284 -245528 -505776 -365363 -190613 -66293 -156027 129162
17880 129162 197199 261203 376322 206076 147318 365532 510818 441856 371131 383240 337122
17869 337122 395510 204167 212327 306168 682271 903413 906611 720690 554224 440329 468756
17858 468756 261765 89950 69933 15556 103373 326695 294829 232452 157759 36302 50489
17847 50489 -100675 106922 348373 250302 392754 329469 214345 529139 462350 484167
17837 484167 567640 485015 339075 303222 419983 467956 499739 605893 634689 844117 797663
17826 797663 499195 521952 624728 684449 708036 635005 403707 522714 888019 1046063
17816 1046063 1056367 1195664 1105305 1111130 1253532 1329906 1401088 1298403 1297205 1551334 1925431
17805A925431j14865K87980N34863M01203J64966Q0680N88090L93895j2486r6887
17795D152870j34406J3912p6497K51494N8783K90809L12692P31078Q53767P91324
17785G245826O44338N23255L81125M14625N93277O42910J072495J323774J819186
17776A4660811K419468L026190L817211N322567P568612J0495026J4990304K1801735
17768H4101924L2380996M8072108O5000705O3842523M7085525L0827844m480587
17761C66831038m1989209n5998380n8001292n5454825m2545295k8421647j8829492
17754F5590898j2824200q755337o538498m553718l197413k359801k084994j477987
17746B3798950r34877q50630l00106m91150j033046j365824j701965k497622j948449
$$ plain form
17805 1925431 1810566 2098546 2633409 3034612 3199578 3280258 3868348 4262243 4249757 4152870
17795 4152870 4018464 4032376 3955879 4207373 4266156 4556965 4869657 5600735 6454502 7245826
17785 7245826 7890164 8413419 8794544 9209169 9802446 10445356 11517851 12841625 14660811
17776 14660811 17080279 20106469 23923680 29246247 36814859 47309885 62300189 84101924
17768 84101924 116482920 164555028 229555733 293398256 340483781 371311625 366831038
17761 366831038 324841829 268843449 210842157 155387332 112842037 84420390 65590898
17754 65590898 52766698 44011361 37472863 32919145 29721732 27361931 25276937 23798950
17746 23798950 22864073 22013443 21713337 21222187 20189141 18823317 17121352 14623730 12675281
17737A2675281j371268j154985n69302l48891l29577Q3472N03026Q06526M93289
17728A0787571M40337M11693j87730K259K97748M64852R90565R66809J152086
17719A5326190J952620K460786L576964M970514P008537R685278J3717858K0574932
17711G9273679L0558804M5942040N9441579N3349579L8900964K2791418j2140136
17704C18117927m2298522n0497706n1163873m6887709l3890790k1877564j4888962
17697E6612801j0430082p353332n662719m233750l296423k722093k268226j769828
17689A8876348j792107j552032j525494j453372j177472j297889j369318j184694
17681G523970q02308o78055m50652n04720l85157j96968j17464r1189Q6643l369
$$ plain form
17737 12675281 11304013 10149028 9579726 9230835 8901258 8984730 9487756 10294282 10787571
17728 10787571 11227908 11639601 11451871 11454130 11751878 12216730 13207295 14174104 15326190
17719 15326190 17278810 19739596 23316560 28287074 35295611 44980889 58698747 79273679
17711 79273679 109832483 155774523 215216102 268565681 307466645 330258063 318117927
17704 318117927 275819405 225321699 174157826 127270117 93379327 71501763 56612801
17697 56612801 46182719 38829387 33166668 28932918 25636495 22914402 20646176 18876348
17689 18876348 17084241 15532209 14006715 12553343 11375871 10077982 8708664 7523970
17681 7523970 6721662 6043607 5592955 5088235 4703078 4506110 4388646 4297457 4384100 4380731
17671D380731j72049l8851l05208l49195m26692l57068k40104j64290j70919m3865
17661B112490j10642l07802k43075O5183r9024n4758J27030K1271m241J24455
17651A630887J28420j12879j95272J10547n05Q4513O9359J40036J32841L9850
17641B027797J85890M58740N64723R33782J173756O73126J93807j35474k36922
17632E839225l17559k15541J94505l4350m70360n41236o09811p27789q40780l96202
17622A880102r964l48297l01727p0771N5634P0469k20838m8945J06660j04327
17612A007996j33652p2430k1982j88488j01196q8856j58081Q6730J18445J37433
17602E85919N0515j82727p4179J86356J58207L9347L57526M31090L35104M55514
$$ plain form
17671 4380731 4208682 4169831 3864623 3515428 3088736 2731668 2491564 2327274 2156355 2112490
17661 2112490 2001848 1694046 1450971 1516154 1417130 1362372 1489402 1510673 1506432 1630887
17651 1630887 1759307 1646428 1451156 1561703 1561198 1645711 1715070 1855106 1987947 2027797
17641 2027797 2213687 2672427 3237150 4170932 5344688 6017814 6211621 6076147 5839225
17632 5839225 5521666 5306125 5500630 5466280 4995920 4454684 3844873 3117084 2276304 1880102
17622 1880102 1870138 1521841 1220114 1149343 1204977 1275446 1054608 1005663 1112323 1007996
17612 1007996 874344 801914 779932 591444 490248 401392 243311 330041 448486 585919
17602 585919 636434 453707 379528 565884 724091 763438 1120964 1552054 1887158 2342672
17592B342672P59358R24860J282782J269803Q28453O03581J83353j69227P498
17583H033133M0920j27331p3019m06743j001260j217204j338380j078472p21329
17574B110315m90206k85908q6511j19566j09391J3327j41950n3359l314P4769
17564I08206k9563L678j45341j40876J84762j00779k50949j85500M7083K7843
17554C18564Q6639k18826k44072l2539k46531N0450J95696k2219J34066N90409
17544F11637N52138M95202O37210P42743M23763l8976j8905k24665n0741J23965
17534C253371L76295N6356l54461o16082q09241m43216l00373k67365l37256j09339
17524D48689j75326n3826P3916J08391J03224M516K11128Q9743j05402j67104
$$ plain form
17592 2342672 3102030 4026890 5309672 6579475 7407928 8011509 8194862 8025635 8033133
17583 8033133 8074053 7946722 7873703 7466960 6465700 5248496 3910116 2831644 2110315
17574 2110315 1620109 1334201 1247690 1128124 1018733 1032060 890110 836751 833437 908206
17564 908206 878643 882321 736980 596104 780866 680087 429138 243638 290721 318564
17554 318564 405203 186377 -57695 -90234 -336765 -286315 -90619 -112838 21228 611637
17544 611637 1163775 1658977 2296187 3038930 3462693 3423717 3404812 3180147 3129406 3253371
17534 3253371 3629666 3686022 3331561 2715479 1906238 1463022 1162649 895284 558028 448689
17524 448689 273363 219537 293453 401844 505068 509584 720712 810455 705053 537949
17514E37949j7430J4874q4330q0680j05783j15548j29526n6224O301k8922j21958
17503a81277K30683K638r015j23941j10069p7940J44207J81719J34402n0682J50340
17492B91065O9623r8749k35177N5986j59690j85940j02063J6264O0060K2523r1488
17481c57586J94414K66460p1743N305o5006q1751L4706O7987J20098j39091j88294
17470b14501j9252P6771j12470Q4482K16135j78723P7912K27643k3933j91911
17460e7847j32790J34354j0835P6234P1740j2751j14292R2063K02560Q9790J82458
17449E20684j00322j81167p3342j9490r089K44177J74783k20490K9462L7863l35167
17438F7902k08973k2262j70825j55511Q3781J40478J30507J86674p8640k55047
$$ plain form
17514 537949 520519 535393 451063 370383 264600 149052 19526 -36698 -30397 -59319 -181277
17503 -181277 49406 52044 43029 -80912 -190981 -268921 -124714 57005 191407 140725 291065
17492 291065 360688 261939 26762 82748 -76942 -262882 -364945 -348681 -288621 -266098 -357586
17481 -357586 -163172 103288 31545 36850 -28156 -109907 -75201 -7214 112884 -26207 -214501
17470 -214501 -233753 -156982 -269452 -184970 31165 -147558 -69646 157997 134064 -57847
17460 -57847 -190637 -56283 -67118 9116 80856 68105 -46187 45876 248436 338226 520684
17449 520684 420362 239195 165853 146363 137274 381451 556234 335744 365206 403069 67902
17438 67902 -141071 -163333 -334158 -489669 -405888 -265410 -134903 51771 -26869 -281916
17428b81916n6494R2993R0686m645p235K0735M1976j33523j00405K2867K22122
17417i2839p3485K38152k0827r8969L5202q0841J48728M9492j04174j80953j22466
17406c02980m9968J44562J42882j59241q5017J97824j12190o8945P3689j0201
17396b29585M9115j22371j04695J87530K65432j71781j04026j51472M3418J52398
17386a86037K57181N5564m5200R0538L6620j15070o643k347J39032j023j29101
17375I3514o8760j15469O3703K46297q227j51201o1715j59489K5074j15645r5763
17364c47681M7759J67511j7421K17534q8274P078o6654J94828J54320k94569l29093
17353c54662j37929j5995L7829j50562K43546O8032J33709o7458J41535K14101
$$ plain form
17428 -281916 -338410 -245417 -154731 -159376 -166611 -145876 -103900 -237423 -337828 -314961 -92839
17417 -92839 -166324 71828 51001 -47968 -12766 -93607 55121 104613 439 -180514 -302980
17406 -302980 -352948 -208386 -65504 -224745 -309762 -111938 -224128 -293073 -219384 -229585
17396 -229585 -180470 -302841 -407536 -220006 45426 -126355 -230381 -381853 -338435 -186037
17386 -186037 71144 126708 81508 172046 208666 93596 86953 84606 223638 222615 93514
17375 93514 24754 -90715 -27012 219285 211058 59857 -1858 -161347 -136273 -251918 -347681
17364 -347681 -299922 -132411 -149832 67702 -20572 -13494 -80148 114680 269000 -25569 -354662
17353 -354662 -492591 -508586 -470757 -621319 -377773 -309741 -176032 -243490 -101955 112146
17343A12146j44342j12084j24334P3808P1839j30092J70416J40894j32920m0389
17333a15058Q666M7671m1551J15202K29064r446k67275L5209o5682O1788r5318
17322i6730p4078K1107k9746k2155q4666M2295J64395j01484k1414P4336O9261
17311e8879K72069k394q9250k98814l39796K16946J35853m2108o9674R4021J02334
17300g9692K09589j9245R6176J46290J5263k25075k21630j91845k3524j00172
17290c93865l1123k23686p3958K8472K48703L71569K09562j9665P9006n0075O6862
17279B11802J7536j76000j31979n583q4728P0605L14487J39108j19220m4971p0032
17268A21025j24945k2968j79402J12867K1576R2063j04119j67321J47815J72990
$$ plain form
17343 112146 -32196 -144280 -268614 -194806 -122967 -253059 -82643 58251 -74669 -115058
17333 -115058 -106392 -58721 -100272 14930 243994 234548 -32727 2482 -63200 -1412 -96730
17322 -96730 -170808 -149701 -179447 -201602 -286268 -243973 -79578 -181062 -202476 -128140 -58879
17311 -58879 213190 210796 121546 -177268 -517064 -300118 -164265 -206373 -276047 -182026 -79692
17300 -79692 129897 110652 206828 353118 368381 143306 -78324 -270169 -293693 -393865
17290 -393865 -424988 -648674 -722632 -694160 -445457 -73888 135674 116009 195015 144940 211802
17279 211802 229338 53338 -78641 -84224 -168952 -98347 216140 355248 236028 191057 121025
17268 121025 -3920 -26888 -206290 -93423 -71847 20216 -83903 -251224 -103409 69581
17258F9581J52480O5054k16525k63400M3744K2273p1144n655L82065Q9129O829
17247B74431o1136j6800K5477J30668J15002K01301j3411n2962K01021K14366
17237A017957J19067K7846J7925R1402j66181j34953k71311j76139j90281j61960
17227A73372R3387m0695Q6410O3606k07011k27781l04445k08920L12558k244J72712
17216h9051J90442P07r1305q2418p7183k9604r9214J82939k1543P1729K19678
17205A75177J71999K6425j05864L9540j59112j90750Q6920j7130j01384K79489
17195B05310K53238l1249j02581k25726j02562P1243L17148L14764k33720j2917
17185D52948J13550M37864K79151j06755j74412j88556k4916J0261j05762j29895
$$ plain form
17258 69581 222061 287115 70590 -192810 -149066 -126793 -197937 -203592 178473 267602 274431
17247 274431 213295 196495 221972 352640 467642 668943 655532 602570 803591 1017957
17237 1017957 1137024 1164870 1182795 1274197 1108016 973063 701752 525613 335332 173372
17227 173372 266759 226064 312474 376080 169069 -58712 -363157 -572077 -259519 -261763 -89051
17216 -89051 101391 102098 10793 -71625 -148808 -178412 -277626 -94687 -116230 -44501 175177
17205 175177 347176 373601 267737 307277 148165 -42585 44335 27205 -74179 205310
17195 205310 458548 427299 324718 98992 -3570 67673 384821 699585 465865 452948
17185 452948 566498 1004362 1283513 1176758 1002346 813790 788874 799135 693373 563478
17175E63478N4505Q8962k10503j06089J59726r0623j07384O257j50813k15597
17165h081P3845Q623q3030P1902K29013J8859J95839j06387j16587j51662j94904
17154f2570j82466m34892k1150M71562M33293N2275m9704K2260p0251j17887j41398
17143a00928J0170K34336l2899o7495l22232q7445J20964J39031j49270j21371
17133c77139j94544J00687L9093J48856J72216k1872l405j26758L4239J96318
17123c2309j9842l26858o1820J14420K47929K0292j85479k11490m2409K54459
17113b43107J68531J29156j09518m28580k46568K69839J12270q888L41300l2202
17103d7767M9747M3160k42645J77561L88923l9107n308J2894n7690L8553r6901
$$ plain form
17175 563478 617983 706945 496442 390353 550079 459456 352072 358329 207516 -8081
17165 -8081 65764 74387 -8643 63259 292272 311131 506970 400583 283996 132334 -62570
17154 -62570 -245036 -679928 -701078 -229516 203777 256052 206348 228608 158357 40470 -100928
17143 -100928 -90758 143578 110679 43184 -279048 -366493 -245529 -106498 -255768 -377139
17133 -377139 -571683 -470996 -431903 -283047 -110831 -132703 -136108 -262866 -228627 -32309
17123 -32309 -52151 -379009 -440829 -326409 -78480 -58188 -243667 -455157 -497566 -243107
17113 -243107 -74576 54580 -54938 -483518 -730086 -460247 -347977 -356865 -15565 -47767
17103 -47767 1980 45140 -197505 -19944 368979 329872 324564 337458 279768 318321 221420
17092B21420j86155j66567m4966k24225r5595m095K61078J48529O804N0096J54329
17081A20653J21541m1745j60410j0501L6687k03848j71906j07156K30989K08699
17071B3003j51625j25146J33468J1407P9793J5265j01253j70427j25703K79195
17061a32023p274j28531J69455j78655j43480O9083J50201K45002J78074K5990
17051B47842o5033N9678k9585j61191j85046m3970n559J73555l9846j21162M9820
17040a20497K9074j8337O6190L7356R068o7654j53905Q5437J14196J228q734R7106
17028G0528L6042J9033l3756L6034P5683p2699m6378j68934J8767j74556L2875
17017b07361J36236n0256L60K62660q9339j76197O9155q5387p6458J55240q0835
$$ plain form
17092 221420 35265 -131302 -176268 -400493 -496088 -500183 -239105 -90576 -83772 -33676 120653
17081 120653 242194 200449 40039 29538 66225 -137623 -309529 -416685 -185696 23003
17071 23003 -128622 -253768 -120300 -108893 -29100 -13835 -115088 -285515 -411218 -132023
17061 -132023 -139297 -267828 -98373 -277028 -420508 -351425 -201224 43778 221852 247842
17051 247842 182809 242487 212902 51711 -133335 -177305 -182864 -9309 -49155 -170317 -120497
17040 -120497 -91423 -109760 -43570 -6214 2854 -64800 -218705 -133268 -19072 -17844 -26578 70528
17028 70528 106570 125603 91847 127881 203564 130865 84487 -84447 -65680 -240236 -207361
17017 -207361 -71125 -121381 -121021 141639 52300 -123897 -54742 -140129 -216587 -61347 -142182
17006a42182j13928Q5020K39866j8821N3848j47847P5831l2843l040J55539R160
16995A60603Q7377n521n4306j62261k49631J3322k555J36160N9789k03380R8908
16984a21495K35878L4514r416r5133j3530Q0170j43155j03761k76990n5558K12751
16973b55725O7535R2258J36318j31350m29582j76410J60957K39044Q9604m0912
16963b48263m2838N3295J72421J85992O3225k0187K8257k49856l19181J43912
16953b33223J47445J74681M252m5899j7762j66638m3619J02112J49845k45967
16943a74773j88592j13345J45243P0829k25317K3866M44531K40418j22593k7001
16933G3266k8657J2357Q8824K7521k16363k04425m8778j63467p17J82813M4438
$$ plain form
17006 -142182 -256110 -171090 68776 49955 103803 -44044 31787 -1056 -4096 151443 160603
16995 160603 247980 242459 188153 25892 -223739 -210417 -212972 -76812 -17023 -220403 -121495
16984 -121495 114383 148897 139481 44348 30818 110988 -32167 -135928 -412918 -468476 -255725
16973 -255725 -188190 -95932 40386 -90964 -520546 -696956 -535999 -296955 -207351 -248263
16963 -248263 -291101 -237806 -65385 120607 183832 163645 191902 -57954 -377135 -233223
16953 -233223 -85778 88903 93155 47256 29494 -137144 -180763 -78651 71194 -174773
16943 -174773 -363365 -476710 -331467 -260638 -485955 -462089 -17558 222860 100267 73266
16933 73266 44609 56966 145790 173311 -43052 -247477 -296255 -459722 -460439 -277626 -233188
16922b33188m6424k15610J60460K81686J30376n9036j32642l21381l927J61041
16912b78645K05731J2980k19375l4580J05875J44983M2187J16143K01413j57932
16902A38780k14338n3990l7801R6343J53646J57463J54383m7230k150k96993r3909
16891d5796p5826j61167Q9464M38235j10945j30880K836P0606m7380l9086k134
16880a2073r1184o6506j9070q4199q8722O8600J02031J11127j48861n4106P7470
16869b05493J09950k55676j26895M3946J01073K81881J5906J33005r4413j43151
16859a39867k13242K7179N7344L3736K24509J81635k6348j99792j45988J44736
16849e6098J66674j02062N6322O2547J12400j64687M6499o8307k109O1801j54744
$$ plain form
16922 -233188 -279612 -495222 -334762 -53076 77300 18264 -114378 -435759 -439686 -278645
16912 -278645 -72914 -59934 -279309 -313889 -208014 -63031 -20844 95299 296712 138780
16902 138780 -75558 -129548 -167349 -71006 82640 240103 394486 347256 345106 48113 -45796
16891 -45796 -121622 -282789 -193325 244910 133965 3085 5921 76527 29147 -9939 -12073
16880 -12073 -103257 -169763 -188833 -273032 -361754 -293154 -191123 -79996 -228857 -282963 -205493
16869 -205493 -95543 -351219 -478114 -434168 -333095 -51214 -35308 97697 3284 -139867
16859 -139867 -353109 -325930 -268586 -234850 -10341 171294 144946 -54846 -200834 -56098
16849 -56098 110576 8514 64836 127383 239783 75096 121595 53288 51179 112980 -41764
16838d1764r248j47689n5617K07369N5286R5972l6749p8484R7440L9099j85444
16827e9829p4372P5426J32328J8044P3202J48335O7929o2316o8108k48699k4742
16816b2802K39762J41311l0186j53942n0090q0957j89788j2340L54216J67042
16806C62226j67043l92168o9315m392J4075K00948J09827M2699p184O7408k7548
16795A29533k6125J14353r985m8640l9213m0763j16444j3758J7135m6286j47594
16784b27787M9101R4966J10389k6027p4114k82912j7878R9859L23418Q8458n8229
16773G9244l07850m05889p6450O0232K55130L52423J61626j38184M8294j75996
16763a47420j23104L9591K77682L3333j4114R0633p9011j58281l7112K08327j29922
$$ plain form
16838 -41764 -51012 -198701 -254318 -46949 8337 104309 67560 -10924 86516 125615 -59829
16827 -59829 -134201 -58775 73553 91597 164799 313134 381063 318747 250639 1940 -22802
16816 -22802 216960 358271 328085 174143 124053 43096 -146692 -159032 195184 362226
16806 362226 195183 -196985 -266300 -270692 -256617 -55669 54158 96857 89673 157081 129533
16795 129533 103408 217761 207776 159136 119923 79160 -37284 -51042 -33907 -80193 -227787
16784 -227787 -178686 -83720 26669 642 -73472 -356384 -374262 -274403 49015 137473 79244
16773 79244 -228606 -634495 -710945 -650713 -395583 -43160 118466 -19718 28576 -147420
16763 -147420 -270524 -230933 46749 80082 65968 156601 77590 -80691 -117803 90524 -39398
16752c9398J26236p0972r5206l3360m9067j80124r6631Q7828K77382M1844k7137
16741e8605K4565j06039K1341j8943L5257J13497j74978r3234J24473j75092R1272
16730b16486L26632j04394j28238j92087p8202m2077J88365l0405j36346Q4568
16720c28670M8999j0594j17821Q3051j725K00563J84168L5490J8656j08047j37768
16709a33698r1602k17118j4018J95418j36282J97328K83328J15437o8929j46831
16699a6967J05858p6866j70478j56997j08290K27285k3508j33920J60393L8821
16689a54669m1503J116N9794P4677K5470K52860j53420j26697j34597J04600J34533
16678D2164j40687o7064l9193K24132K80477J19992p6296j82773k18725j78762
$$ plain form
16752 -39398 86838 15866 -79340 -112700 -161767 -341891 -438522 -350694 -73312 -31468 -58605
16741 -58605 -34040 -140079 -118738 -137681 -102424 11073 -163905 -257139 -132666 -307758 -216486
16730 -216486 110146 5752 -122486 -314573 -392775 -434852 -246487 -276892 -413238 -328670
16720 -328670 -279671 -290265 -408086 -325035 -326760 -126197 57971 93461 112117 4070 -133698
16709 -133698 -225300 -442418 -456436 -261018 -397300 -199972 83356 198793 129864 -16967
16699 -16967 88891 12025 -158453 -315450 -423740 -196455 -219963 -353883 -193490 -154669
16689 -154669 -196172 -195056 -135262 -60585 -35115 217745 64325 -62372 -196969 -92369 42164
16678 42164 -98523 -165587 -204780 19352 299829 419821 343525 160752 -57973 -236735
16668b36735K1166J57611q2268P4509Q2154J22623N953j40937k42541J25744m1277
16657a53998l8740q2187K6352J34214R1601j48922l1385J67584O9540j11452J16647
16646C9254r743j10755j9451k3792k4896q3826l4083J01920R7542Q258k3001O2870
16634a9703K09555R6583n6452p788J97108m4546k00568n5108j24625Q6310Q0480
16623A61246o0086m1182J79539j70103l1019M6975O6678J08488j61426P4947J52643
16612C26700l43839p5649m8571l0230n4614O2594k4074J88478J77329J44418L8385
16601C60927j01080l08815j01108P5993K51907q398j39871N8296J56978Q518J77792
16590D31139r3825m00287j69878P8794M1955k3431J12518J06359j09121J83490
$$ plain form
16668 -236735 -215569 -57958 -140226 -65717 16437 139060 145013 4076 -238465 -112721 -153998
16657 -153998 -192738 -274925 -248573 -114359 -22758 -171680 -203065 -35481 34059 -77393 39254
16646 39254 29511 -81244 -100695 -124487 -149383 -233209 -267292 -165372 -67830 -59572 -82573 -19703
16634 -19703 189852 286435 229983 222195 419303 374757 174189 119081 -5544 80766 161246
16623 161246 101160 59978 239517 69414 38395 85370 152048 260536 99110 174057 326700
16612 326700 -17139 -92788 -141359 -171589 -226203 -163609 -187683 795 178124 322542 360927
16601 360927 259847 -48968 -150076 -74083 177824 169426 29555 87851 244829 253347 431139
16590 431139 337314 -62973 -232851 -154057 -112102 -135533 -23015 83344 -25777 157713
16580A57713Q7652j07757r4474r9106j51562K46157K32828p4296j21667J13907
16570A89395J06605J79528k33245k11962k83105m0842K83901P8682L7561J29971
16560B36489j80801J88250K57184l0640k88777l67192k2413K24449l7408j94415
16550b15274L0827q4822j89782l154J46054J94239Q9776q8342J04509K0242l7300
16539c3027m3449J41020l3705O4092k23630k06179q9798L7996j5108L15670K19844
16528A33726k7650O0461k09654j12258L2385K32371L38837j67608k63008j33914
16518a16312k61457j02332L77177K95337k733j12630J76175J53538K9115k4724
16508D11154L20099J74603k82978k83822L001k01386O4546n9549K6555j01486
$$ plain form
16580 157713 245365 137608 43134 -55972 -207534 38623 271451 197155 75488 189395
16570 189395 296000 475528 242283 30321 -252784 -293626 -9725 68957 106518 236489
16560 236489 55688 243938 501122 470482 181705 -185487 -207900 16549 -20859 -215274
16550 -215274 -184447 -269269 -459051 -462205 -316151 -121912 -32136 -120478 -15969 4273 -33027
16539 -33027 -76476 64544 30839 94931 -128699 -334878 -424676 -386680 -401788 -86118 133726
16528 133726 106076 166537 -43117 -155375 -122990 109381 448218 280610 17602 -116312
16518 -116312 -377769 -480101 -102924 192413 189680 77050 253225 406763 435878 411154
16508 411154 731253 905856 622878 339056 342057 140671 205217 145668 172223 70737
16498G0737J99433N0816J13542l48773r1812P8885m608j32987k41449O4508J21467
16487a20241J6951J05986J02221P7640j07598R324K15833r8137j78056j29824
16477a05901k9214Q392j2666J85286O5104J28510j9445j02278k47553r112O7581
16466g1296p1313M1381N7408J21882L1733P4059L13303k8165l64774k87745j34482
16455c18009K4598q6096k07654J13259J87519J18440K42838J26006J01870J20841
16445D23612k85067k21184K48589M1111k88078n7130j75143Q2095j04109N8282
16435b77022m3755J6635K72873m3944j73281R8796K51587J35893M6308k01849
16425H2241l33567L5629J35331J89663k0764j01233K57193P0796l0065j84375
$$ plain form
16498 70737 270170 320986 434528 85755 -6057 72828 68220 -64767 -306216 -241708 -120241
16487 -120241 -103290 2696 104917 182557 74959 84283 300116 201979 23923 -105901
16477 -105901 -135115 -126723 -139389 45897 111001 239511 220066 117788 -129765 -138877 -71296
16466 -71296 -142609 -101228 -43820 78062 109795 183854 497157 468992 104218 -183527 -318009
16455 -318009 -293411 -379507 -587161 -473902 -286383 -167943 74895 200901 302771 423612
16445 423612 138545 -82639 165950 207061 -81017 -138147 -313290 -231195 -335304 -277022
16435 -277022 -320777 -304142 -31269 -75213 -248494 -149698 101889 237782 284090 82241
16425 82241 -251326 -215697 -80366 109297 88533 -12700 244493 315289 285224 100849
16415A00849j67866k9567N6101q4513Q809k5422j0351p9264p2889N9418J13463
16404a31232o4879R2000R6149m6629M3289J35837j17766j65825k61196N6662M4771
16393c18819l2405Q8397J09345Q8995P2735N7889p805o0949m9423J3645R8146
16382E9751J19809K3182M224o2732k77549p9128Q1225k0136J17347J7967p9235
16371i5275P4200J56488J03868q157J03165j0425Q7696O144q3946n4632n714j74354
16359I9058k01880j05401L4885k989J44703n977o9093n260K01812K30042l6661
16348B83239j56713k12766j85268J06016N0021K99741K18684q3683j64477j5439
16338A39355j29846M0056r5420q8272n2117j66978l8272k3988Q0473J73604n1846
$$ plain form
16415 100849 -67017 -96584 -40483 -124996 -116187 -141609 -151960 -231224 -304113 -244695 -131232
16404 -131232 -196111 -104111 -7962 -54591 -11302 124535 6769 -159056 -420252 -363590 -318819
16393 -318819 -351224 -262827 -153482 -64487 8248 66137 58332 -2617 -52040 -38395 59751
16382 59751 179560 202742 206966 144234 -133315 -212443 -131218 -151354 -34007 -16040 -95275
16371 -95275 -21075 135413 239281 231124 334289 323864 411560 417704 333758 279126 273412 99058
16359 99058 -102822 -208223 -173338 -176327 -31624 -37601 -106694 -111954 89858 319900 283239
16348 283239 126526 -86240 -271508 -165492 -115471 184270 402954 319271 154794 139355
16338 139355 9509 49565 -45855 -134127 -186244 -353222 -391494 -415482 -335009 -161405 -213251
16327b13251j8215O7384K06736L1726k35113j284N803l6627N8871J23597J9372
16316H999K32583O9528R1010j07261m9436k01338O7562l0075R3611p9092P4726
16305A70817j19776j62272K38049j49673k33933j18683Q6430R9708r0770Q3298
16295a96805K66018P0631K2947k07223O5965n05r2115j01786P9762n8013N6284
16284i4840M6823K23426K38518M1369k58893m37866l0594J26859q5909n1155M59873
16273A77611K36092j61483r1729j74320k17448j68392k0292J34733n6180p5398
16263d16806J72801K55279P9380K8298J83136j51016p3431j38440P0101K35241
16253B44543o9212n8709n0410L2003n2547N1079P8589j08437k06479j59449J12436
$$ plain form
16327 -213251 -231466 -164082 42654 74380 -160733 -162017 -156214 -192841 -133970 -10373 8999
16316 8999 241582 311110 402120 294859 245423 44085 111647 81572 175183 96091 170817
16305 170817 51041 -111231 126818 -22855 -256788 -375471 -289041 -189333 -280103 -196805
16295 -196805 69213 139844 162791 -44432 21533 21028 -71087 -172873 -93111 -151124 -94840
16284 -94840 -48017 175409 413927 455296 196403 -241463 -272057 -145198 -231107 -282262 177611
16273 177611 413703 252220 160491 -13829 -231277 -399669 -419961 -285228 -341408 -416806
16263 -416806 -244005 11274 90654 118952 302088 151072 77641 -60799 9302 244543
16253 244543 175331 116622 66212 98215 45668 96747 175336 66899 -139580 -299029 -186593
16242a86593J69076j97601K1612J64328J17318J44301j8655j54644j07765K02575
16232A53952j24349q3665L250J38440k72467j23579K61025K4315m57475n2889
16222e33442K81755J80534J08m9414k1049N2909J65429O4287q3240k245j35119
16211g9487l42883m6293J61161L93021L52377j00559j3300r3509k01094j48637
16201a19203K04400J43970l7934N1155O8746l3848j25002k53456j23026p2134
16191b96332P5096J0711N7414K62091O8860J1018k4019R9650j19738J43190J5336
16180C03277O0112L6026j76196m1073O350m847N6192j7738q7520m9063j11254
16169b5734j4941M6496J767K2977k51651j30977o4674P5479J27845Q860R2774
$$ plain form
16242 -186593 -17517 -215118 -193506 -29178 88140 232441 213786 59142 -48623 153952
16232 153952 29603 -54062 -50812 87628 -184839 -308418 -47393 -23078 -480553 -533442
16222 -533442 -251687 -71153 -71045 -120459 -141508 -88599 76830 141117 57877 55632 -79487
16211 -79487 -422370 -468663 -307502 85519 437896 337337 324037 230528 29434 -119203
16201 -119203 85197 229167 191233 242388 311134 277286 152284 -101172 -224198 -296332
16191 -296332 -221236 -210525 -153111 108980 177840 188858 164839 264489 144751 287941 303277
16180 303277 363389 399415 223219 182146 188496 183649 239841 222103 134583 85520 -25734
16169 -25734 -40675 5821 7588 30565 -221086 -352063 -416737 -341258 -213413 -204553 -111779
16158a11779J33468J28339j73126j79630k64160R661K80116K66748m0889k86975
16148b38227r0395l8761K28298J42123J35459R5650o4209j20585p4596M0861J4019
16137B9637j96012Q6352j13943J56641J21664k25072o2729l2263R5275j3029m2494
16126a95973k9013L7486J98696N6425L1299k48479j6646J35130j09325q5201K11981
16115a3620q0790N6529K40693j57636J73721p66l20709j43474J87552q9863j4466
16104a62829N9624o7117J0577K60121J44164k9189J9952k13044j6089R450k4936
16093i316J62024j88647q3149J12614r5162K86024j08421j08535j60232R2838
16083i9962J4860r3408j33393j47766j63470L3288O1962R46J12324J48572J90949
$$ plain form
16158 -111779 21689 150028 -23098 -202728 -466888 -457227 -177111 89637 48748 -238227
16148 -238227 -328622 -367383 -139085 3038 138497 234147 169938 49353 -25243 15618 29637
16137 29637 -166375 -80023 -193966 -37325 84339 -140733 -203462 -235725 -140450 -153479 -195973
16126 -195973 -224986 -187500 11196 67621 98920 -149559 -166205 -31075 -140400 -225601 -13620
16115 -13620 -94410 -37881 202812 45176 218897 218131 -102578 -246052 -58500 -148363 -162829
16104 -162829 -103205 -170322 -159745 100376 244540 215351 235303 22259 6170 15620 -9316
16093 -9316 152708 -35939 -119088 -6474 -101636 184388 75967 -32568 -192800 -99962
16083 -99962 -85102 -178510 -311903 -459669 -623139 -589851 -527889 -526943 -414619 -266047 -75098
16072g5098j698R1520O5135L9656J4967p7125K10805j129q5951r9028p2774o8657
16060e9377o7090o5930N4182K72201k3091j73545r1398l5059O5717O5139l6389
16049i4640K84817N5045r6138q1716k8908j70103j05274o7725J79551K13840l665
16038H5084o674l6616J18558J46234l6065l59336K8876l7442Q9597J59275J33396
16027B84887j31680k07618P3497J8149k03257j64236n0122R2065k39725j25178
16017f53218J26705N9544K33151K16945K12968j52761j24039r7911N8293P3628
16007d6695P7237J56505l6088N6494L9952j75602p1454j9125k4224L9205O8285
15996F4490J12624K95535o4423n9954j8706j20999p7755q131k44033k80711L0057
$$ plain form
16072 -75098 -76796 14724 79859 119515 134482 57357 268162 267033 181082 82054 9280 -59377
16060 -59377 -126467 -192397 -138215 133986 110895 -62650 -154048 -189107 -123390 -58251 -94640
16049 -94640 190177 245222 149084 67368 38460 -131643 -236917 -304642 -125091 88749 85084
16038 85084 78410 41794 160352 306586 270521 -88815 -59939 -97381 -7784 151491 284887
16027 284887 153207 -54411 19086 37235 -166022 -330258 -380380 -288315 -528040 -653218
16017 -653218 -526513 -466969 -233818 -16873 196095 43334 -80705 -178616 -120323 -46695
16007 -46695 30542 187047 150959 207453 247405 71803 349 -18776 -43000 -3795 64490
15996 64490 177114 472649 408226 348272 329566 208567 130812 122681 -121352 -402063 -372006
15985c72006k9756J21540J14753j069j15887Q0775j94825L5722J45175M8304J97124
15974B9850j15255j18985o9217k2635j33388J42216O7348N938j13814m3496J12569
15963b58869L6949l19262J85788J96643L6802N2099K11436R1530O1721j64633
15953A30204m25268r8353l690j11918J25090J54384L9200k0867l1662j0380J6991
15942b36269R792O1673J96988J35715j21616P7623j06499k9269J1770k29983M2653
15931a87422J69420R2767O6464r3686O2558k1139m4737l1729j33741j10038R9361
15920a31922J11796J59882l4523j6710L8770L867j53683o216J80464j41061j17948
15909a07284j2145Q8861q4482p9416j21651L55668M8627o4248r8468m6075J498
$$ plain form
15985 -372006 -401762 -280222 -165469 -166538 -282425 -201650 -396475 -360753 -215578 -167274 29850
15974 29850 -85405 -204390 -273607 -296242 -429630 -287414 -220066 -214128 -327942 -371438 -258869
15963 -258869 -221920 -541182 -355394 -158751 -121949 -69850 141586 233116 294837 130204
15953 130204 -295064 -393417 -397107 -509025 -383935 -229551 -190351 -211218 -242880 -253260 -236269
15942 -236269 -226477 -164804 32184 167899 46283 123906 17407 -11862 -92 -230075 -187422
15931 -187422 -18002 74765 141229 47543 110101 88962 44225 12496 -121245 -231283 -131922
15920 -131922 -20126 139756 105233 88523 127293 131160 -22523 -28739 151725 10664 -107284
15909 -107284 -119429 -30568 -115050 -194466 -316117 39551 88178 23930 -74538 -120613 -119115
15898a19115j41984j74J75630k4236k75175N8795K07817L2244Q0487K57400J86218
15887D37907K047k98008j54879P3935m2070r233J07813j80187J51233O8121j40583
15876A6096j12803J28282J12154l4806K3719m7272J62659j58187l7123O7308r4313
15865B5714P6677m5054k3747O8086j96713N8991J95535R2187j63803m2123l5827
15854I923p9596Q8392l1393k5513k02967J7786r0379j62051O9310J50469Q0298
15843a75721L2842J67335l1328k46757o2911L01194J00076n7993q9854m5239j6148
15832a24504j49736j49007J56840L08798r8393J2222J97343k322l89401k8251
15822b66411k42220k6114Q4238k59167J17623J48360K01873q8725R2248L12990
$$ plain form
15898 -119115 -261099 -261273 -85643 -109879 -385054 -326259 -118442 -86198 -5711 251689 437907
15887 437907 439954 141946 -12933 61002 18932 9699 117512 -62675 88558 156679 16096
15876 16096 -96707 31575 143729 108923 132642 85370 248029 89842 52719 120027 25714
15865 25714 102391 57337 33590 101676 -95037 -36046 159489 251676 87873 45750 9923
15854 9923 -69673 18719 -12674 -38187 -241154 -223368 -313747 -475798 -406488 -256019 -175721
15843 -175721 -142879 24456 -6872 -253629 -316540 -15346 84730 26737 -63117 -108356 -124504
15832 -124504 -274240 -423247 -266407 42391 -56002 -43780 153563 151241 -238160 -266411
15822 -266411 -508631 -534745 -450507 -709674 -592051 -443691 -241818 -330543 -238295 74695
15812G4695j44303r8353o8089O87J96753J6002J16599J22705j00256l37773K8087
15801a93246O0041j16192j45138o6154J19248K02320J35503M5084Q2463k06373
15791h2444k9058O0360m6478R0938p5847k8159J03679J28393n4379J4264M9690
15780A30959J50357N6198J5765j60955j28219j40081M1424K13947J40507m4081
15770B75821m4002j68612r7855r7383j40698P8789J18097P7678J08761J84984
15760B95580K3251O4867j29838l098o349J22551p8052k27246j88576Q9657m6972
15749h4225j56094r5008n2956K02301J57966l1336m8778m8624k2062M2745j04675
15738b40746L0219q1482m6554O2212J68997J27179j70882N92O384J70699O4865
$$ plain form
15812 74695 -69608 -167961 -236050 -235363 -38610 -22608 93991 216696 116440 -221333 -193246
15801 -193246 -133205 -249397 -394535 -460689 -341441 -139121 -3618 41466 123929 -82444
15791 -82444 -111502 -51142 -97620 -6682 -82529 -110688 -7009 121384 67005 81269 130959
15780 130959 281316 337514 353279 192324 64105 -75976 -34552 179395 319902 275821
15770 275821 231819 63207 -34648 -132031 -272729 -193940 -75843 1835 110596 295580
15760 295580 318831 383698 253860 250762 244413 366964 288912 61666 -126910 -37253 -84225
15749 -84225 -240319 -335327 -388283 -185982 -28016 -59352 -108130 -156754 -178816 -136071 -240746
15738 -240746 -210527 -292009 -338563 -276351 -107354 19825 -151057 -150465 -144081 26618 91483
15727I1483j00112j46440J20745J55266L3134r8126j19322K5975L1856p659n8928
15716g2128l6199l2127J46079J47067O4090j71764l1595N9349J5348j32529k92641
15705c37050k6937J16581J66484J7060K2541Q8085q678r1627k04894k52529K639
15694e08325J00140K02561k03022P2501M12768J13860J12038q2122j82180q6698
15684d8479O5794K782j1217J30057p0058k26482P0287K58146L1164o1383L2871
15673A73482N5413l09604n6746K06786P6418R5815j8870m9897j39649j09423J23781
15662D7506L64158k04886m1152O701j15380j01234j64885o9447J83633q0039j10490
15651b85515n2989n0473p2673J19822K01945J50558j0988p7912Q1503k24040j20368
$$ plain form
15727 91483 -8629 -155069 -34324 120942 154076 55950 -63372 -37397 -5541 -13200 -72128
15716 -72128 -108327 -140454 5625 152692 216782 45018 13423 72772 88120 -44409 -337050
15705 -337050 -363987 -247406 -80922 -63862 -41321 46764 38086 -53541 -258435 -510964 -508325
15694 -508325 -408185 -205624 -408646 -336145 76623 190483 302521 220399 38219 -48479
15684 -48479 17315 20097 8880 138937 68879 -157603 -87316 170830 201994 140611 173482
15673 173482 228895 -80709 -137455 69331 145749 241564 222694 172797 33148 -76275 47506
15662 47506 411664 206778 165626 172327 56947 -44287 -209172 -278619 -94986 -175025 -285515
15651 -285515 -338504 -388977 -461650 -341828 -139883 10675 -313 -78225 3278 -220762 -341130
15640c41130m3780K47406j91277j53613r1877Q9084J76479K07962m1749K8592
15630a13903J23049j25348l7299N7671q9382J54394K39790N0868j28481n4714
15620G6645j77800q5871P9631K1778k23327j49208L4670n5231J81226J54179j23315
15609b66623o5289J94681J14604k6268k00120j91910N6317L85131K14365k1451
15599A93437n7612j09095J13633q5973j64638J69017J69323R5300n0249J69958
15589D43101j10634k63876j82812j07626n8834M7722J65365K21927J47361k6157
15579B75537k6236n5067J7242R5188j76501j92213K17165J10333K6388l0281k0452
15568B41103J30153K7486m1919k92500j58987k13046q7604R7513p5776R7109L41653
$$ plain form
15640 -341130 -384910 -137504 -328781 -482394 -574271 -485187 -308708 -100746 -142495 -113903
15630 -113903 9146 -116202 -153501 -95830 -185212 -30818 208972 259840 131359 76645
15620 76645 -101155 -187026 -107395 -85617 -308944 -458152 -423482 -478713 -297487 -143308 -266623
15609 -266623 -331912 -137231 -22627 -48895 -249015 -440925 -384608 523 214888 193437
15599 193437 135825 26730 140363 54390 -110248 58769 228092 323392 273143 443101
15589 443101 332467 68591 -114221 -221847 -280681 -232959 -67594 154333 301694 275537
15579 275537 249301 194234 211476 306664 130163 -62050 155115 265448 291836 261555 241103
15568 241103 371256 398742 356823 64323 -94664 -307710 -395314 -297801 -373577 -276468 65185
15557F5185J29532O047k85224l27921N5108J20590o7598Q0944K49458N45M8723
15546G5389j09336J15997J68914N466q7990k12839q4343j19472L9887q9991J12452
15535a85866p3950j08893j355L03976Q4937J8942p9058j39212J23397j21554Q1093
15524i7543J32016n0578m7766J29124J91959q7169r4156Q1716N735L4967j6880
15513A81425j89307R488n9149k25103P2254K14821l397k4923J9368O0459P2547
15502A28483j26434J17093M2752k8638l0049j57853j20171m20364r2596J64384
15492e23393K25154R1079R7177J6824M4111J51294j39934j2059J03888k8004k11482
15481a85345j59365L13643J83525K2017j12677q7728R0695M2307m6458J19381
$$ plain form
15557 65185 194717 200764 -84460 -412381 -357273 -236683 -304281 -223337 26121 26666 75389
15546 75389 -33947 82050 250964 256430 168440 -44399 -128742 -248214 -208327 -298318 -185866
15535 -185866 -259816 -368709 -370064 -66088 18849 37791 -41267 -180479 -57082 -178636 -97543
15524 -97543 34473 -16105 -63871 65253 257212 170043 75887 157603 163338 198305 181425
15513 181425 -7882 1606 -57543 -282646 -210392 4429 1032 -23891 -4523 55936 128483
15502 128483 2049 119142 161894 133256 103207 -54646 -174817 -595181 -687777 -523393
15492 -523393 -298239 -207160 -109983 -93159 -49048 102246 -37688 -49747 54141 26137 -185345
15481 -185345 -344710 -31067 152458 174475 61798 -25930 64765 107072 60614 179995
15471A79995k9259O840J7422r1819Q3787q582k9157o9591k63608J17203Q6904
15460A35O3186K02220J79169O1076j34263j62748k64664n3165J27983K12428l9112
15449A92245k39242k4468p1642l33036p9742L92539L64758J5827m7729P676P3251
15438B50437k51651j36303J32079K23192j6110K91501j39920k72399k78789j54808
15428c52771J29952K68316k21109m4018J83291j36468j12516j46374k6065l2239
15418d90001K56926K90720J58796j08926k36139J71215J58500p4100k16455j78244
15408b67708K16151q7233j24889L08881J46328k49837j73104J2931n558M1489
15398a82549p9239l6201k0468M7175K21114J38375P9694j22276Q3952j67117k40426
$$ plain form
15471 179995 150736 157576 174998 83179 166966 158384 129227 59636 -203972 -86769 135
15460 135 63321 265541 444710 505786 371523 208775 -55889 -109054 18929 231357 192245
15449 192245 -46997 -71465 -143107 -476143 -555885 -163346 201412 217239 169510 177186 250437
15438 250437 -1214 -137517 -5438 217754 201644 493145 353225 80826 -197963 -352771
15428 -352771 -222819 45497 -175612 -219630 -36339 -172807 -285323 -431697 -457762 -490001
15418 -490001 -233075 57645 216441 107515 -128624 42591 201091 126991 -89464 -267708
15408 -267708 -51557 -138790 -263679 45202 191530 -58307 -231411 -218480 -224038 -182549
15398 -182549 -261788 -297989 -318457 -271282 -50168 88207 167901 45625 129577 -37540 -277966
15387b77966J85941J47117j17326j95539n7626j32283J39137Q3305m6170P7845
15377a93565Q1107M896J34467K21207N5061k07506l27003r2759P3891K30762J19409
15366I9967o130R3858J02154q8872m2417J97126n4721k30860R0473M2960j39443
15355F4095J00189J70381J22034j56683m2515o3320k14485j60731P2992N0037
15345e8006k1918j32069Q3906K15435l11149j13716Q6214M1876K47489J56311
15335A94373j53228j77526j59989R7638K26396j79133Q977j35836j82740K06610
15325b54458P1217k6002J13653r095P1497j47661K2458j81485m6673J12902Q7852
15314a85795K04168O1667N18n0795M4906L4986l06253k37899R5800Q4190j62330
$$ plain form
15387 -277966 -92025 55092 -62234 -257773 -315399 -447682 -308545 -225240 -271410 -193565
15377 -193565 -112458 -107562 26905 248112 303173 95667 -231336 -324095 -250204 -19442 99967
15366 99967 93837 187695 289849 200977 158560 355686 300965 70105 160578 203538 64095
15355 64095 164284 334665 456699 300016 257501 194181 -20304 -181035 -108043 -58006
15345 -58006 -79924 -211993 -128087 87348 -223801 -337517 -251303 -209427 38062 194373
15335 194373 41145 -136381 -296370 -198732 27664 -151469 -142492 -278328 -461068 -254458
15325 -254458 -183241 -209243 -95590 -104685 -33188 -180849 -158391 -339876 -386549 -273647 -185795
15314 -185795 18373 80040 80558 29763 74669 109655 -196598 -434497 -338697 -254507 -416837
15303d16837o3220r0175N8337K42321J63238j64493K06694j8132m26868K5969
15293d83166K20743L1495J26846o8578P0716m218J60296K54106O5118l60583j78653
15282a65878J52756K97951j36736l1612l37428k68355K92901j6701J19983K65932
15272A72813L0034m8996j59733O355J27213J08691J6795k6952r5397l61071j22781
15261c53029Q3168K70209J31095K1938p1084P2009M8623j61477J3848p0902j34955
15250a50557K07221K9350p3908R7395j23012k95054p3692k1317J57064N1723L2093
15239a62694q2097l3586L3532M3321J61692M4497k00088J2797k3883J99247K1674
15228A4412m2256k241J95377r9757p3951k55101j0058K05320K00096J35918k97119
$$ plain form
15303 -416837 -480057 -570232 -511895 -269574 -106336 -270829 -64135 -82267 -509135 -483166
15293 -483166 -262423 -230928 -104082 -172660 -101944 -106162 54134 308240 373358 12775 -165878
15282 -165878 -13122 284829 148093 116481 -220947 -489302 -196401 -213102 -93119 172813
15272 172813 202847 153851 -5882 473 127686 236377 253172 226220 130823 -230248 -353029
15261 -353029 -269861 348 131443 153381 82297 154306 202929 41452 55300 -15602 -150557
15250 -150557 56664 86014 12106 109501 -13511 -308565 -382257 -403574 -246510 -194787 -162694
15239 -162694 -244791 -278377 -244845 -201524 -39832 4665 -195423 -182626 -206509 -7262 14412
15228 14412 -27844 -30085 165292 65535 -8416 -263517 -273575 -68255 131841 267759 -29360
15217b9360r7485n0741M0765Q5740R8810j26485k3364N4015J50276k2308M9875
15206A29738q2624Q2622j54311j36508P2672K12868j6950q1107j44433j58799
15196b76832J08699j9214r2940P3556O741J50654R806r7954P1684N0498m9034
15185f4336j5256l9066K0449j98276l9829J78838O0278P7250n3948K0677J40136
15174H6917j70346k73312O9222L25579J56819m4976j59419l7210K8287J05020
15164H6581j75192o0611p6971J71317J65677M7329N3942q5901o5315p3493q7442
15153a00079J93335m788k50489j09722K38731K98450n5224m4523p4657Q8593J96229
15142C75856j10077O228k9720j74178p3284n8554m3172n9297m5886J11101R1368
$$ plain form
15217 -29360 -126845 -177586 -136821 -51081 47729 -78756 -102120 -48105 102171 79863 129738
15206 129738 47114 129736 -24575 -161083 -88411 124457 107507 26400 -118033 -276832
15196 -276832 -168133 -187347 -280287 -206731 -199990 -49336 -39530 -137484 -65800 -15302 -64336
15185 -64336 -79592 -118658 -98209 -296485 -336314 -157476 -97198 -19948 -73896 -53219 86917
15174 86917 -83429 -356741 -287519 38060 194879 149903 -9516 -46726 -18439 86581
15164 86581 -88611 -149222 -226193 -54876 110801 158130 212072 126171 60856 -12637 -100079
15153 -100079 93256 88468 -162021 -271743 -33012 265438 210214 165691 91034 179627 375856
15142 375856 265779 272007 242287 68109 -5175 -63729 -106901 -166198 -212084 -100983 -9615
15131i615J08701L33794R0971j10470r7426j12535j594p894K37056k46242j96514
15120a1768J43895L3118K46594j76539l02807m1753K419J46627n2254N2859J01108
15109A41499P7474j66280j02102k29386j18500K8626j93319j00287K20539J62010
15099b79726K2516j85592k0631m2834J55746J99633Q2059O5014J5006O8372r4955
15088a5392l8425K1504O8621k5343o0492J23861k30690j98835K20186K71729L4933
15077A71657k36060j36124k66974m2955N6947r9569J27927q8267r456J59862K33941
15066a29071j4089M3274K0385R842n7502k3664J60237L0502j22784j86583j43561
15055d13014k659J73743L05154J23438J27821P1920j48213o6140r1100j33115
$$ plain form
15131 -9615 99086 432880 523851 413381 315955 203420 201826 193932 430988 184746 -11768
15120 -11768 132127 165245 411839 235300 -67507 -109260 -106841 39786 -12468 40391 141499
15109 141499 218973 52693 -49409 -278795 -397295 -368669 -561988 -662275 -441736 -279726
15099 -279726 -257210 -442802 -463433 -506267 -350521 -150888 -68829 -3815 11191 79563 -15392
15088 -15392 -53817 -32313 36308 10965 -49527 74334 -156356 -355191 -135005 136724 171657
15077 171657 -64403 -200527 -467501 -510456 -453509 -553078 -425151 -513418 -522874 -363012 -129071
15066 -129071 -143160 -99886 -79501 -69659 -127161 -150825 9412 39914 -82870 -269453 -413014
15055 -413014 -415673 -241930 63224 186662 314483 386403 238190 172050 80950 -52165
15045e2165p7096K17699o757j1255P2593M4178n1671L1572J52480k54235j41223
15034g5880n7868j08404m0197J26976O3153m5130j04270k46657K29229J20762
15024a38286M2740J6544J86221J61185j4375j91106j49252k2524J11653P5052
15014G7852P5171p8175Q4663j7370j72529J5021P9838R3860P2776j59721j15069
15003d3683n9536K05150o066j58011n5292r9394N2301O2173l8751j13643k0879
14992b75631R4055J69910o2906m6276Q7676k762K4590j39650j79122n4253O7702
14981c16667p7494P9678J65706J86423k24770j06317O1237j04912n0014J76691
14971b10439P5176K8278J06137O3378N6173j70738j45252l3524J37229J79288
$$ plain form
15045 -52165 -129261 88438 81681 70426 143019 187197 135526 167098 319578 65343 -75880
15034 -75880 -133748 -242152 -282349 -155373 -92220 -137350 -241620 -488277 -259048 -138286
15024 -138286 -95546 -79002 107219 268404 254029 62923 -86329 -108853 2800 77852
15014 77852 153023 74848 159511 142141 -30388 -15367 64471 158331 231107 71386 -43683
15003 -43683 -103219 101931 95865 -62146 -117438 -216832 -164531 -102358 -141109 -254752 -275631
14992 -275631 -181576 -11666 -74572 -120848 -33172 -35934 -11344 -150994 -330116 -384369 -316667
14981 -316667 -394161 -314483 -148777 37646 -187124 -293441 -232204 -337116 -387130 -210439
14971 -210439 -135263 -106985 -848 62530 118703 -52035 -197287 -230811 -93582 85706
14961H5706m6091o8248j22842q8042o9647K47595o7073q4353Q2628m485K66413
14950A31561J29559J0083J85217L1400j04161p5896K00458L8810j9418k69923
14940B57690Q1155p6082o7461R6993k30845k47884k10101P1173p1753J3113J17899
14929b66103M7892K42602Q7755q1892j69699O0379J00892J15934j9973o9801Q4628
14918A32614J43449k40472K4157m6345m7789l3500Q9071L528K47697K54376j63309
14907C63477j91372n1287n9778l435M6218J06728n0608J73816L2031q9870o8838
14896B07082n4024N8840o1653n3456L7525K20787o6530k50095k12373n735n0540
14885b30172J3607j4065R3858m2971J33417q4574k9006K4962P0600J20829M3857
$$ plain form
14961 85706 39615 -28633 -151475 -239517 -309164 -61569 -128642 -212995 -130367 -134852 131561
14950 131561 261120 271203 456420 487820 383659 307763 508221 547031 527613 257690
14940 257690 338845 262763 195302 292295 61450 -186434 -396535 -325362 -397115 -384002 -266103
14929 -266103 -218211 24391 112146 30254 -139445 -79066 21826 137760 117787 47986 132614
14918 132614 276063 35591 59748 13403 -34386 -67886 21185 24713 272410 526786 363477
14907 363477 172105 120818 61040 57605 103823 210551 159943 333759 365790 275920 207082
14896 207082 153058 211898 150245 96789 134314 355101 288571 38476 -173897 -179632 -230172
14885 -230172 -216565 -230630 -136772 -179743 -46326 -130900 -159906 -134944 -64344 56485 100342
14874A00342J29352r5144N8975r767Q4126k0296k70233k62850J00799M62861N7822
14863C35987j03324n2734q9195p7008j67126M0726L9787o87R897j74083O0363
14852a77397K61549m2026O7535l1732J61698j17638k27453j1703J1520Q105J5624
14841h1918p3843q8842J01257Q4093j76561R1262K03733j38190k7863M8915Q0971
14830B3014o0534n5636P0663L0131j25959j6812L57238K36641n3648l72767m0687
14819h356K16166J31556R8632q6472k96321K25735P9129p6008o415J73764N3424
14808E04834k65054m26309o8982N9976r5727j79475J5771K27991J66696J35366
14798G5087l0533J83832j49918l32117k20331P6117J43947K35533J15862M1159
$$ plain form
14874 100342 229694 134550 193525 183758 267884 247588 -22645 -285495 -184696 278165 335987
14863 335987 232663 179929 90734 13726 -153400 -112674 -72887 -73574 -63677 -237760 -177397
14852 -177397 84152 42126 109661 77929 239627 121989 -105464 -117167 -105647 -97542 -81918
14841 -81918 -155761 -244603 -143346 -59253 -235814 -144552 59181 -79009 -106872 -57957 23014
14830 23014 -37520 -93156 -22493 7638 -118321 -135133 222105 458746 405098 32331 -8356
14819 -8356 207810 339366 437998 351526 55205 280940 360069 284061 277646 451410 504834
14808 504834 239780 -186529 -255511 -195535 -291262 -470737 -454966 -226975 -60279 75087
14798 75087 44554 228386 78468 -253649 -473980 -397863 -253916 -18383 97479 138638
14788A38638m283j8403k77914j0780J55612m1471J70651K5682j31329P3568K59183
14777C39154L7183k40179j73749K7374K61094j6621j32638j51402p3550N3237
14767g0097m6956J22605L55775j35642k79412j15329j04234j77537M6094J83885
14757b20848l9036L7202K43509L1747Q7383L6294n3128Q7269L825n5620q6972
14746G1625Q6163N3528j68083k25987q9278m1600J0325p4182L6253P0686K06965
14735f3585K30078J52876O4679j79648k44468K3804J26803k44076j81702j00411
14725d15650N8491J65589n4378P1541K36994m760j58995O3437n9425n9836O2233
14714i4759j47277J23705J91049j46331q3056j18557Q3150L04092Q4407l03050
$$ plain form
14788 138638 134355 115952 -161962 -172742 -17130 -58601 112050 137732 6403 79971 339154
14777 339154 376337 136158 -37591 -10217 250877 234256 101618 -49784 -123334 -70097
14767 -70097 -117053 5552 361327 225685 -53727 -169056 -273290 -450827 -404733 -220848
14757 -220848 -259884 -222682 20827 52574 139957 176251 123123 210392 214217 158597 71625
14746 71625 157788 211316 43233 -182754 -272032 -313632 -303307 -377489 -341236 -270550 -63585
14735 -63585 166493 319369 384048 204400 -40068 -16264 110539 -133537 -315239 -415650
14725 -415650 -357159 -191570 -245948 -174407 62587 57827 -101168 -37731 -97156 -156992 -94759
14714 -94759 -242036 -118331 72718 -73613 -156669 -275226 -192076 112016 196423 -106627
14704a06627l22816j36075K44239L20097p9829j31655L16259j90457o2986Q863
14694a40987J72162R070j48045J20130K93813n7418l72047K88240J40761j20234
14684A85445r6194j28468K53998J38109o6009k06512l1944l22587m8381R2825
14674b29718j9913m6465R3409K09791M0638r3877o6828J35004j39089n6241j0716
14663a84005o0739K03208K22079Q1894j45653j72074L5162N0122P0624L18251
14653D18869n9539q1635k8374l0800J1484M609j8219m6345J4782k9581m9281k1784
14641H4186R6238k7989l0451r0866J20607l1606j7261j10524j15304N0463J82209
14630A09702Q393K8717K0488J54760J30005K261j77967j73271j29558K04134p7191
$$ plain form
14704 -106627 -429443 -565518 -321279 -1182 -81011 -212666 103593 -86864 -149850 -140987
14694 -140987 31175 40245 -107800 12330 306143 248725 -123322 164918 305679 185445
14684 185445 89251 -39217 214781 352890 286881 80369 48425 -274162 -322543 -229718
14674 -229718 -249631 -296096 -202687 7104 47742 -46135 -112963 22041 -117048 -173289 -184005
14663 -184005 -244744 -41536 180543 262437 116784 -55290 -20128 29994 100618 418869
14653 418869 359330 277695 249321 218521 230005 234614 216395 170050 184832 155251 105970 84186
14641 84186 180424 152435 121984 31118 151725 120119 102858 -7666 -122970 -72507 109702
14630 109702 118095 146812 167300 322060 452065 454326 276359 103088 -26470 177664 100473
14619A00473k64432K8197K9968J24518L772L9945J8698J70590L6360m6306O4715
14608C06498O0709n8189j02013N2154k34931Q7585j11923j24227l151j65362J0126
14597b82724L0662Q6637m1332o8191J39471R1071r71l6779K52708M3636N7120
14586B71308q375k7374j93205j8879O2654O2992J5892M9709o0356j1654O3670
14575B06382j86730l180J7067m0254j15210p7643k61501j98943K2485J54960Q8647
14564c93920N6335K68865K67423k5571k18337q6444j043K51987P5308k47208k75842
14553c28447q88L9376O8080J74303J58202L2015J4938R4704k13136r6607N2179
14542e281O5879J1156J6622N0197j02028K2935n8797L9174r0215q9685J49031
$$ plain form
14619 100473 -163959 -135762 -105794 18724 22496 62441 81139 251729 288089 241783 306498
14608 306498 367207 309018 207005 259159 24228 111813 -110 -124337 -127488 -292850 -282724
14597 -282724 -252062 -165425 -206757 -274948 -135477 -44406 -45377 -82156 170552 214188 271308
14586 271308 262933 235559 42354 23475 86129 149121 165013 214722 154366 142712 206382
14575 206382 19652 16472 33539 -6715 -121925 -199568 -461069 -660012 -637527 -482567 -393920
14564 -393920 -337585 -68720 198703 173132 -45205 -131649 -132692 119295 194603 -52605 -328447
14553 -328447 -329335 -289959 -221879 -47576 110626 142641 157579 252283 39147 -57460 -5281
14542 -5281 60598 71754 88376 138573 36545 59480 683 39857 -50358 -140043 8988
14531H988O7047m5468Q4312q6069j33167o1596J28689L74296O9253L6754j83751
14520B59288n1628r294M9084Q2150k11274k84868k8274M7075p3458p4597J89132
14509a06664p3939q384J91752j94490j72978K40135J13319j9850J6849J0239J67470
14498A63459j34319Q2986K7913Q6799n6928M8511J97420j81078j33929j97692
14488i6858j92031j26297N0964M7655J72130R0120k8870J0276j00600J15981j73761
14477b31291j03832R9025J69642j07503J75905o473Q6067Q5779k6890J40848k09550
14466G1727j00446p368j3894M4615K6459J59221J4385M7112J4100k67024j17181
14455a28294N1156M1984J61812n7530k4464r5949j83963q0058J44180J62124J40430
$$ plain form
14531 8988 76035 30567 114879 28810 -104357 -165953 -37264 337032 406285 443039 259288
14520 259288 207660 198366 247450 329600 118326 -166542 -194816 -147741 -221199 -295796 -106664
14509 -106664 -180603 -188987 2765 -191725 -364703 -124568 -11249 -31099 -14250 -4011 163459
14498 163459 29140 112126 140039 226838 169910 218421 415841 234763 100834 -96858
14488 -96858 -288889 -415186 -364222 -316567 -144437 -54317 -83187 -72911 -173511 -57530 -231291
14477 -231291 -335123 -236098 -66456 -173959 1946 -4527 81540 167319 140429 281277 71727
14466 71727 -28719 -36087 -49981 -5366 21093 180314 194699 241811 255911 -11113 -128294
14455 -128294 -77138 -35154 126658 69128 44664 -51285 -235248 -315306 -171126 -9002 131428
14444A31428P218k2629K10359J04477o5148j7268L5127o9514N836m2028J13534
14433C91392j28405j71972J32041J28912j33676j73024k5383k16170j84303O8778
14423c11810K63128K03066m52J05154j67311k3954q6621j88074j33476Q0105J1982
14412b48263k01651P9846K02443O2278j43245J25143J13293L2975j57623j16930
14402b51734K49802K32634P7485n2092k15602l10852j94981J92358L19169l9937
14392F250q4712K02803J70037r4773k47793r3437k40530J47213O8406J9422k4278
14381a71392J9573Q5945o2482J18686j01491j49639K17402K88577m4432l10148
14371a09401q6181j89955p7721r7629o4659j28807O7432J68387q5964j11048M50136
$$ plain form
14444 131428 138646 116017 326376 430853 365705 348437 383564 314050 319886 277858 391392
14433 391392 262987 91015 223056 351968 218292 45268 19885 -196285 -380588 -311810
14423 -311810 -48682 154384 153932 259086 91775 67821 -18800 -206874 -340350 -260245 -248263
14412 -248263 -449914 -370068 -167625 -105347 -248592 -123449 -10156 22819 -134804 -251734
14402 -251734 -1932 230702 308187 256095 40493 -270359 -465340 -272982 46187 6250
14392 6250 -78462 124341 294378 199605 -48188 -141625 -382155 -234942 -166536 -147114 -171392
14381 -171392 -151819 -65874 -128356 -9670 -111161 -260800 -43398 245179 200747 -109401
14371 -109401 -195582 -385537 -463258 -560887 -625546 -754353 -686921 -518534 -604498 -715546 -265410
14360b65410J52257J20717j30618l01348n4646J58093q6515J40530M5638k4425
14350b45727o1607Q5464J84170J99842n533k00211l4453r9173n7095M1800J07488
14339h5035J48072J25163J1300j72575L7961J17184j961J79960L6083l98699j95899
14328a98446j0961j83176n4386K65358K64911K69793m6277J7328j88311k08722
14318g2889j71461J14321R5593j6830J49381J71823k18788j98271j72000J41377
14308a77744j31806l1094M8976J36555K48133P4878o6462k06808J32227k3767
14298C088m2402l346J19937j52414P4790J0276J98278P385K30234n7730p8308
14287C09788j63155k16225L0279P5634J21722j83966k18144j38402O3643J65817
$$ plain form
14360 -265410 -113153 7564 -123054 -424402 -479048 -320955 -407470 -266940 -221302 -245727
14350 -245727 -307334 -221870 -37700 162142 156609 -43602 -78055 -177228 -234323 -192523 -85035
14339 -85035 63037 188200 199500 26925 64886 182070 180109 360069 396152 -2547 -198446
14328 -198446 -209407 -392583 -446969 -181611 83300 353093 306816 324144 135833 -72889
14318 -72889 -244350 -130029 -34436 -51266 98115 269938 51150 -147121 -319121 -177744
14308 -177744 -309550 -340644 -291668 -155113 93020 167898 101436 -105372 26855 3088
14298 3088 -39314 -42660 77277 -75137 -347 9929 208207 215592 445826 388096 309788
14287 309788 146633 -69592 -39313 36321 158043 -25923 -244067 -382469 -318826 -153009
14277a53009J07083K76569M5301m9058k92186N2694M1711J09387R027l4625P0365
14266A83259K67795j6130m09974k31809l1323j073M01229P9998N8735k53123L4128
14255H1712j38894J23139N6997j18140P9094j22941k28547m4462J02519J6981
14245a92542q4823Q6861M57880J60291j76747r4148k11139n044P4260j96910j05480
14234b87541l9204R0452n060l8704J60986K66234m3197j12962L6594j28603P442
14223i3563j2075O7720K6567j80361O9025J92241R9821r074j40841K7735j4801
14212C2394j9354r3693J39574Q3713L1124J39107p1269J39393j95612l6223j45362
14201C792j32068l8134k51434j8299K09706N1161j85812R6445J16915J42874n2509
$$ plain form
14277 -153009 -45926 230643 275944 226886 -65300 -12606 29105 138492 147519 112894 183259
14266 183259 451054 434924 24950 -206859 -238182 -239255 161974 241972 300707 47584 81712
14255 81712 -57182 65957 122954 4814 83908 -39033 -267580 -312042 -209523 -192542
14245 -192542 -277365 -190504 267376 427667 250920 156772 -54367 -59411 14849 -182061 -287541
14234 -287541 -326745 -236293 -241353 -280057 -119071 147163 103966 -8996 27598 -101005 -93563
14223 -93563 -105638 -37918 -11351 -191712 -122687 69554 169375 160301 19460 47195 32394
14212 32394 13040 -80653 58921 142634 173758 312865 241596 380989 185377 149154 3792
14201 3792 -128276 -166410 -417844 -436143 -226437 -175276 -361088 -264643 -147728 -4854 -57363
14190e7363j25118k2843j53666k25147m3756Q9510L14137K79042L8832m9394p5334
14179c1100p1631o5757l5288L7370j21896J06069J89999K06306N9828J09629Q5657
14168D69186j68325l93917K16453L1602j54476k99922j37444Q271J29990J05749
14158a92833j04842o4779n596j04924J16081l1559m1766J06652J69584n9547O0913
14147a52616p6121j49619l9675N0404J82375K40440k21847j12656K09920J50608
14137H1213J6777j38388J24652J10852k16860k69495J95706j3789n2355k19152
14127c80839J13942K36355J4476M7962O9751k53128k0730K35611P8288m0662j11704
14116a0678Q9060k03041L40387L44126j47494l72221j66350J56202J4634j36235
$$ plain form
14190 -57363 -182481 -205324 -358990 -584137 -627893 -538383 -224246 54796 93628 44234 -31100
14179 -31100 -102731 -168488 -203776 -166406 -288302 -182233 7766 214072 273900 383529 469186
14168 469186 300861 -93056 123397 154999 523 -299399 -436843 -428572 -298582 -192833
14158 -192833 -297675 -362454 -368050 -472974 -356893 -388452 -430218 -323566 -153982 -213529 -152616
14147 -152616 -228737 -378356 -418031 -367627 -185252 55188 -166659 -279315 -69395 81213
14137 81213 97990 -40398 84254 195106 -21754 -291249 -95543 -109332 -161687 -380839
14127 -380839 -266897 -30542 -16066 31896 101647 -151481 -172211 63400 141688 101026 -10678
14116 -10678 78382 -124659 215728 559854 412360 40139 -126211 29991 44625 -91610
14106i1610J55452j1367J373j08094k6592J79791j81117n8740j00061P4115J68322
14095A472J32686J14183N4245j21040P6077K1748o1530k22531n0280K09807K3952
14084A78789Q4721l5241k00113j04833L9823K37028p4856j53315r7909Q595J88224
14073G0913k08014O0313O0337N2123j15159q2611j331J64853J19204K7894P4871
14062B23393j90098J19767J85869j71308p36k239p8464j36230k28349J6538L5290
14051b26567Q0477J33861K06383l4586N6888J76799o3484k8568q2744k50938j99674
14040b32153p4810J8032Q1333j29185K7274J98814R2988k3378K125J16165J726
14029G8931p8199l7829J82718R0942k45781j25657K58248n4963j45252O5675j18432
$$ plain form
14106 -91610 63842 52475 53848 -54246 -80838 98953 -82164 -140904 -240965 -166850 1472
14095 1472 134158 248341 302586 181546 257623 279371 217841 -4690 -54970 154837 178789
14084 178789 263510 228269 28156 -76677 -36854 200174 125318 -27997 -125906 -117311 70913
14073 70913 -137101 -76788 -16451 35672 -79487 -162098 -163429 1424 120628 148522 223393
14062 223393 33295 153062 338931 167623 166887 164648 86184 -50046 -278395 -261857 -226567
14051 -226567 -146090 -12229 194154 159568 216456 393255 329771 301203 218459 -32479 -232153
14040 -232153 -306963 -288931 -207598 -336783 -309509 -110695 -17707 -41085 -38960 77205 78931
14029 78931 732 -37097 145621 236563 -9218 -134875 123373 68410 -76842 -11167 -129599
14018a29599K00058J49123K6455J19402j24299k60202l3509j0923M0877J37471
14008A14854m9868j1405M8731J9298j75516O0902l5645k47754J45547K77109L4809
13997A81062j80873J0486q122J38493J15238O4157L1715j61346j30203K00518
13987B61125P6747j55515R318L3790K0822p490j59186n6066k3713j05454O043
13976i9579J56961O0955K52396j71636l58883k59334K47417Q4174J82036L18064
13966D12571J16672j39581l77646k09007k81378k50516M95450L99614Q7221o0554
13956A92846m8358J8330o0908k52068J0454J23939J9937j62761l17983k36774
13946g13346k1461K27389L44446J48900P0460J71972k5470j22j47581m0349P0299
$$ plain form
14018 -129599 70459 219582 246037 365439 241140 -19062 -52571 -63494 -22617 114854
14008 114854 64986 53581 102312 121610 -53906 6996 -28649 -276403 -130856 146253 181062
13997 181062 189 10675 2553 141046 256284 320441 352156 190810 60607 261125
13987 261125 337872 182357 191675 225465 246287 238797 79611 23545 -168 -105622 -99579
13976 -99579 57382 118337 370733 199097 -159786 -419120 -171703 -87529 94507 412571
13966 412571 529243 389662 12016 -196991 -478369 -728885 -233435 166179 253400 192846
13956 192846 144488 162818 101910 -150158 -139704 -15765 4172 -158589 -476572 -713346
13946 -713346 -734807 -507418 -162972 -14072 56388 228360 202890 202768 55187 14838 85137
13935H5137J69132K6126j00123j10793k2327j43106r2103Q5308J97401j28974
13925c4322o639q6245J69129J48810j482L1469j54332p9959k01537n5785Q0653
13914a90240p4177N5247o0946Q7995K34879J9032l5552J20161j8325r9473l8427
13903A74o2091p369n4983j68744J55169P787K21871j78175k08519R2264N3678
13892a48938J58994M2598r0998j33588j92161l9847K52142O9403K4833R3493J04575
13881A40506o4179O2985J5802k8861j36006k8641J01870Q332p2429K02943p9366
13870A22956j47282k62696K28616j44239J55301K39532o1894j11792J25859j8651
13860A25710q1598j37520J45727j14414J11058J10353j9249j91958p301L2091
$$ plain form
13935 85137 254269 280395 180272 69479 47152 -95954 -188057 -102749 94652 -34322
13925 -34322 -40961 -127206 41923 190733 189251 220720 66388 -13571 -215108 -270893 -190240
13914 -190240 -264417 -209170 -270116 -182121 52758 71790 36238 156399 138074 38601 174
13903 174 -61917 -69286 -124269 -293013 -137844 -130057 91814 -86361 -294880 -202616 -148938
13892 -148938 10056 52654 -38344 -171932 -364093 -403940 -151798 -82395 -57562 35931 140506
13881 140506 76327 139312 155114 126253 -9753 -38394 63476 71808 -621 202322 122956
13870 122956 -24326 -287022 -58406 -202645 -47344 192188 130294 18502 144361 125710
13860 125710 44112 -93408 52319 -62095 48963 159316 140067 -51891 -59192 -27101
13850b7101L19799J02313j16091L2536m1631N3667Q3759Q6271j20883m7198O0195
13839C85636O6400k1373j21001p6699J88191J626k0461L7415j07829j92684n4491
13828H4730M2179J14322J54041p8511n3428k14738o9398l5196J10871J88784j5996
13817B27660l1161L859j01670O0435j28071o8910J37270o9637l6596M8770r4968
13806e3019L2926N7590J13769k13657r3456R6898j71024q1440K55635K44098K89084
13795D77404j46909k2156l0569j06127J32676m1886l61031r9536K52320K21633
13785B75819l36770k08682Q9405P2161K21985J09999j50941k640J09993k46183
13775f5854q7928N0712p1422K9900r9887j26663O620J68016R9859j14404L2893
$$ plain form
13850 -27101 292698 395011 278920 311456 269825 323492 407251 493522 372639 325441 385636
13839 385636 452036 430663 309662 232963 421154 422780 402319 439734 331905 139221 84730
13828 84730 126909 241231 395272 316761 263333 48595 -20803 -55999 54872 243656 227660
13817 227660 196499 200358 98688 159123 31052 -37858 99412 29775 -6821 41949 -53019
13806 -53019 -20093 37497 151266 -62391 -155847 -58949 -229973 -311413 -55778 188320 477404
13795 477404 330495 308339 277770 171643 304319 262433 -98598 -198134 54186 275819
13785 275819 -60951 -269633 -180228 -108067 113918 223917 72976 70336 180329 -65854
13775 -65854 -153782 -103070 -174492 -144592 -244479 -371142 -364522 -196506 -96647 -211051 -178158
13764a78158pj24504P1489J33094j15617J91954J34403j04455j620j44355j31609
13753b69385q6846J4398R5139J98081j81895j51982N3123R7346J46219k4314J33178
13742B3062n6434J09178n7035K45427J97579k1357l9562j47419l5251n4560k51980
13731h8352l2957q0170k33997L3560K76053N9159K4129N4181l0206K15940R8364
13720B95704j18158P7698Q5447j36779l2092o2518j58973j53683J73971J22557
13710I3174o8889N1595m185l01740J18085k3930j00801J50793N1633N2869O5334
13699H3938n3004n2023q0093j83810O7316J51967K28313q3591q425J1684m6530
13688C5742j79947R7199K36594O3788k91375j38782J81643Q1833N1442q7879j75116
$$ plain form
13764 -178158 -178165 -302669 -231180 -98086 -213703 -21749 112654 8199 6579 -137776 -269385
13753 -269385 -356231 -341833 -246694 -48613 -230508 -382490 -329367 -232021 -85802 -110116 23062
13742 23062 -33372 75806 18771 264198 461777 440420 400858 253439 218188 163628 -88352
13731 -88352 -121309 -201479 -435476 -401916 -125863 -66704 -42575 11606 -18600 197340 295704
13720 295704 177546 255244 340691 203912 171820 109302 -49671 -203354 -29383 93174
13710 93174 24285 75880 71695 -230045 -111960 -135890 -236691 -85898 -34265 18604 83938
13699 83938 30934 -21089 -101182 -284992 -217676 -65709 162604 79013 70588 82272 35742
13688 35742 -144205 -47006 189588 253376 -37999 -176781 4862 86695 138137 50258 -124858
13677a24858j83740O5929j2424n4359R6647O2611r631n0850p177K6379l8634L7575
13665a92532L4330m3700r4766k13118J66538q2021m5930O5522K26400K08805J6200
13654D5728M4483J29309j24679j27151k72011j97170L34036R4160p4378j93225
13644c40898p9340O8018J15050n4976J29967P3739m8012j95532J71653R2440J58435
13633I0544Q0674J29778l13096k21582K32869K42807j94723j20418p3626M6833
13623i9940j22483p9792l5648l3124K17441O9392j07520R6594j25589K2626J73222
13612b4821Q2495J57269k2116j62665j0730r6892J39976L84018J42960l55051
13602B34443k54539L1788M1013R8214K03114j85436l24181j84735j07151J74538
$$ plain form
13677 -124858 -308598 -242669 -255093 -309452 -212805 -150194 -159825 -210675 -217852 -191473 -230107 -192532
13665 -192532 -158202 -201902 -296668 -509786 -343248 -425269 -471199 -405677 -179277 29528 45728
13654 45728 90211 219520 94841 -32310 -304321 -501491 -167455 -73295 -147673 -340898
13644 -340898 -420238 -352220 -237170 -292146 -162179 -88440 -136452 -331984 -160331 -67891 90544
13633 90544 171218 300996 -12100 -233682 -813 241994 47271 -73147 -146773 -99940
13623 -99940 -222423 -302215 -337863 -370987 -153546 -84154 -191674 -95080 -220669 -198043 -24821
13612 -24821 57674 214943 192827 30162 19432 -77460 62516 446534 589494 234443
13602 234443 -20096 11692 52705 150919 354033 168597 -155584 -340319 -447470 -272932
13592b72932J92504R6754l5624R7434K47260L4276j41600k04774O246j08410K29732
13581A40866K63505m2685j65295r1145j07427q4371N2488K70515M3900j6585Q873
13570B72639j33279n3159m685O4688J8722k33565J01382K97079J56585M964j83401
13559C07970j74561j40962P5918K79723l37828m01220o0020J56095P6901J50887
13549f7097J0267J11422k05333k80525J79403J15657R1300J74245N8665o5761
13539A22243k36631j11865j751M4365K33610J33644O5592M4903j18822j91782
13529a6494k09425J23224M3275p6534k23567p56j25804O4394K23189M0003R8415
13518f0080m3130J02398M9747l8547j35109j7565p3177m0328J23346k44568k2510
$$ plain form
13592 -272932 -80428 16326 -19298 78136 325396 359672 218072 13298 19544 -88866 140866
13581 140866 404371 361686 196391 105246 -2181 -86552 -34064 236451 280351 263766 272639
13570 272639 139360 86201 81516 146204 164926 -68639 32743 329822 486407 491371 307970
13559 307970 133409 -7553 68365 348088 10260 -390960 -450980 -294885 -217984 -67097
13549 -67097 -56830 54592 -150741 -431266 -251863 -136206 -44906 129339 188004 122243
13539 122243 -114388 -226253 -228004 -183639 49971 183615 249207 294110 175288 -16494
13529 -16494 -225919 -102695 -59420 -135954 -359521 -360277 -486081 -421687 -198498 -158495 -60080
13518 -60080 -103210 -812 48935 10388 -124721 -142286 -215463 -255791 -132445 -377013 -399523
13507c99523J62482J19380O430P2156R0362j05890L0119N5078m8047j7919p4577
13496a09949o290j17668N6788J22151P5134J09228l44013l37913j85926J81048
13486e57410Q7080J61141J34419J56788J45815J2264j97222l33150J0501J96814
13476a82960J60063j24181q230L4429L7256k28847K2148o9191q8185J41156J1269
13465b95273J61605N5934j94079r8924J9568q1748J21975K01549J5088j79201
13455b73506L89859J02097j19690J30498J6582J7520r2890j16746k6454J60599
13445A87869j15803k00508n622l9892J35360J48754k04482j19282L90273J40524
13435C17191j7542j74710j72547K43195K18298k80841l20049K43983K57885p1243
$$ plain form
13507 -399523 -237041 -117661 -111231 -39075 51287 -54603 -24484 30594 -17453 -35372 -109949
13496 -109949 -116239 -233907 -177119 -54968 20166 129394 -214619 -552532 -738458 -557410
13486 -557410 -470330 -309189 -174770 -17982 127833 140097 -57125 -390275 -379774 -182960
13476 -182960 -22897 -147078 -155308 -120879 -83623 -312470 -290322 -359513 -447698 -306542 -295273
13465 -295273 -133668 -77734 -271813 -370737 -351169 -432917 -310942 -109393 -94305 -273506
13455 -273506 116353 218450 98760 229258 245840 263360 170470 53724 27270 187869
13445 187869 72066 -128442 -134064 -173956 -38596 110158 -94324 -213606 176667 317191
13435 317191 299649 124939 -47608 195587 413885 133044 -187005 56978 314863 243620
13425B43620M2544n233K53067q9105k70532k23804j92433p7908L09748J99338
13415A89302j05824J7789k70980J48631m9846o4583p1911J62064K07048P2760
13405B34450j37393J08351j7608J45522K07123k64366k41532j47164K4347P8291
13395i979J62272J3929J16257j36408k34494j32214m0508J11185R1242J7895K4923
13384a5900J96935L5956k00058K5495O2154l7310k22027J91166K791j57023R4298
13373b3523M1960O7502R5278l5964J10245k05383k0913J08438m7579k11818J2389
13362a09368P3449j28264M9478P5188M7924J78866j27722l4362K10476L8911M1115
13351C15691K6878k30888l62944k2390J05588j48797j91672K14806K76754L4541
$$ plain form
13425 243620 286164 280931 533998 444893 174361 -49443 -241876 -319784 -10036 189302
13415 189302 83478 101267 -169713 -21082 -70928 -135511 -207422 -45358 161690 234450
13405 234450 97057 205408 187800 333322 540445 276079 34547 -112617 -88270 -9979
13395 -9979 152293 166222 282479 146071 -88423 -220637 -261145 -149960 -58718 -40823 -15900
13384 -15900 181035 216991 16933 42428 104582 67272 -154755 36411 39202 -117821 -23523
13373 -23523 18437 85939 181217 145253 255498 50115 29202 137640 90061 -121757 -109368
13362 -109368 -35919 -164183 -114705 -39517 8407 187273 59551 25189 235665 274576 315691
13351 315691 342569 111681 -251263 -273653 -168065 -316862 -508534 -293728 -16974 17567
13341A7567l9552K8345K0253p2707J13936j16921k28569P6033J33649j39088k23617
13330d30671J93091R0291m9492K500O9887K43354J06228j38375N6401P1889k8769
13319A86334k6895P0621J12653l3486l8883j81651P542K9689O4393j01200q3664
13308E453j71511j6086Q4939J51235j04970J36159R5620J9781k89445l9968P361
13297a21432K15991O6915k59471j23190K68492J01263k995j27605O6373M4634
13287A28975j10502q4706J24208R627j33184k29891p7210K59914P246k25410K26533
13276a04400J20252O3732j23958r9568J71491K02064J7197k574n1892J65305n0033
13265C07616k09803p4604j19658K5281L1054J38385J7447q1021j08709L6751j23807
$$ plain form
13341 17567 -21985 6360 26613 -46094 67842 -49079 -277648 -201615 -67966 -207054 -430671
13330 -430671 -237580 -147289 -196781 -194281 -124394 118960 225188 86813 143214 215103 186334
13319 186334 159439 230060 342713 309227 270344 88693 96235 125924 190317 89117 5453
13308 5453 -166058 -182144 -97205 54030 -50940 85219 180839 200620 -88825 -128793 -121432
13297 -121432 94559 161474 -97997 -221187 47305 148568 145573 17968 84341 128975
13287 128975 18473 -66233 57975 67602 -65582 -295473 -372683 -112769 -105523 -330933 -104400
13276 -104400 15852 79584 -44374 -143942 27549 229613 246810 244236 192344 357649 307616
13265 307616 97813 23209 -96449 -71168 -40114 98271 115718 34697 -74012 -37261 -161068
13254a61068K8514J16770J6208J85059j0797l4630R3194n295K59189q2594j14527
13243B90023J04926r7740j09340M1761P5887L5759o9670M934j01919N1591K5281
13232B51493j35322k08550o4760J76209L58101J54207o2395k31220k6506k13583
13222b326R2772N7995j60248K48450J15755L2908o8234J4163J70625j85278k70930
13211D5652j6522L1505k511j26277n499J20980N65q3784J04413N8761l6910j18676
13199b8303j11078K0383R7019j179k4319m0251r2423J26312R2081Q8899J82510
13188C09651j1732O8886j98302j80834l12571P6913r8255O5346L69009L31595
13178D19706J24956l44057n6544Q7922K20974o9316j45361k59156k02196j3191
$$ plain form
13254 -161068 -132554 -15784 424 185483 174686 140056 233250 227955 487144 404550 290023
13243 290023 394949 297209 187869 229630 305517 341276 271606 276540 174621 226212 251493
13232 251493 116171 -92379 -157139 19070 377171 531378 468983 237763 211257 -2326
13222 -2326 90446 148441 -11807 236643 352398 385306 317072 331235 501860 316582 45652
13211 45652 29130 60635 58124 -68153 -73652 47328 47893 -35891 68522 127283 90373 -28303
13199 -28303 -139381 -118998 -21979 -23158 -47477 -87728 -180151 -53839 38242 127141 309651
13188 309651 297919 366805 168503 -12331 -324902 -247989 -346244 -280898 88111 419706
13178 419706 544662 200605 144061 231983 452957 383641 238280 -20876 -223072 -236263
13168b36263j9955k8028p5292o5412o8067O8678J09943J87970J0908J7619o4702
13157a62601n3964M2347q8798l18317l0212P9966J17305Q6671l9440J24365J16630
13146a26048N1998j2097J35813K00662j43281j23503L02258J11021k86137l74392
13136b63706p9956J22515r1094p2058k2662L32885K70131J06208r9159j34590
13126F8514P1765L42020j23463k37986K729L9645j57835J60491k9991M9398j03806
13115H1481j0891l048J5756J01003M6636j27315j83593j16086R3160J33589j64609
13104a33917J24791J0452n2124r9494Q2914j19267J22815L47284m5115n9663j36082
13093D2594o6381J49935o3614K1515J1034j29431j06726l3290K0456J78610J86312
$$ plain form
13168 -236263 -256218 -284246 -359538 -424950 -493017 -424339 -314396 -126426 -115518 -97899 -162601
13157 -162601 -216565 -174218 -263016 -581333 -611545 -531579 -414274 -327603 -367043 -242678 -126048
13146 -126048 -74050 -86147 49666 250328 107047 -16456 285802 396823 110686 -263706
13136 -263706 -343662 -221147 -312241 -384299 -406961 -74076 196055 302263 203104 68514
13126 68514 140279 482299 358836 120850 123579 163224 5389 165880 135889 185287 81481
13115 81481 70590 67542 83298 184301 230937 103622 -79971 -196057 -102897 30692 -133917
13104 -133917 -9126 1326 -50798 -150292 -67378 -186645 -63830 283454 238339 178676 42594
13093 42594 -23787 126148 62534 84049 95083 -34348 -141074 -174364 -153908 24702 211014
13082B11014R3867p5538J36228n395k00619J3044Q412J54845J49850J14371k15300
13071C84779K0744Q945k6267k9322m57782O3200J10506m551O5057P1913K7550
13060B34772R28j34014J34638R6432o3601l13989m3130P0897m3524j36157P9065
13049a17683J66852M5600J3395j1328J19012J38445l29851l67186K27214R6357
13039a9173N426L17636r6515n9925L4710J26401J92018P5912j59847k66733k63911
13028a14001O8378O2945r6754n4800M2496p2161O4008J28054j01590L2971P0201
13017B9747J3198J4413r6482r9958q8115k7526J42373J59579J11485J26397k89769
13006d658J440O2864j1057j45804q7097K09341L5871J14913J040N1129j65564
$$ plain form
13082 211014 304881 229343 365571 360176 159557 172601 181013 335858 485708 600079 384779
13071 384779 405523 414468 388201 358879 -98903 -35703 74803 70252 135309 207222 234772
13060 234772 235700 101686 236324 332756 269155 -44834 -87964 -17067 -60591 -196748 -117683
13049 -117683 49169 94769 108164 96836 215848 354293 24442 -342744 -115530 -19173
13039 -19173 -13747 303889 207374 147449 182159 308560 500578 576490 416643 149910 -114001
13028 -114001 -45623 17322 -79432 -134232 -91736 -163897 -99889 28165 -73425 -40454 29747
13017 29747 42945 57358 -39124 -139082 -227197 -254723 -112350 47229 158714 285111 -4658
13006 -4658 -3218 59646 48589 -97215 -184312 25029 60900 175813 176853 227982 62418
12995F2418j77291K14130N2871j02207O8024k61913j81379K16665J52919j87031
12985a42794l2154K9769o7840J1319m1016O3162K23659J10704O4529J01435J72015
12974D92788k78455J7087M5022j5819j18524m5288k9629J68553j08133k51513
12964a23911q7840j99302K86646J21453L4405J42002J3095J75382j44274j5977
12954B01679Q400j09459j57059J1185j02453L815L043J73067n9362N7406q3416
12943e3154J59328O8543l5913M1766P9612l6675L5703J08190j11117p724j4385
12932B34174m65667K24425J69553o7038j49909q4171j42886R8311K44058K19894
12922B80744N3931j98931j56472O3955j95682Q4401n4857j74829K5501j0681l5307
$$ plain form
12995 62418 -114873 99257 152128 49921 117945 -143968 -325347 -108682 44237 -142794
12985 -142794 -174948 -145179 -213019 -201700 -242716 -179554 44105 154809 219338 320773 492788
12974 492788 214333 231420 276442 260623 142099 96811 67182 235735 127602 -123911
12964 -123911 -211751 -411053 -124407 -2954 31451 173453 186548 361930 217656 201679
12954 201679 210079 100620 -56439 -45254 -147707 -143892 -140849 32218 -27144 30262 -53154
12943 -53154 106174 174717 138804 180570 260182 223507 259210 367400 256283 248559 234174
12932 234174 -231493 -7068 162485 95447 -54462 -138633 -281519 -183208 60850 280744
12922 280744 334675 135744 -20728 43227 -152455 -68054 -122911 -297740 -272239 -282920 -318227
12911c18227J8800l8113O0457L5408J5797k25945L3345K59J75153J16421J73864
12900D7219J4196l03832p6193R0057Q7821P9238R3795J50312j51984R9217N5600
12889A85446K98225k91668k25976N6424J52105J16180j08875L1625n1965P6142
12879B37663J96446n8322k34105J15908N6688j2717j33289l3484o3143Q6327J67764
12868C25736j42639j59056j81404q8697K08160j59900k1014J21770K8810J25785
12858E7551P3638p2055j52515p2007j03969K58105J52901j06537k41458j44422
12848c50768o76J76489J37506j80983J03265J69062o6544L4742P0610K14873n4382
12837B53194k28722o0495O0489J8263J17147Q4625j18554J4039J31684J4275j96207
$$ plain form
12911 -318227 -299427 -337540 -277083 -241675 -225878 -451823 -418478 -418219 -243066 -126645 47219
12900 47219 61415 -242417 -318610 -228553 -140732 -61494 32301 182613 30629 129846 185446
12889 185446 483671 192003 -33973 22451 174556 290736 181861 213486 161521 237663
12879 237663 434109 375787 141682 257590 314278 301561 168272 134788 71645 157972 325736
12868 325736 183097 24041 -157363 -246060 -37900 -197800 -218814 -97044 -68234 57551
12858 57551 131189 59134 -93381 -165388 -269357 -11252 141649 35112 -206346 -350768
12848 -350768 -351444 -174955 -37449 -218432 -115167 53895 -12649 22093 92703 307576 253194
12837 253194 24472 -36023 24466 42729 159876 244501 125947 139986 271670 285945 89738
12826H9738j30062k35373j11403N8236L70843J87320J2308j9003r002o1951l67041
12815b15390r8349J91011J66842p9328j59208r8287k2957Q8648K18545J40820
12805A32347K40744k20983Q0115J63459j85733j68546k14891j21686J03846j03143
12795b94471O2156K12723n7959K3039j5272K70127N0182o8078M2044k94481j49301
12784b19291J67066N7638j55139o7629m1581K36994J42978j78326k45166J85543
12774a16913J90802R7619Q7406k1836o6717K2127j50736j81104m3981p130O5935
12763a24528l214p7483R4755K13482p9444k1838M4539p8740j88096k4827J2054
12752b33340K48513L27467j8023L977M4633k04418m07498r4554K63096j6287L1020
$$ plain form
12826 89738 -40324 -275697 -387100 -328864 41979 229299 241607 222604 213602 151651 -215390
12815 -215390 -313739 -122728 44114 -35214 -194422 -292709 -315666 -227018 -8473 132347
12805 132347 373091 152108 232223 395682 209949 41403 -173488 -295174 -191328 -294471
12795 -294471 -232315 -19592 -77551 -54512 -69784 200343 250525 182447 224491 -69990 -219291
12784 -219291 -52225 5413 -149726 -217355 -258936 -21942 121036 -57290 -302456 -116913
12774 -116913 73889 171508 258914 237078 170361 192488 41752 -139352 -183333 -190463 -124528
12763 -124528 -127742 -205225 -110470 103012 23568 1730 46269 -32471 -220567 -245394 -233340
12752 -233340 15173 342640 324617 328594 373227 168809 -238689 -333243 -70147 -86434 -55414
12741e5414J13468j90522k0874J0838L4083j25992j01259K07189L53593L48825
12731E73935R4054k22114l85781k24132m3997k46524J44136M64901j61625k94750
12721c01897j24863J28039J34124q2937q2069p1634J39489K04830M364J2678J83037
12710A43161n3381o1525p3179J00838L7034L4431J7292J26636K22998k97873k75726
12699g9294q8148J4516J1417O2246J24745J93187J17622l33515K6365J54459n6332
12688A47268k11823J67970j52888k54392n7387j7385J01150o9475k45524K75847
12678c16639K15107O4590J19422J1505K2383r6994m9107M6765k8882K55393j66656
12667G6887p6909j26520O7966J38205J89479R7849j01391j06981k45026k24982
$$ plain form
12741 -55414 58054 -132468 -153342 -142504 -108421 -234413 -335672 -128483 225110 573935
12731 573935 667989 445875 60094 -164038 -208035 -454559 -310423 154478 -7147 -301897
12721 -301897 -426760 -298721 -164597 -247534 -329603 -401237 -261748 -56918 -52554 -39876 143161
12710 143161 89780 28255 -44924 55914 92948 127379 144671 271307 494305 196432 -79294
12699 -79294 -167442 -152926 -141509 -79263 45482 238669 356291 22776 49141 203600 147268
12688 147268 -64555 103415 -49473 -303865 -361252 -378637 -277487 -346962 -592486 -316639
12678 -316639 -101532 -36942 82480 93985 116368 19374 -29733 17032 -11850 243543 76887
12667 76887 -22 -126542 -58576 79629 269108 366957 265566 158585 -86441 -311423
12657c11423L6813K95786J63822j10675J95688K44992o2007l63590p8490J14422
12647A25338K12207J750j6605l6496L1960m6572j51569k62301o9686Q4227N0795
12636g6952j75871J3001K2899R5750L56261n6608q3364R2231o7613j30967r3949
12625a05182J33987J17380P4080M3092l01889j59668M6832L78746J42744j30441
$$ plain form
12657 -311423 -274610 21176 184998 74323 270011 515003 452996 89406 10916 125338
12647 125338 337545 339295 322690 286194 318154 271582 120013 -142288 -211974 -127747 -76952
12636 -76952 -252823 -239822 -216923 -121173 235088 178480 95116 187347 119734 -11233 -105182
12625 -105182 28805 146185 220265 263357 -38532 -198200 -151368 227378 370122 239681
$$ [...]
##END NTUPLES=NMR SPECTRUM
##END=
