##TITLE=Analysis number 318700
Compound Code gk 00015
Project Code adrs
Chemist Name fudan
##JCAMPDX= 6.0         $$ Bruker NMR JCAMP-DX V2.0
##DATA TYPE= NMR SPECTRUM
##DATA CLASS= NTUPLES
##ORIGIN= Bruker BioSpin GmbH
##OWNER= nmr
$$ XWIN-NMR		Version 3.5
$$ Mon Apr 10 15:33:57 2006 GMT Daylight Time (UT+1h)  MAYBRIDGE\nmr@NMR_250MHZ
##.OBSERVE FREQUENCY= 250.131544655141
##.OBSERVE NUCLEUS= ^1H
##.ACQUISITION MODE= SIMULTANEOUS (DQD)
##.ACQUISITION SCHEME= undefined
##.AVERAGES= 16
##.DIGITISER RES= 18
##SPECTROMETER/DATA SYSTEM= dpx250
##.PULSE SEQUENCE= zg30
##.SOLVENT NAME= DMSO
##.SHIFT REFERENCE= (INTERNAL, DMSO, 0, 16.522)
##AUDIT TRAIL= $$ (NUMBER, WHEN, WHO, WHERE, WHAT)
$$ ##TITLE= Audit trail, XWIN-NMR		Version 3.5
$$ ##JCAMPDX= 5.01
$$ ##ORIGIN= Bruker BioSpin GmbH
$$ ##OWNER= nmr
$$ C:\u/data/dgb/nmr/ADRS/2450/pdata/1/auditp.txt
$$ ##AUDIT TRAIL=  $$ (NUMBER, WHEN, WHO, WHERE, WHAT)
(   1,<2006-04-10 15:33:36.48 +100>,<MAYBRIDGE\nmr>,<NMR_250MHZ>,
      <created by zg, POWCHK disabled, PULCHK disabled
       configuration hash MD5:
       84 BC 41 DB A1 6E 1D 46 DA 25 12 A5 C1 ED C5 3A
       data hash MD5: 64K
       C3 9F 8E 77 BE 50 B5 9F B8 A7 DF E4 EB 9B EF 69>)
(   2,<2006-04-10 15:33:48.86 +100>,<MAYBRIDGE\nmr>,<NMR_250MHZ>,
      <Start of raw data processing
       ef LB = 0.3 FT_mod = 6 PKNL = 1 SI = 32K 
       data hash MD5: 32K
       5C F8 48 11 BA 98 3F 6D 87 7D 9D 89 DA 8D 12 BC>)
(   3,<2006-04-10 15:33:50.47 +100>,<MAYBRIDGE\nmr>,<NMR_250MHZ>,
      <apk 
       data hash MD5: 32K
       BE CA 50 35 BE 1A A4 FE 05 25 A4 EF 85 38 72 26>)
(   4,<2006-04-10 15:33:51.28 +100>,<MAYBRIDGE\nmr>,<NMR_250MHZ>,
      <abs ABSG = 5 
       data hash MD5: 32K
       F2 AA 4A 44 A2 C5 55 CA AA 82 E4 DC E9 60 A0 96>)
$$ ##END=
$$ 
$$ hash MD5
$$ 00 07 7E 03 CB A6 90 D8 5E CE 96 18 E4 29 F4 E8
##$RELAX= 
##$RELAX= 
##$RELAX= 
##$RELAX= 
##$RELAX= 
##$RELAX= 
##$RELAX= 
$$ Bruker specific parameters
$$ --------------------------
##$DU= <C:\u>
##$EXPNO= 2450
##$NAME= <ADRS>
##$PROCNO= 1
##$TYPE= <nmr>
##$USER= <dgb>
##$AMP= (0..31)
100 100 100 100 100 100 100 100 100 100 100 100 100 100 100 100 100 100 
100 100 100 100 100 100 100 100 100 100 100 100 100 100 
##$AQSEQ= 0
##$AQ_mod= 3
##$AUNM= <au_zg>
##$AUTOPOS= <57 >
##$BF1= 250.13
##$BF2= 250.13
##$BF3= 250.13
##$BF4= 250.13
##$BF5= 500.13
##$BF6= 500.13
##$BF7= 500.13
##$BF8= 500.13
##$BYTORDA= 1
##$CFDGTYP= 0
##$CFRGTYP= 5
##$CHEMSTR= <none>
##$CNST= (0..31)
1 1 145 1 1 1 1 1 1 1 1 1 1 1 1 1 1 1 1 1 1 1 1 1 1 1 1 1 1 1 1 1 
##$CPDPRG= <>
##$CPDPRG1= <>
##$CPDPRG2= <>
##$CPDPRG3= <>
##$CPDPRG4= <mlev>
##$CPDPRG5= <mlev>
##$CPDPRG6= <mlev>
##$CPDPRG7= <mlev>
##$CPDPRG8= <mlev>
##$CPDPRGB= <>
##$CPDPRGT= <>
##$D= (0..31)
0 1 0 0 0 0 0 0 0 0.06 0 0 0 0 0 0 0.0002 0 0 0 0 0 0 0 0 0 0 0 0 0 0 
0 
##$DATE= 1144679615
##$DBL= (0..7)
120 120 120 120 120 120 120 120 
##$DBP= (0..7)
150 150 150 150 150 150 150 150 
##$DBP07= 0
##$DBPNAM0= <>
##$DBPNAM1= <>
##$DBPNAM2= <>
##$DBPNAM3= <>
$$ [...]
##$SUBNAM7= <"">
##$SUBNAM8= <"">
##$SUBNAM9= <"">
##$SW= 20.6930455092707
##$SWIBOX= (0..15)
0 0 3 0 0 0 0 0 0 0 0 0 0 0 0 0 
##$SW_h= 5175.983436853
##$TD= 65536
##$TD0= 1
##$TE= 295.16
##$TE2= 300
##$TE3= 300
##$TEG= 300
##$TL= (0..7)
0 120 120 120 120 120 120 120 
##$TP= (0..7)
150 150 150 150 150 150 150 150 
##$TP07= 0
##$TPNAME0= <>
##$TPNAME1= <>
##$TPNAME2= <>
##$TPNAME3= <>
##$TPNAME4= <>
##$TPNAME5= <>
##$TPNAME6= <>
##$TPNAME7= <>
##$TPOAL= (0..7)
0.5 0.5 0.5 0.5 0.5 0.5 0.5 0.5 
##$TPOFFS= (0..7)
0 0 0 0 0 0 0 0 
##$TUNHIN= 0
##$TUNHOUT= 0
##$TUNXOUT= 0
##$USERA1= <user>
##$USERA2= <user>
##$USERA3= <user>
##$USERA4= <user>
##$USERA5= <user>
##$V9= 5
##$VALIST= <valist>
##$VCLIST= <CCCCCCCCCCCCCCC>
##$VD= 0
##$VDLIST= <DDDDDDDDDDDDDDD>
##$VPLIST= <PPPPPPPPPPPPPPP>
##$VTLIST= <TTTTTTTTTTTTTTT>
##$WBST= 1024
##$WBSW= 4
##$XGAIN= (0..3)
0 0 0 0 
##$XL= 0
##$YL= 0
##$YMAX_a= 274265
##$YMIN_a= -355814
##$ZGOPTNS= <>
##$ZL1= 120
##$ZL2= 120
##$ZL3= 120
##$ZL4= 120
##$ABSF1= 16.522
##$ABSF2= -4.171173
##$ABSG= 5
##$ABSL= 3
##$ALPHA= 0
##$AQORDER= 0
##$ASSFAC= 0
##$ASSFACI= 0
##$ASSFACX= 0
##$ASSWID= 0
##$AUNMP= <proc_1d>
##$AZFE= 0.1
##$AZFW= 0.1
##$BCFW= 0
##$BC_mod= 0
##$BYTORDP= 0
##$COROFFS= 0
##$CY= 12.5
##$DATMOD= 1
##$DC= 0
##$DFILT= <>
##$DTYPP= 0
##$F1P= 14.0000005364418
##$F2P= -0.99999901652339
##$FCOR= 0.5
##$FTSIZE= 32768
##$FT_mod= 6
##$GAMMA= 0
##$GB= 0
##$INTBC= 1
##$INTSCL= 1
##$ISEN= 128
##$LB= 0.3
##$LEV0= 0
##$LPBIN= 0
##$MAXI= 10000
##$MC2= 0
##$MEAN= 0
##$ME_mod= 0
##$MI= 0
##$NCOEF= 0
##$NC_proc= -3
##$NLEV= 6
##$NOISF1= 0
##$NOISF2= 0
##$NSP= 0
##$NTH_PI= 0
##$NZP= 0
##$OFFSET= 16.522
##$PC= 1
##$PHC0= 165.8136
##$PHC1= 5.814608
##$PH_mod= 1
##$PKNL= yes
##$PPARMOD= 0
##$PSCAL= 4
##$PSIGN= 0
##$REVERSE= no
##$SF= 250.13
##$SI= 32768
##$SIGF1= 0
##$SIGF2= 0
##$SINO= 400
##$SIOLD= 32768
##$SREGLST= <1H.DMSO>
##$SSB= 0
##$STSI= 32768
##$STSR= 0
##$SW_p= 5175.98343685301
##$SYMM= 0
##$S_DEV= 0
##$TDeff= 65536
##$TDoff= 0
##$TI= <Analysis number 999999
Compound Code 99
Book Reference 9
Project Code 9>
##$TILT= no
##$TM1= 0
##$TM2= 0
##$TOPLEV= 0
##$USERP1= <user>
##$USERP2= <user>
##$USERP3= <user>
##$USERP4= <user>
##$USERP5= <user>
##$WDW= 1
##$XDIM= 32768
##$YMAX_p= 302683826
##$YMIN_p= -219962
$$ End of Bruker specific parameters
$$ ---------------------------------
##NTUPLES= NMR SPECTRUM
##VAR_NAME=  FREQUENCY,     SPECTRUM/REAL,   SPECTRUM/IMAG
##SYMBOL=    X,             R,               I
##VAR_TYPE=  INDEPENDENT,   DEPENDENT,       DEPENDENT
##VAR_FORM=  AFFN,          ASDF,            ASDF
##VAR_DIM=   32768,         32768,           32768
##UNITS=     HZ,            ARBITRARY UNITS, ARBITRARY UNITS
##FACTOR=    0.157963299565203, 1,           1
##FIRST=     4132.6476996994, 0,             0
##LAST=      -1043.33573715361, 0,           0
##MIN=       -1043.33573715361, -219962,     0
##MAX=       4132.6476996994, 302683826,     0
$$ Real data points
##PAGE= N=1
##DATA TABLE= (X++(R..R)), XYDATA
$$ [...]
$$ plain form
15723 -1253 24334 945 -19698 -26388 -7610 30683 3111 -17102 -29776 -15320 -36867 -8904
15711 -8904 -16629 14 1244 -73632 -53387 49601 87307 33920 16819 27977 -2602 -48978
15699 -48978 -48397 -10676 2299 -36043 -23084 -20396 -371 -21211 18076 88575 69120 24143
15687 24143 3307 -2928 11693 12590 -23906 -43522 -49019 -48940 -37532 -35906 -29492 -31487 -41364 -51120
15673 -51120 -50170 -111954 -51663 -6364 -59364 -76949 -21750 -6153 -51453 -67371 -62797 -56986
15661 -56986 -1635 -3846 -3058 -9203 -1033 -19695 -46774 5077 60748 44578 19442 58006 93597
15648 93597 35678 -54283 -19814 44891 99817 97305 75001 43729 86675 100809 32420 -38409
15636 -38409 -35932 -32985 -4860 -40115 -95731 -94204 -98087 -54518 16721 70274 -4716 -58503
$$ packed form
15723a253K5587k3389k0643o690J8778L8293k7572k0213j2674J4456k1547K7963
15711h904p725J6643J230p4876K0245J02988L7706n3387j7101J1158l0579m6376
15699d8978N81L7721J2975l8342J2959K688K0025k0840L9287P0499j9455m4977
15687B4143k0836o235J4621Q97l6496j9616n497P9J1408J626O414j995r877r756
15673e1120R50o1784O0291M5299n3000j7585N5199J5597m5300j5918M574N811
15661e6986N5351k211P88o145Q170j8662k7079N1851N5671j6170k5136L8564L5591
15648I3597n7919q9961L4469O4705N4926k512k2304l1272M2946J4134o8389p0829
15636c8409K477K947K8125l5255n5616J527l883M3569P1239N3553p4990n3787
$$ plain form
15624 -58503 -105513 -69880 -24016 31661 59485 40901 29629 41192 15264 -26167 25355 60413
15612 60413 17648 -15941 -51211 -54325 -3182 21394 12442 -7342 -16664 22585 51258 58567
15600 58567 35347 49490 31248 -80051 -116557 -80331 -32439 -26729 -40021 -20203 15334 -6782
15588 -6782 -55892 -51043 -18549 -32455 6754 26009 -38294 -54107 12670 51291 19022 -66687
15576 -66687 -54489 -1866 31766 35260 53859 51266 26189 23266 67870 108483 96267 34265
15564 34265 33384 9144 -12076 24609 25166 -21483 -8747 18124 -100 1708 -29456 -95739 -96836
15551 -96836 -84476 -123476 -138636 -139375 -96711 -77329 -69484 -557 139754 119475 20120 -67691
15539 -67691 -36108 45026 74551 63093 -44484 -70897 -21113 -9228 6447 61942 51677
$$ packed form
15624e8503m7010L5633M5864N5677K7824j8584j1272J1563k5928m1431N1522L5058
15612F0413m2765l3589l5270l114N1143K4576q952j9784r322L9249K8673P309
15600E8567k3220J4143j8242j11299l6506L6226M7892N710j3292J9818L5537k2116
15588f782m9110M849L2494j3906L9209J9255o4303j5813O6777L8621l2269q5709
15576f6687J2198N2623L3632L494J8599k593k5077k923M4604M0613j2216o2002
15564C4265q81k4240k1220L6685N57m6649J2736K6871j8224J808l1164o6283j097
15551i6836J2360l9000j5160p39M2664J9382P845O8927J40311k0279r9355q7811
15539f7691L1583Q1134K9525j1458j07577k6413M9784J1885J5675N5495j0265
$$ plain form
15528 51677 23447 63994 113087 121428 37793 -64459 -47807 -9814 -28049 35948 37544 -13235
15516 -13235 49298 88485 87218 10726 77496 99826 37611 45835 95086 123951 62363 32793
15504 32793 54913 25940 13176 -17713 -51549 -49971 -72034 -57913 -15723 11153 -55433 -52536
15492 -52536 -81781 -56589 -53758 -32907 -43912 -53867 -45455 -59717 -27057 5018 -37177 -80951
15480 -80951 -104958 -37822 -32810 7182 49776 -20144 -55577 11887 24299 55058 99982 101365
15468 101365 27317 37057 17481 -762 3621 57514 32289 -1685 7767 -246 -16674 -61381
15456 -61381 -65003 -69324 -23804 3374 -51498 -65785 -1855 72787 122521 74640 9544 -48660
15444 -48660 -39556 -43103 -12305 -24722 -23055 509 12303 -44409 -69668 27401 25608 -8432
$$ packed form
15528E1677k8230M0547M9093Q341q3635j02252J6652L7993j8235O3997J596n0779
15516a3235O2533L9187j267p6492O6770K2330o2215Q224M9251K8865o1588k9570
15504C2793K2120k8973j2764l0889l3836J578k2063J4121M2190K6876o6586K897
15492e2536k9245K5192K831K0851j1005r955Q412j4262L2660L2075m2195m3774
15480h0951k4007O7136N012L9992M2594o9920l5433O7464J2412L0759M4924J383
15468A01365p4048R740j9576j8243M383N3893k5225l3974R452q013j6428m4707
15456f1381l622m321M5520K7178n4872j4287O3930P4642M9734m7881o5096n8204
15444d8660R104l547L0798j2417J667K3564J1794n6712k5259R7069j793l4040
$$ plain form
15432 -8432 -54863 -60506 -36267 17330 -10324 -81539 -31205 -27536 -12137 40655 -4277 -26545
15420 -26545 -17618 16231 35360 47596 66600 53498 74169 42386 -79478 -103582 -40377 10766
15408 10766 -21133 -23063 -4041 -48858 -44570 -38217 -70706 -141544 -96298 -42613 23443 26873
15396 26873 9080 7120 12881 43540 21535 9887 43683 4945 5614 -5972 -30633 -31607 8736
15383 8736 21847 24759 38816 42566 21637 -14124 -30800 -42841 -28300 -33738 -8793 -19897
15371 -19897 -34246 -78125 -112759 -64462 -52766 -26140 -42159 -55324 -2276 23950 15309 25928
15359 25928 35288 18348 -3971 21516 42264 29509 62672 88863 101568 62647 1845 26846
15347 26846 -45653 -95358 -58220 22524 52515 41975 23445 -38093 -14268 6025 -5971 -21618
$$ packed form
15432h432m6431n643K4239N3597k7654p1215N0334L669J5399N2792m4932k2268
15420b6545Q927L3849J9129J2236J9004j3102K0671l1783j21864k4104O3205N1143
15408A0766l1899j930J9022m4817M288O353l2489p0838M5246N3685O6056L430
15396B6873j7793j960N761L0659k2005j1648L3796l8738O69j1586k4661r74M0343
15383H736J3111K912J4057L750k0929l5761j6676j2041J4541n438K4945j1104
15371a9897j4349m3879l4634M8297J1696K6626j6019j3165N3048K6226q641J0619
15359B5928R360j6940k2319K5487K0748j2755L3163K6191J2705l8921o0802K5001
15347B6846p2499m9705L7138Q0744K9991j0540j8530o1538K3825K0293j1996j5647
$$ plain form
15335 -21618 -16964 -53978 -68502 -63213 -80222 -107189 -111716 -91500 -103731 -106260 -109526 -69909 -96684
15322 -96684 -90657 -80263 -51501 -64477 -866 11191 -80470 -77421 -23613 -37043 -48046 -70924
15310 -70924 -61618 -64194 -56432 -80088 -83977 -57986 -24142 -5587 6479 -20825 -18166 35234 67342
15297 67342 69032 61196 16832 34102 6398 -30493 -21877 38187 77180 102521 95464 52831
15285 52831 -19105 -26139 -55502 -53822 -29922 -20015 -84884 -71159 -7658 25368 9026 57694
15273 57694 91142 67776 36359 70590 44167 45398 11241 39929 30254 48487 47759 50819 9708
15260 9708 -29271 -51697 -47051 23934 28431 -16038 -35700 -31231 16964 34142 41165 32950 6166
15247 6166 2572 28223 57756 24318 -20730 -25521 -31439 -38332 -28088 29534 12479 29060 24669
$$ packed form
15335b1618M654l7014j4524N289j7009k6967m527K0216j2231k529l266L9617k6775
15322i6684O027J0394K8762j2976O3611J2057r1661L049N3808j3430j1003k2878
15310g0924R306k576P762k3656l889K5991L3844J8555J2066k7304K659N3400L2108
15297F7342J690p836m4364J7270k7704l6891Q616O0064L8993K5341p057m2633
15285E2831p1936p034k9363J680K3900R907o4869J3725O3501L3026j6342M8668
15273E7694L3448k3366l1417L4231k6423J231l4157K8688r675J8233p28L060m1111
15260I708l8979k2426M646P0985M497m4469j9662M469M8195J7178P023q215k6784
15247F166l594K5651K9533l3438m5048m791n918o893J0244N7622j7055J6581m391
$$ plain form
15234 24669 -16739 -7272 -6973 39157 28425 46585 58227 -13164 -34544 -33294 -58210 -68243
15222 -68243 -54830 -50881 6187 39559 -34622 -120438 -89748 -90561 -21002 -51096 -62200 -33119
15210 -33119 12077 43018 60685 14635 50618 114900 56639 -25764 -70026 -60561 -99348 -91415
15198 -91415 -58221 -11718 10543 29047 97087 110018 65308 4732 -42579 -107827 -145022 -112476
15186 -112476 -89825 -30932 34631 2339 -35819 -9447 10467 78598 128106 129866 79347 -18965
15174 -18965 -53135 -25084 3350 -29442 16066 76974 96447 68131 -3651 -36816 -33907 -40637
15162 -40637 -77366 -105413 -76252 2756 -12934 -55917 -5145 -18778 -71037 -57945 3384 20550
15150 20550 -5440 2285 12360 11130 -31833 -33285 1656 5310 -1811 -25270 -23580 -10146 9406
$$ packed form
15234B4669m1408R467K99M6130j0732J8160J1642p1391k1380J250k4916j0033
15222f8243J3413L949N7068L3372p4181q5816L0690q13O9559l0094j1104K9081
15210c3119M5196L0941J7667m6050L5983O4282n8261q2403m4262R465l8787P933
15198i1415L3194M6503K2261J8504O8040J2931m4710o0576m7311o5248l7195L2546
15186a12476K2651N8893O5563l2292l8158K6372J9914O8131M9508J760n0519r8312
15174a8965l4170K8051K8434l2792M5508O0908J9473k8316p1782l3165K909o730
15162d0637l6729k8047K9161P9008j5690m2983N0772j3633n2259J3092O1329J7166
15150B0550k5990P725J0075j230m2963j452L4941L654p121k3459J690J3434J9552
$$ plain form
15137 9406 29567 60164 34906 -15785 -12994 -2710 -17914 -74715 -49237 32549 88356 55169
15125 55169 -20037 7730 5493 1562 42227 -2545 28805 -10436 -81288 -132799 -126917 -162467
15113 -162467 -139096 -90478 -83337 -44659 13382 19724 -4607 7809 4108 17814 54286 -15440
15101 -15440 -75921 -5687 -5042 3654 43043 4617 -40375 -102532 -36963 -9687 -12466 -27868
15089 -27868 -69058 -57827 -72642 -21393 30040 10551 -46598 -50126 -4476 48546 25952 -26372
15077 -26372 -8896 25017 7838 17258 -6308 33030 -10726 -51238 3040 5777 -25387 -17971
15065 -17971 -51180 8979 46255 76778 58396 40769 -6665 -33979 -44368 40623 99922 68104
15053 68104 27503 2156 10966 11216 -22116 -28061 -22315 -15762 9157 77047 69773 23568 15794
$$ packed form
15137I406K0161L0597k5258n0691K791J0284j5204n6801K5478Q1786N5807l3187
15125E5169p5206K7767k237l931M0665m4772L1350l9241p0852n1511N882l5550
15113a62467K3371M8618P141L8678N8041O342k4331J2416l701J3706L6472o9726
15101a5440o0481P0234O45Q696L9389l8426m4992o2157O5569K7276k779j5402
15089b7868m1190J1231j4815N1249N1433j9489n7149l528M5650N3022k2594n2324
15077b6372J7476L3913j7179R420k3566L9338m3756m0512N4278K737l1164P416
15065a7971l3209O0159L7276L0523j8382j7627m7434k7314j0389Q4991N9299l1818
15053F8104m0601k5347Q810K50l3332n945N746O553K4919O7890p274m6205p774
$$ plain form
15040 15794 5598 -12799 36409 34882 -2338 -19442 -33751 -50817 -20815 23846 -2671 -8160
15028 -8160 -1373 -21996 -52305 -105738 -83683 -56254 -89248 -159824 -172833 -36553 12252 17253
15016 17253 -7320 -101006 -104528 -47782 -43199 -35112 -48431 -22682 13376 49055 16537 -55635
15004 -55635 -72797 -42779 -17025 -35039 -27296 15075 58664 91747 81336 55433 5577 -68154
14992 -68154 -28582 -52655 -106031 -77999 -1839 43142 63610 66875 23157 4212 21707 -19464
14980 -19464 -57935 -69980 -31730 -24296 2615 55680 21318 11531 20326 -35269 -53890 -58419
14968 -58419 -37052 39839 68524 126022 123545 36125 17144 39376 41458 54017 36056 14301
14956 14301 -60646 -97583 -50825 -40799 -19147 -3352 -25818 1392 -9553 31804 42168 49468
$$ packed form
15040A5794j0196j8397M9208j527l7220j7104j4309j7066L0002M4661k6517n489
15028h160O787k0623l0309n3433K2055K7429l2994p0576j3009J36280M8805N001
15016A7253k4573r3686l522N6746M583Q087j3319K5749L6058L5679l2518p2172
15004e5635j7162L0018K5754j8014P743M2371M3589L3083j0411k5903m9856p3731
14992f8154L9572k4073n3376K8032P6160M4981K0468L265m3718j8945J7495m1171
14980a9464l8471j2045L8250P434K6911N3065l4362r787Q795n5595j8621m529
14968e8419K1367P6891K8685N7498k477q7420j8981K2232K082J2559j7961k1755
14956A4301p4947l6937M6758J0026K1652J5795k2466K7210j0945M1357J0364P300
$$ plain form
14944 49468 90398 88002 64060 42160 21955 44930 24046 -34806 -45351 -54806 -46438 -32933
14932 -32933 -27658 -17955 -26620 57151 27966 -17519 -23390 -70718 -73485 -3665 35865 54351 18013
14919 18013 -60810 -85706 -63010 -27466 -11829 6082 2750 1282 -55409 -22378 10580 -9391
14907 -9391 -25054 -14524 -52238 3151 22861 16314 -6635 -58434 -63347 -124831 -130930 -89044
14895 -89044 -45972 -30003 7716 63002 77688 42969 28493 66093 46958 49899 28700 -27359
14883 -27359 -13332 1913 13343 37640 34737 21741 -4848 44129 75040 81226 67058 56398
14871 56398 25794 10136 -8516 -13780 -38066 -29573 -42064 -22823 4487 38106 47846 30534
14859 30534 39557 65215 53590 58054 49065 6276 4127 40795 54661 47392 57467 84479 90368
$$ packed form
14944D9468M0930k396k3942k1900k0205K2975k0884n8852j0545r455Q368J3505
14932c2933N275R703q665Q3771k9185m5485n871m7328k767O9820L9530J8486l6338
14919A8013p8823k4896K2696L5544J5637J7911l332j468n6691L3031L2958j9971
14907i391j5663J0530l7714N5389J9710o547k2949n1799m913o1484o099M1886
14895h9044M3072J5969L7719N5286J4686l4719j4476L7600j9135K941k1199n6059
14883b7359J4027J5245J1430K4297k903j2996k6589M8977L0911O186j4168j0660
14871E6398l0604j5658j8652n264k4286Q493j2491J9241K7310L3619R740j7312
14859C0534R023K5658j1625M464q989m2789k149L6668J3866p269J0075K7012N889
$$ plain form
14846 90368 66721 85653 63038 47682 48932 64943 20386 -64654 -106761 -63734 -35335 -50050
14834 -50050 -114575 -135006 -80108 -32041 -27936 -42418 -96358 -152549 -137736 -69748 -53180 -21501
14822 -21501 16598 80577 64530 -14831 -5978 44263 54228 13617 -48331 -66739 37357 44325
14810 44325 41411 14355 -803 -19831 -23085 -40870 -61636 -51129 38389 -6792 -26364 -16577
14798 -16577 -15180 27394 46902 65068 62661 71395 78025 56458 -7184 -18524 -55712 -89349
14786 -89349 -59808 -73807 -88522 -94623 -82211 -75250 -47787 19345 85122 91511 43173 -20652
14774 -20652 -3045 31245 13015 -35078 -53059 -50154 -6278 2626 4247 -3540 -7917 13483 31733
14761 31733 -12278 -49453 -51930 -11289 43273 108857 72249 39463 49383 61539 79721 31361
$$ packed form
14846I0368k3647J8932k2615j5356J250J6011m4557q5040m2107M3027K8399j4715
14834e0050o4525k0431N4898M8067M105j4482n3940n6191J4813O7988J6568L1679
14822b1501L8099O3979j6047p9361Q853N0241R965m0611o1948j8408J04096O968
14810D4325k914k7056j5158j9028l254j7785k0766J0507Q9518m5181j9572R787
14798a6577J397M2574J9508J8166k407Q734O630k1567o3642j1340l7188l3637
14786h9349K9541j3999j4715o101J2412O961K7463O7132O5777O389m8338o3825
14774b0652J7607L4290j8230m8093j7981K905M3876Q904J621p787m377K1400J8250
14761C1733m4011l7175k477M0641N4562O5584l6608l2786R920J2156J8182m8360
$$ plain form
14749 31361 9950 -19170 11965 47644 18205 -132137 -125496 -21285 49862 47870 35895 54514
14737 54514 36983 14276 16472 3515 -35443 -68188 -67718 -66562 -60433 -30590 25141 -3692 -23656
14724 -23656 -45134 -35135 -7937 60217 41325 -20899 -57755 -88978 -68802 -69074 -48327 -35224
14712 -35224 -6325 2164 2339 25345 61823 66849 50917 34196 38258 1072 -21323 -44803 16002
14699 16002 72569 109729 63409 -3526 -37371 -71595 -68311 -55111 -25977 -40958 -32730 -29242
14687 -29242 -14061 -54530 -82657 -81096 -49090 5240 11891 7147 -31460 -94728 -49104 -18029
14675 -18029 18357 41637 70905 48140 -15737 -75284 -153345 -151853 -135668 -114365 -41904 7749
14663 7749 12317 11287 49782 48660 -1941 44215 95176 43743 10832 17353 41559 76048 116654
$$ packed form
14749C1361k1411k9120L1135L5679k9439j50342O641J04211P1147j992j1975J8619
14737E4514j7531k2707K196j2957l8958l2745M70J156O129K9843N5731k8833j9964
14724b3656k1478R999K7198O8154j8892o2224l6856l1223K0176k72K0747J3103
14712c5224K8899Q489J75K3006L6478N026j5932j6721M062l7186k2395k3480O0805
14699A6002N6567L7160m6320o6935l3845l4224L284J3200K9134j4981Q228L488
14687b9242J5181m0469k8127J561L2006N4330O651m744l8607o3268M5624L1075
14675a8029L6386K3280K9268k2765o3877n9547p8061J492J6185K1303P2461M9653
14663G749M568j030L8495j122n0601M6156N0961n1433l2911O521K4206L4489M0606
$$ plain form
14650 116654 64270 24904 -1576 -62312 -116869 -146034 -140794 -147164 -61905 6119 27670 52297
14638 52297 42605 5528 -23873 -35755 34298 36263 -31912 -40723 26656 59419 276 -109704
14626 -109704 -110104 -47452 -20115 -72433 -67338 -4896 -10332 -77691 -56582 -40371 -50412 -27861
14614 -27861 -27685 -79896 -58068 -59802 -66532 -43001 -42852 -20111 -71406 -131515 -88702 6776 52510
14601 52510 50060 24908 27150 4869 -38208 -36529 19383 35472 87737 90337 100884 77973
14589 77973 -16881 -75600 -29551 15390 40128 13675 2862 -26795 -51876 -76956 -64279 -20596
14577 -20596 15164 1315 60511 88512 53434 10542 -9537 -9464 -5415 -701 16321 77284 52984
14564 52984 45644 29338 -56979 -128837 -79085 -38765 32238 72030 13537 -23406 -35192 -83872
$$ packed form
14650A16654n2384l9366k6480o0736n4557k9165N240o370Q5259O8024K1551K4627
14638E2297r692l7077k9401j1882P0053J965o8175q811O7379L2763n9143j09980
14626a09704m00O2652K7337n2318N095O2442n436o7359K1109J6211j0041K2551
14614b7861J76n2211K1828j734o730K3531J49K2741n1295o0109M2813R5478M5734
14601E2510k450k5152K242k2281m3077J679N5912J6089N2265K600J0547k2911
14589G7973r4854n8719M6049M4941K4738k6453j0813k9657k5081k5080J2677M3683
14577b0596L5760j3849N9196K8001l5078m2892k0079P3M049M714J7022O0963k4300
14564E2984p340j6306q6317p1858M9752M0320P1003L9792n8493l6943j1786m8680
$$ plain form
14552 -83872 -98663 -132443 -103259 -64395 -50100 -79486 -62026 -51948 -19449 33292 21638 4543
14540 4543 -38846 -44333 -28647 -3174 -7521 -29891 -27983 -71796 -102364 -101647 -77414 -72569 -50479
14527 -50479 -7434 10559 43464 67964 39380 -64765 -42225 78794 98774 62627 11923
14516 11923 -25928 -6773 -4636 -27456 23694 54738 53258 72217 53614 37359 -21279 -38952
14504 -38952 -17553 55913 55636 7981 -31852 -28073 -1081 -30547 -69743 -28167 -6211 34054
14492 34054 59253 84223 32476 -27015 -72257 -83650 -96714 -65551 -6602 -27338 -43403 55453
14480 55453 38472 -57075 -59765 -73289 -116132 -121932 -118956 -129653 -128953 -96592 -60062 -61358 -22008
14467 -22008 -13373 -28695 -57338 -89336 -79979 -29347 -12045 14052 11914 -16042 6416 7355 -20531
$$ packed form
14552h3872j4791l3780K9184L8864J4295k9386J7460J0078L2499N2741j1654j7095
14540D543m3389n487J5686K5473m347k2370J908m3813l0568P17K4233M845K2090
14527e0479M3045J7993L2905K4500k8584j04145K2540J21019J9980l6147n0704
14516A1923l7851J9155K137k2820N1150L1044j480J8959j8603j6255n8638j7673
14504c8952K1399P3466k77m7655l9833L779K6992k9466l9196M1576K1956M0265
14492C4054K5199K4970n1747n9491m5242j1393j3064L1163N8949k0736j6065R8856
14480E5453j6981r5547k690j3524m2843n800K976j0697P00L2361L6530j296L9350
14467b2008Q635j5322k8643l1998R357N0632J7302K6097k138k7956K2458R39k7886
$$ plain form
14454 -20531 30831 94677 71249 7238 -79505 -63338 -4999 49040 35653 5587 -28814 -15454
14442 -15454 5071 -3802 -70477 -98258 -80144 -18622 7845 -32078 -24529 27491 30575 58838
14430 58838 5462 -42443 -11363 33017 -36374 -45613 -15795 -31932 -49327 -15009 -5568 -81877
14418 -81877 -146108 -114137 -51807 -19246 -58585 8334 65588 121309 152826 112103 11418
14407 11418 12919 49059 54992 21445 144 -31904 -59632 -36131 791 -18268 -28304 -68499
14395 -68499 -40289 -36212 -31284 4174 13307 17311 56486 29172 7770 -1804 -13156 -2935 -34379
14382 -34379 -106777 -86741 -44152 -45178 -29037 21568 -333 11129 24924 21185 -13690 -71318
14370 -71318 -27865 29280 -21751 -90119 -83863 -44824 -45840 -25912 20320 27449 63310 72448
$$ packed form
14454b0531N1362O3846k3428o4011q6743J6167N8339N4039j3387l0066l4401J3360
14442a5454K0525q873o6675k7781J8114O1522K6467l9923P549N2020L084K8263
14430E8838n3376m7905L1080M4380o9391r239K9818j6137j7395L4318R441p6309
14418h1877o4231L1971O2330L2561l9339O6919N7254N5721L1517m0723j00685
14407A1418J501L6140N933l3547k1301l2048k7728K3501L6922j9059j0036m0195
14395f8499K8210M077M928L5458R133M004L9175k7314k1402r574j1352J0221l1444
14382c4379p2398K0036M2589j026J6141N0605k1901J1462J3795l739l4875n7628
14370g1318M3453N7145n1031o8368O256L9039j016J9928M6232P129L5861R138
$$ plain form
14358 72448 56897 58645 63956 53858 21665 -2206 -28528 -70443 -50859 -54655 -37609 -53948
14346 -53948 -44941 -37761 37724 56599 91213 105193 111939 128730 110687 25321 -269 -4397
14334 -4397 -48274 -74163 -77461 -38184 -22741 -13703 23851 105897 124528 68391 60621 82217
14322 82217 80210 116618 113324 24384 -35626 -33116 45165 34135 40841 5433 -26799 -54166
14310 -54166 -96293 -61273 -38311 3345 -20330 -67249 -84730 -54780 -26702 -50733 -33055 29017
14298 29017 58222 52185 60161 91379 100668 56188 113871 124776 82106 53856 15571 -19370
14286 -19370 -59328 -76720 -99228 -86088 -71092 -20965 33712 40138 43632 44876 45275 68037 74695
14273 74695 87329 57842 37433 -8448 23838 12382 -60490 -85457 -10423 -45840 -89638 -60121
$$ packed form
14358G2448j5551J748N311j0098l2193k3871k6322m1915J9584l796J7046j6339
14346e3948R007P180P5485J8875L4614J3980O746J6791j8043q5366k5590m128
14334d397m3877k5889l298L9277J5443R038L7554Q2046J8631n6137p770K1596
14322H2217k007L6408l294q8940o0010K510P8281j1030O706l5408l2232k7367
14310e4166m2127L5020K2962M1656k3675m6919j7481K9950K8078k4031J7678O2072
14298B9017K9205o037P976L1218R289m4480N7683J0905m2670k8250l8285l4941
14286a9370l9958j7392k2508J3140J4996N0127N4677O426L494J244L99K2762O658
14273G4695J2634k9487k0409m5881L2286j1456p2872k4967P5034l5417m3798K9517
$$ plain form
14261 -60121 -14636 79800 74012 31755 54285 65201 38582 -36889 -35019 -31648 21268 14991
14249 14991 -872 -12642 -54932 -122788 -73706 -30603 -2377 31393 107251 58243 -31997 -12993
14237 -12993 -29047 -4498 -26018 -24777 -62397 -41680 -33571 9325 94534 104452 144758 131793
14225 131793 47031 46873 55337 -13497 14848 44485 4277 17794 13510 9311 -24120 -54284
14213 -54284 -40168 6045 6117 -6670 -34539 -123573 -162968 -129704 -51866 -22687 -35769 -81222
14201 -81222 -36086 -3660 45361 134148 95075 33084 43140 52938 12848 -22138 -30326 19876
14189 19876 69649 2468 -53743 -70693 -8943 51926 26274 -19688 -54018 -60630 -14820 -14025
14177 -14025 -75707 -69664 -25623 -1857 34375 90183 92931 60884 3599 -68075 -9261 -4916
$$ packed form
14261f0121M5485R4436n788m2257K2530J0916k6619p5471J870L371N2916o277
14249A4991j5863j1770m2290o7856M9082M3103K8226L3770P5858m9008r0240J9004
14237a2993j6054K4549k1520J241l7620K0717Q109M2896Q5209R918M0306j2965
14225A31793q4762j58Q464o8834K8345K9637m0208J3517m284m199l3431l0164
14213e4284J4116M6213P2j2787k7869q9034l9395L3264P7838K9179j3082m5453
14201h1222M5136L2426M9021Q8787l9073o1991J0056R798m0090l4986q188N0202
14189A9876M9773o7181n6211j6950O1750O0869k5652m5962l4330o612M5810P95
14177a4025o1682O043M4041K3766L6232N5808K748l2047n7285p1674N8814M345
$$ plain form
14165 -4916 -22983 -43572 -24803 -50781 -74773 -104846 -90528 102 -18647 -48812 -58876 -52825
14153 -52825 -70203 -21269 -64363 -65225 -18153 43196 7107 -19088 -21256 -20269 -10939 -51434 -32073
14140 -32073 -35299 32108 100984 99615 48620 48679 40090 11219 26449 -13516 -35672 4123 35424
14127 35424 43996 12588 10307 -2006 -80847 -24313 72676 12184 -40974 -54959 -40140 50710
14115 50710 84999 103423 118737 53363 26749 19086 17634 -11456 -45893 -2778 18046 8417
14103 8417 34266 42477 44267 58660 62158 70253 -25873 -85689 -72325 -8174 -42342 -58038 -2513
14090 -2513 9512 30518 51690 78027 89967 63982 62447 91463 88770 32737 13605 49919
14078 49919 48053 57828 -4439 14968 12140 -5877 658 48884 64158 44476 34862 24907 17755
$$ packed form
14165d916j8067k0589J8769k5978k3992l0073J4318R0630j8749l0165j0064O051
14153e2825j7378M8934m3094q62M7072O1349l6089k6195k168R87R330m0495J9361
14140c2073l226O7407O8876j369n0995N9q589k8871J5230l9965k2156L9795L1301
14127C5424Q572l1408k281j2313p8841N6534R6989o0492n3158j3985J4819R0850
14115E0710L4289J8424J5314o5374k6614p663j452k9090l4437M3115K0824r629
14103H417K5849Q211J790J4393L498Q095r6126n9816J3364O4151l4168j5696N5525
14090b513J2025K1006K1172K6337J1940k5985j535K9016k693n6033j9132L6314
14078D9919j866R775o2267J9407k828j8017O535M8226J5274j9682r614r955p152
$$ plain form
14065 17755 92869 106824 65674 35119 -11183 -35189 -77949 -105407 -126211 -48576 -31906 6447
14053 6447 75218 119924 74641 1446 22766 47032 32844 71710 50533 78461 111477 117804
14041 117804 54458 30535 26640 86966 62890 29022 -9613 6935 95970 146733 129358 76252
14029 76252 37714 -6584 -31456 -57342 -43223 -61868 -68953 -75579 -85392 -46074 -65045 -45694
14017 -45694 -31217 -20595 -11720 37463 75884 63881 73950 20886 -42757 -53157 -17078 -61262
14005 -61262 -96441 -112597 -111782 -125449 -96833 -25137 -32242 -21222 -24437 -48104 -77660 -89570
13993 -89570 -77930 -80729 -78691 -29458 -22683 -44841 -50959 -77574 -73940 -36013 -41005 -52826 -58853
13980 -58853 19174 55333 14221 -2143 11314 896 -31565 -28036 -17439 -15702 47179 69176
$$ packed form
14065A7755P5114J3955m1150l0555m6302k4006m2760k7458k0804P7635J6670L8353
14053F447O8771M4706m5283p3195K1320K4266j4188L8866k1177K7928L3016O327
14041A17804o3346k3923l895O0326k4076l3868l8635J6548Q9035N0763j7375n3106
14029G6252l8538m4298k4872k5886J4119j8645p085o626r813L9318j8971J9351
14017d5694J4477J0622Q875M9183L8421j2003J0069n3064o3643j0400L6079m4184
14005f1262l5179j6156Q15j3667K8616P1696p105J1020l215k3667k9556j1910
13993h9570J1640k799K038M9233O775k2158o118k6615L634L7927m992j1821o027
13980e8853P8027L6159m1112j6364J3457j0418l2461L529J0597J737O2881K1997
$$ plain form
13968 69176 25315 -51635 -31054 21017 -7652 -34046 -6362 2290 -46307 -23490 3795 47502
13956 47502 12407 32089 52184 74439 81485 70416 46624 36177 54234 -5793 -58978 -41929
13944 -41929 -35361 -13532 -58067 -152713 -112951 -73627 9899 53917 30060 -2298 -15545 -13861
13932 -13861 9675 35756 -8006 -47670 -62685 -21340 10911 -17406 -42864 -62436 -33873 22857
13920 22857 -7224 5027 -35963 -33207 -38909 35344 30435 35463 -16268 -52406 -34385 -17882
13908 -17882 -6770 64314 4567 -52867 -25548 22025 41108 -31028 -90669 -150482 -146628 -64186
13896 -64186 -4862 -172 -16275 -35288 -70921 -67597 -31516 -7622 -31400 -38215 40704 25901
13884 25901 -40111 -45789 -110548 -120082 -65406 -42568 -9732 11500 61283 41517 -67112 -53790
$$ packed form
13968F9176m3861p6950K0581N2071k8669k6394K7684Q652m8597K2817K7285M3707
13956D7502l5095J9682K0095K2255P046j1069k3792j0447J8057o0027n3185J7049
13944d1929O568K1829m4535r4646L9762L9324Q3526M4018k3857l2358j3247J684
13932a3861K3536K6081m3762l9664j5015M1345L2251k8317k5458j9572K8563N6730
13920B2857l0081J2251m0990K756n702P4253m909N028n1731l6138J8021J6503
13908a7882J1112P1084n9747n7434K7319M7573J9083p2136n9641n9813L854Q2442
13896f4186N9324M690j6103j9013l5633L324L6081K3894k3778o815P8919j4803
13884B5901o6012n678o4759r534N4676K2838L2836K1232M9783j9766j08629J3322
$$ plain form
13872 -53790 20576 36386 24023 -9225 -54021 -17410 1689 -4961 -28321 1477 26430 8704
13860 8704 -48998 -76822 -64247 -7535 -38511 -89503 -75437 -30292 4567 -25415 -97452 -68002
13848 -68002 -58733 -22864 17421 -24323 22072 27440 -42728 -70441 -35753 21832 13613 -22970
13836 -22970 -21294 20467 4901 -3591 23873 34679 64618 59623 52042 25200 44384 93035
13824 93035 107502 33828 47041 48454 91140 75846 34624 38535 21488 64082 28934 21035
13812 21035 56373 54452 18137 -31973 -52686 -33827 -36783 -21123 14636 15893 2826 -42493
13800 -42493 -81897 -69689 -14960 617 -19346 57391 159800 186383 110698 58218 58005 5630
13788 5630 -26131 10220 57517 102087 70847 82207 25989 -50164 -39024 -70673 -39449 -42729
$$ packed form
13872e3790P4366J5810j2363l3248m4796L6611J9099o650k3360K9798K4953j7726
13860H704n7702k7824J2575N6712l0976n0992J4066M5145L4859k9982p2037K9450
13848f8002R269L5869M0285m1744M6395N368p0168k7713L4688N7585q219l6583
13836b2970J676M1761j5566q492K7464J0806K9939m995p581k6842J9184M8651
13824I3035J4467p3674J3213J413M2686j5294m1222L911j7047M2594l5148p899
13812B1035L5338j921l6315n0110k0713J8859k956J5660L5759J257j3067m5319
13800d2493l9404J2208N4729J5577j9963P6737J02409K6583p5685n2480k13n2375
13788E630l1761L6351M7297M4570l1240J1360n6218p6153J1140l1649L1224l280
$$ plain form
13776 -42729 -47623 -55822 -134012 -170098 -187502 -163787 -97848 -91592 -39567 6682 -34855 -50018
13764 -50018 -51423 -38252 15365 44717 6990 11265 66443 65483 25542 35381 66663 10668 -28472
13751 -28472 -15086 -26392 -58455 -18181 -53372 -60959 -109453 -118500 -79860 -30746 -11402 -34762
13739 -34762 17190 67343 42014 -41722 -74548 -44114 -5517 3651 17760 17864 -13069 -44127
13727 -44127 -51748 -36881 -56615 -95752 -96188 -76495 -57458 -22790 -20350 -23848 782 -33963 -82917
13714 -82917 -36439 25293 105413 108264 71603 64644 79058 46259 15060 -40304 -68029 -36307
13702 -36307 24274 16807 -27047 -34800 -26110 -83644 -83577 -72126 -49644 -61942 -31566 46512 44330
13689 44330 63148 101087 55799 84643 65865 33705 -33329 -86359 -96377 -46049 18503 92663
$$ packed form
13776d2729m894q199p8190l6086j7404K3715O5939O256N2025M6249m1537j5163
13764e0018j405J3171N3617K9352l7727M275N5178r60l9941R839L1282n5995l9140
13751b8472J3386j1306l2063M0274l5191p587m8494r047L8640M9114J9344k3360
13739c4762N1952N0153k5329q3736l2826L0434L8597R168J4109J04l0933l1058
13727d4127p621J4867j9734l9137m36J9693J9037L4668K440l498K4630l4745m8954
13714h2917M6478O1732Q0120K851l6661o959J4414l2799l1199n5364k7725L1722
13702c6307O0581p467m3854p753Q690n7534O7J1451K2482j2298L0376P8078k182
13689D4330J8818L7939m5288K8844j8778l2160o7034n3030j0018N0328O4552P4160
$$ plain form
13677 92663 55148 -51196 -94356 -87515 -130280 -138469 -89115 -91197 -86228 -61756 -28081 -1713
13665 -1713 -27169 -61634 -25507 -12925 126 -27161 -26626 4724 30453 8128 17606 5525
13653 5525 -64479 -129723 -109318 -39480 -29662 -50830 -80991 -75128 -44229 23794 84007 28666
13641 28666 -68033 -61708 -76280 -58463 -56369 -45975 -23478 8299 -56590 -49106 -13566 -3443
13629 -3443 -25703 -29421 -22089 -66200 -34597 -8891 21356 58358 81058 27525 38009 79459
13617 79459 27643 443 -46101 -98194 -100021 -87334 -97831 -125747 -145348 -72403 -47172 -18177
13605 -18177 -9255 -26409 -58030 -92019 -87275 -30790 -27141 -35006 -19609 -69029 -111002 -135416
13593 -135416 -122771 -56902 49436 68846 -9926 -72305 -76442 -69599 -62996 -80389 -86107 -72873
$$ packed form
13677I2663l7515j06344m3160O841m2765q189M9354k082M969K4472L3675K6368
13665a713k5456l4465L6127J2582J3051k7287N35L1350K5729k2325R478j2081
13653E525p0004o5244K0405O9838R818k1168l0161N863L0899O8023O0213n5341
13641B8666r6699O325j4572J7817K094J0394K2497L1777o4889P484L5540J0123
13629c443k2260l718P332m4111L1603K5706L0247L7002K2700n3533J0484M1450
13617G9459n1816k7200m6544n2093j827J2687j0497k7916j9601P2945K5231K8995
13605a8177Q922j7154l1621l3989M744N6485L649p865J5397m9420m1973k4414
13593a35416J2645O5869J06338J9410p8772o2379m137O843O603j7393n718J3234
$$ plain form
13581 -72873 -67772 -51894 -41995 -61516 -30170 17744 39509 58893 16601 20227 60572 71297
13569 71297 23748 -47724 -21075 9471 -346 -45075 -23977 -11957 -10251 -29622 -76905 -90328
13557 -90328 -132796 -136747 -117793 -13455 7563 13422 -15357 -38031 -9051 2535 -22532 -22180
13545 -22180 38703 50759 55294 33451 52806 23329 -13667 -35965 -64481 -43151 -15570 43122
13533 43122 129248 80605 12985 -20598 -77621 -65628 -11053 14827 31738 5631 -28014 -60887
13521 -60887 -96892 -99536 -64100 -39733 -20944 -14926 -50161 -93407 -122566 -123433 -121220 -127421 -137548
13508 -137548 -81845 -81928 -91232 -85405 -80853 -35307 -30171 -39230 17450 53151 50775 -65158 -106108
13495 -106108 -86006 -46043 21088 22126 19019 29601 -6150 -42762 -10313 -54171 -93636 -46468
$$ packed form
13581g2873N101J5878R899j9521L1346M7914K1765J9384m2292L626M0345J0725
13569G1297m7549p1472K6649L0546r817m4729K1098J2020J706j9371m7283j3423
13557i0328m2468l951J8954J04338K1018N859k8779k2674K8980J1586k5067L52
13545b2180O0883J2056M535k1843J9355k9477l6996k2298k8516K1330K7581N8692
13533D3122Q6126m8643o7620l3583n7023J1993N4575K5880J6911k6107l3645l2873
13521f0887l6005k644L5436K4367J8789O018l5235m3246k9159q67K213o201j0127
13508a37548N5703q3r304N827M552M5546N136r059N6680L5701k376j15933m0950
13495a06108K0102L9963O7131J038l107J0582l5751l6612L2449m3858l9465M7168
$$ plain form
13483 -46468 -46353 -23699 4942 13554 17040 -7556 -11696 7877 23689 9753 -9865 -43262 -43008
13470 -43008 -53058 -11980 62346 24447 -38222 -8712 29379 3230 -61302 -25099 15776 7206
13458 7206 -54879 -110643 -63203 -57739 -89613 -55037 -51593 -39355 -30029 -68954 -71540 -36621 -26572
13445 -26572 -40281 -23231 -10700 26432 4420 13157 -83001 -102629 -93142 -49993 -50277 -94028
13433 -94028 -62355 -40055 -1719 4318 41208 127048 73871 4840 49660 82788 102030 120295
13421 120295 101328 89083 109036 89806 88575 40631 34590 -22715 -30066 -46051 -82257 -101370
13409 -101370 -49090 5203 42435 52782 31110 -670 -23981 2644 5847 -8679 -13003 45260
13397 45260 57196 17789 24385 -43418 -71695 -62470 -58478 -58276 -52641 -12677 99549 172412 135222
$$ packed form
13483d6468J15K2654K8641Q612L486k4596m140J9573J5812j3936j9618l3397K54
13470d3008j0050M1078P4326l7899o2669K9510L8091k6149o4532L6203M0875q570
13458G206o2085n5764M7440N464l1874L4576L444J2238R326l8925k586L4919J0049
13445b6572j3709J7050J2531L7132k2012Q737r6158j9628R487M3149k84m3751
13433i4028L1673K2300L8336O037L6890Q5840n3177o9031M4820L3128J9242J8265
13421A20295j8967j2245J9953j9230j231m7944o041n7305p351j5985l6206j9113
13409a01370N2280N4293L7232J0347k1672l1780k3311K6625L203j4526m324N8263
13397D5260J1936l9407O596o7803k8277R225L992K02N635L9964J12226P2863l7190
$$ plain form
13384 135222 74060 10562 17661 36751 33587 24383 62239 77299 -2821 -65761 -91780 -68239
13372 -68239 -30170 -38630 -14176 14564 101038 64909 32629 -48428 -27274 -22938 12239 23973
13360 23973 50754 47618 8706 1542 27339 56393 53309 6212 -64013 -78971 -79146 -80075 20542
13347 20542 58050 62977 86989 90820 66042 38558 61873 78231 28711 21022 -5738 -5660 -27567
13334 -27567 37607 134327 146910 108292 63196 80216 86931 8237 -32035 24857 74642 98577
13322 98577 6840 372 22907 26155 18468 55666 75020 85624 71851 20335 17504 51581
13310 51581 1950 -61291 -23425 32093 -50870 -122759 -138969 -73748 -377 -6581 10574 43199
13298 43199 79136 74743 79455 52453 -51766 -65649 -35245 -19593 49379 35579 23953 -30055
$$ packed form
13384A35222o1162o3498P099J9090l164r204L7856J5060q0120o2940k6019K3541
13372f8239L8069q460K4454K8740Q6474l6129l2280q1057K1154M336L5177J1734
13360B3973K6781l136l8912p164K5797K9054l084m7097p0225j4958j75r29J00617
13347B0542L7508M927K4012L831k4778k7484K3315J6358m9520p689k6760P8k1907
13334b7567O5174R6720J2583l8618m5096J7020O715p8694m0272N6892M9785K3935
13322I8577r1737o468K2535L248p687L7198J9354J0604j3773n1516k831L4077
13310E1581m9631o3241L7866N5518q2963p1889j6210O5221P3371o204J7155L2625
13298D3199L5937m393M712k7002j04219j3883L0404J5652O8972j3800j1626n4008
$$ plain form
13286 -30055 -10724 -12266 2553 19044 61135 32967 25566 -16337 5441 44877 48226 34522
13274 34522 47573 75493 42322 -14548 -40100 -26459 -13870 -47138 -59083 8296 40324 24432
13262 24432 -20483 -13630 -38197 -78237 -68334 -48110 -19946 48043 126746 113443 107040 92569
13250 92569 1961 -62514 -59436 -63413 -7673 13818 31958 32454 28303 68972 32672 -5323 -6832
13237 -6832 25177 28363 44746 49656 -20220 -24450 10034 32965 -18389 -39347 -47424 -42442 -51552
13224 -51552 -16570 -69313 -80020 -42501 -47560 8163 59128 51571 16205 85921 131031 110861
13212 110861 69184 41890 37423 29420 42995 41290 40517 14830 43647 73680 24420 4756
13200 4756 13591 60937 84755 74975 54987 52726 68004 26112 3552 49323 34972 -1499
$$ packed form
13286c0055J9331j542J4819J6491M2091k8168p401m1903K1778L9436L349j3704
13274C4522J3051K7920l3171n6870k5552J3641J2589l3268j1945O7379L2028j5892
13262B4432m4915O853k4567m0040R903K0224K8164O7989P8703j3303o403j4471
13250I2569r0608o4475L078l977N5740K1491J8140M96m151M0669l6300l7995j509
13237f832L2009L186J6383M910o9876m230L4484K2931n1354k0958q077M982r110
13224e1552L4982n2743j0707L7519n059N5723N0965p557l5366O9716M5110k0170
13212A10861m1677k7294m467q003J3575j705p73k5687K8817L0033m9260j9664
13200D756Q835M7346K3818r780j9988k261J5278m1892k2560M5771j4351l6471
$$ plain form
13188 -1499 1002 10876 53120 19798 25089 37874 129422 140138 124162 104937 75061 19315
13176 19315 33615 52998 58154 100481 81353 76699 56754 103200 125562 87328 136982 158745
13164 158745 141951 147331 151572 71757 19884 14487 57588 33691 38929 66783 78287 89851
13152 89851 84561 115488 155959 236814 260824 235748 166256 126463 95192 64513 39409 44581
13140 44581 93051 130295 123413 54422 9082 29485 57562 37254 -4709 19791 35707 7813
13128 7813 -29391 -5371 41240 9076 13832 -27336 39752 48164 6686 45169 102752 110593
13116 110593 121203 87681 28728 44891 71409 95624 92738 141848 110130 50026 34173 40398
13104 40398 67851 74105 47846 -7893 -35774 -59381 -49382 -16737 9990 -3879 32140 11080
$$ packed form
13188a499K501R874M2244l3322N291J2785R1548J0716j5976j9225k9876n5746
13176A9315J4300J9383N156M2327j9128m654j9945M6446K2362l8234M9654K1763
13164A58745j6794N380M241p9815n1873n397M3101k3897N238K7854J1504J1564
13152H9851n290L0927M0471Q0855K4010k5076o9492l9793l1271l0679k5104N172
13140D4581M8470L7244o882o8991m5340K0403K8077k0308m1963K4500J5916k7894
13128G813l7204K4020M6611l2164M756m1168O7088Q412m1478L8483N7583P841
13116A10593J0610l3522n8953J6163K6518K4215k886M9110l1718o0104j5853O225
13104D0398K7453O254k6259n5739k7881k3607R999L2645K6727j3869L6019k1060
$$ plain form
13092 11080 -44584 -30295 13015 54007 85962 60410 15829 -1724 8316 6835 -1794 10659
13080 10659 43650 75327 51366 45628 34915 86752 124535 111806 88064 99306 106343 95431
13068 95431 161162 160998 100416 84964 35201 35818 78113 51399 23356 58817 78966 102705
13056 102705 102364 61652 102740 93817 25513 13286 83607 101048 85764 56586 15641 25669
13044 25669 15233 -11846 28232 21909 61371 76701 87117 102680 31733 -44742 -18434 42740
13032 42740 81703 97366 82467 64938 68975 104137 84592 121485 117640 117813 68194 266
13020 266 -51246 -54876 -5431 42689 -47603 -90804 -65125 -65683 2872 27338 25433 5665 -20045
13007 -20045 -22982 28002 65209 45291 -3947 -54440 -88307 -84570 -68589 -109580 -100873 -119685
$$ packed form
13092A1080n5664J4289M3310M0992L1955k5552m4581j7553J0040j481q629J2453
13080A0659L2991L1677k3961n738j0713N1837L7783j2729k3742J1242P037j0912
13068I5431O5731j64o0582j5452m9763O17M2295k6714k8043L5461K0149K3739
13056A02705l41m0712M1088q923o8304j2227P0321J7441j5284k9178m0945J0028
13044B5669j0436k7079M0078o323L9462J5330J0416J5563p0947p6475K6308O1174
13032D2740L8963J5663j4899j7529M037L5162j9545L6893l845J73m9619o7928
13020B66n1512l630M9445M8120r0292m3201K5679n58O8555K4466j905j9768k5710
13007b0045k937N0984L7207j9918m9238n0493l3867L737J5981m0991Q707j8812
$$ plain form
12995 -119685 -106276 -41765 -58 43164 39293 62389 116712 153019 89876 8793 35294 57565
12983 57565 58647 -5215 -57432 -47421 -12012 -11691 35731 107642 135422 112732 107501 70050
12971 70050 93805 114032 134060 144095 161225 152484 139274 99901 55349 89717 83691 62202
12959 62202 48419 47044 75842 88843 73686 50588 -691 -65855 -98391 -41503 -28702 -2513
12947 -2513 -418 -18506 14624 22897 98757 114503 94050 96295 91863 67214 41648 13149 22296
12934 22296 89244 111357 57164 -7561 -30619 1338 51127 61436 45621 22677 31913 -24976
12922 -24976 -32544 -4468 -30940 26145 75782 30199 57759 74894 78835 70310 74049 24389
12910 24389 -3560 5629 -18490 -56949 -49551 -4992 12279 58853 118988 151360 87236 41317
$$ packed form
12995a19685J3409O4511M1707M3222l871K3096N4323L6307o3143q1083K6501K2271
12983E7565J082o3862n2217J0011L5409L21M7422P1911K7780k2690n231l7451
12971G0050K3755K0227K0028J0035J7130q741j3210l9373m4552L4368o026k1489
12959F2202j3783j375K8798J3001j5157k3098n1279o5164l2536N6888J2801K6189
12947b513K095j8088L3130Q273P5860J5746k0453K245m432k4649k5566k8499R147
12934B2296O6948K2113n4193o4725k3058L1957M9789J0309j5815k2944R236n6889
12922b4976p568K8076k6472N7085M9637m5583K7560J7135L941q525L739m9660
12910B4389k7949R189k4119l8459P398M4559J7271M6574O0135L2372o4124m5919
$$ plain form
12898 41317 57666 14100 4983 40072 95602 99029 61163 -2671 -2844 20741 780 -48018
12886 -48018 -61617 -69826 -22587 31495 49840 68508 30493 40896 28957 24123 -28517 1083
12874 1083 41778 84746 50332 24062 30599 21537 -57080 -50825 21946 17089 -29920 -24617 -33758
12861 -33758 -55800 -42055 -61517 -17245 56144 60866 27564 9493 19599 16372 27725 98697
12849 98697 74498 13209 -8525 38534 51962 15202 70115 113036 36379 1413 9768 74553
12837 74553 76256 76813 60214 -35639 6406 47214 12197 -18390 -25186 28789 73887 97408
12825 97408 66759 -26859 -47972 -34483 4398 12859 -16441 -18516 20554 103419 111615 68732
12813 68732 101777 128012 76541 87532 120018 157138 118307 55762 86060 47629 10973 9824
$$ packed form
12898D1317J6349m3566r117L5089N5530L427l7866o3834j73K3585j9961m8798
12886d8018j3599q209M7239N4082J8345J8668l8015J0403j1939m834n2640K9600
12874A083M0695M2968l4414k6270O537r062p8617O255P2771m857m7009N303r141
12861c3758k2042J3745j9462M4272P3389M722l3302j8071J0106l227J1353P0972
12849I8697k4199o1289k1734M7059J3428l6760N4913M2921p6657l4966Q355O4785
12837G4553J703N57j6599r5853M2045M0808l5017l0587o796N3975M5098K3521
12825I7408l0649r3618k1113J3489L8881Q461k9300k075L9070Q2865Q196m2883
12813F8732L3045K6235n1471J0991L2486L7120l8831o2545L0298l8431l6656j149
$$ plain form
12801 9824 23285 23247 21888 28055 6805 14883 78829 92866 74719 101321 84037 38302 -5784
12788 -5784 -41787 -65758 -44697 31166 76011 19818 -256 35346 59692 55840 10241 23632
12776 23632 -24904 14298 21003 52350 46259 32861 33484 55338 78213 158959 152810 57652 52504
12763 52504 84255 37632 38132 6299 -16359 35777 68455 44133 44631 58813 6416 -27008
12751 -27008 -7898 -60561 -40760 -16786 56984 100750 48321 5173 -25986 -2893 -28636 9345
12739 9345 100986 108912 47150 19664 60790 85321 94171 104714 87793 64741 73228 115802
12727 115802 108784 87010 86643 99336 109595 144124 109531 91824 162256 273754 216273 149252
12715 149252 138545 139378 113784 114506 135667 230521 310593 435885 612611 878120 1242751
$$ packed form
12801I824J3461l8j359O167k1250Q078O3946J4037j8147K6602j7284m5735m4086
12788e784l6003k3971K1061P5863M4845n6193k0074L5602K4346l852m5599J3391
12776B3632m8536L9202O705L1347o091j3398O23K1854K2875Q0746o149r5158n148
12763E2504L1751m6623N00l1833k2658N2136L2678k4322M98J4182n2397l3424
12751b7008J9110n2663J9801K3974P3770M3766n2429m3148l1159K3093k5743L7981
12739I345R1641P926o1762k7486M1126K4531Q850J0543j6921k3052Q487M2574
12727A15802p018k1774l67J2693J0259L4529l4593j7707P0432J11498n7481o7021
12715A49252j0707Q33k5594P22K1161R4854Q0072J25292J76726K65509L64631
$$ plain form
12704 1242751 1489250 1772658 2072725 2288539 2292658 1821127 1343012 944716 695523 565020
12694 565020 483743 436406 348812 267339 230342 266679 260701 201232 161430 150537 224112 252534
12682 252534 212986 224136 229560 201830 177057 98853 66305 55719 52020 40635 69431 54303
12670 54303 111793 145354 100626 74729 102265 164229 155428 133465 69205 59210 66228 100041
12658 100041 19318 -17317 36448 57984 61632 48277 23254 30065 83361 120632 110462 32055
12646 32055 32543 23732 49018 55465 146865 159395 139446 150123 145277 50832 24465 73698 127496
12633 127496 189537 137211 99245 146184 146288 142281 141455 125411 97009 110522 95350 135900
12621 135900 199017 187927 107219 27486 12724 11920 37398 93934 62312 73615 96663 102104
$$ packed form
12704A242751K46499K83408L00067K15814M119m71531m78115l98296k49193j30503
12694E65020q1277m7337q7594q1473l6997L6337n978n9469l9802j0893P3575K8422
12682B52534l9548J1150N424k7730k4773p8204l2548j0586l699j1385K8796j5128
12670E4303N7490L3561m4728k5897K7536O1964q801k1963o4260r995P018L3813
12658A00041q0723l6635N3765K1536L648j3355k5023O811N3296L7271j0170p8407
12646C2055M88q811K5286O447R1400J2530j9949J0677m846r4445k6367M9233N3798
12633A27496O2041n2326l7966M6939J04m007q26j6044k8402J3513j5172M0550
12621A35900O3117j1090q0708p9733j4762q04K5478N6536l1622J1303K3048N441
$$ plain form
12609 102104 125321 162165 138221 106743 95109 12303 -47456 -22417 756 26871 5243
12598 5243 22082 65519 53828 26398 -2570 -12298 -15371 -23303 -1056 20232 21509 17552 27023
12585 27023 46132 83306 80198 32977 6414 18853 76486 98253 60826 75611 93299 55035
12573 55035 47377 54128 83103 77616 70700 57499 92410 98538 72705 23492 5605 -28831 -15845
12560 -15845 -41991 -12278 10672 10598 27340 21697 67224 85158 105882 102256 81666 87047 67924
12547 67924 62910 88856 72697 97988 123791 176409 136782 63286 20147 5069 60477 108015
12535 108015 98489 75415 65609 73456 13773 -22242 8771 36651 88420 113760 76918 46982
12523 46982 22095 40066 52670 75758 36206 90228 104644 102500 111975 112308 142692 134727 129403
$$ packed form
12609A02104K3217L6844k3944l1478j1634q2806n9759K5039K3173K6115k1628
12598E243J6839M3437j1691k7430k8968r728l073p932K2247K1288J277l957R471
12585B7023J9109L7174l108m7221k6563J2439N7633K1767l7427J4785J7688l8264
12573E5035p658O751K8975n487o916j3201L4911O128k5833m9213j7887l4436J2986
12560a5845k6146K9713K2950p4J6742n643M5527J7934K0724l626k0590N381j9123
12547F7924n014K5946j6159K5291K5803N2618l9627p3496m3139j5078N5408M7538
12535A08015r526k3074r806P847n9683l6015L1013K7880N1769K5340l6842k9936
12523D6982k4887J7971J2604K3088l9552N4022J4416k144R475L33L0384p965n324
$$ plain form
12510 129403 93507 85394 50029 60513 44844 29024 50018 76683 21451 55707 82135 106998
12498 106998 156238 143431 130268 150197 127592 135282 128756 133685 133156 91351 94897 87944 102738
12485 102738 145753 141529 118301 121368 67070 -1775 12854 -26513 -80553 -5563 91480 77178
12473 77178 412 -9385 41286 139673 186595 214361 116047 93453 66196 103654 91037 89719
12461 89719 84013 87460 62216 37397 31943 60055 95330 82205 139778 194115 166387 86232
12449 86232 4262 32380 127136 158767 140895 68943 80482 88063 92220 68582 74882 83897
12437 83897 75803 36872 24775 10304 40834 24863 -34792 -14852 37744 80787 31695 -9825
12425 -9825 29030 130774 134347 124796 139297 157533 207559 199041 147912 143157 116426 96069
$$ packed form
12510A29403l5896q113l5365J0484j5669j5820K0994K6665n5232L4256K6428K4863
12498A06998M9240j2807j3163J9929k2605P690o526M929n29m1805L546o953J4794
12485A02738M3015m224k3228L067n4298o8845J4629l9367n4040P4990R7043j4302
12473G7178p6766r797N0671R8387M6922K7766r8314k2594k7257L7458j2617j318
12461H9719n706L447k5244k4819n454K8112L5275j3125N7573N4337k7728q0155
12449H6232q1970K8118R4756L1631j7872p1952J1539P581M157k3638O300R015
12437H3897q094l8931j2097j4471L0530j5971n9655J9940N2596M3043m9092m1520
12425i825L8855J01744L573r551J4501J8236N0026q518n1129m755k6731k0357
$$ plain form
12413 96069 116334 146982 114039 114061 162179 179165 100812 7292 -27072 33125 64638 86592
12401 86592 51216 31000 52730 110604 110760 72188 96136 101870 123947 118591 73829 95990
12389 95990 84794 45584 51361 99061 121075 102022 89550 52568 67038 92510 132814 77332
12377 77332 47612 6087 5922 31069 48133 71166 78712 129379 183033 207263 185719 161163
12365 161163 144563 134119 145544 155740 160754 186518 168767 154624 154368 102804 14533 24303
12353 24303 90794 87133 73057 77532 135261 150825 134479 165219 201350 173672 189148 174471
12341 174471 169409 116628 91422 83273 117317 125092 164548 140723 89133 51766 72987 124609
12329 124609 143236 186306 219188 191798 116756 95012 138258 234523 312801 266794 215311
$$ packed form
12413I6069K0265L0648l2943K2M8118J6986p8353r3520l4364O0197L1513K1954
12401H6592l5376k0216K1730N7874J56l8572K3948N734K2077n356m4762K2161
12389I5990j1196l9210N777M7700K2014j9053j2472l6982J4470K5472M0304n5482
12377G7332k9720m1525j65K5147J7064K3033P546N0667N3654K4230k1544k4556
12365A61163j6600j0444J1425J0196N014K5764j7751j4143k56n1564q8271R770
12353B4303O6491l661j4076M475N7729J5564j6346L0740L6131k7678J5476j4677
12341A74471n062n2781k5206q149L4044P775L9456k3825n1590l7367K1221N1622
12329A24609J8627M3070L2882k7390p5042k1744M3246R6265P8278m6007n1483
$$ plain form
12318 215311 202483 156384 127435 155167 104408 111981 124349 165340 214572 256258 223516 172948
12306 172948 158269 133534 136845 150302 174899 162917 128571 136239 169691 140321 96409 117101
12294 117101 142141 183912 210424 200760 198198 226290 238744 274856 300831 306343 299168 302577
12282 302577 394283 545825 639940 865610 1087896 1254626 1413248 1647574 1742389 1470804
12272 1470804 1017066 739961 606034 531483 435714 400792 361606 349126 379868 295674 275473
12261 275473 271258 263658 279806 242332 248620 270350 264748 288987 317935 243902 235296 271059
12249 271059 251602 195238 164238 170165 214473 235734 237211 183701 228001 234036 200934 229325
12237 229325 221911 199882 166568 167169 178435 214723 223402 288154 282552 254785 246224 253013 275117
$$ packed form
12318B15311j2828m6099k8949K7732n0759P573J2368M0991M9232M1686l2742n0568
12306A72948j4679k4735L311J3457K4597j1982l4346P668L3452k9370m3912K0692
12294A17101K5040M1771K6512r664k562K8092J2454L6112K5975N512p175L409
12282C02577R1706J51542R4115K25670K22286J66730J58622K34326R4815k71585
12272A470804m53738k77105j33927p4551r5769l4922l9186j2480L0742q4194k0201
12261B75473m215p600J6148l7474O288K1730n602K4239K8948p4033q606L5763
12249B71059j9457n6364l1000N927M4308K1261J477n3510M4300O035l3102K8391
12237B29325p414k2029l3314O01J1266L6288Q679O4752n602k7767q561O789K2104
$$ plain form
12224 275117 261182 237921 241683 246223 311325 311076 328407 340411 261568 169773 161658 186986
12212 186986 253292 254300 267038 249021 289432 284148 224131 245895 301169 326238 306736 305158
12200 305158 279371 277610 328882 345007 311187 284105 276210 241913 278606 335006 356875 329055
12188 329055 319551 343058 342684 378840 371149 388814 384939 325387 315817 339240 379717 402940 420023
12175 420023 435599 417183 375485 357783 399689 445695 442462 411990 387766 339081 289244 384761
12163 384761 408848 408881 387600 389966 391294 418014 397295 426583 404725 379741 428064 405533
12151 405533 398336 387608 427729 456810 517875 594551 570677 499913 434275 430166 415627 436860
12139 436860 419474 391802 382772 452296 477634 507642 472933 404460 431830 465185 497962 484200
$$ packed form
12224B75117j3935k3261L762M540O5102k49J7331J2004p8843r1795q115K5328
12212A86986O6306J008J2738j8017M0411n284o0017K1764N5274K5069j9502j578
12200C05158k5787j761N1272J6125l3820k7082p895l4297L6693N6400K1869k7820
12188C29055r504K3507l74L6156p691J7665l875n9552r570K3423M0477K3223J7083
12175D20023J5576j8416m1698j7702M1906M6006l233l0472k4224m8685m9837R5517
12163C84761K4087L3k1281K366J328K6720k0719K9288k1858k4984M8323k2531
12151D05533p197j0728M0121K9081O1065P6676k3874p0764o5638m109j4539K1233
12139D36860j7386k7672r030O9524K5338L0008l4709o8473K7370L3355L2777j3762
$$ plain form
12127 484200 491917 499404 525284 499932 492324 478887 491210 497382 479872 497319 549939 545578
12115 545578 529557 549519 559741 603347 560601 549336 569159 600923 609473 644798 558838 564773
12103 564773 660636 687040 724614 729486 736484 703475 648580 630417 666705 685296 644608 693086
12091 693086 724467 722935 685465 663716 739775 698422 713578 747007 746137 708499 694365 723692
12079 723692 793428 804173 839172 888195 916401 973017 939928 962102 1038071 997939 955367
12068 955367 938703 941930 948386 934125 955717 975200 1029112 1027012 1023929 1016564 1009234 981402 1004267
12055 1004267 1038794 1087216 1144514 1119122 1114827 1091181 1048687 1054613 1118864 1185734 1237931 1241060
12043 1241060 1260325 1292378 1255924 1280240 1310685 1349006 1354481 1326365 1337069 1297586 1296206 1253519
$$ packed form
12127D84200P717P487K5880k5352p608j3437J2323O172j7510J7447N2620m361
12115E45578j6021J9962J0222M3606m2746j1265J9823L1764Q550L5325q5960N935
12103E64773R5863K6404L7574M872O998l3009n4895j8163L6288J8591m0688M8478
12091F93086L1381j532l7470k1749P6059m1353J5156L3429q70l7638j4134K9327
12079G23692O9736J0745L4999M9023K8206N6616l3089K2174P5969m0132m2572
12068I55367j6664L227O456j4261K1592J9483N3912k100l083p365p330k7832K2865
12055A004267L4527M8422N7298k5392m295k3646m2494N926O4251O6870N2197L129
12043A241060J9265L2053l6454K4316L0445L8321N475k8116J0704l9483j380m2687
$$ plain form
12031 1253519 1280242 1361894 1470109 1526206 1551662 1581067 1573346 1540426 1540061 1564946 1597470 1633162
12019 1633162 1689527 1690716 1699582 1715873 1729917 1780603 1781079 1769785 1792942 1869639 1868035 1850242
12007 1850242 1896166 1901176 1877353 1878743 1928743 2032793 2092083 2084117 2091976 2122958 2194512 2159810
11995 2159810 2190120 2300011 2297729 2365728 2420984 2384714 2385805 2443782 2506423 2569373 2599837
11984 2599837 2643519 2603672 2527267 2536863 2571262 2653256 2704281 2757775 2846077 2885162 2907622
11973 2907622 2901144 2966184 3108079 3122348 3142712 3213982 3239500 3288331 3288488 3317429 3403114 3481229
11961 3481229 3554379 3633991 3664730 3693432 3763729 3825748 3904893 3938560 3919339 3920868 3959314
11950 3959314 4025871 4049869 4018744 4026258 4039984 4093183 4170637 4307741 4378155 4366547 4354846
$$ packed form
12031A253519K6723Q1652J08215N6097K5456K9405p721l2920l65K4885L2524L5692
12019A633162N6365J189Q866J6291J4044N0686M76j1294K3157P6697j604j7793
12007A850242M5924N010k3823J390N0000J04050N9290p966P859L0982P1554l4702
11995B159810L0310J09891k282O7999N5256l6270J091N7977O2641O2950L0464
11984B599837M3682l9847p6405R596L4399Q1994N1025N3494Q8302L9085K2460
11973B907622o478O5040J41895J4269K0364P1270K5518M8831J57K8941Q5685P8115
11961C481229P3150P9612L0739K8702P0297O2019P9145L3667j9221J529L8446
11950C959314O6557K3998l1125P514J3726N3199P7454J37104P0414j1608j1701
$$ plain form
11939 4354846 4357724 4436932 4493106 4465797 4580120 4649460 4622630 4643165 4678824 4680835 4718063
11928 4718063 4751518 4778738 4753758 4750076 4747712 4715070 4717654 4680645 4689577 4747718 4803235 4841211
11916 4841211 4853703 4827725 4802902 4800267 4787820 4768123 4747612 4692885 4726571 4781613 4770654
11905 4770654 4761412 4780741 4720863 4658764 4588994 4552690 4511995 4454636 4489707 4475642 4394711
11894 4394711 4353623 4399870 4437196 4336601 4302292 4286821 4260488 4211830 4167645 4105192 4063041
11883 4063041 4039412 4045710 4061091 4073319 4003496 3888237 3813880 3819548 3794381 3702905 3622928
11872 3622928 3592883 3592332 3566785 3508466 3508003 3493794 3492317 3421554 3339788 3300579 3320613 3241630
11860 3241630 3165815 3167612 3209514 3166679 3129904 3093787 3080846 3058306 2975622 2941767 2913610
$$ packed form
11939D354846K878P9208N6174k7309J14323O9340k6830K0535L5659K011L7228
11928D718063L3455K7220k4980l682k364l2642K584l7009Q932N8141N5517L7976
11916D841211J2492k5978k4823k635j2447j9697k0511n4727L3686N5042j0959
11905D770654r242J9329n9878o2099o9770l6304m0695n7359L5071j4065q0931
11894D394711m1088M6247L7326j00595l4309j5471k6333m8658m4185o2453m2151
11883D063041k3629O298J5381J2228o9823j15259p4357N668k5167r1476p9977
11872C622928l0045n51k5547n8319m63j4209j477p0763q1766l9209K0034p8983
11860C241630p5815J797M1902m2835l6775l6117j2941k2540q2684l3855k8157
$$ plain form
11849 2913610 2914799 2868492 2860553 2833224 2778472 2711572 2622579 2558146 2497552 2434034 2411025 2475835
11837 2475835 2523634 2477406 2470747 2440600 2368808 2231225 2196828 2236349 2275052 2277323 2204368
11826 2204368 2182286 2183270 2095686 2077258 2139534 2059242 1951328 1887184 1850674 1878092 1902739
11815 1902739 1870169 1895142 1881107 1835481 1799571 1763557 1720076 1741577 1696146 1695177 1637695 1531996
11803 1531996 1557669 1605660 1575402 1475691 1464132 1472339 1494756 1523350 1558149 1551780 1538970 1562096
11791 1562096 1532919 1467558 1459571 1459757 1468451 1459893 1405724 1351142 1326389 1331060 1337688 1417154 1422335
11778 1422335 1343172 1280049 1285285 1248889 1175337 1152696 1190251 1222411 1237294 1201211 1148159
11767 1148159 1122989 1123917 1180647 1156294 1136103 1115639 1076597 1015618 974603 998835 969421 996671
$$ packed form
11849B913610J189m6307p939k7329n4752o6900q8993o4433o0594o3518k3009O4810
11837B475835M7799m6228o659l0147p1792j37583l4397L9521L8703K271p2955
11826B204368k2082R84q7584j8428O2276q0292j07914o4144l6510K7418K4647
11815A902739l2570K4973j4035m5626l5910l6014m3481K1501m5431r69n7482j05699
11803A531996K5673M7991l0258r9711j1559Q207K2417K8594L4799o369j2810K3126
11791A562096k9177o5361p987J86Q694q558n4169n4582k4753M671O628P9466N181
11778A422335p9163o3123N236l6396p3552k2641L7555L2160J4883l6083n3052
11767A148159k5170R28N6730k4353k0191k0464l9042o0979m1015K4232k9414K7250
$$ plain form
11755 996671 1010245 953973 959683 948573 933119 929478 894562 835396 776860 764968 830360 929097
11743 929097 995855 989710 906809 887031 848962 808744 772210 817293 825619 817072 852318 846275
11731 846275 747938 692287 676797 690986 745615 783798 770718 766192 777162 770862 756514 756875
11719 756875 725467 668842 718830 737434 699398 665480 660194 704286 688629 686794 702400 674709
11707 674709 650431 620125 609708 656957 648642 632705 571706 592832 590553 557153 540042 540689
11695 540689 563927 575910 539614 504041 527000 448640 416088 472537 514887 527662 546466
11684 546466 547972 527550 531058 554427 532188 562676 516805 484458 524708 550475 597237 629513
11672 629513 595674 545536 513202 511137 507109 437812 504681 569123 533115 571464 574916 623578
$$ packed form
11755I96671J3574n6272N710j1110j5454l641l4916n9166n8536j1892O5392R8737
11743I29097O6758o145q2901j9778l8069m0218l6534M5083Q326q547L5246o043
11731H46275r8337n5651j5490J4189N4629L8183j3080m526J0970o300j4348L61
11719G56875l1408n6625M9988J8604l8036l3918n286M4092j5657j835J5606k7691
11707F74709k4278l0306j0417M7249q315j5937o0999K1126k279l3400j7111O47
11695E40689K3238J1983l6296l5573K2959p8360l2552N6449M2350J2775J8804
11684E46466J506k0422L508K3369k2239L0488m5871l2347M0250K5767M6762L2276
11672F29513l3839n0138l2334k065m028o9297O6869O4442l6008L8349L452M8662
$$ plain form
11660 623578 692284 716999 766807 800706 780047 823739 864584 945616 1069180 1230849 1441954
11649 1441954 1738045 2106581 2577516 3085387 3543400 3979383 4268711 4508655 4470098 4056194
11639 4056194 3436299 2851829 2448323 2121461 1819941 1580361 1442010 1316373 1156786
11630 1156786 1106656 1047508 962476 936754 974642 910088 832660 785912 790695 806689 797401 783259
11618 783259 798099 734109 670851 640338 646374 604192 576091 531285 513419 521633 540518 540791
11606 540791 555793 548290 561530 498596 460817 494243 468704 424356 449941 536113 548429 559093
11594 559093 485926 454459 471572 491798 470715 412364 379573 384095 390499 417071 398792 311806
11582 311806 267184 283660 331191 362341 419207 466971 443929 422094 320689 323499 397203
$$ packed form
11660F23578O8706K4715M9808L3899k0659M3692M0845Q1032J23564J61669K11105
11649A441954K96091L68536M70935N07871M58013M35983K89328K39944l8557m13904
11639D056194o19895n84470m03506l26862l01520k39580j38351j25637j59587
11630A156786n0130n9148q5032k5722L7888o4554p7428m6748M783J5994r288j4142
11618G83259J4840o3990o3258l0513O036m2182k8101m4806j7866Q214J8885K73
11606E40791J5002p503J3240o2934l7779L3426k5539m4348K5585Q6172J2316J0664
11594E59093p3167l1467J7113K0226k1083n8351l2791M522O404K6572j8279q6986
11582C11806m4622J6476M7531L1150N6866M7764k3042k1835j01405K810P3704
$$ plain form
11571 397203 364224 307106 307066 314931 246659 236657 224838 204532 207654 315939 358089 339298
11559 339298 322340 259746 161848 148273 172080 175974 174923 148412 184951 170150 121085 177171
11547 177171 185805 248393 307060 253944 221310 211946 197119 166072 169254 229111 251948 206527
11535 206527 223978 220114 186511 179503 133915 109983 227904 250285 206099 213863 208209 231566
11523 231566 291767 284212 256041 280167 241071 179416 199066 281924 314705 272674 194115 179829
11511 179829 184163 228141 206660 173875 97321 133263 227704 198755 171211 170634 140248 119263
11499 119263 101726 134351 159750 234807 238938 212503 267702 294594 283482 245571 217454 168314
11487 168314 183421 206949 148645 101683 95555 82493 118179 192137 251702 266924 238869 162335
$$ packed form
11571C97203l2979n7118m0P865o8272j0002j1819k0306L122J08285M2150j8791
11559C39298j6958o2594r7898j3575K3807L894j051k6511L6539j4801m9065N6086
11547A77171Q634O2588N8667n3116l2634r364j4827l1047L182N9857K2837m5421
11535B06527J7451l864l3603p008m5588k3932J17921K2381m4186P764n654K3357
11523B31566O0201p555k8171K4126l9096o1655J9650Q2858L2781m2031p8559j4286
11511A79829M334M3978k1481l2785p6554L5942R4441k8949k7544n77l0386k0985
11499A19263j7537L2625K5399P5057M131k6435N5199K6892j1112l7911k8117m9140
11487A68314J5107K3528n8304m6962o128j3062L5686P3958N9565J5222k8055p6534
$$ plain form
11475 162335 167975 149541 133143 152436 167175 179815 163177 243594 243660 181513 140314 76538
11463 76538 80733 99110 140157 163744 172618 134962 142896 139251 116073 160135 157736 122666 185491
11450 185491 147954 119444 131561 123715 136708 211287 244061 218304 213454 187153 140498 141751
11438 141751 141747 130623 92414 90711 95794 47893 -11951 7564 14482 16354 50244 64371 57278
11425 57278 29105 117799 114750 93849 45850 102454 135351 87516 135692 182444 142186 126233
11413 126233 118956 132933 195980 217719 192433 156838 132501 104950 81288 99090 103296 147437
11401 147437 85411 54241 48611 79554 50190 51441 85813 44185 -4050 -4887 -4555 51021 107753
11388 107753 77505 55348 44323 61802 40231 10414 56143 81923 76426 26420 -10253 -1356
$$ packed form
11475A62335N640j8434j6398J9293J4739J2640j6638Q0417O6o2147m1199o3776
11463G6538M195J8377M1047K3587Q874l7656P934l645k3178M4062k399l5070O2825
11450A85491l7537k8510J2117p846J2993P4579L2774k5757m850k6301m6655J253
11438A41751mj1124l8209j703N083m7901n9844J9515O918J872L3890J4127p093
11425E7278k8173Q8694l049k0901m7999N6604L2897m7835M8176M6752m0258j5953
11413A26233p277J3977O3047K1739k5286l5595k4337k7551k3662J7802M206M4141
11401A47437o2026l1170n630L0943k9364J251L4372m1628m8235q37L32N5576N6732
11388A07753l0248k2157j1025J7479k1571k9817M5729K5780n497n0006l6673Q897
$$ plain form
11376 -1356 43034 70011 98432 86198 12681 -3186 247 2463 12732 78812 75456 48784
11364 48784 24340 3310 60193 56448 -10587 -25807 12561 30762 47243 18277 -48557 13940
11352 13940 57384 49135 64230 67842 53940 126162 159991 80651 67684 22684 7043 -2303
11340 -2303 7544 -29617 -47326 19634 15336 -13387 -232 -4576 40763 79896 25124 -38109
11328 -38109 -29966 -22549 -16472 6688 -5683 -37793 -21806 -28377 -54841 -1078 136803 167122
11316 167122 133761 54647 37306 69815 55857 58773 44067 -3634 -4618 55739 31874 2244
11304 2244 14908 63982 100997 108567 32908 -29251 -27863 44052 53772 36732 397 -7302 9462
11291 9462 1321 30777 55534 26626 34123 59506 37749 43279 18579 -43600 -14097 47205
$$ packed form
11376a356M4390K6977K8421j2234p3517j5867L433K216J0269O6080l356k6672
11364D8784k4444k1030N6883l745o7035j5220L8368J8201J6481k8966o6834O2497
11352A3940M3444q249J5095L612j3902P2222L3829p9340j2967m5000j5641r346
11340b303R847l7161j7709O6960m298k8723J3155m344M5339L9133n4772o3233
11328c8109Q143P417O077K3160j2371l2110J5987o571k6464N3763J37881L0319
11316A67122l3361p9114j7341L2509j3958K916j4706m7701r84O0357k3865k9630
11304B244J2664M9074L7015P570p5659o2159J388P1915R720j7040l6335p699J6764
11291I462q141K9456K4757k8908P497K5383k1757N530k4700o2179K9503O1302
$$ plain form
11279 47205 13732 -1096 28002 36422 34885 30550 -12108 36746 80152 17642 36518 91263
11267 91263 -25496 -19728 36030 31998 -4277 -38787 -6934 32748 480 18094 13859 5012
11255 5012 -12349 -9020 -24613 -14942 -34108 -46313 15398 78785 77984 38365 -72865 -75082 -28664
11242 -28664 -28595 4437 11827 -31578 -15657 38559 15795 7525 -4746 -30694 -33209 -34767 -65562
11229 -65562 -102265 -69724 -36031 16946 -32346 -97558 -33728 28113 8887 70657 67338 12248
11217 12248 3216 11335 24334 29126 43573 15505 -247 10975 40713 14655 -36143 -25508
11205 -25508 -41903 9712 28434 12298 -64168 -78101 -32106 -29577 -20909 -25639 -4516 36546
11193 36546 89102 86757 61728 23492 4271 16889 15715 -8470 -64835 -23592 50923 72382
$$ packed form
11279D7205l3473j4828K9098Q420j537m335m2658M8854M3406o2510J8876N4745
11267I1263j16759N768N5758m032l6275l4510L1853L9682l2268J7614m235q847
11255E012j7361L329j5593R671j9166j2205O1711O3387q01l9619j11230k217M6418
11242b8664O9L3032P390m3405J5921N4216k2764q270j2271k5948k515j558l0795
11229f5562l6703L2541L3693N2977m9292o5212O3830O1841j9226O1770l319n5090
11217A2248r032Q119J2999M792J4447k8068j5752J1222K9738k6058n0798J0635
11205b5508j6395N1615J8722j6136p6466j3933M5995K529Q668m730K1123M1062
11193C6546N2556k345k5029l8236j9221J2618j174k4185n6365M1243P4515K1459
$$ plain form
11181 72382 23470 13660 56104 61764 6193 -51671 -31065 -24669 -52406 -25052 35026 37836
11169 37836 70667 82663 25708 -14521 -81491 -69460 -55035 -89763 -39306 21734 26496 55230
11157 55230 52298 62353 60575 -27703 -16210 19175 48221 45995 29391 22784 32243 29835 4843
11144 4843 7081 65102 30113 -43105 -80605 -85515 -84849 -48055 -33947 1080 73449 90952 90257
11131 90257 150035 60453 56299 90311 72709 68235 720 -17627 1022 20513 51041 36018
11119 36018 -31365 -27673 -18992 37866 49506 89 -15890 -93018 -160815 -114615 -70831 -37397
11107 -37397 -9750 50206 71943 48075 21807 39550 53422 54730 25790 19364 99475 89163
11095 89163 13662 -29257 -4290 46634 64906 83335 104585 66181 78938 124756 87904 72129
$$ packed form
11181G2382m8912r810M2444N660n5571n7864K0606O396k7737K7354O0078K810
11169C7836L2831J1996n6955m0229o6970J2031J4425l4728N0457O1040M762K8734
11157E5230k932J0055j778q8278J1493L5385K9046k226j6604o607R459k408k4992
11144D843K238N8021l4989p3218l7500m910O66L6794J4108L5027P2369J7503o95
11131I0257N9778q9582m154L4012j7602m474o7515j8347J8649J9491L0528j5023
11119C6018o7383L692Q681N6858J1640m9417j5979p7128o7797M6200M3784L3434
11107c7397K7647N9956K1737k3868k6268J7743J3872J308k8940o426Q0111j0312
11095H9163p5501m2919K4967N0924J8272J8429K1250l8404J2757M5818l6852j5775
$$ plain form
11083 72129 55365 -5722 4520 21030 5208 3729 54258 71627 97680 84770 -12190 -54856
11071 -54856 15343 -3511 -16123 -13059 -50441 -56223 -29397 -27566 -11682 -20027 65147 69412 66420
11058 66420 94740 89422 62755 90205 146047 109612 55894 97695 104339 124339 103573 95263
11046 95263 143876 102993 85293 127547 138212 123493 152252 143915 199056 286820 269848 277072
11034 277072 267959 253947 207498 203395 231903 233030 223683 223773 242798 217568 203729 239832 323485
11021 323485 390006 424817 423338 350458 315222 358129 329113 331467 330419 349858 404587 376292
11009 376292 376468 319544 307201 320090 277808 254627 222516 206688 241880 274727 286941 246589
10997 246589 181103 149925 145061 130009 159494 203700 157182 74523 89655 77192 50341 30066
$$ packed form
11083G2129j6764o1087J0242J6510j5822j479N0529J7369K6053j2910r6960m2666
11071e4856P0199j8854j2612L064l7382n782K6826J831J5884q345Q5174M265k992
11058F6420K8320n318k6667K7450N5842l6435n3718M1801O644K0000k0766q310
11046I5263M8613m0883j7700M2254J0665j4719K8759q337N5141Q7764j6972P224
11034B77072r113j4012m6449m103K8508J127r347R0J9025k5230j3839L6103Q3653
11021C23485O6521L4811j479p2880l5236M2907k9016K354j048J9439N4729k8295
11009C76292J76n6924j2343J2889m2282k3181l2111j5828L5192L2847J2214m0352
10997B46589o5486l1178m864j5052K9485M4206m6518q2659J5132j2463k6851k0275
$$ plain form
10985 30066 1288 -19435 -15475 -38905 -54012 -82427 -10969 21246 53352 85880 35491 -45061
10973 -45061 -101680 -100036 -47624 24066 97221 126618 50857 -30218 -62800 -24564 -5205 -9704
10961 -9704 18491 -11296 7656 77263 31179 -26976 -15256 -26880 -11143 -11566 -34775 1318
10949 1318 102957 101891 38029 -37090 -62344 -86090 -99027 -87080 -49344 -41014 -4730 12646
10937 12646 9139 19357 16737 15721 2793 -39265 -66451 -24232 -38860 -102278 -26595 15163
10925 15163 14320 32707 12913 -18489 -13982 -49816 -11548 31166 8435 -44035 -32506 -47426
10913 -47426 -44682 -63393 -107564 -112889 -76911 -33204 -40794 -2772 -4705 -53874 -48046 -17647 -27244
10900 -27244 -5287 14240 22853 -1325 -60380 -61953 -53966 -42401 -69174 -69172 -60285 -123277 -119009
$$ packed form
10985C0066k8778k0723L960k3430j5107k8415P1458L2215L2106L2528n0389q0552
10973d5061n6619J644N2412P1690P3155K9397p5761q1075l2582L8236J9359m499
10961i704K8195k9787J8952O9607m6084n8155J1720j1624J5737m23k3209L6093
10949A318J01639j066o3862p5119k5254k3746j2937J1947L7736Q330L6284J7376
10937A2646l507J0218k620j016j2928m2058k7186M2219j4628o3418P5683M1758
10925A5163q43J8387j9794l1402M507l5834L8268M2714k2731n2470J1529j4920
10913d7426K744j8711m4171n325L5978M3707p590L8022j933m9169N828L0399r597
10900b7244K1957J9527Q613k4178n9055j573P987J1565k6773KQ887o2992M268
$$ plain form
10887 -119009 -99966 -118936 -119838 -116003 -118984 -66329 -29204 15212 54819 45940 -22085 -92286
10875 -92286 -53834 -34157 29652 25067 -11147 16067 107210 94223 33202 23817 82713 50584
10863 50584 10074 38629 19933 1800 -40113 -78706 -59812 26724 89680 68630 75125 66992
10851 66992 62600 50474 20404 22224 -4328 14631 50045 11667 -46199 -60562 -39758 -19121
10839 -19121 -69821 -17279 38737 39884 55421 81759 97505 114176 99330 22562 27427 15374
10827 15374 -7402 15487 4100 33232 43424 -3453 1985 15179 17232 63119 17634 -68263
10815 -68263 -86314 -3874 26911 31871 85794 141750 146163 104982 4755 11209 41423 64871
10803 64871 59491 27213 9503 20802 25945 25691 -28066 -36322 -56808 -31899 32810 22906 -23137
$$ packed form
10887a19009J9043j8970r02L835k981N2655L7125M4416L9607q879o8025p0201
10875i2286L8452J9677O3809m585l6214K7214R1143j2987o1021r385N8896l2129
10863E0584m0510K8555j8696j8133m1913l8593J8894Q6536O2956k1050O495q133
10851F6992m392j2126l0070J820k6552J8959L5414l8378n7866j4363K0804K0637
10839a9121n0700N2542N6016J147J5537K6338J5746J6671j4846p6768M865j2053
10827A5374k2776K2889j1387K9132J0192m6877N438J3194K053M5887m5485q5897
10815f8263j8051Q2440L0785M960N3923N5956M413m1181j00227O454L0214K3448
10803F4871n380l2278j7710J1299N143k54n3757q256k0486K4909O4709r904m6043
$$ plain form
10790 -23137 -71233 -83727 -29650 -79313 -137732 -92437 -57377 -58183 -77592 -78810 -28126 -36213
10778 -36213 -30881 -12997 9271 3628 -2363 -72514 -141802 -183042 -112493 -74761 -84070 -112565
10766 -112565 -120898 -132807 -123420 -53736 -52685 -69539 -115702 -169725 -170602 -134531 -185439 -140367
10754 -140367 -95833 -132638 -118130 -80834 662 21612 7707 -41145 -46215 -55131 -35414 -17127
10742 -17127 -30465 -54394 -14110 40722 96841 153256 201745 233389 232540 259330 227890 204467
10730 204467 261386 282439 270267 312930 355884 343368 368645 413683 419863 436936 481587 502145
10718 502145 412381 427235 518529 574074 575746 579241 516225 492324 482261 502611 543116 527895
10706 527895 492064 500985 537105 507466 525074 500495 518244 521271 555363 556441 575780 573978
$$ packed form
10790b3137m8096j2494N4077m9663n8419M5295L5060q06j9409j218N0684q087
10778c6213N332J7884K2268n643n991p0151o9288m1240P0549L7732r309k8495
10766a12565q333j1909R387O9684J051j6854m6163n4023q77L6071n0908M5072
10754a40367M4534l6805J4508L7296Q1496K0950j3905m8852n070q916J9717J8287
10742a7127j3338k3929M0284N4832N6119N6415M8489L1644q49K6790l1440k3423
10730B04467N6919K1053j2172M2663M2954j2516K5277M5038O180J7073M4651K0558
10718E02145q9764J4854R1294N5545J672L495o3016k3901j0063K0350M0505j5221
10706E27895l5831Q921L6120k9639J7608k4579J7749L027L4092J078J9339j802
$$ plain form
10694 573978 549408 514659 467434 449182 455089 468755 416925 384979 425918 441322 410302 431107
10682 431107 419696 459031 508427 537966 504527 413575 380250 344479 352970 309727 324101 364798
10670 364798 418311 407994 406818 404153 413363 407325 366418 366979 426143 485008 482397 481799 481717 495482
10656 495482 498461 520150 578110 615159 666172 742245 745900 725149 758793 824560 871905 872621
10644 872621 787524 732973 768844 797348 790014 821640 916461 1006296 1113979 1204528 1309088
10633 1309088 1452454 1625049 1802664 1932433 2160015 2415069 2613308 2760690 3037784
10624 3037784 3463161 4070966 4906729 5984036 7463688 9388295 11777837 14456027 17225244
10615 17225244 19919326 22382569 24339238 25421529 25576454 25372151 25625735 26842234
$$ packed form
10694E73978k4570l4749m7225j8252N907J3666n1830l1946M0939J5404l1020K0805
10682D31107j1411L9335M9396K9539l3439r0952l3325l5771Q491m3243J4374M0697
10670C64798N3513j0317j176k665R210o038m0907N61N9164N8865k611n98q2J3765
10656D95482K979K1689N7960L7049N1013P6073L655k0751L3644O5767M7345P16
10644H72621q5097n4551L5871K8504p334L1626R4821Q9835J07683R0549J04560
10633A309088J43366J72595J77615J29769K27582K55054J98239J47382K77094
10624C037784M25377O07805Q35763J077307J479652J924607K389542K678190K769217
10615A7225244K694082K463243J956669J082291J54925k04303K53584J216499
$$ plain form
10607 26842234 29333025 33081800 37780626 42710603 47378772 51529932 54420299 54873039
10599 54873039 52878353 49966060 47970241 47989738 50309885 54598875 60233254 66016493
10591 66016493 71151341 75276766 77117920 75087702 69476103 62650868 56975434 53489986
10583 53489986 52482015 53343542 55307581 57540009 59400721 60524461 60014717 56905247
10575 56905247 51582079 45704452 40833298 37451761 35607623 34811916 34653074 34646940 34551346
10566 34551346 33995012 32603544 30284102 27185581 23937470 20989127 18635147 16780864
10558 16780864 15329550 14218368 13367449 12703337 12097145 11487941 10977315 10504171 10107554
10549 10107554 9730527 9350611 9022625 8772490 8480904 8205630 7989581 7727733 7516518
$$ packed form
10607B6842234K490791L748775M698826M929977M668169M151160K890367M52740
10599E4873039j994686k912293j995819J9497K320147M288990N634379N783239
10591F6016493N134848M125425J841154k030218n611599o825235n675434l485448
10583E3489986j007971Q61527J964039K232428J860712J123740n09744l109470
10575E6905247n323168n877627m871154l381537j844138p95707j58842o134r5594
10566C4551346n56334j391468k319442l098521l248111k948343k353980j854283
10558A6780864j451314j111182q50919o64112o06192o09204n10626m73144l96617
10549A0107554l77027l79916l27986k50135k91586k75274k16049k61848k11215
$$ plain form
10540 7516518 7333398 7129496 6940026 6809703 6645366 6392017 6209786 6098613 6005655 5829041
10530 5829041 5649135 5521156 5417219 5292372 5233975 5111615 4974645 4889674 4777693 4629050
10520 4629050 4527565 4426505 4389246 4342728 4254418 4167206 4045607 3983236 3909478 3878417 3755647
10509 3755647 3641832 3537341 3467066 3399373 3389332 3346246 3211090 3114257 3136188 3166139 3100958
10498 3100958 2978950 2945332 2952660 2948379 2881239 2867252 2852472 2822714 2769701 2637951 2570189
10487 2570189 2561476 2579186 2499757 2457665 2504305 2431274 2330990 2363753 2396307 2374847 2362699
10476 2362699 2301481 2300378 2265429 2246930 2201067 2169138 2117597 2061639 2036584 2051344 2020069
10465 2020069 2030359 2095752 2113652 2090157 2060891 2108106 2089922 2099862 2024050 2003098 1947565
$$ packed form
10540G516518j83120k03902j89470j30323j64337k53349j82231j11173r2958j76614
10530E829041j79906j27979j03937j24847n8397j22360j36970q4971j11981j48643
10520D629050j01485j01060l7259m6518q8310q7212j21599o2371p3758l1061j22770
10509C755647j13815j04491p0275o7693j0041m3086j35156r6833K1931K9951o5181
10498C100958j22008l3618P328m281o7140j3987j4780k9758n3013j31750o7762
10487B570189q713J7710p9429m2092M6640p3031j00284L2763L2554k1460j2148
10476B362699o1218j103l4949j8499m5863l1929n1541n5958k5055J4760l1275
10465B020069J0290O5393J7900k3495k9266M7215j8184R940p5812k0952n5533
$$ plain form
10454 1947565 1814410 1715198 1769122 1764479 1770763 1830966 1838224 1757636 1766342 1816983 1862004 1905051
10442 1905051 2086241 2252305 2433006 2605419 2755908 2885614 2968654 2883300 2581165 2269251
10432 2269251 2045279 1897435 1754773 1665559 1587666 1498863 1434849 1432351 1401311 1334957 1337904
10421 1337904 1399617 1380173 1280063 1182746 1155221 1172550 1136897 1112752 1089732 1005307 964011
10410 964011 963116 1047750 1079709 1002360 910267 935232 984964 938284 964776 1009273 960107 853551
10398 853551 804427 847764 877176 880955 848631 765643 715883 683426 738454 719219 714953 715007
10386 715007 707063 704942 663742 623134 573478 545132 584864 630855 683799 691382 701324 677455
10374 677455 641031 615427 541716 475020 504679 517688 543054 535892 437411 296216 297147 362665
$$ packed form
10454A947565j33155r9212N3924m643O284O0203P258q0588Q706N0641M5021M3047
10442A905051J81190J66064J80701J72413J50489J29706Q3040q5354l02135l11914
10432B269251k23972j47844j42662q9214p7893q8803o4014k498l1040o6354K947
10421A337904O1713j9444j00110r7317k7525J7329l5653k4145k3020q4425m1296
10410I64011q95Q4634L1959p7349r2093K4965M9732m6680K6492M4497m9166j06556
10398H53551m9124M3337K9412L779l2324q2988m9760l2457N5028j9235m266N4
10386G15007p944k121m1200m0608m9656k8346L9732M5991N2944P583R942k3869
10374F77455l6424k5604p3711o6696K9659J3009K5366p162r8481j41195R31O5518
$$ plain form
10362 362665 412935 493089 544103 484327 428404 424572 412904 390009 369132 381875 391850 331560
10350 331560 304434 317679 268499 262706 306573 287916 283173 319520 310675 344415 304733 245702
10338 245702 287701 365070 373598 346313 311045 305562 353706 319765 318555 310985 265643 285717
10326 285717 288405 293834 286752 277542 306192 354716 344286 244496 260743 251845 207472 191910
10314 191910 276667 309121 279085 270789 270399 296534 320975 287735 268095 268682 199695 161170
10302 161170 109865 68347 26027 72157 58730 61334 101143 137845 160820 175549 184297 236849
10290 236849 294042 352428 304340 234711 247233 204655 191464 152634 240748 319142 329180
10279 329180 224529 219323 228827 228721 202683 192957 165114 236069 220757 226886 232705 262645 306172
$$ packed form
10362C62665N0270Q0154N1014n9776n5923l832j1668k2895k0877J2743R975o0290
10350C31560k7126J3245m9180n793M3867j8657m743L6347q845L3740l9682n9031
10338B45702M1999P7369Q528k7285l5268n483M8144l3941j210p570m5342K0074
10326B85717K688N429p082r210K8650M8524j0430r9790J6247q898m4373j5562
10314A91910Q4757L2454l0036q296l90K6135K4441l3240j9640N87o8987l8525
10302A61170n1305m1518m2320M6130j3427K604L9809L6702K2975J4729Q748N2552
10290B36849N7193N8386m8088o9629J2522m2578j3191l8830Q8114P8394J0038
10279C29180j04651n206R504j06k6038r726k7843P0955j5312O129N819K9940M3527
$$ plain form
10266 306172 365015 357414 304584 291651 280286 221830 153110 186438 192636 131265 161100 190009
10254 190009 137440 141921 138641 162859 146547 145371 107976 61482 76591 82583 93172 83168
10242 83168 77834 154350 197282 147691 111180 148473 159381 121099 83140 77329 61671 100947
10230 100947 56807 -6589 -9376 -31917 -41843 -27091 11429 65653 85941 100492 127695 70424
10218 70424 45283 120418 123841 70896 24221 46189 12447 10726 16613 87933 134794 129466
10206 129466 88134 58271 59028 35429 24690 8745 64354 131093 126133 85770 -19879 -141283
10194 -141283 -206102 -182174 -134199 -109566 -83581 -82023 -55523 34974 132282 155031 282200
10183 282200 319392 303925 349594 326243 321305 330367 314441 350467 374191 409330 417905 436296
$$ packed form
10266C06172N8843p601n2830j2933j1365n8456o8720L3328O198o1371K9835K8909
10254A90009n2569M481l280K4218j6312j176l7395m6494J5109N992J0589j0004
10242H3168n334P6516M2932m9591l6511L7293J0908l8282l7959n811j5658L9276
10230A00947m4140o3396k787k2541r926J4752L8520N4224K0288J4551K7203n7271
10218G0424k5141P5135L423n2945m6675K1968l3742j721N887P1320M6861n328
10206A29466m1332k9863P57k3599j0739j5945N5609O6739m960m0363j05649j21404
10194a41283o4819K3928M7975K4633K5985J558K6500R0497R7308K2749J27169
10183B82200L7192j5467M5669k3351m938R062j5926L6026K3724L5139Q575J8391
$$ plain form
10171 436296 462921 485557 604275 678630 739608 841569 1018740 1203526 1274738 1337773 1399197
10160 1399197 1522816 1646907 1619218 1578018 1450693 1353727 1352899 1424278 1476430 1415854 1379314
10149 1379314 1305900 1283637 1175220 1187769 1253273 1272279 1205012 1158223 1112050 1007787 950309
10138 950309 908081 921989 1000469 1024470 995946 934923 883760 850878 830398 858673 884546
10127 884546 861207 897078 877242 830251 799469 775656 811571 829597 793342 725363 759676
10116 759676 759813 727929 726676 705753 677371 667759 728243 782290 830077 864370 875114 827183
10104 827183 854049 849986 808523 824624 846005 857730 858894 875969 887525 912953 887680 884065
10092 884065 975957 1002153 1034491 1045633 1039028 1052049 1126754 1186177 1133764 1072483 1063592 1055045
$$ packed form
10171D36296K6625K2636J18718P4355O0978J01961J77171J84786P1212O3035O1424
10160A399197J23619J24091k7689m1200j27325r6966q28P1379N2152o0576l6540
10149A379314p3414k2263j08417J2549O5504J9006o7267m6789m6173j04263n7478
10138I50309m2228J3908P8480K4001k8524o1023n1163l2882k0480K8275K5873
10127H84546k3339L5871j9836m6991l0782k3813L5915J8026l6255o7979L4313
10116G59676J37l1884j253k0923k8382r612O0484N4047M7787L4293J0744m7931
10104H27183K6866m063m1463J6101K1381J1725J164J7075J1556K5428k5273l615
10092H84065R1892K6196L2338J1142o605J3021P4705N9423n2413o1281q891q547
$$ plain form
10080 1055045 1143797 1284786 1380912 1401275 1469075 1587538 1710791 1840641 1939579 2093136
10070 2093136 2202417 2332224 2466115 2630405 2850564 3177805 3693086 4315732 4844561
10061 4844561 5308294 5852039 6373345 6598752 6608167 6704118 7062157 7520582 8140486 8899221
10051 8899221 9684386 10516029 11428106 12713348 14404918 16582660 19504235 23354263 28570896
10042 28570896 35851297 46228641 61487910 84252901 117326196 159837202 202761309
10035 202761309 237433252 267145260 295658532 302683826 265545953 206162603 153994702
10028 153994702 116875842 92118454 75508864 63945653 55567349 49339941 44543534
10021 44543534 40789006 37834971 35407689 33350990 31534183 29989913 28706666 27507755
$$ packed form
10080A055045Q8752J40989R6126K0363O7800J18463J23253J29850R8938J53557
10070B093136J09281J29807J33891J64290K20159L27241N15281O22646N28829
10061D844561M63733N43745N21306K25407R415R5951L58039M58425O19904P58735
10051H899221P85165Q31643R12077J285242J691570K177742K921575L850028N216633
10042B8570896P280401J0377344J5259269K2764991L3073295M2511006M2924107
10035B02761309L4671943K9712008K8513272P025294l7137873n9383350n2167901
10028A53994702l7118860k4757388j6609590j1563211q378304o227408m796407
10021D4543534l754528k954035k427282k056699j816807j544270j283247j198911
$$ plain form
10013 27507755 26316415 25189787 24071753 22816016 21611426 20572241 19692148 18917521
10005 18917521 18288672 17712045 17041571 16419142 15847866 15382644 14861454 14348721 13885460
9996 13885460 13451381 13046651 12573124 12162692 11851208 11645824 11400846 11153780 10920394
9987 10920394 10734840 10532151 10314598 10067939 9721906 9468012 9224496 8966851 8716117
9978 8716117 8465263 8253684 8026221 7802293 7756422 7675772 7465623 7307011 7088510 6864146
9968 6864146 6673003 6493455 6364930 6234438 6170920 6044783 5839207 5569557 5410591 5344304
9958 5344304 5322286 5281425 5236902 5167465 5122350 5028301 4885911 4742540 4640089 4560826 4498466
9947 4498466 4426951 4416961 4343628 4234425 4131223 4012655 3986425 3949498 3872522 3807887 3715164
$$ packed form
10013B7507755j191340j126628j118034j255737j204590j039185q80093p74627
10005A8917521o28849n76627o70474o22429n71276m65222n21190n12733m63261
9996A3885460m34079m04730m73527m10432l11484k05384k44978k47066k33386
9987A0920394j85554k02689k17553k46659l46033k53894k43516k57645k50734
9978H716117k50854k11579k27463k23928m5871q0650k10149j58612k18501k24364
9968F864146j91143j79548j28525j30492o3518j26137k05576k69650j58966o6287
9958E344304k2018m0861m4523o9437m5115r4049j42390j43371j02451p9263o2360
9947D498466p1515r990p3333j09203j03202j18568k6230l6927p6976o4635r2723
$$ plain form
9936 3715164 3568727 3534419 3530255 3465533 3418802 3351828 3301356 3241365 3199258 3166105 3070913
9925 3070913 3072127 3081436 3074434 3074027 3078243 3209405 3372990 3458506 3429995 3367181 3321264 3357704
9913 3357704 3404133 3397972 3354012 3227473 3110761 3034640 2926183 2916802 2961191 2991440 3071142
9902 3071142 3050351 2857962 2645952 2513317 2460565 2466684 2432592 2309721 2229606 2203433 2221022
9891 2221022 2193936 2095749 1958668 1903305 1886243 1897715 1823165 1764155 1763162 1747949 1798530 1861660
9879 1861660 1884107 1915042 1924931 1948438 2006820 1973830 1856427 1751996 1683292 1657646 1610232
9868 1610232 1618775 1587435 1564171 1562152 1554338 1550101 1504947 1390104 1315019 1260060 1249765 1286623
9856 1286623 1231929 1168208 1199891 1172185 1181362 1228835 1244545 1243784 1222250 1175875 1141813 1127285
$$ packed form
9936C715164j46437l4308m164o4722m6731o6974n0472n9991m2107l3153r5192
9925C070913J214R309p002m07M216J31162J63585Q5516k8511o2814m5917L6440
9913C357704M6429o161m3960j26539j16712p6121j08457r381M4389L0249P9702
9902C071142k0791j92389k12010j32635n2752O119l4092j22871q0115k6173J7589
9891B221022k7086r8187j37081n5363j7062J1472p4550n9010r93j5213N0581O3130
9879A861660K2447L0935R889K3507N8382l2990j17403j04431o8704k5646m7414
9868A610232Q543l1340k3264k019p814m237m5154j14843p5085n4959j0295L6858
9856A286623n4694o3721L1683k7706R177M7473J5710p61k1534m6375l4062j4528
$$ plain form
9844 1127285 1148741 1176691 1118529 1103157 1147589 1182775 1138057 1083068 1061225 1075558 1022240
9833 1022240 941301 892313 907976 916543 869064 851378 798214 813537 844631 895789 927178 902693
9821 902693 904245 900441 829153 759862 766242 762490 693541 688954 727164 699522 687908 696466 684365
9808 684365 638656 606087 645687 689648 685982 734351 789236 762604 772762 726259 628558 578386
9796 578386 532825 513849 577645 593731 567268 526416 523358 546062 437795 341976 353258 392587
9784 392587 419780 468240 497207 493457 446251 421212 438361 454928 497304 523796 478905 479758
9772 479758 466079 464045 417636 378504 421959 468175 512368 500066 467982 457697 426982 385564
9760 385564 397482 423099 363124 294419 315677 356923 320078 283739 284755 263053 199452 211600
$$ packed form
9844A127285K1456K7950n8162j5372M4432L5186m4718n4989k1843J4333n3318
9833A022240q0939m8988J5663Q567m7479j7686n3164J5323L1094N1158L1389k4485
9821I02693J552l804p1288o9291O380l752o8949m587L8210k7642j1614Q558j2101
9808F84365m5709l2569L9600M3961l666M8369N4885k6632J0158m6503r7701n0172
9796E78386m5561j8976O3796J6086k6463m0852l058K2704j08267r5819J1282L9329
9784C92587K7193M8460K8967l750m7206k5039J7149J6567M2376K6492m4891Q53
9772D79758j3679k034m6409l9132M3455M6216M4193j2302l2084j0285l0715m1418
9760C85564J1918K5617n9975o8705K1258M1246l6845l6339J016k1702o3601J2148
$$ plain form
9748 211600 228868 219533 224100 255601 283124 320565 294989 227054 232003 263899 284527 234171
9736 234171 250954 321412 301384 246211 246746 282242 376416 384481 371402 331676 290005 287073
9724 287073 298031 286226 311616 338681 339573 329825 298408 251305 225524 236762 234251 231594 268479
9711 268479 286560 275850 252917 204819 104648 95351 118862 148410 177949 241186 244471 192498
9699 192498 161030 179200 158881 198398 197701 158142 133997 185681 229357 232644 196602 174179
9687 174179 129133 114628 141416 148208 192489 247488 257608 235881 203720 172385 147513 100933
9675 100933 136924 156457 192044 184827 195862 222054 292063 283221 250857 185843 179301 133940
9663 133940 130291 139427 155766 124794 180345 262016 354177 389214 442906 565550 730647 867671
$$ packed form
9748B11600J7268r335M567L1501K7523L7441k5576o7935M949L1896K0628n0356
9736B34171J6783P0458k0028n5173N35L5496R4174Q065j3079l9726m1671k932
9724B87073J0958j1805K5390K7065Q92r748l1417m7103k5781J1238k511k657L6885
9711B68479J8081j0710k2933m8098j00171r297K3511K9548K9539O3237L285n1973
9699A92498l1468J8170k0319L9517o97l9559k4145N1684M3676L287l6042k2423
9687A74179m5046j4505K6788O792M4281N4999J0120k1727l2161l1335k4872m6580
9675A00933L5991J9533L5587p217J1035K6192P0009q842l2364o5014o542m5361
9663A33940l649R136J6339l0972N5551Q1671R2161L5037N3692J22644J65097J37024
$$ plain form
9651 867671 862534 954304 1026657 837677 614246 476273 377901 276383 257914 266811 286173
9640 286173 253515 205711 215947 253021 265541 268680 320138 363969 408603 457526 529210 761125
9628 761125 1001712 1163287 1372559 1534542 1655322 1690912 1584676 1312067 1044836 804513
9618 804513 685465 579175 444316 387357 396096 385875 358387 336429 333045 380036 389986 288353
9606 288353 254521 202424 169792 202560 167418 125034 130151 145769 118372 70156 56120 50260
9594 50260 47106 45067 53591 114428 187727 177075 159962 133188 121460 118696 60048 36674 43321
9581 43321 -2586 20160 49096 15906 16013 78865 93887 67870 134881 131105 114060 140590
9569 140590 181290 199030 181618 156950 147860 151473 141100 185357 162348 169435 124264 146044
$$ packed form
9651H67671n137R1770P2353j88980k23431j37973r8372j01518j8469Q897J9362
9640B86173l2658m7804J0236L7074J2520L139N1458M3831M4634M8923P1684K31915
9628G61125K40587J61575K09272J61983J20780L5590j06236k72609k67231k40323
9618H04513j19048j06290j34859n6959Q739j0221k7488k1958l384M6991R950j01633
9606B88353l3832n2097l2632L2768l5142m2384N117J5618k7397m8216j4036n860
9594E0260l154k039Q524O0837P3299j0652j7113k6774j1728k764n8648k3374O647
9581D3321m5907K2746K8936l3190J07O2852J5022k6017O7011l776j7045K6530
9569A40590M0700J7740j7412k4668r090L613j0373M4257k3009P087m5171K1780
$$ plain form
9557 146044 175817 215931 188594 182871 163630 126740 125076 156219 177659 185990 182986 224259
9545 224259 319812 357329 312624 315347 247189 207059 158203 100700 138327 116604 60739 74376
9533 74376 82506 93998 148460 164456 166226 139720 59718 8925 -5219 -14174 15279 43368
9521 43368 34991 -2690 24591 66428 105210 131233 111008 75112 93944 105992 59313 61253
9509 61253 95664 129220 151398 143946 80481 39223 23471 22990 14916 2448 -40975 29531 53597
9496 53597 -2680 -38790 -63230 -7776 28865 52907 30744 49241 108630 122101 87715 95628
9484 95628 101837 76846 84201 100504 93692 84084 84995 122137 82280 63557 69328 93118 112327
9471 112327 102674 62551 21996 64771 91677 125664 167993 211565 148855 43123 54770 145667
$$ packed form
9557A46044K9773M0114k7337n723j9241l6890j664L1143K1440Q331l004M1273
9545B24259R5553L7517m4705K723o8158m0130m8856n7503L7627k1723n5865J3637
9533G4376Q130J1492N4462J5996J770k6506q0002n0793j4144q955K9453K8089
9521D3368q377l7681K7281M1837L8782K6023k0225l5896J8832J2048m6679J940
9509F1253L4411L3556K2178p452o3465m1258j5752m81q074j2468m3423P0506K4066
9496E3597n6277l6110k4440N5454L6641K4042k2163J8497N9389J3471l4386P913
9484I5628O209k4991P355J6303o812r608R11L7142l9857j8723N771K3790J9209
9471A12327r653m0123m0555M2775K6906L3987M2329M3572o2710j05732J1647R0897
$$ plain form
9459 145667 121221 111860 112402 129683 108122 139337 68585 63076 75052 33628 25729 33571 58381
9446 58381 126198 86615 34939 33596 27049 43290 96917 114963 25930 -55846 -6457 109947
9434 109947 176561 171222 89111 54079 38835 31993 45327 61351 -4602 -3492 23621 28087
9422 28087 82214 109710 70774 49138 79243 153947 165283 153618 161144 174445 141335 84507
9410 84507 34333 35531 62051 94639 123973 130917 166395 176196 108869 89119 150881 154715 152450
9397 152450 124959 99414 166501 166235 114271 25423 14446 -1392 -54517 -39136 2573 15670
9385 15670 -20490 -37087 -39523 -26642 -3380 -23596 -33083 -23364 20231 35818 39215 28853 1051
9372 1051 9199 91217 87208 84712 78765 80363 24676 33789 -1413 -39410 -53047 14682 5449
$$ packed form
9459A45667k4446r361N42J7281k1561L1215p0752n509J1976m1424p899P842K4810
9446E8381O7817l9583n1676j343o547J6241N3627J8046q9033q1776M9389J16404
9434A09947O6614n339q2111l5032j5244o842J3334J6024o5953J110K7113M466
9422B8087N4127K7496l8936k1636L0105P4704J1336j1665P526J3301l3110n6828
9410H4507n0174J198K6520L2588K9334O944L5478R801o7327j9750O1762L834k265
9397A52450k7491k5545O7087k66n1964q8848j0977j5838n3125J5381M1709J3097
9385A5670l6160j6597k436J2881K3262k0216r487R719M3595J5587L397j0362k7802
9372A051Q148Q2018m009k496n947J598n5687R113l5202l7997j3637O7729r233
$$ plain form
9359 5449 -9358 47068 13206 -31347 -5162 66678 68310 50653 29064 9927 -6659 26287
9347 26287 29462 4550 -35634 -28292 28999 -7186 -34323 -30127 -54285 -111785 -61318 23862
9335 23862 -32116 -27783 31231 65267 37914 -25593 -9900 1664 49967 -13367 -40593 -48100
9323 -48100 -58844 -5198 31232 -16401 -19557 -34689 -51803 -78986 -47637 32670 61366 100599
9311 100599 81172 41724 24445 -7396 -6635 16446 90374 60701 20463 -14340 -15198 32587
9299 32587 63008 69896 34941 39581 34893 55091 70244 65481 36470 55592 69153 92572 86899
9286 86899 46300 123056 74940 59043 35345 27027 59860 73154 88009 81444 29457 -17763
9274 -17763 -46294 -80732 -71462 -24276 7098 -21284 5815 -30661 9402 86132 123434 107147
$$ packed form
9359E449j4807N6426l3862m4553K6185P1840J632j7657k1589j9137j6586L2946
9347B6287L175k4912m0184P342N7291l6185k7137M196k4158n7500N0467Q5180
9335B3862n5978M333N9014L4036k7353o3507J5693J1564M8303o3334k7226p507
9323d8100j0744N3646L6430m7633l156j5132j7114k7183L1349Q0307K8696L9233
9311A00599j9427l9448j7279l1841P61K3081P3928k9673m0238l4803q58M7785
9299C2587L0421O888l4955M640m688K0198J5153m763k9011J9122J3561K3419n673
9286H6899m0599P6756m8116j5897k3698q318L2833J3294J4855o565n1987m7220
9274a7763k8531l4438R270M7186L1374k8382K7099l6476M0063P6730L7302j6287
$$ plain form
9262 107147 58457 25271 -3663 9515 -23840 -5312 77324 122910 72111 25169 4927 19307
9250 19307 27578 50555 48420 71110 26202 19695 72015 62345 71504 59557 57880 118954 102731
9237 102731 61519 33836 77766 106537 86256 64552 74701 128932 178751 109280 -72
9226 -72 -16636 -18175 21732 15267 15165 29108 34502 44441 65614 140289 141768 56888 -15828 -96837
9212 -96837 -117965 -117507 -66104 -29137 -6853 -3395 -27562 -13841 -25529 -10948 -3996 -37514 32239
9199 32239 18937 -11356 34776 127107 144489 144484 130735 97871 74074 81008 22743 -23592 -30733
9186 -30733 -35125 -31389 -78681 -134669 -83785 -47574 -50907 16092 56569 127098 182111 124838
9174 124838 82589 77715 86279 157253 168255 147171 158361 156169 111913 71646 25282 22521
$$ packed form
9262A07147m8690l3186k8934J3178l3355J8528Q2636M5586n0799m6942k0242J4380
9250A9307Q271K2977k135K2690m4908o507N2320r670R159j1947j677O1074j6223
9237A02731m1212k7683M3930K8771k0281k1704J0149N4231M9819o9471j09352
9226g2j6564j539L9907o465j02J3943N394R939K1173P4675J479q4880p2716q1009
9212i6837k1128M58N1403L6967K2284L458k4167J3721j1688J4581O952l3518O9753
9199C2239j3302l0293M6132R2331J7382nj3749l2864k3797O934n8265m6335p141
9186c0733m392L736m7292n5988N0884L6211l333O6999M0477P0529N5013n7273
9174A24838m2249m874Q564P0974J1002k1084J1190k192m4256m0267m6364k761
$$ plain form
9162 22521 -20329 26089 55529 16079 37303 66513 108251 133308 138499 110741 83343 54537
9150 54537 49051 16533 -19775 -15147 -1682 31616 24189 -1855 36082 53863 2395 43858
9138 43858 33425 4934 83460 101559 124042 159113 179707 142575 87536 85110 60099 80736
9126 80736 64532 52298 -11025 -21849 22961 2010 11206 47841 72947 -13601 -48707 17469
9114 17469 24038 -47735 -58416 -42160 -61565 -38844 -29897 -2381 13510 52706 61761 8830
9102 8830 4927 -54652 -20728 50932 13182 -29389 -9256 20465 25639 85983 60177 -52909
9090 -52909 -59347 -47968 -29252 -14311 -32776 14273 20710 22409 57029 16755 58731 86153
9078 86153 48403 -5050 -4630 4181 -6317 40552 54361 58173 58464 47625 60415 74941 69485
$$ packed form
9162B2521m2850M6418K9440l9450K1224K9210M1738K5057N191k7758k7398k8806
9150E4537n486l2518l6308M628J3465L3298p427k6044L7937J7781n1468M1463
9138D3858j0433k8491P8526J8099K2483L5071K0594l7132n5039k426k5011K0637
9126H0736j6204j2234o3323j0824M4810k0951R196L6635K5106q6548l5106O6176
9114A7469O569p1773j0681J6256j9405K2721Q947K7516J5891L9196R055n2931
9102H830l903n9579L3924P1660l7750m2571K0133K9721N174O0344k5806j13086
9090e2909o438J1379J8716J4941j8465M7049O437J699L4620m0274M1976K7422
9078H6153l7750n3453M20Q811j0498M6869J3809L812K91j0839J2790J4526n456
$$ plain form
9065 69485 15681 -23395 -523 60270 59700 28880 -28318 -44892 -29719 27067 10274 24917
9053 24917 -16104 -28860 -32043 -48311 -62817 -35010 -3373 14034 54047 15076 12024 35075
9041 35075 68067 68240 64729 59700 -8258 -62802 -19682 8622 15162 84085 41332 38100 58516
9028 58516 13801 8346 83937 116462 72245 68452 54061 90865 92316 55172 79910 96957
9016 96957 86035 14922 9003 59631 101901 91282 99423 135214 83617 39817 24332 46319
9004 46319 11989 -29857 -14135 45142 59279 42965 8289 58732 132606 138372 155446 113967
8992 113967 77834 37694 15603 3582 -24968 -93243 -172753 -60762 -53441 -90419 -41947 -20790
8980 -20790 -32461 9036 59252 103480 60834 77811 48355 9315 27357 46199 43396 73450
$$ packed form
9065F9485n3804l9076K2872O0793n70l0820n7198j6574J5173N6786j6793J4643
9053B4917m1021j2756l183j6268j4506K7807L1637J7407M0013l8971l052K3051
9041C5075L2992J73l511n029o7958n4544M3120K8304O540O8923m2753l232K0416
9028E8516m4715n455P5591L2525m4217l793j4391L6804J451l7144K4738J7047
9016I6957j0922p1113n919N0628M2270j0619Q141L5791n1597m3800j5485K1987
9004D6319l4330m1846J5722N9277J4137j6314l4676N0443P3874N766J7074m1479
8992A13967l6133m0140k2091j2021k8550o8275p9510J11991P321l6978M8472K1157
8980b0790j1671M1497N0216M4228m2646J6977k9456l9040J8042J8842k803L0054
$$ plain form
8968 73450 43457 17867 48608 65704 23904 -4404 17588 49192 27408 56253 73833 9529
8956 9529 -42361 50640 70974 40142 -11113 -46304 -41524 9775 7720 -36195 -130199 -171361
8944 -171361 -91012 -44920 2630 23668 38380 18089 27482 -28840 -54339 44483 110555 167609
8932 167609 148628 92237 52658 42412 9284 -6624 19503 51402 18184 42226 49069 45671
8920 45671 38198 47825 43993 27833 21494 31182 39644 15677 11384 -8834 -1534 12154 -11393
8907 -11393 -20029 29347 33496 25313 -3427 6548 22451 75328 102300 22228 -70240 -28068 61583
8894 61583 31684 -17395 22730 49697 46585 -3731 65810 112647 89020 82836 25896 -76775
8882 -76775 -99656 -101795 -74505 -95029 -89922 -10532 20242 39923 108463 142292 198509 195864
$$ packed form
8968G3450k9993k5590L0741J7096m1800k8308K1992L1604k1784K8845J7580o4304
8956I529n1890R3001K0334l0832n1255l5191M780N1299k055m3915r4004m1162
8944a71361Q0349M6092M7550K1038J4712k0291R393n6322k5499R8822O6072N7054
8932A67609j8981n6391l9579j0246l3128j5908K6127L1899l3218K4042O843l398
8920D5671p473R627l832j6160o339R688Q462k3967m293k0218P300J3688k3547
8907a1393q636M9376M149q183k8740R975J5903N2877K6972q0072r2468M2172Q9651
8894F1583k9899m9079M0125K6967l112n0316O9541M6837k3627o184n6940j02671
8882g6775k2881k139K7290k0524N107P9390L0774J9681O8540L3829N6217k645
$$ plain form
8870 195864 151500 139384 69838 65749 64287 68852 53292 50405 24490 -30213 -21797 14865 111771
8857 111771 89991 35085 -13393 13778 4278 82489 110749 36343 53543 85063 102770 111213
8845 111213 111613 55737 33851 52727 68703 85331 159379 165183 148314 86242 58904 60850
8833 60850 40256 3188 -6472 808 2856 34262 51192 64237 42280 34072 52326 -16372 -15126
8820 -15126 -13624 -36597 -52847 9006 22320 16839 4668 -40502 29902 63997 27956 5328
8808 5328 16191 -58907 -67294 28321 124496 134576 63264 17685 -9726 -59518 -102609 -74429
8796 -74429 5328 69512 62139 36823 22967 19796 23989 -2390 16583 33298 15372 59476
8784 59476 134220 147514 128507 94451 102228 128102 132418 -29625 -131938 -139948 -103317 30024
$$ packed form
8870A95864m4364j2116o9546m089j462M565j5560k887k5915n4703Q416L6662R6906
8857A11771k1780n4906m8478K7171r500P8211K8260p4406J7200L1520J7707Q443
8845A11213M00n5876k1886J8876J5976J6628P4048N804j6869o2072k7338J946
8833F0850k0594l7068r660P280K048L1406J6930J3045k1957q208J8254o8698J246
8820a5126J502k2973j6250O1853J3314n481j2171m5170P0404L4095l6041k2628
8808E328J0863p5098q387R5615R6175J0080p1312m5579k7411m9792m3091K8180
8796g4429P9757O4184p373k5316j3856l171M193k6379J8973J6715j7926M4104
8784E9476P4744J3294j9007l4056P777K5874M316j62043j02313q010L6631J33341
$$ plain form
8772 30024 105444 24582 -44355 -66998 -51615 -75367 -34881 29167 57627 80507 111535 26733
8760 26733 -11157 38226 63064 11633 -38732 -43600 -40392 9796 41683 4298 -5442 42637
8748 42637 65243 47163 26650 29522 -76862 -93566 -71968 -76798 -57126 -41456 -44103 -28080
8736 -28080 4930 -17826 -19069 -15696 -29021 -48663 -22819 -26130 32126 128972 131544 109517 50134
8723 50134 12081 55706 108187 37767 -1646 -13102 -26409 -46734 -84224 -83471 16102 23648
8711 23648 -7136 -1903 76061 145947 80887 23033 69728 65095 77520 82047 12909 -61354
8699 -61354 -33290 22882 52191 23018 -9986 -42717 -103605 -74292 5880 26916 19678 -16351
8687 -16351 -22563 -2324 9073 18964 77968 116187 37637 27744 -9798 -54514 -76796 -102282
$$ packed form
8772C0024P5420q0862o8937k2643J5383k3752M0486O4048K8460K2880L1028q4802
8760B6733l7890M9383K4838n1431n0365m868L208N0188L1887l7385r740M8079
8748D2637K2606j8080k0513K872j06384j6704K1598m830J9672J5670k647J6023
8736b8080L3010k2756j243L373j3325j9642K5844l311N8256R6846K572k2027n9383
8723E0134l8053M3625N2481p0420l9413j1456j3307k0325l7490P53R9573P546
8711B3648l0784N233P7964O9886o5060n7854M6695m633J2425M527o9138p4263
8699f1354K8064N6172K9309k9173l3004l2731o0888K9313Q0172K1036p238l6029
8687a6351o212K0239J1397R891N9004L8219p8550r893l7542m4716k2282k5486
$$ plain form
8675 -102282 -83373 20511 36159 69872 109994 25982 -36315 26335 31703 25971 49685 1824
8663 1824 -51344 -47141 31237 5601 14689 51359 37583 25855 28449 69501 46944 32281 45803
8650 45803 42468 34999 73691 96862 75561 86472 112067 74967 118434 80983 62910 -16348
8638 -16348 738 7016 13089 33300 58873 49294 -740 -14414 6796 -13569 -40301 -1139
8626 -1139 28395 43908 33065 24723 16645 1598 -4951 23675 61884 65254 126062 103235 71437
8613 71437 97318 67092 -2006 3930 22429 38397 89305 121698 111771 116147 155074 177330
8601 177330 143640 45611 52177 67375 81855 56868 63514 56745 65827 77566 96370 87368 111209
8588 111209 84343 58563 86324 183331 270545 311890 328876 280484 265737 247593 302067 385122
$$ packed form
8675a02282J8909J03884J5648L3713M0122q4012o2297O2650N368n732K3714m7861
8663A824n3168M203P8378k5636R088L6670j3776j1728K594M1052k2557j4663J3522
8650D5803l335p469L8692K3171k1301J0911K5595l7100M3467l7451j8073p9258
8638a6348J7086O278O073K0211K5573r579n0034j3674K1210k0365k6732L9162
8626a139K9534J5513j0843q342q078j5047o549K8626L8209L370O0808k2827l1798
8613G1437K5881l0226o9098N936J8499J5968N0908L2393r927M376L8927K2256
8601A77330l3690r8029O566J5198J4480k4987O646o769R082J1739J8804r002K3841
8588A11209k6866k5780K7761R7007Q7214M1345J6986m8392j4747j8144N4474Q3055
$$ plain form
8576 385122 372490 352101 404714 383783 337723 285261 288596 259826 234933 264675 302312 225917
8564 225917 196025 150289 146925 178662 118049 86712 120362 188348 198663 171931 130889 120021
8552 120021 129250 141446 143608 131115 73501 56366 18448 53249 88221 112494 178179 155973
8540 155973 93349 43298 27842 33045 84801 115195 114864 179072 136343 119501 134781 127109
8528 127109 103144 80219 43346 -3590 34530 64918 134715 123082 85217 96975 115789 111490
8516 111490 86645 41901 -13433 -13916 -3085 56533 43751 62063 53223 48864 -6706 -12518 40548
8503 40548 23410 1647 -28091 -7753 -13877 8758 56491 59290 38582 -25487 -29465 -1868
8491 -1868 6195 3454 -29538 -30397 -24114 -22951 -5639 2776 -5066 -11497 6766 45834 -8906 13129
$$ packed form
8576C85122j2632k0389N2613k0931m6060n2462L335k8770k4893K9742L7637p6395
8564B25917k9892m5736l364L1737o0613l1337L3650O7986J0315k6732m1042j0868
8552A20021R229J2196K162j2493n7614j7135l7918L4801L4972K4273O5685k2206
8540A55973o2624n0051j5456N203N1756L0394l31O4208m2729j6842J5280p672
8528A27109k3965k2925l6873m6936L8120L0388O9797j1633l7865J1758J8814m299
8516A11490k4845m4744n5334m83J0831N9618j2782J8312q840m359n5570n812N3066
8503D0548j7138k1763k9738K0338o124K2635M7733K799k0708o4069l978K7597
8491a868Q063k741l2992q59O283J163J7312Q415p842o431J8263L9068n4740K2035
$$ plain form
8477 13129 33300 76199 111914 71954 88481 67863 34762 27629 64052 75494 82583 117218
8465 117218 126747 57481 -24136 -30916 -11035 19575 43941 49660 21437 45630 1305 37774
8453 37774 50018 21539 41166 47724 131132 154633 134063 162389 156614 86367 95272 143317
8441 143317 105144 109556 114034 131157 142502 173218 180802 151639 157110 157566 145932 115057 82984
8428 82984 34539 54376 84394 105411 87369 67111 51558 68202 137196 131607 49093 20947
8416 20947 27409 -7119 5224 8061 -14604 -25775 -6279 -33319 -61000 -68692 -57033 -80677
8404 -80677 -71662 -47958 -26338 -50682 -81604 -26408 12867 18388 6303 -8398 55425 80141
8392 80141 44261 30531 63284 85470 51789 44100 70430 63756 56500 56712 19004 -4568 -33539
$$ packed form
8477A3129K0171M2899L5715l9960J6527k0618l3101p133L6423J1442P089L4635
8465A17218R529o9266q1617o780J9881L0610K4366N719k8223K4193m4325L6469
8453C7774J2244k8479J9627O558Q3408K3501k0570K8326n775p0247Q905M8045
8441A43317l8173M412M478J7123J1345L0716P584k9163N471M56j1634l0875l2073
8428H2984m8445J9837L0018K1017j8042k0258j5553J6644O8994n589q2514k8146
8416B0947O462l4528J2343K837k2665j1171J9496k7040k7681p692J1659k3644
8404h0677R015K3704K1620k4344l0922N5196L9275N521j2085j4701O3823K4716
8392H0141l5880j3730L2753K2186l3681p689K6330o674p256K12l7708k3572k8971
$$ plain form
8379 -33539 -8790 -965 24379 15050 4503 -16356 44068 90732 128290 79234 17951 42338
8367 42338 99264 138310 176166 161346 117085 42565 -40501 -76545 -127460 -54153 37884 63845
8355 63845 36401 53396 100745 145237 156499 98984 20886 -37327 -37536 -2669 4998 22449
8343 22449 -16422 -8294 33943 34484 51324 28123 17043 73040 173498 91856 28103 -6292
8331 -6292 -68497 -71638 -78063 -58904 -45636 -38446 -34155 1486 -23900 -7526 19870 -20701 -37729
8318 -37729 -39331 -866 35177 53925 94442 64654 5979 525 26423 30974 41624 38253 -25212
8305 -25212 -6964 -10156 -16334 11114 31418 26891 -22176 -3324 -3069 2813 57941 93626 105073
8292 105073 39230 73376 106279 130488 126334 115820 94969 75680 66246 87544 85573 9889
$$ packed form
8379c3539K4749P825K5344r329j0547k0859O0424M6664L7558m9056o1283K4387
8367D2338N6926L9046L7856j4820m4261p4520q3066l6044n0915P3307R2037K5961
8355F3845k7444J6995M7349M4492J1262n7515p8098n8213k09L4867P667J7451
8343B2449l8871Q128M2237N41J6840k3201j1080N5997J00458q1642o3753l4395
8331f292o2205l141o425J9159J3268P190M291L5641k5386J6374K7396m0571j7028
8318c7729j602L8465L6043J8748M0517k9788n8675n454K5898M551J0650l371o3465
8305b5212J8248l192o178K7448K0304m527m9067J8852K55N882N5128L5685J1447
8292A05073o5843L4146L2903K4209m154j0514k0851j9289r434K1298j971p5684
$$ plain form
8280 9889 2243 -2892 21821 47239 78148 25324 -12407 5715 -417 30433 68907 76022 73270
8267 73270 3844 -52450 -24744 2921 -307 -37797 -39054 -6319 59033 50864 -9615 -10298 41433
8254 41433 53896 59047 39541 63179 91608 102225 126833 59255 25623 34482 101062 110112
8242 110112 84311 14136 10511 28287 41701 67479 51372 -10316 -29317 -2458 23001 -25979
8230 -25979 -65660 -129792 -155532 -66791 -58242 -74963 -12911 -12844 16239 41743 27423 10428 -20525
8217 -20525 5096 3373 -18436 18386 36057 58082 80859 75165 50467 21683 42005 44937
8205 44937 63577 83976 136731 69801 21313 22016 18259 16476 24088 -1354 9709 -2495 -26302
8192 -26302 -16269 -39888 -21315 38755 108852 60405 -9390 32138 43238 -18393 5216 37707
$$ packed form
8280I889p646n135K4713K5418L0909n2824l7731J8122o132L0850L8474P115k752
8267G3270o9426n6294K7706K7665l228l7490j257L2735O5352q169o0479o83N1731
8254D1433J2463N151j9506K3638K8429J0617K4608o7578l3632Q859O6580R050
8242A10112k5801p0175l625J7776J3414K5778j6107o1688j9001K6859K5459m8980
8230b5979l9681o4132k5740Q8741Q549j6721O2052O7K9083K5504j4320j6995l0953
8217b0525K5621j723k1809L6822J7671K2025K2777n694k4698k8784K0322K932
8205D4937J8640K0399N2755o6930m8488P03l757j783P612k5442J1063j2204k3807
8192b6302J0033k3619J8573O0070P0097m8447o9795M1528J1100o1631K3609L2491
$$ plain form
8180 37707 -41146 -97369 -78898 -44764 -19708 18106 33937 8100 20777 6924 34526 11477
8168 11477 11020 34649 50147 46001 71350 111812 62718 54739 43417 48168 33669 16702 -20918
8155 -20918 -44477 15402 20553 47972 66359 73554 77679 75590 29112 5194 20906 2807 -53764
8142 -53764 -63312 -118859 -116413 -108476 -102280 -88073 -83618 -66958 -98968 -80004 -96576 -68423 -27451
8129 -27451 -6681 19096 -18230 -57914 -75965 -82536 -54749 -33674 -54782 -78040 -68400 -88149
8117 -88149 -77302 -197 18078 -30599 -21666 11753 25024 8148 -26293 -41324 -16242 -123
8105 -123 3506 22999 27989 35989 59579 84309 11501 -54163 -126118 -147832 -116283 -49355 9280
8092 9280 62669 86105 65705 -1906 14691 52465 122219 120379 72855 11702 -9353 -19406
$$ packed form
8180C7707p8853n6223J8471L4134K5056L7814J5831k5837J2677j3853K7602k3049
8168A1477m57K3629J5498m146K5349M0462m9094p979j1322M751j4499j6967l7620
8155b0918k3559N9879N151K7419J8387P195M125k089m6478k3918J5712j8099n6571
8142e3764r548n5547K446P937O196J4207M455J6660l2010J8964j6572K8153M0972
8129b7451K0770K5777l7326l9684j8051o571K7787K1075k1108k3258R640j9749
8117h8149J0847P7105J8275m8677Q933L3419J3271j6876l4441j5031K5082J6119
8105a23L629J9493M990Q000K3590K4730p2808o5664p1955k1714L1549O6928N8635
8092I280N3389K3436k0400o7611J6597L7774O9754j840m7524o1153k1055j0053
$$ plain form
8080 -19406 -28656 -18283 13749 63453 116274 139510 40084 -7896 18987 38459 64842 70139
8068 70139 53251 -32605 18206 33470 -252 -26086 15946 11724 -5991 -54368 -52980 -82720
8056 -82720 -46543 -32061 -26061 -30077 7291 22367 4947 22855 36135 63994 77948 54912
8044 54912 -9384 -38644 -13046 -3953 39905 28620 -13209 -50806 -111947 -64926 -32865 -61742
8032 -61742 -60605 -42745 -21382 -9575 18477 45897 38388 11565 -46492 -5879 29330 -1058
8020 -1058 34166 63650 38977 14420 4430 3860 -21428 -60180 -37775 21250 58448 -9897 -90029
8007 -90029 -105320 -93237 -67843 -64316 -85671 -95784 -80965 -125219 -66082 5645 84966 176071
7995 176071 170336 163180 123375 67017 50579 3456 -8355 33020 76519 91314 109762 172616
$$ packed form
8080a9406r250J0373L2032M9704N2821K3236r9426m7980K6883J9472K6383N297
8068G0139j6888q5856N0811J5264l3722k5834M2032m222j7715m8377J388k9740
8056h2720L6177J4482O000m016L7368J5076j7420J7908J3280K7859J3954k3036
8044E4912o4296k9260K5598R093M3858j1285m1829l7597o1141M7021L2061k8877
8032f1742J137J7860K1363J1807K8052K7420p509k6823n8057M0613L5209l0388
8020a058L5224K9484k4673k4557r990n70k5288l8752K2405N9025L7198o8345q0132
8007i0029j5291J2083K5394L527k1355j0113J4819m4254N9137P1727P9321R1105
7995A76071n735p156l9805n6358j6438m7123j1811M1375M3499J4795J8448O2854
$$ plain form
7983 172616 132928 80765 9660 7148 40492 30379 53037 85398 122354 151906 104200 28089
7971 28089 43785 35799 3304 -29382 27716 27850 16977 7229 21466 50920 16541 -36929 -33065
7958 -33065 -37499 -120258 -106225 -131558 -77138 -4720 79949 111358 145016 133087 108772 83297
7946 83297 22820 23298 33896 12772 28799 56634 66520 76697 73378 48912 56613 69063 27479
7933 27479 11226 -34526 -28803 -10550 -27370 -25977 -65687 -44076 -11461 -8669 -42404 -10887
7921 -10887 40854 7079 40287 103467 53717 40097 -10748 -63242 -79361 -39854 -29780 -44916
7909 -44916 -91538 -136410 -161306 -66450 -20009 -23338 -25505 -14202 -23175 -43954 -55012 -11812
7897 -11812 11216 -39438 -45670 -24018 -57602 -14491 -3381 -23677 47127 99227 58938 20803
$$ packed form
7983A72616l9688n2163p1105k512L3344j0113K2658L2361L6956K9552m7706p6111
7971B8089J5696p986l2495l2686N7098J34j0873r748J4237K9454l4379n3470L864
7958c3065m434q2759J4033k5333N4420P2418Q4669L1409L3658j1929k4315k5475
7946H3297o0477M78J0598k1124J6027K7835R886J0177l319k4466P701J2450m1584
7933B7479j6253m5752N723J8253j6820J393l9710K1611L2615K792l3735L1517
7921a0887N1741l3775L3208O3180m9750j3620n0845n2494j6119L9507J0074j5136
7909d4916m6622m4872k4896R4856M6441l329k167J1303q973k0779j1058M3200
7897a1812K3028n0654o232K1652l3584M3111J1110k0296P0804N2100m0289l8135
$$ plain form
7885 20803 50479 43782 42944 41760 36915 3618 18940 70768 67920 36322 18782 -24556 -90284
7872 -90284 -78249 -74174 -29154 -38873 -28860 -1865 8493 30046 60113 46191 10653 28281
7860 28281 72036 94383 69954 25261 42805 42146 49468 91997 97750 65235 70302 1182 -56915
7847 -56915 -78698 -134102 -137873 -61224 -57455 -52038 -13465 -17460 -8423 -24385 -53388 4305 29998
7834 29998 34914 3992 -2266 -45452 -63353 -45689 -33222 -38181 5181 70848 66418 54915 116431
7821 116431 85947 19427 23364 8909 -8233 -2513 9552 -56781 -36940 -2538 -12589 3194
7809 3194 78560 145368 96847 102157 111203 112765 47995 14701 -9451 -91585 -125579 -73491 -11476
7796 -11476 -21951 -24986 49904 -1392 -24738 -89889 -71145 -21900 20479 105711 144381 66805
$$ packed form
7885B0803K9676o697q38j184m845l3297J5322N1828k848l1598j7540m3338o5728
7872i0284J2035M075M5020r719J0013K6995J0358K1553L0067j3922l5538J7628
7860B8281M3755K2347k4429m4693J7544o59P322M2529N753l2515N067o9120n8097
7847e6915k1783n5404l771P6649L769N417L8573l995R037j5962k9003N7693K5693
7834B9998M916l0922o258m3186j7901J7664J2467m959M3362O5667m430j1503O1516
7821A16431l0484o6520L937j4455j7142N720J2065o6333J9841L4402j0051J5783
7809C194P5366O6808m8521N310R046J562o4770l3294k4152q2134l3994N2088O2015
7796a1476j0475l035P4890n1296k3346o5151J8744M9245M2379Q5232L8670p7576
$$ plain form
7784 66805 -17044 7535 -1905 2477 55919 58729 29470 -3974 24730 14701 57674 103320
7772 103320 76812 44876 -24730 -17240 58477 72334 84930 24008 -20710 -4462 29794 50531
7760 50531 82767 49365 62805 13360 33535 22022 -10772 -16094 -31230 -52849 -12094 44469
7748 44469 100397 105147 62774 -15950 -74965 -109631 -97445 -77609 -53646 -44840 -16105 -13647
7736 -13647 -71333 -107804 -73476 -80306 -86666 -23329 40386 -318 -15048 4875 -3548 730 -33792
7723 -33792 -45288 -120456 -109568 -50153 -36521 -48218 -110695 -126472 -39289 548 -17096 14461
7711 14461 472 12754 9168 -71795 -104636 -64422 -10114 -34718 -11669 -4132 1744 24026
7699 24026 32449 48076 114858 91878 43704 27273 10659 19144 15386 -36811 -84389 -83741 -80435
$$ packed form
7784F6805q3849K4579r440M382N3442K810k9259l3444K8704j0029M2973M5646
7772A03320k6508l1936o9606P490P5717J3857J2596o0922m4718J6248L4256K0737
7760E0531L2236l3402J3440m9445K0175j1513l2794n322j5136k1619M0755N6563
7748D4469N5928M750m2373p8724n9015l4666J2186J9836K3963Q806K8735K458
7736a3647n7686l6471L4328o830o360O3337O3715m0704j4730J9923q423M278l4522
7723c3792j1496p5168J0888N9415J3632j1697o2477j5777Q7183L9837j7644L1557
7711A4461j3989J2282l586q0963l2841M0214N4308k4604K3049P537N876K2282
7699B4026Q423J5627O6782k2980m8174j6431j6614Q485l758n2197m7578O48L306
$$ plain form
7686 -80435 -78920 -58770 -51134 -73274 -80126 -33314 13943 43840 59603 37310 -16088 -44457
7674 -44457 -2404 34207 98004 98837 40856 -2638 14783 27945 -5175 -30769 -9206 56943
7662 56943 44218 1980 19776 -16436 -31473 -40696 -22768 13536 5706 -18367 -64208 -122308
7650 -122308 -162880 -115943 -67501 18563 39842 34735 26355 15604 -22984 -53509 -28331 -79334
7638 -79334 -56062 -10437 -23260 -14490 9315 49862 46799 64712 48519 58670 864 -9664
7626 -9664 36279 64868 49040 50531 57433 18291 -10598 33200 63659 89616 102436 54822
7614 54822 -21539 -35547 -51129 -41221 -40141 -11160 -10396 -64400 -20279 28898 49650 32643 19094
7601 19094 -10558 -74564 -125890 -167425 -136569 -114493 -90654 -130084 -91478 -90057 -172535 -185786
$$ packed form
7686h0435J515K0150P636k2140o852M6812M7257K9897J5763k2293n3398k8369
7674d4457M2053L6611O3797Q33n7981m3494J7421J3162l3120k5594K1563O6149
7662E6943j2725m2238J7796l6212j5037r223J7928L6304p830k4073m5841n8100
7650a22308m0572M6937M8442Q6064K1279n107q380j0751l8588l0525K5178n1003
7638g9334K3272M5625j2823Q770K3805M0547l063J7913j6193J0151n7806j0528
7626i664M5943K8589j5828J491O902l9142k8889M3798L0459K5957J2820m7614
7614E4822p6361j4008j5582R908J080K8981P64n4004M4121M9177K0752j7007j3549
7601A9094k9652o4006n1326m1535L0856K2076K3839l9430L8606J421q2478j3251
$$ plain form
7589 -185786 -134737 -118874 -40819 1945 -18233 -41157 -51332 -16267 -8523 -17112 -18510 -10508
7577 -10508 -46863 -90336 -127820 -72962 30704 37481 964 -6334 -3526 36071 33681 31819 -57147
7564 -57147 -77348 -46202 -78439 -57215 -58306 -38123 -43304 -76828 -89688 -92983 -63955 -29187
7552 -29187 5338 86745 81430 11420 -71168 -87520 -25056 -16282 -6640 -34860 -15142 -17862 32540
7539 32540 71183 74417 47201 -48614 -24092 -6731 -62945 -75123 -75361 -29285 1790 14369
7527 14369 23140 4553 -19614 -32685 -8106 15342 -9387 24596 43018 652 30198 30890
7515 30890 -10474 -9802 -4406 -51447 -72875 -49851 -46760 -61308 11165 69966 29140 -65318 -107801
7502 -107801 -101311 -56271 -21914 -19818 -52360 -46396 -25300 -25181 -56742 -3656 45450 42255 60880
$$ packed form
7589a85786N1049J5863P8055M2764k0178k2924j0175L5065P744q589j398Q002
7577a0508l6355m3473l7484N4858J03666O777l6517p298K808L9597k390j862q8966
7564e7147k0201L1146l2237K1224j091K0183n181l3524j2860l295K9028L4768
7552b9187L4525Q1407n315p0010q2588j6352O2464Q774R642k8220J9718k720N0402
7539C2540L8643L234k7216r5815K4522J7361n6214j2178k38M6076L1075J2579
7527A4369Q771j8587k4167j3071K4579K3448k4729L3983J8422m2366K9546O92
7515C0890m1364O72N396m7041k1428K3024L091j4548P2473N8801m0826r4458m2483
7502a07801O490M5040L4357K096l2542N964K1096J19l1561N3086M9106l195J8625
$$ plain form
7489 60880 21530 -75687 -93709 -96373 -83971 -48772 -18221 19064 -15913 417 45783 39161
7477 39161 33093 34468 36820 52452 56617 29416 -38859 -22763 25295 14355 79989 105798 52955
7464 52955 37559 43719 37562 -8580 -24529 -40569 -57689 -42724 3760 13138 -6889 -40655
7452 -40655 -31946 -2071 4235 -74150 -113691 -67859 -52328 -60294 -42455 -68797 -132876 -73370
7440 -73370 2987 75462 73282 15116 36993 20354 -4232 -45176 -56425 -41964 -18806 -1056
7428 -1056 -32736 -45651 -25315 5693 53414 46391 -3053 -40709 6940 5594 -16507 -6758 -15719
7415 -15719 -71364 -82668 3843 -17601 -34503 -47050 -54732 -27476 -46559 -56886 -69954 -41886
7403 -41886 -30504 -59248 -3147 -6237 -30415 -38305 -20161 -10799 -30122 -135167 -149273 -78790
$$ packed form
7489F0880l9350r7217j8022k664J2402L5199L0551L7285l4977J6330M5366o622
7477C9161o068J375K352J5632M165k7201o8275J6096M8058j0940O5634K5809n2843
7464E2955j5396O160o157m6142j5949j6040j7120J4965M6484R378k0027l3766
7452d0655Q709K9875O306p8385l9541M5832J5531p966J7839k6342o4079N9506
7440g3370P6357P2475k180n8166K1877j6639k4586m0944j1249J4461K3158J7750
7428a056l1680j2915K0336L1008M7721p023m9444l7656M7649j346k2101R749q961
7415a5719n5645j1304Q6511k1444j6902j2547p682K7256j9083j0327j3068K8068
7403d1886J1382k8744N6101l090k4178p890J8144R362j9323j05045j4106P0483
$$ plain form
7391 -78790 -31857 35125 41233 48598 -13393 -58175 -55640 -28508 -31459 -23850 -53845 -53373 -24181
7378 -24181 -17437 32788 38268 10949 -44905 -66111 -47374 -53374 -11951 -49810 -77324 -36501
7366 -36501 28919 -3342 -26100 -26726 -53822 -34645 29329 -1389 12389 -6147 -3220 -16479
7354 -16479 -45314 -34202 -960 10617 25772 -2125 -2525 -5773 -10458 2650 29635 42542 70415
7341 70415 61458 -4596 13376 18884 -21242 -17939 -60254 -74893 -50534 -34917 -6748 -32662
7329 -32662 2573 83155 76271 14162 -38278 -27249 -16016 -32342 -100158 -100493 -104715 -46542 -72488
7316 -72488 -143517 -73247 -42880 -21615 -4334 -6135 -18081 -7300 19174 11016 15486 -19609
7304 -19609 -21946 34804 67488 53666 -9982 -51589 -41551 -37682 -72304 -129639 -139410 -64914
$$ packed form
7391g8790M6933O6982O108P365o1991m4782K535K7132k951P609k9995M72K9192
7378b4181O744N0225N480k7319n5854k1206J8737o000M1423l7859k7514M0823
7366c6501O5420l2261k2758o26k7096J9177O3974l0718J3778j8536K927j3259
7354a6479k8835J1112L3242J1577J5155k7897m00l248m685J3108K6985J2907K7873
7341G0415q957o6054J7972N508m0126L303m2315j4639K4359J5617K8169k5914
7329c2662L5235Q0582o884o2109n2440J1029J1233j6326o7816l35m222N8173k5946
7316g2488p1029P0270L0367K1265J7281j801j1946J0781K6474q158M470l5095
7304a9609k337N6750L2684j3822o3648m1607J0038L869l4622n7335r771P4496
$$ plain form
7292 -64914 -33980 -27355 -8358 -44972 -14180 -25522 -17521 23729 49039 41374 62647 58701 13038
7279 13038 14797 21573 3777 -34078 -20745 11496 15324 38383 67091 69860 10862 -28106 -80220
7266 -80220 -53059 -44509 -52645 -92401 -137263 -120173 -61814 -62963 -58126 -69390 -76460 -82564 -62422
7253 -62422 -23009 17522 38276 20287 -60172 -79178 -72621 -27408 -13543 -28586 -12618 -16903
7241 -16903 -68945 -39191 -29407 -93977 -65277 -29641 6472 11184 32255 38359 31941 27786 11476
7228 11476 -24990 -118357 -187123 -103833 -78963 -58377 -94201 -93810 -121830 -99190 -53667 52538
7216 52538 3539 3994 27201 6860 10534 34744 506 30275 27370 39429 40779 22019 -14338
7203 -14338 -30909 -46969 -6459 10491 -21239 -20282 -18152 -33925 -52232 -62040 -44561 -65148 -39328
$$ packed form
7292f4914L0934O625J8997l6614L0792j1342Q001M1250K5310p665K1273l946m5663
7279A3038J759O776j7796l7855J3333L2241L828K3059K8708K769n8998l8968n2114
7266h0220K7161Q550q136l9756m4862J7090N8359j149M837j1264p070o104K0142
7253f2422L9413M0531K0754j7989q0459j9006O557M5213J3865j5043J5968m285
7241a6903n2042K9754R784o4570K8700L5636L6113M712K1071O104o418m155j6310
7228A1476l6466r3367o8766Q3290K4870K0586l5824L91k8020K2640M5523J06205
7216E2538m8999M55K3207k0341L674K4210l4238K9769k905J2059J350j8760l6357
7203a4338j6571j6060M0510J6950l1730R57K130j5773j8307r808J7479k0587K5820
$$ plain form
7190 -39328 45026 85767 33801 -24324 8503 53566 70679 71371 24522 28691 42370 43737 69826
7177 69826 64740 93029 98171 9348 -69005 -32735 -15994 -18751 15894 40255 40543 -298 -58133
7164 -58133 -40113 -26717 -34292 -52856 -70520 -95891 -84139 -53661 -2166 -9457 -17428 38342
7152 38342 45906 50857 -38266 -85710 -40456 7133 63574 51382 4115 -33284 -10291 28718
7140 28718 75608 68404 4576 -22646 -24313 -29012 -29407 -107562 -141833 -61716 -2376 14780 38567
7127 38567 59276 98732 44329 11836 21324 20790 -21876 -13562 -31597 -5297 -10754 -57158 -76928
7114 -76928 -78411 -35682 5685 41086 47448 82846 104616 63591 27788 41598 41755 6256 13693
7101 13693 -24000 20557 9419 -17683 -61661 -83375 -57383 -18706 -37825 -121894 -130679 -157015
$$ packed form
7190c9328Q4354M0741n1966n8125L2827M5063J7113O92m6849M169J3679J367K6089
7177F9826n086K8289N142q8823p8353L6270J6741k757L4645K4361K88m0841n7835
7164e8133J8020J3396p575j8564j7664k5371J1752L0478N1495p291p971N5770
7152C8342P564M951q9123m7444M5254M7589N6441j2192m7267l7399K2993L9009
7140B8718M6890p204o3828k7222j667m699l95p8155l4271Q0117N9340J7156K3787
7127C8567K0709L9456n4403l2493R488n34m2666Q314j8035K6300n457m6404j9770
7114g6928j483M2729M1367L5401O362L5398K1770m1025l5803J3810J57l5499P437
7101A3693l7693M4557j1138k7102m3978k1714K5992L8677j9119q4069q785k6336
$$ plain form
7089 -157015 -155541 -136854 -106863 -47202 -49275 -70381 -18823 12914 -27678 -67860 -27119 -14267
7077 -14267 -16658 -13335 1759 5578 -69120 -107464 -105262 -34419 2544 13317 28293 -70788 -104612
7064 -104612 -96104 -40850 -12067 24646 57819 99668 103927 133868 117358 56248 30305 49745
7052 49745 -32792 -118247 -146751 -42828 668 -26674 -78307 -48602 -48244 -53332 -35626 -9122
7040 -9122 -37754 -54583 -11543 -25283 -39483 -49720 -33878 -30538 -40112 -41778 -25403 19675 20007
7027 20007 -3946 -53578 -12348 64761 116221 119770 22561 17646 22413 22324 44892 -15016 -62790
7014 -62790 -55644 -50706 -51088 -83839 -124605 -47955 24180 -26899 -54935 -56785 -56655 -60643 -67099 -44461
7000 -44461 -27357 -3928 39793 72803 45794 48019 56562 102058 100312 69040 -26591 -34023 -77674
$$ packed form
7089a57015J474J8687K9991N9661k073k1106N1558L1737m0592m0182M0741J2852
7077a4267k391L323J5094L819p4698l8344K202P0843L6963J0773J4976r9081l3824
7064a04612Q508N5254K8783L6713L3173M1849M259K9941j6510o1110k5943J9440
7052D9745q2537q5455k8504J03923M3496k7342n1633K9705L58n088J7706K6504
7040i122k8632j6829M3040j3740j4200j0237J5842L340r574j666J6375M5078L32
7027B0007k3953m9632M1230P7109N1460L549r7209m915M767q9K2568n9908m7774
7014f2790P146M938l82l2751m0766P6650P2135n1079k8036j850J30l988o456K2638
7000d4461J7104K3429M3721L3010k7009K225Q543M5496j746l1272r5631p432m3651
$$ plain form
6987 -77674 -63338 -33576 -58040 -117003 -136639 -130957 -90479 -37575 -28071 -8815 -9551 -8680 59427
6974 59427 75472 26668 -22911 -78493 -92956 -66132 -49754 14424 41121 50707 -42662 -49182
6962 -49182 -24773 -29094 -29027 15711 30088 2435 7428 19592 -2854 -6247 -5552 -65636 -80815
6949 -80815 -79260 -50362 -46640 -70747 -77925 -52781 -46213 -14267 14389 31638 -8625 -7123 -76447
6936 -76447 -89680 -55785 -83594 -72028 -30384 14341 -5121 -12140 -68879 -75336 -44991 19706
6924 19706 -20326 20151 14412 4734 -48894 -77413 -63991 -76817 -43572 -79335 -83763 -78566 -79085
6911 -79085 -60728 -32912 -26508 -37848 -42969 6551 34162 38377 38322 54694 -25463 -68398 -21184
6898 -21184 8219 -3465 -65942 -76435 -14729 -25694 -27158 -14352 -60671 4229 -1872 -46640
$$ packed form
6987g7674J4336K9762k4464n8963j9636N682M0478N2904R504J9256p36Q71O8107
6974E9427J6045m8804m9579n5582j4463K6824J6378O4178K6697R586r3369o520
6962d9182K4409m321O7M4738J4377k7653M993J2164k2446l393O95o0084j5179
6949h0815J555K8898L722k4107p178K5144O568L1946K8656J7249m0263J502o9324
6936g6447j3233L3895k7809J1566M1644M4725j9462p019n6739o457L0345O4697
6924A9706m0032M0477n739r678n3628k8519J3422j2826L3245l5763m428N197n19
6911g9085J8357K7816O404j1340n121M9520K7611M215n5J6372q0157m2935M7214
6898b1184K9403j1684o2477j0493O1706j0965j464J2806m6319O4900o101m4768
$$ plain form
6886 -46640 -36337 -52360 -97796 -31297 40753 -4073 -40215 -494 25518 9077 -31761 -31148
6874 -31148 -41940 -100323 -80828 -78040 -57133 -15222 -40961 -56394 -49698 -69309 -67055 -56090
6862 -56090 -12303 23791 73750 90072 46124 25429 51281 16668 29598 67122 52359 23004
6850 23004 -5252 -13433 -27382 -66970 -11455 3010 -11820 -15326 -6598 11074 6075 -52751 -6626
6837 -6626 -14382 26409 20713 17892 31667 41479 -10582 16643 -21110 -11892 54455 87947 132341
6824 132341 96188 132757 102210 77942 73071 75173 57719 55445 -5421 -46305 -13766 12037
6812 12037 35448 10417 35339 32687 51205 70730 67222 20911 -5128 -27301 -15826 -10184
6800 -10184 -7869 15599 39033 31455 -61623 -62730 -44734 -36390 -29503 -40664 -60656 -35977 29003
$$ packed form
6886d6640J0303j6023m5436O6499P2050m4826l6142L9721K6012j6441m0838O13
6874c1148j0792n8383J9495K788K0907M1911k5739j5433O696j9611K254J0965
6862e6090M3787L6094M9959J6322m3948k0695K5852l4613J2930L7524j4763k9355
6850B3004k8256q181j3949l9588N5515J4465j4830l506Q728J7672m999n8826M6125
6837f626p756M0791n696k821J3775R812n2061K7225l7753R218O6347L3492M4394
6824A32341l6153L6569l0547k4268m871K102j7454k274o0866m0884L2539K5803
6812A2037K3411k5031K4922k652J8518J9525l508m6311k6039k2173J1475N642
6800a0184K315K3468K3434p578r3078j107J7996Q344O887j1161j9992K4679O4980
$$ plain form
6787 29003 17763 -30794 -38849 -27455 -16011 -14443 14143 26946 -10912 41075 39543 -1021
6775 -1021 -12861 -54590 -101253 -12884 12765 38453 23664 13538 -19492 -21176 8263 24784
6763 24784 51637 24812 14343 -3512 -26749 -62950 -44822 -70432 -51326 -27968 32158 62956
6751 62956 29608 31858 55534 68094 36595 45471 61496 71296 -39471 -87080 -55537 -44922
6739 -44922 -66785 -108777 -75205 -40038 -21537 -45686 -88534 -24805 -64300 -43224 25399 74635
6727 74635 33223 -70383 -62114 -21598 -4572 -32913 -38320 -11074 -53705 -69254 -18409 31097
6715 31097 38102 26833 22497 17803 32467 87649 62916 29976 35102 66059 100922 94792 40432
6702 40432 -38332 -68507 -56055 -72491 -38415 -25998 4326 27376 42369 1644 -32701 -28265
$$ packed form
6787B9003j1240m8557q055J1394J1444J568K8586J2803l7858N1987j532m0564
6775a021j1840m1729m6663Q8369K5649K5688j4789j0126l3030j684K9439J6521
6763B4784K6853k6825j0469j7855k3237l6201J8128k5610J9106K3358O0126L0798
6751F2956l3348K250K3676J2560l1499Q876J6025R800j10767m7609L1543J0615
6739d4922k1863m1992L3572L5167J8501k4149m2848O3729l9495K1076O8623M9236
6727G4635m1412j03606Q269M0516J7026k8341n407K7246m2631j5549N0845M9506
6715C1097P005j1269m336m694J4664N5182k4733l2940N126L0957L4863o130n4360
6702D0432p8764l0175J2452j6436L4076J2417L0324K3050J4993m0725l4345M436
$$ plain form
6690 -28265 -49264 -14583 -34310 -63457 -52345 -51030 -112032 -125007 -63005 -50891 -34486 17984
6678 17984 65179 100551 124493 99472 67476 5681 -19713 -31624 -26730 -19363 -41326 -65767
6666 -65767 -35789 46153 41695 15996 -37489 -33474 8082 711 -53481 -54776 -74443 -84052 -48212
6653 -48212 -56097 -61241 -62057 -44174 28679 40267 35594 13785 -10289 -10012 -42272 -97450 -72756
6640 -72756 -100494 -81064 -58595 -110423 -101123 -33579 -93474 -136948 -121537 -78255 -76625 -100337
6628 -100337 -87314 -89336 -31477 43385 36575 1689 -36580 -49672 -66323 -29998 39571 58069
6616 58069 123239 118314 43718 3414 -51450 -36858 21524 85182 61370 19779 4451 -5625
6604 -5625 3057 -51529 -26264 20206 44784 35520 -36496 -82303 -27923 26201 49146 24023
$$ packed form
6690b8265k0999L4681j9727k9147J1112J315o1002j2975O2002J2114J6405N2470
6678A7984M7195L5372K3942k5021l1996o1795k5394j1911M894P367k1963k4441
6666f5767K9978Q1942m458k5699n3485M015M1556p371n4192j295j9667r609L5840
6653d8212p885n144q16J7883P2853J1588m673k1809k4074K77l2260n5178K4694
6640g2756k7738J9430K2469n1828R300O7544n9895m3474J5411M3282J630k3712
6628a00337J3023k022N7859P4862o810l4886l8269j3092j6651L6325O9569J8498
6616E8069O5170m925p4596m0304n4864J4592N8382O3658k3812m1591j5328j0076
6604e625Q682n4586K5265M6470K4578r264p2016m5807N4380N4124K2945k5123
$$ plain form
6592 24023 -10914 -10953 -48724 -54357 -62924 -62999 2877 55839 73071 78093 65578 35143 17532 -40127
6578 -40127 5500 9765 50521 50404 6506 -25996 -73252 -6753 -1188 -41851 2240 7063 97279
6565 97279 54993 16022 66044 85156 105913 106232 29780 467 1370 5809 -40366 -104920 -85847
6552 -85847 -33736 -24431 -6279 -8133 -21013 -19948 46436 29765 18492 56895 81435 149812
6540 149812 164791 135409 43236 -40849 -8823 39326 49358 35253 77788 43981 903 -42732
6528 -42732 48782 100002 75098 74817 52612 12152 -3935 1738 1857 24268 -51535 -87297 -14484
6515 -14484 24725 106687 116795 101836 41257 19380 36540 6641 21351 -44729 -79564 -87570
6503 -87570 -147338 -137366 -74408 -37391 29095 21908 40522 35741 -23159 -2073 40120 42277 39947
$$ packed form
6592B4023l4937l9l7771n633q567p5O5876N2962J7232N022j2515l0435j7611n7659
6578d0127M5627M265M0756j17m3898l2502m7256O6499N565m0663M4091M823R0216
6565I7279m2286l8971N0022J9112K0757L19p6452k9313R03M439m6175o4554J9073
6552h5847N2111R305J8152j854j2880J065O6384j6671j1273L8403K4540O8377
6540A49812J4979k9382r2173q4085L2026M8149J0032j4105M2535l3807m3078m3635
6528d2732R1514N1220k4904k81k2205m0460j6087N673J19K2411p5803l5762P2813
6515a4484L9209Q1962J0108j4959o0579k1877J7160k9899J4710o6080l4835q006
6503h7570n9768R972O2958L7017O6486p187J8614m781n8900K1086M2193K157k330
$$ plain form
6490 39947 68662 67679 26450 20565 25630 51462 32682 18612 -19184 10249 20438 47779 59462
6477 59462 52665 -2182 -36148 -41471 -46038 250 50480 17886 -5130 8150 8139 7936 28622
6464 28622 18677 33830 34387 -5736 15462 92595 50489 29856 53805 -9007 -40078 27516
6452 27516 50246 51280 81875 71278 25941 20260 70880 42949 43756 67145 89582 96959 103070
6439 103070 64727 22802 30620 89912 128154 128452 85516 65760 62789 19398 -31595 -69115
6427 -69115 -44922 -51455 -30538 -9456 17922 26761 63123 73634 55527 -12768 -27674 -25417
6415 -25417 -18594 -45483 -14115 11976 -66305 -48686 -7721 -12250 8137 43630 14200 -1971
6403 -1971 15841 25935 22130 9572 1628 5080 -748 803 10032 -89504 -77775 -51417 6554
$$ packed form
6490C9947K8715r83m1229n885N065K5832j8780j4070l7796K9433J0189K7341J1683
6477E9462o797n4847l3966n323m567M6288N0230l2594k3016J3280j1k03K0686
6464B8622r945J5153N57m0123K1198P7133m2106k0633K3949o2812l1071O7594
6452B7516K2730J034L0595j0597m5337n681N0620k7931Q07K3389K2437P377O111
6439A03070l8343m1925P818N9292L8242K98m2936j9756k971m3391n0993l7520
6427f9115K4193o533K0917K1082K7378Q839L6362J0511j8107o8295j4906K257
6415b5417O823k6889L1368K6091p8281J7619M0965m529K0387L5493k9430j6171
6403a971J7812J0094l805j2558p944L452n828J551R229r9536J1729K6358N7971
$$ plain form
6390 6554 60203 31594 35691 34467 78376 37431 -59863 -61739 12463 7507 9885 29698 17065
6377 17065 28670 25685 -53204 -114787 -74567 2929 14326 -30295 3200 -4322 -50582 -75737
6365 -75737 -71465 -97601 -157885 -147109 -78077 -525 -10260 -42375 -20353 -70652 -56688 -50594
6353 -50594 -33820 -8676 42568 29256 -36015 -2292 -31821 22566 28783 -6297 -37353 -88153
6341 -88153 -64571 -2870 41851 43487 31399 48279 97141 127016 57007 -11411 40134 -6022
6329 -6022 -56223 -28539 -71070 -47026 29228 8359 -10096 25650 9480 -22969 -25896 -39429
6317 -39429 -52310 -8088 -4702 -39160 -72904 -7418 -7763 -51382 -62269 -15074 24862 1268
6305 1268 6564 10932 57547 -12714 -42020 -18517 -65052 -108512 -34294 18595 112716 149836
$$ packed form
6390F554N3649k8609M097j224M3909m0945r7294j876P4202m956K378J9813j2633
6377A7065J1605k985p8889o1583M0220P7496J1397m4621L3495p522m6260k5155
6365g5737M272k6136o0284J0776O9032P7552r735l2115K2022n0299J3964O094
6353e0594J6774K5144N1244j3312o5271L3723k9529N4387O217l5080l1056n0800
6341h8153K3582O1701M4721J636j2088J6880M8862K9875p0009o8418N1545m6156
6329f022n0201K7684m2531K4044P6254k0869j8455L5746j6170l2449k927j3533
6317c9429j2881M4222L386l4458l3744O5486l45m3619j0887M7195L9936k3594
6305A268N296M368M6615p0261k9306K3503m6535m3460P4218N2889R4121L7120
$$ plain form
6293 149836 130033 50175 -7172 4649 9781 3436 43513 3478 -30622 -70841 -78322 -57397
6281 -57397 -50621 25308 22368 59141 132436 112867 64409 33962 8535 -26431 -8391 3129
6269 3129 -16801 5384 -8817 -39315 -110151 -132969 -91998 -51743 -46837 -91858 -85099 -46695
6257 -46695 -50451 -80830 -88086 5732 28933 33682 5071 -21895 -39820 -25092 -38148 -2977
6245 -2977 37556 -10379 -53551 -62172 -38755 -24750 1853 44426 33106 34488 18268 27611 53546
6232 53546 2905 4846 -23742 -57386 -76776 -127977 -91469 -47671 14470 48296 17243 7501
6220 7501 64148 56748 30767 30761 21942 -7990 -35568 -18613 -22133 -7536 -14422 5423 23071 38799
6206 38799 -43268 -67628 13080 26701 36901 43628 7473 21424 -5933 -27994 8141 34463
$$ packed form
6293A49836j9803p9858n7347J1821N132o345M0077m0035l4100m0219p481K0925
6281e7397O776P5929k940L6773P3295j9569m8458l0447k5427l4966J8040J1520
6269C129j9930K2185j4201l0498p0836k2818M0971M0255M906m5021O759L8404
6257d6695l756l0379p256R3818K3201M749k8611k6966j7925J4728j3056L5171
6245b977M0533m7935m3172q621K3417J4005K6603M2573j1320J382j6220R343K5935
6232E3546n0641J941k8588l3644j9390n1201L6508M3798O2141L3826l1053r742
6220G501N6647p400k5981oq819k9932k7578J6955l520J4597o886J9845J7648J5728
6206C8799q2067k4360Q0708J3621J0200O727l6155J3951k7357k2061L6135K6322
$$ plain form
6194 34463 23794 35130 22474 -57182 -24424 -14747 -51663 -57281 -65963 -27632 13146 43543
6182 43543 79426 86823 80571 71063 83667 96132 91502 52769 -33378 -77968 -95583 -57154 16123
6169 16123 -29716 -48739 -41819 -53839 -56106 -33252 -72162 -142184 -105407 -4123 23584 -16289
6157 -16289 -24534 -5582 -18208 -30564 -80425 -90824 -97002 -88600 -51613 3230 11239 -14306 -3251
6144 -3251 -76990 -74123 -35372 -89614 -80460 -67340 -2234 53471 58207 27707 -908 -41423 7436
6131 7436 30369 -16523 6159 19697 39204 34858 39218 13468 40243 86035 38037 57221
6119 57221 6275 -5912 -27346 -100633 -89442 -37102 61270 49671 80914 127202 128848 84866
6107 84866 68505 19331 -89220 -82438 -46267 -65254 -78774 -33009 9853 20902 19543 50431
$$ packed form
6194C4463j0669J1336j2656p9656L2758R677l6916n618q682L8331M0778L0397
6182D3543L5883P397o252r508J2604J2465m630l8733q6147m4590j7615L8429P3277
6169A6123m5839j9023O920j2020k267K2854l8910p0022L6777J01284K7707l9873
6157a6289q245J8952j2626j2356m9861j0399o178Q402L6987N4843Q009k5545J1055
6144c251p3739K867L8751n4242R154J3120O5106N5705M736l0500k8615m0515M8859
6131G436K2933m6892K2682J3538J9507m346M360k5750K6775M5792m7998J9184
6119E7221n0946j2187k1434p3287J1191N2340R8372j1599L1243M6288J646m3982
6107H4866j6361m9174j08551O782L6171j8987j3520M5765M2862J1049j359L0888
$$ plain form
6095 50431 78587 69016 58586 -3871 1111 27925 -19938 -47514 -33093 -23595 -30138 -44445 -101189
6082 -101189 -52946 -11445 -18030 -48206 -72082 -38698 -7164 9046 981 -75684 -66486 -53511
6070 -53511 -36608 4480 -4135 -24925 -4852 14643 30877 62084 25139 -23810 25349 -480
6058 -480 -34998 -13121 -83228 -120697 -101835 -74028 -97934 -106977 -48825 -57148 1465 21898 -79141
6045 -79141 -95675 -74380 -39616 34676 73354 64826 11771 -4387 -1246 5082 25647 -1461
6033 -1461 6447 -2719 -89144 -97813 -77167 -42130 -32438 -34329 -34315 -12092 -8709 -27730 -51799 -40050
6019 -40050 31120 50411 19696 1929 3820 32906 6353 30393 35645 -13890 -13682 -21150 -34283
6006 -34283 -5328 -8489 -22225 -26852 -16084 12211 7972 -4440 34419 1077 -10740 2390
$$ packed form
6095E0431K8156r571j0430o2457M982K6814m7863k7576J4421R498o543j4307n6744
6082a01189M8243M1501o585l0176k3876L3384L1534J6210q065p6665R198J2975
6070e3511J6903M1088q615k0790K0073J9495J6234L1207l6945m8949M9159k5829
6058d80l4518K1877p0107l7469J8862K7807k3906r043N8152q323N8613K0433j01039
6045g9141j6534K1295L4764P4292L8678q528n3055j6158L141O328K0565k7108
6033a461P908r166q6425q669K0646L5037R692j891J4K2223L383j9021k4069J1749
6019d0050P1170J9291l0715j7767J891K9086k6553K4040N252m9535K08p468j3133
6006c4283K8955l161j3736m627J0768K8295m239j2412L8859l3342j1817J3130
$$ plain form
5994 2390 21625 35332 73010 69654 54686 14754 35136 52848 14217 -30684 10969 27022
5982 27022 -6073 28336 66588 61520 84238 91218 51206 -6004 -57625 -96734 -23321 1370
5970 1370 -28044 -62804 -84050 -33560 12911 81021 96836 38783 41301 59108 27123 -62284
5958 -62284 -42125 24560 57360 62216 52136 6094 481 38940 53560 56830 25069 39688
5946 39688 48149 -51637 -120730 -111579 -48521 -13766 19572 40519 70803 80898 14608 16864
5934 16864 53427 102296 84965 -9364 -55983 -34819 24749 84439 60799 20094 -28559 -52979
5922 -52979 -29970 -2134 -59331 -109143 -89673 -21355 -1254 30862 61049 68742 60213 8407
5910 8407 5152 -2251 13976 4141 -2434 2895 2006 25615 80243 111948 42539 313 33216
$$ packed form
5994B390J9235J3707L7678l356j4968l9932K0382J7712l8631m4901M1653J6053
5982B7022l3095L4409L8252n068K2718O980m0012n7210n1621l9109P3413K4691
5970A370k9414l4760k1246N0490M6471O8110J5815n8053K518J7807l1985q9407
5958f2284K0159O6685L2800M856j0080m6042n613L8459J4620L270l1761J4619
5946C9688Q461r9786o9093R151O3058L4755L3338K0947L0284J0095o6290K256
5934A6864L6563M8869j7331r4329m6619K1164N9568N9690k3640m0705m8653k4420
5922e2979K3009K7836n7197m9812J9470O8318K0101L2116L0187P693q529n1806
5910H407l255p403J6227r835o575N329q89K3609N4628L1705o9409m2226L2903
$$ plain form
5897 33216 10888 -29310 -129767 -177550 -121730 -88256 -108938 -117448 -85020 -95241 -70891 -66553
5885 -66553 -88910 -70034 -69880 -96957 -114376 -119066 -137930 -91392 -7605 10574 -16079 24926
5873 24926 68403 65013 14361 -27423 4659 9985 -41045 -13939 4795 67643 66576 44666
5861 44666 43675 82255 131738 90001 36440 -27186 -74483 -64117 1096 57492 58722 50444 -27231
5848 -27231 -88866 -41655 -32102 -57985 -79599 -76194 -63746 -7561 -44816 -105938 -99199 -38875
5836 -38875 7094 -85743 -145776 -152084 -111166 -99764 -105601 -104144 -99619 -49010 8099 5071 21779
5823 21779 11652 38262 54289 19431 -71494 -46191 -2458 18553 42938 73516 100095 2800
5811 2800 -43435 -33562 -31208 -51927 -55062 45885 79041 97075 85215 75049 60451 15705
$$ packed form
5897C3216k2328m0198j00457m7783N5820L3474k0682q510L2428j0221K4350M338
5885f6553k2357J8876J54k7077j7419m690j8864M6538Q3787J8179k6653M1005
5873B4926M3477l390n0652m1784L2082N326n1030K7106J8734O2848j067k1910
5861D4666r91L8580M9483m1737n3561o3626m7297J0366O5213N6396J230q278p7675
5848b7231o1635M7211R553k5883k1614L405J2448N6185l7255o1122O739O0324
5836c8875M5969r2837o0033o308M0918J1402n837J457M525N0609N7109l028J6708
5823B1779j0127K6610J6027l4858r0925K5303M3733K1011K4385L0578K6579r7295
5811B800m6235R873K354k0719l135J00947L3156J8034j1860j0166j4598m4746
$$ plain form
5799 15705 7655 7630 -5927 -23900 -42489 -58424 -61627 -99382 -110976 -65832 -82481 -110997 -82207
5786 -82207 -58213 -62752 -73448 -29308 -21786 -33497 -63405 -27156 -33032 -6012 9725 -16791
5774 -16791 66780 61626 76406 74064 -35146 -59868 -16421 42583 12407 -87877 -133352 -72036
5762 -72036 -26110 13013 -9727 -7201 33772 13135 -31568 -94143 -116269 -64779 -43531 -1048
5750 -1048 49443 34396 51347 41072 49801 93853 31249 -55559 -25037 -68094 -62031 -9405
5738 -9405 -27916 -50256 -50888 1954 42363 58833 67238 41228 15102 29969 4755 -32076 -72222
5725 -72222 -66889 -34634 -54302 -33905 50054 102884 88220 68623 35808 -21021 -18064 74935
5713 74935 134848 161498 103560 63464 70192 45428 40093 3134 8108 37656 7533 -33641
$$ packed form
5799A5705q050k5j3557j7973j8589j5935l203l7755j1594M5144j6649k8516K8790
5786h2207K3994m539j0696M4140P522j1711k9908L6249n876K7020J5737k6516
5774a6791Q3571n154J4780k342j09210k4722M3447N9004l0176j00284m5475O1316
5762g2036M5926L9123k2740K526M0973k0637m4703o2575k2126N1490K1248M2483
5750a048N0491j5047J6951j0275Q729M4052o2604q6808L0522m3057O063N2626
5738i405j8511k2340o32N2842M0409J6470Q405k6010k6126J4867k5214l6831m0146
5725g2222N333L2255j9668K0397Q3959N2830j4664j9597l2815n6829K957R2999
5713G4935N9913K6650n7938m0096O728k4764n335l6959M974K9548l0123m1174
$$ plain form
5701 -33641 -75657 22692 61494 49781 14704 -22068 3350 28800 67463 124398 84383 46261
5689 46261 16510 16581 -30546 -77261 -39290 -67788 -207445 -207005 -106520 -54851 -13075 -3057
5677 -3057 -46866 -20883 -52870 -65973 -76339 -19714 -19374 -81360 -108113 -39374 12965 33879
5665 33879 77920 68406 -10728 -5741 19291 -8895 -1074 9776 -39301 -24702 -74825 -116803
5653 -116803 -59966 73941 75494 10153 -29848 -42085 -29613 -6482 -70239 -106328 -89570 -119115
5641 -119115 -78104 -30594 -50305 -28901 12959 37184 7256 634 4576 -19424 -48084 -93368
5629 -93368 -84093 -49579 -88367 -61805 -22221 -51299 -53033 -8130 3323 -32155 -65568 -15772
5617 -15772 51449 61057 15583 35261 3243 -23584 -65233 -79548 -48843 2792 -40400 -28512
$$ packed form
5701c3641m2016R8349L8802j1713l5077l6772K5418K5450L8663N6935m0015l8122
5689D6261k9751P1m7127m6715L7971k8498j39657M40J00485N1669M1776J0018
5677c057m3809K5983l1987j3103j0366N6625L40o1986k6753O8739N2339K0914
5665C3879M4041r514p9134M987K5032k8186P821J0850m9077J4599n0123m1978
5653a16803N6837J33907J553o5341m0001j2237J2472K3131o3757l6089J6758k9545
5641a19115M1011M7510j9711K1404M1860K4225k9928o622L942k4000k8660m5284
5629i3368R275L4514l8788K6562L9584k9078j734M4903J1453l5478l3413M9796
5617a5772O7221R608m5474J9678l2018k6827m1649j4315L0705N1635m3192J1888
$$ plain form
5605 -28512 -30528 8147 13664 4304 47964 70869 141320 127771 123735 76021 29428 -53699 -39977
5592 -39977 -33300 -48296 -74708 -121449 -108156 -77582 -49674 -13402 14458 43162 53748 62989
5580 62989 45995 105260 73048 13086 13956 12960 16635 6579 6021 24004 60044 10482 -38367
5567 -38367 -25972 12149 80595 131658 101904 -647 8587 95974 111895 45190 -16308 -52014
5555 -52014 -76765 -100386 -66489 -41740 -45295 8460 54091 37786 36630 37177 44173 -2808 67887
5542 67887 105062 79156 89256 72286 -822 28965 82285 74146 66692 50708 13497 3239
5530 3239 -25786 -68028 -99430 -79461 -41147 -9279 -51934 -120221 -128544 -95218 -93302 -41225
5518 -41225 23470 -11688 -93644 -158162 -151518 -115427 -62716 -30092 -33985 -60762 -37098 -30735
$$ packed form
5605b8512k016L8675N517r360M3660K2905P0451j3549m036m7714m6593q3127J3722
5592c9977O677j4996k6412m6741J3293L0574K7908L6272K7860K8704J0586R241
5580F2989j6994N9265l2212n9962Q70r96L675j0056n58J7983L6040m9562m8849
5567c8367J2395L8121O8446N1063k9754j02551R234Q7387J5921o6705o1498l5706
5555e2014k4751k3621L3897K4749l555N3755M5631j6305j156N47O996m6981P0695
5542F7887L7175k5906J0100j6970p3108K9787N3320q139p454j5984l7211j0258
5530C239k9025m2242l1402J9969L8314L1868m2655o8287q323L3326J916N2077
5518d1225O4695l5158q1956o4518O644L6091N2711L2624l893k6777K3664O363
$$ plain form
5506 -30735 -64297 -49525 -52374 -21583 909 20370 -13955 -46416 -53518 -61719 -100735 -58156
5494 -58156 12678 78256 71144 134890 93454 48778 -54561 -74833 -70472 -26705 11729 -19514
5482 -19514 -13335 -27533 2233 73433 51443 4202 -9509 61381 134544 88052 33191 -21642
5470 -21642 -17366 -20214 -23751 16387 44631 2052 -15234 -22264 -24147 -59523 -20651 38875 64737
5457 64737 65093 12570 21076 80400 76893 26363 -22833 -14602 -41899 -37477 -27518 -40687 -31136
5444 -31136 17371 -15417 -99494 -83712 -86773 -92955 -41993 -3778 -14321 -11464 -9587 -29009 -19438
5431 -19438 -6637 -57342 -10273 -12363 -22457 -76510 -124659 -137198 -67931 -11841 1101 -54962
5419 -54962 -24109 -73578 -83620 -34052 -4628 -12542 -86873 -106337 -59747 2331 31529 -17403
$$ packed form
5506c0735l3562J4772k849L0791K2492J9461l4325l2461p102q201l9016M2579
5494e8156P0834O5578p112O3746m1436m4676j03339k0272M361M3767L8434l1243
5482a9514O179j4198K9766P1200k1990m7241j3711P0890P3163m6492n4861n4833
5470b1642M276k848l537M0138K8244m2579j7286p030j883l5376L8872N9526K5862
5457F4737L56n2523Q506N9324l507n0530m9196Q231k7297M422R959j3169R551
5444c1136M8507l2788q4077J5782l061o182N0962L8215j0543K857J877j9422R571
5431a9438J2801n0705M7069k090j0094n4053m8149j2539O9267N6090J2942n6063
5419e4962L0853m9469j0042M9568K9424p914p4331j9464M6590O2078K9198m8932
$$ plain form
5407 -17403 -12088 -50045 -35093 -3196 -83783 -106526 -74911 -43710 -20357 9036 87283 57899
5395 57899 70157 95573 41580 114800 176541 116135 -36082 -81309 -32573 -8418 22175 30444
5383 30444 3077 4140 72366 110628 137563 77075 57663 18641 -20453 30981 40326 29703
5371 29703 -19367 -19641 -7303 -40170 -66668 -45210 -42365 -28762 13153 41577 18151 40333
5359 40333 24117 -13416 48352 27712 31008 -8445 21303 -38 21255 52916 73723 51791
5347 51791 50585 -23091 -36004 -2010 607 -18144 -14164 2139 -16594 -13807 -7187 -39712 -102016
5334 -102016 -115480 -132073 -157751 -124301 -59851 -17240 -53880 -47484 -21015 16185 65299 70358
5322 70358 66360 35709 29178 -42978 -49275 -24335 -65794 -82277 -87585 -91131 -5905 5342 4815
$$ packed form
5407a7403N315l7957J4952L1897q0587k2743L1615L1201K3353K9393P8247k9384
5395E7899J2258K5416n3993P3220O1741o0406j52217m5227M8736K4155L0593Q269
5383C0444k7367J063O8226L8262K6935o0488j9412l9022l9094N1434R345j0623
5371B9703m9070k74J2338l2867k6498K1458K845J3603M1915K8424k3426K2182
5359D0333j6216l7533O1768k0640L296l9453K9748k1341K1293L1661K0807k1932
5347E1791j206p3676j2913L3994K617j8751L980J6303j8733K787O620l2525o2304
5334a02016j3464j6593k5678L3450O4450M2611l6640O396K6469L7200M9114N059
5322G0358l998l0651o531p2156o297K4940m1459j6483n308l546Q5226J1247n27
$$ plain form
5309 4815 -20344 -71705 -136608 -178792 -181291 -163825 -147743 -101145 -30598 11236 19470 36556
5297 36556 82105 45861 41768 59789 21078 -54053 -9165 -23061 -56465 -36721 -23405 9456
5285 9456 -17471 -11030 -1986 -16625 -50056 -52007 -66684 -91057 -116753 -91729 -49673 -40178 -118182
5272 -118182 -152253 -116691 -83481 -63811 -58206 -21122 7343 6125 -27095 -44118 -80792 -67791
5260 -67791 -38119 -69231 -81519 -83382 -41148 8310 82157 110074 78650 76240 2539 2845 9275
5247 9275 -1381 54873 46699 -16247 -66459 -63414 -96466 -100773 -75305 -37799 14831 62888 84060
5234 84060 38219 -19557 -24636 39445 91137 37928 -51469 -2822 65498 70632 62855 19560
5222 19560 23453 73151 62539 48559 12145 -34615 -14573 26974 28725 -17514 -33974 -66418
$$ packed form
5309D815k5159n1361o4903m2184k499J7466J6082M6598P0547M1834Q234J7086
5297C6556M5549l6244m093J8021l8711p5131M4888j3896l3404J9744J3316L2861
5285I456k6927O441R044j4639l3431j951j4677k4373k5696K5024M2056R495p8004
5272a18182l4071L5562L3210J9670N605L7084K8465j218l3220j7023l6674J3001
5260f7791K9672l1112j2288j863M2234M9458P3847K7917l1424k410p3701L06O430
5247I275j0656N6254q174o2946n0212L045l3052m307K5468L7506N2630M8057K1172
5234H4060m5841n7776n079O4081N1692n3209q9397M8647O8320N134p777m3295
5222A9560L893M9698j0612j3980l6414m6760K0042M1547J751m6239j6460l2444
$$ plain form
5210 -66418 -90644 -55181 -50798 -24775 75339 48516 27143 84074 43338 -9774 -93907 -109446
5198 -109446 -106613 -84167 -54071 -43413 -92809 -61156 28360 34088 -1257 -23872 -31952 -47859
5186 -47859 -64905 -39539 8758 31326 -7266 -33862 8575 22831 -23770 -33844 -55708 -21379
5174 -21379 -624 26785 -208 18135 67806 101335 49926 25211 71292 67326 70899 78236
5162 78236 70282 -34187 -64309 -37195 -15198 -8448 -25621 7469 -32178 -111930 -144353 -125998
5150 -125998 -35748 12931 1823 -17876 -9773 5477 64539 127585 83751 23401 12418 2919
5138 2919 -6568 -18321 -22501 -348 29900 -26461 -15064 59283 86111 47544 -49885 -92244
5126 -92244 -71421 11105 41821 32608 24441 -55407 -133009 -123266 -81862 -112679 -90364 -69855
$$ packed form
5210f6418k4226L5463M383K6023J00114k6823k1373N6931m0736n3112q4133j5539
5198a09446K833K2446L0096J0658m9396L1653Q9516N728l5345k2615q080j5907
5186d7859j7046K5366M8297K2568l8592k6596M2437J4256m6601j0074k1864L4329
5174b1379K0755K7409k6993J8343M9671L3529n1409k4715M6081l966L573P337
5162G8236p954j04469l0122K7114K1997O750j7173L3090l9647p9752l2423J8355
5150a25998R0250M8679j1108j9699Q103J5250N9062O3046m3834o0350j0983r499
5138B919r487j1753m180K2153L0248n6361J1397P4347K6828l8567r7429m2359
5126i2244K0823Q2526L0716r213q167p9848p7602R743M1404l0817K2315K0509
$$ plain form
5114 -69855 -117356 -122397 -65748 58091 109251 118140 -2322 -75888 -39210 15955 28429 38658
5102 38658 90741 73154 90051 71805 5490 -39366 -41677 -6201 -22158 14293 59933 40667
5090 40667 29621 -20197 -95252 -61153 6506 78305 81794 5117 -22184 -40846 -41091 -3047
5078 -3047 -58341 -78594 -49530 -32847 -118986 -125795 -52987 -24833 5498 5135 -48050 -40038 -11440
5065 -11440 -10826 17998 31155 4308 -63725 -45086 38749 61352 6975 -6334 -7603 18496
5053 18496 6924 -8179 -37588 -27135 -48930 -39501 -64781 -98273 -73783 -118417 -95737 -80469
5041 -80469 -33816 11460 13257 43486 21699 545 -82028 -52421 7590 28573 42872 49122
5029 49122 -5042 -64233 -41607 31304 81807 18913 13885 -2915 4846 -5601 -9293 -14589 13011
$$ packed form
5114f9855m7501n041N6649J23839N1160Q889j20462p3566L6678N5165J2474J0229
5102C8658N2083j7587J6897j8246o6315m4856k311L5476j5957L6451M5640j9266
5090D0667j1046m9818p5055L4099O7659P1799L489p6677k7301j8662k45L8044
5078c047n5294k0253K9064J6683q6139o809P2808K8154L0331l63n3185Q012K8598
5065a1440O14K8824J3157k6847o8033J8639Q3835K2603n4377j3309j269K6099
5053A8496j1572j5103k9409J0453k1795R429k5280l3492K4490m4634K2680J5268
5041h0469M6653M5276J797L0229k1787k1154q2573K9607O0011K0983J4299O250
5029D9122n4164n9191K2626P2911N0503o2894n028j6800P761j0447l692n296K7600
$$ plain form
5016 13011 71122 61681 -17753 -31629 22081 57360 17166 -10306 -43193 -82714 -95377 -114348
5004 -114348 -81343 -76042 -27764 115 -73011 -42932 -26083 12029 33287 -16636 -41024 -12335
4992 -12335 -7529 32357 33091 26954 95 6949 22740 62108 43393 -14521 5749 24034 -16243
4979 -16243 -23963 -10965 17391 5204 -27407 50217 50134 23905 -12894 -4603 -36709 -43736 -14939
4966 -14939 28749 13291 20324 43609 55772 62774 77671 20426 -3744 4906 19237 62890
4954 62890 -9084 -26230 -6346 9983 -42334 -54605 -66010 7115 5322 -5846 -48395 -149243
4942 -149243 -155335 -76055 -40538 653 -64713 -47210 2335 8433 -3721 -60582 -72592 -3505
4930 -3505 5636 -18354 13861 13390 45052 66446 -14035 -130531 -122115 -58643 -36590 -42348 -72969
$$ packed form
5016A3011N8111r441p9434j3876N3710L5279m0194k7472l2887l9521j2663j8971
5004a14348L3005N301M8278K7879p3126L0079J6849L8112K1258m9923k4388K8689
4992a2335M806L9886P34o137k6859O854J5791L9368j8715n7914K0270J8285m0277
4979a6243p720J2998K8356j2187l2611P7624q3k6229l6799Q291l2106p027K8797
4966a4939M3688j5458P033K3285J2163P002J4897n7245k4170Q650J4331M3653
4954F2890p1974j7146J9884J6329n2317j2271j1405P3125j793j1168m2549j00848
4942a49243o092P9280L5517M1191o5366J7503M9545O098j2154n6861j2010O9087
4930c505R141k3990L2215m71L1662K1394q0481j16496Q416O3472K2053n758l0621
$$ plain form
4917 -72969 -40706 -51845 -58904 -25751 -21583 -74127 -64933 -9608 -13781 -23843 22077 54427 23301
4904 23301 944 3402 -80013 -80020 -36113 -33855 -39135 -69824 -64257 -35535 -35974 -48297 -57621 -21576
4890 -21576 -38664 -8150 14810 17710 59249 41918 51610 65194 89397 64704 60149 36862
4878 36862 15874 9744 61240 72137 109107 114887 143943 157305 95442 58481 48362 43366
4866 43366 -41584 -126524 -98133 -66106 -150925 -111048 -82218 -70614 4524 7872 -81722 -31247
4854 -31247 31851 30066 -884 -15354 -35245 -45458 31142 106395 42512 -27135 -51102 -1014
4842 -1014 16717 -2021 -32609 -12655 -2230 -37466 -21448 -39685 -33631 -21047 -39148 -75444
4830 -75444 -104421 -79334 2210 -56064 -53916 -54819 -32766 -24999 -30910 -59029 -121869 -68616 -88574
$$ packed form
4917g2969L2263j1139p059L3153M168n2544R194N5325m173j0062M5920L2350l1126
4904B3301k2357K458q3415pM3907K258n280l0689N567K8722m39j2323r324L6045
4890b1576j7088L0514K2960K900M1539j7331R692J3584K4203k4693m555k3287
4878C6862k0988o130N1496J0897L6970N780K9056J3362o1863l6961j0119m996
4866D3366q4950q4940K8391L2027q4819L9877K8830J1604P5138L348q9594N0475
4854c1247O3098j785l0950j4470j9891j0213P6600P5253o3883o9647k3967N0088
4842a014J7731j8738l0588J9954J0425l5236J6018j8237O054J2584j8101l6296
4830g5444k8977K5087Q1544n8274K148r03K2053P767n911k8119o2840N3253j9958
$$ plain form
4817 -88574 -87326 -17187 -9006 -73529 -66202 -12023 2158 58822 66920 45577 9542 -45487 -60765
4804 -60765 -5079 75431 67415 -14614 -77185 -94112 -75557 -19386 27546 44506 23134 18784
4792 18784 2209 -12137 -66388 -70924 -12299 1408 -21172 -7836 14669 8648 -44099 3249
4780 3249 7667 -26294 -36790 -56903 -69771 -93738 -104412 -97627 -56468 -15959 12115 51555
4768 51555 26966 -15456 -65521 -87358 -85981 -101441 -93051 -17879 -309 4960 31117 29224 -26580
4755 -26580 -3107 -38614 -1515 -32023 -81715 -63556 -73536 -46616 -25096 -41459 -53402 -47497
4743 -47497 -32439 13769 41893 18206 15978 20755 17144 39325 -2380 -57388 -101741 -136581
4731 -136581 -134629 -84814 -26396 1820 -36353 -66907 -25803 16337 68753 24912 9856 -38983
$$ packed form
4817h8574J248P0139Q181o4523P327N4179J4181N6664Q098k1343l6035n5029j5278
4804f0765N5686Q0510q016q2029o2571j6927J8555N6171M6932J6960k1372m350
4792A8784j6575j4346n4251m536N8625J3707k2580J3336K2505o021n2747M7348
4780C249M418l3961j0496k0113j2868k3967j0674O785M1159M0509K8074L9440
4768E1555k4589m2422n0065k1837J377j5460Q390P5172J7570N269K6157j893n5804
4755b6580K3473l5507L7099l0508m9692J8159r980K6920K1520j6363j1943N905
4743d7497J5058M6208K8124k3687k228M777l611K2181m1705n5008m4353l4840
4731a36581J952M9815N8418K8216l8173l0554M1104M2140N2416m3841j5056m8839
$$ plain form
4719 -38983 -61796 -23623 -12655 -38956 -39189 -24210 -15995 -24197 -69793 -96381 -85241 -101098 -137760
4706 -137760 -101434 -100328 -106055 -89999 -94514 -38724 40475 26333 -29784 -33795 38945 40303 -21911
4693 -21911 -1911 -22707 -32590 -82715 -19087 7072 43090 64802 -6843 -74812 -69366 -4227
4681 -4227 22899 67819 64609 88221 65767 37739 23818 41238 -3104 -18529 9923 -9045
4669 -9045 -60757 -54140 -13501 -11497 -54684 -37044 -37701 -80174 -119555 -91626 -58813 -19234 -26138
4656 -26138 9114 34473 25392 -27011 -22097 -26038 -35229 -60656 -87358 -59032 -18428 24211 72793
4643 72793 121332 75156 43196 21182 -35186 -36247 23532 13959 26293 10927 -20782 -50557
4631 -50557 -117047 -187348 -114472 -50978 32677 55501 23746 2452 -31423 23549 44703 78198
$$ packed form
4719c8983k2813L8173J0968k6301k33J4979Q215q202m5596k6588J1140j5857l6662
4706a37760L6326J106n727J6056m515N5790P9199j4142n6117m011P2740J358o2214
4693b1911K0000k0796r883n0125O3628K6159L6018K1712p1645o7969N446O5139
4681d227K7126M4920l210K3612k2454k8028j3921J7420m4342j5425K8452j8968
4669i045n1712O617M0639K004m3187J7640o57m2473l9381K7929L2813L9579o904
4656b6138L5252K5359r081n2403M914l941r191k5427k6702K8326M0604M2639M8582
4643G2793M8539m6176l1960k2014n6368j061N9779r573J2334j5366l1709k9775
4631e0557o6490p0301P2876O3494Q3655K2824l1755k1294l3875N4972K1154L3495
$$ plain form
4619 78198 55719 18310 -39098 -100494 -28006 -33702 -53889 -69590 -34513 18043 27533 29243
4607 29243 2801 -18040 -49086 -62885 -27369 -41538 -168447 -204525 -76623 13203 42805
4596 42805 15585 -3186 -15150 -73816 -59638 -39243 -25492 -15525 -62550 -87844 -74307 -65395
4584 -65395 -40391 -42210 1334 19252 -11921 51484 -1152 -75102 -78759 -44163 -36864 15923
4572 15923 27812 21676 56152 8989 -71225 -103866 -107382 -48343 12851 -5601 -35059 -31404
4560 -31404 -47020 -39149 25894 6368 -37615 -15915 -59017 -115734 -131656 -92272 -54167 -19708
4548 -19708 -55069 -145809 -157399 -97700 -59359 -24359 -28487 -68161 -103808 -64256 -20632 -101169
4536 -101169 -140029 -86598 -13792 11560 15547 37279 15775 25869 7319 1580 -16820 -22245
$$ packed form
4619G8198k2479l7409n7408o1396P2488n696k0187j5701L5077N2556R490J710
4607B9243k6442k0841l1046j3799L5516j4169j26909l6078J27902Q9826K9602
4596D2805k7220j8771j1964n8666J4178K0395J3751R967m7025k5294J3537Q912
4584f5395K5004j819M3544J7918l1173O3405n2636p3950l657L4596P299N2787
4572A5923J1889o136L4476m7163q0214l2641l516N9039O1194j8452k9458L655
4560c1404j5616P871O5043j9526m3983K1700m3102n6717j5922L9384L8105L4459
4548a9708l5361r0740j1590N9699L8341L5000m128l9674l5647L9552M3624q0537
4536a01169l8860N3431P2806K5352L987K1732k1504J0094j8550n739j8400n425
$$ plain form
4524 -22245 -32917 -6693 36212 23203 14457 21171 -27787 -56273 -42678 -5448 -70390 -58293
4512 -58293 -15251 -13009 29945 65298 62561 2177 -25430 4795 -37020 94 49264 38949
4500 38949 -18980 -33653 -44861 -34580 -13892 -38652 -11349 -482 -70856 -114681 -80424 -47156
4488 -47156 -34496 -34027 -49990 -33930 -54642 -32681 18008 12974 -57995 -71481 -10317 13183
4476 13183 -28742 -73485 -85385 -89349 -49946 -16034 72768 108484 94083 24987 7508 73067
4464 73067 47232 -15855 -77879 -91356 -72813 -47489 5257 -35496 -46013 -12488 53048 105031
4452 105031 20737 -57693 -86319 -19421 -11121 -24589 -12713 6658 24460 42821 32657 13520
4440 13520 17953 -18924 -3037 -32743 -65272 -26592 10331 49459 -18810 -92199 -142596 -154981
$$ packed form
4524b2245j0672K6224M2905j3009q746O714m8958k8486J3595L7230o4942J2097
4512e8293M3042K242M2954L5353k737o0384k7607L0225m1815L7114M9170j0315
4500C8949n7929j4673j1208J0281K0688k4760K7303J0867p0374m3825L4257L3268
4488d7156J2660M69j5963J6060k0712K1961N0689n034p0969j3486O1164K3500
4476A3183m1925m4743j1900l964L9403L3912Q8802L5716j4401o9096j7479O5559
4464G3067k5835o3087o2024j3477J8543K5324N2746m0753j0517L3525O5536N1983
4452A05031q4294p8430k8626O6898Q300j3468J1876J9371J7802J8361j0164j9137
4440A3520M433l6877J5887k9706l2529L8680L6923L9128o8269p3389n0397j2385
$$ plain form
4428 -154981 -89950 -127962 -170893 -219962 -203191 -125945 -61685 -35414 -49833 -92723 -120628 -116018
4416 -116018 -46260 -49115 -126929 -138730 -123144 -115954 -144022 -125278 -44844 21678 13605 36931
4404 36931 49518 19453 4972 9050 33597 41354 44091 73512 90175 90422 51259 55853 70769
4391 70769 116277 120810 51977 -14646 -55335 -100334 -100987 -47025 -33426 -73143 -121472 -93905
4379 -93905 -51255 22542 50426 76263 56729 6420 -14965 -7268 33819 -11199 -26236 4305
4367 4305 -63154 -56640 -41255 -62363 -37093 -14209 4078 -1450 20739 14853 -57319 -86228 -81588
4354 -81588 -76211 -46166 7296 -30236 -78390 -82391 -74869 -80953 -70564 -8946 33239 23814 -60386
4341 -60386 -75654 -54032 -40812 -101531 -103872 -73169 7423 -38751 -16172 27917 48749 56822
$$ packed form
4428a54981O5031l8012m2931m9069J6771P7246O4260K6271j4419m2890k7905M610
4416a16018O9758k855p7814j1801J5586P190k8068J8744Q0434O6522q073K3326
4404C6931J2587l0065j4481M078K4547P757K737K9421J6663K47l9163M594J4916
4391G0769M5508M533o8833o6623m0689m4999o53N3962J3599l9717m8329K7567
4379i3905M2650P3797K7884K5837j9534n0309k1385P697M1087m5018j5037L0541
4367D305o7459O514J5385k1108K5270K2884J8287n528K2189n886p2172k8909M640
4354h1588N377L0045N3462l7532m8154m001P522o084J0389O1618M2185r425q4200
4341f0386j5268K1622J3220o0719k341L0703Q0592m6174K2579M4089K0832Q073
$$ plain form
4329 56822 49282 -17683 -6659 32160 47173 -6609 -30105 -1960 16339 16250 21411 -12914 -22345
4316 -22345 -7060 -17647 27127 28839 8892 -18090 -103010 -140224 -34965 59293 56406 22324
4304 22324 21216 -19412 -52981 -4325 25686 64965 90866 41753 -25526 -43713 -45695 -23224
4292 -23224 39803 24508 -41419 -86806 -56198 -60778 -118249 -50047 5477 -35646 -70087 -65810
4280 -65810 -83723 -78338 -24940 -25995 -33438 -34479 -28070 -17337 -15370 -17278 -11054 11100 -29883
4267 -29883 -7413 -25570 -38545 -86712 -108131 -44376 21770 53094 27257 -17356 -9016 75134
4255 75134 109594 104820 76719 36423 22644 14390 1937 -28825 -71178 -65700 -1708 11969
4243 11969 50901 18939 -72439 -41694 25981 51254 55363 33151 11726 13913 -14885 -25910
$$ packed form
4329E6822p540o6965J1024L8819J5013n3782k3496K8145J8299q9N161l4325r431
4316b2345J5285j0587M4774J712j9947k6982q4920l7214J05259R4258k887l4082
4304B2324j108m0628l3569M8656L0011L9279K5901m9113o7279j8187j982K2471
4292b3224O3027j5295o5927m5387L0608m580n7471O8202N5524m1123l4441M277
4280f5810j7913N385N3398j055p443j041O409J0733J967j908O224K2154m0983
4267b9883K2470j8157j2975m8167k1419O3755O6146L1324k5837m4613Q340Q4150
4255G5134L4460m774k8101m0296j3779q254j2453l0762m2353N478O3992J3677
4243A1969L8932l1962r1378L0745O7675K5273M109k2212k1425K187k8798j1025
$$ plain form
4231 -25910 -20406 -63101 -112206 -92240 -61946 -24870 -33889 -16652 14372 953 -30286 820
4219 820 62733 34999 34524 51661 -13411 -51857 -22015 28109 37474 33085 -13259 1286 2194
4206 2194 -18591 -35023 -45665 -23963 -70493 -58423 -47494 -4091 36152 43463 96319 72199
4194 72199 17768 28339 32637 59143 119029 53374 48178 73834 37485 -5445 -2470 58305
$$ packed form
4231b5910N504m2695m9105J9966L0294L7076r019J7237L1024j3419l1239L1106
4219H20O1913k7734m75J7137o5072l8446K9842N0124R365m389m6344J4545R08
4206B194k0785j6432j0642K1702m6530J2070J0929M3403M0243P311N2856k4120
4194G2199n4431J0571M298K6506N9886o5655n196K5656l6349m2930K975O0775
$$ [...]
##END NTUPLES=NMR SPECTRUM
##END=
