##TITLE=Analysis number 317968
Compound Code gk 00323
Book Reference 196/154/2
Project Code adrs
Chemist Name jimp
##JCAMPDX= 6.0         $$ Bruker NMR JCAMP-DX V2.0
##DATA TYPE= NMR SPECTRUM
##DATA CLASS= NTUPLES
##ORIGIN= Bruker BioSpin GmbH
##OWNER= nmr
$$ XWIN-NMR		Version 3.5
$$ Thu Mar  9 09:54:57 2006 GMT Standard Time (UT+0h)  MAYBRIDGE\nmr@NMR_250MHZ
##.OBSERVE FREQUENCY= 250.131544655141
##.OBSERVE NUCLEUS= ^1H
##.ACQUISITION MODE= SIMULTANEOUS (DQD)
##.ACQUISITION SCHEME= undefined
##.AVERAGES= 16
##.DIGITISER RES= 18
##SPECTROMETER/DATA SYSTEM= dpx250
##.PULSE SEQUENCE= zg30
##.SOLVENT NAME= CDCl3
##.SHIFT REFERENCE= (INTERNAL, CDCl3, 0, 16.4691)
##AUDIT TRAIL= $$ (NUMBER, WHEN, WHO, WHERE, WHAT)
$$ ##TITLE= Audit trail, XWIN-NMR		Version 3.5
$$ ##JCAMPDX= 5.01
$$ ##ORIGIN= Bruker BioSpin GmbH
$$ ##OWNER= nmr
$$ C:\u/data/dgb/nmr/ADRS/370/pdata/1/auditp.txt
$$ ##AUDIT TRAIL=  $$ (NUMBER, WHEN, WHO, WHERE, WHAT)
(   1,<2006-03-09 09:54:31.05 +000>,<MAYBRIDGE\nmr>,<NMR_250MHZ>,
      <created by zg, POWCHK disabled, PULCHK disabled
       configuration hash MD5:
       84 BC 41 DB A1 6E 1D 46 DA 25 12 A5 C1 ED C5 3A
       data hash MD5: 64K
       5C 83 3D C9 41 73 96 6B A9 C4 1F 96 CA C7 62 47>)
(   2,<2006-03-09 09:54:46.71 +000>,<MAYBRIDGE\nmr>,<NMR_250MHZ>,
      <Start of raw data processing
       ef LB = 0.3 FT_mod = 6 PKNL = 1 SI = 32K 
       data hash MD5: 32K
       14 A6 AC 75 17 34 65 1F 58 B4 84 33 E7 A3 27 E8>)
(   3,<2006-03-09 09:54:48.26 +000>,<MAYBRIDGE\nmr>,<NMR_250MHZ>,
      <apk 
       data hash MD5: 32K
       99 9D 2D 2B 43 C8 DA 5B 95 8B 01 A2 4E 0A 67 82>)
(   4,<2006-03-09 09:54:49.01 +000>,<MAYBRIDGE\nmr>,<NMR_250MHZ>,
      <abs ABSG = 5 
       data hash MD5: 32K
       E6 1F 41 E0 24 55 C8 9D D3 B9 AF 5D A0 16 94 31>)
$$ ##END=
$$ 
$$ hash MD5
$$ E2 BB 96 7A BD 0C 07 F6 D4 A8 A0 4F D8 AA 6E 90
##$RELAX= 
##$RELAX= 
##$RELAX= 
##$RELAX= 
##$RELAX= 
##$RELAX= 
##$RELAX= 
$$ Bruker specific parameters
$$ --------------------------
##$DU= <C:\u>
##$EXPNO= 370
##$NAME= <ADRS>
##$PROCNO= 1
##$TYPE= <nmr>
##$USER= <dgb>
##$AMP= (0..31)
100 100 100 100 100 100 100 100 100 100 100 100 100 100 100 100 100 100 
100 100 100 100 100 100 100 100 100 100 100 100 100 100 
##$AQSEQ= 0
##$AQ_mod= 3
##$AUNM= <au_zg>
##$AUTOPOS= <9 >
##$BF1= 250.13
##$BF2= 250.13
##$BF3= 250.13
##$BF4= 250.13
##$BF5= 500.13
##$BF6= 500.13
##$BF7= 500.13
##$BF8= 500.13
##$BYTORDA= 1
##$CFDGTYP= 0
##$CFRGTYP= 5
##$CHEMSTR= <none>
##$CNST= (0..31)
1 1 145 1 1 1 1 1 1 1 1 1 1 1 1 1 1 1 1 1 1 1 1 1 1 1 1 1 1 1 1 1 
##$CPDPRG= <>
##$CPDPRG1= <>
##$CPDPRG2= <>
##$CPDPRG3= <>
##$CPDPRG4= <mlev>
##$CPDPRG5= <mlev>
##$CPDPRG6= <mlev>
##$CPDPRG7= <mlev>
##$CPDPRG8= <mlev>
##$CPDPRGB= <>
##$CPDPRGT= <>
##$D= (0..31)
0 1 0 0 0 0 0 0 0 0.06 0 0 0 0 0 0 0.0002 0 0 0 0 0 0 0 0 0 0 0 0 0 0 
0 
##$DATE= 1141898070
##$DBL= (0..7)
120 120 120 120 120 120 120 120 
##$DBP= (0..7)
150 150 150 150 150 150 150 150 
##$DBP07= 0
##$DBPNAM0= <>
##$DBPNAM1= <>
$$ [...]
##$SUBNAM7= <"">
##$SUBNAM8= <"">
##$SUBNAM9= <"">
##$SW= 20.6930455092707
##$SWIBOX= (0..15)
0 0 3 0 0 0 0 0 0 0 0 0 0 0 0 0 
##$SW_h= 5175.983436853
##$TD= 65536
##$TD0= 1
##$TE= 294.16
##$TE2= 300
##$TE3= 300
##$TEG= 300
##$TL= (0..7)
0 120 120 120 120 120 120 120 
##$TP= (0..7)
150 150 150 150 150 150 150 150 
##$TP07= 0
##$TPNAME0= <>
##$TPNAME1= <>
##$TPNAME2= <>
##$TPNAME3= <>
##$TPNAME4= <>
##$TPNAME5= <>
##$TPNAME6= <>
##$TPNAME7= <>
##$TPOAL= (0..7)
0.5 0.5 0.5 0.5 0.5 0.5 0.5 0.5 
##$TPOFFS= (0..7)
0 0 0 0 0 0 0 0 
##$TUNHIN= 0
##$TUNHOUT= 0
##$TUNXOUT= 0
##$USERA1= <user>
##$USERA2= <user>
##$USERA3= <user>
##$USERA4= <user>
##$USERA5= <user>
##$V9= 5
##$VALIST= <valist>
##$VCLIST= <CCCCCCCCCCCCCCC>
##$VD= 0
##$VDLIST= <DDDDDDDDDDDDDDD>
##$VPLIST= <PPPPPPPPPPPPPPP>
##$VTLIST= <TTTTTTTTTTTTTTT>
##$WBST= 1024
##$WBSW= 4
##$XGAIN= (0..3)
0 0 0 0 
##$XL= 0
##$YL= 0
##$YMAX_a= 594058
##$YMIN_a= -708817
##$ZGOPTNS= <>
##$ZL1= 120
##$ZL2= 120
##$ZL3= 120
##$ZL4= 120
##$ABSF1= 16.46908
##$ABSF2= -4.224092
##$ABSG= 5
##$ABSL= 3
##$ALPHA= 0
##$AQORDER= 0
##$ASSFAC= 0
##$ASSFACI= 0
##$ASSFACX= 0
##$ASSWID= 0
##$AUNMP= <proc_1d>
##$AZFE= 0.1
##$AZFW= 0.1
##$BCFW= 0
##$BC_mod= 0
##$BYTORDP= 0
##$COROFFS= 0
##$CY= 12.5
##$DATMOD= 1
##$DC= 0
##$DFILT= <>
##$DTYPP= 0
##$F1P= 14.0000005364418
##$F2P= -0.99999901652339
##$FCOR= 0.5
##$FTSIZE= 32768
##$FT_mod= 6
##$GAMMA= 0
##$GB= 0
##$INTBC= 1
##$INTSCL= 1
##$ISEN= 128
##$LB= 0.3
##$LEV0= 0
##$LPBIN= 0
##$MAXI= 10000
##$MC2= 0
##$MEAN= 0
##$ME_mod= 0
##$MI= 0
##$NCOEF= 0
##$NC_proc= -2
##$NLEV= 6
##$NOISF1= 0
##$NOISF2= 0
##$NSP= 0
##$NTH_PI= 0
##$NZP= 0
##$OFFSET= 16.46908
##$PC= 1
##$PHC0= 170.3188
##$PHC1= 5.294038
##$PH_mod= 1
##$PKNL= yes
##$PPARMOD= 0
##$PSCAL= 4
##$PSIGN= 0
##$REVERSE= no
##$SF= 250.130013235851
##$SI= 32768
##$SIGF1= 0
##$SIGF2= 0
##$SINO= 400
##$SIOLD= 32768
##$SREGLST= <1H.CDCl3>
##$SSB= 0
##$STSI= 32768
##$STSR= 0
##$SW_p= 5175.98343685301
##$SYMM= 0
##$S_DEV= 0
##$TDeff= 65536
##$TDoff= 0
##$TI= <Analysis number 999999
Compound Code 99
Book Reference 9
Project Code 9>
##$TILT= no
##$TM1= 0
##$TM2= 0
##$TOPLEV= 0
##$USERP1= <user>
##$USERP2= <user>
##$USERP3= <user>
##$USERP4= <user>
##$USERP5= <user>
##$WDW= 1
##$XDIM= 32768
##$YMAX_p= 292876956
##$YMIN_p= -44923
$$ End of Bruker specific parameters
$$ ---------------------------------
##NTUPLES= NMR SPECTRUM
##VAR_NAME=  FREQUENCY,     SPECTRUM/REAL,   SPECTRUM/IMAG
##SYMBOL=    X,             R,               I
##VAR_TYPE=  INDEPENDENT,   DEPENDENT,       DEPENDENT
##VAR_FORM=  AFFN,          ASDF,            ASDF
##VAR_DIM=   32768,         32768,           32768
##UNITS=     HZ,            ARBITRARY UNITS, ARBITRARY UNITS
##FACTOR=    0.157963299565203, 1,           1
##FIRST=     4119.41119120693, 0,            0
##LAST=      -1056.57224564608, 0,           0
##MIN=       -1056.57224564608, -44923,      0
##MAX=       4119.41119120693, 292876956,    0
$$ Real data points
##PAGE= N=1
##DATA TABLE= (X++(R..R)), XYDATA
$$ [...]
23537 -1155 10437 7831 13333 21157 23039 10761 -2687 -651 -6372 -17703 -11923 -4331 -6715 -13017
23523 -13017 -13143 -7240 -5151 -10278 2005 11759 3834 3523 6926 12074 6930 5512 6352 1621 -12000
23508 -12000 -17559 -11679 2860 9979 6016 -11858 -987 7339 1376 4417 12739 8421 6460 -7162
23494 -7162 -12213 -9664 3305 10264 11380 13277 12948 5971 -9180 -22229 -5196 5303 1809 7595
23480 7595 -9254 -17120 -15996 -3794 6230 19969 21595 15115 2184 -8027 -12504 -18250 -27147
23467 -27147 -27220 -13744 -21555 -23851 -5785 -636 -680 -5228 -11184 -6374 -1945 -2701 -9896 -2103 11168
23452 11168 17939 16309 23509 22679 15409 10822 9268 4084 -5278 -10749 -10717 -6432 -13878 -30297 -29307
23437 -29307 -15255 -7058 2046 1901 9084 11885 11598 7924 -3540 -4983 2730 12113 17460 5805
23423 5805 -12305 -18753 -17465 -20902 -17408 -13841 -7106 -8473 -197 7625 1483 427 -2931 -4422
23409 -4422 -2458 -2798 -14409 -1920 19009 15225 13429 12363 2435 117 3595 9979 6635 -414
23395 -414 5564 11931 5223 1153 9533 17918 17601 14053 7116 9983 11543 11218 -1849 -8920 -12881
23380 -12881 -12088 836 8338 8468 6479 2425 -8148 -971 5589 -6702 -13806 -7664 391 1767
23366 1767 -3367 -1117 -11109 -18130 -25120 -27668 -12552 -14127 -19147 -5928 -1702 -2678 2611 3907
23352 3907 1703 6418 3951 2525 4472 12881 8907 1659 -4105 219 -2959 -6037 -6796 -5778 -3908
23337 -3908 10822 17394 10179 -3321 1983 8173 3850 8080 16587 7902 4764 13648 26943 25608
23323 25608 12843 14740 21711 16130 1432 -7485 -7127 -16116 -19663 -17952 -7009 -1921 -8453 -1598
23309 -1598 -1543 16006 19440 15002 4549 7127 7793 2398 6124 -6435 -11874 -11559 -11626 -9340 -3702
23294 -3702 5142 10145 21573 13951 2360 -5012 -19759 -23470 -13107 -15876 -11920 -6086 -5315 -11994
23280 -11994 -8331 -8493 -13385 -11378 1911 -1864 205 2132 4343 -908 -2627 -5658 -3893 -248
23266 -248 -11448 -2308 -938 -4911 -5207 -8954 -8198 -2371 8540 5220 -7293 -1884 1296 -8128 -2139
23251 -2139 7339 711 2050 1498 -11058 -4150 10342 18344 16539 -4473 -9391 -13655 -9458 8543
23237 8543 7787 -2760 -10478 -16281 -16248 -2907 17561 16750 11355 21563 26489 27057 20932 12736 523
23222 523 8417 13565 12439 10977 8874 14342 5672 -3427 -11898 -16419 -23044 -20591 -8606 -2107 -3615
23207 -3615 1176 3567 6264 14384 2042 -7520 5688 12463 8301 565 -6081 -1205 -4484 -5817
23193 -5817 4868 17208 12076 6226 2315 10825 5908 7964 8856 4915 15686 9514 3718 8078
23179 8078 -1215 7275 12370 13713 9082 7577 16496 19763 40803 45517 32482 18145 -4576 -16353
23165 -16353 -19192 -9489 -827 4693 9246 13382 15304 -8188 -20380 -12812 -3524 1421 3436 1064
23151 1064 -3750 -2974 -3428 -11647 -11010 -9820 -12546 -19833 -6524 6631 10715 831 660 1288 -1071
23136 -1071 3866 4375 -2217 -1154 -12564 -22049 -11617 -10101 -8209 2632 10862 23403 26108 16890
23122 16890 15478 10833 12781 8357 4124 -11671 -8068 -4896 -5164 -9356 -16371 -8560 -1414 -3922
23108 -3922 2763 8711 8367 8782 9100 679 2917 -5544 -8856 -6155 2184 -2036 -5572 -8144 -5183
23093 -5183 -6639 -385 -3921 -2975 8615 -2599 -8545 -2176 389 -6701 -16837 -31084 -30106 -24384
23079 -24384 -23880 -26220 -28359 -25997 -13247 -8536 -4566 -6375 -15980 -21318 -10287 -23674 -26440 -11141
23065 -11141 -4824 -181 1175 1692 -5527 -2870 -9811 -16337 -18468 -21207 -22412 -21337 -6195 -6358 -13990
23050 -13990 -6615 -1600 -4249 1708 -3949 -13717 -16039 -13280 -9702 -6822 -4800 -10255 -24259 -16428
23036 -16428 -2929 644 -5345 -4542 -14622 -14317 -3224 -14872 -9909 6384 7623 -1354 -4678 644
23022 644 1654 -10024 -22996 -27664 -33543 -27509 -11463 -698 -1021 -6412 -2712 -2646 -480 -6384 -1502
23007 -1502 8773 4649 8562 13947 15056 20274 16976 13211 14453 18306 17402 12886 -1536 3925
22993 3925 6736 -3503 -19813 -22826 -14433 -652 4773 -10550 -20287 -13402 -10810 -13890 -5582 -3531
22979 -3531 -8158 -817 19150 21597 10253 -645 -4857 1703 6864 17715 18718 25462 19516 14794
22965 14794 12427 7541 -4850 -10069 -3337 3094 5373 10138 1196 -13810 -14863 -3304 1853 2579
22951 2579 -5759 -14445 -11750 -4197 -901 -5593 -18294 -14632 -14469 -18721 -9977 3692 -2998 9148
22937 9148 13081 7604 12679 16023 12687 14790 17103 11255 -5572 -2532 9513 6058 -4618 -13550
22923 -13550 -17884 -5089 7627 12000 2932 -13844 -10128 524 1420 506 5293 -3771 -12108 -487
22909 -487 8113 2317 3442 4439 6014 -4671 -15273 -12363 -9092 -12726 -13022 1999 2668 -8862 -11165
22894 -11165 6753 12316 6147 5662 11169 13155 9301 22869 32812 11032 8183 6630 7059 -2661
22880 -2661 -5104 13534 18985 7718 -1945 -248 -18194 -20400 -24108 -18427 -14193 -16272 -22606 -19737
22866 -19737 -19020 -20342 -25745 -18877 -9433 2659 9201 10798 13705 22784 18318 22748 29078 23450
22852 23450 14271 15714 20658 19757 16118 992 -8050 -10210 -13183 -6649 -1918 -1478 6687 -4065
22838 -4065 -10902 -17162 -17338 -7340 -1072 -9890 -17570 -8741 5358 4354 -2054 -3459 -4074 -5579 2596
22823 2596 12530 14733 8112 8515 11152 9231 6046 5292 -1410 -1293 1857 -4355 -9214 -12826 -14633
22808 -14633 -9922 -5639 3614 14913 11305 6671 11146 1938 -6859 -2074 2593 10439 2637 1929
22794 1929 9586 18298 22731 17917 18363 11544 -1776 -10101 -10461 -8735 -9165 -3605 -3466 -5690 -5890 -11190
22778 -11190 -13092 -10965 -7727 -10814 -14244 -7724 9353 17030 12639 -2438 -8460 3659 15469
22765 15469 14776 5371 3503 6246 -6842 -19743 -13162 -8521 -11983 -7463 -2465 6480 7338 17085
22751 17085 15040 5140 2705 -4301 -17249 -19764 -6858 -7512 -2396 969 8127 10108 7145 13247
22737 13247 9147 -2387 -12225 -12612 -12081 -14129 -15476 -11838 -11943 -9436 -20169 -19013 -15491 -12874 -507
22722 -507 2564 -2124 9949 12431 2984 -1180 2330 13057 26445 16594 -4671 -12415 -13000 -12815
22708 -12815 2399 15420 14368 12880 17296 -267 -683 -4995 893 5404 1004 -7017 -14255 -7165
22694 -7165 -7338 -14531 -10443 2897 253 1306 4853 -7488 -18396 -26641 -20714 -18195 -2385 9989
22680 9989 20939 15132 7800 -8596 -11720 -21403 -25732 -25437 -3298 11925 14103 3760 2565 15099
22666 15099 19308 9582 -8813 -15040 -18934 -22276 -11832 -7473 -9384 -16467 -2882 -296 4220 3362
22652 3362 7494 6726 6649 7609 656 1021 1829 -1663 -13606 -12525 -1126 9159 -2507 1455 1489 -6446
22636 -6446 5599 3225 -15665 -22413 -22857 -15519 -5633 -1145 5290 3343 5798 -2371 -4084 -11699
22622 -11699 -19435 -13584 -6991 -9317 -22041 -34963 -27574 -9023 -1079 -3151 5314 -2914 -3032 -8477
22608 -8477 -10810 -4200 -1204 -204 -6481 -6834 -3173 -6537 -9709 -8459 -714 907 -15643 -20224 -4853
22593 -4853 -1101 3391 -10134 -6588 -1022 -5426 -2903 7216 1330 1808 8453 10655 3549 3562 5175
22578 5175 -1552 -3987 -1726 8961 23565 15145 5435 -12734 -14456 -6551 1922 591 -12189 -1533
22564 -1533 -7252 -15093 -19754 -12634 -4484 12084 14279 4036 3462 985 -1100 -1245 7587 7826 6024
22549 6024 -3023 -11855 -11352 -5434 -6760 -1514 1480 -18335 -11302 -3210 -9403 -12869 -13469 -10637 -16640
22534 -16640 -19797 -15546 -3999 -6071 -16613 -17407 -13713 -5077 6409 2343 -5482 -814 7590 2072
22520 2072 -6822 -9874 -8411 -6211 -2409 -2366 6338 -6842 -17437 -10771 -14846 -19088 -14357 699
22506 699 1805 1442 -874 -3781 -1517 -6157 11041 19908 16667 21396 21740 14896 17888 21216 3677
22491 3677 -8468 -8644 -4054 -11600 -10944 -12586 -4228 3465 8242 -2968 -16553 -17660 -12777 -16543
22477 -16543 -28511 -20208 -3658 4066 16022 5549 3569 6123 2703 -1837 2280 2976 10546 4726
22463 4726 4035 11782 13041 7501 11298 7210 -907 -14 4883 6428 -899 -7248 468 5208 4818
22448 4818 -2297 -10322 -6493 2772 7833 7887 13909 12930 8787 4061 -8838 -131 628 -5643 -8939
22433 -8939 -8057 4741 12263 5158 -10379 -17618 -16901 -11782 -2832 12852 13334 7089 13392 5703 2052
22418 2052 -7001 3111 18706 16619 17680 4708 -11536 -2329 747 4 -5567 -11330 -5845 -2890
22404 -2890 -7431 -2629 1135 5231 -4209 -15885 -18473 -12000 -10366 -9858 -5236 2104 9441 -504 -1753
22389 -1753 5194 9904 18702 21877 18219 18385 10090 3394 1421 8125 2801 193 -905 -12427 -9613
22374 -9613 2451 5665 6798 -5884 -8145 -6586 3775 7120 5764 -9056 -24324 -16479 -203
22361 -203 -8843 -4546 7064 7888 2628 1077 9875 7655 5063 -1560 -4982 -1919 -1805 -4808 -4240
22346 -4240 -2409 2619 -3189 -11668 -18589 -18742 -15666 -8895 -3683 -4069 -5022 -7592 -9002 -4904 -3229
22331 -3229 -2593 -12050 -12010 -215 13568 17148 11440 6949 -768 -1318 19196 17286 3309 3591 4732
22316 4732 1754 2943 -4007 -2467 -13696 -23044 -16437 -28212 -29111 -21986 -18196 -12880 -12125 -11589 -15383
22301 -15383 -11020 -9746 -13756 -15355 -17738 -22372 -28776 -23913 -18174 -5679 -77 -3397 2828 10965
22287 10965 11302 3422 15302 18180 9465 -2816 -6268 -7281 -13380 3255 527 -9281 -8217 -2285
22273 -2285 -4096 -7128 -9049 -12251 -11847 8431 17083 20781 16484 6328 9098 9428 7969 9124 10917
22258 10917 6839 7787 11987 14391 3569 -9365 -9956 598 1314 1363 -14664 -17891 -22063 -24048 -17126
22243 -17126 -12785 -15580 -19699 -10455 -7330 -6610 -11717 -6746 -8069 2465 -1174 5794 -1680 -1717 9756
22228 9756 25866 20946 13296 13208 8481 1942 -977 -1705 1978 2544 -14018 -18346 -17065 -20406 -15664
22213 -15664 -15356 -9812 -1495 838 -2867 -21664 -29724 -19089 -6594 -14763 -15320 -7201 -5053 -9320
22199 -9320 957 -1594 -8504 -12351 -12273 -15637 -15354 -12774 -8220 947 8707 9663 13526 10614 9307
22184 9307 3365 -7445 -6680 -69 -2417 -6726 -9385 -260 9433 1940 -714 -1716 -3459 -6821 8185
22169 8185 878 -11346 -991 10712 13835 22689 12986 943 -5033 -10962 -7314 -9782 -7714 -11949
22155 -11949 -4200 -3131 -10724 -6483 -9069 -10580 -3594 -10720 -27208 -23534 -10927 -4536 4690 -3407
22141 -3407 1320 -7168 -15825 -13633 -20641 -20093 -2734 5128 -8304 -15070 -12463 -17704 -15557 -4837
22127 -4837 -416 5517 2586 -5402 -2534 -3130 -8365 -10060 -9499 -6145 -2424 -13822 -16156 -24162 -20784
22112 -20784 -7320 -7047 -9768 3284 18055 11674 13317 4258 -9410 -11520 -3237 7047 1968
22099 1968 7278 83 -8874 -10554 -672 -1573 -1936 -1327 -5612 1451 10529 8566 15160 9690 2258
22084 2258 -799 -11739 -15006 -8365 -5352 -5494 -333 4557 5290 15455 16402 -1878 -24951 -31156
22070 -31156 -21828 6583 6305 11454 23340 25944 30327 17055 12229 10058 16702 16746 4528 -6224
22056 -6224 -9333 -4642 498 1052 -828 -1213 -1232 -8872 -10365 -6690 -2734 918 -11197 -8773 4143
22041 4143 16759 15857 17812 19221 13042 18086 15882 5123 5867 15929 7666 566 816 -1373 -7076
22026 -7076 -3264 6870 7790 4918 6555 8048 5600 5997 -1571 -14476 -8248 1819 1375 5637 2118
22011 2118 4931 655 -11126 -19632 -16326 -7482 -6882 -4549 -12080 -17768 -15786 -22025 -24969 -17504 -13351
21996 -13351 -18892 -16840 -19524 -25972 -23463 -21853 -27165 -22500 -19646 -1118 5017 13258 17302 10114
21982 10114 15372 24012 20938 -4529 -11710 3547 7992 -6355 -6307 -6914 719 13264 12256 6234
21968 6234 -4919 -5859 -266 -1897 -11399 -10890 -9460 -15123 -16539 -13264 -5123 1996 2144 5715 9910
21953 9910 6098 -5099 -16338 -17516 -19108 -20881 -13124 -7805 -6367 -9444 2681 -513 -8261 -2229
21939 -2229 -2266 -4660 -7310 -10621 -10039 -5956 75 -209 -2156 -3133 1665 73 5760 6253 1401 6121
21923 6121 -7715 -6512 -6691 -6420 -11206 -10549 -1269 12135 18131 15754 832 -7817 -5959 -3199 -3227
21908 -3227 -6186 -13512 -19957 -21089 -7638 -3557 -7816 -1467 -3673 -16769 -5562 -5660 -20408 -35649
21894 -35649 -32763 -17168 -4112 -2070 -8851 -2548 3338 7788 8855 2191 -5356 -2870 4774 -2707
21880 -2707 -5256 -6092 -12818 -4199 -5384 -10486 -1661 2394 7963 5565 2736 -4204 -14951 -16831 -18397
21865 -18397 -20773 -17163 -20796 -10712 -10884 -15488 -12425 -12456 1348 14858 19440 18594 15139 8652 2629
21850 2629 1031 875 -1365 -2276 -5528 8103 14307 1223 -5459 -6697 3665 -609 -8518 1214
21836 1214 3112 284 11881 18554 11003 5412 -3256 -7513 -7563 -15222 -9341 -6282 -22073 -20549 -27895
21821 -27895 -26155 -15723 -11108 -18337 -17560 -13974 -16164 -10280 -5904 -14429 -8855 -360 255 7794 9622
21806 9622 14 -7457 -1492 -3716 -5864 -6819 -2344 10431 12477 -5147 -14760 -3880 -9072 -11244
21792 -11244 -11032 -7401 -6891 -18542 -11290 -2283 -3434 -3242 -14748 -25746 -23084 -16691 -15552 -19291
21778 -19291 -20422 -14610 -2522 14353 7149 -131 9237 9155 1169 -3743 -1204 662 -6230 -7930
21764 -7930 3282 10598 9358 11938 9913 -5205 -129 -2971 -9470 -10792 3859 6561 -4456 -17537
21750 -17537 -21850 -22427 -15100 -13139 -16740 -7432 -16355 -13145 -10714 -1537 7493 8390 7654 1191 -8159
21735 -8159 -3943 188 -7880 -9476 -6437 -10872 -17195 -23198 -20269 -14137 2296 279 -17149 -24582
21721 -24582 -14693 -7473 -18080 -15197 -7828 6524 13109 -6858 -10243 1023 5170 -3918 -17757
21708 -17757 -20954 -18050 -12153 -6040 986 8936 6020 5090 -5128 -13524 -7866 -8901 -19567 -14851
21694 -14851 -10607 -15325 -9993 -5009 -25277 -29350 -12255 7172 7098 -787 -7799 6376 -314 -11560
21680 -11560 -12626 -17423 -5263 -2568 1963 -3568 -14862 -25410 -16759 -11177 -9853 -4882 -2463 -709
21666 -709 -3668 11227 24506 13136 3178 2866 4726 103 -8592 -12471 -20346 -25421 -24870 -27696 -14515
21651 -14515 -1474 15781 4024 -12236 -25126 -13016 -9230 -9360 -8718 -1900 -2132 -18155 -25379
21638 -25379 -10245 -9513 -8999 2942 9174 311 -14358 -6802 -3323 13 -3708 -6995 -1647 -3075
21624 -3075 -3031 -1251 -19345 -36125 -22006 93 -3467 -12749 -12748 -8019 11595 15136 10869 12913 1411
21609 1411 -1813 -2477 -6950 -8893 -5640 -6979 -5437 -2292 9820 3543 -1363 4269 7401 8594 1959
21594 1959 -5298 -13557 -16136 -11137 -6277 8622 10468 8152 7473 1030 -3364 -3381 -7514 -11069 -11471
21579 -11471 -19450 -11889 -687 -3746 3382 5601 8072 4228 20237 33210 31795 15915 6545
21566 6545 -4276 728 2307 4834 7209 2769 -6084 -5556 -339 2215 -3568 3409 11118 13765 295
21551 295 -5736 644 -8545 -9268 -1372 5694 2002 -7585 -10766 -8354 -8196 -7830 3533 11565 6625
21536 6625 4529 8802 12685 8431 -4534 4239 3786 -4090 -4755 -9579 -4708 11071 13389 11077 6610
21521 6610 -7192 -15492 -11858 -12974 -6973 6656 6989 -6590 -4155 -10037 -3325 -4318 3202 2178
21507 2178 -9499 -7824 -9588 -8809 -8867 -12893 -8665 -4506 -5962 -8177 -8363 1828 -10 -5814 4835
21492 4835 1678 -1806 9624 17982 14247 1132 -10426 -5419 -827 -1467 -3815 3439 1194 -3511
21478 -3511 4011 3403 3964 15793 22769 13791 15568 10702 1607 -8395 768 12636 9277 1280
21464 1280 -9806 -14724 -28413 -22164 -14655 -20106 -21707 -12996 -7849 -2700 -8105 -16134 -16214 -22802 -27111
21449 -27111 -20749 -15702 -15425 -5398 2671 5325 4242 97 -2283 -5043 -16852 -21834 -24073 -10523
21435 -10523 -3100 4813 -3140 -4807 -8627 -14633 -22534 -26885 -22767 -14917 -3067 -4254 5041 7386
21421 7386 -2841 -3023 5795 2607 4147 5661 -5147 2908 2383 -10148 -15469 -9955 -4199 -4197 -12590
21406 -12590 -10179 -3274 -4139 -11154 -16757 -13962 -10473 -5971 -7027 -11742 -1697 -1977 -12923 -16576
21392 -16576 -27576 -23548 -14111 -6185 -6765 -2761 2172 4063 2269 3009 5782 3723 -10378 -23853
21378 -23853 -28120 -11635 -4022 -2325 -3259 -11575 -17908 -23094 -14323 2478 3089 -3027 -4859 7214
21364 7214 9417 4662 857 -6651 -11823 -6147 -3800 5550 7614 2477 -3119 7303 1779 -20208
21350 -20208 -20774 -514 4221 2016 -4596 -8892 -11374 5326 19876 15906 6587 -3648 -25569
21337 -25569 -32687 -27449 -26716 -28589 -28589 -21455 -19291 -14226 -12419 -8223 -18629 -25881 -18493 -20693 -15701
21322 -15701 -15063 -7632 -5717 -199 58 -9581 -17101 -7492 -4186 -266 -782 -5494 -6226 -8014 -13080
21307 -13080 -15000 -3210 -1284 -3080 3809 -10897 -19755 -12503 -2657 -7221 -15804 -7832 -4177 1141
21293 1141 1066 -3138 4731 9878 -2319 -8626 -17408 -15567 -16052 -10617 1092 9215 5188 -7760 -25879
21278 -25879 -31384 -32162 -25584 -23812 -19221 -7701 -6274 -7156 -8585 1689 8469 336 -8120 -8988 -6029
21263 -6029 -5850 -7140 -1911 -5167 6720 11424 11274 11001 16843 15545 20209 19618 14048 4022 919
21248 919 -6019 -5801 -4040 -13916 -11701 -1704 -6201 -12808 -7697 574 -2835 -11558 -14364 -8744 -1737
21233 -1737 1126 1497 -8669 -11235 -8819 3259 6629 10456 9695 5309 12671 16541 21364 8097
21219 8097 -2515 2597 4623 -11176 -13902 -2971 -6243 -14928 -28244 -21398 -8471 -1597 -6581
21206 -6581 -15713 -5622 413 -6353 -11345 -10242 -13193 -10729 -5455 -14191 -30588 -30997 -8800 6237
21192 6237 3007 -9579 -19091 -18777 -7655 1134 -6130 -9670 -12615 -19024 -31417 -33488 -21357 -17771
21178 -17771 -7812 -2655 -2228 6797 -6581 -6339 -5739 -9660 -13941 -8781 -12370 -22428 -20308 -12679 -7770
21163 -7770 -18004 -23648 -17944 -8033 -4748 -5505 -9809 -1901 2467 1618 -300 1321 -6968 -7372 -7170
21148 -7170 -8550 5158 17080 17927 15669 16743 18671 2047 -8144 -15424 -18122 -15819 -4010 12697
21134 12697 11950 2851 2194 -4978 -9624 -11309 -542 6313 4683 -4085 -3504 -15380 -16123 -8296 -6465
21119 -6465 4566 -8312 -12977 4556 7866 1001 8473 4340 -4518 -6317 -2753 -20111 -13449 -8154
21105 -8154 1627 16628 28744 18890 17385 1965 -14809 -16817 -10159 2857 -2846 -16384 -23329
21092 -23329 -17759 -17817 -22447 -21056 -16718 -23893 -18850 2857 7456 -2994 -8215 -19030 -7773 4882
21078 4882 5530 -607 2485 3107 -12115 -23326 -26582 -25036 -24472 -23737 -16077 -4091 5391 5021 1302
21063 1302 768 -12625 -4555 4731 -7627 -13446 -12886 2607 4730 15479 21559 18051 24975 19356
21049 19356 2904 -15094 -28308 -25644 -14664 -7976 1979 8285 1168 -3368 -9939 -7764 -9360
21036 -9360 -12185 -15162 -15835 -16843 2742 -5918 2200 5793 -10093 -12255 -12720 -13560 -11937 -7580 -609
21021 -609 11522 11810 -1144 -3608 812 2732 10428 16665 5670 -12523 -22696 -18533 -12315 3642
21007 3642 4223 -7034 -2245 383 -3246 -1406 15837 17173 19368 14276 17170 23807 34027 6154
20993 6154 -17852 -23508 -8553 2496 2659 1980 4325 -3445 -6723 -13738 -12700 -10498 -14924 -8082
20979 -8082 -6270 -3917 -9782 -11777 -2133 5777 4462 640 3276 2424 2932 4841 9995 5095 -4578
20964 -4578 -16191 -8826 3598 -1127 -11477 -12947 -10382 -4115 -10638 -7961 -7598 -14609 -10387 -12161
20950 -12161 1394 -4502 -4451 -145 -5438 9794 10429 -1678 -9066 -9155 -7384 -7678 -9187 -4761 -10575
20935 -10575 -15699 -13805 -7421 -272 -774 -5070 -6082 -10105 -2944 -5405 -14510 -8340 -9672 -16623 -15319
20920 -15319 -16411 -12129 -7500 -13166 -9063 4059 -7225 -7436 -9614 -13623 -4465 -836 -6128 -17513
20906 -17513 -16187 -13559 -19020 -38081 -44156 -27451 -13298 -12782 -15184 -1890 -9697 -24605 -20023
20893 -20023 -17005 -7692 -7364 -11125 -9252 -2503 -3013 903 1062 448 -1107 6882 12175 10230 -11383
20878 -11383 -20160 -20890 -9988 -12612 -8426 653 369 -3708 251 -962 4054 8801 2353 4212 -9394
20863 -9394 -2132 6702 8361 10199 -631 -14498 -19290 -22627 -30093 -21135 -9326 5214 15533
20850 15533 9476 -9755 -5206 380 4243 282 9484 6696 -496 -16286 -16854 -12293 -14391 -12284
20836 -12284 -12575 911 -5021 -4367 -457 -1074 -4064 -9772 -12825 -15107 -23634 -20846 -7229 874 11788
20821 11788 16303 6685 1537 -10940 -19079 -9227 -3004 -6345 -16589 -18929 -15209 -17506 -19600 -20598
20807 -20598 -10183 -448 2619 -11172 -17859 -11388 -7988 -1482 -7479 -8171 -13336 -21677 -10456 -7590
20793 -7590 -3111 3954 -181 -14643 -11113 -4899 2402 8223 1455 4828 14930 11650 -5491 -20303
20779 -20303 -22561 -16408 -5910 -1819 -8482 -21754 -25216 -16544 -16687 -14944 -9953 -3166 3461 7739
20765 7739 17392 19275 20521 19810 1717 -4923 -14077 -27186 -19148 -15889 -15701 -17303 -18605 -17980 -14113
20750 -14113 -9558 -6814 -3806 953 244 -3737 -19243 -25711 -16061 -7644 -10053 -8671 -9435 -18984 -6392
20735 -6392 1745 -4625 -19874 -17696 -9542 -11296 -21271 -24453 -26238 -28632 -12957 -19779 -34219 -17288
20721 -17288 -5297 6286 4774 3074 20843 25932 14705 13863 11274 -1059 -6369 -8023 1919
20708 1919 6951 11313 8858 6764 -2825 -6293 -5775 6902 10517 6332 -1070 -7062 -8458 839 3630
20693 3630 3481 -4914 -11716 -26833 -20558 -18138 -25366 -17992 -15093 -9922 -11482 -16652 -1731 6457
20679 6457 8976 -97 -4421 -7949 -5720 -1245 7416 5479 2915 3563 239 4650 4805 915 -7760
20664 -7760 -8325 -9413 -22980 -29127 -15313 -12106 1671 4535 -5250 -17674 -21611 -25133 -24485 -16789
20650 -16789 -5581 6072 6738 -2184 -2938 -5917 8776 11957 3448 -10391 -16581 -1488 3642 -7504
20636 -7504 194 18021 25392 9249 3508 -6851 -24051 -13341 -777 -9896 -7299 -3590 -1603
20623 -1603 -9339 -14221 -11441 1852 10488 9834 7944 -4783 -9148 -9066 -8423 -14800 -14910 -2040 1102
20608 1102 10934 7545 301 2491 -8565 -731 5171 8576 10037 8318 7515 8160 12287 3215 744
20593 744 4820 -5567 -2042 9012 3075 -589 15979 18367 4849 -2936 -4953 4991 13061 17100
20579 17100 17865 14518 12616 8829 12764 8403 1387 6759 14157 8403 -3343 -2225 2411 -1206
20565 -1206 -9588 -5178 -4276 -13256 -13694 -5750 -7228 -10433 -4801 -781 -347 -2660 -6753 -5645 -5992 -12712
20549 -12712 -3917 -2576 -5861 3255 6899 3026 -11965 -16246 -21330 -5550 11711 11455 7125 5029
20535 5029 2623 -4317 1333 1673 -3219 -220 4860 7958 -4959 -18365 -10948 -12957 -13096 -3610 -14131
20520 -14131 -17976 -18206 -9141 -1077 -8715 -15017 -9125 890 -5672 -3366 2173 6078 -5013 -14413
20506 -14413 -9413 -2200 1898 537 7817 5352 -255 -1219 -7583 1666 11715 2329 -3147 10628
20492 10628 19803 15170 10876 7057 -905 -4344 2952 13276 18399 12140 6162 6449 393 -5519
20478 -5519 7244 10534 -886 -8499 -8477 -6252 -9168 -2275 -611 -14758 -12902 9950 14224 11051
20464 11051 7648 17904 17156 18692 20352 19675 13044 19799 10552 7343 3168 -13396 -5762 -682
20450 -682 -1171 2120 -6090 -10400 -5157 1033 -4703 -12498 -2577 9129 7885 10488 8299 5953 8510
20435 8510 10134 -1249 -11627 -16284 -13178 -10201 881 13622 7326 -6564 -11134 -6798 1746
20422 1746 1761 -15886 -10465 -7407 -5195 -12235 -14272 -12798 -14343 -13006 -12478 -11045 -6256 -702 -2560
20407 -2560 -7465 -10955 -14707 -9890 -4780 1359 -4761 2548 4170 1331 -4109 -15335 -25176 -30881
20393 -30881 -26907 -16927 -16269 -15726 -10860 -5355 1300 -246 -6505 -5920 -8214 -20568 -22803 -3047 5057
20378 5057 399 -6935 -7204 6298 8129 20683 32310 28647 19055 8268 6769 10376 9147 9137
20364 9137 1735 4257 1291 -6453 -3221 -7365 1873 17577 20359 15523 10049 18129 18737 19737 16891
20349 16891 14883 20325 37488 38088 19156 11429 14809 13125 9509 6056 -2285 -182 -7438 1194
20335 1194 12399 11318 6149 3623 6577 8370 1322 -10760 -6866 2536 6451 -3723 -8163 -8067
20321 -8067 -7240 -5184 160 -4787 -18569 -16140 -17641 -11867 -657 4929 16031 11041 3291 -5215
20307 -5215 203 12142 16444 6795 2713 -7299 -13993 -8183 -7550 -4256 -1534 11183 11635 3947
20293 3947 -2589 5768 -4172 -16723 -19106 -9757 5204 979 6152 18115 15702 7872 12564 10688
20279 10688 1993 -472 -1010 -4157 -7280 -6768 -8282 -8698 4822 16262 17514 7529 -8046 -13693
20265 -13693 -10648 -7500 -5452 -10786 -2392 6545 7522 5216 11272 4088 -3124 4522 -272 -10782
20251 -10782 -15934 -17234 -9612 -11927 -11588 -25601 -25116 -12916 -20939 -24788 -19582 -10496 1100 2369
20237 2369 -2855 -14282 -16978 -10856 -17319 -26614 -29959 -24603 -20905 -14202 -3773 -3136 -4009 5850 3474
20222 3474 1195 -932 -5593 -7002 -2018 -700 -4079 -5965 -2855 -6565 -8013 -6252 3138 -712 -21338
20207 -21338 -24705 -25142 -32117 -37020 -24990 -27165 -19535 -13732 -11042 -12790 -16389 -18175 -7775 -6485
20193 -6485 -14768 -13011 -6899 -1802 1441 4590 24 -4242 -10845 -1014 1438 -2632 -9085 -11614 -17563
20178 -17563 -24424 -21020 -29557 -24172 -10600 -426 3961 10921 5246 203 -9477 -10385 737 -4021
20164 -4021 -7932 -17072 -14220 -7651 -13234 -16864 -19460 -18463 -15644 -8333 -11766 -10979 -16188 -4587 -10577
20149 -10577 -10275 1755 -1953 -562 9660 9503 6247 5659 13211 16699 7754 5707 14849 15611 12711
20134 12711 3183 -13400 -10722 -3963 -2197 -9314 -14564 -10191 1533 8626 13184 -2540 -15052
20121 -15052 -23051 -21898 -16654 -10006 -2923 -10538 -24650 -31984 -30510 -27470 -22840 -13098 -8545 -458
20107 -458 6836 4487 -12762 -19203 1119 7960 5727 -1874 2877 660 -4037 -12046 -5223 8581
20093 8581 1075 -15366 -27126 -26574 -2413 7879 4421 16566 15002 14301 17394 8798 93 180
20079 180 14157 14968 6370 -9569 -3382 -6334 -10242 -9593 1517 4678 4126 2333 -16912 -29438
20065 -29438 -14170 -9574 -8374 -849 4632 1422 -3965 -141 1771 -2988 3405 -890 -8065 -5646
20051 -5646 -7265 -2917 6789 2196 -3570 -10153 -2606 14970 6904 -3186 -1728 1471 7875 10280
20037 10280 14639 15425 8373 -1266 -9449 -10092 -10120 -6868 3917 2210 -4789 -10502 -7525 -999 7095
20022 7095 6964 10728 4347 2862 -5669 -487 2157 -2769 -6956 -3286 11696 6016 -10292 -17122
20008 -17122 -12107 -2977 -2722 -9753 -14239 -11522 -5357 -2108 -3166 -9291 -21499 -28171 -23668 -29351
19994 -29351 -30064 -16582 -8975 -474 6273 10563 526 -3464 7629 15688 14317 9536 -12271 -24397
19980 -24397 -17459 -10781 -8063 3088 7830 6067 4062 -8038 -14577 -9927 -19016 -21656 -21325 -30769
19966 -30769 -25207 -4861 1053 -5683 2086 978 -6357 1177 4343 3431 -6543 -9206 -2771 -877
19952 -877 -1719 -3145 -267 3578 -6392 -14670 -22083 -19487 -8811 -8013 -13978 -7597 613 3532 5582
19937 5582 621 -241 11007 11780 5303 4809 3286 1861 6178 -655 -6414 -10254 -4329 10343 5877
19922 5877 -2570 -21608 -20903 -19901 -4992 -52 -6047 -4479 -8143 6619 6530 11415 11077 9470 -2658
19907 -2658 -5805 -14773 -16475 -15532 -19777 -24728 -33221 -34117 -35572 -32631 -28837 -18070 -20835 -15997 -10944
19892 -10944 -6522 4489 9298 -4642 -13088 -16369 -10623 -2256 -3969 -11966 -12408 -9929 -15241 -15761
19878 -15761 -12898 -13939 542 11671 11754 -6621 -15399 -23565 -30846 -31998 -25920 -21254 -16535 -3430
19864 -3430 6898 11587 5106 11443 0 10932 25614 24586 16008 22889 25144 19443 13608 1183
19850 1183 -5302 -8477 -7521 -6009 -2882 -3743 478 5209 -180 -10479 -8516 1007 4108 1888 758
19835 758 -4392 -12198 -21741 -33347 -36936 -28430 -9591 -2833 -7146 -15125 -18491 -16824 -10639 -3788
19821 -3788 -6472 246 7609 12784 7230 10418 9808 1862 -3478 861 2213 173 8538 11446 287
19806 287 -4543 -11949 -13565 -7090 -5740 -8005 -18815 -29284 -31999 -24073 -6557 -4411 -10638 -15644
19792 -15644 -16192 -22236 -26995 -29222 -16262 -6036 -3607 -6162 -3243 -11133 -21402 -12173 6074 -3539
19778 -3539 -10743 -14024 -8547 -5524 -13595 -12462 -13452 -10238 -12083 -14976 -19394 -7548 7199 -1372
19764 -1372 2430 5119 -3526 -4236 -9265 -4652 80 -14277 -21106 -16885 -5648 3740 11353 9899
19750 9899 6312 -7762 -9222 924 -1115 1196 -3520 -7585 -1554 -6589 -10942 -15478 -18121 -12911
19736 -12911 -1889 1658 -4722 -10701 -14042 -6844 3032 -4761 -7411 -3135 -1631 -1083 -9034 -18406
19722 -18406 -4477 -7174 -13135 -19745 -16584 5295 7418 -1140 -12044 -8596 -1781 -4355 -9764 -12297
19708 -12297 -14870 -18350 -14668 -8334 -5189 -15608 -14745 -11619 -4802 -9249 -13779 -14443 -7334 -6497 -8886
19693 -8886 -21451 -15466 -4376 5659 14454 12095 3241 4971 12646 2589 -9319 -17472 -23155
19680 -23155 -19456 -14888 -14232 -7021 1200 -1474 -5853 4777 8880 8348 -4389 -6333 -2812 1349
19666 1349 3234 15737 14733 6831 982 960 19771 21821 5949 -2987 10173 6975 -8753 -7596
19652 -7596 4645 271 -2741 -1170 3092 9649 -7200 -12575 -17495 -20271 -10686 -6411 -7271 -554
19638 -554 1693 5552 3081 1110 -964 1443 4149 960 -11842 -9154 -13892 -7593 -3772 -9827 -17291
19623 -17291 -13624 -5454 630 -2175 1154 9211 10795 11841 10782 10680 5115 -4175 -5672 6506
19609 6506 23866 23149 30370 23048 14252 -1707 -1357 903 -6372 -18323 -16050 2465 12979 7567
19595 7567 -577 154 -4169 -3859 968 -5550 -5131 -3287 -5376 -10692 -6474 -2623 1130 14087 11628
19580 11628 5136 7844 -4996 2406 8215 1971 5219 7963 9391 11056 14229 15217 6599 -5994
19566 -5994 -15545 -12562 -9419 -5394 -24627 -15653 7659 6536 -1525 -4869 -7918 -12257 -10166 -7900
19552 -7900 -12214 -22804 -10823 -10780 -16735 -12018 -6579 -13178 -19211 -81 9864 7735 11738 9282
19538 9282 1641 4919 8068 -6967 -195 15778 5556 -845 -7688 -15498 -15442 -1044 3632 8256
19524 8256 -3896 -4703 2800 14062 24197 13288 -1535 6390 -140 -14999 -13319 -16420 -18608
19511 -18608 -4971 1485 -527 5394 4402 -1774 1229 10232 10392 3468 -7926 -13540 -7873 -8143 -19663
19496 -19663 -14660 -8762 -17718 -5030 3815 10181 11232 4038 -5272 -7813 -8139 -6661 -3114 -7863
19482 -7863 -14273 -13765 -14115 -17675 -8254 -7612 -18138 -14344 -15749 -10894 -6062 -519 11207 19092 7815
19467 7815 920 -2482 1106 5650 -6066 -9816 -7863 -1736 -7484 -9823 -12522 -15622 -10485 -7994
19453 -7994 -14407 -15743 3954 17138 19272 4496 -15860 -24486 -23769 -18371 -9660 -1495 6789 682
19439 682 -10862 -9967 -7022 -14212 -18865 -11229 -16502 -3363 -3530 -4522 -10581 -8351 -20817 -11671 4752
19424 4752 -325 597 10131 11424 5514 2806 8569 5762 3920 10332 7863 -2566 -2778 -6015 1548
19409 1548 399 2300 9145 22482 25716 20090 16436 11594 1707 -2962 -5064 -1416 13805 14812
19395 14812 5544 -6520 -14604 -12524 -7764 -4977 1884 6886 8171 6345 5200 -2541 -364 -6870
19381 -6870 -13315 -12794 -11579 -10017 -15860 -14192 -9608 -3844 2201 -1206 -3262 -3507 1125 6370 9001
19366 9001 359 -863 4546 3016 -1935 1303 16073 17292 22215 12360 -5872 -5564 -889 15969
19352 15969 35130 27669 14174 17212 5493 1587 7467 18354 17370 13383 3905 13210 23444
19339 23444 18951 11112 4646 7280 8599 16423 11906 16308 3824 -5680 507 10322 6821 9036
19325 9036 10192 5799 16089 17501 23169 15071 20251 17366 6246 8764 16363 19742 14662 6649
19311 6649 -810 -134 2396 16552 5585 -301 -2635 -5343 -9438 -4624 -3280 -3480 1573 5278 16226
19296 16226 20970 8484 9215 703 50 5210 4713 1167 939 2053 5417 17521 19429 15831 -2352
19281 -2352 7448 20404 16247 11092 8945 5688 5031 5123 792 927 8972 6653 -613 -5039 574
19266 574 2192 13226 19832 11029 10061 14317 9621 10075 11814 23679 35167 30528 15431 11474
19252 11474 6012 -2233 10143 13856 4240 -4965 -20321 -18817 -8393 -4558 -10866 -10354 -7526 7885
19238 7885 7974 11591 7757 -4140 -24346 -32986 -44923 -33018 -20478 -21295 -18814 -3687 6285 8489
19224 8489 1799 -1833 8936 6946 775 5810 4965 -2425 5754 16658 16750 10879 998 1003 9814 10870
19208 10870 7727 6389 3401 -12405 -25941 -22900 -26467 -26910 -14428 -7048 -1087 4667 -7993 -12060
19194 -12060 -6654 8345 7381 1604 -9043 -20127 -33955 -28288 -19041 -44 623 -1177 -1430 8435
19180 8435 11491 7000 8988 10309 13211 4721 -539 -2154 -7164 -2168 1533 6281 -4774 -10906
19166 -10906 -15175 -11620 -3957 2104 7721 4662 9192 9872 20071 24287 19584 20233 12275 13231 4481
19151 4481 4190 4659 4616 1350 4324 5797 8247 5508 9070 6247 -10363 -4959 -5596 -1744 -2123 -7794
19135 -7794 1869 11150 16331 14762 7138 -3275 -6459 -7713 -5277 -9696 -9043 -8607 -7039 -7989 -8761
19120 -8761 -12254 -2581 6836 591 -17960 -20943 -16298 -13774 -11321 -6368 -12521 -12494 -33937 -32189 -9048
19105 -9048 -6378 -13428 -11979 -6427 347 4018 3890 12714 7585 -4111 -18138 -16424 -16814 -10122 -4868
19090 -4868 2569 3049 -11426 -13339 -16797 -18360 -14685 -14504 -18270 -137 441 -467 -14171 -7977 -5426
19075 -5426 -2667 456 -5830 -7566 824 11611 13293 14299 17143 20176 19437 11853 3095 6969 3313
19060 3313 -4220 -8549 -8428 -16191 -23485 -7530 7003 11739 18809 11377 -1700 -52 -3691 6729
19046 6729 13332 11305 376 2140 6094 15169 3837 -1537 -596 -14459 -9580 -12120 -11194 -12191 -5904
19031 -5904 1069 -8566 -3425 -1344 10798 4384 965 899 -4251 -5112 -4794 -9447 -14023 -8653 -4046
19016 -4046 -3647 -4034 85 -2802 -10345 -1294 323 -6158 -2731 -4667 -2235 -12739 0 7406 19609
19001 19609 29699 29794 24751 13245 3026 -5724 -6998 -1794 6836 4233 1931 17761 15281 2099
18987 2099 2001 -6600 -2700 6739 22128 20301 19763 16540 5172 350 4513 -978 -4753 -3146 -2138
18972 -2138 -1427 -6079 -13776 -9171 -5277 -5127 -623 4097 6425 -3009 -84 10958 8281 -5741 4122
18957 4122 11340 -637 -13414 -17324 -14628 -18762 -8370 -6197 10231 14781 8986 9283 1735 -4627
18943 -4627 -13774 -21907 -8152 -2870 10166 12144 9306 -9946 -8987 8985 18716 13529 14526 13011
18929 13011 9212 4341 5727 -818 1582 3619 9539 6343 -5035 921 2553 -4809 -12349 -4428
18915 -4428 -10679 -15379 -13478 -6751 3260 10442 14911 11287 12038 4888 -2212 4078 1352 2940 3291
18900 3291 -9856 -11387 3528 -1184 -7818 -4635 -1309 301 -2409 9819 3811 -6173 -399 2625
18886 2625 2194 -265 11572 25135 30296 27801 19681 14260 4835 4434 17380 26570 19816 9785
18872 9785 -621 941 7306 -5962 -10680 -12073 -6119 -4504 -5864 -4648 -3728 1171 -2968 -3344 -7973
18857 -7973 -7510 5687 24213 20839 3817 -7337 -11421 -20963 -25922 -5067 13118 13571 17962 25919
18843 25919 22844 5319 -5766 -620 5819 5251 6314 6592 2862 2045 2732 -2156 1596 10887 4138
18828 4138 4340 17168 15433 17379 17258 14675 13583 21045 36013 25664 11814 15822 26796 20133
18814 20133 19027 2054 -6248 -9474 -8818 -2949 -77 -551 -1497 2821 3718 3868 14626 19185 14564
18799 14564 12245 9306 15226 23290 22228 18507 19916 17202 11839 9571 2836 -4287 -10762 6101
18785 6101 12519 11957 829 2101 10912 16323 17661 13688 10101 5328 6503 3558 18178 24013
18771 24013 28224 27649 26985 27103 21114 28930 21601 19652 25007 35396 46806 44091 40518 31470 44828
18756 44828 55544 47073 42955 43767 40447 31628 29754 28026 17040 16389 11109 -97 2717 18751
18742 18751 17962 15251 16634 27132 16554 4117 19264 31421 30820 40158 28450 20467 10056
18729 10056 10783 18321 4699 -9825 -11793 -15981 -10533 -3788 2037 -8824 -20687 -13963 -12197 -13488
18715 -13488 -14107 -2064 13506 9410 -12181 -16373 3597 12678 4144 -6816 467 14701 11000
18702 11000 5995 -1213 1521 4664 12620 12875 18053 18505 16794 11970 15549 5669 2252 7844 8515
18687 8515 53 7037 13886 11995 9824 -1971 -2239 -4457 11028 17613 12657 13775 12239 21916
18673 21916 25384 16921 7121 1833 7616 14591 16092 -3004 -8774 385 11088 20968 22700 22227
18659 22227 4908 -858 -11514 -13924 3010 11264 7062 5937 4958 8749 8294 7237 8118 3000
18645 3000 -11374 -19558 -21788 -11159 -8782 -10464 5747 12747 2462 -13618 -17368 -21720 -23367
18632 -23367 -16680 -7905 546 6925 102 -4669 -3040 -2455 3825 1453 -9177 -829 8328 12119
18618 12119 6671 545 16525 28238 13251 6125 9060 424 -3583 -2371 -2797 6522 12663 12621
18604 12621 20576 19688 18341 16588 20070 26746 27038 29981 25955 23924 18094 20707 32428 31763 29766
18589 29766 19535 16173 26970 30183 30446 19783 4846 -4116 -9636 -7589 -3505 -3321 6478 8991
18575 8991 9090 2662 7180 5942 4430 8741 14013 16432 17802 22191 15263 2198 4233 9197 14306
18560 14306 19890 12910 20581 25366 25202 20477 14115 10229 8177 15029 10821 6833 11587 22914
18546 22914 19464 19283 19305 12909 12344 8760 20297 13849 -1443 -1094 10921 9175 4186 -5385 -3178
18531 -3178 5618 3471 13094 21466 27932 28743 40426 44940 43255 38944 35373 27516 21297 25112 21644
18516 21644 11581 3049 3816 13980 15528 25928 44732 53108 52952 56610 65002 68800 72030 78851
18502 78851 85287 86783 93121 115711 131492 149315 176857 208008 237019 275701 310885 352533
18490 352533 387799 425374 455641 450417 424642 396895 368953 340855 307689 288254 256868 214115
18478 214115 194549 186114 184904 158007 131151 118820 107715 119457 119305 109082 105358 95807 83306
18465 83306 77569 64611 57931 65028 59144 56293 45741 41297 38311 38075 38217 37253 40742 39548 30354
18450 30354 26716 32857 50288 49876 31332 34491 25013 26569 36875 25640 15275 8177 10172
18437 10172 18015 15373 24479 36029 32657 32206 23609 25990 24850 29247 24562 25341 29146 19536 14192
18422 14192 19380 29558 33198 43194 44633 39563 29027 22381 10988 10893 22202 24262 12536 25354
18408 25354 33520 36524 34982 28977 26433 33518 39471 47899 49741 37525 29525 24817 33155 39043
18394 39043 32901 22245 10089 13953 22208 24522 24835 27991 28665 40687 35960 18120 1405 -3621
18380 -3621 -5784 389 -9060 -16580 -28333 -22828 -9965 3380 10780 15642 17565 29238 18887
18367 18887 13813 11024 10239 13337 11755 16029 10617 23360 22050 19055 19714 26832 26221 14591 12509
18352 12509 20793 32730 47893 43855 41527 33771 22597 14541 26031 35412 40579 34315 26553
18339 26553 18570 24759 30257 31746 32392 31024 43351 54341 45172 43438 35449 39329 37253 47584
18325 47584 50652 34582 32406 30835 40952 31459 35686 46730 44863 49314 48853 43721 53650 39639
18311 39639 37321 35915 37420 36835 39371 35120 30887 25147 26846 30030 45854 48418 42776 36299
18297 36299 33510 27777 34347 19505 6970 17483 35331 44979 31388 14877 341 6918 19869
18284 19869 30152 26754 26712 18406 4819 8966 16213 19829 16045 8841 14128 34846 40797 42890
18270 42890 26332 28541 26126 32834 38046 47222 59721 49992 43769 55763 60066 56689 49475 41339
18256 41339 32409 45726 50833 53012 58261 55002 49523 55938 50469 57103 62192 68914 58798 53804
18242 53804 55705 54876 58652 70019 70051 66365 54379 56350 55565 65977 65747 61458 58904 63025 56741
18227 56741 54493 64006 61112 51080 57561 53843 59901 66058 71553 77924 71511 63040 69732 73325
18213 73325 76209 79017 66663 66534 78699 76247 72987 82031 90966 81961 77282 84180 87496 99817
18199 99817 90634 81421 82755 91947 89780 81264 78934 75442 92651 107421 105708 100507 92199 84457
18185 84457 96184 98443 105137 103903 96915 97680 102481 106788 107049 100275 94642 108928 112428 111590 111892
18170 111892 105378 105643 106508 110884 114199 116875 120379 120341 120585 128359 133477 133390 132374 136987 143378 132441
18154 132441 145483 160508 163831 167620 182882 186605 197520 196644 194583 210306 229509 254157 265361
18141 265361 275922 289335 292723 304666 308333 314958 318692 311894 313038 327543 341741 347321 364733
18128 364733 381123 415492 444252 476728 517996 580725 617604 651835 703288 771407 849187
18117 849187 935379 1057325 1197113 1362955 1575499 1831180 2154240 2550890 3037954 3674983
18107 3674983 4502740 5550688 6831927 8076622 8637622 8240661 7187730 5997961 5012729
18098 5012729 4299792 3812988 3487779 3258716 3058805 2857650 2652924 2474091 2289678
18089 2289678 2094587 1884559 1689356 1520305 1375741 1256902 1156208 1070732 989251 917413
18079 917413 873099 831941 791604 766956 745249 726128 691193 669627 644315 623085 611827
18068 611827 612158 606891 589243 566582 568280 576455 554564 541267 521424 496322 482680 459268
18056 459268 426282 408808 396355 393022 386155 370439 335296 315726 319523 323363 332493 327040 318013
18043 318013 296906 289345 297675 297470 297929 306735 296504 288848 306732 333929 355079 378006 389714
18030 389714 437517 490736 516799 527625 525443 537551 537157 526256 529292 528874 522189 509045 497748
18017 497748 491856 486018 465302 440701 429862 410854 393424 400591 397866 392003 379965 363230
18005 363230 357162 357294 355459 357122 348270 345079 358901 354201 353089 353211 361104 367542 367515 369543 381354
17990 381354 392169 400198 406862 410765 415783 424787 442301 455329 469432 483154 470779 496854
17978 496854 516972 523398 527568 545188 566011 582910 601315 612481 627379 661515 699707 733311
17966 733311 772627 815987 852112 896058 941768 972702 998661 1022189 1052037 1072341 1097908
17955 1097908 1118960 1134433 1149442 1160547 1162940 1170401 1170192 1175295 1165357 1160883 1178588 1192489 1198294
17942 1198294 1201741 1219144 1247096 1278407 1310389 1340403 1382717 1430175 1483377 1549045 1630335
17931 1630335 1715742 1809912 1904101 1992033 2089614 2216638 2370039 2517758 2673686 2860228
17921 2860228 3056693 3264959 3487268 3719785 3981472 4276320 4597460 4929125 5281016
17912 5281016 5680654 6135530 6656617 7242864 7907953 8690481 9625112 10740999 12103118
17903 12103118 13771594 15821221 18365871 21509238 25424028 30250201 36093569 42974284
17895 42974284 50714934 58792599 66520921 73007564 77293780 78888127 77622015 73792466
17887 73792466 68197612 61712611 55181625 49209893 44056842 39767059 36209276 33179644
17879 33179644 30510374 28051426 25733755 23509793 21383682 19384465 17534622 15851407
17871 15851407 14349577 13013169 11830004 10788192 9870107 9076741 8363357 7706299 7121931
17862 7121931 6590826 6119240 5687659 5295865 4956773 4645751 4364083 4106780 3866977
17853 3866977 3638792 3443032 3272111 3110447 2950986 2809085 2679987 2551528 2441891
17844 2441891 2328775 2223046 2117874 2013284 1914495 1829344 1759621 1690953 1614100 1545650
17834 1545650 1475165 1410431 1345983 1289213 1241108 1200065 1144830 1092034 1040916 1002951 974038
17823 974038 948365 912499 879726 852447 818314 796752 777106 750368 729646 703320 686381
17812 686381 662393 640252 613319 597259 585084 562878 534882 512091 494673 485090 475216 454819
17800 454819 432018 418885 412919 397356 394461 384252 371033 368964 370043 363232 341850 325106
17788 325106 312964 310903 315618 323679 318080 296479 290185 283540 274953 270024 267846 263612 254586 238411
17774 238411 250957 268179 272281 274886 280068 292868 310031 314065 317255 313896 302494 277278 255420
17761 255420 236159 220284 210159 201370 199906 188245 187308 182053 171761 160790 156296 162840 162313
17748 162313 160969 154056 143059 141193 132092 140314 141540 147386 150577 145745 140970 142600 158556 148049
17734 148049 146390 143305 145679 137385 129487 124428 108764 91772 101115 100019 88793 83751 94977
17721 94977 84753 86578 98218 105126 108700 115123 111864 119422 124462 121428 128925 126756 120537 121526
17707 121526 121022 113571 100164 102074 115751 119390 110753 83961 61662 58952 61331 59456 55097
17694 55097 50855 36706 34993 43861 61669 70099 71055 61173 57263 56550 59084 49266 54225 50700
17680 50700 46007 57414 67858 66281 62063 65453 82440 80770 62422 46757 40674 42848 44193
17667 44193 42407 38709 29502 19964 32679 34366 38620 40259 41075 36378 31810 31163 36294 34976 30999
17652 30999 42895 44529 40407 35283 26989 22419 13598 11378 24258 38957 47480 48466 32501 18956
17638 18956 28389 42101 29170 30667 41073 43583 29160 11408 2074 3982 3508 725 3062
17625 3062 14118 28316 37158 34645 29154 24739 29196 34000 25978 31928 29595 30857 32687 29888
17611 29888 23799 19037 28297 26091 21552 35174 38425 31389 19531 10237 9066 19271 33780
17598 33780 32371 36399 20387 12742 7658 -1165 15919 32860 42754 48671 34289 19291 12758
17585 12758 17005 17290 23349 33060 22976 15225 19656 23100 16675 15776 18173 22919 30512 27440 25514
17570 25514 15670 7781 6056 13435 17476 19595 20756 18918 15655 19015 28543 30153 16243 11315
17556 11315 21683 15506 6071 11920 4943 3985 8216 5409 -6831 -1232 -6997 -9976 3321 7940
17542 7940 9926 12880 18412 22289 19615 16854 25137 20228 11693 10657 8969 13819 19867 9089
17528 9089 3938 1360 6869 6022 8578 14128 21377 19296 7291 9280 3977 -9012 -3874 -3647 6472
17513 6472 4663 9138 12949 11006 4154 7344 10834 9025 8070 22184 38053 38328 28731 23057 17692
17498 17692 3046 -7601 -7629 3744 6392 -3866 -10113 -2668 -4072 2246 2426 -576 -1597 5249
17484 5249 5503 6347 15013 19654 19046 8690 -17116 -17384 -28364 -11732 4580 3119 970 1339 -7687
17469 -7687 -1659 12052 15460 623 -2412 7882 18849 23278 22350 21766 13545 4337 8078 12013
17455 12013 9400 -1793 -9058 -3523 5671 2643 3938 18051 23494 29109 20025 20836 15184 18465
17441 18465 33313 45388 37112 30897 36839 35610 40818 30802 18240 20456 21038 25416 17043 18627
17427 18627 18818 22360 33646 30585 21695 19894 13586 16182 18225 18014 23408 14452 6372 3166 2952
17412 2952 -5517 -1874 -5811 -12313 -5762 -4227 -11983 -11450 -2559 3673 10851 11917 11365 9194 9599
17397 9599 13851 19380 21717 14668 477 -849 1902 8278 502 -7288 -10052 -10641 -4951 11047
17383 11047 20615 14806 14438 2487 -8575 -19842 -10113 8572 -276 3763 20729 23308 15003
17370 15003 7071 10157 5364 -6560 -22978 -7983 -1474 1724 -1660 -4820 -828 -3952 -3651 -4662
17356 -4662 -8392 -9615 -7754 3474 3847 2700 -8745 -9664 3574 6776 -3514 -6204 1502 -160
17342 -160 -2674 -6873 -9117 1269 9896 10543 5628 -949 6004 13535 14730 11405 11479 6671 -6690
17327 -6690 -8637 -8400 3743 8134 7929 15383 11659 12163 24653 23292 15833 10152 7894 20454 23675
17312 23675 21139 7224 -1815 782 9973 13284 8770 17835 45671 52041 42021 43452 57807
17299 57807 63007 71993 80317 90262 103931 112649 133261 159089 184706 224350 268187 325836 375503
17286 375503 404297 420022 437352 439154 404297 367946 353527 329985 291129 252607 227263 214535
17274 214535 202120 174963 166264 148197 140126 120925 106195 94002 80858 75504 66604 74837
17262 74837 74936 66890 68221 65121 62032 56673 48906 35655 30898 34688 26947 12492 7926 10029
17248 10029 19441 21462 19016 12354 19143 15276 14240 13845 14695 18414 24613 16125 6866 12184 19383
17233 19383 15144 2183 10060 18844 24484 17277 6962 20365 31866 14642 -2367 -3116 5370
17220 5370 8380 7648 -2318 -10561 -19206 -17457 -2196 14259 8906 -3845 -12383 -7902 -5712 -8015
17206 -8015 -10781 756 9782 2513 -17087 -9575 -4383 -1188 7221 -839 -6568 963 1416 -919
17192 -919 -13543 -16945 -7219 -3565 723 1856 3204 -234 -2284 -17936 -9645 -9125 -4986 -1397 -1215
17177 -1215 -1748 -4147 -245 5395 13421 16010 19539 25609 13610 352 5149 9172 -1303 -4573
17163 -4573 7445 1817 6158 12673 19206 25550 8793 -5553 -1825 -1169 261 -11362 -5308 946
17149 946 5677 5992 -743 8953 5214 -10337 -19318 -16049 -13270 -10700 -13155 -4779 12219 9272 -3928
17134 -3928 -4365 3705 5002 6768 13297 9304 -1428 -4746 -5045 -8842 -813 -2280 -4872 6414 3241
17119 3241 -4781 -2933 8931 1741 -1617 3655 6828 -4471 -14588 -15650 -12959 -8676 -16436 -6862
17105 -6862 -8750 -6720 3983 -1496 -867 -5583 -8681 -9239 -4771 955 6387 11684 10337 -5974 -19850
17090 -19850 -16308 -14124 -12832 -18570 -12381 3998 4667 4486 3760 -4059 -10556 -14306 -13273 -7485 7228
17075 7228 8960 6483 3992 6140 672 -280 9571 15154 13267 3173 1815 -736 555 -2302 -7576
17060 -7576 -4467 4834 -383 2167 -5818 -15287 -22093 -14798 -15544 -17939 -14435 -11176 7129 5986 -3181
17045 -3181 -7195 -8325 -7221 2930 10498 10564 7200 5305 9594 4663 3971 4596 12910 7082 -7004
17030 -7004 -9055 -12500 -1499 1064 -11912 -19362 -3400 6587 15202 5306 -1524 1742 18181 12248
17016 12248 3008 -2502 -9596 -12115 -10637 -6197 2963 888 -2266 -5910 -1796 1524 -6007 -7529
17002 -7529 -1069 10740 12315 4770 -4523 -10844 -18532 -9507 12022 14727 9910 9036 -8524 -17169
16988 -17169 -21375 -22902 -7894 -2408 -12216 -18376 -9833 1967 16070 15906 6148 -15 957 411
16974 411 -4012 -2213 -800 1905 7495 8134 492 1184 1911 -2908 -4302 -5253 -5306 -9596 -12769 -20872
16958 -20872 -16019 -13728 -9765 -7688 -20139 -18115 -26148 -18883 -15038 -20840 -18974 -12439 8852 20255
16944 20255 11802 2112 -3138 -3887 -12479 -17833 -24668 -29330 -26663 -16511 -12202 -10386 -10460 -1448 -1427
16929 -1427 -4571 7761 16474 13006 5223 -8362 -9600 -10929 -56 -12 -7618 -7007 -5240 -10447 -16358
16914 -16358 -22460 -13870 -6772 -1192 -8968 -4266 568 -13468 -24636 -15412 -5659 -4742 -16169 -4265
16900 -4265 13029 13860 10146 13006 7959 -5326 -7222 -2330 -9484 -2821 16276 25920 18260 11083
16886 11083 15140 18081 17288 11514 3289 14014 22179 9761 7724 3148 -4085 1480 -3651 -5774
16872 -5774 -2467 11757 12328 6431 5891 19565 26355 29463 37713 29116 25231 9433 2091 -2345
16858 -2345 8769 3663 9117 -5283 -30675 -34381 -10534 -1120 -4492 -9797 -13335 -3042 -1386
16845 -1386 2499 3280 -9400 -13676 -13939 -9048 -6055 -9918 -1155 10660 4170 -4497 -805 -4252 3791
16830 3791 9882 2858 -6996 -23961 -20121 -10294 5212 -3522 -6702 -2912 -7928 -15352 -10464 2457
16816 2457 620 6275 10679 9799 19502 16053 7360 3306 1672 -6253 -6253 -17567 -29575 -28685 -27153
16801 -27153 -23974 -19307 -2250 1166 4331 4591 9 912 4184 -704 -13022 -13869 -16510 -33361
16787 -33361 -33049 -19703 -8334 2248 12185 12424 1850 -7937 -9441 -6535 -10515 -17847 -12672 -2353
16773 -2353 -1578 -10680 -15244 -14296 -14442 -14449 -14203 -9436 -7502 -21328 -26631 -30945 -24135 -11865 -10940 -16597
16757 -16597 -14992 -8044 -1303 -10940 -15871 1453 2356 403 3788 3456 -2197 -9148 -6021 -9865 -7426
16742 -7426 -1728 -4766 -6776 -614 -3551 -6330 12602 17287 11201 6951 -1138 -6754 -8559 -249
16728 -249 6329 -2146 -13969 -14878 -3640 -2064 1316 -1004 -20574 -25717 -30660 -23618 -22521 -19505
16714 -19505 -9245 -4514 12173 19099 9633 -8061 -9797 -14702 -16884 -14920 -10172 -16100 -3264
16701 -3264 3996 4608 17510 5973 -15808 -19141 -19650 -19205 -12318 -10952 -1208 5530 -10164 -20605
16687 -20605 -16824 -16262 -12506 -8791 -5435 4102 10521 22424 11537 3305 6520 766 -16959 -25222
16673 -25222 -20678 -17569 -18095 -21209 -19864 -8659 -9935 -15967 -13261 -6692 -3052 -2489 1521 6530 17499
16658 17499 13141 5791 5998 -8607 -9022 7046 -2269 -15996 -12679 -19549 -13485 -9143 -6245 1418
16644 1418 1413 -5812 -10223 885 1103 -6248 -756 5174 3578 -607 -10051 -7929 -5062 -8907 -21570
16629 -21570 -22723 -10520 -3174 -5531 -14901 -24723 -33437 -28223 -17484 -13541 -24496 -13621 -9624
16616 -9624 -16051 -13005 -6911 -9535 -9501 7462 11040 8202 9079 603 -5108 -4274 -671 12952 5755
16601 5755 2536 11265 13877 14852 13005 11114 11492 4119 8891 14418 11949 1973 2388 13566 3886
16586 3886 11153 13746 3035 -4511 -6577 -15374 -10086 -3005 4242 13675 7928 -187 -8178 -10338
16572 -10338 -23195 -18971 -7698 -3663 3752 5902 -12650 -18845 -24621 -21215 -16599 -10396 -23408
16559 -23408 -23935 -13602 -8424 -696 -1609 -7288 -7945 -10728 -6452 5229 10694 -2357 -12490 -14948
16545 -14948 -12909 -6773 1475 8682 6107 -1300 -6345 -12106 -12958 -12323 -6512 -16463 -17623 -5009 10701
16530 10701 12103 6693 6601 5816 4432 -3881 -13479 -26753 -24726 -26846 -26993 -30508 -23479 -13207 -1627
16515 -1627 -4043 -5851 -5377 -7855 -14555 -17333 -13701 -11098 -10847 -10351 -869 9890 4332 5723 10219
16500 10219 7838 1095 -5366 -11920 -11611 -6313 -1478 -3106 -1177 -2601 -4738 4456 1659 -500 -4844
16485 -4844 -14161 -3246 7339 -3386 1939 17410 5613 4974 5100 2898 2195 -3684 4472 15674
16471 15674 11909 -3572 12897 22294 1527 -15927 -23584 -18680 -9354 4245 452 -11114 -11949
16458 -11949 -6171 -5832 -5711 -6964 -5940 -4738 12895 11138 3183 1134 2324 -7763 -19365 -21800
16444 -21800 -29600 -16945 -3196 7496 10651 6924 -3639 -19369 -14793 -10744 -1866 -439 -4632
16431 -4632 -1792 -13893 -11746 -4730 755 -8677 -13610 -10051 -4255 -5181 -11661 -7058 -3070 6045 2277
16416 2277 -10234 -7223 -1432 -3701 -5514 -3118 11553 9212 -747 -9372 -14409 -6139 11470 16586
16402 16586 11712 1459 13010 30222 40331 14586 -14825 -21734 -13656 -8813 -1736 6560 18617
16389 18617 16211 5607 -3160 -4611 -4638 5176 8772 2176 -10010 -11924 310 -11525 -18316 -13580
16375 -13580 -8494 -7977 -6024 -1888 11806 16933 13391 6412 -6602 -4344 -1397 -7390 -7986 1186
16361 1186 -5751 -5523 4191 6190 -2455 -1961 4536 -8021 -21930 -26816 -21527 -6344 -10034 -12001
16347 -12001 -2978 -12630 -23424 -18688 -15335 -6476 22 293 -939 14250 11096 2566 11729 8597
16333 8597 1050 2589 6969 11539 13456 -2414 -9279 5370 -3041 -10229 -7658 4437 3853 530
16319 530 6945 2815 -6624 -3144 -8853 -7750 -214 -2655 -280 8517 10117 -1347 -2294 2539 -7959
16304 -7959 -9364 1085 19900 24041 22940 6827 -11006 1679 11549 10229 11748 20282 14266
16291 14266 15725 23083 22684 16520 26815 29225 16980 10227 7344 8774 7543 2042 -3221 -5539
16277 -5539 622 -1680 -15384 -8584 52 1948 -5664 -15548 -8814 461 7579 7374 9880 11879 11462
16262 11462 15363 15174 10752 5077 8187 8751 -17113 -31093 -10531 5038 -2398 -3076 -7153 -11370
16248 -11370 -6347 -10592 -13184 -20607 -24722 -15253 -781 949 -2577 -1489 -231 -8658 -17798 -15499
16234 -15499 -10498 -17115 -21389 -8404 -9201 -3108 1448 915 11160 13760 4272 -7924 -12327 -5508
16220 -5508 -7227 -22567 -30231 -35411 -25357 -17471 -15635 -14630 -19771 -17161 -21953 -12577 -10081 -16177
16206 -16177 -20311 -14440 672 8849 -5739 -4891 2389 162 -13471 -20109 -18876 -14178 -22920 -30104
16192 -30104 -24426 -24994 -24698 -28293 -25369 -12972 -11401 -1058 -4610 -20586 -22117 -7057 -10206 -1592
16178 -1592 2530 5639 8495 12257 8863 4441 9539 2638 -11069 -6172 -11567 -24483 -25227 -13884
16164 -13884 -7341 -2021 -1098 2479 4388 2506 -5288 -7052 -13335 -24262 -16422 -7147 1432 3773
16150 3773 5415 5347 9453 1501 -510 6588 1840 -12380 -7920 2740 7484 6169 8289 6151 -7169
16135 -7169 -11707 -5464 -8009 -17679 -17196 -11279 -26215 -31616 -20056 -1832 4379 -2071 -6068 -3991
16121 -3991 -6133 -5088 4033 5716 3009 8447 7713 1677 -6624 -7500 -12317 -8887 -13922 -20408 -20124
16106 -20124 -14931 -1354 3948 10755 16105 12958 1885 -12629 -19991 -18770 -9736 -16606 -16143 10099
16092 10099 21833 17732 13980 15549 7885 14656 9510 1982 84 -1807 -10007 -22776 -21636 -17872
16078 -17872 -15409 -24967 -26898 51 4743 -657 -14139 -22897 -14018 -6034 -4906 -9941 -16413 -31560
16064 -31560 -25344 -10013 1246 546 7386 7038 -2336 -14487 -21152 -11222 -22326 -18929 -12477 -5992
16050 -5992 -12545 -14843 -14063 -12203 -11105 -4670 -1037 -9512 -15179 -17607 -9541 -9375 -14490 -9924 -8981
16035 -8981 -2721 -1280 -620 -3429 2242 5458 -4634 -8029 -21266 -18946 -3470 61 -6829 -19482
16021 -19482 -17940 -16478 -646 3453 -536 -7458 -22016 -8318 13239 9705 13103 18159 9844
16008 9844 6884 2835 -11739 -19451 -13650 4462 6510 -2697 -4250 -14916 -16368 -14127 -5526 -3414
15994 -3414 -4264 3143 -1 -746 -9971 -2909 -2357 -17182 -22158 -3328 4695 -1474 -6797 -16407 -4014
15979 -4014 -804 -9090 -12615 1052 325 -7574 53 1900 -5206 -15039 -18348 -4865 4274 6621
15965 6621 6585 6328 4574 9374 7811 8860 12535 26056 14218 3190 2728 -3342 -5234 -10654 -13164
15950 -13164 -13182 -17691 -18714 -6412 5415 5963 8163 -1484 -3175 -675 390 7474 12483 1915
15936 1915 689 11217 11107 -1487 -16269 -19289 -23202 -20223 -20531 -14232 -4035 -14014 -19566 -14062
15922 -14062 -14030 -10312 5675 12266 2571 8162 9544 5936 6 2656 729 4160 13586 23333 28527
15907 28527 27933 20337 16631 11816 -215 4569 10045 18711 33159 33095 29196 13925 -692 -2821
15893 -2821 2473 -6833 -16761 -32163 -21866 -5232 2126 -7470 -14094 -14527 -18658 -22199 -20067 -11588
15879 -11588 -10175 224 1432 8382 4635 8629 7051 7220 -2725 -1059 8402 -125 -1022 -6090 -12495
15864 -12495 -1833 6158 -1842 -14675 -26627 -26189 -11782 -10823 -11841 -5009 4407 -1324 -9787 4454
15850 4454 -1995 -8802 2252 6175 4011 1768 11177 17980 5896 -5351 -16029 -9517 -17994 -25036
15836 -25036 -20262 -4221 6594 11533 8218 3326 6638 -3823 -11441 -19082 -19089 -17716 -21482 -17663
15822 -17663 -14453 -17802 -8943 6184 3479 1764 595 1423 5153 2757 -13748 -12479 -2510 10644
15808 10644 7449 5957 15487 7806 -3260 -4702 -14263 -25811 -26363 -26711 -19867 -15522 -13352 -13734 2613
15793 2613 3511 754 -10517 -15419 -14924 -13280 -20009 -20251 -9236 -810 -1762 -877 5563 -1610 5410
15778 5410 5778 1837 899 -12477 -15156 -10855 699 1846 5835 5999 2343 4346 6734 -1855 -1405
15763 -1405 8385 7884 -32 -6323 -21627 -17387 -12965 -15001 -8168 -3568 630 -1220 -5413 -3205 -1169
15748 -1169 4368 9112 952 -6749 -8789 -4818 7195 18419 17095 16071 10419 4424 3872 -3657
15734 -3657 1445 511 1313 18074 20821 10759 1202 -5518 -10205 -11564 -5042 -711 309 -2756 -6022
15719 -6022 5131 1098 -2605 -640 10247 17363 10542 7332 673 -5239 -9046 -7541 -5158 -9253
15705 -9253 -16320 -9919 -2735 3678 4318 -6685 -8856 -7671 -11021 -2525 -3876 8729 16544 10568
15691 10568 -10201 -7646 4651 14293 7531 -1489 3586 -11249 -21339 -15626 -21786 -22606 -11559
15678 -11559 -13808 -11564 -6134 3009 6331 994 6352 6469 311 3689 9083 6985 2557 952 991
15663 991 -6363 -11789 -21882 -24822 -14454 -5151 -7722 -9092 -13412 -10946 -6804 -7272 -2752 -7774 -13787
15648 -13787 -11813 -11194 -16443 -11253 -417 6210 1403 -10761 -15069 -6290 -1739 10653 13902 -1027
15634 -1027 -10670 -8994 -10108 -12011 -17119 -15015 -12215 -4404 -581 2167 -367 -2756 -1018 4944 8241
15619 8241 12303 19779 10185 14395 15427 346 -741 -3193 5150 4167 -8356 -2627 -18 -9363
15605 -9363 -5682 -6735 -3066 917 -2126 -2271 -3008 -16331 -15181 -10759 1902 7721 5894 6961 -177
15590 -177 -1944 8211 21527 17645 8438 5888 1417 -1134 6233 17957 13573 10532 12576 24579
15576 24579 24576 35122 36865 23764 9434 204 -9256 -10694 -4334 -16668 -19330 -2080 -2143 -1766 10977
15561 10977 14964 8114 -2184 -17973 -22998 -20406 -13492 -6419 4639 -10412 -20739 -12822 -8079
15548 -8079 -14711 -17065 -15667 -20834 -24252 -11097 -8728 -4 15736 17590 4671 8135 13528 8146
15534 8146 -5731 -10317 -7881 -10589 -4192 2009 -1145 -1581 5853 1705 -6827 -6884 -31 4100 3980
15519 3980 -6729 -4146 1610 1540 -4330 -7103 -7385 2527 11851 5683 2768 -806 6321 2890 -8575
15504 -8575 -8221 -3890 -3726 2612 15797 12134 1735 -5030 -1798 -4764 -16953 -10147 -1643 -5642
15490 -5642 -6616 -28 -3319 1893 13635 6679 7214 4659 10466 9644 18885 24088 21938 13566 -656
15475 -656 -5784 -10608 -5840 6025 4237 3891 9425 11079 13147 17171 12816 -287 -7031 -6164 -6481
15460 -6481 6116 4726 -6118 -441 -3808 -2247 2167 -4159 -7392 -858 -911 3638 5127 -4473 5056
15445 5056 2754 2813 12126 9106 4440 2335 10490 17680 18501 19794 24123 22065 24319 27683 31235
15430 31235 15763 -45 1754 1380 -9328 -8346 -18683 -11988 3399 8423 -357 -9545 -11365 -4766
15416 -4766 7696 3513 3382 6872 9527 21450 24484 14237 9529 493 -3224 3434 3223 11090
15402 11090 12019 2666 9032 13370 18872 19302 25450 35683 37622 32351 29644 28177 13723 8919
15388 8919 27826 46484 48727 48356 40524 36476 44915 38342 30578 36007 36932 39502 25557 21117
15374 21117 14265 11034 2644 11009 24042 18829 24748 30154 32800 28551 27445 26034 23959 18844
15360 18844 19179 15603 23507 22405 22887 18267 14539 1115 3396 7570 10100 7264 14854 25565
15346 25565 16914 5911 -3691 -6448 -4636 -5278 -5400 5780 1994 -6986 -227 -214 -4555 -2604 6988
15331 6988 7198 2521 4543 9617 1562 9443 6495 1393 -3381 -6145 -6972 -9549 -12689 -7008 -2276
15316 -2276 7259 22672 25008 13529 9754 16427 21522 11240 3665 12124 26281 24250 6594
15303 6594 8124 15850 14458 15802 18681 12639 3855 9364 12607 -12381 -15212 -7923 5201 4758
15289 4758 7667 15302 8899 8933 9844 12394 8527 5517 -3510 -8212 -7020 -7252 -6966 -4623 6227 4525
15273 4525 10580 15272 2096 14182 22767 7315 9070 8010 10540 26150 23431 13843 1347
15260 1347 -6004 -9225 -5872 6477 -1085 -8128 -549 9980 13737 4335 8732 3844 742 -1043
15246 -1043 -684 17153 7494 1722 11110 11027 8969 -153 3860 7517 7236 924 -4321 -16594 -16350
15231 -16350 -16485 -21602 -29511 -17969 -3995 -7722 -7565 2064 15550 14740 4398 5159 4067 -4913
15217 -4913 -15272 -10081 -3148 -5018 -17182 -17605 -18143 -16067 -11990 -3862 -2293 7059 11301 13213 17018
15202 17018 2144 -13263 -14692 -15761 -9111 2682 16938 21161 18770 14964 10981 -5417 -17649
15189 -17649 -14940 -3763 4796 -2076 -14262 -1175 17555 23473 32171 21762 -2784 8779 26514
15176 26514 13843 -590 -4995 1226 15390 10093 1723 -1686 9183 12495 14784 13314 10011
15163 10011 6026 1290 -2635 11408 25244 24353 23464 15647 -2681 -7493 -13587 -15355 2974 9714
15149 9714 1432 -7725 -9359 2190 4998 -4968 -7245 -16705 -19318 -19241 -13724 -5587 109 731 455
15134 455 3010 -336 2889 10124 712 2881 7574 4191 -8111 -12504 -7554 -7477 -10556 -970 1380
15119 1380 9738 17361 18410 19345 7130 -559 3687 1515 606 -618 6614 11951 -4034 -14278
15105 -14278 -6127 899 10328 17211 11403 6797 16481 21815 19970 10118 5380 7212 4601 -2815
15091 -2815 -2599 -14697 -7396 6048 4913 2285 327 -14431 -16050 -19632 -18127 -15147 -834 8400
15077 8400 6542 10066 15804 20626 15029 -1452 -4084 455 -2653 -17351 -24075 -15377 2236 10680
15063 10680 23467 25969 16738 11495 8078 10009 5571 659 -5454 -2957 -7636 -9339 -12661 -11754
15049 -11754 -5855 6813 7086 2810 2279 9584 27814 21953 13398 -3421 -4932 -607 -1426 1051
15035 1051 1388 2312 5768 15181 24909 19229 10816 -2593 1363 -4163 -5783 -5350 9153 3778 10076
15020 10076 17152 8231 3079 12975 13613 6884 6929 139 -5814 -11943 -11142 -13018 -14106 -3767 -6355
15005 -6355 -11617 174 7152 5570 3837 -222 -1730 8478 5151 6944 -1953 -11403 -5104 4370
14991 4370 -9699 -14339 -10020 -685 861 -3149 9604 -1272 -3317 8344 4639 2971 5538 8927
14977 8927 10946 13151 12063 5273 8737 18672 15188 123 -6480 7519 20994 6607 -6315
14964 -6315 -8356 -8647 -1335 -10387 -20114 -22543 -11661 -7207 -3316 -4885 -3194 -10224 -8680 -18559 -16459
14949 -16459 -15934 -8294 -2838 -1813 -3680 -4439 -2520 12830 23531 14215 18654 15162 14701 10258 8309
14934 8309 -2449 -5732 -4385 -9036 -8098 -4104 3463 11768 19535 17554 16443 7493 5142 10104 20632
14919 20632 29844 20633 7799 7311 -596 -446 -3910 -886 -569 -4852 -14421 -15251 -8337 -331 -3835
14904 -3835 -8410 -16162 -12060 -8382 6839 15677 8688 -1426 -11468 -18109 -8649 4034 13540 27149
14890 27149 26156 14955 15126 20271 20574 18331 5693 10511 12465 10228 10197 8046 -2672 4151 7549
14875 7549 7996 5234 -4032 -3774 -2142 228 7099 6632 4910 6755 732 2372 19459 14872 15677
14860 15677 22792 15901 8717 -2033 -682 4617 -2159 -4999 -12107 -12329 -3060 -9816 -13056 -3980
14846 -3980 6840 -391 -1357 8541 5020 -4339 -5357 1207 14116 12505 9857 16166 31089 26234
14832 26234 17650 22065 23304 26225 20082 16080 8304 -1995 -1052 -220 4267 10953 9911 19129 14234
14817 14234 2550 -6081 4379 7262 10372 5162 -1129 5202 6249 -1855 -1423 1945 327 -13137
14803 -13137 -22983 -22847 -20171 -6308 5376 20508 24937 21878 13739 5075 13903 18709 23201 20358
14789 20358 26752 30338 24873 22375 11714 6460 1377 -8618 -16525 -18514 -10203 2441 -1068 -5861
14775 -5861 -8707 -11520 -5258 -2153 6391 6930 19393 27478 23991 12716 8334 6825 14372 8552
14761 8552 4604 1474 -2513 2188 6979 15779 11012 2588 -640 474 -6665 2668 10904 11306 2948
14746 2948 8485 9426 5591 9536 -474 -6464 -15761 -6985 -175 6191 8637 11800 10669 10567 6648
14731 6648 -1009 -567 1269 4087 -6012 -15498 -15852 -8661 -2318 1806 4914 7498 5049 3156 -6555
14716 -6555 1471 4437 6846 12881 8214 11428 13784 11538 19190 7916 5941 5332 -2522 6903 10563
14701 10563 14139 15562 22786 13089 10303 18299 34642 31671 15065 9242 12742 15928 28909 25370
14687 25370 18422 22993 27038 29186 22064 18695 20452 8576 8598 11886 9973 12095 8955 9715 4972
14672 4972 8408 6661 9367 10818 7105 11605 19927 19985 9883 11626 8572 9087 13699 296 -11831
14657 -11831 -11166 6137 20364 19030 12792 9524 7367 12054 11823 17616 23767 20155 13285 6367
14643 6367 1868 8549 11349 11980 9484 -3876 3767 9522 4977 -1280 -7665 -18876 -11927 -6383
14629 -6383 -613 8452 22366 18676 21253 12216 1723 -6234 -7238 4040 12080 19164 18409 13075
14615 13075 8256 -13 -2320 5579 7088 9794 -369 -8058 -2970 10657 20438 20116 15697 12043
14601 12043 4240 -523 2531 13176 20863 9276 -1626 6813 5459 8289 28225 25022 20976
14588 20976 11821 13788 6073 -14759 -13482 -18688 -15690 -10595 -6432 688 -5158 -1605 -8599 2415
14574 2415 10138 2236 1480 -1257 -8006 -10053 -8984 7532 8368 6069 -6961 2868 345 603 3582
14559 3582 8099 16295 13226 12984 11635 7574 1454 -6914 -13263 -9591 4831 18665 20555 16095
14545 16095 20977 34371 30202 24257 29612 28887 24640 13121 12854 20429 36163 30378 21466 20033
14531 20033 17336 14585 19998 25119 5610 13386 25908 24771 20568 19912 27524 36383 45463 29723
14517 29723 21729 25488 27554 27944 10708 -2805 -1119 438 -4335 4700 12494 13106 16798 14440
14503 14440 18150 27012 39209 35045 22802 17281 10620 8829 736 9456 12945 13852 17570 10945
14489 10945 1871 -11181 -2040 4842 3142 1682 9163 7265 6206 12008 8082 4114 6077 13701
14475 13701 8332 -4202 -5307 3384 13676 21732 20826 7027 -2466 885 -1538 -6011 -2010 -2589
14461 -2589 -4112 -1969 4255 7969 -2550 -7306 3202 11831 23907 19284 13431 17428 13693 2244
14447 2244 -4486 -2589 5932 6929 6431 3707 1133 7092 27004 18536 14277 10301 13345 5073 -7131
14432 -7131 -12508 -13097 1570 9108 8195 4169 10814 9531 10731 10409 10597 10500 10930 23394 23588 19031
14416 19031 18264 13297 10058 10123 13840 12847 5500 13211 19071 21911 17770 5808 2455 5085 5957
14401 5957 1505 -7446 -5558 -10682 422 2681 6370 14308 23197 13786 18743 19211 18735 19358 8447
14386 8447 -7743 3890 17415 20052 19183 12525 8521 294 -2165 732 4714 4386 7400 38
14372 38 12038 15851 12893 9588 13285 9995 -2899 6589 15666 17035 15645 14360 22416 33048
14358 33048 23448 33407 35615 27370 20732 14723 15391 21676 24888 23577 30364 26397 21561 13274 9586
14343 9586 20716 22881 16591 18017 23220 22599 22360 20495 18674 13466 12139 15033 9990 3652 15119
14328 15119 20922 24619 23672 25205 21834 21315 35480 38830 24083 13206 11505 10382 15483 24820
14314 24820 23382 12877 8933 8466 988 -1011 -1386 -6159 -6578 -532 4945 4434 -12277 -6594 2578
14299 2578 11032 20509 9281 3354 7885 20533 22559 14953 10718 20498 15209 2256 6667 25935
14285 25935 28538 26704 19395 28033 30403 24780 15177 17360 19793 13714 3803 2232 -6041 -401
14271 -401 929 -5024 -91 10310 26177 26565 15029 18995 19053 6453 5190 8754 29756 33711
14257 33711 31744 32325 26180 17154 15441 17508 12088 18557 14164 12054 19456 22074 13612 3816 -1002
14242 -1002 2102 11554 20418 19169 18837 16980 11082 20005 21437 19735 13203 15265 19673 25925 29664
14227 29664 28281 25611 25814 27402 17502 13156 5889 -1774 6762 16737 13859 2424 3261 11640 19662
14212 19662 18364 19267 31245 34469 28270 31780 25919 13430 4694 -975 928 -928 8595 16360
14198 16360 26182 25680 17143 15128 16090 15748 17707 20179 23851 17759 11838 16408 39531 43454 38050
14183 38050 39141 38152 25745 15388 20693 19014 18660 23738 22890 14334 5410 -1927 5348 18512
14169 18512 15678 14897 15256 26785 29746 24561 22859 26876 15918 263 770 1336 11132 11313 10802
14154 10802 -6163 -3971 -5983 7087 13167 13708 18093 14751 22302 24847 31102 42309 36374 23969
14140 23969 18515 17131 14822 15892 28555 25438 5371 3723 10565 2857 1451 5553 669 -140
14126 -140 7886 11623 15454 17642 19576 14303 10199 15484 31546 32824 32003 32226 32803 17598 7833
14111 7833 12065 17849 21485 28286 12754 5083 1900 8467 10957 20391 27794 30629 34649 33373
14097 33373 23858 12473 6767 7570 5982 6979 11004 20594 20061 16714 11520 13173 18983 25755 25577
14082 25577 11661 10107 16431 7006 1899 6011 4804 5975 -5337 -6104 660 18483 23220 30831
14068 30831 33555 25544 24009 29782 30453 29478 31390 44881 32219 21620 19950 18568 15331 15077
14054 15077 20145 24700 22394 18336 19911 14302 7821 12816 21382 23609 19406 17905 18880 27632 40532
14039 40532 34233 38497 36336 22267 15523 23582 33197 38109 40348 34168 25241 25098 27662 22570
14025 22570 16341 15205 10884 19450 35025 38855 32511 25500 22131 20851 21871 31937 33182 27110
14011 27110 24978 15436 285 1251 6293 8697 13792 25049 35824 30195 28068 37214 47447 40680
13997 40680 37805 31628 36499 55090 61922 58328 38911 26411 22484 19511 6680 13673 17405
13984 17405 25244 37398 43646 46959 32469 29344 45096 42065 25358 19759 22412 31655 35497
13971 35497 36226 30234 32216 33755 37124 36816 30015 11100 15567 25001 29692 39715 36273 31866
13957 31866 23532 27302 28854 31054 31643 27426 31083 43684 53322 41658 32263 31851 39418 32633
13943 32633 34693 39474 39077 37442 33820 31263 33654 33980 36191 41232 22162 22336 34147 28526 18484
13928 18484 14338 18920 21772 19599 10383 9179 15133 20587 16356 10793 18775 39599 32209 22457
13914 22457 32667 33977 26937 21690 25416 17265 31762 36087 26054 21312 20087 15688 9644 21361
13900 21361 27687 32828 37221 45331 40931 44971 38123 28912 25262 32879 31504 33553 34182 27870 17384
13885 17384 28424 37078 35453 35924 48379 34892 33954 26890 18716 16511 25388 31435 28726 26043
13871 26043 21561 23584 30532 39062 41457 29482 20413 32141 31301 26341 32212 36256 30190 22148
13857 22148 17345 9601 13410 17323 20727 41050 50948 52747 38164 16920 10509 12636 20565 33522
13843 33522 38729 41339 34965 30826 21421 5656 15468 27143 29371 22375 33331 39419 31507 35719
13829 35719 50975 51599 45064 44405 40185 34338 27027 18022 15045 19741 27664 26222 21606 13945 14565
13814 14565 18162 26327 31380 24108 26035 28930 13075 4905 22950 37874 48896 46189 39987
13801 39987 34582 40993 47372 50346 62698 56831 55389 47022 21675 23461 33701 31952 21469
13788 21469 12332 23268 32563 39849 35028 38781 35502 25545 37784 50763 48035 56364 58431 55252
13774 55252 40101 43579 56047 51764 55819 49776 36207 42193 50692 47215 37316 37247 27523 18099
13760 18099 24386 40951 46885 47499 51313 53022 47043 44221 41906 33583 39223 50092 63466 56601
13746 56601 58706 63489 62625 61842 59061 42080 31648 36021 39315 42343 43261 34662 35799 35950 40453
13731 40453 45703 44270 54027 64957 61901 58128 65979 56292 38365 25234 38884 53229 47506
13718 47506 44624 47028 41227 45070 50620 45091 51039 58659 59588 54521 49819 36636 42367 55395
13704 55395 47398 36188 37079 49917 65600 55964 42875 31595 29085 32283 35568 45233 46860
13691 46860 42141 32770 36348 46609 44730 41071 49941 61978 58422 52767 66106 50949 32094
13678 32094 27445 41477 50319 38949 33463 49608 58548 53009 49732 47400 44608 39261 27906
13665 27906 42154 44142 43761 47781 44790 38273 24796 25091 42714 38769 24115 37350 48008
13652 48008 48932 43275 50626 50387 47408 34083 27641 44256 53408 43711 37956 40221 38746 52453
13638 52453 65604 65140 67960 66337 58310 49176 46980 45306 34547 34659 50025 48921 45296 52125
13624 52125 58417 56808 66148 69923 59896 48214 49320 67537 75687 74867 67715 56373 53336 62137
13610 62137 63682 62436 55062 54528 46633 46854 59026 59233 60380 74555 64398 62457 75559 76588
13596 76588 75854 66968 60458 55272 45602 32903 26750 36943 37950 52404 56978 58032 58260 53272
13582 53272 61946 67322 64711 71833 78628 79168 79981 72787 55316 53403 62825 61822 67732 68142 65003
13567 65003 56744 57477 55209 45784 44379 58344 63279 53057 56004 69402 75595 71940 86982 77041
13553 77041 67893 76180 75644 72361 63520 60836 60764 57636 68930 68427 71300 76470 77836 66635 56325
13538 56325 55593 52685 52011 44272 43793 49778 49322 49389 55345 41658 52202 68853 72124 59470 56427
13523 56427 53103 44999 47143 49665 61547 61692 54551 40891 35338 35815 38577 40468 43445 48124
13509 48124 56224 66566 54407 44497 52963 61121 67096 61082 56981 51471 52940 69240 79946
13496 79946 76084 71663 69189 68331 74395 82027 77159 73449 80060 62557 70722 81953 73086 69895
13482 69895 72124 79263 84024 80545 84715 79362 66471 58554 60626 71054 76605 77792 69296 62015
13468 62015 59028 56508 65774 67284 71982 76346 72279 59929 66724 71841 81112 93698 89057 89939
13454 89939 96385 102143 103024 101233 93268 88878 91976 99248 98283 86918 75691 79460 76533 63881
13440 63881 57455 66058 74507 75330 82562 85832 83596 83431 76320 71094 87075 97723 89923 86665
13426 86665 76837 69876 72191 90000 93663 92473 82715 84772 86819 82443 84756 94966 97674 100511
13412 100511 101512 97100 91051 76897 80767 84112 90754 85450 84874 95452 95817 87932 78994 77326
13398 77326 64245 60360 66757 61550 60375 72935 77657 81849 88515 85390 94326 97884 97610 87580
13384 87580 81654 92847 102439 94521 101571 97616 106484 102386 94437 87567 80230 82870 90254 87844
13370 87844 83737 90441 88959 85059 83540 82705 86753 94872 98011 95565 104431 96123 90060 93422 99926
13355 99926 106860 102250 89766 90626 84612 93386 104244 104920 85774 76276 86693 90427 97860 101273
13341 101273 107528 106574 113432 117209 99082 84765 84998 96462 108788 102395 97896 109800 110543 105253
13327 105253 107774 115900 118032 110969 115568 115749 120912 126267 126245 110716 92435 94106 95818 90836
13313 90836 81570 89927 101144 98693 95712 107883 111387 101678 101542 95790 98304 102771 104737 100758
13299 100758 100829 101913 105337 106448 110925 107654 99238 98318 109954 114182 111045 103609 102576 108087 113671
13284 113671 105769 97566 95195 96726 95515 99714 101994 95049 98931 104868 105246 108599 112934 106108
13270 106108 104657 109643 117357 121895 115323 124843 133464 127627 129788 127255 122165 113480 111242 131591
13256 131591 137781 142303 134446 112475 103149 95226 93168 97398 114585 117334 117899 111625 118600 129348
13242 129348 127736 125873 119940 130347 126795 116885 112618 125642 128683 125294 125349 127676 134088 130907
13228 130907 117885 118499 131409 136636 140101 148009 135503 117734 114047 120435 123820 125972 127500
13215 127500 130118 140010 141273 137410 132707 134389 131031 126256 137273 149080 150317 142796 147891 141109
13201 141109 138645 142141 136565 130914 132752 139097 139449 126683 126274 123474 120623 117558 117840 114942 128576
13186 128576 136212 146528 154894 154697 140259 131192 130678 141129 150922 155511 158384 156353 153992 153307
13172 153307 152214 155440 159783 162072 160724 165576 163231 163517 159197 152119 155513 165876 162062 153584
13158 153584 154789 169900 182918 178817 172053 170097 168505 163449 166031 179952 182071 182989 180616 185665
13144 185665 187299 169247 165081 169607 175448 171263 178306 173377 175479 175125 185153 183632 169652 176668
13130 176668 176960 174579 176185 183749 179627 173435 161804 165304 175512 175395 174698 178842 178269 176551 175911
13115 175911 168067 167180 168385 175208 174505 169848 166256 168135 184728 195053 194485 188913 173968 182467
13101 182467 192855 199629 194508 191443 182034 185085 180693 179352 182680 197445 206741 203496 204611 200907
13087 200907 197153 193827 197622 198837 197827 197710 205363 195010 192867 193820 198139 198462 204035 203019 192076
13072 192076 184144 186513 195635 196608 191897 184609 188285 204478 196853 195513 200658 194025 186199 186819
13058 186819 193326 193911 194784 189537 191089 197946 197573 203298 211375 215116 219908 221413 221548 220371 211735
13043 211735 203237 198632 205310 212494 225062 220439 219887 225387 240253 241096 240003 241929 247201 256802
13029 256802 241104 226266 230743 235832 232677 235146 242714 237959 237852 242977 254268 261988 267390 253221
13015 253221 252620 262793 278611 277418 269819 267634 271751 258305 248638 249806 256731 261369 258769 254439
13001 254439 263807 265374 278538 284060 280374 276095 270262 275125 277500 272324 271522 272219 267033 275784
12987 275784 292595 296289 301695 301503 289029 285540 304706 306679 307139 303046 295907 304291 304145 298878
12973 298878 309059 316264 310573 304759 301005 300966 303366 296987 298504 297372 305856 304966 305619 306947 301562
12958 301562 303986 313607 304055 316466 328616 325266 325392 333719 344774 347981 348156 359723 358464 369064
12944 369064 376915 376113 378022 383327 381004 381064 383595 367633 361638 363904 361992 357262 352756 368871
12930 368871 384908 385967 396437 416275 427370 421060 414912 415473 419449 421449 418285 428384 430932
12917 430932 427237 422064 418779 427330 434735 432606 430445 430310 433219 422946 423936 425860 414813 427646
12903 427646 423393 430201 438801 444026 449265 471470 495090 498550 503629 510882 504406 495764 505711 515709
12889 515709 538810 552912 568996 595211 613910 631852 662068 696443 745140 827659 901288
12878 901288 982215 1076105 1199557 1375344 1573218 1777431 1931860 2006295 1964699 1835548
12868 1835548 1662384 1484745 1351383 1257066 1197452 1141096 1094963 1056943 1010613 974497 937886
12857 937886 900181 853663 815784 790227 769946 747098 735043 719858 712873 694659 687484 694740
12845 694740 693764 685897 679585 683714 676054 665670 652993 640258 641834 646056 651762 643967 636333 627320
12831 627320 630584 631169 635277 634823 643681 639038 641426 649647 650730 661381 658562 652627 633467 627561
12817 627561 643672 662056 682541 676980 676027 681629 686040 695699 690020 685486 692040 714298 722660
12804 722660 726692 729800 718163 721050 729742 735206 737688 741578 757846 769161 767928 771872 772226 786888
12790 786888 787602 785985 791269 802107 814692 819452 817103 823902 847804 857002 845162 854754 855428 851494
12776 851494 847695 842666 838091 844204 842986 847815 866168 876138 879068 885784 901346 921850 923834
12763 923834 925161 929654 931483 933308 931045 934179 938979 939240 950147 968863 993040 993504 999676 1015094
12749 1015094 1021463 1026785 1030237 1039839 1050630 1064630 1081798 1110587 1122777 1133468 1145942 1176856
12737 1176856 1219475 1262021 1314108 1360183 1408141 1438456 1448422 1442834 1420609 1388066 1358348 1340477
12725 1340477 1341835 1335615 1324026 1323451 1331069 1340201 1352572 1342180 1344209 1352048 1368246 1385147 1394455
12712 1394455 1400157 1402720 1410824 1415243 1421388 1420788 1412516 1416242 1430174 1440641 1451933 1452567 1453948 1463594
12698 1463594 1479535 1500811 1536031 1562072 1573681 1568265 1551698 1552303 1573222 1615412 1670484 1739151
12686 1739151 1796210 1837890 1861626 1867287 1883504 1901020 1912932 1903995 1883985 1868094 1854016 1853735
12674 1853735 1854603 1853095 1856380 1869260 1878887 1895826 1909650 1922958 1934971 1942464 1956449 1989332
12662 1989332 2018896 2038025 2051603 2068935 2092282 2113715 2142906 2170538 2181660 2194143 2222400
12651 2222400 2241934 2262807 2292685 2315935 2330995 2351662 2385916 2408204 2429129 2474076 2499859
12640 2499859 2524129 2558278 2590914 2626075 2678011 2718525 2761618 2811511 2865791 2922933 2965134
12629 2965134 2999865 3041824 3078804 3114150 3136975 3131877 3135567 3135936 3154191 3192592 3228959 3280178
12617 3280178 3313531 3353762 3393198 3431779 3473606 3526315 3553855 3590917 3638418 3698819 3753572
12606 3753572 3794635 3844736 3910087 3970765 4027763 4080455 4141830 4212838 4286716 4338278 4386171
12595 4386171 4446482 4505312 4556588 4605905 4669590 4730347 4795709 4849807 4907872 4980291 5058784
12584 5058784 5148024 5229056 5326825 5436435 5537525 5637809 5740034 5841180 5958464 6088612
12574 6088612 6208087 6325816 6440811 6545245 6653711 6761430 6867084 6985056 7099363
12565 7099363 7233121 7389038 7545948 7690848 7861456 8022617 8169103 8296759 8421074
12556 8421074 8559828 8722347 8880336 9030934 9198910 9365262 9536420 9712454 9911363
12547 9911363 10127819 10342121 10545547 10763512 10983883 11198507 11401461 11611339 11830142
12538 11830142 12075375 12329027 12586530 12852784 13115093 13386333 13657880 13921238 14203751
12529 14203751 14508205 14803464 15107536 15418138 15745730 16069697 16388043 16716636 17047797
12520 17047797 17368659 17699688 18025761 18352666 18673131 19002498 19345743 19685860 20022945
12511 20022945 20362928 20708429 21056458 21399126 21742420 22089741 22433982 22756299 23078873
12502 23078873 23395908 23711069 24035087 24345101 24646542 24941299 25215286 25477041 25740410
12493 25740410 25988251 26220561 26435701 26641475 26826162 26978435 27124140 27243396 27354759
12484 27354759 27450248 27519089 27568722 27618528 27663104 27685459 27699428 27729776 27745663 27773381 27813386
12473 27813386 27860676 27908372 27962046 28029903 28106052 28177093 28233960 28300127 28373823 28475818 28587870
12462 28587870 28733622 28930823 29171323 29490882 29886189 30369780 30944662 31651721 32509492
12453 32509492 33522543 34730952 36172700 37890969 39939368 42432190 45475717 49196723
12445 49196723 53795640 59494379 66512068 75073014 85579537 98445410 114280685 134077064
12437 134077064 158971656 189820329 225674690 260586233 285061022 292876956 281793514
12430 281793514 255691840 223493951 193360014 169331072 151628156 138621418 128420008
12423 128420008 119704101 111631479 103808622 96154718 88663899 81199914 73788466 66694000
12415 66694000 60171165 54359818 49309115 44959280 41232735 38014959 35238077 32810447
12407 32810447 30645047 28728496 27028914 25493732 24093508 22804551 21631850 20554110
12399 20554110 19564332 18671424 17877726 17154393 16475791 15852473 15275885 14724094 14201813
12390 14201813 13711902 13247695 12800687 12359933 11934220 11553722 11172974 10811318 10467801
12381 10467801 10141306 9832832 9541002 9256972 8982042 8711848 8459623 8217824 7986597
12372 7986597 7769592 7557225 7362741 7177696 7004065 6832531 6667127 6492904 6328651
12363 6328651 6182746 6052551 5925246 5797320 5673505 5542794 5424743 5301902 5183543
12354 5183543 5067117 4961565 4855587 4752223 4650422 4552226 4441345 4333877 4240531 4139993
12344 4139993 4050303 3974097 3892696 3822369 3772976 3721248 3663588 3597946 3539376 3481379 3415442
12333 3415442 3358018 3307315 3262715 3215944 3168467 3124371 3080941 3038711 2990669 2924279 2876385
12322 2876385 2837800 2805156 2779679 2762930 2733260 2707393 2690444 2669702 2654465 2659334 2680683
12311 2680683 2706652 2723099 2755699 2761929 2731418 2664564 2570674 2458868 2356402 2289154 2266450
12300 2266450 2257716 2217674 2184637 2142017 2089659 2032747 1992065 1954999 1940381 1917984 1901328
12289 1901328 1884753 1871828 1857921 1849322 1840545 1840651 1842997 1851031 1865530 1854125 1850961 1830079 1798469
12276 1798469 1754524 1704480 1669882 1631283 1600395 1586239 1565526 1537974 1513900 1497443 1496503 1494699
12264 1494699 1470072 1449466 1449850 1443507 1441345 1440008 1433831 1424513 1442614 1438463 1420880 1415040 1406063
12251 1406063 1401718 1401902 1406420 1411385 1429951 1442639 1470439 1497227 1507711 1497853 1475162 1448104
12239 1448104 1419827 1399937 1363735 1318805 1253969 1205293 1173262 1154284 1148648 1143626 1127545 1096028
12227 1096028 1083386 1083708 1089208 1085491 1074920 1061526 1040807 1017221 1006850 998058 989220 980385 960806
12214 960806 942729 936220 923597 914841 907197 900305 895630 895323 897463 878482 860943 859149 862136
12201 862136 859420 848520 832477 821643 818426 818333 813937 807825 792533 770655 748640 745289 747026
12188 747026 735638 729498 720001 724559 732636 724244 717360 716204 722131 730846 732254 727339 715453 687989
12174 687989 675509 663143 648701 644224 650913 662935 671223 667265 664808 659653 660337 651326 647203
12161 647203 644754 635558 620006 615190 620663 620706 608964 594464 600808 603322 597734 594855 594515 593834
12147 593834 585584 577901 583895 588764 580090 554559 543176 535047 530220 530716 523976 524782 530958 531411
12133 531411 530855 538975 527212 521095 519052 518489 513452 515631 514639 488442 484270 489177 498685 496799
12119 496799 494793 500583 497145 491032 496963 497103 492580 494738 484749 475181 470580 465353 463092 467705
12105 467705 454804 443166 431336 417855 414375 422210 425864 420159 415874 418555 416979 430735 429652
12092 429652 415118 412696 418115 406463 398456 394410 389819 377343 365376 354047 361791 370294 365223
12079 365223 354637 347853 338800 326146 328369 334203 337845 347356 351420 352452 345150 344137 346802 343186
12065 343186 344684 354841 355788 353807 341960 340567 346455 345522 348422 353771 340671 333062 330217 330275
12051 330275 331290 330475 325143 333617 335325 331488 337717 350903 342552 338969 334651 328510 317316 308321
12037 308321 322134 326536 329396 334255 334627 325385 307003 303966 309617 305363 310263 308770 307650 312676
12023 312676 320048 319886 303955 295395 297612 303441 301916 296455 306985 323731 322395 317442 324705 322352
12009 322352 315995 326425 343154 330481 317121 328310 353949 383945 409232 426916 443141 478852
11997 478852 517881 564536 619567 687621 778380 895394 1030554 1209629 1403492 1578463
11987 1578463 1703202 1731762 1658690 1507270 1330515 1172471 1043633 960468 911404 865208
11977 865208 808236 748561 701559 674045 632225 576061 533753 501471 462178 437031 427189 406450
11965 406450 374864 365194 348049 342386 337423 321858 297555 276414 272596 273017 276027 265718 255110
11952 255110 246277 243122 245593 245466 232546 223727 234732 230166 219542 219417 216181 214913 212504 203450
11938 203450 195386 198824 197669 191935 194575 193204 185396 193580 197591 198647 196645 196007 195458 180412
11924 180412 178243 172984 174242 183312 186007 183540 171915 156409 170941 180096 172559 155965 154691
11911 154691 158693 161359 169244 174135 189515 182657 182652 180738 165399 155483 151786 151336 150721 139282 140498
11896 140498 152130 145571 132491 120899 119714 123698 132967 133326 150324 159332 157156 153983 144614
11883 144614 139922 143546 151035 161066 161227 153521 153324 147743 139367 129981 125278 131813 135101 137512
11869 137512 134350 129306 130400 139816 144605 141105 126891 128528 134863 147229 146024 137323 142918 140718
11855 140718 137396 136655 141587 136795 136447 149497 161968 152511 142750 136083 144941 143672 141482 135186
11841 135186 134341 125614 113602 114539 121588 136931 138848 130388 127046 128515 120504 108381 93662 98107
11827 98107 105071 113617 120993 117136 106460 108423 130063 136875 139090 136494 113414 112380 110189 104197
11813 104197 106349 103769 112512 112898 119894 118822 110826 110328 115749 110305 109216 115110 115487 119447 121134
11798 121134 117677 107576 118695 125203 123809 109474 98317 96750 98424 97437 100001 97456 97889 101618
11784 101618 83142 84811 108405 124292 128657 117171 96607 88179 81654 88961 115024 110663 93552
11771 93552 92899 97250 92926 98567 97570 77901 79408 87058 86051 84096 88833 83603 85258 96541
11757 96541 109046 110706 100806 88774 76607 72813 66748 74325 86486 87871 84735 80780 81397 90189
11743 90189 89984 81388 82492 81412 85669 87598 83830 85806 89796 84074 82461 86072 79864 74239 78027
11728 78027 86182 96944 93538 86607 91901 91690 90262 91486 92143 81010 71543 63126 69867 79104
11714 79104 84080 91155 87264 96488 109683 97097 82644 71329 71000 80971 81776 83289 91999 83368
11700 83368 74304 73552 71873 70802 72354 68160 64273 61264 51570 49218 61342 72984 65537 53834
11686 53834 59682 64083 73399 67745 64771 72735 69855 61179 63660 69285 70937 69764 75294 72810
11672 72810 68624 58043 56302 62037 70832 76016 64154 60009 69038 71491 68565 66738 60694 60586
11658 60586 59115 57588 52956 57576 58086 53998 63330 67694 64561 59634 57068 52812 61807 63957 71916
11643 71916 76210 69945 63347 51006 48512 44355 45242 53459 64616 79488 67129 56333 49014
11630 49014 52203 58447 57388 54962 51169 62172 61573 57812 53544 43395 46296 45859 43159 50996
11616 50996 56883 59317 59534 38719 41164 45314 34072 35452 39166 39602 40724 51367 58938 64043
11602 64043 64437 58666 44792 42423 36458 35269 33241 36178 46269 52745 61737 52811 52106 43312
11588 43312 19086 11604 12390 27654 44118 67837 77476 62742 47201 45434 51660 49385 55809
11575 55809 54574 49125 47364 46399 47117 39280 38445 41104 52062 59562 48868 41173 33102 37998 38475
11560 38475 44227 61585 50622 40670 41986 47122 54832 51844 50825 53529 49517 44933 47283 35033
11546 35033 19437 24560 36061 55217 61210 48886 43900 53396 44109 36498 44180 54055 49392
11533 49392 43634 48156 40467 28168 32772 32089 29731 31972 48452 43059 43898 39497 41498 48560
11519 48560 45969 47247 46393 44857 43502 38369 35324 37190 41956 34867 31100 34331 36364 37610 31304
11504 31304 34751 39233 47997 36352 18350 13472 20373 17323 20170 36558 36898 40687 28687 26219
11490 26219 34084 38449 36374 46918 50715 37767 28017 27916 17608 16767 27902 33283 22556 34870
11476 34870 32493 21723 19047 28608 36419 29384 29175 38841 40683 39022 36824 33783 43358 43511 26980
11461 26980 30413 47093 56830 47806 29573 30053 24811 32185 44351 48234 50772 42635 38365 40956
11447 40956 39888 33477 35093 36611 43345 49780 45562 45586 53754 50698 42603 33803 37390 36831 29608
11432 29608 35994 34145 36125 28277 26801 33620 30019 15062 8909 15526 20495 31343 27894 25485
11418 25485 29525 23440 23390 38929 41109 46629 28525 19508 30133 17263 21700 29340 28115 26630
11404 26630 28778 24485 26158 27855 25518 28056 21834 11775 12336 18400 18513 16099 19918 25739 20593
11389 20593 11618 2662 8108 -7985 -6816 6172 18106 22018 5153 -7312 3757 16001 35095
11376 35095 47019 43157 42349 34009 33655 37198 44071 43788 38448 29404 25557 26476 37100 31882 30367
11361 30367 28554 14380 14545 17438 13227 11573 17801 27178 27559 19372 20906 14705 292 6148
11347 6148 16866 25561 31026 39716 37924 27361 13025 871 5291 15002 24844 35084 31940
11334 31940 32315 25237 14847 9759 8433 13444 11623 8546 22673 13418 4185 4390 2772 4243
11320 4243 6091 8459 4292 8723 4406 711 9837 27568 35125 31173 30603 17468 184 -2572
11306 -2572 2119 7122 -3189 -19248 -25846 -21913 2055 21443 14775 18824 21352 9086 18931
11293 18931 31422 28564 22444 22133 27396 22673 23040 17926 20218 20889 30721 40179 39917 38181 40446
11278 40446 33830 27845 17517 17049 12674 16557 11192 8950 -3389 -13562 -14248 -5202 13531 26442
11264 26442 25895 20956 32184 26658 12938 20803 26198 23238 10703 6919 3650 60 1484 16257
11250 16257 18878 14009 18653 26233 18210 12281 20913 12999 5251 7576 13212 10038 -1243 -5307
11236 -5307 -2676 -5629 -7854 11102 19359 17925 13588 17582 27018 15496 -8346 -8020 9620 26610
11222 26610 19008 17921 16591 19854 23696 18563 11873 13350 19910 13935 11090 9543 6627 9792
11208 9792 9476 11082 12323 14622 22352 18964 31708 46547 31309 26374 24887 30932 21813 10695
11194 10695 5275 13659 22429 23851 11055 4226 7033 15165 20534 19489 24328 27987 29066 26653
11180 26653 24563 32728 37181 26193 16854 14296 16155 20376 20835 27408 41917 35423 19528 14739
11166 14739 20742 23350 13915 14724 18395 15806 19179 14811 22700 31463 36440 30193 13614 12901 12284
11151 12284 4176 -5241 -4597 2763 12878 21480 17871 17171 24390 23971 18600 22206 32304 33932 26371
11136 26371 9356 -4666 8789 12104 9813 2382 2735 3743 -8661 -12944 -4617 2060 -106 -13992
11122 -13992 -17704 -13597 -7115 1067 1785 6980 -265 1024 -612 -4208 -4356 338 -2153 2922 -5439
11107 -5439 -6860 2238 12758 16990 21988 15885 -1895 5530 12432 6550 20480 27337 19046 7561
11093 7561 15940 21504 22825 21507 31034 27686 16642 15268 17253 27108 27373 16501 23523 20787
11079 20787 25045 14134 -7942 722 12992 14316 12687 3455 -5875 -8817 -3342 6154 7781 2261
11065 2261 -3338 3174 -5301 -9338 -14304 -2404 8975 7162 -144 7361 13838 5022 8423 10264
11051 10264 10932 17790 20671 17858 7280 5297 7269 7788 1697 -14480 -8653 12059 20437 25253
11037 25253 18558 4469 1217 -5874 1550 4408 -3324 1384 12623 3035 8557 5684 5624 7692
11023 7692 3345 5982 11371 16637 15066 20125 13533 -8234 -9035 9509 18246 20893 27453 25542
11009 25542 14696 15691 21489 8707 7941 12631 16530 21916 18638 10969 6747 3155 -5267 -10018
10995 -10018 -657 3313 6009 15095 18071 13940 17580 31111 28783 13701 2619 5078 9368 12401
10981 12401 13398 21628 21454 15126 20428 25510 16579 15172 28799 27538 21892 32655 30175 27798
10967 27798 25655 12240 5285 2736 2585 4890 10680 11713 8990 9817 1803 2728 13557 10810 6560
10952 6560 -1751 -8959 -19449 -12431 -5366 -7213 -14148 -12207 -22780 -19873 -19853 -13899 -4959 -9167 -7209
10937 -7209 -9131 5928 17838 13036 -1111 4951 -11131 -12200 -12025 -14360 -8123 6063 11548 12454
10923 12454 -642 -1905 10106 17673 19445 19110 8060 3077 1622 -1743 7253 29279 28608 27328
10909 27328 30129 16749 5538 789 -8764 -24862 -15610 -8448 -8536 -2154 -7654 -15223 -16266 -22037
10895 -22037 -24897 -6130 1721 -9145 -4411 12736 10611 12384 4433 7782 10676 11349 8462 2311
10881 2311 -10283 -9910 -12948 -12665 -13114 -16032 -7036 8944 14069 23333 32271 35869 14282 5039 4560
10866 4560 10314 7538 7019 14822 4805 1143 5678 8858 5950 5970 12669 24321 8883 -1347
10852 -1347 4015 9162 6292 -4086 -9102 -5359 12264 15532 32527 16329 -285 -1293 5851
10839 5851 1110 5474 -1131 285 2058 -2305 -9387 -10423 6430 9126 5360 10767 6966 6079 14931
10824 14931 12162 7190 9881 18907 21072 14761 -2234 -16698 -27222 -16286 -3485 8308 8877
10811 8877 2220 405 -676 218 10450 26168 17330 4758 9993 10088 17576 26238 22984 34339
10797 34339 42882 22022 3642 -149 6640 7016 4666 8848 10232 11204 12324 3043 3908 6516 -2138
10782 -2138 2513 -694 -8076 -7937 234 11708 12232 17515 24519 20171 18956 28898 26467 13837 17974
10767 17974 14690 8209 14877 30926 38121 43249 41105 48367 55760 61762 51937 45010 32590 24975
10753 24975 29821 32769 29097 26884 43586 54532 62548 71721 76530 74896 70256 66429 67970 79267
10739 79267 98466 123297 136981 153474 165143 172659 186015 198784 220422 251509 271365 304967
10727 304967 356619 421380 494467 570416 675794 813354 976835 1194569 1483590 1849553
10717 1849553 2250666 2536141 2525797 2261150 1905491 1589797 1362180 1195298 1077809 982946
10707 982946 911156 840735 778259 724578 667750 609406 555377 488928 421383 377853 341972
10696 341972 303692 280907 262292 233365 202314 185139 192189 171632 141910 124027 118674 117672
10684 117672 113980 106729 93856 76538 64064 73592 91279 90567 82301 62723 59303 65338 70989
10671 70989 50976 45782 54870 47317 32196 25511 35485 37026 26541 22636 27019 24760 23619 8685
10657 8685 15777 31146 28784 22738 11432 14529 21801 27147 30872 31088 24980 14758 18832 22107
10643 22107 9240 -6762 3753 8452 3141 -8628 -7686 8193 12945 16641 17147 19751 29547 29013
10629 29013 38618 32549 22142 24852 26938 35629 28834 18296 -1430 4977 6525 6073 2553 -763
10615 -763 3245 5695 -464 6407 5138 478 1881 -1942 -1837 -1899 -13949 -26728 -31416 -22422 -9517
10600 -9517 -5937 -12424 -18089 -15507 -22461 -16796 -7755 -6371 -11616 -596 -1785 -5498 2287 -455
10586 -455 1337 -4283 -24245 -13832 -4721 -3430 -7610 -21383 -20966 -4327 -1388 4014 10483 15755
10572 15755 17256 10065 3152 -7772 1491 12324 5054 3781 8048 17480 9475 -9826 -11848 -9564
10558 -9564 -8911 -1683 2466 10328 17399 18023 4177 171 -8702 -10594 -5494 -14126 -21523 -21292 -22874
10543 -22874 -10410 -3381 -6990 -1943 -7084 -12191 -11663 -6325 -2107 -2299 6919 8373 12241 13970 22202
10528 22202 16254 5393 2082 13350 8080 311 16473 8202 2679 -10395 -12728 -16878 1759
10515 1759 6184 -3209 -1513 -7737 -10856 -7852 -9306 -6095 -11510 -2747 -3531 -5691 -11412 -9819 -13700
10500 -13700 -12365 -12086 -12097 -6728 -5282 3526 13395 23196 26363 22346 22045 7018 -4542 -5545 -7004
10485 -7004 -2242 7038 5882 -3007 2072 2566 -3060 -4240 -919 2675 6758 4317 3271 -6215 -18107
10470 -18107 -13206 1634 6925 13407 -899 -16930 -18648 -15978 -9628 -3302 -719 7617 4078 11793
10456 11793 27876 23846 6931 -5727 -8557 -337 13146 18576 18003 26588 33185 19247 15489
10443 15489 7007 6291 1719 1562 -587 -2673 1390 3304 -10602 -10623 -608 11287 21720 14109
10429 14109 11172 5896 -47 5587 1675 2485 -3983 -12982 -14358 -8967 -14554 -17665 -17417 -13445 -9385
10414 -9385 -19628 -15625 1738 11697 7743 -11875 -12710 -12335 -14832 -4679 7641 -3324 -9795 446
10400 446 13698 579 -5276 -2234 -9440 -12827 -11222 -2555 1596 6631 6165 5630 -823 -1315 -8223
10385 -8223 -5042 -10619 -9145 6778 3934 -1959 -7246 -8861 -13417 -20183 -14687 -16822 4538 15866
10371 15866 16266 20422 25839 34635 26720 19664 19281 25238 36322 35717 18315 -2326 -10891 -4768
10357 -4768 93 8578 11722 11744 10829 12442 19160 37834 36350 38665 34182 34526 28752 15803 28924
10342 28924 37176 40907 32849 19620 18157 18658 36155 42967 47314 50082 58950 69243 58227 70391
10328 70391 88866 92100 100081 102170 110340 125384 130642 154360 171682 179174 206507 244930 294833
10315 294833 343780 402201 485541 562603 659871 753473 831392 913884 988397 1045833 1081356
10304 1081356 1090332 1066627 1024653 968784 890956 808879 719579 650973 599108 547850 503468
10293 503468 462194 414657 372057 343429 313078 286156 245810 225413 204183 176732 160525
10282 160525 150115 151746 148713 147135 142801 130518 114070 97754 86435 78656 77523 69157 65926
10269 65926 69592 67757 66443 62697 61412 54271 53812 42236 34169 39729 39580 25557 5758 -423
10255 -423 14503 28902 32546 27538 28296 22920 13432 14265 13052 19490 7652 12586 15945 12369 5223
10240 5223 -7421 -3541 7330 9334 7536 170 -3337 95 11164 17790 14017 1127 -1455 430
10226 430 -469 -8554 -9794 -9981 1362 5038 8671 2197 -11052 -15914 -3165 2562 -7324 -1543 -2242
10211 -2242 -9227 -13395 -15023 5478 10375 5239 11497 11409 7739 -4073 -5955 6037 -3659 -513
10197 -513 -4912 4276 7178 1300 -4076 -11570 -8316 2885 11527 11063 5700 9094 7479 9578 10267
10182 10267 14934 12133 7563 5968 -3807 -15529 -26470 -17639 -5337 -2030 -1147 1476 2197 9202
10168 9202 7405 -910 -14400 -22245 -9746 347 -1858 2114 5193 2999 7262 10079 11131 1663
10154 1663 12257 7400 12708 17347 15373 13725 -8777 -18687 -14464 -11541 -5140 11517 19142 10406
10140 10406 7482 -586 -11046 -3778 12903 6738 -6318 -6084 -9439 -20888 -17957 -11875 9424
10127 9424 14552 13435 13709 15363 13578 21546 19424 13240 14058 21824 20829 14542 7554 8702 -3690
10112 -3690 760 -4966 -9886 -10725 -16074 -17134 -9366 -6802 -2224 -5795 -12676 362 12220 10596
10098 10596 2823 858 -4895 5316 4439 2627 15423 26292 15753 5280 4561 9336 14966 10882
10084 10882 777 1190 -4499 -4808 3584 -1619 -9967 -7814 -5327 -11430 -17492 -6416 -10690 -11139 -8774
10069 -8774 -14615 -16614 -13243 -20302 -29076 -21678 -7343 -1702 -9991 -14335 -6649 1322 7819 12659
10055 12659 305 3779 -1557 -4988 6871 5600 -7307 -9968 -9984 -4864 14703 27130 14260
10042 14260 9978 3622 -10715 -12433 -13344 -15906 -16382 -6014 14048 15664 9920 4050 5818 8623
10028 8623 8042 20910 34326 29679 28065 14892 4045 11750 22161 14076 -2807 -6771 -12122
10015 -12122 -15348 -9496 5734 17961 21702 7363 1280 -6788 -8364 -8191 -5743 -3469 -3518 -10270
10001 -10270 -12864 -5766 4131 3136 1190 5693 6126 3830 7440 10996 10292 9017 11475 9635 -4964
9986 -4964 -12749 -17077 -15743 -20098 -17602 -20635 -3300 6215 9325 13939 8184 11343 11672 21961 15211
9971 15211 11431 7640 9803 8930 4862 -2144 4606 9701 6661 -3687 -3768 -1096 -10682 -6570 -6796
9956 -6796 -5611 -4486 -2969 -15865 -25216 -16409 -20065 -10210 -18526 -18858 -7157 5664 17516 30038
9942 30038 23703 4956 3829 7393 7671 10210 -574 -8841 -585 1317 2287 -3593 -16219 -8960
9928 -8960 -971 -8167 -6014 -585 7880 13345 14525 15775 15048 15727 9306 11983 20180 26654 19454
9913 19454 18396 12321 6596 2316 5393 10144 9404 14822 21394 30851 40308 32736 27312 36463 31841
9898 31841 28957 20110 12255 7166 13828 22375 15581 10732 4417 449 14669 22105 12895 7163
9884 7163 15897 8334 -4679 -3133 -2948 -16309 -9260 2824 14615 17644 22830 18587 12552 23918
9870 23918 32566 35706 30989 20953 9144 12722 23951 19282 15445 30129 45585 40184 31937
9857 31937 38763 50041 51547 51177 42333 33638 21400 17609 25138 32566 38559 43208 48204 43177
9843 43177 39333 36436 40374 35542 26453 41363 42929 40773 46703 38331 47791 56664 50726 59427
9829 59427 69632 72914 68984 76751 67770 64379 71539 67688 76396 77959 95244 98882 84158 78832
9815 78832 80448 95566 96979 89266 85471 96826 98475 99502 103463 116972 120662 117792 125710 132143
9801 132143 136203 141052 143101 163382 179451 189267 215664 229771 250451 256901 264611 268240 300474
9788 300474 330268 353208 378677 412551 454759 510342 570102 630448 702069 782705 879064 1012351
9776 1012351 1159131 1337972 1562250 1811307 2097732 2429483 2793691 3159884 3475712 3685709
9766 3685709 3777885 3791784 3759195 3705456 3640008 3520163 3319159 3058205 2777700 2497189
9756 2497189 2261759 2046273 1839233 1640001 1464825 1305099 1152565 1027997 926117 845179
9746 845179 769286 692334 629501 566852 520486 481022 445226 401291 361772 339557 321163 309805
9734 309805 293699 273733 257674 242789 218876 208564 207250 198300 182286 166885 160750 142318
9722 142318 125503 109697 107119 95251 93740 89336 87079 87111 96784 93106 93909 92323 74178 65937
9708 65937 73207 65030 52303 45070 40770 31358 26381 32973 47033 55905 60685 48107 35553 18881
9694 18881 21791 30317 31794 29584 34757 48030 38494 33880 31379 29987 43045 45871 37330 27554
9680 27554 26612 34336 32700 22807 20392 29539 23376 23638 26787 29120 34059 32177 28532 25824 25211
9665 25211 24613 31001 33952 25943 10900 13034 11177 20915 16153 6767 1890 -1631 4915 -1922 -2294
9650 -2294 -1788 1219 -5052 2699 9959 12281 4116 3584 3864 2479 -1910 -4321 -1796 -4287 -7910 -3617
9634 -3617 1132 -5110 -1705 8737 6598 2068 -4463 -14180 -9255 10588 23954 26834 24655 21766
9620 21766 21451 20262 8952 3675 3354 -3134 -6555 -2515 -3983 -3912 -8495 -14057 -4763 1308 -4236
9605 -4236 -18445 -10636 -2652 -6412 -15877 -12298 -8738 -11252 -14415 -12232 -2601 4337 7490 5747 -8429
9590 -8429 -9807 -1256 1361 -2225 -17886 -17966 -8487 -8597 -7023 -5868 -4621 -3880 4234 20306 25647
9575 25647 15125 1803 3636 7970 -4783 -5976 -2054 3011 6006 -6762 -7489 -4409 4879 9823
9561 9823 9743 3000 386 3940 4638 -7289 -9818 -2441 -8403 -12813 -9572 -16415 -19028 -19053 -6369 568
9545 568 7346 5896 96 -8241 -3489 15892 21932 23165 16797 6657 489 -12580 -14375 -12472
9531 -12472 -15844 -1337 8506 3509 -1495 -986 -7092 -8968 -10994 -10973 -12478 -2847 -3759 2553 9566
9516 9566 6233 -2647 -13905 -15803 -2114 -12926 -29486 -20397 -9928 -3723 -3062 -14328 -14062 -16623
9502 -16623 -31727 -19763 -7566 -4420 -5 -476 -5166 -2286 -4243 -3836 -3654 -5526 -764 1373 -70
9487 -70 5554 3062 8370 11812 2078 3732 7941 -3139 -18365 -26812 -28267 -24580 -15066 -11412 -15541
9472 -15541 -17749 -5233 5374 7799 6896 11905 4867 2485 -1024 -10916 -23359 -19903 -16526 -16629
9458 -16629 -9906 -9055 6366 13501 8842 -1640 -10168 -6256 3171 6761 11938 13905 3751 1722
9444 1722 4847 1247 -1697 -8226 -8248 -4626 -154 1076 6237 -933 -3093 -7219 -4332 -8331 -11177
9429 -11177 -23305 -21011 -7795 -6896 -11549 -11862 -19483 -24044 -23090 -18847 -19062 -27338 -19710 -17598 -23298
9414 -23298 -29971 -21214 -20978 -19109 -8483 -5810 -8389 -4106 -8227 -13879 -15559 -12388 -13271 -8487 -3557
9399 -3557 -7288 -1193 -423 3354 -4424 2202 -3738 -3759 -1314 -1397 -8662 -9427 -4033 2853 20751 25837
9383 25837 12651 -3233 -10549 -22904 -11954 -10879 -12015 -21126 -19242 -20585 -25829 -21349 -15177 -22633
9369 -22633 -26067 -22286 -12695 -10525 -18121 -19604 -34015 -29489 -18631 -22829 -16074 -5358 653 8626
9355 8626 8788 -6701 -9800 -22634 -27717 -32818 -40976 -38472 -22582 -11306 -17459 -30010 -39173 -39190
9341 -39190 -36718 -15897 -18149 -19350 -18944 -23142 -13855 -7481 -743 1280 18517 25679 17596 5426
9327 5426 -1145 -1370 -3870 -5866 -7832 -3356 -4272 -10962 -14830 -18241 -26097 -34471 -35732 -36608 -22254
9312 -22254 -24569 -24416 -11551 -12239 -9281 -49 -2768 -16773 -21012 -12929 162 2478 -1222 -836 1528
9297 1528 -467 6172 8389 2808 9610 7896 -453 -2591 -1030 -5328 -5068 -344 6266 8614 4793
9282 4793 2831 3255 -6340 2135 18034 19467 15120 14342 6389 1231 4739 3741 712 -5504 -3155
9267 -3155 -9629 -8073 -6676 -8309 -12423 -8073 -6951 727 2432 4101 415 -4186 -18475 -23041 -9102
9252 -9102 -4218 -5456 -9464 -6365 -10649 -9648 -19155 -19914 -6336 -5515 -5797 3109 -245 -2455 -11187
9237 -11187 -11405 -6693 -14495 -15255 -18253 -14900 -6349 -1742 -13841 -11779 -18135 -20545 -22455 -21759 -20232
9222 -20232 -18423 -7131 -11159 -14450 -7351 -608 -1877 -8448 -11591 -4374 1227 -610 -9307 -13537
9208 -13537 -14464 -16919 -15344 -13757 -15580 -16757 -10905 -11058 -13721 -7390 -3702 1322 9725 7113 4556
9193 4556 -4852 -3387 964 3661 847 -10108 -5556 471 4280 3453 1035 697 7099 7756 509
9178 509 -4056 -5105 -8418 -4757 -6492 1181 9817 -3434 -17226 -14717 -9223 3875 16013 14464
9164 14464 3200 -11155 -19864 -4853 -249 -7317 -9798 -9632 -10712 -11395 -10179 -972 6439 5997 5918
9149 5918 -6581 -10966 -3270 -5239 6910 15591 11563 11097 7755 3010 -5093 -10174 -16151 -15204 -14515
9134 -14515 -12880 -27278 -30414 -27565 -22536 -27288 -28933 -19043 -14289 -8805 -9671 -10333 -16677 -11313 -6513
9119 -6513 -2726 6148 9736 7692 12445 6674 6621 12547 11863 -3454 -7812 -6188 -1773 -11010 -8957
9104 -8957 -9947 -15523 -9967 -9465 -13797 -23569 -24775 -24956 -17657 -11587 3182 8930 1641 7125 6617 3441
9088 3441 5858 487 -6279 -5722 -5690 -5642 -9395 -16224 -20770 -22419 -20469 -6700 829 5382 -3618 -14438
9072 -14438 -9362 -7511 -5286 -12535 -10299 -102 8850 5809 -6053 -6774 1997 897 -7807 -1725
9058 -1725 1256 4729 8012 -2440 -6458 -2659 -1994 4812 10159 9489 -11250 -14727 -5806 -150 5364
9043 5364 1344 2626 -12424 -12638 -6532 -13223 -17498 -11405 -8366 -1586 -574 -6898 -16653 -23546 -17690
9028 -17690 -13033 -23117 -15708 -17070 -5711 -3839 -9790 -23689 -41822 -39482 -20629 -12791 -1387
9015 -1387 2504 -492 -4329 -16044 -23012 -23345 -14338 -7176 -11495 -13874 -16990 -2624 8900 3999
9001 3999 -4431 -8015 -559 1793 1990 2559 -10307 -11782 -12511 -8493 247 -1760 6977 -314 3228
8986 3228 9600 2642 -384 -7396 -1137 -8543 -13780 -11799 4651 2318 -76 -660 -5369 -4696 -12371
8971 -12371 -27865 -19149 -14621 -21316 -18969 -17887 -14218 -9997 6970 19797 13553 15137 3546 -7526
8957 -7526 -10661 -2914 2423 681 -2710 -6053 5362 -1028 -5783 -12575 -23196 -14947 -2750 1912
8943 1912 2191 -16522 -28848 -14486 -8116 -12395 -10385 -14703 -26031 -17588 -18433 -21039 -25754 -14712
8929 -14712 -9874 -6618 -6625 -4431 1082 -6918 418 -1651 -7312 -2140 -5873 -15599 -10790 195 5600
8914 5600 16425 16940 12961 5151 5109 7050 5306 -9066 -17556 -8252 -1357 -11146 -9367 -5483 2283
8899 2283 5295 13010 2798 -10974 -1552 -6789 -8921 -9938 -2787 7645 5410 3109 -4753 4333
8885 4333 5875 -7965 -4604 -4467 -14068 -8189 11509 18350 6341 -5867 -16691 -18383 -25389 -33341
8871 -33341 -26864 -6319 -3735 -8584 -19482 -22188 -17464 -14939 -9851 -3851 3826 1291 876 11050
8857 11050 9712 -330 2715 6113 -8333 -4046 5845 7351 5966 9155 3090 2680 11858 11316 15474
8842 15474 23744 29485 23442 14577 6802 -5760 -3335 1937 -1841 8548 14370 16795 10315 1866
8828 1866 1083 14359 19126 9279 -5731 -9245 -1903 422 3994 -2430 -2663 7778 9141 8772 14382
8813 14382 13614 3655 -1048 -1162 -10963 -1521 1769 -4077 -2879 -1201 2176 -1678 5684 9956 9051
8798 9051 2739 4142 370 -2470 5196 -4983 -5674 -9602 -1626 5873 -1958 -7400 -4411 -9883 -19769
8783 -19769 -17071 -15697 -9146 368 3578 6089 1334 -491 -164 -5521 -9579 -14403 -27828 -28019 -27608
8768 -27608 -21228 -3060 197 -16107 -11310 1859 10905 27 -6314 -7087 -7914 -7461 -5190 -11637
8754 -11637 -10540 -3032 -329 -19943 -15486 -4374 -8182 -14634 -13662 -19428 -9763 3565 4716 7694
8740 7694 15462 13379 16675 10498 11330 13134 11573 6280 9211 17241 19973 279 87 571 4647
8725 4647 6335 8178 12586 1010 -259 -2273 7593 14445 7621 7381 2878 -608 -262 536 6963
8710 6963 14366 21174 13051 -2563 -6800 -7272 -4590 13697 22126 25021 11270 11556 12884 4668 11961
8695 11961 8859 1977 9818 6551 9808 4623 -7759 -20615 -13760 5961 11109 7999 2599 -34
8681 -34 1552 11365 10333 4705 -8290 -7840 -3148 -14657 -28795 -26259 -22519 -26465 -21965 -14971 -8889
8666 -8889 -249 8749 4899 8140 3174 -14221 -22733 -14081 -15575 -9708 -4224 7574 25634 23887
8652 23887 544 -8072 -7583 -1948 -9925 -13671 -9129 -9232 -7880 -6328 -15998 -274 10330 14757
8638 14757 14505 4011 1937 11565 12545 23966 22646 2292 -8734 913 4451 16313 14230 15885
8624 15885 13380 14088 7752 17204 22641 13775 7774 -9319 -14895 -8671 4808 10682 9270 8557 2421
8609 2421 -2607 -10295 273 14658 16411 7196 6835 -4933 -2905 -4638 2584 4223 -4224 -2615
8595 -2615 -868 5585 11397 8835 2684 -2596 -6367 -6430 9314 -1612 -13097 491 -6218 -3608
8581 -3608 -4671 -4981 6130 11509 8158 5692 3044 928 10452 22128 30324 31737 21719 12559
8567 12559 12130 11326 17835 20603 21527 21665 20628 22301 33619 36764 31031 21770 26199 29973 29867 33399
8551 33399 30350 22236 9683 901 3574 4593 14760 16226 17736 24286 28518 20198 11693 13779
8537 13779 11094 -4837 -8615 -3021 -5542 -2019 4816 -594 7822 16396 9611 10982 5916 7041
8523 7041 413 106 4367 966 4481 -1859 -1706 3068 6854 11531 1570 -3092 -1863 6069 5351 -13693
8507 -13693 -20377 -16892 -7839 5634 2487 5137 18226 17206 7440 -311 3086 -3913 -733 -1700
8493 -1700 -17238 -15080 -6073 -6012 -7154 -3656 3777 6087 2875 4475 1461 -6661 4039 17472 19370
8478 19370 26062 12491 152 -8065 -14801 -14507 -7123 -14906 -30409 -31516 -31244 -29585 -16563 -5485
8464 -5485 14494 18359 8494 12915 20246 4840 -10137 4533 14929 14591 -985 -5291 -3402 -8386
8450 -8386 -2101 -4954 -5502 2401 13499 11016 5017 -4388 -4583 -8855 576 -856 -7640 -4027 4125
8435 4125 -72 -8387 7857 4103 2640 14628 13603 487 -7491 -6953 5132 13041 9476 648
8421 648 -10675 -18362 -18940 -18462 -7303 -8851 -662 1562 1923 -5913 -6241 1453 -3062 -10111 -12867 -21501
8405 -21501 -19381 -13555 -11709 -4594 8018 9308 6719 4859 -7003 -23880 -20401 -15651 -13450 -5345
8391 -5345 7482 3208 3804 -2226 -1218 9183 16253 11644 16335 18685 9953 5316 -3367 -399 -6517
8376 -6517 -307 7805 2922 -7902 -23700 -26327 -17609 -16926 -16142 -25602 -32180 -34773 -37996 -27527 -16532
8361 -16532 -16935 -8407 -5450 -10119 -9079 -12503 396 9247 11684 10169 18090 22844 20083 5157
8347 5157 -9186 -10184 8971 7622 10698 -1973 -10395 -11526 -3229 -3082 -4753 6106 10192 14264
8333 14264 14252 11461 -6214 506 4922 -11846 -13764 -8037 1474 5712 12780 1712 -5175 1902
8319 1902 -3154 -5229 -6486 1334 -388 -11543 -6355 7977 8893 19118 22345 11420 1556 -1285
8305 -1285 -982 -5829 6605 14402 7775 18609 26304 18694 6001 1598 10139 13843 7436 4772
8291 4772 6841 3241 2046 5262 6163 -1631 -4518 -6403 -1817 10609 6786 5345 6104 1419 4464
8276 4464 -5733 -9011 -13080 -9281 6194 6326 -235 -1695 -7422 -13550 -1879 12102 5556 -15830
8262 -15830 -19033 -17511 -20328 -19487 -10359 4675 9024 19935 25476 20590 7020 8867 10727 13839
8248 13839 11057 8400 8568 3267 4921 18602 22437 6405 -2364 -5722 -1872 4761 10851 15601
8234 15601 18981 16311 19266 7216 -6394 2226 5781 -7285 -20519 -14423 -8460 -8332 -4960 823
8220 823 5969 1211 -7803 -16526 -16508 -28106 -39529 -36239 -23102 -8458 -11252 -19073 -29636 -24229
8206 -24229 -21836 -11336 -151 81 6812 12659 4855 -6083 4294 4748 69 -7256 -8310 -12952
8192 -12952 261 12085 7117 14917 12058 4730 -2117 -901 4005 12753 15427 18726 13403 1694
8178 1694 -5258 -10380 -8973 -9445 -4774 -4880 7438 13146 8898 9916 6649 -9470 -6023 -13091 -23009
8163 -23009 -17712 -91 4761 2696 -1149 -499 10758 15309 7339 4629 13989 20706 17969 21047
8149 21047 7679 -7282 -5855 1787 2670 -8353 -19847 -10988 1674 10083 5286 4777 9234 -574
8135 -574 4723 4171 21661 14568 9921 7041 8051 14737 12929 11180 3407 -1352 -503 10313 -2745
8120 -2745 -17410 -1381 6006 -2648 7984 9875 2465 4736 2848 -10305 -12299 -10393 -13571 -11577
8106 -11577 -6857 8053 14095 12203 5950 -3642 -14710 -33620 -37494 -35073 -30692 -22622 -9305 -3181
8092 -3181 3866 9040 3821 4975 196 -15435 -6965 1674 11497 -569 -7217 5598 11015 9635
8078 9635 2444 -2641 -11345 -7821 -2649 2118 4262 3833 -3064 -12176 -19839 -13067 1964 2509 6631
8063 6631 20758 25499 11286 10081 10396 15097 17166 12755 9695 8347 1428 -6429 -4827 -3206 4574
8048 4574 3385 12520 10429 -9093 -20304 -13237 -3241 7265 10523 5117 -12170 -6517 -1255 -12287
8034 -12287 -16168 -15492 -6068 5682 10222 2337 -3397 -13938 -17047 -587 8374 1281 9260 4688
8020 4688 -4314 8190 18709 20519 25108 20254 17372 2221 4282 13533 12407 7075 5817 11500
8006 11500 11339 4858 -8134 -3982 -5984 -4911 -5708 4824 5140 6561 10320 5637 2492 -1172 -15188
7991 -15188 -27069 -22260 -11120 3205 9688 14241 19356 19770 21417 20537 6419 -5293 -7359 -3685
7977 -3685 177 -3415 6414 13432 2944 -9014 1563 14736 4230 -2420 -4906 -3737 9579
7964 9579 13514 -311 -3560 -5377 314 -7733 -12030 -6862 -7326 -6121 5977 -4354 -13813 -1068
7950 -1068 10537 2480 -2379 -7827 -3065 -5006 -8206 -12736 -10880 -3613 3783 18349 24941 28362
7936 28362 22635 14293 14047 12952 9114 11784 7505 -5474 -119 -459 -1307 -6341 2005 15871 15423
7921 15423 8434 7437 4930 13554 28833 20678 6222 15438 26972 17961 2963 -8035 -6443 -8556
7907 -8556 -14781 -20004 -16297 -7236 3867 11277 7502 -524 9225 11392 15229 17593 20266 18044 14288
7892 14288 10397 14774 11476 -8782 -16033 -18584 -11768 -1798 -2377 -193 -8029 -12484 -17698 -9243 -9078
7877 -9078 -4972 5845 10800 2228 1720 -134 3025 18164 18160 13417 13240 3636 -4243 -4308 2040 18088
7861 18088 13599 6574 4528 5793 10179 181 -7732 2020 2937 3736 14062 21666 31914 25611 16494
7846 16494 2265 -4339 1575 6026 20837 28515 26228 29958 32019 22704 21306 15620 5778 -1445
7832 -1445 -3338 -1290 496 2812 112 9044 16844 11910 12995 20696 29249 19977 8763 4756 5401
7817 5401 1916 -9983 -10901 -2140 4310 7976 7278 1552 -13598 -7967 -1247 1434 -1227 -25927 -35595
7802 -35595 -20861 -9635 1763 5123 13169 19085 15887 2582 3276 8849 -3131 -11777 -9008 1474
7788 1474 1696 -4077 -2168 -1713 -6025 -4610 3230 7672 434 -15462 -23814 -13124 -4742 -4836 3747
7773 3747 4691 -2938 3198 7338 12018 15839 13932 13433 761 2711 9989 12403 13824 15745 19102
7758 19102 11443 3160 2344 -5924 -12410 -5792 9279 17023 13836 8856 8088 4008 -283 623 -3338
7743 -3338 -17903 -17886 -24025 -34364 -36325 -14588 -2474 6690 -1975 -5272 4908 12125 9016 5525
7729 5525 1104 -1051 -1430 -4564 -14765 -15970 -13737 -13638 -7365 6504 -4306 -16546 -25783 -13753
7715 -13753 -11408 -14508 -17951 -24837 -33097 -27205 -14027 -6914 1140 11556 -3132 -17995 -28564
7702 -28564 -15694 -12357 -24588 -26456 -17953 -5990 -6213 -4014 -616 -76 -3610 -11261 -4175 13198
7688 13198 15982 7336 1513 -2366 -7350 -11217 -17578 -10911 -3536 850 -3488 7938 9249 10529
7674 10529 2959 -12559 -8489 -5705 -7086 -4552 -3157 -6329 -14200 -1699 15549 5821 -6490 -12395
7660 -12395 -19079 -13316 -11126 -5671 -13728 -18807 -21893 -25336 -16077 4067 7078 3704 -10614 -15051
7646 -15051 -10271 -19628 -20300 -14763 -12734 -14539 -18451 -15825 -9167 -14862 -19219 -22714 -29430 -6214 843
7631 843 -1790 4975 11793 11194 12909 645 -937 -1535 -512 -730 7744 6110 2126 2431 -7519 -2653
7615 -2653 1884 -4348 -15033 -14270 -8046 -11910 -11231 482 3311 -5983 4967 8679 9427 15408 26127
7600 26127 26879 19345 1837 -15405 -15245 -11482 -6900 -5046 -9677 -3742 4144 -2788 -12445 -15120 -19277
7585 -19277 -22864 -18921 -13868 -13305 -27702 -22629 -4410 -5794 -17672 -21709 -21619 -28284 -29887 -31105 -10232
7570 -10232 -5635 -6856 -9997 3232 14066 2623 -3341 -5806 -11403 -12516 -15777 -14595 -17470 -18399
7556 -18399 -15495 -13651 -7612 -3984 -3968 -2072 -6840 -9048 960 716 -5565 -8564 -16595 -19846 -19068
7541 -19068 -26379 -24201 -13619 -1328 -3156 -7151 -9848 -2710 218 -3010 -2603 6681 15684 13039
7527 13039 3075 -2019 -3274 5818 12774 10450 1763 5636 8368 4277 3081 5732 17623 17403 853
7512 853 -9575 -12940 -23095 -26725 -26004 -10867 -7398 -4951 -4836 -8880 -5012 2670 1804 3443 -3656
7497 -3656 -7653 -1719 5809 9071 14862 37181 37646 30978 31362 21538 15919 15626 15020 2396 -5664
7482 -5664 -1170 697 -13271 -28019 -24923 -6600 -8348 -12579 -18343 -23926 -15996 -6070 -4073 2624
7468 2624 -459 -6333 -13919 -11458 -3309 8171 16480 12535 12360 832 -11491 -12460 -1684 6241
7454 6241 16193 15412 11698 12903 8907 155 -2537 -815 -12768 5462 15223 7359 2769 -722 -6136
7439 -6136 -14923 -16531 -5068 14349 12705 3564 -4328 2331 10161 3479 2757 11828 12135 1118 2355
7424 2355 8659 9041 7059 1041 -1631 4069 5619 7288 10233 7588 -3657 -6694 -11711 -6760 -11724
7409 -11724 -2920 -3849 -8950 -6254 1468 7265 -4998 -16350 -11960 -9954 -15928 -9873 -3387 -5007
7395 -5007 2215 2806 6667 5587 9879 10960 -5926 -15772 -16084 -19479 -10315 4922 17903 13418 -4000
7380 -4000 -16011 -27232 -32658 -25257 -19318 -18355 -6776 815 596 -484 -4084 -13898 934 -2440
7366 -2440 -1758 3838 -937 -4776 3052 4186 2679 -3516 7457 18072 3652 -8407 -2055 2253
7352 2253 -2020 6434 8752 776 -10444 -15112 -2897 4448 -2061 -13506 -4048 -1100 -2686 1988
7338 1988 -5097 -15656 -8713 -18379 -21923 -15713 -9722 2779 3734 -9309 -16596 -17924 -15660 1767
7324 1767 7294 1559 4503 -2463 -2432 101 -10310 -20622 -21718 -15810 -14183 -11673 -9185 -6714 -2655
7309 -2655 -5713 -17592 -9940 -7121 -3886 -5304 -11734 -5030 8287 9849 261 234 -8056 -12490 -3518
7294 -3518 -1224 -4581 -9806 -13079 -8469 5704 12825 10584 8132 -937 1531 3883 1328 -2766 -4405
7279 -4405 7232 11874 10165 2177 -1027 -2352 1057 4742 8004 8459 20467 30116 15687 7185
7265 7185 7818 -452 -3536 -7023 4559 23046 23917 27180 12466 -890 50 27 -962 4647 6001
7250 6001 -10150 -9063 -12542 -10767 -6807 -5188 510 -3262 -6766 -1996 4695 -2790 -9107 -5999 -5280
7235 -5280 1777 -912 -11036 -14668 -12404 -962 9182 8314 9788 -3938 -13023 -1678 13527 13314
7221 13314 -3419 -11206 -13262 -13473 -2789 -9834 -5526 11568 22029 22927 7705 -4331 -5370 -554
7207 -554 3562 3944 -8335 -15060 -9560 3454 20121 11932 5148 7455 1843 -15588 -15655 -25756 -34817
7192 -34817 -31486 -19006 -15207 -20148 -14617 -8975 -2235 -9564 -20646 -24415 -19475 -19582 -21475 -15636
7178 -15636 -828 -8021 -10709 -9055 -25937 -34213 -25677 -20810 -12309 -20619 -21648 -7697 -11980 -28578
7164 -28578 -29473 -24689 -11387 2690 3624 -12852 -26055 -30016 -29787 -20852 -17781 -22858 -17761 -7210
7150 -7210 -5572 -14208 -15960 -11162 -12986 -15519 -25850 -19421 -14578 -8602 11670 21137 9173 -18086
7136 -18086 -27467 -19108 -21478 -13238 -7257 80 -11616 -20225 -15582 -4054 10109 -1194 -16055
7123 -16055 -11810 -14119 -8998 -13696 -8557 1185 -13482 -10143 -6687 -5219 -10811 -10654 765 875 4447
7108 4447 5534 -8985 -26528 -26415 -19298 -24939 -10651 -2704 -9450 -22526 -35810 -27530 -9710 -4766
7094 -4766 -8339 -1579 -4455 -14758 -14780 -15323 -10221 -9345 -14254 -6231 -7474 -12211 -1915 6251 8839
7079 8839 -370 -6042 -8964 -7589 32 -6929 -6536 6924 12548 1122 -4318 10945 5220 -10165
7065 -10165 -803 3770 -3788 -694 -588 3488 5052 2277 9640 17559 10622 -11387 -14705 -9403 -15056
7050 -15056 -23920 -9201 1245 -6356 -7863 -17671 -11389 -14882 -19098 -9972 -5462 -10982 -13439 -18351
7036 -18351 -17363 -19645 -13513 -5823 -396 3010 1598 -1581 7085 13262 3075 -4502 -1547 13634
7022 13634 16008 22692 21431 16574 7656 7751 11285 -928 -7916 -11722 -25969 -25479 -17789 -18386 -15778
7007 -15778 -5192 -7733 -15631 -11740 -10039 -12962 -13161 -11703 -7946 557 9949 18513 4996 -5169
6993 -5169 -11792 -15732 -7839 -8211 -8955 -16053 -10137 -6219 -8922 -16980 -20349 -22214 -20207 -27767 -11051
6978 -11051 -2758 1185 3068 4207 7643 5020 8976 5216 -5652 -10050 -15710 -15314 -12610 -1373
6964 -1373 8208 5737 7626 5364 7553 2732 3595 11461 5040 -11570 -21783 -27088 -29119 -26640 -25557
6949 -25557 -23461 -7062 2426 5254 8433 -8162 -12306 -13596 -15527 -11746 -11810 -15663 -10246 -6111 -720
6934 -720 -9722 -16141 -26011 -22240 -10495 6629 11766 6051 -4003 -16077 -21224 -25515 -23643 -18120
6920 -18120 -12800 -8361 798 8868 728 -11301 -3210 -311 -1540 -3864 -7872 -23464 -27501 -9559
6906 -9559 -11319 -12633 -13231 -11080 -5284 1615 -3818 -6934 -3275 -3865 16248 16738 2849 2979 6152
6891 6152 -2534 -3666 -796 -2509 -3338 6804 14850 23270 22903 6648 -8209 -9637 -9051 -10726 -7153
6876 -7153 -1289 -5234 -14652 -20430 -17599 -16298 -22111 -11074 -5881 -18312 -20338 -17163 -10572 -14344
6862 -14344 -7538 -6307 -4051 -6972 -11718 -12036 -4850 1774 5627 6796 -7162 -7878 -5011 -7077 6543
6847 6543 17358 17180 12445 21135 30043 42198 34400 22342 22472 21208 15556 10022 4218 12624 13015
6832 13015 5470 4767 -1761 -7163 -10666 -9899 -8513 -10632 -18274 -12749 -12275 -18084 -22215 -26679 -11393
6817 -11393 -8740 -3926 -939 -3397 -2282 -241 2419 13896 1779 -4524 1763 4763 3917 5148
6803 5148 1906 2558 5164 4941 -2568 3359 8907 12012 15418 13604 5468 -8110 -3308 -1879 8524
6788 8524 572 -7661 -14223 -11349 -2503 1769 -4222 -7898 -1745 13845 27369 21293 7927 8464
6774 8464 3098 11109 15579 8367 12902 6230 3883 925 5245 14728 -772 -3969 -2506 -4244 -10385
6759 -10385 -8988 -10611 -10030 -5987 -3177 -838 -130 8090 5053 12742 17770 18201 16870 10415 200
6744 200 -2488 -10114 -19313 -9742 -7199 5814 10388 11829 3909 8616 17109 11698 9569 7194 7488
6729 7488 7025 15948 21954 13258 7677 1012 -334 6289 12437 14271 8575 16613 27929 17709 8939
6714 8939 25284 33626 30687 21515 23598 28883 22758 17897 14653 12277 16016 25223 19715 21909 35114
6699 35114 44499 56855 63706 76071 81621 91700 118956 141660 144688 160392 177847 164943 160401
6686 160401 151562 136802 113780 94035 90025 71234 61931 60799 57381 43613 41566 41715 44054
6673 44054 40062 32033 37319 43296 32207 18393 22755 15287 8101 5825 8490 9890 23449 31862
6659 31862 23915 23519 15029 1234 79 5212 12509 18584 20773 22480 19065 9280 10680 5652 -7815
6644 -7815 -2279 9617 -353 -2192 13432 13891 10662 11162 15468 12960 12718 2024 379 9843 10721
6629 10721 12318 16334 7311 -11002 -17487 -9010 1103 2439 -2772 -4612 -6052 -9479 -1947 -6306
6615 -6306 -14588 -12590 -11593 -14150 -5533 -3043 10112 20493 12559 3351 -497 3359 5225 -1638 2313
6600 2313 3459 -14037 -13358 -14431 -22298 -28396 -18776 -9025 -6757 2684 -557 -5717 -4755 3140 18886
6585 18886 12446 4031 4462 3262 -3498 -5239 -5131 -9873 -17394 -25463 -23901 -11713 -9 -796 -357
6570 -357 -1517 1005 9674 24561 11156 2298 2829 7666 7780 8091 5725 -9750 -9959 -6487 -8411
6555 -8411 -2195 4991 5360 -16115 -21257 -10463 5868 474 -2949 -7638 -13306 -11855 -3050 13229
6541 13229 16448 7991 -9395 -16310 -5159 -9086 -15512 -9097 1551 5934 2036 2581 -6647 107
6527 107 -2287 4102 7054 13954 15729 13680 6813 -15392 -28905 -18608 -6409 7655 23391 21284
6513 21284 10691 -174 -7094 -185 -10450 -14892 -24137 -28595 -20525 -8148 -17808 -23859 -17455 -17323
6499 -17323 -17903 -8088 -2463 3422 5546 9644 7198 -4052 -1588 7608 1274 -10772 -7340 3428
6485 3428 9329 -3081 -543 18701 15425 16595 20202 13743 3018 11250 11424 4982 -15592 -22206
6471 -22206 -25015 -18717 -12500 -2902 1848 -34 5775 532 -6265 -11894 -7293 -10850 -3526 2909 13041
6456 13041 7304 254 3178 3635 12713 11691 5700 5051 4648 17737 20406 20020 23429 10614 -2370
6441 -2370 -2803 2680 -3302 -7645 -12713 -13863 -10089 -14529 -11371 -1168 -1090 -3753 3408 -8760 -4776
6426 -4776 -3624 -549 5317 6135 12225 19079 22854 30410 28423 15192 9755 5457 6106 9764 9751 -3925
6410 -3925 -13026 -14193 -16070 -14446 -11739 -5663 3123 -4380 -22815 -23308 -2253 -5753 -1739 3003 -3754
6395 -3754 -9818 -13199 -17678 -18331 -12327 1712 5760 -735 -20625 -19026 -5940 -724 8528 16982
6381 16982 3897 2964 3867 -7766 -2199 -7083 -16228 -23607 -20994 -21296 -21593 -16455 -12215 -18692 -11690
6366 -11690 6490 12247 2225 -3669 2839 3569 1480 -6379 -5494 339 3966 8505 6624 4262 -1281
6351 -1281 -5867 -20414 -15399 -11061 -13728 -11041 -11074 -10006 -5022 -5895 -11518 -13399 -12903 -11946 -6794 1523
6335 1523 6558 -1582 -11304 -21708 -25195 -19194 -8810 -5002 2818 6554 9025 13232 253 -2156
6321 -2156 -10600 -5821 219 -6155 -1642 -10402 -15258 -1074 -2430 -13685 -8973 4829 7666 7470
6307 7470 12510 9972 12370 18420 17352 11096 438 -4902 -7235 235 -1221 7353 17048 18788 14335
6292 14335 9970 19391 20316 30971 30403 25075 16577 15416 17976 12040 530 -9125 -12208 -11166 -8924
6277 -8924 -13909 -14310 -5312 5718 6337 9883 7709 -4065 -5912 -631 -3775 -3961 3612 2428 3716
6262 3716 560 -1066 -5002 -8181 4925 5162 16473 14071 7783 8012 8663 13630 1311 5169 5407
6247 5407 1718 7998 11281 -1034 -15858 -22835 -21337 -13540 -9338 1252 -3370 -3834 -2484 -3476 892
6232 892 -4793 4818 7053 9007 8876 13039 8767 7314 1343 -2580 -4808 1550 -5706 -3619 2598
6217 2598 -1959 -9039 1760 9260 19187 30948 32296 20580 -4234 -17537 -932 1693 -10704
6204 -10704 -17761 -10847 -9586 -4090 5353 4239 -4356 -12835 -13652 -408 1386 11554 4353 -10501
6190 -10501 -4706 5305 10401 7661 4637 8521 11761 3866 -7533 -4923 -8128 -11174 -4026 -4385
6176 -4385 -2430 -8818 -7445 -2749 -4396 6452 5786 -19799 -33252 -17710 -6199 -1169 -7786 -10989
6162 -10989 2530 7311 746 4259 6714 8335 -6091 -7195 -4275 -5088 -12566 -22255 -33564 -38114
6148 -38114 -31793 -21717 -9812 -620 -4441 -14048 -3490 -8457 -11187 -16234 -26729 -23800 -3885
6135 -3885 2138 -1998 4630 13537 12299 12998 -2359 -8420 -5039 1673 1935 3912 2483 3607 -4239
6120 -4239 376 11834 15967 8709 -2922 -9099 7271 2563 -11810 -6277 5635 6614 4184 13978
6106 13978 11792 -1953 -7327 312 1591 -5254 -9847 -14919 -9116 -11432 -14187 -12269 -3481 4076
6092 4076 1935 5648 2492 -4764 -6625 -8412 -661 3391 -425 -5244 -4818 -7199 -11556 -15811 -10258
6077 -10258 -279 7791 3730 -5056 2628 4750 -3171 -18179 -14664 2096 1514 -5844 3035 873
6063 873 -16363 -22582 -17818 -17397 -18055 -27698 -16815 -13445 -14908 -6652 11613 5185 -7747 -3550 2617
6048 2617 8474 -2347 -9107 -15203 -17159 -7021 -5027 -5972 2938 5198 -3939 -6773 -6433 7971 6068
6033 6068 9716 -661 -4449 656 -889 -4485 -6012 -10185 -7643 -2040 5290 1547 -7788 3676
6019 3676 -1423 -4733 -6674 -3312 -2518 1480 11082 14756 22566 29701 19442 17572 1939 -1844 -291
6004 -291 454 -4792 1037 -712 -5721 -4436 2270 5808 4089 3870 5544 -2736 575 2222 11342 16143
5988 16143 6988 -3144 -21983 -20883 -16894 -11905 -7711 -6335 -9290 -8743 -7385 11034 25257 5569
5974 5569 -8771 -24826 -22346 -5022 -1932 -10487 -13610 -7819 -13144 -17252 -16756 -25481 -35138 -23810
5960 -23810 -6890 -2785 -5894 -12854 -5770 5267 3042 4402 13377 13220 4257 6965 18931 21385
5946 21385 13209 9385 4965 628 7338 19535 14762 10510 -296 -13151 -11784 -17251 -24959 -16714
5932 -16714 -3317 -8760 -13776 -9531 -3502 -9970 166 8628 4943 4819 7069 7683 10125 -2801
5918 -2801 -16002 -19242 -25232 -24760 -22601 -28254 -7596 587 -10079 -11481 2008 13722 6026 -2826
5904 -2826 -6928 -12616 -12364 9968 13877 -739 -4447 4793 7135 8575 5252 10833 13471 6580 6369
5889 6369 13241 20575 16221 9764 -4011 -7458 -151 1474 -10081 -7120 -9177 -19066 -15570 -15767 -11638
5874 -11638 -9770 1659 7390 15423 26607 22579 15825 13428 -5111 -13264 -3335 -1489 -2915 -10491
5860 -10491 -3141 -6132 -9365 -13224 399 9295 920 -3805 -1380 -2206 -1767 -6033 -15346 -15321 -12210
5845 -12210 -6300 -8735 -4364 -6695 -18049 -20587 -5668 7816 14413 12140 -150 2845 -2971 -7475
5831 -7475 -821 -5215 -1231 -235 -14524 -6056 2859 -1832 1281 -1555 108 7924 11822 6465 -4788
5816 -4788 -508 12400 18898 17930 18224 12977 6716 9263 3886 3839 -1563 -2030 4846 -2560 -6675 -15632
5800 -15632 -14044 -9000 7579 3043 2712 11950 6211 -3905 -6879 -553 -1257 256 178 -15505 -19485
5785 -19485 -12439 -14096 -11823 874 5251 573 -3780 12834 17002 6678 -5381 -4270 2161 5605
5771 5605 4992 9983 9431 12609 14645 -3789 -10172 -7212 2843 8500 8434 4069 462 -2054 264
5756 264 -2616 273 -1021 -6458 -7147 -6119 -4309 4015 -4792 -11322 -10456 -1424 584 -16934 -25354
5741 -25354 -18168 -12485 -1143 -1919 -8134 -5998 -2766 -9674 -10344 2204 12804 6608 -175 -10097
5727 -10097 -18718 -9855 -16763 -19647 -6144 -4971 -14626 -20393 -16853 -8963 -6543 -3296 -3020 -4401 -3711
5712 -3711 -1612 -12159 -3382 4055 11216 10213 -1321 -6667 -10410 -11045 -8634 -15007 -6176 4972
5698 4972 13908 10872 6254 4033 11634 26289 18574 2621 413 2594 1739 5008 11665 7848 5711
5683 5711 18923 24478 17546 4928 -6462 -3824 7370 2343 -11808 -9997 -15564 -15282 -6953 -996
5669 -996 2575 13970 26226 20257 10892 13736 16070 3338 -5977 -1949 -5737 -5607 -9405 2522
5655 2522 9665 17670 33254 23096 -8213 -14670 8114 10278 2823 8320 14126 3646 7833 751
5641 751 2621 7146 4353 5880 9233 10236 1233 -6140 -14678 -21662 -16690 -1431 1899 -9541 -7270
5626 -7270 2538 5333 4750 -12398 -11725 -3627 -4515 -7689 -7287 -5531 -4107 -5040 4896 8463 11966 16487
5610 16487 5640 5322 11130 4878 -2202 -6777 -7427 -2218 -4563 3251 5272 5238 3963 -1495 1698
5595 1698 -3890 -19773 -32069 -32661 -17789 -14501 -16944 -15393 -1560 3353 2808 -1254 6157 15907
5581 15907 1533 5241 15964 9765 7512 7733 3023 5237 12200 4706 1196 10212 16235 10108
5567 10108 1525 -5015 -12133 -8813 -11572 -12503 -15510 -8744 -12175 -16667 -10312 -1821 -5444 3322 2945
5552 2945 3915 195 -15840 -20857 -18735 -7873 -14269 -13323 -12595 -4921 -664 4469 2060 -2385 3198
5537 3198 12266 8577 1419 984 -3261 -559 10245 6998 7452 9455 9050 10372 16722 26243 20948
5522 20948 11791 14382 17305 446 -51 1710 -3370 2961 15320 11148 -6474 -10110 -7392 -3274
5508 -3274 5256 9193 1340 -3685 -5214 -17196 -27739 -24307 -18204 -23524 -20777 -7286 -1498 11034
5494 11034 14542 1843 -4070 4717 5221 -1417 -11723 -11458 -16119 -20382 -10414 6845 8283 -6119
5480 -6119 -19784 -24182 -18919 -16732 -14614 -13285 -3616 14357 24221 13826 12547 18637 12684 3751
5466 3751 15253 19136 7613 3280 -4055 -9587 -9113 -5836 -8001 5453 -974 -7342 -9836 -15238
5452 -15238 -5874 -4950 -9210 -8208 -12489 -14903 -8810 -5190 -1912 -1993 6708 12118 -1617 -2568 -4681
5437 -4681 -1407 -9232 -14822 -23170 -22349 -4739 3495 1905 -5894 6046 6567 -3533 -10502 -4689 -1428
5422 -1428 3676 1264 -6194 -14959 -9616 -2452 -9358 -13369 -23791 -26951 -19294 -10856 -8542 -2297 1100
5407 1100 -105 -7070 -19205 -15605 -18168 -17202 1460 9985 17246 20020 18715 9867 -2619 -14547
5393 -14547 -22155 -18887 -4576 -1002 -258 9811 9879 2279 -5561 -3292 12781 7414 12352 25361
5379 25361 32881 22582 11899 -1460 -12811 -23016 -31732 -27197 -10875 -1662 -10595 -11226 -5214
5366 -5214 5745 -1143 -16467 -16194 -4893 17418 22399 11358 10401 7608 -6366 -6009 -9682 -5529
5352 -5529 1031 -3697 -5599 3956 12435 6378 -2821 -21309 -23636 -23786 -17316 -10455 -9172 -5346 -2648
5337 -2648 -312 -8335 295 6056 4162 11346 18206 15353 435 -6219 -10628 -14520 -24436 -26902 -9156
5322 -9156 8095 11913 9089 555 -3825 -680 10994 11330 -2623 -13475 -11230 -11621 1687 -428
5308 -428 -4296 2785 15535 26114 24087 17591 12727 3601 3346 15928 27865 17158 24635 21481
5294 21481 15317 7715 -3977 4927 2354 -428 10746 11872 14566 16755 9015 12048 8375 1006
5280 1006 6631 5556 4243 1767 8093 17627 15636 11117 -3896 4599 17715 9785 -249 -18129
5266 -18129 -19441 -12887 2172 1768 -4934 859 4343 3851 4248 -111 3820 10681 5902 -1577 1106
5251 1106 1166 -3037 4143 1840 4545 4480 -1208 5565 13723 1371 -7681 -12933 -14291 -7776 -5321 -8190
5235 -8190 -3251 -1651 -3076 389 -4996 -11147 -16132 -12966 -13964 -18397 -24795 -4419 2179 -1134 -6246
5220 -6246 -7682 -15653 -12182 7185 14197 12420 6511 -1308 -6462 -11091 -3668 1774 -5253 -8666 -6956
5205 -6956 1218 -12795 -26248 -16248 -12871 -17540 -21806 -10429 4051 5325 -2015 -3701 -5814 -2325
5191 -2325 -2188 -6590 -2139 3250 4385 2067 1674 -10471 -24627 -26896 -32864 -39514 -26222 -24092 -23234
5176 -23234 -27139 -15423 -6857 1031 6346 13704 9548 -4690 -1176 -6604 -2416 13395 13092 -7020
5162 -7020 -17177 -18447 -7719 -4152 2013 3927 16158 13067 3357 -6488 -5414 -3397 1901 -1221
5148 -1221 -9484 -13098 -10736 -13143 -7557 2581 4747 886 5054 -13284 -13345 -6572 -19854 -22870 -19511
5133 -19511 -2697 3012 -3235 -291 9993 14572 17126 4238 708 -2021 -4451 -2580 -45 9893
5119 9893 1735 1854 9593 16734 30910 23503 14033 5778 -1068 3171 7572 5512 13021 15419 7831
5104 7831 9355 3688 -5416 -12566 -17284 -17222 442 16364 17136 12128 1412 1587 14695 13780 1386
5089 1386 2597 303 -1089 19896 14576 11499 19538 23992 11706 5504 -1408 -4789 1481 -10947
5075 -10947 -6592 4865 -3122 -10766 -21801 -22927 -8750 -2151 385 -2934 -14178 -14601 -6986 5456
5061 5456 13231 8790 8292 14379 6349 -1869 -7647 -5630 -810 -7478 -10353 -7376 -3073 -376 811
5046 811 -7722 -10759 -20857 -19430 -18209 -15111 -11076 -3654 -13658 -19047 -5700 16148 20321 18070
5032 18070 9899 4819 -8512 -16900 -5707 8238 12178 9054 1299 -166 -4876 -17047 -15199 -890
5018 -890 -6226 3264 -2863 -1550 -7442 -14466 -18307 -20662 -10672 -507 4189 1056 6111 6555 11564
5003 11564 5935 11770 10665 3832 8821 28754 32482 10412 -3717 3127 16210 12511 2273
4990 2273 -1360 -143 -8742 -12605 -1293 -1264 -12182 -12378 -10546 -19522 -23051 -10154 -729 14175 14953
4975 14953 5612 -5517 -5741 2009 -1435 -2236 -8039 -1873 345 -1259 1723 3556 5116 4199 -6726
4960 -6726 -5401 3712 14972 17219 10442 5702 3591 -2677 -9579 -14462 -11241 -14280 -19549 -18344 -8199
4945 -8199 -36 8506 6303 4494 -50 -7396 -1201 3203 -3495 -5948 796 -5900 2406 4605 4407
4930 4407 -6370 -6359 8357 321 -691 -11323 -13489 1102 5301 -939 -7123 1208 -1700 -10472
4916 -10472 -20788 -14451 -7047 -13237 -10149 -7525 -19293 -33033 -28222 -5825 7074 6264 3180 -573
4902 -573 6317 9811 8118 5499 9901 4973 1235 -3767 -10089 -7494 -2232 -507 4898 9615 13587
4887 13587 11357 17880 21478 10844 4177 4422 4366 8472 -154 2173 -5895 -11490 -7307 -9117 -11473
4872 -11473 -8155 -6378 2883 -128 1443 263 -1841 2246 1670 -759 -10658 -10857 2668 8725 8785
4857 8785 3393 -9161 -9109 -6319 -13708 -3016 -1295 -8742 -1511 4655 -11941 -22162 -13603 -5308
4843 -5308 -4588 -1754 -2482 -2541 -3175 -2351 230 29 1664 350 1489 2906 -1896 -7029 -824 9446
4827 9446 16801 10734 12106 1060 5076 6950 2955 -1228 -4484 58 1496 -2827 -6724 2261 -3412
4812 -3412 -742 4797 6819 4812 -3091 -4854 -5542 -9570 -12564 -13227 -3182 -4757 740 8632 12121
4797 12121 3245 -9812 -20512 -15981 -1521 12920 780 -10868 -8848 -3352 9999 30453 26955
4784 26955 25623 12106 7666 7865 7133 982 -5232 -262 3509 12668 4591 678 6112 4010 -109
4769 -109 -7194 -16622 -16076 -9044 -8060 860 351 -10198 -14239 -8474 3313 6726 10302 814 -5320
4754 -5320 4392 16180 9936 7496 11321 10991 8154 12314 12024 14141 15425 6258 5399 11149 15570
4739 15570 10090 13472 18832 17663 10637 2301 1155 -4224 -5982 -10858 -19025 -15851 4806 24435
4725 24435 28583 24120 16079 12643 15823 15286 16879 14723 1845 2173 9976 5360 4682 11275 13980
4710 13980 101 -879 3961 3604 9629 14815 15349 5201 7176 8352 2869 4889 -5248 -9826 -2052
4695 -2052 -6450 2233 10043 6109 -1855 -4229 5036 9273 -2761 -8697 -1237 -2825 -960 -4686 -3893
4680 -3893 1437 5215 9732 1216 -750 5818 -3641 -9007 -3094 6067 12376 17683 15268 -1382 -3404
4665 -3404 -4904 -7178 -7359 9966 16707 11613 14070 9762 -10016 -15377 -14477 -9608 -5805 415 8555
4650 8555 4311 4346 -1417 3467 4264 -3710 -10422 -1914 -4021 -6203 7770 8654 6583 18325 32586
4635 32586 25894 10444 7894 17391 9430 -4272 -820 -3520 -13280 -6359 -8838 -13596 -1314 1575
4621 1575 8187 -1095 -15261 -1259 27080 30315 19322 7745 5733 5413 9034 10840 1414 8191
4607 8191 13529 19633 10400 -4263 -11695 -14274 -16229 -8738 -3610 -2613 -5440 2893 -2610 -11971 449
4592 449 5675 16919 13097 -1212 1231 -2302 -4413 -18575 -10875 -2937 -1219 11142 6438 5564
4578 5564 61 -7641 6630 19505 17158 7684 5225 4121 1831 4192 5924 195 -975 -169 2469
4563 2469 3227 -166 1873 -3290 -8196 -13597 -9326 -4750 -4469 -1426 7455 -8561 -14792 -15241 -16831
4548 -16831 -18005 -17023 -10055 -3711 360 -2545 -5353 6308 6234 11499 8163 5530 9064 3481 3044
4533 3044 3074 5371 11947 -2825 -2912 4798 16833 12100 3644 7333 4290 6008 5315 14188 23424 16849
4517 16849 13949 19886 14969 -1479 -12664 -16157 -14452 -11674 -6807 8967 13199 10775 16448 13232
4503 13232 -3285 -6456 -14168 -8723 -1962 5361 4375 12191 13417 -943 -4045 -544 -5761 -3514
4489 -3514 2922 -2688 -12658 -17350 -16146 -4259 3120 20120 31997 24767 15421 9271 -3129 -7101
4475 -7101 -5574 -13343 -13631 -4690 -3687 -190 582 -14344 -5228 -6688 -10436 -17376 -6430 15438 22115
4460 22115 16227 -744 -12944 -13343 -1089 11109 -238 -15678 -5915 4169 -2857 -1037 4976
4447 4976 13141 22370 24340 16918 13105 15811 9684 18642 20746 7808 -11583 -11073 -7679 -3665 -9276
4432 -9276 1143 3872 7748 13217 14219 6886 10659 215 -17406 -15742 -11093 -15862 -24030 -27705
4418 -27705 -7059 4401 13964 6779 7999 11930 -4392 -6687 -15067 -25564 -16713 -7372 -7712 -2557
4404 -2557 6585 -1051 -4916 -12738 -17043 -2193 7352 5769 23675 34464 19532 10436 6381 6250
4390 6250 5417 4447 5927 1451 -3156 -10823 -2671 14577 27627 19108 14982 7539 -20680 -28372 -16349
4375 -16349 -17705 -22319 -18039 -10269 1195 9803 26489 20965 14182 10308 1863 -8729 -10920 6004
4361 6004 6258 6657 -8554 -14721 -9430 -244 -15660 -28932 -19405 -9739 -6002 -11393 -7559 -3311 -1191
4346 -1191 13094 11179 -3539 -4136 -5070 -12413 -19932 -18651 -14497 4738 10575 2310 -3539 -8817 -11536
4331 -11536 -15332 -10701 -7215 -7854 -9217 -7406 -2514 3953 8879 25121 20992 12498 3693 8204 16854
4316 16854 13560 15479 7229 5170 7675 -3414 -17688 -24719 -34597 -40148 -28670 -18084 -22155 -26176
4302 -26176 -23126 -26754 -23758 -12251 1273 15279 8358 15801 15689 7835 7891 10681 8562 -8496
4288 -8496 -14371 -2551 5212 2178 39 2332 9061 13195 810 5326 5421 5301 15955 21308 17900
4273 17900 17496 13537 10811 4865 -8345 -22504 -25468 -9033 3044 17176 12234 8739 11756 13781
4259 13781 -1194 -10890 -9157 -11494 -11230 -9261 -1388 2603 -314 -4090 -4967 183 13272 11779 3504
4244 3504 -8122 -2851 -10235 -14098 -2160 -4759 -14274 -13226 1316 1337 2582 -3365 -2185 -3535 3423
4229 3423 -2724 2219 -140 -4349 -3269 473 6898 305 2381 -6938 -17344 -16465 -12141 1634 5932
4214 5932 4882 3286 -396 -3565 -564 -979 3307 7802 1928 2329 -8403 -6205 -833 -2886 -3740
4199 -3740 -2031 15153 9868 8559 14470 16033 10865 11017 1154 -12254 -18275 -13490 -22115 -13894 -896
4184 -896 14974 19534 9463 11542 10156 -4265 -7055 -2386 -2021 -8365 -5609 -1772 5376 13721 7727
4169 7727 -2625 2103 2880 -214 8530 16958 11863 19400 10762 6331 11988 18733 19587 13865 7784
4154 7784 2054 -14028 -8560 -5610 -6248 -1757 -2213 -15142 -24609 -9345 4657 10056 9138 1185 -3778
4139 -3778 -5647 -4905 -7615 4577 -4747 -14093 -21959 -17038 -7554 8094 8296 166 1980 -612 -149
4124 -149 -7955 -6195 2019 -2414 -788 -1525 -10687 -2351 9906 2644 -222 4819 3159 -5468 -1947
4109 -1947 -1486 8540 6296 326 -5267 -9064 -6024 6545 13103 17875 7725 4221 -4728 -2423
4095 -2423 -2478 1396 8014 5535 -943 2513 3460 -4052 -11026 -14234 -20271 -10850 -6851 -4206 5321 12446
4079 12446 12769 12948 8769 -112 -2297 -8197 -16073 -9580 -5552 1834 9054 4751 -1260 -1392 -3909
4064 -3909 -10423 -15039 -17339 -11232 -5037 1333 2309 3637 6650 -13689 -12279 -3366 9026 6926 9127
4049 9127 1493 11186 6332 493 887 5389 3219 -558 -5335 3057 -6286 -7196 552 859 9356 12095
4033 12095 1948 4579 2202 2038 -6275 -6648 2977 7379 16331 6912 -4386 -2165 3447 1626 11630
4018 11630 3003 -13978 -12013 -198 4068 3829 -4680 -8460 -3866 3594 10060 17299 18579 5033
4004 5033 1727 -1752 -1419 -1475 -1249 -5632 -1561 -4809 -11260 -7142 2434 507 16307 29145 16842
3989 16842 6357 4567 -3003 -8574 5175 -4281 -9466 -12638 -11590 -6021 -7908 -8742 -5507 2149
3975 2149 -2018 -4379 2168 6229 15083 7956 328 -3687 -2699 -1957 -5176 -13890 -15185 -12186 -4186
3960 -4186 -1549 -8147 -7662 -11850 -13020 -11368 -4295 1162 7473 -2133 -14526 822 15280 14735 1889
3945 1889 -7480 -9973 -9409 -1767 4807 9697 -2061 -3277 7029 5331 11981 9043 -207 2377 2138
3930 2138 -4493 -2573 -7928 -11115 -8700 -4196 1938 2887 -2992 -8248 -6584 -4145 2518 7076 -3335
3915 -3335 -14706 -24938 -25170 -32688 -29208 -16034 692 14660 13335 15214 25893 19861 17060 24067
3901 24067 22085 18271 8027 5979 12499 18767 3903 -14736 -8485 6268 9351 6776 -2566 -9818
3887 -9818 -4000 8582 5870 -1120 -2241 1625 8040 4239 -3996 -8582 -212 12428 17255 7285
3873 7285 5127 4435 12548 15359 14370 28613 25121 7765 13167 23371 6151 -1917 -2428 2457 10047
3858 10047 4411 -2575 -11552 -540 -6422 -1745 -2701 8565 11682 14528 9247 -9865 -15761 -13759
3844 -13759 -17573 -7632 -3318 867 7714 7480 16819 25107 28354 36059 32303 14801 3642 2686 -4606
3829 -4606 -8039 -3898 3638 3994 464 10369 12330 10582 6154 8442 12964 2456 -481 115 507
3814 507 3197 7758 581 -5043 -3775 -3834 -4448 -9426 -4558 -1042 3273 10896 16104 10164 1059 -8308
3798 -8308 521 10506 -996 -15914 -15806 -9031 -2649 -5311 -12910 -5340 14463 22439 19525 17326
3784 17326 966 -13201 -21217 -10193 -2098 16426 18255 6419 -2738 -8484 -26014 -22769 -9863
3771 -9863 -7531 -2850 1837 10284 20122 16844 18006 27203 31167 24833 12896 7366 17893 9643
3757 9643 5618 6452 13724 16264 4491 -4557 -11871 -11617 -3484 2991 7431 44 2233 10019 14324
3742 14324 12639 5846 6977 12579 9070 8874 7437 2835 7079 844 -7632 -8370 -6951 -14285 -20808
3727 -20808 -8962 4159 12990 1749 -9731 -11361 -6899 -3994 -7823 -10333 -1348 18955 25830
3714 25830 17772 5162 -2683 -1994 -6400 -6741 -4955 2064 11406 22807 25460 24517 6027 -3305 171
3699 171 2899 -2863 1517 3164 15678 15533 11716 7395 2845 2877 4134 8854 11371 13372 10378 11100
3683 11100 7200 1411 5070 1645 6947 14510 15764 4798 -7899 -17237 -24284 -9686 7626 7807
3669 7807 6080 7465 -1602 2073 1755 -10574 -19978 -26292 -23871 -4782 2693 1467 -10770 -12311
3655 -12311 890 13032 3971 6057 7482 9843 5325 -13910 -18053 -4485 -3239 -12140 -8212 3899
3641 3899 14784 12138 -12369 -14878 -9073 4500 -282 1238 8795 -1802 -14133 -9955 -13037 -16780
3627 -16780 -14167 -9742 -1296 -250 5085 11605 8348 3300 -14209 -14408 -13003 -8924 -1047 852 2070
3612 2070 9394 1378 -13427 -10434 -16497 -6854 -8208 -601 11084 8116 8928 293 -631 2963 -6907
3597 -6907 -5684 -12994 -18421 -2716 3309 9651 23158 20739 21549 19700 11888 8582 -6326 -24849
3583 -24849 -24627 -24968 -21936 -8771 -3416 5695 17658 5543 -4933 -3295 -268 4175 -5650 -14841
3569 -14841 -16790 -4113 -9616 -23433 -11726 497 -859 -5597 -8111 -6002 -16289 -17562 -11864
3556 -11864 -1233 -5734 -20971 -23082 -11921 -6130 -7578 675 4731 7847 -2482 -1749 7528 7975
3542 7975 14890 12483 8699 -414 -11158 -10899 3664 7138 1180 11405 20582 15667 17515 15333
3528 15333 8857 546 -2693 2966 -2049 -2272 2101 1245 7025 1405 3160 -4390 -9264 -17002 -26072
3513 -26072 -33614 -14086 -7482 -2622 6742 7004 7225 12641 7309 8319 -4447 -17102 -11714 843
3499 843 3609 3637 -2781 -3844 2383 2275 4153 8642 -6737 3834 5656 9058 7916 12022 24265
3484 24265 17828 6527 9508 12817 -4493 -10349 -9681 10776 17285 9415 300 -9572 4172 10452
3470 10452 -857 -10850 974 1119 605 -313 7926 20720 15179 6052 7280 7082 -13498 -14119 4109
3455 4109 16671 18735 9833 -2552 44 -10909 -25066 -12557 3092 3135 16665 26084 9278
3442 9278 15564 10152 3788 6807 -1411 -8761 -4471 -11224 -20624 -26603 -22224 -339 17728 28784
3428 28784 11914 5051 10268 5719 9158 16712 12861 11508 7240 152 -414 -15318 -17126 -8179
3414 -8179 -6545 1643 1177 3470 1709 -12315 -31624 -22879 -12187 -9736 -13522 -16139 -8266 1551
3400 1551 -1131 -2655 -3159 -11051 -17408 -9913 -7696 870 -8079 -12656 -10689 -3772 -7250 -15183 -9934
3385 -9934 1216 4120 -3232 -4802 -7676 -3713 -445 10965 4885 -8001 -7770 -3052 1662 7194
3371 7194 5319 6800 18656 15938 6027 -2984 4204 6683 7491 -1597 -6769 -2691 -8445 -12892 -3340
3356 -3340 500 -2766 -1697 3493 11676 17186 12749 2373 -2154 -15134 -6613 6703 2104 4171
3342 4171 -5726 -8622 1273 -2980 -392 6846 12655 29681 29828 27696 30154 27897 26256 28292 27191
3327 27191 19177 11675 12626 16218 1504 -12328 -13256 -13915 -7083 -6552 1513 12647 3852 -2344 -14762
3312 -14762 -15216 -20379 -31185 -19403 -14185 -4724 -4764 -17114 -13837 -8937 -13465 -8737 2732 7322
3298 7322 -3018 -8909 -2974 -14163 -12025 -1415 -4820 -10649 -15216 -11880 -14598 1173 13616 7714
3284 7714 -3584 -451 8736 15225 12649 2447 1899 19453 15006 11332 -584 -5198 -3662 6040
3270 6040 18326 25198 24913 23856 17843 6473 -3754 -3396 6388 3293 4239 22046 25533 18835 5746
3255 5746 -5084 -12700 -11257 3422 11138 15633 6124 2075 3378 6067 4065 9963 21840 18942
3241 18942 5504 -3508 -3581 -3442 -1765 3312 -6991 -13143 -21009 -19979 -9511 -1529 5413 -3903 -681
3226 -681 -1783 10480 13845 -689 -13535 -15371 3532 18904 19302 3531 3775 2074 675 5057
3212 5057 13765 7528 4801 6288 -198 -5890 -4466 -6147 10400 17737 1488 -10929 -16311 -19120
3198 -19120 -6086 3214 8956 8800 2735 -101 -3073 -6230 -9103 -9091 -6972 -2680 -4880 -3037 -1955
3183 -1955 7741 12286 4398 -1885 294 -6357 -10724 -1782 -6171 -11560 -24794 -14230 -7958 -9470
3169 -9470 -483 15364 14929 6237 1382 8727 12587 7833 -5400 -9880 -8878 -16530 -21747 -16615 -18463
3154 -18463 -9138 -927 -2207 -9378 5935 9300 -3534 -16005 -7492 4833 8685 2533 -11091
3141 -11091 -18619 -19290 4813 8682 -5334 -8173 4728 8125 -1492 -14898 -12657 -5714 -7534 5686
3127 5686 16640 11439 -4760 -23382 -20651 -9825 -6006 -14299 -22021 -36825 -25974 -17955 -6374
3114 -6374 5984 4449 866 6125 7223 -2315 497 6192 10372 6491 1231 -459 11599 6241
3100 6241 -3106 13443 12170 9309 17290 17109 6188 9325 1231 -5425 -2810 -9239 -15163 -18714 -16762
3085 -16762 -3347 8660 7695 5788 -3250 -4918 -5124 2069 -2725 -1565 6991 10075 9281 7267 23124
3070 23124 17472 -97 -785 5260 13436 15547 7671 7847 18033 15526 10421 14708 19879 28698 30583
3055 30583 22655 23326 12195 -2939 -6759 -7633 -7529 -12636 -1665 -2112 4641 10183 15509 14907 16160
3040 16160 23277 15852 18420 24748 26934 20794 18195 4358 2204 -4375 -1208 5725 747 6111
3026 6111 11627 6326 11711 11365 1245 2439 62 1534 1498 2239 -2790 -7640 -11891 1759 7414
3011 7414 1115 3870 4540 8763 13678 15486 2779 -3864 -10758 -1646 17771 21610 20615 12147 11733
2996 11733 13619 13854 11598 5237 -6260 -28543 -25054 -9766 934 3387 -2431 -7168 -10167 -9322
2982 -9322 -12192 -19007 -16009 -2193 -11380 -18673 -16539 -10024 -4831 347 -8817 -12830 2873 -5439
2968 -5439 -20538 -26490 -6148 322 -7432 -15194 -9687 -10931 -19111 -24771 -18666 -17830 -18224 -4069 2697
2953 2697 -6926 -9738 -2006 2672 -14288 -18154 -16235 -5154 -8837 -4137 -9015 -18516 -20323 -15415
2939 -15415 -5880 -300 7075 16107 23023 24595 25417 13819 -2033 -2093 9036 12136 9155 7146 9033
2924 9033 17302 20620 11193 17531 25882 27596 22629 9798 15316 11391 8055 8365 -8013 -16508 -13253
2909 -13253 -6737 -6498 -13988 -13890 -6445 -9892 -7590 1027 -13986 -19181 -8508 -12717 -7782 -4429 -2894
2894 -2894 4724 -696 -5139 -181 2401 7395 7621 14 -1148 1940 -2390 -19446 -13992 -3357 -8477
2879 -8477 -1939 -643 5979 3123 15129 3721 -4135 -16313 -30123 -24630 -10670 -10047 -1772 -2618
2865 -2618 1696 15120 15826 2171 1960 5787 8209 -2774 -1784 -8269 -20415 -29589 -25925 -17443 -8659
2850 -8659 2259 4489 8499 9694 13057 8964 -4402 -12996 -12624 -7309 -3338 -4779 -12784 1295
2836 1295 6123 8155 14706 870 -7158 -7048 1282 945 8694 17258 21998 19819 3654 -860 -3055
2821 -3055 1539 2688 10914 12784 10122 -3383 -3799 -10794 1423 6319 1940 8299 18818 12268
2807 12268 9112 9509 9038 4496 -1692 4348 2394 2465 -726 755 1026 11261 11844 8030 12531 18234
2791 18234 13602 -3609 -14499 -15640 -9627 -21315 -21169 -9751 -4451 -18783 -23954 -5136 -3016
2778 -3016 -4718 -8753 1004 752 -6336 -3224 -2654 -3518 -1119 8496 5529 3405 12611 8133 1369 -7165
2762 -7165 -10602 -15560 -10167 -1754 -2513 -2569 669 15 -9859 -13179 -4029 8612 16384 5855 -8436
2747 -8436 -14912 -10311 -2302 9870 22681 9508 3649 10773 11564 1265 9496 19075 3927 -5132
2733 -5132 -8681 -3508 1946 7249 13747 13294 13700 5956 255 4064 10753 12174 6739 1024 -2190
2718 -2190 -1674 1315 1773 2146 -6498 -2476 -20 872 -7523 -2903 6970 14964 14875 3801 -3104 892
2702 892 -988 -12924 -21799 -24708 -25185 -13613 -11381 -5879 11361 21709 12322 548 -227 -6330
2688 -6330 -6473 790 -8100 -9347 -5881 -16363 -13956 1799 2494 -5650 -10972 -8652 -12332 -15735 -13701
2673 -13701 -5674 -10924 -27232 -24879 -17367 -16153 -12912 -1700 8985 2071 -9503 -21883 -14285
2660 -14285 -6865 6465 19345 14673 15418 13891 10915 1514 -857 -5380 -4553 9753 20580 12671
2646 12671 13283 -1164 -8023 8149 7237 13254 15840 13534 9114 4386 418 -1621 -5579 -4063 -4401
2631 -4401 2161 2969 3466 -4169 -15163 -14763 -742 63 -11546 -8876 -3214 1883 7337 10388 8492
2616 8492 3629 178 1586 7298 6414 -10334 -10422 -2585 4796 -4638 -10562 -4598 -10042 -5499 -4885 -8747
2600 -8747 -2444 2091 2960 3433 9293 17821 35730 42195 29722 9074 12488 385 -5671 -2601
2586 -2601 6804 8690 3803 -3857 -10847 -13367 -11028 -5649 -9805 -13252 -10113 -3594 -5407 299 11613
2571 11613 15887 28990 17364 4985 7693 13677 10172 8399 7469 5318 338 -16908 -19708 -12700
2557 -12700 3055 16646 24163 19097 12392 5861 -4328 -5827 3863 8024 3685 14582 15392 11874
2543 11874 7579 21568 24474 19475 17756 15542 11466 9201 6803 2783 6155 8604 3480 1750
2529 1750 854 14256 10265 -566 -10565 -14861 -12799 -8178 -6533 -12181 -22031 -16922 -8582 -14965 -18622
2514 -18622 -13011 -11779 -21527 -30512 -24116 -14618 -8220 1931 3547 -6150 -12103 -15558 -11328 -8938
2500 -8938 -222 4690 3792 -9917 -10466 4614 10214 4435 18711 22905 17720 5147 9131 19187
2486 19187 22666 23955 20498 15319 12021 13408 14621 24277 19324 -4144 -4605 9867 18844 11585
2472 11585 -4200 -118 -939 -7656 -20660 -134 7381 5412 2637 -2760 -1350 -22343 -27787 -19468
2458 -19468 -868 679 -10909 -10410 -1405 18335 15541 13770 17770 -1677 -5721 -8141 -2206 3690
2444 3690 12624 12577 7591 6451 11955 7631 -372 -7774 -477 61 -128 -1206 -4364 -9224 -6445 -3045
2428 -3045 -5432 -9025 -8959 -13261 -1624 1013 -8032 -11704 -2840 3695 7745 -3356 -1541 2575 11737
2413 11737 14351 7047 1761 403 7931 2506 203 -7757 -21587 -9927 -15174 -7262 -7308 -9771 -6543
2398 -6543 -1189 -6599 -4733 -2153 -1862 -3975 798 3042 6474 3009 -853 -5225 -16967 -19031 -11367
2383 -11367 -4964 -4668 7466 11861 8576 -1441 -374 -7020 -12675 -4669 480 3720 -3964 -6779
2369 -6779 1876 3742 -700 -7023 -2172 -1810 -12307 -9691 4936 2422 -4529 3683 6146 20066
2355 20066 27757 35616 31546 17425 20848 5794 -12775 -6474 -2138 -6158 -1119 -3385 -11645 -1175
2341 -1175 -5171 -13053 -7938 1587 6571 8205 10595 14146 10809 2959 3079 12564 13897 15047 13397
2326 13397 18468 16066 6455 5544 8467 15266 24048 28822 22978 7307 -5423 5179 2291 -10266
2312 -10266 -9088 1634 9383 11404 5880 2555 -11701 -18206 -11526 -9988 -22000 -20157 -27240 -16171
2298 -16171 -3792 4434 -1412 1394 -2736 -3668 -3608 5629 16321 15351 10554 5261 -7267 762 3278
2283 3278 9341 4802 -4540 -2339 -16151 -8547 14060 20531 13775 8634 996 -9493 -9320 2590
2269 2590 7191 12460 15443 9837 8802 7289 8134 5480 -3455 -8483 -7840 -1056 11854 13800 10352
2254 10352 5640 3670 7806 7014 -6531 -18048 -12345 -11017 1302 4592 -1395 -17796 -16316 -18171
2240 -18171 -18258 -7947 -7 4833 9412 1395 -13337 -19179 -8224 -1733 3162 8629 13363 9306
2226 9306 -2489 -2175 -1033 1445 12626 15450 10596 14399 7236 2849 3171 -2717 4943 21086 19506
2211 19506 16445 12484 12887 22775 11503 2762 -13705 -21556 -11698 -12406 -9834 -14007 -17829 -12198 6129
2196 6129 13204 8361 -7357 -7229 -1002 -15227 -11564 -8596 -5184 -10772 -14708 -12179 -2422 3779 -1129
2181 -1129 -2126 -2920 -3175 329 248 -2028 -8691 -7770 -6488 7685 6633 4465 12529 6702 -598 -4481
2165 -4481 5424 3922 -776 5494 8013 -13268 -11319 23 3017 9287 6809 -1023 2108 3201
2151 3201 5318 -2286 -9053 -6764 1113 4262 -9477 4016 5968 2439 -2534 -9877 -8802 1325
2137 1325 8411 1094 -3811 -3836 1643 914 -10927 -16137 -19126 -11658 -8652 -1637 2269 -747 -14956
2122 -14956 -12449 -6757 -53 7067 20294 14363 8383 9715 -930 -11477 -19702 -10975 5426 10905
2108 10905 16474 16279 22267 19649 7373 3700 4101 67 -11241 -1970 2412 7736 6075 5456 10097
2093 10097 13135 16666 12777 4372 -11025 -24265 -25814 -21879 -22928 -23326 -14445 -10869 -8243 -2402
2079 -2402 -3094 -2185 -473 519 -3860 -1619 5875 -33 -659 3631 2768 -3760 -5897 -13786 -6135 13061
2063 13061 6956 -4032 -3321 -2851 -12314 -22256 -17883 -11444 -5099 6481 8195 5778 6853 10705 -4762
2048 -4762 5177 14878 5961 4246 1592 -2436 -3339 -18551 -32678 -24740 -9963 -4850 -8298 -1334
2034 -1334 -1700 8183 6986 -7174 -5380 -1738 10523 5876 7099 14152 6970 -4034 -5759 -13170
2020 -13170 -6246 3481 -7719 -12419 -19070 -16840 -10876 -9826 6362 13801 17928 10031 4386 11564
2006 11564 13368 5464 6660 9108 12166 6315 7813 -2734 -11223 -5902 -3513 1666 9658 8413
1992 8413 -2608 -145 13566 13544 9454 11627 9528 -622 -423 -1345 -10426 -10604 3284 9271 19983
1977 19983 18431 4764 -5367 -481 -692 -8290 1940 1620 -6513 -1736 -5017 -8238 -15602 -22310
1963 -22310 -21956 -20701 926 15362 13153 13876 16636 6883 11687 10173 914 2054 3858 101 559
1948 559 6000 367 -5017 -7034 -11710 -6382 -13425 -21299 -11934 1664 3257 -1249 -12029 -21199 -27290
1933 -27290 -21583 -13495 -14293 -24600 -16266 -7939 -2278 6012 15179 18611 12053 -10466 -13113 -14584
1919 -14584 -13565 -5128 847 -6708 -5161 -5726 -10566 -10801 -8420 -8468 -9673 -11152 -7757 -7538 -10002 -11192
1903 -11192 -11997 -10593 -20989 -6442 7724 5505 -3863 831 4739 -916 -3837 3351 6417 -444
1889 -444 547 2557 11408 21425 12874 6673 2327 42 -4227 -6873 -2536 -7619 -9302 -9917 385
1874 385 8386 1006 4789 9982 9835 5049 1966 673 -3596 -1452 -3592 -17172 -16974 -8898 -15129
1859 -15129 -13688 -4898 1277 4589 4821 10418 11195 7735 -1271 2131 -5095 -9573 -7834 -10360 2002
1844 2002 7171 6920 17123 28082 23432 11604 8605 12984 16151 823 -8897 -10263 -7616 -10521
1830 -10521 -6650 -7498 -6250 298 6980 14170 15578 4775 -395 12354 10439 9207 -276 -13078
1816 -13078 -12528 -16190 -15848 1104 5178 7147 6062 3814 -10744 -21972 -15278 6095 16452 4045
1802 4045 -2911 -4322 -5507 -11731 -11707 -7231 -10127 -6071 -5547 -4416 -2602 -9322 -10202 -5661 11139 7954
1786 7954 -7844 163 -7652 -10490 -2131 -3212 -8631 -18945 -14591 -7025 5030 15263 5362 8810
1772 8810 9277 948 -6007 -14671 -12975 -14793 -6490 3227 -4084 12166 15601 9075 10097 13039 12031
1757 12031 14015 12849 23706 25741 10645 7242 6039 15000 12526 10767 -3053 -6543 -4258 -7393
1743 -7393 -8927 -18234 -17474 -11754 -5330 -1740 5175 -4452 -2607 -1264 402 -1886 1382 761 2541
1728 2541 4343 -15521 -16131 -16720 -12331 -7275 5417 11425 6473 -1946 -4153 2857 -7472 -10982 -411
1713 -411 -1986 -6046 3446 -9642 -16307 -8216 2600 1700 6787 12381 17275 10025 5664 13773 17536
1698 17536 12510 9074 -2271 -3186 -10218 -12782 -10344 -5937 -4216 2444 10336 11720 6476 -41 -715
1683 -715 -1227 3806 3884 -1392 3076 9616 4116 6986 -1846 -7498 -12100 -8896 -4277 -782 8256 12105
1667 12105 9751 -1438 -9817 -3081 3542 8033 -3748 -10788 -9095 -5460 55 11542 16482 6308
1653 6308 10395 17514 11168 821 1418 4928 1888 -5397 -12122 -11743 -23437 -15622 -8924 -1273 1721
1638 1721 1417 -2769 -4177 -9983 -15470 -6843 -1386 -4590 -18757 -21157 -8639 5523 15843 20086
1624 20086 27586 25399 16189 1167 386 9196 -4186 -961 -5178 -2256 6920 10228 3889 -1748
1610 -1748 -10800 -18325 -7261 -740 7291 17307 4667 -14323 -15912 2821 1840 301 -2474 -661
1596 -661 12224 4381 -5411 9857 8412 7724 10223 10188 2704 -8699 -10923 -7841 -12701 -9242 -4924
1581 -4924 -6032 -2408 4752 1124 -5761 -3333 283 -11690 -3871 5199 2512 -4326 -8001 6681
1567 6681 2072 -5762 1609 -3045 -10608 -17272 -8265 -13181 -8897 9237 12686 9962 7501 474 -245
1552 -245 1776 8471 13471 10904 2730 1506 15315 14702 7683 -7110 -7988 -2902 5567 9355 8834
1537 8834 2888 -1808 953 -1102 -6419 -2792 -14070 -16133 -9055 -10709 -2312 6708 6222 -4540 6761
1522 6761 9236 8077 5531 1367 -9493 -6305 -8517 -13063 -18503 -16427 -20161 -8188 -11129 -11472 -16226
1507 -16226 -3560 5083 3332 -5431 -3823 1418 915 -8722 -3262 17929 12403 1068 3810 9480
1493 9480 9920 852 -901 2805 13790 20204 23817 22899 32726 35746 20666 4308 3610 7012 4318
1478 4318 -3945 -8813 -13939 -9048 -14109 -18565 -2134 7245 8448 -818 -1876 -3906 3218 7400 17899
1463 17899 15834 10656 16059 11925 14064 8411 1126 4633 643 -4516 -8636 -5683 -7631 -6674 -3332
1448 -3332 5139 6323 2253 1590 -2349 -7258 -4997 -236 8219 21550 29665 20994 6870 6685 -758
1433 -758 -5569 4229 1016 -907 -163 -831 5792 4301 1499 11673 15971 16951 4056 188 -6876
1418 -6876 -6236 -9374 -8627 -4245 -2146 -2537 -8556 -19301 -15930 -7310 -59 4108 6320 2704 -227
1403 -227 3188 6234 19096 22184 22758 6143 1382 -526 511 4132 -2497 -2960 -15255 -13577 7964
1388 7964 20666 3880 6568 6537 2968 7741 7973 937 459 -6645 2444 10881 12490 12969 10797 24942
1372 24942 33401 24439 8669 -2859 -11833 -14364 -1072 4370 5428 1081 4782 9451 12009 5414
1358 5414 138 -5049 618 10113 5404 3232 -5047 -2467 3739 11742 9532 6336 -2673 501 8507
1343 8507 15281 22704 18127 14645 8647 -10562 -19301 -21810 -10827 -6981 -5879 -12308 -20158 -11416
1329 -11416 -500 2987 1255 1623 4108 15105 17774 8954 6062 -5358 -10989 -3618 12582 4358
1315 4358 -3931 -9291 -19464 -5748 7039 14439 15828 12469 8552 11218 -456 -2710 13711 17761
1301 17761 1518 -1577 -4993 5471 4313 5560 8761 10665 1872 -667 3868 -14902 -22786 -1579
1287 -1579 3234 -3408 -2013 -92 1403 -5451 -6154 -6202 -6325 812 6254 9640 -1887 -18597 -24931
1272 -24931 -18193 -9733 -6327 -5330 171 -2978 -12153 -11036 -5772 2258 97 -5196 2785 9732 9858
1257 9858 13274 16525 8123 -1258 -1556 2576 878 2235 13325 9451 7520 15374 -8910 -27757
1243 -27757 -27149 -19653 -28557 -37901 -32275 -4695 14055 9110 -645 -8978 -12684 -6480 -798 -6890
1229 -6890 -4276 -4445 -3414 6986 18047 17945 12711 -489 -3928 -9783 -14128 788 -5829 -2088
1215 -2088 5228 12354 14694 8504 3852 -1094 4878 7353 -3537 11359 16374 10466 12422 6105
1201 6105 2570 2396 3451 2515 6046 23960 32872 25682 21903 16008 8293 1289 -11957 -7733 -4284
1186 -4284 -663 9648 16878 22142 29448 14841 3040 2384 9716 13074 11841 10140 -3758 -4265
1172 -4265 7609 880 6123 3224 -613 5014 20092 24642 23451 16486 14646 5780 -6336 8538
1158 8538 10709 2248 -9374 -14453 -16333 2960 16816 12162 -1126 -3936 -1614 -2852 5195 2042
1144 2042 -2962 -684 3656 19994 29223 18609 7720 3823 4171 462 3263 -2323 -5982 -9828
1130 -9828 -5495 -3344 9503 5135 75 1179 -3821 6498 -140 -5221 -3737 -10200 -5515 10156
1116 10156 -758 -2312 874 -2967 3076 1491 -3414 -5425 -10687 -8731 2456 19768 21811 17141
1102 17141 14171 11598 10979 -3671 316 9923 6076 531 1166 1451 -3900 -4732 498 9796 4251
1087 4251 6110 5539 112 -5037 2532 6268 1530 -6108 -10890 -2356 1865 3359 579 -8237 -5930
1072 -5930 -3117 -1343 1122 357 -3334 2316 12164 20237 8310 -6686 -7964 -13649 -9445 -695 8810
$$ [...]
##END NTUPLES=NMR SPECTRUM
##END=
