##TITLE=Analysis number 315954
Compound Code gk 00598
Project Code qc-cat
Chemist Name prosynth
##JCAMPDX= 6.0         $$ Bruker NMR JCAMP-DX V2.0
##DATA TYPE= NMR SPECTRUM
##DATA CLASS= NTUPLES
##ORIGIN= Bruker BioSpin GmbH
##OWNER= NMR
$$ XWIN-NMR		Version 3.5
$$ Fri Dec  9 12:09:31 2005 GMT Standard Time (UT+0h)  MAYBRIDGE\NMR@NMR_250MHZ
##.OBSERVE FREQUENCY= 250.131544655141
##.OBSERVE NUCLEUS= ^1H
##.ACQUISITION MODE= SIMULTANEOUS (DQD)
##.ACQUISITION SCHEME= undefined
##.AVERAGES= 16
##.DIGITISER RES= 18
##SPECTROMETER/DATA SYSTEM= dpx250
##.PULSE SEQUENCE= zg30
##.SOLVENT NAME= DMSO
##.SHIFT REFERENCE= (INTERNAL, DMSO, 0, 16.522)
##AUDIT TRAIL= $$ (NUMBER, WHEN, WHO, WHERE, WHAT)
$$ ##TITLE= Audit trail, XWIN-NMR		Version 3.5
$$ ##JCAMPDX= 5.01
$$ ##ORIGIN= Bruker BioSpin GmbH
$$ ##OWNER= NMR
$$ C:\u/data/dgb/nmr/ADRS/13650/pdata/1/auditp.txt
$$ ##AUDIT TRAIL=  $$ (NUMBER, WHEN, WHO, WHERE, WHAT)
(   1,<2005-12-09 12:09:09.81 +000>,<MAYBRIDGE\NMR>,<NMR_250MHZ>,
      <created by zg, POWCHK disabled, PULCHK disabled
       configuration hash MD5:
       62 19 C7 07 E1 42 D1 B7 37 6C 3D D0 77 39 F9 E6
       data hash MD5: 64K
       3F 1B E9 7C CE 52 EF 46 F8 0D 5D D9 E5 75 7D D9>)
(   2,<2005-12-09 12:09:22.65 +000>,<MAYBRIDGE\NMR>,<NMR_250MHZ>,
      <Start of raw data processing
       ef LB = 0.3 FT_mod = 6 PKNL = 1 SI = 32K 
       data hash MD5: 32K
       E9 75 39 AA 7C E2 53 6A 84 BD 23 B3 8B 3C F9 56>)
(   3,<2005-12-09 12:09:24.40 +000>,<MAYBRIDGE\NMR>,<NMR_250MHZ>,
      <apk 
       data hash MD5: 32K
       EB 7F FE C6 3C 2B 29 70 C4 F3 91 1F A2 6B 88 73>)
(   4,<2005-12-09 12:09:25.17 +000>,<MAYBRIDGE\NMR>,<NMR_250MHZ>,
      <abs ABSG = 5 
       data hash MD5: 32K
       A7 86 33 F7 EC AE 31 E6 04 2B 3C 47 2F D1 0A 71>)
$$ ##END=
$$ 
$$ hash MD5
$$ E5 4D 37 DC E0 36 DE 2D 15 88 94 C8 43 1A 93 90
##$RELAX= 
##$RELAX= 
##$RELAX= 
##$RELAX= 
##$RELAX= 
##$RELAX= 
##$RELAX= 
$$ Bruker specific parameters
$$ --------------------------
##$DU= <C:\u>
##$EXPNO= 13650
##$NAME= <ADRS>
##$PROCNO= 1
##$TYPE= <nmr>
##$USER= <dgb>
##$AMP= (0..31)
100 100 100 100 100 100 100 100 100 100 100 100 100 100 100 100 100 100 
100 100 100 100 100 100 100 100 100 100 100 100 100 100 
##$AQSEQ= 0
##$AQ_mod= 3
##$AUNM= <au_zg>
##$AUTOPOS= <14 >
##$BF1= 250.13
##$BF2= 250.13
##$BF3= 250.13
##$BF4= 250.13
##$BF5= 500.13
##$BF6= 500.13
##$BF7= 500.13
##$BF8= 500.13
##$BYTORDA= 1
##$CFDGTYP= 0
##$CFRGTYP= 5
##$CHEMSTR= <none>
##$CNST= (0..31)
1 1 145 1 1 1 1 1 1 1 1 1 1 1 1 1 1 1 1 1 1 1 1 1 1 1 1 1 1 1 1 1 
##$CPDPRG= <>
##$CPDPRG1= <>
##$CPDPRG2= <>
##$CPDPRG3= <>
##$CPDPRG4= <mlev>
##$CPDPRG5= <mlev>
##$CPDPRG6= <mlev>
##$CPDPRG7= <mlev>
##$CPDPRG8= <mlev>
##$CPDPRGB= <>
##$CPDPRGT= <>
##$D= (0..31)
0 1 0 0 0 0 0 0 0 0.06 0 0 0 0 0 0 0.0002 0 0 0 0 0 0 0 0 0 0 0 0 0 0 
0 
##$DATE= 1134130148
##$DBL= (0..7)
120 120 120 120 120 120 120 120 
##$DBP= (0..7)
150 150 150 150 150 150 150 150 
##$DBP07= 0
##$DBPNAM0= <>
##$DBPNAM1= <>
##$DBPNAM2= <>
$$ [...]
##$SUBNAM7= <"">
##$SUBNAM8= <"">
##$SUBNAM9= <"">
##$SW= 20.6930455092707
##$SWIBOX= (0..15)
0 0 3 0 0 0 0 0 0 0 0 0 0 0 0 0 
##$SW_h= 5175.983436853
##$TD= 65536
##$TD0= 1
##$TE= 294.16
##$TE2= 300
##$TE3= 300
##$TEG= 300
##$TL= (0..7)
0 120 120 120 120 120 120 120 
##$TP= (0..7)
150 150 150 150 150 150 150 150 
##$TP07= 0
##$TPNAME0= <>
##$TPNAME1= <>
##$TPNAME2= <>
##$TPNAME3= <>
##$TPNAME4= <>
##$TPNAME5= <>
##$TPNAME6= <>
##$TPNAME7= <>
##$TPOAL= (0..7)
0.5 0.5 0.5 0.5 0.5 0.5 0.5 0.5 
##$TPOFFS= (0..7)
0 0 0 0 0 0 0 0 
##$TUNHIN= 0
##$TUNHOUT= 0
##$TUNXOUT= 0
##$USERA1= <user>
##$USERA2= <user>
##$USERA3= <user>
##$USERA4= <user>
##$USERA5= <user>
##$V9= 5
##$VALIST= <valist>
##$VCLIST= <CCCCCCCCCCCCCCC>
##$VD= 0
##$VDLIST= <DDDDDDDDDDDDDDD>
##$VPLIST= <PPPPPPPPPPPPPPP>
##$VTLIST= <TTTTTTTTTTTTTTT>
##$WBST= 1024
##$WBSW= 4
##$XGAIN= (0..3)
0 0 0 0 
##$XL= 0
##$YL= 0
##$YMAX_a= 520153
##$YMIN_a= -330716
##$ZGOPTNS= <>
##$ZL1= 120
##$ZL2= 120
##$ZL3= 120
##$ZL4= 120
##$ABSF1= 16.522
##$ABSF2= -4.171173
##$ABSG= 5
##$ABSL= 3
##$ALPHA= 0
##$AQORDER= 0
##$ASSFAC= 0
##$ASSFACI= 0
##$ASSFACX= 0
##$ASSWID= 0
##$AUNMP= <proc_1d>
##$AZFE= 0.1
##$AZFW= 0.1
##$BCFW= 0
##$BC_mod= 0
##$BYTORDP= 0
##$COROFFS= 0
##$CY= 12.5
##$DATMOD= 1
##$DC= 0
##$DFILT= <>
##$DTYPP= 0
##$F1P= 14.0000005364418
##$F2P= -0.99999901652339
##$FCOR= 0.5
##$FTSIZE= 32768
##$FT_mod= 6
##$GAMMA= 0
##$GB= 0
##$INTBC= 1
##$INTSCL= 1
##$ISEN= 128
##$LB= 0.3
##$LEV0= 0
##$LPBIN= 0
##$MAXI= 10000
##$MC2= 0
##$MEAN= 0
##$ME_mod= 0
##$MI= 0
##$NCOEF= 0
##$NC_proc= -3
##$NLEV= 6
##$NOISF1= 0
##$NOISF2= 0
##$NSP= 0
##$NTH_PI= 0
##$NZP= 0
##$OFFSET= 16.522
##$PC= 1
##$PHC0= 75.18797
##$PHC1= 9.159145
##$PH_mod= 1
##$PKNL= yes
##$PPARMOD= 0
##$PSCAL= 4
##$PSIGN= 0
##$REVERSE= no
##$SF= 250.13
##$SI= 32768
##$SIGF1= 0
##$SIGF2= 0
##$SINO= 400
##$SIOLD= 32768
##$SREGLST= <1H.DMSO>
##$SSB= 0
##$STSI= 32768
##$STSR= 0
##$SW_p= 5175.98343685301
##$SYMM= 0
##$S_DEV= 0
##$TDeff= 65536
##$TDoff= 0
##$TI= <Analysis number 999999
Compound Code 99
Book Reference 9
Project Code 9>
##$TILT= no
##$TM1= 0
##$TM2= 0
##$TOPLEV= 0
##$USERP1= <user>
##$USERP2= <user>
##$USERP3= <user>
##$USERP4= <user>
##$USERP5= <user>
##$WDW= 1
##$XDIM= 32768
##$YMAX_p= 338710452
##$YMIN_p= -491650
$$ End of Bruker specific parameters
$$ ---------------------------------
##NTUPLES= NMR SPECTRUM
##VAR_NAME=  FREQUENCY,     SPECTRUM/REAL,   SPECTRUM/IMAG
##SYMBOL=    X,             R,               I
##VAR_TYPE=  INDEPENDENT,   DEPENDENT,       DEPENDENT
##VAR_FORM=  AFFN,          ASDF,            ASDF
##VAR_DIM=   32768,         32768,           32768
##UNITS=     HZ,            ARBITRARY UNITS, ARBITRARY UNITS
##FACTOR=    0.157963299565203, 1,           1
##FIRST=     4132.6476996994, 0,             0
##LAST=      -1043.33573715361, 0,           0
##MIN=       -1043.33573715361, -491650,     0
##MAX=       4132.6476996994, 338710452,     0
$$ Real data points
##PAGE= N=1
##DATA TABLE= (X++(R..R)), XYDATA
$$ [...]
21892 48735 31056 45152 24162 6113 -44779 -40306 1940 2499 4595 10332 -20320 -75151 -113443
21879 -113443 -160224 -108480 -82421 -100064 -122148 -31502 2932 479 42451 56567 86572 106429
21867 106429 86984 82956 65653 65581 58584 60289 76774 130442 158053 153843 72475 24632 -6831
21854 -6831 5762 -35074 -87270 -76047 -6541 -66888 -61627 -48860 -70692 -84412 -91613 -114903
21842 -114903 -101280 -20739 21362 14669 -52980 -80342 -109453 -122246 -115358 -100011 -74534 -41082
21830 -41082 -27064 53125 98632 50601 -21391 -56600 -85101 -76009 12719 10645 -54714 -42755
21818 -42755 -55016 -89907 -55058 46281 44919 33816 -9220 -66989 -32800 12448 -12365 -21937
21806 -21937 -5259 -46724 -88753 -108482 -41754 -48733 -74918 -113920 -33996 27058 50416 9207
21794 9207 -40709 -68006 -72599 -1187 -5771 -48519 -36952 -50582 -73671 -5916 28417 -49458
21782 -49458 -83233 -88024 -136347 -139839 -111318 -97104 -10136 40399 -30733 -89446 -61048 -61015 -65923
21769 -65923 -100437 -59819 -65025 -101404 -67238 -50342 -60422 -41680 -11808 -31963 -99982 -91597
21757 -91597 -91132 -101164 -55463 -44354 -64336 -86802 -79634 -88872 -61205 -74816 -24440 -21286 -16648
21744 -16648 -63702 -76926 -83848 199 10278 -69380 -141403 -144928 -101294 -80014 -116176 -139780
21732 -139780 -89575 14954 49197 41131 2906 -77120 -68788 -63891 -85774 -67545 -58620 -44053
21720 -44053 12747 -19568 -64048 -46704 1624 -3931 -43829 -52588 -43999 -100065 -77927 -28877
21708 -28877 15693 50020 51708 63600 39029 10080 34061 -2978 -55940 -97502 -94798 -67285
21696 -67285 -78871 -80928 -28562 -38190 -44405 -67078 -77450 -73873 -44170 -41972 -19151 9650 8104
21683 8104 -42534 -54278 -19977 20667 -21776 -68042 -142685 -96322 -95945 -65796 4337 11876
21671 11876 -51633 -34290 -40361 -39269 2558 -7605 -73595 -91356 -89737 -41411 -36183 -9068
21659 -9068 -366 -46103 -45964 -59627 -56431 -64184 -75973 -73508 -56002 21754 64669 35188 -21484
21646 -21484 -29584 -83049 -83454 -66650 -19926 -78567 -90053 -86783 -47864 40860 44308 9031 8264
21633 8264 20491 3095 -13981 -44936 -23839 41995 94682 103509 10670 -30148 -43483 -41677
21621 -41677 -75587 -68055 -45383 -36755 -23522 6215 -486 38041 -17140 33231 34040 -49372 -35649
21608 -35649 -50218 -6139 57959 16969 73855 78580 59883 64636 93553 66857 21993 20083
21596 20083 45451 88340 75682 86487 54003 77525 88811 57502 3427 -64247 -25411 12453
21584 12453 45521 32844 -36543 -71953 -46224 -39771 -32484 -17346 59852 114660 116706 52424
21572 52424 36333 25640 18074 12592 -18081 -32241 -58351 -58623 -35777 -7373 18858 5931
21560 5931 -5225 -7483 -46815 -98115 -88725 11965 39652 -39681 -97327 -97465 -67283 -92356
21548 -92356 -98278 -30778 870 1053 28477 45177 9372 -34088 -65190 -52566 -71847 -123620
21536 -123620 -96036 -39136 38849 53039 56137 72268 36449 18303 -16734 -33564 13070 37615
21524 37615 37735 12116 -40445 13545 55660 53122 54058 108293 95517 20568 -16436 -70513 -78957
21511 -78957 -66145 -65816 -74417 -54160 -41395 -29230 -22475 -10097 -35224 -45956 -60004 -74824
21499 -74824 -62376 -55562 -50699 -52958 -50951 -50489 -47885 -18153 -1727 30889 16513 -1774 -31222
21486 -31222 -85187 -48117 -58221 -42895 -102390 -135584 -80056 -96172 -64237 -1715 28280 5117
21474 5117 -52503 -77459 -61841 -29011 -18666 -44829 -66187 -16559 31700 51033 39740 -5551
21462 -5551 -28439 -47818 -80553 -93203 -32902 -480 -1917 6151 47970 138633 127301 51775
21450 51775 25206 -4810 -46505 -43760 -22003 -31041 19573 8637 -26279 -57814 -41797 -67262
21438 -67262 -31597 -38388 -14175 22421 38514 28335 -663 -42978 -33790 -30365 -88818 -85450
21426 -85450 -40066 7759 9474 -26254 -49256 -2565 55615 63728 -20213 -51917 7501 33077
21414 33077 36742 12890 59105 91157 40119 65364 27175 5510 -837 11188 70791 98915
21402 98915 25657 -54764 -119866 -42356 47338 89233 23980 19409 56868 89655 62544 -17858
21390 -17858 -22145 -35691 -15823 -1951 29137 -59789 -102406 -106322 -121199 -57338 -16632 -25092
21378 -25092 -69694 -90689 -67006 -81421 -79251 -36567 -25988 -39401 -56844 -72005 -74443 -109593
21366 -109593 -111664 -61645 -83863 -70010 -128495 -137333 -70020 -5929 38858 44026 -51820 -53906
21354 -53906 22454 51876 13234 43399 13861 5777 -9941 -43514 -32437 -54333 -26328 -44041
21342 -44041 -80157 -89051 -67225 -70265 -651 -75776 -108245 -72187 -1858 -9676 -34895 -80593
21330 -80593 -73528 -24735 -31414 -43025 37482 20829 -54457 -59334 13332 37349 12322 6664
21318 6664 -23005 -12534 -2141 5179 17984 -391 -15885 -46215 -49411 -32957 -45185 -35902
21306 -35902 -33897 -66079 -103762 -108966 -70071 -43221 -39842 -32025 -24618 -58566 -94758 -62525 -47894
21293 -47894 -16768 17845 26675 14032 22586 10683 -2969 -11158 -15747 -30725 -37653 -17287 -46608
21280 -46608 -75150 -56855 -58735 -8100 14103 43798 37590 214 -48638 -53003 -35822 -32128
21268 -32128 -69372 -94163 -74488 -42622 -6532 45263 60335 38364 39021 40815 -32677 -29428
21256 -29428 6581 9115 -50172 -73451 -12437 -4664 8073 79193 86878 65565 79632 21821
21244 21821 -40814 936 24702 -34592 -61235 -35857 22541 -21038 -35095 -30705 -24731 -52642
21232 -52642 -73557 -36109 16005 38023 16109 54888 24165 24925 59294 77520 85594 96050
21220 96050 94235 39599 42262 92923 98710 102454 58295 -5980 -17465 -12950 -44443 -45514 54702
21207 54702 87567 79452 31307 48622 15687 51666 49348 2963 -18458 23485 43154 60433
21195 60433 123881 54803 -81563 -89339 -31095 -21561 24251 -56265 -77031 -31147 6795 -9291
21183 -9291 -33657 4776 841 30702 104109 119010 103430 27635 -33565 -44160 -19077 15454
21171 15454 12299 16010 -23189 -72315 5707 96401 108506 92718 84999 49654 15119 20746
21159 20746 32133 35821 96862 100645 -5678 -52670 -30256 -1905 39728 42615 51387 27477
21147 27477 -4377 -66423 -53348 -46928 -31333 -11749 -6721 26837 38406 -1069 -16664 -23052
21135 -23052 -29588 -13901 -71825 -86734 -72324 -63507 -114244 -75509 -335 22366 5073 -4143
21123 -4143 -40760 -51935 -23316 -26255 -41030 -73270 -50836 -50644 -90981 -90048 -66333 -99574 -56036
21110 -56036 -53973 -77434 -56823 -20479 -60164 -87872 -62384 -24934 -18649 7841 39182 34485
21098 34485 -26619 -25953 19727 87463 27309 -9062 -9024 21619 79781 64164 70921 77742 37817
21085 37817 -32067 -34596 -4473 34384 35738 -4346 -10028 -32534 -13457 3055 -23590 -60476
21073 -60476 -92346 -46768 -9707 1411 3722 -12773 -32475 -39781 -15635 20207 24090 21038
21061 21038 -25941 -99918 -110319 -74083 -44865 -57841 6138 -8565 -47059 -63919 -4018 -15427
21049 -15427 -72043 -95383 -95550 -98737 -34293 20651 17945 26631 26383 -1133 -8664 -557 55481
21036 55481 74536 44132 15219 -1195 -45668 -107613 -138002 -144751 -103360 -76134 -34819 -44006
21024 -44006 -70141 7220 54414 64397 52950 34574 27688 -12367 -27166 -34459 -53084 -69619
21012 -69619 -37064 -8680 38406 62468 74862 23912 -18084 -18898 -15570 -30805 -35207 15745
21000 15745 90457 82446 33443 -3016 -14647 17248 58904 65106 89378 62106 -11603 22164
20988 22164 51043 27404 14056 45149 46767 36813 45369 30213 -12772 -59905 -37759 10640
20976 10640 53779 88100 107445 89345 23004 -9878 942 64030 107010 94258 110137 34576
20964 34576 -33251 30647 75132 110719 30504 3286 -29444 -81229 -60710 -71573 -54286 -78819
20952 -78819 -164810 -149142 -60380 -67761 -96029 -60578 1360 10493 -9287 28823 19568 21999
20940 21999 27775 54148 82634 41017 4440 2644 66772 79970 11776 -44773 -47654 -14088
20928 -14088 -41455 -30519 -50887 -72187 -76981 -65208 -86715 -49093 -6010 -21637 -43450 -65694
20916 -65694 -67515 -59811 -49071 -10011 36158 59705 25330 -25428 -79701 -84597 -54078 -68793
20904 -68793 -46536 11882 28216 59952 78399 77870 52868 68199 94477 62460 12009 -23102
20892 -23102 15836 103635 118338 102829 41199 -44673 -62411 -26820 26369 -32903 -54064 -75061
20880 -75061 -58349 -35690 -55221 -9472 -41308 -70133 1940 11416 -12371 2322 34101 14503
20868 14503 1062 43704 18202 21575 42593 -19710 -29181 -37365 -50039 -24433 -33117 -35420 -20310
20855 -20310 19656 -3923 -32890 -68918 -62606 -52670 -48286 -31782 -77807 -102597 -59116 -53208
20843 -53208 -58875 -91310 -106320 -73116 -71331 -115640 -108458 -94610 -52710 -36156 -18149 -47972
20831 -47972 -80854 -40482 31025 30395 -26075 -30183 5692 45582 -18404 -29108 6895 32978
20819 32978 34656 12470 6783 -48289 -92103 -29059 43198 88635 36810 -23188 -18613 -17865 14934
20806 14934 -33754 -8838 -10103 -12716 8712 -6496 -29678 12500 -16086 -34849 -55495 -43320
20794 -43320 43784 25684 -35362 -25482 -2965 20928 88253 82087 43364 19780 63687 25858
20782 25858 10919 34852 44493 60515 71068 17255 23346 39341 45688 85987 113955 66719
20770 66719 30332 51241 48922 -42 -44140 -85151 -37746 9999 52733 43353 9326 85378
20758 85378 123522 93454 120980 160863 113677 61502 108800 169286 90001 4744 6053 10335
20746 10335 22938 10773 44505 14716 -6181 -11641 -45624 -47326 -33997 20010 70349 50233
20734 50233 -24038 -79507 -89523 -146193 -99548 -61450 -58565 -58781 -6656 31753 20881 -21673
20722 -21673 -11303 15147 -18135 12945 8855 -13817 10186 35998 -1280 12074 22800 12561
20710 12561 17919 11873 -17062 -42873 -18641 -15154 -5121 -16261 17206 65409 39715 18351
20698 18351 44437 37998 -16739 -42416 -56692 -52157 -59945 -34539 -8887 -21125 21241 90490
20686 90490 129166 78482 83863 100593 84736 56522 16865 4826 -60 15862 15845 -18477 -29578
20673 -29578 9427 42644 -1690 -40674 -14116 37493 54902 45940 77463 67015 42536 31979
20661 31979 -2130 -52189 -48975 -48111 -26152 -17259 -26393 4504 9708 -10251 -89344 -61305 13618
20648 13618 18218 21509 -16515 -62294 -41846 -12556 -21714 -24906 -8316 23373 -4350 -39627
20636 -39627 6626 -40475 -110689 -57712 36325 52280 17887 -5 -18661 37973 -6424 -18345
20624 -18345 -51534 -19108 71398 93122 10977 -22408 -12990 -6625 -23446 -52144 -46875 -43949
20612 -43949 8755 68109 86170 103425 69923 54087 40329 63597 88842 52541 35686 2324
20600 2324 -65385 -71802 -88203 -89915 -32496 18977 19485 -32661 15563 33329 22575 1008 46321
20587 46321 54922 54587 58221 26919 -4189 32976 37774 38755 33150 -25334 -12352 44056 57979
20574 57979 41953 60419 125567 128245 135049 96926 758 -46532 -38554 -51829 -55851 -98896
20562 -98896 -98987 -56960 -54055 -40420 -10297 -8740 -22078 24056 -7347 12219 6947 134 25669
20549 25669 16371 -37802 -2938 47774 66036 17412 -16460 -26322 -1264 1046 -4366 6927
20537 6927 -13890 733 4087 45551 72231 69249 55349 23843 6789 11288 6897 45588 33951
20524 33951 -28738 -28350 13866 32148 53635 34187 21781 6902 24185 1587 47365 26866
20512 26866 -23531 -50376 -36975 -20072 -1171 50994 54906 -40715 -56665 -41946 -37469 -35946
20500 -35946 -56396 -89675 -38844 -39112 -45563 -132403 -151579 -49732 3372 -22559 -48594 -66629
20488 -66629 -27655 -27409 -83796 -60932 -42728 -28318 16253 35842 1360 -51444 -52481 17432
20476 17432 57750 18976 -53264 -6980 14851 1500 -47379 -65739 -59870 -26521 -67914 -77244
20464 -77244 -73059 -21750 21948 55875 86993 74605 59392 6883 -84455 -31567 1493 -47302
20452 -47302 -20859 -9571 -32212 -89450 -71651 -57943 -41162 -39168 -62227 -17874 3479 12013
20440 12013 26479 81232 83349 21432 23250 -30029 -48430 -78316 -70092 -44692 -16370 -10904
20428 -10904 8712 28807 -1682 7047 -23397 -35931 -45266 -27196 23096 26770 50401 55805
20416 55805 17286 -15169 -22096 47381 121821 78593 48515 13918 5207 -40816 -3919 60684
20404 60684 36917 -40643 -18493 -8915 -18824 -56774 -57367 -74360 -72037 -65009 -73120 -61648 -57604
20391 -57604 -66835 -74614 -502 -32683 -96370 -91386 -59981 5477 15291 66349 58971 13174 -8279
20378 -8279 -46796 -39362 -6448 -40648 -30171 32860 23572 -12975 -42714 -58941 -62920 -39892
20366 -39892 -28745 -14690 -32982 -4961 35626 56828 -20708 -31228 -24629 -21183 903 14
20354 14 -43081 -27107 19320 14710 31079 74646 111236 98863 60315 4206 -22640 -7329
20342 -7329 463 36118 91321 124443 88522 46063 1754 -26887 -15747 12502 9153 -9919
20330 -9919 -49747 -97012 -130391 -108824 -42027 25952 -7979 -51095 -18666 -25114 -79518 -64138
20318 -64138 -16525 -11579 -70076 -58450 -32190 -26841 -33894 -56603 -48008 -24387 6483 30833
20306 30833 90838 80086 13326 -25414 -48896 -38765 -35056 -83474 -134221 -173332 -173696 -163962
20294 -163962 -82617 -36892 -72628 -50500 -53980 -65344 -81398 -69813 -44761 -94445 -164757 -125706
20282 -125706 -72750 -3573 41319 50244 10187 -45111 -86717 -42365 9320 59950 54594 94748
20270 94748 94605 30101 -42438 -103889 -99519 -90037 -43453 -25283 -44112 -79016 -54524 -67241
20258 -67241 -55260 751 -9492 -19949 -57811 -46965 11894 28954 30996 55125 61678 41435
20246 41435 70224 83516 64390 -1396 -15206 -16354 -70835 -141853 -135627 -105774 -87034 -48681
20234 -48681 -39642 -36220 -50039 -40089 -56234 -52222 28145 47964 76423 115186 114250 109020 108238
20221 108238 56739 31035 38484 83278 69185 54443 32248 22827 30841 55968 44854 24693
20209 24693 -2997 22284 -35365 -63933 -80670 -97980 -61440 -33794 6120 11084 -6554 -48171
20197 -48171 -42413 -42880 -38967 -24526 16984 62064 58930 17739 20782 29729 15905 -34108 -38445
20184 -38445 25051 25573 -15305 -48113 -92443 -130720 -98289 -2549 37160 72191 31061 -34828
20172 -34828 -34224 -38756 4751 -32847 -42890 -7924 -15460 -42587 -47551 -37951 -55046 -14184 -20452
20159 -20452 -84496 -93615 -60392 -18540 34470 55078 -7386 19494 29720 39336 19189 -1807
20147 -1807 -16155 -22024 18605 29522 53839 54981 39017 7090 32561 2945 3544 -29645 -94686
20134 -94686 -67607 1863 60965 65671 7309 -94964 -106001 -114240 -138617 -68855 11704 2684
20122 2684 -9189 -13806 -25692 -902 -12653 10260 67987 59743 63885 38342 19550 -2325
20110 -2325 -14427 -29250 -81387 -97024 -89360 -48538 -65358 -13658 -2860 16618 20502 -9873
20098 -9873 15327 63909 48453 -23203 -31227 238 30108 -33518 -76847 -73749 -85941 -82268
20086 -82268 -53914 -14981 -25282 -48739 -73005 -78397 -34538 -38214 -79290 -92037 -53629 15393
20074 15393 -47429 -36963 -33042 -72247 -90395 -78357 -18871 36996 12955 16488 15984 13357 451
20061 451 -62212 -58930 -59884 -115307 -52902 -7564 -8673 -70057 -56005 3101 13861 34107 106362
20048 106362 58999 44382 20747 -25198 -103748 -81367 14263 35925 16829 2377 31480
20037 31480 38676 8056 11236 -1067 -51349 -57680 -15700 25202 23778 2444 21387 26485 47962
20024 47962 56994 63577 40614 18630 80347 54201 6413 50916 70881 6376 -29005 8431
20012 8431 53613 44070 78240 170248 217921 231522 227413 234879 211580 153740 94662 33971
20000 33971 -10920 -7902 27626 95799 90012 66638 266 -9040 -12531 -13933 9799 -337 -11882
19987 -11882 37864 -13674 -19833 -89312 -65658 -22702 -17334 8886 -11581 -33115 -9913 -8298
19975 -8298 -68147 -47939 -65052 -65317 -60759 -34939 -20092 -9338 -73537 -99827 -74754 -36502
19963 -36502 -16921 -44509 -36870 2245 25584 82476 57534 -25401 -47902 -57259 -23154 11909
19951 11909 59066 70163 91466 103130 73937 21807 -109 14211 42255 42265 102162 61248
19939 61248 9611 16367 -11324 -4719 38503 43303 42628 35227 5042 -283 9451 38378 81995
19926 81995 106027 54990 70891 103967 77747 81909 54271 -3342 -62642 -107901 -112168 -69289
19914 -69289 -99831 -74084 -39112 3024 28503 17208 10722 32280 36463 29696 8559 -2647
19902 -2647 -20566 -85071 -55780 -52452 -66713 -58187 -42084 -11844 -8013 -29274 -85563 -103063
19890 -103063 -92390 -86340 -45545 -2582 -47882 -38535 -57001 -15006 -27538 -6956 19285 8451
19878 8451 -8418 7326 -13931 -24088 -29716 -101113 -87568 -6518 33218 48614 44351 47894
19866 47894 26476 16305 42613 47033 -10968 -29952 -13156 -22464 -31011 -36133 -81979 -148885
19854 -148885 -80976 -11016 -17927 -22361 -4944 -783 -8638 -39897 -76743 -57511 4271 63827
19842 63827 103154 148784 153771 139411 135214 103342 39104 27715 63331 29829 69420 73551
19830 73551 30812 14882 -9609 57090 79568 94763 159667 114347 101318 90308 46424 50361
19818 50361 66314 114567 145562 110371 69799 35620 45600 60818 60088 34025 11935 25255
19806 25255 -5572 6916 40139 60487 123244 71073 8577 34553 94724 72110 75416 53779
19794 53779 40557 33100 -23156 -45693 -28632 -50513 -27830 1524 18517 6061 -22797 -24238
19782 -24238 -19598 24865 47555 11863 32225 84701 43801 -17725 -36095 -33332 -10093 -12110
19770 -12110 -15755 -4078 -4973 -23517 36754 39419 38452 54422 12743 -5479 2326 31697 -28705
19757 -28705 -34588 35145 39762 53402 29276 2493 -54326 33507 85081 69349 6362 -29274
19745 -29274 -30753 -59980 -87190 -107195 26030 106651 46270 -11237 -41639 2009 -34705 -89783
19733 -89783 -104138 -63487 -69348 -46911 -70019 -48539 -52324 -37059 1663 9326 10482 -10722
19721 -10722 6634 32958 20172 -5797 -38330 -36741 -24495 -12594 -15508 11154 25770 32848
19709 32848 27049 9189 -24356 -27758 -21545 -5364 44473 29840 16837 13348 35164 28495 -21026
19696 -21026 -13284 -3204 34630 6753 -18634 -8393 -8478 3439 -23723 10106 113049 134841
19684 134841 58958 69009 83973 89922 78743 30691 -25383 -52927 -49821 -54736 5253 35730
19672 35730 33004 24682 18444 29315 61360 39324 -19812 -30656 -56113 -18690 14490 20110
19660 20110 23002 -12214 -38735 -52860 -15853 34614 117563 125782 98849 72827 38195 29316
19648 29316 9017 -26443 -83615 -32373 63639 79245 24351 10444 4509 3001 -27549 -17704
19636 -17704 21926 32203 74788 68822 43441 32843 76188 63650 19448 54005 18661 -48321
19624 -48321 -20193 65413 84043 62633 33486 11008 8473 32585 51247 47327 -499 -34664
19612 -34664 -19301 18890 65523 70107 33488 7733 13907 85523 90196 91257 86585 51893 360
19599 360 -119822 -167738 -106938 -57545 -17104 -15911 -16374 17933 69833 36086 -3900 -18280
19587 -18280 -79395 -81974 -79773 -37298 -7939 53590 74903 37352 22065 27846 70376 108108
19575 108108 28643 13389 -23069 17236 96961 134134 115331 83086 77411 60225 35382 13671
19563 13671 74827 78835 32239 -12158 26988 62971 46761 43245 58454 43937 36395 39293
19551 39293 59039 58619 -606 -30178 -52570 8400 72639 58006 -4167 -50583 -58107 -55325
19539 -55325 -33260 -45432 -9037 -9313 -16921 555 5464 -1046 -13834 -54041 -52299 7203 7312
19526 7312 -10895 13389 21021 66100 75561 79677 33974 22652 38572 73635 31348 -12573
19514 -12573 -13038 -29668 8194 73843 65294 45218 36686 17011 27824 11038 -22887 -5973
19502 -5973 39356 -1532 -53573 -18015 15992 9645 29598 59356 94756 50271 77041 49007
19490 49007 66541 80086 76006 5135 24787 9199 5878 35983 27463 28315 32823 36822 -40467
19477 -40467 1189 20815 11224 82749 98313 49194 36883 45838 65274 60552 -4271 -6732
19465 -6732 38765 41942 11957 6064 48560 1505 -85238 -127515 -123680 -123386 -38467 34203 80228
19452 80228 83187 24867 24099 101053 97618 40360 42977 87581 67975 42518 80876 120226 79398
19439 79398 3177 -46165 -45630 -15497 15181 -13467 -37022 -58290 -76909 -77009 -87498 -35307
19427 -35307 -30759 -27076 -28167 -34932 -45674 -21882 54310 78216 57535 -19852 -78194 -23969
19415 -23969 36667 41312 36573 -8634 -27014 -9719 -6076 8290 90149 105461 66556 5393
19403 5393 -65317 -43745 -11518 3499 60307 94979 70383 19885 69851 87375 99485 120179
19391 120179 116900 85579 78427 87310 95623 118766 44534 42646 35246 44140 55153 60462 102717
19378 102717 132111 63853 -16219 -4255 1011 7499 -39108 -100606 -96614 -43138 -11266 19410
19366 19410 22563 46877 72246 88897 67066 19791 24336 66928 58132 50916 19006 23648 27678
19353 27678 5042 -30043 -18347 -2006 -29327 -60336 -20055 58509 119786 113808 94837 -9734
19341 -9734 -22494 -6276 45910 65932 47329 26277 -42635 -47025 -35857 5993 67869 46714
19329 46714 62239 49296 9057 10191 60147 34814 -2567 -6687 -15960 -5306 -28752 28976
19317 28976 30756 21439 51581 21201 -12526 -5306 67513 103093 34908 23619 86183 140043
19305 140043 95468 78252 137900 128277 98894 84426 96969 114684 67753 88592 124730 197103
19293 197103 158728 127953 108534 93343 132828 95711 105677 157483 197912 210154 113604 135984
19281 135984 144935 144841 114332 130875 151662 255532 299784 282678 250012 223670 207219 210036
19269 210036 150912 99945 123503 147055 163018 180567 204742 202179 134661 107376 96766 77220
19257 77220 68058 11475 917 59837 119849 117540 78776 93428 128012 175903 202054 178693
19245 178693 156199 122529 135366 161394 165124 144696 146438 110756 106855 112032 119314 149439
19233 149439 200620 242817 243835 217020 248949 304409 327690 309762 339594 328402 309562 336025
19221 336025 343632 274863 251637 199694 144267 154463 164241 167054 190808 213977 149900 143741
19209 143741 191675 193886 202556 166479 131437 134442 150961 191541 213827 165331 94690 90337
19197 90337 101064 122903 82349 739 -30912 1483 33108 -344 14245 64439 104756 131801
19185 131801 137740 116678 35184 27958 85340 171743 170859 113239 82472 117235 106371 75464
19173 75464 58545 35956 42039 63203 28739 63664 107066 122087 14119 -46945 -4468 2575
19161 2575 19729 100092 112752 43144 28699 50760 33160 42440 97235 97957 70658 49879
19149 49879 69814 123131 107721 86773 82866 28280 27706 48845 54538 39492 48055 59944 128460
19136 128460 150198 95901 93300 84263 85953 92690 70258 76715 99146 117359 126496 111756 81709
19123 81709 80031 103598 105318 60489 135730 183646 145407 43889 15897 -15659 9705 80536
19111 80536 78195 111945 138428 104687 60978 45444 74096 99306 60856 90448 112283 87614
19099 87614 91529 59918 95742 118604 90691 78949 107471 202380 201724 199660 195707 158595 156676
19086 156676 156148 138129 141752 212152 232942 158826 109324 114027 158572 179824 201235 207432
19074 207432 211154 243041 221773 276423 286513 263874 213809 206120 212062 251165 232625 223153
19062 223153 245197 245410 244329 239434 202289 260890 325229 314315 276371 208778 106950 102947
19050 102947 158553 211006 248550 296407 288167 250663 221288 221216 230138 199585 117926 98803
19038 98803 123663 102730 102662 98306 118742 146114 234152 289195 222630 174995 116619 96906
19026 96906 149029 210065 238290 253760 227761 220880 248321 241231 273773 302668 287952 296573
19014 296573 310099 313177 352303 385705 387858 378035 343046 291120 314027 369665 402809 379209
19002 379209 349878 295656 275988 327070 297140 253713 267484 275289 267142 272992 242198 178080
18990 178080 164280 189189 204309 232565 237222 198641 157950 179520 183433 200178 220479 208791
18978 208791 164826 144513 113716 86239 110438 170839 200601 221957 214380 235697 249466 262684
18966 262684 213739 114850 119622 168380 140260 179280 220059 264613 228762 182524 164138 96496
18954 96496 138100 157502 114807 31327 78827 156449 163265 198115 215583 172427 146264 182629
18942 182629 182763 149585 171704 170696 197424 172551 39840 31250 78065 94526 102086 109222
18930 109222 144926 146229 149448 205812 257260 315121 321410 345361 331431 305660 324100 346034
18918 346034 354934 347820 351264 377753 393513 342718 321697 307259 266929 275411 246851 232182
18906 232182 183297 218539 231160 213102 240838 255354 271576 278226 339345 430876 425392 418066
18894 418066 440440 360721 251108 167730 221178 239366 236483 247587 243257 284140 315909 329542
18882 329542 358053 378091 354817 310065 336584 304329 328383 411496 460761 452755 545236 600257
18870 600257 544022 555280 557468 476257 437559 458624 518793 504777 497017 510978 521878 459350
18858 459350 455865 476185 516703 513048 501150 515393 529000 553340 489394 448525 462867 465556
18846 465556 511371 660431 748070 724953 749187 802266 775021 787701 735886 704204 663770
18835 663770 588638 550511 543331 516781 516079 559943 580212 541526 576343 604633 624361 701059
18823 701059 783406 805158 793620 856394 914996 917626 891877 891259 876378 866567 836168 839723
18811 839723 855681 904955 1060811 1117248 1240776 1312852 1374094 1462913 1605779 1740581 1828183
18800 1828183 1819257 1873802 1976656 2116721 2238507 2369709 2545845 2866596 3240447 3709567
18790 3709567 4425652 5381242 6544800 7661134 8300864 8092119 7450231 6956917 6800341
18781 6800341 6922205 7392936 8224492 9429411 11121345 13667573 17612504 23460566 31813397
18772 31813397 43110402 56731370 67211097 66779228 60197620 54068398 45500789 34992782
18764 34992782 26871512 21890086 19284306 18294198 18634688 20141836 22352761 24407881
18756 24407881 24543319 21648233 17355422 13788966 11268077 9488730 8313551 7524542
18748 7524542 6968385 6440486 6016936 5737042 5587351 5482926 5518936 5622584 5756588 5975809
18738 5975809 6349988 6908463 7656118 8653579 10062024 12100866 14893234 18558823 22970482
18729 22970482 27401425 29988776 29169933 26185213 23503129 22285707 22632786 24733540
18721 24733540 28975292 35905151 46383065 61234706 79928417 97017469 106575559
18714 106575559 108288448 96432589 73568446 52488109 38062153 28831579 22775132
18707 22775132 18727795 16025881 14170739 13090876 12607683 12667459 13354313 14581675 15885209
18698 15885209 16093167 14285729 11385657 8881207 7123715 5935611 5018800 4325327
18690 4325327 3825450 3521718 3252914 3104709 2961502 2822282 2808681 2807553 2745147 2656645
18680 2656645 2543149 2319819 2005430 1774498 1598346 1475053 1394825 1320618 1276056 1149713
18670 1149713 1104279 1138441 1146220 1096844 977428 848283 812995 703427 672784 747574 789575
18659 789575 843855 907800 914016 908119 923648 896262 867002 754516 612279 581665 522407
18648 522407 496530 504618 447766 447102 426021 390919 415002 406482 303825 297754 367395 422928
18636 422928 463817 454553 454468 421127 409984 459147 481613 464692 442743 399891 420507 482922
18624 482922 519341 542058 510651 473950 410789 395150 382675 312073 328834 383535 444277
18613 444277 484994 521823 544279 512023 536103 548546 551720 584853 636091 680443 743585 739418
18601 739418 701302 681571 699966 759948 755497 735874 723034 721289 734388 759498 753342 724488
18589 724488 687362 576940 577063 633230 659993 710297 754735 743533 732228 719695 776279 821040
18577 821040 861249 901031 899017 994595 1031652 1032012 1066101 1167512 1163496 1270374 1393539 1420161
18565 1420161 1428627 1449470 1481405 1572142 1744492 1924138 2135136 2479393 2849914 3254899
18555 3254899 3678483 4034817 4436958 4952263 5624629 6595350 8002604 10020691 12440461
18546 12440461 14616190 15198606 13993092 12574661 11815697 11802601 12454554 13682071 15460282
18537 15460282 18057329 21981652 27985101 36974410 50035479 67849248 89346690 107178618
18529 107178618 110099138 100194864 84639066 65583722 48810397 37527591 30594993
18522 30594993 26594471 24573249 24066852 24874808 26643323 28916442 30379958 28975039
18514 28975039 24492259 19360717 15312169 12455554 10554422 9242465 8343392 7745803
18506 7745803 7298440 6953698 6560839 6234588 5966107 5766735 5697351 5685766 5790454 5903705
18496 5903705 6195078 6677902 7427352 8578314 10271108 12607568 15713428 19371394 22802560
18487 22802560 24155033 22745927 20295911 18507274 18040201 18992054 21593696 26195067
18479 26195067 33268951 43091551 53852784 61076040 65125429 67883381 62148110 47173176
18471 47173176 32980132 23490116 17611020 13913214 11463289 9875456 8830538 8045288
18463 8045288 7515943 7236651 7186881 7371176 7793798 8130265 7944895 6832871 5446962
18454 5446962 4418963 3720090 3271400 2982396 2709973 2419469 2133007 1885698 1662000
18445 1662000 1507758 1419113 1331291 1207551 1091332 1024911 944719 934922 916410 824534 731930
18434 731930 669476 643768 625721 595763 578525 568873 494222 466871 500882 455422 400733 355150
18422 355150 313741 372075 393804 340187 296678 283470 324486 387270 336603 297703 267320
18411 267320 282460 253614 187790 187349 199909 142438 64648 -12008 -110107 -111156 -86074 -69291
18399 -69291 -20946 17441 58994 93012 117418 95578 81394 66914 47770 15894 -36772 -79350
18387 -79350 -60423 10257 93486 78017 -16200 -31418 -40656 -101906 -126834 -76763 -105735 -154150
18375 -154150 -87620 -53015 -23920 25719 40332 54683 71778 129427 123628 130321 154790 117947
18363 117947 101882 91979 98636 84759 129518 78087 31515 79897 110851 59734 68756 85077
18351 85077 65433 -38227 -96975 -111675 -118441 -93730 -83724 -35147 13424 18998 33930 43472
18339 43472 92496 124471 109260 131242 69149 -7571 94 27772 22813 28244 55508 53640
18327 53640 17515 -57753 -28432 1660 -3064 -12645 -90390 -119031 -67207 4789 45196 111474
18315 111474 96270 119063 137071 95767 43044 81116 107702 55553 -29888 -15900 10652
18304 10652 28682 89268 97185 34227 3704 53122 61171 43893 90608 84405 98134 126719
18292 126719 126737 101613 107240 87531 123803 134836 105871 42805 63253 91263 113433 121146
18280 121146 105783 101284 50618 57261 64163 42034 14024 27319 48132 69253 131139 164573
18268 164573 141301 107766 99467 123897 216493 241381 176911 90294 111495 112847 141564 208948
18256 208948 176892 187926 218019 214526 188872 183471 209707 227188 208423 217916 263227 219704
18244 219704 172247 197952 243500 154417 160677 189800 184905 229887 250581 266299 295525 342569
18232 342569 380251 407428 391117 507828 610591 678088 656424 553373 500236 405457 254858
18221 254858 215440 252831 272572 205011 126154 129201 152584 150168 159424 145034 170041 231379
18209 231379 235041 113951 34758 37697 100028 131525 95351 106699 88230 119008 135850 184829
18197 184829 207161 218515 242462 196853 142342 44420 -19053 -42417 -9671 111595 144969
18186 144969 135833 135435 159293 171610 127130 62265 24771 52488 44645 68130 138988 174865
18174 174865 169735 134412 65651 -462 -3239 1588 88592 130856 137678 165441 166695 150688
18162 150688 132352 32031 -20340 -53812 -40287 -44720 -43212 -30673 -13098 -21292 26153 53229
18150 53229 48637 -15304 -35090 1684 59643 67349 47279 44636 52826 46912 36292 52470 29461
18137 29461 20704 31681 35201 30175 -12067 -85631 -141075 -56422 3565 14958 -26832 -13946
18125 -13946 978 43894 137280 64874 21054 43973 69344 60919 31351 29116 49352 48344
18113 48344 58123 65556 37528 39008 66079 107939 158909 97665 54601 61967 49146 11368
18101 11368 -57485 -45613 6957 75965 140092 96226 78270 75981 14273 -28694 -4897 -27642
18089 -27642 -28862 157 5515 19963 42673 2900 -19552 13739 62312 33923 36437 74618
18077 74618 70746 43964 10934 39910 30974 71069 81166 53464 45177 3745 -4275 15421
18065 15421 -31518 -86796 -91759 23746 54967 9844 31729 59448 6234 26501 52028 16117
18053 16117 -18896 -24965 -56733 -43370 -18175 48675 24823 -14884 35080 51589 12523 -42697
18041 -42697 -53986 -3556 35758 73332 94436 69079 65613 22262 7559 24930 61693 9361
18029 9361 -14038 -12036 -26414 -10714 25059 22726 13009 36853 87287 90801 97293 111749 98703
18016 98703 81935 103887 168563 157079 146626 115420 114772 97526 84758 131114 169113 184188
18004 184188 199556 188099 205561 229593 281490 299618 234971 228500 243209 235254 234638 227609
17992 227609 175162 110263 95916 168432 208489 164921 97225 42204 18324 -18772 -25136 -16536
17980 -16536 28020 -1006 897 -5888 80029 73072 67464 147573 110865 79155 108805 183402
17968 183402 112511 466 -15680 -48702 15899 53921 78599 124858 134742 150038 188632
17957 188632 247265 282686 287582 290846 259564 251740 271702 296369 317047 274349 201837 137423
17945 137423 93688 112505 130439 150788 179714 194345 189812 205388 190258 223725 230135 171442
17933 171442 103600 88513 97583 83576 95029 70483 24813 6036 57489 47959 41890 50340
17921 50340 52895 46737 80475 135211 172969 157929 183738 186839 152435 151766 110874 158322 100458
17908 100458 35991 67117 47508 7570 62644 46384 41067 3707 43072 116077 88196 34728
17896 34728 5973 2734 21370 76688 91537 57382 2918 -38441 -20125 -5574 -3444 10014
17884 10014 -22871 -6770 50103 75172 80820 95542 51662 -39737 28918 113213 99478 104457
17872 104457 130020 110234 79366 21579 734 71346 86092 96529 54433 49710 61576 49603
17860 49603 53828 66700 70911 81929 94610 132394 151157 173707 239115 334022 305036 294693
17848 294693 291194 259754 209195 194487 149070 126573 180233 203004 144962 115434 138567 183021
17836 183021 176773 204678 185408 136995 171433 159094 121872 171516 239164 339180 450723
17825 450723 533595 513969 445873 438664 358580 300111 291166 280061 216646 167678 144251 153993
17813 153993 169815 140294 129405 121675 169749 204018 218105 199873 154986 126909 159569 148479
17801 148479 133184 172411 201929 163008 92491 94686 106797 102561 108574 209296 266715 290511
17789 290511 241433 188153 190934 177842 185969 253699 306082 266565 258491 272533 302684 273898
17777 273898 239275 217807 219561 268289 259640 222030 286602 408267 465513 456077 415898 406151
17765 406151 375779 339018 312713 336988 367256 335780 368262 433910 439624 449452 509792 529125
17753 529125 502454 523179 538683 512816 490849 515629 547497 596581 538087 536487 534640 541498
17741 541498 576758 628107 701120 734749 783989 832729 893362 901834 915185 983598 1090284
17730 1090284 1127959 1178829 1262028 1383006 1542467 1694902 1883351 2178756 2479485 2694529
17720 2694529 2767432 2779727 2828461 2983359 3235720 3555089 4031111 4647282 5321857 5992044
17710 5992044 6627330 7429662 8625047 10262993 12421655 15081199 18554996 23536341
17702 23536341 31039578 42281939 58443689 80219734 106499710 128541549 127208458
17695 127208458 100716967 70873896 49532586 35987326 27245528 21500947 17720374
17688 17720374 14977943 12795572 10948711 9375736 8062663 7133219 6383586 5791076
17680 5791076 5369868 5015819 4585651 4104780 3675643 3397484 3177082 2993442 2864746
17671 2864746 2675153 2387100 2129529 1928730 1837049 1736419 1544279 1318491 1233559 1204534
17661 1204534 1180869 1175831 1141110 1047111 959368 925637 850395 750964 718144 667944 619513
17650 619513 599936 597372 618378 609649 550778 516324 493172 441875 374417 331954 302170 313581
17638 313581 295460 248223 190872 169719 253461 283057 305592 267367 244796 257224 216345
17627 216345 190492 187384 164846 145817 149892 170709 164240 166498 191603 209150 167759 137669
17615 137669 142973 121426 163583 236253 247423 221581 145294 43294 17425 81087 127081
17604 127081 135641 133266 110804 71951 77190 71390 107343 143716 144634 97343 72088 91676 108531
17591 108531 121393 131215 138236 128141 142803 141961 198860 192056 149622 123831 114834 129814 140365
17578 140365 88028 37853 40888 74354 39294 37087 37011 -22972 -140872 -211487 -233060 -199356
17566 -199356 -151003 -106760 -109897 -91508 -34410 -26122 9904 -22619 -16360 7376 38184 30040
17554 30040 1465 -1234 6664 -24610 -48828 -47095 -57672 -85113 -28396 -46049 -84374 -67382
17542 -67382 -101314 -77637 -33724 6112 21914 88303 177294 155041 110538 120914 132790 167728
17530 167728 184967 147825 162873 170307 160118 132554 126241 88484 102627 115280 128061 169689
17518 169689 191921 163739 122545 121802 125749 136704 141382 174410 152823 136308 131798 138713 191044
17505 191044 140567 104484 102026 104019 181092 163223 128910 98640 123290 160555 162387 117500
17493 117500 77269 122270 159073 116803 165637 161665 122542 74135 45703 69370 78296 36867
17481 36867 32048 23884 22157 4432 -15849 -8576 5839 35725 89637 148020 149643 91961 119306
17468 119306 162126 123210 139450 137529 65067 71308 89617 58427 42907 90793 112665 164862
17456 164862 141076 96620 25185 45519 28833 12890 32539 36467 91092 18985 -39457 4427
17444 4427 73813 68187 56732 44825 39298 64609 114252 126151 96935 68119 59644 72730
17432 72730 113930 150339 160901 138427 143016 191301 127041 52344 44756 119602 192117 207698
17420 207698 150458 110473 115330 127392 131777 114948 80842 75671 44231 83103 106888 70808
17408 70808 51029 79554 125608 140490 150498 195824 237086 230309 167119 144355 224739 242130
17396 242130 276256 336791 336432 353802 341469 363066 328014 242342 216508 206743 174202 161684
17384 161684 193578 189755 180824 190885 227282 224591 223642 254293 195309 174967 198692 153926
17372 153926 133352 145920 179598 167583 113697 119731 210217 219847 145126 114036 127048 165095
17360 165095 168421 206178 234887 272145 281598 261607 262317 276775 316331 315803 297362 260111 202826
17347 202826 166954 190064 204998 254908 291949 274534 244904 284511 263042 246906 201629
17336 201629 201626 216751 169107 147776 159633 125150 154517 153953 181674 168364 195025 217934 230618
17323 230618 267255 234124 205022 223558 289806 251916 233034 259964 247063 188780 177790
17312 177790 303267 301784 279016 296529 251128 181364 176394 198861 214193 256186 250928 215226
17300 215226 206358 206459 257245 290955 269223 211076 189467 201921 283190 303468 265860 215745
17288 215745 227290 273984 300999 326838 331547 332730 331087 376364 473400 436422 351008 284566
17276 284566 319620 389128 434242 451222 478493 506935 469057 460661 426983 382883 428092 476968
17264 476968 549155 567043 594159 618756 607155 618141 621947 631869 659330 660239 634722 660440
17252 660440 673845 691545 688499 727473 749952 759446 777312 718199 711934 705076 756536 789974
17240 789974 826259 817244 841288 853619 880341 928667 931785 949310 1022441 1013763 1016888 982418
17228 982418 957502 939162 950163 925659 935655 942392 946719 921042 890789 896840 934565 1012956
17216 1012956 1021832 1031431 976835 945252 955092 975378 1053932 1187644 1235155 1237303 1194127 1130011
17204 1130011 1187299 1267966 1288848 1311926 1374295 1359374 1323540 1293570 1352868 1428896 1448294
17193 1448294 1456700 1488731 1529033 1564018 1597118 1710317 1745551 1724973 1828617 1925011 1907244
17182 1907244 1906829 1973015 2050882 2115639 2153417 2200652 2279046 2362925 2452196 2532811 2590116 2656459
17170 2656459 2775624 2902436 2960674 3067396 3242176 3482496 3661220 3761920 3928858 4090857
17160 4090857 4161317 4196987 4306878 4412134 4532702 4660972 4788947 4949666 5184526 5475664
17150 5475664 5727138 5936191 6187222 6411443 6663360 6960101 7288955 7632704 8040613
17141 8040613 8587907 9116770 9629415 10241686 10792213 11415083 12105210 12878084 13732653
17132 13732653 14590323 15600653 16753617 17900629 19134457 20430577 21944926 23668023
17124 23668023 25432726 27361916 29503793 31802552 34249043 36904194 39629807 42461060
17116 42461060 45360701 48252463 50939413 53508728 55721976 57407322 58483642 58938276
17108 58938276 58806770 57929752 56429952 54472125 52104333 49493322 46730191 43919249
17100 43919249 41136589 38467130 35910734 33477258 31228573 29113816 27145204 25360851
17092 25360851 23684495 22217044 20931949 19650361 18468263 17345801 16360552 15412621
17084 15412621 14450687 13589806 12826594 12047675 11337950 10715006 10074360 9454730 8951447
17075 8951447 8554725 8128322 7726166 7343667 6946560 6576225 6246372 5933281 5692762
17066 5692762 5504071 5212584 4964538 4755378 4569176 4413603 4225521 4021238 3855879
17057 3855879 3722432 3521947 3369955 3263609 3181633 3051992 2867365 2747897 2703738 2600005
17047 2600005 2472925 2402166 2340182 2295119 2237491 2191768 2112191 2031075 2006050 1989410 1878812
17036 1878812 1856121 1810872 1730434 1651039 1581501 1511341 1434732 1413264 1454530 1450720 1432800
17025 1432800 1436805 1400765 1286564 1181657 1149378 1150950 1185768 1152306 1090986 1029369 1048615
17014 1048615 1033249 1001230 975870 940511 905674 878822 862794 883487 862468 842519 845841
17003 845841 812252 750077 719328 709884 725542 730421 707001 707726 670755 667251 649976 628003
16991 628003 614822 548519 516759 475586 461674 465062 457108 459477 467345 466776 391189 306077 289649
16978 289649 356257 366921 408447 386016 338803 346338 363368 314162 319304 247502 187976 244720
16966 244720 312062 269918 237994 238989 214100 202576 209355 201502 197570 268747 309743 308596 338655
16953 338655 337965 326019 289442 276457 279599 300783 295237 278441 295394 299867 298526 322101 321340
16940 321340 347148 376718 374923 352292 316973 239767 244700 280422 273846 295097 293684 332601
16928 332601 348811 307342 257237 250516 267955 253089 266142 298368 323849 291830 257196 234780
16916 234780 263430 249415 257711 227868 227083 249202 242522 251191 249121 197829 204340 241448 286583
16903 286583 242722 215564 230453 207684 221598 224468 223954 239721 222017 147636 124415 100650
16891 100650 87985 98096 99577 112385 110391 118976 114420 65522 27716 79366 141904 185287
16879 185287 192623 200679 211366 198075 173990 140382 158450 199248 170740 114938 132444 124426
16867 124426 171596 189613 219058 243518 189241 134928 105323 81743 95762 94452 136012 160274
16855 160274 187562 222081 229613 227565 199028 204431 219804 228769 230301 246565 190828 79981
16843 79981 127205 192079 195901 166059 178909 181097 162179 143259 182554 201154 161597 165142
16831 165142 216647 270301 225663 183261 241687 280774 280154 336138 312974 318718 336246 288636
16819 288636 215438 189415 182772 165926 166609 176041 167358 90144 60427 46181 72176 116967
16807 116967 100617 94858 131192 142511 146182 128451 136127 144064 104963 84603 95301 111007
16795 111007 157675 88688 22273 13550 51904 62666 110351 40252 26272 -6763 -15717 59877
16783 59877 123710 136092 97862 63632 51180 62579 30236 39095 51557 21513 1228 60405
16771 60405 97449 101620 81523 69097 89239 88673 121271 136542 96110 90409 93652 103540 124804
16758 124804 103411 109266 157676 140802 101625 88111 66548 83378 116754 116687 82588 59388
16746 59388 51904 7427 3530 15423 -24007 10716 -2377 23056 69405 74262 47103 44172
16734 44172 65335 13167 -28433 -5725 8791 28080 44638 94607 42873 -529 39922 21422
16722 21422 -24362 -55426 -19114 6988 6522 58690 65282 65534 53826 49296 74859 54678 47496
16709 47496 -16509 -17041 24412 46542 -6596 3 -14165 26187 29463 -6418 -31717 -73713
16697 -73713 -41096 25135 22149 -4202 -13042 -32076 -34848 -6359 4526 -14141 32779 59451
16685 59451 48629 46506 8250 -27090 10939 -25629 -5590 54001 64980 33984 -9997 -28915
16673 -28915 7391 87096 95944 40922 16385 55697 73703 47305 105414 118473 134360 122828
16661 122828 86139 68185 89723 150762 89699 18152 88618 143637 102438 28537 -39704
16650 -39704 -14372 54662 34798 29022 594 -44843 -49176 -46174 -31909 -29414 -54988 -6029
16638 -6029 7673 -31002 -13265 30069 41622 62506 47644 -10344 -6806 -43784 -80091 -8184
16626 -8184 17131 5911 -7577 -36140 -43025 -56930 -24294 -33967 45961 72433 95454 14603
16614 14603 -840 -5327 -19587 556 52714 77397 104723 71250 46535 -13668 -87189 -83125
16602 -83125 -32954 -688 54570 48717 75007 78109 10485 1905 28373 -736 -33746 -82066
16590 -82066 -62198 15205 10263 31599 50974 3531 -46045 10342 37577 88121 109019 57781
16578 57781 42298 18689 -9257 -23315 3200 -3434 23664 17139 -59482 -66277 -58390 -31707
16566 -31707 16352 14470 39338 31741 11260 30128 28602 67892 68276 23679 -7838 -43225 -47328
16553 -47328 -40970 -54189 -87899 -79104 -32268 -53647 -61945 -25667 41617 11156 -21154 -61442
16541 -61442 -110269 -144235 -114187 -18330 1911 -2016 4120 240 -126 38693 30656 40594 -22099
16528 -22099 -55035 -46762 -55364 -18744 28427 -29029 8144 19794 -15590 -25982 -59447 -34088
16516 -34088 13336 54557 53436 16804 -34691 -24853 20863 32401 9948 39915 59520 59322
16504 59322 11745 -13773 -44193 -18262 13970 -15207 578 812 -30186 -24880 27937 45184
16492 45184 15630 17630 40454 -18839 -81005 -67003 -57502 7142 49710 -83920 -91064 -8465
16480 -8465 28717 9149 -16666 12791 14125 39002 -36621 -79368 -38030 3883 -38178 -70050
16468 -70050 -86904 -52345 -11491 -40836 -69923 -72135 -55971 -103073 -102012 -91569 -59826 -88350
16456 -88350 -160795 -138970 -15304 -39824 -47373 -8867 16521 -35023 -28804 -74043 -59686 9788
16444 9788 30269 46856 28692 2282 -4338 33073 26462 4431 49044 26343 -17888 -77657
16432 -77657 -135601 -95758 -82783 -65621 -90444 -43047 27011 25056 26140 25383 38009 27585
16420 27585 3464 -37259 -28379 40309 83504 99185 104098 76802 42320 29970 29981 16997 79895
16407 79895 138129 99655 59757 89284 73558 39138 57993 83831 65942 33647 32375 -12344
16395 -12344 -27509 -12754 8598 27145 33715 69582 48761 -16723 -58533 -65716 -46965 -43453
16383 -43453 -65741 -101754 -106308 -81191 -75149 -71747 -22785 22399 22501 35690 -25507 19467 74757
16370 74757 47403 -12007 -19178 -37482 -67707 -62962 -86025 -45378 -6234 -58574 -88247 -45272
16358 -45272 -23183 -58176 -77879 -81515 -47376 10447 49016 82798 101690 -1602 -119348
16347 -119348 -109107 -52996 12961 61006 -9315 -13449 42202 20882 -37598 -43783 37901 -30031
16335 -30031 -84567 -65248 -37909 -45979 -37097 -101991 -132932 -69066 -31860 12437 14263 -20564
16323 -20564 -11430 -71143 -56782 -22585 -20966 -44208 -14018 12814 39369 -7775 -104175 -128279
16311 -128279 -82647 -67839 -78535 -75981 -76146 -58115 -45382 -32840 -54544 -93040 -100020 -88953
16299 -88953 -89600 -86291 -73707 -36572 -36247 -61842 -59291 -71453 -67721 -28216 -7045 25507 36904
16286 36904 21978 35692 48990 -16978 11951 -12122 -51920 -37621 -20249 -25750 7394 48317
16274 48317 107354 110744 12655 -6039 -4718 -49407 -51485 -38142 -97936 -189126 -126837 -103982
16262 -103982 -103558 -78301 -61918 -18328 38021 54718 31835 4281 -8820 8003 18528 53168
16250 53168 44003 -14736 -63986 -72285 -2953 19945 19539 44476 4612 12544 33939 68514 25173
16237 25173 -11365 -37127 1478 9907 -16358 -71190 -28510 42554 55705 27077 30403 12844
16225 12844 -21728 -52384 -111798 -75929 -77181 -48003 -38592 -69080 -117528 -137599 -124949 -96032
16213 -96032 -69068 -57951 5139 3688 -34866 -33732 -63734 -78934 -124893 -68400 -23336 -32431
16201 -32431 -60352 -37390 -52385 2051 -42400 -27916 -5906 -47662 -26252 15397 14036 -9258
16189 -9258 -72047 -72934 -74019 -96330 -105100 -94498 -113654 -93371 -37270 -43722 -46118 -23733 -14455
16176 -14455 6873 16708 -27870 -47235 486 13604 -11670 -81525 -84744 -65387 6745 28851
16164 28851 11467 25661 16508 -12439 -24113 -60292 -65440 -36318 -53335 -44249 -80905 -46623
16152 -46623 26137 14901 -20971 33589 51228 -14795 -52712 -77306 -89455 -39367 -23985 -23285
16140 -23285 -9895 67335 81503 40701 34065 38384 -14398 -21838 11632 1872 -22955 -29566 -5557
16127 -5557 -38120 739 -21780 -52445 6068 -12424 -86139 -127488 -146084 -82464 -55264 -73425
16115 -73425 -39556 -18992 49875 36286 -42528 -3687 14491 15550 -50006 -163322 -148542 -92131
16103 -92131 -93162 -69312 -92911 -111370 -97499 -44708 -3358 9734 -28797 1775 51570 58465
16091 58465 37218 6514 31127 53608 94658 79165 31749 -5457 -30962 -92038 -70235 -4164
16079 -4164 52905 67227 89036 48776 -80223 -171555 -136438 -96603 -86483 -55389 -11142 47975
16067 47975 79445 74685 83721 69786 65254 31234 69999 57239 5257 -23047 795 46914
16055 46914 85243 103254 73275 -1301 2769 8724 31138 22543 -39934 -54595 -61647 -50066
16043 -50066 -35259 3591 -5445 -15850 44264 43063 -34294 -61867 -23666 27006 10598 -87909
16031 -87909 -81482 -22413 28981 29955 -68128 -141048 -110364 -68910 -53474 -62215 -14432 -20566 18663
16018 18663 45308 1983 -31597 -87401 -91926 -37339 -4092 57352 48980 -5719 -44710 -63203
16006 -63203 -129620 -201828 -171117 -95446 -15266 16099 31302 18964 -36160 3850 -59280 -86692
15994 -86692 -94228 -70474 -30535 -21116 -7009 10175 2609 -14626 -32470 -69394 -60401 -92819
15982 -92819 -65249 -25629 -53425 -81981 -74669 -28071 3003 -45552 -64029 -10031 -27185 -78817
15970 -78817 -116827 -91481 -6604 26299 38426 28676 14946 20526 44246 68698 38497 33049
15958 33049 30853 32627 21613 7068 -33695 -51836 -68234 -75951 -87168 -43904 -25821 -40023
15946 -40023 -14432 -54765 -128371 -146475 -131010 -93960 -90308 -138416 -152697 -164230 -115135 -75452
15934 -75452 -81532 -65512 -31023 -5194 31037 -19597 -43099 -34321 -57007 -112373 -54441 -15842
15922 -15842 -12291 -12362 43205 49074 19479 49937 42575 27445 25449 23481 -32267 -27083 -16918
15909 -16918 -56423 -79176 -73523 -40458 -9686 15963 47750 46392 16683 -2603 -18118 492
15897 492 -3840 -65953 -50986 22720 -41387 154 54176 30986 48673 56025 43599 15292
15885 15292 95110 122844 96532 109352 49350 -8516 -23816 47268 13612 -41539 -82757 -74120
15873 -74120 -58015 -20650 31878 98403 84709 57309 34199 39593 -26009 -47407 24603 64677
15861 64677 56861 285 -29406 -43634 2894 39665 16158 -30541 -36551 -8944 -7554 -4616
15849 -4616 -9846 -7935 7296 22355 12557 18897 11435 5804 2438 25628 99722 43417 -27024
15836 -27024 -34451 -12011 25891 -5524 -33866 -30309 -77569 -80150 -13178 43704 48427 47250 33092
15823 33092 -7618 -90756 -92603 -64474 -30666 -6292 -1344 1360 -23277 -24802 -17740 -65748 -50708
15810 -50708 -2209 -6801 -32901 -39410 -27270 13783 -8329 -17250 9440 5607 -1541 -19502 -101344
15797 -101344 -103663 -101869 -123011 -91659 -81478 -83724 -103780 -84834 -19138 -27244 -43280 -30088
15785 -30088 -45236 -9859 -12421 -39941 -62394 -2489 -37338 -87124 -94074 -31666 -15128 10359
15773 10359 4384 69408 98002 77670 72427 114843 102066 55507 5689 45657 42428 18244
15761 18244 46793 65065 97946 71091 57633 113565 68549 4888 41028 63028 137478 208952
15749 208952 231548 288134 433822 592539 814863 1102458 1006059 628014 308301 157539
15739 157539 92667 117104 167675 121565 13260 -41549 874 -5955 36009 32371 55757 32122
15727 32122 66133 102436 67842 52136 63339 82031 49285 40262 2783 -64117 -38482 -71191
15715 -71191 -85905 -73350 17506 41864 19748 -4405 -48169 -48640 27525 -2594 -19554 34633
15703 34633 34388 28121 55518 41529 56177 60763 51769 646 -48327 -17378 -32859 -56842 124
15690 124 -10531 -4987 27691 21981 -15756 -6917 -36822 -118395 -166045 -155320 -120880 -164705 -154877
15677 -154877 -135377 -108005 -3642 62561 104951 127376 104011 49530 10707 3226 25504
15666 25504 30119 14914 -2558 38566 69546 68110 59961 25884 -49534 -88776 -29077 3737
15654 3737 -5821 -13437 -67728 -111215 -96420 -84819 -44566 -1229 14940 36550 2099 -29628
15642 -29628 -24970 -34357 -90114 -72574 -82098 -90526 -102099 -21231 -44974 -52483 -50109 -62450 -92375
15629 -92375 -17709 -1784 -22374 -14587 -31906 -40371 -50766 -72844 -56817 -85334 -46182 -45379
15617 -45379 -6911 -1761 -62382 -59476 -3459 40110 22612 -25506 -57695 -13060 -19533 7065
15605 7065 -7613 -57035 -50899 -108357 -100470 -26473 8217 -50195 -101842 -143238 -116865 -102593
15593 -102593 -69657 -54539 -12848 -34809 -30309 -31539 -14351 80863 88175 64902 47869 13105
15581 13105 -30615 -63098 -65465 -454 14517 -19152 -9429 -18753 -24991 -30335 -34035 -4181 16489
15568 16489 26347 -2056 17607 72135 83250 64000 22709 -18625 25596 66068 133891 116263
15556 116263 129509 162868 97164 19141 -11755 -9873 -630 49498 11115 -43858 -38733 -80884
15544 -80884 -70060 -8941 57857 33046 -22506 -65388 -43781 -46949 -46790 9580 50536 26955
15532 26955 -61818 -117788 -64424 -13530 21582 8336 -28249 -55764 -36014 -22389 -46383 -29345
15520 -29345 -48090 -5171 51911 37024 15173 18106 14859 -17991 -8391 42168 82893 22135
15508 22135 -58224 -68077 -48074 -61491 -39442 11703 30412 -4668 -8907 54819 48773 34522
15496 34522 18699 -24373 -84681 -85942 -5641 -29921 -33963 -29913 -32198 -13319 10377 -6045
15484 -6045 -38889 -54520 -84812 -86750 -78155 -65081 -99793 -62484 -35626 45797 52332 8509
15472 8509 27931 751 -70901 -68767 -38426 -47697 -128144 -80919 -10798 12614 -7590 -38460
15460 -38460 -49767 -54475 -53327 -64111 -51673 -44859 -49266 -66629 -83582 -52402 -25529 2972
15448 2972 -30285 -68634 -24367 -5417 42892 107067 99757 69443 54423 10434 -35170 -30117
15436 -30117 19334 7372 -38603 -7122 -18495 -40695 -48225 -14107 4800 -20407 -73689 -105911
15424 -105911 -108665 -65194 -17819 -45524 -46833 -45225 -81974 -105790 -127980 -109759 -88285 -70871
15412 -70871 -74821 -45554 -45564 -43002 -46630 -50941 -48848 -40903 -50477 -53361 -21680 14005 15309 -52043
15398 -52043 -94764 -84735 -118379 -121683 -141454 -142600 -101671 -37781 16121 -27224 -34819 -51831
15386 -51831 -27032 -18666 -21318 -26272 -89130 -79019 -54827 -65160 -93544 -109683 -49680 -35961
15374 -35961 -6412 -3957 11214 -6115 -86365 -74658 -39967 -23330 12571 -35042 -31955 -47785
15362 -47785 -27942 -45066 -1754 5867 -17252 776 -16769 -55214 -59859 -49639 -11367 -82879
15350 -82879 -71159 2497 31184 41525 -8379 -34524 -63526 -59673 -33796 10336 74887 95623
15338 95623 59368 73461 91788 75300 39521 5924 -70543 -100989 -120789 -140696 -99886 -63614
15326 -63614 -82165 -28238 -9214 -10599 2566 -16446 -89452 -12547 44019 74923 104560 75111
15314 75111 42605 90098 125303 57082 -6128 11021 34348 8787 -50389 -31734 44643 -6508
15302 -6508 -79518 -73823 -8683 39654 34563 -18581 -30731 -61041 -66812 -3931 38888 10402
15290 10402 6483 43683 18248 3295 -13213 -61295 -98865 -80933 -20405 13531 -56629 -118503
15278 -118503 -56004 -8013 -19619 -49814 -18353 -22829 -25079 -4606 -1796 -37971 -14068 -46113
15266 -46113 -50334 22587 50769 18799 33698 -23402 -44430 -77026 -101095 -33921 38190 33461
15254 33461 77970 116290 48506 -17431 -30845 13127 26277 -50732 -59297 -22135 -9786 1852
15242 1852 -56463 -98567 -123161 -74267 -19960 11953 -2837 7580 5168 15350 74036 59457
15230 59457 -1249 -46570 -80228 -78562 -29889 -43802 -77600 -60858 -69027 -15734 -27680 -61605
15218 -61605 -112794 -68729 8650 2719 -11785 8579 -13508 26294 66073 100643 99448 87386
15206 87386 59939 3473 -34877 -72807 -97776 -35023 -859 -57471 -75765 -25234 -6425 -59512
15194 -59512 -61248 2873 81235 79678 58400 48732 -32876 -75023 -87364 -158728 -137652 -95365
15182 -95365 -99335 -105616 -153470 -138206 -96872 -107199 -101202 -55384 -36101 -92692 -107920 -93864
15170 -93864 -82224 -82307 -23193 -8377 -1835 -22328 -37814 -78610 -50208 -2139 45425 25678
15158 25678 -2139 -66043 -35571 2556 47648 57852 21906 -11783 13471 -7032 -13969 6432
15146 6432 -10810 -45055 -4182 15417 -19631 -55250 -94249 -119493 -83030 -43058 -53026 -48117
15134 -48117 -51188 -37443 2445 -1174 -34740 4125 49270 44068 -8755 -28468 -25286 -48656
15122 -48656 -44040 -67919 -19008 -50185 -44110 -22657 42119 50518 16932 30958 83576 9079
15110 9079 -18055 35270 6918 -11317 -45481 -5976 20409 -37060 -83629 -87417 -110719 -50793
15098 -50793 -8145 -46692 6813 12976 12800 42594 -21288 -58680 -98153 -84412 -47330 -30757
15086 -30757 -42199 -78917 -98292 -74004 -67465 -82343 -103679 -35281 -44928 -39566 -1198 -42989
15074 -42989 -54669 -55612 -57021 -59109 -97657 -85090 -12756 49310 36393 25250 29515 65679 74432
15061 74432 73912 40680 5634 -3187 16682 74486 84002 79317 81621 51795 14932 -57378 -73092
15048 -73092 -91222 -64081 -20658 12384 31616 -6439 -69109 -113782 -105744 -55298 -43015 -16757
15036 -16757 7988 43906 32197 43640 52697 64741 97304 60182 -21739 -15874 -54952 -85522
15024 -85522 -58494 -50300 -53260 -21199 7715 -6819 52047 12056 -72640 -55700 -13826 -36959
15012 -36959 -19369 419 -4101 14581 -4781 3250 54630 39136 -29811 -20114 32626 81962
15000 81962 34313 -31840 -91839 -79884 -83461 5782 27010 -22321 -28360 -27301 31558 25200
14988 25200 -12825 -23175 26344 -11158 -84818 -38995 -24197 -9688 -11901 -28602 35243 55078
14976 55078 60357 5215 -22060 -24610 -21676 -34430 -52829 -82999 -15249 16959 14306 37256
14964 37256 9518 20294 45040 15079 43521 49621 -65680 -112319 -107343 -100501 -108238 -98856
14952 -98856 -104626 -70676 21397 157255 165634 86754 54500 98093 68056 32438 21781 79859
14940 79859 65620 37459 7109 -31110 -75477 -88625 -70780 -100086 -82844 -88287 -108820 -112898
14928 -112898 -72972 -5704 19189 13611 -44907 -26366 -26503 17545 22622 -8164 -13431 -11340 -10669
14915 -10669 12529 19043 -22549 -38101 -10670 -39714 -80193 -126894 -82614 -11247 54048 96103
14903 96103 11327 -34992 -13559 56823 42172 1130 -48556 -83765 -110636 -177799 -159924 -96868
14891 -96868 -63272 -22981 18878 22757 -7055 35804 53239 30365 27814 -8391 -14955 -38636
14879 -38636 -38421 -28208 -49234 -91511 -127338 -124413 -84495 -51110 -82796 -91058 -132769 -119657
14867 -119657 -65535 -29648 -61289 -79561 -44233 -14009 -14012 -19300 -13167 -59139 -6007 11901 36454
14854 36454 43011 10972 -33338 -62668 -61613 -32438 -28126 22173 21021 -11824 -49695 -82773
14842 -82773 -85326 -12354 39521 17932 -7581 5842 -6317 2537 -17119 -51248 -45244 -69764
14830 -69764 -50602 -87926 -43847 -20342 676 -22285 -55930 -41578 -51753 -55831 -90877 -108119
14818 -108119 -74005 -31391 22571 57020 25339 11149 -3374 -11239 -4543 -12028 9622 7666
14806 7666 -31923 -3025 -1752 1301 -7921 32049 71754 71288 28602 14123 31483 -557 3621
14793 3621 20032 -4141 -43326 -41713 -29434 -42729 -20940 5382 40859 -15823 -37628 -13173
14781 -13173 -5816 -41019 -73178 -50564 32172 105088 131104 109698 42385 -28754 -55546 -66838
14769 -66838 -123807 -124402 -157135 -182979 -162541 -102637 -43712 -32410 -92933 -166898 -177225 -119623
14757 -119623 -123360 -125191 -20599 9613 33494 23105 56550 52186 97501 151169 167347 147092
14745 147092 79462 35306 25826 18142 -15480 20056 20839 36325 45701 34415 47500 43650 6897
14732 6897 21484 49178 21421 52265 104081 89895 46396 15735 23736 22212 11867 -9398
14720 -9398 11197 26063 66164 29431 -51776 -100599 -136249 -106472 -79763 -60350 -15214 -22745
14708 -22745 -5784 6007 -35614 -45707 -46265 -49139 -48001 -36294 -36825 -12856 -37462 -57227 -97685
14695 -97685 -91018 -58221 -59429 -37841 8825 93429 136312 121893 71716 -12495 -85310 -101290
14683 -101290 -38310 -8557 -25197 -6281 -27362 -49330 3635 24153 4960 -92216 -63473
14672 -63473 -21029 6005 12601 24128 16047 -16698 -10040 -13870 54202 75156 82350 72536 87426
14659 87426 42004 4916 35915 17248 -10171 -10419 -25306 -53594 -48948 -15782 -13369 -17779 27198
14646 27198 -7832 -23125 8022 -2677 9549 -38732 -19797 -1526 -14670 -20545 -25397 -12828
14634 -12828 -947 43278 32709 42224 16072 6889 -58753 -76617 -85509 -48773 -10346 2396
14622 2396 -56346 -54739 -77941 -80069 -58305 17191 53787 63923 8349 16965 46442 39449 56772
14609 56772 64049 -11323 -47118 -6767 11649 -11074 -1512 -8060 -34438 -87739 -116363 -86672
14597 -86672 -19789 -14753 -820 -22161 -93303 -92070 -65053 -63680 -72287 -86606 -123219 -116316 -56637
14584 -56637 -4095 -15324 -2502 -13138 -68471 -123578 -127977 -73827 -57112 -65264 -40259 14124
14572 14124 735 -7445 1551 1811 -53446 -42256 -33720 -67867 1329 -575 -70448 -48288 -56002
14559 -56002 -32452 -40747 -59046 -99839 -84356 -56485 -12408 8617 16142 -9362 -25208 7091
14547 7091 48578 73417 46551 60252 73937 -15696 -76320 -53752 -87910 -69971 42655 42807
14535 42807 6361 -16285 -1979 -30569 -413 46521 63927 85992 58305 -6335 -55383 -10595
14523 -10595 30207 29851 40838 -9918 -33826 -43449 -81941 -137540 -134028 -106928 -60901 -10421
14511 -10421 24923 16010 -24076 -15160 -64166 -39966 11468 -57755 -121210 -57923 32280 37270
14499 37270 1162 4193 -58672 -70522 -43051 -34056 -77947 -49597 43538 37186 47937 30354
14487 30354 -23749 -28563 12012 18544 -38710 -46334 -52098 -42825 -62648 -89197 -101690 -90600 -80968
14474 -80968 -89872 -103193 -42740 13679 -13627 -84749 -111310 -118961 -94799 -68883 -88229 -68019
14462 -68019 -10639 -59890 -85561 -42039 40035 77079 9838 -57258 -53031 -74797 -115776 -53724
14450 -53724 -18708 -5930 8452 -16449 41883 67378 60012 45191 60483 50328 -64081 -118226
14438 -118226 -68363 -72852 -45603 -1665 46157 72589 119787 54498 44625 20767 15361 23176
14426 23176 67336 57257 30139 5815 14701 4332 -6703 17952 9008 4336 49419 40575
14414 40575 -66544 -93323 -69288 -67132 -75451 -13022 24993 15586 -1261 -48840 -67889 -54873
14402 -54873 -24368 -37125 -50218 -13512 -28079 -17490 -5839 -4985 -17867 25609 83799 70399
14390 70399 -1148 18995 100300 100387 75645 7921 -40268 -62144 -44547 12552 -17219 -58174
14378 -58174 -17043 28711 -31914 -59426 -45046 -60572 -65581 -40254 -41488 -49336 -58260 -38746
14366 -38746 -6581 17508 -32459 -19772 31463 49495 82560 80904 2619 -34674 -26284 -52490
14354 -52490 -52799 -16818 -4982 -35222 -31984 11297 -19130 -50557 -43345 -42677 -49903 -94397 -84304
14341 -84304 -32469 85376 107675 15542 3079 -29818 1492 -3812 -30470 8608 6917 -35850
14329 -35850 -23493 23322 46513 102261 71029 11559 3241 63603 70436 24292 24383 -11431 4922
14316 4922 17242 -18868 -11161 3823 -14346 -33985 -63384 -58677 -62282 -58492 1758 -5575 -4891
14303 -4891 11564 9754 20 -25566 -17078 -11777 7297 -26527 -61999 -101745 -173050 -134208 -29261
14290 -29261 -2208 -78926 -142445 -145334 -89271 -12602 8326 -9838 -4768 53006 2745 -34170
14278 -34170 -69927 -72569 -53291 -61378 -104318 -119620 -68155 -12639 33912 63927 43472 13886
14266 13886 35159 39737 12744 -62709 -72769 -83654 -65739 -40472 -13204 21798 -22356 -9111
14254 -9111 -25194 419 61680 47151 -4993 -30445 21944 92617 64275 34432 20652 36580
14242 36580 66859 66848 42354 -36098 -99609 4854 42412 39645 86116 105288 40020 -28944
14230 -28944 -25643 -5289 -6352 75576 83147 29622 15822 42917 55780 62604 61078 26511 -10789
14217 -10789 -4699 87805 82461 22501 -5355 4179 -4530 13316 79784 101582 35718 -39368
14205 -39368 -97540 -62677 -38614 5167 21633 47288 52726 67932 41519 -8186 -52254 -7892
14193 -7892 4447 -30339 -76483 -73206 -28366 15344 16469 -11492 11770 66327 108991 73653
14181 73653 6083 -5596 -20710 -51940 -26377 -13284 -7716 -32770 -43516 -49255 -22196 9227
14169 9227 81522 69245 25933 -23678 -60847 -59711 -58421 -55504 -67376 -65178 -26488 26618 68126
14156 68126 72136 15182 -46178 -50847 29558 33719 3153 2941 12315 1171 19209 44638 -13651
14143 -13651 -78845 -54331 -47712 -319 13362 -8339 -21637 -45198 -25604 -12666 -12487 -11756 -25078
14130 -25078 -13637 40585 21950 22180 4085 -7750 1072 23633 31450 26217 28118 15940 -13354
14117 -13354 -5091 10389 29944 -5658 -44699 -59902 -33017 1425 30430 37227 -5071 -39201
14105 -39201 -79184 -81348 -48809 -36861 20637 68650 34819 19430 -18238 35272 47300 29942
14093 29942 80632 58176 50584 5429 -17070 -44688 -938 17845 19420 25366 37374 35737
14081 35737 48361 26924 -25147 -28240 17544 41336 25583 -4847 -25219 -6159 4365 -24770
14069 -24770 -79058 -92838 -67580 -18916 -27027 -22199 -68355 -124449 -120159 -133450 -54965 -47193
14057 -47193 -22891 -33173 -87043 -152348 -128301 -103961 -51834 -2939 4894 -8567 11463 54999
14045 54999 47872 52925 10040 -26154 -69352 -55760 -46747 -10058 23199 -11344 -8161 12481
14033 12481 -8710 -82204 -75147 -100791 -78267 -75095 -64030 -24702 4233 -1631 -9205 -2845 37851
14020 37851 17044 -50927 -94803 -93292 -47225 -6757 -104217 -90753 -73298 -79057 -52693 -5060
14008 -5060 48389 71251 48144 20398 27037 -41496 -71366 -65650 -17406 -69603 -66482 -29963
13996 -29963 -29645 -14895 -29321 -19647 35513 33719 22191 31997 52589 44029 -41161 -83294 -48423
13983 -48423 17403 71853 50187 13103 21882 15941 -10329 -35262 -73295 -45146 6387 25487
13971 25487 38222 9079 42154 101782 55670 34475 13377 41637 95617 95124 53652 -31697
13959 -31697 -50273 23680 51981 4802 -102893 -122589 -100760 -67750 -62045 -80821 -42640 -53890
13947 -53890 -58501 -31266 -10777 -98483 -88347 -43321 31457 94997 47019 -19750 -98652 -150259
13935 -150259 -102788 -103863 -58684 23130 101846 116534 137020 111154 103601 74919 80256 123283
13923 123283 68051 73892 10998 -46336 -80573 -106613 -119817 -98183 -20024 38448 45526 28258
13911 28258 23143 -26443 -51926 -62268 -50691 -37631 -2014 34239 41213 9185 -28443 -25126
13899 -25126 3403 99516 75432 16238 -5379 -22115 -51607 -38825 -4976 10076 -605 23067
13887 23067 -21215 -88246 -110782 -112284 -85745 -62283 -67277 -68532 -93956 -122502 -151772 -130389
13875 -130389 -106186 -78604 -45477 15379 36624 66980 29014 25370 -23371 -75555 -51820 -40314
13863 -40314 -57936 -41722 -24478 -34879 -25342 -29096 -22532 -40301 -43879 38895 63896 55884 37684
13850 37684 -2464 25753 -35314 -100862 -104767 -99896 -104388 -68693 -26 19873 -7147 -7805 4736
13837 4736 68446 -4055 -62716 -86593 -99034 -75671 -111170 -120628 -122042 -78024 -35644 -48121
13825 -48121 1245 18640 20697 10548 -19335 8056 44442 15553 -16240 7669 21903 18900
13813 18900 -22012 -72446 -152390 -106250 -43165 -49148 -3803 16276 -20676 -28454 9139 33827
13801 33827 995 29153 6835 -20877 -12333 -43449 -56992 -26982 -17058 -53675 -48111 -1612
13789 -1612 36711 -9211 -67317 -66610 -49955 -21660 -5110 23773 -2853 32650 68234 66625
13777 66625 25713 -6080 -68903 -44397 -46875 -37438 -61673 -41486 -41912 -39830 -90901 -111893 -150394
13764 -150394 -145488 -131475 -136557 -81808 -73707 -1764 50690 48508 30897 -12875 -25743 -38459
13752 -38459 -79467 -96600 -136298 -86062 -21676 11030 8394 -14259 2851 -23211 -6019 8858
13740 8858 -9075 -6024 -34280 -65588 -61242 -53455 -76343 -88210 -42662 26103 16589 -40501 -97023
13727 -97023 -100492 -75495 -83471 -118634 -130893 -170911 -99184 -93912 -56930 -9310 -19768 -57
13715 -57 34434 -4470 -37557 -28702 19424 10231 11668 18901 25329 27404 107132 141350 92674
13702 92674 1519 -48608 -87726 -69378 -35780 -45233 -81777 -11430 14414 1989 12144 -3565
13690 -3565 -15926 -6874 -18590 -42122 10499 9618 -71770 4538 17975 -7503 -28786 -46202
13678 -46202 -20286 30657 -17047 -53215 -35184 -42688 -18579 10104 5026 -25425 -68529 -98415
13666 -98415 -110852 -81913 -35311 -10265 -11585 27399 44794 17143 33586 12543 29880 -8656
13654 -8656 31288 64051 18016 13503 16262 -43780 -67944 -63653 -19218 -29734 -85422 -56492
13642 -56492 -22660 -453 10850 51663 64886 2519 -37100 -6417 15475 6005 -30639 -19268
13630 -19268 -73285 -54830 -25983 -20580 -39425 -8 4743 -3292 -31664 -92625 -69851 -39177
13618 -39177 -38116 -25907 -14435 -16803 -10528 -2992 -15711 -4705 797 -17360 2837 55005 51691
13605 51691 30407 40269 67750 54136 63864 27983 19568 18755 20595 63684 70458 45168 14194
13592 14194 93856 131001 87607 101738 54485 30818 23710 -2024 11662 24211 31036 32357
13580 32357 14265 -8635 22685 -6638 9971 10944 17650 42124 1413 -41195 -7285 -1272
13568 -1272 16818 16340 20142 -40188 -104822 -82303 -57996 -49045 -31494 -14861 368 38916 76104
13555 76104 14715 -5691 -33135 -38295 73169 102197 81261 50594 76035 9633 -37693 -78020
13543 -78020 -24081 41018 50983 33188 8484 -30254 -38521 -31213 -21790 -17017 -4020 -20822 8252
13530 8252 23612 48039 15569 20235 1177 50108 71382 31907 -20784 -63254 -51541 -30458
13518 -30458 -37771 -56588 -61543 -6225 -17645 -750 27691 -16298 -20150 -34510 -41216 -50965 -95766
13505 -95766 -138993 -133414 -94659 -44189 -31596 -13390 10867 36659 39553 73588 52878 16320
13493 16320 -28618 1041 -20047 -25816 35110 3984 -23645 -76502 -91877 -55619 -18961 -39030
13481 -39030 -67463 -58999 -61096 -44118 -45999 10640 45263 26965 -44585 -71553 -88932 -90237
13469 -90237 -40377 14353 -7205 -16469 -36944 -44616 -56403 -37653 -52197 -33841 -20663 -5436
13457 -5436 2406 5604 46127 57459 56791 1781 -65616 -57181 14068 -6378 -36802 -33460 -11779
13444 -11779 -12613 -8745 -5150 -9227 -9165 -3928 -1628 -33292 -19830 -36628 -15299 41221 60252 -15507
13430 -15507 -90190 -104560 -42596 8951 -28306 -48611 -9380 -45051 -47555 -1371 34505 14920
13418 14920 -18914 -39406 -15684 14921 -5141 -32844 -95987 -109378 -129088 -122513 -127833 -109108
13406 -109108 -45113 6038 26686 48693 61946 9013 -25828 -28222 14448 -35092 -44461 -76032
13394 -76032 -17787 55470 66919 40197 44261 10938 32946 47620 45533 22150 14891 88853
13382 88853 158091 137625 35371 -20369 -1412 52211 62037 -8192 -24560 2733 12118 66280
13370 66280 82786 -8317 -52658 -10432 -42481 -91872 -98392 -57906 -41378 -73624 -57419 -34913
13358 -34913 -94055 -119995 -168641 -129789 -67448 -54022 -8021 -45930 -59936 -34237 3905 27367
13346 27367 37050 -11608 -29984 -83191 -19965 7596 -21240 25011 -54823 -19652 12929 -49978
13334 -49978 -106477 -47421 11620 -22648 -4479 14904 23139 41580 50081 -1110 61266 78625
13322 78625 64689 120965 92131 89324 44659 23015 39009 68887 27862 14449 11667 40822
13310 40822 23420 -350 -2748 -17077 -30479 -24075 -7581 26620 3443 -10987 11648 -8622
13298 -8622 -45373 -40069 -53684 -111167 -9356 77609 99488 66188 -42572 -94601 -79271 -36153
13286 -36153 -52990 -54577 -26791 7905 -41320 -50904 -31932 18500 63090 62489 26464 2845
13274 2845 -11348 -48490 -40173 -37283 -24998 1413 29621 18064 43345 44932 27075 -12432
13262 -12432 11192 56273 43001 38409 6330 44476 21449 -17514 -12102 31050 71873 47470
13250 47470 79624 71066 11067 15680 65473 32116 5306 7823 -5044 -19772 -44600 -50267
13238 -50267 -28300 -27245 1749 8301 -56864 -20461 28449 40473 8277 8303 15273 55683 30320
13225 30320 42931 28530 19702 5426 1716 23910 -1655 -9918 10475 21007 -23430 -22214
13213 -22214 43000 67393 110832 101303 34908 -21252 -70167 -40273 1361 40137 974 -22239
13201 -22239 39573 94099 101657 84819 68505 61759 51590 92052 84353 93668 80727 88977 46378
13188 46378 91554 144691 128490 90232 67704 85826 85419 80990 82244 58899 70212 109789
13176 109789 115214 96539 66565 159556 163512 59245 71 3826 -16614 10165 39038 37092
13164 37092 101468 136463 70185 -29442 -24585 13298 3651 7770 5875 13560 21024 -1059 32888
13151 32888 37535 6505 5402 -13202 -7044 9032 3857 -48358 -84 -43733 -129910 -83857
13139 -83857 -67646 -81350 -21922 1829 84785 75690 62788 82901 43897 44118 73563 26820
13127 26820 -40097 -104199 -75633 -61894 -81421 -21592 -12688 -34255 -51378 -11182 6900 -5710
13115 -5710 -25565 10182 47156 7634 23430 60269 34911 -3916 -44566 -34206 -15415 37107
13103 37107 31314 34125 26699 37176 -2906 -25037 54327 94307 53206 72916 99461 71760
13091 71760 59859 67359 52306 33655 -38708 27545 115085 139805 134175 139774 124976 118454
13079 118454 99192 69506 12364 26854 42765 45982 4893 -1882 11366 21313 60955 76501
13067 76501 57278 -4581 -49115 -40302 -15198 23656 754 -20679 27172 58430 47968 92524
13055 92524 115872 64704 56754 71449 67641 5442 -7899 -33280 -2258 -4037 -24891 -8198
13043 -8198 36830 41585 63539 15372 40597 17329 50807 30839 61625 108898 131759 77167
13031 77167 88076 115029 49068 18466 33100 86775 141269 116561 85352 79013 84195 68007
13019 68007 43384 34149 44083 19926 25896 -9671 24044 65528 79714 64627 43888 59534
13007 59534 87271 161280 216529 250057 282557 289902 297859 353141 473634 663700 779744
12996 779744 993539 1176935 1392283 1510903 1380522 1104377 872984 692232 560625 444418
12986 444418 361360 255708 256916 271036 318244 331262 279582 254963 227172 136235 106011
12975 106011 115662 109880 116200 129474 91574 68588 95399 63325 -31805 -85349 -70320 -74543
12963 -74543 -56615 -2836 34973 27806 13390 -19791 9461 59618 83808 69101 18967 20592
12951 20592 -16373 -47724 -43304 12569 30924 22437 49610 10069 -30598 -24178 22873 3870
12939 3870 -15874 9906 74611 102861 114063 87935 127996 130467 129123 91109 30057 31603
12927 31603 93000 84294 77992 48041 -25290 -10175 -9533 10311 5234 -3692 -32493 -37555 -30091
12914 -30091 -60255 -68928 -79516 -74551 -82522 -82178 -50102 -46127 -24415 -36373 -72736 1153 83630
12901 83630 116540 88162 69043 51478 -11137 -9767 31263 20581 72028 116082 138307 126438
12889 126438 113541 95969 88826 100192 61696 23204 38827 -28999 -32550 29177 20652 11896
12877 11896 79804 63171 61147 52384 29870 20119 11329 44920 6280 40058 75280 81734 61354
12864 61354 43752 41319 21160 -17897 -16847 32367 66772 68688 -14728 1736 2364 101793 114873
12851 114873 48651 36782 59428 82019 108052 103489 98609 125731 49495 -34735 -41734 -19263
12839 -19263 -20144 4516 -51783 -15644 28922 26664 33109 72151 87995 130545 121986 102851 85908
12826 85908 164690 194674 180287 205995 232867 301073 348139 438705 483351 482209 460143 385812
12814 385812 353874 239445 158242 155717 208249 218409 176914 134889 100382 84631 37969
12803 37969 24070 71797 58777 11808 39133 135674 120322 40844 82575 147847 147320 148411
12791 148411 136961 129907 171954 172189 173230 190598 220629 216276 242422 265564 275631 216984
12779 216984 191105 200387 198564 169503 147867 147560 116851 91723 96446 103967 121772 131512 156948
12766 156948 154296 115098 104574 143287 131256 134747 184694 169160 115576 92170 60921 18711
12754 18711 -18174 -6584 12389 82974 185643 244048 201245 167560 160341 146380 171410 145991
12742 145991 116359 81642 84946 97741 119965 60541 54339 143233 184080 182493 203958 205233
12730 205233 127598 147385 114397 57789 77526 105617 47860 -15925 -71628 -119325 -134043
12719 -134043 -91842 -36104 -23195 3664 11994 8090 83045 131699 126079 137758 104821 62469
12707 62469 58104 74467 40881 24591 19338 75360 77291 72626 81696 73802 80609 42463 43295
12694 43295 97123 86063 89978 129345 205219 299736 468727 597165 602420 571811 611230 654557
12682 654557 616142 544770 470171 444614 443741 449734 519969 516486 426418 440029 453483 446628
12670 446628 479463 563471 531823 541568 597568 638127 716505 820646 874540 1045075 1259583
12659 1259583 1378747 1326361 1245736 1143207 999837 849738 713081 617854 609404 674646
12649 674646 729532 719688 609637 508434 499973 504772 568020 570933 522498 457370 444288 501748
12637 501748 548255 550586 548022 495274 535078 574431 602581 574247 549188 539404 466967 453417
12625 453417 528681 541024 554444 588481 589586 560943 576270 697347 763768 758586 766654 770361
12613 770361 719050 711669 694235 692910 757068 816192 833142 823973 862331 903245 908488 934117
12601 934117 990112 1086475 1150048 1094847 1068549 1089033 1127125 1183539 1277931 1391222 1472686
12590 1472686 1614573 1672678 1607177 1601433 1632218 1698022 1750670 1764314 1798339 1828025 1939480
12579 1939480 1981081 2030707 2123752 2238643 2334103 2389803 2487990 2662817 2791117 2922554
12569 2922554 3019476 3184776 3360317 3581528 3858529 4103672 4356741 4600851 4878536 5279746
12559 5279746 5681048 6112571 6626769 7200505 7878818 8619321 9439899 10344469 11424265
12550 11424265 12662722 14143692 15968681 18100469 20639427 23736676 27365155 31482840
12542 31482840 36694878 43619295 53062580 66032974 83969268 108859522 143089286
12535 143089286 188196592 242583504 299702722 338710452 313976245 244394054 181760011
12528 181760011 136558853 105046380 82915942 67114547 55536066 46810127 40146266
12521 40146266 34992704 31030800 27696090 24572851 21704267 19253062 17208058 15463315
12513 15463315 13953374 12637242 11398426 10406506 9614328 8861602 8144783 7500718 7050582
12504 7050582 6611537 6230724 5896892 5536865 5194554 4873976 4604433 4415946 4194116
12495 4194116 3981772 3749800 3522575 3306402 3066582 2960559 2893744 2798928 2667521 2466583
12485 2466583 2321163 2197574 2092833 1983173 1864918 1758286 1661782 1578207 1542957 1553904
12475 1553904 1502390 1414494 1395977 1369061 1294756 1235682 1192189 1151137 1067655 1012273 910381
12464 910381 871593 907192 914089 909448 909448 831677 804777 838264 764740 761143 777624 710564 602234
12451 602234 573039 624528 692118 673262 621492 637410 668597 675238 572202 515166 530954
12440 530954 515255 492432 544910 575765 475541 503249 518455 593643 575916 531728 483724
12429 483724 379169 306675 347571 393643 411629 393537 357791 335706 378041 407033 419909
12418 419909 414889 359776 340395 330189 282798 310541 294561 258859 180285 101163 8397 -122496
12406 -122496 -319966 -456764 -491650 -464779 -288154 -185790 -86214 7404 29554 -5315 2230
12395 2230 24807 52369 85573 75019 26364 -54176 -66714 -8547 -36895 -69881 -36523 -30982
12383 -30982 -68641 -133509 -222287 -260528 -260957 -281543 -256086 -141481 46754 167006 224732
12372 224732 213421 266096 298086 289488 289036 273558 287250 274824 243669 209460 113007 112740
12360 112740 155302 181821 180895 181811 199974 207375 229859 171256 197999 238885 238227 257813 242534
12347 242534 314571 314976 308483 364611 457129 475891 379812 240657 120517 92314 84558 130871
12335 130871 161383 143405 184291 147929 111086 93930 86589 131513 174295 123691 148406 125293
12323 125293 80003 27371 12961 799 24178 51444 80877 109085 142625 161055 150847
12312 150847 160125 197328 155960 175463 187503 211224 167150 101943 93700 111187 102545 95614
12300 95614 160845 163578 171204 105302 82098 74853 145737 180300 171550 197760 137797 96922
12288 96922 119516 80224 24080 27813 85483 65493 15899 39423 100387 111573 79698 69524
12276 69524 121489 165223 86431 36122 31481 20683 19089 130451 150994 166379 113660 74520
12264 74520 47314 98738 140298 154297 108094 121001 220127 242590 233289 158966 143859 159351
12252 159351 174738 213928 177275 123165 116850 174408 205132 205604 186920 145099 44501 536
12240 536 27636 67573 24329 1671 97685 75224 36125 56850 76724 131734 154582 143940
12228 143940 149504 188509 156830 69045 34266 31318 260 -20771 -36320 -38378 235 101441
12216 101441 77444 -2428 2158 19948 18256 4062 -34185 -61247 -55685 22785 70761 105260
12204 105260 88534 183809 240672 155257 77854 61497 43096 20232 41361 77500 54809
12193 54809 87744 138614 179593 134469 60668 16981 19070 32093 12981 43156 25296 84366
12181 84366 115536 165518 133419 122714 99041 72530 82576 84774 133875 142117 80550 79108
12169 79108 113174 133366 110620 156458 170103 195952 189966 110049 111241 152312 142099 130098
12157 130098 153519 151293 140122 128858 103706 94129 131672 145824 14954 -14776 35488 75840
12145 75840 20360 15312 47329 102694 126403 111617 74479 103837 160286 159750 113123 120083
12133 120083 86334 82423 167589 127036 77746 75472 55892 80612 90012 52035 54357 24157
12121 24157 2255 28166 72185 109267 139423 167194 164277 162432 110730 48611 84031 110460
12109 110460 139506 185164 139344 97797 47306 33438 125192 132862 69057 53467 60635 -1054
12097 -1054 22716 41275 54946 87176 69417 85636 152548 160746 104470 101221 145469 131736
12085 131736 97525 35117 -2135 17969 3799 44347 106453 82912 135006 174042 210756
12074 210756 213302 292551 424763 631882 824390 892957 914166 975420 1153696 1383279 1552875
12063 1552875 1726343 1708325 1437191 1182328 981976 831325 684579 601903 529823 448008
12053 448008 351038 354231 365490 342263 325078 385025 427756 507473 489340 568243 730208
12042 730208 839267 829212 682776 597492 575933 466071 323326 245050 221791 280064 306093
12031 306093 284463 253598 245948 212882 217963 242276 249892 221668 251801 275960 225580 175420
12019 175420 252442 243443 229688 266059 269834 247849 221968 205090 249806 273865 296849 248247
12007 248247 233709 249424 260895 289532 270375 246396 223463 150754 132592 172420 240070
11996 240070 287656 287695 295432 333595 378829 326693 275610 213446 244064 303482 305777 302821 336992
11983 336992 330633 320676 388636 430161 435109 390128 366351 413060 487555 502474 474297 492340
11971 492340 512356 554420 583685 570169 532398 575861 557854 621423 648039 622438 662183
11960 662183 743166 774742 876028 979149 1026132 1072230 1074640 1105342 1156672 1251453 1311945
11949 1311945 1331794 1372112 1544075 1667766 1797661 1937479 2108622 2299130 2524496 2698214
11939 2698214 2888780 3134340 3456599 3751244 4095460 4505513 4974627 5433305 6075329
11930 6075329 6883794 7866236 9010220 10417730 12271059 14689942 17972317 22448647
11922 22448647 28644211 37731920 51377593 71661620 100875868 140126818 186486935
11915 186486935 218028376 198165875 144784436 98860469 69157249 50756395 38892769
11908 38892769 30814623 25075884 20923660 17748252 15295007 13305862 11625085 10328582
11900 10328582 9204597 8239184 7456483 6719535 6087926 5557867 5099726 4698312 4330370
11891 4330370 4018579 3772074 3562590 3352642 3186808 3120432 3114542 3109139 3084150 3085760 3043933
11880 3043933 3091416 3103612 3086455 2952837 2783428 2590154 2440375 2285990 2092287 1862593
11870 1862593 1697229 1575732 1369558 1197695 1114549 1028897 971540 954064 886375 824517
11860 824517 797296 682868 623763 601708 557589 550657 526979 460623 438381 498584 475852
11849 475852 396865 388684 357712 369852 426565 432963 384943 319802 297486 324436 344768 393506
11837 393506 355281 272701 313261 325480 259901 239029 235433 277234 298751 299602 301687 242398
11825 242398 213962 179322 222331 265462 223127 193027 167532 147483 189809 255423 198877
11814 198877 127817 106097 42892 92084 156207 167227 151353 157766 180887 195536 221034 193197
11802 193197 152481 118597 123353 158123 126335 157817 170298 143552 121229 112715 78575 -17875
11790 -17875 -126609 -196469 -322161 -433862 -339207 -234768 -166763 -132046 -94422 -26855 13300
11779 13300 52086 68540 79736 56806 -4758 -4435 21220 60990 4866 -15109 -34148 -63171
11767 -63171 -124874 -217551 -226384 -256735 -292522 -286312 -250676 -229631 -156153 -2886 102558 149178
11755 149178 195853 200230 212328 233620 228498 202400 190111 182926 178685 172680 165015 200541 235525
11742 235525 199061 172589 145568 148870 127229 115324 123617 137450 117460 122542 121454 177989
11730 177989 152148 125184 135278 135903 163371 173789 70335 13628 23389 24688 78831 68376
11718 68376 59132 31800 -7441 26564 49363 34052 11781 14873 7723 43379 53720 38984
11706 38984 300 -32891 14984 37446 106333 68819 52475 45165 24747 64390 91495 1844
11694 1844 -56467 5926 98433 97481 91449 63194 10666 -40613 -120830 -95276 -9937 61505
11682 61505 23066 31393 8683 46423 73064 112456 130897 164420 174982 115977 24200 -28277
11670 -28277 30013 60015 109006 61884 37000 -3307 -28112 -57548 -18511 45536 36321 31655
11658 31655 5680 -70192 -84724 3302 72964 56434 61614 71354 76916 50735 92846 135553
11646 135553 147093 102243 51531 105386 103776 35374 1374 -27783 -69942 -59518 5269 17230
11634 17230 8346 51848 58370 44312 2198 -13484 21296 -1072 -29432 50440 81931 93184
11622 93184 65332 30716 -692 50092 84001 93700 102329 92613 77464 62094 -24868 -14530
11610 -14530 46207 55895 23533 24537 21532 -13691 -9638 -8117 60 83055 37400 10633 4017
11597 4017 37422 136206 239215 331735 460202 460650 327801 194370 178709 205886 153071
11586 153071 124617 120716 48572 26851 62448 38710 44213 92754 122964 113819 61354 53729
11574 53729 53325 54217 -2889 -13033 -37053 -18014 -39203 -44149 -10114 43001 94102 100028 78603
11561 78603 38232 -2473 -21434 -127871 -170904 -104261 -127204 -120029 -32093 8631 -28306 -15496
11549 -15496 38560 84331 104498 123352 92033 18429 -21141 -50457 -68773 -34118 3054 -31390
11537 -31390 -47327 -3175 65530 40903 33916 21428 -24175 -17045 4100 79646 21983 5117
11525 5117 36072 9581 -11787 -61938 -105674 -101329 -97386 -12390 48996 73734 66667 -5776
11513 -5776 -28737 31393 35339 4756 -5622 15555 44063 78714 81939 80111 79174 77531 45060
11500 45060 10914 -12512 11497 65252 35843 42176 37681 43922 47605 72278 79502 13446 74822
11487 74822 168305 136736 60909 62358 93515 142845 135999 154103 136451 91551 55662 17521
11475 17521 25494 32772 17764 48310 106797 57876 -62771 -54112 -13820 -3401 -15766 23737
11463 23737 55432 39361 22540 27165 48672 31392 -30036 31999 47283 24963 -25850 -96903
11451 -96903 -125479 -125038 -129463 -137387 -49808 -6233 -1083 -16653 -25528 -40127 -44154 -6000 -33470
11438 -33470 -19376 -14162 -51741 -38390 -33907 -78882 -64996 -40272 -56948 -23732 36494 14017
11426 14017 -12417 -18330 -27827 -32741 -46313 -30124 -4135 -933 3467 20099 24243 -50274 -37823
11413 -37823 70157 71220 -21566 -28792 -20625 -44750 -8076 343 30620 22819 -658 8517 41040
11400 41040 60434 41438 -59686 -39556 -39475 -23434 1550 -2402 -1323 -33233 -17560 -20000 7925
11387 7925 21332 -12269 -37130 -17076 42585 55257 62977 43145 14905 -8952 6224 16380
11375 16380 16337 31282 75140 90394 81798 84636 54857 85164 55900 58267 95392 89410 106224
11362 106224 57921 -14487 -3269 5585 27278 65941 125393 117820 53365 59924 60091 -18638
11350 -18638 -82881 -55435 -63075 -100792 -87935 -14203 -8893 -47017 -57302 -39259 -38448 -12766
11338 -12766 3058 12791 43093 35825 12837 -30337 -9962 35559 21340 -39236 -31842 22526
11326 22526 44554 -19439 -29643 22383 40981 37965 36813 -1690 -50455 -63069 -33749 70782
11314 70782 77219 77484 49883 31664 30901 15795 -2431 44662 101233 95876 136643 146048 126998
11301 126998 93980 56244 77896 73584 53858 -26222 -39625 30064 37244 -21766 -21913 5026
11289 5026 291 22228 23058 106542 167541 141094 102404 91027 74388 75427 55731 44152 53012
11276 53012 4547 42144 33086 64769 72086 74450 60438 33565 -4100 -52484 11222 91535
11264 91535 73854 28622 20781 -1178 -40099 -131128 -177605 -132055 -121347 -71772 -3241 48527
11252 48527 101241 124901 149534 138791 104888 55411 15066 67160 76074 97156 -16755 -104173
11240 -104173 -47719 7051 49862 49488 5015 -17782 -7989 -5132 -22392 -75952 -75728 -80290 -80095
11227 -80095 -80073 -97447 -70810 -47338 -25475 -34318 -100222 -81176 -48778 -33575 15614 -9206
11215 -9206 14450 -13034 -39916 -49409 -5737 29724 -153 -60137 -78161 -28798 -11559 -18737
11203 -18737 -36050 -58213 -72919 -18912 17583 9508 39286 47307 37672 -25762 -84637 -76295
11191 -76295 -35653 -37901 -28269 -27574 -4186 13319 -59477 -90972 -58184 15286 27068 -10469
11179 -10469 -11289 36309 68475 49009 79597 105638 70257 69889 121688 64346 37970 6710
11167 6710 -39198 -72547 -87743 -60349 2962 26996 11517 -18447 -48048 -46304 -50557 -124851
11155 -124851 -136272 -44548 -31231 -3110 39183 8668 13239 74526 52250 9762 -70071 -100964
11143 -100964 -79326 -79939 -70109 -82920 -145619 -115229 -89397 -14789 14560 -15958 -41488 -4871
11131 -4871 31408 -19152 -63339 -41791 -14092 -25276 -45835 -54842 -4997 7624 4921 -13689
11119 -13689 -40929 4302 -22881 -77197 -25468 7301 26083 -21226 -150593 -132851 -71128
11108 -71128 -62141 -8873 55923 49703 14568 625 -32554 -19068 5939 18718 69726 51593
11096 51593 64996 33971 38429 33312 54012 47960 -26299 -45681 -44565 -45852 -51042 -37908 -21992
11083 -21992 16610 -59810 -56406 -102859 -84612 -14328 -15798 -62989 -37734 -74078 -76511 -37341
11071 -37341 -8668 1914 -50940 -43686 26562 86846 128470 65641 12697 -16738 -47637 -56616
11059 -56616 -50900 -10450 -16497 -26979 6695 28417 588 -29183 -37543 -51739 -37818 -28871
11047 -28871 38082 23950 -25447 3270 94445 157122 214046 188034 174924 172379 154119 120441
11035 120441 132445 129968 158032 102732 68109 41768 109033 115762 79611 126159 168291 209553
11023 209553 208327 196585 215330 216334 131651 108098 147376 175314 242069 358998 389896 434525
11011 434525 419344 342229 298500 333162 274533 242907 269771 328622 318076 309958 289442 321502
10999 321502 322742 253248 156791 103989 116795 93354 93833 75350 96478 146444 151832 146080
10987 146080 119510 57198 73771 79438 110342 92347 100920 100460 106367 112428 117367 109083 119219
10974 119219 137227 105436 57556 -9563 29555 40982 -18938 -48839 -56693 -14240 -9186 -31349
10962 -31349 -23424 26782 79094 20412 -27590 -17336 -12179 37647 45175 2478 2093 46868 61538
10949 61538 24097 16224 76185 139774 113524 99773 58864 38213 43310 47654 22516 -1603
10937 -1603 18169 55559 30619 20953 8561 -3407 24089 -7699 -2435 14454 139 30234
10925 30234 21925 30526 75824 88479 77961 64410 63861 47694 20808 73431 47791 34479
10913 34479 75865 40301 44095 96533 81276 64107 22084 13797 53992 76503 56906 17654
10901 17654 -11126 -10938 -18961 -20883 -40625 -14834 7498 6088 -14167 -35375 -64027 -58793 -40721
10888 -40721 22999 29173 -12566 38960 40014 19325 -4522 7428 34958 51104 67997 467
10876 467 -34194 -18104 3601 -2966 -58450 -107621 -85852 -13909 3758 19796 24110 2996
10864 2996 -22593 37892 39775 15788 -70800 -66533 -1044 40958 38683 19876 17989 -47738 -61045
10851 -61045 -6005 23715 13265 20332 -25338 -64166 -75723 21464 91674 81616 82049 91575
10839 91575 59157 -611 510 34436 24401 13122 -14054 67796 117440 129765 135759 185024
10827 185024 190673 154462 68474 39075 25382 36945 54827 113912 148758 64334 10937 -2051
10815 -2051 28312 15685 -33552 -85130 -45764 17828 57258 52774 22089 70362 119174 114807
10803 114807 106334 70550 16680 81542 42988 36079 72716 101407 69309 42120 43175 5804
10791 5804 -25409 23946 71133 83502 82422 80689 12563 25602 29764 30452 32889 2887 10908
10778 10908 20772 -46717 -60061 -62301 -48539 -3511 -27878 -9709 46124 66823 58332 -12828
10766 -12828 -58013 -16053 8513 -6279 -23238 -91372 -95832 -83947 -122606 -128569 -70603 -27783
10754 -27783 4694 32005 14322 -6454 33065 69288 86715 31103 26438 29878 7282 -3659
10742 -3659 -394 54757 133478 184431 184221 185839 192537 186085 236605 253059 203960 195249 209107
10729 209107 177514 201125 196248 193249 259875 316665 341511 353040 271475 261616 302099 313040
10717 313040 303859 312942 336862 367642 381264 436609 439240 452360 502194 468054 458423 462271
10705 462271 402731 350659 298546 290838 351100 367722 334505 349151 375527 410380 330518 282014
10693 282014 332097 370081 316026 287620 327019 283104 237646 242115 272778 240808 202928 184634
10681 184634 199070 224070 248646 254796 273594 261518 172127 138831 169814 204293 249435 236781
10669 236781 189855 219865 210546 202666 261782 235168 223783 252333 311147 335195 360501 354597
10657 354597 338026 349233 322749 319990 330661 392684 421786 460072 507427 524650 440512 443673
10645 443673 508231 548019 555640 544173 586068 609840 577567 586480 598834 634619 657632 799593
10633 799593 922258 966091 989052 1040465 1034923 1058002 1139714 1340933 1511883 1638359 1872687
10622 1872687 2015127 2157376 2380756 2595318 2920401 3355031 3832175 4477051 5378399
10613 5378399 6516958 7982808 9975188 12531270 15773431 19429887 22990910 25556918
10605 25556918 26356759 25611885 24499081 23884980 24185297 25706108 28637333 33142292 39289502
10596 39289502 46565561 53495688 57532208 56615067 52254687 47347501 43862069 42550042
10588 42550042 43502645 46818177 52550069 60392173 69441131 77299641 80097918 75666072
10580 75666072 66557277 57166598 49981023 45488860 43572255 43958511 46293783 50220429
10572 50220429 54782137 58267163 57967522 52879268 45214155 37813183 32152472 28421144
10564 28421144 26355337 25612769 25788667 26584398 27527762 27788479 26438001 23382800 19505097
10555 19505097 15781061 12688914 10318491 8550077 7214391 6182022 5393751 4737968
10547 4737968 4253479 3868411 3574302 3320574 3052284 2767104 2523938 2258941 2069486
10538 2069486 1945527 1784913 1714325 1662357 1548625 1452015 1354857 1260706 1140245 1036292
10528 1036292 1024099 966794 841082 786238 812086 794768 765738 669535 595376 575201 546352
10517 546352 589850 585681 524161 492947 483471 438741 411794 380451 381658 406576 461150 428999
10505 428999 394141 409270 415822 394341 382680 337431 334915 369260 402605 357070 337989 268592
10493 268592 284088 287803 228431 215543 249319 176508 125436 151250 187035 213219 213833 224668
10481 224668 161365 100630 68670 109038 94442 51061 80824 95999 106223 116482 98287
10470 98287 106002 75449 107132 115881 48867 -35385 -36345 -44555 -1871 -27269 -16162 -406 -77922
10457 -77922 -132966 -104359 -113703 -108051 -129524 -87281 -34597 -8122 -15208 -45019 -45251 -101745 -151450
10444 -151450 -77798 -92040 -119883 -112225 -88881 -97099 -80436 22078 59970 -21153 -41426 -37486
10432 -37486 -72363 -108015 -147808 -84274 8275 31878 47330 75773 91801 61993 27041 16253
10420 16253 5914 3119 -48862 -55576 22804 66617 95042 143571 176364 189255 146804 107096
10408 107096 48330 27782 39274 26029 540 5282 20046 76602 156815 179524 109757 115145
10396 115145 201952 210042 171079 148293 152223 116872 139855 94097 97983 82967 66612 46214
10384 46214 61090 109090 108491 57773 33477 21039 -6 627 384 -36924 -83433 -52768 24624
10371 24624 78230 108993 85344 50080 75730 99040 160206 141040 144051 201879 214151 154439
10359 154439 59242 34158 33622 33274 90819 126852 105407 130874 110595 84152 120899 154454
10347 154454 136516 109823 39070 41212 30141 53957 71329 59794 195 23849 46818 40227
10335 40227 91539 148338 144847 100202 43123 36801 95176 80047 81466 96139 30721 2657
10323 2657 18437 -13933 -858 33581 48169 55601 -8015 -41329 -17049 19548 138185 175813
10311 175813 138727 100208 87347 94548 110235 72779 55717 78597 32575 435 -1581 1981
10299 1981 -57280 -6689 75685 71011 -24818 -52080 -50435 -11559 21424 33384 30043 72802
10287 72802 91580 67727 64029 84477 90387 35422 8496 -3643 -4464 37532 89190 127210
10275 127210 121795 96184 87944 -16040 -33584 -9863 19590 26139 20959 53909 39220 30199
10263 30199 -31286 45299 135872 185060 183874 127232 83753 34654 505 11131 -2870 -56490
10251 -56490 -84973 -12902 57176 90185 96884 157484 143797 45278 44171 89989 54082 33199
10239 33199 -7913 -15366 21524 -18888 25770 77902 69248 52057 44519 42176 19882 -5963
10227 -5963 -26256 3197 38518 24603 51303 48755 29490 47736 33602 -12954 1149 -13401
10215 -13401 16772 -2198 -42388 -23572 -14538 -819 -15497 4076 11547 22591 54624 60067
10203 60067 39054 -16400 -65247 -25114 48012 82070 34922 -63071 -64270 -77817 -30222 -67422
10191 -67422 -60646 28608 52496 52132 41570 39030 31089 63370 61579 69047 54069 49634 60618
10178 60618 78512 55833 37183 38995 74470 95002 134088 161517 148444 140648 102552 42015
10166 42015 60221 143330 203257 245640 269581 298493 300406 289701 227218 203580 215923 239231
10154 239231 201340 122973 132849 182829 254356 315295 367298 389847 413158 340939 318346 290428
10142 290428 270623 223780 236347 285391 273414 237332 264247 326567 356069 290440 224923
10131 224923 204402 226130 233852 182718 129213 49426 29221 75320 115743 166376 189768 196867
10119 196867 161160 108713 43938 8829 78476 106584 65741 72671 58052 29997 29666 60175
10107 60175 128540 72943 52493 50220 78967 48951 -2805 -3106 40229 80461 36681 7790
10095 7790 -4535 13630 61446 75859 63060 113463 112587 70933 47427 21158 -2794 61769
10083 61769 79854 46075 69168 61742 9070 -19834 -16590 -31084 -25063 -160 7305 45294
10071 45294 42330 34758 54570 97645 79231 18284 24974 87484 75621 11153 23658 20506
10059 20506 14038 37681 -21056 -102120 -89171 -97249 -56260 -13106 -10486 3292 7472 29995
10047 29995 90643 114896 69987 16970 11515 68921 96748 54045 2341 -19235 -36245 -18228
10035 -18228 2818 81724 116492 96562 85123 23029 19415 54235 58462 46578 43208 49250
10023 49250 44673 10483 -24371 20756 50782 42475 32064 9333 -44312 -82186 -76648 -58410
10011 -58410 -63817 -24483 -28371 -56942 -90760 -90163 -88127 8598 40329 25948 603 -15 -49244
9998 -49244 -97811 -33030 -13367 -13780 -19505 -19904 -1314 17454 -43046 -31021 7439 -42364 -75326
9985 -75326 -70335 -107239 -105118 -64502 11010 77892 42711 45666 20230 -4918 -44671 -37319 -51980
9972 -51980 -71960 -62978 -3578 49448 69120 44786 16901 -8167 4545 -13209 -19484 40313
9960 40313 70097 17974 -57700 -92987 -59193 -53734 -24732 -50858 -79802 -37760 29747 19118
9948 19118 -28059 24425 83606 87476 43046 37164 -5083 -54819 -102666 -56595 -56334 -83821 -101051
9935 -101051 -95050 -93835 -78143 -60725 -94610 -55270 -24457 58570 741 -55967 -23456 35154
9923 35154 63993 138088 129137 82277 54021 55067 39778 22600 6855 -48591 -41149 -14388
9911 -14388 16039 69401 102873 126330 126520 111582 98034 86089 53522 24110 46119 75394
9899 75394 76395 85964 69232 19682 -10661 2199 60343 -35154 -68473 19739 83859 80873
9887 80873 60929 25296 29919 49126 119597 176842 129829 66498 46137 116822 116956 103132
9875 103132 84934 44121 -47065 -37679 -34764 -56742 -58493 -8310 11063 -49660 -15471 -16195 -43443
9862 -43443 -4724 -9947 -9694 36918 62876 125483 49653 6387 -27964 -56999 -16577 45640
9850 45640 57460 36304 27057 75847 6068 -63871 -50970 -32555 -40818 -8042 -42702 -64714
9838 -64714 -16938 2437 -363 -21589 -61547 -63443 -7595 56168 53249 13783 12895 40694 42694
9825 42694 42114 32209 2222 6475 8607 1708 -361 -42829 -47428 -115431 -127519 -64321 -28994
9812 -28994 -1568 -7110 -19365 11238 23868 18062 35084 96218 16542 7571 37015 20234
9800 20234 -12333 13434 1994 -15685 -22701 -20716 -17468 7735 30674 32038 31825 57199 57127 37732
9786 37732 33989 -3912 -39856 -90368 -91419 -64404 -39892 -59625 -7035 -27295 -57291 -67733
9774 -67733 -65001 -17084 18597 -41186 -82417 -45797 -26040 -1196 52600 79976 67679 38157
9762 38157 7593 -5485 6984 69464 55170 3342 -54665 -26370 -784 37010 18881 -23629
9750 -23629 -37287 -28647 2687 -909 7899 39818 76339 99119 96262 68067 13800 -17120 -24763
9737 -24763 -41140 -909 57430 34820 31874 -6564 -53986 -49307 -74146 -64747 -85010 -63831
9725 -63831 -23474 -33178 -35295 -79624 -28127 -3854 15212 3704 -25672 -4642 19445 28198
9713 28198 3447 588 -9447 55674 61821 13696 40395 29949 -8387 2715 -56166 -44129
9701 -44129 -38796 -50301 16080 33775 24829 34192 35362 46335 50697 -5138 11679 65690 106558
9688 106558 108264 89417 64565 -3561 -27170 28180 30208 53605 83952 83709 140271 146579 69769
9675 69769 77712 30186 -4022 53530 88340 71950 63743 659 -26724 45694 58110 27573
9663 27573 -49888 -16560 36233 32581 10987 -26189 -54558 -54621 -56845 -82060 -25024 1845 4935
9650 4935 355 29434 23482 -7801 -10902 -15641 -41344 -52430 -44248 -19698 -22428 10525 44938
9637 44938 69517 100467 62783 71042 57225 743 11698 -37040 -77101 -68344 -65794 -61511 -8770
9624 -8770 -3099 -29085 -299 9492 71570 52762 -274 -34385 -1424 -44221 -58432 -25566
9612 -25566 -19145 -1969 -7078 1568 5085 -39741 -40326 -1675 32744 -12723 -34044 -31502 -4152
9599 -4152 15108 57207 17849 340 15276 -11039 -11351 31494 24416 24760 71676 117323 69255
9586 69255 16329 22288 -6962 -19518 -52416 -68823 -64263 -101697 -90789 -59364 -26300 -17384
9574 -17384 -5498 53204 78574 23083 -12546 19850 -6363 -14177 12840 7905 41068 11461
9562 11461 18097 33824 -7279 -49777 11406 45142 -9710 -46593 -57236 -7719 8043 2917
9550 2917 17328 30284 32832 30077 25640 10396 -6505 -29520 -46393 1541 42085 30993 14932
9537 14932 -9165 11254 91841 68321 30320 51895 114645 110774 44589 -37443 -56171 -61841
9525 -61841 -85478 -91266 -25573 -40901 -60997 -37956 10048 73977 40653 9034 -57231 -8015
9513 -8015 37356 11660 27403 25831 2544 7665 21710 60907 34297 10957 -18475 -52311
9501 -52311 -55352 -3596 15897 13801 50285 -13158 -92014 -111006 -96476 -73835 -84363 -91746
9489 -91746 -60539 9860 28540 11317 -31915 2707 42425 57676 82443 75822 109743 81549
9477 81549 33872 6358 -4067 -13996 -21853 -84046 -73162 2758 21110 -8714 37676 84074
9465 84074 83886 45733 76405 82483 -16587 -62267 -15924 69635 114296 88821 -3290 -3303 54073
9452 54073 59662 65763 55927 28501 21742 -39035 -91961 -92948 -53496 23349 5310 -78896 -102896
9439 -102896 -66921 -50447 -23851 -34781 -34958 -19475 16740 -19622 -40195 10470 10110 20563
9427 20563 8024 -24522 -44086 -49460 -30651 -1752 11519 1253 -50616 -112695 -110551 -91115
9415 -91115 -32059 -15118 -54592 -103650 -49715 -343 -10895 -59162 -41836 -8913 20365 1383
9403 1383 13934 43408 43539 60097 -6893 -65755 -26346 1503 23430 61510 -10151 -63831
9391 -63831 -66914 -5000 75148 81351 82284 9661 -3039 2817 -65908 -100932 -121509 -108897 -59548
9378 -59548 -23535 -22017 -18301 4811 15153 -4599 -46955 -92682 -52685 28282 15408 -36106
9366 -36106 -30052 10679 65247 55191 74532 83862 37168 -24550 -25887 2244 -3674 11567 18445
9353 18445 13403 16006 47519 4556 -53828 -91297 -124680 -130797 -104967 -29732 36737 26127
9341 26127 -54341 -57255 580 -13637 -15877 -592 -35353 -28511 -11728 3014 7820 1644 22563
9328 22563 -27371 -26961 22964 4383 -31570 -48150 -22055 -6484 -21683 -54555 -55622 -72593
9316 -72593 -20835 -9469 16014 68129 66740 30927 48854 60273 1387 -25525 22092 39852
9304 39852 26055 -5405 -55356 -43158 -19844 -22999 -72266 -123001 -123154 -117662 -65045 -5285 65942
9291 65942 51248 17345 31032 43222 47077 44796 72214 112858 91079 -432 -18739 -16138
9279 -16138 7600 26738 39350 70797 32866 -11506 -33910 38662 32968 -3068 -28825 25919
9267 25919 69067 110455 82997 53417 39142 44382 26129 9738 12927 4684 -2199 37329 241
9254 241 8298 10429 35044 26037 -65008 -100113 -60018 25616 52996 67514 16404 12049 71146
9241 71146 96474 43 -29209 25979 26199 1637 -19552 -42193 21276 78437 8069 -34181
9229 -34181 -24283 -14279 -28262 -41958 -96837 -148398 -130313 -88469 -71111 -84354 -109896 -84029
9217 -84029 -40747 -24268 -24822 1745 -20423 -78786 -90855 -59510 4764 25279 46174 19109
9205 19109 -20432 -28983 -47291 -40076 40868 137950 136986 67051 6471 -33723 -34968 4222 28494
9192 28494 -26697 -11477 28713 36016 18506 -43402 -60376 -14334 32215 7388 20540 19949
9180 19949 62167 49844 72 3671 62844 69753 2916 -22183 -44423 -13897 -12846 -57171
9168 -57171 -33741 13187 -11104 -13092 32012 2641 -63225 -73027 -49575 -11293 12375 58778
9156 58778 14252 -24730 -33977 -64651 -53705 23973 53269 39752 998 -25980 -5942 17777
9144 17777 18032 -20869 -61815 -89278 -127055 -112017 -140310 -120110 -79310 -21989 -49277 -78363
9132 -78363 -32162 -23141 11770 58559 16166 -27842 -100782 -101741 -117364 -71471 -5338 -2551 -12666
9119 -12666 -9964 -19950 -36968 -42998 -68799 -135558 -49088 9777 -7294 -10848 38709 81452 56697
9106 56697 49150 46205 46743 -21277 -39222 -21817 47681 119607 139303 116820 119634 88874 44569
9093 44569 34550 58901 73421 85492 85904 36616 -1643 -8721 -15883 -31472 -63069 -62603 -26624
9080 -26624 -6513 -13540 -24774 -58510 -75864 -84259 -71225 -101698 -113592 -97713 -47968 -27789
9068 -27789 -46667 -55173 -30121 20426 159 -44705 -78779 -69914 -57894 -30268 -631 -10216
9056 -10216 10690 -66960 -111992 -151839 -191436 -170863 -84667 -20022 -50035 -115295 -98522 -78453
9044 -78453 -54174 -26564 4577 -11142 -15632 -18868 -52505 -7415 -7481 -75736 -72973 147 15296
9031 15296 2998 -13676 12105 67865 11033 -37364 10912 53871 31043 -13451 -5795 -17277
9019 -17277 3038 -967 -32629 -2096 -70058 -10752 -22074 -66764 -14272 -18818 -29303 -15062
9007 -15062 261 39385 25845 -26547 -29769 -14939 -6233 9377 45757 116343 59652 6996
8995 6996 48272 10656 -31584 -75767 -106046 -79841 -31851 -20893 -46955 -48422 18071 -19369
8983 -19369 -43063 -72749 -34095 25103 9621 9941 1540 -26626 -25267 5593 -2774 -11031 18736
8970 18736 98569 82159 36309 -29406 -14006 17403 -33818 -95815 -123969 -108279 -91104 -59451
8958 -59451 -44189 11055 74790 84884 54856 58874 66884 107014 68893 38908 71530 106233
8946 106233 36431 -47273 -66577 -51679 -23828 -11530 17056 74563 119987 44449 -23439 -12331
8934 -12331 -30885 -51309 -35318 -21373 43046 55821 52303 58535 79005 11118 -35790 -86848
8922 -86848 -119851 -39720 25798 -9450 -64172 -70784 -82074 -107796 -126252 -102090 12620 45203
8910 45203 31689 -6331 -45541 -58960 -23411 -47131 -28289 -61020 -81045 -74647 -61421 6426
8898 6426 -10222 -15208 31875 44234 -10780 -40745 -52812 -85413 -83473 -77473 -41956 -43318 -45582
8885 -45582 -19937 -26600 -17168 18487 53563 23830 -15115 -7161 18310 -35062 -66611 -59529 -42295
8872 -42295 -51807 -53828 -52708 -62862 -88926 -94085 -30529 -31669 10961 10498 -3559 -20978 -26684
8859 -26684 9205 61813 35960 -12775 -70977 -90438 -47732 25060 94488 57786 60251 65629
8847 65629 53424 7065 -32725 -43245 -28860 -3516 -29042 -35487 -57532 -46451 -270 86890
8835 86890 56018 66538 42348 75767 54372 -14660 -50282 -74493 -83574 -72136 -56603 -41869
8823 -41869 -21928 -96750 -162807 -181552 -139904 -81456 -42039 -18732 36939 46145 59509 -25135
8811 -25135 -53966 -55761 -29714 -32336 -48429 -48986 -93263 -38452 4224 34862 40155 78824 87306
8798 87306 67881 72978 74449 32553 -10332 -46165 -66684 -44071 48643 126284 129530 68446
8786 68446 11792 -26100 -52334 -38835 -16072 -60584 -91694 -101090 -82712 20935 25565 -27226
8774 -27226 12355 27992 61285 40262 44267 48116 2015 -19366 2472 49858 48653 15265
8762 15265 -7007 -3099 41047 65733 98878 80493 125025 136321 69641 3497 2861 5950 -44982
8749 -44982 2346 22275 -3591 -14237 -13183 17206 8527 8276 46889 64591 11493 -34069 -50844
8736 -50844 -3941 14358 3609 -33256 -70855 -106910 -43480 278 -36953 -89154 -110409 -77596
8724 -77596 -35748 -11193 33667 5246 -43684 -22543 -20065 -42322 -83913 -94474 -105797 -81386
8712 -81386 -16593 -37339 -11972 10170 -28116 12681 46973 26164 16670 30507 -10066 -41100
8700 -41100 -64771 -120801 -121116 -111667 -103102 -93422 -102587 -78612 14496 68107 54074 21962 38097
8687 38097 55581 26201 -4077 -18711 -32781 -26541 -6131 -2743 4396 15238 -7002 -94416
8675 -94416 -134160 -115161 -100199 -67428 -86612 -90937 -80539 -97069 -35160 405 -18237 -7015
8663 -7015 38729 19607 -18062 -70794 -58896 -32480 -41995 -67617 12053 87693 108199 116934
8651 116934 82562 28673 4447 12429 42594 27044 -28923 -54739 1514 61503 55713 23866
8639 23866 -18201 -67002 -92540 -74546 -23398 59135 103395 99649 70940 25716 -56042 -102574
8627 -102574 -92305 -5208 23398 -6333 -64736 -7454 -13975 -8532 12588 7942 14814 68770
8615 68770 52680 -23952 -52000 -48067 -26558 -12070 -48503 -48656 -28982 -12417 10714 -35152
8603 -35152 -13782 20369 44009 57864 20591 11434 9500 -20370 -18707 -9202 -35818 -84403 -108075
8590 -108075 -5598 84911 99083 100318 28186 19659 18177 41408 48780 50508 36554 18646
8578 18646 49684 43608 66228 41327 50431 44473 32910 15628 43992 57104 57227 991 -44998
8565 -44998 -29651 -27182 -66996 -45612 -22397 2537 11831 -3938 10232 -37760 -1494 -7983
8553 -7983 -22670 -22904 -25633 -79529 -62029 -6721 -13587 -34825 -12675 -14137 -9855 7535 1794
8540 1794 -30042 8120 -14394 -79184 -101886 -92078 -42174 -5311 65319 40131 22794 24029
8528 24029 43847 4481 -40092 -29210 -22548 -43312 -28779 19911 -28334 -57442 -28560 -52393
8516 -52393 -39809 -39630 -51161 -36150 -27054 20315 31545 21180 9147 21242 48831 78728
8504 78728 35133 25218 46864 51026 17723 5123 45155 135256 125294 81708 86963 55541 48247
8491 48247 38751 89233 39180 -101175 -159254 -125154 -79557 -105835 -131919 -112819 -24100 7808
8479 7808 -21545 -38135 -54762 -21445 -28888 -54815 -11241 57367 95750 61814 32436 33249 -7084
8466 -7084 -36614 -5097 25577 -3300 14740 29083 -4568 -72457 -58817 -33954 -68659 -80608
8454 -80608 -40101 -10324 -4794 -1006 -34952 -40662 -20120 14516 47407 41457 31959 23109 100983
8441 100983 111756 69119 21015 -47675 -79511 -41221 -41780 -21301 -2142 -41085 -75807 -169033
8429 -169033 -116935 -61840 -58012 -61232 -28885 15835 18392 3574 -8778 -41257 -333 136364
8417 136364 155490 112598 86538 77205 59030 61377 29218 -30600 42108 77482 20340 59316
8405 59316 73084 2412 -22899 -42216 -81100 -54004 1019 -15169 -2759 1061 123 -11232
8393 -11232 -31821 -76354 -47290 21113 14370 62654 36990 -18191 -53206 -56867 16857 78770
8381 78770 68736 -31276 -55907 -18954 15828 31523 64203 33486 23654 34954 18830 66709
8369 66709 112612 203444 309627 341180 235863 137171 42102 40122 36116 16976 -19807 20641
8357 20641 42100 27174 43638 15833 -54539 -99667 -84630 -30768 -18278 -17165 -988 -20817
8345 -20817 -51969 -50005 18864 52660 32912 -31355 -63207 -81909 -44497 -17219 25657 62006
8333 62006 -20336 -35502 44712 69132 45420 34221 43371 54789 29000 -41133 -35200 -3106
8321 -3106 63227 112574 90936 30516 -3670 -38887 -110603 -72667 18522 3444 -65275 -90957
8309 -90957 -106588 -93247 -70354 -93530 -55199 52933 9730 -16932 -30781 -58805 -78916 -73961
8297 -73961 -48453 -3507 3566 -76512 -41353 -54258 -90113 -46915 -2554 -29279 2742 86298
8285 86298 93752 38657 -5922 -27865 6778 27521 45492 72824 22257 -6190 -49053 -9610
8273 -9610 10231 441 8952 16609 8108 -15617 -4760 26607 61036 71402 58604 60454 34270
8260 34270 -8059 -17375 -2344 -25837 -104282 -129176 -73302 -102097 -156952 -55136 4074 -38876
8248 -38876 -12871 4056 33930 30714 54334 49712 27651 15833 11075 29657 56534 41819
8236 41819 29163 25370 20120 19993 -60468 -82084 -51348 -82177 -63911 -24388 -26321 -53082 -72990
8223 -72990 -38142 -27790 509 25970 41620 85716 58773 15720 53406 65195 -7300 -30183
8211 -30183 -43888 -52889 3732 24792 -30606 -63929 -64631 -54859 -40868 -75207 -100101 -53158 -4705
8198 -4705 31934 -12992 -59942 -73725 -45228 -64663 -87320 -71662 -20534 24253 -50396 -68958
8186 -68958 -23537 6918 15087 2849 -31705 -45613 10149 36904 48027 -762 -53665 -62826
8174 -62826 -15159 -50425 -40789 -58898 -92787 -60912 -41637 -31791 -42098 5075 10693 -10596
8162 -10596 -41719 -54042 -60639 -70786 -72457 -51963 -18547 44503 82437 92250 65298 -4618
8150 -4618 -10807 2206 -33739 -71918 1562 21631 -47586 -50946 50591 86832 38422 13078
8138 13078 29189 10478 10956 33853 99646 62948 17581 -50330 -31286 37781 16627 -52047
8126 -52047 -16106 27229 58060 100526 79066 11831 -41292 -57007 -29857 -49937 -51479 -75796
8114 -75796 -68054 -38732 -82247 -105471 -82034 -62300 -62053 -96437 -108084 -70113 7062 37223
8102 37223 31749 -11972 -27218 -8365 57052 28922 51482 74031 49004 11438 -57788 -55007
8090 -55007 -70966 -60083 -4780 -38913 -71742 -89441 -109820 -70993 -47215 -38248 -58638 -59042
8078 -59042 -60359 -45975 -25504 -50507 -26599 -34796 10869 61603 112864 20290 2281 -21266
8066 -21266 -50552 -67564 -24392 -10298 60002 37094 22648 21279 28041 -1948 -17272 -24597
8054 -24597 8581 55757 60989 18272 -45354 -95072 -118058 -99831 -75678 2766 -16846 23257
8042 23257 11165 -50766 -79245 -64851 3955 91871 79794 76827 50384 12251 -28907 -40481
8030 -40481 -26497 52256 -44825 -146312 -149566 -135144 -60187 35009 29911 325 8695 57375
8018 57375 25918 -552 3585 7802 -10446 -22652 -42203 -59529 -30171 40113 53791 8350
8006 8350 -4862 -39882 24421 31404 12049 6113 -11400 -1942 9209 23515 -27791 -6354 56491
7993 56491 45994 30757 31959 53354 58636 38239 67132 73221 51451 61177 50880 58151 43913
7980 43913 -8908 -26401 30975 64472 41119 8647 9487 35614 73644 41757 -8418 -19072
7968 -19072 -42560 -10570 -55779 -40722 -44162 -81831 -67982 -18087 -21543 15304 17142 -10681
7956 -10681 -10728 35081 10324 -30438 -34164 -62049 -44366 -2667 25113 -27687 -32554 1210 2649
7943 2649 2343 6027 14617 100510 110871 110143 74696 40606 7983 -43595 -49824 -3729 -2465 1185
7929 1185 24276 8320 -8547 -41102 -78262 -75525 -9420 24060 -21575 -75406 -46081 -71634
7917 -71634 -78418 -42304 -84059 -47909 -49133 -97886 -44777 17702 -13044 -9458 -9203 4771 -15714
7904 -15714 -5063 47891 28472 14624 18034 -22111 -19614 46913 51296 -54474 -101449 -61865
7892 -61865 -40706 -3553 -16 -31228 -18955 9589 36092 94597 120579 122415 135941 124792
7880 124792 39684 -816 55289 69393 70881 34161 2443 -49143 -13999 50685 72887 79422
7868 79422 72081 23112 -17093 -42879 -52095 -62967 -14237 -17864 -27524 -22994 22279 64735 5932
7855 5932 -17558 -30606 12361 17405 31445 50040 9675 -4219 -10281 -34375 -89348 -89407 -29451
7842 -29451 3820 -20710 -39330 -56892 -40943 -85353 -77947 -64373 -45940 -17371 36375 85918
7830 85918 47315 -8914 -4806 52261 78023 52832 39183 52247 47514 36502 63699 -2296
7818 -2296 -86412 -66033 -59222 -17363 -16442 -29855 -37877 -13598 -7790 25921 23015 40098 20903
7805 20903 54609 81870 74285 9463 -25777 7378 60255 57658 141246 123627 66806 28037
7793 28037 -4827 -55836 -20134 4516 18707 13676 -69432 -89611 -73508 -44100 -8370 10941
7781 10941 79362 27226 -33306 -47770 -24713 -26131 -11853 -5492 -21956 3677 31387 52717
7769 52717 66070 86246 99402 104518 77131 28261 40994 8207 -15799 -43681 -35743 -6561
7757 -6561 -35654 -13777 -9871 -52630 -93593 -74243 8353 12311 28311 -5143 35447 109821
7745 109821 100185 90822 74914 27942 12400 -5332 -7769 -31668 -74218 -44961 -24907 2621
7733 2621 -11340 43736 18306 -49636 -25931 -20230 20009 35449 18128 -40085 -77493 -66976
7721 -66976 -23505 63358 92069 15135 -24162 -1261 4803 -54824 -17846 -19229 -35627 4570
7709 4570 -1235 -27437 -24768 -10638 32361 5849 -49392 -41566 -73507 -78667 -5325 62139 40766
7696 40766 -2637 -16396 -35787 -28600 -16302 -14864 -21402 -8739 -27559 -20525 -27783 -60028 -57405
7683 -57405 -74174 -80762 -87356 -86817 -54308 -64873 -50188 -48667 -56143 -30267 -23361 -8689 44047
7670 44047 71610 23534 -42445 -88676 -68440 -33184 7405 49385 -11396 -11327 -9023 -6438 -15721
7657 -15721 -27187 -57518 -60872 -39502 -13835 511 23403 -26613 -20290 18941 13888 19124 22542
7644 22542 36317 75861 30861 16381 28245 -8025 6098 10644 16593 -3055 24916 6104
7632 6104 3868 7822 -30926 -52030 -13317 58023 28757 -43593 -70844 -61380 -36425 6827 -7225
7619 -7225 13297 65298 56261 55949 102417 123643 64484 25539 57083 98959 42162 -52138 -24685
7606 -24685 49556 43144 -10151 -54441 -109619 -98994 -83230 -66157 -63816 -65689 -43896 8408
7594 8408 15561 6137 27085 34847 17029 -15810 -70787 -69895 -97968 -134348 -153320 -122262 -89079
7581 -89079 -110890 -57349 622 -39474 -31937 -4232 20575 -4422 -20233 -11427 1081 19106
7569 19106 -4126 -45533 -42060 -22593 -21373 21608 67100 87500 70952 95608 75566 69905
7557 69905 10220 34002 80284 69623 -25188 -57189 -48815 -46219 -43706 -44128 -19718 -33785 -44862
7544 -44862 -69874 -87189 -104220 -105603 -7878 56439 34919 -40902 -22863 -6346 -16119 -22767
7532 -22767 -26576 35435 21426 -31083 -29799 -55559 -66633 -68678 -60174 -37431 -43001 -31050 -9821
7519 -9821 -55456 -82254 -106261 -44464 17515 -11059 -4603 1997 57367 36039 -55125 -76898
7507 -76898 -41886 6591 -19400 -19355 6813 18703 -12289 -39697 -48724 -31210 -30185 -17109 -9271
7494 -9271 -3147 20428 32426 -2269 4200 8326 26283 24201 -37029 -85032 -89547 -98316 -80986
7481 -80986 -53193 -49524 -28340 -7397 20247 36220 32456 7018 -43761 -45172 3743 27746
7469 27746 58673 14397 -17743 30230 67299 65129 61018 66081 37119 -7111 -23304 20788
7457 20788 41678 45475 14211 -52680 -73416 -133788 -172758 -119865 -42891 6574 39710 49292
7445 49292 16896 10197 62727 124623 139104 71622 24809 12500 -11380 -15272 5898 2849
7433 2849 -32374 -12815 -2142 -26538 -37799 -5895 38232 -32762 -56152 14809 48955 2134
7421 2134 -43769 -42266 -73913 -83628 -51627 -32451 -68439 -33749 25308 12246 46498 55121 34966
7408 34966 -5625 -33219 -65551 -40558 1057 30343 30036 18247 -15562 7801 39906 11560
7396 11560 -47032 -34188 42332 72660 1295 1983 -2346 8350 -5193 -16055 -38819 -29594 -64451
7383 -64451 -63705 -57709 -58634 -54081 -20454 -21472 12203 -883 -52231 -47583 26161 24972 -31848 -104726
7369 -104726 -117380 -79379 -30723 -19447 13751 49993 83110 31172 -1146 15019 51093 65676
7357 65676 16421 -33508 13641 62938 85644 66660 25932 -33575 -50539 -67373 -66272 -56309
7345 -56309 -102655 -108984 -30777 -11219 3593 32774 50283 -14742 -39868 -19965 6920 5247
7333 5247 958 50891 16814 20102 43526 65201 78798 100193 191616 155323 97817 82981
7321 82981 53864 -8487 -28687 6871 11069 17358 6287 18944 68097 100949 78928 79081 36388
7308 36388 -12185 -5167 83592 105655 35435 -2451 8374 40944 43072 10478 -30756 11453
7296 11453 45137 49750 86509 71982 31638 45657 17335 17771 25972 -8267 -13294 16193 -12659
7283 -12659 -26852 -56809 -65820 -86068 -54234 7715 59864 30539 34803 8462 -15712 -336
7271 -336 -5690 9440 773 17868 60018 60021 -19333 -13865 -56977 -58146 -35204 -93831 -190805 -145810
7257 -145810 -152220 -90562 26652 48836 -2058 -22691 -58769 -51862 -59526 -26872 -22162 -65326
7245 -65326 -36090 -21102 14321 42255 13590 -35038 6312 54426 63894 -15256 -58481 18342
7233 18342 52471 61978 95554 78761 54702 119277 133678 132362 59064 31217 -3806 -44637
7221 -44637 -18286 34527 26539 20313 -7819 -65896 -90287 -95708 -52524 -30167 -57193 -73564
7209 -73564 -78400 -56999 -41799 -29945 -2896 -33289 -65571 -71699 -41988 -31329 14944 54712
7197 54712 73804 87885 64416 37087 34500 47031 13289 -400 48532 66692 92257 51935
7185 51935 99013 107517 86099 67638 7418 35565 31463 3322 -34929 -36533 -72090 -110265
7173 -110265 -78242 -7625 5254 4165 -24060 -57220 -65339 -108221 -117532 -107045 -110738 -146223
7161 -146223 -89605 -58263 -61281 -89065 -109958 -111371 -137690 -117220 -67257 -80481 -40588 59834
7149 59834 137799 139128 114272 102204 63234 63839 81274 28073 36638 85901 93549 82772 12163
7136 12163 -6704 -5866 36170 21930 52162 12563 -44806 -5681 9827 11214 -42590 -106944
7124 -106944 -56176 -13457 -33519 -61607 -61144 -53734 -17474 49003 83179 31999 31168 16457 43305
7111 43305 78302 79924 40844 22462 33023 67459 8948 -62829 -45841 3516 29847 -49306
7099 -49306 -140470 -111981 -35058 -4853 43739 24561 15534 -19408 -24681 7036 -23521 -3848
7087 -3848 63308 -11958 -98448 -67725 -20947 26539 43797 31359 47145 69471 77734 113349
7075 113349 106117 25852 -13708 -25301 -52644 -2653 18104 31267 64899 53020 65910 73308
7063 73308 18692 -62108 -111011 -69611 -123315 -110675 -78773 -70622 -23383 36952 44554 -17708
7051 -17708 -88863 -97313 -69531 31935 66653 26547 -17674 -24690 40249 68461 52458 20559
7039 20559 5793 15265 9093 9448 -31861 -52493 40784 73138 50892 22727 -4902 -21551 -5359
7026 -5359 15704 28476 36692 39649 68638 53047 -18144 -23399 -22855 12517 -5039 9119 -7077
7013 -7077 -48980 -70276 -61221 1711 36579 22726 1880 8783 7865 -69471 -50472 19204 -23563
7000 -23563 -41518 -49007 -12484 31721 6990 25562 85367 47190 -6712 -31049 -19487 -74650
6988 -74650 -92042 -146498 -140496 -89118 -89177 -71992 -66203 -59211 -24004 -31012 -3027 -7020 -24711
6975 -24711 -5197 6254 13018 175 70184 86071 66330 67386 25292 43096 6818 -38329
6963 -38329 -8915 -35957 -58637 -55518 -43297 -42714 -56562 -79497 -47512 -21129 -28719 23047 35505
6950 35505 20776 -15158 -8512 -8800 -19637 -39272 -48830 -38090 1064 -6469 -16003 10530 5461
6937 5461 -6698 17498 36400 -20404 10278 69699 111674 120061 57786 -20210 -77777 -123801
6925 -123801 -111643 -78164 -31029 -47796 -85407 -88254 -71088 -33205 55806 103943 103139 55998
6913 55998 39682 1363 -17672 -44466 -36605 33430 44421 43298 51986 79026 80317 66556 12258
6900 12258 21008 63135 20672 -29793 -20550 22137 87625 100204 89153 43644 40605 74268
6888 74268 77098 67931 66619 87599 85108 34806 -7453 -31575 12760 -7456 -62972 -44232 13251
6875 13251 2688 -89333 -108353 -60686 -63647 -59960 15956 27407 6409 31827 -61633 -110359
6863 -110359 -76204 -92824 -64678 -53642 -5368 11015 41740 45537 80841 103474 14828 17576
6851 17576 35818 44486 42416 39115 21886 -39176 -63048 -94358 -44626 11122 28664 3350
6839 3350 -1126 -29281 13410 82357 49303 22887 17506 56367 104000 2779 -83427 -77130
6827 -77130 -119176 -133529 -94807 7780 6231 -10183 8632 25079 -82 -32967 -32431 -5688
6815 -5688 -32125 -37044 2633 16535 31234 17357 -45612 -67209 -86903 -126636 -72764 -21194
6803 -21194 15979 6238 4769 -9067 -52706 -66512 -56566 5675 79353 170008 163270 123105 35750
6790 35750 -2107 43209 26579 4425 -23692 -32184 -23098 -39617 -78536 -78385 -63559 -26102 -54341
6777 -54341 -76899 -107081 -63267 -55027 -58108 -1553 51627 2772 23875 81435 64282 51592
6765 51592 66313 48855 55221 51214 71061 43314 34839 72831 70347 28261 115621 131965 80537
6752 80537 60640 76655 138823 134436 58110 -5387 -14734 -4661 -11118 -18645 30146 49862 29825
6739 29825 35731 50308 -4971 -18053 1447 43864 8665 40056 116987 173763 201039 152154
6727 152154 92355 67719 87817 100165 131942 180390 152517 104745 19227 36907 24533 -6316
6715 -6316 -47423 -5566 316 -27037 11515 48794 32582 30507 42494 110217 144815 150578 104573
6702 104573 67500 74016 37077 2153 33558 41390 -2393 -34472 -40995 -72908 -70198 28490
6690 28490 66357 -3215 19371 35920 68786 30801 -24737 -39335 -50671 -53361 -2120 37106
6678 37106 -32512 -53484 -26248 -70415 -69516 -101238 -134696 -117332 -31280 8553 28619 21008
6666 21008 16713 23482 15921 -2021 -10613 11899 24821 53265 30239 13256 72308 52403 60317
6653 60317 83643 53600 8802 -8603 -12571 2602 42981 46217 -16656 -3723 16151 -9121
6641 -9121 34074 75929 28212 -12508 48141 96870 54990 -18443 -36878 3311 -20970 -96478
6629 -96478 -69664 -47546 28679 34836 -27170 -58781 -33295 -12208 -7303 -4665 -21540 -8868
6617 -8868 49896 96405 97161 70567 21618 62936 71941 105273 77684 35878 20779 19527 41347
6604 41347 43486 39748 33414 -73535 -92460 -53704 -22216 -18235 -61250 -125062 -96009 -35647
6592 -35647 25059 40693 -17554 3556 -5535 3643 4937 29170 -2942 1512 35395 4900 -2721
6579 -2721 73520 84692 33684 -29487 -55193 -45344 -47111 -43897 -104437 -132209 -135995 -64145 -30505
6566 -30505 27350 47102 36800 25312 -29846 -83408 -81387 -59082 -8795 31674 57326 83557
6554 83557 71206 18969 -55125 -11284 5955 67399 38796 -28915 -62161 -82480 -79293 -82675
6542 -82675 -101547 -156631 -151810 -139364 -136136 -139754 -115012 -83539 -42259 -53797 -78815 -63559
6530 -63559 23422 72074 58117 100318 116505 84591 30065 -26471 -9286 -3472 20266 -21142
6518 -21142 -70008 -41320 -11434 -34464 -38922 -25760 -30468 -69040 -87208 -65258 -56823 -36748
6506 -36748 14843 36272 51548 74143 19336 -71549 -112641 -106892 -35763 -8505 19833 10381
6494 10381 24758 49181 46641 96576 148469 165025 157801 120307 72222 69524 40057 60450
6482 60450 50407 18686 41527 85138 67990 30484 27369 31703 -937 23874 49451 17174
6470 17174 12069 17720 15535 -1255 10156 8871 18628 16502 -1232 -40004 -55056 -23790 -18245
6457 -18245 11727 7735 -48257 -58501 -7688 9183 22342 69661 65780 11873 -32509 -1244
6445 -1244 23671 -17393 -40678 -22221 10787 69517 13116 -14608 27306 32774 28279 11902
6433 11902 -3920 -29161 -103372 -199161 -139065 -74404 -48349 -9001 -2182 -35732 -101404 -139927
6421 -139927 -99973 -116103 -70088 -36177 -15572 39981 -25620 -88945 -83385 -50913 -26349 -49133
6409 -49133 -75207 -78564 -78945 -89185 -84850 -21212 -59896 -87774 -18428 3598 32506 79132 18659
6396 18659 -38403 -87846 -61079 -87761 -55075 16920 35719 -17874 38428 98720 92570 92087
6384 92087 34592 -29686 -17572 7239 2096 -503 27802 7687 -14136 -2454 6460 24909
6372 24909 -7142 -30123 -4304 -45015 -42667 -47445 -12074 47089 77681 51626 37770 24545
6360 24545 3309 50288 109870 2753 -27402 -11091 4790 4189 -28638 -2035 -587 -8592
6348 -8592 -13318 -14994 -31175 -66017 -69982 -14391 -8147 12327 38526 35369 40403 54267 30009
6335 30009 -31394 -62296 -24517 -37538 -63907 -69115 12766 38034 67859 44749 10442 10276
6323 10276 -29446 -57579 -55064 -22576 29902 21809 21604 -70658 -86296 -55793 206 17245 -55627
6310 -55627 -73756 -64892 -17058 13853 45782 34234 -9654 -86566 -79482 -72092 -37469 -8495
6298 -8495 -19773 -23275 47308 100871 114268 108869 88237 44945 36796 50592 65412 43608 -12154
6285 -12154 17674 -9601 -4440 -18226 -6121 -34452 -1266 49019 -555 -21487 -39851 3091
6273 3091 18533 -7314 -11826 -7838 33000 36029 41373 58073 42811 -3882 -52193 -75306 -34448
6260 -34448 -14177 25054 -19817 -80354 -94185 -48840 -4982 -25328 -28738 25899 -2091 29415
6248 29415 31165 -34391 -64570 -82380 -104734 -150719 -104327 -73904 -67394 1995 18097 70881
6236 70881 99828 87979 41079 58004 121261 154674 123720 74419 85275 96949 73999 63183
6224 63183 33171 19312 32518 -23530 -31176 -17222 -69488 -94064 -100483 -128623 -130123 -79982
6212 -79982 -37977 -28156 -31105 8015 -15429 -46849 -31341 -54900 -53078 -21896 -18323 -21458 -31330
6199 -31330 -44688 -49356 -67 -15507 -64280 -74760 -70849 -30234 -37626 -45264 5073 48399 74441
6186 74441 61774 61027 21113 10132 -8262 13685 49433 44426 35086 42899 -16453 -13938 25617
6173 25617 33807 -12546 -6047 -9993 -30596 -30089 1344 36108 79059 84284 58654 59541 27835
6160 27835 43958 47354 7639 33114 65926 69354 3549 -29693 -46692 -97424 -108243 -86205
6148 -86205 -22187 -19401 8307 1652 -4169 24138 -50825 26170 124492 149666 147934 143832 165354
6135 165354 73338 316 13817 -12021 -33946 -55551 -77651 -66409 -56332 16121 37772 27715
6123 27715 20042 -41826 -77885 -90399 -74163 -44550 -66671 -14817 3858 -11603 -17133 -35964
6111 -35964 -27637 -31551 -45258 -71055 -84442 -68703 -51977 -60760 -5853 85421 85989 58455 35610
6098 35610 13211 -10361 29964 44215 11643 -6601 -23127 -64660 -98164 -101853 -50086 -48313
6086 -48313 -64821 -43155 -71249 -108160 -94283 -62184 -64375 -94783 -96393 -131973 -118249 -89247
6074 -89247 -84297 -113905 -86731 -119995 -72627 -60360 -31173 -51470 -82447 -75701 -45237 -37526
6062 -37526 -53030 -22355 -36073 -72952 -55977 -79013 -68335 -78412 -94287 -102991 -64699 -24600
6050 -24600 -10025 -29778 -88958 -63574 -40563 -8123 6057 -19095 -69695 -49832 19419 61037
6038 61037 18271 -43607 -60112 -8814 -25744 -25944 39551 13473 -21715 -34046 17052 21180
6026 21180 -25296 3864 25689 17957 -27028 -26056 35331 54645 58717 11525 -81444 -77104 -53944
6013 -53944 -48786 -85488 -45706 -25182 -30286 27451 5189 -43417 -78911 -90348 -23247 23440
6001 23440 -30764 -51396 -31876 -75647 -37328 16875 -5361 -7070 40699 44565 -10854 21253
5989 21253 -19004 -58755 -77018 -77408 -70401 -76041 -68114 -60998 -82489 -86307 -41183 -17764 -31973
5976 -31973 -102259 -66635 5923 46624 48359 39486 40560 2391 -4907 6519 -58640 -73796 -70702
5963 -70702 -61540 -106725 -137910 -73716 -45763 -51881 1795 -23730 -110813 -83413 -72229 -119406
5951 -119406 -83160 -88355 -62470 -31641 -21740 13598 23162 20910 34018 42464 77367 113636 139904
5938 139904 38224 -74155 -110296 -74149 -21160 -37649 -72842 -34031 -12642 756 1485 16153
5926 16153 8532 -39470 -32656 -16255 -1189 2061 30721 89236 150989 115441 -1437 -53299
5914 -53299 -95651 -71157 -53866 -51644 -34445 22325 2831 -12609 -6937 -2580 56472 67792
5902 67792 36322 -62702 -52527 2711 -55877 -101057 -89707 -15563 -2340 -51712 -7233 36553
5890 36553 20550 -14443 -40249 -34051 -46988 -99492 -89128 -17531 -12155 -8501 16649 41472
5878 41472 48114 61513 119279 113752 93172 86225 108975 88314 2529 27007 10708 -29327
5866 -29327 -2274 12570 14155 -63166 -48679 -74672 -97354 -18634 7395 56587 147125 129251
5854 129251 154063 199347 180115 72410 13841 13277 51791 57374 26624 27299 3170 42435
5842 42435 12433 6663 -38927 -80744 -56613 20849 79939 700 -27458 -14755 -1411 -72368
5830 -72368 -55247 31296 89306 74370 73461 72076 4524 -16158 -53581 -35503 8979 28338
5818 28338 20354 -12987 -66770 -109473 -67259 -22854 68300 70878 -47594 -75165 -47603 -61053
5806 -61053 -23146 -6131 20346 14686 38561 -3877 7413 -5028 25814 35290 26896 -8380
5794 -8380 -3750 24401 9401 20473 9386 -4163 -53712 -74011 -49117 2980 -21601 -45039
5782 -45039 -9961 -25283 -41629 -19118 -35541 -394 398 -32368 -72562 -37180 -6508 -3800
5770 -3800 13740 50331 21936 27502 52709 35950 47937 67792 80163 85919 27312 26078 37744
5757 37744 45724 5781 20798 11075 -5072 -37879 -75835 -85938 -122572 -89998 -59928 23539
5745 23539 29568 -11604 -20690 -13415 18285 71054 108380 103262 66029 35730 41233 98889 50975
5732 50975 67866 84724 52740 38893 9851 552 3380 54199 37263 6386 -3385 6880
5720 6880 -21411 -42492 -20910 -62954 -58242 -41127 -17616 2007 23094 66773 52868 -36108
5708 -36108 -64644 -27094 41880 71731 82209 69270 8674 14051 2865 -12949 19088 -18448
5696 -18448 -56513 -48282 1466 40346 41454 34767 31303 76095 80132 -6097 -69750 -78656 -13722
5683 -13722 3030 -13717 -28117 -31604 -88221 -122251 -98615 -105503 -120630 -90739 -56354 34032
5671 34032 56498 -19472 -75879 -68773 -12473 35387 -53610 -82828 -90829 -49208 17636 -71798
5659 -71798 -95967 -70585 -69389 -27732 17736 41657 59083 52062 88807 121765 81521 31379
5647 31379 -6023 50176 70032 57548 44063 -28957 -53252 -37885 -36763 -69338 -45007 11615
5635 11615 -780 -53762 -29721 2811 36910 125908 126667 63552 51053 54948 57706 127221 92294
5622 92294 131764 154360 110521 70864 35508 10238 -8907 -63628 -42173 -36722 -27679 -39554
5610 -39554 -43210 -23651 -34528 492 31351 -25301 -102584 -69213 -17118 26450 -17244 -38152
5598 -38152 -3716 57097 89040 116141 114985 110605 99894 87689 61000 35667 -52066 -64203
5586 -64203 22562 37373 26785 39826 61370 -2923 -17951 -2600 45762 61655 77955 83571
5574 83571 57383 27922 29231 33573 7248 -11390 947 38564 26917 -52659 -27211 -7951
5562 -7951 -12463 -20348 -8947 24906 33625 2681 12520 -6474 -40306 15930 46589 60745 22193
5549 22193 -54617 -52558 -29810 -26973 -23025 -45159 -64367 -28889 -36722 -95698 -65200 -54783 -29127
5536 -29127 -61630 -36596 23290 61686 62583 97568 95570 -22032 -81003 -14510 -12676 -29045
5524 -29045 -23444 37940 50392 76266 115671 71944 13895 -41415 -36143 -17047 13137 45110
5512 45110 29311 32910 -28392 -63673 -53345 -40261 -42749 -22421 -23 14725 -12005 -5966
5500 -5966 8241 -23102 -57996 -26489 -11889 -33094 -24568 31085 62256 90366 92499 92452 81811
5487 81811 16517 3863 62603 75030 44204 13919 -149 16302 56187 27885 13491 58804
5475 58804 58214 20700 16315 10907 35599 -8071 -49536 -48317 -1851 -7165 -7173 -52281 -45062 -24826
5461 -24826 -7724 21816 -24892 -116171 -86822 -45191 -7352 -50216 -86365 -35426 2198 -5982
5449 -5982 -9185 -16806 -6979 -6126 -7063 44889 78662 69852 29814 31250 -6168 16327 32438 30828
5435 30828 15967 -58713 -77577 -76834 -30284 8452 34555 51936 84237 103043 59738 12331
5423 12331 -9035 -17113 -93410 -102969 -50566 336 19955 23743 40075 34729 95896 151812 96486
5410 96486 49304 10799 12550 42475 37014 -15370 -7024 18279 25257 -11578 -55997 -41551 -74539
5397 -74539 -65727 -28560 -40719 -24346 -12460 1312 -24496 -81363 -66340 -27269 -28900 -60326
5385 -60326 -80117 -78632 -52498 7749 -15256 -74841 -83909 -60281 -65873 -38052 12717 34377
5373 34377 8671 -28046 -9221 -37047 -22371 21050 -37587 -24941 13437 2662 -2392 -37095
5361 -37095 -92295 -61874 -60769 -32206 -87258 -36608 4626 42070 33925 -16176 -62775 -62659 -11184
5348 -11184 52127 57507 -5697 -38932 28662 68843 62154 37512 67556 14328 1725 9257
5336 9257 19252 26535 60700 93740 51230 30595 46319 -7254 -58005 -47520 11242 54510
5324 54510 37818 6353 -19580 -1096 45084 -13398 -84489 -51555 -31398 -96579 -104257 -58367
5312 -58367 -21708 -69154 -116907 -127289 -131794 -85188 -58271 -14160 60503 26724 -21759 -56561
5300 -56561 -47868 -39818 -35550 -62088 -97336 -122425 -139897 -82472 -39250 -38468 -12448 33475 70124
5287 70124 77196 96293 64241 50697 35257 19198 75305 76416 73028 -5138 55122 66387
5275 66387 86463 140120 139335 71027 83229 46041 26300 48388 66449 65838 29663 -21524 -65459
5262 -65459 -58174 -29567 -34845 -28303 -1509 8555 28132 323 -57961 -75079 -33007 -52017
5250 -52017 -38362 -38407 -77553 -71903 -44423 15215 24721 -20566 -32180 -98360 -141307 -130067 -87465
5237 -87465 -19198 74737 73211 5874 -62314 -92795 -109281 -82908 -16416 -40166 -42077 -17308
5225 -17308 -43569 -46146 -56434 -42966 -1604 44979 59166 374 -5472 -12377 -17234 -2658 31094
5212 31094 77679 99868 97337 140054 143937 109350 73333 39298 -56824 -98378 -51826 -20269
5200 -20269 -49028 28275 23235 -29770 -34871 -119616 -126083 -53095 -87989 -93701 14586 75347
5188 75347 69756 34614 -4569 -53471 -79213 -29662 -23165 -59586 -39673 -74752 -103275 -13441
5176 -13441 27982 78340 18264 24000 20772 17112 -15026 -44399 -4413 3625 21949 16306 17007
5163 17007 -2689 56344 52246 41826 -21878 -47717 -24288 17434 33133 47491 58990 58117
5151 58117 49142 -17288 -69853 -99791 -58305 -10106 -30320 -21403 46730 82111 47967 76014
5139 76014 89346 83987 61300 82 -47619 -60427 -53847 -32490 1356 5474 -74402 -59881
5127 -59881 -1176 51283 78789 57454 39272 12868 67632 103620 117536 81372 50394 17800
5115 17800 10270 16246 12414 29174 27358 9349 -7827 2960 40373 82640 71856 53571 12848
5102 12848 -9550 -21494 -22818 2177 16304 18833 57540 137074 175455 164643 71900 44989
5090 44989 71176 78218 32672 -50034 -92764 -70655 -106484 -84077 -25452 -42169 -50413 -34191
5078 -34191 -4804 -6954 -21098 -28751 14967 22930 10115 -26407 -49502 -58739 -51257 -38467 37790
5065 37790 43006 5746 25667 33240 61828 138541 144446 94626 32334 -7868 -34049 -70105
5053 -70105 -12237 19918 -66316 -63942 -21290 -26580 -66044 -40586 21678 -19093 16842 15122
5041 15122 -9193 45116 62121 25737 12672 78985 100431 92561 80486 25220 -20502 -6643
5029 -6643 45566 22766 -16392 -63506 -127405 -76749 21355 26828 -28531 -34712 -32124 -58118 -72201
5016 -72201 -94968 -16982 72728 62599 31018 23760 47795 40773 74386 52269 49938 -12
5004 -12 -1757 -1654 8510 -9767 -5852 -31038 28535 51671 41526 10537 20747 24870 27767 45233
4990 45233 -13459 11251 115230 155054 153170 105740 54001 126 -8779 -316 26868 101187
4978 101187 127849 83258 67964 90933 93181 119819 108753 64775 39102 46881 109158 125383
4966 125383 83261 63338 38780 -7615 -367 -15583 -42169 -6270 -75456 -104775 -94479 -84884
4954 -84884 -60651 -28483 -19046 -6509 -58246 -50790 -19864 -20929 -15253 18698 10700 54266 31166
4941 31166 -45387 -8186 -21626 -8227 12561 -26216 -37378 2960 -34640 -115201 -80282 -52860
4929 -52860 3676 34066 3645 -765 49210 54326 18998 21699 28140 43743 54487 38235 55926
4916 55926 56650 -13691 15576 -14563 -6085 -23401 6 26578 -21814 -18653 21474 14741 -19848
4903 -19848 -35761 -11059 -45167 -40814 2064 37832 27856 -6168 -47687 12768 78781 60137
4891 60137 -61796 -80192 -38533 -57455 -73917 -42944 -34490 -44680 -45553 -33387 -2081 26381
4879 26381 -4249 -19002 -395 -23064 5419 -31606 -36582 -36322 -47736 -4628 42634 10213
4867 10213 -10384 -19012 -39567 -48547 -45254 -9912 10803 -22549 -55578 -54152 -67055 -58465 -62305
4854 -62305 -73325 -6763 62962 43207 60546 17804 35770 66336 426 54586 81427 86866
4842 86866 83889 59669 74939 61268 80404 73680 7160 -28894 -57875 -45971 -12757 19470
4830 19470 32837 39681 20332 -11104 -42589 2879 14464 28089 31425 -14296 -12706 31193
4818 31193 85683 38278 -8867 25992 19660 30790 -11270 -41247 42555 62380 26013 -13591
4806 -13591 20456 30969 25745 29311 -11162 -31571 -8131 17449 25202 24258 -10587 -36417 -43733
4793 -43733 -58147 -9025 -17662 -37325 -27309 -105327 -151194 -39614 -5385 -40570 -23451 -18302
4781 -18302 4453 -26072 -60455 -41086 40818 46700 62615 24633 4281 -46156 27469 85495
4769 85495 83447 53770 37936 37255 38201 -30601 -27706 -15273 -9121 3432 37349 53954 76843
4756 76843 41693 82426 99133 97728 59019 -17189 -18115 15804 60882 -12531 -77456 -61923
4744 -61923 -32327 -43220 -51502 -35005 -15862 7194 41886 5051 -18627 -72016 -82696 -11617
4732 -11617 6914 -34189 -69388 -57754 -103519 -126089 -83727 -39783 -22870 -31778 -59066 -52322
4720 -52322 -37581 -31261 -74137 -60695 -96122 -96972 -72059 -56085 -26929 15185 24460 8360 38186
4707 38186 30974 47747 -30335 -108010 -83349 20107 56011 17606 -22704 -2765 15829 25730
4695 25730 518 32254 106136 119494 56563 -17557 -61210 -75355 -11131 7873 -10026 -27830
4683 -27830 -49107 -6895 -43742 -27826 -6641 16885 31473 34893 58143 85098 83351 38074
4671 38074 14682 51756 53675 20619 -32964 -4431 42739 -1806 -20471 6595 3416 10161
4659 10161 -9767 7221 24605 4141 -38653 9213 21239 17773 27634 43207 8494 28165
4647 28165 52929 24602 13064 -71331 -51527 -28085 -64672 -33803 -38507 -65618 -65326 -34815
4635 -34815 -1640 -38786 -16450 12579 38265 59860 6105 -53279 -25610 7620 18805 28906
4623 28906 10354 -11146 -52640 -33572 -15245 -16301 -65998 -87912 -40063 -7067 -26627 3925
4611 3925 40052 73317 83839 58620 61501 82390 116702 46453 45793 41436 26663 47227 37884
4598 37884 62662 84404 77038 55547 62023 63571 92498 17964 40533 68479 57968 25806
4586 25806 -10172 -26567 935 -55153 -70876 -38431 -102218 -95844 -86336 -103502 -82191 -52984
4574 -52984 -43377 -45594 20289 44413 102911 110076 109357 50200 -19785 6905 83941 141921 81802
4561 81802 53020 -1429 -71841 -34514 -9295 36741 70245 40485 57913 69912 50415 93073
4549 93073 87222 38141 3007 -20249 1133 -1431 -43861 -75874 -79655 -67691 -56119 2856
4537 2856 56141 47444 45994 45755 7112 -11378 -72062 -43943 -179 22645 24956 -36975 -92387
4524 -92387 -116389 -53654 -107 67938 80704 43753 14278 -29050 1116 -8708 48837 69834
4512 69834 88600 51155 -12505 23911 3204 -22953 -25623 -24036 39553 40684 -52150 -129917
4500 -129917 -102991 -11186 -16196 -37366 38936 14459 -30094 -65165 -79873 -87814 -94475 -87073
4488 -87073 -49440 -32701 -5531 -2157 -59618 -95985 -46235 33208 61911 92377 146047 101278
4476 101278 58621 2922 -13441 -40906 -61937 28978 16232 22908 25387 12163 -11176 -40799
4464 -40799 -86225 -119119 -95592 -178943 -179579 -129133 -109146 -91941 -71267 -15646 78439 64514
4452 64514 947 -28523 -35389 -44992 3701 19477 -942 -2174 -6576 -49200 -68596 -38247 -31649
4439 -31649 -17784 -26438 10475 -3063 -20820 -8497 24773 42609 77342 48805 53278 107747
4427 107747 102341 42204 -22244 -17117 -63225 -128506 -115943 -78230 -49233 3762 79078 77547
4415 77547 27080 -36984 -36961 14323 25072 38002 -1793 -51140 -42728 -31970 29378 493 -58140
4402 -58140 -32653 -37390 -28096 -41290 -44178 -61556 -7604 -53157 -32235 -12565 -77226 -69040 -48567
4389 -48567 -7930 22188 -18704 -52930 -93339 -130835 -120613 -57431 -23847 -63220 -50224 -21131
4377 -21131 45151 -15698 -53319 -35131 -15381 26906 37478 59605 47068 42587 124493 117114
4365 117114 65831 33926 15646 -5253 -27025 -14671 -42528 -30430 -39648 -62468 -72421 -80172
4353 -80172 -101256 -32813 90428 109835 53431 35455 14039 27540 24448 16937 4018 -20814
4341 -20814 -10764 -66007 -125901 -104639 -53379 -35921 -68277 -127537 -85219 -61825 -78525 -28374
4329 -28374 83039 86832 102671 90111 13262 -2359 -53233 -48244 6883 64649 54655 29238
4317 29238 63559 84892 44544 55908 54838 52928 -9516 -14902 20395 24511 -14168 -30694 -48056
4304 -48056 -81627 -83106 -21583 64203 36177 -43636 -118159 -101394 -55087 -33741 -62355 -118911
4292 -118911 -99938 -39261 -33922 -74467 -54802 -9120 24298 63942 50468 42383 690 -85738
4280 -85738 -64405 -43967 23772 65058 90923 61087 77613 55480 75491 105314 101029 24643
4268 24643 17115 41616 67151 14557 -3454 -41221 -84734 -74948 -74910 -72003 -77355 -41499 -28361
4255 -28361 92010 75950 18231 31711 32714 21127 39134 -20589 -48159 -55232 -27419 7016
4243 7016 52265 13475 24342 47944 -7391 12858 65639 80211 103960 118690 140729 100318
4231 100318 15174 15911 2224 -34368 -79857 -62755 -52654 -73530 -46921 -34522 -6691 69066
4219 69066 112830 92723 83919 45619 30339 86004 75825 80212 86265 21813 -5824 -35330
4207 -35330 -63388 -28417 19726 -39296 -77923 9785 82866 77701 23399 -7477 50525 48497
4195 48497 -19636 -14 27303 34422 24403 14624 -48128 -93868 -78806 -41092 35988 49693
4183 49693 31154 37655 -8975 3393 21054 68232 71589 56065 32102 -12377 -53509 -60190
4171 -60190 -68771 -37185 -6960 44807 10221 15120 30276 -3317 -33326 -89532 -72541 -2834
4159 -2834 21006 543 -17748 -38485 -58820 -415 -38227 -73890 -23243 72261 61689 -23262
4147 -23262 -35682 -86603 -133224 -128625 -79953 -27860 -34030 -38341 -52728 -23974 -23741 -22773 13003
4134 13003 33976 -8219 14227 24200 -29640 -9141 -40666 -29246 -21370 -40870 -5941 36466
4122 36466 17765 -59801 -67192 -56565 -73654 -77009 -1709 45001 57027 56811 -16062 -30759 -42844
4109 -42844 -70922 -49160 -42407 -25066 -1294 -33803 -56237 -59948 -39647 -68108 -112936 -130225
4097 -130225 -91407 -24059 13433 13907 6799 -17339 -1353 -31809 -48457 -31627 -50658 -101890
4085 -101890 -47675 -1587 25985 10211 -66464 -83157 -83529 -84540 -63294 -34303 43755 95435
4073 95435 38928 -9586 -463 7696 64822 3608 -35944 5388 -16101 -5879 22093 23074 8396
4060 8396 22451 -4793 -50199 -41656 -36759 -13058 -2134 11859 -17280 15038 38768 -4497
4048 -4497 -26046 -5340 -10760 -44575 -29295 -48895 -41897 -32047 -34938 -50746 -69668 -104370 -142750
4035 -142750 -125963 -35234 7253 29450 39141 19124 -51538 -114071 -34734 -5463 23834 39077
4023 39077 85727 63300 34541 12313 -30091 -53120 -36652 -50491 -61465 5180 63300 39898
4011 39898 77479 58705 -6328 -40251 -41073 -50090 -78658 -103771 -100384 -95246 25058 36514 53602
3998 53602 20518 42548 65236 -4200 -18905 -12409 -54940 -117256 -108191 -65789 -42751 -61256
3986 -61256 -43840 2455 -52728 -93493 -69912 3291 46064 84815 75505 51610 69455 85838
3974 85838 40239 92119 121019 99084 36716 71323 74834 54730 55740 17057 34005 29045
3962 29045 -37294 3126 14982 54685 50424 -32867 -66325 -71059 -20416 -6924 -24909 7531
3950 7531 2982 24839 61436 -46541 -101139 -69749 -80781 -84103 -91034 -129928 -78678 -14082
3938 -14082 37842 34052 8636 1130 24671 59517 76813 61507 80575 59615 46248 24781
3926 24781 45383 -32392 -42968 -57430 -91832 -85278 -91078 -36136 -22920 11775 30317 39564
3914 39564 30630 9015 -34778 -54348 -61269 -34998 -47486 -57032 -25305 8940 29123 69545
3902 69545 72562 72994 16426 -47525 7449 44685 14959 45588 17578 -8827 1997 52456
3890 52456 58353 -8938 -19666 31240 64584 47863 43745 49152 15824 27051 12530 -19499
3878 -19499 4177 60813 82655 33013 11642 60112 54290 42816 18414 -35992 -99722 -63349
3866 -63349 -63601 -33561 -29677 -83245 -126259 -74394 -8997 6453 54930 98308 73386 46368
3854 46368 33576 97270 74834 -3706 -50052 517 19781 32741 13453 20585 -34361 -36365
3842 -36365 11082 17848 418 26669 11195 -22713 -43653 -73508 -45654 -41930 -43697 -9542
3830 -9542 57710 -14497 -68789 1231 59145 16449 -47189 -56650 -66912 -25092 497 6719
3818 6719 197 -25996 -10083 56672 60214 84948 77787 15557 -9345 67542 101399 69621 8441
3805 8441 -78934 -79477 -112568 -43548 11608 71420 90362 8982 -31788 -29918 -34686 -80861 -120064
3792 -120064 -74960 -4613 -3559 773 2663 80649 98650 37871 -17666 -54171 -37047 44182
3780 44182 47539 52206 6103 -33103 -29812 7530 61234 92547 102861 65562 3461 2995 1389
3767 1389 50546 64889 70195 103546 104696 109118 59794 22768 -25856 -52966 -16595 -1638 -9506
3754 -9506 -10809 -20450 46266 59975 53767 50409 60071 104743 55323 20674 61982 33485 -52701
3741 -52701 6210 17547 9427 -30443 -40529 -78944 -51487 -26833 -82876 -107119 -44851 19701
3729 19701 47781 81112 87987 85083 80426 46482 47276 -17285 -45292 -101740 -105167 -63872 3285
3716 3285 -4963 11773 19354 17573 15994 20200 38943 27277 383 -44707 -56203 -44744 -12588
3703 -12588 -47028 -44716 -3492 39923 73192 53740 -4278 -49172 -41746 2281 11078 -7862
3691 -7862 -28776 -56989 -71643 -42159 11048 99479 88212 7236 -12700 -58528 -94239 -77822
3679 -77822 -40255 -14872 -49320 -80560 -86990 -52029 -93222 -94772 -80804 -108816 -83529 -7233
3667 -7233 -5804 22399 17114 -31486 -58292 -59672 36998 48367 9488 -54940 -113368 -68126 -30453
3654 -30453 25955 57741 57587 103398 63883 32257 37974 32645 10446 59562 113793 86587 28815
3641 28815 55901 63750 23129 -8604 -17698 4963 35585 54786 21651 15484 -8389 -45393
3629 -45393 -109499 -103541 -68100 -49933 -46501 -92900 -112898 -99992 -86331 -2649 122402 152087
3617 152087 71301 40679 29488 28404 101240 98251 121614 122330 90746 71798 29338 4631
3605 4631 -19407 -12492 4269 -12347 -39507 -17324 -35902 -43209 -55670 -53129 -85941 -64590 -71426
3592 -71426 -27566 -8116 -3572 -17924 -36716 21312 60973 71535 54646 40613 22698 3465
3580 3465 -4371 -61995 -109666 -105729 -100496 -70411 -176 24657 -1393 23059 -4695 -26482 -865
3567 -865 21325 -1707 -53896 -72948 -61354 -104278 -64807 -18407 8488 -15322 -41280 -28801
3555 -28801 -30960 -66214 -111739 -98457 -97153 -64511 60040 56858 -8166 -77881 -65553 -18748
3543 -18748 -18143 -48504 -55542 -48160 -14082 -7796 31804 16919 10519 38517 23849 27197 82162
3530 82162 66022 2537 10661 18299 -24673 -30681 -40159 -24226 3217 14918 10674 -4425 25172
3517 25172 68180 86091 112809 95442 92390 142735 75179 10533 9553 21264 5752 30007
3505 30007 66349 92741 54907 2747 5394 -42379 -91716 -41646 -5601 -88829 -44551 1783
3493 1783 41326 29848 19491 57705 82164 44086 53257 113136 132013 104536 95512 57274
3481 57274 65892 76406 68030 79147 75351 4089 11083 -26115 5630 8950 11011 3739 21340
3468 21340 1573 5750 62609 79907 103393 112380 87900 21590 -21296 3801 18834 -31165
3456 -31165 -47324 -47558 -53139 -65375 -98636 -113603 -81129 -51001 -49361 -44910 -80382 -41849 -10891
3443 -10891 -35492 -28029 -47401 -1065 13571 26527 1352 27098 54377 1648 14419 46735
3431 46735 73628 49116 5974 -32694 11262 81406 52059 14165 -6352 6200 58025 83984
3419 83984 106704 125127 96048 20499 -36438 -86387 -108940 -95216 -55604 -41774 29140 29114
3407 29114 -13031 2284 38389 38580 -16765 -12211 51221 54146 57587 58694 -24343 -15768 -13590
3394 -13590 -37290 -40470 -19715 23267 19360 5700 14826 61587 83091 83770 9296 -6152 -8725
3381 -8725 -16948 -7919 18981 24392 61921 44448 10431 -8986 34117 31011 -17621 -23897 5479
3368 5479 8935 -1403 43962 49212 25636 -14086 -1919 37262 21188 1189 10556 -6153 -11431
3355 -11431 9432 -59071 -78417 -62724 -83250 -99205 -84585 -79427 -32037 -40536 -34951 44240
3343 44240 76014 120351 58322 5247 35883 35631 -6825 10150 -3418 -11055 -45413 -29655
3331 -29655 -63393 -54956 -19288 -1188 -45490 -20211 1636 6231 2458 -45528 -135087 -171689
3319 -171689 -172112 -182459 -158830 -131451 -93125 -129794 -85491 22912 27485 11633 -13360 -59863
3307 -59863 -83184 -53417 -23747 -13366 76144 120605 105421 68599 62699 113226 59241 32498
3295 32498 36269 32686 67099 15394 18984 41995 68783 52273 -5022 -36243 -47964 -47532 -19553
3282 -19553 -665 3497 23148 51080 -2464 -53162 -51506 -7871 52840 39573 42756 78676
3270 78676 91363 49025 97329 150293 147114 166263 169670 166484 95698 60539 19398 31048
3258 31048 -4965 -20438 -12389 38548 72141 1259 -39650 -38674 -44039 -14079 49474 63634 34154
3245 34154 37552 74100 33349 -14465 -67253 -9171 53739 110650 87010 60766 -26617 2682
3233 2682 -6263 -52271 -44692 -20765 -29950 -26386 -47539 -30085 27449 -59 262 21960 34032
3220 34032 664 -20237 -2182 21078 -43138 -54557 -12130 -54096 -2718 59723 49594 1528
3208 1528 -41018 27029 54262 76280 70069 64819 15004 36297 61603 -10920 -37649 -41770 -7011
3195 -7011 13476 36932 74066 42536 57850 63363 71967 35780 12626 7158 7898 12751 1006
3182 1006 22500 -3824 23377 47703 75575 51663 -57307 -137511 -43812 45211 60207 97279
3170 97279 101586 100441 58787 -6004 26012 67581 58188 29377 29662 45883 -7151 -77322 -65882
3157 -65882 -35440 -94706 -96339 -32774 22608 70015 53836 4150 -45252 -68619 -29452 11484
3145 11484 -19592 -66316 -84057 -86852 -42236 -19449 -69123 -44715 16410 48038 -8430 -31865
3133 -31865 -28821 -28799 -22688 -22382 -26856 9367 -24502 -79205 -28123 28887 20807 -29631 11990 31932
3119 31932 45976 57861 54589 81377 85874 77552 77873 62603 59742 74034 29328 34433 6765
3106 6765 27028 84802 126346 117519 98691 87068 69389 77322 69010 99127 100043 65832 57602
3093 57602 66633 64300 55921 32560 -69115 -105287 -33079 7846 -40054 -66915 -114265 -8573
3081 -8573 10026 4681 -25252 -79903 -64638 -29720 -14085 -23710 -10786 40626 83546 65110
3069 65110 85553 83902 100967 55980 23422 25803 79221 54096 15787 11037 40561 70269
3057 70269 52945 776 -4952 17853 27904 -4753 -12512 4181 95568 102214 104834 68269 94331
3044 94331 60704 99233 89412 75341 82964 43222 22319 526 -1413 21818 62934 129151
3032 129151 110255 100746 65000 27940 22880 54864 43587 60194 38585 61549 95778 96478
3020 96478 21805 -46481 -108848 -114865 -69812 -12008 40176 17561 39171 74802 100452 121690
3008 121690 152395 101597 39429 -32773 -66890 -62599 -17193 20661 46817 17856 31186 23676
2996 23676 48154 23841 6226 -33254 -28628 -42961 43898 66856 15346 2622 -20780 -49214
2984 -49214 -81748 -119399 -93126 -55268 -45153 -3227 -8360 -26670 -45901 -96981 -74230 -31346
2972 -31346 -33858 -5077 -10200 -41089 -3807 27462 19349 41243 -3932 -17339 16554 40534
2960 40534 76533 132142 92986 67904 137816 148159 106706 60249 35162 29501 2280 11816
2948 11816 38376 55040 250 -30924 11134 80077 46183 48941 29931 6704 47194 89633
2936 89633 73322 2623 -15554 -5452 -9970 10321 65416 57922 -10784 4666 -23051 24470
2924 24470 9000 -31204 24817 69274 56959 56340 57327 32397 -28489 -38653 -60489 -24782 -4555
2911 -4555 12332 33886 9904 -27381 2574 56323 88958 72463 10476 -16107 33510 28182
2899 28182 -60417 -104539 -86985 -72577 -22099 14679 34024 -20949 -72876 -98993 -75980 22867
2887 22867 45019 29671 12494 -10090 -52705 -47543 -81364 -150150 -158684 -143875 -85589 -79569
2875 -79569 -60691 -41676 -42244 -36232 4234 10522 -19320 -33820 -13330 2996 72351 71556 -14089
2862 -14089 -44036 -22739 -56709 -89299 -57076 -26102 -32788 -72241 -47853 -71840 -56388 -20325
2850 -20325 -69663 -66856 4679 74203 49881 53812 29559 29159 21923 -42656 -23944 48343 67266
2837 67266 66724 85632 114165 124210 73426 47480 61585 34077 14337 11595 -74766 -134839
2825 -134839 -126272 -143629 -112489 -53076 -57423 -35837 -27873 12125 38034 49136 32980 59717
2813 59717 40325 -6458 -59132 -83936 -91252 -49146 22845 80912 117132 90660 -21163 -86034
2801 -86034 -91297 -77401 -66885 -64946 -92406 -65102 -23594 10897 51853 17660 3944 7362
2789 7362 33137 61143 46937 69664 27736 10521 3961 -23023 -15644 26430 18719 71845 80193
2776 80193 72967 98984 41041 1308 -1372 32819 9559 18998 -640 -7377 -9265 10567 -14348
2763 -14348 -74061 -71357 -60980 -62508 -50604 -39219 -39617 -34862 -78414 -51709 -86423 -63384 -11269
2750 -11269 -10376 -1837 -12335 -84862 -99512 -65300 -40250 9307 28893 26303 -4066 -53943 -51280
2737 -51280 -75962 -78527 27651 80118 78559 62963 17692 -1616 -19576 -37496 -64840 -51853
2725 -51853 1123 58474 60139 71463 59609 43066 25714 44957 79602 92270 18293 -58006
2713 -58006 -72261 -943 37705 41861 36804 91834 99698 46292 -9495 1348 16378 82191
2701 82191 84013 77993 59180 24717 -20039 -50462 3015 57285 9452 -39333 -24845 -43612
2689 -43612 -84018 -84937 -113052 -40555 7905 -5121 -4775 14907 23376 71664 54609 -3389 -23526
2676 -23526 -8139 17179 -6350 -39870 -57499 -60233 8281 66064 47799 9109 74079 68188
2664 68188 90 -21184 76 -25364 -42900 -61246 -15135 26019 32206 7613 -12854 -19119
2652 -19119 -39946 -61700 -36133 -25026 -12375 32278 17871 25106 -12551 -96615 -91384 809
2640 809 40706 1893 -9362 1273 977 5797 -20201 -58062 -48729 -72139 -93657 -52059 129
2627 129 -13184 -19079 8496 31001 89341 51155 -24939 -47044 3010 7963 -7697 20942 7004
2614 7004 -114248 -136448 -64859 -3592 26796 44065 27123 24673 -4224 -11845 -48819 -66910
2602 -66910 -24765 -855 28442 72888 55202 -30046 -80605 -36735 2141 24475 24441 28987 42821
2589 42821 54950 79457 44646 20894 9504 29218 34386 -23444 -16217 31045 13661 3700
2577 3700 57287 42642 60525 27886 20231 27709 42210 16004 -74223 -97507 -54180 -74664
2565 -74664 -86723 -123689 -171917 -116167 -82462 -50410 -59677 -39241 -28747 -70376 -39178 -23283
2553 -23283 -15714 -25462 -61803 -31094 -71996 -101352 -151386 -152204 -74833 -2779 -4018 -20614 -11376
2540 -11376 -25437 -41655 -47309 -44075 -4077 -7318 -55194 -17636 13816 9410 -31746 -80662 -58539
2527 -58539 30239 24668 4979 23938 22321 40593 40532 7799 -5565 838 -18986 -165 28816
2514 28816 25071 30096 11148 -37088 -72083 -14725 43238 65236 69777 55401 74988 37223
2502 37223 21641 13982 -266 -33796 7297 23203 -16090 -74646 -89737 -47118 -55562 7287
2490 7287 90955 133732 46839 18625 75561 117854 122620 97247 78249 5964 -38001 -19296
2478 -19296 64137 165374 199202 131199 89687 47166 30339 48752 76844 31576 4582 -2188
2466 -2188 59999 80551 68742 56423 54980 51738 71456 31813 -4498 -17638 -17256 -17094 -8015
2453 -8015 6898 31354 652 -84850 -138757 -118202 -105373 -82567 -57002 46855 31855 27159
2441 27159 42731 63379 91484 81617 96982 77389 85495 100884 119831 81733 9153 -20130
2429 -20130 19284 52738 43423 -4436 51117 114691 88025 65411 108183 109963 34915 -26709
2417 -26709 -9589 5818 58326 41664 42098 44313 44625 11710 -10694 -40062 -49323 -61968 -61793
2404 -61793 -33637 -24544 -21081 -5778 -13456 22379 41317 -11840 12803 72946 72522 30598 13815
2391 13815 -33156 -71167 -140943 -95366 -88869 -82760 -37742 -4280 12931 17506 -19582 -44172
2379 -44172 -39956 -66391 -91731 -65645 -43001 -30363 -37159 -38469 -17433 -17330 -23155 -18187 -53754
2366 -53754 -99284 -154453 -84667 -40573 693 44854 18721 6385 -23131 -25186 31051 57110
2354 57110 98512 54943 9145 28061 -20302 -39690 16526 61821 96607 103429 77978 -5510
2342 -5510 -60801 -39512 -28009 30142 35228 21048 623 -72167 -71276 -74289 -54045 -63861 -22876
2329 -22876 -1439 21334 36081 -16796 -632 -41673 -62489 -52304 -53287 -30978 -95578 -159389
2317 -159389 -119940 -46022 -29756 -12017 307 2019 -16136 -47309 -13256 72202 34263 3806
2305 3806 31421 23376 26098 39427 48144 65368 80323 28529 11594 39593 69684 52284 -10485
2292 -10485 -66671 -80720 -47568 -80491 -47823 -50147 -79828 -60242 -38388 -3999 24021 978
2280 978 1259 -21008 -43929 -13828 -42459 -45554 -96283 -139637 -92336 -40337 -57914 -27487 -25463
2267 -25463 -67523 -70659 -50941 -36516 -37106 -33005 7309 3111 22323 44335 30398 27907 48901
2254 48901 -15846 -14450 29106 -20334 -26541 -8624 18285 54481 46830 52009 52649 30407 -20646
2241 -20646 -32463 -22970 -44009 -35942 18449 35454 9110 -32199 -3339 46844 85047 61535
2229 61535 50245 49741 19329 -5463 54351 20951 3283 -11457 -79367 -126835 -71434 -93382
2217 -93382 -103573 -92806 -115632 -99059 -377 1784 6953 11947 -9719 -42973 -7501 18127
2205 18127 7614 -58580 -121413 -54454 29520 41857 73906 91700 90314 76714 4213 -25423
2193 -25423 52388 63778 39681 96698 103340 10802 -14398 -24772 -11223 88710 129744 99727
2181 99727 27350 -15281 -43575 -12291 -1541 -519 13484 39956 8004 -37514 7945 -796
2169 -796 -29090 -36293 -55824 -38019 -9084 -17964 -89893 -78046 -26169 14585 25675 17557 39815
2156 39815 50718 30529 47569 9156 277 16342 -27999 -10112 20163 34033 37073 38108
2144 38108 67386 65030 2376 -5400 43314 25189 -45868 -77890 -40652 -39717 -62471 -60203 -69033
2131 -69033 -87098 -116837 -94547 -35812 -26515 -31445 -14556 -7209 45415 5954 -22798 2087
2119 2087 66887 36089 -9370 13619 33217 76759 115883 18988 -26129 4600 21622 -31376
2107 -31376 -44644 -56582 -70408 -83474 -43366 -24308 -63191 -95612 -34823 -12354 -21558 -20979
2095 -20979 -2723 -3038 -14427 10847 32368 -43655 -37010 -59767 -55257 53354 62998 43060 9019
2082 9019 -34707 -35023 -39151 -35512 -18926 29614 82745 81066 92526 76682 96602 106733 49488
2069 49488 42888 100896 82551 28919 25559 -17248 -24731 2010 -38950 -80170 -48946 -1981
2057 -1981 45451 -67206 -55507 -5753 -12243 -43904 -33515 8972 23041 32999 -32045 3436
2045 3436 927 -36103 -34022 -55826 -47564 -35502 -30976 6344 15225 -25030 -35229 -11965 33355
2032 33355 46252 8771 -16281 -20191 21319 20991 65246 115754 37534 -47842 -45621 -46963 2031
2019 2031 54337 106662 114885 146758 120189 82903 65848 20407 -11702 -51022 -28587 -7636
2007 -7636 7390 15396 -8814 37 4867 -19390 -9755 22887 19158 57831 89167 114179 129731
1994 129731 130351 70977 32029 -26684 -78708 -87274 -32051 -11849 6533 27944 -50648 -89102
1982 -89102 -59206 -33156 -17390 -9488 -20430 -1296 47536 -40509 -73328 -70987 -64166 -61596 -40750
1969 -40750 15957 24858 10790 14278 -15349 -21042 -21777 -24264 50987 53627 15626 1253 -1473
1956 -1473 -39028 18029 13218 -17473 27640 79204 74622 57862 44987 -2352 26059 45215
1944 45215 22338 -47287 -69347 -116205 -92463 -45612 3722 -54364 -55990 -10222 17729 30342
1932 30342 580 -25816 -48366 -96159 -48109 -28608 -61695 -6746 69495 94519 101878 74585
1920 74585 59485 56786 12851 22107 36777 59475 90339 46738 50839 98445 91281 43133 66114
1907 66114 72012 55736 27972 -34682 -32933 21306 40635 33009 18681 33755 46527 20876
1895 20876 2292 -62180 -38105 -502 -25061 -15067 2761 46487 32139 -37035 19544 38648
1883 38648 32611 92310 84538 61477 35651 28084 3493 -27352 6078 31602 66285 95971
1871 95971 42086 -18869 2306 67737 98443 94338 41825 52202 35308 -5302 -12020 3938
1859 3938 -25916 2536 75001 18576 7518 21694 -43778 -54167 -24321 -31221 -64581 -43180
1847 -43180 18234 60641 31836 34838 -11104 -16785 41673 94449 97130 96586 92029 63285 21184
1834 21184 5880 -32485 -9297 8736 -54414 -113851 -25087 51293 24135 -4113 -35219 -2795
1822 -2795 50680 4618 -27786 -50493 45646 44421 -35276 -86192 -115036 -23053 11502 -35314
1810 -35314 -76499 -139944 -151529 -89302 -26016 5599 22134 677 49307 64245 17487 34408
1798 34408 60754 32999 -43335 -35875 15569 55249 22 -61191 -62702 148 14238 -42206
1786 -42206 -70418 -76294 -79238 -105701 -94169 -98978 -98163 -89395 -45934 8211 49778 4767 -9993
1773 -9993 45625 73938 1962 -82907 -74442 -128542 -136029 -124832 -105169 -95134 -106862 -74630
1761 -74630 -10478 53287 89598 103831 42742 57601 36809 49336 35662 39552 -5194 -28763
1749 -28763 -15948 -18706 7302 55941 51779 65359 47175 8674 8793 48399 77855 94280 77054
1736 77054 49322 -28280 -49625 -31796 -51894 -68983 -30256 18990 49693 -31323 -127085 -126237
1724 -126237 -74049 -54513 6784 5128 -1769 22807 21891 7835 -35324 43642 68825 46322
1712 46322 1639 45887 82784 37538 4348 20628 21096 12559 -32409 -53744 -44912 -33794 -37812
1699 -37812 -31176 -43904 -31560 -43064 -54744 438 63698 70045 31237 20354 8149 -2723
1687 -2723 -8023 19086 34898 -40509 -36049 26048 225 -38090 -40469 64631 97169 115727
1675 115727 171432 149809 103081 140539 76060 -32002 -59924 -119368 -121330 -77061 -85526 -70168
1663 -70168 -48130 -60822 -72216 -37767 31462 68353 95601 117883 89982 37343 25214 -9770
1651 -9770 -44436 -35400 9447 -1823 19198 61285 82849 95764 30021 2253 54402 14615
1639 14615 -25730 -31906 -53581 -44560 -9052 -23385 27985 44722 37078 65220 25522 52506
1627 52506 66156 119529 114890 72159 41790 11210 -36278 -24758 -15663 -21606 15599 46707
1615 46707 2627 -3897 -51917 -84394 -65713 -75489 -101600 -32954 -80476 -105593 -44700 -1632
1603 -1632 -16722 29593 83008 98989 46522 -8974 -52036 -22094 12217 -28535 -41266 -39390
$$ [...]
##END NTUPLES=NMR SPECTRUM
##END=
