##TITLE=Analysis number 315559
Compound Code gk 01940
Project Code adrs
Chemist Name durham
##JCAMPDX= 6.0         $$ Bruker NMR JCAMP-DX V2.0
##DATA TYPE= NMR SPECTRUM
##DATA CLASS= NTUPLES
##ORIGIN= Bruker BioSpin GmbH
##OWNER= NMR
$$ XWIN-NMR		Version 3.5
$$ Wed Nov 23 14:48:19 2005 GMT Standard Time (UT+0h)  MAYBRIDGE\NMR@NMR_250MHZ
##.OBSERVE FREQUENCY= 250.131544655141
##.OBSERVE NUCLEUS= ^1H
##.ACQUISITION MODE= SIMULTANEOUS (DQD)
##.ACQUISITION SCHEME= undefined
##.AVERAGES= 16
##.DIGITISER RES= 18
##SPECTROMETER/DATA SYSTEM= dpx250
##.PULSE SEQUENCE= zg30
##.SOLVENT NAME= CDCl3
##.SHIFT REFERENCE= (INTERNAL, CDCl3, 0, 16.522)
##AUDIT TRAIL= $$ (NUMBER, WHEN, WHO, WHERE, WHAT)
$$ ##TITLE= Audit trail, XWIN-NMR		Version 3.5
$$ ##JCAMPDX= 5.01
$$ ##ORIGIN= Bruker BioSpin GmbH
$$ ##OWNER= NMR
$$ C:\u/data/dgb/nmr/ADRS/12920/pdata/1/auditp.txt
$$ ##AUDIT TRAIL=  $$ (NUMBER, WHEN, WHO, WHERE, WHAT)
(   1,<2005-11-23 14:47:33.63 +000>,<MAYBRIDGE\NMR>,<NMR_250MHZ>,
      <created by zg, POWCHK disabled, PULCHK disabled
       configuration hash MD5:
       62 19 C7 07 E1 42 D1 B7 37 6C 3D D0 77 39 F9 E6
       data hash MD5: 64K
       E0 E8 AD F3 FE 77 50 36 4F E0 97 63 E9 11 30 FF>)
(   2,<2005-11-23 14:47:50.92 +000>,<MAYBRIDGE\NMR>,<NMR_250MHZ>,
      <Start of raw data processing
       ef LB = 0.3 FT_mod = 6 PKNL = 1 SI = 32K 
       data hash MD5: 32K
       72 62 DE 55 BE 45 25 43 57 D8 04 5E 46 7C DA CD>)
(   3,<2005-11-23 14:47:56.35 +000>,<MAYBRIDGE\NMR>,<NMR_250MHZ>,
      <apk 
       data hash MD5: 32K
       B6 25 EB D7 BC 13 80 3E 5F 4C C3 20 7B 00 CA DF>)
(   4,<2005-11-23 14:47:57.81 +000>,<MAYBRIDGE\NMR>,<NMR_250MHZ>,
      <abs ABSG = 5 
       data hash MD5: 32K
       24 36 15 A8 CE 5F 78 EF FD 28 2F CE 39 45 39 37>)
$$ ##END=
$$ 
$$ hash MD5
$$ 70 60 2B C8 E8 91 4D 8C 60 20 D4 66 7C E3 D5 33
##$RELAX= 
##$RELAX= 
##$RELAX= 
##$RELAX= 
##$RELAX= 
##$RELAX= 
##$RELAX= 
$$ Bruker specific parameters
$$ --------------------------
##$DU= <C:\u>
##$EXPNO= 12920
##$NAME= <ADRS>
##$PROCNO= 1
##$TYPE= <nmr>
##$USER= <dgb>
##$AMP= (0..31)
100 100 100 100 100 100 100 100 100 100 100 100 100 100 100 100 100 100 
100 100 100 100 100 100 100 100 100 100 100 100 100 100 
##$AQSEQ= 0
##$AQ_mod= 3
##$AUNM= <au_zg>
##$AUTOPOS= <38 >
##$BF1= 250.13
##$BF2= 250.13
##$BF3= 250.13
##$BF4= 250.13
##$BF5= 500.13
##$BF6= 500.13
##$BF7= 500.13
##$BF8= 500.13
##$BYTORDA= 1
##$CFDGTYP= 0
##$CFRGTYP= 5
##$CHEMSTR= <none>
##$CNST= (0..31)
1 1 145 1 1 1 1 1 1 1 1 1 1 1 1 1 1 1 1 1 1 1 1 1 1 1 1 1 1 1 1 1 
##$CPDPRG= <>
##$CPDPRG1= <>
##$CPDPRG2= <>
##$CPDPRG3= <>
##$CPDPRG4= <mlev>
##$CPDPRG5= <mlev>
##$CPDPRG6= <mlev>
##$CPDPRG7= <mlev>
##$CPDPRG8= <mlev>
##$CPDPRGB= <>
##$CPDPRGT= <>
##$D= (0..31)
0 1 0 0 0 0 0 0 0 0.06 0 0 0 0 0 0 0.0002 0 0 0 0 0 0 0 0 0 0 0 0 0 0 
0 
##$DATE= 1132757251
##$DBL= (0..7)
120 120 120 120 120 120 120 120 
##$DBP= (0..7)
150 150 150 150 150 150 150 150 
##$DBP07= 0
##$DBPNAM0= <>
##$DBPNAM1= <>
##$DBPNAM2= <>
$$ [...]
##$SUBNAM7= <"">
##$SUBNAM8= <"">
##$SUBNAM9= <"">
##$SW= 20.6930455092707
##$SWIBOX= (0..15)
0 0 3 0 0 0 0 0 0 0 0 0 0 0 0 0 
##$SW_h= 5175.983436853
##$TD= 65536
##$TD0= 1
##$TE= 294.16
##$TE2= 300
##$TE3= 300
##$TEG= 300
##$TL= (0..7)
0 120 120 120 120 120 120 120 
##$TP= (0..7)
150 150 150 150 150 150 150 150 
##$TP07= 0
##$TPNAME0= <>
##$TPNAME1= <>
##$TPNAME2= <>
##$TPNAME3= <>
##$TPNAME4= <>
##$TPNAME5= <>
##$TPNAME6= <>
##$TPNAME7= <>
##$TPOAL= (0..7)
0.5 0.5 0.5 0.5 0.5 0.5 0.5 0.5 
##$TPOFFS= (0..7)
0 0 0 0 0 0 0 0 
##$TUNHIN= 0
##$TUNHOUT= 0
##$TUNXOUT= 0
##$USERA1= <user>
##$USERA2= <user>
##$USERA3= <user>
##$USERA4= <user>
##$USERA5= <user>
##$V9= 5
##$VALIST= <valist>
##$VCLIST= <CCCCCCCCCCCCCCC>
##$VD= 0
##$VDLIST= <DDDDDDDDDDDDDDD>
##$VPLIST= <PPPPPPPPPPPPPPP>
##$VTLIST= <TTTTTTTTTTTTTTT>
##$WBST= 1024
##$WBSW= 4
##$XGAIN= (0..3)
0 0 0 0 
##$XL= 0
##$YL= 0
##$YMAX_a= 535044
##$YMIN_a= -523796
##$ZGOPTNS= <>
##$ZL1= 120
##$ZL2= 120
##$ZL3= 120
##$ZL4= 120
##$ABSF1= 16.522
##$ABSF2= -4.171173
##$ABSG= 5
##$ABSL= 3
##$ALPHA= 0
##$AQORDER= 0
##$ASSFAC= 0
##$ASSFACI= 0
##$ASSFACX= 0
##$ASSWID= 0
##$AUNMP= <proc_1d>
##$AZFE= 0.1
##$AZFW= 0.1
##$BCFW= 0
##$BC_mod= 0
##$BYTORDP= 0
##$COROFFS= 0
##$CY= 12.5
##$DATMOD= 1
##$DC= 0
##$DFILT= <>
##$DTYPP= 0
##$F1P= 14.0000005364418
##$F2P= -0.99999901652339
##$FCOR= 0.5
##$FTSIZE= 32768
##$FT_mod= 6
##$GAMMA= 0
##$GB= 0
##$INTBC= 1
##$INTSCL= 1
##$ISEN= 128
##$LB= 0.3
##$LEV0= 0
##$LPBIN= 0
##$MAXI= 10000
##$MC2= 0
##$MEAN= 0
##$ME_mod= 0
##$MI= 0
##$NCOEF= 0
##$NC_proc= -1
##$NLEV= 6
##$NOISF1= 0
##$NOISF2= 0
##$NSP= 0
##$NTH_PI= 0
##$NZP= 0
##$OFFSET= 16.522
##$PC= 1
##$PHC0= 82.34927
##$PHC1= 5.593196
##$PH_mod= 1
##$PKNL= yes
##$PPARMOD= 0
##$PSCAL= 4
##$PSIGN= 0
##$REVERSE= no
##$SF= 250.13
##$SI= 32768
##$SIGF1= 0
##$SIGF2= 0
##$SINO= 400
##$SIOLD= 32768
##$SREGLST= <1H.CDCl3>
##$SSB= 0
##$STSI= 32768
##$STSR= 0
##$SW_p= 5175.98343685301
##$SYMM= 0
##$S_DEV= 0
##$TDeff= 65536
##$TDoff= 0
##$TI= <Analysis number 999999
Compound Code 99
Book Reference 9
Project Code 9>
##$TILT= no
##$TM1= 0
##$TM2= 0
##$TOPLEV= 0
##$USERP1= <user>
##$USERP2= <user>
##$USERP3= <user>
##$USERP4= <user>
##$USERP5= <user>
##$WDW= 1
##$XDIM= 32768
##$YMAX_p= 284879672
##$YMIN_p= -45027
$$ End of Bruker specific parameters
$$ ---------------------------------
##NTUPLES= NMR SPECTRUM
##VAR_NAME=  FREQUENCY,     SPECTRUM/REAL,   SPECTRUM/IMAG
##SYMBOL=    X,             R,               I
##VAR_TYPE=  INDEPENDENT,   DEPENDENT,       DEPENDENT
##VAR_FORM=  AFFN,          ASDF,            ASDF
##VAR_DIM=   32768,         32768,           32768
##UNITS=     HZ,            ARBITRARY UNITS, ARBITRARY UNITS
##FACTOR=    0.157963299565203, 1,           1
##FIRST=     4132.6476996994, 0,             0
##LAST=      -1043.33573715361, 0,           0
##MIN=       -1043.33573715361, -45027,      0
##MAX=       4132.6476996994, 284879672,     0
$$ Real data points
##PAGE= N=1
##DATA TABLE= (X++(R..R)), XYDATA
$$ [...]
19736h551M081O788j530Q791m296p233M536R14p290J723L998Q36K058l052l509
19721a736J282o587M92P715K309n107J605M673K752K148L341p243j2939R59Q161
19706A825L040p765K363L524m373k550K887L744q58l072j22k695k368m789J392
19691i817Q863N267K145l313j581j52K692j000K356J039O105K25m305k039p282
19676g97l852j366K794K207L313J1470J0860N030n29R90n722k933M430k575p200
19661A6120L037n317n80j786n003m421j568o3K060k652K693j066L839M339k260
19646G372n97M29k199N123L018j0921p613r57M814P355K152o936j789L428J020
19631C699j478N346J8302J2229L02k072n791o665r485j44p15k295l312M246k492
$$ y = [-8551, -4470, 2318, 788, 9579, 5283, -1950, 2586, 3500, -3790, -2067, 1931, 2767, 4825, 1773, -1736, -454, -7041, -6549, 1166, 3475, -1632, -27, 4646, 7398, 9546, 12887, 5644, -7295, -6336, 1825, 4865, -2900, -537, 2987, -1386, -3936, -1049, 2695, 1837, -1235, -1357, -4052, -6420, -11209, -9817, -954, 4313, 6458, 3145, 1564, 1412, 4104, 3104, 5460, 6499, 12604, 12829, 8524, 6485, -797, -4649, -6015, -3221, -1014, 2299, 13769, 24629, 29659, 29130, 30120, 24398, 21465, 25895, 23320, 16120, 19157, 13840, 13260, 11474, 6471, 2050, 482, 419, 2479, -173, 2520, 1454, 5293, 9632, 7372, 6775, 7204, 5005, 10128, 13146, 2225, -5388, -6345, -1531, 5824, 7976, 1040, -749, 2679, 3699, 2221, 7567, 25869, 38098, 38400, 36328, 30537, 23872, 14387, 14243, 13528, 11233, 7921, 12167, 9675]
19616I675n183r94j014j677j018K265K849N314L115n142j0399K793K31N334R193
19601A5342K018m206m232o136M743l037j187j769r4o22k192j351n805k701N918
19586e311l24m119q4k127j48O573P918o73K85Q84M235k503K805m719k409j880
19570a597K726oo371o024o83K638L345K205L113K769l658p031O568J626j009n065
19554f454n37J594k604N726Q880o145J46o564n978m984P950P109k067o389O22
19539i695L518K496O602l47j074K774L695J017P1K899P51J436p095q17l15j370
19523D546m723p504l500l75j313O012P157K000n303l552M440K419N575m098M642
19508F423L766l823l106R45k3m909l05q21M194J0965r5l77k189m604p553J147
$$ y = [9675, 4492, 3498, 2484, 807, -211, 2054, 4903, 10217, 13332, 8190, -2209, 584, 815, 6149, 15342, 17360, 13154, 8922, 2786, 7529, 4492, 3305, 1536, 1442, 820, -1372, -2723, -8528, -11229, -5311, -5635, -9754, -9838, -11965, -12113, -5540, 2378, 1705, 1990, 2874, 7109, 4606, 7411, 2692, 283, -1597, 1129, 1123, -5248, -11272, -11955, -9317, -5972, -3767, -654, 2115, -1543, -8574, -2006, -380, -1389, -6454, -6991, -5397, -8001, -2275, 6605, 460, 606, -5958, -11936, -16920, -8970, -1861, -3928, -10317, -9695, -6177, -3681, 2921, 2574, 1500, 4274, 7969, 8986, 9057, 11956, 12707, 14143, 7048, 6231, 5916, 4546, -177, -7681, -11181, -11556, -12869, -6857, 300, 2300, -3003, -6555, -2115, 304, 5879, 1781, 6423, 10189, 6366, 3260, 4205, 4182, -727, -1032, -1853, 2341, 13306, 13211, 12834, 10645, 6041, -1512, -365]
19492c65p1j897o08K079M062R6p08p304j039M008j187K59J681K694M101j872M254
19475H183j987m319l610k147L517j849j974R42p98m786N09N539R8l619l477j370
19459a1148K273L479j620O77K849J0082M986l784j038l157n278m851P747P458
19445H675m715n611Q50o90M607r33K881l418r47J420j90m647M660K504R74r92
19429D428M61L272R46J446k135l20j110j638n806n28L811k33m854m723J831O229
19413A077m01L096j10J639O73p487j904L08K957J09n192m273k177K996J0327L416
19397E054p51j244r069j787O217j69l544j737n511r9N328j071k666k532J407J1146
19381a028K113l804N077O005j497k976p913J676K396k989n403k0J0099N150m439
$$ y = [-365, -436, -2333, -2941, -862, 3200, 3296, 2588, -4716, -5755, -1747, -2934, -2675, -994, 1700, 5801, 3929, 8183, 6196, 1877, -1733, -3880, -363, -2212, -4186, -3244, -4042, -8828, -8319, -2780, -2682, -6301, -9778, -11148, -8875, -5396, -7016, -6339, -3490, 6592, 11578, 7794, 6756, 3599, -1679, -6530, 1217, 8675, 3960, -1651, -801, -1491, 3116, 2183, 5064, 1646, 699, 2119, 1929, -2718, 1942, 4446, 5420, 4428, 4889, 8161, 9107, 10553, 8418, 8098, 6988, 5350, -456, -984, 2827, 2594, -2260, -6983, -5152, 1077, 676, 3772, 3662, 5301, 5974, -1513, -3417, -3109, -152, -43, -5235, -9508, -11685, -8689, 1638, 5054, 4303, 3059, -6010, -7797, -1580, -1749, -5293, -7030, -12541, -12640, -7312, -8383, -11049, -13581, -12174, -1028, 1085, -2719, 2358, 8363, 6866, 3890, -4023, -2347, 49, -2940, -8343, -8363, 1736, 6886, 2447]
19366B447K030k048n989r134j955O13K728k921o12N513L220K630n194P121R008
19351G457L434r177q116j377l439O22P315O832M690o05l298j29O71K45o144J964
19335I45m71p574J702J2210M536m272m884L167L855P049k952l345l561M438n71
19320A0272m884k77k491l953p49n261n510j012K71N508M093Nk240L07k64K251
19304c934P01k82m77O717L845l819k581m220o631K267J846j203O035L036N271
19289F571k189l618M462k032K167O906j942q810j999K224J537J208l019k790P690
19274F366K914j069K035m022P35K110m2q836L031J569L882l308J115o0j431K202
19258G191m605q507l323M984R84M285m196j920l740j840R36l54L73L080K731j758
$$ y = [2447, 4477, 2429, -3560, -12694, -14649, -14036, -11308, -14229, -14841, -9328, -6108, -3478, -8672, -1551, 7457, 10891, 1714, -6402, -7779, -11218, -10596, -3281, 3551, 8241, 7636, 4338, 4209, 4880, 5125, -1019, 945, 474, -7100, -5398, 6812, 11348, 7076, 2192, 5359, 9214, 16263, 13311, 9966, 6405, 10843, 10272, 5388, 5111, 2620, -1333, -2082, -7343, -12853, -13865, -13594, -8086, -3993, -3988, -6228, -5921, -6185, -3934, -3233, -3515, -3992, 2725, 6570, 2751, 170, -4050, -10681, -8414, -6568, -7771, -1736, 1300, 6571, 4382, 764, 5226, 3194, 5361, 12267, 10325, 1515, -484, 1740, 3277, 4485, 1466, -1324, 6366, 9280, 8211, 10246, 6224, 6959, 9069, 9027, 191, 3222, 4791, 8673, 5365, 6480, 6420, 4989, 7191, 2586, -5921, -9244, -4260, -3276, 1009, -3187, -5107, -8847, -10687, -9751, -10105, -9732, -6652, -3921, -5679]
19242e679m785J17q38J952M815R069L255m881k045n351L86p11L49K794o137m34
19226h124J406N535R848N654r0p601m923o546l108p92j844L392o011K838N183
19211e183L239P114J452M024J034j415r459n427N613K429P45P4O554O94n059k869
19195C560o163K220L991k210L709O785l194r255p947M007M070k32K1n978O87M188
19179a741j123k009N177M520n125P45N871n524l742o96j385j638N666L679j154
19164A521L091n290l449L101J326Q96j055m246L453M431J43l301K981p69L747
19149F580J089k672j615m489j463k079K77M159k081M066L104k255m174j076m748
19134g377J182M478K425R72j581p719K617J0042K603q10m844j799L941M96P339
$$ y = [-5679, -10464, -10347, -11185, -9233, -4418, 4651, 7906, 3025, 980, -4371, -3985, -4696, -4347, -1553, -7690, -8124, -6718, -1183, 8665, 14319, 14229, 6628, 1705, -4841, -7949, -8741, -10585, -7193, -13204, -10366, -5183, -1944, 5170, 6622, 10646, 11680, 10265, 806, -4621, 992, 3421, 4166, 4240, 10794, 11488, 6429, 3560, -2603, -383, 3608, 1398, 5107, 11892, 8698, -557, -8504, -4497, -427, -659, -638, -6616, -5929, -1741, -2864, -4873, 304, 4824, -301, 444, 6315, 791, -2951, -3647, -5032, -6670, -1004, 2675, 1521, 4612, -678, -4127, -1026, 300, 1196, 141, -4105, -652, 3779, 3922, 621, 3602, 2833, 6580, 7669, 4997, 3382, -1107, -2570, -4649, -4372, -213, -2294, 1772, 4876, 2621, -1553, -2629, -7377, -6195, -1717, 708, 1680, 99, -7620, -5003, 5039, 7642, 6832, 1988, 189, 4130, 4626, 11965]
19119A1965m840J727k761n435m865k961O361P059M260l028q543k982K685K999
19105A641N270J792j230p782j0367J308K195j157j552K452L502J493K058K495
19091B118q352K955O185N489l746j880k518o28R55n799l535J474K833l692K964
19076e177M749M695M551P90o341m2K814J427k356j916o828J258L800J178k124
19061D78m060l161J381j098m868K968j466m669L53N360J142N71J592j200J710
19046d967L434l394l674L218k203K989O201J67k916q22j416N28M695j763m5K174
19030B206J235L392M82m676l839k972N555k228p729j913L223P698R38L273P195
19015A1840j360J644m031l301l239p12j247L630J92J951N84l002k650m033M227
$$ y = [11965, 7125, 8852, 6091, 656, -4209, -7170, -809, 6250, 10510, 7482, -1061, -4043, -1358, 1641, 6911, 8703, 7473, -309, -10676, -9368, -7173, -8330, -9882, -7430, -3928, -2435, -377, 2118, -6234, -3279, 2906, 8395, 4649, 2769, 251, -377, 578, -5221, -8756, -7282, -4449, -8141, -5177, -428, 4267, 8818, 9608, 3267, 3225, 6039, 7466, 5110, 3194, -3634, -2376, 1424, 2602, 478, -3582, -6743, -5362, -6460, -11328, -8360, -9826, -14495, -14142, -8782, -7640, -7069, -5477, -6677, -4967, -1533, -4927, -8601, -5383, -7586, -4597, 1604, 1771, -1145, -1967, -3383, -2855, 1840, 77, 32, 2206, 3441, 6833, 7315, 2639, -1200, -4172, 1383, -845, -8574, -10487, -7264, 434, 1372, 4645, 11840, 10480, 12124, 8093, 4792, 1553, 841, -406, 3224, 3416, 5367, 5951, 2949, 299, -3734, 493]
19000D93M026j105n346l206l172o249O157O315l364K945J936J319k129j647L388
18985C61L154n133o555j862J960l40N239Q686Q3L836q12L492k733n716J008J597
18969F265k414k683O27L437L371o235j0320m385L540L871q64L553O935j035m450
18954g87l305N246O513n715j889r401k854L999O08m927M502M646K071q93l302
18939e488q976J281J0014M119O982Q89p979m718O591K791m105L600M658k323l255
18924D081l744K522M894M352q618n63l362l772J0024O629m560m101l390O808L495
18909A0695j779Q95M689L691j578k838K906M83k2k60Q609M027m385k555R950M300
18893C6828J117J4602J9574L5592M7508Q3883Q1978L4917K1434K8346n799m3127
$$ y = [493, 4519, 3414, -1932, -5138, -8310, -14559, -8402, -2087, -5451, -2506, -570, 749, -1380, -3027, 361, 3515, -1618, -8173, -10035, -8075, -8415, -3176, 5510, 5593, 9429, 8617, 12109, 9376, 3660, 4668, 6265, 3851, 1168, 1795, 5232, 8603, 2368, -7952, -12337, -8797, -4926, -5790, -2237, 4698, 3663, -787, -4092, 1154, 7667, 1952, 63, -9338, -12192, -8193, -7585, -12512, -8010, -3364, -1293, -2186, -5488, -14464, -13183, -3169, 950, 7932, 8821, 842, -3876, 2715, 5506, 1401, 5001, 9659, 7336, 4081, 337, 2859, 7753, 12105, 3487, 2924, -438, -4210, 5814, 12443, 7883, 3782, 392, 7200, 10695, 8916, 9811, 14500, 18191, 16613, 13775, 16681, 17164, 17142, 16882, 25491, 29518, 25133, 22578, 32528, 36828, 37945, 52547, 72121, 107713, 155221, 239104, 321082, 355999, 377433, 405779, 399980, 356853]
18881C56853m9909m0419k9381l2017l7588l7446l3958k3458j9445j2729n040r30
18869C4533R96m219m275N1p558k943k768l354n43R86L192Q49q785k304P563j058
18853A0363m277n040M078N775L314l693q850m282j314O44M310k547J433j371l577
18838e034P92j338m517l24L235L641L649K458l741p258L125M676l351P53O381
18823C147R22k62R26j617q751k237j750L699O315K778j516O689P619j948p172
18808F842p706l969J768J689P665O714n141p506l051L334O176k577J565q344p389
18793i930J748P531L156q79O038L226l133l646n104N891K52n019q46j179r655
18778a1549j084Q936J0122K207l576o23n129J195K5K675J0674o728O274K0379
$$ y = [356853, 306944, 266525, 237144, 205127, 167539, 130093, 96135, 72677, 53232, 40503, 35463, 34533, 35529, 31310, 27035, 27086, 19528, 16585, 13817, 10463, 9920, 10906, 14098, 14947, 6162, 3858, 11421, 10363, 6086, 1046, 5124, 10899, 14213, 10520, 1670, -2612, -3926, -3282, 1028, -1519, -86, -1457, -5034, -4242, -5580, -10097, -10421, -7186, -3545, 104, 2562, -1179, -8437, -5312, -636, -3987, -3234, 3147, 4069, 3807, 4733, 3116, -5635, -7872, -9622, -5923, 392, 3170, 1654, 8343, 15962, 14014, 6842, -864, -4833, -3065, -1376, 6289, 13003, 7862, 356, -2695, 639, 6815, 4238, 5803, -2541, -9930, -8182, -651, 2505, 1626, 7664, 10890, 7757, 4111, -993, 4898, 5150, 131, -715, -1894, -11549, -12633, -3697, 6425, 8632, 5056, 4433, -696, 499, 524, 3199, 13873, 7145, 13419, 33798]
18764C3798J6806P259j0298r841r730n067M37l415m139l741k397k501M015P26
18750A1912j254O83L256L861n881K30L611R42l297k752l303J285L311m226k540
18735E838O415K375j0719q072m683N878J47M43k323l351Q13M458P528k877n453
18720c583j15K223L913J990K155k859l183k242j078K802j47J350P27j323N219
18705E849q81k224p273l964J039J722O326j155Q97J2149P0R09l274n360k877m81
18689A472K311J235M8J991j952J430J726m945k345K690M370j818J72j754m951
18674c20M582M763o092n951j897J1266O481p438m32J414L019j361j151M301j930
18659I254m903n772r2r24Q042J4872j690j0485r30P91j0708l738J992j607M815
$$ y = [33798, 50604, 57863, 47565, 37724, 27994, 22927, 23364, 19949, 15810, 12069, 9672, 7171, 11186, 11912, 10658, 11341, 14597, 18458, 12577, 12807, 16418, 17360, 14063, 11311, 8008, 9293, 12604, 8378, 5838, 12253, 14628, 3909, -4163, -8846, -2968, -2821, -2378, -4701, -8052, -7239, -2781, 4747, 1870, -3583, -3698, -1475, 2438, 4428, 6583, 3724, 541, -1701, -2779, 23, -124, 1226, 1953, 630, 5849, 4968, 2744, -4529, -8493, -7454, -5732, 594, -561, 336, 12485, 12555, 13464, 10190, 4830, 1953, 1472, 3783, 5018, 5066, 7057, 5105, 6535, 8261, 3316, 971, 3661, 8031, 6213, 6385, 4631, -320, 4262, 9025, 2933, -3018, -4915, 6351, 12832, 5394, 4962, 6376, 9395, 8034, 6883, 11184, 9254, 4351, -1421, -1513, -2437, 5605, 20477, 18787, 8302, 7372, 8163, -2545, -6283, -4291, -5898, -1083]
18644a083Q051K955K03p94k186l931m586M651l20n599j271N822P605P68J232L049
18628A4566l792j914M635n91p653K668K439o086m808N345k048k879J201j171J850
18613A762N197l105m997j047O208M288o364J077P169l059J348m693k93Q90Q6N737
18597A0204K303J682J211O39p022M54J191k674J998O474l481n867p725N255O891
18582A1533j039Q993k283j3391o264k415M156J0755m217l815j416k667k982L969
18568a083P430L974k341k42k256m47j027j433N091k59j180M337P627J137j562
18553A7766j154j0445l383J664p04J188L999N959J438J081o801k78K0Q525K142
18538B1017L694O390P170K305P804R16n7P183J379l095p657L4Q96m033j2289n707
$$ y = [-1083, 6968, 9923, 10126, 9332, 7146, 3215, -1371, 3280, 2960, -2639, -3910, 1912, 9517, 10285, 11517, 14566, 10774, 8860, 13495, 12904, 5251, 7919, 10358, 4272, -536, 4809, 2761, -118, 1083, -88, 1762, 6959, 3854, -1143, -2190, 4018, 8306, 1942, 3019, 10188, 7129, 8477, 3784, 3491, 4381, 4467, 10204, 12507, 14189, 15400, 16039, 9017, 9471, 10662, 7988, 9986, 16460, 12979, 7112, -613, 4642, 11533, 10494, 19487, 17204, 3813, -2451, -4866, -710, 10045, 5828, 2013, 597, -2070, -5052, -1083, 6347, 10321, 7980, 7738, 5482, 5035, 4008, 2575, 7666, 7407, 6227, 10564, 18191, 19328, 17766, 16612, 6167, 2784, 4448, 3744, 4932, 8931, 14890, 16328, 17409, 10608, 10330, 10350, 18875, 21017, 24711, 31101, 38271, 40576, 48380, 49296, 49239, 56422, 57801, 54706, 47049, 47083, 47979, 43946, 31657, 25950]
18522B5950R08n76l435k40J152L196K165q853l373k032R46m168M587J970j301
18507A6896L517l023j0951O927K473r643k193K946l990q771j467Q626K090l34
18493C103j738L961O967J031P5k714j253r84P185O750j448j241L191K821R70P680
18477C4356Q333P706r545k1991j1946M861r630j1643l698J044l571j547k777j988
18463b2036Q962L130L060L548K140L020m00J646K516L758K113k71j307n162p31
18448C986J840M18q22R5j585J115Q837M665J684p88L297L148j86L167L346k03
18432C2014j273n153l369M654n380j0969l628M361N647j24r15j301J840q7J51
18417A6468N875Q199N80M992P051N413J5815J7183R694L379K949q92p201r535
$$ y = [25950, 26858, 26282, 22847, 22607, 23759, 26955, 29120, 20267, 16894, 14862, 15808, 11640, 16227, 18197, 16896, 20413, 17390, 6439, 13366, 15839, 6196, 4003, 6949, 2959, -5812, -7279, 1347, 3437, 3103, 1365, 5326, 12293, 13324, 13399, 10685, 9432, 8448, 15633, 22383, 20935, 19694, 22885, 25706, 26676, 34356, 42689, 50395, 40850, 18859, 6913, 11774, 2144, -9499, -13197, -12153, -15724, -17271, -20048, -22036, -13074, -9944, -6884, -3336, -1196, 1824, 1424, 3070, 5586, 9344, 11457, 11186, 9879, 4717, 3986, 5826, 6244, 5422, 5517, 3932, 5047, 13884, 18549, 20233, 19445, 22742, 25890, 25704, 28871, 32217, 32014, 30741, 25588, 22219, 26873, 21493, 10524, 6896, 11257, 16904, 16780, 15865, 14564, 16404, 16317, 16468, 22343, 30542, 31122, 36114, 43165, 48578, 64393, 81576, 91270, 94649, 97598, 96706, 89505, 79970]
18403G9970j4639r381O09r949j3346n650l782P86p50N138l664K371O589q20R906
18388D3388M549k832r587R42M025K141l965p755p459j667R47M909L11K943J519
18373C2409j472M690R44n727j695K372N615P135M141M63K68k470j517J629J0509
18358E7294P457J620k271L965M266Q977N262R322P963k51K829O97j497j753J112
18343A04992K856Q797N395L047P148O822J607l875L85N877o626J98L601M45n018
18328A35651O072R143P463J1744J7876K2695K3753K5012K5128L5761N1756Q7451
18316D59505J29539J00844N2103O4000O4599p52k3182K792J3453K2498L1854M5422
18304I62675P6131J22408J85803K35279J82529J57365K28181K19968J79800K33583
$$ y = [79970, 65331, 55950, 56559, 46610, 33264, 27614, 23832, 24618, 23868, 29006, 25342, 27713, 34302, 33482, 43388, 47937, 45105, 35518, 36460, 40485, 42626, 38661, 30906, 23447, 21780, 22727, 27636, 27947, 30890, 32409, 30937, 35627, 36571, 30844, 29149, 31521, 37136, 44271, 48412, 48875, 49143, 46673, 45156, 46785, 57294, 64751, 66371, 64100, 68065, 72331, 81308, 86570, 95892, 103855, 103604, 106433, 107130, 105633, 103880, 104992, 107848, 116645, 122040, 125087, 132235, 139057, 140664, 136789, 137174, 143051, 136425, 136623, 140224, 140669, 135651, 141723, 150866, 158329, 170073, 187949, 210644, 234397, 259409, 284537, 320298, 372054, 459505, 589044, 689888, 741991, 805991, 870590, 869838, 846656, 849448, 862901, 885399, 917253, 962675, 1038806, 1161214, 1347017, 1582296, 1764825, 1922190, 2150371, 2370339, 2550139, 2783722]
18294B783722L29981M59046O66052R14356J237977J824296K990354N404654J0604044
18285B7214482J7799700J5392224M694122N527368P498313l084146j0344436q480506
18277E6217121o675725o860808p576771p450162o531233n502895m214459k773316
18269H631752j709381j054500p03223n87069m85314l57492l46292l63723l12518
18260B712240k50694k22994k08075j80423j37213q3894m0700m8388p4298m3591
18250A421970m1491j05570j28579r9497q2701q6799p9705p0956o7601m6738l0946
18239E81387l4157l2076k9273k0186j9885k5455k6489k2426k5257j8440k2042
18228C05701k1542k3487k0916j7194j9414j6579p064k890j434j4925j5219j0719
$$ y = [2783722, 3113703, 3572749, 4238801, 5153157, 6391134, 8215430, 11205784, 16610438, 27214482, 45014182, 60406406, 65100528, 70627896, 78126209, 75042063, 64697627, 56217121, 49541396, 42680588, 35103817, 27653655, 21122422, 15619527, 11405068, 8631752, 6922371, 5867871, 5164648, 4577579, 4092265, 3734773, 3388481, 3024758, 2712240, 2461546, 2238552, 2030477, 1850054, 1712841, 1628947, 1588247, 1539859, 1465561, 1421970, 1380479, 1274909, 1146330, 1046833, 964132, 877333, 797628, 726672, 659071, 612333, 581387, 547230, 515154, 485881, 465695, 445810, 420355, 393866, 371440, 346183, 327743, 305701, 284159, 260672, 239756, 222562, 203148, 186569, 179505, 176615, 175181, 160256, 145037, 134318]
18216A34318n133l946o346k817k643K764l02n028j813M177M4j091J391m421q087
18201A01067k582J657n788o447M601L952m210m751K07k641j869J422J902l359
18187H3161J5J1113L824O2o665j2189r929m710l983l183j35O145K148L074Q36
18172F9584k657l831j971k86k799m150r58q55l762n72J1550Q596J0948J556L452
18157H3845L761j592n405j1662q197l086Q79J091P49l914k076M269R815K439O823
18142G7739p163r081j297J0635P355l369o323l251M843K687L275j286R957P894
18128I2615L57J2228J3748J0283R434J3363J8375K1287K9871L2382L2374L6903
18116C23220O1311P1478R6952J22711J66732K38211L74757O31215J280117K904349
$$ y = [134318, 129185, 125239, 118893, 116076, 113433, 116197, 115895, 110867, 109054, 113231, 113275, 112184, 113575, 109154, 101067, 98485, 100142, 94354, 87907, 92508, 96460, 92250, 87499, 87706, 85065, 83196, 84618, 86520, 83161, 83176, 94289, 98113, 98175, 91510, 79321, 69392, 64682, 60699, 57516, 57381, 63526, 65674, 68748, 69584, 66927, 63096, 61125, 60839, 58040, 53890, 52932, 52077, 48315, 47743, 59293, 67889, 78837, 80393, 83845, 87606, 86014, 80609, 68947, 60750, 57664, 58543, 59634, 60383, 56469, 54393, 58662, 68477, 70916, 77739, 70576, 61495, 60198, 70833, 78188, 74819, 68496, 65245, 70088, 72775, 76050, 74764, 84721, 92615, 92972, 105200, 118948, 129231, 138665, 152028, 170403, 191690, 221561, 253943, 286317, 323220, 384531, 456009, 552961, 675672, 842404, 1080615, 1455372, 2086587, 3366704, 6271053]
18106F271053M397982J312584j957856j808082j175732j318417j489287j331831
18098B900414r39955n34937l01050j99396j42671j15517q7163p1343o7238n0252
18088C90892l9134m3976l9375k7956k2291k0934j8972j0948p136p972j1118j0747
18076A30333o327k110q500j2624k818Q56n156o634n762r301q570N48n80o5J08
18061F3398l415l97p300p718r2P2k359o402m183n011j887M110n077n685J450J815
18045B1319K555r87m646j390j675l647l41R959M901k380J771L451M147l326k589
18030B7122m807L03K266m541k645J107n056J186k506k573L537J742j272n244R62
18015I581R567R71Q37k786r432K270N902M660k416n836n008j0305m35M310Q751
$$ y = [6271053, 10669035, 11981619, 10023763, 8215681, 7039949, 5721532, 4232245, 2900414, 1960459, 1425522, 1124472, 925076, 782405, 666888, 579725, 508382, 441144, 390892, 351758, 307782, 268407, 240451, 218160, 197226, 178254, 167306, 160170, 152198, 141080, 130333, 124006, 121896, 113396, 100772, 97954, 98810, 93654, 87020, 81258, 71957, 63387, 63935, 63355, 63290, 63398, 59983, 59586, 52286, 44568, 44476, 44548, 42189, 35787, 31604, 26593, 24706, 28816, 23739, 18054, 19504, 21319, 23874, 22887, 18241, 16851, 15176, 11529, 11188, 21147, 26048, 23668, 25439, 28890, 33037, 29711, 27122, 22315, 22618, 24884, 20343, 17698, 18805, 13749, 14935, 12429, 9856, 13393, 15135, 13863, 8619, 9581, 19148, 20119, 20956, 18170, 8738, 11008, 16910, 21570, 19154, 13318, 8310, -1995, -2430, 1880, 10631]
18000A0631j404L174J2103J0914l882p694n51m333K245N932n703j5845o372Q474
17986G689N306l660K860l62p87L699r90M896l6q77q090n663k023M894n4L554k566
17969G790J695R318m800P4j584k286J106l496j853J481k794l058N58j002m113
17954b964N977Q17K72o51k291m417oL260J942l78o339j430j874m01K627J91J122
17937d543N281J997J555P96j708k535O967M137n078J424O988L243m71o012l294
17922H747j986m76j562j143N279j023k151J295p030j849N710q03J451M218j782
17907F895k719k364N138K740j252j201m138L760N534K195l326m703k382J902J961
17892H040j974l104k704m660J062j123Q453P799j027j725o30n015q07m606J060
$$ y = [10631, 9227, 12401, 24504, 35418, 31536, 23842, 23291, 18958, 21203, 27135, 21432, 5587, -785, 7689, 12995, 9335, 12195, 11833, 11046, 14745, 13755, 18651, 18615, 17738, 9648, 3985, 1962, 6856, 6802, 10356, 7790, 9485, 18803, 14003, 14077, 12493, 10207, 11313, 7817, 5964, 7445, 4651, 1593, 2151, 1149, -2964, 3013, 3830, 4102, 3451, 1160, -3257, -3263, -3, 1939, 1561, -4778, -6208, -8082, -8483, -5856, -5665, -4543, 738, 2735, 4290, 5086, 3378, 843, 7810, 11947, 6869, 8293, 15281, 18524, 18053, 12041, 8747, 6761, 6285, 4723, 3580, 8859, 7836, 5685, 6980, -50, -1899, 3811, 3008, 4459, 8677, 6895, 4176, 1812, 6950, 9690, 8438, 7237, 3099, 6859, 12393, 14588, 11262, 6559, 4177, 6079, 8040, 6066, 2962, 258, -4402, -3340, -4463, 3990, 11789, 10762, 9037, 8407, 3392, 2585, -2021, -961]
17877i61J212o52k763m111k975o59P588P695L827K887k834n956l038R83M408n3
17861D598j645K675m164k375m343K283R712j066j355o100l451M307L615l355Q50
17846A86L893L762M679m610l79j233M113K051m492k464j82j821N277o08o95m062
17830C415j766k956k183j116j447L228O026L772j199l949l862R00P051R407J065
17815A6386r255m408j243k375n035M155N730n193n322q76M53O918M137m122k835
17800b885O733J029k882J584K198o07m016j322l576k358K529J53K27L208K421
17785B436N95m769l55m524L738K664l659m820Q24N842N841O257n256k157M229
17770F886K066J279l94N966k245j869k97l702n082p092O413L931k719p80J599
$$ y = [-961, 251, -401, -3164, -7275, -10250, -10909, -3321, 4374, 8201, 11088, 8254, 2298, -740, 243, 4651, 4598, 2953, 5628, 1464, -911, -5254, -2971, 6741, 5675, 4320, -1780, -5231, -924, 2691, -664, 186, 4079, 7841, 12520, 7910, 7531, 6298, 10411, 12462, 7970, 5506, 5324, 3503, 8780, 8172, 7477, 3415, 1649, -1307, -3490, -4606, -6053, -2825, 3201, 6973, 5774, 1825, -2037, -1137, 5914, 15321, 16386, 7131, 2723, 1480, -895, -5930, -1775, 3955, -1238, -6560, -7436, -6983, -65, 4072, -50, -2885, 3848, 4877, 1995, 3579, 5777, 5170, 1154, -168, -3744, -6102, -3573, -3420, -3193, 15, 2436, 3031, -1738, -2093, -6617, -2879, -215, -3874, -8694, -7870, -2028, 3813, 10070, 4814, 2657, 6886, 8952, 10231, 9837, 15803, 13558, 11689, 11392, 7690, 2608, -4484, 1929, 5860, 3141, 2361, 3960]
17755C960R2m103l663O927J103k357L204M301N151k819r582k60K68M086p04r114
17739c510L946K295j792k127j089L85L744N011n260q03m623n384j118P663O939
17724D277K615q174m697L714J340M229m075o926M66O385o61P150L859k721n614
17709A167J925P156K273l780o588o728R041R801m83j802K884J490K431j061K658
17694B0384J730k003q978r57K678m473k898K258k314O0L178P770O753N754M205
17679C3147O814Q350J7760M4995P4043R6768N2213L1090L8920J4206m1789n3119
17667C23398m3246l3516l4358l3967l2937l5355l7625k7097m852J396p572l527
17655C0742l573m294J668k05p911j887M025l893j432j712j684n601P14K369K185
$$ y = [3960, 4052, -51, -3714, 3213, 4316, 1959, 5163, 9464, 14615, 11796, 2214, 1954, 2222, 6308, 5604, -3510, 436, 2731, 939, -1188, -2277, -1892, 1852, 6863, 1603, 800, -3823, -9207, -10325, -2662, 4277, 6892, -1282, -5979, -2265, -925, 3304, -771, -7697, -7231, -846, -1507, 5643, 9502, 6781, 1167, 3092, 10248, 12521, 8741, 2153, -4575, 4466, 14267, 13784, 11982, 14866, 16356, 18787, 17726, 20384, 22114, 20111, 11133, 10176, 12854, 8381, 5483, 7741, 5427, 5487, 8665, 16435, 23188, 28942, 33147, 39961, 48311, 66071, 111066, 185109, 281877, 334090, 365180, 404100, 418306, 376517, 323398, 280152, 246636, 212278, 178311, 145374, 110019, 72394, 45297, 40445, 41841, 34269, 30742, 27169, 22875, 24543, 24338, 16427, 14540, 18565, 14672, 13240, 11528, 9844, 4243, 4957, 7326, 9511]
17640I511o490O9N157l189k865L758J519q248R97o708k492O037J0406j66m641
17625B655q913q25j412N179O063k763j2156k23J291K819N612J375J136j949N893
17610C782k974n190L356M148K910J470P47P12l724p797l948L061K201M313J280
17595D347k927q542M010K06p915j704N020P38l328l275O117L491K321p330o917
17580a5688J977N806j59L07m497L519j433J411K564K251j702q98l841K127J1934
17565C678L215k635m893m065k344m537n37Q590k110J637m041k661K483j665K100
17550g785N024O034o21J213m793o565N994K569n700O89K244m214J197L018Q76
17535h20j77k271O345J3206M235K185j0542l215K096n785m784j842m168K392L187
$$ y = [9511, 3021, 3090, 8247, 5058, 2193, 5951, 7470, -778, 219, -6489, -8981, -2944, 7462, 7296, 2655, -6258, -7083, -8495, -3316, 2747, -16, -12172, -12395, -11104, -8285, -2673, -1298, -162, -2111, 3782, 808, -4382, -1026, 3122, 6032, 7502, 8249, 8961, 5237, -2560, -6508, -3447, -1246, 3067, 4347, 1420, -7122, -3112, -2906, -10821, -12525, -7505, -6767, -10095, -13370, -7253, -3762, -1441, -8771, -15688, -13711, -7905, -8064, -7757, -12254, -8735, -10168, -8757, -6193, -3942, -5644, -6542, -10383, -8256, 3678, 6893, 4258, -635, -4700, -7044, -11581, -12118, -3528, -5638, -4001, -8042, -10703, -8220, -9885, -7785, -2761, 3273, 2652, 3865, -928, -7493, -1499, 1070, -4630, -3941, -1697, -5911, -4714, -1696, -820, -997, -3268, 3077, 16283, 20518, 22703, 12161, 8946, 11042, 5257, 473, -1369, -5537, -3145, 42]
17520D2j356J919R26L948o4O5m306k590j561j098L065m158l094K151O69J625L618
17503a99L051K988n691n353K756l456m054K689J839O21j833L273N610p34l505
17488a998J416K305j314R2j721L892l015o09O90q490l143L714O792P42M55k445
17472b637r261J377N220K718O006K879R16m541k463j480M223L688l247K774J1
17457F183n867o863J653N713J401r62m904J091K320l187Q090m7J103J739Q99k66
17441H096J0945K4280K0167k457r781n999j2718o751j463k276k401r728j2544
17428b630n186K202L81o676j440M672M845M958p633j998P48J750J1456K33m134
17413A548j770r347J492P172N11K301k943k851mJ475k561J362O989K474q005p859
$$ y = [42, -1314, 605, 1531, 5479, 5415, 5480, 1174, -1416, -2977, -4075, -1010, -5168, -8262, -6111, -5442, -3817, -199, 2852, 5840, 149, -5204, -2448, -5904, -9958, -7269, -5430, -4809, -6642, -3369, 2241, 1507, -1998, -582, 1723, 409, 501, -1220, 2672, -343, -952, -262, -8752, -11895, -8181, -1389, -647, -192, -2637, -11898, -10521, -5301, -2583, 3423, 6302, 7218, 2677, 214, -1266, 2957, 6645, 3398, 6172, 6183, 316, -6547, -4894, 819, 2220, 1258, -3646, -2555, -235, -3422, 4668, 4621, 5724, 7463, 8362, 8096, 19041, 43321, 63488, 61031, 51250, 45251, 32533, 25782, 24319, 22043, 19642, 9914, -2630, -7816, -5614, -5233, -11909, -13349, -8677, -3832, 1126, -6507, -8505, -7757, -6007, 5449, 5682, 1548, -222, -9569, -8077, -905, -394, 1907, -1036, -3887, -3891, -2416, -4977, -3615, 3374, 5848, -2157, -10016]
17397a0016M255N454K037k90n273J139L092o600K796M399l624K128O596o104K038
17382B027l443l842m047N41L628k901l998j730l382N181K762N0p283k585M342
17367a4680j242P219Q143J64K42K321M13r43l774m986N3M012j73j106n129q786
17351a8252J617M194l592j84K367Q823P945q400L60K402l513j781k909K673R175
17336I25K647J93n33k910l552L791k066M970O744o904r697m22j798J590J599J232
17320d191M620L896j064m176j97L394j661k209K645l979J330O334P653M332O402
17305B3129J324L183K0938L9940M9439K3211R07k2170k7085j0163J443J151p487
17292I7760j2992k1940j6188j8158j0256Q298O911n847n872o355n696O65L853
$$ y = [-10016, -5761, -307, 1730, 1440, -3833, -2694, 398, -6202, -3406, 993, -2631, -503, 6093, -11, 2027, -1416, -5258, -9305, -8764, -5136, -8037, -12035, -13765, -17147, -11966, -9204, -9154, -16437, -19022, -14680, -15922, -8703, -560, -396, -154, 2167, 2580, 1637, -2137, -7123, -7070, -3058, -3231, -4337, -9466, -18252, -16635, -12441, -16033, -16217, -13850, -5027, 2918, -5482, -5122, -2720, -6233, -8014, -10923, -8250, 925, 3572, 3765, 3232, 322, -3230, 561, -1505, 3465, 10209, 3305, -6392, -6814, -8612, -7022, -5423, -4191, 429, 4325, 3261, -915, -1112, 2282, 621, -1588, 1057, -2922, -1592, 4742, 12395, 16727, 23129, 24453, 27636, 48574, 88514, 137953, 161164, 162071, 139901, 112816, 102653, 104096, 105247, 97760, 84768, 62828, 46640, 28482, 18226, 26524, 33435, 27588, 21716, 15361, 9665, 10330, 14183]
17279A4183k119m428m345k886O76O280M470L618N177J6857K0270K9798M7700L3350
17265A68601O165j8164l0076j6743p981m746q653j2419j9788k0830m896p682j0775
17252A2013p941L227j412N433J138j962l733j402j771l465j53J277j19L334l183
17237A281m132m73j369q48j160J239lJ814k02j074J076L612J566j899j460M082
17221B050M147M712m60m619J616J485p252j043J122P11R417j436j925j498J905
17206H932l167j1732J640L405l972K216m619J0938K533r177q472k077N559K774
17192e219K59L985k70k687J056m957q462k578P822M618P20R948N558L316j519
17177A1590n624k887m235K435L889k061n039k427K340l245l922L647k039j576
$$ y = [14183, 12064, 7636, 3291, 405, 1081, 7361, 11831, 15449, 20626, 37483, 57753, 87551, 135251, 168601, 174766, 156602, 126526, 109783, 101802, 97056, 88403, 75984, 56196, 35366, 30470, 22788, 12013, 4072, 7299, 5887, 11320, 12458, 10496, 6763, 5361, 3590, 125, -28, 1249, 1130, 4464, 1281, -2851, -3324, -4693, -5541, -6701, -5462, -5465, -3651, -3853, -4927, -3851, -239, 1327, -572, -2032, 2050, 6197, 10909, 10449, 5830, 7446, 8931, 1679, 636, 1758, 2469, 11886, 10450, 8525, 7027, 8932, 5765, -5967, -4327, -922, -4894, -2678, -7297, 3641, 6174, -3003, -11475, -13552, -7993, -5219, -4960, -975, -1245, -3932, -2876, -7833, -16295, -18873, -11051, -6433, -5713, 4235, 9793, 13109, 11590, 5966, 3079, -1156, 1279, 5168, 3107, -1932, -4359, -2019, -5264, -9186, -5539, -7578, -9154]
17163i154K362N968N63p644l083M309Q70J410L892O196Q584o70m970r115j712
17148b194L431p51J156l29o06K4L167m00p721L745P457K565p108m927O76j231
17132c046m164l059l592N255O619L496R08k394L86l85K211K434m147n766k29j745
17116g218o21j519j983P685Q61K894P045O176l108p998q296j238O66j276j182
17101i112Q769L255L485O621p196m084k190l151K698l245q04N26l423m175M050
17086g976N391L030j957o716j237Q685O122k252q845j1153j464Q797j952m980
17072a6507k084J996J2172L824k236j792k89N02N79L175o6m185k25J838L39n388
17056h347L633J854J975M075L542m474L08N417p119j765O860L637J688l5n727
$$ y = [-9154, -6792, -824, -261, -7905, -10988, -6679, -5809, -4399, -507, 5689, 14273, 13603, 8633, -482, -2194, 1237, 486, 1642, 1313, 707, 731, 3898, 3498, -4223, -478, 6979, 9544, 2436, -2491, -1815, -3046, -7210, -10269, -13861, -8606, -1987, 1509, 2417, 23, 409, 24, 2235, 4669, 522, -5244, -5473, -7218, -7839, -9358, -11341, -3656, -2795, 99, 7144, 13320, 10212, 2214, -6082, -7320, -6654, -7930, -9112, -343, 2912, 6397, 13018, 5822, 1738, -452, -3603, -905, -4150, -4954, -4428, -7851, -12026, -7976, -2585, 445, -1512, -8228, -9465, -780, 5342, 3090, -5755, -16908, -18372, -9575, -11527, -16507, -18591, -16595, -4423, -599, -2835, -4627, -4916, -4414, -3835, -660, -726, -4911, -5136, -3298, -2959, -8347, -4714, -2860, -885, 3190, 6732, 2258, 2566, 7983, 864, -901, 5959, 9596, 11284, 11249, 5522]
17041E522J000Q87K280o54k2L772o295l911Q0j004j385P336M255l34K92m746l133
17024C940m664O953Q265l859l601j869o005Q694l683m555k046j411p71m949k005
17009a1566M696L471j570l553k688J0443P986J322k914M579N231p8o079J990k982
16994H288J025K10j796o685l501K274j493M191R02j585k500o97N537L272J923
16979I365p210k772o003K612N385N515k818n937j0352O891K820k627j11r225n200
16964a9667N780K013l262N788J0078j148k571j593P95J004L013q88q795L802L911
16949a740M578q350Q412Q114l021o432k303k808j286O870K997K832r846m731J069
16934e645J811M574N372J400n965j0031n182j085j61J0385L859J845r76j424K539
$$ y = [5522, 6522, 7409, 9689, 9035, 9013, 12785, 6490, 2579, 2659, 1655, 270, 7606, 11861, 11527, 11819, 7073, 3940, -724, 6229, 14494, 10635, 7034, 5165, -840, 7854, 4171, -384, -2430, -3841, -4612, -9561, -11566, -6870, -3399, -4969, -8522, -11210, -767, 7219, 8541, 5627, 10206, 15437, 15359, 9280, 11270, 8288, 9313, 9523, 7727, 1042, -2459, -185, -1678, 2513, 3415, 1830, -670, -1367, 4170, 7442, 9365, 2155, -617, -6620, -4008, 1377, 6892, 4074, -1863, -12215, -5324, -2504, -5131, -5242, -14467, -19667, -13887, -11874, -15136, -9348, 730, -418, -2989, -4582, -3787, -2783, 230, -658, -9453, -5651, -1740, 2838, -5512, 2900, 11014, 7993, 1561, -742, -3550, -4836, 2034, 5031, 7863, -1983, -6714, -5645, -3834, 740, 6112, 7512, 1547, -8484, -13666, -14751, -14912, -4527, -668, 1177, 201, -1223, 1316]
16919A316K286l645j043m298k13K789Q642N13o34n873n941j484n420k537N891
16904i651O556L779k350N364L879j806m624l100m43J184P108L047k637j376l651
16889A279m472k496K415o861k176R13k415j331k744L164P907N968L683o073j085
16874d324p96K848j689M16l786J003J1034J240j978o676K28R633N751l795k948
16859F161O02k267n742n895j0553K745P513K319J062N363L733J91P49p068L455
16844B368R19p841q46p608K033R973Q588N740Q10l598l932o023k734o549l305
16829a2005Q81L071J526K156n347J708M221k693l900j470J0507O618M093N98m398
16814E566O88k574j464j233l634q66K58K453J072j712m89l885k758O12k155L16
$$ y = [1316, 3602, -43, -1086, -5384, -5597, -2808, 5834, 6347, 5713, -160, -6101, -7585, -13005, -15542, -9651, -3095, 684, -1666, 3698, 7577, 5771, 1147, -1953, -2396, -1212, 5896, 8943, 6306, 4930, 1279, -3193, -5689, -3274, -10135, -12311, -11398, -13813, -15144, -17888, -14724, -6817, -849, 2834, -3239, -4324, -5120, -2272, -3961, -3545, -7331, -6328, 4706, 5946, 3968, -2708, -2480, 7153, 12904, 9109, 6161, 6763, 4496, -1246, -7141, -17694, -14949, -7436, -5117, -4055, 1308, 5041, 5232, 5981, -1087, 2368, 3287, -4554, -5400, -13008, -10975, -1002, 7586, 13326, 14136, 10538, 6606, 583, -2151, -8700, -12005, -11124, -8053, -6527, -4371, -9718, -8010, -3789, -6482, -10382, -11852, -1345, 5273, 9366, 9964, 5566, 6254, 3680, 2216, 983, -2651, -3517, -3259, -806, 266, -1446, -1935, -5820, -8578, -7966, -10121, -9805]
16798i805j31J63M400l902j319J801M243P906O02o462K505L987J281k485L776
16783F560K477m291n752J400J507m389R99L854k797K975K130J600l58m492j445
16768b2r427j797J1014P773J119k64k104p701n840K521M444N15m943L03J535l682
16752f556J321L953p07k132J389m685J676p2L685K029n303p094m300O020K090
16737h686J2653L976m592m663l686j632N56P266m542l238L923n147N92j436n412
16722a4068N673M29L243K706j0014L250P105m033K064j073P79J575J190l41k590
16707d105j135J843j092K336M312N636L544j464m316k505R58L249m800j544l71
16692E46J864K112O123l95l247k526j975j421N138K157j590o612n486j462M941
$$ y = [-9805, -9936, -9773, -5373, -9275, -10594, -8793, -4550, 3356, 3958, -2504, 1, 3988, 5269, 2784, 6560, 9037, 4746, -1006, 394, 1901, -2488, -1489, 2365, -432, 2543, 4673, 6273, 5915, 1423, -22, -9449, -11246, -232, 7541, 8660, 8396, 6292, -1409, -7249, -4728, -284, 231, -4712, -4409, -2874, -6556, -5235, -1282, -1989, -4121, -2732, -7417, -5741, -5813, -2128, -99, -5402, -12496, -16796, -10776, -8686, 3967, 7943, 3351, -1312, -4998, -6630, -6074, 1192, -3350, -6588, -2665, -7812, -7220, -8656, -14068, -8395, -7966, -4723, -2017, -12031, -8781, -1676, -5709, -3645, -4718, -3939, -2364, -1174, -1515, -4105, -5240, -3397, -4489, -2153, 2159, 7795, 11339, 9875, 5559, 3054, 4012, 7261, 2461, 917, 546, 2410, 4522, 10645, 10250, 7003, 4477, 2502, 1081, 6219, 8376, 6786, 174, -5312, -6774, -1833]
16677a833M234m112o217O779M102k41n864r826L867Q241k485n308K565L441L721
16662A064M666k180j743l378K179O850J206J277l801n385k334K4n216L438K858
16647d75m547k137L499m645L010j107k80o97J652K3l292r48N57K93k297k468o41
16630a4500J881K529K926M668N966o588n486K066L37k123k958O763L103J06Q78
16615d32k009K958k064m582K61R621M519J206L091p216n890R80l518o59R407k496
16599C177r490m293L680j077O077m834m507j112p61P424Q472k955k108j751j999
16584f057m85J091Q42R66K261j913j896n485m727N05O780J12L26P292M972l934
16568F50M589j324r2j022n66J114o126K174K542q45n719r155M436O741P502M38
$$ y = [-1833, 2401, -1711, -7928, -1149, 2953, 2712, -3152, -12978, -9111, -870, -3355, -8663, -6098, -2657, 1064, 5730, 3550, 1807, -1571, 608, 7458, 8664, 9941, 6140, 755, -1579, -1555, -6771, -3333, -475, -5022, -7159, -3660, -8305, -5295, -6402, -6682, -7379, -5727, -5704, -8996, -9944, -9387, -9094, -11391, -13859, -14500, -12619, -10090, -7164, -2496, 3470, -3118, -8604, -6538, -6201, -8324, -11282, -4519, -1416, -1310, -432, -2441, 517, -1547, -6129, -5868, 3753, 8272, 9478, 12569, 5353, -537, 443, -3075, -3734, 5673, 3177, -6313, -10606, -6926, -8003, -1926, -6760, -11267, -12379, -13140, -5716, 2756, -199, -2307, -4058, -6057, -6542, -5451, -4609, -3643, -1382, -3295, -5191, -10676, -15403, -14898, -8118, -8006, -7680, -388, 4584, 650, 5239, 3915, 3823, 2801, 2235, 3349, -2777, -603, 1939, 1094, -4625, -13780, -9344, -2603, 4899, 5337]
16552E337q421j400j646L318R674J707n208q215k509O27M879M483j375l030K42
16537a537J194J536M265j358k249l118K419j541k478J84O696M946r32p673o366
16522f012l959k558O725O220n608o304j303Q587K645L038j084m387k998O629M202
16507C833j633k524l371K382P360R98M811K54o845q420k007M945J413K628J283
16492E107k167p66J233K867k344o733J666J365j774l294k054k634N388L601K484
16477A945l462m024J465N305J319o029j487j22l863P35j582P41K336Q407l67k964
16461a647N007o116J849J028k627l42R44r843m295J3434j296o436M467R57N244
16446C28O929K409n962J19k570n927k377oL437O796m785r008n556p86o70K006
$$ y = [5337, -3084, -4484, -6130, -2812, 6862, 8569, 3361, -4854, -7363, -6736, -1857, 2626, 1251, -1779, -1537, -343, 1193, 5458, 4100, 1851, -1267, 1152, -389, -2867, -2683, 4013, 8959, 8027, 354, -6012, -9971, -12529, -5804, 416, -5192, -11496, -12799, -4212, -1567, 1471, 387, -4000, -6998, -369, 3833, 2200, -324, -3695, -1313, 6047, 7045, 11856, 12110, 5265, -3155, -5162, -217, 1196, 3824, 5107, 2940, 2174, 3407, 6274, 3930, -2803, -1137, 228, -1546, -4840, -6894, -9528, -4140, -539, 1945, -1517, -5541, -4076, 1229, 2548, -3481, -4968, -5090, -8953, -8218, -9800, -9059, -6723, 1684, 1317, -1647, 3360, -2756, -907, 121, -2506, -2848, -1904, -11747, -16042, -2608, -3904, -10340, -5873, -4916, 328, 7257, 9666, 3704, 3823, 1253, -4674, -7051, -7057, -3620, 3176, -1609, -10617, -16173, -16959, -17629, -15623]
16430a5623Q999L107J196J413j699M537N340n699r132o087L661Q233K012k180
16416a922O143J654q02k812J203j330n408l210K118L186r50M547L540l373l808
16401a224J028M08J478p591n485K687K475M347j662j289l487N82j896O77p596
16386a6548o853R618R605L772K36k684j001M421P580N538o869l488m163l793K974
16371a655O401K562q727p072k885k568N241l655l711L905J767j866M21Q685K343
16356h14l838K494k562L161m396J684k057O11Q156l146M517l774p474l33q372
16341a6143K682K855J840l349l510L829K828j690M980j93o38M099l073R0K239
16326c154K789K028N63r740J551r91j676O599M305N970l053p888K774k397l526
$$ y = [-15623, -6624, -3517, -2321, -908, -2607, 1930, 7270, 1571, -7561, -13648, -9987, -1754, 258, -1922, 4221, 5875, 5073, 2261, 3464, 2134, -3274, -6484, -4366, -1180, -2130, 2417, 5957, 2584, -1224, -196, 212, 1690, -5901, -11386, -8699, -6224, -1877, -3539, -4828, -8315, -7733, -9629, -8952, -16548, -23401, -13783, -4178, -406, -170, -2854, -3855, 566, 8146, 13684, 6815, 3327, -836, -4629, -1655, 4746, 7308, -1419, -8491, -11376, -13944, -8703, -12358, -16069, -12164, -10397, -12263, -11842, -3157, -814, -4652, -2158, -4720, -1559, -5955, -4271, -6328, -5717, 2439, -707, 3810, 36, -7438, -7771, -16143, -13461, -10606, -8766, -12115, -15625, -11796, -8968, -10658, -5678, -5871, -6509, -2410, -5483, -5393, -3154, -365, 1663, 2226, -7514, -5963, -6954, -8630, -2031, 2274, 8244, 5191, -2697, 77, -2320, -5846]
16311e846m89j352m378N031P661k524j725J576M958L915p488o0M141k290K78R94
16295B402r76K172j93J298j533k314k553L345N987k26l698R84k013K981j978l335
16279C50k794l981J832P881M81M515p139q759l905M046J521M75K316k617o81M638
16263a821K446k60L4K248L18j681l156j608p223M315P703l381m397k561m142J025
16247a2141M034M364P367m798n843l352l230K661P716J207P330l988m047P89o56
16232b587J97L229L517M572k420o623k844J884L687k661M84J412p51j718O93R7
16216A68l819P688P006k225o273o893m617L353M988n76P8L307R173K544l900n034
16200D968m284l312N074J315k941j725l719j277M732J3699M225l710p127p177
$$ y = [-5846, -6335, -7687, -12065, -7034, 627, -1897, -3622, -2046, 2912, 6827, -661, -721, 3420, 1130, 1408, 2402, 1426, 3598, 3405, 4703, 3170, 856, -1697, 1648, 7635, 7409, 3711, 4695, 2682, 5663, 3685, 350, -2444, -6425, -4593, 3288, 3769, 8284, 1145, -7614, -11519, -7473, -5952, -5477, -3161, -5778, -6459, -1821, 625, 365, 399, 2647, 2965, 1284, -1872, -3480, -10703, -6388, 1315, -2066, -6463, -9024, -13166, -12141, -8107, -3743, 3624, -1174, -7017, -10369, -13599, -10938, -3222, -2015, 5315, 1327, -2720, -1931, -2587, -2390, 839, 4356, 8928, 6508, -115, -2959, -1075, 2612, -49, 435, 1847, 1096, -622, 71, 168, -3651, 4037, 11043, 8818, 2545, -4348, -8965, -5612, -624, -1200, -1122, 2185, 11358, 13902, 10002, 4968, 684, -2628, 2446, 3761, 820, -905, -4624, -5901, -1169, 12530, 16755, 13045, 5918, -1259]
16186a259M84K049m850l147j123o754J494M322L061L454k062L525N452N497J0627
16171B0770l291j2794l420R81J636k297K562J194j797m405o783q24L294K248K413
16156e13j301j246l269M983j156o88M908n814n34O767L217k132n838O629l187
16141H26J221O419q67k627l080j381m646M487K906m19m548P91N960r418o44n239
16125a0259q715P58K150M141R773M307o29K558J835m013p681m971l26k46N803
16110e515J2219p598m930L453K968M189L4P886P181q147r861o04j112j68M104
16095D099M952n431l588K929l7j71n38M15p352K836Q56m916l58J934N68K170m389
16078f021n130K99O156p45m50j743L84M226n791K964p11n836k825O433M925O91
$$ y = [-1259, -775, 1274, -3576, -6723, -7846, -14600, -13106, -8784, -5723, -2269, -4331, -806, 4646, 10143, 20770, 17479, 4685, 1265, 2246, 3882, 1585, 4147, 5341, 3544, -861, -7644, -8468, -5174, -2926, -513, -1814, -3060, -6329, -1346, -2502, -3190, 1718, -4096, -4630, 2137, 5354, 3222, -2616, 4013, 826, 2047, 8466, 7599, 4972, 1892, 511, -4135, 352, 3258, 2839, -1709, -918, 5042, -4376, -5020, -10259, -18974, -18216, -16066, -11925, -2152, 2155, 1526, 4084, 5919, 1906, -5775, -10746, -11072, -11318, -5515, 6704, -894, -5824, -2371, 597, 4786, 4820, 12706, 19887, 11740, 1879, 1275, 163, -5, 4099, 9051, 3620, 32, 2961, 2924, 2753, 2215, 2630, -4722, -1886, -1030, -5946, -6304, -4370, -3802, -1632, -6021, -11151, -10852, -4696, -5441, -5891, -7634, -7250, -3024, -8815, -5851, -6562, -12398, -15223, -8790, -3865, -3174]
16062c174n254k232K693M729o388j319Q31J667l203J260K384P956L089L200n230
16047A009m705m191k014p918q7P53J536P790j635J954M033K478l994K933o517
16032h575l822p12q23P181P880k999L92K035m565q834j3M903J706K233k484j957
16016h454l08k321L933P195K702j872k092k432K613q12j833M30m56o72m638N581
16000c436K704L305O939L161l700n076o560m151M269M491p8k156K220N87k767
15985b48L09l64l947J800j157J480L940P069R93j930M523m305j0344N48L034k110
15969g09m23r70r73P63N48K378j653r35l194K064L13m82L90N349j119l825L282
15952H04l16M34J840j253j358m07K351n817q673N434J098N005R399J602q31k525
$$ y = [-3174, -8428, -10660, -7967, -3238, -9626, -10945, -10114, -8447, -11650, -10390, -8006, -50, 3039, 6239, 1009, -3696, -7887, -9901, -17819, -17906, -17153, -15617, -7827, -9462, -7508, -3475, -997, -4991, -2058, -8575, -12397, -13109, -13932, -6751, 1129, -1870, -1478, 557, -4008, -12842, -12855, -7952, -6246, -4013, -6497, -8454, -8762, -11083, -7150, 45, 2747, 875, -1217, -3649, -1036, -1848, -3681, -3251, -3707, -4379, -9017, -3436, -732, 2573, 9512, 12673, 8973, 3897, -2663, -6814, -2545, 1946, 1868, -288, 1932, 2519, -248, 61, -303, -4250, -2450, -3607, -2127, 1813, 8882, 9875, 7945, 12468, 8163, -2181, -1633, 1401, -709, -1132, -2102, -3075, -2312, -1764, 614, -1039, -1974, -5168, -3104, -2791, -3273, -2883, 2466, 1347, -2478, 804, 488, 922, 2762, 1509, 151, -256, 2095, -3722, -12395, -6961, -5863, -858, 8541, 10143, 9312, 6787]
15936F787m117m142M376k265l521l043O189R244R448k935j3387o829Q398M711
15922H914l81p317n702O32K381L550k154n130r165L054l632K886L906k07O180
15907b185O747Q606M693l391q693j048N276l424p560o306m18K925M005N411J864
15892F502O60J735q920p681P34N593k63j880M690J818J735k488p006m941n36k842
15876a3090j379P749K317n263L814M999L679m144n878l089K495P467M470Q24p986
15861c015j0024K741J1778N605j855n120k935m392N83l476K520N862R05L189j417
15846I49k873K618O896J426P87l049r074p317K883M376Q59J669R37p59j946L662
15830B044N331l08j527k152k861L030q184n295l57L389m108k736O161J159m797
$$ y = [6787, 2670, -1472, 2904, 639, -2882, -5925, 264, 9508, 18956, 16021, 2634, -4195, 4203, 8914, 8533, 1216, -4486, -3854, -1473, 2077, -77, -5207, -14372, -11318, -14950, -12064, -8158, -8365, -2185, 4562, 13168, 17861, 14470, 5777, 4729, 10005, 6581, -979, -7285, -7703, -4778, -773, 4638, 6502, 7162, 8897, -23, -7704, -6970, -1377, -1640, -3520, 1170, 2988, 4723, 2235, -4771, -9712, -10248, -13090, -14469, -6720, -4403, -9666, -5852, -853, 2826, -1318, -7196, -10285, -7790, -323, 4147, 4971, -3015, -13039, -10298, 1480, 7085, 5230, 110, -2825, -7217, -6634, -10110, -7590, -1728, -823, 2366, 949, -1924, 694, 7590, 9016, 9803, 6754, -2320, -9637, -6754, -2378, -1519, 150, 1087, 328, -1618, 2044, 7375, 7067, 5540, 3388, 527, 3557, -4627, -9922, -10279, -6890, -10998, -13734, -7573, -6414, -11211]
15815a1211Q492J461j11K364j65J155k693r79l215J642J804l770k668O406l500
15800d988K141N145K659q276m010P773n05o699K262O219l52L03j260o643l56L558
15784c029L847K487K142m01K377Q69p164m068N72n35J330P172L549P95o243q263
15768d563L13j030m895J419K871O53J267l486P302O052n411m576N428o142l21
15753e119p40m2J5958K985o567k888J633j102K071k688r309p743O87J0607Q776
15738F519J033k335O974N295m928q798m686P47L746R609k424r432m298K862O451
15723F335n299n477N999j076j04K771J427J324M61m255l078M712n31r02R56N4
15707C317n17M6k732o447L495N213P33K064n44l193p168k771m111J286M682Q336
$$ y = [-11211, -2719, -1258, -1369, 995, 830, 1985, -708, -1687, -4902, -3260, -1456, -5226, -7894, -1488, -4988, -2847, 2298, 4957, -3319, -7329, 444, -61, -6760, -4498, 1721, 1369, 1672, 412, -6231, -6587, -3029, 818, 3305, 5447, 5046, 7423, 8292, 1128, -2940, -2368, -2903, -1573, 5599, 9148, 9943, 3700, -4563, -4250, -5280, -10175, -8756, -5885, -5232, -3965, -7451, -149, 5903, 492, -4084, 1344, -4798, -5119, -5859, -5901, 10057, 13042, 6475, 3587, 5220, 4118, 6189, 3501, -5808, -13551, -12864, -2257, 6519, 7552, 5217, 12191, 17486, 12558, 3760, -926, -179, 3567, 13176, 10752, 1320, -2978, -116, 6335, 1036, -4441, 1558, 482, 378, 3149, 4576, 5900, 6361, 2106, -972, 3740, 3209, 2307, 3263, 3317, 2800, 2846, 114, -6333, -2838, 2375, 3108, 5172, 4628, 1435, -5733, -8504, -12615, -11329, -6647, 1689]
15691A689k264o580j313n77M932L435%j268j320P69J821J571n09k538N479M306
15675G633o578n24m721J14L382m6j291m736L915l729k253M525K991n825k796M306
15659e633k041L143K784O998O94n358m066k637O927l880p070O090P80q83O296
15644B144N592p311k722O810M301k447m926r104j815M631j696p85J310m433K669
15629g782M583l654K834j327j701L163J1L003R767L029l808n881q33k382k315
15614c293n02k435J059O068K298k234n462p069L489K747p614M214L879R31m608
15599h532m812r65O57O834M366K133o439r178N174J803M156N250j841L83k129
15584c140p709j963K108O762J649L691k074K335M564j41l214Mj807n12k915n56
$$ y = [1689, -575, -7155, -8468, -9045, -4113, -678, -678, -1946, -3266, -2497, -676, 895, 386, -2152, 3327, 7633, 1055, 531, -4190, -4076, -694, -740, -2031, -6767, -2852, -6581, -8834, -4309, -1318, -7143, -9939, -5633, -7674, -4531, -1747, 5251, 5945, 587, -3479, -6116, 811, -3069, -10139, -4049, -3269, -4152, 2144, 7736, 425, -2297, 4513, 8814, 6367, 1441, -7663, -9478, -4847, -6543, -7328, -6018, -10451, -7782, -3199, -6853, -4019, -5346, -7047, -3884, -3873, -870, 8897, 11926, 8118, 2237, 1404, -978, -3293, -3795, -6230, -5171, 897, 3195, 961, -4501, -11570, -8081, -5334, -12948, -8734, -4855, -3924, -8532, -13344, -14309, -13652, -6818, -2452, -319, -6758, -15936, -10762, -8959, -4803, 447, -1394, -1011, -3140, -10849, -12812, -10704, -3942, -2293, 1398, -676, 1659, 6223, 6082, 2868, 2872, 1065, 553, -2362, -2918]
15568b918J121K037k229k770m660j524K684L763J06l675l17l912k277L638M897
15553f036N810J49q02j945K625L428j366o439m181O871P078n600o970o91j026
15538i095M258M072l550L850M10K099J604k176k985L60J182p733j671l38K009
15523g704k186K020J459r71L687O35l293l212M151M668l334m400m37n71L446K567
15507c475r90m723K259K318j591N021J397n773j241J291J073M211M966r43o26
15492C174J511J7j4n251Q10K418M637j219q241j556J704o999R33K197J199R194
15476D514M348l563o717n356O941O556L788m601q57k406K716l968m924M814K858
15461D143L580j866N205O041m275p492k727M152J498q946o279J976J837k619j44
$$ y = [-2918, -1797, 240, -1989, -4759, -9419, -10943, -8259, -4496, -4390, -8065, -8382, -12294, -14571, -10933, -6036, -226, -77, -879, -2824, -199, 3229, 1863, -4576, -8757, -1886, 5192, -408, -7378, -8069, -9095, -4837, -765, -4315, -465, -55, 2044, 3648, 1472, -1513, -1153, 29, -7704, -9375, -9713, -7704, -9890, -7870, -6411, -7382, -3695, -3060, -6353, -9565, -5414, -746, -4080, -8480, -8917, -9488, -6042, -3475, -4465, -9188, -6929, -4611, -6202, -1181, 216, -5557, -6798, -5507, -4434, -223, 4743, 3800, 3174, 4685, 4702, 4688, -563, 247, 2665, 7302, 6083, -2158, -3714, -2010, -9009, -8076, -5879, -4680, 4514, 8862, 5299, -1418, -6774, 167, 6723, 10511, 5910, 5053, 2647, 5363, 1395, -3529, 1285, 4143, 7723, 5857, 11062, 17103, 12828, 5336, 2609, 6761, 8259, -687, -6966, -4990, -3153, -5772, -5916]
15446e916K459N490J492l423J837M475N431o962n601L65L797K754j825k940N302
15431F735k257p729k312J0558J686O229Q398q024r535r477n375Q56k392r85j63
15416a3787R669J1741Q928O24m938qj539p993j410p582m312l93L478l345k076
15401a2943O5M280P555L91j106K172k583k448m630l197N916N368J0119r88l464
15386D507J4n956J471N162L082o405l849L350l927k588K854n808k14j491J613
15371h185M826Q76q77k99M265m738m257N96J048M970N816N410k365l433K418j696
15355D375k769P220J930l744n587j3918J94P073P752k302n932K901K891p07m31
15340a054j696j00J151N042k859m248q82L995k926n78M188J620l076J00k601m253
$$ y = [-5916, -3457, 2033, 3525, 102, 1939, 6414, 11845, 4883, -718, -353, 3444, 6198, 4373, 1433, 6735, 4478, -3251, -5563, 4995, 6681, 12910, 21308, 13284, 3749, -5728, -11103, -10247, -12639, -13624, -13787, -4118, 7623, 16551, 17175, 12237, 12229, 10690, 2697, 1287, -6295, -10607, -11000, -7522, -10867, -12943, -12878, -8598, -1043, -652, -1758, 414, -2169, -4617, -9247, -12444, -6528, -1160, 8959, 7971, 4507, 4521, -1435, 36, 5198, 8280, 1875, -1974, 1376, -2551, -5139, -2285, -8093, -8307, -9798, -8185, -3359, -2483, -3360, -3659, 606, -4132, -8389, -7793, -6745, -1775, 4041, 9451, 7086, 3653, 6071, 4375, 1606, 8826, 10756, 7012, 1425, -12493, -12299, -5226, 2526, 224, -5708, -2807, 84, -623, -1054, -2750, -2850, -1699, 3343, 484, -3764, -4646, -651, -3577, -4155, 33, 1653, -1423, -1323, -3924, -8177]
15324h177K005M695M628n098j1430K508K161O269L777M058p112q062m043N020
15310h801P321l874J707Q21p49j493n95M321k577O561M257R97j736l661j879m635
15294d015J592j165J698R476O343n330l013N25k507M126O144O430l969m782q143
15279C410o779k028J0423r00o775l230k768L913M536J115l309L46J072o359K696
15264d637Q25k393k527r71p03J684r82N118R637O94n486J253n390L29O876j715
15248A612N76L7k690N913m403j957l157n906J985r35k552N728o3n120J2476O000
15232G544q201R8L924J073L289o126k152L172N534k72j171j329L160n560p366
15217d383m576K808O799M81l098k923j727P04M79P897p990m300O018p86o7J560
$$ y = [-8177, -6172, -1477, 3151, -1947, -13377, -10869, -8708, -2439, 1338, 5396, -1716, -9778, -13821, -8801, -1480, -5354, -3647, -2826, -3575, -5068, -5663, -1342, -3919, 2642, 6899, 7896, 6160, 2499, 620, -4015, -2423, -3588, -1890, 7586, 13929, 8599, 5586, 6111, 3604, 7730, 13874, 20304, 16335, 11553, 3410, -3369, -5397, 5026, 4126, -2649, -5879, -8647, -4734, -198, 917, -2392, -2046, -974, -7333, -4637, -3812, -6205, -8732, -9703, -10406, -8722, -9704, -4586, 5051, 5745, 259, 1512, -3878, -3549, 3327, 1612, 2188, 2225, -465, 5448, 1045, -912, -4069, -9975, -7990, -8925, -11477, -5749, -5812, -10932, 1544, 7544, -657, -559, 3365, 4438, 7727, 1601, -551, 2621, 8155, 7883, 6712, 5383, 8543, 2983, -4383, -8959, -6151, 648, 1129, -1969, -4892, -6619, -5915, -5436, 2461, -5529, -9829, -3811, -4597, -4664, -3104]
15201c104l385K238Q306L115K066o056j3837p53Q784j87J654O890J484M783J306
15186A3304n739m646n957l466q599N681Q290N314k252J135K87n565k838L964j123
15171b210n73J615q06J354j65M996N525l166p28o131n275N348N952K196J789k142
15155G579l736K348l455K752N18m257j688r03R247M736r126l269N16R2n425M397
15139C26l8j380M918j522j578l13J694n189p352P190l9n735n399P583N014j331
15123c151N322L82J455k369R091N640q24o513n050J449L212M269m335R42m986
15108D534p318o592j79O287N631k318l169L82j491m500p7k510M404J725J70O803
15092A782J054k079M11j794q16l45j124j133n42J462p89L289K81n769M91J0802
$$ y = [-3104, -6489, -4251, 4055, 7170, 9236, 3180, -10657, -11410, -2626, -2813, -1159, 5731, 7215, 11998, 13304, 7565, 2919, -3038, -6504, -15103, -9422, -1132, 4182, 1930, 3065, 3352, -2213, -5051, -1087, -2210, -2783, -1168, -1974, -620, -785, 4211, 9736, 6570, 5842, -289, -5564, -216, 5736, 7932, 9721, 7579, 3843, 6191, 2736, 5488, 6006, 1749, 61, -842, 8405, 13141, 4015, 746, 1262, 1354, -4071, 326, 288, -1092, 3826, 2304, 726, 413, 2107, -3082, -10434, -3244, -3283, -9018, -14417, -6834, -1820, -3151, 2171, 2553, 4008, 1639, 10730, 16370, 15546, 9033, 3983, 5432, 8644, 12913, 8578, 9520, 4534, -2784, -9376, -9555, -3268, 2363, 45, -3124, -2742, -4233, -8733, -8810, -11320, -6916, -5191, -5021, 1782, 2836, 757, 1168, -626, -1442, -1787, -2911, -4044, -4586, -3124, -3913, -624, -343, -6112, -5621, 5181]
15076E181j888l500m660n804M91q3L398J73J821l43j201L067J251M459K661L832
15060H855O581k003m045j3098o805l660m786L895K560K49O358j463J307L831M099
15045A875j735P656O696J460o55k815l342q299m800K726L018l16k184K643k1L77
15029B284L622O175k500j059n311n992l477O197L596o185r080L951N938M019M908
15014G086n598q319L364J10O40K061J578O782j100q266K816O728L477L473q102
14999F730q662k845R591N620J064l475j60o18j878r244n03L036P010M469p739
14984B396p197N455N940K3m942k302J751M71K20m5K215Q3m563n82J599j420J675
14967G77j748l086k852j873n27Q110p92l205R47N366M928N570p811n704l143K630
$$ y = [5181, 3293, -207, -4867, -10671, -10180, -10263, -6865, -6692, -4871, -5214, -6415, -3348, -2097, 2362, 5023, 8855, 15436, 13433, 9388, -3710, -10515, -14175, -18961, -15066, -12506, -12257, -5899, -7362, -6055, -2224, 1875, 140, 7796, 14492, 15952, 15297, 12482, 9140, 841, -3959, -1233, 1785, 1469, -715, 1928, 1907, 2284, 5906, 12081, 9581, 8522, 3211, -2781, -6258, -61, 3535, -2650, -11730, -7779, -1841, 2178, 7086, 1488, -6831, -3467, -3357, -2717, -656, 922, 7704, 6604, -1662, 1154, 7882, 11359, 14832, 6730, -1932, -4777, 4814, 10434, 11498, 8023, 7863, 7245, 5367, -3877, -4380, -1344, 5666, 10135, 2396, -4801, 654, 6594, 6617, 1675, -627, 1124, 1595, 1815, 1770, 3985, 4068, -495, -1077, 522, -898, 777, -971, -4057, -6909, -8782, -9309, -1199, -1991, -5196, -4249, 1117, 6045, 11615, 3804, -1900, -5043, -2413]
14951b413O788N11m10l491K22J948o519m994L80k729L315J0791j4m63J2079L639
14935A8640j814o58l920m924K768o88p272k129J783L541l746k255q05p20j955
14920d154j599l863j864N028M426K17O21k547r134r00R513N364n78k143n877k453
14904i943k172P42P859N362L913m78P5l429l023q454L025L244J371P02p161K215
14888f152j832O699R011K469n933q677j891j31L588K772j871Q211L188q324m419
14873c292k508k968J755q37l670M444O260j614K444J210o288m352r2R636J002
14858A130o583K218R23M493O609P544m64p032m669k693p875l005O733K85L942
14843A556r44N1L752J635L102l740p421o560k828M067M759J0309L85k817n113
$$ y = [-2413, 4375, 4886, 4476, 985, 1207, 3155, -3364, -8358, -7978, -10707, -7392, 3399, 3385, 2922, 15001, 18640, 16826, 16168, 12248, 7324, 10092, 9404, 2132, 3, 1786, 5327, 1581, -674, -1479, -2199, -4154, -5753, -9616, -11480, -6452, -2026, -1809, -1188, -3735, -12869, -13769, -4256, 1108, 530, -1613, -7490, -9943, -12115, -11373, -3514, 1848, 5761, 5283, 5358, 1929, -1094, -9548, -6523, -3279, -1908, -1206, -8367, -6152, -7984, -1285, 7726, 10195, 4262, -4415, -6306, -6437, -2849, -77, -1948, 6263, 9451, 1127, -3292, -5800, -8768, -7013, -7850, -11520, -7076, -816, -2430, 14, 1224, -5064, -9416, -9508, 128, 1130, -5453, -3235, -2312, 2181, 8790, 16334, 15870, 8838, 4169, 1476, -6399, -9404, -2671, -2386, 1556, 612, 663, 4415, 6050, 9152, 5412, -2009, -8569, -11397, -7330, -2571, 7738, 8123, 5306, 193]
14828A93Q80o00o16n67L888O997k523L90k973j638l889J10K786j856J43j514k822
14811c611k859p62J247O26o96O859R6l808L008O48O43J884l046m809p32O4K462
14794b786J853K920K668j85N766K923n024o474n971M11j945K423K558J039m376
14779d200N3P83n199J24L362O358M562O17j038L426k000n134o54O39N730L625
14763A1054o607l782j482j102n2K162q59l520J90O087j301n898K859q8l851M396
14747a794N164k408O42M26J400L719L553l963k377p309k225K131L515J176k344
14732f94k09J147R67K766l399o749J098P365j97p842m483m972M196J079l952R693
14716d186J219M896P624l666o546j362m63J148L924N019j748k435M515N275k982
$$ y = [193, 1073, 473, -143, -710, 3178, 10175, 7652, 8042, 5069, 3431, -458, -348, 2438, 582, 725, -789, -3611, -6470, -7232, -5985, -5359, -6055, 804, 900, -2908, 100, 748, 1391, 3275, 229, -4580, -5312, -5248, -2786, -933, 1987, 4655, 4470, 10236, 13159, 8135, 1661, -4310, -3899, -5844, -3421, -863, 176, -4200, -4147, -3364, -8563, -8439, -5077, 1281, 5843, 6460, 5422, 8848, 6848, 1714, 1060, 1699, 7429, 11054, 4447, 665, -817, -1919, -1971, 191, -668, -4188, -3998, 2089, 788, -5110, -2251, -2339, -6190, -1794, 3370, 962, 1604, 2030, 3430, 7149, 10702, 6739, 4362, -2947, -5172, -3041, 474, 1650, -694, -903, 244, 1211, 3977, 578, -6171, -5073, 2292, 2095, -5747, -10230, -15202, -11006, -9927, -13879, -4186, -2967, 1929, 9553, 5887, -659, -2021, -2484, -1336, 2588, 7607, 5859, 3424, 7939, 13214, 10232]
14701A0232o042j446k908n535L580J503n233K350M296o17M335r19k397m867m336
14686h004j219k440l113L648M430Q904M009m872m525l105o9J576J227l360r12
14671g825k60M06Q69J0021L443k578j542j353o091n78N306n036j155J449O595
14656A671Q080K776m158n573k140n08j618Q7j073M523J562m238n955K466J31l223
14640g190k889J0567K029p459o582j708L233J0133M394J583m221k823N959m470
14626E56Q25p441o423N799J998J4758K652q674j903k20J80K213J216o646m541
14611e651M29j272L704Q397N341k05r029o694O979k24n73R82k103l318J359J769
14595a09l661j49p21m6o62O299k951J825R708l113l835k268J65J140r67m145j363
$$ y = [10232, 4190, 2744, -164, -5699, -2119, -616, -5849, -3499, 797, 180, 4515, 3596, 1199, -3668, -8004, -9223, -11663, -14776, -11128, -6698, 2206, 6215, 1343, -3182, -6287, -6356, -4780, -3553, -6913, -7825, -8085, -7679, -6810, 3211, 6654, 4076, 2534, 1181, -4910, -5488, -182, -5218, -6373, -4924, 1671, 9751, 12527, 8369, 2796, 656, 148, -1470, -1383, -2456, 2067, 3629, -609, -6564, -4098, -3967, -7190, -10079, 488, 2517, -4942, -11524, -13232, -9999, 134, 4528, 6111, 1890, -933, 5026, 556, 1381, -6060, -12483, -6684, -4686, 10072, 12724, 4050, 2147, 1927, 2107, 4320, 5536, -1110, -5651, -5222, -6494, -2790, 5607, 10948, 10743, 1714, -4980, 1999, 1775, 1202, 2184, 81, -3237, -1878, -109, -3770, -3919, -4640, -4686, -5348, 951, -2000, -175, 9533, 6420, 2585, 317, 482, 1622, 655, -3490, -4853]
14578d853J843j271J853m1O96N912J565j157K486l548o480k258O408K1m769j06
14562c699K953L509M15M902n549L382K546k370l342l722p793k509j298L074R802
14547C01J0865K667m745l26k162o379l428L347L926N008L618j570J222k747K167
14532A1764o05L82J839o210l296o229n662N387K208o909k516J156L601K040j633
14517d683L13o863p090m921K352J833M444M682N373P062J771K121K503N611k391
14502A2117n471L41k224l177M46L044K419l353o701o538K238K195J717J724j793
14487c016k72O158m380p496Q55L04k344L025L913l679k495Q64k528J872L350M390
14471a479J7m975p497j020O905N879J154k931n17L899L52k951l037K820j38N79
$$ y = [-4853, -3010, -4281, -2428, -2469, -1773, 4139, 5704, 4547, 7033, 3485, -2995, -5253, 1155, 1176, -3593, -3699, -746, 2763, 3178, 8080, 2531, 5913, 8459, 6089, 2747, -975, -8768, -11277, -12575, -9501, 301, 11166, 13833, 9088, 8762, 6600, 221, -3207, 140, 4066, 9074, 12692, 11122, 12344, 9597, 11764, 11159, 11541, 13380, 7170, 3874, -2355, -8017, -2630, -422, -7331, -9847, -8691, -5090, -3050, -4683, -4370, -11233, -18323, -23244, -20892, -19059, -14615, -9933, -4560, 2502, 4273, 6394, 8897, 14508, 12117, 6646, 6987, 4763, 1586, 2032, 5076, 7495, 4142, -2559, -9097, -6859, -4664, -2947, -1223, -3016, -3288, 2870, -1510, -9006, -8151, -7847, -10191, -7166, -3253, -6932, -9427, -8563, -11091, -9219, -5869, -1479, -1462, -6437, -13934, -14954, -8049, -2170, -1016, -3947, -4464, -565, -213, -3164, -6201, -3381, -3519, -2940]
14455b940j818K442K336K896O053m229k068j698q82N581J667M727l51l180k785
14440E751j048o16p99m887k260k255j99j261J499P55K025L021m112jq627p72P234
14423f552P012L855k6k484n677k067M86m926l43l43J874Q780O988N22J19k942
14407D276m043m084l452J35J09Q974Q387P33J688J87m161m353l577n344M032l317
14391c810N769N966K25k114m230L01M222k793l105K307J249l803l042K601r32
14376a189K585K434r96J986K333K395o205l912j018p34P10J50P935Q110j1197
14361C387p956K391J438p905J552q11M757P092k860k123R453J422q396l169o656
14346h384J887J195M222K702j978L04o580l558Q306q09k608K013k188L11M794
$$ y = [-2940, -4758, -2316, 20, 2916, 8969, 4740, 2672, 974, 92, 5673, 7340, 12067, 11716, 8536, 5751, 4703, 4087, 3288, -1599, -3859, -6114, -6313, -7574, -6075, -5320, -3295, -274, -4386, -4387, -13014, -13786, -6552, 460, 4315, 4289, 1805, -3872, -5939, -5453, -10379, -10722, -11065, -9191, -411, 6577, 7099, 7218, 4276, 233, -3851, -7303, -7168, -7059, 1915, 10302, 11035, 12723, 12910, 8749, 4396, 819, -4525, -493, -3810, 1959, 7925, 8150, 6036, 1806, 2107, 6329, 3536, 431, 2738, 3987, 184, -2858, -257, -1189, 1396, 3830, 2834, 4820, 7153, 9548, 3343, -569, -1587, -2321, -1611, -1461, 6474, 14584, 3387, -4569, -2178, -740, -8645, -7093, -7904, -3147, 3945, 1085, -1038, 8415, 9837, 1441, -1728, -8384, -6497, -5302, -1080, 1622, -356, -52, -6632, -10190, -1884, -2693, -5301, -3288, -5476, -5165, -371]
14331c71J2548N745n224k129l205j2087o948M773j221l12K729N286N07j909J595
14316b23L125l557k563K152l656n729J937N875L305O013m49k800J032J587K757
14301H806L751k998q092n337q8O635l09K728J179l154M126m167j599l468r42j703
14285d632Q86J703P55M849P35k49m598J0548O010N046l446q396J440l196K41l914
14269C782m140o332M133N304n322p104J610J1953j23k79L570l00j197o214l599
14254d258O5N656k976j509M909O175J850K586L039r53J609k417q844j757M772
14239G947Q04n994l375L760M552k265J358j908J330l117O117M948N212n572q101
14224E696q721M013P64K140k034l768O979l551p198l601M493O15L005j354J34
$$ y = [-371, 12177, 17922, 12698, 10569, 7364, -4723, -11671, -6898, -8119, -8431, -5702, -416, 91, -1818, -223, 2902, -655, -3218, -1066, -4722, -10451, -8514, -2639, 666, 6679, 6230, 3430, 4462, 6049, 8806, 12557, 9559, 1467, -3870, -3958, 2677, 2368, 5096, 6275, 3121, 7247, 3080, 1481, -1987, -2929, -4632, -3746, -2043, -1288, 3561, 4296, 4047, -551, 9997, 16007, 21053, 17607, 9211, 10651, 7455, 7696, 3782, -358, -6690, -2557, 2747, -2575, -9679, -8069, 3884, 3761, 3482, 7052, 6752, 5555, -659, -4258, -4193, 1463, -1513, -3022, 1887, 8062, 9912, 12498, 15537, 14584, 16193, 13776, 4932, 3175, 7947, 8751, 2757, -618, 3142, 7694, 5429, 6787, 4879, 6209, 3092, 9209, 14157, 19369, 13797, 5696, -3025, 988, 1752, 3892, 1858, -1910, 5069, 1518, -5680, -9281, -4788, -4173, -1168, -2522, -2388]
14209b388J977O562O55r15k352K397k468K671P164l765j1178p159m516j200P313
14194g202J0145m764k438j546q042Q554L309L239l179j283K87J216M027K871M01
14179E595m998j282N802N831N921q410q653K102J7m415J578M080Q549k782j957
14164F978m024m546o226j144N957N414j434l326q39n85K531j573q81k571m404
14149a0673P793j593m096J733P052L698R642j217n389J479O472k068m855L353
14135A1331J96O62m340q755o301P077J971j251j610J277K093R355P86j300J13
14120A1304K374k340j835o93k673l688M063M766l829o301r92J688R747J545m037
14105I099n09j498l9J195J340M372l480k730o26k814P606m035n859K605K11J97
$$ y = [-2388, -411, 6151, 6806, 5891, 3539, 5936, 3468, 6139, 13303, 9538, -1640, -8799, -13315, -14515, -7202, 2943, -1821, -4259, -5805, -13847, -5293, -1984, 1255, -1924, -3207, -2920, -1704, 2323, 5194, 5595, 597, -685, 5117, 10948, 16869, 8459, -194, 1908, 1925, -2490, -912, 3168, 11717, 8935, 6978, 2954, -1592, -7818, -8962, -3005, 2409, 975, -2351, -3190, -3775, -1244, -2817, -3698, -6269, -10673, -2880, -4473, -8569, -6836, 216, 3914, 13556, 12339, 6950, 8429, 14901, 12833, 7978, 11331, 11527, 12189, 7849, -906, -7207, -130, 1841, 590, -1020, 257, 2350, 11705, 12491, 11191, 11304, 13678, 11338, 9503, 8810, 6137, 2449, 6512, 11278, 7449, 1148, 156, 1844, 11591, 13136, 9099, 8590, 7092, 7053, 8248, 9588, 13960, 10480, 7750, 7124, 4310, 11916, 7881, 2022, 4627, 4838, 5035]
14089E035l463n762M783l79J276L048K884N172j137m335k909k724l799L919K437
14074D046j1378l578J597K843J184L903j775r08k34K721k879N970M962N037J300
14059A2811n39J82j445r7j807n560l479K483q85k60J146J0103M878o931o779k778
14043A043l180R66K016J507r94P529l037p809L632O284K70N023l355o647J43Q15
14027D206j422l033o47P013J881m488j059K081j678l867J818L030P38o755n94
14012b776l5l220o504N769K131O59j58l248J559k196m323l804q207N611L832J106
13996a3804j805J962M593l680N83Q862P860k491l865J589J324L548j967M179P16
13981G604k325L549l220r215L442N577J100p932j340P775K612n203m898M492L016
$$ y = [5035, 1572, -4190, 593, 214, 1490, 4538, 7422, 12594, 11457, 7122, 4213, 1489, -2310, 1609, 4046, -7332, -10910, -9313, -6470, -5286, -1383, -3158, -4066, -4300, -1579, -4458, 1512, 6474, 11511, 12811, 12272, 12454, 11009, 10912, 9105, 3545, 66, 2549, 1664, 1404, 2550, 12653, 17531, 10600, 3821, 1043, -2137, -1171, 845, 2352, 1358, 8887, 5850, -1959, 1673, 7957, 8227, 13250, 9895, 3248, 3391, 4206, 2784, -249, -896, 6117, 7998, 3510, 2451, 4532, 2854, -1013, 805, 3835, 4573, -2182, -2776, -2811, -6031, -12535, -6766, -4635, -3976, -4134, -7382, -5823, -8019, -12342, -16146, -24353, -18742, -14910, -13804, -15609, -13647, -9054, -12734, -12151, -3289, 4571, 2080, -1785, -196, 1128, 4676, 2709, 6888, 7604, 5279, 8828, 5608, -3607, -165, 5412, 6512, -1420, -2760, 5015, 7627, 2424, -2474, 2018, 5034]
13966E034m952m247L078N634k373k274N252M875L171j103l8K464j093m234m155
13951E039q312n618O466L6J888J992J661M679o113n518L371L453J407k643l229
13936a441p00M497K326N080M370K186K537l729p293L63p74J616q60J586M329J565
13920A5658m473K596P270n811m672R56M46k714J073k55N040k86R51p221m855P82
13904D485j292l404j670j262M478J99l179n45M970M451o64l852j716K463K300
13889E762P41L0o254m058K708M271m101o679l248j768M707j300M416O104K051
13874C382J995J072r14k557P47N69J128k622L04K410p243j617K89K317l3m233
13858e006M733J364j031k320L581P149J962J958K330n968K788K36p05M263k583
$$ y = [5034, 82, -4165, -1087, 4547, 2174, -100, 5152, 10027, 13198, 12095, 12057, 14521, 13428, 9194, 5039, -3273, -8891, -2425, -2389, -501, 1491, 3152, 7831, 1718, -3800, -429, 3024, 4431, 1788, -1441, -2141, 2356, 4682, 9762, 14132, 16318, 18855, 15126, 7833, 8196, 7422, 9038, 8178, 9764, 14093, 15658, 11185, 13781, 21051, 15240, 10568, 11524, 11970, 9256, 10329, 10074, 15114, 14828, 15779, 8558, 3703, 4485, 3193, -211, -1881, -3143, 1335, 1534, -1645, -2190, 2780, 7231, 6567, 2715, 999, 3462, 5762, 6503, 6533, 279, -3779, -1071, 3200, -901, -7580, -10828, -12596, -7889, -9189, -4773, 1331, 3382, 5377, 6449, 5535, 2978, 3725, 4294, 5422, 2800, 3104, 5514, -1729, -3346, -3057, -740, -773, -5006, -273, 1091, 60, -2260, 1321, 8470, 10432, 12390, 14720, 8752, 11540, 11776, 11071, 15334, 12751]
13843A2751J32r44n494M843k408J841l888j023K849l420q115K56j834n11j154
13828f119j927j66P9O892M683J038L721n013m14M718l181k473m16j686P571L65
13812G672J069p31N72K228j07m297k845j274N722J870n518R13l03m245L754J155
13796E635q211K035O403k140J379J193J676n441p130p172P652O101J450m534Q05
13781b99J226J382R819l065r003J153m07m97l79L208k970k866j223P103M171J991
13765I344n830l882n396J775N132R91j751R54L628l419m859j645J1935M938o923
13750D992N245O622m384l934k902r47J813K967M08O86m082k99L540n480k482n758
13734c995M820M470P492J797o334m710M363q20k824N155j197P8n43L743M038l188
$$ y = [12751, 12883, 11939, 6445, 11288, 8880, 10721, 6833, 5810, 8659, 5239, -2876, -2620, -4454, -4965, -6119, -8046, -8212, -8133, -1241, 3442, 4480, 8201, 3188, 2774, 7492, 4311, 1838, 1422, -264, 7307, 7672, 8741, 8010, 8582, 10810, 10703, 6406, 3561, 2287, 8009, 9879, 4361, 5274, 4971, 726, 4480, 5635, -2576, -541, 5862, 3722, 5101, 6294, 7970, 2529, -4601, -11773, -4121, 1980, 3430, -1104, -299, 927, 2309, 12128, 9063, 60, 1213, 806, 309, -70, 3138, 168, -2698, -3921, 3182, 7353, 9344, 3514, -368, -5764, -3989, 1143, 2134, 383, 1337, 4965, 1546, -3313, -4958, 6977, 11915, 4992, 10237, 16859, 12475, 8541, 5639, 4692, 6505, 9472, 9880, 10566, 6484, 6185, 9725, 4245, 1763, -3995, 825, 5295, 12787, 14584, 8250, 3540, 7903, 7083, 4259, 9414, 8217, 8295, 7752, 11495, 15533, 12345]
13718A2345j393j22j913O082q315j0489K558n64M428K805K975l30o704j166N194
13703E391J379L550J860l739l980J191N49j246K520j059K561k922o542M26K455
13688B394N673N50j798Q60M580O734j0079q308J55o000l284k581L685O044N734
13673D359K231l911M828j232j939J73K774L642L642m765q137L76l050r88K336
13658C39k202M153m22k626M196K256N30o35j138O770O297Ol998J44M051j692j0254
13641E775o756j199Q370P81m4J58l181O975R090j362l601j1797o532O635L106
13626F418N61K147l853O19K180m8k769k92l460K376m152l568P523N446k137k03
13610F788K11l376K969n86p107j285k930Q29M051R59o645M862K047k818R33J406
$$ y = [12345, 10952, 10830, 8917, 14999, 6684, -3805, -1247, -1811, 2617, 5422, 8397, 8067, 1363, 197, 5391, 6770, 10320, 12180, 8441, 4461, 5652, 6201, 4955, 7475, 6416, 8977, 6055, -487, -61, 2394, 8067, 8617, 6819, 7679, 12259, 18993, 8914, 606, 761, -5239, -8523, -11104, -7419, -1375, 4359, 6590, 2679, 7507, 6275, 4336, 4509, 7283, 10925, 14567, 9802, 1665, 2041, -1009, -1997, 339, -1863, 2290, 1868, -758, 3438, 5694, 6224, 5589, 4451, 11221, 17518, 17524, 13526, 13670, 17721, 16029, 5775, -981, -2180, 6190, 6971, 6927, 7085, 3904, 10879, 19969, 18607, 15006, 3209, -3323, 3312, 6418, 6979, 9126, 5273, 5892, 8072, 8024, 5255, 4963, 1503, 3879, -273, -3841, 3682, 9128, 6991, 6788, 6999, 3623, 6592, 6006, -1101, -2386, -5316, -4487, -436, 523, -6122, -1260, 787, -2031, -1098, 308]
13594C08o50L934K251j44P226m686j315j0933M30P684K292j451n188K166N236
13579G160O46R80k703J382O691O438l491r970k016P366L095q998l584J753L62
13564E111n509K704M287L906N883M422k592n301m22o865o488Q37r09M792Q61j828
13548B889J880K290M588k813l295K861k848m263j234N990k624j593q58P122N785
13533A3877J965J901o588k483k842m204J174P682K050Q97M077m253k689k110J324
13518I778J80j450N560J2104O040o828l676L30j0409r664M134J014m302k201N366
13503E976R873P678n268q565M09N100Q052l358o359j068j037l32l298J335N680
13488A4818J851q04r70l852q655J663N091J252m227n09l521Q81L070m78J025J630
$$ y = [308, -342, 3592, 5843, 5699, 12925, 8239, 6924, -4009, -3579, 4105, 6397, 4946, -242, 1924, 7160, 7806, 8786, 6083, 7465, 14156, 20594, 17103, 7133, 5117, 12483, 15578, 6580, 2996, 4749, 5111, -398, 2306, 6593, 10499, 16382, 20804, 18212, 12911, 12489, 5624, -864, -27, -936, 3856, 4717, 2889, 4769, 7059, 11647, 8834, 5539, 8400, 5552, 1289, 55, 6045, 3421, 1828, 970, 8092, 13877, 15842, 17743, 11155, 8672, 5830, 1626, 2800, 10482, 12532, 13429, 17506, 13253, 10564, 8454, 9778, 9958, 8508, 14068, 26172, 32212, 25384, 21708, 22038, 11629, 1965, 6099, 7113, 2811, 610, 5976, 15849, 23527, 18259, 9694, 10103, 15203, 23255, 19897, 13538, 12470, 11433, 11101, 7803, 9138, 14818, 16669, 15865, 14895, 11043, 2388, 4051, 9142, 10394, 6167, 5658, 2137, 3018, 6088, 5610, 6635, 8265]
13472H265L887J940l992J464K452k814J993J377L231K642k113m510m885p940L266
13457D263K330n579K338k025L191M374K890j449o12j009m213Q693M816k817p094
13442H097k637j477L4L698K86L878j95o312P267L575j1162j315P727m207J075
13427H332M730L289j602M26j860l889j217L837L64l867J169Q29J555N311k159
13412A5248p597K859N301m12k302K194O143j751l588k860p375L16P185j368m334
13397G659J2380P660l004m234r628o100l08K414N60J223r91J044J0286L841o152
13382A6650j313j895L653R26k921n609K19L839M93k872k020l129K654N286j755
13367A2206k201N514K091l493n20k885O93R420M063l44j656m115o4q572N99l499
$$ y = [8265, 12152, 14092, 10100, 11564, 14016, 11202, 13195, 14572, 17803, 20445, 18332, 13822, 8937, 997, 4263, 6593, 1014, 3352, 1327, 4518, 8892, 11782, 10333, 9721, 8712, 4499, 13192, 18008, 15191, 8097, 5460, 3983, 4017, 7715, 8001, 11879, 11684, 5372, 12639, 16214, 5052, 3737, 11464, 7257, 8332, 13062, 16351, 14749, 15175, 13315, 9426, 8209, 12046, 12410, 8543, 9712, 10541, 12096, 17407, 15248, 7651, 10510, 15811, 15399, 13097, 15291, 21434, 19683, 16095, 13235, 5860, 6176, 13361, 11993, 7659, 20039, 27699, 24695, 20461, 10833, 4733, 4425, 6839, 7399, 8622, 7631, 8675, 18961, 22802, 16650, 15337, 13442, 17095, 18021, 15100, 9491, 9710, 13549, 14042, 11170, 9150, 6021, 8675, 13961, 12206, 10005, 15519, 17610, 14117, 13597, 10712, 11405, 20825, 24888, 24544, 22888, 18773, 18709, 10137, 10736, 7237]
13351G237K39M391K749K6l834L136J820K064M134L008L78n102m160k653n672K241
13335A0002P742l668l700L639M595N688o37j72k967q291k35l157N231N805L586
13320B3461J334l771k924r08N05L547k98N468o09J480Q47P84l534j990p07L3N379
13303B8097m192m052K982M182n808l809M218j576J530R146K336j93O325N103q74
13288D3415O031P383N602J269M578M808J0876J9611J0018J6255K5851M3969O5670
13275B65336R6732J86514L61499M67075J58985k16342k15726j11766n2034o4982
13265H75291j05012j35040j30464j30021r9990p4557l8542k1380k4210j9445r105
13254H7525m503j1131j2212r908j2348p862p540k776J8m44j2163K180P207P692
$$ y = [7237, 7476, 11867, 14616, 14642, 10808, 13944, 15764, 17828, 21962, 24970, 25348, 20246, 16086, 13433, 7761, 10002, 17744, 14076, 10376, 14015, 18610, 24298, 23661, 23489, 20522, 12231, 11996, 8839, 14070, 19875, 23461, 24795, 21024, 18100, 17192, 17697, 21244, 20946, 26414, 25805, 27285, 28132, 28916, 25382, 23392, 22685, 22718, 28097, 23905, 19853, 22835, 27017, 21209, 17400, 21618, 20042, 21572, 30718, 33054, 32861, 39186, 44289, 43415, 49446, 56829, 62431, 63700, 68278, 73086, 83962, 103573, 113591, 129846, 155697, 199666, 265336, 362068, 548582, 910081, 1377156, 1536141, 1319799, 1104073, 992307, 940273, 875291, 770279, 635239, 504775, 374754, 274764, 200207, 161665, 140285, 116075, 96630, 87525, 83022, 71891, 59679, 49771, 37423, 29561, 22021, 19245, 19263, 18819, 6656, 8836, 16043, 23735]
13240B3735N101K050M510l757M500k287M28N20n250l165l622P524K806m978L63
13225B8478j256O479j63r737J107J261L8n808j148M975Q00r15J2q55j061K705
13209B4912J162P52M004M95l034q50m174m122J148k091Q392K508K142O976m465
13194C3755k821n054m00l022O95M13n522k36j053L06J696M013n189k033P583l83
13178B2748r314K646O708J351o664K444J060n105j810K824M838m60m693p39k139
13163A3695R625o903Q56M82k985J803N480l607P2N181K500N360l055P188L221
13148C8913m294N59j438k077j201K092L384J36j663m832p508J124j067o72L433
13133B4889L118J09l648J925M064k23P020K759L763l387m513p793r560r059j263
$$ y = [23735, 28836, 30886, 35396, 31639, 36139, 33852, 34280, 34800, 29550, 26385, 22763, 30287, 33093, 28115, 28478, 27222, 33701, 33538, 23801, 24908, 26169, 26207, 20399, 19251, 24226, 25026, 24111, 24123, 23268, 22207, 24912, 26074, 26826, 30830, 31325, 28291, 27441, 23267, 19145, 20293, 18202, 26594, 29102, 31244, 38220, 33755, 30934, 25880, 25480, 22458, 23153, 23566, 18044, 17808, 16755, 17061, 18757, 22770, 17581, 15548, 23131, 22748, 13434, 16080, 22788, 24139, 17475, 19919, 20979, 15874, 14064, 16888, 21726, 21266, 16573, 15834, 13695, 23320, 16417, 17273, 17755, 14770, 16573, 22053, 18446, 18518, 23699, 26199, 31559, 28504, 35692, 38913, 34619, 35178, 33740, 31663, 30462, 32554, 35938, 36074, 34411, 29579, 22071, 23195, 22128, 21456, 24889, 28007, 28116, 24468, 26393, 30457, 30234, 37254, 40013, 43776, 40389, 35876, 28083, 18523, 9464, 8201]
13118H201j151l90k129O228P430l030J882m446K452R349O902J399j063k849R96
13103B9781N428J805n165j0q20n526m322j471P148L074P371N677p536p077M398
13088C2755P159J108K808k461J432J394O024N236J889J26K128L221j190p198M77
13073E4908N685M977q259p189N403o74n82N172J047l713N851K6149K9022L1205
13059A49002J0588o056l366J4724j474L918K2748k029j7883k6543k5954j0533
13047A07142o51J518p595q537j3240j1735q460M140N582o279j650J438n483k424
13033E3766O45L418k446L051K244j059p031o274o858L520o81m17N914k068j775
13018D3949j319L09L820M036O001k268j206Q336N885J0832J5929N420L669K083
$$ y = [8201, 7050, 6660, 4531, 10759, 18189, 15159, 17041, 12595, 15047, 24396, 31298, 32697, 31634, 28785, 29781, 35209, 37014, 31849, 31839, 31019, 25493, 21171, 19700, 26848, 29922, 37293, 42970, 35434, 28357, 32755, 39914, 41022, 43830, 41369, 42801, 44195, 50219, 55455, 57344, 57470, 59598, 62819, 61629, 54431, 54908, 60593, 65570, 57311, 50122, 55525, 54851, 54269, 59441, 60488, 56775, 62626, 88775, 117797, 149002, 159590, 153534, 150168, 164892, 163418, 167336, 190084, 188055, 170172, 143629, 117675, 107142, 106491, 108009, 100414, 91877, 78637, 66902, 58442, 62582, 68164, 61885, 60235, 61673, 56190, 53766, 54411, 57829, 55383, 58434, 60678, 59619, 52588, 46314, 39456, 42976, 42295, 41878, 47792, 45724, 43949, 42630, 42939, 46759, 50795, 56796, 54528, 53322, 61658, 67543, 78375, 94304, 99724, 103393, 105476]
13004A05476M223Q272R607P684K3554K6682o760o7619p9388k1953R844J593j1569
12991I646j8119k0788j0758n008K51M721J1571J6673J2977K700k451K60K493M558
12977H726L573L594P763K013N802R646l033R1M961O700j632k05Q363M421J0263
12962G1046J1132P20J223j982N757P606J2383O998k306k2130j7336L472M478J424
12948H2485p309j3225m835l068o364m949L173J2698Q497J5241K0262R170l869
12935A07907R954O0557Q7658N6991j626k6489k4822O654J4799j3293m2466m4534
12923A91290m3689k4802o910n562j2834j4068Q15M315L401O869J2464M68q073
12910A03684J623J4670O81l864q371J853N291k294n177k747L995N626J897J608
$$ y = [105476, 109699, 117971, 127578, 135262, 158816, 185498, 178738, 111119, 31731, 9778, 19622, 21215, 9646, -8473, -29261, -40019, -45027, -44776, -40055, -28484, -11811, 1166, 3866, 1415, 1675, 4168, 8726, 12299, 15893, 23656, 25669, 31471, 41117, 38084, 38175, 43136, 49836, 48204, 47999, 56362, 60783, 71046, 82178, 82898, 84121, 82139, 87896, 95502, 107885, 114883, 112577, 90447, 73111, 76583, 81061, 82485, 75176, 61951, 57116, 54048, 47684, 42735, 45908, 58606, 67103, 82344, 102606, 111776, 107907, 117861, 178418, 266076, 323067, 321441, 294952, 270130, 276784, 291583, 278290, 235824, 191290, 147601, 122799, 115889, 110327, 97493, 83425, 84240, 88555, 91956, 98825, 111289, 111757, 103684, 105307, 119977, 120658, 116794, 108423, 110276, 115567, 113273, 108096, 105349, 109344, 114970, 116867, 118475]
12896A18475n32J0201J2802Q478K148K069L210M817M000M253N141O804K997M402
12882A89265P268R608N949J1265K7447K6212P919J4612J9064K5395K0147K1476
12870C85627K0324K371K621J7245J2747N700Q664o914j742J9130K9748R992J399
12857E06912J6682K2186N535j5093k5536r226J9693M1518M6650N3706P3866P3331
12845H10224N5845N2776N4852O3159R1981J28622J11981O6127N2279Q0395J13669
12834A681910J13846J18217J41071J89272K23760K49274K88084L20073L22579
12825C648086L50124M67172O02351P19256Q79632J230225J438280J194083J213630
12816A1742839J673693K487271L550637M830730O964051J0867047J8655715L5854065
$$ y = [118475, 117943, 128144, 140946, 149424, 151572, 153641, 156851, 161668, 165668, 169921, 175062, 181866, 184863, 189265, 196533, 206141, 212090, 223355, 250802, 277014, 284933, 299545, 318609, 344004, 364151, 385627, 405951, 408322, 410943, 428188, 440935, 446635, 455299, 448385, 446643, 465773, 495521, 505513, 506912, 523594, 545780, 551315, 536222, 510686, 501460, 521153, 562671, 609321, 663027, 736893, 810224, 866069, 918845, 973697, 1036856, 1128837, 1257459, 1369440, 1435567, 1487846, 1568241, 1681910, 1795756, 1913973, 2055044, 2244316, 2468076, 2717350, 3005434, 3325507, 3648086, 3998210, 4465382, 5067733, 5786989, 6666621, 7896846, 9335126, 10529209, 11742839, 13416532, 15903803, 19454440, 24285170, 31249221, 42116268, 60771983, 96626048]
12808I6626048O9684914R1406750K7161960m3766203m2312333k0097952r231134
12801A69472050j0904271j8387799k3628952k5238763k4412399j9284515j2362057
12794C5253294p277337m706041l652595k868538k164319j639009j381011j208950
12786A0355494j005940q73706q41516p67444o35127n19146m60696m13004l49829
12777D489086l10433k90077k52616j41614Q3172K73578J1882l57448l73571k46543
12767B885416j63248j40453j54989j82887j78207j58659j40549j28246j31159
12758A507019j11223q7268q3527p6860p4430n8146m4258n2047p3026n8608m9233
12747G38393l7415k6735l2557m8880m2718l0800k1493k3319k3608j4149j5970
$$ y = [96626048, 166310962, 257717712, 284879672, 241113469, 198801136, 178703184, 169472050, 158567779, 140179980, 116551028, 91312265, 66899866, 47615351, 35253294, 27975957, 23269916, 19617321, 16748783, 14584464, 12945455, 11564444, 10355494, 9349554, 8475848, 7634332, 6866888, 6231761, 5712615, 5251919, 4838915, 4489086, 4178653, 3888576, 3635960, 3494346, 3577518, 3851096, 3862978, 3505530, 3131959, 2885416, 2722168, 2581715, 2426726, 2243839, 2065632, 1906973, 1766424, 1638178, 1507019, 1395796, 1308528, 1225001, 1148141, 1073711, 1015565, 971307, 919260, 846234, 787626, 738393, 700978, 674243, 641686, 592806, 550088, 519288, 497795, 474476, 450868, 436719, 420749]
12736D20749j1704j204N811j220o684p688q062r697j1702K246j62n915l097l056
12722C58615j2517j4658j7951m813N719j208j102p007j2414K409k776n003j1788
12709B75506q467M389K466j6778j6398r977n158n928r601q027m014j339K36J029
12695A97939K601O699k003k063K315M486L667p114j435N274J1656L3020K9894
12682B84936L395m3620n5595r432m558k849L988J250O327k478q825K761r168k4708
12668A41424j1684L783K715n616J43P049N45j4307k1111j3366R97j678k039j313
12654H5542p429n076q341l400N806N146O123N059L153o108j577Q79j902N006L58
12639H3239M152K783J520P056K09M346L271j1724K93P034J351O322R442L360N805
$$ y = [420749, 409045, 407841, 413652, 412432, 405748, 398060, 389998, 380301, 368599, 370845, 370683, 364768, 361671, 358615, 346098, 331440, 313489, 308676, 314395, 313187, 312085, 305078, 292664, 295073, 292297, 287294, 275506, 267039, 271428, 273894, 257116, 240718, 230741, 225583, 219655, 210054, 202027, 198013, 196674, 196910, 197939, 200540, 207239, 205236, 203173, 205488, 209974, 213641, 206527, 205092, 210366, 222022, 255042, 284936, 288331, 244711, 189116, 179684, 175126, 172277, 176265, 177515, 183842, 181364, 172539, 175300, 166132, 141424, 129740, 133523, 136238, 130622, 130765, 137814, 138359, 124052, 102941, 89575, 90572, 88894, 86855, 85542, 78113, 73037, 64696, 61296, 67102, 72248, 78371, 83430, 86583, 80475, 78898, 79777, 77875, 82881, 83239, 87391, 90174, 91694, 98750, 98959, 103305, 106576, 94852, 95145, 102179, 103530, 109852, 119294, 122654, 128459]
12624A28459J2423L135M255N792J2209K0195J2546k5931p2210o5706k4495Q907
12612A9579J5255j100j3929j8502k0278r910K770J5083J7190R833k168k983M281
12599A5121K991l086M609P857Q215J275k359N400K44K996J0675K725l566m729
12585D8368K14R6n375p491p749o388N85k691k148k478P698R874Q30n289o851o307
12569A4898m93p125O845J2631J0993R95O40K399J111m384n609m475M276K423K964
12554C8089m449l837n606q318J787n430n87j270L009M836N443p200q171n779N110
12539G627J1692J649o020m553J246L452n690l479M680l149m949K963M701L5Q686
12524A8891J1389M250m902q578o768j230P956R67o308j676j495j189N059l094
$$ y = [128459, 140882, 144017, 148272, 154064, 166273, 186468, 199014, 173083, 100873, 35167, 10672, 19579, 34834, 33734, 19805, 1303, -18975, -28885, -26115, -11032, 6158, 15991, 13823, 10840, 15121, 18112, 15026, 19635, 27492, 35707, 36982, 34623, 40023, 40267, 43263, 53938, 56663, 53097, 48368, 48582, 48678, 43303, 35812, 28063, 21675, 22260, 19569, 17421, 14943, 22641, 32515, 33345, 28056, 21205, 14898, 14405, 7280, 14125, 26756, 37749, 38744, 39384, 41783, 42894, 38510, 32901, 28426, 32702, 35125, 38089, 33640, 29803, 24197, 15879, 17666, 12236, 11649, 10379, 13388, 18224, 23667, 16467, 8296, 2517, 7627, 19319, 20968, 14948, 10395, 11641, 15093, 9403, 5924, 10604, 7455, 2506, 5469, 10170, 10205, 18891, 30280, 34530, 29628, 21050, 14282, 13052, 21008, 21975, 15667, 13991, 12496, 11307, 16366, 13272]
12510A3272L40M835L516j122j515Q66o827j307M054J101L978J0437L814J423O48
12495C7513j0667n819O737J406l581j199l129K76K503j816k190J678J044l755
12481A9001j16p833n62N315m812o948K753qm63K922R456j108k682p36P957J749
12465B3885l928l625j335k837J77o98q453J100Q240O663k791l922P74K220k352
12450A3118o7p282k6O818k997k478P177O39j661o284P64o989r42P327N577R324
12434B2018Q75L007L320P19j583n87k944m315j930n614J297J858k135q34p922
12419E230l406L09J36K897l411n282J0291M970r754n007M631N741L571M523K751
12404A8190k757o140j298N658o742J180J12o48q506K622J884N810M796k777n279
$$ y = [13272, 13612, 18447, 21963, 20841, 19326, 20192, 13365, 12058, 16112, 17213, 21191, 31628, 35442, 36865, 37513, 26846, 21027, 27764, 29170, 25589, 24390, 21261, 21537, 24040, 22224, 20034, 21712, 22756, 19001, 18885, 11052, 10490, 15805, 10993, 4045, 6798, 6790, 6327, 9249, 18705, 17597, 14915, 14179, 22136, 23885, 19957, 16332, 14997, 12160, 12337, 11639, 3186, 4286, 12526, 19189, 16398, 12476, 13250, 15470, 13118, 13051, 5769, 5743, 12561, 9564, 7086, 14263, 14902, 13241, 6957, 7721, 732, -210, 7117, 12694, 22018, 22893, 25900, 29220, 29939, 28356, 27769, 24825, 20510, 18580, 12966, 14263, 16121, 13986, 13152, 5230, 1824, 2133, 2269, 5166, 1755, -3527, 6764, 11734, 1980, -3027, 1604, 7345, 10916, 15439, 18190, 15433, 9293, 7995, 13653, 6911, 8091, 8203, 7555, -951, 1671, 3555, 9365, 14161, 11384, 6105]
12389F105K29M931m361J820L121J369P362j271r454k473k321k350N388L566m307
12374G354m927j592O706L244l566l1O511J4213P105m167j310M412m13N7l843o933
12358B2820l799J803J695P487M035K111L703o877k14R636L208J211Q773R64J849
12343E8405J5598K2890J4780J7378L6205M9891R1194J70964L32594M74362K29285
12332A513546j72275k33375j26045o4651o3475j00402j24777j30683j31879j13265
12322B52719o8392m1151l0499k3864n332p252j7754j2048o897Q063Q70k512o475
12309C9476r247M992J515k679k642j579q853l715Q826N679j209o263j13P22j434
12294B3476M538o52n95m102m323p466J847n78l973l168p747K037O863M720m767
$$ y = [6105, 6334, 11265, 6904, 8724, 11845, 13214, 20576, 19305, 9851, 7378, 5057, 2707, 8095, 11661, 7354, 2427, 835, 7541, 10785, 7219, 7188, 13699, 27912, 35017, 30850, 29540, 33952, 33539, 33596, 29753, 22820, 19021, 20824, 22519, 30006, 34041, 36152, 39855, 32978, 32764, 42400, 45608, 46819, 55592, 56556, 58405, 74003, 96893, 111673, 129051, 165256, 215147, 306341, 477305, 809899, 1284261, 1513546, 1341271, 1107896, 981851, 917200, 853725, 753323, 628546, 497863, 365984, 252719, 184327, 143176, 112677, 88813, 83481, 76229, 58475, 46427, 39530, 47593, 48463, 45951, 39476, 30229, 35221, 36736, 34057, 31415, 29836, 20983, 17268, 26094, 31773, 30564, 24301, 24188, 24910, 23476, 28014, 27362, 26767, 22665, 18342, 10876, 12723, 12145, 8172, 5004, -2743, -706, 6157, 10877, 6110]
12279F110k895K463P867M366J250m149p983j0784r75O542K473r679J702J3838
12265A0146L516o662j352O39k980m861p511r95n277o688M407O922K645Q218N709
12250E876m762j686L109j988k237p39l400k902k358q7O593L374K19m723m035m9
12234i795l485L293k326N036L966L36N656n522K761P008J638l52n569K051Q42
12219E538J424K196J059J635l584n677P34l027o157L78N21o11k65K853N149j561
12203F05l553p23j864l498K327N151M60J528Q37L568L690L131Q44o956j333m506
12187b92q357k828N401J55K948l171K511P754l348j523l935L197N563L533j031
12172F577k6K619L2n023o819L27N363k408n682R44L290J0224N232j774l472j871
$$ y = [6110, 3215, 5678, 13545, 17911, 19161, 15012, 7029, -3755, -4730, 1812, 4285, -5394, -3692, 10146, 13662, 7000, 5648, 6287, 3307, -1554, -9065, -10060, -15337, -22025, -17618, -10696, -8051, 167, 5876, 1114, -572, 2537, 549, -1688, -2427, -5827, -8729, -11087, -11174, -4581, -1207, -988, -5711, -9746, -9795, -13280, -9987, -12313, -7277, -3311, -2975, 2681, -2841, -80, 6928, 8566, 8214, 2645, 4696, 5538, 6962, 9158, 10217, 11852, 8268, 2591, 3325, 298, -5859, -5481, -4960, -5571, -5836, -2983, 2166, 605, -2948, -3671, -5535, -9033, -6706, -1555, -1095, 433, 1270, 4838, 8528, 11659, 12503, 5547, 4214, -292, -8649, -11477, -6076, -5921, -2973, -6144, -3633, 4121, 773, -750, -4685, -1488, 4075, 7608, 6577, 6551, 9170, 9202, 4179, -2640, -2313, 3050, 642, -5040, -4096, -806, 9418, 14650, 12876, 9404, 7533]
12156G533j803N678N97l262p639n568J107l7N26m49q28K695J564J184M43j232
12140E09R90O942j81r626k356m399L095L769O43j52m538p32j804l937k82j066
12124a3125K915Q884L52o315K484M465j96L143L084l437L98l197o470j716k147
12109a0878K600L892K749R82m27o589j246L472O089j784L673n687m742K302N495
12094i9R69l916m466m046M938P48L511j149k090J844Q184K441p69j495L970m34
12078H141K372k56j587m288o380o238j422R560J128K993j169p534K09L988n31
12063a014M62K543P5K905K038k379l681K013L55l511L936j137m852K691M030M271
12047H745Q7N500N91j01j1799k69M606k322K868R08j523n087n452K082j846j531
$$ y = [7533, 5730, 11408, 12005, 8743, 1104, -4464, -3357, -3394, -2868, -3317, -4145, -1450, 114, 1298, 1741, 509, 1499, 8441, 8260, -1366, -3722, -8121, -5026, -1257, -614, -766, -5304, -6036, -7840, -11777, -12059, -13125, -10210, -1326, -974, -7289, -4805, -340, -536, 2607, 5691, 2254, 2652, -545, -7015, -8731, -10878, -8278, -4386, -1637, -655, -1082, -7671, -8917, -5445, 644, -1140, 2533, -3154, -7896, -5594, -99, 870, -3046, -7512, -11558, -6620, -5872, -2361, -3510, -5600, -3756, 4428, 6869, 6100, 4605, 8575, 8141, 10513, 10257, 8670, 4382, -1998, -8236, -9658, -98, 1030, 4023, 2854, -4680, -4471, -483, -1014, -552, 1991, 2066, 4971, 7009, 4630, 949, 2962, 3317, -194, 3742, 2605, -2247, 444, 4474, 8745, 8832, 14332, 14923, 14822, 3023, 2754, 7360, 5038, 7906, 8814, 7291, 2204, -3248, -1166, -3012, -4543]
12031d543O081K363j790n726m768L179J038K950J750l152j948N164L273o565K30
12016b464P234O369j298j2506Q49P040k513k175p991m837k674n137M147L550j65
12001a2571N400Q155j857m701k023L466K84k292Q82R31j725M666K658J109r79
11986A403J045l430p447Q822M017j541j27q935r68M514M969K516O92N82m519j143
11970D50k911n994p239P00M960L220L085m376J042k54j675J434O303Q161J128
11955H034L280K122m332l114j014n703n217p35L10l860L086M72Q133M0l453k947
11939d898k446m46Q235L757M262j965l669J351q793n896K813O95J101J183N291
11924E75l309p778k789N701P665N628j488K32l611j931L478K837o751L188L261
$$ y = [-4543, 1538, 3901, 2111, -3615, -8383, -5204, -4166, -1216, 534, -2618, -4566, 598, 3871, -2694, -2464, 4770, 11139, 9841, -2665, -1816, 5224, 2711, 536, -7455, -12292, -14966, -20103, -15956, -12406, -12571, -7171, 984, -873, -5574, -7597, -4131, -3847, -6139, -5257, -4326, -6051, -1385, 1273, 2382, 1403, 2448, -982, -8429, 393, 4410, 2869, 2742, -6193, -7161, -2647, 2322, 4838, 5530, 6112, 1593, 450, -2461, -8455, -15694, -14994, -10034, -6814, -3729, -8105, -7063, -7317, -8992, -7558, -1255, 6906, 8034, 11314, 13436, 9104, 5990, 4976, -727, -5944, -6679, -6369, -10229, -7143, -6671, 1462, 1502, -1951, -4898, -7344, -7790, 445, 4202, 8464, 6499, 2830, 4181, -4612, -10508, -7695, -7000, -5899, -4716, 575, -2734, -10512, -13301, -7600, 65, 5693, 4205, 4437, 826, -1105, 2373, 5210, -1541, 1647, 4908]
11909D908j283J925p404o230J80l970L538K585l778l43K251O766r2k441L000P9
11893c09o133r75L501k634K613M965K285o03o29n547k636J070J23L247m231p56
11877f649l822P06O033k290j000L008R670J728j462l298n602n379r41J4155M857
11862I714j0344k599o42L743K218N70l123j10M793L433j273q701n023k378N57
11847i165L935k904r08M062o006q83P510J691n64Q623n08o996o500m933L114P737
11831b695N501N396P38O095o523j4400p077N549K957J59N763q86R70p96r845k691
11815a1785j152J794K540k246p82K862Q579j33m168l992j746K28N087N880k901
11800a935l035l018K669K851K315K421n814m635M50L348O388P4K720N213l473
$$ y = [4908, 3625, 5550, -1854, -8084, -7904, -11874, -8336, -5751, -9529, -9872, -7621, -855, -947, -3388, -388, -309, -6442, -7417, -3916, -6550, -3937, 1028, 3313, 2710, 2081, -3466, -6102, -5032, -4909, -1662, -5893, -6649, -10471, -9765, -3732, -6022, -7022, -4014, 5656, 7384, 5922, 2624, -2978, -8357, -9298, 4857, 9714, -630, -3229, -3871, -128, 2090, 2660, -463, -573, 4220, 7653, 6380, -2321, -7344, -9722, -9165, -5230, -8134, -9042, -4980, -10986, -11869, -4359, -2668, -3232, 5391, 4883, -2113, -8613, -13546, -10432, -2695, 2806, 8202, 8940, 15035, 8512, -5888, -12965, -7416, -4459, -4300, 1463, 577, 1547, 751, -9094, -11785, -12937, -11143, -8603, -10849, -11631, -8769, -190, -323, -4491, -8483, -10229, -10001, -4914, 966, -1935, -4970, -7988, -5319, -2468, -153, 2268, -3546, -8181, -7731, -4383, 2005, 2079, 4799, 10012, 6539]
11785F539l128n900l71M332N41j5n41J381j755l184K333j408K396M719q80n818
11769g59k482k241K732J932p884n751j75O698O543n353J435R386K39j0354o254
11754a2288j95P901J527p762l714J451j791P765M360j195M257Q51O5j602l406
11739c776j496M728J594l038n710P741J1010m16l419m010p17m824m560N754P456
11724F317m16m638N57M907j021j184p56l99K85M793K064p817p778m549K918L541
11708c176M3J958R19m798J214K697M564j789p83k854l027L020r91m392m339O10
11692a1124L372K093j204J24j917o134M47P738O283K071n846m281K281L817J392
11677h88l443K040K722R77k989k511K023M707k769o251l569K854J477j039n48
$$ y = [6539, 3411, -2489, -2860, 1472, 2013, 1998, 1457, 2838, 1083, -2101, 232, -1176, 1220, 5939, 5059, -759, -3241, -5482, -2750, -818, -8702, -14453, -14628, -7930, -1387, -6740, -5305, 4081, 4320, -6034, -12288, -12483, -4582, -3055, -10817, -14531, -13080, -14871, -7106, -2746, -3941, 316, 1167, 1232, -370, -3776, -5272, -544, 1050, -1988, -7698, 43, 11053, 10637, 7218, 3208, 2491, -2333, -6893, -1139, 6317, 5901, 1263, 1820, 6727, 5706, 4522, 3766, 3367, 3652, 8445, 10509, 2692, -5086, -9635, -6717, -3176, -3133, -1175, -256, -5054, -3840, -1143, 3421, 1632, 849, -2005, -5032, -2012, -3003, -7395, -11734, -11124, -7752, -5659, -6863, -6739, -8656, -14790, -14343, -6605, -322, 1749, -4097, -8378, -6097, -2280, -888, -4331, -2291, 431, 1408, -1581, -4092, -2069, 2638, -131, -6382, -9951, -7097, -5620, -6659, -7207]
11662g207K439j731N614K656O237k079k541p193m211K148K384m220j485O657J550
11647i82P404k054k012J663p10L809N087k071m327M572p51o762o196J391Q63k27
11631a303K738K186N149J863n863n695l73j484k046Q487K085l981m291k567m5
11616e140p32l974K345O657K799m939j83N198M646L464N063J377p442r732m146
11601d739K884N209P116n190j0580o138N24k391K24K756M85j622L267K762P534
11586B101J33q160K373R54l058l044k229K324q91m559O252P209l036n030j730
11571a0391n91L085Mp61P59J302Q304q5L00m54J916n16n290p265k930j63M463
11554h313O612P962N430q72j699m138j633j3162j831Q114N171Q87L357j332j0114
$$ y = [-7207, -4768, -6499, -885, 1771, 8008, 5929, 3388, -3805, -8016, -5868, -3484, -7704, -9189, -2532, -982, 6422, 4368, 2356, 4019, 3309, 7118, 12205, 10134, 5807, 10379, 9628, 2866, -3330, -1939, -1076, -1303, 1435, 3621, 8770, 10633, 4770, -925, -1298, -2782, -4828, 3659, 5744, 1763, -2528, -5095, -5140, -5872, -9846, -7501, -844, 1955, -2984, -3167, 2031, 6677, 10141, 15204, 16581, 9139, -593, -4739, -1855, 3354, 10470, 5280, -5300, -11438, -10914, -13305, -13081, -10325, -9840, -11462, -8195, -5433, 2101, 2234, -5926, -3553, -2599, -5657, -8701, -10930, -8606, -9497, -14056, -7804, -595, -3631, -8661, -10391, -10982, -7897, -7893, -8654, -7895, -6593, 1711, 1626, 1926, 1472, 3388, 2872, -2418, -9683, -12613, -12776, -8313, -1701, 6261, 11691, 10819, 9120, 4982, 3349, -9813, -11644, -3530, 1641, 2528, 5885, 4553, -5561]
11539e561p780L405K801K280L02J050j247q18j865r60J316M715K779J542k429
11524d70l15k480K612l50o152J670l606r39l696K645K3P763M714N432O952K132
11508A5935r014j1518r07L906L592q98k159J118J571k166k089p64k781P807J902
11493C535p005j423M717m591n921M361K258k056j102j72P43L432L546m46N007
11478D883k431k038m058N05N922L468l169n748n400J707L712N168n554J60k830
11463e703P75L133O141R8j149l583l446M665j41kj842J10J614Q486l44n121j819
11446A872L016m827R05L288M183M96l187j0099L207N103K065l273j0204o71K325
11431e801o379m753M07M158P503m72M73J012L750m058m938M029M107J07j213M898
$$ y = [-5561, -13341, -9936, -7135, -4855, -4553, -3503, -4750, -5568, -7433, -8393, -7077, -2362, 417, 1959, -470, -785, -3265, -653, -1003, -7155, -5485, -9091, -10030, -13726, -11081, -11058, -3295, 1419, 6851, 13803, 15935, 6921, -4597, -5504, -1598, 1994, 1096, -1063, 55, 1626, -540, -2629, -3393, -6174, 1633, 3535, -3470, -4893, -176, -4767, -10688, -6327, -4069, -6125, -7227, -7399, -6656, -3224, 322, -124, 4883, 2452, 414, -3644, -3139, 2783, 6251, 3082, -2666, -8066, -6359, -2647, 2521, -3033, -2873, -5703, -4928, -1795, 4346, 4444, 3295, -288, -3734, 931, 790, 788, -1054, -944, 670, 9156, 8812, 3691, 1872, 4888, 61, 966, 4254, 8437, 8933, 5746, -4353, -1146, 3957, 6022, 2749, -7455, -8126, -5801, -12180, -16933, -16526, -12368, -4865, -5337, -4864, -3852, -102, -4160, -9098, -5069, -962, -855, -2068, 2830]
11415B830O729K823m936n736o40j086K685q66m440l232k834J979M799L17n31L08
11399a831K33M34k9Q32J206j952l665r61J143K956N164J333L51J882l063k271
11383A762m97N40N600k048J675L053l705o726m23n179k960K20K766j671J612o514
11367a2495p415O963R512R617N253p782n341J49O293j279m426j713n243N309n248
11352g846m860N46l026J899O136j586O001L372n315j0648r142L396Q102L360N046
11337d565J799k114P45k653O136N525l877q506l269N137M625o154N554J231P43
11322C57n21k451o746k282P866P66p679o316L685R133L660o489j256P586j899
11307b586k681M062l579PK611J243l137m661m803O026K558l590n403K54O262k40
$$ y = [2830, 9559, 12382, 7446, 1710, 1070, -16, 2669, 1803, -2637, -5869, -8703, -6724, -1925, -1608, -2139, -1831, -1598, -1164, -1193, -361, 845, -1107, -4772, -5733, -4590, -1634, 3530, 4863, 5214, 7096, 4033, 1762, 1265, 1805, 7405, 5357, 7032, 10085, 6380, -346, -769, -5948, -8908, -8688, -5922, -7593, -5981, -12495, -19910, -12947, -3435, 6182, 11435, 3653, -1688, -1539, 4754, 3475, -951, -2664, -7907, -2598, -7846, -12706, -12160, -15186, -13287, -7151, -8737, -2736, 636, -4679, -15327, -24469, -21073, -12971, -9611, -4565, -2766, -4880, -4135, -6788, -652, 4873, 996, -7510, -10779, -5642, -1017, -7171, -1617, -386, 357, -164, -2615, -9361, -11643, -3777, -3011, -10690, -17006, -13321, -4188, -528, -7017, -8273, -687, -2586, -5267, -1205, -4784, -4777, -2166, -923, -4060, -8721, -13524, -7498, -4940, -8530, -13933, -13679, -7417, -7657]
11291g657K356l949M097K289m283M20J10j370P228k688p259P174K962o599l631
11276a0800P878Q827N949J537L230q330j1795j150M08k137K072J082K031n50m392
11261f140O712P643m198j663q62O240N63m899K507O287k512J206N99l740r0j630
11245F023o523l383K395K188l116J250l398r416l512L295K061J371L849M979J633
11230c04L365O477j348q282m37M472L245m62n459q39M641J371K207j2j426r798
11214b589L960P905m742n610K402J18l154N81K600K091o113j2367K717J846j208
11199a1563N029L913R604q576k970n437L222M608j359k152J646N549J091j435
11185A170j805M816M947N088k371k733m849l698j884P86N282K210l598j1239k313
$$ y = [-7657, -5301, -9250, -5153, -2864, -7147, -6727, -6617, -7987, -759, -3447, -10706, -3532, -570, -7169, -10800, -2922, 5905, 11854, 13391, 16621, 8291, -3504, -4654, -4246, -6383, -4311, -3229, -1198, -1748, -6140, 572, 8215, 4017, 2354, 1492, 7732, 8295, 3396, 5903, 12190, 9678, 10884, 11483, 7743, 7653, 6023, -500, -3883, -1488, 700, -2416, -1166, -4564, -13980, -17492, -14197, -12136, -10765, -6916, -1937, -304, 3061, 9538, 8190, -92, -529, 3943, 7188, 6726, 1267, 428, 5069, 6440, 8647, 8635, 7209, -2589, 1371, 9276, 4534, -1076, 1326, 1444, -1710, -1129, 1471, 3562, -2551, -14918, -12201, -10355, -11563, -6534, -2621, 6983, -1593, -4563, -10000, -6778, -2170, -3529, -5681, -4035, 1514, 2605, 1170, -635, 4181, 9128, 14216, 11845, 9112, 4263, 565, -1319, -533, 4749, 6959, 3361, -7878, -10191]
11170a0191M06L407m364M770O234N083l07J883j60m275k065K060L749J750o36
11155G344O530p597r999n967o12J685K661N470L39Q72R68j70k088l657K579N235
11139C593j071p213k363K603J395k594k468j023J833M508L677K460p48j399L354
11124D544k664n229K383m59N016K188K10m913r72N03J878L557m521k131j53k331
11108c094M173R897k484q604k145J035J205N424k390j0666j67O272J176n261r2
11093e721l449p252M012P411K447J036K38J69l604N41P08L26N076j752k527N221
11077B880J083r463j489P977L900O38Q150p44n501J41M29J773m766p43m564l022
11061c321n783K112M00j809R22l447j947J777l48K385L885r80K309j109M351O963
$$ y = [-10191, -9785, -6378, -10742, -5972, 262, 5345, 5038, 6921, 6761, 2486, 421, 2481, 6230, 7980, 7344, 13874, 6277, -3722, -9689, -10301, -8616, -5955, -485, -146, 726, 1694, 1524, -564, -4221, -1642, 3593, 2522, -4691, -7054, -4451, -3056, -5650, -8118, -9141, -7308, -2800, 877, 3337, 2589, 1190, 4544, 1880, -3349, -966, -1425, 3591, 5779, 5989, 1076, 104, 607, 2485, 6042, 1521, -610, -763, -3094, 1079, 10976, 8492, -112, -2257, -1222, -17, 5407, 3017, -7649, -7816, -1544, -368, -5629, -5721, -9170, -16422, -12410, -4999, -2552, -1516, -1278, -1109, -4713, -4172, -3464, -3138, 1938, 186, -2341, 2880, 3963, -5500, -6989, 988, 4888, 5526, 13676, 12932, 7431, 7572, 8001, 9774, 5008, 4265, -299, -3321, -9104, -6992, -6592, -8401, -7479, -10926, -12873, -11096, -11444, -9059, -5174, -6154, -3845, -4954, -603, 6360]
11045F360M03j431o179j038n576p809K645l316L621l36O587L462Q73K157j669
11030a246l856p037j400L834J748K363K670m576l686j006L672l322K46K976k789
11015a1409K67Q463L290K076l830n051l106K589j954J811M02L567l286K128M247
11000B04M63r199n047L361P696M184k393l023O652m95N415O446o357M455j249
10985A1113k966l47l550m433J832M999r656p341j361m98P395L356K6n657O92O27
10969e769p58l879M809p62M227P784J066k417o22m090J464l371l081p07l902m921
10953a4929P270P970m75j555j570n833l09P212j633n93l016M592O310p42n948
10938c249p17L533M425J16m567M761J809k307l355k456m555l473n32K984O88J1767
$$ y = [6360, 6763, 5332, -847, -1885, -7461, -15270, -12625, -15941, -12320, -12656, -6069, -2607, -1734, 423, -1246, -5102, -12139, -13539, -9705, -7957, -5594, -2924, -7500, -11186, -12192, -8520, -11842, -11596, -8620, -11409, -11142, -2679, 611, 2687, -1143, -6194, -9300, -6711, -8665, -6854, -6452, -2885, -6171, -4043, 204, 667, -8532, -13579, -10218, -2522, 1662, -731, -3754, 2898, 2403, 7818, 14264, 7907, 12362, 11113, 8147, 7800, 4250, -183, 1649, 6648, -3008, -10349, -11710, -12208, -4813, -1457, -1431, -7088, -6396, -5769, -6527, -10406, -5597, -6359, -2132, 5652, 6718, 4301, 3679, -411, 1053, -2318, -5399, -6106, -10008, -14929, -7659, 311, -164, -1719, -3289, -9122, -9431, -2219, -3852, -4445, -7461, -2869, 3441, 2699, -3249, -3966, -433, 3992, 4108, -459, 4302, 6111, 3804, 449, -2007, -6562, -10035, -10567, -7583, -6895, 4872]
10922D872P818j542l480J64K040J128m334l449k223L720m14l402j1187k16L687
10907f818N704K06O86L764l122L90j052J222j678J724l656J152j8M375J43m136
10891a114k778N663p16n806K431M213L168k676l031j170o514K305Q579k458m693
10876d597L229L285P9j749m185k409l671k482O355l233k195l872N075N812L758
10861h00j197O720M332n51p791Q11K145J61M343J416n776m878p103j363M727N013
10845B09P307M987L329k665o222l113n672j83k218l208J750K863K086o169q648
10830a5567J266J2146O320j985K577n094m421l458k622K671L123P67J301J832
10816a144K430K921n19k080l974L646J635l60M782Q247M552o219n901M680O23
$$ y = [4872, 12690, 11148, 7668, 7832, 9872, 11000, 6666, 3217, 994, 4714, 4300, 898, -10289, -10505, -6818, -1114, -908, -222, 3542, 420, 810, -242, 980, -698, 1026, -2630, -1478, -1496, 2879, 3022, -1114, -3892, 1771, 1055, -4751, -2320, 1893, 5061, 2385, -646, -1816, -8330, -6025, 2554, 96, -4597, -1368, 1917, 1996, 247, -3938, -6347, -10018, -12500, -6145, -9378, -11573, -15445, -10370, -4558, -800, -1997, 4723, 9055, 8504, 713, 1524, 3669, 3830, 8173, 9589, 3813, -1065, -8168, -9531, -4804, 209, 7516, 12503, 15832, 13167, 6945, 3832, -1840, -2023, -4241, -7449, -5699, -2836, -750, -6919, -15567, -14301, -2155, 4165, 2180, 4757, -337, -4758, -8216, -10838, -8167, -5044, -4277, -2976, -1144, 1286, 4207, 3688, 1608, -2366, 1280, 2915, 2555, 7337, 15584, 20136, 13917, 8016, 12696, 13319]
10801A3319l166L143m043L120k504o334k788O3k103L071j667o261k680N00O127
10786b203L747m896o862j010N400M104k035K118J345J148K397J088L018p208n352
10771e201L40M549K041L917m449j6685k024L058J875M755J840N910L797K099K812
10756H634k968k495o679m780j311K971N401j125Q93O677M11n531Q09N675k780
10741C802l450M3K349k76n258l596j828j440J463M279L761M805k982n563m866
10726h757L334K565j286k773K244J072r57m391j203J93Q25q54J192O510J437j150
10710a999M61q476o48K413K318j081j965L041L059K851R53p11J210L183l142m316
10694b849k778j959K578L840o344k964l156N003N780J0613j16p963n768q93K733
$$ y = [13319, 10153, 13296, 9253, 12373, 9869, 3535, 747, 810, -1293, 1778, 111, -6150, -8830, -8330, -2203, 1544, -3352, -10214, -11224, -5824, -1720, -3755, -1637, -292, 856, 3253, 4341, 7359, 151, -5201, -4861, -312, 1729, 5646, 1197, -15488, -17512, -14454, -12579, -7824, -5984, -74, 3723, 5822, 8634, 5666, 3171, -3508, -8288, -9599, -6628, -1227, -2352, -1459, 5218, 5629, 98, 907, 6582, 3802, 352, 395, 2744, 2468, -2790, -6386, -8214, -9654, -8191, -3912, -151, 4654, 1672, -3891, -8757, -5423, -2858, -4144, -6917, -4673, -3601, -4558, -8949, -10152, -9959, -9134, -9988, -8796, -2286, -849, -1999, -1538, -10014, -10662, -8249, -5931, -7012, -8977, -5936, -2877, -26, 927, 216, 1426, 4609, 1467, -2849, -5627, -7586, -5008, -1168, -7512, -10476, -13632, -8629, -2849, 7764, 7648, -315, -6083, -6976, -4243]
10679d243m33L820K792m412J131O477n085j952K657l984p811J085R967m85K96
10664a80N407J94J835k6l122j336m43L160K803O344p375r420K644J397O46m602
10648b074M854P648j509l251l088K379L804p076o528J069K198Q058p471n540J717
10633d810M700k067J882M144K76q98j049r603K38P587L681j181p829n750O421
10618d258J925j849L288o914l662Q725n91J50K922o57M6j027q67l006l043j101
10602i919N362N698l711k75j168J006Q784m12j4874N31P130J337J305J531o005
10587c680J991L853J652K685o12K540L523r721k590j020j318J215k18J703K943
10572B946m56l895j366K726O582r305o144N633N022P99o987k344M388K803K5l100
$$ y = [-4243, -4676, -856, 1936, -2476, -1345, 5132, 47, -1905, 752, -3232, -11043, -9958, 9, -476, -180, 5227, 5421, 7256, 7230, 4108, 2772, 2329, 5489, 8292, 14636, 7261, -2159, 485, 1882, 2528, -2074, 2780, 10428, 8919, 5668, 2580, 4959, 8763, 1687, -4841, -3772, -1574, 6484, -987, -6527, -4810, -110, -2177, -295, 3849, 4125, 3227, 2178, -7425, -7187, 400, 4081, 2900, -4929, -10679, -4258, -2333, -4182, -894, -7808, -11470, -2745, -3336, -3186, -264, -921, -875, -1902, -2769, -5775, -8818, -9919, -4557, 1141, -2570, -2845, -4013, -3007, 5777, 5365, -9509, -8978, -1848, -511, 794, 2325, -3680, -1689, 2164, 3816, 6501, 5889, 8429, 11952, 2231, -359, -1379, -2697, -1482, -1700, 3, 2946, 2490, -1405, -2771, -45, 6537, -2768, -8912, -3279, 1743, 2542, -4445, -6789, -2401, 402, 427, -2673]
10556b673K930J1973m939q088L986M758j420n491q087j463M28O601j486O427M109
10541G565k6n208n39k415K69k638p15l830O314K997j190k476l051J418M955j772
10525c42o196K020L250L507k106l398m04K888J774j23q088k299J366R350J246
10510B445K11k219l68j294L110k843l637O8r44L162K081M75K007Q30n329o762
10494i007n888K351O088M262k654j877M937K477k034m079R037j654L760k731j719
10479A269J501K264j553L295m029k339j11j757K171M409n772p052R434p90j211
10464b71Q636O363l810o156l021L847K114p327m402N118j751M907J308k205m511
10449a161j765N930M780q30q567O47j146l806M776j575l405l33k412r44P152K853
$$ y = [-2673, 257, 12230, 7291, -797, 3189, 7947, 6527, 1036, -7051, -8514, -8086, -1485, -2971, 3456, 7565, 7539, 2331, 1792, -623, -354, -2992, -3707, -7537, -1223, 1774, 584, -1892, -4943, -3525, 1430, -342, -6538, -4518, -1268, 2239, 133, -3265, -3669, -781, 993, 870, -7218, -9517, -8151, 1199, 2445, 2656, 437, 69, -1225, 1885, -958, -4595, -4527, -5471, -2309, -228, 247, 2254, 3084, -2245, -9007, -14895, -12544, -6456, -2194, -4848, -6725, -1788, 689, -1345, -5424, 3613, 1959, 5719, 2988, 1269, 2770, 5034, 3481, 6776, 2747, 408, 297, -1460, 711, 5120, -652, -7704, 1730, 940, -271, 8365, 14728, 10918, 4762, 1741, 5588, 7702, 375, -4027, 1091, -660, 4247, 5555, 3350, -1161, -2926, 3004, 7784, 6954, -1613, -966, -2112, -5918, -1142, -2717, -6122, -6455, -8867, -9811, -2659, 194]
10433A94l22k937m640K942L631N50M302l631K791K054j887j24l007k755q5M328
10417A404N17k320R41R54m883m54M944l949M123L851j601L520l287q174P98l479
10401g095K978K584L396M384K345n194p921L14Q573J346J042j563k92j1338p182
10386a3623N457l55J557N934L354J725j805Q95K018m588p40K803L842o329j782
10371a637M537j600l402n46P14j952P85N744L597j872l121K42K871j629J864j01
10355D494n388m249N827j582k244r80L807K67l990j992L710k54p82J525O829l22
10339D676k194l703n283l329M610j562J098K784K826N608K640r757n574m67L220
10324d407O19N754N089p566n504M676P545M149j144n568j412K696j904p672l699
$$ y = [194, -128, -3065, -7705, -4763, -1132, -582, 3720, 89, 2880, 4934, 3047, 2923, -84, -2839, -2924, 1404, 1921, -399, 542, 1496, -3387, -3841, 1103, -2846, 1277, 5128, 3527, 7047, 3760, -4414, -3616, -7095, -4117, -1533, 1863, 6247, 8592, 3398, -4523, -4209, 4364, 5710, 6752, 5189, 4897, -6441, -13623, -8166, -8521, -6964, -1030, 2324, 4049, 2244, 3139, 5157, 569, -171, 2632, 6474, 145, -1637, 2900, 1300, -2102, -2648, -1934, -3886, -3101, 2643, 6240, 4368, 1247, 1489, 4360, 2731, 4595, 4494, -894, -5143, 684, -898, -3142, -4122, -315, -48, -4038, -6030, -2320, -2574, -3356, -1831, 4998, 4676, 2482, -1221, -6504, -9833, -5223, -6785, -5687, -2903, -77, 5531, 8171, -1586, -7160, -7627, -4407, -3788, 1966, 7055, -511, -6015, -1339, 6206, 10355, 9211, 3643, 2231, 4927, 3023, -4649, -8348]
10309h348J111Q972l76l020n112n200K831M984R57P56J736L462m874n059N33k66
10293f913P40M610q43m051j82N682K914K882q040m487n53K161O573O7m953K791
10277a602L281L953J635o129m459l540j685L950L384J134O747j914n523K129P203
10262H564r10r703j805K073l166n400k231N820J604J60j393L137N402m484k507
10247d839k563R578k403l542N575J234m081N175P233k451k197n96j547p225o256
10232h905r81J731K98l370L056j066Q798P451J438J721q87k663n540k025q52J453
10216c43O308l16l141N44Q94K617L387K570m778L963r81p833j33k381l3n142M07
10199d391P155M301o59P26Q841l587p492p951k218J840M194n79o628k586m090
$$ y = [-8348, -7237, 1735, 1359, -1661, -6773, -11973, -9142, -4158, -3201, -2445, -709, 2753, -2121, -7180, -6647, -6913, -6173, -1563, -2406, -6457, -6639, -957, 1957, 4839, -3201, -7688, -8241, -6080, 493, 560, -4393, -1602, 1679, 5632, 7267, 1138, -3321, -6861, -8546, -4596, -1212, -78, 6669, 4755, -768, 1361, 8564, 7654, -2049, -3854, -1781, -4947, -10347, -12578, -6758, -5154, -4994, -6387, -3250, 2152, -2332, -4839, -7402, 2176, -227, -3769, 1806, 3040, -1041, 4134, 11367, 8916, 6719, 6123, 4576, -2649, -8905, -9886, -8155, -7857, -11227, -8171, -9237, -439, 7012, 8450, 10171, 9284, 6621, 1081, -944, -1796, -343, 5965, 5649, 2508, 3052, 3946, 6563, 9950, 12520, 7742, 11705, 10724, 2891, 2758, 377, 344, -4798, -4391, 2764, 7065, 6406, 7132, 15973, 12386, 4894, -3057, -5275, -3435, 759, 180, -6448, -9034, -13124]
10184a3124M461L696J924q2l233r14J646L563J561J335L120K427n596m068J600
10169a684l876k92M202j0241M023J907k048O974k768l788P258L784o287j620L154
10154a302J679r21k364K208N36n276K202Q796O407p354p87o966NJ305o329l572
10138a1733Q1P531N11K536m912m709L692J131j233P611L855J113m081l442Q20
10123a229N2k934p22m581n447L525O851K160O26L126k33m423j775R697J951p016
10107c72j994R26J914l911j795P480P480j575q40j461j471k490p32n21K146n377
10091b593k068k56j587L322o154o685J98N112N92l4J350k282O0J390M034Q188
10075B587L455O90l529q386j138O239R850J857m794P15m575J808M84J807Q80n800
$$ y = [-13124, -8663, -4967, -3043, -3125, -6358, -7272, -5626, -2063, -502, 833, 3953, 6380, 784, -3284, -1684, -5560, -5852, -1650, -11891, -7868, -5961, -8009, -1035, -3803, -7591, -333, 3451, -2836, -4456, -1302, 377, -544, -2908, -700, -164, -5440, -3238, 5558, 11965, 4611, 3824, -3142, -3137, -1832, -8161, -11733, -11652, -4121, -3610, -1074, -5986, -10695, -7003, -5872, -7105, 506, 4361, 5474, 1393, -2049, -1229, -1177, -4111, -4833, -9414, -14861, -11336, -4485, -2325, -1699, 1427, 1194, -3229, -5004, 4693, 6644, -372, -2366, -1440, 474, -3437, -5232, 2248, 9728, 8153, 7313, 5852, 4381, 1891, 1159, 638, 2784, -2593, -4661, -4917, -6504, -3182, -9336, -16021, -15823, -10711, -10119, -10153, -8803, -11085, -11025, -9635, -5601, 2587, 6042, 6732, 3203, -5183, -6321, -82, 9768, 11625, 6831, 7546, 2971, 4779, 5263, 7070, 7950, 2150]
10059B150L29K157L438m867p427M512J862J111K433J324J590l953n092N177J977
10044F721l528l953k335N100n33p438k387Q03J424K384K442L965K417k085J098
10029D095q60O04o8m833J596p6K886Q47j997R61M286M221l292q996o350K156K78
10012d542K428K886L359m873m738N366Q857k167O01J712o697N33L172l409m782
9997b294K520M598k163m201l21j170n260l515O763k512L43P282l06n068l39k348
9981g991J580P971N630r757k675Q008N905n217q792m690O67P270O525L326n836
9966A924N82L13o45k452J018P53l888l604M679P55K880o531l714j915n811Q817
9950f839J0842J92J735o505n045Q928k160p96j007M190p060j204J157k176M253
$$ y = [2150, 2479, 4636, 8074, 3207, -4220, 292, 2154, 3265, 5698, 7022, 8612, 4659, -433, 4744, 6721, 3193, -760, -3095, 2005, 1472, -5966, -8353, -7550, -6126, -3742, -1300, 2665, 5082, 2997, 4095, 3235, 3839, 3771, -1062, 534, 458, 3344, 4191, 2194, 3155, 7441, 11662, 8370, -626, -6976, -4820, -4542, -2114, 772, 4131, -742, -5480, -114, 8743, 6576, 7177, 8889, 2192, 2725, 5897, 2488, -2294, 226, 4824, 2661, -1540, -1861, -3031, -8291, -11806, -5043, -7555, -7212, 70, -236, -5304, -5643, -7991, -6411, 1560, 7190, -2567, -5242, 2766, 8671, 3454, -5338, -10028, -9361, -2091, 4434, 7760, 1924, 2506, 2819, 2174, -278, 740, 1493, -2395, -5999, -1320, -565, 2315, -4216, -7930, -9845, -15656, -6839, 4003, 4195, 5930, -575, -5620, 3308, 1148, 352, -655, 3535, -3525, -4729, -3572, -5748, -1495]
9935a495O587O113k069l015o071L215M283m407p426j667K581M804M168K783L085
9920A1469L245o610o623K139m96J285N2l459L62Q767K014m047j0628L86N323N533
9904H712q13K21k615m911L054k408l831l699o76L80k948k324N328R311J444o793
9888b568j087k016L410k082K405Q64O90q38l838K249L999k840J196L698M37R33
9872D612J903m244r307n90K135p139P350O479K814M852l57k644l337l987k258
9857c718J900l462l20P624j059j512J312r00j745K693N760j056j1533n092J037
9842a0071O425P991O334j264L65J612p524o125K216q13q256J969O718K187M107
9827E871J004p208l557J731M383l839m451J749M55n141j013q31l537O731j268
$$ y = [-1495, 5092, 11205, 9136, 6121, 50, 3265, 7548, 3141, -4285, -5952, -3371, 1433, 5601, 8384, 11469, 14714, 8104, 1481, 3620, 3124, 4409, 4461, 1002, 1364, 10131, 12145, 8098, -2530, -2144, 3179, 8712, 7899, 8120, 5505, 594, 3648, 1240, -2591, -6290, -6966, -6586, -9534, -11858, -6530, 2781, 4225, -2568, -3655, -5671, -2261, -4343, -1938, -1074, -384, -1222, -5060, -2811, 1188, -1652, -456, 3242, 3679, 4612, 6515, 2271, -7036, -7626, -5491, -12630, -5280, 1199, 4013, 8865, 8508, 5864, 2527, -1460, -3718, -1818, -5280, -5600, 2024, 965, -547, 765, -135, -1880, 813, 6573, 5517, -6016, -11108, -10071, -3646, 4345, 10679, 9415, 9780, 11392, 3868, -2257, -41, -854, -9110, -7141, -423, 1764, 5871, 6875, -333, -3890, -2159, 2224, -1615, -6066, -4317, -3862, -9003, -10016, -10847, -14384, -7653, -8921]
9812h921l88N918N320J849L24n55J117J021K485K022p89q797p627q00O136N82
9796a103N128k997q263o403m843O91P452R198n12P90m67O185M761m204l817N950
9780G546Q347j127m004j1512n784M976l465m953Q141R880K242o919m210J44l469
9765d167n774O325m3k376n09j591P71m02j827k913M651M052l685n199J383Q099
9749c205P178M76j185n710l640j31j099n52M284O982j926n680j177l037l365j0595
9733b2382m195P091O656P826J0269N664k816M18k622m444N240QJ15P69R20P881
9717A6398l751L535j86j960k411p868J211k763o440p916K202N51J736m318P97
9702a1183J596J312O481m003j0039O50M352P586N753R434q65j2028j0589J382
$$ y = [-8921, -9309, -3391, 1929, 3778, 4102, 3547, 4664, 5685, 8170, 10192, 9403, 606, -7021, -7821, -1685, -1103, 4025, 1028, -7235, -13638, -18481, -17790, -10338, -1140, -1652, -862, -1329, 4856, 9617, 5413, 1596, 7546, 15893, 14766, 10762, -750, -6534, -1558, -5023, -9976, -1835, 8045, 10287, 3368, -842, -698, -4167, -9941, -3616, -3659, -6035, -6544, -8135, -7364, -7766, -9593, -12506, -7855, -3803, -7488, -12687, -11304, -3205, 3973, 4449, 3264, -2446, -6086, -6217, -7316, -7868, -3584, 3398, 1472, -4208, -5385, -8422, -11787, -22382, -26577, -19486, -12830, -5004, 5265, 10929, 8113, 8531, 5909, 1465, 6705, 6713, 6828, 7597, 8517, 16398, 12647, 16182, 15996, 14036, 11625, 3757, 4968, 2205, -4235, -12151, -9949, -9398, -7662, -11980, -11183, -9587, -8275, -1794, -5797, -15836, -15186, -10834, -3248, 2505, 11939, 11074, -954, -11543, -10161]
9688a0161P526O847j746l045J92K29m99P4p260r01K570K27M762j24j322L18K436
9671A23J234j563o912j264O036L490o231n727o438L658M848M44m995j688j515
9656a6500J686R727R765j802L854J936k851M59L02J661j780o445k281Q232O816
9641A2779p368o710K569K871K483l435m59l529R77m020n689J123L983K824J78
9626a423J374k493J0366M842l721j085j964k730m547O700L849n947J138O0j125
9611C294r3J934l662m464P607l563O308M024j389K675j47J32p267P49O08j568
9595E178n78J964j252m507L628k444O296J896j297j59K795k68m960k2r99m857
9579D14n179O047M078k471j1103J112L423M773L863n507m824k506M131P17P243
$$ y = [-10161, -2635, 4212, 2466, -579, -387, -158, -657, -583, -7843, -8744, -6174, -5947, -1185, -1309, -2631, -2313, 123, 1357, -206, -7118, -8382, -2346, 1144, -5087, -10814, -17252, -13594, -8746, -8302, -13297, -14985, -16500, -14814, -5087, 4678, 2876, 6730, 8666, 5815, 6274, 6576, 8237, 6457, 12, -2269, 5963, 12779, 5411, -1299, 1270, 4141, 6624, 3189, 2730, -799, 178, -3842, -9531, -8408, -4425, -1601, -1423, -49, -2542, 7824, 12666, 8945, 7860, 5896, 3166, -1381, 5319, 9168, 3221, 4359, 4419, 3294, 3201, 5135, 1473, -2991, 4616, 1053, 7361, 11385, 9996, 12671, 12524, 12656, 5389, 6138, 6746, 5178, 4600, 6564, 5312, 805, 4433, 1989, 8285, 10181, 8884, 8725, 11520, 11252, 6292, 6270, 5271, 414, -4765, 1282, 5360, 2889, -8214, -7102, -3679, 1094, 4957, -550, -5374, -7880, -3749, -3032, 4211]
9564D211M156j705K184j638k419l415l310K648J856L618Q221k947j2490R75J223
9549A168n452n606L024K994O164M627J31K90L170K411J72n454o272J378k982l501
9533c738L614P185J91q950k662K304K427K460n225k34O253j898l499k205J184
9518b793Q142J450k358q716l693J249O757L13K819N936k591k864J0657q18j1587
9503A903l964j653J578l779K855L750L662o8O42j033q234l279J123Q300O094P494
9487A5391l648q09j1366l915J360n184j417M440M083l712N27k289Q4M92K426O695
9471C158L529r04o409l426N095j583M148J225k556J561L199K956l350l931j225
9456A487k621k345M517Q765J774o391k004N87j515k832M878J360J732j745j712
$$ y = [4211, 8367, 6662, 8846, 7208, 4789, 1374, -1936, 712, 2568, 6186, 14407, 11460, -1030, -55, 1168, -4284, -9890, -6866, -3872, 2292, 6919, 7050, 7340, 10510, 12921, 13093, 7639, 1367, 2745, -237, -3738, -124, 7061, 7252, -1698, -4360, -2056, 371, 2831, -2394, -2628, 3625, 1727, -1772, -3977, -2793, 5349, 6799, 4441, -4275, -7968, -6719, 38, 351, 3170, 9106, 6515, 3651, 14308, 13490, 1903, -2061, -3714, -2136, -5915, -3060, 690, 4352, 4284, 4926, 3893, -4341, -7620, -6497, 1803, 7897, 15391, 11743, 10934, -432, -4347, -2987, -8171, -9588, -5148, -1065, -4777, -4250, -6539, -6455, -5963, -3537, 3158, 6687, 5783, -626, -4052, 1043, -540, 3608, 4833, 2277, 3838, 7037, 9993, 6643, 2712, 1487, -1134, -3479, 1038, 9803, 11577, 5186, 3182, 3769, 2254, -578, 4300, 5660, 7392, 5647, 3935]
9441C935M432l80j0118j251Q268J007n69k398q466K008L672k756k847J945m46
9426c964m532K25Q342K829j188N281J465O90L068j325o525l631K206N669K051
9411A0661o32l158J090j105J760K80k556J593j570m765J541L625j249L633L272
9396A2420j401o80K680K589J58k152o25o29k348J483o4m591K686n090n782K397
9380A051P167M023L498n197p405k495P550j677r426k040m538L38L017O928L068
9365C862O32j396l887J116K285J731L260j051P182L065j680j998k465l605o28
9350F423l599k774M82L166M024K115L377j509m980j18O20N380l473l433k690Q162
9334A1173J549m892n562l927M858Q054j720q260K1O542l691j841j550n54J521
$$ y = [3935, 8367, 7987, -2131, -3382, 4886, 5893, 5324, 2926, -5540, -3532, 140, -2616, -5463, -3518, -3964, -8496, -8271, 71, 2900, 1712, 6993, 8458, 9148, 12216, 10891, 4366, 735, 2941, 8610, 10661, 10029, 6871, 7961, 6856, 8616, 8896, 6340, 7933, 6363, 1598, 3139, 6764, 5515, 9148, 12420, 11019, 10339, 13019, 15608, 15766, 13614, 12989, 12360, 10012, 11495, 11431, 6840, 9526, 4436, -1346, 1051, 8218, 12241, 15739, 10542, 3137, 642, 8192, 6515, -2911, -4951, -9489, -9151, -6134, 794, 3862, 4494, 3098, -789, 327, 2612, 4343, 7603, 6552, 13734, 16799, 15119, 13121, 10656, 7051, 6423, 2824, 50, 532, 3698, 7722, 9837, 13214, 11705, 6725, 6607, 7227, 12607, 9134, 5701, 3011, 11173, 12722, 7830, 2268, -1659, 3199, 11253, 9533, 1273, 1294, 7836, 4145, 2304, 754, 200, 1721]
9319A721L872J161l738j900Q599M164q996L022L196N038j190r524l798J426j402
9304A651k670K520j089j902K36N593L290l870p874O112M313L911J944J638M413
9289A8216j081n293l139K486L570R17n032l57j872K646J356k052l765O41l763
9274C478J546n887j655O971K566l27K965K099K112K744p702k338j102N475P639
9259A8584L614m116j604J799m32j455M059K172j892m186j190P278N623o549p420
9244A4285K657n90l650K211l92K751P282J81o182n667N526j183k83N26m905j4
9228A2553L127K574K474m032j561k694l829j595Q05L251j685Q918O51M896k898
9213B0955M365O630L352K489r57n181m115J797L282j017L492j755l521o99L464
$$ y = [1721, 5593, 6754, 3016, 1116, 9715, 13879, 4883, 7905, 11101, 16139, 14949, 5425, 1627, 3053, 1651, -1019, 1501, 412, -1490, -1254, 4339, 7629, 3759, -4115, 1997, 6310, 10221, 12165, 13803, 18216, 17135, 11842, 8703, 11189, 14759, 15676, 10644, 10287, 8415, 11061, 12417, 10365, 6600, 7241, 3478, 5024, -863, -2518, 4453, 7019, 6692, 9657, 11756, 13868, 16612, 8910, 6572, 5470, 10945, 18584, 22198, 18082, 16478, 18277, 17845, 16390, 20449, 22621, 20729, 16543, 15353, 22631, 28254, 21705, 14285, 16942, 16352, 12702, 14913, 14521, 17272, 24554, 24735, 18553, 12886, 18412, 17229, 16946, 17472, 12567, 12553, 15680, 18254, 20728, 16696, 15135, 12441, 8612, 7017, 7822, 11073, 9388, 18306, 18957, 23853, 20955, 25320, 31950, 35302, 37791, 36834, 31653, 27538, 29335, 32617, 31600, 35092, 33337, 29816, 29117, 32581]
9198C2581k56p17p53J020O65R03j032n803R726O536N138P887r02l383n027n443
9182D1140l31Q666N365N443j611m040j833l356L506K533O393J1082J641K255m81
9167G6372L085Q147P153l298m224k762k259N490O890K402J430r69O866l47L036
9152A07012J2013J2383R811M432N180J0438O325N264M355K556O054Q396O273J969
9138B02461M004N171J265M419M399J6188J1272j87N265N133m414K408R85N94j632
9123B57331K378m365n543k302n45j0766m7k001j0001p262o544n095r146q410l123
9108A84559n427k069o953l338p296r807n586q057q516k786n924o813n891p914
9094I8182k816j349m75k304L05j325o304m405K625p989m447N666j639o481m201
$$ y = [32581, 32325, 31608, 30855, 31875, 32540, 33443, 32411, 26608, 36334, 42870, 48008, 55895, 54993, 51610, 46583, 41140, 40809, 49475, 54840, 60283, 58672, 54632, 52799, 49443, 52949, 55482, 61875, 72957, 74598, 76853, 76372, 79457, 87604, 94757, 91459, 87235, 84473, 82214, 87704, 94594, 96996, 98426, 97457, 104323, 103976, 107012, 119025, 131408, 141219, 145651, 150831, 161269, 167594, 172858, 177213, 179769, 185823, 194219, 200492, 202461, 206465, 211636, 212901, 217320, 221719, 237907, 249179, 248992, 254257, 259390, 254976, 257384, 258369, 258963, 257331, 259709, 255344, 249801, 247499, 246954, 236188, 236141, 234140, 224139, 216877, 210333, 205238, 196092, 187682, 184559, 179132, 177063, 170110, 166772, 159476, 149669, 144083, 136026, 127510, 124724, 118800, 111987, 106096, 98182, 95366, 94017, 93542, 91238, 91543, 90218, 83914, 79509, 82134, 74145, 69698, 75364, 73725, 67244, 63043]
9079F3043K58P194J492l809k489P828j239j2818j3425j334M767J274m929l196
9065D2617K291K666j357p59q677k590l18m661j324L741P071k870r35M721r19p323
9049C1374q581N424N044K07j119q099n176O067M444n734l980M992k39K365J361
9034B8350K324l899l544L532L599K754l701l767M46N299M14m146o735m699J886
9019A8113k285K352K494m151r419J151m31P624R286K188q345n798K196N59J093
9004A6627J184n089l144L570L944L766J72r74k077l820J788J667p09o381k146
8989H378M137K381j314j422K145m78K754L780K639p201j1502m724M573K948J138
8974H232N296L622p34k420l777l994j697j838k204q77M545J511J749R41k975k339
$$ y = [63043, 63301, 70495, 71987, 68178, 65689, 73517, 72278, 59460, 46035, 44701, 49468, 50742, 45813, 42617, 44908, 47574, 46217, 45458, 36781, 34191, 33873, 29212, 27888, 31629, 38700, 35830, 34895, 39616, 38697, 31374, 22793, 28217, 33261, 33468, 32349, 24250, 19074, 25141, 29585, 23851, 19871, 24863, 24624, 26989, 28350, 30674, 26775, 23231, 26763, 30362, 33116, 29415, 25648, 26094, 31393, 31807, 27661, 20926, 16227, 18113, 15828, 18180, 20674, 16523, 7104, 8255, 7824, 15448, 24734, 26922, 18577, 12779, 14975, 15534, 16627, 17811, 12722, 9578, 13148, 17092, 20858, 21030, 20056, 17979, 14159, 15947, 17614, 16905, 10524, 8378, 12515, 14896, 13582, 12160, 14305, 13827, 16581, 20361, 23000, 15799, 4297, -427, 4146, 7094, 8232, 13528, 17150, 16416, 13996, 10219, 6225, 4528, 2690, 486, -391, 4154, 5665, 7414, 8355, 5380, 3041]
8958C041J684o75L767N003K320K80l377N025L172o847q400K791N129o466N81O441
8942A3469l06m355N80l715k705j004N214O956Q33K474m153j466l192j131l237
8927D262J142O484K123q236k512j312k59o49O97N57L77m992n889k610P322O655
8911C160K92m903L701L172l712K117l62k644k722K834m192l044q17J728M257N023
8895C888Q020l3j059K621o513j0565m888J772K950N848L392j335j745j848p943
8880g438q19L907J092M210O577l697j563k277R80P89O36k148l381q12J18M694
8864H68K020P319r22p152k789R812J1041J381m887m283N980K279K264n231l98
8849A7302J585m091J26K81J662l036r732L958K607l714o595M27N109K818m329
$$ y = [3041, 4725, 4050, 7817, 12820, 15140, 15420, 12043, 17068, 20240, 13393, 4993, 7784, 12913, 6447, 7028, 13469, 13163, 8808, 9388, 5673, 2968, 1964, 7178, 14134, 14967, 17441, 13288, 11822, 8630, 7499, 4262, 5404, 11888, 14011, 5775, 3263, 1951, 1692, 1043, 1740, 2297, 2674, -2318, -8207, -10817, -3495, 3160, 3452, -1451, 2250, 5422, 1710, 3827, 3465, 821, -1901, 933, -3259, -6303, -7120, -5392, -1135, 3888, 11908, 11875, 10816, 13437, 6924, -3641, -8529, -6757, -3807, 2041, 5433, 4098, 2353, 505, -7438, -8257, -4350, -3258, 952, 7529, 3832, 2269, -8, 972, 1761, 2397, 249, -3132, -3944, -3826, 868, 2888, 10207, 9285, 2133, -656, 9156, 20197, 21578, 16691, 12408, 18388, 20667, 22931, 17700, 17302, 18887, 14796, 14922, 15203, 16865, 13829, 4097, 8055, 10662, 6948, 353, 780, 5889, 8707, 4378]
8834D378j721q637n740O305n57N122N872K793o186J6L853O184p343p352k357k96
8818e666j00K043l393L341Q149L732R92n898n427J150J0572M633p355l315L506
8803F964J633l075j406Q98O857K573k744o045j739K286K784l759k130k850K507
8788B754m869j781n069R34M871K062q07O366j650n216j371R89R277N796j84j429
8772A0673M145k383j178m436o421j21K448M502K278k84r425m229R087N815P71
8757A1242j885m559l313j558K506L70p925J952M916k18l003j063M404L131M029
8742I026Q650P271o980l884m261q296O89K9J610M745j384o776R39L311K013l833
8726B869L579K553m632r08K041M599J395l563L432q363j541P122M782M049L469
$$ y = [4378, 2657, -5980, -11720, -5415, -5972, -850, 5022, 7815, 1629, 1645, 5498, 11682, 4339, -3013, -5370, -5666, -5766, -3723, -7116, -3775, 4374, 8106, 9098, 3200, -2227, -1077, 9495, 14128, 6773, 3458, 6964, 8597, 5522, 4116, 5014, 11871, 14444, 11700, 5655, 3916, 6202, 8986, 5227, 3097, 247, 2754, -2115, -3896, -8965, -8031, -3160, -1098, -1905, 4461, 2811, -2405, -3776, -2787, 6490, 12286, 12102, 10673, 14818, 12435, 11257, 6821, 400, 279, 2727, 7229, 9507, 9223, -202, -4431, 4656, 10471, 11242, 9357, 4798, 1485, -73, 2433, 2803, -5122, -3170, 1746, 1528, -1475, -2538, 1866, 4997, 9026, 17676, 24947, 17967, 14083, 9822, 1526, 2215, 2244, 3854, 8599, 7215, 439, 1378, 4689, 6702, 2869, 6448, 9001, 4369, 3461, 5502, 10101, 11496, 7933, 11365, 3002, 1461, 8583, 13365, 17414, 20883]
8711B0883k339j1976l013M536J006M355n160l23L399Q416k279K816j778l988J787
8696A6342n235L69M462n953j180n740M38K880O325M742j449J027n340o895L582
8681H375J0164R783j215J422O942n165p572j612J399O815L082l97m978n359K970
8666B4654k750o712l143M666M732N899K218q68n249j251J134N89k157o404K180
8651A7538L454J879M831M941l909m972j786O01J514L29L014K876N986L921M84
8636D0701R3J343k795L19K667N033j300r098K7L086k172n2R109J262k090j124
8620D5009n01L129N678L01K363N288M911N182Q886K805J497J447P699J0421M276
8605A08391M00J2135P432m033n63J075R08P36J374l038j0557j1823l860L438j04
$$ y = [20883, 18544, 6568, 3555, 8091, 9097, 13452, 8292, 7969, 11368, 19784, 17505, 20321, 18543, 14555, 16342, 11107, 11476, 15938, 9985, 8805, 3065, 3503, 6383, 12708, 17450, 16001, 17028, 11688, 4793, 8375, 18539, 28322, 27107, 28529, 35471, 30306, 22734, 21122, 22521, 29336, 32418, 32021, 27043, 21684, 24654, 21904, 15192, 12049, 16715, 21447, 27346, 29564, 28696, 23447, 22196, 23330, 23919, 21762, 15358, 17538, 20992, 22871, 27702, 32643, 28734, 23762, 21976, 22577, 24091, 24420, 27434, 30310, 36296, 40217, 40701, 40794, 42137, 39342, 39661, 42328, 47361, 46061, 36963, 36990, 40076, 37904, 37852, 46961, 48223, 46133, 45009, 44508, 47637, 53315, 53616, 55979, 61267, 66178, 71360, 80246, 83051, 84548, 85995, 93694, 104115, 108391, 108791, 120926, 128358, 124325, 123762, 124837, 125745, 126481, 127855, 124817, 114260, 102437, 98577, 102015, 101911]
8590A01911r698N275j152n727k522j268K384J762K476n817k695k880n423q389
8576F8237q880j03j209l228K433J828m318r712q019J22o13k92K090j257n170m335
8560B7574j0557p252j297Q39p2n974K844J951L266P111M3k345M74l414o86K138
8544A4643L135J883j690m903n578R43J394L368l506J179J488P259N175p62j1693
8529A2335j3205j670j09l902L047J0573L209K64m040L698j644M021j84n846N76
8514G123O883M17p097n489J83K746O57q94l067j990M6l305k288J325j83K727O627
8497D421N635l158j251q149o094L989M109J416O462j641m605j105k360O693L738
8482H100K660J529J709j326K682m123j083K834j344n581j003K531k790m683J49
$$ y = [101911, 92213, 97488, 96336, 90609, 88087, 86819, 89203, 90965, 93441, 87624, 84929, 82049, 76626, 68237, 59357, 59254, 58045, 54817, 57250, 59078, 54760, 45048, 37029, 37151, 36538, 36246, 38336, 37079, 31909, 27574, 17017, 9765, 8468, 9307, 9235, 3261, 6105, 8056, 11322, 18433, 18476, 16131, 16605, 13191, 12505, 14643, 17778, 19661, 17971, 13068, 7490, 8433, 9827, 13195, 9689, 10868, 12356, 19615, 24790, 24028, 12335, -870, -2540, -2649, -6551, -3504, 7069, 10278, 10542, 6502, 10200, 8556, 12577, 12393, 6547, 7123, 14006, 14423, 7326, 1837, 2020, 4766, 5423, 4529, 1462, -528, -482, -3787, -6075, -4750, -4933, -2206, 4421, 10056, 6898, 5647, -2502, -8596, -4607, -498, 918, 7380, 5739, 1134, 29, -2331, 4362, 8100, 10760, 12289, 13998, 12672, 15354, 11231, 10148, 12982, 11638, 6057, 5054, 7585, 4795, 112, 261]
8467B61J646K388M433Q19N416M874M027p021o311o425K60m127l142r18R25J125
8451a770R851M756j436m636l771L35K32M22M015K790k205n812q66J1942J588j0100
8435E335N991k592J39n181o27L238M494J67N141q72k606J455j760m861j833L896
8419I524P929j22m478m875n302L632M899J811j452J915p215l717j861O945J0107
8404A7740n323j2262M71J101l712Q356O478j1964R0L958N91L754L511k422j034
8389I333p71Rq103r80L614L423j767p664L198L222l651P974L916k296n055k672
8373A730J198K133P147M284p462n395M747P23k298O57j187J133k660k093j086
8358A571k900p794K948J098k640j76j781K691Q57K757Q016M831k309j406L590
$$ y = [261, 1907, 4295, 8728, 9547, 14963, 19837, 23864, 16843, 10532, 4107, 4367, 240, -2902, -3820, -2895, -1770, 8081, 12837, 11401, 6765, 2994, 3329, 3561, 3983, 7998, 10788, 8583, 2771, 1905, 13847, 15435, 5335, 11326, 8734, 8873, 3692, 3065, 6303, 10797, 10964, 16105, 15233, 12627, 14082, 12322, 7461, 5628, 9524, 17453, 17331, 12853, 7978, 2676, 6308, 11207, 13018, 11566, 13481, 6266, 2549, 688, 7633, 17740, 12417, 155, 626, 1727, -1985, 6371, 12849, 885, 975, 4933, 5524, 9278, 12789, 10367, 9333, 8562, 8571, 468, -512, 3102, 6525, 4758, -2906, 292, 3514, -137, 7837, 11753, 9457, 4402, 1730, 2928, 5061, 12208, 16492, 9030, 3635, 8382, 9105, 6807, 7464, 6277, 7410, 4750, 2657, 1571, -1329, -9123, -6175, -5077, -7717, -7893, -9674, -6983, -6126, -3369, 4647, 9478, 7169, 5763, 9353]
8343I353P751L013J729n520o574q653o992K910J410J063M156J758K462k439M744
8328A0171L358m789l10k870J024Q565L606l491p818J089M3j645J640l856j418
8313C299K688l74N499k563q916m993J2715L812l885rk623M082K937l701k316J442
8297G094L257m393J644n29l094o270M525O220M55m87o156J068O473N86j595m741
8281D057J634K752L61l367j75L066M070K46j74n243K864j283n828n725M937M403
8265F595j622K479R71N39r659R31k315q96j540N505N871N152J521p408m874o175
8249d925J639K878K894mk58n354p05N066l585O998L479q232m360k896q60K17L636
8232d372L255m990k600O663N298o97R97M24j194k41r30j6O121L562j138o81l534
$$ y = [9353, 17104, 20117, 21846, 16326, 9752, 1099, -5893, -2983, -1573, -510, 3646, 5404, 7866, 5427, 10171, 13529, 8740, 8430, 5560, 6584, 15149, 18755, 15264, 7446, 8535, 8578, 6933, 8573, 4717, 3299, 5987, 5613, 11112, 8549, -367, -5360, 7355, 11167, 7282, 7273, 4650, 8732, 11669, 7968, 5652, 7094, 10351, 5958, 7602, 7073, 3979, -2291, 2234, 8454, 8909, 8422, 2266, 3334, 9807, 10393, 8798, 4057, 5691, 8443, 8804, 5437, 5262, 8328, 12398, 12644, 12470, 7227, 10091, 8808, 2980, -2745, 2192, 6595, 4973, 7452, 8423, 8962, -697, 234, -2081, -2977, -4517, 988, 6859, 12011, 13532, 6124, 1250, -4925, -3286, -408, 2486, 2482, 2224, -3130, -3835, 1231, -2354, 4644, 8123, -109, -4469, -7365, -8225, -8008, -4372, -1117, -6107, -8707, -2044, 3254, 2557, 3554, 3978, 2784, 2543, 1613, 1597, 7718, 11280, 10142, 9461, 5927]
8215E927o269K385K515k662P71j715j956L738O648k185L403j263q996k427M197
8200B111L89k705k576K704L25J071k1n79P185L992p038m743m46j154J6J000K185
8183A716J041K996m621N357J295o559k025j035N81N68n811O952K192O709j658
8168G698J730N63m110k020j669l422K464q843k489k549J489K543R866J890J82
8153C323O67O130j96k20n537j760O196J1364J2090P767L816n197j2486q090m7
8138A7820l72n032l927j1519j0331K942M630Q244K38J272k295k854J823N671l032
8123C278j197j75K107J321n812m54J375Q878j809n762M168Q404n64n44k931K500
8107A2783K458n14q85P406J1139J2648m426q593n712n865r168m287L407N174L49
$$ y = [5927, -342, 2043, 4558, 1896, 2667, 952, -1004, 2734, 9382, 7197, 10600, 9337, 341, -2086, 2111, 2500, -205, -2781, -77, 248, 1319, 1298, 719, 7904, 11896, 4858, 115, -331, -1485, -1469, -469, 1716, 2757, 5753, 1132, 6489, 7784, 1225, -800, -1835, -1254, -686, -6497, 455, 2647, 9356, 7698, 9428, 9991, 5881, 3861, 2192, -1230, 1234, -7609, -10098, -12647, -11158, -8615, 1251, 3141, 3323, 3990, 10120, 9924, 9704, 4167, 2407, 8603, 19967, 32057, 39824, 43640, 38443, 25957, 17867, 17820, 17448, 12416, 8489, -3030, -13361, -10419, -5789, 2455, 2693, 3965, 1670, -1184, 639, 6310, 3278, 2081, 1906, 4013, 5334, -478, -932, 443, 9321, 7512, 1750, 5918, 14322, 13758, 13214, 10283, 12783, 15241, 14727, 13842, 21248, 32387, 45035, 40609, 32016, 26304, 20439, 11271, 6984, 10391, 15565, 15914]
8092A5914j800J944r586m585k018l553J676k319M389M104O018K113m023n158o224
8077c108k108j391Q102J581L28j38n996j973l157J0681M955K178j53J487l766
8062G522r499M1Q700J403l321k764P20k2o865J998J433O224L198P21r75L609O61
8045A2784l357J027L563R77Q478O501J156q92P398M191P818N00l801j395j802
8030D3146j674O842R315P441J586q818j1879J957K599j011N591j130m833q530
8016D0602q701o533P089Q575k862j791j091m549P00m692J568M130j781j957P91
8001B9498O868R533J2230R056J6290K5814K7989K3207J4448p715j7808j4538j293
7988A33579K221n351q766j307N100J3247K8224K6620l753k2183j9774j5526r399
$$ y = [15914, 14114, 16058, 6472, 1887, -131, -3684, -2008, -4327, 62, 4166, 10184, 12297, 8274, 3116, -3108, -5216, -6607, 1495, 3076, 3404, 3266, -2730, -4703, -7860, 2821, 7776, 9954, 9801, 11288, 7522, -1977, -1936, 6764, 8167, 4846, 2082, 2802, 2780, -4085, -2087, -654, 5570, 8768, 9489, 8514, 12123, 12784, 9427, 10454, 14017, 14994, 23472, 29973, 31129, 30237, 37635, 41826, 49644, 50144, 46343, 44948, 43146, 41472, 48314, 57629, 65070, 66656, 57838, 45959, 47916, 50515, 49504, 55095, 53965, 49132, 40602, 31901, 25368, 32457, 41032, 38170, 36379, 35288, 30739, 31439, 26747, 28315, 32445, 30664, 28707, 29498, 36366, 45899, 58129, 67185, 83475, 109289, 137278, 160485, 174933, 167218, 149410, 134872, 133579, 135800, 130449, 121683, 120376, 125476, 138723, 166947, 193567, 189814, 167631, 147857, 132331, 122932]
7975A22932j8109j5493n150j6553j4618n115m70k247j365P93l182J941M516K539
7961E0419J983K185p454m233M639P088J5024O205R549J5341J2375K0011J6473
7948A49605q36k277L06k525l295m026J1480J9279J7259J0801q501k3900j6048
7935A47322j0014p85o933j4329j2084j7428j6537p468r766j5498l586P008k518
7922C7384j1947n074J732O019K93N686O194n835l333k65K069j388L608J3129J1787
7907F0059N345J006p770M468P942m830j3920n983k329m583k664l972l825K559
7893C1503L238j109j1425m234M260J344m132K760k099r153R18O80o572N42m134
7878B387n729J406N318Q75O18j648R52m165m024o647R306K623k830m900r59L280
$$ y = [122932, 104823, 89330, 84180, 67627, 53009, 47894, 47424, 45177, 43812, 44605, 41423, 43364, 47880, 50419, 52402, 54587, 47133, 42900, 47539, 54627, 69651, 75856, 85405, 100746, 113121, 133132, 149605, 148769, 146492, 146798, 144273, 140978, 136952, 148432, 167711, 184970, 195771, 187270, 163370, 147322, 137308, 136523, 129590, 115261, 103177, 85749, 69212, 61744, 51978, 36480, 32894, 39902, 37384, 25437, 20363, 22095, 28114, 28407, 34093, 40287, 34452, 31119, 30854, 32923, 31535, 35143, 48272, 60059, 65404, 66410, 58640, 63108, 71050, 66220, 52300, 46317, 43988, 39405, 36741, 32769, 28944, 31503, 34741, 33632, 22207, 17973, 22233, 23577, 19445, 22205, 20106, 10953, 11871, 12551, 5979, 6521, 2387, -3342, -1936, 3382, 4257, 4875, 3227, 4179, 14, -4010, -10657, -1351, 1272, -1558, -6458, -7417, -4137]
7862d137L01J317k371L91K383L920K423K931m19m453R221M35j2093L977M591L954
7846A2371l200k614k408N5n588k802O528N592p528p230j445L998k257r4K580P230
7830C188j630m189l966M099j852R08K486K668K170O820m02j0080J109O285m48
7815G166J336j428M06o346l425M717L482k712n766K767m91o227k32M027k93N135
7799B116K323k92M837j854p358n097J149l07O516j08j692P18k19j385o960K321
7783e292N363j39l251o154J799K730K453J560K48m015l372L377M012L202l74j203
7767I44k347n081K317O818P289p100q474j657L058M719K932n500q99l248J730
7752d499M104J113L560k401K108o021n671L930O173L462m556k433K313k165o219
$$ y = [-4137, -3836, -2519, -4890, -4499, -2116, 1804, 4227, 7158, 6739, 2286, 11507, 11942, -151, 3826, 8417, 12371, 9171, 6557, 4149, 4204, -1384, -4186, 2342, 7934, 406, -6824, -8269, -4271, -6528, -6622, -4042, 3188, 1558, -2631, -6597, -2498, -4350, -3442, -956, 1712, 3882, 10702, 10300, 220, 1329, 7614, 7166, 8502, 7074, 7480, 1134, -2291, 2426, 5908, 3196, -2570, 197, -294, -6521, -6753, -2726, -3019, 2116, 4439, 4147, 8984, 7130, -228, -5325, -4176, -4483, 2033, 1925, 233, 951, 732, -653, -7613, -5292, 71, -68, -3319, -9473, -7674, -4944, -2491, -931, -683, -4698, -8070, -4693, -681, 2521, 2147, 944, -1403, -6484, -4167, 2651, 9940, 2840, -5634, -7291, -4233, 486, 3418, -2082, -2981, -6229, -4499, -395, 718, 4278, 1877, 3985, -2036, -7707, -3777, 2396, 5858, 1302, -1131, 1182, -983, -7202]
7737g202M728O050j627J303L216o545L247O082k261q537p467n22O88K07L202j583
7721g021l249L308J926L252L761j671m794L234M420l563K609K253K032n122l61
7706A014j499j72m870J611L279L125j927L555N39j831j1415m100M953N232M743
7691B237m174m227K244L911K733k333m148M957J828L97k88k614m398k450M43K382
7675c500K044K336J660m015K077l876L65Q29l33k284k52R20P84M594K39O07l00
7658A895m905L29M725M207k219K889o746j509p08P67p41J151K390P03K092J149
7642E469n39o302L110J939L95N086J068j0091j1281R02O004j43L612J503o04k225
7626b097K284l122o028k171L431L412J1350K275m746l850n030m546M264j714j806
$$ y = [-7202, -2474, 3576, 1949, 3252, 6468, -77, 3170, 9252, 6991, -1546, -9013, -9535, -8847, -8640, -5438, -7021, -10270, -6962, -5036, -1784, 1977, 306, -4488, -1254, 3166, -397, 2212, 4465, 6497, 1375, 1014, -485, -657, -5527, -3916, -637, 2488, 561, 4116, 4655, 2824, -8591, -12691, -7738, -2506, 2237, -1937, -6164, -3920, -9, 2724, 391, -3757, 1200, 3028, 3425, 3137, 523, -3875, -6325, -5882, -3500, -1456, 880, 2540, -1475, 602, -3274, -2909, -2080, -2413, -4697, -4949, -4029, -3245, 1349, 1588, 2195, 1895, -3010, -2681, 2044, 6251, 4032, 6921, 175, -1334, -2042, -1275, -2016, -865, 1525, 2228, 4320, 5469, 4930, -1372, 1738, 3677, 4072, 9158, 10226, 135, -11146, -10244, -4240, -4383, -771, 732, 128, -2097, 187, -2935, -8963, -11134, -7703, -4291, 7059, 9334, 4588, 738, -4292, -8838, -4574, -6288, -8094]
7611h094N94L680K851J989R12l194j431l462O056L467J023K11o754M26r10L514
7595H78K544K927M217N027m967l254O29Pl774K075k16k035N44k702r87j860R41
7578fj453m070j658L597p06l225M618P255O669l646P3Q054j176p693m940n102
7562c409K963K410L834l809K615k202N67l598k21L552J000O060l021m671l597
7547a527J960L355M82m084j11n99k678L05M815p629m397M212P013k508l443j188
7531f022n51m178J096L011n25j234J768j322K479q10K357N601K58k871l480j598
7515f021n87K161M694J041J47j708q56N238l248l172M200M017k81L148k857n518
7499C98k28o114N28M588J982N01O675J643q607k929J712o549j116J500l137O312
$$ y = [-8094, -7500, -3820, -969, 1020, 1932, -1262, -2693, -6155, -99, 3368, 4391, 4602, -2152, -1726, -2636, 878, 3422, 6349, 10566, 15593, 10626, 7372, 8001, 8008, 4234, 6309, 6093, 4058, 4602, 1900, 913, -947, -6, -1459, -5529, -7187, -3590, -4296, -7521, -2903, 4352, 11021, 7375, 7448, 15502, 14326, 6633, 1693, -3409, -446, 1964, 5798, 1989, 4604, 2402, 2969, -629, -850, 2702, 3702, 9762, 6741, 2070, -1527, 433, 3788, 4270, 186, 75, -524, -3202, -2897, 1918, -5711, -10108, -5896, 1117, -1391, -4834, -6022, -6573, -10751, -9655, -6644, -7169, -8403, -6635, -7957, -5478, -6288, -3931, 1670, 1928, -943, -4423, -6021, -6608, -4447, 247, 1288, 1435, -273, -1129, 4109, 861, -2311, 1889, 5906, 5625, 8773, 5916, 398, 170, -5944, -5416, -828, 1154, 1655, 8330, 9973, 1366, -1563, 149, -6400, -7516, -6016, -9153, -2841]
7483b841l107q68O682R162p643n693L853o17o315J077L10J038l218k866P263R190
7467E407M011l567p737J027M398k222o716r595M538L511l585J688J1812O588r632
7452g4p102k899j93O689K176P37L120j440J775k422l155j304K653n189m334m646
7436a5608J899J236J309J440O710N585K11l648q58J917k726M971K725n093p17
7421f47R106O357l1q900l021J672q758l835k46J428J044J234n97K249k302J642
7405c605M002j503M50J739m835K771N336m857o61L903J717O027L788J241o368
7390I145n855m123j99J688O70j733j808L834J66l416L065N750R02J071p859l365
7374b067j098O417o731q969K975M333L065L445l944k276j393j76j579J264n95
$$ y = [-2841, -5948, -6816, -134, 9028, 1385, -4308, -455, -1072, -7387, -6310, -6000, -4962, -8180, -11046, -3783, 5407, 9418, 5851, -1886, -859, 3539, 1317, -5399, -14994, -10456, -6945, -10530, -8842, 2970, 9558, -74, -7176, -10075, -10268, -3579, -1403, -666, 2454, 1014, 2789, 367, -2788, -4092, -1439, -6628, -10962, -15608, -13709, -12473, -11164, -9724, -3014, 2571, 2782, -866, -1724, 193, -2533, 2438, 5163, 70, -647, 8459, 14816, 14785, 5885, 2864, 4536, -4222, -8057, -8303, -6875, -5831, -4597, -5194, -2945, -5247, -3605, 397, -1106, -656, 1083, -3752, -981, 4355, -502, -1163, 2740, 4457, 10484, 14272, 15513, 9145, 3290, -833, -1032, 656, 1326, -407, -2215, 1619, 1785, -1631, 1434, 7184, 8086, 9157, 1298, -2067, -3165, 3252, -3479, -12448, -9473, -5140, -2075, 1370, -2574, -4850, -6243, -6419, -7998, -6734, -7329]
7359g329J254M188K764N446n647o148k160M058L724M651Q577K035q693j2571l352
7344i203Q145K561J062Q166l236q378j301O824O508l858k996O799P629q147n10
7329A0065Q393o582j0964n554m289k369M313J14j262K882J834k594o747J739L366
7314g655k176l82O149M737K925n282O128k354J124j403k161o122J606R188l109
7299A213P276O672n754p371K18L881J958o79O097p74o841n311m783j203J824Q640
7283E063K433k662j148l022L066M073M448m57n696j0249k840L845K097m657q415
7268a4121l702R89O836R737Q163j980r1j573j671L679j642K588j787r54p904o701
7252a0134n45K563M255M760L933P790j851k927J352n998k718m54m408L999P511
$$ y = [-7329, -6075, -1887, 877, 6323, 676, -5472, -7632, -3574, 150, 4801, 13378, 15413, 6720, -5851, -9203, -1058, 1503, 2565, 10731, 7495, -883, -2184, 4640, 11148, 7290, 4294, 11093, 18722, 10575, 10065, 18458, 11876, 912, -4642, -8931, -11300, -6987, -6873, -8135, -5253, -3419, -6013, -12760, -11021, -7655, -9831, -10213, -4064, 673, 3598, -1684, 4444, 2090, 3214, 1811, -350, -6472, -4866, 4322, 1213, 8489, 15161, 9407, 2036, 2254, 6135, 8093, 7414, 13511, 12737, 5896, 585, -4198, -5401, -3577, 5063, 7496, 4834, 3686, 664, 3730, 7803, 12251, 11794, 6098, -4151, -6991, -3146, -1049, -5706, -14121, -17823, -16834, -9998, -261, 7902, 5922, 5831, 4258, 2587, 6266, 4624, 7212, 5425, 4471, -3433, -10134, -10679, -8116, -3861, 899, 4832, 12622, 10771, 7844, 9196, 3198, 480, 26, -4382, -383, 7128]
7237G128J007m518M444m854n660r432k299R061J201j221K078J046K923j155m170
7222d421l529L400j021J133K176L201j714k191M58p32N468M238N20k175n491o442
7206g122o81O078M287l263j317m178J666o38k67N204K396o824l824K297R926N706
7190I446N125K199o946k208m701L06R03J93K790j508q179K273m106o387o78N223
7174f255l214m147O121M959K717j348n048m714J479J671M645L307K344n980r213
7159a2676L781N056K886j746M813J762o527M154N891N083J827n898m353m485l864
7144d296m163N815M027l746l257K304K355m748q42K116j458n343L795N828N660
7129D047J862L093l482l866n29M092K600r65P76l945j327j376M673J667P92k398
$$ y = [7128, 8135, 3617, 8061, 3207, -2453, -11885, -14184, -5123, -3922, -5143, -3065, -2019, 904, -251, -4421, -7950, -4550, -5571, -4438, -2262, 939, -775, -2966, -2508, -3240, 2228, 6466, 6986, 4811, -680, -7122, -7803, -1725, 2562, -701, -2018, -6196, -4530, -5168, -5435, -231, 2165, -4659, -8483, -6186, 3740, 9446, 14571, 16770, 9824, 7616, 2915, 3221, 4124, 4317, 7107, 5599, -2580, -307, -4413, -10800, -11478, -6255, -9469, -13616, -7495, -2536, 181, -1167, -6215, -10929, -9450, -7779, -3134, 173, 2517, -3463, -12676, -8895, -3839, -953, -2699, 2114, 3876, -2651, 1503, 7394, 12477, 14304, 8406, 4053, -432, -4296, -8459, -2644, 1383, -2363, -5620, -3316, -961, -5709, -6551, -4435, -5893, -11236, -7441, -1613, 4047, 5909, 9002, 5520, 1654, 1125, 5217, 7817, 6852, 7628, 3683, 2356, 980, 5653, 7320, 8112, 5714]
7113E714r81n074J761P556m97N200O83q748m551k425l34O425K006K30o029k110
7097a174j528n430N948J393p23o845J75K386j999q14m105L397O691o2P979K583
7081G872p957k008K615J943l981K099L612q279K830Q097J239q616K009J413p104
7066d216n82Q805k102M56M890J380m835K47M150M188m624q977p239J719N156O135
7050D551k863m770K71L1N112n677o356p706l73J835L884L654K214r05J45M185
7034b768K200l008J380o749l809O644Q02K467M198l283l969k762O227J265K482
7019A317K486p093N353k878j668L251P86o206J43j624j918N01N200k362o44J462
7003c894Q21l52J46J047L562J0331Q151J492j0235j0902p18M433M46l704j219
$$ y = [5714, 4733, -341, 1420, 8976, 8479, 13679, 14362, 5614, 1063, -1362, -1696, 4729, 6735, 6965, 936, -1174, -2702, -8132, -2184, -791, -1514, -8359, -8184, -5798, -7797, -8611, -12716, -9319, -2628, -2690, 5289, 7872, -85, -2093, 522, 2465, -1516, 583, 4195, -4084, -1254, 6843, 8082, -534, 1475, 2888, -4216, -4798, 4007, 1905, 2361, 7251, 8631, 3796, 4043, 8193, 12381, 7757, -1220, -8459, -6740, -1584, 4551, 1688, -3082, -2811, -2780, 2332, -3345, -9701, -17407, -17780, -15945, -12061, -8407, -6193, -7098, -6953, -2768, -568, -3576, -2196, -8945, -12754, -6110, -5308, -2841, 1357, -1926, -5895, -8657, -2430, -1165, 1317, 3803, -3290, 2063, -815, -2483, 768, 1554, -4652, -4509, -6133, -8051, -7550, -2350, -4712, -5356, -3894, -3073, -3425, -3279, -2232, 1330, 11661, 19812, 21304, 11069, 167, -551, 3882, 4328, 624, -595]
6988e95r26l460K426O72l55o13L663J694J818J715m876p077k551O864P933R51
6972G283K63n593j1911k631N097J608j97k259l173L067Q757K937N050k412J913
6957G799L092J211j4112n920O183Q721K582n957p956k562M891Q37L297M521L609
6942A0236n276n402J015L184J518L20J646q014n770j01O622P64j036r46L734J314
6926C808q09M48k200m892o255M976n81J528L16O91J006Q88K855n274n733q89R924
6909a93R034l766l337q044r116M639O169K637k247O188N357L903K985l662j0006
6894E41Q4O02j239l631k249p039O738L952j697L841N415n201K2P116J007L528
6878A1790m875l005n381m713L7K054o305L424M170L39o570J948O558K899q384
$$ y = [-595, -1521, -4981, -2555, -1883, -2238, -2851, 812, 2506, 4324, 6039, 1163, -5914, -8465, -1601, 6332, 7283, 7546, 1953, -9958, -12589, -7492, -5884, -6081, -8340, -11513, -8446, 311, 3248, 8298, 5886, 7799, 10891, 12102, -2010, -7930, -1747, 6974, 9556, 3599, -4357, -6919, -2028, -1191, 2106, 6627, 10236, 4960, -442, 573, 3757, 5275, 5595, 7241, -773, -6543, -6644, -22, 742, -294, -1240, 2494, 3808, 2999, 3447, 1247, -3645, -9900, -4924, -5505, -3977, -3661, -2970, -1964, -1076, 1779, -3495, -9228, -10117, -193, 8841, 5075, 1738, -6306, -15422, -10783, -4614, -1977, -4224, 1964, 7321, 11224, 14209, 10547, 541, 625, 1227, -12, -3643, -5892, -12931, -6193, -2241, -3938, -97, 5318, 117, 139, 7255, 8262, 11790, 6915, 3910, -1471, -6184, -6147, -4093, -10398, -6974, -2804, -2465, -9035, -7087, -529, 2370, -6014]
6863f014L946L794k450j324j47J52p65O627J850m301r068j0305m747J2244M779
6848e729K553M853m219j912K464J572R51J758L5M374Q93l833k585J735l168K830
6832B572J1887K978o575p011N57O820M42p812q1M070k206o486k78p778l411L341
6816h971l066k559N878N035j807p366M918P970K316J288N79J350J170k814o983
6801c062q83n45J568N622K644q522P36N555O698o211n567M763J585m191l642m741
6785h193M284P891l914m980K806N182m943n362M95J785O19J557k431m141M433
6770d912R082O269j723l039N318K953m468n080j0171L68j943j391k277J345N336
6755d333M938L875K933r80k580M425M073L695K620j693q172L904Q677p1n757k088
$$ y = [-6014, -2068, 1726, -724, -2048, -2195, -2043, -2808, 3819, 5669, 1368, -7700, -18005, -22752, -10508, -5729, -3176, 1677, -2542, -4454, -1990, -418, 533, 2291, 2326, 6700, 7593, 3760, 1175, 2910, -258, 2572, 14459, 17437, 10862, 3851, 4408, 11228, 11670, 3858, 3777, 7847, 5641, -845, -1123, -8901, -12312, -8971, -12037, -14596, -8718, -3683, -5490, -12856, -7938, 32, 2348, 3636, 4215, 5565, 6735, 3921, -3062, -3945, -4490, -2922, 2700, 5344, -3178, -2442, 3113, 9811, 3600, -1967, 2796, 4381, 190, -3452, -8193, -3909, 3982, 68, -4912, -2106, 3076, -1867, -7229, -6734, -4949, -4330, -2773, -5204, -9345, -4912, 4170, 10439, 8716, 5677, 10995, 13948, 9480, 4400, -5771, -5403, -7346, -8737, -11014, -9669, -4333, 605, 4480, 7413, 6433, 3853, 8278, 12351, 16046, 18666, 16973, 8801, 12705, 21382, 21311, 15554, 13466]
6739A3466J240P36k225j031j441k173l620p908N48O5j643k873O002M466j809M050
6723E850N48p38Q14n893o866j473J422P0K555J039M575k28n23K895k436k497n673
6706f559L624Q102p44m040K228L134K338M7o082l713L690m801l077k626L867k070
6690f682M043M635P763J092k950l825j408P181p45l711L237O86p099n553j162
6675d498J015p37j885L965N016L277p593l422p09M78M136j283l922p076n653L292
6659a5599O658P748p85j943J023j888J47k697o55P422N906l664K725J033k262
6644C169k31R93L190m863n216k508k466l293n265K390Q838M203L936J855l006
6629A726K068J18K184j0330l111M547K011M23N194N712q62k33j0554q605k094
$$ y = [13466, 14706, 15442, 13217, 12186, 10745, 8572, 4952, -2956, -2408, -2343, -3986, -6859, -857, 3609, 1800, 5850, 6398, 5660, 6474, 581, -6285, -7758, -6336, -6266, -3711, -2672, 1903, 1675, 1152, 4047, 1611, -886, -6559, -2935, 5167, 4423, 383, 2611, 5745, 8083, 8130, 2048, -1665, 2025, -2776, -5853, -8479, -4612, -6682, -2639, 1996, 9759, 10851, 7901, 4076, 2668, 9849, 9104, 5393, 8630, 9316, 2217, -3336, -4498, -3483, -4220, -6105, -2140, 2876, 6153, -1440, -4862, -5571, -5093, -957, -2240, -6162, -13238, -18891, -15599, -8941, -1193, -1978, -3921, -2898, -4786, -4639, -7336, -7991, -569, 5337, 1673, 4398, 5431, 3169, 2938, 3931, 7121, 2258, -2958, -5466, -7932, -11225, -16490, -14100, -5262, -1059, 2877, 4732, 1726, 3794, 3912, 6096, -4234, -7345, -2798, -787, -364, 4830, 10542, 9680, 9447, -1107, -9712, -11806]
6614a1806K7J598O807L291L851K559J576l604j762M611k594l265J363L380L182
6599I214M133M597m225p025l285m164m209J966N535k625j938J339j171N61m71
6584a768o315N211Q861O85l549l436m517k260L41K651l16k448J449n95K624L61
6568c021N238M12j994N62K395L96o735J284J746K343M982q07N33m884o182j49
6552c881K458M933j832j200K002J111j372l946n184l557m132l52k242r77R793
6537h378Q492Q66K523K017m598n595k627k864N582P246L349m053l395J274k157
6522b318l667K341k700n153O027J800K74o61J410N627M427L889K012m914m754
6507C640p508o47j141O78l431P211J490m579l322J712O064R108j015N24L842o472
$$ y = [-11806, -11779, -10181, -3374, -83, 3768, 6327, 7903, 4299, 2537, 7148, 4554, 1289, 2652, 6032, 9214, 13347, 17944, 13719, 6694, 3409, -755, -4964, -2998, 2537, -88, -2026, -687, -1858, -1297, -1768, -8083, -2872, 5989, 6674, 3125, -311, -4828, -7088, -6747, -4096, -4412, -6860, -5411, -6006, -3382, -3021, 2217, 2629, 635, 1197, 3592, 3988, -2747, -1463, 283, 2626, 7608, 6801, 7334, 2450, -3732, -3881, -1423, 3510, 1678, 478, 2480, 3591, 2219, -1727, -6911, -10468, -14600, -14952, -17194, -18171, -8378, 114, 980, 3503, 5520, 922, -4673, -7300, -10164, -4582, 2664, 6013, 1960, -1435, -161, -2318, -5985, -3644, -6344, -11497, -5470, -3670, -3396, -4057, -2647, 2980, 7407, 11296, 13308, 8394, 3640, -3868, -4515, -5656, -4978, -8409, -1198, 292, -4287, -7609, -5897, 167, 9275, 8260, 8784, 12626, 6154]
6491F154p605l05J232P63r1L745j123m517K25O682N930k466l606p086r795k298
6475a4161J844O238L187k819l273L194j09k569L059J170n95l647L395m04N157
6460c33J282K051J208k392j182O150l696o892j597L966K383Q296j730Q18l798
6445D534n681O476L660l961m596j615k1J443J006N84k626M217l932k676K095j13
6429a206j893K799K867L661m54j730j032J02L357k392K162m780n712m563O260
6414b554P458J852J844m965o082K085L327K92l096j478R03K306m882L92N291P70
6398C463n34n888r93J308J611m051J029N256N095k545j759l509K874K047R47k629
6382A722j410l444p26N58l108N487J472j0533l116k409J0044R041p752J143L306
$$ y = [6154, -1451, -1756, -524, 239, 148, 3893, 2770, -1747, -1522, 5160, 11090, 8624, 5018, -2068, -11863, -14161, -12317, -6079, -2892, -5711, -8984, -5790, -5899, -8468, -5409, -4239, -4834, -8481, -5086, -5490, -333, 949, 3000, 4208, 1816, 634, 6784, 3088, -3804, -5401, -1435, 948, 9244, 7514, 8332, 4534, -1147, 5329, 8989, 5028, 432, -1183, -1204, 239, 1245, 1829, -797, 3420, -512, -3188, -1093, -1206, -3099, -300, 2567, 6228, 5774, 4044, 3012, 3114, 6471, 4079, 6241, 1461, -4251, -8814, -2554, 4904, 6756, 8600, 3635, -2447, -362, 2965, 3257, 161, -1317, -414, 1892, -2990, -2598, 2693, 3463, 2929, -2959, -3952, -2644, -1033, -5084, -4055, 1201, 6296, 3751, 1992, -1517, 1357, 3404, 4351, 1722, 312, -3132, -3858, -3300, -6408, -921, 551, -9982, -13098, -15507, -5463, 3578, -4174, -3031, 275]
6367B75K168q80l63P49n14k574N76M012r28p369J332M889p464k395L699l341l801
6350a1929n83j011R36k194L663N923Lm133K743O361N730K838r54j551N643M702
6334A6187j159L169J157m874r366n606q760j377Q80N888N334O72j174m579k422
6319f030j542L094L577k648K065J1802j958j492o306L665m93k202J583m864k644
6304d393Q76n953j025O941Q885M373p580m871k062J150q20k371n87r2K549j653
6288f633L526M193p64o440j462P156Q88r06J904J127o634o033R10l173N583Q307
6272A549k63k748j822k488R356J725j707J226j342k47L255o16k519l499L292L175
6256F327P660m555j509m69q548j590j686J804J267o31O90J075j16K43j52M747
$$ y = [275, 2443, 1563, 1200, 1949, 1435, -1139, -563, 3449, 2521, -4848, -3516, 1373, -6091, -8486, -4787, -8128, -11929, -12512, -13523, -12587, -14781, -11118, -5195, -5192, -9325, -6582, -221, 5509, 8347, 7393, 5842, 11485, 16187, 15028, 18197, 19354, 14480, 5114, -492, -9252, -10629, -9749, -3861, 1473, 2145, 971, -3608, -6030, -7572, -4478, -901, -3549, -1484, 10318, 8360, 6868, 562, 4227, 3734, 1532, 3115, -1749, -4393, -3517, -9470, -10495, -3554, 5331, 9704, 2124, -2747, -4809, -3659, -4479, -6850, -7437, -7529, -4980, -6633, -3107, 1086, 322, -6118, -7580, -424, 464, -442, 1462, 2589, -4045, -10078, -9168, -12341, -6758, 1549, 1286, -1462, -3284, -5772, 3584, 5309, 3602, 4828, 3486, 3239, 6494, 5878, 3359, -140, 3152, 6327, 13987, 9432, 7923, 7454, -1094, -2684, -4370, -2566, -1299, -1930, -1240, -165, -281, -38, -190, 4557]
6240D557l479j1060l49R534K400k835K48O78L70R04J649l347L264Q89l383k367
6224b327K462J964j991m286n324j049L981L286M903q36L345k912l187N669K635
6209F333k749L2K702R67l975N95J133L762p73m669R77K85l782K015O325k681R21
6192G418M275k75j159m67j106m118K63l212n550l01P01n49k121J906K48K695L087
6175A735J085n648n500J211l49M346j879j270J0270R644K367o234m65P47n216
6160D844o842L67J8J292J827M630k492l141K856M125p553l171N447k435j317K519
6144I74J197M92L745K623r66J57q085o906k406K99J635j35l42Q934K031k134o52
6127D61J491k286q684j996K658K152N406N248p20m115j1014q205q07L211Q695
$$ y = [4557, 1078, -9982, -10331, -797, 1603, -1232, -984, -306, 64, 968, 2617, -730, 2534, 3423, 40, -2327, 135, 2099, 108, -4178, -9502, -10551, -6570, -3284, 1619, 783, 4128, 1216, -1971, 3698, 6333, 3584, 3616, 6318, 7285, 3310, 3905, 5038, 8800, 8027, 3358, 4335, 4620, 838, 2853, 9178, 6497, 7418, 11693, 11418, 10259, 9792, 8686, 4568, 4831, 1619, -3931, -4232, -3531, -4080, -6201, -4295, -4047, -1352, 1735, 2820, -2828, -8328, -7117, -7466, -3120, -4999, -6269, 4001, 13645, 16012, 9778, 9313, 10060, 4844, -1998, -1631, -1613, -321, 1506, 6136, 3644, 503, 3359, 7484, -69, -3240, 2207, -228, -1545, 974, 2171, 2663, 6408, 9031, 8065, 8222, 137, -6769, -9175, -8876, -7241, -7376, -7718, 1216, 3247, 1113, 461, 1952, -334, -9018, -11014, -8356, -6204, -798, 4450, 3730, -385, -11399, -19604, -20411, -17200, -8505]
6112h505M213K21J999L496M56l053j660m621j994J737J757n359L756Q264L368
6097D075n202m909k725M12M552M265N208k781Q64l825M187L28K74L118K32NK834
6080A0912M4R91m889J707l167n017j262k075l913L211R75K80M664R84P98m918
6064f75m267K28j704M630K950j382p57q50l11k069j506M454j86m46N22K628N717
6047F976L210l827p337n797l882L7j548O410M991l662N208n4l125o086N710N376
6031B600j554N210q83j0229n365Q54Q038L060o606L364l20J245k110j800K955
6016a541l308k189M511J574l060n441L25Q47R814O408l499q106J48J858K187O103
6000F631r039o925K228L281M644n647R6j965L879o152k098J0286N353l658k569
$$ y = [-8505, -4292, -4071, -2072, 1424, 1880, -1173, -2833, -7454, -9448, -7711, -5954, -11313, -7557, 707, 4075, -1127, -6036, -8761, -8349, -3797, 468, 5676, 2895, 3759, -66, 4121, 4449, 4723, 7841, 8073, 8078, 10912, 10956, 11947, 7058, 8765, 5598, 581, -681, -2756, -6669, -3458, -2483, -2203, 2461, 3445, 4243, -675, -4942, -4714, -6418, -1788, 1162, -220, -977, -1827, -2138, -4207, -5713, -1259, -1445, -1891, -1369, 1259, 6976, 10186, 6359, -978, -6775, -10657, -10620, -12168, -5758, -767, -4429, 779, 725, -2400, -8486, -2776, 2600, 1046, 6256, 5373, -4856, -10221, -9367, -1329, 1731, -4875, -1511, -1831, -586, -2696, -4496, -1541, -4849, -7038, -2527, -953, -4013, -9454, -9129, -8282, 1532, 7940, 4441, -3665, -3517, -1659, 528, 6631, -2408, -9333, -7105, -3824, 820, -4827, -4731, -6696, -2817, -8969, -11067, -781, 4572, 914, -1655]
5985a655k094M65J891M305n050k153M20m571K5L813k963L274L065k316j174N2
5969d666j390R537J107N229J562l738l362j91k489K78J473l174n682l315J286
5954g535L186r31J255N302r27l241k145k058J325P34m713L307J3569N565k474
5939A0219m228r34M80L188K375k061r406m005K953J544K960j298n571m715l600
5924a2099M358L138K860J845o41p692K401R082N986n423p224r168q61L573K869
5909f996K77Q174M861K590o472o450l367O225k068n39J1061R99o587o822o327
5894a1441l347L700k445J66O212L288J609l138M82N587K31M543J364k014j644
5879C153n276m240J579J194L689J998m364J223L048j0501j71L690P569n847p761
$$ y = [-1655, -3749, -3284, -1393, 2912, -2138, -4291, -3871, -8442, -8417, -4604, -7567, -4293, -1228, -3544, -4718, -4666, -6056, 3481, 4588, 9817, 11379, 7641, 4279, 4088, 1599, 1877, 3350, 176, -5506, -8821, -7535, -4349, -5280, -4025, 1277, 350, -2891, -5036, -7094, -5769, -5035, -9748, -6441, 7128, 12693, 10219, 5991, 5057, 5537, 8725, 11100, 9039, -367, -4372, -1419, 125, 3085, 1787, -3784, -8499, -12099, -7741, -4603, -1743, 102, -539, -8231, -5830, 3252, 9238, 3815, -3409, -12577, -13438, -9865, -6996, -6719, 1455, 6316, 8906, 2434, -4016, -7383, -1158, -3226, -3765, 7296, 8295, 1708, -5114, -11441, -14788, -11088, -13533, -13367, -7155, -3867, -2258, -5396, -4914, 673, 904, 5447, 6811, 4797, 3153, -2123, -6363, -4784, -3590, 99, 2097, -2267, -1044, 2004, -8497, -8668, -4978, 2591, -3256, -11017]
5864a1017K711o373O485P187J50K692j678K96p61l521J888O003m201k318L866
5849A409P42j614O55M241m160n999l557N8J0095m32r679M150J013k830o278j031
5833a3217J01P99l02K339N837M298r134j986M979P486K650n394l22r07L962j005
5817A84n821J915j86J506q330P36K973L83J692j364j143N452k374m239K489M363
5801a764K388k899K870o6p690q184o139K892J0092M834N685l589J154L756q675
5786e335m645N574R25n51K126j614K162M981p759l908k071p88M461N126k313l20
5770c949k828m350n92L025K851N834M73N53K610l624j096Q728r58m717n747p184
5754a0971M561P178j061j782J03j507N08m763k984L81L890J463k917k281J764
$$ y = [-11017, -8306, -14679, -8194, -1007, -857, 1835, 157, 453, -308, -3829, -1941, 4062, -139, -2457, 1409, 2151, 537, 1192, 5433, 1273, -4726, -8283, -8225, 1870, 1438, -8241, -4091, -3078, -5908, -12186, -13217, -13116, -12317, -12619, -10280, -4443, -145, -9279, -11265, -6286, 1200, 3850, -1544, -1866, -2773, 1189, 184, -5637, -3722, -3908, -2402, -10732, -9996, -7023, -6640, -4948, -6312, -7455, -2003, -4377, -8616, -6127, -1764, 624, -2275, 595, 529, -7161, -15345, -21484, -18592, -8500, -3666, 2019, -1570, -416, 3340, -5335, -9980, -4406, -3481, -4032, -1906, -3520, -1358, 3623, -4136, -8044, -10115, -10903, -6442, -1316, -3629, -3949, -6777, -11127, -11719, -8694, -5843, -9, 464, 1017, 3627, 3, -1093, 7635, 6677, 1960, -3787, -10971, -6410, 768, -293, -2075, -1972, -3479, -2971, -7734, -10718, -10337, -6447, -4984, -7901, -10182, -8418]
5739h418M586j163K022L420k513k063p71p812J958K203l578K931J0591J886l434
5724a55j579l761j110L962L718m78J195p78j983q5j772l80J644J680M276K734
5708G128p097k452L68L430N311K122K624L110m518n602k850p24m386M79L434J39
5692E16L693K958m548k579m982K794r4m590n064Q64P461N095M428P73k875j533
$$ y = [-8418, -3832, -4995, -2973, 447, -2066, -4129, -4900, -12712, -10754, -8551, -12129, -9198, 1393, 3279, -155, -1734, -5495, -6605, -2643, 1075, 597, 1792, 1014, -969, -1054, -2826, -3206, -1562, 118, 4394, 7128, 31, -2421, -2053, 1377, 6688, 8810, 11434, 14544, 10026, 4424, 1574, 850, -3536, -3057, 377, 516, 4209, 7167, 2619, 40, -4942, -2148, -2242, -6832, -11896, -11032, -3571, 1524, 5952, 6725, 3850, 2317]
$$ [...]
##END NTUPLES=NMR SPECTRUM
##END=
