##TITLE=Analysis number 315558
Compound Code gk 02499
Project Code adrs
Chemist Name durham
##JCAMPDX= 6.0         $$ Bruker NMR JCAMP-DX V2.0
##DATA TYPE= NMR SPECTRUM
##DATA CLASS= NTUPLES
##ORIGIN= Bruker BioSpin GmbH
##OWNER= NMR
$$ XWIN-NMR		Version 3.5
$$ Wed Nov 23 14:39:42 2005 GMT Standard Time (UT+0h)  MAYBRIDGE\NMR@NMR_250MHZ
##.OBSERVE FREQUENCY= 250.131544655141
##.OBSERVE NUCLEUS= ^1H
##.ACQUISITION MODE= SIMULTANEOUS (DQD)
##.ACQUISITION SCHEME= undefined
##.AVERAGES= 16
##.DIGITISER RES= 18
##SPECTROMETER/DATA SYSTEM= dpx250
##.PULSE SEQUENCE= zg30
##.SOLVENT NAME= CDCl3
##.SHIFT REFERENCE= (INTERNAL, CDCl3, 0, 16.522)
##AUDIT TRAIL= $$ (NUMBER, WHEN, WHO, WHERE, WHAT)
$$ ##TITLE= Audit trail, XWIN-NMR		Version 3.5
$$ ##JCAMPDX= 5.01
$$ ##ORIGIN= Bruker BioSpin GmbH
$$ ##OWNER= NMR
$$ C:\u/data/dgb/nmr/ADRS/12910/pdata/1/auditp.txt
$$ ##AUDIT TRAIL=  $$ (NUMBER, WHEN, WHO, WHERE, WHAT)
(   1,<2005-11-23 14:39:08.82 +000>,<MAYBRIDGE\NMR>,<NMR_250MHZ>,
      <created by zg, POWCHK disabled, PULCHK disabled
       configuration hash MD5:
       62 19 C7 07 E1 42 D1 B7 37 6C 3D D0 77 39 F9 E6
       data hash MD5: 64K
       67 E1 59 80 40 58 37 34 68 12 68 3D AC 46 8F E9>)
(   2,<2005-11-23 14:39:24.32 +000>,<MAYBRIDGE\NMR>,<NMR_250MHZ>,
      <Start of raw data processing
       ef LB = 0.3 FT_mod = 6 PKNL = 1 SI = 32K 
       data hash MD5: 32K
       80 D6 26 DD FE 7B F7 6B 79 7A C8 BB 11 07 37 DC>)
(   3,<2005-11-23 14:39:27.73 +000>,<MAYBRIDGE\NMR>,<NMR_250MHZ>,
      <apk 
       data hash MD5: 32K
       AE 1D 96 7A CE E9 88 CD 6A CB F1 EE 18 F8 55 EC>)
(   4,<2005-11-23 14:39:29.15 +000>,<MAYBRIDGE\NMR>,<NMR_250MHZ>,
      <abs ABSG = 5 
       data hash MD5: 32K
       BC 8A 59 0A 42 51 94 AC 1D A0 1D 74 FD 13 0C E7>)
$$ ##END=
$$ 
$$ hash MD5
$$ 00 50 4E C5 40 3B 4B 1F 24 B8 AA 09 6C 01 FC DB
##$RELAX= 
##$RELAX= 
##$RELAX= 
##$RELAX= 
##$RELAX= 
##$RELAX= 
##$RELAX= 
$$ Bruker specific parameters
$$ --------------------------
##$DU= <C:\u>
##$EXPNO= 12910
##$NAME= <ADRS>
##$PROCNO= 1
##$TYPE= <nmr>
##$USER= <dgb>
##$AMP= (0..31)
100 100 100 100 100 100 100 100 100 100 100 100 100 100 100 100 100 100 
100 100 100 100 100 100 100 100 100 100 100 100 100 100 
##$AQSEQ= 0
##$AQ_mod= 3
##$AUNM= <au_zg>
##$AUTOPOS= <37 >
##$BF1= 250.13
##$BF2= 250.13
##$BF3= 250.13
##$BF4= 250.13
##$BF5= 500.13
##$BF6= 500.13
##$BF7= 500.13
##$BF8= 500.13
##$BYTORDA= 1
##$CFDGTYP= 0
##$CFRGTYP= 5
##$CHEMSTR= <none>
##$CNST= (0..31)
1 1 145 1 1 1 1 1 1 1 1 1 1 1 1 1 1 1 1 1 1 1 1 1 1 1 1 1 1 1 1 1 
##$CPDPRG= <>
##$CPDPRG1= <>
##$CPDPRG2= <>
##$CPDPRG3= <>
##$CPDPRG4= <mlev>
##$CPDPRG5= <mlev>
##$CPDPRG6= <mlev>
##$CPDPRG7= <mlev>
##$CPDPRG8= <mlev>
##$CPDPRGB= <>
##$CPDPRGT= <>
##$D= (0..31)
0 1 0 0 0 0 0 0 0 0.06 0 0 0 0 0 0 0.0002 0 0 0 0 0 0 0 0 0 0 0 0 0 0 
0 
##$DATE= 1132756747
##$DBL= (0..7)
120 120 120 120 120 120 120 120 
##$DBP= (0..7)
150 150 150 150 150 150 150 150 
##$DBP07= 0
##$DBPNAM0= <>
##$DBPNAM1= <>
##$DBPNAM2= <>
$$ [...]
##$SUBNAM7= <"">
##$SUBNAM8= <"">
##$SUBNAM9= <"">
##$SW= 20.6930455092707
##$SWIBOX= (0..15)
0 0 3 0 0 0 0 0 0 0 0 0 0 0 0 0 
##$SW_h= 5175.983436853
##$TD= 65536
##$TD0= 1
##$TE= 294.16
##$TE2= 300
##$TE3= 300
##$TEG= 300
##$TL= (0..7)
0 120 120 120 120 120 120 120 
##$TP= (0..7)
150 150 150 150 150 150 150 150 
##$TP07= 0
##$TPNAME0= <>
##$TPNAME1= <>
##$TPNAME2= <>
##$TPNAME3= <>
##$TPNAME4= <>
##$TPNAME5= <>
##$TPNAME6= <>
##$TPNAME7= <>
##$TPOAL= (0..7)
0.5 0.5 0.5 0.5 0.5 0.5 0.5 0.5 
##$TPOFFS= (0..7)
0 0 0 0 0 0 0 0 
##$TUNHIN= 0
##$TUNHOUT= 0
##$TUNXOUT= 0
##$USERA1= <user>
##$USERA2= <user>
##$USERA3= <user>
##$USERA4= <user>
##$USERA5= <user>
##$V9= 5
##$VALIST= <valist>
##$VCLIST= <CCCCCCCCCCCCCCC>
##$VD= 0
##$VDLIST= <DDDDDDDDDDDDDDD>
##$VPLIST= <PPPPPPPPPPPPPPP>
##$VTLIST= <TTTTTTTTTTTTTTT>
##$WBST= 1024
##$WBSW= 4
##$XGAIN= (0..3)
0 0 0 0 
##$XL= 0
##$YL= 0
##$YMAX_a= 621223
##$YMIN_a= -554439
##$ZGOPTNS= <>
##$ZL1= 120
##$ZL2= 120
##$ZL3= 120
##$ZL4= 120
##$ABSF1= 16.522
##$ABSF2= -4.171173
##$ABSG= 5
##$ABSL= 3
##$ALPHA= 0
##$AQORDER= 0
##$ASSFAC= 0
##$ASSFACI= 0
##$ASSFACX= 0
##$ASSWID= 0
##$AUNMP= <proc_1d>
##$AZFE= 0.1
##$AZFW= 0.1
##$BCFW= 0
##$BC_mod= 0
##$BYTORDP= 0
##$COROFFS= 0
##$CY= 12.5
##$DATMOD= 1
##$DC= 0
##$DFILT= <>
##$DTYPP= 0
##$F1P= 14.0000005364418
##$F2P= -0.99999901652339
##$FCOR= 0.5
##$FTSIZE= 32768
##$FT_mod= 6
##$GAMMA= 0
##$GB= 0
##$INTBC= 1
##$INTSCL= 1
##$ISEN= 128
##$LB= 0.3
##$LEV0= 0
##$LPBIN= 0
##$MAXI= 10000
##$MC2= 0
##$MEAN= 0
##$ME_mod= 0
##$MI= 0
##$NCOEF= 0
##$NC_proc= -2
##$NLEV= 6
##$NOISF1= 0
##$NOISF2= 0
##$NSP= 0
##$NTH_PI= 0
##$NZP= 0
##$OFFSET= 16.522
##$PC= 1
##$PHC0= 80.93176
##$PHC1= 8.128841
##$PH_mod= 1
##$PKNL= yes
##$PPARMOD= 0
##$PSCAL= 4
##$PSIGN= 0
##$REVERSE= no
##$SF= 250.13
##$SI= 32768
##$SIGF1= 0
##$SIGF2= 0
##$SINO= 400
##$SIOLD= 32768
##$SREGLST= <1H.CDCl3>
##$SSB= 0
##$STSI= 32768
##$STSR= 0
##$SW_p= 5175.98343685301
##$SYMM= 0
##$S_DEV= 0
##$TDeff= 65536
##$TDoff= 0
##$TI= <Analysis number 999999
Compound Code 99
Book Reference 9
Project Code 9>
##$TILT= no
##$TM1= 0
##$TM2= 0
##$TOPLEV= 0
##$USERP1= <user>
##$USERP2= <user>
##$USERP3= <user>
##$USERP4= <user>
##$USERP5= <user>
##$WDW= 1
##$XDIM= 32768
##$YMAX_p= 525626123
##$YMIN_p= -380722
$$ End of Bruker specific parameters
$$ ---------------------------------
##NTUPLES= NMR SPECTRUM
##VAR_NAME=  FREQUENCY,     SPECTRUM/REAL,   SPECTRUM/IMAG
##SYMBOL=    X,             R,               I
##VAR_TYPE=  INDEPENDENT,   DEPENDENT,       DEPENDENT
##VAR_FORM=  AFFN,          ASDF,            ASDF
##VAR_DIM=   32768,         32768,           32768
##UNITS=     HZ,            ARBITRARY UNITS, ARBITRARY UNITS
##FACTOR=    0.157963299565203, 1,           1
##FIRST=     4132.6476996994, 0,             0
##LAST=      -1043.33573715361, 0,           0
##MIN=       -1043.33573715361, -380722,     0
##MAX=       4132.6476996994, 525626123,     0
$$ Real data points
##PAGE= N=1
##DATA TABLE= (X++(R..R)), XYDATA
$$ [...]
19400c470P232q228j540L173N849N522m536r289j108L94m234N340J2901O930L989
19385A8925o688r496Q343R180r914M70L082J65j7555j89P925l706J2111R242L477
19370B5372M238j0188j3764N545P231j082j6288j5498m321M704k015L690J4708
19357B332P279J0328p234j2495r78M484L285o81j435O60J125R678J1373j3544
19343A4177q917L798R653l901j367p028j284R785k18k331J705L800K183j897j2765
19328E393j8667N622O426k526O277o118r577J4300R756L622j4450p524J2980J184
19314F698p413J8455J7744l549j8057q050R605M45o507l280L424K529j703j5069
19300d728q428P233j7969J4959P115J2556P953J574M231r257l265Q984q141P360
$$ y = [-3470, 3762, -4466, -6006, -2833, 3016, 8538, 4002, -5287, -6395, -6001, -10235, -4895, 8006, 14936, 18925, 12237, 2741, 11084, 20264, 10350, 10820, 13902, 14067, -3488, -3677, 4248, 542, 12653, 21895, 25372, 29610, 19422, 5658, 11203, 18434, 17352, 1064, -14434, -18755, -14051, -16066, -12376, 2332, 9611, 19939, 12705, 210, -768, 3716, 7001, 6320, 4885, 5545, 6670, 16348, 27721, 14177, 5260, 9058, 18711, 14810, 13443, 6415, 5131, 14916, 14698, 12367, 14072, 17872, 20055, 18158, 5393, -13274, -7652, -1226, -3752, 2525, -3593, -13170, 1130, 10886, 14508, 58, -7466, 5514, 6698, -715, 17740, 35484, 31935, 13878, 5828, 15433, 15878, 9371, 6091, 9515, 12044, 10341, -4728, -13156, -5923, -23892, -8933, -1818, 10738, 18691, 20265, 24496, 15239, 11974, 20958, 12817, 20177]
19286B0177J2253j4674k6139o618J2561k388K193L688K928l651Q87o86J254K597
19272D382l362j2306j2320k403J3635P227M097j4404n400P552Q772K904P686M692
19258A0752r400j071P833m348J2617J0028j661R389L140l84j0649q899p136j1090
19244h79R22j426M986n77o191n900j6451q05J3893q588l335N737J7783Q632j0692
19229b891r085Q843n82j2382n899q72J8519J1870O8K427j0872j2110n518J077
19215a7407J4433K316j2128J663O253M7N896O271n775q506M708o4j836j1919P753
19200h295J4118r335p701l932M853K051r86P580R153J0453j606m121M730Km111
19185A2853m135l373q191N83P035l285j9023j338O813J7208P92l238M15j5803
$$ y = [20177, 32430, 17756, -8383, -15001, -2440, -4828, -2635, 1053, 3981, 330, 1217, 531, 1785, 4382, 1020, -11286, -23606, -26009, -12374, -5147, -1050, -15454, -20854, -13302, -4530, -1626, 6060, 10752, 1352, 281, 8114, 3766, 16383, 26411, 24750, 34139, 37279, 36895, 26246, 17347, 10211, -879, 43, -1383, 3603, 3026, -3165, -9065, -25516, -26321, -12428, -21016, -24351, -18614, -831, 7801, -2891, -11976, -3133, -3715, -16097, -21996, -22868, -4349, 7521, 7589, 10016, -856, -12966, -18484, -17407, -2974, -658, -12786, -11123, -4870, -4823, 1073, 7344, 1569, -6937, -2229, -2293, -4129, -16048, -8295, 5823, -3512, -11213, -15145, -10292, -8241, -9227, -1647, 7506, 17959, 16353, 12232, 16962, 16964, 12853, 8718, 5345, -2846, -2263, 4772, 1487, -17536, -18874, -12061, 5147, 5939, 2701, 3116, -12687]
19171a2687j1508O922J4057Q417j231m529O839J74j3394j827J2224j147j3190
19158a0880M198q833n401J0866J2254Q918N955M955j0104k957J653Q349j261j2010
19144E702L534L915q702R75j1835q092O461K154J0274J2536q213J2650m688n31
19130A6140J031p151N947n071j9791l087j669L133K1620K042j2087k1504R45J1401
19116h101N750j524o572J3934J0894K793j2788M26k162L374M173K139J072M170
19102A7578m755M813j0858K559N620P624L803n764r092j0690j1915l128M570K713
19088f922Q735M042N9n113p533j270K839J412k142j914j0066o744R118P540j38
19073h097O948M925P58J094M813p168p377n608r355N029R673N414O62n585k533
$$ y = [-12687, -24195, -17273, -3216, 5201, 3970, -559, 6280, 6454, -6940, -8767, 3457, 2310, -10880, -6682, -15515, -20916, -10050, 2204, 11122, 17077, 22032, 11928, 8971, 10624, 18973, 17712, 5702, 9236, 13151, 4449, 5424, -6411, -14503, -8042, -5888, 4386, 16922, 8709, 21359, 16671, 16140, 17171, 10020, 15967, 10896, -8895, -11982, -13651, -10518, 11102, 13144, 1057, -20447, -19502, -8101, -2351, -3875, -10447, 3487, 14381, 17174, 4386, 4812, 2650, 6024, 10197, 12336, 13408, 17578, 12823, 17636, 6778, 9337, 14957, 22581, 26384, 20620, 11528, 838, -11077, -14205, -9635, -6922, 1813, 5855, 5914, 801, -6732, -8002, -5163, -3751, -5893, -7807, -17873, -24617, -15499, -7959, -8097, -1149, 3776, 4534, 5628, 10441, 3273, -4104, -9712, -19067, -14038, -4365, 1049, 1711, -3874, -6407]
19058f407l261j8J3393R568L278j1692L810J7133R84r086k816r455R612J218J311
19043A7572j028O284N437j2463j2456j0122N479o56l966J590Q161N333P671p825
19029I011j4096k1L649r733L677N335K134L742l65q555N009O892n892p690L239
19014c664J076m754P791N765j0675m209K414O144k312Q228L452K903j0859j833
19000e33P215M75r759j3895j809P398M552Q208M193N886r990r184P793N488o326
18985b88L34J5888J140l078l709j7671q401q041P146K3667m566P991Q171l419
18971A5164j3991j1448Q774o29o115L663J6971J3426l651r783Q370p095j6679
18958c023k3905m859J2393J5013J4172n559Q531Q394M470k443k2703n546Q887
$$ y = [-6407, -9668, -9686, 3707, 13275, 16553, 4861, 8671, 25804, 26788, 17702, 14886, 5431, 15043, 16261, 17572, 16544, 22828, 28265, 15802, 3346, -6776, -1297, -1953, -5919, -4329, 3832, 9165, 16836, 9011, -5085, -5106, -1457, -11190, -7513, -2178, -44, 3698, 3333, -5222, -213, 6679, 787, -6903, -3664, -2588, -7342, 449, 6214, -4461, -8670, -6256, -112, -2424, 5804, 9256, 12159, 1300, -533, 6682, 7157, -2602, -16497, -18306, -10908, -6356, 1852, 6045, 11931, 1941, -7243, 550, 6038, -288, 46, 15934, 17074, 13996, 10287, -7384, -15785, -23826, -16680, 6987, 2421, 10412, 18583, 15164, 1173, -10275, -1501, -2130, -8245, -4582, 12389, 25815, 22164, 12381, 20751, 13656, -3023, -26928, -31787, -19394, -4381, 9791, 4232, 12763, 21157, 25627, 23184, 481, -5065, 3822]
18945C822n722M779m361m589j930Q397k966J904J2717L659J32N049O426j1492
18931A5825m832J525Q552j8K695R183Q973j0742p581J234J4990O743J7157M998
18917F8702n003p504J3788O405J4224K1373K7081N0765J05194J86768K98965J96178
18905I76936j15661j60088j87134j76645j32247p6477l6815o008j0190j3840j7453
18894D4378q623n173Q165j224n882k7845j9827M726O399R513K73j528Q487K927
18880A4766m357J685J665k09k26o124p357n447M562P117o249L471J2714Q554j8538
18865F027j8643j484M575l725j445m314R836O435m93K944l389R152R209K854j4607
18850B932q638l602R481O313L455R923J4395M088m601n333p070m397l326l0n319
$$ y = [3822, -1900, 2879, -1482, -6071, -8001, 396, -2570, -666, 12051, 15710, 15842, 20891, 27317, 15825, 10993, 12518, 21070, 21052, 23747, 32930, 41903, 31161, 23580, 24814, 39804, 46547, 63704, 68702, 63699, 56195, 69983, 76388, 90612, 111985, 139066, 189831, 295025, 481793, 780758, 976936, 861275, 701187, 514053, 337408, 205161, 128684, 91869, 85861, 75671, 61831, 44378, 35755, 30582, 38747, 37523, 31641, 3796, -16031, -11305, -4906, 4607, 4880, 3352, 11839, 14766, 10409, 12094, 13759, 13550, 13324, 7200, -157, -5604, -1042, 6075, -174, 3297, 16011, 24565, 6027, -12616, -14100, -9525, -13250, -14695, -19009, -9173, -2738, -3231, -287, -3676, 5476, 14685, 17539, 2932, -5706, -9308, 173, 6486, 9941, 19864, 34259, 38347, 33746, 28413, 21343, 16946, 13620, 13590, 8271]
18835H271j03j2532m168J0217J2568k840r614K711O648P280p55p537J6049J1664
18821C7859j3072j2327R143L783K489M619j4206j3529J3256N855J0342O805j1165
18808B9852j8569m473j3445o081J0187J5450J4005K766j6160j3136n748J0624
18796E272K4556J452j3474q851j7986p51Q365P569n533q696L680J8204O506L728
18782B4041j392n305k611L036j0405q066Q449J4177R665k890n64K101j573r359
18768A9304R040O604M448M2010O6980K9700k7321m1466l1381k1851k1288k3008
18756A1771k397J0034k688J262R909n149K057n320JL190l886k220q510k66Q15
18741H603m475P566j507N376k249q486r758J5095J3351k140l494r7K298q216j3750
$$ y = [8271, 8168, -4364, -8532, 1685, 14253, 11413, 1799, 4510, 11158, 18438, 17683, 10146, 26195, 37859, 24787, 12460, 21603, 25386, 27875, 32494, 18288, 4759, 18015, 23870, 34212, 41017, 29852, 11283, 6810, -6635, -12716, -2529, 12921, 26926, 29692, 13532, 396, -5352, 5272, 29828, 31280, 17806, 8955, -9031, -9782, -1417, 6152, 619, -8077, -4397, 13807, 20313, 24041, 22649, 17344, 14733, 17769, 7364, -702, 7747, 21924, 31589, 28699, 28135, 30236, 28663, 19304, 28344, 34948, 39396, 81406, 148386, 178086, 150765, 109299, 77918, 56067, 34779, 11771, 9374, 19408, 16720, 17982, 27891, 22742, 24799, 19479, 19480, 22670, 18784, 16564, 8054, 7788, 8603, 4128, 11694, 10187, 15563, 13314, 4828, -4930, 10165, 23516, 21376, 17882, 17785, 20083, 11867, -1883]
18726a883K526P190R82p871j3341j6628O000J6702K757q144N245Q590J2466P532
18712B2123n371j0689k075M693J169N380Q263r10n891K361K580k531J040j916
18698A8226O735l069p780J1927J5184J0837j1637j1797o780j2546r270K023Q116
18685A0169J0367J2872m824m000L363K611M333n625N989l527j5267l290N440j359
18671A7252N489Q769m484j6429P025P14L004n215J1202l397j5471l574m764J2683
18657A2804M188k515o7l087k097k548l105R716k391r248o078r835R006Q146j503
18642A386P313R613O115j813K400l561N106m537o01Q370r694n298J063L631o266
18627A3227j2502q91M239J1665m545l691J5681O025N626K956m045o394l342K985
$$ y = [-1883, 643, 7833, 8815, 944, -12397, -29025, -23025, -6323, -3566, -11710, -6465, 2125, 14591, 22123, 16752, 6063, 3988, 8681, 9850, 15230, 23493, 22583, 16692, 19053, 21633, 19102, 20142, 18226, 24961, 21892, 14112, 26039, 41223, 52060, 40423, 28626, 21846, 9300, 30, 2053, 10169, 20536, 33408, 28584, 24584, 27947, 30558, 34891, 29266, 35255, 31728, 16461, 13171, 18611, 17252, 22741, 31510, 27026, 10597, 17622, 18336, 21340, 16125, 27327, 23930, 8459, 4885, 121, 12804, 16992, 14477, 14410, 11323, 9226, 6678, 3573, 13289, 10898, 1650, -4428, -14263, -5257, 2889, 1386, 8699, 18312, 24427, 22614, 25014, 21453, 26559, 22022, 21421, 29791, 20097, 14799, 15862, 19493, 13227, 725, -166, 4073, 15738, 11193, 7502, 23183, 29208, 34834, 37790, 33745, 27351, 24009, 26994]
18613B6994j402j160p644l794O521r819p119N376P957N596J3609p951p003P809
18599B7970j0007m829P348K231O451n779j1263L829m150O3k254j294L466p657
18585D125Q0J4623P005R640l370n962P263R67J515q748j1961j3510J0284J3885
18571B5836L839J918L274o062j1732K199J278Q712J7354J4175Q904j0791O896
18558F5800O238J3522J2872j0179m298J1344k7513Q209m028j2669L977j1537j6750
18545C4988j837P244M159n254j749N935r35K902M164j845m808j7530M346k062
18531B7718j3538k346M829M0J224P91o024O012J2564P28l895J862O415m720Q148
18516C9808K1404n212n510R97J207J6402j7741M864K406k399m988p943j1412K801
$$ y = [26994, 25592, 24432, 16788, 12994, 19515, 9696, 2577, 7953, 15910, 21506, 35115, 27164, 20161, 27970, 17963, 13134, 20482, 22713, 29164, 23385, 12122, 15951, 11801, 11864, 9610, 8316, 11782, 4125, 4205, 18828, 25833, 35473, 32103, 26141, 33404, 34371, 35886, 27138, 15177, 1667, 11951, 25836, 29675, 31593, 34867, 28805, 17073, 19272, 20550, 29262, 46616, 60791, 69695, 58904, 65800, 72038, 85560, 98432, 88253, 83955, 95299, 67786, 75995, 71967, 59298, 63275, 51738, 34988, 33151, 40395, 44554, 39300, 37551, 43486, 42551, 45453, 49617, 47772, 42964, 25434, 29780, 27718, 14180, 11834, 16663, 16703, 17927, 18718, 12694, 18706, 31270, 31998, 28103, 29965, 36380, 31660, 39808, 61212, 56000, 50490, 51487, 52694, 69096, 51355, 56219, 58625, 56226, 51238, 43295, 31883, 34684]
18502C4684K2359J5057L704P176P453M771o778P452L1464M5722L4193l2108n3557
18489A21592l1612r912j3935M88P050M00j1746Q941L497j2104r200J226R26j2555
18475D3056j6722L177J066P730Q313o049o394J11O716R20o756J987j926p086J2458
18460D0601J9264P366n485j7286j9292j1891j6948j1151J5867K5453J0959j725
18448C5732q715r601j2850O939J867o745j932k210k191o317p79J2635J7537P162
18434C0532j6901j8497j7161j8165N175k276J1196M1595J3617K6041N3777L3585
18422A42518J4678Q583j9077l0847j5905k0202N165K205O458k602N842l543m130
18409H9143Q925N879o52r573m510J2577J9617j479q37K427j8793o605O543K350
$$ y = [34684, 57043, 72100, 75804, 82980, 90433, 95204, 88426, 95878, 127342, 173064, 207257, 175149, 121592, 89980, 80068, 66133, 66621, 73671, 74071, 62325, 71266, 74763, 62659, 53459, 54685, 55611, 43056, 26334, 29511, 30577, 38307, 46620, 40571, 34177, 34288, 41004, 41924, 35168, 37155, 35229, 28143, 40601, 59865, 67231, 61746, 44460, 25168, 13277, -3671, -14822, 1045, 26498, 37457, 35732, 27017, 17416, 4566, 11505, 13372, 6627, 4695, 2485, 294, -6023, -6802, 5833, 23370, 30532, 13631, -4866, -22027, -40192, -35017, -37293, -26097, 15498, 29115, 55156, 108933, 142518, 157196, 165779, 146702, 115855, 99950, 79748, 84913, 87118, 93576, 90974, 96816, 93273, 89143, 98068, 103947, 103295, 93722, 89212, 101789, 121406, 119927, 119090, 121517, 102724, 96119, 102662, 105012]
18395A05012j082l481j0450M292l594j2550N716K5574J4856J6265P274q366j2171
18382A27295K142Q93j7302o408J7764Q457r187j2480j322m301J1622J3628K1392
18369A52193K6882K4582J3249J8562N149M851O25j0107P250J0628P791K093J8594
18356B82342L1008K185P92l929M902M254K5222L373K1533M5605O153J4898J0333
18343D48671J2090O784J6568K5368L9520O1181N6316N6532P9431J37954K43729
18332A184144M04880L58604q2385j11598j28482j26614n7989K5952P3474J04975
18322A644961J47076K01033K92715L38618M32877O33009Q42042J035800P97147
18313F365278P86149J110708J319005J607812K041464K719381L538327N617566
$$ y = [105012, 103930, 100449, 89999, 94291, 90697, 78147, 83863, 109437, 124293, 140558, 147832, 139466, 127295, 129437, 130330, 113028, 106620, 124384, 132841, 123654, 111174, 109852, 105551, 117173, 130801, 152193, 179075, 203657, 216906, 235468, 240617, 245468, 246093, 235986, 243236, 253864, 261655, 263748, 282342, 313350, 315535, 316327, 312398, 317300, 321554, 346776, 350149, 371682, 417287, 423440, 438338, 448671, 460761, 467545, 484113, 509481, 549001, 610182, 666498, 723030, 802461, 940415, 1184144, 1589024, 1947628, 1865243, 1753645, 1625163, 1498549, 1440560, 1466512, 1539986, 1644961, 1792037, 1993070, 2285785, 2624403, 3057280, 3690289, 4532331, 5568131, 6365278, 7151427, 8262135, 9581140, 11188952, 13230416, 15949797, 19488124, 25105690]
18305B5105690J0364698K0498436M0767188O7663815K0428027l3562401l1314179
18298A19951274l8105928l2106771j9096755r727294n582689l507464k352072
18291I472301j608340r89026o01466l15673o09382o80406n57436n49640m51616
18282C109316l20763k76181k36590j84039j68104j82799j62250l9577Q9189K25106
18272A853308J12878k61669k43338k32727k13325j44474j02000p0739m8488m9007
18262F00419m7006o0834m1994l2684l1053k3895k7247q744p298l0618k4606j7401
18250B47039j9837o271j4874m0206k2786M900J4191j4582k5447k9686l650L422
18238I2213J655n085k313l717j0763p371K5724K7335l779k873N77O981r830o547
$$ y = [25105690, 35470388, 55968824, 96736012, 164399827, 184827854, 151265453, 119951274, 81845346, 49738575, 30641820, 20914526, 15331837, 11824373, 9472301, 7863961, 6874935, 6273469, 5957796, 5348414, 4668008, 4110572, 3560932, 3109316, 2788553, 2512372, 2275782, 2091743, 1923639, 1740840, 1578590, 1539013, 1628202, 1853308, 1966186, 1704517, 1461179, 1228452, 1015127, 870653, 768653, 697914, 649426, 600419, 553413, 492579, 450585, 417901, 386848, 362953, 335706, 326962, 319664, 289046, 264440, 247039, 227202, 220931, 206057, 165851, 143065, 147965, 162156, 147574, 122127, 92441, 88791, 92213, 93868, 88783, 86470, 82753, 71990, 64619, 90343, 117678, 113899, 111026, 111603, 118584, 108754, 102207]
18224A02207j3067r487k296J2818j554n995j7826l0229k7916K1041K3757l809
18212D7644l274J337M599r324p57q67J604K770j1461p115N42j039j2039k971J0861
18197B0510J3209M529K767j083L557P636j5678Q984L645r666o7j552j3491k4157
18183h57j9498J096P724r078p848O529K8816M5849K5893L2889M899L083l115J0993
18169A27375M365j5441k2812j1996J2433J9145j3780p077j184O380J021j0482
18157H7947q034q736m897J290r717k233J2466J0803Q072J021o696M16j7233j1643
18143E2826l783R429J4429J4117l035k190J7417R809J1763J6819O823l166J1585
18130A52843P444J2205J4757K7190J9760J7341L6060L9440M1350N9578Q2506R8133
$$ y = [102207, 89140, 79653, 77357, 90175, 88621, 82626, 64800, 34571, 6655, 27696, 51453, 47644, 44370, 45707, 50306, 40982, 40225, 39358, 40962, 43732, 32271, 25156, 25698, 24659, 12620, 9649, 20510, 33719, 38248, 41015, 39932, 43489, 51125, 35447, 44431, 48076, 38410, 38343, 36791, 23300, -857, -20355, -19259, -11535, -20613, -28461, -21932, 6884, 52733, 78626, 111515, 116414, 119497, 116382, 127375, 131740, 116299, 93487, 81491, 93924, 113069, 99289, 92212, 91028, 97408, 98429, 87947, 79913, 71177, 66280, 67570, 57853, 55620, 68086, 78889, 86961, 87982, 81286, 81702, 64469, 52826, 49043, 58472, 72901, 87018, 83983, 81793, 99210, 109019, 120782, 137601, 144424, 141258, 152843, 160287, 172492, 187249, 214439, 234199, 251540, 287600, 327040, 368390, 427968, 510474, 608607]
18118F08607J08803J28680J52749J98246K21938K44271K48799L66318O23014J094601
18108C996026K053365M056488P962679R863788j718524n599675n717424n506578
18100I390145l733580k030404j075288o35561m06089k75398j73218j28857q9108
18091H42642j11884r2844p4611o6040m7646l0335l1904k2813l1219m3171k2102
18080B68073j6217k5792k0584k3774k6970j9491j8507j1602O466L613l373j465
18068A10377o111j2143r646q0n608q755r205r155j1916r170o572P36n465j0358
18054F929o805N560L949j38p658O380Q993r47P460L827k1370j4575m852J3869
18040F22R855J8751k305n723m369L502o718P020Q364J907j3262J264m522o241
$$ y = [608607, 717410, 846090, 998839, 1197085, 1419023, 1663294, 1912093, 2278411, 2901425, 3996026, 6049391, 10105879, 18068558, 27932346, 26213822, 20614147, 14896723, 9390145, 5656565, 3626161, 2550873, 1915312, 1509223, 1233825, 1060607, 931750, 842642, 730758, 637914, 563303, 497263, 449617, 419282, 387378, 364565, 333346, 290175, 268073, 251856, 226064, 205480, 181706, 154736, 135245, 116738, 105136, 111602, 115215, 111842, 110377, 104266, 92123, 82477, 82397, 76789, 68034, 58829, 49674, 37758, 28588, 22016, 22752, 17287, 6929, 124, 5684, 9633, 9495, 1837, 8217, 17210, 16263, 23723, 27550, 6180, -8395, -13247, 622, 10477, 29228, 26923, 21200, 16831, 20333, 13615, 20635, 28999, 30906, 17644, 18908, 14386, 8145]
18026H145R068O004l129j1160M766r640j3281j088R775J2964M381J647j2308J5125
18012B1269j0028j4610J4806J3205o634J441L131j2824o307l245L796n116p289
17999h405j0604J787O413P776N252L333L607J9569k942O50l181j604j0202j4074
17985b625j7446R965M411P954p052n76J3916J360j9125J1756R977J538J4266J086
17971B9405n950j653M310o618j0890M771R752l474j2437j280j149N527J526j8119
17957f279p269N7J494j643J1434P905n491r184o548j09n055N316q885K066J974
17942b0217N037j676l854p749l660j281J1409J3009O174J279P371Q04j7786l379
17928a4519M270P132Q210Q784n776o495m503L31J71j581k187K009m682j5254r147
$$ y = [8145, 17213, 23217, 20088, 8928, 13694, 4054, -9227, -10315, -540, 12424, 16805, 18452, 6144, 21269, 11241, -3369, 11437, 24642, 18008, 19449, 22580, 9756, 3449, 204, 4000, -1116, -8405, -19009, -17222, -10809, -3033, 2219, 5552, 9159, 28728, 25786, 26436, 23255, 21651, 11449, -2625, -20071, -10106, -5695, 2259, -4793, -5369, 8547, 9907, -9218, 2538, 12515, 14053, 28319, 29405, 23455, 21802, 26112, 19494, 8604, 13375, 23127, 19653, 7216, 5936, 4787, 10314, 11840, -6279, -13548, -13491, -11997, -13640, -2206, 5699, 208, -8976, -15524, -15633, -20688, -15372, -24257, -22191, -20217, -15180, -16856, -20710, -28459, -32119, -33400, -21991, -8982, -2808, -1529, 5842, 6646, -11140, -14519, -10249, -3117, 5093, 13877, 8101, 1606, -2897, -2566, -2395, -3976, -6163, -4154, -8836, -24090, -33237]
17913c3237Q886J5835k989J219p928j902r167N833K3682q33j4433l1K320O143
17899f602Q26j9910K924R951M911m2j50j975R03k72q336l140M530L237j1068K233
17883b1980j0125q438K0489J1476Q197J70k3661Q532J6250n415j4335m175N736
17870a7279J1372O208q553J168K593k091p684J226L181m738k322l043J1032O791
17856b139L827j3105k2318j552M386K148j422J0563M250n408J989P918J0573O749
17842F459r748k516p148K892o337p736P41o672q921n72J4070O711P293j336L741
17827i079J3912R348M70n152j1519j192Q28p774n461N25J3764L334Q092R730l294
17812A6532o162p864j5097j3725L09N282J837n222j2968P668J5896k679J379M193
$$ y = [-33237, -24351, -8516, -11505, -10286, -18214, -20116, -29283, -23450, 232, -601, -15034, -15065, -12745, -6602, -5776, -25686, -22762, -12811, -7900, -7942, -8092, -10067, -9164, -9436, -17772, -20912, -16382, -13145, -24213, -21980, -32105, -40543, -20054, -8578, -381, -211, -23872, -15340, 910, -4505, -18840, -23015, -17279, -5907, 301, -8252, -7084, -4491, -6582, -14266, -13040, -9859, -14597, -16919, -19962, -8930, -2139, 1688, -11417, -33735, -35287, -30901, -28753, -30175, -19612, -15362, -20770, -18781, -10863, -290, 6459, -3289, -5805, -12953, -10061, -16398, -24134, -23393, -30065, -38986, -39558, -25488, -18777, -11484, -12820, -9079, 4833, 14181, 14651, 9499, -2020, -3212, -2384, -10158, -15619, -15094, -1330, 2004, 10096, 19826, 16532, 10370, 2506, -12591, -26316, -26007, -20725, -18888, -24110, -37078, -29410, -13514, -16193, -14814, -10621]
17798a0621P498O615j949N30O254O008m83L533r225m963J692L780m079j3031p003
17783a5444R575O442P895J955j869q32O303J765m608p878j9621K03Q348O596n132
17768f302J166L028p105k937l036j9203K117J1499R613J3735k993l346o771p867
17754a8402m478L262J2219L557k0226o001J3529L404J856P443k577L536j2222
17741a5100j1211J138K4886R858K851l735p738r544R55J107k102J200J0476J937
17727D978k586J531j4671J12J0220k436j5125J3831O906Q895n134j7861N94r307
17713b0053o068M904J7540J2880Q13o930m809r27Q962J2111J2764L819k89o440
17699B8277n24J9713R210J4327K6296K3377M4469Q7868J69482K87190K25802q3423
$$ y = [-10621, -3123, 3492, 1543, 2073, 8327, 14335, 13852, 17385, 8160, 3197, 4889, 8669, 4590, -8441, -15444, -5869, 573, 8468, 10423, 8554, 7722, 14025, 15790, 11182, 3304, -16317, -16114, -7766, -1170, -6302, -5136, -2108, -9213, -12150, -15186, -34389, -32272, -20773, -11160, 2575, -418, -3764, -10535, -18402, -22880, -19618, -7399, -3842, -24068, -30069, -16540, -13136, -11280, -3837, -6414, -2878, -15100, -26311, -25173, -287, 9571, 12422, 8687, 949, -8595, -7640, -6533, -8635, -7435, 3041, 4978, 2392, 3923, -10748, -10636, -416, -2852, -17977, -4146, 2760, 11655, 6521, -11340, -10746, -20053, -26121, -21217, -3677, 9203, 10016, 3086, -1723, -2650, 6312, 18423, 31187, 35006, 34717, 28277, 27753, 47466, 56676, 71003, 97299, 120676, 165145, 253013, 422495, 709685, 935487, 852064]
17687H52064j63198j75156j76965j21542p1272m3310k4516k1161k0794L155k479
17676C4826r153r878P236m924K185p598m965j2960j1665L550L344J0951k033l007
17662d091k880J1485M67J0954j0244j1905q308M652J4249M334r906L187N166J0421
17648A7581n710j5820N854N4R899l189l495m004l732L820K827J3901J5829n863
17634B7952q344r119l096j5269j1870J0092N861n644o4N487l969L0M405n333M003
17619d878J6397O005k109Q998j100k6191j0971P872Q765n189L771J175N04N872
17605H921J30P533j1415j774N118j0011j6553m50O087L431K704k04q77l094j2725
17590b3179Q657M458m225p697k361J1j0557n00O590J6600r945M107K0252l013
$$ y = [852064, 688866, 513710, 336745, 215203, 143931, 100621, 76105, 54944, 34150, 37305, 34826, 25673, 15795, 23031, 18107, 20292, 12694, 7729, -5231, -16896, -13346, -10002, 949, -1084, -4091, -6971, 4514, 4981, 15935, 5691, -6214, -14522, -9870, 4379, 8713, -1193, 1994, 7160, 17581, 11871, -3949, 1905, 1959, 11858, 8669, 5174, 1170, -2562, 1258, 4085, 17986, 33815, 27952, 19608, 10489, 7393, -7876, -19746, -9654, -3793, -9437, -9501, -4014, -7983, -7953, -3548, -8881, -4878, 11519, 17524, 15415, 24413, 23313, -2878, -13849, -5977, 2788, -2401, 1370, 2545, 3049, 8921, 9051, 16584, 5169, 3395, 8513, -1498, -18051, -18501, -12414, -8983, -6279, -6483, -7360, -10454, -23179, -14522, -10064, -14289, -21986, -24347, -24336, -34893, -35393, -28803, -12203, -22148, -18041, 2211, -802]
17576h02j598P716l498j1570l180j0193J116K867J681K546r358R93R287P149r47
17561g791P763m728K431k145j6434L607k960J55J3243J2708J195r219l147J763
17547c559O428n524m338nj43L599P237m412j1860l339j0017j151J3658J3361o630
17532f695j0346j8961L860J6169J7029r13q02l264L228M14K636o418j5790L248
17518a6605J0963M472O249l87m759O335Q883K354m054o455J358J5222L203j2721
17504A4058j4440m845j623q426o623K522O712J0962n97N713J7648L233j033l434
17490A9827r701q075j860J2791m495m073n558m255j4169J3179J4221M699l27n820
17476F384O651j2299p935K49o956k20j87k577l67K3497M093j5161j2316m105N740
$$ y = [-802, -2400, 5316, 1818, -9752, -12932, -23125, -22009, -19142, -17461, -14915, -24273, -23280, -13993, -6844, -7791, -28, -4756, -2325, -4470, -20904, -17297, -20257, -20102, -6859, 5849, 7044, -2175, -5322, -3559, 2869, -2655, -6993, -6998, -7141, -3542, 3695, -717, -12577, -15916, -25933, -27084, -13426, -65, -6695, -17041, -36002, -32142, -15973, 1056, 143, -659, -3923, -695, -281, 2355, -4063, -19853, -16605, -5642, -1170, 5079, 4692, -67, 6268, 15151, 17505, 13451, 6996, 8354, 23576, 26779, 14058, -382, -5227, -6850, -15276, -21899, -19377, -12665, -1703, -2300, 3413, 21061, 24294, 23261, 19827, 10126, 2051, 191, 12982, 8487, 4414, -1144, -5399, -19568, -6389, 7832, 12531, 12204, 6384, 13035, 736, -7199, -6950, -13906, -14126, -14313, -16890, -17257, 6240, 10333, -4828, -17144, -21249, -15509]
17461a5509J1615L137M560j354O107q569j1518N324j064j3716K026J1213K19p581
17447a5110k807R633K549q575K144K5162J8054K0433O1074L0425j0973k3886k5758
17434H2365j5856j5017m3802k2248J1850K702J984N615J3586j4985j5231j6258
17422b5295L407M640j0157K590j1473O622J1856J90N092j489J2408J928L080M696
17408H095j012Q222k4253q469K176R379J87M446j2180j424J7379R107J1142p272
17394A5523k5058l231J8771O138p553q876L250J0538J66k0711q834o98R086l060
17380a4549L488q1k931r351J4882K5865J1445j2780k066Q259n276j8084r205j0001
17366b0385M637p192N40J8521J2256j034l719m722k228Q131j401q510j3386K348
$$ y = [-15509, -3894, -757, 3803, 2449, 8556, -13, -11531, -6207, -7271, -20987, -18961, -7748, -7529, -15110, -17917, -8284, -5735, -14310, -12166, 12996, 31050, 51483, 112557, 142982, 132009, 108123, 82365, 66509, 51492, 7690, -14558, -2708, -6, 1978, 7593, 21179, 6194, -9037, -25295, -21888, -17248, -27405, -24815, -36288, -29666, -17810, -17620, -12528, -14017, -1609, 319, 3399, 8095, 7083, 15305, -8948, -17417, -15241, -5862, -5675, -1229, -13409, -14833, 2546, 11653, 22795, 15523, -9535, -12766, 6005, 12143, 4590, -4286, -1036, 9502, 9668, -11043, -19877, -20575, -11489, -14549, -11061, -11142, -14073, -23424, -8542, 17323, 28768, 15988, 13922, 22181, 16905, -1179, -10384, -20385, -15748, -22940, -22400, -3879, 8377, 7343, 3624, -1098, -3326, 4805, 3404, -5106, -18492, -16144]
17352a6144n236r604M059O079k506K080J3260R465l947p642o546m814m84O766
17338a5214q09j842M04n553R978j9051m803J7356J6693n366J0595L581j0297n541
17324i869O709J0733m055j1739j6562L102J3129R36j2158l218M479N736K261M453
17310f063q846k3392k758O623k825Q271K3239M694O59p25j0769M854J0992K023
17296E977J074R721q415n136k623l300m953P997m637k951N304m305o913J265k726
17281a4621j43L419N416q758R94O216J8853j526j2995j0455R659O398j8837O064
17267a0316J4799k106k429j917j6376j2212L733l731l612N295M806o126m515K9663
17253e044J9772o15o913L897R259J3851J550j3882j3121r787q027N006J552j3969
$$ y = [-16144, -21380, -30984, -26925, -20846, -23352, -21272, -8012, 1453, -2494, -10136, -16682, -21496, -21980, -15214, -16023, -17865, -17461, -23014, -13036, -32087, -36890, -19534, -2841, -8207, 2388, 5969, -4328, -9869, -3160, 7573, 3518, -8221, -24783, -21681, -8552, -7616, -19774, -22992, -18513, -12777, -10516, -6063, -14909, -38301, -41059, -34436, -37261, -28990, -5751, -1057, -398, -1123, -11892, -7038, 3954, 5977, 7051, 16772, 8357, 3221, 598, -2702, -7655, 342, -4295, -7246, -1942, -6247, -13160, -11895, -14621, -14764, -11345, -5929, -14687, -13693, -7477, 11376, 9850, -3145, -13600, -3941, 2457, -16380, -10316, 4483, 2377, -52, -1969, -18345, -30557, -26824, -30555, -34167, -28872, -24066, -30192, -34707, -5044, 14728, 14113, 7200, 11097, 20356, 34207, 35757, 21875, 8754, -1033, -9060, -4054, -2502, -16471]
17239a6471n086J4337K923Q937o004m237K794O870L424j7774L017P719N47l475
17225b479K592l428j5941N43J4060k688l710J671K4044J1339j4679l96n814q876
17211c762L391j360L73j1188k398J6419J3459K082m808o520L621R95N141m692
17197A0753N37m475J737M008j4681j2698K507K743j2700j668L300R683N644O731
17183A421m916L334N172r652l228o797Q77R314n450o789n513L492P659J3028J0173
17168A2125m844L959l116j2813R399r929j781o800n713Q885p906o617o627n18
17154c2296J462O291O095J6689N842O712p765j4899j64M095J1060N543n209j1832
17140h376j498J0703R394j2830k464K434n560o583K937K202L171R095N335j2251
$$ y = [-16471, -21557, -7220, -4297, 4640, -1364, -5601, -2807, 4063, 7487, -10287, -7270, 449, 996, -2479, 113, -3315, -19256, -18713, -4653, -7341, -11051, -9380, 14664, 26003, 11324, 10928, 5114, -3762, -371, -1731, -1358, -12546, -14944, 1475, 14934, 17016, 12208, 5688, 9309, 10304, 15445, 10753, 11290, 6815, 8552, 12560, -2121, -14819, -12312, -9569, -22269, -23937, -20637, -10954, -5310, 1421, -3495, -161, 5011, -4641, -7869, -14666, -13789, -4475, -9925, -16714, -22227, -18735, -11076, 1952, 12125, 7281, 11240, 8124, -4689, 4710, -5219, -7000, -13800, -19513, -10628, -18534, -25151, -31778, -32296, -30834, -24543, -18448, -1759, 4083, 10795, 3030, -11869, -12033, -7938, 3122, 8665, 3456, -8376, -9874, 829, 10223, -2607, -5071, -2637, -8197, -14780, -11843, -9641, -6470, 2625, 7960, -4291]
17126d291j9246P847J2888m802j9679o321M339J0447J4473J2877m40j2674q593
17113a3175K7J2225k883j9348p799P479P691r868M043J0796N913M401M469J1910
17099A5881N166n049p194k3689p488K446m20J449j62J2046p861j182J1584J492
17085b981N487n811j5754l872J2014m040l121Q790Q351P546j292m786j266j1936
17071a2671j5188n999J7556K3551K848j7524j0778L928M165N955J7297J174m303
17058A0011p768r421j1844J996N686R24J1486P006j0640n780o261M39Q498k633
17044h301j0884J863J0786pN612N81O332n280K552j0010j6221R825L49j3525l628
17029b9956R759M574N185q114Q175L915P516k489k82N637n958j3618P563l913
$$ y = [-4291, -23537, -15690, -2802, -7604, -27283, -33604, -29265, -18818, -4345, 8532, 8092, -4582, -13175, -13148, -923, -3806, -23154, -30953, -23474, -15783, -25651, -21608, -10812, -4899, -498, 3971, 15881, 21047, 15998, 8804, -14885, -22373, -19927, -20347, -18898, -19060, -7014, -14875, -16057, -4473, -2981, 2506, -3305, -19059, -22931, -10917, -14957, -18078, -9288, -937, 6609, 5317, 531, -735, -12671, -27859, -33858, -16302, 7249, 10097, -7427, -18205, -14277, -10112, -4157, 13140, 14314, 10011, 2243, -7178, -19022, -17026, -11340, -10416, 1070, 8076, -2564, -8344, -14605, -14166, -5668, -8301, -19185, -17322, -6536, -6543, -931, -350, 5982, 702, 3254, -6756, -22977, -13152, -12803, -26328, -29956, -20197, -15623, -10438, -18552, -10377, -6462, 1054, -1435, -1717, 3920, -2038, -15656, -8093, -12006]
17015a2006J568L913Q76j0135m87L147m160L138L337K922K579M711p783o980J4844
17000e16N733j3924K52J3567r88j3018N160l551n8J3660K458N541j0273j4892
16986a0849j1200P431j0042r3N114n863J871l624j6059K121K2303J4392P468K645
16972E615L859Q618p379j3747K773L862K220l393o688q30J0792O166m412o508
16958I48m816J6320P435j8736j3250P220J71J2529m013j4894N706L258k299j5159
16944a9580j145R520j336R799J1164k853j2916R29O64n933k308L869j582l337
16930a5045j791J103K802j156j310J2362J8191R48o105k0947j1410J5047J6133
16917H822k192n478m827J2499J62K308l099j7874r747J3512K3673o615j8531r007
$$ y = [-12006, -10438, -6525, -5649, -15784, -16271, -13124, -17284, -14146, -10809, -7887, -5308, -597, -8380, -15360, -516, 5217, -8707, -8455, 5112, 4124, -8894, -3734, -7285, -7343, 6317, 8775, 14316, 4043, -10849, -22049, -14618, -24660, -24753, -19639, -25502, -23631, -27255, -43314, -41193, -18890, -4498, 2970, 5615, 9474, 18092, 10713, -3034, -261, 3601, 5821, 2428, -4260, -5090, 5702, 11868, 7456, 948, -3868, 12452, 19887, 1151, -12099, -4879, -4708, 7821, 3808, -11086, -5380, -2122, -4421, -19580, -20725, -11205, -12541, -2742, 8422, 5569, -7347, -6418, -5754, -11687, -13995, -10126, -11708, -15045, -16836, -15733, -12931, -14087, -15397, -3035, 15156, 16104, 9999, -10948, -22358, -7311, 8822, 6630, 1152, -3675, 8824, 8986, 11294, 8195, -9679, -19426, -5914, 17759, 11144, -7387, -16394]
16903a6394n271O554j457o51K662K594j2798M14J8540J1566K991r579j0670m271
16889a5770P52m414P789Q605k250J712J4911N066j773l448K241n577m691N750
16875H903M650m694J495j0792k197Q812p515p98M086L505l684o989Q070M227q687
16860a608m039Q343P521j153j168n689r141O622O755J6322K307l862o903M799
16846A9106J1496q971o728l44J431l011o058k198j2504R445k091l188J1227n49
16832G063o632L012J0512l614j4834n502K765m059Q11O858L547j5439l658J233
16818a7937o848Q321J1486K385n434j386J433J594M507n262o933j1412r39k201
16804b8626J9769P871R77m996O021J7734Q565J278q114j4950j3096j639J1710
$$ y = [-16394, -21665, -15111, -16568, -17219, -14557, -11963, -24761, -24347, -5807, 5759, 8750, -829, -11499, -15770, -15018, -19432, -11643, -3038, -5288, -3576, 11335, 16401, 14628, 11180, 13421, 7844, 3153, 8903, 13553, 8859, 10354, -438, -2635, 6177, -1338, -2136, 1950, 5455, 1771, -5218, 2852, 7079, -1608, -5647, 2696, 10217, 9064, 7896, 2207, -6934, -312, 6443, 22765, 25072, 21210, 14307, 19106, 30602, 21631, 14903, 14559, 15990, 12979, 6921, 4723, -7781, 1664, -427, -3615, 7612, 7063, 431, 3443, 13955, 10341, -4493, -9995, -7230, -11289, -10478, -3620, -73, -15512, -19170, -17937, -24785, -16464, -4978, -2593, -8027, -9413, -7980, -6386, -1879, -7141, -14074, -25486, -26425, -28626, -8857, -986, -9, -5005, 1016, 18750, 27315, 28593, 20479, 5529, -7567, -9206, 2504]
16791B504O043j1858N248Q209R037j1098m364M046K707o511j90m929p958n350
16777a4464R458R392j3168L191Q342o933J519j077N163J1098l653M121M292j3629
16763C652n843l031j4758P72J664M006j785M657L062M208j1250o103L068J2099
16749e582R720j0485n350N744o667j400N131J4521l346k988l743N757M678P243
16735A3233m734r569l811M593Q078j012N028K769K650N185R157k212j0263N41
16721A9633J536M092R7r515r411J781n485j3767j0709n693M927R096P230r619
16707a5807r8J1278J1673P596p142K578j2950o99k055Q51L537q026j0899M58J1618
16692h087r29k031R816O267o860j0133j0665R896J4719R67j4683J528Q929Q918
$$ y = [2504, 8547, -3311, 1937, 10146, 19183, 8085, 3721, 7767, 10474, 3963, 3773, -1156, -9114, -14464, -5006, 4386, -8782, -5591, 2751, -4182, -2663, -3740, 1423, 12521, 8868, 12989, 17281, 3652, -2191, -5222, -19980, -19208, -17544, -13538, -15323, -10666, -7604, -3396, -14646, -20749, -17681, -5582, 4138, -6347, -11697, -5953, -12620, -14020, -8889, 5632, 2286, -702, -4445, 1312, 5990, 13233, 8499, -1070, -4881, -288, 7790, 6778, 11806, 14575, 17225, 22410, 31567, 29355, 19092, 19633, 21169, 25261, 25358, 15843, 6432, 8213, 2728, -11039, -21748, -27441, -22514, -13418, -6188, -15807, -15905, -4627, 7046, 14642, 7500, 10078, -2872, -3571, -5626, -4775, -1238, -9264, -20163, -19705, -8087, -9016, -11047, -1231, 5036, -1824, -11957, -22622, -12726, 1993, 2960, -11723, -10195, -1266, 7652]
16678G652q573P313j0197j398L683j3116p256k177J4568M870l337O851K693q487
16664f911j1062j892J0160N075M145L023l246M196M77m206M039P548m186j2917
16650e757j6301l572R558J8058J1543l655L86j6644J2003Q019l306Q25J0153K257
16636B3567j4380j8988r10m519J6993K2729j35j8166j2519o025L081O236k098
16623e134q933M745m06j153N753N617j831o444P397K811J41j3914j1524q854O754
16608b4975K198Q883J113Q227k81N486Q411K818L019j5251n506K723l092J4118
16594G891j2320n60Q023m318p506J804o30n562P929N888j0147J404l334P879J1985
16579H426N612J1586J0526j4870j5515l072j1244j0945P449O746N887O200r51
$$ y = [7652, -921, 6392, -3805, -5203, -1520, -14636, -21892, -24069, -9501, -4631, -7968, -1117, 1576, -6911, -17973, -19865, -9705, -4630, -485, 2538, -708, 3488, 3965, -241, 3798, 11346, 7160, -5757, -22058, -25630, -16072, 1986, 13529, 9874, 10260, -6384, 5619, 13638, 10332, 11157, 21310, 23567, 9187, -9801, -10711, -15230, 1763, 24492, 24357, 6191, -6328, -12353, -9272, -3036, -5134, -14067, -9322, -9728, -10881, -5128, 489, -1342, -7786, -389, 2422, 2563, -11351, -22875, -31729, -24975, -22777, -13894, -12781, -4554, -4835, 651, 9062, 11880, 14899, -352, -5858, -3135, -6227, 7891, -4429, -4989, 3034, -1284, -8790, -6986, -7616, -13178, -5249, 639, -9508, -8104, -11438, -3559, 8426, 14038, 25624, 36150, 21280, 5765, 2693, -8551, -19496, -12047, -5301, 586, 6786, 5835]
16566E835L2k823L41k181J875j1403J2994J8971M370k3184j1982o385l737P854
16552i423n818o66J5100o858L14j658l288k884J590K830P746l405J0457k309L155
16537D883Q04O166j2931j5676l494J0061Q233N527j1044k3578j282O615J5889
16524i827J0118O98l418n911L113K232p408q875l495J9252Q013m34l518j3013
16510a2473m157J2143J8073K1j25k124o263j9189j3109J2359K2563O335Q587n368
16496A7273K402p376r778o254J046q257J3896J2161M634l27k391L80l273J27N463
16481A9726n623q908R481K713l192l415M314r461l1301J449P526P183P573m842
16467f777K343J4230J0023N411J0724p768j1207j915j922N275M789j7245j5892
$$ y = [5835, 5867, 3044, 3385, 1204, 3079, -8324, 4670, 23641, 28011, 4827, -7155, -13540, -17277, -9423, -15241, -15907, -807, -7665, -7351, -9009, -12297, -15181, -13591, -10761, -3015, -6420, 4037, 1728, 4883, 5687, 11853, -1078, -16754, -20248, -10187, -1954, 3573, -7471, -31049, -32331, -25716, -9827, 291, 989, -2429, -8340, -5227, -2995, -10403, -19278, -22773, -3521, 4492, 4058, 540, -12473, -16630, -4487, 13586, 13607, 13482, 11358, 5095, -14094, -27203, -14844, 7719, 14054, 22641, 17273, 19675, 12299, 2521, -3733, -2687, -10944, 2952, 15113, 19747, 19420, 17029, 17409, 14136, 14263, 19726, 14103, 5195, 14676, 17389, 14197, 10782, 15096, 5635, -25666, -24217, -16691, -9508, -1935, -6777, -4434, 9796, 19819, 25230, 35954, 28186, 16979, 15064, 13142, 18417, 23206, 5961, -9931]
16454i931j260q130M658J1976M463q40n792K448n814M355m941j85p51J6268j95
16439F329j844J1041M373P44m376j1050j2053j3596L998J6067m033j1978O583
16426i795J1699J128N293J369K16k973j3714m941n41L109J881J69L294R659J506
16411G359j5093j4143m705L446P120L643j2726J1184L193N343Q543N723l105o851
16397a069M193L014n930j3016j3159L333J9264p897P63J4258o151k1375R97J802
16383b0973n831Q391K0933J2004Q421L353R181k0889m161Q950k0947q304j1689
16370b1561L243M075J3322J0401m864l686M665q481m981M513K893n801j0608n744
16356b2614m285P305Q688O620K455J277K176n848O561m30m997j1269J6147P746
$$ y = [-9931, -11191, -19321, -14663, -2687, 1776, 936, -4856, -2408, -8222, -3867, -8808, -8993, -9744, 6524, 6329, 4485, 15526, 19899, 20643, 16267, 5217, -6836, -20432, -16434, -367, -4400, -16378, -9795, 1904, 3032, 8325, 9694, 9910, 6937, -6777, -11718, -12259, -9150, -7269, -7100, -3806, 5853, 7359, -7734, -21877, -26582, -23136, -16016, -12373, -25099, -13915, -10722, -5379, 3164, 8887, 5782, -1069, 3124, 6138, 208, -12808, -25967, -22634, -3370, -11267, -10504, 3754, -2397, -23772, -22775, -20973, -26804, -18413, 2520, 14524, 22945, 26298, 35479, 14590, 10429, 19379, -1568, -9872, -21561, -18318, -14243, -921, 9480, 4616, 930, 5595, -2886, -7867, -3354, -461, -6262, -16870, -22614, -26899, -19594, -10906, -4286, -1831, -554, 1622, -4226, 2335, 1905, -3092, -14361, 1786, 9532]
16342I532O381O13K985j1520m186R256K667R11l332p005P44q764q313l186p222
16327b0439j1395J3135J251N249P10o1N02P621J2305L463j6156j3240k543J0116
16313i482J1868M642j070O137P691l761j8419j654M877L791j160r00m975N729
16299C314J8216o086j0214j338l482j1576j5060J1848J1886p674m604m764m030
16286b3564p004R297J2450J0235J2868N784n609j241l972r641r122L65M814m788
16272i128n7j1494N076O009Q044M868P86M240L063j4053o858m621k806Q08K1593
16257E470L217l52N616K540q910J415o608j45q330P626m658O20M394n24L163J510
16241F044r699j2518O035J7776k147k1033l913J5741O505M855o443j2340L889
$$ y = [9532, 15913, 16526, 19511, 7991, 3805, 13061, 15728, 16639, 13307, 6302, 7046, -1718, -10031, -13217, -20439, -31834, -18699, -17448, -12199, -11489, -11550, -11048, -3427, 8878, 12341, -3815, -17055, -19598, -9482, 2386, 7028, 5958, 12095, 19786, 16025, -2394, -4048, 829, 4620, 3460, 2560, -2415, 3314, 21530, 15444, 5230, 3892, 410, -11166, -26226, -14378, -2492, -10166, -14770, -19534, -23564, -30568, -21271, -8821, 1414, 14282, 20066, 14457, 13216, 9244, -397, -9519, -9154, -4340, -9128, -9185, -20679, -15603, -9594, -1550, 3318, 4104, 8344, 11407, -2646, -9504, -14125, -16931, -16123, 5470, 8687, 8335, 13951, 16491, 7581, 8996, 2388, 2243, -6087, 1539, -3119, -2499, 1895, 1371, 4534, 6044, -3655, -16173, -10138, 7638, 5491, -15542, -19455, -3714, 2791, 7646, 1203, -11137, -7248]
16228g248J3663O859O896j1730n073J327J671P730l526j120j193j3689R057J043
16214D667n403K752J3946l685n588N483K251m750J0445p82p619R19m185k771J0481
16199A6161N373R891j2228k3928q696o010n527N551m377r141j283M817K110J5812
16185a1475O969O985O880J1983l012n068k6076j7693R943l97J0415J392J0076
16172I22p115j2321q715J2085K0290p792j614J456N048m694L470j2405j2345l527
16158b7257J3580J6958K0712R401q603j2430j0403n435o3J2731J6375L644j1606
16145A7604r328r15N952r655o904j191k070k1714J6311J0973k739L254O042K711
16131H331j943m168m941m117j4367r081J0063O376J5174J0519p724k822J4173
$$ y = [-7248, 6415, 13274, 20170, 8440, 3367, 4694, 6365, 14095, 10569, 9449, 8256, -5433, 3624, 4667, -736, 2016, 15962, 12277, 6689, 12172, 14423, 9673, 20118, 19336, 11717, 12636, 8451, 5680, 16161, 21534, 31425, 19197, -4731, -13427, -19437, -24964, -19413, -23790, -32931, -34214, -29397, -27287, -11475, -4506, 2479, 9359, 21342, 18330, 13262, -12814, -30507, -20564, -20961, -10546, -9154, 922, -6193, -18514, -27229, -15144, 5146, -2646, -4260, -2804, 2244, -2450, 1020, -11385, -23730, -27257, -13677, 3281, 23993, 33394, 24791, 12361, 1958, -3477, -3540, 9191, 25566, 29210, 17604, 8276, 7361, 13313, 3658, -3246, -4437, -6507, -28221, -11910, -937, -3676, -422, 5620, 8331, 6388, 2220, -2721, -6838, -21205, -30286, -20223, -13847, 1327, 11846, 4122, 1300, 15473]
16118A5473k160o156K021l615m685r986J619J7926J401j8209J488O40q983q576
16104b1802O972J071n411O988P512N049J0674j1842P2J779K848q088l469n672
16090a3319r588L167j90J225J6767K696l521k600j0950l267J9198l418p392K522
16076h670L610J8728N23p119m143O21o214q175p670j102Q254L970J859j5918m021
16061b5467O753J7303M225o646R352O512o306p872J531L138l37j6670n006P831
16047a1659m584q768O076J3038J0267R784k476k1974L407J42j9116p696R077P428
16033a7054P60P864j850n563O019L783j912P194P076J844j5060l618M636L385
16019b496K375K456m976P43J1571M663K262J142j5212n271j1681n391O041J1560
$$ y = [15473, 13313, 7157, 9178, 5563, 878, -9108, -7489, 10437, 11838, -6371, -4883, -4243, -13226, -21802, -14830, -13759, -19170, -12182, -4670, 379, 11053, -789, -717, 1062, 3910, -4178, -7647, -13319, -22907, -19740, -19930, -18705, -1938, 758, -2763, -5363, -16313, -19580, -382, -3800, -11192, -8670, -5060, 13668, 14191, 7072, 2929, 3550, -2664, -10839, -18509, -19611, -11357, -7387, -5528, -21446, -25467, -18714, -1411, 2814, -3832, 5520, 12032, 5726, -2146, -615, 2523, 2186, -14484, -19490, -11659, -16243, -25011, -18935, -5897, 4370, 14154, 11678, -10296, -6889, -6747, -25863, -33559, -24482, -17054, -16294, -8430, -10280, -15843, -9824, -6041, -7953, -759, 6317, 8161, -6899, -10517, -5881, -2496, -121, 2335, -2641, -1898, 9673, 14336, 16598, 17740, 2528, -2743, -14424, -19815, -13774, -2214]
16005b214J2207M966K765M572j4642n919l857R315M71q941p904K618J982j7754
15991b2335j881j897K680J292j1962K090K3961L547j278n160j1959P247K5328
15978I673L307j3961n808k923L846N076J800J5709k7p704L337K483r571J62j0901
15963e502j815O925J295N558o994j4316O331J846O710L99j232m050K311r00M913
15948A479O85L284K85Q655j0645l074M806l56r345j0513j315K2204K770j3240
15934d320m103p09K458R513L739j1460l697M105R965P628k751j1833j7817Q095
15920a1187J645l759K532N61M097n841J0251J780r919n696l055L855j049oK591
15905a3200Q400q874k2295K1853J8696k605k595j86k751m537j2593j2756K6713
$$ y = [-2214, 9993, 14959, 17724, 22296, 7654, 1735, -2122, 7193, 7664, -1277, -9181, -6563, -4581, -22335, -24216, -26113, -23433, -22141, -34103, -32013, -8052, -4505, -5783, -10943, -22902, -15655, 9673, 12980, -981, -6789, -9712, -5866, -790, 1010, 16719, 16692, 8988, 12325, 14808, 5237, 5399, -5502, -7317, -392, 903, 6461, -533, -14849, -8518, -6672, 38, 437, -795, -4845, -2534, -3434, 1479, 2164, 5448, 5733, 14388, 3743, 669, 5475, 5119, -4226, -14739, -16054, 6150, 8920, -4320, -8423, -9132, -6674, 2839, 6578, -4882, -8579, -4474, 5491, 13119, 10368, -1465, -19282, -11187, -9542, -13301, -10769, -10208, -6111, -11952, -1701, 79, -9840, -15536, -18591, -14736, -15785, -15791, -13200, -4800, -13674, -35969, -14116, 4580, 1975, -620, -806, -3557, -8094, -20687, -33443, -6730]
15892f730J7134l656O20J7962o798j869j0793o324o386l75M013R720k66p957N474
15877C769M36r050r11M457Q580o947m507N721J1Q606k194M343j492q192j1060
15862h430O501J0015P541J0309j205q597Q736J780K504j7414j3247R445J0629
15849A8567q427j3139P075O033J709m246L248L382r103k343m576Q19R654l657
15835D996O754lR2j442m330O48j0911J0688J7540j0289j1526j452o742J4091Q221
15820A6335j0767m41k97j17O468k47n063p593j791N13J7278q974k7975m421k320
15805b9412Q70P504J7597R720j2926O228N110n522k938P059K334m476q341K781
15791d412J8585Q125o681p095Q97p234N447j393j032J36O338r306j1034l653k460
$$ y = [-6730, 10404, 6748, 7368, 25330, 18532, 16663, 5870, -454, -6840, -7215, -3202, 6518, 6252, -1705, 3769, 4205, -4845, -5756, -1299, 7281, 334, -4173, 1548, 1559, 10165, 7971, 12314, 10822, 2630, -8430, -1929, 8086, 15627, 25936, 24731, 16134, 24870, 26650, 29154, 11740, -1507, 7938, 18567, 10140, -2999, 4076, 10109, 11818, 7572, 10820, 14202, 5099, 2756, -1820, -1001, 8653, 4996, 11750, 11747, 11839, 10397, 6067, 6715, -4196, 6492, 24032, 13743, 2217, 765, -5977, 8114, 16335, 5568, 5127, 4830, 4713, 11181, 10934, 5871, -1722, -3513, -3000, 14278, 5304, -22671, -27092, -29412, -28542, -21038, -3441, 6279, -6647, -419, 4691, -831, -3769, 3290, 5624, 1148, -7193, -4412, 14173, 22298, 15617, 8522, 9419, 2185, 7632, 6239, 5207, 5343, 11681, 2375, -8659, -12312, -14772]
15776a4772J0652j444j5348o728n502M69J9637O341O057N208K375M964r35P121
15762A8095n605p021N13r467o332k619k203J0786R223l681q529Q903Q577J639
15748A2279o848J34L732j196r628O116J5064o527j9162r804M831j922J0383L694
15734A146q950n07J1662L20o973r103K170j2568j204R553R513M969l690K836M899
15719D073l310m125M230K320o463L836J903O41R09q668L650j60r275L287J0880
15704C728J2349K289j416n254J544j9722p016Q738J2971j81q343n82q179n65J531
15689h108q578J267J1630J1540L722j2767j314L254j0360n534J1345J2835j884
15676G048j5702k752L624J9047L424q743K89J1902P621M918m639n831j3662j5033
$$ y = [-14772, -4120, -5564, -20912, -27640, -33142, -32673, -13036, -6695, -638, 4570, 6945, 11909, 10974, 18095, 12490, 5469, 5982, -3485, -9817, -12436, -14639, -3853, 5370, 1689, -6840, 2063, 10640, 12279, 5431, 5565, 9297, 8101, -1527, 4589, 19653, 13126, -6036, -15840, -11009, -12931, -2548, 1146, -7804, -8311, 3351, 3671, -3302, -12405, -10235, -22803, -24007, -14454, -4941, 28, -3662, -826, 4073, 763, -3362, 868, 3188, -3275, 561, 2464, 3105, 4014, -4654, -1004, -1164, -10439, -7152, 3728, 16077, 18366, 16950, 11696, 13240, -6482, -13498, -4760, 8211, 8030, -313, -895, -9074, -9639, -8108, -16686, -15419, -3789, 7751, 11473, -1294, -2608, 646, -9714, -15248, -3903, 8932, 7048, -8654, -11406, -7782, 11265, 14689, 5946, 6235, 18137, 25758, 30676, 26037, 20206, 6544, -8489]
15662h489J5863J3178j6689j4704N686O764o050R556J113j0017L128k654l982
15649g297K663O760m264j56k561R235o398M310J4389o710j2759J1274l366j525
15635C595p728L397P386N680j4507j491J3111l43r352J3598j584J4829k476k247
15621B1868O95J316j8030M950j850R951N680j5609q281O63O666o77P52o397j488
15606B09k338O603n081n042M13J3309k089j3537O882j927p920Q685K1150M139
15592B3456n689op86K418j0872j3579N995P484Q46L930j2587n562r77m715K566
15577h078r108m316K502J2188R112r674n685M512j5472M924K757L833J9512M029
15563A1036l248l377j2042J996p52J0054J644j1171l282j1621o949L729J140K099
$$ y = [-8489, 7374, 20552, 3863, -10841, -5155, 1609, -4441, 5115, 6228, -3789, -661, -3315, -7297, -4634, 2126, -2138, -2294, -4855, 4380, -2018, 2292, 16681, 9971, -2788, 8486, 5120, 3595, -4133, -736, 6650, 12330, -2177, -3668, 9443, 9100, -252, 13346, 11762, 26591, 24115, 21868, 22563, 23879, 5849, 10799, 8949, 18900, 24580, 8971, 690, 1353, 8019, 7342, 8094, 1697, 209, -2129, 4474, -607, -5649, -5236, 8073, 5984, -7553, -671, -2598, -10518, -1833, 19317, 23456, 17767, 17761, 16975, 19393, 8521, -5058, 937, 8421, 9267, 13197, 610, -4952, -5929, -10644, -8078, -17186, -21502, -19000, -6812, 2300, -7374, -13059, -8547, -24019, -19095, -16338, -12505, 7007, 11036, 7788, 4411, -7631, -5635, -6387, 3667, 5311, -5860, -9142, -20763, -27712, -23983, -22843, -20744]
15549b0744l243J2716R431J0592k002j1115j3206k023l407J698l905P027P363
15536a0818M375J19J2028O665J058P389m317k916j562k506k794K3275J7560j6925
15522C0631l5593j5536Q165J3850j678N221J4270K087n474O007J451o980J2216
15509B8637j5670j0393L5J1406O242q996j3139r937O210Q743J4615l36N323Q427
15495C1167J0362j506j3236M022L16q497l293k92j4197j721L585j724j0495K460
15481c049l281j3340Q678l877N77R884J1098P843n097J550j6518m990r74Q698
15467b798M362k771P989L474l130J4517N308q099k5564K845M783n307m043J1065
15453B631j4562o833P323J4922j1215n530K158M105j4946k027Q476R744k381j259
$$ y = [-20744, -23987, -11271, -1840, 8752, 6750, -4365, -17571, -19594, -23001, -21303, -25208, -18181, -10818, -6443, -6324, 5704, 12369, 13427, 20816, 16499, 13583, 12021, 9515, 6721, 29996, 47556, 30631, -4962, -20498, -12333, 1517, -161, 5060, 19330, 21417, 15943, 21950, 23401, 16421, 28637, 12967, 2574, 2609, 14015, 20257, 11261, -1878, -11815, -5605, 3138, 17753, 17417, 22740, 31167, 41529, 40023, 26787, 30809, 31125, 22628, 19335, 19043, 4846, 3125, 6710, 4986, -5509, -3049, -6330, -19670, -10992, -14869, -14292, -4408, 6690, 14533, 9436, 10986, -5532, -10522, -11496, -2798, 1564, -1207, 6782, 10256, 7126, 21643, 26951, 18852, -6712, -3867, 916, -4391, -8434, 2631, -11931, -18764, -11441, 3481, -7734, -13264, -11106, -7001, -21947, -23974, -15498, -5754, -8135, -9394]
15439i394M114J2598Q536Q50j0654P098J4450k059p004k4509L00j793k0925J976
15425b6416J2833P229r341J2132J554Q63L325q913j6526N576K1531P016j0416
15412D47j573J3491l158K069K228K759K839q844j85k658p844m292o492K931J6913
15397H631l153j3049n305O738J3453P140j5288n33J4242n511j9766m26J8936J703
15383G812o892r994l31J4266J884j0766j2512j492J235k53J0906n860K325R018
15369f54j726m853Q321l215k673J014n87m730M813P529l093P987J9296j0102j9342
15354b015N663N103j0616K59L251j1301j4020J9922P844n605m276L434l118j833
15340g308R962P741p766j0663M780k815o397K503R841J280k643M503n136l407
$$ y = [-9394, -5280, 7318, 15854, 16704, 6050, 13148, 27598, 25539, 18535, -5974, -5674, -7467, -28392, -26416, -13583, -6354, -15695, -3563, -2009, -1146, 2179, -6734, -23260, -17684, 3847, 10863, 447, -1126, 12365, 9207, 11276, 13504, 16263, 19102, 10258, 10073, 7415, -429, -4721, -11213, -8282, 8631, 5478, -7571, -12876, -6138, 7315, 14455, -833, -1366, 12876, 7365, -12401, -12827, 6109, 7812, 920, -9074, -9405, 4861, 6745, -4021, -16533, -18025, -16790, -17043, -6137, -11997, -9672, -654, -2380, -7233, 1088, -2127, -4800, -3786, -4373, -9103, -4290, 3239, 146, 8133, 27429, 17327, -2015, 3648, 8751, -1865, -1606, 1645, -9656, -23676, -3754, 4090, -1515, -5791, -2357, -5475, -7308, 2654, 10395, 2629, -8034, -3254, -6069, -12466, -9963, -122, 1158, -1485, 3018, -2118, -5525]
15326e525O196J7982j837j0339r679P356J1674k539q991L738O561l830j4032m596
15312g861q195J4661R584p79k972J8415o051r907N492K725R939p266r046J893
15298A0632K498J79l256L629R598q558j6860j613Q64n932m136P497P807p669o772
15283a2092Q018J3255o617k8293j7498J5307O983O112J1030p883p015J155J7236
15270c02P893j454m177k5974j3240P500J2046M229n184J8250J5807M618k0095
15257h3j0483O974q17p655M603J5192J2608K246k577r562j2533L285j675n341
15243e818R99j2359M650J3904q593q394N202m00N172R636R493m589m266M756j118
15228H275q518o209r194k57P455Q26j537N085N489Q442r20j2024m915j1353l951
$$ y = [-5525, 671, 18653, 16816, 6477, -3202, 4154, 15828, 13289, 4298, 8036, 14597, 10767, -3265, -7861, -16056, -1395, 8189, 7410, 4438, 22853, 16802, 6895, 12387, 15112, 25051, 17785, 8739, 10632, 13130, 13309, 10053, 13682, 23280, 14722, -2138, -3751, -2887, -8819, -12955, -5458, 2349, -5320, -12092, -4074, 9181, 2564, -25729, -43227, -27920, -20937, -14825, -3795, -11678, -18693, -17538, -302, 7591, 6137, 1960, -24014, -37254, -29754, -17708, -13479, -18663, -413, 15394, 20012, -83, -10566, -3592, -4409, -12064, -7461, 7731, 20339, 22585, 20008, 10446, -2087, 1198, -477, -5818, -4819, -17178, -12528, 1376, -7217, -15611, -10409, -10809, -5637, 3999, 13492, 8903, 4637, 9393, 8275, -243, -6452, -15646, -15903, -8448, -7622, -9159, -4074, 1415, 9857, 8937, -3087, -8002, -19355, -23306]
15213b3306J6765P963O122l871O841N565o225J0787M845j951j1700k2274p664
15200a8103j697l905J3152k398M028J0032o86m106j0262r003n889p903J0380J5707
15186a0653J1927R785Q411o027n423J1552o527P59j0060k730m29m245r352O458
15172f554J3286l810o822K2544r94j188J2887r379J827j2209j5224k413r46j314
15158a0309Q581n685k375M537J7474r954o260j0305J4300J5510q288j5039o363
15145a4176k949K144M062j4232O372N194k461j83O193J3288L371j2673p357L455
15131i952J9742N11k928o416l24q939j111q35j1197r791Q443J0654j2779Q646
15117a6276O082P27J1488N289n75q438m577J166j464M07L188j260M204l031n804
$$ y = [-23306, -6541, 1422, 7544, 3673, 10514, 16079, 9854, 20641, 25486, 23535, 11835, -10439, -18103, -19800, -23705, -10553, -12951, -8923, 1109, 423, -3683, -13945, -22948, -28837, -36740, -26360, -10653, 1274, 11059, 19470, 13443, 8020, 19572, 13045, 13804, 3744, 1014, 585, -3660, -13012, -6554, 6732, 2922, -3900, 18644, 17650, 16462, 29349, 19970, 21797, 9588, -5636, -8049, -8995, -10309, -1728, -7413, -9788, -5251, 12223, 2269, -3991, -14296, 4, 15514, 7226, -7813, -14176, -17125, -14981, -10919, -25151, -18779, -13585, -16046, -16229, -10036, 3252, 6623, -6050, -13407, -9952, 9790, 10301, 7373, 957, 633, -8306, -9417, -10252, -21449, -31240, -22797, -12143, -24922, -16276, -10194, -9467, 2021, 7310, 6735, -1703, -6280, -5114, -6578, -6171, -2983, -4243, -39, -3070, -8874]
15102h874J1248M105j0256k578j0571J758J8742R784j3947q15P318m815k894j4902
15088a6697J051N537o783J2909J6853R431k108j4158j8907L623k907q560m027
15075b4743J7279J0057k697K756L411l396j447K007n730r032K995O715R026J7023
15061B4224O926j1598o556M762j32j2373N400n431j1606j731M684n467n176J4936
15047H62J5189q714j8653J499J2539j3585M62J5166p164r590k988k749J877J219
15033a4630P626R815J0330J521n672q140o784k560R596k762O669N452O349R885
15019B6695j162j202o623j0773r147r07p23J1154l301j4218l976L023M880M848
15005a432l679N064J8294j91j5538j1698j376O421J7737R209p368k886K046m503
$$ y = [-8874, 2374, 6479, -3777, -6355, -16926, -15168, 3574, 13358, -589, -1404, 5914, 1099, -1795, -16697, -15646, -10109, -16892, -3983, 12870, 22301, 20193, 6035, -12872, -9249, -12156, -20716, -24743, -7464, 2593, -104, 2652, 6063, 2667, 1220, 3227, -2503, -11535, -8540, -1825, 7201, 24224, 31150, 19552, 12996, 17758, 17626, 5253, 10653, 5222, -6384, -8115, -3431, -8898, -14074, 862, 16051, 7337, -11316, -9817, 2722, -10863, -10401, 4765, -2399, -11989, -14977, -17726, -15849, -14630, -7004, 2811, 13141, 14662, 8990, 850, -5934, -8494, 1102, -1660, 5009, 10461, 16810, 26695, 25533, 24331, 17708, 6935, -2212, -3119, -3842, 7312, 4011, -10207, -14183, -11160, -6280, -1432, -5111, -47, 18247, 18056, 2518, -9180, -10556, -4135, 13602, 22811, 15443, 12557, 14603, 10100]
14991A0100n411p670n675J0230P551Q911M039p960m855m635n060K469M379j764
14977D649Q470q479m287n858j1632j1698N359K5749N281j0526j2264J42J1804
14964c290p609o901R976q587j953J0565J0999j180l705K415R639R186M470n086
14950A8939l951m742m952k273O462J2363N881O388K273N838j2456j8021L862L713
14936A9324N726j132J605N87j783k347J2446L75j2201j1635n425o495L534m257
14922a678N816J304L950J3131j539j5136n022J1060P659M350q423j8241j1417
14909a4186j1898j758J0338m50m138R004J4247k026J1473n791L313J10m541j8116
14895a4419M174R129J6296N441R934q668j3298j1288p812p829J075Q745R359k116
$$ y = [10100, 4689, -2981, -8656, 1574, 9125, 18036, 22075, 14115, 9260, 4625, -435, 2034, 6413, 4649, 13119, 4640, 353, -5505, -17137, -28835, -23476, 2273, 7554, -2972, -15236, -15094, -3290, -10899, -17800, -7824, -16411, -18364, -7799, 3200, 2020, -1685, 730, 10369, 19555, 24025, 18939, 14988, 10246, 5294, 3021, 9483, 21846, 27727, 34115, 36388, 42226, 29770, 11749, 15611, 19324, 25050, 23918, 25523, 26110, 24327, 21980, 34426, 34801, 22600, 10965, 5540, -955, 2579, -1678, 4138, 5442, 9392, 22523, 20984, 5848, 826, 11886, 19545, 23895, 15472, -2769, -14186, -26084, -27842, -17504, -17954, -22092, -13088, 1159, -867, 10606, 4815, 8128, 8238, 3697, -14419, -10245, -1116, 15180, 20621, 30555, 21887, 8589, -2699, -10511, -18340, -17265, -8520, 839, -1277]
14881a277J0082n949p835P296N151O771L302r680p315n732N39J3806J8107o574
14867B0692j2762L347k241J3105l357j6736k279O559O244J1976j1121q933L502
14854G996l928k169Q460m000j3512q072Q973P277l801J226m632J5495K0783j486
14840B8610o193q000k582j2917L49Q721m140j2521m163j558O798R067O872O845
14826A5188n74q006p864N483k636j3179m783J0995P665r096r978Q961J1751r782
14812e855R685J4687J014l734j1032n856L411J0217R134q566p658j5250j791Q436
14798c158O541m815m573R40n669l144P337R446L527j453l255J283q033J020Q163
14783D157j831Q420r466p548J927m15n93O361j311k919p988q755q30Q788J929
$$ y = [-1277, 8805, 2856, -4979, 2317, 7468, 14239, 17541, 7861, 546, -5186, -4647, 9159, 27266, 20692, 7930, 11277, 9036, 22141, 18784, 2048, -231, 6328, 12572, 24548, 13427, 4494, 7996, 4068, 1899, 10359, 6359, -7153, -15225, -6252, 1025, -2776, -1550, -6182, 9313, 30096, 28610, 22417, 14417, 11835, -1082, -733, 7988, 3848, -8673, -12836, -14394, -7596, 1471, 8343, 15188, 14614, 6608, -1256, 4227, 1591, -11588, -16371, -5376, 2289, -6807, -16785, -7824, 3927, -5855, 3830, 18517, 19531, 15797, 4765, -1091, 2320, 12537, 21671, 13105, 5447, -9803, -11594, -3158, 3383, -1432, -6005, -5065, -10734, -13878, -6541, 2905, 6432, 4979, 1724, 3007, -5026, -4006, 4157, 2326, 10746, 1280, -6268, -4341, -4756, -5349, 1012, -299, -3218, -11206, -19961, -20791, -12003, -10074]
14768a0074k167J0946K1218N788J0886q374j765j8923k1538j0307Q694J1179J7169
14755A2732r365J3896l116q629J151J2180J584j049J2699p972j75r348j811J0961
14741B3738m4K60n033j1212K201n921j343k96j3941M844J0978O236n32j3567l698
14726g330L225o363J532J1796J2834J551J052n674k708P819n85j1852q687R288
14712E898K801J1639R138j3166r541M542L016o648J893n424j0655j442Q927J3379
14698A4357J2672m060k671P83O670M188K697j3945j3106o862J1413P647l503K334
14684A8614p860N893R86o053J0767m925j6751r31K620j1061K138J1081j594m807
14670a883Q347O905J146q577o778j888K308K4397j454j613P975k0424j0868Q719
$$ y = [-10074, -12241, -1295, 19923, 25711, 36597, 28223, 26458, 7535, -14003, -24310, -15616, -4437, 12732, 3367, 17263, 14147, 5518, 6669, 18849, 20433, 19384, 32083, 24111, 23936, 14588, 12777, 23738, 23694, 23954, 18921, 7709, 9910, 3989, 2646, 2350, -11591, -6747, 4231, 10467, 9935, -3632, -7330, -4105, -10468, -8936, 2860, 15694, 17245, 18297, 12623, 9915, 17734, 17149, 5297, -3390, 5898, 8699, 20338, 29476, 16310, 6769, 11311, 14327, 7679, 9572, 4148, -6507, -7949, 978, 14357, 27029, 22969, 20298, 21081, 27751, 31939, 34636, 20691, 7585, 723, 12136, 19783, 16280, 18614, 10754, 16647, 17633, 11580, 22347, 17422, 671, -260, 2360, -8701, -6563, 4518, 2924, -1883, 6464, 13369, 14515, 5938, -840, -2728, -420, 23977, 22523, 20910, 28885, 8461, -2407, 6312]
14656F312K686J848R397m199l092j0361n33M643j3489r151P349J0094L09j0554
14642h741J945r38n903J176J5546l911j279M03P507Q284m223l573L257p663o902
14627e015k95J0187j948o54N947m084o159J116k095l874k200J1132n749L303m417
14612d805j86N644J3061k472o447n826M581K789n192j108j1169r285q096J3997
14598a4514J1796q877m810l854k629J7306J3719q855q51j719K50O550J4087j169
14584A6430o830o159m040J140L859M280j6848j193J2725o096K560N213q489l593
14570g041k638P588J4092J061j0351k633Q162q872j4349K526P331M256N33j693
14556b028O95K576J344Q052N946j0671o510p96Q473o994q200N6J1474J7354j364
$$ y = [6312, 8998, 10846, 20243, 16044, 12952, 2591, 2058, 6701, -6788, -15939, -8590, 1504, 1813, -8741, -6796, -7734, -13637, -12461, 3085, -826, -2105, -1702, 5805, 14089, 9866, 6293, 9550, 1887, -5015, -5310, 4877, 2929, 2275, 8222, 4138, -2021, -905, -3000, -6874, -9074, 2058, -3691, -388, -4805, -4991, 653, 13714, 11242, 4795, -1031, 3550, 6339, 1147, 39, -11130, -20415, -28511, -14514, -2718, -11595, -16405, -20259, -22888, -5582, 8137, -718, -1569, -3288, -3038, 3512, 17599, 16430, 9600, 3441, -599, 541, 4400, 8680, -8168, -9361, 3364, -2732, -172, 5041, -3448, -7041, -9679, -2091, 12001, 13062, 2711, 78, 8240, -632, -14981, -12455, -5124, -868, -335, -2028, -1333, 1243, 2587, 10639, 16585, 5914, -596, -1392, 7081, 87, -8113, -8057, 3417, 20771, 19407]
14541A9407O177r330k7249J187k812R413L027k144M534N579o191j2826n502l093
14527a9823J6681J4134r244O007K553j0025r833J1822N211l638M660J734R70q635
14513B574m885m712P798L708N077k170O090m183L540p087j0357m002P135K885
14499A411J8029P274j9182o149J0196J228p68j58k45M750O714j1088r324n653
14485b965K273Q373O168N828r077j7455J0105J7232L430n663q066O36p253k0229
14471a6663Q50M32M573M304m775k538J5264Q549k387R625Q487k042r706m516r190
14456B67j1178o294p13M130J4700P533J0885J0487L073j0632j6236o224O295j263
14442D830j950q76J6476r754k0313l042M711j6126J1476J0776O141J3725L239
$$ y = [19407, 25584, 16254, -10995, -9808, -12620, -3207, -180, -2324, 2210, 7789, 1598, -11228, -16730, -19823, -3142, 10992, 1748, 7755, 10308, 283, -9550, 2272, 7483, 3845, 8505, 10239, 11209, 2574, -2311, -7023, 775, 4483, 9560, 7390, 13480, 9297, 12837, 5750, -4607, -8609, -1474, 1411, 19440, 26714, 7532, 1383, 11579, 12807, 12039, 11881, 11636, 16386, 23100, 12012, 2688, -2965, -692, 7681, 13849, 19677, 10600, -6855, 3250, 20482, 23912, 18249, 10183, 10819, 3566, -16663, -15813, -15381, -10808, -6504, -11279, -13817, 1447, 9996, 7609, 17234, 25721, 23679, 13973, 9457, 267, -10911, -17205, -17918, -13788, 912, 8445, 19330, 29817, 32890, 22258, 6022, -202, 6093, 4830, 2880, 2004, 18480, 8726, -11587, -14629, -9918, -26044, -14568, -3792, 2349, 16074, 19313]
14429A9313j5230q800r302m81J0532J449p074r419J0127J1055m433J784J05r929
14415a0303o552P926J4153J0626k646J463J0586j3388m563J0315J719m027m795
14402A0514N238L182J190j1087q943j7190N809J3721L540r41Q700J55j1110l940
14388a162j0291k159K842K1716j518j4852J362J3304Q910n744k4O963q561m309
14374F477M416L631m564k546p328o83j597Q902J5137J1871L023o243q746j5529
14360F221j874l753P599p166r901m578j579N250j126m769p51k41L764P744N138
14345b2p862n494J434Q820J0587N242J1121J7390m134l297p905r283p247m613
14331D737q926j784L51M984J439q43m684Q56O686O628O529o538o019r890p13j684
$$ y = [19313, 4083, -4717, -14019, -14500, -3968, -2519, -9593, -19012, -8885, 2170, -2263, -479, -374, -10303, -16855, -8929, 5224, 15850, 13204, 14667, 25253, 11865, 7302, 17617, 19336, 15309, 10514, 15752, 18934, 20124, 9037, 94, -17096, -11287, 2434, 5974, 5033, 13733, 13888, 2778, -1162, -11453, -13612, -10770, 10946, 9428, -5424, -4062, 9242, 18152, 12408, 12384, 19347, 10786, 6477, 10893, 14524, 9960, 7414, 86, -597, -2194, 6708, 21845, 33716, 36739, 30496, 21750, 6221, 4347, 594, 8193, 1027, -8874, -13452, -15031, -9781, -10907, -15676, -16427, -16668, -12904, -5160, -22, -7884, -13378, -11944, -3124, 7463, 12705, 23826, 41216, 37082, 33785, 25880, 16597, 9350, 4737, -4189, -5973, -5622, -638, 801, -42, -4726, -3870, 2816, 9444, 15973, 9435, 3416, -6474, -7187, -8871]
14315h871J2915j001n379Q086o260M04J2915J343p06j4508m026O546J1076P526
14301B0060k786n12q884j0813m462L543R563j193j6670J53P194Q1j2198J790J5049
14286h5J2825p377Q097k69p285j4684o465Q059R602J995R865M225j3615m274J1701
14271A2315M74M972J1262m511j3012M020M179j7202o553O070n299N794j500k043
14257a034J4037K808j606l342K303j644l760M68j2901l653R471J0735Q615o009
14243A4488N3k941o435j6787L625P964O081l161P053L482k211o686J072M736o331
14228D002M314j216Q621r696p84l385j0091r04J820J9386Q109K036n543O176o152
14213A6693n142K107J0154n075j9167n315J5477P956N9q979N30P643o371q035
$$ y = [-8871, 4044, 3043, -2336, 5750, -510, -106, 12809, 14152, 13446, -1062, -5088, 1458, 12534, 20060, 17274, 16762, 7878, -2935, -7397, -3854, 5709, 4516, -12154, -12001, -4807, -4726, -16924, -15134, -85, 12740, 5363, 13460, 13191, 5906, -8778, -15243, -7184, 2418, 4413, 14278, 18503, 4888, 614, 12315, 12789, 17761, 29023, 24512, 11500, 15520, 19699, 2497, -4056, 2014, -3285, 2509, 1009, -1034, 13003, 15811, 14205, 10863, 13166, 11522, 7762, 8230, -4671, -8324, 1147, 11882, 20497, 14488, 14541, 11600, 5165, -11622, -7997, -33, 6048, 2887, 9940, 13422, 11211, 4525, 5597, 10333, 4002, 8316, 7100, 15721, 6025, 5241, 1856, -8235, -9139, -7319, 12067, 20176, 22212, 16669, 22845, 16693, 11551, 13658, 23812, 18737, -430, -5745, 9732, 17688, 17747, 8768, 9298, 16941, 10570, 2535]
14199B535K801K251l998L189j7125k0083J8226K6660M982j2980O429J0335k342
14186B0880k544k1580l89O195P660J1059J1098m596j0065p515l538m8k924K1M004
14171G718R37j2263R800J1329j5877p447j827N908J469J4188O250Q693q29O684
14157C4733M32j0962j6206j2867N335O368J3944J3398M185j2j2509j4980J76N116
14143A6151J113k498N266Q681K330j4749j1427K894n762k207j0401j1344J2697
14130i256J8871M440q143j4870k872N340P289j819j1865o449L105Q425K0023K311
14116A4530n479m970Q908j315K297J1678P29j5061m381R379Q759J3542j771j8
14102C6827O942n227j1850k1406j1975k968k487J2768J2052J902k60N377k638
$$ y = [2535, 5336, 7587, 3589, 6778, -10347, -30430, -12204, 14456, 19438, 6458, 12887, 23222, 20880, 18336, -3244, -3633, 2562, 10222, 21281, 32379, 27783, 17718, 10203, 6665, 6617, 3693, 3714, 7718, 8655, -3608, 6192, 17521, 1644, -5803, -7630, -1722, -253, 13935, 20185, 28878, 28049, 34733, 35165, 24203, 7997, -4870, 465, 6833, 20777, 34175, 38360, 38348, 25839, 10859, 11035, 16151, 17264, 14766, 20032, 28713, 31043, 16294, 4867, 7761, 1999, -208, -10609, -21953, -9256, 9615, 14055, 5912, -8958, -11830, -6490, 799, -1020, -12885, -19334, -16229, -7804, 12219, 14530, 9051, 4081, 12989, 11674, 13971, 25649, 26378, 11317, 6936, 16315, 25074, 38616, 36845, 36827, 43769, 38542, 26692, 5286, -6689, -9657, -12144, 624, 12676, 14578, 14318, 19695, 17057]
14089A7057N719m021J649Q685J29j3757j7094o91M755N454J0453L403J366r85
14075B2122j2809N537N774l884m892M617R120M275O815P676j4968j0084J4612
14062C3911K0866j604r03j5525j3813k3259L406Q528j1900j647R907R466l949
14049A3484o694m78O966O585j0913K261o287j2071j206J6832M108K111l186J401
14035A2913m794L460j644j347J7020k359L924q644R732J745n774j2204M377J548
14021A7953j0476m97J675k372J618J846l650L547J2158k848j4108J074J22m935
14007A107l766j718N362j858R420J0877L243J669P43j2256Q816n816k807o891
13993F125j4410R745J5259N150r507o104L786L525N569N886p212M165k480P989
$$ y = [17057, 22776, 18755, 20404, 29089, 29218, 15461, -1633, -2324, 2431, 7885, 18338, 21741, 23107, 22122, 9313, 14850, 20624, 16740, 11848, 16465, 25585, 29860, 36675, 44351, 29383, 19299, 33911, 54777, 53173, 52270, 36745, 22932, -327, 3079, 11607, -293, -1940, 7967, 17433, 13484, 6790, 6312, 13278, 19863, 8950, 11211, 4924, -7147, -8353, 8479, 12587, 14698, 11512, 12913, 8119, 11579, 9935, 8588, 25608, 23249, 27173, 18529, 28261, 30006, 24232, 12028, 16405, 17953, 7477, 6980, 8655, 6283, 7901, 9747, 6097, 9644, 21802, 18954, 4846, 5920, 6042, 1107, -2659, -4377, 985, -873, 8547, 19424, 22667, 24336, 25079, 12823, 21639, 15823, 13016, 6125, -8285, 1460, 16719, 21869, 12362, 6258, 10044, 13569, 19138, 25024, 17812, 21977, 19497, 27486]
13979B7486N325J0499l636l752q961k100P104j218o779m117l817R028M361p485
13965B1938M237k09l504J4510N239j0497l015p533p733J9252J4122N210j0490
13952D1527N28K400o162N896j689r750o603K384k560j1099j0458j799k45N300
13938G670K0331n474j9088N729J1514J1198N971j5880M141L927j2373K835K63
13925B0764j2343j6767o052M616J2898O141P98j1457Q101j723r595l913O268Q156
13911E892L913O677k638J311n211O062P891m857L337l364k280O828l217r115k666
13896H563N624K967J552p423j567Q079J553K918N938J9590M064p079p983P967
13882D4763l431m421L83K657n083r073k332n634j517j1582o140J785q242Q755
$$ y = [27486, 32811, 43310, 39674, 35922, 26961, 24861, 31965, 30747, 23968, 19851, 16034, 25062, 29423, 21938, 26175, 25966, 22462, 36972, 42211, 31714, 28699, 21166, 13433, 32685, 46807, 52017, 41527, 42055, 44455, 38293, 44189, 42500, 32750, 26147, 28531, 25971, 14872, 4414, 2615, 2370, 7670, 28001, 22527, 3439, 9168, 20682, 31880, 37851, 21971, 26112, 30039, 17666, 20501, 20764, 8421, -8346, -14398, -9782, 3116, 9257, 10055, -1402, 6699, 4976, -4619, -8532, -2264, 5892, 9805, 16482, 13844, 15155, 9944, 16006, 23897, 19040, 22377, 19013, 16733, 23561, 20344, 11229, 8563, 14187, 17154, 18706, 11283, 9716, 17795, 19348, 22266, 28204, 47794, 51858, 44779, 36796, 44763, 41332, 36911, 37294, 39951, 34868, 25795, 23463, 17829, 16312, 4730, -1410, 375, -7867, 888]
13868H88O833P407j157q642p040Q958J6690m816k256n453m452N820L703o415O266
13853A6334j599j1527p531N856L868L309J718M572K119M060L613r586n554o914
13839B738l629R469j4959N461J5342R240L993N97p116o162j1342J694L959O251
13825A5536J1215K373j3153M981k573m242L222n5P859J080P171m4j2879n732R81
13810A5740L082J2324m042N439n595o268r635M80L482q284R88P832J0822j4102
13796A2263q780Q351J425L271Q079L542j4996o433O388j089q094l278N253O100
13782A2002K355q69J071l672p165N396J4462P44k232J2314P616q931N786J268
13768D0145r988r650j0828r834M326k417r233O341q268J3266J6053Q974j2964
$$ y = [888, 7721, 15128, 13971, 5329, -1711, 7247, 23937, 19121, 16865, 11412, 6960, 12780, 16483, 10068, 16334, 14735, 3208, -4323, 1533, 5401, 8710, 10428, 15000, 17119, 21179, 24792, 15206, 9652, 2738, -891, 8578, -6381, -920, 14422, 23662, 27655, 28252, 21136, 14974, 3632, 5326, 9285, 15536, 26751, 29124, 15971, 20952, 18379, 14137, 17359, 17304, 25163, 26243, 33414, 33370, 20491, 14759, 15740, 18822, 31146, 27104, 32543, 26948, 20680, 11045, 11525, 15007, 6723, 7711, 15543, 26365, 12263, 3483, 11834, 13259, 16530, 24609, 28151, 13155, 6722, 13110, 12021, 3927, 649, 5902, 12002, 14357, 13488, 14559, 10887, 3722, 9118, 23580, 24324, 22092, 34406, 42022, 33091, 38877, 40145, 30157, 20507, 9679, -155, 4171, 1754, -7479, -1138, -9406, 3860, 19913, 28887, 15923]
13755A5923q194M537Q528n547j1428k891M360J6394J4422J2763n237p490Q436
13742D4576k579l284l017j29P685o320j4414k222J6346O158J427j5136q077r938
13728A1076l102M809P212l505n988k939J6883J8868O930m216j1638J0151k609
13715D1932j4321k597J023K911L630r155j0715J932K0258o4M6n010O12L798j382
13700C2898r260r792j287N371l84O875J3319j0037j4621j0054R933K710M121K150
13686B1942k006p351Q86J0131o212o11n307k974K567m333R825Q381n860O732Q468
13671C4278J4226k424k508N17n416o185Q650o514m283r668M53p312j3318Q360
13657H856P427m08k519N582L131K0461J1623r763j0282j8548j97R513K362p45
$$ y = [15923, 7729, 12266, 20794, 15247, 3819, 928, 5288, 21682, 36104, 48867, 43630, 36140, 44576, 41997, 38713, 35696, 35567, 43252, 36932, 22518, 20296, 36642, 42800, 44227, 29091, 21014, 11076, 7974, 12783, 19995, 16490, 10502, 7563, 24446, 43314, 50244, 46028, 34390, 44541, 41932, 27611, 25014, 26037, 28948, 32578, 23423, 12708, 14640, 34898, 34834, 34880, 29870, 30482, 34280, 32898, 23638, 13846, 12559, 17930, 17546, 24421, 37740, 27703, 13082, 3028, 12961, 15671, 19792, 21942, 19936, 12585, 13471, 23602, 17390, 16779, 11472, 8498, 11065, 6732, 16557, 24938, 19078, 25810, 34278, 48504, 46080, 43572, 44089, 38673, 32488, 41138, 34624, 30341, 20673, 21126, 13814, 496, 8856, 16283, 15875, 13356, 18938, 22069, 42530, 54153, 44390, 34108, 15560, 15363, 24876, 27238, 26493]
13643B6493r94m559n961J441J8604m19k0083K877J3819M335J825k588j673j3660
13629A9457q73k920q647p330P726J0903L041R845l498l342p735n041M613O533
13615B2732p12J1885P653M346n378n157L586o334J5407J5586K966j2391p438l995
13601D2756Q382N690q728j1555Q566r404j8811q879l290J701N605O585N29l058
13587A6089m079M395J2043O380p474r177j987O715J2282Q226l722M98k375J407
13573C9221o473p825N12P882K18J131L953K626r270O244q998o402q807j2337O269
13558G944N658l452o453J32J0934J7596R670K467j1684r062K471J341R735J615
13544C8912J209j6518j9687R98M698J94j907L265J2833L180J3619O027j249M281
$$ y = [26493, 25499, 20940, 14979, 16420, 35024, 34605, 14522, 17399, 31218, 35553, 37378, 34790, 33117, 19457, 18584, 15664, 7017, -313, 7413, 18316, 21357, 31202, 27704, 24362, 16627, 11586, 16199, 22732, 22020, 33905, 41558, 45904, 40526, 35369, 38955, 32621, 48028, 63614, 66580, 54189, 46751, 42756, 51138, 56828, 48100, 36545, 45111, 35707, 16896, 8017, 4727, 6428, 12033, 18618, 19147, 16089, 12010, 16405, 28448, 34828, 27354, 18177, 16190, 22905, 35187, 43413, 39691, 40189, 37814, 39221, 32748, 24923, 25435, 33317, 33535, 34666, 38619, 41245, 31975, 38219, 29221, 22819, 14012, 1675, 7944, 13602, 10150, 3697, 3829, 14763, 32359, 42029, 44496, 32812, 23750, 26221, 27562, 37297, 38912, 40121, 23603, 3916, 4914, 9612, 9806, 7899, 11164, 23997, 27177, 40796, 46823, 45574, 49855]
13530D9855P46o469r578k313l774L80J8035O176l540j0419o879J0915N110r548
13516C8697l118q352l078J1M67K695L369J0842J499r348j4251j301J4193p876
13502B4449o285P529J2070r690q213q249J2904J9231O47O77j8682j3906J5708
13489B8190J349m078o151M82Q989J2053R762k673n304L995j762n439k795p939
13475B8679L581k705M048O274J9504J4555J4M168j2052n520n738k3725Q260K2539
13461F1882l286N078P999p670k095K926n607p89l709j1616r993Q766K3623N338
13447G0847j710k272q823o583j83J2261N243Q158q879o345J1018k550J3990K4229
13433A08401L1358O594J0585K0824J0089n313J0478L3457L1167M6902P0643J28415
$$ y = [49855, 50601, 44132, 34554, 32241, 28467, 28847, 46882, 53058, 49518, 39099, 32220, 43135, 48245, 38697, 35579, 27227, 24149, 24160, 24627, 27322, 30691, 41533, 43032, 33684, 19433, 18132, 32325, 24449, 18164, 25693, 37763, 28073, 19860, 11611, 24515, 43746, 44393, 45070, 26388, 12482, 28190, 29539, 25461, 19310, 19792, 28781, 40834, 50596, 47923, 42619, 46614, 44852, 39413, 36618, 28679, 32260, 29555, 33603, 39877, 59381, 73936, 73950, 78118, 66066, 60546, 54808, 31083, 39343, 61882, 58596, 63674, 71673, 64003, 61908, 64834, 59227, 58438, 54729, 43113, 33120, 41886, 65509, 70847, 69137, 66865, 58042, 51459, 51276, 63537, 68780, 76938, 68059, 61714, 72732, 70182, 84172, 108401, 139759, 146353, 156938, 177762, 187851, 182538, 193016, 226473, 257640, 304542, 375185, 503600]
13421E03600K01826L65926O99854Q93551M8448m38641m32613n41048m77201k91689
13411E32013j45601r5547m8663k2395l0126k1991j423j5038k7996j4118l928j1690
13399I3497q314l824k289o876n078J828M63k529N335j833l951K40O948M046L78
13384G8041l75n598k4488p935q877j3277j9583J4515J9191J0041R952l611L083
13371E1079L0374R300j1828k235L532l373j832N321l369n893k274j01L861J454
13357G4016R112j1941k0768k1235p103j885m233J598P649K3195J1969Q448R469
13344G8291O506J1278l0782k4142o435N778P800k276N633K018Q989O060r388j9624
13330C9706r164O184K403M015P74l730K4169J6787l579J085o110r212j7247j7832
$$ y = [503600, 705426, 1071352, 1771206, 2664757, 2713205, 2274564, 1841951, 1300903, 823702, 532013, 386412, 290865, 242202, 219807, 189681, 167690, 166267, 151229, 123233, 109115, 105187, 93497, 85183, 81359, 79070, 72194, 67116, 68944, 69407, 66878, 72213, 70380, 66429, 66669, 73617, 77663, 78041, 77666, 72068, 47580, 39645, 30768, 17491, -2092, 12423, 31614, 41655, 51607, 47996, 51079, 81453, 90753, 78925, 76690, 80222, 76849, 75017, 80338, 76969, 71076, 68802, 68701, 72562, 74016, 83128, 71187, 50419, 29184, 22081, 20196, 15963, 17561, 25210, 48405, 60374, 68822, 78291, 84797, 96075, 65293, 41151, 34716, 40494, 48294, 46018, 51651, 53669, 62658, 68718, 59330, 39706, 30542, 36726, 39129, 43144, 43918, 40188, 64357, 81144, 77565, 78650, 72540, 63328, 46081, 28249]
13316B8249k999K6446O621r060K1113Q460j2363m282q279j6994M752J0895r238
13303D3321j0917P048J9186l143J2004J0760N370j3090j8992j160J0995J1139
13291G2521P375j6702Q883M673k880r127q914q81P712M366k47j279l584m389P105
13276F4632J2703P980j7091n095J1073Q96k2232k1486j2682P526J0708q866M899
13263C2965j067j3061j492R891J3986L4669Q73j4647O412J3000j0047p873k306
13250F1303J466K7390K0298j4275j8857N76m502p002j0961L826J5769J1229P053
13237I3313Q050j463m013j284j0084O59o35K8177K7821K208J2550J7445J1429
13224A84173O854J7395L8126M4965M7774O6755O6708Q4471K33228L80817O02747
$$ y = [28249, 25250, 51696, 58317, 49257, 70370, 78830, 66467, 62185, 53906, 36912, 41664, 52559, 43321, 32404, 39452, 58638, 55495, 67499, 78259, 83629, 70539, 51547, 50387, 61382, 72521, 79896, 63194, 72077, 76750, 73870, 64743, 55829, 54948, 62660, 67026, 66779, 65500, 61916, 57527, 64632, 77335, 85315, 68224, 63129, 74202, 75098, 52866, 31380, 18698, 26224, 36932, 28066, 32965, 31898, 18837, 17345, 27236, 41222, 75891, 76764, 62117, 68529, 81529, 71482, 63609, 61303, 62769, 90159, 110457, 96182, 77325, 77901, 73399, 66397, 55436, 59262, 75031, 86260, 93313, 101363, 99900, 95887, 94603, 84519, 85178, 84543, 112720, 140541, 142749, 155299, 172744, 184173, 191027, 208422, 246548, 291513, 339287, 406042, 472750, 557221, 790449, 1171266, 1774013]
13213A774013Q68027M25808l21168l90133n58266m92145l94285k70476j53261
13204D88114r7825o3715l3685k2677j4605k5489l7082k8815q353m957o775j747
13192A42389p781J125n424k0311J110L258k783j1713J5722Q449j7198J1159Q074
13179A26076l770J0979J496j4245j2477j061n401m687m141L409M1688L6150k2721
13166A51295r846j4678j1370R027l296M347P910J2625L5069L3774J7079K4128
13154B56064K1478J8576K9092Q3345J44502J01657j00652j26960o8154p5509q1728
13143B01711k6010q747j2396j405M707J7833J1380o003j6468j6906j0600M974
13131A42070J507r328k0109j8282l028J6705K2070R408L53J9010o36m857R293
$$ y = [1774013, 2642040, 3067848, 2746680, 2356547, 1798281, 1306136, 911851, 641375, 488114, 390289, 326574, 292889, 270212, 255607, 230118, 193036, 164221, 155868, 150911, 144136, 142389, 134608, 135733, 130309, 109998, 111108, 114366, 111583, 99870, 115592, 124041, 106843, 118002, 126076, 122306, 133285, 134781, 120536, 108059, 106998, 101597, 96910, 92769, 96178, 137866, 174016, 151295, 141449, 126771, 115401, 124428, 121132, 125479, 133389, 146014, 181083, 214857, 231936, 256064, 277542, 296118, 325210, 408555, 553057, 654714, 554062, 427102, 358948, 283439, 201711, 175701, 166954, 154558, 153153, 157860, 175693, 187073, 181070, 164602, 147696, 137096, 142070, 143577, 134249, 114140, 95858, 92830, 109535, 131605, 141013, 141366, 160376, 159740, 154883, 164176]
13118A64176K229n710K5058K0995n7471q8749j3670J4601J1383M0548J6647N239
13106A35276J0016n388p652j8575j7512k0148j8040j3005j4226K909J2389l668
13094D2376P344J1328M006j9264l9163n7170m9452M8859j8583O1894J45742L1713
13082A69630N2138J54003R8287J4203q186l1343m6428m7273m0138j6589j0496
13071B87808K137n025j0238q091k873N757O041j6751K368P918P829q58K0190K0648
13057C16860l582l0332j086K3336m156k0818k9417J847K5181L065J570K8614L3181
13044C44263K8525R438j6838k6050p714J5312J3711N209M405n983k9924k4092
13032C10262J04q363J4578L7917L2405N1244N4249M2896K6034L3284L6151M2363
$$ y = [164176, 166405, 160695, 185753, 206748, 149277, 60528, 46858, 61459, 72842, 113390, 130037, 135276, 145292, 139904, 132252, 113677, 96165, 76017, 57977, 44972, 30746, 33655, 46044, 42376, 49720, 61048, 65054, 45790, 6627, -50543, -99995, -51136, -69719, -7825, 137917, 169630, 221768, 375771, 474058, 488261, 480075, 448732, 402304, 355031, 314893, 298304, 287808, 289945, 284920, 274682, 266591, 263718, 269475, 275516, 258765, 261133, 269051, 276880, 276022, 296212, 316860, 313278, 282946, 281860, 305196, 301040, 280222, 250805, 252652, 277833, 280898, 282468, 311082, 344263, 372788, 382226, 365388, 339338, 331624, 346936, 360647, 365856, 370261, 364278, 334354, 310262, 310366, 302003, 316581, 354498, 386903, 438147, 492396, 535292, 561326, 594610, 630761, 673124]
13020F73124L5275K5934J8715J9960K8279L5224M9247M7684J6167J7804K3088
13009I90501M2518M6186M9091P0323P8744J09246R5416K5162O2210L4201l941
12998A599657L7432K9723N4314R4562Q3176J06214J67164J97188K09133K01062
12988B779625K10904J93250J99116K15877K07077K36361L48512L88888M11575
12979E191185N20336P36817R30491J070225J440772J912120K336703L019707L438462
12970B0596818L014300L759829M366633N008640O258665Q675410J3252795K1839054
12962H6772144L9293594P3347756J32237503J76725177J7249949q4490317q0299466
12955C60836340j05639527r4418430n9853792l2657461j8370670j1238884p333545
$$ y = [673124, 708399, 734333, 753048, 773008, 801287, 836511, 885758, 933442, 949609, 967413, 990501, 1033019, 1079205, 1128296, 1198619, 1277363, 1386609, 1482025, 1507187, 1569397, 1603598, 1599657, 1637089, 1666812, 1721126, 1815688, 1898864, 2005078, 2172242, 2369430, 2578563, 2779625, 2990529, 3183779, 3382895, 3598772, 3805849, 4042210, 4390722, 4779610, 5191185, 5711521, 6448338, 7378829, 8449054, 9889826, 11801946, 14138649, 17158356, 20596818, 23611118, 27370947, 31737580, 36746220, 43004885, 51680295, 64933090, 86772144, 126065738, 199413494, 331650997, 508376174, 525626123, 441135806, 360836340, 255196813, 160778383, 100924591, 68267130, 49896460, 38657576, 31324031]
12948C1324031m722364k890664j761693j859380k484795k119332j845724j604424
12940A2035655j194891r78542j002416r11703p72416o89740p09428o25471m36399
12931D714649l83122m02606l31283k60841k32030j47055j38713j47643j53211
12922B518145j20122j26053j03344j03730j40302r0100p2299q2545q9628r8747
12912A491275n9581q6825j01451q8066p0391k9627l7737j05750j42169o3810j0068
12901F95800N421q727j4706l2877k5023k3564k4476j1766o708k7633j4838j139
12889E09764K5607N082K5516J5495L012l5074n6823n9641o6331o4543o6849k6902
12877B08313L5797l1594O4966O4615P48J35428J60822M9054M378l846l4676n8906
$$ y = [31324031, 26601667, 23711003, 21949310, 20089930, 17605135, 15485803, 13640079, 12035655, 10840764, 9862222, 8859806, 7948103, 7175687, 6485947, 5776519, 5151048, 4714649, 4331527, 3928921, 3597638, 3336797, 3104767, 2957712, 2818999, 2671356, 2518145, 2398023, 2271970, 2168626, 2064896, 1924594, 1834494, 1762195, 1679650, 1590022, 1491275, 1431694, 1344869, 1243418, 1155352, 1084961, 1055334, 1017597, 911847, 769678, 705868, 695800, 701221, 692494, 677788, 644911, 619888, 596324, 571848, 560082, 553374, 525741, 510903, 509764, 535371, 540453, 565969, 581464, 584476, 549402, 492579, 432938, 366607, 302064, 235215, 208313, 244110, 212516, 277482, 342097, 342845, 478273, 639095, 688149, 692527, 688681, 654005, 595099]
12865E95099n4571m7183l2723j6211k0018k1112k8511j7762j222J3766K8926Q547
12853D07025j4272M892J9239J4032K4131R877j0387j1266j0507j6348j9924l5453
12841C61039m4070l5110j6563j5631J4850J2992N1150R9886J49278O6809O5589
12830G10219J2822L9484J7551K6114m88o3894p8445m9117k4836m273p979J8123
12818E95281N6716L7111L1459J9846R827J8042J1979J7018L0855J8917J7871L9359
12806I04281O8207O4164N9627J6056n3481m8402j1428L6387P7445M3582K6372
12795A182810M0187L3129M0834P2403Q0580N4795L4167N0126P2907Q7440J30213
12784A879591J19603J38258J95115J99527K03854K06042K24912K16813K28761
$$ y = [595099, 540528, 493345, 460622, 444411, 424393, 403281, 374770, 357008, 355786, 369552, 398478, 407025, 392753, 397645, 416884, 430916, 455047, 464924, 454537, 443271, 432764, 416416, 396492, 361039, 316969, 281859, 265296, 249665, 264515, 277507, 328657, 428543, 577821, 644630, 710219, 723041, 762525, 780076, 806190, 805702, 741808, 663363, 614246, 589410, 585137, 577158, 595281, 651997, 689108, 720567, 740413, 750240, 768282, 780261, 797279, 828134, 847051, 864922, 904281, 972488, 1036652, 1096279, 1112335, 1058854, 1010452, 999024, 1035411, 1112856, 1156438, 1182810, 1222997, 1256126, 1296960, 1369363, 1449943, 1504738, 1538905, 1589031, 1661938, 1749378, 1879591, 1999194, 2137452, 2332567, 2532094, 2735948, 2941990, 3166902, 3383715, 3612476]
12775C612476K62604K39541K87525L67913L93921M29254M87671P52684R91358
12766G824947J295713J824672K272962K757091L361304L282404L420946M244042
12758C0284081M866209N844720P642224J1088605J7339081K9350433N2783766
12751A59199119R4398971J49540307J15921626m4459024p3979898q8163252j00000576
12744B12457273p7181694m6475744k6123764j5521519r868339o529347m146332
12737B6610534k606410j925076k436542k423047k100262j899268j581069j168979
12729A0469881r09061q40452q39279p32665o83697o74913n62865m45683m39973
12720D341293m34425l49779k86036j89691j43944j45814j50112j41574j03662
$$ y = [3612476, 3875080, 4114621, 4402146, 4770059, 5163980, 5593234, 6080905, 6833589, 7824947, 9120660, 10945332, 13218294, 15975385, 19336689, 22619093, 26040039, 30284081, 35150290, 40995010, 48637234, 59725839, 77064920, 106415353, 159199119, 253598090, 403138397, 519060023, 474600999, 400621101, 312457849, 212457273, 135275579, 88799835, 62676071, 47154552, 37286213, 30756866, 26610534, 24004124, 22079048, 19642506, 17219459, 15119197, 13219929, 11638860, 10469881, 9560820, 8720368, 7881089, 7148424, 6464727, 5789814, 5226949, 4781266, 4341293, 3906868, 3557089, 3271053, 3081362, 2937418, 2791604, 2641492, 2499918, 2396256]
12711B396256j36428j33174j55257j45743r6204j01697r9000j11384o6600m2314
12701A308455q5584r2737o0301n1089l5575o9860q9832m5390j6771N129K3840
12690G90285J3246r652k1995m6830l3320k4625m1577l9115j5448p751K5827J4948
12678F03993j495J3553N097l011k7610m7080n9445l3442k8332j4563M484j2315
12666C99834l2672m2451l1466j5560Q291J9086J246m206K6016Q407k479k5037
12654C09009l1737r427o258j9379j0136j7051j3207K853K281j810j1599J555J7172
12641B12266J150r228P812n284k3450j2035o137P35j8610l5321l1191l7069k9510
12628A4128k2775k038M544N7397R8367J01591O6735N0620K6495L1471J0039m428
$$ y = [2396256, 2259828, 2126654, 1971397, 1825654, 1729450, 1627753, 1528753, 1417369, 1350769, 1308455, 1222871, 1130134, 1069833, 1018744, 983169, 913309, 823477, 778087, 761316, 766445, 790285, 803531, 793879, 771884, 725054, 691734, 667109, 625532, 586417, 570969, 563218, 589045, 603993, 602498, 616051, 621148, 618137, 590527, 543447, 484002, 450560, 422228, 407665, 412149, 399834, 367162, 324711, 293245, 277685, 285976, 305062, 306308, 302102, 328118, 336525, 334046, 309009, 277272, 267845, 261587, 242208, 232072, 215021, 201814, 204667, 206948, 205138, 193539, 195094, 212266, 213416, 204188, 212000, 206716, 183266, 171231, 165094, 165829, 147219, 111898, 80707, 43638, 14128, -8647, -10685, -6141, 51256, 149623, 251214, 317949, 368569, 395064, 426535, 436574, 432146]
12616D32146l2523l4173m1587l5664o802j0979O333j754j6146j8259j8971j7692
12604B03929k6413l3356j5117m771P950J1228J8028K0822K2390Q170l122k8721
12592A81017o9031n2299j5303K1894K3107L766r734o021j559O319J6680J7845
12580A16681P765j5848k4168j014J947p213j7760j1833K702j4983j5499q272k287
12567A0218L382J5250o40J982p849j7980n2768j08153j51976o9578k610O2749
12555c17973J12179P8402L8469O256K1207L5643L2338R967m222O341J9893J0464
12543D8964M603j7795Q911L2534J1436j0541n643j3442M588J3051L627j2841r610
12530E7842k628N443O669K38M573o83N587Q925L513j2937K727m294r53k930j704
$$ y = [432146, 399623, 365450, 323863, 288199, 281397, 270418, 276751, 274997, 258851, 240592, 221621, 203929, 177516, 144160, 129043, 124272, 132222, 143450, 161478, 182300, 204690, 212860, 209738, 181017, 111986, 59687, 44384, 66278, 89385, 93151, 83417, 77396, 75837, 82156, 98836, 116681, 124446, 108598, 84430, 83416, 85363, 78150, 60390, 48557, 51259, 36276, 20777, 12505, 10218, 13600, 28850, 28210, 30192, 22343, 4363, -48405, -156558, -308534, -378112, -380722, -317973, -205794, -127392, -88923, -82667, -61460, -25817, 6521, 16488, 12266, 18607, 38500, 48964, 53567, 35772, 44683, 77217, 88653, 78112, 72469, 59027, 63615, 76666, 80293, 67452, 57842, 55214, 60657, 67326, 67564, 72137, 71454, 77041, 85966, 89479, 76542, 79269, 74975, 74022, 71092, 69388]
12515F9388K603m690p463j612O198J3594M3n708Q547J5802K9711J9269R919L2138
12501A87739K6950L8645L4434L3816N7974J10530J94869L42907O47667R07451
12491B582982J53701m19747m22089n47905m76959l07613j65328j01784p2986n1136
12481A71136l565M849j7371j0800j3052j1731L206J2376m034o569m327k1596j8081
12468H0441o537k054Q05n620j0118l76N524j844j1835j9257J601J6742L134M005
12454E4611Q362J0885j3265j1897j5411p042O082L977M050M025J4481r067j6200
12441C3591J0539K9950N66R282P443k1168l3109j7247j1j973o878K0490N818J150
12427C8443J8263J7700j427N302q884k5569l9100k297J2826N600j2293q545j882
$$ y = [69388, 71991, 67301, 59838, 58226, 64424, 78018, 78061, 72353, 80900, 96702, 126413, 145682, 155601, 187739, 214689, 253334, 287768, 321584, 379558, 490088, 684957, 1027864, 1675531, 2582982, 2736683, 2316936, 1894847, 1346942, 869983, 562370, 397042, 295258, 222272, 171136, 167571, 172420, 155049, 144249, 131197, 119466, 122672, 135048, 131014, 124445, 120118, 98522, 80441, 73904, 71850, 72655, 67035, 56917, 56541, 62065, 60221, 48386, 29129, 30730, 47472, 50606, 54611, 62973, 73858, 60593, 48696, 33285, 26243, 32325, 36302, 40352, 44377, 58858, 49791, 33591, 44130, 74080, 74646, 83928, 91371, 70203, 37094, 19847, 19836, 17863, 10985, 31475, 37293, 38443, 56706, 74406, 72979, 78281, 69397, 43828, 4728, 2431, 15257, 20857, 8564, 19, -1863]
12414a863k642Q796K661R200L517p61Q73m902o23J3041m246m694K566M800j857
12399B3866J854O670R53N16m257J0573q054j1585K81j764j153j484j147j9166
12385c897j6926j8993Q745O413J276J5350K6222P597o365o073o168l640j860J820
12371C501N930P936O42M670p506m829N074n39J482J0725p645j3252n918j999o650
12356h378J4009J0876j176o474J3678P327m108o895N056q861j8992o668o515Q227
12342h894k687K897J6860P057J007O505o315j7996l956k495M478J1243j0171j2246
12328a4713J0389J8682K017O417N234m428l856n801M966j7199rm04J2566N458
12314A9319N868J222r978q871J8874J2384q393o116n632N80O749J700J716J5900
$$ y = [-1863, -4505, 4291, 6952, 16152, 19669, 18908, 19781, 14879, 14256, 27297, 23051, 18357, 20923, 25723, 23866, 25720, 32390, 33343, 33859, 29602, 40175, 32121, 20536, 20817, 19053, 17900, 16416, 15269, -3897, -20823, -39816, -31071, -24658, -23382, -8032, 18190, 25787, 19422, 13349, 7181, 3541, 1681, 3501, 9431, 17367, 18009, 22679, 15173, 10344, 15418, 14879, 16361, 27086, 19441, 6189, 271, -1728, -8378, 5631, 16507, 15331, 8857, 22535, 29862, 25754, 18859, 23915, 15054, -3938, -10606, -17121, -8894, -11581, -8684, 8176, 15233, 16240, 22745, 16430, -1566, -5522, -8017, -3539, 7704, -2467, -14713, -4324, 14358, 16375, 22792, 28026, 23598, 19742, 13941, 18907, 1708, 1699, 1295, 13861, 19319, 25187, 26409, 16431, 7560, 26434, 38818, 30425, 24309, 18677, 19257, 26006, 27706, 29422, 45322]
12300D5322J204j1894K947N137n06M014J0922J4506J5255K1114K6347K2459K8859
12287A85686J6155K2774J9381N3633Q3466J46881K49662M38248P05083P24327
12277B645296k0982l81577m55041n29497m37103k91015j60762j01143n4245l7894
12267A76037k9521j2422N221j4789k4185q922q311j2894k385M91j2637r111j9320
12254B7252j7606j0701l243M957l27R702j091p606m039k744m249L291Q421p351
12240e334N317J1967o066N256N927j5025m083R778k475k272k927O487O973M410
12226A7933m411Q309M88o566o126j2287j1760N837R502O130o397R85l745q190
12212a0298J8573p95N051o531k06j526j0595m667k148J7578J533K185L182N45
$$ y = [45322, 46526, 34632, 37579, 42716, 42210, 46224, 57146, 71652, 86907, 108021, 134368, 156827, 185686, 201841, 224615, 243996, 297629, 381095, 527976, 777638, 1215886, 1920969, 2645296, 2624314, 2242737, 1787696, 1258199, 821096, 530081, 369319, 268176, 213931, 176037, 146516, 134094, 139315, 124526, 100341, 91419, 83108, 70214, 67829, 68320, 55683, 46572, 27252, 9646, -1055, -4298, 659, 332, 10034, 8943, 1337, -2702, -5446, -9695, -6404, 2017, -5334, -17, 11950, 5884, 11140, 17067, 2042, -2041, 7737, 5262, 2990, 63, 6550, 13523, 17933, 13522, 21831, 22319, 15753, 9627, -2660, -14420, -8583, 919, 7049, 652, 1637, -2108, -10298, 8275, 7480, 12531, 6000, 5794, 4268, -6327, -10994, -13142, 4436, 5969, 8154, 11336, 11881]
12198A1881L476K694o58Q541j464l282n718n193N213N848M864j1280j2138o107
12184c323J398l358O702O292J406j4360j4016M595k612Q592J3300J2794P525q486
12170A6449m834J4779P896j0456k0753o619N945J813o391J970o538k008R703J0711
12156A1667j009j5520k742K894j559K133j3419O368j929M321M387J444m595l521
12142a1080K660R753L393j4991J0024J5617m068l646m993K069q027J1434k370
12129E775j16P434R76m099r233n211Q076Q29L978O73l06j1660J171k923m333q891
12113a7860j1465N108O581n910M737Q929n808m255m827q322J1584K5353M240n916
12099B169J6320J027j0719j2702j6261Q477l427m102J2593J4526K638j710j1386
$$ y = [11881, 15357, 18051, 17393, 25934, 24470, 21188, 15470, 10277, 15490, 21338, 26202, 14922, 2784, -3323, -1925, -5283, 1419, 7711, 9117, -5243, -19259, -14664, -17276, -8684, 4616, 17410, 24935, 16449, 11615, 26394, 34290, 23834, 3081, -3538, 2407, 4220, -2171, -201, -6739, -8747, 956, 11667, 10658, -4862, -7604, -4710, -6269, -4136, -17555, -11187, -13116, -8795, -4408, -2964, -7559, -11080, -8420, 1333, 4726, -10265, -241, 15376, 11308, 7662, 2669, 4738, -3289, 8145, 5775, 5659, 13093, 14069, 9970, 737, -4474, 3602, 4431, 8409, 9082, 8776, -2884, -1713, -4636, -8969, -17860, -29325, -24217, -17636, -23546, -18809, -9880, -15688, -19943, -24770, -33092, -21508, 3845, 8085, 2169, 18489, 19516, 8797, -3905, -20166, -11689, -15116, -19218, -6625, 7901, 10539, 8829, -2557]
12086b557j0666Q94M272J615o90P880J0215O630o223k767J1205k024p371q553
12072A860k344p074J2513J613j2937j366r161L482J1219j1732K099p161p54L254
12058a6489n5p660m747J3574Q485M745M823m277O448J0198N008R674o500r507
12044A3720p617J0O671p159o767P71J5907q936j9193m757k756M73P007J1883K111
12029A368j566Q171n427k746J3551k318p137l157m909m56O309j164j0180o413
12015a6074K529L70R738J2140Q56L777J3783p878j6915j9916j5866K082J7479
12002a3895K3012K732N358q508l192n332k965N527j524O611o080k120N463k243
11988B844L173P200P799p057j2566r519k3269k253R299J5943J6439O610m757j1762
$$ y = [-2557, -13223, -12329, -8057, -6442, -7132, 748, 10963, 17593, 11370, 8603, 19808, 17784, 10413, 1860, -484, -7558, 4955, 6568, -6369, -7735, -16896, -13414, -2195, -13927, -11828, -18989, -19743, -16489, -16544, -24204, -28951, -15377, -6892, -2147, 2676, -1601, 4847, 15045, 20053, 29727, 23227, 13720, 6103, 6113, 12784, 5625, -1142, -371, 15536, 6600, -12593, -17350, -20106, -19633, -12626, -743, 1368, -198, 7973, 2546, -200, 13351, 11033, 3896, 739, -4170, -4626, 1683, 519, -9661, -16074, -13545, -13175, -3437, 8703, 9559, 13336, 27119, 19241, 2326, -17590, -33456, -31374, -13895, 9117, 11849, 17207, 8699, 5507, 175, -2790, 2737, 1213, 7824, 1744, -376, 5087, 2844, 6017, 13217, 21016, 13959, 1393, -8126, -31395, -33648, -24349, -8406, 8033, 14643, 9886, -1876]
11974a876M37q814r351J8958P724Q607N300n881j1223j3672N121P876j824l261
11960a879q690l284P638j492j066J6358N925k569j2256L258J19l93j328l155r34
11945c748N445l239K671o394P080p611j8804Q025J2030M834l003o308K929J857
11931d236k055P233m799l592O21n547n750l144p8m04J7076J3114O220l208n893
11916E558j3237q655j245q47m050o209R810J3775J2851L634L658j5233j9029k318
11902b1537J3474O310j117j274O954P834J9N418Q116q033o609p376r119J4274
11888G334q30p458J762K568M821K689Q856p338o536J005J2562m834p710R0l113
11873C868p867j3445P377K0698K934R96K511j82m531j0453j198K927j1159N977
$$ y = [-1876, -1439, -10253, -19604, -646, 7078, 15685, 20985, 15104, 3881, -9791, -4670, 3206, 1382, -1879, -10569, -13853, -6215, -7707, -8773, 7585, 13510, 10941, -1315, 1943, 2062, 1669, 341, -2814, -3748, 1697, -1542, 1129, -5265, 1815, -5796, -24600, -16575, -4545, 289, -2714, -9022, -6093, -4236, -6291, 942, -3857, -7449, -6828, -12375, -18125, -21269, -21347, -21751, -4675, 8439, 14659, 11451, 5558, -7679, -16334, -17579, -18426, -22476, -28685, -18875, -5100, 7751, 11385, 15043, -190, -19219, -21537, -8063, -1753, -2870, -4144, 2810, 10644, 10663, 16081, 24197, 16164, 9555, 2179, -6940, 7334, 6504, -954, 808, 3376, 8197, 10886, 19742, 12404, 5868, 6873, 19435, 14601, 6891, 6981, 3868, -3999, -17444, -10067, 10631, 13565, 14561, 17072, 16890, 12359, 1906, 708, 3635, -7524, -1547]
11859a547n064J0492K868Q413P656P876l167k0937j2310O768L916P665j176j1827
11845c74L73J592J7317J949r714o129O715K376j382M751m03j7505q424n32l648
11830a3038j416K413J7817j018n017j3761O052J8212j702j0437q239J1051mM249
11816E162K274j570k778j365j932j0215J5977J3810K360m243m102j6233j2939
11803a5794l838K369k201o961M190K199o139M90O457K094m882N494L322p598L240
11788a7558J0495m532m909J5945J9637k422J92l711p799r032j8084j546J8748
11775d576J6631R278M86j3042j0754n90o086O58N83L132P730J0467N974R848o342
11760B3397j3142n948p053k087l487O332N065j809M208k67j0523O26M730P037
$$ y = [-1547, -6611, 3881, 6749, 15162, 22818, 30694, 27527, 6590, -5720, 1048, 4964, 12629, 11453, -374, -1, 1591, 18908, 20857, 11143, 5014, 11729, 14105, 12723, 17474, 17071, -434, -8858, -9390, -13038, -14454, -12041, 5776, 4758, -259, -14020, -7968, 10244, 8542, -1895, -10134, 917, 913, 5162, 7436, 5866, 3088, 1723, -209, -10424, 5553, 19363, 21723, 17480, 13378, -2855, -15794, -19632, -17263, -19464, -26425, -22235, -20036, -26175, -25685, -19228, -17134, -22016, -16522, -13200, -20798, -17558, -7063, -11595, -16504, -559, 19078, 16656, 16848, 13137, 5338, -3694, -21778, -23324, -4576, 12055, 21333, 21819, 8777, -1977, -2567, -8653, -7995, -7412, -4280, 3450, 13917, 19891, 29739, 23397, 10255, 4307, -2746, -4833, -8320, -1988, 3077, 1268, 5476, 5209, -5314, -4688, 42, 7079]
11746G079N199j0352m568J0805P345M754j4414o764K788Q905L435K137k1673J07
11732e217P337r088j1730R352r223J0859J4519K996Q278m788J0351n329N937Q364
11718C2618j6515n948n30l70K732L511J319N600K454j0364j3371j0554M520j2907
11704a7805J1995J8106N27L76j706j2437p458k890J481K07R735J6208J470j9377
11690a568j0704o501Q765L400J451k546r269J436J138k063K070K0528M297O568
11676A7002Q755o555q285L958n73o306j7971j296P907j1227J0959N126r833L109
11662e230K1006j0653j3948P041R366j226J879o044J132Q358o392k423m681K688
11648H73J462N623J2058m85j5659J985K137N38J1462L450L88l596j0252j0047
$$ y = [7079, 12278, 1926, -2642, 8163, 15508, 20262, 5848, -916, 1872, 10777, 14212, 16349, -5324, -5217, 2120, -6968, -18698, -9346, -18569, -7710, 6809, 9805, 18083, 13295, 23646, 18317, 24254, 32618, 16103, 10155, 9625, 9255, 11987, 15498, 16817, 22417, 24871, 14507, 1136, -9418, -4898, -17805, -5810, 12296, 12823, 13199, 11493, -944, -8402, -11292, -9811, -9604, 131, 16339, 17809, -1568, -12272, -18773, -10008, -6608, -5157, -7703, -16972, -15536, -14398, -16461, -14391, 6137, 10434, 17002, 25757, 19202, 10917, 14875, 14302, 7996, -9975, -11271, -3364, -14591, -3632, 1494, -8339, -5230, 15776, 5123, -8825, -1784, 7582, 6356, 8235, 2191, 3323, 11681, 5289, 2866, -1815, 873, 2335, 7958, 20016, 19531, 3872, 5857, 7994, 8532, 19994, 23444, 23832, 20236, 9984, -63]
11634f3p622P422Q228J833J2409M818q741r952j9635n257L751R36R297N723L582
11619F729n2N21k729j0433k283K826J3868M640n686m462J982r731m247L568j228
11604f717J867l657R006L201J552m427p663q202k799J4773J2410M293Q908J018
11590B3563L567K040k8476K82J9444l559j2022k952Q61q262p261l8J8801q118
11576b130j2019k707k772N269J0237Q257j6967m963J0639J6792n476r260J0910
11563E810J006j0344l237N923q814M20l032k79J837J2919N797M43L716J7968O77
11548C0810j5067k1582l542r75j438J2734k04J3494N793k1395n768R751r64P741
11534I388N725k760N929J512n069r136m658l283n912j6115J1933R869J6291P443
$$ y = [-63, -7685, -263, 7965, 9798, 22207, 27025, 18284, 8332, -11303, -16560, -12809, -11873, -2576, 3147, 6729, 6677, 7198, 4469, -5964, -8247, -5421, 8447, 13087, 7401, 2939, 4921, -4810, -9057, -5489, -6717, -4850, -8507, 499, 3700, 5252, 825, -6838, -15040, -17839, -3066, 9344, 13637, 22545, 23563, 27130, 29170, 694, 976, 20420, 16861, 4839, 1887, 2748, -5514, -12775, -12813, 5988, -2130, -14149, -16856, -19628, -14359, -4122, 4135, -12832, -17795, -7156, 9636, 4160, -5100, 5810, 6816, -3528, -6765, -842, -9656, -9236, -12268, -12547, -10710, 2209, 8006, 8449, 12165, 30133, 30810, 15743, -5839, -9381, -10356, -11794, 940, 736, 14230, 20023, -1372, -7140, 2611, 1647, 9388, 15113, 12353, 18282, 19794, 14725, 5589, 931, -2352, -8264, -24379, -12446, -2577, 13714, 21157]
11520B1157m873q94m100n525j2916n28P03P322j942j855o890N525O190r177j0096
11505a7899Q255r231o650K571j75m990o713O876K0164P422n170n738K426J4762
11491E910Q019m905j7018j052J3130J0002N990q995j6813Q76l150j8737J765R959
11477a5019j95m955J0182p031O587L406J5661J94n592q674J50m9j3688N297j346
11462a5072o119K453P872R358O990j3017q178J322p786m472N687J9699k415R334
11448E656m87l939k882q646l985O203M63l049q679O240O412O949J5198k665j4280
11433a491j2090m725P25M169R047o435R389O633Q517K435p356K113o237P315k25
11418A1784m429n108J19K2527p254j3587r727r024K099J7895J6129o536j1499
$$ y = [21157, 16284, 15390, 11290, 5765, -7151, -7679, -6976, 346, -1596, -3451, -10341, -4816, 1374, -7803, -17899, -9644, -18875, -25525, -22954, -23129, -28119, -34832, -27956, -7792, -370, -5540, -11278, -8852, 5910, 13929, 9024, -7994, -9046, 4084, 14086, 20076, 11081, -5732, -4856, -8006, -26743, -24978, -15019, -15214, -20169, -9987, -17018, -10431, -7025, 8636, 8830, 3238, -5436, -5286, -5335, -19023, -13726, -15072, -21191, -18738, -10866, -1508, 5482, -7535, -15713, -14391, -22177, -26649, -20962, -1263, -3678, 5656, 5169, 1230, -1652, -10298, -14283, -8080, -7617, -10666, -19345, -13105, -6693, 256, 15454, 12789, -1491, -13581, -18306, -17581, -13412, -4365, -10800, -1411, 5222, 13739, 16174, 8818, 10931, 4694, 12009, 11784, 7355, 2247, 2366, 24893, 17639, 4052, -5675, -14699, -12600, 5295, 21424, 14888, 3389]
11405C389j558L392j851j5625n500p603J61K2583j332j1338k45L471R136p240
11391a0160J1718j1j131M31M108P347o517j337J0562o928j4377M789N619J5368
11377A9481n850r098P273M756r051j3860j0292N890j0392q515K076L724j468L104
11363b2222q70j213n393O275P855P478R421r45j0494J1198L535N745P310n518
11349A2162J039m29j1320n421n731j0533k614O173R232Q522J3443n411n244K173
11335F041n699j1264N53P290R176J723j770L940r278O801J6576P490J0083q324
11321C3338j3610m696p488j1031K771n280l276N570J973L673Q963k939j0153j3492
11307a5677j2762P078J3861N009p745j873J025P782R47j2890n424J293j629N35
$$ y = [3389, 1831, 5223, 3372, -12253, -17753, -25356, -25195, -2612, -3944, -15282, -15527, -12056, -2920, -10160, 1558, 1547, 416, 847, 4955, 12302, 5785, 4448, 15010, 8082, -6295, -1506, 4113, 19481, 13631, 4533, 11806, 16562, 7511, -6349, -16641, -10751, -21143, -29658, -27582, -23858, -25326, -22222, -23092, -24305, -29698, -23423, -15568, -8090, 1331, 386, -10108, 1090, 4625, 10370, 17680, 12162, 13201, 12772, 1452, -3969, -9700, -20233, -22847, -16674, -7442, 1080, 14523, 9112, 3868, 6041, 342, -10922, -10369, -3079, 6097, 7820, 6050, 9990, 712, 7513, 24089, 31579, 41662, 33338, 19728, 15032, 7544, -3487, -716, -5996, -9272, -3702, -1729, 1944, 10907, 7968, -2185, -15677, -28439, -21361, -7500, -2491, -10236, -12109, -11084, -3302, -2355, -15245, -20669, -19376, -21005, -20470]
11293b0470J7995P275J2450n642K559L108o29j3986l223p360l914O241J1654N432
11279A1490O018j0226J040m303q138j3299j067N102j0167J431J3828N339P800
11266D848L401o527n168n096p283N62J719M996l697Q943K4220p60j3439J084j044
11251F759o709j228m546j5753J0891R427o847O27M327m05J855N755l037p566j4394
11236b0844n423K0360J0929j50n271P753J5886p007m685M400l832j3859j0290
11223a2033L528m88K4303J0630j6445j5229j1170J121K920J1196R492q284k4228
11210b4687j4291Q834M293J594R959j765j6832M152M484J323N287R35J5038n208
11196f884n604j799P80j814J0506M458k651N743K818o181o872j0616O259Q594
$$ y = [-20470, -2475, 4800, 17250, 11608, 14167, 17275, 16646, 2660, -563, -7923, -11837, -5596, 6058, 11490, 17508, 7282, 8322, 4019, -4119, -17418, -18485, -13383, -23550, -22119, -8291, -2952, 4848, 8249, 1722, -3446, -8542, -15825, -15263, -13544, -8548, -12245, -3302, 20918, 20158, 6719, 7803, 6759, 50, -1178, -5724, -21477, -10586, -1159, -8006, -7379, -3052, -3457, -1602, 4153, 1116, -6450, -20844, -26267, -5907, 5022, 4872, -399, 7354, 23240, 16233, 11548, 15948, 12116, -1743, -12033, -8505, -8993, 15310, 25940, 9495, -5734, -16904, -15783, -12863, -1667, 7825, -459, -24687, -38978, -30144, -25851, -24257, -14298, -16063, -32895, -28743, -24259, -22936, -17649, -16714, -1676, -6884, -12488, -14287, -13507, -15321, -4815, -357, -3008, 2735, 5553, -628, -7500, -18116, -11857, -3263]
11182c263R42n626p798J0281R440P013O55l503K287M56l619K375O715r308j898
11167E149R367r882j2463j1977Q457K1134J3651p768j5171L237q517l83J1891
11154F725J270k6047j2158J2373P104P558j161O17o805m360N656j882Q394J4490
11140A1774j0929n748J2443J5052N919m244r375p669L883J449M438n075o070p463
11126a615j6225J3752J4425O993N365n08r181p969n329r822J0270j1530n75J1623
11112c26L525N684J0847J5158p423j3225m342p974j2855j6348O309N635J0955
11099d380O722R074M781n512j2958K684J4397K991q446j1486N780L897j2187j1558
11085a6201p347K56J4555n835K820Q310Q424L154J4675j3249j4693O880Q410J0405
$$ y = [-3263, -2321, -7947, -15745, -5464, 3976, 10989, 11644, 8141, 10428, 10884, 7265, 9640, 16355, 7047, 5149, 14516, 4634, -7829, -19806, -11349, 9785, 23436, 15668, 497, 3734, -4783, -5166, 6725, 7995, -18052, -30210, -17837, -10733, -3175, -4336, -3719, -10524, -14884, -9228, -11110, -2716, 11774, 845, -4903, 7540, 22592, 28511, 24267, 14892, 7223, 11106, 12555, 16993, 11918, 5848, -1615, -17840, -4088, 10337, 17330, 22695, 22187, 13006, 5037, -292, -10114, 156, -11374, -11949, -326, 3199, 8883, 19730, 34888, 27465, 14240, 9898, 1924, -10931, -27279, -20970, -15335, -4380, 2342, 11416, 16197, 10685, -2273, 411, 14808, 17799, 9353, -2133, 3647, 7544, -4643, -16201, -23548, -23292, -8737, -14572, -11752, -3442, 4982, 8136, 22811, 9562, -5131, 1749, 10159, 20564]
11071B0564k887r900j0375p041m018J084k671J312l278j3245K144J1344L990J0563
11057b414r015J2710K735q804k4599K39J3665n507O244l661N528n376O211j41
11043a2185J128o745n584R705Q258K565j155p518k548R036L450M594O546N746
11029A5293l70j0179n496n346n444Q276Q473r61J782m812l651J6745O827p759
11015A3378j3699m44M359L463j1467j496l405p191R412M904M768M59M156J4743
11001B1940J0673L052n757n176j319j0020r534j2476N664L607m6M261L315o970
10987A214j1087n745O745K0444O330O039o951j2566J850L877J331J602J267j2294
10973B056m093J6399L517J394j2302j2001k567r8J3687J615r673p62K71n346j8698
$$ y = [20564, 17677, 7777, -2598, -9639, -13657, -12573, -15244, -13932, -17210, -30455, -28311, -16967, -12977, -2414, -11429, 1281, 4016, -4788, -29387, -29148, -15483, -20990, -14746, -18407, -12879, -18255, -12044, -12185, -11057, -17802, -23386, -13681, -5423, -2858, -4013, -11531, -14079, -5043, -1593, 3001, 9547, 15293, 14923, 4744, -752, -6098, -11542, -3266, 5207, 4246, 6028, 1216, -2435, 14310, 21137, 13378, -321, -765, 3594, 7057, -4410, -5906, -9311, -16502, -7090, -2186, 2582, 3041, 7197, 21940, 32613, 35665, 29908, 24732, 23413, 13393, 3859, -8617, -2953, 654, 608, 4869, 8184, 1214, -9873, -15618, -8873, 11571, 17901, 23940, 16989, 4423, 6273, 10150, 11481, 13083, 14350, 2056, -2037, 14362, 17879, 19273, 6971, -5030, -7597, -7695, 5992, 7607, -2066, -2828, -2557, -7903, -26601]
10958b6601m947Q066J2211J9704P686n300o923N138J1548o445j6292o938M064
10945e029N203K1785M670j5366L481j1976j3388n908J2729K4829r649m150j047
10932F184K045R4j484k953k0281N790m21j772N820K3K447n011l181J2970J2210
10917A2480l868p27J849j1031j3861O930Q244L96m718k615J2303j116j802L298
10903E762N595N538j2943j0125J124k589j2280O032M113J2345J0402J131O583
10890B0688j5825j0808m690J3793m54j2461q035J0517J4739N011q642j1796p931
10877a5894J0675J443o080o500P56P402j4524K156K0244J3764o071k1045J1684
10864a990J2958j765j1914q498l666R660P538O068K804R501J181n608k740j6816
$$ y = [-26601, -31548, -23482, -11271, 8433, 16119, 10819, 3896, 9034, 20582, 14137, -2155, -9093, -5029, 174, 21959, 26629, 11263, 14744, 2768, -10620, -16528, -3799, 21030, 11381, 7231, 6184, 8229, 8323, 6839, 3886, -16395, -10605, -11026, -12798, -6978, -6955, -4508, -9519, -12700, 270, 12480, 8612, 7885, 9734, -1297, -15158, -8228, 16, 412, -4306, -6921, 5382, 4266, 2464, 5762, 11357, 16895, 3952, -6173, -5049, -7638, -19918, -13886, -9773, 2572, 12974, 14105, 20688, 4863, -5945, -10635, 3158, 2704, -9757, -17792, -7275, 7464, 12475, 3833, -7963, -15894, -5219, -3776, -9856, -16356, -15600, -8198, -22722, -20566, -322, 13442, 7371, -13674, -1990, 10968, 9203, -2711, -11209, -14875, -5215, 2323, 8391, 11195, 20696, 21877, 16269, 13529, -3287]
10850c287l774P983r76o775L547J1822N486p277p952O152p759k639m50J1113l200
10835B014J574n62j5912j000n469l983k865M246m017J0912O802l469Q13j122n801
10820a7839J0644l33l935J2619r40r66J1266j0731j25J2793j6755r427L885J2644
10806B800l823l146M327J107l765j462L095J2405P882J127o606r547O60K839j1669
10791c776j5261L256J2007J6997m299j4498r288O575R445R219j2551o600J7496
10778H722m414j0063k999l588J4407n132q604J1842J4787q237m82M904J1110N560
10764B7813j4111j0705k451j0939R80m041J571k059L522m779p210P05J315k496
10750b2885n567Q954Q296L877k612j5262p951K03J8979N600m641K244P659l268
$$ y = [-3287, -7061, 922, -54, -6829, -3282, 8540, 14026, 6749, -1203, 4949, -2810, -5449, -5899, 5214, 2014, 3588, 3026, -12886, -13886, -19355, -23338, -26203, -21957, -25974, -15062, -8260, -11729, -10916, -12038, -17839, -7195, -7528, -11463, 1156, 216, -750, 10516, -215, -340, 12453, -4302, -13729, -9844, 2800, -1023, -4169, 158, 1265, -2500, -3962, -867, 11538, 19420, 20547, 13941, 4394, 5054, 7893, -3776, -19037, -15781, -3774, 13223, 8924, -5574, -14862, -8287, 1158, 10377, -2174, -8774, 8722, 4308, -5755, -8754, -12342, 2065, -3067, -11671, 171, 14958, 6721, 6239, 11143, 22253, 27813, 13702, 2997, 546, -10393, -9413, -13454, -11883, -13942, -10420, -15199, -22409, -21704, -20389, -22885, -28452, -19498, -11202, -7325, -9937, -25199, -33150, -32947, -13968, -8368, -13009, -10765, -3106, -6374]
10736f374q974K811M379l701j519K323M024P727M435q560o334l442N075k203J2437
10721B104l631j4935j522J4027j237M27N619K989L940j168P726j038M540l543
10707A4298k557j1700J534M016o932M769n666m500P005P37p761L536p265j1583
10693b2069J5402P864J133l782j1324p080M040j076K815N26K258L32M279o156
10679a2838m651M985r038k204J2524J0790q837o881J612k779M856R909M107m17
10665A138O243k002j0694q893J304Q632o531p848l092J8976J4973l255N395j5466
10651a120o986j2390N716Q268P35N473J2666Q303p996m094l629k951j014p236
10637f255q756m620N334J2472J31m514j1217m869J6796j461M743n735k2132j0004
$$ y = [-6374, -15348, -12537, -8158, -11859, -13378, -11055, -7031, 696, 5131, -3429, -9763, -13205, -8130, -10333, 2104, -1527, -16462, -17984, -3957, -5194, -4767, 852, 3841, 7781, 6613, 14339, 13301, 17841, 14298, 11741, 41, 1575, 5591, -1341, 3428, -2238, -6738, 267, 1004, -6757, -3221, -10486, -22069, -6667, 1197, 2330, -1452, -12776, -19856, -15816, -16892, -14077, -13551, -11293, -10961, -6682, -12838, -17489, -12504, -21542, -23746, -11222, -432, -9269, -16150, -14538, -17317, -12461, -2552, 1555, 1138, 7381, 5379, -5315, -14208, -12904, -4272, -10803, -18651, -21743, -2767, 12206, 8951, 14346, -1120, -8106, -20496, -14780, -6512, -5777, -304, 12362, 20665, 12669, 8575, 4946, 1995, 981, -6255, -15011, -19631, -14297, -1825, -1694, -6208, -17425, -22294, -5498, -6959, -2216, -7951, -30083, -40087]
10623d0087L569J3843J0090L437Q506P374n088r444j180Q826k084J1413K433L934
10609A5542N06j9066r193K2168N607j4992j2272J639P720p20r123q852k631J9527
10595d140M785l21P308j55M771N970L31r000j4878j8173Q523J0552O406r179J350
10580e850O147J607k588n491L151l442L559J089r67J162k550o281o788L829Q259
10565e154M862J023L8o745o530p786l506M027L941L087q297o313J2185J1091J1158
10550G081J2154m5j9797j4221O178R329J041j1609n740J070P222k94o611n458
10536a9700P290R075l12m018J9195m271j0527p538r779J378Q764k287L254l995
10522a3471k400J999j904N768O823j5408p050M550J7439m656L049K235p80M011
$$ y = [-40087, -36518, -22675, -12585, -9148, -642, 6732, 1644, -7800, -8980, -154, -2238, 9175, 11608, 15542, 16048, -3018, -12211, 9957, 15564, 572, -11700, -10061, -2341, -3061, -12184, -21036, -23667, -4140, 645, 324, 7632, 7477, 12248, 18218, 18549, 9549, -5329, -23502, -14979, -4427, 1979, -7200, -5850, 297, 1904, -684, -6175, -3024, -6466, -2907, -1818, -2785, -1623, -4173, -10454, -17242, -13413, -5154, -292, 731, 769, -5976, -12506, -20292, -23798, -19771, -15830, -12743, -21040, -27353, -15168, -4077, 7081, 19235, 19190, -607, -14828, -8650, 679, 1720, -9889, -15629, -14559, -7337, -7631, -14242, -19700, -12410, -3335, -3647, -7665, 11530, 7259, -3268, -10806, -20585, -19207, -10443, -12730, -9476, -13471, -15871, -13872, -15776, -10008, -3185, -18593, -25643, -21093, -3654, -8310, -5261, -3026, -3806, 205]
10508B05q306j9373j3577R235J3868N938N895l731n283l635j82L378L278J1545
10494g45L796k0616r957N148R266J9392j4154r088J769K788J1554L690k666k478
10480b301k007L888N630n916M010J2696j3410r145r83L894Q198l488m855L029
10466g60j1586l798M60r09N109j27o19j920Q046J6531j0496j0389O433J2124j089
10451G010q789R675r14O813J3727o264l130r862n747m125m963O171o370p524j869
10436a6161R408J0663n305l744j817m330o55J2689M852q009j2823M440J374m74
10422i892N438M968j053j668P997J0093j0598O32L684j07M83q70o003M9N949O151
10406A5253l890j9370j624K3778J7666O250j4220q606Q504K788Q45n333l240J5184
$$ y = [205, -8101, -27474, -41051, -31816, -17948, -12010, -6115, -9846, -15129, -18764, -18946, -15568, -12290, -745, 3051, -17565, -27522, -22374, -13108, 6284, -7870, -16958, -15189, -12401, -847, 2843, 177, -2301, -4308, -420, 5210, -706, 3304, 16000, 2590, -6555, -7538, -3644, 4554, 1066, -3789, -760, -12346, -16144, -15684, -16593, -11484, -11611, -12230, -14150, -6104, 10427, -69, -10458, -4025, 8099, 7010, -1779, 7896, 6982, 13795, 27522, 21258, 18128, 8266, 2519, -1606, -6569, -398, -6768, -14292, -16161, -6753, 3910, -1395, -5139, -6956, -11286, -11941, 748, 5600, -2409, -15232, -10792, -9418, -9892, -4454, 514, -539, -2207, 5790, 15883, 5285, 5917, 9601, 9494, 9977, 9107, 3104, 3153, 9102, 15253, 11363, -8007, -9631, 14147, 31813, 38063, 23843, 15237, 23741, 26529, 27374, 22041, 18801, 33985]
10392C3985m317j1900Q760j2775m92J1518K00j0804j2901l484J653M954q132N732
10378A997J873o614k798o885K0608P045M395p161n556p734m740N67r298N211K055
10363g035k296L59J4411P686L447O367j3816q950j1384n642k859M631J5936j5150
10349a4295j012J8075R627j6517j4686L526L732K875J5076P827q918K456j998
10336E768L020n769j315n479j2413l944l26O224J4293M522l608N734J7894L108
10322B7709j2562n480r408R3J3471o293m523Q6O657P01l804O828L294n94p357
10307H818l178m805m958l054J0718J7465o925K541q219p392Q816j657q345J1679
10293A1504K53n195n796j4749r994J9420J7930L179n583J190j1J1089N459j495
$$ y = [33985, 29668, 17768, 26528, 13753, 13261, 24779, 24979, 14175, 1274, -2210, -557, 4397, -3735, 1997, 3870, -2744, -5542, -12427, 8181, 15226, 19621, 12460, 6904, -830, -5570, -5003, -14301, -9090, -7035, -9331, -8972, 5439, 13125, 16572, 22939, 9123, 173, -11211, -16853, -19712, -15081, 855, -14295, -15307, 2768, 12395, -4122, -18808, -15282, -11550, -8675, 6401, 14228, 5310, 7766, 5768, 8788, 3019, 1704, -3775, -16188, -20132, -20458, -14234, 59, 4581, 973, 6707, 24601, 27709, 15147, 9667, 259, 352, 13823, 7530, 3007, 3093, 9750, 10451, 6647, 13475, 16769, 16175, 8818, 5640, 835, -4123, -7177, 3541, 21006, 14081, 16622, 8403, 1011, 9827, 8170, -175, 11504, 11757, 6562, 766, -13983, -23977, -4557, 13373, 16552, 10969, 12159, 12148, 23237, 28696, 27201]
10279B7201L804k5375j5816N64Q920O523K072n063N542O155l337Q439N013j4159
10265A0483j0271o414o350r17Q989q138j0358K695L255l930J1639J4889J2753
10252A8325J6422L134J0473k64j3957k0553m813M126p535J0338K841l531m603
10239A0403k432l314l270J058M050p931j0864l707j180j3304k964K1936l844Q692
10225f671J5386k513j7760m008k964J7236J2160r697m713K312j135K826o070m30
10211f041L589q438J209R725J5355k402L542j8902k400o471p257M718p609J037
10197b0345j040J900K931l617N817j291j2225n672K211K4087K6032r42m344K930
10183A6432J4559J624j6561n813O408j1535k350J2084M740n922l105n332M825
$$ y = [27201, 31005, 5630, -10186, -9622, -702, 5821, 7893, 2830, 8372, 14527, 11190, 19629, 24642, 10483, 212, -6202, -12552, -13469, -4480, -12618, -22976, -20281, -17026, -20956, -9317, 5572, 18325, 34747, 37881, 48354, 48090, 34133, 13580, 8767, 12893, 5358, 15696, 18537, 15006, 10403, 7971, 4657, 1387, 2445, 6495, -1436, -12300, -16007, -17187, -30491, -33455, -11519, -15363, -6671, 8715, 6202, -11558, -15566, -18530, -1294, 10866, 1169, -3544, -1232, -2367, 459, -5611, -6041, -2452, -10890, -9681, 44, 15399, 12997, 16539, -2363, -4763, -11234, -18491, -13773, -21382, -20345, -21385, -19485, -16554, -20171, -14354, -15645, -27870, -33542, -31331, -7244, 18788, 17846, 13502, 16432, 30991, 32615, 16054, 10241, 16649, 5114, 2764, 14848, 19588, 13666, 10561, 5229, 10054]
10170A0054k300j1498J125J3222j464o684j4808q851J620J845L03P104Q165J026
10156a141p080K572J9931k125q752m392N280L946m925N243J1834J119l869K658
10142B0299j5437q478l59J3548Q039j4855p931o639N448Q337K801M391n086k38
10128C840j879p767l633k2601N1J2523q205o783Q964L070N59J9863M086N969j344
10113F713r854n371M069l186m669J3079l281j7023L238Q266Q086m949l907j0059
10099a8848K572P652r141K807J8112N286p127j153q355K731J1604O383j834J345
10085A2034m019P145L531o586N262j5745m436M514O730k419j2105j682m097N708
10071f165J9240L004j1616l668j537m58k677o27q67L842j9937q483J6247Q931
$$ y = [10054, 7754, -3744, -2619, 10603, 9139, 2455, -12353, -21204, -19584, -17739, -17436, -10332, -2167, -1141, -8221, -5649, 14282, 12157, 3405, -987, 4293, 8239, 3314, 8557, 20391, 21510, 17641, 20299, 4862, -3616, -3975, 9573, 17612, 2757, -5174, -11813, -6365, 1972, 4773, 9164, 4078, 3840, 1961, -5806, -9439, -32040, -31989, -19466, -27671, -34454, -25490, -22420, -21861, -1998, 2088, 8057, 6713, -3141, -8512, -4443, -7629, -12298, 781, -2500, -19523, -16285, -8019, 67, -4882, -8789, -18848, -16276, -8624, -17765, -14958, 3154, 8440, 1313, 160, -8195, -5464, 6140, 12523, 10689, 12034, 8015, 15160, 18691, 12105, 17367, 1622, -2814, 1700, 8430, 6011, -6094, -7776, -11873, -6165, 13075, 16079, 4463, 795, -742, -1200, -3877, -4504, -5371, -1529, -21466, -29949, -13702, -4771]
10057d771p84N042q78L409N913J976j0732j9895J143Q702L805l349O807L806J0928
10042A1122Q970j3270P379M16n011j0176O790R615J324m60K40l498M400j994o519
10027I328n538R300J0401k088j8820j5754N644p55m973J4370k497M869J8973K807
10013B5267m129n478O21j2803j5251Q0k73k131M541P118L352J042m448O96r655
9998a1451m253q565o841K3754J2656L72j3179j359J4367j1396q067J3050Q534
9985G622j1164j5770o772K356l551m173J680J1739m345m70K113K80O37p951J5959
9970a1810J8328k159R57M672j0908j4882J3607M739m466m373M873j653R219L235
9956I379n793r597N717N482j95j4085p566L159J7111J142N043J1190k35K580J021
$$ y = [-4771, -5555, -513, -1391, 2018, 7931, 9907, -825, -20720, -19577, -10875, -7070, -10419, -3612, 194, 11122, 20092, 6822, 14201, 14617, 9606, -570, 6220, 15835, 17159, 16699, 16939, 13441, 17841, 15847, 9328, 3790, 13090, 23491, 21403, 2583, -13171, -7527, -8282, -13255, 1115, -1382, 3487, 22460, 25267, 21138, 15660, 16281, 3478, -11773, -11693, -11966, -14097, -9556, -2438, 914, 1956, -2492, -1796, -11451, -15704, -24269, -31110, -7356, 5300, 5672, -7507, -8866, 5501, -5895, -13962, -912, 7622, -3542, -19312, -26084, -23728, -27279, -31452, -29772, -18033, -22378, -22848, -20735, -20455, -19818, -27769, -11810, 6518, 4359, 5316, 9988, -920, -15802, -2195, 2544, -1922, -6295, -1422, -3075, 6144, 9379, 3586, -6011, -294, 5188, 4993, -9092, -16658, -13499, 3612, 4754, 9797, 20987, 20752, 23332, 24353]
9941B4353K361j6981p704N041m217J0576P550j2777j0685P059o654R279J231O671
9927A5103N490K589j5105j7114j996N255Q405Q488j0019j5915l9j187J2616M08
9913c021j2882n497Q526J1733O908P232n048o631o333j0771J4474K620m998P4
9899c614p436M156k573r142J4215J4774O877j0585n415J1074n324l225j4472n47
9885a1237K566K815J1652J3630p401j1442k793M288M498j19M982m169j3764n72
9871g066l215N27O92O476j3795N985M644K402J6286j364j0547j3334q45J915Q872
9856b367R728o017M672n314j0983J3477R507k392j4863j4947p99k576J812N52
9842b0510K960N336n835O958r172m998N382J2124O581j3597K273O51R407P83L906
$$ y = [24353, 26714, 9733, 2029, 7070, 2853, 13429, 20979, 8202, -2483, 4576, -2078, 7201, 8432, 15103, 20593, 23182, 8077, -9037, -11033, -5778, 2627, 11115, 1096, -14819, -14858, -16045, -3429, -3021, -15903, -21400, -12874, -1141, 5767, 12999, 7951, 1320, -5013, -15784, -1310, 1310, -3688, -3614, -11050, -6894, -9467, -18609, -4394, 10380, 17257, 6672, 1257, 12331, 7007, 3782, -10690, -11237, -8671, -5856, 5796, 19426, 12025, 583, -2210, 2078, 6576, 6457, 11439, 7270, -6494, -7066, -10281, -9754, -9062, -2586, -16381, -10396, -5752, -3350, 12936, 11572, 1025, -12309, -13154, -11239, -2367, 7361, 1344, 6016, 702, -10281, 3196, 12703, 10311, -4552, -19499, -20298, -22874, -21062, -20510, -17550, -12214, -18049, -11091, -20263, -25261, -19879, -7755, -1174, -14771, -12498, -11847, -2440, -1657, 2249]
9827B249j987L57N021p11l812K57m624q759k56j1625j2473L746K0522j40j2935
9812b5170J1601J1698N08O18M008Q936J9j8133n535L183k442j2798j1418R337
9798b5588J3795J491m112q444J605N960j03J6840J2146N251k217j2845j395J0591
9784A2975m048M991N525j0631o550l74L359L13r346q464R86M113l723j4202M769
9769b0307P807Q780J0753l815O131j258r611o068j966J0758L942l011P338l41
9755I132Q888l474m452j0155M873M523j508m725m459J5529j651p793K281j4004
9741f995r614R261J8481m491k2846J1421O539q114m762j6895j1187J0263O055
9728b2884J0348J0731n79L503N871N470K66r281M456r317o535p109L022L783l660
$$ y = [2249, 262, 619, 5640, 4929, 1117, 1374, -3250, -12009, -12265, -23890, -36363, -32617, -12095, -12235, -25170, -13569, -1871, -1363, -745, 3263, 12199, 12218, -5915, -11450, -8267, -10709, -23507, -34925, -25588, -11793, -10302, -14414, -22858, -21253, -15293, -15396, 1444, 13590, 18841, 16624, 3779, 2384, 12975, 8927, 13918, 19443, 8812, 2262, 1888, 5247, 5560, -3786, -12250, -11264, -7151, -10874, -25076, -20307, -12500, -3720, 7033, 3218, 9349, 8091, -1520, -7588, -9554, 1204, 5146, 2135, 9473, 9132, 18020, 14546, 10094, -61, 4812, 9335, 7827, 3102, -1357, 14172, 12521, 4728, 7009, -6995, -16609, -7348, 11133, 6642, -16204, -4783, 1756, -6358, -11120, -28015, -39202, -28939, -22884, -12536, -1805, -2384, 1119, 6990, 12460, 12726, 3445, 7901, -1416, -7951, -15060, -12038, -8255, -11915]
9713a1915L884P607M461m899J057N177j3991q060p275J1331k449m281k742J9174
9699b921J4057J18j444j0399o773P858l451r342J338J2535j3853j2985k075l754
9685c1091J8937J7503r52q819q933N802l95K854J7417l498n639K555J5075m673
9671A6143j0204q348L474J2685R462p793j0543k020N127Q859j015L636l859j3843
9657A761o294P933l939j4010R418J5678Q266k940k1817j8242Q633N64N625R172
9643a92o465O704n470j1913J119J0792p931R192J3690L597o773j3072q774M453
9629a1043P280N90M291O161R148J279m919q345o9r71r12M52l828N069m76p661
9613c954m579p08N573O799J027l947j4896j0263O835m955m402J9233R272l753
$$ y = [-11915, -8031, -424, 4037, -862, 195, 5372, -8619, -16679, -23954, -12623, -15072, -19353, -22095, -2921, 11136, 11254, 9810, -589, -7362, 496, -2955, -12297, -10959, 1576, -12277, -25262, -27337, -31091, -12154, 5349, 4397, -4422, -13355, -7553, -7948, -5094, 12323, 8825, 3186, 5741, 20816, 16143, 5939, -2409, 1065, 13750, 23212, 15419, 4876, 2856, 7983, 16842, 15827, 19463, 15604, 1761, -4533, 3400, -539, -14549, -5131, 10547, 18813, 15873, -5944, -24186, -15553, -14989, -9364, -192, -6657, 47, -5423, -17336, -16217, -5425, -13356, -4164, 9526, 13123, 6350, -6722, -15496, -11043, -3763, -3173, 1118, 7279, 16427, 17706, 12787, 4442, 4373, 3402, 2490, 2942, -886, 4183, 3707, -3954, -8533, -9241, -3668, 3131, 4158, 211, -14685, -24948, -18113, -23068, -27470, -8237, 1035, -2718]
9599b718n271j1246J4512Q061k637K763n695N282J1738j0750m389P781O280o832
9585F879p684p04j2836q374O449O590J1955P474j9955L44K008l618j3609J9157
9571e924M402M502o181n966P845p85k592R648k354l264l893N186J1260n654%q671
9555b441j75k866O573O26J2422M458j5323j2236J981M298p048m567K128J3602
9541A432l206J4000J2748o646j6125j1242L713p988J3626J2347p623n610N740
9528E166R218j255n588N666l370J2702l407j5995k255N94j5572j0138o51R862
9514a5023J7636O82l049j209R390r621m762J2715L30J639k567n075j2739r721
9500b1374M938N838O322J0222J8372n914n562m321o518k659K404m444m362P329
$$ y = [-2718, -7989, -19235, -4723, 3338, 701, 3464, -2231, 3051, 14789, 4039, -350, 7431, 13711, 6879, -805, -1509, -14345, -22719, -16270, -9680, 2275, 9749, -10206, -9862, -7854, -11472, -25081, -5924, -1522, 2980, -3201, -9167, -1322, -2107, -4699, 4949, 2595, -669, -4562, 624, 11884, 6230, 6230, -2441, -2616, -5482, 1091, 1717, 14139, 18597, 3274, -8962, -6981, -2683, -9731, -14298, -12170, 1432, -1774, 12226, 24974, 18328, 2203, -9039, -5326, -13314, 312, 12659, 5036, -574, 5166, 14384, 13129, 7541, 13207, 9837, 22539, 19132, 3137, 882, 1476, -14096, -24234, -24885, -15023, 2613, 3295, 246, -963, 8427, -1194, -5956, 6759, 7089, 8728, 6161, 1086, -11653, -21374, -16436, -10598, -4276, 5946, 24318, 18404, 12842, 8521, 2003, -656, 1748, -2696, -7058, 271]
9486B71J3818J387j409Q671r590j4412q838r48J1288n816M039K957J2160O854
9472B0432p46k224J708J5452R076r761k7248L107J2975q98r790n170J750N073
9458A3736q36j2211o430n802J7315Q700m982j1726Q092J9571o298k5496O53P837
9444B123J033N040p01j7494j0702J7381K5516j468j1532o683k821j0205R1o915
9430a7337q474J0586P310r285N574N239j6414p206n57J4322n686l721J2163M098
9416i388m784M950k423l286K494n734r251p18J998m397J3039R535P360K028q63
9401E60J966J7679l853M000n596M89O799l103n382p364k975J400l579O646O065
9386A3752K132q20J1336j0976k0796j9510k742J9914O471M048L027m621K838N617
$$ y = [271, 14089, 15476, 14067, 22738, 13148, -1264, -10102, -11050, 238, -5578, -1539, 1418, 13578, 20432, 19686, 17462, 19170, 34622, 43698, 33937, 6689, 9796, 22771, 21873, 12083, 6913, 8663, 13736, 12900, 689, -5741, -11543, 5772, 14472, 9490, -2236, 5856, 25427, 19129, -6367, -5714, 2123, 3156, 8196, 7495, -9999, -20701, -3320, 22196, 20728, 9196, 2513, -308, -10513, -10422, -17337, -25811, -15225, -7915, -17200, -11626, -6387, -22801, -30007, -30564, -16242, -21928, -25649, -13486, -9388, -14172, -9222, -11645, -14931, -12437, -18171, -27422, -28140, -26142, -30539, -17500, -7965, -605, 1423, 560, 2526, 20205, 16352, 20352, 14756, 15245, 22044, 18941, 13559, 6195, 3220, 4620, 1041, 7687, 13752, 15884, 15064, 26400, 15424, -5372, -24882, -27624, -7710, -1239, 2809, 5836, 1215, 4053, 9670]
9372I670R910N3q737k087j7989p664J675j3740p92P647N974P701O079r799K984
9357i115J1114Q752N227n03l958l743m351J334n809l689l057L011Q417k73O798
9342A0155M830M292Q192k2498o248J893o403j160J882L862j0021j116k519k823
9328a7682J1292K546j0167k691r84Q786R151j0151m130K599N532P049m767j1041
9314a4658o407J2198j287m927l235Q18J6346J3892J1164m88l439j1016k489L186
9300I658L668k423M018N910K28L754m892o653j9803j2839q08J2078O869L822J4490
9285A7077M14p54j633M938N603P034l642l022L103K838O690q784j6877j1169K637
9270D453K275Q062k12j375P99K22m933j2347O452L122j786k364j998j5795m717
$$ y = [9670, 19580, 19633, 10896, 8809, -9180, -16844, -15169, -28909, -29701, -22054, -16080, -8379, -2300, -12099, -9115, 1999, 10751, 15978, 15475, 11517, 7774, 3423, 4757, -1052, -4741, -7798, -4787, 3630, 3357, 10155, 14985, 19277, 27469, 4971, -1277, 616, -5787, -6947, -5065, -1203, -11224, -12340, -14859, -17682, -6390, -3844, -14011, -16702, -17686, -8900, 251, -9900, -14030, -11431, -5899, 1150, -3617, -14658, -21065, -8867, -10154, -15081, -18316, -17498, -1152, 12740, 23904, 23416, 19977, 8961, 6472, 9658, 13326, 10903, 14921, 20831, 21059, 24813, 19921, 13268, -6535, -19374, -20182, -8104, -1235, 2587, 17077, 17491, 16737, 15104, 20042, 25645, 32679, 29037, 26015, 29118, 31956, 38646, 29862, 12985, 1816, 4453, 6728, 14790, 14578, 13203, 14002, 14224, 9291, -3056, 3396, 6518, 4732, 2368, 370, -15425, -20142]
9255b0142J1195J3997O437L195K253P367j054n235o779O089M523m552l31j0540
9241F423L658p745L142R289Q856j2863q888j2697o578N770L238M978J2826r645
9227b36k434P746J2541R3k619M87J64n066L749L906L96N758l85n673Q216j9123
9211G520l690Q590M112q968j3528J880J8912Q803M089n033K118J0364k347j4646
9197A8176k084k111m356k194j211R510M820R671J0334l973p344N131K290m475
9183C2184L014m490r19n791K875n507m490K6642K1065k307N239K9330J3409R376
9169A19630J9758J3476L5886L7771L3889L6716O3058P5300J03625J73502L02913
9158A015524O27933J232973J344904N60752l63268j337132j263114o89093l47547
$$ y = [-20142, -8947, 5050, 11487, 14682, 16935, 24302, 23248, 18013, 11234, 17323, 21846, 17294, 16963, 6423, 10081, 2336, 5478, 14767, 23623, 10760, 1872, -10825, -17403, -11633, -8395, -3417, 9409, -236, -2670, 5076, 17617, 17710, 15091, 15578, 15742, 10676, 14425, 18331, 18727, 24485, 24100, 18427, 26643, 7520, 3830, 12420, 16532, 7564, -5964, -4084, 14828, 23631, 27720, 22687, 24805, 35169, 32822, 18176, 16092, 13981, 9625, 7431, 6220, 15730, 20550, 30221, 40555, 36582, 29238, 34369, 36659, 32184, 35198, 30708, 29789, 23998, 26873, 21366, 16876, 43518, 64583, 62276, 67515, 96845, 110254, 119630, 139388, 152864, 188750, 226521, 260410, 297126, 360184, 435484, 539109, 712611, 1015524, 1643457, 2876430, 4221334, 4782086, 4418818, 3081686, 1818572, 1129479, 781932]
9149G81932j89396j33823r4693o2293n7734k9713j3591j5146k6547k4727r104
9138A25165r883j837j456Q809j4409j9243o039q193o795k524j9515j7144o360
9125B0576P022J2838m233R169J8494j3397j7859j862l785j0009j0611O099j708
9112A0734n095k638O973P274O965J933l460o275m571J4627Q686j8153q382j091
9098G527L310o146q193K557J1795q34p567J7384J0945j0222J717k042j3506m446
9084B279L696m363p976q824P860R32n16K470O920K665J501m133J106K096j739
9069C974M787N929p943M284J1329k869J20P731j265n764j4265j0349p803O686
9055e418Q732j258p127j956J3752P603o0r5p716j4484k895L739K726J575P092
$$ y = [781932, 592536, 458713, 364020, 301727, 243993, 214280, 200689, 185543, 158996, 134269, 125165, 115282, 113445, 111989, 120798, 106389, 87146, 81107, 72914, 66119, 63595, 44080, 26936, 20576, 27598, 40436, 36203, 45372, 63866, 50469, 32610, 30748, 26963, 16954, 6343, 12442, 10734, 5639, 3001, 9974, 17248, 24213, 26146, 22686, 16411, 11840, 26467, 35153, 17000, 8618, 7527, 10837, 4691, -3502, -945, 10850, 10016, 2449, 19833, 30778, 20556, 22273, 20231, 6725, 2279, 5975, 1612, -6364, -15188, -7328, -6396, -6912, -4442, 2478, 5143, 6644, 2511, 3617, 5713, 3974, 8761, 14690, 6747, 11031, 22360, 19491, 19611, 27342, 26077, 20313, 6048, -4301, -12104, -5418, 3314, 2056, -5071, -7027, 6725, 14328, 14268, 14173, 6457, -8027, -10922, -7183, -4457, -2882, 4210]
9040D210r105N262J3719M173q087J037J4333K485q984r193j397J676M770r528
9026E371l12K372k087o634p620O027j0632j0051M487J0882j031L223P522o154
9012d637K837m903j2989P521J5758q334q451l926N116j3602j5205J5096K4087
8999a632J2984K605j980j2021r604J700p450q338L689R780N273j027M601P320
8985E900P218n766M174J577r783k361j6706j0079J2692J9877j2881l176P535M452
8971B673J1410p998m188Q711J493M817o072j6226j4178J2205Q569J3370L950p170
8957A1366J743R048K967q010l725l402j4804O407Q301j0380l188q37J963r676
8943a2227m552M272l577J4757J4685j3006r937j553R270O996m084n639N212j808
$$ y = [4210, -4895, 367, 14086, 18259, 10172, 11209, 25542, 28027, 19043, 9850, 8453, 10129, 14899, 5371, 5059, 7431, 5344, -1290, -8910, -2883, -13515, -23566, -19079, -8197, -9228, -6005, 1517, -4637, -1800, -6703, -19692, -12171, 3587, -4747, -13198, -17124, -12008, -25610, -40815, -25719, -1632, 11352, 13957, 11977, -44, -9648, -7948, -15398, -23736, -20047, -10267, -4994, -6021, -1420, 5900, 13118, 7352, 11526, 13103, 3320, 959, -15747, -25826, -13134, 6743, -6138, -9314, -1779, 2673, 14083, 6085, 1897, 10608, 12101, 16918, 10846, -5380, -19558, -7353, 1216, 14586, 18536, 11366, 13109, 22157, 25124, 17114, 13389, 9987, -4817, 1590, 9891, -489, -3677, -4514, -2551, -12227, -16779, -12507, -16084, -1327, 13358, 352, -9585, -11138, -1868, 5128, 1044, -4595, 617, -1191]
8929a191j2383j166J8984J1719q073j0699j7322O441J4522l697M273j0718L328
8916e982J1671m447L592j4764j7190Q315p927O088J7221N916P301M907r452J4535
8902A9784O391j1139P86q817O678M484k691k520l782r68j8982j3602J6614M315
8888c449m178k914J5794n01l27p122j538L283p789n248O58Q928J7178J0581m995
8873A8361n610K122J893M597L993m876J0728p994j4225L004j1741l612N445Q501
8859A0586m365j445j359r01l345m527l515o806J1475K0863L046j0314r086J930
8845B237J1618N17j206j9939j0436R707k562j1021M699J3908J1196O812p959o737
8831H34J752j5576Q292J5643o829l103l903J855Q031L541r372J1458p578m47j96
$$ y = [-1191, -13574, -14740, 4244, 15963, 7890, -2809, -20131, -13690, 832, -2865, 1408, -9310, -5982, 5689, 1242, 4834, -9930, -27120, -18805, -26732, -20644, -3423, 2493, 9794, 14701, 5249, 19784, 26175, 15036, 15822, 7005, 13683, 18167, 15476, 12956, 9174, 8206, -10776, -24378, -7764, -3449, -7627, -10541, 5253, 4752, 4425, -2697, -4235, -952, -8741, -13989, -13331, -4403, 12775, 23356, 18361, 12751, 14873, 16766, 21363, 25356, 20480, 31208, 23214, 8989, 11993, 252, -3360, 2085, 10586, 6221, 4776, 3417, 2516, -829, -5356, -8871, -15677, -4202, 16661, 19707, 9393, 307, 2237, 13855, 14372, 13166, -6773, -17209, -7502, -10064, -21085, -16386, -2478, 8718, 15530, 7571, 834, 2586, -12990, -4698, 10945, 4116, 1013, -2890, -1035, 6996, 10537, 1165, 12623, 5045, 4598, 4402]
8816D402o866p137j2442m423P697J1341l693n091M450l451o841r875J239J3066
8802a7624J4519O111J200j5775L332K3740R365j1803r427q335K788M396n109Q259
8788E637N219n016l459O553o442k0704r572J539R059K8878r56n647j1657m439
8774a1007K716J0320J6147P629k895k932j3319j8749r15J8304J1540n045r577
8761B217q760Q568O559L921q121P943J3020o987j5218l165N811j0133m04J7554
8747A2805Q913j990j2958n823p991L272J40j784m122m647Q268K1701L099j3017
8733E866J1068J958j1106p302q418J1743M822M724o54q404j2179j4448O372M684
8719a1274P247L928j3699j3123L309L295K010Q902J0927J15K04M779Q059r096
$$ y = [4402, -2464, -9601, -22043, -26466, -18769, -7428, -11121, -16212, -11762, -15213, -22054, -31929, -30690, -17624, -3105, 3006, 4206, -11569, -8237, 15503, 24868, 13065, 3638, -4697, -1909, 2487, -2622, 5637, 10856, 5840, 2381, 8934, 2492, -18212, -27784, -26245, -17186, 11692, 10736, 5089, -6568, -11007, -8291, 2029, 18176, 25805, 22910, 19978, 6659, -12090, -13005, 5299, 16839, 11794, 2217, -6543, 2025, 8584, 12505, 4384, 12327, 25347, 18360, 3142, -23, 5788, -4345, -4749, 12805, 21718, 19728, 6770, 947, -7044, -3772, -3632, -5416, -9538, -14185, -5917, 15784, 18883, 5866, 16934, 18892, 7786, 484, -7934, 3809, 8631, 13355, 12701, 4297, -7882, -22330, -15958, -11274, -4027, -99, -13798, -26921, -23612, -20317, -18307, -9405, 1522, 1637, 1841, 6620, 14679, 5583]
8705E583o761j165J938k419J1738M817O16o012O871J434j941J5178m200j3979
8691A1698L727O559p734r59p106n277n77k622Q756m523J7602L994j6276J1670
8677A8932Q406p11j3353K418J727J240K405P282o635m071J583l352n746Q440O261
8662B4826k1724o483P716R986k371n789L957L150j468q831l186J0461j025p217
8648B002L264n795L864J582j2469l197j490Q507Q231P600q985j044P31q994J126
8633e067N393K192j0112J497M637N0J053J0589m578q776N59J6583N926j0869j3473
8618d396J3019Q188j493R42J135o29J921K217J4364l80k100M204J269J1155r1
8603D9325o134P319N121j8027p118r09m20M860N391J2201k861m357L39n91m27
$$ y = [5583, -1178, -2343, -405, -2824, 8914, 13731, 14347, 8335, 15206, 16640, 14699, 29877, 25677, 11698, 15425, 21984, 14250, 13291, 6185, 908, 331, -2291, 6465, 1942, 19544, 23538, 7262, 18932, 27338, 26627, 13274, 15692, 17419, 18659, 21064, 28346, 21711, 17640, 19223, 15871, 10125, 18565, 24826, 3102, -3381, 4335, 14321, 11950, 6161, 10118, 13268, 11800, 2969, -217, 10244, 9219, 2002, 5266, -529, 3335, 4917, -7552, -10749, -12239, -3732, 4499, 12099, 3114, 2070, 2801, -6193, -5067, 326, 2518, -7594, -6097, -1460, -1410, -357, 10232, 5654, -3122, -2563, 14020, 19946, 9077, -4396, 8623, 16811, 15318, 16260, 17395, 16766, 18687, 20904, 35268, 34888, 32788, 36992, 38261, 49416, 49325, 43191, 50510, 55631, 37604, 30486, 29577, 29157, 34017, 39408, 51609, 48748, 44391, 44730, 44139, 43712]
8588D3712k732j3499l167p961p634M23J3493p93k1457o024M405J2382J2352j089
8574B2411m819o195J0538K909m012o585q056j0930j2746J024K226o465J7218J9090
8560A5608j6444J687J3822j442j979j6108O639Q997J841R010K947n615k387R82
8546A7558R35q237j5392j22K763L27L14P143K935n575p090P81n880j5784m046
8531b9370o84Q040J4880J0829n416o871j3314O630Q093J809J1684R594m891j6288
8517e275M609n119n461k401O210Q325N520J5984J694j441p710N61l564j4751j724
8502d543P457J511o276J1402J340L255j3857n129M125L241L415K87j2000M318
8488a454n102r925J928R574K918m846J718M243O881k453M002k852k27j286j0780
$$ y = [43712, 40980, 27481, 24314, 16353, 8719, 9142, 22635, 21842, 385, -5639, -1234, 11148, 23500, 22411, 17592, 11397, 21935, 24844, 20832, 14247, 6191, -4739, -17485, -16461, -14235, -20700, -3482, 15608, -836, 851, 14673, 13231, 11252, -4856, 1783, 10780, 12621, 21631, 24578, 18963, 16576, 17558, 18493, 10256, -5136, -5258, -2495, -2168, -1854, 5289, 8224, 2649, -4441, -3660, -9540, -25324, -29370, -30054, -22014, -7134, 3695, -1721, -8592, -21906, -15276, -7183, -5374, 6310, 15904, 11013, -5275, -666, -5785, -11246, -13647, -7437, 888, 6408, 22392, 24086, 22645, 14935, 15496, 11932, -2819, -4543, 2914, 4425, -1851, 9551, 10891, 14146, 289, -4840, -715, 2526, 5941, 6228, -5772, -1454, -6556, -16481, -14553, -4979, -2061, -6907, -5189, -946, 5935, 3482, 7484, 4632, 4405, 3119, -7661]
8473g661O77J125Q120K974J0568J3456M324j3437j9597j029l506P927M401p734
8459F08r700j334M187p270K285Q345J2207k101o747J2966k216k232K818K999l961
8444A0854m854p962N215J935j497l198K211k645J169J780J130p840L384o493j747
8429h558o01j527R479m131p232RR35k033O464m734L566J3730o08k910j3452M975
8413f628M854J4339K840k553l993J826n611P452Q236N851o249r274J2578N095
8399B8763q036r716j1556j425N571l323j904M383j0373p401L108J2932o093l508
8385h578J56R757P186m364J5101R442K453p825j686l920m605o077J100J6222r146
8370A5216j2344o010P862J6765m921p206J4556M224j6904j0713j2328K853R542
$$ y = [-7661, -6984, -5859, 2261, 5235, 15803, 29259, 33583, 20146, 549, -480, -3986, 3941, 8342, 608, -9092, -10426, -6239, -13509, -11224, -2879, 9328, 7227, 480, 13446, 11230, 8998, 11816, 14815, 10854, 6000, -1962, 3253, 5188, 3691, 493, 2704, 59, 1228, 3008, 4138, -3702, -318, -6811, -8558, -9159, -10686, -1207, -5338, -12570, -12561, -11626, -13659, -7195, -11929, -8363, 5367, 4759, 1849, -11603, -6628, -1774, 12565, 15405, 12852, 8859, 10685, 5074, 12526, 20762, 26613, 20364, 11090, 23668, 28763, 20727, 11011, -545, -1970, 3601, 278, -1626, 2757, -7616, -15017, -11909, 1023, -5070, -8578, -8422, 1335, 8521, 4157, 19258, 28700, 31153, 23328, 21642, 17722, 13117, 7040, 8140, 24362, 15216, 2872, -3138, 4724, 21489, 16568, 9362, 23918, 28142, 11238, 525, -11803, -8950, 592]
8357E92Q549r143O44K550j2441K610J1148M431N02r041o983K741k214J0305L959
8342H209r264o37j990R967M959N931j11o454j117K367q141n067q469m489j168
8327a5474J2580o37O9R705P026K588Q861N324m3q991l846R730L225j9829j9978
8312i690j1185J7556M940K188Q797o437j242p011K307J368j1185M482N77J1307
8298F772N083K691q354O80L546K920r91M019k688q415p519R212J0076J526M436
8283B2994m133K221j2095m682p026J470O837q697p738l047Q975m989J2504M606
8269G200K659k738o91J855Q391n414q495O067P734l278J0613J3497l254j7577
8255A6569m443n647p129l233P667P069j0802j1784q848P96l53k220P242J4113
$$ y = [592, 9141, -2, 642, 3192, -9249, -6639, 4509, 8940, 9442, 401, -6582, -3841, -6055, 4250, 8209, -1055, -1692, -3682, 6285, 11244, 17175, 17064, 10610, 9493, 11860, 3719, -1348, -9817, -14306, -15474, -2894, -3531, -3462, 6243, 13269, 15857, 24718, 30042, 29999, 21008, 17162, 26892, 30117, 10288, -9690, -20875, -3319, 1621, 3809, 12606, 6169, 4927, -2084, 223, 1591, -9594, -5112, -4535, 6772, 11855, 14546, 6192, 6872, 10418, 13338, 12347, 16366, 13678, 5263, -2256, 6956, 17032, 18558, 22994, 18861, 21082, 8987, 4305, -2721, -1251, 5586, -3111, -10849, -13896, -4921, -9910, 2594, 7200, 9859, 7121, 6430, 8285, 16676, 11262, 2767, 8834, 16568, 13290, 23903, 37400, 34146, 16569, 12126, 6479, -650, -3883, 3784, 10853, 51, -11733, -20581, -19785, -20138, -22358, -15116, -1003]
8241a003L440j3016n359N921p629j275M608j94J4552J4562k265q968J4495J708
8227A9577j2466j382j6297k135P602m921m455R54Q335l835p762J0701M636k580
8213d028j113L153J0695j1370o982n641j463Q329O823O179J642q377j5122m497
8199b1772K751j869J9577J2536p605j1723j1709K695Q445K091P927j1812m187
8186a4655O950p1P235M169n834O916r61l752m006l184K7M514O490j1418l508Q151
8170b937o123m437J2951Q640K092j1093P234j737j5225o257j595M306J241Q375
8156d565J0313L28j297j1670j3703m684J1499R132M007q552m222J0838J0876J688
8142I988n981m360j1322p183R576J9171p098J137R19p289K871j884Q421o066N122
$$ y = [-1003, 2437, -10579, -15938, -10017, -17646, -18921, -14313, -14507, 45, 14607, 12342, 3374, 17869, 19577, 7111, 5729, -10568, -12703, -5101, -10022, -14477, -13523, -5188, -9023, -16785, -6084, -1448, -4028, -5141, -1988, 8707, -2663, -9645, -15286, -16749, -8420, -1597, 4582, 6224, -2153, -17275, -21772, -19021, -20890, -1313, 11223, 3618, -8105, -19814, -17119, -8674, -6583, 1344, -10468, -14655, -7705, -7776, -541, 3628, -2206, 4710, 3749, -3, -4009, -7193, -7166, -2652, 3838, -7580, -11088, -2937, -9060, -13497, -546, 8094, 10186, -907, 6327, 4590, -10635, -16892, -18487, -14181, -12940, -4565, 5748, 6076, 4779, -6891, -20594, -25278, -13779, -4647, -640, -9192, -13414, -2576, 8300, 9988, 4007, -353, -11675, -18858, -9282, 9889, 2791, 3928, 4847, -2442, 429, -1455, 6966, 900, 6022]
8127F022p71j7970q214R456R011M505Q635K615j111M726R523o69j6660j0739j8671
8112b0312R847k028k538P958J2880J6016l843m867k401Q304R214k823j4339p362
8098C706K535j975Q366J880j686j4125o581N296O627j1532N49l942M833N290k932
8083c691p242J2093l774o916j1058m706n947J3334J6306P292J1546k173q959m71
8069E634j45o421l715M296J0550Q197n667j1814o241l359j6290K000J4400J4381
8055E806P662p195q272R00q689P136J6003n689j1017J1561O332q820j0683j570
8041f535Q884Q954j5704o045J0084J2344R060q463j1316k422M883q10j282Q540
8027A0172Q358P394O639j1564j444l64m484m373n184n775l47R059L284J959j1187
$$ y = [6022, 5251, -12719, -20933, -11477, -2466, 2039, 10674, 13289, 12178, 16904, 26427, 25758, 9098, -1641, -20312, -10465, -12493, -15031, -7073, 5807, 21823, 17980, 13113, 10712, 19016, 28230, 25407, 11068, 3706, 6241, 4266, 12632, 14512, 12826, -1299, -7880, -2584, 4043, -7489, -6940, -10882, -6049, -759, -3691, -10933, 1160, -2614, -9530, -20588, -25294, -31241, -17907, -1601, 5691, 17237, 15064, 6105, 5634, 5489, -932, -4647, -351, 10199, 18396, 12729, 915, -5326, -8685, -24975, -22975, -8575, 5806, 13468, 6273, -1999, -1099, -9788, -2652, 13351, 7662, -3355, 8206, 14538, 5718, -4965, -6535, 2349, 11303, -4401, -10446, -362, 11982, 21042, 12579, 1263, -1159, 3724, 2914, 1632, 10172, 18530, 25924, 32563, 20999, 19555, 19191, 14707, 10334, 5150, -625, -972, 8087, 11371, 13330, 2143]
8012B143k996j42R219K877o504M074O882K062M565p454J6780J1651nj935o231
7997C4986k999o283j4168n874J8532J4717J6805P954J459j0707k7630j3383K154
7984A5563J1923N582L166R454O06j418K770M029l670j1517l773k0681p764J3027
7970A7297M121k832L547J0475J825P822j0422r714q45k529Q710l37J786R125l550
7955C4479o065O81j364j02p794L457J3130J9009R190J96O499j0307j3571q293
7941C9145j4057j0395r463Q240N483N590M323j824J235J140j9662j5866M95K856
7927b760j1356P569J1057o500j7979j288Q028j5919J1983K0401r19P101O37o067
7913C988k650N915k380j267J31n423N658O259J3572J2327m556k843n544j1729
$$ y = [2143, -853, -995, 8224, 11101, 4597, 8671, 15553, 17615, 22180, 14726, 31506, 43157, 43152, 41217, 34986, 31987, 25704, 11536, 5662, 24194, 38911, 55716, 63670, 65129, 54422, 26792, 13409, 15563, 27486, 33068, 36234, 45688, 46294, 44876, 47646, 51675, 48005, 36488, 32715, 12034, 4270, 17297, 21418, 18586, 22133, 32608, 34433, 42255, 31833, 22119, 21274, 18745, 27455, 27118, 28904, 38029, 34479, 28414, 29095, 27731, 27629, 19835, 23292, 36422, 55431, 64621, 64817, 71316, 61009, 47438, 39145, 25088, 14693, 5230, 13470, 18953, 24543, 28866, 27042, 28277, 29417, 9755, -6111, -5616, -2760, -14116, -6547, 4510, -1990, -19969, -21257, -13229, -29148, -17165, 3236, 2317, 9418, 10055, 3988, 1338, 7253, 4873, 3606, 3737, -1686, 3972, 10231, 23803, 36130, 31574, 28731, 23187, 11458]
7899A1458J0151o076j2833n753J483p41m239N041j0008P671J1004j227Q986P416
7885B2333k832j6849J306J3896j321m345N049R501o379j6300l779N253j5975r45
7871a1387K95j845L469R249Q67K529p427N204N662j3651p199P390P515J0750P19
7856A2140j2713m556N589K607q271j2674l894J9275J1852p334j7563M955j698
7843a2285l174Q02Q448J5935n708j3448q863j1392r417J0987P260R522J180R215
7829i38P9j852p273l921P822J4994J7686N429J617o458m302j7563j2879J2683
7815E124k232n52r034j486L346k877n952M001N646J2572k548j2556R571K806l847
7800A982J0730M051O490o771J071p709j5576O24R490q27J938N501n599p626r775
$$ y = [11458, 21609, 15533, 2700, -3053, -1570, -2311, -6550, -1509, -11517, -3846, 7158, 5931, 14917, 22333, 19501, 2652, 3958, 17854, 16533, 12188, 17237, 26738, 20359, 4059, 280, 5533, -10442, -11387, -11092, -12937, -9468, -219, 648, 3177, -4250, 954, 6616, -7035, -14234, -6844, 671, 11421, 12140, -573, -5129, 460, 3067, -5204, -17878, -21772, -2497, 9355, 2021, -15542, -10587, -12285, -15459, -14657, -6209, 9726, 4018, -9430, -18293, -29685, -39102, -28115, -20855, -11333, -10153, -938, -859, -2711, -9984, -13905, -6083, 8911, 26597, 32026, 33643, 27185, 22883, 5320, -7559, 5124, 2892, 2340, -6694, -8180, -4834, -7711, -13663, -9662, -4016, 8556, 6008, -6548, 3023, 5829, 1982, 12712, 16763, 23253, 16482, 17553, 9844, -5732, -5108, 4382, 3555, 5493, 10994, 5395, -2231, -12006]
7785a2006m514J1785n425l024K1284J3343j3663k314j0479j535j622k941O212
7772d899R783r922j7420m195M312J2118q809j0724K0337N409J282p99p459J3032
7758B046J5208m042j5892j8748J2046N869J0564n337q414P993J1262N864N735
7745B4154k0937q993N001l543j8400R103J7256M91p769Q491o060l556k323l804
7731a0889k041R276Q602L962n875L857o967n335N639M395J115m366p067q507Q7
7716a4114q341L92J6318n323j0786J0223j686Q633j3647m516j200J0126K37j2078
7702b5762m803J3998J6365l995k1068n715M041Q188J1820k174J835k899L466K0061
7688A3358m069j2200k741N055O631M059L772q561j532n40r795j0673J1107J5132
$$ y = [-12006, -16520, -4735, -10160, -13184, 8100, 21443, 7780, 5466, -5013, -6548, -8170, -11111, -4899, 4884, -5038, -22458, -26653, -22341, -10223, -19032, -29756, -9419, -4010, -2728, -3527, -10986, 2046, 17254, 13212, -2680, -21428, -9382, -3513, 7051, 1714, -6700, 1293, 12555, 18419, 24154, 3217, -5776, -775, -4318, -22718, -13615, 3641, 4132, -3637, 4854, -1206, -4762, -7085, -10889, -12930, -3654, 4948, 8910, 3035, 6892, -75, -5410, 229, 4624, 5739, 1373, -5694, -14201, -14114, -22455, -22063, -5745, -11068, -21854, -11631, -13317, -4684, -18331, -22847, -24047, -13921, -13684, -25762, -30565, -16567, -202, -4197, -25265, -30980, -26939, -18751, -6931, -9105, -7270, -10169, -6703, 13358, 9289, -2911, -5652, -597, 6034, 10093, 13865, 5304, 3772, 3232, -6563, -17236, -6129, 9003]
7674I003P815n022l810j791j1243j3224N467J2730J1595o650M309o46m064p768
7660c299m748M583m310J2051P378o483m968N210q523J3243J8640L446j3963q548
7646I709p485k596M398O215K39L439J5187q178j7196j3772n380j663J214K025
7632a3844P657J3069L796K555j835q617P366r720j2315J1378L4027m719j5878
7619A2920j2158P50j0441J3130j0306O07j913J012M812J1026K6414q447j3631
7606A3775m398J0531O137r114o211n548O487n970j3636N813O231o33k701q66m510
7591d613n058l927N255p27j2247p290J781J2615O850r857j1977L52J1072J4255
7577c516O057L472J4543L628n143q540j1118j0070P675m956r519L299J2704K2150
$$ y = [9003, 16818, 11796, 7986, 6195, -5048, -18272, -12805, -75, 11520, 4870, 9179, 8533, 4469, -3299, -8047, -3464, -7774, 4277, 11655, 5172, 204, 5414, -3109, 10134, 28774, 32220, 18257, 9709, 2224, -372, 4026, 10241, 10480, 13919, 29106, 20928, 3732, -10040, -15420, -17083, -15869, -13844, -6187, 6882, 10678, 13233, 11398, 2781, 10147, 427, -11888, -510, 33517, 28798, 12920, 762, 1512, -8929, 4201, -6105, -5498, -7411, -6399, -1587, 9439, 35853, 27406, 13775, 9377, 19908, 26045, 16931, 10720, 5172, 11659, 5689, -7947, -2134, 4097, 3464, 763, -103, -4613, -9671, -13598, -8343, -9070, -21317, -28607, -26826, -14211, -7361, -17218, -29195, -28843, -17771, -3516, 2541, 6013, 20556, 24184, 19041, 10501, -617, -10687, -3012, -7968, -17487, -14188, -1484, 20666]
7563B0666Q22j0258n304n074O904K197k351J1217J0950P68j0668r771j079l717
7549E302N201r139j2831j2576O910J4932J1509L469p187p270r465J5581n452j5855
7535a6871k801l58J5231L773k717Q176l36L208N069M682j6290N795l180j229J3881
7520A6033Q133M35J5713n087n730p505o817n926n60p224J451O782J0115J446L436
7505B4695j7491p181Q678n033p626M004r813l197J734j2494K398J1179J1223R726
7491A0802J872j1715p980R157P644o650j0051L712L762r773L792J1601j414j4445
7477i686P314N239K1K733n82Q944N178M180j6805j9212M275P171Q369q136R300
7462H303M652R774j582j1366j3786O64k213j6346p915R441j079K94K1594M8j5977
$$ y = [20666, 21488, 11230, 5926, 852, 7756, 9953, 7602, 18819, 29769, 30537, 19869, 10098, 9019, 5302, 10503, 1364, -11467, -24043, -17133, -2201, 9308, 12777, 5590, -1680, -11145, 4436, -1016, -16871, -19672, -20030, -4799, -1026, -3743, 4433, 4097, 7305, 12374, 17056, 766, 6561, 3381, 2152, 16033, 24166, 24601, 40314, 35227, 29497, 21992, 15175, 9249, 8689, 1465, 2916, 9698, 19813, 21259, 24695, 7204, 23, 8701, 3668, -3958, 46, -9767, -12964, -11230, -23724, -21326, -10147, 1076, 10802, 12674, 959, -7021, 2136, 9780, 3130, -6921, -3209, 553, -9220, -5428, 6173, 4759, -9686, -2372, 2867, 2888, 5621, 5039, 13983, 19161, 23341, 6536, -12676, -8401, -1230, 7139, -997, 8303, 12955, 22729, 21147, 9781, -4005, -3341, -5554, -21900, -29815, -20374, -21453, -21159, 435, 483, -15494]
7447a5494J6451Q890Q148n736j4982q953m423N161J5768J2357J167n169J2048
7434B5233K4O89Q183k970j2065p253r323j1214J524Q368R921J3597n084j9489
7420A41r906Q683J817k602N039K461L663r266K90Q56j3986k749N043K6748n72
7405A5660k2401k738r25l49P579j2130K344O293L921Q472p646k710p515P703O493
7390B051M488j5636p181M31k705J893N459L896q770R82J3960l892j1481m443K763
7375a8185Q44M262P003j873j2889q861L103O991J0734J4206K320j2045j2786q450
7361b5626r796M13J6240N446Q57p088O109J8204M274n899J2390N54j4867j286
7347g5J980l274j969j7221J812R717m069L853L764M894Q05r575k144L517L141
$$ y = [-15494, 957, 9847, 17995, 12259, -2723, -11676, -16099, -10938, 4830, 17187, 18354, 13185, 25233, 25257, 25946, 34129, 31159, 19094, 11841, 2518, -8696, -7172, 1196, 11117, 24714, 19630, 141, -9765, -1082, 735, -1867, 3172, 5633, 9296, 30, 320, 1176, -12810, -15559, -10516, 16232, 15660, -6741, -9479, -10404, -10753, -3174, -15304, -12960, -6667, -2746, 5726, -1920, -4630, -12145, -4442, 2051, 6539, -9097, -16278, -15847, -18552, -16659, -11200, -7304, -16074, -15092, -1132, -5024, -16505, -20948, -18185, -17341, -13079, -6076, -7949, -20838, -29699, -26596, -19605, -8871, 5335, 7655, -4390, -17176, -25626, -35422, -35009, -18769, -13323, -12466, -19554, -13445, 4759, 9033, 3134, 15524, 16078, 1211, -75, 1905, -1369, -3338, -20559, -18747, -9030, -13099, -9246, -5482, -588, 217, -9358, -11502, -7985, -4844]
7332d844J1607N207n294L981J014N292Q089q004l777m695j7261j0999O790J8353
7318E459J4254Q195L296n036j7787m267q4J930m962r054R244k810n533J1151Q389
7303A2385M112K2j1455j5845j3356M172J1842J1717o326j0105K723J1826M384
7290F096K185m103k365J764R412K078k3741r656J071R550M330l685L027J4890
7276A0853m39j2569j391R21P226j0154j7167M231Q957L087M138L283l58L323o010
7261b069m077r589j0996j75Q557K738J2943o409p035J1518m806L597J5944j2328
7247b187o597j163j778K6926J5683j199k1106j4532J2261K161o741l372J911J1126
7233A1393L28J1461N70o52j6345p619m827q229J244m854O669K191n175O034k315
$$ y = [-4844, 6763, 11970, 6676, 10657, 11671, 16963, 25052, 17048, 13271, 8576, -8685, -19684, -12894, 5459, 19713, 27908, 31204, 26168, 8381, 4114, 4030, 5960, 998, -8056, 1188, -1622, -7155, 3996, 12385, 16497, 16519, 5064, -10781, -24137, -19965, -8123, 3594, -2732, -12837, -10114, 1712, 6096, 8281, 4178, 1813, 3577, 12989, 15067, -8674, -18330, -17259, -7709, -3379, -7064, -4037, 10853, 10414, -2155, -3546, -2625, 4601, -5553, -22720, -18489, -9532, -6445, -2307, 976, 618, 3941, -2069, -6146, -15735, -26731, -26906, -18349, -15611, -2668, -9077, -16112, -4594, -9400, -5803, 10141, -2187, -8784, -9947, -11725, 15201, 30884, 29685, 8579, -5953, 6308, 8469, 1728, -1644, 267, 11393, 11721, 23182, 23752, 23100, 6755, -864, -5691, -13920, -12676, -17530, -10861, -8670, -13845, -7811, -10126]
7218a0126Q663m62k714r674J216K385o150J0943J2801j730o64p072N708P52J0626
7203A4502n746j1824k166K771j699J98n342k40K139k764P006m936K945J7587n934
7188F497j5893L77L917j649p993O796J1020j0364l797q418L592n078J2334J0673
7174B014r48o340J7789R593j4990m805m875p544P230J9041N360j738k180k2640
7160e033N824j099M671o187K698m508j1340j1619j3221k608O349J6900M652K289
7146a2232K079J3139Q147J734m009m542n234n45L188j564j1704o380N043J0859
7132b021J703o787n992j5367j658O569J4715j369q9P09J1091r97Q969K009n888
7117E597m834r375r969Q433J2755J8907r174j0284n20n61K348J3638J851j0338
$$ y = [-10126, -1463, -1925, -4639, -14313, -13097, -10712, -16862, -5919, 6882, 5152, 4488, -2584, 3124, 3876, 14502, 8756, -3068, -5234, -2463, -4162, -3964, -9306, -9546, -7407, -10171, -3165, -8101, -5156, 12431, 6497, -9396, -9019, -5102, -6751, -14744, -7948, 3072, -7292, -11089, -19507, -15915, -20993, -8659, 2014, 1066, -5274, 12515, 22108, 7118, 2313, -2562, -10106, -2876, 16165, 21525, 19787, 17607, -5033, 791, -308, 4363, -1824, 874, -3634, -14974, -26593, -39814, -42422, -36073, -19173, -14521, -12232, -10153, 2986, 11133, 12867, 8858, 4316, -918, -1463, 1725, 161, -11543, -17923, -12880, -2021, -318, -7105, -13097, -28464, -30122, -23553, -8838, -10207, -10296, -9587, 1504, 507, 9476, 11485, 5597, 763, -8612, -18581, -10148, 2607, 21514, 12340, 2056, 1536, 975, 3323, 16961, 18812, 8474]
7103H474J955Q056N609j0075j3764l971R155j2962Q920J8256q013q377M70q244
7089d511k825L6m028o547p534O462J2830L568J2876J5536p087M01L595j4509J596
7074I859l30l950Q316o685k1086l461N260P57k0352m326K40P85J1676J9459J929
7059a909Q741J89j8469j3960l432J2424R996N985Q77k730j337M215r054J035p62
7044h191m638M868O562l343n649l201r600n840O469J4472J1961o080j2523o364
7030b1097n27l409P378J5809R494K049n003j5234n685j59m832j006Q162J1088
7016b972j590m841k738n072k712m497K373J0376L838j2030m332n597Q709K907
7002a8178J5899n139n583J662P447J103Q542J0185m693p934N027Q737j647j627
$$ y = [8474, 10429, 18485, 24094, 14019, 255, -3716, 5439, -7523, 1397, 19653, 11640, 3263, 3733, -4511, -7336, -7300, -11328, -17875, -25409, -18947, -6117, -2549, 10327, 25863, 18776, 19177, 22772, 8263, 9859, 9529, 5579, 13895, 7210, -13876, -17337, -12077, -11320, -31672, -35998, -35758, -34973, -23297, -3838, -1909, 6832, 7021, -11448, -25408, -28840, -16416, -6420, -435, 442, -2288, -3625, 590, -8464, -7429, -8191, -12829, -7961, -1399, -4742, -10391, -13592, -23192, -29032, -22563, -8091, 3870, -2210, -14733, -21097, -21624, -25033, -17655, -1846, 7648, 9697, 4694, -10540, -16225, -16384, -21216, -22222, -14060, -2972, -4562, -9403, -12141, -17213, -19925, -24422, -22049, -11673, -7835, -19865, -24197, -29794, -21085, -18178, -2279, -7418, -13001, -11339, -3892, -2789, 5753, 15938, 11245, 3311, 8338, 17075, 15428, 13801]
6988A3801M430o722k1390l875M844n78o282P657J0960l323l742P816O453P351
6974A7400l068j1023p435J298j7021p934K6723K009K063K0638O929j2626L13r857
6960H409j0014p36K586l631j1769k748K642o726Q212J121k475J5704K715K821
6946F111j76J05q282Q051P052j3979j3107L118J1944J0091m707n672o754p048
6932a3253r862K546J0293n379L044J7806L014J576J037j0818k371j053l965o555
6918a3940o357J0294J66n600Q504O176J0813N743r028j0424M253J4096j318j6648
6904c270q247m09P57j54p075J3932J1169j635j4257j0333M187N310Q706J2501
6890A1182L662n277j0154j1980n60J9057J2266p697j2981J221q22K532N143Q896
$$ y = [13801, 18231, 11509, -9881, -13756, -8912, -9490, -15772, -8115, 2845, -478, -4220, 3596, 10049, 17400, 14332, 3309, -4126, -2828, -19849, -27783, -1060, 949, 3012, 23650, 30579, 17953, 18266, 8409, -1605, -2341, 245, -3386, -15155, -17903, -15261, -21987, -13775, -12654, -15129, 575, 3290, 6111, 5935, 6040, -2242, 5809, 12861, -1118, -14225, -11107, 837, 10928, 6221, 549, -6205, -13253, -23115, -20569, -10276, -15655, -12611, 5195, 8209, 9785, 10822, 4, -2367, -3420, -7385, -13940, -20297, -10003, -9837, -15437, -6933, -757, 10056, 15799, 6771, -3653, 600, 14696, 13378, -3270, -11517, -11926, -11169, -11323, -18398, -4466, 6703, 5068, -9189, -19522, -15335, -10025, -1319, 11182, 14844, 9567, -587, -12567, -13127, 5930, 18196, 10499, -2482, -1261, -2083, 449, 5592, 14488]
6876A4488Q965m618q236r882N884q01p098P88J0185k94l431n53q42m623j2332
6861a2400M660M142P336P77P517N388q442k055n896O472J785m244j1125l586N052
6846d619j76N344P121j120j4791J2396n86r951K069M107r734j824J4185R194O113
6831A7728J0380n949k1465n744j240R479l911j1385Q950M090O098q37L493P756
6817A7443J589k0688r127K070J898Q03N683l759j086J2669l809J608M436m138
6803E592n977J981l823j5827j3426J3518J2730m835n336j0301M034J6591P876
6790B797n240l574R544J4953O155J0900k848k1050k6520p380Q480N325K0995J904
6776A4441p735j250j2085j0494R224M814J3800N00k3579l508J3832K953J3191
$$ y = [14488, 23453, 18835, 10599, 717, 6601, 5800, -1298, -510, 9675, 9381, 5950, 5397, 4555, -68, -12400, -7740, -3598, 3738, 4515, 12032, 17420, 8978, 6923, 1027, 7499, 9284, 5040, -6085, -9671, -4619, -4795, 549, 7670, 6550, -8241, 4155, 3569, -6382, -4313, -206, -9940, -11764, 2421, 11615, 17728, 28108, 22159, 694, -5050, -6290, 3189, -722, -12107, -3157, 933, 7031, 6194, 9687, 17443, 19032, -1656, -10783, -8713, -6815, -6012, -329, -4088, -5174, 7495, 3686, 5294, 9730, 5592, -385, 1596, -2227, -18054, -31480, -17962, -5232, -10067, -15403, -25704, -21670, -5079, 2797, -2443, -6017, 3527, 18480, 24635, 35535, 32687, 11637, -14883, -22263, -13783, -8458, 12537, 14441, 6706, 5456, -6629, -17123, -7899, -3085, 10715, 11215, -12364, -15872, -2040, 913, 14104]
6763A4104J247M84l665l787L93o96p453q237M629l774r485P539P456J848l804
6748c201n695J85j3936O780J7981k666k651Q042P600j7209R359L593k0481j0245
6734b2544J1962O453N88j897K111P801J998l250j83L989l865M311l543j9141n765
6719b0975J2512K851p203R38J1685N114o569J5017P409j3594j5437o426P054M321
6705c303R050m091l217l112J415j6829j1043m362J573Q35J5086J9560O762n749
6691B575n435o821L84N187L113l433R648j301m304j0925r079Q46o18J0159M024
6676e980q78j1440n935N605q943J3273P241J0174r360j9170J2285J484p184M17
6662a8411J4551L81oj2877O274L398N436K1085Q762J564r366O931k034j1350o
$$ y = [14104, 15351, 15835, 12170, 8383, 8776, 8080, 627, -7610, -2981, -6755, -16240, -8701, -1245, 603, -3201, -8896, -8711, -22647, -15867, 2114, -552, -3203, 4839, 12439, -4770, 4589, 8182, -12299, -22544, -10582, -4129, -3541, -5438, -3327, 4474, 6472, 3222, 3039, 7028, 3163, 7474, 3931, -15210, -20975, -8463, -5612, -12815, -11877, -192, 4922, -1647, 13370, 20779, 7185, -8252, -14678, -7624, -3303, 5747, 1656, -1561, -4673, -3258, -20087, -31130, -35492, -33919, -33084, -17998, 1562, 8324, 2575, -2860, -9681, -9297, -4110, -997, -4430, 5218, 3917, -387, -11312, -20391, -19545, -20163, -10004, -5980, -6858, -18298, -24233, -18628, -27571, -14298, -7057, 3117, -6243, -25413, -13128, -11644, -18828, -18411, -3860, -3479, -3485, -16362, -10088, -6690, -1254, 19831, 28593, 30157, 20791, 27722, 25688, 14338, 14332]
6647A4332N827L200n093o133K882J496j2342n384R184l677n32m45J0494N139k2472
6632c524j1918q043m346R184N955P554J4227N446j473k0618O142L874j5525R5
6618a2970O582l847Q234J0728M515M615k2828j462O515O657N678m255j0934P559
6604D787J4408P035K402j1808j1856q258P125M06k013J6159R591K053j1359r315
6590I357o79q825j2674J037j221N48L259L123J3031O880J57N440j0423j3315j2933
6575a7238J721J250L434Q18j1781O926P299L541P009n661l849K123Q447k632M408
6560E815J6090J1072k001n576j8165j3334j5679R263M542k800J7546L343M845
6547A4961j2354j5226K244r0o487j702J0074q26j8231L444J3415l914p45K054
$$ y = [14332, 20159, 23359, 18266, 12133, 15015, 16511, 4169, -1215, 7969, 4292, 3760, 3315, 13809, 18948, -3524, -15442, -23485, -27831, -18647, -12692, -5138, 9089, 14535, 13062, -7556, -1414, 2460, -13065, -12970, -6388, -10235, -2001, 8727, 13242, 17857, -4971, -6433, 82, 6739, 12417, 8162, -2772, 4787, 19195, 26230, 28632, 16824, 4968, -3290, 3835, 4241, 2228, 18387, 27978, 30031, 18672, 9357, 8678, -147, -12821, -11784, -13005, -12457, -9198, -6075, 6956, 13836, 13993, 19433, 9010, -4305, -17238, -15517, -14267, -10833, -10015, -21796, -14870, -7571, -4030, 2979, -2682, -6531, -4408, 4039, 1407, 5815, 21905, 32977, 30976, 25400, 7235, -6099, -21778, -12515, -7973, -10773, 6773, 10116, 14961, 2607, -12619, -10375, -10465, -16952, -18654, -8580, -9406, -27637, -24193, -10778, -14692, -15437, -13383]
6533a3383n082M35P995J3711J525m818l899k204O85n324J3531J3399o237q255
6519B079L39k825K240l780M195p009m892j84Q450K6696J861Q338R992L892r981
6504C9411k2114r139q615O291J5173N231j4306r844O902j3607j3687Q410O176
6491c718P256n852r399M894O331m353l097n386J9444k75n110R714K961p208L524
6476I726r602J0497N619j1539n644K749J0333o73p495N842m060l081l465O741
6462E948j2188l357m543j740p358p812J4473J741R867P124j085M004q071r178
6448a2175J1489M666o410J552J0574J979p034o018o291K481N022N453o53m504
$$ y = [-13383, -18465, -18030, -10035, 3676, 5201, 383, -3516, -5720, -5035, -10359, 3172, 16571, 10334, 2079, 2418, -407, 1833, -1947, 2248, -4761, -9653, -9837, -1387, 25309, 27170, 35508, 45500, 49392, 39411, 17297, 8158, -457, 5834, 21007, 26238, 11932, 2088, 8990, -4617, -18304, -9894, -3718, 3538, -2314, -11713, -6819, -488, -4841, -7938, -13324, 6120, 5845, 735, 10449, 13410, 6202, 9726, 124, 10621, 16240, 4701, -943, 1806, 12139, 11466, 3971, 9813, 5753, 2672, -793, 5948, -6240, -9597, -14140, -15880, -23238, -31050, -16577, -14836, -4969, 2155, 1070, 5074, -2997, -12175, -686, 3980, -2430, -878, 9696, 11675, 4641, -1377, -7668, -5187, -165, 5288, 4635, 131]
$$ [...]
##END NTUPLES=NMR SPECTRUM
##END=
