##TITLE=Analysis number 313453
Compound Code gk 02802
Project Code adrs
Chemist Name endeavour
##JCAMPDX= 6.0         $$ Bruker NMR JCAMP-DX V2.0
##DATA TYPE= NMR SPECTRUM
##DATA CLASS= NTUPLES
##ORIGIN= Bruker BioSpin GmbH
##OWNER= NMR
$$ XWIN-NMR		Version 3.5
$$ Fri Sep  9 08:49:38 2005 GMT Daylight Time (UT+1h)  MAYBRIDGE\NMR@NMR_250MHZ
##.OBSERVE FREQUENCY= 250.131544655141
##.OBSERVE NUCLEUS= ^1H
##.ACQUISITION MODE= SIMULTANEOUS (DQD)
##.ACQUISITION SCHEME= undefined
##.AVERAGES= 16
##.DIGITISER RES= 18
##SPECTROMETER/DATA SYSTEM= dpx250
##.PULSE SEQUENCE= zg30
##.SOLVENT NAME= CDCl3
##.SHIFT REFERENCE= (INTERNAL, CDCl3, 0, 16.457)
##AUDIT TRAIL= $$ (NUMBER, WHEN, WHO, WHERE, WHAT)
$$ ##TITLE= Audit trail, XWIN-NMR		Version 3.5
$$ ##JCAMPDX= 5.01
$$ ##ORIGIN= Bruker BioSpin GmbH
$$ ##OWNER= NMR
$$ C:\u/data/dgb/nmr/ADRS/9120/pdata/1/auditp.txt
$$ ##AUDIT TRAIL=  $$ (NUMBER, WHEN, WHO, WHERE, WHAT)
(   1,<2005-09-09 08:48:55.72 +100>,<MAYBRIDGE\NMR>,<NMR_250MHZ>,
      <created by zg, POWCHK disabled, PULCHK disabled
       configuration hash MD5:
       62 19 C7 07 E1 42 D1 B7 37 6C 3D D0 77 39 F9 E6
       data hash MD5: 64K
       7B 2E AD 3C 4F E5 35 53 6E FB 18 C8 DB D8 87 3C>)
(   2,<2005-09-09 08:49:15.33 +100>,<MAYBRIDGE\NMR>,<NMR_250MHZ>,
      <Start of raw data processing
       ef LB = 0.3 FT_mod = 6 PKNL = 1 SI = 32K 
       data hash MD5: 32K
       D6 17 B4 11 FC 84 74 1C 69 54 52 1E 0B D2 56 02>)
(   3,<2005-09-09 08:49:21.22 +100>,<MAYBRIDGE\NMR>,<NMR_250MHZ>,
      <apk 
       data hash MD5: 32K
       AB 56 B7 03 C9 6F 02 0C 97 E8 31 0F D7 66 DC 02>)
(   4,<2005-09-09 08:49:22.88 +100>,<MAYBRIDGE\NMR>,<NMR_250MHZ>,
      <abs ABSG = 5 
       data hash MD5: 32K
       89 E6 0D C6 F1 FD 5D 15 93 01 A7 81 C4 BC 23 6A>)
$$ ##END=
$$ 
$$ hash MD5
$$ 5A C8 CA EF 93 07 19 D9 07 69 AC E3 B5 23 08 F8
##$RELAX= 
##$RELAX= 
##$RELAX= 
##$RELAX= 
##$RELAX= 
##$RELAX= 
##$RELAX= 
$$ Bruker specific parameters
$$ --------------------------
##$DU= <C:\u>
##$EXPNO= 9120
##$NAME= <ADRS>
##$PROCNO= 1
##$TYPE= <nmr>
##$USER= <dgb>
##$AMP= (0..31)
100 100 100 100 100 100 100 100 100 100 100 100 100 100 100 100 100 100 
100 100 100 100 100 100 100 100 100 100 100 100 100 100 
##$AQSEQ= 0
##$AQ_mod= 3
##$AUNM= <au_zg>
##$AUTOPOS= <2 >
##$BF1= 250.13
##$BF2= 250.13
##$BF3= 250.13
##$BF4= 250.13
##$BF5= 500.13
##$BF6= 500.13
##$BF7= 500.13
##$BF8= 500.13
##$BYTORDA= 1
##$CFDGTYP= 0
##$CFRGTYP= 5
##$CHEMSTR= <none>
##$CNST= (0..31)
1 1 145 1 1 1 1 1 1 1 1 1 1 1 1 1 1 1 1 1 1 1 1 1 1 1 1 1 1 1 1 1 
##$CPDPRG= <>
##$CPDPRG1= <>
##$CPDPRG2= <>
##$CPDPRG3= <>
##$CPDPRG4= <mlev>
##$CPDPRG5= <mlev>
##$CPDPRG6= <mlev>
##$CPDPRG7= <mlev>
##$CPDPRG8= <mlev>
##$CPDPRGB= <>
##$CPDPRGT= <>
##$D= (0..31)
0 1 0 0 0 0 0 0 0 0.06 0 0 0 0 0 0 0.0002 0 0 0 0 0 0 0 0 0 0 0 0 0 0 
0 
##$DATE= 1126252134
##$DBL= (0..7)
120 120 120 120 120 120 120 120 
##$DBP= (0..7)
150 150 150 150 150 150 150 150 
##$DBP07= 0
##$DBPNAM0= <>
##$DBPNAM1= <>
##$DBPNAM2= <>
$$ [...]
##$SUBNAM7= <"">
##$SUBNAM8= <"">
##$SUBNAM9= <"">
##$SW= 20.6930455092707
##$SWIBOX= (0..15)
0 0 3 0 0 0 0 0 0 0 0 0 0 0 0 0 
##$SW_h= 5175.983436853
##$TD= 65536
##$TD0= 1
##$TE= 295.16
##$TE2= 300
##$TE3= 300
##$TEG= 300
##$TL= (0..7)
0 120 120 120 120 120 120 120 
##$TP= (0..7)
150 150 150 150 150 150 150 150 
##$TP07= 0
##$TPNAME0= <>
##$TPNAME1= <>
##$TPNAME2= <>
##$TPNAME3= <>
##$TPNAME4= <>
##$TPNAME5= <>
##$TPNAME6= <>
##$TPNAME7= <>
##$TPOAL= (0..7)
0.5 0.5 0.5 0.5 0.5 0.5 0.5 0.5 
##$TPOFFS= (0..7)
0 0 0 0 0 0 0 0 
##$TUNHIN= 0
##$TUNHOUT= 0
##$TUNXOUT= 0
##$USERA1= <user>
##$USERA2= <user>
##$USERA3= <user>
##$USERA4= <user>
##$USERA5= <user>
##$V9= 5
##$VALIST= <valist>
##$VCLIST= <CCCCCCCCCCCCCCC>
##$VD= 0
##$VDLIST= <DDDDDDDDDDDDDDD>
##$VPLIST= <PPPPPPPPPPPPPPP>
##$VTLIST= <TTTTTTTTTTTTTTT>
##$WBST= 1024
##$WBSW= 4
##$XGAIN= (0..3)
0 0 0 0 
##$XL= 0
##$YL= 0
##$YMAX_a= 342286
##$YMIN_a= -299844
##$ZGOPTNS= <>
##$ZL1= 120
##$ZL2= 120
##$ZL3= 120
##$ZL4= 120
##$ABSF1= 16.45698
##$ABSF2= -4.236193
##$ABSG= 5
##$ABSL= 3
##$ALPHA= 0
##$AQORDER= 0
##$ASSFAC= 0
##$ASSFACI= 0
##$ASSFACX= 0
##$ASSWID= 0
##$AUNMP= <proc_1d>
##$AZFE= 0.1
##$AZFW= 0.1
##$BCFW= 0
##$BC_mod= 0
##$BYTORDP= 0
##$COROFFS= 0
##$CY= 12.5
##$DATMOD= 1
##$DC= 0
##$DFILT= <>
##$DTYPP= 0
##$F1P= 14.0000005364418
##$F2P= -0.99999901652339
##$FCOR= 0.5
##$FTSIZE= 32768
##$FT_mod= 6
##$GAMMA= 0
##$GB= 0
##$INTBC= 1
##$INTSCL= 1
##$ISEN= 128
##$LB= 0.3
##$LEV0= 0
##$LPBIN= 0
##$MAXI= 10000
##$MC2= 0
##$MEAN= 0
##$ME_mod= 0
##$MI= 0
##$NCOEF= 0
##$NC_proc= -3
##$NLEV= 6
##$NOISF1= 0
##$NOISF2= 0
##$NSP= 0
##$NTH_PI= 0
##$NZP= 0
##$OFFSET= 16.45698
##$PC= 1
##$PHC0= -80.46995
##$PHC1= 15.10449
##$PH_mod= 1
##$PKNL= yes
##$PPARMOD= 0
##$PSCAL= 4
##$PSIGN= 0
##$REVERSE= no
##$SF= 250.130016261743
##$SI= 32768
##$SIGF1= 0
##$SIGF2= 0
##$SINO= 400
##$SIOLD= 32768
##$SREGLST= <1H.CDCl3>
##$SSB= 0
##$STSI= 32768
##$STSR= 0
##$SW_p= 5175.98343685301
##$SYMM= 0
##$S_DEV= 0
##$TDeff= 65536
##$TDoff= 0
##$TI= <Analysis number 999999
Compound Code 99
Book Reference 9
Project Code 9>
##$TILT= no
##$TM1= 0
##$TM2= 0
##$TOPLEV= 0
##$USERP1= <user>
##$USERP2= <user>
##$USERP3= <user>
##$USERP4= <user>
##$USERP5= <user>
##$WDW= 1
##$XDIM= 32768
##$YMAX_p= 276412720
##$YMIN_p= -188774
$$ End of Bruker specific parameters
$$ ---------------------------------
##NTUPLES= NMR SPECTRUM
##VAR_NAME=  FREQUENCY,     SPECTRUM/REAL,   SPECTRUM/IMAG
##SYMBOL=    X,             R,               I
##VAR_TYPE=  INDEPENDENT,   DEPENDENT,       DEPENDENT
##VAR_FORM=  AFFN,          ASDF,            ASDF
##VAR_DIM=   32768,         32768,           32768
##UNITS=     HZ,            ARBITRARY UNITS, ARBITRARY UNITS
##FACTOR=    0.157963299565203, 1,           1
##FIRST=     4116.38461288361, 0,            0
##LAST=      -1059.5988239694, 0,            0
##MIN=       -1059.5988239694, -188774,      0
##MAX=       4116.38461288361, 276412720,    0
$$ Real data points
##PAGE= N=1
##DATA TABLE= (X++(R..R)), XYDATA
$$ [...]
28748 15016 33411 45761 50403 35083 -10492 -1265 16054 4855 -2398 -5962 -2532 23712 42280
28735 42280 43179 44828 39105 22350 39550 63350 34362 -4524 -21125 -1212 -14700 -44548
28723 -44548 -21724 48936 40961 -9996 -4616 -106 16304 21969 -16195 -68174 -26619 8077
28711 8077 -5574 13383 2102 37867 38708 13863 -16861 -23657 1606 15074 13852 -3155 -16777
28698 -16777 -8973 -9621 -6441 11084 19534 12194 21679 -2297 -19255 -41291 -43253 -16682 5312
28685 5312 -21171 -15887 -23491 8265 14093 19710 7618 -11689 -9286 -6501 -17548 -39015 -11642
28672 -11642 31532 35766 25552 18322 31064 8346 14716 12708 -8037 -47929 -50089 -51139 -70987
28659 -70987 -55749 -14223 -3723 -33347 -24841 -17977 -16031 31513 37773 -3000 -28312 -36098 -28562
28646 -28562 -12128 -38117 -23295 -10292 -9738 -23977 -13576 -5816 -35151 -38013 -26940 -12251
28634 -12251 19639 60082 65071 67528 49537 33821 25143 27350 -11543 -36096 -43663 -639 40518
28621 40518 3790 -40831 -53307 -59606 -42532 7838 70963 38185 14340 -4820 -12643 -40714
28609 -40714 -60654 -3209 16824 14796 22142 26422 20478 25821 38336 25338 -11529 -2078 22352
28596 22352 -2042 -43737 -19373 -3707 9036 -1735 -42659 10155 90081 91456 46750 16170
28584 16170 6409 -44473 -22423 19815 25813 26979 24415 35758 12340 5767 47854 89367 55555
28571 55555 53709 47142 20795 -27855 -8760 38221 11939 36997 66803 67178 70045 40233 34581
28558 34581 24237 287 -17898 -34540 -22102 -7105 25381 32932 19704 55413 80242 47005
28546 47005 54989 29872 -21370 -27151 -29792 -77915 -114338 -160030 -110727 -32550 21894 52996
28534 52996 66322 61286 41148 19443 16015 30854 18185 10938 -20605 -30784 -52877 -41761
28522 -41761 -45558 -61344 -45479 2012 15069 17569 -6182 -7542 25112 44717 39006 7667
28510 7667 -16759 -12085 -8457 -21179 -30209 -342 19035 -1773 17844 6235 11013 39461 34215
28497 34215 62920 32707 -15292 -37636 -30830 -41930 -47068 -52368 -3264 8921 28268 -5419
28485 -5419 4034 31025 34263 37433 66447 79909 57432 44781 37241 40908 54243 31079 38720
28472 38720 55994 47989 41292 40664 36144 44352 54430 23277 39169 55690 43588 76401 66843
28459 66843 35799 4447 20560 63321 40200 -1831 23426 -12195 -54022 -31906 -42898 5464
28447 5464 68714 42237 73549 52672 -1613 -26757 -61394 -17834 12711 40404 60897 46833
28435 46833 7346 -5520 -36793 -39945 -13688 -9628 16226 -18231 -63386 -42234 -2926 38235
28423 38235 33663 16098 15318 8339 15608 16137 -8924 -9450 -3412 -7463 -22059 -1546 7210 20687
28409 20687 57190 62134 41449 6846 14150 8448 14208 363 -33339 -59160 -54442 -50073 -11472
28396 -11472 45310 71865 100640 91041 41247 21083 14437 2686 -46495 -55423 -61785 -42647
28384 -42647 -16535 -1435 13065 45057 50078 24026 20295 9058 30438 9845 21962 65810
28372 65810 46781 13653 19058 20552 -6545 -4568 -50002 -74262 -14402 11743 -15216 -41023
28360 -41023 10012 36178 14920 31343 50276 61647 57499 32096 54561 23519 56819 72119
28348 72119 78492 77753 91151 84294 67254 21035 -6981 -17584 -32843 -62961 -56108 -36903 4827
28335 4827 -2974 -51930 -82175 -82467 -39023 -27921 -590 53306 23574 15266 34090 14831 39279
28322 39279 55947 16199 -21972 -11624 3125 -17628 -41631 -34017 1745 7228 20535 11580
28310 11580 -1850 29007 40286 34284 -13019 -39489 -50646 -29333 53744 54731 14786 -24700
28298 -24700 -47366 -42201 -38369 -54322 -43587 -25061 -34305 218 -10616 31068 59696 42317
28286 42317 51162 8171 -24599 -31124 -61888 -82795 -46248 -18116 -3290 -4680 -962 -18241
28274 -18241 -7547 2133 -15960 -28373 1631 17754 14305 50076 89972 109380 88084 38307
28262 38307 10868 33941 4216 -6943 -27408 -34846 -16466 -27919 14861 63961 48093 38453
28250 38453 53153 19996 -8571 -35680 -46473 -15453 20890 28026 48084 26164 33129 33616
28238 33616 31825 12390 11811 6061 -45727 -48582 -21976 -20432 -13231 -6548 35921 47610 48176 7969
28224 7969 12562 15977 -42090 -74902 -46297 -21160 -39050 18976 9898 -4603 -36368 -43435 -35089
28211 -35089 -52499 -29674 874 15166 -5619 -16030 -48230 -77522 -63935 -3228 45565 32947
28199 32947 8726 -10517 -35157 -63873 -56913 -38953 -54987 -26703 4937 -40867 -52359 -28273
28187 -28273 -10603 -49221 -75487 -49798 -9348 -6560 60552 55860 3039 -207 10097 2566
28175 2566 -24403 -1273 35950 36417 29972 10650 -5793 -18925 -19082 41045 44605 16148 -31258
28162 -31258 -15793 9136 8613 6151 43106 36731 -4835 -25854 -23694 -412 -21339 -27589 1950
28149 1950 -5337 -7875 -9560 -6911 1775 34171 -7278 -20678 -1976 -5265 -20584 -29637 -39351
28136 -39351 -33384 -48755 -47903 891 10380 3310 -11465 12654 20903 32338 29683 7302 7718
28123 7718 -44813 -51204 -27438 3202 28075 40920 -5767 8570 53058 37848 68282 84974
28111 84974 110466 105183 75624 34400 -1580 5523 -8659 16039 7443 -20601 -51788 -49741
28099 -49741 -28136 5829 9238 29604 37429 40935 61172 29303 -12845 -17371 -18698 8180 -2219
28086 -2219 8799 48327 53332 15002 -24325 17239 33441 46359 56688 55580 41287 32806
28074 32806 31721 47219 44559 9972 -24806 -27263 17657 9883 -39713 -21808 -7316 12877
28062 12877 7498 -44316 -42709 19829 28463 53185 47749 35278 39509 47226 11763 -13590 -2959
28049 -2959 3982 -12145 -36501 15360 54215 57368 50460 26714 13420 -41789 -28299 10027
28037 10027 21830 -4927 -23749 -75391 -73888 -43698 -43032 -46807 11211 33333 -7686 -17161 1992
28024 1992 -2570 4432 -2090 -4844 -9120 -40385 -40933 3285 15955 27538 23104 7012 40894
28011 40894 51619 23923 -12830 -31224 -6807 -27002 -17315 -34660 -25337 -16365 -3972 -7191
27999 -7191 2454 -13562 -44201 -18792 19324 -22146 -29194 -31842 -29005 2973 -12627 -14912 -25867
27986 -25867 -28939 -7053 -12176 23337 50561 23904 -17703 -11308 -7694 -24006 -50620 -33069
27974 -33069 -30773 52 52227 76784 56149 61178 68846 56688 74324 68476 32566 53640
27962 53640 41433 40584 22076 -25035 -9838 5601 -7574 6566 -35998 -25328 11916 64644
27950 64644 68875 72184 43744 15856 -36109 -39689 -19741 -15191 4114 -4845 20626 23176 -12975
27937 -12975 -48505 1302 16753 41442 48327 22178 6646 -4469 -34575 -58010 -29679 13997
27925 13997 43589 41581 59012 50940 12396 21675 34915 30266 50241 44009 68202 55468 59478
27912 59478 82315 73166 6912 -33195 -28623 -50650 -26175 6372 7656 -9442 -33526 -23724
27900 -23724 -5584 1180 -10349 17523 10490 -19463 -17276 -21197 -4405 -15129 2382 23740
27888 23740 17111 48394 67968 65965 54403 33567 -5364 -37249 -26304 -44400 -5962 21051
27876 21051 34359 17356 -18688 -70565 -77233 -44538 3934 5787 -1896 -30037 3121 18311
27864 18311 5126 -28881 -30013 -10138 -17259 -12168 188 1619 -28682 -33434 -14049 -23263 -57734
27851 -57734 -66713 -59264 -9632 48245 60340 58342 34403 -12489 4360 -15197 -10513 22164
27839 22164 32316 24289 -2739 12079 51483 40790 -12182 -32057 -56793 -64361 -35698 -6521
27827 -6521 -23804 -20913 4769 -9516 -37730 -44186 -35288 -9725 21775 709 31021 43022
27815 43022 50250 1724 -20139 -22016 -22169 -21313 -52001 -44167 -25053 -913 9634 21976 12734
27802 12734 15126 9838 17452 31518 36956 8375 38654 35717 20920 12532 31180 28404 -4692
27789 -4692 -12776 -19313 -8696 9823 5011 30561 54994 7782 -24536 8662 21218 -18625
27777 -18625 -57631 -121159 -86431 -72640 -77605 -43378 -23306 -22770 -42175 -53860 -55753 -41075
27765 -41075 -178 -86 -23142 -88028 -94067 -74825 -28299 1710 1271 3244 8276 17554 -19940
27752 -19940 -76191 -84551 -44781 23760 61514 16552 -16786 -6000 9250 14784 15141 10495 16072
27739 16072 27522 29432 19430 15546 32027 8619 53893 74074 90136 66433 34269 35863
27727 35863 18932 -4714 3089 3480 -54082 -68514 -31527 -4493 -9579 5763 -5755 -74796
27715 -74796 -117847 -94086 -57127 -36873 -29590 -12867 -43647 -61057 8143 12493 -19923 -1274
27703 -1274 22328 47352 46650 29403 27781 22908 -28649 -76079 -71280 -88803 -71253 -71042 -49125
27690 -49125 -44568 -44892 -59276 -31400 -23576 -12647 -8540 -5150 -25897 -77072 -90907 -59863 -32495
27677 -32495 -51894 -45382 -17927 -23368 -23149 -1462 38323 19348 15872 -7519 -12542 16785 49465
27664 49465 48437 46006 950 -47583 -62054 -48810 -43467 -21015 -44367 -39131 -31829 -26332 -27003
27651 -27003 -38033 -31206 -22130 -28833 17064 55951 14692 -7877 10985 41163 33842 9751
27639 9751 -19708 -30636 -7810 28030 -13232 -61032 -50757 -25778 17654 17698 1127 43530
27627 43530 79814 77915 97304 100546 79687 80790 78312 80145 36825 -6029 -40719 -19176 -10759
27614 -10759 30092 25334 9205 23961 11872 34588 39916 -14562 -39462 -42619 -36896 13488
27602 13488 2126 -57929 -18115 -19984 -27345 -36177 -32023 -4088 11236 -29155 -37683 -27068 -21182
27589 -21182 -9238 41243 41575 71312 84901 78615 64294 47566 18770 28627 19038 -2349 41378
27576 41378 96818 61026 49073 17392 -5042 -17025 -4954 -4317 -30486 -59179 -17631 23944
27564 23944 5077 -11488 -1006 19627 26412 19023 12197 50462 69478 6949 -15461 3574
27552 3574 44682 95012 45153 -25368 -2882 -714 -10467 -7765 17854 31860 35209 13770 -26516
27539 -26516 -18001 -28785 -3233 48142 60953 26972 7903 15977 40339 30322 23586 24972
27527 24972 41918 46148 5942 25611 49465 65093 46105 -9147 -57022 -20661 -1102 -2193
27515 -2193 -5877 -5431 31571 68804 46468 31721 9964 -5227 6884 28806 29796 20824 -4002
27502 -4002 9607 9764 27091 33144 19883 -13233 -10966 6131 34515 66776 75876 32148 4594
27489 4594 2098 -14555 -24009 -8030 -7752 -23278 -42117 -40519 -20243 24752 23144 20819 3438
27476 3438 18223 40325 36956 43423 40591 60429 86669 91333 43346 33532 28896 30588 -1532
27463 -1532 -6194 10984 26958 18571 30726 64355 52582 8827 37156 47682 57875 16644
27451 16644 616 -21789 -41425 -7085 365 6126 9000 23303 16868 -10322 -36411 -14974
27439 -14974 -29901 -14766 11878 38072 36111 -8779 -40491 -52133 -52019 -29863 -30713 2149 1122
27426 1122 -51300 -71471 -45984 -9876 -20522 -3245 24434 47049 52059 12865 5619 12950
27414 12950 25058 -27403 -18507 18505 26393 15075 14258 40608 12476 -15024 -28423 -36793 -36416
27401 -36416 -68225 -52806 12378 1892 -16536 -8300 -14865 -15391 -22110 -9393 4262 29899 27508
27388 27508 -10657 -29314 -23415 -23745 -14491 -14034 26498 77726 72490 25295 19835 21722 38352
27375 38352 46884 31019 27009 21025 26656 27543 35848 29149 31635 28352 -10986 -28834 -7913 -18939
27361 -18939 -51511 -29851 13638 17255 27734 11044 -39454 -18818 -16840 -46697 -59950 -81420
27349 -81420 -92728 -74030 -81590 -51165 -27468 -31239 -32162 -51750 -63744 -53735 -24704 -3673
27337 -3673 27287 65146 31311 4306 -5768 20551 35401 26147 42687 26711 -17233 -49992
27325 -49992 -8306 29923 30672 12972 19651 35891 28780 16668 -15189 -21717 -27053 -39065 -21811
27312 -21811 -31665 -73914 -33799 12820 51 -8624 1557 -10274 -9856 22264 40120 38610 20806
27299 20806 -5833 -21048 210 4696 -11630 -2616 41941 49011 7099 -13569 -19737 33131
27287 33131 68771 54966 46219 -12558 -23869 -5135 13411 -18934 -64434 -78209 -35282 -2466
27275 -2466 -21145 -90952 -126776 -88034 -48512 -16500 8718 -12617 -9731 233 7578 29657
27263 29657 23858 22426 25283 20366 -13626 -44009 -36765 -17197 6968 40667 81567 75789 53171
27250 53171 26125 37345 4000 -24841 23490 42185 -1494 28414 47292 23512 4873 10014
27238 10014 30793 -21837 -8354 43690 71076 37968 4965 33266 47064 9278 8596 6199
27226 6199 -14859 -18893 -6117 26929 35571 50516 51391 7791 -23634 -16893 -37284 13841 22057
27213 22057 2285 -51901 -79605 -70355 -36481 32878 44782 15751 -27935 -34391 -12723 -5091
27201 -5091 22962 60120 56217 26437 7817 13462 -50799 -77425 -31227 -7965 -7559 27231 40518
27188 40518 75080 79281 72324 104482 110396 82071 53613 32508 13916 32757 6184 -48306
27176 -48306 -37588 -9688 7783 -2818 -1673 26775 17697 -35466 -40258 -23928 -36132 -42788
27164 -42788 -12322 13298 6762 17213 33757 26945 -625 3096 -24980 -2522 19863 -7271
27152 -7271 -19557 8636 31478 -2499 -4184 -6203 9192 49669 27136 37565 35753 23865
27140 23865 -19626 -12970 7416 188 21290 52594 62849 59706 49484 32044 26352 37529
27128 37529 36247 41407 45741 25177 -20160 -24643 -25899 9005 26902 25710 10017 -66092 -57177
27115 -57177 -54963 -49459 -26667 -56271 -20149 -15947 -7017 3741 -11938 -20283 7972 15404 -11813
27102 -11813 -49380 -82033 -87167 -73571 -41841 -1403 -72 -3159 -20233 -42619 -35953 -23661
27090 -23661 -25624 -7996 -22324 -25491 -27663 -26337 -32001 -32139 -57059 -49315 -34148 13973 -9106
27077 -9106 -22307 -46724 -63145 1409 11925 19298 17598 7879 -4006 -6615 -26277 -11923 -42931
27064 -42931 -52624 -57824 -57572 -12460 -215 8353 30874 43195 57990 51396 35295 32994 -8602
27051 -8602 -23513 30187 48633 50856 66864 29943 -5741 -12375 6858 48312 67840 61120
27039 61120 73203 49946 35705 -5516 -54423 -44835 -1305 -9866 -45892 -49776 -26449 -13170
27027 -13170 -25949 -2795 266 19459 2505 -4195 3631 -14629 -16827 18655 32611 10328
27015 10328 29746 40120 -4495 -37590 -31438 -6989 4981 -26743 -11495 11585 22899 24219
27003 24219 10842 -34732 -52482 -79390 -75191 -53405 5518 34503 31265 55771 74872 71550
26991 71550 68869 48573 41061 51299 52262 25159 53031 45845 21769 4410 20778 53831 65365
26978 65365 89979 63314 62199 61428 83692 60631 54425 29827 12150 28538 53548 70509
26966 70509 93899 83323 41762 25825 19548 31665 48527 38205 31753 -27545 -47583 -25779
26954 -25779 286 -14126 -2849 35138 40590 60990 47940 -3052 -38103 -39408 -13514 -38228
26942 -38228 24900 57074 39447 28907 47758 64636 39807 27569 -30796 -7715 31717 34044
26930 34044 -7993 -47227 -83013 -75449 -49365 -21084 -44656 -17242 19179 14344 2580 -39780
26918 -39780 -33504 -18059 -3764 -22471 -38883 -10915 -50932 -75005 -56873 -67106 -67845 -36484
26906 -36484 -32624 -14794 -7884 3483 -924 -35783 -26755 -2038 17678 23024 -24261 -27236 -17170
26893 -17170 -861 -9958 -31577 -38862 -11396 14908 11498 15206 -3277 -517 23219 -3792 -65184
26880 -65184 -68721 -30630 -45169 -47544 -32659 -40693 -38249 -12933 -20067 -36879 -12016 -10481 13449
26867 13449 54682 42779 30290 36832 18014 -15907 603 34419 21166 -14581 18723 44400
26855 44400 61156 16288 -6662 -11143 8047 5318 -9722 -1683 19381 8506 5542 21639
26843 21639 8626 4927 2796 -25223 -1865 -2033 -18831 -43828 -25866 -2733 10544 25534
26831 25534 11196 2378 -17584 -43416 -48433 -26224 -13168 -13024 16379 28326 16037 26721
26819 26721 14887 13176 13294 -1465 -27934 -52985 -55039 -29135 2309 34638 18434 -6665
26807 -6665 30106 7115 809 -17707 28819 84650 96687 34064 684 -1076 23716 54772
26795 54772 46565 15402 47799 18645 7816 17492 11291 -9329 -10754 -42219 -35098 -11289 49584
26782 49584 50497 11463 16030 26141 24126 7315 -5610 -42220 -46153 -41052 -91508 -104271 -91442
26769 -91442 -58294 4221 25230 20839 28921 22796 44534 68387 31835 27161 -11339 -67980
26757 -67980 -100016 -80428 -44270 -14341 21689 53461 23549 -2442 13117 19890 27605 23214
26745 23214 -12136 -41213 -42401 9147 69732 66456 31794 36536 21916 24343 6309 -19441
26733 -19441 -12892 170 -35717 -15004 13431 8352 15321 73386 66862 9198 -12378 41197
26721 41197 24618 -21737 -30308 -27493 15092 -1960 -31247 -40195 12879 48975 57611 52856 21234
26708 21234 20332 38404 20278 -7490 -20974 -8670 -18550 -38772 -11114 10684 -34336 -37137
26696 -37137 -19665 27671 30372 26687 20430 21900 14877 -19632 -24715 4013 45936 51863 19318
26683 19318 308 13087 36290 11160 13488 15643 22149 17522 -13416 -2440 27800 8410
26671 8410 21106 37453 13075 -30696 -10490 3043 -35972 -73000 -67161 -33248 10538 22642
26659 22642 30796 10591 27991 11712 -12642 21827 10589 3612 15931 18681 -40356 -68684
26647 -68684 -74040 -79097 -50252 -67247 -49288 -17986 -54248 -52941 -20712 -11342 -27638 -40499
26635 -40499 -20342 -42071 -33365 24387 13507 -273 -3172 -96 -29335 -197 21567 8979
26623 8979 32322 78284 79844 60433 41463 41296 30673 29704 31643 37824 18895 34422 16740
26610 16740 29284 -19900 -43420 -8136 11504 6498 27411 -20321 -14352 31757 36863 33809
26598 33809 -22862 -37048 14197 28414 13185 -44533 -73795 -40475 14274 23315 33141 51177
26586 51177 37541 38529 30492 15355 -12012 -65339 -67718 -26794 -11903 -17308 15420 38373 14335
26573 14335 -1830 -7391 -20242 -12633 -7568 -14697 -39298 -56913 -28623 3311 17894 11544 21285
26560 21285 1129 19331 57086 52138 20639 25190 51640 30193 -15834 -9565 -445 3665 -78
26547 -78 11386 72 15381 -16598 -37139 -12674 18228 15884 44035 57652 55884 32311 20039
26534 20039 5971 -20166 -12706 -44504 -52738 -43516 -11150 -8886 -14177 -28152 -9501 -24345 -9195
26521 -9195 8728 -14095 -22120 -11815 -34137 -34263 -16542 -42326 -35621 396 15718 17378 26197
26508 26197 34954 35601 46392 89249 78433 27735 11733 -8544 868 -5404 -41901 -46948 -25901
26495 -25901 -37936 -30901 22808 57680 18913 -15272 17905 -8232 -46939 -47165 -42368 -73586
26483 -73586 -97723 -51057 -26968 -2041 -27862 -58611 -21072 -22584 -16391 -4801 46711 38511
26471 38511 30592 -884 -4873 19823 -10974 49112 101401 82148 44637 43645 14632 -10914
26459 -10914 23948 44154 1503 -5963 -9243 7413 63389 65063 21458 30333 18770 1545
26447 1545 2952 -18925 -14496 -4911 -32702 -18827 -3613 -4674 -40632 -8897 36392 -13832 -69062
26434 -69062 -53218 -2286 4735 2128 18090 -14366 -62908 -47447 7658 -11091 -27404 -27824
26422 -27824 -7123 5485 -4069 -12017 16902 20151 12978 81 -1452 29416 35839 22616 5030
26409 5030 -27454 -19500 -13628 -52413 -50637 -20468 -16857 -28339 25184 37173 67429 78582 -4210
26396 -4210 -60924 -61192 -28626 30062 42076 11592 -6553 36303 71235 44244 -5811 -41020
26384 -41020 -26571 5629 66488 74795 69822 52719 46583 65323 69361 51829 33253 8425
26372 8425 27716 17300 -12622 -49865 -34924 -8622 -11352 13694 57352 29672 3129 4316
26360 4316 2461 194 -2955 2916 43387 85488 76499 48508 29448 21419 13600 -6950 -6113 -6076
26346 -6076 439 -9904 12542 26615 20804 55548 68617 74344 29340 -8476 -33867 -56419
26334 -56419 -31802 -13594 -2074 1201 11270 43287 36922 19895 -17202 -6241 25383 31044
26322 31044 21417 39628 62498 56957 14275 28635 -337 -27874 -66719 -88938 -56864 -17646
26310 -17646 -44823 -65365 -58409 -32955 -1625 31533 36751 64770 66123 55848 -17146 -18404
26298 -18404 18599 -14546 -44657 -50860 -26663 8469 18337 18287 59226 48506 6339 26945 8451
26285 8451 41835 25782 25729 37682 19514 49761 59203 23832 -30323 -33066 23107 19000 6803
26272 6803 -4428 27869 41694 18012 -16878 -41620 -27256 -30017 -45219 -28366 7390 10688
26260 10688 20745 -2173 -12294 13743 26549 88701 85241 69929 58304 14430 -20652 -78399
26248 -78399 -36584 34456 47082 25901 30536 29707 21910 60148 90980 78693 48393 33230
26236 33230 -5445 -31323 -22679 5072 28218 18204 15634 -6091 -36622 -7338 15451 7267
26224 7267 -11674 3896 3034 -16202 -22796 -25089 -45706 -52528 -40094 10230 25509 52682 42141
26211 42141 34170 40663 -13439 -55113 -56522 -41547 -39162 -58341 -28828 -14057 28723 15278
26199 15278 -23982 -19148 6688 949 12430 18729 29831 12034 34849 20177 -2229 -878
26187 -878 -13681 -8574 -30846 -8928 -21857 3112 14698 -27343 -12100 4647 -24758 -11071
26175 -11071 14065 33648 66385 75320 75265 47378 6721 29790 23470 -12933 -21404 -18873 -46257
26162 -46257 -45945 -4643 24978 -2809 -4017 607 28554 79685 64631 52389 6796 -45027
26150 -45027 -55806 -65003 -25678 11512 36054 39987 -11793 -42259 -35701 -45948 13594 43190
26138 43190 61510 69496 34645 8758 8055 7606 11004 9714 -1032 55267 70189 97133 73984
26125 73984 40091 51226 26345 -13642 -6609 -744 -6338 8791 17872 19433 -2040 -20388 -30090
26112 -30090 -16123 14878 50726 22328 -5168 14500 46486 55074 54831 78757 102723 81389
26100 81389 72587 68755 36720 41372 70196 80133 67857 65050 64468 66664 23259 -2593 -48012
26087 -48012 -20220 -8216 -32385 -1026 61214 63183 57894 71446 77621 29981 7905 6647
26075 6647 23961 51386 68307 70520 14367 -18210 -15092 22356 49246 39151 40504 41585 63507
26062 63507 30465 21251 53352 87395 65281 63888 17114 5524 1700 16003 57561 16315
26050 16315 -675 -125 16840 35227 63044 44163 -29760 -45682 -34002 -13033 4087 23457
26038 23457 7740 -11246 6908 31990 70464 59021 28052 41357 45458 37833 -1941 4234
26026 4234 55266 80268 31128 -18387 4451 5474 5720 31348 17745 -2595 -15255 -59180
26014 -59180 -76055 -34561 -50858 -18538 4810 7037 41046 44165 18812 10821 63198 41807
26002 41807 43654 629 28758 45236 22911 -5226 -25178 -17736 12040 19848 9324 -2675
25990 -2675 -22230 -17137 2931 25998 11642 -1503 28253 14979 -30710 -76575 -45152 -17884
25978 -17884 -46028 -89729 -52133 -10669 -10485 -11915 -13180 -1876 -2513 -38890 -50563 -25714 -15141
25965 -15141 -14588 16533 -2590 -20717 -7359 49784 86749 69513 63852 46233 16233 27788
25953 27788 26221 23474 26762 52731 16919 2769 18087 -28602 -63630 -52791 -71474 -53611
25941 -53611 -64984 -60570 16184 51225 6783 -25419 -52284 -27768 -17392 -28820 -27812 -31116
25929 -31116 -52979 -13717 30505 28044 37324 27020 10334 -19260 -41426 -38653 -35635 -17713
25917 -17713 -15093 3627 1145 -27909 -7321 8903 -5771 -6351 15527 30217 -22322 -49869
25905 -49869 -41532 -26128 -21036 -29106 -11728 5625 -12708 -2330 -24453 -42217 -38177 -49630
25893 -49630 -31104 -28265 -43703 -79435 -33750 5318 -9458 5113 32264 1171 5903 11751
25881 11751 -239 -19366 -3616 11236 34851 -5560 -26199 -24325 -32121 -17401 -17628 -6101
25869 -6101 12629 45888 41202 8366 -38035 -53808 -53082 -16869 3433 -26965 -44111 -35752 -74266
25856 -74266 -61180 -33911 -22430 -10677 -24299 -32511 -75620 -81369 -29332 -33120 -23459 -5428
25844 -5428 4945 16499 -3981 30824 66165 51914 32302 59876 19965 -12509 -32009 -12670
25832 -12670 -16968 -25872 10034 30269 51605 36417 17666 25607 27785 21057 -2893 -4564 930
25819 930 -18310 -22311 10342 27702 -5391 -72017 -93634 -73957 -31600 811 7899 -14306
25807 -14306 -7768 725 5447 23466 13654 -14889 9064 33442 28698 26036 926 -14895 -29685
25794 -29685 -32554 -6682 36021 69581 70660 41357 27964 38325 34588 49432 33310 -22408
25782 -22408 -449 14121 -339 48351 49792 50180 46277 32562 12934 -31291 5489 38422
25770 38422 28496 12303 4102 23392 22473 21540 -24055 -88298 -77712 -46959 -11468 30480 15006
25757 15006 26264 21332 9754 7084 -39883 -30110 -50986 -30334 -23432 9145 18634 17675 36768
25744 36768 28426 16435 12696 9063 26510 10689 -28810 -6024 -6320 42231 81903 81078 44416
25731 44416 21204 17519 45630 22618 -21617 -35252 -11038 22499 21235 22237 43952 54331
25719 54331 63571 33113 19491 -19406 -25234 18119 -8504 -27947 -11247 -17710 -26685 806
25707 806 34437 13605 -4611 -21642 -22907 -7714 32108 33409 2153 -25422 41051 56265
25695 56265 61504 59136 32913 29615 35848 31026 11622 28796 29347 185 -23646 -60722 -43613
25682 -43613 -10644 20616 47036 45040 10769 -13068 3656 -2710 -59631 -55798 -68114 -72953
25670 -72953 -30451 -12212 -37883 -63527 -53259 -25514 -6077 -5568 -25939 -50044 -30027 35555
25658 35555 19441 6848 2242 -36787 -37536 -5144 3892 23310 5501 21127 14473 -22125 -52680
25645 -52680 -74381 -36375 -22666 -29047 -57447 -52183 9578 40733 43692 13312 -49763 -58529
25633 -58529 -22533 -34574 -75372 -64996 -56018 -27237 4239 24410 -4951 13775 -12037 9025
25621 9025 59842 26601 -17732 -16887 9103 5623 1902 28479 35204 47068 15240 3615 17722
25608 17722 24537 41184 46721 17029 -2213 -16816 -4984 27637 19265 -20366 -13945 10854
25596 10854 45232 14738 9512 -8941 14323 16089 6118 -33824 -41265 -7620 -6840 6252 -38885
25583 -38885 -75882 -58078 11037 64823 22596 -27604 -22789 1336 19542 22443 18637 22792
25571 22792 -8766 3136 8423 24800 63761 54773 12909 -7124 -12154 13286 26688 -28697
25559 -28697 -67807 -70469 -31606 -2380 -18033 -8949 -10737 -942 -17761 -38669 -27456 7020
25547 7020 50036 78349 82673 70317 24399 29573 19132 -21819 -15116 39168 44243 39330 19842
25534 19842 24086 27766 29932 -10246 -28575 -8199 -28094 -62125 -23838 1832 -9155 -29992
25522 -29992 -37717 -53815 -55813 -58694 -67345 -43929 -40786 -40519 -19406 -4986 -18231 -27285 -65795
25509 -65795 -71745 -48774 8562 10914 -25165 -28560 -44540 -31630 -30196 -33793 -68310 -108334 -127284
25496 -127284 -92437 -67931 -47545 -27258 -7421 -39511 -101263 -89459 -72030 -14083 34000
25485 34000 18443 -11702 -26413 -41038 -22775 -35623 -20184 -10946 -57144 -85850 -69740 -65133
25473 -65133 -64642 -40616 -15056 642 -3121 -773 -7157 5500 31607 11147 -24130 -20592 -28147
25460 -28147 -10938 -7054 -9207 -427 -32502 -54170 -29414 -12347 15390 34375 49627 66315
25448 66315 57201 23873 61 -25435 20769 23111 -13692 -27802 -12953 9451 51955 60052
25436 60052 43979 45320 34594 38940 53935 28758 -30345 -29561 -23608 -23877 -1765 -52 4478
25423 4478 17166 29712 32232 32391 37423 65791 9837 17155 -19922 -61597 -59475 -51795 -18394
25410 -18394 25126 28383 28243 45250 26022 -32841 -4806 37252 50725 88821 88930 49670 31295
25397 31295 34971 44139 19361 -5933 13630 36935 12170 -4543 -34714 -591 12448 -11147
25385 -11147 -29703 8162 4580 -43429 -58917 -14074 -6517 -37814 -60561 -36330 -16492 -4407
25373 -4407 -34448 -14877 -5620 -39461 -53929 -48068 -57108 -62587 -86068 -76089 -40418 -14431 14906
25360 14906 18205 10691 -974 24646 18745 7968 6266 -8592 19388 22201 2740 17208 74984
25347 74984 24258 -47378 -55953 -56087 -38319 -36008 -18969 -6682 31065 10255 -27472 8875
25335 8875 44055 13612 441 16418 1125 -22986 -4498 10121 -515 -33219 -70188 -68522
25323 -68522 -48822 -37824 -50019 -28676 2198 40970 27839 -14367 -17369 52285 54961 64289
25311 64289 70078 55734 11807 15506 718 -19076 -32657 -27171 -17297 13416 27327 1667
25299 1667 7902 27430 54388 88933 84224 65323 32969 15252 2678 20686 33907 -23916
25287 -23916 -71008 -54951 -39081 -16880 12519 -34630 -60205 -50757 -27748 1083 -32909 -24187
25275 -24187 -1456 -11815 -23681 -28707 8587 21584 18959 41878 63461 57140 15655 -1765
25263 -1765 -32772 -17751 -41455 -23358 -17185 -17646 6551 -6110 394 37452 78684 78297 39444
25250 39444 30938 27258 55136 48421 2332 -10951 -20858 6711 -2206 -30655 26434 45344 26453
25237 26453 -30608 -41794 -15580 32809 32620 31914 14788 4823 29736 48563 14359 -42216 -39965
25224 -39965 28520 40345 10805 30306 16350 4578 -14243 -12240 -23340 -47130 -52716 -27644
25212 -27644 18588 54929 81302 52122 26742 11048 28347 -23559 -28739 -26875 1565 45837
25200 45837 65182 39500 16578 16968 53375 65126 27673 -9801 4046 44358 43992 24914
25188 24914 -12923 -39682 -31792 -29434 -12332 7982 4675 4352 14805 -9117 -3883 17571 15109
25175 15109 13736 27482 29915 10976 3822 71 19623 10911 -13621 -46379 -32326 -27880 -1075
25162 -1075 -32543 -53786 -23103 33893 97747 127380 90263 51798 47559 48499 47782 56125 45054
25149 45054 10670 -9 14414 636 20285 7560 -13547 -22420 -5080 15508 28278 -472
25137 -472 -16034 12759 -2590 -49942 -70655 -49440 -9881 -4653 -3561 -22067 -4676 22812
25125 22812 16768 5149 -9369 9300 -15118 -42914 -45629 -38074 2914 -30979 -45676 3819
25113 3819 -3165 -29983 -42250 -24538 -14464 -52218 -40717 -55215 -65028 -52047 -34307 -33988 -4452
25100 -4452 58032 35246 29366 24821 31269 35218 6023 -5841 19795 19579 43962 39395 18698
25087 18698 -30370 -43053 -22905 -34817 -10414 -10896 -18879 -569 6637 16486 -24701 -27052 -30011
25074 -30011 -51653 -62643 -61444 -17028 -13733 -53688 -22377 -20789 -20306 1501 33281 34709 26130
25061 26130 29207 35550 18604 -4071 -8979 -17545 10457 45620 66793 38881 35441 -1678 -36160
25048 -36160 -32183 -15201 41659 22996 -53476 -39156 -52623 -43587 -52436 -59156 -44119 250
25036 250 -12822 -9240 -26847 -28816 -41182 -68123 -49946 20594 46779 47001 43063 20466 12237
25023 12237 -12907 -14509 -24442 -41202 -20044 -6173 24413 42451 58001 90113 82891 39116
25011 39116 32269 8635 32960 53270 32193 9450 -9908 -5777 -116 19307 26451 -1856
24999 -1856 8828 42638 64319 34582 25491 -13807 -34304 -19046 -28676 -51803 -77669 -70797
24987 -70797 -38898 -18376 -7529 45413 60613 -40955 -74070 -35581 6532 71080 49601
24976 49601 14114 32805 -10493 -3659 4775 7173 21795 20047 33163 94193 37990 -11564
24964 -11564 1975 -882 23375 41971 32357 37249 45466 36767 34679 1833 -28582 -25913 -2273
24951 -2273 -8984 -48378 -32665 -8736 -35468 -48389 -44739 -21205 -12884 1848 1697 32328 28592
24938 28592 30696 18660 48871 29954 21497 26149 25900 26927 -16846 -26487 -16202 -18727 -10633
24925 -10633 2617 -6114 -14328 17425 37431 20133 -9273 -76 35127 36496 26081 23587 8204
24912 8204 -16497 -17179 -18618 -22335 -12998 -53336 -28349 7242 46770 40240 29710 -206 -27706
24899 -27706 6361 36992 38476 35930 40120 4074 -59424 -90058 -93179 -70720 18219 27300 -5347
24886 -5347 -27796 -22202 -11537 10797 1249 -19201 -7729 1513 2379 -20385 -52615 -47856 -26669
24873 -26669 -25987 -56544 -48490 -43087 -28949 -41380 -7545 -19862 -9476 2272 8706 11502 12855
24860 12855 31597 40029 26984 35072 52514 71850 45588 43337 41040 35418 42692 72080 41779
24847 41779 31200 -9840 -72692 -73500 -46559 -53018 -43186 -172 -40252 -48446 -52423 -68726 -48614
24834 -48614 -58861 -83977 -57473 -58087 -32897 -10091 10061 -648 -31836 -22296 -4496 1670
24822 1670 -3754 -10712 -5692 -13567 -29227 9699 26576 3360 -58535 -49965 -58267 -49196 -32377
24809 -32377 14645 33150 30293 17237 -36864 -24389 -20872 -6153 -40316 -38021 -15281 -19848
24797 -19848 -30369 -20890 859 33732 -2996 -49530 -44247 -73799 -51340 -47076 -74452 -45331
24785 -45331 -33468 -51944 -42316 -36642 -65008 -30128 -12300 -16268 5831 21026 44613 857
24773 857 -10836 608 13006 -1609 -5200 33450 13437 -20410 -52598 -39735 -25968 -28562
24761 -28562 -10474 34191 53796 30000 14770 7728 34506 68644 53050 30533 24253 3216
24749 3216 -26845 -11701 1064 9135 -4616 -12494 -35712 -8207 14569 45651 43714 26209
24737 26209 8373 -40328 -38915 -49876 -68180 -62201 -65662 -62319 -55978 -49277 24238 70268 32603
24724 32603 -6033 2070 50562 23585 -19746 -40868 -69771 -64019 -16868 14066 -20250 -39958
24712 -39958 -37430 -11140 12672 -49185 -51322 -59337 -114040 -135080 -75959 -50839 -97184 -49824
24700 -49824 -15629 -55599 -89578 -55773 -42572 -68351 -92809 -71531 -63387 -72386 -78841 -35387
24688 -35387 -4619 -11715 -4793 15292 7107 29723 -7971 -24939 -15872 -3310 20494 15631 8361
24675 8361 -14625 -31307 -35755 -28517 -42674 -7523 3782 24563 16858 9586 -26823 -10611 10648
24662 10648 7645 22229 -16385 -9219 -14112 16117 -14002 -23420 -24476 -20717 -26868 -29205 13485
24649 13485 15117 -1802 -24018 -44393 -25598 35506 13732 22517 42925 27814 17886 31970
24637 31970 26316 7394 -20216 -26499 -22369 -9818 -36758 -60245 -36257 -25934 -5327 -9795
24625 -9795 5626 11228 1292 34677 52222 48539 13880 -5078 -29162 -4592 -18881 24226
24613 24226 -4266 -36125 -38853 -25985 -24444 -74208 -89180 -83086 -57780 -67829 -18519 -2589
24601 -2589 -6839 -7853 107 37221 33820 23548 -8281 -13272 -29606 -25467 3920 22794 -3685
24588 -3685 -39582 -47697 -40676 -25859 -42729 -33031 -28238 -43596 -78279 -63905 -55834 -49502 -32818
24575 -32818 -27466 -52207 -60784 -62581 -47095 -28387 -49259 -39660 -11296 25526 12 -4552 -3912
24562 -3912 -19673 -32820 -13756 -33036 -53698 -58186 -40730 -27144 30288 72287 15745 -18288
24550 -18288 -24529 -11821 5321 -12780 -17151 14477 -4573 -49467 -57319 -15657 -9966 -16697 -31751
24537 -31751 -18476 -42963 -25355 -23232 -63838 -82248 -36174 -43812 -92112 -96969 -41541 -5808
24525 -5808 -12111 -6123 20275 46211 43359 -7279 -31563 -99648 -101314 -44157 -83112 -83307 -51187
24512 -51187 -50064 -14379 7674 29724 39632 68976 72008 52885 -7577 585 46424 57344
24500 57344 43844 62246 65560 63035 43860 43450 42416 62798 48112 23796 29009 15493 11939
24487 11939 34683 35959 39700 41663 37174 13489 24053 59014 71090 63811 25225 -28920 -30026
24474 -30026 -36933 -53458 -63576 -16478 -916 -47265 -49518 -22012 -40936 -52085 -12070 -35848
24462 -35848 -44627 -39609 -29719 -50606 -61912 -80193 -77778 -37037 -109 4551 -31859 -56957 -64181
24449 -64181 -17587 -5566 -36523 -72161 -81989 -11052 38033 5572 -10486 -49563 -67272 -48016
24437 -48016 -26525 3609 6902 -9830 -24838 -9288 -23470 -10514 65765 62857 21856 -4897
24425 -4897 -11230 -39100 17295 56641 39230 13908 27947 15353 31503 -9430 -25048 -12589
24413 -12589 -43080 -51490 -46587 -24437 -7711 -12128 -39434 -13714 -29797 -47813 -55631 -41431
24401 -41431 4870 65437 74021 35110 -323 -40099 -51370 2549 42660 47175 29425 -25022
24389 -25022 -69652 -44132 -29694 1335 45065 43018 13142 13924 59116 52070 26086 28685 -11118
24376 -11118 -37386 -24192 -16223 -34557 -13256 -14642 -50747 -15329 1209 -25742 -69839 -41539
24364 -41539 -19862 -28222 -33253 13575 16809 19234 58110 77766 79095 75127 6702 -37404 -61400
24351 -61400 -10525 -7138 -51777 -16681 -13752 -34940 -48714 -28322 9815 5256 -26691 -21877
24339 -21877 -11182 19323 28857 -14956 -14472 7869 20643 6918 -31809 -23858 -11486 -15121 -10745
24326 -10745 -41270 -43713 20273 58489 75595 85242 44775 10953 13020 14115 11274 -15317 -1671
24313 -1671 -4689 -27558 -60547 -40128 -16699 -20765 -61093 -41642 -59945 -60109 -50250 -42517 -34052
24300 -34052 -39139 -61769 -82699 -83313 -53675 -2141 28403 20330 33192 -8242 -43488 22796
24288 22796 71561 19091 4503 -7535 -62529 -87499 -44671 -68500 -55557 -19438 -14680 -37566
24276 -37566 -15155 -38997 -54023 -14794 5794 4185 16031 33857 7877 15351 41785 41034
24264 41034 59947 59944 23401 -10498 -17232 -22961 -44800 -54748 -19859 -34855 -56750 -56295 -43210
24251 -43210 -53098 -38398 501 -23676 -44535 -17278 24464 8806 -16683 -29298 -38858 -48605
24239 -48605 -69015 -57370 -43962 -49111 -83978 -78393 -86314 -19146 -4904 -15839 -10611 -30240
24227 -30240 -17721 -8569 -23811 -49782 -27066 -33346 -32438 -4836 15166 23842 47910 46905 51322
24214 51322 64195 56331 63030 9110 -29015 -39056 -41760 -60644 -50449 -53709 -54921 -4585 50314
24201 50314 85026 82610 80816 38047 -17608 -52945 -19596 13503 -15758 -78674 -78940 -83480 -37863
24188 -37863 -64858 -66506 -44937 -41260 -57410 -63230 -60022 -49220 -43866 -5370 -12258 -15675 -26214
24175 -26214 -68304 -84687 -71050 -55478 -23345 -3524 5095 11683 28176 59559 41409 -6039
24163 -6039 5724 30767 12681 -35100 -47189 -66962 -27325 -9438 6531 15930 49647 -5209
24151 -5209 -53785 -52444 -38655 -35710 -40152 -22938 14 11722 -3637 -15109 35159 -10167
24139 -10167 -30568 -34529 -51122 -19660 5172 -28360 -27229 -14554 -41155 -85337 -86737 -66860
24127 -66860 -212 -10018 -19524 -6111 -9573 -5735 19089 -732 3232 10567 -9825 -33420 -23510
24114 -23510 -16737 -44786 -42085 11691 44989 44062 16927 -51847 -67360 -26625 -21935 -27022 -17257
24101 -17257 -30304 -51203 -81078 -71219 -49873 -34852 -12675 29248 66187 24679 -12224 -57050
24089 -57050 -72672 -61484 -12317 4437 8659 -21809 -64329 -86709 -102748 -117904 -74502 -59260
24077 -59260 -62106 -55113 -39911 -42892 -30006 -12276 -27603 -34709 -7253 -30902 -32081 -76167 -94736
24064 -94736 -101116 -93641 -109647 -112685 -75107 -41145 -8462 -8785 -53340 -46261 -2196 10357 -36428
24051 -36428 -25068 -434 18169 26679 14623 -18695 -47646 -17232 49209 90125 55694 32547
24039 32547 -28829 -50045 -58625 -71130 -72347 -94521 -80496 -51521 10398 8252 982 49618
24027 49618 30711 9220 -15339 -17125 -576 5341 1046 -12607 7281 505 -36486 -79802
24015 -79802 -74748 -38868 -14987 -23949 -20935 20327 46556 61231 43858 27603 1865 -22119
24003 -22119 -9300 -14046 -12381 21791 25049 4171 -16783 -19179 -52935 -85297 -91320 -70946 -54525
23990 -54525 -16190 14377 -30255 -60556 -72187 -78883 -49163 -32849 -18955 -14782 -49019 -60665
23978 -60665 -63451 -67641 -35911 -4995 -4746 -31888 -43026 -36381 -23730 -32339 -45366 -34295 4726
23965 4726 20268 -18268 -44948 -15852 -3863 -55612 -48859 -9763 -37633 -77370 -61451 -22826
23953 -22826 -17394 -6722 1679 -42925 -80532 -50742 -51650 -73030 -43915 -27778 -9725 -5011 -12427
23940 -12427 -49935 -63310 -12974 18079 60891 23788 7052 -4963 -30608 -28205 1806 -7157
23928 -7157 26160 17785 -11205 -12768 8543 11355 -18619 -39165 -8517 23349 37385 25118
23916 25118 27545 25972 16288 -6775 -14964 -32598 -44632 -663 24620 21579 10001 -12205 39858
23903 39858 67205 30343 31054 46132 5498 -27451 -14245 16953 38630 59413 64171 32796
23891 32796 2861 -8368 -12816 -33288 -14677 -31215 -38472 -33737 -19440 -10331 26728 127
23879 127 -23839 -19338 -14374 -15229 -28678 -45647 -43935 -22228 -8997 -17320 -72754 -80348 -36719
23866 -36719 -28025 46893 59552 48585 80932 66983 40834 42990 20158 -13112 -9471 26621
23854 26621 1906 -15424 -11259 -35037 -48183 -45058 -33397 -23121 -61053 -67946 -12490 -10084
23842 -10084 4630 21619 44765 38494 17228 32550 14384 -5564 21819 -28667 -76263 -29616
23830 -29616 -17887 -22475 20998 12562 23031 44313 79414 78443 49340 10446 -18498 -4198
23818 -4198 -19741 5140 -13628 -13856 -2982 -200 -27036 -28759 -24048 -30451 -4778 17742 12636
23805 12636 -18138 -17730 -3320 12908 -12819 -54027 -44193 -15882 -3171 -27898 4664 43259
23793 43259 -2079 -38289 -42831 -41783 -27249 -48594 -65835 -67597 -60161 -22593 -14319 -43512 -58426
23780 -58426 -35791 -7581 10848 -18745 -25607 19697 21593 -13308 -16835 -42749 -31728 -34255
23768 -34255 -58179 -36246 -40841 -36475 -21573 -48311 -62072 -57976 -12195 11182 -25818 -25530 19143
23755 19143 6596 -15241 -37917 -37002 16302 18847 -22461 -12276 13374 -5679 -18581 12183
23743 12183 -5448 -12219 26916 38693 21104 -19999 -48309 -49517 -74731 -61971 -43766 -15465
23731 -15465 -2701 -25118 -33253 -19545 -25549 -26697 -17325 -31779 -39401 -29462 -14524 -36426 1872
23718 1872 2130 -30329 1712 -5241 -42845 -66597 -51074 -14567 -597 -11718 -26431 -53759
23706 -53759 -30213 -8849 -10102 3309 31873 17861 21513 -8477 -17232 -30279 -14042 -22668
23694 -22668 154 -12427 6305 22002 -1579 -49479 -46161 -5739 5960 -46757 -42158 2604
23682 2604 -23746 -61356 -62550 -39073 -27897 -16988 -8223 -12488 -24956 -40922 -43878 4591 12054
23669 12054 -5388 -52425 -87170 -59724 -14959 28615 38733 18697 28315 55570 89157 80051
23657 80051 65873 19400 -5209 14981 -10799 -16061 21848 23775 15451 24088 25289 36268 57320
23644 57320 69905 50266 57865 91127 79329 4489 3693 -11145 -56013 -84454 -67458 16502
23632 16502 61582 52020 -10582 -20950 -16615 -30042 26488 13916 -4039 -22215 -7296 -259
23620 -259 -18753 1459 20640 26996 -436 -19992 -27782 -64542 -69968 -33810 -8681 -3979 -20252
23607 -20252 -8604 -30590 -50732 -48495 -70815 -20056 -3467 -5946 -21259 -27595 -26167 -26832 -16922
23594 -16922 -3899 3485 27617 22440 -1149 -29559 -50333 -50484 -37853 -26555 -18295 -33574 -17586
23581 -17586 9717 34235 24197 2102 -38540 -5161 -13372 -40647 -28918 -42498 -21489 34517
23569 34517 76039 54725 20820 -9773 -18418 -21168 -8483 8190 11309 -5082 -40610 -81888
23557 -81888 -69425 -8984 47318 5999 -51616 -57269 -42642 -47893 1580 37834 33865 20168
23545 20168 6437 23928 62727 63121 36222 31028 25845 -10726 -26456 -15379 -7362 18408 46906
23532 46906 33466 4906 6057 6884 -16193 -26405 -35872 -1856 25407 12306 -14635 -39475
23520 -39475 -73125 -65912 -90390 -93076 -61411 -32398 -23559 -49088 -12313 7266 -7195 -49387
23508 -49387 -49927 -19951 -31421 -54504 -24788 46915 59760 44596 9125 -12531 -37393 -70516
23496 -70516 -109140 -134178 -188774 -134825 -50511 -30473 -5569 16403 18631 -16710 -58148 203
23484 203 9607 -9179 -43531 -67878 -58205 -11048 7705 11698 20709 11512 32024 34314 -72
23471 -72 -28703 -44941 -49548 -42939 -26237 -7961 -9000 1891 1443 17892 20022 -28010 -8163
23458 -8163 29112 12146 -5952 5979 -10488 -10126 15289 -17301 -16346 -7450 -26341 -38762 -24781
23445 -24781 -4699 -13669 763 -15055 12094 16053 -48517 -39931 -30383 -16671 -10362 9431 21963
23432 21963 22160 2876 -17787 -36715 -15812 -12064 -16926 -15760 18096 39171 54258 40030 60885
23419 60885 92939 72115 35113 25712 30486 67137 82223 -18278 -59830 -33351 -12450 20240
23407 20240 31596 4519 -8631 22862 77829 67917 63979 52773 33098 9624 33491 44542
23395 44542 21580 5692 -8942 -41255 -8753 32027 42305 23345 18383 16461 -15935 -37648
23383 -37648 10809 51316 55224 63383 28052 -15784 -24715 -31584 -39116 -19569 -23094 -2066 17401
23370 17401 37728 51620 9318 -57431 -95855 -72952 -27838 34200 56999 64768 28962 -22855
23358 -22855 -58293 -70985 -57632 -16638 -1256 24269 64144 19456 34089 73997 21692 28543
23346 28543 46224 16842 -31343 -25340 -14050 10807 29611 54350 37888 -5126 -57270 -42608
23334 -42608 -23251 -20234 8481 29765 3052 -17850 5677 50862 51943 63384 46867 19677
23322 19677 -33285 -71647 -84514 -32983 20132 42008 349 -41478 -44087 -13476 2147 -38100
23310 -38100 -66987 -52002 -20998 -21680 -19452 -41345 -53602 -21795 -558 20006 5410 2640
23298 2640 -5292 31190 21093 22497 56687 58452 -12385 -81212 -75330 -65381 -23085 -22817 -9860
23285 -9860 5598 -27563 -30980 5924 -6478 -42121 -30555 -12564 -37946 -33269 5479 20290
23273 20290 18280 5730 -1975 -24209 -37612 20853 38421 30118 -27914 -63903 -26043 -42628
23261 -42628 -62977 -14916 34926 33907 35957 47642 21984 -12395 22387 63774 34959 21461
23249 21461 585 7748 44097 26917 16492 39498 65957 45104 37350 35952 39500 18765
23237 18765 8293 26178 52829 42880 25078 13963 25879 48163 29922 -23117 -37577 -12506
23225 -12506 35369 -2307 -27974 -6933 14294 3826 2076 24715 69183 73006 71302 71211 -1272
23212 -1272 -1819 -36005 -15472 -9065 -67826 -65784 -80780 -108684 -79208 -8073 -11028 -17037 -8589
23199 -8589 -26763 -30794 -19997 -8049 -11191 -25399 -30403 -51094 -56880 -53875 -43237 -41718 -35396
23186 -35396 -42607 -65450 -52878 -24019 -9834 -25359 -18824 -1918 392 -11854 -45331 -28627
23174 -28627 -8333 -47226 -60370 -23450 17884 30812 31765 33859 -2984 -42610 -32037 28165
23162 28165 -3883 -45935 -23661 -13904 308 -3848 6896 -27825 -47553 -1325 -10623 -35431
23150 -35431 -48472 -34886 -18185 9886 10472 7540 -30540 -17812 13417 -3238 -53181 -86649
23138 -86649 -66752 -66768 -39977 -16814 20192 22469 35858 30704 32494 57160 100446 119460 92268
23125 92268 25219 -32502 -61907 -55820 -39991 -16258 1229 -1839 -12580 -32809 -48729 -91732
23113 -91732 -88759 -62424 -73203 -54191 -29149 -25298 -45745 -76505 -68348 -2507 64011 60263
23101 60263 -8940 -31524 -23252 18552 26006 -11373 1443 8686 -10581 -4205 24255 35327
23089 35327 10439 3036 -18433 -38755 -68692 -86946 -71807 -30153 11318 -951 -2006 16130
23077 16130 9677 -30112 -66589 -39073 -41594 -24481 7601 35567 -987 -10343 -471 13763
23065 13763 30572 72434 78292 15937 -28876 -48432 -24004 5655 6338 -60758 -58285 -50765 -43265
23052 -43265 -21758 -8831 -26637 10073 39879 16757 25272 31097 39081 -3510 -13915 -1166
23040 -1166 12902 6475 808 16735 1573 36910 42748 20619 -17882 2734 20530 20074 4332
23027 4332 10879 34160 23400 -2723 -30986 -5530 1974 22475 5353 -11106 -21399 -6557
23015 -6557 12430 21954 4453 -74477 -88023 -62849 -19254 7858 29543 3588 12150 22812
23003 22812 14175 37230 -10365 -77790 -99410 -80905 -76260 -40203 -12305 5886 13704 -15825
22991 -15825 -39491 -53789 -47850 -35666 -40497 -32893 28039 14960 6358 -3849 18128 37240
22979 37240 31223 11889 -6489 -1609 34918 39279 3422 -46191 -58584 -57248 -7121 -29977
22967 -29977 -53243 -89442 -89050 -41164 -18985 -15796 -5455 -14779 -35379 3675 17757 9096 -26389
22954 -26389 -38876 -33537 6446 71653 67693 46596 -8906 -86221 -30891 34231 17593 -17019
22942 -17019 -7096 3709 14258 13375 19435 16489 -8574 22081 -3026 -62098 -26032 5574 5295
22929 5295 -11447 -38854 -31225 18159 45357 77477 64750 21639 -11599 -20624 -30367 -17868
22917 -17868 -35137 -43017 -47571 -17063 -16438 -29070 -19338 19451 55501 23339 -29336 -40123 -50188
22904 -50188 -43812 -52958 -66821 -97469 -105481 -53765 -8304 -37383 -54402 -30822 -29816 6868
22892 6868 4888 -18739 9495 32031 30602 29460 -1101 -54183 -57685 -43996 -17729 -2603 225
22879 225 21131 68275 43380 8816 2900 25949 32528 22284 37177 30214 71160 60868 63668
22866 63668 35263 662 -18665 13824 44596 87353 81983 73755 33944 18120 -3557 -27812
22854 -27812 -37727 -78427 -112692 -82741 -8559 42587 57194 59041 48461 25867 -778 -4357
22842 -4357 34631 41467 40501 47262 46280 19325 53859 34185 21784 27799 -1525 -45550 -62285
22829 -62285 -24540 48898 48410 35173 -3959 6862 5570 -43004 -74894 -66845 -50709 -23645
22817 -23645 -48723 -94246 -106338 -79177 -61155 -61263 -73468 -84710 -81935 -59306 -43201 -50051
22805 -50051 -46144 -38504 -30909 -50359 -26081 -40591 -13536 15851 -10056 -25685 6296 34269
22793 34269 43502 9195 12185 33408 20464 5100 -18606 -12449 8208 20335 21949 39039
22781 39039 17041 -13022 -32244 -61387 -66158 -67582 -36827 -31963 19297 44142 28484 26521
22769 26521 11668 -6686 9731 14028 13147 47552 30180 -9771 -2651 26194 63285 68455 44655
22756 44655 14030 -10698 15929 1111 -47498 -52830 -24789 -12357 9250 18298 -28580 -44612
22744 -44612 -16112 7294 23478 8426 10182 28703 49126 -4298 -12017 9752 3562 7295
22732 7295 24041 32776 27554 51256 71934 11768 37322 64378 35410 -4210 7879 11857
22720 11857 3463 25317 35929 -9037 -6721 29746 23435 31255 51473 19261 6999 -23150
22708 -23150 -44309 -29229 -5243 35228 26990 -8520 -43732 -35194 2929 2782 -26690 -73045
22696 -73045 -103062 -76649 -59001 -55979 -52733 -63261 -57233 -56696 -47648 -75762 -78803 -54840 -37479
22683 -37479 -17065 -1126 -15096 -45235 -51435 -32870 -401 39654 30209 -1548 -47294 -53187
22671 -53187 -16480 -16336 12270 32553 23373 22666 -39787 -41916 -49522 -49299 -62835 -34526 -22053
22658 -22053 -38420 -74460 -97494 -64570 -30842 -14228 -21672 -33549 -43912 -57733 -101662 -87680
22646 -87680 -52164 -21828 4403 28828 42803 50996 27304 -17134 -30079 17299 11648 19549
22634 19549 4169 -10768 -45451 -28351 -22131 -35017 -27310 -32592 -69076 -78652 -75861 -88241 -81231
22621 -81231 -25823 -12097 -238 46924 31474 -4725 -20325 -11448 -10565 -30313 8759 20710
22609 20710 12225 -2559 2775 -9500 -40238 -36689 -63693 -48103 -15598 15419 26551 14604
22597 14604 23833 14784 37261 62303 39249 -3089 -23783 -77566 -92880 -57451 -99907 -111374
22585 -111374 -69239 -6221 -2523 -39549 -23394 -5284 15251 3036 -5644 -46022 -16706 22016
22573 22016 24534 -418 8792 28989 27296 -11532 -31585 -19259 -31097 -13366 -13639 -14802 -4499
22560 -4499 27389 35442 26094 34696 27605 5413 -12640 -20362 -17048 -9294 -11270 -30797 -3449
22547 -3449 -29042 -37925 -28599 -28434 -17071 -16933 -26476 -2163 -14543 -58741 -56003 -53994 7675 6568
22533 6568 13278 7835 -6634 -6228 -10681 -20820 -57354 -59043 -66582 -65858 -59662 -74208 -70065 -85816
22519 -85816 -53012 -51577 -27152 -18200 -11901 9675 34783 20712 -11837 -24356 -20475 -43964
22507 -43964 -73810 -46748 -49710 -32812 -21908 -71573 -83613 -77549 -77967 -41802 -11610 -13044 -35575
22494 -35575 -9250 18558 28031 18281 1489 8286 4802 -15158 -29307 -47786 -22765 -36136
22482 -36136 -77850 -64178 -52507 -41889 -85797 -102490 -67122 -34633 -23609 -28044 -52171 -52793
22470 -52793 -27006 22394 27366 -15612 -5500 -53890 -59894 -24527 3657 9600 15109 5918 -71417
22457 -71417 -96135 -47949 -11270 -39405 -28668 9728 -9931 -25963 -44663 -47584 -54484 -7465
22445 -7465 -18512 -45180 -15130 -30703 -51140 -29709 -46932 -43189 -7696 20759 8567 17683
22433 17683 32885 32342 12139 -4498 20457 57119 57241 -207 -58550 -21257 24212 50
22421 50 -43900 -25058 21322 61946 61018 30868 37974 21451 3406 3702 -673 -23012 -57172
22408 -57172 -94832 -60690 -38343 -13165 -4734 -31441 -17982 20530 46239 33375 -40610 -59275
22396 -59275 -47749 -22068 10092 27657 13388 40860 42410 -3596 -41174 -35382 -1901 8092
22384 8092 25977 72067 51640 44749 77561 46374 13417 -3275 -17137 -59682 -30604 -15166
22372 -15166 -7250 4902 -31643 -18369 23958 -5731 -18417 -18858 -8125 -8095 -27863 -3880 9874
22359 9874 -18742 -77705 -96893 -75247 -31811 -29305 -39318 16848 75058 48843 -3329 -27981
22347 -27981 -15672 -4798 -18506 6274 30905 3813 -11629 -6496 -27428 -36877 16780 28685
22335 28685 27652 15434 16845 31599 56025 50152 -19403 -35863 1905 5909 38154 67525
22323 67525 75729 49874 32730 20703 49789 8905 459 -7460 -27753 -28684 -49379 -61323 -29219
22310 -29219 -52778 -44372 -33706 -7327 5023 -3971 -15796 4150 30075 29495 27060 9010 -22664
22297 -22664 -52047 -40792 -38613 -63054 -75094 -52916 -32769 -33460 -41673 -10549 44845 49377 22460
22284 22460 10527 33731 63509 48552 62521 65390 29029 -18192 -39625 -13113 39273 9405
22272 9405 15351 36349 -17120 -53567 -78873 -77783 -63549 -35937 -5724 12159 2482 -18897
22260 -18897 -33227 -25669 15581 11906 -1961 -19587 -21373 15732 27467 15553 43616 40769
22248 40769 -12517 -3363 41107 38766 57864 58830 5673 30648 35634 21194 18890 -3758 -21073
22235 -21073 -67339 -34860 -7682 39745 55220 73651 99847 62954 49224 34502 -1804 -37728
22223 -37728 -30798 -13979 6989 14475 -7273 -8120 8347 53181 34229 2356 -1785 27015 14710
22210 14710 -4467 33013 64341 56231 41439 77039 70839 83550 70455 35165 57060 46910
22198 46910 11997 -9730 -869 -351 -20273 -10801 -8316 -45753 -23374 247 11453 40717 3047
22185 3047 7710 17242 23538 1297 -5444 -10351 -10325 10701 6637 24086 66312 47329 25530 23918
22171 23918 29303 63225 9689 -294 10593 36000 82319 77672 55327 53467 37195 16601
22159 16601 15474 30997 42309 42657 -24937 -29152 -7969 12504 3916 39481 58411 56882 21362
22146 21362 35282 72035 70935 45301 47662 37789 854 -32778 -36012 8328 20772 80521
22134 80521 83755 29969 -26003 -18136 4682 25407 33183 51784 26409 36521 49616 77696
22122 77696 66657 61742 34792 -243 1094 2837 19287 54571 65441 30351 26669 29418 49541
22109 49541 69836 24944 -4326 2951 29101 13336 -126 2374 21150 42190 23276 -17833
22097 -17833 -40324 -27525 12115 -2860 14080 46770 67880 22913 -2509 -15658 58630 94712
22085 94712 102206 108215 73431 41583 44252 61944 48338 32958 -8464 -25792 -27144 3992
22073 3992 43031 35103 74220 114574 77299 39992 34421 65714 55199 52284 46030 31071 -25573
22060 -25573 -21291 3021 20300 8714 -12849 -7692 59206 102985 67345 8781 12759 1795
22048 1795 4795 -11781 -28265 10930 29578 12282 18140 15279 -9642 -27443 -54515 -66882
22036 -66882 -60782 -35357 22612 32772 -12673 13679 61282 83654 70507 104154 58432 36471
22024 36471 66103 77944 39679 5761 20023 8204 -7608 11761 17872 4151 -16802 -32002
22012 -32002 -7821 30572 35789 -5819 -19367 -17842 -45128 -41513 -23914 -32332 16664 46532
22000 46532 77247 81428 75585 60531 22379 2036 364 6805 31433 30504 23741 666 19775
21987 19775 29451 40579 57212 38050 -9948 -49835 -7400 69293 58527 2486 2369 -17132
21975 -17132 -50096 -42458 -51912 -50081 -12668 29666 23036 3795 28193 13876 14109 15905 -21017
21962 -21017 -47209 -37774 24589 63987 51848 46530 58487 61049 18513 24902 49796 49631 28201
21949 28201 12931 9392 -6312 -5148 -11965 -31091 -25327 5947 27114 46141 15769 16907 16001
21936 16001 -3760 4678 7236 71497 93080 61426 37003 32327 33082 -13562 -36998 -22794 -16410
21923 -16410 -6081 26345 26041 -3180 -13356 -24192 -65758 -58022 -25935 -43762 -59342 -45325
21911 -45325 -30087 -23368 12234 -37749 -28848 31822 62986 62781 57601 66620 72114 22805 12599
21898 12599 -26004 -38670 -21834 -6286 -13754 13920 46653 34657 -6694 12688 31965 -14232
21886 -14232 -54760 -56211 -27815 -23478 1699 2563 -18462 -60244 -51480 2461 12939 26092 3739
21873 3739 -15251 22354 45155 59887 69532 66663 55379 83528 109826 101915 59024 50661 43806
21860 43806 16776 45258 33543 1966 8294 51878 86489 108761 105850 116027 81008 47967
21848 47967 9368 11425 18921 18068 541 -11382 -20564 -530 35376 50381 16638 16288 40907
21835 40907 76254 102033 63408 21190 12616 3477 68167 100199 75063 55884 57464 64568
21823 64568 50507 66010 85711 118499 105093 47752 6143 12810 9491 -20690 -41965 -24427
21811 -24427 -7740 13597 71215 67224 2679 -70529 -50592 -28841 -18991 23784 54683 68916
21799 68916 50888 45357 52460 31154 45792 52601 22528 25175 35243 24896 27540 39451 50987
21786 50987 61100 39777 34440 35445 66609 79746 76738 66851 63392 25755 10825 1477 12230
21773 12230 -18920 -54504 -60326 -39826 -2005 -7329 -3227 -6478 122 12563 -6345 -39159 -50815
21760 -50815 -33883 -75 1073 2082 -39609 -16614 17708 38356 37805 -5602 4187 39621 49213
21747 49213 19308 4191 -16951 -753 -11445 -15601 -37978 395 53332 60116 51450 36186
21735 36186 54538 49026 -7098 -57221 -15419 45167 61056 47180 45683 15453 -29320 -37256
21723 -37256 -12809 20775 23580 9576 23103 35407 437 -6767 -23445 -52215 -26443 16470
21711 16470 49703 16673 -3193 -8882 -9133 -16036 5966 23041 11587 -16178 -55095 -32460
21699 -32460 -15299 27335 -4015 -20511 25637 48153 76990 88730 68360 17959 26446 43632
21687 43632 42105 26948 25444 -2078 24463 22443 11963 23403 35570 -352 3552 23316
21675 23316 27585 23326 24283 21918 42200 11526 -15477 -40330 -10901 19234 13346 6017 24584
21662 24584 57662 82093 26169 -22821 -40891 21889 54613 40137 2163 2831 21814 21472
21650 21472 56595 49525 57297 50932 73348 40445 -3254 -20126 -13123 -15823 -10251 8898 27233
21637 27233 31222 18428 3370 34209 83031 65778 32191 14943 37651 37418 36518 53486 82276
21624 82276 59760 45865 47027 -2826 -38876 -37280 -30293 -10540 -15707 -23882 -44101 -50916 -46571
21611 -46571 -7000 6632 -9347 1832 -24746 -41593 -41668 6965 51997 20971 10047 43948
21599 43948 84701 70394 93777 84056 52092 43617 64874 51594 42387 54082 77417 81673
21587 81673 48329 41406 36822 -44860 -8862 21898 22535 66008 -14719 -47626 -47147 -33885 -27795
21574 -27795 1225 -12750 -2962 16118 -7818 -15481 -57147 -66163 -43834 -30223 -8871 -13456
21562 -13456 -10514 -23602 -23409 1824 16064 24988 30151 28814 55556 37133 15041 49201 26454
21549 26454 30415 35114 7265 10054 12363 -3783 -36647 -18366 -2070 36852 38461 6363 8468
21536 8468 8958 36502 27965 20954 -39062 -42580 -62899 -60842 -21575 -1620 38660 28363 -8668
21523 -8668 -22009 33535 44244 3215 -46228 -24343 -8447 -41306 -35831 20431 27160 -2079
21511 -2079 -20565 -1665 -19847 -38242 -15806 -7914 -22376 -552 5227 -10131 -33807 -25022
21499 -25022 27698 44625 25063 8109 -20758 -21521 -12466 -66040 -64431 -7658 6907 171 4156
21486 4156 -28315 -39586 11647 41110 44907 37678 11120 14447 30113 55568 45681 2054 -18272
21473 -18272 -8945 24218 49046 39388 2704 -19846 -6114 36998 23167 11827 -9990 -6154
21461 -6154 -30590 -2732 47335 64282 53022 35775 30730 51186 52285 -21164 -21630 -10264 37024
21448 37024 37691 47184 5880 -2755 36522 55154 62232 33236 20404 43667 50908 21306 11604
21435 11604 -31628 -38777 -48052 -49930 -56272 -17687 -15620 -10213 16997 31151 8550 -13292 -45751
21422 -45751 -51276 -45612 -52109 -56266 -59094 -26195 15357 27621 -1187 -15282 8659 4462 13231
21409 13231 7494 990 38477 59619 63969 61374 89026 98685 34892 37070 38825 6925 -3591
21396 -3591 36909 77590 85514 62167 25529 -5280 13143 4153 -16564 -10907 13884 -5019
21384 -5019 2580 51402 62404 23048 9947 -19141 -28072 2817 1366 -19776 -27696 -20095 -19512
21371 -19512 -67229 -97776 -58449 -11367 44103 23241 3179 5183 -12745 33711 90474 64711
21359 64711 45859 56993 21109 -33334 -52013 -63033 -34846 7386 -19305 -19031 12308 36091
21347 36091 88389 112391 112398 93021 71303 62673 44904 36690 59960 87700 78104 68120 21605
21334 21605 52200 88867 133235 154979 102892 87515 102281 81803 101511 152921 178704 187305
21322 187305 188126 195886 196936 268626 388463 469436 534049 679907 862873 1070417 1205561
21311 1205561 1271055 1263620 1188397 1072941 851164 688128 543918 451770 369417 314130 236912
21300 236912 213062 216485 216378 215783 228938 178729 93768 84293 97115 84869 71194 43515 46575
21287 46575 65098 37227 22196 10702 4074 38009 86174 107801 93683 98262 79000 120541
21275 120541 77543 25151 5765 32123 52657 10456 5031 -9245 -1162 26846 22708 12846
21263 12846 -95 -18184 -6734 8136 -1043 20764 22775 -8316 -39026 -79318 -66888 -12414
21251 -12414 -705 -29397 15443 34251 28359 32358 2934 5838 -43038 -53125 -13239 -9409
21239 -9409 6985 72952 55908 10254 -41535 -51885 -40064 -41550 2063 -14503 -60833 -89360
21227 -89360 -55590 -38715 -27983 -15360 -17419 12681 2245 22488 60196 53416 34699 71016
21215 71016 90510 66840 25458 30586 37880 33171 8885 3975 -14771 -35385 -24412 -21108 -17944
21202 -17944 36794 64639 18481 -9616 -11118 21994 -12408 -27406 -28743 -48753 -18103 -20513
21190 -20513 -17441 14649 11234 -14161 -24619 -27258 -17021 11810 12005 -15036 -32762 -6386 2294
21177 2294 8680 6479 36027 27505 -15929 -4783 -2045 -9102 4203 40232 32004 14812 15211
21164 15211 -11813 -14377 -35104 -12248 -1010 -8320 2726 -23496 18135 28866 18458 14307
21152 14307 6427 29109 38118 35985 37905 43146 38756 44846 35376 58437 88699 70603 42729
21139 42729 67703 73151 96921 100935 79358 4212 10606 61401 70822 81891 69364 26702
21127 26702 6785 40697 58044 63699 91907 79635 18104 -23607 -6812 27971 57072 37601
21115 37601 47055 46893 23680 42402 59900 52656 34583 53849 80510 85897 63666 64755 79366
21102 79366 80139 40423 -2752 11158 62331 61821 47851 39088 45782 61614 140086 257135 294580
21089 294580 346763 444674 535020 506164 444071 327296 197031 162457 128753 102587 60082
21078 60082 71967 92777 86750 63126 62940 94391 105096 108360 100388 99982 116590 137819 92805
21065 92805 33118 -1271 -28149 -43096 -37151 -7313 -1660 29195 67611 74352 70111 46966
21053 46966 39607 66884 91850 84022 73865 77040 82253 55991 24512 21629 18789 58996 30538
21040 30538 4132 1947 -31323 -63833 -22244 80576 112352 65715 17609 -33795 -25840 1485
21028 1485 17833 81434 115829 157164 124087 90580 106775 85452 71636 82810 111341 86831
21016 86831 45421 18215 39981 71992 83022 66960 72535 90744 62472 22353 28509 47217
21004 47217 76121 82862 100192 123994 127991 78880 100270 89867 84395 86085 102916 125653
20992 125653 93365 93864 71052 69054 50096 20190 14631 57128 64640 55789 49629 61776 96998
20979 96998 88058 40254 49254 98840 102552 79773 77181 49881 34866 32812 67365 71425 97411
20966 97411 109919 92926 81373 76585 96564 97119 82045 73791 86738 70111 60768 36852 15219
20953 15219 65513 87978 101789 113317 149935 147957 131171 110157 123280 101595 49047 31802
20941 31802 9334 12937 35936 86833 107418 123495 80867 55813 39903 -6083 19496 64045
20929 64045 85200 84689 57522 72595 105203 70616 88245 87734 72156 101966 125164 118502 93215
20916 93215 109782 131103 116785 108894 134308 107740 93296 112126 120767 134196 181589 218797
20904 218797 223529 217256 214359 201218 202454 209358 229466 227949 197861 175549 156483 119208 107340
20891 107340 86654 92090 88068 112718 128306 104671 74347 70730 170731 205006 208181 176571
20879 176571 128627 130970 132005 108149 62980 41603 12588 50237 72973 72147 83516 90562
20867 90562 163088 199490 196671 166253 162657 140192 130522 173976 175219 159440 163702 154052 154777
20854 154777 158572 182173 210214 201163 174646 184514 148819 135186 133476 158567 189740 205641
20842 205641 211050 192280 182001 204327 200562 225721 219570 211832 196006 177225 218677 276151
20830 276151 283901 233826 211795 202013 195605 214297 186975 178226 172092 152313 149760 190971 210064
20817 210064 174587 151478 169819 193738 241700 242305 222303 206655 170519 174276 219306 254363
20805 254363 262217 273554 293311 317847 329208 321852 315623 296891 288388 289748 277711 270411 252431
20792 252431 239717 253430 286572 337397 307585 290630 271911 272338 287955 295929 331190 384140
20780 384140 384903 379490 374890 429341 498299 510525 500330 512673 501397 517496 530597 509260
20768 509260 500172 527690 546897 519236 485493 518028 457719 435371 434166 449986 405620 388588
20756 388588 446652 478021 423202 452829 482618 535338 547520 532919 532740 556814 565054 619039
20744 619039 626598 573849 576191 595323 602118 638569 664115 711628 744214 763097 730253 665957
20732 665957 677462 705621 745391 747314 727311 743871 771589 793328 823464 817871 846509 890860
20720 890860 908629 974619 1045476 1080570 1085497 1102352 1133978 1170809 1232397 1274169 1307772 1356421
20708 1356421 1397424 1483081 1595408 1674517 1767717 1893193 2033903 2180176 2356190 2623940
20698 2623940 2935186 3243329 3492693 3690552 3848055 4020380 4166309 4408918 4718683
20689 4718683 5079905 5407711 5635235 5696882 5634849 5482642 5357007 5285247 5260389 5298221
20679 5298221 5414186 5564289 5768315 6105393 6496308 6947620 7454880 8015052 8663311
20670 8663311 9387973 10249450 11281897 12504890 13937698 15549637 17446475 19710788
20662 19710788 22403604 25536444 29283783 33839989 39534503 46823002 56335633 69027502
20654 69027502 86018494 108424823 136371777 167854644 197974448 220386213 229764335
20647 229764335 223920070 204578959 176735647 146438544 118491771 95011336 76235540
20640 76235540 61550566 50104505 41232814 34328066 28906202 24607510 21229908 18492858
20632 18492858 16202309 14311754 12768834 11423860 10300242 9301669 8451671 7688576
20624 7688576 7109669 6558579 6099064 5712846 5383569 5073122 4806595 4593334 4481728
20615 4481728 4428674 4414894 4586765 4799447 4991769 5124917 5152688 5009423 4694352 4321130
20605 4321130 3905955 3596936 3400600 3253684 3198155 3149453 3080739 2950369 2746288 2509965
20595 2509965 2221900 1972690 1816647 1680651 1544315 1422321 1350608 1272533 1204843 1146719
20585 1146719 1100367 1093358 1101194 1039656 993238 986808 919967 839686 808398 743388 650525 651636
20573 651636 621423 593664 587989 601452 624741 602305 561713 543998 534728 484884 455816 456889
20561 456889 470883 446346 389334 349048 382295 413191 404752 437594 436328 427235 424506 377465
20549 377465 376503 377420 327787 345520 354177 317528 307109 293183 269388 259411 260525 249617 260579
20536 260579 254843 226703 239858 221562 251122 271952 289866 266191 236584 249689 238754 216815
20524 216815 161882 126780 126626 149952 179108 195772 185802 185733 155997 161442 177044 184554 161516
20511 161516 131700 136635 118939 94973 98269 120368 102932 88332 85522 132335 190395 202207
20499 202207 136543 96770 88560 51379 22470 -13350 -35656 -31646 -2410 26557 64306 62126
20487 62126 72117 92422 95321 106907 112654 100902 103324 88600 112471 135390 181165 203763
20475 203763 184074 161062 126806 154969 169171 139188 105902 46941 9576 31015 73289
20464 73289 68811 59208 85950 75236 32902 24531 76179 89181 47287 47103 50103 50845 59737
20451 59737 59391 19529 84748 128303 125757 126934 98229 76015 73133 62796 30179 742 6128
20438 6128 14211 11141 12722 69187 116860 156395 114487 75179 50851 14524 14195 37766 61199
20425 61199 82771 80727 71755 32796 14933 36561 98621 118684 104085 117395 93227 74452
20413 74452 115146 145276 161038 149785 103388 82112 74415 66129 92888 58305 73671 54253
20401 54253 -14915 -31267 45306 84181 79050 48075 19174 -9252 -27746 12446 35256 99439
20389 99439 107824 128534 176762 175082 190528 166556 188964 193755 201747 181997 168423 199792
20377 199792 178644 116195 89148 89913 48357 24932 68832 105597 120220 101568 81767 73567
20365 73567 56071 25278 57917 109105 113663 98748 91824 65587 49670 15722 9153 31056
20353 31056 55124 97661 133480 124036 54968 39597 51439 45705 46387 19271 -16914 8958
20341 8958 44269 50705 73381 76062 31510 14062 28164 9832 9887 20734 20268 25813 9960
20328 9960 -19317 -34970 -53614 -22875 30583 26297 14085 24365 30679 249 2737 -22322
20316 -22322 -7991 20877 -20372 -40974 -60474 -56272 15147 44188 38088 53554 58646 58460 30651
20303 30651 6354 12893 -34529 -56440 -43753 -20499 6410 3646 980 -32592 -43483 -59684
20291 -59684 -80095 -61629 3606 59868 69971 55662 53933 28874 23522 25677 12118 -7386
20279 -7386 561 24271 -2055 7266 -3993 15008 41443 41596 40485 39339 33917 27402 54232
20266 54232 39598 24974 -14206 8245 11053 2065 -23340 -36139 -28914 -33848 -23625 -35681
20254 -35681 -25569 15040 28933 -14934 -25485 1523 14795 19766 36381 -7442 -54835 -76117
20242 -76117 -67512 -47433 -28363 16225 56896 45289 20432 -28077 -25705 -24784 -19409 33897 19765
20229 19765 27122 23699 4199 -19050 -10303 -10376 -57069 -41632 -5088 -3706 27161 41558 51444
20216 51444 43503 17479 -28864 -43891 -29157 25081 55251 30853 25535 33215 43944 111415
20204 111415 183118 193870 171887 168399 147627 180016 193862 199529 188609 150992 99042 46107
20192 46107 70669 60951 51164 47034 17777 57769 57987 25043 23070 39153 25286 -2987 -1240
20179 -1240 -19045 -49755 -22331 -309 -6560 7790 46187 78249 49391 -208 984 -18899
20167 -18899 16164 19071 32013 45365 39374 1428 -16326 14272 7913 -15072 -48624 -36949
20155 -36949 -30845 -4274 38151 50799 11831 -868 2034 7905 23920 35580 33450 11905
20143 11905 -18421 -46078 -37949 -944 4648 -8733 -20354 -42316 -61164 -53434 10003 14160
20131 14160 -2682 -25281 -14744 10122 -30363 -27482 -3034 -18481 -13900 -309 -17207 18158
20119 18158 12536 45240 37233 -3394 -31343 -7279 15950 -33612 -54416 -68644 -30985 -38163
20107 -38163 -53573 -13928 35036 1111 -23515 -16107 -21309 -2040 35445 9296 4667 -14226
20095 -14226 -5421 9252 3900 -19026 -8812 40122 24602 12276 8448 13639 -9432 -4211 -23552
20082 -23552 -53162 -33610 -8435 14272 32095 19137 -886 28069 -5323 -25008 -12398 -20830
20070 -20830 -25915 -18147 -33111 -21097 -56116 -96136 -79413 -25823 -23574 -44001 -76367 -74515
20058 -74515 -27611 -25609 -44451 -27697 4862 14706 10420 -21299 -42546 -35906 -23191 -7970
20046 -7970 1201 14897 37209 70436 99258 99545 85820 78752 20505 15472 36224 21251 17878
20033 17878 14581 412 13839 39048 25533 -10276 7819 25102 33392 15339 -8434 -41898
20021 -41898 -5548 14658 21465 19706 -4737 20473 29125 -4801 16778 8056 -19893 29156
20009 29156 29804 25151 -13662 -42397 -47302 -27446 14664 42906 49094 38673 11538 19432 39771
19996 39771 70530 54094 48229 55901 93641 118042 143559 138552 176913 230705 304589 353637
19984 353637 471272 651233 811488 967043 1103217 1195660 1234173 1174026 1029494 892600
19974 892600 764009 617720 490349 412231 326096 305876 258695 239983 192974 163402 163408 118340
19962 118340 144378 104387 58364 16573 -2935 37494 50686 78837 78686 74745 76370 90454
19950 90454 111116 82208 44658 26485 49560 46633 70432 104142 112069 109635 124972 160712
19938 160712 190992 290512 365776 378033 387993 379861 362508 259500 141409 96003 68571
19927 68571 43321 41356 24073 7416 -9422 -29199 -22910 -27061 -11171 28196 60293 42424
19915 42424 14042 -7088 -31697 -65378 -79863 -35243 2406 38337 5853 -23837 -14560 -6239
19903 -6239 5605 19542 28013 40166 44538 7861 -4741 -17642 -23961 -27346 -24285 -10705 -21712
19890 -21712 -21317 -5023 -30255 10945 54760 55142 57682 21887 75890 64195 17042 -33920 -72632
19877 -72632 -80572 -83072 -33377 -7562 -36276 -25986 -771 -34474 -56512 -2469 13034 -2814
19865 -2814 9716 40220 -18759 -64355 -59053 -1226 33801 44212 8031 10936 -17785 -78300
19853 -78300 -75505 -75190 -64806 -64037 -34129 -51618 -61871 -87367 -64417 -66682 -65344 -64229 -49824
19840 -49824 -52723 -51538 -2277 164 54420 61413 15044 3888 15414 40571 49688 39210 6141
19827 6141 -23776 -65896 -36412 -27997 -57192 -35799 35304 62792 50396 25336 -16497 -39910
19815 -39910 -25598 -10963 2496 10877 -28176 -38359 -26710 -31904 -34145 -39656 -68275 -50994
19803 -50994 -13389 -25707 -18553 11717 36035 -8185 -19827 -14324 -4694 -50831 -56381 -29250
19791 -29250 -51682 -47514 -36890 -52022 -76557 -82398 -70057 -90559 -116848 -75878 -63775 -88596
19779 -88596 -112518 -137487 -128105 -104015 -86523 -94882 -64183 -18973 -27085 -30782 -60448 -89822
19767 -89822 -61081 -33368 -39608 -55551 -50977 -28080 -6145 7423 16083 8048 -26532 -65009
19755 -65009 -42533 -45282 -18580 -1145 -37322 -73964 -22204 9897 -31848 -81189 -50560 3451
19743 3451 17413 17948 -4094 7164 16912 -48219 -83533 -37010 5971 -7948 -20052 -4680
19731 -4680 27296 52201 29774 20496 -1203 -19698 -41678 -27171 11385 14943 -18677 -16545
19719 -16545 -39078 -67803 -38986 -38053 -2825 8068 2120 31906 19247 10849 -5005 -13595 -10865
19706 -10865 -5935 763 15735 13074 -24161 -19008 69667 101813 130772 102924 64537 37353
19694 37353 30410 -15750 -8686 -9413 -24142 12546 23666 20889 28230 13606 12113 13732 -15102
19681 -15102 -40507 -53386 -94511 -79471 -44048 -39885 -34556 -49287 -70512 -85045 -62412 -37992
19669 -37992 -18745 -13116 5665 -23988 -21356 1189 -24502 -35149 -14949 -12965 -16463 -17093 -42782
19656 -42782 -8862 -18646 -2213 5719 35151 21608 -2070 8083 6676 31041 26459 1573
19644 1573 19588 21262 22746 18518 883 7161 -37895 -55723 -18657 -5103 -20216 -39914 -70381
19631 -70381 -75457 -50384 -39073 -12218 19848 -20951 -35048 -21269 18850 31139 56195 52206
19619 52206 16024 6778 1541 7171 30542 47626 -19971 -28164 -15768 -10284 -28397 -53793 -15782
19606 -15782 16299 24216 16591 15871 37247 10101 28401 55 -6323 6062 -22053 -46878 -31169
19593 -31169 -13383 16227 41034 10526 -69514 -76658 -63733 -46870 -29670 -34328 -33475 -570
19581 -570 -23153 -7053 -7876 -30244 -46543 -55075 -41071 -24418 -90840 -138661 -88685 -22313 20165
19568 20165 21895 -15098 -22661 -41120 -52060 -45465 -5757 39112 33672 -43592 -55369 -21810
19556 -21810 -4190 -8612 -6709 -8960 -24560 -23503 9246 18432 -9241 -7862 -25650 -13421 -12659
19543 -12659 -37843 -31223 215 16282 19163 8010 7785 15969 -16327 -15658 -28221 -45307 -66188
19530 -66188 -31648 33126 16300 15311 41639 55461 70220 48749 10843 -5719 -4555 11162
19518 11162 1305 -6848 39441 53204 81680 68352 -8996 -49179 -18708 -12094 -8182 8170
19506 8170 14372 26464 10320 3993 -709 -27535 -47135 -27901 12043 12013 -28902 -28034 -35023 -4087
19492 -4087 10153 14241 5742 -26571 -53043 -42634 -57612 -53205 -44696 -14371 12306 46826 69084
19479 69084 73446 92608 69144 53797 50968 41407 36761 -9208 1493 37396 33126 883 -32920
19466 -32920 -36747 -27426 -6238 -16980 -40221 -52706 -32783 -20180 -64417 -58024 -64414 -72974 -78810
19453 -78810 -79422 -67017 -43496 -15411 -6717 45275 43783 6201 9631 151 -8891 -10947 20896
19440 20896 51583 50212 24709 13491 23771 2401 -13196 -14268 -30334 -25931 -34044 -38863 -44449
19427 -44449 -44062 -42599 -6104 -8430 -20723 -53901 -32998 3683 -6824 -14621 -17126 -9478 -10173
19414 -10173 16666 -35079 -29116 -17061 -948 37747 12875 -26847 -26094 -44792 -7126 20832
19402 20832 -4268 -40246 -49912 -54378 -36095 -22153 -2742 3242 -36733 -52214 -72341 -58882
19390 -58882 -45520 -46202 -7991 -6101 -35378 -84302 -126687 -132473 -151139 -110654 -33559 20254
19378 20254 46420 54815 55560 58073 32624 35369 -8444 -36398 -49100 -29489 -39424 -37827 -29859
19365 -29859 -32533 -35623 -72910 -85980 -94556 -47185 20612 25367 19901 -14281 -37325 13308 18942
19352 18942 55258 98499 99086 34284 24696 27842 46363 18605 -13658 -50233 -14481 10140
19340 10140 20243 -9525 -64009 -90765 -49192 12947 31718 80477 81985 60803 45481 88354
19328 88354 115838 115921 105041 77744 25904 21261 51264 62693 65127 90554 96026 95826 43054
19315 43054 40564 111586 183158 350159 589262 826788 985924 1010710 921092 824613 623486
19304 623486 442620 311796 226607 173684 156971 144700 166218 229115 220143 180715 134384
19293 134384 118224 119257 140605 174614 140581 113803 92480 88489 81227 91433 137748 141763
19281 141763 158340 189175 188000 220777 274065 282831 304635 468224 750199 1023054 1161277
19270 1161277 1231163 1180138 1007489 732550 513998 368282 258945 198104 183128 163245
19260 163245 158135 142690 134679 89061 72877 86269 119209 111553 80059 97327 90158 102042
19248 102042 95495 99200 58519 11345 17281 37513 44833 43654 19545 -4913 19173 65455
19236 65455 42119 -4068 -45516 -60596 -22247 7767 -5851 -25097 21531 56108 30454 29580
19224 29580 23973 56430 60097 42441 -36373 -52867 -40651 -16083 -22447 -36937 -29175 -19363 -19726
19211 -19726 -15620 15636 18323 37403 18210 1964 13094 -41959 -41584 -22265 -27328 -37766 -48745
19198 -48745 -25501 26616 11332 6132 17615 -11606 12239 13544 34267 44672 31763 24308
19186 24308 -17391 -58576 -75211 -45919 -35640 -35031 -54951 -39478 -78219 -96606 -64865 -63634
19174 -63634 -39895 -24923 -11572 4715 43843 7977 -3351 -19731 -26695 -17549 12797 44474
19162 44474 58116 31423 -11081 -7070 21506 29485 -278 -18572 -20415 -39617 -21528 -52109
19150 -52109 -34361 -20973 7124 60970 68531 10381 -16700 26737 3906 -23363 -35244 -12578
19138 -12578 -5788 8590 30663 43789 32337 7089 14735 15138 -6276 -19335 -55660 -70989
19126 -70989 -22375 -2351 -28459 -6612 28698 32826 47102 66523 72031 48779 7945 -18602
19114 -18602 -3103 11312 1382 21271 37552 30638 -2206 -20789 -14993 -34230 -21869 6760
19102 6760 19666 60889 44560 9394 -8954 14922 54944 34977 -11862 12874 21114 30165
19090 30165 40249 3329 19852 40332 9576 -19789 1474 45594 57872 37465 20140 -28321
19078 -28321 -37853 -2005 48920 41273 51154 22836 17218 41945 10886 -24727 -23047 3919 -3074
19065 -3074 23016 35324 36529 53214 25400 24924 33976 44892 48898 33080 22639 -1959 -18025
19052 -18025 23916 35628 31904 56335 54610 38382 38450 31880 56975 52452 52653 36215 3889
19039 3889 4243 16242 -3537 12307 23860 26928 52109 63685 54180 39920 7501 27422 29518
19026 29518 17069 1299 -39556 -56188 -62432 -29114 2457 29816 37623 4050 -35567 -65244
19014 -65244 -43589 -44418 -59526 -56434 -2365 39088 34868 -102 11186 70691 71678 55041 67817
19001 67817 79522 36516 49924 58854 37167 96097 121156 151018 214490 328422 539771
18990 539771 815066 1071106 1075483 857492 604640 404985 287642 212450 153532 102850
18980 102850 82680 40635 33671 38362 86314 105724 85116 93894 114110 87309 64420 85108
18968 85108 110728 123739 105924 92355 67407 92889 117811 120552 127179 126689 90902 66946
18956 66946 115680 199889 370059 654707 1053041 1391933 1502868 1245247 882423 626360
18946 626360 439468 313077 280958 229297 190021 147905 114926 101714 98558 91017 74267
18935 74267 74352 97704 117013 157145 184630 209855 142134 74067 108215 106150 95512 76807
18923 76807 40509 42174 40607 47323 55572 45301 6757 -32773 -3615 21412 29673 -20542 -56693
18910 -56693 -29282 -9914 57500 69811 7041 16435 36216 74727 84232 64192 42055 7209
18898 7209 9277 21145 15861 -4998 16971 46946 43014 27723 22060 72106 94921 126510 113191
18885 113191 80205 58238 41348 55686 66409 77087 95743 81445 19051 35369 66158
18874 66158 102348 132182 108300 112883 147414 151910 109989 116154 137122 141949 98710 68310
18862 68310 35294 15082 26601 44157 72152 89611 86540 75807 88328 80273 99258 143101
18850 143101 125393 42920 33590 44888 50377 123965 173474 198957 220649 221671 203182 204040
18838 204040 190221 202723 229270 225948 229818 216870 188315 199560 204051 183095 177090 93472
18826 93472 68750 101711 127111 100494 101437 126588 152313 174151 162877 153566 144844 141072 146557
18813 146557 151113 162202 182946 209169 231929 285443 322774 331256 346662 373713 327786 287115
18801 287115 279467 250108 251436 228384 231153 228446 207131 157530 149709 152579 157616 180903 231170
18788 231170 240517 216025 211484 239147 256239 293800 286289 304739 320125 273781 240188 227560
18776 227560 312945 383966 480655 549398 582304 564379 620147 652141 675650 768896 878018
18765 878018 943334 861462 777011 746998 684185 624501 640954 717129 749885 780338 865010
18754 865010 927908 998016 1133898 1337372 1624741 1877765 2047568 2110397 2171440 2215951
18744 2215951 2317338 2540587 2729408 2831653 2896363 2919313 2893603 2977179 3242167 3595718
18734 3595718 4052993 4610355 5336949 6131544 7013136 8038176 9296647 10865131 12849940
18725 12849940 15718798 20218391 27917320 42582988 70864633 111723424 148103907
18718 148103907 172810034 173580156 153681095 119812026 80705844 54319143 38357299
18711 38357299 28197119 21558278 16952055 13752871 11652230 10379060 9652298 9201371
18703 9201371 8768395 8224466 7586299 6956927 6551871 6461947 6586155 7024774 7701626 8576813
18693 8576813 9636455 10772131 11999329 13428433 15182845 17458980 20699064 25726850
18685 25726850 34176324 50002311 81016006 131124533 181348044 217844645 228463282
18678 228463282 207942494 168883830 116695797 76934949 52697086 37258537 27210127
18671 27210127 20414330 15741069 12566663 10406164 8881625 7818680 6935361 6130115
18663 6130115 5333129 4600753 3999894 3586744 3340210 3273632 3356376 3443592 3521022 3486640
18653 3486640 3398737 3326426 3221076 3107210 2986999 2747606 2417445 2035353 1700179 1467988
18643 1467988 1360858 1289613 1208961 1119483 1050414 963415 885911 850742 780894 717505 642802
18632 642802 562183 543744 533413 567296 600380 604743 606011 608504 598752 569907 566111 588620
18620 588620 585358 579266 590006 651307 721041 665997 584403 533118 466618 460077 397799 394522
18608 394522 382098 381837 381915 368753 369003 353107 369879 377854 414822 436048 460856 459004 411908
18595 411908 341237 276574 247467 204141 162155 174088 206910 238867 261141 331604 424721
18584 424721 402011 376005 342787 283406 205834 182937 157597 202757 277433 295400 278467
18573 278467 288855 275458 177366 159372 152082 179264 181185 160025 143148 109422 105653 153910
18561 153910 146701 181068 248664 332407 399064 404744 375050 337137 283943 287500 297360 326651
18549 326651 329586 337497 349517 395536 358407 322825 304865 284384 233453 167954 163295 166880
18537 166880 178822 171215 147558 129791 127841 137440 136393 131498 116106 98800 158128 236334
18525 236334 336050 412657 409742 409975 392973 352827 375823 400467 429038 440270 436457 407972
18513 407972 364489 369071 341506 307033 295741 265832 260196 256229 258692 276245 273002 281745 312566
18500 312566 350171 369354 338544 352803 395054 459155 520765 526349 490157 433691 396057 480401
18488 480401 624587 688723 757312 730655 733685 719109 689812 668022 611110 607604 644504 632996
18476 632996 616078 635932 649268 662157 681720 714289 759991 813726 846317 891119 967544
18465 967544 1058398 1081558 1133370 1220745 1364299 1538141 1823240 2272698 2871027 3311911
18455 3311911 3431711 3247574 2995299 2956874 3229061 3737504 4408677 5118066 5696107 6221367
18445 6221367 6893424 7730095 8559749 9399661 10328865 11369388 12578186 14354537 17230371
18436 17230371 21566835 28289223 39631535 61579062 107115343 185145960 258107409
18429 258107409 276412720 230918317 154451516 99827151 67828111 48039961 35272954
18422 35272954 26539854 20444852 16260922 13488802 11711208 10518652 9785432 9372382
18414 9372382 9031393 8684523 8444833 8386429 8335874 8119866 7892177 7974832 8503254 9320974
18404 9320974 10203535 10865398 11256458 11541881 12317558 13960025 16729984 21041478 28293163
18395 28293163 41896588 70419208 124498019 187054697 214665858 192155438 133837549
18388 133837549 85290887 56802677 39586483 28641508 21288263 16072224 12413232
18381 12413232 9762211 7942154 6756499 6128163 5910380 5776503 5480198 5129462 4763570
18372 4763570 4287907 3677459 3119662 2748103 2582411 2593081 2761235 2821288 2597869 2205806
18362 2205806 1846101 1555734 1345601 1178040 1082824 1034287 992425 958453 931870 925492 882805
18351 882805 809862 751223 738420 734756 731613 692858 614785 527145 498007 465962 448087 420685
18339 420685 360130 388927 444659 480455 478016 470917 467938 439659 417296 483656 537271 532782
18327 532782 499733 484742 421923 365811 336953 320193 325751 334297 329055 288813 290633 315314
18315 315314 310975 313978 294470 286105 288912 272803 256969 266254 260625 265273 221814 208886 240127
18302 240127 239562 216257 249821 315345 341827 317613 290113 350846 385611 395200 430337 443932
18290 443932 417735 350004 293534 273681 253718 233845 197268 235853 277968 269235 217269 204488
18278 204488 171262 131489 110620 91533 112919 138540 141749 152060 145754 135582 160483 145596
18266 145596 150176 179842 168532 209261 228346 213863 232886 227983 168139 159778 179196 201150
18254 201150 155077 143492 136909 142207 136266 69737 66297 108705 102607 109530 104141 90016 89580
18241 89580 96767 63622 35669 69563 102047 117922 152940 217990 261369 243335 239703 185167
18229 185167 123886 142390 176544 212161 165790 122469 114940 116948 118281 70864 44002 55558
18217 55558 68273 60975 82365 83520 54216 96901 94308 95196 96006 79136 96005 109758 62129
18204 62129 70203 100127 122138 95883 88533 101755 124731 141635 118006 136268 183584 273859
18192 273859 348316 360069 328143 333825 309473 255827 234529 205675 188458 171915 158105 142474
18180 142474 124348 147137 148742 162858 144786 86549 83931 91771 138074 181182 220217 293394
18168 293394 406508 490797 477820 371563 286388 258604 214457 159974 143863 138512 197008
18157 197008 265722 315187 372966 394745 419617 425900 402896 386044 350347 367101 365099 370784
18145 370784 408883 458186 495913 519122 487011 447752 454320 448305 443299 433165 467812 530031
18133 530031 565003 622832 675423 775579 919785 1041653 1092905 1112457 1158685 1272581 1449247
18122 1449247 1692500 2054564 2535036 3144396 3795565 4309161 4830786 5419451 6290053
18113 6290053 7716591 10437237 15786041 27276918 49419432 73772605 82636848 71941124
18105 71941124 47986585 30349818 20101819 13820751 9929822 7358604 5551170 4260168
18097 4260168 3360382 2765771 2376479 2078671 1854310 1593517 1336053 1163407 1035326
18088 1035326 909073 819499 757547 723238 676205 674474 725191 849544 1010244 1182594 1281900
18077 1281900 1244210 1168020 989197 755711 570886 426170 426400 487284 513022 490333 400150
18066 400150 323525 302338 274597 252460 257003 225346 240606 314283 378680 372095 351586 287674
18054 287674 214479 151972 156725 147443 128010 114721 95614 107008 134066 124681 100154 101934
18042 101934 116735 127158 86889 76811 68449 62945 88391 84015 143815 144528 139693 113893 97891
18029 97891 90518 80637 53490 53260 30439 30147 106459 85382 33501 33259 55278 55699 34713 49795
18015 49795 30773 17329 21572 63796 81962 84620 66386 83424 60612 36885 37702 40199 52595
18002 52595 62091 45260 38930 7681 -21722 -29810 -22356 -15543 16902 39483 85091 86872 34225
17989 34225 18542 43409 52161 66475 72043 58856 5914 -10609 -17514 -32832 -57285 -41625
17977 -41625 -18001 -16252 1475 32536 54280 37514 36261 7044 -22405 5160 -2552 24392
17965 24392 45583 13218 34876 51192 18492 2248 -9094 -21845 10286 8892 -28354 -45785
17953 -45785 -54339 -79222 -88181 -51280 13971 56484 70280 77081 69248 57380 53585 31268 40552
17940 40552 26591 -8270 -372 13280 31287 36271 63682 39883 38942 34021 12223 -211 23176
17927 23176 39085 34908 -15971 -21984 -12580 -18513 -13790 -5461 27600 36907 -24664 -54300 -31218
17914 -31218 -7049 -13998 -14941 -9855 13678 33052 18684 -6926 4379 24221 9126 10154 82830
17901 82830 103846 10675 -34897 -20264 -6723 -39521 -34010 -19455 762 9830 40589 15245
17889 15245 4582 21547 10786 36408 65264 36658 28184 47396 34857 41624 36703 59425
17877 59425 62442 86304 106693 132726 146407 205559 285514 477733 833942 1208017 1367326
17866 1367326 1188912 793854 542597 426476 349223 276611 165105 99187 83227 77062
17856 77062 68586 41568 39501 35124 35562 36432 19935 35824 27773 37099 67590 99765 115109
17843 115109 81120 76339 67398 68595 82928 86758 67486 63012 109409 192904 276483 388835
17831 388835 643694 972586 1157471 1112865 819115 529769 396260 274140 186951 142089
17821 142089 116337 115976 93080 99423 53846 41989 37523 11995 12078 30844 65069 68333 58836
17808 58836 97307 104391 106498 113660 75777 36087 18591 26774 53770 3428 -10091 -17086 -35142
17795 -35142 -14271 38124 76482 59499 57910 37446 4787 -5415 48248 58956 48644 24132
17783 24132 21606 32446 26277 22168 -9896 22656 21568 2888 7585 44886 78110 46319 56916
17770 56916 26495 3333 32401 26922 -2221 6217 51599 75973 84732 64578 55854 35405
17758 35405 -6961 26079 66425 103911 72950 1678 -65409 -68093 -73288 -38652 -10292 17325
17746 17325 52687 30579 20807 30408 4938 23817 10348 -621 -23728 -35752 -31345 -37651
17734 -37651 -58948 -26822 -16583 -31951 -56450 -34384 39916 95557 94872 48334 57574 120821
17722 120821 162779 185817 183811 185788 197351 177032 189067 159279 81970 27827 31064 88457
17710 88457 94929 58280 45139 40039 29825 38438 53398 42360 50337 37914 43574 78441 55581
17697 55581 58838 49190 20666 42592 54067 66025 70596 72748 92003 58555 69159 76777 105679
17684 105679 149513 156337 168954 112963 89800 123956 160660 121908 63442 52871 -303 -21646
17672 -21646 3853 29552 64450 68061 28546 4078 2541 -2794 19516 6066 -27526 -8417
17660 -8417 27726 36700 38603 12634 723 -9942 -13290 37298 42742 43176 65308 43549 32193
17647 32193 -229 -19059 33583 62283 34796 7604 14395 -2922 -33203 -12382 -55953 -82493
17635 -82493 -41090 -38519 8661 36748 24584 11484 13113 -7821 -6518 -8877 -13104 8556 4934
17622 4934 4259 -82 12331 48588 53589 60450 48503 20910 32269 39626 69501 86890 123231
17609 123231 120383 94578 103026 112298 86564 100746 117571 131018 136221 97709 41730 5068
17597 5068 -1667 -13431 24939 35737 49290 25771 32119 72973 69410 35529 38702 66746 71270
17584 71270 54590 72079 88844 81368 71894 86624 80340 76343 85956 104596 117033 127102 84893
17571 84893 28443 -2574 4946 56874 85297 89669 16813 -328 -30 10758 47682 59114
17559 59114 46281 39564 22089 36025 47528 43027 70709 89900 99894 137962 104157 64933
17547 64933 52871 29899 45120 76598 31966 24050 50472 65060 53784 37007 10885 51277
17535 51277 45251 173 -63580 -47169 -66815 -74595 -55485 -21741 -21249 -6914 49598 81810
17523 81810 74156 17525 -14839 -37663 -54622 -26741 15888 30133 22299 39401 19808 23245
17511 23245 -32442 -78070 -69705 -55745 -29897 -28291 -55567 -71966 -50863 9615 18229 -7025
17499 -7025 -9654 -10476 -1035 8063 -20904 -8261 14570 -4778 -47049 -71812 -58276 -46946 -35381
17486 -35381 -33618 -21801 -5960 -41479 -32073 -23106 -65008 -93844 -82900 -35767 -1710 -42053
17474 -42053 -65466 -56762 -29983 41531 50770 30937 -32300 -17036 21762 21113 24067 -5798 -44274
17461 -44274 -39503 -9078 13629 2647 -3593 22592 21220 10327 1676 -13047 33424 20614
17449 20614 12701 20788 19672 46733 66681 78350 194588 401709 495923 460887 344714 225697
17437 225697 136985 92335 104017 74481 11791 -7060 16004 14376 13176 11901 -37518 -47507
17425 -47507 -50739 -13910 5694 32489 45781 11632 -30941 -21397 -10327 -9407 -17456 -25570 -22808
17412 -22808 -62238 -20409 3372 3218 12901 -38626 -40404 7568 37172 34612 59862 73249 60247
17399 60247 8286 -23032 -17426 -3875 7810 53938 35081 3653 -643 -29219 3812 23833
17387 23833 -11892 -42995 -56582 -29920 -23988 17864 -16898 -72869 -90501 -66262 -23457 8011
17375 8011 13817 -989 -861 2627 -3557 12651 21248 25020 17068 19235 -22751 -40479 -26573 -38849
17361 -38849 20119 38955 18854 -13134 1162 -10598 12225 2339 -4637 -10519 -31989 -15587
17349 -15587 -4056 15947 2873 -440 -8093 -19185 -29967 -56046 -58423 -41590 18764 22284
17337 22284 -19378 -61291 -100922 -90723 -69816 -33663 3090 50818 27849 12290 14415 14016
17325 14016 8986 -19967 -30479 19730 41516 30596 29469 42206 30734 50816 50258 17624
17313 17624 -35 -139 -18929 6323 -12197 -14308 -43193 -51994 -37684 1662 31613 -9429
17301 -9429 -17561 -32814 -43100 942 29657 65934 62479 56897 27755 -26887 -1664 7420 -7479
17288 -7479 -10021 6096 11904 43191 62266 2071 -25481 -43750 -6859 35515 52947 48817
17276 48817 47685 10248 -35447 -48928 -45792 -37436 -11026 -19907 -43373 -9375 -4979 -5344 9695
17263 9695 34151 37079 7319 -4357 -6530 -59428 -76999 -71719 -61966 -19407 14061 -15646 -50232
17250 -50232 -51909 -41971 -52012 -61794 -58984 -79327 -65095 -50426 -58653 -83688 -75868 -49588 28270
17237 28270 66435 59023 -2407 -19490 -18927 -30737 -3396 2390 -14389 -18088 -23333 11799 24612
17224 24612 19229 4158 -21871 -34504 -39637 -29363 10282 13611 2506 -8517 -33002 -34152
17212 -34152 -28927 -22699 -9615 -3535 -23778 -22951 -12318 -1030 -11724 -20472 -11868 -13939 -77801
17199 -77801 -65181 -3437 8967 -33451 -26910 -25964 -21634 -27115 -41944 -70519 -45073 -20524 422
17186 422 -1343 -31588 -40675 -27998 1258 16750 25913 43407 45640 52620 42841 33346 18594
17173 18594 14891 39599 35159 31208 47929 -8048 -38820 -13530 13460 38167 30387 15401
17161 15401 31657 33846 58906 26249 10587 -4759 -23924 -46407 -10188 7731 -32095 -32509
17149 -32509 -8015 -2700 9375 4875 23514 43903 50218 25850 9830 61476 46870 29254
17137 29254 39545 34693 31285 76786 41714 -10232 -18192 -3375 -41190 -28821 -22507 -37017
17125 -37017 -53095 -8388 -186 4173 4281 14996 -9885 -33844 -50958 -47484 -30994 5959 -4159
17112 -4159 -58674 -60503 -11096 33513 72760 67403 65360 106824 76883 33194 34749 15259 -7804
17099 -7804 -32958 -37657 -72399 -66203 -28654 -19300 -27402 -37257 10810 65843 27736 6976 24789
17086 24789 -626 647 47447 81873 44567 60 -2728 8746 27830 29656 16333 -4312
17074 -4312 -33356 -37697 27396 43842 -8664 -11917 16318 47823 68653 25372 10679 30286
17062 30286 35839 46085 34713 2624 -16827 24404 25805 -50380 -78304 -101779 -87535 -51307
17050 -51307 -6622 22424 -1460 -30926 -8917 -7067 -5874 -67947 -67689 -54922 -34586 -8414
17038 -8414 -26125 -52719 -42683 -2040 14555 -9031 5693 56743 79088 62084 48619 -1284
17026 -1284 -30295 16893 18510 -12390 -51572 -59524 -29731 12560 8427 -8924 12059 14296 -19788
17013 -19788 -29768 -11029 1603 18421 45698 41839 57934 45293 68845 75414 42857 -9990
17001 -9990 -28004 -6231 -3005 -35128 -46549 -37113 -25866 -38073 1824 -7892 1441 12811 -953
16988 -953 -25513 -27241 -49190 3309 25760 1163 -33473 -30349 1822 19625 23344 -9618 -24907
16975 -24907 -18652 -18037 -29412 -17352 -4423 -30686 -14748 10676 32250 47376 67870 54209
16963 54209 66050 23936 10673 3164 -12715 -9624 -13751 5904 3620 -2984 -436 117 -14899
16950 -14899 6979 -33204 -41979 -14284 -15525 -36394 -25965 -18648 -329 16778 35929 15419
16938 15419 37763 45459 52741 51758 61119 43084 43802 41962 46043 17259 1012 -6551 -11566 -13084
16924 -13084 12038 18121 24694 38547 41309 9889 2825 -44198 -44953 -45284 -19481 34566 54453
16911 54453 55164 35567 -5843 -35437 -29348 -37071 -6774 4764 5138 14160 -12096 -15706 -1135
16898 -1135 -3311 4380 12698 -300 -5543 4370 -14761 -13292 -5927 13320 29361 33269 19307
16885 19307 -23325 -37388 -37299 -71980 -60994 -88229 -73013 -49543 -15953 8901 36518 24794
16873 24794 21776 52866 73847 88028 88758 70328 52518 80983 77794 63819 51922 31973
16861 31973 20282 5539 36676 54383 4087 -18637 -19515 -56625 -46826 14873 37914 30937
16849 30937 44135 17984 -3924 4035 21162 10552 7059 16351 39679 24647 23956 16820 9333
16836 9333 4281 -9513 -17498 27430 69346 52500 41855 39628 -1894 26526 19230 40578 58715
16823 58715 83386 45527 -12356 -43030 -23103 -24926 28337 64598 49456 11085 -37987 -79302
16811 -79302 -40961 -40255 -87413 -85106 -69223 -20607 -2024 5541 7834 17213 -33291 -45628 -26300
16798 -26300 -8014 6645 23513 52713 18712 -43450 -35738 15557 40450 44199 27123 30158
16786 30158 -5142 -29019 -48724 -78699 -84058 -27018 16935 48531 12701 -24655 -41843 -59447
16774 -59447 -26117 -8086 6394 20431 770 -35725 -36402 19198 -1216 -43253 -33772 -1962
16762 -1962 31890 25918 -39534 -34637 -10905 2628 -31112 -13465 15615 66111 38346 -3855
16750 -3855 -39393 -40189 -40180 -43790 -22237 8109 11920 34717 23371 -680 59659 109343 81684
16737 81684 15184 -7497 -4148 34090 64227 95486 95238 78384 41793 17405 40921 75052
16725 75052 81052 72748 80735 79413 93060 54226 31163 -7826 -29553 -41639 -68925 -44957
16713 -44957 -22977 -21139 -3312 986 -9178 -27405 -17062 -8264 30584 21004 -12740 -38464
16701 -38464 8141 46711 65450 38699 30529 33987 54941 60407 12437 464 -18583 -19105 -36554
16688 -36554 -20485 25002 53282 81108 55487 1281 -6381 -1541 6698 -23487 -21941 22513
16676 22513 51793 61858 60147 11416 11857 37584 64974 10571 11360 -2348 -23766 -30043 -22730
16663 -22730 16150 63540 47969 10162 -6502 -5045 11746 24557 12790 51332 36879 29720
16651 29720 67450 47389 34661 21086 22966 2669 -15861 -7492 12010 -6754 -22702 -12090
16639 -12090 15847 55723 38156 2530 12857 47797 29173 -3149 -28599 -71035 -69113 -9749
16627 -9749 -12146 -44500 -58791 -31357 -34930 -34288 -21964 -11691 -4925 35919 35870 7749 8212 19872
16613 19872 16065 -3639 2637 17148 -16109 33253 33378 6807 35932 83212 81359 89264 68248
16600 68248 43297 19429 13449 56269 70018 48678 -11174 -19524 -8236 -13028 -9369 22498
16588 22498 46486 13642 -35424 -34387 -27364 -34147 -11254 63564 74640 50217 3467 13286
16576 13286 47005 59207 21790 9166 -5922 -31459 -43614 -41861 -36357 -16949 16542 32470
16564 32470 -34973 -57461 -54228 -11016 51365 80399 58145 55821 31096 23734 55521 48868
16552 48868 43201 13018 13081 56039 44690 15390 -6644 46785 79716 22928 -1367 -10558 -927
16539 -927 5784 11695 -18597 -25702 -45977 -18811 -24251 -58164 -51197 -42096 -81254 -24155 16337
16526 16337 1681 6273 3361 8197 -19118 -93260 -96036 -52234 -60364 -42830 -45249 -44157 -31674
16513 -31674 -19414 -9906 32328 35026 45247 30592 -6317 14880 15519 -24019 -34156 -22870
16501 -22870 -30581 -4831 3170 -63166 -37106 -6366 47935 47225 26981 45124 69360 58370
16489 58370 42175 -1687 -31328 -11506 -8082 -4513 -17175 -38341 -28162 -9151 19308 -10906
16477 -10906 13153 11366 29968 47782 60428 17282 -33566 -28337 -8826 -47840 -61626 -25709
16465 -25709 -34874 -26327 -2381 3578 20729 8549 37241 35948 13732 -17115 -46990 -83951
16453 -83951 -98489 -94462 -35356 7817 -28111 -30783 -28731 3414 22408 6608 -12274 -69885
16441 -69885 -104786 -87857 -63870 -34630 -4770 44325 47184 33211 7169 -22041 -43518 -33731
16429 -33731 -14246 12587 29982 -13576 -26690 -40639 -10995 19980 20109 -2845 -9818 -36897
16417 -36897 -3349 23320 21147 3647 -632 23550 75174 74024 75552 40140 -762 -52861
16405 -52861 -85856 -81923 -54056 -17970 1259 -17875 -17372 -22377 -27648 -36178 -23802 -15809 148
16392 148 -15942 -42803 -71898 -67791 -35299 -26407 -13580 -30219 -21965 1788 5059 37275 25768
16379 25768 24940 8156 -21625 -17148 -11756 17814 -7474 -24479 -14095 -20861 2014 -13000 -6395
16366 -6395 41817 30767 -1961 -12498 -17775 -7610 1313 -31266 -57209 -65606 -16359 17976
16354 17976 -6144 2190 -22472 -117821 -107026 -31859 51128 80891 65833 74271 84232 45074
16342 45074 -2064 3024 -1032 29663 22100 -3198 -20139 -62004 -36780 -13146 -77485 -72261
16330 -72261 -25797 5691 22243 30913 7274 -33539 1149 15817 35720 16308 13418 11970
16318 11970 -34069 -74776 -36550 -38270 -6366 3158 15489 46424 9753 -4095 -9001 32640
16306 32640 63895 50283 39580 24327 27136 32971 37039 27334 -22001 -53827 -35403 -56078
16294 -56078 -73471 -53029 -24373 538 -16824 -12446 -1555 33315 42490 69783 52699 7663
16282 7663 -9436 -12269 16940 18766 16678 -20061 -49118 -27976 -16830 -11019 -23428 -29708 8878
16269 8878 25841 21106 -8882 26668 42157 -9826 -33661 -10484 -18701 -880 -5465 -29138
16257 -29138 -28338 -18922 -4486 12413 19711 -29317 -73773 -66474 -63681 -29070 23331 25616 42488
16244 42488 75638 112665 77666 31300 15568 1188 -43879 -59913 -100137 -105714 -97715 -96704
16232 -96704 -72784 -36599 -15929 1167 12564 -8396 -13371 -61 14936 35970 86328 101344
16220 101344 35498 -6848 9148 30093 37617 34641 -5684 -17986 8820 -1564 -50315 -36345
16208 -36345 5420 -15180 -30381 -61142 -27228 -27555 6351 6913 6732 32014 39472 30376 37621
16195 37621 26514 -13443 -53014 -64009 -11689 -5737 -8466 3997 47492 53278 43360 28170
16183 28170 36280 29034 27016 2257 -490 -13866 22658 27392 24237 49741 73925 81268 81451
16170 81451 16631 20479 16311 21094 27048 23662 11045 11908 9531 -16107 -20192 -8598 19047
16157 19047 42607 40137 39516 43965 11148 -12344 -12771 -44642 -57591 -41339 -52909 -26688 5899
16144 5899 19813 12478 -31958 -12450 10235 39726 33929 26808 8642 23596 10757 28805
16132 28805 39217 53615 48472 -1041 30379 80001 57719 2527 -8945 -33414 -37268 -7621
16120 -7621 -22953 4321 11468 2104 -25814 -65485 -27272 -27703 -56707 -56730 -81766 -96193 -95524 -40252
16106 -40252 -2686 -8298 -40278 -15485 -12237 9061 -1986 -15315 -37495 -51377 -48483 -43080
16094 -43080 -42910 -45191 -18826 39944 25238 27705 253 -6095 -11718 -10242 30571 -2426 -4434
16081 -4434 11382 -8515 -9358 -13824 -36640 -34153 -31773 3601 23699 40451 65648 44149 21053
16068 21053 38277 24920 19415 34166 39278 14810 14289 24063 35723 22860 -5031 16961 3045
16055 3045 -29822 -22474 -13149 -11848 -67894 -83709 -81775 -48280 5834 24639 10558 4584 35000
16042 35000 28860 8983 48314 36183 39495 50344 36268 11107 35969 27592 -14050 15181
16030 15181 30641 24374 4957 -3590 -13736 -34699 -42573 -35895 -34510 -66027 -49486 -21942 38848
16017 38848 56468 37617 32315 17474 -8085 837 10455 -14943 -39594 -65596 -78789 -67851
16005 -67851 -50106 -57248 -80785 -54134 -46967 -53179 -58670 -6491 12563 26627 -19464 -73591
15993 -73591 -48746 -1395 -17499 -40023 -4992 24437 36560 52514 47510 25100 18229 -36354
15981 -36354 -67581 -61658 -14839 10882 7603 26556 3634 -5749 -17246 -21763 23764 20754 20720
15968 20720 14536 23313 33081 49495 41761 32007 21484 -1716 -2890 -16462 -25209 -69874 -110772
15955 -110772 -128884 -107393 -90141 -54662 -33529 1809 14034 42320 28588 35653 52837 17435
15943 17435 -26255 -13697 -24022 -56410 -69980 -89795 -77147 -70102 -28219 -29682 -33978 -40131
15931 -40131 -42194 -14188 -2510 -10740 -7221 -5509 -13480 15287 26431 2069 15105 18943 -16356
15918 -16356 -15552 -32593 -45696 -22482 -15582 -9244 -9106 -48061 -55018 -53112 -58097 -60709 -70214 -55060
15904 -55060 -25920 -11783 25863 29319 22009 10714 -2430 30922 39198 -2504 -23635 5623
15892 5623 54074 26567 38109 8353 -20049 -12211 -36480 -42261 22319 35722 14712 13028
15880 13028 -6775 -5082 49329 50319 32558 -25285 -49169 -60593 -65989 -58864 -33957 -41794 4615
15867 4615 4768 -34712 -30475 5415 -610 -39582 -37852 -45695 -45151 -46652 -58273 -29521 273 -21347
15853 -21347 -56741 -15150 11332 26573 -8510 12549 58906 49971 25935 25912 35120 18935 -15087
15840 -15087 -40937 -40571 -56076 -32751 12612 5841 24757 47702 35159 18774 10384 2559 16981
15827 16981 55895 64962 37758 12163 -5786 6343 10652 46663 48187 32331 1701 -377
15815 -377 16958 30358 17787 1896 -32801 -33535 -18661 -21162 4268 8751 -7021 -8499 -29844
15802 -29844 -5834 8995 -29807 -40551 -47607 -62962 -779 74444 77936 56102 231 -37951
15790 -37951 -32365 -10222 -17820 -33717 -22661 -51053 -13614 9348 -18838 -13787 24916 16977
15778 16977 -6217 -29566 -38581 -30613 -1662 -2791 12035 -23849 -39922 -56472 -70496 -33752
15766 -33752 -39740 -12570 41011 49585 42637 36513 7824 -2949 -21859 -65638 -65627 -36981 4331
15753 4331 18641 -29936 -24131 41374 71583 31813 -39618 -44773 -38892 -21070 -10332 -20181 -23589
15740 -23589 -19403 15072 14064 -31130 -63891 -52052 -57350 -59549 -26393 -35291 -19180 -23983 -19317
15727 -19317 -37227 -66446 -79615 -97610 -100649 -88794 -37005 4299 -4139 -38789 -30514 -62568
15715 -62568 -37517 -44869 -59076 -56329 -27205 -32115 -23467 25461 -2863 -17950 4085 19671
15703 19671 28613 -13224 -74819 -30443 22045 52287 98435 73992 18157 -25808 -43614 -60905
15691 -60905 -57967 -65185 -60320 -41933 -45296 -46834 -81346 -114129 -86363 -82272 -94084 -69015 -6853
15678 -6853 6840 11851 8960 -25874 -24604 -23611 -30245 -17165 10305 -4241 -420 22879 39341
15665 39341 30271 48232 19330 -37763 -28837 -12824 -27470 -43609 -961 16622 21356 39203
15653 39203 12089 4631 17768 34717 41763 48405 33721 30988 7966 -38112 -59270 -6957
15641 -6957 -6808 15583 -4388 -10620 -43709 -6000 5230 -16575 -23640 -6895 7311 41357 38879
15628 38879 67014 59827 61433 9919 -44289 -38573 -35647 7055 45407 6420 -11220 -2348 41682
15615 41682 50403 15104 8840 -14662 -12375 9253 44156 34986 7603 5270 -13428 -45830 -20459
15602 -20459 -16737 -10651 -13569 -40675 -27064 21546 42365 19178 30547 18299 17381 -13236 -23029
15589 -23029 -9840 10311 15849 -1529 1627 25379 41417 36758 2693 -44452 2331 29605
15577 29605 40516 24492 -1548 -7490 -4628 -36496 -23901 -24135 -43627 -58105 -41180 -48959 -26103
15564 -26103 -12459 -312 11127 -56839 -67508 -15419 -7553 12355 20140 25016 42971 22650
15552 22650 -5771 7224 32916 61471 59528 -535 -23316 -38477 -64496 -64908 -75744 -72861
15540 -72861 -30503 3422 40216 45725 -18594 -50467 -45855 -75580 -68378 -46440 -63213 -89376
15528 -89376 -101315 -62179 -37905 11045 35099 2824 -36614 -36940 -25660 -41392 -56182 -45062
15516 -45062 -35757 -48079 -47259 -29868 -20557 -31327 -92382 -73292 -12825 12107 38470 15822
15504 15822 -21672 26826 97786 84430 44605 48307 -12025 15126 -27148 -47180 13954 -14333
15492 -14333 4451 -12185 -39764 -52457 -30367 -17037 -6185 -43737 -30248 -5135 10928 6059
15480 6059 -19505 -8626 34056 13016 23560 11548 -11913 -21930 -38668 -26013 -38028 -25084
15468 -25084 31596 27719 20759 13715 -15972 -28987 7940 46660 36692 12797 -23020 -13575 22990
15455 22990 18765 7375 -4399 -13092 11183 40294 48521 39110 3784 -10043 -27873 -28399 -22910
15442 -22910 -18868 622 479 -23251 -40993 -9448 -28579 -61737 -62000 -40422 -22309 1332 31470
15429 31470 30093 -40714 -45282 -39339 -5725 4139 -23813 -43073 -45519 -11781 5547 -27117 -54098
15416 -54098 -36723 -67696 -78130 -34543 -39272 -27778 15919 38526 -109 -31808 -13462 -15310
15404 -15310 -55999 -51193 -50741 -56495 -12795 13994 14141 26638 -3554 -45166 -50373 -26435 -29779
15391 -29779 -17925 -34258 -55114 -65316 -44170 -23667 -50317 -62711 -48205 -61702 -50701 -46961
15379 -46961 -17772 17231 -7927 -30642 1002 14541 -33908 -21459 5697 -19258 -30509 -27670
15367 -27670 41091 52445 52841 27488 -26024 -1752 10834 -25386 -4707 6121 27866 10514
15355 10514 -198 16874 33163 5960 -15501 -37830 -23735 -6813 11080 6074 -22272 -34879
15343 -34879 -19637 -27827 33532 52438 18894 34847 37560 13295 -22652 24674 12137 -42511
15331 -42511 -102215 -82003 -48777 -14469 6823 16411 8571 -38176 -43987 -30539 -18917 -49707
15319 -49707 -49701 -45766 -67905 -49310 -26144 -23407 -3057 9210 20573 11697 -699 -35776 -35541
15306 -35541 -9309 12553 6860 -29842 -47807 -25234 -26507 -4227 1614 -21037 -38076 7434
15294 7434 15382 37946 57846 54272 40398 49952 24760 14310 18946 11133 13125 11556 27604
15281 27604 5387 -11458 14924 19189 875 -8397 50967 102866 69272 60400 62813 30806
15269 30806 -8969 -72577 -33150 -1313 -48355 -73471 -137574 -143824 -99763 -47316 -36269 -79842
15257 -79842 -94580 -23771 -14152 -35373 8872 5636 4822 20891 6997 2708 21802 51365 33846
15244 33846 521 -21073 -37693 -19044 -23038 5006 39602 18910 3129 7466 -18491 3533
15232 3533 -23893 -34974 5781 4075 -37866 -54431 -75575 -68256 -31958 -16559 2430 31341
15220 31341 20890 39407 36098 28741 31329 36804 -6660 -62043 -75858 -65971 -44920 -18867 -13363
15207 -13363 2789 39946 90672 88072 103903 85149 72296 32645 7604 1233 6454 -3859
15195 -3859 -3382 367 16273 8797 27364 1248 -8806 18997 -278 12743 -13838 -7764 -557
15182 -557 -23275 -18511 19322 15185 18958 6735 4656 23294 2661 -12724 36933 57170 65016
15169 65016 66361 32689 33332 45392 38838 36690 46913 39551 14662 45499 49902 49051 25512
15156 25512 -1827 -43352 -46452 -27422 -15234 -30593 -39159 -44935 -8671 7654 34913 35346 34262
15143 34262 -4829 -42514 -26276 51895 75936 98245 104198 101150 76037 23435 5481 24876
15131 24876 51437 52084 42118 13119 26305 46386 50094 32760 23127 19765 -20056 -18369 -13444
15118 -13444 10440 22067 -22100 -10385 17685 22800 -15864 -32707 4655 10008 38113 35867
15106 35867 22113 -29209 -35423 -11884 61192 91832 48658 54094 25183 -8983 35188 37829
15094 37829 37647 28441 42729 18241 -35947 -63787 -59039 -37050 -20172 -11112 27598 56792 59130
15081 59130 41436 12680 -9404 -8033 13291 41308 50203 12949 11987 18752 7351 8582 7739
15068 7739 8334 -15382 -25181 309 4346 13831 18339 15699 -10400 20762 45613 12655 -3912
15055 -3912 643 -15570 -27914 -53943 -46441 -43232 -10178 6147 -11492 -12258 37685 50844 44606
15042 44606 -22174 -53935 -39247 7988 33141 29216 54162 37760 21364 45415 86814 61649
15030 61649 8194 -29477 -55744 -48836 -34307 -21696 -8478 13690 8148 3938 55005 84708
15018 84708 69163 59562 34035 24640 30179 53151 35328 47420 46630 55440 55781 10795 3579
15005 3579 56259 86230 71427 96913 100923 92109 94925 92676 113854 192906 348792 631924
14993 631924 1153808 1871631 2303370 2192906 1572277 989654 663015 456830 333771 239184
14983 239184 201592 224891 181901 110940 93719 76260 75559 78111 79565 75135 83822 102650 91771
14970 91771 90616 81740 22142 29691 89575 90457 54484 49819 109078 96285 6762 -11716 75081
14957 75081 92113 77348 68238 36946 32460 38134 29633 17995 3410 -18102 -23859 -5425 -14926
14944 -14926 -10566 -53094 -54497 -62537 -21131 17329 28419 51860 75790 49146 35824 11186
14932 11186 19967 26244 63278 74224 55880 54448 46887 56821 106055 88620 50516 18674 18754
14919 18754 67356 61807 48177 59604 28671 32560 9042 -30446 -23631 -37716 -20418 20752
14907 20752 50506 51107 35455 18249 -5328 15182 24431 6137 -21067 -3034 43658 61565
14895 61565 57883 16579 -36934 -56649 10487 68541 76926 42896 -14715 -14663 4149 12470 14251
14882 14251 24365 22736 52487 56314 65078 96706 95308 46231 -21661 -47474 -54473 -77572 -35620
14869 -35620 -32021 -51492 -30991 -24243 -40851 11879 69910 41958 8566 -12097 -32708 -9578
14857 -9578 5317 12158 -2497 -16500 -12475 -8559 6024 22833 24955 9384 9792 -3286 -20332
14844 -20332 -11715 -53412 -107795 -121784 -107408 -83676 -37102 9350 -23616 -42364 -37522 -48784
14832 -48784 -63833 -42684 -19130 3361 -103 -31125 -74992 -63849 -11345 7702 42939 50501
14820 50501 15115 12197 2631 48450 75897 79589 65206 22718 15474 27613 32105 20661 9460
14807 9460 10920 -10197 -35694 -16904 -30882 -54144 -53714 -53531 -9527 -12339 -43431 -30604 -30849
14794 -30849 -34392 -72872 -72921 -51677 -50684 -41773 -49173 -46081 -6671 -37485 930 26536 11812
14781 11812 -1618 -7421 -5117 -51040 -41368 24887 15979 -4980 -144 -18902 -19974 -30385 -43554
14768 -43554 -37413 -38308 -7436 18069 2046 -12105 20672 26877 4623 21844 34831 43264 23765
14755 23765 23328 37454 72780 65032 37615 -47690 -62084 -24750 5146 40655 27184 25842
14743 25842 43593 46490 6524 -32497 -72275 -50855 -14224 8226 28605 22037 -18395 -22971
14731 -22971 30502 -245 -37354 -9064 16554 40957 50290 13693 -1851 -14161 30157 28595
14719 28595 33690 16311 13723 -7958 -28015 -42323 -50211 -14842 24624 16692 -2412 -20420
14707 -20420 -6109 16787 -21090 -43829 -7199 -23465 -38400 -26373 -16959 -22466 -13342 -3111
14695 -3111 -26936 -76300 -115339 -112290 -32800 31834 37860 55906 54060 52878 75147 14362 -2930
14682 -2930 -28608 -53438 -51233 -45945 -73862 -37162 2719 -156 2827 2259 11364 10485 5109 2375
14668 2375 12414 22214 6779 -8588 -2522 9243 14769 45621 85522 43508 13521 2598
14656 2598 8591 -11981 11532 42735 53149 38029 52066 38355 19985 477 -26170 -24495
14644 -24495 -18285 17401 23674 -10607 -11453 -30036 1131 25762 8948 9102 17711 7693 14377
14631 14377 -17445 -24090 -47093 -26692 -3699 14579 -21742 1783 16010 4934 -40725 -51810
14619 -51810 -60329 -4469 6337 -26932 -63621 -58434 -39366 -11057 7383 31069 29711 46869
14607 46869 6441 -26137 -35275 -23447 -44477 -35801 -16592 -46522 -62680 -47614 -18353 -34152
14595 -34152 -40753 -88923 -60523 -11449 12971 -5706 -28642 -18019 -29158 -65618 -39781 15263
14583 15263 29433 17798 -24376 -36009 -14625 40518 60610 35086 1360 18906 47782 36586
14571 36586 38930 36751 46649 42762 14988 -34316 -51848 -57100 -106123 -93147 -72579 -69561 -29188
14558 -29188 3424 30672 18522 5965 24276 31579 7466 25284 52312 37637 16166 1529
14546 1529 -31988 -36572 -17365 23033 5358 -10781 26920 45215 18907 -2775 33409 45694
14534 45694 48167 44420 59127 27113 -2046 22742 45619 49767 15731 -32301 -32395 -2165 38907
14521 38907 72070 62799 77617 58965 44357 2040 -5611 -63441 -81096 -66931 -61249 -25692
14509 -25692 30041 50305 59635 32856 18305 -19551 -42071 -34586 -11952 7101 10093 9305 47601
14496 47601 27083 -11994 -8637 -17698 -11036 -609 -6285 -44137 -51127 -67427 -65331 -62715 -26128
14483 -26128 -22386 -21264 -38458 -57122 -27378 -23951 -14803 -30881 -49495 -44389 -16166 26212 25494
14470 25494 9893 -38274 -17334 250 -11807 -5959 -7207 20043 25839 33951 -13019 -53135
14458 -53135 -35973 7245 -1638 -36892 -54933 -54554 -47984 -40946 -53243 -93781 -112293 -91970 -45604
14445 -45604 -26379 -55074 -82437 -61693 -18419 9341 43554 58703 117539 91109 21042 -20362
14433 -20362 -6193 10682 -1364 -28703 5554 24688 12654 43576 62468 86991 41338 81778
14421 81778 63682 25918 -3463 26753 52282 21526 3572 5614 -1080 -12687 4383 36033
14409 36033 74959 36569 29810 26403 37636 19476 -3880 -32411 -43166 -52466 -40917 -12188
14397 -12188 5794 -1811 1500 29392 28218 28530 7103 -18048 3220 21700 75971 101249 76631
14384 76631 22920 6060 26599 3356 -26854 -18342 -14025 -8582 -18227 -45954 -92533 -93259 -74919
14371 -74919 -49821 -34177 -39497 -40025 -52630 -57169 -78599 -115174 -118716 -106098 -91804 -73825 -52826
14358 -52826 -71419 -47234 -11577 -37216 -38812 -40335 136 19126 2685 -11429 5488 8795
14346 8795 2951 8146 -3096 -5038 27556 20683 -6954 12310 -15766 -50735 -39439 5126 9502
14333 9502 20348 -1655 -16524 -28741 -19420 -20912 -34442 -2067 15253 -8459 -2549 -4254 -25383
14320 -25383 -15523 -20762 -16422 -17647 10151 15438 -45481 -64068 -37624 -25932 -9076 45896 39775
14307 39775 39995 25249 41706 73204 74245 51509 43458 61290 81213 86934 24962 5108 36169
14294 36169 50321 45789 19698 -26301 -49658 -45586 -22053 23712 1005 -21805 12076 26886
14282 26886 17602 6906 3546 35001 17024 -9164 -34858 -34728 -33996 -27137 -32714 -54517 -16596
14269 -16596 20622 -6362 1974 -13341 -34710 -50775 -54957 -47096 -46687 -38663 -13110 -47834 -33536
14256 -33536 -26644 -17250 -3034 27136 10955 3371 -4974 -12929 -20234 -45243 -57046 -7227 13115
14243 13115 36482 3464 -13365 25181 26036 54264 52266 18995 12209 8032 -10674 -18413 -11863
14230 -11863 7315 -14759 -7706 7169 8713 12696 24757 31609 25608 14591 -9126 1788 4544
14217 4544 12515 -22478 -12965 1576 -11170 7362 57352 38824 12137 -11887 -5219 30141
14205 30141 32899 26324 41556 57739 51460 66289 62727 75032 40196 2871 -11905 -15356 -20304
14192 -20304 -7740 9472 -2866 4222 2159 17959 31355 -35480 -67573 -26278 -24055 12251
14180 12251 -42520 -73673 -63569 -54503 -53149 -40390 5454 9229 1589 2015 6546 18725 2083
14167 2083 -31577 -38997 8167 66910 70767 52962 17203 3084 14881 -2023 17353 12567
14155 12567 -2625 -12745 -37205 -6937 40408 66784 -7539 -28749 -61663 -57028 -9968 2314
14143 2314 -4711 -28248 -61599 -59004 -18014 27926 9245 30936 57816 92029 112635 92465
14131 92465 91744 63937 11949 -36235 -28342 36360 37882 13811 20623 10696 4638 6855 2878
14118 2878 -38822 -44127 -14348 -18665 -49612 -51612 -12550 -15183 -18967 -41691 -60659 -32404 -3903
14105 -3903 -3311 -23458 -26750 -31481 -59235 -39890 -31847 -39600 12245 54152 59730 32699 4406
14092 4406 4328 17762 2340 -19317 -35855 -10631 -116 15786 13136 -31422 -62753 -73440 -53236
14079 -53236 -31998 -32274 30418 5838 -53394 -43150 5201 -8525 2418 -5469 6000 69
14067 69 -36057 -24505 4258 -2870 -11157 -58253 -65098 -7763 8823 32414 48743 34754 37181
14054 37181 70246 53785 33499 31754 40356 34479 23864 20443 -33474 -57207 -21149 -14837 -28943
14041 -28943 -29435 -31424 4741 45303 66267 60528 18926 -7129 6405 16251 -14348 -43942 -61139
14028 -61139 -44782 -12086 4982 -15887 -9780 -12963 -12231 11629 42108 38960 44861 55330 39113
14015 39113 21339 -5076 -26837 -16395 -34731 -57718 -46156 -30157 10101 26986 11739 6381
14003 6381 31696 25679 26535 -26973 -47059 33885 76581 26649 -14706 -3915 15410 21394 58012
13990 58012 60291 66482 71863 45914 27761 10888 4247 -19885 -33058 2028 -1724 2447 4952
13977 4952 3040 -9895 -7993 9283 -22322 -26070 -57533 -81330 -37915 -13741 -481 1523 22496
13964 22496 5431 -20787 -3110 -1945 -20199 -37210 -12738 1184 50291 59344 52702 48675
13952 48675 24145 10881 27941 16281 23801 31256 -2274 -29544 -61439 -80795 -49894 -20631
13940 -20631 2373 37437 93384 88010 49552 -637 -15058 -24247 -18468 41218 60674 58228
13928 58228 -1492 -14903 -8243 -18958 -29883 14159 -9352 -31334 -55092 -64381 -60086 -72088
13916 -72088 -81858 -76208 -44470 -18984 1081 -1467 -5195 -5610 -24255 -39883 -89247 -92941 -73305
13903 -73305 -28652 -7486 -1945 -9793 -21026 -61629 -85153 -82591 -50052 -8800 2413 -7272
13891 -7272 -24701 -79793 -102232 -92123 -94596 -97550 -63052 -28419 -35389 -30557 3109 7118 -2794
13878 -2794 878 -20600 -27643 -50157 -44402 -28021 -24403 -14490 -25952 -49311 -34133 -3922 -2379
13865 -2379 -32190 -54422 -43403 -34761 -49196 -27431 -36087 -42536 -85988 -95001 -65036 -71030 -96344
13852 -96344 -90584 -43280 -14262 6810 32076 10898 8244 35966 30937 31834 54353 15395 -30415
13839 -30415 -24026 -52 17505 -19124 -25239 -11359 17576 13047 -17935 -5463 21084 8530
13827 8530 -49298 -33301 9 -11530 -20024 14702 15523 49141 64781 63586 88514 106865 134026
13814 134026 111216 50173 11939 -15376 6547 -7021 20817 32291 23429 23401 -4793 -25446
13802 -25446 28180 68401 64839 58016 53352 20398 34104 18928 4869 32816 48072 52405
13790 52405 45310 3163 22581 22685 10863 -25453 -30071 -349 21383 -6573 -48488 -67568
13778 -67568 -37452 -12049 -26450 -28611 -49731 -59218 -53303 -40740 -13209 -9594 -31172 -53182
13766 -53182 -75375 -64528 -32381 -11674 10645 11970 23627 29729 -1271 -4274 4391 -2555 -27173
13753 -27173 -57951 -16313 30899 28007 -6687 -77910 -63275 -24454 -13101 1049 9665 -4161
13741 -4161 -29928 -43521 -38950 -44889 -38377 -28195 -12863 4675 -9465 -51287 -42542 -49258 14737
13728 14737 33581 16174 -23857 -38124 5400 -19213 -50436 -66679 1753 27986 21362 -11633
13716 -11633 -37264 -43113 -39289 -45104 -51795 -24056 -25928 -29842 -16067 -23429 -45223 -38256 -26039
13703 -26039 -11758 16382 -1323 -51043 -41440 -50883 -49009 -41362 -24496 -16981 -16794 -12803 -2481
13690 -2481 19108 34978 19246 -22359 -49541 -63105 -50865 -30226 22555 -19758 -40210 -15974
13678 -15974 -25106 -63221 -54754 -63984 -67899 -39268 -36291 -22528 -17356 -12586 25678 8496 -50724
13665 -50724 -73760 -52095 -18875 11846 2488 -2855 -18421 -27894 -43801 -14649 18658 -5039
13653 -5039 -11219 -31554 -13028 -15473 40582 93805 39831 17922 17839 78096 64752 -11710 -47526
13640 -47526 -48311 -32441 20085 48453 45103 38878 15478 -906 -2496 -32801 -18304 -10714 -17389
13627 -17389 -16834 20269 26013 -10667 -39422 -47492 -34996 -541 -2802 14522 29042 -18641 -60620
13614 -60620 -61341 -58776 -70593 -42733 -40802 -26864 -43414 -39249 -16281 -4893 -35720 -54376 -8650
13601 -8650 9879 2141 14826 36675 45532 51391 48692 27336 26553 29981 29807 -25995 -51297 -25458
13587 -25458 -27018 -4620 26580 23909 17099 63 -52739 -79858 -48429 -905 -18890 -18763 -13224
13574 -13224 20164 -16672 -39867 -45326 -23982 -26931 4879 20985 29300 19539 -12494 -36447
13562 -36447 -29779 -26280 -22280 -26014 8212 10793 -10083 -12267 -26141 -29001 -2944 16538 12587
13549 12587 7732 4082 13753 22577 -330 19044 59045 42154 16524 -52135 -70230 -11215
13537 -11215 -3322 -21384 -32354 -8516 13679 -34263 -44688 -16944 19007 18578 -1427 29878
13525 29878 41553 31135 -16063 -61977 -27348 5231 8825 6395 5721 11697 -28313 -27698 -54507
13512 -54507 -39886 -3125 24128 7360 -12863 -22299 29687 13335 -17652 -41473 -30236 -42511
13500 -42511 -41196 -27759 21106 -4057 -7529 -10579 5928 17489 19280 50729 58919 67013 58860
13487 58860 72196 71518 31944 -27899 -40369 -30667 -49520 -25400 17281 52391 43483 8144
13475 8144 -12401 1568 11893 29905 36319 25281 4170 3526 -879 19987 12582 23019 32490
13462 32490 26703 42933 17547 -30411 -57102 -36098 14289 17164 -4984 3524 26176 8390
13450 8390 5746 -13162 -12953 10102 48345 5795 -334 3747 -9096 14135 26484 19848 -6992
13437 -6992 -16752 -23355 3957 22265 -8090 -17501 -23712 -20421 -41629 -29637 -19694 -8474 5857
13424 5857 27485 27124 20399 17326 15027 5498 15631 -22015 -45535 -20096 39600 34072 -2918
13411 -2918 -28790 -48672 -42852 -57475 -67826 -82484 -49109 -42731 -39160 -20546 -23015 -12569 -27491
13398 -27491 -39679 -30687 16976 45730 44527 24075 -9635 -3272 2164 -241 32260 79363 87505
13385 87505 48293 13945 5088 12869 12794 -24234 732 12493 -25838 -46263 -19213 21517 18704
13372 18704 -8953 -19485 -14245 -35174 -53371 -34845 -9851 17059 15635 -12204 3804 -25312
13360 -25312 -5511 10078 14965 -7779 -17566 4078 8346 -2183 -19618 -44020 -34531 -58888
13348 -58888 -57926 -25114 21489 21523 38739 46383 54061 27445 -4750 26225 79323 58745 -7180
13335 -7180 -19640 2824 -10383 -34522 -54481 -40052 10761 35944 2749 -9761 2162 1974
13323 1974 13082 -1692 -1122 4644 -9596 -8699 5661 8754 41649 5226 -27402 -22296 -33539
13310 -33539 -29854 -37424 -35986 19879 105593 105182 73657 50646 59543 56761 54515 44213 29926
13297 29926 36200 48610 70071 74159 100538 80141 54560 44991 -10229 6859 20526 20273 -19857
13284 -19857 -75253 -56277 -31280 -48298 -69758 -79475 -84557 -41161 -32108 -32472 -16649 -8829 -12198
13271 -12198 -41703 -78660 -68281 -46539 -17383 -4473 -4810 -16401 10326 20971 43618 80960
13259 80960 63705 44586 29158 40320 48134 55880 66500 63794 94374 96715 60697 65369 68876
13246 68876 73427 68686 68042 32093 28437 20632 8589 32813 24727 21527 -30539 -55772 -39158
13233 -39158 -12058 25191 19459 5083 6654 11613 -13250 -19005 25720 16454 7482 13865 -321
13220 -321 -1945 -17369 2206 38536 14405 5685 482 1697 -7138 -8343 -13396 -25284 -17945 38159
13206 38159 75933 70088 20649 -14487 -10822 16192 22661 15560 -13785 -9307 13476 7603 -11366
13193 -11366 -7476 -9231 44853 40722 14358 -7135 -35960 -69132 -93691 -102733 -79645 -81304 -85517
13180 -85517 -85878 -52120 -39347 -39352 -41472 -68410 -43105 -41454 -35946 -13572 7506 -16471 -27660
13167 -27660 -25448 -41120 -34354 -22822 9537 61110 57472 30309 -6752 -23489 3081 48900
13155 48900 32835 32949 31407 -144 -14903 -11228 66001 59229 58590 94061 71420 67446 41036
13142 41036 27094 45028 36168 19277 -6388 -28894 -54689 -54161 -75173 -70354 -32059 -41261 -65713
13129 -65713 -69755 -44301 -25374 -46292 -34214 -3015 -20719 -19398 -17536 -6106 8875 6933
13117 6933 6584 -55754 -66778 -49463 -41900 -34054 -70546 -106667 -83960 -57091 -30687 -19529 -3210
13104 -3210 -7877 21172 68335 130611 198282 175340 131495 108343 96186 91604 36250 3539
13092 3539 -9228 -8028 -7626 28311 35415 3486 -19369 -31141 28042 6897 -9574 -14984 -22309
13079 -22309 7905 10345 19829 17524 9223 49866 49479 9828 -20091 -17546 -43754 -62105 -106371
13066 -106371 -101898 -61867 24812 41061 42681 30329 42978 62955 95475 117871 127972 140530
13054 140530 144504 103734 71287 67173 17429 7325 18729 -2155 -19435 -22839 -18823 -18212 1425
13041 1425 18211 14496 -5185 1359 -1349 1490 21483 19225 -12666 -39704 -64512 -45521 17136
13028 17136 12202 18623 13313 6366 5734 -22990 -21654 17055 36818 19802 -4418 10175 13243
13015 13243 30773 10867 -13612 -3410 25725 -11213 23337 31781 -12871 1471 -6268 -39069
13003 -39069 -44226 -57882 -44360 -7698 -33514 -46543 -37230 -64523 -60680 -27980 -17087 -43916
12991 -43916 18642 34879 -6049 -21950 -52280 -68048 -20164 4949 -42939 -38705 -25815 4690
12979 4690 -10841 -15896 -21530 -10088 40078 14459 17675 24003 23056 -6096 -4186 -30390 -37064
12966 -37064 -21534 -28259 -34626 -31066 -19566 -40191 -17245 -26677 -22331 -54097 -72246 -86697 -86732
12953 -86732 -43145 -22486 -36340 -57240 -67367 -44845 -36506 -54630 -35715 -33749 -45000 -47974
12941 -47974 -42028 -43490 -48496 -57214 -62535 -49681 -17176 -48240 -68176 -39526 10216 21204 8186
12928 8186 -10227 -3422 27075 15858 22622 11123 -9148 29619 60347 43208 22649 22861 43297
12915 43297 18031 -30182 -74684 -86971 -66532 -29253 10009 700 -50356 -62699 -41702 -77134
12903 -77134 -53869 -7281 20772 -26912 -83459 -25050 19488 -1953 -44868 -44956 -48859 -56673 -60958
12890 -60958 -64267 -56975 -16257 -21758 -6386 -35622 -107457 -130199 -62575 39809 58411 -826
12878 -826 -23699 -22753 -39043 -26157 -26305 3524 -25474 -13679 -23774 -21886 -18944 -33398 -17752
12865 -17752 -15076 -14439 -25105 -30913 -7725 -8980 1752 34669 47253 30046 49803 34190 21592
12852 21592 -7659 -60286 -45177 -11468 -8224 9840 16757 -18534 -72293 -76162 -63225 -37589
12840 -37589 -20836 -80833 -130118 -103569 -134304 -91851 -19968 -18782 -41322 -31336 -28203 -14533
12828 -14533 -1695 -15559 -15701 33520 54910 19537 9464 12967 -5750 -10294 -3020 -34320 -79339
12815 -79339 -68928 -60529 -47595 -22870 2708 25886 23138 19717 -3109 -17564 27598 26449
12803 26449 7863 -12808 -21879 -17579 -16974 815 -22552 -50501 -51217 -61601 -58301 -49267 -45661
12790 -45661 -23851 -4723 -44058 -46696 -36185 -55813 -63790 -47767 -4566 10147 16053 -4437
12778 -4437 -43879 -67936 -25830 -34364 -12930 17366 -1357 -4356 12987 19906 21657 54726 78749
12765 78749 55009 67659 75901 62177 66032 21772 21763 10101 8738 38863 50465 56965 40414
12752 40414 5948 5646 48507 87681 56595 44768 31865 39262 43633 15980 -15190 -14725 23927
12739 23927 3156 -8283 -35590 -25465 -16188 -46121 89 -10501 -17774 -10193 -5434 -25725
12727 -25725 -60623 -70276 -49515 -31333 4381 38294 38723 -32458 -43738 -19011 -23882 -2828
12715 -2828 -17331 -42215 -39988 -9409 -33151 -56760 -26612 -29020 -1875 21620 1039 11204
12703 11204 40767 33626 37949 72413 73005 8972 -13830 -20321 -50349 -50030 -39128 -18943 18284
12690 18284 67799 62484 60938 57389 18948 -8889 -30667 -29218 -2862 -28025 -31161 -39187 -31323
12677 -31323 -13097 -15710 3824 25063 29594 22408 18157 46664 27890 53552 65807 49309
12665 49309 45896 65576 52551 21686 6022 -22037 -34459 -13090 4859 -10461 5784 30654
12653 30654 -12152 -58551 -79264 -45948 -15699 -30652 -41785 -15156 -15705 -49511 -27726 -50050
12641 -50050 -49199 -68146 -65032 -15522 22185 24952 -13635 -6545 -8529 9295 -1075 -24191 -63646
12628 -63646 -66818 -63268 -36789 19654 34930 45307 62896 42739 -6255 7550 -15375 -25709
12616 -25709 -58410 -52995 5329 -111 -33069 -57284 -52750 -26963 -19595 -38057 -44481 -22395 3893
12603 3893 18343 32927 22660 7701 540 30923 46492 65377 34702 3889 -5670 6103
12591 6103 -15816 -24185 -30539 -28081 20027 -3432 -29570 -28086 -32138 -19900 -33138 -36175 -5642
12578 -5642 4792 -25722 -1297 1064 -7025 -26502 -77028 -116702 -103564 -84852 -79909 -41184
12566 -41184 6228 -24048 -47718 -17970 -17231 -58050 -80518 -55241 -36210 -32922 -5919 -11461
12554 -11461 -12709 16669 32241 36755 12638 -15533 6439 25022 -9513 -43654 -40787 -12145
12542 -12145 -21433 -11507 18931 -45863 -76767 -42643 11151 32089 42597 18644 12513 -5037
12530 -5037 -6119 1080 27612 51032 31428 14284 -10196 -30167 -47842 -8610 -8054 -38045 6785
12517 6785 26805 -7602 15846 13270 9560 56322 24444 -3167 -44516 -58294 -36754 -19327
12505 -19327 -25396 -17093 -13566 -17896 16840 -36611 -56134 -36365 -14604 25870 23282 33552 -1483
12492 -1483 -42267 -55867 -40508 -38478 -11397 -31114 -36779 -16924 -24815 -24819 -554 25638 12958
12479 12958 14826 4471 16481 36160 11135 8900 18167 53270 39071 61519 93559 71594
12467 71594 30506 23119 23270 12924 3916 -26233 -50215 -25936 -38191 -49569 -18670 -17767 8846
12454 8846 26386 -635 -18309 -7953 21015 22709 16713 -31848 -67708 -68768 -46845 -38544 -3513
12441 -3513 27878 34311 11082 -6482 9310 47181 13232 -12824 -14343 -6972 -51091 -55184 -23368
12428 -23368 -24762 -44753 1109 17095 6965 16990 25040 -5470 -23632 -70165 -60819 -66784
12416 -66784 -64288 -18179 17594 15004 19351 50165 64772 53439 21645 8548 -10366 -11896
12404 -11896 -31142 -55194 -16550 11937 12653 18422 12326 -213 17880 32746 49855 28175
12392 28175 23782 12226 -2282 13596 29681 15562 -16205 -13726 -16590 -25311 -22099 15419 28501
12379 28501 9282 -24818 -63910 -45657 -15533 -53914 -60108 -67476 -82418 -87129 -91031 -70395
12367 -70395 -42270 -19262 44080 53526 39365 44948 17293 -11629 -4979 29346 45023 26787
12355 26787 2625 -36669 -45526 7752 -7106 35868 -536 -27457 -3976 -23084 -64028 -63563
12343 -63563 1827 42016 39608 -9750 -43983 -28176 5010 2834 -24011 -35342 5516 39705
12331 39705 30575 20992 28420 41868 17566 -4485 27546 63207 53345 70710 136280 116945
12319 116945 62495 12515 -16090 -23183 8242 27269 47647 54574 50395 59404 53906 32299
12307 32299 38722 60604 32663 -13281 -28864 -41044 -2142 42285 27566 38219 29833 -3028
12295 -3028 -30745 -58290 -69081 -10368 15109 -8903 22782 82625 76932 48689 45746 61071
12283 61071 59679 85881 53085 64904 51093 39222 73112 81534 100022 88906 73328 44731
12271 44731 9741 2132 -18997 -19355 13329 54883 39992 -1505 -4794 3602 -21285 -8117 3615
12258 3615 7384 -11563 -30414 -33670 -31555 -54156 -64252 -57995 1666 20177 28063 5577 3106
12245 3106 16529 9167 10249 -6121 -39208 -32245 -22123 -11921 2473 40342 33960 55672 38515
12232 38515 57397 56437 37847 31543 36893 13273 -19431 -31976 -39774 -22163 -4403 -4287 -16506
12219 -16506 -21379 11723 26360 9011 -2068 -29122 -27996 -10745 -10089 -44992 143 23438
12207 23438 42174 37626 34559 33404 8750 4581 4405 22427 11300 2722 -10448 -37663 -39524
12194 -39524 -59226 -88596 -85114 -38606 -14498 18939 52429 31054 12151 4555 25332 11015
12182 11015 6884 -1860 -32718 -10882 14706 20992 77497 54927 22682 -9580 -21167 -34587
12170 -34587 -8128 8773 2624 -32928 -12819 8640 49000 64466 78567 59209 8484 -28914
12158 -28914 -64573 -41802 1959 -18526 -1262 -2861 -5679 -48386 -91579 -92219 -65825 -34891
12146 -34891 -4058 -37938 -43456 -42907 -27505 2098 16195 43890 49836 34213 29368 27100 3660
12133 3660 -4231 16235 50506 70227 65052 60511 66179 30313 -24265 -16254 15293 22206 13822
12120 13822 -133 33528 9183 8094 -3770 -62950 -68163 -14828 -3849 -3269 -12823 -9932 671
12107 671 -30690 -68269 -79719 -53196 -23238 -14378 -22303 -35312 -1278 19675 30558 32919 36865
12094 36865 51165 -8566 -64714 -54302 -49156 -42541 -32279 -37197 -71438 -80558 -54817 -32426
12082 -32426 -6121 5928 -23032 -22737 3470 -11406 -34429 -23379 24493 44245 3933 -18409
12070 -18409 35312 23581 2396 9520 -3395 -1387 12666 42383 22373 -63122 -85699 -41959
12058 -41959 -2811 12230 -31559 -36696 -26453 -25148 -66499 -26081 -4816 -15389 -18322 -31862
12046 -31862 -2680 16921 7500 13964 31055 19708 -7179 -72741 -68541 -40061 -24176 -25243
12034 -25243 -27541 -2149 6312 -3623 -16356 -3276 27110 28758 7393 25985 -2364 -173 -10212
12021 -10212 -1438 -1591 -10742 -48261 -70018 -86566 -47948 11177 54151 61001 45420 40631 30304
12008 30304 32801 13695 14253 -917 -5086 21676 27746 10824 -4335 22410 16856 -2134 -30368
11995 -30368 -21229 -12063 -17300 -13035 -39216 -72121 -88235 -50927 -26295 -15359 -47638 -19782
11983 -19782 21244 12765 -17253 -54966 -38001 -18069 20840 5941 -20745 -22263 9245 -4562
11971 -4562 -33111 -36266 1428 -5950 -7508 -9909 3152 37549 11880 625 -5816 -2647 9292
11958 9292 42476 55676 48019 64180 77274 41555 24323 32917 10011 44030 45970 -12060
11946 -12060 1681 11048 28846 8746 -52127 -67252 -16798 15049 -2851 -22 -18712 -14267
11934 -14267 -29114 -28241 -51836 -59087 -28992 10725 -5109 11326 50679 43848 46919 47991 5986
11921 5986 -21 21281 31832 26030 8272 13938 51035 70936 70903 51587 58210 20742 -12163
11908 -12163 -7071 -1160 873 21028 35003 25928 15976 -6652 -39744 -36614 -12519 -1127 -63054
11895 -63054 -52579 -12271 8686 25819 -8780 -29219 -13637 -19024 6724 -9227 -23433 -15477
11883 -15477 -13701 -8539 -21809 -5304 28446 41782 31718 -6185 -25351 -26360 -59505 -50182
11871 -50182 -35103 -7452 20241 -14804 -23829 2989 14161 30595 7856 -27038 -19746 -1979
11859 -1979 -27552 -50045 -39921 -23390 -46630 -32232 2412 46485 50881 17081 572 11263
11847 11263 7327 714 3865 39525 40840 31968 41003 44470 26560 12732 54279 54584 47586 10047
11833 10047 -21581 -10400 45500 62594 73842 96439 82920 7181 -47884 -32543 -15388 -7409
11821 -7409 15855 3505 -5526 -25743 -44404 -72834 -46226 3024 20427 14333 34896 38417
11809 38417 -3780 -62191 -86173 -92972 -76611 -22300 55361 51990 -17841 -50703 -55289 -34499
11797 -34499 -22478 -45569 -55947 -99884 -110544 -95765 -29690 -20632 -39491 -18146 -18883 -40094
11785 -40094 -58896 -31572 -34659 -40471 -9805 6319 -30065 -43398 -25321 646 8303 -25216
11773 -25216 -14868 -5529 -21900 -7522 19507 45663 46089 20864 11109 -17058 -11324 -14299 -25699
11760 -25699 -57751 -65387 -64385 -54829 -11731 -35982 -24473 -6750 -22767 -32486 -22940 -20732 -31531
11747 -31531 -25622 -19306 -43604 -58787 -31421 -26104 -28359 -20411 -19374 -25594 -37752 -37552 13698
11734 13698 67818 36570 -13653 -51772 -66693 -66899 -94569 -72224 -52986 -70292 -61121 -6377
11722 -6377 35163 9943 -6604 -41616 -36278 -25543 29334 3603 -21393 -15320 14023 -5609
11710 -5609 -20437 -45679 -61441 -64035 -72651 -38075 -21813 -34542 -40875 -67046 -47883 -28405
11698 -28405 -17172 -34949 -49074 -74047 -41413 -16294 -65531 -48249 -42963 -24184 4867 -6643
11686 -6643 -52394 -64104 -3658 2557 -10306 -22407 28092 33653 45582 61366 44412 40337
11674 40337 32818 30243 -20445 -43859 9413 47872 22705 -29748 -44028 -29376 -47108 -8956
11662 -8956 -19172 7949 833 -26207 -19318 40321 53665 30790 4312 -8399 0 3840 11900
11649 11900 -15847 10327 31329 -1255 -14435 390 -10952 -8964 -24983 -34066 -32173 -27399
11637 -27399 2397 28107 65702 70221 69188 38320 8344 -13104 -33133 -7539 36312 9344
11625 9344 -3466 45918 22083 -34798 -60772 -79787 -62566 19446 27269 38223 58378 40922
11613 40922 56146 78104 50307 4165 20781 11988 -6909 -1365 43703 61069 36826 -707
11601 -707 -24873 -2256 -5335 -20226 -26707 7719 16997 -4471 -26891 -52811 -22731 -9297 -48060
11588 -48060 -67190 -72734 -90087 -88683 -80310 -90163 -50658 -21758 -77831 -91565 -82490 -62780 -56756
11575 -56756 -41177 -12003 458 -24563 -20572 17855 46636 16640 -26532 -34613 -56845 -35609
11563 -35609 -28268 -52242 -126276 -85624 -69516 -64942 -30290 -29023 -24479 30676 58748 40027
11551 40027 9003 -3368 -10533 -30577 -17167 -23846 -30135 3081 18281 11788 18166 -13163 39763
11538 39763 111138 89296 9783 -27592 -23576 -4516 10458 -17624 -45702 -30832 -16010 -7493
11526 -7493 49478 74880 38734 42320 48299 9712 -29037 -20256 18295 39148 -6106 -33561
11514 -33561 -29143 -6226 -26657 -20402 9578 37498 64432 49831 4597 -484 -9908 -34029
11502 -34029 -16329 25741 24361 10069 37993 81434 58497 78493 55477 59881 19351 5126
11490 5126 38949 -490 -18392 -468 -7684 -24711 -16555 6286 18739 18131 23622 8450 -16513
11477 -16513 -8965 8091 -2511 -44094 -92074 -94169 -64178 -29599 -21510 -19430 -8298 -29819
11465 -29819 -31716 -17593 -38516 -52557 -29372 -22709 -34049 -47507 -58260 -42453 -34860 -71175
11453 -71175 -87404 -81337 -61475 -19664 13368 -29142 -78936 -122551 -69918 -11498 -3594 -36885
11441 -36885 -53976 -35163 -64457 -44145 2902 29967 36245 44868 37070 63030 67888 63579 48872
11428 48872 39959 -4716 -13555 -9243 -8591 -7623 54328 57455 64440 66720 48833 30714 18538 -32801
11414 -32801 -59483 -79286 -88155 -107236 -58161 -21847 -29094 -61360 -48359 -11410 5608 -6368
11402 -6368 -26935 -43968 -101539 -90640 -81950 -74155 -34757 -8596 20603 57357 43219 42102
11390 42102 25741 2450 -18957 -6215 -10789 19109 36890 5014 -30572 -36302 -25876 -28383
11378 -28383 -45936 -24381 8772 2203 -1800 -7151 -7089 -923 6976 19505 -1503 -19570 -49404
11365 -49404 -110101 -136894 -168580 -120837 -103619 -92325 -85322 -32961 -34458 -37521 -77014 -48806
11353 -48806 21808 62805 42517 18209 25388 40346 430 -35504 -19197 -26578 10834 -19922
11341 -19922 -55996 -54738 -37464 8953 41602 41670 1025 -29412 -44592 -84017 -106482 -54552
11329 -54552 -8950 -56692 -53487 -32251 3742 4482 6322 8791 76506 76701 53000 27085 21760
11316 21760 37638 24790 19402 26323 23508 28933 32220 53713 50055 29157 8620 -6745 8362
11303 8362 -2749 -16803 -24050 8499 19703 -235 -45491 -54040 -47556 -62205 -70683 -61520 -29390
11290 -29390 461 11997 32524 33704 -23033 -73779 -63772 -84770 -76628 -28377 -500 -4683
11278 -4683 -31439 -10250 12551 33439 46202 38768 33642 33110 67340 71381 18974 22449 30198
11265 30198 60010 60159 55599 16062 8391 11762 32156 -4525 -52466 -75510 -53443 -24379 -15047
11252 -15047 41857 80517 70812 79649 65142 93611 55583 -8614 -41330 -63158 -62963 -63772 -68517
11239 -68517 -55730 -52951 -80808 -74089 -17800 -11585 -9658 -10851 -26523 -38830 -17547 -30015 -43086
11226 -43086 -33615 -6565 -5005 -14364 13961 57984 48357 16025 742 6466 52439 88507 76124
11213 76124 56089 46352 14978 42752 46316 37580 14962 -12934 -38825 -52451 -58125 -11016
11201 -11016 37856 8318 -18951 -23635 -38678 -8902 -14194 7586 9611 12042 -33022 -48459
11189 -48459 -64520 -23996 28090 35538 16091 -7311 -41895 -30645 -41126 -62282 -92141 -91121
11177 -91121 -87169 -62385 -21170 4064 16548 44973 43401 -6511 -50624 -36061 -40523 -73858
11165 -73858 -78901 -75016 -77566 -59271 -61770 -65022 -60165 -35384 -27005 -8045 14823 -21251 -24480
11152 -24480 -27873 -47185 -78196 -71881 -50798 -24806 -6788 -32823 -27724 -27071 -3930 -37144 -50303
11139 -50303 -28205 -55913 -105961 -90534 -52943 -21071 12640 -1561 -35361 -22408 -3656 -1624
11127 -1624 -5137 -24187 -44936 -49907 -15212 -2255 -2816 -12340 -29354 -38648 -27830 -41422 -55502
11114 -55502 -63528 -76694 -104643 -110933 -68433 -4612 33771 -6775 -27140 7510 13545 31030
11102 31030 -6572 18257 10544 -7484 -8188 -10320 190 10937 24846 19580 34736 31591 42423
11089 42423 39334 -16982 -44839 -43998 -47618 -49675 -10586 1857 22079 28486 39453 -7651 -11515
11076 -11515 -20444 -72170 -63535 -33535 -23399 -61702 -87076 -72620 -36136 -24217 -5489 32751
11064 32751 63053 57777 57165 47284 -17880 -36946 -46015 -48828 -37692 -990 19417 -2996 -79106
11051 -79106 -81040 -57446 360 6126 19412 -12423 -27755 -24826 -47387 -63799 -48672 -2638
11039 -2638 10517 -2626 -46922 -75235 -49178 -15227 -10195 12323 17238 8348 -6093 9072
11027 9072 53354 62159 49589 5993 -7314 19265 11606 1008 299 5110 -25169 -56338 -22113
11014 -22113 43120 47712 27585 19015 47978 22301 30891 55017 15421 31554 34913 12201
11002 12201 2977 5671 -14244 -20507 37006 74715 76253 59657 14413 29763 16664 36239
10990 36239 11424 19257 47248 47052 39223 2768 -12337 -18253 -18635 -14783 9699 -5714 -24518
10977 -24518 4064 -6835 -52768 -51614 -45295 -48165 -48376 -28279 4531 65463 46493 26833 44712
10964 44712 87296 91155 127903 131388 99829 26304 -35935 -32874 25506 53199 35594 -29928
10952 -29928 -66721 -57733 -73612 -72864 -65216 -82959 -90300 -82418 -42019 27430 48463 6514 -9977
10939 -9977 -4398 -24756 -61598 -94898 -104964 -71627 -19935 8213 39776 -1988 -11312 -6791
10927 -6791 -8356 -34064 -25369 -510 -4866 1762 -21884 -18946 -44909 -33557 -3584 -5146 -2599
10914 -2599 19896 -8684 -21948 -28644 11942 16997 -42387 -51948 -27813 788 21457 -5353
10902 -5353 -27440 860 24959 62105 55940 43586 41679 41939 32333 -12062 -35371 -12967 -19632
10889 -19632 -45605 -62852 -59976 -94988 -99983 -81237 -43671 -53350 -25780 -20206 -48444 -59305
10877 -59305 -28830 -12466 -40402 -12822 20759 5735 -13709 -61378 -47709 8203 -15290 4721
10865 4721 13788 41737 17037 -34349 -41225 -32853 -16582 1560 -129 -25779 -539 17059 20830
10852 20830 33397 52949 58144 15930 -14451 -21283 -41417 -32050 30804 43780 43781 58795 27901
10839 27901 -3998 5964 19312 16069 -2352 6284 27191 -19848 -25248 5 -2216 -27679 -21535
10826 -21535 -34887 -32518 -21998 -24060 -10363 -15060 -13590 28664 37265 47290 32081 8574 14884
10813 14884 49174 79652 65077 22157 45790 57773 16221 -25496 -24290 -39577 -42208 -37200
10801 -37200 -12439 45716 65222 40834 6010 -28821 -67236 -58323 -30635 -4243 -6622 -9809
10789 -9809 -34201 -67848 -60117 -51844 -59247 -86117 -44138 3748 18779 -8702 -34569 -65671
10777 -65671 -48072 -24196 -36598 -37379 -26466 -12932 11984 37331 28284 63124 28448 -50830
10765 -50830 -73658 -38996 -42408 -40913 -76338 -92267 -47548 -14909 11892 59697 53521 -9173
10753 -9173 -30142 -8882 23575 10539 -64533 -65284 -2190 3148 -3021 -16358 -46886 -75063 -91691
10740 -91691 -67149 -52777 -45063 -25722 -35182 -50145 -50228 -46766 -19991 10979 26834 37829 35622
10727 35622 34155 20665 -25586 -63763 -20443 8567 41433 53168 41977 33121 16069 -21970
10715 -21970 -4314 11204 2961 -28504 -18505 -36271 -46283 -45279 -43226 -33391 -5173 -17563 -26425
10702 -26425 -3370 -9004 -880 23656 17328 42189 93530 84455 49223 45526 76135 59973 2121
10689 2121 -5265 10980 -9758 -12473 -26658 -3818 -24847 -19751 -3167 27484 32646 12321 27895
10676 27895 27273 34799 65832 86100 63407 9592 -21552 -16896 -8181 43554 23946 25810 35388
10663 35388 61160 67790 43822 92335 95784 55102 47664 26232 16251 -49414 -52525 -41199 -25046
10650 -25046 -28289 -49759 -48379 -54999 -32298 -28570 -71948 -61857 5800 7615 -6553 -5984 23784
10637 23784 79008 67287 26195 -2288 -24541 -41185 -48649 -23800 48643 85839 59092 40542
10625 40542 1895 -22892 -49654 -38004 -32637 -34658 -58442 -62076 -63250 -28865 -7979 33789
10613 33789 34262 19947 28925 22340 -5638 -45947 -14114 17195 35219 37926 12332 20931 14927
10600 14927 -10147 -6771 15237 32808 15452 12381 20202 3358 -31263 -25725 -19341 -26894 -25534
10587 -25534 -63003 -98751 -67892 -32882 -36578 -15092 -3294 -53962 -32153 -1077 29227 45937
10575 45937 29786 1974 -18204 -20181 -2873 19836 10965 21658 61739 32997 -18887 -6985
10563 -6985 23325 -5365 -1282 1395 25780 62586 50539 25966 2585 -8379 4760 13134
10551 13134 29946 43202 25699 -19199 -10426 -23827 6298 28150 -6941 10295 35485 35101
10539 35101 7219 20633 30035 -1322 -94974 -73677 -55988 -35220 -20207 -15619 18247 10149
10527 10149 48040 28348 22972 -5695 -34053 -34084 -3702 44566 97071 56801 37877 10290
10515 10290 24291 22576 21392 5007 7666 58204 53886 30124 -17102 -69591 -100057 -74616
10503 -74616 -91388 -86336 -60991 -24368 13239 1364 -11944 -15806 18518 45702 59501 34882
10491 34882 -20932 -48750 -21490 -47139 -77377 -108083 -74705 -13333 -19421 -28535 -29390 -29693 -4130
10478 -4130 18633 2861 -19267 -46365 -55092 -57326 -14000 -27070 -39697 -41820 -53465 -98653
10466 -98653 -98561 -98817 -44552 -12307 1174 18064 -11658 -1951 -4119 4039 -16520 -19297 -3797
10453 -3797 -30902 -46156 -16098 -19087 -15837 -14888 -21151 9306 8204 -26375 -36661 -24631 -13845
10440 -13845 25200 37892 22168 -24553 -56429 -32342 -58765 -44848 -22826 -29468 -52748 -34372
10428 -34372 25552 13519 -10712 -4458 13557 18079 -3594 -27771 -16757 -24311 -17719 5356
10416 5356 30305 44261 1683 -6447 -30399 -48078 -6396 -25826 -10424 -18164 -34171 -53373
10404 -53373 -45526 -30904 -15989 -14444 20824 54319 67518 33740 4256 -8606 -30327 -48562
10392 -48562 -28481 -30613 -43040 -5641 -3120 -11168 7501 33140 20775 -32452 -34026 -50845
10380 -50845 -82712 -55258 -8721 26825 63227 82916 72742 45931 42508 44211 78049 42145
10368 42145 -13235 -37827 -46764 -11822 -21 6434 -13744 5250 -21765 -74948 -59265 -37142
10356 -37142 -61569 -42612 -16945 -43755 -15403 4358 -3370 -43205 -67945 -50434 -17757 -34998
10344 -34998 -9291 13801 32366 -14644 -37466 -30000 -7975 -85 -9279 -9293 4770 16751 32730
10331 32730 38403 43640 28872 72133 68602 77519 79291 26168 -21759 943 33983 20977 -2149
10318 -2149 -685 -13430 -37651 -24223 5164 7884 -33064 -63545 -54061 -48504 -49456 -67021 -82446
10305 -82446 -44765 -10072 13313 -123 37406 10041 28943 36324 19078 445 -29121 -41981
10293 -41981 -43240 -77354 -59713 -46058 -25684 -39504 -46507 -36918 -14195 -12537 -31241 -44363
10281 -44363 -28353 -27807 -4532 -9717 26335 66571 37899 34762 31685 23700 22907 12446 10177
10268 10177 28269 3118 -40357 -41928 -62915 -86185 -77765 -51803 -70455 -80742 -76579 -101077
10256 -101077 -105986 -61510 -28544 -34777 -26431 -19085 -7268 -13863 -55345 -99619 -117249 -94262
10244 -94262 -84110 -57304 -26003 -26167 -7058 3277 2084 27344 42142 49750 64722 31576
10232 31576 -4392 -10806 -46630 -24179 -23719 -13808 15406 26904 8815 47922 71577 27036
10220 27036 -14884 -24121 -20073 5506 28883 10606 2973 18521 2022 -12412 -23448 -49374
10208 -49374 -41885 -42150 -31667 5107 -11130 22287 65509 40200 15258 -9378 21548 39971
10196 39971 50724 31519 21796 -2122 -47459 -80260 -105689 -68392 -51996 -110596 -118442 -87302
10184 -87302 -46214 -2028 22198 60976 19709 -34571 1671 11122 7747 24553 -3034 -240
10172 -240 18067 32233 50527 36917 25258 -35448 -52230 -38073 -25726 -23712 -77730 -92363
10160 -92363 -81961 -48957 -10186 11996 4234 32468 60483 88399 66179 26468 17856 22127
10148 22127 30289 43097 50788 13961 -7890 -11544 -8571 -51576 -73219 -75093 -83951 -44487 -13742
10135 -13742 -50136 -43388 -1071 38155 17579 -9776 -6169 42250 86789 34885 1146 12117
10123 12117 450 10736 -14663 -58461 -34246 -9500 11115 -6811 3251 14985 32672 5451
10111 5451 -8435 -20244 -46575 -56403 -85776 -100544 -41848 -5484 10166 -1830 -5894 -17989
10099 -17989 -2496 3911 -14696 -24117 -42212 -32130 -22050 -9337 3853 -4484 -39875 10
10087 10 -1326 3604 11982 -27881 -36516 11862 5836 3527 -35241 -90613 -81006 -38933 -27613 -9820
10073 -9820 46153 40963 22718 27713 19839 -22070 -50337 -46575 -48273 -45401 -65025 -51346 -39132
10060 -39132 4459 12317 4883 -20055 -40673 -72379 -119416 -95606 -74747 -44647 -38487 -7732
10048 -7732 35484 25237 -11478 -46859 -11663 -22132 -45002 -20841 -46811 -92514 -102577 -54860
10036 -54860 -3592 28159 11866 6545 18034 18791 18682 11634 20363 -36356 -54422 -31504 8170
10023 8170 14226 -8520 -2309 1840 12187 15202 2609 -23423 -21011 -3779 26126 38415 21042
10010 21042 31155 6435 -10222 21753 12728 13626 20262 33525 24767 19758 -31392 -57974 -29405
9997 -29405 -13943 -20804 -1642 -737 38563 46502 -9548 -20577 22343 -15622 -77417 -38617 -28533
9984 -28533 -32450 -16352 -3097 -1294 -21978 -9652 -55627 -59655 -21748 7460 22501 6216
9972 6216 -18612 -20102 -34926 -27537 -33351 -36001 -32068 -37866 -12703 -8985 -23052 -19538 -74153 -92535
9958 -92535 -93376 -49797 -7090 22160 22274 28168 18469 19152 25373 -10941 -45448 -38112 -33366 -89207
9944 -89207 -106155 -96696 -98161 -85392 -80003 -86028 -84858 -47518 -33387 -1876 12153 19930 10850
9931 10850 1985 -5849 -18379 5631 27008 14615 16099 18535 -23009 -19114 13036 50568 64647
9918 64647 33072 11089 30794 43209 14846 -11070 14799 -14826 -8595 -9665 2512 42842
9906 42842 49963 31957 61602 56601 63875 65206 61595 59194 48174 50085 24270 -39125 -47399
9893 -47399 -49520 -41836 -21785 -47422 -43317 -59767 -86735 -32390 -21781 -29292 -40850 -71320 -90199
9880 -90199 -106116 -60040 -15721 18894 31304 -11751 -16260 24151 12882 -26578 -31207 -15418
9868 -15418 -32243 -3494 -2449 -14762 -665 998 6594 50308 57781 34193 60832 48278 19832
9855 19832 3336 -14474 -35640 -31118 -33565 -20831 -11966 -20234 -8296 465 -19647 -14716 27263
9842 27263 43441 21169 7057 48344 77158 116636 111994 50403 44177 3211 -41044 -11499
9830 -11499 17096 -33473 -71742 -32622 16672 9801 -32099 -40690 -41820 -7795 34529 61560
9818 61560 42426 2222 10125 31331 86145 41801 -5411 -7272 -13342 -28855 -31036 -7883 13425
9805 13425 36593 21695 -21814 -29788 -47089 -62414 -48916 4465 83977 66273 64531 49642
9793 49642 35406 26804 15771 26850 52589 97156 109442 85999 56150 36717 28561 7702
9781 7702 11080 20477 -3798 -6691 -11308 5230 -20584 -2895 8339 28112 37878 40061 37404
9768 37404 61505 95159 63960 20964 26924 32930 66891 53914 51610 -1322 -49379 -65275
9756 -65275 -60879 -19861 53525 72349 93272 64122 15562 2708 18696 13264 -13633 -21174
9744 -21174 -11658 -16373 31402 49352 39011 18793 13891 27980 68788 49078 33900 -220
9732 -220 -1130 -298 -7028 26249 8692 -9469 -14993 26985 22677 -19311 -23416 -8419 5231 -37817
9718 -37817 -48108 -51997 -6229 37206 22247 9635 21145 59276 82764 43906 35012 20543
9706 20543 -5055 -11960 -8330 15013 8574 20842 2810 9359 -1618 -31195 -40629 11730 2226
9693 2226 19191 31374 29828 20964 35162 5017 -21126 -13086 -18230 7880 28136 13818 31467
9680 31467 36515 -4783 12597 42560 46716 51439 14230 15436 4091 -437 49076 118559 117217
9667 117217 31911 5258 17896 47643 45630 30226 2849 -2208 7801 20165 31469 49928
9655 49928 7051 -2086 -13413 -28494 9597 28791 23059 15779 79512 53570 -13152 36930
9643 36930 21925 -14278 -16941 -36518 -32574 -8521 -218 8345 37800 39194 34748 36706 -13331
9630 -13331 -1849 35507 13954 28625 48672 46459 26376 29485 18728 22319 44563 44115 30868
9617 30868 37649 68216 74895 25024 -34115 -18968 10512 24345 -10489 2133 11592 47932
9605 47932 44629 29854 76136 82128 43105 12567 19226 28343 52419 64709 50250 4004 -19109
9592 -19109 -36534 -35897 23199 23356 23553 29525 -7474 6145 81696 112132 89801 53798 59004
9579 59004 70053 6519 -19101 -33842 -20716 -35199 -74436 -57133 5425 58603 44232 13164
9567 13164 -13078 -5760 43706 25412 5501 -20889 -38617 -34538 -30014 -5100 -5142 -28224 2946
9554 2946 29082 40383 31495 38763 33250 25457 31389 51100 72899 89587 94518 93682 97871 121544
9540 121544 109769 100516 104644 70373 91342 74695 52578 65790 49300 33262 -8123 41762
9528 41762 32753 15649 23224 595 24829 27261 47080 39867 26793 46335 32351 19809 65726
9515 65726 39709 8895 136 46990 68282 66157 79821 52158 6347 -815 -38519 -50524
9503 -50524 -15268 20317 65192 89975 90870 90456 82857 44960 58013 90079 99144 86330 77071
9490 77071 55749 88089 86198 69417 44978 81082 117301 96774 85699 65387 79752 140219
9478 140219 147392 123011 60239 44713 7545 -4104 19479 14251 5612 79774 104043 99187
9466 99187 76376 77043 73274 92150 145088 135618 141866 127739 124247 103062 92907 81245 67411
9453 67411 92267 136429 134886 118687 106135 91660 114219 109947 64961 46077 60186 63774
9441 63774 90597 130193 140155 168304 159219 131395 100191 80291 68510 71284 113341 129525
9429 129525 118557 88297 91426 111869 133382 171016 163956 164209 190158 200384 223059 258040
9417 258040 228444 204596 217544 205330 199436 215825 234481 274063 240440 195811 222516 257081
9405 257081 261491 191501 163217 163400 185022 230433 289496 297917 283706 277294 291002 261337 243749
9392 243749 275029 308380 329312 342084 315064 337651 388918 380806 376521 381826 351718 346272
9380 346272 378749 395817 380375 378648 375381 403517 430137 459071 466085 489841 540580 537399
9368 537399 533390 514589 523524 522117 529835 553819 570873 560326 565381 611493 687732 741564 761909
9355 761909 782976 785785 788494 801358 823002 843146 890544 921123 914642 889833 928971 978105
9343 978105 1036288 1087312 1109778 1170564 1180309 1219544 1227093 1284509 1323456 1363489 1384466 1425762
9331 1425762 1493257 1546352 1616497 1682624 1786541 1844051 1884615 1933082 1974183 2037071 2131406
9320 2131406 2198512 2261348 2348331 2430950 2511003 2604390 2694014 2766701 2820813 2883396 2932373
9309 2932373 3016627 3038176 3067995 3119353 3173202 3232395 3263122 3248915 3277784 3287071 3264011 3292777
9297 3292777 3287815 3241338 3207622 3147472 3147347 3141264 3037696 2934837 2841012 2750469 2708583 2699034
9285 2699034 2658968 2567522 2522449 2493310 2407260 2294803 2236880 2156431 2043331 1937408 1902215
9274 1902215 1846506 1796379 1756796 1706625 1648752 1586465 1583409 1594596 1535304 1456601 1401967 1364841
9262 1364841 1314225 1277308 1253008 1188603 1127640 1086769 1059793 1064078 1050743 1011759 982458 999016
9250 999016 1019930 969061 904453 887127 851267 826309 777721 742592 727808 705846 744627 747917
9238 747917 688396 621900 603439 646662 637772 619355 601220 597810 576795 553048 515559 524438
9226 524438 552833 588608 581685 524675 494617 458077 431635 447112 488525 479164 437019 423067
9214 423067 425043 406761 391435 397722 373979 341911 323451 319207 330534 283732 284394 313653 331427
9201 331427 342533 347023 326800 290030 280454 275716 260619 244577 210672 194366 228671 240595
9189 240595 274144 268853 272879 253464 241724 248361 248842 235121 219862 219544 237170 202049 214475
9176 214475 244014 264407 255130 246589 198525 174802 191689 246370 253935 227876 202756 216999
9164 216999 214318 225435 204377 190877 170033 150788 147779 166463 136186 116205 110339 119711
9152 119711 130099 138240 126773 142747 165844 144421 111884 146982 154062 124667 111955 121263
9140 121263 116222 113581 98578 104947 159686 211916 222392 147897 98801 102943 97804 128065 145942
9127 145942 141967 148848 153804 146588 159849 151804 144205 147065 112760 69999 44890 32552 19808
9114 19808 4952 44595 101365 91257 65172 62749 72216 56032 75083 68714 84811 77783 76645
9101 76645 115902 143256 144325 117449 89446 38249 67577 119630 98109 101410 93778 64109
9089 64109 50473 52379 53228 58114 61619 65757 65010 61041 44978 42800 87260 102776 80734 37721
9075 37721 28321 36676 79270 97771 93636 72308 77093 77771 56611 68305 67181 50454 27140
9062 27140 25043 19237 25461 56802 83814 94260 38239 25368 49337 21338 14949 24681 60056
9049 60056 94340 104290 104675 100613 132780 106838 57445 61464 67744 89502 63198 74719 85636
9036 85636 90048 59509 40516 32225 28958 35540 56936 71733 47105 41758 67405 77406 71665
9023 71665 73373 73068 88169 61817 45524 34940 37749 36639 47175 66268 61001 61032 15514 -33001
9009 -33001 14287 50930 35556 48295 39267 47290 80074 96061 65001 60518 68917 114277 143455
8996 143455 82698 34858 61767 70291 56987 66697 72182 69000 62605 104499 96047 97869 94596
8983 94596 60886 60320 99543 124094 132381 130128 80753 58571 29178 31211 41648 72938 96002
8970 96002 87397 60956 27784 60795 72609 30088 31503 31143 62118 71966 68285 61708 41094
8957 41094 10466 2643 23569 61425 45558 44195 32599 10892 -8074 -26835 -13438 -8163
8945 -8163 7221 26952 13294 -13500 2846 -14159 4240 23759 46810 43667 29046 11898
8933 11898 66430 86332 41731 77624 69822 70851 105883 112089 73920 88005 53234 36459
8921 36459 84167 114088 144431 84931 43212 51828 53671 32724 48367 43341 24398 12467
8909 12467 23319 52424 62173 89354 83577 79950 121209 152428 177340 189728 158466 121195
8897 121195 106382 98457 109418 93336 53722 50131 26407 45742 56757 42716 74997 115334
8885 115334 125889 122025 96676 80778 95902 73160 35311 67032 81025 42884 39220 27530
8873 27530 53801 51407 66086 55582 27207 3319 27167 103779 135381 148738 148784 142055 142709
8860 142709 133039 128616 173560 220638 302667 382436 410385 403731 355282 284524 233382 223925
8848 223925 194812 168423 156712 173570 151157 99970 125282 132177 134475 92016 53059 61356
8836 61356 28916 21083 28186 33292 60256 33707 34320 48856 59305 7674 12962 40492 79990
8823 79990 143081 113125 89002 82925 97195 108671 119306 140851 94270 104969 135859 168841
8811 168841 203398 236465 227136 226512 192606 142531 106883 107462 112180 123231 116512 103163 73074
8798 73074 98177 87427 88919 116432 109366 75182 95327 99873 97069 70939 23962 12598 55627
8785 55627 60124 78721 72249 66079 85402 82530 74513 96185 83440 59832 44234 32766 40773
8772 40773 47654 49420 56801 58691 72097 71873 74588 52605 36347 32072 17283 -341 -95 22586
8758 22586 28621 23929 52817 109056 144892 133817 93984 100905 163020 177243 151804 134286
8746 134286 112039 93838 82558 102140 84375 86978 79737 57419 81903 63164 77246 65402
8734 65402 45612 81809 88770 96519 89039 62648 41561 39133 94674 102468 78740 30816 9381
8721 9381 31618 37149 50842 53444 119303 133692 94172 53692 93866 109656 121921 89984
8709 89984 111576 110381 113143 137468 153816 112229 111863 99570 87246 117682 121655 170481 200632
8696 200632 166482 126227 130263 120933 109587 120919 156279 172311 133743 142810 164061 133521
8684 133521 129068 140368 141721 166626 175624 145332 142740 188267 167410 136817 125235 127768 153923
8671 153923 198111 174626 161376 116322 117139 85242 86003 74326 101522 124207 152809 140128
8659 140128 154752 171794 169634 151535 154766 154567 115550 110855 91263 111885 119096 94486 141265
8646 141265 171511 134105 120255 154797 157533 135855 124874 163758 183682 184551 177975 186337 175433
8633 175433 167341 179308 167882 172528 161312 161724 173915 144772 149207 161280 151318 132975 120711
8620 120711 95498 113212 96221 110285 192205 227157 226653 206600 167946 159019 176761 204396
8608 204396 197659 191172 164395 164049 167382 180330 217974 252518 262501 271503 285073 318508 347984
8595 347984 395557 420925 451971 414212 409117 450940 488356 506157 540006 580955 610266 681089
8583 681089 764057 838394 920320 981414 1022307 1047655 1060289 1123675 1188786 1174993 1188874 1147505
8571 1147505 1031270 920784 838529 729934 663571 607083 578516 554053 506135 464647 392530
8560 392530 328731 305982 345501 364079 354310 316534 311723 323634 289791 286888 301235 302435
8548 302435 268903 250601 226822 205722 213754 238167 247614 241261 235254 223015 223322 194739 181772
8535 181772 208741 179528 124257 136004 142292 159096 158175 173509 169394 171223 165530 118570 88789
8522 88789 84993 111276 102647 101948 147496 173946 167563 138036 135562 139666 97980 76970 41631
8509 41631 51532 111269 137983 181827 165418 153850 154388 134772 134710 103969 80403 32527 32909
8496 32909 72589 95562 97356 104375 118336 127553 153618 140701 129130 105295 65104 42571
8484 42571 48321 49642 41115 94717 94083 75312 65063 39163 -590 -17776 16408 17052 20683
8471 20683 80667 119340 68327 79138 86861 94726 99152 80834 95408 127770 139708 143516 153202
8458 153202 166480 160144 127418 109585 84373 59175 65904 72376 46806 38917 90024 89788 98938
8445 98938 72206 62322 62097 73609 89205 91475 63914 29088 41952 80600 102374 63166 50137
8432 50137 70877 78095 78705 96550 108292 94709 61016 44142 -10876 -21060 22046 42848
8420 42848 51487 73760 79083 78529 64881 106943 107785 79696 88926 34826 38595 60211 66785 100644
8406 100644 147833 149058 152539 104397 56154 39684 77203 123414 74057 26386 22381 10520
8394 10520 64544 129536 119113 82205 41121 37268 32258 38833 50137 41371 32045 32495 40400
8381 40400 81335 102883 71662 57282 33210 -14236 -21171 885 -35196 -23316 30786 76452
8369 76452 98018 94294 85961 68711 46674 58295 49859 20994 40234 16250 11036 -10683 16031
8356 16031 24005 9089 26738 42665 69909 77096 73609 104378 99897 79115 75939 53004 34494
8343 34494 71214 98653 102350 128538 87981 34775 36338 44055 58457 71188 55962 49718 23208
8330 23208 39309 71802 111252 75783 63900 81768 111247 68406 -2707 -9624 4314 -20846
8318 -20846 -33428 -16577 21462 27756 34572 60815 80813 58260 52748 46901 3198 38325 64177
8305 64177 72767 117881 95384 98231 97008 66193 19590 9946 12478 32644 47110 54519 38825
8292 38825 28349 53254 54197 35692 46159 58564 83818 45793 13583 -20830 21947 77328
8280 77328 68113 38746 69415 98689 72152 51144 52268 39098 45105 35752 1746 27137 72633
8267 72633 76744 62811 79096 87894 97142 96997 104858 75749 57853 79896 84237 76656 34382
8254 34382 1899 14340 30145 67463 34953 36777 30793 7830 25023 69450 55105 62338
8242 62338 67787 61317 24053 -29018 -35690 44170 68045 70103 64590 67579 24034 12607 39478
8229 39478 45947 36486 56641 43579 1710 -22575 -4972 6830 63815 87235 49470 708
8217 708 -3767 -1742 2676 19710 8669 -7693 -32778 -36785 -28563 -25430 -12854 -13316 -21598 -30896
8203 -30896 -52676 -34954 -3601 -29858 -29355 -18159 20398 1369 13168 35280 30467 29030 35547
8190 35547 47327 71529 67682 66512 71479 67437 78847 78146 41181 36276 73684 62913 40502
8177 40502 20705 19180 30855 50514 51483 -9042 9951 25044 69155 54369 26860 4467
8165 4467 -563 -1890 23804 51094 43963 26134 4984 6651 2769 20019 19811 -15151 -3805
8152 -3805 28939 30400 12133 21057 32171 55974 41229 14730 6683 22095 59524 86196 57045
8139 57045 25732 31558 36262 10568 29980 16901 -20517 -41239 -18196 560 32031 12712
8127 12712 24665 53873 37877 12878 -14285 -37346 -21097 -42890 -28503 -4436 19786 33736
8115 33736 41313 -1196 -18101 -23550 13458 38844 15326 -15936 -28875 -25613 -5760 11839
8103 11839 13003 9295 -11337 16671 50501 92901 107330 89058 92286 96137 104529 99413 83628
8090 83628 78075 84622 73951 70574 44364 31017 18810 -1085 -15138 6233 30751 56226
8078 56226 78903 62671 51144 54911 47321 59537 50068 31984 33684 30381 27846 27241 -11437
8065 -11437 20635 7582 -3474 19410 38341 37542 37190 47214 6356 53226 65751 45762 89771
8052 89771 118353 101262 101942 124856 137714 142910 138734 109821 83608 44466 63386 86942 69829
8039 69829 95607 154642 151938 153524 124807 87822 66034 78287 84840 81658 92964 83234 61819
8026 61819 53171 45103 158052 238415 210715 158134 175230 206147 176006 160557 150056 111680
8014 111680 105511 103636 93926 62344 59809 86754 136883 196025 216418 202081 178968 155711
8002 155711 159754 182515 155709 117614 133646 200049 220667 223958 229354 234387 215853 171418
7990 171418 163413 206695 238229 248689 223395 209154 209263 247173 298476 327988 323917 321798 282565
7977 282565 241315 206921 172637 159535 176879 208031 181398 148318 175784 196351 191567 181899
7965 181899 160174 150468 196765 217866 193772 151093 102309 88035 110942 152165 157208 183158
7953 183158 180211 167790 176049 179016 176051 167746 124469 134465 175956 174495 198515 218017 230944
$$ [...]
##END NTUPLES=NMR SPECTRUM
##END=
