##TITLE=Analysis number 314642
Compound Code HTS 06019
Book Reference 439/47/32
Project Code adrs
Chemist Name ronp
##JCAMPDX= 6.0         $$ Bruker NMR JCAMP-DX V2.0
##DATA TYPE= NMR SPECTRUM
##DATA CLASS= NTUPLES
##ORIGIN= Bruker BioSpin GmbH
##OWNER= NMR
$$ XWIN-NMR		Version 3.5
$$ Fri Oct 21 14:26:19 2005 GMT Daylight Time (UT+1h)  MAYBRIDGE\NMR@NMR_250MHZ
##.OBSERVE FREQUENCY= 250.131544655141
##.OBSERVE NUCLEUS= ^1H
##.ACQUISITION MODE= SIMULTANEOUS (DQD)
##.ACQUISITION SCHEME= undefined
##.AVERAGES= 16
##.DIGITISER RES= 18
##SPECTROMETER/DATA SYSTEM= dpx250
##.PULSE SEQUENCE= zg30
##.SOLVENT NAME= DMSO
##.SHIFT REFERENCE= (INTERNAL, DMSO, 0, 16.522)
##AUDIT TRAIL= $$ (NUMBER, WHEN, WHO, WHERE, WHAT)
$$ ##TITLE= Audit trail, XWIN-NMR		Version 3.5
$$ ##JCAMPDX= 5.01
$$ ##ORIGIN= Bruker BioSpin GmbH
$$ ##OWNER= NMR
$$ C:\u/data/dgb/nmr/ADRS/11210/pdata/1/auditp.txt
$$ ##AUDIT TRAIL=  $$ (NUMBER, WHEN, WHO, WHERE, WHAT)
(   1,<2005-10-21 14:26:01.10 +100>,<MAYBRIDGE\NMR>,<NMR_250MHZ>,
      <created by zg, POWCHK disabled, PULCHK disabled
       configuration hash MD5:
       62 19 C7 07 E1 42 D1 B7 37 6C 3D D0 77 39 F9 E6
       data hash MD5: 64K
       16 EE 8B 4A 18 CA B5 58 97 4A 9D 4A 03 32 62 07>)
(   2,<2005-10-21 14:26:11.77 +100>,<MAYBRIDGE\NMR>,<NMR_250MHZ>,
      <Start of raw data processing
       ef LB = 0.3 FT_mod = 6 PKNL = 1 SI = 32K 
       data hash MD5: 32K
       02 A1 B8 27 4A 02 54 B6 62 02 59 C6 31 41 0E E0>)
(   3,<2005-10-21 14:26:13.52 +100>,<MAYBRIDGE\NMR>,<NMR_250MHZ>,
      <apk 
       data hash MD5: 32K
       80 AC 03 48 A4 4A E0 6E B9 CF EB 6E 49 F7 4B 81>)
(   4,<2005-10-21 14:26:14.24 +100>,<MAYBRIDGE\NMR>,<NMR_250MHZ>,
      <abs ABSG = 5 
       data hash MD5: 32K
       EC E3 04 2D 98 77 1C DC 29 33 35 BE E5 80 4E 8F>)
$$ ##END=
$$ 
$$ hash MD5
$$ 55 17 61 B2 74 B7 72 91 F1 00 CE EE F5 C3 77 C9
##$RELAX= 
##$RELAX= 
##$RELAX= 
##$RELAX= 
##$RELAX= 
##$RELAX= 
##$RELAX= 
$$ Bruker specific parameters
$$ --------------------------
##$DU= <C:\u>
##$EXPNO= 11210
##$NAME= <ADRS>
##$PROCNO= 1
##$TYPE= <nmr>
##$USER= <dgb>
##$AMP= (0..31)
100 100 100 100 100 100 100 100 100 100 100 100 100 100 100 100 100 100 
100 100 100 100 100 100 100 100 100 100 100 100 100 100 
##$AQSEQ= 0
##$AQ_mod= 3
##$AUNM= <au_zg>
##$AUTOPOS= <46 >
##$BF1= 250.13
##$BF2= 250.13
##$BF3= 250.13
##$BF4= 250.13
##$BF5= 500.13
##$BF6= 500.13
##$BF7= 500.13
##$BF8= 500.13
##$BYTORDA= 1
##$CFDGTYP= 0
##$CFRGTYP= 5
##$CHEMSTR= <none>
##$CNST= (0..31)
1 1 145 1 1 1 1 1 1 1 1 1 1 1 1 1 1 1 1 1 1 1 1 1 1 1 1 1 1 1 1 1 
##$CPDPRG= <>
##$CPDPRG1= <>
##$CPDPRG2= <>
##$CPDPRG3= <>
##$CPDPRG4= <mlev>
##$CPDPRG5= <mlev>
##$CPDPRG6= <mlev>
##$CPDPRG7= <mlev>
##$CPDPRG8= <mlev>
##$CPDPRGB= <>
##$CPDPRGT= <>
##$D= (0..31)
0 1 0 0 0 0 0 0 0 0.06 0 0 0 0 0 0 0.0002 0 0 0 0 0 0 0 0 0 0 0 0 0 0 
0 
##$DATE= 1129901160
##$DBL= (0..7)
120 120 120 120 120 120 120 120 
##$DBP= (0..7)
150 150 150 150 150 150 150 150 
##$DBP07= 0
##$DBPNAM0= <>
##$DBPNAM1= <>
$$ [...]
##$SUBNAM7= <"">
##$SUBNAM8= <"">
##$SUBNAM9= <"">
##$SW= 20.6930455092707
##$SWIBOX= (0..15)
0 0 3 0 0 0 0 0 0 0 0 0 0 0 0 0 
##$SW_h= 5175.983436853
##$TD= 65536
##$TD0= 1
##$TE= 296.16
##$TE2= 300
##$TE3= 300
##$TEG= 300
##$TL= (0..7)
0 120 120 120 120 120 120 120 
##$TP= (0..7)
150 150 150 150 150 150 150 150 
##$TP07= 0
##$TPNAME0= <>
##$TPNAME1= <>
##$TPNAME2= <>
##$TPNAME3= <>
##$TPNAME4= <>
##$TPNAME5= <>
##$TPNAME6= <>
##$TPNAME7= <>
##$TPOAL= (0..7)
0.5 0.5 0.5 0.5 0.5 0.5 0.5 0.5 
##$TPOFFS= (0..7)
0 0 0 0 0 0 0 0 
##$TUNHIN= 0
##$TUNHOUT= 0
##$TUNXOUT= 0
##$USERA1= <user>
##$USERA2= <user>
##$USERA3= <user>
##$USERA4= <user>
##$USERA5= <user>
##$V9= 5
##$VALIST= <valist>
##$VCLIST= <CCCCCCCCCCCCCCC>
##$VD= 0
##$VDLIST= <DDDDDDDDDDDDDDD>
##$VPLIST= <PPPPPPPPPPPPPPP>
##$VTLIST= <TTTTTTTTTTTTTTT>
##$WBST= 1024
##$WBSW= 4
##$XGAIN= (0..3)
0 0 0 0 
##$XL= 0
##$YL= 0
##$YMAX_a= 344551
##$YMIN_a= -289615
##$ZGOPTNS= <>
##$ZL1= 120
##$ZL2= 120
##$ZL3= 120
##$ZL4= 120
##$ABSF1= 16.522
##$ABSF2= -4.171173
##$ABSG= 5
##$ABSL= 3
##$ALPHA= 0
##$AQORDER= 0
##$ASSFAC= 0
##$ASSFACI= 0
##$ASSFACX= 0
##$ASSWID= 0
##$AUNMP= <proc_1d>
##$AZFE= 0.1
##$AZFW= 0.1
##$BCFW= 0
##$BC_mod= 0
##$BYTORDP= 0
##$COROFFS= 0
##$CY= 12.5
##$DATMOD= 1
##$DC= 0
##$DFILT= <>
##$DTYPP= 0
##$F1P= 14.0000005364418
##$F2P= -0.99999901652339
##$FCOR= 0.5
##$FTSIZE= 32768
##$FT_mod= 6
##$GAMMA= 0
##$GB= 0
##$INTBC= 1
##$INTSCL= 1
##$ISEN= 128
##$LB= 0.3
##$LEV0= 0
##$LPBIN= 0
##$MAXI= 10000
##$MC2= 0
##$MEAN= 0
##$ME_mod= 0
##$MI= 0
##$NCOEF= 0
##$NC_proc= -5
##$NLEV= 6
##$NOISF1= 0
##$NOISF2= 0
##$NSP= 0
##$NTH_PI= 0
##$NZP= 0
##$OFFSET= 16.522
##$PC= 1
##$PHC0= -77.27517
##$PHC1= 10.9723
##$PH_mod= 1
##$PKNL= yes
##$PPARMOD= 0
##$PSCAL= 4
##$PSIGN= 0
##$REVERSE= no
##$SF= 250.13
##$SI= 32768
##$SIGF1= 0
##$SIGF2= 0
##$SINO= 400
##$SIOLD= 32768
##$SREGLST= <1H.DMSO>
##$SSB= 0
##$STSI= 32768
##$STSR= 0
##$SW_p= 5175.98343685301
##$SYMM= 0
##$S_DEV= 0
##$TDeff= 65536
##$TDoff= 0
##$TI= <Analysis number 999999
Compound Code 99
Book Reference 9
Project Code 9>
##$TILT= no
##$TM1= 0
##$TM2= 0
##$TOPLEV= 0
##$USERP1= <user>
##$USERP2= <user>
##$USERP3= <user>
##$USERP4= <user>
##$USERP5= <user>
##$WDW= 1
##$XDIM= 32768
##$YMAX_p= 282335311
##$YMIN_p= -702371
$$ End of Bruker specific parameters
$$ ---------------------------------
##NTUPLES= NMR SPECTRUM
##VAR_NAME=  FREQUENCY,     SPECTRUM/REAL,   SPECTRUM/IMAG
##SYMBOL=    X,             R,               I
##VAR_TYPE=  INDEPENDENT,   DEPENDENT,       DEPENDENT
##VAR_FORM=  AFFN,          ASDF,            ASDF
##VAR_DIM=   32768,         32768,           32768
##UNITS=     HZ,            ARBITRARY UNITS, ARBITRARY UNITS
##FACTOR=    0.157963299565203, 1,           1
##FIRST=     4132.6476996994, 0,             0
##LAST=      -1043.33573715361, 0,           0
##MIN=       -1043.33573715361, -702371,     0
##MAX=       4132.6476996994, 282335311,     0
$$ Real data points
##PAGE= N=1
##DATA TABLE= (X++(R..R)), XYDATA
$$ [...]
27195 23639455 23584353 23640419 23605496 23579803 23652637 23746378 23763159 23727503 23711599 23695917 23626542
27184 23626542 23486830 23285061 23042692 22925803 22837318 22796164 22718869 22539066 22423481 22300936
27174 22300936 22079335 22024656 22027908 21872621 21610156 21475826 21305003 21087564 20757212 20603519
27164 20603519 20531234 20533319 20498524 20308731 19964527 19872509 19579597 19386043 19232286 19090790
27154 19090790 18905000 18748963 18549027 18237679 18045576 17786324 17817901 17845904 17706768 17337033
27144 17337033 17034361 16810301 16766975 16599408 16459642 16328340 15946877 15607089 15470841
27135 15470841 15172996 14866374 14759570 14620103 14608473 14466239 14191831 14061283 13905186
27126 13905186 13640384 13417277 13289769 12900427 12601847 12538796 12399224 12290332 12125477
27117 12125477 12094373 12043693 12059024 11945256 11666322 11473137 11185821 10910370 11031424 10943462
27107 10943462 10744671 10593787 10506456 10397034 10143002 9883016 9989853 9940212 9660784 9397463
27097 9397463 9170160 9129592 9097839 8949742 8860071 8680399 8621960 8795213 8592631 8331607
27087 8331607 8241800 8124087 8152345 7944821 7778125 7763600 7698021 7614280 7544272 7436573
27077 7436573 7388567 7473763 7430693 7143860 7130560 7255152 7293185 7080385 6879672 6945197
27067 6945197 6819908 6651645 6559307 6455607 6362370 6311223 6186883 6090727 5837530 5667127
27057 5667127 5562952 5557728 5612286 5627541 5628428 5621420 5501489 5374095 5271021 5178317 4977130
27046 4977130 4923749 4972725 4993793 4990835 4957192 4973434 4911711 4997622 5021975 4928168 4846746
27035 4846746 4702673 4598208 4486857 4544105 4606827 4389669 4326077 4182802 4087525 3977595
27025 3977595 3917447 3893206 3861182 4027782 4044642 4010355 4189592 4263795 4134087 3912048
27015 3912048 3610229 3661195 3725238 3464902 3351484 3504751 3679155 3723272 3761250 3667310
27005 3667310 3566003 3425414 3415199 3366767 3328249 3326142 3262094 3254091 3306351 3223786 3051694
26994 3051694 3012028 2892523 2827741 2859862 2940887 3026858 3081285 3051032 2996595 2937908 2853047
26983 2853047 2715780 2780387 2854198 2894765 2803891 2820891 2872037 2956801 2942775 2746714 2559740
26972 2559740 2570517 2424047 2387760 2497632 2399717 2325428 2387186 2380968 2282073 2239768 2257746
26961 2257746 2305565 2239811 2042102 2013058 2022153 2050269 2032152 2209398 2373509 2388630 2319797
26950 2319797 2158007 2067030 2109230 2162042 2048296 2082667 2097995 2112015 1844198 1910811 2131518
26939 2131518 2247210 2302826 2257822 1990977 1913031 1909240 1885360 1973950 1928773 1934364 1871867
26928 1871867 1819526 1927609 1936213 1876543 1862519 1696285 1532341 1453189 1376617 1402716 1590282
26917 1590282 1672066 1548853 1658987 1713904 1631877 1571201 1600650 1720225 1764953 1738148 1751908
26906 1751908 1767537 1705600 1738572 1609831 1350930 1522372 1635348 1476359 1341622 1332326
26896 1332326 1444764 1492876 1364268 1324513 1284481 1406667 1517129 1477279 1487793 1581494
26886 1581494 1588343 1399267 1341102 1319873 1274527 1228025 1223797 1210238 1046865 855641 741729
26875 741729 900852 1196770 1207286 1218241 1300538 1304490 1190821 1108157 1210433 1316106 1376251
26864 1376251 1424492 1387434 1346371 1134342 1189251 1343499 1312738 1327219 1201550 1192630 1139743
26853 1139743 1056933 1047041 1200190 1294756 1282416 1199260 1181593 1171877 1111170 1121952 1068137
26842 1068137 948531 805482 721140 699468 639953 932038 1066601 1000058 899771 942111
26832 942111 992551 835291 697214 781261 886027 831041 693936 747048 870387 949597
26822 949597 937820 932967 909772 994342 1079137 1005129 1009639 894788 732607 657071 666372 818784
26810 818784 883268 953494 903031 813083 741347 769658 710492 737966 972885 1032108 1022925
26799 1022925 874649 754395 726668 885804 943965 895791 729608 624270 554740 559398
26789 559398 730153 684846 819897 931852 718931 670708 767023 938221 1013568 931898
26779 931898 858182 638687 542991 514224 590628 692236 730389 756120 848780 849954 779481
26768 779481 623964 470436 571025 547569 363574 395654 610908 718535 660055 694981
26758 694981 680566 503042 405588 496413 638875 772531 854309 884276 804077 744728 698883
26747 698883 617222 455248 393799 371449 392612 322406 296893 229808 395113 346097 255614
26736 255614 274880 530652 591123 631249 639802 436321 257369 476312 723246 663317 593398
26725 593398 516306 455879 483856 548331 558628 694631 707534 679401 782790 836593 886812
26714 886812 790642 779548 847190 814867 713804 620192 514860 493270 555399 699867 617658
26703 617658 511105 490656 462277 486841 428520 408690 424388 455092 488121 515473 600029
26692 600029 665971 506540 455451 606350 623176 462929 464607 433647 575444 472071 283855
26681 283855 337999 520555 457393 435615 335686 263604 369726 476572 489925 368555 342804
26670 342804 398442 568627 488343 318484 306253 469863 567056 523937 328666 144227
26660 144227 243887 344069 538889 624689 486734 254753 235449 228564 382238 274498
26650 274498 230146 356036 465023 552419 605705 591991 646798 589547 533574 431582 333975
26639 333975 234564 172736 196905 245453 301988 266936 355775 370471 344960 363432 297742
26628 297742 115593 165077 329060 470476 476719 401378 419201 424167 335237 175862 130229
26617 130229 277311 298143 294304 443184 533580 438512 393427 496294 569816 413495 493575
26606 493575 480876 415575 568153 508649 379413 291180 253805 420493 432231 359330 224741
26595 224741 177919 133711 258270 382819 351868 323331 337626 156983 164644 179572 168342
26584 168342 221137 171327 229129 226905 140458 102606 192365 348114 402289 364693 437374
26573 437374 473445 267550 239209 85236 92562 183635 207810 254085 251656 136627 267311
26562 267311 470241 646961 503926 523486 605324 460510 375396 344036 267575 172419 102612
26551 102612 143827 166889 116339 199415 347355 367083 421747 458617 427156 208655 129430
26540 129430 111663 16675 66591 183735 224652 243506 246205 255934 208794 123132 183937 140303
26528 140303 257648 315644 241354 240045 432178 359927 448566 263546 73665 129273 215374
26517 215374 282467 243141 168968 262917 392794 502611 520618 523324 492442 522029 521182 351097
26505 351097 305830 237413 126307 245747 306197 166275 220791 192959 137059 242944 172915
26494 172915 -20486 -23309 179134 220630 94884 -18190 144932 293492 389617 401016
26484 401016 340735 353475 417053 450558 340888 261459 357416 328770 395040 398838 303194
26473 303194 304590 356746 384156 322582 90709 185833 151222 183609 234499 357344 443045
26462 443045 342448 225674 99858 85854 123626 52011 96755 31131 217172 282674 269418
26451 269418 197374 82094 255398 291023 290075 167133 118432 160825 198003 235712 394448
26440 394448 412046 401779 247473 209045 144775 132379 222875 259816 201296 205762 303242
26429 303242 75264 -75356 -47411 -29145 158617 20583 5374 22189 136664 49055
26419 49055 147078 175938 55092 141848 38841 50947 75422 145836 176226 41815 43819
26408 43819 93331 29696 -27768 105341 138501 -22156 -199652 -209061 -232933 -85121 62912
26397 62912 199258 236737 138540 137777 91050 3719 62090 128399 -22446 80498 13257
26386 13257 123072 223829 143529 115076 87875 -52671 -145884 -86414 -15317 159395 159938
26375 159938 95579 -98537 -141280 -98282 5160 33948 19686 126098 96747 -69403 -27823
26364 -27823 -24908 57910 157066 207901 113728 114101 146075 196682 336676 217262 112462 21801
26352 21801 -54633 95439 258992 258861 236533 135141 207443 110082 107501 143617 34937
26341 34937 -30234 -93286 -44022 127621 140999 83283 145308 271710 433485 444677 543007
26330 543007 470890 133883 -44046 -37896 -70230 -140268 -123074 -49495 -32271 -86142 106055
26319 106055 222412 71684 33617 135738 153488 -30980 -68130 -67940 -28939 46058 120900
26308 120900 208363 195343 99501 70342 131952 -15737 -10200 85161 -12003 40185 214783
26297 214783 76197 -7324 68424 185330 238906 354954 371770 395620 302406 199048 229383
26286 229383 298599 301249 277766 79941 35306 49416 97483 134697 183383 315409 305151
26275 305151 168257 28648 69643 166959 117992 119146 249236 291238 237575 159712 76317
26264 76317 92879 324036 197766 97295 179601 271501 477702 376286 147149 57544
26254 57544 62437 205934 149352 187149 189027 170106 163795 82957 -10703 4478 46216 113529
26242 113529 201606 191778 179455 13284 49744 235977 277571 235944 164487 233710 243329
26231 243329 222741 241935 241055 284444 219230 -340 -49133 157879 102119 -65072 -78875
26220 -78875 -39317 -174189 -197419 -238670 -239461 -69542 -102534 -213216 -211020 -138875 -8266
26209 -8266 77899 120264 133033 -100634 -290187 -183334 -158267 -151672 -150059 -123070 -116916 -125712
26197 -125712 -81125 -175557 -67642 21905 -52955 -232059 -210840 -166790 -78897 -31987 -22225
26186 -22225 -21107 -192459 -108879 8998 -94982 -179137 -168006 -216815 -264287 -178991 -684
26175 -684 -45164 14470 64123 140440 76837 61667 -8379 -54595 -145272 -189314 -129511 -51637
26163 -51637 -15495 212 59859 -67204 -169905 -277731 -230390 -80613 -79337 -71905 -53673
26152 -53673 -115331 -236768 -242574 -209259 -35406 53563 119786 58946 -21360 29321 110142
26141 110142 92467 -130276 -102480 -9191 45322 89172 66866 93938 265060 320197 313838
26130 313838 238099 86525 119556 189401 255171 155461 188110 166354 53318 -61777 -26893
26119 -26893 44127 49150 133572 -50828 -216178 -129521 -26700 -109876 -77752 -125615 72199
26108 72199 326990 305603 100966 67716 -29234 -162051 10383 186002 109548 183649 77870
26097 77870 -113176 -28542 144498 238125 153201 -44998 -44077 -104206 -291993 -110650 86900
26086 86900 177900 219580 57821 -89697 -67271 -3084 -120487 -169408 -24575 108296 127430
26075 127430 -21122 47607 -96098 -248829 -15658 -55843 -144593 -119850 -140307 -195538 -741
26064 -741 137247 108594 82827 -16240 90134 125263 47200 -108698 -17939 -69665 -13064
26053 -13064 12906 -13677 98365 93895 175325 206386 106281 -54398 -121645 -120890 -201319 -154936
26041 -154936 18945 186468 90893 70587 -26127 -78248 -52681 -88649 -219069 -300140 -201598
26030 -201598 -122056 -119364 9791 134529 161019 101682 162565 218471 89834 -135490 -190247
26019 -190247 -182771 -239018 -171328 -21060 2017 -102093 -8067 121315 164192 74489 -87284
26008 -87284 -150295 -107478 134954 76506 51952 136300 84886 -62479 -112091 -237804 -337395
25997 -337395 -249008 -55604 33411 -46179 -77875 -188108 -235822 -131638 24410 37090 21267
25986 21267 114255 237568 297248 284445 294192 289230 257456 89583 -64899 -168820 -71632
25975 -71632 51039 -14162 88181 79886 -136476 -349326 -249644 -132735 -93340 -100730 -151723
25964 -151723 -40688 -11690 -56052 -73192 9295 168799 240880 9606 -164484 -201884 -39480
25953 -39480 -57783 -77127 -70788 36868 64687 74883 296 87259 68390 129092 149747 77450
25941 77450 -88476 -232900 -189900 -221415 -51069 37487 -16880 51606 209637 305207 205988
25930 205988 51180 136663 93024 173688 23368 -67704 -101252 -138625 -93190 -141378 -128882
25919 -128882 -12689 97934 173102 152425 44377 73826 127646 -77770 -245405 -298663
25909 -298663 -184841 -150180 -34829 94804 53404 11423 35305 -95845 -16317 592 -84669
25898 -84669 109735 187582 147665 230009 217005 73371 2221 -66937 -151174 35646 -45340
25887 -45340 -229390 -100093 -61088 44702 -2378 77492 75418 46328 18768 95733 71368
25876 71368 148514 180653 233967 246573 183069 85226 -2987 -128247 -173789 -40272 -135560
25865 -135560 71594 9894 24281 132783 -40045 -25967 21513 -45694 -36914 -125397 -206652
25854 -206652 -88227 1101 92004 83426 53506 -80409 31527 65315 36586 -57595 -81773
25843 -81773 -13085 34921 71812 29479 -69933 -129162 25778 113490 219488 208521 108482
25832 108482 -66767 -127923 -84821 -53735 -14824 -133725 -231380 -308797 -302849 -279658 -83735
25821 -83735 37987 131650 200631 76136 7039 349 -27560 5165 -23541 -193586 -150549
25810 -150549 -119428 -88733 -57575 -72109 -102743 38067 73440 9664 145825 105998 15780
25799 15780 1628 8680 27742 76166 107230 40289 -41756 -13980 99567 136169 96296 -53829
25787 -53829 -23581 131334 144480 111900 22833 -66203 -188277 -198511 -53515 150142 239440
25776 239440 262627 347588 422966 468554 393965 309272 223362 47685 -203215 -100487 -87075
25765 -87075 -622 115893 87693 20858 -165651 -272953 -206634 -329706 -215630 -182955 -173177
25754 -173177 -82169 82494 135886 -2918 -113658 -98159 -122913 -148392 -164503 -211597 -202889
25743 -202889 -169367 -35708 13243 -139802 -206523 -244941 -274450 -271906 -277087 -258404 -178743
25732 -178743 -108596 -23238 29213 7613 32765 -176147 -158220 -30533 -147028 -195495 -207433
25721 -207433 -73766 31006 32244 32118 111054 109060 114919 51548 12597 -90985 -54668 58470
25709 58470 139250 229873 324125 229196 70268 -11176 -125046 -205631 -150392 -66496 -112195
25698 -112195 -52330 73083 116588 -17049 -124411 -100306 -161525 -164153 -128944 -122526 -122704 -85406
25686 -85406 -66214 -76270 -154245 -109875 -13454 -85947 -26381 -16808 29973 -50276 -141800 -238038
25674 -238038 -96071 -103851 -189824 -150609 -177894 -48256 -277380 -264166 -238373 -20639 197424
25663 197424 151285 -84940 -327892 -427265 -249915 -196670 -111017 -132156 68384 435610
25653 435610 314587 160297 29375 -61751 -106379 -4442 206429 76256 -30656 -116227
25643 -116227 -113469 -110561 -157937 -160624 -75836 36349 72659 58490 94640 217889 192935 81060
25631 81060 111791 89129 8137 18622 100226 -21243 -121324 -24612 136537 68383 -165224
25620 -165224 -244584 -243175 -320290 -222015 -13399 107484 149015 72540 -188418 -274402 -223284
25609 -223284 -238698 -240560 -270551 -136008 -156658 -242811 -268683 -157596 -7326 86584 52058
25598 52058 -209006 -179428 -130865 -112965 -232592 -369231 -219949 -6379 163945 65521
25588 65521 32626 -110348 -114883 113018 301695 324051 231341 201853 139082 49991 -33022
25577 -33022 -94427 57804 164695 206317 126473 -51925 -133136 -188891 -171399 -39739 -124225
25566 -124225 -65576 64960 24702 95852 196036 259801 254072 178280 158300 100266 -32205
25555 -32205 5639 118552 241249 239810 210223 135988 -16654 -41313 121573 60415 84901
25544 84901 2523 -68147 -208447 -160912 -135148 -212755 -164884 -79346 138146 22793 6701
25533 6701 79006 26836 -23899 90424 200108 333052 324540 150519 -99106 -107373 -53958
25522 -53958 113229 185443 144413 115063 113814 133046 147858 207988 265667 99601 -73832
25511 -73832 -144877 86928 170663 187653 233328 140876 172511 200424 101676 32623 -179373
25500 -179373 -62178 125090 85068 -12402 -800 12865 69491 136689 60911 120088 205727
25489 205727 240077 121993 89862 103415 151719 108652 -19504 45199 79417 158593 111690
25478 111690 -64786 -231807 -276668 -262067 -203634 -200884 -137122 -66074 13195 197068 116295
25467 116295 -18125 -55935 -17843 50773 164983 80530 96630 -9278 -13568 66603 -26164
25456 -26164 -60511 4183 108278 125802 64853 -118096 42709 -51913 -70835 53726 77927
25445 77927 64885 1379 -127845 -56905 -87397 -254761 -253294 -155498 23506 -45602 -212732
25434 -212732 -9819 2500 -136331 7252 87673 407 -79808 -73340 -216625 -127595 -48608
25423 -48608 -91774 -225185 -121567 10933 88294 77759 -72953 -265988 -343069 -177223
25413 -177223 -59030 -53764 -234704 -271309 -188627 -65895 -162046 -170493 57139 -78419 -125216
25402 -125216 -118015 -27019 -111183 -65243 185952 303788 355847 315256 232243 71038 21817
25391 21817 120312 51422 46743 72742 1924 238 -8574 -12574 -36263 -85612 -249794 -350278
25379 -350278 -260013 -198299 39726 123607 74460 -133692 -124362 -2609 5758 48764 82907
25368 82907 22193 123318 -58572 -129331 -24989 -56523 -180381 -231971 -50069 7967 -68241
25357 -68241 -180772 -106761 39215 -50306 -174809 -207888 -295633 -374556 -305125 -163237 -122675
25346 -122675 -113896 -184338 -155752 -327175 -112808 -37805 -89301 -127456 -98498 -136052 -67225
25335 -67225 -6329 90681 28699 24978 98740 270231 223934 118795 165654 192081 192332 292451
25323 292451 125970 161317 185532 -661 -131276 15831 -46764 -146235 -23237 46078
25313 46078 -91310 -148312 -199260 -173096 -247149 -235064 -135085 -94139 -143324 -202934 -207222 -112813
25301 -112813 -140001 -105873 -234305 -302240 -283068 -311637 -196058 54941 54186 -143510 -56850
25290 -56850 -3053 -34255 41853 -27940 -220898 -234793 -365740 -462848 -339684 -239232 -143703
25279 -143703 -187305 -147669 -220396 -251156 -251096 -286381 -231514 -154343 -120672 -86693 -11507 62847
25267 62847 -53997 -204194 -287473 -209670 -281475 -325114 -249529 -200677 -219103 -215697 -161787
25256 -161787 -160797 -81414 -133322 -73719 -77101 -146946 -275716 -379115 -274352 -215662 -132850
25245 -132850 -125047 -179042 -233467 -379722 -221686 -323329 -188127 -74984 6687 -43837 -126777
25234 -126777 -179229 -182871 -88934 45830 60533 -8358 -18500 -49365 -3459 -52570 -237256
25223 -237256 -270041 -197028 -86887 57500 71719 9430 51737 111345 26808 -85492 -42221
25212 -42221 -133069 -66990 33109 67172 88341 87925 5454 -70274 -149394 -73266 -51701 -7433
25200 -7433 146557 97572 963 -183678 -252837 -365053 -328954 -154407 39136 -87766 -141885
25189 -141885 -104502 -214641 -74649 -25819 -27116 -40742 -112367 -123518 -112650 -61491 96236
25178 96236 94751 79984 38633 -125123 -250257 -188497 -30090 -16389 -45282 -165486 -173795
25167 -173795 -146766 -238493 -245263 -388088 -444140 -360745 -379872 -390008 -164128 16854 83238
25156 83238 217378 168668 81320 19521 232480 187220 -8111 -100842 -109862 -177382 -134225
25145 -134225 -22604 -71225 41515 5349 -193643 -202774 -140996 -156884 -59905 79893 -17493
25134 -17493 -158294 -84682 -231724 -313225 -335674 -286634 -235789 -260377 -311231 -316507 -322113 -172112
25122 -172112 -137055 -188376 -135772 -8608 212541 146141 42692 104436 81393 -90552 -78165
25111 -78165 -84161 -56396 1614 62415 53708 130377 -10241 -160922 -188694 -86755 165655
25100 165655 253858 104104 -47648 -47040 -110528 -208940 -85282 -185340 -165522 -56039 -109532
25089 -109532 -12657 19513 124969 154977 95276 58274 49807 34509 -148308 -247771 -292962
25078 -292962 -163146 -11165 -11862 -34680 -11680 96334 196697 173160 94097 96823 -40530
25067 -40530 -199242 -135646 -184709 -249520 -433890 -415956 -345019 -310784 -179079 -22499 89212
25056 89212 56598 -21342 48205 13153 -3237 -71788 -215542 -150593 -6081 -15769 22554
25045 22554 -15274 -23859 -174985 -181081 -109934 -35699 -94758 -169978 7675 71005 -18739 -17056
25033 -17056 117854 111212 48364 -32292 -160109 -128876 -82210 -49183 -130048 11209 52435
25022 52435 -96335 -113690 -124048 -145125 -3557 113188 37094 8035 4068 25330 145765
25011 145765 56855 -5402 18004 -200173 -148405 -230655 -200160 -88135 55446 180423 75867
25000 75867 -17732 175048 240016 114798 -34562 -176797 -173073 -168991 -201534 -116953 -43440
24989 -43440 -127977 -84779 25952 110466 99818 -14163 -32936 -153781 -312415 -170246 -13945
24978 -13945 -128381 -113731 -111554 -51097 -44918 -85206 75167 118274 217746 161927 27544
24967 27544 11947 -26610 -81587 -16800 212719 266104 334484 287754 249134 355267 314087
24956 314087 117089 79358 -72000 -74881 117969 181930 153945 119173 63795 -6673 -20953
24945 -20953 68431 177680 18447 -104263 -178580 -194326 -31390 101330 115825 144171 121417
24934 121417 4963 -3781 -132043 -130243 97904 233077 181548 7140 -25717 12319 106347
24923 106347 219037 215727 68392 78927 137213 105672 196089 187477 8439 -88566 -131739
24912 -131739 -141699 -88244 -54006 -95003 101823 214238 144644 -123224 -178973 -28192 -63282
24901 -63282 -148476 -100065 28597 -140714 13073 112258 91920 64118 205365 126578 -4610
24890 -4610 3498 -90629 -135040 -178225 -97204 -43348 -78873 -140671 -87308 -65710 -145248 -298788
24878 -298788 -222002 -207785 -237966 -247314 -150042 26572 233144 202459 243836 259079 71270
24867 71270 -116105 -48918 -135573 -43800 87800 197867 113878 430 -46555 -117767 -165304
24856 -165304 -481 71117 22326 23049 -76000 -141935 -6249 26193 -39882 -76139 -71201 -78056
24844 -78056 -61246 34197 -9427 -2103 97963 126973 17640 9338 -32066 109173 155581
24833 155581 104592 150357 95696 78869 16916 -6037 15339 69941 156413 31856 -77973
24822 -77973 -80497 -132660 15124 55217 -128093 -167571 -242430 -407609 -338275 -248083 -27647
24811 -27647 88589 -3708 93990 236737 89184 -69985 -184293 -95362 -29576 57520 158747
24800 158747 305343 442556 443238 381697 129631 -158449 -218016 -200933 -138217 -235694 -300001
24789 -300001 -187648 -159518 -82901 -84159 -84809 -174225 -113451 102597 56766 133291 187294 158042
24777 158042 186997 49170 16209 14699 -73974 -198548 -210445 -115358 -39518 -166957 -224402
24766 -224402 -148125 -10997 163881 283927 176896 83752 86689 56850 -13682 -6954 -34044
24755 -34044 -70379 28498 176967 251056 195260 197808 238609 158130 -1703 -83308 -166739
24744 -166739 -213945 -226123 -258138 -75114 18236 -54415 -19167 -39904 -98308 -123795 -171983
24733 -171983 -73464 -24906 -164714 -233212 -305976 -253818 -246109 -46665 -64891 -92623 -149442
24722 -149442 10211 90142 -9585 -47230 36849 36196 46313 -275471 -416716 -363345 -439093
24711 -439093 -380788 -288571 -322707 -317838 -237818 16347 11555 -124358 -99700 -17844 -62362
24700 -62362 -71509 -138462 -66962 67627 2307 -8372 -26744 -40861 -205396 -154852 35949
24689 35949 39682 -42862 -27141 51866 124426 78415 -143683 -267299 -125923 -157302 -179410
24678 -179410 -221465 -228705 -195289 1191 6873 -55409 110662 161649 135749 64092 -153668
24667 -153668 -155297 -210120 -268191 -82114 -31918 -50337 -11994 25002 8054 -63456 -42724
24656 -42724 -41472 28245 159024 187341 146417 75023 23342 70043 -11966 -60823 -103011 -89505
24644 -89505 27232 97409 -18587 -20903 13662 66893 190614 100328 -135434 -107449 -1347
24633 -1347 -7353 -29065 85236 157066 160658 161892 80721 50795 119647 212772 99706 254088
24621 254088 255836 36803 6556 29404 27441 -6225 -84365 -183274 -66579 118568 193220
24610 193220 -14004 -24823 21423 -97158 -144716 -168051 -138279 70269 28362 -67964 -132346
24599 -132346 -56212 -101656 36832 87764 40768 16539 18548 28406 20463 221564 332825
24588 332825 379927 294514 82876 -35320 19289 68377 -32280 -124258 -67545 71417 85521
24577 85521 39877 -7590 31115 94461 -13385 4171 100024 254261 279928 65399 -2753
24566 -2753 56313 50590 128056 171329 152671 110641 -75228 -178789 -138666 -133810 138518 282851
24554 282851 89487 80887 -87198 -111638 -299039 -256093 -38781 85845 36694 -38584 -1185
24543 -1185 107287 -63493 -120809 40112 -5814 152721 246573 130215 178861 188796 102032
24532 102032 -5675 -64425 -40541 -13654 99252 48738 4154 23714 205354 391543 326121
24521 326121 231666 270249 257458 249147 200464 77284 -160606 -189069 -105977 -62219 -170543
24510 -170543 -197388 -166239 -307825 -144048 -71245 -64811 -116363 -274712 -456240 -306199 -215119
24499 -215119 -225145 -201988 -170088 -147608 -133207 77057 140467 21043 -122348 -163687 -96925
24488 -96925 -208677 -230565 -144739 -15400 3178 27071 -13878 -63606 -49263 71021 7227
24477 7227 -112980 -138756 -122859 -193496 22262 74563 142825 232011 230871 215088 75064
24466 75064 -61968 -4578 -62665 -24370 -165355 -324964 -123739 -7078 -39490 -160570
24456 -160570 -144641 -43162 51463 27451 32868 -26437 40429 87411 -7261 -8444 -106884 -3232
24444 -3232 188456 260287 118729 -60475 -42975 -12903 -17438 27784 129808 -3972 -45529
24433 -45529 -3357 -49221 45079 71504 -686 55870 -10591 5817 -20731 -92324 -129333 -183416
24421 -183416 -204853 -231744 -46980 78702 91501 139327 26945 -4314 -2803 27309 77281
24410 77281 117803 93086 190755 387947 364336 95444 -76929 -94576 -29112 59425 -104616
24399 -104616 6242 155190 152432 62824 6726 26330 -21222 -250369 -252728 -187403 -85054
24388 -85054 -78553 -87561 -65683 -164025 -77707 -105237 -80429 53370 67839 65012 18372 37074
24376 37074 90560 63350 -86931 -230130 -316083 -302958 -343192 -272417 -83425 -84856 -133551
24365 -133551 -127517 -197299 -113206 -102208 -53644 94896 202832 155539 -44154 -342852 -434532
24354 -434532 -325323 -146100 3571 74110 107808 102622 5376 -98037 -175906 -79905 -47024
24343 -47024 -53076 -238471 -276927 -135636 -60119 -20900 82883 38227 50213 66860 -43251
24332 -43251 -101980 65488 253525 388458 367779 167175 131493 76863 -126051 -33956 -134233
24321 -134233 -118212 69384 19557 -32118 -260129 -421456 -433616 -278942 -150139 -63113
24311 -63113 1552 60489 -2862 -116402 -74472 -145750 -188106 -278454 -215975 -164245 -176826
24300 -176826 -65276 35363 101350 214426 60077 -121978 -78844 -56653 104885 113604
24290 113604 -18169 -50637 128358 70504 79937 190376 216315 107383 150092 139115 9880
24279 9880 6224 -92656 -166401 -50932 -62845 -56418 -69285 -51565 -27437 -24331 107161 97747
24267 97747 -1711 48349 30200 201385 250703 235009 342028 314820 198434 146709 70980
24256 70980 42764 74831 56067 -17880 27658 54286 -39229 -75327 -45621 -186906 -257218
24245 -257218 -166547 -142980 -54867 -3534 -109113 -72574 65472 166111 243492 207336 142881
24234 142881 164683 187130 35689 -55736 -7940 -176262 -86782 -59101 -72370 44663 182593
24223 182593 274021 22843 -67423 -14993 6497 -116437 -151188 -73254 98304 174701 143754
24212 143754 150189 60772 -107764 -127580 -80336 -141395 -170663 -154995 -64795 202527 228479
24201 228479 179324 12264 -188688 -269433 -217798 -159233 -88022 15913 69924 -92975 -217610
24190 -217610 -267523 -185468 15084 115449 170628 161032 159825 63582 156245 168909 213426
24179 213426 207125 73331 -138591 -259363 -269995 -189948 -83685 105801 59677 -59562
24169 -59562 -198235 -169549 1984 45156 102843 6736 -164627 -351901 -253341 -83755 -64711
24158 -64711 -101856 -13177 -88936 -141875 -41909 73084 50055 -100485 -80227 -58087 128697
24147 128697 267358 275898 95959 -74878 -317159 -292049 -274961 -350214 -483390 -383517 -58934
24136 -58934 9840 20286 2042 113584 187345 137526 266563 253789 322604 244710 198193
24125 198193 134861 -129298 -152814 -142570 -139469 -242549 -416796 -506733 -484580 -352297 -166547
24114 -166547 18521 80478 112968 183205 -16019 -32159 -124628 -164472 -278590 -370948 -163680
24103 -163680 -69984 -17175 -1734 -56895 -9614 -57612 8256 23313 59242 87493 -36945
24092 -36945 -102608 -79076 -103706 -189561 -96193 -123444 -175629 -19742 89252 64547 10892
24081 10892 66142 41963 -111629 -177153 -26473 99498 164529 -34476 -189065 -235669 -266931
24070 -266931 -156179 -245972 -304818 -355028 -202007 -105598 -90017 -93658 122722 225515 -25021
24059 -25021 -247630 -292355 -267361 -312870 -186061 65141 246564 75113 -95637 -264488
24049 -264488 -198042 -33223 63029 10970 -126105 9444 53059 -61984 -140756 -128733 6811
24038 6811 236085 154663 34561 -63217 -68459 -134702 -70927 -2053 -134379 -330025 -226505
24027 -226505 52064 -13853 78056 120134 249841 278708 295995 232034 201939 222551 191200
24016 191200 105980 23295 102465 -17809 -142846 98949 169699 57507 -31141 -271922
24006 -271922 -204151 -116580 59661 34887 -112544 -218704 -160755 -148034 -125556 -94661 28841
23995 28841 124596 22077 -119380 -165169 -188111 -149865 -187644 -179549 -21744 -10439 40026
23984 40026 14932 -63816 -132671 -48728 -113923 -125905 75770 172956 150152 -25319 58325
23973 58325 111808 72411 136747 201920 174033 123693 151403 174368 137546 111970 -23672
23962 -23672 -71412 -175483 -220691 -198648 -257509 -82681 112954 117469 147569 170009 129168
23951 129168 26212 -59384 -79311 -166539 -214984 -131515 -111619 -86028 23429 -24281 -161755
23940 -161755 -94590 -3320 92634 37226 17618 -10618 -168294 -115853 14296 64694 -55935
23929 -55935 -71625 -29693 -5995 57991 37574 -98421 -185457 -120682 -80284 -46813 -86253
23918 -86253 -55444 -37521 -31632 -64822 -8663 37162 -195109 -313279 -265251 -293636 -319392
23907 -319392 -324555 -363318 -435036 -187685 -131802 -26710 52083 76197 146388 238954 112242
23896 112242 257519 217460 35864 -236977 -394364 -183909 -217891 -344104 -223707 -260103
23886 -260103 -310977 -259792 -181948 -262839 -145493 -71098 24444 33723 -97437 -106651 89685
23875 89685 17010 -63444 -76676 -24389 24357 66385 73831 -30218 -39402 142402 155506 187421
23863 187421 118665 -25683 -80319 -69813 -45378 -30283 13048 27341 171519 269219 159459
23852 159459 14823 -9348 -54468 -86470 95371 160423 72331 -23237 -115651 -92682 -170731
23841 -170731 -216205 -21805 -198578 -414296 -248440 -60585 -223805 -264233 -150255 -65154
23831 -65154 -923 -51264 -264287 -288408 -198760 -8795 -76207 -278597 -365421 -249273 -207215
23820 -207215 -255033 -267619 -119224 -34849 -254658 -167515 -142782 -195186 -159746 -161150 -111449
23809 -111449 -118065 -196 -44394 -48274 26495 56145 -2462 56961 161747 88687 -38403
23798 -38403 39480 49824 -13460 3692 -26340 -162741 -93165 -53219 -140811 -181220 -152880
23787 -152880 181524 335517 407528 322288 40266 -190892 9314 24362 -69801 52403
23777 52403 20314 -64645 -116144 -171934 -131356 56923 -92714 -133052 -49824 107857 284433
23766 284433 234765 10195 -148953 -204131 -231566 -283004 -187314 -206162 -200686 -187235 -90691
23755 -90691 6747 -2136 -21008 34921 176819 218703 102655 -24281 -22786 -19872 8019 -1228
23743 -1228 59678 185722 95529 -106650 -77006 -47956 -61846 -144668 -89956 -9744 41981
23732 41981 79767 139245 50064 75472 18899 -174518 -252362 -270949 -181930 -99210 9061
23721 9061 192397 133375 100390 -43764 -117868 -45605 -36231 -82237 -38950 -94055 -64194 13507
23709 13507 -71902 -87772 -62200 -127819 -24727 -7989 -112462 -108151 -202113 -219323 -56411
23698 -56411 31695 -120613 -189609 -272313 -298026 -220589 -22880 80352 113294 165939 140801
23687 140801 -77131 -24956 109307 198458 363749 335534 228933 120867 197548 149021
23677 149021 96532 212042 76425 77552 190611 79379 15127 65941 23914 -143033 -151440
23666 -151440 -78880 -92122 -271570 -161766 14387 111775 -66191 -184270 -95943 -82212
23656 -82212 59256 69208 182620 234268 129738 125835 -10292 -26332 -126720 -138146 -48907
23645 -48907 -109011 -132297 -215058 -149355 8346 141371 152137 123917 162643 241379 209923
23634 209923 82259 92817 38637 46226 3386 -63735 -179361 -187111 -82668 -69002 -32807
23623 -32807 -53834 -146795 -242641 -129498 -101122 -60836 69683 -17096 -47754 89596 -119012
23612 -119012 -212609 -108246 -124467 -27369 -199359 -218512 -168101 -44074 -13262 -103804 -182458
23601 -182458 -308703 -198369 -101305 -51653 5105 -28583 -119968 -174485 10921 276491 323660
23590 323660 292678 187771 47816 -63883 -56403 -227409 -92334 101104 205731 305277
23580 305277 218417 42196 -24619 41879 31490 18936 85958 168275 115277 -66071 -68167
23569 -68167 16579 -36912 -16787 67451 118107 55526 -7872 106392 214214 131093 -31156
23558 -31156 -185000 -293345 -317279 -232309 -188172 -74754 2287 -16007 139909 39157 -162332
23547 -162332 -154905 -183187 -96701 28415 88968 157938 138912 154553 -63207 -167175 -71907
23536 -71907 43392 71967 -135685 -98655 24168 219353 205732 208938 106376 100087 112114
23525 112114 -50349 103756 82975 30585 125908 50088 -76416 -318480 -363186 -253812
23515 -253812 -39504 -104989 -141437 -130085 -60798 38596 1835 -29409 -48113 -61045 93122
23504 93122 89070 101590 -93581 -170521 -77841 -147088 -48300 -178523 -88077 -69712 -37499
23493 -37499 65234 -65669 -92457 -39657 -54125 -155065 -223872 -182385 -128727 -128673 -1514
23482 -1514 159307 109246 181145 64520 -95845 -114071 15084 -66000 -105106 -168918 -123360
23471 -123360 -123908 -222529 -46921 -206568 -294470 -235469 -166214 -143189 -134999 -191299 -339617
23460 -339617 -230037 -18347 -24629 -145320 -378018 -373292 -288381 -384517 -587980 -509680 -492016
23449 -492016 -454104 -470311 -373587 -312505 -310285 -214514 -160754 -198439 -163032 -63864 -12198 149950
23437 149950 114938 44374 36301 -6951 -34117 11587 62397 43713 80901 214200 195640
23426 195640 159130 87963 2514 -117172 -174567 -319736 -391966 -391331 -302671 -84669 28505
23415 28505 195266 201198 38398 -213525 -143330 -176464 -131573 -104494 -85668 -158122 -325310
23404 -325310 -276609 -276910 -47019 57597 46996 32407 64184 60722 32938 195714 280332
23393 280332 246250 198156 207582 64899 52036 -40887 6651 -5279 -29315 -49545 5191
23382 5191 -98447 -6202 71406 192814 130333 45897 997 -27762 -32754 -131541 -139028 49503
23370 49503 -69084 -204195 -246627 -257776 -204798 -147725 -245496 -266178 -76972 5789 -115242
23359 -115242 -177732 -123932 -110501 -161731 -242635 -310617 -349980 -235997 -65244 -24807 -70125
23348 -70125 -178336 -179263 -56074 -135892 -96374 -22103 213699 236219 202777 165106 60865
23337 60865 -138493 -195938 -89426 -40324 -67432 -56538 -37590 -24488 76576 148518 152185
23326 152185 25025 -138362 -99790 -116755 -233801 -335114 -246661 -309943 -268021 -95491
23316 -95491 -162856 -103592 64415 74854 -102480 -117224 -55724 25870 78004 73844 -44911
23305 -44911 -82777 136023 233944 206113 258460 327449 288485 263416 177557 231596 51216
23294 51216 -15188 37546 -141058 -58011 90049 73405 82032 172774 171152 42358 -50826
23283 -50826 3884 -21210 -38778 31135 64207 166108 127894 96812 -24890 -18852 -64385
23272 -64385 -126661 -32030 79702 -64044 -123074 28840 -10155 -42034 159861 399618 267978
23261 267978 215375 60981 9100 -23850 94203 85714 31035 71346 52519 -108578 -158083
23250 -158083 -165829 -70313 -17982 104707 277819 159737 -118892 -104939 -18104 -62053 -145552
23239 -145552 -217797 -195505 -111380 -54251 -46289 -58532 -245104 -276069 -278495 -220091 -228920 -180740
23227 -180740 71 55384 -40774 -242735 -185314 37571 220470 104164 90651 91857 29494
23216 29494 -74531 -21461 151653 137596 244582 298415 229005 -38558 -46553 60506 73480
23205 73480 62603 10621 -133951 -77050 -128838 -200514 -34650 127254 133003 52495 83758
23194 83758 133132 153621 109937 43072 -86029 -241527 -225275 -122050 57392 -13061 -135637
23183 -135637 -203482 -70191 36602 -68165 -158538 -115061 -211514 -161550 -106948 -75170 -213505
23172 -213505 -204067 -112655 -47604 11280 -81202 -88194 99658 263575 259636 215762 205564 99615
23160 99615 -68463 -55946 -68310 -22284 97972 80765 79110 127147 121309 29416 36140 125150
23148 125150 167365 70946 -128400 -176976 -185188 -245496 -197949 -17256 -26031 36903 217147
23137 217147 164681 109905 -69328 -277154 -339208 -338143 -316307 -230763 -178669 -216008 -198755
23126 -198755 -293102 -289624 -147281 -141395 -146955 -226015 -319706 -225019 -212709 -85862 142 87263
23114 87263 28825 -117612 -169268 -65055 17037 50027 -25 63564 -98738 -124586 -90379
23103 -90379 -122799 -182594 -130528 -131164 -74859 -76026 -50841 60456 173120 96747 -166117 -224037
23091 -224037 -274079 -138746 33194 69936 203811 148424 151466 11017 -15586 106600 138671
23080 138671 -43657 -41621 655 -98982 -80100 -127056 -43653 -27476 -45696 -15507 6066
23069 6066 -32665 -75872 -108146 -203568 -229410 -316857 -279874 -256826 -134981 -41357 -30522 -225076
23057 -225076 -170682 12424 -18948 -119137 -44407 47249 74560 142367 252145 254495 294527
23046 294527 241598 182038 143557 89855 1539 -54075 -57735 -86383 6096 72230 297337
23035 297337 252405 148251 61262 -33343 -93093 85137 282520 344173 312758 188227 305267
23024 305267 279657 34069 -134695 -127828 -239101 -185204 -168611 -39324 17651 -54605 -115919
23013 -115919 -166603 -4056 51892 22919 -84442 -157233 -208738 -24069 -42871 -87149 -48889
23002 -48889 -86343 -141280 -45917 21286 -54437 -99494 51374 169969 102727 24335 32662
22991 32662 -43298 -70196 -142050 -277080 -168587 -186589 -49437 35247 -64448 -199887 -150660
22980 -150660 -83865 -272623 -425561 -297307 -56305 43802 -49685 86095 150130 134013
22970 134013 -20220 -81998 28642 50102 35642 69738 29734 -40021 19187 -149753 -232439
22959 -232439 -130422 -120429 -173276 -244307 -186471 -153734 -197478 -313928 -246389 -283872 -446297
22948 -446297 -433680 -198955 -16218 110578 104382 73476 43316 86477 99643 47351 -40589
22937 -40589 -96703 -133140 -168638 -90595 -215374 -264591 -320140 -294347 -91696 62743 51349
22926 51349 105949 224058 47072 -232379 -173741 9756 -13690 -130311 -190312 -145653 -56846
22915 -56846 -5776 -135276 -132203 96406 125283 103509 59495 173794 87358 54219 -48233
22904 -48233 -30121 -91041 -144118 -41543 -81701 -174637 -136088 -21333 -101113 -216641 -112073
22893 -112073 49530 124323 239000 295070 307824 232123 266298 209377 170674 170858 60166
22882 60166 18601 13173 -98597 -155370 -254511 -288427 -216999 -271175 -339207 -236830 -226599
22871 -226599 -66605 91592 -138305 -280798 -117283 -79266 -276442 -206581 -186369 -139855
22861 -139855 -95313 -130455 -202985 -119499 -4331 71342 151696 136652 -22145 -110356 -16358
22850 -16358 110286 271827 169005 23686 -170705 -134137 -210464 -47286 -89091 -176734
22840 -176734 -39158 -73729 -65107 -11107 -73714 -166846 -165866 -180814 -113617 -171877 -230682 -9701
22828 -9701 139336 139682 11977 -63850 -78007 23850 -75917 -169724 -164750 -188460 -305153 -258021
22816 -258021 -201791 -249687 -317657 -294885 -105815 -87319 -167127 -120187 -70728 -66666 -94954
22805 -94954 -264028 -343715 -195216 -13808 127118 51476 -46316 -23544 -72929 20279 288907
22794 288907 263040 121457 54532 90036 50965 64130 95741 3917 47922 98600 154899
22783 154899 194783 370538 176948 73788 284602 322076 228499 149162 32819 752
22773 752 118377 113055 13664 57543 94179 176805 110149 -40989 -22971 87884 85846 75895
22761 75895 17841 11878 101908 125796 178837 124734 -2360 -120606 -73458 141229 84395
22750 84395 -41192 -16037 72901 14728 51066 -76338 -160454 -101108 -154669 -216584 -153380
22739 -153380 -268293 -306622 -173677 36086 168455 233887 160335 239382 110667 -49056
22729 -49056 65901 99324 205535 202272 47048 58512 106429 32369 -132258 -233647 -299033
22718 -299033 -441757 -479546 -321508 -192035 -253675 -234693 -199092 -161441 -137677 -79190 -54992
22707 -54992 -186221 -318666 -397969 -251113 -88897 52684 121276 152404 -73441 2759
22697 2759 56256 16673 154491 -18323 -60529 -25756 -212139 -158717 -24764 -137870 -20782
22686 -20782 -77706 -117727 -22316 73091 -84403 -132124 -133116 -99231 -86728 -20192 9993 -102432
22674 -102432 -33677 -117320 -257655 -284767 -76603 -36543 57006 15451 -168092 -199046 -150117
22663 -150117 -250864 -301212 -341497 -360126 -208558 -109893 -45954 -116202 -91523 -136376 -234995
22652 -234995 -246596 -319858 -291154 -89529 136415 171991 158040 73181 -48981 -147818 -188256
22641 -188256 -180422 -128718 -48292 -99382 135984 111312 -220478 -233129 -212795 -186394 -141331
22630 -141331 -153822 6119 -14969 -122580 -228022 -109834 -58139 -50857 15962 -40513 -12199
22619 -12199 36872 -71583 -115029 -69197 60232 9254 127840 171846 193444 180596 79722
22608 79722 -23038 66344 134570 170754 -93098 -123102 -189356 -156425 -104406 -205820 -159535
22597 -159535 -107912 -22552 3555 47237 64524 -124366 -310669 -138900 57809 -51466
22587 -51466 -157942 -84167 -133677 -157461 -167153 -189375 -104562 65383 -58982 -91175 6600
22576 6600 -111304 -72321 42024 141289 67540 99492 142245 -22339 -217050 -115324 43196
22565 43196 -114520 87825 281690 103752 18716 -165089 -223487 -117824 -28707 -150666
22555 -150666 -48725 9099 -114348 -208836 -211922 -237535 -185820 -28448 -49983 -126774 -27402
22544 -27402 -21333 -37002 91206 170805 200134 57456 -105721 -132318 -46492 -110378 -334303
22533 -334303 -414741 -79768 185708 107133 -47458 60533 227617 223828 120850 61302
22523 61302 -151030 -231210 -128991 -137097 63139 73597 107894 255163 257194 237802 -25058
22512 -25058 -39938 -93439 -68072 -91919 -6816 13587 45898 -64019 -31066 56250 4988
22501 4988 -73652 -199476 -206925 -93659 4420 27655 106577 232649 281701 199766 134465
22490 134465 159507 131861 32008 -103838 -220892 -235382 -68310 68760 97703 16634 -32324
22479 -32324 -17845 70459 134056 130354 64311 120146 94659 30554 36991 169800 146181 48026
22467 48026 -67052 -126979 -190717 -149809 -92426 -103804 -44957 3493 -228881 -308448 -200013
22456 -200013 2016 30203 52175 101023 -37876 7196 63949 114814 -13539 -23388 -66204
22445 -66204 67567 145916 159866 125924 31527 -98796 25278 190415 117580 -16116 -92075
22434 -92075 64750 46522 -56403 -101683 -231817 -337818 -367574 -296244 -247670 -139117 -1608
22423 -1608 -25641 -57748 -97054 -99047 -203306 -105548 64237 -106093 -236963 -409554 -319487
22412 -319487 -139895 -107339 -17646 -38960 -160214 -36356 -28235 69892 47070 -217189 -289290
22401 -289290 -80321 107086 105791 43423 -57123 -75892 86630 30248 -102816 -262326
22391 -262326 -125318 -20216 80310 96008 36916 -15086 -96969 -91013 -70600 -166993 -143881
22380 -143881 -152765 -232505 -246119 -118977 54329 16465 -164755 -145563 -150313 -49884 128283
22369 128283 173356 41267 -4197 19392 75166 86332 20726 -159682 -212202 -152718 -56018
22358 -56018 99401 19167 -47042 -143766 -208551 -258145 -103253 65431 115798 -46968 -130410
22347 -130410 -218760 -291216 -171145 -79811 48730 152082 74785 -46224 -177675 -151442
22337 -151442 -59094 -64839 -180002 -312483 -235411 -58883 -161420 -242622 -283574 -275461 -309110
22326 -309110 -232928 -26102 91056 2652 -106077 -109112 -46896 -60155 -272086 -198494 -19967
22315 -19967 57708 11899 -80745 -230153 -160269 -20739 42917 -37985 -97954 -148722 33703
22304 33703 18316 -97995 -121931 68440 180070 44828 78364 65342 53923 -2261 9677
22293 9677 -96120 -110987 10895 159212 146069 146393 75496 105510 13863 2396 -32336 -123402
22281 -123402 -240290 -305597 -87772 58265 -150335 -165462 -104639 -70330 15784 -72742 -125699
22270 -125699 23511 85174 231373 156809 -15044 -197881 -137108 -103135 -6285 118097
22260 118097 -49079 -48097 -71627 42846 -8452 -114012 -224740 -165447 44819 175244 255988
22249 255988 98871 24903 -60630 -5082 -110428 -49641 106806 155353 99525 23554 -15813
22238 -15813 -129293 -125280 41524 183877 74674 87469 78945 28547 38740 41618 216624
22227 216624 145133 -7596 -26918 -74753 -80008 -44685 -91515 -254583 -137838 -23640 29046
22216 29046 4786 -14576 -134432 -67198 -146802 -75486 164422 402364 374622 93880 -37530
22205 -37530 -87501 56111 88945 109014 156375 232006 56376 -23630 153734 126343 177119
22194 177119 20264 -181871 -322905 -142670 -33753 -6652 169939 39911 -194954 -383813
22184 -383813 -283284 14277 77751 124866 174404 157173 110423 261016 285240 208642 302719
22173 302719 92687 -7311 -32934 -1391 46662 49965 -75547 -152432 -32615 98885 25140
22162 25140 10921 88388 187603 163745 -26451 -220140 -150460 -120837 -233125 -193686 -183498
22151 -183498 -106868 -22227 42217 -151955 -193525 -232718 -194498 -229460 -355068 -355379 -303538
22140 -303538 -314296 -332917 -263391 -267924 -449279 -298614 -132907 -125985 -83094 140939 229095
22129 229095 111976 29068 -37558 -201244 -577123 -702371 -475260 -346423 -152041 176241
22119 176241 241981 167119 89074 97821 -26556 -39532 -88236 -20273 35082 -37566 41735
22108 41735 -31 54141 332080 271401 260270 295818 218416 98487 106287 109187 56548 -39873
22096 -39873 32686 117205 114643 -109666 -208343 -205577 -158681 -203293 -7364 5810 -18919 -177084
22084 -177084 -294772 -298516 -131017 -188218 -276932 -330456 -205857 80953 229467 297048 322502
22073 322502 200181 128888 -46849 -5398 43042 94155 157766 -164916 -339605 -291716 -273065
22062 -273065 -209741 -92110 -93842 -103330 -16805 -63278 -123404 -345363 -462243 -357705 -230501
22051 -230501 -204983 -98997 23695 130080 77149 69160 87117 -91852 -194210 -149608 5551
22040 5551 71253 67618 56147 30946 108209 120517 107144 20469 -71702 -148627 46856 250181
22028 250181 292965 305203 330437 351424 184896 109532 -35353 -65130 147606 230014 163271
22017 163271 119446 282542 321618 148357 5539 -24215 -78069 1977 -16817 -66287 -175791
22006 -175791 -166021 -147554 -224598 -95872 180899 234752 178499 122441 -33463 -93706 -47232
21995 -47232 -85769 -111963 3305 50499 -135013 -167709 -132269 -76346 -33330 141590 286136
21984 286136 276641 301833 182149 237531 200127 153161 88356 103562 94952 -199735 -73963
21973 -73963 -11841 -32979 29526 35903 -17843 -80584 -35376 -247650 -474116 -430900 -300968
21962 -300968 -20459 240282 112697 -4946 1062 54652 165008 71837 165595 125963 74740
21951 74740 -35977 -171587 -273099 -319838 -282316 -231242 -195532 -122924 -215168 -204167 -160688
21940 -160688 -61834 -98749 -64594 -103050 -157765 -112097 -190579 -257505 -158128 -191011 -169335
21929 -169335 102053 126357 81461 162916 88246 -61805 -127847 28613 86323 34307 -36916
21918 -36916 24219 128126 168179 92024 -3804 25362 -24233 -11337 86660 101303 33888
21907 33888 -15294 -53615 -67543 -95496 -86339 -37880 1476 -25129 127971 284679 37329
21896 37329 -65977 137565 92041 38666 -50918 -107048 77087 125951 71804 59613 142480
21885 142480 33674 -31918 -91595 -225919 -149762 -79675 -89297 -231054 -384442 -309918 -380676
21874 -380676 -190804 -150490 -275235 -363102 -435322 -218421 -149885 -275736 -237695 -186547 -224576
21863 -224576 -230948 -256734 -124966 -199738 -116105 -49043 97494 304503 199880 -100493 -151059
21852 -151059 -104191 -65920 29456 19882 89425 82083 105096 -28103 -5675 -11709 -2005 -11257
21840 -11257 -24677 -126771 -392771 -519790 -170904 -92602 -219782 -50665 -21653 -36136
21830 -36136 -111636 -218800 -283629 -324096 -147087 -10128 71210 53051 -31725 -159038 -267789
21819 -267789 -378338 -441239 -389859 -422714 -398809 -253126 -68844 81034 151667 138986 -1096
21808 -1096 -199685 -403471 -259642 -123460 -276515 -388389 -285632 -148879 -69938 -107583
21798 -107583 -252129 -192815 43830 171583 1853 -67216 -99765 6681 -16698 -99643
21788 -99643 -176723 -196818 -235500 -253455 -277611 -206819 -352609 -276818 -131991 40794 -53752
21777 -53752 -127196 -156393 -143094 -172266 -80904 -145261 -189966 -38960 -57742 65208 2049
21766 2049 -162758 -99331 -204611 -353164 -360854 -251203 -203819 -348908 -383183 -432605 -275639
21755 -275639 -255043 -219498 -194057 -146475 -144828 -10104 133554 159559 -34377 -126794 -70224
21744 -70224 15007 61794 37937 108002 -3990 -481 -61099 -109303 -29346 -21474 11713 53877
21732 53877 23607 -30791 16740 35729 148852 -35854 -120910 -120626 1184 36263 -173199
21721 -173199 -186797 -188255 -112749 -73746 -133042 -147486 -46621 54464 50126 95941 -53543
21710 -53543 38961 16886 -112537 -129578 23650 -57022 -46694 141309 122975 92026 -11165
21699 -11165 -110228 -177805 -305476 -325790 -340642 -186847 -204970 -362028 -357667 -168992 -90050
21688 -90050 -241381 -345036 -301047 -38159 -9257 -22728 -134812 -162405 -107434 -62004 -35983
21677 -35983 -92587 -235292 -228113 -126441 -88915 -35753 92062 93590 46549 12277 116765
21666 116765 165195 211067 114037 38830 144793 69209 -32183 -240326 -317853 -92287 23707
21655 23707 -54196 -150291 -305671 -379789 -354926 -180727 -60972 94183 197509 284258 173646
21644 173646 54507 -143053 -143007 -36793 -64715 -244456 -242694 -77650 30279 27144 59361
21633 59361 202527 284487 244582 275371 258488 187465 227929 186036 64770 -54518 -61834
21622 -61834 -55189 -191611 -240600 -212589 -220252 -111305 -59168 74424 -126195 -27963 53406
21611 53406 5078 71064 72008 -29141 103305 104426 174098 108420 163387 149792 -100154 -157506
21599 -157506 -18484 162404 225927 181534 65348 98982 114510 95130 224840 158204 143445
21588 143445 -53131 -225027 -148329 -70817 21683 -153444 -194659 -163308 -32283 12069 -31396
21577 -31396 -81276 -136635 -291260 -261485 -347674 -433821 -289956 -166810 -43197 194583 114498
21566 114498 2933 13799 -77883 65098 -3061 12028 -73431 -64559 77102 46985 4591
21555 4591 -13547 44820 -72140 -13784 44026 28960 30025 43476 -73194 -335801 -354776
21544 -354776 -108177 26439 51820 28153 91640 192847 146440 85954 -48924 -142242 -135816
21533 -135816 -228338 -177930 -263039 -243883 -376329 -374219 -271058 -271740 -328105 -180047 -62838
21522 -62838 -88317 35674 216629 170599 174555 33791 7177 123891 45231 -155833 -141618
21511 -141618 53424 95682 147008 -106710 -339371 -195282 -5562 39103 -13468 21916
21501 21916 -38663 -153249 -280441 -71152 -53325 -160136 -265788 -186551 -127281 32476
21491 32476 123798 81428 -75046 -230855 -231725 -92605 201877 327122 186224 74228 128710
21480 128710 298610 312540 231157 -51702 -158776 -31544 66734 -31661 -99256 -180477 -293531
21469 -293531 -289788 -111326 -64160 17744 -55907 -94879 -99968 29795 63311 -52641 -162699
21458 -162699 -42707 -92180 -118184 -50490 52759 16147 23873 189646 200909 104652 166417
21447 166417 231403 179227 194250 237833 293910 218550 211838 169522 108530 101347 45432 97091
21435 97091 31874 111715 264687 367004 248283 47356 81811 -97275 -92972 -17779 87734
21424 87734 257362 144905 13578 -81891 -70661 -20744 -32780 151186 70789 62219 67158
21413 67158 -36820 -93932 32590 202765 167406 240880 182353 17702 -8036 58290 211195
21402 211195 266617 40338 -19542 -34900 -122291 -37245 1155 58536 146484 9103 -47184
21391 -47184 -154771 -272395 -115148 -9169 109100 -38310 -141042 -76863 -35125 35728
21381 35728 -6688 -86883 -236352 -320707 -155826 -99957 -259929 -324346 -304402 -186260 -180628
21370 -180628 -24437 46182 -111511 -130167 -60112 -267801 -409974 -188384 -116890 -184506
21360 -184506 -159467 19266 46764 57410 -83538 -77758 -103280 -193181 -216366 -83605 -90179
21349 -90179 -37839 -106317 -192159 -10132 -34265 -158685 -65130 -5726 -60371 25036 134239
21338 134239 133790 -20183 -24006 35336 51332 105337 179234 248347 174189 156466 181219 -107179
21326 -107179 -234017 -150596 -38120 24311 -2202 19527 49717 132866 129721 6698 43997
21315 43997 213900 100384 42506 11472 15103 169717 145657 64503 3258 73243 118131
21304 118131 89343 270017 318548 174388 131342 166027 14136 -81909 -77044 99712 53909
21293 53909 46813 10024 -127573 -191634 -211000 -164958 -123992 62957 -35055 -255176 -146273
21282 -146273 -35331 5138 39472 -36205 -20581 -5367 -167610 -109945 -46326 -69866 -47093
21271 -47093 -61187 -111623 -66774 132342 210350 170187 113848 5341 -28012 70518 60781
21260 60781 104514 165335 -61822 -188735 -13996 -89966 -119257 -29280 166863 225657 44890
21249 44890 -99771 -111386 -55335 -108435 -118771 13997 45635 -153038 -247111 -150331 -204156
21238 -204156 -172889 -67283 -28673 12657 -153939 -216910 -280468 -269493 -171483 -123949 -146156
21227 -146156 -86697 25529 -118889 -61965 -76651 -54473 58550 -9690 -140811 -229367 -117412
21216 -117412 10428 42420 34839 40097 82690 237742 192170 140117 -47359 -77888 20047
21205 20047 188631 92881 45649 14696 -54368 -19949 80230 130412 41702 -126824 -44557
21194 -44557 -65694 -85350 -51339 -112719 45439 251192 181167 -50992 -261428 -315504 -306502
21183 -306502 -278424 -196971 -89665 949 -90310 -66159 -143002 -111173 19755 97655 65112
21172 65112 124440 135064 65665 -91136 -258928 -306307 -107739 7653 29449 78416 45816
21161 45816 -4541 207382 313591 165742 -57298 -125470 -167454 -240498 -152905 9791 46210
21150 46210 62484 -124463 -124941 -178539 -125733 -76258 -143159 -180381 -98370 -62740 -12579 90595
21138 90595 6739 -91625 -43950 -60120 -58770 -5869 -49606 -16714 77061 170750 148666 196302
21126 196302 74269 -68724 -69491 -6225 9885 57372 -18144 2405 32721 992 -33855
21115 -33855 -147622 -252145 -272107 -181186 -178015 -73345 -205246 -129660 -176904 -172726 -80157
21104 -80157 -174819 -248545 -249473 -136603 -133075 -96683 -81682 -73187 -168764 -203292 -264321 -293527
21092 -293527 -208639 -153670 -66847 17332 84079 122196 103677 -2318 -75465 -53840 66297
21081 66297 34413 -45866 -124557 -172228 -28529 170043 175239 -6450 57846 249659 346960
21070 346960 154638 -51217 -103034 70559 94869 118242 91671 61854 126449 93579 -93719
21059 -93719 -208608 -60072 -97130 -61394 54977 116479 236635 184858 153420 17138 -144696
21048 -144696 -183015 32596 260531 185750 145707 52236 -74878 -50331 -535 -141513 -358701
21037 -358701 -405343 -398085 -370432 -202681 -39346 -171161 -171089 -274360 -336460 -242258 -154593
21026 -154593 -184211 -78736 -90885 -94942 -32386 -22243 -4376 87208 86908 -78019 -119441 -155119
21014 -155119 -219181 -387062 -453596 -441368 -245641 -188547 -161394 -173241 -138295 -156921 -95313
21003 -95313 -93989 16381 97904 76157 18871 -60270 -99285 -102191 88637 148017 39389
20992 39389 -81406 -141368 -179248 -83886 -46898 13728 66732 31851 -21674 143736 87142
20981 87142 -104538 61904 103683 207630 181770 196840 135766 130815 231638 270169 102459
20970 102459 149201 163856 110185 35902 64352 50032 -78417 -70533 -139134 -126839 -121734 -133130
20958 -133130 34849 -7798 -137158 -56937 135920 71407 -120577 -312395 -153318 -41234
20948 -41234 -36034 1262 24031 -23183 -154810 -45141 25572 -113814 -105154 -124646 -73823
20937 -73823 5383 82401 19374 -16855 -69165 -14084 81759 39151 -61835 52941 152937
20926 152937 187523 301938 247284 88249 5169 -128554 -226600 -53880 -34772 2456 67057
20915 67057 -15788 -128914 -147896 -94562 -45518 -42720 -65261 -162196 -242672 -123731 -143653
20904 -143653 -63991 -21816 -46214 -42347 55480 134996 53215 -71416 -106705 9570 43896
20893 43896 -68528 -188753 -59247 100460 133656 55323 -13648 -134580 -153806 -205292 -75519
20882 -75519 -5864 -29043 -40733 99466 41553 -32141 -143635 -52122 3762 33004 105652
20871 105652 40974 -9328 -31912 79818 -78011 32018 296604 244740 103477 -99291
20861 -99291 -230143 -149960 -222414 -149022 78140 -16263 -40182 99334 164805 177546 57893
20850 57893 95074 34651 146911 246756 128843 688 -36957 -6593 -168315 -150982 -87197
20839 -87197 50601 -26037 -160493 -141166 64441 164268 253440 247841 170598 102192 -38930
20828 -38930 -107387 -82565 -152447 -19988 33607 -58352 -163098 -132052 -39870 42841 32303
20817 32303 16606 -44631 -36051 -173977 -166171 -136528 -288225 -249511 -164501 -121975 -174701 -257624
20805 -257624 -217545 -249773 -193644 -125409 -100819 -51085 -100726 -238532 -265782 -223130 -178810
20794 -178810 -79046 67972 -7946 -63132 -53291 16932 43489 145321 -37300 -82022 13491
20783 13491 -111893 -184382 -143002 -224349 -205514 -137045 -113769 -179513 -299171 -289267 -234332
20772 -234332 -246081 -210380 -51299 -136098 -286838 -221726 -93734 11136 5127 2603 10444
20761 10444 58366 131455 38619 -73358 -112041 -226684 -202851 -7362 19502 -143995 -191667
20750 -191667 -113455 -15941 -36725 -27873 -59424 -137481 -186368 -64564 -158599 -83786 40289
20739 40289 159377 41347 -111564 -55539 91880 109017 46848 7140 -28283 -99977 -141401
20728 -141401 -90747 -63772 -198153 -110116 -80135 -69952 -63592 -223278 -200755 -179466 -137424
20717 -137424 94840 210250 161825 129199 202420 99457 108973 136936 21464 -206358 -317288
20706 -317288 -217011 -207014 -85288 29468 50260 101657 196784 271122 301821 173209 78574
20695 78574 115760 240141 205324 113495 184604 268298 197068 228118 101592 169164 303343
20684 303343 175376 258 32622 162470 113433 165632 349124 255261 -66009 -77473
20674 -77473 49088 58449 -38819 106639 222596 166003 22087 -42346 9852 59961 47797
20663 47797 -76931 -90099 -74398 84012 255491 114258 -52308 66349 117482 256694
20653 256694 286146 152848 91164 101965 177938 183435 -58468 38004 66505 76608 -118738
20642 -118738 -162419 8612 110847 152075 275681 143063 -22619 -103386 -43791 69922
20632 69922 76894 7046 -101458 -191586 -108304 188180 291812 209628 164416 42922 121901
20621 121901 167442 265153 338093 324501 318373 173725 134906 119340 23046 17657 18997 -61701
20609 -61701 -52128 22293 238362 326090 281914 327782 247650 198291 155442 107760 30588 51121
20597 51121 93463 -25623 24195 147782 124024 53414 118520 126254 8571 -23977 -88165
20586 -88165 -210848 -91297 19134 -3366 37717 124502 202329 148290 76028 104415 180577
20575 180577 231992 196220 177114 118664 -19551 -70970 -68421 73883 186071 220272 114249
20564 114249 58418 12801 61998 6712 -209525 -227868 -279358 -258322 -200358 -141416 -47270
20553 -47270 100472 87360 -149567 -300903 -219671 -369412 -414558 -256179 -40376 -17423
20543 -17423 -23851 -5550 68213 92530 -49230 72106 126529 75631 -33857 -49701 226364
20532 226364 228213 166473 132505 50832 72192 -107436 -99258 -68360 -93928 -122826 -104642 -293226
20520 -293226 -278110 -234583 -226353 -129244 -59882 -90691 52052 206546 171903 106320 49712
20509 49712 341 -68365 -16621 -19376 -40118 -44189 18641 153946 119019 -39564 -220567
20498 -220567 -299886 -296165 -109830 5626 -98288 18346 88949 -48078 -254563 -340541
20488 -340541 -224606 -41515 -26562 104415 110048 -17200 -99391 -101042 -15490 153404 -21847
20477 -21847 -98733 -4049 618 164513 84599 -1101 -610 -37749 -145513 -194052 -109455 46934
20465 46934 -9563 -48384 -46158 -10758 -90086 -95744 -30062 -222920 -282544 -143800 -123694 -259060
20453 -259060 -331848 -345552 -239269 -158175 -90704 -54159 -94538 -126762 -13722 85563 57445
20442 57445 18657 -48877 93986 212677 -48804 -286313 -160624 -174100 -232849 -101986
20432 -101986 13580 102712 227951 112728 -104644 -190581 -138260 -147842 -258701 -224518 -214490
20421 -214490 -134097 -100085 -71120 -5352 67273 234411 106227 34358 72606 205875 152469
20410 152469 -90394 -343898 -186347 -69299 50183 -28489 -87283 -261910 -237594 -196334
20400 -196334 -183524 -132774 75686 231007 318399 16886 -117619 -133911 -144434 56050
20390 56050 151523 83223 -51838 -99469 -128544 -17915 -12023 -12769 122034 280673 232401
20379 232401 -437 -35283 18574 -74150 -109536 -68432 -15040 81455 143598 38603 -153022
20368 -153022 -241122 -244050 -408980 -295052 -87148 120350 65752 -80295 -15104 168716
20358 168716 54095 -56337 -75527 -70874 -14838 13000 58884 272052 187799 53850 -80851
20347 -80851 3396 73271 168156 14250 -132125 -166548 -231065 -102527 33333 172219 117705
20336 117705 162335 318835 203611 116347 3037 -19127 138153 120758 80395 -136982
20326 -136982 -254293 21622 -50663 -98166 -14989 -25097 -48696 -101802 -149745 -51614 -16852
20315 -16852 -127858 -80222 25720 32759 -79829 254090 285674 23361 184213 233593 200762
20304 200762 280276 125299 115500 118690 33704 10025 76869 29614 765 80402 50298 -182725
20292 -182725 -157092 -29640 38991 38076 35631 23441 -10951 43814 136707 282942 272794 94997
20280 94997 94085 77172 178671 120412 22795 162996 171435 261614 418833 384965 232425
20269 232425 113920 82401 131366 -472 -181079 -135233 53737 209140 134950 2764
20259 2764 -61527 35664 94706 129556 146475 54723 190334 94781 375 -8035 -18129 -40422
20247 -40422 -68082 -124729 -63320 -32002 -51581 -26694 156853 168945 50932 -65090 -204291
20236 -204291 -86724 -134813 -288108 -286566 -291938 -161532 -92222 -105136 -54601 -62407 -17478
20225 -17478 -7525 212908 315236 95304 -123734 -128967 -59216 -185191 -132526 -36982 101658
20214 101658 193042 225184 191070 101462 63270 25964 -97950 -34160 -46333 -98470 -35459
20203 -35459 97507 29860 -33557 -118160 -270073 -343152 -332855 -189564 103 126576 194699
20192 194699 115716 -48682 -26709 -77078 -123638 -167844 -185995 -232535 -119056 59860 57217
20181 57217 -24718 -47242 5343 69071 -13914 78803 47618 68595 298340 215930 161115
20170 161115 141282 97248 128555 98137 28137 68802 98011 30902 54761 181132 65284
20159 65284 12058 41309 -7344 -47997 4590 -115618 -259566 -199496 -163882 -310703 -299732
20148 -299732 -156501 -63367 -31586 66772 128678 36479 -16456 98401 115837 71623 -19994
20137 -19994 7251 72243 32933 143304 166574 200055 246133 163365 19366 -28041 -23001
20126 -23001 -92352 -106310 -120408 -99235 -59826 152969 81840 -57820 -198804 -113189 129932
20115 129932 126859 111168 253332 162359 -48460 -99049 -154238 -92663 194945 280457 261348
20104 261348 356889 204716 -28724 31822 -37054 -162930 -73337 60580 46973 141168 193777
20093 193777 -43930 -98211 14877 10157 -21462 -142207 -59755 34803 103913 126806 107360
20082 107360 71868 110701 -80692 -259854 -168044 -84491 20074 68167 113364 111588 -52979
20071 -52979 19643 207735 149988 99606 157203 114454 21065 7793 28860 26678 141998
20060 141998 266675 264862 180125 199388 100779 106298 197978 260703 181425 155276 163839 155925
20048 155925 392653 404606 302141 238485 74219 87982 81309 176774 159999 54830 138080
20037 138080 98907 111158 83990 1729 42504 -54865 -88160 14961 22295 73603 203838
20026 203838 28218 -17023 83920 39086 5937 -71666 -161650 -287455 -350746 -327538 -159431
20015 -159431 -208708 -221788 -304391 -219413 -164666 -184969 -196218 -98539 16418 10083 -63148
20004 -63148 -31244 -25808 78752 231866 279607 264548 106372 25555 -23757 -220540 -352935
19993 -352935 -315153 -306286 -206164 -146966 -271571 -237036 -349501 -413616 -176377 -85589 -132928
19982 -132928 10931 -377 -162138 -251772 -276691 -246822 -173578 46202 65074 10732 -69125
19971 -69125 -57774 -9959 -119491 -107078 -57369 -91823 -190175 -181140 -146917 -94244 64913
19960 64913 154938 303187 234251 245224 308578 179637 -56802 -86883 -22640 160344 338982
19949 338982 323902 160415 165127 126776 116295 -82180 -23809 75206 138661 181280 185875
19938 185875 164392 197586 167426 107666 110751 124452 -23304 -58536 16751 69147 -35626
19927 -35626 -72817 -38323 -172771 -252072 -249123 -271000 -271207 -153662 -124625 -87035 58617 147587
19915 147587 228693 293819 271509 108453 156999 112906 64819 60833 -18591 -44603 -99515
19904 -99515 26482 120290 -90372 -285528 -173386 -37485 17693 -155388 -108407 9132
19894 9132 87989 237020 270802 210596 231459 155231 39524 -48778 -57539 -85300 -145362 43148
19882 43148 15710 -64100 -52914 -97368 -62914 35005 -16927 -8749 -47135 -83604 -136645 -210747
19870 -210747 -290854 -116065 -119138 -84797 55764 124071 153178 85300 20760 -78002 -118869
19859 -118869 5612 74085 67657 66 -77704 -170451 19193 28561 -106902 70804 71987
19848 71987 70203 88228 -162155 -244034 -237206 -244668 -36349 116077 127781 252695 189920
19837 189920 57436 -74811 -177866 -184445 -296006 -264061 -183301 9257 -105487 98457
19827 98457 291095 305747 153317 66207 55886 59758 59666 160036 256225 252771 219675 85990
19815 85990 85271 153215 148429 162647 121657 -55008 -42201 246762 301588 126779 211269 124952
19803 124952 -40679 15680 -14798 30291 108331 167355 228977 317677 332653 127081 -196833
19792 -196833 -309042 -93817 64257 100372 96080 -31091 -95164 -105461 -183403 -72890 38519
19781 38519 36450 -18754 56326 163897 147690 8026 -130776 7074 -1527 -89024 -252647
19770 -252647 -375015 -305630 -126128 139556 42959 -81723 -151728 -331379 -252640 -90258
19760 -90258 35371 92743 16860 31895 119336 109858 59297 -30036 -177316 -175140 -246103 -193433
19748 -193433 -110335 -120364 -62929 53597 -12713 -118742 -93866 -196821 -231442 -206642 -152257
19737 -152257 -221584 -201286 -118940 -213274 -179970 -165835 -88174 -69421 -150452 -82419 -42078
19726 -42078 -80345 -96614 -115261 -26811 191708 360999 533084 498159 322725 351774 164298
19715 164298 243690 344961 275552 210541 -8674 -34615 -29715 2573 -53129 -116429 -92661
19704 -92661 -33420 10813 -83221 -14006 -27946 -23469 -105882 -194016 -260875 -192817 -51747 255914
19692 255914 365913 -47010 -212125 -211183 -272873 -186173 2272 -38181 136413 204264 226803
19681 226803 227586 177529 16311 -52292 16243 140178 144806 152104 71208 55877 47249 101640
19669 101640 163487 190879 96188 210620 336588 392302 175108 142701 104548 -7919 -64493
19658 -64493 172180 226926 234890 199986 127333 102461 111556 280394 322985 425321 207214
19647 207214 72590 152859 326231 288032 302996 316845 328531 326642 376281 313289 161121
19636 161121 43389 165391 331449 421346 454162 279258 235190 218434 -51038 -144436
19626 -144436 -198402 -122947 -63661 6086 88418 142044 381025 295108 163276 10420 -73514
19615 -73514 -26699 163763 184355 121308 55314 19929 15126 140737 102644 -16457 -18490
19604 -18490 18900 8612 73577 71548 199024 230113 163944 128578 157654 114601 -64897
19593 -64897 -15796 21851 13109 -73482 32500 -41445 -124563 -102534 6681 132013 153419
19582 153419 63988 -63113 32351 41880 86427 -48752 -44105 -187183 -245994 -123129 -44553
19571 -44553 -165200 -143954 -142806 -217853 -253073 -201534 -69519 -6276 -54388 -10910 3863
19560 3863 7913 -32843 -83341 -179548 -133904 -15247 50593 106083 139471 45354 117356 107366
19548 107366 -59517 -177069 -170293 -70770 -5112 174404 74006 155278 123964 13925 20964
19537 20964 196474 380227 204606 -12584 -160315 -341967 -282618 -169198 6717 100924
19527 100924 79032 264996 353202 336720 228149 104190 194671 147995 81563 -639 -305
19516 -305 84572 133707 45049 -147574 -290965 -165190 -41220 -72825 -19873 83740 85194
19505 85194 110473 43671 146574 175429 95620 -1188 68271 178504 163396 145515 56495
19494 56495 54349 231004 263684 179436 213632 107341 -62391 -115829 -135414 -81405 20842
19483 20842 186366 120265 85877 55027 -34098 66650 144325 57483 25370 39494 292620
19472 292620 145919 -101592 -75998 -63265 128098 71690 -87886 -201264 -124668 -5060
19462 -5060 207002 235745 170697 118379 142123 172017 114852 76566 104123 52598 -40683 -244319
19450 -244319 -133915 -32693 -173119 -109223 -77815 -102892 -212336 -241491 -285727 -327457 -251035
19439 -251035 11262 109717 87825 -80141 -118938 43437 30409 -65338 -137150 -98618 47415
19428 47415 108244 103700 19027 -110583 -160017 -1261 125003 235012 143019 41581 -16807
19417 -16807 117001 145698 35167 68500 -51734 11186 111260 146638 244614 280468 235443
19406 235443 142242 190221 207916 249638 205228 105879 58383 12841 126326 133783 -39700
19395 -39700 -78734 -29706 -43709 -34875 282580 357701 133225 -16287 -142419 -100079 104243
19384 104243 50058 -104779 18723 255019 432391 484736 444734 290564 133818 143894
19374 143894 172634 16857 -265671 -226353 -204144 118728 315168 303082 160147 -40082
19364 -40082 -98735 -214531 -199870 -215913 -120508 -149261 -36617 3413 -29803 -41128 -39973
19353 -39973 -95901 -1928 31312 14293 134489 133795 192936 337918 267031 179329 127724 94168
19341 94168 298186 252106 58204 -123861 -287661 -219240 45847 68962 -97029 -182399
19331 -182399 -205906 -266960 -245272 -52384 178908 216455 215122 226602 142075 78263 233876
19320 233876 447750 452153 350166 408063 477072 404137 271271 308493 359181 226249 146841
19309 146841 54429 43217 154250 285874 334395 335678 443790 421271 356447 223092 132984
19298 132984 173465 195144 28277 -146463 -308297 -238043 -13293 -40231 5460 101581 46553
19287 46553 -6076 -73662 -82988 13440 36195 140514 114240 67265 47170 8857 72514 131413
19275 131413 83504 -29957 -59712 -103666 -197365 -82281 40669 668 -61194 25482 75605
19264 75605 196601 162147 36782 71261 212893 271097 132201 -46672 -21453 -54417 33071
19253 33071 118391 147007 -32527 -95099 13252 -80482 -151559 -107907 -20043 -72688 -110266
19242 -110266 -121733 58166 229288 35819 -115296 169503 613670 585445 426939 257797
19232 257797 88367 8563 84329 95883 14081 10353 -99288 -4596 235245 308008 310119
19221 310119 200015 112169 197878 189203 167712 52531 45614 118649 202967 239038 372913
19210 372913 416758 280220 348787 652842 618089 407745 301331 305364 359979 496972 469664
19199 469664 485162 361938 266591 305889 371011 405379 416910 364197 306432 258182 102033
19188 102033 23479 109009 206073 227459 254626 322726 198042 120080 116927 36090 112507
19177 112507 118644 15012 7341 -17295 138753 160485 -22174 171 -102512 -139782 -16937
19166 -16937 136755 134030 66430 59669 81861 9706 59439 259866 244973 147530 36744
19155 36744 -46408 83641 109349 49867 36069 49958 118814 56049 59776 36604 -38564 -78779
19143 -78779 -70422 -61402 219825 279841 160230 148834 46055 105227 123456 176210 201445
19132 201445 243518 125851 -53786 -82822 23372 -113494 -118805 -20976 -29541 106693 74106
19121 74106 -3748 89649 252501 326932 397503 313713 288109 207168 328354 351982 382514
19110 382514 348011 390531 367981 401171 312444 201579 160507 189338 302604 280033 239643
19099 239643 396587 426773 373307 201121 181436 215130 294500 182113 140683 143225 197236
19088 197236 191967 87327 89651 193671 193640 85113 -199336 -450285 -356912 -181451 -138072
19077 -138072 -64742 66438 106331 172945 97527 -12499 -130236 -239910 -268284 -238179 -203114
19066 -203114 -72657 54649 -13580 -125553 -20869 102937 392903 393245 463149 419283 335460
19055 335460 306860 184885 49911 90701 48063 96526 194905 13624 -9727 -13391 -29940
19044 -29940 112599 340385 443743 281136 258717 284148 338775 325689 442162 525117 582329
19033 582329 511787 415911 447438 448302 401587 411337 457859 193093 103675 218435 321337
19022 321337 432388 394056 262869 305263 178869 131608 247030 429731 473031 445084
19012 445084 460672 460879 416900 470875 510932 525368 539209 557514 733923 872797 877579 779580
19000 779580 721542 667508 490617 499556 568187 728589 734249 800392 671045 502206 657705
18989 657705 722031 609776 610972 665102 725498 668896 595807 668608 796503 768193 707454
18978 707454 553602 474366 372216 252942 189012 93876 187833 380699 358052 289238 325409
18967 325409 318151 359982 530183 604073 555609 667217 727343 777582 711856 837461 928169
18956 928169 907802 797162 753652 638085 742921 878380 890707 932529 1150102 1196004
18946 1196004 1219337 1113841 890943 830833 869527 960535 1029041 1156756 1055712 984772
18936 984772 1044576 822926 688809 645962 576121 708781 806826 794599 632012 607067 670814
18925 670814 535455 376739 446204 537711 586733 573655 603810 510701 507168 290309 359223
18914 359223 487868 543979 475802 420433 352454 429271 249792 59631 275583 477904
18904 477904 698248 845113 740804 794660 892195 781613 795021 809732 891648 741805
18894 741805 696012 845179 952940 934869 882559 762827 604690 786097 959076 923548
18884 923548 885388 761449 603971 510513 606995 634238 671216 662243 588418 559495 568662
18873 568662 451200 278317 315516 409911 425059 316328 357686 230376 144836 165854 133422
18862 133422 176246 187935 297211 326938 420648 430489 479593 371482 297906 332830 357291
18851 357291 349151 334531 369434 339300 349981 310175 315554 430303 351727 179322 184583 177962
18839 177962 178427 262426 333552 276626 371544 512144 257940 199449 376769 473301 419250
18828 419250 332448 320813 189620 392953 413821 349003 278771 370504 329301 262609 118478
18817 118478 60388 166400 303434 256205 167798 175914 173460 164065 156817 97459 72300 169667
18805 169667 339829 508508 398015 311895 224807 279863 397816 574254 617489 488367
18795 488367 567710 751469 557386 518891 606362 540302 402767 452962 368363 240872 237079
18784 237079 246583 285624 223979 238701 404745 447487 435656 471323 454181 431557 541304
18773 541304 566996 529948 424319 315483 268409 294514 495329 436009 299898 304343 478049
18762 478049 548074 490182 479205 558669 633514 427739 159002 199925 404497 496285 692853
18751 692853 761270 546800 694389 749044 575350 311367 120630 107935 80131 98379
18741 98379 186098 73068 158125 297526 344825 556499 485924 452274 422564 427336 316126
18730 316126 246674 280667 401019 450706 415426 425059 376996 374566 467669 460265 503902 482389
18718 482389 343954 373671 518755 404910 571042 732758 703710 479617 631341 675581
18708 675581 610896 528682 478115 434396 570990 649350 680862 745882 773286 798365 706016
18697 706016 594779 563158 532270 634728 680836 742303 968903 1130477 1190039 1172172 1151565
18686 1151565 1235808 1192496 1112184 1123198 1213435 1208847 1291544 1239782 1332539 1600471 1879910
18675 1879910 2037721 1938218 1844207 1748984 1703320 1524368 1433798 1517932 1435882 1398275 1346824
18664 1346824 1331101 1405216 1408268 1448500 1396650 1574115 1672550 1617664 1562601 1609605 1790795
18653 1790795 2003741 2186805 2225759 1984574 1709859 1729466 1870107 1974703 2007935 1990544
18643 1990544 1878115 1841040 1733177 1788222 1820216 1793437 1474495 1400849 1462664 1521030 1578756
18632 1578756 1612066 1797682 1929702 1766536 1469895 1259883 1127199 1257749 1377586 1425139
18622 1425139 1457040 1387121 1514075 1497671 1488575 1373292 1370850 1271680 1279890 1289617 1274037 1149637
18610 1149637 1168319 1268560 1467054 1413203 1427289 1382435 1439489 1523949 1529310 1549156 1557716
18599 1557716 1585010 1475527 1567960 1707807 1630258 1438024 1373927 1604378 1675869 1687522
18589 1687522 1543823 1551597 1746321 1869230 1751214 1624387 1639105 1674496 1759313 1823735
18579 1823735 1858601 1734213 1742159 1849911 1878993 1938296 1919146 1808317 1862728 2062794 2169669
18568 2169669 1968062 1923085 1871274 1892281 1887772 2023096 2195782 2359066 2608929 2642546
18558 2642546 2369232 2247122 2412293 2655075 2745139 2591240 2637598 2749452 2819436 2831911
18548 2831911 2732848 2710003 2785806 2703178 2775913 2894885 3001138 3026950 2922915 2919778 3151950
18537 3151950 3276672 3346731 3564048 3662472 3787038 3923813 4154373 4406140 4650691 4930171
18527 4930171 5053790 5376683 5725405 5906109 6129415 6367855 6680501 7076432 7271759
18518 7271759 7212814 7491241 7972921 8375940 8866970 9503763 10116289 11010798 12321799
18509 12321799 13984687 16139739 18585247 20920698 22622868 22967787 22449812 22356876 22898322
18500 22898322 24270956 26509114 30019116 35163498 42621702 52459658 64435077 77141199
18492 77141199 87820994 94570793 98102450 100138122 99426467 94706893 88194620 82260777
18484 82260777 75429125 67648455 61008209 56934877 55405939 56180023 58417017 60754060
18476 60754060 61026120 57618827 51429027 45211552 40423013 36856845 34080329 32028237
18468 32028237 30626520 29842224 29699957 29973134 30647967 31908227 33891108 36467150 38732449
18459 38732449 40110587 40708885 41546103 43425231 46873779 52351776 59824995 69148053
18451 69148053 79287840 88772010 97349325 108055125 123852453 145507762 170185703
18444 170185703 191574456 204678104 208979168 208667177 208304357 209320721 210500214 208314805
18436 208314805 202274475 197599829 194576479 188388860 176317627 159667536 141053629
18429 141053629 122544332 106629165 94127543 84639589 77700791 72923272 69691685
18422 69691685 67050895 63676071 58518151 52366790 47065224 43010895 39931115 37669054
18414 37669054 35882692 34667361 33964284 33856635 34189393 35166471 36797807 39723444 44386137
18405 44386137 51149730 59669767 69079141 77484918 81667789 80583697 78224691 78647808
18397 78647808 83457247 92546549 105080536 119447257 133773412 148841070 165740595
18390 165740595 179745171 184999589 180834488 168265669 147945204 124358331 103965777
18383 103965777 88386294 76578017 67511210 60332839 54906946 50832858 48024755 46333363
18375 46333363 45354619 44674565 43449250 40253727 35531913 30777238 26864725 23786657
18367 23786657 21187644 19080744 17370014 15688413 14380014 13367572 12567390 11877524
18359 11877524 11260434 10719425 10293051 9766816 9038809 8373521 7768632 7127963 6644475
18350 6644475 6228957 5829007 5587329 5071003 4711568 4575279 4410442 4145611 4047033 3869720
18340 3869720 3632454 3521979 3504518 3582835 3464845 3165509 3085852 2985921 2863276 2838825
18330 2838825 2780547 2664753 2554103 2461447 2347966 2418710 2522959 2473198 2520257 2511148 2454237
18319 2454237 2302256 2127689 2047415 1888653 1730143 1916892 2022662 2010463 2155480 2122961
18309 2122961 1860576 1684491 1526304 1571020 1698645 1904006 1801241 1861028 2076899 2005155
18299 2005155 1935599 1881025 1998961 2165488 2138992 2166137 1868744 1844944 1875320 1975095 1871568
18288 1871568 1843917 1828294 1686342 1606160 1664004 1736490 1837132 2024630 2095141 2068498 1998916
18277 1998916 1913557 1812879 1865177 1901852 1845885 1910253 2042088 1995056 1873960 2025421
18267 2025421 2273486 2116862 1904911 1947744 1895641 1711630 1614028 1592391 1647242 1704453
18257 1704453 1727291 1905223 2077636 2108198 2041387 1983924 2093679 2134697 2073291 2014871 1945935
18246 1945935 2171593 2349982 2566223 2613344 2257286 2090251 2168322 2298310 2411508 2589201
18236 2589201 2681567 2796751 2782303 2680387 2658742 2609493 2604824 2674811 2809893 3020521 3101729
18225 3101729 3066669 3106556 3173868 3137788 3218029 3436767 3614365 3576034 3466935 3616271
18215 3616271 3892173 4031649 4046824 3949256 3961310 4184507 4402940 4581570 4671671 4854415
18205 4854415 4952574 5057561 5232181 5209501 5421954 5801844 6200155 6481633 6729399 7050214
18195 7050214 7487667 7959418 8223512 8616954 9129889 9709147 10429735 11440805 12781627
18186 12781627 14433825 16163097 18410426 21311259 25427424 30957430 37643152 44798939
18178 44798939 50995885 53990318 55341682 58385544 65171482 75180761 85991426 93782935
18170 93782935 93733471 86676631 78703082 74544573 74074927 75433598 76155862 72862607 64777244
18161 64777244 55443547 47927165 42171830 37739536 34189941 31271927 28888565 27362546
18153 27362546 26149217 24995624 24036298 23385057 22981975 22920800 22878192 22965513 23395059
18144 23395059 24144752 24930037 25871156 27269920 29460633 32414813 36671090 42361153
18136 42361153 48866282 55129032 59671790 62126981 64831895 70143301 79058915 91417960
18128 91417960 106123277 121301482 135939117 148264757 155827174 156782931 151882486 143674476
18120 143674476 133755862 124164644 118392812 118592762 125308027 139380769 161926526 192975392
18112 192975392 228686413 263114320 282335311 268545777 226845542 184296418 153306916
18105 153306916 131200471 115008116 102738538 93889767 88115241 84324886 81292172
18098 81292172 78750744 77280607 77405865 79669558 84971277 94441807 110413389 136227719
18090 136227719 172485981 215440299 256018395 274525232 257078183 218805428 184320777
18083 184320777 158066144 138477436 125314967 118199357 115766622 115700168 113569718 105983486
18075 105983486 95525685 86907696 81393360 78001663 75763955 73024305 68386341 62872404
18067 62872404 58128056 54727337 52750211 52048800 52794953 55040488 58807312 63717137
18059 63717137 69331034 74087415 76621888 77508741 78605354 80636209 85298301 94110467
18051 94110467 107808878 127351319 151852745 177279076 198959723 210731833 208285186
18044 208285186 198514744 194710340 203352912 223012677 248030630 267418320 268419371
18037 268419371 251572201 230880842 213166253 195031296 173554422 151166129 132337048
18030 132337048 119017082 110528741 105521189 102746783 101383822 99727927 95012642 86444928
18022 86444928 76512693 67936174 61110848 55701551 51462485 48357675 46143031 44487574
18014 44487574 43236034 42364312 42169239 42538433 43726326 45794000 49444702 54972082
18006 54972082 62556485 71693138 80978792 88475169 94124887 100601570 109662509 119434603
17998 119434603 125714988 126023464 124740859 128409662 139639594 157596846 178510584 194268032
17990 194268032 197877305 193637683 189580982 187741079 187987099 187806582 181283516 164826910
17982 164826910 142673758 122891863 107997913 95851828 84493638 73867003 65047889
17975 65047889 58261062 52696949 47863069 43811960 40484283 38059824 36420743 35312666
17967 35312666 34265561 32685744 29939087 26687056 23628969 21104512 18952026 17048645
17959 17048645 15392948 14170586 13334512 12510448 11735905 10766104 10060906 9474409 8708745
17950 8708745 8008314 7358663 6719779 6496776 6035625 5695862 5358051 5080256 4933546
17941 4933546 4696489 4535599 4214325 3967606 3782716 3631914 3549379 3489388 3282133 2997232
17931 2997232 2984928 2967936 2778576 2829429 2841003 2738708 2665308 2598229 2715550 2729182 2710922
17920 2710922 2693351 2614780 2434406 2295580 2216857 2162900 2113170 2088299 2207604 2274707 2198786
17909 2198786 2055898 2052949 2033289 2001901 1962393 2018358 2040020 1846852 1772329 1727982 1591761
17898 1591761 1657078 1650975 1653618 1571510 1532559 1601417 1502581 1349047 1267053 1175169 1049131
17887 1049131 1074460 1114841 1060640 1070379 1018983 1024251 1045209 977908 963201 950317 1009126 1013209
17875 1013209 1048583 990286 871990 826324 945554 1088600 1072437 1108424 1110381 1076576 979592
17864 979592 922375 1066360 956363 763418 790038 752366 632568 469922 448623 447999 550935
17853 550935 599383 769075 794779 791145 790161 584573 458842 518731 490054 367697 308829
17842 308829 399287 351931 377318 493269 582706 512691 453010 562258 567733 554518 425948
17831 425948 551449 625022 466311 279108 285077 259126 238427 296067 311052 293809 247299
17820 247299 214515 274401 323601 299286 367527 307539 321727 369425 295273 196899 63666
17809 63666 -2400 46653 145911 147862 140579 133318 221491 276395 375597 281006 118800 295601
17797 295601 211381 116469 323604 336761 323473 377038 454979 598838 693658 492992 397157
17786 397157 400609 372136 458199 503878 383350 389964 465512 341859 284229 273981 76404
17775 76404 58748 195381 202927 254971 267840 97271 86877 86225 131933 210552 124582 72069
17763 72069 83308 130645 242560 331382 258002 92046 83790 67163 218536 172002 -271
17752 -271 -13402 -13176 2386 -29578 55674 157692 170774 197535 111913 95979 -44025 -103460
17740 -103460 -18463 -26061 -79945 -210797 -279959 -322998 -248705 -78966 -119148 -132493 -75598
17729 -75598 -133999 22720 256659 244358 254939 13836 -33732 -52206 46040 2610 -3449
17718 -3449 -34777 -133595 -156856 -221748 -270542 -184405 -167768 -258352 -215417 -87618 -3571 60554
17706 60554 -60180 -109374 -37365 -116670 -279466 -352928 -364074 -254470 -28964 37413 -26144
17695 -26144 79526 112554 52273 -9129 63756 38423 7198 106109 204846 -6142 -217732
17684 -217732 -250726 -254289 -181657 -127291 -45049 -8804 -46375 -117573 -44207 79114 184478
17673 184478 30814 -164563 -189303 -139277 -40805 3578 45180 128244 116375 104304 181239
17662 181239 120795 117554 124991 134678 183074 147598 8537 40574 49556 94691 136345 259439
17650 259439 391048 417376 348863 190281 68124 39906 294943 382915 373337 211823 -51922
17639 -51922 -86244 -7362 -99469 -190016 -121989 -12127 127762 -35880 -119716 -164492 -149809
17628 -149809 -78465 19666 4207 37007 29932 -58106 93902 218496 154591 120206 372169
17617 372169 489630 419958 362371 433855 448744 594070 590872 573695 517572 577211 498021
17606 498021 528182 521212 449324 342615 221336 98128 73969 243564 326119 385860 361003
17595 361003 435485 460224 247293 131309 82708 -66214 -123971 -24378 -19715 515 -98134
17584 -98134 -116119 -62875 33608 -87422 2876 16057 12009 14592 -18979 91817 215732
17573 215732 275103 452476 592121 575337 411828 287434 271020 352086 416064 493084 419637
17562 419637 191012 167230 410855 506403 434797 352661 311219 125257 -54670 38685 72685
17551 72685 26725 197827 277640 275020 274928 383768 561164 616355 751048 767858 950063
17540 950063 1193742 1275131 1405402 1565717 1577380 1321504 1251551 1096617 1050376 1086453
17530 1086453 984224 1206239 1300323 1134468 914969 934807 986533 1310284 1474364 1565082
17520 1565082 1605565 1650798 1729372 1759285 1656888 1493395 1348034 1216041 1089433 997449
17510 997449 876400 683060 574042 709945 651984 566704 402261 294963 355239 518059
17500 518059 434598 459725 427659 345369 209149 254633 266311 270926 250417 242057 259660 269001
17488 269001 231987 326528 447697 411990 420108 577098 666513 748402 718757 601247 602772
17477 602772 655331 814915 718017 724206 638334 617018 664680 549829 497520 591597 661842
17466 661842 731244 665887 621204 585478 621646 713134 686341 559894 466285 319468 185787
17455 185787 76874 86854 60248 67079 79093 5331 2221 -21189 -8195 92821 90585 -50605
17443 -50605 -74478 160118 173573 146721 98325 -69502 -160184 -170542 -119298 -264850 -340636
17432 -340636 -371049 -275282 -200757 -151734 -82853 -146779 -189574 -96548 -27310 56286 56897 -105470
17420 -105470 -254067 -477899 -417034 -293684 -200043 -327535 -334730 -268965 100833 278610
17410 278610 137598 -96684 -85512 -7518 -6062 184755 262485 190046 -90605 -203959 89959
17399 89959 135471 42710 21704 85310 90932 -16044 -102895 -139318 -32259 -21144 -97423
17388 -97423 -321846 -437547 -336807 -136388 -5216 -130591 -136482 -80675 -28067 8774 39885
17377 39885 -6035 -150163 -191777 -119885 -188223 -167806 -118111 -109831 -28808 20027 -179257
17366 -179257 -321575 -411595 -284572 -98373 -2385 10849 32265 31498 113192 -44348 -83500
17355 -83500 -68823 -84110 40965 22319 39070 83721 -57129 -213576 -130967 -154307 -183892
17344 -183892 -177538 -216579 -247460 -185429 -182438 -140548 -209242 -71087 -1707 58638 169005
17333 169005 65964 -134894 -202381 -52418 101521 192900 -10710 -87071 -137861 -49658
17323 -49658 102930 43005 -44605 25708 -98450 -20030 17832 13199 -30898 -50552 -21296
17312 -21296 -206918 -240491 13403 15460 -34384 80918 97349 7676 22797 -163366 -285690
17301 -285690 -172923 -105657 -80538 -244753 -224112 -69461 -23461 -83600 -90633 -208877 -97138
17290 -97138 -59546 20390 -17905 40035 30648 -136887 -220122 -206084 -129877 -245039 -238301 -202846
17278 -202846 -148141 -140637 -230653 -380291 -363291 -227618 -133423 -91207 -87762 -103015 2238
17267 2238 -70461 -231582 -193248 -165962 -99785 87022 213363 217658 102723 -141550 -332540
17256 -332540 -144501 -7285 54977 95967 -80400 -209229 -194018 -201548 -88818 -97072 -206161
17245 -206161 -145561 -78687 -100375 -81032 72291 84203 83901 16780 -112862 -264993 -176967
17234 -176967 -233702 -238403 -24691 -33889 -238944 -374464 -218167 -193872 -276761 -173989 -189990
17223 -189990 -137660 -247987 -334328 -314127 -268705 -116447 -24563 -184470 -248579 -66029 -163203
17212 -163203 -219564 -4430 76315 116202 19069 -33941 -31115 -27104 -68243 -223617 -207162
17201 -207162 -207868 -334156 -213371 -72872 -56458 -296092 -312193 -257302 -152145 -155290 -50798
17190 -50798 -35432 -97910 -144464 -72712 58564 85376 179545 79102 14126 1110 90591
17179 90591 79860 16621 -28992 48366 -54211 -185172 -244621 -179208 -76475 -74126 -101705
17168 -101705 11644 31732 59946 91309 137761 138494 53558 66092 67631 -2863 45576 -59958
17156 -59958 -252823 -266267 -254572 -297135 -141745 -87299 -11157 -1679 95724 260574 426369
17145 426369 227864 109630 71559 -112718 -405739 -358782 -214840 -79201 -50158 -235702
17135 -235702 -262100 -338805 -280325 -227834 -263089 -357129 -367777 -462507 -440075 -423401 -251054
17124 -251054 -183307 -204183 -103397 -15798 -97754 -248877 -355419 -95606 -25961 -279472
17114 -279472 -266979 -247427 -269892 -31840 14367 24541 -48347 -300250 -432552 -343486 -119904
17103 -119904 -58861 -221560 -229579 -331076 -313815 -277078 -210616 -190566 -169839 -71534 -68854
17092 -68854 -134574 -282759 -256844 -54646 -86796 -148912 -317175 -243889 9725 72975 92521
17081 92521 92375 -36825 132932 204369 164529 102075 -81342 -138840 -114689 -125404 -38991
17070 -38991 -30440 43983 50928 33291 38850 -133340 -186431 -48380 37662 -28375 -118635 -120402
17058 -120402 -76775 -90287 54837 -106290 -101829 3237 -26302 -89148 -38859 -27649 -28381
17047 -28381 11972 -28685 -63017 -149572 -97132 30988 -48818 -221339 -152202 -66635 -103963
17036 -103963 24288 84962 45890 -46796 -108668 -242578 -199751 -114044 -21598 -43934 -119618
17025 -119618 -119701 -194786 -242633 -225574 -302433 -293323 -326684 -471547 -408485 -191557 -153727 -87798
17013 -87798 -101186 -126437 -45068 130608 181493 44665 -14 -71653 -143859 -70703 -93585
17002 -93585 -251714 -288239 -127303 -153741 -254878 -226112 -188340 -225657 -194517 -162334 -128640
16991 -128640 -52307 -18372 -20480 -116165 -154848 -150304 -203644 -345456 -286285 -128650 -208591
16980 -208591 -263704 -235642 -227655 -80449 33041 -141803 -161270 -133966 -220821 -257964 -430327
16969 -430327 -489388 -566197 -567820 -321548 -142489 -82316 -198903 -297232 -310695 -315014 -295415
16958 -295415 -235166 -73457 -153677 -189717 -131782 -123836 -92317 -103902 -245798 -362006 -241134
16947 -241134 -56294 -116335 -154522 -226323 -240192 -357810 -366947 -287682 -325375 -370063 -308301
16936 -308301 -251540 -226398 -191979 -265284 -256824 -251320 -71730 -40649 96291 163530 160197 107380
16924 107380 -16066 -24423 -87299 -123994 -12416 -1363 -189952 -147034 -82127 -63699 -65380
16913 -65380 28437 1055 21281 57411 -132518 -195514 -107766 -72209 -193592 -220304 -258904
16902 -258904 -233960 -336397 -279711 -270404 -66833 22819 -91247 -253132 -396473 -359403 -254293
16891 -254293 -500354 -622137 -497263 -373848 -307737 -334070 -326628 -249230 -334645 -263040 -128729
16880 -128729 -166456 -210964 -372390 -360901 -317024 -300352 -362943 -356017 -204257 -104042 -94479
16869 -94479 -147616 -367466 -358391 -209082 -81226 -125952 -127087 -56584 -58393 -32055 -33916 79705
16857 79705 129627 135427 110490 53514 -13156 -72468 -104396 -175590 -108709 916 32009 81508
16845 81508 -41867 -141724 -96765 -63977 20548 29589 -3200 79327 67261 8077 -38296 -118508
16833 -118508 -262132 -212540 -173910 -28570 189862 253846 137363 47611 -25585 31067 -41660
16822 -41660 -130871 -110829 -134006 -160475 -223161 -73185 -9032 -38049 -200827 -259611 21899
16811 21899 4395 -256276 -329504 -271110 -232098 -310981 -368023 -442372 -409617 -395790 -378160
16800 -378160 -361775 -281934 -34792 -106242 -231077 -276421 -327347 -231841 -65149 -37011 -4048
16789 -4048 -74219 -151794 -88773 -214622 -136248 -121959 -95942 -100650 -173602 -86266 5640 -86888
16777 -86888 -321023 -387384 -423912 -320829 -284693 -51242 7610 125262 242568 200634 -29956
16766 -29956 -61926 -516 -10612 -165532 -240016 -228189 -207514 -315090 -216057 -139718 -98656
16755 -98656 -135050 -353181 -409023 -205775 -72008 40543 -92262 -156954 12141 59589
16745 59589 -66678 -61170 -177725 -153655 -77658 -77206 -76293 -248512 -367193 -373093 -341369 -461199
16733 -461199 -472660 -360927 -183605 -44252 -46620 -106754 -99344 -96789 -84161 -219489 -345713
16722 -345713 -428426 -542015 -512321 -391106 -319714 -291443 -240919 -141273 -77946 -66542 80628
16711 80628 190704 157678 -36690 705 105292 126228 110331 105904 45750 81752 175402
16700 175402 46092 -177988 -289312 -240135 -29231 107660 130344 39969 -39044 -86009
16690 -86009 19899 165071 206013 117379 -44231 -133048 -80196 -62127 -82246 -144562 -66497
16679 -66497 33842 103594 -53324 -167793 -204819 -250648 -203507 -67292 204886 139827 -50791
16668 -50791 -91325 -136208 -172355 -221214 -278626 -201356 -333631 -384658 -269766 -200182 -151430
16657 -151430 -63256 12413 -70422 -179480 -107535 3619 15456 -98060 -72469 -59464 -41558
16646 -41558 60199 112176 48788 128086 -35380 29771 36708 -2753 141610 -47446 -189274
16635 -189274 -144274 -119038 -117591 -169508 -307639 -89848 152481 370458 422541 333547 170829
16624 170829 65556 77173 -39302 -193156 -169774 -84837 -127441 -99321 -115503 -251746 -306610
16613 -306610 -183510 -159662 -305150 -268889 -292778 -275567 -256108 -164710 -112667 -181727 -139800
16602 -139800 -64027 -228571 -300977 -292597 -336641 -292854 -161396 -164023 -175221 -179330 -105404 -274
16590 -274 -101887 -128197 5109 152843 207537 35246 -64338 13137 99969 2811 -62355
16579 -62355 -185294 -106745 -191477 -201181 -251939 -266794 -356161 -316287 -185847 -91406 -56963
16568 -56963 -63262 -138695 -114256 -37966 -115350 -318032 -344935 -264863 -306809 -253518 -160657 -223666
16556 -223666 -73312 61323 -185489 -310711 -41067 -35331 -89885 -81075 -49287 -130475 -287652
16545 -287652 -311905 -210761 -117296 -17561 55866 28297 -146010 -260882 -270658 -324252 -295694
16534 -295694 -142156 -116882 -128411 -50948 -12476 -144081 -7913 83775 96333 49939 1544
16523 1544 64628 29016 17473 -43883 5580 -18301 -94065 -21290 -80396 -103235 -71645 -84092
16511 -84092 -227573 -158049 -63333 -25534 74832 105849 142503 227141 111663 43177 139646
16500 139646 130565 -15347 -160415 -120497 8418 -12990 -131219 -65180 115818 138510 116636
16489 116636 162338 278883 201269 21833 -101233 13884 100525 299131 337035 406866
16479 406866 648696 877219 1019108 1058551 958327 994851 1046216 1054664 741425 711542 718091
16468 718091 622319 490114 363616 333268 399755 425944 335816 564093 506270 284155 289451
16457 289451 449838 706488 951417 774829 700588 802213 755164 607974 711179 806833
16447 806833 652071 596383 639583 529908 465907 326681 309134 269437 277397 371539 298975
16436 298975 115649 -72670 -230591 -206050 -92774 63367 203872 89331 74693 43851
16426 43851 -58703 -14241 -154317 -130537 -11330 -27660 -37349 3130 -84805 103663 176194
16415 176194 73934 43211 -85993 -137701 -54913 136151 209588 120966 118033 229504 185188
16404 185188 117880 200105 153077 -68115 34525 18820 -56765 -146214 -48448 -123737 -125087
16393 -125087 -171485 -280108 -298691 -275341 -311401 -339997 -307177 -227279 -176712 -130845 -33560
16382 -33560 -8243 3270 28934 83037 105345 -64209 -309076 -217854 -81194 31495 108682
16371 108682 109913 -2975 -92204 -235691 -124343 -69903 -48976 -38598 14458 90455 98658
16360 98658 19674 -88871 -176577 -90389 -102463 -81808 127640 88995 8260 116199 -68907
16349 -68907 -156883 -204413 -109360 31782 1231 -139283 104175 213428 110192 42035 -17627
16338 -17627 -102924 -104622 -62035 -147330 -75519 66492 18624 -110037 4267 107859 81641
16327 81641 95399 21961 -48254 -128186 -153740 -21587 79175 78753 -48272 -205265 -365320
16316 -365320 -237707 -194384 -346261 -430690 -425800 -494272 -373899 -242120 -198847 -87758 -6219
16305 -6219 72695 158460 153133 105350 234509 313992 423991 407436 226456 121119 -38632
16294 -38632 -46062 17051 -107651 10722 -22673 27244 162608 89358 176947 208933 235148
16283 235148 346585 87378 -35733 -53784 -128578 -226651 -222805 -177934 -339685 -439903 -282869
16272 -282869 -114234 -225418 -257088 -118706 14242 28463 -20994 7010 -84893 -230454
16262 -230454 -202715 -95710 -203023 -238615 -193056 -136862 -143548 -21916 -52897 -146263 -295385
16251 -295385 -319956 -87610 -86303 -46678 87151 -118758 -197645 -15649 92991 54829 16955
16240 16955 96386 158331 96990 73811 -79003 -195246 -192398 13700 71050 92897 166547
16229 166547 282746 243252 245359 268255 388211 312278 156257 61474 4757 -61479 95055
16218 95055 69576 63722 179643 108017 103315 70513 188638 237772 209169 31426 30728 -55031
16206 -55031 -188089 -241516 -221812 -118859 160997 20132 -243559 -352441 -238685 -302173
16196 -302173 -254380 -49174 -98770 -104262 78396 197749 97805 91395 146443 173842 135360
16185 135360 89425 131813 48550 30663 235024 366034 523395 550668 238072 -7330
16175 -7330 -21020 -62485 -167572 -175418 -154300 -63956 258946 404118 225822 5547 -17444
16164 -17444 -37209 83183 130544 143535 99126 142417 92008 28458 116568 128568 -8226
16153 -8226 -242287 -240111 15189 226530 283350 246162 181163 225948 267282 312703 464787
16142 464787 460107 330845 216664 43339 -168732 -175798 20223 144224 235128 188237 120547
16131 120547 74532 171951 162225 277504 224506 289346 191807 183195 187640 -28478 -82390 42623
16119 42623 150762 235383 204276 263409 374056 529260 495869 315908 330408 172793 249631
16108 249631 282022 174171 -95553 -208539 -74723 74354 249276 190394 76683 -34833
16098 -34833 -84532 -56255 103864 211214 40514 -18426 126994 173235 274284 319962 309277
16087 309277 471669 460657 426318 540210 662618 564476 342921 274318 221287 252672 322556
16076 322556 361204 290522 179958 -809 89576 192575 148123 4829 -125646 -107467
16066 -107467 -13151 240432 393247 253263 341498 430976 418581 463971 496027 470503 389562
16055 389562 304521 365693 267110 82768 -29093 -124062 -116332 79371 202690 169818 148192
16044 148192 280899 372909 276369 189255 170243 136147 168431 206958 208649 266956 286712
16033 286712 217843 156495 81676 105726 149060 127065 229753 529290 653672 677721 545297
16022 545297 383343 245721 204771 133439 360121 531774 600164 542075 551653 561010 506506
16011 506506 519366 566827 719291 835071 803696 836731 854250 835404 886767 848217 772423
16000 772423 690291 668996 783228 865674 792442 760167 749136 808267 645316 653645 730292
15989 730292 891904 839666 817889 766860 833007 951060 1051075 936568 863677 844452 958785
15978 958785 917208 907718 999987 962453 1048829 1155490 1268139 1038436 816732 905310 838126
15967 838126 860064 1093506 1278840 1330009 1321983 1430290 1558540 1428190 1461043 1521983 1565544
15956 1565544 1580886 1642923 1661380 1728547 1845682 1942864 1945037 2099189 2244695 2382981 2361190
15945 2361190 2250848 2207001 2439176 2715018 2868726 2996132 3141741 3136312 3298843 3715063
15935 3715063 4180579 4467914 4626438 4757579 4827947 4975096 5347227 5728495 6090617 6703072
15925 6703072 7465863 8132038 8611484 8996741 9277195 9744602 10463807 11447978 12641562
15916 12641562 13799163 14927637 16436779 17829058 19469333 21674547 24749580 28555942
15908 28555942 33329890 39695776 48510602 60772755 78560266 104918288 140977412
15901 140977412 183371923 223258182 241850175 223844498 183925986 147890124 122205593
15894 122205593 103777458 89969381 79594107 72421699 68055521 65322368 63302624
15887 63302624 61572757 60724249 61362654 64320419 70499611 81171713 98709027 125540482
15879 125540482 161634875 202152624 235498827 241062497 211803397 169791416 135673284
15872 135673284 111126337 92853048 78932835 68249872 60336538 54763497 50179679
15865 50179679 45260221 40206756 35658108 31506917 27917950 24728285 22096788 19832218
15857 19832218 18100660 16932092 16020063 15289678 14315406 13176263 11924343 10721281
15849 10721281 9722219 8820737 8041227 7333156 6687706 6278483 5973574 5699808 5198685
15840 5198685 4618040 4350196 4163195 3920879 3783098 3415733 3056757 2765259 2627110
15831 2627110 2453218 2347738 2338078 2464221 2373573 2169280 2071617 1871836 1757399 1693483
15821 1693483 1616362 1468134 1483249 1592508 1643530 1556302 1329086 1162673 1132046 1046397
15811 1046397 998265 978030 818722 764967 921403 973519 913304 896088 859473 990058 1009367
15800 1009367 888768 731898 633504 678359 797111 745058 650475 720099 677077 615711 672802
15789 672802 689816 595267 928517 1105546 1140546 1091299 1014850 821676 581364 508461 703909
15778 703909 865652 951349 846727 755340 547039 413153 407583 356151 310186 292171 417127
15767 417127 340748 136284 52894 331783 713914 747496 599147 497670 578490 599695
15757 599695 553428 725348 932478 1031428 1365764 1591591 2046672 2625750 2974841 2731478
15747 2731478 2344434 1964785 1528778 1272463 1099910 924490 859246 895081 883222 738703
15737 738703 580183 496937 422770 552576 555436 396515 368461 435714 371348 342921 414111
15726 414111 511360 609037 496439 247028 140017 125728 49601 -57185 -10199 -64217 -79812
15715 -79812 -58956 110652 119178 8549 25597 79522 142067 200226 246770 176977 217897
15704 217897 295637 121650 202863 335885 289630 247693 218309 156176 188568 86034 98547
15693 98547 240551 293444 334832 250476 189098 135219 87685 68466 199013 172574 88427
15682 88427 23327 127553 148212 240168 272481 234927 153256 85753 -61514 -73265 -6723
15671 -6723 134107 266502 227772 140957 156285 81131 4549 77137 200274 217584 197363
15660 197363 80872 3719 -88779 -133636 -63916 -35612 2433 -64525 -22899 62234 98200
15649 98200 154099 89170 86394 130985 168617 181446 167668 -27168 -154631 15424 47017
15638 47017 128665 212025 144750 -35799 -45511 155533 203875 197644 143002 118913 14340
15627 14340 77662 207709 71010 235691 310453 175247 37258 6208 19488 245077
15617 245077 372628 356634 260422 299514 287153 298055 201934 164299 227415 209209 216792
15606 216792 267160 328450 399704 279500 238419 296853 276942 121957 -4095 128618 113481
15595 113481 132538 -118182 -279325 -398318 -337360 -62468 15192 60577 57313 -97856 -124470
15584 -124470 -49313 -34991 67766 64066 86993 23258 132013 182485 254450 278511 82474
15573 82474 13460 -96287 -46375 82916 -44745 -25078 82489 145291 119880 32047 15295
15562 15295 90123 92965 156929 131944 58337 76985 110325 45141 116888 65639 -91429 -132220
15550 -132220 -235 7125 92808 196437 122674 174180 274555 255321 124139 59434 102969
15539 102969 223357 102078 -124104 -381223 -396955 -238650 -162251 -117992 -156418 -111586
15529 -111586 -136075 -152130 -132445 -119393 -66146 19703 7869 -22960 -178767 -246085 -91744
15518 -91744 43920 43699 -116211 -2653 -46473 10539 88777 148815 131572 87245 -9428
15507 -9428 75090 101839 176804 310756 230380 235129 370404 351036 298417 81388 -22945
15496 -22945 93785 120212 96074 114209 56993 91371 147184 26133 -18733 25482 71757
15485 71757 243836 262634 137120 53520 102542 -20660 47412 157263 192114 240257 307469
15474 307469 227556 84424 43593 27749 116928 104869 38059 -9915 195937 158680 122868
15463 122868 59632 32384 114102 44586 51889 98719 110541 17266 -30147 -19450 97972
15452 97972 86068 -17289 -24413 -31358 -21472 -116454 -274818 -185363 -56656 -117211 -129403 -105729
15440 -105729 -57860 -51542 16914 10628 -221954 -240354 -336264 -296498 -44362 -28628 57387
15429 57387 40338 30977 -10739 -46382 -43805 9998 121297 726 -223144 -228491 -333437
15418 -333437 -331683 -288441 -333616 -245070 -255253 -180503 -55156 79301 6340 -151983 -121023
15407 -121023 -158945 -6348 -92482 -54572 86362 21384 133621 50050 -57920 -38209 43426
15396 43426 19689 -20076 -13700 -66687 -36248 -8991 -71458 -75537 -188214 -138846 -95200 -30857
15384 -30857 -79238 -101771 -63977 12958 -8444 -32855 -56339 -18445 -94413 -333444 -298097
15373 -298097 -123097 -183733 -298764 -276759 -83185 201372 142913 -35916 -63537 -95171
15363 -95171 85825 255444 102604 6461 -109038 19084 -74449 131656 132853 -88051
15353 -88051 -48875 17493 -47251 -32365 -50907 -9754 -199949 -324846 -93320 1028 -21905
15342 -21905 77570 167431 262982 312959 351713 289907 238462 262493 182611 169899 144797 94457
15330 94457 139364 133998 165840 180630 140321 279835 363761 551439 742963 1073533 1348162
15319 1348162 1256556 1119452 994920 723119 517261 425762 378025 350837 295292 232435
15309 232435 190425 237094 237665 235831 237584 222624 211671 337364 502301 552359 675692 959026
15297 959026 1059827 967367 850682 605586 370334 294126 263035 271119 279906 255603 117579
15286 117579 35939 125054 166794 215235 248113 165220 186540 263611 247753 333369 312885
15275 312885 161977 50934 47890 10813 -67693 42845 105849 -30458 -57903 33971 7296
15264 7296 48913 207501 118042 4869 82186 -47646 -3626 -707 25955 152396 158181
15253 158181 132982 151461 -27441 -52291 -109144 -119920 -87616 1496 30165 97116 -38298
15242 -38298 -80369 -71300 -87560 -224005 -181687 -138355 -182401 -101771 -152444 -67497 85728
15231 85728 -16817 -6514 131161 17403 45685 44188 -99567 -93506 -66288 -200775 -249873
15220 -249873 -212824 -131594 -143474 -185352 -257875 -201883 -59984 -110078 -2393 4126 5398
15209 5398 31394 -65890 -110884 1006 188711 78469 -71880 -119448 -145828 -197602 -302668
15198 -302668 -266755 -158308 -122739 -113613 -114156 -97379 -53446 92320 194111 268935 337377
15187 337377 240892 325106 263118 174605 100476 77484 44104 96060 98963 -16273 -63227
15176 -63227 18865 99301 88368 153067 -56983 -59694 -24922 69438 70474 -46882 -12563 17512
15164 17512 83578 127087 128383 -67242 -93049 -152600 -243604 -175479 -45313 -68440 -120589
15153 -120589 -89948 -102650 17416 129916 110883 -12090 160444 263093 161246 165638
15143 165638 388645 323875 268313 151819 -128520 -63772 -109181 -105926 -89017 -182825 -185841
15132 -185841 -109275 -98226 -108876 -142606 -144125 -70106 -279 36434 5898 -107269 -178268
15121 -178268 -132098 -6305 -59503 -41984 -117650 -150930 -262713 -203126 -101333 79914 84312
15110 84312 -31433 -185541 -140564 -59925 -40309 -25250 116329 192786 80115 -26742 80185
15099 80185 36185 -47155 -21132 155179 146423 91701 10961 -110661 -93237 -13658 17700
15088 17700 96740 49115 54391 -74230 -241349 -278438 -225363 -40988 -43339 -61228 76178
15077 76178 96540 96849 5289 -81127 -110774 -179696 -328360 -402195 -236450 -196723 -77600
15066 -77600 -11603 -71032 -77554 -121558 -141988 -25377 15550 -55709 -132238 -194270 -279812 -141965
15054 -141965 32708 226466 224725 137562 56585 2274 -64283 -16723 62283 103403 -16437
15043 -16437 6587 -8576 9706 -152289 -210599 -57685 26921 30897 -2418 -191126 -299102
15032 -299102 -222133 -219682 -333850 -211865 25347 137450 82090 -109990 -267710 -84216
15022 -84216 154218 83412 -8634 -80463 -126225 -20046 -23107 -16066 56775 161228 111623
15011 111623 63540 80644 -36924 -369243 -431224 -164170 85874 80308 13023 -76810 -121701
15000 -121701 -178018 -186551 -235154 -198643 -214693 -382315 -300888 -142106 40346 124913 136194
14989 136194 10666 82438 67316 54745 -60824 -186750 -78609 124508 187347 59575
14979 59575 -26229 74896 184679 140105 86464 133273 113204 -43521 -35964 -37168 59011
14968 59011 101423 83443 -15602 67483 32903 -119183 -136812 3984 276423 299995 22684
14957 22684 -105671 -37544 136393 145765 108596 114546 32164 -120187 -164176 -249633 -186749
14946 -186749 -156868 -135028 -44845 -29076 160572 106531 -71375 -124845 -59450 55579 57348
14935 57348 113420 171342 43113 -124718 -29264 57665 93056 16523 -185781 -305599 -154673
14924 -154673 -48742 -4619 19301 88341 23767 36349 -16693 -209773 -282418 -298355 -307789
14913 -307789 -265888 -129796 -52572 -171511 -210050 -75607 126872 -29139 -255230 -354849
14903 -354849 -269751 -222627 -222146 -122495 -32999 -80496 -27076 -91699 -156686 -126233 -2728 -14341
14891 -14341 127576 77901 156442 140768 24496 110163 68691 83188 64997 129082 152610
14880 152610 117959 171068 55718 34383 79436 50151 59083 144667 69707 -9298 45613
14869 45613 160507 45053 -89070 -160771 -154351 -121781 -38259 13508 -50899 -23475 -106046
14858 -106046 -54163 -77573 -205988 -191511 8364 -44917 50479 125659 27052 159465 162664
14847 162664 -17565 24116 3761 -4700 -38911 -89876 -92475 -163336 -90400 -84948 -159952 -133915
14835 -133915 -154259 -126119 -185295 -174949 -124952 -128380 -131648 -147201 -948 -31792 7543 -146490
14823 -146490 -11089 16494 -99868 -27964 15266 80619 -370 -42796 -118601 -174318 -72056
14812 -72056 -64799 -216018 -102197 -34243 83162 17571 -86934 -149804 -97766 -70951 -310178
14801 -310178 -390139 -277572 -192148 -70312 -36641 -50946 -129885 -119709 -105034 -13162 -25160
14790 -25160 66483 36905 -3599 -25360 -25036 -52446 -30784 -25479 -28516 67732 183137 276682
14778 276682 189442 124850 -31518 -161390 -246290 -245121 -280811 -398860 -316324 -207458 -333013
14767 -333013 -325394 -170719 -54856 -113532 -31693 99209 208679 153073 40919 28518 2626
14756 2626 -99229 -76652 -87141 -153003 -131228 -32972 14617 -196747 -343719 -340859 -198681
14745 -198681 44947 54722 64935 65199 128603 100619 36655 144309 134728 253959 271339 283751
14733 283751 273391 233311 252910 184996 -1730 -128868 -2926 134026 83638 102304 41921
14722 41921 -53333 -38220 -161391 -225950 -34745 58185 -10232 -62012 -91007 -61144 -31251
14711 -31251 35308 133863 -150635 -372640 -342457 -209571 -101236 -97823 -172470 -104045 -162846
14700 -162846 -148908 -102261 41010 85713 -43592 -78112 31733 182786 225549 117887
14690 117887 64769 -193640 -304598 -263585 -318558 -237407 -9727 128526 41457 -99680
14680 -99680 -80770 -140493 -222518 -190822 -232337 -388157 -414241 -290894 -266497 -314761 -256579
14669 -256579 -106588 -27397 -65756 -142367 -158697 -48729 63696 132992 -19294 -177779
14659 -177779 -123571 -96015 -28795 58238 -117573 -250628 -271318 -280375 -161992 -140488 -283191
14648 -283191 -470859 -422003 -240073 -46668 16846 -113462 -196485 -182521 -129606 -120191 -50741
14637 -50741 -120765 -213367 -305790 -333517 -393107 -428667 -345762 -241187 -282619 -200226 -66699
14626 -66699 110473 229739 195224 204991 2250 -63099 -52296 28960 175648 75891 -106943
14615 -106943 -386675 -517111 -474324 -330069 -226411 -23957 80971 58033 -55427 -28532
14605 -28532 96494 148678 58367 -2456 -281462 -412347 -260401 -148647 -152504 -196487 -231413
14594 -231413 -133086 -106878 -42623 -117744 -222410 -214596 -223606 -198772 -214940 -86986 11790
14583 11790 -74231 -135541 -242675 -113626 -231927 -294808 -128434 -31055 -37135 112215 240802
14572 240802 181973 47867 -59579 -113040 -215417 -320895 -391169 -263353 -100928 -275285
14562 -275285 -261137 -176267 -83677 81879 60232 137197 28603 -3907 47373 65854 7860
14551 7860 -98544 50673 197339 114962 39181 -65088 -13682 -27538 -88498 -96171 -28221
14540 -28221 70945 94618 -40247 -40942 -50380 -109600 -74134 -179266 -287438 -330488 -368902 -289068
14528 -289068 -68531 104257 28716 -64616 -12742 -126471 -160069 62330 31035 -64874 164826
14517 164826 326650 240890 66161 -43925 94497 130027 33960 -166746 -144042 -81401
14507 -81401 15753 92010 113125 108950 156088 167208 113583 49780 60021 -669 -97931 17017
14495 17017 -61789 12313 -31199 -63697 -67252 43374 9253 -40392 -60950 -146441 -250173
14484 -250173 -204420 -131052 -297977 -260468 -158638 -141594 -150213 -193975 -232508 -192771 -107617
14473 -107617 -173520 -248758 -171698 49812 186291 112984 20686 -116303 -82954 -9789 158350
14462 158350 183841 -48990 -134432 -31661 -16510 26246 -38727 -88215 -150965 -201414 -224865
14451 -224865 -227816 -237854 -263910 -202041 -249489 -342143 -326516 -205061 -98089 -112182 -152859
14440 -152859 -222569 -119298 -41168 -127606 -211261 -15497 56156 -52278 -213625 -193447 -9535
14429 -9535 113903 85928 1656 -162146 -230642 -192545 -308468 -219941 -150832 -130601 -82396
14418 -82396 -56542 -73919 -40485 55180 -95909 -69678 -72006 -233297 -225125 -187609 -69850
14407 -69850 182053 92794 67738 51132 91248 172123 148106 31317 89410 91944 236588
14396 236588 445905 340872 244641 203416 108961 -45125 -33840 -235119 -276945 -152955
14386 -152955 -127858 -131336 -110433 -102923 -3852 -50033 -145329 -80086 -58275 95304 166105 42165
14374 42165 129925 68037 -29160 28592 -57799 -145095 -30717 73017 164401 32566 -37393
14363 -37393 -15070 -26302 -23741 -76950 31838 173954 230127 44644 88581 113797 126075
14352 126075 119834 154512 162797 57840 148785 19184 -100098 -246082 -259681 -277568 -287735
14341 -287735 -123579 -187286 -357950 -264081 -54310 93200 162420 209048 -3517 -225520
14331 -225520 -318889 -145515 29907 170837 54691 -128396 -20319 89644 34666 26537
14321 26537 88818 123125 86493 -113648 -82920 8882 138076 48337 74260 119590 -31231
14310 -31231 -60242 -70944 79146 270031 172010 143239 -23521 -63408 133064 248148 196325
14299 196325 120019 64930 186749 20672 -110849 -7506 -91965 -60248 -18162 153548
14289 153548 244558 296086 146048 10346 -17107 -113709 -205315 -148101 53971 90435 25476
14278 25476 -34628 61273 12882 45040 76940 89344 -8746 82950 24305 -136619 -160117
14267 -160117 -64976 -174363 -299989 -333965 -218726 -70002 -84699 -235276 -207246 -167970
14257 -167970 -30154 61090 15675 28274 -29659 -56358 -31600 39951 215004 240134 180078
14246 180078 125508 213450 194208 371889 279222 88189 9856 37506 35223 -60244 -49607
14235 -49607 -91576 -10096 71420 1374 42943 205850 234674 166217 178767 94332 -144429
14224 -144429 -223938 -270136 -315220 -201184 72995 96039 -54917 -165407 -32266 68950
14214 68950 -47079 -135723 -79715 -100575 -150878 -242622 -224439 -101075 37004 81682 -30287
14203 -30287 -122631 -235846 -207205 57589 234331 265795 135899 50349 -62266 -153821 -215139
14192 -215139 -244762 -126172 -181230 -312312 -268292 35104 108265 92247 97001 162617 301999
14181 301999 311214 333421 207189 -17831 -149379 -110669 -90655 -160591 -169798 -93252 -88363
14170 -88363 -69502 -52582 138105 251850 88648 -165454 -259261 -254308 -228891 -312796 -327603
14159 -327603 -429402 -377275 -143110 -81713 -543 -107724 -202733 27082 167408 282079
14149 282079 188180 4744 -111221 -171849 -184686 -209884 -209663 -89230 13857 20685 39191
14138 39191 78980 15676 -96627 -95665 -119653 -98681 -43725 -29134 -9493 -161289 -306147
14127 -306147 -369547 -277953 -272946 -213019 36672 111704 129586 -58041 -154369 -136012 -52775
14116 -52775 52441 42637 -176942 -210019 -207535 -206307 -36771 -27361 -11244 56857 121502 46359
14104 46359 -71902 28279 93803 23380 -45570 -322940 -342599 -349513 -247380 -81899 17783
14093 17783 -11925 -37935 -96981 -40884 -26124 -117090 -124429 -99565 -120988 -55228 -186614 -2695
14081 -2695 176048 200930 122803 160098 185448 166560 70043 122264 182939 56273 44483
14070 44483 -8876 24774 -27386 -969 82671 224673 70983 -29060 -62534 -25810 29549
14059 29549 143424 182482 209418 71850 -97825 -216835 -298136 -256182 -168543 -203476 -141843
14048 -141843 -15342 -39266 37830 31229 -134521 -106829 60986 79546 193636 12941 -18784
14037 -18784 -24982 -58650 9826 65993 64784 35977 45142 181089 142642 178037 297495 393187
14025 393187 334496 218223 144862 68443 -84573 -167878 13803 120633 292630 254611
14015 254611 14580 -103292 -67058 -20441 -34645 -146994 -180654 -206607 -190810 -232580 -342777
14004 -342777 -272429 -206988 -215191 -216837 233812 337406 253381 45134 -56884 94165 253189
13993 253189 273647 124257 -38797 -162844 -162085 -172454 -210865 -112420 -12903 43028 212071
13982 212071 268372 148618 191746 116619 44037 49034 -44057 23599 92136 -129899 -79919
13971 -79919 -113555 -151862 -338045 -383781 -253372 -10759 102517 66970 -25643 -21986 -61146
13960 -61146 -194981 -352496 -277921 -58579 171985 283997 223587 177212 81985 74340 -22661
13949 -22661 -156688 -83464 -56687 -3117 -95667 -124345 63121 130996 37514 147154 44018
13938 44018 -17797 -49498 -38039 -19942 -24040 -34168 -100962 -67112 -93074 -163804 -132935 -58488
13926 -58488 -36375 -104836 -92157 -89388 -151385 12394 41866 -24618 -148447 -244213 -243792 -188652
13914 -188652 -142609 -127522 -27384 -172132 -209800 -203739 -106492 8847 71429 223086 184544
13903 184544 137092 -31099 -143340 -82816 -37781 -70038 -138793 38681 128208 178577 254002
13892 254002 215475 78317 72664 -167479 -244909 -32230 11391 -37528 -65961 12262 185126
13881 185126 200488 158866 113975 -86203 14801 -39306 -50169 -63167 -113517 -191240 -67781
13870 -67781 95545 23169 12413 176618 145957 57090 70263 54395 68109 177213 71017
13859 71017 91956 61485 -43516 50922 -55443 -231374 -200805 -167751 -160322 -119676 40698
13848 40698 178584 110630 135580 92909 154109 160321 -26546 -42575 -43351 -186726 -176036 -90720
13836 -90720 -79019 -40412 -133599 -246370 -155026 -48064 -115631 -31166 137833 112741 -14446
13825 -14446 -223682 -218560 -321174 -239692 -69534 -117788 -115649 1769 -11944 -92536 -211158
13814 -211158 -255850 55160 76995 78810 -112059 -304584 -375239 -286193 -72206 -63285 4940
13803 4940 55339 -11675 -100048 -146100 -153481 -80486 -113067 -117527 -30009 68403 111199 184485
13791 184485 78327 -21200 -134690 -253420 -274881 -132557 -96082 -79431 -72881 -137366 -209665
13780 -209665 -208910 -178892 -317133 -184846 -95346 41392 127508 21420 -80097 -193187 47030
13769 47030 167790 42823 38770 -63959 60159 -111120 -152572 14385 146808 250636
13759 250636 186308 32491 91218 -110029 -100477 -61086 -155377 -89521 -77985 -100706 -100369 -43644
13747 -43644 -94998 -215913 -172140 -169131 -143029 29490 30808 109883 173183 57009 -178946
13736 -178946 -194974 -115945 -104883 -30810 -43822 8004 -63948 24114 -82089 -237524 -185680
13725 -185680 -11541 6921 -144257 -184701 -230905 -198907 -121250 22834 76657 -95383 -52766
13714 -52766 9356 206213 195585 320471 112014 -43741 -66491 -15193 -84594 -147679 -65058
13703 -65058 80121 18163 -106042 -124331 -75594 47037 24536 99986 67667 -118232 -223686
13692 -223686 -411941 -393019 -374358 -220223 -196777 -323906 -288540 -198596 -219451 -293414 -270140
13681 -270140 -308794 -269867 -187186 -69938 96829 163642 190619 148183 111259 -65712 -31320
13670 -31320 99433 269332 242684 164966 31202 -146984 -212006 -291283 -262090 -213003 -101067
13659 -101067 -19993 124438 220785 221350 225423 218502 101525 63050 -27890 -139917 -130417 -66321
13647 -66321 110916 211946 172801 175101 -26562 -73959 -100755 -166515 -248421 -258453 -142913
13636 -142913 -124173 -72338 -51494 -47345 -147493 -70565 -141673 -202413 -155664 31847 36380
13625 36380 -41748 -131419 -29170 90898 -4216 -44122 -5639 150216 190426 14566 47524
13614 47524 65440 103540 -45793 -20880 48314 39009 72376 264702 253527 158230 -348
13603 -348 -105788 -151699 -203189 -219783 -210238 -133549 49982 -11906 19987 13355 -272024 -56542
13591 -56542 149554 80874 21081 -48585 -116314 -134148 -68963 13842 113240 118141 21871 -28425
13579 -28425 -71931 -120474 -143583 -52316 -51284 -178642 -207908 -325103 -162619 -167370 -35431
13568 -35431 76707 46257 -58457 1391 25074 110862 144299 174553 -13943 36562 -19759
13557 -19759 90927 -60154 -186461 -169767 -139760 -195892 -184698 -80305 83892 275871
13547 275871 284406 124364 183594 135323 38105 120691 149448 2530 -182632 -73122 -207672
13536 -207672 -197814 -267027 -309971 -157518 11696 99438 108590 48758 55426 21298 -109137
13525 -109137 -60637 69930 -24182 76690 159930 -7672 36484 201799 238502 232802 204182
13514 204182 140499 137645 -23717 -23231 51427 44619 43894 -71926 119684 98985 84475 105758
13502 105758 89102 138028 236272 259195 271879 226752 61338 -4546 24508 70293 131534
13491 131534 183192 338242 244430 78720 16951 196256 302498 264500 -136149 -216409
13481 -216409 -215504 -412957 -298473 -51470 8006 -161805 -184673 -153925 -105975 -262466 -333571
13470 -333571 -224518 -98865 -131708 -88545 8822 50252 59052 155877 299091 341404 186475
13459 186475 26935 -719 -54559 -150432 -135095 -190453 -343443 -397147 -439203 -225014 -38819
13448 -38819 -38340 -16974 111279 188291 220950 119208 -45998 -77685 -79619 -201261 -243829
13437 -243829 -215236 -244529 -54648 57744 65092 155296 123901 -77033 -207295 -334641 -441564
13426 -441564 -391646 -350372 -89770 -11503 30751 16324 -7977 46262 147023 138315 105172
13415 105172 262668 214526 167686 69617 97535 230821 164159 65528 -70047 -54039 -65132
13404 -65132 -78470 -155396 -214070 -289487 -43079 67887 88136 211534 219757 108805 165444
13393 165444 190045 -4036 -122288 -117285 -21296 -227277 -321971 -190132 -30648 -97274 -330441
13382 -330441 -249068 -4937 71117 182841 205141 148360 81674 124768 91386 145552 177362
13371 177362 138890 138619 141620 140371 78035 194155 393351 262636 105162 -27703 -106129
13360 -106129 -62345 58594 215163 37945 -110481 -185127 -307128 -186701 71759 -40666
13350 -40666 -33777 91478 76951 70678 136144 203097 165956 16778 -85446 -70226 -2294
13339 -2294 33178 -86243 -231328 -229723 -156563 -109546 -21044 -93412 -30118 -19242 -3428 39346
13327 39346 170214 126357 -121361 -172942 -116301 -28242 -78974 -85637 -31171 -40133 -75336 -187327
13315 -187327 -241234 -202448 -92995 -2187 -69154 -91429 -107773 84068 192749 174501 166949
13304 166949 147729 221161 257870 123964 127983 12793 -3895 -12248 -67641 -77287 -142869 107876
13292 107876 182376 29702 -86478 67209 59767 12541 82917 295036 271145 32807 19520
13281 19520 95436 224217 141092 -13092 112987 186970 229871 151783 80784 22856 -27685
13270 -27685 3689 245015 239929 18135 128932 131086 137667 23077 -67950 -136371 5873
13259 5873 -34489 -37626 -2694 -20179 -113428 -215218 -244322 -273243 -266715 -287726 -153498 -57212
13247 -57212 -18874 64746 13468 -10445 -46875 -144006 13083 233439 248623 182912 113208
13236 113208 82373 108603 23894 -21410 -155655 -316977 -220386 -139431 -211030 -202262 -246633
13225 -246633 -228989 -103620 12449 52544 3727 44462 226778 270411 183636 80933 -40800
13214 -40800 15530 170073 197040 158381 125371 59773 -49553 -161397 -126554 -83506 54544
13203 54544 30871 -8104 -117081 -181654 -108628 -54478 -41513 8760 87101 -28798 -162264
13192 -162264 -207905 -199269 -163078 -74586 46019 176237 161859 103045 96054 159101 122552
13181 122552 3559 -37698 -156577 -252875 -174414 -61493 154395 238889 239594 230258 189152
13170 189152 290898 226645 100040 28038 14619 -31781 38269 26921 -68597 81028 -26590
13159 -26590 -104851 1223 94802 183772 170762 86623 -2538 158785 186163 178028 303585
13148 303585 314959 265336 151548 94174 130498 -18672 -50306 -253897 -194370 -88913 -147088
13137 -147088 49036 142650 -54529 -147192 -71915 -42120 -81241 -68456 -85914 15190 234891
13126 234891 318742 239275 142510 128564 245570 185270 101092 123231 235637 236197 228371 134172
13114 134172 136570 158491 156802 222503 116797 -35783 47503 170606 55973 81908 171282
13103 171282 134184 1008 2733 -2662 100781 76449 280 134200 60578 -69286 -31797
13092 -31797 -85639 -147443 -42654 -93406 5138 80416 -73210 -18970 41631 -103016 -108947
13081 -108947 -148869 -116985 101217 49988 -144029 -97076 -54990 39193 66770 11760 25911
13070 25911 112568 41078 -72971 -48965 39713 126872 108591 66620 -29197 227019 212751
13059 212751 282292 126236 27692 84914 20809 -21462 17648 87606 99950 57814 -24001
13048 -24001 -19154 -94362 -133924 -181630 -119713 72149 95966 129811 131874 127221 319084 509829
13036 509829 430901 362001 262965 253709 202946 313441 406278 270842 -12243 -130521 -45609
13025 -45609 -137773 -71540 81647 115383 10571 18646 -64705 -53257 74692 108081 113821
13014 113821 222922 262673 432568 306234 114735 135734 168177 215920 127158 112454 143745
13003 143745 173639 72872 277381 244125 86422 74602 294706 411382 253042 98665
12993 98665 139829 155106 178352 145259 94039 95692 -24743 151696 226460 200854 26132
12982 26132 -195453 -221033 -45419 129427 204479 156310 86094 53733 -32565 40841 210229
12971 210229 193491 217255 149167 126125 104261 90949 -17385 -75541 43901 38170 -42042
12960 -42042 -9677 124168 172948 185665 148148 41664 -53890 4213 196395 322265 408278
12949 408278 401128 293886 111757 61728 172556 205501 258197 284120 133381 158398 279305
12938 279305 327450 264942 225077 139836 154129 45265 80487 8873 -267376 -287041 -186626
12927 -186626 -103349 -171420 -271186 -7339 281678 250226 186431 99955 -93374 95106 91606
12916 91606 -99454 -71982 86788 85137 47094 157703 246829 227413 198408 135749 -544
12905 -544 -2870 1177 -41 -71223 -112463 -78198 -196601 -220505 -49320 173470 175841 101986
12893 101986 190274 313535 242080 193205 256804 242054 309112 206536 82377 150338 157509
12882 157509 112639 84794 69607 10860 -69526 -156528 -51866 19772 1707 112292 97424
12871 97424 4483 -71411 -112353 -94139 22415 112640 176881 34960 -28371 40420 178307
12860 178307 214799 279821 164524 20867 -4630 29298 34185 -183112 -188770 -138406 -152045
12849 -152045 -175518 -119183 -25911 121811 200152 135446 60824 133448 152383 216925 124063
12838 124063 -21394 -122601 21623 238674 451288 273396 179436 196566 42423 -32049
12828 -32049 -180301 -216248 -71868 7868 -53802 -18183 -14837 315677 478931 355781 173433
12817 173433 176638 230645 304712 496366 603580 630818 796079 875031 825171 872682 762455
12806 762455 645908 671622 602082 545139 526318 571986 414870 281657 325840 273660 139913
12795 139913 54761 107135 178936 185885 183577 193556 284637 151843 -34394 -35510 1582 135570
12783 135570 368956 409161 412711 301841 243938 243787 368608 298496 132866 47352 70309
12772 70309 43513 63188 135882 96156 48991 57371 303303 365933 363919 382213 424766 344911
12760 344911 300534 272815 184471 268713 436662 464553 391701 313614 388230 454631 444688
12749 444688 322140 303968 476187 509223 414300 392110 307328 273991 340370 280136 258372
12738 258372 310336 341991 447720 338749 275085 369814 343344 314432 269353 237235 268960
12727 268960 298613 167509 141933 -17355 18028 116954 250422 331112 359408 373964 276317
12716 276317 295231 221610 122621 121116 134871 179433 234966 269126 398506 316240 197021
12705 197021 181409 220073 153356 93623 -6722 -142503 -138982 -30589 -605 83230 190955
12694 190955 202073 285910 339133 249791 168254 96328 135826 171325 137369 98355 104321 191449
12682 191449 226086 246144 236836 169694 202015 225818 177728 72421 218481 302055 86675
12671 86675 6087 -121364 -204012 -102307 1511 85228 45246 -1892 -47505 -88997 -76725
12660 -76725 -9923 150417 169541 133029 166337 88106 -145732 -19691 156021 97173 74013
12649 74013 195354 161212 389183 472792 283581 276408 179213 166230 265632 322195 232711
12638 232711 342473 469259 410395 304978 327803 210564 139413 217805 433404 452972
12628 452972 386993 364612 260520 156365 123498 189970 267554 434480 358012 245537 191916
12617 191916 241359 269113 195055 180610 282763 373041 260922 254547 356434 267589 279934
12606 279934 477964 522778 503187 357896 325265 117035 159285 346136 368081 366975 334192
12595 334192 265531 109714 77523 159267 230912 295631 397158 569255 605603 551836 404509
12584 404509 340826 378001 260375 207510 323938 364615 425088 384535 128537 -12480 138851
12573 138851 283245 177563 64791 166104 199722 305449 455502 535091 417538 219643
12563 219643 278245 319037 367391 490895 516553 389427 344318 413474 473732 471622 362596
12552 362596 285984 389952 535065 494402 488114 430158 498042 504966 398611 405017 470302
12541 470302 446799 451189 523762 521956 497749 338565 384821 448436 536044 523781 385369
12530 385369 429316 507150 309163 149063 266623 351724 328067 200342 326346 453989
12520 453989 393942 343871 329156 374916 276219 324832 457216 444781 272105 289718 342837
12509 342837 222833 255116 177708 136265 253482 288812 362212 376362 398738 357070 386538
12498 386538 389137 457165 254371 235508 278449 275692 378190 314958 399430 430135 357293
12487 357293 319306 259079 540373 549698 510018 430642 205725 296558 463791 442610 423992
12476 423992 292215 270858 180843 209106 214041 385936 485658 482248 449495 493400 533885
12465 533885 513460 637808 667861 573174 547406 525143 563360 496355 558858 389161 244954
12454 244954 342403 546941 459232 339507 277984 228209 212333 457386 395160 176725 246679
12443 246679 384143 488566 521200 544302 575436 405172 332625 362720 429255 255787 261392
12432 261392 289364 278600 231426 284523 326026 380376 281313 328924 413392 468777 376259
12421 376259 388339 462150 398772 420764 464144 546044 590146 635407 571925 589613 503810
12410 503810 557900 773012 886084 767433 712534 890933 837601 638205 561291 596934
12400 596934 709280 754557 653930 450673 488892 581543 620137 745877 838530 637022
12390 637022 606099 491089 516253 672413 600707 472217 457527 446681 435254 389169 403485
12379 403485 585444 565429 390230 421246 389982 566763 761355 665681 607236 630357 619077
12368 619077 501635 572221 667559 700970 679997 749173 753519 906380 897340 732536 746675
12357 746675 905050 797325 610769 732775 854490 812602 716760 806125 750652 749326 779687
12346 779687 781559 579784 414112 659745 767375 550617 505475 683941 567381 517790
12336 517790 843289 1036635 1003251 926417 920933 863209 810195 861621 881658 799991 760701
12325 760701 829818 806598 759717 808686 906526 927534 879118 836447 994217 1049576 947239
12314 947239 858568 853274 799978 773722 847823 973152 1055127 1103218 1108889 1074695 1102670 1164830
12302 1164830 1224769 1216671 1009888 1058821 937280 920201 918522 945226 892841 988205 983568
12291 983568 1045744 1035584 1042299 1163598 1020319 844185 920042 1046710 991950 843308 804230
12280 804230 1051076 1167287 1170077 1292161 1426509 1207264 983733 977899 1089803 1220295
12270 1220295 1308026 1306179 1323479 1422853 1542673 1602794 1445516 1368911 1455570 1466917 1578314
12259 1578314 1637944 1571402 1454602 1328344 1384722 1499624 1498765 1439488 1252864 1197228 1285204
12248 1285204 1383303 1440409 1600022 1583610 1384124 1428192 1570199 1574331 1512805 1411395 1408370
12237 1408370 1444182 1491233 1501372 1399704 1314192 1441663 1535354 1572705 1471318 1690758
12227 1690758 1721093 1777058 1843708 1616498 1572082 1740375 1797867 1768165 1657517 1688556 1693360
12216 1693360 1698451 1748479 1665110 1626242 1642828 1576172 1671517 1806214 1885569 1787334 1740728
12205 1740728 1814199 1836665 1757839 1915514 2101079 1926119 1756991 1691500 1819684 1989200
12195 1989200 2007538 2070564 2134351 2060816 2031766 2111358 2126223 2165165 2219373 2149680 2074822
12184 2074822 2201023 2329331 2307178 2248573 2192764 2181110 2312874 2381169 2373389 2393911 2394220
12173 2394220 2498561 2584455 2682446 2645400 2478338 2417868 2429372 2469696 2354279 2357371 2464843
12162 2464843 2605927 2734487 2816132 2748356 2675117 2588800 2734329 2748785 2774998 2724460 2804813
12151 2804813 2912807 2991395 2829298 2883128 3073866 3157144 3258904 3332955 3278383 3252979
12141 3252979 3107023 3052528 3247404 3324930 3345761 3363906 3423835 3550295 3602800 3405545
12131 3405545 3329510 3291928 3404421 3555179 3627126 3622923 3550108 3673291 3639344 3573733 3525993
12120 3525993 3694476 3872670 3863573 3886426 3831519 3826576 3888178 4029644 4142174 4234388 4221361
12109 4221361 4274765 4214414 4156627 4186339 4326754 4370618 4356910 4393524 4501777 4633614 4674324
12098 4674324 4717294 4829538 4909765 4929613 4898628 4918089 4903058 4946391 5044184 5077733 5139283
12087 5139283 5146428 5155953 5138851 5138445 5308755 5270860 5324639 5519169 5691971 5803849 5814565
12076 5814565 5894210 5952720 6113882 6213410 6209689 6163809 6235833 6165720 6142048 6322670 6442455
12065 6442455 6432297 6589266 6723899 6802523 6943974 6955848 6966864 7085680 7308348 7543196
12055 7543196 7364433 7431087 7634740 7872155 7943197 7922409 8048604 8439005 8580984 8612335
12045 8612335 8613796 8691000 8725627 8913169 8872872 8940313 9314971 9556105 9602687 9850822 10109986
12034 10109986 10117899 10002130 10133890 10393589 10523609 10652443 10747733 10938086 11230815 11404878
12024 11404878 11633323 11861581 12106505 12129376 12069552 12182196 12296166 12534740 12840995 13078422
12014 13078422 13259159 13595193 13801985 14023281 14410283 14591061 14674464 14849472 14930211 15073106
12004 15073106 15288507 15632627 16273241 16862704 17185768 17274349 17575771 17766950 18137535
11995 18137535 18360063 18458468 18675548 19057188 19366066 19584704 19827290 20273743 20740428
11986 20740428 21216165 21672880 21993098 22215900 22437560 22698991 23143009 23631758 24149099
11977 24149099 24550030 25129002 25488594 26113914 26535149 26880002 27341735 27674738 27933965
11968 27933965 28233472 28714338 29282936 29767862 29983680 30242493 30719420 31351874 32016513
11959 32016513 32479022 32854297 33303143 33701838 34162260 34686759 35030276 35439707 35880993
11950 35880993 36351103 36856639 37483230 37896120 38178285 38610539 39049173 39287468 39682621
11941 39682621 40210023 40576869 40948427 41227988 41354758 41557937 41720139 42112261 42428056
11932 42428056 42596034 42740045 43074134 43190514 43203810 43149622 43174683 43074782 43159652 43189781
11922 43189781 43110600 43074021 43175231 43234333 43020725 42897004 42624265 42272066 42108343 42011809
11912 42011809 41755254 41323807 40799546 40419327 40153133 39726891 39446023 39281667 38878741
11903 38878741 38342322 37987340 37538436 37110009 36809692 36436934 36023436 35542795 35237428
11894 35237428 34774842 34255268 33798560 33483693 33144127 32699112 32045020 31377456 30779234
11885 30779234 30179066 29632826 29215047 28920210 28608542 28180851 27782434 27306860 26848533
11876 26848533 26267661 25924497 25614076 25271179 24856997 24392142 23954609 23535987 22950122
11867 22950122 22580650 22266646 21912742 21529860 21187579 20810413 20499252 20093339 19667552
11858 19667552 19369557 19180596 18841927 18486897 18263812 18045617 17786004 17520277 17126823
11849 17126823 16722221 16421944 16218344 16007461 15652787 15529903 15313261 14939399 14712178
11840 14712178 14593054 14406269 14195064 14038907 14040829 13868237 13594396 13324441 13125800 12936359
11830 12936359 12742311 12534869 12297957 11958013 11687094 11466705 11320406 11374449 11268073
11821 11268073 10967454 10814842 10723217 10604660 10243547 10050806 9985165 10050076 9845465 9741941
11811 9741941 9444920 9231718 9189928 9018207 8733984 8484572 8529369 8673987 8620908 8574233
11801 8574233 8433970 8222934 8179053 8113458 8012405 7837558 7764846 7645585 7532009 7422284
11791 7422284 7492927 7545564 7441086 7213043 7013969 6893999 6748958 6791360 6793426 6690416
11781 6690416 6722969 6636020 6437926 6302806 6193871 6188114 6089815 5969254 5875095 5708119
11771 5708119 5625115 5643587 5675110 5662104 5494006 5414426 5423236 5368346 5254287 5190110 5077549
11760 5077549 4834161 4808478 4967436 4901011 4812541 4816649 4802360 4673370 4689161 4815179 4762857
11749 4762857 4707218 4674151 4624851 4539545 4483365 4284274 4152294 4075409 4011028 3933697 3857439
11738 3857439 3836622 3732661 3788240 3883670 3889307 3944356 3868482 3929713 3866659 3679995 3579034
11727 3579034 3580835 3631190 3691746 3543894 3445516 3538949 3573805 3609113 3523570 3343708 3454127
11716 3454127 3465008 3217911 2984601 3129642 3361961 3395258 3286860 3110108 3014834 2998037
11706 2998037 2982173 2913767 2829524 2761907 2773873 2704144 2519530 2637332 2699430 2615440 2557625
11695 2557625 2421213 2404220 2659743 2678281 2689472 2788875 2710712 2608993 2524764 2432382 2293394
11684 2293394 2421320 2543236 2674255 2726805 2661095 2550453 2399943 2285837 2252200 2310288
11674 2310288 2253888 2072803 2210967 2464518 2427438 2270308 2281939 2351771 2327033 2256887
11664 2256887 2246666 2055902 1966465 2139113 2143717 2091229 2098101 1935401 1754635 1865162 2107309
11653 2107309 2050797 1940529 1974324 2016467 1999968 1927246 1862539 1908244 1882262 1899361 1902029
11642 1902029 1968403 1922673 1908230 1894816 1819533 1781016 1785710 1685224 1752246 1621037 1672465
11631 1672465 1783172 1916705 1868725 1773826 1581703 1574696 1755492 1757494 1611617 1623791 1636916
11620 1636916 1586155 1647484 1687708 1511606 1453160 1574251 1627698 1712461 1778078 1758861 1775096
11609 1775096 1574254 1382945 1468429 1532115 1614214 1615979 1482859 1562293 1632489 1652740 1745827
11598 1745827 1716440 1650355 1565077 1509651 1510154 1535256 1447159 1316954 1153443 1113400 1175948
11587 1175948 1216941 1308704 1239019 1105578 1072552 1162729 1399139 1392792 1306152 1306863 1228282
11576 1228282 1276491 1254131 1096941 1004573 937234 904580 1023045 1192989 1250204 1257877 1102241
11565 1102241 818505 871021 988512 1017653 1106396 1039133 1170836 1174625 1143730 1141091 1251435
11554 1251435 1279245 1204662 1145708 1124359 1172660 1225501 1117801 966857 950031 1116267 1116765
11543 1116765 970015 899745 920607 914107 908666 941822 884731 832062 772552 873891 1094199
11532 1094199 1071464 817520 764034 762780 832670 805041 841366 925772 981497 968181 943405
11521 943405 845239 715171 631398 733209 859987 786539 790247 793414 867516 803921 792363
11510 792363 817043 860407 799193 569600 577449 690561 877389 997129 991082 865633 1046796
11499 1046796 1113426 961303 778165 647751 505999 415483 501853 566708 527572 503149
11489 503149 527773 542994 643079 687187 640232 657905 722967 650012 756622 761991 572600
11478 572600 600044 677862 872285 823093 605533 599302 569656 450248 386851 475560 440764
11467 440764 550904 711035 737857 771887 761959 652543 754218 647033 526831 489372
11457 489372 405405 647242 786667 568607 333254 354027 525204 657140 610832 638051
11447 638051 747875 723861 797057 854285 766798 614027 520296 535603 575210 401225 347650
11436 347650 419335 554928 492584 547174 583718 524858 516034 492958 474273 476690 370257
11425 370257 458346 535172 581531 600420 608799 496727 544638 762585 644310 387263 407788
11414 407788 393930 374321 578614 542880 533429 640834 513373 562521 757650 709859 594512
11403 594512 548101 637098 526569 465756 428876 356002 422914 431414 592387 670325 648834
11392 648834 483428 421323 302356 234941 151390 300906 510984 387570 404444 484694
11382 484694 376213 269627 129128 158583 394661 396668 381656 445245 471814 288643 283906
11371 283906 271317 219966 153678 84965 90458 154942 138350 320954 373926 398096 473829
11360 473829 379351 338054 430065 404521 434201 394314 453325 295629 252630 276579 279213
11349 279213 457839 531328 452529 432068 463540 458400 333835 208223 170122 125450 204780
11338 204780 194492 109334 171145 231320 161812 156888 195817 295457 320888 451363 371005
11327 371005 234575 231381 403289 280555 257147 375482 401028 395434 321263 254708 79863
11316 79863 61439 262850 359598 248977 75159 31254 139714 216884 237634 266503 211346
11305 211346 159026 345675 447028 342185 331810 330089 197421 154607 289521 222985 54510
11294 54510 139172 110140 125914 186358 319402 474678 391863 102951 44589 35140 -32809
11283 -32809 -1007 109504 247953 354817 426690 351061 269794 177212 156882 345061 463450
11272 463450 385881 413050 449483 546639 461980 230258 285880 289993 217823 229227 223882 251236
11260 251236 281966 203576 270595 357055 374307 421485 316038 330918 496314 503437 406796
11249 406796 305822 314553 329522 272850 99501 139598 246058 279318 322146 320836 350079
11238 350079 292064 189022 80699 -62594 92632 399489 395093 224027 263774 302566
11228 302566 206257 252989 145904 71359 220188 280408 235803 248638 372051 452123 382737
11217 382737 335932 268658 102474 133373 140375 210259 238547 440723 397822 313265 264788
11206 264788 238624 227011 389327 487540 377581 289314 214155 298399 458091 491821 358881
11195 358881 252428 260292 327137 308074 249381 147768 122838 102316 239103 219294 44983
11184 44983 56379 34322 15983 144855 270148 368552 361585 393568 398450 491190 485854 330568
11172 330568 181277 63835 146568 206007 119178 244926 291331 406003 535345 405638
11162 405638 371709 476176 489596 541920 423045 279582 219794 49527 -53421 133479
11152 133479 171855 4904 -39628 160319 309405 287296 321471 407809 360156 330696 225319
11141 225319 54416 71090 113069 178894 201456 216315 252675 172323 69334 -100913 -135229
11130 -135229 159150 179545 310118 293796 234672 322376 152318 21086 79019 131926 108618
11119 108618 110146 250858 344711 312481 322039 248414 179758 157393 233494 202774 214135 164705
11107 164705 128734 163438 50245 12289 26863 -9560 -7152 -819 116004 257654 278839
11096 278839 338630 295962 319821 278561 262601 101496 19294 -7940 173176 229824 197688
11085 197688 112397 16723 -8490 80151 126686 192556 254898 20470 -70923 -108983 -55649
11074 -55649 -80062 69907 96858 154186 97525 122118 49993 -75586 -90130 32534 36062
11063 36062 55136 112347 156659 83345 42385 -126884 -74745 68734 167183 162306 168981 208103
11051 208103 181792 260432 379494 504670 737694 688079 544445 532718 557881 413464
11041 413464 325762 437059 614613 758840 868962 987107 999100 981363 981636 1017076 932387
11030 932387 832067 883749 874170 812433 763379 879065 1012290 1156286 1010789 908870
11020 908870 1004430 1096486 1065762 1050697 1154600 1116512 1073311 974192 977814 991702 1155856
11009 1155856 1098951 956967 933092 980351 901472 990172 854305 716994 554837 392423
10999 392423 491299 680979 645714 496801 548074 391578 269721 269107 227588 240861 339391
10988 339391 423680 348865 347364 467893 445696 322813 170625 215152 212809 263011 380948
10977 380948 375246 246339 267403 158360 31838 -131583 -110245 16908 94937 151355 275557
10966 275557 353553 171222 -20503 -87328 -216699 -252695 -118096 43737 -55543 -128092
10956 -128092 18699 171844 213329 154298 387575 425509 216131 349023 371964 344544
10946 344544 381073 268863 231467 228647 203253 88044 -47556 93246 112804 -10897 -265533
10935 -265533 -288638 -183272 -146383 -168165 -169567 -8754 75478 30053 -18707 -68802 13134
10924 13134 62658 113862 13702 73790 269663 440181 339359 232383 161136 184307 77529
10913 77529 -33734 15842 43052 38353 125125 138255 74405 -12297 -22323 -28608 99589 263201
10901 263201 252908 149627 98572 214506 326309 202624 169578 250246 142552 -7793
10891 -7793 132577 138599 220049 213038 233044 111409 109570 94090 13328 -13492 -45193 -22932
10879 -22932 -28606 202401 240355 188224 120858 29073 295255 313883 290520 299124 180964
10868 180964 147385 164794 -37596 -193266 135789 82736 69088 151509 180316 216752 168202
10857 168202 194102 187404 101002 98950 207727 104060 6266 127871 235762 186595 161727
10846 161727 178914 188879 218983 339906 278276 194376 98972 12972 -40093 27125 -54552
10835 -54552 37477 75194 21063 70528 92206 115692 218749 226274 231350 40924 25718 143411
10823 143411 79415 16229 278947 363960 388616 308413 143446 43979 139943 203378 152037
10812 152037 197520 70605 89953 386643 558696 397510 251622 279404 204514 28922
10802 28922 83636 139579 305937 421994 353289 314195 176095 95951 24235 -91726 -13789
10791 -13789 158330 218152 224807 138171 68313 219497 259359 208125 14205 -152843 -39662
10780 -39662 -3498 130486 177748 153730 250242 372306 274026 256778 328805 391346 426419
10769 426419 380545 434756 460499 469911 400396 368612 364590 103722 74875 151190 178986 245639
10757 245639 256044 318588 440601 443819 453147 612282 541076 315901 137539 200302 275515
10746 275515 411280 451678 414903 453950 537138 427175 377607 287129 209728 42409 108984
10735 108984 214749 309288 429134 428478 510285 644514 526827 443651 366339 355034 345910
10724 345910 403578 294557 235138 342049 312342 326011 377530 445495 360837 259249 221641
10713 221641 252283 521574 620086 675651 626102 379073 263195 256650 487518 452234 520613
10702 520613 771983 824900 757576 667782 696338 762869 670869 706347 697609 691428 761036 877325
10690 877325 1003453 964314 881906 850363 625394 559898 537013 620924 623336 736752 874695
10679 874695 894198 934420 903981 888286 1066394 1162331 1299664 1348343 1336819 1156222 1048796
10668 1048796 1143331 1322660 1358850 1517788 1539792 1541542 1516913 1523557 1704374 1815868 2062343
10657 2062343 2254493 2233811 2352250 2455669 2367821 2391093 2519603 2735584 2818683 2940828
10647 2940828 3168516 3324113 3430900 3663407 3873233 4050091 4085051 4382225 4648481 4948185
10637 4948185 5337151 5765101 6256112 6662952 7328311 7892991 8564338 9403528 10262261
10628 10262261 11249310 12238048 13616567 15181126 17323100 20043868 23452371 27775330
10620 27775330 33120617 39419176 46613102 53916597 60359813 64692977 66827831 67965248
10612 67965248 68883593 70838340 74331556 80040545 88243198 99092797 111974042 124751019
10604 124751019 134777612 139397410 138426989 134464292 130507773 128507017 129676315 134563623
10596 134563623 143616730 156134391 170509262 184024284 192368670 192530670 184416471 171950667
10588 171950667 159650436 149824979 143294287 140189166 140814081 144564326 149732386 154054577
10580 154054577 154701423 149556845 139351462 126643891 114490798 104471562 97011225
10573 97011225 91910895 88838947 87266010 86395103 85025418 82083316 76857264 69850723
10565 69850723 61944477 54302100 47534809 41754700 36866329 32807804 29505378 26703580
10557 26703580 24111228 21843098 19878572 18187423 16678358 15188171 13793910 12525592
10549 12525592 11379758 10465877 9834423 9051276 8420075 7810679 7352906 6971674 6664896
10540 6664896 6226717 5678271 5202396 4861400 4597360 4431686 4284824 4126329 3984308
10531 3984308 3833848 3379499 3299943 3164832 3021283 2937347 2752147 2594346 2566639 2534314
10521 2534314 2442054 2265490 2322380 2346368 2173198 2048013 1967477 1930675 2068860 2063147 2090155
10510 2090155 2010040 2000365 2024846 1956059 1777512 1536457 1491524 1440140 1615375 1611227 1489168
10499 1489168 1314358 1318043 1160282 1086646 1142617 1306092 1361864 1414877 1387551 1253833 1132463
10488 1132463 1084189 1234869 1418085 1392907 1228717 1178001 1223890 1278982 1128702 1172077
10478 1172077 1097270 991193 948814 978908 890187 989553 1093734 1130604 1152316 1145577 1124058
10467 1124058 997818 849456 855771 839300 831225 842005 662067 654725 878829 1012010 1077975
10456 1077975 1097597 988009 863764 883542 1033790 936451 905901 991302 941300 750237
10446 750237 676121 612080 573910 651438 666188 428813 411821 515246 496463 550568 590853
10435 590853 605227 585366 513693 514216 552471 543985 516738 374868 457048 702647 821848
10424 821848 737373 671449 683570 638885 638407 688999 753491 660215 475792 397931 195119
10413 195119 128104 331347 498053 404879 363043 376552 323552 314196 321640 431519 559746
10402 559746 583239 457589 330504 165093 4293 94221 241200 309310 366241 297799
10392 297799 291405 377197 317004 55103 -5937 59829 162973 119217 125366 168011 129205
10381 129205 19470 122632 255461 175441 123706 202857 393868 434779 486424 389687 443543
10370 443543 362646 446338 346540 178271 216024 249315 343671 539784 515877 413321 401001
10359 401001 369720 346275 452749 393117 299175 113727 210989 377082 357961 339501 322216
10348 322216 168929 50683 91969 226105 252855 342053 315187 204371 260969 426493
10338 426493 460613 375020 156483 159436 197992 142252 230811 475345 565778 510944 509443
10327 509443 489147 360142 290670 340722 415194 342907 317420 276352 286153 381601 376244 317837
10315 317837 121883 111981 131765 142839 269802 159197 136406 260030 380855 353251 204187
10304 204187 144059 232582 247482 387149 412423 568413 524029 223185 138600 339306 292959
10293 292959 241885 268299 196899 136235 128113 192574 274598 347289 377659 236155 194585
10282 194585 168932 110956 148558 103109 119522 158042 314289 465197 455187 342697 372713
10271 372713 518484 524660 331708 262911 208377 197585 405656 446231 372069 343352 325779
10260 325779 339757 298065 197862 166380 -242 -81248 -50491 60108 81162 38464 140910
10249 140910 150898 118456 147135 29440 -121139 -75603 13180 166537 243100 168355 166588
10238 166588 70477 25599 -39920 259699 420247 236311 145114 216404 87142 -104173
10228 -104173 -191047 -226410 -167338 126677 203271 103752 23642 -4376 -76071 -28654 -17944
10217 -17944 43502 182774 334448 368125 370120 268731 180955 331695 264351 30781 -149606
10206 -149606 -119053 -89767 25148 161577 286136 86334 -47554 3258 125681 204230
10196 204230 325170 292165 222430 183939 188087 232693 354964 416433 376482 199226 142078
10185 142078 7385 94820 165317 245320 498453 681057 710239 750064 716568 749306 617794
10174 617794 426361 360244 506197 761249 1012959 1060486 986530 869073 870634 732683
10164 732683 714444 797476 862912 691927 627507 649053 711930 958969 1083765 1190726 1212462
10153 1212462 1206520 1133921 1015347 955290 1064797 1287201 1128168 1004003 1152251 1355510
10143 1355510 1282590 1106887 1014612 853035 895044 825820 677791 507434 558437 506989
10133 506989 504403 459482 411584 318404 283916 194588 349319 502853 371724 252323 150700
10122 150700 182390 142631 73280 -4728 -50548 72343 111658 151820 77368 123917 108925
10111 108925 43063 -39573 -146753 -122865 -39530 25613 22601 -172935 -228254 -82545 -109760
10100 -109760 -212668 -134322 -22206 11773 -8162 66605 116609 131943 139758 190089 308928
10089 308928 132438 55172 65883 193471 137221 151981 200931 388304 344945 190614 153603
10078 153603 114748 230782 124383 20896 107377 122238 28327 65920 145403 179819 177294
10067 177294 18707 42501 70701 71867 219879 222916 148777 142442 190885 149203 105051 116823
10055 116823 125836 104097 6620 2207 18337 90980 175487 193313 211854 153431 173630 105833
10043 105833 131094 230694 279274 189551 -67414 -154517 -109384 24344 70024 55246 109470
10032 109470 196142 69254 88605 44470 -53515 65742 65388 26763 -3465 42099 26609
10021 26609 -94814 -133916 -65289 -103279 -82747 -117007 -128498 -68596 -89020 -58106 87745
10010 87745 176292 177269 232498 224548 132729 371023 303732 272176 349858 254322 43030 -15573
9998 -15573 -108935 -129664 -176085 -241497 -143158 -120620 -161987 -140280 -148125 -226507 -208042 112815
9986 112815 261803 67299 -114566 -33669 87346 32534 -148181 -101334 79311 106130
9976 106130 186444 166362 238484 190246 265585 303151 275024 160029 118371 107860 5481
9965 5481 56216 172696 121788 55253 223387 167668 -28456 6109 8302 112781 173738
9954 173738 159091 74018 -25717 -120544 -35718 71090 56506 -41287 -44307 -166941 -206737
9943 -206737 -115542 -103643 -70089 -14911 36238 55728 8334 -20698 -130641 -324566 -157252
9932 -157252 -56145 65379 249583 209815 -10212 -85859 -125745 -95052 -169013 -348032 -143846
9921 -143846 -22 -32132 49503 39428 165242 207779 103659 -36533 64085 -86685
9911 -86685 -195294 -199833 -127478 -49876 -8544 -107193 -6751 92351 53859 163830 167465 116889
9899 116889 74447 -21572 105969 184220 -62124 -124545 -79105 -85862 -148712 -54553 -205818
9888 -205818 -188682 -100793 -73780 -49839 -135967 -331421 -280874 -139611 -55580 -38855 37370
9877 37370 169809 21186 -85275 27844 -33172 -45830 162728 328992 421551 333510 265576
9866 265576 122016 42073 81823 89012 36120 62919 67654 -26429 -83618 -123579 -57218 -42618
9854 -42618 6874 -58388 31360 -59496 -245580 -154653 -176741 -223972 -113691 -172142 -334097
9843 -334097 -292817 -144435 -18709 5236 105166 234646 185430 58458 118681 13541 -180602
9832 -180602 -249315 -145762 -114819 -210492 -126320 -3037 36140 37010 80333 187018 119493
9821 119493 110895 287447 285507 129616 3386 -34723 -54751 -20984 -21864 -10895 21007 47451
9809 47451 -3347 28220 100734 -9576 10041 -34608 -29644 -77445 6338 36937 75514 123633
9797 123633 105847 -70012 -180160 31014 203368 170561 117371 -74872 25574 28850 103640
9786 103640 232943 143747 157121 203182 85517 36185 159594 40074 16334 95185 98572
9775 98572 148950 92043 233296 372368 279886 166533 144875 -68265 -93789 -14486 152211
9764 152211 171757 281894 208421 20540 56570 -6184 -161025 -53383 78073 78860 -60716
9753 -60716 145770 368547 429170 260329 183348 187766 233508 286199 240030 175620 187421
9742 187421 128107 200987 269211 215931 218473 85566 -41077 -216835 -168443 -147616 -234144
9731 -234144 -211364 -90935 -67570 -40597 -58669 -182941 -305101 -321630 -290686 -253562 -207959
9720 -207959 -190773 38865 188478 47274 -90001 -141994 -98576 -100006 -207356 -145643 -111552
9709 -111552 -215944 -193917 -121229 -81111 -38052 -56300 121281 73054 125407 -17755 -272722
9698 -272722 -83567 228190 173621 -17032 -216073 -176745 -13009 -52627 -104026 -138451 -96782
9687 -96782 74647 148532 169263 261244 341409 315901 84784 99616 136468 53674 -9694
9676 -9694 -50762 -11151 87248 33642 -5296 -137226 -299607 -308185 -237605 43596 161191
9665 161191 125215 179333 120859 -41621 -44985 138448 283791 207021 181696 128220 195786
9654 195786 413866 665238 628279 516280 312467 116376 77411 144783 206109 281787 249649
9643 249649 86732 -42385 85319 91073 1613 -18717 -26103 15123 -225827 -240081 -262630
9632 -262630 -97684 157605 173448 110907 47634 -38725 -113892 -250146 -196787 -115921 150505
9621 150505 176101 153185 122610 -46160 -87595 -44094 -30459 45050 166847 96996 49469
9610 49469 -99744 -23017 4055 -113655 -175006 -92631 22077 66569 -12715 -83431 -19861
9599 -19861 -84258 -46000 54463 102691 9304 -116621 -93191 11827 35412 149342 121299
9588 121299 -87041 -98515 -83908 -52890 -53806 -164962 -121669 -111141 -288319 -335555 -141422
9577 -141422 -103627 36032 87581 96445 90443 83537 88617 16141 -22446 -95574 -176630 -251994
9565 -251994 -106803 113193 84429 174186 232128 133129 127431 121610 191995 196895 67429 -255356
9553 -255356 -313585 -44075 -101856 -340328 -300511 -209022 -1673 -42009 -125140 -138002 -154810
9542 -154810 4921 185692 211861 117721 264017 230729 143432 130712 49885 -49176 65776
9531 65776 101116 29157 -23441 -95347 93562 438587 419852 66772 69624 -86695 21528
9520 21528 179490 209546 139775 32738 -66981 -27044 -34105 -161599 -64683 65859 -18731
9509 -18731 -118283 -277499 -300911 -315757 -304516 -206355 -166830 -200775 -66576 -91544 -183590
9498 -183590 -65115 107602 51865 -73660 -49362 -19493 -5506 132358 81279 -90700 -148875
9487 -148875 -256510 -162279 -30269 74483 10435 -123959 -165037 -76842 -5307 30111 144598
9476 144598 132300 48195 -55302 -38614 36060 32584 -46101 -82254 -130448 -47071 -12745 -83670
9464 -83670 -163061 -148874 -179265 -75238 -69789 4417 25562 -63565 -68097 4581 43240 -9706
9452 -9706 -38813 -55273 -65662 -91129 -108067 -38284 -127770 -100606 26306 6408 7439 -1970
9440 -1970 -187519 -225733 -74455 87261 42120 79295 100942 132243 128385 42051 11460 -117350
9428 -117350 -164562 -172937 -160905 -85527 13257 17418 -243763 -242821 -112826 -77037 63123 243258
9416 243258 288593 246189 149454 122210 10345 4082 2142 56999 -41026 -84823 -355976 -438024
9404 -438024 -289042 -278921 -174545 11283 -118867 -256070 -116322 -85941 -231921 -340503
9394 -340503 -262191 -158159 6530 36044 162048 182577 97207 146056 141903 50018 -59123
9383 -59123 -26118 15204 191473 359399 66461 -50666 24140 118441 109784 91631 143478
9372 143478 185982 25080 53833 155369 105370 -67866 -209425 -98095 45213 40118 107486
9361 107486 246243 251536 90477 98754 -95913 -37302 94698 145414 68661 22292 27798
9350 27798 38515 -97377 -52093 29496 234364 281636 98625 120232 57731 2289 73740
9339 73740 192892 155831 135756 201540 102806 39569 75057 93516 76613 82506 108987 80792
9327 80792 18221 134871 141138 18638 -31979 38308 90570 123770 92098 54404 -65398
9316 -65398 -39710 -9016 119985 -4982 -234012 -241135 -99816 -23726 29151 -15949 -45280
9305 -45280 54552 103728 -20241 -89035 20760 116922 8422 -26448 -52112 72126 118685
9294 118685 277349 415993 315976 132979 -129973 -218555 -137954 -26468 95200 75194
9284 75194 -207563 -115810 105038 86892 49259 61155 -94743 -173872 -117749 -27070 -30396
9273 -30396 6776 -1660 -61395 -18834 -128834 -207354 -308903 -334072 -271086 -212548 -248718 -12302
9261 -12302 111565 -94225 90955 169873 320425 475849 440528 392656 285791 155422
9251 155422 189986 72902 -250916 -507294 -503636 -489048 -494298 -494324 -368827 -175867 -134353 -223253
9239 -223253 -73562 56958 59008 50406 130345 118450 -80183 -47213 173675 137178 116939
9228 116939 -13148 -131164 -61007 52734 183805 28031 -98613 -88365 -59633 -245764
9218 -245764 -258859 -192962 -145096 -61695 -66301 -33908 -17658 -139602 -112605 -71910 -61616 -69572
9206 -69572 59903 79442 34519 122688 200010 218231 181133 168965 216702 113669 -18031
9195 -18031 -127763 -119896 -259897 -323155 -118248 -13412 1263 -124712 -186246 -41347 29493
9184 29493 101345 98624 4502 -93182 -30166 323373 420673 40880 -23895 -33936 -32731 -222488
9172 -222488 -362169 -383427 -200151 -58463 56626 117954 201346 367474 269138 -5733
9162 -5733 -101999 55306 128202 42725 -30521 9265 130135 182408 182324 190534 78951 46366
9150 46366 13973 123812 197121 -52168 -134271 -13346 -22146 -249 20877 -1523 31500
9139 31500 -79646 -32753 -69325 -158956 -244904 -211639 -344540 -279586 -167202 -180632 -164016
9128 -164016 -152957 -13026 33263 -206516 -264601 -194056 -213511 -207477 -50516 -33907 48303
9117 48303 19063 -20979 -88565 -209261 -95563 -92224 -228847 -113816 -53498 -51233 13622
9106 13622 19115 81736 191799 213788 242610 109211 86449 2994 -46585 -193375 8044
9095 8044 61864 -177650 -159937 45198 79744 2177 129567 211489 25863 -103416 -7542
9084 -7542 157703 210769 167522 189050 149767 264623 330228 198362 -64634 -93731 -141158
9073 -141158 -208516 16271 227084 215439 354313 127793 -184718 -396318 -327937 -116594
9063 -116594 -74352 -165048 -137680 -92119 40238 171662 211326 225370 309372 336225 227645
9052 227645 231323 309803 105093 -63064 -190472 -255716 -192389 -94167 -130601 343 138643
9041 138643 -10835 -51017 93704 142503 -85244 -154361 -62933 -122674 -7988 204227 163124
9030 163124 158132 111367 14460 -166654 -201180 -1705 33368 35506 -18969 59248 145762 307564
9018 307564 231730 98269 118681 51675 65836 188495 105228 101815 145649 308527 181313
9007 181313 23216 159199 -24876 -157296 -50220 168301 229863 20436 -4985 16174
8997 16174 -152329 -308438 -350575 -376420 -234215 -5910 -139999 -170538 -59229 -54268 -73312
8986 -73312 -42161 -77492 -43308 -54683 -41797 -65668 -101480 -213913 101189 257926 211817
8975 211817 129343 121691 127914 113295 -561 9552 -46743 -83160 -65654 -105971 -208515 -41115
8963 -41115 54303 -57678 -37874 -98508 -43426 79387 86844 49091 49243 -186945 -239518 -118773
8951 -118773 12660 102563 64730 183252 54848 81905 141424 118830 39400 -78119 -100666
8940 -100666 -56014 -34455 -176066 -116870 -196743 -831 65752 -142887 -49760 25789 -94454
8929 -94454 -93627 -13676 -87918 -65980 99702 143712 197068 77885 -10337 -45721 9755 -24159
8917 -24159 -150649 -26317 94882 55230 -3166 -87696 -63683 85594 120509 22470 -24341
8906 -24341 137353 95506 184167 123941 10120 60712 34737 33910 81494 183171 192279 -70946
8894 -70946 -296538 -209594 -57978 3185 92181 3841 -53620 -78899 -70519 -170473 -160612 -35705
8882 -35705 -6975 70637 74297 190812 104991 119767 148817 -12143 119074 353208 271620
$$ [...]
##END NTUPLES=NMR SPECTRUM
##END=
