##TITLE=Analysis number 314057
Compound Code jfd 01173
Book Reference 2
Project Code adrs
Chemist Name perepichka
##JCAMPDX= 6.0         $$ Bruker NMR JCAMP-DX V2.0
##DATA TYPE= NMR SPECTRUM
##DATA CLASS= NTUPLES
##ORIGIN= Bruker BioSpin GmbH
##OWNER= NMR
$$ XWIN-NMR		Version 3.5
$$ Tue Oct  4 11:34:54 2005 GMT Daylight Time (UT+1h)  MAYBRIDGE\NMR@NMR_250MHZ
##.OBSERVE FREQUENCY= 250.131544655141
##.OBSERVE NUCLEUS= ^1H
##.ACQUISITION MODE= SIMULTANEOUS (DQD)
##.ACQUISITION SCHEME= undefined
##.AVERAGES= 16
##.DIGITISER RES= 18
##SPECTROMETER/DATA SYSTEM= dpx250
##.PULSE SEQUENCE= zg30
##.SOLVENT NAME= DMSO
##.SHIFT REFERENCE= (INTERNAL, DMSO, 0, 16.5162)
##AUDIT TRAIL= $$ (NUMBER, WHEN, WHO, WHERE, WHAT)
$$ ##TITLE= Audit trail, XWIN-NMR		Version 3.5
$$ ##JCAMPDX= 5.01
$$ ##ORIGIN= Bruker BioSpin GmbH
$$ ##OWNER= NMR
$$ C:\u/data/dgb/nmr/ADRS/10340/pdata/1/auditp.txt
$$ ##AUDIT TRAIL=  $$ (NUMBER, WHEN, WHO, WHERE, WHAT)
(   1,<2005-10-04 11:34:35.02 +100>,<MAYBRIDGE\NMR>,<NMR_250MHZ>,
      <created by zg, POWCHK disabled, PULCHK disabled
       configuration hash MD5:
       62 19 C7 07 E1 42 D1 B7 37 6C 3D D0 77 39 F9 E6
       data hash MD5: 64K
       69 D1 EF 1F B4 00 14 41 B4 EE A2 13 64 EA 2A 8C>)
(   2,<2005-10-04 11:34:46.49 +100>,<MAYBRIDGE\NMR>,<NMR_250MHZ>,
      <Start of raw data processing
       ef LB = 0.3 FT_mod = 6 PKNL = 1 SI = 32K 
       data hash MD5: 32K
       BF 53 9F 3D A9 40 20 28 CC 00 12 11 E5 3E E6 80>)
(   3,<2005-10-04 11:34:48.04 +100>,<MAYBRIDGE\NMR>,<NMR_250MHZ>,
      <apk 
       data hash MD5: 32K
       92 54 9E E5 2F 65 B6 CD 90 A8 D9 F7 F9 B1 E8 58>)
(   4,<2005-10-04 11:34:48.70 +100>,<MAYBRIDGE\NMR>,<NMR_250MHZ>,
      <abs ABSG = 5 
       data hash MD5: 32K
       D5 E6 85 67 5C 72 C8 81 AF 04 4C 3A ED AB BB EA>)
$$ ##END=
$$ 
$$ hash MD5
$$ 0E 41 0F 55 24 B8 51 4D 0F 9D 56 CB F0 F2 12 18
##$RELAX= 
##$RELAX= 
##$RELAX= 
##$RELAX= 
##$RELAX= 
##$RELAX= 
##$RELAX= 
$$ Bruker specific parameters
$$ --------------------------
##$DU= <C:\u>
##$EXPNO= 10340
##$NAME= <ADRS>
##$PROCNO= 1
##$TYPE= <nmr>
##$USER= <dgb>
##$AMP= (0..31)
100 100 100 100 100 100 100 100 100 100 100 100 100 100 100 100 100 100 
100 100 100 100 100 100 100 100 100 100 100 100 100 100 
##$AQSEQ= 0
##$AQ_mod= 3
##$AUNM= <au_zg>
##$AUTOPOS= <21 >
##$BF1= 250.13
##$BF2= 250.13
##$BF3= 250.13
##$BF4= 250.13
##$BF5= 500.13
##$BF6= 500.13
##$BF7= 500.13
##$BF8= 500.13
##$BYTORDA= 1
##$CFDGTYP= 0
##$CFRGTYP= 5
##$CHEMSTR= <none>
##$CNST= (0..31)
1 1 145 1 1 1 1 1 1 1 1 1 1 1 1 1 1 1 1 1 1 1 1 1 1 1 1 1 1 1 1 1 
##$CPDPRG= <>
##$CPDPRG1= <>
##$CPDPRG2= <>
##$CPDPRG3= <>
##$CPDPRG4= <mlev>
##$CPDPRG5= <mlev>
##$CPDPRG6= <mlev>
##$CPDPRG7= <mlev>
##$CPDPRG8= <mlev>
##$CPDPRGB= <>
##$CPDPRGT= <>
##$D= (0..31)
0 1 0 0 0 0 0 0 0 0.06 0 0 0 0 0 0 0.0002 0 0 0 0 0 0 0 0 0 0 0 0 0 0 
0 
##$DATE= 1128422074
##$DBL= (0..7)
120 120 120 120 120 120 120 120 
##$DBP= (0..7)
150 150 150 150 150 150 150 150 
##$DBP07= 0
##$DBPNAM0= <>
##$DBPNAM1= <>
$$ [...]
##$SUBNAM7= <"">
##$SUBNAM8= <"">
##$SUBNAM9= <"">
##$SW= 20.6930455092707
##$SWIBOX= (0..15)
0 0 3 0 0 0 0 0 0 0 0 0 0 0 0 0 
##$SW_h= 5175.983436853
##$TD= 65536
##$TD0= 1
##$TE= 296.16
##$TE2= 300
##$TE3= 300
##$TEG= 300
##$TL= (0..7)
0 120 120 120 120 120 120 120 
##$TP= (0..7)
150 150 150 150 150 150 150 150 
##$TP07= 0
##$TPNAME0= <>
##$TPNAME1= <>
##$TPNAME2= <>
##$TPNAME3= <>
##$TPNAME4= <>
##$TPNAME5= <>
##$TPNAME6= <>
##$TPNAME7= <>
##$TPOAL= (0..7)
0.5 0.5 0.5 0.5 0.5 0.5 0.5 0.5 
##$TPOFFS= (0..7)
0 0 0 0 0 0 0 0 
##$TUNHIN= 0
##$TUNHOUT= 0
##$TUNXOUT= 0
##$USERA1= <user>
##$USERA2= <user>
##$USERA3= <user>
##$USERA4= <user>
##$USERA5= <user>
##$V9= 5
##$VALIST= <valist>
##$VCLIST= <CCCCCCCCCCCCCCC>
##$VD= 0
##$VDLIST= <DDDDDDDDDDDDDDD>
##$VPLIST= <PPPPPPPPPPPPPPP>
##$VTLIST= <TTTTTTTTTTTTTTT>
##$WBST= 1024
##$WBSW= 4
##$XGAIN= (0..3)
0 0 0 0 
##$XL= 0
##$YL= 0
##$YMAX_a= 423339
##$YMIN_a= -326582
##$ZGOPTNS= <>
##$ZL1= 120
##$ZL2= 120
##$ZL3= 120
##$ZL4= 120
##$ABSF1= 16.51622
##$ABSF2= -4.176952
##$ABSG= 5
##$ABSL= 3
##$ALPHA= 0
##$AQORDER= 0
##$ASSFAC= 0
##$ASSFACI= 0
##$ASSFACX= 0
##$ASSWID= 0
##$AUNMP= <proc_1d>
##$AZFE= 0.1
##$AZFW= 0.1
##$BCFW= 0
##$BC_mod= 0
##$BYTORDP= 0
##$COROFFS= 0
##$CY= 12.5
##$DATMOD= 1
##$DC= 0
##$DFILT= <>
##$DTYPP= 0
##$F1P= 14.0000005364418
##$F2P= -0.99999901652339
##$FCOR= 0.5
##$FTSIZE= 32768
##$FT_mod= 6
##$GAMMA= 0
##$GB= 0
##$INTBC= 1
##$INTSCL= 1
##$ISEN= 128
##$LB= 0.3
##$LEV0= 0
##$LPBIN= 0
##$MAXI= 10000
##$MC2= 0
##$MEAN= 0
##$ME_mod= 0
##$MI= 0
##$NCOEF= 0
##$NC_proc= -4
##$NLEV= 6
##$NOISF1= 0
##$NOISF2= 0
##$NSP= 0
##$NTH_PI= 0
##$NZP= 0
##$OFFSET= 16.51622
##$PC= 1
##$PHC0= -64.36423
##$PHC1= 3.971054
##$PH_mod= 1
##$PKNL= yes
##$PPARMOD= 0
##$PSCAL= 4
##$PSIGN= 0
##$REVERSE= no
##$SF= 250.130001445422
##$SI= 32768
##$SIGF1= 0
##$SIGF2= 0
##$SINO= 400
##$SIOLD= 32768
##$SREGLST= <1H.DMSO>
##$SSB= 0
##$STSI= 32768
##$STSR= 0
##$SW_p= 5175.98343685301
##$SYMM= 0
##$S_DEV= 0
##$TDeff= 65536
##$TDoff= 0
##$TI= <Analysis number 999999
Compound Code 99
Book Reference 9
Project Code 9>
##$TILT= no
##$TM1= 0
##$TM2= 0
##$TOPLEV= 0
##$USERP1= <user>
##$USERP2= <user>
##$USERP3= <user>
##$USERP4= <user>
##$USERP5= <user>
##$WDW= 1
##$XDIM= 32768
##$YMAX_p= 262728788
##$YMIN_p= -401246
$$ End of Bruker specific parameters
$$ ---------------------------------
##NTUPLES= NMR SPECTRUM
##VAR_NAME=  FREQUENCY,     SPECTRUM/REAL,   SPECTRUM/IMAG
##SYMBOL=    X,             R,               I
##VAR_TYPE=  INDEPENDENT,   DEPENDENT,       DEPENDENT
##VAR_FORM=  AFFN,          ASDF,            ASDF
##VAR_DIM=   32768,         32768,           32768
##UNITS=     HZ,            ARBITRARY UNITS, ARBITRARY UNITS
##FACTOR=    0.157963299565203, 1,           1
##FIRST=     4131.20215567833, 0,            0
##LAST=      -1044.78128117468, 0,           0
##MIN=       -1044.78128117468, -401246,     0
##MAX=       4131.20215567833, 262728788,    0
$$ Real data points
##PAGE= N=1
##DATA TABLE= (X++(R..R)), XYDATA
$$ [...]
17594A01067r158q3701j03725j1055J3277M2245m2057p2795m4754o0793o3711
$$ 101067 91909 8208 -95517 -106572 -93295 -51050 -93107 -165902 -210656 -271449 -335160
17583c35160J80702J29505J5640M3560N1626J1389j0671K0051o746j8603p2165
$$ -335160 -154458 -24953 -9313 34247 85873 97262 86591 106642 99896 81293 9128
17572I128K1468q299K0385K5073J6057j8426m7380n7262m7278j5936P9921J0258
$$ 9128 30596 22297 42682 67755 83812 65386 18006 -39256 -86534 -102470 -22549 -12291
17560a2291Q6660k6552l9502K043k4883n0783K5802j1405L4657M1949m0575K0245
$$ -12291 74369 47817 8315 10358 -14525 -65308 -39506 -50911 -16254 25695 -14880 5365
17548E365j7770L5865j4304p8251L9687l3679q2776K4920L8715J02962L7394m3588
$$ 5365 -12405 23460 9156 -69095 -29408 -63087 -145863 -120943 -82228 20734 58128 14540
17536A4540K0967L1437M3001p06o0002m9276r1355o8657M1741J43067P1833N7199
$$ 14540 35507 66944 109945 109239 49237 -39 -91394 -160051 -118310 24757 96590 153789
17524A53789m2701j1874J39826k2862p6178o0829l6476Q8218O7711L35m9053p832
$$ 153789 111088 99214 239040 216178 140000 79171 42695 130913 198624 198959 149906 142074
17512A42074K5110j05277p5908R2131M6825p0919l8237k744k1304m0461Q373O7781
$$ 142074 167184 61907 -14001 78130 124955 54036 15799 13055 -8249 -48710 -40337 27444
17500B7444j5163k4392n442O5112M991q1630j5062O855K3571L3231k0464l1922
$$ 27444 12281 -12111 -17553 47559 52550 -29080 -44142 -37287 -13716 19515 -949 -32871
17488c2871n3056J7531L1084J40295j057Q2350O0013K1388N8584j2334o425O3904
$$ -32871 -85927 -68396 -37312 102983 101926 184276 244289 265677 324261 311927 305502 369406
17476C69406K4241P718K0986j9824m6365M9612M9592j8876q0773r6740j5125L5806
$$ 369406 393647 401365 422351 402527 356162 405774 455366 436490 355717 258977 243852 279658
17464B79658P947j82481q7351J2752p6115p7003N2876J07574M0142J7126O925
$$ 279658 287605 105124 17773 30525 -45590 -122593 -69717 37857 77999 95125 102050
17453A02050k0081l8646L8276L737l6247K3776P1020N00N436k9597n7028O0983
$$ 102050 81969 43323 81599 85336 49089 72865 143885 144385 149821 120224 63196 124179
17441A24179R02k0062j2883l2269J6370j7873k8771l1074J6455M5430j4327Q0901
$$ 124179 125081 105019 92136 59867 76237 58364 29593 -1481 14974 60404 46077 126978
17429A26978N9168o5753o2110n6669M6883J8200P9007O86q3423m0491m1419P06
$$ 126978 186146 120393 58283 1614 48497 66697 145704 146390 62967 22476 -18943 -18237
17417a8237N5477m3243k9421P375L8715l2270N303K7111l0900m5916J8037M262
$$ -18237 37240 -6003 -35424 -28049 10666 -21604 -16301 10810 -20090 -66006 -47969 -43707
17405d3707j9633K510K1742n711J3394P744r819N1478k2967O5149L8466q88j49109
$$ -43707 -63340 -60830 -39088 -44799 -31405 -23661 -33480 17998 -4969 60180 98646 97758 -51351
17392e1351o620J34208J5811l6333k8376p7675m9777J0905j3043l0592K2811K3414
$$ -51351 -57971 76237 92048 55715 27339 -50336 -100113 -89208 -102251 -132843 -110032 -86618
17380h6618N2485k3330p4551R2365P4364M7511j551n7543j11613N5523Q4262k8763
$$ -86618 -34133 -57463 -132014 -39649 34715 82226 80675 23132 -88481 -32958 51304 22541
17368B2541r1006j1686N8705p586j9777j5868m0411J1291R129M1162M7604k5248
$$ 22541 -68465 -80151 -21446 -29032 -48809 -64677 -105088 -93797 -84668 -43506 4098 -21150
17356b1150k406n879m5780M303N6705o153o0780O0668M1126p3819Q1688L9278
$$ -21150 -23556 -29435 -75215 -70912 -14207 -20360 -81140 -20472 20654 -53165 28523 67801
17344F7801o3388J6563J2619N1683m9002n0067j010J04469j1425L1672m5420q2379
$$ 67801 4413 20976 33595 85278 36276 -13791 -14801 89668 78243 109915 64495 -17884
17332a7884N2633L1495n5384o1085m2671K7662j8530O8326L7626k6067k5688j8367
$$ -17884 34749 66244 10860 -50225 -92896 -65234 -83764 -15438 22188 -3879 -29567 -47934
17320d7934L0119L7896K2115o3166j344N9148k8381P5049M4380n141N4433l9338
$$ -47934 -17815 20081 42196 -20970 -22314 36834 8453 83502 127882 122741 177174 137836
17308A37836K2201Q496p4726j09364n7591j2128L0923k03L1085L2325n3439n1903
$$ 137836 160037 168533 93807 -15557 -73148 -85276 -54353 -54556 -23471 8854 -44585 -96488
17296i6488l7953O0643o045P7682J02092k3642j3179j09162K8949J07187K2969
$$ -96488 -134441 -73798 -79843 -2161 99931 76289 63110 -46052 -17103 90084 113053
17285A13053J5945o1474o258K7457M7535l0456Q8271q0973j9329j8183n3987R1570
$$ 113053 128998 67524 61266 88723 136258 105802 194073 113100 93771 75588 21601 113171
17273A13171M7080m7282m0156r119k6122O4996p1561m3839L1920J1280n7400M852
$$ 113171 160251 112969 72813 63694 37572 102568 31007 -12832 19088 30368 -27032 -22180
17261b2180J5084m4593j5209j24366m2297P6684P7664J00339o8772o4874j404
$$ -22180 -7096 -51689 -66898 -191264 -233561 -156877 -79213 21126 -47646 -112520 -113924
17250a13924P241M660Q7805O1297K2236m3770M9363M2376m1472j4608l6845J0140
$$ -113924 -106683 -102023 -14218 47079 69315 25545 74908 117284 75812 61204 24359 34499
17238C4499L4602R4273o2022m7887K0326K5216K3226M434m7235j9740k7375j12334
$$ 34499 69101 163374 101352 53465 73791 99007 122233 126667 79432 59692 32317 -80017
17226h0017L2951J6862O0164M3042o6998p070k9009M4824K0515k5345l7560L7758
$$ -80017 -47066 -30204 29960 73002 6004 -1066 -30075 14749 35264 9919 -27641 10117
17214A0117N3215l1056J2147J1539K5603K2725K5063o499m218m6985o8284n700
$$ 10117 63332 32276 44423 55962 81565 104290 129353 122854 118636 71651 3367 -2333
17202b333k9532n4869K4600O7825k4607M0422j7497o9721K1562P8898j0839q1542
$$ -2333 -31865 -86734 -62134 5691 -18916 21506 4009 -65712 -44150 34748 23909 -57633
17190e7633l7319Q4083m175j6153o6298L6439J40449M6599q6424q1244l3724L0661
$$ -57633 -94952 -10869 -15044 -31197 -97495 -61056 79393 125992 39568 -41676 -75400 -44739
17178d4739O8007N9622j9472n4257o7327J5497M5572j8625r2189r2616R2921M8680
$$ -44739 23268 82890 63418 9161 -58166 -42669 2903 -15722 -107911 -200527 -107606 -58926
17166e8926m0175K0258Q2334L0323P1987r6541m7678k7976J05163L1104N2763
$$ -58926 -99101 -78843 3491 33814 105801 9260 -38418 -66394 38769 69873 122636
17155A22636j3605l1811j1996j7896l9025N3397P9941L8391o4079M429m7002m1083
$$ 122636 109031 77220 65224 47328 8303 61700 141641 180032 115953 120382 73380 32297
17143C2297l1645j7298R210j6356o4879P9768R3242k9986P307r0586r2971M990
$$ 32297 652 -16646 -7436 -23792 -88671 -8903 84339 54353 61660 -28926 -121897 -116907
17131a16907J914M2100M2535M2689l9207p0470l9282M0923P5082P8422l0470j10023
$$ -116907 -114993 -72893 -30358 12331 -26876 -97346 -136628 -95705 -20623 57799 27329 -82694
17119h2694O1429Q7105R023Q4396j10294j04213p4816l0681k9484P014Q7431P3570
$$ -82694 -21265 65840 74863 159259 48965 -55248 -130064 -160745 -190229 -183215 -95784 -22214
17107b2214n0375O433M4652K018k5584r626j4155j366K3857K7670Q425J37860
$$ -22214 -72589 -66156 -21504 -19486 -45070 -54696 -68851 -70217 -46360 -18690 -10265 127595
17095A27595K5280M2663k2134j8004Q4389p9973r5783l2971j0146K3811j4323
$$ 127595 152875 195538 173404 155400 239789 159816 64033 31062 20916 44727 30404
17084C0404r9601j6379J00608K3075l9518R647K4418m0475M6842j7952n7200J0872
$$ 30404 -69197 -85576 15032 38107 -1411 8236 32654 -7821 39021 21069 -36131 -25259
17072b5259J8736K1834j8286J7327J9999p7649n579L3158m8492o3100M0329K0822
$$ -25259 -6523 15311 -2975 14352 34351 -43298 -48877 -15719 -64211 -127311 -86982 -66160
17060f6160k5221K555q5254M3066R1799l5586p3196k5304N4877P2927M2806L4361
$$ -66160 -91381 -88826 -174080 -131014 -39215 -74801 -147997 -173301 -118424 -45497 -2691 31670
17048C1670L5353l729j24516n7470n9065r148J41082J17581o843k0592p402n0933
$$ 31670 67023 63294 -61222 -118692 -177757 -186905 -45823 71758 64915 44323 36921 -14012
17036a4012r192R9107l3143M9972J6394k229p2283k1830L2721J3880J4387K9348
$$ -14012 -23204 75903 42760 92732 109126 106897 34614 12784 45505 59385 73772 103120
17024A03120L2754r2112o3888m1648N817m3664J0240L0323k6641o5905q9107L0810
$$ 103120 135874 43762 -20126 -61774 -55957 -99621 -89381 -59058 -85699 -151604 -240711 -209901
17012b09901P5989q050J21333j2587k1494j9436O724q1697L9913N0488Q2984J2081
$$ -209901 -133912 -141962 -20629 -33216 -54710 -74146 -67422 -149119 -109206 -58718 24266 36347
17000C6347M763m1649p7510l3099N226r6401l8639Q0041J14526L1189P7302m7913
$$ 36347 41110 -539 -78049 -111148 -105922 -202323 -240962 -160921 -46395 -15206 62096 14183
16988A4183l6389j8071m7068r022l0700M3144M6605J0382K768K1357m4087P5550
$$ 14183 -22206 -40277 -87345 -96367 -127067 -83923 -37318 -26936 -24168 -2811 -46898 28652
16976B8652l6809n4512j7265k4204Q4042Q5924j08609p2782N4416L4255M671L5637
$$ 28652 -8157 -62669 -79934 -104138 -20096 65828 -42781 -115563 -61147 -26892 -22221 13416
16964A3416J635n4655m3288J7590m0410m474K7689N7568k4633o2130N2936J4450
$$ 13416 15051 -39604 -82892 -65302 -105712 -110186 -82497 -24929 -49562 -111692 -58756 -44306
16952d4306k6867N175J15627q436j8258N8249n8656j2219J8633o8683o4198m1532
$$ -44306 -71173 -65998 49629 41193 22935 81184 22528 10309 28942 -39741 -103939 -145471
16940a45471J7760L2385J03666j4137k4276M2472o2813o4919R5204O08l745O4920
$$ -145471 -127711 -95326 8340 -5797 -30073 12399 -50414 -115333 -20129 -19521 -23266 41654
16928D1654L8661n0056J6882m9671o410n0471J4828L5788O1105N738j8454k3298
$$ 41654 80315 30259 47141 -2530 -8940 -59411 -44583 -8795 52310 58048 39594 16296
16916A6296q810K6196k0952r4965l9407M4570P4494p5243n5812j4154J04727J14429
$$ 16296 7486 33682 12730 -82235 -121642 -77072 -2578 -77821 -133633 -147787 -43060 71369
16904G1369j742p2215k5294m7913L8272J19863J2256p7425k7856J01608J0035
$$ 71369 69627 -2588 -27882 -75795 -37523 82340 94596 17171 -10685 90923 100958
16893A00958k8119m9687j3764o3967K1564M1876q861M9337M9377n6666r2506k5296
$$ 100958 72839 23152 9388 -54579 -33015 8861 0 49337 98714 42048 -50458 -75754
16881g5754m5626L3500M8491L3549N0955j8800m8752K7995Q9579j9358n8788p0110
$$ -75754 -121380 -87880 -39389 -5840 45115 26315 -22437 5558 95137 75779 16991 -53119
16869e3119N5321j1248l7110q7494k6625J38759N9879K1497k6480j8689n837J0719
$$ -53119 2202 -9046 -46156 -133650 -160275 -21516 38363 59860 33380 14691 8854 19573
16857A9573n1796m7544k6692J3758M6823m620Q7491l085P165j7880P036Q1555
$$ 19573 -32223 -79767 -106459 -92701 -45878 -50498 36993 33908 41073 23193 30229 111784
16845A11784N942j8013j00976K0282j1659L7042k7047m2952j3208J5179p6830
$$ 111784 117726 99713 -1263 19019 7360 44402 17355 -25597 -38805 -23626 -100456
16834a00456k7095M7443o2432m7262n714P5975P1267N789K5776J1145j2731j6645
$$ -100456 -127551 -80108 -142540 -189802 -195516 -119541 -48274 -42485 -16709 -5564 -18295 -34940
16822c4940m384P547K1507K4964J4728J3425j5149l2945j5616N1744j1935q4287
$$ -34940 -39324 -31777 -10270 14694 29422 42847 27698 -5247 -20863 30881 18946 -65341
16810f5341q425M6268O3369l0874K8098L2773K0199m7455N533m7562l1582K3017
$$ -65341 -73766 -27498 35871 4997 33095 65868 86067 38612 44145 -3417 -34999 -11982
16798a1982l438j41903k976K9384L5336Q8155N4976o305m8503o1017K0855o4365
$$ -11982 -15420 -157323 -160299 -130915 -95579 -7424 47552 41247 -7256 -68273 -47418 -111783
16786a11783l7713Q0494L1019l0310J6460k7985L9399Q0107L9037m0737l769J877
$$ -111783 -149496 -69002 -37983 -68293 -51833 -79818 -40419 39688 78725 37988 34219 36096
16774C6096k5345M7488M9403p6345L662J4763j6403q0903r80M1472K9236R403
$$ 36096 10751 58239 107642 31297 34959 49722 33319 -47584 -48564 -7092 22144 31547
16762C1547L0604j2981j04486j9421P985l4509K3220R9385j176L61o3552K0452
$$ 31547 62151 49170 -55316 -74737 -66752 -101261 -78041 21344 20168 20529 -43023 -22571
16750b2571n380K0057L4614k3741R263l9479q0384J6928L5427M4003K1692j2161
$$ -22571 -27951 -7894 26720 2979 12242 -27237 -107621 -90693 -55266 -11263 10429 -1732
16738a732m0556n5313K0498M2199K7886l6472k9749j0973K7394m8845m4980L2844
$$ -1732 -42288 -97601 -77103 -34904 -7018 -43490 -73239 -84212 -56818 -105663 -150643 -117799
16726a17799L2823J15024Q6988Q5054O334k5757o9760n9923k133L3448r2056o5510
$$ -117799 -84976 30048 117036 202090 208424 182667 112907 52984 50851 84299 -7757 -73267
16714g3267m4953J83O1038l9296r3034l8301J20223J0658J42694n865m2259J4454
$$ -73267 -118220 -118037 -56999 -96295 -189329 -227630 -107407 -96749 45945 40080 -2179 12275
16702A2275o2641n0594M6942Q246n7976K2103J5115J8012k7102P0148M3050k2033
$$ 12275 -50366 -100960 -54018 -45772 -103748 -81645 -66530 -48518 -75620 -5472 37578 15545
16690A5545o9499K3850m5911j4527M2811L4567m41L6073n4925p0082Q5436P7927
$$ 15545 -53954 -30104 -76015 -90542 -47731 -13164 -13605 22468 -32457 -102539 -17103 60824
16678F0824p9034o0699q018L1429K5677k0291k783M431l398N9335Q5606k8262
$$ 60824 -18210 -78909 -86927 -55498 -29821 -50112 -52895 -48464 -51862 7473 93079 64817
16666F4817K1281j145j18416m0996Q5867m0K5298P5714P1941j7253l633O8145
$$ 64817 86098 84953 -33463 -74459 11408 11368 36666 112380 184321 167068 163435 231580
16654B31580q7574j18278q0059J04798Q0850j07013l2753Q4579l1734l3985R048
$$ 231580 144006 25728 -54331 50467 131317 24304 -8449 76130 44396 10411 19459
16643A9459J6776j3273j1742L3087j2602j6997n7118k0692Q4272N6325r9657m6195
$$ 19459 36235 22962 11220 44307 31705 14708 -42410 -63102 21170 77495 -22162 -68357
16631f8357m591L4684M8048j8627K0243q577J4504o0885M3916N6488j3625p9030
$$ -68357 -72948 -38264 9784 -8843 11400 2823 17327 -43558 358 56846 43221 -35809
16619c5809k3789J8624j4289m299L4400N6768J4281r578K5111j9862r8007k8595
$$ -35809 -59598 -40974 -55263 -59562 -25162 31606 45887 36309 61420 41558 -56449 -85044
16607h5044J46833r98m8314q422M8158O538m8149n3870j9952n8563L1713O2063
$$ -85044 61789 60791 12477 4055 52213 58751 10602 -43268 -63220 -121783 -90070 -28007
16595b8007J3846Q9269J5107k5479j8070N3925J8716p0934o6790q9572n6028j5240
$$ -28007 -14161 75108 90215 64736 46666 100591 119307 48373 -18417 -107989 -164017 -179257
16583a79257O5927Q9557L6691J19957L9185J5005j33032k9783L96J2067P1972
$$ -179257 -113330 -23773 12918 132875 172060 187065 54033 24250 24646 36713 108685
16572A08685j3859n1911l2185l3376m7879J26172P51J0039R9457l9066j10667
$$ 108685 94826 42915 10730 -22646 -70525 55647 56398 66437 165894 126828 16161
16561A6161q736Q2664M882o2142k4747K720j52879n7991M0354K3313N8997R7036
$$ 16161 7425 90089 94971 32829 8082 10802 -142077 -200068 -159714 -136401 -77404 19632
16549A9632n1397Q593M1185p4415j3023M5035L6046J5380L7826l0879K5244J3547
$$ 19632 -31765 -23172 18013 -56402 -69425 -24390 11656 27036 64862 33983 59227 72774
16537G2774j6997o0655m4762k7913m255K8214Q1122M7514K913j6122o2895m1913
$$ 72774 55777 -4878 -49640 -77553 -81808 -53594 27528 75042 77955 61833 -1062 -42975
16525d2975K5086n2235J4201J26595K2123o2932k1244n6626q2386L2934k5722
$$ -42975 -17889 -70124 -55923 70672 92795 29863 8619 -48007 -130393 -97459 -123181
16514a23181l2417N02L3997K2629l5044M2221m7465k0958l0046R4201N6857k5000
$$ -123181 -155598 -155096 -121099 -98470 -133514 -91293 -138758 -159716 -189762 -95561 -38704 -63704
16502f3704K3598k1445m9637j345P579K4927K8007L802M2832N8501P951k5841
$$ -63704 -40106 -61551 -111188 -112533 -104954 -80027 -52020 -48218 -5386 53115 61066 35225
16490C5225n0297l7993J52570K2527o3714n331N7791k2453j49332p1855j5001
$$ 35225 -15072 -53065 99505 122032 58318 52987 110778 88325 -61007 -132862 -147863
16479a47863j7629R4758J04343O6569K8558o7336j28401R923M0973J6593j0792
$$ -147863 -165492 -70734 33609 100178 128736 61400 -67001 -57078 -16105 488 -10304
16468a0304o6100K6771M8141L8550M622J1373k4720m8801m2524R1062l3032l212
$$ -10304 -76404 -49633 -1492 37058 41680 53053 28333 -20468 -62992 28070 -4962 -8174
16456h174j235m949J706N922K9613N5112N3122q7764k02273m819N2003O5147P1202
$$ -8174 -9409 -14358 -12652 -6730 22883 77995 131117 43353 -158920 -163739 -111736 -46589 24613
16443B4613L2524R805m7367q7385l2335O1034l616N0689N191R3977K0681k5315
$$ 24613 57137 66942 19575 -67810 -100145 -39111 -42727 7962 13153 107130 127811 102496
16431A02496k6131q9466o5536m2225K7819M6893q01l5493O2047P0412N7434P8892
$$ 102496 76365 -13101 -78637 -120862 -93043 -46150 -46951 -82444 -20397 50015 107449 186341
16419A86341k147o3491j3434k7538M5338m2307j47427m9376J8783O4065j7762
$$ 186341 184194 120703 107269 79731 125069 82762 -64665 -114041 -95258 -31193 -48955
16408d8955M4069J17762O6499l54j07424j4953M9710o0249q2568O767j8074m4270
$$ -48955 -4886 112876 179375 179021 71597 56644 106354 46105 -36463 -29696 -47770 -92040
16396i2040j7467n6789Q5120N0628k7836L9817J01401J0376o6335o3739j4080
$$ -92040 -109507 -166296 -81176 -30548 -58384 -18567 82834 93210 26875 -36864 -50944
16385e0944N345O5740K7498l9812n5546N6226q084n8544j6157J7171N8802K9316
$$ -50944 -45599 20141 47639 7827 -47719 8507 423 -58121 -74278 -57107 1695 31011
16373C1011o0362j0609K2727O6305M629o6488k9349K5598L1847L4813m2545J3603
$$ 31011 -29351 -39960 -17233 49072 53701 -12787 -42136 -16538 15309 50122 7577 21180
16361B1180K6071R0820N8910k2106l2872k5059r5939j6558N533p2691J6890j4547
$$ 21180 47251 138071 196981 174875 142003 116944 21005 4447 9980 -62711 -45821 -60368
16349f0368N9374J28975J7095l7296j2895m5977k0320j1931k7997j8172j9292
$$ -60368 -994 127981 145076 107780 94885 48908 28588 16657 -11340 -29512 -48804
16338d8804l7516j8966J26732R5867l8826k2778M2201M4831n6386m7320j0880
$$ -48804 -86320 -105286 21446 117313 78487 55709 97910 142741 86355 39035 28155
16327B8155N62k6330k2011n8465j6933L0337j0035N299l1201k0400r3531J3083
$$ 28155 28717 2387 -19624 -78089 -95022 -64685 -74720 -69421 -100622 -121022 -214553 -201470
16315b01470J22340J33299K4828K9266n065r5089o2681l9873R5285K1829M2248
$$ -201470 -79130 54169 78997 108263 103198 8109 -54572 -94445 840 22669 64917
16304F4917K2889k0531p6848m5370Q446j05401J6862L8888o1529r7605M9264M6456
$$ 64917 87806 67275 -9573 -54943 -46497 -151898 -135036 -96148 -157677 -255282 -206018 -159562
16292a59562J05932K8066K9181N011o7748m0413K8510M8457O422r386k959Q0698
$$ -159562 -53630 -25564 3617 8628 -59120 -99533 -71023 -22566 -16144 -25530 -28489 52209
16280E2209O600j04309r8186k7330O3878M1480N8221k3250m1149M4842o1818J0562
$$ 52209 58809 -45500 -143686 -171016 -107138 -65658 -7437 -30687 -71836 -26994 -88812 -78250
16268g8250P7817L8541m9605o3185k1407k2237M9645O8860K8699Q5072N0365m2626
$$ -78250 -433 38108 -11497 -74682 -96089 -118326 -68681 179 28878 113950 164315 121689
16256A21689n9588o6216J1343J9733k0978O746r035k9271l4560K7275K5781J06976
$$ 121689 62101 -4115 7228 26961 5983 12729 3694 -25577 -60137 -32862 -7081 99895
16244I9895m450q7804k8373r4198o1563K292o659K7970k6129K4250M4765K2051
$$ 99895 95445 7641 -20732 -114930 -176493 -174201 -180860 -152890 -179019 -154769 -110004 -87953
16232h7953N0988k1622J8508K2837l5938j17871k7489R0453M2283O9252R4328
$$ -87953 -36965 -58587 -40079 -17242 -53180 -171051 -198540 -108087 -65804 3448 97776
16221I7776p4828J1536P015J1794P1303J3630m1904J6669R434j3609p6257p3237
$$ 97776 22948 34484 41499 53293 124596 138226 96322 112991 122425 108816 32559 -40678
16209d0678J4102P0847P563J1362K0972J2860M818q742p8336M3914m3967j8974
$$ -40678 -26576 44271 51834 63196 84168 97028 101846 93104 14768 58682 14715 -4259
16197d259N1697K7123k7072l4872n2707k0034k4319P0063J8064n6478j1200k2765
$$ -4259 47438 74561 47489 12617 -40090 -60124 -84443 -14380 3684 -52794 -63994 -86759
16185h6759N5792N0333l1238j9903j21581o9570N6781R4890Q7930K5085m3459
$$ -86759 -30967 19366 -11872 -31775 -153356 -222926 -166145 -71255 16675 41760 -1699
16174a699N0115k9141m7413P314j9609j5808L122k6085j4322k2545K1189K0889
$$ -1699 48416 19275 -28138 -20824 -40433 -56241 -53119 -79204 -93526 -116071 -94882 -73993
16162g3993J7606k417m025P7985O1048l4664l5774q9128m8202M7975M9282J832
$$ -73993 -56387 -58804 -62829 15156 76204 41540 5766 -83362 -131564 -83589 -34307 -32475
16150c2475k0472L6107k7288l8375j3164M1052p5233J7231J39396M7635p4968
$$ -32475 -52947 -16840 -44128 -82503 -95667 -54615 -129848 -112617 26779 74414 -554
16139e54o6455k2300N233l0805l909M5372J6532l4562j8063O2678m327M3133N9593
$$ -554 -67009 -89309 -84076 -114881 -118790 -73418 -56886 -91448 -109511 -46833 -51160 -8027 51566
16126E1566r013m5025K9822J6072O7645K1098q2839K6649j257o9989o7277j4963
$$ 51566 42553 -2472 27350 43422 111067 132165 49326 75975 74718 4729 -62548 -77511
16114g7511J4110N6330M3146O3227l120J2062l2937L9345P480q2215q1847K7585
$$ -77511 -63401 -7071 36075 99302 96182 108244 75307 114652 122132 39917 -41930 -14345
16102a4345N7288K5841j2407m8249o9551j256j1651K7188Q671M1194L1188O0322
$$ -14345 42943 68784 56377 8128 -61423 -62679 -74330 -47142 -38471 2723 33911 94233
16090I4233n2391j8503p769O354k1595j0773n4122N9785K202P1620J4862m2020
$$ 94233 41842 23339 15570 21924 329 -10444 -64566 -4781 -2579 69041 83903 41883
16078D1883p326p9916k4299n3291l0095k7746K0925L6538Q3790O6283J03408q7956
$$ 41883 34557 -45359 -69658 -122949 -153044 -180790 -159865 -123327 -39537 26746 130154 42198
16066D2198k1496K0857q1790K1154N9596l9975m6432N8060m2483j8557k8287K7976
$$ 42198 20702 41559 -40231 -19077 40519 544 -45888 12172 -30311 -48868 -77155 -49179
16054d9179O4405p045O0702O7718o3542m1270p384k4835p2962k9459R2923J5104
$$ -49179 15226 8181 68883 136601 73059 31789 24405 -430 -73392 -102851 -9928 5176
16042E176l5528n2546P4966P3083j0771r830M9012m0027j19746O12N294P1807
$$ 5176 -30352 -82898 -7932 65151 54380 44550 93562 53535 -66211 -65599 -60305 11502
16030A1502K5944J2564R356J0370N1857k7338m8564l6484o3512m5391L1349J1821
$$ 11502 37446 50010 59366 69736 121593 94255 45691 9207 -54305 -99696 -68347 -56526
16018e6526j5027q989J3212m515L0047J1465p172M1337m2791n6344J776O2401
$$ -56526 -71553 -80542 -67330 -71845 -41798 -30333 -37505 3832 -38959 -95303 -93527 -31126
16006c1126O7620K487r7557n6143j0425L2249Q932J7783N0306l7012l9789Q193
$$ -31126 36494 38981 -58576 -114719 -125144 -92895 -83963 -66180 -15874 -52886 -92675 -84482
15994h4482K5878L7156R590K5311l8649j2108K4059M194L8634M1020j4570L4474
$$ -84482 -58604 -21448 -11858 13453 -25196 -37304 -13245 -9051 29583 70603 56033 90507
15982I0507J2185L2006M4834n5388r9925l8908L3886K9359J9597k0541r266l5885
$$ 90507 102692 134698 179532 124144 24219 -14689 19197 48556 68153 47612 38346 2461
15970B461k4642L9009L0076L6804M3271O7249l0799j26739n7421L5265P0017N533
$$ 2461 -22181 16828 46904 83708 126979 194228 163429 36690 -20731 14534 84551 90084
15958I0084m6655p7159r4683r368N0227K2889j3628J0703M5643L337q960L3453
$$ 90084 43429 -33730 -128413 -137781 -87554 -64665 -78293 -67590 -21947 -18610 -27570 5883
15946E883N482J3878P1248Q4631p3558m9515m8835j29812m9656M9199O1453j0944
$$ 5883 11365 25243 96491 181122 107564 58049 9214 -120598 -170254 -121055 -59602 -70546
15934g0546j6246J08211N0423J18O1141m7562l0634n8525l5647L9566K8948J472
$$ -70546 -86792 21419 71842 71960 133101 85539 54905 -3620 -39267 299 29247 30719
15922C0719m3033M751k2626P1992O8340o3567k5677M4125j8863J1372j08368l1483
$$ 30719 -12314 -7563 -30189 41803 110143 46576 20899 65024 46161 57533 -50835 -82318
15910h2318L2484N6065j742m2504K7087L1489o3101K2926L5387J6379m4680q5918
$$ -82318 -49834 6231 4489 -38015 -10928 20561 -42540 -19614 15773 32152 -12528 -98446
15898i8446m2390L8351L9533M2588J3730J7826M5335M6749N205o1132o3571r0573
$$ -98446 -140836 -102485 -62952 -20364 -6634 11192 56527 103276 108481 47349 -16222 -106795
15886a06795J575J17089J6449l0787q6808j2030L6583M3968N698m169M7535O0406
$$ -106795 -105220 11869 28318 -2469 -89277 -101307 -64724 -20756 -15058 -19227 28308 88714
15874H8714j4255L322J1390M4242K91j11848m3761M5110l413n3857k2758o4471
$$ 88714 74459 77781 89171 133413 133704 21856 -21905 23205 19792 -34065 -56823 -121294
15862a21294m7470J7929L3036Q2077N1839M9716k5804m8542p457O5258J1161l1938
$$ -121294 -168764 -150835 -117799 -35722 16117 65833 40029 -8513 -15970 49288 60449 28511
15850B8511l5342k9814M0608M9541n8030r6L3213J6133j21758p7160J3827k4717
$$ 28511 -6831 -36645 3963 53504 -4526 -4622 28591 44724 -77034 -154194 -140367 -165084
15838a65084J22187P7783P846N531L6194j24103m5542O8376m78j503Q65P423k9842
$$ -165084 -42897 34886 42732 48263 84457 -39646 -85188 -16812 -17290 -18793 -17928 -10505 -40347
15825d0347L2745J5473K7194J6833J764l7741j24090m8611M3444O815K1153j0735
$$ -40347 -7602 7871 35065 51898 53662 15921 -108169 -156780 -113336 -106521 -85368 -96103
15813i6103o69R4929J9063n1942k5633L7428O8657N420q2353j30696n7419J5373
$$ -96103 -96772 -1843 17220 -34722 -60355 -22927 45730 51150 -31203 -161899 -219318 -203945
15801b03945N7836N3324J21929O5476P2162j9580n0274j9422m3608l9534o2212
$$ -203945 -146109 -92785 29144 94620 166782 147202 96928 77506 33898 -5636 -67848
15790f7848O1939M7107l9914l0385K0004m0674j8098R2237M3885K7060o880k1247
$$ -67848 -5909 41198 1284 -29101 -9097 -49771 -67869 24368 68253 95313 88433 67186
15778F7186m5988m083L9297J7967p1293q2910R170M7295M11j7470O703p7900q062
$$ 67186 21198 17115 56412 74379 3086 -79824 -70654 -23359 -22948 -40418 -33715 -111615 -119677
15765a19677k423p2118K9434J07182L7747O0703K6315m6044k9088k4683Q3150
$$ -119677 -122100 -194218 -164784 -57602 -19855 40848 67163 21119 -7969 -32652 50498
15754E0498J1684m9542j13655k1934P6747L76N0958K7911J2253o4235p1470k1895
$$ 50498 62182 12640 -101015 -122949 -46202 -45826 5132 33043 45296 -18939 -90409 -112304
15742a12304R5059N4585q045L709l0701j4316k1102l3749m3538J8072l4663M9552
$$ -112304 -17245 37340 29295 33004 2303 -12013 -33115 -66864 -110402 -92330 -126993 -77441
15730g7441L6111j49429o2058J18799J02691J6475K6575j3013K2911M6038m8498
$$ -77441 -41330 -190759 -252817 -134018 -31327 -14852 11723 -1290 21621 67659 19161
15719A9161O941r962o3307J1065K0976q2561J742O8393j3472k1216j193m9051
$$ 19161 26102 16140 -47167 -36102 -15126 -97687 -95945 -27552 -41024 -62240 -63433 -112484
15707a12484p822R0059l8627q4015O8607M0393q7293k7514P4554M6263R0325M9121
$$ -112484 -120306 -30247 -68874 -152889 -84282 -43889 -131182 -158696 -84142 -37879 52446 101567
15695A01567j5826j2036N613N7157q9562n3130l884O215n0076K9947n1442J452
$$ 101567 85741 73705 79318 136475 46913 -6217 -10101 -3886 -53962 -24015 -75457 -74005
15683g4005O0499K8994M0507M2648n7827l4106q4355J6539M3831J08243j8041
$$ -74005 -13506 15488 55995 98643 40816 6710 -77645 -61106 -17275 90968 72927
15672G2927L0634O8819m9347m3695p0052j5592j010J0830m0921P1757q041l6209
$$ 72927 103561 172380 123033 79338 9286 -6306 -7316 3514 -37407 34350 26309 -9900
15660i900Q935L7932J27633l1224r5315j16824k2992J35602P0712o6218o7187
$$ -9900 -965 36967 164600 133376 38061 -78763 -101755 33847 104559 38341 -28846
15649b8846j4447K9605M5101L9554j23495j5146Q3535M3230o4773m3460O8865
$$ -28846 -43293 -13688 31413 70967 -52528 -67674 15861 59091 -5682 -49142 19723
15638A9723M4095o7385m5364K61O1645o706J7264n8106m8337N7316Q5396l900
$$ 19723 63818 -3567 -48931 -48670 12975 6269 23533 -34573 -82910 -25594 59802 55902
15626E5902L8723k3505Q00n2529L7183L7680J7991j9040q424k0358j09159j5766
$$ 55902 94625 71120 71920 19391 56574 94254 112245 93205 84781 64423 -44736 -60502
15614f0502L4040K0631l3713l0828o668j4070N3185N6493n9430J412J8816K1469
$$ -60502 -26462 -5831 -39544 -70372 -77040 -91110 -37925 18568 -40862 -39450 -20634 835
15602H35J2951l7124p0245J9157J978O790L5009P412K8112K0728j7580M7815J1320
$$ 835 13786 -23338 -93583 -74426 -72448 -65658 -30649 -23237 4875 25603 8023 55838 67158
15589F7158P1112k6858m4323m0774l3623J1317M182R699K4431O140j8175q4772
$$ 67158 138270 111412 67089 26315 -7308 4009 8191 17890 42321 48461 30286 -54486
15577e4486r304M2399N3098K9530l7327l5856m3634P3493N4217L5480k7882n6036
$$ -54486 -63790 -21391 31707 61237 23910 -11946 -55580 17913 72130 107610 79728 23692
15565B3692q7394j9550K2261K3245R040R81m0068j33408n1262M3240P4952K3185
$$ 23692 -63702 -83252 -60991 -37746 -28706 -27725 -67793 -201201 -252463 -209223 -134271 -111086
15553a11086M3410O0606P7830j6053J43k7703j9300m2071K3261M7158o915n017
$$ -111086 -67676 -7070 70760 54707 54850 27147 7847 -34224 -10963 36195 29280 24263
15541B4263L8216m1388q4599j5342R6924l607l3025l3206p0261K0220Q37O0638
$$ 24263 62479 21091 -63508 -78850 18074 14467 -18558 -51764 -122025 -101805 -100968 -40330
15529d0330N6687M6880k3109n0114o2232J974L0175L4832n2037m1348M560N5630
$$ -40330 16357 63237 40128 -9986 -72218 -70244 -40069 -5237 -57274 -98622 -94062 -38432
15517c8432j7500L2539L5986Q7838n569l9540L2703M2702J9346o7899r9728p625
$$ -38432 -55932 -23393 12593 100431 94862 55322 88025 130727 150073 82174 -17554 -25179
15505b5179q6981j0623k8566k6446O9444R7508P198n6285M0674J55655N5666p3097
$$ -25179 -112160 -122783 -151349 -177795 -108351 -10843 -3645 -59930 -19256 136399 192065 118968
15493A18968j2676J357j2051m2157r5563l958R5307J6465j7917K6344O1223j14352
$$ 118968 106292 107649 95598 53441 -42122 -46080 49227 65692 47775 74119 135342 20990
15481B0990n1203m7165L6040K4585L5313m3238K8977L3763p5941K7558J3262L2040
$$ 20990 -30213 -77378 -41338 -16753 18560 -24678 4299 38062 -37879 -10321 2941 34981
15469C4981K7330p0419o2867N6848K5878n539j0030J256o316O3677k8129j0212
$$ 34981 62311 -8108 -70975 -14127 11751 6212 -3818 -2562 -8878 54799 26670 16458
15457A6458k8566J198J4972o797j8022o9497M3724P8863j8458j08116m0122J5116
$$ 16458 -12108 -10910 4062 -2735 -20757 -90254 -46530 32333 13875 -94241 -134363 -119247
15445a19247R4838k7348P0077J6951j3645p2623n2495L1586K6519j9182J4922
$$ -119247 -24409 -51757 18320 35271 21626 -50997 -103492 -71906 -45387 -64569 -49647
15434d9647j6068l5685p1746n7849Q4310Q6966J28837l3364j7189l7320N0596
$$ -49647 -65715 -101400 -173146 -230995 -146685 -59719 69118 35754 18565 -18755 31841
15423C1841K9963M8955m6581K2399M0844R390p7349j73715m0108J15257R3090
$$ 31841 61804 110759 64178 86577 127421 136811 59462 -114253 -154361 -39104 53986
15412E3986k2059m447M3286m3952k8637R1221j1944o6630p019L915r0473j66553
$$ 53986 31927 27480 70766 26814 -1823 89398 77454 10824 3805 7720 -82753 -249306
15400b49306J9529J28781Q2569n6921k1671J3850M1237O58l2499l8713m185Q1484
$$ -249306 -229777 -100996 -18427 -75348 -97019 -83169 -41932 -41274 -73773 -112486 -116671 -35187
15388c5187N2252N070k1230j07701J2803J11052K1951l7660J3808M0528n6751
$$ -35187 17065 22135 905 -106796 -93993 17059 39010 1350 15158 55686 -1065
15377a065l4903m4028j16179m5647O4698J59895M3757j2026L6399M588N0851J00729
$$ -1065 -35968 -79996 -196175 -241822 -177124 -17229 26528 14502 50901 55489 106340 207069
15365B07069L3973q8545r8504o9250k2393N2634N5990m5179o0252M5633k426L7389
$$ 207069 241042 152497 53993 -15257 -37650 14984 70974 25795 -34457 11176 8750 46139
15353D6139l4842n1124M7795J07278K7387j6299L0777m2357j14810p6921r527
$$ 46139 11297 -39827 7968 115246 142633 126334 157111 114754 -56 -76977 -86504
15342h6504j122M6459N8937R7414q2509L3741p2625l5803N5473Q772K5016p5996
$$ -86504 -87626 -41167 17770 115184 32675 66416 -6209 -42012 13461 22233 47249 -28747
15330b8747Q8495Q1502P088l3306j224o3982n8940j2876J013O0354M3398n2693
$$ -28747 59748 141250 148338 115032 113808 49826 -9114 -21990 -20977 39377 82775 30082
15318C0082n9049L8195J0068k1599k1705N7848n6700Q629N8874l821j08555j25158
$$ 30082 -28967 9228 19296 -2303 -24008 33840 -22860 -14231 44643 40822 -67733 -192891
15306a92891J2205K5661Q8168l8670j4597J21714n4070o8676J09410J01885q281
$$ -192891 -180686 -155025 -66857 -105527 -120124 1590 -52480 -121156 -11746 90139 81858
15295H1858j06089n517L2083k2113o2376j6120K704K3417l9283j250R7982j6426
$$ 81858 -24231 -29748 2335 -19778 -82154 -98274 -95570 -72153 -111436 -112686 -14704 -31130
15283c1130n0221p4012P876O3595q6611m1765N0549P4877N2590R1727O1234k8200
$$ -31130 -81351 -155363 -147487 -83892 -170503 -212268 -161719 -86842 -34252 57475 118709 90509
15271I0509k5543o9092N6869n4265j2437m2556r6829L5164K2408O6784k6421R1395
$$ 90509 64966 -4126 52743 -1522 -13959 -56515 -153344 -118180 -95772 -28988 -55409 35986
15259C5986K9497n5207j39916m8310M3705Q4747P6818K0348m4739Q071N1624O4835
$$ 35986 65483 10276 -129640 -177950 -134245 -49498 27320 47668 2929 11000 62624 127459
15247A27459l6697o2361m5310j0455q155J18424K6425o7294L3162K0519l098o5121
$$ 127459 90762 28401 -16909 -27364 -35519 82905 109330 42036 75198 95717 92619 27498
15235B7498k7094j0439l7854m1297n690K3968k3001J25637M1058K7379q6310K0141
$$ 27498 404 -10035 -47889 -89186 -94876 -70908 -93909 31728 72786 100165 13855 33996
15223C3996L3109o3942j2087r837K7666J3923m3692l5232k2804o8930j1536R7848
$$ 33996 67105 3163 -8924 -18761 8905 22828 -20864 -56096 -78900 -147830 -159366 -61518
15211f1518Q9168L5643l0015j36715m350P6181p395q1949k4986r65K8217Q197
$$ -61518 27650 63293 33278 -103437 -107787 -31606 -39001 -120950 -145936 -146901 -118684 -110487
15199a10487O2551N2733j104K5479k767p3996n8246P8678K1518K4980J412l8388
$$ -110487 -47936 4797 3693 29172 26405 -47591 -105837 -27159 -5641 19339 20751 -17637
15187a7637r4443J7901Q2351l1O4040j1704K6992k0882n2604J32983J0020j8923
$$ -17637 -112080 -94179 -11828 -11859 52181 40477 67469 46587 -6017 126966 136986 118063
15175A18063l2795o7840m86M3629k7528o2666p5681J002P8134N4462j5212j3758
$$ 118063 85268 17428 16942 60571 33043 -29623 -105304 -104302 -26168 28294 13082 -676
15163f76p4390o9324N5369P1800l8545J08704K4449j15886P008k0078k0023O211
$$ -676 -75066 -144390 -89021 -17221 -55766 52938 77387 -38499 -31491 -51569 -71592 -65381
15151f5381O278p211J8660J03562K2981p645j02196l7557K5587j8425j6429J3945
$$ -65381 -59103 -66314 -47654 55908 78889 71244 -30952 -68509 -42922 -61347 -77776 -63831
15139f3831L1664m1067p525K3527J1856J502n7857L2897P4992P5820j0494m5895
$$ -63831 -32167 -73234 -80759 -57232 -45376 -43874 -101731 -68834 6158 81978 71484 25589
15127B5589j6684o912p6509O3487J00321q0000K4993Q1243k4951o4090j3273p83
$$ 25589 8905 1993 -74516 -11029 89292 9292 34285 115528 90577 26487 13214 12431
15115A2431j7368M191p1212l048O9750o4202r915K875l675p2365O0387M6910m4296
$$ 12431 -4937 -746 -71958 -75006 -5256 -69458 -79373 -76498 -80173 -152538 -92151 -45241 -89537
15102h9537m4916J5259P1004P0098J25531P8838m5363m4563K5002p9677j18715
$$ -89537 -134453 -119194 -48190 21908 147439 226277 180914 136351 161353 81676 -37039
15091c7039k4337m3006J8720N9772k678j4118N3851M6326n8158r658r886N6010
$$ -37039 -61376 -104382 -85662 -25890 -28568 -42686 11165 57491 -667 -10325 -20211 35799
15079C5799K0180n5282K8185m6110J1134P0251P731K0252q0555q3689L5591O4694
$$ 35799 55979 697 28882 -17228 -6094 64157 71888 92140 11585 -72104 -36513 28181
15067B8181k7873K9435Q70q8571N3419j1744J8682k9366N2349O7797o7827j4620
$$ 28181 308 29743 30613 -57958 -4539 -16283 2399 -26967 25382 93179 25352 10732
15055A0732o5098n0385N0649N1362J4578K8438L026J25169m1589r7602j4510j0004
$$ 10732 -54366 -104751 -54102 -2740 11838 40276 43302 168471 126882 29280 14770 4766
15043D766p6628j9686j7474J0425N4160M670L3408J1166r3613j00347K1590L8130
$$ 4766 -71862 -91548 -109022 -98597 -44437 -39767 -6359 4807 -88806 -189153 -167563 -129433
15031a29433O2317M2729o1892j1410K0039l1129R810J2930l931l5252K1747N1722
$$ -129433 -67116 -24387 -86279 -97689 -77650 -108779 -98969 -86039 -89970 -125222 -103475 -51753
15019e1753k4675q394Q8188J30013j2166m8885l9784L8623O1258m3828n8963k9096
$$ -51753 -76428 -84822 3366 133379 121213 72328 32544 71167 132425 88597 29634 538
15007E38j1014o8738m6919L3088O2561K1049p4622M4624L7256r7710m6043O6490
$$ 538 -10476 -79214 -126133 -93045 -30484 -9435 -84057 -39433 -2177 -99887 -145930 -79440
14995g9440J00305M784o5733Q3316L0470J2220P152L132J3551q2421n9324M7481
$$ -79440 20865 25649 -40084 43232 73702 85922 93074 96206 109757 27336 -31988 15493
14983A5493K0493l6602q364M1596j11398o0433J26968J1242j18169J9966K6963
$$ 15493 35986 -616 -8980 32616 -78782 -139215 -12247 -1005 -119174 -99208 -72245
14972g2245M2235K8494J5441M041l0258l9610J1629m9821J0166L8148l8927k0952
$$ -72245 -30010 -1516 13925 17966 -12292 -51902 -40273 -90094 -79928 -41780 -80707 -101659
14960a01659j7600J15665Q8211l0970q9635m3965L8803L1608J8599q0982q4874
$$ -101659 -119259 -3594 84617 53647 -35988 -79953 -41150 -9542 9057 -71925 -156799
14949a56799R2158M5607p593j9476k2810N8247O8513J2544J3894m9187K7776M1937
$$ -156799 -64641 -19034 -26627 -46103 -68913 -10666 57847 70391 84285 35098 62874 104811
14937A04811j08733o9759Q4903p4603m5380K1201N0711M0808P5795o9260n4224
$$ 104811 -3922 -73681 11222 -63381 -108761 -87560 -36849 3959 79754 10494 -43730
14926d3730J1303J04685L9888n1633n2238P6002j8707n3929r5982m919j2175n07
$$ -43730 -32427 72258 112146 60513 8275 84277 65570 11641 -84341 -89260 -101435 -101942
14914a01942M9706m2075l0385M5710L8389J0509K5300k2552K8907M0682O9137
$$ -101942 -52236 -94311 -124696 -78986 -40597 -30088 -4788 -27340 1567 42249 111386
14903A11386Q7131m6581r3239r2708n9585Q209R997p6483K3451J03190Q7700k2783
$$ 111386 198517 151936 58697 -34011 -93596 -85387 -75390 -151873 -128422 -25232 62468 39685
14891C9685n8258J4246m2712r8871L0514J10009Q20o8909o2831K8294O1146R835
$$ 39685 -18573 -4327 -47039 -145910 -115396 -5387 -4567 -73476 -136307 -108013 -46867 -37032
14879c7032O252k1215m1633L8340O3848O0770k9012l1598n6698p2850k7658N0924
$$ -37032 -30780 -51995 -93628 -55288 8560 69330 40318 8720 -47978 -120828 -148486 -97562
14867i7562P2634l6063L074j386m6089k0598M4254l374P1101M2519P6681N8435
$$ -97562 -24928 -60991 -57917 -59303 -105392 -125990 -81736 -85110 -14009 28510 105191 163626
14855A63626r8350q0711l0717j8947m5765j455K6019l4028M3155R0672M7181p9448
$$ 163626 65276 -15435 -46152 -65099 -110864 -112319 -86300 -120328 -77173 13499 60680 -18768
14843a8768j06341k4904l1713L1375O7279N5490N6585K2622o0980L1555J8559
$$ -18768 -125109 -150013 -181726 -150351 -83072 -27582 29003 51625 -9355 22200 40759
14832D0759m7027M498M011J6088O8363J0173l9251p3256j4517J6270J6854N1528
$$ 40759 -6268 -1770 2241 18329 86692 96865 57614 -15642 -30159 -13889 2965 54493
14820E4493p6661o1362r941J28230Q950p4892m5760J3318M190L7350N6948K1424
$$ 54493 -22168 -83530 -93471 34759 43709 -31183 -76943 -63625 -59435 -22085 34863 56287
14808E6287l7578r5358n7307K3332O8249j822L2518j2814J647j7353n6546M9612
$$ 56287 18709 -76649 -133956 -110624 -42375 -44197 -11679 -24493 -22846 -40199 -96745 -47133
14796d7133O4808j671R631m7748M3288Q7864P8443p1196n3300p1083k265m4393
$$ -47133 17675 16004 25635 -22113 21175 109039 187482 116286 62986 -8097 -10362 -54755
14784e4755J1866P3593P4890p567k6495k2865N634J20151M5873L587K0665j03507
$$ -54755 -42889 30704 105594 98027 71532 48667 54301 174452 220325 223912 244577 141070
14772A41070p9076M5236r1611p0718O740J9689L9063K0419K6296J005n9799k626
$$ 141070 61994 107230 15619 -55099 -48359 -28670 10393 30812 57108 58113 -1686 -4312
14760d312L8224k8255M1355M595p4813j9969K0900K1721o8938n1725O0166n837
$$ -4312 33912 5657 47012 51607 -23206 -43175 -22275 -554 -69492 -121217 -61051 -66888
14748f6888p3498K7946R612P9150O0474j9402j0101l4032j5056k8621m7897m4508
$$ -66888 -140386 -112440 -102828 -23678 36796 17394 7293 -26739 -41795 -70416 -118313 -162821
14736a62821R1567n6722p9187M2807L6533J398M8493M0413R702j00067o5416k2
$$ -162821 -71254 -127976 -207163 -164356 -127823 -126425 -77932 -37519 -27817 -127884 -193300 -193322
14724a93322J14601R4420o8701q4174M0431L7784M6439N8505L7773l358J5044
$$ -193322 -78721 15699 -53002 -137176 -96745 -58961 -12522 45983 83756 80398 95442
14713I5442j5091n5743k4091l3556J0317l423o5631M2253K5420k7228J8393j4495
$$ 95442 80351 24608 517 -33039 -22722 -26145 -91776 -49523 -24103 -51331 -32938 -47433
14701d7433k5722l0520J5074J8314N1185J12426O2471p9628m5564P0206j12454
$$ -47433 -73155 -103675 -88601 -70287 -19102 93324 155795 76167 30603 100809 -11645
14690a1645m7286J996n944L0169J8091q6681M7068K3645l1121m4899K7514L7363
$$ -11645 -58931 -56935 -62879 -32710 -14619 -101300 -54232 -30587 -61708 -106607 -79093 -41730
14678d1730K7006O3900q375r7057p8413Q0562L9544o7763j7943p3828m3604J35276
$$ -41730 -14724 49176 40801 -56256 -134669 -54107 -14563 -82326 -100269 -174097 -217701 -82425
14666h2425r674J06381K7308p8627l1715j9635N5468J5183L9061M9463R6360l4263
$$ -82425 -92099 14282 41590 -37037 -68752 -88387 -32919 -17736 21325 70788 167148 132885
14654A32885p5358p36L9751K3943q1368p6370r2527M2291M6758j7328M9397L2843
$$ 132885 57527 56791 96542 120485 39117 -37253 -129780 -87489 -40731 -58059 -8662 24181
14642B4181O7375m6405p5479q616K79J8571N5077L3106l1270n6002p221P3251
$$ 24181 91556 45151 -30328 -38944 -38665 -20094 34983 68089 36819 -19183 -26404 46847
14630D6847R1438p150o4278p2884O9747P6583n5951j2521k5854p6446L5880N5697
$$ 46847 138285 131135 66857 -6027 63720 140303 84352 71831 45977 -30469 5411 61108
14618F1108m0805n3550O5541j3235j10148q994Q1089N0291M8893N6980m4523o519
$$ 61108 20303 -33247 32294 19059 -91089 -100083 -18994 31297 80190 137170 92647 86128
14606H6128K8327o5985j1734j15281n4039R1231M0894p93L6298R5607k9581r6518
$$ 86128 114455 48470 36736 -78545 -132584 -41353 -459 -1252 35046 130653 101072 4554
14594D554l8979o6629O6026L4335p365l5856k4144k8702l990N6229M4118L8380
$$ 4554 -34425 -101054 -35028 -693 -8058 -43914 -68058 -96760 -100750 -44521 -403 37977
14582C7977J9921j26802l1086L4433J13561O486k4006m2338q5593o1739Q0708
$$ 37977 57898 -68904 -99990 -65557 48004 54490 30484 -11854 -97447 -159186 -78478
14571g8478Q1454M1058l3704q0542K7158R4138j992K8363J5026m9980l0376O1125
$$ -78478 2976 44034 10330 -70212 -43054 51084 49092 77455 92481 42501 12125 73250
14559G3250k6107o4022r1984R6094K7307n3345l9084L2745n4620m158M3293Q6301
$$ 73250 47143 -16879 -108863 -12769 14538 -38807 -77891 -45146 -99766 -103924 -60631 25670
14547B5670K6092k3986Q833k3937j3557n2307m4460R083N3606Q342O6475q504
$$ 25670 51762 27776 36609 12672 -885 -53192 -97652 -88569 -34963 -26621 39854 31350
14535C1350l2433j04012L0741N7935K3612J5282K7499l5664o8214N4642m1924
$$ 31350 -1083 -105095 -74354 -16419 7193 22475 49974 14310 -53904 738 -41186
14524d1186j9416j1415O541N5843J9100p2266k1069m0494k5738M1826N3459m4754
$$ -41186 -60602 -72017 -65476 -9633 9467 -62799 -83868 -124362 -150100 -108274 -54815 -99569
14512i9569k2083Q981o450l7101L3019M4931J6071R6538O2598K0124M6881P0488
$$ -99569 -121652 -112671 -119121 -156222 -123203 -78272 -62201 34337 96935 117059 163940 234428
14500B34428m6064j00132j8481M5761K0482l6660l7801n8705p8449k022K3236
$$ 234428 188364 88232 69751 115512 135994 99334 61533 2828 -75621 -77643 -54407
14489e4407Q048Q3649O169o3283L862N7955L4630q0937L7454J536l4200o9262
$$ -54407 -46359 37290 43459 -19824 -15962 41993 76623 -4314 33140 34676 476 -68786
14477f8786j1363J41794Q9533K6006n228q5644n7322K1521K255m500m8439J3685
$$ -68786 -80149 61645 151178 177184 171956 86312 28990 50511 52766 48266 -173 13512
14465A3512N0138K6789N123K22M5108k7460n909p3407j6392j8397P1558M5075
$$ 13512 63650 90439 95562 95784 140892 113432 107523 34116 17724 -673 70885 115960
14453A15960N631l0213q1182O3684M1200J1083p9378l404l816o5756o708n727
$$ 115960 121591 91378 10196 73880 115080 126163 46785 43381 39565 -26191 -32899 -38626
14441c8626K6744M2017Q662n0275q8189o0843M3605K5417K7662m1895K4909N276
$$ -38626 -11882 30135 38797 -11478 -99667 -160510 -116905 -91488 -63826 -105721 -80812 -75536
14429g5536J5507j86N1627J9437n232O0599n6926L5009M5211k2192L4994p344
$$ -75536 -60029 -60215 -8588 10849 5617 66216 9290 44299 89510 67318 102312 94968
14417I4968M6932o4619l2044l5610l7564J2735N8346j845m521M1826n564o0683
$$ 94968 141900 77281 45237 9627 -27937 -15202 43144 41299 36778 78604 73040 12357
14405A2357k9521N5022k0487k6758l2163K0620Q2819J6839Q881p1747n0032j4816
$$ 12357 -17164 37858 17371 -9387 -41550 -20930 61889 78728 87609 15862 -34170 -48986
14393d8986K1186L9573K3029k4788q0669r1598k2806L9280O8045J2118O6374J9065
$$ -48986 -27800 11773 34802 10014 -70655 -162253 -185059 -145779 -77734 -65616 758 19823
14381A9823j11716o7391J8568N078K1082l6520P0550M1794M7922K2967l2931N7883
$$ 19823 -91893 -159284 -140716 -135638 -114556 -151076 -80526 -38732 9190 32157 -774 57109
14369E7109K3538k8650j8809k566J01943J2162m7898n5183n4226K2698N5301n217
$$ 57109 80647 51997 33188 30622 132565 144727 96829 41646 -12580 10118 65419 60202
14357F0202l6370R045j8667J3769o918j3189k6677k3430j3386l3530N6221N5646
$$ 60202 23832 32877 14210 27979 21061 7872 -18805 -42235 -55621 -89151 -32930 22716
14345B2716Q1446K7025k1016m2095o3561M0710P1444o0799j2509k987j3235o6442
$$ 22716 104162 131187 110171 68076 4515 45225 116669 55870 43361 40374 27139 -39303
14333c9303o2616J3368o519Q2871O1551J8398Q3387K435p7223j994j8212J2767
$$ -39303 -101919 -88551 -95070 -12199 49352 67750 151137 153572 76349 74355 56143 68910
14321F8910k7192n5474m1965P5359M1864j01284p6525l2306J4812J15540k8910
$$ 68910 41718 -13756 -55721 19638 61502 -39782 -116307 -148613 -133801 -18261 -47171
14310d7171m811P0668J8442P8709n2635n4624M5051O6729O669N108j4270o0577
$$ -47171 -51982 18686 37128 115837 63202 8578 53629 120358 127027 132135 117865 57288
14298E7288j63296K940M0630J09676k0610k0662N4027o5340o2813J16474K1945
$$ 57288 -106008 -103068 -62438 47238 26628 5966 59993 -5347 -68160 48314 70259
14287G0259m0840k2481K7559m3366o0038n002N4714O2854k2205j4946m635j671
$$ 70259 29419 6938 34497 -8869 -68907 -73909 -19195 43659 21454 6508 1873 202
14275B02P0533N6343L5919o5109m1196L497l7230N3526M5559l9932o1127M1998
$$ 202 70735 127078 162997 97888 56692 60189 22959 76485 122044 82112 20985 62983
14263F2983l144j1804M1700N9217m3876j2666k0625J4620n3493r1636L6332m9801
$$ 62983 59839 48035 89735 148952 105076 92410 71785 86405 32912 -58724 -22392 -72193
14251g2193j0854N9429K8019Q4527N1193l1678o0654K7297M2977L4294l3916q1552
$$ -72193 -83047 -23618 4401 88928 140121 108443 47789 75086 118063 152357 118441 36889
14239C6889l8755k1182j1143o735o725m759K2930M4840M1170J953l2925r5993
$$ 36889 -1866 -23048 -34191 -40926 -47651 -52410 -29480 15360 56530 58483 25558 -70435
14227g0435n0951M0455R0717n435n5468J011R674r1115J5236Q9421k6171k7676
$$ -70435 -121386 -80931 9786 4351 -51117 -50106 -40432 -131547 -116311 -26890 -53061 -80737
14215h0737L0505J2237O756n730O2943M4569K4985K8510l4382m8780N6183L6110
$$ -80737 -50232 -37995 -31239 -36969 25974 70543 95528 124038 89656 40876 97059 133169
14203A33169q3551o1018r6548K3906Q2067J16646j3983j8022O0606r053o7172
$$ 133169 49618 -11400 -107948 -84042 -1975 114671 100688 82666 143272 134219 67047
14192F7047n910M9344j3106n0260k3138l4578n0964m4062R0005P3344Q2326p4667
$$ 67047 61137 110481 97375 47115 23977 -10601 -61565 -105627 -15622 57722 140048 65381
14180F5381o7785M0851Q6574J6013k5438j03710l6221M0388J2351o0992J1942
$$ 65381 -2404 38447 125021 141034 115596 11886 -24335 16053 28404 -32588 -20646
14169b0646k2894J4899R8631l2837j9155n665k3475k7614J0959M4166l1265K9619
$$ -20646 -43540 -28641 69990 37153 17998 12333 -11142 -38756 -27797 16369 -14896 14723
14157A4723j1765K1933P5135o346l7947K1290n5070L1714n07N6303L7070m1492
$$ 14723 2958 24891 100026 93680 55733 77023 21953 53667 53160 109463 146533 105041
14145A05041p6756j08662o4725l8924R6704K4514p3887O5705M1813Q480K0716
$$ 105041 28285 -80377 -145102 -184026 -87322 -62808 -136695 -70990 -29177 -20697 19
14134A9N9507M6875j5742L477O8o6534m0597j0871n5337o386k276P8j4881l20
$$ 19 59526 106401 90659 94136 94204 27670 -12927 -23798 -79135 -85521 -87797 -87719 -102600 -102920
14120a02920m6648N804L8976L3984P5256K0962M6445m90p5152r1840m3826p461
$$ -102920 -149568 -143764 -104788 -70804 4452 25414 71859 71369 -3783 -95623 -139449 -146910
14108a46910M0524n3705N1590O8305O908L4492j3300r557j0840N4278l5934N9289
$$ -146910 -106386 -160091 -108501 -40196 -33288 1204 -12096 -21653 -32493 21785 -14149 45140
14096D5140L2607j9008K699j00095k4108J02615L5449j9271J6856p160m6322p509
$$ 45140 77747 58739 61438 -38657 -62765 39850 75299 56028 72884 65724 19402 11893
14084A1893L1583l1370K575M937K0216N5905n8015O398L4790j9824n4445K8165
$$ 11893 43476 12106 14681 19618 39834 95739 37724 44122 78912 59088 4643 32808
14072C2808p9630j51256J3762P0004L3054O3621k964l3377O6051o8698n4018l7874
$$ 32808 -46822 -198078 -184316 -114312 -81258 -17637 -20601 -53978 12073 -56625 -110643 -148517
14060a48517L5617N8551L5227M097K2134J0435o5777m9290k5611L5030O7449l5556
$$ -148517 -112900 -54349 -19122 -15025 7109 17544 -48233 -97523 -123134 -88104 -20655 -56211
14048e6211j00306J5459L1998P163J9536K4207m9178K757L516Q9980k3058j2574
$$ -56211 -156517 -141058 -109060 -101897 -82361 -58154 -107332 -104575 -101059 -11079 -34137 -46711
14036d6711M3916l2104O9706K8364o6750L3383P483N2672J7784n6204q729m7144
$$ -46711 -2795 -34899 34807 63171 -3579 29804 37287 89959 107743 51539 42810 -4334
14024d334M9958K3539J4429l3968j4862o434J1920l1098p5371r832j839R0760
$$ -4334 45624 69163 83592 49624 34762 28328 40248 9150 -66221 -76053 -77892 12868
14012A2868n2121n6703J4120R1045P5705j0823K0821L434j01852n6738o8242O4738
$$ 12868 -39253 -95956 -81836 9209 84914 74091 94912 98346 -3506 -60244 -128486 -63748
14000f3748L119O656K0644M1856k7557o3218m4927l749N1733j4630J3723R4075
$$ -63748 -60629 -53973 -33329 8527 -19030 -82248 -127175 -130924 -79191 -93821 -80098 13977
13988A3977O3442j9346r014P8338q818j880N376k2605j6386q656M6186M2985m3
$$ 13977 77419 58073 49059 127397 118579 116699 122075 99470 83084 74428 120614 163599 163556
13975A63556n6877q6302l0574n86J933M5874N1363J7389K6179j3396J2267K7159
$$ 163556 106679 20377 -10197 -10783 -8850 37024 88387 105776 131955 118559 130826 157985
13963A57985l8693K3812K3146m0813n4997L2327M4320l3397o4361j6187K2213
$$ 157985 119292 143104 166250 125437 70440 102767 147087 113690 49329 33142 55355
13952E5355l0749O1623N2640j4948n9893k9396J3604K3814p6392k4411J4740N2364
$$ 55355 24606 86229 138869 123921 64028 34632 48236 72050 -4342 -28753 -14013 38351
13940C8351K9059N8576N8640l5165q3475L7497L7566m475m5321p7876n3931k33
$$ 38351 67410 125986 184626 149461 65986 103483 141049 136574 91253 13377 -40554 -40787
13928d0787J4943l4574J5097J14716O7363J9085k5322n0610N2220P8936k802j23931
$$ -40787 -25844 -60418 -45321 69395 136758 155843 130521 79911 132131 211067 208265 84334
13916H4334j32875K0951J02230K7661m8551J2156j07628J9979P5648m7877p5538
$$ 84334 -48541 -27590 74640 102301 53750 65906 -41722 -21743 53905 6028 -69510
13905f9510L9323N6966M105M5745o5328o8749n1528L9255N6547N3154q018r6631
$$ -69510 -30187 26779 30884 76629 11301 -57448 -108976 -69721 -13174 39980 31962 -64669
13893f4669J5546L0131j348m4497M594l9483R1004Q2642J8923j3609o7273K788
$$ -64669 -49123 -18992 -20340 -64837 -60243 -99726 -8722 73920 92843 79234 11961 14749
13881A4749N2682N4676l6983o3916J1906q3157l1968K3417k0775P6629O5763k0006
$$ 14749 67431 122107 85124 21208 33114 -50043 -82011 -58594 -79369 -2740 63023 43017
13869D3017P395K1753q26m1468J3224n3819j7112q763j611J039L5312n6449m7704
$$ 43017 50412 72165 71339 29871 43095 -10724 -27836 -36599 -38210 -37171 -1859 -58308 -106012
13856a06012M8222P8543N8084p0978K5074N1458k1247P529J2913k1564j4393k1019
$$ -106012 -57790 20753 78837 7859 32933 84391 63144 70673 83586 62022 47629 26610
13844B6610n5477k4448L8060K9336Q470r2959Q210K000Q7634P6151j23222k358
$$ 26610 -28867 -53315 -15255 14081 22551 -70408 -62198 -60198 27436 103587 -19635 -21993
13832b1993K7509J6152n5032m3884O4229k2825M502K0572m952J13998m740l4845
$$ -21993 5516 21668 -33364 -77248 -13019 -35844 -31342 -10770 -15722 98276 93536 58691
13820E8691R2917J847L0065k3731j56317j21174M2159l4060k8723N2131K6827
$$ 58691 151608 153455 183520 159789 3472 -117702 -75543 -109603 -138326 -86195 -59368
13809e9368O050l496Q2785k0785J1924k260J071P5492L5124j21656l5953n330
$$ -59368 -53318 -56814 25971 5186 17110 14850 15921 91413 126537 4881 -31072 -36402
13797c6402K2714k316l2097p4385k6492L9712K7770P5400N2305N5375m4318M874
$$ -36402 -13688 -16004 -48101 -122486 -148978 -109266 -81496 -6096 46209 101584 57266 62140
13785F2140K2826K6033P3403Q845k6940p6525j33899j570N1163R2696Q7576m6783
$$ 62140 84966 110999 184402 193247 166307 89782 -44117 -45687 5476 98172 185748 138965
13773A38965J0709M5068q7571j1413J1347k9245N4414l5835m9443N7892o91k4790
$$ 138965 149674 194742 107171 95758 107105 77860 132274 96439 46996 104888 104197 79407
13761G9407o9307j8776k9884p361L1071r874j3627l8730K0185J03381R4467q8621
$$ 79407 10100 -8676 -38560 -45921 -14850 -24724 -38351 -77081 -56896 46485 140952 52331
13749E2331j49279j0573O064J8730J79804M5572K4232l6035q8376m0514l3485
$$ 52331 -96948 -107521 -101457 -82727 97077 142649 166881 130846 42470 1956 -31529
13738c1529k5634P9752k7967q4291j50900R327R6762Q3239K4429J6314L0939j1170
$$ -31529 -57163 22589 -5378 -89669 -240569 -231242 -134480 -51241 -26812 -10498 20441 9271
13726I271m1850p9725n963M4120R4926m3137Q709N3837r218p4825l13P629Q733
$$ 9271 -32579 -112304 -118267 -74147 20779 -22358 -13649 40188 30970 -43855 -44168 -36539 -27806
13713b7806j4318J337K3472m0703P197q633k0832l5971R0813L7563k1503K0014
$$ -27806 -42124 -40787 -17315 -58018 -50821 -59454 -80286 -116257 -25444 12119 -9384 10630
13701A0630m383J3128q1906M716L3413m1073n0534J18529Q1583j3998o9671j2667
$$ 10630 6247 19375 -62531 -57815 -24402 -65475 -116009 2520 84103 70105 434 -12233
13689a2233m7399J3495J03519p3181q4666k3786K854J00172P4619j9091l5899
$$ -12233 -59632 -46137 57382 -15799 -100465 -124251 -121397 -21225 53394 34303 -1596
13678a596j4874m7845j6920O7816M7133N8598J5599K3801l9316q5349p6998j9453
$$ -1596 -16470 -64315 -81235 -13419 33714 92312 107911 131712 92396 7047 -69951 -89404
13666h9404O9062J4754l498q8072q0887l6742O9730P6287J0554R144n3978O6339
$$ -89404 -20342 -5588 -9086 -97158 -178045 -214787 -145057 -68770 -58216 -49072 -103050 -36711
13654c6711M0340L2738O6230J0158j8533P2090K6113k6340o0375m2540m2545J6824
$$ -36711 3629 36367 102597 112755 94222 166312 192425 166085 105710 63170 20625 37449
13642C7449O300J1077P109l6957l5820L5025M6072K6726N4806k6093j00820n4023
$$ 37449 43749 54826 61935 24978 -10842 24183 70255 96981 151787 125694 24874 -29149
13630b9149J1977K6437m0605M5088M1512m8860l9357J5550Q9642n2727O1297N5299
$$ -29149 -17172 9265 -31340 13748 55260 6400 -32957 -17407 72235 19508 80805 136104
13618A36104O838j06207l5731k6599J17836J35715o9151j9506m392q0383L905
$$ 136104 142942 36735 1004 -25595 92241 227956 158805 139299 134907 54524 58429
13607E8429j0419N1979N6781P09L2346L9539q3783q3807q8793l81j758j6246K3446
$$ 58429 48010 99989 156770 157479 189825 229364 145581 61774 -27019 -27400 -29158 -45404 -21958
13594b1958P8550L9431O013J2691j02712p1808m2292q8957m7517j23P8173Q1202
$$ -21958 56592 96023 102036 114727 12015 -59793 -102085 -191042 -238559 -238682 -160509 -79307
13582g9307O3580j0561O7797N853l1821k2146N8971M8547N1271k3753k2385l3624
$$ -79307 -15727 -26288 41509 47362 15541 -6605 52366 100913 152184 128431 106046 72422
13570G2422l0239k1108m2424L0076L4393m0647k4282K07k9827L8429N4544O980
$$ 72422 42183 21075 -21349 8727 43120 2473 -21809 -21602 -51429 -13000 41544 48524
13558D8524l9109q40k9217k6861M9861J06616L1548q006j3416m2794o8681j3165
$$ 48524 9415 8575 -20642 -47503 2358 108974 140522 132516 119100 76306 7625 -5540
13546e540l6366N0576K4334j8338L0715J5232J3651L4458k9348l2816J4088l649
$$ -5540 -41906 8670 33004 14666 45381 60613 74264 108722 79374 46558 60646 56997
13534E6997J108l079q1913J4826M3836o2395K2498N7406P3330o7253q7491j7261
$$ 56997 58105 55026 -26887 -12061 31775 -30620 -8122 49284 122614 55361 -32130 -49391
13522d9391M0321N3773O317p8347l8534p8010R602N6611j7388K7725P3434M2549
$$ -49391 -9070 44703 51020 -27327 -65861 -143871 -134269 -77658 -95046 -67321 6113 48662
13510D8662j2966p8579k5037N050J0666M6768j1472m6200M1770M3583Q6912m8725
$$ 48662 35696 -42883 -67920 -62870 -52204 -5436 -16908 -63108 -21338 22245 109157 60432
13498F0432j2873q995l0430O323K5800N2018q9369o3241J8261K6627J2962P7765
$$ 60432 47559 38564 8134 14457 40257 92275 2906 -60335 -42074 -15447 -2485 75280
13486G5280n9335K7910r9494q0997L0619M4934P107k0621J6623J9988J6812J036
$$ 75280 15945 43855 -55639 -136636 -106017 -61083 -53976 -74597 -57974 -37986 -21174 -20138
13474b0138N7826J5895l1884j30020n0283P0184Q7992Q0737J5714j06543m7065
$$ -20138 37688 53583 21699 -108321 -158604 -88420 -428 80309 96023 -10520 -57585
13463e7585M3126P9132J7656o0096n3467l4527j4558K9611J5169M8823N0512M6335
$$ -57585 -14459 64673 82329 22233 -31234 -65761 -80319 -50708 -35539 13284 63796 110131
13451A10131K890p1837k9292Q1251J6097k1846l0790n6802m7921j5655K9041j4951
$$ 110131 113021 41184 11892 93143 109240 87394 56604 -198 -48119 -63774 -34733 -49684
13439d9684j7387m6397J7553P3366J01596j908o6675j3937K2377j0146J2030O0699
$$ -49684 -67071 -113468 -95915 -22549 79047 77139 10464 -3473 18904 8758 20788 81487
13427H1487L6929N3504L1186n7486r9004j4128J7097o0999n248J6259l5390P6648
$$ 81487 118416 171920 203106 145620 46616 32488 49585 -11414 -16662 -403 -35793 40855
13415D0855l5716q3546k4748J04295M5852k8298J4865O3301n6676N021k6121o0103
$$ 40855 5139 -78407 -103155 1140 46992 18694 33559 96860 40184 45205 19084 -41019
13403d1019R281Q6535k5300m8513m958N661n960j0385n3600l2369j8890R2385
$$ -41019 -31738 54797 29497 -19016 -23974 -18313 -24273 -34658 -88258 -120627 -139517 -47132
13391d7132O3704o098m5623K3273k8089J0849j4884o25l2210J9487P9952L0617
$$ -47132 16572 10474 -35149 -11876 -39965 -29116 -44000 -44625 -76835 -57348 22604 53221
13379E3221P207j3681J1756J4212N4591J5531l2752k0397j68039J743j5210O8128
$$ 53221 60428 46747 58503 72715 127306 142837 110085 89688 -78351 -76608 -91818 -23690
13367b3690N3717J8432N6858r466l4574M1155k823m047J01075p154m1531o8913
$$ -23690 30027 48459 105317 95851 61277 102432 99609 95562 196637 189483 147952 79039
13355G9039m4508n2511k9861Q904n0995j3260J03755N3329m4898l2387m874k6172
$$ 79039 34531 -17980 -47841 -38937 -89932 -103192 563 53892 8994 -23393 -28267 -54439
13343e4439q2997O477K8754R1877r610p2288k7261k461N2111J32381j9175L6328
$$ -54439 -137436 -130959 -102205 -10328 -19938 -92226 -119487 -121948 -69837 62544 43369 79697
13331G9697j8624k8561J7220q9960J927J4365R166R882r1594l1142o299J0340
$$ 79697 61073 32512 49732 -40228 -38301 -23936 -14770 -4888 -96482 -127624 -133923 -123583
13319a23583O3708o7557k4747P031J19532j1366j473k0004j006O8103K4210j6449
$$ -123583 -59875 -127432 -152179 -145148 -25616 -36982 -38455 -58459 -59465 8638 32848 16399
13307A6399M4898k7749N1940K7000M8803m3330r4018p4989M0238l4998q2044o667
$$ 16399 61297 33548 85488 112488 161291 117961 23943 -51046 -10808 -45806 -127850 -134517
13295a34517N5186K9982O3576J1848P4804M5555n7064j22619J3955J18601M6476
$$ -134517 -79331 -49349 14227 26075 100879 146434 89370 -33249 -19294 99307 145783
13284A45783k9947r7675p853K3842o166j17983m7043P809J2580L8037n2454p7482
$$ 145783 115836 18161 10308 34150 27984 -89999 -137042 -129233 -116653 -78616 -131070 -208552
13272b08552Q7515J16816P9761j04365j0757J19092Q5330j5706j10035l6664J3727
$$ -208552 -121037 -4221 75540 -28825 -39582 79510 164840 149134 39099 2435 16162
13261A6162P856n181o146L8712L1194l8054p3958j0610l8251K8290M5156K6963
$$ 16162 24018 18837 12691 51403 82597 44543 -29415 -40025 -78276 -49986 -4830 22133
13249B2133L1536l9001l1742k2308r02l18J6786L4783M7903o1066j42573j17510
$$ 22133 53669 14668 -17074 -39382 -40284 -40602 -23816 10967 58870 -2196 -144769 -262279
13237b62279R249K06134J15296o3623J1913J22818K8616n6353j2434P868J507
$$ -262279 -253030 -46896 68400 4777 16690 139508 168124 111771 99337 107205 108712
13226A08712K3463n2755q0604k6224M3239m3069m5846M5222M8949n0593m8837
$$ 108712 132175 79420 -1184 -27408 15831 -27238 -73084 -27862 21087 -29506 -78343
13215g8343P1365R2264J578j03259o6460j6568J2594L4244Q0233l2275M8868K4930
$$ -78343 -6978 85286 86864 -16395 -82855 -99423 -86829 -52585 27648 -4627 44241 69171
13203F9171p7716l5479L2221J8871l0708j5244K2857K7527J5142L499l266Q7465
$$ 69171 -8545 -44024 -11803 7068 -23640 -38884 -16027 11500 26642 30141 26875 114340
13191A14340k1914p3293o4714o2222k4198R896J14526R1699J5446R467j0224m1472
$$ 114340 92426 19133 -45581 -107803 -132001 -122105 -7579 84120 99566 109033 98809 57337
13179E7337p2414r420M3177M615N4855m2028L7569P7138l49L6740j2720J2759
$$ 57337 -15077 -24497 18680 23295 78150 36122 73691 150829 150480 187220 174500 187259
13167A87259j03837k3147j9554o633o806J3545m5753j5487P4195M0646M953l4452
$$ 187259 83422 60275 40721 34088 27282 40827 -4926 -20413 53782 94428 99381 64929
13155F4929M5074M409o8623l3840l2802o2376m8109L9984Q6966P2697r09k3160
$$ 64929 110003 114412 45789 11949 -20853 -83229 -131338 -91354 -4388 68309 67400 44240
13143D4240Q06J6718j1172K3348j5275l654k9203m5486m4248l9919P637K2856
$$ 44240 45046 61764 50592 73940 58665 55011 25808 -19678 -63926 -103845 -96208 -73352
13131g3352J5169K4535l5143j3004j8410K9200J7240P2828l14o03j20554O1853
$$ -73352 -58183 -33648 -68791 -81795 -100205 -71005 -53765 19063 18749 18146 -102408 -40555
13119d0555J22662M5818k1203k9056r4856r7677O2125L7977r0972o3209K2625
$$ -40555 82107 127925 106722 77666 -17190 -114867 -52742 -14765 -105737 -168946 -146321
13108a46321J778j7182K2617O2028K6341r82j3558P1171k6284j08885N5916K1332
$$ -146321 -144543 -161725 -139108 -77080 -50739 -51721 -65279 5892 -20392 -129277 -73361 -52029
13096e2029M4007L2125k2919k2212n088j7419l611m2224Q386K7961L9403j2597
$$ -52029 -8022 24103 1184 -21028 -26116 -43535 -47146 -89370 -80984 -53023 -13620 -26217
13084b6217L8358n4287m5115l3388p675M9627j6569m6011J0080K8973R0157P8977
$$ -26217 12141 -42146 -87261 -120649 -128324 -78697 -95266 -141277 -131197 -102224 -12067 66910
13072F6910M3651J9118J9049L0662m4014q9697r697K0599m6135o0562L7330j6047
$$ 66910 110561 129679 148728 179390 135376 45679 35982 56581 10446 -50116 -12786 -28833
13060b8833Q625p1781l3528J34720K8321j4839R7700L8466m7748m6107q530N9658
$$ -28833 -20208 -91989 -125517 9203 37524 22685 120385 158851 111103 64996 56466 116124
13048A16124M716q8852l1727l4109j3890l6708l0142R5432J21081o040q2624Q845
$$ 116124 120840 31988 261 -33848 -47738 -84446 -114588 -19156 101925 95885 13261 22106
13036B2106O4496j09018l1197P5336O5672n7356k4098k1597m5664J6360O3193
$$ 22106 86602 -22416 -53613 21723 87395 30039 5941 -15656 -61320 -44960 18233
13025A8233J8025J1165o685K2094K2046m3752l3316j1543M9963M8994r4250K2126
$$ 18233 36258 47423 40738 62832 84878 41126 7810 -3733 46230 95224 974 23100
13013B3100K9208L5391J759N4007N085l3007n8O420R45R7906m462p0215j10912
$$ 23100 52308 87699 89458 143465 148550 115543 115485 121905 122850 220756 216294 146079 35167
13000C5167J3016j5850K957j14771O573N1757M83L5343N0689L3178o2860L826
$$ 35167 48183 32333 35290 -79481 -72908 -21151 -20668 14675 65364 98542 35682 39508
12988C9508p517k6714q7097j1963O5467j6200n9006m647J09729Q7841K6281l3711
$$ 39508 31991 5277 -81820 -93783 -28316 -44516 -103522 -108169 1560 89401 115682 81971
12976H1971n5484p9092J04763R8896K9641j03378j0633L6108l7428j10307l5702
$$ 81971 26487 -52605 52158 151054 180695 77317 66684 102792 65364 -44943 -80645
12965h0645Q4749j5816l934K3109K3447m8830m1237N6199j9615R0071P7615j5824
$$ -80645 4104 -11712 -15646 7463 30910 -17920 -59157 -2958 -22573 67498 145113 129289
12953A29289l1361M2560J6414m8071k4346j3261p5328j9924J0759k5078J1007
$$ 129289 97928 140488 156902 108831 84485 71224 -4104 -24028 -13269 -38347 -27340
12942b7340l4253k0182J1583n0374m8549o9940L0554R0706K5339M3885J01006
$$ -27340 -61593 -81775 -70192 -120566 -169115 -239055 -208501 -117795 -92456 -48571 52435
12931E2435N5959O245k8887j5573K501q8224j00458N6460L9323J2115J3881o9619
$$ 52435 108394 114639 85752 70179 72680 -15544 -116002 -59542 -20219 -8104 5777 -63842
12919f3842J0637R1153q411K978M5533q6733p1096O0957R9310j2092n8604n5959
$$ -63842 -53205 37948 29537 32515 78048 -8685 -79781 -18824 80486 68394 9790 -46169
12907d6169L852J1911o1047q3207Q317O5629l287K3260M2567k0688J2344J1943
$$ -46169 -42317 -30406 -91453 -174660 -166343 -100714 -104001 -80741 -38174 -58862 -46518 -34575
12895c4575K7415n6986j980J7752R6773n4282l7066O6027L4527n1294j04716q7694
$$ -34575 -7160 -64146 -66126 -48374 48399 -5883 -42949 23078 57605 6311 -98405 -186099
12883a86099p915m850K9281L6561L4763R8656L8303o3260m1581K4296M7925j023
$$ -186099 -194014 -198864 -169583 -133022 -98259 397 38700 -24560 -66141 -41845 6080 5057
12871E057n2978J9214N006K303K8486n5494k5728j9866l3813j00449N9887N7354
$$ 5057 -47921 -28707 -23701 -21398 7088 -48406 -74134 -94000 -127813 -228262 -168375 -111021
12859a11021M0412K5226O9450j0338k165m3025p8147j2505l771R5919K374o8917
$$ -111021 -70609 -45383 24067 13729 11564 -31461 -109608 -122113 -125884 -29965 -27591 -96508
12847i6508j2215J03185O8675p3257k1067Q3004P99l6440k95J5297O8547O9787
$$ -96508 -108723 -5538 63137 -10120 -31187 51817 52616 16176 15881 31178 99725 169512
12835A69512m3263r290J4409k5635k0351j0442p7409J9484O6793l6392o7186L785
$$ 169512 126249 116959 131368 105733 85382 74940 -2469 17015 83808 47416 -19770 -15985
12823a5985N1690r0966j42585M3077M1298L58j0606M6702N5147L3578o2048M2248
$$ -15985 35705 -55261 -197846 -154769 -113471 -113113 -123719 -77017 -21870 11708 -50340 -8092
12811h092J2695j9050n3824P2126K164N3952l3320p978p453r53l5682j8408K648
$$ -8092 4603 -14447 -68271 3855 6019 59971 26651 18673 11220 10267 -25415 -43823 -41175
12798d1175j06477K7444Q3982P2909m378J2662O8614M0528o811p9995m4808L2354
$$ -41175 -147652 -120208 -36226 36683 32305 44967 113581 154109 147298 67303 22495 54849
12786E4849l2579L0757Q5069l9499m7809O6907M835q8941m8012k008r2328p362
$$ 54849 22270 53027 138096 98597 50788 117695 122530 33589 -14423 -16431 -108759 -116121
12774a16121L6095Q3187Q6934J1409j6046j25385n4044K8788l4373R9354N3786
$$ -116121 -80026 3161 90095 101504 85458 -39927 -93971 -65183 -99556 -202 53584
12763E3584N575m0516r9971o2921j1266N8733J47604R202l4784M8626j3643q5409
$$ 53584 59159 18643 -81328 -144249 -155515 -96782 50822 60024 25240 73866 60223 -25186
12751b5186M8807Q1685r800r4937l5220j25J10881q828o6119k6971l4112m6798
$$ -25186 23621 105306 95506 569 -34651 -34776 76105 67277 1158 -25813 -59925 -106723
12739a06723J1672R9028N6380K968K6399L8089k9594j22975J5014k6437j4748
$$ -106723 -95051 3977 60357 63325 89724 127813 98219 -24756 -9742 -36179 -50927
12728e0927N5513K8687O3398m5269l4805j5547L2493N696q426k7960o1970K0767
$$ -50927 4586 33273 96671 51402 16597 1050 33543 39239 30813 2853 -59117 -38350
12716c8350N5933N7309L5919J06488k0092j76538r0257R1170N8958n060n3886
$$ -38350 17583 74892 110811 217299 197207 20669 -69588 21582 80540 75480 21594
12705B1594P9850L4378m4294L1593n9706K0209K2158j3892n9468l4479J6351m2103
$$ 21594 101444 135822 91528 123121 63415 83624 105782 91890 32422 -2057 14294 -27809
12693b7809L3685L4382l8537M6593P4080R593m6043k3847l3120n27m1997m8535
$$ -27809 5876 40258 1721 48314 122394 131987 85944 62097 28977 28450 -13547 -62082
12681f2082p4827O8277K1136J14574m3103l4000N9909j7321n0021l8878O1908
$$ -62082 -136909 -68632 -47496 67078 23975 -10025 49884 32563 -17458 -56336 5572
12670E572M6055K1242j33422l8185L1321J1013O2707O7244L3460J15171K1938
$$ 5572 51627 72869 -60553 -98738 -67417 -56404 6303 73547 107007 222178 244116
12659B44116o1276r8675p8262q051M3464O2151J8887K1154K0586n1991k6293L896
$$ 244116 182840 84165 5903 -2148 41316 103467 122354 143508 164094 112103 85810 89706
12647H9706o6936o8773K9450J10366K5251J3239Q417l8676r6463n5820j5794N1982
$$ 89706 22770 -46003 -16553 93813 119064 132303 140720 102044 5581 -50239 -66033 -14051
12635a4051l7328n8341P0618M9297P666j24557K9994j3918L4568N9378L8634P4685
$$ -14051 -51379 -109720 -39102 10195 17861 -106696 -76702 -90620 -56052 3326 41960 116645
12623A16645K4943o014j13617k8577l5261N3465Q6452k2124J816m9139q1163n8399
$$ 116645 141588 135574 21957 -6620 -41881 11584 98036 75912 77728 28589 -52574 -110973
12611a10973R7042J06729n635P7077j5937j7054n2982p3630M7995j2169k6302
$$ -110973 -13931 92798 87163 164240 148303 131249 78267 4637 52632 40463 14161
12600A4161k2932k9082K2912Q8161K5580Q0323K0484n4924j1902k0093J0709R947
$$ 14161 -8771 -37853 -14941 73220 98800 179123 199607 144683 132781 112688 123397 133344
12588A33344q0444r5568O6497N5865k3118l6522K830O6231l5692J0571L7297K1800
$$ 133344 52900 -42668 23829 79694 56576 20054 22884 89115 53423 63994 101291 123091
12576A23091k1784l488n8191k4477J8465n4447n1293N1611j2590K8921M6761j4300
$$ 123091 101307 97819 39628 15151 33616 -20831 -72124 -20513 -33103 -4182 42579 28279
12564B8279o0728k7582N4091O1820j2648m4885O2311Q1491J3894k224k1641J9883
$$ 28279 -32449 -60031 -5940 55880 43232 -1653 60658 142149 156043 153819 132178 152061
12552A52061j883L0384j06913j02672n2666n6305j1049J08412J32413n3027j7447
$$ 152061 150178 180562 73649 -29023 -81689 -137994 -149043 -40631 91782 38755 21308
12541B1308O8441M7137J764m8732J9239o8359j00873K3247M8069q208L1057l7012
$$ 21308 89749 136886 138650 89918 109157 40798 -60075 -36828 11241 3033 34090 -2922
12529b922j02896K6493O8200j2152l2108M4252k769M9269l82l2391p007r910P7604
$$ -2922 -105818 -79325 -11125 -23277 -55385 -11133 -13902 35367 34985 2594 -4413 -14323 63281
12516F3281M443q534l7425N1725l2318n2785L88p6647k5986Q663N9126J2456M0075
$$ 63281 67724 59190 21765 73490 41172 -11613 -11225 -87872 -113858 -105195 -46069 -33613 6462
12503F462m7848n2647K4734K0008J3729m9516m9023O7792P0670m6665j5731L2500
$$ 6462 -41386 -94033 -69299 -49291 -35562 -85078 -134101 -66309 4361 -42304 -58035 -25535
12491b5535m0881L7769Q3843Q1006n1518m7104N831O509O610m1853o7782L8367
$$ -25535 -66416 -28647 55196 136202 84684 37580 43411 49920 56530 14677 -53105 -14738
12479a4738j8943O8208P2283j3278k4650j16960j10688q2058P8669P9463O3812
$$ -14738 -33681 34527 106810 93532 68882 -48078 -158766 -240824 -162155 -82692 -18880
12468a8880R8194N1985n3071P9331q877j25246o5192r529j4701K1040J1464J6269
$$ -18880 79314 131299 78228 157559 148682 23436 -41756 -51285 -65986 -44946 -33482 -17213
12456a7213N1057N7682l9654j385o7077o943Q019n384j5837P9630N2208Q317m2210
$$ -17213 33844 91526 51872 50487 -16590 -23533 -15514 -20898 -36735 42895 95103 103420 61210
12443F1210N8007J24050o857o5622O4043n6489l4219m4956N7522J0976j8870l079
$$ 61210 119217 243267 236410 170788 234831 178342 144123 99167 156689 167665 148795 145716
12431A45716j7709m1754l6120L5174K6111n7561J9399j8356k0087l4634R8812
$$ 145716 128007 86253 50133 85307 111418 53857 73256 54900 34813 179 98991
12420I8991m3955K9544K5362o3818q0028m0004O8804R0159o6089j38492j9182
$$ 98991 55036 84580 109942 46124 -33904 -73908 -5104 85055 18966 -119526 -138708
12409a38708N8140M1964O9524l4109n7737l6285L7207m1557P5456j820m1134m458
$$ -138708 -80568 -38604 30920 -3189 -60926 -97211 -60004 -101561 -26105 -27925 -69059 -73517
12397g3517l4450J4965q362p282M0693l9745O8091M4579K5233J5553L9187j5533
$$ -73517 -107967 -93002 -101364 -108646 -67953 -107698 -39607 4972 30205 45758 84945 69412
12385F9412k5539k644n5821J7779N0056K4794j5898O4429J6776j11919l8438l6665
$$ 69412 43873 41229 -14592 3187 53243 78037 62139 126568 143344 31425 -7013 -43678
12373d3678m1160M8513q39M2575J32678P6010K1240j13364q6151l566j11746l0820
$$ -43678 -84838 -36325 -37164 5411 138089 214099 235339 121975 35824 32258 -79488 -110308
12361a10308O8105J02908L3528j7840l7562k5983l5992p2353Q8671L0519K6982
$$ -110308 -42203 60705 94233 76393 38831 12848 -23144 -95497 -6826 23693 50675
12350E0675P549r4126q0172J05133Q5164k2010p8189O44M5480K0381n6522M6370
$$ 50675 58224 -35902 -116074 -10941 74223 52213 -25976 -25332 20148 40529 -15993 30377
12338C0377N1408m1971k6256k9833O548J6651M128N2562L7570n2730k7972L1922
$$ 30377 81785 39814 13558 -16275 -9727 6924 11052 63614 101184 48454 20482 52404
12326E2404l1686p3510j0666P8464r304l547q610j2040K2256M7134J5307P9633
$$ 52404 20718 -52792 -63458 15006 5702 2155 -6455 -18495 3761 50895 66202 145835
12314A45835K1104r3745r2150K0427O2337J1112O9904J0330j00915J939n3535
$$ 145835 166939 73194 -18956 1471 63808 74920 144824 155154 54239 56178 2643
12303B643k4146L4376j9264O5492J2642o7422L6053j8140k6300L579k0649M3723
$$ 2643 -21503 12873 -6391 59101 71743 4321 40374 22234 -4066 -487 -21136 22587
12291B2587k0504l0357N0229O8639l0699r9085m4952O8993M0110N5724N9631L1760
$$ 22587 2083 -28274 21955 90594 59895 -39190 -84142 -15149 24961 80685 140316 172076
12279A72076m0033j09108m4879P9085K8534K8512o4378j03834q530O6126P6351
$$ 172076 132043 22935 -21944 57141 85675 114187 49809 -54025 -62555 3571 79922
12268G9922N49j3161k0357m1631M7286k4627j3723p33l8903J5402J8591L7243
$$ 79922 80471 67310 46953 5322 52608 27981 14258 13525 -25378 -9976 8615 45858
12256D5858O3422j14524o6569P2568N6292m099J9796j5482M0086l4293L5332k5156
$$ 45858 109280 -5244 -71813 755 57047 52948 72744 57262 97348 63055 98387 73231
12244G3231P1956j5990j8575j8068k4j5563r0128n0738R443q086O9444L2233M542
$$ 73231 145187 129197 110622 92554 92530 76967 -13161 -63899 -54456 -62542 6902 39135 43677
12231D3677Q4387M6394K657J6610n7118k3830n3754r1488L959L7262O8521j0510
$$ 43677 128064 174458 177115 193725 136607 112777 59023 -32465 -28506 8756 77277 66767
12219F6767r3997o6254J3339L3088K4418k1990k6379L0471L4559k6623o7534j20123
$$ 66767 -27230 -93484 -80145 -47057 -22639 -44629 -71008 -40537 -5978 -32601 -100135 -220258
12207b20258m625K1101K9613R7800P1584N3699j6515l5819k1745o861m0789N2122
$$ -220258 -224883 -203782 -174169 -76369 -4785 48914 32399 -3420 -25165 -32026 -72815 -20693
12195b0693J31398L5302j2985M1741K4817N1885k4987j09699p8800l6801J6993
$$ -20693 110705 146007 133022 174763 199580 251465 226478 116779 37979 1178 18171
12184A8171Q604L2829L0241m9292o3389Q767J7244Q3926J4997N3621P3228p708
$$ 18171 26775 59604 89845 40553 -22836 -14069 3175 87101 102098 155719 228947 221239
12172B21239j6960l0300m2137n5477L2261R738m1665j02971l4586P5268N6152
$$ 221239 204279 173979 131842 76365 108626 118364 76699 -26272 -60858 14410 70562
12161G0562J5177k9992j1251l0200K8014N7939K0664q4270K8753j4356k0388P8458
$$ 70562 85739 55747 44496 14296 42310 100249 120913 36643 65396 51040 30652 109110
12149A09110L3002l0777p730J9484K8925l6303n8748k4230O8199j03450q4389
$$ 109110 142112 111335 103605 123089 152014 115711 56963 32733 100932 -2518 -86907
12138h6907K9192P7488P4175k1455M5566n8661j2447P0511l124l8468L0832k0448
$$ -86907 -57715 19773 93948 72493 118059 59398 46951 117462 114338 75870 106702 86254
12126H6254M0850K3499o1283k9013P97J8403M5956j9849n285m085l2974n7869
$$ 86254 127104 150603 89320 60307 61104 79507 125463 105614 100329 96244 63270 5401
12114E401L342R1314P6256J6385r6070l4252R0650K7437j4331J6190l1780J8914
$$ 5401 8743 100057 176313 192698 96628 62376 153026 180463 166132 182322 150542 169456
12102A69456l2111q1816K3007J18013N4419r8194l7203L8484q0798r397o5311
$$ 169456 137345 55529 78536 196549 250968 152774 115571 154055 73257 63860 -1451
12091a451l7948J7063N2294L5419J05494J2139j9133q4596n3023J5291j505q0203
$$ -1451 -39399 -22336 29958 65377 170871 183010 163877 79281 26258 41549 40044 -40159
12079d0159j06231m3880L6040Q9398R746K7768k0888R1796J14784M1387r349M4366
$$ -40159 -146390 -190270 -154230 -64832 -55086 -27318 -48206 43590 158374 199761 190412 234778
12067B34778m5940n0272N4795L5600n2049k6326K3402n9553j0661P6390P2604
$$ 234778 188838 138566 193361 228961 176912 150586 173988 114435 103774 180164 252768
12056B52768N4167l7689o1021N2563r920o6077j05523j30169L995J1273M2816
$$ 252768 306935 269246 208225 260788 250868 184791 79268 -50901 -46906 -35633 7183
12045G183R4273O1253P800N1079P0953p2440o843N1712n8784K4423R9619l6318
$$ 7183 101456 162709 170509 221588 292541 220101 213258 264970 206186 230609 330228 293910
12033B93910j03778K5617K185m3482q6301O6690J00210L3995N174k4245P430M3241
$$ 293910 190132 215749 217934 174452 88151 154841 255051 289046 294220 269975 277405 320646
12021C20646j2834L5248l2867k7189L0104L6045q9235m9814J18390N2477Q38k1892
$$ 320646 307812 343060 310193 283004 313108 349153 259918 210104 328494 380971 381809 359917
12009C59917l7863L3920J55222j21325j01548k2209j9714M2850O4454N0438P7002
$$ 359917 322054 355974 511196 389871 288323 266114 246400 289250 353704 404142 481144
11998D81144L7044p1076o4330Q243J30028N3306O083O1300L4835j32465j0723
$$ 481144 518188 447112 382782 391025 521053 574359 580442 641742 676577 544112 533389
11987E33389L2286O2665m8686l6146J19183O206n6235Q8058O6139O0653J5871
$$ 533389 565675 628340 579654 543508 662691 668897 612662 700720 766859 827512 843383
11976H43383m5964n5372K6810q349K5866J42591L3296l7076P3519o980L6852J42431
$$ 843383 797419 742047 768857 760508 786374 928965 962261 925185 998704 991724 1028576 1171007
11964A171007R7190J14902N5627N5047p084K1213R6510J30891J35041L3450J6237
$$ 1171007 1268197 1383099 1438726 1493773 1486689 1507902 1604412 1735303 1870344 1903794 1920031
11953A920031j5075m648J02752K30395K66063J16469J86082K31319J87837J71828
$$ 1920031 1904956 1900308 2003060 2233455 2499518 2615987 2802069 3033388 3221225 3393053
11943C393053K64040L36411M24334N18436M77979M89043O98742P71131R41760
$$ 3393053 3657093 3993504 4417838 4936274 5414253 5903296 6602038 7373169 8314929
11934H314929J268211J474649J790631K248209K966944L949896N115873P007033
$$ 8314929 9583140 11057789 12848420 15096629 18063573 22013469 27129342 34136375
11926C4136375J0198264J4967070K2303594L2562725M2669316M3582830K7231665
$$ 34136375 44334639 59301709 81605303 114168028 156837344 200420174 227651839
11919B27651839N72276k1958361l5495132l9388522l4164496k5321169j7790380
$$ 227651839 228224115 206265754 170770622 131382100 97217604 71896435 54106055
11912E4106055j2377713q847106o488010m805237l638577k846433k144793j749865
$$ 54106055 41728342 32881236 26393226 21587989 17949412 15102979 12958186 11208321
11904A1208321j470834j174985r55606q62007p42531o22227n44501l96367l53390
$$ 11208321 9737487 8562502 7606896 6744889 6002358 5380131 4835630 4439263 4085873
11895D085873l24460l02518j85803j81210k62835j38598j02138j25637r0592m3291
$$ 4085873 3761413 3458895 3273092 3091882 2829047 2690449 2588311 2462674 2372082 2328791
11885B328791j45493p7812o6057o6259q9255j27318j51728j25296q4139j25274
$$ 2328791 2183298 2105486 2039429 1973170 1883915 1756597 1604869 1479573 1395434 1270160
11875A270160j38695j01441m3060k1110n8431j5331n6141m6772k537l7776r8827
$$ 1270160 1131465 1030024 986964 965854 907423 892092 835951 789179 786642 748866 650039
11864F50039k1301k0050o844r835k6714L4045l0227p9194p4045M4443J5852J0784
$$ 650039 628738 608688 601844 592009 565295 599340 569113 489919 415874 460317 476169 486953
11852D86953K3208j22929q6614k0232k8070o934o5233l1782M3809O2918N7250
$$ 486953 510161 387232 300618 280386 252316 245382 180149 148367 192176 255094 312344
11841C12344N1015O0886J40626l5873n1508r4580m1184k5494q9408M690O2014
$$ 312344 363359 424245 564871 528998 477490 382910 341726 316232 226824 231514 293528
11830B93528n9648r308P4654R290l4732l9591m3901q7503N4381N5111k1926J8294
$$ 293528 233880 224572 299226 308516 273784 234193 190292 102789 157170 212281 190355 208649
11818B08649m3702k5150K9468m2784k8767L4575N1469K3645m2376K0696P7552
$$ 208649 164947 139797 169265 126481 97714 132289 183758 207403 165027 185723 263275
11807B63275l2267n3538n0020K287N3258M5673o9603o2845k7689O8219L2051j0644
$$ 263275 231008 177470 127450 129737 182995 228668 159065 96220 68531 136750 168801 158157
11795A58157m3457P6236J5220M1372k9945j9421j263N3386k2051l813q7222M3367
$$ 158157 114700 190936 206156 247528 217583 198162 196899 250285 228234 224421 137199 180566
11783A80566N9335m1969k0963n6897Q73L4067o5804p1330j8967N5902P0198M8027
$$ 180566 239901 197932 176969 120072 120945 155012 89208 17878 -1089 54813 125011 173038
11771A73038j6122m0673n0871m708R5752O3422M5325R487l1686L0750J4234o1142
$$ 173038 156916 116243 65372 60664 156416 219838 265163 274650 242964 273714 287948 226806
11759B26806L0498O959J8666j1342o9058P321L7351J7740L1418q0043l7499p1148
$$ 226806 257304 264263 282929 271587 202529 209850 247201 264941 296359 216316 178817 107669
11747A07669m1556j1210P0847P6285J911l9100o9211j37o729J5903J4385K2798
$$ 107669 66113 54903 125750 202035 203946 164846 95635 95498 88769 104672 119057 141855
11735A41855J0450j5054J0433L4603K4937l7722p7775J353O1270N3004P795l5982
$$ 141855 152305 137251 147684 182287 207224 169502 91727 93080 154350 207354 215149 179167
11723A79167J1942k2198L9130n7057j00606j365N5692O179N043L901q7895r7789
$$ 179167 191109 168911 208041 150984 50378 49013 104705 110884 115927 119828 31933 -65856
11711f5856M6361L316N5260J07996m3216k1352j9001j0148o6289K5813R5243P8588
$$ -65856 -19495 -16179 39081 147077 103861 82509 63508 53360 -12929 12884 108127 186715
11699A86715q3682m612o6121k5969J1140P0223L3485k4405k625O283P303p848
$$ 186715 103033 98421 32300 6331 17471 87694 121179 96774 94149 100432 107735 99887
11687I9887m9925m2633p7736k0697K3779J09907M2263m188j06422L2335L9759
$$ 99887 49962 7329 -70407 -91104 -67325 42582 84845 80657 -25765 6570 46329
11676D6329l1662L827k8006P3731N1929P837L4927K2267N3869l0716j03460M6682
$$ 46329 14667 18494 -9512 64219 116148 123985 158912 181179 235048 204332 100872 147554
11664A47554n220K0880q3124K4336l57j00229L1949K1889J3325K4671J5012j9003
$$ 147554 142334 163214 80090 104426 104069 3840 35789 57678 71003 95674 110686 91683
11652I1683k3236j1165J8300k2541P5108j6405k0749l3310o0697q2647P0411P9155
$$ 91683 68447 57282 75582 53041 128149 111744 90995 57685 -3012 -85659 -15248 63907
11640F3907M2M2786P039l2706L600k403l0998N38K3943l802r5599J4777O4763
$$ 63907 63949 106735 113774 81068 84668 82265 51267 51805 75748 71946 -23653 -8876 55887
11627E5887K2639q2336K7743j7205k0273O4174L6032K1746n0466j0824k4639L4346
$$ 55887 78526 -3810 23933 6728 -13545 50629 86661 108407 57941 47117 22478 56824
11615E6824M4042q0948q5972J7978j1864l733l254K8947j0075R9356M5979m2073
$$ 56824 100866 19918 -66054 -48076 -59940 -63673 -66927 -37980 -48055 51301 97280 55207
11603E5207j8955Q4248l7664J3500n5888l5511K0244m9898K7668m0740M272Q3739
$$ 55207 36252 120500 82836 96336 40448 4937 25181 -24717 2951 -37789 -33517 50222
11591E0222K8876j6484p0543k3255m2484k4816J00706J21600K1112o4114K251
$$ 50222 79098 62614 -7929 -31184 -73668 -98484 2222 123822 144934 80820 83071
11580H3071k5858o1007L7393j0920j3356o9918o3534P7997P5824N2522R341M424
$$ 83071 57213 -3794 33599 22679 9323 -60595 -124129 -46132 29692 82214 91555 95979
11568I5979K8647J3410o4845j31633l643N4668p822K8693P6074m9792k3687P098
$$ 95979 124626 138036 73191 -58442 -62085 -7417 -15239 13454 89528 39736 16049 23147
11556B3147J1753K8721M8458o2771q2040N805k3883M9371k0182m3914n8206J01298
$$ 23147 34900 63621 112079 49308 -32732 -26927 -50810 -1439 -21621 -65535 -123741 -22443
11544b2443O2873m5394M2372P5447j5487p185n1557l8942O1782M3029M8713l6426
$$ -22443 40430 -4964 37408 112855 97368 90183 38626 -316 61466 104495 153208 116782
11532A16782j43877K4061K4451k2034p7430p371P0900N5836M7585J28144k0921
$$ 116782 -27095 -3034 21417 -617 -78047 -85418 -14518 41318 88903 217047 196126
11521A96126q6396k8773o0286j7707p172m4744Q0102M3420L2021P6145o8157j7721
$$ 196126 109730 80957 20671 2964 -4208 -48952 31150 74570 106591 182736 114579 96858
11509I6858n7759r955m912o9606o4829j0996l481J20287Q8751m4094m4271n4221
$$ 96858 39099 29144 24232 -45374 -110203 -121199 -124680 -4393 84358 40264 -4007 -58228
11497e8228m8551r1568n711J03575J3290M2249n0344k0469j5992P597O5222P5078
$$ -58228 -106779 -198347 -204058 -100483 -87193 -44944 -95288 -115757 -131749 -124152 -58930 16148
11485A6148M1776L2954l7255j2612n1137k3153k9294J9459N5674O9591L2185r3600
$$ 16148 57924 90878 53623 41011 -10126 -33279 -62573 -43114 12560 82151 114336 20736
11473B0736j26602o6530N2428J02525j2615J3258K0897N4214j5139m9923j0200
$$ 20736 -105866 -172396 -119968 -17443 -30058 -16800 4097 58311 43172 -6751 -16951
11462a6951J5501R9809M2473j05657o5604m6595k3107O6021K7802K4191M9434
$$ -16951 -1450 98359 140832 35175 -30429 -77024 -100131 -34110 -6308 17883 67317
11451F7317j0018J5783k6938m9537J6272J9416J5032Q233j0363K8629m0361M2865
$$ 67317 57299 73082 46144 -3393 12879 32295 47327 55560 45197 73826 33465 76330
11439G6330K9565J794J0050L2576O6988K4490J3949o6932j18379r6576l0512m3463
$$ 76330 105895 107689 117739 150315 217303 241793 255742 188810 70431 -26145 -56657 -100120
11427a00120j4448K7185P1159P2316N5516O5931j9136p9367l2097O7317p1616
$$ -100120 -114568 -87383 -16224 56092 111608 177539 158403 79036 46939 114256 42640
11416D2640M4594N1095k7475M3818k2541q6441m7467J8940k6119M4935J02115
$$ 42640 87234 138329 110854 154672 132131 45690 -1777 17163 -8956 35979 138094
11405A38094n8848j03275m1133K0862N0171l4969K1463N0769J261j0845k0388
$$ 138094 79246 -24029 -65162 -44300 5871 -29098 -7635 43134 44395 33550 13162
11394A3162o371L5834L2562Q001j0830Q1116M3147M2340m3733m9405j07086n6962
$$ 13162 6791 42625 75187 83188 72358 153474 196621 238961 195228 145823 38737 -18225
11382a8225m5390n245R213p5916J0180J06887J39857N0095p8062j0537n2707j0566
$$ -18225 -63615 -68860 -59647 -135563 -125383 -18496 121361 171456 93394 82857 30150 19584
11370A9584K3971O5927n9840r5904o7198p34O3871M9547O4975N6476k9908J4952
$$ 19584 43555 109482 49642 -46262 -113460 -114194 -50323 -776 64199 120675 90767 105719
11358A05719k5406p2063m2670m7395N1491J6847K4084L1705l3743p905n5103K0660
$$ 105719 80313 8250 -34420 -81815 -30324 -13477 10607 42312 8569 664 -54439 -33779
11346c3779M2684n4926k0115O84J9331j9220Q0443J866j4266o031Q318L2384p2972
$$ -33779 8905 -46021 -66136 -65452 -46121 -65341 15102 16968 2702 -3329 4989 37373 -35599
11333c5599m3244k8578J10439K4812K0181P5007k6403p5687k3922R230K6647J3533
$$ -35599 -78843 -107421 3018 27830 48011 123018 96615 20928 -2994 6236 32883 46416
11321D6416k8022p6623j7372M6018P8542p2844n4364M7881O8711o4483n4594O6595
$$ 46416 18394 -58229 -75601 -29583 48959 -23885 -78249 -30368 38343 -26140 -80734 -14139
11309a4139K3495o1528j9848J955N9059R8036j1840M5779k0954k3744Q560j0724
$$ -14139 9356 -52172 -72020 -70065 -11006 87030 75190 120969 100015 76271 84831 74107
11297G4107J3435P974p2644l4946K7415p986l1285M2242K7369o5104K781K9228
$$ 74107 87542 95516 22872 -12074 15341 7355 -23930 18312 45681 -19423 -16642 12586
11285A2586o0993j0793j0034j9091Q2972L9385o4757K8086j554O2487n2358o7685
$$ 12586 -48407 -59200 -69234 -88325 -5353 34032 -30725 -2639 -4193 58294 5936 -61749
11273f1749p22k899K1856N0583j7441n1598J051O4570P5243N2219j1490M0357
$$ -61749 -62471 -65370 -43514 7069 -10372 -61970 -60919 3651 78894 131113 119623 159980
11261A59980L0050m1798j20921j4035J0819J7964M8769M5729o8701k4334k2805
$$ 159980 190030 148232 27311 13276 24095 42059 90828 136557 67856 43522 20717
11250B0717r8261k9322Q708R5167M7945k7966P4882J5393L5800N9407q2921m8898
$$ 20717 -77544 -106866 -98158 -2991 44954 16988 91870 107263 143063 202470 119549 70651
11238G0651p4877l6185O669J2591J678K5085J8684o4846k850O4587O0233k6615
$$ 70651 -4226 -40411 -33742 -21151 -19473 5612 24296 -40550 -43400 21187 81420 54805
11226E4805p562J9878N5095Q9487q1604o6922q6572n2705k9017N5618J1502k0386
$$ 54805 47243 67121 122216 211703 130099 63177 -23395 -76100 -105117 -49499 -37997 -58383
11214e8383j0763O9388M6525m4972n9414M9259J8765P878q7211n687M2680L5153
$$ -58383 -69146 242 46767 1795 -57619 -8360 10405 18283 -68928 -74615 -31935 3218
11202C218N1096k5869k5336K5459K9400q406L0116L0696m7176r6492n819P1497
$$ 3218 54314 28445 3109 28568 57968 49562 79678 110374 63198 -33294 -39113 32384
11190C2384M9323l6317k7334j3775L601N7710L9017q3045n8752r947p553J8540
$$ 32384 81707 45390 18056 4281 7882 65592 104609 21564 -37188 -47135 -54688 -36148
11178c6148L2131p6710n7906K6234M0274M6786k46L1453J29978M0465l1371o2256
$$ -36148 -4017 -80727 -138633 -112399 -72125 -25339 -25585 5868 135846 176311 144940 82684
11166H2684p7131k7954M080P764j6030J603J1726K6315j9357o1504K1114J2588
$$ 82684 5553 -22401 -18321 -10557 -26587 -24984 -13258 13057 -6300 -67804 -46690 -34102
11154c4102j9845l5159L1534K3471N8671J6037J4521K2513J6295M1139j1297j09602
$$ -34102 -53947 -89106 -57572 -34101 24570 40607 55128 77641 93936 135075 123778 14176
11142A4176l502k0124l6569l5154k1034K9408J4366O1417Q8146N8143q4525q2980
$$ 14176 10674 -9450 -46019 -81173 -102207 -72799 -58433 2984 91130 149273 64748 -18232
11130a8232N0784J1672k5886P379M2206L7928L9645j07683l977L3217l7787l5087
$$ -18232 32552 44224 18338 25717 67923 105851 145496 37813 33836 67053 29266 -5821
11118e821o5676J0947J8936o4921M8075J23103J7239l8058n113J2091R736m578
$$ -5821 -71497 -60550 -41614 -106535 -58460 64643 81882 43824 38711 50802 60538 55960
11106E5960j2562m1789L5876l7996n3777M0610J39260m441r4671K1298J00179
$$ 55960 43398 1609 37485 -511 -54288 -13678 125582 121141 26470 47768 147947
11095A47947n9724K7698K2107n211n8797N426p1092k2496n8436M4225M1024K7335
$$ 147947 88223 115921 138028 132817 74020 79446 8354 -14142 -72578 -28353 12671 40006
11083D0006m198p6586m003M7067Q3834J00831k3342j22363o9828L854P8730L9260
$$ 40006 35808 -40778 -44781 2286 86120 186951 163609 41246 -28582 -24728 54002 93262
11071I3262j1018n6494J6340J742m4708j2471O3572P314N7291K6595L4421q3315
$$ 93262 82244 25750 42090 43832 -876 -13347 50225 57539 114830 141425 175846 92531
11059I2531L0872J19755j9494n4919k5721K4713m6198N9519L5531m7404p9092
$$ 92531 123403 243158 223664 168745 143024 167737 121539 181058 216589 169185 90093
11048I0093J7138M8806P568j3876j25167L755L6842l6818N1938J34083N4956R400
$$ 90093 107231 156037 163605 149729 24562 28317 65159 28341 80279 214362 269318 278718
11036B78718J3198k3714P3417O2217N8623j8392j03791q3512M2901M9872L2037
$$ 278718 291916 268202 341619 403836 462459 444067 340276 256764 299665 349537 381574
11025C81574n9296K6085M8180l7200P4390L4203j02308n6025R3241O1590J7816
$$ 381574 322278 348363 396543 359343 433733 467936 365628 309603 402844 464434 482250
11014D82250P9968Q703k347K0465O696n2854r1329m0146k8728j05576O6374O6758
$$ 482250 562218 570921 568574 589039 595735 542881 451552 411406 382678 277102 343476 410234
11002D10234P8857M0930m8175n6916n3519p5658m3143N1944m9353l7713l1871
$$ 410234 489091 530021 481846 424930 371411 295753 252610 304554 255201 217488 185617
10991A85617N1315M7449j03192L5677L7598j11439j19763K0985J5018Q712l5461
$$ 185617 236932 284381 181189 216866 254464 143025 23262 44247 59265 67977 32516
10980C2516k4005Q0485P4292K193j40978l1628Q570q8625J2660O9948M9606L3314
$$ 32516 8511 88996 163288 165481 24503 -7125 1445 -87180 -74520 -4572 45034 78348
10968G8348O2014Q59m2862q3550j07461J5352L1137j7525K7055o641J8441m8789
$$ 78348 140362 141221 98359 14809 -92652 -77300 -46163 -63688 -36633 -43274 -24833 -73622
10956g3622R3830R2263n9284j11010J7967Q1529N7530J2206K5476p221N7583k7415
$$ -73622 20208 112471 53187 -57823 -39856 41673 99203 111409 136885 129664 187247 159832
10944A59832p1033m2549o5982m1768j6793N5827R751j6165J0886k1920j2037l8670
$$ 159832 88799 46250 -19732 -61500 -78293 -22466 -12715 -28880 -17994 -39914 -51951 -90621
10932i0621j2780M8824J2688n0584J6018Q1007n8943j7396M5810p4394p5580N8441
$$ -90621 -103401 -54577 -41889 -92473 -76455 4552 -54391 -71787 -25977 -100371 -175951 -117510
10920a17510P3661N7784J16108l7384m8170p40J1782q9756j9670P7721O7934M499
$$ -117510 -43849 13935 130043 92659 44489 43749 55531 -34225 -53895 23826 91760 96259
10908I6259m3738k8748k1580q086l9228R990L0868K0657K3230o5743J0713Q5974
$$ 96259 52521 23773 2193 -5893 -45121 -35131 -4263 16394 39624 -26119 -15406 70568
10896G0568J01127L0501j42830r9587J9886N3044J985O1850j3093n7299j2879
$$ 70568 171695 202196 59366 -40221 -20335 32709 34694 96544 83451 26152 13273
10885A3273o0829j11048L0840J14376P3209R3222p976r385m1372j4561J5103J182
$$ 13273 -47556 -158604 -127764 -13388 59821 153043 145067 135682 94310 79749 94852 96034
10873I6034n3946k4456o4045m9931R8O7828J00337L6355k4209N0429m2499J6125
$$ 96034 42088 17632 -46413 -96344 -96246 -28418 71919 108274 84065 134494 91995 108120
10861A08120p3705l4352r6053O042O2982J8054j1234N1208L5238K0323r908O6971
$$ 108120 34415 63 -95990 -89948 -26966 -8912 -20146 31062 66300 86623 76715 143686
10849A43686P3798L4086p6549j09292q4262k7830P292L3615O3286L1073M3k7541
$$ 143686 217484 251570 175021 65729 -18533 -46363 -39071 -5456 57830 88903 88946 61405
10837F1405p904P613M7034O2698m0257M40R960n3567j0129n4383r1648Q3994P4253
$$ 61405 53501 61114 108148 170846 130589 131029 140989 87422 77293 22910 -68738 15256 89509
10824H9509L0843N1206M8482o4430q1829K6370K1338K9988o209j05098M0106O537
$$ 89509 120352 171558 220040 155610 73781 100151 121489 151477 145268 40170 80276 86813
10812H6813j5675n8244M6963N4294l9366l3076j4363j00673m9927N7441n2336
$$ 86813 71138 12894 59857 114151 74785 41709 27346 -73327 -123254 -65813 -118149
10801a18149N520J3244r5130P0677N2582L9622P6560k6606m7485m212Q784J28664
$$ -118149 -112629 -99385 -194515 -123838 -71256 -31634 44926 18320 -29165 -33377 -24593 104071
10789A04071J7839j33182J1572N6765q3804P056j6540j5451O2489J9726L457M8117
$$ 104071 121910 -11272 300 57065 -26739 -19683 -36223 -51674 10815 30541 33998 82115
10777H2115J4688l0457k1745N8186Q270l1913j9032k4804k2235L5378Q5318l9016
$$ 82115 96803 66346 44601 102787 111057 79144 60112 35308 13073 48451 133769 94753
10765I4753L1602R991j5143j23520r8961M9603L1009o7436p039O3480l477o6477
$$ 94753 126355 136346 121203 -2317 -101278 -51675 -20666 -88102 -95141 -31661 -35138 -101615
10753a01615p6210j40401O4244J18141P984N921M0679J0338P6631J8405J7614
$$ -101615 -177825 -318226 -253982 -135841 -127857 -121936 -81257 -70919 5712 24117 41731
10742D1731o1986q1396J9273P7401M0087m9625n3445p3486m7853M3398J12725
$$ 41731 -20255 -101651 -82378 -4977 35110 -14515 -67960 -141446 -189299 -145901 -33176
10731c3176N1357L7236k5490j8528l2766m2355l6160M7832N2228J50866k2951
$$ -33176 18181 55417 29927 11399 -21367 -63722 -99882 -52050 178 151044 128093
10720A28093j01233L684N269L4462O0946l146n7919L2888M0089P2283Q4241r326
$$ 128093 26860 30544 35813 70275 131221 128075 70156 103044 143133 215416 299657 290331
10708B90331j29306K639M5100o4080P976O7474K286k6496Q267n5201l8152J5138
$$ 290331 161025 163664 208764 144684 152660 220134 222420 195924 204191 148990 110838 125976
10696A25976J07577O2583k1528o4436n1579J08256N2948q5744L259L6910J200
$$ 125976 233553 296136 274608 210172 158593 266849 319797 234053 237312 274222 275422
10685B75422m6472L6616l1162Q399q980L9979L5900j6875k7583R571J08764J2678
$$ 275422 228950 265566 234404 242803 233823 273802 309702 292827 265244 274815 383579 396257
10673C96257p745j13603l6822J5607L0951K1473K6133O3445O3523O8364m8630
$$ 396257 388512 274909 238087 253694 284645 306118 332251 395696 459219 527583 478953
10662D78953j03630L540P0042K0229k8254l5363o9172K3992J45390M5266o0786
$$ 478953 375323 378863 448905 469134 440880 405517 336345 360337 505727 550993 490207
10651D90207o9056m718J12894P9629O4242j5401j1103Q0659j3981Q276k2758K085
$$ 490207 421151 416433 529327 608956 673198 657797 646694 727353 713372 721648 698890 700975
10639G00975k3669K3580J11662L4519O8891O4980L6475Q7518J44058P7037m3895
$$ 700975 677306 700886 812548 847067 915958 980938 1017413 1104931 1248989 1326026 1282131
10628A282131J03810J20961J29246J90097K57584K29191K31309K28436K80229
$$ 1282131 1385941 1506902 1636148 1826245 2083829 2313020 2544329 2772765 3052994
10619C052994L94337L87183M85260P07304R29047J219907J675231K271723L388859
$$ 3052994 3447331 3834514 4319774 5027078 5956125 7176032 8851263 11122986 14511845
10610A4511845M593202N604509N749107M772482K954335P92634r02784j538185
$$ 14511845 19105047 24709556 30458663 35231145 38185480 38978114 38075330 36537145
10602C6537145j158434J76727K192007M981086Q119323J0850591J1621896Q718344
$$ 36537145 35378711 35555438 37747445 42728531 50847854 61698445 73320341 82038685
10594H2038685L471635j876031n513120o742264n540724k488983J448263N882223
$$ 82038685 85510320 83634289 78121169 71378905 65838181 63349198 64797461 70679684
10586G0679684J0489362J3933977J4079962Q958055O71645o905918j1672684j3152729
$$ 70679684 81169046 95103023 109182985 118141040 118812685 111906767 100234083 87081354
10578H7081354j1520098p862276l501926O72997M530927P054205O952540L229764
$$ 87081354 75561256 67698980 64197054 64870051 69400978 76455183 83407723 86637487
10570H6637487k575855p342738j0034045j0526911q965195o330852l658444j275871
$$ 86637487 84061632 76718894 66684849 56157938 47192743 40861891 37203447 35927576
10562C5927576P13942J821528J374600k69014k446057m388498n369420n437801
$$ 35927576 36641518 38463046 39837646 39568632 37122575 32734077 27364657 21926856
10554B1926856m808286l926606k897264k038610j527124j168097q80856p16747
$$ 21926856 17118570 13191964 10294700 8256090 6728966 5560869 4680013 3963266
10546C963266m97789l88563l86985l91835l31622j66358q6615j64962j19644j28191
$$ 3963266 3465477 3076914 2689929 2298094 1966472 1800114 1713499 1548537 1428893 1300702
10536A300702j04408j72177o5888k4292n9014r2916n1076j5370k1165n1492j579
$$ 1300702 1196294 1024117 958229 933937 874923 782007 730931 715561 694396 642904 641325
10525F41325q6121n3357o3423J1807k6154l1796L6115K7101j10659m1507K4837
$$ 641325 555204 501847 438424 450231 424077 392281 428396 455497 344838 303331 328168
10514C28168k4257o798Q8723N9121j02922r5483l5368j319N2024J9770O736l1561
$$ 328168 303911 297113 385836 444957 342035 246552 211184 209865 261889 281659 288395 256834
10502B56834K5760L9909j26353p0500J01123M7856k3007n1565J4785J4025r123
$$ 256834 282594 322503 196150 125650 226773 274629 251622 200057 214842 228867 219744
10491B19744l6231l6487k3535k3109N3139N8130q6689n594P7653n8888j11549
$$ 219744 183513 147026 123491 100382 153521 211651 124962 119368 197021 138133 26584
10480B6584P7177m8076o276R8547R20k7827k2505l9460m1944O4321L3583K686
$$ 26584 103761 55685 49409 147956 148876 121049 98544 59084 17140 81461 115044 117730
10468A17730L0032q1344l7653k3141M2992k3135L4962J7908P9153M376l9002n494
$$ 117730 147762 66418 28765 5624 48616 25481 60443 78351 157504 161880 122878 117384
10456A17384J3798P575r7664q1873N9278J31973M2536j2832j7504m6109J5757
$$ 117384 131182 138757 41093 -40780 18498 150471 193007 180175 162671 116562 132319
10445A32319J4338J5669k7160L8812O977K6634m4464o6066m8378N219J4505J4539
$$ 132319 146657 162326 135166 173978 180955 207589 163125 97059 48681 53900 68405 82944
10433H2944R3054J03574r178l6052m8778l8221J24093Q1282L2798j19153j49022
$$ 82944 175998 279572 270394 234342 185564 147343 271436 352718 385516 266363 117341
10422A17341J8702K9614l7166J4243J14986L6227p7968j37597j08100l5448M3547
$$ 117341 136043 165657 128491 142734 257720 293947 215979 78382 -29718 -65166 -21619
10411b1619N9550M8420j0901n4972O0565M9776J1912j1013M6617L0999m402p0307
$$ -21619 37931 86351 75450 20478 81043 130819 142731 131718 178335 209334 204932 134625
10399A34625m6735k2956l6922P3826J4980N0441k6321l2650J2837j3292l8969
$$ 134625 87890 64934 28012 101838 116818 167259 140938 108288 121125 107833 68864
10388F8864N910q444l3750l6267l6577O2543L4925P176l0903l8575O2068O5949
$$ 68864 74774 66330 32580 -3687 -40264 22279 57204 64380 33477 -5098 56970 122919
10376A22919J8410L384J2608Q912O326k1235o5252J8778Q4442j6544p0122O182
$$ 122919 141329 144713 157321 166233 172559 151324 86072 104850 189292 172748 102626 108808
10364A08808n4844L4522m1468r989O622J5986l0060N4440J7114o6188j1992O8019
$$ 108808 53964 88486 47018 37029 43651 59637 29577 84017 101131 34943 22951 90970
10352I0970n585l1703q7038l2426m9566l7757J1050O1742L1134M5090O0827M5037
$$ 90970 85385 53682 -33356 -65782 -115348 -153105 -142055 -80313 -49179 -4089 56738 101775
10340A01775k1608p6798j0559k9076L616M9004M063m9323m1942J00702j391n0155
$$ 101775 80167 3369 -7190 -36266 -32650 16354 20417 -28906 -70848 29854 28463 -21692
10328b1692l6088j8005N3091Q5551j3046m7977k6581l7723O888N4970l1519P521
$$ -21692 -57780 -75785 -22694 62857 49811 1834 -24747 -62470 -55582 -612 -32131 -24610
10316b4610J6443J5448P347l0805j2098q17j9325n5516p7763O2027K5005q09j6743
$$ -24610 -8167 7281 14628 -16177 -28275 -29092 -48417 -103933 -181696 -119669 -94664 -95473 -112216
10303a12216N3832Q5861m8827o5210O3455K2045J8255j9056r51J676q2468l5117
$$ -112216 -58384 27477 -21350 -86560 -23105 -1060 17195 -1861 -2812 -1136 -83604 -118721
10291a18721O3291J14361O7422N6243p212l0348n3059K5218n9518j10192M776
$$ -118721 -55430 58931 126353 182596 175384 145036 91977 117195 57677 -52515 -47739
10280d7739l7409K2212O904p6394o3680m4201L2976M1761O5720R7965J5380k8001
$$ -47739 -85148 -62936 -56032 -132426 -196106 -240307 -207331 -165570 -99850 -1885 13495 -14506
10268a4506j6331j4180j1024O9941K398Q901L6377q3102q5665j6595O7587N9084
$$ -14506 -30837 -45017 -56041 13900 16298 25199 61576 -21526 -107191 -123786 -56199 2885
10256B885k2892j4784j7830N8072J5538m0440L7293L7506o6847p4069J8803r713
$$ 2885 -20007 -34791 -52621 5451 20989 -19451 17842 55348 -11499 -85568 -66765 -76478
10244g6478k5820n5161M8057M7455K5142K8549P8763M0971n6083n0779K6506j4788
$$ -76478 -102298 -157459 -109402 -61947 -36805 -8256 70507 111478 55395 4616 31122 16334
10232A6334M82J3917J5519m6299k0352M939l178q9114n228Q3755L2360j0010o484
$$ 16334 16816 30733 46252 -47 -20399 -15460 -18638 -107752 -112980 -29225 3135 -6875 -13359
10219a3359M5543J5982r2301k4475j3233l8906L410M4412k9944Q94P254j2377
$$ -13359 32184 48166 -44135 -68610 -81843 -120749 -117339 -72927 -102871 -101977 -94723 -107100
10207a07100K5134J4516L1414K7447O5719m6414k5645k0044K8236O6561M7619
$$ -107100 -81966 -67450 -36036 -8589 57130 10716 -14929 -34973 -6737 59824 107443
10196A07443n3008q4187P1111k9947m4312L3625o340k140M1394M647p208R746
$$ 107443 54435 -29752 41359 11412 -32900 725 -5615 -7755 33639 38286 31078 40824
10184D0824K171J5339l1144K3033r519L2017K8105l9005j3117k3912j2156L5593
$$ 40824 42995 58334 27190 50223 40704 72721 100826 61821 48704 24792 12636 48229
10172D8229l2518l4157O1253Q5913Q1942m0906l187O747L2401O3056N0788j8417
$$ 48229 15711 -18446 42807 128720 210662 169756 166569 173316 205717 268773 319561 301144
10160C01144R1375Q8413O4870M9572k5164k08318o2729N8003m0341K2822P4624
$$ 301144 392519 480932 545802 595374 570210 361892 299163 357166 316825 339647 414271
10149D14271P347J14934J57995j3532m0716j6555n0823M1128m2499j8902J6636
$$ 414271 421618 536552 694547 681015 640299 623744 572921 614049 571550 552648 569284
10138E69284p1936o017N2205k4336J5871r736l4154p4829r6026m3650k7409N018
$$ 569284 497348 491331 543536 519200 535071 525335 491181 416352 320326 276676 249267 254285
10126B54285k3732o1994l3924K6419N8103k7872Q702p4344p404N691k5800m7699
$$ 254285 230553 168559 134635 161054 219157 191285 199987 125643 118239 123930 98130 50431
10114E0431J1632k5452M7942k2694j11297R0415L1140p8295m1647k1982L7864
$$ 50431 62063 36611 84553 61859 -49438 40977 72117 -6178 -47825 -69807 -31943
10103c1943r0057m4386J9974O946R6760Q6888n5651n2504j3889q683L7906l5960
$$ -31943 -122000 -166386 -146412 -139466 -42706 44182 -11469 -63973 -77862 -86545 -48639 -84599
10091h4599p1003j2391J00277J04447j1928j8072r662j132r6551K1148P6780N0623
$$ -84599 -155602 -167993 -67716 36731 24803 6731 -2931 -4063 -100614 -79466 -2686 47937
10079D7937J0313k920J3036R779l3398q3713l0509l9938M457o398M3434R6992
$$ 47937 58250 55330 68366 78145 44747 -38966 -69475 -109413 -104956 -111354 -67920 29072
10067B9072m1103n4594n904m680j700l6825o4039J1013O8886J09153O5821p3355
$$ 29072 -12031 -66625 -72529 -77209 -78909 -115734 -179773 -168760 -99874 9279 75100 1745
10055A745j7131L7078l4545K536J1008j8872j22213P43N9481k345J9934l8768
$$ 1745 -15386 21692 -12853 -10317 691 -18181 -140394 -139651 -80170 -82515 -62581 -101349
10043a01349q74o258n0123L0133O0420M9029L9849k7265q2504K570J5702n1275
$$ -101349 -102223 -108481 -158604 -128471 -68051 -19022 20827 -6438 -88942 -86372 -70670 -121945
10031a21945K3071K0759K2356l2150O2742N0219k8051k0593k1689j0484k722l2533
$$ -121945 -98874 -78115 -55759 -87909 -25167 25052 -2999 -23592 -45281 -55765 -58487 -91020
10019i1020Q6659J53193k7319q8302p8952J3353o2703J597L147m222J8311P912
$$ -91020 -4361 148832 121513 33211 -45741 -32388 -95091 -93494 -90347 -94569 -76258 -68346
10007f8346l6811J8402l9012j22657j9526O1020R1396K999J08744K6088n5583
$$ -68346 -105157 -86755 -125767 -248424 -267950 -206930 -115534 -112535 -3791 22297 -33286
9996c3286R5041l9914o0427n1210o7148P694O4043J2144N566O0866J3516O532
$$ -33286 61755 21841 -38586 -89796 -156944 -149250 -85207 -73063 -67497 -6631 6885 13417
9984A3417p5383Q907K4935o6170q4510J7264P6609j818k844K8581J9187K4797
$$ 13417 -61966 -53059 -28124 -94294 -178804 -161540 -84931 -86749 -89593 -61012 -41825 -17028
9972a7028m7056j04849j4095N8934O2179j0084l8558J1371L2883K0330K8444K9623
$$ -17028 -64084 -168933 -183028 -124094 -61915 -71999 -110557 -99186 -66303 -45973 -17529 12094
9960A2094k6297o3439N1087r371L3766m8967k7672M9488K861m4303l2412J07537
$$ 12094 -14203 -77642 -26555 -35926 -2160 -51127 -78799 -29311 -26450 -70753 -103165 4372
9948D372P072o0442J5365Q1613J42523N1574n1127p6742n6655p0521M3710l3786
$$ 4372 11444 -48998 -33633 47980 190503 242077 190950 114208 57553 -12968 30742 -3044
9936c044J7445P0290K1093K7745r414l8788M3941k5841p1743l544J5544K8906
$$ -3044 14401 84691 105784 133529 124115 85327 129268 103427 31684 28140 43684 72590
9924G2590P222n717k397n7240p1788k8238L4166N1365M0342j138m7268m668J9752
$$ 72590 79812 74095 71698 14458 -57330 -85568 -51402 -37 40305 39167 -8101 -12769 6983
9911F983l7687o2435O3943K7776P1661l3762j4011j9761j0515l9318k0889K4631
$$ 6983 -30704 -93139 -29196 -1420 70241 36479 22468 2707 -7808 -47126 -68015 -43384
9899d3384O0509J9268j1509n0780k5580J3149K7727p2634k7884K9023p7878R10
$$ -43384 17125 36393 24884 -25896 -51476 -38327 -10600 -83234 -111118 -82095 -159973 -159063
9887a59063N0157l5793L0930m2753K6954Q9933J17519P426j41545K981R00P4517
$$ -159063 -108906 -144699 -113769 -156522 -129568 -39635 77884 85310 -56235 -53254 -52354 22163
9875B2163P3940q129k2536O4985k7141k6926Q068j01781j9850Q296N5234M2368
$$ 22163 96103 87974 65438 130423 103282 76356 84424 -17357 -37207 -28911 26323 68691
9863F8691J3317l5371q9111k912N4700k683N8294N0996o6219O0239P2350o926
$$ 68691 82008 46637 -42474 -45386 9314 6631 64925 115921 49702 109941 182291 175365
9851A75365j2415q9114m7801L0777N4498P728J4938l3708n4284m5607p0565m8295
$$ 175365 162950 73836 26035 56812 111310 119038 133976 100268 45984 377 -70188 -118483
9839a18483M8160J7613l4178j02742R85J06957l0713J3423K2603j713O3774N4597
$$ -118483 -70323 -52710 -86888 -189630 -188645 -81688 -112401 -98978 -76375 -78088 -14314 40283
9827D0283M0614m5156r111j4096m2188L6603L498n2678L4610m8147j126K3156
$$ 40283 80897 35741 26630 12534 -29654 6949 10447 -42231 -7621 -55768 -56894 -33738
9815c3738L8085j7240k0331M5420J6130k0136M5593j6486j4352j0195q1750P0096
$$ -33738 4347 -12893 -33224 12196 28326 8190 53783 37297 22945 12750 -69000 1096
9803A096k4175r2682N2988Q0949K3207l8426j7468j01127j8466N9217J7320N1238
$$ 1096 -23079 -115761 -62773 18176 41383 2957 -14511 -115638 -134104 -74887 -57567 -6329
9791f329l4757j08448N609K2812q4158n843N4652k759J7027L0372k5391j5427
$$ -6329 -41086 -149534 -143925 -121113 -205271 -211114 -156462 -159221 -142194 -111822 -137213 -152640
9779a52640P1931P5065R6713k7417l4546n4290m508k4908N5296R028o6650p045
$$ -152640 -80709 -5644 91069 63652 29106 -25184 -29692 -54600 696 9724 -56926 -63971
9767f3971l442l0104J30428j6045l0335L8717m8374j9823P5966m122j20498r1604
$$ -63971 -67413 -97517 32911 16866 -13469 25248 -23126 -42949 33017 28895 -91603 -183207
9755a83207M216J3165l9904J10734Q3779p022L3117k1864j7227l3810m5836j0976
$$ -183207 -178991 -165826 -205730 -94996 -11217 -18239 14878 -6986 -24213 -58023 -103859 -114835
9743a14835p9100M0638L4970P1486J12079j0733n5439o1782L2335N4961k0121
$$ -114835 -193935 -153297 -118327 -46841 65238 54505 -934 -62716 -30381 24580 4459
9732D459n5417j086j7176L7569k6815m6896N0144k9733R518R4358Q9685n7799
$$ 4459 -50958 -52044 -69220 -31651 -58466 -105362 -55218 -84951 -75433 18925 108610 50811
9720E0811L835L207m7381L1678K7074R2429N0191n9116o3499j61775J0741k658
$$ 50811 54646 57853 10472 42150 69224 161653 211844 152728 89229 -72546 -61805 -64463
9708f4463j761l9119k5970P9263M9850j7540m4297m3525O6215K4864J4279l7354
$$ -64463 -66224 -105343 -131313 -52050 -2200 -19740 -64037 -107562 -41347 -16483 -2204 -39558
9696c9558l5058P4642m8068k3302K973L4942J9863J6969Q059m9510j7775K0862
$$ -39558 -74616 26 -48042 -71344 -68371 -33429 -13566 3403 11462 -38048 -55823 -34961
9684c4961L6028q163O027k6776n1889q4260l1383N6781k3362M9191P5575J08076
$$ -34961 1067 -7096 -1069 -27845 -79734 -163994 -195377 -138596 -161958 -112767 -37192 70884
9672G0884j4655m7955J3935o7843j726J3253l4876l9468N4446M1682l0421N0358
$$ 70884 56229 8274 22209 -45634 -47360 -34107 -68983 -108451 -54005 -12323 -42744 7614
9660G614M2366m836J8767j4751m4520o6837J2854M7988k0781o9p1509j0183r492
$$ 7614 49980 45144 63911 49160 4640 -62197 -49343 -1355 -22136 -22205 -93714 -103897 -113389
9647a13389k6016j0339J4186R5274Q2532J1348p6224p5733Q8136M9013j6419k5527
$$ -113389 -139405 -149744 -135558 -40284 42248 53596 -22628 -98361 -10225 38788 22369 -3158
9635c158P1641l3236l3289R0203J2918j24043r9749J20962P4965K0233Q7863o955
$$ -3158 68483 35247 1958 92161 105079 -18964 -118713 2249 77214 97447 185310 178355
9623A78355p7243m3861M0916K1008q5921K3100K6780k5914m4931j43111q4388
$$ 178355 101112 57251 98167 119175 33254 56354 83134 57220 12289 -130822 -215210
9612b15210O0875K4731K3124R3608K7268r4625j1449J9545K3620o4559k5135N0164
$$ -215210 -154335 -129604 -106480 -12872 14396 -80229 -91678 -72133 -48513 -113072 -138207 -88043
9600h8043N823J09780O1039l4346J5187J1537m8325l7002M982O6167Q233j65359
$$ -88043 -82220 27560 88599 54253 69440 80977 32652 -4350 632 66799 75032 -90327
9588i0327k651Q4512m7223m8122j2116j4372K928K3071Q2963J3689N4610L7486
$$ -90327 -92978 -8466 -55689 -103811 -115927 -130299 -127371 -104300 -21337 -7648 46962 84448
9576H4448J3093O112p635Q893o0379p882N530k4678m648j01237l0552k8528P680
$$ 84448 97541 103653 96018 104911 44532 36650 42180 17502 12854 -88383 -118935 -147463 -139783
9563a39783O7691k6496l5693J1308P1319M725R454L3920M5430L3483j9836q2253
$$ -139783 -72092 -98588 -134281 -122973 -51654 -46929 -37475 -3555 41875 75358 55522 -26731
9551b6731k5501P7761K220m6642m554r192j2321J9761l922L0448q7661o0153M5183
$$ -26731 -52232 25529 27749 -18893 -23447 -32639 -44960 -25199 -29121 1327 -86334 -146487 -101304
9538a01304R1505n1994l2755L9916r805m958l2361O7605N3840L4038l8906o6818
$$ -101304 -9799 -61793 -94548 -54632 -64437 -69395 -101756 -34151 19689 53727 14821 -51997
9526e1997M1262o6386o4888o994J01137M2879K0436m7119N380j4257k2176O3814
$$ -51997 -10735 -77121 -142009 -149003 -47866 -4987 15449 -31670 -26290 -40547 -62723 1091
9514A091L8904L5447J150o9007n3499N2307K4245j9306m0841k9327p651l110P4489
$$ 1091 39995 75442 76592 7585 -45914 6393 30638 11332 -29509 -58836 -66487 -69597 4892
9501D892o174L0463m9727m2104L8990K4368N5666L2661m8761n3546n3315o4380
$$ 4892 -1282 29181 -20546 -62650 -23660 708 56374 89035 40274 -13272 -66587 -130967
9489a30967J5078N7484M8081J0793o4361p1248J648P453j7867K9359J13974J5157
$$ -130967 -115889 -58405 -10324 469 -63892 -135140 -133492 -126039 -143906 -114547 -573 14584
9477A4584K2141n1002r4303l8549O5364P64J2576J9723K3893N0791M786j4474
$$ 14584 36725 -14277 -108580 -147129 -81765 -81001 -68425 -48702 -24809 25982 30768 16294
9465A6294L2589K276j0015j1249n5896l9406n683O2750J8544L9096j0887J211
$$ 16294 48883 51159 41144 29895 -26001 -65407 -71090 -8340 10204 49300 38413 39624
9453C9624n6498j3798K6925N0597M2164M6955J6712p0568j50520M5898Q2563j1809
$$ 39624 -16874 -30672 -3747 46850 89014 135969 152681 82113 -68407 -22509 60054 48245
9441D8245o618N938m3089k1721O9587k2989n2491n8768M5433P8954R0459k0459
$$ 48245 41627 47565 4476 -17245 52342 29353 -23138 -81906 -36473 42481 132940 112481
9429A12481j06447o7872N2774Q892M8839k7989j03390K1324N5396m6297l1003
$$ 112481 6034 -61838 -9064 -172 48667 20678 -82712 -61388 -5992 -52289 -83292
9418h3292L5774P4808q009j3288K2390O827J4724n892l5123K4900L5837R540j1294
$$ -83292 -47518 27290 19281 5993 28383 35210 49934 44042 8919 33819 69656 79196 67902
9405F7902J6761K1384l2298k7170K1011m873l5094n1318k4541J7423L7546j16072
$$ 67902 84663 106047 73749 46579 67590 62717 27623 -23695 -48236 -30813 6733 -109339
9393a09339p1392K4065L9038P4687N2010J387p511m096k5729j4083R4236M6137
$$ -109339 -180731 -156666 -117628 -42941 9069 10456 2945 -1151 -26880 -40963 53273 99410
9381I9410l3457p6778K3150j635q9659n098J147R737M7150L6338m8509n5707Q0444
$$ 99410 65953 -10825 12325 10690 -78969 -84067 -82920 -73183 -26033 10305 -38204 -93911 -13467
9368a3467J53212N5750l5227q210o3148L7366o755o4231k6779Q084O4K8875P7037
$$ -13467 139745 195495 160268 152058 88910 126276 119521 55290 28511 36595 36659 65534 142571
9355A42571P3641n5536j46364k1325k3425l6052L4156R2760n9821l660R0487J4746
$$ 142571 216212 160676 14312 -7013 -30438 -66490 -32334 60426 605 -3055 87432 102178
9343A02178l529K2194m9824l8832p250Q0085P146r211r2398o0046J7862n2252
$$ 102178 98649 120843 71019 32187 24937 105022 112168 102957 10559 -49487 -31625 -83877
9331h3877L1624O1230R4198J888q2330l606Q531m5090p467J09989K075j17343
$$ -83877 -52253 8977 103175 105063 22733 19127 27658 -17432 -24899 85090 87165 -30178
9319c0178p719N5328m2481n9181k0029m1393m0313o237K4432J975R743K1906K8531
$$ -30178 -37897 17431 -25050 -84231 -104260 -145653 -185966 -192203 -167771 -165796 -156053 -134147 -105616
9306a05616P8467j2332R685N9077R1736M4814m3397j21364M1541o6476j00032
$$ -105616 -27149 -39481 -29796 29281 121017 165831 122434 1070 42611 -23865 -123897
9295a23897j9082M4967n444M9732J5115n9967j5267o308K3533K7625j6305Q0707
$$ -123897 -142979 -98012 -103456 -53724 -38609 -98576 -113843 -120151 -96618 -68993 -85298 -4591
9283d591J7723J8791k9304j10984J309M1063j6233L5727n5648K7768l9843l6905
$$ -4591 13132 31923 2619 -108365 -107056 -65993 -82226 -46499 -102147 -74379 -114222 -151127
9271a51127J18928N5207l6725k5772O8262R3230Q2391k0847m5332q6015o9171
$$ -151127 -32199 23008 -13717 -39489 28773 122003 204394 183547 138215 52200 -16971
9260a6971m690O8692j0252P1024o3911L1949O7806q863o6501o3364j5127p9704
$$ -16971 -21661 47031 36779 107803 43892 75841 143647 134784 68283 4919 -10208 -89912
9248h9912r4273J04698Q5759r473r940j9288N1292K2220n5497j1132J8056q4042
$$ -89912 -184185 -79487 6272 -3201 -13141 -32429 18863 41083 -14414 -25546 -7490 -91532
9236i1532k4735J05698R3331l783J544j1270L371k7044o6543M6903J01879N5422
$$ -91532 -116267 -10569 82762 78979 80523 69253 72624 45580 -20963 25940 127819 183241
9224A83241p5505l3834q359j30976j97080L4360j1201R4735J13226L1822o1314
$$ 183241 107736 73902 65543 -65433 -262513 -228153 -239354 -144619 -31393 429 -60885
9213f0885L941n7056L7411O8804l1592O2236Q8162n0586q5965j9767L679l792
$$ -60885 -56944 -114000 -76589 -7785 -39377 22859 111021 60435 -25530 -45297 -41618 -45410
9201d5410O1864q879o4645M4751J0287n1607l540N2199L1901J737q1277J3706
$$ -45410 16454 7575 -57070 -12319 -2032 -53639 -57179 -4980 26921 28658 -52619 -38913
9189c8913R50k5855L2550K4026K076n9916k0122O5973j3433Q2050m4239p6917
$$ -38913 -37963 -63818 -31268 -7242 -5166 -65082 -85204 -19231 -32664 49386 5147 -71770
9177g1770M2890J6182m9657q3806l0171O5100J41003m0190o1150j2211m9398L8754
$$ -71770 -28880 -12698 -62355 -146161 -176332 -111232 29771 -10419 -71569 -83780 -133178 -94424
9165i4424M3231K2611j4404l9434K8231o9307o3241O3542O3023j08505p1538R750
$$ -94424 -51193 -28582 -42986 -82420 -54189 -123496 -186737 -123195 -60172 -168677 -240215 -230465
9153b30465k8922R2096O9370Q6727N894J4074M1445R573L383o6370o0158K5445
$$ -230465 -259387 -167291 -97921 -11194 -5300 8774 50219 59792 63175 -3195 -63353 -37908
9141c7908l5735N4695P3771K3423J2199o3161n2796M747M6115L4197m0465P708
$$ -37908 -73643 -18948 54823 78246 90445 27284 -25512 -20765 25350 59547 19082 26790
9129B6790J4038m2567o8136j8831k4497k819N750p6043j1060Q8351P6010K9036
$$ 26790 40828 -1739 -69875 -88706 -113203 -116022 -110272 -186315 -197375 -109024 -33014 -3978
9117c978p3464o3718l3452P4989R8799J6507l9704k7435k5942k7218l100j3246
$$ -3978 -77442 -141160 -174612 -99623 -824 15683 -24021 -51456 -77398 -104616 -107716 -120962
9105a20962L1813O1489N54q925J1581N1690m2166M797n575m7201k8204m6915J40449
$$ -120962 -89149 -27660 -27106 -36031 -24450 27240 -14926 -10129 -15704 -62905 -91109 -138024 2425
9092B425k329J3697q6190k553m4238J1789J67202P0781o3399m6270j2048l5874
$$ 2425 96 13793 -72397 -74950 -119188 -107399 59803 130584 67185 20915 8867 -27007
9080b7007k6578j6857M9779N6615p302j5246j9334l6524J8276J17607K4163L3274
$$ -27007 -53585 -70442 -20663 35952 28650 13404 -5930 -42454 -24178 93429 117592 150866
9068A50866r4894Q538L676n6201k0675m3241l8150J5928O8246J5548o7589o9993
$$ 150866 55972 64510 68186 11985 -8690 -51931 -90081 -74153 -5907 9641 -57948 -127941
9056a27941J1324k3511L1722J32435K0810J1944j9333q3009q888j11044q0772
$$ -127941 -116617 -140128 -108406 24029 44839 56783 37450 -45559 -54447 -165491 -246263
9045b46263M8625O6096O5713L0723P5242Q119p4448l6647l94k1454m012P6859
$$ -246263 -197638 -131542 -65829 -35106 40136 48255 -26193 -62840 -63234 -84688 -88700 -11841
9033a1841p922j6172J2940k6942j12384j3349J08428Q1796J9336k4792l2698J2658
$$ -11841 -19763 -35935 -22995 -49937 -162321 -175670 -67242 14554 33890 9098 -23600 -10942
9021a0942k4899n9408q2364M8589J32712K8237k5660k178j4797M4540N6103r72
$$ -10942 -35841 -95249 -177613 -129024 3688 31925 6265 4087 -10710 33830 89933 88961
9009H8961M3328n3686r8927L523L9464P9428n3980o9202p0435M1864P2532o133
$$ 88961 132289 78603 -20324 -16801 22663 102091 48111 -21091 -91526 -49662 22870 16737
8997A6737J4312m0187n5639m6197q3980o116K6882L7045O9208O6015l3268m5649
$$ 16737 31049 -9138 -64777 -110974 -194954 -201070 -174188 -137143 -67935 -1920 -35188 -80837
8985h0837j0619n528k5749K9302K0240p2447K8660j413K8368o275N0J854M1237
$$ -80837 -91456 -96984 -122733 -93431 -73191 -145638 -116978 -118391 -90023 -96298 -96248 -94394 -53157
8972e3157k3762P7303J3246j4633j0882n9073N4440J0483k67N044J2697l6611
$$ -53157 -76919 384 13630 -1003 -11885 -70958 -16518 -6035 -6302 -1258 11439 -25172
8960b5172m1339p741j9593k7545j559j6014J03409N0621K5508k9288o5003o5106
$$ -25172 -66511 -74252 -93845 -121390 -122949 -138963 -35554 15067 40575 11287 -53716 -118822
8948a18822M9274M2052J4203o8417J8825j7320k6083K0351L3153K7159n6308J6146
$$ -118822 -69548 -27496 -13293 -81710 -62885 -80205 -106288 -85937 -52784 -25625 -81933 -65787
8936f5787N9413j1923k1054K7247k0426J7226N3644J9389k8577n9796j28566k1705
$$ -65787 -6374 -18297 -39351 -12104 -32530 -15304 38340 57729 29152 -30644 -159210 -180915
8924a80915K1207o924O5683R9637K0239J7100k0427M3742n7829K2128J9373n3993
$$ -180915 -159708 -166632 -100949 -1312 18927 36027 15600 59342 1513 23641 43014 -10979
8912a0979j4018R330J667o7400m7873p1201M9831N2102k6275M1163R6156N829
$$ -10979 -24997 -15667 -14000 -81400 -129273 -200474 -150643 -98541 -124816 -83653 12503 18332
8900A8332J07140m7300j86871l0666O8090K7322M5726n301n4855l8481k2317l5829
$$ 18332 125472 78172 -108699 -139365 -71275 -43953 1773 -3528 -58383 -96864 -119181 -155010
8888a55010J5192P5637K0999k2668m8302O8212O3695q645l3303m342n189O6202
$$ -155010 -139818 -64181 -43182 -65850 -114152 -45940 17755 9110 -24193 -28535 -33724 32478
8876C2478K4049l7950n934L8053q31R573p3719J8461L0104M3806M2021r630p5493
$$ 32478 56527 18577 12643 50696 49865 59438 -14281 4180 34284 78090 120111 110481 34988
8863C4988O877q0412o9958m4598N9250J4523N3103M9676r01r4883p9078n494l382
$$ 34988 41865 -38547 -108505 -153103 -93853 -79330 -26227 23449 22548 -72335 -151413 -156907 -160289
8850a60289Q1233N0758j7168L860j7321r738j1515L1513J13359K3128p4376j7522
$$ -160289 -79056 -28298 -45466 -41606 -58927 -68665 -80180 -48667 64692 87820 13444 -4078
8838d078L8877M9139K5330l3697j2113j2672k1681j4155O761K9587o989K871k420
$$ -4078 34799 83938 109268 75571 63458 50786 29105 14950 21711 51298 44309 47180 44760
8825D4760n0904K1829K7667l1719n684j5237N8182J18107M4931l2230j07609p1258
$$ 44760 -6144 15685 43352 11633 5949 -9288 48894 167001 211932 179702 72093 835
8813H35l759K1796J8779n8828q4293K049J9489K1410j077n8876k4316n8758O3215
$$ 835 -2924 18872 37651 -21177 -105470 -103421 -83932 -62522 -63599 -122475 -146791 -205549 -142334
8800a42334Q7039J10617j3845n0698n7670J3316n1895l3848L0062J20476M9932
$$ -142334 -55295 55322 41477 -9221 -66891 -53575 -105470 -139318 -109256 11220 61152
8789F1152p2031N009r820Q77n911q334l7179J8670p8271n7755M0758J1630J5986
$$ 61152 -10879 -5870 -15690 -14813 -20724 -29058 -66237 -47567 -125838 -183593 -142835 -131205 -115219
8776a15219M861M8278L3134O4188n5917n6078j8473J6674P0943J06280o8488m2433
$$ -115219 -110358 -62080 -28946 35242 -20675 -76753 -95226 -78552 -7609 98671 30183 -12250
8764a2250R8097j9524l0329o9460q4048K8068j3542p5545Q7755M3409l3909O844
$$ -12250 85847 66323 35994 -33466 -117514 -89446 -102988 -178533 -90778 -47369 -81278 -74434
8752g4434k322r239J4427n5769j13770K1894J40312R9618O3866J29150o7923k7387
$$ -74434 -76756 -85995 -71568 -127337 -241107 -219213 -78901 20717 84583 213733 145810 118423
8740A18423P9802R023r5332p8053r1186j4114j1190j528N8499J13817L9684k7540
$$ 118423 198225 207248 111916 33863 -57323 -71437 -82627 -84155 -25656 88161 127845 100305
8728A00305q6722L438L1323m6044p0821k3048P0271Q9658j5190o7722p533L2573
$$ 100305 13583 17021 48344 2300 -68521 -91569 -21298 68360 53170 -14552 -22085 10488
8716A0488j2464k5247N2698Q4421L2740J5427m3949n9021Q659N9809M237m9947
$$ 10488 -1976 -27223 25475 109896 142636 158063 114114 55093 63752 123561 127798 77851
8704G7851r4975q121P6065j4753k826p0697p1375K1835M9374j7196L6461J4201
$$ 77851 -17124 -25245 50820 36067 33241 -37456 -108831 -86996 -37622 -54818 -18357 -4156
8692d156n4446j7141m2645l008P6240L9393j9653n6146m1892P3370O0085m539
$$ -4156 -58602 -75743 -118388 -121396 -45156 -5763 -25416 -81562 -123454 -50084 10001 5462
8680E462l1963l3038K9738k0505K4089J300k7537j4278M8122J1989j5688m0720
$$ 5462 -26501 -59539 -29801 -50306 -26217 -24917 -52454 -66732 -18610 -6621 -22309 -63029
8668f3029O4231M070J4200L2479m1075k0202j9726L9482R9143L0703j26595j928
$$ -63029 1202 5272 19472 51951 10876 -9326 -29052 10430 109573 140276 13681 11753
8656A1753N2914N4793L0812k631j77600r5471M0205l3637p553J6676L5119L3322
$$ 11753 64667 119460 150272 147641 -29959 -125430 -85225 -118862 -126415 -109739 -74620 -41298
8644d1298K9029J2153l0448j6862p7244m928J11094K4454m5305p1823P2736j0170
$$ -41298 -12269 -116 -30564 -47426 -124670 -129598 -18504 5950 -39355 -111178 -38442 -48612
8632d8612m864K7957J00237n5890M2589m3245k4049L2509j2215l5438j2720p2422
$$ -48612 -53476 -25519 74718 18828 61417 18172 -5877 26632 14417 -21021 -33741 -106163
8620a06163J2516N4798K9450q6954k3680P9719M3614l9095M2030Q7960N4863K4477
$$ -106163 -93647 -38849 -9399 -96353 -120033 -40314 3300 -35795 6235 94195 149058 173535
8608A73535n0583m012j7684j22699p5057j5939M0496k7367J9120N4943K1161l2283
$$ 173535 122952 118940 101256 -21443 -96500 -112439 -71943 -99310 -80190 -25247 -4086 -36369
8596c6369M9943n8733r0100m4031O3044Q4939R5046M6460K9126m8466j03001M4127
$$ -36369 13574 -45159 -135259 -179290 -116246 -31307 63739 110199 139325 90859 -12142 31985
8584C1985o6883O897P2027j0198o7470l415Q0515n2852l7269N5716p5915l8466
$$ 31985 -34898 -28001 44026 33828 -33642 -37057 43458 -9394 -46663 9053 -66862 -105328
8572a05328R2764L3265L2284o1431k2877M733O7799m8154o729Q1893K6268p6693
$$ -105328 -12564 20701 52985 -8446 -31323 -26590 41209 -6945 -13674 68219 94487 17794
8560A7794m3969M3515L7721m1547o4352J4959M9893j4101k2765k8182J6705Q9299
$$ 17794 -26175 17340 55061 13514 -50838 -35879 14014 -87 -22852 -51034 -34329 54970
8548E4970M3317K3904j0130l007o8702m9024M2181R1871o3526j00611k2750K2709
$$ 54970 98287 122191 112061 109054 40352 -8672 33509 125380 61854 -38757 -61507 -38798
8536c8798K141o0621P283K5331N884O2184l2965K1186J4593K601n555R73l7495
$$ -38798 -36657 -97278 -89995 -64664 -58780 3404 -29561 -8375 6218 8819 3264 4237 -33258
8523c3258k3930L9611M9949J0743k2127Q626J7475J2293k4908j4774O6018k0933
$$ -33258 -57188 -17577 32372 43115 20988 29614 47089 59382 34474 19700 85718 64785
8511F4785l8148j1919K3011O0844l4088p4437P014O6163m169l7029K5562j3412
$$ 64785 26637 14718 37729 98573 64485 -9952 -2938 63225 59056 22027 47589 34177
8499C4177L7912L7181l7954P0747p0974K2466P572J2333J0948Q25l7965j7681
$$ 34177 72089 109270 71316 142063 71089 93555 101127 113460 124408 125233 87268 69587
8487F9587J8012l6637j00455q4154q9013M0129J4237Q0775O7075L462l5514m5685
$$ 69587 87599 50962 -49493 -133647 -222660 -182531 -168294 -87519 -20444 -16982 -52496 -98181
8475i8181m7974K6281l28K2880J15390R3694l9679n2306K0560k4742p6284l7670
$$ -98181 -146155 -119874 -120202 -97322 18068 111762 72083 19777 40337 15595 -60689 -98359
8463i8359N741k4146M1825J32326j737L3614k826J8804q379K2346L0294m4763
$$ -98359 -92618 -116764 -74939 57387 55650 89264 86438 105242 96863 119209 149503 104740
8451A04740Q9J2380p1073m6004m9666J5320M9239O6788m1997K0334L9295k4471
$$ 104740 104829 117209 46136 132 -49534 -34214 15025 81813 39816 60150 99445 74974
8439G4974k179N0162N0589j939m9389p2321l029N0540K0518K6923N8622m9116
$$ 74974 72795 122957 173546 171607 122218 49897 46868 97408 117926 144849 203471 154355
8427A54355k7065r865j1827j0668q7851J0214J673m095n1152n4036K8999N1512
$$ 154355 127290 117425 105598 94930 7079 17293 18966 14871 -36281 -90317 -61318 -9806
8415i806M769j3884o865P907k1316j0806L777l7356o1400N546Q1588J923O0904
$$ -9806 -5037 -18921 -25786 -17879 -39195 -50001 -46224 -83580 -144980 -139434 -57846 -55923 4981
8402D981j6469n905K9345k4947L5065L8386j03060n9369k7057k2115R4621M6025
$$ 4981 -11488 -17393 11952 -12995 22070 60456 -42604 -101973 -129030 -151145 -56524 -10499
8390a0499O3367o6422p0879R3915L5575j3268K9093L6795l5626j5201j3770j3846
$$ -10499 52868 -13554 -84433 9482 45057 31789 60882 97677 62051 46850 33080 19234
8378A9234k5065j6766j7607J856J9060M2714Q5037l0593q1028l0052L6026N3073
$$ 19234 -5831 -22597 -40204 -38348 -19288 23426 108463 77870 -3158 -33210 2816 55889
8366E5889O7460q0641r5981j0796J9432L7202k4709N999O4868p4824K767j2262
$$ 55889 123349 42708 -53273 -64069 -44637 -7435 -32144 -26145 38723 -36101 -33334 -45596
8354d5596J7031J2227l3070j0545Q1689k2065J7940p949m5650M9196m6038k02
$$ -45596 -28565 -16338 -49408 -59953 21736 -329 17611 9662 -35988 13208 -32830 -33032
8342c3032Q670L0907q673j40624J20092R3540k0844J5629M2631M2537o9008o6626
$$ -33032 -24362 6545 -2128 -142752 -22660 70880 50036 65665 108296 150833 81825 15199
8330A5199o1777L3716N0616l5104o8467o0013O1816O1909m4942J2915R021J2703
$$ 15199 -46578 -12862 37754 2650 -65817 -125830 -64014 -2105 -47047 -34132 -25111 -12408
8318a2408n5152p8519l0695m6758Q1185Q4074Q1245P3051j7294p7970m2138o3764
$$ -12408 -67560 -146079 -176774 -223532 -142347 -58273 22972 96023 78729 759 -41379 -105143
8306a05143o6666L2816Q0283J8445M8153k210M3903L9131p7024m7998o9472L2351
$$ -105143 -171809 -138993 -58710 -40265 7888 5678 49581 88712 11688 -36310 -105782 -73431
8294g3431N407j6948L3361M9330N189o825m405K3664N7896J2464N128l0326m7662
$$ -73431 -68024 -84972 -51611 -2281 2908 -3917 -8322 15342 73238 85702 90830 60504 12842
8281A2842l5924o5570l4718P5763J1731K59J2695J1342p64J6529P3712n9920p3526
$$ 12842 -23082 -88652 -123370 -47607 -35876 -35617 -22922 -11580 -12344 4185 77897 17977 -55549
8268e5549j1107k2672l2118L3504l2058N0729Q3490L2627J8645m116p7751k2338
$$ -55549 -66656 -89328 -121446 -87942 -120000 -69271 14219 46846 65491 61375 -16376 -38714
8256c8714R225M7906M5963K221K4079o349k3800N167o877j7292m1359o0853o6256
$$ -38714 -29489 18417 64380 66601 90680 84331 60531 65698 58821 41529 170 -60683 -126939
8243a26939R6569j6685l6786Q7262K7278k8865k5653L1917O2155n1332j9575k7404
$$ -126939 -30370 -47055 -83841 3421 30699 1834 -23819 8098 70253 18921 -654 -28058
8231b8058p2980O1603Q8120P878j11025l7194L7021P3296j07379k1765K9684M8577
$$ -28058 -101038 -39435 48685 56563 -54462 -91656 -54635 18661 -88718 -110483 -80799 -32222
8219c2222P0503M8447K5413q8403l0314o3443J2396L8557l1087j2385N9159P111
$$ -32222 38281 86728 112141 23738 -6576 -70019 -57623 -19066 -50153 -62538 -3379 3732
8207C732n587N8755P3405j5452J6183m0699j33528m2828m5755J9159Q069P6232
$$ 3732 -1855 56900 130305 114853 131036 90337 -43191 -86019 -131774 -112615 -104546 -28314
8195b8314J00737M128l7480L4259Q5002j42571p5367K0619J5119j9221j7874L4390
$$ -28314 72423 76551 39071 73330 158332 15761 -59606 -38987 -23868 -43089 -60963 -26573
8183b6573k3089J4442L2581O2894O1863p4684k4525J1482r1088N5038r7624J8696
$$ -26573 -49662 -35220 -2639 60255 122118 47434 22909 34391 -56697 -1659 -99283 -80587
8171h0587J12292o3797r193K2123L8161N7186j1601O4732O2722o584n1519o8861
$$ -80587 31705 -32092 -41285 -19162 18999 76185 64584 129316 192038 185454 133935 65074
8159F5074q0433m0631m4831L8696O702k1670R8120N0930o399p7799l6583k54L4737
$$ 65074 -15359 -55990 -100821 -62125 -55423 -77093 21027 71957 65558 -12241 -48824 -49078 -14341
8146a4341J8528n248K536L680l4072M1152K6273n6169j8945M6781M320k3251l3806
$$ -14341 4187 -1061 1475 5155 -28917 12235 38508 -17661 -36606 10175 14495 -8756 -42562
8133d2562k3846j1876P7687P4033L2285J7888l8816k3998o130l9063l81j04179
$$ -42562 -66408 -78284 -597 73436 105721 123609 84793 60795 54665 15602 15221 -88958
8121h8958j4868M0700j9979L2626r812L6803o812N7187Q838L8900l8827P732J6921
$$ -88958 -103826 -63126 -83105 -50479 -60291 -23488 -30300 26887 35725 74625 35798 43530 60451
8108F0451N42K5236L682o4241n6060m3889L0335J38444K5969l0641p5008k0184
$$ 60451 60993 86229 89911 25670 -30390 -74279 -43944 94500 120469 89828 14820 -5364
8096e364l5043l2618O191k48m1566n4688N2919P0386l2681J3514L0999M9327q701
$$ -5364 -40407 -73025 -66834 -67082 -108648 -163336 -110417 -40031 -72712 -59198 -28199 21128 12427
8083A2427J132J2346r6622q8269L1186R4309l6444O2234M1843M4284O1813K310
$$ 12427 13559 25905 -70717 -158986 -127800 -33491 -69935 -7701 34142 78426 140239 142549
8071A42549k6688l1472p8251p2688j1247m0764n2113J6277M8880n160L0427j6428
$$ 142549 115861 84389 6138 -66550 -77797 -118561 -170674 -154397 -105517 -110677 -80250 -96678
8059i6678Q071K3659O211j9092J4379j877J4325j3131J4754K0858j3829J0657
$$ -96678 -88607 -64948 -58737 -77829 -63450 -65327 -51002 -64133 -49379 -28521 -42350 -31693
8047c1693j4618k6126j1395m6390M4807Q8823k5868j5565L6929N9822r0717r9306
$$ -31693 -46311 -72437 -83832 -130222 -85415 3408 -22460 -38025 -1096 58726 -31991 -131297
8035a31297K5392O613o3010M5973J20593N8139K9484j823J1222L0333m7351r3418
$$ -131297 -105905 -99292 -162302 -116329 4264 62403 91887 90064 101286 131619 84268 -9150
8023i150L3704O4616K8677j9422o3726n6700L2117Q020K4827N2362K1212l609
$$ -9150 24554 89170 117847 98425 34699 -22001 10116 18136 42963 95325 116537 112928
8011A12928q973r685q1691j562O5539j24341J012K6859K854J09412J2233j13627
$$ 112928 103955 94270 12579 11017 76556 -47785 -46773 -19914 -17060 92352 104585 -9042
7999i042o2861J7111j087R8471k7024l818K2057l5788M8528R6500N3856j0518
$$ -9042 -71903 -54792 -55879 42592 15568 11750 33807 -1981 46547 143047 196903 186385
7987A86385k5041q0457k9099M8765K1495j5065j11282o5423J5963M1082K5360
$$ 186385 161344 80887 51788 100553 122048 106983 -4299 -69722 -53759 -12677 12683
7976A2683j7506O2381j1171J1033j4325J6706K7341k0611n6977M1955J02955j9083
$$ 12683 -4823 57558 46387 57420 43095 59801 87142 66531 9554 51509 154464 135381
7964A35381k3427o8082j06325l237N1031j9608j06390N5249k4675L7785P4794
$$ 135381 111954 43872 -62453 -65690 -14659 -34267 -140657 -85408 -110083 -72298 2496
7953B496j1064k8355K6636P2072P2747m8992m1195N76r269p0837o221O4404l9384
$$ 2496 -8568 -36923 -10287 61785 134532 85540 44345 44921 35652 -35185 -41406 22998 -16386
7940a6386L1468k767j14760o3019j4159r116M6497K5746J29156L5572l9955O2035
$$ -16386 15082 12315 -102445 -165464 -179623 -188739 -142242 -116496 12660 48232 8277 70312
7928G0312m3640l1480k7935j40518L2876J35832P8333J3393p9472n9675O827J4394
$$ 70312 26672 -4808 -32743 -173261 -140385 -4553 73780 87173 7701 -51974 -45147 -30753
7916c0753L6711Q3194N8111M3796L0180l0613j00670r7997K070K552K2876O9128
$$ -30753 5958 89152 147263 191059 221239 190626 89956 -8041 -5971 -3419 19457 88585
7904H8585l6436m2542k2921p5532P8290K0799j20137k8856J823N2909O3077K4883
$$ 88585 52149 9607 -13314 -88846 -10556 10243 -109894 -138750 -136927 -84018 -20941 3942
7892C942N2965j9143l8102j9734K4866Q8684R975q0476j7214M7224l498j0487
$$ 3942 56907 37764 -338 -20072 4794 93478 103453 22977 5763 52987 49489 39002
7880C9002K267M5173K2278J7967j03293o5480j2357P6347l7586j6655M2518K8891
$$ 39002 41269 86442 108720 126687 23394 -42086 -54443 21904 -15682 -32337 10181 39072
7868C9072L6549P3866k5l0647p6421o7085Q972K773J1640l6835p0101p987K0631
$$ 39072 75621 149487 149462 118815 42394 -24691 -15719 -12946 -1306 -38141 -108242 -116229 -95598
7855i5598o1050R1955P1847L3212o8228j1965L542J0334l4319k9037R302J7164
$$ -95598 -156648 -64693 7154 40366 -27862 -39827 -36285 -25951 -60270 -89307 -80005 -62841
7843f2841M870L523j9263P8490P024N0084l082J6066k4488j36358p775L6247P910
$$ -62841 -57971 -54448 -73711 4779 11803 61887 58805 74871 50383 -85975 -93750 -57503 -49593
7830d9593Q3135m6869n4152O7693o6443q9096M5055J5756l4928J4216o4339R26
$$ -49593 33542 -13327 -67479 214 -66229 -155325 -110270 -94514 -129442 -115226 -179565 -178639
7818a78639P4755J1353k5826j4567K2249l8562N406m8923k0752K5606J10056N0887
$$ -178639 -103884 -92531 -118357 -132924 -110675 -149237 -143831 -192754 -213506 -187900 -77844 -26957
7806b6957Q830o878L7594m5504j9862q632R781O9822J5782o6910p3422j7079L4192
$$ -26957 -18127 -25005 12589 -32915 -52777 -61409 -51628 18194 33976 -32934 -106356 -123435 -89243
7793h9243J21465M4159N0495M1431r3005l6771m611r2022p5611o7387j00152L0276
$$ -89243 32222 76381 126876 168307 75302 38531 33920 -58102 -133713 -201100 -301252 -270976
7781b70976J28478Q7454L2191k4403l3028O6615N6004n3786k9356O8068k5408
$$ -270976 -142498 -55044 -22853 -47256 -80284 -13669 42335 -11451 -40807 27261 1853
7770A853j4537l0532P7564k9710l9807R4022R8350k1712J9519q956o5922l6796
$$ 1853 -12684 -43216 34348 4638 -35169 58853 157203 135491 155010 146054 80132 43336
7758D3336k8402n8711n2571R213l4503j3595q774l4080p564R560J4870J03503
$$ 43336 14934 -43777 -96348 -87135 -121638 -135233 -144007 -178087 -185651 -176091 -161221 -57718
7746e7718N3202N9555Q8075q5174j57991j0384O356M6936L1964j8150j4924K5717
$$ -57718 -4516 55039 143114 57940 -100051 -110435 -104079 -57143 -25179 -43329 -58253 -32536
7734c2536l781M143J25415K9366n5248l2798j2689L6132M996m959p3124k2881
$$ -32536 -36317 -32174 93241 122607 67359 34561 21872 58004 63000 58041 -15083 -37964
7722c7964M5k5748j3974M5523k610k336K1680n5030N6127p8167j2986J9254j4009
$$ -37964 -37919 -63667 -77641 -32118 -34728 -37064 -15384 -70414 -14287 -92454 -105440 -86186 -100195
7709a00195k1674l3219Q5465O189r295R2728N4879j9617j5756L0457l0881j12864
$$ -100195 -121869 -155088 -69623 -63434 -72729 19999 74878 55261 39505 69962 39081 -73783
7697g3783m2195L573M5659O1528M1373o8683o7806p1243N2815J7564L0302o3492
$$ -73783 -115978 -112405 -66746 -5218 36155 -32528 -100334 -171577 -118762 -101198 -70896 -134388
7685a34388M2329P2315J8008k6608N9073P087k9709O6482M1471o787j6650n0987
$$ -134388 -92059 -19744 -1736 -28344 30729 37816 8107 74589 116060 109273 92623 41636
7673D1636M5757Q3353n6600p8037L9581O8260q5000j15429k6977J942M0450O2162
$$ 41636 87393 170746 114146 36109 75690 143950 58950 -56479 -83456 -81514 -41064 21098
7661B1098N7583K6071j9093p3239K146L3222J2592m0861L4786o8837M01l1236
$$ 21098 78681 104752 85659 12420 14566 47788 60380 19519 54305 -14532 -14131 -45367
7649d5367O484m5189n6435O04J7662l3080J4853J5506J21915K4498j1452n1574
$$ -45367 -38883 -84072 -140507 -139903 -122241 -155321 -140468 -124962 -3047 21451 9999 -41575
7637d1575J9129N8408R5539K6164n2959q9866j2994R2160m6777o7605P3379L8775
$$ -41575 -22446 35962 131501 157665 104706 14840 1846 94006 47229 -20376 53003 91778
7625I1778m4606l1337p5747O0419J07227j05887O7714O4469r8003n5517N892l7858
$$ 91778 47172 15835 -59912 507 107734 1847 69561 134030 36027 -19490 -13598 -51456
7613e1456j01370j8782J41412M3168r0260j04573Q218N0141O8057L7695l5651
$$ -51456 -152826 -171608 -30196 12972 -77288 -181861 -173643 -123502 -55445 -17750 -53401
7602e3401L8480K2162p8603k4337R7107k0105K9093j3707k6854k7208j4766J9657
$$ -53401 -14921 7241 -71362 -95699 1408 -18697 10396 -3311 -30165 -57373 -72139 -52482
7590e2482k4225K2034J9668N866m1822L5095K2490N1832o6160j9254n288q2299
$$ -52482 -76707 -54673 -35005 -29139 -70961 -35866 -13376 38456 -27704 -46958 -52246 -134545
7578a34545k0321R9604M323l0753n7428k4478J1275N0096J16605N5181n0482j1471
$$ -134545 -154866 -55262 -50939 -81692 -139120 -163598 -152323 -102227 14378 69559 19077 7606
7566G606o1315N0792J63089K4649q7995l4432j08477K3214J05632M2793r4124
$$ 7606 -53709 -2917 160172 184821 96826 62394 -46083 -22869 82763 125556 31432
7555C1432n9959o639L7344M8626J5410j3192l9333o365M5144k3401l5277R34L4852
$$ 31432 -28527 -35166 2178 50804 66214 53022 13689 7324 52468 29067 -6210 -5276 29576
7542B9576J0999n5630n7161N7308k392K1590R64J5155j9493p2898O7340j2726
$$ 29576 40575 -15055 -72216 -14908 -17300 4290 5254 20409 916 -71982 -4642 -17368
7530a7368j0196N0322M1147P225M0193K5118l5956r5250P1501M6503j47892K287
$$ -17368 -27564 22758 63905 71130 111323 136441 100485 5235 76736 123239 -24653 -22366
7518b2366L8128K5087J6050J1068j1824O6581m7301q4907j9903O4990N4746m4445
$$ -22366 15762 40849 56899 67967 56143 122724 75423 -9484 -29387 35603 90349 45904
7506D5904O2882J3016j8461n3506l1099j47379q2908j2895J04287m93j7790N8181
$$ 45904 108786 121802 103341 49835 18736 -128643 -211551 -224446 -120159 -120652 -138442 -80261
7494h0261J2706N0436r45j09685j5819K0592L2314l5146L3137L0438O4796M2096
$$ -80261 -67555 -17119 -18064 -127749 -143568 -122976 -90662 -125808 -92671 -62233 2563 44659
7482D4659N8561j8874m2539m4980n0873L0116L7991j49521q9916P920R3197Q6346
$$ 44659 103220 84346 41807 -3173 -54046 -23930 14061 -135460 -225376 -217456 -124259 -37913
7470c7913R1188j5813j26901l0388M1327P5629O7476n8082r5570L8953M9754j6997
$$ -37913 53275 37462 -89439 -119827 -78500 -2871 64605 6523 -89047 -50094 -340 -17337
7458a7337o7353M580M3437J8776L5060j2966m6035L7157k6865L2223Q1325J4151
$$ -17337 -84690 -80110 -36673 -17897 17163 4197 -41838 -4681 -31546 677 82002 96153
7446I6153o1520N4942k1124n4490J7046j3584L5907k5863n5030q8247Q2715M8200
$$ 96153 34633 89575 68451 13961 31007 17423 53330 27467 -27563 -115810 -33095 15105
7434A5105p598P1995M0631q5279m9838J5951L0715N2129M1892M0240j4504m6350
$$ 15105 7507 79502 120133 34854 -14984 967 31682 83811 125703 165943 151439 105089
7422A05089j4616n4216J2197j0781J00O8925n486j2397k9028q8869K5138L9763
$$ 105089 90473 36257 48454 37673 37773 106698 101212 88815 59787 -29082 -3944 35819
7410C5819R668M8903K584p0866O821J02502j14682j60677k760L5414R369p160
$$ 35819 45487 94390 96974 26108 32929 135431 20749 -139928 -142688 -107274 -97905 -105065
7398a05065L3399M5999j2359N6377N6872k4963J03853K519J765M2659l3463r8869
$$ -105065 -71666 -25667 -38026 18351 75223 50260 154113 156632 158397 201056 167593 68724
7386F8724p4759l5458j1997l4693L0910M9313Q2041M3100K5085o8111j04713n0807
$$ 68724 -6035 -41493 -53490 -88183 -57273 -7960 74081 117181 142266 74155 -30558 -81365
7374h1365m838K1212j1451l689n6425N6053Q8783P0644K0098r9229L429K5495
$$ -81365 -86203 -64991 -76442 -80131 -136556 -80503 8280 78924 99022 -207 3222 28717
7362B8717J6981k0299N6322k6662k1988k9498J8696K6535l8160n3901o0320j05864
$$ 28717 45698 25399 81721 55059 33071 3573 22269 48804 10644 -43257 -103577 -209441
7350b09441K7966J71227Q1263M3692m8490o1576j6526n1918L3673M8656m216K9958
$$ -209441 -181475 -10248 71015 114707 66217 4641 -11885 -63803 -30130 18526 14310 44268
7338D4268J6171l845n3334p1717r1915M8324P6022j8486n443K1315L3522Q969
$$ 44268 60439 56594 3260 -68457 -160372 -112048 -36026 -54512 -59955 -38640 -5118 3851
7326C851l1129J3819n3185K9214n310J01652k3391p5485L2046K9160M0242n9169
$$ 3851 -27278 -13459 -66644 -37430 -42740 58912 35521 -39964 -7918 21242 61484 2315
7314B315l4679K0461m1826P1385M6639o3269l5644k5191O1301j2937r0267m3174
$$ 2315 -32364 -11903 -53729 17656 64295 1026 -34618 -59809 1492 -11445 -101712 -144886
7302a44886J8873M8364n4673j930L1078L1017P3889N7563O188q2860L7112p9957
$$ -144886 -126013 -77649 -132322 -134252 -103174 -72157 1732 59295 65483 -17377 19735 -60222
7290f0222J0040M8839j3576o6585J5607J485J7373o0095L4340J10007k1922J193
$$ -60222 -50182 -1343 -14919 -81504 -65897 -64412 -47039 -107134 -72794 37213 15291 16484
7278A6484N5918p758l0243N4934P2489K7002m1633j70484N110J16222N1432j52573
$$ 16484 72402 64644 34401 89335 161824 188826 147193 -23291 -18181 98041 149473 -3100
7266c100n1242o4584K6881N4566O226l5765m9352J4801O0054K3525R0301M7167
$$ -3100 -54342 -118926 -92045 -37479 -31253 -67018 -116370 -101569 -41515 -17990 72311 119478
7254A19478l3643p6740q7257k9662k7399L951M1342K644R375J6646K3599N5767
$$ 119478 85835 9095 -78162 -107824 -135223 -131272 -89930 -87286 -77911 -61265 -37666 18101
7242A8101o8928n7140l0781O3405O7258k0348Q9880l6723j08070j9608J1888K0558
$$ 18101 -50827 -107967 -138748 -75343 -8085 -28433 61447 24724 -83346 -102954 -91066 -70508
7230g0508j8704K5325j724j6044k2258P1509M6799j6464R838o968o4140n8082
$$ -70508 -89212 -63887 -65611 -81655 -103913 -32404 14395 -2069 7769 801 -63339 -121421
7218a21421R496n5792O9999J38557K8440q9983r6914q6062J02764M7012L3716
$$ -121421 -111925 -167717 -97718 40839 69279 -20704 -117618 -203680 -100916 -53904 -20188
7207b0188m407o526k2333N9884N8151K0889J8010k561m1123k4337J4001J0431
$$ -20188 -24595 -31121 -53454 6430 64581 85470 103480 100919 59796 35459 49460 59891
7195E9891J2096j6168K5648K1749l78l9340l8309K5682N5380m5300l6676M1471
$$ 59891 71987 55819 81467 103216 102838 63498 25189 50871 106251 60951 24275 65746
7183F5746N915o1004o6902J0886O3737r783p1653N3567P0728k734m7072o6810
$$ 65746 71661 10657 -56245 -45359 18378 8595 -63058 -9491 61237 58503 11431 -55379
7171e5379n702O0932K6530L8076o5937m9960k9668O955p129K6049Q5492l9080
$$ -55379 -61081 -149 26381 64457 -1480 -51440 -81108 -74153 -81282 -55233 30259 -8821
7159h821L5162K6089K6792k9147j03952O949l5951K2409L0623L651l624K5733
$$ -8821 26341 52430 79222 50075 -53877 -46928 -82879 -60470 -29847 -26196 -29820 -4087
7147d087K4180L5524K5864J8259l7904o1830r577J2505r4567l4349J1004O7533
$$ -4087 20093 55617 81481 99740 61836 6 -9571 2934 -91633 -125982 -114978 -47445
7135d7445J05006j5806p5427n9646J2548M065N2960q773k2920n8365o0416N7886
$$ -47445 57561 41755 -33672 -93318 -80770 -76705 -23745 -32518 -55438 -113803 -174219 -116333
7123a16333J04078O9291Q3421J04649j1967j04569p4029l8430o0357J4235M9228
$$ -116333 -12255 57036 140457 245106 233139 128570 54541 16111 -44246 -30011 19217
7112A9217j7029J43919k4624r1082q4905o1810L1438J01291M2878M8243K2037
$$ 19217 2188 146107 121483 30401 -54504 -116314 -84876 16415 59293 107536 129573
7101A29573j4375m7396n4659l1225K3851J7828L6818m7330p5441K984l7235O5835
$$ 129573 115198 67802 13143 -18082 5769 23597 60415 13085 -62356 -59372 -96607 -30772
7089c0772Q381l0380L1652o9549M3301N2439m32q606n2922K6584N9096j0742p1790
$$ -30772 -22391 -52771 -21119 -90668 -47367 5072 4640 -3966 -56888 -30304 28792 18050 -53740
7076e3740l1995M0947k3435K8524J5340L902L7236j2098r0318k4638L3396l1454
$$ -53740 -85735 -44788 -68223 -39699 -24359 -20457 16779 4681 -85637 -110275 -76879 -108333
7064a08333n66n4783J9511P0411P4014K8319k1765q7556k6698P8427M3692o9733
$$ -108333 -108899 -163682 -144171 -73760 254 28573 6808 -80748 -107446 -29019 14673 -55060
7052e5060J7028K1304K7219n225N1549l0469q2975N7528l7254L718L5152j8567
$$ -55060 -38032 -16728 10491 5266 56815 26346 -56629 899 -36355 -32637 2515 -16052
7040a6052k396L4420J5534R072p5636q1696q984M9042m770P4072P692K3675K9804
$$ -16052 -18448 15972 31506 40578 -35058 -116754 -125738 -76696 -81466 -7394 298 23973 53777
7027E3777P61j6634n1142q187Q221J3582K9879k7316J68Q741L5552N4025k2004
$$ 53777 54538 37904 -13238 -21425 -13204 378 30257 2941 3109 11850 47402 101427 79423
7014G9423Q020P343k5773n3209j9261l7906l1081p5828K6078K0263P5812N8743
$$ 79423 87443 94786 69013 15804 -3457 -41363 -72444 -148272 -122194 -101931 -26119 32624
7002C2624M273R726l9612l89m0087k2581m6533l679J7655N8625N2285M8369M1111
$$ 32624 36897 46623 7011 6622 -33465 -56046 -102579 -106258 -88603 -29978 22307 70676 111787
6989A11787N475j2168m9965M183J6573P5558n9530j6747n0504M4233K9960n3932
$$ 111787 117262 105094 55129 59312 75885 151443 91913 75166 24662 68895 98855 44923
6977D4923j0830K1418p5912j6604R736L7735J6472o2178m6728J7315q297m002
$$ 44923 34093 55511 -20401 -37005 -27269 10466 26938 -35240 -81968 -64653 -72950 -76952
6965g6952O3655J916o4553j3074k0721L2621J9843P2570J1788k0598l8411R07
$$ -76952 -13297 -11381 -75934 -89008 -109729 -77108 -57265 15305 27093 6495 -31916 -31009
6953c1009P6131k3469m5652j6050O0193L2695M091J1115j2328k5106J1402o8029
$$ -31009 45122 21653 -23999 -40049 20144 52839 56930 68045 55717 30611 42013 -26016
6941b6016K318P7496K233m948N4943p3071q3293N8190l4405j5079K3433j4255
$$ -26016 -23698 53798 56031 51083 106026 32955 -50338 7852 -26553 -41632 -18199 -32454
6929c2454L2185L6551o1602j11245K646m2512j6082P1481Q6559K6200n310j4430
$$ -32454 -269 36282 -25320 -136565 -133919 -176431 -192513 -121032 -34473 -8273 -13583 -28013
6917b8013K4659J2453o6535p8633R478Q2974L8539J9523J06725j7038q1081j9177
$$ -28013 -3354 9099 -57436 -136069 -126591 -43617 -5078 14445 121170 104132 23051 3874
6905C874j8446p1181O6518P8110k271M5867m3855j9291j08644l9596K5557P2460
$$ 3874 -14572 -85753 -19235 58875 56604 102471 58616 39325 -69319 -108915 -83358 -10898
6893a0898n2778q0593k710M9713M3103O3329P0044l3541Q267O274j03115m3623
$$ -10898 -63676 -144269 -146979 -97266 -54163 9166 79210 45669 53936 60210 -42905 -86528
6881h6528P4541K9279o7415o6960N2669j858N4884M5902k6112N5558m6465k2836
$$ -86528 -11987 17292 -50123 -117083 -64414 -66272 -11388 34514 8402 63960 17495 -5341
6869e341j6991K9461m2176L9823M9284P140j818p3318n9753l483J6337J0421r66
$$ -5341 -22332 7129 -35047 4776 54060 61200 59382 -13936 -73689 -77172 -60835 -50414 -51380
6856e1380m3091k2583N6618M0312o7915m8405L2L8691R8165Q6119n1458j4039
$$ -51380 -94471 -117054 -60436 -20124 -88039 -136444 -136412 -97721 444 86563 35105 21066
6844B1066j8246p75j0504k8531p528K818N8411R0131M3695k1317p4253p0891j9181
$$ 21066 2820 2045 -8459 -36990 -44518 -41700 16711 106842 150537 129220 54967 -15924 -35105
6831c5105L151N0720K6636j08916m7632R0659J5844m0403o6658j25693Q133l533
$$ -35105 -31954 18766 45402 -63514 -111146 -20487 -4643 -45046 -111704 -237397 -229264 -232797
6819b32797K0845P0058Q2723l6794j6265L2485N598l8304L9099J05113N3844K9082
$$ -232797 -211952 -141894 -59171 -95965 -112230 -79745 -74147 -112451 -73352 31761 85605 114687
6807A14687m3350r3098o8303J8625N4306L1869N483q0413l1531o262N6030K6778
$$ 114687 71337 -21761 -90064 -71439 -17133 14736 20219 -60194 -91725 -97987 -41957 -15179
6795a5179j3141q289N6738n2777l6564L8418J8588K9182n9966q1374O0319P630
$$ -15179 -28320 -36609 20129 -32648 -69212 -30794 -12206 16976 -42990 -124364 -64045 -56415
6783e6415L5564P256J9228m4590N520N1188M3539M5940q9170j69907j14228Q600
$$ -56415 -20851 -13595 5633 -38957 -33437 17751 61290 107230 18060 -151847 -266075 -257475
6771b57475J16401R0210K652n6519k855K5435P155J7390J3005k4567J09013J1391
$$ -257475 -141074 -50864 -48212 -104731 -107586 -82151 -74996 -57606 -44601 -69168 39845 51236
6759E1236m5454J15413N5164k9607l6443l5885l4700O642J3712m8467n847Q4177
$$ 51236 5782 121195 176359 146752 110309 74424 39724 46366 60078 11611 5764 89941
6747H9941n6747j41804k6955L3796M5015r053p5623j6680M5092K3088n213J4626
$$ 89941 33194 -108610 -135565 -101769 -56754 -65807 -141430 -158110 -113018 -89930 -95143 -80517
6735h0517l8042r394O3587O435p6871K6717J12923q1145O139J27871O5336p3327
$$ -80517 -118559 -127953 -64366 -57931 -134802 -108085 4838 -76307 -70168 57703 123039 49712
6723D9712p7102L9173j1607j4671k842O4019Q971k3671K3645n7563p7702k5734
$$ 49712 -27390 11783 176 -14495 -17337 46682 55653 31982 55627 -1936 -79638 -105372
6711a05372M2034M7398L1356r1o2658q0184P5270J35318j93j6939m7008r0148
$$ -105372 -63338 -15940 15416 15325 -47333 -127517 -52247 83071 82878 65939 18931 -71217
6699g1217j4797K1880j5454O1931Q5165K2666n8046q6960j3570J05218K3062Q919
$$ -71217 -86014 -64134 -79588 -17657 67508 90174 32128 -54832 -68402 36816 59878 68797
6687F8797l4260k0726J5241L4144J3448l5163o5002M033k132o9229Q5354K3497
$$ 68797 34537 13811 29052 63196 76644 41481 -23521 -19488 -21620 -90849 -5495 18002
6675A8002o404L820n618N2815K3484o4741p0414j18532n469J3407l0100K5674
$$ 18002 11598 15418 9800 62615 86099 21358 -49056 -167588 -173057 -159650 -189750 -164076
6663a64076K4976M3513O0750Q4408K2574n3841m8956o95R2840K6962R604m2730
$$ -164076 -139100 -95587 -34837 49571 72145 18304 -30652 -31347 61493 88455 98059 55329
6651E5329j67510M0394Q3242J7316Q2891L4003J0805p3969k7235o1031J8912j22383
$$ 55329 -112181 -71787 11455 28771 111662 145665 156470 82501 55266 -5765 13147 -109236
6639a09236J2192J71113J31409O0628O6217J3304r6325l7811m5312p4158n3554
$$ -109236 -97044 74069 205478 266106 332323 345627 249302 211491 166179 92021 38467
6628C8467J3116M4107M7094J59519Q1350J00745J11544J83989K38131L98061O34043
$$ 38467 51583 95690 142784 302303 383653 484398 595942 779931 1018062 1416123 2050166
6617B050166J341464K242089K050044K64669r52263j314588j768628j470568q01654
$$ 2050166 3391630 5633719 7683763 7948432 6996169 5681581 3912953 2442385 1640731
6608A640731m41402k89960l33310j94519m3790p5506n1077m4219p9890m897j9913
$$ 1640731 1199329 909369 576059 381540 337750 262244 211167 166948 87058 82161 62248
6597F2248M3944P172Q59P4612O9332L575n5956j32451m5802K3275J5761k275j271
$$ 62248 106192 113364 114223 188835 258167 261742 205786 73335 27533 50808 66569 64294 63023
6584F3023j35Np8188m1734N6321p389J9445K5489L6751l2508o5609L0491K6028
$$ 63023 62888 62893 -15295 -57029 -708 -8097 11348 36837 73588 41080 -24529 5962 31990
6571C1990j5692O6731K5454j36547n1729j469M9621J03157P4135k8845p9142l086
$$ 31990 16298 83029 108483 -28064 -79793 -81262 -31641 71516 145651 116806 37664 34578
6559C4578j1913n8866K5990Q7063l3647K1852N6456J7860r1967K5713p38q9629
$$ 34578 22665 -36201 -10211 76852 43205 65057 121513 139373 47406 73119 72381 -17248
6547a7248k0122l2879J9447N4780k1596j6086O259O19N5322J2573M4801L5513
$$ -17248 -37370 -70249 -50802 3978 -17618 -33704 -27445 -26826 28496 41069 85870 121383
6535A21383K5662l4479m4897o8102k128R4738n641J5116N5847P965j9369k2436
$$ 121383 147045 112566 67669 -433 -2561 92177 86536 101652 157499 165464 146095 123659
6523A23659q6561p6687o5091R8329P6601p420m8838n068o3538Q3823l9929R381
$$ 123659 37098 -39589 -104680 -6351 70250 62830 13992 8924 -54614 29209 -10720 -1339
6511a339M8743N2138p9418l6644M3955k6098k5189j0888L8139O5508j5452p475
$$ -1339 47404 99542 20124 -16520 27435 1337 -23852 -34740 3399 68907 53455 45980
6499D5980J5568l7523n0964N5044P1066r4372j14620j5496n0116L526J01346P8321
$$ 45980 61548 24025 -26939 28105 99171 4799 -109821 -125317 -175433 -171907 -70561 7760
6487G760P0558J7837o7108q7651p4022k0121m1296N5263k1342k8293l8606N5593
$$ 7760 78318 96155 29047 -58604 -132626 -152747 -194043 -138780 -160122 -188415 -227021 -171428
6475a71428R2324n345m8805K1935l1439L2942O9426l4684q2741P8800L4868p078
$$ -171428 -79104 -84449 -133254 -111319 -142758 -109816 -40390 -75074 -157815 -79015 -44147 -51225
6463e1225L0038l4099J797M1080n2804j4184N0362P2029k8613J7117L9085o1904
$$ -51225 -21187 -55286 -53489 -12409 -65213 -79397 -29035 42994 14381 31498 70583 8679
6451H679m3688M195N1333l5150M6672P0228p2101o0495k2614k2733p736J4001
$$ 8679 -35009 -30814 20519 -14631 32041 102269 30168 -30327 -52941 -75674 -83410 -69409
6439f9409O5390M1206n7711o8583J8662P8236O0661M349p2687J0645m3788L909
$$ -69409 -4019 37187 -20524 -89107 -70445 7791 68452 72801 114 10759 -33029 -29120
6427b9120M5922p2558p2900j0462Q7456O3827j0194m676K4598R939N7139r0229
$$ -29120 16802 -55756 -128656 -139118 -51662 12165 1971 -2705 21893 31832 88971 -1258
6415a258o8006j6747L6821J22034J8679O122L15p5534k5028J0727J9640L5057
$$ -1258 -69264 -86011 -49190 72844 91523 97645 97960 22426 -2602 8125 27765 62822
6403F2822j8057J4954K3930n2527n4640O3908P1026K1271o3486M7314J7801j33011
$$ 62822 44765 59719 83649 31122 -23518 40390 111416 132687 69201 116515 134316 1305
6391A305j25885K8853M8988J43045J0549k8594o7606M3393J5380j08934k2024
$$ 1305 -124580 -95727 -46739 96306 106855 78261 10655 54048 69428 -39506 -61530
6380f1530P8653n9891n2508L2982k6070J7545L0751K6103Q4248K2767j8119J565
$$ -61530 17123 -42768 -95276 -62294 -88364 -70819 -40068 -13965 70283 93050 74931 76496
6368G6496M498l8603q2884p3925Q7061J860p9439o0559J8549L0231J44111M6454
$$ 76496 80994 42391 -40493 -114418 -27357 -25497 -104936 -165495 -146946 -116715 27396 73850
6356G3850m3303m3359M49j974O8753N6747N0617k3169m6837N5725J1950j02540
$$ 73850 30547 -12812 -12363 -14337 54416 111163 161780 138611 91774 147499 159449 56909
6344E6909o2733P3636K8200m4423p5855L2012M0367L2534n4731j3865K2993M2597
$$ 56909 -5824 67812 96012 51589 -24266 7746 48113 80647 25916 12051 35044 77641
6332G7641K9123L872q0161p5083p8174l4669M7557J02175P1693j0277m2354M8232
$$ 77641 106764 110636 30475 -44608 -122782 -157451 -109894 -7719 63974 53697 11343 59575
6320E9575L1342n2304n5034j0152J6015L8715K4496k8953n4847n568L6548K0016
$$ 59575 90917 38613 -16421 -26573 -10558 28157 52653 23700 -31147 -36715 -167 19849
6308A9849k3601q1849J9684L2887j3577o658J9186O1789q0415j6382O0422Q8168
$$ 19849 -3752 -85601 -65917 -33030 -46607 -53265 -34079 27710 -52705 -69087 -8665 79503
6296G9503J7108j15642o9387P5715m2943l60J05602R5782K611j45741m5784K9936
$$ 79503 96611 -19031 -88418 -12703 -55646 -56006 49596 145378 147989 2248 -43536 -13600
6284a3600M1258q5784J5255M4020k480j5192L5940J9279L7903p4784q3081J4540
$$ -13600 27658 -58126 -42871 1149 -1331 -16523 19417 38696 76599 1815 -81266 -66726
6272f6726J7691n026K0254J635N0551P7759j01848n8164M5066K2599j6673r6337
$$ -66726 -49035 -54061 -33807 -32172 18379 96138 -5710 -63874 -18808 3791 -12882 -109219
6260a09219j23L4384o358L4739K7191Q639n2027K4339L5777j7520P2910L7236
$$ -109219 -109342 -74958 -81316 -46577 -19386 -10747 -62774 -38435 -2658 -20178 52732 89968
6248H9968o4254J9256P129k9964k2135k2720j7956J4754M3042P390J3580j9345
$$ 89968 25714 44970 52099 22135 0 -22720 -40676 -25922 17120 24510 38090 18745
6236A8745k1185K4711J7674j8736l8206N7338L9464m1215q893j9168K1493j497
$$ 18745 -2440 22271 39945 21209 -16997 40341 79805 38590 29697 10529 32022 30525
$$ [...]
##END NTUPLES=NMR SPECTRUM
##END=
