##TITLE=Analysis number 315957
Compound Code jfd 01549
Book Reference 458/28
Project Code qc-cat
Chemist Name stevem
##JCAMPDX= 6.0         $$ Bruker NMR JCAMP-DX V2.0
##DATA TYPE= NMR SPECTRUM
##DATA CLASS= NTUPLES
##ORIGIN= Bruker BioSpin GmbH
##OWNER= NMR
$$ XWIN-NMR		Version 3.5
$$ Fri Dec  9 12:32:34 2005 GMT Standard Time (UT+0h)  MAYBRIDGE\NMR@NMR_250MHZ
##.OBSERVE FREQUENCY= 250.131544655141
##.OBSERVE NUCLEUS= ^1H
##.ACQUISITION MODE= SIMULTANEOUS (DQD)
##.ACQUISITION SCHEME= undefined
##.AVERAGES= 16
##.DIGITISER RES= 18
##SPECTROMETER/DATA SYSTEM= dpx250
##.PULSE SEQUENCE= zg30
##.SOLVENT NAME= DMSO
##.SHIFT REFERENCE= (INTERNAL, DMSO, 0, 16.522)
##AUDIT TRAIL= $$ (NUMBER, WHEN, WHO, WHERE, WHAT)
$$ ##TITLE= Audit trail, XWIN-NMR		Version 3.5
$$ ##JCAMPDX= 5.01
$$ ##ORIGIN= Bruker BioSpin GmbH
$$ ##OWNER= NMR
$$ C:\u/data/dgb/nmr/ADRS/13680/pdata/1/auditp.txt
$$ ##AUDIT TRAIL=  $$ (NUMBER, WHEN, WHO, WHERE, WHAT)
(   1,<2005-12-09 12:32:11.53 +000>,<MAYBRIDGE\NMR>,<NMR_250MHZ>,
      <created by zg, POWCHK disabled, PULCHK disabled
       configuration hash MD5:
       62 19 C7 07 E1 42 D1 B7 37 6C 3D D0 77 39 F9 E6
       data hash MD5: 64K
       5B 82 83 49 EC 5E E3 FA 4B 58 5E FA 38 93 59 C2>)
(   2,<2005-12-09 12:32:24.96 +000>,<MAYBRIDGE\NMR>,<NMR_250MHZ>,
      <Start of raw data processing
       ef LB = 0.3 FT_mod = 6 PKNL = 1 SI = 32K 
       data hash MD5: 32K
       3C 0A 73 0D D3 3D 38 5D 32 63 DD 02 BC 51 D2 83>)
(   3,<2005-12-09 12:32:26.85 +000>,<MAYBRIDGE\NMR>,<NMR_250MHZ>,
      <apk 
       data hash MD5: 32K
       07 C5 D0 F5 A1 96 19 87 EE AE DD 19 45 11 74 E3>)
(   4,<2005-12-09 12:32:27.68 +000>,<MAYBRIDGE\NMR>,<NMR_250MHZ>,
      <abs ABSG = 5 
       data hash MD5: 32K
       2D 21 E0 6F C8 50 EE F3 D9 33 5C 1A A7 87 25 77>)
$$ ##END=
$$ 
$$ hash MD5
$$ 44 40 06 B7 71 55 47 CF D2 57 A3 94 2E 64 B7 34
##$RELAX= 
##$RELAX= 
##$RELAX= 
##$RELAX= 
##$RELAX= 
##$RELAX= 
##$RELAX= 
$$ Bruker specific parameters
$$ --------------------------
##$DU= <C:\u>
##$EXPNO= 13680
##$NAME= <ADRS>
##$PROCNO= 1
##$TYPE= <nmr>
##$USER= <dgb>
##$AMP= (0..31)
100 100 100 100 100 100 100 100 100 100 100 100 100 100 100 100 100 100 
100 100 100 100 100 100 100 100 100 100 100 100 100 100 
##$AQSEQ= 0
##$AQ_mod= 3
##$AUNM= <au_zg>
##$AUTOPOS= <17 >
##$BF1= 250.13
##$BF2= 250.13
##$BF3= 250.13
##$BF4= 250.13
##$BF5= 500.13
##$BF6= 500.13
##$BF7= 500.13
##$BF8= 500.13
##$BYTORDA= 1
##$CFDGTYP= 0
##$CFRGTYP= 5
##$CHEMSTR= <none>
##$CNST= (0..31)
1 1 145 1 1 1 1 1 1 1 1 1 1 1 1 1 1 1 1 1 1 1 1 1 1 1 1 1 1 1 1 1 
##$CPDPRG= <>
##$CPDPRG1= <>
##$CPDPRG2= <>
##$CPDPRG3= <>
##$CPDPRG4= <mlev>
##$CPDPRG5= <mlev>
##$CPDPRG6= <mlev>
##$CPDPRG7= <mlev>
##$CPDPRG8= <mlev>
##$CPDPRGB= <>
##$CPDPRGT= <>
##$D= (0..31)
0 1 0 0 0 0 0 0 0 0.06 0 0 0 0 0 0 0.0002 0 0 0 0 0 0 0 0 0 0 0 0 0 0 
0 
##$DATE= 1134131530
##$DBL= (0..7)
120 120 120 120 120 120 120 120 
##$DBP= (0..7)
150 150 150 150 150 150 150 150 
##$DBP07= 0
##$DBPNAM0= <>
##$DBPNAM1= <>
$$ [...]
##$SUBNAM6= <"">
##$SUBNAM7= <"">
##$SUBNAM8= <"">
##$SUBNAM9= <"">
##$SW= 20.6930455092707
##$SWIBOX= (0..15)
0 0 3 0 0 0 0 0 0 0 0 0 0 0 0 0 
##$SW_h= 5175.983436853
##$TD= 65536
##$TD0= 1
##$TE= 294.16
##$TE2= 300
##$TE3= 300
##$TEG= 300
##$TL= (0..7)
0 120 120 120 120 120 120 120 
##$TP= (0..7)
150 150 150 150 150 150 150 150 
##$TP07= 0
##$TPNAME0= <>
##$TPNAME1= <>
##$TPNAME2= <>
##$TPNAME3= <>
##$TPNAME4= <>
##$TPNAME5= <>
##$TPNAME6= <>
##$TPNAME7= <>
##$TPOAL= (0..7)
0.5 0.5 0.5 0.5 0.5 0.5 0.5 0.5 
##$TPOFFS= (0..7)
0 0 0 0 0 0 0 0 
##$TUNHIN= 0
##$TUNHOUT= 0
##$TUNXOUT= 0
##$USERA1= <user>
##$USERA2= <user>
##$USERA3= <user>
##$USERA4= <user>
##$USERA5= <user>
##$V9= 5
##$VALIST= <valist>
##$VCLIST= <CCCCCCCCCCCCCCC>
##$VD= 0
##$VDLIST= <DDDDDDDDDDDDDDD>
##$VPLIST= <PPPPPPPPPPPPPPP>
##$VTLIST= <TTTTTTTTTTTTTTT>
##$WBST= 1024
##$WBSW= 4
##$XGAIN= (0..3)
0 0 0 0 
##$XL= 0
##$YL= 0
##$YMAX_a= 512706
##$YMIN_a= -426804
##$ZGOPTNS= <>
##$ZL1= 120
##$ZL2= 120
##$ZL3= 120
##$ZL4= 120
##$ABSF1= 16.522
##$ABSF2= -4.171173
##$ABSG= 5
##$ABSL= 3
##$ALPHA= 0
##$AQORDER= 0
##$ASSFAC= 0
##$ASSFACI= 0
##$ASSFACX= 0
##$ASSWID= 0
##$AUNMP= <proc_1d>
##$AZFE= 0.1
##$AZFW= 0.1
##$BCFW= 0
##$BC_mod= 0
##$BYTORDP= 0
##$COROFFS= 0
##$CY= 12.5
##$DATMOD= 1
##$DC= 0
##$DFILT= <>
##$DTYPP= 0
##$F1P= 14.0000005364418
##$F2P= -0.99999901652339
##$FCOR= 0.5
##$FTSIZE= 32768
##$FT_mod= 6
##$GAMMA= 0
##$GB= 0
##$INTBC= 1
##$INTSCL= 1
##$ISEN= 128
##$LB= 0.3
##$LEV0= 0
##$LPBIN= 0
##$MAXI= 10000
##$MC2= 0
##$MEAN= 0
##$ME_mod= 0
##$MI= 0
##$NCOEF= 0
##$NC_proc= -3
##$NLEV= 6
##$NOISF1= 0
##$NOISF2= 0
##$NSP= 0
##$NTH_PI= 0
##$NZP= 0
##$OFFSET= 16.522
##$PC= 1
##$PHC0= 72.03359
##$PHC1= 5.9551
##$PH_mod= 1
##$PKNL= yes
##$PPARMOD= 0
##$PSCAL= 4
##$PSIGN= 0
##$REVERSE= no
##$SF= 250.13
##$SI= 32768
##$SIGF1= 0
##$SIGF2= 0
##$SINO= 400
##$SIOLD= 32768
##$SREGLST= <1H.DMSO>
##$SSB= 0
##$STSI= 32768
##$STSR= 0
##$SW_p= 5175.98343685301
##$SYMM= 0
##$S_DEV= 0
##$TDeff= 65536
##$TDoff= 0
##$TI= <Analysis number 999999
Compound Code 99
Book Reference 9
Project Code 9>
##$TILT= no
##$TM1= 0
##$TM2= 0
##$TOPLEV= 0
##$USERP1= <user>
##$USERP2= <user>
##$USERP3= <user>
##$USERP4= <user>
##$USERP5= <user>
##$WDW= 1
##$XDIM= 32768
##$YMAX_p= 449387071
##$YMIN_p= -210874
$$ End of Bruker specific parameters
$$ ---------------------------------
##NTUPLES= NMR SPECTRUM
##VAR_NAME=  FREQUENCY,     SPECTRUM/REAL,   SPECTRUM/IMAG
##SYMBOL=    X,             R,               I
##VAR_TYPE=  INDEPENDENT,   DEPENDENT,       DEPENDENT
##VAR_FORM=  AFFN,          ASDF,            ASDF
##VAR_DIM=   32768,         32768,           32768
##UNITS=     HZ,            ARBITRARY UNITS, ARBITRARY UNITS
##FACTOR=    0.157963299565203, 1,           1
##FIRST=     4132.6476996994, 0,             0
##LAST=      -1043.33573715361, 0,           0
##MIN=       -1043.33573715361, -210874,     0
##MAX=       4132.6476996994, 449387071,     0
$$ Real data points
##PAGE= N=1
##DATA TABLE= (X++(R..R)), XYDATA
$$ [...]
##PAGE= N=2
##DATA TABLE= (X++(I..I)), XYDATA
18693 17265911 17460839 17626357 17759128 17919947 18066786 18201785 18351190 18447614 18597086
18684 18597086 18808279 19031383 19249809 19494430 19703922 19920377 20152970 20371014 20562448
18675 20562448 20815435 21152705 21484851 21857175 22261530 22661921 23080529 23506760 24014818
18666 24014818 24579845 25068204 25313594 24949023 24081281 23695303 23943488 24326428 24777851
18657 24777851 25326039 25569399 25125735 24288862 23041062 21794469 21496834 22010764 22826846
18648 22826846 23567096 24357646 25157792 25947374 26626019 27080906 27213497 26933111 26668470
18639 26668470 26993053 27717296 28512214 29357615 30160670 30957560 31786143 32663745 33536063
18630 33536063 34268619 34565010 34490374 34719763 35407029 36373433 37596440 39035208 40507708
18621 40507708 41812229 42682663 42973748 42418287 41425597 41132440 41827004 43195699 44887666
18612 44887666 47107789 50047789 53406113 56680291 59239210 60355140 60398562 58769943
18604 58769943 52628994 44210680 41222304 43024457 44673196 44371551 43286100 40074010
18596 40074010 35405599 34387412 37733005 43236094 49425290 55682790 61697783 66781466
18588 66781466 69288947 67505812 63194506 58915674 55649289 53445670 52285522 53716495
18580 53716495 59058059 67047859 77018167 88986643 102910711 118659258 135797029
18573 135797029 152771301 165663415 167307855 150268831 116539787 74324053 24769446
18566 24769446 -28509668 -76547088 -115044926 -139050113 -149790568 -153700693 -149477059
18559 -149477059 -137819188 -123912212 -111025822 -99899401 -90348699 -82124893 -74909018
18552 -74909018 -68444815 -62531607 -57006137 -51796097 -46817642 -42028843 -37331527 -32662323
18544 -32662323 -27973871 -23503609 -19906458 -18563086 -20502223 -24611255 -28382305 -29550206
18536 -29550206 -28689239 -29654935 -34967012 -40275031 -40441508 -37043503 -33541979 -32675427 -34567552
18527 -34567552 -35385897 -34982042 -35591892 -37441985 -41468231 -47495771 -50449363 -49034856
18519 -49034856 -45795288 -42424788 -39256488 -36207160 -33373587 -30832688 -28665451 -27164177
18511 -27164177 -26766695 -27694031 -28594268 -28189550 -27123284 -26575167 -27435997 -30224475 -32844698
18502 -32844698 -32917099 -31247672 -29176137 -27119233 -25124570 -23150458 -21178879 -19315471
18494 -19315471 -17811833 -17098873 -17972718 -20537591 -22829644 -23948112 -24378131 -23802068 -22243084
18485 -22243084 -20334110 -18680089 -17905249 -18870167 -21553849 -24395568 -25521954 -25519272 -26350580
18476 -26350580 -28826943 -30860740 -30765089 -29377384 -27699957 -26152765 -24844767 -23849270
18468 -23849270 -23470052 -24056577 -24746501 -24425834 -23516829 -22467520 -21428802 -20420198 -19551323
18459 -19551323 -18939894 -18745132 -19149144 -19917335 -20828807 -21563580 -21531582 -20846037 -19875700
18450 -19875700 -18825385 -17821028 -17047940 -16966406 -17984756 -19563513 -20671713 -21745158
18442 -21745158 -22504649 -22328171 -21654077 -20891898 -20206628 -19570120 -19045596 -18586638 -18207589
18433 -18207589 -17865737 -17476160 -17133564 -17000572 -17449251 -18550579 -19458243 -19569397 -19213012
18424 -19213012 -18731451 -18294643 -17868486 -17511055 -17190631 -16896022 -16644534 -16387858 -16184577
18415 -16184577 -16000726 -15811556 -15621527 -15408058 -15207313 -14990125 -14775935 -14623546 -14522523
18406 -14522523 -14491583 -14517136 -14438329 -14281189 -14082089 -13888639 -13687182 -13490570 -13327600 -13201472
18396 -13201472 -13168148 -13186773 -13228819 -13195660 -13090908 -12973365 -12876027 -12824957 -12797249 -12770974 -12650850
18385 -12650850 -12531787 -12438048 -12396102 -12331795 -12202493 -12095050 -11979383 -11897662 -11848946 -11789898
18375 -11789898 -11701165 -11617882 -11545934 -11484098 -11417291 -11370999 -11319926 -11236412 -11142015 -11069849 -11013965
18364 -11013965 -10952352 -10868601 -10772725 -10686709 -10634396 -10576540 -10501068 -10412068 -10332210 -10274142 -10232746
18353 -10232746 -10174116 -10126441 -10051089 -9969467 -9929517 -9857219 -9823657 -9840583 -9839967 -9804604 -9798457 -9807355
18341 -9807355 -9771014 -9718371 -9659793 -9588588 -9526497 -9486835 -9460001 -9449609 -9441800 -9421620 -9393987
18330 -9393987 -9383204 -9350192 -9321075 -9282236 -9229880 -9172705 -9094960 -9000543 -8928276 -8870882 -8790890
18319 -8790890 -8721952 -8640349 -8544346 -8483778 -8422637 -8367257 -8356468 -8343075 -8270385 -8232725 -8204057
18308 -8204057 -8135414 -8072884 -8032176 -7985273 -7921895 -7851639 -7782083 -7697438 -7629037 -7591401 -7583048
18297 -7583048 -7649866 -7718649 -7728874 -7677564 -7615367 -7631603 -7706628 -7774664 -7824703 -7835951 -7817623
18286 -7817623 -7770843 -7695140 -7648545 -7637423 -7673645 -7746282 -7893169 -7970608 -8014115 -8019677 -7997395
18275 -7997395 -7903209 -7814358 -7727123 -7663782 -7604281 -7516036 -7431007 -7399288 -7336014 -7269254 -7209644
18264 -7209644 -7170747 -7151714 -7145978 -7165322 -7151879 -7117497 -7092673 -7071288 -7030373 -7016194 -6992058
18253 -6992058 -6949384 -6918988 -6873951 -6834246 -6800394 -6753745 -6728302 -6729128 -6745342 -6720239 -6662905 -6626194
18241 -6626194 -6593968 -6557739 -6519547 -6523153 -6545296 -6586945 -6609355 -6659067 -6671110 -6684532 -6665880
18230 -6665880 -6657843 -6670580 -6700871 -6703016 -6681805 -6664525 -6623989 -6567654 -6504125 -6460683 -6415177 -6377159
18218 -6377159 -6325916 -6309215 -6287258 -6242365 -6218584 -6212511 -6231692 -6234753 -6207330 -6174916 -6156024 -6105437
18206 -6105437 -6041157 -6017359 -5991927 -5964017 -5918647 -5871719 -5885450 -5898030 -5896577 -5874838 -5830894
18195 -5830894 -5796405 -5765931 -5783857 -5780846 -5726172 -5674774 -5646370 -5657772 -5632980 -5618292 -5615365 -5620084
18183 -5620084 -5600560 -5567679 -5534517 -5518964 -5492627 -5461056 -5461740 -5473573 -5453236 -5405155 -5358577 -5326101
18171 -5326101 -5332056 -5318754 -5262661 -5225317 -5225922 -5226671 -5251760 -5266066 -5234897 -5202056 -5201265 -5175236 -5146847
18158 -5146847 -5144978 -5136892 -5098518 -5051603 -5028387 -4998448 -4998830 -5018930 -4991912 -4974218 -4944072 -4944167 -4931780
18145 -4931780 -4909058 -4890147 -4868966 -4849693 -4851858 -4857530 -4842111 -4848440 -4829293 -4791168 -4770348 -4741719
18133 -4741719 -4705555 -4691368 -4656486 -4627162 -4587682 -4586491 -4607835 -4628808 -4649825 -4659182 -4646037 -4649248
18121 -4649248 -4694050 -4688769 -4651765 -4636608 -4628831 -4617994 -4601739 -4551414 -4529974 -4497468 -4469856 -4472211
18109 -4472211 -4438525 -4437642 -4425424 -4421482 -4412401 -4434936 -4429716 -4401048 -4368244 -4339400 -4304549 -4227834
18097 -4227834 -4204144 -4234882 -4238209 -4226307 -4194928 -4163523 -4128215 -4103944 -4063865 -4045125 -4035250 -4015147
18085 -4015147 -4010905 -3992076 -3986589 -4005122 -4035601 -4039670 -4052381 -4036192 -4018240 -3981451 -3966819 -3941463
18073 -3941463 -3979001 -4047588 -4125462 -4182277 -4142780 -4078038 -4026486 -3984477 -3983082 -4020451 -4035894
18062 -4035894 -4048614 -4089695 -4128038 -4134596 -4174095 -4207935 -4207502 -4168355 -4167963 -4137247 -4125658 -4103306
18050 -4103306 -4073443 -4087021 -4090065 -4064481 -4012607 -3992493 -4001680 -3991402 -3994946 -3961303 -3879384 -3842057
18038 -3842057 -3813819 -3798374 -3785742 -3752629 -3724225 -3689382 -3652024 -3628482 -3639899 -3702862 -3753044
18027 -3753044 -3781763 -3803867 -3794180 -3755307 -3739790 -3725519 -3753081 -3772988 -3790477 -3803958 -3852728
18016 -3852728 -3851800 -3827370 -3810429 -3803262 -3783118 -3764395 -3754475 -3760558 -3782453 -3787919 -3778134 -3792829 -3769554
18003 -3769554 -3717220 -3643802 -3637866 -3630027 -3679089 -3665801 -3650493 -3642723 -3649234 -3627031 -3613587 -3618994
17991 -3618994 -3620137 -3608589 -3608103 -3610737 -3611872 -3623202 -3577077 -3524829 -3562503 -3562341 -3522476 -3506172 -3487436
17978 -3487436 -3457422 -3459284 -3487787 -3483158 -3518816 -3528897 -3508727 -3487164 -3478830 -3488057 -3491442 -3487790
17966 -3487790 -3440560 -3439489 -3449743 -3449595 -3460618 -3456232 -3432326 -3393848 -3378049 -3369831 -3311056 -3287167
17954 -3287167 -3280105 -3283393 -3296000 -3318546 -3308026 -3294966 -3299344 -3299899 -3304106 -3272853 -3260455 -3278325
17942 -3278325 -3277218 -3221171 -3200856 -3182568 -3222807 -3223592 -3203966 -3162780 -3173047 -3178534 -3202970 -3222129
17930 -3222129 -3219195 -3200834 -3182729 -3202119 -3152562 -3144389 -3132423 -3111891 -3139919 -3096319 -3084546 -3117484
17918 -3117484 -3139009 -3151734 -3131645 -3086769 -3090351 -3089279 -3093052 -3076241 -3053409 -3024611 -3032901 -3034219
17906 -3034219 -3038531 -3018599 -2991004 -2973855 -2989049 -2992757 -2986285 -2974629 -2956629 -2962331 -2957843 -2965590
17894 -2965590 -2966307 -2942504 -2928554 -2969328 -2968065 -2948804 -2930980 -2928276 -2930054 -2929676 -2892482 -2877368 -2890824
17881 -2890824 -2889800 -2862267 -2841452 -2855596 -2882357 -2878638 -2860624 -2816196 -2813030 -2827362 -2840994 -2872288
17869 -2872288 -2873918 -2854791 -2854152 -2803364 -2754229 -2740806 -2743669 -2786182 -2782237 -2737491 -2726496 -2740387
17857 -2740387 -2753617 -2746029 -2701138 -2691004 -2715107 -2722883 -2717621 -2734586 -2761100 -2741525 -2734917 -2721776
17845 -2721776 -2669223 -2655705 -2690932 -2689538 -2671502 -2676337 -2689840 -2713213 -2677679 -2665895 -2659899 -2664454
17833 -2664454 -2691902 -2694944 -2680957 -2661364 -2634943 -2618458 -2591507 -2581502 -2599113 -2604198 -2592011 -2610372
17821 -2610372 -2625583 -2609576 -2626214 -2620903 -2612842 -2621974 -2625796 -2623755 -2588348 -2544044 -2501330 -2487134
17809 -2487134 -2517016 -2515181 -2519054 -2507327 -2497370 -2482032 -2468654 -2452835 -2443392 -2460429 -2435584 -2441520
17797 -2441520 -2446053 -2466186 -2467434 -2509969 -2500023 -2476547 -2464739 -2482304 -2482543 -2478985 -2444374 -2416119
17785 -2416119 -2376125 -2398992 -2394969 -2414445 -2452036 -2450444 -2430247 -2440435 -2425087 -2391530 -2374519 -2392884
17773 -2392884 -2421876 -2418755 -2400809 -2391777 -2404809 -2386439 -2381006 -2358155 -2330894 -2327074 -2342071 -2356223
17761 -2356223 -2329974 -2308565 -2318745 -2307616 -2283104 -2291962 -2304969 -2311744 -2271683 -2270199 -2302885 -2318743
17749 -2318743 -2315835 -2306081 -2300607 -2300371 -2314115 -2313257 -2305572 -2282603 -2274956 -2251466 -2264992 -2269715 -2274962
17736 -2274962 -2287400 -2295955 -2256686 -2246057 -2254024 -2255642 -2256763 -2269426 -2218260 -2197426 -2200081 -2183059
17724 -2183059 -2171580 -2172990 -2162386 -2173292 -2138575 -2138308 -2141742 -2190049 -2184673 -2170053 -2155981 -2147589
17712 -2147589 -2167551 -2158687 -2143071 -2131155 -2114192 -2113719 -2151197 -2181205 -2166948 -2132169 -2097376 -2089621
17700 -2089621 -2103881 -2140560 -2141748 -2140050 -2141167 -2139697 -2129760 -2092773 -2096798 -2102845 -2085629 -2094648 -2112985
17687 -2112985 -2102474 -2102740 -2099770 -2102846 -2121407 -2081424 -2047585 -2052139 -2046050 -2055078 -2056332 -2034977 -2019471
17674 -2019471 -2052833 -2094177 -2093072 -2068957 -2036240 -2052516 -2033820 -2004991 -1967273 -1971638 -2018816 -2018509
17662 -2018509 -1967070 -1941723 -1946667 -1954678 -1942581 -1936148 -1919640 -1937874 -1992963 -1989539 -1968158 -1974886
17650 -1974886 -1979967 -1961566 -1954039 -1959234 -1933650 -1946224 -1955006 -1973778 -1991851 -2007083 -2002685 -1969944
17638 -1969944 -1906622 -1882049 -1869665 -1873407 -1888205 -1893333 -1880727 -1883047 -1881215 -1865181 -1847788 -1851774
17626 -1851774 -1854786 -1855923 -1853190 -1874657 -1875830 -1861311 -1844114 -1849766 -1874076 -1881214 -1850255 -1836354
17614 -1836354 -1832347 -1865230 -1878050 -1871109 -1888251 -1910890 -1853239 -1827447 -1859708 -1853302 -1849700 -1840200
17602 -1840200 -1830070 -1827721 -1831428 -1800663 -1808095 -1841700 -1848324 -1837406 -1843790 -1850719 -1863733 -1852765
17590 -1852765 -1838849 -1838090 -1826241 -1804935 -1802549 -1802090 -1802121 -1795606 -1776818 -1768034 -1743160 -1770653 -1780221
17577 -1780221 -1769158 -1770394 -1764595 -1754109 -1767939 -1817978 -1833935 -1841397 -1804232 -1755610 -1710371 -1709935
17565 -1709935 -1709475 -1687936 -1682503 -1715306 -1722686 -1735791 -1756003 -1765942 -1755637 -1773879 -1761145 -1746482
17553 -1746482 -1759554 -1748269 -1756027 -1753085 -1743581 -1744801 -1748657 -1732738 -1695643 -1703808 -1707740 -1674901 -1662633
17540 -1662633 -1667730 -1671091 -1697323 -1731037 -1720382 -1674730 -1671097 -1681458 -1663511 -1623813 -1621624 -1647980
17528 -1647980 -1662782 -1672881 -1661318 -1661306 -1655760 -1668138 -1694925 -1695629 -1682364 -1661124 -1664080 -1695161 -1707249
17515 -1707249 -1715975 -1687079 -1633732 -1594168 -1565809 -1570583 -1597652 -1604683 -1588325 -1591216 -1595209 -1595728 -1635252
17502 -1635252 -1632571 -1619298 -1595848 -1583636 -1588761 -1572833 -1565305 -1604683 -1593281 -1585343 -1618172 -1642043
17490 -1642043 -1612152 -1584438 -1539045 -1530300 -1568642 -1576327 -1575916 -1554892 -1529048 -1486199 -1492621 -1529488
17478 -1529488 -1551061 -1552884 -1531982 -1520448 -1511378 -1524488 -1488234 -1482418 -1494502 -1490597 -1469484 -1469718
17466 -1469718 -1503665 -1504084 -1506035 -1467365 -1469958 -1505844 -1543826 -1540368 -1506438 -1499043 -1509020 -1512390 -1500839
17453 -1500839 -1517150 -1503239 -1462404 -1468103 -1487177 -1459759 -1460042 -1468537 -1468926 -1443479 -1443277 -1477259 -1496564
17440 -1496564 -1525485 -1534714 -1497835 -1466323 -1482998 -1483419 -1476306 -1485357 -1513023 -1484095 -1496608 -1490316
17428 -1490316 -1484473 -1463345 -1459951 -1451317 -1446743 -1437211 -1416731 -1409100 -1412520 -1414809 -1455327 -1470315 -1490255
17415 -1490255 -1505727 -1519280 -1519822 -1482260 -1491192 -1461339 -1434503 -1440869 -1450161 -1449796 -1466924 -1440231 -1423377
17402 -1423377 -1418043 -1385401 -1399017 -1432226 -1436729 -1425910 -1430806 -1442836 -1415937 -1409319 -1418026 -1426484
17390 -1426484 -1440425 -1414287 -1419428 -1422500 -1429903 -1421863 -1382536 -1392411 -1416671 -1409633 -1396289 -1407985
17378 -1407985 -1419942 -1407756 -1368308 -1335134 -1344562 -1371311 -1342460 -1314497 -1290939 -1303627 -1320594
17367 -1320594 -1312561 -1321235 -1311078 -1305892 -1333546 -1316411 -1289783 -1308678 -1355162 -1360291 -1376022 -1356345
17355 -1356345 -1348570 -1327087 -1319707 -1312202 -1296531 -1276695 -1262313 -1273483 -1250579 -1243553 -1254170 -1262156
17343 -1262156 -1280970 -1275753 -1259926 -1278676 -1278956 -1298448 -1308403 -1295794 -1279080 -1263074 -1261367 -1263154
17331 -1263154 -1257026 -1266666 -1246499 -1238894 -1244097 -1251979 -1226107 -1215784 -1203787 -1244611 -1287402 -1300101
17319 -1300101 -1258833 -1230921 -1230994 -1263199 -1279569 -1271403 -1256546 -1218456 -1235747 -1288737 -1269768 -1258993
17307 -1258993 -1239302 -1230998 -1230032 -1235424 -1228987 -1210816 -1184522 -1154757 -1147939 -1185202 -1198962 -1216592
17295 -1216592 -1233368 -1247584 -1260973 -1263465 -1227255 -1214123 -1238786 -1264972 -1272122 -1229553 -1213970 -1211882
17283 -1211882 -1206776 -1195635 -1236881 -1280850 -1281056 -1240211 -1215194 -1196218 -1174565 -1190307 -1208370 -1202073
17271 -1202073 -1162476 -1152321 -1181524 -1179664 -1181012 -1201619 -1249751 -1304248 -1296276 -1258233 -1266605 -1293062
17259 -1293062 -1286966 -1265247 -1212466 -1210217 -1215669 -1236764 -1205379 -1181246 -1178469 -1190472 -1189358 -1217584
17247 -1217584 -1228557 -1213757 -1229498 -1228861 -1227679 -1198776 -1199814 -1199915 -1165105 -1128025 -1119430 -1096473 -1090606
17234 -1090606 -1113508 -1125788 -1122571 -1160877 -1172541 -1146095 -1150871 -1145860 -1146712 -1140190 -1089120 -1068815
17222 -1068815 -1065514 -1103524 -1138458 -1147579 -1143975 -1150684 -1138318 -1146421 -1180112 -1171847 -1148023 -1163162
17210 -1163162 -1164564 -1120474 -1090526 -1070799 -1100248 -1120612 -1120581 -1110216 -1099647 -1088739 -1084572 -1080640
17198 -1080640 -1080374 -1074102 -1045482 -1016591 -1025314 -1057280 -1064929 -1076454 -1098741 -1081997 -1062080 -1033681
17186 -1033681 -1022943 -1032874 -1057716 -1078089 -1103842 -1113841 -1075140 -1038533 -1045925 -1020525 -997356 -982246
17174 -982246 -998459 -1009581 -1029767 -1068346 -1074971 -1041078 -1024764 -1016889 -1002637 -1010241 -1023711 -1028794
17162 -1028794 -1029515 -1063924 -1083039 -1075584 -1081362 -1122238 -1157973 -1124487 -1094322 -1088178 -1097019 -1070826
17150 -1070826 -1069780 -1109583 -1086639 -1062977 -1038619 -1055327 -1059795 -1072731 -1044229 -1018548 -1009403 -1029799
17138 -1029799 -1024070 -1002450 -981575 -985361 -998224 -1034521 -1065672 -1072781 -1067577 -1037796 -1052906 -1037056
17126 -1037056 -1010640 -990323 -1021687 -1017182 -1011488 -1020366 -1031516 -985266 -980369 -988125 -983508 -987085 -977092
17113 -977092 -966930 -951328 -957435 -963692 -950652 -963913 -959574 -950323 -937902 -937672 -987081 -1025145 -1041241
17100 -1041241 -1036596 -1015111 -980673 -957005 -974191 -953953 -960279 -951822 -983942 -983097 -1012381 -979302
17088 -979302 -927192 -932352 -924888 -920248 -940420 -933050 -919360 -959578 -969267 -935796 -941300 -957266 -943674
17075 -943674 -955008 -960151 -951039 -937878 -936594 -938328 -946994 -968324 -986283 -951211 -946978 -971141 -983377
17062 -983377 -971581 -969252 -971476 -932044 -945086 -963796 -988640 -983579 -970999 -989944 -967708 -958466
17050 -958466 -935312 -894837 -852473 -896531 -937010 -974823 -974979 -946428 -923466 -886044 -858563 -865043
17038 -865043 -868391 -882816 -913937 -904509 -898134 -894710 -897915 -876125 -881187 -871985 -881950 -904727 -894869
17025 -894869 -866548 -850547 -845894 -856050 -875762 -860991 -837597 -850085 -832490 -891275 -913064 -913933
17013 -913933 -931769 -933367 -921704 -885223 -851328 -829886 -828151 -855062 -875008 -865559 -844031 -828450
17001 -828450 -830383 -832789 -889113 -911658 -906795 -885889 -881384 -923368 -939565 -932147 -904070 -895599 -929125
16988 -929125 -955783 -970703 -941530 -918772 -898095 -894844 -876456 -893677 -887211 -868187 -844834 -877540
16976 -877540 -861098 -838643 -865429 -904247 -892619 -867860 -875959 -852637 -858425 -816810 -819197 -819192 -836889
16963 -836889 -862662 -866872 -842246 -829278 -826799 -828226 -825586 -819033 -832115 -834897 -825986 -810829 -813037
16950 -813037 -830460 -822200 -820201 -854565 -839023 -837143 -824779 -800921 -791240 -792568 -797831 -814836 -816262
16937 -816262 -812510 -783868 -797546 -808639 -817420 -842767 -831978 -834281 -821052 -801606 -817377 -828849
16925 -828849 -809039 -790515 -802003 -798251 -758630 -729319 -722116 -755638 -786137 -808304 -843091 -826051
16913 -826051 -845930 -882431 -847120 -814832 -768120 -779895 -804626 -815869 -797061 -799827 -779616 -767991
16901 -767991 -761009 -737266 -731592 -766135 -794205 -845484 -849775 -842006 -833077 -813493 -783210 -772312
16889 -772312 -766439 -768627 -766295 -794354 -831911 -866675 -850636 -811363 -779741 -754751 -726306 -723561
16877 -723561 -765503 -787650 -782862 -760953 -756667 -754446 -751536 -767367 -744369 -711200 -724909 -749269
16865 -749269 -724145 -680034 -703634 -701076 -718115 -707822 -678998 -682994 -696491 -717737 -746038 -757064
16853 -757064 -739528 -737746 -773794 -752821 -750294 -760224 -732831 -719731 -709616 -699203 -700677 -713565
16841 -713565 -715370 -719748 -706403 -682369 -703478 -700767 -702329 -726118 -736091 -731677 -745141 -757778 -768254
16828 -768254 -752275 -743238 -718771 -730613 -779072 -797700 -760054 -757687 -731233 -705082 -697179 -707940
16816 -707940 -707739 -691912 -698554 -705202 -702723 -715484 -708150 -717492 -748087 -758131 -726137 -728655 -707638
16803 -707638 -669575 -665042 -649532 -681585 -688111 -661604 -655818 -636113 -633114 -640771 -639751 -639411 -663435
16790 -663435 -688161 -679529 -697750 -729508 -756597 -745414 -729727 -715241 -722487 -740516 -749255 -713949
16778 -713949 -708974 -702770 -681991 -671610 -680585 -676937 -676128 -677291 -694588 -690839 -677610 -679105 -687203
16765 -687203 -677375 -670429 -680897 -662578 -683491 -683812 -650099 -646177 -637312 -657336 -653531 -661806 -647296
16752 -647296 -647221 -646662 -649482 -641768 -622840 -624539 -635271 -648039 -632926 -651749 -634399 -633337 -639502
16739 -639502 -615250 -616397 -653982 -668396 -662213 -702933 -713021 -695413 -705092 -695412 -643403 -621381
16727 -621381 -632721 -630297 -627482 -645550 -631421 -597139 -622241 -624542 -602741 -609623 -616665 -626779
16715 -626779 -625997 -606411 -602272 -631698 -629463 -646579 -641505 -633748 -634646 -682666 -686062 -655464 -645318
16702 -645318 -647600 -655415 -672733 -684015 -657556 -629245 -605957 -594232 -600407 -583914 -584218 -609869
16690 -609869 -608509 -635420 -644226 -653708 -683066 -686183 -654809 -634882 -638733 -621304 -605903 -595677
16678 -595677 -593250 -609416 -629102 -624188 -597185 -598117 -595840 -592224 -594504 -607256 -562504 -555765 -532859
16665 -532859 -529068 -548049 -533096 -557293 -589284 -603102 -623593 -659095 -650507 -631659 -608429 -587150
16653 -587150 -588071 -591153 -604549 -559597 -534030 -550109 -563378 -558029 -584136 -578598 -589709 -601415
16641 -601415 -613138 -601730 -592324 -565033 -541607 -523805 -537068 -535380 -512276 -524756 -552694 -571132
16629 -571132 -582480 -551030 -524225 -535177 -556048 -584551 -589659 -556026 -527883 -526723 -552760 -607627
16617 -607627 -574953 -563432 -573974 -574623 -569034 -565018 -559538 -548310 -516741 -523680 -547156 -529957 -521699
16604 -521699 -538674 -521778 -528499 -500704 -498332 -549364 -551262 -531055 -505278 -493386 -512901 -505395
16592 -505395 -540147 -539179 -522048 -497993 -488867 -489800 -496654 -524870 -560905 -557375 -528952 -527605 -516101
16579 -516101 -503517 -513667 -532675 -549084 -553553 -525660 -522194 -524826 -531978 -545099 -563298 -536129
16567 -536129 -525040 -490340 -500646 -539541 -548945 -506697 -488503 -521127 -541641 -557665 -560284 -546805
16555 -546805 -566219 -585373 -576691 -540717 -511545 -474147 -501197 -514624 -519289 -485236 -479181 -479428
16543 -479428 -489964 -495678 -489786 -513538 -543298 -535486 -527641 -505870 -507071 -552648 -525355 -497604
16531 -497604 -483180 -462119 -456290 -443293 -464770 -481387 -493327 -489749 -498118 -481471 -494002 -495118
16519 -495118 -500673 -495555 -491365 -482101 -481608 -473762 -482122 -494611 -523198 -516390 -525071 -499710 -513528
16506 -513528 -490422 -492400 -531385 -532499 -533280 -483255 -441531 -445382 -439257 -404751 -451146 -485481 -472925
16493 -472925 -501790 -537238 -509226 -479966 -484802 -493710 -498998 -476757 -505213 -528394 -552746 -547987
16481 -547987 -525858 -508986 -494875 -473219 -460175 -485182 -520724 -507055 -480028 -477231 -460077 -439192
16469 -439192 -472765 -479283 -492029 -472134 -435361 -420413 -424762 -464634 -464961 -459812 -467600 -479505 -477071
16456 -477071 -478272 -454057 -466759 -471826 -438928 -437183 -461057 -475667 -445355 -423387 -431700 -424695
16444 -424695 -380249 -369041 -420889 -440019 -406280 -383575 -387048 -399684 -432066 -441245 -424356 -387347
16432 -387347 -388169 -371488 -399406 -434236 -427988 -414702 -419355 -440099 -462956 -454938 -453820 -406808 -399703
16419 -399703 -416968 -424822 -436941 -450128 -448357 -450460 -423939 -399084 -408278 -404630 -393117 -380130
16407 -380130 -418937 -415848 -406178 -393990 -377390 -377843 -355578 -346249 -367231 -406284 -427202 -450995
16395 -450995 -463780 -438900 -439585 -438014 -435315 -424862 -419392 -391286 -408187 -443803 -425315 -409329
16383 -409329 -409058 -398405 -412150 -424817 -399067 -390037 -395991 -382924 -367871 -343972 -342199 -378299
16371 -378299 -399691 -435359 -422783 -420049 -401350 -403001 -403095 -383815 -387716 -420372 -422909 -432513 -422498
16358 -422498 -430985 -436014 -433496 -428471 -406616 -405032 -419437 -428975 -405690 -391108 -395091 -409055 -379549
16345 -379549 -374073 -399208 -419847 -417166 -427448 -469857 -476160 -427612 -409983 -418041 -415103 -397692
16333 -397692 -365177 -368572 -382094 -408780 -390287 -375031 -398094 -396576 -378492 -376828 -384379 -398950
16321 -398950 -398171 -374455 -368701 -339107 -318498 -345059 -358400 -369604 -366826 -382077 -408824 -405140
16309 -405140 -412755 -377875 -337709 -351097 -364138 -367246 -361044 -357472 -329382 -341936 -354538 -384435
16297 -384435 -366891 -359122 -355965 -344316 -328241 -318449 -328566 -363302 -380542 -364561 -339351 -324863
16285 -324863 -301389 -286259 -302046 -362510 -364400 -374120 -374928 -357765 -344175 -336184 -339481 -329333 -312950
16272 -312950 -323916 -351317 -383555 -401395 -395490 -371809 -349203 -377697 -393732 -375262 -375567 -374691
16260 -374691 -365632 -348520 -339959 -285059 -300148 -314023 -334109 -317732 -312414 -320673 -310900 -298281
16248 -298281 -304412 -299532 -320401 -327335 -301403 -273526 -283129 -256247 -272934 -298816 -306651 -316860
16236 -316860 -315840 -305938 -303087 -321166 -318440 -312809 -293672 -314371 -324221 -322976 -319130 -332428 -354314
16223 -354314 -355110 -374722 -396518 -420279 -402765 -394385 -377732 -377737 -362048 -343852 -350706 -362210 -364133
16210 -364133 -396658 -386942 -351863 -329217 -298800 -299697 -284200 -288764 -325561 -371534 -350340 -340497
16198 -340497 -324083 -303242 -302346 -315767 -327871 -360917 -344988 -351344 -387559 -372398 -364139 -356272
16186 -356272 -312114 -299339 -327150 -340835 -325589 -309466 -297331 -296444 -296811 -309510 -269368 -242047
16174 -242047 -257448 -301165 -297427 -281618 -272809 -239306 -234689 -228628 -240691 -273301 -274999 -280161 -283974
16161 -283974 -324029 -363657 -373964 -386376 -375389 -359788 -324049 -324965 -311788 -319729 -296284 -283681
16149 -283681 -283218 -298343 -301009 -313152 -312466 -287410 -256297 -242916 -268881 -303746 -324478 -316460 -307243
16136 -307243 -295769 -292676 -276226 -272629 -298544 -289691 -287770 -299356 -282072 -280202 -286760 -315567 -289203
16123 -289203 -275292 -283849 -278250 -280200 -303457 -307172 -266027 -226926 -244523 -274836 -276304 -274504 -287026
16110 -287026 -305932 -289769 -277776 -252653 -258983 -291845 -289203 -277832 -288209 -298236 -286484 -253788
16098 -253788 -261184 -258996 -234698 -261079 -281402 -267380 -277907 -271707 -283824 -281175 -300737 -340656
16086 -340656 -324499 -299409 -286049 -311254 -306901 -300816 -288400 -282907 -276775 -271967 -290840 -318078
16074 -318078 -280638 -264732 -261470 -252628 -233819 -209224 -207084 -226579 -236066 -243191 -235083 -227269 -230130
16061 -230130 -255178 -268359 -240371 -204824 -196138 -212512 -215617 -222931 -232226 -207958 -245326 -307820
16049 -307820 -307919 -267633 -240590 -230574 -222459 -253814 -254871 -220947 -188972 -192839 -218159 -250579 -288279
16036 -288279 -268263 -245745 -232421 -213382 -203910 -184833 -191050 -188647 -178150 -178737 -200043 -174853
16024 -174853 -177437 -203251 -232313 -232122 -254955 -222008 -175041 -146954 -138083 -127265 -102942 -133366
16012 -133366 -181615 -199878 -209057 -215128 -236436 -263239 -250781 -250343 -243722 -215271 -191554 -178660
16000 -178660 -168449 -170151 -220529 -215373 -225508 -233142 -229693 -254295 -264698 -229672 -213059 -216810
15988 -216810 -208711 -191408 -202723 -252736 -255279 -201184 -190914 -231945 -239332 -273255 -290380 -268294
15976 -268294 -210002 -194429 -180121 -168907 -178949 -233764 -218930 -221141 -220495 -182894 -167117 -206947
15964 -206947 -193956 -208446 -219477 -186744 -187446 -186825 -167272 -152569 -167797 -181532 -145107 -121125
15952 -121125 -115279 -117850 -130127 -148980 -153271 -151532 -158502 -160898 -186923 -198164 -197137 -205476 -198743
15939 -198743 -173192 -149593 -173810 -167349 -152471 -197422 -219465 -209985 -222215 -192833 -175554 -187272
15927 -187272 -168607 -154919 -161262 -197323 -217155 -206267 -214818 -216808 -201693 -167713 -138784 -175793
15915 -175793 -228450 -194580 -175394 -184926 -197820 -216922 -196266 -175198 -188272 -188143 -216773 -220208
15903 -220208 -188439 -169252 -141465 -126273 -160996 -168401 -170653 -168296 -162504 -173460 -156208 -116115
15891 -116115 -113393 -99853 -100664 -108706 -99893 -101768 -106882 -159762 -155527 -154662 -128591 -93629 -110137
15878 -110137 -139356 -148664 -138595 -155320 -159606 -157324 -156966 -165878 -157204 -130640 -146577 -177571 -165459
15865 -165459 -115238 -110201 -125129 -105071 -100580 -105036 -100177 -103817 -166112 -190691 -162506 -137162
15853 -137162 -166663 -167349 -139788 -149971 -149964 -151884 -140665 -122186 -111424 -118543 -104172 -80957 -90162
15840 -90162 -85347 -72081 -90827 -130988 -111736 -104441 -102231 -109424 -123748 -107534 -128435 -149038
15828 -149038 -100099 -86938 -116502 -123317 -147126 -118493 -103805 -64796 -42906 -78673 -96613 -96386
15816 -96386 -98288 -85681 -71936 -79524 -107055 -113550 -102510 -92593 -85360 -106240 -133962 -165204 -164517
15803 -164517 -166534 -145119 -85569 -55684 -109769 -132678 -124963 -100775 -92037 -92498 -90560 -93607 -88585
15790 -88585 -63414 -52766 -16110 -59665 -88339 -121145 -124291 -110258 -112683 -128947 -116623 -112660
15778 -112660 -73538 -68265 -60186 -60005 -64135 -77615 -66935 -44337 -50193 -64825 -73902 -76818 -103520
15765 -103520 -155439 -142905 -108283 -118100 -142059 -155960 -171977 -165286 -163747 -139983 -114386 -118810
15753 -118810 -106169 -92555 -58998 -72400 -67761 -54809 -51083 -60076 -105323 -97487 -69105 -81532
15741 -81532 -80499 -79246 -112024 -94441 -80155 -108651 -88005 -104278 -137293 -142590 -116262 -95044
15729 -95044 -94682 -102795 -112242 -103954 -117548 -123916 -112187 -79865 -104175 -112768 -109158 -56128 -54623
15716 -54623 -89264 -91216 -86242 -75624 -85388 -104478 -103272 -109588 -85870 -62322 -40546 -54530 -81659
15703 -81659 -90500 -87180 -88916 -77613 -100761 -67800 -41904 -11416 -42983 -67696 -75208 -61563
15691 -61563 -57856 -89859 -78856 -30102 -5957 -32163 -46074 -46780 -45121 -41749 -73799 -73162 -57760
15678 -57760 -56752 -51900 -27704 12135 25917 23655 6936 22194 12551 8100 2018 6392 9116
15665 9116 -9221 -25036 -20024 -10634 -13911 -15523 -763 -24437 -57500 -22316 -8177 4250 1306
15652 1306 -7413 -29248 -31563 -15125 -3655 -7465 -12559 -38906 -42803 -12255 -43965 -50305 -64965
15639 -64965 -81043 -80951 -61141 -73694 -57068 -32288 -52716 -61784 -84504 -69406 -75646 -59160 -13238
15626 -13238 -7646 -13915 24817 53302 21327 -18060 -38285 -16177 -26691 -37763 -22510 -45992
15614 -45992 -64455 -53650 -14464 8740 4139 20379 -2372 -16926 -9373 -11147 -40142 -44480
15602 -44480 -18400 8821 -2284 -6377 -15047 -20016 -14237 -16948 -25036 -53791 -26233 -26500 -42315
15589 -42315 -92083 -93933 -63247 -67508 -78674 -53642 -52914 -27576 -34779 -63797 -38447 -2357 -973
15576 -973 3480 -17702 -51161 -23157 -2664 4879 5472 27661 -7185 -17391 -39390 -39879 -42368
15563 -42368 -45864 -24566 -25062 -50589 -49732 -64605 -35621 -50331 -44673 10071 20983 -9621 -18098
15550 -18098 -24952 -49452 -35407 1077 -10372 -9323 -16072 -35411 -20635 -12532 -5349 -29213 -22504
15537 -22504 4805 40294 24110 -2607 27717 34677 24892 10500 -5727 -29123 -46462 -31545
15525 -31545 -32675 -25443 3087 32536 65146 41564 26976 33192 58209 71176 9730 8149
15513 8149 35949 40347 19665 -1194 11559 20875 -4555 18132 18002 29410 52155 45487 41266
15500 41266 21819 10515 16169 -3503 -45724 -12349 24862 41905 51263 45355 44565 49580 56129
15487 56129 43367 31804 50221 82049 79751 82444 76251 39278 -14495 4213 39456 29986
15475 29986 9756 -34637 -31616 -33314 20975 20882 17744 10655 14112 52992 70402 31997 49682
15462 49682 35911 21352 33556 22719 4988 2901 25148 56319 24001 17665 231 -10525
15450 -10525 20266 65993 69309 55068 79024 103461 78058 59685 52337 53076 52897 40592 41538
15437 41538 34651 49785 72552 86695 101408 86326 36804 27725 40903 25542 11661 18287
15425 18287 48361 56914 34798 43541 33276 29728 30740 1040 -10783 -6572 -3473 40017 58131
15412 58131 59972 58740 74419 103110 86585 89370 82624 61064 82437 103775 122352 109053
15400 109053 75054 59726 76076 92557 95034 101128 66394 8583 8756 54049 65383 81133
15388 81133 98669 107659 121242 78388 66558 90293 93750 81400 72397 77726 84676 91823 90348
15375 90348 121734 98959 87890 94261 71162 49559 68605 92461 131523 146917 121638 71014
15363 71014 45435 13044 290 30424 26133 52640 62452 41717 65285 71486 76278 79511 60483
15350 60483 74810 39589 52553 84915 103993 103458 76508 51151 36596 45947 80357 84198
15338 84198 70247 56105 16116 25965 52797 73486 71473 41220 48622 70010 58721 39708
15326 39708 61228 64597 87401 97196 106213 98093 93466 117128 134959 136623 132515 102337 74812
15313 74812 112767 136349 141251 135355 135449 102307 75238 90088 73980 73861 78854 98067 79787
15300 79787 70084 88266 92079 92214 75472 64428 66066 91534 60461 64098 80415 85407 91138
15287 91138 93277 91749 110914 98157 101066 107264 113226 91979 84134 97849 109378 123229 75161
15274 75161 55601 75241 133270 146070 166916 163248 114265 122690 152549 155773 118051 137540
15262 137540 193249 183427 158903 121921 140423 154733 125526 136641 143286 170814 150490 158971
15250 158971 157999 136252 142724 126161 112835 119524 118613 142280 166201 149558 170786 184151 189213
15237 189213 194989 170151 121138 100551 120890 153939 184740 175576 195535 203310 167267 176397
15225 176397 182041 183479 166250 160135 145081 133315 150501 211923 216026 213440 183379 178051 206322
15212 206322 184624 173273 203922 214890 214149 192132 201272 209945 187189 167485 172053 177398 154585
15199 154585 193955 224931 222817 218562 232888 240532 213105 219390 223193 228866 203624 209080 208946
15186 208946 247021 252868 252856 272110 285844 318976 343670 321100 333998 376851 407416 429059
15174 429059 403335 399832 434556 443072 433889 422756 387092 309347 204218 139958 86718 62292
15162 62292 84093 79747 52162 51478 69285 98296 144341 205708 226048 245231 269234 294584
15150 294584 269084 222635 175096 124142 60429 10652 -44477 -101153 -170853 -175836 -197437 -177917
15138 -177917 -110377 -89246 -76571 -56049 -45078 -12783 -3427 -1769 -12102 -15075 20678 44285
15126 44285 14002 -8216 12008 9690 -161 14690 15171 -11220 -33859 2416 51407 48087 56817
15113 56817 95749 136965 146558 125057 115217 98433 136322 134880 82701 57246 87580 102662
15101 102662 98989 103925 90075 118897 154557 155059 150892 129953 130492 140454 103400 137630 141983
15088 141983 121753 86612 65032 60031 66814 79823 94269 116911 130024 122459 100578 103247
15076 103247 114741 111267 103426 98829 102303 128434 124601 106692 110953 99448 99789 133403 147698
15063 147698 134223 146585 141101 137607 126239 143255 142354 146421 149101 125630 77072 75831 101655
15050 101655 128561 150301 172565 155478 129758 120224 101003 90296 85644 101610 104930 94566
15038 94566 110412 121107 149831 167404 193389 191126 168712 183842 226813 219139 186964 151615
15026 151615 141938 140345 149811 160705 159840 169810 187256 199642 218624 228119 202114 220140 186846
15013 186846 166531 183075 184279 200421 208684 199661 179198 199641 209079 201744 200033 198698 182553
15000 182553 181381 198956 201382 183928 149969 143051 156842 180268 204189 191472 155083 138286
14988 138286 168837 203293 207424 225290 233571 196389 184947 179056 162551 184411 207105 224414
14976 224414 239775 240888 235029 211256 202546 213494 243502 234030 221223 201948 192754 205216
14964 205216 224718 231399 239327 233125 217153 218241 189064 231227 266427 255459 227411 218068
14952 218068 208472 202123 230652 252936 256604 229857 186298 194205 206159 226226 268527 274002
14940 274002 265695 228353 232150 214236 202237 213448 222334 220194 244688 238383 234893 263645 273477
14927 273477 269184 264612 258333 246499 218952 223571 240994 228478 250516 245274 237281 230020 215278
14914 215278 194584 196067 201044 238071 246914 228713 233585 257337 243548 242944 238747 231938 236849
14901 236849 222606 214849 192238 197982 186501 159795 162770 203576 178920 200568 210403 211647
14889 211647 168209 158204 141017 159901 167344 204254 249141 241906 206148 191410 179734 184793
14877 184793 207408 232311 234028 228945 231617 214495 184468 173870 193274 189559 222991 243781
14865 243781 219371 211113 237552 261744 251638 232126 233753 265957 253592 232286 224791 230523
14853 230523 185524 183141 215662 257475 281140 282869 286953 252417 213491 196076 187133 205019
14841 205019 241393 240863 201929 203162 214915 258971 271981 277194 292961 299996 305104 294888 276090
14828 276090 245932 249330 275655 302531 278289 286271 285853 304082 288138 283243 260274 235700
14816 235700 184517 222081 236984 236360 237183 229048 247150 256894 267108 289607 282725 285691 280553
14803 280553 271913 277397 282161 277494 265533 266769 261494 225853 219315 235837 257440 248695 259712
14790 259712 287086 274911 286315 293660 279059 266534 239668 245670 229734 202493 198459 236429
14778 236429 254510 281424 300429 286419 273202 289877 305218 318222 307927 296342 284801
14767 284801 327641 344287 306225 286321 255565 255128 273970 295687 287560 251359 279665 291570
14755 291570 282238 276137 285839 327376 317326 304152 328693 328428 296130 283609 279618 256356 253394
14742 253394 258989 283891 272882 258574 249734 257573 258562 275905 275647 238278 202331 233661 245372
14729 245372 255429 293418 319097 293852 279657 301214 293734 291071 267688 285493 298747 318683
14717 318683 312039 280190 264217 243302 227290 240854 264685 279735 266260 257007 268643 294345
14705 294345 299332 293054 309180 326161 323016 309034 293806 251440 235342 248033 267125 292196
14693 292196 287003 320792 321623 291164 256633 259570 282310 305713 276738 292375 320367 322404
14681 322404 317893 315841 336810 356226 339131 321143 323029 365706 356485 339344 336982 349431
14669 349431 327609 316058 343996 334406 293233 287937 291722 290605 306901 326204 352688 357648
14657 357648 326582 317025 278419 294809 290557 306945 303684 299984 310652 306677 308622 329788 345210
14644 345210 347253 330593 337550 355746 375726 348644 355779 376439 333121 315242 335603 330547
14632 330547 368657 414396 387214 380343 397040 399030 375679 353258 377543 387166 356277 356685
14620 356685 352084 332926 324304 347117 323256 289805 294740 298660 311824 324521 315945 323958 317262
14607 317262 317969 337534 328546 304878 318090 338282 322965 333125 359926 383183 379257 421592
14595 421592 402914 383163 354148 360441 366781 355037 345569 353803 360483 351210 356332 331455 327920
14582 327920 331807 323244 287340 292860 343770 376003 353182 368509 394842 389029 358965 352106
14570 352106 360238 367376 364959 366553 365309 368882 362144 357710 311270 304390 325434 367961 359953
14557 359953 347915 337288 315939 311824 325218 343544 350661 367427 383944 377960 375086 385616
14545 385616 396885 386895 370000 360637 366500 366044 378353 390604 407476 404498 386955 372363 369332
14532 369332 349586 372679 410835 419186 380190 347577 335105 340071 353904 340249 341755 371094
14520 371094 413203 434151 442731 424460 389651 401132 431712 414986 408251 413538 397634 366773
14508 366773 366996 367199 349629 344942 388961 387104 405068 395829 381935 375809 413975 407469 401910
14495 401910 408770 401086 422884 402814 401374 407698 422322 419290 435162 421785 388809 391618 393275
14482 393275 388219 401510 383697 392044 396342 387348 404701 420812 421086 437058 458040 459937 421638
14469 421638 393850 421291 416795 420653 415083 419567 379050 361391 339737 340652 358954 385908 417711
14456 417711 397132 395436 370079 377725 366470 379299 400507 381464 381658 399186 412866 405355
14444 405355 431305 416200 373772 345631 356252 370729 385238 354194 347929 363696 378511 394715
14432 394715 396591 408612 413317 433940 452975 418411 394300 362904 355317 376906 356483 376269
14420 376269 393914 367777 374061 341726 368972 426271 425212 440494 451758 435413 419224 409847
14408 409847 452938 464492 397500 377526 415116 454892 443220 409384 408987 398599 393645 384442
14396 384442 389632 405142 418683 417766 429154 418588 439274 442090 436724 450916 432828 419543
14384 419543 419225 419526 412508 426843 424178 405782 398489 435581 450526 454355 412626 392573 384437
14371 384437 403381 396733 371442 378395 387323 395888 409311 442890 461465 465530 440070 441087 442045
14358 442045 419927 395767 406652 438287 463341 443721 444129 433487 457032 479986 466396 420734
14346 420734 412467 433094 473967 445084 452427 482053 456254 452944 428863 406558 421654 410959
14334 410959 380172 395087 390487 420567 446131 447213 453218 468276 490299 500289 485534 473350
14322 473350 459744 442503 412773 388651 400997 412694 419168 449472 481270 495477 472089 442812
14310 442812 438406 417693 420726 403982 409898 446597 470103 461457 472416 464795 470115 474707 463422
14297 463422 476535 464607 468203 458423 461455 464378 435341 412878 442553 489050 487098 505255
14285 505255 513087 514487 528642 494723 467404 487875 503844 494026 494022 509279 513278 530748 542573
14272 542573 556329 558153 534614 548632 568576 566508 564636 554101 558850 555089 529193 498699
14260 498699 531156 547484 543887 535666 534358 552952 541590 528059 530875 568860 568198 538121 513956
14247 513956 492220 522785 559054 536466 531259 516404 517834 536736 513439 496976 507807 526484
14235 526484 533962 540033 532681 553799 539380 547856 557327 560385 564343 563854 568967 546415 518735
14222 518735 512208 534919 521826 529316 523643 501428 511520 542586 539105 513312 531412 557601
14210 557601 588940 595677 564363 539395 542532 532572 532814 530527 492293 498441 512260 511764 495080
14197 495080 505711 506958 487250 451242 474164 464568 464621 471322 481702 502892 540914 489259 449283
14184 449283 459333 455293 441990 481630 523703 550958 502589 481756 453194 453625 413932 403638
14172 403638 401886 395898 387667 399161 415666 443648 437951 402557 430009 431353 442159 474917
14160 474917 468730 493928 494624 431935 447960 496751 502320 472538 461441 462601 455897 423463 428508
14147 428508 464794 508211 492538 470302 438121 400661 393234 397825 411429 440915 487584 474352
14135 474352 482338 527256 514773 479241 425877 423103 501565 490485 435125 422807 415193 406437
14123 406437 396910 403927 397356 442736 465382 458690 440796 463985 449903 473576 470509 450182
14111 450182 449831 464449 472326 472680 449312 438493 421779 397729 399187 445766 457579 480424 491401
14098 491401 488549 465520 483755 493574 499451 483664 478301 503694 515101 503715 470768 470811 455839
14085 455839 477373 494683 463949 480980 542201 559462 571899 561332 516841 481507 484872 498180
14073 498180 499582 493127 492643 488093 483058 484806 492768 518024 562189 564658 554445 538434 506897
14060 506897 514353 501772 481979 502591 515781 536759 508999 491313 488202 512079 546105 549833
14048 549833 518709 514435 548614 552677 560709 581508 573398 576528 558172 555357 562579 584058 564392
14035 564392 571318 589532 550029 504977 500142 525630 562206 559619 567122 584575 629138 611464
14023 611464 557740 566838 566884 582216 583122 576095 583174 606865 593010 550335 534750 552494 571697
14010 571697 561059 534725 578573 584799 580047 580948 576818 583387 606471 594324 579495 569983 577456
13997 577456 582255 594927 612235 615864 600358 605352 632280 610386 594076 572931 584131 582016
13985 582016 567621 567162 586609 608529 603652 589492 591251 588803 607572 611122 616190 590794 620189
13972 620189 595026 584817 570764 547659 527636 546114 549252 550757 516394 516802 557561 585484
13960 585484 585607 579972 608226 633095 619077 605352 620219 588434 561027 572517 552213 572377
13948 572377 593517 588719 571615 593581 601055 593740 584935 592773 601890 603228 608475 571574 553221
13935 553221 573119 599688 626405 646399 651029 658214 653721 641432 609161 586051 550658 523012
13923 523012 563628 626544 658979 675354 645455 612292 601951 598890 608257 614580 575047 587945
13911 587945 587212 601778 624436 636203 593638 566341 576530 588987 609690 620995 616695 623860
13899 623860 617710 620453 619660 626909 644259 654644 651302 632723 638084 641665 632811 639400 647582 638250
13885 638250 626643 626683 611749 611629 623778 643213 674781 686067 672555 677641 662767 668872 681772
13872 681772 690299 682310 690268 708542 675561 665593 676468 704742 722069 684966 672396 637897
13860 637897 659741 690027 706786 661209 638627 667956 656329 618723 615221 669768 706498 666124
13848 666124 638740 663413 671176 672022 663272 655639 678561 665281 639565 637969 641202 643905 651355
13835 651355 664128 685578 659791 645772 673820 658069 644960 663518 661128 672827 687421 661872
13823 661872 678979 683574 676722 700319 687179 683838 667854 646484 645465 670884 678959 668498
13811 668498 700274 653034 635822 641080 663664 676804 659918 676828 679203 684390 716206 718525
13799 718525 698696 662582 647238 665228 684578 722667 728240 716019 698399 697894 671402 671586
13787 671586 680531 695971 661421 654627 658837 674265 666660 654806 625014 658561 672573 654045
13775 654045 668480 683876 700074 716017 715320 710119 689494 656482 660538 671030 679138 665233
13763 665233 653023 640932 648489 666171 669843 721733 719605 713859 697811 687897 694687 676269 681151
13750 681151 683596 680135 648447 634800 651241 677117 653909 617781 631676 664704 689008 690074
13738 690074 707253 696116 700490 711867 715861 699397 681390 676597 669675 670438 680194 669313 683932
13725 683932 661993 688255 718329 733600 726450 711520 689495 684007 688819 702081 724269 760176
13713 760176 742100 725532 698200 706024 729919 729064 715081 722520 750330 753380 694636 678388
13701 678388 689338 661568 659921 712272 710271 680487 707645 698496 691612 691878 709069 722656 722379
13688 722379 684743 689813 687827 702361 714350 667962 703570 757432 804193 787907 755892 738461
13676 738461 775024 764553 761971 764209 752951 751465 729666 739424 745133 755373 773846 778000 757774
13663 757774 763232 744147 730705 707548 723724 727781 732100 715574 704504 736816 755346 767191
13651 767191 747349 743180 758946 759785 715790 708320 690639 684800 681336 688904 733742 750072 732565
13638 732565 695336 741096 782256 772642 754577 738192 739996 757093 782172 782563 754628 766825
13626 766825 761349 758696 783092 810171 804566 804875 803325 781261 768241 770426 796996 791641 778757
13613 778757 744794 744063 779298 816092 781721 739285 724307 726376 722803 721484 733411 728246 767991
13600 767991 773758 765565 731841 714001 682828 687199 739986 755968 740132 728124 729550 750309
13588 750309 786605 779245 748973 731132 765201 783560 789037 785303 775859 786952 807641 798066
13576 798066 758173 737675 745390 748276 719052 715140 747043 788855 807067 813344 800896 786431
13564 786431 823413 835800 816503 805015 774284 764247 787522 807321 826097 824868 817495 778144
13552 778144 765498 764962 776928 809184 799125 768645 720117 747437 765428 752390 779063 820208
13540 820208 813386 810946 787731 761734 739493 738035 758084 743318 746792 777603 796541 800712
13528 800712 804473 791204 760845 770321 775520 798932 809625 812195 808376 803574 816575 844047 821306
13515 821306 815177 802109 793057 789635 788816 768438 792732 819953 809219 826931 816022 797594
13503 797594 812210 817776 848528 864654 849865 827945 817802 800915 787953 823278 821836 835993
13491 835993 855392 846228 817549 831190 824316 821345 809339 768792 769624 816225 796070 788703 812490
13478 812490 815941 804637 780026 805506 830927 817529 820001 842158 851467 820319 806036 818118
13466 818118 819260 820612 843477 859093 835794 809162 800604 811119 843668 870686 897080 881275
13454 881275 850290 843729 842776 826109 775598 767777 812224 870250 886156 836283 819101 812725
13442 812725 810658 834511 840267 851350 867117 899751 903255 899479 868916 842642 821605 809988
13430 809988 803028 810525 807729 863631 896577 874795 872509 866418 876952 883260 896542 890029 871154
13417 871154 903179 904102 880597 858875 852508 866143 867584 864387 849133 814886 801681 812729
13405 812729 794524 805023 811683 832119 878412 871693 860143 906053 890095 871292 874332 854822
13393 854822 830244 829596 853485 845661 840498 840643 875015 899535 878530 881140 887031 926855 937228
13380 937228 939905 946693 928518 917187 927089 940662 955867 966580 943068 924757 927842 932797
13368 932797 939279 917837 898608 878505 864351 836183 829656 859916 904483 901758 884543 848697
13356 848697 862673 877009 878918 856206 891232 900433 903667 925187 945216 929728 906738 888567
13344 888567 900237 908137 890141 881474 891555 885275 895684 902722 898145 930518 950476 940509 970338
13331 970338 988091 960408 921009 901037 899639 933505 975166 965520 961339 973479 990815 971191
13319 971191 947800 939135 947963 938773 937549 972127 995544 966577 956323 945348 939594 949424 953954
13306 953954 946658 943118 923545 944384 934220 896839 871237 904679 930456 942314 926599 911301
13294 911301 898410 908210 930361 909000 892570 896946 918468 945740 975060 984598 971650 957939
13282 957939 931223 944289 948801 944763 964939 984970 1016286 1026028 1029586 1049308 1045843 1035614
13270 1035614 1007632 977915 947678 930162 931619 970155 981451 990543 999602 1011522 971129 957849
13258 957849 960723 956938 933363 912610 939746 981907 998713 1007601 977837 968183 970465 991316
13246 991316 1007029 992572 959225 956189 983414 995717 1013678 1015166 1000878 997311 1002750 1000215
13234 1000215 972855 994680 997768 978927 962383 976241 1000503 1030027 1059980 1067456 1098894 1082409
13222 1082409 1078231 1043785 1058953 1073203 1039024 1041268 1072183 1105154 1112390 1122960 1123321 1097473
13210 1097473 999670 913176 911359 914924 936116 940218 897587 932954 937754 949036 978707 999244
13198 999244 985567 970576 1009157 1014975 1053407 1036827 1027186 1026499 1022641 1010554 989332 1001109
13186 1001109 981717 976663 974120 944972 958599 975224 969706 979033 985058 988346 1012407 1043661
13174 1043661 1072205 1062468 1047722 1084065 1067121 1060924 1069247 1029312 1013094 1013024 1011623 1034788 1067025
13161 1067025 1087084 1115282 1124299 1134005 1107981 1082849 1052583 1067382 1080654 1116884 1055611 1015637
13149 1015637 1042143 1061684 1053205 1033519 1043788 1049448 1035971 1036988 1016345 1003624 1026446 1005392
13137 1005392 974925 986050 1005289 1022548 1036228 1063015 1051612 1047142 1030799 1022116 1021546 1034767
13125 1034767 1030551 1041385 1032915 1018259 1031597 1031891 1011264 1038159 1048106 1064785 1057943 1065556 1056807
13112 1056807 1047271 1027743 1031754 1070740 1098736 1128583 1132856 1095947 1057547 1057997 1047664 1021261
13100 1021261 1036889 1082807 1107483 1085995 1101962 1115395 1108902 1094161 1081857 1082163 1110436 1067181
13088 1067181 1067617 1078008 1071543 1073790 1061150 1046271 1089660 1115005 1100236 1100345 1082519 1074114 1109311
13075 1109311 1107475 1044440 1012832 1053111 1110952 1140974 1136050 1080142 1120842 1138117 1107826 1105285
13063 1105285 1143137 1104338 1103872 1092581 1084719 1054485 1043431 1103797 1115689 1119022 1108891 1123805
13051 1123805 1154925 1156434 1161699 1167824 1136523 1136719 1135116 1122608 1118331 1136354 1111260 1101663 1140199
13038 1140199 1167846 1161229 1150536 1170942 1196570 1206828 1177842 1143120 1116311 1126209 1138311 1099049
13026 1099049 1082277 1105603 1096604 1101104 1112057 1143247 1142449 1149231 1169983 1217514 1215387 1189648
13014 1189648 1196449 1200857 1236653 1218170 1187065 1150743 1144787 1168146 1158004 1127572 1114078 1132540
13002 1132540 1176879 1206702 1231336 1217899 1195929 1194660 1201726 1201893 1188322 1192397 1196704 1224335
12990 1224335 1220471 1207591 1184184 1146995 1136757 1172770 1213129 1236468 1227757 1221523 1224801 1214337
12978 1214337 1206804 1213480 1226487 1226004 1205143 1210590 1246554 1262520 1267021 1260067 1272168 1272790 1249835
12965 1249835 1216333 1187559 1180379 1195973 1240188 1247270 1261769 1259191 1280493 1256239 1211668 1220837
12953 1220837 1239109 1241096 1254647 1265034 1271700 1284690 1279275 1258570 1221109 1205269 1240494 1259391
12941 1259391 1260061 1242195 1263898 1255516 1236798 1246400 1220367 1205939 1214101 1207309 1199123 1220362 1241995
12928 1241995 1228691 1217158 1191325 1219356 1242127 1265899 1286442 1310083 1271174 1239375 1226966
12917 1226966 1211091 1232718 1223617 1255100 1282373 1282467 1266459 1262854 1269526 1274933 1266424 1273603 1267398
12904 1267398 1276886 1256404 1247773 1258714 1285324 1296860 1284709 1274376 1262070 1286196 1282279 1270758
12892 1270758 1241259 1223523 1227020 1215859 1231103 1260863 1281159 1284056 1314246 1341104 1319023 1283901
12880 1283901 1299113 1289856 1284769 1300780 1301074 1296793 1303665 1280523 1280163 1283048 1265542 1239625 1241109
12867 1241109 1293336 1300148 1302594 1300950 1295539 1326173 1356709 1363128 1352851 1324211 1310443 1325030
12855 1325030 1333396 1314790 1298761 1290210 1291722 1287937 1252424 1262537 1288553 1315314 1311078 1291415
12843 1291415 1281638 1292798 1305499 1315019 1347355 1357453 1358688 1348292 1359243 1342602 1304517 1301240
12831 1301240 1323030 1344225 1372434 1382095 1349697 1329369 1306415 1286577 1298876 1305268 1323822 1350898
12819 1350898 1361683 1356170 1322612 1328886 1367714 1386135 1392015 1392269 1364155 1381442 1423030 1419083
12807 1419083 1394767 1400500 1389526 1395397 1392731 1403046 1412703 1425872 1421292 1401117 1376314 1352579
12795 1352579 1358743 1343899 1335007 1316475 1322191 1324532 1347264 1364833 1378992 1421903 1414642 1415503 1412387
12782 1412387 1387087 1408407 1440196 1461797 1448112 1446917 1459034 1444972 1392196 1375017 1429740
12771 1429740 1438655 1427843 1403456 1430921 1455929 1443339 1434576 1448598 1442500 1410494 1401385 1408107
12759 1408107 1455642 1481247 1474704 1473365 1458806 1439298 1446570 1464116 1451620 1461736 1470531 1422192
12747 1422192 1379458 1426879 1448440 1470038 1438053 1398985 1420989 1425744 1431626 1459229 1432259 1420520
12735 1420520 1423574 1404157 1452389 1510171 1510879 1499647 1497362 1464756 1459963 1497493 1529148 1544433
12723 1544433 1539237 1533158 1534600 1508883 1494370 1514076 1514429 1506205 1511467 1535139 1501882 1480612 1503226
12710 1503226 1512427 1496810 1493370 1494569 1514560 1524292 1524331 1514479 1523794 1533929 1521675 1520843 1532469
12697 1532469 1540781 1580132 1557317 1505400 1499417 1507151 1536187 1534779 1542500 1557356 1563413 1590608
12685 1590608 1582228 1544962 1541665 1546181 1552532 1547340 1535961 1531979 1512721 1500282 1489921 1541647
12673 1541647 1576569 1590392 1590402 1563440 1543563 1574227 1584291 1601976 1574612 1567950 1550014 1523767
12661 1523767 1505595 1521398 1543109 1535288 1500630 1509633 1516834 1519587 1542002 1550225 1542009 1528307
12649 1528307 1544335 1570623 1584443 1587971 1560480 1517370 1508423 1529215 1541724 1534646 1539047 1552388
12637 1552388 1561032 1601637 1605884 1611751 1623048 1630534 1621443 1610385 1611395 1596979 1579007 1601809
12625 1601809 1610114 1622985 1630121 1627924 1657972 1657857 1652940 1638168 1663295 1644131 1649834 1655322 1651473
12612 1651473 1639317 1645470 1668284 1679296 1694175 1700404 1678590 1647887 1669456 1665334 1693171 1701250
12600 1701250 1679857 1659817 1666457 1694143 1720857 1710797 1700256 1682110 1665720 1666105 1650120 1666981
12588 1666981 1704423 1678547 1678380 1686146 1670124 1666727 1679157 1699433 1715105 1713109 1690905 1670075
12576 1670075 1669919 1697983 1671465 1657499 1678378 1710583 1737478 1745921 1756508 1757842 1748178 1752731
12564 1752731 1743843 1725314 1733843 1743494 1768551 1761881 1731325 1713576 1688439 1692706 1729718 1729732 1750748
12551 1750748 1774960 1804261 1815865 1826744 1814010 1777094 1780816 1796033 1758779 1727176 1737077 1728896
12539 1728896 1721430 1765928 1794168 1805623 1772671 1720347 1701118 1734361 1745091 1777686 1778607 1773476
12527 1773476 1773367 1818093 1848066 1808615 1821701 1838031 1799766 1794157 1794400 1798748 1814228 1802663
12515 1802663 1828338 1828204 1803958 1821205 1830684 1841166 1888518 1901018 1893092 1913976 1927080 1879426
12503 1879426 1833532 1811315 1804578 1787934 1793700 1795096 1833451 1844964 1816401 1794725 1785170 1817018
12491 1817018 1818133 1796335 1793502 1822309 1853167 1850630 1850043 1848728 1848602 1849508 1837900 1834244 1835987 1872168
12477 1872168 1901106 1912754 1919290 1879135 1894100 1856750 1800637 1796314 1811768 1845329 1870288 1894917
12465 1894917 1930022 1916557 1901969 1902904 1888180 1881708 1894376 1885302 1872447 1893820 1914732 1929876
12453 1929876 1924338 1934149 1966251 1981231 1971755 1973044 1968511 1980017 1959975 1949520 1978037 1989489
12441 1989489 1992279 2012098 2007664 2000587 2004438 1982661 1990967 2018632 2003278 1961571 1945039 1968164
12429 1968164 1987945 1949558 1983179 1970325 1969625 1970966 1968215 1968507 1999814 2047574 2044287 2028200 2011543
12416 2011543 2015356 2019333 2048021 2054591 2052371 2041985 2044263 2071935 2091198 2089022 2073830 2058677
12404 2058677 2042001 2044261 2034791 2054967 2073342 2070406 2053086 2040246 2068934 2080007 2049478 2064696
12392 2064696 2065875 2084413 2066408 2040443 2026352 2011484 2018037 2058580 2079684 2060904 2032245 2061864
12380 2061864 2119650 2150667 2142702 2092708 2080235 2111635 2116476 2132338 2142482 2149043 2154354 2161943
12368 2161943 2155457 2145416 2121566 2115887 2105245 2089913 2072260 2083188 2153508 2200098 2183437 2194415
12356 2194415 2214985 2230581 2224324 2202491 2183078 2137045 2164773 2168041 2151887 2166686 2198718 2189002
12344 2189002 2132832 2133660 2160907 2200471 2218358 2195995 2182860 2175599 2187607 2210418 2196699 2200278
12332 2200278 2228825 2235400 2238573 2281972 2292677 2298895 2328477 2309159 2260830 2231618 2262105 2272672
12320 2272672 2285903 2293192 2290201 2285824 2276070 2272853 2274462 2270336 2256264 2251481 2248679 2274282 2341383
12307 2341383 2383241 2411418 2424622 2397477 2391704 2402523 2372608 2378508 2385944 2400284 2432600 2406117
12295 2406117 2377200 2364451 2381978 2382698 2385775 2410914 2410935 2394797 2391532 2403075 2407363 2430113 2432962
12282 2432962 2441819 2416809 2405603 2433360 2419790 2444510 2483008 2494684 2465392 2480446 2491715
12271 2491715 2491302 2493250 2472802 2502739 2520214 2508653 2518837 2516667 2530258 2535228 2524155 2491481
12259 2491481 2484293 2499684 2495613 2477393 2464847 2476210 2495754 2527975 2546161 2554664 2610283 2619047
12247 2619047 2612770 2563838 2553189 2571297 2571452 2588235 2588378 2617598 2645751 2656115 2670857 2686374
12235 2686374 2651159 2628755 2615964 2656666 2681540 2658910 2614037 2621223 2641861 2668431 2684554
12224 2684554 2718181 2718934 2718226 2721034 2700147 2698074 2729625 2749818 2766967 2772534 2810118 2817176 2793722
12211 2793722 2776778 2793266 2795089 2780441 2781020 2801901 2841371 2825240 2831809 2825973 2820836 2807728
12199 2807728 2806747 2814423 2843868 2834018 2816442 2811735 2842951 2864705 2877384 2903814 2879611 2873578
12187 2873578 2906135 2954901 2972899 2944559 2908586 2923807 2926316 2962233 2980553 3000211 3025889
12176 3025889 3019283 3018387 3017086 3021956 3009956 3021437 2999598 2972633 2969264 2997904 2981185 2976811 3006380
12163 3006380 2992136 3015317 3047392 3049234 3056858 3085161 3115570 3132133 3117429 3097281 3146896 3181044
12151 3181044 3189567 3224527 3225985 3244937 3218548 3212970 3200433 3182306 3195479 3217449 3245912 3270873
12139 3270873 3282454 3285801 3291060 3328744 3319871 3312636 3320791 3302038 3303985 3323967 3327760 3326762 3368450
12126 3368450 3406647 3411881 3422277 3431690 3434455 3437186 3471823 3475856 3468277 3475220 3482468 3538943 3573444
12113 3573444 3567529 3503236 3473151 3475773 3498110 3506706 3515277 3492410 3505606 3543937 3575596 3573657
12101 3573657 3579441 3598466 3600900 3617664 3636931 3645649 3639027 3635553 3658722 3690563 3696601 3707359
12089 3707359 3675286 3683473 3721140 3737119 3761379 3803908 3832638 3804540 3820621 3833543 3860030
12078 3860030 3885495 3904495 3922972 3971062 4011076 4034801 4088738 4114567 4114980 4118769 4165635 4203727
12066 4203727 4206163 4197510 4225465 4240785 4223384 4218354 4200849 4194730 4214292 4262670 4299284 4308834
12054 4308834 4343806 4375931 4366339 4386059 4405217 4456400 4486986 4497386 4524858 4542676 4558020
12043 4558020 4591959 4633143 4668600 4687059 4661457 4651788 4663257 4727930 4813133 4871997 4877099 4887523
12031 4887523 4923873 4922611 4952689 4980664 5003377 4997244 5018861 5056370 5093743 5117274 5127618 5156319
12019 5156319 5187146 5225339 5245340 5290151 5309929 5317895 5356852 5406060 5461345 5512997 5552263
12008 5552263 5591257 5611146 5657069 5702193 5764941 5797000 5850027 5922497 6003033 6029869 6068097
11997 6068097 6162178 6236684 6277667 6306882 6408316 6449702 6500866 6595637 6686533 6760950 6843882
11986 6843882 6898967 6944562 7017714 7070341 7150501 7265125 7359634 7466861 7554150 7606454 7691717
11975 7691717 7807428 7884128 7981512 8093491 8193035 8294075 8423923 8561648 8682807 8824650
11965 8824650 8996012 9147289 9295506 9459328 9590261 9773051 9963818 10142750 10376314
11956 10376314 10592802 10794152 11041152 11315720 11589126 11845222 12147346 12485803 12843173
11947 12843173 13182933 13572357 13962379 14393584 14862157 15391612 15932361 16464523 17082189
11938 17082189 17763277 18500964 19346921 20257978 21209999 22304005 23526528 24897612 26439377
11929 26439377 28197283 30209586 32514546 35193284 38327852 41952123 46095507 50633919
11921 50633919 55065313 58278853 58394194 52429613 36458236 9012565 -21846401 -43062582
11913 -43062582 -51202707 -51225461 -47971687 -43870643 -39910380 -36354349 -33213320 -30486436
11905 -30486436 -28129611 -26031543 -24232330 -22676921 -21265035 -20020888 -18851654 -17791129
11897 -17791129 -16833322 -16007407 -15272573 -14599022 -13901309 -13249147 -12686046 -12164026 -11641549
11888 -11641549 -11175133 -10755868 -10349417 -9953252 -9588527 -9270862 -8959268 -8684158 -8414925
11879 -8414925 -8130427 -7867799 -7611733 -7368325 -7153598 -6949015 -6716382 -6485466 -6317105
11870 -6317105 -6162157 -5973457 -5786251 -5664763 -5523721 -5374250 -5232784 -5107122 -4997781
11861 -4997781 -4882020 -4747295 -4592573 -4450936 -4340682 -4225969 -4116650 -3978881 -3897524 -3816541
11851 -3816541 -3727528 -3672752 -3575310 -3446250 -3335106 -3290691 -3252466 -3187179 -3110959 -3048912 -2976193
11840 -2976193 -2863461 -2798943 -2743606 -2692374 -2598290 -2508463 -2448725 -2422659 -2371634 -2315012 -2284174
11829 -2284174 -2222031 -2175720 -2105086 -2026025 -1969518 -1940425 -1868455 -1806545 -1787183 -1748965 -1737747
11818 -1737747 -1702956 -1648031 -1574932 -1500180 -1491905 -1467955 -1443812 -1377594 -1341552 -1329217 -1289707
11807 -1289707 -1224462 -1214889 -1190521 -1126882 -1104294 -1116292 -1110382 -1101646 -1076040 -1051308 -1026028 -962014
11795 -962014 -880368 -858709 -845441 -812397 -775385 -745107 -751087 -742521 -739216 -702013 -660388 -600910
11783 -600910 -546696 -517057 -502655 -508491 -491721 -480302 -447823 -408437 -370078 -379603 -332484 -315822
11771 -315822 -313957 -302605 -271918 -201012 -189797 -183378 -181356 -178302 -147655 -97410 -100720 -99496 -92669
11758 -92669 -67687 -28140 -45118 -33664 8314 35144 62923 75735 124298 147039 149055 142492
11746 142492 124248 138707 114387 118232 165213 167185 175855 163660 162673 159603 175587 207561 219097
11733 219097 230712 229033 220303 231294 269274 272333 280036 314800 328724 342631 369267 375382
11721 375382 379026 421896 457196 440996 419317 423361 473753 470009 470120 517880 566877 588737
11709 588737 566197 551008 577893 551859 534992 521198 531499 525043 524682 540031 545274 536286
11697 536286 517656 521977 541729 562731 562024 588493 636682 674120 685395 670689 661612 683749
11685 683749 697868 704443 701399 731671 721568 759067 778895 789837 783127 771240 786981 841824
11673 841824 856307 858433 856407 890838 921096 933703 942155 934784 965784 993077 1022483 1010120
11661 1010120 984365 989346 1004796 988706 997613 1016427 1026904 1031928 1005529 965452 992533 1005181
11649 1005181 1014131 1010451 1032842 1012904 985697 1003492 1036208 1046691 1038345 1051862 1084820 1086441
11637 1086441 1109470 1144136 1135161 1094108 1069192 1096572 1140742 1164229 1156822 1182216 1214780 1236409
11625 1236409 1236596 1194901 1187779 1213009 1200002 1224445 1250149 1273347 1264711 1262824 1256482 1283249
11613 1283249 1238446 1198438 1220877 1220799 1217012 1235011 1261004 1263184 1230960 1260398 1289161 1241777
11601 1241777 1247298 1283384 1333313 1376634 1382962 1363684 1361937 1368453 1355837 1350288 1340034 1354203
11589 1354203 1349175 1346983 1375967 1416999 1430317 1405629 1379846 1418165 1445690 1429820 1437679 1504187
11577 1504187 1502086 1507801 1517699 1493935 1497506 1513392 1549710 1578333 1585301 1592393 1572043 1542171
11565 1542171 1552822 1603497 1636391 1620977 1606839 1634930 1617957 1605102 1636955 1642177 1656056
11554 1656056 1665388 1677273 1666555 1682028 1736912 1740924 1776627 1827073 1796877 1759861 1718165 1741664
11542 1741664 1733052 1725527 1704678 1700814 1733908 1752522 1814495 1805608 1800718 1818597 1823433 1826684 1830116
11529 1830116 1841082 1848030 1842504 1834576 1821788 1869169 1859029 1841336 1842542 1878443 1882527 1873269
11517 1873269 1878913 1900465 1888941 1914677 1925757 1932012 1937442 1921315 1924762 1941668 1954831 1919465
11505 1919465 1938637 1950273 1940391 1935594 1946256 1965395 1979097 1985088 1988124 2000553 2002423 2026132
11493 2026132 2042139 2018774 1999063 2039246 2082261 2071708 2045027 2050081 2064243 2075969 2092112
11482 2092112 2127256 2121471 2111151 2094749 2105197 2136875 2157520 2137756 2119230 2124070 2142551 2138823
11470 2138823 2124270 2118867 2140151 2158254 2166589 2126178 2118695 2119076 2157137 2195299 2246941 2262055
11458 2262055 2275933 2318195 2314055 2269259 2245807 2246148 2276976 2322837 2345444 2358749 2385021 2378138
11446 2378138 2374753 2409786 2473441 2504834 2467023 2472319 2539544 2530461 2499063 2511923 2541329 2588742
11434 2588742 2611237 2639497 2659728 2566994 2436139 2323209 2231783 2179584 2159332 2153083 2236601
11423 2236601 2296316 2300066 2289841 2326178 2352090 2372128 2326647 2258134 2200306 2190556 2199651 2254781
11411 2254781 2281260 2287668 2276846 2285728 2296497 2333429 2347413 2382481 2397636 2412278 2418349 2454494
11399 2454494 2450426 2455012 2446059 2438301 2453025 2473025 2522822 2555723 2539252 2521098 2506642 2525005
11387 2525005 2533183 2527478 2540103 2527246 2573292 2598442 2559313 2543845 2556394 2542653 2550045 2564119
11375 2564119 2581679 2597974 2617656 2620160 2606208 2604997 2620754 2625965 2660211 2674309 2670643 2690116
11363 2690116 2731924 2737540 2683904 2701316 2726713 2756207 2794584 2828835 2834575 2834525 2819629 2782139
11351 2782139 2772283 2756737 2799771 2787251 2759006 2762657 2775138 2828102 2848057 2888772 2903461 2897725
11339 2897725 2858662 2852805 2902007 2938831 2948974 2970666 2994823 2998308 2995656 2990058 2972613 2959988
11327 2959988 2988043 3006376 3015477 3009117 2953605 2923746 2923223 2921204 2913405 2924779 2918860 2909554 2921134
11314 2921134 2897052 2885669 2887799 2856847 2872319 2933887 2960583 2995170 2978567 2964453 3001183
11303 3001183 3024799 3036626 3012761 3033868 3023976 3010094 3010719 3031378 3077813 3110185 3122563 3131479
11291 3131479 3141273 3108617 3096669 3117701 3132937 3114560 3100374 3084931 3081379 3115143 3143582 3174643
11279 3174643 3191840 3205539 3194173 3196059 3206720 3209747 3235085 3241762 3243583 3269312 3248966 3277431
11267 3277431 3307564 3281317 3303225 3298067 3273089 3270890 3277411 3248671 3249553 3235778 3253810 3282125
11255 3282125 3322731 3343954 3371417 3389812 3406745 3424190 3478847 3476731 3454179 3480946 3487635 3468920
11243 3468920 3463333 3441214 3437580 3448140 3464653 3484992 3511926 3532139 3550459 3532208 3528206 3554865
11231 3554865 3522412 3517442 3537592 3565361 3621633 3638454 3612885 3607421 3627269 3655810 3668841 3643403
11219 3643403 3619516 3643692 3676039 3691567 3733199 3751873 3713430 3709800 3715634 3736817 3785947 3790725
11207 3790725 3806534 3838129 3835038 3855096 3892656 3932882 3953314 3965935 4021911 4037882 4027365
11196 4027365 3974441 3888566 3821330 3767208 3705474 3713968 3734251 3751040 3787352 3830437 3850221
11185 3850221 3856739 3867474 3894127 3901109 3900680 3887765 3904733 3917608 3904887 3892696 3877831 3881293
11173 3881293 3951411 3987066 4011178 4007778 4028571 4045994 4080586 4110465 4087428 4095514 4140557 4133247
11161 4133247 4152518 4169669 4187968 4186979 4196479 4172880 4157423 4167004 4181785 4199828 4222820 4228382
11149 4228382 4217866 4250376 4267118 4276934 4246069 4288277 4326607 4295325 4302057 4295605 4330927 4367358
11137 4367358 4370309 4384544 4423152 4438133 4423267 4417708 4396867 4416225 4465827 4458771 4449436 4466019
11125 4466019 4492883 4509958 4501638 4491185 4476691 4514466 4529543 4554547 4533732 4566990 4617018
11114 4617018 4622139 4652067 4645153 4626157 4640528 4676310 4719432 4726918 4730545 4778726 4804128 4800308
11102 4800308 4776654 4773612 4800012 4801817 4776423 4794023 4811710 4833911 4846246 4850921 4896024 4921173
11090 4921173 4936063 4940773 4952710 4999748 5041748 5042744 5024106 4986949 4968455 4982223 5022941 5064897
11078 5064897 5112078 5109925 5112182 5125969 5153905 5144047 5163611 5178670 5192770 5247700 5266575 5254073
11066 5254073 5280162 5333448 5370217 5396647 5375025 5361764 5391720 5435992 5471228 5464455 5473659 5465750
11054 5465750 5486977 5545935 5614205 5643564 5646093 5671111 5717611 5754094 5774010 5777049 5849615 5906325
11042 5906325 5907629 5950950 5994612 6033180 6128172 6210995 6290074 6398831 6518053 6653386 6761179
11031 6761179 6780744 6629601 6197936 5537571 4891134 4572659 4511393 4594557 4741778 4871760
11021 4871760 4960785 5013002 5098401 5192375 5273605 5335137 5407507 5439064 5448625 5414273 5402285
11010 5402285 5423540 5437288 5421154 5440556 5461222 5538874 5628929 5666200 5652476 5637865 5648027
10999 5648027 5637675 5646560 5669815 5701397 5761485 5800478 5832491 5823474 5854842 5904092 5890730 5876167
10987 5876167 5889279 5923880 5947149 5950332 5929443 5937917 5941227 5937669 5987416 6031148 6075120 6103709
10975 6103709 6143708 6184136 6212139 6229436 6253952 6279501 6263132 6257978 6292530 6315553 6340126
10964 6340126 6389920 6422128 6457496 6519821 6534432 6548313 6558488 6591670 6613881 6674050 6694519
10953 6694519 6721749 6759262 6826528 6881211 6887707 6923011 6975488 6960853 6901865 6848478 6828090
10942 6828090 6872463 6863580 6805022 6769666 6780318 6808250 6851321 6898497 6950808 7011167 7017159 7017724
10930 7017724 7024206 7018038 7044670 7104620 7154824 7217902 7309422 7363520 7393776 7447243 7473676 7478030
10918 7478030 7522427 7532558 7534951 7558764 7607190 7594344 7623626 7696483 7720940 7735184 7763128
10907 7763128 7791882 7815728 7842883 7878014 7883219 7897687 7898091 7930228 7952245 7960116 7989441 8028628
10895 8028628 8039878 8054647 8118355 8164167 8180781 8232662 8295312 8340015 8387134 8417921 8463141
10884 8463141 8534015 8582063 8598241 8642977 8703891 8761488 8789382 8801000 8808548 8820907 8838337
10873 8838337 8816878 8802752 8825107 8870168 8900089 8902106 8940914 9037164 9109145 9170783 9209812
10862 9209812 9207473 9266848 9341550 9407221 9474158 9558728 9647496 9682372 9752813 9827987 9930404
10851 9930404 10041430 10177995 10282281 10425384 10565308 10687713 10739294 10583354 10113779 9412652
10841 9412652 8826790 8614379 8670975 8783059 8920048 9083475 9228492 9305516 9394244 9507025
10831 9507025 9606480 9661686 9739497 9808795 9909882 9982375 10077600 10166500 10203189 10235799 10312184
10820 10312184 10406743 10433116 10461079 10509529 10564389 10632102 10699367 10753188 10778770 10877599 10945238
10809 10945238 10979416 11027090 11072859 11156229 11228570 11300983 11371607 11450380 11535169 11585740 11599295
10798 11599295 11611669 11620825 11668646 11768832 11903650 11975055 12042719 12130555 12225925 12250268 12284741
10787 12284741 12350417 12417320 12446895 12497587 12552721 12601228 12658653 12729013 12830455 12921655 13091264
10776 13091264 13265124 13422125 13568132 13665041 13685185 13689083 13732345 13794228 13872722 13930829 14011676
10765 14011676 14075292 14148382 14254480 14352829 14438597 14539378 14645247 14769897 14866936 14951336
10755 14951336 15050237 15122358 15210675 15309849 15376567 15397410 15460444 15507793 15597398 15780683 16054022
10744 16054022 16299837 16377047 16383942 16438842 16558443 16648263 16732553 16846832 16982722 17082684
10734 17082684 17195082 17274575 17356556 17502110 17661280 17822019 17965089 18068835 18232724 18411964
10724 18411964 18566150 18720352 18899417 19070429 19216677 19331064 19464778 19631772 19800796
10715 19800796 19976163 20174664 20397634 20602567 20796440 21005694 21205166 21435600 21640943
10706 21640943 21807702 22034426 22256227 22459479 22666270 22877372 23113109 23360384 23626959
10697 23626959 23866110 24082096 24293767 24493440 24700480 24876950 25096104 25360874 25672106
10688 25672106 26022841 26397098 26789815 27141820 27527736 27907896 28311065 28731001 29116543
10679 29116543 29524666 29961157 30412793 30863007 31302657 31742996 32218446 32708084 33202398
10670 33202398 33722636 34258804 34832303 35414622 36056852 36733290 37459754 38196191 38946524
10661 38946524 39706882 40475647 41276053 42128053 42991612 43948830 45009261 46138726 47305523
10652 47305523 48561417 49891877 51276750 52743041 54293267 55948112 57764413 59701746
10644 59701746 61711720 63896616 66241404 68599863 70920653 73223612 75775833 78993005
10636 78993005 82903182 87472660 92632698 98506348 105245157 112872458 121596706 131651989
10628 131651989 143302841 156990343 173615616 193993648 217390985 240005516 253375631
10621 253375631 242226090 183151278 60515186 -86484257 -181459295 -205748941 -191862193
10614 -191862193 -167415541 -143635954 -123394599 -107027563 -93994842 -83466425 -74935022
10607 -74935022 -68352747 -63291019 -58760578 -53922152 -48600514 -42959552 -37221365 -31732950
10599 -31732950 -26783987 -22945224 -21012252 -21628331 -24630645 -28638088 -31384214 -31547645
10591 -31547645 -29447261 -25965699 -21861091 -17805793 -14291264 -12141221 -12336299 -15876990
10583 -15876990 -22943161 -31294747 -37295242 -39296087 -38181029 -35474287 -32157580 -28804032
10575 -28804032 -26029242 -24449103 -24671440 -27228958 -32051932 -37373433 -40770198 -41406271
10567 -41406271 -40027478 -37601458 -34920382 -32522377 -30720763 -29649626 -29353704 -29999291
10559 -29999291 -31415952 -32875989 -33569805 -33252251 -32177195 -30751409 -29302273 -27923859
10551 -27923859 -26685352 -25537546 -24391358 -23305130 -22281886 -21299082 -20363835 -19476647
10543 -19476647 -18654708 -17881885 -17127770 -16407433 -15688498 -14997124 -14348620 -13663105 -12993054
10534 -12993054 -12374686 -11756919 -11118450 -10515137 -9922383 -9359606 -8822464 -8259373 -7643928
10525 -7643928 -7064029 -6509950 -5969842 -5481044 -4983996 -4468583 -4081141 -3916164 -4085418
10516 -4085418 -4424574 -4562864 -4331573 -3875959 -3366533 -2817327 -2243152 -1732298 -1221542
10507 -1221542 -660653 -100893 457127 1029105 1587466 2137679 2689055 3218965 3775837
10498 3775837 4329081 4840811 5403319 6044005 6639158 7175058 7618377 8043565 8580069
10489 8580069 9218654 9923252 10626005 11305109 12060707 12852645 13665902 14454616 15265845
10480 15265845 16127235 16981941 17882824 18819170 19821732 20884723 22028621 23249866 24497251
10471 24497251 25776995 27117561 28480290 29942938 31619797 33456718 35442494 37548718
10463 37548718 39706317 41838852 43882879 45862702 48039305 50738505 54001746 57584223
10455 57584223 61419214 66002695 71609206 78233401 85962228 94878233 105235716 117408631
10447 117408631 132030861 149641842 170571624 193602884 213824841 221024874 197108009
10440 197108009 116047430 -28054665 -168123201 -233745908 -237427457 -217292182 -193589045
10433 -193589045 -172691668 -155667932 -141916220 -130350425 -120383055 -111801960 -104344111
10426 -104344111 -97829527 -92055956 -86878296 -82219575 -78047866 -74307617 -70943681 -68045074
10418 -68045074 -65643274 -63792304 -62339524 -60767047 -58888288 -56936568 -55066542 -53357564
10410 -53357564 -51769076 -50282180 -48910828 -47617015 -46381074 -45187200 -44116841 -43114137
10402 -43114137 -42118022 -41142865 -40261702 -39395045 -38572705 -37791874 -37027321 -36324240 -35685942
10393 -35685942 -35039833 -34422112 -33793235 -33160929 -32603762 -32054617 -31494704 -30929040 -30382947
10384 -30382947 -29889178 -29413294 -28959900 -28528595 -28127210 -27762974 -27408602 -27047112 -26656045
10375 -26656045 -26310341 -25949247 -25615870 -25310462 -25020506 -24728322 -24359390 -23949947 -23522024
10366 -23522024 -23163358 -22954664 -22957265 -23273062 -23788090 -24145134 -24155306 -23888836 -23548675 -23263287
10356 -23263287 -22963915 -22645596 -22329169 -22079804 -21847398 -21604226 -21360481 -21120572 -20917511
10347 -20917511 -20697942 -20508711 -20336885 -20132202 -19944346 -19775723 -19593726 -19451574 -19275186
10338 -19275186 -19065692 -18916039 -18791610 -18625359 -18468153 -18335050 -18163610 -18040799 -17894632
10329 -17894632 -17742664 -17613865 -17511969 -17397126 -17236906 -17115769 -17021490 -16886733 -16729888
10320 -16729888 -16601971 -16463201 -16295167 -16151409 -16001024 -15800771 -15648756 -15651968 -15788536 -15919514
10310 -15919514 -15903077 -15793067 -15679062 -15553868 -15400109 -15318583 -15196756 -15050873 -14931923 -14809981
10300 -14809981 -14716740 -14632990 -14550821 -14466822 -14369286 -14275966 -14180422 -14057598 -13933473 -13869436 -13796402
10289 -13796402 -13719500 -13619793 -13517996 -13400636 -13259774 -13179489 -13189810 -13222543 -13204376 -13157104
10279 -13157104 -13114988 -13041127 -12939150 -12873908 -12815764 -12717037 -12602298 -12523606 -12456832 -12424097 -12378276
10268 -12378276 -12319215 -12290534 -12222686 -12119013 -12062887 -12002990 -11906684 -11810807 -11759699 -11723153 -11687071
10257 -11687071 -11715115 -11703791 -11642737 -11605867 -11527679 -11429775 -11313284 -11252001 -11209400 -11130873 -11026814
10246 -11026814 -10951970 -10877975 -10781691 -10746338 -10719170 -10758427 -10891218 -11041684 -11136384 -11162058 -11163420
10235 -11163420 -11132751 -11120738 -11074373 -11034970 -11022323 -10961171 -10885599 -10787378 -10726576 -10662889 -10596920
10224 -10596920 -10542789 -10488028 -10433074 -10362668 -10285233 -10172052 -10081653 -9989459 -9884533 -9771640
10214 -9771640 -9684579 -9616272 -9502881 -9335592 -9164919 -9019147 -8921541 -8830620 -8842340 -9036899
10204 -9036899 -9525959 -10208256 -10685994 -10868946 -10816921 -10660122 -10501429 -10387362 -10282276 -10174715
10194 -10174715 -10091962 -10060395 -9989511 -9921780 -9849641 -9779372 -9710377 -9672403 -9639587 -9611855 -9560368
10183 -9560368 -9485172 -9419106 -9356311 -9328828 -9275538 -9205380 -9167146 -9130605 -9088513 -9020428 -8973694
10172 -8973694 -8909132 -8887189 -8866681 -8832464 -8792668 -8779811 -8756971 -8726218 -8681443 -8670601 -8679905
10161 -8679905 -8675821 -8648960 -8636084 -8663144 -8681515 -8696259 -8637570 -8559199 -8490667 -8424751 -8373050
10150 -8373050 -8299418 -8280822 -8278244 -8253061 -8284578 -8330529 -8352606 -8343057 -8321155 -8274299 -8174896 -8115489
10138 -8115489 -8098422 -8028425 -7977690 -7930373 -7936760 -7965342 -8043775 -8096517 -8093790 -8068605 -8024106 -7971152
10126 -7971152 -7934512 -7908088 -7855737 -7826790 -7809648 -7758354 -7708429 -7662686 -7630460 -7576947 -7534476
10115 -7534476 -7495489 -7475225 -7420489 -7375258 -7341731 -7298959 -7270590 -7291981 -7348890 -7460308 -7553983
10104 -7553983 -7619147 -7678664 -7668922 -7646587 -7626710 -7627605 -7583066 -7557554 -7550799 -7527979 -7513466 -7509532
10092 -7509532 -7482312 -7446905 -7405114 -7361051 -7321621 -7302605 -7276515 -7224311 -7152932 -7093106 -7080919
10081 -7080919 -7109715 -7074214 -7030059 -6988720 -6986776 -6964743 -6954603 -6940261 -6930777 -6927064 -6888647 -6850287
10069 -6850287 -6809697 -6773758 -6706904 -6653738 -6606269 -6538717 -6513492 -6519779 -6568427 -6612022 -6683707
10058 -6683707 -6790475 -6849374 -6811074 -6741525 -6681905 -6618281 -6577379 -6547043 -6537430 -6528725 -6490541
10047 -6490541 -6439702 -6395340 -6361965 -6303314 -6261881 -6173202 -6098151 -6051352 -5997903 -5929769 -5811468
10036 -5811468 -5691345 -5558164 -5482691 -5489798 -5636533 -6114222 -6824184 -7423672 -7705627 -7713526
10026 -7713526 -7621047 -7501867 -7377346 -7258822 -7176840 -7104342 -7032461 -6982934 -6919159 -6887146 -6856302
10015 -6856302 -6803792 -6745561 -6713898 -6679642 -6599462 -6521261 -6478209 -6456761 -6406104 -6388532 -6383977
10004 -6383977 -6360675 -6374364 -6341696 -6309442 -6311613 -6285549 -6219940 -6213069 -6167771 -6133684 -6102129 -6063302
9992 -6063302 -6070336 -6089071 -6082968 -6059065 -6049703 -6058093 -6102657 -6120574 -6131822 -6153540 -6137735 -6123505
9980 -6123505 -6132534 -6119277 -6079226 -6056663 -6005171 -5937168 -5897962 -5908105 -5889907 -5855669 -5874835 -5900766
9968 -5900766 -5856960 -5812336 -5839501 -5829582 -5823764 -5834920 -5818576 -5826839 -5830029 -5818806 -5828613 -5812756
9956 -5812756 -5809711 -5802532 -5801172 -5770106 -5758705 -5765873 -5740757 -5720467 -5726268 -5709348 -5685811 -5644671
9944 -5644671 -5603758 -5603306 -5602008 -5591283 -5569316 -5545520 -5553964 -5546345 -5524956 -5482746 -5471305 -5470082 -5444669
9931 -5444669 -5441765 -5421895 -5455586 -5460315 -5437500 -5417978 -5392421 -5363758 -5317503 -5303742 -5342182 -5352057
9919 -5352057 -5341314 -5315302 -5316730 -5288043 -5263926 -5242541 -5222856 -5225677 -5223333 -5233225 -5200175 -5175805
9907 -5175805 -5184596 -5197643 -5257344 -5234584 -5214612 -5245034 -5262521 -5243146 -5209221 -5172318 -5172484 -5177303
9895 -5177303 -5179918 -5177371 -5152377 -5128448 -5097264 -5104197 -5105753 -5101498 -5088499 -5096495 -5085762 -5069804 -5047889
9882 -5047889 -5054677 -5044984 -5005753 -4975198 -4980879 -4955486 -4949044 -4946052 -4919078 -4893676 -4902542 -4895682 -4871602
9869 -4871602 -4857463 -4843752 -4844048 -4840042 -4874563 -4874946 -4865259 -4838402 -4807465 -4806278 -4802399 -4792145 -4785058
9856 -4785058 -4801252 -4767173 -4755162 -4763396 -4754319 -4752787 -4741097 -4734574 -4711459 -4666700 -4679146 -4690976
9844 -4690976 -4708150 -4743306 -4722864 -4687616 -4659470 -4655670 -4666036 -4646819 -4601759 -4568950 -4571910 -4608033
9832 -4608033 -4615191 -4606695 -4612954 -4584221 -4578098 -4547347 -4537698 -4547671 -4554841 -4547565 -4566472 -4566341 -4536108
9819 -4536108 -4522375 -4555995 -4597209 -4587085 -4538356 -4520761 -4492762 -4487634 -4437329 -4451281 -4466155 -4477049
9807 -4477049 -4478128 -4467438 -4447779 -4403161 -4364459 -4343330 -4366403 -4359727 -4357349 -4365323 -4342038 -4326387
9795 -4326387 -4321823 -4299981 -4278626 -4294895 -4289620 -4264677 -4242211 -4238847 -4217590 -4213449 -4208975 -4206203 -4194302
9782 -4194302 -4181520 -4167042 -4147493 -4165209 -4175747 -4122091 -4099738 -4076274 -4076638 -4097049 -4103550 -4116848
9770 -4116848 -4112366 -4122074 -4111529 -4059982 -4059448 -4095482 -4092680 -4082075 -4062979 -4025512 -3994837 -3992855 -4002663
9757 -4002663 -3967295 -3939427 -3955635 -3973810 -3969134 -3937957 -3918835 -3913758 -3934198 -3957681 -3938160 -3943082
9745 -3943082 -3920585 -3883513 -3861349 -3866149 -3871291 -3878863 -3860275 -3873962 -3881850 -3880585 -3862236 -3837614
9733 -3837614 -3820090 -3801290 -3791364 -3766913 -3763537 -3780621 -3777419 -3771245 -3755201 -3737249 -3690908 -3660547
9721 -3660547 -3627410 -3597464 -3620159 -3626413 -3583571 -3557038 -3586942 -3593604 -3558061 -3544346 -3480399 -3439179
9709 -3439179 -3459148 -3464964 -3475055 -3418203 -3378353 -3362223 -3328404 -3323185 -3329972 -3297568 -3286417 -3281053
9697 -3281053 -3234554 -3170509 -3155325 -3122278 -3043370 -2973324 -2926640 -2837489 -2759221 -2763241 -2743596 -2669472
9685 -2669472 -2558396 -2475111 -2432791 -2376430 -2340183 -2307517 -2319950 -2428392 -2703248 -3111771 -3679106
9674 -3679106 -4217270 -4553002 -4669761 -4674192 -4645156 -4607731 -4522200 -4462910 -4386728 -4282125 -4225041
9663 -4225041 -4145957 -4079410 -4019762 -3925464 -3877375 -3819251 -3749956 -3709037 -3685807 -3651964 -3658529 -3680705
9651 -3680705 -3707389 -3803452 -3894702 -3906817 -3861171 -3834511 -3900905 -4045405 -4208395 -4243679 -4201426
9640 -4201426 -4137263 -4066174 -4002119 -3993252 -3948836 -3870949 -3795293 -3728531 -3706580 -3679412 -3685110 -3688210
9628 -3688210 -3636749 -3572118 -3510554 -3504715 -3477561 -3428420 -3388187 -3360877 -3329685 -3331111 -3341023 -3355679
9616 -3355679 -3387450 -3393315 -3410797 -3421991 -3376661 -3325615 -3304750 -3263803 -3197774 -3126004 -3061556 -2978389
9604 -2978389 -2898105 -2804997 -2714600 -2621168 -2557419 -2494234 -2511592 -2621462 -2843357 -3207798 -3755889
9593 -3755889 -4349805 -4723759 -4861483 -4878891 -4864289 -4776782 -4687106 -4587420 -4503146 -4428231 -4402329
9582 -4402329 -4361640 -4274280 -4222697 -4220685 -4217200 -4203559 -4180527 -4164322 -4116670 -4055874 -4038252 -4024348
9570 -4024348 -4025135 -4004659 -3960660 -3910113 -3888301 -3863623 -3847529 -3814158 -3783150 -3765924 -3789887 -3844368
9558 -3844368 -3910850 -4001092 -4051938 -4044355 -4066191 -4063333 -4055024 -4066765 -4042368 -4033713 -4042208 -4026734
9546 -4026734 -4002500 -3965899 -3912831 -3930167 -3914110 -3867244 -3852828 -3801059 -3777929 -3779489 -3790567 -3786387
9534 -3786387 -3786600 -3789133 -3778006 -3746338 -3712963 -3690172 -3670718 -3675550 -3659526 -3665175 -3676946 -3671986 -3667439
9521 -3667439 -3634610 -3620670 -3584910 -3565331 -3575234 -3585577 -3581076 -3586807 -3591201 -3563160 -3637400 -3711702
9509 -3711702 -3733437 -3691138 -3705919 -3746604 -3721676 -3699773 -3655272 -3648288 -3690003 -3684910 -3658526 -3640854
9497 -3640854 -3653067 -3621412 -3586354 -3555451 -3549146 -3561882 -3569147 -3551839 -3525338 -3520237 -3507704 -3495677
9485 -3495677 -3484229 -3486536 -3504138 -3527537 -3512000 -3511581 -3514035 -3496308 -3456084 -3434658 -3455801 -3471151
9473 -3471151 -3464733 -3467631 -3487160 -3473832 -3432593 -3413295 -3415812 -3432939 -3443453 -3453129 -3437949 -3417325
9461 -3417325 -3410733 -3411696 -3409734 -3404903 -3396205 -3399923 -3390552 -3384737 -3368721 -3326355 -3315711 -3361215 -3358091
9448 -3358091 -3310804 -3313283 -3339948 -3318763 -3291065 -3286300 -3289144 -3275765 -3260782 -3237361 -3268697 -3274062
9436 -3274062 -3242674 -3237986 -3215124 -3177258 -3201314 -3229595 -3200336 -3202652 -3227483 -3207190 -3201506 -3192243
9424 -3192243 -3218344 -3240547 -3210844 -3197925 -3192735 -3178024 -3148700 -3143838 -3167934 -3185170 -3188645 -3164215
9412 -3164215 -3119616 -3120466 -3112951 -3165939 -3232378 -3278108 -3294587 -3312512 -3297009 -3245132 -3217142 -3214428
9400 -3214428 -3217390 -3239934 -3232035 -3193916 -3192762 -3192745 -3188331 -3206869 -3206926 -3189354 -3206438 -3170763 -3121880
9387 -3121880 -3105163 -3097655 -3130059 -3161795 -3176831 -3170324 -3154742 -3138417 -3102079 -3091990 -3102214 -3100602
9375 -3100602 -3087751 -3111268 -3084428 -3061824 -3031480 -3035252 -3054293 -3036758 -3002027 -2964369 -2966087 -2985859
9363 -2985859 -3011344 -3001289 -3017726 -3009992 -2964523 -2957193 -2978417 -3024575 -3088277 -3106755 -3085189 -3081168
9351 -3081168 -3086358 -3067558 -3062646 -3077809 -3068888 -3015522 -3002426 -2996297 -3017319 -2997498 -2981235 -2981046 -3011772
9338 -3011772 -3051638 -3046520 -2996395 -2944653 -2924749 -2913255 -2928361 -2960849 -2980015 -2938168 -2904691 -2912459
9326 -2912459 -2910564 -2947907 -2965374 -2940105 -2919143 -2909023 -2891289 -2910096 -2913743 -2909454 -2890001 -2894957
9314 -2894957 -2917567 -2912816 -2883439 -2868260 -2873353 -2858714 -2806353 -2787562 -2811279 -2843335 -2859909 -2814870
9302 -2814870 -2802577 -2808979 -2794963 -2789517 -2790095 -2802240 -2794865 -2752609 -2769008 -2800313 -2806793 -2787973 -2779203
9289 -2779203 -2773887 -2771564 -2774746 -2793666 -2791836 -2768163 -2741356 -2730450 -2746297 -2781646 -2810556 -2801053
9277 -2801053 -2814110 -2791666 -2790571 -2783822 -2778901 -2785415 -2780326 -2776826 -2778708 -2767610 -2755936 -2759755 -2775478
9264 -2775478 -2751350 -2730994 -2707695 -2690311 -2698006 -2721649 -2731082 -2719708 -2692378 -2697632 -2703387 -2691588
9252 -2691588 -2674868 -2666512 -2690550 -2728539 -2704176 -2695890 -2713458 -2715739 -2718531 -2683134 -2674956 -2700734
9240 -2700734 -2655813 -2615830 -2668400 -2735169 -2732638 -2681010 -2671552 -2690212 -2704755 -2702328 -2684488 -2678165
9228 -2678165 -2649784 -2602638 -2600016 -2622026 -2653552 -2640998 -2626754 -2609028 -2606283 -2610345 -2607080 -2594531
9216 -2594531 -2584125 -2619051 -2670899 -2659139 -2641939 -2642675 -2614186 -2614570 -2611172 -2610998 -2611106 -2586295 -2600152
9203 -2600152 -2609231 -2543991 -2514376 -2529562 -2578538 -2579731 -2559157 -2564051 -2539980 -2490013 -2492361 -2524748
9191 -2524748 -2541393 -2542101 -2537795 -2525771 -2521957 -2499981 -2486975 -2471895 -2489069 -2515399 -2513053 -2529621
9179 -2529621 -2542835 -2546423 -2538842 -2526568 -2501246 -2492347 -2498670 -2510309 -2484468 -2485181 -2510230 -2495337 -2474360
9166 -2474360 -2456100 -2470551 -2474501 -2493289 -2484303 -2475310 -2459078 -2480777 -2508133 -2468185 -2431069 -2427917
9154 -2427917 -2453420 -2442092 -2435076 -2442162 -2450807 -2461428 -2452666 -2458823 -2421400 -2370098 -2350929 -2367309
9142 -2367309 -2408695 -2433094 -2438878 -2442537 -2425118 -2402147 -2408094 -2406340 -2422806 -2427305 -2405185 -2383853
9130 -2383853 -2400762 -2398790 -2417938 -2416162 -2406715 -2381000 -2343687 -2351201 -2349926 -2390984 -2411287 -2418334 -2380444
9117 -2380444 -2361854 -2375320 -2357786 -2357321 -2335214 -2329812 -2310707 -2295076 -2268235 -2274234 -2278228 -2292875
9105 -2292875 -2325152 -2321432 -2325296 -2309693 -2320136 -2333551 -2337881 -2336540 -2332462 -2332795 -2289173 -2281146 -2267527
9092 -2267527 -2269574 -2243685 -2226155 -2205291 -2193876 -2202746 -2254155 -2256891 -2269163 -2272636 -2261226 -2248999
9080 -2248999 -2247166 -2244751 -2225003 -2232876 -2252104 -2241758 -2252297 -2256530 -2225150 -2210183 -2215581 -2209186 -2232511
9067 -2232511 -2237557 -2233828 -2215229 -2214321 -2200472 -2186102 -2209090 -2218935 -2182268 -2154116 -2179570 -2188039 -2170707
9054 -2170707 -2158903 -2125919 -2128135 -2129170 -2127596 -2156496 -2114654 -2089585 -2121115 -2117967 -2101678 -2105119
9042 -2105119 -2100061 -2130850 -2155573 -2147368 -2151102 -2123156 -2122117 -2140715 -2155428 -2181920 -2166874 -2130817
9030 -2130817 -2099824 -2107903 -2097503 -2112442 -2106168 -2082243 -2063454 -2053060 -2079346 -2077319 -2049327 -2046530
9018 -2046530 -2037358 -2002017 -1986150 -2002475 -2018990 -2016199 -2036457 -2047269 -2046105 -2035975 -2008847 -1992266
9006 -1992266 -1965130 -1949082 -1943405 -1937667 -1945346 -1952622 -1941100 -1930365 -1944065 -1919915 -1943618 -1943872 -1952065
8993 -1952065 -1973847 -1966561 -1967318 -1957583 -1934218 -1939771 -1942815 -1956807 -1957800 -1895314 -1867940 -1894158 -1887840
8980 -1887840 -1887644 -1865505 -1872038 -1868339 -1873394 -1872883 -1868187 -1874312 -1855255 -1845655 -1844349 -1844991 -1849965 -1847745
8966 -1847745 -1819451 -1799799 -1766649 -1744682 -1783444 -1770696 -1757729 -1764166 -1753457 -1721901 -1732380 -1703778
8954 -1703778 -1674139 -1655918 -1651141 -1659054 -1674420 -1688893 -1703517 -1692664 -1680501 -1686620 -1732080 -1716024
8942 -1716024 -1689842 -1684488 -1700531 -1698964 -1677383 -1682135 -1649407 -1603266 -1578666 -1553661 -1526179 -1513604
8930 -1513604 -1502353 -1517821 -1545306 -1559999 -1570251 -1531261 -1500333 -1508063 -1504322 -1493591 -1462888 -1448695
8918 -1448695 -1418154 -1391132 -1386056 -1349765 -1331406 -1337281 -1313911 -1329359 -1344099 -1331700 -1353215 -1328705
8906 -1328705 -1293099 -1312885 -1296996 -1282833 -1240705 -1214050 -1221832 -1215816 -1175086 -1161664 -1117197 -1077615
8894 -1077615 -1041236 -1031752 -1054985 -1006473 -988746 -987504 -943738 -891308 -874638 -857784 -846223 -801882
8882 -801882 -785645 -768183 -757547 -733304 -703853 -642628 -593953 -557840 -492067 -436663 -420208 -380840
8870 -380840 -343541 -291879 -254833 -229411 -149883 -78039 -41046 -37719 15679 105638 168330 268147
8858 268147 365593 423002 530089 649827 756438 858014 975915 1073052 1232170 1413944
8848 1413944 1578297 1750732 1953190 2145841 2388280 2648342 2942038 3290238 3667936 4049315
8838 4049315 4552326 5173419 5920286 6813374 7877620 9156623 10653626 12306306 13716572
8829 13716572 14125033 12089908 5461849 -5801562 -15068723 -18181935 -17580805 -16002704
8821 -16002704 -14426421 -13044236 -11878922 -10951480 -10186735 -9531741 -8960389 -8467087 -8064680
8812 -8064680 -7720049 -7395925 -7112957 -6897820 -6681206 -6453502 -6287418 -6138240 -6011043 -5856461
8802 -5856461 -5691571 -5512781 -5412444 -5343175 -5226889 -5089438 -4975726 -4890275 -4802683 -4723974
8792 -4723974 -4660848 -4563611 -4481634 -4430057 -4367931 -4317865 -4281870 -4239820 -4153916 -4099283 -4023165
8781 -4023165 -4004080 -4009433 -3994459 -3971879 -3911110 -3870768 -3812656 -3759811 -3760314 -3761095 -3718692 -3656697
8769 -3656697 -3616547 -3586230 -3575896 -3551050 -3531960 -3498226 -3480182 -3502971 -3474172 -3414802 -3400658
8758 -3400658 -3357163 -3343070 -3318847 -3324900 -3326684 -3274700 -3243316 -3255371 -3251421 -3204265 -3189916 -3146934
8746 -3146934 -3104660 -3114107 -3124973 -3132411 -3142682 -3117201 -3089068 -3083203 -3063852 -3041227 -3037735 -3037934 -3036307
8733 -3036307 -3008968 -3012933 -3044738 -3041334 -2990396 -2974040 -2956286 -2934449 -2946370 -2945681 -2918484 -2897690
8721 -2897690 -2903813 -2922878 -2902623 -2872427 -2834469 -2829868 -2810110 -2785798 -2798370 -2812997 -2792691 -2760759
8709 -2760759 -2781328 -2772976 -2767843 -2784629 -2759870 -2757071 -2723958 -2716709 -2708133 -2702811 -2713941 -2713344 -2686497
8696 -2686497 -2699498 -2731032 -2713148 -2675748 -2655637 -2641166 -2633481 -2623540 -2620101 -2664716 -2712385 -2696482
8684 -2696482 -2661969 -2622683 -2605060 -2611560 -2627923 -2653222 -2648969 -2645161 -2636075 -2630552 -2629440 -2583998 -2560125
8671 -2560125 -2585117 -2578974 -2601645 -2623224 -2623238 -2586950 -2536921 -2522064 -2517965 -2485579 -2473147 -2455437
8659 -2455437 -2481349 -2496397 -2495855 -2514725 -2523109 -2508737 -2499116 -2506067 -2545624 -2522163 -2513408 -2512979 -2510326
8646 -2510326 -2500203 -2495566 -2473985 -2479813 -2471132 -2480623 -2473166 -2456934 -2428908 -2418170 -2447027 -2447947 -2490788
8633 -2490788 -2518375 -2495530 -2477560 -2473981 -2464747 -2416132 -2425560 -2431334 -2395364 -2370983 -2383941 -2407266
8621 -2407266 -2427272 -2401801 -2376936 -2353759 -2359799 -2380424 -2383290 -2381258 -2385872 -2381873 -2395292 -2372759
8609 -2372759 -2349409 -2358705 -2367946 -2401690 -2406286 -2425848 -2397838 -2378899 -2347617 -2350915 -2353759 -2324172
8597 -2324172 -2317931 -2334192 -2292521 -2270223 -2283141 -2288279 -2273703 -2248579 -2247307 -2247324 -2291644 -2286161 -2306622
8584 -2306622 -2310782 -2320012 -2322402 -2339214 -2317585 -2304669 -2297589 -2263713 -2235509 -2241850 -2297096 -2332651
8572 -2332651 -2314720 -2289533 -2296307 -2293230 -2274711 -2225046 -2217892 -2247056 -2277778 -2285984 -2250750 -2243713
8560 -2243713 -2226866 -2250867 -2283221 -2253453 -2231189 -2232533 -2240288 -2208736 -2199419 -2189277 -2233527 -2259240
8548 -2259240 -2276871 -2271961 -2298936 -2281322 -2258004 -2268007 -2256654 -2228607 -2243041 -2269679 -2303716 -2282771
8536 -2282771 -2267807 -2230405 -2203508 -2218222 -2228590 -2214717 -2204070 -2200459 -2174726 -2172423 -2181233 -2177723
8524 -2177723 -2144095 -2125248 -2117561 -2116460 -2126044 -2152195 -2169477 -2183347 -2188573 -2184809 -2146918 -2113773
8512 -2113773 -2102817 -2101076 -2129317 -2171086 -2159100 -2140282 -2152790 -2149595 -2147657 -2145703 -2149720 -2190009
8500 -2190009 -2205366 -2187806 -2177003 -2153689 -2165910 -2177005 -2163413 -2175976 -2187832 -2189681 -2190748 -2156168
8488 -2156168 -2108367 -2146884 -2162869 -2167339 -2156932 -2121709 -2064905 -2069394 -2079515 -2083125 -2082952 -2102857
8476 -2102857 -2106758 -2116117 -2117402 -2079837 -2069624 -2098499 -2132511 -2117034 -2060255 -2031357 -2039179 -2073188
8464 -2073188 -2096948 -2127505 -2121239 -2098586 -2123159 -2076997 -2067311 -2053124 -2055287 -2078330 -2078527 -2071199 -2052516
8451 -2052516 -2030903 -2074529 -2081337 -2113893 -2103072 -2113509 -2099858 -2090668 -2081696 -2069286 -2106300 -2111393
8439 -2111393 -2073781 -2057988 -2054849 -2095801 -2100657 -2116669 -2102857 -2066515 -2068497 -2076869 -2052729 -2039599
8427 -2039599 -2028316 -2023472 -2064136 -2069473 -2061335 -2075628 -2076339 -2081695 -2050793 -2028012 -2044389 -2080641 -2100358
8414 -2100358 -2081544 -2057671 -2081611 -2083509 -2065815 -2057072 -2014350 -2002495 -2029681 -2041618 -2022905 -2029215
8402 -2029215 -2024145 -2006292 -2033795 -2054529 -2036078 -2047663 -2066741 -2062028 -2063777 -2042010 -2002265 -2002419
8390 -2002419 -2016756 -2005073 -1974901 -1905868 -1890132 -1914641 -1982352 -2009579 -2009320 -2004001 -1996636 -1994159
8378 -1994159 -1977708 -1984656 -1973004 -1948827 -1965487 -1990681 -2021916 -2011069 -1994670 -1966402 -1911360 -1907908
8366 -1907908 -1952159 -1974494 -2009423 -2021520 -1983893 -1962017 -1975097 -1955479 -1976521 -1977681 -1964495 -1972014
8354 -1972014 -1953263 -1931119 -1938415 -1939419 -1915916 -1941279 -1984226 -2018005 -2008930 -2012340 -1998283 -1964595
8342 -1964595 -1926944 -1904984 -1912605 -1966663 -2021386 -2009835 -1992132 -1961501 -1976745 -2012735 -2003172 -1989368
8330 -1989368 -1953733 -1949817 -1961373 -1962864 -1945329 -1938983 -1939678 -1952569 -1976610 -1999601 -1994097 -1983336 -1974464
8317 -1974464 -1952026 -1914299 -1879200 -1886706 -1933111 -1968162 -1994731 -1958253 -1913497 -1917428 -1918963 -1906740
8305 -1906740 -1923537 -1944875 -1949566 -1914846 -1877876 -1879523 -1900534 -1913176 -1882713 -1879355 -1877862 -1869027
8293 -1869027 -1906725 -1915307 -1887089 -1910859 -1908730 -1920248 -1930094 -1929662 -1894986 -1885919 -1907591 -1868357 -1861055
8280 -1861055 -1852606 -1862303 -1882585 -1894811 -1883082 -1880967 -1875660 -1875305 -1880242 -1920867 -1888885 -1909080 -1893410
8267 -1893410 -1903687 -1907779 -1906331 -1900201 -1866445 -1869904 -1880945 -1886462 -1881903 -1851459 -1866301 -1869806 -1854174
8254 -1854174 -1846613 -1841351 -1857513 -1878060 -1877996 -1878828 -1872032 -1865951 -1851502 -1841808 -1835216 -1836324 -1822569 -1808575
8240 -1808575 -1807925 -1854182 -1878818 -1875927 -1894582 -1905585 -1891677 -1872677 -1836381 -1811079 -1818007 -1824724
8228 -1824724 -1821022 -1821409 -1820196 -1844165 -1878340 -1897651 -1889252 -1887915 -1890315 -1828840 -1826723 -1795550 -1798655
8215 -1798655 -1785912 -1770508 -1768742 -1827718 -1852479 -1839654 -1792647 -1790622 -1804182 -1804092 -1805973 -1829283 -1831636
8202 -1831636 -1860142 -1876378 -1836346 -1808754 -1821107 -1828102 -1836856 -1789763 -1773357 -1797892 -1806453 -1824742
8190 -1824742 -1807335 -1815817 -1847074 -1841441 -1799275 -1832194 -1851776 -1836443 -1778915 -1775171 -1792265 -1819293
8178 -1819293 -1819150 -1793280 -1795564 -1811882 -1818415 -1841416 -1840446 -1812119 -1785157 -1780657 -1815045 -1806409 -1800969
8165 -1800969 -1795241 -1769541 -1726509 -1737585 -1749931 -1757514 -1795771 -1764174 -1754653 -1733283 -1752452 -1761889
8153 -1761889 -1764305 -1767237 -1762186 -1759682 -1751523 -1770693 -1756586 -1741446 -1755287 -1770895 -1763046 -1771278 -1755502
8140 -1755502 -1755142 -1799069 -1816840 -1813007 -1797966 -1778118 -1781011 -1803108 -1803702 -1761792 -1758951 -1788456 -1746277
8127 -1746277 -1719166 -1740692 -1776949 -1746174 -1755084 -1764431 -1807905 -1811180 -1814742 -1812727 -1799406 -1788806
8115 -1788806 -1764299 -1748000 -1764071 -1735453 -1753674 -1775951 -1794694 -1781792 -1741324 -1727672 -1759211
8104 -1759211 -1761204 -1775027 -1746580 -1769501 -1778583 -1762112 -1711250 -1711032 -1715210 -1753372 -1767794 -1758338 -1753212
8091 -1753212 -1746321 -1748254 -1754930 -1803837 -1794927 -1772170 -1768213 -1776199 -1783444 -1770598 -1751880 -1736994 -1726680
8078 -1726680 -1752958 -1766537 -1746352 -1759232 -1748715 -1724154 -1686377 -1679453 -1734059 -1747951 -1720096 -1682331
8066 -1682331 -1647042 -1662674 -1676979 -1695733 -1688580 -1669455 -1673044 -1690940 -1709281 -1697637 -1675442 -1645157
8054 -1645157 -1663280 -1675153 -1697813 -1713780 -1718701 -1733495 -1744918 -1723964 -1703606 -1730816 -1726144 -1712200
8042 -1712200 -1708031 -1726881 -1756848 -1760311 -1707977 -1667386 -1719264 -1693759 -1695273 -1709731 -1713057 -1685839
8030 -1685839 -1704408 -1706093 -1671243 -1654737 -1665244 -1669005 -1670276 -1657294 -1687727 -1708043 -1726573 -1714396
8018 -1714396 -1709851 -1670061 -1655439 -1707180 -1724205 -1721008 -1674727 -1640339 -1635118 -1617790 -1591250 -1600437
8006 -1600437 -1610553 -1625444 -1631845 -1663342 -1668574 -1664806 -1687646 -1700397 -1690303 -1653101 -1669128 -1671859
7994 -1671859 -1666665 -1693517 -1719552 -1738617 -1724576 -1702471 -1705179 -1705559 -1703313 -1679638 -1645781 -1636015 -1611758
7981 -1611758 -1568330 -1582968 -1625723 -1628219 -1631908 -1670598 -1698438 -1691306 -1681884 -1677683 -1677874 -1677356 -1693093
7968 -1693093 -1681741 -1660196 -1627232 -1592512 -1587796 -1622519 -1641886 -1655660 -1671418 -1696146 -1671058 -1667022
7956 -1667022 -1648627 -1651517 -1698249 -1671559 -1646302 -1651458 -1650976 -1647765 -1665059 -1681191 -1654171 -1640547
7944 -1640547 -1636276 -1621271 -1624333 -1668383 -1638551 -1653746 -1645403 -1616254 -1616810 -1616186 -1632467 -1649980 -1651958
7931 -1651958 -1657793 -1668367 -1653387 -1656714 -1657532 -1677001 -1693578 -1698324 -1740166 -1690245 -1643036 -1643620 -1641915
7918 -1641915 -1636205 -1659460 -1662918 -1665588 -1638635 -1634121 -1621085 -1615663 -1640774 -1646405 -1668692 -1672375 -1652473
7905 -1652473 -1626182 -1629791 -1644335 -1641906 -1662777 -1696010 -1692879 -1661334 -1674019 -1687693 -1634593 -1614007
7893 -1614007 -1590210 -1579361 -1628166 -1668320 -1657234 -1649969 -1626772 -1585284 -1583952 -1594113 -1612172 -1598331
7881 -1598331 -1573507 -1587391 -1619245 -1625529 -1620306 -1574177 -1565606 -1569538 -1593051 -1575734 -1556451 -1560850
7869 -1560850 -1576140 -1579509 -1580222 -1592435 -1576775 -1521556 -1490802 -1527589 -1593260 -1604430 -1579424 -1595346
7857 -1595346 -1604918 -1600347 -1614794 -1592216 -1626565 -1653130 -1668458 -1645469 -1586602 -1581144 -1642292 -1635826
7845 -1635826 -1618652 -1616743 -1594105 -1590661 -1568949 -1548925 -1581843 -1614285 -1604010 -1581662 -1596906 -1586166
7833 -1586166 -1564760 -1591716 -1587539 -1584206 -1584190 -1604523 -1591257 -1567826 -1583714 -1594039 -1578157 -1545397
7821 -1545397 -1552325 -1581784 -1595690 -1585393 -1573887 -1568148 -1576184 -1599511 -1595657 -1575587 -1565564 -1575955
7809 -1575955 -1603074 -1590494 -1572131 -1574270 -1585825 -1565588 -1580111 -1580034 -1567068 -1582220 -1572718 -1538886
7797 -1538886 -1519753 -1546296 -1561107 -1568868 -1577671 -1561253 -1510242 -1491685 -1493015 -1537735 -1561590 -1564093
7785 -1564093 -1557303 -1567921 -1569751 -1552422 -1533773 -1537082 -1522992 -1542531 -1574542 -1582387 -1556833 -1546571
7773 -1546571 -1538877 -1564681 -1555623 -1523508 -1510182 -1517451 -1509239 -1528096 -1533185 -1519686 -1522970 -1547422 -1556101
7760 -1556101 -1576485 -1585740 -1566543 -1562726 -1551164 -1556835 -1574738 -1552233 -1560094 -1540195 -1535411 -1554581
7748 -1554581 -1542134 -1537122 -1538328 -1572378 -1566730 -1562782 -1526171 -1503307 -1498594 -1522526 -1538236 -1526537
7736 -1526537 -1495938 -1495907 -1494467 -1486108 -1503068 -1500832 -1498657 -1507071 -1509552 -1501689 -1489974 -1485362 -1479857 -1489082
7722 -1489082 -1517064 -1493593 -1444747 -1449605 -1461523 -1472913 -1498984 -1509477 -1484120 -1505490 -1516291 -1522473
7710 -1522473 -1520185 -1468860 -1479985 -1458579 -1454226 -1452433 -1451089 -1478642 -1489437 -1486905 -1490669 -1527031 -1524240
7697 -1524240 -1509424 -1504839 -1486553 -1480657 -1476697 -1459212 -1469826 -1476480 -1477639 -1480705 -1486986 -1459981 -1438656
7684 -1438656 -1446861 -1465114 -1471719 -1484302 -1502625 -1504818 -1531292 -1538842 -1485089 -1457350 -1461909 -1471755 -1464113
7671 -1464113 -1459431 -1467731 -1476400 -1455281 -1451990 -1467435 -1484090 -1468438 -1453742 -1459663 -1462273 -1500245 -1529169
7658 -1529169 -1510707 -1493389 -1464386 -1427998 -1426490 -1459305 -1482428 -1479193 -1455539 -1447792 -1453024 -1472766
7646 -1472766 -1480195 -1499480 -1510869 -1518381 -1504377 -1496533 -1474028 -1470954 -1461409 -1477700 -1514231 -1530847
7634 -1530847 -1483098 -1443674 -1427341 -1434630 -1445114 -1459093 -1452313 -1430621 -1448479 -1502000 -1529677 -1501579
7622 -1501579 -1476803 -1453288 -1417999 -1418056 -1428241 -1420925 -1436844 -1467285 -1467448 -1477975 -1462796 -1450891 -1466737
7609 -1466737 -1448577 -1434598 -1425411 -1457763 -1442106 -1437108 -1458266 -1437138 -1450037 -1453137 -1482461 -1486153
7597 -1486153 -1491437 -1499127 -1545908 -1549652 -1494471 -1465418 -1470872 -1464167 -1460994 -1485935 -1468455 -1455109 -1458279
7584 -1458279 -1484199 -1493049 -1465891 -1430020 -1441237 -1464813 -1490587 -1470802 -1463594 -1447085 -1426748 -1457752
7572 -1457752 -1461991 -1445887 -1444565 -1463814 -1463400 -1468839 -1455555 -1422767 -1391829 -1410565 -1437038 -1433701 -1402860
7559 -1402860 -1436487 -1420849 -1399650 -1407159 -1398817 -1405998 -1406891 -1407142 -1428707 -1405966 -1396938 -1398355 -1424316
7546 -1424316 -1446842 -1442537 -1423630 -1439094 -1430577 -1420995 -1412265 -1437396 -1434851 -1451829 -1464796 -1416170
7534 -1416170 -1403780 -1412314 -1415972 -1435521 -1469727 -1477273 -1468755 -1443370 -1429554 -1424957 -1397513 -1389491 -1411159
7521 -1411159 -1431266 -1430836 -1417821 -1408766 -1371748 -1340907 -1360898 -1372666 -1371910 -1376523 -1378143 -1380883 -1360745
7508 -1360745 -1373821 -1399147 -1393531 -1384096 -1426800 -1447976 -1469383 -1450819 -1401253 -1369253 -1337066 -1340634
7496 -1340634 -1406092 -1445876 -1437123 -1424192 -1423407 -1426029 -1423602 -1401628 -1404069 -1442270 -1442904 -1442155 -1399144
7483 -1399144 -1385026 -1413009 -1451000 -1476182 -1506089 -1496475 -1437661 -1390849 -1399469 -1396417 -1387736 -1418600
7471 -1418600 -1418652 -1409487 -1412669 -1421690 -1417132 -1429979 -1425134 -1390271 -1362785 -1325539 -1349307 -1347272 -1346143
7458 -1346143 -1316790 -1317384 -1346054 -1362628 -1424439 -1406689 -1389385 -1394357 -1422015 -1421536 -1401773 -1386952
7446 -1386952 -1376063 -1357707 -1341356 -1343918 -1359878 -1380099 -1399867 -1391172 -1382067 -1394288 -1402768 -1401507
7434 -1401507 -1368058 -1369188 -1343446 -1370617 -1369437 -1389635 -1446158 -1437632 -1418918 -1411970 -1423223 -1415374
7422 -1415374 -1435615 -1391117 -1370212 -1384719 -1377019 -1326356 -1303979 -1333607 -1351330 -1370945 -1393943 -1381807
7410 -1381807 -1358248 -1342965 -1326179 -1338977 -1358489 -1384607 -1382271 -1334887 -1299707 -1332715 -1356155 -1342923
7398 -1342923 -1334404 -1377620 -1402208 -1397393 -1413344 -1426940 -1379441 -1376769 -1404221 -1401228 -1382672 -1335164
7386 -1335164 -1334519 -1330140 -1322844 -1328577 -1363031 -1365291 -1326903 -1307218 -1328126 -1352309 -1349617 -1345606 -1354500
7373 -1354500 -1361257 -1346596 -1332812 -1339766 -1324325 -1326429 -1329073 -1314435 -1312090 -1341588 -1395349 -1384780
7361 -1384780 -1353139 -1321408 -1303008 -1288786 -1334671 -1358910 -1359539 -1370473 -1381980 -1399002 -1377304 -1359063
7349 -1359063 -1314020 -1307198 -1307784 -1345147 -1351473 -1351889 -1356139 -1354658 -1369875 -1380360 -1357605 -1347303 -1338851
7336 -1338851 -1339379 -1348581 -1323229 -1350308 -1371251 -1374730 -1366082 -1356212 -1357806 -1348936 -1330541 -1352709 -1359919
7323 -1359919 -1365290 -1361753 -1343090 -1351958 -1362164 -1342750 -1367904 -1370303 -1391459 -1388848 -1377607 -1376412 -1367795
7310 -1367795 -1359976 -1310924 -1294511 -1295212 -1331558 -1343917 -1314482 -1310547 -1336084 -1356300 -1354157 -1337071
7298 -1337071 -1336949 -1333590 -1358263 -1330135 -1329229 -1367647 -1356374 -1333691 -1346834 -1330669 -1298804 -1303434 -1308473
7285 -1308473 -1302811 -1308435 -1328652 -1355135 -1385399 -1368621 -1356499 -1310711 -1297185 -1321309 -1318914 -1312152
7273 -1312152 -1302395 -1304169 -1284046 -1260743 -1274624 -1267213 -1268547 -1262506 -1272420 -1324659 -1339316 -1348436 -1315955
7260 -1315955 -1269145 -1227425 -1252712 -1282346 -1336342 -1345613 -1326657 -1309819 -1286635 -1270040 -1267236 -1296871
7248 -1296871 -1321897 -1299263 -1298424 -1332777 -1303710 -1312324 -1330500 -1319231 -1345352 -1344394 -1305534 -1295233
7236 -1295233 -1306751 -1267538 -1242816 -1261251 -1248502 -1254921 -1275151 -1295561 -1311477 -1307237 -1295258 -1307181
7224 -1307181 -1306934 -1289112 -1289324 -1291541 -1265252 -1264468 -1271758 -1294143 -1311641 -1297743 -1277716 -1257840 -1263373
7211 -1263373 -1276900 -1290640 -1285965 -1298055 -1283619 -1306588 -1331489 -1294257 -1255486 -1277190 -1284741 -1286314
7199 -1286314 -1273506 -1278996 -1241394 -1246064 -1277089 -1263804 -1282988 -1303750 -1318296 -1295755 -1269882 -1278908
7187 -1278908 -1294023 -1311349 -1302572 -1305476 -1313509 -1293765 -1261476 -1257785 -1260622 -1281631 -1294091 -1299885 -1311682
7174 -1311682 -1305713 -1274557 -1294996 -1330903 -1372794 -1365461 -1348097 -1334433 -1325508 -1320141 -1290248 -1278980
7162 -1278980 -1292874 -1296254 -1239009 -1223241 -1222525 -1239900 -1286433 -1298218 -1265245 -1268312 -1259037 -1263456 -1274962
7149 -1274962 -1262325 -1232049 -1245170 -1236165 -1241009 -1240682 -1243181 -1277798 -1301365 -1310321 -1279913 -1293499 -1301279
7136 -1301279 -1292219 -1274303 -1269750 -1230968 -1221065 -1224875 -1240625 -1288233 -1285936 -1270000 -1246903 -1228301
7124 -1228301 -1235599 -1237009 -1232296 -1295393 -1279420 -1235562 -1222459 -1225942 -1270587 -1282067 -1297686 -1282525
7112 -1282525 -1270346 -1263929 -1262133 -1240582 -1277707 -1306085 -1295616 -1276428 -1265763 -1288859 -1294742 -1273407
7100 -1273407 -1252970 -1256475 -1271471 -1276344 -1263209 -1264650 -1263816 -1279763 -1271885 -1233332 -1246142 -1244978 -1254502
7087 -1254502 -1252416 -1274576 -1264700 -1263400 -1258746 -1217975 -1243059 -1275867 -1284636 -1272957 -1265735 -1260563 -1244454
7074 -1244454 -1263538 -1289087 -1260756 -1227807 -1227481 -1257583 -1247135 -1258210 -1256280 -1246606 -1242470 -1261104
7062 -1261104 -1281164 -1296963 -1289688 -1292120 -1268467 -1262419 -1247638 -1214170 -1216577 -1240945 -1254580 -1253967 -1268455
7049 -1268455 -1260191 -1267351 -1249265 -1227756 -1225935 -1259920 -1250647 -1245528 -1227946 -1223256 -1242006 -1245673 -1215279
7036 -1215279 -1213076 -1203481 -1169788 -1176747 -1231426 -1272580 -1282391 -1303286 -1290674 -1253531 -1249980 -1268768
7024 -1268768 -1242705 -1206060 -1198123 -1191561 -1208645 -1233486 -1214039 -1219599 -1223538 -1227701 -1240698 -1234380 -1246559
7011 -1246559 -1234977 -1211772 -1250270 -1250145 -1254744 -1243535 -1222387 -1234676 -1245030 -1240262 -1227511 -1253861
6999 -1253861 -1252769 -1220767 -1209035 -1203636 -1191891 -1200188 -1251043 -1239784 -1239840 -1250307 -1245893 -1255693 -1280126
6986 -1280126 -1279634 -1260551 -1235277 -1223821 -1227285 -1254586 -1242395 -1234522 -1193855 -1156476 -1192441 -1230101
6974 -1230101 -1254163 -1263833 -1264529 -1219217 -1188150 -1194263 -1179933 -1189243 -1206539 -1201774 -1178901 -1154854 -1150455
6961 -1150455 -1180204 -1157900 -1180375 -1225696 -1244307 -1242102 -1228231 -1207228 -1199390 -1192202 -1163478 -1165897
6949 -1165897 -1173180 -1180373 -1195065 -1228386 -1230306 -1232847 -1206161 -1178888 -1160778 -1147729 -1155616 -1201245
6937 -1201245 -1238697 -1237605 -1229663 -1248657 -1244998 -1197707 -1190996 -1151046 -1153671 -1178225 -1190878 -1209926
6925 -1209926 -1195106 -1190284 -1215173 -1241688 -1231697 -1189966 -1161962 -1151130 -1122221 -1085260 -1078394 -1097788
6913 -1097788 -1118799 -1108086 -1128090 -1166826 -1198570 -1160005 -1145454 -1135936 -1141329 -1134790 -1143108 -1148984
6901 -1148984 -1160159 -1155852 -1159887 -1166973 -1167290 -1188970 -1241252 -1235948 -1181622 -1175636 -1200424 -1205525 -1190210
6888 -1190210 -1186818 -1236554 -1252547 -1200780 -1184457 -1203008 -1200869 -1215840 -1217238 -1193839 -1194748 -1190418 -1173182
6875 -1173182 -1187637 -1181599 -1187638 -1206085 -1201027 -1205004 -1215793 -1209995 -1224127 -1268385 -1271625 -1233157 -1204747
6862 -1204747 -1203356 -1210953 -1215182 -1199402 -1185058 -1165854 -1162718 -1153383 -1188289 -1184633 -1202184 -1215157 -1207360
6849 -1207360 -1230697 -1223601 -1207866 -1202853 -1192668 -1170461 -1196780 -1178187 -1168046 -1195491 -1206156 -1191968
6837 -1191968 -1202154 -1213736 -1203980 -1218484 -1226012 -1245202 -1238157 -1212296 -1179830 -1154822 -1158741 -1179760
6825 -1179760 -1182814 -1176243 -1174166 -1143593 -1154776 -1162723 -1193124 -1213913 -1193133 -1182530 -1173446 -1187806
6813 -1187806 -1186988 -1176612 -1166069 -1196974 -1191428 -1201949 -1204555 -1181943 -1146881 -1132037 -1169927 -1198359
6801 -1198359 -1165447 -1178921 -1168392 -1142642 -1117485 -1119024 -1172015 -1199021 -1178840 -1170589 -1177910 -1200285
6789 -1200285 -1198313 -1170220 -1140225 -1141599 -1137151 -1157956 -1160127 -1173424 -1190960 -1165068 -1202868 -1219278
6777 -1219278 -1210870 -1197491 -1189403 -1177784 -1187278 -1176785 -1195629 -1201366 -1200161 -1196021 -1217360 -1173044 -1163623
6764 -1163623 -1209457 -1187985 -1182636 -1204929 -1201475 -1208317 -1194037 -1152220 -1137520 -1149979 -1178813 -1176502
6752 -1176502 -1173872 -1164246 -1145832 -1162714 -1196153 -1187550 -1178918 -1177032 -1149044 -1129400 -1163258 -1166835 -1158530
6739 -1158530 -1118903 -1117371 -1134883 -1135038 -1129129 -1158023 -1160599 -1125166 -1101548 -1104977 -1136800 -1171051 -1173135
6726 -1173135 -1160904 -1174496 -1169770 -1161423 -1159866 -1161340 -1154659 -1168939 -1182776 -1178186 -1159208 -1134627 -1140452
6713 -1140452 -1132261 -1099505 -1111443 -1132292 -1129557 -1128225 -1126015 -1118648 -1147394 -1147577 -1135455 -1143931 -1154552
6700 -1154552 -1146321 -1149111 -1141337 -1144345 -1148679 -1147989 -1149000 -1141354 -1111208 -1115416 -1134727 -1145858 -1131344
6687 -1131344 -1145232 -1181708 -1200410 -1196117 -1189634 -1187441 -1165684 -1125779 -1157279 -1185444 -1188500 -1189257 -1157391
6674 -1157391 -1148396 -1147233 -1140438 -1126683 -1129266 -1116922 -1131478 -1145079 -1122529 -1125607 -1149325 -1175321
6662 -1175321 -1159265 -1121821 -1134266 -1151766 -1168180 -1158183 -1163201 -1154851 -1151417 -1105338 -1105881 -1119143 -1149939
6649 -1149939 -1166046 -1150270 -1128261 -1108502 -1129955 -1170976 -1140472 -1101223 -1083630 -1072677 -1092201
6638 -1092201 -1073214 -1065580 -1065380 -1102106 -1145717 -1164054 -1133430 -1127088 -1124137 -1100508 -1107879 -1087426 -1108688
6625 -1108688 -1118185 -1118955 -1108367 -1108800 -1119930 -1130215 -1119205 -1091522 -1104296 -1148539 -1148716 -1139247 -1137842
6612 -1137842 -1128885 -1125517 -1126996 -1118023 -1135975 -1176747 -1146990 -1126276 -1132699 -1093509 -1094466 -1109414 -1129971
6599 -1129971 -1140919 -1152838 -1124861 -1119076 -1149478 -1169955 -1167590 -1135836 -1128527 -1136359 -1115495 -1111070
6587 -1111070 -1108360 -1115139 -1131839 -1137297 -1159761 -1146768 -1147602 -1168468 -1129108 -1127631 -1126686 -1145124 -1134560
6574 -1134560 -1113115 -1140218 -1132590 -1122534 -1091069 -1092981 -1114188 -1112988 -1128923 -1130585 -1122809 -1114321 -1107185
6561 -1107185 -1071323 -1034824 -1048102 -1066903 -1092012 -1075545 -1066120 -1046375 -1074567 -1086010 -1087365 -1086985
6549 -1086985 -1080619 -1055883 -1065293 -1080722 -1075892 -1083030 -1101262 -1112503 -1116970 -1123711 -1125579 -1128516 -1099116
6536 -1099116 -1084995 -1085258 -1077098 -1108265 -1117298 -1115209 -1130222 -1154272 -1138071 -1141858 -1136973 -1118881 -1097115
6523 -1097115 -1081925 -1073158 -1068901 -1078835 -1080382 -1090989 -1095163 -1079888 -1072195 -1112903 -1109849 -1091096 -1066673
6510 -1066673 -1040567 -1022979 -1041739 -1046408 -1063674 -1094344 -1096323 -1122610 -1119430 -1090397 -1085685 -1074779
6498 -1074779 -1087411 -1124801 -1112468 -1127108 -1131489 -1125028 -1115036 -1128526 -1131787 -1096097 -1114930 -1129107
6486 -1129107 -1111746 -1134089 -1128578 -1109773 -1091544 -1140008 -1143901 -1170225 -1136998 -1086217 -1090404 -1111223
6474 -1111223 -1118513 -1107498 -1114211 -1100906 -1054701 -1047934 -1049644 -1023494 -1013101 -1039135 -1091188 -1094581
6462 -1094581 -1086405 -1109835 -1112097 -1085556 -1081402 -1105942 -1094695 -1088255 -1095355 -1125531 -1118217 -1132254 -1153300
6449 -1153300 -1130732 -1079147 -1069925 -1081968 -1104242 -1103984 -1086588 -1090028 -1057305 -1038571 -1017816 -1011661
6437 -1011661 -1022410 -1051589 -1048128 -1039525 -1060040 -1053985 -1058492 -1038051 -1030836 -1046545 -1072563 -1097382
6425 -1097382 -1076503 -1079416 -1086179 -1070241 -1079431 -1063084 -1053912 -1057891 -1067243 -1039572 -1000790 -1026952 -1055047
6412 -1055047 -1062055 -1059202 -1069344 -1064345 -1021076 -1028409 -1056974 -1075222 -1075993 -1063409 -1052731 -1056497 -1057985
6399 -1057985 -1061538 -1063000 -1032672 -1036820 -1033055 -1055129 -1074519 -1084853 -1092541 -1075521 -1055482 -1034502
6387 -1034502 -1027850 -1026879 -1066281 -1076379 -1081667 -1065987 -1058629 -1053702 -1085743 -1091943 -1073204 -1048018 -1055694
6374 -1055694 -1084724 -1063730 -1031960 -1015979 -1038897 -1048407 -1036616 -1037108 -1044580 -1029486 -991911 -1033169
6362 -1033169 -1069574 -1053681 -1056164 -1042967 -1039139 -1075002 -1102268 -1124258 -1149906 -1143805 -1099131 -1055271
6350 -1055271 -1077426 -1094366 -1057785 -1038465 -1013373 -985082 -968980 -1017319 -1051115 -1055423 -1048670 -1084870
6338 -1084870 -1093800 -1095357 -1080109 -1084950 -1077243 -1074023 -1062040 -1021887 -1023370 -1025026 -996912 -990268 -1013227
6325 -1013227 -1025641 -987868 -997858 -1012720 -1023461 -1042263 -1047071 -1036269 -1058646 -1080877 -1078350 -1073403
6313 -1073403 -1065725 -1060107 -1057255 -1057256 -1028797 -1025846 -1038649 -1061273 -1081717 -1102474 -1097200 -1075545 -1085301
6300 -1085301 -1078875 -1049234 -1072466 -1060472 -1038857 -1044499 -1058517 -1062248 -1043855 -1034040 -993410 -1003389
6288 -1003389 -1016995 -1000095 -1000231 -1040850 -1063150 -1038789 -1031643 -1042472 -1069845 -1061531 -1040235 -1030029
6276 -1030029 -1021322 -1024246 -1027780 -1030215 -1080687 -1082233 -1061096 -1072200 -1080494 -1036141 -1004840 -1003439 -1054541
6263 -1054541 -1088282 -1089361 -1078543 -1035171 -1007118 -1020307 -1036080 -1025430 -1006103 -1003239 -1011119 -1021834
6251 -1021834 -1007329 -997650 -991988 -990519 -990769 -959845 -995170 -962950 -975458 -977411 -1000080 -1004428 -1015996
6238 -1015996 -1034092 -1037930 -1076798 -1077230 -1038539 -1003980 -961335 -951787 -964753 -1001415 -1013098 -1024393
6226 -1024393 -1028982 -1003843 -1012564 -1030249 -1016480 -997617 -994756 -986445 -983350 -982834 -1008103 -1029318 -1030101
6213 -1030101 -1016339 -1007077 -1025828 -1091831 -1097992 -1060029 -1085363 -1106016 -1069617 -1033168 -1049724 -1050390
6201 -1050390 -1015568 -987876 -1009676 -1024262 -1035228 -1049865 -1058315 -1060594 -1036998 -1011134 -1002356 -1005949
6189 -1005949 -991821 -1003858 -1040067 -1054952 -1035460 -1030557 -1021488 -986762 -955925 -967655 -1001268 -987087
6177 -987087 -984390 -996143 -1010664 -1000520 -988623 -981314 -986847 -972986 -988834 -1026839 -1048761 -1038910
6165 -1038910 -1032485 -1039874 -1060543 -1062619 -1041933 -1013667 -988753 -993007 -1025759 -1036269 -990101 -972299
6153 -972299 -998769 -1032187 -1031133 -1020485 -998658 -1043475 -1060846 -1027205 -1010644 -1005254 -1019723 -1008778
6141 -1008778 -1032278 -1043706 -1031618 -1038747 -1074657 -1063633 -1040385 -1054365 -1053007 -1051054 -1039576 -1032469
6129 -1032469 -1054340 -1040086 -1036735 -1018918 -1002666 -1011373 -997224 -1015325 -1019103 -1049859 -1073018 -1083401
6117 -1083401 -1044429 -1012814 -966798 -972994 -1027065 -1035585 -1031422 -1031864 -1032681 -1007310 -981365 -979251 -980291
6104 -980291 -1022294 -1047279 -1032601 -1039572 -1035311 -1039181 -1038291 -991206 -967593 -1008212 -1035415 -1027248 -1033942
6091 -1033942 -1013345 -1005671 -991483 -997697 -1002974 -1027503 -1017148 -1003717 -1015351 -1031649 -1037054 -993651
6079 -993651 -945768 -954716 -1000362 -1003403 -1021209 -1025124 -989787 -977691 -1027201 -1062045 -1059516 -1021400
6067 -1021400 -984471 -989566 -1023117 -1007857 -955135 -916376 -929479 -972703 -985352 -996882 -960680 -971454
6055 -971454 -1023561 -1047091 -1048480 -1053082 -1048074 -1021276 -994009 -964475 -936724 -962844 -985793 -1005390
6043 -1005390 -1027520 -1029021 -1026895 -999184 -953052 -961682 -1001432 -1000285 -979411 -981310 -951954 -936868
6031 -936868 -977163 -1011534 -1016880 -1004614 -1020087 -1040740 -1041222 -1022567 -1017759 -1017926 -1013725 -988415 -997729
6018 -997729 -1029951 -1044804 -1045206 -1014970 -991363 -1010292 -1029343 -1015808 -1023720 -1014630 -1029542 -1003851
6006 -1003851 -991821 -954105 -959327 -992154 -981847 -979076 -977157 -983397 -981137 -986151 -1016405 -1014209 -1041200
5993 -1041200 -1033117 -1019127 -990906 -990627 -1019795 -1003766 -940699 -917462 -966537 -1000041 -972426 -977856
5981 -977856 -964098 -947522 -970999 -969391 -963953 -983402 -1018230 -1037768 -1033342 -1024141 -1060661 -1079367
5969 -1079367 -1040556 -1010245 -1003543 -1023066 -1059382 -1056417 -1016150 -968359 -929088 -934593 -963874 -950239
5957 -950239 -985646 -983862 -942930 -918928 -920784 -944936 -981781 -1014685 -998008 -981971 -978965 -974366
5945 -974366 -953254 -950240 -924818 -959280 -997324 -1005121 -991768 -986780 -982013 -962079 -964109 -991605 -981439
5932 -981439 -974423 -976809 -932615 -924670 -941429 -970962 -953642 -939683 -974861 -982775 -961221 -951885 -970937
5919 -970937 -1009697 -998641 -986867 -978011 -989335 -988716 -1006843 -1021751 -1014065 -1000505 -1003416 -1015087 -1011995
5906 -1011995 -993436 -1003344 -983613 -966577 -1004384 -1003063 -962908 -917772 -877238 -868114 -896279 -918794
5894 -918794 -928681 -922372 -945505 -987236 -996431 -993587 -987881 -965701 -939641 -934827 -949385 -943451 -947984
5881 -947984 -952511 -933948 -920206 -921859 -923904 -945635 -986676 -957037 -913473 -926369 -950953 -980469
5869 -980469 -985570 -977711 -981106 -973040 -961685 -960302 -913055 -935819 -990542 -986598 -970307 -994107 -983850
5856 -983850 -961847 -921323 -899386 -915926 -929631 -964350 -943822 -941759 -966885 -971746 -957558 -933253
5844 -933253 -921647 -937855 -963942 -983906 -991318 -984550 -989757 -957146 -946342 -944422 -898426 -886670
5832 -886670 -903636 -932228 -922155 -918437 -974153 -998859 -977326 -960337 -946701 -1000293 -1034878 -1017940
5820 -1017940 -977542 -954661 -954252 -935992 -941323 -939124 -939926 -958833 -973022 -968515 -970722 -954830 -931271
5807 -931271 -943492 -963423 -946386 -963402 -951134 -924302 -926164 -925563 -918092 -922031 -931754 -940727 -932989
5794 -932989 -916283 -919274 -948510 -966464 -982994 -983511 -976009 -976315 -1000493 -993555 -982042 -974149 -942374
5781 -942374 -945174 -956335 -963372 -988755 -984992 -942095 -927621 -935716 -943041 -954060 -973730 -990513 -979048
5768 -979048 -955456 -950362 -960517 -993881 -982844 -986007 -985450 -986218 -972800 -952354 -973245 -986055 -990294
5755 -990294 -978024 -961700 -958463 -978008 -963591 -913744 -903377 -940885 -949023 -948201 -953052 -942743 -960882
5742 -960882 -974023 -971688 -956547 -942742 -950274 -950968 -932029 -925478 -909699 -877584 -860779 -907874 -917983
5729 -917983 -929686 -921583 -916201 -941093 -962371 -1009019 -1021954 -1009843 -1001483 -1005637 -976508 -972520 -973239
5716 -973239 -982527 -996160 -993605 -990918 -970395 -965216 -941240 -933045 -931472 -930282 -931814 -928540 -922015 -936490
5702 -936490 -931111 -913122 -932360 -906950 -909224 -919534 -944487 -928109 -926479 -917823 -909612 -892322 -872666
5689 -872666 -875462 -884323 -896081 -932900 -936696 -926564 -941184 -962656 -929866 -909938 -935891 -986861
5677 -986861 -990496 -970796 -973644 -962989 -943987 -932271 -912372 -902028 -878288 -877363 -848875 -868582
5665 -868582 -912726 -923030 -943347 -904078 -895575 -919766 -922473 -898744 -897855 -915782 -897492 -890407 -863761
5652 -863761 -878274 -894358 -889408 -869024 -900741 -918435 -928907 -954218 -939338 -919666 -922248 -939543
5640 -939543 -921041 -894635 -916664 -921240 -927916 -928773 -914629 -888113 -897666 -899597 -901902 -907123 -935035
5627 -935035 -917344 -926223 -933244 -939535 -921765 -901640 -897432 -927923 -946883 -937312 -947427 -985957 -976399
5614 -976399 -949730 -945030 -930399 -908017 -887669 -891001 -908895 -918858 -935472 -945035 -937821 -940389 -930183
5601 -930183 -917309 -926015 -934784 -939138 -960276 -944810 -938576 -915495 -894734 -900538 -918936 -934921 -974186
5588 -974186 -956906 -940679 -938288 -940454 -946312 -923685 -930230 -950291 -960808 -975735 -966292 -937747 -915857
5575 -915857 -930328 -973943 -961102 -933537 -923795 -902592 -872964 -863575 -884850 -914510 -934983 -921242
5563 -921242 -922226 -910689 -929979 -925663 -912397 -924995 -950662 -959156 -982730 -960511 -919690 -912493 -910159
5550 -910159 -888704 -908229 -927674 -910437 -896888 -889631 -908062 -892273 -874508 -868501 -869194 -878503 -868868
5537 -868868 -889684 -905632 -894616 -910745 -902304 -873446 -860687 -876861 -904410 -900855 -908308 -911051
5525 -911051 -880681 -859762 -853660 -899057 -910295 -920828 -927858 -936666 -917182 -879912 -842231 -845829
5513 -845829 -832531 -839696 -863355 -832418 -853122 -887181 -880671 -869345 -921133 -936704 -926403 -929225
5501 -929225 -921738 -919601 -901357 -865314 -858452 -856411 -861312 -861439 -868432 -901424 -943749 -942824 -890022 -892261
5487 -892261 -897708 -902668 -884957 -874581 -885292 -881691 -888537 -873798 -871876 -892583 -901006 -935995 -951050
5474 -951050 -965779 -951682 -964057 -970965 -952225 -949912 -916052 -906902 -900612 -863887 -840215 -841174 -890756
5461 -890756 -938110 -930204 -933134 -937219 -934763 -933425 -912105 -863993 -884346 -909642 -913724 -905397 -922709
5448 -922709 -947607 -964343 -947437 -917759 -923474 -900656 -880341 -874796 -878829 -866021 -883323 -894883
5436 -894883 -870108 -889777 -907449 -904219 -916763 -880438 -886295 -902207 -924796 -886244 -845465 -842301
5424 -842301 -848707 -910946 -924335 -933462 -925453 -906294 -881561 -870522 -873054 -874008 -835170 -835836 -822699
5411 -822699 -831089 -870132 -915095 -943038 -919087 -915334 -896859 -893740 -873209 -874507 -874122 -880708 -885492
5398 -885492 -924539 -901097 -895912 -897708 -887044 -896909 -897647 -890653 -875920 -896307 -885155 -882956 -916447
5385 -916447 -918742 -869681 -852270 -849219 -848049 -869601 -907339 -930754 -899126 -861531 -820946 -809826
5373 -809826 -825334 -856261 -865943 -871053 -912759 -904695 -910310 -911580 -913275 -912922 -891332 -896585 -881848
5360 -881848 -832069 -831487 -849237 -880284 -905794 -900490 -857003 -831260 -847026 -832777 -847868 -862233
5348 -862233 -887446 -864732 -883874 -892952 -879313 -900550 -894171 -897545 -906267 -894814 -910663 -913314 -880251
5335 -880251 -845924 -851425 -877166 -906001 -908938 -904005 -886431 -885262 -903849 -912233 -904539 -891870 -884464
5322 -884464 -913068 -903104 -894050 -873057 -849064 -848863 -852894 -854038 -881231 -937875 -912427 -890226 -883949
5309 -883949 -858919 -854547 -860356 -895341 -897548 -858595 -838073 -838060 -857910 -855918 -851289 -868418 -875244
5296 -875244 -852648 -809269 -813483 -820098 -800294 -803051 -796384 -794713 -808753 -821588 -821518 -818682 -827845 -835602
5282 -835602 -838097 -856602 -866182 -869615 -867718 -819460 -824344 -843237 -844092 -856052 -879777 -840124 -819883
5269 -819883 -806656 -825157 -854307 -848186 -842995 -835980 -844680 -875098 -886596 -911130 -897051 -850045
5257 -850045 -827290 -839431 -848665 -857638 -855532 -853716 -862354 -859943 -849973 -847300 -861177 -873593 -843170
5244 -843170 -826054 -874562 -873024 -856514 -885669 -865941 -876015 -894064 -901650 -891140 -874430 -871136
5232 -871136 -873997 -850926 -871287 -908002 -888473 -877601 -901330 -921951 -947172 -933083 -909194 -899985
5220 -899985 -872548 -879651 -938870 -957145 -928543 -911721 -916750 -905811 -890162 -885833 -887496 -878237 -875474
5207 -875474 -872194 -883038 -899094 -882247 -888546 -872917 -834921 -836230 -860281 -902955 -891895 -910351
5195 -910351 -907264 -876382 -887085 -882984 -840185 -828797 -836499 -821822 -813519 -805415 -816734 -893848 -924129
5182 -924129 -923511 -896745 -882448 -882768 -905232 -875817 -845792 -849726 -856731 -870471 -867507 -880409 -880632
5169 -880632 -864459 -846732 -841962 -874700 -864370 -867216 -885310 -865424 -836481 -831818 -847403 -829020
5157 -829020 -801011 -831696 -860560 -826383 -829574 -845150 -838232 -871677 -853879 -821583 -820812 -851360
5145 -851360 -869755 -858843 -856753 -855872 -808760 -784887 -794029 -819417 -857132 -848962 -856529 -820071 -793488
5132 -793488 -807653 -832204 -843365 -814531 -795957 -816813 -828496 -831345 -860373 -901808 -908967 -891830
5120 -891830 -845317 -834094 -808206 -765997 -780312 -813198 -862531 -876097 -885856 -867513 -828472 -804383
5108 -804383 -798907 -831081 -836109 -827372 -865292 -876804 -888845 -868282 -835636 -851653 -860686 -864116 -864358
5095 -864358 -861209 -825329 -815267 -807682 -835402 -838740 -821063 -812965 -809060 -794502 -770813 -792391 -806197
5082 -806197 -837211 -860340 -864945 -867033 -872640 -858951 -848934 -859178 -859818 -851417 -859902 -866907 -847545
5069 -847545 -809340 -810943 -806966 -834525 -856461 -850066 -834145 -855223 -887863 -891215 -883821 -834200 -798492
5056 -798492 -834297 -884206 -904485 -925071 -917932 -899695 -891628 -899712 -909800 -892441 -874302 -857985
5044 -857985 -863053 -856897 -843332 -863781 -884122 -890456 -863808 -857980 -831402 -834539 -836934 -815063 -833140
5031 -833140 -825735 -795550 -789642 -813378 -850104 -864463 -850539 -857069 -860828 -848054 -853421 -835466 -826481
5018 -826481 -826042 -799248 -797661 -813651 -847906 -860427 -827011 -812178 -824532 -873394 -891024 -870810
5006 -870810 -864616 -844598 -849473 -882326 -871247 -841943 -836576 -815444 -803510 -786162 -752459 -805895
4994 -805895 -825940 -820608 -824722 -827498 -810190 -829251 -817380 -827222 -834031 -845613 -824820 -830708 -816580
4981 -816580 -797215 -824351 -845671 -818149 -830993 -850063 -852991 -843080 -828601 -805713 -830195 -835695
4969 -835695 -798323 -803163 -811896 -823886 -854690 -830378 -844808 -854737 -852493 -840389 -840485 -833255 -837481
4956 -837481 -846812 -832496 -830098 -843666 -847058 -853363 -836285 -820726 -797941 -795072 -821176 -844784 -845090
4943 -845090 -825196 -843973 -840205 -850071 -864250 -847876 -850310 -867854 -864313 -861009 -859191 -848610 -820171
4930 -820171 -810323 -820651 -822116 -804444 -782303 -800552 -776139 -768738 -801669 -824843 -828858 -821400 -788497
4917 -788497 -779413 -802008 -818159 -796769 -746060 -757875 -826934 -813061 -806663 -797000 -813991 -831067
4905 -831067 -845562 -854006 -864130 -858215 -864862 -861593 -857802 -866891 -856962 -855581 -838312 -827641 -840417
4892 -840417 -834657 -859410 -854548 -808998 -811920 -828556 -826716 -834597 -849617 -866625 -854436 -806197 -814204
4879 -814204 -838785 -844155 -855227 -865054 -881738 -887322 -864475 -821964 -795246 -762517 -802775 -820962
4867 -820962 -836691 -828485 -832457 -816125 -817405 -832259 -806487 -799726 -821368 -822682 -811980 -798899 -793320
4854 -793320 -805911 -802753 -802569 -825069 -801858 -791022 -775358 -776165 -785765 -782589 -762024 -737490 -733490
4841 -733490 -762107 -800842 -817116 -809645 -807918 -824428 -852318 -846285 -831416 -823694 -837851 -847952
4829 -847952 -866328 -848916 -830719 -815702 -805276 -795847 -776079 -798314 -831666 -816741 -814666 -800952
4817 -800952 -803998 -800950 -819458 -808241 -786809 -798573 -808973 -809046 -812182 -803843 -803392 -823352 -839747
4804 -839747 -839080 -839174 -826108 -830447 -848499 -847760 -824985 -817405 -822997 -835700 -863747 -835569 -799063 -766403
4790 -766403 -768409 -781255 -819817 -826591 -791332 -798360 -830725 -859268 -851268 -874890 -893881 -885142 -864801
4777 -864801 -844758 -842396 -883938 -874885 -844790 -850509 -855593 -840867 -825836 -823398 -809895 -799187 -794903
4764 -794903 -805003 -819742 -810136 -798839 -810018 -808413 -780205 -798399 -821351 -799627 -772338 -770752
4752 -770752 -776231 -772985 -787373 -776388 -778911 -806270 -830835 -831768 -821996 -805202 -786221 -793059 -837139
4739 -837139 -844551 -843309 -828373 -794278 -756432 -762087 -802140 -793868 -801560 -813170 -825044 -800083 -781701
4726 -781701 -791192 -791683 -758557 -741014 -764564 -814447 -834071 -843115 -848726 -807563 -810898 -816434 -783507
4713 -783507 -769990 -791742 -790389 -822388 -839026 -838715 -826417 -794260 -801319 -839774 -850116 -870904
4701 -870904 -847957 -815636 -828171 -824584 -826368 -814526 -815992 -838847 -858730 -866279 -859044 -828559 -827746
4688 -827746 -828156 -811264 -782244 -767487 -748985 -797627 -845350 -850808 -845373 -855273 -823253 -833092 -844095
4675 -844095 -837876 -805967 -781806 -777363 -805367 -807372 -776236 -781402 -807432 -782443 -784250 -771481 -809965
4662 -809965 -813487 -796657 -779813 -779018 -754123 -742835 -753196 -764008 -781721 -791827 -805197 -818808
4650 -818808 -820656 -840741 -845474 -827719 -784853 -783553 -748614 -768130 -767857 -758828 -777843 -778483 -772518
4637 -772518 -781781 -809683 -810544 -824769 -816920 -826126 -845257 -833756 -822015 -819405 -820169 -826843 -821495 -834333
4623 -834333 -856627 -845326 -842976 -827518 -812677 -779203 -792452 -827334 -801223 -796209 -823785 -844919
4611 -844919 -877693 -847866 -829635 -803290 -811325 -803186 -771786 -748776 -753826 -757779 -724960 -731060 -751481
4598 -751481 -770333 -764063 -761038 -760690 -788874 -802773 -833067 -844290 -835744 -813062 -781767 -762222 -774979
4585 -774979 -784473 -806983 -828999 -835645 -841035 -818014 -815817 -825606 -815685 -792138 -769971 -790829 -795797
4572 -795797 -837774 -855484 -790976 -800894 -821646 -820032 -804439 -804001 -814760 -793543 -771287 -769473 -752921
4559 -752921 -758957 -780824 -816013 -867210 -867632 -871897 -828813 -819557 -790828 -759039 -765116 -787887 -790451
4546 -790451 -780265 -787807 -766441 -741016 -726266 -763253 -778882 -784480 -798996 -754222 -728076 -707881
4534 -707881 -713769 -708184 -733624 -737314 -738396 -768352 -797649 -752690 -774141 -821361 -808959 -798333
4522 -798333 -792749 -798324 -748685 -732533 -755834 -818364 -824834 -829317 -823567 -782773 -788749 -760587 -758833
4509 -758833 -755413 -743884 -764815 -775806 -813824 -820437 -802032 -767695 -746108 -750339 -750693 -732587 -764185
4496 -764185 -793547 -772809 -722542 -727885 -719613 -726388 -726361 -719365 -740025 -736093 -786138 -805585 -826744
4483 -826744 -798637 -795318 -798688 -815140 -797670 -802770 -798768 -785176 -790485 -787531 -758500 -739957 -746705
4470 -746705 -742586 -782718 -796324 -780461 -795305 -789887 -763662 -758242 -771517 -774596 -769865 -769774 -781184
4457 -781184 -811842 -819315 -798040 -806441 -820022 -777924 -737134 -731532 -769550 -795045 -782252 -732821
4445 -732821 -705559 -709197 -706168 -704977 -677005 -669478 -692781 -723630 -743906 -744605 -760224 -772719 -782486
4432 -782486 -784307 -782393 -799454 -782102 -758294 -758019 -777556 -786209 -786445 -762814 -727964 -725708 -766927
4419 -766927 -771422 -797514 -798344 -790839 -782347 -762077 -765858 -760483 -760973 -765993 -762418 -747553 -733907 -722957
4405 -722957 -719427 -698574 -703966 -738163 -788783 -768864 -741940 -736768 -741715 -763598 -786343 -785588 -797756
4392 -797756 -777382 -742725 -767305 -787753 -791654 -772076 -763286 -761974 -746197 -739884 -744274 -763075 -781339
4379 -781339 -810755 -812970 -786170 -779851 -769018 -730774 -733640 -730274 -743020 -768651 -767814 -743900 -738255
4366 -738255 -759712 -753084 -786904 -781631 -769705 -785207 -817222 -817806 -794609 -768865 -765453 -806299 -813275
4353 -813275 -810955 -813185 -817500 -808047 -784349 -777319 -778620 -794628 -775494 -767914 -749065 -723540 -723357
4340 -723357 -758721 -790336 -817067 -779055 -791508 -810806 -787121 -759260 -765890 -792209 -786101 -787413
4328 -787413 -770154 -764139 -789273 -781280 -744633 -703368 -710383 -734158 -738852 -771603 -773637 -769823 -778284
4315 -778284 -794031 -798705 -777194 -749738 -730035 -729858 -745800 -738113 -724779 -692667 -692489 -704736 -731496
4302 -731496 -732104 -753862 -763446 -766542 -777884 -790008 -804180 -786611 -739723 -756001 -770861 -740824
4290 -740824 -741931 -775183 -780677 -813415 -826197 -817091 -796131 -749251 -719485 -718048 -752273 -738223
4278 -738223 -737002 -759666 -800124 -821888 -822334 -822558 -792921 -767628 -750058 -729310 -731284 -741685 -762797
4265 -762797 -772033 -781039 -762163 -699383 -684494 -694756 -711934 -724205 -731928 -754782 -770176 -783663
4253 -783663 -755180 -735266 -751556 -747173 -740248 -759984 -747171 -757616 -764207 -742832 -716084 -735541
4241 -735541 -725410 -757624 -770706 -744092 -741566 -723840 -743021 -739318 -725987 -744738 -729054 -712135
4229 -712135 -737467 -772764 -768968 -757103 -746241 -726814 -712143 -727562 -759589 -744370 -721661 -742840
4217 -742840 -748543 -742980 -754687 -756869 -751220 -738871 -722972 -766144 -744883 -739647 -749432 -747424 -728681
4204 -728681 -733634 -759277 -782446 -779255 -763939 -772436 -761018 -729189 -734651 -757404 -783041 -804872
4192 -804872 -831529 -834026 -782438 -766297 -758035 -703062 -692057 -738759 -766476 -771642 -760224 -740727
4180 -740727 -751606 -763949 -747418 -757565 -742367 -714260 -695523 -687744 -697865 -724218 -728895 -732033
4168 -732033 -705326 -685821 -702927 -746446 -752966 -746780 -735485 -708976 -712355 -744034 -765129 -765689 -760119
4155 -760119 -777624 -784729 -775963 -780935 -803873 -780357 -726262 -729088 -732633 -746794 -705302 -689857 -699875
4142 -699875 -741394 -741615 -743389 -748140 -752033 -742575 -761737 -778241 -770921 -782817 -769177 -769405 -754380
4129 -754380 -744656 -772513 -777303 -766572 -731648 -744091 -743642 -760499 -779966 -734586 -738886 -737080 -733122
4116 -733122 -743237 -751213 -733530 -739920 -739418 -725565 -749588 -769848 -769880 -760048 -715096 -725679 -742646
4103 -742646 -752768 -767436 -771954 -766236 -726949 -730859 -738045 -737257 -762751 -785297 -741219 -726226 -712326
4090 -712326 -702336 -675864 -712160 -735096 -722296 -709660 -732557 -723530 -695026 -701836 -716290 -725497
4078 -725497 -721282 -677786 -678988 -675064 -704497 -702135 -694998 -673100 -670424 -675347 -688577 -750860 -734623
4065 -734623 -727207 -708066 -686869 -700788 -747466 -775407 -754207 -743071 -751994 -733645 -727441 -717002
4053 -717002 -740393 -760178 -724563 -723391 -714795 -716669 -736506 -761963 -743210 -754869 -799525 -815384
4041 -815384 -796915 -808976 -816484 -778594 -749685 -728295 -719026 -684109 -699419 -748588 -746325 -724402
4029 -724402 -750705 -754465 -724635 -718464 -693797 -700991 -743997 -766964 -752516 -761191 -745861 -722592
4017 -722592 -692251 -682644 -687645 -670355 -679188 -718654 -742720 -730798 -734321 -740718 -742948 -749292 -724637
4004 -724637 -699706 -712496 -687601 -718333 -742247 -727531 -696389 -656156 -666569 -694257 -695528 -688032
3992 -688032 -662835 -680782 -707090 -720779 -713809 -700041 -708810 -748643 -766877 -784737 -794427 -782555
3980 -782555 -772936 -767352 -756055 -729651 -702415 -703371 -720188 -711678 -691557 -661591 -659609 -687887 -693484
3967 -693484 -708269 -760916 -775611 -742810 -744891 -744783 -761537 -751976 -747624 -753205 -726576 -722294 -749053
3954 -749053 -762159 -755866 -745308 -725558 -722051 -734714 -760336 -779740 -756128 -771351 -789629 -779655
3942 -779655 -794379 -821037 -791892 -770132 -765360 -748892 -731357 -731516 -740505 -711134 -714684 -745524 -748670
3929 -748670 -759476 -742641 -747449 -708055 -695078 -718046 -758770 -766711 -765729 -791623 -788617 -757203 -745185
3916 -745185 -723062 -736906 -713004 -662445 -663320 -656115 -702150 -732228 -727649 -716836 -737992 -730317 -699643
3903 -699643 -693441 -656600 -624816 -662859 -710087 -734237 -748313 -731159 -748158 -759210 -769234 -795066
3891 -795066 -768618 -714442 -701834 -710633 -730465 -757349 -745916 -700236 -657177 -660580 -701209 -720858
3879 -720858 -702066 -684150 -670171 -646429 -660451 -706342 -718304 -718749 -689096 -646631 -622145 -637898
3867 -637898 -681210 -701049 -699887 -680409 -684126 -673364 -678596 -682592 -711566 -701917 -712828 -726859 -712176
3854 -712176 -701728 -694645 -686045 -676208 -675217 -696802 -695687 -693179 -710870 -744324 -771653 -789446 -765103
3841 -765103 -755440 -752193 -744846 -729054 -706484 -718383 -749635 -730116 -698448 -709747 -700586 -719944
3829 -719944 -739420 -704562 -697613 -718667 -758211 -719786 -704402 -704420 -705847 -711023 -720150 -705293 -730670
3816 -730670 -729426 -738378 -735094 -755899 -784838 -759420 -726267 -695137 -702486 -755595 -780656 -768239
3804 -768239 -744599 -725781 -732060 -718229 -716755 -723821 -705699 -688189 -712072 -704287 -695666 -722123 -727199
3791 -727199 -723193 -699711 -694721 -718760 -735000 -736477 -748360 -745125 -701591 -682412 -674412 -660607 -683210
3778 -683210 -737000 -782412 -790209 -768914 -714801 -681153 -671104 -720566 -773717 -790865 -752984 -713567
3766 -713567 -681857 -683047 -707540 -716308 -704525 -681926 -659165 -686582 -707946 -741231 -727642 -731767
3754 -731767 -759458 -750059 -696037 -674970 -715070 -715127 -709228 -715438 -711772 -684649 -667924 -684188 -690451
3741 -690451 -693812 -673087 -687156 -664058 -650751 -657229 -658927 -701768 -734179 -743952 -741964 -765207 -759684
3728 -759684 -709121 -703329 -702822 -692095 -672037 -662906 -650325 -678106 -714062 -689841 -643331 -626799
3716 -626799 -614124 -608894 -602849 -643044 -661054 -678408 -684072 -683223 -693141 -701362 -687758 -713664 -717233
3703 -717233 -710389 -692724 -702590 -716698 -711971 -737093 -767743 -756855 -723364 -711680 -701772 -698692 -695797
3690 -695797 -658946 -660668 -675635 -689171 -684860 -689732 -719103 -721107 -688253 -692305 -724951 -733461 -730357
3677 -730357 -686560 -683974 -731835 -711555 -681507 -665614 -658355 -698904 -716209 -737554 -728796 -727032
3665 -727032 -733062 -728037 -729561 -696826 -662579 -647170 -665256 -654720 -690104 -713769 -731278 -755732
3653 -755732 -734601 -713607 -699108 -663355 -636682 -633374 -672656 -686932 -689840 -675886 -645403 -648079
3641 -648079 -617677 -637570 -707910 -680996 -681217 -663229 -675191 -697115 -711232 -681820 -648434 -653634
3629 -653634 -662905 -645129 -657051 -693313 -721648 -708916 -705925 -726618 -738648 -724172 -701573 -674128
3617 -674128 -704532 -737517 -724689 -714675 -684442 -686266 -703620 -692955 -696691 -696884 -708177 -700717 -657425
3604 -657425 -641830 -654049 -658479 -681771 -708628 -716958 -710536 -720988 -761476 -778040 -738154 -710734
3592 -710734 -738114 -733193 -743740 -758492 -727117 -722600 -706199 -702683 -678764 -675249 -665881 -664086 -677460
3579 -677460 -684017 -701374 -712392 -719993 -739395 -746322 -751167 -726433 -708752 -726318 -712285 -742687
3567 -742687 -784523 -763701 -727738 -706749 -687374 -677936 -667894 -666830 -675564 -718277 -701953 -693004
3555 -693004 -695119 -669599 -666058 -667629 -670165 -693358 -703651 -713619 -708162 -660245 -652813 -668240 -690462
3542 -690462 -713219 -711719 -695142 -705394 -722235 -727853 -705474 -682593 -665595 -685059 -689693 -683393
3530 -683393 -671957 -695031 -694070 -690994 -734302 -740067 -741252 -741031 -733728 -748426 -723861 -707241 -695469
3517 -695469 -698050 -673243 -683947 -704303 -688947 -675436 -656013 -662452 -667062 -658338 -627067 -649701
3505 -649701 -679363 -660971 -646423 -625959 -635347 -674664 -695512 -707948 -707404 -722585 -709458 -672566
3493 -672566 -670931 -677895 -703380 -690054 -699205 -705236 -697907 -697424 -676328 -658694 -661970 -671061 -678010 -667666
3479 -667666 -646505 -661495 -665857 -643587 -638192 -656727 -705457 -681066 -622191 -622950 -644441 -679274
3467 -679274 -709954 -709925 -716990 -723552 -701669 -685446 -697236 -703178 -706832 -719867 -704672 -690736 -733394
3454 -733394 -708506 -669642 -677439 -689261 -691809 -646934 -605174 -638042 -649003 -654203 -633746 -642129
3442 -642129 -648397 -653574 -638979 -667343 -667372 -653722 -666755 -696503 -688768 -656900 -673035 -665341 -674025
3429 -674025 -692317 -715704 -709111 -709519 -694048 -666239 -669680 -662884 -660670 -679424 -666433 -676437 -637534
3416 -637534 -655970 -678801 -672312 -633867 -636511 -661104 -630620 -630276 -641856 -657498 -672412 -673504 -674040
3403 -674040 -650068 -633739 -650493 -697823 -694277 -682072 -685663 -698836 -659136 -630599 -646124 -670429
3391 -670429 -700984 -743834 -758883 -736992 -721533 -706531 -686659 -644471 -686080 -692185 -717516 -734669
3379 -734669 -731525 -692094 -677283 -675923 -668721 -669512 -683157 -685518 -683752 -665564 -669062 -664561 -650362
3366 -650362 -644094 -671107 -674064 -676116 -678795 -676365 -677263 -712860 -713285 -702677 -696694 -695211 -707503 -719622
3352 -719622 -718729 -704693 -693954 -639445 -636093 -653693 -648719 -640437 -660885 -660525 -669873 -660009 -666007 -684714
3338 -684714 -683664 -663878 -673365 -671958 -695731 -685086 -687613 -717775 -719970 -711196 -688674 -666747 -655777
3325 -655777 -640568 -649891 -696786 -725777 -676394 -646105 -659700 -658059 -661104 -655163 -634773 -624710
3313 -624710 -633342 -648417 -642981 -636959 -623227 -598384 -585694 -606907 -653015 -683582 -677522 -652902
3301 -652902 -640958 -594054 -599250 -618538 -652806 -663411 -664985 -656141 -654381 -627450 -665003 -678586
3289 -678586 -685708 -713678 -695293 -685047 -686881 -667419 -640893 -636725 -642679 -639327 -620671 -619767 -644854
3276 -644854 -667763 -693156 -677055 -659225 -661188 -681097 -696280 -668752 -683349 -674548 -654157 -641098
3264 -641098 -654538 -663481 -640316 -655608 -681090 -672630 -654757 -660046 -632133 -611101 -604599 -599742 -630398
3251 -630398 -668315 -649705 -660935 -684595 -675384 -625928 -582482 -604686 -605521 -601239 -640537 -672324
3239 -672324 -677326 -642967 -619605 -617952 -602343 -599501 -610077 -580033 -575680 -575155 -605890 -639340 -640397
3226 -640397 -644441 -657772 -642909 -643458 -655142 -686055 -679770 -646382 -616326 -638842 -684405 -712293
3214 -712293 -750648 -726996 -669008 -624564 -616864 -595140 -569032 -568937 -607694 -604907 -605838 -655204 -672960
3201 -672960 -661266 -646141 -619174 -628227 -597854 -630906 -633487 -658237 -677714 -689784 -693522 -682596
3189 -682596 -695186 -690318 -647759 -642261 -665100 -668735 -629935 -568350 -588713 -635793 -657283 -674789
3177 -674789 -670224 -640471 -648172 -650692 -654236 -657456 -680033 -706399 -684846 -654561 -657712 -665892 -666915
3164 -666915 -677184 -692031 -699243 -735561 -744488 -724966 -691196 -693594 -678510 -690510 -689478 -648049
3152 -648049 -637285 -648896 -643026 -666383 -692934 -693900 -678606 -670706 -656151 -629423 -643385 -658869
3140 -658869 -664380 -665201 -663207 -657421 -670157 -683411 -687332 -696876 -707093 -713234 -702963 -694543 -676665
3127 -676665 -649853 -628330 -633734 -656493 -635056 -639667 -672372 -680292 -653533 -636268 -656587 -692743
3115 -692743 -667611 -669933 -694451 -715850 -705167 -654975 -655352 -666419 -659815 -676057 -672029 -665249 -654857
3102 -654857 -631531 -604118 -600502 -609515 -637654 -652273 -658120 -661320 -636275 -631580 -638562 -663526 -668771
3089 -668771 -641107 -613814 -598683 -607386 -611548 -576889 -593489 -646689 -640866 -629373 -658676 -642718
3077 -642718 -646943 -622083 -586624 -615054 -618841 -631793 -607308 -605592 -619614 -627587 -605325 -584138
3065 -584138 -583379 -616642 -615813 -601239 -583533 -591411 -600567 -619853 -626329 -638533 -655994 -656119 -647990 -628434
3051 -628434 -639856 -694749 -678787 -662630 -628780 -653632 -722403 -704925 -673178 -676927 -675667 -670671
3039 -670671 -660517 -656109 -674700 -690596 -677829 -670392 -686843 -685468 -647918 -657814 -663152 -660604 -662277
3026 -662277 -658919 -649946 -649367 -630672 -604156 -589585 -613915 -635868 -651797 -634222 -601655 -604625 -623752
3013 -623752 -615398 -619584 -637910 -626117 -636875 -652277 -640840 -621608 -649864 -656527 -689634 -701230
3001 -701230 -686126 -664029 -621379 -582677 -606414 -646905 -645628 -614781 -624040 -609547 -605611 -615412
2989 -615412 -599482 -595830 -611711 -625825 -644209 -651204 -636091 -606370 -622031 -651305 -683022 -678915
2977 -678915 -655169 -656820 -674163 -667486 -642945 -632394 -654667 -619482 -592849 -580546 -589237 -629426
2965 -629426 -634265 -622327 -655009 -671797 -677489 -676899 -661061 -650391 -638974 -608664 -595593 -619169
2953 -619169 -650018 -647471 -631727 -635206 -643590 -633073 -595689 -602464 -639915 -629245 -635103 -626644 -595448
2940 -595448 -599706 -638493 -648902 -611079 -594655 -628353 -637611 -635848 -616786 -631621 -657551 -632561
2928 -632561 -654961 -656967 -675196 -628696 -583519 -585037 -602627 -613271 -624938 -640288 -643168 -625602
2916 -625602 -652887 -657360 -654530 -628323 -624063 -649477 -667583 -672143 -655341 -675105 -670295 -678123 -672391
2903 -672391 -661212 -637240 -642831 -642506 -634928 -648845 -672693 -644267 -630456 -632767 -649351 -661506 -629704
2890 -629704 -602430 -594320 -600434 -595513 -617696 -620104 -641876 -684540 -698209 -673798 -665227 -647237 -654559
2877 -654559 -686406 -694572 -676865 -651515 -639255 -676066 -669022 -652149 -639767 -616791 -611063 -591900
2865 -591900 -597686 -652301 -645198 -619761 -655028 -687994 -659145 -632599 -637140 -684723 -669600 -665078
2853 -665078 -676472 -659320 -649570 -621732 -621750 -650668 -671442 -654186 -633956 -629161 -624847 -630658 -624695
2840 -624695 -598918 -580782 -577117 -578514 -585219 -628251 -662078 -677413 -680420 -667771 -666497 -665622 -671933
2827 -671933 -678968 -662502 -636845 -612107 -611129 -608645 -633789 -649491 -685342 -682681 -684712 -689217 -683560
2814 -683560 -672980 -611314 -591831 -599755 -617404 -639223 -662091 -675246 -685288 -656248 -645038 -637720
2802 -637720 -643380 -635951 -644808 -678013 -667309 -653513 -649455 -616923 -595350 -596864 -631552 -663497 -667071
2789 -667071 -673590 -646667 -635839 -619986 -629790 -618464 -599449 -617669 -643911 -635087 -641504 -640984 -655882
2776 -655882 -657991 -648067 -663472 -623597 -625976 -623515 -608260 -617434 -615329 -632968 -647226 -661264 -684479
2763 -684479 -639105 -623990 -622014 -626480 -628694 -623285 -622006 -592487 -584300 -617663 -635607 -600319 -560176
2750 -560176 -563514 -583071 -578081 -570728 -564688 -570809 -587850 -585596 -567657 -579512 -576006 -595743 -611287
2737 -611287 -619486 -607138 -592108 -556178 -543751 -580055 -612874 -637783 -614161 -607750 -577811 -550126
2725 -550126 -563881 -588434 -613903 -629521 -636071 -640729 -644591 -640599 -653377 -633413 -650575 -650781 -656945
2712 -656945 -630002 -619373 -624588 -633372 -664570 -693024 -697855 -676542 -648441 -651936 -693527 -703417 -668378
2699 -668378 -622933 -609865 -612248 -606380 -642459 -646602 -596056 -579398 -599973 -643439 -633838 -629981 -625885
2686 -625885 -652183 -656168 -675563 -668776 -662515 -662565 -638684 -647233 -647391 -639372 -641563 -641821 -652090 -681141
2672 -681141 -685533 -658170 -648288 -663461 -652067 -651631 -630471 -642100 -642927 -632430 -659372 -673177 -676541
2659 -676541 -647223 -603663 -606630 -632272 -618197 -586530 -604546 -655528 -678349 -643594 -620080 -627156
2647 -627156 -642458 -620747 -618171 -603092 -616563 -635683 -668532 -684243 -670454 -663508 -643712 -624113
2635 -624113 -604243 -594279 -599414 -587114 -618343 -646066 -651528 -655654 -640561 -625486 -607177 -599000 -592023
2622 -592023 -588691 -583996 -594503 -580432 -572535 -582171 -604901 -610623 -608024 -609534 -608760 -646938 -674728
2609 -674728 -691256 -681613 -660919 -636231 -605157 -599215 -605277 -626631 -627031 -588534 -577348 -606813 -612013
2596 -612013 -610584 -606876 -583074 -585278 -572715 -575546 -555808 -569245 -570397 -586268 -595038 -643095 -641473
2583 -641473 -614407 -593658 -624668 -658133 -637985 -630371 -667581 -669521 -650277 -662888 -632248 -610418
2571 -610418 -640815 -633125 -594759 -601105 -605150 -626493 -598273 -586610 -578038 -546395 -581725 -596880
2559 -596880 -611597 -651999 -652453 -621129 -609874 -605211 -622526 -661483 -662619 -650930 -628915 -617207
2547 -617207 -627831 -632393 -607612 -614944 -613053 -645538 -657527 -642232 -624106 -631191 -659166 -662168 -649873
2534 -649873 -626998 -600396 -602267 -618152 -636156 -645660 -658375 -603734 -577058 -589489 -601149 -610699
2522 -610699 -588808 -570815 -522572 -513015 -544382 -593294 -588143 -601532 -614350 -601305 -604125 -631187
2510 -631187 -607940 -627527 -635936 -618669 -592851 -611593 -630477 -604661 -574583 -583602 -591744 -597855
2498 -597855 -598466 -586804 -551439 -543263 -543960 -552686 -545272 -536381 -548418 -566435 -598295 -630612 -648851
2485 -648851 -641449 -637804 -619353 -618925 -644628 -635084 -622846 -585205 -578170 -617921 -623886 -614025 -610193
2472 -610193 -625849 -631949 -635577 -605844 -573483 -571463 -615203 -630690 -622377 -596013 -594550 -579355 -588856
2459 -588856 -622308 -673723 -705446 -662816 -616148 -610247 -646242 -659341 -648078 -660840 -649104 -623693
2447 -623693 -584939 -544684 -550099 -593958 -589397 -604856 -597198 -589077 -588886 -578318 -591139 -596184 -593902
2434 -593902 -568581 -583754 -603096 -624952 -618329 -640861 -638258 -611099 -627536 -618973 -610844 -609818 -617150
2421 -617150 -570936 -561266 -564835 -560497 -562792 -577231 -561848 -563036 -599068 -590411 -578603 -581209 -598477
2408 -598477 -592077 -607620 -585274 -552966 -545725 -556756 -574490 -589341 -597176 -584280 -590205 -564553
2396 -564553 -554881 -579693 -615820 -617229 -603140 -610420 -647451 -680092 -626104 -614139 -635269 -622451
2384 -622451 -610439 -592609 -582634 -596602 -604773 -606453 -617660 -644830 -628934 -610394 -590097 -600502
2372 -600502 -642033 -645203 -615910 -601702 -596911 -611695 -599906 -587530 -578226 -595887 -623362 -637346
2360 -637346 -655842 -653859 -614888 -597364 -610831 -603172 -601706 -621956 -646843 -621438 -599362 -615379
2348 -615379 -625046 -613176 -605119 -613683 -581519 -548364 -553690 -556902 -587285 -609614 -579436 -551921 -565601
2335 -565601 -609168 -627363 -599118 -586516 -615888 -610767 -607959 -606121 -581944 -577755 -586855 -609143 -624174
2322 -624174 -639964 -650211 -591547 -570854 -573104 -571314 -587457 -581703 -607424 -586137 -567396 -551059
$$ [...]
##END NTUPLES=NMR SPECTRUM
##END=
