##TITLE=Analysis number 315311
Compound Code jpv 00046
Project Code adrs
Chemist Name stores
##JCAMPDX= 6.0         $$ Bruker NMR JCAMP-DX V2.0
##DATA TYPE= NMR SPECTRUM
##DATA CLASS= NTUPLES
##ORIGIN= Bruker BioSpin GmbH
##OWNER= NMR
$$ XWIN-NMR		Version 3.5
$$ Tue Nov 15 08:29:41 2005 GMT Standard Time (UT+0h)  MAYBRIDGE\NMR@NMR_250MHZ
##.OBSERVE FREQUENCY= 250.131544655141
##.OBSERVE NUCLEUS= ^1H
##.ACQUISITION MODE= SIMULTANEOUS (DQD)
##.ACQUISITION SCHEME= undefined
##.AVERAGES= 16
##.DIGITISER RES= 18
##SPECTROMETER/DATA SYSTEM= dpx250
##.PULSE SEQUENCE= zg30
##.SOLVENT NAME= CDCl3
##.SHIFT REFERENCE= (INTERNAL, CDCl3, 0, 16.522)
##AUDIT TRAIL= $$ (NUMBER, WHEN, WHO, WHERE, WHAT)
$$ ##TITLE= Audit trail, XWIN-NMR		Version 3.5
$$ ##JCAMPDX= 5.01
$$ ##ORIGIN= Bruker BioSpin GmbH
$$ ##OWNER= NMR
$$ C:\u/data/dgb/nmr/ADRS/12290/pdata/1/auditp.txt
$$ ##AUDIT TRAIL=  $$ (NUMBER, WHEN, WHO, WHERE, WHAT)
(   1,<2005-11-15 08:29:16.35 +000>,<MAYBRIDGE\NMR>,<NMR_250MHZ>,
      <created by zg, POWCHK disabled, PULCHK disabled
       configuration hash MD5:
       62 19 C7 07 E1 42 D1 B7 37 6C 3D D0 77 39 F9 E6
       data hash MD5: 64K
       F7 3F 60 9F 90 9C B4 4E 04 81 68 DE 3A 28 FF 5C>)
(   2,<2005-11-15 08:29:29.76 +000>,<MAYBRIDGE\NMR>,<NMR_250MHZ>,
      <Start of raw data processing
       ef LB = 0.3 FT_mod = 6 PKNL = 1 SI = 32K 
       data hash MD5: 32K
       96 86 A0 C9 63 DB C7 68 B8 97 26 F7 EA 39 29 B7>)
(   3,<2005-11-15 08:29:31.67 +000>,<MAYBRIDGE\NMR>,<NMR_250MHZ>,
      <apk 
       data hash MD5: 32K
       B9 9D 4B CC 7F 1C 89 A1 CC EC 07 FE C3 0D CA CB>)
(   4,<2005-11-15 08:29:32.43 +000>,<MAYBRIDGE\NMR>,<NMR_250MHZ>,
      <abs ABSG = 5 
       data hash MD5: 32K
       F1 04 81 18 75 C3 3F 80 B6 1F 26 DC 59 B2 FE 53>)
$$ ##END=
$$ 
$$ hash MD5
$$ 37 98 38 F6 C5 B1 54 90 DD 7A 62 E7 46 81 ED 1F
##$RELAX= 
##$RELAX= 
##$RELAX= 
##$RELAX= 
##$RELAX= 
##$RELAX= 
##$RELAX= 
$$ Bruker specific parameters
$$ --------------------------
##$DU= <C:\u>
##$EXPNO= 12290
##$NAME= <ADRS>
##$PROCNO= 1
##$TYPE= <nmr>
##$USER= <dgb>
##$AMP= (0..31)
100 100 100 100 100 100 100 100 100 100 100 100 100 100 100 100 100 100 
100 100 100 100 100 100 100 100 100 100 100 100 100 100 
##$AQSEQ= 0
##$AQ_mod= 3
##$AUNM= <au_zg>
##$AUTOPOS= <2 >
##$BF1= 250.13
##$BF2= 250.13
##$BF3= 250.13
##$BF4= 250.13
##$BF5= 500.13
##$BF6= 500.13
##$BF7= 500.13
##$BF8= 500.13
##$BYTORDA= 1
##$CFDGTYP= 0
##$CFRGTYP= 5
##$CHEMSTR= <none>
##$CNST= (0..31)
1 1 145 1 1 1 1 1 1 1 1 1 1 1 1 1 1 1 1 1 1 1 1 1 1 1 1 1 1 1 1 1 
##$CPDPRG= <>
##$CPDPRG1= <>
##$CPDPRG2= <>
##$CPDPRG3= <>
##$CPDPRG4= <mlev>
##$CPDPRG5= <mlev>
##$CPDPRG6= <mlev>
##$CPDPRG7= <mlev>
##$CPDPRG8= <mlev>
##$CPDPRGB= <>
##$CPDPRGT= <>
##$D= (0..31)
0 1 0 0 0 0 0 0 0 0.06 0 0 0 0 0 0 0.0002 0 0 0 0 0 0 0 0 0 0 0 0 0 0 
0 
##$DATE= 1132043355
##$DBL= (0..7)
120 120 120 120 120 120 120 120 
##$DBP= (0..7)
150 150 150 150 150 150 150 150 
##$DBP07= 0
##$DBPNAM0= <>
##$DBPNAM1= <>
##$DBPNAM2= <>
$$ [...]
##$SUBNAM7= <"">
##$SUBNAM8= <"">
##$SUBNAM9= <"">
##$SW= 20.6930455092707
##$SWIBOX= (0..15)
0 0 3 0 0 0 0 0 0 0 0 0 0 0 0 0 
##$SW_h= 5175.983436853
##$TD= 65536
##$TD0= 1
##$TE= 294.16
##$TE2= 300
##$TE3= 300
##$TEG= 300
##$TL= (0..7)
0 120 120 120 120 120 120 120 
##$TP= (0..7)
150 150 150 150 150 150 150 150 
##$TP07= 0
##$TPNAME0= <>
##$TPNAME1= <>
##$TPNAME2= <>
##$TPNAME3= <>
##$TPNAME4= <>
##$TPNAME5= <>
##$TPNAME6= <>
##$TPNAME7= <>
##$TPOAL= (0..7)
0.5 0.5 0.5 0.5 0.5 0.5 0.5 0.5 
##$TPOFFS= (0..7)
0 0 0 0 0 0 0 0 
##$TUNHIN= 0
##$TUNHOUT= 0
##$TUNXOUT= 0
##$USERA1= <user>
##$USERA2= <user>
##$USERA3= <user>
##$USERA4= <user>
##$USERA5= <user>
##$V9= 5
##$VALIST= <valist>
##$VCLIST= <CCCCCCCCCCCCCCC>
##$VD= 0
##$VDLIST= <DDDDDDDDDDDDDDD>
##$VPLIST= <PPPPPPPPPPPPPPP>
##$VTLIST= <TTTTTTTTTTTTTTT>
##$WBST= 1024
##$WBSW= 4
##$XGAIN= (0..3)
0 0 0 0 
##$XL= 0
##$YL= 0
##$YMAX_a= 374227
##$YMIN_a= -553299
##$ZGOPTNS= <>
##$ZL1= 120
##$ZL2= 120
##$ZL3= 120
##$ZL4= 120
##$ABSF1= 16.522
##$ABSF2= -4.171173
##$ABSG= 5
##$ABSL= 3
##$ALPHA= 0
##$AQORDER= 0
##$ASSFAC= 0
##$ASSFACI= 0
##$ASSFACX= 0
##$ASSWID= 0
##$AUNMP= <proc_1d>
##$AZFE= 0.1
##$AZFW= 0.1
##$BCFW= 0
##$BC_mod= 0
##$BYTORDP= 0
##$COROFFS= 0
##$CY= 12.5
##$DATMOD= 1
##$DC= 0
##$DFILT= <>
##$DTYPP= 0
##$F1P= 14.0000005364418
##$F2P= -0.99999901652339
##$FCOR= 0.5
##$FTSIZE= 32768
##$FT_mod= 6
##$GAMMA= 0
##$GB= 0
##$INTBC= 1
##$INTSCL= 1
##$ISEN= 128
##$LB= 0.3
##$LEV0= 0
##$LPBIN= 0
##$MAXI= 10000
##$MC2= 0
##$MEAN= 0
##$ME_mod= 0
##$MI= 0
##$NCOEF= 0
##$NC_proc= -3
##$NLEV= 6
##$NOISF1= 0
##$NOISF2= 0
##$NSP= 0
##$NTH_PI= 0
##$NZP= 0
##$OFFSET= 16.522
##$PC= 1
##$PHC0= -76.52114
##$PHC1= 9.231471
##$PH_mod= 1
##$PKNL= yes
##$PPARMOD= 0
##$PSCAL= 4
##$PSIGN= 0
##$REVERSE= no
##$SF= 250.13
##$SI= 32768
##$SIGF1= 0
##$SIGF2= 0
##$SINO= 400
##$SIOLD= 32768
##$SREGLST= <1H.CDCl3>
##$SSB= 0
##$STSI= 32768
##$STSR= 0
##$SW_p= 5175.98343685301
##$SYMM= 0
##$S_DEV= 0
##$TDeff= 65536
##$TDoff= 0
##$TI= <Analysis number 999999
Compound Code 99
Book Reference 9
Project Code 9>
##$TILT= no
##$TM1= 0
##$TM2= 0
##$TOPLEV= 0
##$USERP1= <user>
##$USERP2= <user>
##$USERP3= <user>
##$USERP4= <user>
##$USERP5= <user>
##$WDW= 1
##$XDIM= 32768
##$YMAX_p= 281208235
##$YMIN_p= -171655
$$ End of Bruker specific parameters
$$ ---------------------------------
##NTUPLES= NMR SPECTRUM
##VAR_NAME=  FREQUENCY,     SPECTRUM/REAL,   SPECTRUM/IMAG
##SYMBOL=    X,             R,               I
##VAR_TYPE=  INDEPENDENT,   DEPENDENT,       DEPENDENT
##VAR_FORM=  AFFN,          ASDF,            ASDF
##VAR_DIM=   32768,         32768,           32768
##UNITS=     HZ,            ARBITRARY UNITS, ARBITRARY UNITS
##FACTOR=    0.157963299565203, 1,           1
##FIRST=     4132.6476996994, 0,             0
##LAST=      -1043.33573715361, 0,           0
##MIN=       -1043.33573715361, -171655,     0
##MAX=       4132.6476996994, 281208235,     0
$$ Real data points
##PAGE= N=1
##DATA TABLE= (X++(R..R)), XYDATA
$$ [...]
14809g831k471K203K143L667m97o53K038J91k544q73q90K955j181l526l137R15
14793i491K975M599J199j301k295l438j236L013n23K857K203K63j088q681j976
14778a2920L621J277q20L577k156q46k206K225K118j85j983M264J082j969L519
14763a402L297n586l658M488K029m135k989K305L215O39k186l209k24J217k137
14748h336K512J66J47P10J135j690j418j265l173l060Q435K403n850j834Q56K061
14732h201K806K242o96j418J382j348K144Q52J136m212J287K522P35M327j274
14717B284j50m756J086J551l324K001o385p67O910L057l031p053k75K977M818
14702a057N617L333l107j553L224k245m108m122K466Q24l159m794j030k394M674
$$ y = [-7831, -10302, -8099, -5956, -2289, -2786, -3439, -1401, -1210, -3754, -4627, -5517, -2562, -3743, -7269, -10406, -9491, -6516, -1917, -718, -2019, -4314, -7752, -8988, -5975, -6498, -3641, -1438, -1175, -2263, -10944, -12920, -9299, -8022, -8842, -5265, -7421, -8267, -10473, -8248, -6130, -6315, -8298, -4034, -2952, -4921, -1402, 1895, -3691, -7349, -2861, -832, -4967, -7956, -5651, -2436, -1797, -3983, -7192, -7416, -6199, -8336, -5824, -5658, -5511, -4801, -3666, -5356, -6774, -8039, -11212, -14272, -5837, -3434, -9284, -11118, -10262, -8201, -5395, -3153, -3849, -5267, -3885, -5233, -3089, -2237, -1101, -5313, -4026, -1504, -769, 3558, 2284, 2134, -2622, -1536, 15, -3309, -1308, -7693, -8460, -1550, 1507, -1524, -8577, -8852, -5875, -1057, 4560, 7893, 4786, 3233, 6457, 4212, 104, -4018, -1552, -728, -3887, -8681, -9711, -12105, -7431]
14687g431R88O62L007j257K93L000l073l849n9M274L332o045k792l093J012M649
14671f382k166m63M037N862J987J710J65l249J632m585j081P85k154j603M830
14656f75k009L3K935K529L085p2O77o373k569J380j32j484n862K866J561k814
14640f924L098k273K73M116L645L154J018M05o068k252k099J10j007l292N25L073
14624d498K89K593n48l323J004r55O01J209p16j540L683k146L05L443J801j985
14608g83l408P85j182M970M11k103J714M991k471k115j643m306k574K893k340
14593g161m228j182J712P059M556l439j718R1M71l496O38N527K600k839n63K404
14577D32m090n771j099p48J028L540J537l244L139J719J431J265k998l019N35
$$ y = [-7431, -6443, -5781, -2774, -4031, -3738, -738, -3811, -7660, -7719, -3445, -113, -6158, -8950, -12043, -11031, -6382, -8548, -9011, -4974, 888, 2875, 4585, 4750, 1501, 3133, -1452, -2533, -1748, -3902, -5505, -675, -2684, -2651, 284, 2813, 5898, 5826, 6503, 130, -2439, -1059, -1191, -2675, -8537, -5671, -4110, -6924, -3826, -6099, -5826, -1710, 1935, 5089, 6107, 6512, 444, -1808, -3907, -3797, -4804, -8096, -7571, -4498, -4209, -1616, -2164, -5487, -4483, -5438, -4837, -3628, -4344, -5884, -2201, -4347, -4042, -599, 1202, -783, -4191, -3406, -4588, 382, 793, -1310, 404, 5395, 2924, 809, -834, -5140, -7714, -4821, -7161, -11389, -12571, -10859, -3800, 756, -2683, -4401, -4310, -3839, -7335, -6697, -1170, 1430, -1409, -1972, 432, -3658, -9429, -10528, -11276, -10248, -6708, -5171, -8415, -5276, -3557, -2126, -861, -3859, -6878, -6343]
14562f343J64l718j479P72R64N439m428J686R77q24K53L058j27k967k247O56J990
14545f174n49j476J960M887M211K751l982l674j720L039K477J449r34j788m74
14530Cj642M49L4k87K723j457j748J190J379n735J505N368j171L285R71l849J364
14513B382j868j879L090k938J858k187j120j473m366l344j518L616O617M685j73
14498A382j874N25K633l85l54K20j871m773L279J5j510K77l975j676K763J49N88
14481d587N77J409P978l805l474L179k624k2M004J111p40L241J787J83p31k31
14465G255k756p46K001k745j788J249R58j23l123P13q42M44J648K143J547j537
14449D298m013k086j698J387k008M965l78j388K084M134j939q083k09L178L251
$$ y = [-6343, -6179, -9897, -11376, -10604, -9640, -4201, -8629, -6943, -5966, -6790, -6537, -3479, -3606, -6573, -8820, -8164, -6174, -6723, -8199, -6239, -1352, 2859, 5610, 1628, -2046, -3766, -727, 1750, 3199, 2265, 477, 3, -1639, -1190, -1156, -1443, 1280, -177, -1925, -735, 644, -5091, -3586, 1782, 611, 3896, 4867, 1018, 2382, 514, -1365, 1725, -1213, 645, -1542, -2662, -4135, -8501, -11845, -13363, -9747, -3130, 1555, 1382, -492, 33, 2666, 2281, 1927, 2147, 276, -4497, -1218, -1203, -2713, -2436, -6411, -8087, -5324, -5175, -4587, -4010, -2601, 5377, 1572, -1902, 1277, -1347, -1369, 2635, 3746, 3006, 6247, 8034, 8217, 7486, 7255, 4499, 3753, 5754, 3009, 1221, 2470, 3428, 3305, 182, 895, 53, 497, 2145, 4288, 5835, 4298, 285, -1801, -3499, -2112, -4120, 845, 467, -921, 1163, 5297, 3358, -4725, -4934, -1756, 1495]
14434A495J089o73K345k389L066K522k748K170K128M41P93j1307m568J550j237
14419e323L350N236j962k305L474m71K329O667P74k311j458p71l324k216l966
14404b277l1P97J86j512l597O225L549k124M57M678O094M720L519p333o998k762
14388C591J407N691n08k992M578J814L376j519n415k730L58j703L10J900P929
14373A6087J078j765K379J388L074l722n211Q78O54r64K604n299j807m050P058
14358A2382K728O53L478K387k967j477K854M61q33K62k513J229N561N609m91j822
14342B7501K069J526n059k955L064R80n7J988J151L093q01m57k74k605N39K063
14326C1766L671K634k823J151N662M316PP02N902O426n835o244L01O630k252l636
$$ y = [1495, 2584, 1911, 4256, 1867, 4933, 7455, 4707, 6877, 9005, 9446, 10239, -1068, -5636, -4086, -5323, -1973, 3263, 1301, -1004, 2470, 1999, 4328, 10995, 11769, 9458, 8000, 7229, 3905, 1689, -2277, -2308, -1511, -1325, -2837, -6434, -209, 3340, 1216, 1673, 6351, 12445, 17165, 20684, 13351, 6353, 3591, 4998, 10689, 10181, 7189, 11767, 13581, 16957, 15438, 10023, 7293, 7651, 5948, 6258, 8158, 16087, 17165, 15400, 17779, 19167, 22241, 18519, 13308, 14186, 14840, 13876, 16480, 11181, 9374, 5324, 12382, 15110, 15763, 19241, 21628, 18661, 17184, 20038, 20499, 19666, 19928, 17415, 18644, 24205, 29814, 29323, 27501, 29570, 31096, 26037, 23082, 26146, 27126, 27069, 29057, 30208, 33301, 32500, 32043, 31769, 29164, 29703, 31766, 35437, 38071, 35248, 36399, 42061, 46377, 46384, 47086, 52988, 59414, 53579, 47335, 47636, 54266, 52014, 48378]
14310D8378j32N448J366K740L161L301J237K52j525K360j013O356K812m524p128
14295F3089j835K055n051l55R49n53K202M698M651j97j914m677k186j561j918
14280E7397j063N03m454r71q36l274m32l404j590N74L31M924N179K564n410j194
14264D8844n9j820p18q20m390m521j566J471K26J44k563l414J278l316j153j381
14248B6242j661N489j092m893j035J789j80J593M05j250q31l128J092j247K995
14233B4288M661l187m642K50L49j362k380j073k656l477L240K908j664l290k615
14218I350M874J293n192L97N567P24j901l118N82k440L710K314n75P27p145l728
14202E439j121N467N637J066k520j680m65J342o063o78k045k40L30J58R59K201
$$ y = [48378, 48246, 53694, 55060, 57800, 60961, 64262, 65499, 65751, 64226, 66586, 65573, 71929, 74741, 70217, 63089, 61254, 63309, 58258, 57903, 58852, 58299, 60501, 65199, 69850, 69653, 67739, 63062, 60876, 59315, 57397, 56334, 56837, 52383, 51412, 50576, 47302, 46870, 43466, 41876, 42450, 42781, 47705, 52884, 55448, 50038, 48844, 48785, 46965, 46247, 45427, 41037, 36516, 34950, 36421, 36647, 36791, 34228, 30814, 32092, 28776, 27623, 26242, 24581, 30070, 28978, 24085, 23050, 24839, 24659, 26252, 26657, 25407, 24576, 21448, 22540, 21293, 24288, 28949, 25762, 21120, 21370, 21719, 20357, 17977, 16904, 14248, 10771, 14011, 16919, 15255, 11965, 9350, 14224, 15517, 10325, 10722, 16289, 17013, 15112, 11994, 12576, 10136, 13846, 16160, 15585, 16312, 9167, 5439, 4318, 9785, 15422, 16488, 13968, 12288, 11823, 13165, 7102, 6424, 4379, 4139, 4469, 4627, 5586, 7787]
14186G787m45L291J571k987k33m460J951M899J334q85n404n319j508L621L688
14171F901k930m139m081L310P125L598r41q29l74L84m3K416l64l988J84O584L960
14154A6773j386l441k137k976P86l123R62r00Q4J262j323j77j112R65K229K663
14138I149k62J699J307K65n941o276j004L648L13l666j090q49K925K128j112j556
14122c22P16J726J589J760l9K338L849k740p124p507j068L314K960L16K804K10
14106B782j035J781Q19K740m51q37K67m042k377j908k388L065M395J37n328k699
14090e079K575N54L189L278M672K93l445k891j267M115J285j754K767O39l137
14075E794l968K674L979M93K772n79p39j639j585q49l759J848J562J976K704o24
$$ y = [7787, 7342, 10633, 12204, 9217, 8984, 4524, 6475, 11374, 12708, 11823, 6419, 1100, -408, 3213, 6901, 3971, -168, -4249, -939, 6186, 9784, 8843, 8014, 7640, 8024, 7981, 10397, 10033, 6045, 6229, 12813, 16773, 15387, 11946, 9809, 6833, 7619, 4496, 5458, 4558, 4642, 5904, 4581, 4404, 3292, 4257, 6486, 9149, 8887, 10586, 11893, 12158, 6217, -59, -1063, 2585, 2898, -768, -1858, -2707, 218, 2346, 1234, -322, 394, 2120, 3709, 5469, 5430, 7768, 11617, 8877, 1753, -5754, -6822, -3508, -548, -232, 2572, 2782, 1747, 3528, 4347, 7087, 6636, 5799, 6066, 2024, -353, -2261, -4649, -1584, 2811, 2948, -2380, -5079, -2504, -1950, 1239, 4517, 9189, 9482, 6037, 3146, 1879, 5994, 7279, 5525, 8292, 8931, 5794, 1826, 4500, 8479, 8972, 11744, 11165, 10426, 8787, 7202, 6353, 2594, 4442, 6004, 7980, 10684, 10060]
14059A0060K28Q90j439o50j464j701J274P05O07L045j572Q01M343l17p945r98
14043E867J368k987R26M693L149k401k838j708L969L174l557p372j721N225M033
14028I820r05m022J043K597O29n343Mr07K810L18O67j638J538J621L715Q06l482
14011I271j207J51m242l112J92M373K24M186O676o85l290K63l460R31j020j23
13995I128k874m40l28J758L745J00j878K272K760q49N65k443n101J73J487n163
13979B912n237J247K535L089K087j046l985O03J556K955N306O470L473m226j927
13964A5812P05J09k99k906N1J187l787j186M99k298o59O349O186K308n995J025
13948A7101L659K581n360l147L630j848k514J073r60q78n169j31k517q15K532
$$ y = [10060, 10288, 11178, 9739, 9089, 7625, 5924, 7198, 7903, 8510, 11555, 9983, 10784, 15127, 14810, 6865, 5867, 7235, 4248, 5174, 9867, 13016, 10615, 7777, 6069, 10038, 13212, 9655, 2283, 562, 5787, 9820, 8915, 4893, 5936, 8533, 9162, 3819, 3823, 2916, 5726, 6044, 6711, 5073, 6611, 8232, 11947, 12753, 9271, 8064, 8215, 3973, 861, 1053, 5426, 5650, 9836, 16512, 15827, 12537, 12800, 9340, 10271, 9251, 9128, 6254, 5814, 5486, 7244, 10989, 11089, 9211, 11483, 14243, 13394, 13959, 11516, 6415, 6588, 8075, 2912, -2325, -1078, 1457, 4546, 6633, 5587, 1602, 2205, 3761, 6716, 12022, 18492, 21965, 17739, 15812, 16517, 16626, 16327, 13421, 13472, 14659, 10872, 9686, 10185, 7887, 7228, 13577, 19763, 22071, 16076, 17101, 20760, 23341, 17981, 14834, 18464, 16616, 14102, 15175, 14215, 13337, 8168, 8037, 5520, 4705, 7237]
13933G237K865K037k958q6m311J664l79l921L10L543K512L64J779m759P91J36
13917F824J326M647M71j378N535k139m115J448k807q25J302p77k009L654L795
13902A4952l90K06p95k079n1k431J599K481k127j660k329l102m355k487J146K352
13886I30O852P391L308j469k975J506m378l261J612k655N23k117l498J78L869
13871E816K657L121M073O95R89j239n798J048M29j181K21R57K263k121l295j58
13855H477O11R04K765M39Q87P09l288j132K462R373n99k721j648r08j263k937
13839A2131m172L128l819L27M788r84M036k687J500M750j445l955j626k178k079
13824G715K764L319o77L000l206l077L387L371R34n08m024J336j275k824q62J689
$$ y = [7237, 10102, 12139, 9181, 9095, 4784, 6448, 6069, 2148, 2458, 6001, 8513, 8877, 10656, 5897, 6688, 6824, 8150, 12797, 13268, 11890, 17425, 15286, 11171, 12619, 9812, 8987, 10289, 9512, 7503, 11157, 14952, 14562, 14768, 13973, 11894, 11843, 9412, 11011, 13492, 11365, 9705, 7376, 4274, -81, -2568, -1422, 930, 7782, 15173, 18481, 17012, 14037, 15543, 11165, 7904, 9516, 6861, 7384, 5267, 1769, 1947, 5816, 8473, 11594, 15667, 16362, 17351, 16112, 10314, 11362, 11791, 10610, 10831, 11788, 14051, 11930, 8635, 8477, 9088, 9992, 12757, 13196, 14083, 14792, 11504, 10372, 12834, 22207, 21608, 18887, 17239, 16331, 15068, 12131, 7959, 11087, 7268, 7595, 12383, 11399, 15435, 12748, 14248, 18998, 17553, 13598, 11972, 9794, 7715, 10479, 13798, 13121, 16121, 12915, 9838, 13225, 16596, 17530, 17022, 12998, 14334, 13059, 10235, 9373, 11062]
13808A1062J327M90J986K738n97K436k647Q08j767M06l714m450Q71r78M411j952
13792A0430k402K667P565M042l078p880m638q49j698L877K756L433N130m08n533
13777A3414o11P16k44L735o257J643N059M57m879j345l83M45K767k383l707m92
13761G935n432j49m341J370K420J441R496q5l874L449J965l573m607M686M90j947
13745I244j670k374J345j827N097N668j476m611J699j060J313j303j917M444L689
13730A6261k631j204k943J764O94j137L95K098l07j967j470L844j155j957J270
13715A1555J38j442j293l472K23K816J060K531j51l966J005K807M766p32M80n40
13699A5785l42m724j47M443J101J04l829r85j19P049L754K994j585k161l834L87
$$ y = [11062, 12389, 12879, 14865, 17603, 17006, 19442, 16795, 17603, 15836, 16242, 12528, 8078, 8949, 7971, 12382, 10430, 8028, 10695, 18260, 22302, 19224, 11344, 6706, 5857, 4159, 8036, 10792, 14225, 19355, 18947, 13414, 12803, 13519, 13275, 17010, 10753, 12396, 17455, 17912, 13033, 11688, 11305, 11750, 14517, 12134, 8427, 7935, 2503, 2354, -1987, -617, 1803, 3244, 12740, 12655, 8781, 12230, 14195, 10622, 6015, 10701, 11191, 9244, 7574, 5200, 6545, 4718, 9815, 15483, 14007, 9396, 11095, 10035, 11348, 10045, 8128, 12572, 16261, 13630, 12426, 9483, 11247, 11941, 10804, 11199, 13297, 12990, 11023, 9553, 13397, 12242, 10285, 11555, 11693, 10251, 8958, 5486, 5709, 8525, 9585, 12116, 11965, 7999, 9004, 11811, 16577, 15845, 16325, 15785, 15443, 10719, 10572, 15015, 16116, 16220, 12391, 11406, 11287, 18336, 22090, 25084, 23499, 21338, 17504, 17891]
13683A7891m905r52M141N04K635j136N41n32j083K74M747n3n037k234J107j292
13667A4616l035j843N50M107K494j106Q63l111N51k855M039P084J443j53K278
13652B5922j997l602M932K38j47l912m163j632J900O41o548K136M588L362M330
13637B6048K435K70L85o104k957l928J872K874r09J132L404j134l727l029r10
13622A5722L229n54P48n404j411N024J766k47M66o71n244o04O859L200P473j475
13606B8877m519m091J186P52K516k066L641M260l682k052Q87J552o46m708k48
13591B1659L349L74J023J666J071j388P21K007m874P58j801k660R57o20o43j240
13575B0359N25M097J447k031l355L041P159k158j459m085k20K078l150m509K235
$$ y = [17891, 12986, 12034, 16175, 16679, 19314, 18178, 18719, 18187, 17104, 17378, 22125, 22072, 17035, 14801, 15908, 14616, 11581, 9738, 10288, 14395, 16889, 15783, 16646, 13535, 14086, 11231, 15270, 22354, 23797, 23644, 25922, 23925, 20323, 25255, 25493, 25346, 21434, 17271, 15639, 17539, 18180, 11632, 13768, 18356, 21718, 26048, 28483, 28753, 29138, 23034, 20077, 16149, 18021, 20895, 19986, 21118, 24522, 23388, 19661, 16632, 15722, 18951, 18397, 19145, 13741, 12330, 17354, 19120, 18873, 19339, 18668, 13424, 12820, 19679, 22879, 30352, 28877, 24358, 20267, 21453, 22205, 24721, 22655, 26296, 30556, 26874, 24822, 25709, 27261, 26615, 21907, 21659, 25008, 25382, 26405, 28071, 29142, 27754, 28475, 30482, 25608, 26366, 24565, 21905, 22862, 22242, 21599, 20359, 20884, 24981, 26428, 24397, 21042, 24083, 31242, 29084, 27625, 23540, 23320, 25398, 22248, 17739, 19974]
13560A9974Q449Q49n335l322n07K427J898K154M88n428k040K256Q480J212n091
13545B6464l714J915K351J414j70j021M36j737L929O592R47p175m875j785J888
13530B5459p67j135J698K089j552k638k294k600R92N123L381n30K89J208k503
13515B6220j24l256j072r57q41L779K281m171K825Q05j290r19k137J821L937J841
13499B8742J002j506n135q77L92q95o30k930l654K619O305l0L713N185M81L406
13483C6188O89n452q080L205j16M118M734L58n690m944r18K683R50k12N726N580
13467C8819k430p571j961k24N789K658l971L147j161o377j640J012q76m621Q41
13452B1434L351Q65p73L008%p25l21o0J248q93Q40k16l478M949M702l570j750
$$ y = [19974, 28423, 29272, 23937, 20615, 20108, 22535, 24433, 26587, 27075, 21647, 19607, 21863, 30343, 31555, 26464, 22750, 24665, 27016, 28430, 28260, 27239, 27675, 25938, 29867, 36459, 37406, 30231, 25356, 23571, 25459, 24692, 23557, 25255, 27344, 25792, 23154, 20860, 18260, 19252, 24375, 27756, 27226, 27515, 28723, 26220, 26096, 22840, 21768, 20811, 19970, 23749, 26030, 21859, 24684, 25489, 24199, 23280, 21143, 22964, 26901, 28742, 29744, 28238, 23103, 22226, 22618, 21723, 21093, 18163, 14509, 17128, 23433, 23403, 27116, 32301, 32782, 36188, 36877, 31425, 23345, 26550, 26434, 30552, 35286, 35644, 29954, 25010, 24092, 26775, 27725, 27513, 33239, 38819, 36389, 28818, 26857, 26633, 32422, 35080, 31109, 34256, 33095, 26718, 25078, 26090, 25214, 20593, 21434, 24785, 25650, 24877, 27885, 27885, 27160, 26839, 26779, 28027, 27134, 27974, 27758, 24280, 29229, 33931, 30361, 28611]
13435B8611L589Q63M21N936K395N93k133J293l218o031o776r56J67K349K250K065
13419C1418J352p80K767l532k457MM54K641M280j219J158j637k967P253P936l262
13403D3409l297q6j091K084K163p57m634l827J225J479M043K700P463k036l791
13388D5047m508R41J37j768q95M95k408L072k1K058N93k838k147m695M414J805
13372C9282K623L179n116j809p87J267O64k673p75K652K578J340k602k888L282
13357D0217k124O77j509N1K881k104j395R77J241L974L439j903j1088k079K408
13342C3663K778m923K667K501J496j169r85J473j199P46M528K98k548q018l746
13327B7562N695Q36J319L802K074j322l35k194j085L73k401K763K965J598j244
$$ y = [28611, 32200, 33063, 33484, 39420, 41815, 42408, 40275, 41568, 38350, 32319, 25543, 24587, 24754, 27103, 29353, 31418, 32770, 31990, 34757, 31225, 28768, 28772, 29226, 31867, 36147, 34928, 36086, 34449, 31482, 38735, 46671, 43409, 40112, 40026, 38935, 41019, 43182, 42425, 37791, 33964, 35189, 36668, 40711, 43411, 50874, 48838, 45047, 40539, 41480, 41617, 39849, 38954, 39449, 37041, 40113, 40092, 42150, 42743, 39905, 37758, 33063, 37477, 39282, 41905, 45084, 39968, 38159, 37372, 38639, 39303, 36630, 35855, 38507, 41085, 42425, 39823, 36935, 40217, 38093, 38770, 37261, 37312, 40193, 38089, 36694, 37671, 38912, 42886, 46325, 44422, 33334, 31255, 33663, 36441, 31518, 34185, 36686, 38182, 37013, 36028, 37501, 36302, 37048, 41576, 41874, 39326, 31308, 27562, 33257, 34093, 35412, 39214, 41288, 39966, 39631, 37437, 36352, 36725, 34324, 37087, 40052, 41650, 40406]
13312D0406j344L896L62k598J503k202J227j462L723k797m222l9L649K05R55J319
13296D2581k704J846M261M037j037L00k348k364p61K614k688r02N508k324L320
13281D9339M771m304j915J362K386k327o766K220J661P93M70Q00k585L260r41
13266D8224o402L672j884j266K631K916J631J639K952K795j603l23j0R50M923
13251F0845j477k783m716O41r61O70M335n04j180j113J040J243r25k100m395j318
13235D7302m829n43M233M520j436l314J715j205K822K644K643n62j013M932l360
13220E4549K65L501M583j317l442r10j507K40O62j196J76k16k16k34k383n515
13204D7040K848k10k90J78J757J746M914j538n268K260J440J467N45K344K247
$$ y = [40406, 39062, 42958, 43320, 40722, 42225, 40023, 41250, 39788, 43511, 40714, 36492, 36453, 40102, 40307, 41262, 42581, 39877, 41723, 45984, 50021, 48984, 49284, 46936, 44572, 43811, 46425, 43737, 42835, 48343, 46019, 49339, 54110, 49806, 47891, 49253, 51639, 49312, 42546, 44766, 46427, 47220, 47690, 48490, 45905, 49165, 48224, 41822, 45494, 43610, 42344, 44975, 47891, 49522, 51161, 54113, 56908, 55305, 54982, 54972, 55922, 60845, 59368, 56585, 51869, 52510, 51549, 52219, 56554, 56050, 54870, 53757, 54797, 56040, 55115, 53015, 48620, 47302, 42473, 41930, 46163, 50683, 49247, 45933, 47648, 46443, 49265, 51909, 54552, 53990, 52977, 57909, 54549, 54814, 58315, 62898, 61581, 58139, 57229, 55722, 55962, 56624, 55428, 55604, 55388, 55172, 54938, 52555, 47040, 49888, 49678, 49388, 49566, 51323, 53069, 57983, 56445, 51177, 53437, 54877, 56344, 56889, 59233, 61480]
13189F1480m195m190K405J005K10r90l168j681K590J000J071P05j120k514p36
13174E1872j740o4J601k334q03J261J893M139L775j086j545J145N155M499o385
13159F1383k324K430K497m72j61L923L860k792m068L37N37m919R25J839K714l856
13143F1853n229M12L038K700L875K953k485o309J996O41K332j09m57J034J312
13128F7557K783j849j242M65m870p590l234N667M027k143k467L130N177K742n758
13113F2395j250L083J013l262M304K472l683P82N603R04m857L26J006J902N122
13098G5860k370J945M149l106m510j137m585K567P242K131o88o42l696n99k348
13083G0213k262j433L139L697J675P46k157n558Q4k15k790M247k475k465r77k28
$$ y = [61480, 57285, 53095, 55500, 56505, 56715, 55725, 52557, 50876, 53466, 54466, 55537, 56242, 55122, 52608, 51872, 50132, 50068, 51669, 49335, 48532, 49793, 51686, 55825, 59600, 58514, 56969, 58114, 63269, 67768, 61383, 59059, 61489, 63986, 63514, 63353, 67276, 71136, 68344, 64276, 64613, 65150, 60231, 61156, 62995, 65709, 61853, 56624, 57036, 60074, 62774, 66649, 69602, 67117, 60808, 62804, 63445, 65777, 65668, 65211, 66245, 67557, 70340, 68491, 67249, 67714, 62844, 55254, 52020, 57687, 61714, 59571, 57104, 60234, 65411, 68153, 62395, 61145, 64228, 65241, 61979, 66283, 68755, 65072, 65854, 71457, 72361, 67504, 67830, 68836, 70738, 75860, 73490, 75435, 79584, 76478, 71968, 70831, 66246, 68813, 76055, 78186, 77498, 76856, 73160, 72561, 70213, 67951, 66518, 69657, 73354, 75029, 75775, 73618, 68060, 68144, 67929, 65139, 69386, 66911, 64446, 63469, 63241]
13067F3241J628M69M97L073P453J758Q58O10M054J333k520l347q36l328n710J057
13051G0290J215J378K699N276K454K545j393j375n934l222K017L38j453j517p79
13036G2539P07j74J938K932K351m637j723K873o18j198k052j753N959L078J866
13021H2088k435R83P79j513n30n563j93O230N828l601k82M008k45J951l996k427
13005H1082J679m360o85J239N07K302L84J541n469k917M597J755o856J097K600
12990G8496L147q95M252j581j087L486K811K839J03r100n801O57p22k99J277J77
12974G7760M79O266J815p04J904j06Q72l108J030O64J675K626l464m835K906J857
12958H7637l948K988L219k334k633j444M53L631M827J963L785k018j192q22r92
$$ y = [63241, 64869, 65338, 65835, 68908, 76361, 78119, 78977, 79587, 83641, 84974, 82454, 79107, 78271, 74943, 69233, 70290, 71505, 72883, 75582, 80858, 83312, 85857, 84464, 83089, 77155, 73933, 75950, 76288, 74835, 73318, 72539, 73246, 73072, 75010, 77942, 80293, 75656, 73933, 76806, 76188, 74990, 72938, 71185, 77144, 80222, 82088, 79653, 80636, 81415, 79902, 79372, 73809, 73616, 79846, 85674, 82073, 81791, 85799, 85554, 87505, 83509, 81082, 82761, 78401, 77716, 78955, 79462, 81764, 82148, 83689, 78220, 75303, 79900, 81655, 74799, 75896, 78496, 81643, 80748, 85000, 83419, 82332, 85818, 88629, 91468, 91571, 82471, 76670, 77327, 76605, 76306, 77583, 77760, 78239, 84505, 86320, 85616, 87520, 87414, 88286, 85178, 86208, 86872, 88547, 91173, 87709, 82874, 85780, 87637, 83689, 86677, 89896, 87562, 84929, 83485, 83938, 87569, 92396, 94359, 98144, 96126, 94934, 94112, 93120]
12943I3120J156q91m594k404K794J959m705j681M366J473j175K060K748K98J034
12928I5558o64J418J18K043j908m378J188M116j143o068m343J084J176N923M659
12913I8779J363q46n059K40O73N58M078O32k773m616J280R27m771N19J985j811
12897I1158K738N585J553n19L416l725k091K365L401j892j873L119L338J379L350
12882A11302j221K976M615k404M871K315O736K898O520N735L707J024L637l700
12868A49011L487L936J163O787N850O412O271Q063J2489J4878J6281K3348L4603
12855B92579M4657N9625P5513R3196J01518J09989J13745J01281R3570P6221M7570
12844A209464K1023o766l7084o7711q2675r9391j05166j02715r5839q6341p6701
$$ y = [93120, 94276, 93385, 88791, 86387, 89181, 91140, 86435, 84754, 89120, 90593, 89418, 91478, 94226, 94524, 95558, 94894, 96312, 96430, 98473, 96565, 92187, 93375, 97491, 96348, 90280, 85937, 87021, 88197, 94120, 98779, 100142, 99296, 94237, 94477, 95150, 95708, 99786, 100418, 97645, 93029, 94309, 95236, 90465, 90984, 92969, 91158, 93896, 99481, 101034, 100515, 103931, 100206, 98115, 100480, 103881, 101989, 100116, 103235, 106573, 107952, 111302, 110081, 113057, 117672, 115268, 120139, 122454, 129190, 132088, 138608, 144343, 148050, 149074, 152711, 149011, 152498, 156434, 157597, 164384, 170234, 176646, 182917, 190980, 203469, 218347, 234628, 257976, 292579, 337236, 396861, 472374, 565570, 667088, 777077, 890822, 992103, 1085673, 1161894, 1209464, 1230487, 1223721, 1186637, 1118926, 1036251, 936860, 831694, 728979, 633140, 546799, 470098]
12833D70098o3480o0840m6904l0875j9878j4037j6166j4356j1694j1718q086n206
12821A66858n645q554j550l23l884n741k050j578M05K137K058k082o117n656k814
12806A25464K6J673q44m346K216M466N228M703J279L536N117Q201N01r127NK929
12790A51027k206O40m783q728n908j367K79N6l395n252L661O364P58n371m348
12775A21427k606j504R21j343J060K544L912P3n37LL557k870q478j331L313K83
12759A18424N15J907M679m537k072K119J587K68K951o35j154k204J097L322J45
12744A26412L55j421l15L524M941K954j460L403K952q015m725K330K460j329M98
12729A32564r97K746O253K954l704k663m2q96J68L609r68j76l2K516l39N6j630
$$ y = [470098, 406618, 345778, 298874, 267999, 248121, 234084, 217918, 203562, 191868, 180150, 172064, 166858, 161213, 152659, 151109, 150786, 146902, 141161, 139111, 137533, 137938, 140075, 142133, 140051, 133934, 128278, 125464, 125490, 127163, 126319, 121973, 124189, 128655, 133883, 138586, 139865, 143401, 148518, 156719, 157220, 148093, 148098, 151027, 148821, 149461, 144678, 135950, 130042, 128675, 128954, 129010, 125615, 120363, 124024, 130388, 131146, 125775, 121427, 118821, 117317, 118238, 116895, 117955, 120499, 124411, 124484, 123947, 123950, 127507, 124637, 116159, 114828, 118141, 118424, 118939, 120846, 125525, 120988, 118916, 121035, 122622, 122890, 125841, 125206, 124052, 121848, 122945, 126267, 126412, 126767, 125346, 125031, 128555, 133496, 136450, 134990, 138393, 141345, 133330, 128605, 130935, 133395, 132066, 132564, 131567, 134313, 140566, 143520, 139816, 137153, 137111, 136215, 136383, 139992, 139024, 138848, 138816, 141332, 140993, 141049, 139419]
12712A39419j494N885Q542J0783P695L857j533l351m899n798m000j53j36k027
12698A52790n796m91N2L51L393R44l257o709j033J786O505O52m019m347r57j571
12682A38293l073N531P901J457k681k104k213k039j203j568j451J08O713L107
12668A46778M04p93k114n475k048n508J963O960j421K148Q128M452j182m909m063
12653A43320L197M940K215m799k753J357J770J579J725m865j077J920L44N744
12639A54617J245l08k50j724n874k437L67L381j987m323J424Q266L5m73k971M50
12623A49438l99j962m424L656O770M572j858r67q56l785k814k596O858K510l376
12608A50767p62K707q61K537O122Q66n268l89K11o36K575J778k52L610L265K118
$$ y = [139419, 137925, 143810, 152352, 163135, 170830, 174687, 173154, 169803, 164904, 159106, 155106, 154953, 154817, 152790, 146994, 146503, 146555, 146906, 150299, 151243, 147986, 141277, 140244, 142030, 148535, 149187, 145168, 140821, 139864, 138293, 135220, 140751, 148652, 150109, 147428, 145324, 143111, 141072, 139869, 138301, 136850, 136958, 143671, 146778, 147182, 146389, 144275, 138800, 136752, 131244, 133207, 140167, 138746, 140894, 149022, 153474, 152292, 147383, 143320, 146517, 151457, 153672, 148873, 146120, 147477, 149247, 150826, 152551, 147686, 146609, 148529, 148873, 154617, 155862, 155554, 155304, 153580, 147706, 145269, 145636, 149017, 147030, 142707, 144131, 152397, 152432, 151959, 148988, 149438, 149039, 147077, 142653, 146309, 153079, 157651, 155793, 154826, 153970, 150185, 147371, 144775, 151633, 154143, 150767, 150005, 152712, 151851, 154388, 160510, 161376, 156108, 155719, 155930, 155294, 157869, 159647, 159395, 163005, 166270, 168388]
12592A68388L03r30l940k841j813j792n57K375p1n1l676k753j328q99L66L581
12576A54362J770O909K077L296j773L255j551l672L577k046l816j43r30J941L882
12561A67138P88J421L040p58j960m205q95O344J314N11j858q952J402P231K623
12546A73184m06Q91O79q86m378n865K020k95O5K488K549J577m724L25J167J820
12530A70211R76j598k715J75M924O631L081J094L847K913o65K034P08J55L41J870
12514A93982J446j248o00Q76Q97o395J629K210l196L91m204p262L262K578n984
12499A78382l441N629R919N368j605J374l7q93l715K091N68j517L38P64K1Q565
12483B01811L217l361k986M36n56N56M257N968Q427Q351M498K955K740R646R91
$$ y = [168388, 168691, 167761, 163821, 160980, 159167, 157375, 156818, 159193, 159122, 159071, 155395, 152642, 151314, 150415, 150781, 154362, 156132, 163041, 165118, 168414, 166641, 169896, 168345, 164673, 168250, 166204, 162388, 162245, 161315, 163256, 167138, 167926, 169347, 172387, 171629, 169669, 165464, 164569, 170913, 172227, 172738, 170880, 161928, 163330, 170561, 173184, 172778, 173669, 174348, 173462, 169084, 163219, 165239, 164944, 165009, 167497, 170046, 171623, 166899, 167224, 168391, 170211, 171187, 169589, 166874, 167049, 171973, 178604, 181685, 182779, 186626, 189539, 188874, 190908, 191616, 191771, 192112, 193982, 195428, 194180, 193580, 194456, 195353, 188958, 190587, 192797, 189601, 189992, 185788, 178526, 181788, 184366, 178382, 174941, 180570, 190489, 195857, 194252, 195626, 195589, 194696, 190981, 193072, 193640, 192123, 192461, 193225, 193246, 201811, 205028, 201667, 198681, 199117, 198561, 199117, 203374, 209342, 217769, 226120, 230618, 233573, 236313, 245959, 246950]
12468B46950n56Q200J297J830k365l479n677k922n549n243q083n324p96L524L526
12453B25333O268P410J690J359Q048Q198P127J856L39K806L74m551k189n049m685
12438B54334n832m879l520k253l86k460K846O92L302L740J1844P861M083J0910
12424B80282J1864R853L691j908l849K026n315q630n298p486l561r166q855k742
12410B50906j524N227L830j916K767J0159O922N515O321R419N321l083k915n698
12396B91251J769m779r566o835o334r485p727p054o297m559J244J211N724J853
12382B40416L982P776Q417N394m37K997M982J992l999l23J588l561q223j0955
12368B50046m726m1K097J878l331J18K162K980L852N14M890M905J0108P581j597
$$ y = [246950, 246394, 254594, 255891, 257721, 255356, 251877, 246200, 243278, 237729, 232486, 224403, 219079, 218283, 221807, 225333, 231601, 239011, 240701, 242060, 250108, 258306, 265433, 267289, 267628, 270434, 270808, 266257, 264068, 259019, 254334, 248502, 243623, 240103, 237850, 237464, 235004, 237850, 238542, 241844, 245584, 257428, 265289, 269372, 280282, 292146, 301999, 305690, 303782, 299933, 301959, 296644, 288014, 282716, 275230, 271669, 262503, 253648, 250906, 249382, 254609, 258439, 256523, 259290, 269449, 276371, 281886, 288207, 297626, 302947, 299864, 296949, 291251, 293020, 288241, 278675, 271840, 265506, 256021, 248294, 241240, 234943, 230384, 231628, 232839, 238563, 240416, 244398, 252174, 260591, 265985, 265548, 268545, 273527, 275519, 271520, 271197, 272785, 269224, 261001, 250046, 245320, 245279, 247376, 249254, 245923, 246041, 248203, 251183, 255035, 255549, 260439, 265344, 275452, 283033, 281436]
12353B81436n103o208l650o966k014l341k465m014j784p458j0519m659p38m043
12339B18474Q84p28j234P15M060j659L410M238L603j495j477l701k587o59l249
12324B18595J547K190l915k751n628j568M512Q872J045k07r85l246K598P058O859
12309B34976M192J999m065j312Q070J542n434l993l461m143o657l382M851J481
12295B24664o458l042j462n713K731j13J135N450K63k050M181M056L140r6l33
12280B26353n349k913j033J1K754J225L07j455k246o401n769M255N459J364j40
12265B16422L460L165j100L227J246M32J384K556o671k132m503j945J578k781
12251B14338k571L6J390j393j980J812K14K017O219l11l137j069K082L652M16
$$ y = [281436, 276333, 270125, 266475, 259509, 257495, 254154, 251689, 247675, 245891, 238433, 227914, 223255, 222517, 218474, 219358, 218630, 217396, 218111, 222171, 220512, 223922, 228160, 231763, 230268, 228791, 225090, 222503, 221844, 218595, 220142, 222332, 218417, 215666, 210038, 208470, 212982, 221854, 222899, 222692, 221707, 218461, 221059, 228117, 234976, 239168, 241167, 237102, 235790, 243860, 245402, 239968, 235975, 232514, 228371, 221714, 218332, 223183, 224664, 218206, 215164, 213702, 207989, 210720, 210607, 211742, 217192, 217455, 215405, 219586, 223642, 226782, 226686, 226353, 221004, 218091, 217058, 217069, 219823, 221048, 221355, 219900, 217654, 211253, 205484, 209739, 215198, 216562, 216422, 219882, 223047, 221947, 225174, 226420, 226852, 228236, 230792, 224121, 221989, 217486, 215541, 217119, 214338, 211767, 211803, 213193, 211800, 209820, 211632, 211846, 213863, 220082, 219771, 216634, 215565, 217647, 221299, 221715]
12236B21715l791j219P24n7p7l667J051N848Q37m26k358k26L476L406K677K357
12220B30270K59N31P31j147l822M44M658K079n416l779m87J299j977l949l72n563
12204B13759L285M097J425K09k310m727N18O789M976J261l470k328p71K067k2
12189B24758k718k513k456l191K297n931L651N886J745J052K822K130K050J00
12175B29682j471k09J095L230l141j257L583J484j967n748m361l864K475L109
12161B22640O281L205m330k960Q65M185j290m711K869N733j632J212q62L886J103
12146B36194j959o491l512j617M121K05J329M672N331J470l216j094J780P221
12132B44434P830Q619K222J829O193Q254Q863J0909R230R544P207Q649J7181J5874
$$ y = [221715, 217924, 216705, 217429, 217372, 217295, 213628, 214679, 220527, 221364, 220938, 218580, 218354, 221830, 225236, 227913, 230270, 230529, 231060, 231791, 230644, 226822, 227266, 231924, 234003, 228587, 224808, 224321, 225620, 223643, 219694, 219322, 213759, 217044, 221141, 222566, 222775, 220465, 215738, 216256, 223045, 228021, 229282, 225812, 223484, 222713, 224780, 224758, 222040, 219527, 217071, 213880, 216177, 210246, 213897, 219783, 221528, 222580, 225402, 227532, 229582, 229682, 228211, 228002, 229097, 232327, 229186, 227929, 231512, 232996, 231029, 225281, 220920, 217056, 219531, 222640, 228921, 232126, 227796, 224836, 225701, 229886, 228596, 223885, 226754, 232487, 230855, 232067, 231205, 235091, 236194, 234235, 227744, 224232, 222615, 226736, 226941, 228270, 232942, 238273, 239743, 236527, 235433, 237213, 244434, 252264, 260883, 263105, 264934, 271127, 279381, 288244, 299153, 308383, 317927, 325134, 333783, 350964, 366838]
12118C66838J9293K6429K6826L1176L2200M3942O0388P4414R4293J25393J76644
12107A077836K26300K48134K51773K62968K73645K75958K46834J90776J30759
12098C184983O1644O1p5103j33374j58824j76906j94215k11240k00306j61250
12088A935470j02482l2454L8300J13111J72145K07740K30460K50035K72901K57971
12078C343197K09578J52156R7150L5300l6388r5349j20836j20960j28556j37689
12068C197603j19245n7967L6455J60911L10730N00539P15895Q73619R62710J027414
12058G608664J088643J120604J048575Q94867O78378M32818J49374j59278m27576
12049A2435069n99949p16371q07929q79525q89421p84964n98706l48506n8644
$$ y = [366838, 386131, 412560, 439386, 470562, 502762, 546704, 607092, 681506, 775799, 901192, 1077836, 1304136, 1552270, 1804043, 2067011, 2340656, 2616614, 2863448, 3054224, 3184983, 3246627, 3246688, 3171585, 3038211, 2879387, 2702481, 2508266, 2297026, 2096720, 1935470, 1832988, 1800534, 1838834, 1951945, 2124090, 2331830, 2562290, 2812325, 3085226, 3343197, 3552775, 3704931, 3802081, 3837381, 3800993, 3705644, 3584808, 3463848, 3335292, 3197603, 3078358, 3020391, 3056846, 3217757, 3528487, 4029026, 4744921, 5618540, 6581250, 7608664, 8697307, 9817911, 10866486, 11761353, 12439731, 12872549, 13021923, 12862645, 12435069, 11835120, 11118749, 10310820, 9431295, 8541874, 7756910, 7158204, 6809698, 6751054]
12040F751054K47421N16443O84834Q12910R30776J017199J001752Q62881O64077
12031A3489347M25604J56041j48398m37920o15499p27353q23366r00269r29128
12022I489059q30551o36071m00389j18982K14307N77690R20925J200591J421560
12013A1838139J564860J612958J592982J484810J260719Q97676M72960J5357m12736
12004B0327725p51348j054650j256791j350570j400927j338464j177275q85755
11996A1111945m43900L7916M73873Q27509J116767J330520J465418J487307J407526
11987A8814881J204848Q61158M48088r518m69635q32361j142846j375355j512897
11978A5986363j603110j588611j475745j268548r63972o19002k76284O6073M01704
$$ y = [6751054, 6998475, 7514918, 8199752, 9012662, 9943438, 10960637, 11962389, 12825270, 13489347, 13914951, 14070992, 13922594, 13484674, 12869175, 12141822, 11318456, 10418187, 9489059, 8658508, 8022437, 7622048, 7503066, 7717373, 8295063, 9215988, 10416579, 11838139, 13402999, 15015957, 16608939, 18093749, 19354468, 20252144, 20725104, 20740461, 20327725, 19576377, 18521727, 17264936, 15914366, 14513439, 13174975, 11997700, 11111945, 10668045, 10705961, 11179834, 12007343, 13124110, 14454630, 15920048, 17407355, 18814881, 20019729, 20880887, 21328975, 21319457, 20849822, 20017461, 18874615, 17499260, 15986363, 14383253, 12794642, 11318897, 10050349, 9086377, 8467375, 8191091, 8257164, 8658868]
11969H658868O83286Q44056R19749R75890J012474R41550P26844M50109J59056
11960A5371882j39560m27110o99846q73227r48937r81956j000239r71357q18975
11951H510675n38707k11311J11143M09225O71693Q50088R37819R79396J009375
11942A2729396R51664P46499M63511J52015j52254m55888p50622r66259j070304
11933A1647758j136427j183451j205777j141394r63603p56435n69426l91227k29844
11924D070174r2195R717P8784J36533J87491J91262J55847J00513L5622l7470
11914D836278j23353k05726k48588k56139k63296k84902k94577k55261j74822
11905B729614r5720q169Q4160J58944K05718K27088K45209K54277K47184K02208
$$ y = [8658868, 9342154, 10186210, 11105959, 12081849, 13094323, 14035873, 14762717, 15212826, 15371882, 15232322, 14805212, 14105366, 13232139, 12283202, 11301246, 10301007, 9329650, 8510675, 7971968, 7760657, 7871800, 8281025, 8952718, 9802806, 10740625, 11720021, 12729396, 13681060, 14427559, 14891070, 15043085, 14890831, 14434943, 13684321, 12718062, 11647758, 10511331, 9327880, 8122103, 6980709, 6017106, 5260671, 4691245, 4300018, 4070174, 3977979, 3987696, 4066480, 4203013, 4390504, 4581766, 4737613, 4838126, 4873748, 4836278, 4712925, 4507199, 4258611, 4002472, 3739176, 3454274, 3159697, 2904436, 2729614, 2633894, 2625725, 2709885, 2868829, 3074547, 3301635, 3546844, 3801121, 4048305, 4250513]
11895D250513J28708N5861j8666j06245j97695k57600k82488l01351l33987l52446
11885B584604l35975k97746k50179k08779j67150j40626j14596r1386o6460n2534
11875H59173m2112l6822l1245j8122j4555j6236j1917o980j582J1928J8414L0769
11863G40713M7124N7044P7091Q8971R0281Q1336N1401K1664r008l6814n1221n6394
11851A102188n6453n4343n1423m7506m0452m3164m7337m6616l4538k9787k7191
11840F23378k7925k1792j5543j7117j2925n064j653m200j84O850J0324N378M173
11827E43700J4849J6258J6430K5368L1151L7590N0723P4932R8655J22075J49156
11816A180887J68656J57883J34565J00395N9966K2675L585O286K4095O0150Q8518
$$ y = [4250513, 4379221, 4435082, 4416416, 4310171, 4112476, 3854876, 3572388, 3271037, 2937050, 2584604, 2248629, 1950883, 1700704, 1491925, 1324775, 1184149, 1069553, 978167, 911707, 859173, 817061, 780239, 748994, 730872, 716317, 700081, 688164, 681184, 679602, 691530, 709944, 740713, 787837, 844881, 921972, 1010943, 1101224, 1182560, 1233961, 1255625, 1246617, 1209803, 1158582, 1102188, 1045735, 991392, 939969, 892463, 852011, 808847, 761510, 714894, 680356, 650569, 623378, 595453, 573661, 558118, 541001, 528076, 523012, 521359, 517159, 516975, 523825, 534149, 539527, 543700, 558549, 574807, 591237, 616605, 647756, 685346, 736069, 811001, 909656, 1031731, 1180887, 1349543, 1507426, 1641991, 1742386, 1802352, 1825027, 1828612, 1834898, 1858993, 1919143, 2007661]
11805B007661J03829J24692J02208L2251n5900j47090k09518k19118k07690j89746
11795A341579j65576j41923j20844r0718o8439m7547l3281j9896j7715j3620j1681
11784F10339j408Q824J3474J2072Q790J2709K5608L8523N0875P4312R0994J09571
11772A054683J17069J07164R3828P2051N1904M6595N2005N8854P4619Q3673O7959
11761A880404L9125p026n9477j08762j41892j55601j62613j56258j40067j21003
11751H66830r9225q0845n9013m9150l7862k5000j9691j4154j1468o444m535j1755
11739D47688p057l937O070L375k537O369J1706J4231K0236K6727K4615L3821L5083
11726F16390L6898L6554M4122N0283O2676P7330R0063Q7279P6808N2870J0296
$$ y = [2007661, 2111490, 2236182, 2338390, 2370641, 2314741, 2167651, 1958133, 1739015, 1531325, 1341579, 1176003, 1034080, 913236, 822518, 754079, 706532, 673251, 653355, 635640, 622020, 610339, 608931, 617755, 631229, 643301, 652091, 664800, 690408, 728931, 779806, 854118, 945112, 1054683, 1171752, 1278916, 1372744, 1444795, 1496699, 1543294, 1595299, 1654153, 1728772, 1812445, 1880404, 1919529, 1912503, 1853026, 1744264, 1602372, 1446771, 1284158, 1127900, 987833, 866830, 767605, 686760, 627747, 578597, 540735, 515735, 496044, 481890, 470422, 463978, 459443, 447688, 440631, 436694, 442764, 446139, 443602, 449971, 461677, 475908, 496144, 522871, 547486, 581307, 616390, 653288, 689842, 733964, 784247, 846923, 924253, 1014316, 1101595, 1178403, 1231273, 1241569]
11715A241569l1256o4701q9574r4797r8315r5051q5536o7605m6518l0900k6002
11704E11314r762J0233L4954M4955M4275k856m5766m3766k6173j4030j6612j5586
11692D71180q721L450K3293L6965O2708R5028J36928J79544K17176K00418J27316
11681A545285M1128n9316j22094j33439j20972j00558r1145q8060p8767p0539
11671G21523o5070n8666n3911m4133l4819k7626k4285k0988j9716k1471r287m591
11659C36960k169l595M665J0090J9390L5470M4686J5596k7706m2039k9882j5018
11647C46448j1360k0559j9567r523n645m033m428K256M661j455M581K817n1l241
11633B80901k59L882m409o416m31l561n704n843k828p494l063o49l535k540O448
$$ y = [1241569, 1210313, 1145612, 1056038, 961241, 862926, 767875, 682339, 614734, 568216, 537316, 511314, 501552, 511785, 546739, 591694, 635969, 633113, 587347, 543581, 517408, 503378, 486766, 471180, 462459, 465909, 489202, 526167, 588875, 683903, 820831, 1000375, 1217551, 1417969, 1545285, 1586413, 1527097, 1405003, 1271564, 1150592, 1050034, 958889, 870829, 792062, 721523, 656453, 597787, 543876, 499743, 464924, 437298, 413013, 392025, 372309, 350838, 341551, 336960, 334791, 331196, 335861, 345951, 365341, 400811, 445497, 461093, 433387, 391348, 361466, 346448, 335088, 314529, 294962, 285439, 279794, 275761, 271333, 273589, 278250, 276795, 281376, 284193, 284142, 280901, 280642, 284524, 280115, 273699, 273268, 269707, 264003, 258160, 255332, 247838, 244775, 244126, 240591, 238051, 244499]
11618B44499J921M376M415P76M986J0689O840R19J224k016m25j799p359k850L8
11603B66234q033l928j082k592q703p47N719R276Q270N116J0020Q169J2273J0884
11589C10876O686J2137M740L387L918R900K1237L4288N1158N8969K9841l2089
11577E15048m8819l6561l1668k5038k1922j8175j3605j0593m96j877R77M464L486
11564C15221n196q943q813n096o337j0004j4220p275j331q169o47o993n176m273
11550B22748L811P522N320R767J0604J0433J8425J1024J365J447M233M583J504
11537C12786M018J2528J0425K6849M5711L4331m536l2323l5862k2561k0430j9777
11525C11159j5580j0428n251p161r997n119l579l220l00j839p416j1040j4118
$$ y = [244499, 246420, 250796, 255211, 255987, 260973, 271662, 278502, 279421, 280645, 278629, 278204, 276405, 269046, 266196, 266234, 258201, 254273, 253191, 250599, 241896, 241149, 246868, 256144, 264414, 269530, 279550, 287719, 299992, 310876, 317562, 329699, 334439, 337826, 341744, 351644, 372881, 407169, 458327, 517296, 547137, 515048, 466229, 429668, 398000, 372962, 351040, 332865, 319260, 308667, 308171, 306294, 307271, 311735, 315221, 310025, 301082, 292269, 287173, 280836, 270832, 256612, 249337, 248006, 239837, 239190, 232197, 227021, 222748, 226559, 234081, 239401, 249168, 259772, 270205, 288630, 299654, 301019, 302466, 306699, 311282, 312786, 316804, 329332, 339757, 366606, 412317, 446648, 442112, 409789, 373927, 351366, 330936, 311159, 295579, 285151, 279900, 272739, 262742, 257623, 254044, 250824, 250524, 248685, 241269, 230229, 216111]
11512B16111j1823m176l897p897n631L027J270m114j530n005j037j158j296J971
11498A74815L734J086P516j503n366J159K308k684l245o592k571j875k671k295
11484A61816n222J242M712j548n662m978L383P264N142Q24N29j574J211N44m442
11469A63241j746o145r17n628o825k384j439j700m13k917K633M27j631r05K344
11454A35995J933L246p651L21K823k493j074J443n464J339p93K703J710N03J938
11439A36479l766J651k795m134l149j994K890l523o104L40O343R897N058P298
11425A44491L171J025k368j508J817J609J066M561J736j448o682p899p252l64
11411A31955Q88M452L394p42K944o985q273k954J979N40j068K320M110O590r59
$$ y = [216111, 204288, 200112, 196215, 188318, 182687, 185714, 186984, 182870, 181340, 176335, 175298, 174140, 172844, 174815, 178549, 179635, 187151, 185648, 180282, 181441, 183749, 181065, 177820, 171228, 168657, 166782, 164111, 161816, 156594, 157836, 162548, 161000, 155338, 150360, 153743, 161007, 166149, 166973, 167502, 165928, 167139, 167683, 163241, 161495, 155350, 154433, 148805, 141980, 139596, 138157, 136457, 136044, 133127, 135760, 136187, 134556, 133651, 135995, 137928, 141174, 133523, 133844, 136667, 134174, 133100, 134543, 129079, 130418, 129625, 132328, 134038, 134541, 136479, 132713, 134364, 131569, 127435, 124286, 122292, 125182, 121659, 115555, 115895, 122238, 132135, 137193, 144491, 147662, 148687, 146319, 144811, 146628, 148237, 149303, 153864, 155600, 154152, 147470, 139571, 132319, 131955, 132843, 137295, 140689, 139947, 142891, 135906, 127633, 124679, 126658, 127198, 126130, 128450, 132560, 139150, 138191]
11396A38191K42N957K94j570k00Q91L521p73l602n162l295j75J12J381k832m5
11380A32935k380k215k47J560N15J425M966N9m114J339O300M153j431k858l726
11365A36281n00N334K625N43N024M656m380l786Q035J4077J7350J0576Q215J5332
11351B19382K3112J5530M897k534l127o442j0429j0915j3253j4937j1999r838
11339A79447m056r201o293N608J0514K95k938R68o864r962p251k110R634Q890
11325A66681L702M301J3825J9789J1214J2241J9141K7203K9356L9159N1610N6154
11313D54376N8803O6572P4749J03335J37165J47034J45324J38643R9629Q3812
11303A509442J38069K08720K68070L23460L40562L80168N22760P51558J054770
$$ y = [138191, 138433, 144390, 144684, 143114, 142914, 143805, 147326, 146553, 142951, 137789, 134494, 134319, 134431, 135812, 132980, 132935, 130555, 128340, 128093, 129653, 130168, 131593, 136559, 136618, 132504, 133843, 140143, 144296, 142865, 140007, 136281, 135781, 141115, 143740, 144283, 149307, 153963, 149583, 145797, 153832, 167909, 185259, 195835, 204050, 219382, 242494, 258024, 262921, 260387, 257260, 250818, 240389, 229474, 216221, 201284, 189285, 179447, 175391, 166190, 159897, 165505, 176019, 176314, 173376, 174344, 167480, 157518, 150267, 148157, 157791, 166681, 170383, 174684, 188509, 208298, 219512, 231753, 250894, 278097, 307453, 346612, 398222, 454376, 513179, 579751, 654500, 757835, 895000, 1042034, 1187358, 1326001, 1425630, 1509442, 1647511, 1856231, 2124301, 2447761, 2788323, 3168491, 3691251, 4442809, 5497579]
11294E497579J416099J969166L041229N102869Q755974J2727818R926904k112137
11286D6325501q699463p120612m677336l605643l807257m141754l534096k586576
11278H152764j788012j212462q68368o82488n34874l92892k80570j91215j35689
11269B066194j46655j73437j46128r0136n7390k6109N609L6725N8340Q3834R7428
11258A708275P8085M1672P1753J33552J91590K43016K66624K79042L65585N29946
11248C909140P55472J037415J428324K120056L455744O006781R959113J1548149
11240D0220194L437443o619359p544575m977884l359127l067869l527248l374718
11232A1186857k558797j794495j224719q57209o96489o03705m85871l72819k78921
$$ y = [5497579, 6913678, 8882844, 11924073, 17026942, 25782916, 38510734, 48437638, 46325501, 37626038, 30505426, 25828090, 22222447, 18415190, 14273436, 10739340, 8152764, 6364752, 5152290, 4283922, 3601434, 3066560, 2673668, 2393098, 2201883, 2066194, 1919539, 1746102, 1599974, 1509838, 1452448, 1426339, 1431948, 1468673, 1527013, 1610847, 1708275, 1786360, 1828032, 1899785, 2033337, 2224927, 2467943, 2734567, 3013609, 3379194, 3909140, 4664612, 5702027, 7130351, 9250407, 12706151, 18712932, 28672045, 40220194, 43657637, 37038278, 29493703, 24515819, 21156692, 18088823, 14561575, 11186857, 8628060, 6833565, 5608846, 4751637, 4055148, 3451443, 2965572, 2592753, 2313832]
11223B313832k10292j84204k24601k21909j66103j26370j06513q4096o0298n0326
11213H79120m6531l5172l3264k2974j9420j3594L175m608j7306j2363o782J419
11201F71700j094K940J6131K5395L6254M1199O6993Q7783Q7527J01191J34373
11190A270392J53430J68161J86159J93666J78277J53823J00869R2098J70451K79389
11180B946715L72905M61553N33466O50650Q56626J126117J459653J863650K547438
11171A2818773L940014O616955J1299386J5930466J1029459m271244j1089674
11164D6274135q599575n647900m480097m851176n179980m310959l125013k149757
11156G929678j464253j061576q45248o54576m58454l02267j94673j20468j22355
$$ y = [2313832, 2103540, 1919336, 1694735, 1472826, 1306723, 1180353, 1073840, 989744, 929446, 879120, 832589, 797417, 764153, 741179, 721759, 708165, 711340, 706732, 689426, 677063, 670281, 671700, 670606, 673546, 689677, 715072, 751326, 792525, 859518, 947301, 1034828, 1136019, 1270392, 1423822, 1591983, 1778142, 1971808, 2150085, 2303908, 2404777, 2496875, 2667326, 2946715, 3319620, 3781173, 4314639, 4965289, 5821915, 6948032, 8407685, 10271335, 12818773, 16758787, 23375742, 34675128, 50605594, 61635053, 57363809, 46274135, 37674560, 32026660, 27546563, 22695387, 17515407, 13204448, 10079435, 7929678, 6465425, 5403849, 4558601, 3904025, 3445571, 3143304, 2948631, 2828163, 2705808]
11147B705808j47240r7789l7941n300M971O035J8136L1489M9396N7226L4077J4333
11135B633201O4071J40521K22037K97030L29106L65495M88054P16548J019462
11126F275525J390252J907696K863769M694987Q040393J2720492J3414665K707716
11118E4015495q327876q948891o049553m281949m055450m580902m276154l256534
11110A0238186k297833j560495j089458q29025o51847m73239l20909k14486j47791
11101B653103j39147k02352k20018j81836j58534j43809j38883j38079j20337
11092A210108r3265p4180n8671m7074l7441k9356l1216l8485l9147l0457k2751
11081G08065k4290k5891k4306k1452j9742j5216j4930n904j0260k6660j6607k812
$$ y = [2705808, 2558568, 2460779, 2422838, 2417538, 2422509, 2428544, 2446680, 2478169, 2527565, 2584791, 2618868, 2633201, 2697272, 2837793, 3059830, 3356860, 3685966, 4051461, 4539515, 5256063, 6275525, 7665777, 9573473, 12437242, 17132229, 25172622, 37893114, 51307779, 54015495, 45687619, 36738728, 30689175, 26407226, 22351776, 17770874, 13494720, 10238186, 7940353, 6379858, 5290400, 4461375, 3809528, 3336289, 3015380, 2800894, 2653103, 2513956, 2311604, 2091586, 1909750, 1751216, 1607407, 1468524, 1330445, 1210108, 1116843, 1042663, 983992, 936918, 899477, 870121, 838905, 800420, 761273, 730816, 708065, 683775, 657884, 633578, 612126, 592384, 577168, 562238, 556334, 546074, 519414, 502807, 499995]
11069D99995j082j1528j7242j6647q357R080M876N228J6980L3411M0356L8344
11057E93414L4978K0456r499k8150l3097l4755l3129k8545l2029l0286l0571k8750
11045C60037k3183o762q66J120M196n955j6382q642j365M512L433n327o880p939
11031B89997o346p519r411j2469o391n428k239N470O953L225j950n262n062O3
11017B43631O938J269o526k845J432L219J569j351k935m586n276l815l870k652
11003B24202q405q318J275j714l020l006k697k213N477P131O54j8526q697M357
10989A86500P946Q40o069n486j679k027m318o449k346J49K23P59J366P725L278
10974A80412l046n074j729K831J184l644m30L12j0143M322P908N804K633j772
$$ y = [499995, 498913, 487385, 470143, 453496, 445139, 454219, 459095, 464323, 481303, 514714, 555070, 593414, 628392, 648848, 639349, 611199, 578102, 543347, 510218, 481673, 449644, 419358, 388787, 360037, 336854, 330092, 329226, 330346, 334542, 328587, 312205, 303563, 302198, 306710, 310143, 304816, 297936, 289997, 283651, 276132, 266721, 254252, 247861, 242433, 240194, 245664, 252617, 255842, 253892, 248630, 243568, 243631, 250569, 251838, 245312, 242467, 243899, 247118, 248687, 247336, 244401, 239815, 234539, 230724, 226854, 224202, 215797, 207479, 208754, 207040, 204020, 201014, 198317, 196104, 201581, 208712, 209366, 190840, 182143, 186500, 194446, 195286, 189217, 183731, 182052, 180025, 175707, 169258, 166912, 167061, 167284, 168043, 169409, 177134, 180412, 177366, 172292, 170563, 173394, 174578, 170934, 170504, 170816, 160673, 164995, 172903, 178707, 181340, 179568]
10960A79568K493L188m476q560m142P11j060m918n683m28J94K732m008k940J612
10945A54283J788L865N943k198m140m756l596r189m502O78j681O340M120P72O69
10930A48396K964N876L032rk154m023J390M103O595N418K405O843L842K028K93
10915A86999J8O43j388r81K209P851P542n40J2808J5182J1398J9170K2746K6585
10901C10242L8300N4736Q1295J25618J96541K81786L15022K04939j8455j73797
10891A416227j98661j61019j29909j17021j09116q8777m9958j3663K4896P2438
10881F45437J37309J98958J93195P4365p0553j45875j30763r6992q1038o1489
10871F62554l6046k7666n1576p7316o6664m4735l1096k7741k8116k2456j8421
$$ y = [179568, 182061, 185249, 180773, 172213, 168071, 168782, 167722, 162804, 157121, 156693, 156887, 159619, 155611, 152671, 154283, 156071, 159936, 165879, 163681, 159541, 154785, 151189, 142000, 137498, 138176, 136495, 142835, 146955, 147727, 148396, 151360, 157236, 160268, 160259, 158105, 154082, 155472, 159575, 166170, 171588, 173993, 180836, 184678, 186706, 186999, 187017, 187660, 186272, 185291, 187500, 195351, 202893, 202353, 215161, 230343, 241741, 260911, 283657, 310242, 348542, 403278, 484573, 610191, 806732, 1088518, 1403540, 1608479, 1590024, 1416227, 1217566, 1056547, 926638, 809617, 700501, 611724, 561766, 548103, 572999, 645437, 782746, 981704, 1174899, 1249264, 1178711, 1032836, 902073, 805081, 724043, 662554, 626508, 598842, 547266, 469950, 403286, 358551, 327455, 299714, 271598, 249142, 230721]
10860B30721j4537q611p75j936o020k542j547J084K397r91j541L014M525L914
10846B07155Q962J3350J7826K0305L2192M6931P2128J10161J67741K06251J63979
10835A066981M0034q9289j30591j16999r7416q4399q1316p3389n3814k7873k645
10824C49284J6338L4235J5009k3654l6090k6435j4722p461j2259j1957m697n006
10812B72585k990n520m902j215l09p569m145l690J685J5574J3167Q995J0645P002
10798B99313J0963J5578J8397K4817K8574L1568L7159M7311O3255Q6488J09140
10787G72563J54019K28340L44829N07451O81871P38466N13073N6783k92292l56349
10777C348754k52230j23782r8499k23260l60600l74426l04790k22950j64574j36664
$$ y = [230721, 216184, 207573, 206798, 204862, 198842, 196300, 194753, 195837, 198234, 197243, 195702, 198716, 203241, 207155, 216117, 229467, 247293, 267598, 299790, 346721, 418849, 529010, 696751, 903002, 1066981, 1107015, 1017726, 887135, 770136, 672720, 588321, 507005, 433616, 379802, 351929, 349284, 365622, 399857, 414866, 391212, 355122, 328687, 313965, 306504, 294245, 282288, 277591, 272585, 269595, 264075, 259173, 257958, 257649, 250080, 245935, 242245, 243930, 259504, 272671, 281666, 292311, 299313, 310276, 325854, 344251, 369068, 397642, 429210, 466369, 513680, 576935, 663423, 772563, 926582, 1154922, 1499751, 2007202, 2689073, 3427539, 3940612, 3997395, 3705103, 3348754, 3096524, 2972742, 2874243, 2650983, 2290383, 1915957, 1611167, 1388217, 1223643, 1086979]
10767A086979j12745q1551n4614m0373l6543l3876k9224k6943k5343k0107k0462
10756F05198j5184n331O927K3685M6574O9614R8883J00151M0374O005K2766O1153
10744A060815J17906J93754L03330M63466O33961O48483L45572j10543m03654
10735C253090m45585l82094l20717l00588k76840k21146j60442j05962o4732k8386
10725I46598J2778N1233R8513J63603K63520M15094O44277Q94685Q72595K74103
10715D636999m05138n87889n02651m02629l72529l92913l62727k91702k19562
10706A099259j53092j01701n2277j8354Q516j8337p0139p8466o0537m3422l3687
10695D77763l5659k3351j6891j1196M195J4484K3935L1603L4700M0658M5771M9806
$$ y = [1086979, 974234, 892683, 838069, 797696, 761153, 727277, 698053, 671110, 645767, 625660, 605198, 590014, 584683, 591610, 615295, 661869, 731483, 830366, 930517, 970891, 976896, 999662, 1060815, 1178721, 1372475, 1675805, 2139271, 2773232, 3421715, 3767287, 3656744, 3253090, 2807505, 2425411, 2104694, 1804106, 1527266, 1306120, 1145678, 1039716, 974984, 946598, 959376, 1010609, 1109122, 1272725, 1536245, 1951339, 2595616, 3490301, 4362896, 4636999, 4231861, 3643972, 3141321, 2738692, 2366163, 1973250, 1610523, 1318821, 1099259, 946167, 844466, 792189, 773835, 782351, 764014, 693875, 615409, 554872, 511450, 477763, 442104, 418753, 401862, 390666, 394861, 409345, 433280, 464883, 499583, 540241, 586012, 635818]
10683F35818O0705R9566J97704L03747J64019j59216j84652j02733n0950l6730
10673I27278l5723j5616K7414Q3879J58323K49267M03348O20181P88960N88517
10663C795828m2666m84758n12294m01588l30116l21523l20912k79706k09123j47211
10653G45931j05775p1048n5522l7616k4081j4144j3295p435J299J0371K1894K3250
10641D73829K2224K4384K4618K0923K0037P826P212L5681N9987L7213k0270m2523
10629F71141l3748k7867k2141j3354p987J5078M5781R6512J86000K49957J65707
10618A325079o3608j79315j54293j06701p9169o4317m1337j6070k9713o7567p6680
10607D46309n2832m2133l7878l2721k6967k4248k4562j3409o859k232J305N580
$$ y = [635818, 696523, 796089, 993793, 1297540, 1461559, 1302343, 1117691, 1014958, 964008, 927278, 891555, 875939, 903353, 987232, 1145555, 1394822, 1798170, 2418351, 3207311, 3795828, 3753162, 3268404, 2756110, 2354522, 2024406, 1702883, 1381971, 1102265, 893142, 745931, 640156, 569108, 513586, 475970, 451889, 437745, 424450, 417015, 418314, 428685, 450579, 473829, 496053, 520437, 545055, 565978, 586015, 593841, 601053, 636734, 696721, 733934, 713664, 671141, 637393, 609526, 587385, 574031, 566044, 581122, 626903, 723415, 909415, 1159372, 1325079, 1261471, 1082156, 927863, 821162, 741993, 677676, 636339, 620269, 590556, 522989, 446309, 393477, 351344, 313466, 280745, 253778, 229530, 204968, 191559, 184700, 182468, 183773, 189353]
10595A89353L737J6366K2187K6192K9119K1495J4021J1884Q067p849j0957j2340
10583C11275j5883j0499j5086j1276j5164m863L822L154m382N270J0333K8281
10571B84982M9816Q3826J50191K33412K60451J02030j14290j68479j37931j02594
10561F41414r1406r2751q4313p0646n2698l3634k0213j8196k2313j1171l845m846
10549A35382j992m195m385J990K69j333l841j1193m783k4k571K161R23R82j586
10534A05804l418n601l23J16M38M97K249l272n005n297k206O537O694J0671K744
10519A10628k845R912J1035J3362K5818L4710M5951M3366J6954k3414l6477k4248
10507B24752k0311j5912j6504j5852j0675j0887p604l342k085L853P622O047J0742
$$ y = [189353, 193090, 209456, 231643, 257835, 286954, 308449, 322470, 334354, 342421, 334572, 323615, 311275, 295392, 284893, 269807, 258531, 243367, 238504, 242326, 245480, 241098, 246368, 256701, 284982, 334798, 418624, 568815, 802227, 1062678, 1164708, 1050418, 881939, 744008, 641414, 550008, 457257, 372944, 302298, 249600, 215966, 195753, 177557, 155244, 144073, 140228, 135382, 133390, 129195, 124810, 126800, 127069, 125736, 121895, 110702, 105919, 105895, 103324, 105485, 106408, 107390, 105804, 102386, 96785, 96462, 96578, 97016, 97513, 99762, 96490, 91485, 86188, 83982, 90519, 97213, 107884, 110628, 107783, 117695, 128730, 142092, 167910, 202620, 248571, 291937, 308891, 285477, 249000, 224752, 204441, 188529, 172025, 156173, 145498, 134611, 127007, 123665, 121580, 125433, 133055, 139102, 149844]
10494A49844J6835K9445L7761M6036M0394N321k2166k0080p286j874j612k538
10482B70080m708r029m734j4843j8201p508q100r569j6987j5717j3555j2650j2182
10469A22297o565k418m720q605q017j073N00L762M109L872R999K1548J8481J7610
10455A70780J4861J2412J32O63J706J814k81n175r487j2289j1907o157L037N942
10441A66051O505J4439K2986K5021J9000J6994Q711N958M681p364j0370j2773
10429B59839j4787j5977j8535j6529j4750j9346k4690k1204j5709j5314o963j0973
10417F5062j1707j0269m474L789O057P313n29r569r011n799K087M280p604n969
10403B3657J071M887K464K939n19k492q906n841N23O78Q81P776K975n506l180
$$ y = [149844, 166679, 196124, 233885, 279921, 320315, 325636, 303470, 283390, 276104, 274230, 272618, 270080, 265372, 256343, 251609, 236766, 218565, 211057, 202957, 193388, 176401, 160684, 147129, 134479, 122297, 115732, 113314, 108594, 99989, 91972, 90899, 91399, 95161, 99270, 103142, 113141, 134689, 153170, 170780, 185641, 198053, 198185, 198848, 200554, 202368, 202087, 196912, 187425, 175136, 163229, 157072, 160109, 166051, 172556, 186995, 209981, 235002, 254002, 270996, 279707, 285665, 290346, 282982, 272612, 259839, 245052, 229075, 210540, 194011, 179261, 159915, 135225, 114021, 98312, 82998, 76035, 65062, 53355, 43086, 38612, 42401, 48458, 55771, 55242, 45673, 36662, 30863, 32950, 37230, 29626, 23657, 24728, 29615, 32079, 35018, 34499, 32007, 23101, 17260, 17783, 18461, 19342, 27118, 30093, 24587, 21407]
10388B1407o767J125J886m467m695m579K248Q352Q853M37q71J694j490M484L868
10373C1485L864N97J84R2J51n215J282N29L238J660j385r90j707N198J419N025
10357D5427P212P800O220J0451P480K795K306L329J2065J8371P495Q90J622n59
10343A32904j0497q885r043l545m539o217q784j463k772k329M33J519j512j939
10329G3331r090p518j809k009n836n375k587j159l840K291J200p709j1468l273
10315A5149k118k560l380N848J0426M396L013N784M24k059m517k406k398q00n903
10300A8899o080M866Q034K519r500j4581k944q59o19K398L556L569N116K409K24
10285A7007J875O275M745L935L368M906M950J567k519k638o078j052O128J2961
$$ y = [21407, 14640, 15765, 17651, 13184, 8489, 3910, 6158, 14510, 23363, 23800, 22929, 24623, 23133, 27617, 31485, 35349, 35946, 36130, 36222, 36373, 31158, 32440, 32969, 36207, 37867, 36482, 35492, 33785, 38983, 40402, 45427, 52639, 60439, 66659, 77110, 84590, 87385, 89691, 93020, 105085, 123456, 130951, 131841, 133463, 132904, 122407, 113522, 104479, 100934, 96395, 90178, 81394, 79931, 77159, 74830, 75263, 76782, 75270, 73331, 64241, 56723, 54914, 52905, 47069, 41694, 39107, 37948, 34108, 36399, 37599, 29890, 18422, 15149, 13031, 10471, 7091, 12939, 23365, 27761, 30774, 36558, 36982, 34923, 30406, 28000, 25602, 24802, 18899, 12819, 17685, 25719, 28238, 18738, 4157, 1213, 354, -265, 2133, 5689, 9258, 14374, 16783, 17007, 18882, 25157, 29902, 33837, 37205, 42111, 47061, 48628, 46109, 43471, 37393, 36341, 42469, 55430]
10271E5430K1864J4405L530o790n136R374J4524L216l696J006P743J9999K8231
10258A63700K1018K2420K2962L3357M5174N2896N9242O5386Q0268R8667J22745
10247G87835J51865J89966K20815K26547J63795P5635O2594J28943K05331K73512
10237B486838L46786M52012N96413P31104R11930J197625J658063K530666M099057
10228A5010494O941721J1477293J5027253R371779l933909r659486p654622n192028
10220C1388495m270834m590887m691975l779155k625910j663894r52662m90554
10212H322624j58026K26693O68228J181174K011858L390568N753203R700592J3849253
10203D4946167J1063450j370315r457732q521783n822316m449235m490345m801614
$$ y = [55430, 77294, 91699, 95229, 88439, 83303, 92677, 107201, 110417, 106721, 107727, 115470, 135469, 163700, 184718, 207138, 230100, 263457, 308631, 361527, 420769, 486155, 566423, 665090, 787835, 939700, 1129666, 1350481, 1577028, 1740823, 1816458, 1879052, 2007995, 2213326, 2486838, 2833624, 3285636, 3882049, 4613153, 5525083, 6722708, 8380771, 10911437, 15010494, 21952215, 33429508, 48456761, 57828540, 53894631, 44235145, 36580523, 31388495, 27117661, 22526774, 17834799, 14055644, 11429734, 9765840, 8813178, 8322624, 8164598, 8391291, 9059519, 10240693, 12252551, 15643119, 21396322, 31096914, 44946167, 56009617, 54639302, 45181570, 36659787, 30837471, 26388236, 21897891, 17096277]
10195A7096277m158761l075421k138256j469380j070391q31588o38854m60807
10187C252819l18755k15669j53433j56510k07734k36449k04808j55442j29855
10178A474164j29656j25236j04676q3551o2060n2747n1781m6236l6980l2384k9995
10167G18862k9976k9843k0760k3089k5439j6493q333m018l368p594n941j5245
10155E28763k9413k4443k1877j5874j3190j0358o886q793j1269j2987n055M694
10143C73312L392J373K511P747Q313M141M601L445Q490J3148J4534L1552M3307
10130E19866M9455O5707Q7961R7172J25547J52728J76299J78248J23795M5924
10120A622702M8570J12094J71313K21101K76868L61359M54415N53720P30395R63420
$$ y = [17096277, 12937516, 9862095, 7723839, 6254459, 5184068, 4352480, 3713626, 3252819, 2934064, 2718395, 2564962, 2408452, 2200718, 1964269, 1759461, 1604019, 1474164, 1344508, 1219272, 1114596, 1031045, 968985, 916238, 864457, 818221, 781241, 748857, 718862, 688886, 659043, 638283, 615194, 589755, 573262, 564929, 560911, 557543, 549949, 544008, 528763, 499350, 474907, 453030, 437156, 423966, 413608, 406722, 397929, 386660, 373673, 368618, 373312, 376704, 378077, 380588, 388335, 396648, 400789, 405390, 408835, 417325, 430473, 445007, 476559, 519866, 569321, 635028, 722989, 820161, 945708, 1098436, 1274735, 1452983, 1576778, 1622702, 1671272, 1783366, 1954679, 2175780, 2452648, 2814007, 3268422, 3822142, 4552537, 5515957]
10110E515957J352483K093930L410986N792536R544104J2104171O705527m029145
10102D2490549p828749n918229m001518l386731l712886l727617k936256k004218
10094H974345j244846p05449l75520j21453J97673N51922R69057J643370K793651
10085A2682750M798961Q175848J1547142Q543598k180150q072779o737629m508988
10077B4248753l486853l620118l856230l263780k367185j627022j112812q20556
10069D094197o43101m85745l51151k46471j60354j14266j17994j70819j89280
10060A615016j53991j20731j08414j11879j06244q1844n4851m2146m5950m0030
10050G48936l4631l5042k0579j5269k5177k1254j9612k2696k1020k3170j0846
$$ y = [5515957, 6868440, 8962370, 12373356, 18165892, 27709996, 39814167, 46519694, 42490549, 34661800, 28743571, 24742053, 21355322, 17642436, 13914819, 10978563, 8974345, 7729499, 7024050, 6648530, 6527077, 6724750, 7276672, 8245729, 9889099, 12682750, 17481711, 25657559, 37204701, 45748299, 43568149, 35495370, 28757741, 24248753, 20761900, 17141782, 13285552, 10021772, 7654587, 6027565, 4914753, 4094197, 3451096, 2965351, 2614200, 2367729, 2207375, 2093109, 1975115, 1804296, 1615016, 1461025, 1340294, 1231880, 1120001, 1013757, 931913, 877062, 834916, 788966, 748936, 714305, 679263, 658684, 643415, 618238, 596984, 577372, 554676, 533656, 510486, 499640]
10039D99640p112j0103o875M57m026j9206j5864j9149j9376k1035j7969j9802
10027C39580r994l715n204m349q023l445p462k663l717j1330j1220p129n097k190
10013B54042j705J574q22r67o847R27M072m9p858o381j533K606j3N372l846K2
9997B38594O365R057J169j2804j1842q231n179j1695q16M312J2089K0404J8492
9984B59915P973N240J0327M487p623j2623n453j6239k0765p429J0400K3602K4479
9971B76291Q180p202j1441k08k759j2279j2237j1027o694p483n259k550K235P924
9957B15491N640k854j9192j7388q347l393j732k069j171J756j55l340m167o97
9943A58382M433l153p214J442N484m713m568p348j758M615J608n038K92m94m675
$$ y = [499640, 492528, 482425, 475550, 476007, 471981, 452775, 436911, 417762, 398386, 377351, 359382, 339580, 329586, 325871, 320667, 316318, 308295, 304850, 297388, 294725, 291008, 279678, 268458, 261329, 256232, 254042, 252337, 253911, 253089, 252122, 245275, 246202, 250274, 250225, 242367, 235986, 234453, 237059, 237046, 242418, 238572, 238594, 244959, 254016, 255185, 242381, 230539, 222308, 217129, 205434, 204618, 208930, 221019, 241423, 259915, 267888, 273128, 283455, 287942, 280319, 267696, 262243, 246004, 225239, 217810, 228210, 251812, 276291, 284471, 277269, 265828, 265620, 262861, 250582, 238345, 227318, 220624, 213141, 207882, 205332, 207567, 215491, 221131, 218277, 199085, 181697, 173350, 169957, 168225, 166156, 164985, 166741, 166586, 163246, 159079, 158382, 162815, 159662, 152448, 153890, 159374, 154661, 150093, 142745, 140987, 145602, 147210, 142172, 142464, 141970, 137295]
9928A37295n5R763N552N820J02K890J844N560n71j5022j4000j1188n996J254O546
9913A29794J0736P058L06j0539j1528k294O84m680m803n776M63N713K18n090n599
9898A04663n288m635j05q66p92J589J1760J4081J694l220L619P02n62o266k339
9883A14035M223P110J149K600k653o4K924l013K464L269N892j233n273p230J40
9868A24340K588L001K005R000J0462K591l261L14P134J0676K1676K5087Q007j8458
9854B05162j5419j0655r015j1142j0993j1118n791j3683j1131o041M13M805O573
9841A11965k953k04K655L205l040p047N99L047k002N64J113K120o625l696k558
9826I7143j876j854K045J560O281O700N287M546J4356K3292K9863L9741N4711
$$ y = [137295, 137240, 147003, 152555, 158375, 158477, 161367, 163211, 168771, 168200, 153178, 139178, 127990, 121994, 123248, 129794, 140530, 147588, 147894, 137355, 125827, 123533, 124217, 119537, 114734, 108958, 109421, 115134, 115352, 110262, 104663, 99375, 94740, 94635, 93769, 92977, 94566, 106326, 120407, 122101, 118881, 122500, 123202, 122640, 116374, 114035, 118258, 125368, 126517, 129117, 126464, 126400, 129324, 126311, 128775, 132044, 137936, 136703, 131430, 124200, 124340, 126928, 129929, 131934, 140934, 151396, 153987, 150726, 151040, 158174, 168850, 190526, 215613, 223620, 205162, 189743, 179088, 170073, 158931, 147938, 136820, 131029, 117346, 106215, 100174, 100587, 105392, 111965, 109012, 108808, 111463, 114668, 111628, 104581, 105180, 108227, 106225, 106789, 107902, 110022, 103397, 99701, 97143, 95267, 93413, 95458, 97018, 103299, 109999, 115286, 119832, 134188, 157480, 187343, 227084, 281795]
9813B81795O2914J9376k6574m0105l0225k9787k3747k3000j7743j4088p529q104
9801A43183m833j515l97m160J115J181J0978K4219L9576M8970O2782L8999j6237
9788C43861m2716m1091l1512k2518j9719k1244j9170k2484j8720j1130l884k402
9776H7271j1m003p723o083r2L747j41N705j013k108j797N282O000j184k998l26
9760H0526J29l003p249J84N160j196n667k664J989J435j250M932J1287K704k132
9745H5185p418k876k424j411N401J936m026n648J738L151j800n056j898N8N22
9730F5434j972J716j293q182n501M827J568l167j991k0P818P248J878n008k714
9715F0641p30R43k691k029l229m98L677r04l145O402N766M235K497J083N574N604
$$ y = [281795, 344709, 364085, 337511, 297406, 267181, 237394, 213647, 190647, 172904, 158816, 151287, 143183, 138350, 136835, 136438, 132278, 133393, 134574, 145552, 169771, 209347, 258317, 321099, 360098, 343861, 301145, 260054, 228542, 206024, 186305, 165061, 145891, 123407, 104687, 93557, 89673, 87271, 87260, 83257, 75534, 69451, 69359, 73106, 72965, 78670, 77657, 75549, 73752, 79034, 85034, 83850, 80852, 80526, 80655, 77652, 70403, 70587, 75747, 74551, 68884, 66220, 68209, 69644, 68394, 73326, 84613, 87317, 85185, 77767, 74891, 72467, 71056, 76457, 78393, 74367, 68719, 70457, 73608, 71808, 66752, 64854, 64912, 65434, 63462, 65178, 63885, 55703, 50202, 55029, 56597, 53430, 51439, 51419, 59237, 66485, 68363, 63355, 60641, 59911, 60854, 58163, 56134, 52905, 52407, 56084, 55180, 52035, 58437, 64203, 68438, 70935, 72018, 77592, 83196]
9699H3196O984J3385J5634J8591K1296K6790M4227M6530J4210k7591l8908k6942
9687A97402k2298k3493k4324j7028j3613o456n227o545p00M616K378J162L312
9674H9186Q463J4344L0087M8796N2332K8716j7034l8696l0020k1770k1857k2269
9662A20278k3586j6901n643j925n488q781l770j295Q24J706l792o57K283j189
9648E2064k913J40l821O78K585m782l86J742o40j966O865L182M701N692j776j76
9632F1189o46k505r60J755n659j986k069k709n72M075J311J158p92o121o011n07
9616C8951P63n486J061M549L035l775k176n94r86k416L414j830j313k869j545
9601B8783L413N104J813k228q58M160O254L691l55L97j74M088J206J450n62p68
$$ y = [83196, 90180, 103565, 119199, 137790, 159086, 185876, 230103, 276633, 290843, 263252, 224344, 197402, 175104, 151611, 127287, 110259, 96646, 90190, 84963, 78418, 77718, 82334, 84712, 85874, 89186, 97649, 111993, 142080, 190876, 243208, 271924, 254890, 216194, 186174, 164404, 142547, 120278, 96692, 79791, 74148, 72223, 66735, 57954, 54184, 52889, 53713, 55419, 51627, 50970, 53253, 52064, 49151, 49291, 45470, 46148, 48733, 43951, 43565, 45307, 44667, 42701, 49566, 52748, 57449, 63141, 61365, 61189, 60543, 58038, 57078, 58833, 53174, 51188, 49119, 46410, 45838, 49913, 51224, 52382, 51590, 45469, 39458, 38951, 39714, 34228, 35289, 39838, 42873, 39098, 36922, 36328, 35342, 32926, 36340, 34510, 33197, 30328, 28783, 32196, 37300, 39113, 36885, 36027, 40187, 46441, 50132, 49777, 50174, 50000, 54088, 55294, 56744, 56182, 55414]
9585E5414L283N824N633k537p49P489K485J516J356O49r26O96j12k634L111K535
9569H3033M264N026m237l386O78k992J097J306L603R45J698n027l204M680J220
9554H8704K293M344K877o76j825L336K909L563R333L964R214J1068L196k887j115
9539A38298k259m802m570k977j708k564N33l186m950L43J052K046N331N894K3
9524A26504M843N965M580O579N617j423k273o56N95L554J608n942m686N239O391
9509A56495L934R530R265M643J434K742M369J952O42J1645Q184N163K725M029
9495B26752j253k567M290K566M777L113L11k450o940j714K990j084k115J012K181
9480B29869K236K560L052k298q907p138J641O533k155m028k128O51J97m798o315
$$ y = [55414, 58697, 64521, 70154, 67617, 66868, 74357, 76842, 78358, 79714, 80363, 79437, 80133, 80021, 77387, 80498, 83033, 87297, 92323, 88086, 84700, 85378, 82386, 83483, 84789, 88392, 89337, 91035, 86008, 82804, 87484, 88704, 90997, 95341, 98218, 97542, 95717, 99053, 101962, 105525, 114858, 118822, 128036, 139104, 142300, 139413, 138298, 136039, 131237, 126667, 123690, 121982, 119418, 119951, 116765, 111815, 112158, 113210, 115256, 120587, 126481, 126504, 131347, 137312, 141892, 148471, 154088, 152665, 150392, 149736, 150331, 153885, 155493, 149551, 144865, 150104, 156495, 160429, 169959, 179224, 183867, 185301, 188043, 192412, 194364, 195006, 206651, 214835, 219998, 222723, 226752, 225499, 222932, 227222, 229788, 234565, 237678, 237989, 235539, 228599, 226885, 229875, 228791, 226676, 227688, 229869, 232105, 234665, 237717, 235419, 226512, 219374, 221015, 227548, 225393, 221365, 219237, 219888, 220085, 215287, 208972]
9465B08972p870n898o6J074l392n785l085J644M16j984K47l325n397q770n949
9450A60832j703k970j0384p854k829L388J805L224R96j070n068q88j914p81J122
9435A35906j467l365M597j940n420j365J898J882k86o58m50M100m32j932k409
9420A28659M81l300m700J699j356R90l3L901L595l981l315n074k860j18J183n475
9404A10296j0023j3539m694K139o642n463L767M31k522J18m861m083K374l518
9390F3780p99K329J0j124k735l001j090j260P77n15O204J392j48L538M537M471
9374G6366L648j758l008K942J0457N681K326k635K228j411M47M016L108J172K376
9359A05955m411k316K609O935P333L855O27j225P56r387l170n033m300J673k899
$$ y = [208972, 201102, 195204, 195138, 196212, 192820, 187035, 183950, 185594, 186010, 184026, 184273, 180948, 175551, 166781, 160832, 159129, 156159, 145775, 137921, 135092, 138480, 140285, 143509, 144505, 143435, 138367, 137479, 135565, 134784, 135906, 134439, 131074, 135671, 133731, 128311, 126946, 128844, 130726, 130440, 129782, 129332, 133432, 133000, 131068, 128659, 129140, 125840, 121140, 122839, 121483, 122473, 122440, 126341, 129936, 125955, 122640, 117566, 114706, 114588, 115771, 110296, 100273, 86734, 82040, 84179, 77537, 72074, 75841, 76272, 73750, 73868, 69007, 64924, 67298, 63780, 62981, 65310, 65320, 64196, 61461, 58460, 57370, 56110, 56887, 56372, 62576, 63968, 63820, 67358, 71895, 76366, 80014, 78256, 75248, 78190, 88647, 94328, 96654, 94019, 96247, 94836, 95283, 99299, 102407, 103579, 105955, 101544, 99228, 101837, 108772, 116105, 119960, 120587, 119362, 120118, 110731, 107561, 102528, 98228, 99901, 97002]
9344I7002k431m749j276j243k413j30M155K086j472J09k925m281j859K071O280
9329H8924j622O037Q746J2563J6816J1992J5168J7401J4623K1332L1036M0640
9317B83656M5526L6517M0973M9628O3498Q3289J16619J69471K48663L32742L77595
9306A848177L64041K69321J30339M759q9774j17472p7212J7445J56102L53249
9296B858975O37995R57702J130171R54380M34756k03058o77790q42055p98108
9287D452968p18643o56169n94525n05487l97153k99585k18321j60783j18899r6971
9277F86432p8490o1437n7119n0716m4635l7728l1080k7063k1467j2915n255j2633
9265B45894j3476q677j1016j7079j8814j2625n791N72m657j1318j567L273L113
$$ y = [97002, 94571, 89822, 88546, 87303, 84890, 84760, 88915, 91001, 89529, 89638, 86713, 82432, 80573, 82644, 88924, 87302, 93339, 102085, 114648, 131464, 143456, 158624, 176025, 190648, 211980, 243016, 283656, 329182, 365699, 406672, 456300, 519798, 603087, 719706, 889177, 1137840, 1470582, 1848177, 2212218, 2481539, 2611878, 2616637, 2526863, 2409391, 2332179, 2349624, 2505726, 2858975, 3496970, 4454672, 5584843, 6539223, 6973979, 6770921, 6093131, 5251076, 4452968, 3734325, 3078156, 2483631, 1978144, 1580991, 1281406, 1063085, 902302, 783403, 686432, 607942, 546505, 489386, 438670, 394035, 356307, 325227, 298164, 276697, 263782, 258527, 245894, 232418, 223741, 212725, 195646, 176832, 164207, 158416, 158988, 154331, 143013, 141446, 144719, 147832]
9252A47832K834n979r552j649k245p845j6436j0716j590l262k445j625q813o785
9238G1724N343n030j0074l291K118P085L123J181O649O420M596J782N337J1276
9224A08239J4215J7122K2890K2387K1396P039p553j4144j6515j073J846l073M031
9211A76807k90l624m23N365J2266K2674M1483O1508Q3487J37857K21971L17871
9199A076952L30174J17377j40275k17271j78659j38028j28646j30433j19515r8000
9189C73676p6666n4995l2991k1760j4184j0499o196J013R202O975M022P056J8464
9176B03117K7240K6575J8244J9617J9542N191n257r404k132J51n675k915m050
9163B90244n052M988J7363K5284M6643P4342J16609J93609K91934L16432J30277
$$ y = [147832, 150666, 144687, 135135, 133486, 131241, 123396, 106960, 96244, 94654, 91392, 88947, 87322, 78509, 71724, 77067, 72037, 61963, 58672, 60790, 67875, 70998, 72179, 78828, 85248, 89844, 91626, 96963, 108239, 122454, 139576, 162466, 184853, 206249, 213288, 205735, 191591, 175076, 174003, 175849, 172776, 176807, 176517, 172893, 172470, 177835, 190101, 212775, 254258, 315766, 399253, 537110, 759081, 1076952, 1407126, 1524503, 1384228, 1166957, 988298, 850270, 721624, 591191, 471676, 373676, 297010, 242015, 209024, 187264, 173080, 162581, 156385, 157398, 166600, 173575, 177597, 184653, 203117, 230357, 256932, 275176, 294793, 314335, 319526, 314269, 304865, 302733, 302884, 297209, 294294, 290244, 285192, 290180, 307543, 332827, 379470, 453812, 570421, 764030, 1055964, 1372396, 1502673]
9152A502673j42415k26472j86828j32951j19782j25800j26324j08123p7178m8016
9142B08784l1931j7000j0239o765n432n338J152R990R98Q87k351P111J2599Q934
9128A71399J1764K2724K9771L1437K1975L434N358R670O522o851k1895k9571l9925
9115B15812l9249l5430k5791j8310j1732m754j1392j0311m383Q882M359p459j2294
9102D7948l930l588n688l635J523l571J210K907l993k984N168P342M301M628R582
9087E7220Q839J0327J5813K0599K3002K1983J9605K4543J5535O677Q359R617r992
9074B32127k0059j7630j8907k1185k7564k6735k5051j6114q427m176q674o479
9062C1126M865K823K420m014P34L895J2147K2167K3385J8713P704L278R661Q964
$$ y = [1502673, 1360258, 1133786, 946958, 814007, 694225, 568425, 442101, 333978, 256800, 208784, 176853, 159853, 149614, 142849, 137417, 132079, 133231, 143221, 144219, 145106, 142755, 149866, 162465, 171399, 183163, 205887, 235658, 267095, 289070, 292504, 297862, 307532, 314054, 307203, 285308, 255737, 215812, 176563, 141133, 115342, 97032, 85300, 80546, 69154, 58843, 54460, 63342, 67701, 60242, 47948, 44018, 40430, 34742, 31107, 32630, 29059, 30269, 33176, 29183, 26199, 31367, 38709, 43010, 47638, 57220, 66059, 76386, 92199, 112798, 135800, 157783, 177388, 201931, 217466, 224143, 232502, 242119, 232127, 212068, 194438, 175531, 154346, 126782, 100047, 74996, 58882, 50455, 46279, 37605, 31126, 35991, 38814, 41234, 37220, 37954, 41849, 53996, 76163, 99548, 118261, 125965, 129243, 138904, 147868]
9048A47868K384j4764j9085k1884j6912J52J1264J1433J7n275N870N192o588j1163
9034H8509k153J743Q331R806O530M93L14l169j6775k0639k0724j4151r835p587
9020B0693j1227j9291j0470n007r866j1288K185J1018J2832J2265K5532L2919
9008E0295J5173N40k257l478Q34Q08r042k1231k3629j3172l761j848L552M076
8994c140M17n67j342m534l246O210J7074J3324O685R910L947j2409j3706j4528
8980D095j4102k1595r830j297n481o495p974k100J087m595l389j0112j0505p694
8966i9987n136m131l976j838p728j2539j2939j7579n802M493J0275K6951M3051
8953h6885L5296J3155o930r212q13j284j0171j7256n553J7654K9639K0684J6046
$$ y = [147868, 150252, 135488, 116403, 94519, 77607, 77759, 89023, 100456, 100473, 95198, 101068, 106260, 99672, 88509, 86356, 88099, 96430, 106236, 112766, 113259, 113573, 110404, 93629, 72990, 52266, 38115, 28280, 20693, 9466, -9825, -20295, -25302, -35168, -46456, -44271, -33253, -20421, -8156, 17376, 50295, 65468, 66008, 63751, 60273, 61107, 61915, 52873, 31642, 8013, -5159, -8920, -10768, -7216, -3140, -2723, -3290, -4632, -9166, -12412, -6202, 10872, 24196, 30881, 40791, 44738, 32329, 18623, 4095, -10007, -31602, -41432, -42729, -48210, -54705, -62679, -64779, -63692, -68287, -71676, -81788, -92293, -99987, -105123, -109254, -113230, -115068, -122796, -135335, -148274, -165853, -171655, -167162, -156887, -129936, -86885, -51589, -38434, -45364, -54576, -55389, -56673, -66844, -84100, -89653, -71999, -42360, -21676, -5630]
8940e630J2148O295J359J864j1282j6553j5273j1204M668J2853J1265J4599J5971
8927B1080P583j451j9454j8076N350K2916J8840J171m086j2205k2087j0034j095
8914a1548p505j0237j0773N502L1250M1935K6246N315q098m612q416J468J2645
8901F3172Q077o27o829j7102j2877M475J6222K2796N053j6611j4414j3914k2447
8888A4974k8427j2829J1947K9799K8541K7138J6099J3234l682j0667R900L2402
8876A28429L2622J5444J2145N681k268j0693R63M476K823Q762J8519K0115J6438
8863B53456K0686K4786K0939J0450N780J0439K6838K5237K5342J9133j339j9921
8851D21826K74K4616K7521J5037J4648K3785K8065K3550J5214L421L063L0865
$$ y = [-5630, 6518, 12813, 14172, 16036, 4754, -11799, -27072, -38276, -33608, -20755, -9490, 5109, 21080, 28663, 27212, 7758, -10318, -4968, 17948, 36788, 37959, 33873, 21668, -419, -10453, -11548, -19053, -29290, -40063, -34561, -3311, 38624, 64870, 70185, 62087, 57475, 49059, 50527, 63172, 71249, 70622, 63793, 46691, 33814, 38289, 54511, 77307, 82360, 65749, 51335, 37421, 14974, -13453, -26282, -14335, 15464, 44005, 71143, 87242, 100476, 96794, 86127, 96027, 128429, 161051, 176495, 188640, 194321, 192053, 181360, 182323, 186799, 189622, 198384, 216903, 237018, 253456, 274142, 298928, 319867, 330317, 336097, 346536, 373374, 398611, 423953, 443086, 441747, 421826, 422100, 446716, 474237, 489274, 503922, 527707, 555772, 579322, 594536, 597957, 601020, 631885]
8839F31885P2692P3243M9658N2193O5804P8082Q6275J06511J38340J66746J83736
8828A705165K15816K81072L30908L58394M07589M90985N82859O87429P87840Q33555
8818F681612Q80370J060481J359578J573689J630492J589233J543339J560214
8810A7879008J828052K481337L394019M641962O426611R097188J3446589K0700343
8802G9895109L3045619N1921553O7685685M8660269r485860m3330078l9235827
8795A89156470k7996622k2220212k2938153k4804859k1763594j6320761j1543617
8788D1568652q076463n630691l780797k327947j506960j456199j543520j532698
8780A5713377j444942j176207q09029n09075k59087q185K02934L73896O45091
$$ y = [631885, 704577, 777820, 827478, 879671, 945475, 1023557, 1109832, 1216343, 1354683, 1521429, 1705165, 1920981, 2202053, 2532961, 2891355, 3298944, 3789929, 4372788, 5060217, 5848057, 6681612, 7561982, 8622463, 9982041, 11555730, 13186222, 14775455, 16318794, 17879008, 19707060, 22188397, 25582416, 30224378, 36650989, 45748177, 59194766, 79895109, 112940728, 164862281, 232547966, 281208235, 271722375, 228392297, 189156470, 161159848, 138939636, 116001483, 91196624, 69433030, 53112269, 41568652, 33492189, 27861498, 24080701, 21752754, 20245794, 18789595, 17246075, 15713377, 14268435, 13092228, 12283199, 11774124, 11515037, 11506852, 11709786, 12083682, 12728773]
8771A2728773J011560J241239J344814J349995J283124J283245J537012K133787
8763B3913549K988740M206268N928767Q445796J2536695J9397878L1120544M9441349
8755A57979586O6163493N0402644o668612m2090923l8727810k7581679k1693898
8748A37782801k2247133k4308071k1547930j6242969j1541697q127870n731967
8741B8035164l918468k488382j676930j665083j811157j847210j790215j580618
8733A1257101j298101j078510r33506p84170o13848m73755l73678k95123k47630
8724E158780k17376j80356j41315j31785j42321j83855k02948j72137j28745j16112
8714C541830j12585r2749n8876l5577m1090m6019m2979o8282j02324j02970p3924
$$ y = [12728773, 13740333, 14981572, 16326386, 17676381, 18959505, 20242750, 21779762, 23913549, 26902289, 31108557, 37037324, 45483120, 58019815, 77417693, 108538237, 157979586, 224143079, 274545723, 267877111, 225786188, 187058378, 159476699, 137782801, 115535668, 91227597, 69679667, 53436698, 41895001, 33767131, 28035164, 24116696, 21628314, 19951384, 18286301, 16475144, 14627934, 12837719, 11257101, 9959000, 8880490, 7946984, 7162814, 6548966, 6075211, 5701533, 5406410, 5158780, 4941404, 4761048, 4619733, 4487948, 4345627, 4161772, 3958824, 3786687, 3657942, 3541830, 3429245, 3336496, 3277620, 3242043, 3200953, 3154934, 3111955, 3043673, 2941349, 2838379, 2764455]
8703B764455l7816l1075m1249l8767n985L5918N7011O2477O3954Q3802J28531
8692C041256J98751L09296M60747O81132J039421J587740K283694K711065K138163
8683A4451265M74610j160569j754520j612738j378265j281576j239710j107147
8675E391350q70004o31131m52392l90134l17512k02285j25604j00467r7103r2512
8665B112206r6536j04193r9803p5752m4139k7886j2067K3086M9835N4763M6713
8654A826227N8593P4672R2964J12824J36659J69119J98357K82126M28532O50072
8644D030145J005682J533066K194532K652476K185404O03844j045149j712716
8636A1447284j599223j352189j240678j207660j109786q98265o43841m35648l09533
$$ y = [2764455, 2726639, 2695564, 2654315, 2615548, 2609563, 2645481, 2702492, 2764969, 2828923, 2912725, 3041256, 3240007, 3549303, 4010050, 4691182, 5730603, 7318343, 9602037, 12313102, 14451265, 14925875, 13765306, 12010786, 10398048, 9019783, 7738207, 6498497, 5391350, 4521346, 3890215, 3437823, 3047689, 2730177, 2527892, 2402288, 2301821, 2204718, 2112206, 2015670, 1911477, 1811674, 1735922, 1691783, 1663897, 1651830, 1674916, 1724751, 1779514, 1826227, 1884820, 1959492, 2052456, 2165280, 2301939, 2471058, 2669415, 2951541, 3380073, 4030145, 5035827, 6568893, 8763425, 11415901, 13601305, 14205149, 13160000, 11447284, 9848061, 8495872, 7255194, 6047534, 4937748, 4039483, 3395642, 2959994, 2650461]
8627B650461k75055k41127j66366j19346r9780r7433j02654r5692r2194q8659
8617A272155q2677o8840n3537m7391m1085l2355j9036l453P577Q523q252j6719
8605I14910j2295q111r582j4534j2565J305J7691K4597K3231N092p361J230L368
8592I26976M947Q094j0005j9901k3119k1235r145j457l821k72J5233K1294M388
8579H91977j0452r898m945J226Q157J0034J1698K0400L4080L6225L4384L3713
8567A056599N4970Q5755J33137J95676K66965L77354N97022J018779J762723K587327
8557H136307K108225l69012j778384j442707r33183p17599p59250q41825p21477
8548B681095n17456l47392k29413j57758r2824n3646n6656n1511m1034m1627l9090
$$ y = [2650461, 2375406, 2134279, 1967913, 1848567, 1748787, 1651354, 1548700, 1453008, 1360814, 1272155, 1189478, 1120638, 1067101, 1019710, 978625, 946270, 927234, 923781, 931358, 939881, 931629, 914910, 902615, 894504, 884922, 870388, 857823, 859128, 876819, 901416, 924647, 929739, 922378, 923608, 926976, 931923, 940017, 930012, 910111, 886992, 865757, 856612, 855155, 851334, 851062, 866295, 887589, 891977, 881525, 871627, 866682, 867908, 876065, 886099, 897797, 918197, 952277, 988502, 1022886, 1056599, 1111569, 1197324, 1330461, 1526137, 1793102, 2170456, 2767478, 3786257, 5548980, 8136307, 10244532, 9875520, 8097136, 6654429, 5721246, 5003647, 4244397, 3402572, 2681095, 2163639, 1816247, 1586834, 1429076, 1336252, 1282606, 1225950, 1174439, 1133405, 1091778, 1052688]
8537A052688k6679j8997j0415K38L552J3566M8152O5987K9543j3007o84J3954
8525A157898Q531J1905K6975N3405R2758J48550K24794L55828N83164J008262
8515C672070J742369K513041J830219n06092j446510j061561q33890q08624q64675
8506D236347q74801p11723n24414l87014k72077j76653j07751p3171p4219o4204
8496I70320m1365m0109n4400n0144m9258k9873k1893n659J6387L0493L4644O558
8484G65701m1562n1996m2358k7906k6939l2076k6324k1991j3688j0823q813n39
8472D60686n39J581L718O595P737J0677J8482K8788N4127R1973R7443K6357o2147
8459G45478q0917n3207l8998m1514l9637l6837l3205k1377j3743j0515r893j6540
$$ y = [1052688, 1026009, 1007012, 996597, 996835, 1000387, 1013953, 1062105, 1128092, 1157635, 1144628, 1143944, 1157898, 1166429, 1178334, 1205309, 1258714, 1351472, 1500022, 1724816, 2080644, 2663808, 3672070, 5414439, 7927480, 9757699, 9251607, 7805097, 6743536, 5909646, 5101022, 4236347, 3361546, 2649823, 2125409, 1738395, 1466318, 1289665, 1181914, 1108743, 1034524, 970320, 928955, 888846, 834446, 784302, 735044, 705171, 683278, 677619, 694006, 724499, 759143, 765701, 724139, 672143, 629785, 601879, 574940, 542864, 516540, 494549, 480861, 470038, 461225, 460686, 460147, 461728, 465446, 472041, 479778, 490455, 508937, 537725, 591852, 683825, 781268, 807625, 745478, 664561, 611354, 572356, 530842, 491205, 454368, 421163, 399786, 386043, 375528, 365635, 349095]
8447C49095j2439l236K238N63M63Q53m482n609p580o028N11K354k613j755p42
8432C11593k322m738l497m5k61J556J845R09j793L73j349n750p675M261J0152
8417C03259K906n67L697M465N689N854J0091Q399J507R218P770L600j02J2681
8403C78467J9965K3445K9011M4759O2360R4345J40477K25970L28034L24868R2598
8392A764299j70647k22340j76574j33608j33883j36609j22735j01333p2587n0151
8382D43832l4926j9885q966j5555j9496j5127l457j0537j7341p376k591k266j584
8369B84725k541l441P744J1216M962N480O562P100K023O853J3279J9493K1069
8356C84524K7495L6345N7741R3405J39530K22791L21033L22465Q7906j65852k18579
$$ y = [349095, 336656, 333420, 335658, 336221, 336684, 337537, 333055, 327446, 319866, 313838, 314349, 316703, 314090, 312335, 311593, 309271, 304533, 301036, 300991, 300730, 302286, 304131, 305040, 303247, 303620, 302271, 296521, 288846, 293107, 303259, 306165, 305598, 309295, 313760, 319449, 325303, 335394, 343793, 345300, 354518, 362288, 365888, 365786, 378467, 398432, 421877, 450888, 495647, 558007, 652352, 792829, 1018799, 1346833, 1671701, 1764299, 1593652, 1371312, 1194738, 1061130, 927247, 790638, 667903, 566570, 493983, 443832, 408906, 389021, 380055, 364500, 345004, 329877, 326420, 315883, 298542, 291166, 288575, 286309, 284725, 282184, 278743, 286487, 297703, 302665, 308145, 314707, 321807, 323830, 330683, 343962, 363455, 384524, 412019, 448364, 506105, 599510, 739040, 961831, 1282864, 1605329, 1693235, 1527383, 1308804]
8345A308804j69158j30667j26344j32094j19925r6233o7147m5037l4118l2431
8335C55650k6192j5010j2013j7032j6396n732j2536j1299o118m520m51Q5o024
8322B22412l561r41O551k414r370j659K202n506n952k942N922M02m193m090o456
8307A90405l627J459M122J179J875M39j360l657l650o53K206P028R795O581L547
8292B15689k091r102q636p264k30k374P43O798O791N167O710J0446P207M854k944
8277B31764p704q723k314q22n244k762O59M972J1858M769q046r403p866l086m0
8262A98012j741j605p410m544m955l766k062k772j522m54L971m348J145J254L116
8247A72319M456P99l62m789l919L72P23R579R863Q383R399J3345P593L45k53J983
$$ y = [1308804, 1139646, 1008979, 882635, 750541, 630616, 534383, 467236, 422199, 388081, 355650, 329458, 314448, 302435, 285403, 269007, 263275, 250739, 239440, 233322, 228802, 228351, 228436, 222412, 218851, 217910, 224461, 222047, 212677, 211018, 213220, 207714, 201762, 198820, 204742, 205144, 200951, 196861, 190405, 186778, 188237, 192359, 193538, 195413, 195852, 194492, 190835, 187185, 186532, 188738, 195766, 205561, 212142, 215689, 213598, 204496, 195860, 188596, 188366, 185992, 186735, 193533, 200324, 205491, 212201, 222647, 229854, 234708, 231764, 224060, 215337, 213023, 212201, 206957, 204195, 204854, 209826, 221684, 226453, 218407, 209004, 201138, 198052, 198012, 196271, 194666, 187256, 182712, 177757, 173991, 171929, 169157, 167635, 167181, 171152, 166804, 167949, 169203, 172319, 176775, 177574, 177212, 172423, 168504, 168876, 169599, 179178, 189041, 197424, 206823, 220168, 227761, 228106, 227853, 229836]
8231B29836M885R011J0150M14q838j3214j2540q042q063j1773q900p113m711o188
8217A64914J016K203m984n000k938k83n070J206L438p257o752j383O24K404k533
8202A39605K475K299J762J342m389l186k266K648KJ745o59m102j843L544R687
8187A48664Q394O514p4o391q01l883j748n877k957j84l311k020L552K440k724
8172A39594j788j873M94J897M918M850J84m730k691r201p082L654O787N796J3951
8157A54760Q860R281K017m191m078K271q38j0799r622n426r35k51o860m115L565
8142A33639j791o791n303J126L457m5j361K191l040p38KM844R431L522J176r83
8126A39336L97J28k265J7K722O039k038k091m239K092K006K858L759N293L767
$$ y = [229836, 234721, 243732, 253882, 254296, 245458, 232244, 219704, 211662, 203599, 191826, 182926, 175813, 171102, 164914, 165930, 168133, 163149, 158149, 155211, 154928, 149858, 151064, 154502, 147245, 140493, 139110, 139734, 142138, 139605, 142080, 144379, 146141, 147483, 143094, 139908, 137642, 140290, 140292, 142037, 141378, 137276, 135433, 138977, 148664, 157058, 163572, 163498, 157107, 156306, 152423, 150675, 144798, 141841, 141657, 138346, 136326, 139878, 142318, 139594, 137806, 135933, 136427, 138324, 143242, 148092, 148276, 143546, 140855, 131654, 124572, 128226, 135013, 140809, 154760, 163620, 172901, 174918, 170727, 166649, 168920, 168082, 157283, 147661, 142235, 141300, 141049, 134189, 130074, 133639, 131848, 125057, 119754, 120880, 124337, 124292, 122931, 125122, 122082, 121344, 121346, 126190, 135621, 139143, 140319, 139336, 139733, 139861, 137596, 137613, 140335, 146374, 144336, 142245, 138006, 140098, 142104, 144962, 148721, 154014, 157781]
8111A57781k137l307k623k427L049R17m889K290J226L452K858l800j472q92n21
8096A49505O187L464N735J6664K5456L3452N4732P3146Q8388Q2224M0930q438
8084E71445m3323o5597n8218m7578m2445m2368l2360k8071k5444j5161q518n522
8072A56840n929j6Q02j956l7O30J168J052J879P35K460M577L166M519j625jq51
8055A67413M181q35L934R195Q880R708J3570J0956J5074K7774M6157O8970J16063
8042E01040J72477J95499J42455r98j06922j27769j10421r0233q6500q3262o7463
8031C37903m8432l2390k2256j6904q813k126L225k912r793q662l131o327l443
8018A75939J341O195J1148J3220K810J725R41j563n940L048J2318J6445K5137
$$ y = [157781, 155644, 152337, 149714, 147287, 150336, 151253, 146364, 148654, 149880, 153332, 156190, 152390, 150918, 150026, 149505, 155692, 159156, 164891, 181555, 207011, 240463, 295195, 368341, 456729, 538953, 579883, 571445, 528122, 462525, 404307, 356729, 314284, 271916, 239556, 211485, 186041, 170880, 162362, 156840, 150911, 150895, 151697, 149741, 149704, 150334, 151502, 152554, 154433, 155168, 157628, 162205, 165371, 169890, 168265, 168264, 167413, 171594, 170759, 174693, 183888, 192768, 202476, 216046, 227002, 242076, 269850, 316007, 384977, 501040, 673517, 869016, 1011471, 1010473, 903551, 775782, 665361, 575128, 488628, 405366, 337903, 289471, 257081, 234825, 217921, 209108, 206982, 210207, 207295, 197502, 188840, 185709, 179382, 175939, 177280, 183475, 194623, 207843, 210653, 212378, 213319, 211756, 205816, 208864, 221182, 237627, 262764]
8005B62764L4475O3268R6463J46543J43757L1449o8099o6488k1492J2588K2777
7994F58005L074k2513n0297o1008o5126n4833m1465l6282k9299k0221k1605k1294
7982B37136j6090j1064j1970o650p179l811m427j50L30L601k731o60J346k593
7968A75088K811O137J2906Q250J1479L3051O0045R8083J38977J12976J48q6034
7956E73917q5675o2292m4500m7383n0992l8919l2965k6432k3162j3987m139j240
7944A42231j620o287k332m629n088o546n94L23k047k70J965r22J143J024Q78l36
7928A16893J324N068j181K4L599l978o799k351M27J353k491k09M482J313o010
7913A11464j779M982l548o44j876J312M495j247J012j186k999L79Q082J3438K1962
$$ y = [262764, 297239, 360507, 456970, 603513, 747270, 778719, 710620, 644132, 622640, 635228, 658005, 661079, 638566, 588269, 527261, 462135, 407302, 365837, 329555, 300256, 280035, 258430, 237136, 221046, 209982, 198012, 191362, 184183, 180372, 175945, 175795, 176125, 179726, 176995, 176335, 177681, 175088, 177899, 184036, 196942, 205192, 216671, 249722, 309767, 407850, 546827, 659803, 659951, 573917, 488242, 425950, 381450, 334067, 283075, 244156, 211191, 184759, 161597, 147610, 143471, 142231, 140611, 134324, 131992, 127363, 122275, 115729, 115135, 115458, 113411, 113141, 115106, 114184, 115327, 116351, 117229, 116893, 118217, 123285, 122104, 122128, 125727, 121749, 114950, 112599, 113026, 114379, 111888, 111679, 116161, 117474, 111464, 109685, 114667, 111119, 110475, 108599, 109911, 114406, 113159, 114171, 112985, 109986, 110365, 118447, 131885, 153847]
7898A53847J5937M035q66K687p489j7306j2054q671o954l982m229m682n926j907
7884A02440O97j560L98o581m991l86K06K482N572m56J843Rr40J106k673m18O086
7867A02834O214M97m035k615J168m796n20j743k995K58O433M496J2073K1242L0723
7852A69234L6904K8046O972r974j8952k2290j8635j4961j4927j6486j2873j0454
7840A01604l999k613l985k910K524M839j609m908m397j758j851j045j833l219
7826G4840O99N628L587N29k231m144r90k401p09m107q085M068K416M38K51N178
7810G4967O023L415O186J5346J4189J1798J2731L444j960j0996j2759j0088o579
7797A05717j1540p620l353j669j806o713o09M182M57m227k400K593M173J241K141
$$ y = [153847, 169784, 173819, 172953, 175640, 168151, 150845, 138791, 130120, 123166, 119184, 114955, 110273, 104347, 102440, 103137, 101577, 101975, 95394, 90403, 90017, 90223, 92705, 98277, 97821, 99664, 99673, 98733, 99839, 97166, 96748, 102834, 109048, 109545, 105510, 102895, 104063, 99267, 98747, 97004, 94009, 94267, 100700, 105196, 117269, 138511, 169234, 206138, 234184, 241156, 231182, 212230, 189940, 171305, 156344, 141417, 124931, 112058, 101604, 97605, 94992, 91007, 88097, 90621, 95460, 93851, 88943, 84546, 82788, 80937, 79892, 78059, 74840, 75539, 81167, 84754, 85283, 83052, 78908, 77918, 75517, 74808, 70701, 62616, 66684, 69100, 69538, 69789, 74967, 80990, 84405, 90591, 105937, 120126, 131924, 144655, 148099, 146139, 135143, 122384, 112296, 105717, 94177, 86557, 83204, 81535, 79729, 73016, 72407, 76589, 77046, 72819, 70419, 73012, 77185, 78426, 80567]
7782H0567l387n951L21J249K954M076j413n813l567J180Q41k466q60j714N049
7767G1066m014q909l969M817J363j247O3j904K188K260L325Q12L962r01k167j422
7751F5323l245l852J788j817j325K145K234Q94m461L030K614l001k248N885K108
7736F6072J300l815l019R2N769L546j094q175l263j500l863P28K530J697j080
7721E5925K108Q11J878P85kj328K957r4l647M769N602k176k972j222k432j494
7705E9468j543J817M843k950p363j924j037L084Q21N36k858l98M013j409j455
7690E3645K548p67m777K139J499m6k75l757J191O162P99j993m659m685K450L400
7674E2874o002k608K195O592L047J103j583n385j137M403P689O97p001q546m365
$$ y = [80567, 77180, 71229, 71550, 72799, 75753, 79829, 78416, 72603, 69036, 70216, 71057, 68591, 67731, 66017, 71066, 67052, 58143, 54174, 58991, 60354, 59107, 59170, 57266, 59454, 61714, 65039, 65851, 69813, 68912, 66745, 65323, 62078, 58226, 60014, 58197, 56872, 59017, 61251, 62145, 57684, 60714, 63328, 60327, 58079, 63964, 66072, 67372, 63557, 60538, 60630, 66399, 69945, 68851, 60676, 57413, 55913, 52050, 52778, 55308, 57005, 55925, 58033, 58844, 60722, 61507, 61505, 60177, 63134, 63040, 59393, 64162, 69764, 67588, 64616, 63394, 60962, 59468, 57925, 59742, 64585, 61635, 54272, 52348, 51311, 54395, 55216, 55752, 52894, 52496, 56509, 55100, 53645, 56193, 55426, 50649, 52788, 54287, 54241, 53966, 50209, 51400, 57562, 58361, 56368, 51709, 47024, 49474, 52874, 46872, 44264, 46459, 53051, 56098, 57201, 55618, 50233, 49096, 53499, 61188, 61885, 54884, 46338, 41973]
7659D1973L434M106K664m726J154o62k169k053O69Q98L393J522k348K911Q14K030
7643E3610L902J02m226m313M405M29k453J993M398M582j170o345k843J973J389
7628E5433K062n528o017l200j110J1o40O267P491L816L720M895p187l651J834
7613E8196m612l153L586l114l428K471R13J934N221j922k45m404j280O446l169
7598E3440k669l969n721J344M052j44j849K098j880K126J458K353M20j719J223
7583E0563J116j288j432j543kj034L108j041Q89l168J26J472K913J145M205l665
7567E2364J074o35k971j624p3r78k693n444j766M908L435j603Q38K151j642k448
7551D2893l626k937j807L021O446l500m53L043o97n940n047K001L946M097q01
$$ y = [41973, 45407, 49513, 52177, 47451, 48605, 47943, 45774, 43721, 44390, 45288, 48681, 50203, 47855, 50766, 51580, 53610, 57512, 57614, 53388, 49075, 53480, 53909, 51456, 53449, 57847, 62429, 61259, 54914, 52071, 54044, 55433, 57495, 51967, 45950, 42750, 41640, 41651, 41011, 47278, 54769, 58585, 62305, 67200, 60013, 56362, 58196, 53584, 50431, 54017, 50903, 47475, 49946, 50859, 52793, 58014, 56092, 55847, 51443, 50163, 56609, 53440, 50771, 46802, 41081, 42425, 46477, 46333, 44484, 46582, 44702, 46828, 48286, 50639, 51059, 49340, 50563, 51679, 50391, 48959, 47416, 47414, 46380, 49488, 48447, 49336, 46168, 46294, 47766, 50679, 51824, 56029, 52364, 53438, 52803, 49832, 48208, 48135, 47157, 44464, 39020, 37254, 42162, 45597, 43994, 44832, 46983, 45341, 42893, 39267, 36330, 34523, 37544, 43990, 40490, 40037, 43080, 42383, 36443, 31396, 33397, 37343, 41440, 40639]
7536D0639k736L089M490o37k876L61l003l503O386L241l74j149k445K38O21P53
7520D3095l916l935M418J742L68L157j367j891j784n479R63L032O585j513n487
7505C7988k608k848k139l46L592M446j877L782K054j287l435J197L639Q77m35
7490D2600l772K420L75k985J700K813P86l69K82n628J703m84r36M02l290o80P705
7473D2642J2189M224m725k373p734p274j824P83M000P50k38K470m71L27l336m227
7457C5183k79M387j069k102n585M56Q386P108L900L501k513j2989n92M849j090
7442D1551n959l861J878K01j402J613p95k078K7J230j040j82L189n99J907k876
7426C2804K700k698N69q27L153N492l870n825k346K338O157J091l808j673l132
$$ y = [40639, 37903, 40992, 45482, 44845, 41969, 42330, 39327, 35824, 42210, 45451, 45077, 43928, 41483, 41721, 42342, 43095, 39179, 35244, 39662, 41404, 41772, 44929, 43562, 41671, 39887, 34408, 35371, 38403, 44988, 43475, 37988, 35380, 32532, 30393, 30047, 33639, 38085, 36208, 39990, 42044, 40757, 37322, 38519, 42158, 43035, 42600, 38828, 41248, 41623, 38638, 40338, 43151, 43937, 43568, 43850, 38222, 39925, 39441, 38505, 38907, 35617, 34937, 42642, 54831, 59055, 54330, 51957, 44223, 36949, 35125, 35908, 39908, 40658, 40420, 42890, 42419, 42746, 39410, 35183, 34904, 39291, 38222, 36120, 30535, 30991, 39377, 46485, 50385, 53886, 51373, 38384, 37792, 42641, 41551, 35592, 31731, 33609, 33810, 32408, 34021, 33226, 31148, 31175, 32405, 31365, 31183, 34372, 33773, 35680, 32804, 35504, 32806, 33375, 32548, 35701, 41193, 37323, 31498, 29152, 31490, 37647, 38738, 34930, 33257, 30125]
7411C0125l974M029k568M24L854L506L393j51j893n193j938O11k234L125P624
7396C8740J16n410q36n40R25M125r45k801n016j508k628Q83J589j205K63J83l296
7379B2639k906N050P297N036n37k288q36q89j215m243k533K116m51j562K770L838
7363C1286j050m149J060K04r87j860q08J213M203K903N635P834P662M111p0q199
7347D8988j4152j1132P21L804O97R55L58n89j195n60o790k908M9K889J688k672
7331B0151J421K0312J3773p48R68p354q836m122O3J033O62J99r36j349j901k124
7315C1212o02J654M846O92m841k87N63m103m012J697L75k93J210k209J021M164
7299C1087J85n93l631L805M463K658j326m226j925j049Q98l26l685k751J864L321
$$ y = [30125, 26151, 30180, 27612, 28036, 31890, 35396, 38789, 38638, 36745, 31552, 29614, 30225, 27991, 31116, 38740, 38856, 33446, 32610, 32070, 32995, 37120, 36175, 33374, 28358, 26850, 24222, 25105, 26694, 25489, 25752, 25935, 22639, 19733, 24783, 32080, 37116, 36579, 34291, 33455, 32566, 31351, 27108, 24575, 26691, 26240, 24678, 27448, 31286, 30236, 26087, 27147, 27351, 26364, 24504, 23696, 24909, 29112, 32015, 37650, 45484, 53146, 57257, 57187, 48988, 34836, 23704, 24425, 28229, 28926, 29881, 30239, 29650, 28455, 27895, 21105, 18197, 18246, 21135, 22823, 20151, 21572, 41884, 55657, 54909, 55877, 48523, 39687, 35565, 35628, 36661, 37323, 37522, 36586, 35237, 33336, 31212, 30610, 32264, 37110, 37802, 32961, 32674, 33237, 29134, 25122, 26819, 27194, 26901, 28111, 25902, 26923, 31087, 31272, 30679, 27048, 30853, 35316, 37974, 36648, 32422, 30497, 29448, 30346, 30020, 26335, 23584, 25448, 28769]
7283B8769J015J636k325q44M609K29l440l906j376J591J568N650m128l028J057
7268B7077J925N015l646n199l993K087J397K428n37k522l975O32k8j304L806L067
7252B6230m0K696O21k343n51K199L401N50k647J566m480m104j301J690J73j47
7236B3513j892k504J823L906j172L13N30j250k374m68L399K962J985l420k597
7221B2754L307P96j106NJ039N22k335K939K293k135k628K029j432Q58J167j971
7205B6102P20j912p016j344j709j856N891O403j648p44J892M81Q06k891l131l756
7189A6288n441L711J058Q95J327J714R74k845m90r5J175K373L10n99n031M479
7173A9803N256K759n323p724l86M122L041O635j775n979p39j82J772o01l858k457
$$ y = [28769, 29784, 31420, 29095, 28251, 32860, 33089, 29649, 25743, 24367, 25958, 27526, 33176, 29048, 26020, 27077, 29002, 34017, 30371, 25172, 21179, 23266, 24663, 27091, 26554, 24032, 20057, 20689, 20661, 19357, 23163, 26230, 26190, 28886, 29507, 27164, 26613, 28812, 32213, 32763, 30116, 31682, 27202, 23098, 21797, 23487, 23660, 23513, 21621, 19117, 20940, 24846, 23674, 23987, 24517, 23267, 20893, 20425, 23824, 26786, 28771, 25351, 22754, 26061, 26857, 25751, 25756, 26795, 27317, 24982, 27921, 30214, 28079, 25451, 27480, 26048, 26906, 28073, 26102, 26822, 24910, 17894, 16550, 14841, 12985, 18876, 25279, 23631, 22887, 24779, 25260, 26066, 23175, 20044, 16288, 10847, 14558, 15616, 16511, 17838, 19552, 20526, 17681, 17191, 17096, 18271, 20644, 20954, 20355, 15324, 19803, 25059, 27818, 22495, 14771, 14385, 18507, 21548, 28183, 26408, 20429, 19690, 19508, 21280, 20679, 16821, 14364]
7157A4364J007O015O642K93j566m411q95l080K050o47Q90M594L419k061j939k277
7141B2398l0L695k782n757J34L452N11N24N349L842j355q34k266j502m792j735
7125A8852L822K112l104J680j045K426j267j875N61M306J150k771M31K122j192
7110B6208J48K00l772N251K630j072J509j234k997m353k355L670J408m784p90
7095A9667R22N01K419O797K738P96K976m105p493k534L680l51j712j266M80k027
7079B1488J53q11M63R29k995Q25R680K511k422k375j57K45J144L13j899P28l224
7062B4596L70l947l095o20l55RJ165L291k321L834R52k973k926n63l29J046L204
7045B1338L288j357k524j992q49L0k391N390L375l961k374J109j643L042M776
$$ y = [14364, 15371, 21386, 28028, 28321, 26755, 22344, 21449, 18369, 20419, 19772, 20662, 25256, 28675, 26614, 24675, 22398, 22368, 26063, 23281, 17524, 17658, 21110, 21621, 22145, 27494, 31336, 29981, 29147, 26881, 25379, 20587, 18852, 22674, 24786, 21682, 23362, 22317, 24743, 23476, 21601, 22162, 26468, 27618, 24847, 25278, 27400, 26208, 26356, 26556, 22784, 28035, 30665, 29593, 31102, 29868, 26871, 22518, 20163, 23833, 25241, 20457, 19667, 20589, 21090, 23509, 30306, 33044, 33840, 36816, 32711, 25218, 22684, 26364, 26013, 24301, 23035, 23515, 21488, 21641, 20830, 21293, 22222, 19227, 20052, 29732, 32243, 29821, 27446, 27289, 27534, 28678, 28991, 27092, 27820, 24596, 24966, 21019, 17924, 17304, 16949, 16958, 18123, 21414, 19093, 22927, 23879, 20906, 17980, 17417, 17088, 18134, 21338, 24626, 23269, 20745, 18753, 17904, 17934, 15543, 20933, 24308, 20347, 17973, 19082, 17439, 20481, 25257]
7030B5257k264m037N157N430K604j739n301q299K075K565N44m308J74J771l811
7015A5818O53J990N672L240l869o471N98j739J648P333P21q98J308l83m379l105
6999A8137j973J015k97O621l031l840M90K037j182m46M063N23J739l140m361j254
6983A5101M421R92K67m74M24L772j986j558K229Q73j980j784j865k187l824m446
6967G975l90L803J443k352P72J989K808j725L93K617J40o435n954N06P128P113
6951A9831M054K728J549k910k992J02mn341m406M1K352K960M209K016R96r83j887
6934B2315J981K972m382l088o006j83K824m177l053J440K477M758K25L562j510
6919B0155K133k337k098K910q44k219m110j205L246L27K77j723P7J012j177k165
$$ y = [25257, 22993, 18956, 24113, 29543, 32147, 30408, 25107, 16808, 18883, 21448, 21992, 17684, 17858, 19629, 15818, 16471, 18461, 24133, 27373, 23504, 17033, 17631, 15892, 17540, 24873, 25594, 24696, 26004, 25621, 21242, 18137, 16164, 17179, 16882, 23503, 20472, 16632, 17122, 19159, 17977, 17531, 21594, 22117, 23856, 20716, 16355, 15101, 19522, 20514, 20781, 20307, 20731, 24503, 22517, 20959, 23188, 24061, 22081, 20297, 18432, 16245, 12421, 7975, 7585, 11388, 12831, 10479, 11251, 13240, 16048, 14323, 14716, 17333, 17473, 11038, 5084, 5590, 12718, 19831, 23885, 26613, 28162, 25252, 22260, 22362, 22358, 17017, 12611, 12652, 15004, 17964, 22173, 24189, 25185, 24202, 22315, 24296, 27268, 22886, 19798, 13792, 13609, 16433, 12256, 9203, 10643, 13120, 17878, 18103, 21665, 20155, 22288, 19951, 17853, 20763, 19919, 17700, 13590, 12385, 15631, 15958, 16235, 14512, 14589, 15601, 14424, 12259]
6903A2259j563K268L68K729L796L303O36L05m196l214J047j047J96p12J31q28
6887A5478m641N627N422K288k900o481Q58L684L350l536q146K200P12j190L222
6872A5947J087j769L185N788L963j100l300j462n013P71k689k737M281j354J160
6857A6758K520J94J347j661m869k439n93M220p14J892N00J588o071l359L901N839
6841A9053J609o14K274k039N2n926k232J205K241K831J252O71q51n70Q52M99n34
6824A9773k623p3K407P02m201r32J633L263K089K455k404n925O98j373l609P31
6808A2611l577L390M058L350l965j47j268m322j425J567K368j491K620K889o313
6793A0345l573p33K970K654M441L038n177k066P956J969p848J735P984L161l986
$$ y = [12259, 10696, 12964, 13332, 16061, 19857, 23160, 23796, 24101, 19905, 16691, 17738, 16691, 16887, 16175, 16306, 15478, 10837, 16464, 21886, 24174, 21274, 14793, 15651, 19335, 22685, 19149, 11003, 13203, 13915, 12725, 15947, 17034, 15265, 18450, 24238, 28201, 27101, 23801, 22339, 17326, 18097, 15408, 12671, 16952, 15598, 16758, 19278, 19472, 20819, 19158, 14289, 11850, 11257, 15477, 14763, 16655, 17155, 18743, 12672, 9313, 13214, 19053, 20662, 20048, 22322, 20283, 20335, 14409, 12177, 13382, 15623, 18454, 19706, 20377, 19526, 18956, 19808, 20307, 19773, 17150, 17077, 19484, 20186, 15985, 15053, 16686, 19949, 22038, 24493, 22089, 16164, 16862, 15489, 11880, 12611, 9034, 12424, 16482, 19832, 15867, 15720, 14452, 10130, 8705, 10272, 12640, 11149, 13769, 16658, 10345, 6772, 6039, 9009, 11663, 16104, 19142, 13965, 11899, 19855, 21824, 13976, 15711, 23695, 26856, 22870]
6778B2870l80m969n335r86m376O128K133p9J042L64m078p375J275K753M366j45
6762A3208n836J228M601J353m62q52M646J888q96K567k446k457k201L30k5r66
6746A3680J482J362j341n50k843L156j704L091L087K347L719J090m019k593M78
6731B0442O66o24K865j078j761l306J35J233l846l092k47J044J001L382K684Q41
6715B0339K348K193m693k859M58L119L49j569M676P89m471k650p17M846L109J456
6699B6723m649o251k340j365l928N505O641J308J391L568Lp832l801j299n72N930
6683A9032K1K564l670m447J308J292j130l005j493m474Q84M663l60K241k355N49
6667A1620l318j219k166j083K072N474n20o988J249L323K932K447l048K62J642
$$ y = [22870, 22490, 17521, 12186, 11200, 6824, 12952, 15085, 15006, 16048, 16412, 12334, 4959, 6234, 8987, 13353, 13208, 7372, 8600, 13201, 14554, 14092, 13240, 17886, 19774, 18878, 21445, 18999, 16542, 14341, 14671, 14646, 13680, 15162, 16524, 15183, 14633, 11790, 14946, 13242, 16333, 19420, 21767, 25486, 26576, 22557, 19964, 20442, 21108, 20484, 23349, 22271, 20510, 17204, 17339, 18572, 14726, 11634, 11387, 12431, 13432, 16814, 19498, 20339, 22687, 24880, 20187, 17328, 17786, 20905, 21254, 19685, 24361, 25150, 20679, 18029, 17312, 22158, 25267, 26723, 22074, 15823, 13483, 12118, 8190, 13695, 20336, 21644, 23035, 26603, 26606, 18774, 14973, 13674, 13102, 19032, 19053, 21617, 17947, 13500, 14808, 16100, 14970, 11965, 10472, 5998, 6882, 11545, 11185, 13426, 11071, 11620, 8302, 7083, 4917, 3834, 5906, 11380, 10860, 3872, 5121, 8444, 11376, 13823, 10775, 11037, 12679]
6652A2679j482o918J038N181k22L095O70l239k182j272J809J095J08k14P05m531
6636F320l004M618N98J347O59l038J150L955J440k146n676K931K491L19K915K504
6620A7383J227l25k198l012O9m702Q44l003P01K936j886J914L542J872l448n060
6604F854l933K845M402N341m071Q98J611n13l916J416M92Ql842J374k973m438
6588A555L946Q309M694M58l978j73J375j310q19j735k877r21J76J725K713J216
6572A4354O08J082l187n002k9M721k283l255l72N841J739j832R39J91m88O476
6556A9503q08j034K773l331m489k142k584O684M885l722L251m037p547k946j950
6541B506M692N601L391Q63M09n155j183j800m326k658j77q21N795P44k908l261
$$ y = [12679, 11197, 4279, 5317, 10498, 10276, 13371, 14041, 10802, 8620, 7348, 9157, 10252, 10360, 10146, 10851, 6320, 3316, 7934, 8532, 9879, 10538, 7500, 8650, 12605, 14045, 11899, 6223, 9154, 11645, 11964, 14879, 17383, 18610, 18285, 16087, 13075, 13144, 8442, 9286, 6283, 6984, 9920, 8034, 9948, 13490, 15362, 11914, 6854, 2921, 5766, 10168, 15509, 11438, 12336, 13947, 13434, 9518, 10934, 11426, 11434, 7592, 8966, 5993, 1555, 5501, 13810, 18504, 18962, 14984, 14811, 16186, 14876, 14057, 12322, 9445, 8524, 8700, 10425, 13138, 14354, 14962, 16044, 12857, 7855, 7826, 12547, 10264, 7009, 6637, 12478, 14217, 12385, 13324, 13515, 13027, 19503, 18695, 17661, 20434, 17103, 12614, 10472, 7888, 14572, 19457, 15735, 18986, 14949, 7402, 4456, 2506, 7198, 12799, 16190, 17053, 17462, 12307, 11124, 9324, 4998, 2340, 2163, 1342, 7137, 7881, 4973, 1712]
6525A712n656N531N306k754M29m10K352J650k123J045N958K854l188n792J932
6510H846l188m192M06L988J161M10M803k360l679j812M50N507P30k123n518R92
6494D421R50k809K266K701m99J247N295l782n177L584K605k204q45L272q85J515
6478A1655k632m640P5M534K315m534l030L197r95L357O734L839J578m329l20l926
6462A2878q489o346L974M977o8k571L819J571k688L108J883j619R34m480O315
6447A3198J471k146m040K023J453J574n6l714l439l648K772Q625L301K492O364
6432B6230O463q789j4422j909l747n5N545N764L143L342n064p123p915k634P223
6417F052M868k812l575J052n37r69J262J475J593K980M076p56m248J086n98m29
$$ y = [1712, -3944, 1587, 6893, 4139, 4568, 4158, 6510, 8160, 6037, 7082, 13040, 15894, 12706, 6914, 8846, 5658, 1466, 1872, 5860, 7021, 7431, 12234, 9874, 6195, 4383, 4833, 10340, 11070, 8947, 3429, 4421, 5371, 2562, 4828, 7529, 7030, 8277, 13572, 9790, 4613, 8197, 10802, 8598, 7753, 11025, 10140, 11655, 9023, 4383, 4458, 8992, 11307, 6773, 3743, 6940, 5945, 9302, 16036, 19875, 21453, 17124, 16804, 12878, 4389, -1957, 2017, 6994, 6926, 4355, 8174, 9745, 7057, 10165, 12048, 10429, 11363, 6883, 13198, 14669, 12523, 8483, 10506, 11959, 13533, 13477, 9763, 6324, 2676, 5448, 14073, 17374, 19866, 26230, 32693, 23904, 9482, 7573, 3826, 3771, 9316, 15080, 18223, 21565, 16501, 9378, 1463, -1171, 6052, 10920, 8108, 4533, 5585, 5048, 4079, 5341, 6816, 8409, 11389, 15465, 14709, 10461, 11547, 10949, 10520]
6401A0520m295k921j188P431J849k796K773l330n744r9j318j844O324J6217J0865
6386C2444k575J151o691j2542o048N95j431m67K05K094J828k184j953n58r85Q87
6370C770j220J794p90P037L141q62j046O96k62k702O719L63l486l163k800l528
6354C661j509R36N530K557L713J60o751m74o37p402j895Q613P754L972l348r592
6338E288o261K827l58n7l432J973k03N992k096j011L525R801j84k056n352n376
6322C020r71n326o15Q314j674n546M159O101M126R43N116L807k285q129o154r31
6306C955K204M507n725l470J602N681l808k104K365N88O7n830k364L599P555M089
6290A2911r447m412j068l566P146J638K234J713m80K225p11k224J981J356O39
$$ y = [10520, 6225, 3304, 2116, 9547, 11396, 8600, 11373, 8043, 2299, 2200, 882, -962, 5362, 21579, 32444, 29869, 31020, 24329, 11787, 5739, 6334, 4903, 4436, 4641, 6735, 8563, 6379, 4426, 3868, 2883, 3770, 2550, 4344, 3554, 10591, 13732, 12870, 11824, 12520, 12258, 9556, 16275, 16638, 13152, 9989, 7189, 3661, 2152, 3088, 8618, 11175, 14888, 15048, 8297, 7823, 7186, -216, -2111, 6502, 14256, 18228, 14880, 5288, -973, 1854, 1496, 1439, -1993, -20, -223, 5769, 3673, 2662, 6187, 15988, 15804, 13748, 8396, 3020, 2049, -3277, -3892, 4422, 2748, -2798, 1361, 7462, 11588, 12531, 17647, 21454, 19169, 11040, 4886, 3955, 6159, 10666, 4941, 1471, 3073, 8754, 4946, 2842, 5207, 5795, 5862, 32, -2332, 1267, 8822, 12911, 3464, -948, -2016, -5582, 1564, 3202, 5436, 7149, 6669, 8894, 8183, 5959, 7940, 9296, 9935]
6275I935l455l867J663M208j065R79l823O808R560M533o122n199l045k601m441
6260D068J315K478k525m997m924K760L482rj83k649l615K301O889J386j917k786
6244A074J60M17j623L504L089R11l472p084j775M345n813l342N29M278K748L447
6228A393M419L56P75o78o41k719P324J210j547k646p02k63J91O078J385p897P44
6211F782K239q14J904m45J297K754O43j934l701R96J447l832j493j736M994O491
6195A5592l807p293R11j032j029j442J975j160k625r5k53M323p74k682q9j962
6179a442m480J345N824J529J082k56K099k898Q81L973m845l914j628L218N332
6164E820L85n204M569M806R88O10k712n670o529M119J985K000k514k740L722J203
$$ y = [9935, 6480, 2613, 4276, 8484, 7419, 8398, 4575, 11383, 20943, 25476, 19354, 14155, 11110, 8509, 4068, 5383, 7861, 5336, 339, -4585, -1825, 1657, 1648, 1465, -1184, -4799, -2498, 4391, 5777, 3860, 1074, 1234, 1651, 28, 3532, 6621, 7532, 4060, -3024, -4799, -454, -6267, -9609, -9080, -4802, -2054, 1393, 5812, 6168, 6943, 6265, 5624, 2905, 10229, 11439, 9892, 7246, 6544, 6281, 6472, 12550, 13935, 6038, 6782, 9021, 8207, 10111, 9666, 10963, 13717, 14360, 12426, 8725, 9721, 11168, 7336, 5843, 4107, 9101, 15592, 11785, 4492, 5403, 4371, 3342, 1900, 3875, 2715, 90, -5, -258, 4065, 3291, 609, 520, -1442, -5922, -4577, 1247, 2776, 3858, 3602, 5701, 2803, 3684, 7657, 2812, -1102, -2730, 488, 5820, 6205, 1001, 5570, 10376, 11364, 11974, 9262, 3592, -2937, 1182, 3167, 5167, 2653, -87, 3635, 4838]
6148D838J267p57n528J894J914J172J385J911K015J79K00j747k208o01N14J836
6132H284j676k472j282O93J526J721j525l910l328m577j88K653O313j749o319
6117e836M002N143p54m313J12M345J277k532K132N28j435k580K952N557ln184
6101C411l890j304K140J152L033j195L262j039L163K639p6m010m100J425j976
6086B635L172n14j898k011m378K58P24j377Q70l10J006L063L1j277N223k50o19
6069D348l838l301O777k867n24l994l513M052O421K250l085j094J672k91P14N033
6053H760l214j938l204K081L670p98n092n186k985K554J140K367K500J143l120
6038a322k694Q79l96j840j012j282J812K672K697K75L311K920K983l681q836l47
$$ y = [4838, 6105, 5348, -180, 1714, 3628, 4800, 6185, 8096, 10111, 10290, 10490, 8743, 6535, 5934, 6448, 8284, 6608, 4136, 2854, 3547, 5073, 6794, 5269, 1359, -1969, -6546, -6734, -4081, 2232, 483, -5836, -1834, 3309, 2555, -1758, -1646, 2699, 3976, 1444, 3576, 4104, 2669, 89, 3041, 8598, 8595, 3411, -479, -1783, 357, 1509, 4542, 3347, 6609, 5570, 8733, 11372, 11296, 7286, 3186, 4611, 2635, 5807, 5293, 3395, 1384, -2994, -2736, -2012, -3389, -2519, -2829, -1823, 1240, 1271, -6, 5217, 4967, 4348, 510, -2791, 3986, 1119, 595, -3399, -6912, -2860, 3561, 5811, 2726, 1632, 3304, 3013, 3727, 8760, 5546, 3608, 404, 2485, 6155, 5357, 265, -4921, -7906, -5352, -4212, -1845, 655, 1798, -1322, -4016, -3137, -3533, -5373, -6385, -7667, -5855, -3183, -486, -211, 3100, 6020, 9003, 5322, -3514, -3861]
6022c861K373L421n52J864J999J585p244m221J951m816O700K107N47K880j483
6007C250J974k958n37Q07M051k618M65o6j405k004O58O707J469n235p60k448K573
5990C923L885Q52k323R73M267m25o098n52l570j328r59J264K220J758J171k876
5974B182M145J294k593n508J737J580j448l479J452O208K256j783K751L81m355
5959D820k367m66K653L945J766q68j628l518l246m940N30L34l340l203q2J300
5943h310M399M808O86k722M549o97k380m816J63P028P171l220m441J432k013p73
5927H64J115J560k218J099l995j534m53O083N711k259M14L985M38K17m435n43
5911F049j988l260L63O228l358k054J126k201J546k411r81j562K383R00K57K361
$$ y = [-3861, -1488, 1933, 1381, 3245, 5244, 6829, -415, -4636, -2685, -7501, -801, 1306, 1853, 4733, 3250, 5224, 2266, 1729, 2536, 6587, 3969, 4434, 4368, 2963, 959, 1617, 8324, 9793, 4558, 3798, 1350, 3923, 7808, 8660, 6337, 7310, 11577, 11152, 5054, 4502, 932, -396, -1355, -91, 2129, 3887, 5058, 2182, 6327, 7621, 5028, -480, 1257, 2837, 1389, -2090, -638, 5570, 7826, 6043, 8794, 9175, 4820, 2453, 1987, 4640, 8585, 10351, 9483, 7855, 4337, 1091, -3849, -3319, -2985, -6325, -9528, -9610, -8310, -3911, 897, 1583, -1139, 3410, 2713, 333, -4483, -4320, 2708, 9879, 6659, 2218, 3650, 1637, 864, 1979, 3539, 1321, 2420, -1575, -3109, -3562, 2521, 8232, 5973, 6387, 10372, 10810, 11027, 6592, 6049, 4061, 801, 1164, 7392, 4034, 1980, 3106, 905, 2451, 40, -941, -2503, -120, 780, 1037, 3398]
5895C398J453k299j794m22M380P24j223k42K133L263J682m115m901K592j108o198
5879b677J151K580l648L131O193J380j777M166L079m73o920p573j595o02R40K917
5863B72l140j598L042L714J248k786m618j367J319L545K380n06q43J320k682m42
5847a142j705k074O62K03J651M208J583L26O211O75o84l192J80j466R91j625Q
5830D810Q63n87j010j869l523n84M288K275P41k694j236l058K38K714J983j519
5814A832J618k327k453k026J462L153J983l974k247O45O471k150l163q254j118
5799a0548J230O411L357k823J054K69j962r22K584k355J309J470j759j273L904
5784e4M393J818j22J795j08j257J589j020o058J120L485L867j245k463k184J306
$$ y = [3398, 4851, 2552, 758, 336, 4716, 5440, 4217, 3975, 6108, 9371, 11053, 6938, 2037, 4629, 3521, -2677, -1526, 1054, -2594, 537, 6730, 8110, 6333, 10499, 13578, 13105, 6185, -1388, -2983, -3585, -2645, 272, -2868, -4466, -1424, 2290, 3538, 752, -3866, -5233, -3914, -369, 2011, 1505, 662, 1982, -700, -1142, -2847, -4921, -4259, -4056, -2405, 1803, 3386, 3712, 9923, 10598, 9914, 6722, 6902, 5436, 6427, 4802, 4810, 5673, 5086, 4076, 2207, -1316, -1900, 2388, 4663, 5404, 2710, 1474, -1584, -1346, 1368, 3351, 1832, 3450, 1123, -1330, -3356, -1894, 1259, 3242, -732, -2979, -2334, 4137, 1987, -1176, -9430, -10548, -9318, -2907, 450, -2373, -1319, -1050, -3012, -3934, -1350, -3705, -2396, -926, -2685, -3958, -54, 4339, 6157, 6035, 7830, 7722, 6465, 8054, 7034, 976, 2096, 5581, 9448, 8203, 5740, 3556, 4862]
5768D862p103k555K43P337O724l126m039L246n15p401K91M085K313k452j749j75
5752a4o96k833p51j92J204K728N445j408j09k504m160k655k984j259L372N827
5736i89L542L76l129l023K979K090q28l304k915J73L213M150J150q77m671j933
5720c996M309J215K238r95K782L47J470n157n433k627j999N764M002P38J053L596
5704G307j284n370n011Q6J583M34M4j088M50K623R35q61o443k446J002K390M429
5687a220O39M86k810J800J809P589q95l996k488n578L20p86L64R91K04j36J257
5670b450j097M37j548P62k639k979m67L150M335j769m017n77P35M434O569j891
5654I88J62K33M888M71o605m470k36M346J710K476l87l466k581M349J079m53j980
$$ y = [4862, -2241, -4796, -4553, 2784, 9508, 6382, 2343, 5589, 5074, -2327, -2036, 2049, 4362, 1910, 161, -14, -710, -3543, -4294, -4486, -3282, -554, 4891, 3483, 3374, 870, -3290, -5945, -8929, -10188, -6816, -989, 2553, 2929, -200, -3223, -244, 1846, 1018, -2286, -5201, -5028, -1815, 2335, 3485, 2608, -2063, -3996, 313, 1528, 3766, 2771, 5553, 5900, 7370, 2213, -3220, -5847, -7846, -2082, 1920, 2658, 3711, 7307, 6023, 653, -4358, -4272, -2689, -2255, -2211, -3299, -2849, -226, 709, -152, -6595, -9041, -8039, -5649, -1220, -581, -95, -2905, -1105, 704, 8293, 7398, 3402, 914, -4664, -4344, -5130, -4766, -3775, -3571, -3707, -2450, -3547, -3110, -4658, -3896, -6535, -9514, -9981, -6831, -2496, -4265, -8282, -8859, -8124, -3690, 2879, 988, 1150, 1383, 6271, 6742, 137, -4333, -4569, -223, 1487, 3963, 3576, 110, -2471, 1878, 2957, 2504, 524]
5637E24n55k618K571N200J591L91K232N20n855L91k211p916n69K53N510M833l112
5620A180j703L846K39l412j253k317M369J428k155L632K935J709l449o506J760
5605C03K784L131l304n689J302l052K273K409J495m39j605j481R28R27n97L736
5589C121J222l918J333L346K193L822k29l75J139L05n91r82O73p48m424o344L674
5572C217O296k065M75L4j618n626K094O14M39K650L368l445m251k156L259j979
5556A306j979j297K154K412M73J39j024M144j695j274n06J610K042K308j034k574
5540E205j268n302j911L493K003j588j527o9K72M461M215J582m166k040k555q45
5524d0m57j038R06K826M80M03l673m824N83k728l65K721M476r8K991l381m345
$$ y = [524, -31, -2649, -78, 5122, 6713, 7104, 9336, 9856, 4001, 4392, 2181, -5735, -6304, -6051, -541, 4292, 1180, -523, 3323, 3562, 150, -1103, -3420, 949, 2377, 222, 3854, 6789, 8498, 5049, -1457, 303, 3087, 6218, 2914, -2775, -1473, -4525, -2252, 157, 1652, 1213, -392, -1873, -945, -18, -615, 3121, 4343, 425, 1758, 5104, 7297, 11119, 10890, 10515, 11654, 11959, 11368, 10386, 11059, 10311, 5887, -457, 3217, 9513, 7448, 7923, 7957, 6339, 713, 2807, 3421, 3860, 6510, 9878, 6433, 2182, 26, 3285, 1306, -673, -1970, 184, 2596, 3069, 3208, 2184, 6328, 4633, 3359, 2853, 4463, 6505, 8813, 7779, 5205, 3937, -1365, -3276, 217, 2220, 632, -895, -964, -692, 3769, 7984, 9566, 5400, 3360, 805, -40, -497, -1535, -629, 2197, 2677, 3080, -593, -5417, -4834, -7562, -7927, -5206, -730, -828, 2163, -1218, -5563]
5507e563k391K256M728L488P52k566n319j25M78k421j340M378O579l242m819l328
5491h455j46L3j72L750M660j326j240P39J856n55J729L278k207R17k946q048J278
5474f855K84r76k232J095j335J211J851m54K751L942P0K774K710j892M65m84m791
5457a866l103L221L865M741l972n261l51L884j807P26K682M761J030n519n621
5442b590o750j617L306P968P232k102p469n101J316R14M255l014k789J526M835
5427h0L819j771k176K122j207l28l611J668j995K394J962K043O37k522K442j648
5411A749p530r249O38N393N22j312M246R426L9j50p70k421k22j268R59J675K69
5394A994J260o535n35M75K184j982M18K252n81m031K7m39K364M675N51k343q543
$$ y = [-5563, -7954, -5698, -970, 2518, 3270, 704, -4615, -4740, -4262, -6683, -8023, -3645, 2934, -308, -5127, -8455, -8601, -8568, -8740, -4990, -330, -1656, -2896, -2157, -301, -856, 873, 4151, 1944, 2861, -85, -8133, -6855, -6571, -7547, -9779, -8684, -10019, -8808, -6957, -7411, -4660, -718, -648, 2126, 4836, 2944, 3409, 2925, -1866, -4969, -1748, 2117, 6858, 2886, -2375, -2726, 1158, -649, 77, 2759, 7520, 8550, 3031, -2590, -9340, -10957, -7651, 317, 7549, 5447, -2022, -7123, -5807, -4893, -638, -3652, -6441, -4915, -80, 3739, 1968, -208, 1914, 707, 379, -3232, -1564, -3559, -1165, 797, 2840, 3477, 955, 3397, 1749, -5781, -15030, -14392, -8999, -8477, -9789, -5543, 3883, 3922, 3772, 3002, 581, 359, -909, 50, 1725, 1994, 3254, -3281, -3816, -3341, -1157, -3139, -2721, -469, -1050, -5081, -5054, -5493, -3129, 1546, 2097, -246, -8789]
5377h789m082j625L150K222P92J644J407J463k509j334L444Q29J89k869J4O983
5361I29K245j426R89r96N09j349j969l88J598j270p220q82p11j012k701N222L631
5344d801j40K436j721n60P30k583J44n23K11M17k982K138k67M961L874n75K498
5327C257k910J39k47K555J791m087m735J435O335m882l018k334l437j419J975
5312i582J589J582J30j913M62J218J836J325L423j826m546O74r02j363j458J969
5296g382O545O74m13J957J045O18l72J737j886k995L0J624J055K102J957k846
5280C450k909j073j514M59m36J976N84l870j176k375L030K362k115L97K71K284
5264f55j082k180n381L471K559k531j68K136l005J260j721l122K887M465J941
$$ y = [-8789, -12871, -14496, -11346, -9124, -8332, -6688, -5281, -3818, -6327, -7661, -4217, -3388, -3199, -6068, -6054, 929, 3174, 1748, 2737, 1741, 2250, 901, -1068, -1456, 142, -1128, -8348, -9230, -9941, -10953, -13654, -8432, -4801, -4941, -2505, -4226, -4786, -4056, -6639, -6495, -7018, -6807, -6390, -9372, -7234, -7501, -2540, 1334, 759, 3257, 347, 486, 239, 2794, 4585, 498, -4237, -2802, 3533, -1349, -4367, -6701, -10138, -11557, -9582, -7993, -6411, -6281, -8194, -7732, -6514, -4678, -3353, 70, -1756, -6302, -5628, -6530, -7893, -9351, -7382, -837, -163, -576, 1381, 2426, 3044, 2672, 4409, 2523, -472, -442, 1182, 2237, 4339, 6296, 3450, 541, -532, -2046, -1587, -2023, -47, 537, -3333, -4509, -6884, -3854, -1492, -3607, -3210, -2939, -655, -1737, -3917, -9298, -5827, -3268, -5799, -5967, -3831, -6836, -5576, -7297, -10419, -7532, -3067, -1126]
5249a126P28J204L741K21k784k817J090L722P95M733K848n481p992l449M50k45
5233d362R57K749J36j233J243M204l311m651J699K934N28n04J158m086K096M010
5217C567p498k138N52L857N754M909n59m560k913l303k200Q41J313j404o60q63
5201e305k65j79J355J759L288m001n91K243M747J146l401j481J687M861K302k183
5185E982o738o529J197j163J168M909l253k718k443J031P072K082j137q81l793
5170e214n32l930n161M684L370J153K574K282j25n312n726j217O88j640L947n07
5154a0666O751M331L157J539j846J421R74n05l593R7r17j952J005J698N21q69
5138A146k366j746m715l742Q29L396J077j638p97L573K735k227j284L521N300
$$ y = [-1126, -398, 806, 4547, 4768, 1984, -833, 257, 3979, 4774, 9507, 12355, 6874, -1118, -4567, -4117, -4362, -3405, -656, -520, -1753, -510, 3694, 383, -4268, -2569, 365, 893, 389, 1547, -2539, -443, 3567, -3931, -6069, -5517, -1660, 4094, 9003, 8444, 3884, 971, -2332, -4532, -3691, -2378, -3782, -4442, -5305, -5570, -5749, -4394, -2635, 653, -3348, -3939, -1696, 3051, 4197, 796, -685, 1002, 5863, 8165, 5982, -756, -7285, -6088, -7251, -6083, -1174, -4427, -7145, -9588, -8557, -1485, 597, -540, -1421, -5214, -5746, -9676, -14837, -10153, -6783, -5630, -3056, -774, -899, -6211, -11937, -13154, -12466, -14106, -10159, -10666, -3915, 416, 3573, 5112, 3266, 4687, 5661, 5156, 1563, 1660, 743, -1209, -204, 1494, 2015, 1146, -1220, -2966, -7681, -11423, -10594, -7198, -6121, -7759, -8556, -4983, -2248, -4475, -5759, -2238, 3062]
5123C062K610k207j108R11n907k022r76J696j89J652N45l021l643k282O481L889
5107e09l4n868O38K653j053J842J740j451K322j05J463j706l263L913N7j065q77
5090a303K087M596l169k022J149k629l992m21r94m654o78M520J258K5q61l609
5074a0697K433N582N652Q9O84k878M391M28k120k803K095L334N168n67j688r298
5058a95o728L55L550M734j808l114k311L671M093j045J991m833R97j181k059J10
5042c773k161j610n164l484R64M378M331M75K464j797M555M831O19n654m111J050
5026d087M732k819j20K367k881K27L506J081k321l91K815l277n19k782N610J661
5010B802k601j362J105k976j810K123K639N683j540q793l232L74r7l471L958J945
$$ y = [3062, 5672, 3465, 2357, 3268, -2639, -4661, -5637, -3941, -4130, -2478, -1933, -4954, -8597, -10879, -4398, -509, -543, -6411, -5773, -3120, -4173, -2331, -591, -2042, 280, 175, 1638, -68, -3331, 582, 639, -426, -1303, 784, 5380, 2211, 189, 1338, -1291, -5283, -5704, -6698, -11352, -12030, -7510, -6252, -6227, -7088, -10697, -8264, -2682, 2970, 3059, 3743, 865, 5256, 5684, 3564, 761, 2856, 6190, 11358, 10791, 9103, -195, -6923, -6568, -3018, 1716, -92, -3206, -5517, -1846, 2247, 1202, 3193, -1640, -643, -1824, -3883, -3773, -5934, -7544, -12708, -16192, -15228, -10850, -6519, -6044, -3580, -5377, -822, 4009, 4628, -1026, -5137, -4087, 645, -2174, -2294, 73, -2808, -2581, 925, 2006, -315, -706, 2109, -1168, -1687, -4469, 1141, 2802, 201, -1161, -56, -3032, -4842, -2719, -80, 5603, 4063, -4730, -7962, -7588, -7685, -11156, -7198, -5253]
4994e253N00J069n5J687K260m34l860J79Q78l302j167M489r53K546j949m676k885
4977a0926M017K655J092M681L718k933l694J388k50K56J776k800n734k407mk112
4961a1277j264L914q56K608n16P76j162J015N345N171k783K93l466o93j823j145
4945e863l486P63O987P327m73l236l081J704R26l766k01j434n269k169k198L309
4929a0160J566n90j170n59k18L168K000p67K905l231L997J11k490j863j983n001
4913a4285K031Q012L858k841q772k475M332M689J808P092o637O54j031o28L704
4898d89R59k064l94M09p29J114k096k229M902M689l443r41K040J760l60m015m316
4881e203j818K736K1L384J500l086k070J153M620m61j136J280J919r17K231o57
$$ y = [-5253, -4753, -3684, -3739, -2052, 208, -226, -4086, -3907, -3029, -6331, -7498, -3009, -3962, -1416, -3365, -8041, -10926, -6909, -4254, -3162, 1519, 5237, 2304, -1390, -2, -252, 4, 1780, -1020, -6754, -9161, -9165, -11277, -12541, -8627, -9483, -6875, -7391, -6615, -7777, -6762, -1417, 3754, 971, 1264, -2202, -2895, -4718, -5863, -9349, -8586, -1599, 5728, 5255, 2019, -1062, 642, 1568, -2198, -2399, -3833, -9102, -11271, -13469, -10160, -8594, -9184, -10354, -10913, -11131, -7963, -5963, -6730, -3825, -7056, -3059, -2948, -5438, -7301, -9284, -14285, -12254, -4242, -384, -3225, -11997, -14472, -10140, -5451, -3643, 3449, -3188, -2534, -3565, -4193, -489, 470, -1594, -1988, -1579, -2308, -1194, -3290, -5519, -617, 4072, 629, -312, 1728, 3488, 3128, -887, -5203, -7021, -4285, -4264, -880, 620, -2466, -4536, -3383, 1237, 776, -360, 920, 2839, 1922, 4153, 3496]
4865C496k228m112K051M143O76j688j206j287K492O810Q25k06p212m474j596j007
4849d523l85j858o22K593j497J141l09j056l294m159L281P661N631k263q21o11
4833a091K812m151m423n788o76P772K814n813l169Q36M768J780K393n42R59r46
4817b465n56N401K990j941K852j596m633p54K962J100n763l431L218j408k276
4802f300P11J196M025L819l515m504j248N819M815M98K12n213m478l680J528K877
4786c438K606m252J945M015k49k553q94m019M37q5J547L785N000k59J169P54n074
4769D35p797j006m68l330J27J050M745K646m70j508N078j333m266L4N576J167
4753F80n68J98j127R4j60Q15O458L505o115n640k673M770J439o05m60o19k961
$$ y = [3496, 1268, -2844, -793, 3350, 4026, 2338, 1132, -155, 2337, 9147, 9972, 9766, 2554, -1920, -3516, -4523, -4908, -6766, -7388, -4795, -6292, -5151, -5460, -6516, -9810, -13969, -10688, -3027, 2604, 341, -480, -1091, 1721, -2430, -6853, -12641, -13317, -5545, -2731, -8544, -11713, -10877, -6109, -4329, -1936, -2478, -1519, -2465, -3021, 2380, 5370, 3429, 6281, 4685, 52, -702, 2260, 3360, -2403, -5834, -2616, -4024, -6300, -5589, -4393, -368, 3451, -64, -4568, -5816, 3, 4818, 5316, 5528, 315, -4163, -7843, -6315, -3438, -832, -5084, -3139, 876, 627, -1926, -2820, -6839, -6402, -6487, -4940, -1155, 3845, 3586, 4755, 5509, 435, -7362, -8368, -8836, -12166, -12039, -10989, -6244, -3598, -4068, -5576, -498, -1831, -6097, -6063, -487, 680, 112, 310, -817, -723, -883, -68, 6390, 9895, 3780, -1860, -4533, 237, 1676, 1071, 611, -8, -2969]
4736b969k805M71j038j904L5J978Q6k938j913J587L303l550K295N739L154N64
4720B095j031KN88l715K41n0J621j347q797p01N641O556J759k334m642m026j710
4703i850j859J15q28K681L126L031J238j036O36L051K50k479j287J166m351j784
4687h180O32N99l169m809K140j719J672p15j042N931L453l045M521L911p94J540
4671I26l88K053l665n985N208j881l309k533n66N484M826m126l025m981K204q67
4655a0625J919J525J261K50M391K287l307O85J090p48J457j08k794K27r91k86
4639c767J608n62j271k483K380O59k448j462j908L98Q19J548M04r07M88j96N98
4622f102k767N32k68m744J633O295J821o125q13M80K367J146J808J596N16J841
$$ y = [-2969, -5774, -5303, -6341, -8245, -8210, -6232, -6146, -9084, -10997, -9410, -6107, -9657, -7362, -1623, 1531, 2095, 1064, 1066, 1654, -2061, -1820, -1870, -249, -1596, -10393, -11094, -5453, 1103, 2862, 528, -4114, -8140, -9850, -11709, -11594, -12422, -9741, -6615, -3584, -2346, -3382, -2746, 305, 555, -1924, -3211, -2045, -6396, -8180, -7548, -6949, -10118, -14927, -12787, -14506, -12834, -13549, -14591, -8660, -5207, -8252, -3731, 180, -614, 926, 538, 2591, -1074, -7059, -1851, -3732, -7041, -9574, -10140, -4656, 170, -3956, -6981, -11962, -9758, -10625, -8706, -7181, -5920, -5670, -1279, 1008, -2299, -1614, -524, -1272, 185, 77, -2717, -2490, -3481, -3767, -2159, -2721, -3992, -6475, -4095, -3436, -5884, -7346, -9254, -8856, -8037, -6489, -6085, -6992, -6504, -6700, -6102, -8869, -8337, -8605, -13349, -11716, -5421, -3600, -9725, -10538, -10058, -7691, -6545, -4737, -3141, -2625, -784]
4606g84M45P21j297j880l254k610m719q88L824O4O10M422O485j847k950j052k268
4589f978K10J063K160J271J922j553N43K198j111k054K93l127K283J349K166J012
4573A647j365n540l587l331L555Q000J891J442K6m47k498K122l978l051K360K419
4557c35j854O13k548k923k622j426N076M461j045K987J791j712j204l042n89K880
4541a492k207j803J015M570M419l282p06N230j993Q54n892l367l11K819j65O47
4525a664l049K33J481J751J991k179k933m16L937M401O40n576m61j22R57k605
4509c614o544Q28L240j887N994N06k657j052K43J446J085K406m23j347R92l037
4493c821l814M643P00k150L156j931n314L744L197n98N1J282j594o11K126Q3L16
$$ y = [-784, -339, 382, -915, -2795, -6049, -8659, -13378, -14266, -10442, -10378, -9768, -5346, 1139, -708, -3658, -4710, -6978, -6768, -5705, -3545, -2274, -352, -1905, -1362, 836, -275, -2329, -2036, -5163, -2880, -1531, 635, 1647, 282, -5258, -8845, -12176, -8621, -621, 1270, 2712, 2738, 2291, -207, 1915, -2063, -5114, -2754, -335, -2189, -1576, -4124, -7047, -9669, -11095, -6019, -1558, -2603, 384, 2175, 463, -741, -3783, -4372, -1492, -3699, -5502, -4487, 83, 4502, 1220, 514, 5744, 3751, 4605, -1287, -4654, -4965, -2146, -2311, -1664, -4713, -4480, -2999, -1248, 743, -1436, -4369, -4785, -848, 3553, 4193, -1383, -1844, -1966, -1009, -3614, -10158, -9330, -6090, -7977, -1983, -1477, -4134, -5186, -4943, -3497, -2412, -6, -429, -1776, -784, -3821, -7635, -2992, -2292, -4442, -1286, -3217, -8531, -4787, -1590, -2188, -2137, -855, -2449, -3060, -934, -851, -535]
4476e35n598j591M567k969k040L235j230o30J466L505k363L998r65k794M892j918
4460i70J940J86j611M13J661l72r84K247j17n562o463L573J363j621J174J705
4444c438J466j990L455r94k561L996m828l276l153k913K351L558L013P71J688
4429b855k458o64K759M594Q49o164j122j740j997L27M259K637k923k724J533L532
4413b157j313J626k227k264N719M451l135j515J38L789J838n388l30p834n747
4398a4349r10N930M122m34l30r22K525j855j535K939m095M838O433J891o74j945
4382A629n514j833J327L515L391k564l839j247K044J900K618K624l024k875K946
4367A098K120L144K409p254m241l605k311K49K415l782L780M470L46m183o76r66
$$ y = [-535, -6133, -7724, -3157, -6126, -8166, -4931, -6161, -6791, -5325, -1820, -4183, -185, -1150, -3944, 948, -970, 970, 1156, -455, -42, 1619, 1247, 263, 2510, 2393, -3169, -9632, -6059, -4696, -6317, -5143, -3438, -1972, -3962, -507, -1501, -4062, -66, -4894, -8170, -11323, -14236, -11885, -8327, -5314, -4543, -2855, -5313, -5977, -3218, 1376, 2225, -3939, -5061, -6801, -8798, -8471, -4212, -1575, -4498, -7222, -5689, -2157, -3470, -1844, -4071, -6335, -616, 3835, 700, -815, -677, 3112, 4950, -438, -768, -8602, -14349, -15259, -9329, -5207, -5641, -5971, -6893, -4368, -6223, -7758, -4819, -8914, -4076, 2357, 4248, 3574, 1629, -3885, -5718, -4391, -876, 2515, -49, -3888, -5135, -3091, -1191, 1427, 4051, 1027, -1848, 1098, 3218, 6362, 8771, 1517, -2724, -6329, -8640, -8391, -5976, -9758, -5978, -1508, -1162, -5345, -6021, -6987]
4351f987J752J067k754n09Q21R10L029M49k257J138m043o420J353K110J951K300
4335f090L572l64o871j883K154K647k388l40J973K791L58o8L638K054K32M44o923
4318e064j329K328m148l969Q31L892K288q97O38j929k310M425N206J058q96q49
4302g25q77m0r09k875J03L676N042L51L544k110n318o618L81M819m082m278N819
4285d097O356J61n49M011j620l783j315n509l633l448M265K614J084j132m097
4270a0692L030J45j603M91j485N263k997o502K784M349R99J846k377L096N557
4255A904n95o5p318M407K104p51K17j74o3J784o692m904M943K880Q96k557O11
4238c373N650K582n826R07K85L712J002k116j396j610l077k283j867l259n70n1
$$ y = [-6987, -5235, -4168, -6922, -7431, -6610, -5700, -2671, -2222, -4479, -3341, -7384, -13804, -12451, -10341, -8390, -6090, -2518, -2882, -9753, -11636, -9482, -6835, -9223, -9563, -7590, -4799, -4441, -4509, -871, 1183, 1415, 1859, -5064, -6393, -4065, -8213, -12182, -11351, -7459, -5171, -6068, -5430, -7359, -9669, -5244, -38, 1020, 124, -725, -1602, -1642, -2551, -5426, -5323, -1647, 3395, 3746, 7290, 5180, -138, -6756, -6375, -1556, -5638, -9916, -4097, 2259, 2420, 1871, 5882, 4262, 479, -836, -6345, -9978, -13426, -9161, -6547, -5463, -6595, -10692, -7662, -7517, -9120, -8629, -10114, -4851, -7848, -14350, -11566, -7217, -6218, -4372, -6749, -3653, 1904, 1309, 1244, -6074, -1667, 437, -314, -97, -271, -334, 1450, -5242, -10146, -5203, -2323, -1427, -3984, -3373, 2277, 4859, -967, -60, 225, 3937, 4939, 2823, 1427, -183, -3260, -5543, -7410, -10669, -11239, -11290]
4222a1290j676q73O037K52j223L791J223p82k700Q59j913K100j12m14J472Q32
4206d417j199m57J048K062L354J081l103l986l042n94q21l928L317M465O877l414
4190b757m10r96j177k205J218l566m414m31j392N393P011J281k384m840j414j612
4174a2695m26J059J990K427K672N510j048O44o672k746M509M796j748q700l076
4159a3504R219k13O29k70r87M225K459r67j305r43o2L48j41p040l687n35M635
4142h139N284K177K134M072o30l916m368k197M773J761O06k362l799n072M209
4127e467J278k818M581N646m68j363r64K345l411l879K945j380l744K554N84m33
4111c994J033J827L174L41K739M681o671l764J691k882N935m80o860n245L192
$$ y = [-11290, -12966, -13839, -7802, -7550, -8773, -4982, -3759, -4541, -7241, -6382, -8295, -6195, -6307, -6721, -5249, -4417, -5616, -6073, -5025, -2963, 391, 1472, -1631, -5617, -8659, -9253, -10074, -14002, -10685, -6220, 657, -2757, -3167, -4163, -5340, -7545, -6327, -9893, -14307, -14738, -16130, -10737, -3726, -2445, -4829, -9669, -11083, -12695, -13121, -12062, -10072, -7645, -4973, 537, -511, 133, -6539, -9285, -4776, 20, -1728, -10428, -13504, -4285, -4498, -3869, -4139, -5126, -901, 1558, 591, -714, -1657, -1719, -1371, -1512, -8552, -12239, -12774, -8139, -2855, -678, 1456, 5528, 4898, 982, -3386, -5583, -810, 951, 1557, -805, -4604, -9676, -5467, -4189, -7007, -2426, 3220, 2752, 1389, 425, 2770, -641, -4520, -1575, -2955, -6699, -4145, -3561, -3994, -2961, -1134, 2040, 2381, 5120, 9801, 3130, -634, 1057, -1825, 4110, 3630, -3230, -8475, -5283]
4096e283L487o81k525r72M142R89o99L373M452m636o524j946K371N495j924l757
4080d638R86k815m497L275L105j273j750l060r22N86M656J748k755m846J180p1
4064a1091j607Q796P253k927j385l283k318J823j568k622J646k756r17K542Q964
4049E50n29L03N540k247k301l596j936j16j877o027N537Q173r23o473l681q62
4033a0465M44K778O42K307m814q223K949O559L3K599L365L095L58j493m73K832
4017B493N18l84k226n362j069K445J903n516m839p48J4N078J07k524j704k74q57
4000a2945j695J179M415M562N625K647J542m61n403l516K147L56K89K579L04q158
3984f533l658J258K828l941Q28O589J686j972L691j080J807n025l301K98J71N599
$$ y = [-5283, -1796, -2477, -5002, -5974, -1832, -843, -1542, 1831, 6283, 1647, -4877, -6823, -4452, 1043, -881, -4638, -3652, -6467, -10964, -7689, -4584, -5857, -7607, -10667, -11589, -11003, -6347, -4599, -7354, -12200, -11020, -11091, -12698, -3902, 3351, 424, -961, -4244, -6562, -4739, -6307, -8929, -7283, -10039, -10956, -8414, 550, 21, 324, 5864, 3617, 1316, -2280, -4216, -4332, -6209, -12236, -6699, 1474, 551, -5922, -9603, -10465, -10021, -7243, -6601, -4294, -9108, -17331, -14382, -7823, -7790, -5191, -1826, 1269, 1627, 134, -339, 2493, 3011, 2627, 401, -4961, -6030, -3585, -1682, -7198, -12037, -12785, -12771, -7693, -7586, -10110, -11814, -12088, -12945, -14640, -13461, -9046, -4484, 1141, 3788, 5330, 4869, -534, -4050, -1903, -1547, -1258, 1321, 1625, -6533, -10191, -8933, -6105, -10046, -9218, -2629, -943, -2915, 776, -304, 1503, -3522, -6823, -6525, -6354, -755]
3968g55M143l319o778k161J247l430K031K584q26K425M189K745o136j970J748
3953d263M91M436L53j071l869J883l577p89K131N019n332k504L257K61l276J563
3937e287j355M712l748m147M60l395j499l30Q57M767P01o735r92P360J281N143
3921b207O599k230r624m520J644L015P53k242j554m78N889M102K38j310K749l793
3905b969K918N866p162m566M714k496n448M504K969l181J650k668l814k322L722
3890h283L259J697k869m53O82L76j744J541M258L525k481m316j83j689K883M317
3874E20j419L909M081M92m378q77j382l687k179K858L059K591m294N54j727m60
3858b339J673J107o405j675J93l56K293Q89P83q95k565N326K791M385k63o493
$$ y = [-755, 3388, 69, -6709, -8870, -7623, -11053, -9022, -6438, -7264, -4839, -650, 2095, -4041, -6011, -4263, -3772, 664, 1017, -54, -3923, -2040, -5617, -6406, -4275, 744, -4588, -7092, -3835, -3574, -6850, -5287, -6642, -1930, -5678, -9825, -9365, -12760, -14259, -14589, -13732, -8965, -8264, -14999, -15991, -8631, -7350, -2207, 4392, 2162, -7462, -11982, -10338, -7323, -6570, -8812, -10366, -10844, -4955, -853, -615, -1925, 824, -2969, -51, 5815, -1347, -5913, -1199, -3695, -9143, -4639, -1670, -4851, -3201, -5869, -9683, -12005, -8283, -5024, -3327, -6196, -6649, -5967, -5591, -7335, -5794, -1536, 1989, -492, -4808, -4991, -6680, -3797, 520, -899, 3010, 7091, 7583, 3205, 2328, 946, -2741, -4920, -2062, 997, 3588, -706, -152, -1879, -2339, -666, 441, -5964, -7639, -7446, -7802, -5509, -4620, -3837, -4732, -7297, -1971, 820, 5205, 4942, -1551]
3842a551l303m397k771p02M550K97J446l058M39j424K448P61j573K100K227m363
3826h874k980o72j21O159Q360j358n690L798N256j31n141n205k105j350n524k240
3810a7818L072K447k044N66K452l43N35K714N95k036P794K396j616n901l677k487
3794a3351L369L849j856k825K292j056j520l967l1J264l477P774L625q23l459
3779a0192M71j704l430M129P664N349n93k584L723l26j729k702j809O41M45J079
3763a568k748m137k895J620J312N29J848L471N640N842J095n040k982j802J808
3748A993j024l771R76l455q49K171J733K11N51R84K482j790K886r1K459j582l486
3731C98n675k01k193l39L726j805Q5K631P816k43k16l661j757R29K865K86m363
$$ y = [-1551, -4854, -9251, -12022, -12724, -8174, -7877, -6431, -9489, -9050, -10474, -8026, -7265, -8838, -6738, -4511, -8874, -11854, -12526, -12647, -6488, 1872, 514, -5176, -1378, 3878, 3747, -1394, -6599, -8704, -10054, -15578, -17818, -14746, -12299, -14343, -13777, -11325, -11668, -11133, -8419, -7824, -9860, -2066, 330, -1286, -7187, -10864, -13351, -9982, -6133, -7989, -10814, -8522, -9578, -11098, -15065, -15096, -13832, -17309, -9535, -5910, -6733, -10192, -9721, -11425, -14855, -10726, -3062, 2287, 1694, -890, 2833, 2507, 778, -1924, -3733, -3092, -2647, -1568, -4316, -8453, -11348, -9728, -8416, -7887, -6039, -2568, 3072, 8914, 10009, 4969, 1987, 185, 1993, 969, -2802, -1826, -5281, -6130, -3959, -2226, -2015, -1464, -480, 2002, 212, 3098, 3007, 5466, 3884, 398, -5277, -5478, -7671, -8010, -4284, -6089, -6004, -3373, 4443, 4200, 3984, 323, -1434, -505, 2360, 2646, -1717]
3714a717l340k216PQ99K944J988J725j550n147j538k116k687P086J483J510N136
3698B467j575r86l473j215m070n57M802l131l50p83l844J627j318M825K360l725
3682h946n220l00K572n98j462K854J448j562j281J162M167J890K247n198q87K370
3666f744J64J873K52j695N47k630kN987l968r78J994J472j865k375M470N843N36
3649B881j459j349l229j499O39K256L20l074L692K784L06m734j084J899k602l196
3633g449M63Q8J622j989n46K318k833k295K663n31K558j116m228J888O145O043
3617B801L037N17j040m356k840j117n439m56j224O85k291m694L539M381o35m132
3601a3264M28L429k623k411O90L218L875J744K25J541L119L80k660K769M305k46
$$ y = [-1717, -5057, -7273, -7266, -6367, -3423, -1435, 290, -1260, -6407, -7945, -10061, -12748, -5662, -4179, -2669, 2467, 892, -94, -3567, -4782, -8852, -9409, -4607, -7738, -8088, -8871, -12715, -11088, -12406, -7581, -5221, -8946, -14166, -14466, -11894, -12492, -13954, -11100, -9652, -11214, -12495, -11333, -7166, -5276, -3029, -8227, -9114, -6744, -6580, -4707, -4455, -6150, -5603, -8233, -8235, -2248, -6216, -7194, -5200, -3728, -5593, -7968, -3498, 2345, 2881, 1422, 73, -3156, -4655, -4016, -1760, -1440, -4514, -822, 1962, 2268, -2466, -3550, -1651, -4253, -7449, -6986, -6898, -5276, -7265, -7811, -5493, -8326, -10621, -7958, -8489, -5931, -7047, -11275, -9387, -3242, 2801, 5838, 6355, 5315, 959, -1881, -2998, -8437, -8893, -10117, -9432, -11723, -16417, -12878, -8497, -9132, -13264, -12836, -9407, -12030, -14441, -13751, -10533, -6658, -4914, -4689, -3148, -29, 351, -2309, 460, 4765, 4519]
3585D519o247l767l508P43J595L496J686l383N645Q83K000j377j763m556k901
3570f935j440N954L593k089k201l855N38o12j05K998J810l573J159J509J876k544
3554c917j162K039L160m272j564L754N36j392J011l839k702J203M48m7m07J528
3538e623K34J056R15M133M995k142l628l897Q95K03J854Q75m078J190J266m316
3522f068l099N04M088L379l85L542L40M809m60n080m128m213L471n072p32n98
3506i702K408k132P44J282K21J571k48L20P52k170m784j981q88J664P503P251
3490A811J556k351J516M40k131j454n1K190N175L157j922r785R95K576j130m21
3474A71l669k067K186N423J977m30m116j879M460k285l545J238o485l38l864J430
$$ y = [4519, -1728, -5495, -9003, -8260, -6665, -3169, -1483, -4866, 779, 1662, 3662, 2285, 522, -4034, -6935, -8375, -2421, 1172, -917, -3118, -6973, -6435, -7047, -7152, -4154, -2344, -5917, -4758, -3249, -1373, -3917, -5079, -3040, 120, -4152, -5716, -1962, -1426, -2818, -1807, -5646, -8348, -7145, -6697, -6744, -7151, -5623, -5389, -4333, -3418, 715, 5710, 3568, -60, -3957, -3062, -2859, -1005, -130, -4208, -3018, -1752, -6068, -9167, -8663, -4575, -1196, -1581, 1961, 2301, 7110, 6650, 1570, -2558, -6771, -3300, -8372, -9104, -9702, -7294, -9426, -8682, -7400, -7179, -5608, -5856, -5536, -4784, -6954, -11738, -13719, -14607, -12943, -5440, 1811, 3367, 1016, 2532, 2972, 841, -613, -664, 1526, 6701, 9858, 7936, -1849, -854, 1722, 592, 171, -3498, -5565, -3379, 2044, 4021, 3591, -525, -2404, 2056, -229, -3774, -2536, -9021, -9359, -13223, -11793]
3458a1793K412K903j010j731l351L090P015N744K732j956j495p069k742J164p38
3443f825J800j550l682LK644J222J157K018J923k136L284K771q63j591k786J033
3427a578m775K135m000k743K888J593L440N23K667k72j021m619K62K688L452j993
3411a353o41M474l315j118o35L57l564l259m866N42M428J084j060q47Q482J804
3395E13j875L257n314K880O50n018J10N554M4m663N89j978n935O43O67M268N249
3378c59j757J818M010L980m744m596L37O0J351K725n3m379k503r52J606L489J110
3361A143j243k2J969n670J729k514l789k112O004O020j260o355M16L617J443q73
3345a497K060o470m647L610M137L531j281q5K000K024k252m465m393l178L593
$$ y = [-11793, -9381, -6478, -7488, -9219, -12570, -9480, -2465, 3279, 6011, 4055, 2560, -4509, -7251, -6087, -6825, -5025, -6575, -10257, -10254, -7610, -6388, -5231, -3213, -1290, -3426, -142, 2629, 1766, 175, -2611, -1578, -6353, -4218, -8218, -10961, -8073, -6480, -3040, -2517, 150, -122, -1143, -5762, -5500, -2812, 640, -1353, -1994, 2480, -835, -1953, -2588, -2231, -5795, -9054, -13920, -13378, -8950, -7866, -8926, -9773, -1291, 513, -1362, 1895, -3419, -539, 111, -4907, -4797, 757, 801, -3862, -3273, -5251, -11186, -10543, -9876, -5608, -359, -2116, -298, 3712, 7692, 2948, -1648, -1311, -1251, 100, 2825, 2772, -1607, -4110, -5062, -3456, 33, 1143, -100, -122, 1847, -3823, -2094, -4608, -8397, -10509, -4505, 1515, 255, -6100, -5684, -2067, -624, -1497, 563, -5907, -10554, -6944, -2807, 724, -557, -642, 1358, 3382, 1130, -3335, -7728, -10906, -7313]
3330g313J748L512j773J284k064J029j59m090K274n47K892K01j895M386M973m916
3314d58J820M304k136K697n52J08o645j645M354J175L265j756p196l563k391l540
3298a2159L600M312j074m714n76J053o38J441Q186K575P78j445j2k432K891J251
3282C037J008M4o844r69K465k185r95o15l120j320o86R45k09M784O307l235j879
3265c467p43o06R53l045P5K499k727J831m98j778n612j112M288m400J718J862
3249a0762m003M832J220l116J555J966k575j637L449L838j820n003N64J517m709
3234a4684J611J130J440K964K657L859L090l78K957L174p263n760J698j591q48
3219e944l068k910j359N266P449j51k641k765j78O615P001l168m005K17l945m990
$$ y = [-7313, -5565, -2053, -3826, -2542, -4606, -3577, -3736, -7826, -5552, -6099, -3207, -3006, -4901, -515, 4458, -458, 1362, 5666, 3530, 6227, 5675, 5783, -862, -2507, 1847, 3022, 6287, 4531, -2665, -6228, -8619, -12159, -8559, -4247, -5321, -10035, -10611, -9558, -10196, -8755, -569, 2006, 2784, 1339, 1327, -1105, 1786, 3037, 4045, 4089, -2755, -3724, -1259, -3444, -4439, -5054, -8174, -9494, -10180, -9235, -9444, -4660, 1647, -1588, -3467, -4210, -4816, -3863, -6908, -6833, -4334, -7061, -5230, -5728, -7506, -13118, -14230, -9942, -14342, -12624, -10762, -14765, -9933, -8713, -11829, -10274, -8308, -10883, -12520, -9071, -5233, -7053, -12056, -11492, -9975, -14684, -13073, -11943, -10503, -7539, -4882, -1023, 2067, 1689, 4646, 7820, 557, -5203, -3505, -5096, -5944, -9012, -11922, -13281, -8015, -566, -717, -3358, -6123, -6301, 314, 7315, 4147, 142, 359, -3586, -8576]
3203h576J241N795P403M99o482o309o96M760M71k776J799M10n390l31K153M987
3187a042L957j581j704l641l686L328k707K599R31J251K667J475l083j822L058
3172@n267o514N39K111K280R32J185J051k558M816J841m431n084l96L692J91L551
3155b061K14k87P71j49k56k05l747J603M203l580o714j478N355L466o97L749M360
3138D547k775j394p22L112m174m524K318k450J650K866o9j361j567n46j43n53
3122e785m0m139L053K288l521k726k194k219M964R1J813J08j139K537Q9j203K487
3105e536M539L887J960J664o91k905o114M02L098j610k042N799j88o697o439J350
3089i523r61K841N713Q64l935l801J688q7K425N97R22L515R32p14l996l248l786
$$ y = [-8576, -7335, -1540, 5863, 6362, -120, -6429, -7125, -2365, -1894, -4670, -2871, -2461, -7851, -8182, -6029, -1042, 2915, 1334, -370, -4011, -7697, -4369, -7076, -4477, -3546, -2295, 372, 1847, -1236, -3058, 0, -5267, -11781, -11242, -9131, -6851, -5919, -4734, -3683, -6241, -1425, 416, -4015, -9099, -9495, -5803, -5612, -2061, -1847, -2134, -1363, -1512, -1768, -1973, -5720, -4117, 86, -3494, -10208, -11686, -6331, -2865, -3562, 187, 4547, 1772, 378, -344, 2768, -1406, -5930, -3612, -6062, -4412, -1546, -1615, -2976, -4543, -5089, -5232, -5785, -5825, -9964, -6911, -4623, -8144, -10870, -13064, -15283, -10319, -10228, -8415, -8307, -9446, -6909, -6820, -8023, -5536, -997, 2890, 4850, 6514, 5823, 2918, -3196, -2794, 304, -1306, -3348, 2451, 2263, -4434, -10873, -9523, -10484, -7643, -1930, -1066, -5001, -8802, -7114, -7201, -4776, -4179, -3257, 258, 1190, 476, -3520, -6768, -10554]
3072a0554K293J459O305J380j076n861k604m986j136J416M184K825l099j355k132
3057a2941k753M86P49L058O592L944J828K372j887K020j029o232n019K174J727
3042d911K978P41m261j682J778m467m506K339M405N387l789k334L426N880J776
3027B760l677m300k972K822K256l499m71J759J480j965L557j309r50k378J10j936
3011h713J970j185l477K118R087J329m99J012n526J478L57j9l249n26J785m442
2995h500n007M76M127M411j824N66M844O47n148k616l015m68M894K954M402P25
2979A468k48K505l256l115Q30K68k941l908Q50J373K262k103k587K110J346M338
2963h08L013r052j662M758L525m4L91n84k298J95l61R65l063o091K407J743j275
$$ y = [-10554, -8261, -6802, -497, 883, -193, -6054, -8658, -13644, -14780, -13364, -9180, -6355, -9454, -10809, -12941, -15694, -15208, -14459, -11401, -4809, -865, 963, 3335, 1448, 3468, 2439, -3793, -8812, -6638, -4911, -1933, -1192, -5453, -7135, -5357, -9824, -14330, -11991, -7586, -2199, -5988, -8322, -4896, 984, 2760, -917, -5217, -8189, -5367, -3111, -6610, -7081, -5322, -3842, -5807, -2250, -3559, -4509, -6887, -6777, -8713, -6743, -7928, -11405, -9287, -200, 1129, 630, 1642, -3884, -2406, -2049, -2068, -5317, -5843, -4058, -8500, -13507, -13031, -8904, -4493, -6317, -5751, -907, -260, -5408, -8024, -11039, -11507, -6613, -3659, 743, 1468, 1220, 3725, 469, -2646, -1816, -1548, -4489, -8397, -7547, -6174, -3912, -6015, -8602, -6492, -5146, -808, 2205, -6847, -8509, -3751, -226, -270, 121, -463, -2761, -2566, -2927, -1962, -5025, -11116, -8709, -6966, -8241]
2946h241J989L694M099r55l561k075k215K37K569M131N00O971L377J005l210k393
2930E922m14J149m114n766l979J368O077L260m846J70l131k762L33K54K255N79
2914c645j555r25K69k291j83N285O887j788m820m173k974M756O72j180L580M633
2898B548K016l251n305j21P81j469N242L389l483N994L401n29o618o131l511J433
2882e614J75q2N27k011J283L944L870p5k988j872n21m49k062k846M24K860j826
2865g263l328P957M290l337k931l346K787M497K548O28k237j295K424J137k194
2850C37k295K977l426m28N586J811j030k891J794k652n584J190J515j642J799
2835b939j363k606o58M032j206k901M94M245N01l022J531J475O815O4J346m207
$$ y = [-8241, -6252, -2558, 1541, 586, -2975, -5050, -7265, -7028, -4459, -328, 172, 7143, 10520, 11525, 8315, 5922, 5508, 6657, 2543, -3223, -7202, -5834, 243, 3503, -1343, -1173, -4304, -7066, -6733, -6479, -4224, -3645, -5200, -6125, -5856, -8147, -8330, -3045, 3842, 2054, -2766, -6939, -9913, -5157, -4485, -5665, -2085, 2548, 4564, 1313, -3992, -4113, -3332, -4801, 441, 3830, 347, 6341, 9742, 9213, 2595, -3536, -7047, -5614, -5439, -5521, -4994, -7005, -5722, -1778, 2092, 2017, -971, -2843, -3364, -3813, -5875, -8721, -8297, -5437, -7263, -10591, -2634, 1656, -1681, -4612, -7958, -5171, -674, 1874, 2502, 265, -1030, 1394, 2531, 337, -1958, 1019, -2407, -2835, 2751, 4562, 3532, 641, 2435, -217, -5801, -4611, -3096, -4738, -2939, -4302, -6908, -7566, -3534, -4740, -7641, -7147, -2902, -2401, -5423, -3892, -2417, 4398, 4462, 5808, 1601]
2819A601p292l976N29M382J983Q54n925l456L773J592k969K291L488L50m344k228
2803i347J299n795j989K187O805O490K610K37j885J90k476n995l581j58O919J973
2787b516l387j927J013J796L39p34K31k612j787p7K756J329M607L551K098k827
2771A853m746k974O039P85j649K147j493P38p80l415J69o00J057Q37L21Q23j394
2754b282n52K939N80j005P082O502l963j0478m016N47l420R44p29j182k268K465
2738h836M745K828L959l08n077l071K420k695j108K313o66j500N669J697l444
2723c074j907j12J886J900l736M797k103l871R17J52l437l235J287M771N145m400
2707e020m64Q159K944p104m081K680J945J353N393L669j643p122m146j25k333
$$ y = [1601, -5691, -9667, -9138, -4756, -2773, -1919, -7844, -11300, -7527, -5935, -8904, -6613, -3125, -2775, -7119, -9347, -8048, -13843, -15832, -13645, -6840, -350, 2260, 2497, 612, 802, -1674, -7669, -11250, -11408, -4489, -2516, -5903, -7830, -6817, -5021, -4682, -5416, -5185, -7797, -9584, -9661, -6905, -5576, -969, 2582, 4680, 1853, -2893, -5867, 172, 957, -692, 1455, -38, 700, -80, -3495, -3326, -3926, -2869, -2032, -1711, -888, -2282, -2834, 105, 685, -320, 6762, 13264, 9301, -1177, -5193, -4646, -8066, -7122, -7851, -9033, -11301, -8836, -4091, -1263, 2696, 2388, -2689, -5760, -3340, -6035, -7143, -4830, -5496, -6996, -1327, 370, -3074, -4981, -5093, -3207, -1307, -5043, -246, -2349, -6220, -5303, -5151, -8588, -11823, -10536, -5765, -620, -5020, -5484, 2675, 5619, -1485, -5566, -2886, -941, 412, 5805, 9474, 7831, 709, -3437, -3562, -5895]
2692e895k402j739K85Q45J836N244K186j184k339l048m083N411l07o26M086l900
2676e630l48L316K608k415J453L19K623J46j244j744k615k741N509L629N028j038
2660F856n414p14L655m449q45l380k189j647M052J778j7j043j173n024J282M593
2644c679k313L010P72m72K64j845l555J283J274l395J765L704m043l005K838M886
2628b511k416J238k266m151l763K014J103K634L58j270L020K920j251J128J495
2613a718k75J414j975l54r44J591K320k50k462j460k283M483L440J285j717l033
2597a938j28j827m490L054L657N86n29j458k737L532m33m113l837M427O610N101
2581E477n248k691N310L285l895j431N03L96P055M034K36o009k079m44N4n846
$$ y = [-5895, -8297, -10036, -9751, -8906, -7070, -1826, 360, -824, -3163, -6211, -10294, -4883, -5190, -5816, -1730, -5630, -5978, -2662, -54, -2469, -1016, -697, 1926, 2072, 828, -916, -3531, -6272, -763, 2866, 7894, 6856, 1442, 728, 4383, -66, -911, -4291, -6480, -8127, -4075, -2297, -2314, -3357, -4530, -9554, -8272, -3679, -5992, -2982, -2210, -2682, -2418, -4263, -7818, -6535, -5261, -8656, -6891, -3187, -7230, -10235, -7397, -2511, -4927, -3689, -5955, -10106, -13869, -11855, -10752, -8118, -7760, -9030, -6010, -3090, -4341, -3213, -1718, -1993, -579, -2554, -2908, -3852, -2261, 59, -191, -2653, -4113, -6396, -1913, 1527, 2812, 1095, -1938, -2066, -3893, -8383, -5329, -1672, -1086, -1615, -3073, -5810, -2278, -2711, -6824, -10661, -6234, 376, 5477, 229, -2462, 2848, 6133, 2238, 807, 1310, 1706, 8761, 12795, 13031, 7022, 4943, 4499, 4553, -1293]
2565a293p267l598M616Q493K96J837J146o76R93m197k875k632K683J624l158j426
2549e434l393j271J159N317N452K56m201Q38L834n24K060J930k920p475m443L127
2533e688N288J153O41o47N68R80K448k626l062j813N054K04n213J641K140j431
2517c63J466j818m92R29M460L172K189L028m22o66l512l058o845m765M595j836
2501c938L5P380L514k809m337Q0N151k376k033K849J941n371k801J769l221k84
2485d451M038J623J97m503K134K66k491r46l162K107O585O83K282K873L502l960
2469F777m344j05L984o181m452L843j345M257Q39m377k647l243k954k473k464
2454a4885P809O577M425J757m568l712J719J316n72P70l555j762K718Q22j024
$$ y = [-1293, -8560, -12158, -7542, 951, 1247, 3084, 4230, 3554, 4547, 350, -2525, -5157, -2474, -850, -4008, -5434, -8827, -10098, -8939, -3622, 1830, 2086, -2115, -1277, 2557, 2033, 4093, 6023, 3103, -4372, -8815, -5688, -400, 753, 1394, 747, 1315, 2295, 4743, 2117, -945, -2758, 2296, 2500, -2713, -1072, 1068, -363, 1103, -715, -1207, -278, 4182, 7354, 9543, 12571, 12149, 11483, 7971, 4913, -1932, -6697, -2102, -3938, -3903, 3477, 6991, 4182, -155, -75, 5076, 2700, 667, 3516, 5457, 86, -2715, -946, -4167, -4451, -413, 1210, 1407, -3096, -962, -696, -3187, -4133, -7295, -5188, 1397, 2080, 4362, 7235, 10737, 6777, 2433, 2328, 6312, 131, -4321, -478, -1823, 2434, 3273, -1104, -3751, -6994, -9948, -12421, -14885, -7076, -499, 3926, 5683, 1115, -2597, -878, 438, -134, 636, -2919, -4681, -1963, -1141, -2165]
2439b165m444K63J78K268J901j365j452L401R18L389J928m852m361N280J377K718
2423D982N18l1l136m246r63k400j777J104l94J188p42n36L101M48L365n73J035
2406I43K589Q0n032j001J783O658J36l762K331L56j785k036n583K274L544J263
2390B758m094p69M319J545l632k669K626k925m84l36K092j972j303N433J643j966
2374B66P32j049J048J399j262k603j37j715k112M677O024K58n575j510j828j885
2358e272j894k961N160M420l165o27N033l04k515J110K5l920k266M924J972K012
2342A732J066o648K348n06n314l13K932L426l37K047m539p95L335N036M706j768
2326F408n875o80l04j06L30K332r68n29k031k060R81k059j952K822J809J855J932
$$ y = [-2165, -6609, -6346, -6168, -3900, -1999, -3364, -4816, -1415, -497, 2892, 4820, -32, -4393, 887, 2264, 4982, 5500, 5469, 2333, -1913, -2876, -5276, -7053, -5949, -6343, -5155, -5897, -6433, -3332, -2884, 481, -92, 943, 3532, 3612, -1420, -2421, -638, 6020, 6156, 2394, 4725, 5081, 3296, 1260, -4323, -2049, 1495, 2758, -1336, -2105, 2214, 3759, 127, -2542, 84, -2841, -3325, -3661, -1569, -3541, -4844, 589, 2232, 266, 998, -51, 997, 2396, 1134, -1469, -1606, -3321, -5433, -756, 5268, 5526, -49, -1559, -3387, -5272, -7166, -10127, -4967, -547, -3712, -4339, 694, 390, -2125, -1015, -990, -4910, -7176, -2252, -280, 1732, 2798, -3850, -1502, -2008, -7322, -7635, -4703, -1277, -1614, 433, -4106, -4901, -1566, 3470, 8176, 6408, 533, -147, -451, -557, -227, 2105, 1137, 608, -1423, -3483, -2502, -4561, -6513, -3691, -1882, -27, 1905]
2309A905L313j131n748M000N89J469k089m940l805m080P57O356L027O575j984
2294D214j968L55k117l12m73j504j568l66k130L669j716j708m107K038M348R96
2278b349l129m18P709j341k52J288k371l225m711M853N883j118L86m691n403P120
2262a769J702q45m66L337K08J971l077j232j677J890l80k624j28l941L559j872
2246e344k170l90M894L057O970k229n448o64L023l477n679k302L982P03J950J034
2230b090J418K217J257L974k793J631j765j64J991L699p383k42j876l648l009
2215f783p61R53M040N140K977L856j88m967k768k598k946L588K979q50J939K902
2199F513n63k695j714l078k87k693L262J009j284P61o54l888k654K856K67l239
$$ y = [1905, 5218, 4087, -1661, 2339, 2928, 4397, 2308, -2632, -6437, -10517, -9760, -3404, -377, 6198, 4214, 2246, 2601, 484, 172, -301, -1805, -3373, -3739, -5869, -2200, -3916, -5624, -9731, -7693, -3345, -2349, -5478, -5896, 1813, 472, 220, 1508, -863, -4088, -8799, -3946, 1937, 819, 1205, -3486, -8889, -1769, -67, -912, -1378, 1959, 2167, 4138, 1061, -171, -1848, 42, -338, -2962, -3090, -7031, -3472, -5344, -7514, -7904, -3010, 47, 7017, 4788, -660, -1324, 1699, -1778, -7457, -9759, -5777, -5074, -3124, -2090, -672, 1545, 2802, 6776, 3983, 5614, 3849, 3685, 5676, 9375, 1992, 1750, -126, -3774, -6783, -7544, -6591, -2551, 2589, 5566, 9422, 9234, 4267, 1499, -1099, -4045, -457, 2522, 1672, 3611, 6513, 5950, 3255, 1541, -1537, -1824, -4517, -1255, -246, -1530, -769, -1423, -5311, -7965, -5109, -4842, -8081]
2183h081J149J520l737P604k198k161J631m075P81L418j57L085o91m912Q88r49
2167f885J63k413n590m460M706J0219O331K226Q57m306k166K654N129j110n786
2152d31k112m645J767L984L444o49j925n783P20M68j637r13O071J356L52j996
2136a929j637K90L974j910J129K588R75l077J676j672k037M940J712J155j914
2121D263m577k687Q3l183L09n29j305L159L851L958M04k42M51l55j488m352j809
2104d049J879M71m835J389K530m69K837L720K192k349k55L301j16j694k778L64
2088B138M37O89k752j586P20n158j871L666L603l26l16m893o908K296L04L030
2072f927L798j982l868j858J114l48r88J620l539j802o12P8N051K763L560Q191
$$ y = [-8081, -6932, -5412, -9149, -1545, -3743, -5904, -4273, -8348, -7567, -4149, -4306, -1221, -1912, -6824, -5936, -6885, -6722, -9135, -14725, -19185, -14479, -4260, 2071, 4297, 5154, 848, -1318, 1336, 6465, 5355, -431, -2543, -7188, -5421, -1437, 2007, 1358, -567, -6350, -5630, -5162, -6799, -7712, -1641, -285, 67, -1929, -3566, -3276, 698, -1212, -83, 2505, 3480, 403, 2079, 407, -1630, 3310, 5022, 6177, 4263, -314, -3001, -2918, -6101, -5792, -6321, -7626, -4467, -616, 3342, 3746, 3504, 3955, 3600, 2112, -2240, -4049, -2170, -1699, -6534, -5145, -2615, -3084, -247, 3473, 5665, 3316, 3061, 6362, 6246, 4552, 1774, 2138, 2575, 3264, 512, -1074, -354, -5512, -7383, -3717, -114, -440, -756, -5649, -12557, -10261, -9957, -6927, -3129, -5111, -8979, -10837, -9723, -10071, -11059, -9439, -12978, -14780, -15392, -15314, -10263, -7500, -3940, 4251]
2056D251N5k627j516l225j87j645k888j224l64m87N584N455K346k771m053J320
2040a976N040L322M29m544N63K226J268l646o231L959j080j240k75J263J144N995
2024F217J938M883j137j692l454l466n145P50K024L053o34l4q97k675j944M629
2008B416k171l860o82m60q12L477L206L759j008r25l226n794k194K627Q765K517
1992E635Q6n786n63l190l197n281K977M145M803M826q18m662K174m567K448N268
1976D298J156M436l561k311m860k737L440J34j085j099K953K422k76k912M38N011
1960E447q69j427J00m563n401N525L556n522L693K283r12K39j681Q62j612k94
1944e76j299m341k785K550N210K865K657J175J138N75j812k483R49J483Q31j121
$$ y = [4251, 4306, 1679, 163, -3062, -3249, -4894, -7782, -9006, -9370, -9857, -4273, 1182, 3528, 757, -3296, -1976, 3064, 6386, 6815, 2271, 2834, 5060, 6328, 2682, -3549, 410, -670, -1910, -2185, -922, 222, 6217, 8155, 13038, 11901, 10209, 6755, 3289, -1856, -1106, 918, 3971, 3337, 3303, 2406, -269, -2213, 2416, 245, -3615, -4297, -4757, -5569, -2092, 1114, 4873, 3865, 2940, -286, -6080, -8274, -5647, 3118, 5635, 5721, -65, -628, -3818, -7015, -12296, -9319, -5174, -371, 4455, 3637, -1025, 1149, -3418, -970, 4298, 5454, 9890, 6329, 4018, -842, -3579, -139, -5, -1090, -2189, 764, 3186, 2910, -2, 436, 5447, 4578, 3151, 3251, -1312, -6713, -1188, 2368, -3154, 539, 2822, 1910, 2149, 468, 1330, -282, -576, -1875, -6216, -9001, -6451, -1241, 1624, 4281, 5456, 6594, 7169, 5357, 2874, 3823, 5306, 6137, 5016]
1928E016l430J665j620n944o46L764O23j389j268m465N456K349L685n1l901m507
1912d663l545J239L472M583l8J625j889m095l86k045m69J79Q390N032k476p913
1896b999R91J289q39K313j405j13J175n675m526J184N949k691k513L438Q76L708
1880A62J200k32L470J598K4j156j354K524k168l281q48K249j178l320J30L604
$$ y = [5016, 1586, 3251, 1631, -4313, -4959, -1195, -572, -1961, -3229, -7694, -2238, 111, 3796, 3745, -156, -4663, -8208, -6969, -3497, 1086, 1048, 2673, 784, -3311, -3697, -5742, -6211, -6032, 2358, 7390, 4914, -2999, -2008, -719, -1558, 755, -650, -763, 412, -5263, -9789, -8605, -2656, -5347, -7860, -4422, -3546, 162, 1362, 1130, 4600, 6198, 6222, 5066, 3712, 6236, 4068, 787, -61, 2188, 1010, -2310, -2180, 1424]
$$ [...]
##END NTUPLES=NMR SPECTRUM
##END=
