##TITLE=Analysis number 323282
Compound Code cc 63602
Book Reference 470/121
Project Code adrs
Chemist Name mikem
##JCAMPDX= 6.0         $$ Bruker NMR JCAMP-DX V2.0
##DATA TYPE= NMR SPECTRUM
##DATA CLASS= NTUPLES
##ORIGIN= Bruker BioSpin GmbH
##OWNER= nmr
$$ XWIN-NMR		Version 3.5
$$ Fri Oct 20 12:03:54 2006 GMT Daylight Time (UT+1h)  MAYBRIDGE\nmr@NMR_250MHZ
##.OBSERVE FREQUENCY= 250.131544655141
##.OBSERVE NUCLEUS= ^1H
##.ACQUISITION MODE= SIMULTANEOUS (DQD)
##.ACQUISITION SCHEME= undefined
##.AVERAGES= 16
##.DIGITISER RES= 18
##SPECTROMETER/DATA SYSTEM= dpx250
##.PULSE SEQUENCE= zg30
##.SOLVENT NAME= CDCl3
##.SHIFT REFERENCE= (INTERNAL, CDCl3, 0, 16.4179)
##AUDIT TRAIL= $$ (NUMBER, WHEN, WHO, WHERE, WHAT)
$$ ##TITLE= Audit trail, XWIN-NMR		Version 3.5
$$ ##JCAMPDX= 5.01
$$ ##ORIGIN= Bruker BioSpin GmbH
$$ ##OWNER= nmr
$$ C:\u/data/dgb/nmr/ADRS/1040/pdata/1/auditp.txt
$$ ##AUDIT TRAIL=  $$ (NUMBER, WHEN, WHO, WHERE, WHAT)
(   1,<2006-10-20 12:03:32.75 +100>,<MAYBRIDGE\nmr>,<NMR_250MHZ>,
      <created by zg, POWCHK disabled, PULCHK disabled
       configuration hash MD5:
       49 4B E0 1D 92 C2 6B 37 9F E6 65 BC 52 41 86 1D
       data hash MD5: 64K
       09 87 3B BE EF 7B 9C 58 50 FF 39 DF 44 C5 7F 2B>)
(   2,<2006-10-20 12:03:45.17 +100>,<MAYBRIDGE\nmr>,<NMR_250MHZ>,
      <Start of raw data processing
       ef LB = 0.3 FT_mod = 6 PKNL = 1 SI = 32K 
       data hash MD5: 32K
       0E 34 80 9A 75 A4 5D A4 3D C6 67 8B D8 7E 0E 5A>)
(   3,<2006-10-20 12:03:46.92 +100>,<MAYBRIDGE\nmr>,<NMR_250MHZ>,
      <apk 
       data hash MD5: 32K
       63 58 48 A5 20 A0 18 D0 AB D3 33 9A 90 CF 64 67>)
(   4,<2006-10-20 12:03:47.62 +100>,<MAYBRIDGE\nmr>,<NMR_250MHZ>,
      <abs ABSG = 5 
       data hash MD5: 32K
       F7 9C C0 18 08 BF 5D A3 6A 42 D3 E6 A1 A1 CE EC>)
$$ ##END=
$$ 
$$ hash MD5
$$ 90 6F B1 FC 25 7F 61 8F 44 09 E0 81 8A 52 42 CB
##$RELAX= 
##$RELAX= 
##$RELAX= 
##$RELAX= 
##$RELAX= 
##$RELAX= 
##$RELAX= 
$$ Bruker specific parameters
$$ --------------------------
##$DU= <C:\u>
##$EXPNO= 1040
##$NAME= <ADRS>
##$PROCNO= 1
##$TYPE= <nmr>
##$USER= <dgb>
##$AMP= (0..31)
100 100 100 100 100 100 100 100 100 100 100 100 100 100 100 100 100 100 
100 100 100 100 100 100 100 100 100 100 100 100 100 100 
##$AQSEQ= 0
##$AQ_mod= 3
##$AUNM= <au_zg>
##$AUTOPOS= <8 >
##$BF1= 250.13
##$BF2= 250.13
##$BF3= 250.13
##$BF4= 250.13
##$BF5= 500.13
##$BF6= 500.13
##$BF7= 500.13
##$BF8= 500.13
##$BYTORDA= 1
##$CFDGTYP= 0
##$CFRGTYP= 5
##$CHEMSTR= <none>
##$CNST= (0..31)
1 1 145 1 1 1 1 1 1 1 1 1 1 1 1 1 1 1 1 1 1 1 1 1 1 1 1 1 1 1 1 1 
##$CPDPRG= <>
##$CPDPRG1= <>
##$CPDPRG2= <>
##$CPDPRG3= <>
##$CPDPRG4= <mlev>
##$CPDPRG5= <mlev>
##$CPDPRG6= <mlev>
##$CPDPRG7= <mlev>
##$CPDPRG8= <mlev>
##$CPDPRGB= <>
##$CPDPRGT= <>
##$D= (0..31)
0 1 0 0 0 0 0 0 0 0.06 0 0 0 0 0 0 0.0002 0 0 0 0 0 0 0 0 0 0 0 0 0 0 
0 
##$DATE= 1161342211
##$DBL= (0..7)
120 120 120 120 120 120 120 120 
##$DBP= (0..7)
150 150 150 150 150 150 150 150 
##$DBP07= 0
##$DBPNAM0= <>
##$DBPNAM1= <>
$$ [...]
##$SUBNAM7= <"">
##$SUBNAM8= <"">
##$SUBNAM9= <"">
##$SW= 20.6930455092707
##$SWIBOX= (0..15)
0 0 3 0 0 0 0 0 0 0 0 0 0 0 0 0 
##$SW_h= 5175.983436853
##$TD= 65536
##$TD0= 1
##$TE= 683.16
##$TE2= 300
##$TE3= 300
##$TEG= 300
##$TL= (0..7)
0 120 120 120 120 120 120 120 
##$TP= (0..7)
150 150 150 150 150 150 150 150 
##$TP07= 0
##$TPNAME0= <>
##$TPNAME1= <>
##$TPNAME2= <>
##$TPNAME3= <>
##$TPNAME4= <>
##$TPNAME5= <>
##$TPNAME6= <>
##$TPNAME7= <>
##$TPOAL= (0..7)
0.5 0.5 0.5 0.5 0.5 0.5 0.5 0.5 
##$TPOFFS= (0..7)
0 0 0 0 0 0 0 0 
##$TUNHIN= 0
##$TUNHOUT= 0
##$TUNXOUT= 0
##$USERA1= <user>
##$USERA2= <user>
##$USERA3= <user>
##$USERA4= <user>
##$USERA5= <user>
##$V9= 5
##$VALIST= <valist>
##$VCLIST= <CCCCCCCCCCCCCCC>
##$VD= 0
##$VDLIST= <DDDDDDDDDDDDDDD>
##$VPLIST= <PPPPPPPPPPPPPPP>
##$VTLIST= <TTTTTTTTTTTTTTT>
##$WBST= 1024
##$WBSW= 4
##$XGAIN= (0..3)
0 0 0 0 
##$XL= 0
##$YL= 0
##$YMAX_a= 607003
##$YMIN_a= -330218
##$ZGOPTNS= <>
##$ZL1= 120
##$ZL2= 120
##$ZL3= 120
##$ZL4= 120
##$ABSF1= 16.41794
##$ABSF2= -4.27523
##$ABSG= 5
##$ABSL= 3
##$ALPHA= 0
##$AQORDER= 0
##$ASSFAC= 0
##$ASSFACI= 0
##$ASSFACX= 0
##$ASSWID= 0
##$AUNMP= <proc_1d>
##$AZFE= 0.1
##$AZFW= 0.1
##$BCFW= 0
##$BC_mod= 0
##$BYTORDP= 0
##$COROFFS= 0
##$CY= 12.5
##$DATMOD= 1
##$DC= 0
##$DFILT= <>
##$DTYPP= 0
##$F1P= 14.0000005364418
##$F2P= -0.99999901652339
##$FCOR= 0.5
##$FTSIZE= 32768
##$FT_mod= 6
##$GAMMA= 0
##$GB= 0
##$INTBC= 1
##$INTSCL= 1
##$ISEN= 128
##$LB= 0.3
##$LEV0= 0
##$LPBIN= 0
##$MAXI= 10000
##$MC2= 0
##$MEAN= 0
##$ME_mod= 0
##$MI= 0
##$NCOEF= 0
##$NC_proc= -4
##$NLEV= 6
##$NOISF1= 0
##$NOISF2= 0
##$NSP= 0
##$NTH_PI= 0
##$NZP= 0
##$OFFSET= 16.41794
##$PC= 1
##$PHC0= -51.15774
##$PHC1= 5.515738
##$PH_mod= 1
##$PKNL= yes
##$PPARMOD= 0
##$PSCAL= 4
##$PSIGN= 0
##$REVERSE= no
##$SF= 250.13002602586
##$SI= 32768
##$SIGF1= 0
##$SIGF2= 0
##$SINO= 400
##$SIOLD= 32768
##$SREGLST= <1H.CDCl3>
##$SSB= 0
##$STSI= 32768
##$STSR= 0
##$SW_p= 5175.98343685301
##$SYMM= 0
##$S_DEV= 0
##$TDeff= 65536
##$TDoff= 0
##$TI= <Analysis number 999999
Compound Code 99
Book Reference 9
Project Code 9>
##$TILT= no
##$TM1= 0
##$TM2= 0
##$TOPLEV= 0
##$USERP1= <user>
##$USERP2= <user>
##$USERP3= <user>
##$USERP4= <user>
##$USERP5= <user>
##$WDW= 1
##$XDIM= 32768
##$YMAX_p= 369887638
##$YMIN_p= -151324
$$ End of Bruker specific parameters
$$ ---------------------------------
##NTUPLES= NMR SPECTRUM
##VAR_NAME=  FREQUENCY,     SPECTRUM/REAL,   SPECTRUM/IMAG
##SYMBOL=    X,             R,               I
##VAR_TYPE=  INDEPENDENT,   DEPENDENT,       DEPENDENT
##VAR_FORM=  AFFN,          ASDF,            ASDF
##VAR_DIM=   32768,         32768,           32768
##UNITS=     HZ,            ARBITRARY UNITS, ARBITRARY UNITS
##FACTOR=    0.157963299565203, 1,           1
##FIRST=     4106.61979445181, 0,            0
##LAST=      -1069.3636424012, 0,            0
##MIN=       -1069.3636424012, -151324,      0
##MAX=       4106.61979445181, 369887638,    0
$$ Real data points
##PAGE= N=1
##DATA TABLE= (X++(R..R)), XYDATA
$$ [...]
20122D03080L0449N4901J1313J4141K3092j3414J3735L4224N7274K5328J167K979
20110F58269O526P758l428m1102l2190n3135k7965L822j7379m2736p623j7901
20098D32916o414k2439q0927o7131l6751P761N796m7513m037P004k928j0073l7485
20085A37779o2041j3758L8393N080k1763j8856K825L4141L4608j5378m7814o058
20073F7158R260p573R425k3840j7179K1435J1731m062j3434L829J3128K0052K9028
20060A18958j1435j9275n1614J5496K6919k933j4032j5203J8908J467N913m5394
20048B7775Q335j0274J0495j2734k3745O234K3668L0886K0070n196j0696m4778
20036B0040Q795K8744K6783j3128O80J3440r1j4548P550K8193j5330o7152J779
$$ plain form
20122 403080 433529 488430 499743 513884 536976 523562 537297 571521 628795 654123 655290 658269
20110 658269 664795 672553 669125 628023 595833 542698 514733 518555 501176 458440 450817 432916
20098 432916 426502 404063 323136 256005 219254 227015 232811 185298 181261 188265 185337 175264 137779
20085 137779 75738 61980 100373 105453 83690 64834 67659 101800 136408 121030 73216 67158
20073 67158 76418 68845 78270 54430 37251 58686 70417 66355 52921 56750 69878 89930 118958
20060 118958 107523 88248 36634 52130 79049 76116 62084 46881 65789 67256 73169 27775
20048 27775 36110 25836 36331 23597 -148 6086 29754 60640 80710 75514 64818 20040
20036 20040 28835 57579 84362 71234 71914 85354 85263 70715 78265 106458 91128 23976 25755
20023B5755j0418R04L9613o589M437O036M8649N181j7499l3281N373K9826R693
20010A07680j0044J5233k784L536m716l6402K1396K4828j347p459M0453L114k9789
19997A23699K1204J7794j1040K1762P183K9659K5280N3188J9717M0625K2713l9350
19985C32434J0403L2278J5739O002R90k6001j1345L3684J667j4111j6791j8664
19973C46285K652k991l395P858j8919k5008k0544l5046m6986l0595K1028K0131
19961B14470k742m7281m3503k4823J6209N9163J9876P435l1140j6302k2883r794
19949A18685P203J4766J940J1240p65L2376O3564M62o7452m3650N7303Q4022N6627
19936C36321P927j5560j485M1062L3435L027m4183P600L9547K7700j7842J426
$$ plain form
20023 25755 15337 16241 55854 49265 53702 59738 108387 113568 96069 62788 68161 97987 107680
20010 107680 97636 112869 110085 113621 108905 72503 93899 118727 117380 109921 150374 153488 123699
19997 123699 144903 162697 151657 173419 180602 210261 235541 288729 308446 349071 371784 332434
19985 332434 342837 375115 390854 396856 397846 371845 360500 394184 395851 381740 364949 346285
19973 346285 348937 345946 342551 350409 331490 306482 285938 250892 203906 173311 194339 214470
19961 214470 211728 164447 120944 96121 112330 171493 191369 198804 167664 151362 128479 118685
19949 118685 125888 140654 142594 153834 153069 185445 249009 249471 182019 138369 195672 279694 336321
19936 336321 344248 328688 327203 368265 401700 404727 360544 368144 407691 435391 417549 418975
19924D18975n507j3895k1476R83k7687k7404l500j1904o7862k8261m5606k7318
19912A39538m426j9406L7719P089r270K4236R736J2672l5909n5634l6127o695
19900F3523K0303K7050r711j6730J1718J7495K9645o2830l3530J7563L1330J2065
19888A07891k2316J4848l812j4097J1593M7796P964j0757l891J3002P834L2486
19876A88541j8233j5555J7199m888n073l988m766m854j6827J1211J149j0816m0380
19863I2720K8676O3843P3065K343j6712l0950Q876M3828R43j7363K241Q575L5771
19850B95856R661n1694l4603O995R542n015j1916L3578m2905l5118l1101M475
19838A47755K9578j6972l6023l2356j93M5411o989j0676J446K2639K3725j1200
$$ plain form
19924 418975 413468 399573 378097 379080 351393 323989 320489 308585 240723 212462 166856 139538
19912 139538 135112 115706 153425 160514 151244 175480 185216 197888 161979 106345 70218 63523
19900 63523 83826 110876 101165 84435 96153 113648 143293 80463 46933 64496 95826 107891
19888 107891 85575 100423 96611 82514 94107 141903 149867 139110 135219 148221 156055 188541
19876 188541 170308 154753 171952 167064 161991 158003 153237 148383 131556 142767 143916 133100 92720
19863 92720 121396 185239 258304 260647 243935 212985 221861 265689 266632 249269 251510 260085 295856
19850 295856 305517 253823 219220 226215 235757 230742 218826 252404 209499 174381 143280 147755
19838 147755 177333 160361 124338 91982 91789 137200 130211 119535 120981 143620 167345 156145
19826A56145k0299m8836k658L2020J0223j8995k4040m2181l751K112K3332N8920
19814A21992Q589l2731j0827J4533j1867N620J4507R023L7143J5364L024R604
19802A83974k9633m5406k103j1172k9885K2389L0621L0035k442l2876K4104K2480
19790A60086J1209k4224m727j0318k0412J4742Q274k3478K1399K0383k334l3889
19778A16711J2153K3305M6299J2693R192j0814N643j8985k229K3163m451J7835
19766B30515K3956J4286O7529N4103L9385J5750J3750Q652J2072n158L5196K9389
19754E39425L0697K4252L9460M4851K4735M0418P4079L9245L5931J0938k1301
19743H82730k5919j8327k6792k6188m6031q223J2077k6879j7598l6450j6438R808
$$ plain form
19826 156145 135846 87010 84352 116372 126595 107600 83560 41379 37628 39740 63072 121992
19814 121992 130581 97850 87023 101556 89689 95309 109816 118839 155982 171346 174370 183974
19802 183974 154341 108935 106832 95660 65775 88164 118785 148820 146378 113502 137606 160086
19790 160086 171295 147071 142344 132026 111614 126356 134630 111152 132551 152934 150600 116711
19778 116711 128864 152169 198468 211161 220353 209539 215182 196197 193968 217131 212680 230515
19766 230515 254471 268757 336286 390389 429774 445524 459274 467926 479998 474840 510036 539425
19754 539425 570122 594374 633834 678685 703420 743838 817917 857162 893093 904031 882730
19743 882730 856811 838484 811692 785504 739473 731250 743327 716448 698850 662400 645962 655770
19731F55770j7495l5686j4887l0093n4658J6063l092k5430k2460K4713j2274j1955
19719D68516J446K5845p285m1878L626K3633j6583k4683j4472K3012J1526k4329
19707D28374k5533m561J68m1703o898j6326l5068J2212K4697K2981R04Q189K1190
19694C88626q582k771N300k9655k7239L1387N262M585m1747k5827R501n414J6488
19681C19914L9782J4536J7386L2487j233K0235M2385J7647J2750L7704p336J1101
19669E57358L2136O944L7909N6550M6730L5968M298J8564P645J8076K2404j014
19657H43568j646K2361M3435J7958M2547K854l2487j3759L1315J5357M2184N8400
19645A072087L8016N8649N6369P6346J03679N2445N5325Q3643J69395J68533J73875
$$ plain form
19731 655770 638275 602589 587702 557609 502951 519014 515922 490492 468032 492745 480471 468516
19719 468516 469962 495807 488522 446644 450270 473903 457320 432637 418165 441177 452703 428374
19707 428374 402841 398280 398448 356745 349847 333521 298453 310665 335362 358343 359247 367436 388626
19694 388626 380044 377273 382573 352918 325679 357066 362328 366913 325166 299339 308840 303426 319914
19681 319914 359696 374232 391618 424105 422872 443107 485492 503139 515889 553593 546257 557358
19669 557358 589494 596438 634347 690897 737627 773595 777893 796457 804102 822178 844582 843568
19657 843568 841922 864283 907718 925676 968223 971077 938590 924831 956146 971503 1013687 1072087
19645 1072087 1110103 1168752 1225121 1301467 1405146 1457591 1512916 1596559 1765954 1934487 2108362
19634B108362K24750K43754K97871L03521L04161L37539M34786M61645N26655
19625E243044O35444P66029Q68974J094080J393108J721001K307028K981501L692069
19616B0702278M459285N035751N008215N147380N804154N925446M429862K496536
19608E9008907L107410M579077L936265L010648M357417N886910O060015O003173
19600I5949822O797192N891159J836622j075882l51238o72581m377706o725454
19592I7271934n172597l444239l461326l097947j911252k141684m464651m605818
19584F8972420l284009m416729p196201p678446o257700n211415n271139n016241
19576B4640540m058376l103604k375357j899538j632487j371807j101237r68364
$$ plain form
19634 2108362 2333112 2576866 2874737 3178258 3482419 3819958 4254744 4716389 5243044
19625 5243044 5878488 6644517 7513491 8607571 10000679 11721680 14028708 17010209 20702278
19616 20702278 25161563 30197314 35205529 40352909 46157063 52082509 56512371 59008907
19608 59008907 62116317 66695394 70631659 73642307 77999724 83886634 89946649 95949822
19600 95949822 102747014 108638173 110474795 109398913 109047675 108375094 103997388 97271934
19592 97271934 92099337 88655098 85193772 82095825 80184573 78042889 73578238 68972420
19584 68972420 65688411 61271682 54075481 46397035 40139335 34927920 29656781 24640540
19576 24640540 20582164 17478560 15103203 13203665 11571178 10199371 9098134 8129770
19568H129770q39568p25660o08394n36716n02602l97476l71521l14216k88860
19559C544757k61061k18341j59600j37740j17909o8813j04689j05894r7430m8692
19549B224588o00n5001n4424l9133k7788k2838m2990n5069q2875r0483l6150j9679
19537A697558n5410k7607j0835j7357n1626k5179n2317l4481l4742K652k0175
19526A370481j5864L6691M2424P3667R3214R8425Q0154Q1588J41791P9042M1200
19515B122813M3152O6578Q810M7669J01817J59623K03312J71500K07034K35523
19505C367831J18739N7154R3483M4744n2522j6694L6441M9791L9057O8579J44662
19494C951265K05137J40218J52551K03178J81716J48475J11557J04087J06663
$$ plain form
19568 8129770 7290202 6564542 5956148 5419432 4916830 4519354 4147833 3833617 3544757
19559 3544757 3283696 3065355 2905755 2768015 2650106 2581293 2476604 2370710 2273280 2224588
19549 2224588 2223988 2168987 2114563 2075430 2047642 2024804 1981814 1926745 1843870 1753387 1717237 1697558
19537 1697558 1642148 1614541 1603706 1586349 1534723 1509544 1457227 1422746 1388004 1390656 1370481
19526 1370481 1354617 1391308 1433732 1507399 1600613 1699038 1779192 1860780 2002571 2081613 2122813
19515 2122813 2165965 2232543 2241353 2289022 2390839 2550462 2753774 2925274 3132308 3367831
19505 3367831 3486570 3543724 3637207 3681951 3629429 3612735 3649176 3698967 3738024 3806603 3951265
19494 3951265 4156402 4296620 4449171 4652349 4834065 4982540 5094097 5198184 5304847
19485E304847J60224K34118K39366L49374N43380P24570Q37114J109444J562054
19476A1064491K092174K794310L575138M377933N030878M712756L984193L913962
19468D1545835K770128O53838J007242K186646K266655J976138K507514L103380
19460E8017376J294956j003890j205116j394242k536549l769141k857922j423623
19452D5121849j130762j487617j324961j052020k634334m573423m213228l959270
19444B4746234m088002l458853k486510j765554j321846j017665p54822n42422
19436I310560l73846k42200j41858N898J77561L93355N25695Q25118J162337J632699
19426A3275319K246851L123878M037303M891964N512513N070304M389537M318460
$$ plain form
19485 5304847 5465071 5699189 5938555 6287929 6831309 7555879 8392993 9502437 11064491
19476 11064491 13156665 15950975 19526113 23904046 28934924 33647680 37631873 41545835
19468 41545835 44315963 44969801 45977043 48163689 50430344 52406482 54913996 58017376
19460 58017376 59312332 58308442 57103326 55709084 53172535 49403394 46545472 45121849
19452 45121849 43991087 42503470 41178509 40126489 37492155 32918732 28705504 24746234
19444 24746234 20658232 17199379 14712869 12947315 11625469 10607804 9852982 9310560
19436 9310560 8936714 8694514 8552656 8558554 8736115 9129470 9655165 10480283 11642620 13275319
19426 13275319 15522170 18646048 22683351 27575315 33087828 38158132 42547669 46866129
19418D6866129K806197N69146J263974K385822K285784K169987K968360L400285
19410F4715684J268422r15078j244338j471881k746043m182558l040000j519453
19402E0864755j390728j789721j507713j388869l480980n269231m898607m762826
19394B6376080m789730l996146l002500k223764j698383j310084j118950r43407
19386G293116q53319p17042n77436n03315m23815l90055l46692k77479k57865
19377B946098k45703j85666j35236j66250j75379j32101j03803j02322q0178p1628
19367A547832o9334j05128p7281k9054n1811l9357l8182k2399n0581R367k8512
19356A045560o247k6065R924j0435J236P8127P3802L5405K7351R634K2803n542
$$ plain form
19418 46866129 49672326 50241472 51505446 53891268 56177052 58347039 61315399 64715684
19410 64715684 65984106 65069028 63824690 62352809 59606766 55424208 52384208 50864755
19402 50864755 49474027 47684306 46176593 44787724 41306744 36037513 31138906 26376080
19394 26376080 21586350 17590204 14587704 12363940 10665557 9355473 8236523 7293116
19386 7293116 6439797 5722755 5145319 4642004 4218189 3828134 3481442 3203963 2946098
19377 2946098 2700395 2514729 2379493 2213243 2037864 1905763 1801960 1699638 1619460 1547832
19367 1547832 1478498 1373370 1296089 1267035 1215224 1175867 1137685 1115286 1064705 1074072 1045560
19356 1045560 1039313 1013248 1023172 1012737 1013973 1092100 1165902 1201307 1228658 1238292 1261095 1255553
19344A255553j4195K9891J9347L9861P3711K953j8031K6413n2148o2483n5969
19333A244903j00829q1987Q915R161l8485m6838l8127l6810l2945k8715o4065
19322G94178r0888k7536k9662m0821m4096o1550l8642k0963M0188J0836m1144
19311D49900j6919J5000K8055J858K5207J2068j100J8288K2589O5923M8983M4365
19299G14217L4274L4796L3318O3408L2734K0507M9660P3732Q1050M4494k4335
19288A157855k4878O022p0220q1293k2659Q656J0782j3137j2539j0510m8138q5452
19276H14489p5500q1158r0048n7387n8374j9425l4912Q409J7113K520r506n2975
19264C63246m4435q737J491j0446m3458l2999k4853K8881n218j6876j5299k1986
$$ plain form
19344 1255553 1241358 1271249 1290596 1330457 1404168 1407121 1389090 1415503 1363355 1300872 1244903
19333 1244903 1144074 1062087 1071002 1080163 1041678 994840 956713 919903 886958 858243 794178
19322 794178 703290 675754 646092 605271 561175 499625 460983 440020 480208 491044 449900
19311 449900 432981 447981 476036 477894 503101 515169 514069 532357 554946 620869 669852 714217
19299 714217 748491 783287 816605 880013 912747 933254 982914 1056646 1137696 1182190 1157855
19288 1157855 1132977 1138999 1068779 987486 964827 973483 984265 971128 958589 948079 899941 814489
19276 814489 738989 657831 567783 510396 452022 432597 397685 406094 423207 425727 416221 363246
19264 363246 318811 310074 311565 301119 257661 224662 199809 228690 223472 206596 191297 169311
19252A69311q43j8598o521j3367R488L1742O868r619l1370l1018L2209J6452N896
19239A60630N661r5P667r578q311j2831J2079o817O702J0699q489K926K4000J5442
19225A99685J4782k466J2533k5009j3755M247K811M6610J1562l4464L486J5977
19213B35999M376Q820r951l4676J5353K6204p146m9913K3978j5157m7653o433
19201A43801K0218k80p274m757Q799J9990j9992j5086j2604K896l797J8856q131
19188A42639m213N8223K9623j4223k4248n082j1351J3960K8919N2483L7705J0621
19176C15056k2089k3551k1798j1262K1212O8723L447k3702l0290l9813L0746K7886
19164B94565N058n873m1771l1076j69l155K5343Q288k2746m8967P365j497n510
$$ plain form
19252 169311 168468 149870 143349 129982 139470 171212 178080 168461 137091 106073 138282 154734 160630
19239 160630 166291 166196 173863 164285 155974 143143 155222 148405 155107 165806 157317 160243 184243 199685
19225 199685 214467 212001 224534 199525 185770 190017 192828 239438 251000 216536 220022 235999
19213 235999 240375 249195 239244 204568 219921 246125 238979 189066 213044 197887 150234 143801
19201 143801 164019 163739 156465 151708 160507 180497 160505 145419 132815 135711 131914 150770 142639
19188 142639 138426 196649 226272 212049 187801 182719 171368 185328 214247 266730 304435 315056
19176 315056 292967 269416 247618 236356 257568 326291 329738 306036 275746 235933 266679 294565
19164 294565 299623 293750 251979 220903 220734 217579 242922 251210 228464 179497 186862 185365 179855
19151A79855N536M931J067K3409N137j4015P63M560J0884J6702R132M1073Q7424
19138C76458M2990p299k8637j0190m645p8570O797J9840k5554k5104j2946k3174
19126B29966l985n04J7923j0918j0487n3171k113K4486M1543J7151m0876m7849
19114A61166p368r127l4144p372N9507K1889J5847K7336J6347O703L3300L3147
19102C17231M897J0279j3498J5702P2221N2181N2831P0532R9838Q7245J05474
19091H74933J37928J18043O3489P873L2327j7788n1017o0242m6615k8716J4172
19080A044387K2170Q017o6813m4677L79J7932n6683k7520k5579n3805p9965j0642
19068G27201K338k7920n0996l5099J6449k893q0798p4830k3692o637K3702j7115
$$ plain form
19151 179855 185391 190322 191389 214798 219935 205920 206683 211243 222127 238829 247961 289034 376458
19138 376458 419448 412149 383512 373322 368677 290107 296904 316744 291190 266086 253140 229966
19126 229966 225981 225477 243400 232482 221995 168824 166711 191197 232740 249891 209015 161166
19114 161166 153798 144671 110527 103155 162662 184551 200398 227734 244081 250784 284084 317231
19102 317231 322128 332407 318909 334611 406832 459013 511844 582376 682214 769459 874933
19091 874933 1012861 1130904 1194393 1202266 1234593 1216805 1165788 1105546 1058931 1030215 1044387
19080 1044387 1066557 1074574 1007761 963084 963463 981395 924712 897192 871613 817808 737843 727201
19068 727201 729539 701619 650623 615524 631973 629080 548282 473452 449760 443123 466825 449710
19056D49710k5237j9469k3714J8299K3861Q954q312J2495K4589K2124J5220L0498
19044E29018L4408M0002O8094N0163L924l2165q345J636J0202l6137l4661m7401
19032E78738m1301j1362n540l7964J1533J4373K3379j2109j6585L0128K0481j4809
19020E38962L259P141K1198K5050K2594J235j5024m991M6377L2475O75j7406N2364
19007G13909N1972O5443M2257L2389N8948Q2871M6188O5925J11522J56268J29065
18996A556757J22177J66496J69914J38536J86977K30846K43879L08391L74827
18987C498800M27702N34943N97127P57963R80473J337545J744906K242883K761109
18978A4883451L258430L528806L152657K915536L517678M009506L056123J301606
$$ plain form
19056 449710 424473 405004 381290 399589 423450 432404 424092 436587 461176 483300 498520 529018
19044 529018 563426 603428 671522 721685 725609 693444 685099 686735 696937 660800 626139 578738
19032 578738 537437 526075 520535 482571 494104 508477 531856 519747 503162 533290 553771 538962
19020 538962 542221 549362 570560 595610 618204 619439 604415 599424 645801 678276 678951 661545 713909
19007 713909 765881 831324 873581 905970 964918 1047789 1093977 1159902 1271424 1427692 1556757
18996 1556757 1678934 1845430 2015344 2153880 2340857 2571703 2815582 3123973 3498800
18987 3498800 3926502 4461445 5058572 5816535 6797008 8134553 9879459 12122342 14883451
18978 14883451 18141881 21670687 24823344 27738880 31256558 35266064 38322187 39623793
18970C9623793J861127K926517K629451K111676K399516K033953j89520j029428
18962E2367085K56577O8963k201736k861190k024131j958891k349519j935365
18954C9361793j464088k877092m338801l559218k633076k640668l115377k853979
18946A5879494k135676j512415j045195p53391n49325m02656k58802m4273J62780
18937I340541L26224M89988Q18928J224924J728131K353687L086383L750577M311732
18928B7431115M356194L768319L937439M814966M899153K653311J332155K776068
18920E5968720L605053K962315K594881K938730J540756j068897n75081P05179
18912F8671656j138608l936572l584016k558829k883458l159720k412669k618664
$$ plain form
18970 39623793 41484920 44411437 47040888 49152564 51552080 53586033 53396513 52367085
18962 52367085 52623662 52692625 50490889 47629699 45605568 43646677 41297158 39361793
18954 39361793 37897705 35020613 30681812 27122594 24489518 21848850 18733473 15879494
18946 15879494 13743818 12231403 11186208 10432817 9883492 9480836 9222034 9177761 9340541
18937 9340541 9666765 10156753 10975681 12200605 13928736 16282423 19368806 23119383 27431115
18928 27431115 31787309 35555628 39493067 44308033 49207186 51860497 53192652 55968720
18920 55968720 59573773 62536088 65130969 68069699 69610455 68541558 67966477 68671656
18912 68671656 67533048 63596476 60012460 57453631 54570173 51410453 48997784 46379120
18904D6379120m890630n413111m161835l389892l792479m116560l509314k622938
18896A4482361j939663j486515j208595j002184p93532o58084o41499o09605m86936
18887E655748l84841l25371k44464j89841k02402j41087j72500j74268j95336
18878C625638j76659k71715k34001j59876j38067j19980j30860p3817j09986j62328
18868B048349j49673j24443j58473j25830p8647l0819j2972M627k4623j7019j2506
18857A317971k1003l182J4641M0466K3211L210k8567J854J8422M2299N9191N6888
18845A525401R4570Q3477L7078N7815O9775j9219O62J5596l8528J6740N2632Q2964
18833A978963M6155p6776n5929j9644o0856r4463m2756o3049m7487k9200l2604
$$ plain form
18904 46379120 41488490 36075379 31913544 28523652 24731173 20614613 17105299 14482361
18896 14482361 12542698 11056183 9847588 8845404 8051872 7393788 6752289 6142684 5655748
18887 5655748 5270907 4945536 4701072 4511231 4308829 4167742 3995242 3820974 3625638
18878 3625638 3448979 3177264 2943263 2783387 2645320 2525340 2394480 2320663 2210677 2048349
18868 2048349 1898676 1774233 1615760 1489930 1411283 1380464 1367492 1372119 1347496 1330477 1317971
18857 1317971 1296968 1293786 1308427 1348893 1372104 1375314 1346747 1348601 1367023 1409322 1468513 1525401
18845 1525401 1619971 1703448 1740526 1798341 1868116 1848897 1849559 1865155 1826627 1843367 1895999 1978963
18833 1978963 2025118 1948342 1892413 1872769 1811913 1717450 1674694 1611645 1564158 1534958 1502354
18822A502354l7810p9491j17926q9711r3948r5417j08087r7042p9004m5487m8240
18811F10191j9986K490n3963j0717Q860o991k7105j8593j5079k1698k8492j937
18799D16980J7130l8540o649O684l8074j1705K8203K2829O709N0093P205j8121
18787D42744M6266J6894L3535j5502k5468J5568L1528M0348K8505J9486K5009
18776F58913N6695N7540N3341P7217O0138P9893O6553R9554P0375N8569k6278
18765A312510r0009l1748m635J5006K6227L4623P993K8534J3836k6506l5641n5482
18753A194708r1648o7207q6667l4138k6997k4316n5051m1831n8089m0399o3405
18742F04960j3413J19m075k4956j3311o446l337k3145l3385p936O0068N0940Q7142
$$ plain form
18822 1502354 1464544 1385053 1267127 1177416 1083468 988051 879964 782922 703918 658431 610191
18811 610191 590205 592695 538732 528015 536875 529884 502779 484186 469107 447409 418917 416980
18799 416980 434110 395570 388921 395605 357531 345826 374029 396858 403567 453660 460865 442744
18787 442744 489010 505904 539439 523937 498469 514037 545565 585913 614418 633904 658913
18776 658913 715608 773148 826489 903706 963844 1043737 1110290 1209844 1280219 1338788 1312510
18765 1312510 1222501 1190753 1186118 1201124 1227351 1261974 1269967 1298501 1312337 1285831 1250190 1194708
18753 1194708 1103060 1035853 949186 915048 888051 863735 808684 766853 708764 668365 604960
18742 604960 591547 591666 587591 562635 549324 542878 539541 516396 483011 475075 535143 586083 673225
18729F73225Q2240L4636K3345K1638M1904Q1180O4387P9561K9080P9542N8855
18718A269593L8793P2682J07058Q3181L2781R5838R9489J6657n1868q7857q3324
18707A593023m6866k8494l0915o4912j6126K0650J5802n8202j37175j15277j08671
18696A022837j02780q3377o2793n4775j0171k5251l3756J3042J635m197k6606
18685F33808j7658k7569j5435O379j880M6151K5393O357K6314k2358l2634L5935
18673F62803M1367J7159N4115L3675O5503Q9748N8745L9184m781n0955k8154J3817
18661I92226l1934l330L2030L745M0002O1694L2655L6645J5613K2354P7023O6678
18649A345401J11380J80640J86827J39157R7954J17713R0377N9958J16966Q7827
$$ plain form
18729 673225 755465 790101 813446 835084 876988 958168 1022555 1102116 1131196 1210738 1269593
18718 1269593 1308386 1381068 1488126 1571307 1604088 1699926 1799415 1816072 1764204 1676347 1593023
18707 1593023 1546157 1517663 1486748 1421836 1405710 1426360 1442162 1383960 1246785 1131508 1022837
18696 1022837 920057 836680 773887 719112 708941 683690 649934 662976 664611 660414 633808
18685 633808 616150 588581 573146 579525 577645 623796 649189 655546 681860 659502 626868 662803
18673 662803 704170 721329 775444 809119 874622 964370 1023115 1062299 1057518 1006563 978409 992226
18661 992226 960292 956962 988992 992737 1032739 1094433 1127088 1163733 1179346 1201700 1278723 1345401
18649 1345401 1456781 1637421 1824248 1963405 2061359 2179072 2269449 2329407 2446373 2534200
18639B534200J23019J91963K27669K84541L85868N09829N94710O74369Q20998
18630F347166J038019J359537J788085K429301L295444M577805O200148P983008
18622C5018513R538189J0050135Q948771O325515J787885j818615m887889p934611
18614E7027893r818609r317542p762379n699863m121265l073131k410308j967604
18606A2857192j676031j361668j054813q32180n94835l48363k39470j26077l2252
18597F591503R105O1413p193o6927j11689q5168o8331n9166l23J21557K80147
18586F664928M75561N84454P47049R88244J246173J565508K027225K720410L661625
18577B0681177N039439O953154R408003J2201540J4742094J5953795J4953943
$$ plain form
18639 2534200 2657219 2849182 3076851 3361392 3747260 4257089 4851799 5526168 6347166
18630 6347166 7385185 8744722 10532807 12962108 16257552 20835357 27035505 35018513
18622 35018513 44556702 54606837 63555608 69881123 71669008 69850393 64962504 57027893
18614 57027893 47209284 37891742 30129363 24429500 20308235 17235104 14824796 12857192
18606 12857192 11181161 9819493 8764680 7932500 7337665 6989302 6749832 6623755 6591503
18597 6591503 6600608 6662021 6654828 6587901 6476212 6391044 6322713 6263547 6263224 6384781 6664928
18586 6664928 7140489 7724943 8471992 9460236 10706409 12271917 14299142 17019552 20681177
18577 20681177 25720616 32673770 42081773 54283313 69025407 84979202 99933145
18570I9933145J1115950N222788j364059o740435j1732254j4967008j5506746
18563F5961381j3557196j0585204p667425n626649m331598l447899k805399k362933
18555A5577078j931203j544398j224341q84390o49382m87881m28733l32372k90998
18546G803380l16447l49417l79918l60684l02398l30787k92508k44966j39429
18537E086826l7517P9227J91274K83970L20461M87595O55754R40958J362320J909573
18527A1280441K649281L688062M852091O062992O908329O698135N386727K689520
18519E0215578k82856k573053m658869o618934o786018o064210m673572l388805
18511A5169261k483788j878517j500169j251686j028727q54096o80225n50080
$$ plain form
18570 99933145 111049095 116271883 114907824 108167389 96435135 81468127 65961381
18563 65961381 52404185 41818981 34151556 28524907 24193309 20745410 17940011 15577078
18555 15577078 13645875 12101477 10877136 9992746 9343364 8855483 8426750 8094378 7803380
18546 7803380 7486933 7137516 6757598 6396914 6094516 5763729 5471221 5226255 5086826
18537 5086826 5049309 5128536 5319810 5603780 5924241 6411836 7067590 8008548 9370868 11280441
18527 11280441 13929722 17617784 22469875 28532867 35441196 42139331 47526058 50215578
18519 50215578 49932722 47359669 42700800 36081866 29295848 23231638 18558066 15169261
18511 15169261 12685473 10806956 9306787 8055101 7026374 6172278 5492053 4941973
18503D941973m24700l33273k34585k02230j83819j63326j34293j34284j30168
18494C001295r3808p5478p1400n1160k0962j12675j34582j65178j78927j83767
18484A913358j77295j66014j24852m2775r2616n4320l0245m1924k8743o1157r102
18473A084315m4129j0639K6492L0355k124J3723M1493M0110L2045M5864L6260
18462A293765N7442O0634M1815p743J6977K012j5289n6766o6007k1007K0165N906
18450A331904K6131M4251R8616J13114J26249J39973J22669J50415J34586R3890
18440B381798O326p3961j02552j64124k05266k21297j77342j37190j28778j16466
18430A061148m1319q399l4893n5490m9590j8327k3101J9236L1073M1260P7138
$$ plain form
18503 4941973 4517273 4184000 3949415 3747185 3563366 3400040 3265747 3131463 3001295
18494 3001295 2907487 2832009 2760609 2709449 2688487 2575812 2441230 2276052 2097125 1913358
18484 1913358 1736063 1570049 1445197 1402422 1309806 1255486 1225241 1183317 1154574 1093417 1084315
18473 1084315 1040186 1029547 1056039 1086394 1084270 1097993 1139486 1179596 1211641 1257505 1293765
18462 1293765 1351207 1411841 1453656 1445913 1462890 1464902 1449613 1392847 1326840 1305833 1325998 1331904
18450 1331904 1358035 1402286 1500902 1614016 1740265 1880238 2002907 2153322 2287908 2381798
18440 2381798 2388124 2314163 2211611 2047487 1842221 1620924 1443582 1306392 1177614 1061148
18430 1061148 1019829 1011430 976537 921047 871457 853130 830029 849265 880338 921598 998736
18419I98736R1976N1978R7530J52002J09996O1826R3100M6645m1240l3730p0230
18408A558589p7642o7195m9496n2611o795K2223J555o2100q3743n8329j5107K9672
18396A139021J6867J7098P6845P7692J24n5496m2049j05574p4694p0639p8221
18385I00974o5785l3448m7566n2293k0962k4001k0562K4088q636J6860K1665n328
18373F85006L4161M8874L1175L3355K0834K6203P4390O4173N1160O8662K4074
18362A162067L7375M1257n1383j21505n6024j1931j05747o2379o1428o1977k9801
18351F78524m0757l6729J258K1354p372m339n747j3187m9818l9049N479J3811
18339E23428J4436M0167M4981N1173N661k6992j7596k5386N551L4474M3775K0224
$$ plain form
18419 998736 1090712 1142690 1240220 1392222 1502218 1564044 1657144 1703789 1662549 1628819 1558589
18408 1558589 1480947 1413752 1364256 1311645 1304850 1327073 1328628 1266528 1182785 1124456 1109349 1139021
18396 1139021 1155888 1172986 1249831 1327523 1327647 1272151 1230102 1124528 1049834 979195 900974
18385 900974 835189 801741 754175 701882 680920 656919 636357 660445 651809 668669 690334 685006
18373 685006 719167 768041 799216 832571 853405 879608 953998 1018171 1069331 1137993 1162067
18362 1162067 1199442 1240699 1189316 1067811 1011787 999856 894109 831730 770302 708325 678524
18351 678524 637767 601038 602296 623650 616278 611939 606192 593005 543187 504138 509617 523428
18339 523428 537864 578031 623012 674185 679846 652854 635258 609872 615423 649897 693672 713896
18327G13896j5812n3209K4352L3088k177l3267l569J4733L345k571L823k466M5701
18314G25867L6802K9461N882k5653P5213L8122J9251O8585O1479J8982K0532L9316
18302A113839N6564Q5805R3628P4669J26417J46541J65991J38005J22268J02677
18292B226404Q9741J35140J11371J14866K08027K81799L90434N24932P27881R70723
18282E781318J217423J393198J431646J093924N7396p28012n03678l4974M39136
18273A0147377Q16689J257820J843026K631355L824673N590434P884867J0353154
18265D4349395J2329829J3027200R493816J480301m287307r473975j2303980j0343051
18257D4272228o884491m013368k172036r25225K01209J154376J558571J087829
$$ plain form
18327 713896 698084 644875 669227 702315 700138 666871 663302 678035 681380 678809 682632 680166 725867
18314 725867 762669 792130 798012 772359 847572 885694 904945 973530 1035009 1053991 1074523 1113839
18302 1113839 1170403 1256208 1349836 1424505 1550922 1697463 1863454 2001459 2123727 2226404
18292 2226404 2316145 2451285 2562656 2677522 2885549 3167348 3557782 4082714 4810595 5781318
18282 5781318 6998741 8391939 9823585 10917509 10974905 10246893 9743215 9708241 10147377
18273 10147377 10964066 12221886 14064912 16696267 20520940 26111374 33996241 44349395
18265 44349395 56679224 69706424 79200240 80680541 76393234 66919259 54615279 44272228
18257 44272228 37387737 33374369 31202333 30277108 30478317 31632693 33191264 34279093
18249C4279093M82212j322j835847m515624m815457l492154k237341j391665q59214
18240A5612681n03594k11421J25977N63644J039936J425091J812400J983479J750193
18231B3598386J415903P70551J76602Q59396K346514M071927N946884P831523
18223D7017686R624675J0587889R316948P306379P164650N408355O09419j61053
18215I6874948L417372N737079M320226J728903L897701O857584N045367J351520
18207A29230700J431930N69651p039214j3298823j2423877j1528819j3200160
18200G3741388j1807936q761565o708211n571172m376815l156213k188701j478757
18192B9692018j187804j141335j502932k327238k310139j584420q07383k19214
$$ plain form
18249 34279093 34761305 34759983 32924136 28408512 23593055 20100901 17863560 16471895 15612681
18240 15612681 15109087 14897666 15023643 15587287 16627223 18052314 19864714 21848193 23598386
18231 23598386 25014289 25784840 25961442 26820838 29167352 33239279 39186163 47017686
18223 47017686 56642361 67230250 76547198 83853577 91018227 96426582 97036001 96874948
18215 96874948 100292320 106029399 110349625 112078528 115976229 122833813 127879180 129230700
18207 129230700 130662630 131232281 124193067 110894244 98470367 86941548 73741388
18200 73741388 61933452 53171887 46463676 40892504 36515689 33359476 31170775 29692018
18192 29692018 28504214 27362879 25859947 23532709 21222570 19638150 18830767 18611553
18184A8611553K67331O43912J176117J957881K952638L769021M162457L929116
18176C7470026K023227j853541l500041j934231K74539K479897M881834P180660
18168D7022370R063185J0363566R960579N629516L270811O576778R207523N981065
18160A07075393k216401q005061j3791862j4353772j1799943j0295997q033156
18153C8579201n708458l954371k773931j987391j441987j274511j716647j917172
18145A7804733j283798o27799l28157m76839j271937j766568j586903j312710
18137I150022j063723q56946o81390n13477l51336k71792k27295j56906j11247
18128D915910j09324j35601j12366l6420L8061J01416J49595J75835L41694M73990
$$ plain form
18184 18611553 18878884 19522796 20698913 22656794 25609432 29378453 33540910 37470026
18176 37470026 39493253 37639712 34139671 32205440 32479979 34959876 39841710 47022370
18168 47022370 56085555 66449121 76409700 82039216 85310027 91886805 101094328 107075393
18160 107075393 104858992 96853931 83062069 68708297 56908354 46612357 38579201
18153 38579201 32870743 28916372 26142441 24155050 22713063 21438552 19721905 17804733
18145 17804733 16520935 15893136 15564979 15088140 13816203 12049635 10462732 9150022
18137 9150022 8086299 7229353 6547963 6034486 5683150 5411358 5184063 5027157 4915910
18128 4915910 4806586 4670985 4558619 4522199 4560260 4661676 4811271 4987106 5328800 5802790
18118E802790O49798R15520J345795J948217L080081M745383O839254Q283555
18110C3610393Q692684Q009317K39047j2925145j1606701o875758l957994k532442
18102A2653401j707550j243974j053556q68615p81648p34148o68208o60933o23096
18093D311673n16588l89203k15633j30625o2518n0046j26826k10516j60073j29472
18083B320173j48906j32336j08752r2862j17122o1382n5576j07712q8922n6048
18073A350555m4754p5396n6916n6739j3937J232l3222m2666n5394m3011j0096
18062I19656m6441j8311j5361O292N9068L2500O6075J23748J06669J16090N2336
18051A402321P4610O3092O2427K0366l1852n4681j07701o7732L0125M7271R353
$$ plain form
18118 5802790 6452588 7368108 8713903 10662120 13742201 18487584 25326838 33610393
18110 33610393 42303077 50312394 50551441 37626296 26019595 19143837 15185843 12653401
18102 12653401 10945851 9701877 8648321 7779706 6998058 6263910 5595702 4934769 4311673
18093 4311673 3795085 3405882 3190249 3059624 2997106 2947060 2820234 2609718 2449645 2320173
18083 2320173 2171267 2038931 1930179 1837317 1720195 1658813 1603237 1495525 1406603 1350555
18073 1350555 1305801 1230405 1173489 1116750 1102813 1104045 1070823 1028157 972763 929752 919656
18062 919656 873215 854904 839543 845835 904903 937403 1003478 1127226 1233895 1349985 1402321
18051 1402321 1476931 1540023 1602450 1622816 1590964 1536283 1428582 1360850 1390975 1438246 1447599
18040A447599l6480o4600n6721L2431k5339l4573J7375n0048j23133j12273j07153
18029H87085o7478o9270m1799j6023m5038l6048j4202m5147n3141l1628k8141
18018D39170N540k631m8596j742m1438l1416K6784L3960q168o172N5088M6822
18006D67201J0432K1022J6614N0987L4905K4726L2816l0977k7524k3491l9446
17995E37265o9164l1096l4369m4057k0283J8716J7895k7642k0346l8715J3140
17984C01344K4406p326j5054J7737L2131K7647n469o332n23j5249j3447M853K2907
17971C67625M6104O597l396j3391M699M4012L3099K664M7145J518n7060l638J7003
17958D92981l0876l1040J983l5379N667p746K5160k4587k2846j9113k9216n784
$$ plain form
18040 1447599 1411119 1346519 1289798 1322229 1296890 1262317 1279692 1229644 1106511 994238 887085
18029 887085 819607 750337 708538 692515 647477 611429 597227 552080 498939 467311 439170
18018 439170 444710 442079 393483 391741 350303 318887 345671 379631 371463 365291 420379 467201
18006 467201 477633 498655 515269 566256 601161 625887 658703 627726 600202 576711 537265
17995 537265 468101 437005 402636 358579 338296 357012 374907 347265 326919 288204 301344
17984 301344 325750 318424 303370 321107 353238 380885 375416 369084 368561 353312 339865 344718 367625
17971 367625 413729 420326 416930 403539 408238 452250 485349 488013 535158 536676 479616 475978 492981
17958 492981 462105 431065 433048 397669 403336 395590 420750 396163 373317 354204 324988 319204
17946C19204m037k4554k3820J3105K4337j7327n025J9395J8619m8861l9910Q882
17934B40008L148N619N5148K8882Q774r594M909j2770j0071j0236R763L6537j1143
17921C38974l641O671J8523m7M3495M4156L063K0922M7942O540L7618J5536n5256
17908E24496q4521k7674l0729k7187k0086n438l8011P816R675K3018j3319J173
17896C19213P866j6570k1774K959L1961Q211l0948p78R046k9591L360N8571K8295
17883C69821J7896J653P172r859k0564k1914p755L4189L2794l773r753j645j3448
17870C74814l3923L160N0217M085M770k284k6558l6963J3908K7369k9988O37j1885
17857C37359P776K8955j0547j2532K4199J4011J3795J3797K7250M7616J1026N997
$$ plain form
17946 319204 315167 290613 266793 279898 304235 286908 281883 301278 319897 271036 231126 240008
17934 240008 243156 248775 303923 332805 341579 331985 336894 324124 314053 303817 313580 350117 338974
17921 338974 335333 342004 360527 360480 403975 448131 451194 472116 520058 526598 564216 579752 524496
17908 524496 439975 412301 381572 354385 334299 328861 290850 298666 308341 331359 318040 319213
17896 319213 327079 310509 288735 291694 323655 331866 300918 300140 309186 279595 282955 341526 369821
17883 369821 387717 389370 396542 386683 366119 344205 336450 370639 403433 399660 389907 388262 374814
17870 374814 340891 344051 394268 398353 403123 400839 374281 337318 351226 378595 348607 349244 337359
17857 337359 345135 374090 363543 351011 375210 389221 403016 416813 444063 491679 502705 508702
17845E08702o884k8641n137k187J4805J6986K7067J1623N6818K3767L4193L864
17833F54976M078J9283L6753L9688J0777j1113l6820m1380j921J6379J4359L720
17821G08779J4667J8648k5399l3205O432L3421p735o2378k2385L1536J1154J2308
17809F85843K3269j9229L0829P392j0537N659K1432M9678M2130J1286j8771J4578
17797H43559N1126N9663N0580J2423J6283P2722R0071N7441N0517O5107P6072
17786A445564J30814J33026J07488M4431P1491J19837J61876J32326J67274J84663
17776B698790J05341J34075J91121K48623L62170M03383M47262N48256O73055
17767E812076R22282J196571J568400K052222K655480L274624L719549L910587
$$ plain form
17845 508702 501818 473177 468040 465853 480658 497644 524711 536334 593152 616919 651112 654976
17833 654976 659054 678337 715090 754778 765555 754442 717622 676242 674321 690700 705059 708779
17821 708779 723446 742094 716695 683490 689922 723343 715608 653230 630845 662381 673535 685843
17809 685843 709112 689883 720712 728104 717567 723226 744658 794336 836466 847752 828981 843559
17797 843559 894685 954348 1004928 1017351 1033634 1106356 1196427 1253868 1304385 1369492 1445564
17786 1445564 1576378 1709404 1816892 1861323 1932814 2052651 2214527 2346853 2514127 2698790
17776 2698790 2804131 2938206 3129327 3377950 3740120 4143503 4590765 5139021 5812076
17767 5812076 6734358 7930929 9499329 11551551 14207031 17481655 21201204 25111791
17759B5111791L044911J398729J963404L839161N494564N974630M244532J093446
17751E2165168j847797l746713j919813O97684K015813J224507l481103p946306
17743C7161440p086353m664547k904815j877655j315010j003568o82622l33606
17735A7293264Q7602O33558J267868J885211K509482L036943L303897L241197
17727C3259022L196899L283965K875033J688324J259494K650973N201420Q577213
17719F1992343J2644491J7394841K2016297K5534423K6155885K0948214J2055623
17712A98742117Q359853R935331O638679j99760k539980m693902j0864037j5315350
17704A90062951j2269182m631644J26003j660130n330037j0868147j9369403k4083632
$$ plain form
17759 25111791 28156702 29555431 31518835 35357996 40852560 46827190 51071722 52165168
17751 52165168 50317371 46570658 44650845 45348529 47364342 48588849 45107746 37161440
17743 37161440 30075087 25410540 22505725 20628070 19313060 18309492 17626870 17293264
17735 17293264 17380866 18014424 19282292 21167503 23676985 26713928 30017825 33259022
17727 33259022 36455921 39739886 42614919 44303243 45562737 48213710 53415130 61992343
17719 61992343 74636834 92031675 114047972 139582395 165738280 186686494 198742117
17712 198742117 207101970 217037301 223675980 223476220 220936240 216242338 205378301 190062951
17704 190062951 177793769 173162125 173288128 171627998 166297961 155429814 136060411 111976779
17696A11976779k1707602j6242483j1447569q214222o121383m769403l987973
17689C9486144l626910l252396k601131j925408j304877p85502l56901l583K98540
17680B5927976M87362R95629J883425L144796M703428O282272P492839P933584
17672E8851311O662083L442145N58352J6536J421738L163586L754011L370056
17664H1239818N067358J0114516J7086539K4022908K9186877L0713646K3760775
17657B21192437M292136j6121903k5415664k8211373k8142564k3669779j8037612
17650H5885678j3690085j0825659q797197p373631o030653m839937l841483l027194
17642B7459839k434737k087929j860448j507907r12956m81349m59257r45468j650053
$$ plain form
17696 111976779 90269177 74026694 62579125 54364903 48243520 43474117 39486144
17689 39486144 35859234 32606838 30005707 28080299 26775422 25989920 25633019 25629436 25927976
17680 25927976 26415338 27410967 29294392 32439188 37142616 43424888 50917727 58851311
17672 58851311 65513394 68955539 69513891 69530427 70952165 74115751 77869762 81239818
17664 81239818 86307176 96421692 113508231 137531139 166718016 197431662 221192437
17657 221192437 225484573 209362670 183947006 155735633 127593069 103923290 85885678
17650 85885678 72195593 61369934 52572737 45199106 39168453 34328516 30487033 27459839
17642 27459839 25025102 22937173 21076725 19568818 18655862 18174513 17715256 16769788 15119735
17633A5119735j863641j615183j294220r93486q13649p31507o37256n58924n34221
17624F077648m94634m71025l54480k85010k70330k46584k31027j90023k03384
17615C331151j70379j98517j74689j37221j50824j12523o0551r2678j25098r8404
17605B010267o0009m4793m0880m3581n9279k4563l2903o2649o1745o4750l4253
17594A480862k0769m9815l2457j9397J7334m082l4567m3018l1035j54r999J1739
17582A264642l2985n9336N020j573n3126q125j8851j453q057l4245j1444l1997
17570A008470m4294m0857j4713k1476k1619r509K676q1627n8989l8735j8782j4474
17558F46071k7926m2306k6382K3431L140l0825K4249L0606n6797o827q614l2156
$$ plain form
17633 15119735 13256094 11640911 10346691 9353205 8539556 7808049 7170793 6611869 6077648
17624 6077648 5583014 5111989 4757509 4472499 4202169 3955585 3724558 3534535 3331151
17615 3331151 3160772 2962255 2787566 2650345 2499521 2386998 2326447 2233769 2108671 2010267
17605 2010267 1950258 1905465 1864585 1821004 1761725 1737162 1704259 1641610 1579865 1515115 1480862
17594 1480862 1460093 1410278 1377821 1358424 1375758 1371676 1337109 1294091 1263056 1262902 1252903 1264642
17582 1264642 1231657 1172321 1177341 1175768 1122642 1114517 1095666 1094213 1086156 1051911 1040467 1008470
17570 1008470 964176 923319 908606 887130 865511 856002 858678 777051 718062 679327 660545 646071
17558 646071 618145 575839 549457 572888 576028 545203 569452 600058 543261 536434 527820 495664
17546D95664j4060n179M996M2561r790o9311k6317K0009J9967j5876m478J8619
17534D56805K8994L0779L4119J8187j2730J2792l5116m2622M59l367j8641j4060
17522D55599p322m4400k027K5989j6931k2567l4091j7211p136k6167m9168m2116
17510B12452J5909R523J081O045L0750n0163m428j0379o031m2465j7094M2029
17498A87229M3790J1465p636n9130k8960J6364j0004j1140k2911j1679k3607r390
17486G4391J5608j4590L428M0886L1405Q985j5569l1718L4679N7457J560n6616
17474A49906o4449j4207r737J7764J467j3932J5417J8534M73j2812j6434L303
17462G5293Q337L0038J1438l0276k1289K5728K8208K0152j4165k9637M67j0254
$$ plain form
17546 495664 481604 476425 481421 523982 514192 444881 418564 438573 458540 442664 438186 456805
17534 456805 485799 516578 550697 568884 556154 568946 533830 491208 491667 488300 469659 455599
17522 455599 448277 403877 401850 427839 410908 388341 354250 337039 329903 303736 254568 212452
17510 212452 228361 237884 238965 245010 275760 225597 221169 210790 204759 162294 145200 187229
17498 187229 231019 242484 234848 175718 146758 163122 153118 141978 119067 107388 83781 74391
17486 74391 89999 75409 78837 119723 151128 160113 144544 112826 147505 204962 206522 149906
17474 149906 85457 71250 61513 79277 80744 66812 82229 100763 101236 88424 71990 75293
17462 75293 83630 113668 125106 94830 73541 99269 127477 147629 133464 103827 104294 94040
17450I4040K0558M3181o978Q468N2079L3233n177K5280M2671k9387l0921o0907
17438A86140p3244r939L502l7532j3669N896r118r626o920j9176l347J1428k458
17425B1937R951o1450j1220K2263M7505J8393Q391L0807n361N39L2692k3658m901
17412H5888J00J2061J37r960N859m2109J0158R185k0283Oj532k6251Q792K9164
17398F1215j9971j4762n91K1556m192k8743m662R99K199J2673N739K7559q99m5058
17384A3062J9410J7044l3438l7474Q736Q417l4574r682J0332K6665p390k3517
17372d2409J0723K2702J6623j3140l4833m094K5882J3426P547J4855L0408l5037
17360A2653k2122L0936J9684k4086j4551m8297K953M9763O3110K053M77l0465
$$ plain form
17450 94040 114598 157779 150801 159269 211348 244581 239404 264684 307355 277968 247047 186140
17438 186140 112896 102957 106459 68927 55258 61154 52036 42410 35490 16314 12967 24395 21937
17425 21937 31888 -29562 -40782 -18519 28986 47379 55770 86577 81216 81755 114447 90789 85888
17412 85888 85988 98049 98186 88226 94085 51976 62134 71319 51036 51042 49510 23259 32051 61215
17398 61215 41244 26482 25891 47447 43255 14512 9850 10849 13048 25721 31460 59019 58120 13062
17384 13062 32472 49516 16078 -21396 -12660 -4243 -38817 -48499 -38167 -11502 -18892 -42409
17372 -42409 -31686 -8984 7639 -5501 -40334 -44428 -18546 -5120 2427 17282 47690 12653
17360 12653 -9469 21467 41151 17065 2514 -45783 -42830 6933 70043 72096 72573 42108
17348D2108Q558j9627j785l3444o214K2446L702J0189j5659k1885L412L781K976
17335a442J1337j2015q92k928j7522N477K8240m3254m0485Q05J4482K3328l154
17322c8023L2031L1579l1210j4269K9538J2709l419j199k7124j0519r251O123
17310b3034J2475p348k608K3192m8614k1226M480O2435L2894o96o258k9723J3071
17297I040J5789k0303Q126k8798j2126Q993N49L081j0216J6528M369L906J6455
17284A5393j0480l1106K227K6140N796L395j9123q854L1283Q074J1581K3394k6587
17271C1133j9394k6527K601j4643R128K5110j0149K8618P30l2841N638l485K9360
17258B5279o664q998K8462J8272k9780j352J7900j4185m521J8796M9938K6134
$$ plain form
17348 42108 50666 31039 29254 -4190 -10404 12042 15744 25933 10274 -11611 -8199 -4418 -1442
17335 -1442 9895 -2120 -3012 -5940 -23462 -17985 10255 -32999 -73484 -72679 -58197 -34869 -38023
17322 -38023 -5992 25587 -5623 -19892 9646 22355 18936 17737 -9387 -19906 -29157 -23034
17310 -23034 -10559 -17907 -20515 2677 -45937 -67163 -62683 -248 32646 31950 25692 -4031 9040
17297 9040 24829 4526 12652 -16146 -28272 -19279 -18730 -15649 -25865 -9337 -4968 -1062 15393
17284 15393 4913 -26193 -23966 2174 7970 11365 -7758 -16612 14671 22745 34326 57720 31133
17271 31133 11739 -14788 -12187 -26830 -17702 7408 -2741 25877 26607 -6234 -596 -4081 25279
17258 25279 18615 9617 38079 56351 26571 25219 43119 28934 24413 43209 93147 119281
17246A19281L1418M6112k1299J1592K2720M3096N8070L3468j7396m1505l7028
17235B48529l9098l8294q013l624J6905j3103j276j6569m734q374M6453M1209
17223B20011j7022M136M9948N6438L8245O359K0672M5366K9811M4879L7443n929
17211E30357k8894j3736R920J3319P111J4319j0357M1789P5848N9972M7980M1080
17199G88708n8q700K4066L2657P5722J0587p5006q3256p8124o9165n9431k7054
17187E30946k9636n1143n5201n6251m7370k0348j8931l4622J2175J5987j571l3673
17175B10362J1688m7855N133K2339M4456L4415N0519M4526M0237L1298Q513N912
17163D61543J1601M6114M7108p947q767j2504j7095K7819J1360m486l0557j6242
$$ plain form
17246 119281 150699 196811 175512 187104 209824 252920 310990 344458 327062 285557 248529
17235 248529 209431 171137 163124 159500 176405 163302 162026 145457 140723 132349 178802 220011
17223 220011 202989 207125 257073 313511 351756 358115 378787 424153 453964 498843 536286 530357
17211 530357 501463 487727 497647 510966 518077 532396 522039 563828 639676 699648 747628 788708
17199 788708 788650 779950 804016 836673 912395 922982 847976 764720 686596 617431 558000 530946
17187 530946 501310 450167 394966 338715 291345 270997 252066 217444 229619 245606 244035 210362
17175 210362 222050 174195 179328 201667 246123 280538 331057 375583 415820 447118 455631 461543
17163 461543 473144 519258 566366 558419 549652 537148 520053 547872 559232 554746 524189 507947
17151E07947m1812Q090L6574N6314M7721J3562j9796o4980m7070j7743k4987K9563
17139D83383K6316k0703n7737k2001o9629q1112n0196n1545l7633k0220l1663
17128F7260k3819J3826J58k4553R294j6216q207J7115L3613j6381k2014l6280
17116f204J7508L1208m118k3282j8069o52J6043n086J7666p390m1366J1513P296
17103d933n384J1433j967k305K3900Q193K0225j2287m4492k2130p574J716p058
17090d2663j5245j4672q282L7147O0804j3106q776k3402l0284O730j151l0102
17078h3002J8923j341o677m6761l2466M5725M0151K6794O6464j9805l5822M087
17066b3730M0445k3918j7440K6140l0754J1199M2954Q699j2943l635J398R264
$$ plain form
17151 507947 466135 474225 510799 567113 614834 628396 608600 543620 496550 478807 453820 483383
17139 483383 509699 488996 431259 409258 339629 258517 208321 156776 119143 98923 67260
17128 67260 43441 57267 57425 32872 42166 25950 17743 34858 68471 52090 30076 -6204
17116 -6204 11304 42512 38394 15112 -2957 -3609 12434 7348 25014 17624 -23742 -12229 -4933
17103 -4933 -10317 1116 -851 -3156 20744 28937 49162 36875 -7617 -29747 -37321 -35605 -42663
17090 -42663 -57908 -72580 -80862 -43715 17089 3983 -4793 -28195 -58479 -51749 -52900 -83002
17078 -83002 -64079 -65420 -72097 -118858 -151324 -105599 -65448 -38654 27810 8005 -27817 -23730
17066 -23730 16715 -7203 -24643 1497 -29257 -18058 24896 33595 20652 17017 18415 27679
17054B7679j7544k2881R85J585m912O82l017j8676k1829j2719N5337N0126r910
17041B4906k6603Q321l3215k9320j352L0769J5007K662K4483L1263N437j2553
17029C9805l7370j3384K089J0174J7101o797j855L4325k9372j6928J990J7370
17017A7148k2855k5154J3958J8367k0295l3770L2392M0118r334j8275j7524J7256
17005g968J2430o411N93m1174j0500M0441L5206J4679m4721k3701j0591J2942
16993b8775J4177L3092K9044k6668n6016j555J3751q769k4599M0783J6979r303
16981g859k4346J4318r870L297K668j1322J7667k579k0989L2926L2937K5048M4897
16968I6793J3672n0424m4004J3560K9927J7353j19j5318o6965n870J2230J8756
$$ plain form
17054 27679 10135 -12746 -11761 -10176 -15088 -14406 -17423 -36099 -57928 -70647 -15310 34816 24906
17041 24906 -1697 6624 -26591 -55911 -57263 -26494 -11487 -8825 15658 46921 52358 39805
17029 39805 2435 -10949 -8860 1314 18415 11618 9763 44088 14716 -2212 -222 17148
17017 17148 -5707 -30861 -16903 1464 -18831 -52601 -20209 19909 10575 -7700 -25224 -7968
17005 -7968 4462 -1949 -1356 -42530 -53030 -12589 22617 37296 -7425 -31126 -41717 -28775
16993 -28775 -14598 18494 47538 20870 -35146 -36701 -22950 -31719 -56318 -15535 1444 -7859
16981 -7859 -32205 -17887 -27757 -24460 -21792 -33114 -15447 -18026 -39015 -6089 26848 51896 96793
16968 96793 110465 60041 16037 29597 59524 76877 76758 61440 -5525 -11395 835 19591
16956A9591J4538q758r141l2856l5718j0744R478J4830J607M8213K6466L839l783
16943C7562J2285k2306k6145J9819m4474l9231L877P414O804J3209Q5k004r261
16930d2366j4560L0425q191p513J6005L649o091m0011j1246R697J1663J7725Q893
16917c1921K1781K6308N075l0405k271j976K9955J9868L418l5255l2551k1714
16905d9688L579K2781K8171L1199J3665m3190m0563R40P351k0491K9385L9059
16893B2198j2132j5052Q297l703M190j2416m454K7474N324p704j472O638J3014
16880C0202J2479m7036m4136J31l6516K884m592K9657O820m7797p429j3724K649
16867a16408L839N7803K2051k1725m5956J7013L8807J5910L948p47m6949j6277
$$ plain form
16956 19591 34129 25371 16230 -16626 -52344 -63088 -53610 -38780 -37173 11040 37506 41345 37562
16943 37562 49847 27541 1396 21215 -23259 -62490 -58613 -51199 -44395 -31186 -31101 -33105 -42366
16930 -42366 -56926 -26501 -34692 -42205 -26200 -22551 -28642 -68653 -79899 -70202 -58539 -40814 -31921
16917 -31921 -10140 16168 21243 -9162 -11433 -13409 16546 36414 39832 4577 -27974 -49688
16905 -49688 -46109 -23328 4843 36042 49707 6517 -34046 -33106 -25755 -46246 -16861 22198
16893 22198 10066 -4986 3311 -392 3798 -8618 -13072 14402 19726 12022 10550 17188 30202
16880 30202 42681 -4355 -48491 -48360 -84876 -81992 -86584 -56927 -50107 -97904 -105333 -119057 -116408
16867 -116408 -112569 -54766 -32715 -54440 -100396 -83383 -44576 -28666 -24718 -25465 -72414 -88691
16855h8691l183K8906K8660k883J1107K8051j1515o467k2572l3081J2981M325
16843e4362L5936l2377j0880J0730k1530J7753M3082j7025j6484K0777K75k1855
16831d5960J4720L67j2434J4079l4645l0264L6416K4775j3638l396K1626M344
16819b4010j7640J737M010M165L6267J3405j5111m550n062J3737J4111k8589l9165
16806d6695j7472m883O993K4919L5396k772l5851Q632K7986J5082O520k355l8895
16793b3395j3367k3007L3312L2291j7862j9036O448K1605j0010j2695k5628j2211
16781f3555o102K9741l113k2349p583M5473J8326R847L0180m031K049m9012k8343
16768d8472J2342J4230J1507J5183k8117n836L8271P667l4951M54k1786p818K684
$$ plain form
16855 -88691 -91874 -62968 -34308 -37191 -26084 1967 -9548 -16015 -38587 -71668 -58687 -54362
16843 -54362 -18426 -50803 -61683 -50953 -72483 -54730 -11648 -28673 -45157 -24380 -24105 -45960
16831 -45960 -31240 -30873 -43307 -29228 -63873 -94137 -57721 -32946 -46584 -49980 -28354 -24010
16819 -24010 -41650 -39913 -35903 -31738 4529 17934 2823 -1727 -6789 6948 21059 -7530 -46695
16806 -46695 -64167 -69050 -62057 -37138 -1742 -4514 -40365 -31733 -3747 11335 17855 15500 -23395
16793 -23395 -36762 -59769 -26457 5834 -12028 -31064 -24616 -3011 -13021 -25716 -51344 -63555
16781 -63555 -69657 -39916 -43029 -65378 -72961 -27488 -9162 685 30865 26834 28883 -20129 -48472
16768 -48472 -36130 -21900 -10393 4790 -23327 -29163 9108 16775 -18176 -17722 -39508 -47326 -44642
16755d4642J4136j6927J3081Q937k2024j0354L9424p593q817P842J332o587j836
16742c4028J8010Q382j1975j425N409J1144k1462N582P657J2552K6832J8412j0439
16729C4651l3419n9477l5682j2877l2584K9838N3400k3538K5001n380j9586J5901
16717f3752J5801J4881R100N963K5581j5644j4444l9214j480k670j2445k9287
16705a07610P035O0575K8875j0346o656J0105n413J5925J3817J6680Q986l2209
16693b36n3373K1854L0118p287j0640l4312m474J9214N8633R706j3186J378m308
16680A3087L365j8737j2438m603K063m3750j625K016L5104J7078J6661Q452N935
16667B2608j2811O790k398j1881J1860P510k8404L4164L36j3738r076k086j1094
$$ plain form
16755 -44642 -30506 -47433 -34352 -25415 -47439 -57793 -18369 -25962 -34779 -26937 -25605 -32192 -34028
16742 -34028 -16018 -7636 -19611 -21036 -15627 -4483 -25945 -20363 -12706 -154 26678 45090 34651
16729 34651 1232 -58245 -93927 -106804 -139388 -109550 -56150 -79688 -54687 -60067 -79653 -63752
16717 -63752 -47951 -33070 -23970 -18007 7574 -8070 -22514 -61728 -63208 -65878 -78323 -107610
16705 -107610 -100575 -40000 -11125 -21471 -28127 -18022 -23435 -7510 6307 22987 31973 -236
16693 -236 -53609 -31755 -1637 -8924 -19564 -53876 -58350 -39136 19497 29203 16017 17395 13087
16680 13087 16452 -2285 -14723 -19326 -17263 -61013 -62638 -60622 -25518 -8440 8221 16673 22608
16667 22608 9797 16587 14189 2308 14168 21678 -6726 27438 27774 14036 4960 2874 -8220
16654h220J8030j1552L050J9027J9467j6390R563K2218L6507N219k1000k7402
16642D8517k756j8136m3729L201J8205J9380q150k6185N516k4415L194K451j4439
16629c7346j3161l8022L8490P1773O6584k4382l6824N18j7325R469K6739l4896
16617A1617k8749k8518m5245M986M723J0623K2792J1044l0443N736M6749O3015
16605D8330k12l7680j8808n331j8703j0789l7796O768R738L315J3738K0532j7583
16592d4481R315L8631K2253o696j3780j7374k6592j2463N490j3641J0185R12K3053
16579b5188M7190J664q929j3417J435l1333m4092l532J9783M5528K7935l3495
16567a6451l9118L361l103K789O672N227R631J8689p807k1084N8321K3869j3551
$$ plain form
16654 -8220 9810 -1742 1308 20335 39802 23412 32975 55193 91700 96919 75919 48517
16642 48517 45761 27625 -16104 -12903 5302 24682 16532 -9653 -4137 -28552 -25358 -22907 -37346
16629 -37346 -50507 -88529 -50039 21734 88318 63936 27112 27630 10305 19774 46513 11617
16617 11617 -17132 -45650 -90895 -85909 -81186 -70563 -47771 -36727 -67170 -61434 -14685 48330
16605 48330 48118 10438 -8370 -13701 -32404 -43193 -80989 -74221 -64483 -61168 -47430 -26898 -44481
16592 -44481 -35166 3465 25718 19022 5242 -12132 -38724 -51187 -45697 -59338 -49153 -48241 -25188
16579 -25188 22002 23666 14737 1320 2755 -28578 -72670 -76202 -56419 -10891 17044 -16451
16567 -16451 -55569 -52208 -55311 -52522 -45850 -40623 -30992 -12303 -20110 -41194 17127 40996 27445
16554B7445l8275J1195J0119m1104q870k104J2639J3366M8067K993n279k0781
16542I411N530M5112l5128n4318o784N198L1793k9666J8082J2749j544n5030Q758
16529d5837j4609k689K9715N1633l060k6417j7261K5533N418k3825k0282m5588
16517h7269n326K7598J5771J6061P836R702J753J1439K3411j3624k5023l2867
16505e0538o3954k415Q350J5857O715K6932O084O858N3398L4884P291k9508p604
16492A2350O183j6407j2332m0697l4283K7423K0415L473k0274J8652r760J3101
16480c2156k1045j3844L3101k4826j3153J8168p086o535M7929K5967K8136k2156
16468A2500R712M363J3034k1531j3846k1123l2869J3J528L2511k070j6718N496
$$ plain form
16554 27445 -10830 365 10484 -30620 -39490 -41594 -28955 -15589 32478 35471 30192 9411
16542 9411 14941 60053 24925 -29393 -36177 -30979 814 -28852 -10770 1979 435 -54595 -45837
16529 -45837 -60446 -63135 -33420 18213 15153 -11264 -28525 -2992 2426 -21399 -41681 -87269
16517 -87269 -92595 -64997 -49226 -33165 -25329 -15627 -13874 -2435 20976 7352 -17671 -50538
16505 -50538 -114492 -116907 -108557 -92700 -85985 -59053 -52969 -46111 7287 42171 49462 19954 12350
16492 12350 18533 2126 -10206 -50903 -85186 -57763 -37348 -33875 -54149 -35497 -45257 -32156
16480 -32156 -53201 -67045 -33944 -58770 -71923 -53755 -60841 -67376 -19447 6520 34656 12500
16468 12500 22212 26575 39609 18078 4232 -16891 -49760 -49747 -48219 -15708 -17778 -34496 -29000
16455b9000K5185M7363q66j6000J1037J9875j2274j2106K577j0713n7889L4736
16443A925j605j8523j656L60K7825j1331j3526J1230L6677k554P056j6321J5649
16430C5206N601k4491P783q505l7239M482K941m164m7151J0928k805O750K2422
16417b8242K4550K1929J6321J7077n1960j7614j8609m2353j2777J3072J7886J3110
16405d7610K5863K9326l3076L591R489m8825K6880K558j5362j0435k4144l945
16393h5690J5133N3762q324j9197L4658K7781J941l202Q192p843K27K2882q469
16380C1851k3556j1644o93J8111M149j5543j2225m442J7785N2890k183k4150n8082
16367b7732m322O441K929j183J1520O716n559J9785R493k4234J3051J5310q485
$$ plain form
16455 -29000 -3815 43548 42682 26682 37719 57594 45320 33214 35791 25078 -32811 1925
16443 1925 320 -18203 -19859 -19499 8326 -3005 -16531 -5301 31376 28822 35878 19557 35206
16430 35206 40807 16316 24099 15594 -21645 -17163 -14222 -18386 -65537 -54609 -57414 -50664 -28242
16417 -28242 -3692 18237 34558 51635 -325 -17939 -36548 -78901 -91678 -78606 -60720 -47610
16405 -47610 -21747 7579 -25497 -21906 -12417 -61242 -34362 -31804 -47166 -57601 -81745 -85690
16393 -85690 -70557 -16795 -25119 -44316 -9658 18123 20064 16862 25054 17211 17438 40320 31851
16380 31851 8295 -3349 -4042 14069 18218 2675 -9550 -13992 3793 56683 54500 30350 -27732
16367 -27732 -32054 -25613 -22684 -23867 -12347 -5631 -11190 8595 18088 -6146 6905 22215 13730
16354A3730j0637J0295K1156M921j389m0760j2779k5063l017J6751j9602L2377
16342a4017L2553K9296J9790k5614J4069K1817K855k1864o5801l1138J0047M9359
16330B1352j0931K0029o446J9538l0576p315L7798j2405l9295k4745l4246L5186
16318c2056K2301O74J6960k9054j9035j4848R920p82K3612j3195l5758R450K9981
16305c1830M287m6979Q69R215N2591O0987j1249l8921j3194k1972K2160j1902
16293b5938M921J659J4955k782j4047k6755R053L3533k589k756j1191l8124J786
16280e8275K7817j1017L206j800j6144K558L1869L1325m226m7127P946K067J2395
16267a9406O2671J2548l4220k7188j2763M1116J7050j1747m3627k9603k3545K5185
$$ plain form
16354 13730 3093 13388 34544 39465 38076 -2684 -15463 -40526 -43543 -26792 -46394 -14017
16342 -14017 18536 47832 67622 42008 56077 77894 80749 58885 -6916 -38054 -28007 21352
16330 21352 10421 30450 24004 43542 12966 5651 43449 31044 -8251 -32996 -67242 -32056
16318 -32056 -9755 -9081 7879 -21175 -40210 -55058 -45138 -45920 -22308 -35503 -71261 -61811 -31830
16305 -31830 -27543 -74522 -73653 -64438 -11847 49140 37891 -1030 -14224 -36196 -14036 -25938
16293 -25938 -21017 -19358 -4403 -7185 -21232 -47987 -38934 -5401 -7990 -10746 -21937 -60061 -58275
16280 -58275 -30458 -41475 -38269 -40069 -56213 -53655 -21786 9539 5313 -41814 -33868 -31801 -19406
16267 -19406 43265 55813 21593 -5595 -18358 22758 39808 28061 -15566 -45169 -68714 -43529
16255d3529K4131J0804j0703k99o569K1036M1310k3141k6562K7539J0023l775
16243B0265Q942L55l3599n904m1459j0358K1184j148j8439L2495M2772J278k3003
16230f619p828o7359k9515K2998J9040K9483K0786n657K658K527k4725m816l373
16217e2400j2946l6547K5141J0578M5501K8999o089j6174j4141m103M469J252
16205b6460k6339J999J3633L0841k7230o972Q383l2130k0402J4734P107n036L2188
16192c5684J1480M749l9837n27O206j7968J0183m569K9170M7514J5850k9259j0991
16179a3683r077R242J3263l19J6644j3306n703r246l6339K53l418K2357L405J1747
16165a4180M121l7375L830J3871p977l423L7189R056k1503k7779o589J1429J9607
$$ plain form
16255 -43529 -19398 -8594 -19297 -19596 -26165 -5129 36181 13040 -13522 14017 24040 20265
16243 20265 29207 29562 -4037 -9941 -51400 -61758 -40574 -41722 -60161 -27666 15106 16384 -6619
16230 -6619 -14447 -81806 -111321 -88323 -69283 -39800 -19014 -24671 -22013 -19486 -44211 -49027 -52400
16217 -52400 -65346 -101893 -76752 -66174 -20673 8326 2237 -13937 -28078 -32181 -27712 -26460
16205 -26460 -52799 -50800 -37167 -6326 -33556 -40528 -32145 -64275 -84677 -69943 -62836 -67872 -35684
16192 -35684 -24204 -19455 -59292 -59819 -53613 -71581 -61398 -65967 -36797 10717 26567 -2692 -13683
16179 -13683 -22760 -13518 -255 -574 16070 2764 -2939 -12185 -48524 -48271 -51689 -29332 -25927 -14180
16165 -14180 -10059 -47434 -43604 -29733 -37710 -41133 -3944 5112 -16391 -44170 -50759 -39330 -19723
16152a9723J7916k366O250K2K2783J3406O0772j2857l3734k9456q227O375J0026
16139C1187k0131J870K0680l1042q987m3077J7709J4695J6955J4663l9065J2333
16127a2210O338Q689j4926o90m2458k9830L1003M4855o491J5507J464k0733K8557
16114I075k5297k1937L0157o343N923k942j0800n636k8622L862J9444J0940M1261
16101A9085J5852l3070o5914J1670L7053K803k3609j8909L540k9846j1558K5547
16089f7356M3458K3664j6936k381K3522R126L3987O677n7066n9640k6459M164
16077h5240L6536J5016R01R356P052j702N770n652N689k3528J0783M9320P976
16064C2277O895J1807J5234O79J5550l0623o407n213J4493l8163J1964j9056m7425
$$ plain form
16152 -19723 -1807 -4173 2077 2099 24882 38288 99060 86203 52469 23013 14786 21161 31187
16139 31187 11056 12926 33606 2564 -6423 -49500 -31791 -17096 -141 14522 -24543 -12210
16127 -12210 -5872 2817 -12109 -12799 -55257 -85087 -54084 -9229 -15720 -213 1251 -19482 9075
16114 9075 -16222 -38159 -8002 -14345 -8422 -11364 -22164 -27800 -56422 -52560 -33116 -22176 19085
16101 19085 34937 1867 -64047 -52377 -15324 -12521 -36130 -55039 -51499 -81345 -92903 -67356
16089 -67356 -23898 -234 -17170 -19551 3971 13097 47084 53761 -3305 -62945 -89404 -85240
16077 -85240 -48704 -33688 -32787 -23431 -16379 -18081 -12311 -17963 -12274 -35802 -25019 24301 32277
16064 32277 39172 50979 66213 66892 82442 51819 45412 40199 54692 16529 28493 9437 -37988
16051c7988l734L664L092J2132l364K786k721K7994J5611J2173k450n052l3847
16038a1704j0574P156L0120j1719o439l436O3724j1568k9823K3165J9132k4825
16026C3209o438m1082p755j5167N787N0249o404J0353p916k151J5612m069o384
16013A7844K0241m508k9709K7039K4969k7678n0568j3333j0461O6087L0249j8400
16001C1772m060N208k3105q412K3881N683O660m948l9426j509L2991J001J0018
15988C5754J2428l4280j4168j8450j2379Q100K824o454J954j3988K2878l861j9867
15975c9509L1663L9500J8905j5158k1657J4968n649l3600p683j0956k3762n029
15963e7967N5959M8059N066K9954j682n86m0886q406j0623r060N474K947j3675
$$ plain form
16051 -37988 -41722 -38058 -34966 -22834 -26198 -23412 -26133 1861 17472 29645 27195 22143 -11704
16038 -11704 -22278 -15122 14998 3279 -3160 -6596 57128 45560 15737 38902 58034 33209
16026 33209 26771 -14311 -22066 -37233 -31446 18803 12399 22752 14836 12685 28297 24228 17844
16013 17844 38085 33577 3868 30907 55876 28198 -22370 -35703 -46164 19923 50172 31772
16001 31772 27712 32920 9815 1403 25284 30967 37627 32679 -6747 -8256 24735 25736 35754
15988 35754 48182 13902 -266 -18716 -31095 -22995 -20171 -26625 -24671 -38659 -15781 -19642 -39509
15975 -39509 -7846 31654 50559 35401 13744 28712 23063 -10537 -18220 -29176 -52938 -57967
15963 -57967 -2008 46051 51117 81071 79389 78803 37917 29511 18888 9828 15302 18249 4574
15950D574l5984L7455N1023l3525n701J3019r96L7376L0193k1396k5451j6259
15938C4328l3842j4991l634K70k0922k0233M5435J3638j5886l1770l2364k6944
15926a06915L4534J1987J8733J5989L3947K2143R271J7046k8681l2653n5306J4369
15914d5536N3629J5204k1195j2944K8256k714k526K0331m318m1513l0980K9208
15902a5098J0583l5184j2543J7274L479K8006J6848m451k1634k730P533O680K4026
15889B2789j3238M3254L896j5025k3907l4229K6549O174J6257n471k2447r071
15877d469j9396k15K1047J4389L2875J483k1660o100m0738k0790n658n335P544
15864d7023K4847K457J4483K0129n117j0052J5977J0346j2255M2563j559O964
$$ plain form
15950 4574 -31410 6045 57068 23543 17842 30861 29865 67241 97434 76038 50587 34328
15938 34328 486 -14505 -18139 -17869 -38791 -59024 -13589 49 -15837 -47607 -79971 -106915
15926 -106915 -72381 -60394 -41661 -25672 8275 30418 39689 56735 28054 -4599 -59905 -45536
15914 -45536 8093 23297 2102 -10842 17414 14700 12174 32505 28187 -13326 -44306 -15098
15902 -15098 -4515 -39699 -52242 -34968 -31489 -3483 13365 8914 -12720 -15450 -7917 -1237 22789
15889 22789 9551 52805 56701 41676 17769 -16460 10089 16263 32520 27049 4602 -4469
15877 -4469 -23865 -24080 -3033 11356 44231 45714 24054 17954 -22784 -43574 -49232 -54567 -47023
15864 -47023 -22176 -19719 -5236 14893 9776 -276 15701 26047 13792 56355 54796 61760
15852F1760K1342n4148j1237j7245l7137j1651l283L347K4190K1952J5379J1948
15840B5217M57J2265j8001l0827j6060r142K8693L0219r009m4182m9399r062j320
15827i0151L3498L5030J5014p831l4650J901L1892N9511N25K1858N471J3002L5642
15814A20712j6370m7704k0512J8310k0212J928l5868k2380L4191j1255k7581P078
15802a9663J1228J1694J0136L1770j4845l2249l7588p7693j5988M8915K7009O619
15790e0655K3714P109K283J5267j744k378L3115L9817J5159l2034n4097l501k5168
15777c3113k4862L1380J3230J8414J2710j1641r469J5591k3320k892K675k782
15765a4079r57J4548n1424k8732Q039J6423J4536L536O300J4428j9948j028M9592
$$ plain form
15852 61760 83102 28954 17717 472 -36665 -48316 -51599 -48252 -24062 -2110 13269 25217
15840 25217 25674 37939 19938 -10889 -26949 -36091 -7398 22821 13812 -30370 -79769 -88831 -90151
15827 -90151 -56653 -21623 -6609 -14440 -49090 -47189 -15297 44214 44739 66597 72068 85070 120712
15814 120712 104342 56638 36126 54436 34224 36152 284 -22096 12095 840 -26741 -19663
15802 -19663 -8435 3259 13395 45165 30320 -1929 -39517 -117210 -133198 -84283 -57274 -50655
15790 -50655 -26941 -19832 -17549 -2282 -4026 -6404 26711 66528 81687 49653 -4444 -7945 -33113
15777 -33113 -57975 -26595 -13365 5049 17759 6118 -3351 12240 -11080 -13972 -11297 -14079
15765 -14079 -15036 -488 -51912 -80644 -72605 -56182 -41646 -38110 -31810 -17382 -37330 -38358 11234
15752A1234J8695Q540l6303k2237O431p795J0753K1765p070l1557k4485j3695
15740f5724J618Q484O4793J9892j8739J1084j5467K5006L0266k0639k3811M059
15728B0822k0545N04J6333J204l2695M003m96j2964j8764j8169J2068j7596q745
15715g5040K814N6538L1915L395j0643j6897k5549n797K4774R707J6318R82n523
15702F994J4194J7922K0424j6093J2153p555k6932j0203q627p801m064q843J2076
15689f355L9472J526n67k6731l3906k0606p124J7720N9531J8796k0796j4553m294
15676B113J1089j8127n4292J9415O0156L3355j7428q645n1311J455M4390J7170
15664C9340j5181K499L1872L509L3817j5043l6442l6032l4654J6998K2569p786
$$ plain form
15752 11234 29929 38469 2166 -20071 -13640 -21435 -10682 11083 4013 -27544 -52029 -65724
15740 -65724 -64106 -55622 9171 29063 10324 21408 5941 30947 61213 40574 16763 20822
15728 20822 277 781 17114 18318 -14377 -10374 -10870 -23834 -42598 -60767 -48699 -66295 -75040
15715 -75040 -72226 -15688 16227 19622 8979 -7918 -33467 -39264 -14490 -4783 11535 12517 6994
15702 6994 21188 39110 59534 43441 55594 48039 21107 10904 2277 -5524 -9588 -18431 -6355
15689 -6355 33117 34643 34076 7345 -26561 -47167 -54291 -36571 22960 41756 20960 6407 2113
15676 2113 13202 -4925 -59217 -39802 20354 53709 36281 27636 -23675 -22220 22170 39340
15664 39340 24159 26658 58530 62039 95856 80813 44371 8339 -26315 -9317 13252 5466
15652E466k1950j1142j173J1192j8590M2028j0765k8366l049J4233K2338K3811
15640B4033J0503q442j4056J8740n243l3746j4641K8881J36j5789J269K2286j4518
15627e87K7580k9084k9910K3712K0585k346J3777k022j2312O048K4838m443j0500
15614B5336K0790M4894k0650o3433k5414k883K2000K1756j0692j6942k3016K99
15602b7955L9445J8577J5353j3250k7342k4659k0207j8903j2513K4660p404k1766
15590g5964K5334J0546M48K8745m580k5838p22K2714J8673j8508J6678r953j3868
15577b6295L6794J0340n5731k8010N4596L4780k2329r728j6035K0682K5863J7640
15565D2567M1537N2053k2340k7354N116r826n9113n2152j6259M004l461N0203
$$ plain form
15652 5466 -16484 -27626 -28799 -17607 -36197 5831 -4934 -33300 -36349 -22116 222 24033
15640 24033 34536 26094 12038 30778 25535 -8211 -22852 6029 6165 -9624 -8355 13931 -587
15627 -587 26993 -2091 -32001 -8289 12296 9950 23727 21705 9393 15441 40279 35836 25336
15614 25336 46126 91020 70370 6937 -18477 -21360 640 22396 11704 -5238 -28254 -27955
15602 -27955 11490 30067 45420 32170 4828 -19831 -40038 -58941 -71454 -46794 -54198 -75964
15590 -75964 -50630 -40084 -39636 -10891 -15471 -41309 -42031 -19317 -644 -19152 -2474 -12427 -26295
15577 -26295 10499 20839 -34892 -62902 -8306 26474 4145 -5583 -21618 -936 24927 42567
15565 42567 84104 136157 113817 86463 91579 81753 22640 -29512 -45771 -41767 -45228 4975
15553D975K1475k3288k5384k1691K1703K3650R080J1443K7921k6991J9500j00
15541D2293K3018K7025k9927j7371J8853m2340k3084L9741j3825L1164J0900j447
15529F5000Q333k8885k2534j6729j8808l1784N364J7065J3534L6078n477j3462
15517G695J478L4557J2328J0460k399p3806p747K00j420J0847K4406J867j0799
15504G667j0001M4548r713l1732K2410M3804j9951m8769l5865K8167j0415K1865
15492B015J9579Q867k720k1414k7047j8714L908L86k6287l0329L3182M4806Q794
15479d974K2026p0680n135M3398K0852K2523l0144o9137J2903L4364K8137K1459
15467B5592j1609j1121P434j9678k878M642q956J6486j4010m059R477j8696k5564
$$ plain form
15553 4975 26450 3162 -22222 -43913 -22210 1440 10520 21963 49884 22893 42393 42293
15541 42293 65311 92336 62409 45038 63891 21551 -1533 38208 24383 55547 66447 65000
15529 65000 73333 44448 21914 5185 -13623 -45407 -40043 -22978 -9444 26634 21157 7695
15517 7695 9173 43730 56058 66518 64119 -9687 -17434 -17234 -18654 -7807 16599 18466 7667
15504 7667 -2334 42214 32501 769 23179 66983 47032 -1737 -37602 -9435 -19850 2015
15492 2015 21594 30461 27741 6327 -20720 -39434 -35526 -35140 -61427 -91756 -58574 -13768 -4974
15479 -4974 17052 -53628 -58763 -15365 5487 28010 -2134 -71271 -58368 -24004 4133 25592
15467 25592 13983 2862 10296 -9382 -12260 -7618 -16574 -88 -14098 -18157 -8680 -27376 -52940
15454e2940R480K5062M255m6117k7435N8159L6993J3869N092k7880J7772R108
15442B5418j5759j4678L9044J0636l4420j156Q354j8777L3909L9899m093k5942
15430D2435j4760L0593o969l6448j6993P204R484L3350j5629M82n359q0627l7348
15417i0585j152J2892J8281M278J734M2844M4473N199k6718R379k753L7162Q861
15404F3895j3720l4802l815j0475j1433K9483k2101j4749J3223L6691p354l6678
15392a1835q408M1109K0429J865j7336J0495L2685k2478l7636J5543R12m0095
15380a4750j6949M881J7728M2591k3017M144L4278K2313J1730j5835l1968l5704
15368e58l1874K2152K2107K9746R321J2543l5527j683O947K6584N493k2751J2677
$$ plain form
15454 -52940 -43460 -18398 -14143 -60260 -87695 -29536 7457 21326 26418 -1462 16310 25418
15442 25418 9659 -5019 34025 44661 10241 9085 17439 -1338 32571 72470 68377 42435
15430 42435 27675 58268 51299 14851 -2142 5062 14546 47896 32267 32749 27390 -53237 -90585
15417 -90585 -91737 -78845 -60564 -56286 -54552 -11708 32765 37964 11246 20625 17872 55034 63895
15404 63895 50175 15373 11558 1083 -10350 19133 -2968 -17717 -4494 32197 24843 -11835
15392 -11835 -20243 20866 41295 43160 25824 36319 69004 46526 8890 24433 25345 -14750
15380 -14750 -31699 -26818 -9090 33501 10484 14628 48906 71219 82949 67114 35146 -558
15368 -558 -32432 -10280 11827 41573 50894 63437 27910 26227 33174 59758 65251 42500 55177
15355E5177p258k2194j451j8458P267m3556j6040O580j413P7625M6551L4789j2814
15342A04805j6005j949j0085j8030l0567l5221J9552M6685j8873j9918J0241K5936
15330E6571J9064n0835r762k776j7437j7719m0283J3084M0002M6626M5165k5829
15318E5871k0157j613j8913L615j593l2987j0904K9808M215N3491r328l3309L5717
15305E3913L9519M354k0615Q424j7576k3289j9785j2417j9015l3605J183K8527
15293a0382M4083O6919K1k3625m055M038j2683N643k3023K0573k946M4385L112
15280A12060l7260k3109j3751k7899j3379q889M2261K1705j3072K2263J1195l3942
15268C8183J3164R243m240K9100L4421l1999k3012J3220J7690l3606j360n593
$$ plain form
15355 55177 47919 25725 24274 5816 13083 -30473 -46513 -39933 -41346 36279 82830 117619 104805
15342 104805 88800 86851 76766 58736 28169 -7052 12500 59185 40312 20394 30635 56571
15330 56571 75635 24800 15038 12262 -5175 -22894 -63177 -50093 -10091 36535 81700 55871
15318 55871 35714 34101 15188 18803 17210 -15777 -26681 3127 7342 60833 51505 18196 53913
15305 53913 93432 97786 77171 85595 68019 44730 24945 12528 -6487 -40092 -38909 -10382
15293 -10382 33701 100620 100641 77016 72961 76999 64316 69959 46936 67509 64563 108948 112060
15280 112060 74800 51691 37940 10041 -3338 -12227 30034 51739 38667 60930 72125 38183
15268 38183 51347 60590 56350 85450 119871 87872 64860 78080 95770 62164 60804 55211
15256E5211k7275P993j4062l6024O0622o707k076M6990L4343p595r635k3855j7970
15243E9960K2309K5628k8196k1470L761J426j9173k7536K5188J8201N274l0924
15231C4448L5751K7500k159J1852l481j1716p871J5190M5908L1410K0690N1343
15219B48865M5173P3527J15381Q8183J21406J91312K05339J78755J53421J63946
15209A585308J47055J25782R9546J6042m3938j02497j02076j17666j85864k03777
15199A217915j82378j73157j37044j22095j03893q8682m7779m1366n9035l1084
15189B31402N101k6354l0804l1562p631l5586q326j190j037K5427k920l7940n037
15176G3543k0395k5048J3427M7835J2434j9572m6632J9049M5634K2662q640L497
$$ plain form
15256 55211 27936 35929 21867 -14157 46465 39758 37682 84672 119015 111420 101785 77930 59960
15243 59960 82269 107897 79701 58231 61992 63418 44245 16709 41897 60098 65372 34448
15231 34448 70199 97699 95540 107392 103911 92195 84324 99514 145422 176832 197522 248865
15219 248865 294038 367565 482946 571129 692535 883847 1089186 1267941 1421362 1585308
15209 1585308 1732363 1858145 1957691 1973733 1929795 1827298 1725222 1607556 1421692 1217915
15199 1217915 1035537 862380 725336 603241 499348 410666 362887 321521 262486 231402
15189 231402 236503 210149 179345 147783 140152 104566 96240 95050 94013 119440 116520 78580 73543
15176 73543 53148 28100 41527 89362 101796 82224 35592 54641 100275 122937 114297 117794
15164A17794N2266k663l2629l5330n634M425m613J0516L0073j7140n6127k3769
15152C7169K0243Q078J0544K0158K5394L147m023k7255M767k1172k5969k798r29
15139D7354L918J0425K0700N583l7945j8809L3313M3406M703N927m043k933M104
15126A15703k4732k5822m563P716L836L2417J2423J4901K3589j1763k3463m0199
15114H0043m739R203k6805M599l2049J6153J8123j8159M053l1547k1924j6115
15102a9164K4084L8823O043j5527L0671J96k5197M0703Q454n1952j0490N732l278
15089B9098K1160M9744j2096j8557J5361j3431j2953L2913K995r469j767m587
15077G8411m016J2596K8714n062l3941n547K3761L2380n3906l6550M8282M649
$$ plain form
15164 117794 170060 167397 134768 99438 93804 98229 93616 104132 134205 117065 60938 37169
15152 37169 57412 65490 76034 96192 121586 124733 120710 93455 98222 77050 51081 48283 47354
15139 47354 51272 61697 82397 87980 50035 31226 64539 107945 112648 118575 114532 111599 115703
15126 115703 90971 65149 60586 68302 72138 104555 116978 131879 155468 143705 120242 80043
15114 80043 75304 84507 57702 62301 30252 46405 64528 46369 50422 18875 -3049 -19164
15102 -19164 4920 43743 49786 34259 64930 65126 39929 80632 89086 37134 26644 32376 29098
15089 29098 50258 100002 87906 69349 84710 71279 58326 91239 94234 84765 82998 78411
15077 78411 74395 86991 115705 110643 76702 71155 94916 127296 73390 36840 85122 89771
15065H9771j8282m0113o086J470l775L545j1816j5926j5716n261J5344j7627M5217
15052B0745M9477n857K2795k638Q689J7865k0353m269m632r783Q136N464j314
15039H4325L3307N2664K7119j55m6564l6597j2958J3902K0135J6535M013K008
15027A57734l9632K5493K8927K5098J5605P872J443k546j9051q076J5294M9149
15015B57310M7937K4772K5908O2784L0705L5992M7446q301l495J7964m436l8343
15003D96243l0084l5860m6266l6066p3987m9220l7859K475J663M308k339O102
14991A99110j7559j2289k082m0098P261K8644L2865R846n448p919j5092k7829
14979A49410l554j388j5020j9805j7527Q335K753L3480m307k2061q686j2221l6636
$$ plain form
15065 89771 71489 31376 25290 26760 22985 26530 14714 -1212 -16928 -22189 -6845 -24472 20745
15052 20745 70222 64365 87160 84522 93211 111076 90723 86454 81822 72039 80175 85639 84325
15039 84325 117632 170296 197415 197260 150696 114099 101141 115043 135178 151713 155726 157734
15027 157734 118102 143595 172522 197620 213225 221097 222540 219994 200943 192867 208161 257310
15015 257310 305247 330019 355927 418711 449416 485408 532854 524553 521058 539022 534586 496243
15003 496243 466159 430299 384033 347967 273980 224760 186901 189376 191039 195347 193008 199110
14991 199110 181551 169262 167180 127082 134343 162987 195852 205698 200250 192331 177239 149410
14979 149410 145856 144468 129448 109643 92116 100451 103204 136684 132377 110316 101630 89409 52773
14966E2773j0412j7170L1507M7905N787p802Q32p333Q79K2709n1163p167P163
14953F8508J060j617N1386K6288j0077N01L1841J5431m2863M2619J8257p3K4908
14940B26169r046l6738k1719j6704o729k150n796R762K2280K4472L2342J9287
14928B35430j1429r929J3779L1788L394j1250k850J5994l6455j0553k3970K9320
14916B23269J9447N062k59j9480k0316R964J0968K1945K057n718k2085j300q691
14903B14863j189O702N4914k99J8608L164N1893L6037k935K186L2854M9756j6288
14890D50266m0407K8767Q5174J6648m4451r900Q1683J6080O838l7397J1489N9144
14878F23934R123L327r374Q178J6966J9399Q755r643j2054J974N426M746n6453
$$ plain form
14966 52773 42361 25191 56698 104603 110390 102588 103420 96087 96966 119675 68512 61345 68508
14953 68508 69568 67951 119337 145625 135548 136049 167890 183321 140458 183077 201334 201261 226169
14940 226169 217123 180385 158666 141962 135233 133083 127287 137049 159329 183801 216143 235430
14928 235430 224001 214072 227851 259639 263033 251783 248933 264927 228472 217919 193949 223269
14916 223269 242716 247778 247519 228039 207723 217687 228655 250600 252657 246939 224854 223554 214863
14903 214863 213674 220376 275290 274991 293599 296763 348656 384693 381758 383944 416798 466554 450266
14890 450266 409859 438626 523800 540448 495997 486097 567780 583860 590698 553301 564790 623934
14878 623934 633057 636384 627010 635188 652154 671553 680308 670665 658611 660585 666011 670757 614304
14865F14304q4570m5145M703J3080m1825l0967J3429J8193L5950N771m4649K928
14853D61202K9073K6718j2689r81j1802r101Q319N926m784J3501L1940K4200q517
14840E53005J1452J7497J5413J3288j3404Q034J7332J0214j5755L5991O9536M3834
14828G66437R7144Q9419M8840r644p603k7691k4068M3468P0706K3674K9422J7999
14816A118103L8203M1661K7687O2762N6653P3810Q7018R0988Q4094O6047M0850
14805A787876P8254J03338R4585N8821M9956M7404J24626J19254R4232J47664
14795B706010J68603J96770K14397K21989K47475L25330M00289M55984N12940
14786E449787N06220M98980N41811N56663N88107O11345O01909O36520P82920
$$ plain form
14865 614304 529734 484589 489292 502372 460547 429580 443009 461202 497152 502923 458274 461202
14853 461202 490275 516993 504304 503323 491521 482420 490739 496665 491881 505382 537322 561522 553005
14840 553005 564457 581954 597367 610655 597251 605285 622617 632831 617076 653067 722603 766437
14828 766437 863581 953000 1001840 992196 984593 956902 932834 976302 1047008 1070682 1100104 1118103
14816 1118103 1156306 1197967 1225654 1288416 1345069 1418879 1505897 1596885 1680979 1747026 1787876
14805 1787876 1866130 1969468 2064053 2122874 2172830 2220234 2344860 2464114 2558346 2706010
14795 2706010 2874613 3071383 3285780 3507769 3755244 4080574 4480863 4936847 5449787
14786 5449787 5956007 6454987 6996798 7553461 8141568 8752913 9354822 9991342 10774262
14777A0774262Q90042J088377J426122J804124K179453K609227L092967L656363
14769B7520937M309650N092558O081345P426810R425801J2229905J5927373K0629664
14761A08644043K5968645L1107255L4642525L6279235L6623906L5036833K9963585
14754C38266027K1097795J0488201L5615j0031531j9590606k8123652l3829090
14747B78312759l5582184l4479584l2227166k9449917k5415475k0414912j5877484
14740H4866037j2588881j0361099q734171p502540o457418n549738m666469l962239
14732B5043482l308009k746886k172605j743874j411065j187594r86744q18249
14724A0668456o80085n48784m27145l41622j87181q7653K0756N9019J62350J61813
$$ plain form
14777 10774262 11664304 12752681 14178803 15982927 18162380 20771607 23864574 27520937
14769 27520937 31830587 36923145 43004490 50431300 59857101 72087006 88014379 108644043
14761 108644043 134612688 165719943 200362468 236641703 273265609 308302442 338266027
14754 338266027 359363822 369852023 369887638 359856107 340265501 312141849 278312759
14747 278312759 242730575 208250991 176023825 146573908 121158433 100743521 84866037
14740 84866037 72277156 61916057 53181886 45679346 39221928 33672190 29005721 25043482
14732 25043482 21735473 18988587 16815982 15072108 13661043 12473449 11486705 10668456
14724 10668456 9988371 9439587 9012442 8670820 8483639 8395986 8416742 8475761 8638111 8799924
14714H799924J75180J16251j345j44022k81732m07903m96061n89960o75207o06162
14704E888963n29424n04746m15801l64224k94430k72913k29353j89946k13726
14695B874400j99500j44787j42152j02753r3599r5296o3175m8719o6026n8348
14685A860045o8905m1778m4531n4589m9674m3005l4695n9608o2397n1465l9991
14674A309407k2210l6489m6877J3136l4249p6235n4149k6211n273j4662K64o5198
14662I41254o2209N092j1733k5746k5414j8573k5748k2971l8932N697q557l3610
14650F78550k3155L4098J3614j7291R481Q971j4625m0796l9493j1146J0167k7398
14638E80977k0849q50n5374J4491M1034P3929L566k3408k1240N3647O0145K1747
$$ plain form
14714 8799924 8975104 9091355 9090010 8945988 8664256 8256353 7760292 7170332 6495125 5888963
14704 5888963 5359539 4854793 4438992 4074768 3780338 3507425 3278072 3088126 2874400
14695 2874400 2674900 2530113 2387961 2285208 2191609 2096313 2033138 1984419 1918393 1860045
14685 1860045 1791140 1749362 1704831 1650242 1600568 1557563 1522868 1463260 1400863 1349398 1309407
14674 1309407 1287197 1250708 1203831 1216967 1182718 1106483 1052334 1026123 1020850 1006188 1006452 941254
14662 941254 879045 884137 872404 846658 821244 802671 776923 753952 715020 720717 712160 678550
14650 678550 655395 689493 703107 685816 695297 704268 689643 648847 609354 598208 608375 580977
14638 580977 560128 559278 503904 518395 559429 633358 636924 613516 592276 645923 706068 727815
14626G27815J959q187J4049j0213K3986K179o6982m7176R487K5607l9625l1009
14614F01890j6998l2230m7749m5639p1200n4791l4771m915j5700k969K103J0087
14602B87118l0800k0104j0320J5103K046N702k1835k5816J0872L430J0622p588
14590B18430m4699j0106J1160j0646m455o318k9210R323P1601J8111j88J170J7797
14577B41970j0682J5471K1142J8689J1124M626j7643l8189m3319l6815J610O893
14565A74877j9546j4531j844o0015m0995K8420L5233J831k6319L0698N56m8572
14553E9793k6555o774M4506K8284q658l38J0982j368n322k2168j904j061N410
14540G4827J4898l47J6589Q749j0861n020q862J7008q612J1505m546j3825J9458
$$ plain form
14626 727815 729774 721587 735636 725423 749409 751588 684606 637430 646917 672524 632899 601890
14614 601890 584892 552662 504913 459274 388074 333283 298512 293597 277897 274928 277031 287118
14602 287118 256318 236214 225894 240997 243043 248745 226910 201094 211966 215396 226018 218430
14590 218430 173731 163625 174785 164139 159684 153366 124156 133479 205080 223191 223003 224173 241970
14577 241970 231288 246759 267901 286590 297714 302340 284697 246508 203189 166374 167984 174877
14565 174877 155331 140800 138956 78941 37946 66366 101599 103430 77111 107809 108365 59793
14553 59793 33238 26464 70970 99254 90596 90258 101240 99872 94550 72382 70478 69417 74827
14540 74827 89725 89378 105967 114716 103855 98835 89973 106981 98369 109874 105328 91503 110961
14527A10961P741J3714k8042k5113j1754m765l6002K7132K0261k5756O904j3175
14515D2106O384J3690J321K2983n3032m4117J5709J1712J4097j2814l001K2967
14503C8005l2395l7266K2057J0963N399J304k2240J5163l0929k638J0143J4799
14491g635J6507O377n0384m1217n065L0838L2367k3478K5609J2568K8531J8030
14479D3048M967k2042o7255j9869N7909N7795l9661j4758l2913n2593J6002L6072
14467c3298K1060l025j8306l9174l0585N732j49M929k3739m873O3191M0073L9422
14454B1258J8348m525K7210M3631K1942K961J5634K6792m516j423k6383k6983
14442A13946l4850o192j8369K5388L9750j2219n8624n406j8212M320k0327l441
$$ plain form
14527 110961 118702 132416 104374 79261 67507 62742 26740 53872 74133 48377 55281 42106
14515 42106 48490 62180 63501 86484 33452 -10665 5044 16756 30853 18039 15038 38005
14503 38005 5610 -31656 -9599 1364 6763 8067 -14173 990 -29939 -32577 -22434 -7635
14491 -7635 8872 15249 -35135 -76352 -81417 -50579 -18212 -41690 -16081 -3513 25018 43048
14479 43048 48015 25973 -41282 -61151 -3242 54553 14892 134 -32779 -85372 -69370 -33298
14467 -33298 -12238 -15263 -33569 -72743 -103328 -97596 -97745 -92816 -116555 -121428 -58237 -18164 21258
14454 21258 39606 35081 62291 105922 127864 130825 146459 173251 168735 167312 140929 113946
14442 113946 79096 72904 54535 79923 119673 107454 48830 43424 25212 29532 9205 5764
14430E764q620l592N0013J7043k0718k3327n713k4330j7886J7766K3323k7007
14418a7284N834N594J6925k7530n8209K4321L4131L0576n003l055j7516q644J7839
14405b021P945q50j1521J4788K910K6373K8237K6994l1605o732j0144r113J0166
14392D5427k3855m0807J9616K4821k823l4666q516l0866M544K3722j0723m477
14380c8603L6530M392j4130m0425P085J7434J0524j0399m229K9778p274P120o569
14367h766J0503J8301K7349k4737k9289j4726k9737r481o3j2256j1439K2138L7816
14354b4387k4912j1639M1314K5859O632R642k1237L297k1724j5238J8156L669
14342a0568O425J9779J1693N535j4039K1678n6218j8582M9799L3904M021k4219
$$ plain form
14430 5764 -2856 -6448 43565 60608 39890 16563 10850 -13480 -31366 -13600 9723 -17284
14418 -17284 -11450 -5856 11069 -16461 -74670 -50349 -16218 14358 9355 6300 -11216 -19860 -2021
14405 -2021 5924 5074 -6447 8341 11251 37624 65861 92855 61250 54518 44374 35261 45427
14392 45427 21572 -19235 381 25202 22379 -12287 -20803 -51669 -47125 -23403 -34126 -38603
14380 -38603 -2073 2319 -11811 -52236 -45151 -27717 -17193 -27592 -31821 -2043 -9317 -2197 -8766
14367 -8766 1737 20038 47387 22650 -6639 -21365 -51102 -60583 -60646 -72902 -84341 -62203 -24387
14354 -24387 -49299 -60938 -19624 6235 12867 22509 1272 4569 -17155 -32393 -14237 -10568
14342 -10568 -4143 15636 27329 32864 18825 40503 -15715 -34297 15502 49406 53427 29208
14330B9208J4397K2180O642m6770l4631J2904l1999m487R281K9181J4219r363
14318A0762K9972K6781R797J3564K4697p343r168J2662R448J2042K7726J9862
14306A80802K4260M7061Q2104O8276Q7534R4526J33202J55621J78410K00447K18529
14295A470772J75587J39730J00653N2692l9500m7508q0121j67490j53910j61848
14285A289057j94181j86104j41953j10076j06550r1983m2578m9614o7386n4344
14275B44288p518k4560m7391k0343P205l6624k9038Q196J295j6305J8686K4241
14263A22132p455k6830k7217j619j5441j1584j728j5013K2585J2859L1173q732
14251G3130k2374K9965n38J2575L0464q414n1508k9064k7665N334K6824m6198
$$ plain form
14330 29208 43605 65785 72427 25657 -8974 3930 -28069 -32556 -23275 5906 20125 10762
14318 10762 40734 67515 77312 90876 115573 108230 99062 111724 121172 133214 160940 180802
14306 180802 205062 252123 334227 402503 490037 584563 717765 873386 1051796 1252243 1470772
14295 1470772 1646359 1786089 1886742 1939434 1899934 1852426 1772305 1604815 1450905 1289057
14285 1289057 1094876 908772 766819 656743 550193 458210 415632 366018 298632 244288
14275 244288 236770 212210 164819 144476 151681 115057 86019 94215 95510 79205 97891 122132
14263 122132 114677 87847 60630 59011 43570 31986 30258 15245 37830 50689 81862 73130
14251 73130 50756 80721 80183 92758 123222 114808 63300 34236 6571 11905 38729 -7469
14239g469m4940R804L1919J8875K1185K5063k0890m4877j6260K1863Q472j3577
14227a0832l1875J6067N0251k4338J4898M7129N39l0822j1866l1591J5590K3601
14215B6751k3160k9868n2759J2491K8516L5771J5456K0491M2071j2791n7773k2503
14203a7307N085k870J094r062J6861L1599j125Q217l7626P813K530q280k6430
14190b9501J4415L2200M5448N063K1202l5290n9016j1629k2329l037l9350M291
14178g7533O4347K5329j0982j6094L345L0803k6262j2122n776j1846K0190P812
14166h789J0297k9040m772J0603L7704K8949j6191k0607j2595n305M0020q475
14154B1799k3602l0463k3481J8757J2801J0626l7889l0544J5826L2465O420J4615
$$ plain form
14239 -7469 -52409 -42605 -10686 8189 29374 54437 33547 -11330 -27590 -5727 2745 -10832
14227 -10832 -42707 -26640 23611 -727 14171 61300 61839 31017 19151 -12440 3150 26751
14215 26751 3591 -26277 -79036 -66545 -38029 -2258 13198 33689 75760 62969 5196 -17307
14203 -17307 -12222 -15092 -13998 -23060 -6199 25400 24275 32492 -5134 2679 5209 -3071 -29501
14190 -29501 -15086 17114 62562 67625 88827 53537 -5479 -17108 -39437 -42474 -81824 -77533
14178 -77533 -13186 12143 1161 -14933 -11588 19215 -7047 -19169 -24945 -36791 -16601 -8789
14166 -8789 1508 -27532 -32304 -21701 16003 44952 28761 8154 -4441 -9746 30274 21799
14154 21799 -1803 -32266 -55747 -36990 -24189 -13563 -51452 -81996 -66170 -33705 -27285 -12670
14142a2670J6254k9198L414q853J4972n356M890J75K8664L8258k8241l6315J0739
14129c267K1116J8820m675j9150o057j7075J3136K1417J3496k0358j6828k3121
14117b2546k2074k0778P12M834L6070M0961M976k7894p3J7257J8211m1403m9467
14104f1214j4995M0039L0523J5330K5929M602k2616l127K2159j2839l6925J3872
14092G38K9113P419N998k5585Q882k7642l1206j6349N586K8192n896q730m635
14079c4115O165R619J4547J18J0521K8366K1943n141j7308l0675j3274j1390L4816
14066A4192K6631k1258m864J3336j7887J5689N6491P022m4185m8510M950k7706
14054b6099L8438Q922j9676j6504K6698P610J7471l1116o636J9816P383Q811j6752
$$ plain form
14142 -12670 3584 -25614 -22200 -31053 -16081 -21437 -16547 -16372 12292 50550 22309 -14006 -3267
14129 -3267 17849 36669 31994 12844 6787 -10288 2848 24265 37761 17403 575 -22546
14117 -22546 -44620 -65398 -64686 -59852 -23782 17179 22155 -5739 -5812 11445 29656 -11747 -61214
14104 -61214 -76209 -36170 -5647 9683 35612 40214 17598 14471 36630 23791 -13134 738
14092 738 29851 37270 43268 17683 26565 -1077 -32283 -48632 -43046 -14854 -20750 -29480 -34115
14079 -34115 -27950 -18331 -3784 -3666 6855 35221 57164 52023 34715 4040 -9234 -20624 14192
14066 14192 40823 19565 14701 28037 10150 25839 82330 89352 45167 -3343 1607 -26099
14054 -26099 12339 21261 1585 -14919 11779 19389 36860 5744 -892 18924 26307 35118 18366
14041A8366k0613j0289p543J6589R86N2015L5497j7098k7797k6009m582J0939
14029B0461J3269l3389j6398j0859L2365L9150K5772M5188k231J6064P7337P0821
14017B77550N1786K2355J1908J5649J4503M8803J1087n604l3625r8787o4987m1669
14005B08969k9186k2243k4629M925K2841R290K4095m2060k0562p83L1295J364
13993A63316N059q386L5346P9657P4076N7295N1694P9785Q0917P2002J38293J48165
13981I77219J85095K20661L20684N10387P02152Q84605J000931J056039J009520
13972F867293P47227M32836R6547l63429p46730r26058j050277r51586p96697
13963C309126o82608m89791l40038k61513j88001j45891j18136j00804r1423o6574
$$ plain form
14041 18366 -2247 -12536 -20079 -3490 -2504 49511 85008 67910 40113 14104 9522 20461
14029 20461 33730 341 -16057 -26916 5449 44599 70371 115559 113328 129392 206729 277550
14017 277550 329336 351691 363599 379248 393751 442554 453641 448037 414412 315625 250638 208969
14005 208969 179783 157540 132911 137836 160677 169967 194062 152002 131440 130657 161952 163316
13993 163316 168375 159989 195335 274992 349068 406363 458057 537842 618759 690761 829054 977219
13981 977219 1162314 1382975 1703659 2214046 2916198 3800803 4801734 5857773 6867293
13972 6867293 7614520 8047356 8143903 7780474 7033744 6107686 5057409 4105823 3309126
13963 3309126 2626518 2136727 1796689 1535176 1347175 1201284 1083148 982344 890921 824347
13953H24347n2959o248L4602k6582j4445J4518l8585l7539m1627j18900j01128
13942D35454m5937r2094n8458k3359m3840l1980j2663o275j3833Q390n6j8644
13930I6705J1174J8144l5336j179n366J5064k9235n3744k702N045k4725j7081
13918b3236O214j438J759K524R417j956j4782L3993L2044k3664l3043l5607P901
13905c9874N2096L5123l129K0840m5154m1536K1851L6998J8167m550O99J4157
13893F5688Q31m8103K749L413j5658j6688n037J1434L0541J3006l8303k6685q956
13880c1768k9013J8343O068J6034K4901M9864J0284m057k0286j2963k2314J2306
13868A7399L8684p430K3976L0494j3916k3746J5544p276m1286K1104j5161J1018
$$ plain form
13953 824347 771388 765140 799742 773160 758715 773233 734648 697109 655482 536582 435454
13942 435454 389517 297423 238965 215606 171766 139786 127123 120848 107015 115405 115349 96705
13930 96705 107879 126023 90687 89508 84142 99206 69971 16227 13525 18570 -6155 -23236
13918 -23236 -17022 -18460 -16701 -14177 -4760 -6716 -21498 12495 44539 20875 -12168 -47775 -39874
13905 -39874 12222 47345 44216 65056 19902 -21634 217 37215 55382 50832 51531 65688
13893 65688 66519 18416 21165 24578 8920 -7768 -12805 -1371 29170 42176 3873 -22812 -31768
13880 -31768 -60781 -42438 -36370 -20336 4565 54429 64713 60656 40370 27407 5093 17399
13868 17399 56083 48653 72629 103123 89207 65461 81005 73729 32443 53547 38386 49404
13856D9404K2231k7341k2721l841k3931O550r75J271n747K3440K303J457M5218
13843F7318K51j063j9334m5450q626L7924M134L348j7223k3047j4087K0323J0283
13830A4751J4400J5004q683l878O184K0684L771k9144j0626q393O017J1553n802
13817B5838j3845j8421J6328K2055L230J66j9469l782Q223l062J2164K7640Q247
13804F5312j6904j6226q756l3234j8446M268k8772J099M7610K593J9605n7895
13792c9746m9138l017M1426L7287K1612j833P860k4556q157K7390o95J2976L4720
13779E6129k283k5715K489j9983p865m103J7874K6936K141o029L95j4900p689
13766A7397l4968m1442M0399O301K97K4534O983j6883p380K434n644r722J3200
$$ plain form
13856 49404 71635 44294 21573 17732 -6199 351 -624 647 -5100 18340 20643 22100 67318
13843 67318 67569 66506 47172 1722 -6904 31020 35154 38502 21279 -1768 -15855 4468 14751
13830 14751 29151 44155 35472 31594 37778 58462 62233 33089 22463 14070 20087 31640 25838
13817 25838 11993 -6428 9900 31955 35185 35351 15882 12100 20323 17261 29425 57065 65312
13804 65312 48408 32182 23426 -9808 -28254 -23986 -52758 -51659 -4049 -1456 18149 -39746
13792 -39746 -88884 -91901 -50475 -13188 8424 6591 14451 -10105 -18262 9128 8433 21409 56129
13779 56129 53846 28131 30620 10637 2772 -1331 16543 43479 45620 39591 39986 25086 17397
13766 17397 -17571 -59013 -18614 -12313 -12016 12518 19501 2618 -4762 -2328 -7972 -17694 -4494
13753d494L5010r380j6927j4197J9733K1293j7739k9450j5172k5984R070K4669
13741b3568J5242j1218j6507p106K7929J3869M1434O473P075n495m0877l4317
13729b7066Q806J0052J2829l3885l6204J6278K0748L4208K3102p72j8463J4122
13717B3755P102K8001n539l1003n5024M656m594l6096l0066J4636M2552r641J879
13704d9382n380M6025L3880j5659k0949J6494n705k6546Q470P833o3405p493N3761
13691b8056K3594J1142K7906k779j1213q210J4113q017j6821K3813K6190M243
13679E5905j799j3306k5342k6026p155k3453j8946Q410J376J9493M3364N1880
13667F4401P02p746J2584k757N536J7652p365K3297K0757M822K1607P49L9838
$$ plain form
13753 -4494 30516 21136 4209 -9988 9745 31038 13299 -16151 -31323 -57307 -48237 -23568
13741 -23568 -8326 -19544 -36051 -43157 -15228 -1359 40075 46548 53623 48128 7251 -27066
13729 -27066 -18260 -8208 4621 -29264 -65468 -49190 -28442 5766 28868 28096 9633 23755
13717 23755 30857 58858 53319 22316 -32708 -28052 -32646 -68742 -98808 -84172 -41620 -51261 -49382
13704 -49382 -54762 -8737 25143 9484 -11465 5029 -676 -27222 -18752 -10919 -74324 -81817 -28056
13691 -28056 -4462 6680 34586 31807 20594 12384 26497 18480 1659 25472 51662 55905
13679 55905 54106 40800 15458 -10568 -17723 -41176 -60122 -51712 -50336 -30843 12521 64401
13667 64401 65103 57357 69941 67184 72720 90372 83007 106304 127061 131883 153490 154239 194077
13654A94077M825Q0934J03813J28822J21390J41600N5524r3504j90040j32708
13644D14733n9745q8091o3097m6010J4678j5660J7847P291n4515n560j3013k4002
13632H4856k090m7957k1307P368J7454O49J3479L0904L4750J8027j7589L954O136
13619A28634K5200O8249L153k8481N7882K4384J358L4048Q2143J26587J71657
13608F94814K29523L48864L82096M09075L96113J86526j72641n34946n00378l38361
13598A100685k30430j33024j14168p3378r0058q6740o7937j7772m6057o6071l5190
13587A39860O470j0614j5016m2301l5231j1939L7264K1887L0746J0668j1616k8776
13575I1402P168L5191L4539J2851L6164L0980O2274P2085N8738N3568Q5602J15330
$$ plain form
13654 194077 198902 279836 383649 512471 633861 775461 830985 737481 547441 414733
13644 414733 354988 266897 203800 157790 172468 156808 174655 181946 127431 121871 108858 84856
13632 84856 82766 34809 13502 20870 38324 38973 52452 83356 118106 136133 118544 122498 128634
13619 128634 153834 222083 225236 196755 254637 279021 280379 314427 396570 523157 694814
13608 694814 924337 1273201 1655297 2064372 2460485 2647011 2474370 1939424 1439046 1100685
13598 1100685 870255 737231 623063 549685 459627 372887 304950 287178 241121 175050 139860
13587 139860 146330 135716 120700 78399 43168 31229 68493 90380 121126 131794 120178 91402
13575 91402 98570 133761 168300 181151 217315 248295 310569 382654 441392 494960 580562 695892
13563F95892K06052K95365M18587M58544M20336K56258j28658n29483n37730l64904
13553A190259k42485j43553j37314j23165o3671o5174n1558n2110n2555o5246
13543A93428m9609o056l599m0378l6960j9481N8922J4415Q362K6387l378k5705
13531A16348o0883k40J7127q352J3668M4867N0543j4081j9003j7450P251M8885
13519A78680O6552M3336O6123J50749J45363J33452J07567j5275j43551j64588
13509E68408j12627j30630o8349m0366m8716K632J4804k6100k4486j3636j8178
13498A02756k3601j6161m2154J0492K560j0197J0897N3677J8091J4741j0351m1730
13486F9020k8665K6302J4315l4633l8982L3487q904k1465j0763J1394K3580j4101
$$ plain form
13563 695892 901944 1197309 1615896 2074440 2494776 2751034 2622376 2092893 1555163 1190259
13553 1190259 947774 804221 666907 543742 480071 414897 363339 311229 258674 193428
13543 193428 143819 137763 134164 93786 56826 37345 96267 110682 119044 145431 142053 116348
13531 116348 55465 55225 72352 64000 77668 122535 173078 158997 139994 122544 129795 178680
13519 178680 245232 288568 354691 505440 650803 784255 891822 876547 732996 568408
13509 568408 455781 325151 256802 216436 167720 170352 185156 159056 134570 120934 102756
13498 102756 79155 62994 20840 31332 33892 23695 34592 88269 106360 121101 110750 69020
13486 69020 40355 66657 80972 46339 7357 40844 31940 10475 -288 11106 34686 20585
13474B0585n928K0072K039N302k1394n7624k4077O7734L5864l2238k2041J2580
13462H74j8865m2354p354J5566k6270L3016L4098K7200J3190J7564K9938l0591
13450D6012m7618P19M139L2666K3980k6741j7187L6541J9838l6949o0754l3073
13438e8427K0963K9346M2491j7525m3473j3783l588l604K9996N246k2577j8492
13426e3427J612L1843j6433r969N4638l135k8689j9333J2262R756l5317j664M1617
13413a6239J2539m0657l834k7830J4340M0135J6944m6521j1991J6918K6436J8553
13401a207K2495L6304l4273m3932k2728K3410K7360l5616o286j9137k7072J6252
13389f4430O36J3808Q549p669k2747J578K1995P445p98M806k784K4746j147l0300
$$ plain form
13474 20585 14657 34729 36768 42070 20676 -36948 -61025 6709 42573 10335 -11706 874
13462 874 -17991 -60345 -67699 -52133 -78403 -45387 -11289 15911 29101 46665 76603 46012
13450 46012 -1606 -887 3252 35918 59898 33157 15970 52511 72349 35400 -25354 -58427
13438 -58427 -37464 -8118 34373 16848 -26625 -40408 -43996 -47600 -17604 -12358 -34935 -53427
13426 -53427 -51815 -19972 -36405 -46374 8264 5129 -23560 -42893 -30631 -20875 -56192 -57856 -16239
13413 -16239 -3700 -44357 -48191 -76021 -61681 -21546 -4602 -51123 -63114 -46196 -19760 -1207
13401 -1207 21288 57592 23319 -20613 -43341 -19931 7429 -28187 -34473 -53610 -80682 -64430
13389 -64430 -63794 -49986 -41437 -49106 -71853 -70275 -48280 -40835 -41633 -36827 -39611 -14865 -16012 -46312
13375d6312J9534j9306k0552p289N2098K2740j0256l996L6866j8864P969J0910
13363B3542k3216r653j7543L1078p657l256l1070k1030j6252j9879k1540Q461
13351a08015N2016L0632r532n617K7228J4837l8387p703o485m618k797l612J1589
13338e0464K6786J3120J9451k4142J7436j5262Q011O4472J5255k5196q262J7136
13326E8341j9298k9792p01M9434l6150j8731j2434l0431j2440L2310M613l7405
13314e2684J6710L1137l616j3746K2432J067M890K4762J8838r817k0718P804J6565
13301D3624J4463k9491l5881L0636p25k0797K3805k2807q65j6711j0093J9652
13289e190j9382k2002J1223L5503M126M628M455l3983j9564J2579L470P01N605
$$ plain form
13375 -46312 -26778 -46084 -66636 -73925 -21827 913 -9343 -13339 23527 4663 12632 23542
13363 23542 326 -9327 -26870 4208 -3449 -6705 -37775 -58805 -75057 -94936 -116476 -108015
13351 -108015 -55999 -25367 -34899 -40516 -13288 1549 -36838 -44541 -51026 -55644 -58441 -62053 -50464
13338 -50464 -23678 -10558 8893 -15249 2187 -13075 -5064 59408 74663 49467 41205 58341
13326 58341 39043 9251 8550 57984 21834 3103 -9331 -39762 -52202 -19892 -15279 -52684
13314 -52684 -35974 -4837 -8453 -22199 233 1300 6190 30952 49790 39973 19255 27059 43624
13301 43624 58087 28596 -7285 23351 22626 1829 25634 2827 1962 -14749 -24842 -5190
13289 -5190 -24572 -46574 -35351 152 4278 8906 13361 -20622 -40186 -27607 -24137 -23436 -17831
13276a7831k7289q445J6246L1006R416L7008q255k8893J9358J629m153j4773l8176
13263c3152j995j6296J738n408K6351k3826l9426J657k0968Q499L3022N7348k711
13250a5167k8872J2093M5115j5137n005k4810q680r623n505K6953j8269J9379
13238b7528K314l8737p978K1834J1679n0749k4504M7102L3860K8584l460k210
13226i793J7635o287r16K6069K8268j1225p5334l538J7950L7818K9582n4685k1759
13213b6215L1564R926n0026m8597n880K0749J6952J2287K3932n175j7165J6951
13201b0697l693j4117n995m56j0090N556L3965m412l0226j0986k0408J6688P2688
13188G817M437J1398l382l1999K8041J0725j6351j145j0658n358k3949j1216Q828
$$ plain form
13276 -17831 -45120 -53565 -37319 -6313 3103 40111 31856 2963 22321 23950 19797 5024 -33152
13263 -33152 -35147 -51443 -49705 -55113 -28762 -52588 -92014 -90357 -111325 -102826 -69804 -12456 -15167
13250 -15167 -44039 -31946 13169 -1968 -6973 -31783 -40463 -50086 -55591 -28638 -46907 -27528
13238 -27528 -25214 -63951 -71929 -50095 -38416 -89165 -113669 -66567 -32707 -4123 -7583 -9793
13226 -9793 7842 1555 639 26708 54976 43751 -31583 -35121 -17171 20647 50229 -4456 -26215
13213 -26215 5349 15275 -34751 -83348 -89228 -68479 -51527 -39240 -15308 -20483 -37648 -20697
13201 -20697 -24390 -38507 -44502 -44958 -55048 -49492 -15527 -19939 -50165 -61151 -81559 -64871 7817
13188 7817 12254 23652 20270 -11729 16312 27037 10686 9541 -1117 -6475 -30424 -41640 -32812
13175c2812K1268R44k4056R019R770J2756M0572p593p8098k8938L7083o857l377
13162e0319J7309J1406J2832p553K8217O781m8651l7492j1135J9250J8863K4754
13150a5738M23p713p388l0366P702K1943M9139j6410m3156J0363r574K728P397
13137c0650K9391K4503p917k4785K8142P151k3261j9899K0924O356K2977k2020
13125A0912n1156j3216J4443J8428L6162J5756j0194j7350j2541K5673j7337J1832
13113A1412m911k8241L9796K3088j3604Q21L010K4678k3408n4264o6r502n09L0987
13099g13K3733N712j1559K3543K8359j5451J1927O796j5444J153j9674l950J6318
13086E0750Q563N000J1624k5100q865J4029m971k9853l3077m978O6J8575j8108
$$ plain form
13175 -32812 -11544 -10600 -34656 -25637 -15867 -3111 37461 29868 -48230 -77168 -40085 -46942 -50319
13162 -50319 -33010 -21604 -8772 -16325 11892 18673 -29978 -67470 -78605 -59355 -40492 -15738
13150 -15738 -15315 -23028 -30416 -60782 -53080 -31137 18002 1592 -41564 -31201 -40775 -38047 -30650
13137 -30650 -1259 23244 15327 -9458 18684 25835 2574 -17325 3599 9955 32932 10912
13125 10912 -40244 -53460 -39017 -20589 15573 31329 21135 3785 -8756 16917 -420 11412
13113 11412 6501 -21740 18056 41144 27540 28361 31371 56049 32641 -21623 -21689 -31191 -31700 -713
13099 -713 23020 28732 17173 40716 69075 53624 65551 72347 56903 58056 38382 34432 50750
13086 50750 59313 64313 75937 50837 41972 56001 51030 21177 -11900 -16878 -16812 1763 -16345
13073a6345r97K0847Q865l99J8991j0023k6025r895K8045j5946k8042o863K5374
13060a2413K791j2589K9107n6794L407M2670L6023N396l6390k1967m198k1372
13048d6329p293K2901K1253L9210m308J5827k2532n2521K0073N646Q665M211J7071
13035B1874m4180j4625J5050J2382j1034K702m5212m270K8274P5j10m236O73J6049
13021b6588J1130M4680K0399J3908j293o854k7251k8934l302J4665J0940Q715
13009C0215q827k4624p94p2L30M696l1464m635Q303o268N618K0144K4509J5860
12995C2991J58j4267l8942J1793m981j1897j2067J6149K0347L1388L70l1186j8474
12982a8618k2237l3216M995j0129J9132J8335N738J3807J2370j9022L0940J9086
$$ plain form
13073 -16345 -17342 3505 12370 11971 30962 20939 -5086 -14981 13064 -2882 -30924 -37787 -12413
13060 -12413 -9622 -22211 6896 -49898 -46491 -3821 32202 37598 1208 -20759 -24957 -46329
13048 -46329 -53622 -30721 -9468 29742 25434 41261 18729 -33792 -13719 -8073 592 4803 21874
13035 21874 -22306 -36931 -21881 -9499 -20533 -17831 -63043 -67313 -39039 -38964 -39074 -43310 -42637 -26588
13021 -26588 -15458 29222 49621 63529 62236 55382 28131 -803 -4105 10560 21500 30215
13009 30215 21388 -3236 -4030 -4102 -3772 924 -30540 -35175 -26872 -33140 -27522 -7378 17131 32991
12995 32991 33149 18882 -20060 -8267 -13248 -25145 -37212 -21063 -716 30672 31042 -144 -18618
12982 -18618 -40855 -74071 -69076 -79205 -60073 -41738 -36000 -22193 -9823 -28845 2095 21181
12970B1181q194J0679k3997q325j4331J5517N5216P04j4362K9255m941m5939r338
12957C125P744N987Q728l1888J0077j681K028k8109n859J2163l2277J2961Q145
12944b8856M384N815L0207J1459J0250L7149N500n6505k1148j4654l2877q150
12932e7426K8546k4208p064L465q441k4967K3642K0331R391L4518K4504k8915
12920f624j3474K0996j7287m9942j199j8623J6142J9295k3403L194j281K1811
12908e0395J1837j6330J9711j6147L835J4221K1837J5304K4586J8508K628k0285
12896B9310K1566j4884j7558k065o305J4746R18N403k7748N34J4496O043m1924
12883a7468k6911k4467j3921L434m517L0899j0027m081L9142L9283J4199j9449
$$ plain form
12970 21181 12987 23666 -331 -8656 -22987 -7470 47746 48450 34088 63343 58402 12463 3125
12957 3125 10869 16856 25584 -6304 3773 2092 4120 -23989 -29848 -17685 -49962 -37001 -28856
12944 -28856 -24472 -18657 11550 23009 33259 70408 75908 19403 -1745 -16399 -49276 -57426
12932 -57426 -28880 -53088 -60152 -56687 -65128 -90095 -66453 -46122 -36731 -2213 22291 -6624
12920 -6624 -20098 898 -16389 -66331 -67530 -86153 -70011 -50716 -74119 -70925 -72206 -50395
12908 -50395 -38558 -54888 -35177 -51324 -47489 -33268 -11431 3873 28459 46967 49595 29310
12896 29310 50876 35992 18434 16369 10064 24810 25728 31131 3383 3917 18413 24456 -17468
12883 -17468 -44379 -68846 -82767 -79333 -83850 -52951 -62978 -67059 -27917 11366 25565 6116
12871F116J3879J2137Q831J6071K760k2619m1760k4182L5483K8289K0555l214
12859E2346M3267L8397k6025J0423K7542o275Q5924J23290R2013J45217K20936
12848H07055K00056J03714r6816k63162k52425j09791p2560n9332k8528m8199
12838A80012k7380K1230k5057k1142J3962j5679k513l0354m3817n3726k102K42
12826f324K959m468m5800m78Q71k1016J9026K4123K6811l21r856J2079n598j2853
12812b0845K1742j3849L2033o627j0011O43k60j4880K0225K1176p978M4208l6360
12799B9217j9407k2015p307p404M0748M274n515n333k3132o871L285L408J2550
12786c502j3645K7415n188J838k8344l0917K2118j5704j6219o23L3816K8500L3686
$$ plain form
12871 6116 19995 32132 40963 57034 59794 37175 -4585 -28767 6716 35005 55560 52346
12859 52346 95613 134010 107985 118408 145950 139675 225599 348889 440902 586119 807055
12848 807055 1007111 1110825 1014009 750847 498422 388631 316071 256739 228211 180012
12838 180012 152632 173862 148805 127663 141625 125946 123433 93079 49262 -4464 -6566 -6324
12826 -6324 -3365 -7833 -53633 -54111 -53240 -74256 -55230 -31107 -4296 -4617 -14473 -2394 -7992 -20845
12812 -20845 897 -12952 19081 12454 2443 3086 2826 -12054 8171 29347 21369 65577 29217
12799 29217 9810 -12205 -19512 -26916 13832 18106 12591 7258 -15874 -22745 -19460 -16052 -3502
12786 -3502 -17147 10268 5080 6918 -21426 -52343 -30225 -45929 -62148 -62771 -28955 -455 33231
12773C3231k228O727K500k9962j4474j2763J0793R083J0938P011k0634k0402k0922
12760d1102J5912R942K0406j3005j7502K4205l123k1990N6681k6108j8342J0741
12748c285j8564K931L3387p970J7770L524k6674p349N756J9915K531n6928l599
12735c8555K9994j2747j4663L672j354l447l804k758J8771o778k12k730m4701
12722g9312O838M7156q272K0498j3097K8633l1218n2420L1734N5673j2687k0653
12710b7127M632K6155k1532l0855P433k060k0812k4741M0809J4524o106J2114
12698b7566j2593J7470j1695K9146J6470j4244P870J8136j8860l792L6991N391
12686D2724o874l5984k1607Q680j4217m9990l765J4400O050L79P665j730M2682
$$ plain form
12773 33231 31003 37730 40230 10268 -4206 -16969 -6176 2907 13845 20856 222 -20180 -41102
12760 -41102 -25190 -15248 5158 -7847 -25349 -1144 -4267 -26257 30424 4316 -14026 -3285
12748 -3285 -21849 -18918 14469 6499 24269 27793 1119 -6230 -474 19441 21972 -34956 -38555
12735 -38555 -8561 -21308 -35971 -32299 -33653 -37100 -40904 -43662 -24891 -31669 -31881 -34611 -79312
12722 -79312 -72474 -25318 -33590 -13092 -26189 2444 -28774 -81194 -49460 6213 -6474 -27127
12710 -27127 -22495 3660 -17872 -48727 -41294 -43354 -64166 -88907 -48098 -33574 -39680 -27566
12698 -27566 -40159 -22689 -34384 -5238 11232 -3012 4858 22994 4134 342 37333 42724
12686 42724 35850 -134 -21741 -13061 -27278 -77268 -81033 -66633 -60583 -60204 -52539 -54269 -11587
12673a1587M3586J3729k2338l9866l8995j809J0450J4775n600N952Q197r830M024
12660b9312l1992k2032L23K7872J1786j2593j9551M558M1199J1659P067R475j3525
12647a5066k7964k4185J9321N2578l990k3227j3187P692L8526p083r788J5258
12635H885J4724r11R85l7269r144j7984J9057L0028J2093l5557m4483N773K1113
12622c2690R625K966L317K076r77Q70J3370J4176k9809R995O662l8118l8210Q210
12608f8537J122K7417J3503K0994K343m3133j6064J5445L711r790K0735L5129
12596B875m0135k5549L8568P293j2393N686J8728L0199P126P144j6115k2775K2915
12583B3567m5590P353K0050K5607N916q30Q805O47m2713l5423k24j1273R152J0399
$$ plain form
12673 -11587 31999 45728 23390 -16476 -55471 -57280 -46830 -32055 -37655 -31703 -23506 -33336 -29312
12660 -29312 -61304 -83336 -83013 -55141 -43355 -55948 -75499 -70941 -29742 -18083 -11016 -1541 -15066
12647 -15066 -43030 -67215 -47894 4684 694 -22533 -35720 -28028 10498 3415 -6373 8885
12635 8885 23609 22698 23683 -13586 -22730 -40714 -21657 8371 20464 -15093 -59576 -53803 -32690
12622 -32690 -23065 -20099 -16782 -14706 -15683 -14813 -1443 12733 -17076 -7081 -419 -38537 -76747 -68537
12608 -68537 -67415 -39998 -26495 -5501 -3158 -46291 -62355 -46910 -43199 -52989 -32254 2875
12596 2875 -37260 -62809 -24241 -16948 -29341 -23655 -4927 25272 32398 39542 23427 652 23567
12583 23567 -22023 -14670 5380 30987 36903 36073 44878 45525 2812 -32611 -32835 -44108 -34956 -24557
12569b4557J5551J6284J1726K2616j2856k8164k7626L3913L7776l5342r530K1563
12557B1354L0925K1173n4682m6114P045J4866J3712Q065J714M266j915K5027j7098
12544B8338m2517J3037K5716k5937j4230O119R655q261l3011K6361K240j7309
12532b9799n27N5369j5597N38l60l9794O950N074j6519J7579N478r678O041J0722
12518d523j8693n6330M8255J8731n5059J7787M0661P602j3036l8094J0975J8261
12506b3463o038J4247j4369j2918r297L766M1435j0195k7168N581M7833N6160
12494F5574R39n0593l087N0280J4933j3321k1401q042M71k9185p650M2953k746
12481C9125q717n5790n694K4515J2342P525Q489j0111M534j7386n6k7310j9300
$$ plain form
12569 -24557 -9006 7278 19004 41620 28764 600 -27026 6887 44663 9321 -209 21354
12557 21354 52279 73452 18770 -27344 -20299 -5433 8279 16344 18058 22324 20409 45436 28338
12544 28338 -14179 -1142 24574 -1363 -15593 -9474 181 -8080 -41091 -14730 -12490 -29799
12532 -29799 -30326 25043 9446 9984 9624 -30170 -23220 -18146 -34665 -17086 -11608 -21286 -15245 -4523
12518 -4523 -23216 -79546 -31291 -12560 -67619 -49832 -9171 -1569 -14605 -52699 -41724 -23463
12506 -23463 -29501 -15254 -29623 -42541 -51838 -48072 -6637 -16832 -44000 -38419 9414 65574
12494 65574 66513 15920 12833 63113 78046 64725 43324 35282 35753 6568 -1082 41871 39125
12481 39125 30408 -25382 -31076 -6561 5781 13306 21795 11684 16218 -1168 -1224 -28534 -47834
12468d7834J4552J3249M5512L3451n845m0383l8663Q880K4787N351k2695j6357
12456b5995n485J6787q988J9132K1020j2360j9772o368K9552M4451Q019K452l3248
12443B9197J3384J1047K729K1457k1154j3318m0655j4413J2355L2190J0785j4305
12431B9299j5719j3244j4206L6709K4519p473q045k802m906k1602M438M4254k4813
12418B6409m9792O444j5850j0240K8091p820k2265k9375R470L2734K6595n201
12406a0800r130k0906K3995k929K79J8635K3149j5532l3608j1348J7291j9293
12394d0197K5270J0710K4280j5606J0725J4353j7591j9378m155m689m965m955
12382b6198k1072k8175M8327J3877J270P310K0907N953j4506p187m6461j2341
$$ plain form
12468 -47834 -33282 -20033 25479 58930 53085 12702 -25961 -17081 7706 13057 -9638 -25995
12456 -25995 -31480 -14693 -23681 -4549 16471 4111 -15661 -22029 7523 51974 59993 62445 29197
12443 29197 42581 53628 56357 77814 56660 43342 2687 -11726 629 32819 43604 29299
12431 29299 13580 336 -13870 22839 47358 39885 31840 29038 24132 2530 6968 51222 26409
12418 26409 -23383 -16939 -32789 -43029 -14938 -22758 -45023 -74398 -64928 -32194 -5599 -10800
12406 -10800 -19930 -40836 -16841 -19770 -19491 -856 22293 6761 -26847 -38195 -20904 -40197
12394 -40197 -14927 -4217 20063 4457 15182 29535 11944 -7434 -11589 -16278 -21243 -26198
12382 -26198 -47270 -75445 -27118 -13241 -11971 -4661 16246 22199 7693 506 -45955 -58296
12370e8296K3362P022L0037J8610l2572o11m369k646K4124N3893k6739p0520l3210
12357g1915K1703L0116m2831j6883M992q722l0073n099K2048J8942k2693N49J4886
12344h4980j7661J9901M198J2320k8828p328J7327R096M7374P643J102J0752P134
12331a950J9372m546k3807j267j4613K7489L3714l6823J0010j702j0363K3864
12319A9378J2217l1891j7506O377K35L1196N8858J6555q059O623o144j0181q388
12306F9270p3431k6436R836Q05P627r933K558k3551o6766L646M5796L3157k762
12293c0184J9843j5102M9304K3729k0171q950L0167M2464J6563m6582l8942L1752
12281E3891M684K722j1429j1086K497j4186l7264L9863j0513l0500Q368K0610
$$ plain form
12370 -58296 -34934 -27912 2125 20735 -11837 -12448 -16817 -19463 4661 58554 31815 -38705 -71915
12357 -71915 -50212 -20096 -62927 -79810 -74818 -83540 -113613 -118712 -96664 -77722 -100415 -99866 -84980
12344 -84980 -102641 -82740 -78542 -66222 -95050 -102378 -85051 -75955 -28581 -20938 -19836 -9084 -1950
12331 -1950 17422 12876 -10931 -12198 -26811 678 34392 -2431 7579 5877 -4486 19378
12319 19378 31595 -296 -17802 -11425 -11190 20006 78864 95419 87360 93983 87839 77658 69270
12306 69270 -4161 -30597 -20761 -19956 -12329 -22262 -19704 -43255 -110021 -106375 -60579 -27422 -30184
12293 -30184 -10341 -25443 23861 47590 27419 18469 48636 91100 107663 61081 22139 53891
12281 53891 58575 61297 49868 38782 41279 27093 -10171 29692 19179 -11321 -2953 17657
12269A7657m7443l2646K0929k183o031N833j735j3683R770n51j1083k9035r123
12256i9324j9188Q970K8436J2176R816J1437J2617L622j9337j6826Q96O093j2646
12243g3258M319L1441M8465J9503k2660j538L563m281j3880k565K0698K4463l6720
12230b450l3492J5529K2982Q14J499p824k4165j746j7981L8324K0634k7352k423
12217a7651J1617k9474J6060K1185J6992R077K783k9250k9357k7998J6352K9784
12205i880j6851r130M5287M0890K8109k7211l0630j8698l0041J7754K8970K1129
12193C9698o931l362j1575l759J2959r752J2898m086l4811L579j5601j0015j2331
12180d3089l4062J5978k8552q268M5952j7216L916L2116O177j3902R759J2667
$$ plain form
12269 17657 -29786 -62432 -41503 -43686 -49717 -43884 -45619 -59302 -49532 -50083 -61166 -90201 -99324
12256 -99324 -118512 -109542 -81106 -68930 -59114 -47677 -35060 -31438 -50775 -67601 -66705 -60612 -73258
12243 -73258 -68939 -37498 10967 30470 7810 6272 9835 5554 -8326 -10891 9807 34270 -2450
12230 -2450 -35942 -20413 2569 3383 4882 -2942 -27107 -28853 -46834 -8510 12124 -15228 -17651
12217 -17651 -6034 -35508 -19448 1737 18729 27806 30589 1339 -28018 -56016 -39664 -9880
12205 -9880 -26731 -35861 9426 50316 78425 51214 20584 1886 -28155 -10401 18569 39698
12193 39698 32767 29405 17830 14071 27030 17278 30176 26090 -8721 -5142 -20743 -30758 -43089
12180 -43089 -77151 -61173 -89725 -97993 -52041 -69257 -65341 -33225 -27048 -40950 -31191 -18524
12168a8524J8186k0707l7165J735J5518o50l0008J0902O649n345k0883J0049L5519
12155c4724K7719j2787k349J7883Q380o3767l416N9363K0245j2858j7297p068
12143b0676J1199J955o81L027j7471l518j0668L0587M4013M813j4459j3931P535
12130B1725k1385p92m185J1549j2648j8238J8508k4643k9466J9524K9033K0800
12118I782L393j4737J0051J4202l4372l2940j8941J1728N362p897J1618K562J0066
12105c0123k6125K692K1585k847L4021K4052J595J930j5179l228l8316j1118k3859
12092f4920k951J1103M375j3697K5955J7291P512n1748j3875L975Q650N2530K7034
12079A1234l977k638l276l6962p943L5194m764n4435J7549J5840j541K5823K7143
$$ plain form
12168 -18524 -338 -21045 -58210 -56475 -40957 -41607 -71615 -60713 -54064 -59409 -80292 -70243 -34724
12155 -34724 -7005 -19792 -22141 -4258 4122 -59645 -63061 -3698 16547 3689 -13608 -20676
12143 -20676 -9477 -7522 -8203 -5176 -22647 -26165 -36833 -6246 37767 42580 28121 14190 21725
12130 21725 340 -452 -4637 6912 -5736 -23974 -5466 -30109 -59575 -40051 -11018 9782
12118 9782 13175 -1562 8489 22691 -11681 -44621 -63562 -51834 -46472 -54369 -42751 -40189 -30123
12105 -30123 -56248 -53556 -31971 -34818 -797 23255 24850 26780 11601 8373 -29943 -41061 -64920
12092 -64920 -67871 -56768 -52393 -66090 -40135 -22844 -15332 -67080 -80955 -76980 -68330 -15800 11234
12079 11234 7257 4619 1343 -35619 -43562 -8368 -13132 -67567 -50018 -34178 -35719 -9896 17247
12066A7247K9186J8354k6852j8863N852j5520N169n7297m4562L0345q48m367j523
12053f3679K266M3600m798k4904l203J9815J7174L397k0912k5196j5103M6343
12041b5200J4972k7468k9506p713k2326K1622p261J5651L7749K7453J9065k1065
12029d027k4592l230O496o370K1188K769l8869j876r040j3611N785O8882L1096
12016C4601l5328r819L421J6285J748J8805J593n1527k8974k7361l5184l860M4020
12003g1580N8790L8099K3206j685n8739n5224m036L6155k7103k3827p344M5255
11991d8033K5085m664j2405l1733j8446K0970L8328p230n723L6102J0022K8471
11979C0744J0508J0248k1804l3239o466j6920p713k8187j3517J7376M013P445
$$ plain form
12066 17247 46433 64787 37935 19072 24924 9404 14573 -42724 -87286 -56941 -57789 -62156 -63679
12053 -63679 -61413 -17813 -22611 -47515 -50718 -30903 -13729 -10332 -31244 -56440 -71543 -25200
12041 -25200 -10228 -37696 -67202 -74915 -97241 -75619 -82880 -67229 -29480 -2027 17038 -4027
12029 -4027 -28619 -31849 -25353 -31723 -10535 -7766 -46635 -48511 -57551 -71162 -65377 3505 34601
12016 34601 -727 -10546 -7125 9160 10908 29713 31306 -20221 -49195 -76556 -111740 -115600 -71580
12003 -71580 -12790 25309 48515 46830 -11909 -67133 -71169 -35014 -62117 -85944 -93288 -48033
11991 -48033 -22948 -27612 -40017 -71750 -90196 -69226 -30898 -38128 -43851 -7749 2273 30744
11979 30744 41252 51500 29696 -3543 -10009 -26929 -34642 -62829 -76346 -58970 -54957 -47512
11967d7512J1179J5261J5224J5082l0086k1632j3029O54L0191Q484J3152j2881
11955a5913j1177J8451K3579L2083R589k9362l3429k9175m727M1485J5253n1712
11943c5055k4972j6115j329J8508J6340J3544L0401K4514o260L20l924M4892n172
11930E5692k2803l7399J7946J0823k5191p1327j3559K4222K9769q835m2714Q07
11918h2569J4009K9659m638K1480J8090J8549J188J1138J6483J1661P01l856l2349
11905A9546l7575m5800j5428J069K5996k515l5383J6783K5659L4674k326J6874
11893A574O216j8054k5019K920K2782N81O757K472r687o723m640j0417q16J5120
11879a6934J6407J6129o718m0900j3148J3627K5475j7368n3455J5664L9563j3301
$$ plain form
11967 -47512 -36333 -21072 -5848 9234 -20852 -42484 -55513 -54859 -24668 -16184 -3032 -15913
11955 -15913 -27090 -8639 14940 47023 56612 27250 -6179 -35354 -40081 1404 16657 -35055
11943 -35055 -60027 -76142 -77471 -58963 -42623 -29079 1322 25836 19576 19896 15972 60864 55692
11930 55692 32889 -4510 13436 24259 -932 -72259 -85818 -61596 -31827 -40662 -83376 -82569
11918 -82569 -68560 -38901 -43539 -22059 -3969 14580 15768 26906 43389 55050 55751 51895 19546
11905 19546 -18029 -63829 -79257 -78188 -52192 -54707 -90090 -73307 -47648 -12974 -15300 1574
11893 1574 7790 -10264 -35283 -32363 -9581 -9000 -2243 229 -9458 -16181 -20821 -31238 -32054 -16934
11879 -16934 -527 15602 8884 -32016 -45164 -31537 -6062 -23430 -76885 -61221 -21658 -34959
11867c4959k3563n104K557j2719j6763k074J121J4321l224K9140o618K0934r360
11854d6311m789J1440m152n142L9066J066K7791O745j1824j1371K3555k787p4371
11841e1084M179L0729j4122k0029j8715P499K3230L6888K4915N4247m8029m3964
11829a4256N596O812K452k0878k143p70j99n324j8298n134Q784o480K1599j2534
11815d0773m587J1027L1557j2604j101l091K8363L2799o7052r552M2153J0054
11803A7193j2814l0007l1836M328J6465L5578M6809o966o959J2756n98j1894m3076
11790a1021K1048k6380m4892M0401K0415m9542k9386N321j8662J0188J9382l234
11778f6362K3525K7680J3315J1813j9144J2953J3914j5273J2618j2613m54M472
$$ plain form
11867 -34959 -58522 -63626 -61069 -73788 -90551 -92625 -91504 -77183 -80407 -51267 -57885 -36951 -46311
11854 -46311 -51100 -39660 -43812 -48954 -9888 -8822 18969 25714 13890 2519 26074 23287 -51084
11841 -51084 -46905 -16176 -30298 -50327 -69042 -61543 -38313 -1425 23490 77737 29708 -14256
11829 -14256 -8660 -1848 604 -20274 -22417 -23187 -23386 -28710 -47008 -52142 -43358 -49838 -28239 -40773
11815 -40773 -45360 -34333 -2776 -15380 -16481 -19572 8791 41590 -25462 -35014 7139 17193
11803 17193 4379 -25628 -57464 -53136 -36671 -1093 45716 38750 31791 44547 43949 32055 -11021
11790 -11021 10027 -16353 -61245 -20844 -429 -49971 -79357 -74036 -92698 -82510 -63128 -66362
11778 -66362 -42837 -15157 -1842 9971 -9173 3780 17694 2421 15039 2426 1972 6444
11766F444m210l1773K879K5949N038l9937q623K431J3904J5245q45Q723K6734
11753B1959J2768J3923J4391o1133m7619l3796J5261L900j5633K3910P523J1265
11741c3281L0264k6424n0433L890J4021J7902j5796J9499r56j396Q301Q911M7241
11728B1743j605l715o933k0501R309L0882k9201l9955j0335J0115K3954q989R321
11715a5910j9636l4041l1748K3038M8032L718K5321J3899l1526K4207K5157K947
11703C3458j5800l1097q356p91n718K3425K5327J0442k2850k6424n283M266o96
11690b0097Q025j9552P328N889N0285M2973j0598k8065m4205j8900L0165K6550
11678B9798J1780k1636l6640L350L8272j2369j3879j7387j8369j6108j6921P389
$$ plain form
11766 6444 2234 -29539 -26660 -711 4327 -35610 -44233 -41802 -27898 -12653 -13498 -4775 21959
11753 21959 34727 48650 63041 1908 -45711 -79507 -64246 -60346 -75979 -52069 -44546 -33281
11741 -33281 -3017 -29441 -79874 -75984 -61963 -44061 -59857 -40358 -41314 -42710 -34409 -25498 21743
11728 21743 20138 16423 9490 -11011 -1702 29180 -21 -39976 -50311 -40196 -16242 -25231 -15910
11715 -15910 -35546 -69587 -101335 -78297 -30265 -26547 -1226 12673 -18853 5354 30511 33458
11703 33458 17658 -13439 -21795 -22586 -28304 -4879 20448 30890 8040 -18384 -23667 -19401 -20097
11690 -20097 -12072 -31624 -24296 -18407 31878 74851 64253 36188 -8017 -26917 3248 29798
11678 29798 41578 19942 -16698 -13348 24924 12555 -1324 -18711 -37080 -53188 -70109 -62720
11666f2720K5611O812j2782L7720N118q976J3008L6721M0330L00k7184n797o3746
11653a5585o828J5515L5032K7176L378j8249l7838m1203M984n595p103j3528q797
11640f8641K8815O5264J0512l6574j5834N381J9718L4604L0902L677k0862J218
11628E8180J4648K3260k0341q5200j4449n742K0830K0059l8421n7047J0216O2531
11616a1476J6357j8202M967L783R056l0219j7160K7009K4784q108L2098M2706
11604G5595J0597k0415q075k7647j1865J750q635k5555n151J0173N630j2529q402
11591b4529j8183L8397Q493K1035P44q553j3373P977j4837j9514K471o36K7656
11578G148P107K24j0874o396m861O697L1640j4952j2612J960k382m0464o38m999
$$ plain form
11666 -62720 -37109 -30297 -43079 -5359 -241 -9217 3791 40512 80842 81142 53958 48161 -15585
11653 -15585 -22413 -6898 28134 55310 58688 40439 2601 -38602 -33618 -39213 -46316 -59844 -68641
11640 -68641 -39826 25438 35950 -624 -16458 -11077 8641 43245 74147 77824 56962 58180
11628 58180 72828 96088 75747 -9453 -23902 -29644 -8814 11245 -27176 -84223 -74007 -11476
11616 -11476 4881 -13321 -8354 -4571 4485 -25734 -42894 -15885 8899 791 32889 75595
11604 75595 86192 65777 57702 30055 18190 19940 11305 -14250 -19401 -9228 -3598 -16127 -24529
11591 -24529 -42712 -4315 4178 25213 25957 17404 4031 12008 -2829 -22343 -19872 -20508 7148
11578 7148 14255 14479 3605 -2791 -7652 -955 30685 15733 3121 5081 2699 -37765 -38403 -43402
11564d3402q508M052P766j1239J2960J6242o2J8574k0477q791J7117j2198n557
11551c3523J2646n207j1126K4023K7386k4303j2607L0307r403l882K5903K8k2372
11538b130l366m3191k9654J8995L6348J0262L8433O416l0221n5332N437L0724
11526a7279J746j629L9383k0165k0858j9080j0320P3624Q797J49J6639m7761j5843
11513a2597J2387Q476J6679R566l4417k3419l1402Q802N8070R318l474J3152n334
11500B5807j4741j6954L29J0867M795n0003l9595o335L9877J4718K0224j820l827
11487a6658j8779j8199J0944J8693L142R997L465K2280m526j0266q20l769J1786
11474G290j2417k2135N168j0563J6863l3481p181p167P650K5130j021L4568K9473
$$ plain form
11564 -43402 -51910 -47858 -40092 -51331 -38371 -22129 -22191 -3617 -24094 -32885 -15768 -27966 -33523
11551 -33523 -20877 -26084 -37210 -13187 14199 -10104 -22711 7596 -1807 -5689 20214 20242 -2130
11538 -2130 -5496 -48687 -78341 -59346 -22998 -12736 25697 32113 1892 -53440 -48003 -17279
11526 -17279 -15533 -17162 22221 2056 -18802 -37882 -48202 25422 34219 34368 51007 3246 -12597
11513 -12597 -210 8266 24945 34511 94 -23325 -54727 -45925 12145 21463 17989 31141 25807
11500 25807 11066 -5888 -5559 5308 10103 -39900 -79495 -85830 -45953 -31235 -11011 -12831 -16658
11487 -16658 -35437 -53636 -42692 -23999 -20857 -10860 -7395 14885 10359 93 -727 -4496 7290
11474 7290 -5127 -27262 -22094 -32657 -15794 -49275 -56456 -63623 -55973 -30843 -31864 2704 32177
11461C2177l6003k4077q412K1928m0119q354o27K0321K6106j4036m66j6283J085
11448d6760j4378R943M1733N945j3825N882L08k1099Q756J3276L827n008Q134
11435c266o041l1355L7148M9066J0607j5495j9449o2954j6666l0298J2078O6915
11423i710P9435j2777l7967m162L2192K7492l4666j7620L439m8488J4957M8330
11411D0455M9242l4835k1066k8059k672j2566m3358J0632K398j6646J6965q339
11399d7849L3445L750j4099j9578K4310j8793n545M8728J9138N241j7209j5721
11387d182k9580j0149Q073l1799k7807l463r692K9851K7241m872L4897J2918n054
11374a3618n395l348L7868k0660l3658J7613J9026k2045Q654k2837J6337k7316
$$ plain form
11461 32177 -3826 -27903 -36315 -14387 -54506 -62860 -63487 -43166 -17060 -31096 -31562 -47845 -46760
11448 -46760 -61138 -51195 -9462 -3517 -17342 -11460 -11152 -32251 -23495 -10219 -6392 -11400 -3266
11435 -3266 -9307 -40662 -3514 45552 56159 40664 21215 -41739 -58405 -88703 -76625 -9710
11423 -9710 69725 56948 18981 14819 47011 74503 39837 22217 25656 -22832 -7875 40455
11411 40455 89697 54862 33796 5737 3065 -9501 -52859 -42227 -39829 -56475 -39510 -47849
11399 -47849 -14404 -10654 -24753 -44331 -20021 -38814 -44359 4369 23507 28748 11539 -4182
11387 -4182 -33762 -43911 -35838 -67637 -95444 -98907 -108599 -78748 -51507 -56379 -21482 -8564 -13618
11374 -13618 -19013 -22361 15507 -5153 -38811 -21198 -2172 -24217 -15563 -38400 -22063 -49379
11362d9379k5872m0413j0008L5184K3494J7717L4779M396J7339k6893j5047k5271
11350e9974m520J2911O993R267j1456j557J7623j0551l242J2315j5597j1765J2607
11337d6946L5818J6937J5916q601k0650j9106L878j7670J75J4836m828j1094j769
11324d3104J7458J3018j4093j0651J1835P0620K1118k3190k7840l4304q730j0070
11312c7933M4217L0333M238l47l3943K865J1189m2237k2461M792k0026k0412M3976
11299c5749M6694j2020l320n177R135J0436J3817k2060j568j2600J5391N147K7868
11286C5994j2177l4199l9466J7825L0698j523k4424j7126L7465N7749K226j7422
11274C5620l5468k4593r215r898j575j581k0179M6294K3852m559j2288K4341J2404
$$ plain form
11362 -49379 -75251 -115664 -125672 -90488 -66994 -49277 -14498 -10102 7237 -19656 -34703 -59974
11350 -59974 -64494 -51583 -44590 -35323 -46779 -48336 -30713 -41264 -44506 -32191 -47788 -59553 -46946
11337 -46946 -11128 5809 21725 13124 -7526 -26632 -22754 -40424 -40249 -25413 -30241 -41335 -43104
11324 -43104 -25646 -12628 -26721 -37372 -25537 45083 66201 43011 15171 -19133 -27863 -37933
11312 -37933 6284 36617 40855 40508 6565 9430 20619 -21618 -44079 -39287 -59313 -79725 -35749
11299 -35749 10945 -1075 -4395 -9572 -437 9999 23816 1756 188 -12412 2979 8126 35994
11286 35994 23817 -10382 -49848 -32023 -1325 -2848 -27272 -44398 -6933 50816 53042 35620
11274 35620 152 -24441 -33656 -43554 -45129 -46710 -66889 -20595 3257 -1302 -13590 10751 23155
11261B3155k5295l2488J818L8952L4300J5077n3835l5605l5461K2817K6823l0444
11249e0186p648P959j5168K2865L8975L9976j2643k2084j608J2829j8346J812
11237c267J0857k2858p330P305M2844R524k0586k7531l333k1749j8337j2036j202
11224f7699L802L2948L6859k4674l1041p884J2190l7603J1090K0352q154J4046
11212d5768j7764P684J9402k61j3575L1076K0329R883K6880k2603k5570O334K9959
11199B6006K740j0741J1838j1291O048M619p838m3815l2919K3781L3912k3679
11187b1339q902j3313P570J3927j422M9360J541j2330j6597j3779j289P229J3240
11174C896K6752k4247m0228l2967k3322m1380K9453P1806M9724N525n6630k8793
$$ plain form
11261 23155 -2140 -34628 -32810 6142 40442 55519 1684 -33921 -69382 -46565 -19742 -50186
11249 -50186 -57834 -49875 -65043 -42178 -3203 36773 24130 2046 438 13267 -5079 -3267
11237 -3267 7590 -15268 -22598 -15293 27551 37075 16489 -11042 -14375 -36124 -54461 -66497 -67699
11224 -67699 -63897 -30949 5910 -18764 -49805 -57689 -45499 -83102 -72012 -51660 -59814 -45768
11212 -45768 -63532 -55848 -36446 -36707 -50282 -19206 1123 11006 37886 15283 -10287 -3953 26006
11199 26006 28746 18005 29843 18552 24600 29219 21381 -22434 -55353 -31572 2340 -21339
11187 -21339 -30241 -43554 -35984 -22057 -23479 25881 27422 15092 -1505 -15284 -16573 -9344 3896
11174 3896 30648 6401 -33827 -66794 -90116 -131496 -102043 -30237 19487 25012 -31618 -60411
11162f0411J6004r812M712P5462N263q8472l4672P065J9825K2793k547O487J8291
11149b0012j3084k2280J4682K5681L0992m808J4178L925K4099Q174j2567k9310
11137A9670Q705J412j253k2012k1258K0718M9655M527k7538k970l6805j6297K3952
11124E06R022j4556j8580o469M5881n717l4189j5805O365j4698L5736J6886j8343
11111a3961n711Q800L1763p484k0671l7549j9139J161J3859K5303k375j061J3076
11098a3989j7022k2777K2041l059K3425J2827k0266L114K5268J6821K095j9838
11086H640j5600k9104K41l762K5702N788m1930R131L9902k1222m1306J1667J6553
11073c5300O130K8229J8721k6904m9195j3321L3189J8224K4354R79r360k9952
$$ plain form
11162 -60411 -44407 -54219 -49507 25955 31218 -57254 -91926 -84861 -65036 -42243 -44790 -38303 -20012
11149 -20012 -33096 -55376 -40694 -15013 15979 11171 25349 29274 53373 61547 48980 19670
11137 19670 28375 29787 28534 6522 -14736 5982 55637 60164 32626 29656 -7149 -23446 506
11124 506 9528 -5028 -23608 -30077 15804 10087 -24102 -39907 -33542 -48240 -12504 4382 -13961
11111 -13961 -19672 -10872 20891 13407 -7264 -44813 -63952 -62791 -48932 -23629 -26004 -27065 -13989
11098 -13989 -31011 -53788 -31747 -34806 -11381 1446 -18820 -15706 9562 26383 28478 8640
11086 8640 -6960 -36064 -35823 -39585 -13883 -8095 -50025 -40894 -992 -22214 -63520 -51853 -35300
11073 -35300 -29170 -941 17780 -9124 -58319 -71640 -38451 -20227 4127 5106 -4254 -34206
11061c4206J678P856K0829K779k4624j6820J0937J8441J2940M051K0674k0417
11049D118r054k3043l1605j3187J3005N0408J9479j4831k4787k3122J757J1892
11037c8970k04J292P851m14J6246K6815P719Q546l3179p164k2587l329L4483K6140
11023B3245l0326k2124N276j4922Q690J8330Q78j0663k4373L658K3389K8950j5926
11010e918J4553J0982m0734l6055J0153L163m1534r369K1268M025Q553L2810j6939
10997d5042K326R581L4199J0637n8770m4785K3006L9195q097o112K5085j1906
10985c0683r121J9698K4107J8633j3630J5634j2955l7057J0052l5183k1864J5522
10973e6847L2584K447M5436K0503l9284k1226R801K1066J7862j263p336M796l0950
$$ plain form
11061 -34206 -32528 -24672 -3843 -1064 -25688 -42508 -31571 -13130 -190 3861 24535 4118
11049 4118 -4936 -27979 -59584 -72771 -59766 -9358 10121 -4710 -29497 -52619 -50862 -38970
11037 -38970 -39174 -37882 -30031 -30445 -14199 12616 20335 28881 -4298 -11462 -34049 -37378 -2895 23245
11023 23245 -7081 -29205 -23929 -38851 -30161 -11831 -10953 -21616 -45989 -42331 -18942 10008 -5918
11010 -5918 8635 19617 -21117 -57172 -47019 -43856 -85390 -94759 -73491 -69466 -60913 -28103 -45042
10997 -45042 -42716 -33135 1064 11701 -47069 -91854 -68848 -29653 -37750 -43862 -18777 -30683
10985 -30683 -39804 -20106 4001 22634 9004 24638 11683 -25374 -15322 -50505 -72369 -56847
10973 -56847 -24263 -21816 23620 44123 4839 -16387 -6586 14480 32342 31079 23743 28539 -2411
10960b411J4120m6182m6308J9608L7848k192K4967K3005L2003M738l7342k012
10948A9842m700K8554p175J5363l015m0640K3823j6982j5387n155N498J6433J0124
10935B6583j6843l3904k7370J1098O608r585M293J2356J8055K0924M31m2060p2494
10922a01908J2404M3707K5797R226n236m1275j2666j6037L6739M5621j4326j898
10910a9852L4024k436J914m985j3326q914m4419m7747n793L9090J8588J2653L3806
10897g397o483N435L5326L837j7349j1496p327l4394q825J5778L9335l8361k8900
10884f0821j605J2977K6937k142K028J9835J6242K464J726J220l1068j4725K5508
10871a424j1300J5036j3109q669N590J9515j1945o4114j560k971J6870J7611l6978
$$ plain form
10960 -2411 11709 -34473 -80781 -61173 -23325 -25517 -550 22455 54458 59196 21854 19842
10948 19842 15142 43696 36521 51884 48869 8229 32052 15070 -317 -5472 26 16459 26583
10935 26583 9740 -24164 -51534 -40436 -33828 -43413 -39120 -26764 -8709 12215 12646 -29414 -101908
10922 -101908 -89504 -45797 -20000 -10774 -16010 -57285 -69951 -85988 -49249 -3628 -17954 -19852
10910 -19852 14172 11736 13650 8665 -4661 -13575 -57994 -105741 -111534 -72444 -53856 -41203 -7397
10897 -7397 -13880 -8445 26881 30718 13369 1873 -5454 -39848 -48673 -32895 6440 -31921 -60821
10884 -60821 -62426 -49449 -22512 -24654 -22626 -2791 13451 15915 17641 18861 -12207 -26932 -1424
10871 -1424 -12724 2312 -10797 -19466 -13876 5639 -6306 -70420 -71980 -74951 -58081 -40470 -77448
10858g7448j5718L7185M7932k549J8178Q399N78J3509J553r630j9883k2563K0357
10845a00k6065Q372K0392m6973L263O686l0716P497J7053N2643K9929J35j7161
10832B4955m4004L6710J8125m2243m9204j8262r363K2588O0485K0131m624k5179
10820i885k4171j7884J9286L708k196q52m989k5793P966K3069k2006l783J2825
10807d4705K9400K3505r104j1484J8527k6519k9835k8919j4547K5416L2401O446
10795b9418P262L3673K4693L44m1113l3492J5461K2884P289n347j0651P184m1168
10782d2399j1498J8672L087J8990n930J7468k4280k3860K1657L6339l4075l663
10770b9492O3284L0031l8288j6718J2348L3213l763l2695l9637m2232l0422J859
$$ plain form
10858 -77448 -93166 -55981 -8049 -10598 7580 15979 16557 30066 31619 21989 2106 -20457 -100
10845 -100 -26165 -17793 2599 -44374 -41111 -34425 -65141 -57644 -40591 12052 41981 42116 24955
10832 24955 -19049 17661 35786 -6457 -55661 -73923 -83286 -60698 -213 19918 15294 -9885
10820 -9885 -34056 -51940 -32654 -28946 -31142 -31994 -36983 -62776 -54810 -31741 -53747 -57530 -44705
10807 -44705 -15305 8200 -904 -12388 6139 -20380 -50215 -79134 -93681 -68265 -35864 -29418
10795 -29418 -22156 11517 36210 36554 -4559 -38051 -22590 294 7583 2236 -8415 -1231 -42399
10782 -42399 -53897 -35225 -32138 -13148 -19078 -1610 -25890 -49750 -28093 8246 -25829 -29492
10770 -29492 33792 63823 25535 8817 21165 54378 50615 17920 -21717 -63949 -94371 -92512
10758i2512l4038L0540K6167k639K9217L3215J7623K8426K212p848k0796l194
10746F373J0170P039J8563j6142k1722j8381l0939m6772J4643O02J6409k9470
10734h9627l7643R677Q1161K5359j7968m4175j9560L153M179J8680M3889K4620
10722A745N1042j0320m960J4047k5261o5204n7825R547J2363L4040N263J9938
10710a5585M715q071k1769n084j6228M474L4854n190m278K4689J1008o57j2660
10697i782j7537k7745R276K2617k3344j002l4631J3387K0203K2054m6790M5863
10685b7431J858j1296J6465J4481l7168O869K7142J9475n3624j3223K03q106Q710
10672e5645L7031K1794j7141o583K2182m720P54O688j7689j2150k3332J9369K43
$$ plain form
10758 -92512 -126550 -96010 -69843 -72482 -43265 -10050 7573 35999 38211 30363 9567 6373
10746 6373 16543 23582 42145 26003 4281 -14100 -45039 -91811 -77168 -76566 -60157 -89627
10734 -89627 -127270 -117593 -36432 -11073 -29041 -73216 -92776 -89623 -85444 -66764 -22875 1745
10722 1745 52787 42467 37507 51554 26293 -38911 -96736 -87189 -74826 -40786 -35523 -15585
10710 -15585 -10870 -18941 -40710 -45794 -62022 -57548 -22694 -27884 -32162 -7473 3535 2878 -9782
10697 -9782 -27319 -55064 -45788 -23171 -46515 -47517 -82148 -68761 -48558 -26504 -73294 -27431
10685 -27431 -25573 -36869 -20404 -5923 -43091 -36222 -9080 10395 -43229 -56452 -56249 -64355 -55645
10672 -55645 -18614 3180 -13961 -20544 1638 -3082 -2328 4360 -13329 -25479 -48811 -29442 -29199
10659b9199j1223p740J6248J6665j6132J295R318k3485k0959L8033k6446j1861
10647f5486L7488M599l0965j0144K463J027L9403L0890L586k5122J6618r879j4409
10634a9931J3846K854l665j9054j3655J052k0522L6790m023K6745m359n7350k8463
10621h9735K5479M0115L6084K5846k3233J2354q491k4331j1045L5137k253l1263
10609a5336j9768r157J3933K3121N457j0607l0158L7923M5329j1814l4210J973
10597c314N083L4701O695L5280K598J7397L0621o000l1999l1379k6485L123j3867
10584B2454l6802J1496L2406j965j7610p847l369K0053R584J3925o557K7743l31
10571F3180M86j2676K7234q959n263K4722l7010L2544Q1401k6987n0820n3601
$$ plain form
10659 -29199 -40422 -48162 -31914 -15249 -31381 -30086 -20768 -44253 -65212 -27179 -53625 -65486
10647 -65486 -27998 -23399 -54364 -64508 -62045 -61018 -21615 9275 12861 -12261 4357 -5522 -19931
10634 -19931 -6085 -3231 -6896 -25950 -39605 -38553 -59075 -22285 -26308 437 -3922 -61272 -89735
10621 -89735 -64256 -24141 11943 37789 14556 26910 18419 -5912 -16957 18180 15927 -15336
10609 -15336 -35104 -44261 -30328 -7207 -1750 -12357 -42515 -4592 40737 28923 -5287 -3314
10597 -3314 1769 36470 43165 78445 81043 98440 129061 123061 91062 59683 33198 36321 22454
10584 22454 -14348 -2852 29554 27589 9979 2132 -1237 18816 28400 42325 35768 63511 63180
10571 63180 63666 50990 78224 69265 64002 88724 51714 84258 165659 138672 87852 34251
10559C4251K0180K4007m6611m3221K9111J0248J8028L812l5021O891p452k5252
10547a1029k0828m787j5635K4953K014n8162l84K8793K4933M3690l2156j4291
10535c2889K5191M1545K6662l5154k5718K3345k2334j7790K6789M588J80m1282
10523b6867k4395j2048l914m449R549J5808L7520n969q520J74J5824P721n496
10510e062o599j3044N127l2635J6308J7203L0423l6264J105L6794m168l24K8056
10497C6920j1370K0160J0424j101l8961l7382m5841k4250q049N6728M4930k2730
10485b0522p333j2339J7985L6040o050r979J0510n320n944L18P234K3402J8048
10472D6050k0230l5491k1410l4732k0287P618L0884q941k0371R778M2364K9718
$$ plain form
10559 34251 54431 78438 31827 -11394 17717 27965 45993 49805 14784 21675 14223 -11029
10547 -11029 -31857 -36644 -52279 -27326 -25312 -83474 -83858 -55065 -30132 13558 -18598 -32889
10535 -32889 -7698 33847 60509 25355 -363 22982 648 -17142 9647 14235 14415 -26867
10523 -26867 -51262 -63310 -67224 -71673 -62124 -46316 -8796 -14765 -23285 -23111 -7287 434 -5062
10510 -5062 -11661 -24705 -19578 -52213 -35905 -18702 11721 -24543 -23438 13356 9188 8864 36920
10497 36920 25550 45710 56134 55033 16072 -21310 -67151 -91401 -99450 -42722 2208 -20522
10485 -20522 -27855 -40194 -22209 13831 7781 -2198 8312 2992 -2952 -2634 4600 28002 46050
10472 46050 25820 -9671 -31081 -65813 -86100 -78482 -47598 -56539 -76910 -67132 -24768 4950
10460D950N980l2658k6051m342J9129J6755K3156K2711J607P388r325l2450l3328
10447c6478P809l505M6342O088M463m0221j3381K4610m016r192k1209j8502L3254
10434b3938K2358L0610k0504j0980J1576m291l2365J522J3792j949J2205l604
10422e568j0094J0345K6476P252n230k6799n502J9817j9224M191p096o370k1436
10409c9238J6455K8617K057j8354r315M4242k2464k5621l1015l2299O852K0542
10397e9541M3928L1189L3961K51j5332M069p770k2395l483j0650J1111j1232K2890
10384A6996j07j6910J1485L885k5339M0899Q008o5934J5125N2j5213M4020Q583
10371B5550N754M813l9814m2853L179j4411k558O658J2958o272R224K301L852
$$ plain form
10460 4950 10930 -21728 -47779 -52121 -32992 -16237 6919 29630 31237 38625 29300 -3150 -36478
10447 -36478 -28669 -32174 14168 20256 24719 -15502 -28883 -4273 -8289 -17481 -38690 -57192 -23938
10434 -23938 -1580 29030 8526 -2454 9122 4831 -27534 -26012 -12220 -14169 -1964 -5568
10422 -5568 -15662 -5317 21159 28411 23181 -3618 -9120 10697 -8527 -4336 -11432 -17802 -39238
10409 -39238 -22783 5834 7891 -10463 -19778 24464 2000 -23621 -54636 -86935 -80083 -59541
10397 -59541 -15613 15576 49537 49788 34456 38525 30755 8360 4877 -5773 5338 -5894 16996
10384 16996 16889 -21 11464 15349 -9990 30909 38917 -27017 -11892 -11840 -27053 16967 25550
10371 25550 31304 36117 -3697 -46550 -43371 -57782 -60340 -53682 -40724 -46996 -37772 -35471 -31619
10358c1619J3271n997J6943l6489k7302R594n215M7106p363m856j9710k1652j302
10345g4591O634L9472K8008k417O926N292p574l3078Q308j1688l9144k3404J1199
10332h6057N2482L291L92k2429J0004L0127K1205j0889n868Q678J9631p82j3285
10319F500K1014J6900P864k6746j8403K9177j2731j7466K621n781J2324m0852
10307b5579K6093K5264p842K969l3401n8564j6059N2123K5858o5850m434P4504
10295d918K5818j5583j7207j4770j0498J623J3866l310N301m1234n045M8076K8701
10282A0820j3672j1224J1367L204J1954l9475k1127J3559j172K9063L3215l170
10270B3342m021j5488J6795K0133j2678J0857m8404l5092J6204n10n284Q376j1077
$$ plain form
10358 -31619 -18348 -24345 -7402 -43891 -71193 -61599 -66814 -19708 -27071 -31927 -51637 -73289 -74591
10345 -74591 -67957 -28485 -477 -2894 4032 9324 1750 -31328 -23020 -34708 -73852 -97256 -86057
10332 -86057 -33575 -30284 -29892 -52321 -42317 -12190 9015 -1874 -7742 936 20567 19785 6500
10319 6500 27514 44414 52278 25532 7129 36306 23575 6109 8730 2949 15273 -25579
10307 -25579 514 25778 17936 20905 -12496 -71060 -87119 -34996 -9138 -74988 -79422 -4918
10295 -4918 20900 5317 -11890 -26660 -37158 -35535 -21669 -24979 -19678 -60912 -65957 -17881 10820
10282 10820 -2852 -14076 -2709 495 12449 -27026 -48153 -34594 -35766 -6703 26512 23342
10270 23342 19321 3833 20628 40761 28083 38940 -9464 -44556 -28352 -28862 -34146 -25770 -36847
10257c6847O987j594k4088N880J4662K5923J1033j873l4684k3798J271o430J0706
10244e2852m253O937o060L0737J0095J915L4209r31n665j9536k5792j3861J8379
10231b6678M6827m032k2610J2282L6431j586k6967j4943k3831l4651N825k2223
10219g6156l632M9303m273m3499R586L9402M0912O877L126N889m935l6869L1L505
10205a0733l24Q916L7490J5927k9698J8232k5113m4468k2607J2247J1018j396
10193c0509m207Q960L7782n995n063J5936j7517l829M8572K3216l219k1069l1069
10180A1989n1633o6890J2114j2151J5337J5786j0192J8993L0162K0038K6646j5530
10168e331j5683J1756r309j3529o670K3324J8638k8245j4042k8228l8480J6287
$$ plain form
10257 -36847 -29860 -31454 -55542 -49662 -35000 -9077 1956 83 -34601 -58399 -57128 -63558 -52852
10244 -52852 -57105 -50168 -56228 -25491 -15396 -13481 20728 19797 14132 -5404 -31196 -45057 -26678
10231 -26678 20149 16117 -6493 5789 42220 40634 13667 -1276 -25107 -59758 -53933 -76156
10219 -76156 -79788 -30485 -34758 -78257 -68671 -29269 11643 18520 21646 27535 22600 -14269 -14238 -10733
10205 -10733 -11057 -2141 35349 51276 21578 39810 14697 -29771 -52378 -40131 -29113 -30509
10193 -30509 -34716 -25756 12026 6031 968 16904 -613 -4442 44130 67346 64127 43058 11989
10180 11989 -39644 -106534 -94420 -106571 -91234 -75448 -85640 -66647 -36485 -16447 10199 -5331
10168 -5331 -21014 -9258 -18567 -32096 -38766 -15442 3196 -25049 -39091 -67319 -105799 -89512
10156h9512P960J1027J2795j8496k0604M63L2597K2092J5907K0390M522p794l8927
10143d7580o778O009J8794J7204l7935L204K5179k1423O542j4180j8383j4311
10131h3658j437L5688k2181M066J8013J0371o338j3904K4602L9440Q866j0166
10119C362l7456k2065j5649M7312O409j737J4987j1314l9561J0468R073L2042
10107d129L1714J2580J6136m115l9057k583j8439r161j9394l3976L1856J1221
10095b7347j9473O741P301l0896k455J9901n503L5446J9180m4143J380J2703J6825
10082a0340j888J7850k8113n3710J3508M6205M2137j7971l7845j091J1205J3288
10070f765J2304N125m001R759k828M053J394k5453n83K8803L44j7538J5959m523
$$ plain form
10156 -89512 -81552 -70525 -57730 -76226 -96830 -96367 -63770 -41678 -25771 -5381 -859 -8653 -47580
10143 -47580 -54358 -48349 -29555 -12351 -50286 -47082 -21903 -43326 -36784 -50964 -69347 -83658
10131 -83658 -85095 -49407 -71588 -67522 -49509 -39138 -45476 -59380 -34778 4662 13528 3362
10119 3362 -34094 -56159 -71808 -24496 -18087 -19824 -4837 -16151 -55712 -45244 -36171 -4129
10107 -4129 27585 40165 56301 52186 13129 10546 -7893 -17054 -36448 -70424 -38568 -27347
10095 -27347 -46820 -40079 -32778 -63674 -66129 -46228 -51731 -16285 2895 -41248 -39868 -27165 -10340
10082 -10340 -12228 5622 -22491 -76201 -62693 -16488 25649 7678 -30167 -31258 -20053 -6765
10070 -6765 5539 10664 6663 16422 13594 17647 19041 -6412 -6995 21808 22152 4614 20573 16050
10056A6050l3103k9959L408P958J3791M7868j5115k5354L3684j0452m182O180
10044A0774l4566K322N4339L2810j6970j4282n009n4605j2764K1414K9000k2143
10032i680j4398k4528R606K0620J8588K9980l9538k7457q521o594J1934J2642
10020b7346K452Q836Q295K8455j1111j5325L603j8635j6919j3950j1129L1143
10008c1631K0325J4216j6996j6026j9327K0267L0483k8250k5843k7011Q985J2127
9996e8681J8384J3672l760k0541J5641j087L985L2899j434l9690j1153L095K2844
9983b5826J8261l438r627P556J4912K9353k1205K258Q954l8j091n197j4875q386
9969h389j0111L4476O97m9815p053L8984o547k6089J3627R682l2680j2930L0916
$$ plain form
10056 16050 -17053 -47012 -43604 -35646 -21855 26013 10898 -14456 19228 8776 4594 10774
10044 10774 -23792 -21470 32869 65679 48709 34427 29418 -25187 -37951 -16537 12463 -9680
10032 -9680 -24078 -48606 -39000 -18380 208 30188 -9350 -36807 -45328 -51922 -39988 -27346
10020 -27346 -24894 -16058 -7763 20692 9581 -5744 -2141 -20776 -37695 -51645 -62774 -31631
10008 -31631 -11306 2910 -14086 -30112 -49439 -29172 1311 -26939 -52782 -79793 -70808 -58681
9996 -58681 -40297 -26625 -30385 -50926 -35285 -36372 -32387 512 -922 -40612 -51765 -48670 -25826
9983 -25826 -7565 -11003 -20630 -13074 1838 31191 9986 12244 21198 21160 20069 14872 -3 -8389
9969 -8389 -18500 15976 16673 -33142 -40195 -1211 -7758 -33847 -20220 -10538 -43218 -56148 -25232
9956b5232L0804k1383Q844L1338r824j6995K0882P782J69l1004k7796l6378l602
9943g2395L4905K8902K8665l288k5769k1600o387L278Q082K0487n449j266J4167
9930B332K4863K0519m014j0769j7216J5705r158o409j3764r246K3246N076l9533
9917a8368J4944K5653p930j2215M6248j6102p511k3693l473K6009K5714K595k287
9904D9584k7534m2940k3519K5610K6131k1635N199O620k4322j0098N2686M3232
9892E9014k3980l285j4278j4426j8451J669p603j8478Q625M2414j7007J4554N326
9879A4094K6055K986j0269K4372M223p7860q003M8372J5550R461j2241J8685r073
9866D6352k3877j8479K0468J1998m9929k4001L172J6575j8454l43j712J606J6236
$$ plain form
9956 -25232 5572 -15811 -6967 24371 14547 -2448 18434 26216 26385 -4619 -32415 -68793 -72395
9943 -72395 -37490 -8588 20077 16789 -8980 -30580 -36967 -33689 -25607 -5120 -10569 -11835 2332
9930 2332 27195 47714 43700 32931 15715 31420 22262 15853 2089 -7157 16089 21165 -18368
9917 -18368 -3424 22229 14299 2084 48332 32230 24719 1026 -2447 23562 49276 51871 49584
9904 49584 22050 -20890 -44409 -18799 7332 -14303 -9104 -2484 -26806 -36904 15782 59014
9892 59014 35034 31749 17471 3045 -15406 -13737 -21340 -39818 -31193 11221 -5786 8768 14094
9879 14094 40149 43135 32866 57238 61461 -16399 -24402 23970 39520 48981 36740 55425 46352
9866 46352 22475 3996 24464 36462 -13467 -37468 -34296 -17721 -36175 -36518 -38230 -36624 -20388
9853b0388p785j4010j5962J1960L3639K1164K598k918J5783l813j7916J1009r79
9840A2382L546K4545j4544J3052j6369k4535M71m1530k0530K4744L5674M768K37
9827A911K7790O5851j7698k240m4517r079K5405l2440j9299J1840o630j790K4805
9814B3909K6338k340J2390j0559j3926l537l0807k2292J7807J5356n2563j0862
9802e1086L578j5354p192J3302N6773N5774m945l5590k6932k1989J891K5791j326
9789g305m1075j2519J7269K4898M0578J7361j5946j5526j9004p102l6842K466
9777e2747L6049J7870k6231l478K4569L587l0818j2601L8578m167m3306m2896
9765i5591K8003M2283l597K0026J1377k5525k2162N0337K016l4228k3011l83M6250
$$ plain form
9853 -20388 -28173 -42183 -58145 -46185 -12546 8618 11216 8298 24081 20268 2352 13361 12382
9840 12382 15928 40473 25929 38981 22612 -1923 -1452 -42982 -63512 -38768 -3094 1674 1911
9827 1911 29701 95552 77854 75614 31097 22018 47423 14983 -4316 7524 894 -896 23909
9814 23909 50247 47907 60297 49738 35812 32275 1468 -20824 -3017 12339 -40224 -51086
9802 -51086 -47508 -62862 -70054 -56752 21 55795 50850 15260 -11672 -33661 -31770 -5979 -7305
9789 -7305 -48380 -60899 -43630 -18732 21846 39207 23261 7735 -11269 -18371 -55213 -52747
9777 -52747 -16698 1172 -25059 -28537 -3968 -381 -31199 -43800 -5222 -9389 -52695 -95591
9765 -95591 -67588 -25305 -28902 -8876 2501 -23024 -45186 5151 7167 -27061 -50072 -50455 -4205
9752d205L4094R506M516J955j340J901j7582r599j8715l4298J3645K1695M631
9739F204l674k6847k953J4184R660R504L882l890M387p097L818k314n8161N378
9725d7919M4762K762Q609j6521J1647J719j0390r848k797m282k0726P435J2340
9712b3209j420k1467L0806L1845J3496J0192J4814j419j2376k6686k6280k459
9700a4163j2434k1875j5854m563K2887P218M7619K7280J7653m0853q535j1779
9688g399N077N6958O240j7968J2720l4536r091J9554j0246j9324J0043q819q751
9675e542O70n496r026K355J6896Q908j5129Q214l683J5815j9252m4257j3085K0922
9661d1690N7198R205m2436k4482L275K4212p04J1625l009M740J6952K2769k415
$$ plain form
9752 -4205 29889 39395 43911 45866 44526 46427 28845 19246 531 -33767 -20122 1573 6204
9739 6204 2530 -24317 -27270 -13086 -3426 6078 9960 6070 10457 3360 7178 4864 -53297 -47919
9725 -47919 -3157 -395 8214 -8307 3340 5059 -5331 -15179 -17976 -22258 -42984 -35549 -23209
9712 -23209 -24629 -46096 -15290 16555 30051 40243 55057 53638 41262 14576 -11704 -14163
9700 -14163 -26597 -48472 -64326 -68889 -46002 -38784 8835 36115 53768 12915 4380 -7399
9688 -7399 -2322 54636 60876 42908 55628 21092 12001 31555 21309 1985 12028 3209 -5542
9675 -5542 -4872 -10368 -19394 -17039 -143 8765 -6364 1850 -1833 13982 -5270 -49527 -62612 -41690
9661 -41690 15508 24713 -17723 -42205 -38930 -14718 -15422 -3797 -6806 -2066 14886 37655 35240
9648C5240k4509k3431J14J0182K9146K2904k1628M619K2346k1633j5243k4373
9636f266o624j4439N330J2032m262J5815J4960J3573K1826J0304Q628j3561n1737
9623E579n537M5241N1056l1504l2745j5959j1176j4080m1309K080j708o43L7396
9610a3309J6986J6293k613j3149j3125K553j924J7269M4547J8572l8073j6312
9598A7715l1042j5381J8213N2057r591l110K2723k6645l0416j7305j8133k3381
9586f4296M0308J8648j1404J6264L31o613r843j3996L386n437m145J8541J9843
9573A587R571k3274j745J2836o900J5239M0612k9333k6259O446J3507m035J0018
9560A8270K4122j1252q814J3185k3989p149L6498j2473k4293m556j0150N193K6939
$$ plain form
9648 35240 10731 -12700 -12586 -2404 26742 49646 28018 32637 54983 33350 18107 -6266
9636 -6266 -12890 -27329 -21999 -9967 -14229 1586 16546 30119 51945 62249 70877 57316 5579
9623 5579 42 45283 96339 64835 32090 16131 4955 -9125 -50434 -48354 -50062 -50705 -13309
9610 -13309 3677 19970 17357 4208 -8917 -6364 -8288 8981 53528 72100 34027 17715
9598 17715 -13327 -28708 -10495 41562 31971 28861 51584 24939 -5477 -22782 -40915 -64296
9586 -64296 -23988 -5340 -16744 -480 -149 -6762 -16605 -30601 -27215 -32652 -36797 -18256 1587
9573 1587 11158 -12116 -13861 -1025 -7925 7314 47926 18593 -7666 -1220 12287 8252 18270
9560 18270 42392 31140 22326 35511 11522 4373 40871 28398 4105 -451 -10601 -5408 21531
9547B1531L56m7l6772k6926L7631n218j4706J1645J6167J2786K9840p573o862
9534C1852k2573o498l259L283K5134j4024p009J3307K5354J0059l869K970J191
9521E5918m3658k2845j757J3680K2420R852k2863P007l681k2732K930J0032L6641
9508D0944L0155k5715m1005p581L0037j2985j7597O341k5741p772k297k9639j3682
9495g6537P8463M8024k6043j5079m140K323k9814r251j1457M709J7606K8955L2480
9482D0239J2446j4659l8822l7445K2467J4836K8422N6432k80j795r157n137j3087
9469E4460n001Q157O300l1609M583K890j4954l5566J3811k105P017k1078J6547
9456C452p850j9337J0890K9531q416q048M0158J6887q199M811o9253l2975r303
$$ plain form
9547 21531 21887 21840 -14932 -41858 -4227 -9445 -24151 -12506 3661 16447 46287 38714 31852
9534 31852 9279 2781 -478 2805 27939 13915 6906 20213 45567 55626 51757 54727 55918
9521 55918 12260 -10585 -12342 1338 23758 33610 10747 17754 14073 -8659 -5729 4303 40944
9508 40944 71099 45384 4379 -3202 26835 13850 -3747 2594 -23147 -30919 -33216 -62855 -76537
9495 -76537 1926 49950 23907 8828 4688 7011 -22803 -32054 -43511 -38802 -21196 7759 40239
9482 40239 52685 38026 -796 -38241 -15774 -938 27484 83916 83636 81841 72684 67547 54460
9469 54460 49459 57616 63916 32307 36890 39780 24826 -10740 3071 966 7983 -13095 3452
9456 3452 -4398 -23735 -12845 16686 8270 222 40380 57267 49068 53879 -15374 -48349 -57652
9443e7652j1068K2113K6833Q631k1465k4328k783J3953K1390k919l0207K3497
9431c4005O223J6362L1817J9534r372K0758l3141j0907J0577q549Q794J882j8870
9418A103l939j7971J508k181j6005R976L5158L5791l2875l5725l5425p431L0747
9405c7269K1500l0752J8559J2120m591p111k612j2637l9228M549K4885k5072M735
9392g2924O6616M8638L0795K412l7039m2659Q254J2133n977J4442J2558J618l5038
9379C829N344J6211j3767j7859k68J8945L785Q672p941j5930R099K3316n427k3339
9365D670j6216N172M2645j4731j721k3452j4706M0404L7738l156k0761l8561k0031
9352b2706J0156R33J4014n765Q16K689L0483K7567L1120k3863J8226N8138j7978
$$ plain form
9443 -57652 -68720 -46607 -19774 -11143 -32608 -56936 -59719 -45766 -24376 -27295 -57502 -34005
9431 -34005 -27782 -11420 20397 39931 30559 51317 18176 7269 17846 9297 18091 19973 1103
9418 1103 -2836 -20807 -19299 -21480 -37485 -27509 7649 43440 10565 -25160 -60585 -68016 -37269
9405 -37269 -15769 -46521 -27962 -15842 -20433 -27544 -30156 -42793 -82021 -77472 -52587 -77659 -72924
9392 -72924 -6308 42330 73125 75537 38498 -4161 4093 16226 10249 24691 37249 38867 3829
9379 3829 9173 25384 11617 -6242 -6510 12435 16220 24892 16951 1021 10120 33436 28009 4670
9365 4670 -11546 -6374 36271 21540 19819 -3633 -18339 22065 59803 56647 35886 -2675 -22706
9352 -22706 -12550 -11617 2397 -3368 -2552 137 30620 58187 89307 65444 83670 141808 123830
9339A23830l1368k7829l1761l9760K6153J1865P746J6031L315q844l0250l861
9327A5267j6770M46K4764L6361q863N849J5976J5445l5508l1353L6559j7792l2687
9314G694p991J6624j5565J5971j6318o823L3229q662O478j73J444J5953k7325
9301A4536Q50o079J7545k791J6874k3628K0125J0243r902M700J4629l041j4759
9288C9302k099k2376j7331K040j5095J0772J6909K3215K8434J5332p80J9950j5123
9275H3150m0445j1304P395p459k509K1802K0286J096q654k592l0060K9375L8047
9262I8128m510N933l5793n0348m631P387j2631o946P058L4245J8698l3072J4505
9249C8023M1672L1935j0224j6713L087q751r484m6158l1064J360M9056J7164o283
$$ plain form
9339 123830 92462 64633 32872 -6888 19265 31130 38876 54907 58222 49378 19128 15267
9327 15267 -1503 -1057 23707 60068 51205 57054 73030 88475 52967 21614 58173 40381 7694
9314 7694 -297 16327 762 16733 415 -6408 26821 18159 24637 24464 25908 41861 14536
9301 14536 15386 9307 26852 24061 40935 17307 37432 47675 37773 42473 57102 54061 39302
9288 39302 37203 14827 -2504 -464 -15559 -4787 12122 35337 63771 79103 78323 98273 83150
9275 83150 42705 31401 38796 31337 28828 50630 70916 72012 63358 60766 30706 60081 98128
9262 98128 93618 99551 63758 13410 8779 16166 3535 -3411 3647 37892 56590 23518 38023
9249 38023 79695 111630 101406 84693 87780 79029 69545 23387 -7677 -6317 42739 59903 53620
9236E3620q269J769j7748j1132M3417N634P896p630l1322j9073j0j3460k4073
9223b0381J4812N0972K3840K5349O118j1n516M3292k8911k2509l3055l0832M2218
9210F5386L4722J6550j1252L4762k0355m6003M853j4879M664J1183Q767k4848
9198F3550j7229P522k9877q122p338K8525L270j7073J3786j7436J2983J3610J4715
9185F0886m97k3504J8196Q017J0747j1984M170j8289j0822j4950j4911J2785K8662
9172D8506P192O999M7674J5869m3664l7207K1813J1030l3072k0065J4213L7172
9160G6460l017K1685L4629j8174n458l460l2953O042K625K4157J9153k1345n966
9147I4378L8737p272j7411L6452J4013l500m587j5424J4011n751J612K8302k4641
$$ plain form
9236 53620 45351 47120 29372 18240 61657 67291 75187 67557 36235 17162 17152 3692 -20381
9223 -20381 -5569 45403 69243 94592 100710 100699 95183 138475 109564 87055 54000 23168 65386
9210 65386 100108 116658 105406 140168 119813 73810 78663 63784 68448 79631 88398 63550
9198 63550 46321 53843 23966 15844 8506 37031 40301 23228 37014 19578 32561 46171 60886
9185 60886 60389 36885 55081 63098 73845 61861 66031 47742 36920 21970 7059 19844 48506
9172 48506 55698 62697 110371 126240 82576 45369 67182 78212 45140 25075 39288 76460
9160 76460 73443 95128 129757 111583 106125 102665 69712 75754 78379 102536 121689 100344 94378
9147 94378 133115 125843 108432 144884 158897 155397 150810 135386 149397 143646 145258 173560 148919
9134A48919n2385L3804M5817r329J2644J0827j5554J8189J85R496P895l683l534
9121B03291J3122J7772O395L4460K6814L0628J8732m187L9418K9298J3717N0022
9109D79482O8330O6757P0041J29885J38592J57420J82090K19624K42107K57877
9099B012205L67164M48281N11056P22391J038273J532969K331968L515071M907567
9090A7386945N820869O102144N466175n30044r163118p836383m673850k787136
9082I785602j837154j297750r91184p96186o66844n94207n74227m48416m28640
9073B150994l71116k88841k09343j36634j52390j37873o3596p9718o2676m2160
9063F06647m6954l6559m1842l2095l8559l607o692Q86Q60l9801l3618K159l874
$$ plain form
9134 148919 96534 130338 176155 166826 179470 190297 174743 192932 193117 202613 210508 206825 203291
9121 203291 216413 234185 240580 275040 301854 332482 351214 347027 386445 415743 429460 479482
9109 479482 547812 614569 684610 814495 953087 1110507 1292597 1512221 1754328 2012205
9099 2012205 2379369 2827650 3338706 4061097 5099370 6632339 8964307 12479378 17386945
9090 17386945 23207814 29309958 34776133 34246089 25082971 17246588 12572738 9785602
9082 9785602 7948448 6650698 5659514 4863328 4196484 3602277 3028050 2579634 2150994
9073 2150994 1779878 1491037 1281694 1145060 992670 854797 791201 711483 648807 606647
9063 606647 559693 523134 481292 449197 410638 407031 400339 401225 402085 362284 328666 330825 326951
9050C26951K4706k0029o3894k1229K1451j1705j975J7079m324k2304k2343P519
9038B29903J8752k8839j3886J2862j1541m7242j5625J4893K4813L312n2573Q725
9026A43554K2359L683L5751q618k5912J8027k2661l4501j2956l3769k6283j2467
9014D6207L002M9976m211J3912J5947n5559N052K6867J5662m2631p62L5206l9707
9001F8961j385j7654j6051K3285N80J2896l2574J2913L9911Q455k02k2562k6829
8988D9744o915K4161Q272k9593J2805J6712m334m6886q733M964k874J9089k7609
8975H803L344L6700M6860N469J0766J2887k0808k9018j8404j1129M316J1984N191
8962F6961m165l1911K8254J6666l5345J9751o384l9256J91J8871K9501k7644K443
$$ plain form
9050 326951 351657 331628 267734 246505 267956 256251 254276 271355 267031 244727 222384 229903
9038 229903 248655 219816 205930 218792 207251 160009 144384 159277 184090 187402 134829 143554
9026 143554 165913 169596 205347 196729 170817 188844 166183 131682 118726 84957 58674 46207
9014 46207 49209 99185 94974 108886 124833 69274 74326 101193 116855 74224 73462 108668 68961
9001 68961 67576 49922 33871 57156 57736 70632 38058 50971 90882 99337 99135 76573 49744
8988 49744 42829 66990 75262 45669 58474 75186 70852 23966 15233 20197 17323 36412 8803
8975 8803 12147 48847 95707 101176 111942 124829 104021 75003 56599 45470 49786 61770 66961
8962 66961 62796 30885 59139 75805 40460 60211 53827 14571 14762 33633 63134 35490 37933
8949C7933j0550L6590Q170m3166M127J4285k7821l2328K4495L8876J4358K8241
8937I3210L3211N678j7083k4174K5835K8757O006k8491m7995q276J9482K068l112
8924H5116M251R729j2455L910j279m2994l1706J6056M2863L3282M2305J3110J2762
8911A74950J9894K2543k617M4654J10692P8000K1756M4011J16715J72047K56809
8900A059454L22468L74066L98277L53242K50353j59789n14723n21535l49774k15816
8890I96223j77024j40565q6811o7620n1637m5761m3755n5005p3335l9069j0312
8879B05329J95l737J4428p344J6772j9709J112k682k9524K7276O4485L0171L8494
8866C35266R3874K0922P54P0832P2033N6354O6950J45579K38009L01029M70847
$$ plain form
8949 37933 27383 63973 72143 28977 33104 47389 19568 -12760 11735 50611 64969 93210
8937 93210 126421 132099 115016 90842 116677 145434 151440 122949 74954 66678 86160 88228 85116
8924 85116 89367 99096 86641 90551 89272 46278 14572 30628 73491 106773 149078 162188 174950
8911 174950 194844 217387 214770 259424 370116 448116 469872 513883 630598 802645 1059454
8900 1059454 1381922 1755988 2154265 2507507 2757860 2598071 2083348 1561813 1212039 996223
8890 996223 819199 678634 591823 524203 472566 426805 383050 328045 254710 215641 205329
8879 205329 205524 201787 216215 208871 225643 205934 207046 204364 174840 202116 266601 296772 335266
8866 335266 429140 450062 450816 521648 593681 650035 716985 862564 1100573 1401602 1872449
$$ [...]
##END NTUPLES=NMR SPECTRUM
##END=
