##TITLE=Analysis number 323600
Compound Code cc 63604
Book Reference 510/2
Project Code adrs
Chemist Name jimp
##JCAMPDX= 6.0         $$ Bruker NMR JCAMP-DX V2.0
##DATA TYPE= NMR SPECTRUM
##DATA CLASS= NTUPLES
##ORIGIN= Bruker BioSpin GmbH
##OWNER= nmr
$$ XWIN-NMR		Version 3.5
$$ Mon Oct 30 14:32:36 2006 GMT Standard Time (UT+0h)  MAYBRIDGE\nmr@NMR_250MHZ
##.OBSERVE FREQUENCY= 250.131544655141
##.OBSERVE NUCLEUS= ^1H
##.ACQUISITION MODE= SIMULTANEOUS (DQD)
##.ACQUISITION SCHEME= undefined
##.AVERAGES= 16
##.DIGITISER RES= 18
##SPECTROMETER/DATA SYSTEM= dpx250
##.PULSE SEQUENCE= zg30
##.SOLVENT NAME= CDCl3
##.SHIFT REFERENCE= (INTERNAL, CDCl3, 0, 16.522)
##AUDIT TRAIL= $$ (NUMBER, WHEN, WHO, WHERE, WHAT)
$$ ##TITLE= Audit trail, XWIN-NMR		Version 3.5
$$ ##JCAMPDX= 5.01
$$ ##ORIGIN= Bruker BioSpin GmbH
$$ ##OWNER= nmr
$$ C:\u/data/dgb/nmr/ADRS/1920/pdata/1/auditp.txt
$$ ##AUDIT TRAIL=  $$ (NUMBER, WHEN, WHO, WHERE, WHAT)
(   1,<2006-10-30 14:32:09.33 +000>,<MAYBRIDGE\nmr>,<NMR_250MHZ>,
      <created by zg, POWCHK disabled, PULCHK disabled
       configuration hash MD5:
       49 4B E0 1D 92 C2 6B 37 9F E6 65 BC 52 41 86 1D
       data hash MD5: 64K
       23 93 56 BE C0 A4 A2 14 9E 1C 16 9F B4 24 95 3A>)
(   2,<2006-10-30 14:32:26.18 +000>,<MAYBRIDGE\nmr>,<NMR_250MHZ>,
      <Start of raw data processing
       ef LB = 0.3 FT_mod = 6 PKNL = 1 SI = 32K 
       data hash MD5: 32K
       77 24 D6 3F F9 8F 11 4B 04 20 5F 5F F4 CB 44 97>)
(   3,<2006-10-30 14:32:27.72 +000>,<MAYBRIDGE\nmr>,<NMR_250MHZ>,
      <apk 
       data hash MD5: 32K
       CD F8 B5 17 0A 36 5F 18 55 58 1F 14 93 4E D9 87>)
(   4,<2006-10-30 14:32:28.63 +000>,<MAYBRIDGE\nmr>,<NMR_250MHZ>,
      <abs ABSG = 5 
       data hash MD5: 32K
       D8 37 45 6A 85 DF 94 B3 68 09 4F 0F 08 CF 78 C2>)
$$ ##END=
$$ 
$$ hash MD5
$$ 43 9B B4 36 AF B2 4E 43 E4 5B 83 32 E2 ED 07 09
##$RELAX= 
##$RELAX= 
##$RELAX= 
##$RELAX= 
##$RELAX= 
##$RELAX= 
##$RELAX= 
$$ Bruker specific parameters
$$ --------------------------
##$DU= <C:\u>
##$EXPNO= 1920
##$NAME= <ADRS>
##$PROCNO= 1
##$TYPE= <nmr>
##$USER= <dgb>
##$AMP= (0..31)
100 100 100 100 100 100 100 100 100 100 100 100 100 100 100 100 100 100 
100 100 100 100 100 100 100 100 100 100 100 100 100 100 
##$AQSEQ= 0
##$AQ_mod= 3
##$AUNM= <au_zg>
##$AUTOPOS= <27 >
##$BF1= 250.13
##$BF2= 250.13
##$BF3= 250.13
##$BF4= 250.13
##$BF5= 500.13
##$BF6= 500.13
##$BF7= 500.13
##$BF8= 500.13
##$BYTORDA= 1
##$CFDGTYP= 0
##$CFRGTYP= 5
##$CHEMSTR= <none>
##$CNST= (0..31)
1 1 145 1 1 1 1 1 1 1 1 1 1 1 1 1 1 1 1 1 1 1 1 1 1 1 1 1 1 1 1 1 
##$CPDPRG= <>
##$CPDPRG1= <>
##$CPDPRG2= <>
##$CPDPRG3= <>
##$CPDPRG4= <mlev>
##$CPDPRG5= <mlev>
##$CPDPRG6= <mlev>
##$CPDPRG7= <mlev>
##$CPDPRG8= <mlev>
##$CPDPRGB= <>
##$CPDPRGT= <>
##$D= (0..31)
0 1 0 0 0 0 0 0 0 0.06 0 0 0 0 0 0 0.0002 0 0 0 0 0 0 0 0 0 0 0 0 0 0 
0 
##$DATE= 1162218726
##$DBL= (0..7)
120 120 120 120 120 120 120 120 
##$DBP= (0..7)
150 150 150 150 150 150 150 150 
##$DBP07= 0
##$DBPNAM0= <>
##$DBPNAM1= <>
$$ [...]
##$SUBNAM7= <"">
##$SUBNAM8= <"">
##$SUBNAM9= <"">
##$SW= 20.6930455092707
##$SWIBOX= (0..15)
0 0 3 0 0 0 0 0 0 0 0 0 0 0 0 0 
##$SW_h= 5175.983436853
##$TD= 65536
##$TD0= 1
##$TE= 683.16
##$TE2= 300
##$TE3= 300
##$TEG= 300
##$TL= (0..7)
0 120 120 120 120 120 120 120 
##$TP= (0..7)
150 150 150 150 150 150 150 150 
##$TP07= 0
##$TPNAME0= <>
##$TPNAME1= <>
##$TPNAME2= <>
##$TPNAME3= <>
##$TPNAME4= <>
##$TPNAME5= <>
##$TPNAME6= <>
##$TPNAME7= <>
##$TPOAL= (0..7)
0.5 0.5 0.5 0.5 0.5 0.5 0.5 0.5 
##$TPOFFS= (0..7)
0 0 0 0 0 0 0 0 
##$TUNHIN= 0
##$TUNHOUT= 0
##$TUNXOUT= 0
##$USERA1= <user>
##$USERA2= <user>
##$USERA3= <user>
##$USERA4= <user>
##$USERA5= <user>
##$V9= 5
##$VALIST= <valist>
##$VCLIST= <CCCCCCCCCCCCCCC>
##$VD= 0
##$VDLIST= <DDDDDDDDDDDDDDD>
##$VPLIST= <PPPPPPPPPPPPPPP>
##$VTLIST= <TTTTTTTTTTTTTTT>
##$WBST= 1024
##$WBSW= 4
##$XGAIN= (0..3)
0 0 0 0 
##$XL= 0
##$YL= 0
##$YMAX_a= 583171
##$YMIN_a= -371133
##$ZGOPTNS= <>
##$ZL1= 120
##$ZL2= 120
##$ZL3= 120
##$ZL4= 120
##$ABSF1= 16.522
##$ABSF2= -4.171173
##$ABSG= 5
##$ABSL= 3
##$ALPHA= 0
##$AQORDER= 0
##$ASSFAC= 0
##$ASSFACI= 0
##$ASSFACX= 0
##$ASSWID= 0
##$AUNMP= <proc_1d>
##$AZFE= 0.1
##$AZFW= 0.1
##$BCFW= 0
##$BC_mod= 0
##$BYTORDP= 0
##$COROFFS= 0
##$CY= 12.5
##$DATMOD= 1
##$DC= 0
##$DFILT= <>
##$DTYPP= 0
##$F1P= 14.0000005364418
##$F2P= -0.99999901652339
##$FCOR= 0.5
##$FTSIZE= 32768
##$FT_mod= 6
##$GAMMA= 0
##$GB= 0
##$INTBC= 1
##$INTSCL= 1
##$ISEN= 128
##$LB= 0.3
##$LEV0= 0
##$LPBIN= 0
##$MAXI= 10000
##$MC2= 0
##$MEAN= 0
##$ME_mod= 0
##$MI= 0
##$NCOEF= 0
##$NC_proc= -4
##$NLEV= 6
##$NOISF1= 0
##$NOISF2= 0
##$NSP= 0
##$NTH_PI= 0
##$NZP= 0
##$OFFSET= 16.522
##$PC= 1
##$PHC0= -42.34053
##$PHC1= 5.152905
##$PH_mod= 1
##$PKNL= yes
##$PPARMOD= 0
##$PSCAL= 4
##$PSIGN= 0
##$REVERSE= no
##$SF= 250.13
##$SI= 32768
##$SIGF1= 0
##$SIGF2= 0
##$SINO= 400
##$SIOLD= 32768
##$SREGLST= <1H.CDCl3>
##$SSB= 0
##$STSI= 32768
##$STSR= 0
##$SW_p= 5175.98343685301
##$SYMM= 0
##$S_DEV= 0
##$TDeff= 65536
##$TDoff= 0
##$TI= <Analysis number 999999
Compound Code 99
Book Reference 9
Project Code 9>
##$TILT= no
##$TM1= 0
##$TM2= 0
##$TOPLEV= 0
##$USERP1= <user>
##$USERP2= <user>
##$USERP3= <user>
##$USERP4= <user>
##$USERP5= <user>
##$WDW= 1
##$XDIM= 32768
##$YMAX_p= 302145911
##$YMIN_p= -416711
$$ End of Bruker specific parameters
$$ ---------------------------------
##NTUPLES= NMR SPECTRUM
##VAR_NAME=  FREQUENCY,     SPECTRUM/REAL,   SPECTRUM/IMAG
##SYMBOL=    X,             R,               I
##VAR_TYPE=  INDEPENDENT,   DEPENDENT,       DEPENDENT
##VAR_FORM=  AFFN,          ASDF,            ASDF
##VAR_DIM=   32768,         32768,           32768
##UNITS=     HZ,            ARBITRARY UNITS, ARBITRARY UNITS
##FACTOR=    0.157963299565203, 1,           1
##FIRST=     4132.6476996994, 0,             0
##LAST=      -1043.33573715361, 0,           0
##MIN=       -1043.33573715361, -416711,     0
##MAX=       4132.6476996994, 302145911,     0
$$ Real data points
##PAGE= N=1
##DATA TABLE= (X++(R..R)), XYDATA
$$ [...]
19978c0373M1963k8933n2360K6346l8873m6283J2457K1097M0206p5486q8153O4088
19966a54304J07921l3902l6873n26m5152m4297j5944J30631O9344N3810m424J898
19954B8182O4390L3704n9366n8935l2120m0095K4002N9345m1183q331R2264L6611
19942I8468R68p0821j27812J2884k2292J26032K8748k2889l6203q7735j803K6761
19930g5694Q1242O440P774M9732J1613K9016O0992p3495m3532O1834j2984P6551
19918A79489k8785j6462R7866p7830m1973l6065q661J2998Q327n5077k8724m726
19906C77P6410M5796j68414m9135M2400J2443K7076O0220j1482N347J3685n9254
19894d531k675k4104r776P9590P0171K3377J2622K3419n3175N880n5775j30669
$$ plain form
19978 -30373 11590 -17343 -69703 -43357 -82230 -128513 -116056 -94959 -54753 -130239 -218392 -154304
19966 -154304 -46383 -80285 -117158 -117684 -162836 -207133 -223077 -92446 -23102 30708 26284 28182
19954 28182 92572 126276 66910 7975 -24145 -64240 -40238 19107 -22076 -30407 61857 98468
19942 98468 99436 28615 -99197 -86313 -108605 17427 46175 23286 -12917 -100652 -102455 -75694
19930 -75694 5548 11988 19762 69494 81107 110123 171115 97620 54088 115922 102938 179489
19918 179489 150704 134242 232108 154278 112305 76240 67579 80577 88904 33827 5103 377
19906 377 76787 122583 -45831 -94966 -52566 -40123 -13047 47173 35691 41038 54723 -4531
19894 -4531 -7206 -31310 -41086 38504 108675 132052 144674 168093 114918 120798 65023 -65646
19882f5646l7636K8568J35105l173p944r4638J9631P4919J13574j1113l9200p6588
19870C5859p1825k1903O3018m4164j8760J6644N3393q5568l85M3657L3485L4496
19858C7947K1657o6327j12392J7263Q0638O6992M3061m1166l7636R768O0912O0705
19846A41422O373o1328p8706P576m3277L7451j9488L5337N3174n455j12734M5893
19834F238M6453r0351J4982K1406p7757J6510O0884l5270o291P3441J59130L9899
19822B29274n8021n5742j312j5446O245N0122P4189L4712l3284p7357j1914K8842
19810A70308M2592o5672j7796l4821q2995J28986L7266p6155M534N0003j5256
19799A40994q3853q1804j8640M48N1415N8095R4330m3812N4q8700k8871j3493
$$ plain form
19882 -65646 -103282 -74714 60391 57218 49274 -45364 -25733 49186 162760 151647 112447 35859
19870 35859 -35966 -57869 5149 -39015 -57775 -41131 12262 -73306 -73691 -30034 3451 37947
19858 37947 59604 -6723 -119115 -101852 -21214 45778 88839 47673 10037 19805 80717 141422
19846 141422 147795 86467 7761 15337 -27940 9511 -9977 25360 78534 73079 -39655 6238
19834 6238 52691 -37660 -22678 -1272 -79029 -62519 -1635 -36905 -43196 30245 189375 229274
19822 229274 171253 115511 114199 98753 104998 155120 229309 264021 230737 153380 141466 170308
19810 170308 212900 147228 129432 94611 11616 140602 177868 101713 106247 156250 140994
19799 140994 57141 -24663 -43303 -42855 8560 66655 160985 117173 117227 28527 -344 -13837
19787a3837j7090l751M7791Q840J7690M3694l5721k9755N0340P5948M5081k7065
19775A62165p4369q0517L4804M617O9286n8754j09377q9328k2541P7540P9721
19764f753N1900J3199j2821K8735N5441J225O9075m3755p739J12776J12661j2711
19752C61233K388P6518o9975m5142J41952L8375L2665m739L0308M317m001J26543
19740F90442K356p1991m3484M6457m4049r1241P976j7202j12737o1228J5321j7951
19728C02669o7145J6984O7036m373j40958P7695O71o4948n6242p960J4114j7376
19716A20167j25081l3708M8968O9158O0659j7087k275K8228o3148N5361J9689
19705A60931p6098l4963L4607L0851P6518J5942l8144K98o4167o9034n915k7613
$$ plain form
19787 -13837 -30927 -34678 13113 21953 39643 83337 47616 17861 68201 144149 189230 162165
19775 162165 87796 7279 42083 46700 115986 57232 -52145 -141473 -164014 -86474 -6753
19764 -6753 45147 58346 45525 74260 129701 130926 200001 156246 148507 261283 373944 361233
19752 361233 363621 440139 370164 325022 466974 505349 538014 533275 563583 567900 563899 690442
19740 690442 692798 620807 577323 623780 579731 488490 496466 479264 366527 305299 320620 302669
19728 302669 235524 252508 319544 315171 174213 251908 252579 187631 131389 123429 137543 120167
19716 120167 -4914 -38622 10346 79504 140163 123076 120801 149029 85881 141242 160931
19705 160931 84833 49870 84477 115328 191846 207788 169644 169942 105775 36741 30826 3213
19693C213n5316j1466J4597l2247l2216N6618J4749n1176N0519P9174p963k432
19681B6054p9478k1901J01768J52891Q2675q7200j5028p6435r2619J293O8988
19670F1008J5493O7113M2280K6399j4327p6267m3931L8876P7603q6491l4906m9754
19658B3096q959L3307K7065l1785o5604j10840q63O3961P2914P8610o03j21710
19646d1411k7912L6920O9379Q0784J25779Q130k6761J0917o2003m2131j1472O1645
19634A81864l6825r9092o8191J4893R55J2236J8003N1548P7071k5783k103N6367
19622A80943J0767l6915r2110r988N5120k4126l1379M9043l2112K1097k6602q8517
19610b4779O6386J04069o4460n0131P899m8787K460K2761M5898r6226q0825J27122
$$ plain form
19693 3213 -52103 -63569 -48972 -81219 -113435 -56817 -42068 -93244 -42725 36449 28486 26054
19681 26054 -53424 -75325 26443 179334 262009 174809 159781 83346 -9273 -7980 61008
19670 61008 76501 143614 185894 212293 197966 121699 77768 116644 194247 107756 72850 23096
19658 23096 14137 47444 74509 42724 -22880 -133720 -134583 -70622 2292 80902 80299 -41411
19646 -41411 -69323 -32403 36976 117760 243539 251669 224908 235825 173822 131691 120219 181864
19634 181864 145039 45947 -22244 -7351 -6396 5840 23843 75391 152462 126679 124576 180943
19622 180943 191710 154795 62685 52697 107817 83691 52312 101355 69243 90340 63738 -24779
19610 -24779 41607 145676 81216 31085 38984 -9803 -7343 15418 61316 -34910 -115735 11387
19598A1387k5119p2954L8543J6452M1058J06991J73350J0338j00221p4031O7561
19587A93355K6262M5547R8142o632n6072K4304L8528P6347j343J9728k0188J7561
19575D55539m9882j1447j3448n9921o078O4604N8584O2438j74593r1391j0835
19564B23570L4066o8982l7379J3033R2373j3402K5500m4724l9582p7735L7348
19553A44086P2237n1348k3027J8831P9702m2809L6929r910m540j8627M8019R4067
19541C43610o6011O8898J07671o5005p469n6351r726J40353M8213j3981N0572
19530E40774M9430l36q4476l5666q9988o5559n5930J26444P4865m0340q7043L605
19518C35780N6112o359J0286j28693q2792j9097M7984J13602L5260j4387L6431
$$ plain form
19598 11387 -13732 -86686 -48143 -31691 9367 116358 289708 300046 199825 125794 193355
19587 193355 219617 265164 363306 356674 300602 324906 363434 439781 438438 458166 437978 455539
19575 455539 405657 394210 380762 320841 314763 379367 437951 500389 325796 234405 223570
19564 223570 257636 188654 151275 164308 256681 243279 268779 224055 184473 106738 144086
19553 144086 216323 164975 141948 160779 240481 197672 234601 224691 220151 201524 249543 343610
19541 343610 277599 346497 454168 389163 381694 325343 315617 455970 504183 490202 540774
19530 540774 590204 589868 505392 469726 379738 314179 258249 384693 459558 419218 332175 335780
19518 335780 391892 385533 395819 267126 184334 165237 213221 326823 362083 347696 384127
19507C84127k5157r2090Q3080L2887q6043p0128J07748j5771K7826k0280o5515
19496B60684j5136r736j9487m0857m0511K7889J08170L3400j3356L6403n5447
19485B72016r9408o3800M3769M2499K5386m6409Q9845o8673p6023L4777O0737
19474B14716m9732Q5434L0972k1358n9233j06408K6605N15R3631N9254l0077M635
19462B48954K9395n1036L1147k5112j30520m6929O3599J33986K0557j19779p2879
19451H1383j81146R1640N2753K1674R3849k9244j8036J1220m6828M339j8309M9920
19439A13215R5597k1063N8463M0679j5285j52807n9217P6766m3789j0815P4536
19428A56280r82l8709J1499N7495R6020M6799n2792k6624j19533o8455k5622J3469
$$ plain form
19507 384127 358970 266880 349960 382847 296804 226676 334424 318653 346479 326199 260684
19496 260684 245548 235812 216325 175468 134957 162846 271016 304416 291060 327463 272016
19485 272016 172608 108808 152577 195076 220462 174053 263898 195225 119202 153979 214716
19474 214716 164984 250418 281390 260032 200799 94391 120996 121511 215142 274396 244319 248954
19462 248954 278349 227313 258460 233348 102828 55899 119498 253484 274041 154262 81383
19451 81383 -99763 -8123 44630 66304 160153 130909 112873 124093 77265 81604 63295 113215
19439 113215 208812 187749 246212 286891 271606 118799 59582 136348 92559 81744 156280
19428 156280 155298 116589 128088 185583 281603 328402 275610 248986 129453 60998 35376 48845
19416D8845k7936k6497L5179J30266n862J9119L3936l3649P6343r5935q6785Q6463
19404A53487J61513j7972m4960q477r0040J4813l0603L0752m6315j6842l63O6084
19392A71077o3231p9195n4697k9293J02601J56217Q0202m6367n4186J79225q25
19381C61528m3946n0852r1166m5090J56223J23572K9973J14053O1978l6030o3770
19370E16473M2045k3745K388k6344l9638q0429J7321R6622J24234N4268j8686
19359F64509k0711p8961j6784l4515q6798p4889M7461R276k0233j6734j2683o9347
19347B89591L7396m1689l730k8780L8647M8780K7038k7722L7767L5597N928Q6507
19335E05330L6685j37996j38769L7645J74915M5152N1374N6976M5549O5164q4759
$$ plain form
19416 48845 20909 -5588 29591 159857 153995 173114 207050 173401 249744 153809 67024 153487
19404 153487 315000 297028 252068 243591 153551 168364 137761 168513 122198 105356 104993 171077
19392 171077 107846 28651 -26046 -55339 47262 203479 283681 237314 183128 362353 361528
19381 361528 317582 266730 175564 130474 286697 410269 440242 554295 616273 580243 516473
19370 516473 558518 534773 537161 510817 471179 390750 408071 504693 628927 683195 664509
19359 664509 643798 564837 548053 513538 426740 351851 399312 408588 388355 371621 358938 289591
19347 289591 326987 285298 281568 252788 291435 340215 367253 339531 377298 412895 418823 505330
19335 505330 542015 404019 265250 302895 477810 522962 574336 631312 676861 742025 657266
19324F57266k5477L2225L7117J48368M8644p6357j7100o4345n0727K6895J2736
19313G29245j0744L8655q4697K2792o805l0202n5744j958q957Q6565N8392k836
19301G33706P718k3954k5271p657J19452L1958q5171J1947K7080K9340l2626J2948
19289G99470K05263J72975J22915L6281l9206q5994J16368J01667n272J07341
19279A531808J18291K46517J53030J31195m868J25712K65860K82887K56798K03329
19269C310559K77670K47996K95364K78848M74538N70890N45211P32360R71151
19260G704587J118783J515931K016784K549502K834765L229099L798795M480288
19252B9248534M677849M296983L963775M025860M362548M338470L787148L473942
$$ plain form
19324 657266 631789 664014 701131 849499 898143 821786 804686 740341 689614 716509 729245
19313 729245 718501 757156 672459 695251 688446 658244 602500 600542 591585 678150 736542 733706
19301 733706 741424 717470 692199 684542 803994 835952 750781 762728 789808 819148 786522 799470
19289 799470 1004733 1177708 1300623 1336904 1297698 1211704 1328072 1429739 1424467 1531808
19279 1531808 1650099 1896616 2049646 2180841 2175973 2301685 2567545 2850432 3107230 3310559
19269 3310559 3588229 3836225 4131589 4410437 4884975 5455865 6001076 6733436 7704587
19260 7704587 8823370 10339301 12356085 14905587 17740352 20969451 24768246 29248534
19252 29248534 33926383 38223366 42187141 46213001 50575549 54914019 58701167 62175109
19244F2175109L900246M591262N042552M806382M016203L072145K510290K090231
19236I2204420Q03269j202090k472375k813943k874521k950320l293755l567457
19228G3833228l653347l359872l091399l549856m446025n023669m862269m674763
19220D1172028m873516m912892m617605l919865l227455k807013k326634j928219
19212A2558829j515565j136534j010362p01539o31862o48970o11220m35592k92671
19203E574514l43716m08520l39489k34391j80910j62779k76745j68276k34515
19194C225173j78849j23902j67788j10409p3347j14502k2595k0023q8779j9686
19184B305293j28494j52691q790r6277j60895m4419n642j24429j33819p1964q7908
$$ plain form
19244 62175109 66075355 70666617 75709169 80515551 84531754 87603899 90114189 92204420
19236 92204420 93007689 91805599 89333224 86519281 83644760 80694440 77400685 73833228
19228 73833228 70179881 66820009 63728610 60178754 55732729 50709060 45846791 41172028
19220 41172028 36298512 31385620 26768015 22848150 19620695 16813682 14487048 12558829
19212 12558829 11043264 9906730 8896368 8194829 7562967 6913997 6302777 5867185 5574514
19203 5574514 5230798 4822278 4482789 4248398 4067488 3904709 3627964 3459688 3225173
19194 3225173 3046324 2922422 2754634 2644225 2570878 2456376 2433781 2413758 2324979 2305293
19184 2305293 2176799 2024108 2015318 1919041 1758146 1713727 1708085 1583656 1449837 1377873 1289965
19173A289965m7349M2588J7552O2476N3820Q893n4191N3240m4241j90239l3977
19162A158537J5347L946m698n1861n0228J3464M023o705r0716n7366J7924k8798
19150I22869p453J17629O807m7277j04191N9369N1060O3551k176J6859j00223
19139I76824j09387p1436P2746M6024k8840Q1882K0832K8833P4649n4944k7749
19128A009434L1064L5199l6080O8286J60955Q2095R8703M9711J9246Q7584J02834
19117A709031q6985q1236j43218o6903O5778L9114J35032Q7852M0281J20777L0590
19106A850113L0404K8664J07336Q7302M8680J38251J96016L19914L13369J25306
19096C245355J10700J84144L39764L79283M82404O41584Q39774J026405J252601
$$ plain form
19173 1289965 1242616 1285204 1302756 1365232 1419052 1427945 1373754 1426994 1382753 1192514 1158537
19162 1158537 1173884 1177830 1173132 1121271 1071043 1084507 1088530 1081825 991109 933743 951667 922869
19150 922869 915416 1033045 1039852 992575 888384 947753 998813 1062364 1060188 1077047 976824
19139 976824 867437 796001 868747 914771 885931 967813 988645 1017478 1092127 1037183 1009434
19128 1009434 1040498 1075697 1039617 1107903 1268858 1350953 1449656 1499367 1518613 1606197 1709031
19117 1709031 1622046 1540810 1397592 1330689 1396467 1435581 1570613 1658465 1698746 1819523 1850113
19106 1850113 1880517 1909181 2016517 2103819 2152499 2290750 2486766 2806680 3120049 3245355
19096 3245355 3356055 3540199 3879963 4259246 4741650 5383234 6223008 7249413 8502014
19087H502014J648794K213360K788301L086582L204784L295792K857805K417543
19079C0014975K217673K124319K207020K346965K543281K576870K437121J895569
19071D8363793J053694Q996r69203j860380k263909k346696k182333j775476j673566
19062C6354920j788583k081557k286541k395245k717890k941379k886002k647477
19054A6610246k153200j817532j386668r44797o19242n31950l06221j48375j94920
19045H507341K8348L11422L93578N18146R35368J441910J925985K590264L142840
19036A9795202L485505L653740L702029L326491K755785K545120K467622K541947
19028D4273441K770996L143647L346692K988780K263656J051126k69355j379621
$$ plain form
19087 8502014 10150808 12364168 15152469 18239051 21443835 24739627 27597432 30014975
19079 30014975 32232648 34356967 36563987 38910952 41454233 44031103 46468224 48363793
19071 48363793 49417487 49426483 48457280 46596900 44332991 41986295 39803962 38028486 36354920
19062 36354920 34566337 32484780 30198239 27802994 25085104 22143725 19257723 16610246
19054 16610246 14457046 12639514 11252846 10308049 9688807 9156857 8850636 8702261 8507341
19045 8507341 8535689 8847111 9240689 9758835 10694203 12136113 14062098 16652362 19795202
19036 19795202 23280707 26934447 30636476 33962967 36718752 39263872 41731494 44273441
19028 44273441 47044437 50188084 53534776 56523556 58787212 59838338 59568983 58189362
19020E8189362k200810k710778k829135k583243k185266k049984k324408k634877
19012C8670861k984321l280925l511597l793065l556191l324717k793484k333161
19004A3093400j864016j471835j081634p92714q09689n13257m51800n29533m73920
18995E105002l85836l05771l03925k03861j30902j12058k14811j82335k17801
18986C047702j54783j21983j41947j26042o3535j15989j27163j01272j56380r0083
18976A848525L612l9553p6936j9866L7436J8176j06689j15884j5051o8267p5819
18965A389684m262p1773K0647O3517M4886j1151m253P6993J29701m2308j15996
18954A475685k9219p614K3914o976O883L799n441l7286q9091p4639o9661l5485
$$ plain form
19020 58189362 55988552 53277774 50448639 47865396 45680130 43630146 41305738 38670861
19012 38670861 35686540 32405615 28894018 25100953 21544762 18220045 15426561 13093400
19004 13093400 11229384 9757549 8675915 7883201 7073512 6560255 6108455 5578922 5105002
18995 5105002 4719166 4413395 4109470 3905609 3774707 3662649 3447838 3265503 3047702
18986 3047702 2892919 2770936 2628989 2502947 2439412 2323423 2196260 2094988 1938608 1848525
18976 1848525 1852137 1812584 1735648 1715782 1753218 1771394 1664705 1548821 1533770 1465503 1389684
18965 1389684 1385422 1313649 1334296 1397813 1442699 1431548 1427295 1504288 1633989 1591681 1475685
18954 1475685 1446466 1438852 1462766 1455790 1462673 1466472 1461031 1423745 1334654 1260015 1190354 1154869
18942A154869M6795J01088n8266L9810j95656m9620j7593l0892l547j8214l4345
18931I34429M5028m0268j0419K9814n4643k7053P3860j6790O8966J3624n0556
18920I65992O5830L2821m7235l8069L303J21839K9137k9937q7771J2414J78506
18909A206830L4246j8425J02189P1493J00950J81616J70641J88357J55256J67258
18899B360411P9352j3053J65100O6770K49273K96780K55619L46082L62582N32447
18889D701363O83703R03062J232636J605464J982011K037698K136206K396805
18881A7678948K571551K502365K073440J810293J922806J938877J822529J707753
18873C4028562J711824J673831J262185Q10939O83281L08040n60497j038206j188960
$$ plain form
18942 1154869 1201664 1302752 1244486 1284296 1088640 1039020 1021427 990535 986988 968774 934429
18931 934429 979457 939189 928770 958584 903941 876888 950748 933958 1002924 1016548 965992
18920 965992 1031822 1064643 1017408 979339 982642 1104481 1133618 1103681 1015910 1028324 1206830
18909 1206830 1241076 1222651 1324840 1396333 1497283 1678899 1849540 2037897 2193153 2360411
18899 2360411 2439763 2426710 2591810 2658580 2907853 3204633 3460252 3806334 4168916 4701363
18889 4701363 5385066 6288128 7520764 9126228 11108239 13145937 15282143 17678948
18881 17678948 20250499 22752864 24826304 26636597 28559403 30498280 32320809 34028562
18873 34028562 35740386 37414217 38676402 39487341 40170622 40478662 39918165 38879959 37690999
18864C7690999j387716j737375j566340j270365j362574j740802k042483j968399
18856B4614945j899357k094870k359285k119049j814362j549223j368906j094590
18848A0315303p96436m66847r1256j80870N652J21326L97476P10116J198431J542193
18838A2755088J992714K634092K880012L089461L426536L850086L872008L179930
18830C7679927K537418K587171K760045K385930K064981K280493K426207K043344
18822E6765516J341280R89317N49778l92813j419087j765631k097403k594028
18814E1376929k852835k363714k370836k881457l087742l030160k986274l284973
18806B8518938l486088l281669l003062k623305k332217j974747j517385j326106
$$ plain form
18864 37690999 36303283 34565908 32999568 31729203 30366629 28625827 26583344 24614945
18856 24614945 22715588 20620718 18261433 16142384 14328022 12778799 11409893 10315303
18848 10315303 9518867 9052020 8960764 8779894 8785546 8906872 9304348 10014464 11212895 12755088
18838 12755088 14747802 17381894 20261906 23351367 26777903 30627989 34499997 37679927
18830 37679927 40217345 42804516 45564561 47950491 50015472 52295965 54722172 56765516
18822 56765516 58106796 59096113 59645891 59253078 57833991 56068360 53970957 51376929
18814 51376929 48524094 46160380 43789544 40908087 37820345 34790185 31803911 28518938
18806 28518938 25032850 21751181 18748119 16124814 13792597 11817850 10300465 8974359
18798H974359j075448p88656p06310n93849m83465m93994m83774k77269j79446
18789C892148j92720j80672j00403j22124j95750j64883j44817j00370j11286
18780B579123p6200j57180j35924q9666k9169m7534J4298K6870M8532J18446M3932
18769B295528k3396l8768m6731R858r8881j74007j79420j79994m0957j8855m4386
18758A459991m2188j24208r3470M7565M0822k26k6378k1950o2530m6293J708R34
18746A133777j5436o2180Q0862Q9336R7191j5628N0779P5703K755L7622L7616
18735A512397j41761J04364M8528M422p1355j15455P7610O1577N7104P3534o4990
18724A545975J6960Q3507K9328m3414p2332j6869q4510n8338k010J08145J322
$$ plain form
18798 8974359 7898911 7110255 6403945 5810096 5326631 4832637 4348863 4071594 3892148
18789 3892148 3699428 3518756 3418353 3296229 3100479 2935596 2790779 2690409 2579123
18780 2579123 2502923 2345743 2209819 2120153 2090984 2043450 2057748 2084618 2133150 2251596 2295528
18769 2295528 2272132 2233364 2186633 2196491 2097610 1923603 1744183 1564189 1523232 1504377 1459991
18758 1459991 1417803 1293595 1200125 1247690 1288512 1288286 1261908 1239958 1177428 1131135 1132843 1133777
18746 1133777 1118341 1056161 1137023 1226359 1323550 1307922 1358701 1434404 1437159 1474781 1512397
18735 1512397 1370636 1475000 1523528 1527950 1456595 1341140 1418750 1480327 1537431 1610965 1545975
18724 1545975 1562935 1646442 1675770 1632356 1560024 1543155 1458645 1400307 1398297 1506442 1507764
18713A507764p5009j28308o2343r7076n7781J7459L7296K3714P5194m4975O2981
18702A258916O9175j05609M1815Q8414l5709N760o184K7709O7997M172j21764
18691A294692n1928j7949O6825R1447J12092J23591O0086n7578N5898J76993j2733
18680A841436m8620k505N8733O2716P9813J79785J09892J34169R9778Q920K6464
18669B550581P8561J76622J86206O1046J52617J37944J05307J47915K27174L47372
18659D171345L21361M52251M84195P14839R55885J351386J871638K568727L433173
18650A6324800M596534N696392O399956O827861O517281N638304M130821K092739
18642E8224688k34606k380038m204625n492559o083208o245097n812214n131529
$$ plain form
18713 1507764 1432755 1304447 1242104 1145028 1087247 1104706 1142002 1165716 1240910 1195935 1258916
18702 1258916 1328091 1222482 1264297 1352711 1317002 1322762 1316578 1344287 1412284 1416456 1294692
18691 1294692 1242764 1224815 1291640 1383087 1495179 1618770 1678856 1621278 1677176 1854169 1841436
18680 1841436 1792816 1790311 1849044 1911760 1991573 2171358 2281250 2415419 2515197 2524117 2550581
18669 2550581 2629142 2805764 2991970 3053016 3205633 3343577 3448884 3596799 3823973 4171345
18659 4171345 4492706 4944957 5429152 6143991 7099876 8451262 10322900 12891627 16324800
18650 16324800 20921334 26617726 33017682 39845543 46362824 52001128 56131949 58224688
18642 58224688 57990082 55610044 51405419 45912860 39829652 33584555 27772341 22640812
18634B2640812m189987l285410k574743j855037j356408j076269p40067n34199
18626G028692m57097k60525o4207p5902n6777p1841o3968o7069n30R7981P5534
18615F084291M1995J34093J62492K25596L39982M69775P46289J032795J359350
18606A0596658J822931K608658L677507M865810O443989P990395R166208R827383
18598E6999539R511005Q296426O202113L223146K2641l329112o121362q018815
18590F6785581q975075r104742q557002p448187o283415m938533l811616k907512
18582A4759499k262988j663774j344175r27997o31547m79411m35903l33224k44865
18573F435615p7696k7051j14171j34656j63826q1810q9924k69722k40691j27743
$$ plain form
18634 22640812 18450825 15165415 12590672 10735635 9379227 8302958 7562891 7028692
18626 7028692 6571595 6311070 6246863 6170961 6114184 6042343 5978375 5911306 5910776 6008757 6084291
18615 6084291 6126286 6260379 6422871 6648467 6988449 7458224 8204513 9237308 10596658
18606 10596658 12419589 15028247 18705754 23571564 30015553 38005948 47172156 56999539
18598 56999539 66510544 74806970 81009083 84232229 84254870 80925758 74804396 66785581
18590 66785581 57810506 48705764 40148762 32700575 26417160 21478627 17667011 14759499
18582 14759499 12496511 10832737 9488562 8560565 7929018 7449607 7013704 6680480 6435615
18573 6435615 6357919 6330868 6216697 6082041 5918215 5836405 5746481 5476759 5236068 5108325
18563E108325p5260l0901J16782K74261N64434O20127Q98085J376492J755006
18554A0607351K364562K869119L368409L779323L600178L178710K424879J377782
18546C3570313K20029j141578k267710l055190l541594l647257l419510l020682
18538A3696821k537852k013022j421702j057781q40642o50120n34864n48724l14329
18529C777785k59739k41225m5475j58108j40175k2129m6920m8240r5735j09427
18519B610612j3138j39688k31318j23361j42783j53570o4437m7039r1364j19346
18509A484568j25959p4482j12402o562N6962J01849r2533j37857K0148Q217R2409
18498A214358Q0122m505J68r0133j57369K170K4110j1131l1287o6531j197L7663
$$ plain form
18563 5108325 5033065 5002164 5118946 5393207 5957641 6577768 7475853 8852345 10607351
18554 10607351 12971913 15841032 19209441 22988764 26588942 29767652 32192531 33570313
18546 33570313 33790342 32648764 30381054 27325864 23784270 20137013 16717503 13696821
18538 13696821 11158969 9145947 7724245 6666464 5825822 5175702 4640838 4092114 3777785
18529 3777785 3518046 3276821 3231346 3073238 2933063 2910934 2864014 2815774 2720039 2610612
18519 2610612 2597474 2457786 2226468 2103107 1960324 1806754 1742317 1695278 1603914 1484568
18509 1484568 1358609 1284127 1171725 1165163 1222125 1323974 1231441 1093584 1113732 1121949 1214358
18498 1214358 1294480 1289975 1290143 1200010 1042641 1044811 1068921 1057790 1026503 959972 958775 996438
18486I96438k4129l5877M4752m9994n0548p049L4789L3847m1389J0670l6885O3073
18474I37698j0986j08920l7608o1705j2286M3180n1292l338m9380m6583K9649
18463F28429p7626K861j7625k1545M2642P4360L4841r1765K2034K0202L0601k5005
18451F22404j31437l4707k7173k3591K1843M4394O1690J01741K3076N9072o9164
18440F48148K2615p028K7048J5836q3912j11612j4653q1825r5140j07651J05953
18429C17779L5142j14369o9932K2075R9217L9106N6876R7885k0450m9846l3454
18418C80029L806j8137n6603J7272l2977O7150P1204K4382l2687k9204p8104M2193
18406C58324q249N1334N1346l2946P2771j03016l7337j6945j4134J23951M0314
$$ plain form
18486 996438 972309 936432 981184 931190 880642 873593 908382 942229 900840 911510 874625 937698
18474 937698 926712 817792 780184 718479 706193 749373 698081 694743 645363 598780 628429
18463 628429 550803 553664 536039 514494 557136 631496 666337 574572 596606 616808 647409 622404
18451 622404 490967 456260 429087 405496 427339 471733 533423 635164 658240 717312 648148
18440 648148 670763 663735 690783 706619 622707 511095 496442 414617 319477 211826 317779
18429 317779 352921 238552 168620 190695 289912 329018 385894 483779 463329 413483 380029
18418 380029 383835 365698 309095 326367 293390 360540 431744 456126 423439 394235 316131 358324
18406 358324 350075 401409 452755 419809 492580 389564 352227 335282 321148 445099 485413
18395D85413n303l107L2689M2971o855r39m2697l5625l8014j7302P8666l8835
18383D51062j3772N3853K375q510N099j14811m7537M1618N5636N2972K6981K8489
18371E33455l6855N6301M1392Q8282Q131n2630R8145Q7195n8726o099j7388q2741
18359F58462j8379p1375M7669O1760m9952L3948l2964n2825L0314r53j0821k2526
18347E72358k780o1314J6000m0924q6341j4848L6843j2151j3645M1340O3542o3543
18335D34537J1346J1032N0272j2211l1627P1577r1889l6481P6049k089P1521k2553
18323E29484M0326M4970N8477J75710P0590N4533p8165r3080j128J08536J2747
18312I23000l6592J10796R5873k3015O5661L6129o3899m5525m4216k8221N2976
$$ plain form
18395 485413 480110 477003 509692 552663 545808 544869 502172 466547 428533 411231 489897 451062
18383 451062 437290 491143 493518 485008 490107 375296 327759 369377 425013 477985 504966 533455
18371 533455 496600 552901 594293 682575 690706 638076 736221 823416 764690 758591 741203 658462
18359 658462 640083 568708 616377 678137 628185 662133 629169 576344 606658 605705 594884 572358
18347 572358 569578 508264 524264 483340 396999 382151 418994 406843 393198 434538 498080 434537
18335 434537 445883 456915 507187 494976 463349 534926 443037 406556 482605 480516 552037 529484
18323 529484 569810 614780 673257 848967 919557 974090 895925 802845 801717 910253 923000
18312 923000 886408 997204 1093077 1070062 1135723 1171852 1107953 1062428 1018212 989991 1042967
18301A042967O950l2430p273j58529j61614L8495J35532J9928J547J08659R0789
18290A085021M6706r885n5485L7685J36038N2985J15459R8711l2278J43753J08664
18279A727374J42134J03615J63833J70056P1929J8276M0045J29926J71580K81141
18269C019909K96851K29988K90952M79437O37460Q04342R18639P21124L98779
18260G797481J58147J28901O5526k4314J62343M00207Q80630J379330K007012
18251A2955263K915071M231320N967797P583629Q149050P124678N040447K709529
18243E6676784O12764j141911l082584m719592n430200m988506l837851k669684
18235C1419220j699780q44501n94474j088351j602055j808429j689742j916958
$$ plain form
18301 1042967 1049917 1017487 1010214 851685 690071 728566 864098 884026 885573 994232 1085021
18290 1085021 1131727 1121842 1066357 1104042 1240080 1293065 1408524 1507235 1474957 1618710 1727374
18279 1727374 1869508 1973123 2136956 2307012 2378941 2397217 2437262 2567188 2738768 3019909
18269 3019909 3316760 3546748 3837700 4317137 4954597 5758939 6677578 7398702 7797481
18260 7797481 7955628 8084529 8150055 8125741 8288084 8688291 9568921 10948251 12955263
18251 12955263 15870334 20101654 26069451 33653080 41802130 48926808 53967255 56676784
18243 56676784 57289548 56147637 53065053 48345461 42915261 37926755 34088904 31419220
18235 31419220 29719440 28874939 28280465 27192114 25590059 23781630 22091888 20174930
18227B0174930k100280j961234j436446p89395m01072j86464K19130O23326Q26901
18218A4969396J039909J103516J112282J254794J413166J204564R32567Q96148
18210B3926342J105077J753645K336018L096282L630368L696535L852633M493135
18202D7890035N845326P568264Q545983Q652472Q220980P808319P086896N033351
18194A06651626J736246j292541k813952k583233j663393j770703l201269n231023
18186H9831758o850838p490390p699597q139953q074177o952020n047063l083735
18178C6493985j310503L0509N98486M39112J2483o96046j425409k153940k672647
18169B9316030k744991k547431k339324j863165j475356j111314q61728n67369
$$ plain form
18227 20174930 18074650 16113416 14676970 13887575 13486503 13300039 13519169 14142495 14969396
18218 14969396 16009305 17112821 18225103 19479897 20893063 22097627 23030194 23926342
18210 23926342 25031419 26785064 29121082 32217364 35847732 39544267 43396900 47890035
18202 47890035 53735361 61303625 69849608 78502080 86723060 94531379 101618275 106651626
18194 106651626 108387872 107095331 104281379 101698146 100034753 98264050 95062781 89831758
18186 89831758 82980920 75490530 67790933 59650980 51576803 44624783 39577720 36493985
18178 36493985 35183482 35213991 35812477 36251589 36264072 35568026 34142617 31988677 29316030
18169 29316030 26571039 24023608 21684284 19821119 18345763 17234449 16372721 15805352
18161A5805352j40391K02613N90788J016426J824757K699925L492452L964953
18153B9456875L902904L868457M296076M849540M950571M896422N801235P523556
18145F9545636Q259551O931009L749370n12642m375305p181437q799627r603303
18137E8013252r879774q864841p127321n212621l583053k285691j344240o94606
18129A9021105j8877L47897r8680l70544n16325o46597o64357p09656m40891J83805
18119A6086880Q17436J677492K951485M706620P259657J1054876J5859326J8887891
18111G9301663J4753301N047819l126386o546869q078374j1318463j4574753j3169023
18103D2288915j0045847p104352m857176l541849k557186j814986j397496j140223
$$ plain form
18161 15805352 15664961 15867574 16458362 17474788 19299545 21999470 25491922 29456875
18153 29456875 33359779 37228236 41524312 46373852 51324423 56220845 62022080 69545636
18145 69545636 77805187 84736196 88485566 87972924 83597619 76416182 67616555 58013252
18137 58013252 48133478 39268637 32141316 26928695 23345642 21059951 19715711 19021105
18129 19021105 19002228 19350125 19251445 18880901 18364576 17717979 17053622 16343966 15903075 16086880
18119 16086880 16904316 18581808 21533293 26239913 33499570 44554446 60413772 79301663
18111 79301663 94054964 99102783 95976397 89429528 81351154 70032691 55457938 42288915
18103 42288915 32243068 25138716 20281540 16739691 14182505 12367519 10970023 9829800
18095I829800j017540q72955o03698n32880m64803m94936l97280l34845l21093
18086D789770l03484j15992j62503j17841l6631j38667k15296k18374j38783k2163
18076C320036j29551j43016k28007r5229k2411j33904k47761j24112j49874r6942
18066A949229K448L279p1978q9008n827J5687M3272L6492j60981p1723n5551o4063
18054A531276o1240j2958p7317K1201n4293j5927l7493l4689L4824J440k3157
18043A271667K1898k6992r239o5555q6553O158j6727L2062N0045M8421j8417O299
18031A213067j49484j43432j8157R6057J0094j6399j22983k3886m4601j28752
18021F71524k8033l5043L8240J18562P3401n7142n8164n1903k3843p7354m2298
$$ plain form
18095 9829800 8812260 7939305 7335607 6802727 6337924 5842988 5445708 5110863 4789770
18086 4789770 4486286 4370294 4207791 4089950 4053319 3914652 3699356 3480982 3342199 3320036
18076 3320036 3190485 3047469 2819462 2724233 2701822 2567918 2320157 2196045 2046171 1949229
18066 1949229 1951677 1954956 1882978 1793970 1788143 1803830 1847102 1883594 1722613 1650890 1595339 1531276
18054 1531276 1470036 1457078 1379761 1400962 1346669 1330742 1293249 1258560 1293384 1294824 1271667
18043 1271667 1293565 1266573 1257334 1191779 1105226 1111384 1094657 1126719 1176764 1225185 1206768 1213067
18031 1213067 1063583 920151 901994 998051 1008145 991746 868763 844877 800276 671524
18021 671524 643491 608448 646688 765250 838651 781509 723345 671442 647599 570245 527947
18010E27947l7259J35787Q5347j45035j33062N436M1319M6931M956j7980j2822
17999E01565N3534p024K199J5891K1111R310p9719o3533P8489J17943j02676J9228
17987E66318m053j304O2279R89j67041j00429J3974J38959o1286l7395k6389J07502
17975D92124J7149m469L5979L1797n3632j0947k3557j3536p4018l1211K6695M5914
17963D38288L8192m1826M84j2569J8831K6365l3536j9873m786k8645L6263M0579
17951D57767K9486j8139p2483k421K5420q0047J6652j2871k6636N4186q0895k7462
17939B62557N1380J049K3782O1617J59749o5978j02636q4412J13595l6176j75059
17928B09468J9111R1110j5538M3103r8978J03768k569j19505L3544R4394j2968
$$ plain form
18010 527947 490688 626475 711822 566787 433725 439161 480480 527411 532367 514387 501565
17999 501565 555099 548075 550274 566165 587276 596586 516867 453334 531823 649766 547090 566318
17987 566318 562265 560961 623240 624229 457188 356759 370733 509692 448406 411011 384622 492124
17975 492124 509273 504804 540783 572580 518948 508001 484444 470908 396890 365679 392374 438288
17963 438288 476480 434654 435138 422569 441400 467765 434229 414356 409570 380925 417188 457767
17951 457767 487253 469114 396631 394210 419630 339583 356235 343364 316728 370914 290019 262557
17939 262557 313937 314986 338768 400385 560134 494156 391520 307108 420703 384527 209468
17928 209468 228579 319689 304151 347254 248276 352044 349475 229970 263514 357908 344940
17917C44940k937J7970p7180M9092P2422j5640j47585k7098P3983J02668P9662
17906D70297m44J9785o2238r2775j0358K8724M3410P7475n012p2876o1489P8401
17894D12900j926p7582J2185Q4484q2276o6861L1249k1844M6887O5752O7413N8396
17882E28777K6159m0997j4488K8783K0145p5682p7517L8573L9934j06707o152
17871C60828K7972j0726J441j43533k496k4229m5620n004J3412J6787Q5159N4264
17859C28255l6934P1254O6673o3949k2858L318K8289p319O5557M5534n8403n6297
17847C63120P834l3195l8932j9620Q2362P1521M8875K6455l2796j30824j14085
17836B30715N9940L2416j54346Q325O8024M7578J32157J10587n3105P071L7896
$$ plain form
17917 344940 342003 359973 282793 331885 404307 388667 241082 213984 287967 390635 470297
17906 470297 469853 489638 427400 334625 324267 352991 396401 473876 468864 395988 334499 412900
17894 412900 410974 333392 345577 430061 347785 280924 312173 290329 337216 402968 470381 528777
17882 528777 554936 513939 499451 528234 548379 472697 395180 433753 473687 366980 360828
17871 360828 388800 378074 379515 235982 233486 209257 163637 158633 172045 188832 273991 328255
17859 328255 291321 362575 429248 365299 342441 345759 374048 366729 432286 477820 419417 363120
17847 363120 370954 337759 298827 279207 361569 433090 481965 508420 475624 344800 230715
17836 230715 290655 323071 168725 177050 245074 292652 424809 535396 482291 489362 527258
17825E27258M7153q5743o513O8073Q8805K8433K049j5065r1699m5705m4896l6120
17813D36030m8493J08208K3495Q4511L1435L9326r6119m9788o0621k8375j5413
17802D24196L224M1483P7392j1699j608p4843J00505M1036Q8237M085K4512J4952
17790G31472j0413J6498J16990o176L1691Q6440l9722m6547P0650o378L4725L027
17778I82257O0626J77868J87794j4170m062J6792q0557n5028K1732J35409J57500
17767A586161j1910Q4991R4692O5665l2766Q4904J31377J81446K33889J23705
17757B542154J17982J34422J11397Q9220k820P9096K19767L02478K24830K63468
17747D081994L46560M06424M58470N60410P43120J075878J341420J643925K151755
$$ plain form
17825 527258 574411 488668 482155 550228 639033 667466 669515 654450 562751 517046 472150 436030
17813 436030 387537 495745 519240 603751 635186 674512 578393 528605 467984 439609 424196
17802 424196 427420 468903 546295 534596 532988 458145 558650 599686 687923 692008 716520 731472
17790 731472 721059 737557 854547 848371 880062 966502 926780 880233 950883 944505 979230 982257
17778 982257 1042883 1220751 1408545 1394375 1390313 1407105 1326548 1271520 1293252 1428661 1586161
17767 1586161 1574251 1659242 1753934 1819599 1786833 1871737 2003114 2184560 2418449 2542154
17757 2542154 2660136 2794558 2905955 2995175 2992355 3071451 3291218 3593696 3818526 4081994
17747 4081994 4428554 4834978 5293448 5853858 6596978 7672856 9014276 10658201 12809956
17738A2809956K445330K323765K316789K585493L038976L287151L278109L385026
17730C5470595L809887L883153L480713L648124M361033M325828K600725K54823
17722F1834881r78476j596829k198111k811328k521144j058878J183486L908447
17714E5762048O771028R666931J2292170J3063465J1078672P514718M838721L783570
17706A24771323L047491J210256j106123k430237l246796m262676o361691q227334
17698A03394213q967664q350500o809536m569624k011046O96923K506324K469052
17690G8358142J303536L23518n1754j81892l38040Q32116L073671M718757M241789
17681I2279843J916276r40052k970520m592402o203558p326210p464931o058687
$$ plain form
17738 12809956 15255286 17579051 19895840 22481333 25520309 28807460 32085569 35470595
17730 35470595 39280482 43163635 46644348 50292472 54653505 58979333 61580058 61834881
17722 61834881 60856405 59259576 57061465 54250137 51728993 50670115 51853601 55762048
17714 55762048 62533076 72200007 84492177 97555642 108634314 116149032 120987753 124771323
17706 124771323 127818814 129029070 127922947 125492710 122245914 117983238 111621547 103394213
17698 103394213 94426549 86076049 79266513 74696889 72685843 73382766 75889090 78358142
17690 78358142 79661678 79985196 79933442 79751550 79413510 80245626 83319297 88038054 92279843
17681 92279843 94196119 93256067 90285547 85693145 79489587 72163377 64698446 58639759
17673E8639759m200057k688176j170830K79224J368357J692685J452850J247219
17665E6621031J665839K198944K452747K191801J929479K110831L142043M573274
17657G6885989N608708N523519M542984L649010L224247L640704M108296L281394
17649A10464851K85368l565435o111126o642182o364058o285042o458095o537040
17641F8787241o108562n004655l581607k606161j937254j853175k056315k316843
17633D3322669k374327k143968k393868k777191k938900k926781k948620k841063
17625B1977951k458078k285283k182838j853433j600610j443179j075926p46034
17617H332570o78529n39109m53734k88368k18391k44385k99814j82196k93181
$$ plain form
17673 58639759 54439702 51751526 50580696 50859920 52228277 53920962 55373812 56621031
17665 56621031 58286870 60485814 62938561 65130362 67059841 69170672 72312715 76885989
17657 76885989 82494697 88018216 92561200 96210210 99434457 103075161 107183457 110464851
17649 110464851 110750219 107184784 101073658 94431476 88067418 81782376 75324281 68787241
17641 68787241 62678679 57674024 54092417 51486256 49549002 47695827 45639512 43322669
17633 43322669 40948342 38804374 36410506 33633315 30694415 27767634 24819014 21977951
17625 21977951 19519873 17234590 15051752 13198319 11597709 10154530 9078604 8332570
17617 8332570 7654041 7114932 6661198 6372830 6154439 5910054 5610240 5428044 5134863
17608E134863k97180k55545j55228j47932j06068j71438k39937k80529j37524
17599C343482j10897j02724r8519p7835j09446l1227r1205o8338k5708n0758n4761
17588B522064m6220p2850j27376p5625r620j29819p2948K4719p3290l5564K145
17577A905616p2002p8738o5566j95150j06211l561k7302r9440m0728r1080m9937
17566A075901N156O3999O6914K7799j4347p087j19038r7218K3843J3730j5483
17555A024169k6377M4427J3971K0524J6709j29714q5420n3303N490m1808n5459
17544G33209n4657R289m6472J0158K0887M2775P6514j9840m296Q732l7645l1121
17532G07533m854n8780j12714M1658P2001l4229j430O813o7683L6986L9637J746
$$ plain form
17608 5134863 4837683 4582138 4426910 4278978 4172910 4001472 3761535 3481006 3343482
17599 3343482 3232585 3129861 3031342 2953507 2844061 2812834 2721629 2653291 2627583 2576825 2522064
17588 2522064 2475844 2402994 2275618 2199993 2190373 2060554 1987606 2012325 1939035 1903471 1905616
17577 1905616 1833614 1754876 1689310 1494160 1387949 1384388 1357086 1257646 1216918 1125838 1075901
17566 1075901 1081057 1145056 1211970 1239769 1225422 1218335 1099297 1002079 1025922 1039652 1024169
17555 1024169 997792 1042219 1056190 1076714 1093423 963709 878289 824986 830476 788668 733209
17544 733209 678552 687841 641369 651527 672414 715189 791703 771863 767567 776299 738654 707533
17532 707533 702679 643899 531185 572843 644844 610615 609185 615998 548315 585301 624938 626684
17520F26684n655R0313j31612m2957p5099j04954n7980j9136J31866k4748n9996
17509C26726l1611J20706J20059m8191J604n5045r7616q5696k1752j3798P0127
17498B85513M3987j22621K5755n296q094L9019j7422j5407n514j05604n9875M4456
17486I8897P6915N3790p5907N3184R7146R9664q3946q4630j1425l0073l2441Q1378
17474B42552R3319N1706J1875N0979m1853p033M7276o612M8981K4532O3o9971
17462D45814j85842j04018K2571M6640J04667R975K6103l1375J8890N9639K1245
17451D34309q2138L6429O4141L6097N3507J13708J09452R176l6326j07189o3143
17440E68023m2513j10064j53125j18137m0030L3668J29719o1784n1881n7880n7492
$$ plain form
17520 626684 621029 711342 579730 536773 461674 356720 298740 279604 411470 386722 326726
17509 326726 295115 415821 535880 487689 489293 434248 336632 250936 229184 215386 285513
17498 285513 329500 206879 232634 227338 219244 258263 240841 225434 219920 114316 54441 98897
17486 98897 175812 229602 153695 206879 304025 403689 319743 235113 223688 193615 161174 242552
17474 242552 335871 387577 399452 450431 408578 401545 448821 442209 491190 515722 515785 445814
17462 445814 259972 155954 178525 225165 329832 339807 365910 334535 353425 413064 434309
17451 434309 352171 388600 452741 488838 542345 656053 765505 774681 738355 631166 568023
17440 568023 525510 415446 262321 144184 104154 137822 267541 205757 153876 95996 38504
17429C8504N4429L8287L9814J4352K4979j6413r877o6928m1453M7776J27141O5898
17417C16509l1948j7324J6013K2768j73953q2609P3967L1537K0891q3792p53O8606
17405A59912q060j4116o7745j125p9258q8183l1332j2037J42534Q3552l0822m1119
17393A2201L7904J0869q9495J1562L3819o4404j62121K2946J71537J24174l8323
17382G0669k0984o5009L974L5262J6991l3013o5681k6167j0758k1438Q0172l1449
17370f7431O366L512J5859Q3113m3636p932j05062j7623l7372N0298K6447N2719
17358d0742j6592J7051p742j3786M8455j9244j00428J2257k1890o146J2436P9886
17346e6485L1982J4316J46362l1884j79028o6749R2010J9357L8366J04363P8323
$$ plain form
17429 38504 92933 131220 171034 185386 210365 193952 184075 117147 75694 123470 250611 316509
17417 316509 284561 267237 283250 306018 132065 49456 123423 154960 175851 92059 91306 159912
17405 159912 151852 137736 69991 68866 -10392 -98575 -129907 -141944 590 84142 53320 12201
17393 12201 50105 60974 -28521 -16959 16860 -47544 -209665 -186719 -15182 108992 70669
17382 70669 49685 -15324 -11350 23912 40903 7890 -57791 -83958 -94716 -116154 -35982 -67431
17370 -67431 -61065 -57553 -41694 41419 -2217 -10149 -115211 -132834 -170206 -119908 -93461 -40742
17358 -40742 -57334 -40283 -48025 -61811 -13356 -32600 -133028 -120771 -142661 -148807 -136371 -56485
17346 -56485 -24503 -10187 136175 104291 -74737 -141486 -49476 -30119 8247 112610 190933
17335A90933O3118r4831o2630R233j1507J1700q6412J1076P3005L6489n5730O0937
17323A45381K7858m421r0229n0603q1170N1571R3119o5117o2682J5434j9449K7237
17311a3071l1581L7288L6882j6434J4008k9078N094r9923M4913o195p0404k9034
17299a57535N6256M8897l2299J6007O4193q1892l7889k0660N0131R4894k8804
17288b8701j9138p6117N5475P8643o639J183J00018m3059J1657l9879l5152j9268
17276b0977L825k5223M2955m5140k398K9672j6163K2464q1112J32462j086l6317
17264B962m627k6102J2696N1516n7880N1406m94n7930j026M6791o2837j2283M7721
17251a0087o7704k7253Q25K5760N7833L7081N2393k4951J3023p0044j2771L6689
$$ plain form
17335 190933 254051 159220 96590 105823 94316 106016 19604 30680 103685 140174 84444 145381
17323 145381 173239 168818 78589 27986 -53184 -1613 91506 26389 -36293 -20859 -40308 -13071
17311 -13071 -44652 -7364 29518 13084 27092 -1986 3108 -96815 -51902 -58097 -128501 -157535
17299 -157535 -101279 -52382 -84681 -68674 -4481 -86373 -124262 -144922 -94791 103 -28701
17288 -28701 -47839 -123956 -68481 10162 3523 4706 104724 61665 73322 33443 -1709 -20977
17276 -20977 -17152 -42375 580 -44560 -46958 -17286 -33449 -10985 -92097 40365 39279 2962
17264 2962 -1665 -27767 -15071 36445 -21435 29971 29477 -28453 -29479 17312 -45525 -57808 -10087
17251 -10087 -77791 -105044 -104219 -78459 -20626 16455 68848 43897 56920 -13124 -25895 10794
17239A0794M7252Q0979k248n0165j33825N5178P7163n916N8341K2602n8019n7081
17227D5055L5845N4983k8337N6497L5231m5786N567K5907R0004L1136O1412q662
17215C58852K8290Q8561Q3615J9497P9080Q1984n1405q9462j02738j4374J49146
17204F31046l489j5909k7212j16858k414L0874n3185n1331m1576M6356O6342J01156
17192E63800k8605J4649m2513j49010m1064J09860o0873p4528N3619J68193M0847
17181E54375m6978p4804l0318j80799n1527N2786J10615m3938M5213P2265R4820
17170E01710J5697n4765n657M6407Q374Q6136j06198j6455q006K517N3034Q6745
17158F09539q956m3528L5325j9170J2380r1794r6943j09491j3250P343J50749
$$ plain form
17239 10794 58046 139025 136777 86612 -47213 7965 85128 79212 137553 160155 102136 45055
17227 45055 80900 135883 107546 164043 199274 153488 159055 184962 274966 306102 367514 358852
17215 358852 387142 475703 559318 578815 657895 739879 688474 599012 496274 481900 631046
17204 631046 627557 611648 584436 467578 465164 496038 442853 391522 349946 396302 462644 563800
17192 563800 535195 549844 507331 358321 317257 427117 366244 291716 345335 513528 554375
17181 554375 507397 432593 402275 221476 169949 222735 333350 289412 334625 406890 501710
17170 501710 517407 462642 456985 503392 511766 597902 491704 475249 467243 469760 522794 609539
17158 609539 600583 557055 592380 573210 585590 493796 396853 287362 274112 281455 432204
17147D32204q0915j10072N1052J45653J5625o8987o5581N4268J05432M0523r7606
17136D21596o9811L9241j8263m1133J6403J34085j8758j00698n9809n3383m7474
17125B01996M2771O9939j32920j12417k2969M5851L0274q132R883O618L1636j4896
17113A47634j36713j15737N6737Q8654L1047Q7345n1625q4837j1542O913p5378
17102e7502n8509j9357O7939O6239O83n211n1416p8323J03791J2287k2422J08109
17090F6308Q1070q2892p6058k0253n3385k4578M6758N5263j1657P2378L2454m6691
17078C8717k9033l1441J21248J3301n6425j32364O6806L2293j3526L6113n3761
17067h072j26956K1108M2083k8277K4997N1937J3372r2155K900o914M3490O3220
$$ plain form
17147 432204 351289 241217 292269 437922 453547 384560 318979 373247 478679 519202 421596
17136 421596 351785 391026 372763 331630 348033 482118 463360 362662 302853 249470 201996
17125 201996 244767 314706 181786 69369 46400 92251 122525 114393 124276 130894 162530 147634
17113 147634 10921 -104816 -48079 40575 71622 158967 107342 22505 10963 17876 -57502
17102 -57502 -116011 -135368 -67429 -1190 -507 -5718 -57134 -135457 -31666 -19379 -41801 66308
17090 66308 147378 64486 -11572 -31825 -85210 -109788 -63030 -7767 -19424 52954 85408 38717
17078 38717 9684 -21757 99491 112792 56367 -75997 -9191 23102 9576 45689 -8072
17067 -8072 -135028 -113920 -71837 -100114 -75117 -23180 -9808 -101963 -99063 -105977 -62487 733
17055G33k5700j4429n0021l570O988J2922N6496O0249K6742p6124L3819Q0194
17043A08299m481r42R1323K94j09270j25115j2973n721M4524J4117n6658o337
17031f2940L2600m4625o2687O0790M0255O6296P4458j1823K6470m5075o5453p7054
17019f8788p0597M1913J1498l1968q9199j2558O1975N1445m4701j5186O651j252
17007a60767K9410o6235J34845J7193N2380N3734m4586p3474p1759q46J15306
16996a4799O6339n6020j08776R3197O6441R604l3184l0282J1438q5913J9470N3874
16984h611l4585O2762K4732m7686m5314L6538l2215J326m0303l468l815J03547
16972A2908P5707n4767K668J33631M6131K911L5034j10871j59373j4296M0405
$$ plain form
17055 733 -24967 -39396 -89417 -92987 -85999 -73077 -16581 43668 70410 -5714 28105 108299
17043 108299 103818 102876 194199 194493 85223 -39892 -52865 -58586 -14062 55 -56603 -62940
17031 -62940 -30340 -74965 -137652 -76862 -36607 29689 104147 92324 118794 73719 8266 -68788
17019 -68788 -139385 -97472 -85974 -117942 -207141 -219699 -157724 -106279 -150980 -166166 -159515 -160767
17007 -160767 -131357 -197592 -62747 -45554 6826 60560 15974 -57500 -129259 -130105 -14799
16996 -14799 51540 -4480 -113256 -20059 46382 55986 22802 -7480 3958 -81955 -62485 -8611
16984 -8611 -43196 19566 44298 -3388 -48702 -12164 -44379 -43053 -83356 -86824 -90639 12908
16972 12908 88615 33848 36516 170147 216278 219189 254223 143352 -16021 -30317 10088
16961A0088j3572k4278L7890J01228k4517p983q79p8798m1628Q6956p991o117
16949C0399m4758m944L8179O9929L4016n7046l2634p465J1627K3414j9571k807
16937C8339k8665j2179o4206L7676L390N3888o9338j03012k9177P8665K747J6871
16925g5001J69092R669J5203N8015p4668j52188o3861j6844O8001k7582p7739
16914a67903O8507J31854k6771j26139N235J63612M0886P3002k0247L3997O002
16903A82035k3830j47721j24538n6523O0384Q0790Q4197n6863k5617K582n133
16892c0237J2614J5088M7256p5015k1465J190l2081J3963j2276q564m170j2610
16880a06307k8949o859j02127J07262M8541j7858J6689K9233N4284j3407j07453
$$ plain form
16961 10088 -3484 -27762 10128 111356 86839 78856 77977 -821 -42449 44507 36516 30399
16949 30399 -14359 -19303 18876 88805 122821 65775 33141 25676 37303 60717 41146 38339
16937 38339 9674 -2505 -66711 -29035 -25645 28243 -41095 -144107 -173284 -94619 -91872 -75001
16925 -75001 94091 103760 118963 176978 102310 -49878 -113739 -130583 -62582 -90164 -167903
16914 -167903 -99396 32458 5687 -120452 -115217 48395 89281 162283 142036 176033 182035
16903 182035 158205 10484 -114054 -170577 -110193 -29403 54794 -2069 -27686 -25104 -30237
16892 -30237 -17623 -2535 44721 -30294 -51759 -50569 -82650 -68687 -80963 -89527 -93697 -106307
16880 -106307 -135256 -142115 -244242 -136980 -88439 -106297 -89608 -60375 -6091 -19498 -126951
16869a26951o8862N5188P9414R1559r1048q7459O2545p717k9003O3488l8951N6473
16857d1324J36139K759q2807N2453q3638p5060p063J7988q434O4206O4671N0596
16845I0486M0864r5095n1850l6720J6455P1974l0961n0229J8835J7191l2833P222
16833c4661n5495m7950M8609k5010Q6246N8597K2745l0060j8952m531K4442O4417
16821H8397M3974J8732k2766n1792Q1325N8343j11362o9385N78l3216k280L7859
16809C8407k62p0915o795Q667J3948K2308P3632m7028p692l9630J5617Q03m4348
16796d3288l2594j2657r370P8632Q932N0792k8712m3962q8852J9700M6421l7727
16784i2685j7888n9032p1689o6882L2413K4776J55021Q1169P871l0983k7855K3773
$$ plain form
16869 -126951 -195813 -140625 -61211 30348 -60700 -148159 -85614 -93331 -122334 -58846 -97797 -41324
16857 -41324 94815 97574 14767 67220 -16418 -91478 -98541 -80553 -88987 -24781 39890 90486
16845 90486 131350 36255 -15595 -52315 -35860 36114 5153 -45076 -26241 -9050 -41883 -34661
16833 -34661 -90156 -138106 -89497 -114507 -28261 30336 53081 23021 4069 -462 23980 88397
16821 88397 132371 151103 128337 76545 157870 216213 104851 35466 36044 2828 548 38407
16809 38407 38145 -32770 -39565 -30898 -16950 5358 78990 31962 24270 -15360 257 1060 -43288
16796 -43288 -75882 -88539 -97909 -19277 -10345 40447 11735 -32227 -121079 -101379 -54958 -92685
16784 -92685 -110573 -169605 -241294 -308176 -275763 -250987 -95966 -14797 -6926 -37909 -65764 -41991
16772d1991k9194j03410N4344K688O195p166o505j0757O0166N5832M5475K7190
16760E2867k0469m5150p2790j0863Q9160O8900o3869j1668J2591n6802l8478L6607
16748e9964O6654o8920O9843M0399n6253J8511J8654M4269M5228O168M6341o5021
16736A05909j16389K9995P6789k9847r0092n488N7380n4555m8092j692L9776o2727
16724i9033n5146m2510M3450J3121j8442l9481K1394P3786J0818k3422P5334Q6392
16712D6261J22539j277j09084m9204n2202q966R4305J2084q5775o3784K1494J78513
16700A04904j7383q1881j16423J3273N3591N9174J07306k9007j61418q9586j5828
16689a73278P1882N3624K7372N9940m7057o9041K5898J10617k4181K8292P821
$$ plain form
16772 -41991 -71185 -174595 -120251 -117563 -111368 -118534 -125039 -135796 -75630 -19798 25677 52867
16760 52867 32398 -12752 -85542 -96405 -7245 61655 -2214 -13882 -1291 -58093 -96571 -59964
16748 -59964 6690 -62230 7613 48012 -8241 10270 28924 73193 118421 124589 170930 105909
16736 105909 -10480 19515 96304 66457 -23635 -29123 28257 -26298 -74390 -76082 -36306 -99033
16724 -99033 -154179 -196689 -153239 -140118 -158560 -198041 -176647 -102861 -92043 -115465 -40131 46261
16712 46261 168800 167523 58439 9235 -42967 -51933 42372 54456 -31319 -95103 -73609 104904
16700 104904 87521 5640 -110783 -97510 -43919 15255 122561 93554 -67864 -157450 -173278
16689 -173278 -101396 -47772 -20400 39540 -7517 -76558 -50660 59957 35776 64068 71889
16678G1889j8648K3023J5133p739O5264j15746n6017j5095q0968Q2336Q7580k6752
16666B4260L6819m3531j14621J784J3697J01539k6222J555J9042K4564K3766M2520
16654A05172k3822K4452q6627l5939j2322L8236l1530k8377N8563l7184p5276
16643a04654l2559l6994O1603j3821K4014J17848P6594j20670m3294M2474J02596
16632G3137L7496K0731n7236r9812P9985j0699l7310l5227j21271J7314J30385
16621b507K7754m7544L9748R4183l6957l3463K8930L2304R7855k5651k8160l848
16609A42644N9802j2056j14428m7259l1441J148k3869j17824M7193N9753o1707
16598i8044Q245L8254O3913k3492n3490l1856k4160N0643P3544J1345j40004o3055
$$ plain form
16678 71889 53241 76264 91397 83658 148922 33176 -22841 -37936 -118904 -36568 51012 24260
16666 24260 61079 17548 -97073 -95289 -81592 19947 -6275 -4720 14322 38886 62652 105172
16654 105172 81350 105802 19175 -16764 -29086 9150 -22380 -50757 7806 -29378 -104654
16643 -104654 -137213 -174207 -112604 -126425 -102411 15437 92031 -28639 -71933 -29459 73137
16632 73137 110633 131364 74128 -25684 54301 43602 6292 -28935 -150206 -132892 -2507
16621 -2507 25247 -22297 17451 111634 74677 41214 70144 102448 200303 174652 146492 142644
16609 142644 202446 190390 75962 28703 -2738 -1590 -25459 -143283 -96090 -36337 -98044
16598 -98044 -89799 -51545 12368 -11124 -64614 -96470 -120630 -69987 3557 14902 -125102 -188157
16586a88157P9666P6138l7856L4794J4228n5740M1956L6553K4626K0993q2552
16575c5351m606P9059N6986q9830K149m8619j12443n7783K4610J11970L2075j3227
16563e5010q2482Q8190J80817O4441K7945l7945l0074l9462j84440k2986Q8228
16552b778J7678L8056P6979P479j6659j3420j06803j87218j7887J1804k4563l1732
16540b49064j0532P7275J65396O0725J7988k0479K1114k6041o8093j41J07371
16529G5519N3383o7011K1585q7183L6498j1968p0453J12925k5015j44319L1781
16518g4258N3818J0605L0910j684K3128J7827L101O5218P4245J8415Q464k5864
16506B03925m3980q8064j03888R160N7870m9181n9364j68651J22887J49243N8907
$$ plain form
16586 -188157 -108491 -32353 -70209 -35415 -21187 -76927 -34971 1582 26208 47201 -35351
16575 -35351 -39957 39102 96088 6258 8407 -40212 -152655 -210438 -185828 -73858 -41783 -55010
16563 -55010 -137492 -49302 131515 195956 223901 185956 155882 116420 -68020 -91006 -2778
16552 -2778 14900 52956 129935 137414 120755 107335 532 -186686 -204573 -192769 -217332 -249064
16540 -249064 -259596 -182321 -16925 43800 61788 41309 62423 36382 -31711 -31852 75519
16529 75519 128902 61891 83476 -3707 32791 20823 -49630 63295 38280 -106039 -74258
16518 -74258 -20440 -9835 21075 19391 42519 60346 63447 128665 202910 221325 229789 203925
16506 203925 159945 71881 -32007 -22847 35023 -14158 -73522 -242173 -119286 29957 88864
16495H8864K7844Q8436M6999j09930j20460r0929p4348m9448L7548l7826j4889
16484b08139J99003O7113j962l5697M9310j413J06050M0466n5623q3281q1638
16473e811m1146K5812q743J4704N4715K8392L4305o0120q0383N6759j3823j7348
16461a2687L8891J1972J15709Q4362n5256q5940n7826p5936L2775J5181k0071
16450h826k4903n5384R7389J11320k7616q703l497n6338j5158P3641m9620n7249
16438b4944o6764n470M5694M5363k5762k1008o116J1951r113M8535n6110j1237
16426g4981O5135K8919q1791j10433J6780O6929J14904N1284j04928o3422n2729
16415a44333Q447P8663j17671k4762J02895J5916l0827j37M560j5367Q6368M0206
$$ plain form
16495 88864 116708 205144 252143 142213 21753 -69176 -143524 -192972 -155424 -193250 -208139
16484 -208139 -9136 57977 56015 20318 69628 68215 174265 214731 159108 75827 -5811
16473 -5811 -46957 -21145 -29888 -15184 39531 67923 102228 42108 -38275 18484 4661 -12687
16461 -12687 26204 38176 153885 238247 182991 97051 39225 -36711 -3936 11245 -8826
16450 -8826 -33729 -89113 8276 119596 91980 83277 79780 23442 8284 81925 32305 -24944
16438 -24944 -91708 -97178 -51484 -6121 -31883 -52891 -59007 -47056 -56169 -7634 -63744 -74981
16426 -74981 -9846 19073 -62718 -173151 -156371 -89442 25462 76746 -28182 -91604 -144333
16415 -144333 -135886 -57223 -174894 -199656 -96761 -80845 -111672 -111809 -107249 -122616 -36248 3958
16403C958J5578L7922N108m0981Q1773q5119j20571q8987O2862o620O1890P008
16391f6179K4945J03469L6195r477q4837M5347L188k6428j10683P4931L2965r0411
16379f6975P0198L2703o4480O5974q0752o1260J14485J38146L8684q1633k6363
16368G8727L920N7415o8815n2633j10830l7126P1619P5764L9624K89n3623n6137
16356e1806k8929K9823R048M7075R1899N5370r6867r0318J4010n76j2881N4924
16344B0772P3078P6922L0036l8251q4530o1496j02682m7660K9864Q6429K3022
16333E504O4440J7096q5560q763J1632O101L3745k899J9405q5870j7957Q1227
16321C8101J7743o2728n6477m5321J4389L0046Q8800R4697M5330J6310j0469m5601
$$ plain form
16403 3958 19536 57458 62566 21585 103358 18239 -102332 -191319 -128457 -135077 -73187 -66179
16391 -66179 -41234 62235 98430 88953 4116 49463 52651 26223 -84460 -9529 23436 -66975
16379 -66975 3223 35926 -28554 37420 -43332 -104592 9893 148039 186723 105090 78727
16368 78727 82647 140062 71247 18614 -92216 -129342 -57723 18041 57665 57954 4331 -51806
16356 -51806 -80735 -50912 -41864 5211 97110 152480 55613 -34705 -20695 -21271 -34152 20772
16344 20772 93850 170772 200808 162557 78027 16531 -86151 -133811 -103947 -17518 5504
16333 5504 69944 87040 1480 -7283 4349 10450 44195 41296 60701 -25169 -43126 38101
16321 38101 55844 -6884 -63361 -108682 -94293 -64247 24553 119250 164580 180890 170421 124820
16309A24820n9550m9375Q155m6301k6720k6313P844J57344Q9165N4221j51848
16298H1442q2669M6516o8483p4257L1798J16152N8654j45367o5657p6182l784
16287a81837O400N1561O2606L2893K5186N0519J9915K4360N6125j9033k3418l6479
16275F8798M818j02079j5265J46545M2835l9266n8948k7305j40178j1868J13576
16264a8337P2171q168j0278k5668K4536j33915M9293o1770q2589R6309N8246q3126
16252a23296P767n8744n3597m188J16293o5896k6223L0528J061Q2062K4345o055
16240g5943J34641P3402r670n7207M6480M3175m1960n0512j5723m5502j01753
16229a00572K4846L1913q2123j3380R2893J03600j9051K4499o183p0326o1061
$$ plain form
16309 124820 65270 15895 24050 -22251 -48971 -75284 -67440 89904 179069 233290 81442
16298 81442 -1227 45289 -23194 -97451 -65653 50499 109153 -36214 -101871 -178053 -181837
16287 -181837 -175437 -123876 -61270 -28377 -3191 47328 67243 91603 147728 128695 105277 68798
16275 68798 73616 -28463 -43728 102817 145652 106386 47438 20133 -120045 -131913 -18337
16264 -18337 53834 45666 35388 9720 34256 -99659 -50366 -112136 -194725 -98416 -40170 -123296
16252 -123296 -115529 -174273 -227870 -232058 -115765 -181661 -207884 -177356 -176295 -94233 -69888 -75943
16240 -75943 58698 132100 122430 65223 111703 154878 112918 62406 46683 1181 -100572
16229 -100572 -75726 -43813 -125936 -139316 -46423 57177 38126 62625 56442 -13884 -74945
16218g4945j20949n3438R0669R053m0279J48498O3741l4262L2859q4474K682N9018
16206a827P0086j4833j2265J4617l4848j6848n4893p1917J12521J39684m0054
16195H9423o511O752l6287r5028k3608M2312m3353M910J17251q6082k0852o1578
16183a12651K0423J09320J6557J4841J4635k0250j23431n6879j703R5955O0732
16172A7549K972o9313p5675q0326q104J7911P0165N7660N2065r323j7418L0648
16160a1189n0800r2214P5785O4919j17744k8494P193p950M9856M4178J05065M8527
16148H7132M7140n9136K269o8023q7203K5800o0131Q0401Q7039J77779J37477
16137C70544j17988k4826O7688q0901j43029j01650q7224l6088M1834J0956M4223
$$ plain form
16218 -74945 -195894 -249332 -158663 -149610 -189889 -41391 22350 -11912 20947 -63527 -60845 -1827
16206 -1827 68259 53426 41161 55778 20930 4082 -50811 -122728 -10207 129477 89423
16195 89423 82912 89664 53377 -41651 -65259 -22947 -66300 -61390 55861 -30221 -51073 -112651
16183 -112651 -92228 17092 33649 48490 63125 42875 -80556 -137435 -139138 -43183 17549
16172 17549 20521 -48792 -124467 -204793 -212897 -194986 -124821 -67161 -15096 -24419 -41837 -11189
16160 -11189 -61989 -154203 -78418 -13499 -131243 -159737 -152544 -160494 -110638 -66460 38605 87132
16148 87132 134272 75136 77405 9382 -77821 -52021 -112152 -31751 55288 233067 370544
16137 370544 252556 227730 295418 214517 71488 -30162 -117386 -153474 -111640 -100684 -56461
16126e6461J3576q1054N2672K1746k4571R6077J08932P721j4835j01398n4996
16115c2591M2234O1957N2830p2567l8871O9042K9510p6101o9488K5757o2367j918
16103g2573P5347J2644j0013l1564M9394N1767L1290l1601j7669p044k5999l6828
16091a2849J0543J53975J5748p0365q5785p0900l6512j5699O5817l3617N1076
16080b8568l9574J2160P0982k1041J6400m3027k0344M0442p15M7619o8961Q102
16068b6525P0490J4815r1038N5751Q5117L8474m1363p4838q8539M1078M0930j19062
16056i4710j13458O9762J8010o3182Q9168J06367N9667q0487j9338P7642M1120
16045I0561N1998k8385m4811p677K5831o5503j9157m33m8280l5655Q4556L2624
$$ plain form
16126 -56461 -42885 -123939 -71267 -49521 -74092 21985 130917 138638 123803 22405 -32591
16115 -32591 9643 71600 124430 51863 12992 82034 111544 35443 -34045 -8288 -70655 -72573
16103 -72573 2774 15418 5405 -26159 23235 75002 106292 74691 57022 49978 23979 -12849
16091 -12849 -2306 151669 167417 97052 11267 -59633 -96145 -111844 -46027 -79644 -28568
16080 -28568 -68142 -55982 15000 -6041 10359 -32668 -53012 -12570 -13285 34334 -34627 -26525
16068 -26525 43965 58780 -32258 23493 108610 147084 105721 30883 -57656 -16578 24352 -94710
16056 -94710 -208168 -138406 -120396 -183578 -94410 11957 71624 -8863 -28201 49441 90561
16045 90561 142559 114174 69363 61686 87517 22014 2857 2424 -45856 -81511 3045 35669
16033C5669o0116K8262j362k3119M1908p6114L3205O7200o579K60P1628R8540
16021B09382m724n9292L8158P528o3034L9815n2546R1841k9347m0119j3684O539
16009A30517p7023q1308K0959P3011J6548j13849j22433l6096L5647Q2059J25427
15998E3459K058q8339J6442O6944J9264j9446m8591o3718P887K7952k1237P6831
15986B9506M6474K9051N5060L3807k8l2573p9591q0102m0638N6k2969L0933Q642
15973b2372r6285J0838j3842L1129P7009j5652n0132K2371m6776o4461N5050L8511
15961g4612k2799j8622k3884l9587k9239L9153k1144P6442R5318R740J9447J20696
15949A30909k7465k7693k7705P4954R220r7780l6128k7493j5868K0728j2043o9667
$$ plain form
16033 35669 -24447 3815 2453 -20666 21242 -54872 -21667 45533 38954 39214 110842 209382
16021 209382 204658 145366 183524 191052 128018 167833 115287 207128 177781 137662 123978 130517
16009 130517 53494 -27814 -6855 66156 82704 -31145 -153578 -189674 -154027 -71968 53459
15998 53459 55517 -32822 -16380 50564 69828 50382 1791 -61927 -54040 -26088 -47325 29506
15986 29506 75980 105031 160091 193898 193870 161297 81706 1604 -39034 -38978 -61947 -31014 -22372
15973 -22372 -118657 -107819 -121661 -90532 -13523 -29175 -79307 -56936 -103712 -168173 -113123 -74612
15961 -74612 -97411 -116033 -139917 -179504 -208743 -169590 -190734 -114292 -18974 -9234 10213 130909
15949 130909 103444 75751 48046 123000 132220 34440 -1688 -29181 -45049 -24321 -36364 -106031
15937a06031N7307J16804K1018j14917j7926Q8619J1215j16780o5948r053J41918
15926F226O7276M4898j3870n2345p4980p136O7323K9141M10k3354j02862n2209
15914a11482L7489L9286j678M3032N1953l106n7577J2818P8226j0321o2145K9240
15902D5735q7748r1296M3164Q2007O51m622M5812O5610k6273o5927j04684J3116
15890h4455O9556L5278P8286j9696j89991o7886Q8912N3223N3867M6579n9561
15879D112j01372M4669J7712L1596k2585j0592M1958o9743k8222l9914M8485P3527
15867a0369n145p89L8168r990j14575N18j200p6989O9022J01846P9731q574j09058
15854d7404K9871j0087J0722O2136o4167k3051p881k8242p46O2140P1379J03346
$$ plain form
15937 -106031 -48724 68080 89098 -25819 -43745 44874 56089 -60691 -126639 -135692 6226
15926 6226 73502 118400 104530 52185 -22795 -29931 37392 66533 66943 43589 -59273 -111482
15914 -111482 -73993 -34707 -36385 6647 58600 55494 -2083 10735 88961 78640 16495 45735
15902 45735 -42013 -133309 -90145 -8138 -7487 -12109 33703 99313 73040 7113 -97571 -84455
15890 -84455 -14899 20379 98665 78969 -111022 -178908 -89996 -36773 17094 63673 4112
15879 4112 -97260 -52591 -34879 -3283 -25868 -36460 5498 -64245 -92467 -132381 -83896 -10369
15867 -10369 -15514 -16303 21865 11875 -102700 -102182 -103382 -180371 -111349 -9503 70228 61654 -47404
15854 -47404 -17533 -27620 -16898 45238 -18929 -41980 -49861 -78103 -78849 -16709 54670 158016
15842A58016R7965j03570r7182k1511n4569N0508k6327M9416L3964N6040r1599
15831E1151j46787l3655J1863O1583Q2324J6885L3539J33232k2324n3367o2612
15820G1832P283p3225J3448O0043L82m6744j6687n5047r4816L3805l1060l3062
15808a63848O0416O0531M3231m5511j31475J25760J63122l9459r6881N2147m1331
15797a3298M4132L0018J8018j1914j00560j3065J26876m8753q9846m7133N9306
15786d6219N6075N6321J2552k6011J0342l6514L5110K801P120l1084o4213j02824
15774a26544R1984n032J01247Q2784n2009l7091Q104j1676j9735j0574q9530O5434
15762b638O0266J23656J5410j65632j76554N1882K184K6566j9995m3996J52920
$$ plain form
15842 158016 255981 152411 55229 33718 -20851 29657 3330 52746 86710 142750 51151
15831 51151 -95636 -129291 -117428 -55845 26479 43364 76903 210135 187811 134444 71832
15820 71832 79115 5890 19338 79381 79763 33019 16332 -38715 -133531 -99726 -130786 -163848
15808 -163848 -103432 -42901 330 -45181 -176656 -50896 112226 72767 -24114 28033 -13298
15797 -13298 30834 60852 78870 66956 -33604 -46669 80207 31454 -58392 -105525 -46219
15786 -46219 9856 66177 78729 52718 63060 26546 61656 64457 71577 40493 -23720 -126544
15774 -126544 -34560 -39592 61655 144439 92430 55339 63443 51767 32032 21458 -68072 -2638
15762 -2638 57628 181284 196694 31062 -145492 -93610 -91426 -64860 -84855 -128851 24069
15751B4069K4129m6386J3398R2957q8523o0485L7758M147J3940M8244j52972k4592
15739a14316R1504P5102k3290n1725q9659P4267R9503l0652j29123L3194Q5822
15728B0627r9689j5932L9156J9941m2603j3802n9260J00325L5957p5829p8386
15717a69495Q5463O7877m3093M8322q268j6946L5570J6875r2618l7130n3791p128
15705a74362N0826N7261K3542n4271j151L4718L2771k9990J3158O0697o749q3820
15693g7370M0170j1386l9494o3116N2066n690o363O5161N6948q2534M596n054
15681g2066k9393m124O8708Q0696K2210k6233n092K2560l046m3169o2862M6101
15669e710o184M622j0376k1147n0766P3821J05478k7297J1874j9265m8309j03895
$$ plain form
15751 24069 48198 1812 15210 108167 19644 -40841 -3083 1064 15004 63248 -89724 -114316
15739 -114316 -22812 52290 29000 -22725 -112384 -38117 61386 30734 -98389 -65195 20627
15728 20627 -79062 -94994 -55838 -35897 -78500 -92302 -151562 -51237 -15280 -91109 -169495
15717 -169495 -84032 -16155 -59248 -10926 -19194 -36140 -570 16305 -76313 -113443 -167234 -174362
15705 -174362 -123536 -66275 -42733 -97004 -98155 -63437 -30666 -60656 -47498 13199 6450 -77370
15693 -77370 -37200 -48586 -88080 -151196 -99130 -104820 -111183 -46022 10926 -71608 -67012 -72066
15681 -72066 -101459 -105583 -36875 43821 66031 39798 34706 57266 54220 11051 -51811 -5710
15669 -5710 -11894 -7272 -17648 -38795 -89561 -15740 89738 62441 74315 55050 6741 -97154
15657i7154o565J81083N2309q9635m8211j40893L4788O973L2871J39153N6590
15646A21309n7399n4601L965k2144P9664J31478q3267j21462n9830J7378O0148
15635A5239o6069M8880O3628l538l7571J403j0710q16J1041M6639k5711j04201
15623f1786j2243Q5768L9468M7535l9202l5184j2872n8421q6025N0783O9708n7331
15611f9802L6021R0356l4855J4965l9341O0947m923M1955J7610j48747o8027K720
15599a01121M7415l9307J4484O9064J14570j1742q1250m9079Q053P5510l8208
15588H389l5737n4550J1561J21691r61R2493J9643o3858l2274j1250n4872k0864
15576b0589q120p1095l1168J06437Q5820Q3442K0135o0656n7748K1049L6215n4673
$$ plain form
15657 -97154 -103719 77364 129673 40038 -8173 -149066 -114278 -107305 -74434 64719 121309
15646 121309 63910 9309 13274 -8870 70794 202272 119005 -2457 -62287 -44909 15239
15635 15239 -50830 -1950 61678 58140 20569 21972 11262 10446 21487 68126 42415 -61786
15623 -61786 -74029 11739 51207 98742 59540 24356 11484 -46937 -132962 -82179 -12471 -69802
15611 -69802 -33781 56575 21720 36685 -2656 58291 53368 95323 112933 -35814 -103841 -101121
15599 -101121 -53706 -93013 -78529 -9465 105105 93363 12113 -36966 -28913 46597 8389
15588 8389 -27348 -81898 -70337 51354 50393 142886 162529 98671 66397 55147 275 -20589
15576 -20589 -28709 -99804 -130972 -24535 61285 144727 164862 104206 46458 67507 103722 49049
15564D9049j36274n7151O2615J28656l4609k5142l7580P3415N7032N892q2105
15553C798j65385k3466J12237O6251J32035M0345j17169p90o6858j20806O5094
15542g4714Q0095P0712J0313l9332m198j9975m711J6292K4532k242j07219m0486
15530i0933O4173M3390j7864o2260o8400K5189O5604l9248j08802q6931J22069
15519a54013N3006Q9890M6163J816q1479L6247L7704K825J2519q2184K2647P8338
15507F3479r8983l1581J5663N8341P0080K0000M8445J7711k1667j68838j19154
15496a46504M687Q5677m3660P7169P0972q179J13869K5522R570M9578r4193j02134
15484D2374K5988L709n4154p0958K2125l1610n001O107M3656j474o0413j20787
$$ plain form
15564 49049 -87225 -144376 -81761 46895 12286 -12856 -50436 22979 80011 85903 3798
15553 3798 -161587 -185053 -72816 -6565 125470 165815 48646 47856 -19002 -139808 -74714
15542 -74714 5381 76093 86406 47074 42876 22901 18190 34482 59014 56772 -50447 -90933
15530 -90933 -26760 16630 -1234 -63494 -131894 -106705 -41101 -80349 -189151 -276082 -154013
15519 -154013 -101007 -11117 35046 36862 -44617 -8370 29334 32159 44678 -37506 -14859 63479
15507 63479 -35504 -67085 -51422 6919 76999 96999 145444 163155 141488 -27350 -146504
15496 -146504 -141817 -56140 -99800 -22631 48341 40162 154031 179553 189123 238701 144508 42374
15484 42374 68362 72071 17917 -53041 -30916 -62526 -67527 -61420 -17764 -19238 -79651 -200438
15472b00438J19372J46023r5142m6807j0423N5337R1671o7101k0108J0931j2432
15461b9117Q9292L1378n9558j2198J6170o5180J7221L8221R2511n5044n5327K3241
15449C1610l9806K3404L283L1346n2661k9656l6041n4853J6156L604o8641j204
15437a73459M0874Q0344Q2073m3034L4619J16339P722k0058o6506J4655J0700
15426H4269n4353k2858K3651k797K6384j5009j3927q2483M254p6160r2841J0358
15414b11512J03921J52382M9817r370k8972j3913r9M0299J36010l496o3634N1906
15402B03339j51158j31879m5689l9070m473M758J27245Q1543l2114k5331M2721
15391B9892m8552P2974J43274m1104j25236m3113J65650q7329l6522l9537j11272
$$ plain form
15472 -200438 -81066 64957 -30185 -76992 -87415 -32078 59593 -7508 -27616 -16685 -29117
15461 -29117 60175 91553 31995 19797 35967 -29213 -11992 26229 118740 63696 8369 31610
15449 31610 -8196 15208 18491 49837 -2824 -32480 -68521 -123374 -107218 -103614 -172255 -173459
15437 -173459 -132585 -52241 29832 -13202 21417 137756 145478 125420 58914 73569 84269
15426 84269 29916 7058 30709 27912 54296 39287 25360 -57123 -52869 -129029 -221870 -211512
15414 -211512 -107591 44791 94608 85238 56266 42353 42254 82553 218563 215067 151433 203339
15402 203339 52181 -79698 -125387 -164457 -168930 -164172 -36927 44616 12502 -12829 29892
15391 29892 -18660 54314 197588 156484 31248 -11865 153785 66456 29934 -9603 -120875
15380a20875O3447J65885K8409j18419p9759L6619k447o1435K7281O4480P0829
15369G4015p3987r3469L6239P2132r0568r666N6903k9261j4041j9268o4075N8754
15357i6292N8808j701j7106J05841J37387K4750j15728m3854n8214Q8424K904
15346H5219n5890M1969L5730m2848n4099J9587N5052n730n9431P5137K428k8956
15334F8168P4143j1701q8567m447r8923n3037L2039J1258k2943K0775J17593J01527
15322A45885J4377j09902j1745m015p5538J2837J3948J8492L6842j7672o5909
15311d2400k2258P3645q2200O6840M3200J15462l0035o8196p2934j2086n5920
15300h6882l1108L3603J06121m5205O061L1368K1152O2444N4370J9090r024l5867
$$ plain form
15380 -120875 -57428 108457 136866 18447 -61312 -24693 -27140 -88575 -61294 3186 74015
15369 74015 28 -93441 -57202 14930 -75638 -85304 -28401 -57662 -71703 -90971 -155046 -96292
15357 -96292 -37484 -39185 -56291 49550 186937 211687 95959 52105 -6109 82315 85219
15346 85219 29329 71298 107028 64180 10081 29668 84720 78990 19559 94696 97124 68168
15334 68168 142311 130610 42043 37596 -61327 -114364 -82325 -71067 -94010 -73235 44358 145885
15322 145885 160262 50360 38615 34600 -40938 -28101 -14153 4339 41181 23509 -42400
15311 -42400 -64658 8987 -73213 -6373 36827 152289 122254 54058 -18876 -30962 -86882
15300 -86882 -117990 -84387 21734 -23471 -17410 13958 35110 97554 151924 171014 161990 126123
15288A26123q0306L2251J03950k8629o859P7767j36752j31890l907Q5629M5787
15277H3164o1542K6553J0714J8691L082J3519o0574k8255O1672Q210J3041J4137
15265A02412q6723m0042N3607M7796L9651o6592K6964p260n0481o030m2529j8261
15253d7488J4996J15618l1971j8024M280N647J03584M1963k079j5255j0382r9583
15241F1306o7032L7809j0566j0880o8544P7737J43248J19423K0928n5053j4850
15230B33526l4945J08732J44559K01474J90364J27877Q9352K04471J16919N4692
15220A437021J16087J31521Q841m4157q2349j38728j89276r2815j94778j91132
15210G60235r9548q0383j58512n5432K7785n6954j0310k5207n311l2118l4407
$$ plain form
15288 126123 45817 78068 182018 153389 146530 224297 87545 -44345 -48252 37377 83164
15277 83164 21622 48175 58889 77580 80662 94181 33607 5352 67024 75234 88275 102412
15265 102412 15689 -24353 29254 77050 116701 50109 77073 69813 19332 13302 -29227 -47488
15253 -47488 -32492 83126 51155 33131 37411 43058 146642 188605 186526 171271 160889 61306
15241 61306 -5726 32083 21517 10637 -57907 19830 163078 282501 303429 248376 233526
15230 233526 198581 307313 451872 653346 843710 971587 1060939 1265410 1382329 1437021
15220 1437021 1553108 1684629 1693470 1649313 1566964 1428236 1238960 1146145 951367 760235
15210 760235 660687 580304 421792 366360 394145 337191 326881 301674 296363 264245 229838
15199B29838K4726m1167n9673J3723q7758p1500j9983L4301J01743M0826l1019
15188A34057k3556n0638M7822M4576k7112k8439M3216p045m4087o0131k3850J81825
15176A86638L7145q2240o0365j2152M5980K2152K8793l5247L1824m9351n6168
15165E7009N6787p987m2677j04998O065K5112Q7659P8701k8197k7434j2895L5473
15153A22618r4877m2007l5449O1155L3267l5002m5519L9383O8577P679M4290P3054
15141A97169K7732q1974P1136o1865j52241o2885O1473N4844L7937j0192j2693
15130F8441K261J8078k3612k8575J4777m0631J7749O387l8790Q3252R1497J1897
15118A82731n5614j1841N3627k477q6674K1828m1019l5840n0585k3961N5227O205
$$ plain form
15199 229838 254564 213397 153724 167447 79689 8189 -11794 22507 124250 165076 134057
15188 134057 110501 59863 107685 152261 125149 96710 139926 132881 88794 28663 4813 186638
15176 186638 223783 141543 81178 69026 115006 137158 165951 130704 162528 113177 57009
15165 57009 113796 105809 63132 -41866 -35801 -10689 76970 155671 127474 100040 87145 122618
15153 122618 27741 -14266 -49715 11440 44707 9705 -35814 3569 72146 79825 124115 197169
15141 197169 224901 142927 214063 152198 -43 -62928 -1455 53389 91326 81134 68441
15130 68441 70702 88780 65168 36593 51370 10739 28488 34875 -3915 79337 170834 182731
15118 182731 127117 115276 168903 166426 79752 101580 60561 24721 -25864 -49825 5402 11607
15106A1607r7129j27390N8176O2504P6007p4470j00909n180K4941R0046J5818
15095f5979L4175J11468L3258J5414L0311j02693q086R1311Q1111N222m9189o184
15083A70139J3547r043k2381r2067J0697n486m2109J3791P5281O1070O4933R4915
15071C33287P3097M439q7487p4823P67M9806k9207M4917J0109L593K2074o9095
15059B81477j17257P0385K4083j48626J13334k5377m6522J31370K0019j13439
15049A89447k9843L8796L1141l0622j26311l7871o6864r175J32050P7351r889
15038A58210P5791n9119p3292L537N9393l847J7589M9220p7098m8130O1946J25432
15026B89632J3199N817j0790J7502o550P0697k696p3525p3102J0750J12j2113
$$ plain form
15106 11607 -85522 -212912 -154736 -92232 -16225 -90695 -191604 -196784 -171843 -81797 -65979
15095 -65979 -31804 79664 112922 128336 158647 55954 47868 139179 220290 225512 176323 170139
15083 170139 183686 174643 152262 60195 70892 65406 23297 37088 112369 173439 238372 333287
15071 333287 406384 410823 323336 248513 249280 299086 269879 314796 324905 328498 350572 281477
15059 281477 164220 234605 258688 110062 223396 198019 151497 282867 302886 189447
15049 189447 159604 198400 229541 198919 72608 34737 -32127 -41302 90748 168099 158210
15038 158210 234001 174882 101590 105127 164520 160673 178262 227482 150384 102254 164200 289632
15026 289632 302831 308648 297858 315360 308810 379507 376811 303286 230184 240934 241046 228933
15014B28933K0474j5002J0619K6981o4092O960l693l7540m3807p7321k2794Q9772
15002A19490J08572K3979k6055j58699M0937O6834r488O5070L9891p8852o7893
14991A23786r8131K735n586N0573J05214o869o7519R110r7024l1366k4727Q5675
14979D5871j7729M9801N5029n0608J9485J14464m1695q4417j11858P540O7165
14968E3048R3473L8605L167k0997l5599n4190R761Q3456p607M8225N4952j25484
14956A40810P200J1727k8949N8780P2898J45164j8595j67174k6224p4687M6752
14945A67702J16862j6726N6857J36480J7683j3286j7340q7488P4069J1810m0530
14934D06093r5123l2523o0706l511K7411N3495l4405n4549p1811M78n3754K6646
$$ plain form
15014 228933 249407 234405 245024 272005 207913 214873 211180 173640 129833 52512 29718 119490
15002 119490 228062 252041 225986 67287 108224 175058 165570 230640 270531 191679 123786
14991 123786 25655 28390 22804 73377 178591 171722 104203 113313 16289 -15077 -39804 45871
14979 45871 28142 77943 132972 82364 101849 216313 174618 90201 -21657 -14117 53048
14968 53048 146521 185126 188293 167296 131697 77507 87268 170724 163117 211342 266294 140810
14956 140810 148010 159737 130788 189568 262466 407630 389035 221861 195637 120950 167702
14945 167702 284564 267838 324695 461175 478858 465572 448232 360744 434813 446623 406093
14934 406093 310970 278447 217741 214230 241641 295136 260731 206182 134371 134849 81095 107741
14922A07741l8049l9841q9874r4447k4914K8495Q8561J47553j8284k118M0715
14911A05538P2723P4864P2398n0722J892M5716k4127J056Q3296K3825n989p4986
14899C25484l6924Q0123J07981J45025k1706l4856j342Q6355M8176K1727l2524
14888F87519l8966n7543k9555R3373N8033m2156j16270n6178P915Q2556J10022
14877F98750K6147l0536o5075o2424J63J3378m2456m993K8240o543q0597O9224
14865E43278P095k5431k2162M8014L7298K7982Q101j10413l0319q809o9153K9892
14853D35373P3560O4604O7885M2987O9331K1597K8999o6329O4549N9870L3616
14842H96042J127l5448L505o872K3833J20614R6424K1583L1479J25655J0128q8557
$$ plain form
14922 107741 69692 29851 -60023 -154470 -179384 -150889 -62328 85225 66941 64823 105538
14911 105538 178261 253125 325523 274801 276693 322409 298282 299338 382634 406459 400470 325484
14899 325484 288560 368683 476664 621689 599983 565127 563785 650140 698316 720043 687519
14888 687519 648553 591010 561455 654828 712861 670705 554435 498257 506172 588728 698750
14877 698750 724897 694361 629286 566862 567025 580403 537947 532954 561194 554651 474054 543278
14865 543278 550373 524942 502780 550794 588092 616074 624175 513762 483443 474634 405481 435373
14853 435373 508933 573537 641422 684409 753740 775337 804336 738007 802556 862426 896042
14842 896042 897169 861721 865226 858354 882187 1002801 1099225 1120808 1152287 1277942 1288070 1199513
14830A199513j222P9478R1260J516P8366Q5194l6501j5881J49028k2729K025Q0344
14818A690391J17126P2174J57665P4130R4016J95856R7285O3798N7773K49931
14808B870145J25338j6761O0859K31926J51745K81472L16458K29099K58629K36174
14798D745084K95958L05694M54613M79148N08653N11458N97743O52756Q10396
14789I361503R29217J150618J360522J496822J814565K181933K685623L238205
14781B4219008L789858M581856N935216P534498J0071672J3068160J6631630K0253212
14773A06085110K3710192K6761895K8990072K9643756K7855877K4147417J8696425
14766B85890744J2118108M137059m408979j2336153j8835736k3592630k6766209
$$ plain form
14830 1199513 1198291 1277769 1369029 1370545 1448911 1534105 1497604 1481723 1630751 1608022 1610047 1690391
14818 1690391 1807517 1879691 2037356 2111486 2205502 2401358 2498643 2562441 2620214 2870145
14808 2870145 2995483 2978722 3039581 3271507 3423252 3704724 4021182 4250281 4508910 4745084
14798 4745084 5041042 5346736 5801349 6280497 6789150 7300608 7898351 8551107 9361503
14789 9361503 10290720 11441338 12801860 14298682 16113247 18295180 20980803 24219008
14781 24219008 28008866 32590722 38525938 46060436 56132108 69200268 85831898 106085110
14773 106085110 129795302 156557197 185547269 215191025 243046902 267194319 285890744
14766 285890744 298008852 302145911 297736932 285400779 266565043 242972413 216206204
14759B16206204k8141901k7570586k5448954k2406161j9056349j5829952j2796712
14752F4955589j0050993p910737o325612n222954m171708l525871l187204k668606
14744B1891904k245072j918236j641222j419134j251820q98834q01295p63891
14736A0952400p58696p01853o38975m33737m17722m70954l04433l09286k37600
14727F679144k48563l39047l03322j14551j48571j87896j18043j84803j74742
14718D859606k05710j18537p4052j16991j96843k82668j30208m9156j00891j66931
14708C417619j13097j28450j76350j21767j56986j05205l6169j00468j48370j73047
14698B157710j44040j92425k5523M2682j2455k3721J6503L3676K2097M423p3967
$$ plain form
14759 216206204 188064303 160493717 135044763 112638602 93582253 77752301 64955589
14752 64955589 54904596 46993859 40668247 35445293 31273585 27747714 24560510 21891904
14744 21891904 19646832 17728596 16087374 14668240 13416420 12517586 11716291 10952400
14736 10952400 10193704 9491851 8852876 8419139 8001417 7530463 7226030 6916744 6679144
14727 6679144 6430581 6091534 5788212 5673661 5525090 5337194 5219151 5034348 4859606
14718 4859606 4653896 4535359 4461307 4344316 4147473 3864805 3734597 3685441 3584550 3417619
14708 3417619 3304522 3176072 2999722 2877955 2720969 2615764 2579595 2479127 2330757 2157710
14698 2157710 2013670 1821245 1795722 1838404 1825949 1802228 1818731 1852407 1874504 1878927 1804960
14687A804960m1248l3366j33264n3139L7069Q0748l2944K9082j06365k41119r4483
14676A215931J7717K4100J1225l92j07006m6968j9033l0302j31640p4678j5680
14665H43274p5796O3853J1433L3338k5943j39o073p274k7674O9162n295n0732
14653H22134n408j8722j0190j3164o5510l6165n9391J3950Q2716r120q8382K4824
14641F37572J68310R3151p1040q8738J7090j623j08420l8575O244L5183j11877
14630E37277j31301l3860K9749J31318J32382m0385j61011j0241j2351J1677J41018
14619E94272l6521r8581j7380J39531j076j51529P1984J7374J20143k5298r3583
14608E19336n0634o0705o9141q4606Q990J6433o414j71942j30724J10604L6474
$$ plain form
14687 1804960 1763712 1730346 1597082 1543943 1581012 1661760 1628816 1657898 1551533 1310414 1215931
14676 1215931 1233648 1257748 1268973 1268581 1161575 1114607 1095574 1065272 933632 858954 843274
14665 843274 767478 831331 842764 876102 850159 850020 843947 836673 808999 878161 872866 822134
14653 822134 816726 798004 787814 774650 709140 672975 613584 627534 710250 701130 612748 637572
14641 637572 805882 899033 827993 739255 756345 754722 646302 607727 613971 649154 537277
14630 537277 405976 372116 401865 533183 665565 625180 464169 453928 441577 453254 594272
14619 594272 557751 459170 441790 581321 580245 428716 500700 518074 638217 612919 519336
14608 519336 468702 407997 338856 254250 263240 279673 273259 101317 -29407 81197 117671
14597A17671Q2405M6043k7523o2396j6567L5556O2521o1367j29397J4793N5970
14586A17709j4033m8777N7793j0783l6029n5082M9775K1896m7652L0560K0060
14575H5437k3184J0666N2121m6883l4478R4263P4371J4924N0644r3229p6001J11679
14563B20330k184L3340K7412j20968o3872O3969N8202M002m2213M6765j8784j29271
14551G6728j3226J6161l2181O9620L545m708l5919R980l6459K9766P3548n092
14539A51763j15302n3714L5640O3508N9780K0618l9283k4143m096q8586j11331
14528a05146O0463L8077R1099J51711M4208m1207r5213L0229p7316j35491m805
14517d3391k7490P2305K0901k7177K4245K2097O9233M7370m5141J6520j19669
$$ plain form
14597 117671 200076 246119 218596 156200 139633 175189 237710 176343 46946 61739 117709
14586 117709 103676 54899 112692 101909 65880 10798 60573 82469 34817 65377 85437
14575 85437 62253 72919 125040 78157 43679 137942 212313 227237 277881 184652 108651 220330
14563 220330 218146 251486 278898 157930 94058 158027 216229 220231 178018 224783 205999 76728
14551 76728 63502 79663 47482 117102 120647 115939 80020 90000 53541 83307 156855 151763
14539 151763 36461 -17253 18387 81895 141675 162293 123010 98867 94771 6185 -105146
14528 -105146 -44683 -6606 84493 236204 280412 239205 143992 174221 96905 -38586 -43391
14517 -43391 -70881 1424 22325 -4852 19393 41490 110723 158093 112952 129472 9803
14506I803J4107l2392k7446J20887M15n1433n5857L474K4350j2863n806m2043
14494e4804P2688J1105m2055M9546K1762r5795L5649L3129l1290K4726p2579Q4892
14482C6974n961k3363J1494m3791q626J9829n1933K735n3296k321j8928K840O8050
14469f6297j4865r0276N3411l0481L4505L5647q8490l1238L0375O2309N3327m8491
14457a00564N0099R0208l2149K7231n3J7645J4155L7918n4176q8746L2294o888
14445a3026L1379m4505j7720O2056k1062q2068J5543J06565R1228l6084q0000
14434A2306K2143M6086m7977J9251r497J479N8512M3443J5596q1940j89735p0207
14422a80540L4260N5041J30703l6320m1197m5116J0173L292k4420M0004M3505
$$ plain form
14506 9803 23910 -8482 -35928 84959 85374 33941 -21916 -18442 5908 -6955 -12761 -54804
14494 -54804 17884 28989 -13066 36480 58242 -37553 -1904 31225 -65 24661 -47918 36974
14482 36974 31013 7650 19144 -24647 -33273 -13444 -65377 -62642 -115938 -118259 -137187 -134347 -66297
14469 -66297 -81162 -171438 -118027 -148508 -114003 -78356 -166846 -198084 -167709 -105400 -52073 -100564
14457 -100564 -50465 39743 7594 34825 34772 52417 66572 104490 50314 -38432 -6138 -13026
14445 -13026 18353 -26152 -43872 18184 -2878 -84946 -69403 37162 128390 92306 12306
14434 12306 34449 80535 32558 51809 42312 43791 102303 145746 161342 79402 -110333 -180540
14422 -180540 -146280 -91239 39464 3144 -38053 -83169 -72996 -69704 -94124 -54120 -10615
14411a0615n8147j29450L324Q8669J12617j50461p4816K4776R8078Q9473m4919
14400e1471M1451j0556O5942n4170j75682o0428J3652J11201P7866L2229M2770
14389C2804K7187q8302q681M1904p2710R705J06095K3891j15098j05148P9339
14378f9014Q9576Q8029R273n1196P888R241r7811J0285R282J5039J02750j5982
14366A07360m9108j2378q981O0784J1632k030o523J9474K6594l4241M4630N7226
14354B14439L6901j3950j0292k1861n4209Q174m4339L365Q2165o3229k20397o9302
14342a52535M8590J96163M8499n0802N7J9038j2473Q273j1297k7726m9355k8125
14330a1693k0004Q9716J30226j1683q3255K7815J08629l259n1863M6890M0147
$$ plain form
14411 -10615 -68762 -198212 -194888 -106219 6398 -144063 -218879 -194103 -96025 -6552 -51471
14400 -51471 -10020 -20576 45366 -8804 -184486 -244914 -231262 -120061 -42195 -9966 32804
14389 32804 59991 -28311 -36992 4912 -67798 -58093 48002 71893 -43205 -148353 -69014
14378 -69014 20562 108591 117864 66668 74556 83797 -14014 -3729 5553 20592 123342 107360
14366 107360 58252 45874 36893 97677 109309 107279 100756 120230 146824 112583 157213 214439
14354 214439 251340 237390 227098 205237 151028 159202 114863 118228 200393 137164 -83233 -152535
14342 -152535 -103945 92218 140717 89915 89972 109010 96537 104810 93513 65787 16432 -11693
14330 -11693 -31697 58019 188245 176562 93307 121122 229751 226492 174629 221519 261666
14319B61666L1622P0154M8712O8050K6678P1567J38754J02491N1665K3209K17054
14308A111622J66742J39031m3091K4673J8952R595k7494q6694j43292j20434j66400
14297H83210j25695j22679j71320r4386q9937j18720l7583k5749J3869P9436K5772
14286B16218j01206O3829l0202o3140j9340q8264J7337q4674k1911L5803L0547
14275d5003k1876K9105p363J0927j0008J308N1794Q4756M1080Q3618m7807q9761
14263H0770K6515k4511r8660R563M8295K4934K1974p6214P1716J8247p5528r5886
14251f8785J7604Q6316Q2403J5915O208n7155N659j5385K3536l8667M8888j8581
14239H7956n6918J7907L1933N1052n40q7395j17858k5637J5329J07612J8742J6952
$$ plain form
14319 261666 293288 363442 412154 480204 506882 578449 717203 819694 871359 894568 1111622
14308 1111622 1278364 1417395 1374304 1398977 1417929 1427524 1400030 1313336 1170044 1049610 883210
14297 883210 757515 634836 463516 369130 279193 160473 122890 97141 111010 190446 216218
14286 216218 115012 178841 148639 85499 66159 -22105 -4768 -89442 -111353 -75550 -45003
14275 -45003 -66879 -37774 -45137 -34210 -44218 -42910 8884 93640 134720 218338 170531 80770
14263 80770 107285 82774 -15886 -6323 41972 66906 88880 12666 84382 102629 27101 -68785
14251 -68785 -51181 35135 117538 133453 139661 82506 88165 72780 96316 57649 106537 87956
14239 87956 31038 48945 80878 131930 131390 43995 -73863 -99500 -84171 23441 42183 59135
14227E9135p1479l2544j05740J9201O9632q1397r8284J8939L7396K3594J5629
14216a45918j4591Q2147N2697N0880J2876q6624n6734l0563L9521L8025J4353
14205d3931O0277P5735j3331j81914j21729P6271L8833n2650p7577j5725N653
14194b50088O2158Q0403O9907M1536N4051K3075K6187l5257q7376m9305k9887
14183i4596n8722k7236R8949R3022n3612j00525j2873O0835Q0069o773M0553R8313
14171A17404M9461l0635j27314l9280l5182K3997j5962m7470l8803l2594L4545
14160a41833R9452j1326k934J41453L836n4072j25351o1642L8630L050J9216k3785
14148a15306J9495n8452l9114J6990N2251O1874K8772M7857J8082j16452j26882
$$ plain form
14227 59135 -12344 -44888 -150628 -131427 -61795 -143192 -241476 -222537 -185141 -161547 -145918
14216 -145918 -160509 -78362 -25665 25215 38091 -48533 -105267 -135830 -96309 -58284 -43931
14205 -43931 16346 92081 78750 -103164 -224893 -148622 -109789 -162439 -240016 -255741 -250088
14194 -250088 -187930 -107527 -37620 3916 57967 81042 107229 71972 -15404 -64709 -94596
14183 -94596 -153318 -180554 -81605 11417 -42195 -142720 -155593 -94758 -14689 -21462 19091 117404
14171 117404 166865 136230 8916 -30364 -65546 -41549 -57511 -104981 -143784 -176378 -141833
14160 -141833 -42381 -53707 -56641 84812 88648 34576 -90775 -152417 -113787 -110737 -91521 -115306
14148 -115306 -95811 -154263 -193377 -176387 -124136 -62262 -33490 14367 32449 -84003 -210885
14137b10885L3498J36699J03843m3703k1029O730L1235O5484L8813n2406p7161
14126A1118q9750o4693J1861J12678Q681n0537P8078M4352Q0603J88j6720L416
14114A29275o2517q6372k6684R2333N4021n2929J807p678l0661j04655M1446n2293
14102a04907o1544K2204J16466Q071m3734q636N2865j7271m9670N5329L8257l2922
14090b5492r4322o5680J16099Q4525K3863k7793n9489r4516N6245J07713n7193
14079c6040j6853J7742N517M8662M9401r805j2372K5530p1461k5942k8994J7823
14067c6792o9248j2659Q277M9478J8132J3343P631j7536J5921N2156L2139p680
14055E3162n5485J2798K248l1832m7000K6125M5187r7006k7708l4116K3768J81323
$$ plain form
14137 -210885 -177387 -40688 63155 19452 -1577 5153 36388 101872 140685 88279 11118
14126 11118 -78632 -143325 -131464 -18786 -10105 -60642 17436 61788 142391 142579 125859 129275
14114 129275 66758 -19614 -46298 46035 100056 47127 48934 41256 10595 -94060 -52614 -104907
14102 -104907 -166451 -144247 -27781 -19710 -63444 -72080 -19215 -36486 -86156 -30827 7430 -25492
14090 -25492 -119814 -185494 -69395 15130 38993 11200 -48289 -142805 -86560 21153 -36040
14079 -36040 -52893 -35151 -29634 19028 68429 58624 46252 71782 321 -25621 -54615 -36792
14067 -36792 -106040 -118699 -110422 -60944 -42812 -29469 -21838 -39374 -23453 28703 60842 53162
14055 53162 -2323 10475 12723 -19109 -66109 -39984 5203 -91803 -119511 -153627 -129859 51464
14043E1464J05673P6275q9055j62366j01572N2534l0056j6079Q1106K7991J05310
14032A01225M8383p4944k9466M3079L695M4862O7371j00077q3221j4294J9194
14021B5807J1977l8874M4793N4798k6596N782k4086M5208K706o4005o6045j0165
14009c8700m5769J6389N664J02052L704j3626P148o1078N5426R4794m7534r284
13997F9186p2872k0395K6089j8526p641p2764R0638J16082P548K0787k5349j59079
13985d6296j51759l833N5376J6268l8260M012L135j445Q7032O8992P9891M6701
13973A19814J7941J545j07357j4028m2275J5372J3550L1610O7893J87667n7132
13962B34600j32716j05636n6559l3203k5662j5727L4650P1403N4387O4962J9391
$$ plain form
14043 51464 157137 233412 144357 -18009 -119581 -67047 -97103 -113182 -32076 -4085 101225
14032 101225 149608 74664 45198 88277 91972 136834 204205 104128 20907 6613 25807
14021 25807 37784 -1090 43703 98501 71905 77687 53601 98809 101515 37510 -28535 -38700
14009 -38700 -84469 -68080 -62416 39636 43340 29714 36862 -24216 31210 126004 78470 69186
13997 69186 -3686 -24081 2008 -16518 -24159 -96923 -6285 109797 117345 138132 112783 -46296
13985 -46296 -198055 -201888 -146512 -130244 -168504 -164492 -161357 -162802 -75770 -6778 73113 119814
13973 119814 137755 139300 31943 17915 -24360 -8988 4562 36172 104065 291732 234600
13962 234600 101884 -3752 -60311 -93514 -119176 -134903 -100253 -28850 25537 90499 109890
13951A09890j2714m507j01357l0680K671l4898k106M8678L6925m4227K6704K3417
13939A7796o1776k353M3825K5093K1910L670J09492M3662l756m3730k6460o874
13927A20499l850l4778o9436j59515o896k79L2401J17508J02990Q4324j0488j91516
13915a9036p4336l2323n6856M9509J30375j5587o1153Q8342l278l5557M8333O5187
13903H3620p6105j49644j7996L1223J35326J2652o7101j0349J6171J5053o849
13892c3999m2226K6208N3612J20202J0385M286o3640l2515J64636M8746K253J45052
13880D03000L9532J07378K14184J57451J30927J99664K56961L10892K51213K52092
13870B323294J08815O488k6630K4432k6087j56227l02975l31531l81056k07234
$$ plain form
13951 109890 97176 92669 -8688 -39368 -36697 -71595 -73701 -25023 11902 -32325 -5621 17796
13939 17796 -43980 -46333 -2508 22585 44495 48165 157657 201319 197563 153833 127373 120499
13927 120499 116649 81871 12435 -147080 -153976 -154255 -121854 -4346 98644 182968 172480 -19036
13915 -19036 -93372 -125695 -182551 -133042 -2667 -18254 -79407 8935 5657 -29900 18433 83620
13903 83620 7515 -142129 -160125 -128902 6424 19076 -48025 -58374 -42203 -27150 -33999
13892 -33999 -76225 -50017 3595 123797 134182 138468 74828 42313 206949 255695 257948 403000
13880 403000 442532 549910 764094 921545 1052472 1252136 1509097 1819989 2071202 2323294
13870 2323294 2432109 2438597 2411967 2436399 2410312 2254085 1951110 1619579 1238523 1031289
13860A031289j64379j85118j75736n9493L2987l9819r8263r505J1174L843j31463
13849B15517k8464l7002q6073L8638L5929K0277M4119P6527m0878j34282J5559
13838A19867p6534N2466J8630K8608N4405K5879p3296l1987j8662p7301k3211
13827a136j2918L3921M0165p7844J4298J23482K2917m3916m6239L9311q744L1672
13815A14969k6575m4952Q0631K7353l4865N482K1706L4005J2986l6572l7413o6847
13803D9908n117J16287M0602L5661N4821P9517n1950Q830p3695q5806q3654L8439
13791A23843J19957J019j08320k7566j050j7905n5537p8974j0779Q2898J2901
13780D0487l1845J4052m7458Q3301K1508j2313p6460L7274o1014N2517J6643o8137
$$ plain form
13860 1031289 866910 681792 506056 446563 479550 439731 341468 331963 343137 346980 215517
13849 215517 187053 150051 63978 102616 138545 158822 202941 279468 238590 104308 119867
13838 119867 43333 95799 114429 143037 197442 223321 150025 118038 99376 22075 -1136
13827 -1136 -14054 19867 60032 -17812 -3514 119968 142885 98969 52730 92041 83297 114969
13815 114969 88394 43442 124073 151426 116561 122043 143749 177754 190740 154168 116755 49908
13803 49908 44791 161078 201680 237341 292162 371679 319729 328559 254864 169058 85404 123843
13791 123843 243800 244819 136499 108933 107883 89978 34441 -44533 -55312 27586 40487
13780 40487 8642 22694 -24764 58537 80045 67732 -8728 28546 -32468 20049 36692 -31445
13768c1445N0049J1782M9354p1651j03149J0877J29222R0894L2087M1867j56375
13757E3512o0339m239j8854L6857K7472L8488j4169l7867j00262j37302M9482
13746a67221J51999J66713r1060j21210p7109K0105P3035j510m3153p4080M9647
13735a13844J45000j0307P108l938j01114n9523j6300P9012K7706J7661J137j27133
13723a54535Q767R204j10435N3975M6111R9276J17522m4002M6127J0707J3370
13712I6087k9312j171N026R873p4532P0951M6084L785m6325j04729n2325L7808
13700c8780K2439J9119J7386m647n6551m6264o3576k6458k8272J22596K6697m498
13688f0809M7174M9651k923p4956O6225N9069q5495N2074M0439R802j4683q734
$$ plain form
13768 -31445 18604 30386 79740 8089 -95060 -84183 45039 135933 168020 209887 53512
13757 53512 -6827 -11066 -29920 6937 34409 72897 58728 20861 -79401 -216703 -167221
13746 -167221 -15222 151491 60431 -60779 -137888 -117783 -44748 -46258 -89411 -163491 -113844
13735 -113844 31156 20849 27957 24019 -77095 -136618 -152918 -73906 -46200 -28539 -27402 -154535
13723 -154535 -145768 -136564 -246999 -193024 -146913 -47637 69885 25883 72010 82717 96087
13712 96087 66775 65604 70630 80503 5971 76922 123006 126791 80466 -24263 -76588 -38780
13700 -38780 -16341 2778 20164 15517 -41034 -87298 -150874 -177332 -205604 -83008 -56311 -60809
13688 -60809 -13635 36016 33093 -41863 24362 83431 -2064 50010 90449 100251 85568 76834
13676G6834r8709n1912M4513N7247l222K049O486j7847j8117J3387K504o7796
13664e4583K5464n9088M0673O8842J9945K146J60186n4708j8020k7938j04287
13653a368j01679R6783J9296L1886J0975K4550O5162P7364M055J9018p1435p9806
13641I4801n3231L0501K2376j4047j07669P3704M6672N6263j2663m5557j15327
13630b4177j65964l0923K9175L9272n6880k5518J16367L7839k1651k1252k1689
13619a45401M868J25204K7253j09872N992L6525M0786j01773m3524P0164j5089
13608a04867l4648m5196Q624J01928P3502L5629m4241r2287k9061k8600q0570
13597b39787P8600J31577P5565k4095o5149k4464j4171N2536L7160K7641j0829
$$ plain form
13676 76834 -21875 -73787 -29274 27973 24751 26800 33286 15439 -2678 10709 13213 -54583
13664 -54583 -29119 -88207 -47534 21308 41253 43399 203585 148877 130857 102919 -1368
13653 -1368 -103047 -6264 13032 44918 55893 80443 145605 222969 227024 246042 174607 94801
13641 94801 41570 72071 94447 80400 -27269 46435 93107 149370 136707 91150 -24177
13630 -24177 -190141 -221064 -191889 -152617 -209497 -235015 -118648 -80809 -102460 -123712 -145401
13619 -145401 -140533 -15329 11924 -97948 -91956 -55431 -14645 -116418 -159942 -89778 -104867
13608 -104867 -139515 -184711 -176087 -74159 -657 34972 -9269 -101556 -130617 -159217 -239787
13597 -239787 -161187 -29610 45955 21860 -43289 -67753 -81924 -29388 7772 35413 24584
13586B4584O856m4808K9369Q7412K2470p2812N592o2252j6797j9798Q729q515
13574c9970j6120Q0861J2484j15359J1577K9492l3375m3562J6637P801K668O0923
13562b5943q539J3836j0103q8401N2254N4425j7974L8581o6471m5998j4438N766
13550a13005J29466N9893k6833l6687m2773j5569K7328J03609r0796q2069M684
13539h2752o117R5302J08173k8950j25445q8308P946j5995r837M9769L386k1186
13527a14014J5089O9336L3229o6837J5031j0657k538K1701l9576j35826N5874
13516a59188K7152J07898r4111m2203N9809J08393n1009o4121M1186K4521J9947
13505b1726o9810l8796O3100N3649N109m248j2178j2549j13625k7576J0613N8849
$$ plain form
13586 24584 31440 -13368 16001 103413 125883 53071 58663 -3589 -20386 -40184 -31455 -39970
13574 -39970 -56090 24771 37255 -78104 -66527 -37035 -70410 -113972 -97335 -89534 -86866 -25943
13562 -25943 -34482 -20646 -30749 -119150 -66896 -12471 -30445 8136 -58335 -104333 -118771 -113005
13550 -113005 16461 76354 49521 12834 -29939 -45508 -18180 85429 -5367 -87436 -82752
13539 -82752 -88869 6433 114606 85656 -39789 -128097 -120151 -136146 -145983 -96214 -92828 -114014
13527 -114014 -98925 -29589 3640 -63197 -48166 -58823 -61361 -39660 -79236 -215062 -159188
13516 -159188 -132036 -24138 -118249 -160452 -100643 7750 -43259 -107380 -66194 -41673 -21726
13505 -21726 -91536 -130332 -67232 -13583 -8474 -12722 -24900 -37449 -151074 -178650 -168037 -109188
13493a09188O9217N4203Q826L3476r3940m6514k0977p2559P3662J38626J10107
13482A44939j40786m9894J02203K7977m3241K9005k104k2588o074n6073j4604
13471c1240M5149M8078q0290j8487k6659L8564N2762M5090j2036q8617l9667q0460
13459a47813j3031J96378L3795j01799N2632l2243k7227J10209M6973K5025r7279
13448D5620q8338l717K1278q560J4526l2126r6813K8153J06376q8784r1230n8150
13436b51765N2729m092M4627k7639R8411Q7712k5851o2043L1365m3913p0915J05448
13424f5926J37962M5202M6566L8873K4856m6288j16383r0596K4115L399j2121
13413a0341K472l8627R077M9046P3991M6652n6244n3287j27717q3091J5794p03
$$ plain form
13493 -109188 -39971 14232 23058 56534 -37406 -83920 -104897 -177456 -103794 34832 144939
13482 144939 4153 -45741 56462 84439 41198 70203 68099 45511 39437 -16636 -31240
13471 -31240 13909 61987 -18303 -36790 -63449 -24885 27877 72967 60931 -27686 -67353 -147813
13459 -147813 -160844 35534 69329 -32470 20162 -12081 -39308 70901 117874 142899 45620
13448 45620 -42718 -46435 -25157 -33717 -19191 -51317 -148130 -119977 -13601 -102385 -193615 -251765
13436 -251765 -199036 -203128 -158501 -186140 -87729 -17 -25868 -87911 -56546 -100459 -171374 -65926
13424 -65926 72036 117238 163804 202677 227533 181245 64862 -25734 -1619 1780 -10341
13413 -10341 -7869 -46496 -37419 11627 85618 132270 76026 22739 -104978 -188069 -172275 -172978
13401a72978j7487O2741L2736J8020k5457N1637J11831J14735m602J5552o2691
13390A24037o5735k1274j1080j8856k8046p252r2304p5681J03910O5784m048r119
13378c9664j7900k9103Q2196K1493N9196m0017j04009K6873r899j21561n7821
13367b30216O8266O1336J16302k5693r2122J9188m7951o1211L7731P3993O7804
13356a2573N36k731L308l6079m22O2292N4566r731L3259J3157r5453K5051j3390
13343B1790q9267m0488j1127M7906L4918M3477n1540k7807O2678K0259p1518J7082
13331d3637K288N2837q0042n5781J38550P832j2704k4354k8686K4978o8092N1521
13319c5290l0177k7943O6119K453j17924K4504O0011J7053L0549L4841n6001J7108
$$ plain form
13401 -172978 -190465 -127724 -94988 -76968 -102425 -50788 61043 175778 171176 186728 124037
13390 124037 58302 37028 25948 7092 -20954 -28206 -120510 -196191 -92281 -26497 -30545 -39664
13378 -39664 -57564 -86667 -4471 17022 76218 36201 -67808 -40935 -50834 -172395 -230216
13367 -230216 -161950 -100614 15688 -10005 -102127 -82939 -130890 -192101 -154370 -80377 -12573
13356 -12573 -12037 -14768 -11460 -47539 -47961 14331 68897 59166 92425 105582 10129 35180 21790
13343 21790 -67477 -107965 -119092 -71186 -36268 7209 -44331 -72138 -9460 10799 -60719 -43637
13331 -43637 -41349 11488 -68554 -124335 14215 22047 9343 -15011 -43697 -18719 -86811 -35290
13319 -35290 -65467 -93410 -27291 -24838 -142762 -118258 -58247 -41194 -10645 24196 -31805 -14697
13307a4697m526o3956j8661O9075l9204k3286R879P7459L0921o7104M785n6159
13295i5474j08395J4791o2338R1115P8994L3468M0845M5026M1430q4078L0303
13284B5687q221L6133k6023j49552R8438M3070n8438n2537K4901n4361k676j4938
13272a38517P0686J93315J33947n2425j16434N2360M5335m9688n3708j5924k1851
13261D7096j09629j32373L2845J8423M4791n8869K9556O0907J38047K1964J6296
13250A09054n5107k4802q6712K3761J26606r0714n4833N3718J18609O5514j4073
13239A71021l9695k0753l4264k8117L319q9550J8996O8569o342n1874n3685r501
13227g1876N8597K8533Q704n2879l5468m1409R1123J10828l396j5915K0048k7320
$$ plain form
13307 -14697 -19223 -83179 -101840 -32765 -71969 -95255 -85376 -7917 23004 -44100 -39315 -95474
13295 -95474 -203869 -189078 -251416 -160301 -81307 -47839 -6994 38032 79462 -4616 25687
13284 25687 17466 53599 27576 -121976 -23538 19532 -38906 -91443 -66542 -120903 -123579 -138517
13272 -138517 -67831 125484 259431 207006 90572 142932 188267 138579 84871 68947 47096
13261 47096 -62533 -194906 -162061 -143638 -98847 -157716 -128160 -67253 70794 92758 109054
13250 109054 53947 29145 -57567 -33806 92800 2086 -52747 971 119580 185094 171021
13239 171021 131326 110573 76309 48192 51511 -38039 -19043 49526 43184 -8690 -62375 -71876
13227 -71876 -13279 15254 23958 -28921 -64389 -105798 -14675 96153 92757 76842 96890 69570
13215F9570m7153r8190j12594N1435M356n4497M5971J30275P5431O0422r8578
13204B6448K8573J0740p685q0175K0639N0495P7870l191p9339j34688m7005P1660
13192f5658O0660P8050j0751p3379j5440m5980O6993J33236Q9420n2429l2860
13181A31862J5357P1148o7334j17202k8021M0016K5315O3671l3403j7248k9149
13170E5012J0144L4172N2027k5810o9663m1337R706p583o0514o9431k5625J4119
13158a24783O6539P2920M1975k2624L1284r0116M3100n2142m4518L7591J3548
13147b7226j5788N2872q3848N7019P2610K3192R550n1367r6449k0913o971R874
13135g7445O0612P6855m943L5444j2053j13975n8941o4752J7444R4756n187K7210
$$ plain form
13215 69570 22417 -75773 -188367 -136932 -132576 -187073 -141102 -10827 64604 125026 26448
13204 26448 55021 65761 58076 -22099 -1460 49035 126905 123714 44375 -90313 -137318 -65658
13192 -65658 -4998 73052 62301 -11078 -26518 -72498 -5505 127731 217151 164722 131862
13181 131862 147219 218367 151033 33831 5810 45826 71141 134812 101409 84161 55012
13170 55012 65156 99328 151355 125545 55882 14545 24251 16668 -43846 -113277 -138902 -124783
13158 -124783 -58244 14676 56651 34027 65311 -24805 18295 -33847 -78365 -40774 -27226
13147 -27226 -43014 9858 -73990 -16971 55639 78831 88381 37014 -59435 -80348 -87319 -77445
13135 -77445 -16833 60022 55079 90523 78470 -35505 -94446 -159198 -141754 -46998 -52185 -24975
13123b4975K5404m2223m3905R5986J9470O6907j31913o8990j4494N5129J5104
13112d8500L7045k4092O3264j1515L8415n0042j27517j6214O2695K415o0217o674
13100a40937m921P188J05950J11205O2804p98L510k5154o9739n4628n4417L0139
13088b9798j9825K8890n5022o3473O0520j5452M2100O1208O3417m4012n3895l8067
13076f3409m3406O7937K3256K9063l0298J82531J836j66485q8408R548L3862p458
13064e1431j0110l2366Q9517n890o7494N7717L3075L9162J0075r3845k9559n7840
13052a18989p5808l823O6137R4049Q4131m6682j34226J57J79792j2623j59060
13041a26945l8536K10424Q9847J8744L6731l3812L571k4408k691p7953k5977j3774
$$ plain form
13123 -24975 429 -41794 -85699 10287 29757 96664 -35249 -104239 -118733 -63604 -48500
13112 -48500 -11455 -35547 27717 16202 54617 4575 -122942 -139156 -76461 -74046 -134263 -140937
13100 -140937 -145858 -138670 -32720 78485 141289 140491 144001 118847 49108 -5520 -59937 -29798
13088 -29798 -49623 -20733 -75755 -139228 -78708 -94160 -52060 9148 72565 28553 -25342 -63409
13076 -63409 -106815 -38878 -15622 13441 -16857 165674 167510 1025 -87383 -77835 -43973 -51431
13064 -51431 -61541 -93907 -4390 -10280 -77774 -20057 13018 52180 62255 -31590 -61149 -118989
13052 -118989 -194797 -198620 -132483 -38434 45697 -985 -135211 -135054 44738 32115 -126945
13041 -126945 -165481 44943 134790 153534 190265 156453 160024 135616 132925 54972 28995 15221
13029A5221j9388o8902K1801K2743L1515L778L5160Q776j7569l1411K9939J02408
13017A34071R0982j9225q3038p7317q4049M6914m4054n2083n8297L8608L660k0707
13005a24535N7169M561p7875m5081J06477P7535P0213j1471K6750l8477j52698
12994a07432k9410M9010l122o6270O7238L8181j7646K9282Q1875j0609o7075L6316
12982C38P3142M3054L997N8139p5312o9129m766K4986J4233l3891l9405L2637
12970B8023J6044O4951R2712j31090j26471J6408J7378Q0385O2462L6826p1614
12959H6014j4808l2128K2470p1074k6244O0416J5570o3060p0439N2149Q8040n2189
12947e283R938j9562J8659N7826j5781M200L8056j06949k0274p7418O2099l6824
$$ plain form
13029 15221 -4167 -73069 -51268 -28525 2990 6768 41928 50704 33135 1724 31663 134071
13017 134071 225053 205828 122790 45473 -38576 8338 -35716 -87799 -146096 -107488 -103828 -124535
13005 -124535 -67366 -62805 -140680 -185761 -79284 -1749 68464 56993 83743 45266 -107432
12994 -107432 -136842 -87832 -90954 -157224 -89986 -51805 -69451 -40169 41706 31097 -35978 338
12982 338 73480 116534 120531 178670 103358 34229 29463 54449 68682 34791 -4614 28023
12970 28023 44067 109018 201730 70640 -55831 -39423 -22045 58340 120802 157628 86014
12959 86014 71206 39078 61548 -9526 -35770 24646 40216 -22844 -93283 -41134 46906 -5283
12947 -5283 4655 -14907 3752 61578 45797 49997 88053 -18896 -39170 -116588 -54489 -91313
12935i1313J6738q457k1474o363N3027l5060J19926K6944m7169l1796n2559o3888
12923a41444N6300M4826R725k8564N5331p491M2089Q955j02963n3783l5914N3656
12911i9277L3599n2451k904o3551L8707Q6172l218n7702q2060M0029J19554j9220
12899f2322m9837j3622J32879J54387m8792Q679Q7850J3713m0730J0244m9879
12888A42570o4073l6587N5225R644j2569k4666j15259p231j5714P6564m8513q4765
12876a25374L1958P7291L8989n7420j06629J8948J21967L1346n1539m1023j3675
12865g5161N6438L1265L4597K0773J2532M2143j3872j8726l618j20060r1856P0992
12853e4553J16289o5826m5906j9864o59J28102N2115o1004j05290k9969O07M4471
$$ plain form
12935 -91313 -74575 -83032 -104506 -110869 -57842 -92902 27024 53968 6799 -24997 -77556 -141444
12923 -141444 -85144 -40318 -30593 -59157 -3826 -11317 30772 39727 -63236 -117019 -152933 -99277
12911 -99277 -65678 -118129 -121033 -184584 -145877 -59705 -62923 -120625 -202685 -162656 -43102 -62322
12899 -62322 -112159 -125781 7098 161485 112693 121372 209222 222935 182205 192449 142570
12888 142570 78497 41910 97135 106779 94210 69544 -45715 -52946 -68660 7904 -40609 -125374
12876 -125374 -93416 -16125 22864 -34556 -141185 -122237 -270 31076 -20463 -61486 -75161
12865 -75161 -18723 12542 47139 67912 80444 122587 108715 89989 86371 -33689 -125545 -54553
12853 -54553 61736 -4090 -49996 -69860 -70519 57583 109698 48694 -56596 -86565 -85958 -41487
12841d1487r5856p340J41797P2286k5255l8743N391k177J5771M9525k8742p9184
12829c4014N115P8746L8542m8386m3772l4942m8911O8340N5794j4353n350k8714
12817a1905m5549K9449J2077k9648k4531N2108K6748p9728q946O0979k1632j2660
12805e3238M0114k4196k3114o2691Q6983q1760o7409J07100Q0634N3178j31715
12794g6114r0485L4316L9209L9608m4277j9581N9321P354J54140j8107o5244l1482
12782a1342m8303K8226P3254M3627K6334L3214P6250j14738j47917r7014l6744
12771a75153o890Q130K8357N0632J13808L5541q2140l6748M9656o4834k912J941
12759h0612M8574J43488L0505j49050j03147J27850Q6580l8726J3414l9906n4555
$$ plain form
12841 -41487 -137343 -144683 -2886 69400 44145 5402 10793 8616 24387 73912 45170 -34014
12829 -34014 -28899 49847 88389 40003 -3769 -38711 -87622 -19282 36512 22159 16809 -11905
12817 -11905 -57454 -28005 -15928 -45576 -70107 -17999 8749 -70979 -79925 -18946 -40578 -53238
12805 -53238 -13124 -37320 -60434 -123125 -36142 -117902 -185311 -78211 2423 55601 -76114
12794 -76114 -166599 -132283 -93074 -53466 -97743 -117324 -58003 -50649 103491 85384 20140 -11342
12782 -11342 -59645 -31419 41835 85462 111796 145010 221260 106522 -41395 -138409 -175153
12771 -175153 -182043 -173913 -145556 -94924 18884 54425 -27715 -64463 -14807 -79641 -82553 -80612
12759 -80612 -32038 111450 141955 -7095 -110242 17608 104188 65462 78876 38970 -15585
12748a5585p2410P2208J31999K0578l4966J0532L5338j00236j18803l7596L7938
12737g1003j1321j9711N6540K8108N0782m0672l0639o7048L8327J1013M1220n3427
12725f7831p0617j20105J9899M9812J06661j2805K2873r1004m2466L1656J08899
12714f5028m6797p932J19381m3852p250k2921M9248o800l1468j32808J085R4586
12702a00556j0952j3462J0354J9995j6417q3471L1778M554O5849O6274R3541K9713
12690I7200m3434k5936K3742J6685k4513J6062Q50m1074j8024K0153k14r6553
12678g5056m1093M1433P4668L2330j7270n0549n5268m5773l1754Q0317J40242
12667E2227M2728q6424q606L478N6261M9750M5994j0263n6660l8663Q38R614r5303
$$ plain form
12748 -15585 -87995 -15787 116212 136790 101824 112356 147694 47458 -71345 -108941 -71003
12737 -71003 -82324 -102035 -45495 -17387 33395 -7277 -37916 -104964 -66637 -55624 -14404 -67831
12725 -67831 -138448 -258553 -238654 -188842 -82181 -94986 -72113 -163117 -205583 -173927 -65028
12714 -65028 -111825 -119757 -376 -44228 -51478 -74399 -25151 -31951 -63419 -196227 -195142 -100556
12702 -100556 -111508 -124970 -114616 -94621 -111038 -194509 -162731 -158177 -92328 -26054 67487 97200
12690 97200 53766 27830 51572 68257 43744 59806 60656 19582 1558 21711 21497 -75056
12678 -75056 -116149 -74716 -48 32282 15012 -35537 -90805 -136578 -168332 -88015 52227
12667 52227 94955 8531 -75 3403 59664 109414 155408 145145 88485 49822 50660 60274 -35029
12654c5029j1044Q4424L218j5853K1850J9397q6964l9664J8451J20200J8852q6908
12642A0930o7782P675N402k8275k9060M137K3150M9731K442j7507n5224j3004
12630a07385J4958R5270K8122j7693j18294j09179k8702M6447M2937M937J23784
12619b4798l0729J5329j1034K5734L3117L1639P032L6623m5160j20243j45840
12608b28330L0491J18819M3658L3296O8595M7075k9576q733J8511P4866k5327
12597A43345o2330r0430l1770K20636J05167o3549j37473j6067j4561L9590k1576
12586G0982j8319l0426K7898Q1581J7012j02792m6331L521k3814o3150j3983p7011
12574a74832q4945m1413J74307Q9816k2177n5861M6326P6193j446j940l8177N158
$$ plain form
12654 -35029 -46073 38351 41569 25716 47566 66963 -20001 -59665 -41214 78986 97838 10930
12642 10930 -56852 -49177 -43775 -72050 -101110 -96973 -73823 -24092 -21650 -39157 -94381 -107385
12630 -107385 -92427 2843 30965 13272 -105022 -214201 -242903 -196456 -153519 -148582 -24798
12619 -24798 -55527 -40198 -51232 -25498 7619 39258 46290 82913 37753 -82490 -228330
12608 -228330 -197839 -79020 -35362 -2066 66529 113604 84028 75295 93806 168672 143345
12597 143345 81015 -9415 -41185 179451 284618 221069 83596 67529 52968 92558 70982
12586 70982 52663 22237 50135 131716 148728 45936 -395 3126 -20688 -83838 -97821 -174832
12574 -174832 -259777 -301190 -126883 -37067 -59244 -115105 -68779 7414 5968 4028 -34149 -28991
12562b8991L8216o9347l9104L3889l1028o761J00414K3583r9821m8311K4972Q2302
12550a9987J02055O0850j4463O138N981m3212p9890R6470L0580r0618k7313O5214
12538I1805J4023j0124j8218k3877K6260P5517k5781k00124l1191j7990L3989
12527h5711p5723l6748j8262q72O3948P2932M7180Q6021M3410M0719r886l8391
12515H8617J3590l5860m9576q9836p135Q2296Q0003m3244o7384P7928Q4892J1408
12503A45699J19047q4081K7549k1191p9572p8889n759Q0287k7446k0022j6410
12492C9212j1892p7476p5554M8569M9796n2245J9526L8246Q4120q701k2746j0958
12480A9897R1538P8167m0258o5653P016n1301n1223N5910K6609J781r5040K5255
$$ plain form
12562 -28991 9225 -60122 -99226 -65337 -96365 -103126 -2712 20871 -78950 -127261 -102289 -19987
12550 -19987 82068 142918 128455 134593 140574 97362 17472 113942 144522 53904 26591 91805
12538 91805 105828 95704 77486 53609 79869 155386 129605 -70519 -101710 -119700 -85711
12527 -85711 -161434 -198182 -216444 -217316 -153368 -80436 -33256 52765 96175 136894 127008 88617
12515 88617 102207 66347 16771 -73065 -80200 2096 82099 38855 -28529 49399 134291 145699
12503 145699 264746 180665 208214 187023 107451 28562 22803 103090 75644 55622 39212
12492 39212 27320 -50156 -125710 -77141 -27345 -79590 -60064 -21818 62302 53601 30855 19897
12480 19897 111435 189602 149344 83691 90707 39406 -11817 44093 70702 72483 -22557 2698
12468B698J05220m1092j07547L2452j4754K78J9667k7105n6000m4019m6262J6378
12456a60086J01505k4075P4313P4844p9837J289l8990K654n914K7507P8812O0764
12444A12786j8957l7005q6910l2931m3863r4443r5292Q198J97949K56099N1269
12433B16900n3238M525n2190L1715L7549M3769r052p2292j48986p8574L7033P6251
12421C3410n8920P5908K4660o79k8841Q166N0390M1936m6639j28004n0908K7671
12409e1850P2804K2574J32182J0356r7211r1412n540n7343n8274J11328O7333
12398E4947j005q0941m1913N6740Q3643p4540l1747k2393l3841M3640n3119J1551
12386h8978O7243N5270j2466l3033m1156O6821J1508Q8022j5586p0893R1714P3446
$$ plain form
12468 2698 107918 66826 -40721 -8269 -23023 -22745 -3078 -30183 -86183 -130202 -176464 -160086
12456 -160086 -58581 -82656 -8343 66501 -13336 -12047 -51037 -48383 -54297 -26790 52022 112786
12444 112786 93829 56824 -30086 -63017 -106880 -201323 -296615 -288417 -90468 165631 216900
12433 216900 163662 168187 115997 147712 185261 229030 219978 147686 -1300 -79874 -42841 33410
12421 33410 -25510 50398 75058 74379 45538 53704 104094 146030 99391 -28613 -79521 -51850
12409 -51850 20954 43528 175710 186066 88855 -2557 -8097 -65440 -123714 -12386 54947
12398 54947 53942 -26999 -68912 -12172 71471 -3069 -34816 -57209 -91050 -47410 -100529 -88978
12386 -88978 -21735 33535 21069 -11964 -53120 13701 25209 113231 97645 26752 118466 191912
12374A91912k9850K754j64704o2704j3692J13872J9027P4054P5638m0985J0116
12363A75438Q6027K0544j8958O5279J09693R4069p4246q1081r9886r9777j13757
12352F3345m161n454n0790m6536P7417J0543O0778N5063j03327l7748M4738k0163
12340D3705k6844n0792L242M1149M7612N4956R2427P2969j05113k8793k653n861
12328A36004K5657J6480j0416J20323l9943L2065J00808J18655O1752P8405J98748
12317H38538K86609K10160N153j44200j18818n4199j06062r2671j81778j44560
12307D98172m1215j36636j25033k6733K9943n1255J04986J51012l7081j09601
12297B56559j11179j4043N3273R036k8872q074N9444n2175m2300K2042M4006R3502
$$ plain form
12374 191912 162062 164816 112 -62592 -76284 37588 56615 130669 206307 165322 175438
12363 175438 261465 282009 263051 328330 438023 532092 457846 376765 276879 177102 63345
12352 63345 59184 53730 2940 -43596 33821 44364 105142 160205 56878 19130 63868 43705
12340 43705 16861 -33931 -30689 10460 58072 113028 205455 278424 173311 144518 141865 136004
12328 136004 161661 178141 167725 288048 248105 280170 380978 499633 561385 639790 838538
12317 838538 1125147 1335307 1340460 1196260 1077442 1023243 917181 824510 642732 498172
12307 498172 456957 320321 195288 168555 198498 147243 252229 403241 366160 256559
12297 256559 145380 131337 184610 193646 164774 156700 216144 163969 121669 143711 187717 281219
12285B81219Q3087r6084q3155m0970l9357K9671J21565J79553J61039J52155J27928
12274H76651J47744J26868N4480m6031K5414n0603j80923j13186K0808j01038
12264G60184j76078j00892j14303j23667k6555l1947j30919l7724n4325n6794
12254i3020J44545J58649K9873o0958j03614Q0488L7045m7994j20169j2109m949
12243G787r3389j0483N1881P4819P6353N9289p5591L839J215J9582j6375J22494
12231B21421R9937M2021J82394K0968p9998N2065M3595J04477n2774j04056k30118
12220B99932k25555j58141m054J9948J3648j9296P4001J21933o1825k7075n0059
12209a6543m545l1736m6507m4296P4319J23042J9590q2538M1765K6552j6177M6659
$$ plain form
12285 281219 364306 268222 185067 144097 104740 134411 255976 435529 596568 748723 876651
12274 876651 1024395 1151263 1205743 1159712 1185126 1134523 953600 840414 861222 760184
12264 760184 584106 483214 368911 245244 218689 186742 55823 18099 -36226 -93020
12254 -93020 51525 210174 240047 179089 75475 155963 193008 145014 24845 12736 7787
12243 7787 -85602 -96085 -44204 30615 106968 166257 90666 94505 95720 115302 98927 221421
12231 221421 321358 363379 545773 566741 486743 538808 582403 686880 634106 530050 299932
12220 299932 74377 -83764 -87818 -67870 -54222 -73518 483 122416 60591 33516 -16543
12209 -16543 -21088 -52824 -99331 -143627 -69308 53734 73324 -9214 32551 59103 42926 89585
12197H9585Q6989q4164r5042l328K2094J24607N7769q5418j28866q7390j39413
12186b42577k9889J00177K9934M0971o426J32391R8320n5148L8947J2545n8962
12175F0283o0956M063L4128l8179l1479L7874M6250k3693j1448J7763r948P1048
12163I5706N7777q9382r7903K3412J862N1214p945J6952m4259p4100O1824j3339
12151a8181j49102o4834R3062L8281J0640O5555K9631k5461L6344N1442k6959
12140D0418q0754J0095N2189m9855Q8717k0077p4779k8034j5317K4912L7868M503
12128a0114o0956J5535o7380k2104O9360N439k9691P4407J08983M2335M614m3984
12116H6444j9921M0617m3220p6287j9126O3255J34749p8731m9872m2903L816O5936
$$ plain form
12197 89585 176574 92410 -2632 -5960 16134 140741 198510 113092 -15774 -103164 -242577
12186 -242577 -272466 -172289 -142355 -101384 -107810 24581 122901 67753 106700 119245 60283
12175 60283 -673 3390 37518 -661 -32140 5734 51984 28291 16843 34606 24658 95706
12163 95706 153483 64101 -33802 -10390 -8528 42686 34741 51693 7434 -66666 -4842 -18181
12151 -18181 -167283 -232117 -139055 -100774 -90134 -24579 5052 -20409 15935 67377 40418
12140 40418 -40336 -30241 21948 -27907 60810 40733 -34046 -62080 -77397 -52485 -14617 -10114
12128 -10114 -71070 -55535 -122915 -145019 -75659 -70220 -99911 -25504 83479 125814 130428 86444
12116 86444 66523 107140 63920 -12367 -31493 31762 166511 87780 37908 -4995 -1179 64757
12104F4757j7433l0450Q147o5835m2176N9815m7936l3516J12056L5117O3904n4591
12092E1859n0926j6076K5556q580m3553K5213l1273J9487P4434j25426L7961J23238
12080H1914k9319m4335P0966m5716m424O4112l3230l4017j0456j9378J0457L1415
12068C7989l6714J1860K2773l3662J15833k3355r4616l2507P3199o683j3389R3677
12056A14405K1022k4216k7103P8987R9219P5440L1652p481o281o1492p4365o7328
12044A52459k4612k3803m9214J2380K3790l4257j5954j9206N438N5026k4432r3359
12032c5744K2177J23150Q010o4810p3937J9936j538J3445l3657j01081R6215R8535
12020G0701J0710n3293L1371l2555N4573L3901L8100l972J542p5260j13377j8633
$$ plain form
12104 64757 47324 16874 25021 -40814 -82990 -23175 -71111 -104627 7429 42546 106450 51859
12092 51859 933 -15143 10413 1833 -41720 -16507 -47780 -28293 46141 -79285 -41324 81914
12080 81914 52595 8260 79226 33510 29086 93198 59968 25951 15495 -3883 6574 37989
12068 37989 1275 13135 35908 2246 118079 94724 108 -32399 40800 34117 20728 114405
12056 114405 135427 111211 84108 163095 262314 337754 369406 361925 355644 294152 219787 152459
12044 152459 127847 104044 54830 67210 91000 56743 40789 21583 27021 82047 57615 -35744
12032 -35744 -13567 109583 117593 52783 -21154 -1218 -2756 10689 -22968 -124049 -27834 70701
12020 70701 81411 28118 59489 26934 81507 115408 153508 149536 151078 75818 -37559 -56192
12008e6192m081K3503O491K8495J6739j44794k5916R0224R2345n830k3765R5252
11996I2471p400Q951k598k6274m2553N6318l035l1337P1914r762M8419k361j21048
11983C1705o0504m2609o3211k875m8771O6546J12373m228km088L5560P7442m4270
11970E3068n1572m0178L1710P8570P7457o8469m5678m3972o2778n233Q2162p8377
11958g3290j13381J6218P7744M6704m3137R98M7750O2184r5780j498q0956m9968
11946b06412N0518K4934K09545L5351q7458L0395O9944P4220j11825j03649j19513
11935a33950Q6428J29275J14987n4529j04974k1155m572n1295L2685L7469L8262
11924F8631m518j1960k4107O5144O4861R512m7740n2587R6117N5909l6352J8110
$$ plain form
12008 -56192 -60273 -36770 -30279 -1784 14955 -129839 -155755 -65531 26814 20984 -2781 92471
11996 92471 85071 94022 91424 65150 22597 78915 75880 44543 116457 106695 155114 152753 31705
11983 31705 -28799 -71408 -134619 -137494 -186265 -119719 -7346 -11574 -11576 -15664 19896 97338 53068
11970 53068 1496 -38682 -6972 71598 149055 80586 34908 -9064 -71842 -77075 5087 -73290
11958 -73290 -186671 -170453 -92709 -46005 -89142 -88144 -40394 21790 -73990 -75488 -156444 -206412
11946 -206412 -155894 -130960 78585 113936 26478 56873 126817 201037 89212 -14437 -133950
11935 -133950 -47522 81753 196740 142211 37237 16082 11510 -39785 -7100 30369 68631
11924 68631 64113 52153 28046 93190 158051 167563 119823 67236 163353 219262 182910 201020
11912B01020p1925q1736q446n4031j61602o2338R556N0825j6269L4051J6625n4223
11900a98493M6760M3096P5959q822P556j4895j0571L0922L121p9184o7934J0462
11888a62023O1794p168Q3353R8269K8812l958N080J7281n7571j3975J326m8742
11876B478j2431N1239j9530L2102J6541j97k5516k2962p8414n4103Q9388J05565
11864H4160R701q4144M833K3911J6185L7323p4441J4790N2631l2993l5886l9832
11852b3762R7092K3628j07451j23074L5136P8424j2998j4545R3359J12673n4140
11841A04342p2283r3005K0771J0190m443M2550l33k0616l2315r805o0928n3002
11829a68877l1544q368m3522J00519J10557j5604O644o3239q9617K6932O1565
$$ plain form
11912 201020 129095 47359 38913 -15118 -176720 -239058 -229502 -178677 -194946 -160895 -144270 -198493
11900 -198493 -151733 -108637 -32678 -41500 -33944 -48839 -59410 -28488 -25367 -104551 -172485 -162023
11888 -162023 -100229 -107397 -24044 74225 103037 99079 104159 121440 63869 49894 51220 2478
11876 2478 -9953 41286 21756 53858 70399 70202 44686 21724 -56690 -110793 -21405 84160
11864 84160 93861 9717 14550 38461 54646 91969 17528 32318 84949 51956 16070 -23762
11852 -23762 73330 96958 -10493 -133567 -98431 -20007 -33005 -47550 45809 158482 104342
11841 104342 32059 -60946 -40175 -29985 -34428 8122 7789 -12827 -45142 -54947 -115875 -168877
11829 -168877 -200421 -208789 -252311 -151792 -41235 -56839 -50195 -113434 -203051 -176119 -114554
11818a14554J4770M6072O1945L7184q7957K9033j1546p6555K7420J32114m0519
11807A7407n8555k9265L7118O1312j3109n8429l1172R2380K7632N7028J12432
11796B14779q9602j30208l7591O1792O6670o670q3313J14N1332R0642n5295q3095
11784d45r7456p0502L6776O0651J6535M0254m5643l1013m0051O7859k6409P8404
11772a1040J5402N27O0268l4514n2966q9814L947J3106q528j02136r678Q5932
11760a29494Q2225J00701m0978o9044j5477J4720N7227Q6439o287l0193j7499
11749C2340K0870p7718j9297Q4070m3071N2934n8997j63364L884k2524M737O7131
11737a19005M0055L296m7102J02551L4719j761n2987l1449j398P1636L347K5754
$$ plain form
11818 -114554 -99784 -53712 8233 45417 -42540 -13507 -25053 -101608 -74188 57926 17407
11807 17407 -41148 -70413 -33295 28017 14908 -43521 -74693 17687 45319 102347 214779
11796 214779 125177 -5031 -42622 19170 85840 79170 -4143 -4029 47303 137945 82650 -445
11784 -445 -97901 -168403 -131627 -70976 -54441 -14187 -59830 -90843 -130894 -63035 -89444 -11040
11772 -11040 4362 4889 65157 30643 -22323 -112137 -108190 -95084 -103612 -205748 -215426 -129494
11760 -129494 -47269 53432 12454 -56590 -72067 -57347 -120 86319 80032 49839 32340
11749 32340 53210 -24508 -43805 40265 -2806 50128 -8869 -172233 -168349 -190873 -186136 -119005
11737 -119005 -78950 -75654 -122756 -20205 14514 12753 -40234 -71683 -73081 -1445 1902 27656
11725B7656K2835m1548M9800p855j4002j7960K8179M7309J322j097K1365Q1196
11713A97200l5054p6521q9793k6636J3161L4973l1160O9710p623p0806M2103p7095
11701e7541j2078J22122j4376p7638n9153M916K0126O4015J4031N5439k0373k568
11689C6922l7971l7285k72m5932L4333j3222L2648L4891K1297N0739m0081l9358
11677c291o6675q7555M2536m2209M3354L2071j7543N8086r778K3231K444k5852
11665e1181n7168n1586P0646J24929J1208L0000P1523j1124m1543q9526L5598
11654D1776p7292l0273n620M8544m093K5534M8485j25227p5411J04150O057j20275
11642a63645J1125N5878R7909O1037r2977j46769O8564L5260p914L07k5833L7517
$$ plain form
11725 27656 50491 8943 58743 50888 36886 18926 47105 94414 95736 94639 116004 197200
11713 197200 162146 85625 -4168 -30804 -17643 17330 -13830 55880 48257 -22549 19554 -57541
11701 -57541 -69619 52503 38127 -39511 -98664 -93748 -73622 -9607 4424 59863 39490 36922
11689 36922 -1049 -38334 -38606 -84538 -50205 -63427 -30779 4112 25409 76148 36067 -3291
11677 -3291 -69966 -157521 -114985 -157194 -113840 -81769 -99312 -41226 -51004 -27773 -25329 -51181
11665 -51181 -108349 -159935 -89289 35640 46848 76848 148371 137247 95704 6178 41776
11654 41776 -35516 -65789 -71409 -22865 -26958 -1424 47061 -78166 -153577 -49427 -43370 -163645
11642 -163645 -152520 -96642 1267 62304 -30673 -177442 -108878 -73618 -81532 -81225 -107058 -69541
11630f9541Q4623J3277l9191o9955m5114p0096L0172J7110l0406R7997J5485N74
11618f5065k0401o0030K6462J07119P5850q0381n3634p656P4798Q3120J6834p5522
11606B1494m1206p5298j42013O4575J11110J5891O181J0469N1493q5308r0033
11595a52645M878J50762j565J8036l5085l7048K7044J37344J9321p4081k0972
11584C5989r0850k9094J0525J0451Q5131n9395M6084Q1353m9697L4029m2760q4753
11572e2987P2455P7352o1640p3810m2048M3207j5826L4544M4146j0629J03653
11561A18417J37898r5805o3819p4355O714O4054L505k1565r280Q566O6452K4674
11549A65456j04244n8303p5506j6195O7044n8480l6632K7539R9208J6733l1080
$$ plain form
11630 -69541 15082 28359 -10832 -80787 -125901 -195997 -165825 -148715 -179121 -81124 -65639 -65065
11618 -65065 -85466 -145496 -119034 -11915 63935 -16446 -70080 -77736 -2938 80182 97016 21494
11606 21494 -19712 -95010 -237023 -172448 -61338 -45447 -39266 -28797 22696 -62612 -152645
11595 -152645 -147767 2995 1430 19466 -15619 -52667 -25623 111721 131042 56961 35989
11584 35989 -54861 -83955 -73430 -62979 22152 -37243 8841 90194 40497 74526 31766 -52987
11572 -52987 19468 96820 35180 -38630 -80678 -37471 -53297 -18753 25393 14764 118417
11561 118417 256315 160510 96691 22336 29050 93104 96609 75044 65764 74330 140782 165456
11549 165456 61212 2909 -72597 -88792 -21748 -80228 -116860 -89321 9887 26620 -4460
11538d460l1021m1878j3091l4276m4952Q632L0424R5749o696J08886N3189M96
11526A21002J6892m947m5473l9502r1658J6685k5947R2780J54131n4466p3785
11515F5712r0778N7496j729j29342j26017K6944R8704L513l8993K3952M6411N6650
11503g477N60J08627l7287m8154l1652k4418R657L044K5643j4966m8901m8171
11491a13495Q9700J644j6302l8242N0283N3387j0718J590j58403j51708M8466
11480b43798P1239J70435k1694o9784k7847O1655R018M4734J05013j1287j23772
11469c6088J22070L8109m7669k0873j05983m7451n3290p003Q2614J39619n9613
11458D442q9963R588k4291j46K5611n1618j6330j043J6135J5094K9828p568K2681
$$ plain form
11538 -4460 -35481 -77359 -90450 -124726 -169678 -161046 -130622 -34873 -41569 67317 120506 121002
11526 121002 137894 132947 87474 47972 -43686 -27001 -52948 39832 193963 139497 65712
11515 65712 -25066 32430 30701 -98641 -224658 -197714 -99010 -95497 -134490 -110538 -64127 -7477
11503 -7477 -6917 101710 64423 16269 -15383 -39801 -30144 -27100 -1457 -16423 -65324 -113495
11491 -113495 -23795 -22151 -38453 -76695 -26412 26975 16257 17847 -140556 -292264 -243798
11480 -243798 -172559 -2124 -23818 -93602 -121449 -59794 -50776 -6042 98971 87684 -36088
11469 -36088 85982 124091 76422 55549 -50434 -97885 -151175 -158178 -75564 64055 4442
11458 4442 -85521 -75933 -100224 -100370 -74759 -126377 -142707 -143750 -127615 -112521 -82693 -90261 -67580
11445f7580o6902m2183K8290Q4796N9009N8718p7821j34459J3285J2239J116Q1076
11433e0416n7894l5908J5871p1265j2888N7017j967K7759K3628j3395j4333O4410
11421f9381k263M4432k5798j78705O7306J3173Q1571K1127P4985L0103n610J8852
11409F9792p4840L8095O1816N3315M5974j72279j11562j6243R526L2828O5442
11398A864k3477M484n8966J3326P6565L5913o1623o2507l3277M912j03914j5020
11386b21720N6774L8049j25682q6470j4607K2529J17549J82490L0153p1439k7063
11375i9437J1763j5676o1633l2517m049J4510J6694P9985J18928R5619L4078q9550
11363F8715p2054Q8616O1645p2051j08156R930N4921o5830M415L5981Q9531J1688
$$ plain form
11445 -67580 -134482 -176665 -148375 -63579 -4570 54148 -23673 -158132 -144847 -132608 -131492 -50416
11433 -50416 -108310 -144218 -128347 -199612 -212500 -155483 -157450 -129691 -106063 -119458 -133791 -69381
11421 -69381 -71644 -27212 -53010 -231715 -164409 -151236 -69665 -48538 26447 56550 50940 69792
11409 69792 -5048 33047 94863 148178 194152 21873 -89689 -105932 -96406 -63578 1864
11398 1864 -21613 -17129 -76095 -62769 13796 49709 -11914 -74421 -107698 -102786 -206700 -221720
11386 -221720 -164946 -126897 -252579 -339049 -353656 -331127 -213578 -31088 -935 -72374 -99437
11375 -99437 -87674 -103350 -164983 -197500 -201549 -187039 -170345 -90360 28568 124187 158265 68715
11363 68715 -3339 85277 146922 74871 -33285 -23355 31566 -34264 -29849 6132 95663 107351
11351A07351j57418r9416m500j811M8424J13301L359l9744l0270l4843o6055M4925
11339a16697J28699o6222p7695O0552N9719P3605M0626p021M2634q545j02759
11328B6896q2624o5779J524P5239Q0329J09486n723m9678k1490j08956L2302J4771
11316F297j16041p06O1909j6648k6278O5552R9248l8521K1060n9282Q6003J4838
11304I7431O023p9170j451L0874m6616o289P1713o5278J26863J0295m8430j80509
11292h4544L8780O4771j16533j7623R730P364P7050K3427n7556K1786Q7228p1381
11280a7501q1398k0049K9039m8917k5323o229N0298Q3525O510j67997r207J7326
11268a89923Q2942N1317m3248r6204M0245J00204N776o9637K6721N1221J2258
$$ plain form
11351 107351 -50067 -149483 -153983 -155794 -107370 5931 9290 -30454 -60724 -95567 -161622 -116697
11339 -116697 12002 -54220 -131915 -71363 -11644 61961 102587 95566 138200 129655 26896
11328 26896 -55728 -121507 -119983 -44744 35585 145071 139348 89670 68180 -40776 -8474 6297
11316 6297 -109744 -110450 -48541 -65189 -91467 -25915 73333 34812 55872 -3410 82593 97431
11304 97431 103454 24284 22833 53707 7091 802 72515 7237 134100 144395 95965 -84544
11292 -84544 -45764 19007 -97526 -115149 -105419 -98055 -21005 2422 -55134 -33348 53880 -17501
11280 -17501 -98899 -118948 -89909 -138826 -164149 -170378 -120080 -36555 -30045 -198042 -207249 -189923
11268 -189923 -106981 -55664 -98912 -195116 -154871 -54667 -48891 -118528 -91807 -40586 -28328
11257b8328J9980k3473Q4331j09225n2705J731L4981O501M9446l127O4816O0683
11245A05611l7408O7517J07637m6927p8171n0881R0892j3839j35441q389K6042
11234B6643L1252P9105M35r4472j3302n5063M0116O8151k9517o2246j9982P5207
11222D6327Q35O0036M8108n1798j41745k3012P7460L0847j6301j3569J576K2693
11210D1457o9621k4318M4579k5476j2478k0213q1361L8562J58967R0720r8845
11199D1973j21058j05891j0030Q9956J1480M998l7499l8786p065O9530K1826M0206
11187d0360P3842j981J4412M9767j5712L025J2705K2127m4121m8712R3933l1950
11175H6975J2055k2943j10106M5354M9344r8081j03440N6472Q9245J7467m0680
$$ plain form
11257 -28328 -8348 -31821 52510 -56715 -109420 -107689 -72708 -66207 -16761 -19888 44928 105611
11245 105611 68203 135720 243357 196430 118259 67378 158270 144431 8990 601 26643
11234 26643 57895 137000 137435 42963 29661 -25402 14714 82865 53348 -8898 -28880 46327
11222 46327 47162 107198 155306 103508 -38237 -61249 16211 47058 30757 17188 18764 41457
11210 41457 -28164 -52482 -7903 -33379 -45857 -66070 -147431 -108869 50098 140818 41973
11199 41973 -79085 -184976 -195006 -105050 -93570 -88572 -126071 -164857 -171922 -102392 -80566 -40360
11187 -40360 33482 31501 45913 95680 79968 82993 95698 117825 73704 24992 118925 86975
11175 86975 99030 76087 -34019 11335 60679 -37402 -140842 -84370 4875 22342 -18338
11164a8338L068l8877j2830R4125k0642o9904N5456J34599Q4420m573p4741n8663
11152G3100k8808l8077k92P3021O8528k5764j47488r8291M618L8039K9153P329
11140d4932j262O9939j3557m1801l2385o3803q9507J2773Q2653N4767n8196P3749
11128e1562J04963Q2428k7445k6266n1494Q273m2205N1622J62287J04639n123
11117C10117j1315l1521m956K4157o6364l6811n6805p6123K6732M4993L1000j16863
11105C6241P90p2130O735J04379l5347r3024J4286M0813j3007Q423N9072J45444
11093B02675q3264o558m6994p0924r278N9031M3087m6026q6465r2582M2600L7183
11081e7515o961q475m6603N117p61l95N3182O5240K3959K4561J6641o8994o3697
$$ plain form
11164 -18338 -15270 -54147 -66977 27148 6506 -63398 -7942 126657 211077 206504 131763 73100
11152 73100 44292 6215 5923 78944 147472 121708 -25780 -124071 -119453 -81414 -52261 -44932
11140 -44932 -46194 23745 10188 -31613 -63998 -127801 -217308 -204535 -121882 -67115 -125311 -51562
11128 -51562 53401 135829 108384 82118 30624 38897 -3308 48314 210601 315240 310117
11117 310117 298802 267281 262325 286482 220118 183307 126502 50379 77111 122104 153104 36241
11105 36241 37031 -35099 -28364 76015 40668 -52356 -38070 2743 -10264 -1841 57231 202675
11093 202675 119411 112853 65859 -5065 -14343 44688 87775 41749 -44716 -137298 -94698 -57515
11081 -57515 -64476 -72951 -119554 -114437 -115198 -115593 -62411 2829 26788 51349 67990 -1004 -64701
11068f4701n8981k2378J81328N7931j0164m6516M2095L6946j53649M3006O3011
11057F7928J00768r3602r8775l4210J28107Q438n4478j5356o0965k5614O3961
11046a3798P0150j30170j19694o0965M6470N5634O7897N087q0283j5494j317p2781
11034b49264p30J21969r9530p7496N9184J02915R4775K1246P9857O3303K471j22928
11022d228j3578K1726N5228l175R733r7139n1606m5915P8334J7257m3727j06579
11010a83669k2342P6441J67948K6998l7145n2219K7509J6816m0854J701J47985
10999A29169M4415j33449p8567l1407N8769j12015J7809P3834J16117N7453K3079
10988A65207k8796n0193j01079J7743R9187o5702k0107J74108J3472l868j0151
$$ plain form
11068 -64701 -123682 -146060 35268 93199 83035 36519 78614 115560 -38089 4917 67928
11057 67928 168696 75094 -23681 -57891 70216 78654 24176 8820 -52145 -77759 -13798
11046 -13798 56352 -73818 -193512 -254477 -208007 -152373 -84476 -79389 -159672 -175166 -176483 -249264
11034 -249264 -249994 -128025 -227555 -305051 -245867 -142952 -48177 -26931 52926 116229 118700 -4228
11022 -4228 -17806 3920 59148 55973 65706 -31433 -83039 -128954 -50620 -33363 -77090 -183669
11010 -183669 -206011 -129570 38378 65376 28231 -23988 3521 20337 -20517 -18816 129169
10999 129169 173584 40135 -38432 -69839 -11070 -123085 -105276 -31442 84675 142128 165207
10988 165207 136411 86218 -14861 2882 102069 36367 16260 190368 203840 199972 189821
10977A89821j07092K2514R7056O2358k8671p9291k9895Q760j09961j15509q1242
10966a71152M8213K7041L6828m407O0070K981p3401j9237l651K2280q490k1234
10954a04159N8848J02611K7284l7657m3799Q2480Q902j0647P279O8406J918l1181
10942A30285P4445k9343j00671r4361n8238N4280O9792l9369j59194J5966P3488
10931f2920M6658L3795M8196O6259m5433j09112n8035m174q0588m6482J28737
10920h3099Q9884n9931m7897P2490p6857l7178K7161l9358j8838J01977P0545
10909a101J4318l8822l9284K1505P0549r1349m7839k3729m3659K5579K8093N5087
10897g0652J03764M6315l8526n8759P5891O9119p552j0335n8985m5246k0371O7337
$$ plain form
10977 189821 82729 105243 202299 264657 235986 156695 126800 135560 25599 -89910 -171152
10966 -171152 -122939 -95898 -59070 -63477 -3407 -426 -73827 -93064 -96715 -74435 -82925 -104159
10954 -104159 -45311 57300 84584 46927 3128 85608 94510 83863 91142 159548 161466 130285
10942 130285 204730 175387 74716 -19645 -77883 -23603 46189 6820 -152374 -136408 -62920
10931 -62920 -16262 17533 65729 131988 86555 -22557 -80592 -84766 -165354 -211836 -83099
10920 -83099 6785 -53146 -101043 -28553 -105410 -142588 -115427 -154785 -173623 -71646 -1101
10909 -1101 13217 -25605 -64889 -43384 27165 -64184 -112023 -135752 -179411 -153832 -125739 -70652
10897 -70652 33112 79427 40901 -17858 58033 127152 119600 109265 50280 5034 -15337 52000
10885E2000L4240K2114K0550n2129K3273r4164l4689M6208O1406o7569r5556l0511
10873a14827j40027j61857M0949J28152P3629P7936p2685p2328M3626R0048P9113
10862b8271l1716r0118J11958Q9505m548n3181J8093n4017l8309L8301p5750K6196
10850i1857O5432L0783K8013l3694j6577R3133J3369k8292o7138o372o1600o713
10838h1513P0131R8304O6303K4692k6031L0985L9366m5475m0839m8607o6532j17486
10826i6702k6760o2535J60048M6517m7938j2716K9586M1006o8872q2751N5096
10815f6021O243J18188L3534q4678J506K071L9472o3485o0337k6171K8067n4323
10803a25934k5016L3966O3495L1804j03570o0967N0150N7391J35571k4551j04484
$$ plain form
10885 52000 86240 108354 128904 76775 100048 5884 -28805 17403 78809 11240 -84316 -114827
10873 -114827 -254854 -416711 -375762 -247610 -173981 -96045 -168730 -241058 -197432 -107384 -28271
10862 -28271 -59987 -150105 -38147 51358 46810 -6371 11722 -42295 -80604 -42303 -118053 -91857
10850 -91857 -26425 4358 32371 -1323 -17900 75233 88602 60310 -6828 -13200 -74800 -81513
10838 -81513 -11382 86922 153225 177917 151886 182871 222237 176762 135923 87316 20784 -96702
10826 -96702 -123462 -185997 -25949 20568 -27370 -40086 -10500 30506 -38366 -121117 -66021
10815 -66021 -59778 58410 91944 7266 8772 10843 50315 -13170 -73507 -99678 -71611 -125934
10803 -125934 -150950 -116984 -53489 -21685 -125255 -186222 -136072 -78681 56890 32339 -72145
10792g2145o4391l538M1135O859J1287n7559M5067J04494J3380l2375o7766n519
10780h1071J64620N6704p8098R327Q2948m6644j12796M697L079Q0853L2140J3663
10768A29422j9969j91708m8512K8266q603J4143k6176Q4679K8341L6877l0713
10757c953l4363P3323L4493m891N7307n3802j28958L1250J89722P7228l7374o6781
10745A33201q1980l9862n2719l2391p9343l6632j5496O0349N5304J41598Q728
10734F0757j8942K7996q0807j4719l3677Q4813K7245P870N6014n4321j09912k4475
10722g2158L7371K2824j4044O9807R625j4137J4648r0177j54540k0425J06543
10711a04663P3923L4369L0472n26l9920j7895J9875Q3558q775K6355l8408J6872
$$ plain form
10792 -72145 -136536 -140074 -98939 -92080 -80793 -138352 -93285 11209 24589 -7786 -75552 -81071
10780 -81071 83549 140253 62155 71482 154430 107786 -5010 -313 2766 83619 115759 129422
10768 129422 109453 -82255 -130767 -102501 -111104 -96961 -123137 -38458 -10117 26760 -3953
10757 -3953 -38316 35007 69500 64609 121916 68114 -60844 -29594 160128 237356 199982 133201
10745 133201 51221 11359 -41360 -73751 -153094 -189726 -205222 -144873 -89569 52029 60757
10734 60757 41815 69811 -10996 -25715 -59392 25421 52666 60536 116550 62229 -47683 -72158
10722 -72158 -34787 -11963 -26007 43800 53425 39288 53936 -36241 -190781 -211206 -104663
10711 -104663 -30740 3629 34101 33575 -6345 -24240 -4365 79193 70418 96773 58365 75237
10699G5237O3174j3572j52999j4000k9554K965L8673J0046p9599N8477J74693
10688A33541K2640m2706R539j13640o5900L961n6813l7488M6285M8428L9342J6916
10676D105j11522P210J03749N0867p2510K578K2074O6495j662L8452P6861L0088
10664B16785j2730m1331n529j2494j10421P8554J35405m6986j70573o1712r6800
10653a27832N8228L1692R128L800j08155j27791N3642J15285K1956l5743N9327
10642d6463K6295l5953j4995l3631N9076r259p3342K0354K4322m4485o8510j4951
10630b11542P6513K1214N8274p130O766l3595l4429J6613m105n1804K5252O207
10618a31766k0252L2936N074j8816m459L2767Q884P2101m7855L754n6165l2561
$$ plain form
10699 75237 138411 124839 -28160 -42160 -71714 -68749 -30076 -20030 -99629 -41152 133541
10688 133541 156181 113475 123014 9374 -56526 -52565 -109378 -146866 -100581 -52153 -12811 4105
10676 4105 -107417 -100207 3542 54409 -18101 -15523 6551 73046 71384 109836 186697 216785
10664 216785 204055 162724 157195 144701 34280 112834 248239 201253 30680 -31032 -127832
10653 -127832 -69604 -37912 -28784 -24984 -133139 -260930 -207288 -92003 -70047 -105790 -46463
10642 -46463 -20168 -56121 -71116 -104747 -45671 -54930 -128272 -107918 -83596 -128081 -196591 -211542
10630 -211542 -135029 -113815 -55541 -62671 -55905 -89500 -123929 -107316 -111421 -163225 -137973 -131766
10618 -131766 -152018 -119082 -114008 -132824 -137283 -104516 -95632 -23531 -71386 -67632 -123797 -156358
10606a56358N1947K154k0384J16105O9163o0411J9499Q327j3649j0247R5777m0774
10594F1149o9675l0215M2143J4632m3232q5938j1086L730O3185O2408N3960K6634
10582H7695q4374q6980r1350Q4106Q7523k7646l1865M4949j23081O7070j9503
10571i3456j31000J05948J43329j50820r8143p493L4754J00766R3312J7848j33364
10560a18319k8492l4416n7388Q1642L6385M5282P796N7127J8498m1189l7891K9263
10548d1702J8440L3207n3878K0251n762p8431j8044P9509J0269M6355j16178r1142
10536a97106N334l8504L0624J66837o0665j14405L258J56469J41138J61872m5616
10525B09236p9418l0465J8565o1635m0217p8504k7270K5172j4713j02125j3501
$$ plain form
10606 -156358 -104411 -102257 -122641 -6536 62627 2216 21715 30042 16393 6146 101923 61149
10594 61149 -8526 -38741 3402 18034 -25198 -111136 -122222 -118492 -55307 7101 61061 87695
10582 87695 3321 -83659 -175009 -90903 -3380 -31026 -62891 -17942 -141023 -73953 -93456
10571 -93456 -224456 -118508 24821 -125999 -224142 -231635 -196881 -96115 -2803 15045 -118319
10560 -118319 -146811 -181227 -238615 -156973 -120588 -75306 -67510 -10383 8115 -33074 -70965 -41702
10548 -41702 -23262 9945 -43933 -23682 -29444 -107875 -125919 -46410 -36141 10214 -105964 -197106
10536 -197106 -191772 -230276 -199652 -32815 -93480 -207885 -204627 -48158 92980 254852 209236
10525 209236 129818 99353 117918 56283 16066 -62438 -89708 -64536 -79249 -181374 -194875
10514a94875J00277k5597O1680J05068o7027L9063K1614l1204n3187K511M7454
10503E777k8551N0792N7361K6686n0754M3757P1515j75181k26452m5084J46635
10492a23499P8569p1651J71593J39437M5322K2140q2783L4589Q2996M2038N4044
10481C92795P5144J04638j06907q4146m7167n3389k79j2140K2294m9501k5987
10470B15355M0849O157o4914k6497J5965r2183n048j6969j71190k5252N0038j0514
10458h4203j42451k1796o701Q6261O0538O5567p450O9430j7519q1164o9794n4928
10446b04210P1076R0311K2070j4735N649L1093L7051K5846m0830m4547J0112M6981
10434C5867Q939L2140j00363j61543j0711M5393Q0315N9933K3653K8071n3931
$$ plain form
10514 -194875 -94598 -120195 -58515 46553 -20474 18589 40203 8999 -44188 -41677 5777
10503 5777 -22774 28018 85379 112065 61311 105068 176583 1402 -225050 -270134 -123499
10492 -123499 -44930 -116581 55012 194449 239771 261911 179128 213717 296713 338751 392795
10481 392795 467939 572577 465670 381524 334357 280968 280689 268549 290843 241342 215355
10470 215355 256204 262361 197447 170950 186915 94732 89684 72715 -98475 -123727 -73689 -84203
10458 -84203 -226654 -248450 -255151 -168890 -108352 -42785 -50235 19195 1676 -79488 -149282 -204210
10446 -204210 -133134 -42823 -20753 -35488 -29839 1254 38305 64151 23321 -21226 -11114 35867
10434 35867 44806 76946 -23417 -184960 -195671 -150278 -69963 -10030 13623 41694 -12237
10423a2237r3626m8987J6793J13108N2696o2331J8917M3953P9790L1476q6008
10412E3544m7126M9307J049l8519n7856q2587N9636J12400J1888l5035m3083J1135
10400e247J45001R948l7409L5220n6174r413k4884R3879p423q5403J0236o6211
10388B120n069K6661K7059p2082K6723N5775k6882j4978q2162j02516l7395O7801
10376a34945J43366K2972q281j3018J34607o8718j45129n196R3441N3146k3425
10365D8820p6133o8549l0569N4687J28028Q7970K1274m7897q2901j8017R31N7826
10353G5470m72l2669l3924m6021M5213O478l5064J1516r82m6393j4377r9556K6508
10340a44273O0824O2902j0999j9562L6461P3863L3449P504j14611p1020J12286
$$ plain form
10423 -12237 -105863 -154850 -138057 -24949 27747 -34584 -15667 28286 108076 139552 53544
10412 53544 6418 55725 56774 18255 -39601 -122188 -62552 49848 61736 26701 -16382 -5247
10400 -5247 139754 149702 112293 147513 91339 81926 57042 150921 143498 58095 68331 2120
10388 2120 -2949 23712 50771 -21311 5412 61187 34305 19327 -62835 -165351 -202746 -134945
10376 -134945 8421 31393 23112 10094 144701 75983 -69146 -74342 19099 72245 48820
10365 48820 -27313 -95862 -126431 -71744 56284 144254 165528 117631 34730 16713 17644 75470
10353 75470 74998 42329 8405 -37616 7597 14075 -20989 -9473 -10455 -56848 -71225 -170781 -144273
10340 -144273 -83449 -20547 -31546 -51108 -14647 59216 92665 100169 -14442 -85462 26824
10329B6824M6503L062m8384l0809l5816N5968j6959K366P3191j896O129j9390
10317F0789o4849l0474j7579m7121k6213N0979m543M5516N1696m6788O7723M1488
10305H0624n5218J7401L7090o2765k1961O9256k1160q3265K5396M8506L7689n104
10293F6489k3907J4651K9573m2091p9373Q8281Q9439L5349M9603K2951j47983
10282A02982J709M2173j23913p1324L2201R541l8419q9784P9016J55323O3283
10271A62788q2392q1452p833j2874J06287J34521p1476q5565j0555j4184k7617
10260I648J6190p256l9988j8997k9948K5479k2706q0106l4888l419O6056L9424
10248h0511o123K1836J36563J8178m1008p8202J11013l6448j09473L9875K7317
$$ plain form
10329 26824 73327 76389 28005 -2804 -38620 17348 389 2755 75946 74050 80179 60789
10317 60789 -4060 -34534 -52113 -99234 -125447 -74468 -79011 -33495 18201 -28587 39136 80624
10305 80624 25406 42807 79897 17132 -4829 64427 43267 -39998 -14602 33904 71593 66489
10293 66489 42582 57233 86806 44715 -34658 53623 143062 178411 228014 250965 102982
10282 102982 104691 146864 22951 -48373 -16172 -6631 -45050 -134834 -55818 99505 162788
10271 162788 80396 -1056 -8889 -21763 84524 219045 147569 62004 51449 37265 9648
10260 9648 25838 18582 -21406 -40403 -70351 -44872 -67578 -147684 -182572 -185991 -119935 -80511
10248 -80511 -86634 -64798 71765 89943 48935 -29267 81746 45298 -64175 -24300 3017
10237C017J6528O318q4113k0025J61247O5989o5201j07211l1412o1375L5005o547
10225h7780O0542M5950o6162j3671M0387l3401p815L1876j950m9727M9638K9128
10213b985j27872L451P8388L8763o6535p8810o1250L1878L9415J41142M1549o3980
10201b6846j04743O0759R3183j8545j4553L7238J8153q5698J7926j13211l7127
10190a73464P1476R6814l1011q564K2543K1079O0910j9945O9783r4830o3022r2485
10178a40716L2712P9329l4412j6761M7666M2942R6561l6434q7472n4948Q0104
10167H571K4999k677o5323m4116j866J3958K9740M9455n2770N6543k9124O889
10155e721J8118l317P5922O0979m655J4191q5723l5713N8303k154J61o5691k7946
$$ plain form
10237 3017 19545 25863 -58250 -78275 82972 148961 83760 -23451 -54863 -116238 -81233 -87780
10225 -87780 -27238 18712 -47450 -61121 -20734 -54135 -61950 -30074 -32024 -81751 -32113 -2985
10213 -2985 -130857 -127406 -49018 -10255 -76790 -155600 -216850 -184972 -145557 -4415 37134 -26846
10201 -26846 -131589 -70830 22353 3808 -10745 26493 44646 -41052 -23126 -136337 -173464
10190 -173464 -101988 -5174 -36185 -44749 -22206 -1127 59783 39838 109621 14791 -48231 -140716
10178 -140716 -108004 -28675 -63087 -79848 -32182 10760 107321 70887 -16585 -71533 8571
10167 8571 33570 30893 -34430 -78546 -80412 -66454 -36714 12741 -40029 16514 -12610 -5721
10155 -5721 12397 9080 85002 145981 141326 155517 69794 34081 92384 90230 90391 24700 -3246
10142c246k661q5959N3199Q9051l8250j6707J2482O4453n3573o785L9497l8085
10130A3416K3979R2008L8727o6016n1505p2444n9791j6134L1805L7482Q980m2468
10118f1961N7153O0393J00222K1528Q786o9488j07944M5276N6807L7041K7649
10107A75462n2686j1881J6645J4667q4908l9272p5958O9258k7969o7257o3460
10096a47359K1373P5619Q7357J9568J1800P5794m3077n1506K5240N6001l6895
10085I3915m8754j5745L1972n0277j0419m875j2025n4377J8746L3198P941L1216
10073B0516P8295j8954q0416N4459J3637j02954M1125L2243l9301N4905k458p3502
10061b2405k317n6983J6871L3775j0896r9076M917K1130n7520L4819M2722K3383
$$ plain form
10142 -3246 -5907 -91866 -38667 50384 12134 -4573 7909 72362 18789 12004 51501 13416
10130 13416 37395 129403 168130 102114 50609 -21835 -81626 -97760 -65955 -28473 -19493 -61961
10118 -61961 -4808 55585 155807 177335 186121 116633 8689 53965 110772 147813 175462
10107 175462 122776 110895 127540 142207 57299 18027 -57931 11327 -16642 -83899 -147359
10096 -147359 -125986 -50367 36990 56558 68358 144152 101075 49569 74809 130810 93915
10085 93915 45161 29416 61388 11111 692 -4183 -16208 -70585 -51839 -18641 -10700 20516
10073 20516 98811 79857 -559 53900 67537 -35417 5708 37951 -1350 53555 51097 -22405
10061 -22405 -24722 -81705 -64834 -31059 -41955 -141031 -136114 -114984 -172504 -137685 -94963 -71580
10049g1580J0061O5836M777j027M437N4067K6095r3075o3749M4033J3094L0413
10037B3382k154j1392o0714n9957J4540M7537L4967O8390M2051J640j2126k9911
10025E6253k0363j27663N2377m3324k1812J7627N3897J10385N662J0659r6422
10014b724k8760n896L6142P9915R3964k9741J7271k7676r67J4354j20060o2245
10002c6423j883p1543k8342J5603J06653O0316K6272M8095l0891n6901M2138m5309
9990B7785p9518J8603l7212l3640J0434L9893Q259j1633K6214k2728r295n4877
9978a17715K8830O1803k4407Q3082K5397j01049p1443l7781J57926O0507M130
9967F9280l0896k5618L2001O325o3560O4793m5189M2372K1795p0589q7975p7181
$$ plain form
10049 -71580 -61519 4317 9094 8067 12504 66571 92666 -409 -64158 -20125 -7031 23382
10037 23382 21228 9836 -50878 -110835 -96295 -48758 -13791 54599 96650 98290 86164 56253
10025 56253 35890 -91773 -39396 -82720 -104532 -86905 -33008 77377 83039 93698 -2724
10014 -2724 -31484 -37380 -1238 78677 172641 142900 160171 132495 131528 145882 25822 -36423
10002 -36423 -38306 -109849 -138191 -122588 -15935 44381 70653 118748 87857 30956 73094 27785
9990 27785 -51733 -33130 -70342 -103982 -93548 -53655 -45396 -57029 -30815 -53543 -62838 -117715
9978 -117715 -88885 -27082 -51489 31593 56990 -44059 -115502 -153283 4643 65150 69280
9967 69280 38384 12766 44767 51092 -12468 52325 7136 49508 71303 714 -87261 -164442
9955a64442Q7963Q9499R0987p0331j13188k8895k2844r174Q7348o196M1449J07216
9943H9392J62q6563L6164O4756L1848k10959n2694r4968J5048P1870J56709N1999
9931G2764k0305r7023o2564Q4219M0759J0364M7613j9776m8604M5891n9517P776
9919A597J4231k6380l347L9387o8378l689Q5502K3929n6060k32o335J6088Q058
9906B4371P426l854N6606N8847J1201n1640r4571R787q7762j34970p850r972J46890
9893g5491N6678N3182R9448M7753M0910o2730q9822p9672j9915n9692J4511Q5122
9881A0282R0146K8156j8644P069N9625J6760q6974Q047K3409n4613o3893j9246
9869A24m4010k210L9480M3011m8220J8817m3188m8987l6504M3975M4974K16O5510
$$ plain form
9955 -164442 -76479 13020 104007 33676 -79512 -108407 -131251 -140425 -53077 -59273 -17824 89392
9943 89392 89554 2991 39155 103911 135759 -75200 -127894 -222862 -207814 -135944 20765 72764
9931 72764 52459 -44564 -107128 -22909 17850 28214 75827 56051 7447 53338 -6179 1597
9919 1597 15828 -10552 -13899 25488 -42890 -46579 38923 62852 6792 6560 225 16313 24371
9906 24371 31797 27943 84549 143396 154597 102957 8386 18173 -69589 -204559 -212409 -222381 -75491
9893 -75491 -18813 34369 133817 181570 222480 159750 69928 -9744 -29659 -89351 -74840 10282
9881 10282 100428 128584 109940 117009 176634 193394 106420 114467 137876 83263 19370 124
9869 124 -43886 -46096 -6616 36395 -11825 6992 -36196 -85183 -121687 -77712 -32738 -32522 32988
9856C2988K1636j0238q8934Q250R484l456P3529N913k9237k3856j09791k1462
9844a35174J16173M1064n5960m3578J0078Q9578M3492O4454J5749L7382N437q1219
9832A07476p9638r170k3702k1343n734J05227o7758k4726M1927K8560m3392j4254
9820f527N4648N3668L2279M3025j20050m1128K6401J6786k2543m4206J12296n2822
9808E1827r4387p0095J74L2628p7389L2118n3112N1224K0080N2961O6926J9805
9796C2760j7208k5407p9489M0230L5793k6396J9228O3334K0341L9701l2041m8672
9784B2174r3728n1231J13817j5278p7785N4J5967l2010N7047K1486L0796P5862
9772F7171P4265K180p3550n6114N7190N4446o9275L868L4624R3104p3089p8529
$$ plain form
9856 32988 54624 44386 -44548 -36298 -26814 -30270 43259 49172 19935 -3921 -113712 -135174
9844 -135174 -19001 22063 -33897 -77475 -67397 22181 65673 130127 145876 183258 188695 107476
9832 107476 27838 18668 -5034 -26377 -32111 73116 5358 -19368 22559 51119 7727 -6527
9820 -6527 48121 101789 134068 177093 57043 15915 42316 59102 36559 -7647 104649 51827
9808 51827 -42560 -112655 -112481 -79853 -157242 -125124 -178236 -127012 -106932 -53971 12955 32760
9796 32760 15552 -9855 -89344 -49114 -13321 -39717 -20489 42845 63186 102887 70846 22174
9784 22174 -71554 -122785 -8968 -24246 -102031 -101977 -86010 -118020 -60973 -39487 -8691 67171
9772 67171 141436 143616 70066 13952 71142 125588 56313 60181 94805 187909 114820 36291
9760C6291j4259k7889L1150J06318L5116q6741j16524p8073p5549m9703M9937
9749a89926L2111O1381J45592J130j0933j4407J2795O3730O533m9396j10335K037
9737d9688m6996o2288j3972j00485Q4321Q0439k6624p1529Q3468M5563Q9405n66
9725A1048j0637m4393N2964N5885L5687j12330R934K7851q9695k533L4256k9907
9713f1870O2419K9391n9223q3712K1355J94497Q7798J5863j9435m2676l8892j5296
9701I0219l0881j3416l1498r662O3277n1094n7852p7061J1834n6476k6891O1M2699
9688a46741N1391m6151p4740K9555O0162J42137q2823J7005l5034n2293M9442
9677h8090J14747j18065q6680O8508O0266m8535k160P6315Q762j6813P2064L8445
$$ plain form
9760 36291 22032 -5857 25293 131611 166727 79986 -36538 -114611 -190160 -239863 -189926
9749 -189926 -157815 -96434 49158 50288 39355 24948 37743 101473 108006 58610 -51725 -49688
9737 -49688 -96684 -158972 -172944 -273429 -189108 -108669 -135293 -206822 -123354 -77791 11614 11048
9725 11048 411 -43982 8982 64867 100554 -11776 -1842 26009 -63686 -66219 -31963 -61870
9713 -61870 549 29940 -29283 -112995 -91640 102857 190655 206518 187083 144407 105515 90219
9701 90219 59338 45922 14424 4762 68039 16945 -40907 -117968 -106134 -162610 -189501 -189440 -146741
9688 -146741 -95350 -141501 -216241 -186686 -126524 15613 -67210 -50205 -85239 -137532 -88090
9677 -88090 26657 -91408 -178088 -109580 -49314 -97849 -100009 -23694 -14932 -31745 40319 78764
9665G8764j6316k7632j7601N4133j08500o6144n2719P728N6026M8648Q219m7888
9653h3282N0449J09204m6108J6810K7191J8366l7930l8042P899j0666J0142o6255
9641d2222j8194j2680M1098k7551L7252Q3252K3723K3465j02525p5648L6983o2
9629c3109j1040N9544M9177k0100M780M4653k3914p5107o4527J8630k7073o5498
9617a43584p1939l74M1492J5879k097M2044J54252q131l3113M701j319p0574j2288
9604h5051p0440K3377J20306O2506n1073r3301j17092M141J12717k302J9757K1186
9592e5269m97P2310k3728L779P8226J7682J1010p4381l0858O2591k0937Q4226
9580A24154j9022j11044J0116O3459M8840q3848l112l4347P7234n473n526J2786
$$ plain form
9665 78764 62448 34816 17215 71348 -37152 -103296 -156015 -148287 -92261 -43613 -35394 -83282
9653 -83282 -32833 76371 30263 47073 74264 92630 54700 16658 24557 13891 24033 -42222
9641 -42222 -60416 -73096 -31998 -59549 -22297 60955 84678 108143 5618 -70030 -33047 -33109
9629 -33109 -44149 15395 64572 44472 49252 93905 69991 -5116 -69643 -51013 -78086 -143584
9617 -143584 -215523 -215897 -174405 -158526 -160623 -118579 35673 27542 -5571 -870 -2189 -72763 -85051
9604 -85051 -155491 -132114 -11808 50698 -375 -93676 -210768 -206627 -93910 -96212 -76455 -55269
9592 -55269 -55766 16544 -7184 -3405 74821 92503 103513 29132 -1726 60865 39928 124154
9580 124154 105132 -5912 4204 67663 116503 32655 29543 -4804 72430 66957 61431 74217
9568G4217j8320k4116M0057Q3754n6070p9845N3404j9563l5171o7235L894j4538
9556e9532o2687J2775J16669P9376L5527J8933j01674j02401O7454R1939l4491
9545F1888l7080Q3115n299J762l6492n2838l306K1210J12499P2919q5276j71070
9533c7968j0899l6138J08894K6072j1491J15454j14871j25113k0751r2602Q9607
9522a09806J29435N725k3380k9582k060R6103J03400k7726k7914k7254r1272j22713
9510a27044M9755Q8335j6949M911j5948k3941J1890N3094k9396q9608k2322K9910
9498h7313P6422L4621O4043L4528n639j3884K9426n6780q4185j995N2606L0377
9486G2227M4M4983l9874J1517O352p1313m2445P44j21830m2819N8191M4853P5728
$$ plain form
9568 74217 55897 31781 71838 155592 99522 19677 73081 53518 18347 -48888 -44994 -59532
9556 -59532 -122219 -109444 7225 86601 122128 141061 39387 -63014 4440 96379 61888
9545 61888 24808 107923 102624 104386 67894 15056 11750 32960 145459 218378 133102 -37968
9533 -37968 -48867 -85005 23889 49961 38470 153924 39053 -86060 -106811 -199413 -109806
9522 -109806 19629 25354 1974 -27608 -29668 66435 169835 142109 114195 86941 -4331 -127044
9510 -127044 -77289 11046 -5903 -992 -16940 -40881 -28991 24103 -5293 -94901 -117223 -87313
9498 -87313 -10891 23730 87773 122301 116662 102778 132204 75424 -8761 -10756 41850 72227
9486 72227 72271 117254 77380 88897 95249 23936 -18509 -17765 -139595 -182414 -124223 -79370 -3642
9473c642Q9226j8701p4651N0700l1573m6165m0984J9315L3832k6006P8849l2322
9461b122K7264M6781o1202P488L3540k0218L5624N51k305l1239j5256n5510o9213
9448a05817N6109N8308l8829o9218P6280J14804L0346l5444m6610L6880n6544
9437B0265o0421j5022J5963K8954R510l5347n8355M489J06257r483K4738j2662
9425A8886n9830O8451k0945j78169L9352O8537J12511n4275m0191m319O7699k920
9413A4787M4040j1452o3901P534o0334n4154J6711K7272P1120R0299K7886K8110
9401A37918q355M2088R4432J1458j86749q6660k5055l6050Q9199P991j03070q4891
9389a47744M7237Q4338J07435N3959l3697N8992O066j4158l7043q9764r5098N7028
$$ plain form
9473 -3642 85584 66883 -7768 42932 11359 -34806 -75790 -56475 -22643 -48649 30200 -2122
9461 -2122 25142 71923 10721 18209 51749 31531 67155 67706 65401 34162 18906 -36604 -105817
9448 -105817 -49708 8600 -30229 -99447 -23167 91637 121983 86539 39929 76809 20265
9437 20265 -40156 -55178 -39215 -10261 -751 -36098 -94453 -89964 16293 6810 31548 18886
9425 18886 -40944 27507 6562 -171607 -132255 -63718 48793 -5482 -45673 -49992 17707 14787
9413 14787 58827 47375 -16526 -8992 -69326 -123480 -106769 -79497 -8377 81922 109808 137918
9401 137918 129563 171651 266083 277541 90792 4132 -20923 -56973 32226 40217 -62853 -147744
9389 -147744 -100507 -16169 91266 145225 111528 170520 176586 162428 125385 35621 -59477 -2449
9377b449Q7960R745K842J00976p0188O0958k450j08455n8501K537M5946L4434
9365A03355M0771K2016K7438L0214M3817l4970q2275l4226l0399k5868n1290J6621
9353B5204r225M4166p9354M6230P8321Q6436L4311r6744K3505o7019m7000N2030
9341I0861p649M644m2186J05827o1520p2134J06487R374k3564k5377o3498k5556
9329d291l971L938R237O198r1418O1257J26240m613O0198k6240J7708l5222r1362
9316B7659Q1914K6021Q6350K8657j14328o6238N2832j16563r3925J08043J2100
9305C2522L8098N5386L184K4997j6327O135l8006L0691l422K351l7230q2604p8660
9292f2885M2394M6794n958L4252R5885j35468k3377L3109k583K3893q0209l9632
$$ plain form
9377 -2449 85511 95256 98098 199074 128886 189844 187394 78939 20438 22975 68921 103355
9365 103355 144126 166142 193580 223794 267611 232641 150366 116140 85741 59873 8583 25204
9353 25204 15979 60145 -19209 27021 105342 191778 226089 129345 152850 85831 38831 90861
9341 90861 83212 87856 45670 151497 89977 17843 124330 133704 110140 84763 21265 -4291
9329 -4291 -8262 -4324 4913 11111 -80307 -19050 107190 102577 162775 136535 154243 119021 27659
9316 27659 109573 135594 221944 250601 136273 70035 122867 6304 -87621 20422 32522
9305 32522 70620 126006 129190 154187 137860 143995 105989 136680 133258 135609 98379 15775 -62885
9292 -62885 -20491 26303 20345 54597 150482 15014 -8363 24746 22163 46056 -34153 -73785
9280g3785Q2707M1241O7548P3549r27j28300l8972n4075n6832J11600J57824M4722
9268B26300k8430j8407K4552j07451p796l3721R7208N47j14131N5257o9727l136
9256B1065J4439Q4928m2835j7149J08831K9637l0602j08858M0699L0949m7295
9245H3809l0966K9800K7976O7328R579l4388k983O6739N1831m8649O7347J10322
9233C97745k6114j66883q0552Q4508M7608K6166r361m6272n3404n3674l5752o2150
9221B1865L7129L2288L4091J3476o5977P754R7281J06768L9676L2597J0678r4740
9209B72886p0965L0324O9742N5004N6150n783l6787n741j3792k4986L5232J24179
$$ plain form
9280 -73785 8922 50163 117711 191260 190333 62033 23061 -31014 -87846 23754 181578 226300
9268 226300 197870 179463 204015 96564 88768 55047 152255 152802 38671 93928 24201 21065
9256 21065 35504 120432 77597 60448 169279 198916 168314 59456 100155 131104 83809
9245 83809 52843 82643 110619 177947 187526 153138 150155 216894 268725 220076 287423 397745
9233 397745 371631 204748 124196 208704 256312 282478 273117 226845 173441 119767 84015 21865
9221 21865 58994 91282 125373 138849 72872 80626 177907 284675 324351 356948 367626 272886
9209 272886 201921 232245 301987 356991 413141 407358 370571 364830 351038 326052 361284 485463
$$ [...]
##END NTUPLES=NMR SPECTRUM
##END=
