##TITLE=Analysis number 323591
Compound Code cc 63608
Book Reference 439/197/38
Project Code adrs
Chemist Name ronp
##JCAMPDX= 6.0         $$ Bruker NMR JCAMP-DX V2.0
##DATA TYPE= NMR SPECTRUM
##DATA CLASS= NTUPLES
##ORIGIN= Bruker BioSpin GmbH
##OWNER= nmr
$$ XWIN-NMR		Version 3.5
$$ Mon Oct 30 11:26:45 2006 GMT Standard Time (UT+0h)  MAYBRIDGE\nmr@NMR_250MHZ
##.OBSERVE FREQUENCY= 250.131544655141
##.OBSERVE NUCLEUS= ^1H
##.ACQUISITION MODE= SIMULTANEOUS (DQD)
##.ACQUISITION SCHEME= undefined
##.AVERAGES= 16
##.DIGITISER RES= 18
##SPECTROMETER/DATA SYSTEM= dpx250
##.PULSE SEQUENCE= zg30
##.SOLVENT NAME= CDCl3
##.SHIFT REFERENCE= (INTERNAL, CDCl3, 0, 16.522)
##AUDIT TRAIL= $$ (NUMBER, WHEN, WHO, WHERE, WHAT)
$$ ##TITLE= Audit trail, XWIN-NMR		Version 3.5
$$ ##JCAMPDX= 5.01
$$ ##ORIGIN= Bruker BioSpin GmbH
$$ ##OWNER= nmr
$$ C:\u/data/dgb/nmr/ADRS/1910/pdata/1/auditp.txt
$$ ##AUDIT TRAIL=  $$ (NUMBER, WHEN, WHO, WHERE, WHAT)
(   1,<2006-10-30 11:26:04.61 +000>,<MAYBRIDGE\nmr>,<NMR_250MHZ>,
      <created by zg, POWCHK disabled, PULCHK disabled
       configuration hash MD5:
       49 4B E0 1D 92 C2 6B 37 9F E6 65 BC 52 41 86 1D
       data hash MD5: 64K
       19 40 C3 FC 73 FF AA 77 C7 DD 1E 61 16 96 69 CE>)
(   2,<2006-10-30 11:26:31.95 +000>,<MAYBRIDGE\nmr>,<NMR_250MHZ>,
      <Start of raw data processing
       ef LB = 0.3 FT_mod = 6 PKNL = 1 SI = 32K 
       data hash MD5: 32K
       37 07 34 8D 08 55 90 22 CA 43 90 84 4A 9C 9A 0A>)
(   3,<2006-10-30 11:26:36.37 +000>,<MAYBRIDGE\nmr>,<NMR_250MHZ>,
      <apk 
       data hash MD5: 32K
       AA 9F 16 0B F0 6A E3 C2 F0 48 83 29 47 70 BD 41>)
(   4,<2006-10-30 11:26:37.81 +000>,<MAYBRIDGE\nmr>,<NMR_250MHZ>,
      <abs ABSG = 5 
       data hash MD5: 32K
       44 C0 D3 97 F5 26 1B F0 14 16 DA 8E BE B5 89 58>)
$$ ##END=
$$ 
$$ hash MD5
$$ D3 59 F4 1F 83 08 16 38 E2 72 26 8F D5 53 BA DB
##$RELAX= 
##$RELAX= 
##$RELAX= 
##$RELAX= 
##$RELAX= 
##$RELAX= 
##$RELAX= 
$$ Bruker specific parameters
$$ --------------------------
##$DU= <C:\u>
##$EXPNO= 1910
##$NAME= <ADRS>
##$PROCNO= 1
##$TYPE= <nmr>
##$USER= <dgb>
##$AMP= (0..31)
100 100 100 100 100 100 100 100 100 100 100 100 100 100 100 100 100 100 
100 100 100 100 100 100 100 100 100 100 100 100 100 100 
##$AQSEQ= 0
##$AQ_mod= 3
##$AUNM= <au_zg>
##$AUTOPOS= <7 >
##$BF1= 250.13
##$BF2= 250.13
##$BF3= 250.13
##$BF4= 250.13
##$BF5= 500.13
##$BF6= 500.13
##$BF7= 500.13
##$BF8= 500.13
##$BYTORDA= 1
##$CFDGTYP= 0
##$CFRGTYP= 5
##$CHEMSTR= <none>
##$CNST= (0..31)
1 1 145 1 1 1 1 1 1 1 1 1 1 1 1 1 1 1 1 1 1 1 1 1 1 1 1 1 1 1 1 1 
##$CPDPRG= <>
##$CPDPRG1= <>
##$CPDPRG2= <>
##$CPDPRG3= <>
##$CPDPRG4= <mlev>
##$CPDPRG5= <mlev>
##$CPDPRG6= <mlev>
##$CPDPRG7= <mlev>
##$CPDPRG8= <mlev>
##$CPDPRGB= <>
##$CPDPRGT= <>
##$D= (0..31)
0 1 0 0 0 0 0 0 0 0.06 0 0 0 0 0 0 0.0002 0 0 0 0 0 0 0 0 0 0 0 0 0 0 
0 
##$DATE= 1162207561
##$DBL= (0..7)
120 120 120 120 120 120 120 120 
##$DBP= (0..7)
150 150 150 150 150 150 150 150 
##$DBP07= 0
##$DBPNAM0= <>
##$DBPNAM1= <>
$$ [...]
##$SUBNAM7= <"">
##$SUBNAM8= <"">
##$SUBNAM9= <"">
##$SW= 20.6930455092707
##$SWIBOX= (0..15)
0 0 3 0 0 0 0 0 0 0 0 0 0 0 0 0 
##$SW_h= 5175.983436853
##$TD= 65536
##$TD0= 1
##$TE= 683.16
##$TE2= 300
##$TE3= 300
##$TEG= 300
##$TL= (0..7)
0 120 120 120 120 120 120 120 
##$TP= (0..7)
150 150 150 150 150 150 150 150 
##$TP07= 0
##$TPNAME0= <>
##$TPNAME1= <>
##$TPNAME2= <>
##$TPNAME3= <>
##$TPNAME4= <>
##$TPNAME5= <>
##$TPNAME6= <>
##$TPNAME7= <>
##$TPOAL= (0..7)
0.5 0.5 0.5 0.5 0.5 0.5 0.5 0.5 
##$TPOFFS= (0..7)
0 0 0 0 0 0 0 0 
##$TUNHIN= 0
##$TUNHOUT= 0
##$TUNXOUT= 0
##$USERA1= <user>
##$USERA2= <user>
##$USERA3= <user>
##$USERA4= <user>
##$USERA5= <user>
##$V9= 5
##$VALIST= <valist>
##$VCLIST= <CCCCCCCCCCCCCCC>
##$VD= 0
##$VDLIST= <DDDDDDDDDDDDDDD>
##$VPLIST= <PPPPPPPPPPPPPPP>
##$VTLIST= <TTTTTTTTTTTTTTT>
##$WBST= 1024
##$WBSW= 4
##$XGAIN= (0..3)
0 0 0 0 
##$XL= 0
##$YL= 0
##$YMAX_a= 643091
##$YMIN_a= -415692
##$ZGOPTNS= <>
##$ZL1= 120
##$ZL2= 120
##$ZL3= 120
##$ZL4= 120
##$ABSF1= 16.522
##$ABSF2= -4.171173
##$ABSG= 5
##$ABSL= 3
##$ALPHA= 0
##$AQORDER= 0
##$ASSFAC= 0
##$ASSFACI= 0
##$ASSFACX= 0
##$ASSWID= 0
##$AUNMP= <proc_1d>
##$AZFE= 0.1
##$AZFW= 0.1
##$BCFW= 0
##$BC_mod= 0
##$BYTORDP= 0
##$COROFFS= 0
##$CY= 12.5
##$DATMOD= 1
##$DC= 0
##$DFILT= <>
##$DTYPP= 0
##$F1P= 14.0000005364418
##$F2P= -0.99999901652339
##$FCOR= 0.5
##$FTSIZE= 32768
##$FT_mod= 6
##$GAMMA= 0
##$GB= 0
##$INTBC= 1
##$INTSCL= 1
##$ISEN= 128
##$LB= 0.3
##$LEV0= 0
##$LPBIN= 0
##$MAXI= 10000
##$MC2= 0
##$MEAN= 0
##$ME_mod= 0
##$MI= 0
##$NCOEF= 0
##$NC_proc= -4
##$NLEV= 6
##$NOISF1= 0
##$NOISF2= 0
##$NSP= 0
##$NTH_PI= 0
##$NZP= 0
##$OFFSET= 16.522
##$PC= 1
##$PHC0= -50.3292
##$PHC1= 3.373669
##$PH_mod= 1
##$PKNL= yes
##$PPARMOD= 0
##$PSCAL= 4
##$PSIGN= 0
##$REVERSE= no
##$SF= 250.13
##$SI= 32768
##$SIGF1= 0
##$SIGF2= 0
##$SINO= 400
##$SIOLD= 32768
##$SREGLST= <1H.CDCl3>
##$SSB= 0
##$STSI= 32768
##$STSR= 0
##$SW_p= 5175.98343685301
##$SYMM= 0
##$S_DEV= 0
##$TDeff= 65536
##$TDoff= 0
##$TI= <Analysis number 999999
Compound Code 99
Book Reference 9
Project Code 9>
##$TILT= no
##$TM1= 0
##$TM2= 0
##$TOPLEV= 0
##$USERP1= <user>
##$USERP2= <user>
##$USERP3= <user>
##$USERP4= <user>
##$USERP5= <user>
##$WDW= 1
##$XDIM= 32768
##$YMAX_p= 438846012
##$YMIN_p= -216013
$$ End of Bruker specific parameters
$$ ---------------------------------
##NTUPLES= NMR SPECTRUM
##VAR_NAME=  FREQUENCY,     SPECTRUM/REAL,   SPECTRUM/IMAG
##SYMBOL=    X,             R,               I
##VAR_TYPE=  INDEPENDENT,   DEPENDENT,       DEPENDENT
##VAR_FORM=  AFFN,          ASDF,            ASDF
##VAR_DIM=   32768,         32768,           32768
##UNITS=     HZ,            ARBITRARY UNITS, ARBITRARY UNITS
##FACTOR=    0.157963299565203, 1,           1
##FIRST=     4132.6476996994, 0,             0
##LAST=      -1043.33573715361, 0,           0
##MIN=       -1043.33573715361, -216013,     0
##MAX=       4132.6476996994, 438846012,     0
$$ Real data points
##PAGE= N=1
##DATA TABLE= (X++(R..R)), XYDATA
$$ [...]
$$ plain form
19192 -68 40216 65032 62807 22213 16080 23512 19947 16274 6468 21309 72288 103362 85548
19179 85548 58874 46641 27133 18991 45263 -5767 -11928 16221 33422 390 -44968 45296
19167 45296 75099 88564 77869 62163 107009 162311 164322 158125 158137 128905 137631 119482 144682
19154 144682 154854 136695 112361 95629 92685 125127 104461 84580 65594 37721 44815 73966
19142 73966 158513 133395 73852 6261 15924 34070 41463 36570 -19761 -68137 -35441 10483
19130 10483 33230 73282 101028 59768 54497 -21956 -15134 19872 67171 72615 83577 81240
19118 81240 75574 66966 96273 124949 130672 127217 118678 106916 50628 61603 38025 17004 6263
19105 6263 -22005 -24331 15345 40083 36178 45549 75447 65476 59241 91966 96752 76850 65860
$$ packed form
19192f8M0284K4816k225m0594o133P432l565l673r806J4841N0979L1074j7814
19179H5548k6674j2233j9508q142K6272n1030o161K8149J7201l3032m5358R0264
19167D5296K9803J3465j0695j5706M4846N5302K011o197J2k9232Q726j8149K5200
19154A44682J0172j8159k4334j6732k944L2442k0666j9881j8986k7873P094K9151
19142G3966Q4547k5118n9543o7591R663J8146P393m893n6331m8376L2696M5924
19130A0483K2747M0052K7746m1260n271p6453O822L5006M7299N444J0962k337
19118H1240n666q608K9307K8676N723l455q539j1762n6288J0975k3578k1021j0741
19105F263k8268k326L9676K4738l905R371K9898r971o235L2725M786j9902j0990
$$ plain form
19092 65860 60915 53719 -5950 55852 94667 104904 95923 73880 7744 -28740 21996 73907
19080 73907 81150 73863 82678 98908 94368 114924 136247 92305 68107 46002 22962 17942 50807
19067 50807 110838 116110 115595 109648 106858 99503 101440 129008 134080 111005 100321 51523 100075
19054 100075 125148 88401 77882 81708 84942 55178 102159 85853 70486 63217 75342 71333
19042 71333 59815 52160 60389 47174 758 64272 80660 66203 80223 76310 48038 51799
19030 51799 46942 26854 74466 46794 25155 69315 90246 100458 104419 96046 92346 81923
19018 81923 87405 109864 98583 138372 126725 101029 111122 95623 87016 123488 129408 119445
19006 119445 72583 58526 78472 98033 144495 168905 126315 118710 157967 194192 147020 118963
$$ packed form
19092F5860m945p196n9669O1802L8815J0237q981k2043o6136l6484N0736N1911
19080G3907P243p287Q815J6230m540K0556K1323m3942k4198k2105k3040n020L2865
19067E0807O0031N272n15n947k790p355J937K7568N072k3075j0684m8798M8552
19054A00075K5073l6747j0519L826L234k9764M6981j6306j5367p269J2125m009
19042G1333j1518p655Q229j3215m6416O3514J6388j4457J4020l913k8272L761
19030E1799m857k0088M7612k7672k1639M4160K0931J0212L961q373l700j0423
19018H1923N482K2459j1281L9789j1647k5696J0093j5499q607L6472N920r963
19006A19445m6862j4057J9946J9561M6462K4410m2590p605L9257L6225m7172k8057
$$ plain form
18994 118963 150853 133249 120273 121670 118624 112361 94960 110358 96860 121580 165219 169589
18982 169589 176618 198726 235179 243098 259969 306566 339011 356413 375199 397783 407353 425462
18970 425462 452488 505526 486079 500352 605046 681966 627347 582995 573085 591177 609551
18959 609551 573052 556231 533373 501617 508500 483123 466137 527140 527446 487890 466798 403045
18947 403045 315251 327240 330330 287170 295128 268495 243543 250276 207863 185877 228166 210908
18935 210908 165931 137082 147519 140252 86594 132462 173959 183626 191523 160390 133076 110013
18923 110013 86885 82684 105412 173416 232818 207781 126883 108096 107708 144579 101906 83729
18911 83729 104099 99479 142130 141286 120508 128526 148408 127613 153795 156972 136587 111608 115013
$$ packed form
18994A18963L1890j7604j2976J397l046o263j7401J5398j3498K4720M3639M370
18982A69589P029K2108L6453P919J6871M6597L2445J7402J8786K2584R570J8109
18970D25462K7026N3038j9447J4273J04694P6920n4619m4352r910J8092J8374
18959F09551l6499j6821k2858l1756O883k5377j6986O1003L06l9556k1092o3753
18947D03045q7794J1989L090m3160P958k6633k4952O733m2413k1986M2289j7258
18935B10908m4977k8849J0437p267n3658M5868M1497R667P897l1133k7314k3063
18923A10013k3128m201K2728O8004N9402k5037q0898j8787l88L6871m2673j8177
18911H3729K0370m620M2651q44k0778Q018J9882k0795K6182L177k0385k4979L405
$$ plain form
18898 115013 101751 88870 58122 52881 118101 178908 190738 120985 95351 110509 100966 94460
18886 94460 135223 139776 100411 82308 130863 172315 218584 212497 187116 166709 128529 147994
18874 147994 173479 163397 187314 201539 203752 205495 211840 207089 207518 213197 253205 241713 226994
18861 226994 156745 144540 183269 183808 235166 274186 304133 307641 333194 419329 487974 485332
18849 485332 513871 487705 453236 446405 469928 425859 367184 376428 430435 451388 425944 376779
18837 376779 340602 343817 349877 362372 381973 377720 380558 396708 432289 454069 468165 455490
18825 455490 441311 394119 430141 445554 426451 432793 468037 523278 566490 604254 598646 596822
18813 596822 599687 608430 628621 667255 761494 851283 950299 996778 1038695 1097090 1179112 1251727
$$ packed form
18898A15013j3262j2881l0748n241O5220O0807J1830o9753k5634J5158r543o506
18886I4460M0763M553l9365j8103M8555M1452M6269o087k5381k0407l8180J9465
18874A47994K5485j0082K3917J4225K213J743O345m751M29N679M0008j1492j4719
18861B26994p0249j2205L8729N39N1358L9020K9947L508K5553Q6135O8645k642
18849D85332K8539k6166l4469o831K3523m4069n8675R244N4007K0953k5444m9165
18837C76779l6177L215O060J2495J9601m253K838J6150L5581K1780J4096j2675
18825D55490j4179m7192L6022J5413j9103O342L5244N5241M3212L7764n608j824
18813E96822K865Q743K0191L8634R4239Q9789R9016M6479M1917N8395Q2022P2615
$$ plain form
18801 1251727 1311236 1355850 1308435 1223234 1169738 1076135 976967 911677 825592 739774 746492
18790 746492 740776 626661 563005 570587 619130 650173 604819 592457 613977 585551 612095 636135
18778 636135 682830 718025 668610 650715 629541 587886 544913 559546 624562 751518 824451
18767 824451 794212 736708 682850 663753 669253 622109 620027 627231 608826 663395 715727 750744
18755 750744 788421 860852 900986 915088 946693 942843 877595 843796 822200 797522 781966 780655
18743 780655 769578 781569 776183 718569 628399 572596 540506 511546 530880 557873 521363 509008
18731 509008 484464 539239 561727 505180 482953 475974 449427 475404 483132 442118 443849 498914
18719 498914 488144 463529 498700 531641 543795 590751 648151 637645 578356 573898 648423 717042
$$ packed form
18801A251727N9509M4614m7415q5201n3496r3603r9168o5290q6085q5818O718
18790G46492n716j14115o3656P582M8543L1043m5354j2362K1520k8426K6544K4040
18778F36135M6695L5195m9415j7895k1174m1655m2973J4633O5016J26956P2933
18767H24451l0239n7504n3858j9097N500m7144k082P204j8405N4569N2332L5017
18755G50744L7677P2431M0134J4102L1605l850o5248l3799k1596k4678j5556j311
18743G80655j1077J1991n386n7614r0170n5803l2090k8960J9334K6993l6510j2355
18731E09008k4544N4775K2488n6547k2227o979k6547K5977P728m1014J731N5065
18719D98914j0770k4615L5171L2941J2154M6956N7400j0506n9289m458P4525O8619
$$ plain form
18707 717042 769177 767291 763138 729379 755336 777765 798575 756215 743178 714007 753678 785573
18695 785573 825870 849157 813595 798497 763918 730525 689926 671065 701936 744229 793299
18684 793299 760529 735553 722242 667624 594580 591366 590557 557913 538946 544893 554890 533471
18672 533471 488466 443291 454446 466783 407467 385855 431605 498174 583348 584708 473770
18661 473770 459001 453191 503564 528868 556525 588953 584035 565069 628770 687113 751366 738677
18649 738677 711690 665792 604766 596280 587979 555438 590279 689099 765292 726016 715112 700884
18637 700884 631065 566330 513125 469313 507104 510718 512677 534607 525938 487533 481923 507669
18625 507669 493754 455505 449684 425500 475391 517270 530466 502128 477899 503940 514135 529176
$$ packed form
18707G17042N2135j886m153l3759K5957K2429K0810m2360j3037k9171L9671L1895
18695G85573M0297K3287l5562j5098l4579l3393m0599j8861L0871M2293M9070
18684G93299l2770k4976j3311n4618p3044l214q09l2644j8967N947R997k1419
18672E33471m5005m5175J1155J2337n9316k1612M5750O6569Q5174J360j10938
18661D73770j4769n810N0373K5304K7657L2428m918j8966O3701N8343O4253j2689
18649G38677k6987m5898o1026q486q301l2541L4841R8820P6193l9276j0904j4228
18637G00884o9819o4735n3205m3812L7791L614J959K1930q669l8405n610K5746
18625E07669j3915l8249n821k4184M9891M1879J3196k8338k4229K6041J0195J5041
$$ plain form
18613 529176 560119 568719 561390 552198 554267 575027 603894 594250 533442 488582 461132 460066 415840
18600 415840 394270 379388 338442 336364 353590 383331 380727 342652 321342 314694 327928 343146
18588 343146 363052 418275 448796 464720 496678 514144 520144 535619 516386 501004 517168 535097
18576 535097 546850 563830 586356 600191 606507 612114 613815 618158 564441 540543 529388 514815
18564 514815 547540 608221 602448 614567 664427 652054 673116 746706 835391 885510 950267 973844
18552 973844 1046398 1143706 1143475 1116662 1089305 1103340 1152041 1169337 1153589 1136063 1178903 1228719
18540 1228719 1211967 1208598 1194273 1171329 1130693 1080479 1064311 1084459 1114724 1132169 1141045 1204459
18528 1204459 1245267 1303164 1322620 1285391 1324416 1390386 1433133 1541477 1615933 1686736 1759384
$$ packed form
18613E29176L0943Q600p329r192K069K0760K8867r644o0808m4860k7450j066m4226
18600D15840k1570j4882m0946k078J7226K9741k604l8075k1310o648J3234J5218
18588C43146J9906N5223L0521J5924L1958J7466O000J5475j9233j5382J6164J7929
18576E35097J1753J6980K2526J3835O316N607J701M343n3717k3898j1155j4573
18564E14815L2725O0681n773J2119M9860j2373K1062P3590Q8685N0119O4757K3577
18552I73844P2554R7308k31k6813k7357J4035M8701J7296j5748j7526M2840M9816
18540A228719j6752l369j4325k2944m0636n0214j6168K0148L0265J7445Q876O3414
18528A204459M0808N7897J9456l7229L9025O5970M2747J08344P4456P0803P2648
$$ plain form
18517 1759384 1825887 1848962 1897362 1961583 2003411 2072667 2155647 2230959 2375788 2537639 2654979
18506 2654979 2783960 2959299 3177106 3408010 3674722 3939794 4178121 4462517 4787775
18497 4787775 5155478 5623565 6178315 6776886 7446424 8242783 9233521 10454349 11953417
18488 11953417 13869106 16137760 18823976 21896374 25322840 29065388 33119136 37498288
18480 37498288 42046153 46775398 51644616 56676513 61858293 66957602 71792783 76318964
18472 76318964 80425895 83919272 86967051 89490518 91513421 93138730 94279893 94911218
18464 94911218 94886660 94054221 92324202 89653021 86067488 81851992 77071465 72024142
18456 72024142 66897574 61795478 56740369 51689551 46785385 41960786 37371064 33018724
$$ packed form
18517A759384O6503K3075M8400O4221M1828O9256Q2980P5312J44829J61851J17340
18506B654979J28981J75339K17807K30904K66712K65072K38327K84396L25258
18497D787775L67703M68087N54750N98571O69538P96359R90738J220828J499068
18488A1953417J915689K268654K686216L072398L426466L742548M053748M379152
18480C7498288M547865M729245M869218N031897N181780N099309M835181M526181
18472G6318964M106931L493377L047779K523467K022903J625309J141163O31325
18464I4911218k4558q32439j730019k671181l585533m215496m780527n047323
18456G2024142n126568n102096n055109n050818m904166m824599m589722m352340
$$ plain form
18448 33018724 29029475 25403004 22213869 19548562 17354608 15543334 14028116 12764120
18440 12764120 11750124 10927594 10189929 9504958 8868002 8295196 7819129 7423079 7062652
18431 7062652 6690478 6337811 6065842 5806760 5559417 5326770 5138384 5000073 4886356
18422 4886356 4750337 4568261 4389313 4194335 4033688 3960320 3880843 3743432 3621011 3523109
18412 3523109 3428464 3328701 3235243 3204803 3171247 3106745 3064716 3041904 3047631 3067203 3069120 3031250
18400 3031250 3038481 3028010 3029275 3010008 3005294 3015429 3031367 3015845 3070922 3094995 3118520 3158753
18388 3158753 3182050 3225552 3265677 3276511 3266996 3298542 3300834 3295815 3287050 3253413 3234800 3217460
18376 3217460 3317204 3352953 3407274 3483650 3528770 3594542 3649483 3644354 3618959 3635525 3682083
$$ packed form
18448C3018724l989249l626471l189135k665307k193954j811274j515218j263996
18440A2764120j013996q22530p37665o84971o36956n72806m76067l96050l60427
18431G062652l72174l52667k71969k59082k47343k32647j88386j38311j13717
18422D886356j36019j82076j78948j94978j60647p3368p9477j37411j22421r7902
18412C523109r4645r9763r3458l0440l3556o4502m2029k2812N727J9572J917l7870
18400C031250P231j0471J265j9267m714J0135J5938j5522N5077K4073K3525M0233
18388C158753K3297M3502M0125J0834r515L1546K292n019q765l3637j8613j7340
18376C217460R9744L5749N4321P6376M5120O5772N4941n129k5395J6566M6558
$$ plain form
18365 3682083 3726099 3730298 3758500 3842982 3876999 3888259 3883609 3908675 3969897 4040820 4122611 4190871
18353 4190871 4323154 4489423 4647996 4771980 4959844 5198730 5408461 5641436 5952502
18344 5952502 6332241 6756445 7319025 7976253 8778043 9731155 10749418 11793056 12788168
18335 12788168 13804515 14998567 16441524 18008294 19545301 20841228 21722377 22183697
18327 22183697 22292110 22192012 22086987 22066684 22351499 22921707 23708872 24681756 25681980
18318 25681980 26616557 27482462 28218075 28954957 29802773 30905400 32517538 34794098 37873249
18309 37873249 41924088 47117782 53758328 62092162 72681323 86429439 104242814 126720926
18301 126720926 154269338 187017212 224529349 265320749 305295438 337863537 357513119
$$ packed form
18365C682083M4016M199K8202Q4482L4017J1260m650K5066O1222P0923Q1791O8260
18353D190871J32283J66269J58573J23984J87864K38886K09731K32975L11066
18344E952502L79739M24204N62580O57228Q01790R53112J018263J043638R95112
18335A2788168J016347J194052J442957J566770J537007J295927Q81149M61320
18327B2183697J08413j00098j05025k0303K84815N70208P87165R72884J000224
18318B5681980R34577Q65905P35613P36882Q47816J102627J612138K276560L079151
18309C7873249M050839N193694O640546Q333834J0589161J3748116J7813375K2478112
18301A26720926K7548412L2747874L7512137M0791400L9974689L2568099J9649582
$$ plain form
18294 357513119 362607876 357002238 348828475 344799508 345841707 347192425 342440545 327340078
18286 327340078 302262635 270968001 238029807 206684337 177869554 151856447 129341977
18279 129341977 110697978 95633481 83549145 73638354 65422406 58702066 53324068
18272 53324068 49048625 45707746 43259494 41511501 40480911 40067650 39962117 39770257
18264 39770257 39113221 38010010 36845230 35947864 35420767 35262397 35554471 36383750 37824284
18255 37824284 39953220 42685857 46146580 50945099 57851960 66614996 75610239 82456207
18247 82456207 84814836 81735034 75595000 68450798 61417951 55214756 49650193 44592480
18239 44592480 40943583 39418983 39575713 40260588 40185633 38748557 35930556 32490567 29663534
$$ packed form
18294C57513119N094757n605638q173763m028967J042199J350718m751880j5100467
18286C27340078k5077443l1294634l2938194l1345470k8814783k6013107k2514470
18279A29341977j8643999j5064497j2084336r910791q215948o720340n377998
18272E3324068m275443l340879k448252j747993j030590m13261j05533j91860
18264C9770257o57036j103211j164780q97366n27097j58370K92074Q29279J440534
18255C7824284K128936K732637L460723M798519O906861Q763036Q995243O845968
18247H2456207K358629l079802o140034p144202p032847o203195n564563n057713
18239D4592480l648897j524600J56730O84875p4955j437076k818001l439989k827033
$$ plain form
18230 29663534 27804610 26714580 26176431 25906603 25759168 25484469 24942660 24102984 23248977
18221 23248977 22761017 22734374 23108423 23866117 25088710 26922709 29457211 32572916 35960166
18212 35960166 39701352 43804133 48422229 53242490 57164167 59644728 61150916 63263092
18204 63263092 68288315 77443754 89557909 102389360 113799815 121547439 124234321 122184922
18196 122184922 115732612 107277037 100428034 97599758 98703578 100632262 99877537 94415867
18188 94415867 84424716 73369158 63982369 57442217 53226928 49991692 46994001 44043421
18180 44043421 41599550 40093676 38944188 37348379 35049632 32426274 30339151 29398231
18172 29398231 29463671 30188938 30918218 31027339 30151367 28301250 26006996 23918251 22431094
$$ packed form
18230B9663534j858924j090030n38149k69828j47435k74699n41809q39676q54007
18221B3248977m87960k6643L74049P57694J222593J833999K534502L115705L387250
18212C5960166L741186M102781M618096M820261L921677K480561J506188K112176
18204F3263092N025223R155439J2114155J2831451J1410455P747624K686882k049399
18196A22184922o452310q455575o849003k828276J103820J928684p54725n461670
18188I4415867r991151j1055558r386789o540152m215289l235236k997691k950580
18180D4043421k443871j505874j149488j595809k298747k623358k087123r40920
18172B9398231O5440P25267P29280J09121q75972j850117k294254k088745j487157
$$ plain form
18163 22431094 21588777 21328275 21681505 22637521 24175505 26570889 30102104 34768575 40370895
18154 40370895 46369251 52330349 57833852 62865961 68460939 75637691 84677342 94678578
18146 94678578 102264813 102961560 94980182 81157032 64907035 50864574 40940370 34177687
18138 34177687 29489795 26130410 23723221 22003447 20930307 20624431 20985190 21644206
18130 21644206 21864978 21220033 19613455 17392107 15343064 13842702 12870872 12311339 11970682
18121 11970682 11833515 11904350 12216604 12768910 13697833 15134217 17222544 20480091 25907704
18112 25907704 34524395 45553816 54584316 57199343 52936504 42115179 30675099 23085026
18104 23085026 18501725 15455027 13230242 11626237 10400787 9383595 8511892 7792132
$$ packed form
18163B2431094q42317k60502L53230R56016J537984K395384L531215M666471N602320
18154D0370895N998356N961098N503503N032109N594978P176752R039651J0001236
18146I4678578P586235O96747p981378j3823150j6249997j4042461r924204o762683
18138C4177687m687892l359385k407189j719774j073140l05876L60759O59016
18130B1644206K20772o44945j606578k221348k049043j500362r71830n59533l40657
18121A1970682j37167P0835L12254N52306R28923J436384K088327L257547N427613
18112B5907704Q616691J1029421R030500K615027m262839j0821325j1440080p590073
18104B3085026m583301l046698k224785j604005j225450j017192q71703p19760
$$ plain form
18096 7792132 7158382 6648165 6248096 5893373 5532055 5212939 4951439 4699931 4475693
18087 4475693 4267134 4094395 3882789 3665835 3567973 3476033 3397703 3304212 3188227 3052574
18077 3052574 2955392 2840497 2731398 2662714 2642736 2570565 2499328 2431173 2354690 2297342 2243894
18066 2243894 2235446 2246659 2252874 2223278 2269137 2274874 2171888 2151783 2183411 2184621 2143412 2146324
18054 2146324 2235072 2226498 2230800 2205798 2172069 2167164 2174736 2133212 2099127 2076558 2019425 1950981
18042 1950981 1917772 1914372 1885224 1859807 1764525 1688541 1655251 1650964 1685326 1712516 1663801 1629245
18030 1629245 1600709 1496105 1349351 1257583 1252384 1251393 1245647 1175153 1116834 1096062 1075314 1030486
18018 1030486 939394 920551 889131 824970 763631 754740 805361 841315 805148 774322 777023 751532
$$ packed form
18096G792132o33750n10217m00069l54723l61318l19116k61500k51508k24238
18087D475693k08559j72739k11606k16954r7862r1940p8330r3491j15985j35653
18077C052574r7182j14895j09099o8684j9978p2171p1237o8155p6483n7348n3448
18066B243894q448J1213O215k9596M5859N737j02986k0105L1628J210m1209K912
18054B146324Q8748q574M302k5002l3729m905P572m1524l4085k2569n7133o8444
18042A950981l3209l400k9148k5417r5282p5984l3290m287L4362K7190m8715l4556
18030A629245k8536j04604j46754r1768n199r91n746p0494n8319k0772k0748m4828
18018A030486r1092j8843l1420o4161o1339q891N0621L5954l6167l0826K701k5491
$$ plain form
18006 751532 714211 690212 698361 689017 758173 802606 805136 763123 751004 821234 859308 886702
17994 886702 932507 965789 976552 937827 932290 963109 1018191 1000931 954779 938957 869502 877719
17982 877719 882690 895520 897438 846698 820453 810555 847966 851164 886809 919178 856088 872907
17970 872907 925380 1018063 1081342 1022640 962837 972647 1004204 994960 988619 972411 951485 961560
17958 961560 951984 864953 762801 703084 646243 711928 760473 734710 671159 643347 676839
17947 676839 661231 634340 604151 549671 559701 624778 631833 547655 487867 490798 454906 441961
17935 441961 486187 466509 486118 468044 473806 524953 567684 589338 608800 627453 575315 562445
17923 562445 574837 612422 629287 638961 606452 612301 617142 622397 651682 661489 623880 614483 666386
$$ packed form
18006G51532l7321k3999Q149r344O9156M4433K530m2013j2119P0230L8074K7394
17994H86702M5805L3282J0763l8725n537L0819N5082j7260m6152j5822o9455Q217
17982H77719M971J2830J918n0740k6245r898L7411L198L5645L2369o3090J6819
17970H72907N2473R2683O3279n8702n9803R810L1557r244o341j6208k0926J0075
17958I61560r576q7031j02152n9717n6841O5685M8545k5763o3551k7812L3492
17947F76839j5608k6891l0189n4480J0030O5077P055q4178n9788K931l5892j2945
17935D41961M4226j9678J9609j8074N762N1147M2731K1654J9462J8653n2138j2870
17923E62445J2392L7585J6865R674l2509N849M841N255K9285R807l7609r397N1903
$$ plain form
17910 666386 754470 781850 829608 840266 808096 789885 784860 710728 649349 643454 616696 564665
17898 564665 541788 551400 549234 568036 596957 584422 597457 643123 666463 635603 584739 590482
17886 590482 543223 538243 583116 544387 506386 477478 478854 458876 430616 442107 432145 418619
17874 418619 451393 490133 485662 490106 530443 545557 545980 565803 583771 594188 660732 685697
17862 685697 658356 697783 664471 681424 657162 676650 725810 760248 756537 739471 742221 743192
17850 743192 738193 778295 721361 678886 673830 699194 727474 719249 719339 708796 728841 798279 845673
17837 845673 821339 802349 797923 833672 850117 894958 957422 1048499 1102804 1144367 1144192 1126484
17825 1126484 1103952 1051413 1032034 1026372 1007907 981743 997522 1017931 1031713 1085448 1128951
$$ packed form
17910F66386Q8084K7380M7758J0658l2170j8211n025p4132o1379n895k6758n2031
17898E64665k2877R612k166J8802K8921j2535J3035M5666K3340l0860n0864N743
17886E90482m7259m980M4873l8729l8001k8908J376j9978k8260J1491r962j3526
17874D18619L2774L8740m471M444M0337J5114M23J9823J7968J0417O6544K4965
17862F85697k7341L9427l3312J6953k4262J9488M9160L4438l711j7066K750R71
17850G43192m999M0102n6934m2475n056K5364K8280q225R0j0543K0045O9438M7394
17837H45673k4334j8990m426L5749J6445M4841O2464R1077N4305M1563j75j7708
17825A126484k2532n2539j9379n662j8465k6164J5779K0409J3782N3735M3503
$$ plain form
17814 1128951 1137478 1104954 1132612 1140652 1165638 1231571 1275133 1287593 1274393 1271357 1293663 1270113
17802 1270113 1294838 1367429 1452370 1458008 1402938 1413954 1435844 1442926 1447778 1460983 1445794 1457451
17790 1457451 1512350 1573719 1688568 1731467 1773478 1898845 2003512 2047818 2138880 2299932
17780 2299932 2437048 2505590 2570734 2579828 2537560 2512853 2524836 2488825 2504281 2545951 2579578
17769 2579578 2555472 2546241 2581881 2676630 2716215 2764130 2845834 2911081 3034327 3121497 3202301
17758 3202301 3290788 3444157 3606032 3732817 3878429 4078055 4286806 4488869 4735225 4983698
17748 4983698 5257437 5509749 5781965 6167478 6676715 7196398 7764155 8497828 9400014
17739 9400014 10444355 11651980 13059714 14813361 17093646 19923313 23301074 27218443
$$ packed form
17814A128951Q527l2524K7658Q040K4986O5933M3562J2460j3200l036K2306k3550
17802A270113K4725P2591Q4941N638n5070J1016K1890P082M852J3205j5189J1657
17790A457451N4899O1369J14849M2899M2011J25367J04667M4306R1062J61052
17780B299932J37116O8542O5144R094m2268k4707J1983l6011J5456M1670L3627
17769B579578k4106r231L5640R4749L9585M7915Q1704O5247J23246Q7170Q0804
17758C202301Q8487J53369J61875J26785J45612J99626K08751K02063K46356K48473
17748D983698K73739K52312K72216L85513N09237N19683N67757P33673R02186
17739I400014J044341J207625J407734J753647K280285K829667L377761L917369
$$ plain form
17731 27218443 31535414 35799111 39600584 43147910 47023910 52238095 59508097 68496743
17723 68496743 78284146 88481035 98391814 106671069 113175658 118747144 125021109 134820863
17715 134820863 147531161 158644935 163608523 161063281 153180001 143555893 134609204 126587443
17707 126587443 119220402 112613932 106184834 98593789 89014336 78166056 68557209 62213118
17699 62213118 59459368 59681429 61663729 63662263 63873751 61344432 56446345 50762780
17691 50762780 46021223 43052732 41952632 42603000 44913444 48202361 51478631 54137226
17683 54137226 56163558 58221261 61907224 68517205 79039940 93061552 107526628 118124135
17675 118124135 122540615 121206181 116629416 111785515 107061420 101998609 97223592 94351431
$$ packed form
17731B7218443M316971M263697L801473L547326L876000N214185P270002Q988646
17723F8496743R787403J0196889R910779Q279255O504589N571486O273965R799754
17715A34820863J2710298J1113774M963588k545242p883280r624108q946689q021761
17707A26587443p367041o606470o429098p591045r579453j0848280r608847o344091
17699F2213118k753750K22061J982300J998534K11488k529319m898087n683565
17691E0762780m741557k968491j100100O50368K310444L288917L276270K658595
17683E4137226K026332K057703L685963O609981J0522735J4021612J4465076J0597507
17675A18124135M416480j334434m576765m843901m724095n062811m775017k872161
$$ plain form
17667 94351431 93637750 93449479 92611886 91685066 93115485 98218188 105541282 111940889 114722660
17658 114722660 113406626 110639405 109911247 111850939 113597560 111043537 102184049 88173410
17650 88173410 73221950 61341012 53273125 47542310 42975821 38971716 35538367 32943796
17642 32943796 31398589 31065030 32064899 34604910 38305958 41628620 43047716 42230839
17634 42230839 39715572 37658822 37824369 39689244 41209487 40726166 37753706 33034977
17626 33034977 28706522 26081172 24769608 23760436 22173476 19886742 17103439 14546606
17618 14546606 12609144 11217294 10162485 9343180 8711648 8165330 7667045 7249493 6874346
17609 6874346 6535019 6225925 5961321 5809877 5638391 5452063 5272770 5068552 4832833
$$ packed form
17667I4351431p13681j88271q37593r26820J430419N102703P323094O399607K781771
17658A14722660j316034k767221p28158J939692J746621k554023q859488j4010639
17650H8173410j4951460j1880938q067887n730815m566489m004105l433349k594571
17642C2943796j545207l33559R99869K540011L701048L322662J419096q16877
17634D2230839k515267k056750J65547J864875J520243m83321k972460m718729
17626C3034977m328455k625350j311564j009172j586960k286734k783303k556833
17618A4546606j937462j391850j054809q19305o31532n46318m98285m17552l75147
17609F874346l39327l09094k64604j51444j71486j86328j79293k04218k35719
$$ plain form
17600 4832833 4624492 4429931 4252484 4091727 3956179 3837245 3696470 3539380 3434161
17591 3434161 3368576 3204926 3071559 2977211 2883066 2761709 2682708 2604783 2522174 2421322
17581 2421322 2319297 2328689 2332164 2268353 2148613 2026395 1918940 1896780 1844969 1781317 1707706
17570 1707706 1644952 1626221 1588733 1540151 1530176 1519814 1521313 1480144 1443585 1450943 1443848 1352733
17558 1352733 1264398 1275878 1270699 1309855 1262837 1224636 1203841 1194430 1161126 1155787 1136478 1126109
17546 1126109 1122992 1096224 1056489 994005 999208 1004538 1000336 990529 1018862 1064887 1037634 970207
17534 970207 854108 764129 781089 779230 745455 728427 698167 636365 609190 616766 586959 603179
17522 603179 594793 550749 563084 560207 575644 544095 498046 478296 536195 552060 546453 487906
$$ packed form
17600D832833k08341j94561j77447j60757j35548j18934j40775j57090j05219
17591C434161o5585j63650j33367r4348r4145j21357p9001p7925q2609j00852
17581B421322j02025R392L475o3811j19740j22218j07455k2160n1811o3652p3611
17570A707706o2754j8731l7488m8582r975j0362J499m1169l6559P358p095r1115
17558A352733q8335J1480n179L9156m7018l8201k0795r411l3304n339j9309j0369
17546A126109l117k6768l9735o2484N203N330m202r807K8333M6025k7253o7427
17534I70207j16099q9979J6960j859l3775j7028l0260o1802k7175P576k9807J6220
17522F03179q386m4044J2335k877J5437l1549m6049j9750N7899J5865n607n8547
$$ plain form
17510 487906 475310 472332 452217 450073 410030 376159 357334 403416 391091 368217 354482 398559
17498 398559 381561 323461 341797 325608 296513 290398 277663 280827 303579 339704 329867 333077
17486 333077 319335 265424 234819 250132 300972 290260 253692 199321 202371 262303 276486 296849
17474 296849 324744 301734 339372 336414 354014 322634 343157 356804 401347 477683 566597 646040
17462 646040 597597 513290 531759 517189 502543 545292 574258 614981 646366 601531 527021
17451 527021 495397 451941 443823 424758 462154 494380 504615 522495 512717 516977 485045 420866
17439 420866 328598 330798 338142 308966 300122 300512 270179 249287 239735 268660 263411 247211 269264
17426 269264 316964 314550 328995 364109 387490 415740 422640 407927 448005 448294 437307 446997
$$ packed form
17510D87906j2596k978k0115k144m0043l3871j8825M6082j2325k2874j3735M4077
17498C98559j6998n8100J8336j6189k9095o115j2735L164K2752L6125r837L210
17486C33077j3742n3911l0605J5313N0840j0712l6568n4371L050N9932J4183K0363
17474B96849K7895k3010L7638k958J7600l1380K0523J3647M4543P6336Q8914P9443
17462F46040m8443q4307J8469j4570j4646M2749K8966M0723L1385m4835p4510
17451E27021l1624m3456q118j9065L7396L2226J0235J7880r778M260l1932o4179
17439D20866r2268K200P344k9176q844L90l0333k0892r552K8925n249j6200K2053
17426B69264M7700k414J4445L5114K3381K8250O900j4713M0078K89j0987R690
$$ plain form
17414 446997 457605 431379 377550 375269 445793 490478 570066 610091 608277 541384 497227 480858
17402 480858 512651 490142 376898 302338 265778 252010 283635 260849 210315 201049 216451
17391 216451 211029 195550 166179 221364 271962 251688 208138 128367 143623 133330 95754 122112
17379 122112 139250 113950 135197 128073 127149 113082 133335 142982 133422 115174 73266 54511
17367 54511 101945 71408 804 8586 7899 30187 29471 22292 60757 93570 72436 83570 134059
17354 134059 122433 95571 71382 77073 85644 112333 114475 94997 71678 61264 41587 86828
17342 86828 52622 -5064 13600 -26913 -46577 -31011 18483 25319 17560 34718 11868 -2442
17330 -2442 59722 88941 92609 48616 24792 1519 8974 9978 12696 -27434 -23238 48960 68886
$$ packed form
17414D46997J0608k6226n3829k281P0524M4685P9588M0025j814o6893m4157j6369
17402D80858L1793k2509j13244p4560l6560j3768L1625k2786n0534r266J5402
17391B16451n422j5479k9371N5185N0598k0274m3550p9771J5256j0293l7576K6358
17379A22112J7138k5300K1247p124r24j4067K0253R647r560j8248m1908j8755
17367E4511M7434l0537p0604P782o87K2288p16p179L8465L2813k1134J1134N0489
17354A34059j1626k6862k4189N691Q571K6689K142j9478k3319j0414j9677M5241
17342H6828l4206n7686J8664m0513j9664J5566M9494O836p759J7158k2850j4310
17330b442O2164K9219L668m3993k3824k3273P455J004K718m0130M196P2198J9926
$$ plain form
17317 68886 61830 7134 -11 -23379 -1053 1101 1709 8454 -21286 -41455 -42869 6997 33169
17304 33169 8067 -34460 -22420 6471 20385 -29136 -3642 -42632 -81081 -118241 -104434 -71588
17292 -71588 -18720 -8896 -22129 2282 234 2238 52332 54160 27082 20704 56329 111313 84398
17279 84398 53583 16456 -8847 -32043 -32695 -3429 576 -64359 -149804 -97340 3943 23175
17267 23175 34550 6993 -27813 -50917 -83233 -106254 -72374 -48305 -62092 -25977 -39595 -42522
17255 -42522 -63642 -110769 -83616 -41693 -28736 -82660 -55575 10605 32275 83108 105917 47291
17243 47291 28376 25094 19825 22687 -5528 5270 -2137 -22919 12786 39718 55720 59849 92018
17230 92018 83566 98476 59239 90114 98076 117392 190463 191873 214722 250205 300334 355301
$$ packed form
17317F8886p056n4696p145k3368K2326K154O08O745k9740k0169j414M9866K6172
17304C3169k5102m2527J2040K8891J3914m9521K5494l8990l8449l7160J3807L2846
17292g1588N2868R824j3233K4411k048K004N0094J828k7078o378L5625N4984k6915
17279H4398l0815l7127k5303k3196o52K9266M005o4935q5445N2464J01283J9232
17267B3175J1375k7557l4806k3104l2316k3021L3880K4069j3787L6115j3618k927
17255d2522k1120m7127K7153M1923J2957n3924K7085O6180K1670N0833K2809n8626
17243D7291j8915l282n269K862k8215J0798p407k0782L5705K6932J6002M129L2169
17230I2018q452J4910l9237L0875P962J9316P3071J410K2849L5483N0129N4967
$$ plain form
17218 355301 410667 449185 525930 571919 586524 560043 555326 565513 559640 548316 570689 560626
17206 560626 593026 561135 543288 523106 521604 519549 462331 452854 459237 428283 443392 418940
17194 418940 378286 302962 298583 263294 212408 205200 231625 202756 140670 150988 153758 169411
17182 169411 203957 167892 161523 164650 185163 196702 218307 255622 288740 325823 373371 469707
17170 469707 501658 512789 551884 612535 683493 766409 789044 791074 759818 687447 622558 583123
17158 583123 572642 585216 574537 500955 444087 376586 377792 359250 359441 389125 418426 441461
17146 441461 454699 464206 428886 371346 377972 410644 364685 356433 328756 291750 292777 284657
17134 284657 269188 240445 192571 152270 126446 122823 170009 170732 192968 188695 189205 230112 255818
$$ packed form
17218C55301N5366L8518P6745M5989J4605k6481m717J0187n873j1324K2373j0063
17206E60626L2400l1891j7847k0182j502k055n7218r477O383l0954J5109k4452
17194D18940m0654p5324m379l5289n0886p208K6425k8869o2086J0318K770J5653
17182A69411L4546l6065o369L127K0513J1539K1605L7315L3118L7083M7548R6336
17170D69707L1951J1131L9095O0651P0958Q2916K2635K030l1256p2371o4889l9435
17158E83123j0481J2574j0679p3582n6868o7501J206j8542J91K9684K9301K3035
17146D41461J3238R507l5320n7540O626L2672m5959q252k7677l7006J027q120
17134B84657j5469k8743m7874m0301k5824l623M7186P23K2236m273N10M0907K5706
$$ plain form
17121 255818 282505 310666 301694 205578 206909 230963 185788 147464 127066 86664 69713 73068
17109 73068 35699 22417 51898 15920 21997 23918 48392 24524 15069 26506 28779 74372
17097 74372 61917 35271 -8957 -32125 8272 40233 98662 120838 91201 54225 73768 49152
17085 49152 20191 14663 10198 59494 89041 109570 25845 29274 28963 16040 -13306 21190 4038
17072 4038 -27209 -38728 47495 54173 -9721 -8483 15202 65216 85074 49350 -2860 -49229
17060 -49229 -87221 -67629 -34344 -35160 -31608 -74064 -65948 -10943 23392 13976 11627 11985 27223
17047 27223 42530 71984 86404 28910 -18396 11850 57305 71764 16228 -16445 -49459 -69188
17035 -69188 -7516 47615 31843 3772 -1064 2192 37135 49591 83872 88719 89578 58067 55222
$$ packed form
17121B55818K6687K8161q972r6116J331K4054m5175l8324k0398m0402j6951L355
17109G3068l7369j3282K9481l5978O077J921K4474k3868r455J1437K273M5593
17097G4372j2455k6646m4228k3168M0397L1961N8429K2176k9637l6976J9543k4616
17085D9152k8961n528m465M9296K9547K0529q3725L429l11j2923k9346L4496j7152
17072D038l1247j1519Q6223O678o3894J238K3685N0014J9858l5724n2210m6369
17060d9229l7992J9592L3285q16L552m2456Q116N5005L4335r416k349L58J5238
17047B7223J5307K9454J4420n7494m7306L0246M5455J4459n5536l2673l3014j9729
17035f9188O1672N5131j5772k8071m836L256L4943J2456L4281M847Q59l1511k845
$$ plain form
17022 55222 77554 72956 61099 53325 45755 17980 -14863 -15759 -3485 205 -11035 -45679 -33945
17009 -33945 -15225 -17154 -12160 -13943 -72120 -77072 -20176 -9204 -36595 -9416 42785 88116
16997 88116 93010 72112 64857 12755 -3314 20933 -40555 -73856 -70351 -68405 -65469 -83240 -105804
16984 -105804 -63846 -69475 -94230 -76576 2950 16259 9675 30320 24662 22999 -46726 -83080
16972 -83080 -74588 -62522 -66434 -59530 -44898 -18302 -2306 -64648 -96979 -53914 -34532 -34205 -72068
16959 -72068 -71761 -57399 -52276 -62609 -45782 7234 -36907 -30310 -39966 -78181 -50340 -6956 37809
16946 37809 -11640 -45559 -65590 -105675 -75162 -32770 -43786 -69655 -107378 -32371 -43194 -63125
16934 -63125 -55433 6743 45748 -8181 -58851 -12605 21558 12168 -4927 -34913 -36249 -31505
$$ packed form
17022E5222K2332m598j1857p774p570k7775l2843q96J2274L690j1240l4644J1734
17009c3945J8720j929M994j783n8177m952N6896J0972k7391K7179N2201M5331
16997H8116M894k0898p255n2102j6069K4247o1488l3301L505J946K936j7771k2564
16984a05804M1958n629k4755J7654P9526J3309o584K0645n658j663o9725l6354
16972h3080Q492J2066l912O904J4632K6596J5996o2342l2331M3065J9382L27l7863
16959g2068L07J4362N123j0333J6827N3016m4141O597r656l8215K7841M3384M4765
16946C7809m9449l3919k0031m0085L0513M2392j1016k5869l7723P5007j0823j9931
16934f3125P692O2176L9005n3929n0670M6246L4163r390j7095k9986j336M744
$$ plain form
16922 -31505 -31887 -20113 -42458 -53935 -31656 -33979 -58855 -38962 -52032 -61464 -81007 -73559 -95561
16909 -95561 -67159 -28337 -43300 -21249 -8462 -13597 10187 9765 6229 7842 -17624 -39222 -68835
16896 -68835 -77135 -78975 -74003 -77721 -35991 13 -12890 -14190 19475 22341 -13837 -12018 -55800
16883 -55800 -75465 -78170 -84465 -75351 -49743 -64328 -120499 -93010 -55476 -19188 724 -12145
16871 -12145 -25217 41913 49872 -31210 -33190 28487 63970 21968 -47984 -89667 -55479 -57968
16859 -57968 -83306 -76953 -73730 -22533 -28137 -41859 1172 19489 11304 35743 14559 -24440
16847 -24440 7361 -5575 -677 -36837 -15520 -18249 -4948 -1875 -3900 -15521 -7474 -51211 -34482
16834 -34482 -9265 5866 49170 44965 -44025 -67603 -35025 -31493 -10891 -30464 -28778 -35172
$$ packed form
16922c1505l82J1774k2345j1477K2279k323k4876J9893j3070r432j9543P448k2002
16909i5561K8402L8822j4963K2051J2787n135K3784m22l536J613k5466k1598k9613
16896f8835q300j840M972l718M1730L6004j2903j300L3665K866l6178J819m3782
16883e5800j9665k705o295R114K5608j4585n6171K7489L7534L6288J9912j2869
16871a2145j3072O7130P959q1082j980O1677L5483m2002o9952m1683L4188k489
16859e7968k5338O353L223N1197n604j3722M3031J8317q185K4439k1184l8999
16847b4440L1801j2936M898l6160K1317k729J3301L073k025j1621Q047m3737J6729
16834c4482K5217J5131M3304m205q8990k3578L2578L532K0602j9573J686o394
$$ plain form
16822 -35172 -49115 -52158 -82016 -84713 -64075 -49429 -45006 -23722 -42060 -61725 -70341 -62138 -43674
16809 -43674 -18166 -22450 48578 24776 -14976 -28682 -41037 -64104 -84101 -64095 -7308 -3072
16797 -3072 -61111 -31486 38873 38275 10340 -33834 -15336 -14135 -11656 16976 51069 56437 48672
16784 48672 36831 47408 3799 -45950 -13266 -10405 -67244 -66895 -49892 -36897 -38843 -54889
16772 -54889 -51252 -84654 -97346 -49556 4822 53763 67647 47381 48587 15620 4293 -11945
16760 -11945 -38108 -60305 -80101 -41060 -54190 -40135 -16708 1443 -5589 4166 -40892 -71732
16748 -71732 -22491 -20489 -13617 8915 39099 34036 6655 -32665 -42712 3871 13765 4934 -7899
16735 -7899 -48484 -33681 -13372 -4174 31687 53227 72975 38701 21561 -4803 40605 99691
$$ packed form
16822c5172j3943l043k9858k697K0638J4646M423K1284j8338j9665q616Q203J8464
16809d3674K5508m284P1028k3802l9752j3706j2355k3067j9997K0006N6787M236
16797c072n8039K9625P0359n98k7935m4174J8498J201K479K8632L4093N368p765
16784D8672j1841J0577m3609m9749L2684K861n6839L49J7003J2995j946j6046
16772e4889L637l3402j2692M7790N4378M8941J3884k0266J206l2967j1327j6238
16760a1945k6163k2197j9796L9041j3130J4055K3427J8151p032R755m5058l0840
16748g1732M9241K002O872K2532L0184n063k7381l9320j0047M6583R894q831j2833
16735g899m0585J4803K0309R198L5861K1540J9748l4274j7140k6364M5408N9086
$$ plain form
16723 99691 98033 71071 32570 -59949 -56187 8086 24722 4535 -1312 -5916 -14832 -24434 -16928
16710 -16928 -74504 -119091 -123593 -59727 -14199 29487 40138 12349 -38784 -98911 -101398 -33412
16698 -33412 -43820 -7606 6252 -6603 -34116 -47770 -31166 -12135 10755 -23099 -34358 -19336
16686 -19336 -32997 -37282 -11805 7547 -25170 -82971 -99563 -92996 -123413 -101117 -26099 59353
16674 59353 80061 16679 -56367 -88595 -86753 -88903 -75765 -94556 -124967 -89110 -82760 -93892
16662 -93892 -103276 -80301 -65059 -34356 14125 18805 -11642 -32943 -15820 20688 842 -42331
16650 -42331 -53373 -40272 -22730 53664 96309 73924 49574 63935 44005 45000 -5318 -49730
16638 -49730 -66401 -45812 -26400 -63630 -113519 -50514 -36588 -22995 -55566 -8754 -21561 -16797
$$ packed form
16723I9691j658k6962l8501r2519L762O4273J6636k0187n847m604q916r602P506
16710a6928n7576m4587m502O3866M5528M3686J0651k7789n1133o0127k487O7986
16698c3412j0408L6214J3858j2855k7513j3654J6604J9031K2890l3854j1259J5022
16686a9336j3661m285K5477J9352l2717n7801j6592O567l0417K2296P5018Q5452
16674E9353K0708o3382p3046l2228J842k150J3138j8791l0411L5857O350j1132
16662i3892r384K2975J5242L0703M8481M680l0447k1301J7123L6508j9846m3173
16650d2331j1042J3101J7542P6394M2645k2385k4350J4361j9930R95n0318m4412
16638d9730j6671K0589J9412l7230m9889O3005J3926J3593l2571M6812j2807M764
$$ plain form
16626 -16797 -15604 -21072 -19571 -23036 -15144 36475 28369 -30659 -11884 22865 48036 1851 -47312
16613 -47312 -76621 -70871 -54493 -57511 -39375 -98107 -122544 -73996 -33837 -34022 4605 -3809 -42081
16600 -42081 -40400 -44635 -23102 -8473 -7733 -16449 -23633 -14987 -41128 -13369 -3471 25417 -19421
16587 -19421 -77725 -89547 -88394 -116164 -64946 27359 28850 37898 -10441 -68938 -104695 -43365
16575 -43365 -21944 -57557 -19949 -7615 -24630 -44455 -1891 21261 11979 -21356 -30680 -3099
16563 -3099 -7614 -14725 -2173 -39366 -63303 -41215 -34002 -3061 -21021 -21688 -26275 -28630 -44176
16550 -44176 -41010 -16804 16866 25107 14994 14015 6564 60244 78391 52089 23942 68519 103053
16537 103053 112937 72178 30056 7978 16977 42650 37022 23356 -36666 -55487 -69075 -38014
$$ packed form
16626a6797J193n468J501l465P892N1619q106n9028J8775L4749K5171m6185m9163
16613d7312k9309N750J6378l018J8136n8732k4437M8548M0159j85L8627q414l8272
16600d2081J681m235K1533J4629P40q716p184Q646k6141K7759R898K8888m4838
16587a9421n8304j1822J153k7770N1218R2305J491R048m8339n8497l5757O1330
16575d3365K1421l5613L7608J2334j7015j9825M2564K3152r282l3335r324K7581
16563c099m515p111J2552l7193k3937K2088P213L0941j7960o67m587k355j5546
16550d4176L166K4206L3670Q241j0113r79p451N3680J8147k6302k8147M4577L4534
16537A03053R884m0759m2122k2078Q999K5673n628j3666o0022j8821j3588L1061
$$ plain form
16525 -38014 -23540 -6590 15746 23624 12248 -16269 -17951 -5769 -16413 -61873 -113874 -159091
16513 -159091 -115240 -63201 -54501 -63112 11457 75487 87774 6779 -38902 -49068 -41623 -48999
16501 -48999 -2988 72395 69597 -18450 -24457 -721 14272 -1705 -4816 -16750 -39563 -28931
16489 -28931 -43525 -31526 -41011 -31509 -31889 -43918 -32069 -8608 -6631 5091 16502 -10514 -46180
16476 -46180 -57918 -63627 11742 53371 45454 64164 18775 22653 61230 47073 -158 -32240
16464 -32240 -41033 -51075 -45411 -36679 -25343 -19225 -79735 -92094 -99823 -72516 -24621 -25396 -35318
16451 -35318 -59652 -77798 -82668 -64696 -48539 -73277 -133365 -87281 -39816 16128 5742 -14441
16439 -14441 -22501 -37850 -13613 15370 1055 12951 -13043 -12371 20582 8271 4663 8393 26739
$$ packed form
16525c8014J4474J6950K2336P878j1376k8517j682J2182j0644m5460n2001m5217
16513a59091M3851N2039Q700q611P4569O4030J2287q0995m5681j0166P445p376
16501d8999M6011P5383k798q8047o007K3736J4993j5977l111j1934k2813J0632
16489b8931j4594J1999r485R502l80j2029J1849K3461J977J1722J1411k7016l5666
16476d6180j1738n709P5369M1629p917J8710m5389L878L8577j4157m7231l2082
16464c2240q793j0042N664Q732J1336O118o0510j2359p729K7307M7895p75r922
16451c5318k4334j8146m870J7972J6157k4738o0088M6084M7465N5944j0386k0183
16439a4441q060j5349K4237K8983j4315J1896k5994O72L2953j2311l608L730J8346
$$ plain form
16426 26739 -21895 -78630 -91217 -70620 -34269 9166 18962 6053 -26582 -64275 -91229 -103503
16414 -103503 -85485 -80502 -107362 -128747 -78740 -23075 -2096 -19224 -18945 -60512 -87549 -32518
16402 -32518 7413 19641 -59348 -87864 -27380 -26963 -5175 -6307 -15660 24674 -10052 -16053 37340
16389 37340 64215 46395 -28912 -62205 -30533 447 -20452 -18667 2144 -25846 29011 53986
16377 53986 11943 -65033 -77418 -31593 -21128 -6968 17233 -18761 -104946 -116492 -72144 -19207
16365 -19207 56212 61951 13660 42319 52767 22567 7966 -8036 -38479 -40801 2459 -8483
16353 -8483 18750 32444 33051 5466 -18569 -71730 -90996 -49021 -1880 -33870 -105483 -150601
16341 -150601 -161703 -148527 -126453 -103114 -61296 -68758 -89643 -104552 -137249 -123875 -91744 -85378
$$ packed form
16426B6739m8634n6735j2587K0597L6351M3435R796j2909l2635l7693k6954j2274
16414a03503J8018M983k6860k1385N0007N5665K0979j7128K79m1567k7037N5031
16402c2518L9931J2228p8989k8516O0484M17K1788j132r353M0334l4726o001N3393
16389C7340K6875j7820p5307l3293L1672L0980k0899J785K0811k7990N4857K4975
16377E3986m2043p6976j2385M5825J0465J4160K4201l5994q6185j1546M4348N2937
16365a9207P5419N739m8291K8659J0448l0200j4601j6002l0443k322M3260j0942
16353h483K7233J3694O07k7585k4035n3161j9266M1975M7141l1990p1613m5118
16341a50601j1102J3176K2074K3339M1818p462k0885j4909l2697J3374L2131O366
$$ plain form
16329 -85378 -43752 -48937 -46779 -49155 -45229 -21959 15123 40854 37419 1330 -21330 -45746 -36284
16316 -36284 -37249 -64980 -100791 -91975 -103978 -116266 -115301 -67901 -21270 24154 53577 42697 30925
16303 30925 32339 13402 6280 -38737 -38457 -7234 17184 59384 65001 31092 23280 -7960 -886
16290 -886 -14004 -29250 -66905 -49194 -55476 -48286 -59657 -69689 -89988 -121562 -101558 -66631
16278 -66631 -58200 -10733 4099 -28386 -32081 -18992 -23293 -51270 -21614 -11983 -17297 -52651 8334
16265 8334 77316 71132 61408 52466 56207 55788 26380 22328 -58984 -40747 -8517 -49630 -45108
16252 -45108 -3791 21928 48243 33997 50605 71630 32316 -22366 -17617 -48811 -47230 -67963
16240 -67963 -82074 -71847 -68893 -38343 -90851 -83602 -35389 16681 24401 -20553 -60008 -62175
$$ packed form
16329h5378M1626n185K158k376L926K3270L7082K5731l435l6089k2660k4416R462
16316c6284r65k7731l5811Q816j2003j2288R65M7400M6631M5424K9423j0880j1772
16303C0925J414j8937p122m5017K80L1223K4418M2200N617l3909p812l1240P074
16290h86j3118j5246l7655J7711o282P190j1371j0032k0299l1574K0004L4927
16278f6631Q431M7467J4832l2485l695J3089m301k7977K9656R631n314l5354O0985
16265H334O8982o184r724q942L741m19k9408m052q1312J8237L2230m1113M522
16252d5108M1317K5719K6315j4246J6608K1025l9314n4682M749l1194J581k0733
16240f7963j4111J0227K954L0550n2508P249M8213N2070P720m4954l9455k167
$$ plain form
16228 -62175 -24526 8261 -27913 -48634 -110126 -122354 -60619 -19111 -17365 -36529 -9045 17018
16216 17018 39 40125 56383 76558 57076 -5172 -15021 14051 28681 -21235 -63779 -63575
16204 -63575 -63634 -16879 -19698 5286 16787 22899 4413 16252 12236 16339 -22989 -93302 -97006
16191 -97006 -92108 -79680 -52540 -20567 -39343 -600 14372 -22072 -55772 -60973 -24206 -18321
16179 -18321 -50476 -59329 -88604 -84414 -58905 -17363 43013 19241 -6000 8608 -5516 -21893
16167 -21893 -19 -12456 -1586 4566 21272 17288 -20232 -54682 -38143 15896 -11520 -53536
16155 -53536 -78438 -55109 -30643 32299 34107 10474 -62879 -57280 -27694 -33952 -17496 -30817
16143 -30817 -36707 -13914 45003 33095 52282 52288 10321 -62072 -64547 -3214 51660 39806 54299
$$ packed form
16228f2175L7649L2787l6174k0721o1492j2228O1735M1508J746j9164K7484K6063
16216A7018j6979M0086J6258K0175j9482o2248r849K9072J4630m9916m2544K04
16204f3575n9M6755k819K4984J1501O112j8486J1839m016M103l9328p0313l704
16191i7006M898J2428K7140L1973j8776L8743J4972l6444l3700n201L6767N885
16179a8321l2155q853k9275M190K5509M1542O0376k3772k5241J4608j4124j6377
16167b1893K1874j2437J0870O152J6706l984l7520l4450J6539N4039k7416m2016
16155e3536k4902K3329K4466O2942J808k3633p3353N599K9586o258J6456j3321
16143c0817n890K2793N8917j1908J9187Om1967p2393k475O1333N4874j1854J4493
$$ plain form
16130 54299 32908 16276 58616 29121 -6134 -33930 -33164 -11357 10423 4623 -43501 -63788
16118 -63788 -45134 -26176 21070 20414 8286 14156 -31041 -9179 -19250 -71148 -64813 -28825
16106 -28825 26824 89959 138822 87053 2364 -36892 -16503 -8924 -24221 15427 33894 49382
16094 49382 42569 -54101 -78223 -60146 -33959 9690 18028 3587 22025 45448 12462 12476 -1985
16081 -1985 -23310 -9606 -64792 -30420 -4496 -19534 -33940 -53575 -45544 -3845 -13250 3366
16069 3366 -24531 -57506 -42007 -92732 -86583 -60444 -24471 -11253 3100 4675 -4170 -6521 26518
16056 26518 26011 70605 82466 71050 44033 34841 31872 141 14841 54080 66252 68919 62454
16043 62454 29362 -26245 -100158 -134255 -139970 -97151 -52671 -2707 -15466 -30388 -6532 -5632
$$ packed form
16130E4299k1391j6632M2340k9495l5255k7796P66K1807K1780n800m8124k0287
16118f3788J8654J8958M7246o56j2128N870m5197K1862j0071n1898O335L5988
16106b8825N5649O3135M8863n1769q4689l9256K0389P579j5297L9648J8467J5488
16094D9382o813r6670k4122J8077K6187M3649Q338j4441J8438K3423l2986J4j4461
16081a985k1325J3704n5186L4372K5924j5038j4406j9635Q031M1699r405J6616
16069C366k7897l2975J5499n0725O149K6139L5973J3218J4353J575q845k351L3039
16056B6518n07M4594J1861j1416k7017r192k969l1731J4700L9239J2172K667o465
16043F2454l3092n5607p3913l4097n715M2819M4480M9964j2759j4922K3856R00
$$ plain form
16031 -5632 -41308 -44444 -44486 -27045 -22589 -30644 -81600 -38859 -3413 27259 -14471 28964 59028
16018 59028 11928 -1872 12039 9845 -31318 -37188 -24702 -36673 -70107 -73049 -72080 -29975 24377
16005 24377 93014 124154 96130 36205 -5826 -13864 -11568 -25016 -21468 -7642 -2261 -8922 8904
15992 8904 66970 69175 36565 13344 15865 36743 30581 18193 7637 -2839 -40326 -55628
15980 -55628 13480 23791 13649 10028 14830 -1166 -59822 -69426 -3481 -11596 10403 14377 18458
15967 18458 32975 -21920 17676 12850 13875 9684 -10463 -45517 -54835 -20631 34915 45095
15955 45095 16816 55529 16448 -37237 -43875 -20691 31761 1229 -69204 -86462 -52508 -49823
15943 -49823 -46340 -20545 -22703 -15078 23395 33880 30244 31388 23991 -16124 7997 -3104 -582
$$ packed form
16031e632l5676l136m2J7441M456q055n0956M2741L5446L0672m1730M3435L0064
16018E9028m7100j3800J3911k194m1163n870J2486j1971l3434k942R69M2105N4352
16005B4377O8637L1140k8024n9925m2031q038K296j3448L548J3826N381o661J7826
15992H904N8066K205l2610k3221K521K0878o162j2388j0556j0476l7487j5302
15980e5628O9108J0311j0142l621M802j5996n8656r604O5945q115K1999L974M081
15967A8458J4517n4895L9596m826J025m191k0147l5054r318L4204N5546J0180
15955D5095k8279L8713l9081n3685o638K3184N2452l0532p0433j7258L3954K685
15943d9823L483K5795k158P625L8473J0485l636J144p397m0115K4121j1101K522
$$ plain form
15930 -582 -6577 2018 47157 75805 61457 48528 30577 -30485 -40733 -18448 9798 22808
15918 22808 49723 49008 51601 23846 19613 21050 20967 15193 40994 31151 34787 78045 97880 38628
15904 38628 25140 273 32311 28166 -8247 19133 -9056 -34451 -14449 10884 16655 12547
15892 12547 683 -3689 7873 28 -2844 -26857 -767 -2257 -16264 -15662 -14543 -7388 -10731
15879 -10731 35911 38753 -7978 -37987 1142 48851 50584 -10900 -31900 -20315 -9350 -19281
15867 -19281 -23463 980 8422 -22783 -21131 25500 -1288 -24314 -17350 -6517 56260 35167
15855 35167 -4026 -4603 -36828 -19169 17712 38682 -404 -31487 -29037 -11761 -8780 -44882
15843 -44882 -50588 16927 -2545 -26642 -6327 27702 56125 60932 90597 108771 66850 5025
$$ packed form
15930e82n995Q595M5139K8648j4348j2929j7951o1062j0248K2285K8246J3010
15918B2808K6915p15K593k7755m233J437q3n774K5801r843L636M3258J9835n9252
15904C8628j3488k4867L2038m145l6413K7380k8189k5395K0002K5333N771m108
15892A2547j1864m372J1562p845k872k4013K6090j490j4007O02J119P155l343
15879a0731M6642K842m6731l0009L9129M7709J733o1484k1000J1585J0965r931
15867a9281m182K4443P442l1205J652M6631k6788k3026O964J0833O2777k1093
15855C5167l9193n77l2225J7659L6881K0970l9086l1083K450J7276K981l6102
15843d4882n706O7515j9472k4097K0315L4029K8423M807K9665J8174m1921o1825
$$ plain form
15831 5025 30549 58429 41009 32565 36021 42275 68456 54263 55287 64570 75987 41375 -25512
15818 -25512 -82986 -75101 -25193 7721 -1459 -23944 -31507 -19398 -26277 -68500 -61270 -64426 -61958
15805 -61958 -67267 -63207 -7344 10755 3690 -53748 -50228 -5158 -16950 -67508 -71080 -59216 -29135
15792 -29135 -13950 22600 75174 49333 4285 -20228 662 4819 -7177 7438 -23214 -79386
15780 -79386 -58900 -50896 -69037 -41737 -15858 -16745 4889 -30000 5448 -23179 -82035 -71554
15768 -71554 -27163 3521 -3603 -35392 -36319 -10813 28664 32096 34887 3735 -28455 -27953 -16655
15755 -16655 15711 35628 5229 273 27868 -19238 -40326 27671 75163 36101 -44071 -36867
15743 -36867 -10106 18677 71921 75394 60405 24766 3483 -6751 26632 40032 11066 28606
$$ packed form
15831E025K5524K7880j7420q444L456O254K6181j4193J024R283J1417l4612o6887
15818b5512n7474P885M9908L2914r180k2485p563J2109o879m2223P230l156K468
15805f1958n309M060N5863J8099p065n7438L520M5070j1792n0558l572J1864L0081
15792b9135J5185L6550N2574k5841m5048k4513K0890M157j1996J4615l0652n6172
15780g9386K0486Q004j8141K7300K5879q87K1634l4889L5448k8627n8856J0481
15768g1554M4391L0684p124l1789r27K5506L9477L432K791l1152l2190N02J1298
15755a6655L2366J9917l0399m956K7595m7106k1088O7997M7492l9062q0172P204
15743c6867K6761K8783N3244L473j4989l5639k1283j0234L3383J3400k8966J7540
$$ plain form
15731 28606 2864 -27829 -48962 -29250 -14022 -36434 -91465 -58393 -52469 -70168 -22168 52139
15719 52139 90502 65648 6459 344 -6217 -40671 -20251 -20243 -37532 -70050 -52524 -70384 -113089
15706 -113089 -90535 -17352 24853 30252 12464 -7941 -13420 -1409 40063 13529 23739 -17924
15694 -17924 -66728 -68113 -32408 38767 70218 78791 32542 -17961 8104 38898 41960 57605
15682 57605 41019 22422 -34017 -106373 -58774 -4259 -9787 32905 55419 61799 56552 61186
15670 61186 83670 93303 59578 25976 -20710 -36825 -64652 -60691 -31356 -29726 -68531 -45204
15658 -45204 -41134 -69318 -85786 -69780 -49791 -53558 1208 6856 -28084 -27376 -57830 -97781 -62641
15645 -62641 -49678 -5180 12472 36066 47833 30122 24988 -1118 -5166 27234 13053 29214
$$ packed form
15731B8606k5742l0693k1133J9712J5228k2412n5031L3072N924j7699M8000P4307
15719E2139L8363k4854n9189o115o561l4454K0420Qj7289l2518J7526j7860m2705
15706a13089K2554P3183M2205N399j7788k0405n479J2011M1472k6534J0210m1663
15694a7924m8804j385L5705P1175L1451Q573m6249n0503K6065L0794L062J5645
15682E7605j6586j8597n6439p2356M7599N4515n528M2692K2514O380n247M634
15670F1186K2484R633l3725l3602m6686j6115k7827L961K9335J630l8805K3327
15658d5204M070k8184j6468J6006J9989l767N4766N648l4940P08l0454l9951L5140
15645f2641J2963M4498J7652K3594J1767j7711n134k6106m048L2400j4181J6161
$$ plain form
15633 29214 12144 -19127 -29526 -34276 4528 61782 31246 8539 5823 2976 -48356 -72807
15621 -72807 -28069 -21597 -32570 -57450 -95647 -80838 -53809 -16591 37226 23128 9802 54829
15609 54829 51338 13779 -34212 -72410 -77184 -80323 -43972 34756 33445 62619 56380 23470 -2799
15596 -2799 11059 53249 24872 -13778 -45973 -46124 -50642 -29337 -25346 -17095 -39003 -72841 -33737
15583 -33737 -19911 -67671 -129218 -138241 -102581 -31887 -11772 1988 -3692 -61992 -49059 -87041
15571 -87041 -79435 -38544 -38243 7963 5537 10103 27854 -17647 -44123 1655 -4740 -14939 -8969
15558 -8969 -55035 -88514 -49133 -22995 -9070 60773 52993 47006 28444 18674 -11670 -40356
15546 -40356 -38436 -68365 -77598 -89041 -60944 -55443 -52461 -20053 -24516 -40488 -12058 2424 -38165
$$ packed form
15633B9214j7070l1271j0399m750L8804N7254l0536k2707k716k847n1332k4451
15621g2807M4738O472j0973k4880l8197J4809K7029L7218N3817j4098j3326M5027
15609E4829l491l7559m7991l8198m774l139L6351P8728j311K9174o239l2910k6269
15596b799J3858M2190k8377l8650l2195j51m518K1305L991Q251k1908l3838L9104
15583c3737J3826m7760o1547r023L5660P0694K0115J3760n680n8300J2933l7982
15571h7041P606M0891L01M6206k426M566J7751m5501k6476M5778o395j0199N970
15558h969m6066l3479L9381K6138J3925O9843p780n987j8562r770l0344k8686
15546d0356J920k9929r233j1443K8097N501K982L2408m463j5972K8430J4482m0589
$$ plain form
15533 -38165 -31469 -16566 -11201 11788 14467 -35301 -76811 -57526 -43139 14348 57806 73024
15521 73024 95908 77761 86216 55874 -23590 6435 17369 20699 31455 25202 -23191 43282
15509 43282 50437 22716 2541 -36741 -82798 -38437 31689 29259 21817 28690 33218 51654 91326
15496 91326 111512 98324 74919 11606 -26035 -84390 -53463 -62402 -50372 -58684 -28475 24521
15484 24521 27280 -22213 -30388 -6370 -3125 -37050 -99784 -136640 -108843 -58326 2199 26783
15472 26783 -9053 -375 55644 108139 106405 123544 94567 61621 46491 -13257 -50283 -54146
15460 -54146 -24128 29298 75875 79716 50269 25464 65177 67556 97912 90608 62036 68511
15448 68511 89686 99258 61004 34421 26396 -1627 -27034 -47389 -3093 52571 78487 76763
$$ packed form
15533c8165O696J4903N365K2989K679m9768m1510J9285J4387N7487M3458J5218
15521G3024K2884j8147Q455l0342p9464L0025J0934L330J0756o253m8393O6473
15509D3282P155k7721k0175l9282m6057M4361P0126k430p442O873M528J8436L9672
15496I1326K0186j3188k3405o3313l7641n8355L0927q939J2030q312L0209N2996
15484B4521K759m9493q175K4018L245l3925o2734l6856K7797N0517O0525K4584
15472B6783l5836Q678N6019N2495j734J7139k8977l2946j5130n9748l7026l863
15460e4146L0018N3426M6577L841k9447k4805L9713K379L0356p304k8572O475
15448F8511K1175R572l8254k6583q025k8023k5407k0355M4296N5664K5916j724
$$ plain form
15436 76763 94831 123014 86030 78112 73912 60003 33700 45916 56507 95416 134674 151464
15424 151464 107906 61053 38017 21903 66498 42276 27974 77074 55368 18736 -10812
15413 -10812 -1247 45049 60884 22467 3386 -43336 -48608 -51967 -26950 -9678 -6989 -33513
15401 -33513 -35496 -66186 -45387 29975 77004 51738 16974 16814 17643 -9385 -56310 -70724 -63841
15388 -63841 -37463 39198 59717 53088 3780 -32486 -37097 -62352 -48637 -65205 -60186 -24881
15376 -24881 -19358 20049 7636 6980 12795 27236 5958 -9494 -10020 17345 6275 -6130 -8004
15363 -8004 15489 22286 33308 50127 14104 -44154 464 86467 95618 73458 90933 58066
15351 58066 62453 57565 67119 68196 60964 51890 49090 69225 90834 51857 -10202 -11941 23619
$$ packed form
15436G6763J8068K8183l6984p918m200j3909k6303J2216J0591L8909L9258J6790
15424A51464m3558m6853k3036j6114M4595k4222j4302M9100k1706l6632k9548
15413a0812R565M6296J5835l8417j9081m6722n272l359K5017J7272K689k6524
15401c3513j983l0690K0799P5362M7029k5266l4764j60Q29k7028m6925j4414O883
15388f3841K6378P6661K0519o629m9308l6266m611k5255J3715j6568N019L5305
15376b4881N523L9407j2413o56N815J4441k1278j5452n26K7365j1070j2405j874
15363h004K3493O797J1022J6819l6023n8258M4618Q6003R151k2160J7475l2867
15351E8066M387m888R554J077p232r074k800K0135K1609l8977o2059j739L5560
$$ plain form
15338 23619 10386 11456 14828 -12634 -75363 -48929 -31054 -24569 -55478 -89149 -71071 -9286
15326 -9286 -49784 -109591 -94736 -29463 12302 79502 108465 89209 106836 93223 60948 17561
15314 17561 -26919 -3887 21301 43372 40453 37269 51351 30438 14706 23297 19948 20668 27511
15301 27511 9342 6903 31828 33451 18875 -7070 41521 93233 90985 74094 53252 5211
15289 5211 -38003 -48728 -79501 -59594 -29141 67676 141761 123958 100886 143817 110246 74602
15277 74602 25152 20153 57009 74728 56915 51123 101862 80894 64344 82239 74508 36377
15265 36377 -5482 -13496 962 47383 83572 135428 144051 63210 44961 37288 -17805 -40529
15253 -40529 -15521 35144 25575 -30344 -12262 33755 5446 2053 31036 -1265 -3297 78317
$$ packed form
15338B3619j3233J070L372k7462o2729K6434J7875O485l0909l3671J8078O1785
15326i286m0498n9807J4855O5273M1765O7200K8963j9256J7627j3613l2275m3387
15314A7561m4480K3032K5188K2071k919l184J4082k0913j5732Q591l349P20O843
15301B7511j8169k439K4925J623j4576k5945M8591N1712k248j6891k0842m8041
15289E211m3214j0725l0773J9907L0453R6817P4085j7803k3072M2931l3571l5644
15277G4602m9450m999L6856J7719j7813n792N0739k0968j6550J7895p731l8131
15265C6377m1859q014J4458M6421L6189N1856Q623q0841j8249p673n5093k2724
15253d0529K5008N0665r569n5919J8082M6017k8309l393K8983l2301k032Q1614
$$ plain form
15241 78317 102964 143392 119850 90240 59588 31363 38248 98602 90382 62352 82046 66836
15229 66836 23559 23531 57444 75073 63186 44978 40106 57235 19653 17990 37966 3082 -14061
15216 -14061 63971 95948 103943 93971 84224 77437 113279 98642 68548 81789 82718 66683 52407
15203 52407 25487 29931 47539 70344 109517 131013 119903 111391 80058 75013 96314 113173
15191 113173 94078 38518 38293 72486 44777 67614 132205 135943 125876 70116 95635 105428
15179 105428 105771 90983 101162 121395 89148 77880 95890 117240 127368 91324 49896 69590
15167 69590 56112 87339 139039 179981 155364 123784 108991 104220 44289 47892 74974 69636
15155 69636 71236 114695 155507 158533 147154 106662 94053 68275 76040 94417 92439 72614
$$ packed form
15241G8317K4647M0428k3542k9610l0652k8225O885O0354q220k8030J9694j5210
15229F6836m3277k8L3913J7629j1887j8208m872J7129l7582j663J9976l4884j7143
15216a4061P8032L1977P995r972r747o787L5842j4637l0094J3241R29j6035j4276
15203E2407k6920M444J7608K2805L9173K1496j1110q512l1333n045K1301J6859
15191A13173j9095n5560k25L4193k7709K2837O4591L738j0067n5760K5519R793
15179A05428L43j4788J0179K0233l2247j1268J8010K1350J0128l6044m1428J9694
15167F9590j3478L1227N1700M0942k4617l1580j4793m771n9931L603K7082n338
15155F9636J600M3459M0812L026j1379m0492j2609k5778P765J8377j978j9825
$$ plain form
15143 72614 81827 126820 99803 101346 101769 140927 128796 93694 67121 15132 55746 110056
15131 110056 93134 118765 113012 102354 111386 103955 78990 28494 62823 115575 146468 182204
15119 182204 217024 206101 196231 166506 187190 172833 203939 199581 167967 152956 137688 209734
15107 209734 198441 191010 183180 189397 193295 264326 300091 348559 357206 369832 416917 501649
15095 501649 556488 619371 731273 857654 1072683 1293927 1508863 1681556 1843863 1925532
15085 1925532 1930762 1897057 1805207 1633471 1403431 1127444 975175 855895 733918 619481
15075 619481 485744 390053 383258 356534 325848 290019 261144 208696 156093 132591 198344
15064 198344 261737 245370 175467 119765 106724 84495 111032 157922 174170 149684 115372
$$ packed form
15143G2614R213M4993k7017J543M23L9158j2131l5102k6573n1989M0614N4310
15131A10056j6922K5631n753j0658R032p431k4965n0496L4329N2752L0893L5736
15119A82204L4820j0923r870k9725K0684j4357L1106m358l1614j5011j5268P2046
15107B09734j1293p431p830O217L898P1031L5765M8468Q647J2626M7085Q4732
15095E01649N4839O2883J11902J26381K15029K21244K14936J72693J62307Q1669
15085A925532N230l3705r1850j71736k30040k75987j52269j19280j21977j14437
15075F19481j33737r5691o795k6724l0686l5829k8875n2448n2603k3502O5753
15064A98344O3393j6367o9903n5702j3041k2229K6537M6890J6248k4486l4312
$$ plain form
15053 115372 123913 88787 75884 78470 65526 77082 103819 106281 88394 79024 95148 93442
15041 93442 81860 95878 103330 95268 102486 39928 69467 91682 72507 100234 99896 98837 123866
15028 123866 116527 98193 75568 80220 109308 144474 163053 172339 169593 127333 106185 83406
15016 83406 55992 95175 112215 147588 120130 125773 109696 133674 131945 185359 173939 176079
15004 176079 164166 176610 177048 129031 88963 125040 177178 147076 125091 127018 174484 224068
14992 224068 212124 176147 191500 201267 191328 204163 170108 85832 93267 107225 126844 117692
14980 117692 112830 133981 130240 139969 139698 173346 116428 79178 52785 65185 75670 95459
14968 95459 112819 127229 109000 120035 170508 144508 119708 89187 107565 149247 188708 166985
$$ packed form
15053A15372Q541l5126j2903K586j2944J1556K6737K462j7887r370J6124j706
15041I3442j1582J4018P452q062P218o2558K9539K2215j9175K7727l38j059K5029
15028A23866p339j8334k2625M652K9088L5166J8579R286k746m2260k1148k2779
15016H3406k7414L9183J7040L5373k7458N643j6077K3978j729N3414j1420K140
15004A76079j1913J2444M38m8017m0068L6077N2138l0102k1985J927M7466M9584
14992B24068j1944l5977J5353R767r939J2835l4055q4276P435J3958J9619r152
14980A17692m862K1151l741R729k71L3648n6918l7250k6393J2400J0485J9789
14968I5459J7360J4410j8229J1035N0473k6000k4800l0521J8378M1682L9461k1723
$$ plain form
14956 166985 157256 154372 146203 194406 180747 163314 171614 189131 202375 192368 115999 27134
14944 27134 -57628 -90778 -66834 -109312 -148307 -133822 -154088 -195860 -161756 -113436 -78230 -87893
14932 -87893 -121802 -111673 -92977 -69639 -35635 -3967 -629 6796 24084 46056 23600 30196
14920 30196 118296 167099 171222 164911 93219 79674 138537 126434 145471 121791 133493 119612
14908 119612 127060 180420 151893 162096 154266 95356 65237 145617 184352 211384 226003 230909
14896 230909 256316 266479 344162 429639 454484 443877 438323 466503 474174 461973 398887 373371
14884 373371 343123 293916 232998 202792 210570 225628 213296 205687 192881 155412 157146 169147
14872 169147 173172 175238 158115 168348 164671 175732 193536 180025 196658 178350 167508 170966
$$ packed form
14956A66985r729k884q169M8203j3659j7433Q300J7517J3244j0007p6369q8865
14944B7134q4762l3150K3944m2478l8995J4485k0266m1772L4104M8320L5206r663
14932h7893l3909J0129J8696K3338L4004L1668L338P425J7288K1972k2456O596
14920C0196Q8100M8803M123o311p1692j3545N8863j2103J9037k3680J1702j3881
14908A19612P448N3360k8527J0203p830n8910l0119Q0380L8735K7032J4619M906
14896B30909K5407J0163P7683Q5477K4845j0607n554K8180P671j2201o3086k5516
14884C73371l0248m9207o0918l0206P778J5058j2332p609j2806l7469J734J2001
14872A69147M025K066j7123J0233l677J1061J7804j3511J6633j8308j0842L458
$$ plain form
14860 170966 190606 226738 210735 192661 198776 205393 230067 226983 257590 284592 274049 253996
14848 253996 243724 281844 303031 303860 314633 300746 275792 231228 211205 216132 282315 281508
14836 281508 265933 283400 194992 191834 206152 240297 285635 270956 287828 275738 263309 256562
14824 256562 222621 200872 212693 224955 221868 207452 175022 177540 192015 194421 160285 176519
14812 176519 137613 106313 110743 135848 162169 160113 189338 211182 185618 191464 172884 162091
14800 162091 132441 107379 173712 180252 168206 195779 263134 287948 276645 262079 264069 300380
14788 300380 352153 390008 427107 405258 395641 442542 499984 477583 511509 577386 579683 552185
14776 552185 559919 550910 574412 616482 646701 609557 615603 653609 694346 724622 735238 734963
$$ packed form
14860A70966J9640L6132j6003j8074O115O617K4674l084L0607K7002j0543k0053
14848B53996j0272L8120K1187Q29J0773j3887k4954m4564k0023M927O6183q07
14836B81508j5575J7467q8408l158J4318L4145M5338j4679J6872j2090j2429o747
14824B56562l3941k1749J1821J2262l087j4416l2430K518J4475K406l4136J6234
14812A76519l8906l1300M430K5105K6321k056K9225K1844k5564N846j8580j0793
14800A62091k9650k5062O6333O540j2046K7573O7355K4814j1303j4566J990L6311
14788C00380N1773L7855L7099k1849r617M6901N7442k2401L3926O5877K297k7498
14776E52185P734r009K3502M2070L0219l7144O046L8006M0737L0276J0616k75
$$ plain form
14764 734963 704363 695378 742585 780782 805536 808627 777838 688315 658481 665646 675797 653243
14752 653243 639381 603504 613259 649832 651064 594255 602297 597547 609305 620872 643340 661644
14740 661644 713381 781474 779545 809172 812845 844134 911132 908821 868024 860739 920133 945747
14728 945747 922880 964313 1027562 1015245 1023506 1087402 1123241 1118871 1095540 1024914 1007722 1035019
14716 1035019 1063279 1099372 1123229 1162611 1235643 1304028 1303557 1285783 1326461 1389443 1408342 1440995
14704 1440995 1445713 1471587 1577196 1638683 1694670 1769368 1799635 1840166 1889872 1923333 1975955
14693 1975955 2049459 2133911 2191008 2277272 2389316 2460003 2508300 2619219 2728155 2839120
14683 2839120 2903438 3041030 3177614 3348286 3512629 3651634 3785723 3927599 4096408 4294213
$$ packed form
14764G34963l0600q985M7207L8197K4754L091l0789q9523k9834P165J0151k2554
14752F53243j3862l5877R755L6573J232n6809Q042m750J1758J1567K2468J8304
14740F61644N1737O8093j929K9627L673L1289O6998k311m0797p285N9394K5614
14728I45747k2867M1433O3249j2317Q261O3896L5839m370k3331p0626j7192K7297
14716A035019K8260L6093K3857L9382P3032O8385m71j7774M0678O2982J8899L2653
14704A440995M718K5874J05609O1487N5987P4698L0267M0531M9706L3461N2622
14693A975955P3504Q4452N7097Q6264J12044P0687M8297J10919J08936J10965
14683B839120O4318J37592J36584J70672J64343J39005J34089J41876J68809J97805
$$ plain form
14673 4294213 4523672 4767034 5025274 5299233 5558955 5858517 6226917 6678056 7107798
14664 7107798 7600980 8167289 8772020 9469365 10293779 11209363 12217168 13303532 14587735
14655 14587735 16064296 17662102 19576162 21867545 24528580 27620257 31228103 35532616
14647 35532616 40611149 46752768 54371291 64121238 77058609 94644101 118365889 149104237
14639 149104237 186184173 227070724 267809407 304014399 331852797 348603200 352787675
14632 352787675 344109111 323493613 292976131 255799012 215975202 177727406 144352961
14625 144352961 117580142 97419139 82445639 71109755 62139946 54781736 48522785
14618 48522785 43144758 38451856 34352888 30733571 27636944 24950123 22678665 20698451
$$ packed form
14673D294213K29459K43362K58240K73959K59722K99562L68400M51139M29742
14664G107798M93182N66309O04731O97345Q24414R15584J007805J086364J284203
14655A4587735J476561J597806J914060K291383K661035L091677L607846M304513
14647C5532616N078533O141619P618523R749947J2937371J7585492K3721788L0738348
14639A49104237L7079936M0886551M0738683L6204992K7838398J6750403M184475
14632C52787675q678564k0615498l0517482l7177119l9823810l8247796l3374445
14625A44352961k6772819k0161003j4973500j1335884q969809p358210o258951
14618D8522785n378027m692902m098968l619317l096627k686821k271458j980214
$$ plain form
14610 20698451 18957880 17483829 16237301 15139671 14110664 13218174 12405467 11679197
14602 11679197 11081640 10558111 10015711 9496932 9045160 8613737 8230899 7914994 7576883
14593 7576883 7239016 6924382 6734273 6595582 6386756 6159810 5981874 5778814 5619554
14584 5619554 5421275 5227347 5033129 4848065 4661319 4471818 4339614 4160909 3996136
14575 3996136 3904012 3806923 3677940 3553739 3466769 3347607 3232216 3131214 3040553 2978997
14565 2978997 2905059 2809398 2704758 2607389 2556360 2540923 2492024 2414805 2289139 2238943 2231529
14554 2231529 2212044 2127988 2058526 2022609 1923607 1816004 1772674 1704648 1657770 1619724 1567303
14543 1567303 1482853 1410503 1313153 1212363 1207846 1199915 1118482 1070728 1084853 1032977 994970
$$ packed form
14610B0698451j740571j474051j246528j097630j029007q92490q12707p26270
14602A1679197n97557n23529n42400n18779m51772m31423l82838l15905l38111
14593G576883l37867l14634j90109j38691k08826k26946j77936k03060j59260
14584E619554j98279j93928j94218j85064j86746j89501j32204j78705j64773
14575C996136r2124r7089j28983j24201q6970j19162j15391j01002r0661o1556
14565B978997p3938r5661j04640r7369n1029j5437m8899p7219j25666n0196p414
14554B231529j9485q4056o9462l5917r9002j07603m3330o8026m6878l8046n2421
14543A567303q4450p2350r7350j00790m517p931q1433m7754J4125n1876l8007
$$ plain form
14532 994970 951731 941252 952648 954400 960483 951722 955374 948596 944754 955245 935661 925890 933903
14519 933903 955572 955468 924278 877366 863066 885318 884547 879789 825041 729789 678341 684920 713261
14506 713261 702659 655806 583387 533345 535027 552902 523080 478369 505487 563382 524732 486809
14494 486809 471234 493722 459371 380287 332001 369028 425094 382970 291210 252899 219434
14483 219434 193748 216711 257670 241778 211790 176880 166616 210319 260530 293734 339611
14472 339611 393942 427300 439924 396138 376018 326362 283362 245663 281991 306125 323197
14461 323197 297888 244936 240531 321785 296026 254745 253792 283322 289780 291224 257080 213051
14449 213051 184030 171329 160673 185514 240225 256841 233523 198229 222727 219302 219600 176129
$$ packed form
14532I94970m3239j0479J1396J752O083q761L652o778l842J0491j9584r771Q013
14519I33903K1669j04l1190m6912j4300K2252p71m758n4748r5252n1448O579K8341
14506G13261j0602m6853p2419n0042J682J7875k9822m4711K7118N7895l8650l7923
14494D86809j5575K2488l4351p9084m8286L7027N6066m2124r1760l8311l3465
14483B19434k5686K2963M0959j5892k9988l4910j0264M3703N0211L3204M5877
14472C39611N4331L3358J2624m3786k0120m9656m3000l7699L6328K4134J7072
14461C23197k5309n2952m405Q1254k5759m1281r53K9530O458J444l4144m4029
14449B13051k9021j2701j0656K4841N4711J6616k3318l5294K4498l425K98m3471
$$ plain form
14437 176129 106406 87977 108720 129747 128923 127754 98769 125381 144825 100081 46209 13016
14425 13016 40741 23573 -8214 19194 83532 83434 139411 166130 133209 99365 106991 114664 81927
14412 81927 81841 105489 123109 144808 122310 72863 73215 78975 111938 154360 152142 159640 170296
14399 170296 153486 125516 101889 112995 85972 80624 109419 172858 173834 174434 159376 79073
14387 79073 79185 144772 142238 132000 156831 195415 182148 175287 192234 199674 207725 132824 85222
14374 85222 102344 154912 169528 167556 173820 185180 125987 117085 118212 146654 166504 171142 182197
14361 182197 157146 85931 83104 99358 160287 156653 147857 135958 124118 133175 99071 65037
14349 65037 94943 133328 156562 164749 159990 144305 145407 135970 127681 127952 114092 131945 205970
$$ packed form
14437A76129o9723j8429K0743K1027q24j169k8985K6612J9444m4744n3872l3193
14425A3016K7725j7168l1787K7408O4338r8N5977K6719l2921l3844P626P673l2737
14412H1927q6K3648J7620K1699k2498m9447L52N760L2963M2422k218P498J0656
14399A70296j6810k7970k3627J1106k7023n348K8795O3439R76O00j5058q0303
14387G9073J12O5587k534j0238K4831L8584j3267o861J6947P440Q051p4901m7602
14374H5222J7122N2568J4616j972O264J1360n9193q902J127K8442J9850M638J1055
14361A82197k5051p1215k827J6254O0929l634q796j1899j1840R057l4104l4034
14349F5037K9906L8385K3234Q187m759j5685J102r437q289K71j3860J7853P4025
$$ plain form
14336 205970 227542 261719 305752 305804 297356 298583 269502 306193 303847 276132 254420 239901 230033
14323 230033 175666 131406 104111 85790 81151 51593 8399 -25469 -55105 -45093 -74443 -57487
14311 -57487 -21889 -12337 -9598 -2203 34257 61259 71334 29109 5461 40589 55214 27486
14299 27486 43187 42107 44209 19589 35155 26908 13730 15443 -34 28255 50313 83965
14287 83965 110312 61862 113642 107911 88572 74510 30943 10278 65686 138038 139802 99313
14275 99313 87174 122797 174886 166216 111748 120545 175926 177100 150260 180096 213559 231512
14263 231512 227590 232784 303755 368562 426537 493599 639453 835600 990631 1261195 1591014
14252 1591014 1915314 2165631 2342563 2303681 2101370 1746153 1433056 1157619 912277 734913
$$ packed form
14336B05970K1572L4177M4033N2q448J227k9081L6691k346k7715k1712j4519r868
14323B30033n4367m4260k7295j8321m639k9558m3194l3868k9636J0012k9350J6956
14311e7487L5598R552K739P395L6460K7002J0075m2225k3648L5128J4625k7728
14299B7486J5701j080K102k4620J5566q247j3178J713j5477K8289K2058L3652
14287H3965K6347m8450N1780n731j9339j4062m3567k0665N5408P2352J764m0489
14275I9313j2139L5623N2089q670n4468Q797N5381J174k6840K9836L3463J7953
14263B31512l922N194P0971O4807N7975O7062J45854J96147J55031K70564L29819
14252A591014L24300K50317J76932l8882k02311l55217l13097k75437k45342j77364
$$ plain form
14242 734913 663790 567719 483948 472834 420603 377251 281606 250638 289705 306227 273631
14231 273631 256472 269850 247638 231837 197065 186967 224065 240212 234029 234591 133183 92964
14219 92964 118741 160893 185266 178172 154739 141669 219636 296531 263475 243628 228289 201246
14207 201246 201836 232075 237819 173427 137823 155209 165009 166173 146729 137338 172515 188691 258608
14194 258608 291295 313650 302541 295899 288634 276192 309429 357237 423357 509246 535567 597451
14182 597451 732999 881551 1064351 1251785 1467976 1658688 1736323 1850071 1951825 1957499
14172 1957499 1833139 1637020 1490044 1298171 1092766 929981 788944 667304 599305 538659
14162 538659 486149 426496 361849 350235 342012 377268 337101 314949 335420 310163 276169 244813
$$ packed form
14242G34913p1123r6071q3771j1114n2231m3352r5645l0968L9067J6522l2596
14231B73631j7159J3378k2212j5801l4772j0098L7098J6147o183N62j01408m0219
14219I2964K5777M2152K4373p094k3433j3070P7967P6895l3056j9847j5339k7043
14207B01246N90L0239N744o4392l5604J7386R800J164j9444r391L5177J6176O9917
14194B58608L2687K2355j1109o642p265j2442L3237M7808O6120Q5889K6321O1884
14182E97451J35548J48552J82800J87434K16191J90712P7635J13748J01754N674
14172A957499j24360j96119j46976j91873k05405j62785j41037j21640o7999o0646
14162E38659n2510n9653o4647j1614q223L5256m0167k2152K0471k5257l3994l1356
$$ plain form
14150 244813 213998 220125 238342 199898 176224 183746 223731 202419 186708 191748 192827 156214
14138 156214 126923 129167 150734 147551 171591 184439 182906 217910 236042 266481 274220 255969
14126 255969 226384 183064 188559 177841 114875 157957 229661 237901 245626 212987 195452 218736
14114 218736 194048 180425 212699 178524 157688 188844 197239 189578 186324 202571 253546 262247
14102 262247 258460 206526 202447 173808 146245 127243 137520 175157 202964 231552 213703 160930
14090 160930 151231 171821 116276 91126 82257 95587 118586 106450 40859 56123 13208 -70884
14078 -70884 -90275 -163574 -216013 -186044 -150493 -125485 -109239 -84603 -78935 -62198 -38815 13639
14066 13639 31743 50704 43158 31944 14683 -4691 16130 45200 57621 56878 82822 72383
$$ packed form
14150B44813l0815O127J8217l8444k3674P522L9985k1312j5711N040J079l6613
14138A56214k9291K244K1567l183K4040J2848j533L5004J8132L0439P739j8251
14126B55969k9585m3320N495j0718o2966M3082P1704Q240P725l2639j7535K3284
14114B18736k4688j3623L2274l4175k0836L1156Q395p661l254J6247N0975Q701
14102B62247l787n1934m079k8639k7563j9002J0277L7637K7807K8588j7849n2773
14090A60930r699K0590n5545k5150q869J3330K2999j2136o5591J5264m2915q4092
14078g0884j9391p3299n2439K9969L5551K5008J6246K4636N668J6737K3383N2454
14066A3639J8104J8961p546j1214j7261j9374K0821K9070J2421p43K5944j0439
$$ plain form
14054 72383 66352 82312 77859 98272 131437 103911 94874 96597 119120 141111 138402 116503 114023
14041 114023 98800 98573 115836 125310 142554 151546 187693 252889 265361 228671 259291 324905
14029 324905 364712 390211 464133 568426 613069 601036 599953 583740 565727 529634 490968
14018 490968 392704 320403 292091 249784 254698 271026 255690 248066 209748 182488 187841 197211
14006 197211 195551 201047 205413 208622 181662 190390 216627 231237 260849 254626 231988 221500 182717
13993 182717 152422 152287 154485 161079 210463 233612 220301 241240 277739 322226 240123 208583
13981 208583 196749 248670 256627 263721 255535 277156 295318 243692 222573 230548 179354 165797
13969 165797 183450 235371 248657 262538 275180 305925 321876 276433 272308 291305 283161 275788
$$ packed form
14054G2383o031J5960m453K0413L3165k7526r037J723K2523K1991k709k1899k480
14041A14023j5223k27J7263R474J7244Q992L6147O5196J2472l6690L0620O5614
14029C24905L9807K5499P3922J04293M4643j2033j083j6213j8013l6093l8666
14018D90968r8264p2301k8312m2307M914J6328j5336p624l8318k7260N353R370
14006A97211j660N496M366L209k6960Q728K6237J4610K9612o223k2638j0488l8783
13993A82717l0295j35K198O594M9384K3149j3311K0939L6499M4487q2103l1540
13981B08583j1834N1921P957P094q186K1621J8162n1626k1119P975n1194j3557
13969A65797J7653N1921J3286J3881J2642L0745J5951m5443m125J8997q144p373
$$ plain form
13957 275788 235426 209767 220787 263383 281216 263105 252510 265668 272689 287130 278982 294593
13945 294593 362998 371554 350457 334720 348149 341368 292609 246119 228892 233865 219899 186872
13933 186872 194385 190814 174065 216165 275819 312107 355513 414848 486401 557440 585649 609948
13921 609948 666509 634342 596165 580435 610222 639073 646038 660265 646572 659953 698270 634077
13909 634077 601106 574833 579769 546388 541662 594447 688022 755482 820873 852691 847249 866730
13897 866730 925829 1011752 1087794 1102830 1080576 1086366 1137026 1200990 1263270 1301665 1368415 1336242
13885 1336242 1329613 1323837 1293639 1223714 1126157 1061322 981096 923107 978819 976855 951348 961199
13873 961199 930905 923986 974959 997226 988322 923420 874343 894540 910284 975768 948242 929462
$$ packed form
13957B75788m0362k5659J1020M2596J7833j8111j0595J3158P021J4441q148J5611
13945B94593O8405Q556k1097j5737J3429o781m8759m6490j7227M973j3966l3027
13933A86872P513l571j6749M2100N9654L6288M3406N9335P1553P1039K8209K4299
13921F09948N6561l2167l8177j5730K9787K8851O965J4227j3693J3381L8317o4193
13909F34077l2971k6273M936l3381m726N2785R3575O7460O5391L1818n442J9481
13897H66730N9099Q5923P6042J5036k2254N790N0660O3964O2280L8395O6750l2173
13885A336242o629n776l0198o9925r7557o4835q0226n7989N5712j964k5507R851
13873I61199l0294o919N0973K2267q904o4902m9077K0197J5744O5484k7526j8780
$$ plain form
13861 929462 937109 914636 926836 979515 1027033 1030618 1016973 1035343 1019697 1059087 1140324 1172581
13849 1172581 1194123 1284647 1320507 1389721 1400764 1420805 1424410 1441603 1512864 1569395 1631791
13838 1631791 1692142 1708585 1734336 1794071 1822325 1848222 1931097 1990166 2049307 2097815 2198380
13827 2198380 2280132 2319859 2369916 2429241 2504354 2594780 2728208 2858587 2991613 3137487
13817 3137487 3253781 3387094 3509478 3654819 3799399 3975215 4194269 4417757 4654150
13808 4654150 4869726 5103719 5342956 5632900 5975986 6397495 6864842 7305234 7764293
13799 7764293 8259893 8824086 9402686 10036418 10847134 11834419 12957449 14254289 15781048
13790 15781048 17615911 19718542 22043119 24569416 27233103 30136322 33458231 37469025
$$ packed form
13861I29462P647k2473J2200N2679M7518L585j3645J8370j5646L9390Q1237L2257
13849A172581K1542R0524L5860O9214J1043K0041L605J7193P1261N6531O2396
13838A631791O0351J6443K5751N9735K8254K5897Q2875N9069N9141M8508J00565
13827B198380Q1752L9727N0057N9325P5113R0426J33428J30379J33026J45874
13817C137487J16294J33313J22384J45341J44580J75816K19054K23488K36393
13808D654150K15576K33993K39237K89944L43086M21509M67347M40392M59059
13799G764293M95600N64193N78600O33732Q10716R87285J123030J296840J526759
13790A5781048J834863K102631K324577K526297K663687K903219L321909M010794
$$ plain form
13782 37469025 42327683 48501465 56426036 66822254 80755451 100150139 127994982
13775 127994982 167807459 221779287 286804462 353436812 408650561 438846012 436137236
13768 436137236 402484292 346722361 281940719 221078464 172155375 136931891 112654297
13761 112654297 95763193 83603450 74614901 67747422 62453119 58411997 55346572 52896156
13753 52896156 50671640 48225466 45291108 41780586 37746225 33521154 29457171 25815792
13745 25815792 22832399 20431445 18501438 16986706 15729512 14633517 13655958 12838109
13737 12838109 12157403 11579132 11023472 10539445 10006857 9514697 9058705 8561304 8127540
13728 8127540 7766283 7466860 7199776 6955316 6779242 6683973 6614808 6685434 6896152 7258077
$$ packed form
13782C7469025M858658O173782P924571J0396218J3933197J9394688K7844843
13775A27994982L9812477N3971828O5025175O6632350N5213749L0195451k708776
13768D36137236l3652944n5761931o4781642o0862255m8923089l5223484k4277594
13761A12654297j6891104j2159743q988549o867479n294303m041122l065425k450416
13753E2896156k224516k446174k934358l510522m034361m225071m063983l641379
13745B5815792k983393k400954j930007j514732j257194j095995r77559q17849
13737A2838109o80706n78271n55660m84027n32588m92160m55992m97401m33764
13728H127540l61257k99423k67084k44460j76074r5269o9165P0626K10718L61925
$$ plain form
13718 7258077 7797799 8421748 9121272 9730543 9966567 9777359 9286335 8598073 7895308
13709 7895308 7219740 6606058 6093699 5684129 5273443 4904913 4536836 4223301 4004703
13700 4004703 3769464 3571422 3410605 3296599 3198907 3082251 2933949 2815597 2799657 2777936
13690 2777936 2823768 2911053 3017331 3097500 3182316 3224345 3168876 3072945 2930010 2710537 2448660
13679 2448660 2260744 2126289 1964212 1789326 1678038 1650684 1616379 1555296 1460776 1354921
13669 1354921 1258314 1186292 1149748 1120055 1102839 1064096 1048435 1078865 1119252 1092686 1040326
13658 1040326 1005291 977660 963560 998645 1036682 1039548 1078801 1088528 1029529 968483 934912 864971
13646 864971 831324 823678 846014 797563 769533 740080 738316 737895 720471 668204 648029 701745
$$ packed form
13718G258077N39722O23949O99524O09271K36024j89208m91024o88262p02765
13709G895308o75568o13682n12359m09570m10686l68530l68077l13535k18598
13700D004703k35239j98042j60817j14006r7692j16656j48302j18352j5940k1721
13690B777936M5832Q7285J06278Q0169Q4816M2029n5469r5931j42935k19473k61877
13679B448660j87916j34455j62077j74886j11288k7354l4305o1083r4520j05855
13669A354921r6607p2022l6544k9693j7216l8743j5661L0430M0387k6566n2360
13658A040326l5035k7631j4100L5085L8037K866L9253R727n8999o1046l3571o9941
13646H64971l3647p646K2336m8451k8030k9453j764m21j7424n2267k0175N3716
$$ plain form
13634 701745 747558 744258 745153 737216 694835 677880 642235 599417 517481 400973 368210 367263
13622 367263 353362 310346 277722 244908 221161 200570 208905 263892 261316 288022 354360 403400
13610 403400 428378 421222 426834 438435 423221 396130 374006 338010 326499 368270 391369 345627
13598 345627 237637 225553 236844 239873 171417 198373 239761 236615 253279 236585 229584 235438
13586 235438 262795 238886 243225 224457 212457 194782 201542 173451 116133 104436 98770 34516
13574 34516 77195 82461 84072 66568 96062 121677 109859 101321 98382 80897 35541 15132
13562 15132 13080 5507 -24099 -11408 67679 98592 95863 39005 24715 37704 62920 86727
13550 86727 64838 21169 -10925 34157 111039 116489 54832 49216 41910 62697 40938 -11861
$$ packed form
13634G01745M5813l300Q95p937m2381j6955l5645m2818q1936j16508l2763r47
13622C67263j3901m3016l2624l2814k3747k0591Q335N4987k576K6706O6338M9040
13610D03400K4978p156N612J1601j5214k7091k2124l5996j1511M1771K3099m5742
13598C45627j07990j2084J1291L029o8456K6956M1388l146J6664j6694p001N854
13586B35438K7357k3909M339j8768j2000j7675O760k8091n7318j1697n666o4254
13574C4516M2679N266J611j7504K9494K5615j1818q538k939j7485m5356k0409
13562A5132k052p573k9606J2691P9087L0913k729n6858j4290J2989K5216K3807
13550H6727k1889m3669l2094M5082P6882N450o1657n616p306K0787k1759n2799
$$ plain form
13538 -11861 4616 85142 100390 57205 64520 78407 65659 48183 40660 78777 65245 62605
13526 62605 23523 39811 37318 29266 56501 85061 107631 126260 138877 97046 68309 56704
13514 56704 73140 28411 89747 133231 139461 153902 124849 65656 37188 58474 56258 83421
13502 83421 129186 140953 144385 117769 97131 52811 32663 24978 49038 78953 92372 73170
13490 73170 83522 67384 69499 67404 16841 -11445 -29999 -14717 18833 21538 22677 31939 52403
13477 52403 55257 100641 91017 95443 112726 147879 148277 170778 177117 200138 206644 256620 320024
13464 320024 302891 300613 262760 210284 160439 96795 30096 -12743 -28404 -39581 -39166 -74635
13452 -74635 -82030 -86627 -59673 -92157 -120604 -55525 29792 38045 -6826 -43571 -28294 -20653
$$ packed form
13538a1861J6477Q0526J5248m3185P315J3887j2748j7476p523L8117j3532k640
13526F2605l9082J6288k493q052K7235K8560K2570J8629J2617m1831k8737j1605
13514E6704J6436m4729O1336M3484O230J4441k9053n9193k8468K1286k216K7163
13502H3421M5765J1767L432k6616k0638m4320k0148p685K4060K9915J3419j9202
13490G3170J0352j6138K115k095n0563k8286j8554J5282L3550K705J139R262K0464
13477E2403K854M5384r624M426J7283L5153L98K2501O339K3021O506M9976O3404
13464C20024j7133k278l7853n2476m9845o3644o6699m2839j5661j1177M15l5469
13452g4635p395m597K6954l2484k8447O5079Q5317Q253m4871l6745J5277P641
$$ plain form
13440 -20653 -27493 -83230 -122658 -116906 -95115 -141589 -112951 -91811 -41339 -16091 -55458 -67813
13428 -67813 -47807 -49358 -40515 -31327 -61728 -87848 -53643 -47356 -53613 -45769 16264 38580 -15139
13415 -15139 7418 132 -43930 -33870 -72737 -68232 -19697 -21355 -28709 -25378 -64617 -108898 -143704
13402 -143704 -200205 -176992 -164090 -181537 -206915 -195354 -173678 -122608 -112733 -151424 -183277 -179907
13390 -179907 -167772 -126024 -100346 -84820 -55064 -27444 -10079 -7166 18668 9356 -32726 -26131
13378 -26131 -28987 -100932 -116661 -114734 -77374 -49950 -63037 -90327 -76143 -38036 19270 -4115
13366 -4115 -100938 -122463 -83261 -49211 -2026 8244 -27068 -71724 -113315 -100302 -55596 -4191
13354 -4191 16957 -18850 3058 -20455 -30499 -9666 -34979 -11898 -20628 -28102 16139 28247
$$ packed form
13440b0653o840n5737l9428N752K1791m6474K8638K1140N0472K5248l9367j2355
13428f7813K0006j551Q843R188l0401k6120L4205O287o257P844O2033K2316n3719
13415a5139K2557p286m4062J0060l8867M505M8535j658p354L331l9239m4281l4806
13402a43704n6501K3213J2902j7447k5378J1561K1676N1070R875l8691l1853L370
13390a79907J2135M1748K5678J5526K9756K7620J7365K913K5834r312m2082O595
13378b6131k856p1945j5729J927L7360K7424j3087k7290J4184L8107N7306k3385
13366d115r6823k1525L9202L4050M7185J0270l5312m4656m1591J3013M4706N1405
13354d191K1148l5807K1908k3513j0044K0833k5313K3081q730p474M4241J2108
$$ plain form
13342 28247 14984 -18323 -75814 -98626 -60410 -38225 -37958 -36507 -1788 7114 16902 -25945 -66578
13329 -66578 -69217 -47342 -44381 -68306 -78647 -62121 -28904 6460 10656 23168 -2582 -13398
13317 -13398 2407 -56823 -79599 -42112 -4509 6220 25292 64363 112537 45262 -7303 6639
13305 6639 47799 64270 79783 42770 52520 115153 122715 121304 87937 126546 188751 204716
13293 204716 259491 345836 430639 517869 669281 829129 1037963 1316205 1665694 1969051
13283 1969051 2226694 2278743 2132189 1860012 1514810 1166897 868989 684872 549936 455407
13273 455407 409179 389630 331365 345307 336803 294397 257867 251882 238492 189794 188192 154261
13261 154261 118313 118987 120187 119255 99086 97618 73901 75901 63582 58286 27475 -18516 -46143
$$ packed form
13342B8247j3263l3307n7491k2812L8216K2185K67J451L4719Q902R788m2847m0633
13329f6578k639K1875K961k3925j0341J6526L3217L5364M196J2512k5750j0816
13317a3398J5805n9230k2776L7487L7603J0729J9072L9071M8174o7275n2565J3942
13305F639M1160J6471J5513l7013R750O2633P562j411l3367L8609O2205J5965
13293B04716N4775Q6345Q4803Q7230J51412J59848K08834K78242L49489L03357
13283A969051K57643N2049j46554k72177l45202l47913k97908j84117j34936r4529
13273D55407m6228j9549n8265J3942q504m2406l6530n985j3390m8698j602l3931
13261A54261l5948O74J200r32k0169j468k3717K000j2319n296l0811m5991k7627
$$ plain form
13248 -46143 -43585 -38564 -16325 9475 639 -948 61066 35335 -11304 -73580 -120092 -123781 -130891
13235 -130891 -93387 -75362 -69305 -351 60414 41073 30394 20436 11959 61392 53137 79663
13223 79663 70684 14206 -6276 -17597 -16691 -11192 -11007 39411 2880 -5067 35398 44115 71321
13210 71321 99355 57622 -32043 -10898 15556 43809 107466 86349 36605 72267 124970 105211
13198 105211 77405 101160 136898 135662 68660 24204 15918 3391 20078 -21282 11542 61432
13186 61432 91088 102442 128500 141825 162533 218359 178467 79391 40761 21506 60229 121908
13174 121908 41929 28947 40884 48671 47846 13317 -27617 -59913 -53713 -88867 -61264 -25649
13162 -25649 -36405 -64791 -45731 -29144 -22908 -3059 11269 28647 84174 106504 62790 -2045
$$ packed form
13248d6143K558N021K2239K5800q836j587O2014k5731m6639o2276m6512l689p110
13235a30891L7504J8025O057O8954O0765j9341j0679r958q477M9433q255K6526
13223G9663q979n6478k0482j1321R06N499J85N0418l6531p947M0465Q717K7206
13210G1321K8034m1733q9665K1145K6454K8253O3657k1117m9744L5662N2703j9759
13198A05211k7806K3755L5738j236o7002m4456q286j2527J6687m1360L2824M9890
13186F1432K9656J1354K6058J3325K0708N5826l9892r9076l8630j9255L8723O1679
13174A21908p9979j2982J1937P787q25l4529m0934l2296O200l5154K7603L5615
13162b5649j0756k8386J9060J6587O236J9849J4328J7378N5527K2330m3714o4835
$$ plain form
13150 -2045 4938 22776 -51566 -73252 8047 -3245 11878 37478 16589 17821 70915 123922
13138 123922 210393 254799 252189 230495 221049 133617 84056 67944 59562 25738 -12392 4582
13126 4582 -2801 -15162 10251 11316 18638 42286 68491 27210 6552 -9721 6524 6660 13374
13113 13374 -46606 -75587 -41489 -30354 -19977 15549 19869 87714 39950 -46819 -88188 -95000
13101 -95000 -75776 -68452 -65261 -42201 13114 -18276 -31463 16481 22060 37561 18873 7306
13089 7306 -6863 -168 -19181 19564 79059 58715 30362 32640 61250 68053 57944 13507
13077 13507 -29004 -56731 -15916 -36937 -34130 -2301 658 4403 26463 66355 44251 12810
13065 12810 -36580 -28671 8022 12525 -8192 15321 51927 25270 49824 73129 77997 -29808
$$ packed form
13150b045O983J7838p4342k1686Q1299j1292J5123K5600k0889J232N3094N3007
13138A23922Q6471M4406k610k1694r446q7432m9561j6112q382l3824l8130J6974
13126D582p383j2361K5413J065P322K3648K6205m1281k0658j6273J6245J36O714
13113A3374n9980k8981L4098J1135J0377L5526M320O7845m7764q6769m1369o812
13101i5000J9224P324L191K3060N5315l1390j3187M7944N579J5501j8688j1567
13089G306j4169O695j9013L8745N9495k0344k8353K278K8610O803j0109m4437
13077A3507m2511k7727M0815k1021K807L1829K959L745K2060L9892k2104l1441
13065A2810m9390P909L6693M503k0717K3513L6606k6657K4554K3305M868j07805
$$ plain form
13053 -29808 -63479 -78584 -59917 -21563 11831 -9804 -15227 12813 -10630 -26993 -44664 -65847
13041 -65847 -64547 -54499 -20120 1641 11056 -5309 -377 -680 -39291 16561 35899 40182 10512
13028 10512 -8168 4132 -27976 -98001 -135304 -116008 -109442 -52216 -41457 -48689 6078 13225
13016 13225 -30244 -50443 5408 4972 -49270 -20169 37482 20525 20789 50837 34477 39301 48657
13003 48657 23458 38691 70220 71506 57739 60626 103250 110904 83890 47511 69177 78304
12991 78304 97392 137931 228806 223537 207822 180393 135035 175176 172402 165377 150148 133384
12979 133384 87686 42539 14887 3279 12242 5310 26379 46734 31033 7624 -24192 -54615
12967 -54615 -30421 -38832 -57066 -62411 -23248 2657 23850 45046 13601 25314 33387 28103
$$ packed form
13053b9808l3671j5105J8667L8354L3394k1635n423K8040k3443j6363j7671k1183
13041f5847J300J0048L4379K1761R415j6365M932l03l8611N5852J9338M283k9670
13028A0512j8680J2300l2108p0025l7303J9296O566N7226J0759p232N4767P147
13016A3225m3469k0199N5851m36n4242K9101N7651j6957K64L0048j6360M824R356
13003D8657k5199J5233L1529J286j3767K887M2624P654k7014l6379K1666R127
12991G8304J9088M0539R0875n269j5715k7429m5358M0141k774p025j5229j6764
12979A33384m5698m5147k7652j1608Q963o932K1069K0355j5701k3409l1816l0423
12967e4615K4194q411j8234n345L9163K5905K1193K1196l1445J1713Q073n284
$$ plain form
12955 28103 41696 15732 -26925 -62515 -49388 -12951 -57665 -31938 -20620 -69652 -73280 -95526
12943 -95526 -63013 8582 2445 -23426 -21848 30881 42976 25181 2483 31897 27079 -5944
12931 -5944 1330 -9233 -7552 -13402 11601 -33941 -42525 -37244 -911 11577 41028 40213 8284
12918 8284 -15557 -63136 -83776 -82183 -50617 -32459 -64696 -76318 -57626 -19349 15148 24989
12906 24989 34806 18979 12366 -14810 -21828 -31672 -87898 -93262 -106402 -121056 -83931 -21108 8457
12893 8457 18617 -3483 -13744 19753 36335 5307 -26390 -52514 -3172 9578 19437 47053
12881 47053 53319 35164 33340 52502 67538 51683 49213 8081 -12735 -22504 -60490 -56298 -44325
12868 -44325 -62553 -65388 -55724 -99908 -134446 -129431 -119979 -102251 -35313 -29437 -54388 -43602 -2653
$$ packed form
12955B8103J3593k5964m2657l5590J3127L6437m4714K5727J1318m9032l628k2246
12943i5526L2513P1595o137k5871J578N2729J2095j7795k2698K9414m818l3023
12931e944P274j0563J681n850K5003m5542q584N281L6333J2488K9451q15l1929
12918H284k3841m7579k0640J593L1566J8158l2237j1622J8692L8277L4497R841
12906B4989R817j5827o613k7176p018r844n6226n364j3140j4654L7125O2823K9565
12893H457J0160k2100j0261L3497J6582l1028l1697k6124M9342J2750R859K7616
12881D7053O266j8155j824J9162J5036j5855k470m1132k0816r769l7986M192J1973
12868d4325j8228k835R664m4184l4538N015R452J7728O6938N876k4951J0786M0949
$$ plain form
12855 -2653 -12499 -3871 3137 59 19866 -4723 -22770 -6344 -7193 1020 41841 75169 153079
12842 153079 169901 171182 104389 124907 166009 164701 105802 62867 104980 160644 148239 141674
12830 141674 113754 130604 135982 76365 58901 22281 -10088 10880 16397 -12595 -48282 -60523
12818 -60523 -31022 -28385 18643 11828 4027 -14717 -57075 -60464 -78787 -91209 -52274 -24717
12806 -24717 -48975 -60330 -15301 25886 28204 23623 51718 69859 85879 21759 -55929 -62614
12794 -62614 -36436 8830 24641 1819 17778 69158 50071 47532 -7738 1905 14147 -20762
12782 -20762 -74545 -67200 -7773 4603 61649 66768 85128 98859 67344 64619 66503 44841
12770 44841 49451 23930 6879 -41676 -24732 1233 13945 -12303 -49804 -71307 -85719 -37054
$$ packed form
12855b653r846Q628P008l078J9807k4589j8047J6426q49Q213M0821L3328P7910
12842A53079J6822J281o6793K0518M1102j308n8899m2935M2113N5664j2405o565
12830A41674k7920J6850N378n9617j7464l6620l2369K0968N517k8992l5687j2241
12818f0523K9501K637M7028o815p801j8744m2358l389j8323j2422L8935K7557
12806b4717k4258j1355M5029M1187K318m581K8095J8141J6020o4120p7688o685
12794f2614K6178M5266J5811k2822J5959N1380j9087k539n5270R643J2242l4909
12782b0762n3783P345N9427J2376N7046N119J8360J3731l1515k725J884k1662
12770D4841M610k5521j7051m8555J6944K5965J2712k6248l7501k1503j4412M8665
$$ plain form
12758 -37054 -37165 -50653 -41685 -66442 -61789 -38774 -32825 -102218 -109071 -62669 -31430 1335 3441
12745 3441 -40418 -46680 -20201 -17267 -4311 -1065 -49267 -68044 -36188 1604 1972 -20873 -37627
12732 -37627 -78112 -47916 4740 5517 -7703 25305 32174 23805 -20503 -63006 -118896 -53672
12720 -53672 8991 -13546 -39448 -41876 -31201 -45673 -36724 -1695 -25295 -83433 -79993 -80976 -74150
12707 -74150 1339 10331 -29385 -38855 -14527 7764 9718 7197 -8510 -12648 -20258 3455 8641
12694 8641 -84228 -85821 -93433 -127073 -154284 -139821 -126891 -101811 -44483 16506 42400 44775
12682 44775 21854 25371 9432 25392 30589 43404 74637 75010 61577 33898 -1451 -19000
12670 -19000 -20242 11855 3011 27334 7014 -11617 -38559 -69417 -74758 -62601 -61600 -68147 -106107
$$ packed form
12758c7054j11j3488Q968k4757M653K3015N949o9393o853M6402L1239L2765K106
12745C441m3859o262K6479K934J2956L246m8202j8777L1856L7792L68k2845j6754
12732c7627m0485L0196N2656P77j3220L3008O869q369m4308m2503n5890O5224
12720e3672O2663k2537k5902k428J0675j4472Q949L5029k3600n8138L440r83O826
12707g4150P5489Q992l9716r470K4328K2291J954k521j5707m138p610K3713N186
12694H641r2869j593p612l3640k7211J4463J2930K5080N7328O0989K5894K375
12682D4775k2921L517j5939J5960N197J2815L1233L73j3433k7679l5349j7549
12670a9000j242L2097q844K4323k0320j8631k6942l0858n341J2157J001o547l7960
$$ plain form
12657 -106107 -66493 -30805 -15114 -6963 -7071 23081 22484 -19164 -35658 35741 57511 25038
12645 25038 -68696 -75352 -56483 3411 55593 64987 54052 17564 -41048 -107405 -112000 -75694
12633 -75694 -67015 -45701 -24941 -87502 -147809 -124245 -86355 -113973 -115780 -25527 24566 -413
12621 -413 -30524 -58204 -43164 -57016 -56162 -56380 -44231 -8026 -28476 -50463 -28198 -7880 -26885
12608 -26885 -15661 -27104 -34765 -8128 20129 5658 14158 -6123 -14627 5833 -5114 -13294
12596 -13294 -19719 -47922 -82788 -106291 -51050 -19369 9326 43412 1427 -5557 -13705 -37174
12584 -37174 -24186 -8438 -13159 -10663 -958 -2438 44950 13223 2502 25056 38569 33528 19204
12571 19204 16735 -21904 -32605 -44748 -25812 -21912 -23039 -6369 6353 17980 40044 60060
$$ packed form
12657a06107L9614L5688J5691Q151j08L0152n97m1648j6494P1399K1770l2473
12645B5038r3734o656J8869N9894N2182R394j0935l6488n8612o6357m595L6306
12633g5694Q679K1314K0760o2561o0307K3564L7890k7618j807R0253N0093k4979
12621d13l0111k7680J5040j3852Q54k18J2149L6205k0450k1987K2265K0318j9005
12608b6885J1224j1443p661K6637K8257j4471Q500k0281q504K0460j0947q180
12596a3294o425k8203l4866k3503N5241L1681K8695L4086m1985o984q148k3469
12584c7174J2988J5748m721K496R705j480M7388l1727j0721K2554J3513n041j4324
12571A9204k469l8639j0701j2143J8936L900j127J6670J2722J1627K2064K0016
$$ plain form
12559 60060 20845 -43806 -59631 -64198 11165 38333 -7537 -33295 -24790 -40377 -85237 -82181
12547 -82181 -48752 -19359 19280 32014 36681 11566 -16162 -80220 -75656 -92132 -84704 -49611
12535 -49611 -16870 -13182 -43727 -48941 -25682 -31631 -55288 -53006 -67681 -69356 -79220 -73079 -8755
12522 -8755 34127 -10282 -19261 -30840 -28142 8275 71011 63475 58113 107772 132648 129331 69676
12509 69676 10690 -6636 -20077 -58278 -57133 -45285 20420 60409 68786 58856 67502 36904
12497 36904 13984 13794 -39604 -65961 -101697 -63135 -61812 8055 363 -31421 -21455 20409 29517
12484 29517 -20750 -7885 -21920 -17726 -35812 -79692 -79640 -81877 -80336 -64848 -69229 -50484 -2750
12471 -2750 30131 24922 9636 15879 36114 7281 -25964 -92431 -90418 -50899 -28779 -45620
$$ packed form
12559F0060l9215o4651j5825m567P5363K7168m5870k5758Q505j5587m4860L056
12547h2181L3429K9393L8639J2734M667k5115k7728o4058M564j6476P428L5093
12535d9611L2741L688l0545n214K3259n949k3657K282j4675j675r864O141O4324
12522h755M2882m4409q979j1579K698L6417O2736p536n362M9659K4876l317n9655
12509F9676n8986j7326j3441l8201J145J1848O5705L9989Q377r930Q646l0598
12497C6904k2920j90n3398k6357l5736L8562J323O9867p692l1784R966M1864R108
12484B9517n0267J2865j4035M194j8086m3880N2k237J541J5488m381J8745M7734
12471b750L2881n209j5286O243K0235k8833l3245o6467K013L9519K2120j6841
$$ plain form
12459 -45620 -67962 -82358 -91400 -84137 -43898 -58015 -45006 -63608 -28830 14102 12062 26647
12447 26647 10322 -65072 11519 42443 12848 -38151 -8373 -7632 23846 46148 -32160 -50871
12435 -50871 -20292 -14829 -43729 -50547 12191 59063 61754 70128 -6099 -34349 -19584 16620
12423 16620 17986 -14187 40509 103754 86362 80692 109747 98481 107726 78219 49163 37777
12411 37777 26197 40194 64434 21145 38467 47319 55714 23050 25214 44450 40297 22031
12399 22031 10117 19099 19278 25218 57543 96015 120200 104908 77428 35723 12680 10701 7750
12386 7750 25704 31453 43494 42196 33315 82499 77803 24858 12129 36045 81635 119522 107180
12373 107180 29051 37181 47499 58189 34857 31928 51535 66154 92957 97796 150735 131975
$$ packed form
12459d5620k2342j4396r042P263M0239j4117J3009j8602L4778M2932k040J4585
12447B6647j6325p5394P6591L0924k9595n0999K9778P41L1478K2302p8308j8711
12435e0871L0579N463k8900o818O2738M6872K691Q374p6227k8250J4765L6204
12423A6620J366l2173N4696O3245j7392n670K9055j1266R245k9507k9056j1386
12411C7777j1580J3997K4240m3289J7322Q852Q395l2664K164J9236m153j8266
12399B2031j1914Q982J79N940L2325L8472K4185j5292k7480m1705k3043j979k951
12386G750J7954N749J2041j298q881M9184m696n2945j2729K3916M5590L7887j2342
12373A07180p8129Q130J0318J0690k3332k929J9607J4619K6803M839N2939j8760
$$ plain form
12361 131975 126421 139921 114291 79036 88880 53616 77581 122511 133452 154502 160478 190120
12349 190120 208159 239909 244719 259099 268010 219834 192058 241139 213120 245355 270933 278241
12337 278241 270932 334993 386606 494527 658333 887149 1113411 1296829 1324197 1204531
12327 1204531 974813 783549 629942 502092 442060 436404 383650 313863 264123 268638 202296
12316 202296 178936 110813 73624 60208 113877 139812 177074 196401 165349 164115 172791 162767
12304 162767 178768 187781 198982 200872 184612 246173 286213 300580 394553 497666 583173 660548
12292 660548 790148 1028564 1289479 1715008 2302514 3002968 3695918 3972696 3753899 3198210
12282 3198210 2491519 1876623 1498647 1304778 1121706 986750 908509 789005 656782 570730
$$ packed form
12361A31975n554J3500k5630l5255R844l5264K3965M4930J0941K1050N976K9642
12349A90120J8039L1750M810J4380Q911m8176k7776M9081k8019L2235K5578P308
12337B78241p309O4061N1613J07921J63806K28816K26262J83418K7368j19666
12327A204531k29718j91264j53607j27850o0032n656n2754o9787m9740M515o6342
12316B02296k3360o8123l7189j3416N3669K5935L7262J9327l1052j234Q676j0024
12304A62767J6001R013J1201J890j6260O1561M0040J4367R3973J03113Q5507P7375
12292F60548J29600K38416K60915M25529N87506P00454O92950K76778k18797n55689
12282C198210p06691o14896l77976j93869j83072j34956p8241j19504j32223q6052
$$ plain form
12272 570730 486283 435361 411316 412362 418038 378981 309057 295450 282690 268153 232869 259844
12260 259844 325693 367026 317923 331180 303457 336064 376229 416254 440216 534722 631227
12249 631227 717327 805647 997115 1256554 1631905 2185241 2844672 3508403 3963995 3973685
12239 3973685 3537100 2800263 2151276 1730290 1404713 1185052 1066566 892543 753941
12230 753941 670706 587663 540966 428875 313628 307118 323482 328320 291152 219309 180423
12219 180423 201413 167483 135044 109564 110512 110477 154415 190512 159647 155707 179802 238082 249349
12206 249349 219235 210368 184382 224749 363509 551029 720713 936273 1192322 1393418
12196 1393418 1425585 1289734 1092121 860092 708513 572920 450182 388238 365236 341955
$$ packed form
12272E70730q4447n0922k4045J046N676l9057o9924j3607j2760j4537l5284K6975
12260B59844O5849M1333m9103J3257k7723L2607M0165M0025K3962R4506R6505
12249F31227Q6100Q8320J91468K59439L75351N53336O59431O63731M55592R690
12239C973685m36585p36837o48987m20986l25577k19661j18486j74023j38602
12230G53941q3235q3043m6697j12091j15247o510J6364M838l7168p1843l8886
12219A80423K0990l3930l2439k5480R48l5M3938L6097l0865l940K4095N8280J1267
12206B49349l0114q867k5986M0367J38760J87520J69684K15560K56049K01096
12196A393418L2167j35851j97613k32029j51579j35593j22738o1944k3002k3281
$$ plain form
12186 341955 276034 231071 192819 164406 109844 112669 112818 57248 45501 52307 66967 82086
12174 82086 91468 100395 132526 71856 26619 5305 2220 17011 86342 72070 38817 37082
12162 37082 68953 83209 96461 56563 5953 -11 24950 35705 32376 15263 31348 15904
12150 15904 1324 -23694 -12342 -36612 -21421 11173 33502 34829 50935 71547 55269 63449
12138 63449 29465 -16990 13656 34597 35498 15463 -4047 -23754 -12011 -8408 -27353 -48762
12126 -48762 -91545 -121611 -74557 -47933 -73169 -36401 -49153 -82190 -95850 -143223 -115734 -48041
12114 -48041 -55957 -80142 -76785 -77713 -76208 -56996 -60169 1958 31999 -15400 -23012 -63066 -101107
12101 -101107 -63788 -16899 744 7152 33783 36137 -792 -41527 -37920 19624 52647 23244
$$ packed form
12186C41955o5921m4963l8252k8413n4562K825J49n5570j1747O806J4660J5119
12174H2086R382Q927L2131o0670m5237k1314l085J4791O9331j4272l3253j735
12162C7082L1871J4256J3252l9898n0610n964K4961J0755l329j7113J6085j5444
12150A5904j4580k5018J1352k4270J5191L2594K2329J327J6106K0612j6278Q180
12138F3449l3984m6455L0646K0941R01k0035j9510j9707J1743L603j8945k1409
12126d8762m2783l0066M7054K6624k5236L6768j2752l3037j3660m7373K7489O7693
12114d8041p916k4185L357r28J505J9212l173O2127L0041m7399p612m0054l8041
12101a01107L7319M6889J7643O408K6631K354l6929m0735L607N7544L3023k9403
$$ plain form
12089 23244 -43945 -49013 -24466 -9319 12545 -29397 -43445 -10352 20543 52601 26915 -4270
12077 -4270 13470 26365 47660 25210 -35623 -57421 -18009 -8315 -39623 -99971 -86570 -81965
12065 -81965 -88240 -59672 -59860 -25270 6632 12773 29273 -19241 -42388 -47611 10859 28988 61812
12052 61812 76794 42735 47208 -2251 -25572 10734 13193 41184 18776 1708 21813 45468
12040 45468 61155 87284 81321 70234 64477 99553 105152 97766 106340 154507 178330 213567 305317
12027 305317 408082 518336 739391 1061999 1377953 1576558 1552491 1345564 1025933 768387
12017 768387 563163 381486 280814 298234 298309 288999 245593 176262 176848 136776 109871 109363
12005 109363 113016 133601 144887 115493 78453 25308 -25279 -52946 -32785 -38791 -43467 -18303
$$ packed form
12089B3244o7189n068K4547J5147K1864m1942j4048L3093L0895L2058k5686l1185
12077d270J7740J2895K1295k2450o0833k1798L9412R694l1308o0348J3401M605
12065h1965o275K8568j88L4590L1902O141J6500m8514k3147n223N8470J8129L2824
12052F1812J4982l4059M473m9459k3321L6306K459K7991k2408j7068K0105K3655
12040D5468J5687K6129n963j1087n757L5076N599p386Q574M8167K3823L5237R1750
12027C05317J02765J10254K21055L22608L15954J98605k4067k06927l19631k57546
12017G68387k05224j81677j00672J7420P5r310m3406o9331N86m0072k6905n08
12005A09363L653K0585J1286k9394l7040n3145n0587k7667K0161o006m676K5164
$$ plain form
11993 -18303 2663 -16714 16385 27247 -4647 10705 30744 -8539 32165 36764 42007 -13909
11981 -13909 -52496 -33394 -19945 -62040 -23720 -14994 -3797 -16488 -27850 34902 51828 3817
11969 3817 17274 9779 -26022 -30766 -31206 -40275 -19317 -25907 -83577 -61798 -16298 40016 5766
11956 5766 -18997 -47140 -40460 -23735 -19674 -53505 -53786 -55366 -28848 -19379 16544 31409 -1314
11943 -1314 -49109 -34415 29941 -29111 -54975 -29321 -23723 -56267 -40016 -52604 -97182 -63989
11931 -63989 -51628 -69610 -85778 -95232 -125309 -145565 -97517 -25664 -11128 -25552 -47701 -30881
11919 -30881 -32507 -78237 -126698 -26958 26139 25596 18057 -79645 -108950 -53401 -30020 -16396
11907 -16396 5100 -27174 -87483 -81442 -38522 -30062 -25862 -16427 -36114 -89450 -148719 -151704 -86784
$$ packed form
11993a8303K0966j9377L3099J0862l1894J5352K0039l9283M0704M599N243n5916
11981a3909l8587J9102J3449m2095L8320Q726J1197j2691j1362O2752J6926m8011
11969C817J3457p495l5801m744m40r069K0958o590n7670K1779M5500N6314l4250
11956E766k4763k8143O680J6725M061l3831k81j580K6518R469L5923J4865l2723
11943a314m7795J4694O4356n9052k5864K5654N598l2544J6251j2588m4578L3193
11931f3989J2361j7982j6168r454l0077k0256M8048P1853J4536j4424k2149J6820
11919c0881j626m5730m8461R9740N3097n43p539r7702k9305N5549K3381J3624
11907a6396K1496l2274o0309O041M2920Q460M200R435j9687n3336n9269k985O4920
$$ plain form
11894 -86784 -49654 -70534 -86891 -130166 -148357 -70193 -46302 -84021 -85949 -83468 -79835 -92674
11882 -92674 -68169 -96893 -99337 -59475 -48888 -3177 37963 -33541 -112222 -74194 3972 -1040
11870 -1040 -37440 -57023 -905 -5264 -5759 59238 77908 32745 -25884 29471 22109 11736 -1778
11857 -1778 3133 11062 -7471 -7660 2164 23443 25492 -9313 -41114 -28347 -1358 1474 28281
11844 28281 22900 10058 -35506 -50907 -18568 76905 108522 74177 -9574 -18558 -5339 -40111
11832 -40111 -9421 2185 -11517 -6311 -8777 -34390 -79965 -73397 -67857 -68628 -68436 -87041 -93567
11819 -93567 -82791 -79289 -78994 -86803 -96749 -120759 -53439 23986 -9071 -59875 -75181 -903 20349
11806 20349 36547 -145 -36975 5146 27321 2377 -21570 -78336 -67109 -70076 -74942 -48254
$$ packed form
11894h6784L7130k0880j6357m3275j8191P8164K3891l7719j928K481L633j2839
11882i2674K4505k8724k444L9862J0587M5711M1140p1504p8681L8028P8166n012
11870a040l6400j9583N6118m359m95O4997J8670m5163n8629N5355p362j0373j3514
11857a778M911P929j8533j89R824K1279K049l4805l1801J2767K6989K832K6807
11844B8281n381j2842m5564j5401L2339R5473L1617l4345q3751q984J3219l4772
11832d0111L0690J1606j3702N206k466k5613m5575O568N540p71J92j8605o526
11819i3567J0776L502K95p809r946k4010O7320P7425l3057n0804j5306P4278K1252
11806B0349J6198l6692l6830M2121K2175k4944k3947n6766J1227k967m866K6688
$$ plain form
11794 -48254 -21042 -69143 -126157 -134463 -84925 11432 73433 107724 74754 14031 25110 -22833
11782 -22833 -24762 -44262 -76812 -87246 -83263 -69978 -42767 -30510 -64846 -54408 -9670 -5274
11770 -5274 -9011 -20252 -81195 -53897 -4504 2028 28337 21535 -4921 3176 -4363 13632 48662
11757 48662 69667 86644 101600 54743 -11178 -23192 -11236 -28056 -44611 -13831 -22280 -11120
11745 -11120 -1897 22616 -37256 -56161 -57345 -34623 -64404 -91907 -24589 -27449 -46617 -40363
11733 -40363 -8706 20221 21818 -7384 -3085 20750 -13690 -41606 -46167 -81955 -86904 -82285 -100601
11720 -100601 -64435 -59766 -24556 -10482 -44048 -43381 -22369 -25067 -37345 -35484 -66632 -92994
11708 -92994 -21661 1458 -21583 -10017 -22012 3599 33300 61679 66835 37338 -3578 2879
$$ packed form
11794d8254K7212m8101n7014q306M9538R6357O2001L4291l2970o0723J1079m7943
11782b2833j929j9500l2550j0434L983J3285K7211J2257l4336J0438M4738M396
11770e274l737j1241o0943K7298M9393O532K6309o802k6456Q097p539J7995L5030
11757D8662K1005J6977J4956m6857o5921j2014J1956j6820j6555L0780q449J1160
11745a1120R223K4513n9872j8905j184K2722k9781k7503O7318k860j9168O254
11733d0363L1657K8927J597k9202M299K3835l4440k7916m561l5788m949M619j8316
11720a00601L6166M669L5210J4074l3566O67K1012k698j2278J861l1148k6362
11708i2994P1333K3119k3041J1566j1995K5611K9701K8379N156k9497m0916O457
$$ plain form
11696 2879 23158 80873 67701 -6065 -57997 -28370 -34511 -17810 -30674 -58169 -53477 -62447
11684 -62447 -19878 -5022 -14589 -13108 42757 37082 55115 17289 -4643 -60028 -80005 -78543
11672 -78543 -56974 -48449 -72259 -34209 -39106 -35850 -61050 -84182 -102052 -92215 -65468 -27905
11660 -27905 -13753 4942 7472 25529 -11306 -35367 -34747 -18886 -36244 -71229 -43029 -39798
11648 -39798 -62361 -82380 -33124 -44668 -28744 -29916 -56059 -102108 -111534 -72934 -55528 -98398
11636 -98398 -107114 -48170 -26501 -32381 -11947 3401 -10984 -12364 -25414 -43390 -76001 -60214
11624 -60214 -61291 -80651 -27016 12238 -2471 -5932 -18239 -1175 4788 -39111 -47670 -70801
11612 -70801 -61010 -90556 -128073 -98898 -125782 -119673 -57612 -39920 -22295 -21479 -27256 -48479 -39434
$$ packed form
11696B879K0279N7715j3172p3766n1932K9627o141J6701j2864k7495M692q970
11684f2447M2569J4856r567J481N5865n675J8033l7826k1932n5385j9977J462
11672g8543K1569Q525k3810L8050m897L256k5200k3132j7870R837K6747L7563
11660b7905J4152J8695K530J8057l6835k4061O20J5861j7358l4985K8200L231
11648c9798k2563k0019M9256j1544J5924j172k6143m6049r426L8600J7406m2870
11636i8398q716N8944K1669n880K0434J5348j4385j380j3050j7976l2611J5787
11624f0214j077j9360N3635L9254j4709l461j2307J7064N963m3899q559k3131
11612g0801R791k9546l7517K9175k6884O109O2061J7692J7625Q16n777k1223R045
$$ plain form
11599 -39434 -63933 -38926 -7817 -18062 -44254 -73598 -132758 -151616 -122501 -102940 -77201 -54035
11587 -54035 -31590 -17239 -53010 -63168 -59625 -16726 -30250 -78475 -107201 -85072 -70171 -32651
11575 -32651 -56165 -87760 -82857 -52260 -14933 40556 21588 -39435 -43481 -18294 -11879 -4102
11563 -4102 7223 -31553 -71879 -71194 -27597 19565 41393 -19711 -79515 -37308 -21540 -68235
11551 -68235 -129470 -112600 -73379 -78149 -60903 -28481 -43170 -73592 -60322 -66093 -54426 -57412
11539 -57412 -46934 -53276 -52586 -47205 -29963 -42610 -66002 -31763 -53567 -55505 -37784 -21834 -43483
11526 -43483 -73011 -107815 -105864 -31112 19898 25230 4419 9800 19385 4286 23220 15518 -13362
11513 -13362 -20027 -51336 -54700 -36152 -57490 -35661 -5044 -64973 -83228 -93523 -66086 -13186
$$ packed form
11599c9434k4499K5007L1109j0245k6192k9344n9160j8858K9115J9561K5739K3166
11587e4035K2445J4351l5771j0158L543M2899j3524m8225k8726K2129J4901L7520
11575c2651k3514l1595M903L0597L7327N5489j8968o1023m046K5187O415P777
11563d102J1325l8776m0326O85M3597M7162K1828o1104n9804M2207J5768m6695
11551f8235o1235J6870L9221m770J7246L2422j4689l0422J3270n771J1667k986
11539e7412J0478o342O90N381J7242j2647k3392L4239k1804j938J7721J5950k1649
11526d3483k9528l4804J951P4752N1010N332k0811N381R585j5099J8934p702k8880
11513a3362o665l1309l364J8548k1338K1829L0617n9929j8255j0295K7437N2900
$$ plain form
11501 -13186 -11389 -49624 -65055 -39538 -29054 16791 17676 1433 7817 27230 1315 11207 -25688
11488 -25688 -30852 -42714 19965 55313 7197 -12670 -10578 4141 -5520 -13718 -42895 -281
11476 -281 27131 8773 -43086 -47658 -23418 -4255 8563 -34929 -33061 -15433 -8418 6084 -9132
11463 -9132 -75768 -94582 -40892 -11518 -33675 -15631 17891 31325 31836 4917 -44831 -61610
11451 -61610 -31069 -48671 -88900 -71347 -22393 3146 12742 -22638 -35395 -31309 -8519 -73731
11439 -73731 -85493 -93622 -54940 -9023 -13242 -37780 -51415 -24505 -5108 -9820 -41856 -56699
11427 -56699 -40014 -3033 14803 18522 -34903 -59309 -76969 -30416 37076 104477 56696 33417
11415 33417 20329 10115 -50069 -80439 4174 74434 38514 33832 18486 3615 -11697 -11064
$$ packed form
11501a3186J797l8235j5431K5517J0484M5845Q85j6243O384J9413k5915R892l6895
11488b5688n164j1862O2679L5348m8116j9867K092J4719r661q198k9177M2614
11476b81K7412j8358n1859m572K4240J9163J2818m3492J868J7628P015J4502j5216
11463i132o6636j8814N3690K9374k2157J8044L3522J3434N11k6919m9748j6779
11451f1610L0541j7602m0229J7553M8954K5539R596l5380j2757M086K2790o5212
11439g3731j1762q129L8682M5917m219k4538j3635K6910J9397m712l2036j4843
11427e6699J6685L6981J7836L719n3425k4406j7660M6553O7492O7401m7781k3279
11415C3417j3088j0214o0184l0370Q4613P0260l5920m682j5346j4871j5312O33
$$ plain form
11403 -11064 -15884 -25964 316 30522 -16227 3050 30927 17288 -12657 -36322 -15005 -8079
11391 -8079 -41025 -63846 -71336 -36196 10869 -1175 52624 29350 -27117 -59192 -92901 -120480
11379 -120480 -32892 -21073 -37477 -10787 -2791 14925 10909 -3204 25941 21730 39379 29783
11367 29783 -2704 -37584 -38120 -29247 -33646 -16542 26539 57703 62565 51041 -5035 -46988 -92886
11354 -92886 -113135 -82843 -66624 -30460 -51526 -82548 -103831 -65665 -31350 -72542 -87591 -79617
11342 -79617 -67681 -78482 -42117 -44121 -77341 -55403 -29451 -28984 -31846 -28408 -49486 -74355 -37168
11329 -37168 -18148 -26152 -49630 -92093 -62456 -45157 -59519 -70839 -67530 -55105 -63849 -56844
11317 -56844 -63723 -123737 -118935 -90243 -100035 -105583 -85018 -62099 -63444 -21235 -17525 -30115 -59395
$$ packed form
11403a1064m820j0080K6280L0206m6749J9277K7877j3639k9945k3665K1317O926
11391h079l2946k2821p490L5140M7065j2044N3799k3274n6467l2075l3709k7579
11379a20480Q7588J1819j6404K6690P996J7716m016j4113K9145m211J7649r596
11367B9783l2487l4880n36Q873m399J7104M3081L1164M862j1524n6076m1953m5898
11354i2886k0249L0292J6219L6164k1066l1022k1283L8166L4315m1192j5049P974
11342g9617J1936j0801L6365k004l3220K1938K5952M67k862L438k1078k4869L7187
11329c7168J9020q004k3478m2463K9637J7299j4362j1320L309J2425q744P005
11317e6844o879o0014M802K8692r792n548K0565K2919j345M2209L710j2590k9280
$$ plain form
11304 -59395 -8138 -1795 -6274 -28671 -98828 -112118 -49578 -18133 -24563 -30968 -7043 7526
11292 7526 35135 49582 7401 -25695 -42131 -51637 -76017 -58756 -33732 -63562 -36223 -18212
11280 -18212 -52334 -125502 -117179 -67684 -45466 -52312 -95954 -92315 -87229 -57127 -69922 -42455
11268 -42455 -41482 -81129 -101261 -63001 -69917 -84149 -67773 -67864 -5363 19426 15337 -18195 14754
11255 14754 22889 -7816 26581 71776 47936 -60221 -132508 -97777 -40976 -39857 -68686 -83120
11243 -83120 -75408 -88231 -98284 -76806 -9599 -5244 -23759 -28024 24775 29705 16784 -19627
11231 -19627 -44265 -44050 -63241 -64673 -96572 -117919 -129477 -94125 -83449 -21997 -39137 -7990
11219 -7990 -15330 -21348 -25854 -71076 -78502 -61788 -30055 15052 20379 -16311 -15856 -37644 -66676
$$ packed form
11304e9395N1257O343m479k2397p0157j3290O2540L1445o430o405K3925J4569
11292G526K7609J4447m2181l3096j6436r506k4380J7261K5024k9830K7339J8011
11280a8212l4122p3168Q323M9495K2218o846m3642L639N086L0102j2795K7467
11268d2455R73l9647k0132L8260o916j4232J6376r1O2501K4789m089l3532L2949
11255A4754Q135l0705L4397M5195k3840j08157p2287L4731N6801J119k8829j4434
11243h3120P712j2823j0053K1478O7207M355j8515m265N2799M930j2921l6411
11231a9627k4638K15j9191j432l1899k1347j1558L5352J0676O1452j7140L1147
11219g990p340o018m506m5222p426J6714L1733M5107N327l6690M55k1788k9032
$$ plain form
11206 -66676 -65035 -92037 -125039 -105049 -92630 -53163 -36428 -11544 -17301 -40562 -22172 -57542
11194 -57542 -59815 -29625 -12878 -11186 -8647 -18279 -6535 -10967 -31747 -36918 -50502 -56328 -67500
11181 -67500 -67322 -14370 -6654 -22242 -73802 -85081 -71736 -77298 -41673 -43884 -37850 -22757 -14445
11168 -14445 -36030 -52058 -42214 -22711 -17449 -3024 -45984 -40708 -9477 -45539 -54595 -32928
11156 -32928 -49751 -40023 -42376 -41681 -4363 -22020 -50539 -51318 -49089 -51169 -54767 -69901 -91474
11143 -91474 -80093 -49262 -61037 -88730 -74796 -53134 -48334 -33466 -30841 -42003 -19683 16460
11131 16460 -291 26761 43980 -8409 -59078 -89456 -75654 -73090 -52515 -33464 -9086 -21018
11119 -21018 -61695 -91660 -55406 -51728 -15342 -40801 -67350 -62768 -41252 -6213 -13697 -30134
$$ packed form
11206f6676J641k7002l3002J9990J2419L9467J6735K4884n757k3261J8390l5370
11194e7542k273L0190J6747J692K539r632J1744m432k0780n171j3584n826j1172
11181f7500J78N2952P716j5588n1560j1279J3345n562L5625k211O034J5093Q312
11168a4445k1585j6028R844J9503N262J4425m2960N276L1231l6062r056K1667
11156c2928j6823R728k353O95L7318j7657k8519p79K229k080l598j5134k1573
11143i1474J1381L0831j1775k7693J3934K1662M800J4868K625j1162K2320L6143
11131A6460j6751K7052J7219n2389n0669l0378J3802K564K0575J9051K4378j1932
11119b1018m0677k9965L6254L678L6386k5459k6549M582K1516L5039p484j6437
$$ plain form
11107 -30134 2489 56279 24541 -31791 -19774 1546 -62907 -60054 -19791 -11356 -21158 -34983
11095 -34983 -79425 -35444 30964 12564 -20738 -27763 -57592 -43930 -50483 -61938 -50701 -24995
11083 -24995 -578 -47245 -81828 -44574 -8489 -20739 -66025 -87619 -83181 -41156 -30058 -4465
11071 -4465 12449 -12845 -54550 -61818 -22040 -35526 -50905 -38784 -9595 9889 -14576 -35834
11059 -35834 8196 -19870 -13973 -27901 -1757 16931 -36587 -44269 26381 41501 -42768 -65158
11047 -65158 -77628 -28856 6509 -6151 -28668 -12082 -5854 -5251 -14322 22558 -16698 -93564
11035 -93564 -139042 -117475 -58657 -88251 -135387 -115907 -47156 -16473 -37619 -60442 -46172 10761
11023 10761 -3911 -52931 -46386 -5872 18567 54619 30940 -5844 -3662 22672 37845 49056
$$ packed form
11107c0134L2623N3790l1738n6332J2017K1320o4453K853M0263Q435r802j3825
11095c4983m4442M3981O6408j8400l3302p025k9829J3662o553j1455J1237K5706
11083b4995K4417m6667l4583L7254L6085j2250m5286k1594M438M2025J1098K5593
11071d465J6914k5294m1705p268L9778j3486j5379J2121K9189J9484k4465k1258
11059c5834M4030k8066N897j3928K6144J8688n3518p682P0650J5120q4269k2390
11047f5158j2470M8772L5365j2660k2517J6586O228O03r071L6880l9256p6866
11035i3564m5478K1567N8818k9594m7136J9480O8751L0683k1146k2823J4270N6933
11023A0761j4672m9020O545M0514K4439L6052k3679l6784K182K6334J5173J1211
$$ plain form
11011 49056 18429 -22178 -26882 32768 42113 40969 -17388 -76764 -89717 -56250 7750 4019
10999 4019 -70827 -41680 -24936 -49677 -5918 7100 11106 -22841 -16265 -9437 -11713 -27135 -40048
10986 -40048 -6462 -6813 -25144 -20486 -8256 5454 -23296 -35818 -16670 29391 19690 -4256
10974 -4256 -41214 -69152 -57047 -29628 24822 45152 54692 13505 -13633 -28072 -61267 -84270
10962 -84270 -68066 -87442 -86312 -96826 -97423 -68227 -46819 -42246 -30568 -20571 -68304 -99736 -101656
10949 -101656 -44403 833 32876 16754 -28199 -27758 6144 -12460 -24505 429 353 -46011
10937 -46011 -31951 -22535 13113 18742 -24615 -38827 -34788 -3597 43010 69216 128772 115885
10925 115885 88736 71281 22690 -4954 -15041 -42556 -41618 10705 -4988 -32521 -80477 -107839
$$ packed form
11011D9056l0627m0607m704N9650R345j144n8357n9376j2953L3467O4000l731
10999D019p4846K9147J6744k4741M3759J3018M006l3947O576O828k276j5422j2913
10986d0048L3586l51j8331M658J2230J3710k8750j2522J9148M6061r701k3946
10974d256l6958k7938J2105K7419N4450K0330R540m1187k7138j4439l3195k3003
10962h4270J6204j9376J130j0514n97K9196K1408M573J1678R997m7733l1432j920
10949a01656N7253M5236L2043j6122m4953M41L3902j8604j2045K4934p6m6364
10937d6011J4060R416L5648N629m3357j4212M039L1191M6607K6206N9556j2887
10925A15885k7149j7455m8591k7644j0087k7515R38N2323j5693k7533m7956k7362
$$ plain form
10913 -107839 -105854 -70839 -41545 -54754 -83240 -49144 -15454 -32716 -45322 -11096 9252 -2352
10901 -2352 -57420 -50869 -67357 -65813 44 916 394 22932 90458 72927 24967 -43476 -80098
10888 -80098 -79344 -42862 -62088 -73663 -87992 -51882 -27932 -30755 -45601 -69815 -116853 -106629
10876 -106629 -41632 -31345 -27025 38519 47028 15784 -14856 -22567 -634 4133 -23667 -21594
10864 -21594 -58937 -78397 -73633 -32631 24830 -31976 -45279 -19525 -52749 -67782 -15502 -34372
10852 -34372 -47268 -58662 -69057 -20394 -30058 -19916 10066 -12241 -25658 -8340 -21992 -44058
10840 -44058 -62036 -50056 -75791 -98202 -93467 -42111 14914 21773 12730 -44981 -12666 -18333
10828 -18333 -2547 36228 34111 13449 -28760 -71931 -43825 -16433 7824 27244 -16328 -86425
$$ packed form
10913a07839J985L5015K9294j3209k8486L4096L3690j7262j2606L4226K0348j1604
10901b352n5068O551j6488J544O5857Q72n22K2538O7526j7531m7960o8443l6622
10888h0098P54L6482j9226j1575j4329L6110K3950k823j4846k4214m7038J0224
10876a06629O4997J0287M320O5544Q509l1244l0640p711K1933M767k7800K073
10864b1594l7343j9460M764M1002N7461n6806j3303K5754l3224j5033N2280j8870
10852c4372j2896j1394j0395M8663r664J0142K9982k2307j3417J7318j3652k2066
10840d4058j7978J1980k5735k2411M735N1356N7025O859r043n7711L2315n667
10828a8333J5786L8775k117k0662m2209m3171K8106K7392K4257J9420m3572p0097
$$ plain form
10816 -86425 -110808 -72920 -54036 -41180 -23728 -2136 -9475 -46290 -15346 -6686 -37569 -61865
10804 -61865 -28884 -56278 -33281 29056 33175 -2479 -22109 -52715 -23683 7250 122 -9007
10792 -9007 -34658 -45643 -29784 -35079 -38878 -63484 -51629 -18719 -33980 -22017 -49094 -113693
10780 -113693 -87559 -809 6938 12845 38374 14663 2431 47108 4508 -27189 1137 -12780
10768 -12780 -74144 -104147 -76264 6655 7387 -19685 -15762 -41523 -65098 -68996 -74700 -97861 -62288
10755 -62288 -58816 -6934 -10568 3192 -26142 -17166 20329 26547 -47705 -62723 -2465 -39080
10743 -39080 -104443 -139491 -129050 -64570 -6788 7082 -36591 -16274 35387 38524 52665 28791
10731 28791 21214 15309 59761 19607 -23754 -34409 -40994 -66419 -68138 -65395 -46312 -66699 -87824
$$ packed form
10816h6425k4383L7888J8884J2856J7452K1592p339l6815L0944Q660l0883k4296
10804f1865L2981k7394K2997O2337M119l5654j9630l0606K9032L0933p128r129
10792i007k5651j0985J5859n295l799k4606J1855L2910j5261J1963k7077o4599
10780a13693K6134Q6750P747N907K5529k3711j2232M4677m2600l1697K8326j3917
10768a2780o1364l0003K7883Q2919P32k7072L923k5761k3575l898n704k3161L5573
10755f2288L472N1882l634J3760k9334Q976L7495O218p4252j5018O0258l6615
10743c9080o5363l5048J0441O4480N7782J3870m3673K0317N1661L137J4141k3874
10731B8791p577n905M4452m0154m3361j0655o585k5425j719K743J9083k0387k1125
$$ plain form
10718 -87824 -46107 -15620 -43485 -13443 13085 46730 24052 -3730 3050 -13290 -14991 -1137
10706 -1137 13601 -194 -19951 16166 15233 -8498 -458 -12177 -5602 24556 331 -2609 25533
10693 25533 6647 -14179 -36448 -60730 10182 5251 -39438 -61626 22531 70488 27434 -22392
10681 -22392 -7441 -20995 -32910 -27461 -31910 -18063 12327 -2033 -44659 -31648 -44550 -38054
10669 -38054 -34085 -24085 -25259 -8134 65501 49313 -5596 -12793 -6270 -27258 -49958 -56795 5429
10656 5429 -274 -60839 -61481 -49517 9325 -11815 -25634 -3602 -10837 -34338 -30518 -33197 -26367
10643 -26367 -20574 -27610 -43942 -73419 -58927 -81310 -51208 -19625 -3599 -41631 -41310 -51165 -67322
10630 -67322 -74454 -37369 -54432 -121502 -117059 -122238 -120585 -70861 20312 -16102 -42237 -57913
$$ packed form
10718h7824M1717L0487k7865L0042K6528L3645k2678k7782O780j6340j701J3854
10706a137J4738j3795j9757L6117r33k3731Q040j1719O575L0158k4225k940K8142
10693B5533j8886k0826k2269k4282P0912m931m4689k2188Q4157M7957m3054m9826
10681b2392J4951j3554j1915N449m449J3847L0390j4360m2626J3011j2902O496
10669c8054L969J0000j174J7125P3635j6188n4909p197O523k0988k2700o837O2224
10656E429n703o0565o42J1964N8842k1140j3819K2032p235k3501L820k679O830
10643b6367N793p036j6332k9477J4492k2383L0102L1583J6026l8032L21r855j6157
10630f7322p132L7085j7063o7070M443n179J653M9724R1173l6414k6135j5676
$$ plain form
10618 -57913 -84462 -45229 -56603 -28075 16591 46433 76889 68963 46379 6725 -44038 -52638
10606 -52638 -27142 -28584 20421 17309 10330 -16514 -25971 -24931 -11806 -5841 -9634 41067 33283
10593 33283 3612 -22247 -18345 -25800 -33218 -9748 -13621 -1525 16083 19339 -44529 -90757 -90342
10580 -90342 -41523 4649 8173 -20648 7798 54218 33617 12541 -24577 -5518 -31001 -135046
10568 -135046 -165410 -111422 -99229 -84784 -65621 -62326 -76380 -65789 -83261 -61815 -38579 -40269
10556 -40269 -75897 -97456 -97829 -38448 -52056 -125754 -146093 -111567 -78870 -37968 -54872 -25757
10544 -25757 3226 -75116 -89153 -122830 -162641 -129947 -74597 -48866 -65554 -62479 -50558 17938
10532 17938 67256 48386 -287 3843 39395 42075 12723 -5800 48731 62277 37611 11018
$$ packed form
10618e7913k6549L9233j1374K8528M4666K9842L0456p926k2584l9654n0763q600
10606e2638K5496j442M9005l112o979k6844r457J040J3125N965l793N0701p784
10593C3283k9671k5859L902p455p418K3470l873J2096J7608L256o3868m6228M15
10580i0342M8819M6172L524k8821K8446M6420k0601k1076l7118J9059k5483j04045
10568a35046l0364N3988J2193J4445J9163L295j4054J0591j7472K1446K3236j690
10556d0269l5628k1559l73N9381j3608p3698k0339L4526L2697M0902j6904K9115
10544b5757K8983p8342j4037l3677l9811L2694N5350K5731j6688L075J1921O8496
10532A7938M9318j8870m8673M130L5552K680k9352j8523N4531J3546k4666k6593
$$ plain form
10520 11018 2140 17627 -22686 -27099 12313 5077 1912 -40890 -57815 -56837 -41609 -62831 -127930
10507 -127930 -124876 -69886 -68467 -101038 -89147 -47424 18386 8051 -22326 -18430 -2209 -1164
10495 -1164 -33309 -58437 -26985 -2425 -12076 -24911 -32469 2424 2614 -54361 1842 42549 18415
10482 18415 -29043 -32539 -58384 -45012 -25189 6604 13600 45863 20162 -30520 -53268 -56178
10470 -56178 -48638 -81456 -84565 -67061 -94595 -94757 -32627 3262 12774 30953 -20302 -53334 -48740
10457 -48740 -62493 -16644 -7620 -28566 -5126 -1668 -17928 -1124 -102 -14200 13184 -5093
10445 -5093 -33860 -42967 22722 21910 17851 -20767 -22098 -71422 -30957 764 -23235 -9845 -57332
10432 -57332 -90747 -37295 -49466 -60147 -30377 -27518 -12656 11380 74759 82839 39763 21385
$$ packed form
10520A1018q878J5487m0313m413L9412p236l165m2802j6925R78J5228k1222o5099
10507a27930L054N4990J419l2571J1891M1723O5810j0335l0377L896J6221J045
10495a164l2145k5128L1452K4560r651j2835p558L4893J90n6975N6203M0707k4134
10482A8415m7458l496k5845J3372J9823L1793O996L2263k5701n0682k2748k910
10470e6178P540l2818l109J7504k7534j62O2130L5889R512J8179n1255l3032M594
10457d8740j3753M5849R024k0946K3440L458j6260J6804J022j4098K7384j8277
10445e093k8767r107O5689q12m059l8618j331m9324M0465L1721k3999J3390m7487
10432e7332l3415N3452j2171j0681K9770K859J4862K4036O3379Q080m3076j8378
$$ plain form
10420 21385 10167 25138 31110 4227 -15771 32203 12949 -5009 -10017 -7545 -24821 -58949
10408 -58949 -83503 -49901 -18105 -74486 -73628 -20671 -23372 -52348 -28819 10855 47832 72009
10396 72009 80246 76886 77871 83039 71629 82856 93570 60633 47320 69980 100731 69337 40196
10383 40196 46066 36154 52121 30609 27891 29061 26266 10961 3873 53612 82180 54457 39798
10370 39798 59701 114645 146761 140788 135330 135898 110209 91776 116746 122045 192912 272584 366174
10357 366174 492280 590073 729544 886988 1015232 1135912 1195138 1193656 1216374 1195026 1149244
10346 1149244 1049479 873494 730227 603056 460903 386084 353996 318184 294243 225942
10336 225942 181543 129119 101241 91073 81220 73505 66442 84014 86968 61825 82228 70054
$$ packed form
10420B1385j1218J4971N972k6883j9998M7974j9254j7958n008K472j7276l4128
10408e8949k4554L3602L1796n6381Q58N2957k701k8976K3529L9674L6977K4177
10396G2009Q237l360R85N168j1410J1227J0714l2937j3313K2660L0751l1394k9141
10383D0196N870r912J5967k1512k718J170k795j5305p088M9739K8568k7723j4659
10370C9798J9903N4944L2116n973n458N68k5689j8433K4970N299P0867P9672R3590
10357C66174J26106R7793J39471J57444J28244J20680N9226j482K2718k1348m5782
10346A149244r9765j75985j43267j27171j42153p4819l2088l5812k3941o8301
10336B25942m4399n2424k7878j0168r853p715p063J7572K954k5143K0403j2174
$$ plain form
10324 70054 40632 58952 68496 62433 99452 100491 58729 21583 20517 -13016 -27623 -2045
10312 -2045 10322 38258 47401 83851 111591 127143 102983 87595 70627 28218 -17697 -1688
10300 -1688 13738 -5005 -25481 -45370 -60839 -41519 -26953 -89906 -76013 23210 53892 76193
10288 76193 80396 24047 28652 -7746 -52994 -62168 -21375 -32951 -35414 20808 101289 108300 36077
10275 36077 10006 10804 58356 89425 76476 77812 75182 38721 997 12181 11877 16364 4660
10262 4660 47153 88172 23321 33760 122612 129049 103642 74789 66023 2226 -41433 -32145
10250 -32145 17759 -3428 -9249 -29278 -25154 -46048 -788 2895 -7072 30410 23570 -1972 -13240
10237 -13240 36105 53546 52311 6616 4910 28252 30629 9580 8968 -3120 -25993 -17989 36187
$$ packed form
10324G0054k9422J8320R544o063L7019J039m1762l7146j066l3533j4607K5578
10312b045J2367K7936R143L6450K7740J5552k4160j5388j6968m2409m5915J6009
10300a688J5426j8743k0476j9889j5469J9320J4566o2953J3893R9223L0682K2301
10288G6193M203n6349M605l6398m5248r174M0793j1576k463N6222Q0481P011p2223
10275C6077k6071P98M7552L1069j2949J336k630l6461l7724J1184l04M487j1704
10262D660M2493M1019o4851J0439Q8852O437k5407k8853q766o3797m3659R288
10250c2145M9904k1187n821k0029M124k0894M5260L683r967L7482o840k5542j1268
10237a3240M9345J7441j235m5695j706K3342K377k1049o12j2088k2873Q004N4176
$$ plain form
10224 36187 22356 2122 -42087 -27681 28339 43504 30711 6358 4661 10935 28616 48271
10212 48271 75283 90514 64925 39236 55610 36547 -2201 5541 51413 49458 17548 -9641
10200 -9641 -46152 -55232 -49615 -76257 -35432 -33731 -21699 -40312 2101 -6457 17269 59002 64180
10187 64180 18852 -36460 -25654 -14940 30423 7545 33767 32165 49417 12915 -1387 -27547
10175 -27547 15873 16774 23978 19962 -3501 3038 -22786 -44270 -51954 -58375 -67671 -30950 -36678
10162 -36678 32879 75931 61608 38644 63615 30651 -24805 -7570 37462 38963 61299 33143
10150 33143 -39359 -78187 -60226 5152 41236 19084 -3927 -7951 -23077 -65812 -69519 -62984
10138 -62984 -31651 22683 56179 39400 -46498 -44461 5630 26702 25913 -14545 -43842 -44655 -39573
$$ packed form
10224C6187j3831k0234m4209J4406N6020J5165j2793k4353j697O274J7681J9655
10212D8271K7012J5231k5589k5689J6374j9063l8748P742M5872j955l1910k7189
10200i641l6511r080N617k6642M0825J701J2032j8613M2413q558K3726M1733N178
10187F4180m5328n5312J0806J0714M5363k2878K6222j602J7252l6502j4302k6160
10175b7547M3420R01P204m016k3463O539k5824k1484p684o421r296L6721n728
10162c6678O9557M3052j4323k2964K4971l2964n5456J7235M5032J501K2336k8156
10150C3143p2502l8828J7961O5378L6084k2152k3011m024j5126m2735l707O535
10138f2984L1333N4334L3496j6779q5898K037N0091K1072p89m0458k9297q13N082
$$ plain form
10125 -39573 -7216 9819 14585 74244 59210 71702 117891 92235 60796 72254 110240 83458
10113 83458 52727 49989 16650 -9358 30513 45088 37536 58991 51125 8359 -8752 -7776 21086
10100 21086 36285 33040 36729 2467 -63760 -60806 14660 -11520 -41356 -51273 -19042 -10314 -7149
10087 -7149 6152 13132 9765 28098 28645 -5329 -3194 -34243 -38037 -11075 -10928 4627 22489
10074 22489 -11811 -19117 28015 21519 -12386 -48276 -38611 14677 52061 29435 13527 37383
10062 37383 68532 60063 44575 15455 -17704 -19469 23438 -17478 -13924 -13911 12903 22899 -2516
10049 -2516 -14008 -38066 -62473 -33059 9786 -5441 -33325 -13608 -38738 -29230 3294 30144
10037 30144 14181 -39604 -66354 -66045 -64730 -26117 -36354 -34779 -36029 8000 33538 -17924 -54165
$$ packed form
10125c9573L2357J7035M766N9659j5034J2492M6189k5656l1439J1458L7986k6782
10113H3458l0731k738l3339k6008L9871J4575p552K1455p866m2766j7111R76K8862
10100B1086J5199l245L689l4262o6227K954P5466k6180k9836r917L2231Q728L165
10087g149J3301O980l367J8333N47l3974K135l1049l794K6962J47J5555J7862
10074B2489l4300p306M7132o496l3905l5890R665N3288L7384k2626j5908K3856
10062C7383L1149q469j5488k9120l3159j765M2907m0916L554J3K6814R996k5415
10049b516j1492k4058k4407K9414M2845j5227k7884J9717k5130R508L2524K6850
10037C0144j5963n3785k6750L09J315L8613j0237J575j250M4029K5538n1462l6241
$$ plain form
10024 -54165 5823 20122 25257 46935 63684 31683 26230 486 -32894 5846 35035 46445
10012 46445 10276 -3873 -13330 -24800 -40220 -37898 -49352 9604 40795 26834 25101 61642
10000 61642 56849 7552 -7354 -8735 -23790 -16262 -103 9834 -993 2277 -28732 1524 42099
9987 42099 24135 45699 33324 41626 46471 33512 36309 62085 40466 22784 37729 32495 7106
9974 7106 12226 39070 51982 43343 79432 60347 44245 61770 37071 19416 52083 85394
9962 85394 37407 -39475 -26130 -3227 -17615 -2312 16276 18918 13758 14870 -8767 -22462
9950 -22462 10425 25051 -15108 -4845 -25696 10393 38272 61037 31375 -36287 5307 29969
9938 29969 56009 60559 -539 -26163 -43474 1168 -22294 -71507 -67232 -20812 13228 -4222
$$ packed form
10024e4165N9988J4299N135K1678J6749l2001n453k5744l3380L8740K9189J1410
10012D6445l6169j4149r457j1470j5420K322j1454N8956L1191j3961j733L6541
10000F1642m793m9297j4906j381j5055P528J6159R937j0827L270l1009L0256M0575
9987D2099j7964K1564j2375Q302M845j2959K797K5776k1619j7682J4945n234k5389
9974G106N120K6844J2912q639L6089j9085j6102J7525k4699j7655L2667L3311
9962H5394m7987p6882J3345K2903j4388J5303J8588K642n160J112k3637j3695
9950b2462L2887J4626m0159J0263k0851L6089K7879K2765k9662o7662M1594K4662
9938B9969K6040M550o1098k5624j7311M4642k3462m9213M275M6420L4040j7450
$$ plain form
9926 -4222 -11520 31766 28853 30934 -6729 -9446 -30730 -27929 -24560 -10551 -62924 -60345 -19771
9913 -19771 -6558 -44303 -25843 -6213 -34692 -6922 -6701 -13317 -3327 2277 16259 37791 74997
9900 74997 60984 85346 35271 -2924 -21305 -50476 -13104 12195 -11990 17906 39660 24210
9888 24210 -5786 -43558 -20500 -19893 3254 9708 52176 119765 180669 200161 179823 248582
9876 248582 340464 482989 678103 907383 1091123 1183718 1096474 922796 696039 543006
9866 543006 393024 254339 215847 200225 201819 198855 169393 158695 114166 101667 84432 -11152
9854 -11152 -20314 8599 84151 83245 61506 41837 19710 -17720 4237 70853 55068 5260
9842 5260 25559 20657 -5720 -14448 -9211 42784 95335 74650 53287 46965 23237 24466 13546
$$ packed form
9926d222p298M3286k913K081l7663k717k1284K801L369J4009n2373K579M0574
9913a9771J3213l7745J8460J9630k8479K7770K21o616R990N604J3982K1532L7206
9900G4997j4013K4362n0075l8195j8381k9171L7372K5299k4185K9896K1754j5450
9888B4210k9996l7772K3058O07K3147O454M2468O7589O0904J9492k0338O8759
9876B48582R1882J42525J95114K29280J83740R2595q7244j73678k26757j53033
9866E43006j49982j38685l8492j5622J594k964k9462j0698m4529j2499j7235r5584
9854a1152r162K8913P5552r06k1739j9669k2127l7430K1957O6616j5785m9808
9842E260K0299m902k6377q728N237N1995N2551k0685k1363o322k3728J229j0920
$$ plain form
9829 13546 18364 41870 56443 69795 86031 169842 124987 98269 72472 14389 -28695 -5966
9817 -5966 202 -28366 5656 5846 -7139 -30594 -44693 -21427 29281 45753 35098 2885 -42551
9804 -42551 30846 67255 23159 -2066 -48803 -83733 -31110 -34560 -24272 11680 -2863 44137
9792 44137 71593 69258 53525 4951 -8134 -24491 -38783 -28110 -51607 -67158 -31222 -40247
9780 -40247 -38862 -35927 -29114 24410 69913 79033 35534 -6856 1954 16745 28685 -9664 4321
9767 4321 -15509 -16008 20980 5002 -10383 -68937 -109326 -106314 -81379 -53306 -27404 -18347 -37860
9754 -37860 -48211 -7118 32737 48473 57799 52168 2305 -3081 21582 24853 59928 75264 17654
9741 17654 -30085 -6582 -12887 -36198 -17906 33559 -821 -46479 -35247 -49803 -62483 -55279
$$ packed form
9829A3546M818K3506J4573J3352J6236Q3811m4855k6718k5797n8083m3084K2729
9817e966O168k8568L4022J90j2985k3455j4099K3266N0708J6472j0655l2213m5436
9804d2551P3397L6409m4096k5225m6737l4930N2623l450J0288L5952j4543M7000
9792D4137K7456k335j5733m8574j3085j6357j4292J0673k3497j5551L5936r025
9780d0247J385K935O813N3524M5503R120m3499m2390Q810J4791J1940l8349J3985
9767D321j9830m99L6988j5978j5385n8554m0389L012K4935K8073K5902R057j9513
9754c7860j0351M1093L9855J5736R326n631m9863n386K4663L271L5075J5336n7610
9741A7654m7739K3503o305k3311J8292N1465l4380m5658J1232j4556j2680P204
$$ plain form
9729 -55279 -57132 -62553 -55829 -75183 -10238 36893 -4603 9255 86964 105291 100639 88407 93896
9716 93896 58515 28951 7694 5599 4304 24342 36112 42561 7134 -4109 18247 38549
9704 38549 29227 87729 103917 73040 71381 52990 -13517 -9072 974 -2131 18647 -19387 -7639
9691 -7639 13232 -16489 3181 48372 72462 81616 68830 36305 40430 32637 33897 4499 15393
9678 15393 33021 73460 87394 36629 9083 28158 11467 23138 19239 23564 50278 22173
9666 22173 27682 31818 60943 77594 102865 88742 83344 130045 157309 83078 80651 111442 91909
9653 91909 63622 75515 102616 124376 140774 74530 49388 54203 55678 19899 -6531 -10420
9641 -10420 -2814 21147 44623 69837 87121 94026 82471 100100 55187 1979 55934 77857
$$ packed form
9729e5279j853n421O724j9354O4945M7131m1496J3858P7709J8327m652j2232N489
9716I3896l5381k9564k1257k095j295K0038J1770O449l5427j1243K2356K0302
9704C8549r322N8502J6188l0877j659j8391o6507M445J0046l105K0778l8034J1748
9691g639K0871k9721J9670M5191K4090R154j2786l2525M125p793J260k9398J0894
9678A5393J7628M0439J3934n0765k7546J9075j6691J1671l899M325K6714k8105
9666B2173N509M136K9125J6651K5271j4123n398M6701K7264p4231k427L0791j9533
9653I1909k8287J1893K7101K1760J6398o6244k5142M815J475l5779k6430l889
9641a0420P606K3961K3476K5214J7284O905j1555J7629m4913n3208N3955K1923
$$ plain form
9629 77857 66525 105945 128230 114338 114544 122864 94593 23228 35963 61542 60123 26682 20457
9616 20457 46471 28118 2584 4441 12293 -10243 11979 66908 69972 101604 105756 49091 -324
9603 -324 14318 16474 48605 -19573 -35849 635 69137 130033 106937 106492 93430 92520 72333
9590 72333 115500 120241 128955 128426 116664 76540 54551 60398 55415 30290 -11735 -55950 -55373
9577 -55373 -22259 -24288 17344 45299 29914 57684 81066 61064 30607 45759 22391 15456
9565 15456 19604 34592 46729 39573 76682 69146 69167 106901 91777 61301 93821 111371 79221
9552 79221 57884 57189 43497 36912 -4561 48925 34952 35237 76330 111485 108365 99538 84141
9539 84141 44234 73236 45703 26495 27694 -17773 -30428 -13588 12348 -11935 -60212 -62437
$$ packed form
9629G7857j1332L9420K2285j3892K06Q320k8271p1365J2735K5579j419l3441o225
9616B0457K6014j8353k5534J857P852k2536K2222N4929L064L1632M152n6665m9415
9603c24J4642K156L2131o8178j6276L6484O8502O0896k3096m45j3062r10k0187
9590G2333M3167M741Q714n29j1762m0124k1989N847m983k5125m2025m4215N77
9577e5373L3114k029M1632K7955j5385K7770K3382k0002l0457J5152k3368o935
9565A5456M148J4988J2137p156L7109p536K1L7734j5124l0476L2520J7550l2150
9552G9221k1337o95j3692o585m1473N3486j3973K85M1093L5155l120q827j5397
9539H4141l9907K9002k7533j9208J199m5467j2655J6840K5936k4283m8277k225
$$ plain form
9527 -62437 -81180 -50218 -15444 -15974 28280 53907 83460 109382 105827 88501 103537 168867
9515 168867 194307 104581 14187 3021 20196 52483 88264 69561 75272 64596 37913 44432
9503 44432 57276 57281 19361 -5185 22922 24912 75494 80860 39447 -934 34517 59805 71890
9490 71890 49747 23414 8780 36264 56747 51884 43364 53141 66977 61664 -17253 7619 43620
9477 43620 33320 35734 -13761 -1984 27710 75736 77389 85502 15270 -22477 -3865 -12776 -32065
9464 -32065 -46741 -6408 17679 77314 119258 78574 38943 -3464 -28446 27511 71018 70108
9452 70108 90895 122794 128121 91448 95504 92036 300 -46185 -18195 571 18970 52504
9440 52504 18456 4898 56503 98272 106491 121580 144974 108530 63273 96018 123657 136493
$$ packed form
9527f2437j8743L0962L4774n30M4254K5627K9553K5922l555j7326J5036O5330
9515A68867K5440q9726r0394j1166J7175L2287L5781j8703N711j0676k6683O519
9503D4432J2844Nl7920k4546K8107J990N0582N366m1413m0381L5451K5288J2085
9490G1890k2143k6333j4634K7484K0483m863q520R777J3836n313p8917K4872L6001
9477D3620j0300K414m9495J1777K9694M8026J653Q113p0232l7747J8612q911j9289
9464c2065j4676M0333K4087N9635M1944m0684l9631m2407k4982N5957M3507r10
9452G0108K0787L1899N327l6673M056l468r1736m6485K7990J8766J8399L3534
9440E2504l4048j3558N1605M1769Q219J5089K3394l6444m5257L2745K7639J2836
$$ plain form
9428 136493 111021 91131 59774 54363 61113 89853 118497 123133 100009 78397 58492 29298
9416 29298 54086 36485 20034 47822 38577 10492 -4962 -2019 13307 14519 11855 10091 -11208
9403 -11208 3107 49596 92039 71789 21547 1761 58676 82621 90561 125505 104614 80509
9391 80509 61799 44074 34070 7659 17367 23950 62290 69574 102730 115646 66640 1978
9379 1978 18221 14921 -4392 50692 31211 53292 68707 80725 59325 55382 38323 27104
9367 27104 5892 10657 46179 108192 123793 96960 46449 19091 45355 75065 75312 87474
9355 87474 93440 100717 74465 64019 80636 94936 77542 66141 55981 24284 39271 69527
9343 69527 89780 117776 85215 49608 39958 46706 73753 96612 63068 51916 68368 59754
$$ packed form
9428A36493k5472j9890l1357n411O750K8740K8644M636k3124k1612j9905k9194
9416B9298K4788j7601j6451K7788r245k8085j5454K943J5326J212k664j764k1299
9403a1208J4315M6489M2443k0250n0242j9786N6915K3945P940L4944k0891k4105
9391H0509j8710j7725j0004k6411R708O583L8340P284L3156J2916m9006o4662
9379A978J6243l300j9313N5084j9481K2081J5415J2018k1400l943j7059j1219
9367B7104k1212M765L5522O2013J5601k6833n0511k7358K6264K9710K47J2162
9355H7474N966P277k6252j0446J6617J4300j7394j1401j0160l1697J4987L0256
9343F9527K0253K7996l2561l5607r650O748K7047K2859l3544j1152J6452q614
$$ plain form
9331 59754 86307 80228 100804 97082 71687 83905 129874 115938 85422 71669 106054 70887
9319 70887 97102 116690 115482 85109 49518 40698 3653 -31976 -45677 -28417 17405 17102 18082
9306 18082 37336 36397 77607 113689 71121 29557 32377 37721 88245 117043 101037 68581 81968
9293 81968 121355 145233 151907 145992 140367 147890 164902 123034 76361 95984 99737 38771 37338
9280 37338 94670 91602 35110 22570 38753 29980 55533 119398 103155 82483 107925 131158
9268 131158 107188 112753 172357 175956 150516 131706 123942 132776 101648 23852 -3120 45345
9256 45345 66917 66520 107308 123832 121918 156329 148780 133851 115025 73143 82787 115213 118670
9243 118670 131757 174598 176349 173789 139069 86353 62668 42579 88396 103330 106554 154258
$$ packed form
9331E9754K6553o079K0576l722k5395J2218M5969j3936l0516j3753L4385l5167
9319G0887K6215J9588j208l0373l5591q820l7045l5629j3701J7260M5822l03R80
9306A8082J9254r39M1210L6082m2568m1564K820N344N0524K8798j6006l2456J3387
9293H1968L9387K3878O674n915n625P523J7012m1868m6673J9623L753o0966j433
9280C7338N7332l068n6492j2540J6183q773K5553O3865j6243k0672K5442K3233
9268A31158k3970N565N9604L599k5440j8810p764Q834l1128p7796k6972M8465
9256D5345K1572l97M0788J6524j914L4411p549j4929j8826m1882R644L2426L457
9243A18670J3087M2841J751k560l4720n2716k3685k0089M5817J4934L224M7704
$$ plain form
9231 154258 194010 214999 213157 226150 220774 153653 133202 136458 144320 115619 94786 90710 46881
9218 46881 74266 88698 124117 183054 200715 184057 167644 114512 117796 106896 146696 187099
9206 187099 229836 233164 256520 257526 274717 248681 253586 216063 164710 145769 201250 222406
9194 222406 233360 228788 239272 277007 201142 152087 160835 133719 124677 151313 168146 196525
9182 196525 207534 209203 225982 217609 223610 179354 172062 234087 249340 255052 245534 234297 238442
9169 238442 265631 289514 299401 318680 329654 299768 294207 293405 309818 337067 348014 345160 402824
9156 402824 425842 380192 382465 385613 384088 379977 394246 405454 404657 431439 423134 406075 403325
9143 403325 439428 491780 516172 525815 502554 503450 498198 563926 630744 609740 568917 543646
$$ packed form
9231A54258L9752K0989j842J2993n376o7121k0451L256P862k8701k0833m076m3829
9218D6881K7385J4432L5419N8937J7661j6658j6413n3132L284j0900L9800M0403
9206A87099M2737L328K3356J006J7191k6036M905l7523n1353j8941N5481K1156
9194B22406J0954m572J0484L7735p5865m9055Q748k7116r042K6636J6833K8379
9182A96525J1009J669J6779q373O001m4256p292O2025J5253N712r518j1237M145
9169B38442K7189K3883R887J9279J0974k9886n561q02J6413K7249J0947k854N7664
9156D02824K3018m5650K273L148j525m111J4269J1208p97K6782q305j7059k750
9143D03325L6103N2352K4392R643k3261Q96n252O5728O6818k1004m0823k5271
$$ plain form
9131 543646 567377 624475 668338 676828 723454 768132 807041 837478 866030 899086 932902 965574
9119 965574 981278 1019176 1087586 1097216 1132290 1197766 1278327 1342735 1404550 1464524 1550601 1666089
9107 1666089 1748653 1831690 1921509 2056106 2191151 2312636 2498070 2659365 2867944 3142258
9097 3142258 3360568 3618412 3949136 4288404 4700426 5188113 5745806 6350213 7103265 7964728
9087 7964728 9012932 10276909 11725989 13404271 15448366 17809268 20583698 23733125
9079 23733125 27029320 30176400 32799733 34472886 34788329 33729450 31503289 28624068
9071 28624068 25459260 22414521 19659206 17175773 15055623 13234082 11707938 10471129
9063 10471129 9394862 8451570 7590771 6870847 6264769 5712449 5227151 4806705 4352895
$$ packed form
9131E43646K3731N7098M3863Q490M6626M4678L8909L0437K8552L3056L3816L2672
9119I65574J5704L7898O8410R630L5074O5476Q0561O4408O1815N9974Q6077J15488
9107A666089Q2564Q3037Q9819J34597J35045J21485J85434J61295K08579K74314
9097C142258K18310K57844L30724L39268M12022M87687N57693O04407P53052Q61463
9087G964728J048204J263977J449080J678282K044095K360902K774430L149427
9079B3733125L296195L147080K623333J673153L15443j058879k226161k879221
9071B8624068l164808l044739k755315k483433k120150j821541j526144j236809
9063A0471129j076267r43292q60799p19924o06078n52320m85298m20446m53810
$$ plain form
9054 4352895 3998285 3721289 3469765 3305249 3061932 2890832 2772352 2581056 2433641 2301320
9044 2301320 2128311 1993159 1866027 1780809 1720970 1650813 1552816 1479336 1412128 1376998 1364849
9033 1364849 1265479 1179835 1116826 1082875 1071538 997648 952739 933157 921933 958684 942204
9022 942204 901696 862079 824465 795625 757876 703126 692152 669286 636751 592864 579803 562944
9010 562944 524685 468804 474079 476055 497665 455844 418460 398361 444232 470282 457756 446722
8998 446722 432690 442118 420666 403629 431384 428685 434343 431018 400595 384088 337036 282308
8986 282308 299008 286466 275097 269907 271008 286916 273407 284003 330060 323139 317912 294093
8974 294093 292889 319849 286249 252439 250460 241644 225245 252480 230651 255127 220178 216136
$$ packed form
9054D352895l54610k76996k51524j64516k43317j71100j18480j91296j47415j32321
9044B301320j73009j35152j27132q5218n9839p0157r7997p3480o7208l5130j2149
9033A364849r9370q5644o3009l3951j1337p3890m4909j9582j1224L6751j6480
9022I42204m0508l9617l7614k8840l7749n4750j0974k2866l2535m3887j3061j6859
9010E62944l8259n5881N275J976K1610m1821l7384k0099M5871K6050j2526j1034
8998D46722j4032R428k1452j7037K7755k699N658l325l0423j6507m7052n4728
8986B82308J6700j2542j1369n190J101J5908j3509J0596M6057o921n227k3819
8974B94093j204K6960l3600l3810j979q816j6399K7235k1829K4476l4949m042
$$ plain form
8962 216136 219294 212458 190358 171814 182577 207044 238837 222860 225929 225417 193839 199521 198356
8949 198356 174562 172987 189986 154886 168374 174517 199515 149406 84594 100021 134412 151104
8937 151104 172591 159876 146728 140550 182970 179719 181694 192185 196284 156799 146848 124109 163793
8924 163793 183955 221525 229414 219100 205928 170882 129740 127933 129065 139125 167289 110758
8912 110758 69731 13326 23097 108770 169026 220161 247652 258910 315979 386820 343306 301479
8900 301479 280140 213488 106719 102924 116269 67357 79366 57099 43748 86867 101866 76641
8888 76641 29705 39600 84693 70077 92985 128970 108593 93161 103615 101003 149985 185658
8876 185658 141887 52160 52432 72090 43322 26297 7570 59129 130755 129347 88214 62597
$$ packed form
8962B16136L158o836k2100j8544J0763K4467L1793j5977L069n12l1578N682j165
8949A98356k3794j575J6999l5100J3488O143K4998n0109o4812J5427L4391J6692
8937A51104K1487j2715j3148o178M2420l251J975J0491M099l9485r951k2739L9684
8924A63793K0162L7570P889j0314j3172l5046m1142j807J132J0060K8164n6531
8912A10758m1027n6405R771Q5673O0256N1135K7491J1258N7069P0841m3514m1827
8900C01479k1339o6652j06769l795J3345m8912J2009k2267j3351M3119J4999k5225
8888G6641m6936R895M5093j4616K2908L5985k0377j5432J0454k612M8982L5673
8876A85658m3771q9727K72J9658k8768j7025j8727N1559P1626j408m1133k5617
$$ plain form
8864 62597 93250 100446 80768 94184 74396 97562 105189 109328 115039 58205 -2995 33687 71711
8851 71711 118811 95698 87842 95776 102787 96759 96848 106999 113582 160667 194406 166049 106538
8838 106538 63316 63412 27559 35066 25654 -22731 -47569 -32096 2166 -1375 -23854 -9251 6181
8825 6181 43205 68530 -13392 -31172 11218 36079 33683 47407 71641 89108 129989 130057 75802
8812 75802 91489 139020 164989 195160 237419 220539 201964 169917 164508 165562 182437 167287
8800 167287 149120 141689 190075 220563 195411 173444 180372 169582 164096 143804 93747 56478
8788 56478 48012 63881 97129 122362 121340 73998 84347 144713 130202 117025 120816 161945
8776 161945 184769 150213 144437 163121 174769 187221 171915 156538 130238 117598 93006 98262
$$ packed form
8864F2597L0653P196j9678J3416j9788K3166P627M139N711n6834o1200L6682L8024
8851G1711M7100k3113p856P934P011o028Q9J0151O583M7085L3739k8357n9511
8838A06538m3222R6l5853P507r412m8385k4838J5473L4262l541k2479J4603J5432
8825F181L7024K5325q1922j7780M2390K4861k396J3724K4234J7467M0881O8n4255
8812G5802J5687M7531K5969L0171M2259j6880j8575l2047n409J054J6875j5150
8800A67287j8167p431M8386L0488k5152k1967O928j0790n486k0292n0057l7269
8788E6478q466J5869L3248K5233j022m7342J0349O0366j4511j3177L791M1129
8776A61945K2824l4556n776J8684J1648J2452j5306j5377k6300j2640k4592N256
$$ plain form
8764 98262 92820 79322 74095 97599 94284 86115 83300 82087 102817 143853 237302 279959 319475
8751 319475 324664 296584 278973 277166 279575 269746 294875 284058 227810 195087 186427 154204 116630
8738 116630 103654 141836 179324 183824 140311 145788 187174 178192 157229 155164 148503 128080 166382
8725 166382 229888 242105 186005 87230 89692 103118 103169 115968 101219 63066 84505 104067
8713 104067 104946 125369 192674 193024 176859 158948 177646 200145 162907 134545 148832 174753
8701 174753 173196 189892 193287 244720 259998 221267 231243 240694 230872 194950 204144 219708 296009
8688 296009 325127 322070 380042 439574 498453 529991 575325 660233 714350 823337 969493
8677 969493 1144754 1363210 1656316 2158058 2864764 3693353 4425004 4732478 4482056 3715594
$$ packed form
8764I8262n442j3498n227K3504l315q169k815j213K0730M1036R3449M2657L9516
8751C19475N189k8080j7611j807K409r829K5129j0817n6248l2723q660l2223l7574
8738A16630j2976L8182L7488M500m3513N477M1386q982k0963k065o661k0423L8302
8725A66382O3506J2217n6100r8775K462J3426N1J2799j4749l8153K1439J9562
8713A04067Q79K0423O7305L50j6165j7911J8698K2499l7238k8362J4287K5921
8701A74753j557J6696L395N1433J5278l8731R976R451r822l5922R194J5564P6301
8688B96009K9118l057N7972N9532N8879L1538M5334Q4908N4117J08987J46156
8677I69493J75261K18456K93106N01742P06706Q28589P31651L07474k50422p66462
$$ plain form
8667 3715594 2863509 2149645 1683752 1414822 1231570 1101287 1080956 1119572 1142359 1058949
8657 1058949 947319 822989 790410 775336 730340 703075 737265 717837 651857 624751 638798
8646 638798 685939 691120 728093 779285 825445 890548 965115 1037380 1136497 1233726 1403078 1606223
8634 1606223 1817223 2125649 2542764 3129122 4001298 5275810 6956302 8612764 9510122
8625 9510122 9403060 8282210 6529340 4987406 3950710 3260377 2784751 2471240 2285347
8616 2285347 2130115 1980482 1847485 1688626 1513311 1370325 1304908 1208522 1017454 928408
8606 928408 863310 819653 827859 799931 762214 730913 686442 683722 736936 737067 708832 745377
8594 745377 787621 777842 811515 939717 994128 1042745 1205281 1480993 1838359 2285966 2885717
$$ packed form
8667C715594q52085p13864m65893k68930j83252j30283k0331L8616K2787q3410
8657A058949j11630j24330l2579j5074m4996k7265L4190j9428o5980k7106J4047
8646F38798M7141N181L6973N1192M6160O5103P4567P2265R9117R7229J69352K03145
8634A606223K11000L08426M17115N86358Q72176J274512J680492J656462Q97358
8625I510122j07062j120850j752870j541934j036696o90333m75626l13511j85893
8616B285347j55232j49633j32997j58859j75315j42986o5417r6386j91068q9046
8606I28408o5098m3657Q206k7928l7717l1301m4471k720N3214J31k8235L6545
8594G45377M2244r779L3673J28202N4411M8617J62536K75712L57366M47607N99751
$$ plain form
8583 2885717 3637868 4209943 4354729 4047723 3348104 2603675 1994423 1580838 1312069 1116408
8573 1116408 1021734 980306 947228 882000 775285 660224 583122 534279 498985 471248 491293
8562 491293 468266 432964 399513 431473 413968 368795 369158 334442 324347 358611 339470 258564
8550 258564 175446 166066 190462 199685 163306 141069 163083 145943 117829 112480 75040 134578
8538 134578 194893 186587 233817 214322 147732 114201 76499 93596 50582 45613 116933 103002
8526 103002 109198 139368 158996 136523 151581 128912 110880 129817 117571 94367 71751 92603
8514 92603 118773 125368 148927 161325 210145 224025 179254 180294 190684 174000 136903 120851
8502 120851 146633 183345 132698 114498 106610 114753 111272 160299 127986 102900 89041 86949
$$ packed form
8583B885717P52151N72075J44786l07006o99619p44429o09252m13585k68769j95661
8573A116408r4674m1428l3078o5228j06715j15061p7102m8843l5294k7737K0045
8562D91293k3027l5302l3451L1960j7505m5173L63l4716j0095L4264j9141q0906
8550B58564q3118r380K4396R223l6379k2237K2014j7140k8114n349l7440N9538
8538A34578O0315q306M7230j9495o6590l3531l7702J7097m3014m969P1320j3931
8526A03002O196L0170J9628k2473J5058k2669j8032J8937j2246k3204k2616K0852
8514I2603K6170O595K3559J2398M8820J3880m4771J040J0390j6684l7097j6052
8502A20851K5782L6712n0647j8200p888Q143l481M9027l2313k5086j3859k092
$$ plain form
8490 86949 97780 135881 111459 101765 101431 102251 96514 133048 148315 106313 106424 91108 120846
8477 120846 122643 90791 48920 28575 61138 36761 17049 42204 55964 29874 2763 45686
8465 45686 55041 21450 20031 33905 43208 46054 94241 123811 82778 101012 101851 94257 70255
8452 70255 28409 8183 43232 56595 61782 43565 54837 94305 70772 50763 55040 2114
8440 2114 16798 35659 6977 25752 27211 12285 -4500 72623 105523 83065 69903 40864
8428 40864 -16117 -71871 -57737 -49632 -53948 -36535 -5440 35015 48593 15512 13582 25569
8416 25569 26708 68531 88974 66781 41241 31176 22850 33297 59298 116596 126735 178620
8404 178620 204730 155022 85478 62427 44940 47160 71459 78309 59815 58721 57929 50056 68659
$$ packed form
8490H6949J0831L8101k4422r694l34Q20n737L6534J5267m2002J11j5316K9738
8477A20846J797l1852m1871k0345L2563k4377j9712K5155J3760k6090k7111M2923
8465D5686R355l3591j419J3874R303K846M8187K9570m1033J8234Q39p594k4002
8452G0255m1846k0226L5049J3363N187j8217J1272L9468k3533k0009M277n2926
8440B114J4684J8861k8682J8775J459j4926j6785P7123L2900k2458j3162k9039
8428D0864n6981n5754J4134Q105m316J7413L1095M0455J3578l3081j930J1987
8416B5569J139M1823K0443k2193k5540j0065q326J0447K6001N7298J0139N1885
8404A78620K6110m9708o9544k3051j7487K220K4299O850j8494j094p92p873J8603
$$ plain form
8391 68659 49864 51566 84033 101331 73180 65070 58520 29646 32465 66530 100659 91219 72704
8378 72704 65330 45063 38055 77205 93537 99299 115388 118021 84794 54449 94250 127559 87893
8365 87893 44980 -6218 -27763 -58242 -13311 -10072 15516 53969 56586 57809 59089 59779 57199
8352 57199 81044 59118 56539 127452 151394 100057 22656 92 11473 18330 576 -22311
8340 -22311 20424 964 23715 38442 21175 -14836 -6931 9684 17389 17117 -14855 -34420 -23298
8327 -23298 -19552 -11074 -11802 -3262 -27181 -26757 -11767 27852 55422 88410 122532 113385 86824
8314 86824 50847 23270 -19754 -9043 -48776 -74780 -57764 -38050 -3056 -5324 -44125 -33153
8302 -33153 20311 40507 58742 50524 35450 51994 27834 17172 35168 65002 64912 70971 48893
$$ packed form
8391F8659j8795J702L2467J7298k8151q110o550k8874K819L4065L4129r440j8515
8378G2704p374k0267p008L9150J6332N762J6089K633l3227l0345L9801L3309l9666
8365H7893m2913n1198k1545l0479M4931L239K5588L8453K617J223J280O90k580
8352E7199K3845k1926k579P0913K3942n1337p7401k2564J1381O857j7754k2887
8340b2311M2735j9460K2751J4727j7267l6011P905J6615P705k72l1972j9565J1122
8327b3298L746Q478p28Q540k3919M24J4990L9619K7570L2988L4122r147k6561
8314H6824l5977k7577m3024J0711l9733k6004J7016J9714L4994k268l8801J0972
8302c3153N3464K0196J8235q218j5074J6544k4160j0662J7996K9834r0O059k2078
$$ plain form
8289 48893 28371 -7717 -11374 -10564 -29422 -1330 19138 22041 15772 58599 55828 2886 -5865
8276 -5865 1006 36731 27471 37408 69199 85792 112897 107811 83038 5301 15057 74366 75098
8263 75098 61598 36480 -3933 -25522 -23454 -23947 -24963 -26063 -29048 9264 -10831 2790 -15036
8250 -15036 -22320 5523 9389 21805 43490 26236 41944 68783 67740 83179 49349 71008
8238 71008 145901 121708 84923 28990 -1783 4536 21791 46603 59836 79377 71776 91170
8226 91170 116621 124194 99628 130226 154179 111712 72965 67591 101972 73899 60081 74624
8214 74624 56569 55197 38771 58218 21111 -6183 28678 26670 47127 56437 82354 81552 61879
8201 61879 27840 -24431 -36377 -62357 -66256 -36484 7087 61542 70162 84246 120839 85340
$$ packed form
8289D8893k0522l6088l657Q10j8858K8092K0468K903o269M2827k771n2942q751
8276e865O871L5725r260R937L1791J6593K7105n086k4773p7737R756N9309P32
8263G5098j3500k5118m0413k1589K068m93j016j100k985L8312k0095J3621j7826
8250a5036p284K7843L866J2416K1685j7254J5708K6839j043J5439l3830K1659
8238G1008P4893k4193l6785n5933l0773O319J7255K4812J3233J9541p601J9394
8226I1170K5451P573k4566L0598K3953m2467l8747n374L4381k8073j3818J4543
8214G4624j8055j372j6426J9447l7107k7294L4861k008K0457R310K5917q02j9673
8201F1879l4039n2271j1946k5980l899K9772M3571N4455Q620J4084L6593l5499
$$ plain form
8189 85340 46880 22934 8724 39740 58944 33311 55700 64463 42674 23639 66939 62854
8177 62854 61193 43100 38157 65118 52529 11581 -4253 42107 52116 46422 36788 76629 133197
8164 133197 96065 71995 38986 6698 -40846 -24733 -9774 -28811 -28183 -47373 -80452 -59750
8152 -59750 10478 51402 53016 37708 8690 -30528 -7491 13944 28809 37285 71016 28785
8140 28785 8355 2429 15848 -2139 -5231 -17098 299 10454 -2667 25309 8217 -44032
8128 -44032 -80916 -67848 -23929 -7640 15368 33733 56130 59139 65966 42694 21083 44618
8116 44618 74983 63964 41715 54701 51970 37326 34354 43756 53075 68948 64682 52751 59840
8103 59840 74384 115249 86951 43819 24871 32934 5742 -26405 -34027 -22423 2721 32824
$$ packed form
8189H5340l8460k3946j4210L1016J9204k5633K2389Q763k1789j9035M3300m085
8177F2854j661j8093m943K6961j2589m0948j5834M6360J0009n694r634L9841N6568
8164A33197l7132k4070l3009l2288m7544J6113J4959j9037O28j9190l3079K0702
8152e9750P0228M0924J614j5308k9018l9218K3037K1435J4865Q476L3731m2231
8140B8785k0430n926J3419j7987l092j1867J7397J0155j3121K7976j7092n2249
8128d4032l6884J3068M3919J6289K3008J8365K2397L009O827k3272k1611K3535
8116D4618L0365j1019k2249J2986k731j4644k972R402R319J5873m266j1931P089
8103E9840J4544M0865k8298m3132j8948Q063k7192l2147p622J1604K5144L0103
$$ plain form
8091 32824 48740 71202 38063 -16929 -54524 -55880 -16653 -10320 28906 23354 48815 26639
8079 26639 26949 -7273 -24293 -2048 58946 57697 17112 71380 109844 102586 111516 96759 60817
8066 60817 28878 58020 67643 104269 141694 112944 83053 124287 146467 162932 171793 145772
8054 145772 134764 106377 84979 33985 37298 81784 102852 98958 107936 119327 122754 134853
8042 134853 126794 128861 123519 118324 147507 175428 154685 150431 156137 173988 201303 212006 245149
8029 245149 232319 221061 214773 212988 186762 193205 187377 192939 195954 202788 190926 181041 186935
$$ packed form
8091C2824J5916K2462l3139n4992l7595j356L9227O333L9226n552K5461k2176
8079B6639L10l4222j7020K2245O0994j249m0585N4268L8464p258Q930j4757l5942
8066F0817l1939K9142R623L6626L7425k8750k9891M1234K2180J6465Q861k6021
8054A45772j1008k8387k1398n0994L313M4486K1068l894Q978J1391L427J2099
8042A34853q059K067n342n195K9183K7921k0743m254N706J7851K7315J0703L3143
8029B45149j2830j1258o288j785k6226O443n828N562L015O834j1862r885N894
$$ [...]
##END NTUPLES=NMR SPECTRUM
##END=
