##TITLE=Analysis number 323266
Compound Code cc 63609
Book Reference 439/195/37
Project Code adrs
Chemist Name ronp
##JCAMPDX= 6.0         $$ Bruker NMR JCAMP-DX V2.0
##DATA TYPE= NMR SPECTRUM
##DATA CLASS= NTUPLES
##ORIGIN= Bruker BioSpin GmbH
##OWNER= nmr
$$ XWIN-NMR		Version 3.5
$$ Fri Oct 20 09:10:23 2006 GMT Daylight Time (UT+1h)  MAYBRIDGE\nmr@NMR_250MHZ
##.OBSERVE FREQUENCY= 250.131544655141
##.OBSERVE NUCLEUS= ^1H
##.ACQUISITION MODE= SIMULTANEOUS (DQD)
##.ACQUISITION SCHEME= undefined
##.AVERAGES= 16
##.DIGITISER RES= 18
##SPECTROMETER/DATA SYSTEM= dpx250
##.PULSE SEQUENCE= zg30
##.SOLVENT NAME= CDCl3
##.SHIFT REFERENCE= (INTERNAL, CDCl3, 0, 16.4289)
##AUDIT TRAIL= $$ (NUMBER, WHEN, WHO, WHERE, WHAT)
$$ ##TITLE= Audit trail, XWIN-NMR		Version 3.5
$$ ##JCAMPDX= 5.01
$$ ##ORIGIN= Bruker BioSpin GmbH
$$ ##OWNER= nmr
$$ C:\u/data/dgb/nmr/ADRS/990/pdata/1/auditp.txt
$$ ##AUDIT TRAIL=  $$ (NUMBER, WHEN, WHO, WHERE, WHAT)
(   1,<2006-10-20 09:10:02.39 +100>,<MAYBRIDGE\nmr>,<NMR_250MHZ>,
      <created by zg, POWCHK disabled, PULCHK disabled
       configuration hash MD5:
       49 4B E0 1D 92 C2 6B 37 9F E6 65 BC 52 41 86 1D
       data hash MD5: 64K
       CE F0 AA 9D 6B 4B 3B A1 1C FE 73 A5 D3 12 7E FC>)
(   2,<2006-10-20 09:10:15.01 +100>,<MAYBRIDGE\nmr>,<NMR_250MHZ>,
      <Start of raw data processing
       ef LB = 0.3 FT_mod = 6 PKNL = 1 SI = 32K 
       data hash MD5: 32K
       D4 F6 75 37 23 9E 3F 8B 7D A4 D1 CE CD EE 0F 24>)
(   3,<2006-10-20 09:10:16.75 +100>,<MAYBRIDGE\nmr>,<NMR_250MHZ>,
      <apk 
       data hash MD5: 32K
       3A 14 F1 95 C9 C5 A8 25 58 3F 9A A6 C4 81 A2 4A>)
(   4,<2006-10-20 09:10:17.42 +100>,<MAYBRIDGE\nmr>,<NMR_250MHZ>,
      <abs ABSG = 5 
       data hash MD5: 32K
       47 C4 A0 3D 34 E5 75 4C 58 DA B4 23 29 50 E2 E4>)
$$ ##END=
$$ 
$$ hash MD5
$$ 25 FB 22 12 62 40 F2 1C 6C 32 5A 11 FD D4 E5 11
##$RELAX= 
##$RELAX= 
##$RELAX= 
##$RELAX= 
##$RELAX= 
##$RELAX= 
##$RELAX= 
$$ Bruker specific parameters
$$ --------------------------
##$DU= <C:\u>
##$EXPNO= 990
##$NAME= <ADRS>
##$PROCNO= 1
##$TYPE= <nmr>
##$USER= <dgb>
##$AMP= (0..31)
100 100 100 100 100 100 100 100 100 100 100 100 100 100 100 100 100 100 
100 100 100 100 100 100 100 100 100 100 100 100 100 100 
##$AQSEQ= 0
##$AQ_mod= 3
##$AUNM= <au_zg>
##$AUTOPOS= <46 >
##$BF1= 250.13
##$BF2= 250.13
##$BF3= 250.13
##$BF4= 250.13
##$BF5= 500.13
##$BF6= 500.13
##$BF7= 500.13
##$BF8= 500.13
##$BYTORDA= 1
##$CFDGTYP= 0
##$CFRGTYP= 5
##$CHEMSTR= <none>
##$CNST= (0..31)
1 1 145 1 1 1 1 1 1 1 1 1 1 1 1 1 1 1 1 1 1 1 1 1 1 1 1 1 1 1 1 1 
##$CPDPRG= <>
##$CPDPRG1= <>
##$CPDPRG2= <>
##$CPDPRG3= <>
##$CPDPRG4= <mlev>
##$CPDPRG5= <mlev>
##$CPDPRG6= <mlev>
##$CPDPRG7= <mlev>
##$CPDPRG8= <mlev>
##$CPDPRGB= <>
##$CPDPRGT= <>
##$D= (0..31)
0 1 0 0 0 0 0 0 0 0.06 0 0 0 0 0 0 0.0002 0 0 0 0 0 0 0 0 0 0 0 0 0 0 
0 
##$DATE= 1161331801
##$DBL= (0..7)
120 120 120 120 120 120 120 120 
##$DBP= (0..7)
150 150 150 150 150 150 150 150 
##$DBP07= 0
##$DBPNAM0= <>
##$DBPNAM1= <>
$$ [...]
##$SUBNAM7= <"">
##$SUBNAM8= <"">
##$SUBNAM9= <"">
##$SW= 20.6930455092707
##$SWIBOX= (0..15)
0 0 3 0 0 0 0 0 0 0 0 0 0 0 0 0 
##$SW_h= 5175.983436853
##$TD= 65536
##$TD0= 1
##$TE= 683.16
##$TE2= 300
##$TE3= 300
##$TEG= 300
##$TL= (0..7)
0 120 120 120 120 120 120 120 
##$TP= (0..7)
150 150 150 150 150 150 150 150 
##$TP07= 0
##$TPNAME0= <>
##$TPNAME1= <>
##$TPNAME2= <>
##$TPNAME3= <>
##$TPNAME4= <>
##$TPNAME5= <>
##$TPNAME6= <>
##$TPNAME7= <>
##$TPOAL= (0..7)
0.5 0.5 0.5 0.5 0.5 0.5 0.5 0.5 
##$TPOFFS= (0..7)
0 0 0 0 0 0 0 0 
##$TUNHIN= 0
##$TUNHOUT= 0
##$TUNXOUT= 0
##$USERA1= <user>
##$USERA2= <user>
##$USERA3= <user>
##$USERA4= <user>
##$USERA5= <user>
##$V9= 5
##$VALIST= <valist>
##$VCLIST= <CCCCCCCCCCCCCCC>
##$VD= 0
##$VDLIST= <DDDDDDDDDDDDDDD>
##$VPLIST= <PPPPPPPPPPPPPPP>
##$VTLIST= <TTTTTTTTTTTTTTT>
##$WBST= 1024
##$WBSW= 4
##$XGAIN= (0..3)
0 0 0 0 
##$XL= 0
##$YL= 0
##$YMAX_a= 646950
##$YMIN_a= -461045
##$ZGOPTNS= <>
##$ZL1= 120
##$ZL2= 120
##$ZL3= 120
##$ZL4= 120
##$ABSF1= 16.42887
##$ABSF2= -4.264301
##$ABSG= 5
##$ABSL= 3
##$ALPHA= 0
##$AQORDER= 0
##$ASSFAC= 0
##$ASSFACI= 0
##$ASSFACX= 0
##$ASSWID= 0
##$AUNMP= <proc_1d>
##$AZFE= 0.1
##$AZFW= 0.1
##$BCFW= 0
##$BC_mod= 0
##$BYTORDP= 0
##$COROFFS= 0
##$CY= 12.5
##$DATMOD= 1
##$DC= 0
##$DFILT= <>
##$DTYPP= 0
##$F1P= 14.0000005364418
##$F2P= -0.99999901652339
##$FCOR= 0.5
##$FTSIZE= 32768
##$FT_mod= 6
##$GAMMA= 0
##$GB= 0
##$INTBC= 1
##$INTSCL= 1
##$ISEN= 128
##$LB= 0.3
##$LEV0= 0
##$LPBIN= 0
##$MAXI= 10000
##$MC2= 0
##$MEAN= 0
##$ME_mod= 0
##$MI= 0
##$NCOEF= 0
##$NC_proc= -4
##$NLEV= 6
##$NOISF1= 0
##$NOISF2= 0
##$NSP= 0
##$NTH_PI= 0
##$NZP= 0
##$OFFSET= 16.42887
##$PC= 1
##$PHC0= -51.27377
##$PHC1= 8.154651
##$PH_mod= 1
##$PKNL= yes
##$PPARMOD= 0
##$PSCAL= 4
##$PSIGN= 0
##$REVERSE= no
##$SF= 250.130023293672
##$SI= 32768
##$SIGF1= 0
##$SIGF2= 0
##$SINO= 400
##$SIOLD= 32768
##$SREGLST= <1H.CDCl3>
##$SSB= 0
##$STSI= 32768
##$STSR= 0
##$SW_p= 5175.98343685301
##$SYMM= 0
##$S_DEV= 0
##$TDeff= 65536
##$TDoff= 0
##$TI= <Analysis number 999999
Compound Code 99
Book Reference 9
Project Code 9>
##$TILT= no
##$TM1= 0
##$TM2= 0
##$TOPLEV= 0
##$USERP1= <user>
##$USERP2= <user>
##$USERP3= <user>
##$USERP4= <user>
##$USERP5= <user>
##$WDW= 1
##$XDIM= 32768
##$YMAX_p= 401278325
##$YMIN_p= -180704
$$ End of Bruker specific parameters
$$ ---------------------------------
##NTUPLES= NMR SPECTRUM
##VAR_NAME=  FREQUENCY,     SPECTRUM/REAL,   SPECTRUM/IMAG
##SYMBOL=    X,             R,               I
##VAR_TYPE=  INDEPENDENT,   DEPENDENT,       DEPENDENT
##VAR_FORM=  AFFN,          ASDF,            ASDF
##VAR_DIM=   32768,         32768,           32768
##UNITS=     HZ,            ARBITRARY UNITS, ARBITRARY UNITS
##FACTOR=    0.157963299565203, 1,           1
##FIRST=     4109.35344754999, 0,            0
##LAST=      -1066.62998930302, 0,           0
##MIN=       -1066.62998930302, -180704,     0
##MAX=       4109.35344754999, 401278325,    0
$$ Real data points
##PAGE= N=1
##DATA TABLE= (X++(R..R)), XYDATA
$$ [...]
$$ plain form
20158 -19959 482 43417 63376 33310 -866 6608 24948 13055 -9348 -3141 -12212 -23427
20146 -23427 10265 39112 61880 40726 -19266 -40436 -37362 -45645 -43323 -18242 -5706 15000
20134 15000 23466 14133 -21821 8071 90741 66429 106131 64256 71038 103432 37210 -29217
20122 -29217 7516 101155 102756 108607 79684 49955 11530 -3485 19314 37887 72140 13377
20110 13377 -64404 -86503 -61512 -70801 -67724 -48270 -22366 -27513 3809 -14838 -3486 -46518
20098 -46518 -102045 -125159 -80615 -27173 -32138 -38684 -29841 32367 55886 57104 39371 29093
20086 29093 -629 -32700 -50290 -38569 -9533 14618 56827 65772 23912 -24024 -7522 -12703
20074 -12703 -39678 16820 51778 79273 72306 40913 30594 59440 49692 -16834 -4615 31934
$$ packed form
20158a9959K0441M2935J9959l0066l4176P474J8340j1893k2403O207r071j1215
20146b3427L3692K8847K2768k1154n9992k1170L074q283K322K5081J2536K0706
20134A5000Q466r333l5954K9892Q2670k4312L9702m1875O782L2394o6222o6427
20122b9217L6733R3639J601N851k8923k9729l8425j5015K2799J8573L4253n8763
20110A3377p7781k2099K4991r289L077J9454K5904n147L1322j8647J1352m3032
20098d6518n5527k3114M4544N3442m965o546Q843O2208K3519J218j7733j0278
20086B9093k9722l2071j7590J1721K9036K4151M2209Q945m1860m7936J6502n181
20074a2703k6975N6498L4958K7495o967l1393j0319K8846r748o6526J2219L6549
$$ plain form
20062 31934 5802 20026 39966 15096 38431 71590 25171 -20842 -21826 -9823 -4005 -1660
20050 -1660 19512 40725 56321 31556 16752 46786 66037 62686 72695 81858 986 -20287
20038 -20287 10299 -2543 24743 22223 17800 -1636 56226 92334 120141 120441 88143 44262
20026 44262 -16200 -33934 21352 27764 -7441 18655 35233 12431 18887 44976 14910 -1256
20014 -1256 44896 61719 8288 44001 72853 33918 -8958 -25536 -1249 19164 54953 82239
20002 82239 63540 46343 38078 55921 57687 67069 95658 106320 123180 134498 144362 140069 122899
19989 122899 80121 30598 40773 6860 -34015 -65557 -41682 -10872 20342 -12906 6908
19978 6908 16125 17121 41724 45199 62578 45224 -11550 33108 66449 32671 54149 95029 80400
$$ packed form
20062C1934k6132J4224J9940k4870K3335L3159m6419m6013r84J2003N818K345
20050a660K1172K1213J5596k4765j4804L0034J9251l351J0009R163q0872k1273
20038b0287L0586j2842K7286k520m423j9436N7862L6108K7807L00l2298m3881
20026D4262o0462j7734N5286O412l5205K6096J6578k2802O456K6089l0066j6166
20014a256M6152J6823n3431L5713K8852l8935m2876j6578K4287K0413L5789K7286
20002H2239j8699j7197q265J7843J766R382K8589J0662J6860J1318R864m293j7170
19989A22899m2778m9523J0175l3913m0875l1542K3875L0810L1214l3248J9814
19978F908R217R96K4603L475J7379j7354n6774M4658L3341l3778K1478M0880j4629
$$ plain form
19965 80400 1558 -4152 -41266 -33061 -24446 -27381 -43907 -85742 -83662 -34831 -14048 -5295 -30740
19952 -30740 12890 27 11999 -9703 -3448 36626 33039 560 5662 18113 -31521 -34817
19940 -34817 12526 51268 47690 46334 31335 19980 24995 49755 65725 62688 5887 -188 -2709
19927 -2709 4203 38646 44968 42235 54233 -36403 -38334 -16700 -13318 16894 38337 49423 46118
19914 46118 -4234 -30539 -13773 -45408 -67008 -25125 18443 25663 7967 11408 -2012 -23808
19902 -23808 -9787 -15474 -15967 -35955 -45549 -68607 -38520 8136 7 2958 2325 23951 51981
19889 51981 48660 25953 -30252 -47696 2779 53552 55139 53875 81842 92794 77201 53461
19877 53461 19834 11227 49178 80978 76867 58457 35790 22608 9321 30372 105557 102597
$$ packed form
19965H0400p8842n710l7114Q205Q615k935j6526m1835K080M8831K0783Q753k5445
19952c0740M3630j2863J1972k1702O255M0074l587l2479N102J2451m9634l296
19940c4817M7343L8742l578j356j4999j1355N015K4760J5970l037n6801o075k521
19927b709O912L4443O322k733J1998r0636j931K1634L382L0212K1443J1086l305
19914D6118n0352k6305J6766l1635k1600M1883M3568P220j7696L441j3420k1796
19902b3808J4021n687m93j9988r594k3058L0087M6656q129K951o33K1626K8030
19889E1981l321k2707n6205j7444N0475N0773J587j264K7967J0952j5593k3740
19877E3461l3627q607L7951L1800m111j8410k2667j3182j3287K1051P5185k960
$$ plain form
19865 102597 59192 21923 28556 15735 -24292 -6313 46235 58005 47716 45713 61470 48540
19853 48540 1494 -8010 3851 8920 -12077 -34792 -41887 -28408 -28024 -11081 1308 -29924 -58990
19840 -58990 -57757 -22925 43664 33229 36544 23782 47914 52861 -13654 -8133 47067 25653
19828 25653 -18245 -43119 6735 40715 29291 46182 674 -28150 -18505 -33390 -19543 -12989
19816 -12989 5998 16886 26926 16001 24786 25337 50123 58588 32420 -25319 -29341 15558 25961
19803 25961 -22118 -42795 -32664 -34314 -4203 27903 13318 26053 5127 -33430 -44796 -68587
19791 -68587 -21355 51563 63073 80072 95617 71864 55998 89694 94125 79210 71443 27281
19779 27281 -19497 -43289 -2093 1276 -16990 -24971 -47180 -36139 25856 30520 54399 5954
$$ packed form
19865A02597m3405l7269O633j2821m0027J7979N2548J1770j0289k003J5757j2930
19853D8540m7046r504J1861N069k0997k2715p095J3479L84J6943J2389l1232k9066
19840e8990J233L4832O6589j0435L315j2762K4132M947o6515N521N5200k1414
19828B5653m3898k4874M9854L3980j1424J6891m5508k8824R645j4885J3847O554
19816a2989J8987J0888J0040j0925Q785N51K4786Q465k6168n7739m022M4899J0403
19803B5961m8079k0677J0131j650L0111L2106j4585J2735k0926l8557j1366k3791
19791f8587M7232P2918J1510J6999J5545k3753j5866L3696M431j4915p767m4162
19779B7281m6778k3792M1196L369j8266p981k2209J1041O1995M664K3879m8445
$$ plain form
19767 5954 21403 39801 36356 48677 43276 49758 14703 -23261 -1039 10342 8866 26137 27648
19754 27648 20861 32409 1334 -38459 -33663 -1494 39347 37665 4400 54076 89625 82784
19742 82784 -2582 -59611 -56254 4574 61207 66103 95683 98263 115491 125391 123071 57671 1571
19729 1571 -7868 -15414 23036 24412 12236 4133 -9983 4499 20801 60267 68344 69637 28439
19716 28439 3634 9157 42117 85638 107029 117819 116855 66830 18626 -1758 -15606 -32918
19704 -32918 -22630 -25640 -25225 -38302 -59925 -29770 -19621 -13470 -31189 -60594 -89382 -81857 -49980
19691 -49980 7366 44706 45882 68562 74803 51184 17375 25289 19702 19768 41052 92731 97293
19678 97293 103745 116544 71253 34216 27162 64213 67150 53045 37297 32056 31388 18975 -17677
$$ packed form
19767E954J5449J8398l445J2321n401O482l5055l7964K2222J1381j476J7271J511
19754B7648o787J1548l1075l9793M796L2169M0841j682l3265M9676L5549o841
19742H2784q5366n7029L357O0828N6633M896K9580K580J7228R900k320o5400n6100
19729A571r439p546L8450J376j2176q103j4116J4482J6302L9466Q077J293m1198
19716B8439k4805N523L2960M3521K1391J0790r64n0025m8204k0384j3848j7312
19704c2918J0288l010M15j3077k1623L0155J0149O151j7719k9405k8788P525L1877
19691d9980N7346L7340J176K2680O241k3619l3809P914n587O6K1284N1679M562
19678I7293O452J2799m5291l7037p054L7051K937j4105j5748n241o68j2413l6652
$$ plain form
19665 -17677 -25263 -18150 -44188 -38504 -4143 17855 24173 32107 38223 762 -28927 -26301 -7759
19652 -7759 8415 -24173 -44897 28178 36490 49868 71825 73264 22639 -245 -17049 3492
19640 3492 35479 71696 76970 48197 15931 -12858 -21840 1222 -9087 -22728 -1648 -3622
19628 -3622 -5727 -31518 -32273 -22766 19161 38967 23979 75416 30923 19242 45358 50546 37893
19615 37893 24390 -6952 -62936 -10327 549 21510 45954 51531 80007 87258 74533 50150
19603 50150 18084 -1345 -10136 80842 112912 77199 49308 23573 -2724 19112 35793 24383
19591 24383 20379 19722 3921 -11626 1137 21296 80370 81818 43894 46609 56389 62067 52828
19578 52828 26913 44763 24051 38877 31646 42235 37152 67338 86185 64093 39066 -3009
$$ packed form
19665a7677p586P113k6038N684L4361K1998O318P934O116l7461k9689K626J8542
19652g759J6174l2588k0724P3075Q312J3378K1957J439n0625k2884j6804K0541
19640C492L1987L6217N274k8773l2266k8789q982K3062j0309j3641K1080j974
19628c622k105k5791p55R507M1927J9806j4988N1437m4493j1681K6116N188j2653
19615C7893j3503l1342n5984N2609J0876K0961K4444N577K8476P251j2725k4383
19603E0150l2066j9429q791R0978L2070l5713k7891k5735k6297K1836J6681j1410
19591B4383m004o57j5801j5547J2763K0159N9074J448l7924K715R780N678r239
19578E2828k5915J7850k0712J4826p231J0589n083L0186J8847k2092k5027m2075
$$ plain form
19566 -3009 -46379 -43572 19342 70830 119091 105760 74669 49226 43059 72975 61526 53870
19554 53870 97464 103446 80346 80342 87565 106129 90538 42610 27569 74553 67966 37065 -20462
19541 -20462 -12710 -9920 -27398 -37902 -14975 -18605 -15620 -1010 34554 48428 59074 74125
19529 74125 115276 160279 117910 60697 85279 105928 78010 71945 65685 104130 139209 128275
19517 128275 51662 37728 -3683 -1154 -4173 -20486 -37806 -9682 -16413 10722 -8890 -26988
19505 -26988 -19895 -44557 -37074 16687 62078 70982 57694 71477 64947 86153 85388 22283 24150
19492 24150 51798 78234 76182 71001 60739 36723 -23326 -16763 45349 57433 6079 9226
19480 9226 55602 48607 32605 23180 -7772 21629 40373 27922 18631 17836 37170 44159 79763
$$ packed form
19566c009m3370K807O2914N1488M8261j3331l1091k5443o167K9916j1449p656
19554E3870M3594N982k3100mP223J8564j5591m7928j5041M6984o587l0901n7527
19541b0462P752K790j7478j0504K2927l630K985J4610L5564J3874J0646J5051
19529G4125M1151M5003m2369n7213K4582K0649k7918o065o260L8445L5079j0934
19517A28275p6613j3934m1411K529l019j6313j7320K8124o731K7135j9612j8098
19505b6988P093k4662P483N3761M5391Q904j3288J3783o530K1206p65o3105J867
19492B4150K7648K6436k052n181j0262k4016o0049O563O2112J2084n1354L147
19480I226M6376o995j6002r425l0952K9401J8744j2451r291p95J9334O989L5604
$$ plain form
19467 79763 81873 15422 -10369 34335 67926 70054 64833 41961 85044 80417 7738 1500 -4198
19454 -4198 7439 19823 72887 74050 70444 104806 118322 86032 43461 70312 109340 85046
19442 85046 22935 -2860 44354 47640 19606 -4925 -499 11674 22208 54960 122956 141477
19430 141477 101889 59591 52178 61027 45065 87683 109308 71103 22568 11402 25080 36274
19418 36274 49906 60727 38381 30012 20442 48652 58942 61061 60236 64729 61481 -1952 -31041
19405 -31041 32134 39720 2241 -4047 39797 67443 81534 89213 69196 80763 109279 90336
19393 90336 45629 83075 101436 89838 64666 27942 39582 43441 86260 63097 -2102 6295
19381 6295 9628 8493 72757 78431 31739 -15827 -6192 3181 12593 77002 86367 58817 55150
$$ packed form
19467G9763K110o6451k5791M4704L3591K128n221k2872M3083m627p2679o238n698
19454d198J1637J2384N3064J163l606L4362J3516l2290m2571K6851L9028k4294
19442H5046o2111k5795M7214L286k8034k4531M426J2173J0534L2752O7996J8521
19430A41477l9588m2298p413Q849j5962M2618K1625l8205m8535j1166J3678J1194
19418C6274J3632J0821k2346q369r570K8210J0290K119q25M493l248o3433k9089
19405c1041O3175P586l7479o288M3844K7646J4091P679k0017J1567K8516j8943
19393I0336m4707L7446J8361j1598k5172l6724J1640L859M2819k3163o5199Q397
19381F295L333j135O4264N674m6692m7566R635R373R412O4409R365k7550l667
$$ plain form
19368 55150 12260 -5817 25261 10499 37648 29694 54917 76916 137756 140780 117396 102222
19356 102222 83233 45661 33941 4570 22161 18320 -3680 -54878 -50445 -21397 5147 11605
19344 11605 -4667 32706 117023 150349 186840 165380 57756 15215 3116 2284 56924 92602
19332 92602 101015 85223 119007 98061 91636 75427 80817 143077 160216 152234 71845 4451
19320 4451 4762 5986 12253 23295 27427 43434 62500 74332 82735 105696 103923 79526 74817
19307 74817 97381 103827 73897 59212 58271 52776 73923 41536 42034 72649 87768 95392 96939
19294 96939 96513 109086 89463 103874 136159 101931 68701 90378 62892 17557 34523 30325
19282 30325 70512 119815 95535 141450 205918 170130 63647 27413 -891 -25252 -55721
$$ packed form
19368E5150m2890j8077L1078j4762K7149p954K5223K1999O0840L024k3384j5174
19356A02222j8989l7572j1720k9371J7591l841k2000n1198M433K9048K6544O458
19344A1605j6272L7373Q4317L3326L6491k1460j07624m2541j2099q32N4640L5678
19332I2602Q413j5792L3784k0946o425j6209N390O2260J7139p982q0389o7394
19320D451L11J224O267J1042M132J6007J9066J1832Q403K2961j773k4397m709
19307G4817K2564O446k9930j4685r41n495K1147l2387M98L0615J5119P624J547
19294I6939m26J2573j9623J4411L2285l4228l3230K1677k7486m5335J6966m198
19282C0325M0187M9303k4280M5915O4468l5788j06483l6234k8304k4361l0469
$$ plain form
19271 -55721 -84680 -73539 -51229 -21288 44808 84125 87915 69269 94580 74959 81212 71047
19259 71047 75213 55045 38954 69226 81892 41258 28269 23672 -9120 17777 27781 50336
19247 50336 48580 79452 106660 106925 86876 79554 78981 130451 133849 124167 121214 48100 76995
19234 76995 132471 132351 152459 137710 82670 69612 53415 54441 66559 49333 66773 51166
19222 51166 1898 30880 66969 21823 1459 49734 98535 132711 109478 121942 134570 120480
19210 120480 101103 78579 54123 47182 32839 2218 9150 43915 49157 68324 43581 54849
19198 54849 64588 61637 63351 27868 31756 70404 81251 51897 55044 70233 126116 115829 68009
19185 68009 22053 -31527 10034 93691 128145 154416 116473 52526 5174 -35908 -30070 -43249
$$ packed form
19271e5721k8959J1141K2310K9941O6096L9317L790j8646K5311j9621O253j0165
19259G1047M166k0168j6091L0272J2666m0634j2989m597l2792K6897J0004K2555
19247E0336j756L0872K7208K65k0049p322n73N1470L398r682k953p3114K8895
19234G6995N5476j20K0108j4749n5040j3058j6197J026J2118j7226J7440j5607
19222E1166m9268K8982L6089m5146k0364M8275M8801L4176k3233J2464J2628j4090
19210A20480j9377k2524k4456o941j4343l0621O932L4765N242J9167k4743J1268
19198E4849R739k951J714l5483L888L8648J0847k9354L147J5189N5883j0287m7820
19185F8009m5956n3580M1561Q3657L4454K6271l7943o3947m7352m1082N838j3179
$$ plain form
19173 -43249 -11684 49118 21417 -18960 -71677 -58591 41112 81603 15102 -36523 -47910 21659
19161 21659 32220 24654 -2432 -11373 -39331 807 18342 1538 22727 42360 79879 89889
19149 89889 22865 12741 -25380 -53770 -22651 34775 79360 119365 149636 156573 119992 102145
19137 102145 56591 67749 48193 29634 32410 94484 85948 85848 115836 86574 58526 71688
19125 71688 103546 83276 64538 51444 30935 15174 24100 59099 52154 80875 89964 74853
19113 74853 51256 26097 22089 13613 16279 11108 23185 68614 84016 83595 60942 46480 54124
19100 54124 52333 34067 74816 85133 95410 113574 133185 119501 80290 42521 35821 -17373
19088 -17373 -6630 51778 114342 121664 72416 21459 42966 89146 101296 112608 115090 111714
$$ packed form
19173d3249L1565O0802k7701m0377n2717J3086R9703M0491o6501n1625j1387O9569
19161B1659J0561p566k7086q941k7958M0138J7535j6804K1189J9633L7519J0010
19149H9889o7024j0124l8121k8390L1119N7426M4585M0005L0271O937l6581j7847
19137A02145m5554J1158j9556j8559K776O2074q536j00K9988k9262k8048J3162
19125G1688L1858k0270j8738j3094k0509j5761Q926L4999o945K8721R089j5111
19113G4853k3597k5159m008q476K666n171J2077M5429J5402m21k2653j4462P644
19100E4124j791j8266M0749J0317J0277J8164J9611j3684l9211l7769o700n3194
19088a7373J0743N8408O2564P322m9248n0957K1507M6180J2150J1312K482l376
$$ plain form
19076 111714 97888 108216 99260 80701 48273 15205 46605 100685 117038 119676 105087 103608
19064 103608 143223 172565 148129 144034 103480 101389 63994 32880 32427 13354 72188 125937
19052 125937 86986 69245 38386 17960 -21945 18431 64061 80062 37462 63731 109391
19041 109391 121882 123580 90208 35786 40532 62931 80959 99549 134623 175066 176807 120974
19029 120974 109436 112761 128988 150944 123354 100045 131617 173890 158719 113407 93610 60417
19017 60417 109601 148212 144259 108881 93109 102480 116015 138347 139340 144372 150522 126365 74175
19004 74175 56218 36449 52636 42381 31894 78598 110840 96103 110270 97568 77816 90309
18992 90309 73891 98954 117861 122275 112587 99119 91034 111635 134089 212449 241656 200141
$$ packed form
19076A11714j3826J0328q956j8559l2428l3068L1400N4080J6353K638j4589j479
19064A03608L9615K9342k4436m095m0554k091l7395l1114m53j9073N8834N3749
19052A25937l8951j7741l0859k0426l9905M0376M5630J6001m2600K6269M5660
19041A09391J2491J698l3372n4422M746K2399J8028J8590L5074M0443J741n5833
19029A20974j1538L325J6227K1956k7590k3309L1572M2273j5171m5312j9797l3193
19017F0417M9184L8611l953l5378j5772R371J3535K2332R93N032O150k4157n2190
19004G4175j7957j9769J6187j0255j0487M6704L2242j4737J4167j2702j9752J2493
18992I0309j6418K5063J8907M414r688j3468q085K0601K2454P8360K9207m1515
$$ plain form
18980 200141 154392 94081 38933 43016 79335 82110 76123 91173 111314 159194 178230 186794
18968 186794 198587 199571 190914 181409 157542 147490 127274 166625 151553 119057 123069 163659
18956 163659 198001 182314 211460 180203 117795 156877 129482 103337 134438 146859 103837
18945 103837 85639 57762 50498 97532 138810 143792 123436 118840 166147 212975 253707 316476
18933 316476 296543 305700 334146 318019 325399 404928 451198 436452 495451 551553 592238 647285
18921 647285 678892 726617 722008 698884 696166 705077 762811 765099 698020 657917 642272 654279
18909 654279 637708 609427 543204 489710 496934 449837 410956 374215 325980 331331 337784 334535
18897 334535 336709 327107 268028 250393 276199 295696 274076 245770 248387 258886 236656 186342
$$ packed form
18980B00141m5749o0311n5148M083L6319K775n987J5050K0141M7880J9036Q564
18968A86794J1793R84q657r505k3867j0052k0216L9351j5072l2496M012M0590
18956A63659L4342j5687K9146l1257o2408L9082k7395k6145L1101J2421m3022
18945A03837j8198k7877p264M7034M1278M982k0356m596M7307M6828M0732O2769
18933C16476j9933R157K8446j6127P380P9529M6270j4746N8999N6102M0685N5047
18921F47285L1607M7725m609k3124k718Q911N7734K288o7079m0103j5645J2007
18909F54279j6571k8281o6223n3494P224m7097l8881l6741m8235N351O453l249
18897C34535K174r602n9079j7635K5806J9497k1620k8306K617J0499k2230n0314
$$ plain form
18885 186342 179584 208561 186233 183022 205133 220289 230418 251156 259605 243562 284860 295629
18873 295629 294007 333745 380642 408242 413427 412193 358571 332183 289011 269624 231472 222848
18861 222848 227859 219405 222257 180565 163339 184919 160278 150399 163602 200519 218028 204709
18849 204709 182843 168192 181160 172047 165199 156354 161776 189297 207341 186039 181478 216022
18837 216022 209029 223264 258105 293414 300771 334740 379814 414839 396104 417482 504170 563374
18825 563374 540561 621718 684989 735094 838712 861005 919940 970221 979226 913597 840119
18814 840119 730844 666562 615731 576414 513011 438830 434233 474807 498820 441801 395802
18803 395802 391552 417447 418568 358830 364921 381293 380393 330952 317919 336723 363060 387772
$$ packed form
18885A86342o758K8977k2328l211K2111J5156J0129K0738Q449j6043M1298J0769
18873B95629j622L9738M6897K7600N185j234n3622k6388m3172j9387l8152q624
18861B22848N011q454K852m1692j7226K1580k4641r879J3203L6917J7509j3319
18849B04709k1866j4651J2968r113o848q845N422K7521J8044k1302m561L4544
18837B16022o993J4235L4841L5309P357L3969M5074L5025j8735K1378Q6688N9204
18825E63374k2813Q1157O3271N0105J03618K2293N8935N0281R005o5629p3478
18814H40119j09275o4282n0831l9317o3403p4181m597M0574K4013n7019m5999
18803C95802m250K5895J121n9738O091J6372r00m9441j3033J8804K6337K4712
$$ plain form
18791 387772 380824 320054 274633 290782 306762 263029 266884 310839 348135 367332 436844 527399
18779 527399 558611 557651 597132 681211 738556 782575 805265 918343 1039393 1043396 1041221 1061906
18767 1061906 1086112 980244 866581 796055 708884 616363 592590 595993 571584 614400 578240
18756 578240 521465 479004 488457 474873 454255 466381 468408 448335 460989 474885 475094 473777
18744 473777 422317 447824 495781 454199 456176 503203 540467 622200 645725 643179 621480 622020
18732 622020 670312 738955 806393 855496 862671 847831 848777 848789 867188 832731 762456 695094 678499
18719 678499 680230 669653 681926 653302 573000 553276 519422 453065 405003 357657 346741 378168
18707 378168 391949 422122 464174 484189 561050 573607 567662 576939 562653 588517 647012 688034
$$ packed form
18791C87772o948o0770m5421J6149J5980m3733L855M3955L7296J9197O9512R0555
18779E27399L1212r60L9481Q4079N7345M4019K2690J13078J21050M003k175K0685
18767A061906K4206j05868j13663p0526q7171r2521k3773L403k4409M2816l6160
18756E78240n6775m2461R453j3584k0618J2126K027k0073J2654J3896K09j317
18744D73777n1460K5507M7957m1582J977M7027L7264Q1733K3525k546k1699N40
18732F22020M8292O8643O7438M9103P175j4840R46J2J8399l4457p0275o7362j6595
18719F78499J731j0577J2273k8624q0302j9724l3854o6357m8062m7346j0916L1427
18707C78168J3781L0173M2052K0015P6861J2557n945R277j4286K5864N8495M1022
$$ plain form
18695 688034 739882 800422 855405 875926 876330 869348 899291 960206 967753 971764 900126 872538
18683 872538 835796 822159 886774 927014 983127 997815 917798 817046 787457 831263 841569
18672 841569 809373 823840 841024 793138 744491 691369 619831 598058 591264 526239 515846 500726
18660 500726 440890 398307 408263 423252 438513 398242 386816 354491 368516 378965 366983 367493
18648 367493 332143 310652 311299 309822 296147 351081 410683 443516 496520 556007 569788 590115
18636 590115 595719 603347 659296 644689 618521 551125 531957 534486 583422 617264 644323 640884
18624 640884 637376 623155 577309 539702 506023 499839 492356 521704 519704 450093 426973 457836
18612 457836 432919 441355 438450 435881 415556 397020 428951 422886 358714 368131 385935 403927
$$ packed form
18695F88034N1848O0540N4983K0521M04o982K9943O0915P547M011p1638k7588
18683H72538l6742j3637O4615M0240N6113J4688q0017j00752k9589M3806J0306
18672H41569l2196J4467J7184m7886m8647n3122p1538k1773o794o5025j0393j5120
18660E00726n9836m2583R956J4989J5261m0271j1426l2325J4025J0449j1982N10
18648C67493l5350k1491O47j477j3675N4934N9602L2833N3004N9487J3781K0327
18636E90115N604P628N5949j4607k6168o7396j9168K529M8936L3842K7059l439
18624F40884l508j4221m5846l7607l3679o184p483K9348k000o9611k3120L0863
18612D57836k4917Q436k905k569k0325j8536L1931o065o4172R417J7804J7992
$$ plain form
18600 403927 434315 419947 427235 411622 369106 386463 429174 480058 522044 493763 505556 506150
18588 506150 487696 431877 449831 447759 410382 407876 416765 391302 379323 413219 448514 417581
18576 417581 404697 407723 395924 351916 371483 396397 441797 471586 446721 436387 452565 471637
18564 471637 502131 545488 551515 553322 537663 536925 551327 604562 664141 672899 726890 759659
18552 759659 735655 771814 787783 783025 769122 737097 735956 762908 779043 797675 760011 730408
18540 730408 743104 767422 772915 717017 695451 694734 689215 632428 590968 590352 614911 558906 606610
18527 606610 597911 601751 609781 614150 625327 590122 573091 566605 555858 540066 570938 640522
18515 640522 619981 615781 628589 622392 629315 643366 676589 736634 796868 792068 765645 801740
$$ packed form
18600D03927L0388j4368P288j5613m2516J7357M2711N0884M1986k8281J1793N94
18588E06150j8454n5819J7954k072l7377k506Q889k5463j1979L3896L5295l0933
18576D17581j2884L026j1799m4008J9567K4914M5400K9789k4865j0334J6178J9072
18564D71637L0494M3357O027J807j5659p38J4402N3235N9579Q758N3991L2769
18552G59659k4004L6159J5969m758j3903l2025j141K6952J6135J8632l7664k9603
18540G30408J2696K4318N493n5898k1566p17n519n6787m1460o16K4559n6005M7704
18527F06610q699L840Q030M369J1177l5205j7031o486j0747j5792L0872O9584
18515F40522k0541m200J2808o197O923J4051L3223O0045O0234m800k6423L6095
$$ plain form
18503 801740 797936 763172 752958 777252 799853 792720 784578 800816 781684 849918 905509 952034
18491 952034 952445 958838 1015314 1061035 1070099 1083032 1128500 1146813 1100735 1118772 1149659 1168957
18479 1168957 1204078 1261852 1332457 1380348 1362640 1352007 1355638 1345196 1350067 1446674 1521037 1567337
18467 1567337 1598963 1672211 1770194 1846698 1985945 2145054 2244978 2424401 2596175 2813777
18457 2813777 3026766 3258778 3530417 3796132 4203427 4656988 5180929 5838590 6676136
18448 6676136 7700253 8885962 10316338 12067722 14287337 17024160 20133909 23510448
18440 23510448 27372848 31941395 36896537 41592964 46066420 51060062 56680290 61994717
18432 61994717 66433477 70734955 75652154 80894268 85609591 89588217 93295191 97402855
$$ packed form
18503H01740l804l4764j0214K4294K2601p133q142J6238j9132O8234N5591M6525
18491I52034M11O393N6476M5721R064J2933M5468J8313m6078J8037L0887J9298
18479A168957L5121N7774P0605M7891j7708j0633L631j0442M871R6607P4363M6300
18467A567337L1626P3248R7983P6504J39247J59109R9924J79423J71774K17602
18457B813777K12989K32012K71639K65715M07295M53561N23941O57661Q37546
18448F676136J024117J185709J430376J751384K219615K736823L109749L376539
18440B3510448L862400M568547M955142M696427M473456M993642N620228N314427
18432F1994717M438760M301478M917199N242114M715323L978626L706974M107664
$$ plain form
18424 97402855 101623459 104634660 105745614 106233697 106679131 105616424 102427331 98370038
18416 98370038 94128283 88900343 82814639 76862575 71139834 64936332 58644070 53025000
18408 53025000 47896792 42316934 36807216 32071998 27985098 23967334 20247133 17170532
18400 17170532 14713522 12734308 11090232 9761564 8718520 7880888 7124794 6524906
18392 6524906 6067358 5740636 5482430 5286091 5182946 5082367 5100426 5296678 5745286 6407784
18382 6407784 7215057 7999277 8762447 9550419 10283932 10701268 10701709 10405162 9978186 9277795
18372 9277795 8260528 7014406 5895416 5106512 4620653 4276763 4018046 3878626 3841413
18363 3841413 3785464 3686360 3634114 3597380 3596769 3639284 3702116 3794581 3940719 4108891 4216766
$$ packed form
18424I7402855M220604L011201J110954M88083M45434j062707l189093m057293
18416I8370038m241755n227940o085704n952064n722741o203502o292262n619070
18408E3025000n128208n579858n509718m735218m086900m017764l720201l076601
18400A7170532k457010j979214j644076j328668j043044q37632p56094n99888
18392F524906m57548l26722k58206j96339j03145j00579J8059J96252M48608O62498
18382F407784Q07273P84220P63170P87972P33513M17336M41k96547m26976p00391
18372I277795j017267j246122j118990p88904m85859l43890k58717j39420l7213
18363C841413n5949r9104n2246l6734o11M2515O2832R2465J46138J68172J07875
$$ plain form
18352 4216766 4343812 4541610 4767979 4988102 5295629 5772911 6417944 7105968 7767296
18343 7767296 8599988 9703841 11221749 13394461 16516173 20807890 26621295 33764758
18335 33764758 40876133 46285720 50462665 54527797 57145912 56570872 53979801 51121194
18327 51121194 48441787 45069289 40339317 35594165 32892189 32603044 34120863 36725743
18319 36725743 39833420 42878280 45307990 46972250 47958764 48268097 48033460 48045601 48628498
18310 48628498 49745912 51456354 53871615 56714790 59691216 63083940 67397500 73556201
18302 73556201 83555939 99494515 121456820 146765005 170964529 191207891 206416244
18295 206416244 214230823 213615903 209371370 205059808 200004486 194621794 190376423 183775537
$$ packed form
18352D216766J27046J97798K26369K20123L07527M77282O45033O88024O61328
18343G767296Q32692J103853J517908K172712L121712M291717N813405P143463
18335C3764758P111375N409587M176945M065132K618115n75040k591071k858607
18327E1121194k679407l372498m729972m745152k701976k89145J517819K604880
18319C6725743L107677L044860K429710J664260R86514L09333k34637J2141N82897
18310D8628498J117414J710442K415261K843175K976426L392724M313560O158701
18302G3556201R999738J5938576K1962305K5308185K4199524K0243362J5208353
18295B06416244P814579o14920m244533m311562n055322n382692m245371o600886
$$ plain form
18287 183775537 168775718 148503487 128484661 109652901 92542340 78215136 67332284
18280 67332284 59533218 54145020 50378263 47674003 45625367 44141651 43306906 43078223
18272 43078223 43214435 43206991 42619837 41416955 39473986 37049183 34885011 33503777 32770016
18263 32770016 32549481 32969834 34174669 35956655 38315401 41505307 45369571 49367339
18255 49367339 53340562 57191836 60839454 63573901 64903889 65424038 65577996 64946820
18247 64946820 63911840 63586383 64032314 64881565 66283554 68129233 69844951 71448433
18239 71448433 73685142 77022873 81802591 88070552 94785289 101091343 106506797 109378293
18231 109378293 108501622 105673086 100444308 92570438 85198339 79129594 73004645 67263028
$$ packed form
18287A83775537j4999819k0272231k0018826j8831760j7110561j4327204j0882852
18280F7332284p799066n388198l766757k704260k048636j483716q34745k28683
18272D3078223J36212p444n87154j202882j942969k424803k164172j381234p33761
18263C2770016k20535M20353J204835J781986K358746L189906L864264L997768
18255D9367339L973223L851274L647618K734447J329988N20149J53958o31176
18247F4946820j034980l25457M45931Q49251J401989J845679J715718J603482
18239G1448433K236709L337731M779718O267961O714737O306054N415454K871496
18231A09378293q76671k828536n228778p873870p372099o068745o124949n741617
$$ plain form
18223 67263028 63863095 63154953 64124503 65339985 65428255 63957376 61193971 57204034 51530992
18214 51530992 45718164 41281386 38023777 35647191 34408866 34292426 34614563 34714988
18206 34714988 34827262 35399324 35862955 35866899 36018760 36888991 38329090 39873942 41731360
18197 41731360 44438856 48396275 54144804 62030171 72266659 84097095 96403730 108081955
18189 108081955 117608219 123149450 124428138 123451421 121879031 119715415 115734516 112326692
18181 112326692 112378628 115292341 119058262 124323067 129670971 131643619 129808924 123944775
18173 123944775 110828468 91452439 72080941 56462078 45415904 38186334 33828275
18166 33828275 31507753 30404743 29551679 28581021 27533610 26266201 24243980 21717257
$$ packed form
18223F7263028l399933p08142R69550J215482Q8270j470879k763405l989937n673042
18214E1530992n812828m436778l257609k376586j238325j16440L22137J00425
18206C4714988J12274N72062M63631L944J51861Q70231J440099J544852J857418
18197D1731360K707496L957419N748529P885367J0236488J1830436J2306635J1678225
18189A08081955R526264N541231J278688r76717j572390k163616l980899l407824
18181A12326692N1936K913713L765921N264805N347904J972648j834695n864149
18173A23944775j3116307j9376029j9371498j5618863j1046174p229570m358059
18166C3828275k320522j103010q53064r70658j047411j267409k022221k526723
$$ plain form
18158 21717257 19651232 18215737 17272216 16877696 17051110 17930761 19775157 22755981 26567101
18149 26567101 30182056 32718872 34244675 34955328 34246115 32113902 30269428 29688639
18141 29688639 30379568 32386134 36104272 41578591 48711839 58032668 70587533 85617434
18133 85617434 99470997 109015315 113263026 111123042 102283899 88806777 71001407 53208886
18125 53208886 40153075 31574314 25943347 22257713 20137071 19300940 19544415 20703590
18117 20703590 22457804 24435150 26956563 31188619 37962770 46930960 55773761 60087094
18109 60087094 60519615 60534746 56853664 43688935 30363911 21828729 16552549 13133355
18101 13133355 10742020 8963344 7630167 6651761 5847340 5146454 4591945 4151522 3736789
$$ packed form
18158B1717257k066025j435495r43521l94520J73414Q79651J844396K980824L811120
18149B6567101L614955K536816J525803P10653p09213k132213j844474n80789
18141B9688639O90929K006566L718138N474319P133248R320829J2554865J5029901
18133H5617434J3853563R544318M247711k139984q839143j3477122j7805370j7792521
18125E3208886j3055811q578761n630967l685634k120642q36131K43475J159175
18117B0703590J754214J977346K521413M232056O774151Q968190Q842801M313333
18109F0087094M32521J5131l681082j3164729j3325024q535182n276180l419194
18101A3133355k391335j778676j333177r78406q04421p00886n54509m40423m14733
$$ plain form
18092 3736789 3372311 3084409 2890332 2762986 2587457 2440629 2283422 2213877 2129474 1942615
18082 1942615 1863181 1761718 1658846 1619469 1581794 1569568 1528800 1446194 1353958 1308737 1333656
18071 1333656 1329311 1258961 1185776 1137416 1081761 1040942 1036528 1031032 965302 904276 832705 820435
18059 820435 887680 915204 878379 841986 797456 828205 800760 786127 743667 736158 771228 745329
18047 745329 721946 744762 754891 738729 685354 601643 545092 517855 509562 523492 517499 507985
18035 507985 491097 504786 469385 465435 466588 485413 494808 479907 457071 471897 435234 450297
18023 450297 431833 418640 386622 391531 387513 397200 422718 414129 417705 418280 415089 457959 490861
18010 490861 480754 419731 377384 400829 418550 414416 335502 320769 345081 315013 289635 308159
$$ packed form
18092C736789l64478k87902j94077j27346j75529j46828j57207o9545q4403j86859
18082A942615p9434j01463j02872l9377l7675j2226m0768q2606r2236m5221K4919
18071A333656m345p0350p3185m8360n5655m0819m414n496o5730o1026p1571j2270
18059H20435O7245K7524l6825l6393m4530L0749k7445j4633m2460p509L5070k5899
18047G45329k3383K2816J0129j6162n3375q3711n6551k7237q293J3930n993r514
18035E07985j6888J3689l5401l950J153J8825R395j4901k2836J4826l6663J5063
18023D50297j8464j3193l2018M909m018R687K5518q589L576N75l191M2870L2902
18010D90861j0107o1023m2347K3445J7721m134p8914j4733K4312l0068k5378J8524
$$ plain form
17998 308159 293545 283309 262381 217452 218116 199443 223430 245299 241373 284992 294117 266046
17986 266046 314762 345712 357961 334379 350082 364543 346488 386605 412118 341130 314608
17975 314608 335023 329861 327222 306504 273721 261786 285186 325932 363237 386226 465482 481963
17963 481963 521097 539231 520696 518931 503815 483910 495891 446388 397652 363911 293723 268398
17951 268398 269962 243340 230688 266378 309674 290689 226477 192708 169395 215025 289663 293245
17939 293245 318036 415311 477870 518777 546441 574941 572318 602664 636516 681794 686346 696001
17927 696001 724766 757992 770732 789860 853500 826723 832813 889184 893203 889849 854821 823495
17915 823495 795845 796662 796994 825582 810559 699280 621037 569818 562017 563327 510228 444872
$$ packed form
17998C08159j4614j0236k0928m4929O64j8673K3987K1869l926M3619R125k8071
17986B66046M8716L0950J2249k3582J5703J4461j8055M0117K5513p0988k6522
17975C14608K0415n162k639k0718l2783j1935K3400M0746L7305K2989P9256J6481
17963D81963L9134J8134j8535j765j5116j9905J1981m9503m8736l3741p0188k5325
17951B68398J564k6622j2652L5690M3296j8985o4212l3769k3313M5630P4638L582
17939B93245K4791R7275O2559M0907K7664K8500k623L0346L3852M5278M552R655
17927F96001K8765L3226J2740J9128O3640k6777O090N6371M019l354l5028l1326
17915H23495k7650Q17L32K8588j5023j11279p8243n1219p801J310n3099o5356
$$ plain form
17903 444872 422696 428633 443410 434581 463418 512924 449491 404578 344509 348262 349215 319884
17891 319884 313730 338249 322970 310576 326096 323212 287887 246242 233774 251811 220434 176225
17879 176225 194587 216531 234148 289546 290784 262091 282919 307632 328109 356111 384348 335122
17867 335122 239807 202322 245509 265794 336875 403906 406795 391027 399999 371321 391785 437688
17855 437688 492059 570451 646145 693041 733953 719417 676890 686599 686184 660188 681073 652187
17843 652187 620773 549224 493329 510267 502492 519059 554856 590779 611845 607683 643804 645433
17831 645433 682053 686172 702118 690836 639601 614341 599752 656707 662724 670333 695490 721759
17819 721759 731813 711842 751605 776344 787998 781368 775689 842292 918581 960490 1019223 1120575
$$ packed form
17903D44872k2176N937J4777q829K8837M9506o3433m4913o0069L753R53k9331
17891C19884o154K4519j5279j2394J5520k884l5325m1645j2468J8037l1377m4209
17879A76225J8362K1944J7617N5398J238k8693K0828K4713K0477K8002K8237m9226
17867C35122r5315l7485M3187K0285P1081O7031K889j5768Q972k8678K0464M5903
17855D37688N4371P8392P5694M6896M0912j4536m2527R709m15k5996K0885k8886
17843F52187l1414p1549n5895J6938p775J6567L5797L5923K1066m162L6121J629
17831F45433L6620M119J5946j1282n1235k5260j4589N6955O017P609K5157K6269
17819G21759J0054j9971L9763K4739J1654o630n679O6603P6289M1909N8733J01352
$$ plain form
17807 1120575 1174449 1226135 1270553 1284770 1311454 1295424 1292782 1272334 1181577 1068045 984983
17796 984983 955916 959870 943639 914935 932505 917750 929940 937298 949310 935636 913115 920908
17784 920908 940830 971036 1030546 1081178 1097273 1154488 1243834 1240463 1222635 1280757 1327318 1283398
17772 1283398 1306872 1345456 1373580 1427036 1480455 1496192 1558034 1604874 1624753 1697843 1757008
17761 1757008 1754258 1761458 1829633 1859723 1929199 2032588 2052261 2125696 2178543 2252193 2327181
17750 2327181 2368066 2390447 2451846 2557928 2643959 2776368 2879287 3089776 3341152 3605943
17740 3605943 3993684 4413320 4917851 5497099 6108216 6731962 7401180 8237721 9379666
17731 9379666 11026096 13195416 15925379 18994437 22078137 24974865 27334591 28831298
$$ packed form
17807A120575N3874N1686M4418J4217K6684j6030k642k0448r0757j13532q3062
17796I84983k9067L954j6231k8704J7570j4755J2190P358J2012j3674k2521P793
17784I20908J9922L0206N9510N0632J6095N7215Q9346l371j7828N8122M6561m3920
17772A283398K3474L8584K8124N3456N3419J5737O1842M6840J9879P3090N9165
17761A757008k750P200O8175L0090O9476J03389J9673P3435N2847P3650P4988
17750B327181M0885K2381O1399J06082Q6031J32409J02919K10489K51376K64791
17740C605943L87741M19636N04531N79248O11117O23746O69218Q36541J141945
17731I379666J646430K169320K729963L069058L083700K896728K359726J496707
$$ plain form
17723 28831298 29744646 30544684 31658764 33705175 37390694 43040043 50476632 59766731
17715 59766731 72259050 90134751 114756016 145064956 178227361 210708248 239068180
17708 239068180 257675352 259808957 245949690 223260638 195608543 164274149 136003086
17701 136003086 115156469 100081000 87921824 77710277 69724796 64000257 60325230
17694 60325230 57886580 55548268 52726296 49290210 44636725 38636829 32732926 28159277
17686 28159277 25095553 23119234 21837665 20946351 20430692 20151996 20103835 20377781 21021897
17677 21021897 22226808 24131966 26822750 30329524 34586682 39617704 45696372 53277986
17669 53277986 63216725 76523787 93597463 113482417 134547774 154396161 170822370
$$ packed form
17723B8831298R13348Q00038J114080K046411L685519N649349P436589R290099
17715E9766731J2492319J7875701K4621265L0308940L3162405L2480887K8359932
17708B39068180J8607172K133605j3859267k2689052k7652095l1334394k8271063
17701A36003086k0846617j5075469j2159176j0211547p985481n724539l675027
17694F0325230k438650k338312k821972l436086m653485n999896n903903m573649
17686B8159277l063724j976319j281569q91314n15659k78696m8161K73946O44116
17677B1021897J204911J905158K690784L506774M257158N031022O078668P581614
17669E3277986R938739J3307062J7073676J9884954K1065357J9848387J6426209
$$ plain form
17662 170822370 182846499 189724252 191433334 190669597 187916010 182581155 176642752 170190166
17654 170190166 163579113 156999813 148186033 137222046 126194645 115264857 101353891
17647 101353891 83536946 66421249 53417574 44291956 37672300 32512737 27969205
17640 27969205 24079290 21112370 19189372 18154125 17741750 17486980 17129463 16622058 15984964
17631 15984964 15005529 13707536 12575911 11881186 11677590 12042077 13042186 14892236 17763526
17622 17763526 21183158 24122882 26067950 27764154 29468630 30248777 31160139 33123299
17614 33123299 34722912 35139988 35006143 34045708 30660785 26376970 23418447 21326450
17606 21326450 19504632 17885560 16024415 13297822 10290211 7960230 6402597 5331379
$$ packed form
17662A70822370J2024129O877753J709082p63737k753587n334855n938403o452586
17654A70190166o611053o579300q813780j0963987j1027401j0929788j3910966
17647A01353891j7816945j7115697j3003675r125618o619656n159563m543532
17640B7969205l889915k966920j922998j035247m12375k54770l57517n07405o37094
17631A5984964r79435j297993j131625o94725k03596L64487J000109J850050K871290
17622A7763526L419632K939724J945068J696204J704476P80147R11362J963160
17614C3123299J599613M17076j33845r60435l384923m283815k958523k091997
17606B1326450j821818j619072j861145k726593l007611k329981j557633j071218
$$ plain form
17598 5331379 4557019 3997906 3596897 3261856 2954063 2708517 2567079 2452605 2356615 2216452
17588 2216452 2139956 2079221 1993264 1901644 1780516 1717033 1637777 1603572 1614879 1588171 1531695
17577 1531695 1475313 1361709 1320453 1280254 1247875 1187393 1167375 1069567 952334 905926 855602
17566 855602 815156 767928 748604 730438 671745 629967 623430 618657 597445 541637 487970 454744
17554 454744 498789 503208 489891 519962 486228 484844 463061 426294 407535 330701 314354 340090
17542 340090 350838 369393 401482 415819 413140 395470 418731 466874 491005 466985 456399 387649
17530 387649 353835 381266 405984 377619 353961 320624 341029 335504 270839 246829 228591 222134
17518 222134 190458 155502 146657 149156 139022 168915 193709 218666 243299 230474 226037 238004
$$ packed form
17598E331379p74360n59113m01009l35041l07793k45546j41438j14474r5990j40163
17588B216452p6496o0735q5957r1620j21128o3483p9256l4205J1307k6708n6476
17577A531695n6382j13604m1256m0199l2379o0482k0018r7808j17233m6408n0324
17566H55602m0446m7228j9324j8166n8693m1778o537m773k1212n5808n3667l3226
17554D54744M4045M419j3317L0071l3734j384k1783l6767j8759p6834j6347K5736
17542C40090J0748J8555L2089J4337k679j7670K3261M8143K4131k4020j0586o8750
17530C87649l3814K7431K4718k8365k3658l3337K0405n525o4665k4010j8238o457
17518B22134l1676l4956q845K499j0134K9893K4794K4957K4633j2825m437J1967
$$ plain form
17506 238004 243829 227988 213668 164460 143869 141465 160158 134416 68911 54036 108537 126439
17494 126439 62756 68115 82195 97030 99466 75787 8275 -8359 21582 34262 50946 29847
17482 29847 8599 34708 65308 31333 1806 16266 35450 -4113 -10917 13523 40385 19827
17470 19827 4137 15957 -2734 14521 -13745 -12451 45854 85847 67593 119580 126619 65489
17458 65489 53756 36612 1665 -1286 -8334 35834 41345 105632 109741 91490 126127 168229
17446 168229 230153 244451 219046 245664 279413 322098 264880 146885 46094 1312 20253
17435 20253 6482 -30132 -44543 -43295 -36726 -84786 -90711 -50187 -72046 -101825 -82178 -55361
17423 -55361 -36466 13415 27304 11258 -1059 2717 -35395 -59329 -69303 -57385 -59476 -65379
$$ packed form
17506B38004N825j5841j4320m9208k0591k404J8693k5742o5505j4875N4501J7902
17494A26439o3683N359J4080J4835K436k3679o7512j6634K9941J2680J6684k1099
17482B9847k1248K6109L0600l3975k9527J4460J9184l9563o804K4440K6862k0558
17470A9827j5690J1820j8691J7255k8266J294N8305L9993j8254N1987P039o1130
17458F5489j1733j7144l4947k951p048M4168N511O4287M109j8251L4637M2102
17446A68229O1924J4298k5405K6618L3749M2685n7218j17995j00791m4782J8941
17435B0253j3771l6614j4411J248O569m8060n925M0524k1859k9779J9647K6817
17423e5361J8895M9881J3889j6046j2317L776l8112k3934r974J1918k091n903
$$ plain form
17411 -65379 -53321 -62296 -55505 -48274 -54175 -100841 -142378 -96617 -78667 -18227 33346 28707 -31649
17398 -31649 -68564 -82896 -94680 -76379 -50845 -13284 1116 -423 16004 12396 -43476 -67491
17386 -67491 -36879 -30024 -38525 -3886 -11038 1732 -8770 -49562 -41281 -72490 -117114 -96729
17374 -96729 -34570 -75433 -121238 -132320 -133513 -129826 -110864 -72461 -61865 -44337 -27329 -38495
17362 -38495 -97097 -115327 -137411 -94361 -87590 -85297 -122645 -138310 -130864 -116198 -116737 -41073 -7118
17349 -7118 -53457 -71512 -95115 -11035 52685 32416 54385 25581 1505 5079 1046 -76887
17337 -76887 -79102 -40590 -52499 -24214 -1723 16740 -45333 -58115 -64874 -66358 -67540 -46455
17325 -46455 -64930 -94528 -116216 -136358 -91094 -81554 -55625 -21677 -83197 -92217 -78525 -65817
$$ packed form
17411f5379J2058q975O791P231n901m6666m1537M5761J7950O0440N1573m639o0356
17398c1649l6915j4332j1784J8301K5534L7561J4400j539J6427l608n5872k4015
17386f7491L0612O855q501L4639p152J2770j0502m0792Q281l1209m4624K0385
17374i6729O2159m0863m5805j1082j193L687J8962L8403J0596J7528J7008j1166
17362c8495n8602j8230k2084M3050O771K293l7348j5665P446J4666n39P5664L3955
17349g118m6339j8055k3603Q4080O3720k0269K1969k8804k4076L574m033p7933
17337g6887k215L8512j1909K8285K2491J8463o2073j2782o759j484j182K1085
17325d6455j8475k9598k1688k0142M5264R540K5929L3948o1520r020J3692J2708
$$ plain form
17313 -65817 -48956 -63932 -79898 -51621 -6025 -1673 -5373 -41473 -51931 -43220 -48120 -4244
17301 -4244 11506 -4981 -57799 -104439 -111650 -115852 -93035 -71439 -73081 -98106 -107577 -53817 -21843
17288 -21843 30026 -13981 -56217 -68150 -60330 -82922 -124308 -43124 -9454 -45324 -54001 -41996
17276 -41996 -23025 1976 -20975 -5200 -7509 -34831 -115498 -127032 -107348 -76383 -29467 -37183
17264 -37183 -60798 -47606 -67879 -79394 -60955 -53393 -6077 11167 19132 7280 25925 1410
17252 1410 -41461 -68415 -78025 -65681 -22254 4615 -79503 -89990 -58251 -48349 -14994 -52897
17240 -52897 -36166 -47720 -60206 -104928 -134870 -125573 -86866 -24928 -59864 -68602 -35453 -16813
17228 -16813 -11404 49072 38081 27378 42491 66731 96688 75121 118341 153415 197490 276562
$$ packed form
17313f5817J6861j4976j5966K8277M5596M352l700l6100j0458Q711m900M3876
17301d244J5750j6487n2818m6640p211m202K2817K1596j642k5025r471N3760L1974
17288b1843N1869m4007m2236j1933P820k2592m1386Q1184L3670l5870q677J2005
17276d1996J8971K5001k2951J5775k309k7322q0667j1534J9684L0965M6916p716
17264c7183k3615J3192k0273j1515J8439P562M7316J7244P965j1852J8645k4515
17252A410m2871k6954r610J2344M3427K6869q4118j0487L1739R902L3355l7903
17240e2897J6731j1554j2486m4722k9942R297L8707O1938l4936q738L3149J8640
17228a6813N409O0476j0991j0703J5113K4240K9957k1567M3220L5074M4075P9072
$$ plain form
17216 276562 309997 333693 390750 393565 388262 443400 502856 501206 485514 478454 465237 449443
17204 449443 477213 464561 422465 503768 581964 611478 647057 688799 706908 682515 646736
17193 646736 649871 641897 543811 465361 447315 395229 339983 296604 226927 221879 209195 174656
17181 174656 176382 127833 119268 83008 51155 47262 56632 73746 66655 67883 67048 80935 157862
17168 157862 193732 208986 245600 345955 379522 363230 442884 501046 501301 481515 496798 469622
17156 469622 486254 516186 529098 577883 644504 697977 700290 676904 664288 668129 689015 722840
17144 722840 725625 722507 714057 641413 585074 570476 503053 441623 388219 366537 364260 302247
17132 302247 235232 152397 112941 74224 82349 71217 30930 -1106 2293 -7234 4841 39682
$$ packed form
17216B76562L3435K3696N7057K815n303N5138N9456j650j5692p060j3217j5794
17204D49443K7770j2652m2096Q1303P8196K9514L5579M1742J8109k4393l5779
17193F46736L135p974r8086p8450j8046n2086n5246m3379o9677n048j2684l4539
17181A74656J726m8549q565l6260l1853l893R370J7114p091J228q35J3887P6927
17168A57862L5870J5254L6614J00355L3567j6292P9654N8162K55j9786J5283k7176
17156D69622J6632K9932J2912M8785O6621N3473K313k3386j2616L841K0886L3825
17144G22840K785l118q450p2644n6339j4598o7423o1430n3404k1682k277o2013
17132C02247o7015q2835l9456l8717Q125j1132m0287l2036L399r527J2075L4841
$$ plain form
17120 39682 42830 2301 -32905 -68469 -42595 9851 8502 39222 62255 46707 90269 161076
17108 161076 152120 103989 117767 153779 179535 213375 224661 211821 170966 161430 172796 107898
17096 107898 68384 66283 47250 -10402 -20138 6866 35174 17107 34881 4494 -64547 -48776
17084 -48776 -22424 -13805 -32716 -47029 -28296 -1940 11367 6031 7143 -1662 -5193 -25121 -27537
17071 -27537 -14412 -6657 -27837 -14952 -20637 -24662 -34524 -44064 -44292 -58325 -4258 34329 -1432
17058 -1432 -63343 -55668 -56280 -12457 16254 -11252 -60722 -66363 -84262 -137534 -122840 -38057 -17836
17045 -17836 -51752 -74320 -84159 -67537 -19820 -28670 -52038 -104885 -98601 -78120 -48754 -43440
17033 -43440 -33137 -44768 -31854 -60329 -77825 -62392 -43572 -29638 -33060 -54046 -46543 -17050
$$ packed form
17120C9682L148m0529l5206l5564K5874N2446j349L0720K3033j5548M3562P0807
17108A61076q956m8131J3778L6012K5756L3840J1286j2840m0855r536J1366o4898
17096A07898l9514k101j9033n7652r736K7004K8308j8067J7774l0387o9041J5771
17084d8776K6352Q619j8911j4313J8733K6356J3307n336J112q805l531j9928k416
17071b7537J3125P755k1180J2885n685m025r862r540k28j4033N4067L8587l5761
17058a432o1911P675o12M3823K8711k7506m9470n641j7899n3272J4694Q4783K0221
17045a7836l3916k2568r839J6622M7717q850k3368n2847O284K0481K9366N314
17033d3440J0303j1631J2914k8475j7496J5433J8820J3934l422k0986P503K9493
$$ plain form
17021 -17050 11824 35325 -9941 -59041 -37007 -52598 -67763 -72997 -53377 -26260 -4730 -22067
17009 -22067 2224 1856 -18168 -50838 -21285 45838 60392 39723 -23403 5309 44964 -19007
16997 -19007 -4363 5407 13130 -37625 -114367 -84203 -105231 -119963 -54318 33188 36266 58257
16985 58257 47174 -10009 -29172 -17785 -11205 -24818 -33564 -57223 -83044 -104734 -123469 -99933
16973 -99933 -108370 -121565 -84892 -53257 -36885 -16058 -6984 1181 8955 18235 -60 -6857 -40886
16960 -40886 -108534 -95634 -52070 -25285 -5740 -36891 -60673 -55363 -38259 -22016 -21063 -66188
16948 -66188 -45005 -35515 -58023 -88117 -49104 5014 -75609 -135408 -142697 -105067 -102561 -88710
16936 -88710 -66006 -88109 -85044 -57278 -56199 -75607 -51788 -1209 3714 -25966 -41970 -101578
$$ packed form
17021a7050K8874K3501m5266m9100K2034j5591j5165n234J9620K7117K1530j7337
17009b2067K4291l68k0024l2670K9553O7123J4554k0669o3126K8712L9655o3971
16997a9007J4644R770P723n0755p6742L0164k1028j4732O5645Q7506L078K1991
16985E8257j1083n7183j9163J1387O580j3613q746k3659k5821k1690j8735K3536
16973i9933q437j3195L6673L1635J6372K0827R074Q165P774R280j8295o797l4029
16960d0886o7648J2900M3564K6785J9545l1151k3782N310J7104J6243R53m5125
16948f6188K1183R490k2508l0094L9013N4118q0623n9799p289L7630K506J3851
16936h8710K2704k2103L065K7766J079j9408K3819N0579M923k9680j6004n9608
$$ plain form
16924 -101578 -146038 -121520 -112609 -145736 -129859 -119499 -89412 -101299 -152351 -147246 -132590 -145721
16912 -145721 -146010 -91183 -66270 -65417 -84913 -28471 48107 33036 -457 -27428 -26389 -31878 -79594
16899 -79594 -94338 -89714 -93803 -120919 -145500 -175015 -180704 -138014 -99193 -66663 -56636 -36942
16887 -36942 -82316 -67486 -32114 -27032 -41330 -17636 -54499 -75890 -66283 -54200 -35337 -23283
16875 -23283 -5954 -36529 -146577 -160354 -76127 -68780 -78817 -42036 -51338 -39064 -82844 -108446
16863 -108446 -81329 -37249 609 -45847 -104037 -89137 -62306 -44183 -16030 13918 38895
16852 38895 17372 12248 16656 -11345 -48856 -52912 -112041 -116093 -80015 -63926 -34824 -11906
16840 -11906 -40923 -59800 -46275 -20551 -51566 -51592 -52351 -20792 -28019 -14049 -19432 -28451 -34830
$$ packed form
16924a01578m4460K4518Q911l3127J5877J0360L0087j1887n1052N105J4656j3131
16912a45721k89N4827K4913Q53j9496N6442P6578j5071l3493k6971J039n489m7716
16899g9594j4744M624m089k7116k4581k9515n689M2690L8821L2530J0027J9694
16887c6942m5374J4830L5372N082j4298K3694l6863k1391R607J2083J8863J2054
16875b3283J7329l0575j10048j3777Q4227P347j0037L6781r302J2274m3780k5602
16863a08446K7117M4080L7858m6456n8190J4900K6831J8123K8153K9948K4977
16852C8895k1523n124M408k8001l7511m056n9129m052L6078J6089K9102K2918
16840a1906k9017j8877J3525K5724l1015k6p59L1559p227J3970n383r019o379
$$ plain form
16827 -34830 -72568 -86054 -59569 -63954 -69218 -53993 -36884 -10374 5795 -22502 -14122 -6065
16815 -6065 35219 52586 28450 -10439 -24109 14802 -30735 -36092 34850 14676 -18126 -92158
16803 -92158 -147090 -135483 -141523 -79720 -1990 -10042 -39977 -51371 3402 11140 -11374 -42782
16791 -42782 -90960 -149032 -129937 -96211 -103769 -94357 -65941 -16541 17485 7134 -33710 -37427
16779 -37427 -29776 -1471 -21581 -50386 -64206 -58019 -27784 -38334 -74894 -78781 -75008 -100101
16767 -100101 -100827 -71376 -45591 -17743 -35419 -37386 -43877 -18182 35781 38050 54632 56550 9425
16754 9425 -52959 -116892 -132923 -80255 -74963 -103796 -84530 -13189 -8575 -4038 -7656 -18119 -8063
16741 -8063 -14581 -63370 -84095 -82305 -29478 1974 -22036 -63018 -53186 -71201 -70959 -55866 -69743
$$ packed form
16827c4830l7738j3486K6485m385n264J5225J7109K6510J6169k8297Q380Q057
16815f065M1284J7367k4136l8889j3670L8911m5537n357P0942k0174l2802p4032
16803i2158n4932J1607o040O1803P7730q052k9935j1394N4773P738k2514l1408
16791d2782m8178n8072J9095L3726p558R412K8416M9400L4026j0351m0844l717
16779c7427P651K8305k0110k8805j3820O187L0235j0550l6560l887L773k5093
16767a00101p26K9451K5785K7848j7676j967o491K5695N3963K269J6582J918m7125
16754I425o2384o3933j6031N2668N292k8833J9266P1341M614M537l618j0463J0056
16741h063o518m8789k0725J790N2827L1452k4010m0982R832j8015K42J5093j3877
$$ plain form
16728 -69743 -33240 -5008 -26607 -28044 -86576 -150977 -121642 -81753 -49651 -69086 -97969 -120593
16716 -120593 -43256 -12362 -53802 -59452 -49731 -42066 -11694 -27886 -50309 -41910 -42217 -70374 -91392
16703 -91392 -70524 -82625 -57089 -23557 -21853 -20172 -19803 -19481 21260 59329 41900 46076 49922
16690 49922 41174 24489 1932 12478 -53762 -79673 -27141 -7692 1438 -30567 -47649 -65367
16678 -65367 -64814 -57399 -17545 -11874 -26595 -4940 19001 17877 31954 26368 53908 41028 33775
16665 33775 21433 -10241 -19871 -16808 -13517 -16958 -42491 -82420 -54434 -60616 -24807 -21177 -60371
16652 -60371 -73334 -47433 -30416 7974 -4907 22132 55760 36827 15026 16720 -26928 -46848
16640 -46848 -10026 -11845 -17900 997 -30693 -24074 -15725 -68906 -74047 -70827 -57556 -15339 40106
$$ packed form
16728f9743L6503K8232k1599j437n8532o4401K9335L9889L2102j9435k8883k2624
16716a20593P7337L0894m1440n650R721P665L0372j6192k2423Q399l07k8157k1018
16703i1392K0868j2101K5536L3532J704J681L69L22M0741L8069j7429M176L846
16690D9922q748j6685k2557J0546o6240k5911N2532J9449R130l2005j7082j7718
16678f5367N53P415L9854N671j4721K1655K3941j124J4077n586K7540j2880p253
16665C3775j2342l1674r630L063L291l441k5533l9929K7986o182L5809L630l9194
16652f0371j2963K5901J7017L8390j2881K7039L3628j8933k1801J694m3648j9920
16640d6848L6822j819o055J8897l1690O619Q349n3181n141L220J3271M2217N5445
$$ plain form
16627 40106 64160 68206 43712 843 -7223 -35875 -73656 -112395 -132761 -119394 -111076 -93929
16615 -93929 -48921 -67497 -49669 -17750 -12156 -70481 -82562 -74360 -109898 -91191 -26970 8987
16603 8987 -3808 48165 11736 -3727 -18059 -90598 -54049 -7590 -170 -33063 -55130 -42834
16591 -42834 -26269 -62486 -73997 -47298 -45834 -31712 -73666 -84706 -53861 -52758 -58504 -53680
16579 -53680 -20825 27940 8545 -59279 -83852 -54077 -37348 -33104 -70879 -76353 -96726 -98102
16567 -98102 -74262 -76173 -71940 -21228 -10988 -35110 -78147 -114815 -77682 -59818 -10596 1292
16555 1292 -4277 -35601 -55337 -35873 263 -4307 -55439 -69414 -42943 -74834 -91506 -60908
16543 -60908 -16642 17749 -9201 -24340 -52818 -78389 -76770 -27597 9075 3306 -13010 -50718
$$ packed form
16627D0106K4054M046k4494m2869q066k8652l7781l8739k0366J3367Q318J7147
16615i3929M5008j8576J7828L1919N594n8325j2081Q202l5538J8707O4221L5957
16603H987j2795N1973l6429j5463j4332p2539L6549M6459P420l2893k2067J2296
16591d2834J6565l6217j1511K6699J464J4122m1954j1040L0845J103n746M824
16579e3680L2855M8765j9395o7824k4573K9775J6729M244l7775n474k0373j376
16567i8102K3840j911M233N0712J0240k4122m3037l6668L7133J7864M9222J1888
16555A292n569l1324j9736J9464L6136m570n1132j3975K6471l1891j6672L0598
16543f0908M4266L4391k6950j5139k8478k5571J619M9173L6672n769j6316l7708
$$ plain form
16531 -50718 -33341 -39791 -57155 -40920 -24064 -6214 -6988 -12336 -28926 -51032 -25264 -27513 -20021
16518 -20021 8144 3735 -26997 -85691 -115448 -122195 -90835 -95622 -93551 -107470 -73098 -56006
16506 -56006 -62584 -42265 -46956 -30832 -8121 -8795 -63737 -75678 -47569 -24753 -25990 -71398 -75420
16493 -75420 -46188 -75485 -85991 -51387 14176 34407 -438 -41882 -49925 -7281 41242 10504
16481 10504 -19957 -94563 -128936 -72454 -68317 -76010 -82320 -86645 -61722 -40364 -5686 -15488 -45108
16468 -45108 -21033 -18560 10618 35717 31108 15011 58977 58678 48668 23731 25914 15428 2006
16455 2006 -2147 -21937 -51601 -63502 -18528 3807 -27449 -70195 -49898 -16521 -49694 -55996
16443 -55996 -20327 4499 10109 4274 70092 85094 73587 81014 37899 -31034 -41494 20960
$$ packed form
16531e0718J7377o450j7364J6235J6856J7850p74n348j6590k2106K5768k249P492
16518b0021K8165m409l0732n8694k9757o747L1360m787K071j3919L4372J7092
16506e6006o578K0319m691J6124K2711o74n4942j1941K8109K2816j237m5408m022
16493g5420K9232k9297j0506L4604O5563K0231l4845m1444q043M2644M8523l0738
16481A0504l0461p4606l4373N6482M137p693o310m325K4923K1358L4678r802k9620
16468d5108K4075K473K9178K5099m609j6097M3966k99j0010k4937K183j0486j3422
16455B006m153j9790k9664j1901M4974K2335l1256m2746K0297L3377l3173o302
16443e5996L5669K4826N610n835O5818J5002j1507P427m3115o8933j0460O2454
$$ plain form
16431 20960 66635 86684 85043 67584 25392 -41305 29128 61581 45945 83020 14818 -27394
16419 -27394 -62205 -115263 -90528 -63942 -26823 -24850 -29435 -60455 -39278 -68940 -80447 -77431
16407 -77431 -24340 -31309 -59153 -33590 -23781 -37703 -6959 -39343 -83058 -78917 -52539 -46728
16395 -46728 -85800 -82889 -87000 -96067 -42279 -40438 -50743 -58082 -69810 -31390 -26425 -74611 -51251
16382 -51251 -45315 -16658 22965 31880 19885 15995 22418 25090 23743 26663 -12302 -13210 923
16369 923 -15630 -4286 22092 -18140 -78489 -108220 -61969 -5680 6230 2472 25148 10666
16357 10666 4743 -33598 -64334 -48851 12263 34757 47833 51438 30768 -20192 -35612 -53696
16345 -53696 -9736 -2210 -12841 -4132 130 23418 -460 -38089 -63238 -70482 -67840 -66377 -51836
$$ packed form
16431B0960M5675K0049j641j7459m2192o6697P0433L2453j5636L7075o8202m2212
16419b7394l4811n3058K4735K6586L7119J973m585l1020K1177k9662j1507L016
16407g7431N3091o969k7844K5563R809j3922L0744l2384m3715M141K6378N811
16395d6728l9072K911m111r067N3788J841j0305p339j1728L8420M965m8186K3360
16382e1251N936K8657L9623Q915j1995l890O423K672j347K920l8965r08J4133
16369I23j6553J1344K6378m0232o0349k9731M6251N6289J1910l758K2676j4482
16357A0666n923l8341l0736J5483O1114K2494J3076L605k0670n0960j5420j8084
16345e3696M3960P526j0631Q709M262K3288k3878l7629k5149p244K642J463J4541
$$ plain form
16332 -51836 -27287 -34908 -79602 -123026 -109768 -76654 -96069 -58404 -28244 -21493 38569 33733
16320 33733 -10026 -62768 -95577 -82900 -36654 -7242 -5076 -16657 -41584 -44420 -38303 -64644
16308 -64644 -74021 -29922 -12085 -6898 -10790 14218 39009 50002 48799 21377 -12837 -64436
16296 -64436 -48794 688 27656 -12902 -29977 -103688 -108587 -83129 -60560 -31041 -71646 -102709
16284 -102709 -86884 -54025 -76830 -56367 -54292 -64473 -44622 -24277 -16856 13667 2273 -27823
16272 -27823 -65295 -54075 -52180 -35690 -36834 -49400 -59895 -8226 -32120 -59089 -83731 -83582
16260 -83582 -46953 5546 -15520 -6298 7073 6507 24535 -892 20609 20175 -53773 -74180 -123493
16247 -123493 -102258 -79914 -25853 -9460 25524 41844 -8130 -40113 -23079 13161 -18783
$$ packed form
16332e1836K4549p621m4694m3424J3258L3114j9415L7665L0160O751O0062m836
16320C3733m3759n2742l2809J2677M6246K9412K166j1581k4927k836O117k6341
16308f4644r377M4099J7837N187l892K5008K4791J0993j203k7422l4214n1599
16296f4436J5642M9482K6968m0558j7075p3711m899K5458K2569K9519m0605l1063
16284a02709J5825L2859k2805K0463K075j0181J9851K0345P421L0523j1394l0096
16272b7823l7472J1220J895J6490j144j2566j0495N1669k3894k6969k4642J49
16260h3582L6629N2499k1066R222J3371n66J8028k5427K1501m34p3948k0407m9313
16247a23493K1235K2344N4061J6393L4984J6320m9974l1983J7034L6240l1944
$$ plain form
16236 -18783 -75334 -60940 -53482 -75363 -56416 -20513 -18309 -9957 -33852 -43707 -40770 -69749 -70848
16223 -70848 -40334 -29217 -21292 -13478 26106 -19493 -65530 -50650 -32064 13300 14403 35230
16211 35230 31841 -6365 -42711 -45060 6943 30764 26165 36245 49853 62001 79004 36568
16199 36568 30910 6543 -69941 -115920 -124605 -145682 -76641 -86331 -133043 -144789 -135373 -111327
16187 -111327 -50648 -46598 -88597 -65073 -15181 11903 -11177 -42403 -31447 -32120 -40343 -38501
16175 -38501 -20229 24614 -952 -24830 -293 4370 -37548 -35176 -46789 -83482 -67637 -83815
16163 -83815 -57232 -10219 9335 -54267 -55930 -68517 -59951 5645 -42151 -68328 -76806 -90760
16151 -90760 -51785 -40059 -68328 -76958 -57163 -10952 3279 -1915 -22488 -48298 -59131 -50446
$$ packed form
16236a8783n6551J4394P458k1881J8947L5903K204Q352k3895r855K937k8979j099
16223g0848L0514J1117P925P814L9584m5599m6037J4880J8586M5364J103K0827
16211C5230l389l8206l6346k349N2003K3821m599J0080J3608J2148J7003m2436
16199C6568n658k4367p6484m5979q685k1077O9041r690m6712j1746R416K4046
16187a11327O0679M050m1999K3524M9892K7084k3080l1226J0956o73q223J842
16175c8501J8272M4843k5566k3878K4537M663m1918K372j1613l6693J5845j6178
16163h3815K6583M7013J9554o3602j663j2587Q566O5596m7796k6177q478j3954
16151i0760L8975J1726k8269q630J9795M6211J4231n194k0573k5810j0833Q685
$$ plain form
16139 -50446 -76253 -25534 22815 59015 112897 57455 -30450 -48957 -30226 31337 70620 53897
16127 53897 9551 17027 14667 -6287 -18073 -9343 12139 40169 37596 -23579 -33610 -34299 -88120
16114 -88120 -65566 -51491 1458 33254 9852 28742 1358 -33115 -24936 20565 53369 37997
16102 37997 38275 31851 7414 -194 -21175 -16750 -46532 -60557 -42294 -9860 -11340 37049 76367
16089 76367 67870 60182 63778 58751 44561 42888 -10883 -15811 11308 16754 -3285 -5446 17076
16076 17076 52647 19753 -35491 -100340 -113154 -81335 -69020 -108329 -106827 -80129 -71554 -44452
16064 -44452 2503 -13909 15035 19500 29794 59123 37342 31580 14933 -40356 -81304 -90983
16052 -90983 -98825 -63810 -44094 -17642 -21366 -35995 -55107 -43915 -47133 -96776 -79403 -42731
$$ packed form
16139e0446k5807N0719M8349L6200N3882n5442q7905j8507J8731O1563L9283j6723
16127E3897m4346P476k360k0954j1786Q730K1482K8030k573o1175j0031o89n3821
16114h8120K2554J4075N2949L1796k3402J8890k7384l4473Q179M5501L2804j5372
16102C7997K78o424k4437p608k0981M425k9782j4025J8263L2434j480M8389L9318
16089G6367q497p688L596n027j4190j673n3771m928K7119N446k0039k161K2522
16076A7076L5571l2894n5244o4849j2814L1819J2315l9309J502K6698Q575K7102
16064d4452M6955j6412K8944M465J0294K9329k1781n762j6647n5289m0948r679
16052i0983p842L5015J9716K6452l724j4629j9112J1192l218m9643J7373L6672
$$ plain form
16040 -42731 -11523 14266 60731 49569 -2849 -11290 -14702 -34747 -10085 6061 16038 45051
16028 45051 22583 -24457 -26525 -1904 -21764 -43241 -44743 -3521 8924 16263 -23259 -12675
16016 -12675 14542 9949 -53954 -75970 -46611 -75425 -80844 -81572 -74568 -72790 -19146 -35864 -70741
16003 -70741 -61937 -37070 -40939 -24783 -41335 -107963 -99452 -89345 -89947 -105272 -73037 -29903 -4677
15990 -4677 1293 -6181 -2881 -32751 -57492 -79747 -83513 -78007 -7424 43863 88731 93871 59622
15977 59622 52749 21930 11818 -31644 -23222 -43022 -81828 -28587 -39729 -66042 -22920 35426
15965 35426 7931 -56214 -23792 -2385 19101 -1279 4456 2815 -10635 10678 46206 20507
15953 20507 10740 29650 5161 -27507 -56360 -56258 -53247 -90998 -82041 -43984 19821 44642 96189
$$ packed form
16040d2731L1208K5789M6465j1162n2418q441l412k0045K4662J6146R977K9013
16028D5051k2468m7040k068K4621j9860k1477j502M1222J2445P339l9522J0584
16016a2675K7217m593o3903k2016K9359k8814n419p28P004J778N3644j6718l4877
16003g0741Q804K4867l869J6156j6552o6628Q511J0107o02j5325L2235M3134K5226
15990d677N970p474L300k9870k4741k2255l766N506P0583N1287M4868N140l4249
15977E9622o873l0819j0112m3462Q422j9800l8806N3241j1142k6313M3122N8346
15965C5426k7495o4145L2422K1407K1486k0380N735j641j3450K1313L5528k5699
15953B0507r767J8910k4489l2668k8853J02L011l7751Q957L8057O3805K4821N1547
$$ plain form
15940 96189 63990 22576 -15472 -17924 -24743 -85524 -111631 -91422 -50139 -42336 -63526 -64918
15928 -64918 -28500 -49031 -73406 -61075 -34612 -73054 -53700 -46860 -29862 -1720 -30335 11185
15916 11185 56358 6310 -32682 -1958 27750 2496 -21557 -28558 -41251 -35278 -20092 -42478
15904 -42478 -74909 -66086 -24407 -8993 -12896 22204 63130 74187 48252 44030 4393 -3025
15892 -3025 1505 31220 45906 21019 11611 -886 -52427 -48270 3383 10869 -22424 -18981 -31643
15879 -31643 -72689 -79080 -13292 -48012 -49390 -11239 1250 35965 51052 44164 55320 42923
15867 42923 -4602 -11070 -19022 -43396 29001 1373 -53530 -68213 -36788 -42916 -5675 11648
15855 11648 1782 -4302 -16839 -7064 42105 65410 45023 18469 38156 -20740 -44341 -50215
$$ packed form
15940I6189l2199m1414l8048k452o819o0781k6107K0209M1283P803k1190j392
15928f4918L6418k0531k4375J2331K6463l8442J9354O840J6998K8142k8615M1520
15916A1185M5173n0048l8992L0724K9708k5254k4053p001j2693N973J5186k2386
15904d2478l2431Q823M1679J5414l903L5100M0926J1057k5935m222l9637p418
15892c025M530K9715J4686k4887r408j2497n1541M157N1653P486l3293L443j2662
15879c1643m1046o391O5788l4720j378L8151J2489L4715J5087o888J1156j2397
15867D2923m7525o468p952k4374P2397k7628n4903j4683L1425o128L7241J7323
15855A1648r866o084j2537R775M9169K3305k0387k6554J9687n8896k3601n874
$$ plain form
15843 -50215 -9063 9264 6122 3667 -13561 12082 17916 -2499 -36568 -73416 -42766 -50136
15831 -50136 -24451 -43956 -113626 -111599 -89654 -73819 -47371 -59525 -121617 -94154 -43249 19976
15819 19976 14734 13462 -29633 -77028 -66883 -81848 -74394 -39656 -46165 -53327 -87127 -122799 -138437
15806 -138437 -107096 -42985 -23613 -58092 -46149 -65556 -48453 606 50090 35610 52373
15795 52373 85113 68167 63702 29894 2657 181 -1226 11386 19359 5489 -7667 -25643
15783 -25643 -4783 -8415 -4497 -23344 -15767 43784 84639 47124 25233 51797 67564 56567
15771 56567 58334 37198 32820 6155 8982 13659 30989 23017 3763 -33015 -19670 -6383 2951
15758 2951 13974 26385 43373 31311 49615 34396 18007 17325 -72660 -82636 -80348 -73874 -22373
$$ packed form
15843e0215M1152J8327l142k455j7228K5643N834k0415l4069l6848L0650p370
15831e0136K5685j9505o9670K027K1945J5835K6448j2154o2092K7463N0905O3225
15819A9976n242j272m3095m7395J0145j4965P454L4738o509p162l3800l5672j5638
15806a38437L1341O4111J9372l4479J1943j9407J7103M9059M9484j4480J6763
15795E2373L2740j6946m465l3808k7237k476j407J2612P973j3870j3156j7976
15783b5643K0860l632L918j8847P577N9551M0855l7515k1891K6564J5767j0997
15771E6567J767k1136m378k6665K827M677J7330p972j9254l6778J3345J3287R334
15758B951J1023J2411J6988j2062J8304j5219j6389o82q9985r976K288O474N1501
$$ plain form
15745 -22373 19769 12979 -46747 -72445 -75428 -56125 -117515 -116681 -77064 -54302 -9703 42372
15733 42372 37716 39994 20246 -10736 -49216 -56374 6059 61208 63727 38413 51871 60098 50966
15720 50966 12305 -32451 -18535 -11473 -52220 -18700 12549 -8963 -28791 -39588 -47832 -32603
15708 -32603 -15065 3903 -3598 18989 -50151 -59649 -65844 -28474 13640 59941 52947 11687
15696 11687 4388 -25512 -39553 -13185 31127 30071 16776 -9992 -15331 756 31705 14235
15684 14235 -22230 -40489 -54245 -47239 -52807 -75315 -71564 -16889 30956 37571 1192 21020
15672 21020 79202 23794 -13996 23960 36443 36578 38687 36948 38512 71690 50169 62570 92154
15659 92154 79484 48338 58088 78340 58238 45808 2243 -8386 2240 11760 28282 75890
$$ packed form
15745b2373M2142o790n9726k5698k983J9303o1390Q34L9617K2762M4599N2075
15733D2372m656K278j9748l0982l8480p158O2433N5149K519k5314J3458Q227r132
15720E0966l8661m4756J3916P062m0747L3520L1249k1512j9828j0797q244J5229
15708c2603J7538J8968p501K2587o9140r498o195L7370M2114M6301o994m1260
15696A1687p299k9900j4041K6368M4312j056j3295k6768n339J6087L0949j7470
15684A4235l6465j8259j3756P006n568k2508L751N4675M7845O615l6379J9828
15672B1020N8182n5408l7790L7956J2483J35K109j739J564L3178k1521J2401K9584
15659I2154j2670l1146R750K0252k0102j2430m3565j0629J0626R520J6522M7608
$$ plain form
15647 75890 82251 57557 -11938 -37413 -4301 -11781 -9162 6377 -6032 -15417 -52814 -48783 -79967
15634 -79967 -67560 -927 -48600 -94245 -83395 -29612 -24267 -2729 -2501 -55409 -78032 -78370 -32705
15621 -32705 -7662 -83967 -86197 -63162 -51083 -23384 35761 45166 19109 -40297 -60537 -54080
15609 -54080 -19591 4089 -43505 -9103 57160 55478 17579 -14630 -32450 -12186 9764 18576
15597 18576 -14022 -74827 -90725 -83748 -85369 -52352 18736 3928 -55417 -72720 -24445 18017
15585 18017 45328 68728 31736 -10254 9440 35330 13679 7672 -17571 -32332 -26039 -947
15573 -947 16907 40135 49878 50448 23171 14305 45029 38474 21505 21344 9384 -21680 -64854
15560 -64854 -47004 -28119 -4026 39341 32142 15694 -6971 -26579 -15237 -15191 -40444 -26857
$$ packed form
15647G5890O361k4694o9495k5475L3112p480K619J5539j2409r385l7397M031l1184
15634g9967J2407O6633m7673m5645J0850N3783N345K1538K28n2908k2623l38M5665
15621c2705K5043p6305k230K3035J2079K7699N9145R405k6057n9406k0240O457
15609e4080L4489K3680m7594L4402O6263j682l7899l2209j7820K0264K1950Q812
15597A8576l2598o0805j5898O977j621L3017P1088j4808n9345j7303M8275M2462
15585A8017K7311K3400l6992m1990J9694K5890k1651o007k5243j4761O293K5092
15573i47J7854K3228R743N70k7277q866L0724o555j6969j61j1960l1064m3174
15560f4854J7850J8885K4093M3367p199j6448k2665j9608J1342M6k5253J3587
$$ plain form
15548 -26857 -22181 -41159 -52230 -77677 -70360 -48991 -61071 -33715 -13374 11541 14226 16415
15536 16415 -32912 -33566 -46385 -113695 -103548 -61066 -61996 -99101 -68046 -50850 -34310 -35644 -72369
15523 -72369 -54508 -9919 -28494 -76714 -28545 -23847 -13054 39067 38298 21445 13223 -15991
15511 -15991 -21089 -20056 -33997 -54225 -51515 -19685 -10637 -13864 -28477 -40964 -22468 -37736 -63814
15498 -63814 -65890 -65839 -77226 -51891 -18728 -28675 -37879 -44022 -19145 24276 53401 61430 16740
15485 16740 -43853 -82832 -80102 -54504 -46440 -35035 -14885 -9168 -14133 -21851 -64678 -111486 -72703
15472 -72703 -48512 -57287 -42038 -34067 -6262 -7986 -35566 -42775 -61337 -47636 -58389 -92078
15460 -92078 -63230 -25736 12698 34023 21317 44448 784 -410 12876 1767 20781 16363
$$ packed form
15548b6857M676j8978j1071k5447P317K1369j2080K7356K0341K4915K685K189
15536A6415m9327o54j2819o7310J0147M2482r30l7105L1055J7196J6540j334l6725
15523g2369J7861M4589j8575m8220M8169M698J0793N2121p69j6853q222k9214
15511a5991n098J033j3941k0228K710L1830R048l227j4613j2487J8496j5268k6078
15498f3814k076N1j1387K5335L3163r947r204o143K4877M3421K9125Q029m4690
15485A6740o0593l8979K730K5598Q064J1405K0150N717m965p718m2827m6808L8783
15472g2703K4191q775J5249P971K7805j724k7580p209j8562J3701j0753l3689
15460i2078K8848L7494L8434K1325j2706K3131m3664j194J3286j1109J9014m418
$$ plain form
15448 16363 57659 32716 41156 32428 36862 -11838 -22509 12372 1038 -13876 6427 59329
15436 59329 112847 108495 115586 118690 76955 330 -26562 -19870 -3668 4689 -8901 -25258 -83281
15423 -83281 -77412 2720 61729 65384 35168 28053 -20051 -48023 -29533 -55726 -90636 -43959
15411 -43959 19596 28261 48727 69209 62808 24727 -9593 -22523 4884 10308 4464 30113
15399 30113 20231 -3622 -24590 -2515 -22973 -44961 861 -14260 -22181 -21968 -45180 -76729
15387 -76729 -63579 -8019 12639 8843 -65401 -64556 25193 53018 77742 91912 94506 53489
15375 53489 22237 33060 -18354 -22698 4344 -12359 -44536 -111137 -72543 -12595 -10851 -34167
15363 -34167 -67461 -85258 -81374 -38160 -34827 -19930 31681 51269 71690 75151 22043 -30072
$$ packed form
15448A6363M1296k4943Q440q728M434m8700j0671L4881j1334j4914K0303N2902
15436E9329N3518m352P091L104m1735p6625k6892O692J6202Q357j3590j6357n8023
15423h3281N869Q0132N9009L655l0216p115m8104k7972J8490k6193l4910M6677
15411d3959O3555Q665K0466K0482o401l8081l4320j2930K7407N424n844K5649
15399C0113r882k3853k0968K2075k0458k1988M5822j5121p921K13k3212l1549
15387g6729J3150N5560K0658l796p4244Q45Q9749K7825K4724J4170K594m1017
15375E3489l1252J0823n1414m344K7042j6703l2177o6601L8594N9948J744k3316
15363c4167l3294j7797L884M3214L333J4897N1611J9588K0421L461n3108n2115
$$ plain form
15351 -30072 -23650 15307 2840 -3003 11983 5147 3088 -18136 -32928 -39109 -46733 -54352 -100239
15338 -100239 -42944 -12879 -34939 -11910 18957 13994 16233 -51650 -54659 -77750 -123848 -136285
15326 -136285 -143111 -81201 -51727 -94058 -96072 -80636 -77681 -59121 -99584 -61253 -31917 -66585
15314 -66585 -94674 -63460 -22363 -14337 -28911 -64748 -99733 -73293 -90892 -85075 -64717 -54523
15302 -54523 -29650 -41507 -55949 -11223 36287 46144 14424 12177 26426 -13411 -29847 7212
15290 7212 12728 -8766 19576 9578 -971 -5914 5939 9317 43969 55576 -35620 -14760 58404
15277 58404 117029 123088 33843 579 37470 62378 51182 6990 7893 39081 48930 36111
15265 36111 72528 79952 73315 112880 88140 57442 56470 34434 42503 61709 38948 -56979 -51890
$$ packed form
15351c0072O422L8957j2467n843J4986o836k059k1224j4792o181p624p619m5887
15338a00239N7295L0065k2060K3029L0867m963K239o7883l009k3091m6098j2437
15326a36285o826O1910K9474m2331k014J5436K955J8560m0463L8331K9336l4668
15314f6585k8089L1214M1097Q026j4574l5837l4985K6440j7599N817K0358J0194
15302e4523K4873j1857j4442M4726M7510R857l1720k247J4249l9837j6436L7059
15290G212N516k1494K8342r998j0549m943J1853L378L4652J1607r1196K0860P3164
15277E8404N8625O059q9245l3264L6891K4908j1196m4192R03L1188R849j2819
15265C6111L6417P424o637L9565k4740l0698r72k2036Q069J9206k2761r5927N089
$$ plain form
15252 -51890 35307 85785 79272 22779 21654 60065 85865 80542 72857 110325 101367 58263 27758
15239 27758 20477 -22648 6997 76676 61514 50246 12917 18811 1102 -7825 -10677 -3760 32725
15226 32725 49489 17125 -25375 -15969 17902 5031 13175 24053 15797 42204 81000 83916
15214 83916 35124 -33724 -56401 -66609 -41057 2340 15422 32512 10931 44511 54817 1270
15202 1270 -10722 -9542 -696 43458 76815 69385 47736 15906 30713 58185 69284 31255
15190 31255 13000 18992 23023 3555 44794 41258 25240 54492 55084 18609 -24826 -15873 32032
15177 32032 45583 58068 68937 23565 39141 83294 68630 27965 -26952 -21322 43683 19773
15165 19773 5345 15860 80333 68291 32305 25940 28566 73953 78042 76315 39606 -11054
$$ packed form
15252e1890Q7197N0478o513n6493j125L8411K5800n323p685L7468q958m3104l0505
15239B7758p281m3125K9645O9679j5162j1268l7329N894j7709q927k852O917L6485
15226C2725J6764l2364m2500R406L3871j2871Q144J0878q256K6407L8796K916
15214H3916m8792o8848k2677j0208K5552M3397J3082J7090k1581L3580J0306n3547
15202A270j1992J180Q846M4154L3357p430k1649l1830J4807K7472J1099l8029
15190C1255j8255N992M031j9468M1239l536j6018K9252N92l6475m3435Q953M7905
15177C2032J3551J2485J0869m5372J5576M4153j4664m0665n4917N630O5005k3910
15165A9773j4428J0515O4473j2042l5986o365K626M5387M089j727l6709n0660
$$ plain form
15153 -11054 4436 13125 29649 39211 67496 20565 -8838 8842 -528 -39428 -44637 -29859
15141 -29859 18903 -14352 -63026 -30219 8916 39694 66953 46896 -8240 -15381 27962 49644
15129 49644 71591 46657 39694 39507 31546 -24069 -63720 -74943 -33239 595 12115 31472
15117 31472 45924 105198 108723 86172 108726 152481 192592 203054 213536 223832 263829 360369
15105 360369 473472 547305 655701 805967 1040281 1332680 1606937 1871967 2060091 2172931
15095 2172931 2182355 2079175 1977312 1821776 1584126 1308512 1055166 827447 692372 590632
15085 590632 474860 416958 408410 409426 375754 278277 198714 192660 158160 123596 60629 70666
15073 70666 64628 37125 27914 29752 36303 63475 22597 21615 21567 17042 45775 31348 -1653 10723
$$ packed form
15153a1054J5490Q689J6524R562K8285m6931k9403J7680r370l8900n209J4778
15141b9859M8762l3255m8674L2807L9135L0778K7259k0057n5136p141M3343K1682
15129D9644K1947k4934o963j87p961n5615l9651j1223M1704L3834J1520J9357
15117C1472J4452N9274L525k2551K2554M3755M0111J0462J0482J0296L9997R6540
15105C60369J13103P3833J08396J50266K34314K92399K74257K65030J88124J12840
15095B172931R424j03180j01863j55536k37650k75614k53346k27719j35075j01740
15085E90632j15772n7902q548J016l3672r7477p9563o054l4500l4564o2967J0037
15073G0666o038k7503r211J838O551K7172m0878r82m8m525K8733j4427l3001J2376
$$ plain form
15059 10723 17740 55092 69619 30479 -22937 -25348 -3174 -23913 -12736 -34098 -43047 3824
15047 3824 6686 14793 29034 2158 27793 31359 35507 34562 72937 60401 27019 94832 119728
15034 119728 96506 98900 82239 73698 51589 -10026 -59147 -54651 -38008 28711 43692 12685
15022 12685 -16837 33300 33269 37463 27957 58493 -1712 -28753 -1406 47759 126663 152971 158575
15009 158575 110321 58655 28982 56708 44477 23234 72067 85589 70276 75984 56039 42327
14997 42327 50269 65918 46517 16971 38255 45542 67018 57648 11166 11878 46139 95848 130807
14984 130807 188681 173042 83720 48868 39098 42778 63727 49368 29608 -11666 12464 16141
14972 16141 6942 13425 -14182 -63846 -41683 -30872 -18558 2045 66877 98166 83163 38649
$$ packed form
15059A0723P017L7352J4527l9140n3416k411K2174k0739J1177k1362q949M6871
15047C824K862Q107J4241k6876K5635L566M148r45L8375j2536l3382O7813K4896
15034A19728k3222K394j6661q541k2109o1615m9121M496J6643O6719J4981l1007
15022A2685k9522N0137l1M194r506L0536o0205k7041K7347M9165P8904K6308N604
15009A58575m8254n1666k9673K7726j2231k1243M8833J3522j5313N708j9945j3712
14997D2327P942J5649j9401k9546K1284P287K1476r370m6482P12L4261M9709L4959
14984A30807N7874j5639q9322l4852r770L680K0949j4359j9760m1274K4130L677
14972A6141r199O483k7607m9664K2163J0811J2314K0603O4832L1289j5003m4514
$$ plain form
14960 38649 22076 37465 69385 91176 50990 37712 49619 74164 73551 130605 170443 137963
14948 137963 96213 78085 71957 85022 112175 112911 70775 104871 134717 135627 141127 129852 94357
14935 94357 37491 75225 136431 146224 151255 137943 76825 93607 110089 133218 152977 173774
14923 173774 144429 70282 22899 60660 91847 86336 77786 86515 91188 133935 165717 141340
14911 141340 109093 105936 89824 122843 136501 183107 216428 256400 296168 314492 334960 395174
14899 395174 435707 478036 487638 471671 497581 443742 402005 377867 315234 276747 275180 288475
14887 288475 252660 231167 194757 184536 174906 167991 213956 207638 190619 111331 136131 167807
14875 167807 180895 195071 144514 120961 107945 157696 196480 201344 197488 191998 186735 135127
$$ packed form
14960C8649j6573J5389L1920K1791m0186j3278J1907K4545o13N7054L9838l2480
14948A37963m1750j8128o128J3065K7153P36m2136L4096K9846R10N500j1275l5495
14935I4357n6866L7734O1206R793N031j3312o1118J6782J6482K3129J9759K0797
14923A73774k9345p4147m7383L7761L1187n511q550Q729M673M2747L1782k4377
14911A41340l2247l157j6112L3019J3658M6606L3321L9972L9768J8324K0468O0214
14899C95174M0533M2329R602j5967K5910n3839m1737k4138o2633l8487j567J3295
14887B88475l5815k1493l6410j0221r630o915M5965o318j7019p9288K4800L1676
14875A67807J3088J4176n0557k3553j3016M9751L8784M864l856n490n263n1608
$$ plain form
14863 135127 101192 68132 61666 38777 35586 31244 42476 34465 41652 22590 19341 -12020 38898
14850 38898 69499 62222 15998 3146 -4275 -38854 -16406 27886 53147 12131 38770 114127
14838 114127 227134 289670 240503 297019 327322 307188 266182 220460 205668 197413 221489
14827 221489 207185 227675 236009 276517 287202 277662 275905 266972 205764 193595 217121 224429
14815 224429 175569 122635 139305 170644 167720 194419 215699 206845 178855 167764 183017 201723
14803 201723 236350 258578 225713 223680 193295 167898 167778 165312 176835 182834 171442 156893
14791 156893 167829 189263 210469 231440 246403 270023 239496 249705 276535 312949 342618
14780 342618 393325 406073 378824 407232 500289 544557 572226 621610 736035 790254 808982
$$ packed form
14863A35127l3935l3060o466k2889l191m342J1232q011P187j9062l249l1361N0918
14850C8898L0601p277m6224j2852p421l4579K2448M4292K5261m1016K6639P5357
14838A14127J13007O2536m9167N6516L0303k0134m1006m5722j4792q255K4076
14827B21489j4304K0490Q334M0508J0685r540j757q933o1208j2169K3526P308
14815B24429m8860n2934J6670L1339k924K6699K1280q854k7990j1091J5253J8706
14803B01723L4627K2228l2865k033l0385k5397j20k466J1523N999j1392j4549
14791A56893J0936K1434K1206K0971J4963K3620l0527J0209K6830L6414K9669
14780C42618N0707J2748k7249K8408R3057M4268K7669M9384J14425N4219J8728
$$ plain form
14769 808982 809752 812885 774449 743635 728437 731641 743715 749667 738125 713589 645982 612214
14757 612214 560388 540033 500168 432397 387402 324321 325053 352403 340351 376341 376303 348470
14745 348470 329551 330890 385167 446178 435064 446433 414021 375097 382756 395268 405471 411424
14733 411424 427036 447228 455942 476632 509406 520999 522074 506697 509648 534961 537231 530312
14721 530312 570868 588340 651080 760333 812910 822242 789385 807827 825981 856858 866792 909668
14709 909668 986586 1072908 1104932 1117548 1136994 1207552 1258143 1270290 1324940 1360107 1407206
14698 1407206 1491016 1561353 1617767 1643794 1698654 1745833 1784691 1809694 1829878 1896814 2019084
14687 2019084 2089485 2160183 2203986 2232946 2301613 2390946 2503996 2671526 2857714 3050338
$$ packed form
14769H08982P70L133l8436l0814j5198L204J2074N952j1542k4536o7607l3768
14757F12214n1826k0355l9865o7771m4995o3081P32K7350j2052L5990l8k7833
14745C48470j8919J339N4277O1011j1114J1369l2412l8924P659J2512J0203N953
14733D11424J5612K0192Q714K0690L2774J1593J075j5377K951K5313K270o919
14721E30312M0556J7472O2740J09253N2577R332l2857J8442J8154L0877R934M2876
14709I09668P6918Q6322L2024J2616J9446P0558N0591J2147N4650L5167M7099
14698A407206Q3810P0337N6414K6027N4860M7179L8858K5003K0184O6936J22270
14687B019084P0401P0698M3803K8960O8667Q9333J13050J67530J86188J92624
$$ plain form
14677 3050338 3227496 3445555 3711688 4032944 4374257 4760487 5232163 5742925 6293056
14668 6293056 7029897 7932346 8981887 10368842 12164119 14374977 17020480 20143257
14660 20143257 23728562 27918891 32745149 38305491 44927274 53290952 64520081 80271152
14652 80271152 102439296 132388981 170160620 213691757 260113149 306385277 348749014
14645 348749014 381820580 400030665 401278325 387901700 362513681 325802304 280231071
14638 280231071 232410738 188754300 151487315 120336528 95121245 75872264 61708068
14631 61708068 51249566 43359619 37153682 32044924 27790989 24127593 20964229 18275986
14623 18275986 16032555 14163788 12586557 11286383 10221471 9318831 8600680 7955037
$$ packed form
14677C050338J77158K18059K66133L21256L41313L86230M71676N10762N50131
14668F293056P36841R02449J049541J386955J795277K210858K645503L122777
14660B0143257L585305M190329M826258N560342O621783Q363678J1229129J5751071
14652H0271152K2168144K9949685L7771639M3531137M6421392M6272128M2363737
14645C48749014L3071566J8210085J247660j3376625k5388019l6711377m5571233
14638B80231071m7820333m3656438l7266985l1150787k5215283j9248981j4164196
14631F1708068j0458502p889947o205937n108758m253935l663396l163364k688243
14623A8275986k243431j868767j577231j300174j064912r02640p18151o45643
$$ plain form
14615 7955037 7380190 6911895 6491783 6081753 5690352 5402651 5107765 4857035 4588557
14606 4588557 4344679 4161139 4010204 3859701 3691115 3531077 3380620 3262854 3152199
14597 3152199 3042799 2898906 2806414 2746611 2623336 2495578 2370252 2305233 2252051 2166207
14587 2166207 2080283 2015154 1975466 1957958 1887754 1812794 1724736 1628553 1558106 1545565 1477027
14576 1477027 1391819 1284771 1278928 1243960 1201167 1181094 1185441 1155349 1133552 1079802 1079098 1121031
14564 1121031 1120646 1107420 1094072 1035779 1024603 954382 909066 912278 869302 822418 890898 952381
14552 952381 936842 916323 939050 948320 977822 1023958 1045769 1067764 1098611 1162263 1162404 1138084
14540 1138084 1180114 1241135 1270027 1204989 1149878 1131123 1096855 1074847 1067446 1036222 1009106
$$ packed form
14615G955037n74847m68295m20112m10030l91401k87701k94886k50730k68478
14606D588557k43878j83540j50935j50503j68586j60038j50457j17766j10655
14597C152199j09400j43893r2492n9803j23275j27758j25326o5019n3182q5844
14587B166207q5924o5129l9688j7508p0204p4960q8058r6183p0447j2541o8538
14576A477027q5208j07048n843l4968m2793k0073M347l0092k1797n3750p04M1933
14564A121031l85j3226j3348n8293j1176p0221m5316L212m2976m6884O8480O1483
14552I52381j5539k0519K2727R270K9502M6136K1811K1995L0847O3652J41k4320
14540A138084M2030O1021K8892o5038n5111j8755l4268k2008p401l1224k7116
$$ plain form
14529 1009106 954988 933915 877792 852450 880065 866349 885067 913451 982763 980742 979657 1064204
14517 1064204 1095787 1179103 1252206 1282000 1312884 1365887 1367078 1320375 1269182 1230304 1142941
14506 1142941 1056768 964053 855193 794037 753982 655378 583184 578999 544887 513622 438813
14495 438813 462429 443270 425998 410091 387072 332972 259356 254421 272399 238895 199233 156202
14483 156202 160051 180231 202150 273945 306092 317486 305641 248991 230104 210011 196635 179036
14471 179036 151672 175791 169250 127611 138743 177250 159357 161993 116465 66987 24693 24359
14459 24359 62896 54676 3095 9118 76797 114273 119882 100495 46849 71202 115451 86354
14447 86354 101281 191191 217837 206709 211133 214565 223081 210762 244482 166661 62081 40744
$$ packed form
14529A009106n4118k1073n6123k5342K7615j3716J8718K8384O9312k021j085Q4547
14517A064204L1583Q3316P3103K9794L0884N3003J191m6703n1193l8878q7363
14506A142941q6173r2715j08860o1156m0055r8604p2194m185l4112l1265p4809
14495D38813K3616j9159j7272j5907k3019n4100p3616m935J7978l3504l9662m3031
14483A56202L849K0180K1919P1795L2147J1394j1845n6650j8887k0093j3376j7599
14471A79036k7364K4119o541m1639J1132L8507j7893K636m5528m9478m2294l34
14459B4359L8537q220n1581O023O7679L7476N609j9387n3646K4353M4249k9097
14447H6354J4927Q9910K6646j1128M424L432Q516j2319L3720p7821j04580k1337
$$ plain form
14435 40744 -1161 18035 35988 69778 96215 68621 95529 117876 129374 160109 178066 159912
14423 159912 141851 159965 175132 140588 94147 89662 90742 74428 57695 14018 4726 37681
14411 37681 79491 88663 86056 68043 78739 86045 118049 100857 94290 87978 81288 86767 85761
14398 85761 96469 145175 195194 208301 199001 168566 173692 216181 214442 216589 190719 166849
14386 166849 153503 143828 123232 115848 63619 57750 31990 73636 134512 167930 145846 103538
14374 103538 47832 77540 83463 107510 107291 135332 94208 79630 122023 105745 63135 74044
14362 74044 144619 168334 140473 140476 113714 113614 116621 118756 111067 123065 144220 147247 156664 183925
14348 183925 206846 177180 207725 254330 228288 174993 126960 121640 129436 152070 162295 129641
$$ packed form
14435D0744m1905J9196J7953L3790K6437k7594K6908K2347J1498L0735J7957j8154
14423A59912j8061J8114J5167l4544m6441m485J080j6314j6733m3677r292L2955
14411C7681M1810R172k607j8013J0696P306L2004j7192o567o312o690N479j006
14398H5761J0708M8706N0019J3107r300l0435N126M2489j739K147k5870k3870
14386A66849j3346r675k0596p384n2229n869k5760M1646O0876L3418k2084m2308
14374A03538n5706K9708N923K4047k19K8041m1124j4578M2393j6278m2610J0909
14362G4044P0575K3715k7861Lk6762j00L007K135p689J1998K1155L027R417K7261
14348A83925K2921k9666L0545M6605k6042n3295m8033n320P796K2634J0225l2654
$$ plain form
14336 129641 126904 174052 161777 125104 125199 168966 170670 164020 163263 158092 206295 255404 249132
14323 249132 206534 180216 186875 179109 193335 251040 238536 198633 165586 227548 266247 225410
14311 225410 152918 178450 195958 179893 166907 155190 122787 135740 117750 76745 59651
14300 59651 39562 54903 107866 80203 97521 93694 17226 23461 35366 36673 46926 88443
14288 88443 98701 68638 81073 78376 95519 81292 106111 123014 96507 113930 130419 150163
14276 150163 157755 178805 162376 139548 142548 125911 131445 152897 130301 107420 103510 116387
14264 116387 121842 117962 111448 102488 111592 147206 185619 193807 192086 232434 214750 163117 140874
14251 140874 120170 99554 99174 90871 149963 164312 169486 185197 176783 201387 244263 273209
$$ packed form
14336A29641k737M7148j2275l6673R5M3767J704o650p57n171M8203M9109o272
14323B49132m2598k6318O659p766J4226N7705j2504l9903l3047O1962L8699m0837
14311B25410p2492K5532J7508j6065j2986j1717l2403J2953j7990m1005j7094
14300E9651k0089J5341N2963k7663J7318l827p6468O235J1905J307J0253M1517
14288H8443J0258l0063J2435k697J7143j4227K4819J6903k6507J7423J6489J9744
14276A50163P592K1050j6429k2828L000j6637N534K1452k2596k2881l910J2877
14264A16387N455l880o514q960R104L5614L8413Q188j721M0348j7684n1633k2243
14251A40874k0704k0616l80q303N9092J4349N174J5711q414K4604M2876K8946
$$ plain form
14239 273209 286507 238985 211536 206460 184388 193024 187741 186607 194736 192990 176622 211811 247785
14226 247785 258865 279170 280223 249478 301038 365522 393657 387355 399585 402062 390197 397925
14214 397925 353585 340221 381877 351158 347521 375315 386251 455575 478699 519947 519103 512804
14202 512804 534221 520921 542999 628115 704001 744136 816859 872693 971743 1093139 1237905
14191 1237905 1438243 1691425 1950842 2170582 2358745 2478548 2538884 2520687 2473622 2350458
14181 2350458 2181309 2002690 1788128 1587661 1409190 1238917 1122441 1055527 985872 925711
14171 925711 893158 855754 837570 840265 826882 800792 830044 855688 875310 837761 884240 941756
14159 941756 937883 912239 927131 942968 991208 1053600 1112281 1121471 1151747 1237535 1292852 1363327
$$ packed form
14239B73209J3298m7522k7449n076k2072Q636n283j134Q129j746j6368L5189L5974
14226B47785J1080K0305J053l0745N1560O4484K8135o302J2230K477j1865P728
14214C97925m4340j3364M1656l0719l637K7794J0936O9324K3124M1248q44o299
14202E12804K1417j3300K2078Q5116P5886M0135P2723N5834R9050J21396J44766
14191A237905K00338K53182K59417K19740J88163J19803O0336j8197m7065j23164
14181B350458j69149j78619k14562k00467j78471j70273j16476o6914o9655o0161
14171I25711l2553l7404j8184K695j3383k6090K9252K5644J9622l7549M6479N7516
14159I41756l873k5644J4892J5837M8240O2392N8681R190L0276Q5788N5317P0475
$$ plain form
14147 1363327 1464144 1503490 1548987 1640097 1691496 1718423 1791797 1855231 1917459 1986427 2114919
14136 2114919 2236456 2428695 2561423 2638930 2806762 3028559 3235363 3479902 3802990 4085974
14126 4085974 4337603 4671313 5105081 5575951 6103645 6721765 7377632 8128655 8932426
14117 8932426 9854783 10920891 12145890 13568955 15169588 17025185 19170140 21613168
14109 21613168 24398463 27569140 31144156 35232615 39792873 44910283 50642893 56819336
14101 56819336 63428365 70327350 77310133 84236553 90847292 96888171 102112594 106325241
14093 106325241 109430614 111416030 112277829 112069252 110973890 109142789 106750538 104088981
14085 104088981 101256842 98473597 95853488 93485410 91489996 89868184 88652201 87851592
$$ packed form
14147A363327J00817L9346M5497R1110N1399K6927P3374O3434O2228O8968J28492
14136B114919J21537J92239J32728P7507J67832K21797K06804K44539L23088K82984
14126D085974K51629L33710M33768M70870N27694O18120O55867P51023Q03771
14117H932426R22357J066108J224999J423065J600633J855597K144955K443028
14109B1613168K785295L170677L575016M088459M560258N117410N732610O176443
14101E6819336O609029O898985O982783O926420O610739O040879N224423M212647
14093A06325241L105373J985416Q61799k08577j095362j831101k392251k661557
14085A04088981k832139k783245k620109k368078j995414j621812j215983q00609
$$ plain form
14077 87851592 87573921 87703173 88300269 89386701 90916877 92795446 95110494 97746305
14069 97746305 100640381 103761491 106902351 109895160 112429461 114368404 115524125 115744289
14061 115744289 114777138 112572775 109198997 104824044 99457732 93249450 86541505 79587382
14053 79587382 72532901 65605285 58978592 52807962 47125269 42010725 37499700 33472749
14045 33472749 29929899 26792335 24047414 21616504 19485173 17640302 16020562 14559180
14037 14559180 13293492 12210601 11282485 10460841 9690874 9037001 8483986 7886944 7335408
14028 7335408 6889221 6488263 6145271 5836297 5524136 5186186 4859758 4560226 4287181
14019 4287181 4052373 3831378 3612383 3422176 3223721 3080401 2966211 2795452 2645718
$$ packed form
14077H7851592k77671J29252N97096J086432J530176J878569K315048K635811
14069I7746305K894076L121110L140860K992809K534301J938943J155721K20164
14061A15744289r67151k204363l373778m374953n366312o208282o707945o954123
14053G9587382p054481o927616o626693o170630n682693n114544m511025m026951
14045C3472749l542850l137564k744921k430910k131331j844871j619740j461382
14037A4559180j265688j082891r28116q21644p69967o53873n53015n97042n51536
14028G335408m46187m00958l42992l08974l12161l37950l26428k99532k73045
14019D287181k34808k20995k18995j90207j98455j43320j14190j70759j49734
$$ plain form
14010 2645718 2492453 2405017 2294771 2193396 2114658 1972977 1840371 1775824 1721362 1620573
14000 1620573 1571154 1520679 1439737 1388953 1423441 1494824 1468121 1364310 1290160 1212525 1161550
13989 1161550 1135268 1102388 1061806 1001740 986949 994549 978481 1017206 1022986 998471 931076 869182
13977 869182 853622 852251 857735 800781 778714 822596 797137 756723 774452 736880 746459 731949
13965 731949 730037 698487 661818 641513 638543 652699 620152 597015 560788 617536 646181 631130
13953 631130 580440 551629 571297 532346 470101 516689 477779 447994 437896 438415 506002 525808
13941 525808 496467 447433 423675 377453 368393 347796 397591 435582 474470 472318 453056 374877
13929 374877 329259 341905 350391 376621 389989 379800 337296 318442 311719 315231 303028 286973
$$ packed form
14010B645718j53265q7436j10246j01375p8738j41681j32606o4547n4462j00789
14000A620573m9419n0475q0942n0784L4488P1383k6703j03811p4150p7635n0975
13989A161550k6282l2880m0582o0066j4791P600j6068L8725N780k4515o7395o1894
13977H69182j5560j371N484n6954k2067M3882k5459m0414J7729l7572R579j4510
13965G31949j912l1550l6669k0305k970J4156l2547k3137l6227N6748K8645j5051
13953F31130n0690k8811J9668l8951o2245M6588l8910k9785j0098N19O7587J9806
13941E25808k9341m9034k3758m6222r060k0597M9795L7991L8888k152j9262p8179
13929C74877m5618J2646Q486K6230J3368j0189m2504j8854o723L512j2203j6055
$$ plain form
13917 286973 295718 288778 263095 202947 169439 183114 197631 156029 92101 82626 97885 114180
13905 114180 144600 182955 152706 104067 91210 99927 136941 139317 162267 199790 202699 187223
13893 187223 199014 187220 164384 153288 141307 120925 150854 187470 135255 91216 67627
13882 67627 82002 118626 147860 130935 106956 148526 183299 193738 169511 108707 114121 108620
13870 108620 112440 129219 159104 191009 163510 175546 166604 94731 76412 100655 103690 107796
13858 107796 125405 106393 102918 149671 160442 135381 89097 57537 36263 44344 72954 64481
13846 64481 37136 40428 78615 93250 96237 113954 107944 89639 48128 60253 87827 78494
13834 78494 71700 58286 29265 13628 51381 74245 95989 110152 117897 102282 72515 119852
$$ packed form
13917B86973Q745o940k5683o0148l3508J3675J4517m1602o3928r475J5259J6295
13905A14180L0420L8355l0249m8639j2857Q717L7014K376K2950L7523K909j5476
13893A87223J1791j1794k2836j1096j1981k0382K9929L6616n2215m4039k3589
13882F7627J4375L6624K9234j6925k3979M1570L4773J0439k4227o0804N414n501
13870A08620L820J6779K9885L1905k7499J2036q942p1873j8319K4243L035M106
13858A07796J7609j9012l475M6753J0771k5061m6284l1560k1274Q081K8610q473
13846F4481k7345L292L8187J4635K987J7717o010j8305m1511J2125K7574r333
13834G8494o794j3414k9021j5637L7753K2864K1744J4163P745j5615k9767M7337
$$ plain form
13822 119852 102764 42609 -12273 3983 63762 95003 73949 80308 65158 53775 65527 101528
13810 101528 166135 153005 98890 91678 138123 164148 155487 101163 55895 87116 72076 20892
13798 20892 6403 7672 -14350 -30931 -12644 13935 11318 -15532 -18118 -9933 -6867 -1450 2717
13785 2717 56571 106652 119686 119423 111708 91638 91151 134283 167676 145869 197147 250320 316761
13772 316761 382738 453752 592048 793481 1039538 1328154 1631409 1905462 2174504 2416313
13762 2416313 2588588 2680984 2604398 2455480 2206246 1927419 1565166 1228077 992494 797350
13752 797350 620504 516617 430987 352082 267978 246358 278906 314503 220566 158220 136725
13741 136725 88298 106855 96120 78246 55344 51155 35424 11804 3737 45227 82592 73639
$$ packed form
13822A19852j7088o0155n4882J6256N9779L1241k1054O359j5150j1383J1752L6001
13810A01528O4607j3130n4115p212M6445K6025q661n4324m5268L1221j5040n1184
13798B0892j4489J269k2022j6581J8287K6579k617k6850k586Q185L066N417M167
13785B717N3854N0081J3034k63p715k0070m87M3132L3393k1807N1278N3173O6441
13772C16761O5977P1014J38296K01433K46057K88616L03255K74053K69042K41809
13762B416313J72275R2396p6586j48918k49234k78827l62253l37089k35583j95144
13752G97350j76846j03887q5630p8905q4104k1620L2548L5597r3937o2346k1495
13741A36725m8427J8557j0735j7874k2902m189j5731k3620q067M1490L7365q953
$$ plain form
13729 73639 51816 33799 21805 -1216 53449 37576 16438 -21828 -40459 -6307 52671 34428
13717 34428 40762 26739 -72463 -83309 -57159 -30090 -46163 -35357 -14452 21134 -71 -50502
13705 -50502 -13491 21411 15048 3813 -9215 30278 33542 9776 7818 28273 38532 36972
13693 36972 105083 191711 236537 222402 242411 267356 243970 270487 285933 206512 151279 71057
13681 71057 -14494 -70879 -18770 35291 65390 10182 -5997 -28618 -2344 42466 67717 17389
13669 17389 -95757 -134830 -90360 -42707 -10793 -1978 32306 18119 45959 77644 16645 21833
13657 21833 57272 53510 84202 118452 72834 118578 182500 229829 281785 300105 334659 359578
13645 359578 405142 475794 486241 473010 509692 557801 546162 519290 528809 575906 620423 649663
$$ packed form
13729G3639k1823j8017j1994k3021N4665j5873k1138l8266j8631L4152N8978j8243
13717C4428O334j4023r9202j0846K6150K7069j6073J0806K0905L5586k1205n0431
13705e0502L7011L4902o363j1235j3028L9493L264k3766j958K0455J0259j560
13693C6972O8111Q6628M4826j4135K0009K4945k3386K6517J5446p9421n5233q0222
13681G1057q5551n6385N2109N4061L0099n5208j6179k2621K6274M4810K5251n0328
13669A7389j13146l9073M4470M7653L1914Q815L4284j4187K7840L1685o0999N188
13657B1833L5439l762L0692L4250m5618M5744O3922M7329N1956J8320L4554K4919
13645C59578M5564P0652J0447j3231L6682M8109j1639k6872R519M7097M4517K9240
$$ plain form
13633 649663 630628 619613 642945 620867 591116 543153 518333 534021 515404 468478 517906
13622 517906 515973 490439 488062 499634 551121 564363 544176 529246 557562 605913 646880 660449
13610 660449 660286 618713 586289 617364 634879 589796 581403 554463 545679 523086 460063 429828
13598 429828 441516 394559 316580 222956 180284 158693 179137 183801 175062 219137 183136 119986
13586 119986 97473 124257 69051 63390 81115 99494 127971 145453 145780 104668 42058 -37058
13574 -37058 -52821 -26715 -5545 -1197 -42473 -24508 -1179 29952 61965 43800 54623 70277
13562 70277 81515 77077 29408 36484 79688 88121 61993 58852 9634 -8826 3113 8642 36150
13549 36150 40519 2532 -13911 14185 25459 23848 28815 17764 54160 75536 47614 1715
$$ packed form
13633F49663j9035j1015K3332k2078k9751m7963k4820J5688j8617m6926M9428
13622E17906j933k5534k377J1572N1487J3242k0187j4930K8316M8351M0967J3569
13610F60449j63m1573l2424L1075J7515m5083q393k6940q784k2593o3023l0235
13598D29828J1688m6957p7979r3624m2672k1591K0444M664q739M4075l6001o3150
13586A19986k2513K6784n5206n661J7725J8379K8477J7482L27m1112o2610p9116
13574c7058j5763K6106K1170M348m1276J7965K3329L1131L2013j8165J0823J5654
13562G0277J1238m438m7669P076M3204Q433k6128l141m9218j8460J1939N529K7508
13549C6150M369l7987j6443K8096J1274j611M967j1051L6396K1376k7922m5899
$$ plain form
13537 1715 3071 -26138 -24975 -1274 -7661 7161 -6152 -3111 10921 -12787 -46010 -58391 -60833
13524 -60833 -8162 70021 83234 78895 76992 97359 81551 84354 109158 101812 99078 98068 101105
13511 101105 75395 66673 75570 58466 89376 71392 32079 23820 42087 29512 -729 -4338
13499 -4338 33152 47262 59057 67732 49766 34725 39232 32275 7660 -7051 7690 3403 36275
13486 36275 79818 76613 51690 35945 54397 76852 71772 22250 -4331 8389 8865 36356
13474 36356 65322 94629 63463 64440 26107 10199 41293 -6500 -49614 -76338 -86656 -44203
13462 -44203 -20411 7902 12215 -16345 -50485 -41573 22262 53160 -255 -4526 -35566 -48369
13450 -48369 -15905 -7879 2995 14782 12723 -33436 -7803 43271 45649 -5869 -83835 -99509
$$ packed form
13537A715J356k9209J163K3701o387J4822j3313L041J4032k3708l3223j2381k442
13524f0833N2671P8183J3213m339j903K0367j5808K803K4804p346k734j010L037
13511A01105k5710q722Q897j7104L0910j7984l9313q259J8267j2575l0241l609
13499d338L7490J4110J1795Q675j7966j5041M507o957k4615j4711J4741m287L2872
13486C6275M3543l205k4923j5745J8452K2455n080m9522k6581J2720M76K7491
13474C6356K8966K9307l1166R77l8333j5908L1094m7793m3114k6724j0318M2453
13462d4203K3792K8313M313k8560l4140Q912O3835L0898n3415m271l1040j2803
13450d8369L2464Q026J0874J1787k059m6159K5633N1074K378n1518p7966j5674
$$ plain form
13438 -99509 -74994 -42868 -50786 -80564 -49499 -9520 -827 17265 -38564 -76426 -81342 -34401
13426 -34401 -49905 -57187 -24582 -11017 -22187 -66721 -71747 -38635 -50918 -37237 -51163 -36539
13414 -36539 -47907 -65943 -66092 -57672 -18855 29677 1662 3813 39421 21204 47353 78764
13402 78764 76062 46452 -11357 -61137 -57549 -40218 10911 16236 -14157 -12801 4150 -18372
13390 -18372 -55506 -78197 -69494 -44097 -34323 2972 22579 46655 27511 -11483 -32452 -38568
13378 -38568 16085 46755 31719 -8383 -59197 -91810 -54812 -18283 897 -3556 9880 18088
13366 18088 47194 65217 -13172 -49905 -27415 -817 16874 7941 19215 -9482 -44906 -63667
13354 -63667 13101 35806 -40471 -57498 -25527 -18316 -43914 -66780 -83377 -101943 -87103 -70403
$$ packed form
13438i9509K4515L2126p918k9778L1065L9979Q693J8092n5829l7862m916M6941
13426c4401j5504p282L2605J3565j1170m4534n026L3112j2283J3681j3926J4624
13414c6539j1368j8036j49Q420L8817M8532k8015K151L5608j8217K6149L1411
13402G8764k702k9610n7809m9780L588J7331N1129N325l0393J356J6951k2522
13390a8372l7134k2691Q703K5397R774L7295J9607K4076j9144l8994k0969o116
13378c8568N4653L0670j5036m0102n0814l2613L6998L6529J9180m453J3436Q208
13366A8088K9106J8023p8389l6733K2490K6598J7691q933J1274k8697l5424j8761
13354f3667P6768K2705p6277j7027L1971P211k5598k2866j6597j8566J4840J6700
$$ plain form
13342 -70403 -52341 -73513 -64636 -33212 -14113 -26978 13867 79826 96722 43837 19190 31278
13330 31278 -20948 -86540 -44759 -29435 -14840 -8597 -19884 -572 18566 55660 40129 16979
13318 16979 26857 4466 -23477 38556 55293 46477 33577 51961 56252 53502 35554 37642 68371
13305 68371 89947 108661 102654 73470 81705 27508 -10855 25126 17686 -43623 -92772 -72604
13293 -72604 -40167 19230 31673 -2925 -39822 -5760 9076 -2442 -1053 -4299 -28828 -10843
13281 -10843 -29216 -17578 27545 12382 661 83 -8078 -23687 -33202 -13351 -8399 -2114 4813
13268 4813 14613 -43726 -50153 -58131 -69593 -41789 -25705 -23212 -32717 -49984 -47964 -20442 -8548
13255 -8548 -8771 25170 64549 12791 12343 29342 43633 48247 59297 70929 21819 6050 -25311
$$ packed form
13342g0403J8062k1172Q877L1424J9099j2865M0845O5959J6896n2885k4647J2088
13330C1278n2226o5592M1781J5324J4595O243j1287J9312J9138L7094j5531k3150
13318A6979R878k2391k7943O2033J6737q816j2900J8384M291k750j7948K088L0729
13305F8371K1576J8714o007k9184Q235n4197l8363L5981p440o1309m9149K0168
13293g2604L2437N9397J2443l4598l6897L4062J4836j1518J389l246k4529J7985
13281a0843j8373J1638M5123j5163j1721n78q161j5609r515J9851M952O285O927
13268D813R800n8339o427p978j1462K7804J6084K493r505j7267K020K7522J1894
13255h548k23L3941L9379n1758m48J6999J4291M614J1050J1632m9110j5769l1361
$$ plain form
13242 -25311 -53454 -60847 -22385 30994 59442 55100 -195 -41523 27437 71400 51640 27872
13230 27872 -15966 -3723 -19242 -20314 -40841 -31910 -26036 -9456 -9267 -2333 9621 -12437 11584
13217 11584 53251 48689 -601 -55223 -53210 -93575 -116256 -112072 -93345 -104900 -106627 -97569 -106961
13204 -106961 -102956 -66352 44 36768 47583 37104 25643 -108 -5483 -4770 3666 34560
13192 34560 -30841 -53794 -34607 -20116 55763 84045 83060 67208 12219 47267 27061 2123
13180 2123 -18894 -2620 -21348 20460 56140 96818 156115 244070 268129 267562 284440 258193
13168 258193 197540 136636 97416 49275 32887 43168 3837 6639 5457 -6994 4977 22333
13156 22333 9077 -48827 -14332 -19982 -22732 25788 24797 -20757 -36975 29375 43666 35085 19738
$$ packed form
13242b5311k8143p393L8462N3379K8448m342n5295m1328O8960M3963j9760k3768
13230B7872m3838J2243j5519j072k0527Q931N874J6580J89O934J1954k2058K4021
13217A1584M1667m562m9290n4622K013m0365k2681M184J8727j1555j727R058r392
13204a06961M005L6604O6396L6724J0815j0479j1461k5751n375P13Q436L0894
13192C4560o5401k2953J9187J4491P5879K8282r85j5852n4989L5048k0206k4938
13180B123k1017J6274j8728M1808L5680M0678N9297Q7955K4059n67J6878k6247
13168B58193o0653o0904l9220m8141j6388J0281l9331K802j182j2451J1971J7356
13156B2333j3256n7904L4495n650k750M8520r91m5554j6218O6350J4291q581j5347
$$ plain form
13143 19738 -23778 -54068 -48669 -14957 -10967 20546 24711 35613 7289 82379 168981 144464
13131 144464 147991 146505 202708 213361 237482 309565 328142 286424 226018 169061 108291 109268
13119 109268 102612 73765 98077 82514 51989 73230 101122 86286 91397 85542 23392 21382
13107 21382 38500 54578 64070 33013 -10049 -5029 -48598 -81427 -50518 -19061 -12776 -11889 -22832
13094 -22832 -32438 1300 5458 -1637 10473 19854 1972 -40537 -31048 1931 -6114 -12408 -22552
13081 -22552 -29866 -21816 21375 28430 62055 33933 -6667 -52704 -34394 26394 40147 38643
13069 38643 23604 -8466 -18111 -41776 -51103 -74559 -53780 -8662 36086 8325 -9323 -23979
13057 -23979 -66759 -38599 -27898 -17674 -9225 9206 -20770 -14614 -27282 -48454 5415 46538
$$ packed form
13143A9738m3516l0290N399L3712L990L1513M165J0902k8324P5090Q6602k4517
13131A44464L527j486N6203J0653K4121P2083J8577m1718o0406n6957o0770R77
13119A09268o656k8847K4312j5563l0525K1241K7892j4836N111n855o2150k010
13107B1382J7118J6078R492l1057m3062N020m3569l2829L0909L1457O285Q87j0943
13094b2832r606L3738M158p095J2110R381j7882m2509R489L2979q045o294j0144
13081b2552p314Q050M3191P055L3625k8122m0600m6037J8310O0788J3753j504
13069C8643j5039l2070r645k3665r327k3456K0779M5118M4748k7761j7648j4656
13057b3979m2780K8160J0701J0224Q449J8431k9976O156j2668k1172N3869M1123
$$ plain form
13045 46538 -9852 -24963 -28332 -44656 4638 20122 -14398 -1585 82881 41645 1303 71720
13033 71720 93545 96674 62436 47100 46365 7733 -22312 -9302 -30737 -89454 -47523 2299
13021 2299 30965 38577 791 -45401 -66479 -44154 25959 50587 34841 51575 67413 26568
13009 26568 -15271 -7856 -22744 -31677 -18044 -21951 5105 885 -12215 -8819 40023 41842 31173
12996 31173 53788 40861 37124 66509 66763 80753 78530 50432 69494 80593 45320 57532
12984 57532 64939 49921 47741 38283 -29269 -42249 -48965 -25613 -22738 -44321 -52330 -67875 -68976
12971 -68976 -63530 -57602 -8429 53102 73281 45291 13973 1617 -2691 -6532 -10354 28965 70795
12958 70795 -15879 -48410 -10812 -18326 -6897 -25312 -10478 38537 28074 13314 40510 47528
$$ packed form
13045D6538n6390j5111l369j6324M9294J5484l4520J2813Q4466m1236m0342P0417
13033G1720K1825L129l4238j5336p35l8632l0045J3010k1435n8717M1931M9822
13021B299K8666P612l7786m6192k1078K2325P0113K4628j5746J6734J5838m0845
13009B6568m1839P415j4888q933J3633l907K7056m220j3100L396M8842J819j0669
12996C1173K2615j2927l737K9385K54J3990k223k8098J9062J1099l5273J2212
12984E7532P407j5018k180r458o7552j2980o716K3352K875k1583q009j5545j101
12971f8976N446N928M9173O1531K0179k7990l1318j2356m308l841l822L9319M1830
12958G0795q6674l2531L7598p514J1429j8415J4834M9015j0463j4760K7196P018
$$ plain form
12946 47528 45155 28996 -16673 -17086 14829 19454 14682 3106 -39642 -38541 -29050 -32125 -26721
12933 -26721 3368 54379 29386 16976 -26707 -8470 53746 71982 73091 69389 48610 93946
12921 93946 78299 41292 35335 22754 31479 49851 23807 -11718 8428 -25011 -22905 -39873
12909 -39873 -46634 -50477 -47880 -5779 4438 -36244 -70257 -34956 1463 -14513 -442 -33094
12897 -33094 -73199 -48120 -49023 -50309 -68230 -49436 -37730 -47658 -75073 -38720 647 -11662
12885 -11662 -22272 -22775 17890 47262 26283 -20486 -34501 -62863 -71397 -84720 -46935 4720
12873 4720 14310 66256 42118 13927 3411 -66371 -56939 -36441 -50157 -36499 -31428 -2115
12861 -2115 63424 55254 19220 -89 -5975 -35487 -12229 55366 84408 62278 42058 13309
$$ packed form
12946D7528k373j6159m5669m13L1915M625m772j1576m2748J101R491l075N404
12933b6721L0089N1011k4993j2410m3683J8237O2216J8236J109l702k0779M5336
12921I3946j5647l7007n957j2581Q725J8372k6044l5525K0146l3439K106j6968
12909c9873o761l843K597M2101J0217m0682l4013L5301L6419j5976J4071l2652
12897c3094m0105K5079r03j286j7921J8794J1706r928k7415L6353L9367j2309
12885a1662j0610n03M0665K9372k0979m6769j4015k8362q534j3323L7785N1655
12873D720R590N1946k4138k8191j0516o9782R432K0498j3716J3658N071K9313
12861b115O5539q170l6034j9309n886k9512K3258O7595K9042k2130k0220k8749
$$ plain form
12849 13309 19954 16181 28409 39969 44215 11849 29299 76046 102219 98666 77432 90962
12837 90962 92348 82842 111602 94522 22302 -13820 -5617 -22915 -28213 -42278 -47224 -30944 -31596
12824 -31596 -22128 -13507 -29607 -20866 -35073 -15700 -6050 20683 35516 35506 9960 -27587 -34540
12811 -34540 -39639 -25214 -33604 20608 86535 62869 50921 24146 -6705 -4275 4018 -16054
12799 -16054 -38622 -20303 8793 46166 82066 67880 52432 -4556 30616 27350 18241 6758
12787 6758 2268 -16599 18020 13684 12019 36935 -8468 -53353 -64358 -64823 -24679 -2499 -9422
12774 -9422 -17337 -37143 -70947 -73667 -71227 -7982 -35081 -40967 -35947 -28119 -31064 -56150 -41105
12761 -41105 -39425 -49121 -71528 -78758 -37053 14378 45128 9310 28880 32339 -379 -12465
$$ packed form
12849A3309O645l773J2228J1560M246l2366J7450M6747K6173l553k1234J3530
12837I0962J386r506K8760j7080p2220l6122Q203j7298n298j4065m946J6280o52
12824c1596R468Q621j6100Q741j4207J9373R650K6733J4833j0k5546l7547o953
12811c4540n099J4425q390N4212O5927k3666j1948k6775l0851K430Q293k0072
12799a6054k2568J8319K9096L7373L5900j4186j5448n6988L5172l266r109j1483
12787F758m490j8867L4619m336j665K4916m5403m4885j1005m65M0144K2180o923
12774i422p915j9806l3804k720K440O3245k7099n886N020P828k945k5086J5045
12761d1105J680r696k2407p230M1705N1431L0750l5818J9570L459l2718j2086
$$ plain form
12749 -12465 -47754 -45779 -32784 -37971 -21563 -44033 -23327 -14519 -32704 -46471 -17039 1652
12737 1652 23776 26159 -15431 -61548 -62446 12708 13657 -34103 -45314 -32005 1302 31658 70429
12724 70429 40961 22710 76084 49900 -11513 22445 28045 44903 57126 14624 25297 50029
12712 50029 41935 42663 75269 81095 85385 112872 78236 37936 3982 2115 -53140 -72725 -52825
12699 -52825 -72597 -109757 -113357 -78260 -65894 -47740 -30270 -32499 -51770 -95516 -30568 -23590
12687 -23590 -85645 -32623 -19534 -63041 -80609 -91318 -70505 -35738 2657 15268 -15222 -31343
12675 -31343 -1075 9200 -20981 -57517 -12236 24981 -2686 -3647 -29402 -40574 -7887 35488
12663 35488 11748 -19370 7478 21417 -23257 -56126 -16716 37560 -1082 1853 38876 32176
$$ packed form
12749a2465l5289J975J2995n187J6408k2470K0706Q808j8185j3767K9432J8691
12737A652K2124K383m1590m6117q98P5154R49m7760j1211J3309L3307L0356L8771
12724G0429k9468j8251N3374k6184o1413L3958N600J6858J2223m2502J0673K4732
12712E0029q094P28L2606N826M290K7487l4636m0300l3954j867n5255j9585J9900
12699e2825j9772l7160l600L5097J2366J8154J7470k229j9271m3746O4948O978
12687b3590o2055N3022J3089m3507j7568j0709K0813L4767L8395J2611l0490j6121
12675c1343L0268J0275l0181l6536M5281L7217k7667r61k5755j1172L2687M3375
12663C5488k3740l1118K6848J3939m4674l2869L9410N4276l8642K935L7023o700
$$ plain form
12651 32176 39726 25943 -8860 31172 50245 43958 13933 -8057 -3299 32251 10217 -29004
12639 -29004 -31690 -18434 20020 -16894 -49314 -43910 -60040 -26779 13646 44287 28883 51075
12627 51075 30081 21077 42305 74384 64961 98009 89289 63450 57220 59406 -5675 -47111 -20928
12614 -20928 19150 11937 16494 -23528 -43935 -59202 -61486 -30337 -9544 -5249 -50669 -65438
12602 -65438 -38505 -59400 -49195 -42132 -55225 -35381 -51659 -51086 -34053 6627 10653 8259 27236
12589 27236 4156 -10764 -22247 12024 -6511 -69704 -60162 -47894 -56594 -33379 -18917 -19932
12577 -19932 -34373 -45147 -79563 -75796 -5636 7820 -45571 -70931 -49071 -52151 -81804 -87261
12565 -87261 -16622 28982 38278 79570 71016 66499 63205 68759 69819 14028 -18325 2197 7966
$$ packed form
12651C2176P550j3783l4803M0032J9073o287l0025k1990M758L5550k2034l9221
12639b9004k686J3256L8454l6914l2420N404j6130L3261M0425L0641j5404K2192
12627E1075k0994r004K1228L2079r423L3048q720k5839o230K186o5081m1436K6183
12614b0928M0078p213M557m0022k0407j5267k284L1149K0793M295m5420j4769
12602f5438K6933k0895J0205P063j3093J9844j6278N73J7033M0680M026k394J8977
12589B7236k3080j4920j1483L4271j8535o3193R542J2268q700K3215J4462j015
12577a9932j4441j0774l4416L767P0160J3456n3391k5360K1860l080k9653n457
12565h7261P0639M5604R296M1292q554m517l294N554J060n5791l2353K0522N769
$$ plain form
12552 7966 -1478 -5971 6059 -11718 -26753 1845 22978 34632 6328 53110 64026 31039
12540 31039 -15136 -21943 -10395 29297 37895 71265 51610 32145 55679 76120 48240 42857
12528 42857 28768 16208 -41088 -47590 -3909 10341 33011 39499 50759 29769 -15612 -28588
12516 -28588 -82343 -43190 5877 -6455 1798 52832 79123 63828 52793 87242 45415 -33845
12504 -33845 -37180 -10602 4297 -5467 -41466 -18221 -33694 -33010 -36509 -37547 -32499 -9888 8185
12491 8185 -1360 -11918 -30844 -22340 17117 -9935 -51889 -63925 -75538 -59475 -24299 23098
12479 23098 79608 53525 46937 57537 49154 63414 68510 80609 80882 102280 117046 150113 115924
12466 115924 78928 137329 178069 175386 160531 131593 135305 191349 230051 184196 163798 125150
$$ packed form
12552G966r444m493J2030j7777j5035K8598K1133J1654k8304M6782J0916l2987
12540C1039m6175o807J1548L9692Q598L3370j9655j9465K3534K0441k7880n383
12528D2857j4089j2560n7296o502M3681J4250K2670O488J1260k0990m5381j2976
12516b8588n3755L9153M9067j2332Q253N1034K6291j5295j1035L4449m1827p9260
12504c3845l335K6578J4899r764l5999K3245j5473O84l499j038N048K2611J8073
12491H185r545j0558j8926Q504L9457k7052m1954j2036j1613J6063L5176M7397
12479B3098N6510k6083o588J0600q383J4260N096J2099K73K1398J4766L3067l4189
12466A15924l6996N8401M0740k683j4855k8938L712N6044L8702m5855k0398l8648
$$ plain form
12454 125150 122806 101104 131191 146917 109368 112577 125613 134275 133116 172645 232619 259303
12442 259303 220467 191477 188855 183498 136903 177940 227702 254324 297553 348471 364083 436011
12430 436011 436183 415191 364819 346170 325024 286104 252353 220659 185797 193157 221380 240496
12418 240496 231929 176066 120157 139383 186796 184897 160143 118025 146147 150789 134906 168917
12406 168917 178920 96187 51064 82733 91284 121397 115696 98093 163397 177137 194006 170841
12394 170841 162664 208049 209773 200306 202273 195202 134845 112296 165991 177101 168689 197287 163683
12381 163683 148433 195901 195258 181930 178307 120144 67141 24689 36847 62908 22476 -57241
12369 -57241 -52250 -29678 -4666 35646 49410 51890 60731 67591 93043 122493 111598 110641 118033
$$ packed form
12454A25150k344k1702L0087J5726l7549L209J3036Q662j159L9529N9974K6684
12442B59303l8836k8990k622n357m6595M1037M9762K6622M3229N0918J5612P1928
12430D36011J72k0992n0372j8649k1146l8920l3751l1694l4862P360K8223J9116
12418B40496q567n5863n5909J9226M7413j899k4754m2118K8122M642j5883L4011
12406A68917J0003q2733m5123L1669Q551L0113n701j7603O5304J3740J6869k3165
12394A70841q177M5385J724r467J967p071o0357k2549N3695J1110q412K8598l3604
12381A63683j5250M7468o43j3328l623n8163n3003m2452J2158K6061m0432p9717
12369e7241M991K2572K5012M0312J3764K480Q841O860K5452K9450j0895r57P392
$$ plain form
12356 118033 106612 70916 70129 75768 67654 60066 48961 55942 34262 13165 -11007 -46468 -105539
12343 -105539 -59656 -15253 -11877 12334 34416 -27558 -21284 -35680 -46210 -33397 29606 59479
12331 59479 72203 23215 39968 54516 93556 123520 147393 192200 303512 418329 485305
12320 485305 527765 463824 318167 205076 112097 58251 50634 66939 90755 104405 74927
12309 74927 55328 17114 -3177 -1335 8848 34315 63189 39885 26865 30010 35958 57115
12297 57115 84442 58596 39987 23450 44095 32222 65317 84117 107365 129300 136794 144213
12285 144213 136189 205537 275959 404561 606637 815958 1071341 1261190 1323524 1381782 1329258
12274 1329258 1074245 748546 471859 326139 308975 245136 185628 182148 171776 128767 89380
$$ packed form
12356A18033j1421l5696p87N639q114p588j1105O981k1680k1097k4172l5461n9071
12343a05539M5883M4403L376K4211K2082o1974O274j4396j0530J2813O3003K9873
12331E9479J2724m8988J6753J4548L9040K9964K3873M4807J11312J14817O6976
12320D85305M2460o3941j45657j13091r2979n3846p617J6305K3816J3650k9478
12309G4927j9599l8214k0291J842J0183K5467K8874k3304j3020L145N948K1157
12297E7115K7327k5846j8609j6537K0645j1873L3095J8800K3248K1935P494P419
12285A44213q024O9348P0422J28602K02076K09321K55383J89849O2334N8258n2524
12274A329258k55013l25699k76687j45720j7164o3839n9508l480j0372m3009l9387
$$ plain form
12263 89380 59012 52775 56988 67396 26708 17117 22050 18989 51113 46979 34219 63442 92125
12250 92125 83147 110138 160409 146506 145304 154378 109685 112793 167770 272166 369599 421534
12238 421534 463511 548637 710070 958939 1185112 1291915 1304544 1309821 1209283 942773
12228 942773 646344 451745 346206 259368 165277 141050 123775 108161 85185 80686 111659
12217 111659 137881 88078 52310 62977 43340 64865 78708 54099 53438 -8529 -37057 -10552
12205 -10552 26820 -3096 -18191 22185 60687 47802 62631 77661 78657 91260 75250 102746
12193 102746 134590 187296 257381 316244 384783 434983 430846 413904 328636 257066 220322 162373
12181 162373 103771 110390 57013 -13902 -58982 -55721 -67349 -88936 -97935 -61563 -45506 -44537
$$ packed form
12263H9380l0368o237M213J0408m0688r591M933l061L2124m134j2760K9223K8683
12250I2125q978K6991N0271j3903j202R074m4693L108N4977J04396R7433N1935
12238D21534M1977Q5126J61433K48869K26173J06803J2629N277j00538k66510
12228I42773k96429j94599j05539q6838r4091k4227j7275j5614k2976m499L0973
12217A11659K6222m9803l5768J0667j9637K1525J3843k4609o61o1967k8528K6505
12205a0552L7372k9916j5095M0376L8502j2885J4829J5030R96J2603j6010K7496
12193A02746L1844N2706P0085N8863O8539N0200m137j6942q5268p1570l6744n7949
12181A62373n8602O619n3377p0915m5080L261j1628k1587q999L6372J6057R69
$$ plain form
12169 -44537 -61102 -72745 -56259 -84881 -48314 -17609 -23067 -38474 -28739 -57267 -22614 31267
12157 31267 44786 -14822 -42408 -19506 -16195 3089 -21504 -26862 -6972 -33480 -40771 4426
12145 4426 17696 -24667 -13802 21052 11677 -18908 -36561 -18927 -22744 -33680 -12702 8237
12133 8237 9084 -11153 -15812 -10148 16381 33826 27156 49423 37637 -12095 -16624 148 18651
12120 18651 19350 -4813 48172 24002 -21178 -64117 -70190 -53108 -47600 8421 28846 48602
12108 48602 53779 43298 37365 42815 52701 21505 2229 -42171 -49332 -58147 -67573 -59183 -34325
12095 -34325 -28715 1363 -16815 -22096 24623 29610 37520 22303 8129 -579 -25857 2659 11189
12082 11189 -27568 -38289 -685 -18432 -34654 -31258 -86011 -109900 -94447 -66268 -74304 -62513
$$ packed form
12169d4537j6565j1643J6486k8622L6567L0705n458j5407R735k8528L4653N3881
12157C1267J3519n9608k7586K2902L311J9284k4593n358J9890k6508p291M5197
12145D426J3270m2363J0865L4854r375l0585j7653J7634l817j0936K0978K0939
12133H237Q47k0237m659N664K6529J7445o670K2267j1786m9732m529J6772J8503
12120A8651O99k4163N2985k4170m5180m2939o073J7082N508N6021K0425J9756
12108D8602N177j0481n933N450R886l1196j9276m4400p161q815r426Q390K4858
12095c4325N610L0078j8178n281M6719M987P910j5217j4174q708k5278K8516Q530
12082A1189l8757j0721L7604j7747j6222L396n4753k3889J5453K8179q036J1791
$$ plain form
12070 -62513 -43795 -41849 -41297 -9750 -31774 -19662 9959 -11687 -31120 -66325 -64374 -51999
12058 -51999 -25862 -15776 -55720 -52118 4950 -5477 -23013 -11951 -62382 -95321 -84383 -77357
12046 -77357 -61855 -47387 -12669 -8281 -23092 -19370 -6736 25210 51906 76940 24051 8640
12034 8640 37828 45792 -8059 -17740 9169 21888 46870 30651 -1365 -35266 -36665 -14130
12022 -14130 12407 52177 39260 45151 58150 31291 19320 40041 52966 3775 40829 22297
12010 22297 62046 179174 256359 345378 433423 540649 572029 573651 555968 423560 270688
11999 270688 188238 203932 231852 163060 73287 47416 64724 13800 61977 94901 90889 83847
11987 83847 56821 38155 25795 21349 963 -1388 23813 8837 27515 37816 13342 11251
$$ packed form
12070f2513J8718J946N52L1547k2024J2112K9621k1646j9433l5205J951J2375
12058e1999K6137J0086l9944L602N7068j0427j7536J1062n0431l2939J0938P026
12046g7357J5502J4468L4718M388j4811L722J2634L1946K6696K5034n2889j5411
12034H640K9188P964n3851r681K6909J2719K4982j6219l2016l3901j399K2535
12022a4130K6537L9770j2917N891J2999k6859j1971K0721J2925m9191L7054j8532
12010B2297L9749J17128P7185Q9019Q8045J07226L1380J622j7683j32408j52872
11999B70688q2450J5694K7920o8792q9773k5871J7308n0924M8177L2924m012p042
11987H3847k7026j8666j2360m446k0386k351K5201j4976J8678J0301k4474k091
$$ plain form
11975 11251 12052 35817 -14376 -33960 -35285 5470 36505 68437 66212 60410 5446 35643 72444
11962 72444 78063 46243 31881 6560 10438 -18678 -22804 15083 19542 33592 33716 1938 4699
11949 4699 16480 8993 33727 55465 32854 12894 8917 -20497 -10935 -22823 -72716 -69798 -19361
11936 -19361 -8508 -21481 -49861 -90415 -116633 -112067 -116298 -102707 -112159 -73428 -38667 -41141
11924 -41141 -2695 -5442 -6219 -357 5275 24716 13269 -30307 -77545 -61716 4359 40426 50779
11911 50779 28658 39908 23954 20711 22426 -8321 -69746 -58668 -55095 -60273 -59562 -51798 -30826
11898 -30826 2632 9596 -19334 -28640 -18500 9992 -12776 -49402 -67633 -58839 -31723 1452
11886 1452 -11559 -9349 694 14641 28345 31605 50411 82004 39171 28038 46850 -5946
$$ packed form
11975A1251Q01K3765n0193j9584j325M0755L1035L1932k225n802n4964L0197L6801
11962G2444N619l1820j4362k5321L878k9116m126L7887M459J4050J24l1778K761
11949D699J1781p487K4734K1738k2611j9960l977k9414R562j1888m9893K918N0437
11936a9361J0853j2973k8380m0554k6218M566m231J3591r452L8731L4761k474
11924d1141L8446k747p77N862N632J9441j1447m3576m7238J5829O6075L6067J0353
11911E0779k2121J1250j5954l243J715l0747o1425J1078L573n178P11P764K0972
11898c0826L3458O964k8930r306J0140K8492k2768l6626j8231Q794K7116L3175
11886A452j3011K210J0043J3947J3704L260J8806L1593m2833j1133J8812n2796
$$ plain form
11874 -5946 -54227 -51104 -33661 -4909 35456 33945 6932 8120 35662 50467 32045 41852 72015
11861 72015 93414 93702 67226 36135 -24546 -39208 -1192 -1881 -43955 -56759 -71695 -121873
11849 -121873 -119004 -112299 -106005 -128692 -99288 -29374 30352 -20076 -71520 -54850 -54502 -68496
11837 -68496 -94647 -108674 -66891 -24250 10503 22694 -930 -35909 -68452 -73165 -49919 -45427
11825 -45427 -15912 36382 45566 37773 67140 69931 -11777 -50267 -65036 -67277 -54434 8087
11813 8087 69267 81836 63710 43655 27634 17999 22282 27298 21016 2294 -17581 -13862 -286
11800 -286 66583 52054 -11559 -36171 -24556 -21307 -42268 -27908 -13832 -21580 -20951 -23526 -5328
11787 -5328 16194 -25740 -20020 -8582 3162 -38008 -38594 -37381 -400 62889 21641 -16555 -21658
$$ packed form
11874e946m8281L123J7443K8752M0365j511k7013J188K7542J4805j8422R807L0163
11861G2015K1399K88k6476l1091o0681j4662L8016o89m2074j2804j4936n0178
11849a21873K869O705O294k2687K9404O9914N9726n0428n1444J6670L48j3994
11837f8496k6151j4027M1783M2641L4753J2191k3624l4979l2543m713K3246M492
11825d5427K9515N2294R184p793K9367K791q1708l8490j4769k241J2843O2521
11813H087O1180J2569j8126k0055j6021r635M283N016o282j8722j9875L719J3576
11800b86O6869j4529o3613k4612J1615L249k0961J4360J4076p748O29k575J8198
11787e328K1522m1934N720J1438J1744m1170n86J213L6981O3289m1248l8196n103
$$ plain form
11774 -21658 -50025 -68038 -19258 24872 9788 -30107 -38423 -37777 -1736 37511 28165 -19781
11762 -19781 20578 17126 -12640 -5083 333 -18442 -42081 -26078 -8310 -29339 -52757 -50257
11750 -50257 -19994 4940 19565 22345 -15997 -70903 -107905 -75174 -98502 -95270 -15722 7268
11738 7268 -57867 -68955 -29425 -4287 -59128 -50698 -47797 -18580 -3934 -23609 -24785 16520
11726 16520 -11324 -17142 -25384 -35257 -43211 -97026 -106612 -65883 -58109 -42368 -50024 -91082 -94647
11713 -94647 -71938 -120189 -153172 -133597 -40592 23556 32277 -2830 -38820 -45078 -49967 15818
11701 15818 30412 75796 62453 43389 -5496 -39645 -55543 -52332 -83469 -99147 -27861 11757
11689 11757 -12677 -66577 -84456 -102486 -112196 -81425 -79331 -76966 -49120 -32183 -40273 -35712 -37826
$$ packed form
11774b1658k8367j8013M8780M4130j5084l9895q316O46L6041L9247r346m7946
11762a9781M0359l452k9766P557N416j8775k3639J6003J7768k1029k3418K500
11750e0257L0263K4934J4625K780l8342n4906l7002L2731k3328L232P9548K2990
11738G268o5135j1088L9530K5138n4841Q430K901K9217J4646j9675j176M1305
11726A6520k7844n818q242r873p954n3815r586M0729P774J5741p656m1058l565
11713i4647K2709m8251l2983J9575R3005O4148Q721l5107l5990o258m889O5785
11701A5818J4594M5384j3343j9064m8885l4149j5898L211l1137j5678P1286L9618
11689A1757k4434n3900j7879j8030r710L0771K094K365K7846J6937q090M561k114
$$ plain form
11676 -37826 -24947 -58432 -58604 -10812 -44070 -70431 -45786 -15805 -61152 -56050 -16333 -48807
11664 -48807 -66768 -40752 -36337 3054 -179 -24629 -54638 -16576 -18979 -43440 -81790 -68448
11652 -68448 -92553 -74576 -44279 -41536 -31999 -38046 -43485 -20566 -13447 484 -26638 -74239 -71526
11639 -71526 -16968 26081 75577 54616 -14271 -59687 -51890 -10562 -5433 -26422 -39516 -19045
11627 -19045 38276 34403 -72080 -115356 -103194 -121054 -131128 -77885 -34111 -31025 -23289 -49074
11615 -49074 -37819 -34478 -60492 -83103 -151874 -152226 -121261 -93303 -72391 -28417 -15314 -51774
11603 -51774 -30291 34384 36583 31849 8878 -11201 -54774 -92221 -84294 -65112 -16810 -18613
11591 -18613 -64809 -55133 -71315 -79845 -79678 -46612 -26907 17391 29227 18167 41838 53440
$$ packed form
11676c7826J2879l3485j72M7792l3258k6361K4645K9981m5347N102L9717l2474
11664d8807j7961K6016M415L9391l233k4450l0009L8062k403k4461l8350J3342
11652f8448k4105J7977L0297K743R537o047n439K2919P119J3931k7122m7601K713
11639g1526N4558M3049M9496k0961o8887m5416P797M1328N129k0989j3094K0471
11627a9045N7321l873j06483m3276J2162j7860j0074N3243M3774L086P736k5785
11615d9074J1255L341k6014k2611o8771l52L0965K7958K0912M3974J3103l6460
11603e1774K1483O4675K199m734k2971k0079m3573l7447P927J9182M8302j803
11591a8613m6196R676j6182q530J67L3066J9705M4298J1836j1060K3671J1602
$$ plain form
11579 53440 52838 48199 3149 -41293 -26944 -61943 -46365 -37323 -20694 -19500 -43978 -38517 -36698
11566 -36698 -66381 -119932 -75583 -52162 -2450 4849 -34876 -49714 7441 -24761 -17722 -34863
11554 -34863 -68698 -71051 -77787 -43820 -43570 -103963 -80318 -54864 -10646 -22572 -34093 -15838
11542 -15838 -10650 1103 -4662 -21449 -10402 -23281 -39987 -19353 -42831 -37475 25046 58911
11530 58911 5568 10261 26895 18023 8111 4944 -12457 -11270 6996 24315 4336 19928 33996
11517 33996 38167 18311 -52945 -67029 -68344 -14593 -7921 -29657 -30118 -4655 -18692 -32893 -8763
11504 -8763 -36037 -34791 1426 5479 -11186 -21488 -49270 -15207 -32016 -80796 -101658 -80895
11492 -80895 -24732 42486 74711 19348 -44067 -44110 -55391 -75579 -69480 -51858 -22706 -6352
$$ packed form
11579E3440o02m639m5050m4442J4349l4999J5578R042J6629J194k4478N461J819
11566c6698k9683n3551M4349K3421M9712P299l9725j4838N7155l2202P039j7141
11554c4863l3835k353o736L3967K50o0393K3645K5454M4218j1926j1521J8255
11542a5838N188J1753n765j6787J1047j2879j6706K0634k3478N356O2521L3865
11530E8911n3343M693J6634q872r912l167j7401J187J8266J7319j9979J5592J4068
11517C3996M171j9856p1256j4084j315N3751O672k1736m61K5463j4037j4201K4130
11504h763k7274J246L6217M053j6665j0302k7782L4063j6809m8780k0862K0763
11492h0895N6163O7218L2225n5363o3415m3j1281k0188O099J7622K9152J6354
$$ plain form
11480 -6352 -32455 -34141 -37251 -40132 -16773 43524 38321 8723 20138 24536 -3036 -10223 -17771
11467 -17771 -77265 -76899 -61810 -41381 -39382 -33810 -30363 -25299 -21419 -25850 -9343 19288 31034
11454 31034 -14261 -41054 -15066 -52054 -55297 -24550 10174 28474 43247 76139 39671 10737
11442 10737 14807 5481 -35170 -70423 -41338 -36292 -83811 -80756 -47498 13855 41939 336
11430 336 -46401 -46228 -2639 -19430 -48518 -28257 -47039 -60550 -39765 -68711 -59915 -76872 -64542
11417 -64542 -40509 -39192 -29431 -48002 -74243 -70057 -32812 -28275 -5533 -15977 -52712 -38521
11405 -38521 -9117 23443 23542 2604 -22712 7797 15538 28041 30903 32927 36405 50467 67091
11392 67091 24071 39145 61731 108735 100798 90291 70351 13130 -29899 -47857 -27885 -52000
$$ packed form
11480f352k6103j686l110k881K3359O0297n203k9598J1415M398k7572p187p548
11467a7771n9494L66J5089K0429J999N572L447N064L880m431J6507K8631J1746
11454C1034m5295k6793K5988l6988l243L0747L4724J8300J4773L2892l6468k8934
11442A0737M070r326m0651l5253K9085N046m7519L055L3258O1353K8084m1603
11430C36m6737J73M3589j6791k9088K0261j8782j3511K0785k8946Q796j6957J2330
11417f4542K4033J317R761j8571k6241M186L7245M537K2742j0444l6735J4191
11405c8521K9404L2560R9k0938k5316L0509P741J2503K862K024L478J4062J6624
11392F7091m3020J5074K2586M7004p937j0507j9940n7221m3029j7958J9972k4115
$$ plain form
11380 -52000 -83206 -106099 -116286 -125706 -119870 -95017 -31516 4849 -28847 -29184 -25942 -25863 -33038
11367 -33038 -68910 -78666 -26827 -34325 -47784 -69917 -27469 -13857 -35771 -43944 -29852 -37506
11355 -37506 -62356 -117596 -93287 -56882 4872 24843 35199 1158 -51886 -81141 -21121 2832
11343 2832 -32577 -42565 -55110 -39786 -12289 -30246 -53531 7588 -9722 -36183 -16008 26431
11331 26431 46727 25438 37069 49017 29719 43589 88618 81408 59751 53629 30954 8171
11319 8171 -3663 -14235 -24585 -4875 10566 -16831 -8250 45928 44389 66381 58054 -15863
11307 -15863 -50254 -67834 -45130 -27083 -41738 -27881 -50500 -65165 -105020 -102614 -74456 -97567
11295 -97567 -108123 -139848 -103580 -28713 -14142 -55792 -33731 -24154 -15622 716 -17754 -1273
$$ packed form
11380e2000l1206k2893j0187r420N836K4853O3501L6365l3696l37L242P9p175
11367c3038l5872r756N1839p498j3459k2133M2448J3612k1914q173J4092p654
11355c7506k4850n5240K4309L6405O1754J9971J0356l4041n3044k9255O0020K3953
11343B832l5409r988j2545J5324K7497j7957k3285O1119j7310k6461K0175M2439
11331B6431K0296k1289J1631J1948j9298J3870M5029p210k1657o122k2675k2783
11319H171j1834j0572j0350J9710J5441k7397Q581N4178j539K1992q327p3917
11307a5863l4391j7580K2704J8047j4655J3857k2619j4665l9855K406K8158k3111
11295i7567j0556l1725L6268P4867J4571m1650K2061R577Q532J6338j8470J6481
$$ plain form
11283 -1273 7778 -30166 -54569 -83968 -71416 -50327 -42691 -52485 -108094 -103190 -72263 -56335 -45768
11270 -45768 -22417 -14800 6691 52962 86636 76749 65651 51471 38694 27388 36154 11693
11258 11693 5744 45148 39216 40890 70296 60249 63703 69699 20752 -28663 12685 14213 3745
11245 3745 23383 68603 19173 23768 52465 30077 -16388 -49116 -69871 -66524 -44636 -27987
11233 -27987 -25893 -35468 -47121 -57365 -79119 -35354 -105831 -70057 -16148 50728 54823 -25963
11221 -25963 -57416 -37439 -106 39073 7805 -24932 -47930 -16823 23174 -6106 -24959 8569
11209 8569 7070 979 -15549 -39942 -35797 -36202 -34325 -39311 -24522 -19724 -2862 -3840 -33796 -51859
11195 -51859 -63826 -62711 -53399 -23074 15527 41979 -14320 -53632 -64947 -87665 -78622 -84131
$$ packed form
11283a273R051l7944k4403k9399J2552K1089P636r794n5609M904L0927J5928J0567
11270d5768K3351P617K1491M6271L3674r887j1098j4180j2777j1306Q766k4461
11258A1693n949L9404n932J674K9406j0047L454N996m8947m9415M1348J528j0468
11245C745J9638M5220m9430M595K8697k2388m6465l2728k0755L347K1888J6649
11233b7987K094r575j1653j0244k1754M3765p0477L5774N3909O6876M095q0786
11221b5963l1453J9977L7333L9179l1268l2737k2998L1107L9997k9280j8853L3528
11209H569j499o091j6528k4393M145m05J877m986J4789M798J6862r78k9956j8063
11195e1859j1967J115R312L0325L8601K6452n6299l9312j1315k2718R043n509
$$ plain form
11183 -84131 -93495 -89060 -63200 -42616 9597 8568 -42857 -92836 -106322 -76232 -50480 -15757
11171 -15757 39577 47128 48051 37310 -2745 1926 39210 38205 22977 -730 -34261 -24156 -2404
11158 -2404 -29864 -25235 -24039 -28319 -85729 -85674 -55732 -7483 1301 -5125 -12895 9535 62551 87467
11144 87467 53352 6936 22889 37749 20729 -3191 -45246 -52643 -11536 -16082 -37889 -60624
11132 -60624 -35708 -36852 -33733 -33151 -24818 -28294 -45886 -56638 -31439 -1034 36506 -7187 -37676
11119 -37676 -2634 -947 -3584 -2581 -35728 -22506 3045 43402 81316 100019 111811 147820
11107 147820 151466 127370 131062 130401 95470 134553 139257 98281 50106 31274 17776 -14086
11095 -14086 -21653 -13385 6712 -15669 -29783 -46152 -40551 -30867 6818 2518 42607 -2480 -27626
$$ packed form
11183h4131r364M435K5860K0584N2213j029n1425m9979j3486L0090K5752L4723
11171a5757N5334P551R23j0741m0055M671L7284j005j5228k3707l3531J0105K1752
11158b404k7460M629J196m280n7410N5K9942M8249Q784o426p770K2430N3016K4916
11144H7467l4115m6416J5953J4860j7020k3920m2055p397M1107m546k1807k2735
11132f0624K4916j144L119N82Q333l476j7592j0752K5199L0405L7540m3693l0489
11119c7676L5042J687k637J003l3147J3222K5551M0357L7914J8703J1792L6009
11107A47820L646k4096L692o61l4931L9083M704m0976m8175j8832j3498l1862
11095a4086p567Q268K0097k2381j4114j6369N601R684L7685m300M0089m5087k5146
$$ plain form
11082 -27626 -26585 25813 28184 5902 -48595 -25124 4355 -3537 -11483 -33699 -47672 -33796
11070 -33796 -33697 -28431 -39790 -36531 -4133 21326 17500 28650 39208 45156 55224 19655 -44656
11057 -44656 -59624 -37548 -32098 -10900 -23956 -23465 -1393 -45029 -54658 -74414 -100076 -91204 -55426
11044 -55426 -21242 -23498 -37477 -37308 -18470 7532 9813 -73099 -87841 -84296 -73632 -53797 -47734
11031 -47734 -38645 -6772 12568 18104 1176 -26477 -38326 -16623 39081 65140 49713 35762
11019 35762 -4067 -23115 -42491 -40122 -45086 -40853 -42881 17341 6488 -23418 -34900 -11229
11007 -11229 57803 54277 -722 -339 40707 54404 53404 -464 -29267 -70580 -56605 -18551
10995 -18551 -2533 26960 10600 -14455 -13462 -11244 -31685 -48455 -55896 -32464 7727 43937
$$ packed form
11082b7626J041N2398K371k2282n4497K3471K9479p892p946k2216j3973J3876
11070c3796R9N266j1359L259L2398K5459l826J1150J0558N948J0068l5569o4311
11057d4656j4968K2076N450K1198j3056M91K2072m3636r629j9756k5662Q872L5778
11044e5426L4184k256j3979J69J8838K6002K281q2912j4742L545J0664J9835O063
11031d7734R089L1873J9340N536j6928k7653j1849K1703N5704K6059j5427j3951
11019C5762l9829j9048j9376K369m964M233k028O0222j0853k9906j1482K3671
11007a1229O9032l526n4999L83M1046J3697j000n3868k8803m1313J3975L8054
10995a8551J6018K9493j6360k5055R93K218k0441j6770p441K3432M0191L6210
$$ plain form
10983 43937 31480 677 -27444 -37932 -36186 -23170 -28751 -3592 35695 36237 -27252 -58684
10971 -58684 -55416 -49780 -53996 -40341 6468 2957 -22148 -74349 -48152 15131 35496 -529
10959 -529 -26803 -73816 -116741 -15941 23180 -1235 -31472 -54705 -75620 -98217 -73366 -51331
10947 -51331 -42193 -10075 -27914 -18820 17928 845 14967 -17305 -35623 -19571 -5502 -21608
10935 -21608 -45277 -65642 -52915 -31800 -10639 6926 -9745 -7266 16058 36029 81524 92584
10923 92584 96482 54399 -34756 -56476 -70694 -45067 -5137 17046 5290 -4587 -26722 -28549
10911 -28549 -20387 -25653 -32408 -47338 -42008 1022 48339 36433 29429 37244 18672 43783 19923
10898 19923 22206 -4748 -25579 26577 -19346 -52834 -65850 -94027 -63927 -3248 16688 28361
$$ packed form
10983D3937j2457l0803k8121j0488J746J3016n581K5159L9287N42o3489l1432
10971e8684L268N636m216J3655M6809l511k5105n2201K6197O3283K0365l6025
10959e29k6274m7013m2925J00800L9121k4415l0237k3233k0915k2597K4851K2035
10947e1331R138L2118j7839R094L6748j7083J4122l2272j8318J6052J4069j6106
10935b1608k3669k0365J2727K1115K1161J7565j6671K479K3324J9971M5495J1060
10923I2584L898m2083q9155k1720j4218K5627L9930K2183j1756r877k2135j827
10911b8549Q162n266o755j4930N330M3030M7317j1906p004P815j8572K5111k3860
10898A9923K283k6954k0831N2156m5923l3488j3016k8177L0100O0679J9936J1673
$$ plain form
10886 28361 -587 -30119 -45997 -39547 -37678 -71349 -54700 -21295 24493 20892 -50249 -63351
10874 -63351 7359 -2691 -17070 27507 31347 42013 39977 34115 19988 33867 35613 1790
10862 1790 5200 -26442 -79076 -102563 -80588 -89768 -24105 38267 13827 4620 -7484 12649
10850 12649 27957 -21261 -81544 -86899 -99706 -94347 -82961 -16784 -21140 -16907 22657 49086
10838 49086 2054 -913 -1843 -9584 942 -22071 -23417 -7565 -29195 -40646 -13446 413 -11352
10825 -11352 -26198 -40723 -19654 4549 1591 5531 13761 29465 53627 44919 -11880 -49688
10813 -49688 -25182 -12025 -23086 7055 32886 32125 33949 -2642 -22910 11627 -8102 -464
10801 -464 -68917 -130892 -81606 -54585 -40245 -54788 -42901 -29703 -10992 -5420 -33050 -38216
$$ packed form
10886B8361k8948k9532j5878O450J869l3671J6649L3405M5788l601p1141j3102
10874f3351P0710j0050j4379M4577L840J0666k036n862j4127J3879J746l3823
10862A790L410l1642n2634k3487K1975r180O5663O2372k4440r207j2104K0133
10850A2649J5308m9218o0283n355j2807N359J1386O6177m356M233L9564K6429
10838D9086m7032k967r30p741J0526k3013j346J5852k1630j1451K7200J3859j1765
10825a1352j4846j4525K1069K4203k958L940Q230J5704K4162q708n6799l7808
10813d9688K4506J3157j1061L0141K5831p61J824l6591k0268L4537j9729P638
10801d64o8453o1975M9286K7021J4340j4543J1887J3198J8711N572k7630n166
$$ plain form
10789 -38216 -49844 -27022 -23420 -43417 -21439 -1192 16665 -5088 -30465 -47842 -73797 -50829
10777 -50829 -87353 -96408 -59925 -43890 -32417 -54297 -38906 24778 3644 -6137 -34378 -24150
10765 -24150 17865 2680 -31118 -78375 -52624 -32652 -58663 -55060 -38705 -73283 -114898 -144290
10753 -144290 -137695 -51528 -18378 -13722 4573 29525 52196 22783 -41238 -34200 -24508 -31184
10741 -31184 -19995 -11293 -43 -12658 -8732 14254 14950 -10665 -5303 -10597 9937 58209 96065
10728 96065 52171 -30178 -16700 -7338 -736 -14135 -21285 -45844 -80100 -65173 -68261 -58734 -30035
10715 -30035 -9380 49250 54782 29318 43302 32629 30717 49081 40668 13116 -15910 -8582
10703 -8582 -5016 -54347 -45713 -59431 -27690 -2205 13250 -3164 -51187 -68451 -72250 -70634 -50231
$$ packed form
10789c8216j1628K2822L602j9997K1978K0247J7857k1753k5377j7377k5955K2968
10777e0829l6524r055L6483J6035J1473k1880J5391O3684k1134r781k8241J0228
10765b4150M2015j5185l3798m7257K5751J9972k6011L603J6355l4578m1615k9392
10753a44290O595Q6167L3150M656J8295K4952K2671k9413o4021P038R692o676
10741c1184J1189Q702J1250j2615L926K2986O96k5615N362n294K0534M8272L7856
10728I6065m3894q2349J3478R362O602j3399p150k4559l4256J4927l088R527K8699
10715c0035K0655N8630N532k5464J3984j0673j912J8364q413k7552k9026P328
10703h582L566m9331Q634j3718L1741K5485J5455j6414m8023j7264l799J616K0403
$$ plain form
10690 -50231 -44571 -16588 24160 14422 43423 43861 30299 -2127 12696 49261 46832 44104 14465
10677 14465 -16446 -59685 -69204 -27023 5687 -24535 -61786 -71086 -62242 6128 39709 9609
10665 9609 35837 47060 47800 66107 31048 61181 107869 158501 131064 71544 61624 16823
10653 16823 -579 -50676 -80462 -117950 -148736 -131595 -89543 -22337 -16535 4276 49338 40669
10641 40669 -13445 -74783 -37619 593 -17985 -3656 -46197 -38343 -37568 -35407 -35249 -49862 -964
10628 -964 18612 35463 -6387 -20687 -48010 -35200 -65677 -86458 -58619 -61164 -52612 -69458
10616 -69458 -95562 -108144 -48705 -14705 16788 33851 24139 39242 58119 71097 41597 7819
10604 7819 -34331 -59840 -20731 7408 -713 1560 433 25602 26889 -18943 -19706 -16722 -5910
$$ packed form
10690e0231N660K7983M0748r738K9001M38j3562l2426J4823L6565k429k728k9639
10677A4465l0911m3239r519M2181L2710l0222l7251r300Q844O8370L3581l0100
10665I609K6228J1223P40J8307l5059L0133M6688N0632k7437n9520r920m4801
10653A6823j7402n0097k9786l7488l0786J7141M2052O7206N802K0811M5062q669
10641D0669n4114o1338L7164L8212j8578J4329m2541P854P75K161J58j4613M8898
10628i64J9576J6851m1850j4300k7323J2810l0477k0781K7839k545Q552j6846
10616f9458k6104j2582N9439L4000L1493J7063r712J5103J8877J2978k9500l3778
10604G819m2150k5509L9109K8139q121K273j127K5169J287m5832p63K984J0812
$$ plain form
10591 -5910 -2199 478 20420 -5378 -13634 -69381 -94517 -67339 -30961 551 25873 41148
10579 41148 15748 -48475 -90342 -85336 -68385 -59166 -57963 -27574 10325 62051 76469 42942
10567 42942 12246 -4103 -49120 -113588 -86578 -91524 -102962 -60246 -10597 475 3473 -1510
10555 -1510 -41233 -69750 -37433 -24781 23661 1099 -68223 -54258 2218 18784 -464 24191
10543 24191 31504 33664 48404 43675 19944 -19059 -48162 -43441 -21420 -13041 2730 21378 4880
10530 4880 8437 -15537 -9311 -16941 -56596 -62842 -95079 -100692 -95064 -79511 -36473 -30316 -35499
10517 -35499 -15151 -38448 -37499 -19768 -17986 -4248 16863 1701 -17787 -7884 1694 -13427 4304
10504 4304 -20191 -36044 -7050 -9931 631 -27310 -19186 -59976 -19379 41100 106948 70148
$$ packed form
10591e910L711K677J9942k5798q256n5747k5136K7178L6378L1512K5322J5275
10579D1148k5400o4223m1867N006J6951R219J203L0389L7899N1726J4418l3527
10567D2942l0696j6349m5017o4468K7010m946j1438M2716M9649J1072K998m983
10555a510l9723k8517L2317J2652M8442k2562o9322J3965N6476J6566j9248K4655
10543B4191P313K160J4740m729k3731l9003k9103M721K2021Q379J5771J8648j6498
10530D880L557k3974O226p630l9655o246l2237n613N628J5553M3038O157n183
10517c5499K0348k3297R49J7731J782J3738K1111j5162j9488R903R578j5121J7731
10504D304k4495j5853K8994k881J0562k7941Q124m0790M0597O0479O5848l6800
$$ plain form
10492 70148 71084 80585 59747 62208 63196 41729 23251 -14982 -28859 12110 42318 10342 28608
10479 28608 55534 79956 62105 30633 11695 -47520 -61953 -13461 -20126 -52587 -53941 -14685
10467 -14685 8801 -907 -2855 20637 21399 -26604 -1814 4626 7194 -6861 -21344 -30976 -49531
10454 -49531 -17078 65042 121338 145035 100859 66921 665 -60243 -36312 -47835 -18571 -7692
10442 -7692 -17749 18764 20193 15999 64906 67426 38597 95567 103509 92095 59417 16015 31713
10429 31713 74330 61387 23807 17779 26323 33474 34504 3387 -16267 -11263 7460 11698 9623
10416 9623 49643 68308 88872 95227 84518 75780 13215 10450 10313 -6329 -15105 -1654 31592
10403 31592 -9546 -26374 -19330 -62268 -52568 13588 27749 20149 19211 5026 -12111 -20508 -10945
$$ packed form
10492G0148R36R501k0838K461R88k1467j8478l8233j3877M0969L0208l1976J8266
10479B8608K6926K4422j7851l1472j8938n9215j4433M8492o665l2461j354L9256
10467a4685K3486r708j948K3492P62m8003K4790O440K568j4055j4483r632j8555
10454d9531L2453Q2120N6296K3697m4176l3938o6256o0908K3931j1523K9264J0879
10442g692j0057L6513J429m194M8907K520k8829N6970P942j1414l2678m3402J5698
10429C1713M2617j2943l7580o028Q544P151J030l1117j9654N004J8723M238k075
10416I623M0020J8665K0564O355j0709q738o2565k765j37j6642q776J3451L3246
10403C1592m1138j6828P044m2938R700O6156J4161p600r38j4185j7137q397R563
$$ plain form
10390 -10945 -6692 3761 1711 -20139 -347 22921 58025 66773 19652 8798 782 8546 2054
10377 2054 -14769 26688 103278 95133 94996 124439 182716 239506 256197 252654 262565 290134 314586
10364 314586 321745 289142 259249 241292 229830 207051 186197 127523 98292 89436 21829 26398
10352 26398 369 12658 19733 10531 33961 48132 66526 44058 -31105 -32843 -12272 4982
10340 4982 11201 -32163 -40766 -38850 -25412 -34126 -40958 -53511 -23266 -33772 -22895 28735 31861
10327 31861 1761 -22901 -73601 -76981 -29210 -38317 -18558 10987 1112 15712 45460 55484
10315 55484 58313 97696 129630 110399 95695 120417 96914 58346 81154 89589 67582 19805
10303 19805 -3925 8534 -5716 24929 39246 29417 24675 43457 47873 40121 46106 41827 -1220
$$ packed form
10390a0945M253J0453k050k1850J9792K3268L5104Q748m7121j0854q016P764o492
10377B054j6823M1457P6590q145j37K9443N8277N6790J6691l543R911K7569K4452
10364C14586P159l2603k9893j7957j1462k2779k0854n8674k9231q856o7607M569
10352B6398k6029J2289P075r202K3430J4171J8394k2468p5163j738K0571J7254
10340D982O219m3364q603J916J3438q714o832j2553L0245j0506J0877N1630L126
10327C1861l0100k4662n0700l380M7771r107J9759K9545r875J4600K9748J0024
10315E5484K829L9383L1934j9231j4704K4722k3503l8568K2808Q435k2007m7777
10303A9805k3730J2459j4250L0645J4317r829m742J8782M416p752N985m279m3047
$$ plain form
10290 -1220 4029 -58981 -52005 -11155 38213 42768 22218 12184 -29102 -38804 -60608 -52077 -60456
10277 -60456 -33009 -10026 9518 14360 36323 60915 16199 -1805 5834 5729 9659 46073 24568
10264 24568 20043 9393 -15466 -65904 -47226 -32750 4905 -11165 -4437 -54314 -88301 -58428
10252 -58428 -42382 -38917 -62351 -43227 -7034 -79508 -99023 -29503 14216 6854 -13713 20041
10240 20041 27995 2474 27450 22361 4285 -45539 -66524 -21634 1809 14035 28539 30347
10228 30347 38383 25064 -17721 -21301 -13861 -9990 -75301 -131718 -110642 -101378 -104119 -81690 -6623
10215 -6623 26628 34702 -17023 -74767 -76653 10261 22973 61784 48163 -3588 22075 45293
10203 45293 305 -42649 -36697 -12062 -9112 954 -29859 -16758 -33791 -65917 -103035 -120816
$$ packed form
10290a220N249o3010O976M0850M9368M555k0550j0034m1286r702k1804Q531q379
10277f0456K7447K2983J9544M842K1963K4592m4716j8004P639j05L930L6414k1505
10264B4568m525j0650k4859n0438J8678J4476L7655j6070O728m9877l3987K9873
10252e8428J6046L465k3434J9124L6193p2474j9515O9520M3719p362k0567L3754
10240B0041P954k5521K4976n089j8076m9824k0985M4890K3443J2226J4504J808
10228C0347Q036j3319m2785l580P440L871o5311n6417K1076R264k741K2429P5067
10215f623L3251Q074n1725n7744j886Q6914J2712L8811j3621n1751K5663K3218
10203D5293m4988m2954N952K4635K950J0066l0813J3101j7033l2126l7118j7781
$$ plain form
10191 -120816 -105015 -33436 -21525 -12905 -37928 -82986 -33055 -5376 27002 -8733 -39820 -22274
10179 -22274 -10561 31373 45249 81703 113150 117193 93377 39263 35694 36521 52681 63266
10167 63266 61206 69499 75186 40428 -2339 -11843 51484 55732 4194 -14728 -21737 -28813 -8639
10154 -8639 8444 -15526 -33130 -27989 3633 -35729 -30267 23883 91970 93717 81372 47664
10142 47664 36347 59086 75374 17912 2833 -11773 29395 -881 -67371 -95496 -89284 -119050
10130 -119050 -68741 -30803 -5160 -7682 -14543 5412 -17704 -4206 -31717 -77559 -55804 11389
10118 11389 41666 39701 38154 40413 23489 -3380 -2109 2359 -6428 8257 57840 58875 45113
10105 45113 47847 30474 45064 28036 24649 -5253 -23592 -16141 -20158 -22497 -70340 -84225 14651
$$ packed form
10191a20816J5801P1579J1911Q620k5023m5058M9931K7679L2378l5735l1087J7546
10179b2274J1713M1934J3876L6454L1447M043k3816n4114l569Q27J6160J0585
10167F3266k060Q293N687l4758m2767r504O3327M248n1538j8922p009p076K0174
10154h639J7083k3970j7604N141L1622l9362N462N4150O8087J747j2345l3708
10142D7664j1317K2739J6288n7462j5079j4606M1168l0276o6490k8125O212k9766
10130a19050N0309L7938K5643k522o861J9955k3116J3498k7511m5842K1755O7193
10118A1389L0277j965j547K259j6924k6869J271M468q787J4685M9583J035j3762
10105D5113K734j7373J4590j7028l387k9902j8339P451m017k339m7843j3885R8876
$$ plain form
10092 14651 107686 58879 5307 -30614 -50775 -50982 -42340 -40219 -35572 -36926 -59091 -59734 9146
10079 9146 49750 24127 -23123 -52693 -43887 -68136 -60031 -9262 50543 87329 127617 82181
10067 82181 46073 27467 51338 82048 87335 26453 -11365 -12358 -8206 -18708 -23698 -24446 -30510
10054 -30510 -14903 -5080 29280 31655 31171 23051 18188 33222 -2039 -40906 -59990 -53997 -23296
10041 -23296 -23385 15411 3501 -35495 -48868 -44110 -53265 -81374 -73973 -45651 -10732 -7017 -45213
10028 -45213 -87049 -60316 -32726 -45925 -15418 -90 43175 81150 71547 68618 7513 1231
10016 1231 2946 -23419 -46297 -5188 63156 110903 98955 89662 10522 -64523 -51473 -38990
10004 -38990 13995 25709 18247 40980 39071 39151 54995 99147 87658 66605 65038 24801 13112
$$ packed form
10092A4651R3035m8807n3572l5921k0161k07Q642K121M647j354k2165o43O8880
10079I146M0604k5623m7250k9570Q806k4249Q105N0769N9805L6786M0288m5436
10067H2181l6108j8606K3871L0710N287o0882l7818r93M152j0502m990p48o064
10054c0510J5607R823L4360K375m84q120m863J5034l5261l8867j9084N993L0701
10041b3296q9L8796j1910l8996j3373M758r155k8109P401K8322L4919L715l8196
10028d5213m1836K6733K7590j3199L0507J5328M3265L7975r603k929o1105o282
10016A231J715k6365k2878M1109O8344M7747j1948r293p9140p5045J3050J2483
10004c8990N2985J1714p462K2733j909Q0J5844M4152j1489k1053j567m0237j1689
$$ plain form
9991 13112 44447 92884 15916 15637 88503 63388 46447 71129 80211 80424 77518 52973 81086
9978 81086 87933 31020 7356 43286 54949 67256 91468 58844 35282 60247 22256 -8433
9966 -8433 31658 40947 -23581 -11 77455 44058 35181 69570 109206 140823 98402 63460
9954 63460 72365 58976 69429 107927 152056 128937 51110 81143 111700 105468 82724 74812
9942 74812 72984 77322 76022 39215 11199 17547 15113 -23009 -35308 -430 8809 44797 20238
9929 20238 6777 -11127 -14025 -48703 -71909 -36649 -1283 36380 64461 56523 60527 51965 43745
9916 43745 45470 55915 96137 95915 70171 54729 73937 114804 131241 129941 117401 97883 30886
9903 30886 14215 18890 64522 54647 43737 50431 31359 1212 -36506 -35423 -32034 -50039 14232
$$ packed form
9991A3112L1335M8437p6968k79P2866k5115j6941K4682R082K13k906k4545K8113
9978H1086O847n6913k3664L5930J1663J2307K4212l2624k3562K4965l7991l0689
9966h433M0091R289o4528K3570P7466l3397q877L4389L9636L1617m2421l4942
9954F3460Q905j3389J0453L8498M4129k3119p7827L0033L0557o232k2744p912
9942G4812j828M338j300l6807k8016O348k434l8122j2299L4878R239L5988k4559
9929B0238j3461j7904k898l4678k3206L5260L5366L7663K8081p938M004q562q220
9916D3745J725J0445M0222k22k5744j5442J9208M0867J6437j300j2540j9518o6997
9903C0886j6671M675M5632r875j0910O694j9072l0147l7718J083L389j8005O4271
$$ plain form
9890 14232 91723 120883 144877 130700 87550 63800 72495 112371 131037 137850 82004 71995
9878 71995 34868 6467 -584 25795 45814 129595 143675 100364 110251 149966 224765 282723
9866 282723 381158 534625 733425 938753 1120049 1195087 1197647 1157375 969409 719122 466916
9855 466916 316599 247364 238253 224733 172195 88413 42670 48194 67136 108084 147743 104986
9843 104986 14730 -36098 -7589 11960 31571 84535 116740 107676 93399 105287 65283 819
9831 819 13115 15963 19330 46720 60045 65338 64366 58494 40489 14829 44175 68773 47223
9818 47223 49124 83715 116165 97072 80084 58082 28170 31777 79801 155042 150582 113260
9806 113260 107315 118579 132531 159381 129108 100422 85103 74170 53220 5393 -7062 -20071
$$ packed form
9890A4232P7491K9160K3994j4177m3150k3750Q695L9876J8666O813n5846j0009
9878G1995l7127k8401p051K6379K0019Q3781J4080m3311R887L9715P4799N7958
9866B82723R8435J53467J98800K05328J81296P5038K560m0272j87966k50287k52206
9855D66916j50317o9235r111j3520n2538q3782m5743N524J8942M0948L9659m2757
9843A04986r0256n0828K8509J9549J9611N2964L2205r064j4277J1888m0004o4464
9831H19J2296K848L367K7390J3325N293r72n872j8005k5660K9346K4598k1550
9818D7223J901L4591L2450j9093j6988k2002k9912L607M8024P5241m460l7322
9806A13260n945J1264J3952K6850l0273k8686j5319j0933k0950m7827j2455j3009
$$ plain form
9794 -20071 -8431 33157 69939 62259 74606 103284 95457 113478 66164 59608 101540 99819 108165
9781 108165 124907 125642 149615 91496 76772 104236 101493 65273 10455 51893 108788 106790
9769 106790 90051 47457 61504 112438 116869 108960 143287 114524 46429 81095 126046 115331
9757 115331 77129 93623 104086 96177 93774 76948 110223 134563 90153 70580 78761 154932
9745 154932 131733 135141 125995 134465 127694 93459 101277 43658 33197 51658 50915 118577 119532
9732 119532 156066 148534 121519 116717 125611 109596 106715 96268 14426 39592 104331 122562
9720 122562 111552 63798 68876 80113 114523 105899 88645 85330 95404 94840 79591 52041 47424
9707 47424 52796 92783 95334 55551 22731 20535 70402 66549 52379 68376 87202 127262 142993
$$ packed form
9794b0071J1640M1588L6782p680J2347K8678p827J8021m7314o556M1932j721Q346
9781A08165J6742P35K3973n8119j4724K7464k743l6220n4818M1438N6895j998
9769A06790j6739m2594J4047N0934M431p909L4327k8763o8095L4666M4951j0715
9757A15331l8202J6494J0463p909k403j6826L3275K4340m4410j9573Q181P6171
9745A54932k3199L408r146Q470o771l4235P818n7619j0461J8461p43O7662R55
9732A19532L6534p532k7015m802Q894j6015k881j0447q1842K5166O4739J8231
9720A22562j1010m7754N078J1237L4410q624j7254l315J0074n64j5249k7550m617
9707D7424N372L9987K551l9783l2820k196M9867l853j4170J5997J8826M0060J5731
$$ plain form
9694 142993 122543 91492 67789 117100 111283 97203 131956 135130 107741 122904 152428 150264
9682 150264 112714 66960 66915 71407 125527 84176 77801 48904 60100 96206 159051 159940 175681
9669 175681 115786 100355 146137 163090 163405 160268 179534 170085 119005 174022 136611 166356
9657 166356 192003 163817 92868 46391 73263 69973 98627 140186 137632 113963 100356 136903
9645 136903 122047 68619 67246 71330 37977 42662 35999 64657 117678 132377 142848 141849 140201
9632 140201 153455 204055 180232 115800 82159 112398 138276 145102 188132 211309 166127 164538
9620 164538 233948 265925 267286 212755 218221 251442 253879 238477 233270 249713 325221 370882
9608 370882 381581 351935 336116 329980 357518 334606 252217 255013 297826 301852 343977 354462
$$ packed form
9694A42993k0450l1051k3703M9311n817j4080L4753L174k7389J5163K9524k164
9682A50264l7550m5754m5M492N4120m1351o375k8897J1196L6106O2845Q89J5741
9669A75681n9895j5431M5782J6953L15l137J9266r449n1080N5017l7411K9745
9657A66356K5647k8186p0949m6477K6872l290K8654M1559k554k3669j3607L6547
9645A36903j4856n3428j373M084l3353M685o663K8658N3021J4699J0471r99j648
9632A40201J3254N0600k3823o4432l3641L0239K5878O826M3030K3177m5182j589
9620A64538O9410L1977J361n4531N466L3221K437j5402n207J6443P5508M5661
9608C70882J0699k9646j5819o136K7538k2912q2389K796M2813M026M2125J0485
$$ plain form
9596 354462 374191 400304 380114 365703 323164 326028 348396 411786 490346 475934 445468 465964
9584 465964 465903 486864 491714 492836 485883 497665 537892 500716 462219 486635 530818 571702 561760
9571 561760 580039 619030 685592 747016 764741 762392 792386 817550 849129 834997 816489 885060
9559 885060 946663 971141 1063734 1142229 1214637 1242164 1301175 1415525 1471801 1527021 1612867
9548 1612867 1696537 1816159 1893022 2024712 2168385 2356883 2593024 2822158 3065639 3280707
9538 3280707 3525615 3824826 4156187 4533490 4953749 5388956 5866850 6404477 7007220 7656932
9528 7656932 8410788 9183149 10064465 11018301 12031723 13156696 14302583 15443700 16548396
9519 16548396 17650668 18784034 19826938 20773739 21579680 22214721 22719589 23085023 23303095
$$ packed form
9596C54462J9729K6113k0190j4411m2539K864K2368O3390P8560j4412l0466K0496
9584D65964o1K0961M850J122o953J1782M0227l7176l8497K4416M4183M0884r942
9571E61760J8279L8991O6562O1424J7725k349K9994K5164L1579j4132j8508O8571
9559H85060O1603K4478R2593P8495P2408K7527N9011J14350N6276N5220Q5846
9548A612867Q3670J19622P6863J31690J43673J88498K36141K29134K43481K15068
9538C280707K44908K99211L31361L77303M20259M35207M77894N37627O02743O49712
9528G656932P53856P72361Q81316R53836J013422J124973J145887J141117J104696
9519A6548396J102272J133366J042904R46801Q05941O35041N04868L65434K18072
$$ plain form
9510 23303095 23399325 23420279 23335932 23218435 23133726 23018503 22938239 22894641 22927493 23055402 23262300
9499 23262300 23578509 24036828 24594301 25267146 26169476 27140738 28320262 29739054 31307745
9490 31307745 33126256 35184389 37458161 39982706 42689302 45505077 48337874 51155508
9482 51155508 53727706 55915001 57509424 58342088 58398320 57682488 56251663 54258031 51830225
9473 51830225 49095705 46232460 43354024 40557875 37926705 35552167 33434342 31547980
9465 31547980 29805206 28295978 26987207 25826546 24876040 24154752 23566475 23093383 22730681
9456 22730681 22416037 22236922 22170613 22100711 22107390 22182182 22192806 22275683 22368050 22409582 22445716
9445 22445716 22299108 22044769 21728430 21263274 20635480 19874275 19015815 18061851 17121838
$$ packed form
9510B3303095R6230K0954q4347j17497q4709j15223q0264m3598L2852J27909K06898
9499B3262300L16209M58319N57473O72845R02330R71262J179524J418792J568691
9490C1307745J818511K058133K273772K524545K706596K815775K832797K817634
9482E1155508K572198K187295J594423Q32664N6232p15832j430825j993632k427806
9473E1830225k734520k863245k878436k796149k631170k374538k117825j886362
9465C1547980j742774j509228j308771j160661r50506p21288n88277m73092l62702
9456B2730681l14644j79115o6309o9902O679P4792J0624Q2877R2367M1532L6134
9445B2445716j46608k54339l16339m65156o27794p61205q58460r53964r40013
$$ plain form
9436 17121838 16054955 14952787 13934627 12991760 11994576 11055034 10175741 9373355 8667151
9427 8667151 8011181 7356621 6821996 6322418 5872777 5440890 5092066 4763711 4425634 4133744
9417 4133744 3924016 3682009 3491560 3312614 3116295 2966522 2822151 2684694 2554169 2432582
9407 2432582 2301508 2204921 2061173 1933333 1904859 1853338 1782224 1706135 1641373 1571656 1514499
9396 1514499 1474678 1447600 1415276 1310787 1280453 1247238 1216129 1174199 1151557 1061857 1010590
9385 1010590 939165 928599 946150 959934 942662 981558 984917 980260 957089 883373 812242 818983
9373 818983 790040 738022 723667 731347 694893 718103 685741 644286 662179 637121 633241 635948
9361 635948 596803 599759 604473 628393 585698 535585 547670 539387 507782 494636 492650 521152
$$ packed form
9436A7121838j066883j102168j018160r42867r97184r39542q79293q02386p06204
9427H667151o55970o54560n34625m99578m49641m31887l48824l28355l38077k91890
9417D133744k09728k42007j90449j78946j96319j49773j44371j37457j30525j21587
9407B432582j31074r6587j43748j27840k8474n1521p1114p6089o4762o9717n7157
9396A514499l9821k7078l2324j04489l0334l3215l1109m1930k2642q9700n1267
9385A010590p1425j0566J7551J3784j7272L8896L359m657k3171p3716p1131O741
9373H18983k8943n2018j4355P680l6454K3210l2362m1455J7893k5058l880K707
9361F35948l9145K956M714K3920m2695n0113J2085q283l1605j3146j986K8502
$$ plain form
9349 521152 512599 535161 548782 538534 532903 507857 477461 435041 370254 391472 388174 369622
9337 369622 400566 436602 387450 346035 309083 341569 383284 423537 431318 407923 298522 269048
9325 269048 335210 414208 378564 384518 367507 317874 249407 238449 247416 241685 238376 286569
9313 286569 309406 294562 264806 236090 204178 244875 272285 241382 243898 243413 268066 248484
9301 248484 217914 286451 368238 455019 494560 430895 390203 391407 430329 408193 379367 340325
9289 340325 350947 333498 345704 350084 379060 389122 369314 399052 398490 413386 441688 461350
9277 461350 472099 474225 504895 485808 457095 438863 397503 359509 371416 428961 412528 406393
9265 406393 416514 427778 538052 657627 717565 749053 833663 826298 794671 740772 663169
$$ packed form
9349E21152q553K2562J3621j0248n631k5046l0396m2420o4787K1218l298j8552
9337C69622L0944L6036m9152m1415l6952L2486M1715M0253P781k3395j09401k9474
9325B69048O6162P8998l5644N954j7011m9633o8467j0958Q967n731l309M8193
9313B86569K2837j4844k9756k8716l1912M0697K7410l0903K516m85K4653j9582
9301B48484l0570O8537Q1787Q6781L9541o3665m0692J204L8922k2136k8826l9042
9289C40325J0622j7449J2206M380K8976J0062j9808K9738n62J4896K8302J9662
9277D61350J0749K126L0670j9087k8713j8232m1360l7994J1907N7545j6433o135
9265D06393J0121J1264J10274J19575N9938L1488Q4610p365l1627n3899p7603
$$ plain form
9254 663169 594103 463907 403364 455860 502433 493717 483843 484099 498819 527963 513365 544275
9242 544275 551977 521295 511091 492653 515056 518278 512981 553607 509235 447343 491426 519319
9230 519319 493395 469043 512445 550525 564713 543977 546635 651231 682985 735496 736639 706028
9218 706028 698149 700266 686595 659433 649150 616507 633393 662791 691597 727047 778560 839568
9206 839568 848643 822549 853070 874917 958428 1100982 1246042 1361007 1447358 1568797 1731421
9195 1731421 1925346 2118396 2324870 2532652 2756031 3029583 3399341 3823954 4234677 4697119
9185 4697119 5201674 5757983 6254703 6711515 7075112 7375735 7524506 7505345 7325559 7014466
9175 7014466 6619333 6125770 5546457 5011981 4466378 3952232 3516407 3157375 2830261 2468594
$$ packed form
9254F63169o9066j30196o0543N2496M6573q716r874K56J4720K9144j4598L0910
9242E44275P702l0682j0204j8438K2403L222n297M0626m4372o1892M4083K7893
9230E19319k5924k4352M3402L8080J4188k0736K658J04596L1754N2511J143l0611
9218G06028p879K117j3671k7162j0283l2643J6886K9398K8806L5450N1513O1008
9206H39568R075k6094L0521K1847Q3511J42554J45060J14965Q6351J21439J62624
9195A731421J93925J93050K06474K07782K23379K73552L69758M24613M10723M62442
9185D697119N04555N56309M96720M56812L63597L00623J48771j9161j79786l11093
9175G014466l95133m93563n79313n34476n45603n14146m35825l59032l27114l61667
$$ plain form
9165 2468594 2212077 1996869 1806863 1591291 1446181 1356204 1258441 1164616 1088891 967189
9155 967189 912379 887499 802086 765527 770008 649611 608900 535477 488488 469924 467702 419928
9143 419928 386191 407550 399623 373573 364824 335160 305054 265761 236291 246914 267841 268947
9131 268947 298262 289992 234109 238526 244185 203963 157457 157364 145748 178194 176241 157882 150971
9118 150971 144976 93547 128555 163684 144784 176004 186740 126339 94134 68007 37696 105427
9106 105427 123316 130955 105962 167961 184112 141681 169740 200102 184551 140246 121878 133158
9094 133158 136583 96289 59221 40814 103813 102999 71803 84003 80503 114425 127578 127905 91194
9081 91194 72926 108893 99589 66383 67804 38195 65085 77907 106584 99507 60359 41383
$$ packed form
9165B468594k56517k15208j90006k15572j45110q9977r7763r3825p5725j21702
9155I67189n4810k4880q5413l6559M481j20397m0711p3423m6989j8564k222m7774
9143D19928l3737K1359p927k6050q749k9664l0106l9293k9470J0623K0927J106
9131B68947K9315q270n5883M417N659m0222m6506r3j1616L2446j953j8359o911
9118A50971n995n1429L5008L5129j8900L1220J0736o0401l2205k6127l0311O7731
9106A05427J7889P639k4993O1999J6151m2431K8059L0362j5551m4305j8368J1280
9094A33158L425m0294l7068j8407O2999q14l1196J2200l500L3922J3153L27l6711
9081I1194j8268L5967r304l3206J421k9609K6890J2822K8677p077l9148j8976
$$ plain form
9069 41383 76845 97999 37465 3216 61466 91904 78461 70890 29587 42835 36803 35263
9057 35263 19521 48660 57400 63690 73813 60227 55487 -5827 -10349 14488 39981 47831 68479
9044 68479 86811 44661 -20677 -19947 21379 14052 6152 13201 77618 32646 -28438 -37073 -13037
9031 -13037 40707 31665 30679 12014 -21168 -3318 7936 10091 26898 13382 19589 -3824 8640
9018 8640 33147 -4566 33622 95740 90287 15867 -56413 -11600 11482 -11594 26646 27736
9006 27736 90151 140776 102933 29115 12084 10664 15198 8662 75014 60888 54284 34118 5111
8993 5111 -4611 29273 43328 50724 84575 58414 16754 -25759 -4154 -12927 -30005 12005 89603
8980 89603 115155 50239 36101 39525 -22800 -42687 -50307 -1285 50404 -9235 -29763 -7456
$$ packed form
9069D1383L5462K1154o0534l4249N8250L0438j3443p571m1303J3248o032j540
9057C5263j5742K9139Q740O290J0123j3586m740o1314m522K4837K5493P850K0648
9044F8479J8332m2150o5338P30M1326p327p900P049O4417m4972o1084q635K4036
9031a3037N3744r042r86j8665l3182J7850J1254K155J6807j3516O207k3413J2464
9018H640K4507l7713L8188O2118n453p4420p2280M4813K3082k3076L8240J090
9006B7736O2415N0625l7843p3818j7031j420M534o536O6352j4126o604k0166k9007
8993E111r722L3884J4055P396L3851k6161m1660m2513K1605q773j7078M2010P7598
8980H9603K5552o4916j4138L424o2325j9887p620M9022N1689n9639k0528K2307
$$ plain form
8968 -7456 38690 48624 -31538 -66766 -31073 -24004 -24182 24616 79984 89356 89964 85575 1041 -7441
8954 -7441 21911 10948 -14957 -24226 -1314 48851 44877 20983 68682 111019 126593 109561
$$ packed form
8968g456M6146R934q0162l5228L5693P069j78M8798N5368R372O08m389q4534q482
8954g441K9352j0963k5905r269K2912N0165l974k3894M7699M2337J5574j7032
$$ [...]
##END NTUPLES=NMR SPECTRUM
##END=
