##TITLE=Analysis number 323404
Compound Code cc 63902
Book Reference 439/193/24
Project Code adrs
Chemist Name ronp
##JCAMPDX= 6.0         $$ Bruker NMR JCAMP-DX V2.0
##DATA TYPE= NMR SPECTRUM
##DATA CLASS= NTUPLES
##ORIGIN= Bruker BioSpin GmbH
##OWNER= nmr
$$ XWIN-NMR		Version 3.5
$$ Tue Oct 24 12:13:49 2006 GMT Daylight Time (UT+1h)  MAYBRIDGE\nmr@NMR_250MHZ
##.OBSERVE FREQUENCY= 250.131544655141
##.OBSERVE NUCLEUS= ^1H
##.ACQUISITION MODE= SIMULTANEOUS (DQD)
##.ACQUISITION SCHEME= undefined
##.AVERAGES= 16
##.DIGITISER RES= 18
##SPECTROMETER/DATA SYSTEM= dpx250
##.PULSE SEQUENCE= zg30
##.SOLVENT NAME= CDCl3
##.SHIFT REFERENCE= (INTERNAL, CDCl3, 0, 16.4546)
##AUDIT TRAIL= $$ (NUMBER, WHEN, WHO, WHERE, WHAT)
$$ ##TITLE= Audit trail, XWIN-NMR		Version 3.5
$$ ##JCAMPDX= 5.01
$$ ##ORIGIN= Bruker BioSpin GmbH
$$ ##OWNER= nmr
$$ C:\u/data/dgb/nmr/ADRS/1170/pdata/1/auditp.txt
$$ ##AUDIT TRAIL=  $$ (NUMBER, WHEN, WHO, WHERE, WHAT)
(   1,<2006-10-24 12:13:29.97 +100>,<MAYBRIDGE\nmr>,<NMR_250MHZ>,
      <created by zg, POWCHK disabled, PULCHK disabled
       configuration hash MD5:
       49 4B E0 1D 92 C2 6B 37 9F E6 65 BC 52 41 86 1D
       data hash MD5: 64K
       9D 7F 82 AA BE 9D 7F E1 6B E3 C8 C6 47 A9 4C 12>)
(   2,<2006-10-24 12:13:41.00 +100>,<MAYBRIDGE\nmr>,<NMR_250MHZ>,
      <Start of raw data processing
       ef LB = 0.3 FT_mod = 6 PKNL = 1 SI = 32K 
       data hash MD5: 32K
       EC 25 23 87 6A 6D 61 74 B2 84 29 A6 E1 0C 13 5A>)
(   3,<2006-10-24 12:13:42.67 +100>,<MAYBRIDGE\nmr>,<NMR_250MHZ>,
      <apk 
       data hash MD5: 32K
       09 67 BE B2 02 5F F6 21 2C D9 0E 5D 4E 96 C5 61>)
(   4,<2006-10-24 12:13:43.39 +100>,<MAYBRIDGE\nmr>,<NMR_250MHZ>,
      <abs ABSG = 5 
       data hash MD5: 32K
       82 C5 46 BE 8C 71 6C EC A7 77 58 3E 8E 19 E2 8C>)
$$ ##END=
$$ 
$$ hash MD5
$$ 59 63 B7 08 60 2F 7D 08 0D 0E 26 29 DD 4E CC 77
##$RELAX= 
##$RELAX= 
##$RELAX= 
##$RELAX= 
##$RELAX= 
##$RELAX= 
##$RELAX= 
$$ Bruker specific parameters
$$ --------------------------
##$DU= <C:\u>
##$EXPNO= 1170
##$NAME= <ADRS>
##$PROCNO= 1
##$TYPE= <nmr>
##$USER= <dgb>
##$AMP= (0..31)
100 100 100 100 100 100 100 100 100 100 100 100 100 100 100 100 100 100 
100 100 100 100 100 100 100 100 100 100 100 100 100 100 
##$AQSEQ= 0
##$AQ_mod= 3
##$AUNM= <au_zg>
##$AUTOPOS= <23 >
##$BF1= 250.13
##$BF2= 250.13
##$BF3= 250.13
##$BF4= 250.13
##$BF5= 500.13
##$BF6= 500.13
##$BF7= 500.13
##$BF8= 500.13
##$BYTORDA= 1
##$CFDGTYP= 0
##$CFRGTYP= 5
##$CHEMSTR= <none>
##$CNST= (0..31)
1 1 145 1 1 1 1 1 1 1 1 1 1 1 1 1 1 1 1 1 1 1 1 1 1 1 1 1 1 1 1 1 
##$CPDPRG= <>
##$CPDPRG1= <>
##$CPDPRG2= <>
##$CPDPRG3= <>
##$CPDPRG4= <mlev>
##$CPDPRG5= <mlev>
##$CPDPRG6= <mlev>
##$CPDPRG7= <mlev>
##$CPDPRG8= <mlev>
##$CPDPRGB= <>
##$CPDPRGT= <>
##$D= (0..31)
0 1 0 0 0 0 0 0 0 0.06 0 0 0 0 0 0 0.0002 0 0 0 0 0 0 0 0 0 0 0 0 0 0 
0 
##$DATE= 1161688408
##$DBL= (0..7)
120 120 120 120 120 120 120 120 
##$DBP= (0..7)
150 150 150 150 150 150 150 150 
##$DBP07= 0
##$DBPNAM0= <>
##$DBPNAM1= <>
$$ [...]
##$SUBNAM7= <"">
##$SUBNAM8= <"">
##$SUBNAM9= <"">
##$SW= 20.6930455092707
##$SWIBOX= (0..15)
0 0 3 0 0 0 0 0 0 0 0 0 0 0 0 0 
##$SW_h= 5175.983436853
##$TD= 65536
##$TD0= 1
##$TE= 683.16
##$TE2= 300
##$TE3= 300
##$TEG= 300
##$TL= (0..7)
0 120 120 120 120 120 120 120 
##$TP= (0..7)
150 150 150 150 150 150 150 150 
##$TP07= 0
##$TPNAME0= <>
##$TPNAME1= <>
##$TPNAME2= <>
##$TPNAME3= <>
##$TPNAME4= <>
##$TPNAME5= <>
##$TPNAME6= <>
##$TPNAME7= <>
##$TPOAL= (0..7)
0.5 0.5 0.5 0.5 0.5 0.5 0.5 0.5 
##$TPOFFS= (0..7)
0 0 0 0 0 0 0 0 
##$TUNHIN= 0
##$TUNHOUT= 0
##$TUNXOUT= 0
##$USERA1= <user>
##$USERA2= <user>
##$USERA3= <user>
##$USERA4= <user>
##$USERA5= <user>
##$V9= 5
##$VALIST= <valist>
##$VCLIST= <CCCCCCCCCCCCCCC>
##$VD= 0
##$VDLIST= <DDDDDDDDDDDDDDD>
##$VPLIST= <PPPPPPPPPPPPPPP>
##$VTLIST= <TTTTTTTTTTTTTTT>
##$WBST= 1024
##$WBSW= 4
##$XGAIN= (0..3)
0 0 0 0 
##$XL= 0
##$YL= 0
##$YMAX_a= 423163
##$YMIN_a= -419067
##$ZGOPTNS= <>
##$ZL1= 120
##$ZL2= 120
##$ZL3= 120
##$ZL4= 120
##$ABSF1= 16.45462
##$ABSF2= -4.238552
##$ABSG= 5
##$ABSL= 3
##$ALPHA= 0
##$AQORDER= 0
##$ASSFAC= 0
##$ASSFACI= 0
##$ASSFACX= 0
##$ASSWID= 0
##$AUNMP= <proc_1d>
##$AZFE= 0.1
##$AZFW= 0.1
##$BCFW= 0
##$BC_mod= 0
##$BYTORDP= 0
##$COROFFS= 0
##$CY= 12.5
##$DATMOD= 1
##$DC= 0
##$DFILT= <>
##$DTYPP= 0
##$F1P= 14.0000005364418
##$F2P= -0.99999901652339
##$FCOR= 0.5
##$FTSIZE= 32768
##$FT_mod= 6
##$GAMMA= 0
##$GB= 0
##$INTBC= 1
##$INTSCL= 1
##$ISEN= 128
##$LB= 0.3
##$LEV0= 0
##$LPBIN= 0
##$MAXI= 10000
##$MC2= 0
##$MEAN= 0
##$ME_mod= 0
##$MI= 0
##$NCOEF= 0
##$NC_proc= -2
##$NLEV= 6
##$NOISF1= 0
##$NOISF2= 0
##$NSP= 0
##$NTH_PI= 0
##$NZP= 0
##$OFFSET= 16.45462
##$PC= 1
##$PHC0= -46.86954
##$PHC1= 12.36541
##$PH_mod= 1
##$PKNL= yes
##$PPARMOD= 0
##$PSCAL= 4
##$PSIGN= 0
##$REVERSE= no
##$SF= 250.130016851619
##$SI= 32768
##$SIGF1= 0
##$SIGF2= 0
##$SINO= 400
##$SIOLD= 32768
##$SREGLST= <1H.CDCl3>
##$SSB= 0
##$STSI= 32768
##$STSR= 0
##$SW_p= 5175.98343685301
##$SYMM= 0
##$S_DEV= 0
##$TDeff= 65536
##$TDoff= 0
##$TI= <Analysis number 999999
Compound Code 99
Book Reference 9
Project Code 9>
##$TILT= no
##$TM1= 0
##$TM2= 0
##$TOPLEV= 0
##$USERP1= <user>
##$USERP2= <user>
##$USERP3= <user>
##$USERP4= <user>
##$USERP5= <user>
##$WDW= 1
##$XDIM= 32768
##$YMAX_p= 407906163
##$YMIN_p= -121156
$$ End of Bruker specific parameters
$$ ---------------------------------
##NTUPLES= NMR SPECTRUM
##VAR_NAME=  FREQUENCY,     SPECTRUM/REAL,   SPECTRUM/IMAG
##SYMBOL=    X,             R,               I
##VAR_TYPE=  INDEPENDENT,   DEPENDENT,       DEPENDENT
##VAR_FORM=  AFFN,          ASDF,            ASDF
##VAR_DIM=   32768,         32768,           32768
##UNITS=     HZ,            ARBITRARY UNITS, ARBITRARY UNITS
##FACTOR=    0.157963299565203, 1,           1
##FIRST=     4115.794468266, 0,              0
##LAST=      -1060.18896858701, 0,           0
##MIN=       -1060.18896858701, -121156,     0
##MAX=       4115.794468266, 407906163,      0
$$ Real data points
##PAGE= N=1
##DATA TABLE= (X++(R..R)), XYDATA
$$ [...]
18926e923M993j2359j1846j66J3907n323p980K2293N056q582j8592j0250l601
18913c8373L0173J8228K2011j4980P289J0344k6376k1389L3550Q351k4080K9515
18901C4263L4279l581j2999q395L641L9508L8538l2515p0171k9002J5091m259
18889D398P91r485j0616L4910J1531q863k4475k1410K1564p196j1413J4748J8463
18876A2947K1578J6212Q245J6874j6473k6344K2235Q622k8523k3412j7288J3028
18864G701K3321P768K8139J8292o550n12m6689j2576J9128J4076o924j3597J3259
18851D4836k4722o0922L3121J9695j0843K1149J1707K8935J2633j0610k957j3108
18839D8914k3646J1081M6783Q881J3775q267j2356j0784k4914J1768J0013J0353
$$ y = [-5923, -930, -13289, -25135, -25301, -11394, -16717, -24697, -2404, 2652, -5930, -24522, -34772, -38373, -8200, 10028, 32039, 17059, 24348, 34692, 8316, -13073, 20477, 28828, 4748, 34263, 68542, 64961, 51962, 43567, 47208, 86716, 125254, 92739, 22568, -6434, 8657, 4398, 5189, -4296, -14912, 19998, 31529, 22666, -1809, -23219, -1655, -8851, -20264, -5516, 12947, 34525, 50737, 58982, 75856, 59383, 33039, 55274, 63896, 35373, 11961, -5327, 7701, 31022, 38790, 66929, 85221, 78671, 78159, 31470, 18894, 38022, 52098, 45174, 31577, 44836, 20114, -40808, -7687, 12008, 1165, 22314, 34021, 62956, 75589, 64979, 62022, 48914, 25268, 36349, 83132, 92013, 105788, 97521, 85165, 74381, 49467, 61235, 71248, 81601]
18827H1601K8307q70J3075n008m995L2105J0742K3716j4870k9359j3315k882L0931
18814A49178k0004m2486j4652J9506J1347j9l5458k895n78j1012J5407j2218j8822
18801C7294J6603K5351j0814K944J4226j4673j937R836L2488N828l0315n915P537
18788H8453l0661k927k928K3276n999k438J3822L2995r8k0072j9401K6563M0843
18775A41428L9677n241l9112J6214N5183L1780j4838j9719L2322R764l6861m9024
18763A61573j2243O493j8114P173J1617O516R870J1476J1563m3857m2860j8550
18751I0657k0407L4287M632r544L047J7456J0724m288j7090N960k636Q664K2691
18738A44153k6784j362R900K032m7938l6057q131J7129J8167O5568J5178k6589
$$ y = [81601, 109908, 109038, 122113, 117105, 112110, 144215, 154957, 178673, 163803, 134444, 121129, 118247, 149178, 129174, 86688, 72036, 91542, 102889, 102870, 67412, 64517, 63939, 52927, 68334, 56116, 37294, 53897, 79248, 68434, 71378, 85604, 70931, 68994, 78830, 111318, 117146, 86831, 80916, 88453, 57792, 54865, 51937, 75213, 69214, 66776, 80598, 113593, 113495, 93423, 74022, 100585, 141428, 181105, 175864, 136752, 152966, 208149, 239929, 225091, 205372, 237694, 247458, 210597, 161573, 149330, 155823, 137709, 144882, 156499, 163015, 172885, 184361, 195924, 152067, 109207, 90657, 70250, 104537, 109169, 99625, 102672, 120128, 130852, 126564, 109474, 115434, 112798, 121462, 144153, 117369, 116007, 125907, 127939, 80001, 43944, 35813, 52942, 71109, 136677, 151855, 125266]
18726A25266l2158o7K4048M393L111r877J8663J1654k6796j9593O3200q90l4286
18713A26668j113L765k1139l0183l148K8316J2998j698k3328m1338J1371m867
18701E6304M3400M0951J8425L7208O35k6924k6373l541R1K4131P885K2916K009
18688A97117m3753n011K2777j7215j1763j2260k0630j8733k4706L2029M8351J2349
18676A58552j4029K5017K3246k3286P821M014q505L144L8077J28j7087O741m044
18663A99789k7905J9783K1979K5800Q360k6425j3127q424l2336k2124J5370J2540
18651A73280N643o286J7676K4582K1416n430j1908k679J181R656N0146N0636j521
18638C26392k3331k4445k211J7105J225k2536j9434j8372P3518N6531m9016p0234
$$ y = [125266, 93108, 93041, 117089, 121482, 124593, 114716, 133379, 145033, 118237, 98644, 161844, 160954, 126668, 125555, 129320, 108181, 77998, 74850, 103166, 116164, 114466, 91138, 49800, 61171, 56304, 99704, 140655, 159080, 196288, 196923, 169999, 143626, 140085, 140176, 164307, 172192, 195108, 197117, 153364, 148353, 171130, 153915, 142152, 129892, 109262, 90529, 65823, 97852, 146203, 158552, 144523, 169540, 192786, 169500, 177321, 181335, 172830, 175974, 214051, 214179, 197092, 203833, 199789, 171884, 191667, 213646, 239446, 247806, 221381, 208254, 199830, 167494, 145370, 160740, 173280, 178923, 172637, 190313, 214895, 236311, 230881, 218973, 216294, 217475, 227131, 277277, 327913, 326392, 303061, 278616, 276405, 293510, 294735, 272199, 252765, 234393, 307911, 364442, 315426, 245192]
18626B45192J4884N4476K8318K7495N3752M779L7357r366j6725K4923N878k9344
18614D41619j074L7463K5772K6059M0741K0331P740L0986K8278M6126o67j6968
18602F86406J9140M8522N6210P5900N7384Q3399J15162J76986J86078K16539K33621
18591A955347K44544K43726K02287J89802K25687K55139K97872L63707M22477
18582D400588N23355O38574Q82668J149886J431595J861525K440122L193814M310137
18573B0832264N957662Q381176J1727597J5550490J8571262J8691884J4362876
18566A14075211O468558n654022j3237300j8806089j7968718j4389373j0303471
18559D0184796p171106n191960l828509k865039k175157j676739j412066j204544
$$ y = [245192, 260076, 314552, 342870, 370365, 424117, 428896, 466253, 456887, 440162, 465085, 470963, 441619, 440545, 478008, 503780, 529839, 570580, 590911, 598651, 629637, 657915, 704041, 703374, 686406, 705546, 754068, 810278, 886178, 943562, 1026961, 1142123, 1319109, 1505187, 1721726, 1955347, 2199891, 2443617, 2645904, 2835706, 3061393, 3316532, 3614404, 3978111, 4400588, 4923943, 5562517, 6445185, 7595071, 9026666, 10888191, 13328313, 16522127, 20832264, 26789926, 35171102, 46898699, 62449189, 81020451, 99712335, 114075211, 120543769, 114889747, 101652447, 82846358, 64877640, 50488267, 40184796, 33013690, 27821730, 23993221, 21128182, 18953025, 17276286, 15864220, 14659676]
18551A4659676j048286q76402q04268p33123p00393o23842o23958o16662n86886
18542H045856n94940n68281n58038m70193l79785l20323k80931k80359k22558
18533D370448k22287j98758j97092k13663k21592j74904j35108j27847j72671
18524B706526j33617j11157j06105j35435j00446p2057n4018o1306p2211m1601
18514A818573m8717m8687p2868p0044r1442j10777q4250n8003m6687m0239m7994
18503A098865q7708p4153n5609o5350q0328q4541q9789n9250l7401k0198m3052
18492D01486j9946j6346m6179m5569l7199o2094R157L1443N0450k2368n9076m514
18480A79245q570J3904K6887j9649r599O463j1355k4406L2581J7563l4792K632
$$ y = [14659676, 13611390, 12734988, 11930720, 11197597, 10497204, 9873362, 9249404, 8632742, 8045856, 7450916, 6882635, 6324597, 5854404, 5474619, 5154296, 4873365, 4593006, 4370448, 4148161, 3949403, 3752311, 3538648, 3317056, 3142152, 3007044, 2879197, 2706526, 2572909, 2461752, 2355647, 2220212, 2119766, 2047709, 1993691, 1932385, 1860174, 1818573, 1769856, 1721169, 1648301, 1578257, 1486815, 1376038, 1291788, 1233785, 1187098, 1146859, 1098865, 1011157, 937004, 881395, 816045, 735717, 651176, 561387, 502137, 464736, 444538, 401486, 381540, 365194, 319015, 273446, 236247, 174153, 183310, 214753, 265203, 242835, 183759, 179245, 170675, 184579, 211466, 191817, 182218, 188681, 177326, 152920, 185501, 203064, 168272, 170904]
18468A70904L8639j3866j2633N468k7179J5443J2165j9170L9213K0733p566q58
18456B21293K5861J7610R911K8581J2140N9078J33094J95260K29720K16057K19278
18445A367883J90040J06774r0467j41642k07368k19992j60223p0005m7857p168
18435G19975m3203o7622l4214n9601m3775J500n2180m4738J1400J6459Q903k0908
18423C91996K5819K2953L0287M3988j717n9540r2260o0083m6410n230l4268o242
18411B09293L462k4697n6262k7051o0366k776J5022L8473K795k1940K0035J4827
18399A10815J3248r960k6625l6362k7549j3033J3522l2047k3727M1098R697m371
18387A4706j842M734j05q15p759o86j44l2654K0762K8951j1586L1696K6454m716
$$ y = [170904, 209543, 195677, 183044, 188512, 161333, 176776, 188941, 169771, 208984, 229717, 222151, 221293, 247154, 264764, 274675, 303256, 315396, 374474, 507568, 702828, 932548, 1148605, 1367883, 1557923, 1664697, 1574230, 1432588, 1225220, 1005228, 845005, 775000, 727143, 719975, 676772, 609150, 574936, 515335, 471560, 473060, 420880, 376142, 387542, 404001, 412904, 391996, 417815, 440768, 471055, 515043, 513326, 453786, 361526, 301443, 255033, 249803, 215535, 209293, 212755, 188058, 131796, 104745, 44379, 41603, 56625, 95098, 97893, 75953, 95988, 110815, 124063, 114103, 87478, 51116, 23567, 10534, 24056, -7991, -31718, 9380, 19077, 14706, 12864, 17598, 17493, 16678, 8919, 8233, 8089, -24565, -3803, 25148, 13562, 45258, 71712, 66996]
18373F6996J6234j6711K4676R873J5462n740l2306J7007k0858l5166J8852N143
18361F3462J2120J625k8869j2857m47k4209P742K1918K5566j4604p1K739K972
18348E7087j3463j7808j2803J0500j180j5430M678J9019j4170O069J9147R58L5178
18335G7782J232k2930k4951k2918j6631M0101L0759j1200q603j3103r646j4669
18323E223N3828L1968k2941j8169L907J0687n0654j2379M7367j877K1290Q050
18311G6300Q434j3604m0750l0464N729J3181J0743J5559Q241J3500J8907q5K077
18298H7768K351l1951j7360l7648k0784n248J4643m558j1813j808K1199P923L602
18285F316M907K3428j5470Q06J874K3533K276k9314M628j0404l9663J6347R728
$$ y = [66996, 83230, 66519, 91195, 101068, 116530, 110790, 78484, 95491, 74633, 39467, 58319, 63462, 75582, 77207, 48338, 35481, 35034, 10825, 18567, 40485, 66051, 51447, 51376, 54115, 57087, 43624, 25816, 13013, 23513, 22333, 6903, 11581, 30600, 16430, 22499, 41646, 42604, 77782, 79014, 56084, 31133, 8215, -8416, 31685, 62444, 51244, 42641, 29538, 19892, 5223, 59051, 91019, 68078, 49909, 53816, 64503, 13849, 1470, 48837, 46960, 68250, 76300, 84734, 71130, 30380, -84, 5645, 18826, 29569, 45128, 53369, 66869, 85776, 85691, 87768, 90119, 58168, 40808, 3160, -17624, -22872, -8229, -12787, -24600, -26408, -5209, 2714, 6316, 11223, 34651, 19181, 19987, 21861, 45394, 47670, 18356, 22984, 12580, -27083, -10736, -1008]
18272a008J5878k0420j6736O046J3505r625j7719K8839J2463j4232j9170r944
18260c2123K8314K1002m7107L02J9627r00m4509l0007M184J6431J5935J4857j1280
18247d5274J0499K7015J9621l2093m464J300J6109L4140K1174q888j6291P291
18235C0139J3405q046j0145j1891k5652R086L1641J7534l0428r831j1047M801
18223d34J4280L8276l4831k9059J9004J4400L5166n622N858J7865j2946l850n756
18210E2351J505K8102Q428r26l9388m7372k5335R267q009J9490L2646j2627j9311
18197a179j4181K1815K1535L0902J8974Q751l1689j7098L4815K2000k3323J1520
18185H2842j2049J9125J0778Q41k931l7097k5561P359l6584q680J7453K9653J6857
$$ y = [-1008, 14870, -5550, -22286, -16240, -2735, -12360, -30079, -1240, 11223, -3009, -22179, -32123, -3809, 17193, -29914, -29612, -9985, -10885, -55394, -85401, -81217, -64786, -48851, -33994, -45274, -34775, -7760, 11861, -20232, -24696, -23396, -7287, 26853, 48027, 39139, 22848, 30139, 43544, 35498, 25353, 13462, -12190, -3104, 28537, 46071, 15643, 5812, -5235, -434, 13846, 52122, 17291, -11768, 7236, 21636, 56802, 51180, 57038, 74903, 61957, 58107, 52351, 53856, 81958, 90386, 89460, 50072, 2700, -22635, -13368, -21377, -1887, 30759, 18132, -1179, -15360, 6455, 27990, 58892, 77866, 86617, 54928, 37830, 72645, 94645, 71322, 82842, 70793, 89918, 100696, 101537, 98606, 61509, 35948, 43307, 6723, -1957, 15496, 45149, 62006]
18172F2006r580k99J808j2038m1548k0805Q815J3592L0395J3622K0229J4843J8183
18159I9223j5907j7154J58K9689M9040J4651N591L773j0905l731n146k4992j7836
18146A06454M36j0485j9649Q115M9661K0703K1418R485K5269K3824M613L211L7094
18133B80149P6876M0203J0833J6796R2766R4181P9398J29744J41213K00351K28333
18122A390843L02566L96327M53462N92882Q12140J106815J483821K098209L073638
18113A1710703M848111P269644P792248M399403K238901m351208j0516263o772815
18105A6618724l791190k523207j820187j318681r92289p52084n78311m02085k91628
18096D149062l25667l21437k79260k33997k37928j95595j45507j10778j67726
$$ y = [62006, 52426, 52127, 53935, 41897, 349, -20456, -11641, 1951, 32346, 45968, 66197, 81040, 99223, 83316, 66162, 66320, 96009, 145049, 159700, 165291, 169064, 158159, 154428, 149282, 124290, 106454, 106890, 96405, 76756, 84871, 134532, 155235, 176653, 186138, 211407, 235231, 239844, 243055, 280149, 357025, 397228, 408061, 424857, 517623, 611804, 691202, 820946, 962159, 1162510, 1390843, 1693409, 2089736, 2543198, 3136080, 3948220, 5055035, 6538856, 8637065, 11710703, 16558814, 23828458, 31620706, 36020109, 38259010, 33907802, 23391539, 16618724, 12827534, 10304327, 8484140, 7165459, 6173170, 5421086, 4842775, 4440690, 4149062, 3823395, 3501958, 3222698, 2988701, 2750773, 2555178, 2409671, 2298893, 2131167]
18087B131167j88883j65817j39913j32717j07518j02231m8625n6421n3504o2337
18077A073201l2025n8696l6972m7867n9560n0355m2614r612n2099m5609o6256
18066E71536j8731j8688r582J1181K058l5138r3P534r826J8955R26J5089r804
18053E25417l3347k1455p396j9300k9528k8103m0128o1398j8275J3066L259m2658
18041B40154m7239k2777j1345k4885l8311j5940l6025J0345j3099J1671J662p123
18029D7088j838k6670k6973J2751K1749l476l9814Q053K0203j2407j6326J7051
18017f09P804j3943l8854J4303J4741j997j058K8811K1179K0163q12J3114M545
18004F7387o474J5294k9225N475J079j9757K2615J1516J2014R767L3776N7403
$$ y = [2131167, 1942284, 1776467, 1636554, 1503837, 1396319, 1294088, 1245463, 1189042, 1135538, 1073201, 1041176, 982480, 945508, 897641, 838081, 787726, 745112, 735500, 683401, 637792, 571536, 552805, 534117, 524535, 535716, 537774, 502636, 502543, 510077, 500251, 519206, 520132, 535221, 525417, 492070, 470615, 463219, 443919, 414391, 386288, 346160, 284762, 266487, 279553, 282812, 240154, 192915, 170138, 158793, 133908, 95597, 79657, 43632, 53977, 40878, 52549, 54211, 47088, 45250, 18580, -8393, 4358, 26107, 22631, -17183, -9130, 11073, -1334, -17660, -609, 7195, -6748, -45602, -31299, -16558, -18555, -19613, 9198, 30377, 50540, 49728, 62842, 67387, 60913, 76207, 46982, 52457, 53536, 33779, 56394, 67910, 79924, 89691, 123467, 180870]
17992A80870J7617Q814Q030j0795j2781O273L9843P998j0169n136j835R515M110
17979B42354l2807k9986k7676K0790O50M761l0735l5563k6491l633p58J7545n817
17966I2634j4980J0633q319k8219K716K6894K0332l6443l0024K4715N8687K0998
17954A39624K1363M9963L4528j8304L5729N3984R3612J10504Q9640N3256O6616
17943G30515M0426m6784o8230j15265r0633p5394l7642k5737k1161n1067k586
17932B36442M0616k2868m1032l2781j963j8792n997k6547k8291j7017q925m1721
17920C1124l365K4698K7608J7461j7221j7692M022l160K1814K0143j7913k9965
17908E7554K365n031k2127N392j5541m2340k0118j6202K5704J8559N163L076p633
$$ y = [180870, 198487, 207301, 215331, 204536, 191755, 198028, 237871, 245869, 235700, 230564, 228729, 238244, 242354, 209547, 179561, 151885, 172675, 173325, 178086, 147351, 111788, 85297, 81664, 80906, 98451, 92634, 77654, 88287, 79968, 51749, 54465, 81359, 101691, 65248, 35224, 59939, 118626, 139624, 160987, 210950, 245478, 227174, 262903, 316887, 410499, 521003, 610643, 663899, 730515, 770941, 724157, 655927, 540662, 450029, 374635, 336993, 311256, 290095, 239028, 236442, 277058, 254190, 213158, 180377, 178414, 159622, 153625, 127078, 98787, 81770, 72845, 31124, 27759, 52457, 80065, 97526, 80305, 62613, 66635, 63475, 85289, 105432, 87519, 57554, 59919, 54888, 32761, 38153, 22612, -19728, -39846, -56048, -30344, -11785, -6622, -3546, -11179]
17895a1179M189r94q350Q483j866q921p409l711j8468K4994N301p525j2298j1537
17881d9291J652K9285L595J8761K4056k290m3750l859m4727j9066j4823J4625
17869h5832K9209L4218L4851J4369j8551j0981j1227J169j2662K5975L5867k8546
17857G859m3340n900J5994R157k7548j5159j7018j781L0750K7940J0554L6652
17845B8160J8436j3198p33J4283j1652M20j8962l704N965p917q97J5529l7872
17832a2142k81L8551l5629o712M827L125r842k4030J2757K7650M0928j9473j2481
17819G248J9868J8835q781l4444k785l6961n1911K3353o278R799N7831J2032m2140
17806c4334j7282o611L396K9970O875m5483q318K1845K1363M854q597q806k3169
$$ y = [-11179, -6990, -7984, -16334, -7851, -9717, -18638, -26047, -29758, -48226, -23232, -17931, -25456, -37754, -49291, -47639, -18354, -14759, 4002, 28058, 25768, -17982, -21841, -66568, -85634, -100457, -85832, -56623, -22405, 12446, 26815, 8264, -2717, -13944, -12775, -25437, 538, 36405, 7859, -35481, -41381, -25387, -16230, -43778, -58937, -75955, -77736, -46986, -19046, -8492, 28160, 46596, 33398, 32665, 46948, 35296, 35716, 16754, 13050, 19015, 11098, 10201, 25730, -12142, -12423, 26128, -9501, -16213, -11386, -8261, -18103, -42133, -29376, -1726, 39202, 19729, 7248, 27116, 45951, 37170, 2726, -59, -37020, -88931, -65578, -71856, -62057, -4226, 7806, -34334, -51616, -58227, -54831, -24861, -17986, -63469, -71787, -49942, -28579, -23725, -32322, -41128, -64297]
17793f4297j2064L151O347L2073j4153j2738L0192K5133L9285J0975m5521J746
17781A29K659j8040n920j2127k3394L6710k518L6319p265N071j3639k3716j3628
17768c9359l125K3273K6629K604m8849k7542J4786k2308J3819J8345L3614l1859
17756c9972q126O782k1142K068K7593j481J4544l821j6415o434K0173Q557K2942
17743E268j4012k2443J121J6142L371P692J4919l199o917j0171K6822m583J4567
17730B8577j8378m1562k785j5021k745N25J5303l30J5772Q722j0450k172r220
17717c3764j7122j668L1962J7751Q139r24k353k8145J3585Q961J286p829k1284
17704c1405k4072K6273R338r994N537p95j9072L5550K8086j8520j5490q487K4680
$$ y = [-64297, -76361, -73210, -66863, -34790, -48943, -61681, -31489, -6356, 32929, 43904, -1617, 129, 2788, -15252, -21172, -33299, -56693, -19983, -22501, 13818, 6553, 11624, -2015, -25731, -39359, -42484, -19211, 7418, 10022, -38827, -66369, -51583, -73891, -60072, -41727, -8113, -39972, -48098, -41316, -62458, -60390, -32797, -34278, -19734, -23555, -39970, -46404, -26231, -17674, 5268, -8744, -31187, -30066, -13924, -10553, -2861, 12058, 8859, 1942, -8229, 18593, 14010, 28577, 10199, -31363, -34148, -49169, -51914, -51389, -36086, -36416, -20644, -11922, -22372, -24544, -33764, -50886, -52554, -20592, -2841, 5298, 4374, 2021, -26124, -12539, -3578, -2292, -10121, -31405, -55477, -29204, -19866, -29860, -24323, -25118, -44190, -8640, 19446, 926, -14564, -23051, 1629]
17691A629n519j7528r020J160N835k441k384J980M8206p190P855J122j6605k1030
17677a3930q20o539J8443P609j8084n00k6742L903l9955J7051N2757L5799J280
17664C0272k4321m4224l2247L982K9373L5141K7276m6900q204J8113l2683m568
17652d8990Q429l0499O0260L7964k0490N332J1404J0092j0325m0933q281R353
17640a6684O710j0602j8303j6353N323j3808j3283O705K5867Q640R701Q862m013
17627b1238j0427J5427O258K1503K9969l073m3878j4390n623M613Q019m635J5068
17614b407J2578l47J1164K3317j9972j3296j8122R376R945k7059l5382r153J4418
17601d4940N5773L7890j1099Q029J1796j8139J5638Q796k0058j6846r715L3306
$$ y = [1629, -3890, -21418, -30438, -29278, -23443, -25884, -28268, -26288, 21918, 14728, 22583, 23705, 7100, -13930, -14750, -21289, -2846, 4763, -13321, -13821, -40563, -36660, -76615, -59564, -6807, 28992, 30272, 5951, -38273, -70520, -66538, -37165, -2024, 25252, -21648, -29852, -11739, -44422, -48990, -40561, -71060, -10800, 27164, 6674, 12006, 23410, 33502, 23177, -17756, -26037, -16684, -9974, -20576, -38879, -55232, -49909, -63717, -77000, -70295, -44428, -35788, -26087, -17225, -21238, -31665, -16238, -9980, 11523, 41492, 38419, -5459, -19849, -25472, -20859, -12840, -17475, -2407, 10171, 9824, 20988, 44305, 24333, 11037, -7085, 2291, 12236, -14823, -50205, -59358, -44940, 10833, 48723, 37624, 45653, 57449, 39310, 54948, 63744, 43686, 26840, 17125, 50431]
17589E0431J4647J6555J9189M6727K4899K8332N1963L2449q504m3169l3540l8140
17577A61839l5233j9536j5837K6928k0827K5745L8484J4101P3045J9394K1050
17566B89153K1030l4616p7486o1180k6352j7208k987k8050j0240j2202n760P579
17554D1681l4741j5823L6047K4931K0522j5300p982K0481r061k2357r400j5934
17542A3064J800K272j7278o235j334K3884j2149j5007l0072J1162m393K5922K9183
17529B0819k5602p955j8273J0847L546J4753j9793J4837k2206j4383J2413j869
17517c2866L4508p24p06j6940m6874K6400n059K3098M608K2964j8834k8484J7581
17504b1328J1692P989P556j6901J7316J0419l176N598m7911k3762K0730J0305
$$ y = [50431, 65078, 81633, 100822, 147549, 172448, 200780, 252743, 285192, 276688, 233519, 199979, 161839, 126606, 107070, 91233, 118161, 97334, 123079, 161563, 175664, 248709, 268103, 289153, 310183, 275567, 198081, 136901, 110549, 93341, 90354, 62304, 52064, 39862, 34102, 41681, 6940, -8883, 27164, 52095, 72617, 57317, 49335, 69816, 60755, 38398, 28998, 13064, 14864, 17136, -142, -6377, -7711, 16173, 4024, -10983, -41055, -29893, -34286, -8364, 20819, -4783, -12738, -31011, -20164, -16618, -1865, -21658, -6821, -29027, -43410, -30997, -32866, 1642, 918, 212, -16728, -63602, -37202, -42261, -19163, -14555, 8409, -10425, -38909, -21328, -9636, -1647, 5909, -10992, 6324, 16743, 13567, 19165, -28746, -52508, -31778, -21473]
17492b1473l628K0005P629j8723j0735k693j3144M0297J3022J8751J6033r946
17480C5395n5061l4350P061K6976j7895K4404L8319J0289j1092m93l4849o901
17468a8197j6878o048L0301K7504J865P790J0542P207K3913J7020k6066m945K913
17455E6921K7602m2827m1773m782l727M158J5688p72K0628L6342N0811P5433n864
17442A87838j7839n7498m4797n147R675j7599m8479m898K6026o635k9268j2002
17430b0623K3415K6939J1312j5743j085K4994p76j6479r112j2712l6110j3704
17418c9684K6490n179j275K1456j2448K2677L1810J4825j6953q698J9164k3344
17406B8841k1752j0978q557J1828K1786q005q982J5937l5282K562j0535N956m564
$$ y = [-21473, -25101, -5096, 2533, -16190, -26925, -29618, -42762, -2465, 10557, 29308, 45341, 35395, -19666, -54016, -46955, -19979, -37874, -13470, 24849, 35138, 24046, 23553, -11296, -18197, -35075, -41123, -10822, 16682, 18547, 26337, 36879, 44086, 67999, 85019, 58953, 54008, 56921, 84523, 41696, -77, -4859, -8586, -4428, 11260, 10488, 31116, 67458, 118269, 193702, 187838, 169999, 112501, 67704, 62557, 72232, 54633, 6154, 1256, 27282, 20647, -8621, -20623, 2792, 29731, 41043, 25300, 24215, 49209, 48433, 31954, 22842, 10130, -25980, -39684, -13194, -18373, -19648, 1808, -10640, 12037, 43847, 58672, 41719, 33021, 52185, 28841, 7089, -3889, -12446, -618, 21168, 13163, 4181, 20118, -15164, -12602, -23137, -17181, -21745]
17393b1745J8313J6565j1182Q637N239k6472k0557O153j4610k5148J3810P499
17381d3498L0893j2352l2748N153K0098K3401J2552l4722k5597j795Q726k393
17369e2282K3950m885j7794j2129r025J366R302L6001L6968K20q712J9853K4133
17356D6966j329J2320k1908n6057j431R589O22K4306j0600p561M14k8814o052
17343c9535J4267n325L497L303r936r175p578O9328J4922J4860j6365j7695J923
17330A6491L014r152l6905K934M8293O569p222p25m018l300K334j0137l171k5525
17316b0520o70K5068k703m175j7031J5100J6475l4679l4637K7093N6554L4226
17304F0101J6047k3103l7026l3258Q861N1815j7188l3874j7819L1651j576k4467
$$ y = [-21745, -3432, 13133, 1951, 10588, 15827, -10645, -31202, -25049, -39659, -64807, -50997, -43498, -12605, -24957, -57705, -52552, -32454, -9053, 3499, -31223, -56820, -58615, -49889, -52282, -28332, -33217, -51011, -63140, -72165, -70799, -61497, -25496, 11472, 11692, 2980, 22833, 46966, 45637, 57957, 36049, -20008, -21439, -11850, -11228, 13078, 2478, -5083, -4669, -33483, -39535, -25268, -30593, -27096, -23793, -33729, -42904, -50482, 18846, 33768, 48628, 32263, 14568, 16491, 19505, 10353, -26552, -23618, 24675, 31244, 24022, 23297, 19279, 15979, 18313, 8176, 5005, -20520, -21190, 3878, 1175, -3000, -20031, -4931, 11544, -23135, -57772, -30679, 25875, 60101, 76148, 53045, 16019, -17239, -8378, 43437, 26249, -7625, -25444, 6207, 4631, -19836]
17292a9836Q387L7830Q632L481j5350j5090l0147O449M441J272M779P670L1747
17279C4265L905l8005l5106j4328L3223L5863k5839k0588n342K3184K6038L1405
17267D8675r744l9145m7440r943K1977L6494K782q13K1124K0320K3275k7241n8301
17254a7980l6551K7887L826l8437L2233M9115j2724p369n038l950J2949n685j7404
17241a9128j3045j1004J5346P804n632J3627k258J1235J7138l2790m4368R94P261
17228e4820K289p208k0417N2238L5760R976L7038r208n3375k4352k4926K7422
17216b9583J2059M50K1812j788j4526r872l921L3264K0453j7389l0504Q010J7078
17203E543R342k0374k1959l08j399L741J8285J7187N001Q124J114J0246j184o835
$$ y = [-19836, -11449, 26381, 35013, 38494, 23144, 8054, -22093, -15644, -11203, -9931, -5152, 2518, 34265, 38170, 165, -34941, -49269, -16046, 19817, -6022, -26610, -31952, -8768, 17270, 48675, 38931, -214, -47654, -57597, -35620, 874, 3656, 2843, 23967, 44287, 67562, 40321, -17980, -54531, -26644, -22818, -61255, -29022, 20093, 7369, 0, -5038, -8988, 3961, -1724, -19128, -32173, -43177, -27831, -20027, -25659, -12032, -14290, -3055, 14083, -18707, -63075, -62081, -54820, -52531, -59739, -80156, -27918, 7842, 17818, 54856, 45648, -7727, -32079, -57005, -29583, -17524, -17074, 4738, 2950, -11576, -21448, -25369, 7895, 28348, 10959, -19545, -11535, 5543, 14885, -5489, -27448, -27756, -29155, -25414, -7129, 10058, 15059, 23183, 24297, 34543, 33359, 26524]
17189B6524k5498k6116O36L8256o850r664J3589r127K117J174J6933J3299m1742
17176f469o511L6754j5114k5660j9019q682m299L280K736J9819L0381R138k2396
17163f042k0829J6120J7953j5711p632L990r540p928J8900R221q527K9914n0761
17150c0872l4153k5459R86L6546L0782J7588j8492l1065J0676k122P013k2487
17138f1059R466k452m1560o299K1965M1068J5296p357r722j184M712Q137o129
17125c5118Q508J6285J1204J3421K2001j4162k0188m690q232k3248Q96j1059l3018
17112g7400j1464l673L1429L1442Q42J1515l1621m130J9696j4395p493K0737J7596
17099a6919M672j0310l1534J913J9614k9702L3153O3579k4006k5364j1261p202
$$ y = [26524, 1026, -25090, -24454, 13802, 6952, -2712, 10877, 1750, 3867, 5041, 21974, 35273, -6469, -12980, 23774, 8660, -17000, -36019, -44701, -49000, -45720, -42984, -23165, 7216, 16354, -6042, -26871, -10751, 7202, -8509, -16141, -12151, -21691, -29619, -10719, -1498, -10025, 19889, -30872, -65025, -90484, -89498, -52952, -22170, -4582, -23074, -54139, -43463, -45585, -38572, -61059, -51593, -54045, -95605, -101904, -79939, -38871, -23575, -30932, -40654, -41838, -37126, -28989, -35118, -26610, -10325, 879, 14300, 36301, 22139, 1951, -2739, -10971, -34219, -33323, -44382, -77400, -88864, -92537, -61108, -29666, -28824, -17309, -48930, -53060, -33364, -47759, -55252, -34515, -16919, -12247, -22557, -54091, -52178, -32564, -62266, -29113, 34466, 10460, -14904, -26165, -33367]
17087c3367N885k5622P082P634K0143o395l2908j7994M8967J1797P783q848j0568
17074b6411K6792j6031j0418M0638J5899k399j4935k7017j2651k218j8109j7283
17062f4143J6418N397J1053L3639q53l3503K185j4765Q785K1719n07l1008n378
17049e0961P999K0279j0360J2849K9351J0020r143q92p214j6198m344K4188j351
17036D223j3192j5927N856j3735K0058M8529j2835p491J1819J0060k3363M090
17024A8092J0666J7540k7968k2497j1023L9718k9170k1753m915k0974k9604p275
17012h9163K0386K2235j2320l747R809R831j0448J567J9335k0804j6283J2356
17000e7246K7421L8995L2040j126j6806j635k6877n199l221K253k9670J7444J2912
$$ y = [-33367, -27482, -53104, -46022, -38388, -18245, -24640, -57548, -75542, -26575, -14778, -6995, -15843, -26411, 381, -15650, -26068, 14570, 30469, 28070, 13135, -13882, -26533, -28751, -46860, -64143, -47725, -42328, -31275, 2364, 1511, -31992, -29807, -44572, -35787, -14068, -14575, -45583, -50961, -42962, -22683, -33043, -20194, 9157, 19177, 10034, 9142, 1928, -14270, -18614, 5574, 4223, -8969, -24896, -19040, -32775, -12717, 35812, 22977, 15486, 27305, 37365, 14002, 18092, 28758, 46298, 18330, -4167, -15190, 24528, -4642, -26395, -31310, -52284, -81888, -89163, -68777, -46542, -58862, -62609, -52800, -42969, -53417, -51850, -32515, -53319, -69602, -57246, -29825, 9170, 41210, 40084, 23278, 21643, -5234, -10433, -13654, -11401, -41071, -23627, -10715]
16987a0715P601j8855M100j8957K6575j7285j2558q799K5643K2470K9015K0143
16975D8378r618k4194R714J9068k1535j5553k7046r230P283n092m7225m1832K836
16962a14046M8454M3158K4649k1372K7605k3729p046o762j6900l467j1175O640
16950e3991L5458j4675j8757m79K7155M1827J9540j9918k9006O200J3711k1532
16938a4467n264m7986J4839J5079J8174J2358K165J6117R027n918K476K561J4207
16925C3368l1328m145j2882j0960o131r453J7352P201r025j9324K9408p986o115
16912c0020L3071j3664J8095L096k1366p656J3423K4320j3212l5704q221j8270
16900e6108K8320K4432k7853O206L4999l005K014l9681k0408O623m569J0722K3537
$$ y = [-10715, -3114, -21969, -17869, -36826, -10251, -27536, -40094, -48893, -23250, -780, 28235, 48378, 38760, 14566, 24280, 43348, 21813, 6260, -20786, -30016, -22733, -27825, -75050, -116882, -114046, -65592, -22434, 2215, -19157, 8448, -15281, -22327, -29089, -45989, -49456, -60631, -53991, -18533, -33208, -51965, -52444, -25289, 16538, 36078, 16160, -12846, -6646, 7065, -14467, -19731, -67717, -52878, -37799, -19625, -7267, -5102, 11015, 20042, 14124, 16600, 19161, 33368, 2040, -2105, -14987, -25947, -32078, -41531, -24179, -16978, -26003, -45327, -15919, -23905, -30020, 3051, -10613, 7482, 10578, -10788, -18444, -5021, 19299, 6087, -29617, -37838, -56108, -27788, -3356, -31209, -25003, 9996, 6991, 9005, -30676, -51084, -44461, -49030, -38308, -14771]
16887a4771n338j2524k095k028J6771O116j758M4080J3612l8250j4342j1174J4638
16874g063J4399j2057K2675k0501k3527j08j5245K4568P233J8050L924K746q670
16861F424k4858K2500M756n91J0570J1821p840n8456r851k4253R550N501L7122
16848a7605J367j086r784j2976M355J7759L13L5067M399l1415j4811l986q024
16835c6427L3590K5855J6417n317q393j9327l7263m197K3345N7968K3537L90k7859
16822D2319o4120k3634j5485j552M7301K5344j437J2788l004j1314J0204j483
16810A5927j3889k6174L1545N8852J7093m3097k1139K2632j1642k2609K2055J8779
16798D8333M510R687k2483j2855r752l4576J3828K9266L1296J6104L064l4789
$$ y = [-14771, -20109, -32633, -34728, -36756, -19985, -13869, -15627, 28453, 42065, 3815, -10527, -21701, -7063, 7336, -4721, 17954, -2547, -26074, -26182, -41427, -16859, -9626, 8424, 12348, 15094, 6424, -18434, 4066, 8822, 8231, 18801, 30622, 22782, -35674, -45525, -69778, -60228, -54727, -17605, -16238, -17324, -27108, -40084, -35729, -17970, -17657, 17410, 21809, -9606, -24417, -28403, -36427, -2837, 23018, 39435, 34118, 25725, 6398, -30865, -35062, -11717, 46251, 69788, 70178, 42319, -21801, -45435, -60920, -62472, -15171, 10173, 8736, 21524, 18520, 7206, 17410, 15927, 2038, -24136, 7409, 66261, 83354, 40257, 19118, 41750, 30108, 7499, 29554, 48333, 52843, 62530, 40047, 27192, 17440, -17136, -3308, 25958, 57254, 73358, 76422, 41633]
16786D1633k8441m0523J5407J9294q817r683j0896O035k0830k7391N2456K6203
16774A4447J3551j4581l4370k1018l5014j4754N1800K2724J520P698J9145J7632
16762B8780l571j3906l4153K712j6729r799k8715L6993M0020r00M740J1352l6331
16749a9507k7579P37J377O026P245L5952K6584N134L055q05j7067j1514j9833
16736a0195k3O0550J2893k7437J9449j8238k2332J0141k3062l070P508M3533k7457
16723B2260m6772k4111J8499j2836j5077k38K3662M441J5894L5567J7734r154
16711B9869O716Q013k66m115k6190P929k3861J3871J0252J810l6908l1990J8585
16698b6285P539r284m2122J4267M1021J5963p898K3201J8500k0699j4208r463
$$ y = [41633, 13192, -27331, -11924, 7370, -1447, -11130, -22026, -15991, -36821, -64212, -11756, 14447, 27998, 13417, -20953, -41971, -76985, -91739, -39939, -17215, -15695, -7997, 11148, 28780, 25209, 11303, -22850, -20138, -36867, -46666, -75381, -38388, 1632, 732, 5472, 16824, -19507, -47086, -46349, -44972, -38946, -31701, 4251, 30835, 35969, 39024, 38219, 21152, 9638, -10195, -10218, 50332, 63225, 35788, 55237, 36999, 14667, 24808, 1746, -1324, 6184, 49717, 22260, -24512, -48623, -30124, -42960, -58037, -58275, -34613, -30172, -14278, 21289, 39023, 29869, 36585, 44598, 44332, 40217, 14027, 21956, -1905, 11966, 22218, 24028, -12880, -44870, -26285, -18746, -28030, -70152, -55885, -14864, 1099, -6799, 16402, 34902, 14203, -5, -9468]
16686i468k7532j8345M590K275j4437k5184L6430J500N23m824J8426L0213l963
16673i796R6R530J4654P37r111J9193M4447k5621n0809r020J1203J1175l3638
16660b6960j9586P614K6532j6987l0510L1452J5572q893j437K2873L5685J3470
16648D8825j1764l1950q295N705k3152J1993L4102j2453j6714N930k1892k3897
16636d3562J351R599j1704l8311L7020L240j4633k0969M7566K1033n680K0423
16624E373Q771J807M307j9592j1927J6060K0815l6599K091k3199J1816k1398j4470
16611e6145K1002L9249j7552j2409M187K608N731J3894J4723K4822n70l0493l1840
16598b2793l4427K1429R369J6146j7590j1446P687K1183m963o126K365J061K737
$$ y = [-9468, -37000, -55345, -50755, -48480, -62917, -88101, -51671, -50171, -49648, -54472, -36046, -5833, -9796, -9700, -170, 14484, 15221, 6110, 25303, 69750, 44129, -6680, -15700, -4497, 6678, -26960, -46546, -38932, -12400, -29387, -59897, -28445, -12873, -21766, -23203, -330, 35355, 48825, 37061, 5111, -3184, 2521, -20631, -8638, 25464, 13011, -3703, 2227, -19665, -43562, -42211, -32612, -44316, -82627, -45607, -42367, -57000, -77969, -30403, -9370, -15050, 5373, 14144, 15951, 20258, 666, -11261, 4799, 25614, -10985, -8894, -32093, -20277, -41675, -56145, -35143, 4106, -13446, -25855, -21668, -19060, -13329, 565, 15288, 40110, 39540, 9047, -22793, -57220, -35791, -26422, -10276, -27866, -39312, -31625, -10442, -15405, -21531, -19166, -18105, -15368]
16585a5368J935n441o229K924l0324O719N39M279j7415R243K9569K398J3243k0256
16571b4184k8175j0930m271K3792M803J0658R565J5092J4273j437R484l1996l7028
16558e0354K2407J8104k9044K3221O115Q884K0724J0621k5889k1526K6945l51
16546I857p045k1480P733k59Q221j3036J1911l575l0777j973N904m847L4888j802
16532f280J2386L806J263J0891j480n045k009J2500r231n608J899J4414K569j3843
16518A6232l2755Q830L2713p011m1781j8519Q337K5458J7488Q3M55j7000R951
16505B481l0945j7134L82L5650K9496r483k9033R900N928o467J3071j030J6967
16492A9783k921O052k8884j3698K289K704K4475Q905j2425k1416r632J7436P899
$$ y = [-15368, -13433, -18874, -25103, -22179, -52503, -45784, -45245, -40966, -58381, -49138, -19569, -17171, -3928, -24184, -52359, -63289, -67560, -43768, -38965, -28307, -18742, -3650, 10623, 9186, 18670, -13326, -50354, -27947, -9843, -38887, -15666, -9551, -667, 20057, 30678, 4789, -16737, 10208, 9857, 2812, -18668, -10935, -11194, -2973, -16009, -4098, -7673, -38450, -40423, -34519, -39366, -4478, -6280, 6106, 9912, 11175, 22066, 20586, 15541, 13532, 26032, 16801, 11193, 13092, 27506, 30075, 16232, -16523, -7693, 25020, 18009, -23772, -42291, -33954, -8496, 8992, 9075, 9530, -7470, 2481, -28464, -45598, -45216, -9566, 19930, 10447, -18586, -8686, -2758, -9225, 3846, 2816, 19783, 16862, 22914, -5970, -19668, -17379, -14675, 9800, 18705, 6280, -15136, -24768, -7332, 567]
16479E67k4496k1554j101J4049M5038l3095k6014q771L6893N6374J4602m848J811
16466D9455K217k4961l0119m88K5825K8036p549k1940R90Q603k1982l6798Q42
16453b7869K5106l217j7644j0462K2677K9927J2655j1378j0086k3534k2215k257
16441c8297j7972m6805J6184M0767M5630J5746J6656O747J2392l4661m0932J5725
16429h820l1073K2579j1431k7007p209k177j6703J2657N7437J0166r649l4947
16417d6177j3712N896L5296K234L5156K6591j9420k1806K1621p18k3359J084j93
16404B493J697k4490n735k998j736K0646K4154k4762j285j7409l3072Q42r849
16391g1504r785j7005K2526L8292j2127J6611o487J9185J2789k8362p264K908
$$ y = [567, -23929, -45483, -46584, -32535, 12503, -20592, -46606, -55377, -18484, 37890, 52492, 47644, 49455, 51672, 26711, -3408, -3896, 21929, 49965, 42416, 20476, 21466, 30069, 8087, -28711, -27869, -2763, -5980, -23624, -34086, -11409, 18518, 31173, 19795, 9709, -13825, -36040, -38297, -56269, -103074, -86890, -46123, -493, 15253, 31909, 38656, 51048, 16387, -24545, -8820, -39893, -17314, -28745, -55752, -62961, -65138, -81841, -69184, -11747, -1581, -11230, -46177, -59889, -53993, -18697, -16463, 18693, 45284, 25864, 4058, 25679, 24961, 1602, 2686, 2493, 4190, -20300, -26035, -29033, -30769, -10123, 14031, -10731, -12016, -29425, -62497, -61655, -71504, -81289, -98294, -75768, -37476, -49603, -32992, -39479, -20294, -7505, -35867, -43131, -40223]
16379d0223M440Q712M689J7659K1001M236j8883k3080P721P144k7200J2014l582
16366b5352J0029k075j9596L3669k1196k409k0194j3778n471K7915J0181K2937
16354e340N914p046K800J0872K4467L9443q135Q204j5874J9340j907k5247j3273
16341C4218k4248j6535P091K621O022k9691k3755J0859L7021j3104j1300j716
16329b2517K0530q496m865K97r809J732Q107J321k5089R78N1188M675m662k0618
16315g228q564K9306K0609l3330k190p842o696R262k4538J7647R072j4122K3171
16302D557K3305k3407o540j9539Q587J0672L1040K810k1572k3678j4263q770J2606
16289b4192N281p107j8901k287k3597J8233L0527J2135j4765m990p002J9421R285
$$ y = [-40223, -35783, -27071, -22382, -4723, 16278, 20514, 1631, -21449, -13728, -6584, -33784, -21770, -25352, -15323, -17398, -36994, -3325, -24521, -26930, -47124, -60902, -66373, -38458, -28277, -5340, 574, -6472, -3672, 7200, 31667, 71110, 62975, 71179, 55305, 74645, 72738, 47491, 34218, 9970, -6565, 526, 3147, 9169, -20522, -44277, -33418, 3603, -9501, -20801, -22517, -1987, -10483, -15348, -15051, -24860, -23128, -15021, -13700, -38789, -37811, 13377, 18052, 13390, -7228, -15792, 13514, 34123, 793, -1397, -9239, -15935, -6673, -31211, -13564, -4492, -18614, 4557, 27862, 4455, -2085, -21624, -13037, -2365, 28675, 31485, 9913, -13765, -28028, -36798, -24192, -18911, -26018, -44919, -47206, -70803, -52570, -22043, -9908, -24673, -29663, -36665, -17244, -7959]
16276g959J202n5372k915L571J9002J6341K4993l1816m4305N089L7534j998R468
16263b7165M997L6948J6879Q027o955j249p686J5501p273j5127O066q681k2242
16250g960l3482R566K3152J9140R352j8013j8914j3147L4837N038N290J327j8888
16237b702j2459j3566J7793N1698j7586l5608m0525k4102O169K9294L8974J6085
16225A3465l7736j9569l650J5829n406o465K6354K3440m710q65j5260k2898K0406
16212a7065l1314j9147O557M2463L2697K1565k0210r375J3947L5623J2999l4291
16200C4449n511k6467l0578j1448L333l191J3488l945m470O880J3029j0694j5842
16187d0967j5758K770J7564J427J4973M700p818k5448r022P832M2771M3124J2295
$$ y = [-7959, -6757, -62129, -65044, -61473, -42471, -26130, -1137, -32953, -77258, -72169, -34635, -36633, -27165, -22168, 14780, 31659, 39686, 32731, 31482, 23796, 39297, 32024, 16897, 22963, 14282, -7960, -41442, -31876, -8724, 10416, 19768, 1755, -17159, -30306, 4531, 9569, 14859, 16186, -2702, -15161, -28727, -10934, 40764, 23178, -12430, -52955, -77057, -70888, -41594, -2620, 13465, -24271, -43840, -47490, -31661, -37067, -43532, -17178, 6262, 1552, 687, -14573, -37471, -17065, -48379, -67526, -60969, -18506, 14191, 35756, 15546, 6171, 20118, 55741, 68740, 34449, 28938, 2471, -28107, -39555, -36222, -39413, -25925, -29870, -34340, -27460, -14431, -25125, -40967, -56725, -53955, -36391, -34964, -19991, -15291, -23109, -48557, -57579, -49747, -6976, 36148, 48443]
16174D8443j4078j7651k602L343j6565Q07J9138q843j310Q958k330N14j4859k2601
16160a9636k1836r642J80K3392N751L5304K2345j9880q068l6909p019P810J1381
16147a6827p806Q265J1955j067l3498M546K9398k6195l5134K243K2357n355J961
16134d5157L2292L7609l9817m5469O855K8227j648j787K2168J2779J3863l857
16122A6058j3167J6495k186k195k034k7356l7863n063J9190L686o476L6692K0456
16109A6237k4408j2226p381J8343n123m7753J5304L8060r833l904l3499l493L555
16096e6121J2822O138j9742j9420L8134M5162J6511j4449k930j5813p792K400
16084a5100j0610K7443L4716n742j0353l8998j1028L309J4678k727K6069j2259
$$ y = [48443, 34365, 16714, 14112, 17455, 890, 1697, 20835, 11992, 10682, 19640, 17310, 17824, 2965, -19636, -41472, -51114, -50934, -27542, -21791, 13513, 35858, 15978, 7910, -28999, -36018, -28208, -16827, -24633, -16368, -4413, -5480, -38978, -34432, -5034, -31229, -66363, -64120, -41763, -47118, -45157, -12865, 24744, -15073, -60542, -53687, -25460, -27108, -28895, -6727, 6052, 19915, 16058, 2891, 19386, 17200, 15005, 12971, -14385, -52248, -57311, -38121, -34435, -40911, -4219, 16237, -8171, -20397, -27778, -9435, -14558, -62311, -47007, -8947, -18780, -22684, -56183, -59676, -56121, -43299, -37161, -56903, -76323, -38189, 6973, 23484, 9035, 6105, -9708, -17500, -15100, -25710, 1733, 36449, 30707, 20354, -18644, -29672, -26363, -11685, -14412, 11657, -602]
16072f02j5996R910M5242l746j5246r695J7099N415j2522J0302L002l6847r740
16059a3424Q401l091m177J0645k0840m25L1044j7658l3503O351J3780j1246J5382
16046a8761L1373L8832L0942M178j4917j9833k5142n0306l9015K7049N417K4754
16034e429J1806j553l0596K582l90K0908J1160M370k1594J5977j2153j2762j3428
16021c1102R628N0746J4480m5449n515j3817RN202M0455K8700l570k9321l7150
16008a6704k8094K4244M926l14m853J7148J8243J4992k6998n6365j6634K5770
15996d4639M7296j0206q753j7045J9108m322k2129J9289J9716l43j9126j1686
15984c2840n14R204J6330M0515J9867k6316J311m805j7854l4280J6230K3301K7046
$$ y = [-602, -16598, -6688, 38554, 34808, 19562, 9867, 26966, 32381, 19859, 30161, 33163, -3684, -13424, -5023, -8114, -12291, -1646, -22486, -22911, 8133, -9525, -43028, -36677, -22897, -34143, -18761, 12612, 51444, 82386, 86564, 71647, 51814, 26672, -23634, -62649, -35600, -30183, -5429, 6377, 4824, -25772, -23190, -23580, -2672, 8488, 12858, -8736, 7241, -4912, -17674, -31102, -21474, 29272, 43752, -1697, -7212, -21029, -21020, -15818, 24637, 53337, 49767, 20446, -16704, -44798, -20554, -15628, -15942, -20795, -3647, 14596, 29588, 2590, -53775, -70409, -44639, 2657, -7549, -16302, -33347, -14239, -18561, -40690, -21401, -1685, -2028, -21154, -32840, -33354, -24150, -7820, 32695, 52562, 26246, 27557, 22752, 4898, -29382, -13152, 10149, 37195]
15971C7195R392m3751J2734O879l759k1564J7401K8540r431R44p767m4199P307
15958a0079K6515J7209K1353k8834j5563j6685k0506q747r074K2520K9155M358
15946A1622k8495l819J8433j1002n779J6382N3778p899n1061J735M682J162O819
15933F558p37j1036k8640r870O832j12Q331Oj7678K3496q088N859L7642j283l0433
15918a9153k8569K2271J9289j0396N537K1005l774m1788p524L8800J1521l669
15906C550k0003j689l4929k8900L4000M2758J2934K10J172O342k3775k113M935
15893e508j7557j9443j6698J7685K996K6195L6968j8441K027r874q032O758k633
15880e557M024m1879m7054M531Q918J7401K3252Q236L5483M2775l5250l2926K0553
$$ y = [37195, 46587, 2836, 15570, 22449, 18690, -2874, 14527, 43067, 33636, 34580, 26813, -17386, -10079, 16436, 33645, 54998, 26164, 10601, -6084, -26590, -35337, -44411, -21891, 7264, 11622, -16873, -20692, -2259, -13261, -19040, -2658, 51120, 43221, -7840, -6105, -1423, -261, 6558, 5821, -5215, -33855, -43725, -36893, -37005, -28674, -28668, -46346, -22850, -30938, -25079, 12563, 11280, -19153, -47722, -25451, -6162, -16558, -11021, 9984, 6210, -35578, -43102, -4302, 7219, 3550, -16453, -18142, -53071, -81971, -47971, -5213, 7721, 7931, 9103, 15445, -8330, -10443, -5508, -23065, -42508, -59206, -41521, -38525, -12330, 24638, 6197, 8224, -1650, -9682, -2924, -5557, -1533, -43412, -90466, -85935, -77017, -59616, -36364, -28128, 7355, 50130, 14880, -18046, 2507]
15867B507M633J4087n030j483K4456L697k9246k2689l8933J820R030J8781J1654
15854f716M0411m1628l6637k60j141k439k9831J5667J2971r471J5329k653L3299
15841a3099K5274l5732j9157J859K406J5919J8298j945J3843J1013j1568j1467
15829d356l700j5079j1266R345N290J7856j8797j5637j0116L1707M986M915K7978
15816B3126r928k0301M321K3427k9266j2306l204J6170j511m7034j4501K4811
15804d6196N9335p593j3769P104K5363q669k5080l369k1549j348n629M583L7677
15791H60J7170j0005k9108J7223N6119k08k3626o609k6506l4587q28M947j410
15778c6568M0943K8160M323n8023m2948J0195L0802K152Q074q480k3441L144J4557
$$ y = [2507, 7140, 21227, 16197, 14714, 39170, 42867, 13621, -9068, -48001, -46181, -37151, -18370, -6716, 33695, -7933, -44570, -44830, -45971, -48410, -78241, -62574, -49603, -59074, -43745, -46398, -13099, 12175, -23557, -42714, -40855, -38449, -22530, -4232, -6177, 7666, 18679, 7111, -4356, -8056, -23135, -34401, -25056, -19766, -1910, -20707, -36344, -46460, -14753, -9767, -4852, 23126, 13198, -7103, -2782, 20645, -8621, -20927, -24131, -7961, -9472, -56506, -71007, -46196, 13139, 5546, -8223, -1119, 24244, 15575, -9505, -12874, -34423, -35771, -41400, -36817, 860, 18030, 8025, -21083, -3860, 52259, 52051, 28425, 21816, -4690, -39277, -40105, -35158, -36568, 4375, 32535, 36858, -21165, -64113, -53918, -23116, -20964, -12890, -21370, -44811, -41667, -27110]
15765b7110j0288M274L4717K0138J2720N620o936j107m892l166J7156K2747L222
15752F7095J3396j9883K1271J0770m7975j0545j822m1911q513R155J6183L158
15740A0379L8330n466l1172j3308J4055P771k0142q325J9568L1307J3314j3861
15728D2450o5986j3192K939o911j0927K0409L3422m2441o338J8585J3304K0355
15716E669j1646m720j2191J0460J2869K7274J5577K452k4207l042K2718q821j9272
15703A3120p140j1727o074J3823n758m0473J9619r012j2678J2911K4064J5766
15691F441Q807j5900m2242k4885K2556J7841J4794J1482r164o215p044K4205O748
15678G424k9988o594J5996j1962Q525K6835J0237M104Q689J4149k3660Q429J5472
$$ y = [-27110, -37398, -33124, 1593, 21731, 34451, 40071, 33135, 32028, 27136, 23970, 41126, 63873, 67095, 80491, 60608, 81879, 92649, 44674, 34129, 32307, -9604, -18117, -8962, 7221, 10379, 48709, 43243, 12071, -1237, 12818, 20589, 447, -7878, 11690, 42997, 56311, 42450, -23536, -36728, -33789, -40700, -51627, -31218, 2204, -40237, -46575, -27990, -14686, 5669, -5977, -10697, -22888, -12428, 441, 27715, 43292, 45744, 21537, 18495, 41213, 32392, 13120, 5980, -5747, -11821, 2002, -3756, -44229, -24610, -33622, -46300, -33389, -9325, 6441, 15248, -652, -42894, -67779, -45223, -27382, -12588, -1106, -10270, -16485, -23529, 676, 7424, -22564, -29158, -13162, -25124, -16599, 10236, 20473, 24577, 33266, 47415, 23755, 32184, 47656]
15665D7656j400p636k1034k3007L1461m612j6348k682J0171j7923K0046j1937
15653B755j0371J789j2674k4187O091J1026R755K3575m7875k1244Q503J847L2102
15640a8908J2579n170J2901J1134J9075N293n045k4216l5308J7295J6718j4183
15628g835j9354R739J9627k42j6463J7948o533k9231k0275p721J7947J8474K0999
15615b920J9229j2614n802k9786n449L1506J9094j0856P180m454o838j9180k0473
15602d1363M8298k910j728k9616m4981J4088N306M1208K3176j3975l2744K7314
15590g927k1918j8665K4288k7313O342J8052O892O693J3997L7590K0154m846k9715
15577B3624m7069J7619J6099j3818j1700r63K0024M429k7344p703J0219K5499
$$ y = [47656, 46256, 38620, 17586, -5421, 26040, 21428, 5080, 2398, 12569, -5354, 14692, 2755, -7616, -5827, -18501, -42688, -36597, -25571, -15816, 7759, -40116, -61360, -52857, -51010, -18908, -6329, -11499, 1402, 12536, 31611, 36904, 31859, 7643, -27665, -10370, 6348, -7835, -27189, -17450, 2177, 1935, -14528, 3420, -3113, -32344, -52619, -60340, -42393, -23919, -2920, 16309, 3695, -2107, -31893, -37342, -5836, 13258, 2402, 9582, 5128, -1710, -20890, -41363, 6935, 4025, 2297, -27319, -72300, -58212, -52906, -11698, 11478, -2497, -35241, -7927, -29845, -48510, -24222, -51535, -45193, -27141, -20249, -13556, 441, 38031, 58185, 53339, 23624, -23445, -5826, 10273, -3545, -15245, -16208, 3816, 8245, -19099, -26802, -16583, 8916]
15565H916K3394M754j3687k533l3028l0643J9011n802k547J2742k0253K1906L8792
15552B1022J6831M3519J5618k7475m5956K1846K0186p680l4739M996k1593j2690
15540f115j7932J0919J472O296k3513r689L293J7496j566R064J3495k8741k6429
15527e1950J5987n680L740O571j359N568J0193J7791N902k373r973l599j051K2162
15513A1929j995l7398m9467J3256j2224L479J4471J138P116J6795J6225l037j923
15500b1635P680J5866K5634J2622J2015O006l9560m8067J3398M226J7225Q539
15488A3949J9487m801n088M028j5054j6171P353j2480k4312j1093J9432R586j1455
15475b6619K0913k5326l4247j6648L5280O3778M0767k0858l8777J6533J7856J6058
$$ y = [8916, 32310, 37064, 23377, 20844, -12184, -42827, -23816, -29618, -32165, -19423, -39676, -17770, 21022, 37853, 81372, 96990, 69515, 23559, 45405, 65591, 57911, 23172, 28168, 6575, -6115, -24047, -13128, -11656, -5360, -28873, -38562, -35269, -17773, -19339, -10275, 3220, -25521, -51950, -35963, -41643, -37903, -31332, -32691, -27123, -16930, 861, 6763, 4390, -5583, -9182, -10233, 11929, 9934, -27464, -76931, -63675, -75899, -72420, -57949, -56811, -49695, -32900, -16675, -19712, -21635, -13955, 1911, 27545, 40167, 52182, 58188, 18628, -29439, -16041, -11815, 5410, 13949, 33436, 28635, 23547, 27575, 12521, -3650, 3703, -8777, -33089, -44182, -24750, -15164, -26619, -5706, -31032, -65279, -81927, -46647, 17131, 57898, 37040, -1737, 14796, 32652, 48710]
15463D8710l498m903l454j4803n936K1766q009j2206j3041R554K061j7741l0371
15450c1871j7051P794K9018j12M753M1214K1636l3451m1360k976N659R884o717
15437a3580R793j8676J877K2317l969J8192K1851O35P21J7143q654n1012j2622
15424a5984j3244j5938k9260j2974P437J7418L9280O2630O505l1457k4745R17
15412i415j3515O76N1973L7277n7673k7482K1530J5012n431k4072k8833J1318
15400b8635J493k3604O913J6856K3138J7674l8199m883M9032L1356l238q498J1153
15387E0558J057L816K0471j3185L72j6742m2536R709J459Q940j6863N144k12J6406
15373B8394m655l6037l999k4425J9782L69K340K8511m997J2647p479j0720M281
$$ y = [48710, 45212, 40309, 36855, 22052, 16116, 37882, 29873, 17667, 4626, 14180, 16241, -1500, -31871, -48922, -41128, -12110, -12222, -7469, 33745, 55381, 21930, -19430, -22406, -16747, -6863, -13580, -3787, -22463, -20586, 1731, -2238, 15954, 37805, 38440, 39161, 56304, 47650, -3362, -15984, -29228, -45166, -74426, -87400, -79963, -62545, -23265, 39365, 45870, 14413, -10332, -9415, -22930, -22254, 29719, 66996, 9323, -18159, 3371, 18383, 12952, -11120, -39953, -28635, -27142, -50746, -43833, -26977, -3839, 13835, -24364, -29247, 19785, 51141, 47903, 39405, 50558, 51615, 55431, 75902, 62717, 63089, 46347, 3811, 13520, 14979, 23919, 7056, 12200, 11988, 28394, 23739, -12298, -16297, -40722, -20940, -20571, -18231, 10280, 5283, 17930, 10451, -269, 4012]
15360D012l1255o379P85Q636J6327J3111M200J3846R029k6639j4370K0884J9288
15347C1475j6076k4727r699K433K168J9103L029j5636j5308L1118M71L78l3250
15334b4521r91K3615k1743m25N0842K7858m661m3408m63j7315R188j7616K171
15321a7469q635K0453J3255k6943k0759J1339L2503N3217n0457k9887K1901N731
15309D249J9528k3877k1963K9627K793j6506k5345l3175K8169K5097L2224j6985
15297C836J5081K3310j7834k5876j4662o115J1957K0813r10J101o5634j3202J3177
15284e4958j0628L0559p401n846K5552K2464L689k473q025j5361k4738N8791J3436
15271B5061j1693j9152j3650M0135m2819l1833L923J9400J8805L7021J4221l5614
$$ y = [4012, -27243, -33622, -32837, -24201, -7874, 5237, 9437, 23283, 32312, 5673, -8697, 12187, 31475, 15399, -9328, -19027, -16594, -14426, 4677, 7706, -7930, -23238, 7880, 8351, 8729, -24521, -25512, -1897, -23640, -24065, 26777, 54635, 49974, 6566, 6103, -11212, -2024, -19640, -17469, -26104, -5651, 7604, -19339, -40098, -28759, 3744, 56961, 6504, -23383, -1482, 4249, 23777, -100, -22063, 7564, 10357, -6149, -31494, -64669, -36500, -11403, 20821, 3836, 18917, 42227, 24393, -1483, -16145, -22260, -10303, 10510, 9600, 10701, -54933, -68135, -54958, -65586, -35027, -42428, -48274, -22722, -258, 3431, 958, -7067, -22428, -47166, 11625, 25061, 13368, -5784, -19434, 20701, -22118, -53951, -50028, -30628, -11823, 25198, 39419, 3805]
15259C805n9095m87M692n450L0784J0149L2772M3498J0548l8089k882j7755l1550
15246a9060r243m327N26J2441J6412L601k1148N26m44k3142k6328k1641M4667
15233d7160K0217K1052j450j6216J9624J4287m353m1443k0746k2334N054O0096
15221a3372L2398O845q873k0969O021K6331k2177k4772l1751K0838K8766K2875
15209B2160l584j5976j5412J4585N439J8749p037J2810N039j7212P565j1552j4467
15196A107K2951k0401o288o827k4185J480J6987J128J2636K066l8065M0874L1822
15183C5285l3301Q953n44k3729k4763K1861M187n39J4038K2426M193j5632L0098
15170D2533J923n2850J0915j3700k161L6168J041k9022o149o323j2531j4441K1036
$$ y = [3805, -55290, -55777, -51085, -56535, -25751, -15602, 17170, 60668, 71216, 33127, 30245, 12490, -19060, -28303, -32630, -32104, -19663, -3251, 350, -20798, -20272, -20716, -43858, -70186, -91827, -47160, -26943, -5891, -7341, -23557, -3933, 10354, 6001, -35442, -56188, -78522, -73468, -13372, 19026, 25871, 16998, -3971, 2050, 28381, 6204, -18568, -50319, -29481, -715, 22160, 18576, 2600, -12812, 1773, 7212, 25961, 18924, 31734, 36773, 19561, 27126, 15574, 1107, 24058, 3657, -2631, -9458, -33643, -32163, -15176, -14048, -1412, 654, -37411, 3463, 35285, 1984, 10937, 10393, -13336, -38099, -16238, -12051, -12590, 1448, 23874, 28067, 12435, 42533, 44456, -8394, 2521, -11179, -13340, 22828, 23869, -5153, -11302, -17625, -30156, -44597, -23561]
15157b3561L2475o493k1767p437K4383k0082r796L2349j2340k7564j3184M040
15145d8977k61Q313k1090L725K394j2987P819K1543R705l5037M923n144k1472
15132h6546J5987J1906p961K0036L7695M97k6137j312J812O045P214n957J1973
15119a4748J6740J1875j7660j981k4671k2960K0030J7973j2602k2925j5917l300
15107g0146j8588M5318O3774J562j221j8260K2529R429l4138l0931o101J3689
15095b3084J3215J152J9011k4340l3565m7085J2310K0085j9641J8347K8617j970
15083c6948k4420R00L5669K3542J0454k7363j1519j2852Q916J2729J4598J1974
15071E680l6558J0675j5457q884R730J6927J0134j2286j0368m617K1573M0674
$$ y = [-23561, 8914, 2421, -19346, -26783, -2400, -22482, -32278, 71, -12269, -39833, -53017, -48977, -49238, -40925, -62015, -58290, -55896, -68883, -61064, -39521, -29816, -64853, -59930, -65074, -86546, -70559, -58653, -66614, -46578, -8883, -8386, -34523, -35835, -34023, -27978, -20764, -26721, -14748, 1992, 13867, -3793, -5774, -30445, -53405, -33375, -15402, -28004, -50929, -66846, -70146, -88734, -43416, 20358, 21920, 20699, 2439, 24968, 34397, 259, -30672, -36773, -23084, -9869, -8717, 10294, -14046, -47611, -94696, -82386, -62301, -81942, -63595, -34978, -36948, -61368, -60468, -24799, -1257, 9197, -18166, -29685, -42537, -33621, -20892, -6294, 5680, -30878, -20203, -35660, -44544, -34814, -17887, -7753, -20039, -30407, -35024, -13451, 27223]
15059B7223O036M386k0491l2726R310J9792l3874R88J5698M7911l2763m0865k2926
15046e2301O381M0271j1499j6661L773p417J1233j7170Q186J7984Q535r80j668
15033a1333M5399R792l4419k9153j4860L1534K8735l4602j9815j4701J3536K2318
15021g569k264j5239Q260J7960J5196k5127n7861J3899K2491P05k0743J5125J3628
15008b1539J5581K0047m651K7257n202Q808n321j1568k8178j032K096j642J7277
14995A1933K2593l0729l6374k789j3750j0155L8404K7134L7758J5879K146r604
14983E2446m5335n7608m4351N591K1908J6902O735J8186j7569k6788L5315M5545
14971A0977k1998k9791Q765J8012j9359j9090k0658K8806M4213J8141k5628j4396
$$ y = [27223, 33259, 37645, 17154, -15572, -6262, 13530, -20344, -19356, -3658, 44253, 11490, -29375, -52301, -45920, -5649, -17148, -33809, -30036, -37453, -26220, -43390, -35204, -17220, -8685, -9665, -11333, 34066, 43858, 9439, -19714, -34574, -3040, 25695, -8907, -28722, -43423, -29887, -7569, -9833, -25072, -16812, 1148, 16344, -8783, -66644, -52745, -30254, -29549, -50292, -35167, -21539, -5958, 14089, 9438, 36695, 31493, 40301, 34980, 23412, -4766, -5798, -3702, -5344, 11933, 34526, 3797, -32577, -35366, -49116, -59271, -20867, 6267, 44025, 59904, 62050, 52446, 7111, -50497, -94848, -89257, -67349, -50447, -43712, -25526, -43095, -69883, -34568, 10977, -11021, -40812, -32047, -14035, -33394, -52484, -73142, -44336, -123, 18018, -7610, -22006]
14959b2006J2526J5545K3279N793m5684l3840l196J3140k153M0247L7145J6547
14947E7343l5649m4991Q831Q202Q127J1895j2711K184m0989m9737J2446O0497
14935a4552K8185K1056K2314j3183k6577m6146k6585Q775l30J7622J0170J2982
14923f269L749j892j3030m521o6169j904L8966N7849j1864L403p054l529J6201
14910C936J6327m2228k9315j0297n422K3582J3033J9869K6723K2018k900k4400
14898A0926L8012K2962k7352k8857k0204k3057k7746p164J7817J8331J7536m700
14886a3496J580k5752k4278J6635J8018l629K4468J6030k6666j8242m558k856
14874d2746M683M4656n387M663K3986l3507m0170K7847l499J8164l337L210L7599
$$ y = [-22006, -9480, 6065, 29344, 35137, -10547, -44387, -47583, -34443, -36596, 3651, 40796, 57343, 21694, -23297, -14466, -6264, 1863, 13758, 1047, 3231, -37758, -87495, -75049, -14552, 13633, 34689, 57003, 43820, 17243, -28903, -55488, -46713, -47043, -29421, -19251, -6269, -2520, -4412, -17442, -21963, -88132, -90036, -51070, 6779, -5085, -1682, -8736, -12265, 3936, 20263, -21965, -51280, -61577, -66999, -43417, -30384, -10515, 16208, 38226, 35326, 10926, 48938, 71900, 44548, 15691, -4513, -27570, -55316, -62480, -44663, -26332, -8796, -13496, -11916, -37668, -61946, -45311, -27293, -30922, -6454, 9576, -17090, -35332, -39890, -42746, -38063, 6593, 1206, 5869, 29855, -3652, -43822, -15975, -19474, -1310, -4647, -1437, 36162]
14861C6162k2068l7706Q46K4833K748J964o217j6752K6642M1092M129j4224j9550
14848B1899k2129J6689k3115k0065L5572n917k3231k164K4860Q714o037r221k4013
14835b8158k9494l5713L566O3846K2329j733L4506K796l0718k4780k741NJ8255
14822h034L908Q572p85r722k777K1476J486l2616j7806L1494K7613J3875Q581
14809D5265r257j1424k3086k4378J0592J9406L4636K158k3771l3904O451L9016
14797C1704J0948k2809j0792m181J2976O314k9072m0061J8967j569k2729r134
14785e9438J3980j2704j1848J6164J0947R262l009L8766L868q497j3372J3552
14773b329M2471p02k6725L124J0751k8733m521L4229K2119l5785n068L4599L102
$$ y = [36162, 14094, -23612, -22766, 2067, 4815, 6779, 562, -16190, 10452, 51544, 55673, 41449, 21899, -230, 16459, -6656, -26721, 8851, 2934, -20297, -22461, 2399, 11113, 5076, -4145, -28158, -57652, -93365, -89799, -25953, -3624, -5357, 29149, 31945, 1227, -23553, -26294, -26289, -8034, -4126, 4446, 3661, -6061, -8838, 12638, 14124, -18492, -36298, -4804, 22809, 36684, 45265, 36008, 24584, 1498, -22880, -12288, 7118, 41754, 43912, 20141, -13763, -7312, 31704, 42652, 19843, 9051, 4870, 17846, 24160, -4912, -44973, -26006, -27575, -50304, -59438, -45458, -58162, -70010, -53846, -42899, -33637, -36646, 2120, 5988, -2509, -15881, -2329, 40142, 39440, 12715, 15839, 26590, -2143, -6664, 27565, 49684, 13899, 8831, 43430, 46532]
14760D6532j5950j7971J5131J7949k226k980l090k1254m917j3166j2943l0996
14748d5881p008J065M7838j0733m922P278j4389J914K2330K2135k8619j3745J3779
14735h958L5387m240q419o298J212p906j6920j8280N225L6179J5145j8930k4688
14722b1491o960j3776O27N3102P453j3246o4546L689N7405K7796k074k2717l9253
14709c3991j6973M2480K1242o256K3443J2986J152j4459R731R685j6833m8337
14697a6130j0268J3770k0813j2667j1155K1006L6989J9255j0845k5560j5265K2812
14685h871m662J6456L8421o878o324J3194m6304l645L4448J5344K3737r025m7301
14672H590k4829O230J6320K903j5724K3118J2468K0127k2003j8679j8940n405
$$ y = [46532, 30582, 12611, 27742, 45691, 43465, 40485, 37395, 16141, 11224, -1942, -14885, -45881, -52889, -51824, -3986, -14719, -19641, -12363, -26752, -24838, -2508, 19627, -8992, -22737, -8958, 26429, 22189, 13770, 7472, 8684, 778, -16142, -34422, -29197, 6982, 22127, 3197, -21491, -28451, -42227, -41600, 11502, 18955, 5709, -58837, -55148, 2257, 30053, 27979, 5262, -33991, -50964, -8484, 12758, 6502, 29945, 42931, 44083, 29624, 39355, 49040, 32207, -16130, -26398, -12628, -33441, -46108, -57263, -36257, 732, 19987, 9142, -16418, -31683, -8871, -13533, 2923, 41344, 34466, 28142, 41336, -4968, -8613, 25835, 41179, 64916, 55891, 8590, -16239, -10009, 6311, 9214, -6510, 16608, 29076, 49203, 27200, 8521, -10419, -15824]
14660a5824J9203J3000k8326j6849R998o121K9220o168P36K3131j5482J0309k0791
14647c964l3813k938L2353k602j2256L6859K2718M936J624K46l1613j3106K6763
14634B5207J14j1962N975l0702o001j7087J8378J1382J541q031J6576Q107J3073
14621B6570k0329l1470R460K6644M8929k6082m232J7340M508j8381l6783j9140
14609b2966P351p471K8972K7759k2437K9178j8953n579m276K520p293k5064N477
14596a2782k6692k0663J1040j0478K9504O021L209j1852k8200k728J894J9805
14584d1922R298K7996L0598j1196l477Q985J8134J248k2184O472K5758n2m0748
14571H910j5756J0656j9250K5571J1891J095j3305j361J3711m4002o9789J18M6330
$$ y = [-15824, 3379, 16379, -11947, -28796, -18798, -24919, 4301, -1867, -1131, 22000, 6518, 16827, -3964, -37777, -40715, -8362, -10964, -23220, 13639, 36357, 41293, 42917, 43163, 11550, -1556, 25207, 25321, 13359, 19334, -11368, -17369, -34456, -16078, -4696, -3155, -11186, 5390, 13497, 26570, 6241, -25229, -15769, 10875, 59804, 33722, 29490, 46830, 51338, 32957, -3826, -22966, -15615, -23086, 5886, 33645, 11208, 40386, 21433, 15854, 11578, 14098, 6805, -18259, -12782, -39474, -60137, -49097, -59575, -30071, -24050, -20841, -32693, -60893, -63621, -61727, -41922, -32624, -4628, 25970, 14774, 11297, 20282, 38416, 39664, 17480, 23952, 49710, 49658, 8910, -6846, 3810, -15440, 10131, 22022, 23117, 9812, 8451, 22162, -21840, -91629, -91511, -45181]
14558d5181l437J0607M4634J9912K2642l6066l43j1102l5786O571p317n747K9290
14545a1323R668n122K404L703M790K74j3797J76r528M151K3357K779l7810O020
14531b0258J7034o129k2470J8489K2813j7538l3453L2838K0000m557j1628L0965
14519B6106q350k1878j15J7637K2221J1811j5885k6852m119K5597P345q626m566
14506B0326j4771k7741K861k063o688K7210R91l2354l9978L548L1263N3421k5809
14493i784p753K0771K2296J4727j8043m719k6660j8010k081L1938L861l5766l0635
14480e9858j2675K7427L7246j8864k941L776m10q37j9187m127J1903M715K4511
14467i321J4902j4171m894o290L6742k3982r323J5478R353L791r998k0311M490
$$ y = [-45181, -48618, -38011, 6623, 26535, 49177, 13111, 12768, 1666, -34120, -27549, -34866, -40613, -11323, -1655, -6777, -4373, -670, 4120, 4394, -9403, -9227, -18755, -14604, 8753, 11532, -26278, -20258, -3224, -9353, -31823, -13334, 9479, -8059, -41512, -8674, 11326, 6769, -4859, 26106, 17756, -4122, -4237, 13400, 35621, 47432, 31547, 4695, 576, 26173, 33518, 24892, 20326, 5555, -22186, -19325, -21388, -28076, -866, 125, -32229, -72207, -68659, -37396, 16025, -9784, -17537, 3234, 25530, 40257, 22214, 17495, -9165, -27175, -29256, 2682, 6543, -29223, -59858, -72533, -45106, -7860, -26724, -29665, -25889, -26299, -27136, -46323, -50450, -38547, -33832, -9321, 5581, -8590, -13484, -19774, 16968, -7014, -16337, -859, 8494, 12285, 2287, -18024, -13534]
14454a3534J3913k8043O234L8577j7693L269p806j7294K8400K2007j5555l8283
14442b5808k166j461j346m924J8010J8626j8720j7422K1519K4187L7825M410k3686
14429B9044Q644q012j2078N3495R336p8724M750M2572p136j4823K8298L1639n0236
14416C6769k4559J5770r085J8183J9869O776n3741k3777j5162n380J4555j3505
14404c3287l934l3346l1294J6041K4822M2717J6613l4437J3118K3947k8136N894
14392b1282Q292k5563Q45m248P520r019J686K0746q657q993L3627J0270j6810
14379a1586j7752Q155J2747L511o796m955k6053j0974M289j7041j299p050J6685
14366e8119J6276J4265L5303J7654m684j0032L968M255J7623L0548k9459l601
$$ y = [-13534, 379, -27664, -21430, 17147, -546, 2723, -5083, -22377, 6023, 28030, 12475, -25808, -27974, -29435, -30781, -35705, -17695, 931, -17789, -35211, -13692, 10495, 48320, 52730, 29044, 37688, 29676, 17598, 71093, 80429, 1705, 6455, 49027, 41891, 27068, 55366, 87005, 36769, 12210, 27980, 18895, 37078, 56947, 63723, 9982, -13795, -28957, -34337, -19782, -33287, -37221, -70567, -101861, -85820, -60998, -18281, -1668, -36105, -22987, 960, -27176, -21282, -12990, -38553, -37708, -41956, -34436, -43455, -41769, -21023, -29680, -38673, -5046, 5224, -11586, -29338, -21183, -8436, -4925, -11721, -16676, -42729, -53703, -49414, -66455, -67754, -74804, -58119, -41843, -27578, 7725, 25379, 20695, 10663, 14631, 18886, 36509, 67057, 37598, 33997]
14354C3997J051j3687k6552l160K2224k689j3482j131O135K7032J1980l284j8030
14341B0404m1283J8418J1435j6064N39K3907K1700J6853k1259m2977j1031j2237
14329c1595Q528j6717k3292K2680P271K0569J6725K0832J1258R484J1958M012
14317F1713r255o030j9869L043q037N093l4304p057J0602j3323l264k096K1174
14304a610K07r497j3753r513m074k5066Q748p511r02K4178J4249k4660r333J0726
14290d7811r764J4472L8096l0804j3782J9253j0418O851N300L867k0368K0270
14278b4838J2499j0689K2303L4275l904N067k2192l3572k7491P456J9523J7888
14266c675K1584L041k0850N594K7324j6451k16p759r291j0403O619J0418K5681
$$ y = [33997, 35048, 21361, -5191, -8351, 13873, 11184, -2298, -3429, 2706, 29738, 41718, 38434, 20404, -20879, -2461, 8974, -7090, -6551, 17356, 39056, 55909, 34650, -8327, -19358, -31595, -23067, -39784, -63076, -40396, -33125, -12556, 4169, 25001, 36259, 45743, 57701, 61713, 52458, 46428, 26559, 29602, 21565, 26658, -7646, -14703, -4101, -17424, -20688, -22784, -1610, -1403, -10900, -24653, -34166, -38240, -63306, -54558, -62069, -62971, -38793, -24544, -49204, -58537, -47811, -57575, -43103, -5007, -35811, -49593, -30340, -40758, -33907, -28607, -24740, -45108, -24838, -12339, -23028, -725, 33550, 29646, 34713, 12521, -21051, -48542, -41086, -21563, -3675, 17909, 20950, 100, 5694, 33018, 16567, 16351, 8592, -699, -11102, -4483, 5935, 31616]
14253C1616J0067M137j5135j6481o86j4221k0773j1633J4422K0143j4719j8954
14241c2217J1189j4052K1134k5834N794L5840K1230K9128k4844m0808j304J6240
14229A496n032k666L2220J0374j2603L795j8144l7993J8439L1234k9951M812j879
14216e898l9419J6782L216R249j6761J1639N0829j1551j4243p614o43q73K0158
14203A4871l901l5426l4755n025K0233K3800j330J7521j6238k3491J6914j1327
14191c8154j3652N8055l721j7089j6093J4665K499L05j3246k4923j180J1098J4547
14178b6889m9362J6499M5343M428J271J6794p088P86k3656K0826J7395q354J8987
14165B6980j8305l1111k996R418j5095l0033K28J6729J3704L3876k0142j1480
$$ y = [31616, 41683, 45820, 30685, 14204, 13518, -703, -21476, -33109, -18687, 1456, -13263, -32217, -21028, -35080, -13946, -39780, -33986, 1854, 23084, 52212, 27368, -13440, -14744, 1496, -3536, -6202, 26018, 36392, 23789, 27584, 9440, -28553, -10114, 21120, -8831, -4019, -5898, -45317, -28535, -25319, -16070, -32831, -21192, 29637, 18086, 3843, -3771, -4414, -5287, 14871, 10970, -24456, -59211, -64236, -44003, -20203, -21533, -4012, -20250, -43741, -26827, -38154, -51806, 6249, 2528, -14561, -30654, -15989, -13490, -13185, -26431, -51354, -52534, -41436, -26889, -76251, -59752, -14409, -9981, -8710, 8084, 996, 1782, -21874, -1048, 16347, 7993, 26980, 8675, -22436, -25432, -16014, -31109, -61142, -60914, -44185, -30481, 3395, -16747, -28227]
14153b8227M9782M2210j566k5016m819J7657k5832j2700L544K0556j1493l8707
14141a4611r707J9256O616k24k3184O939J5266O186p23j1936n633P912L695j9821
14127a9969J2330J8861J729j6117R931J0852M4343K5273k0059n2902k6035k4294
14115c6057j9522k2369j920l071M8863m403j818K2978j283J0947J1953N166J116
14102A0580j2431j000M705k6688j2129o15R412J3864J8285N343N608K3667R165
14089D7766J2798l1440J2851O56k8648k0189l347O155j6108j7159K7067L4378
14077B4780K8998n878k4957m9382k2866J7479J839J5125j520j3682j8894j6728
14065f5686P782M2306K1365O59j4977m369j6953l23L1794K4517j5352m405J1022
$$ y = [-28227, 21555, 63765, 62199, 37183, 32364, 50021, 24189, 11489, 15033, 35589, 24096, -14611, -24318, -5062, 1554, 1330, -21854, -14915, 351, 6537, 5814, -6122, -11755, -3843, -148, -19969, -7639, 11222, 12951, -3166, 6765, 17617, 61960, 87233, 67174, 14272, -11763, -36057, -55579, -77948, -79868, -82939, -34076, -38479, -40297, -17319, -18602, -7655, 4298, 9464, 10580, -1851, -2851, 1854, -24834, -36963, -37578, -28166, -14302, 3983, 9326, 14934, 38601, 47766, 60564, 29124, 41975, 42631, 13983, -6206, -9553, -3398, -19506, -36665, -9598, 24780, 53778, 47900, 22943, -26439, -49305, -31826, -29987, -14862, -16382, -30064, -48958, -65686, -57904, -15598, 5767, 6426, -8551, -12920, -29873, -30196, 1598, 26115, 10763, 6358, 17380]
14052A7380L878J3297K3380k0131o1314q49r341o441K6618Q576L3185j5107l923
14039I208j9999m087M470r417K2290J0547k0009k6535j0240J2784K5600J4277
14027H889l2598L65j6410J4513L791J0552J7254M468Q082P576r22k2346m438k4016
14013b5240j1460K928k0402n974J4705K9361k1475J7388J245q914N702J8143M2733
14000C8740J1199j2502k4435k1206j8219n663J5724L0503M2971j2380k5434O241
13988B5539r23j7523l4674J2466M608j1703J0201J7327j4709k1629K0723O747
13976c550j9705j3450L7576K7645j0553k078j5022j9824K2633L0573p193k8118
13964a066j3102q057j7374j6294J6276N697l555j5371M1327j9238j6169J9495
$$ y = [17380, 21258, 34555, 57935, 37804, -23510, -24359, -33700, -40141, -13523, -4947, 28238, 13131, 9208, -10791, -14878, -10408, -19825, 2465, 13012, -6997, -33532, -43772, -30988, -5388, 8889, -23709, -23344, -39754, -25241, -21450, -10898, 6356, 10824, 18906, 26482, 25560, 3214, -1224, -25240, -36700, -33772, -54174, -60148, -45443, -16082, -37557, -20169, -18924, -27838, -22136, -3993, 38740, 49939, 37437, 13002, -8204, -26423, -32086, -16362, 14141, 57112, 44732, 19298, 25539, 24616, 7093, -27581, -15115, -10507, -22210, -12009, 5318, -9391, -31020, -10297, -3550, -23255, -36705, 871, 28516, 17963, 15885, 863, -18961, 3672, 34245, 27052, -1066, -14168, -22225, -39599, -55893, -39617, -33920, -37475, -52846, -11519, -30757, -46926, -27431]
13952b7431O040N814m153n088J588k91J1932K4209L2779J3765l3264m882k5655
13939d637l4254p117J1005K4140J5401M276K5136o848r334J7774M588j5890n3674
13926b9434r670K6207L8664Q33k8841l5087J4491J1563m632j018m2944m954P126
13913e7696K2159M4592j4201r948K7203o069l8704K819K7140K104J654o65j1520
13900a1132k9695p148j0986p914K3605L0387k83k7707Q233M2423J857P471K2212
13887D1323l088l3782l8767K7958J1672M0758L4820l1467l6419m619k5871R740
13875g742K7720l3039k4411P220K6721L2283j7229j74k0939J4538l9799o261L7618
13862c494K2521k8314M661Q430l3609k0204J992J9953k043p781K1576j2332j6147
$$ y = [-27431, -21391, -15577, -19730, -24818, -23230, -23521, -11589, 12620, 45399, 59164, 25900, 21018, -4637, -38891, -46008, -35003, -10863, 4538, 8814, 33950, 27102, 17768, 35542, 40130, 24240, -29434, -39104, -12897, 25767, 26600, -2241, -37328, -22837, -11274, -15906, -16924, -59868, -64822, -57696, -35537, 9055, -5146, -15094, 12109, 6040, -32664, -29845, -2705, -601, 1053, 388, -11132, -40827, -47975, -58961, -66875, -43270, -12883, -13166, -40873, -32640, 9783, 11640, 19111, 41323, 38235, 4453, -34314, -6356, 5316, 46074, 80894, 49427, 13008, 8389, -17482, -7742, 19978, -13061, -37472, -30252, -3531, 28752, 11523, 11349, -9590, 4948, -34851, -41112, -3494, 19027, -9287, -4626, 3804, -29805, -50009, -48017, -28064, -30107, -37888, -16312, -28644, -44791]
13849d4791l522O953O076Q200K1905L2097J2260o795k1332j2087k2324N754J15
13836a7491j1153M1485N749j0227j1970j5561l306K5289M0387j5299j989L300
13824B9214k290m8506k7098k474j1871j0365m746J9595L2215k0782Q92K6912K2077
13811B773j580k3624k0600J206L0404k5294k1599J860K1926J8223q592N784J2865
13798f248K661J3810M103L584m938J240N5321j049o1497j2550j9594l8507L0105
13785c3559J8345j8975J7116K2974M725j1211k9484K8902K3271k2898j2811J288
13773a2317J7570l882L4931o264j3920J7722K6272j8840j5945j1964J8448k8809
13761C002J069J6263j364P534K2171m289L2555r97l4218n1455J9974J8503p19
$$ y = [-44791, -48313, -41360, -35284, -27084, -5179, 26918, 39178, 32383, 11051, -1036, -23360, -17606, -17491, -28644, 12841, 18590, 8363, -3607, -19168, -22474, 2815, 43202, 27903, 25914, 29214, 26924, -21582, -48680, -51154, -63025, -73390, -78136, -58541, -26326, -47108, -46216, -19304, 2773, 1193, -22431, -43031, -41825, -11421, -36715, -58314, -56454, -34528, -16305, -24897, -19113, -6248, -3587, 10223, 14326, 17910, 12972, 14212, 69533, 68484, 6987, -5563, -25157, -63664, -33559, -15214, -34189, -17073, 5901, 10626, -585, -30069, -1167, 22104, -794, -13605, -12317, 5253, 1371, 36302, 30038, 16118, 33840, 60112, 41272, 25327, 13363, 31811, 3002, 4071, 20334, 18970, 26504, 48675, 44386, 76941, 75944, 41726, -9729, 10245, 28748, 28029]
13748B8029o17Q903k0457k5663Q494j6854j3902N116J4124j0632J6640L0995J2664
13735C6840k8414P080m374j0544N122M260j7440J5624K5334P987j311o832j3403
13722A9929o302J1852k0730l5759J1406L7693j246m1927j9336R766L0300K9251
13710B4897K5444M502M192j6429n163l437K985r943J2647p83q413j3822j6000
13697F77J0895J4935j4789J2624M0433j9934K0719O563j9611Q01L9558M2767N7338
13684A92976N7981P2893L7433j0325j4549n7003o2639q605l0390m4044m7663j6409
13672F9656J3629l528j0260j4349j9855j2175k0000j3785L2279L4183m29L2243
13660H7609J9291m5365n221m305l057r590m4135P146L7124K1638k257j5126K8323
$$ y = [28029, 27412, 36315, 15858, -9805, -1311, -18165, -32067, -26951, -12827, -23459, -6819, 24176, 36840, 8426, 15506, 11132, 588, 5710, 9970, -7470, 8154, 33488, 41475, 40164, 33332, 19929, 13627, 25479, 4749, -31010, -19604, 18089, 16843, -25084, -44420, -34654, -4354, 24897, 50341, 54843, 59035, 42606, 37443, 34006, 36991, 27048, 39695, 38912, 30499, 16677, 677, 11572, 26507, 11718, 24342, 64775, 44841, 65560, 72123, 52512, 53313, 92871, 135638, 192976, 250957, 323850, 361283, 350958, 336409, 279406, 216767, 208162, 177772, 133728, 86065, 69656, 83285, 79757, 69497, 55148, 35293, 23118, 3118, -10667, 21612, 55795, 55366, 87609, 106900, 61535, 56314, 52009, 48952, 39362, -4773, 2373, 39497, 61135, 58878, 43752, 72075]
13647G2075N1898M8226J3195K3326M6829N0303P8137J16927J80805K30606J78672
13636A090999J25539M117k22788k48007j77009j25458o1328r6694k4300J639k4322
13625B42388k2336o0620l8146J4098k864j6795J5748J7761l6320r619J1813M380
13613A19488k4736l0609K5715J0185p8J5355j6990K3157l278j3893K7425K4072
13601A55813J2650K6671K3926q420O2413J08211J40701J73204K17586J94831J16673
13590A224259K160j90640k38288j56506j15395o6276n9278p7700m1945j7649j939
13579B60803j728n1386l4662O547j1861n3273J552J9356J6094k0246j2837l8872
13567G9487l711j9881O032J6470K8515j6718l3054M66K8001M608J1404j131J6436
$$ y = [72075, 123973, 172199, 185394, 208720, 255549, 305852, 383989, 500916, 681721, 912327, 1090999, 1216538, 1220655, 997867, 749860, 572851, 447393, 386065, 289371, 265071, 266710, 242388, 220052, 159432, 121286, 135384, 132520, 115725, 131473, 149234, 112914, 103295, 115108, 119488, 94752, 64143, 89858, 100043, 99965, 115320, 98330, 121487, 118209, 104316, 131741, 155813, 168463, 195134, 219060, 210640, 273053, 381264, 521965, 695169, 912755, 1107586, 1224259, 1226419, 1035779, 797491, 640985, 525590, 459314, 400036, 322336, 280391, 262742, 260803, 259075, 207689, 173027, 179574, 167713, 114440, 115992, 135348, 151442, 131196, 118359, 79487, 75776, 55895, 61927, 78397, 106912, 90194, 57140, 57606, 85607, 90215, 101619, 100488, 116924]
13554A16924N067J0761J3651N597L3840P0249R8962O1759M4141l3839q3274o3659
13542B80179l6866m6263Om0661l9844m4376m0331L100L3005J1029j2061l9500
13530B7417j0856J2152J9073r900K0734J2241J8200K120j7158l1411k7434J8906
13518C4084K3563m6919k6734J5881J1121O664L1072K0484l3351l480L9233k6088
13506D5530r01K8768J3296J671K068M290j4574j0311j02m2306P289L0168j955
13493F2931l0874K0178L481J404K490J3527K5244k0439j9721l1671N497J4460
13481D6507K714m9019K3405L020N450N1382L459p789k059k0024K5955P31r868
13468G3864m510L2074J6787n0073m6315j3586P5L0469M4262N0328L7606M4699
$$ y = [116924, 121991, 132752, 146403, 152000, 185840, 256089, 355051, 416810, 460951, 427112, 343838, 280179, 243313, 197050, 197056, 156395, 116551, 72175, 31844, 34944, 67949, 78978, 66917, 27417, 16561, 28713, 47786, 37886, 58620, 70861, 89061, 91181, 74023, 42612, 15178, 34084, 57647, 10728, -16006, -125, 10996, 17660, 48732, 69216, 35865, 32385, 71618, 45530, 44629, 73397, 86693, 88364, 90432, 94722, 80148, 69837, 69735, 27429, 34718, 64886, 62931, 32057, 52235, 55716, 57120, 59610, 73137, 98381, 77942, 58221, 26550, 32047, 46507, 49221, 202, 23607, 26627, 32077, 83459, 86918, 79129, 77070, 57046, 83001, 83732, 73864, 69354, 101428, 118215, 68142, 21827, 8241, 8316, 38785, 83047, 133375, 170981, 215680]
13456B15680K6045K8400P2514J05869J47946K34363K88869L54868L34599K72484
13446B081637J8845k41870l60153l75824k78733j49128j20029p6046q5093l4786
13436C78820n2330k6452m4204l6891l1051l4118L5300k2679m2084j530M7984K2728
13424A93493r059k7279k4280j505j5752m083k9870k33J9437J0937m4459K3894
13412I1241M258N853J3618P421j6597J856Q609M091l9480J6327L1122L0392p141
13399A51570l0399k7063m146k1744l97K2236L2826n220p583n708O268l3078j9178
13386E8384J4995K8850k6929l8219m4509J9153O5228m237m818j8423k4431N391
13374C0435J5024j9516k439j0080n86M617o549J9770K1363k4448J4326L5j0215
$$ y = [215680, 241725, 270125, 342639, 448508, 596454, 830817, 1119686, 1474554, 1809153, 2081637, 2100482, 1858612, 1498459, 1122635, 843902, 694774, 574745, 498699, 413606, 378820, 326490, 300038, 255834, 218943, 187892, 153774, 189074, 166395, 124311, 122781, 170765, 193493, 184434, 157155, 132875, 131370, 115618, 111535, 81665, 81432, 100869, 111806, 67347, 91241, 95499, 101352, 114970, 122391, 105794, 107650, 116259, 120350, 80870, 97197, 128319, 158711, 151570, 121171, 94108, 89962, 68218, 67821, 90057, 122883, 117663, 110080, 104372, 110640, 77562, 58384, 73379, 102229, 75300, 37081, -7428, 11725, 76953, 72716, 67898, 49475, 25044, 30435, 45459, 25943, 23504, 13424, 12838, 17455, 10906, 30676, 52039, 27591, 41917, 41952, 31737]
13361C1737j7599k1816J2889j8468j2217Q834P340j883J788M8463K7264J7311
13349H3643j6405k6000O592N8452K9626l2827j7356j528K082K7700j1587m8230
13337E4162n772J0518J8012j4921k6j247N274J9667k2901k4921k0995O664O450
13324B9964J9379M1165M6064m8445k1612N272R542l608k7885K0370J7733R217
13312I7156K6875K8603J8850J0013l3824j6980j8084l1644j4793m979k0443P176
13300D7926K7010R546l5226k8316J0904N5249K6346M550J8909k1045m3743O237
13288G8347J7841k0715j1619J7874O05R12L0905o378j0524K4804K8594m2474M009
13275A12181k3358k6194K0572N2293L2188l504k685j190l3030j089K6782J4891
$$ y = [31737, 14138, -7678, 5211, -13257, -25474, -16640, -9300, -11183, -9395, 39068, 66332, 83643, 67238, 41238, 47830, 106282, 135908, 103081, 85725, 84197, 86279, 113979, 102392, 54162, 48390, 58908, 76920, 61999, 61973, 60726, 66000, 85667, 62766, 37845, 16850, 23514, 29964, 49343, 90508, 136572, 88127, 66515, 71787, 81329, 77721, 49836, 70206, 87939, 97156, 124031, 152634, 171484, 181497, 147673, 130693, 112609, 80965, 66172, 61193, 40750, 47926, 74936, 84482, 49256, 20940, 31844, 87093, 113439, 117989, 136898, 115853, 72110, 78347, 96188, 75473, 63854, 81728, 82333, 83245, 114150, 107772, 97248, 122052, 150646, 108172, 112181, 88823, 62629, 83201, 135494, 167682, 164178, 161493, 160303, 127273, 126184, 152966, 167857]
13263A67857J2898N0078J2945K5115M7721N6942j458n937l8257r804M176p050
13251C15226m3119m1840n719m730n0669k3980l5849l8554j0254K0187J2479n339
13239H7839j6576J9973O105q9n355l9667k981o967k4642k6114J928J701M3914
13226C9069L3460k52L320k1214n3340j216N494k621o430L1490l71m687K7941K2045
13212G2688j0131K2280M8354k4477m9916k8302k7718p622q077J9074M8620J0228
13200F5001j6870Q053J3757L684M3273M3537K0514J9555K2121K0167J9219l5038
13188B26973k2138l5242k9726j1579k8468k4898m973J8864n197Q569q896l619
13176G9670o433P423J3230M845J1083L9294L0721K3273K514j1917p517o38Q919
$$ y = [167857, 180755, 230833, 243778, 268893, 316614, 373556, 372098, 366161, 327904, 318100, 322276, 315226, 272107, 230267, 224548, 219818, 169149, 145169, 109320, 70766, 60512, 80699, 93178, 87839, 71263, 91236, 97341, 97252, 91897, 52230, 49249, 42282, 17640, -8474, -6546, -4845, 39069, 72529, 72277, 75597, 54383, 1043, -173, 5321, 2700, -3730, 27760, 27389, 22702, 50643, 72688, 62557, 84837, 133191, 108714, 58798, 30496, 2778, -4844, -12921, 6153, 54773, 65001, 48131, 56184, 69941, 73625, 116898, 160435, 180949, 200504, 222625, 242792, 262011, 226973, 204835, 169593, 139867, 128288, 99820, 74922, 69949, 88813, 83616, 92185, 83289, 79670, 73237, 80660, 93890, 98735, 109818, 149112, 179833, 203106, 205620, 193703, 186186, 185548, 194467]
13163A94467J8658O019j7367k6203j5798K4616j2251j9046j5737K6289o843o4161
13151I2643k6179K4834Q141J9839J044O435L919o304q189q559K528j2553k9158
13138F8441K7611Q011J0679J8024J0914M4530L313j6827N6906M9907r603o4813
13126B07093j7310J4792l0229J3029R905l933K505R796m063P34L8225M6507P696
13113B94747K6906K5809k6331m997K6168L5602r054k860L7952l1651M660K526
13101C79477K3487K5282l3840l6695P495L1555L8135j0160o9946n0241J118j7537
13089B88130J3795J8428n675m5123J0474J0007Q341L4757K8219R964l793J1129
13077C78653L0667L1736Q186N0716P499k818O807J437p1021m2428L7183J4672
$$ y = [194467, 213125, 219144, 201777, 175574, 159776, 184392, 172141, 153095, 137358, 163647, 156804, 92643, 66464, 91298, 99439, 119278, 120322, 126757, 130676, 124372, 116183, 107624, 110152, 97599, 68441, 96052, 104063, 114742, 132766, 143680, 188210, 191523, 174696, 231602, 281509, 271906, 207093, 189783, 204575, 174346, 187375, 197280, 193347, 195852, 205648, 201585, 202319, 240544, 287051, 294747, 321653, 347462, 321131, 316134, 342302, 377904, 368850, 365990, 403942, 372291, 376951, 379477, 402964, 428246, 394406, 357711, 365206, 396761, 434896, 424736, 354790, 304549, 305667, 288130, 301925, 320353, 314678, 269555, 280029, 290036, 298377, 333134, 361353, 371317, 367524, 378653, 409320, 441056, 449242, 499958, 507457, 504639, 511446, 512883, 441862, 399434, 436617, 451289]
13065D51289J2353N9766K3365J4265L763L5888M1516J3577L8313K7951K7972R911
13053G59929K567l6452J0K0218N7492O1637P0451R5260M4583L1532O3599N7380
13041A228206L8790J7732l0897m496J6766M1916P1480J00697J85634J70196J93748
13030B029772K18768K63890L03097K77459K71935L18835L81490M56773N35263
13021E057282O93263Q82910J105948J378690J684073K130053K830822L615142
13013A9378183M591821N753227P287545R397452J2176677J5890857K1449014L0549961
13005A26474737M5187564O3010985P1192046O2377419L9663412j5067826n0610564
12998C42227773p5530983o7509530m3726983k8943647k0605079j5341350j1673567
$$ y = [451289, 463642, 523408, 546773, 561038, 564801, 600689, 642205, 655782, 694095, 722046, 750018, 759929, 762496, 726044, 726054, 746272, 803764, 865401, 935852, 1031112, 1075695, 1107227, 1170826, 1228206, 1266996, 1284728, 1253831, 1249335, 1266101, 1308017, 1379497, 1480194, 1665828, 1836024, 2029772, 2248540, 2512430, 2815527, 3092986, 3364921, 3683756, 4065246, 4522019, 5057282, 5750545, 6633455, 7739403, 9118093, 10802166, 12932219, 15763041, 19378183, 23970004, 29723231, 37010776, 46408228, 58584905, 74475762, 95924776, 126474737, 171662301, 234673286, 305865332, 368242751, 407906163, 392838337, 342227773, 266696790, 199187260, 155460277, 126516630, 105911551, 90570201, 78896634]
12991G8896634r177937p363505o030862m967324m219952l753547l374688l055224
12983C6953595k808974k597804k393883k207245j986593j800473j621412j394138
12975B0143073j224945j060884r20158p95664p87600p29153o55122o36023o12344
12966A2721180o17272n84870n75558n91869n46127n18588m33206m24134m15047
12957H014509l22580k80571k35710k06483k34299k12927j97960j86320j84618
12948E953041j95955k10663k16391k14293k68810k55340k21022k25403k63129
12939C882035k21811k15061j97095j69777j41398j45377j66254j90846j96899
12930B237517k32573j68580j31830r8331o4166l5654o0742q1746o6256q9404o3357
$$ y = [78896634, 69718697, 62355192, 56324330, 51357006, 47137054, 43383507, 40008819, 36953595, 34144621, 31546817, 29152934, 26945689, 24959096, 23158623, 21537211, 20143073, 18918128, 17857244, 16937086, 16141422, 15353822, 14624669, 13969547, 13333524, 12721180, 12103908, 11519038, 10943480, 10351611, 9805484, 9286896, 8853690, 8429556, 8014509, 7691929, 7411358, 7175648, 6969165, 6734866, 6521939, 6323979, 6137659, 5953041, 5757086, 5546423, 5330032, 5115739, 4846929, 4591589, 4370567, 4145164, 3882035, 3660224, 3445163, 3248068, 3078291, 2936893, 2791516, 2625262, 2434416, 2237517, 2004944, 1836364, 1704534, 1606203, 1542037, 1506383, 1445641, 1363895, 1297639, 1208235, 1144878]
12919A144878k8109j6915l7585o82j491j2356j567L0578L96K4274L1481P594N4966
12906A195462M1812Q7096J94953K63351L09261L75377N51288P62888Q47161P70377
12896E399026M47516j55592o16130q78206r16621o09531m22168k70469k02450
12887A775375j86236r4351j08445q6339p4252j7532l8389r5066m2731l0781m9706
12876I51547p2288o8278o7329n4193l0599l2400j4856M039K4809K5375j562m855
12864F59410k4907n701j0991k322J2624l851l9002r58J1613P3472M0319M7870
12852G57576R2745R2805L3523J3497p2214j31219j17336q6558m1907j4152p2386
12841D54374l3307k332m8681k8062J3518k1751k4506J7578K7101j3966m0736k6191
$$ y = [1144878, 1116769, 1099854, 1062269, 1061587, 1060096, 1047740, 1046173, 1076751, 1077147, 1101421, 1132902, 1140496, 1195462, 1237274, 1324370, 1519323, 1782674, 2091935, 2467312, 3018600, 3781488, 4628649, 5399026, 5846542, 5690950, 5074820, 4196614, 3279993, 2670462, 2248294, 1977825, 1775375, 1589139, 1494788, 1386343, 1300004, 1225752, 1208220, 1169831, 1074765, 1032034, 1001253, 951547, 879259, 810981, 743652, 689459, 658860, 626460, 611604, 615643, 640452, 665827, 664265, 659410, 634503, 628802, 617811, 615489, 628113, 624262, 585260, 584302, 595915, 669387, 709706, 757576, 850321, 943126, 976649, 990146, 917932, 786713, 669377, 582819, 540912, 526760, 454374, 421067, 418735, 370054, 341992, 355510, 333759, 309253, 326831, 353932, 339966, 299230, 273039]
12829B73039M835j5600j823M574r538j0644P429J1900L917p897k9708j3122l5580
12816A81782k6855o7722m8764J0820K9517J7998o083l46J1938K588M7553M1731
12804A94157q863r342J1283N47r342j0407j18j7493m003O2645K1962P166j133
12791B37059j2109q704l000j6902k4407J4822k437r770j2871J3839k9018j4100
12779A32402l21J5645O984J8433L1337J528j7970n851k0902k3187j6681l0311
12767I1106j485M966k2948j2250n030K3649M058K696L0131n822L399M0097l486
12754A49081l8982k6112l3514J7717J3682J6957j2544J8151N699m1035j3329o287
12742D9484K1060J3615L928j4565j5859J4681j3529m0620P717J3565j74P908K0487
$$ y = [273039, 277874, 262274, 260451, 265025, 255487, 244843, 252272, 264172, 268089, 260192, 230484, 217362, 181782, 154927, 87205, 38441, 49261, 78778, 96776, 90693, 90347, 102285, 104873, 152426, 194157, 185294, 175952, 187235, 187782, 178440, 168033, 167915, 150422, 146419, 209064, 231026, 238192, 237059, 224950, 216246, 213246, 196344, 171937, 186759, 184322, 174552, 161681, 175520, 146502, 132402, 132081, 147726, 154710, 173143, 204480, 206008, 188038, 182187, 161285, 138098, 121417, 91106, 89621, 94587, 71639, 59389, 54359, 78008, 82066, 84762, 114893, 109071, 112470, 152567, 149081, 110099, 83987, 50473, 68190, 81872, 98829, 86285, 104436, 110135, 69100, 55771, 49484, 70544, 84159, 88087, 73522, 57663, 72344, 58815, 18195, 25912, 39477, 39303, 47211, 67698]
12729F7698l6204J1555M1818l3557j9273l989o23M208j8428k5441J604j2464r077
12716c2173J2768J3331K7377J2573J9314J4447o931l5472o64K387K8077N478M229
12703F4741m0816m8573K3928M1389q948k5564j6991j609n82k5345j6507j9690
12691g4567l6339P190L7188L0346J1897O76J378p531M494J9974L9884l3066l7471
12678c5947K3303K1005J0916q114l218L3499J6107j2299l9956o984j0553R572
12666b669K0087o068n426M6282J7464j9246k8446o3811m033L2961L2242l0779
12654a1442n1467M342K8837K9072K5566J322j6544J5504R892K9142j4922l0426
12642A8876j2018Q111k2728J0550K5679j7544m6002M01J8618l330K8034Q405J125
$$ y = [67698, 31494, 43049, 84867, 51310, 32037, 28048, 27425, 31633, 13205, -12236, -10632, -23096, -32173, -19405, -6074, 21303, 33876, 53190, 67637, 60706, 25234, 24570, 26957, 55034, 60512, 64741, 23925, -24648, -720, 40669, 31721, 6157, -10834, -12443, -13025, -38370, -54877, -74567, -110906, -103716, -66528, -36182, -24285, -23609, -22231, -29762, -25268, -5294, 34590, 1524, -35947, -12644, 8361, 19277, 11163, 7945, 41444, 57551, 45252, 5296, -1688, -12241, -2669, 17418, 11350, 5924, 52206, 69670, 50424, 21978, -41833, -45866, -12905, 19337, -11442, -62909, -58567, -29730, -658, 24908, 26230, 9686, 25190, 35082, 64224, 49302, 18876, 6858, 14969, -7759, 2791, 28470, 10926, -35076, -34675, -16057, -19387, 8647, 17052, 18177]
12629A8177l88j5935q811q782l4673j0239K3703M0328J3413q390k3135l958K0856
12616B166m247J0320M49p87j7587l4882l785M5461L6317O306j0019j9134K0698
12603C1276K374J7264K3998n314m6381k1035K9870O505j9162K781K2243l768J818
12590D2469J8979J6992j270j8995k1523k0143J6154K0515J9946j1692j426P706
12578F7712K2093L479n702j4279L49j410l1355J3371K6550k1217j0540L724j361
12565E1414k0161M77M5326M9840L136L6712M0293L1209O6267O1575L1307R1845
12553D89240J91604K69569L54306L89686L28178J35147j45235l29378m15996k74991
12543I92130k04980j63578p8164q0447l7073m4908n8854k2345M240J4500k5453
$$ y = [18177, 17789, 1854, -6957, -15739, -50412, -60651, -36948, 3380, 16793, 8403, -14732, -18690, 2166, -2081, 8239, 8688, 7901, -9686, -44568, -48353, -2892, 33425, 39731, 29712, 10578, 31276, 33650, 50914, 74912, 69598, 23217, 2182, 32052, 38557, 19395, 22176, 44419, 40651, 42469, 61448, 78440, 77170, 58175, 36652, 16509, 32663, 53178, 73124, 61432, 60006, 67712, 89805, 93284, 87582, 73303, 73652, 72242, 40887, 54258, 80808, 59591, 49051, 52775, 51414, 31253, 31730, 77056, 126896, 130032, 166744, 207037, 238246, 304513, 366088, 397395, 489240, 680844, 950413, 1304719, 1694405, 2022583, 2157730, 2012495, 1683117, 1267121, 992130, 787150, 623572, 545408, 464961, 427888, 382980, 324126, 301781, 306021, 320521, 295068]
12532B95068k6115n06k2621k9686n0240n4417J9664J0355J9466k2003l4670L103
12520A07398q877k6599K8485j1285J1334L004j0772j6851K1963m646j7942o20
12508G4592j462j739j2589j2147n773j426k7039k2975j0947L926N5438K9050J2638
12495G9547l014o566k7220p471l8506M240k070Q318K5980J9398l2970K4233k3232
12482B0667l2390o361J2099J3597m931J3067J8024j1161k2331q897K5771M5273
12470F2427j0576K225q412l7432m61j1713K0948J9349m4035j3672J8985J1629
12458I262l7300R600m622q22J7306j0280K7200j898n318J1370J9157L1654l479
12445F1830m1431l05k84J4467K2082l4420j5867J4506P957K0422r80O051J8013
$$ y = [295068, 268953, 268447, 245826, 216140, 165900, 111483, 131147, 141502, 160968, 138965, 104295, 107398, 98521, 71922, 100407, 89122, 100456, 103460, 92688, 75837, 97800, 93154, 75212, 74592, 73130, 71391, 58802, 46655, 40882, 39456, 12417, -10558, -21505, -17579, 37859, 66909, 79547, 76533, 69967, 42747, 35276, -3230, 1010, -1060, 7258, 33238, 52636, 19666, 43899, 20667, -11723, -18084, -5985, 7612, 2681, 15748, 33772, 22611, 280, -8617, 17154, 62427, 51851, 54076, 45664, 8232, 7771, -3942, 17006, 36355, -7680, -21352, -2367, 9262, -28038, -18438, -23060, -23882, -6576, -16856, 10344, 8446, 3128, 14498, 33655, 65309, 61830, 20399, 20094, 19810, 34277, 56359, 21939, 6072, 20578, 28535, 48957, 47977, 54028, 72041]
12432G2041J1533l3525k2817J0996R59r557j8120J9577P973J3811M2923j3004
12420H2790m1820N07J7008k2327J2077J7810L195k7084r102K128K956J6442L048
12407E7628j5329k8733j2807j1215j4221L8598N5707J816j0199k5915j2324J7048
12395D0054K4180j4204j8738K0079k167k4068L6849l2371k5634M3566l6322j2551
12383a327j0214J2150K9367N292j5041R121J473j6937k2551p319J4653j7353J020
12370a7666K2475Q674J7669K425p166r15J6716K0619l1617j2911j0225N1M634
12357A2763n733r624J7933K7973K0790k5085j8913p25p545L2125J456M658N741
12344E5814k7808k9039j0928M064l5455l6767L283M1102K4428K0257k8047k1489
$$ y = [72041, 83574, 50049, 27232, 38228, 39187, 29630, 11510, 31087, 39060, 52871, 95794, 82790, 40970, 41477, 58485, 36158, 48235, 66045, 69240, 42156, 33054, 35182, 38138, 54580, 57628, 42299, 13566, 759, -10456, -24677, 13921, 69628, 71444, 61245, 35330, 23006, 40054, 64234, 50030, 31292, 51371, 49204, 25136, 61985, 29614, 3980, 47546, 11224, -1327, -11541, 609, 29976, 35268, 20227, 29348, 30821, 13884, -8667, -15986, -1333, -18686, -17666, 4809, 13483, 31152, 33577, 26411, 25496, 42212, 62831, 31214, 18303, 8078, 8129, 12763, 7030, -2594, 15339, 43312, 64102, 39017, 20104, 19379, 11834, 43959, 45415, 50073, 55814, 28006, -1033, -11961, -7897, -43352, -80119, -76836, -35734, -11306, 8951, -19096, -40585]
12332d0585o386J0763K8922K7669J4949k0855n7511j5868L8019L4518M9913p075
12320E6473j3608m9275j0171R465n08j1426N868R936K913n468J2207k7631r964
12307c1189j1898K0755J8848n230j4511K1621M151j5500j9645K1976r782J6750
12295c654L3980l433j5460j1456J2247j3667J8388N51k3003k78K2209K6543p386
12282C5581l628k2115j6274J279J6546M5419j974j7943l2724k2004k5637J2950
12270c0524J2289N614O595L0371L1326l4770l6346L193j2691J6490K0620q730
12258C437K1478K637j9237j4560Q033K975K0829K0290Q897J2130j8906k313k513
12245D3177K1211K1781l1671l1875j2676J7181K3969k9669r425L154m561J0440
$$ y = [-40585, -46971, -36208, -7286, 20383, 35332, 14477, -43034, -58902, -20883, 13635, 63548, 56473, 42865, -6410, -16581, -7116, -7624, -19050, -13182, -3246, -333, -5801, 6406, -21225, -31189, -43087, -22332, -3484, -8714, -23225, -1604, 2547, -12953, -32598, -10622, -20404, -3654, 30326, 26893, 11433, -23, 12224, -1443, 16945, 17496, -5507, -5785, 16424, 42967, 35581, 31953, 9838, -6436, -5157, 11389, 56808, 54834, 36891, 4167, -17837, -43474, -30524, -18235, -12621, -6026, 24345, 55671, 20901, -15445, -12252, -24943, -8453, 12167, 3437, 24915, 27552, 8315, -6245, 1788, 4763, 25592, 45882, 54779, 66909, 48003, 45690, 43177, 64388, 86169, 54498, 22623, 9947, 27128, 51097, 21428, 12003, 15157, 10596, 21036]
12233B1036K3485J9353m1306n3036J6786Q942k5265K7400M5573k1470k141L1245
12221E0602K1521j4693j6601m8841N350N2259r69k846n323n103j3141N778Q358
12208C6351K2378J3947L998q145R815N397n487m0528j6338j8288k9029K0436j2501
12195a7994N00R652J1046K3965M381p54j2652L740k807k0293o816J2571L3959
12182C8498J1313j8055k6541J806l7619j5496K8348p029N751L2016J4715J020
12170B8727M360k814r5j1381j6588J5634j2085r380j0290P155L2434l315j9906
12157B456j8053J7023J5756j1915j7034J6379m1975q794j2647j5614J1340j086
12145f4164K1785L9476p123Q372k0703N838K5399K8437m873j5075k2586p237p976
$$ y = [21036, 44521, 63874, 22568, -30468, -13682, -4740, -30005, -2605, 42968, 21498, 19357, 50602, 72123, 57430, 40829, -8012, -2662, 49597, 48628, 45782, 40459, 35356, 22215, 27993, 36351, 58729, 72676, 76674, 68529, 78344, 83741, 78254, 37726, 21388, 3100, -25929, -5493, -17994, -17494, -7842, 3204, 27169, 31550, 30796, 18144, 21884, 19077, -1216, -8032, 4539, 38498, 49811, 31756, 5215, 7021, -30598, -46094, -17746, -24775, -19024, 12992, 27707, 28727, 33087, 30273, 30178, 18797, 2209, 17843, 5758, -3622, -13912, -6757, 25677, 22362, 2456, -15597, 1426, 17182, 5267, -11767, 4612, -37363, -46157, -58804, -74418, -63078, -64164, -42379, -2903, -10026, -1654, -22357, -16519, 8880, 37317, 32444, 17369, -5217, -12454, -20430]
12132b0430j0236J597o002K8029k0975n691M268K0096K703j63r628k2782K073
12119c7141o678J0367M5718L7308P396j8849l143Q243K394j7236m6950l95j0808
12106b9774N96K0035K958M086r048p408l1288j9339M692N3214L7439R6o922l5250
12092a5913L3558M1705l2525j3303l7016o430p614j4186n757K0014M4154J1381
12080A8068R303J0336l959p22j2676J0690L115o079j95r823J950K1714J1087k1995
12066C0814n958Q478J7427l090J4578J6556l1141k9655k5005P961M1228J3954
12054E6147j0711J0567l0733k1894k1214j024P492r2L204p419K5607J341k3155
12041a1884K809K119O736J0050k3838J2292K5368p503J3719O461j1256J307p443
$$ y = [-20430, -30666, -29069, -35071, -7042, -28017, -33708, -29440, -9344, -6641, -6804, -16432, -39214, -37141, -43819, -33452, 12266, 49574, 56970, 38121, 34978, 43221, 45615, 28379, -18571, -18966, -29774, -29178, -9143, -6185, -2099, -11147, -18555, -49843, -69182, -64490, -11276, 26163, 26259, 19337, -15913, 17645, 59350, 26825, 13522, -23494, -29924, -37538, -51724, -57481, -37467, 6687, 18068, 27371, 37707, 33748, 33026, 20350, 31040, 34155, 28076, 27881, 18058, 20008, 41722, 52809, 30814, 24856, 33334, 50761, 47671, 62249, 78805, 47664, 18009, -6996, 965, 42193, 56147, 45436, 56003, 25270, 3376, -17838, -18862, -11370, -11462, -8258, -15677, 9930, 11271, -11884, -9075, -6956, -220, 9830, -14008, -1716, 23652, 16149, 29868, 36329, 25073, 26380, 18937]
12028A8937j1551k7143R017N2717J9729l3524j1350o312j2689K281K9741K4932
12016E4785j3615j746P721l8311J392l5669l1393L7920J0340m419J5137l327o000
12003g185p182k165J0271j0922j8464M687M3607q221J220L915N887m2422K798
11990b4176O948j70k3927l536L303l4713M441K2746m052j9829J5069L4199L0398
11977F701L2549k7940Q932J5567k6069k927J9576K528l1052k4653j3464k826L0977
11964a2101O043l0850j0790j2012n605J8741J8086K167K6256O584o518J1279n1686
11951d0406K2891L2982K1578M397j8383J9390r558j5767j0752j5791J7167R994
11939A7742K280q926r777R959K1513j3306k4940k6403J3159J3902K694j1154m5969
$$ y = [18937, 7386, -19757, -10740, 41977, 61706, 28182, 16832, 10520, -2169, 112, 29853, 54785, 41170, 39424, 47145, 8834, 10226, -25443, -56836, -18916, -8576, -12995, 2142, -1185, -7185, -14367, -16532, -6261, -17183, -35647, -30960, 12647, 4426, 5646, 9561, 15448, -26974, -24176, -17228, -17398, -41325, -44861, -41558, -76271, -71830, -49084, -53136, -72965, -57896, -23697, 6701, 39250, 11310, 20242, 35809, 9740, 6813, 26389, 28917, -2135, -26788, -40252, -43078, -12101, -6058, -36908, -47698, -59710, -65315, -46574, -28488, -26321, -65, 6519, 1, 11280, -40406, -17515, 15467, 37045, 41442, 23059, 42449, 32891, 17124, 6372, -9419, 7748, 17742, 20022, 11096, 1319, 11278, 32791, 19485, -5455, -31858, -18699, -4797, -2103, -13257, -59226]
11926e9226J9819L6820L8221J6504P858k277R268l3852j7646k3017j1502o190
11914b5220J0769M815j4808M849P575k9687n950j3051K93L0047J2028j4934j0699
11901d3973r959J4203M8048r833j9835K6945j5535q888j595K399o586R75K8270
11888D636O664J0795j6413J7307J7719j7563J385j9415j6613L670J2026J6204
11876B0402j0405r342J3078K5540K63l7540j5477l510n407K6500j0128p748k0335
11863c4109j7308K5606m69q675J3735Q731q43L917n268N45J068p455k8652P404
11849d1773K2208L941q309j1837R934q073Q215q948J5456K0049J2759o647k983
11836C992j3763J1237J8980R590r170L078o300n592n5933J2201J3410L529j4256
$$ y = [-59226, -39407, -2587, 35634, 52138, 59996, 57719, 66987, 33135, 15489, -7528, -19030, -25220, -14451, -9636, -24444, -19595, -12020, -41707, -47657, -60708, -60415, -30368, -18340, -33274, -43973, -53932, -39729, 8319, -1514, -21349, 5596, -9939, -18827, -20422, -18023, -24609, -23634, 4636, 11300, 22095, 5682, 22989, 40708, 23145, 24530, 5115, -11498, -7828, 4198, 20402, 9997, 655, 13733, 39273, 39536, 1996, -13481, -16991, -22398, 4102, -6026, -13774, -34109, -51417, -25811, -26280, -34955, -21220, -12489, -13332, -9415, -14683, -14138, -13070, -20525, -49177, -41773, -19565, -15624, -23933, -35770, -25836, -33909, -25694, -34642, -19186, 863, 13622, 6975, 3992, -9771, 1466, 20446, 30036, 20866, 23944, 17644, 12052, -43881, -31680, -18270, -14741, -28997]
11823b8997j5481O07K0142L0422J3426l4383k2377q96Q851K219N630J9086m138
11810e889q05k3303N469L029m854M6592N075k5623j3441K0691o495Q27L4761O0539
11796I6573k8435m9625j9815M302M07q528k2608r931J5290L5050J2900k818n931
11783A6831J0699m1966j9491L715J2667J0099J5547L4450J0512j8211k5200k3597
11771a3945r816p151R497K2661R807j889k6681j6027J3405k9284J4941J7693q302
11758b5091L409L5105P516k4078j7969K7001M9690k442k5466J1696l649n695J1497
11745D1524m016k2213j0941k6939j4021j2738j822L8091K3668L5478j8496l1878
11733d303l7387J8029M2002j4765j1405K1935L2075K3399l1580j5434n63k510
$$ y = [-28997, -44478, -43871, -23729, 6693, 20119, -14264, -36641, -37537, -28686, -26467, -20837, -1751, -5889, -6694, -29997, -24528, -21499, -26353, 20239, 25314, -309, -13750, 6941, 446, 1273, 36034, 96573, 68138, 18513, -1302, 3000, 3407, -5121, -27729, -37660, -22370, 12680, 25580, 22762, 16831, 27530, -14436, -33927, -30212, -17545, -7446, 8101, 42551, 53063, 34852, 9652, -13945, -23761, -30912, -21415, 1246, 11053, 9164, -17517, -33544, -20139, -49423, -34482, -16789, -25091, -21682, 13423, 20939, -3139, -21108, 5893, 55583, 53141, 27675, 39371, 35722, 30027, 41524, 37508, 15295, 4354, -22585, -36606, -49344, -51166, -13075, 10593, 46071, 27575, -4303, -41690, -23661, 18341, 3576, -7829, 14106, 46181, 69580, 38000, 22566, 22003, 19493]
11721A9493j1414n548K6395j9217k8687J392l296l4990j0586L111L122q297L2676
11708c5846j976L124j9638K0829O203Q37K1124L9074j457L487K704l0824m5390
11695c7749J0297J2100R846j9227J6697l956j7442K2289K9789R492M729K9372
11683F6237j17K030M6912j3225p749j7656l1862l0271J0651L715j8052K78J1634
11670B2525J1388k312o812j5405j5260j9630N108K796R462R043K2867j2868k126
11657H776R353L503o14K1628j8374l344j3120Q3r160j7623r710j463n33J5355
11643a5243n353j581J3264K6514J7064m743j1827j3893l2187M384q8k2902K2970
11630b3621K7312O354j3958k2864J7419J8373Q71k603l9601L510J4287M875J6670
$$ y = [19493, 8079, 2531, 28926, 9709, -18978, -17586, -20882, -55872, -66458, -63347, -60225, -68522, -35846, -37822, -34698, -54336, -33507, -27304, -26467, -5343, 33731, 32274, 35761, 38465, 7641, -37749, -27452, -15352, -5506, -24733, -8036, -11992, -29434, -7145, 22644, 32136, 36865, 66237, 66120, 68150, 115062, 101837, 94088, 76432, 44570, 14299, 24950, 28665, 10613, 10891, 22525, 33913, 31601, 24789, 9384, -5876, -25506, -20398, -17602, -8140, 903, 23770, 10902, 8776, 18129, 21632, 21018, 42646, 24272, 20928, 7808, 7891, -1269, -18892, -28602, -30065, -30598, -15243, -20596, -22177, -8913, 17601, 34665, 29922, 18095, 4202, -27985, -23601, -23689, -46591, -23621, 3691, 10045, -3913, -26777, -9358, 9015, 9886, 7283, -32318, -28808, -14521, -9646, 7024]
11617G024J6142r720k4862J7709J6621L8706K3200j4224k1877l64K1372K2508
11605I2235j4110k7333J845K1865j7929k8332l780o571j8121J2445j1503J975
11593B686J8311O334m3644j0566L0706M2252k1274j0379J4121K5383J1980k9667
11581C6243J388j8860j6268K0916L7450k503l1476l8319m3421P398J8365J8085
11569a1002Q894k1887K6248J8452k8525J1222L3273J4434m551j9138j5135l5518
11557b3233l2693N485n010m767M8351m371K4703J9645j380J6314j3496l3937R299
11544D910R674J0454j2777k854J3381Q440J5457m0681k0055O066M999l6818R202
11531c0602M6983K2118L938j626K2601L6259j6801J730o818M3472J3352l1707
$$ y = [7024, 23166, 13446, -11416, 6293, 22914, 61620, 84820, 70596, 48719, 48355, 69727, 92235, 78125, 50792, 52637, 74502, 56573, 28241, 24461, 17890, -231, 12214, 711, 2686, 20997, 27331, -16313, -26879, 3827, 46079, 24805, 14426, 28547, 53930, 65910, 36243, 37631, 18771, 2503, 23419, 60869, 58366, 26890, -11429, -54850, -47452, -29087, -11002, -2108, -23995, 2253, 20705, -7820, 3402, 36675, 51109, 46558, 27420, 12285, -23233, -55926, -50441, -55451, -60218, -11867, -16238, 8465, 28110, 26730, 43044, 29548, -4389, 4910, 14584, 25038, 12261, 9407, 22788, 31228, 46685, 6004, -14051, -7985, -2986, -39804, -30602, 16381, 38499, 42437, 40811, 63412, 99671, 82870, 84600, 77782, 121254, 134606, 102899]
11519A02899J5082n290O93K5334R451k6549l8478n897K9716j8221k0755r430j6250
11506D2305J0600K8379L2396n299p257k0917l8580j7090K0905L385J779j9692
11494C0914k3026k17M6717J0940j0772p9342l5855L8127L8525m825l163J0072
11482A8095K898m247J1077k4226k1916k0141k6003K2243N2407k3041k8436r390
11470e0680k736k688j2262L615J3676L0726R074R858L9610J1434J040m014L326
11457D9979K4649k122m2068m1699j593L4910J1213j759r646j7071n8402L3956
11445a9653J8544j8599n3755r663M4544L2064k978j1158O994l570L022J3622M074
11432C488L778j572K365J7671j2265K2982l122L093J1273l639k9502K4318o849
$$ y = [102899, 117981, 112691, 113384, 138718, 148169, 121620, 83142, 77245, 106961, 88740, 67985, 58555, 42305, 52905, 81284, 113680, 108381, 101124, 80207, 41627, 24537, 45442, 48827, 50606, 30914, 7888, 7671, 54388, 65328, 54556, -24786, -60641, -22514, 16011, 11186, 8023, 18095, 20993, 16746, 27823, 3597, -18319, -38460, -64463, -42220, 10187, -12854, -41290, -50680, -53416, -56104, -68366, -64751, -51075, -20349, -11275, -1417, 38193, 49627, 50667, 46653, 49979, 74628, 72506, 30438, -11261, -12854, 22056, 33269, 31510, 21864, 4793, -53609, -19653, -1109, -19708, -73463, -83126, -38582, -6518, -9496, -20654, -13660, -17230, -14208, -586, 3488, 7266, 5694, 8059, 25730, 13465, 36447, 33325, 36418, 47691, 44052, 14550, 38868, 32019]
11419C2019n61j0414j178K4732R951Q118j6321k2326m0247N59Q048R657J9128
11406B1165m1862j234J4731k7926l141l506K7241K0544j2679p590Q032q762Q572
11393f415K2157K3105J2977n8713j0930j1653k895L9350L3068j0979m4119j4169
11381b9216L4022J2537m6328j7687O037M301k9932j0076M8744J991m34J5230K095
11368h716L591J0930j263l600p180J6705j6909q997K0861j3602n049J9385J1633
11355A7789K0806K72j0356M479K0689j0656j9327K6645k3837m2210r796N439k3905
11342d3968L8953L9201j4632n4472l1881J8735L4543P073K1546l905l1313j2103
11330c2223q562J8810L0415M604l1935K8403K6651J4455k8874Q373R269R603k8801
$$ y = [32019, 31458, 21044, 19866, 44598, 54549, 62667, 46346, 24020, -16227, -15668, -7620, 2037, 21165, -20697, -21931, -7200, -35126, -38267, -41773, -14532, 6012, -6667, -14257, -6225, -14987, -6415, 15742, 38847, 51824, -6889, -17819, -29472, -32367, 6983, 40051, 29072, -15047, -29216, 4806, 17343, -28985, -46672, -40635, -36334, -66266, -76342, -27598, -25607, -26041, -10811, -8716, -5125, 5805, 4542, 942, -6238, 10467, -6442, -15439, 5422, -8180, -13229, 6156, 17789, 38595, 38867, 28511, 32990, 53679, 43023, 23696, 50341, 26504, -15706, -25502, -20063, -43968, -5015, 34186, 19554, -34918, -66799, -48064, -13521, -6448, 15098, 11193, -20120, -32223, -40785, -21975, 8440, 13044, -18891, 9512, 36163, 50618, 21744, 30117, 39386, 48989, 20188]
11317B0188J6100j4806j257J8439J2010j9900j4589n643K9680L0170K2265l7682
11305E4975n0998P15K1073j3927k0245K80j4785j3109j8025k5553K2431N8974
11293A806J6809m796K9066J1638m1735l4048p453K9607J0681m815m9312j7076
11281e9628K1353J2821K111L1818o533P061J9040o556m7728j7960K7390K0166
11269C355R192k1260j2119J4611j0192k7361l944J8161L3650J1440o228k2170
11257a2865j0658L3388p687k09J9664l610k2529l4886r153R642M840J2692L298
11244a8073o087M506m032l0424M0207L3898q84j7764l1514Q667k0193j0600K1544
11231c0749K1382L822J1558k406l072L3300k9379k529M127j4556P769M9877j0589
$$ y = [20188, 36288, 21482, 20225, 38664, 50674, 30774, 16185, 10542, 40222, 70392, 92657, 54975, 3977, 4692, 25765, 11838, -8407, -8127, -22912, -36021, -54046, -79599, -57168, 1806, 18615, 13819, 42885, 54523, 12788, -21260, -28713, 894, 11575, 6760, -42552, -59628, -38275, -25454, -23343, 8475, 1942, 9003, 28043, 21487, -26241, -44201, -16811, 3355, 12547, -8713, -20832, -6221, -16413, -43774, -47718, -29557, 4093, 15533, 9305, -12865, -23523, 9865, 2178, 1969, 21633, 18023, -4506, -39392, -48545, -38903, -34063, -21371, -18073, -24160, -19654, -23686, -54110, -13903, 19995, 19111, 1347, -30167, -21500, -41693, -52293, -30749, -9367, -5545, 6013, 3607, 535, 33835, 4456, 1927, 6054, -8502, -733, 49144, 38555]
11218C8555M366l1968m140P84J3261j1191k2121j1868j5974K691K4482j0490M086
11205a9527J6249J028J3502k68j858K9576J8096j8198k0618p842k41Q97J9041
11192B9837K5073K7753m0382p3149J8441M431j9833J0945J5270J825L321Q22J7368
11179B1722l2661J6979J7742k5436k301J1756J0401Q666R119o908K5308j3431
11167D0956l1833M956L35j6434J3809q106J586J1019L4049K0662m7162j2387O069
11154A7519K2097M591n222M149j2049l5190J3500j1532j3935J446N6423m814j4565
11141B2418J6868j2117k1909j0988M297j0232Q674J3567l347l349j7443q456p476
11128b9493k0598o096K3203M2751J0521k6558k931N5246n453J4081J4508l093
$$ y = [38555, 42921, 10953, 6813, 7597, 20858, 9667, -12454, -24322, -40296, -37605, -13123, -23613, -19527, -3278, -2250, 11252, 10984, 9126, 38702, 56798, 38600, 17982, 10140, 9899, 10796, 29837, 54910, 82663, 42281, -30868, -12427, -7996, -27829, -16884, -1614, 211, 3532, 4354, 21722, -10939, 6040, 23782, -1654, -3955, 7801, 18202, 26868, 35987, 29079, 54387, 40956, 9123, 14079, 14414, -2020, 11789, 3683, 5269, 16288, 50337, 70999, 23837, 11450, 17519, 39616, 44207, 38985, 43134, 31085, -4105, 9395, -2137, -16072, -14626, 41797, 36983, 22418, 39286, 27169, 5260, -5728, -1431, -11663, -2989, 10578, 7231, 3882, -13561, -22017, -29493, -50091, -56187, -32984, 9767, 20288, -6270, -9201, 46045, 40592, 54673, 69181, 66088]
11116F6088k2447j5950o443j4380l320J174K6506J8003j1757k0734q418J2857
11104B1179J5760r572k7499p697J2851J0645r313J6651j113j3173j9012K7294
11092A7001J3677k6030K596N432m0055J1874L6783L9823L977l9691M4296l500
11080F6183j6525k4740j7154K6646j206j8577J1763r106j3577K838K4533L9817
11068G0895l6992k0695p073J5320r399k052L8877L3010j1499m2025l5421k8426
11056c5480J7470J21Q165J8979j5686K6569P869J3560j4369K9767L3535m5392
11044D5108m6015j1973j2097J5503L1981r674K169N710J3658L226j1539O773j1830
11031B1000J914n569k9166K5902K3117K9617j9776k4554k0869k0739r0M1414k633
$$ y = [66088, 43641, 27691, 21248, 6868, 3548, 4722, 31228, 49231, 37474, 16740, 8322, 21179, 36939, 27367, -132, -7829, 5022, 15667, 6354, 23005, 21892, 8719, -10293, 17001, 30678, 4648, 7244, 12676, -27379, -15505, 21278, 61101, 65078, 25387, 69683, 66183, 49658, 24918, 7764, 34410, 33204, 14627, 26390, 17284, 3707, 6545, 31078, 70895, 33903, 13208, 6135, 21455, 12056, 10004, 48881, 81891, 70392, 28367, -7054, -35480, -18010, -17889, -9724, 9255, -6431, 20138, 28007, 41567, 27198, 56965, 90500, 45108, -907, -12880, -24977, -9474, 22507, 12833, 15002, 20712, 34370, 37596, 26057, 32830, 21000, 22914, 17345, -11821, 14081, 37198, 66815, 47039, 22485, 1616, -19123, -19213, 22201, 19568]
11018A9568m990l8703m5961K984K3922K5133J5985K9338K4042L869J72n352m173
11005D5834k0354l0852n534J7161k2681k8088k8748O356L7019L4793J5727K5224
10993D5857K169j2405k4433l5390J3404K3763J0427p645l834L937L062K872k3075
10980a291J7863r254m679q977k154j3454O110m430k2183k6209k3471N232K6118
10967f0779K2671P247n580K4801R70L9819J3680j4535n9965j1741p650O581k4800
10954f9281K1717M5031M2380p45l1084j7896K2983J9580k5448L49l857K7401j920
10941B9210j0477p476q297j6346P403J3913k1374L497r54N331q860K525K3693
10928A1788r870L154J2364J4477M352l7550o278J4009o819j2433K3549j0728n226
$$ y = [19568, 14578, -24125, -70086, -67102, -43180, -18047, -2062, 27276, 51318, 55187, 55359, 50007, 45834, 25480, -5372, -10906, 6255, -16426, -44514, -73262, -66906, -29887, 4906, 20633, 45857, 48026, 35621, 11188, -24202, -10798, 12965, 23392, 15747, 11913, 15850, 18912, 21784, -1291, 16572, 7318, 2639, -6338, -8492, -21946, -15836, -20266, -42449, -68658, -92129, -86897, -60779, -38108, -30861, -36441, -11640, -10670, 29149, 42829, 28294, -31671, -43412, -51062, -44481, -69281, -47564, -2533, 39847, 39102, 8018, -9878, 13105, 32685, 7237, 7586, 3729, 31130, 29210, 18733, 11257, 2960, -13386, -5983, 7930, -13444, -9947, -10901, -5570, -14430, -11905, 11788, 1918, 5072, 17436, 31913, 36265, -1285, -7563, 6446, -373, -12806, 10743, 15, -5211]
10915e211r753n472K7082J5045k0629o150J500k75l4332J0836K6178L0129j8905
10902A0043j2906J7165j743j9159q422P295K4050L7622p112j4748j0843K5841
10890D7083l479k944k4349Q80j2449M231l1178j9665J9290K7732l6461k4910L2984
10877b3235j4731j6046j6719j082M3269L6854K156j38N079j7993k5085J7767r486
10864a9390O138o028K3279L5853J6883j6555k2596k7265M5660k1724k0092j6627
10852b2464j0904k1546J3380l935J6942J5340J3585P113J1631j5413l1552L131
10840b4692L3947L6705K0358j8774l1403K617J495M658j8474k0244J839J8706
10828F738M5879K4782m854m2223l9352L207J7779P741J4171J740j0809j6861P057
$$ y = [-5211, -14964, -20436, 6646, 21691, 1062, -5088, -3588, -3863, -38195, -27359, -1181, 28948, 10043, -2863, 14302, 12559, -6600, -15022, -7727, 16323, 53945, 46833, 32085, 21242, 47083, 43604, 40660, 16311, 17191, 4742, 8973, -22205, -41870, -22580, 5152, -31309, -56219, -23235, -37966, -54012, -70731, -71813, -28544, 8310, 10466, 10328, 15407, -2586, -27671, -9904, -19390, -13252, -19280, 3999, 39852, 56735, 40180, 17584, -9681, 35979, 14255, -5837, -22464, -33368, -54914, -41534, -45469, -28527, -13187, 398, 7511, 19142, 3729, -27823, -24692, 9255, 45960, 66318, 47544, 16141, 18758, 20253, 24911, 6437, -13807, -11968, 6738, 52617, 77399, 72545, 30322, -9030, -5823, 11956, 19697, 33868, 35608, 24799, 7938, 14995]
10815A4995k4262j2632k0619J0105k582k6363k092L9254K2545p094k2319p267
10803c8331k5560J1315K7795k3209j6893J610j0933K0827k224L5634P941n343
10791a7371N2886M8170k2317n6547j6147N845j5532l3803j4755L1069Q893j6551
10779d6160k2594M0892K0571j9508k5811J913L402K8901N881m208q68l9202J603
10766e5188N5670J9193m579J731K1669j1049l4550q279J3026n54Q583k1585N500
10753a0412J1948J2148J1609K4010j0420j2562j7804o258j3261o052R124l6097
10741d4027j5308m693n953j1648J6586K6461K8575K1740L90J2322k0014j079J1565
10728A4917j1136n781k0215J9505R713J8565M2714j6199j0197k0462K439L9395
$$ y = [14995, -9267, -21899, -42518, -32413, -34995, -61358, -63450, -24196, -1651, -8745, -31064, -38331, -63891, -52576, -24781, -47990, -64883, -63273, -74206, -53379, -55603, -19969, -12028, -17371, 35515, 83685, 61368, 4821, -11326, -5481, -21013, -54816, -69571, -38502, -29609, -46160, -68754, -27862, -7291, -26799, -52610, -50697, -47295, -18394, -12513, -16721, -17589, -56791, -55188, 482, 19675, 15096, 16827, 38496, 27447, -7103, -15382, -2356, -2910, 5673, -15912, -10412, 1536, 13684, 25293, 49303, 38883, 26321, 8517, 2259, -11002, -17054, -7930, -44027, -59335, -64028, -69981, -81629, -65043, -38582, -10007, 11733, 12123, 24445, 4431, 3352, 14917, 3781, -2000, -22215, -2710, 7003, 25568, 68282, 52083, 41886, 21424, 23863, 63258]
10716F3258k0500L707j4015n2692l3584j0439M1292J99o532k3616J9519R950R073
10703a4380K7101K6942L24j1787l0774k909K520J908L331K413l276K5547M1992
10690F8952K0361m8871m5430o347L2106P299k1622J1793j2222L514L0828k1052
10678A9309k2017k6777Q93K0878L6268o355K629L0248l910l2138j3784J2033J6103
10665C3380k829j0165k3851k0525J5594K1449j8142k08j4303j64J3569J5993k3124
10652a3326j4569J3792J242L997j0659J0813j1880k0421L8819R764P729O1r465
10639E897l8724j3595J5406L5785p104j9942r249L8016O1037J0292m5656l5139
10627b976R372K7458K349l635J9496l377M39O106k1538j7201l863k8278j7595
$$ y = [63258, 42758, 46465, 32450, -20242, -53826, -64265, -22973, -22774, -29306, -52922, -33403, -23453, -14380, 12721, 39663, 39987, 28200, -2574, -5483, -2963, -1055, 2276, 4689, 1413, 26960, 68952, 89313, 40442, -4988, -11335, 20771, 28070, 6448, 18241, 6019, 9533, 40361, 19309, -2708, -29485, -28592, -7714, 28554, 22199, 24828, 55076, 51166, 19028, 5244, 17277, 33380, 30551, 20386, -3465, -23990, -8396, 13053, -5089, -5297, -19600, -19764, -6195, 9798, -13326, -27895, -14103, -12861, -8864, -19523, -8710, -20590, -41011, -2192, 7572, 15301, 15362, 5897, -32827, -46422, -31016, 4769, -2335, -22277, -31526, 6490, 67527, 77819, 32163, -2976, 6396, 33854, 36203, 32568, 52064, 48687, 49126, 55232, 33694, 16493, 12630, -15648, -33243]
10614c3243Q067L7055K3848l7008l9862m733J7528K9695R876j1401j6048O270
10602i956J73l66k1654l197l767l391k2465k2720J169K7394L3275O623k8007k9041
10588g5930k427K1682K1318P720k184M0961M5242k7601Q099j109j8841J4018m8605
10575a7657j2848K1942M9733J4909j6214k1099k8543q213m411L133j4323l4371
10563f7962J0917K8671k3795N711L2232K6716N801j3862N614J8332J980l9346
10551h991J0779J2256L345l0048n7J1017L803k4752j8476J4765N4651K394j0777
10538A9909k634J1874J8390l2996l39k299j4637q019M3666N6l0642K333J2079
10525A6741K9350j850N487j9172k712j8673j3664k175N320L6649O707j5454m421
$$ y = [-33243, -25176, 11879, 35727, -1281, -41143, -45876, -28348, 1347, 11223, -178, -16226, -9956, -9783, -10149, -31803, -35000, -38767, -42158, -64623, -87343, -86174, -58780, -25505, -18882, -46889, -75930, -78357, -56675, -35357, -27637, -29821, 11140, 56382, 28781, 36880, 35771, 16930, 30948, -17657, -30505, -8563, 41170, 56079, 39865, 18766, -9777, -17990, -22401, -19268, -33591, -67962, -57045, -28374, -52169, -46458, -14226, 12490, 18291, 4429, 10043, 28375, 30355, -8991, 1788, 14044, 17389, -12659, -12716, -1699, 2104, -22648, -41124, -26359, 28292, 30686, 19909, 17275, 29149, 47539, 14543, 14204, 11905, -2732, -10751, 32915, 32971, 2329, 4662, 16741, 46091, 44241, 49728, 30556, 27844, 9171, -4493, -6668, -1348, 35301, 42008, 26554, 22133]
10512B2133m03j6155l9939k6615p454J7989N664N109J3964j5950k4271K7903l890
10499d1915j0473j1750J0244O610j074M148q429r889J2698K2K2292J438Q604J7367
10485a07k9114k227J0801K202K7917k8670j5920M8232j16L947m1723j0693n321
10472d0792j1636m329k3942L0591M3850j2793l1417J5619K6501r367j8622j0535
10460d6872K0904J4688J5828K913K1344K1279k2161k3759l779k3782m063J6621
10448a0839K6797R566j6518l0152j1181L496L3147J8556J055L528R109k520J3196
10435D7240j5304l0741k8818l2449j301L0312k388R37L9130L1794L974j6110j6837
10422I439j6087P186j7211J2627J569J4830J8812R985N932j7704k2084P735j3464
$$ y = [22133, 21730, 5575, -34364, -60979, -68433, -50444, -44780, -39671, -25707, -41657, -65928, -38025, -41915, -52388, -64138, -53894, -47284, -48358, -44210, -52639, -62528, -49830, -49808, -27516, -26078, -17474, -107, -29221, -31448, -20647, -18445, 9472, -19198, -35118, 13114, 12998, 16945, -24778, -35471, -40792, -52428, -56757, -80699, -50108, -6258, -19051, -50468, -34849, -8348, -17715, -36337, -46872, -25968, -11280, 4548, 7461, 28805, 50084, 27923, 4164, 385, -23397, -27460, -10839, 15958, 25524, 9006, -21146, -32327, -28831, 4316, 22872, 23927, 27455, 36564, 34044, 47240, 31936, 1195, -27623, -60072, -61373, -31061, -33449, -32512, 6618, 38412, 42386, 26276, 9439, -6648, 538, -16673, -4046, -2477, 12353, 31165, 41150, 47082, 29378, 7294, 15029, 1565]
10409A565q87j1803l4186N693K0866m078L8311N600j4390L740K0524k4478m0134
10396c3657J6651L9989L268l2352l8029J226K3169p888j3443O559O268r314J0198
10383b7355J502J2122l7774j5129n969J1825K13J638j1976L351L0858L9637K6433
10370B9376L1033m701n5413n0150k9749l215O49M5679L5935j6439k210P841K8438
10357A7074K4109k9778k069j5148o097K517J4409J598k0876J6921M3027R142K785
10344E7614K3557M3618L3556K6053J2146N5596Q9624R8714J9996J3769N6737M3235
10332E74215P485J9414k1198p6017p8340o5043m6479l0404m5039j6442k9671l4707
10320A57774j2593m8856l4788J4672K8117M7881j9023j9365O282l282l567M151
$$ y = [1565, 678, -11125, -45311, -39618, -18752, -22830, 15481, 21081, 6691, 10431, 30955, 6477, -33657, -17006, 22983, 26251, -6101, -44130, -42904, -19735, -27623, -41066, -34507, -28239, -37553, -27355, -25853, -13731, -51505, -66634, -72603, -60778, -60565, -58927, -70903, -67552, -36694, 2943, 29376, 60409, 55708, 295, -49855, -79604, -82819, -82170, -36491, -556, -16995, -19205, -11364, 17074, 41183, 11405, 9336, -5812, -11909, -9392, 5017, 6615, -14261, 2660, 45687, 54829, 57614, 81171, 124789, 158345, 184398, 196544, 252140, 341764, 440478, 460474, 474243, 530980, 574215, 581700, 601114, 579916, 503899, 425559, 360516, 314037, 283633, 238594, 222152, 192481, 157774, 145181, 96325, 61537, 76209, 104326, 152207, 133184, 113819, 120101, 116819, 113252, 117403]
10308A17403k5959l9621R975K224j1509j3978J0205k31l0574l465K9209j2502
10296C1177j1915m254K403m2263K6591K9372j8778l0978j2036J9660L3064K4940
10284D6983Q47R385P956j6864m78J7606j410k3581K6523Q154j5829j1190K76j0779
10270C7599J0576M297p070j2503m1785j7185Q255K1692j4420O243K6235K5753
10258D7687k0536n9353p14M3872P28o342k6253m536K7019J5663M1945n472p843
10245D5865k0133l0663K4823Q705k1765j1410j4151J5092J0357O082P046M238
10233B4086K5822k2132m080L324J205j6076J0233o450M777l4605j2149N2402K2186
10220D8543k8750l8060J18J4078L5472N478o335k0021J3208j5617J5104K621k8213
$$ y = [117403, 91444, 51823, 61798, 64022, 52513, 38535, 48740, 48509, 17935, 14470, 43679, 31177, 19262, 15008, 17411, -24852, 1739, 31111, 12333, -18645, -30681, -11021, 22043, 46983, 47830, 57215, 65171, 48307, 47829, 65435, 64025, 40444, 66967, 75121, 59292, 48102, 48378, 37599, 48175, 52472, 45402, 32899, -8886, -26071, -17816, 3876, -10544, -4301, 21934, 47687, 27151, -32202, -32916, 10956, 11684, 5342, -20911, -25447, 1572, 17235, 59180, 53708, 45865, 25732, -4931, 19892, 28597, 6832, -4578, -18729, -3637, 6720, 12802, 19848, 24086, 49908, 27776, 23696, 27020, 28225, 12149, 22382, 15932, 20709, -13896, -26045, 26357, 48543, 19793, -18267, -18149, -4071, 31401, 36879, 30544, 10523, 23731, 8114, 23218, 25839, -2374]
10207b374k9758k2151K3234J672k649j0507L9181J8330k954j7406o137K3888j2251
10194A18j1916k3221q072j2408K4549l141J5179J1045P166m0077k874p898q526
10181f0076j2475J3959J9611L550L2339r44j182j1739j1695P124p576n68L2351
10168B679m94n716j9533r169J4290J0850L7253j4676l0604q686J9246k81j8795
10155b3636j7840k170L5266K1828k2192l9162K0032M1314M1323M574l1712J5242
10143D2867M996J3241m4366o7866m573O927J1497m31P725J0164L538Q736j4831
10130b2376l7404M1439J7717k3502k187J7194K836J1115k872p978l450j5834M763
10117b0539L3592o668m044K2756j9831p896K4998j5356J1944K4569P342l0618
$$ y = [-2374, -32132, -54283, -31049, -29377, -32026, -42533, -3352, 14978, 12024, -5382, -11519, 12369, 118, -11798, -35019, -43091, -55499, -30950, -34091, -18912, -7867, -701, -40778, -43652, -51550, -60076, -72551, -58592, -38981, -35431, -3092, -4036, -5218, -16957, -28652, -21528, -29104, -29672, 2679, 2185, -3531, -23064, -32233, -17943, -7093, 30160, 15484, -15120, -23806, -4560, -4841, -23636, -41476, -43646, -8380, 13448, -8744, -47906, -27874, 13440, 54763, 59337, 27625, 42867, 47863, 61104, 16738, -51128, -55701, -48774, -37277, -37708, -29983, -19819, -16281, -7545, -22376, -59780, -18341, -624, -24126, -26313, -9119, -6283, 4832, 1960, -6018, -9468, -25302, -20539, 13053, 6385, 2341, 25097, 5266, -2630, 22368, 7012, 18956, 43525, 50867, 20249]
10105B0249k8944k751L6616q729j5781j9883l90M0303K6017L0751j4337p4237
10093a1116Q13m605k0701K1149J8247r867j2902K0480K3099P302l9626j6670K2180
10080b217R75k7973n505P777L1886K2977K128N668J2878p152K4452o519k2567
10067C6808J8972K1599j5816J2148J9291n846K3791J180M9667Q1998P6893N9630
10055C80315J27724J49326J62319K59098L30540N46613P69213J289358J677942
10046E692448J270738O18417M7766k008676j743729r27013n68533m24890l01647
10037A654881k32670j53671j42446j17881o9945q6828p7151k9973l4916r6612
10027F12788q4427l0803j1653m0344l1293m0241m7504k8958l0103l4268j3122
$$ y = [20249, -8695, -11446, 25170, 16441, 660, -19223, -19613, 20690, 46707, 77458, 63121, -11116, -10303, -14908, -35609, -14460, 3787, -6080, -18982, 1498, 24597, 31899, -7727, -24397, -2217, -1242, -29215, -34720, -26943, 4943, 27920, 30048, 35716, 48594, 41442, 65894, 59375, 36808, 55780, 77379, 61563, 73711, 93002, 87156, 110947, 112127, 161794, 243792, 320685, 380315, 508039, 657365, 819684, 1078782, 1409322, 1955935, 2725148, 4014506, 5692448, 6963186, 7581603, 7629369, 5620693, 3876964, 2949951, 2381418, 1956528, 1654881, 1422211, 1268540, 1126094, 1008213, 938268, 851440, 774289, 744316, 709400, 612788, 528361, 497558, 485905, 445561, 414268, 374027, 326523, 297565, 267462, 233194, 220072]
10016B20072J9004J6779n4712J2490K7543j4704j4353N211k111l5668j2288o811
10004A60452o02j973k5414n2401j0349J0000L1664K1118O177r828l8655N260j22
9991I5327k625q56l3683o348J9540p649k0492J3092N649K3130j6769j9555K0012
9978F8773M860l0486l5008j0264J7775j4056l9794J4020L9481k9167N013M3775
9966C4922l833R775J9165l3813l9417N018K5600K1243N345R481J9832j9381j8253
9953C5684J88o2J7565q434j04m873k3579m7337J1827J6401J1690p92k2745N687
9939h884J7499j0519K4327N108l6172k4174q645K2919J4712P928J2379q542j2579
9926d643M1205P158l09n600l838p135P65J9919j2221k754O764j8592k2633P671
$$ y = [220072, 239076, 255855, 201143, 213633, 241176, 226472, 212119, 217330, 215219, 179551, 167263, 160452, 159850, 157877, 132463, 80062, 69713, 79713, 111377, 132495, 138672, 128844, 90189, 95449, 95327, 92702, 91846, 58163, 51815, 71355, 63706, 43214, 56306, 61955, 85085, 68316, 48761, 68773, 73633, 43147, 8139, -2125, 15650, 1594, -38200, -24180, 15301, -13866, -8853, 34922, 31089, 40864, 60029, 26216, -13201, -8183, 17417, 38660, 44005, 53486, 73318, 53937, 35684, 35872, 35810, 53375, 44941, 44837, 39964, 16385, -30952, -19125, -2724, 8966, 8174, -14571, -8884, 8615, -1904, 22423, 27531, -8641, -32815, -41460, -18541, -3829, 4099, 16478, 7936, -4643, 36562, 43720, 43411, 37811, 33973, 26838, 27603, 47522, 35301, 32547, 39311, 20719, -1914, 5757]
9912E757K4977o134ql1918p04K9788j3634N367L896m0483m5730m161P771J0801
9898e4415M4246L1098R25k0284R224R05J4195R074L568j7543k1265k0415k4931
9885d5618J8923N0700J7795k3050M259j4491k4548K9647J4216J4322k633n091
9873C4431j3422O157l890m903K0981J5066N325k5375k3031N826J321K1782j29
9860D0139J4097J1020J7722k7467k1945k7817n569J396L487p074L553L7898R029
9847D8469j170m3030r956K6205L1290Q487q959m0984q504L575M967J9020N280
9834C4690M796M647k7649q24j8720k475K0957K9198L4583n903j5234j8876j6848
9821B2342l2598J6520K7028J9234M595K5613j8896l7397K3136j865J0029n9950
$$ y = [5757, 30734, 24600, 24592, -7326, -8030, 21758, 8124, 13491, 17387, -23096, -68826, -72987, -65216, -54415, -10169, 20929, 21854, 1570, 10794, 11699, 25894, 34968, 38536, 20993, -272, -20687, -45618, -26695, 24005, 41800, 18750, 23009, 8518, -16030, 13617, 27833, 42155, 39522, 34431, 21009, 27166, 23276, 18373, 39354, 54420, 59745, 34370, 11339, 17165, 18486, 40268, 40139, 54236, 65256, 82978, 55511, 33566, 5749, 180, 1576, 5063, -2011, 1542, 39440, 48469, 47299, 4269, -5687, 20518, 51808, 60295, 51336, 10352, 1848, 5423, 10390, 29410, 34690, 39486, 44133, 16484, 15660, -3060, -5535, 15422, 44620, 79203, 73300, 58066, 39190, 22342, -10256, 6264, 33292, 52526, 57121, 82734, 63838, 26441, 49577, 47712, 57741, -2209]
9809b209j8845J0385K9960J6342k0191J0096q456k4070j3239l2196j5733L792
9797f4364k715J3324N9641q215l2066J9113J2765O5546L935k5383l6824r864J3335
9784H228k4796j0337J2848j1769J4802o797o237J1854L8238m967k8118k2084J899
9771b7236l2K3188k6837P597L6992L917j9196O447k1699J5336J969J4979q389
9758G036J9374K1037J3509j6368k3240n239N168K1317j5120j7392J4338j2774
9746A1646j7326J608K205j0184J61j8798p132L0366L2416j5656m1160k608M1036
9733F574M4687o146j8529p925m690K6753K6480J0065l2136L439J353k7096j7681
9720E148k2712J1007J9139j0271k4221J1933K5977L5417K205j0740m4321m014
$$ y = [-2209, -21054, -10669, 19291, 35633, 15442, 25538, 17082, -6988, -20227, -52423, -68156, -64364, -67079, -53755, 5886, -2329, -34395, -15282, -2517, 63029, 66964, 41581, 4757, -5107, 8228, -16568, -26905, -14057, -25826, -11024, -17821, -24058, -12204, 26034, 21067, -7051, -29135, -27236, -27268, -4080, -30917, -23320, 13672, 17589, -1607, 4840, -16859, -1523, 446, 15425, 7036, 26410, 47447, 60956, 44588, 21348, 16109, 21277, 42594, 27474, 10082, 24420, 11646, -5680, -4072, -1867, -12051, -11890, -30688, -37820, -7454, 24962, 9306, -31854, -34462, 6574, 51261, 45115, 26586, 18661, 13971, 40724, 67204, 77269, 45133, 48572, 49925, 22829, 5148, -17564, -6557, 12582, 2311, -21910, -9977, 16000, 51417, 53622, 42882, -1439, -5453]
9708e453J15O42L2483L5707j1816k0997N159j0448r987m080M1755J2068k7816
9695C7332l407K8714K6859j7047l8728R281j3361j1033k0078L859M5094K5371
9683G2856k4839l0073j2596l0309j6773J0448M0788q476N298M5722K974j2329
9671D2691k4424N758k2833O88P336J8592m004P183Q738j3120k761l4564M514N2365
9657D6159K5535j6880q218k9723j2551L6410K3684j2351k2053j6349k253j3173
9645a763k2511K7208J0579J5473Q090k5553J6122K8392P078J1689o823n0695l9397
9632b2111J8192K7657L1622j5837k1612M450P399k0923j6553j8073J6752K1589
9620A2552j3865j1216j240k9524N567L7908M8545j6911l9293J4808L5736M2340
$$ y = [-5453, -5338, -4696, 27787, 63494, 51678, 30681, 35840, 25392, 15405, 11325, 53080, 65148, 37332, 33925, 62639, 89498, 72451, 33723, 43004, 29643, 18610, -1468, 2391, 47485, 72856, 48017, 17944, 5348, -24961, -41734, -31286, 9502, 1026, 6324, 52046, 55020, 42691, 18267, 24025, 1192, 1880, 9216, 27808, 23804, 30987, 39725, 26605, 23844, -10720, -6206, 46159, 71694, 54814, 46596, 16873, 4322, 40732, 64416, 52065, 30012, 13663, 11410, -1763, -24274, 2934, 13513, 28986, 37076, 11523, 27645, 56037, 63115, 74804, 67981, 17286, -22111, -3919, 23738, 55360, 39523, 17911, 22361, 29760, 8837, -7716, -25789, -9037, 12552, -1313, -12529, -13769, -43293, -37726, 182, 48727, 31816, -7477, 7331, 43067, 85407]
9608H5407m7242m6518l672j3925Q416K2890K9711j3677j4038l831j1237N581L4229
9595C2094K8773o568k5350r192k515q385L210n835j33k9378k5237K3047M8219
9582B2750j7224m3399J8919K7572j966j4357Q833K4968k9289k5114K8634k0354
9570b0027j4323l7453J8486L5359n630j9357J7843J6729J7610l961n1311j6539
9558f2574L907J9147M9019J0735j6107j3686L099J035j5711J5165J2387R536o467
9545I485K5148Q351q133p276n346K410k1111k588j473L6792M9996j4788l5244
9532C6223j8777J3268j3443j8859J8590J194J2639O436l5690N436J5731j336m6372
9519b4960K077J3883J4697o41j4089O64K0707J8503n475m7157k0844J855j2251
$$ y = [85407, 38165, -8353, -12025, -25950, -17534, 5356, 35067, 21390, 7352, 3521, -7716, -2135, 32094, 60867, 54299, 28949, 19757, 17242, 8857, 12067, 6232, 6099, -23279, -48516, -25469, 22750, 5526, -37873, -18954, 8618, 6652, -7705, 1128, 26096, -3193, -28307, 327, -20027, -34350, -71803, -53317, -17958, -23588, -42945, -25102, -8373, 9237, 5276, -46035, -62574, -58667, -39520, 9499, 20234, 4127, -9559, -6460, -5425, -21136, -5971, 6416, 15952, 9485, 34633, 42984, 34851, 27575, 22229, 24639, 3528, 940, -533, 36259, 86255, 71467, 36223, 17446, 30714, 17271, -1588, 17002, 18196, 30835, 37271, 1581, 7017, 22748, 21412, -24960, -22883, -9000, 5697, 5056, -9033, -8369, 12338, 30841, 25366, -21791, -42635, -40780, -53031]
9506e3031K3725M3730K115k8562M977o040j1986l470M3818k19q688j537k932K601
9492D501l9486Q751L7888L2168O24k5882M208k7915K33o874m464R915r384j7k7058
9477d2792m545K4244J3328M4046r238o304o499J347p350M941j2353L2121J0254
9464D1200J2138q682l1594j5141n046P826J7376j356J1288P565J4167k3890Q240
9451C4091j0317n44p416k7797N469L5198l8836l3739K0282L4276j7494k8855K7485
9438h197L3448n968J5272N446j4726m499j9334l3015J4474M2398J1424l0189j4944
9425h410J4878K4622r819j0962k2264J4045K111J9916K2869K2002j7240l7738
9413A4010L94q810k1127K762M6712j252r69K3953j3377O356R194j5652q875m664
$$ y = [-53031, -29306, 14424, 16539, -12023, -7046, -13086, -25072, -28542, 15276, 15057, 6369, 4832, 1900, 4501, -34985, -26234, 11654, 43822, 44446, 18564, 22772, -5143, -4910, -11784, -16248, -6333, -15717, -15734, -42792, -47337, -23093, -9765, 34281, 25043, 18739, 12240, 13587, 6237, 11178, -1175, 30946, 41200, 53338, 44656, 13062, -2079, -7125, 701, 18077, 16721, 28009, 35574, 49741, 25851, 34091, 23774, 23230, 15814, -11983, -6514, 28684, -10152, -43891, -23609, 10667, -6827, -35682, -8197, 25251, 19283, 34555, 40001, 25275, 20776, 1442, -31573, -17099, 25299, 36723, 6534, -8410, 6468, 31090, 21271, 10309, -11955, 2090, 4201, 24117, 46986, 68988, 51748, 14010, 14404, 5594, -15533, -12771, 33941, 32689, 31720, 55673, 42296, 48652, 57846, 42194, 33319, 28655]
9399B8655J3493J4031j4015m1638O666L4400L8110N888l5861J5093m3832k4321
9387c331J9707j6880r302P257J6100J1422K6985J4424j955l8013j8343m795K180
9374E456K8354Q24q65j9385j4484L2420K9164O084k6782J6265q761J0314J6888
9361G5492j2204k7969l1861o590R011K5452J0842j9203j9539K2003r433o8699
9349e2698k9395K9616M7501J7910L44K3580j9095j6765K6735J8226k3779P577
9337B9757L7604J3310k1925N980m5681k3022R137K5260K4744N66k3675j2213J8261
9324C8103L5122K7611k7836o1788j0345K9535k556n422k3840J3459R142k053J7972
9311C7104Q08Q778o710K5011J0008k2938N671Q706j2856j1145K562j4016j2228
$$ y = [28655, 42148, 56179, 42164, 526, 7192, 41592, 79702, 85590, 49729, 64822, 20990, -3331, 16376, -504, -9806, -2549, 13551, 24973, 51958, 66382, 64427, 26414, 8071, 3276, 5456, 33810, 34634, 33769, 14384, -100, 32320, 61484, 67568, 40786, 57051, 48290, 58604, 75492, 63288, 35319, 3458, -3132, 5879, 31331, 42173, 22970, 3431, 25434, 16001, -52698, -82093, -52477, -4976, 12934, 13278, 36858, 17763, 998, 27733, 45959, 22180, 29757, 67361, 80671, 58746, 64726, 19045, -3977, 5160, 30420, 55164, 55730, 32055, 19842, 38103, 73225, 100836, 73000, 11212, 867, 30402, 27846, 22424, -1416, 12043, 21185, 19132, 37104, 37912, 46690, 39980, 64991, 74999, 52061, 57732, 66438, 53582, 42437, 44999, 30983, 18755]
9298A8755l7289M4690M7490O644J9386j0279l7072K1152J5531j6525P60n153J1496
9285G9586k8567k0845J4311L2127J091j5135j3646N321K1799J1170M924j2112
9273H0024J54j2707p586J3785l3210k4710J8108J7418K5663k514J9811k5095J5451
9260H4592M900k0823J4154J1706j8799q662K8262J2707k5143N533K0396K7045
9248A35868l1981k7437K0068L7187k226k8146l3914j8761j8667J3149K5518K4057
9236I4715L3178P866J2260Q001r04l9587l941N351j8035J2601K1195r827K0420
9223A43293k3109k1436K8252M3558r02l1585l7737k7345k9876K6749K6052L6880
9211A32794K541k7463J5579J3166J6000K5125O432m4465k0789j6323J2493J7134
$$ y = [18755, -18534, 26156, 73646, 80290, 99676, 89397, 52325, 73477, 89008, 72483, 73243, 68090, 79586, 51019, 30174, 44485, 76612, 77703, 62568, 48922, 54243, 76042, 87212, 92136, 80024, 80178, 67471, 59885, 73670, 40460, 15750, 33858, 51276, 76939, 74425, 94236, 69141, 84592, 89492, 68669, 82823, 94529, 75730, 67068, 95330, 108037, 82894, 88427, 108823, 135868, 103887, 76450, 96518, 133705, 131479, 103333, 69419, 50658, 31991, 45140, 70658, 94715, 127893, 135759, 148019, 156020, 155116, 115529, 111588, 116939, 98904, 111505, 132700, 122873, 143293, 120184, 98748, 127000, 170558, 169656, 138071, 100334, 72989, 43113, 69862, 95914, 132794, 135335, 107872, 123451, 136617, 152617, 177742, 184174, 139709, 118920, 102597, 115090, 132224]
9199A32224K0388N851l1223J8891K0972K5467L6334L2533k0283m0238j9070P062
9187A88908M941j0229L5536N8689R170J3687j7111r42m1732j6018L9325o244L4899
9174B92879J8146K259N752L3604K5544L749N692L162j5150K9888L9389p653J0021
9161D47282L5372K512q405j737M1430K4477L5645J5595j635j3894M3871J2316
9149F32829k3707R184J2937J7911M0278J4368M7024M5420M7127k0047j7884J5454
9137H20894M9313M0106N0917M6628J3136O100K8987L1921O339M3905O140J3101
9125A157487j4825K3925L6373k963K1104K8824K796J0056J6565J0929j5174k1265
9113A253832O872J1894k5580K1856L7935l5369j8438j1074R440o01n4251p7135
$$ y = [132224, 152612, 158463, 127240, 146131, 167103, 192570, 228904, 261437, 241154, 200916, 181846, 188908, 193849, 183620, 219156, 277845, 287015, 300702, 283591, 282649, 240917, 224899, 264224, 257980, 292879, 311025, 313284, 319036, 352640, 378184, 381933, 387625, 390787, 375637, 405525, 444914, 437261, 447282, 482654, 485166, 476761, 475024, 516454, 540931, 576576, 592171, 590536, 576642, 620513, 632829, 609122, 618306, 631243, 649154, 689432, 703800, 750824, 796244, 843371, 823324, 805440, 820894, 870207, 910313, 961230, 1007858, 1020994, 1027094, 1056081, 1088002, 1094341, 1138246, 1144386, 1157487, 1142662, 1166587, 1202960, 1199997, 1221101, 1249925, 1252721, 1262777, 1279342, 1290271, 1275097, 1253832, 1260704, 1272598, 1247018, 1268874, 1306809, 1271440, 1253002, 1241928, 1251368, 1250767, 1196516, 1119381]
9101A119381j8200J328m6084k023J4267n1934m0903j4460J480k2323l1617n2946
9089H55966n5237M950j6833j0992p336r750L4491q714l1801k6161l4810l8796
9077F54977m6881K815j7660m1153j681k6716j2319J0590N38l6599k4363K738j4055
9064D50231j6961K1391l3319m1511m3516P68p544n613k3083J9233L0781J5330
9052C66187k0598j6934n648J0530r939M91k2026k889K128n4747k4288K0765J7977
9039B61009N315q608m2069r790m988M986J8448j6140K0666o290k5125p07N899
9026B02606J9790J9594j8003j6392m041q291r695j4099j1794L782K0574k1004
9014A63027k0655p839j0974k6929k5930O084J8672L5029L3042j1408l863O636
$$ y = [1119381, 1101181, 1102509, 1056425, 1054402, 1068669, 1016735, 975832, 961372, 962852, 940529, 908912, 855966, 800729, 805679, 788846, 777854, 770518, 760768, 795259, 786545, 754744, 728583, 693773, 654977, 608096, 610911, 593251, 552098, 550417, 523701, 511382, 521972, 522510, 485911, 461548, 464286, 450231, 433270, 454661, 421342, 379831, 336315, 337083, 329539, 323926, 300843, 320076, 350857, 366187, 345589, 328655, 323007, 333537, 323598, 324089, 302063, 299174, 301302, 246555, 222267, 243032, 261009, 266324, 257716, 215647, 205857, 200869, 205855, 224303, 208163, 228829, 222539, 197414, 196707, 202606, 222396, 241990, 223987, 207595, 203554, 195263, 185568, 171469, 159675, 163457, 184031, 163027, 142372, 134533, 123559, 96630, 70700, 76784, 95456, 130485, 163527, 152119, 148256, 154892]
9002A54892l179j5842J8650K8514k0282k3594l0250N85l871P255J9782j2821o086
8989A13753J1010L0056o367r561l4246K0206m908k391p768j3209Q267K7159m743
8976A27258l2451K0841j4939k9449j5521J0122J714R727j699j0463j1792j1833
8964D1515K1093j1292q08J0862J6790K1255j3939k2965M5307N136r09j8384J255
8951I4916K0342J0558j7265j1890j8977l118J8390O042m5206j6030L9747N456
8939H2965k7074J495J2392k1302m0596J5386J1291J6951M2751J8881p954k7727
8927G7459o561n635j8883k3476k316K3038O123j0718J3173Q709p847J2335k0383
8914D5018j289J4055j4313J7380o119P870J9479K3699J642K3214M0080r305K641
$$ y = [154892, 151713, 135871, 154521, 183035, 162753, 139159, 108909, 109494, 105623, 112878, 132660, 119839, 113753, 124763, 154819, 148452, 138891, 104645, 124851, 119943, 117552, 109784, 96575, 104842, 132001, 127258, 94807, 115648, 100709, 71260, 55739, 65861, 67575, 77302, 75603, 65140, 53348, 41515, 62608, 51316, 50508, 61370, 78160, 99415, 85476, 62511, 107818, 112954, 112045, 93661, 94916, 115258, 125816, 108551, 96661, 77684, 74566, 92956, 98998, 53792, 37762, 77509, 82965, 55891, 57386, 69778, 48476, 7880, 23266, 34557, 51508, 94259, 113140, 105186, 77459, 70898, 65263, 46380, 22904, 20588, 43626, 49749, 39031, 52204, 60913, 53066, 65401, 45018, 43729, 57784, 43471, 60851, 54732, 62602, 82081, 105780, 107422, 130636, 170716, 161411, 164052]
8901A64052P0842M5009M6380R3873J60484K15673K45340J88287J07116n3498k42630
8890A040928k20703j55827j19482j11893j17119j9796M767k1959n4087n6027l5430
8879A33372k112L2007J411r014K7345k0637l2129j7896J3583J9987N1523j1012
8867A86428m1173k1900k6941K7410N6737R077M975o005M8639Q2736Q4304Q7605
8855D91892O6733J30699J71701K44742M05386N01184M05365K49624m4100n14244
8845B108982n25058l41323k48109j72342j38414q3712m1159j8145n4341j3950
8835D72429m6121m5777j6971m022j4778n025m6601n2752J3242l849N809j9398
8823B36186m885M576K1589O348m1099q3239j9399N3207M4002K4065P142L559L7855
$$ y = [164052, 234894, 279903, 326283, 420156, 580640, 796313, 1041653, 1229940, 1337056, 1283558, 1040928, 820225, 664398, 544916, 433023, 315904, 296108, 300875, 278916, 224829, 168802, 133372, 131260, 163267, 164678, 155664, 183009, 162372, 130243, 112347, 125930, 145917, 197440, 186428, 145255, 123355, 96414, 123824, 180561, 189638, 194613, 188608, 237247, 319983, 404287, 491892, 558625, 689324, 861025, 1105767, 1511153, 2012337, 2417702, 2667326, 2623226, 2108982, 1583924, 1242601, 994492, 822150, 683736, 600024, 558865, 540720, 486379, 472429, 426308, 380531, 363560, 359538, 344760, 339735, 293134, 240382, 253624, 249775, 255584, 236186, 231301, 235877, 257466, 263814, 222715, 139476, 120077, 173284, 217286, 241351, 248493, 252052, 289907]
8810B89907R6608R4846P6393R5348J59341J87215J83591Q7077K7079j55916k34438
8799I07051k02513j67922j10065n5841n0418l0477k2014k8384J2861m9951K5780
8788B28107j8875l9786j780k2482K337J9136Q648j4274k2959r25J6546l749P262
8775A57206J2420O981k4496m1245l0971j5297p957j8687P381j4593K0068J8899
8763F9709K1444K9472P700K6182J8018k7271k7005m2592j439K4141K4512K2690
8751A45561j6543m5505j2357L1838J1537l572m743k4371k4716m413J0822k784
8739F0754J0880J0332K2402J2885J2668k9383l923n578L6155j2341J0029j0497
8727A14383n7695L428J1679k0411j653K0404n209j1731k4609j8537K785K3124
$$ y = [289907, 386515, 481361, 557754, 653102, 812443, 999658, 1183249, 1270326, 1297405, 1141489, 907051, 704538, 536616, 426551, 370710, 320292, 289815, 267801, 239417, 252278, 202327, 228107, 209232, 169446, 167666, 145184, 147521, 166657, 175305, 161031, 138072, 137147, 153693, 149944, 157206, 169626, 176607, 152111, 110866, 79895, 64598, 56641, 37954, 45335, 30742, 50810, 69709, 91153, 120625, 128325, 154507, 172525, 145254, 118249, 75657, 74218, 98359, 122871, 145561, 129018, 83513, 71156, 102994, 114531, 110959, 106216, 81845, 57129, 52716, 63538, 60754, 71634, 81966, 104368, 117253, 129921, 100538, 96615, 91037, 127192, 114851, 124880, 114383, 56688, 60116, 71795, 51384, 49731, 70135, 64926, 53195, 28586, 10049, 12834, 35958]
8715C5958L6016J3K1675j1412k9807m789j1498l3640K2234J7121n170J2069M8955
8702I7725j2386p346j8060J7975L2976j0505k7865r525L464L4434M0660J4159
8690A55706k1494n6188j1045q807n664J0634N562L216K1570J7160J977k2025k2577
8677F8025p738j7295M0223j381n0204M845L3151k3121j7826J3610K6826L9570
8665A08685l3173k7928j3187K1573J5871K014j0990o387K068j1419l971K5062
8653F8218J7935Q29l1873J0235o500j1119k9723j0393M0239K4742m3242K3812
8641E3160L4886j3942Q774m6460L740K6373K2806l7790m2065L4461J0318p520
8629D6741J3270K6786k2451L385m896L83Q9p058K3771K0353K962j2845l8945j8974
$$ y = [35958, 71974, 71987, 93662, 82250, 52443, 47654, 36156, 2516, 24750, 41871, 36701, 48770, 97725, 85339, 77993, 59933, 77908, 110884, 100379, 72514, 62989, 66453, 100887, 141547, 155706, 134212, 78024, 66979, 58172, 52508, 63142, 68704, 71920, 93490, 110650, 112627, 90602, 68025, 60287, 42992, 83215, 81834, 31630, 36475, 69626, 46505, 28679, 42289, 69115, 108685, 75512, 47584, 34397, 55970, 71841, 73855, 62865, 56478, 58546, 47127, 43156, 68218, 86153, 86982, 55109, 65344, 58844, 47725, 18002, 7609, 47848, 72590, 29348, 53160, 88046, 74104, 82878, 36418, 40158, 66531, 89337, 51547, 9482, 43943, 54261, 46741, 60011, 86797, 64346, 67731, 62835, 63218, 63307, 56249, 80020, 100373, 103335, 90490, 51545, 32571]
8615C2571r561j4438q224K1021L7680L7234K0305k5313l7030m380K7849j1952
8603F5762l1179R436J1159l765K6365j3531j3131K9549K867K8792K1699J4753
8591A48776K0921J2794k5995j9012K4502l3504k2083K9738R687j1921j5728j3022
8579A05153l7645l2531N8389N7910m042k4042j1303n4358m1927j7663K096j0831
8567a0794L098M2895J2365k7512j6904K563R142k6492Q02M464l282K0475l2162
8554b1342k7737J9784L5324L1203j8634n148J6326L613J5397n062j7064K227q601
8541B0286J5163j1112l105j2841L327o47N707n482L0799J2344Q928j0714k5053
8528B7600j1488M631m980k3056k1612p52J3803N0491j0664p585k8758m118J7821
$$ y = [32571, 23010, 8572, 348, 21369, 59049, 96283, 116588, 91275, 54245, 49865, 77714, 65762, 34583, 44019, 55178, 51413, 77778, 64247, 51116, 80665, 83532, 112324, 134023, 148776, 169697, 182491, 156496, 137484, 161986, 128482, 106399, 136137, 145824, 133903, 118175, 105153, 67508, 34977, 93366, 151276, 147234, 123192, 111889, 57531, 15604, -2059, 37, -10794, -7696, 35199, 47564, 20052, 3148, 5711, 14853, -11639, -10837, -6373, -9655, 10820, -21342, -49079, -29295, 6029, 37232, 18598, 13450, 29776, 33389, 48786, 43724, 26660, 28887, 20286, 35449, 24337, 21232, 8391, 11718, 11071, 16778, 11296, 42095, 54439, 63367, 52653, 27600, 16112, 20743, 15763, -7293, -28905, -29657, -15854, 34637, 23973, 16388, -12370, -16488, 1333]
8515A333j2516J011J864P937k695J3616Q619J3371l050j6199q986O64j9902M8
8501a4885J3054L5995J4732j1784J4843K638l2466R904L7190k0031m2842J0579
8489A6927L2896L6835j883J836k2408k6464K803R409l6192O16j4654j9474M0062
8476B0309J2274k1958j9228j8255k055k391J8974o159K2756M4625n443l2388j4184
8463c123P8L035K903O716K5842k4865l6878K589J8045n066k335L7017M965l2792
8449c869k2498n81Q294L9474N361n640J0287K7507p272k4955M29j9682q139r575
8435a0859j1636N771O262o907N810J8895M3082p102k6700k0671k8209j3161L3524
8422a1901L7369k44l485R283J1763j8682l2917k0870J21K9955n048k0786L998
$$ y = [1333, -11183, -10172, -8308, -371, -3066, 10550, 19169, 32540, 29490, 13291, 4305, 4969, -14933, -14885, -1831, 34164, 48896, 37112, 51955, 54593, 22127, 32031, 69221, 49190, 6348, 16927, 49823, 86658, 84775, 86611, 64203, 37739, 40542, 49951, 13759, 14375, -279, -19753, 20309, 32583, 10625, -8603, -26858, -28913, -31304, -12330, -18489, 4267, 48892, 43449, 11061, -3123, -3045, -10, 2893, 9609, 35451, 10586, -26292, -23703, -5658, -10724, -13059, 23958, 28923, -3869, -26367, -26948, -18654, 20820, 26181, 20541, 30828, 58335, 51063, 26108, 26537, 6855, -1284, -10859, -22495, -16724, -10462, -17369, -11559, 7336, 50418, 43316, 16616, -4055, -32264, -45425, -11901, 25468, 25224, 21739, 31022, 42785, 24103, -8814, -29684, -29563, 392, -4656, -25442, -21444]
8409b1444L7921Q477n470M0141K8356M294j4752m865j5820L458N946q731k6462
8396C1049n359o088j0330j0917k318j6253J885q778K5565J2981j9658j3352K2994
8383A421K9855j827m106r865j8133m227j9240K8393J0467k2617k5092K8029q981
8370a5923J1464K9225M778L642K5356k1641J6555o553k1505k6440j209M2749L7897
8357G8395m960j1490j0336r600Q289J1794l985J0834J975l8014n2849m9692L9553
8344c0086L1385N140r990J9907j5369J0172q325l2647O320j7305k797L500k9926
8331g0021j4048J8219K1110M560j7538J6618O994M65n878J060J4881p04n852j6245
8317d6379K567J0192m952R667O1J7998j844q381L1213J9441J6122j0552k1246
$$ y = [-21444, 16477, 24954, 19484, 59625, 87981, 92275, 77523, 72658, 56838, 60296, 66242, 57511, 31049, 25690, 19602, 9272, -1645, -3963, -20216, -18331, -27109, -1544, 11437, -8221, -21573, 1421, 31276, 29449, 25343, 15478, -2655, -6882, -26122, 2271, 12738, -9879, -34971, -6942, -15923, -4459, 24766, 29544, 33186, 58542, 36901, 53456, 46903, 25398, -1042, -2251, 40498, 78395, 73435, 61945, 51609, 42009, 50298, 62092, 58107, 68941, 70916, 32902, -19947, -69639, -30086, 1299, 6439, -3551, 16356, 987, 11159, 2834, -29813, -23493, -40798, -43595, -40095, -70021, -84069, -65850, -44740, -40180, -57718, -41100, -34106, -33641, -39519, -38459, -23578, -24282, -30134, -46379, -43812, -33620, -38572, -28905, -28844, -10846, -12690, -21071, 10142, 29583, 45705, 35153, 13907]
8304A3907J673K4760O198k4615k0943j4911J3160L3987J635k6842m3455j0414
8292d5860K1809K590l6570k2929K2778M5536m131n35K290P57J4637J6765j6412
8279G25J9767J5230R95k1384l7187k4492n750O129k633k6351j561M4179K1899
8266a0434j8922j0368K749R241J6071K0637j1500K227M5708L1779r214j2206K574
8253E8342p463j4927k0334M960n017k9474k982L8073k4625l8292L2854K3734k5874
8240a1025N091l3167j726M9P693K0872m187J5856q11j6553m269K8653J8394k2984
8226A886J3851j8669r612L4536J7402K509j2543p1030o789K576L4504Q917R617
8213G155l2148J3675R79K3464k4984k0994k050O3973L1702k9480j2012r697j0394
$$ y = [13907, 15580, 40340, 46538, 21923, 980, -13931, -771, 33216, 34851, 8009, -35446, -45860, -24051, -21461, -58031, -80960, -58182, -12646, -16777, -17312, -15022, -14265, 372, 17137, 725, 20492, 35722, 36717, 15333, -21854, -46346, -52096, -45967, -48600, -74951, -76512, -32333, -10434, -29356, -39724, -36975, -27734, -11663, 8974, -2526, -299, 45409, 77188, 67974, 55768, 58342, 50879, 35952, 15618, 20578, 15561, -13913, -16895, 21178, -3447, -41739, -8885, 14849, -11025, -5934, -39101, -40827, -40778, -33085, -12213, -16400, -544, -1355, -17908, -22177, 6476, 24870, 1886, 15737, -2932, -12544, 21992, 39394, 41903, 29360, -41670, -48459, -45883, -11379, -2462, 7155, -24993, -11318, -10339, 13125, -11859, -32853, -34903, 29070, 60772, 31292, 19280, 9583, -811]
8200h11J3566k400J3218K8367j5111l7781k3979j6202J6849J2592L782M597r328
8187a2641k752K0273o664K8335O443l910J0055m2817j8442j2559J6193L1784N478
8174A8776k1879j7033N532L7320J7682j1849o334k650j2926k2005J6994K3816
8162B5444j6116j4931J4641j1938O586K0540j2719J7187K3957Q158l6425j5101
8150I283L7237l8648j7733J253j482m212K1969o511l1434N315K6367l071m519
8137f186n456P205j575j8370L2307R021j9967o686l6804l0117J1999M9343K5989
8124A0703n282j3082j8898J2331k1473J6365K0244K8920J5615J1675j6141k4125
8112A6852m594J7833K4967k063K4580j0180j2762l777K305K578r470j5564k2800
$$ y = [-811, 12755, 10355, 23573, 51940, 36829, -952, -24931, -41133, -24284, -11692, -7910, -3313, -12641, -15393, 4880, -1784, 26551, 32994, 29084, 39139, -3678, -22120, -34679, -18486, 13298, 18776, -3103, -20136, -14604, 22716, 40398, 28549, 22215, 19565, 6639, -15366, 1628, 25444, 9328, -5603, 9038, -2900, 3686, 24226, 11507, 28694, 52651, 60809, 24384, 9283, 46520, 7872, -9861, -8608, -10090, -14302, 7667, 1156, -30278, -24963, 1404, -1667, -6186, -11642, -4437, -6012, -24382, 7925, 16946, -3021, -9707, -46511, -76628, -64629, -15286, 10703, 5421, -7661, -26559, -14228, -35701, -19336, 908, 29828, 45443, 57118, 40977, 16852, 12258, 30091, 55058, 52995, 77575, 67395, 54633, 50856, 53161, 55739, 46269, 30705, 7905]
8099G905O450K0622j7564J680K1671J7469J6141j3604o803P530j4970j5324K386
8086C3589k4520j3042l026m2572p356L3094N9471L027j0073p497l288J0988J554
8073C0349k9318o485K4185k223M759o272k1063k0389p04p1N571L3944K7712J4698
8059E4693K732J5680J6704K1539l7034k9280J3923K7692j0614m4048k855K17J2160
8046D1509J3285k0101j7332J0448j1822o750M3956K1331k9798l2325K22L4728
8034D7351J6494r229k2511N194M1388k3912m0894j2338Q725K2290J6943N1J0775
8021F0327L6260n711k5371N503j2122K394j6066j530M5607J1991o18J7362k652
8008A15374j0970j4126j8881n97J5386J1031j7624k1864K932Q773j8110M927J2155
$$ y = [7905, 14355, 34977, 17413, 19093, 40764, 58233, 74374, 60770, 53967, 61497, 46527, 31203, 33589, 9069, -3973, -6999, -49571, -56927, -23833, 35638, 38665, 28592, 21095, 17807, 28795, 30349, 1031, -5454, 18731, 16508, 21267, 14995, -6068, -26457, -27161, -27232, -21661, 12283, 39995, 54693, 57425, 73105, 89809, 111348, 74314, 45034, 58957, 86649, 76035, 31987, 29132, 29349, 41509, 54794, 34693, 17361, 27809, 15987, 9237, 53193, 74524, 44726, 12401, 12623, 47351, 63845, 54616, 32105, 37299, 78687, 54775, 13881, 1543, 10268, 32558, 49501, 49552, 60327, 96587, 90876, 65505, 71008, 58886, 61280, 45214, 43684, 89291, 101282, 100664, 118026, 115374, 104404, 90278, 71397, 70800, 86186, 97217, 79593, 57729, 60661, 69434, 51324, 56251, 68406]
7995F8406k5141j8383k3351k497L4164r421p472J0250o880K1713q62l882K42j1314
7981B5572Q973L3342k989J06l8167l3706k5314K3281O83r595j1971J6096L5135
7968B1446j3660r086K8539j6060j791p468j2789n792K9378J3939K1209J1829j9228
7955D0466m460J6959J363O380K9880k5636n2799j1785J5653Q686n93j4135k2909
7942a2930J0747K3729J9636K6794k4455l5093j2407J4750M807N786K9659J3790
7930F4813l4217j8465L4345M6672N468n1199k2643J6913j4985p251K7356l857
7918D2950j0782J494K0152K4014o473k56J754J8024j5519q3570n0561M1358M4907
7905B7492j4464j025j2697N78J5994l454M0229j4158K1367k270l8350Q110K7381
$$ y = [68406, 43265, 24882, 1531, -966, 33198, 23777, 16305, 26555, 19675, 41388, 40526, 36644, 36886, 25572, 34545, 67887, 64898, 65004, 26837, -6869, -32183, -8902, -8219, -17814, -29785, -13689, 21446, 7786, -1300, 27239, 11179, 9388, 1920, -10869, -16661, 12717, 26656, 47865, 59694, 40466, 36006, 52965, 54328, 60708, 90588, 64952, 12153, 368, 16021, 24707, 24114, 9979, -12930, -2183, 21546, 41182, 67976, 43521, 8428, -3979, 10771, 15578, 21364, 51023, 64813, 30596, 12131, 46476, 93148, 98616, 47417, 24774, 41687, 26702, 19451, 46807, 42950, 32168, 33662, 53814, 77828, 71355, 71099, 72853, 90877, 75358, -8212, -58773, -17415, 27492, 13028, 12003, -694, -116, 15878, 12424, 52653, 38495, 59862, 57592, 19242, 27352, 54733]
7892E4733k0395j6710O631k0299J3428j3521k0230J0071J8907p996j5976k195
7880a3552L2718K3421J1049n3193l5137j9515Q826j8677K8416J1066Q099j8118
7868c4597k4463J6713J3644K0259J4976J2984K2996M896k7775k2624L619K3122
7856B3750K7700l077m760m711O4j1457k7962L0248q787l1809J1244L6203J0974
7843D7620k1770m834Q904j6239j9226K8949l195P307j3894o609M2043J048m196
7830D5908j3516l7448k9648o658k847L1436J0312J2944P348R59l4662l135L7247
7817A8240j0524l4769k1405J761j983K2549n877M182l1458M1379K8952P95L0784
7804D2626l75O423j7105j5928k2093n960J4088q931k5161j9342l615K1469M4380
$$ y = [54733, 34338, 17628, 24259, 3960, 17388, 3867, -16363, -6292, 12615, 4619, -11357, -13552, 19166, 42587, 53636, 443, -34694, -54209, -45383, -64060, -35644, -24578, -16479, -34597, -59060, -42347, -28703, -8444, 6532, 19516, 42512, 47408, 19633, -2991, 628, 23750, 51450, 48373, 43613, 38902, 38966, 27509, -453, 29795, 21008, -10801, 443, 36646, 47620, 25850, 21016, 29920, 13681, -5545, 23404, 20209, 27516, 13622, 7013, 49056, 50104, 45908, 32392, -5056, -34704, -41362, -44209, -12773, -2461, 10483, 17831, 18790, -15872, -19007, 18240, 7716, -27053, -48458, -46697, -48680, -26131, -32008, -27826, -59284, -17905, 11047, 11842, 42626, 42251, 48674, 31569, 15641, -6452, -12412, 1676, -7255, -32416, -51758, -55373, -33904, 10476]
7791A0476J3258M82r674j2357j4461l344j5689q047K1986J6494k2609j4661r916
7778d8062J8062J7651M2673j208k6127L314j9057o688L6369J2254k0052k2662
7766a3533J2377J8572o457k0395M375J111j8750l68K0791o903r619J1119L879
7753c801j1728l9532J2088K0971K7253P5j3043L443K5473j5670j9669j240K5332
7740I952K6465j1436l5682m0256J0350K5329K2145J3021K960l4643l1057J2703
7728c0149M375j3368k1446J8574N0124M5838J2347l8344l4183j4283j2547J1222
7716b1840O733k0685j9280M396J8379J1536K6725k9423k0133J2971l802J9461
7704a4962j3817o311Q203L3191J6892o776j5394L84K001p003j330j8466J4559
$$ y = [10476, 23734, 24216, 14542, 2185, -12276, -15620, -31309, -39356, -17370, -876, -23485, -38146, -48062, -30000, -12349, 30324, 29116, 2989, 6303, -12754, -19442, 16927, 29181, 9129, -13533, -1156, 17416, 10959, -9436, -5061, -3950, -22700, -23068, -2277, -9180, -18799, -7680, -3801, -15529, -55061, -42973, -22002, 5251, 5326, -7717, -4274, 21199, 5529, -14140, -15380, 9952, 36417, 24981, -10701, -50957, -40607, -15278, 6867, 19888, 22848, -11795, -42852, -30149, -25774, -39142, -60588, -42014, 8110, 53948, 66295, 27951, -6232, -20515, -33062, -21840, -15107, -35792, -55072, -50676, -32297, -20761, 5964, -23459, -43592, -30621, -34423, -14962, -28779, -35090, -26887, 6304, 23196, 16420, 1026, 1410, 3411, -3592, -4922, -23388, -8829]
7691h829K973q523L1267K4025k3633j7542l892l983L9007J1682r756P149o657
7678C3288l4570k699j5734O608J7544O741o899J5382K2527M076M222k768q303
7665C9415l0099j1697j3151N142L8910o721o798j6914j8541J6560K0105J1237
7653B7448k0736K060n296k6537j9246J646M7992j8767k51K7718r423J3147K0566
7640D0321R863O406n1255l5143J8217R919q100M7905j1810m0358K8175K020k5849
7627i689J0683j052K148l8822j3628j615N765Q181o473L4519N8678J7789k030
7614F4454k0905k6771j196J393j4358k3081O994J0832n913j2450J5856k4393J0260
7601a9278P724M089J4060k5897j7823j4259M0148J8697K9219m702j5524J9719
$$ y = [-8829, -5856, -14379, 16888, 40913, 17280, -262, -4154, -8137, 30870, 42552, 32796, 39945, 33288, -1282, -3981, -19715, -13107, 4437, 11178, 4279, 19661, 42188, 46264, 50486, 47718, 39415, 9316, -2381, -15532, -10390, 28520, 21799, 15001, -1913, -20454, -3894, 16211, 27448, 6712, 8772, 3476, -23061, -42307, -40661, 7331, -11436, -11687, 16031, 6608, 19755, 40321, 50184, 56590, 5335, -29808, -11591, -1672, -9772, 38133, 26323, -14035, 14140, 16160, -9689, 994, -58, 2090, -36732, -50360, -51975, -46210, -38029, -44502, -9983, 48695, 66484, 64454, 43549, 16778, 15582, 16975, 2617, -20464, -13470, -2638, -8551, -21001, -5145, -29538, -19278, -11554, -7465, 6595, -19302, -37125, -51384, -11236, 7461, 36680, 31978, 16454, 36173]
7589C6173J4304q765m0243k5410K1780K9188J2274j375k6921j8109o693k5192
7577c8989m386J6188j0133L6417K7916J4009R073n2016O622r949k6182r560N905
7564c5085L296L2747j0831k1737P309J955K4572p846j6978m1322L24L5189J8497
7551i910P945j4561K0938J4768K0144J5664J7250j5703L581l2845k6401j260J1992
7538A1602q237q148R143J6889L406n6497k9354R434R609K6018J2622L693p609
7525g429m001j6564j3021K863K1301m996K14M521q48L2183n739J7701j4333o982
7511D870M305R913J5998q510k4403J2577j6226q726J0376P160J281J1786p717
7498A2684k7255j4929O624Q098q218j5188q46J1483M0772k3954P932K9728r866
$$ y = [36173, 50477, 41712, 1469, -23941, -2161, 27027, 39301, 37926, 11005, -7104, -13797, -38989, -43375, -27187, -37320, -903, 27013, 41022, 50095, -1921, 4701, -5248, -31430, -40990, -35085, -31789, 958, -9873, -31610, -24301, -22346, 2226, -5620, -22598, -63920, -63596, -28407, -9910, -1965, -16526, 4412, 19180, 39324, 54988, 72238, 56535, 60116, 27271, 870, -390, 11602, 3365, -4783, 4360, 21249, 24655, -31842, -61196, -51762, -42153, -16135, -3513, 180, -7429, -11430, -27994, -41015, -38152, -16851, -21847, -21633, -17112, -17960, 14223, 8484, 26185, 11852, 4870, 9175, 19088, 35086, 26576, 2173, 14750, -1476, -10202, 174, 7334, 8615, 20401, 12684, -14571, -29500, -22876, -14778, -22996, -38184, -39030, -27547, 13225, -10729, -2797, 26931, 17065]
7485A7065J812J7281k5778m0499R642J1551O611J1805j4391l7365j7687J8625
7473d1328Q811k6746p757L118J6099j3178o047N531K8057J4156k9636l9653K6271
7460f2302N4735p05J154J7603j6211l4816k5101K7606J1043p21j2959l092o944
7447e0710L0169q127p741l9899j9290J8299L4805J2561J7487K5310L3698J1625
7435E8187n1780l8102l2026L812j9140J9424L2968p75k6315N2197K9947L2101
7423F0498L58j5803j917j841J3940j7743k7778j1546p301J0390J2243j7618m2847
7410d6965o306Q834j5272J5852L2056L0248J7324q677o597k3434l2631l3051M7162
7397b1457J1371J2545j0667R574p76M731J1035k850K0127J3440j9352j2261O612
$$ y = [17065, 18877, 36158, 10380, -30119, -20477, -8926, -2315, 9490, -4901, -42266, -59953, -41328, -32517, -59263, -67020, -63902, -47803, -60981, -67028, -61497, -33440, -19284, -48920, -88573, -62302, -7567, -8272, -7118, 10485, -5726, -40542, -65643, -38037, -26994, -27715, -40674, -43766, -50710, -20541, -28668, -36409, -76308, -95598, -77299, -42494, -29933, -12446, 12864, 46562, 58187, 6407, -31695, -63721, -59909, -79049, -59625, -26657, -27432, -53747, -1550, 28397, 60498, 60856, 45053, 43136, 41295, 55235, 37492, 9714, -1832, -9133, 1257, 13500, -4118, -46965, -53271, -44437, -59709, -43857, -11801, 18447, 35771, 27094, 20497, -2937, -35568, -68619, -21457, -10086, 2459, -8208, 1366, 590, 5321, 16356, 13506, 33633, 47073, 27721, 15460, 22072]
7384B2072O922J3343l2648n7349k26J1429J8662k34k5518L6798J6260k7990J1148
7371g331r019k9391J2031K2370J620N663L533l0080m192J6499j9851J4692L9723
7358A6267j7436j6494j7829J0361J2024l971l4376j496K8344p346j2000j6391
7346f0343j7134L0748L8020j2554J2452j8039N728j2445N029K9940P715m504j0823
7333f210J205J8133k058M9J8087R346j8880l1928k3776J8771J3883J1247k349
7320E520r01l535M415j8690k941K3798k929j8869j0604p586Q420O033j3493k9579
7306f0941Q329M1954k9412r743K6103p943r856K2746M495K0054n080j8717N139
7293a2872J8670L717K1141j5229m9732j1504L0173L1213J0474j6654j6873m012
$$ y = [22072, 28994, 42337, 9689, -47660, -47886, -36457, -17795, -18029, -43547, -6749, 9511, -18479, -7331, -16350, -45741, -33710, -11340, -9720, -4057, -524, -30604, -34796, -18297, -38148, -23456, 16267, -1169, -17663, -35492, -25131, -13107, -17078, -51454, -52950, -24606, -31952, -43952, -60343, -77477, -46729, -8709, -21263, -8811, -26850, -21122, -33567, -28538, 1402, 9117, 4613, -6210, -5005, 13128, 11070, 11119, 29206, 38552, 19672, -12256, -36032, -17261, -3378, 7869, 5520, 4619, 1084, 5499, -13191, -16132, 7666, 4737, -14132, -24736, -32322, -23902, -17869, -31362, -60941, -52612, -10658, -40070, -49813, -23710, -31653, -41509, -18763, -14268, 5786, 706, -18011, -12872, 5798, 9515, 30656, 15427, -34305, -45809, -15636, 15577, 26051, 9397, -7476, -11488]
7281a1488q880J364o34j2467P244l7768k3788L8012M2176J4971R274m223N236
7268A9029J2502o506l2576k5743P166K6560K7860n644k6709L012L1924Q256k3307
7255A5824r468j6835M3258K6636j3671k9967r611o321j1632j7155K46J315J539
7242b5842j7342M5526M9899k9150j4626Q839k2731l5818J8747J8513q964L988
7230h961J043J1676J4078Q989M141j191J883J2045j8071l3962j2493m5798O298
7217f0323J0034K568K5461O980M6408L7236j8351l0037l5607j0928j4657Q746
7205c2470j4256P724J946L2802j8857M705J631J55J9375q338m7028j6034J5523
7192e3122k0096K2839M4481M416m7522J0970N857l939k715J9473K936k2305l77
$$ y = [-11488, -20368, -19004, -19638, -32105, -24861, -62629, -86417, -48405, -6229, 8742, 18016, 13793, 19029, 31531, 25025, -7551, -33294, -26128, 432, 28292, 22648, -4061, -1049, 30875, 39131, 15824, 6356, -10479, 32779, 59415, 45744, 15777, 6166, -155, -11787, -28942, -28696, -27381, -25842, -43184, 2342, 52241, 23091, 8465, 17304, -5427, -41245, -22498, -3985, -12949, -8961, -7918, 3758, 17836, 26825, 30966, 29775, 31658, 43703, 25632, -8330, -20823, -66621, -60323, -50289, -47721, -22260, -15280, 31128, 68364, 50013, 19976, -15631, -26559, -41216, -32470, -46726, -39002, -37056, -4254, -23111, -18406, -16775, -16620, 2755, -5583, -52611, -68645, -53122, -73218, -50379, -5898, -1482, -49004, -38034, -32177, -36116, -38831, -19358, -16422, -38727, -39104]
7179c9104L262J7500K9930J7010p381m18j6635j0473J8436K476k7749l756l2865
7166d9767o39q65K2329K8616J2580j2431K1407K8368j1037j8715J1281K2180k834
7153E0473k738l7160k3977J4163K6623L2160l1314m8376k7962J9240K5562Q882
7141E576k4597k869o281J4970R205k0794j4179J4112J5055J5378k1054J312K3556
7128I390M1065J7889q415k2466j3036J6588M676k0247m6120k6205J3081j4954
7116d8754M7847j5656o4241j1866K3469N5959N5217l34k3368j0526K9371R004
7104D6122j5954l5822J8136n835l8186l652J5152k244m732j5823J626M254J5143
7091b1815K3664K6959j8137L0452J5266j714q082k018k2949q54J3632l2171j8995
$$ y = [-39104, -35842, -18342, 11588, 28598, 21217, 20799, 4164, -6309, 12127, 14603, -13146, -16902, -49767, -50406, -51271, -28942, -326, 12254, -177, 21230, 49598, 38561, 19846, 31127, 53307, 50473, 47735, 10575, -13402, 761, 27384, 59544, 28230, -20146, -48108, -28868, -3306, 5576, -19021, -21890, -28171, -13201, -3996, -24790, -38969, -24857, -9802, 5576, -15478, -14166, 9390, 50455, 68344, 59929, 37463, 24427, 41015, 45691, 25444, -20676, -46881, -33800, -48754, -907, -16563, -80804, -92670, -69201, -13242, 41975, 41641, 18273, 7747, 37118, 46122, 30168, -5654, 12482, 6647, -31539, -35191, -20039, -22283, -27015, -42838, -41212, -36958, -21815, 1849, 28808, 10671, 41123, 56389, 54675, 46593, 44575, 21626, 20772, 34404, 2233, -16762]
7078a6762j2367n241N2866J9805l8916k2465P498J6961p10k8561k2177L6679l0280
7065d3670j8035K382L0889L0331j1644j4017K2461n318Q547J6501j1633k0215
7053a3421k3764k9532P869J0015J3667M3370K338P332R710O252R755k1072p5722
7040e3203J00K5776L1128O91m326P602l366Q492K3373j0836k5798j556J2245J4614
7026B4936Q952L2779K685P350l9087k4467L1982M1263j5369l0617k0211M554k975
7013B1775k7680k16q63K5422J0180r464J39o721q889m124J7170p970l7856o905
6999c6002O812m476J0816J4853n323k3045j5576J3306K0847j9853n72K1839J9813
$$ y = [-16762, -29129, -34370, 18496, 38301, -615, -23080, -15582, 1379, 669, -27892, -50069, -13390, -43670, -61705, -59323, -28434, 1897, -9747, -23764, -1303, -6621, 1926, 18427, 6794, -13421, -37185, -66717, -58848, -48833, -35166, 8204, 10542, 17874, 27584, 33836, 43591, 22519, -53203, -53103, -27327, 3801, 4492, 166, 7768, 4402, 12894, 36267, 25431, -367, -1923, 10322, 24936, 33888, 66667, 69352, 76702, 37615, 13148, 45130, 86393, 71024, 40407, 20196, 24750, 21775, -5905, -6121, -6984, 18438, 28618, 19154, 19293, 12572, 3683, -441, 16729, 8759, -29097, -36002, -29190, -33666, -22850, -7997, -13320, -36365, -51941, -38635, -17788, -37641, -38213, -16374, 3439]
$$ [...]
##END NTUPLES=NMR SPECTRUM
##END=
