##TITLE=Analysis number 323564
Compound Code gk 02696
Project Code adrs
Chemist Name fudan
##JCAMPDX= 6.0         $$ Bruker NMR JCAMP-DX V2.0
##DATA TYPE= NMR SPECTRUM
##DATA CLASS= NTUPLES
##ORIGIN= Bruker BioSpin GmbH
##OWNER= nmr
$$ XWIN-NMR		Version 3.5
$$ Fri Oct 27 13:15:03 2006 GMT Daylight Time (UT+1h)  MAYBRIDGE\nmr@NMR_250MHZ
##.OBSERVE FREQUENCY= 250.131544655141
##.OBSERVE NUCLEUS= ^1H
##.ACQUISITION MODE= SIMULTANEOUS (DQD)
##.ACQUISITION SCHEME= undefined
##.AVERAGES= 16
##.DIGITISER RES= 18
##SPECTROMETER/DATA SYSTEM= dpx250
##.PULSE SEQUENCE= zg30
##.SOLVENT NAME= CDCl3
##.SHIFT REFERENCE= (INTERNAL, CDCl3, 0, 16.522)
##AUDIT TRAIL= $$ (NUMBER, WHEN, WHO, WHERE, WHAT)
$$ ##TITLE= Audit trail, XWIN-NMR		Version 3.5
$$ ##JCAMPDX= 5.01
$$ ##ORIGIN= Bruker BioSpin GmbH
$$ ##OWNER= nmr
$$ C:\u/data/dgb/nmr/ADRS/1860/pdata/1/auditp.txt
$$ ##AUDIT TRAIL=  $$ (NUMBER, WHEN, WHO, WHERE, WHAT)
(   1,<2006-10-27 13:14:41.34 +100>,<MAYBRIDGE\nmr>,<NMR_250MHZ>,
      <created by zg, POWCHK disabled, PULCHK disabled
       configuration hash MD5:
       49 4B E0 1D 92 C2 6B 37 9F E6 65 BC 52 41 86 1D
       data hash MD5: 64K
       64 C1 E2 98 C4 13 FA E2 03 43 E2 5C 4E 1D 1D 52>)
(   2,<2006-10-27 13:14:54.90 +100>,<MAYBRIDGE\nmr>,<NMR_250MHZ>,
      <Start of raw data processing
       ef LB = 0.3 FT_mod = 6 PKNL = 1 SI = 32K 
       data hash MD5: 32K
       C3 FF 72 BA 06 DD 68 41 44 B0 CE BF E1 49 3C F3>)
(   3,<2006-10-27 13:14:56.48 +100>,<MAYBRIDGE\nmr>,<NMR_250MHZ>,
      <apk 
       data hash MD5: 32K
       81 24 11 33 D5 6A B1 13 DE 8C 59 88 F8 57 B0 02>)
(   4,<2006-10-27 13:14:57.28 +100>,<MAYBRIDGE\nmr>,<NMR_250MHZ>,
      <abs ABSG = 5 
       data hash MD5: 32K
       07 A6 35 79 8A BB 2F 74 BA 4D FA 52 CE 1A 65 35>)
$$ ##END=
$$ 
$$ hash MD5
$$ 3B E8 1C 31 10 85 4C 65 1A 0D 27 F1 01 F8 BA B4
##$RELAX= 
##$RELAX= 
##$RELAX= 
##$RELAX= 
##$RELAX= 
##$RELAX= 
##$RELAX= 
$$ Bruker specific parameters
$$ --------------------------
##$DU= <C:\u>
##$EXPNO= 1860
##$NAME= <ADRS>
##$PROCNO= 1
##$TYPE= <nmr>
##$USER= <dgb>
##$AMP= (0..31)
100 100 100 100 100 100 100 100 100 100 100 100 100 100 100 100 100 100 
100 100 100 100 100 100 100 100 100 100 100 100 100 100 
##$AQSEQ= 0
##$AQ_mod= 3
##$AUNM= <au_zg>
##$AUTOPOS= <29 >
##$BF1= 250.13
##$BF2= 250.13
##$BF3= 250.13
##$BF4= 250.13
##$BF5= 500.13
##$BF6= 500.13
##$BF7= 500.13
##$BF8= 500.13
##$BYTORDA= 1
##$CFDGTYP= 0
##$CFRGTYP= 5
##$CHEMSTR= <none>
##$CNST= (0..31)
1 1 145 1 1 1 1 1 1 1 1 1 1 1 1 1 1 1 1 1 1 1 1 1 1 1 1 1 1 1 1 1 
##$CPDPRG= <>
##$CPDPRG1= <>
##$CPDPRG2= <>
##$CPDPRG3= <>
##$CPDPRG4= <mlev>
##$CPDPRG5= <mlev>
##$CPDPRG6= <mlev>
##$CPDPRG7= <mlev>
##$CPDPRG8= <mlev>
##$CPDPRGB= <>
##$CPDPRGT= <>
##$D= (0..31)
0 1 0 0 0 0 0 0 0 0.06 0 0 0 0 0 0 0.0002 0 0 0 0 0 0 0 0 0 0 0 0 0 0 
0 
##$DATE= 1161951280
##$DBL= (0..7)
120 120 120 120 120 120 120 120 
##$DBP= (0..7)
150 150 150 150 150 150 150 150 
##$DBP07= 0
##$DBPNAM0= <>
##$DBPNAM1= <>
##$DBPNAM2= <>
$$ [...]
##$SUBNAM7= <"">
##$SUBNAM8= <"">
##$SUBNAM9= <"">
##$SW= 20.6930455092707
##$SWIBOX= (0..15)
0 0 3 0 0 0 0 0 0 0 0 0 0 0 0 0 
##$SW_h= 5175.983436853
##$TD= 65536
##$TD0= 1
##$TE= 683.16
##$TE2= 300
##$TE3= 300
##$TEG= 300
##$TL= (0..7)
0 120 120 120 120 120 120 120 
##$TP= (0..7)
150 150 150 150 150 150 150 150 
##$TP07= 0
##$TPNAME0= <>
##$TPNAME1= <>
##$TPNAME2= <>
##$TPNAME3= <>
##$TPNAME4= <>
##$TPNAME5= <>
##$TPNAME6= <>
##$TPNAME7= <>
##$TPOAL= (0..7)
0.5 0.5 0.5 0.5 0.5 0.5 0.5 0.5 
##$TPOFFS= (0..7)
0 0 0 0 0 0 0 0 
##$TUNHIN= 0
##$TUNHOUT= 0
##$TUNXOUT= 0
##$USERA1= <user>
##$USERA2= <user>
##$USERA3= <user>
##$USERA4= <user>
##$USERA5= <user>
##$V9= 5
##$VALIST= <valist>
##$VCLIST= <CCCCCCCCCCCCCCC>
##$VD= 0
##$VDLIST= <DDDDDDDDDDDDDDD>
##$VPLIST= <PPPPPPPPPPPPPPP>
##$VTLIST= <TTTTTTTTTTTTTTT>
##$WBST= 1024
##$WBSW= 4
##$XGAIN= (0..3)
0 0 0 0 
##$XL= 0
##$YL= 0
##$YMAX_a= 417442
##$YMIN_a= -357272
##$ZGOPTNS= <>
##$ZL1= 120
##$ZL2= 120
##$ZL3= 120
##$ZL4= 120
##$ABSF1= 16.522
##$ABSF2= -4.171173
##$ABSG= 5
##$ABSL= 3
##$ALPHA= 0
##$AQORDER= 0
##$ASSFAC= 0
##$ASSFACI= 0
##$ASSFACX= 0
##$ASSWID= 0
##$AUNMP= <proc_1d>
##$AZFE= 0.1
##$AZFW= 0.1
##$BCFW= 0
##$BC_mod= 0
##$BYTORDP= 0
##$COROFFS= 0
##$CY= 12.5
##$DATMOD= 1
##$DC= 0
##$DFILT= <>
##$DTYPP= 0
##$F1P= 14.0000005364418
##$F2P= -0.99999901652339
##$FCOR= 0.5
##$FTSIZE= 32768
##$FT_mod= 6
##$GAMMA= 0
##$GB= 0
##$INTBC= 1
##$INTSCL= 1
##$ISEN= 128
##$LB= 0.3
##$LEV0= 0
##$LPBIN= 0
##$MAXI= 10000
##$MC2= 0
##$MEAN= 0
##$ME_mod= 0
##$MI= 0
##$NCOEF= 0
##$NC_proc= -2
##$NLEV= 6
##$NOISF1= 0
##$NOISF2= 0
##$NSP= 0
##$NTH_PI= 0
##$NZP= 0
##$OFFSET= 16.522
##$PC= 1
##$PHC0= -43.32333
##$PHC1= 6.356418
##$PH_mod= 1
##$PKNL= yes
##$PPARMOD= 0
##$PSCAL= 4
##$PSIGN= 0
##$REVERSE= no
##$SF= 250.13
##$SI= 32768
##$SIGF1= 0
##$SIGF2= 0
##$SINO= 400
##$SIOLD= 32768
##$SREGLST= <1H.CDCl3>
##$SSB= 0
##$STSI= 32768
##$STSR= 0
##$SW_p= 5175.98343685301
##$SYMM= 0
##$S_DEV= 0
##$TDeff= 65536
##$TDoff= 0
##$TI= <Analysis number 999999
Compound Code 99
Book Reference 9
Project Code 9>
##$TILT= no
##$TM1= 0
##$TM2= 0
##$TOPLEV= 0
##$USERP1= <user>
##$USERP2= <user>
##$USERP3= <user>
##$USERP4= <user>
##$USERP5= <user>
##$WDW= 1
##$XDIM= 32768
##$YMAX_p= 404812102
##$YMIN_p= -233672
$$ End of Bruker specific parameters
$$ ---------------------------------
##NTUPLES= NMR SPECTRUM
##VAR_NAME=  FREQUENCY,     SPECTRUM/REAL,   SPECTRUM/IMAG
##SYMBOL=    X,             R,               I
##VAR_TYPE=  INDEPENDENT,   DEPENDENT,       DEPENDENT
##VAR_FORM=  AFFN,          ASDF,            ASDF
##VAR_DIM=   32768,         32768,           32768
##UNITS=     HZ,            ARBITRARY UNITS, ARBITRARY UNITS
##FACTOR=    0.157963299565203, 1,           1
##FIRST=     4132.6476996994, 0,             0
##LAST=      -1043.33573715361, 0,           0
##MIN=       -1043.33573715361, -233672,     0
##MAX=       4132.6476996994, 404812102,     0
$$ Real data points
##PAGE= N=1
##DATA TABLE= (X++(R..R)), XYDATA
$$ [...]
23600 -5888 -11893 -24435 -17262 -17154 -23288 18272 43315 35606 29452 928 11820 41162 27179
23587 27179 -8123 -19821 -19027 -24445 -40360 -41549 -30022 -23296 -2652 46530 52087 33518 -6857
23574 -6857 -26261 -14057 13876 30740 6359 15411 39799 52910 44979 39152 32812 25166 37166
23561 37166 43635 -1974 -26233 -27821 -978 -22092 -34871 -24852 -13480 14998 19387 13394
23549 13394 3328 5446 -2000 14482 -2761 -8265 6285 16952 1120 -5755 23915 33544 16940
23536 16940 5673 11837 -18623 9672 31640 43212 26259 -4060 -35692 -16622 19046 25730
23524 25730 -12972 -29086 -7660 12598 7581 16022 26685 20033 28176 43857 -7956 -73480
23512 -73480 -64168 -38713 -41467 -27388 -33500 -46657 7673 34211 34411 40213 6130 387 -4825
23499 -4825 -47437 -56790 -40784 -27898 -46545 -31354 -678 54 2352 -3502 -31850 -40303 -61908
23486 -61908 -62759 -35972 -35245 -16539 -31617 -23366 2483 36679 63572 61715 30404 -15234 -13900
23473 -13900 -6606 11102 26850 28327 -3266 -21835 -57408 -45723 -57376 -53552 -43605 -17581
23461 -17581 3759 31824 32055 -7593 -49441 -55823 -50849 5602 28428 42057 40869 1451 -599
23448 -599 -1811 9666 -4375 -11445 24166 27386 -11978 -46274 -49410 -71887 -77974 -54759 -43638
23435 -43638 -32375 -58533 -88455 -74400 -51386 -55930 -32235 -16470 -28528 -35686 -43058 -68931
23423 -68931 -56732 -32866 -29489 -7716 -11969 -3710 2250 -23270 -11251 27754 25420 4261 -32720
23410 -32720 -42882 -9502 2911 55843 69200 9389 1958 -5934 -8058 15389 47220 10871
23398 10871 -37311 -11032 -3576 -9654 -10114 -21357 -20276 -21510 -2802 -19836 -55376 -55316 -34055
23385 -34055 -11979 -31645 -27245 -24214 -7428 -18061 -28737 -33253 -32200 -5745 -14277 -8139 9800
23372 9800 3868 40308 64365 33553 -17422 -38071 -28864 -10163 -4977 12638 19619 23587 6651
23359 6651 -27762 -22910 -43764 -63121 -47230 -71246 -55352 -28323 23201 -8361 -12914 14757
23347 14757 -8519 -6717 -18785 -10351 6218 12980 4158 27117 37177 34654 13505 -22576 -31675
23334 -31675 -24009 -5715 6800 -10106 7343 211 -16082 -54360 -59496 -43961 -2139 15529
23322 15529 -38870 -40515 -48474 -41007 -35458 -13087 23646 37632 22701 -9291 -37705 -52092
23310 -52092 -29411 -12365 -22363 -17934 -24385 16749 43964 31692 34463 14155 26699 40844
23298 40844 48392 45220 32380 -1270 -17467 -14948 421 27998 41505 17465 6489 18021
23286 18021 8935 -4746 -34917 -18710 19759 30489 11568 14307 50577 66859 71589 30779
23274 30779 -30760 -67092 -64344 -23374 -52697 -95786 -66675 -40970 -23524 -4792 1742 22521
23262 22521 6123 -28075 -58967 -39434 -12007 -35992 -32969 -63028 -71070 -38693 -16910 -18552
23250 -18552 -7110 -15977 -34285 -37507 -71764 -79483 -64738 -37558 -9838 3531 4999 3682 -9269
23237 -9269 14721 8005 3440 6562 15067 15059 27727 36895 12155 -1525 -939 -6136 4112 33948
23223 33948 19344 -26858 -16205 -24350 -12546 -16054 -8501 13662 45323 37435 -26778 -43802
23211 -43802 -13032 19459 3662 7543 -12906 -33232 -46704 -27112 -8103 189 -12335 2823
23199 2823 -22161 -28965 -4131 -33029 -65047 -47513 -2349 4093 -11218 -27293 -39810 -14634
23187 -14634 -7745 4340 24269 38004 32590 15400 12770 13652 12037 13061 -6202 -29661 -23581
23174 -23581 -6589 359 -4503 30481 29051 6186 4433 -1616 -5185 -14396 -46302 -29037 -2807
23161 -2807 4325 -27298 -48690 -46887 -35539 -3262 2811 -11983 39111 72558 86340 91997 72485
23148 72485 43412 24842 5886 6730 -13099 -51291 -59481 -37450 -22920 34877 84210 58391
23136 58391 24579 -7114 -30740 -68757 -69588 -23509 -3986 17970 23626 22128 160 7388 11501
23123 11501 9802 25347 15761 5152 -43163 -61845 -70497 -79538 -49787 -43895 -27642 -26594 -19638
23110 -19638 -16167 11666 2558 3400 16339 27614 28086 10781 -6812 -46458 -30165 6652 21254
23097 21254 19638 7822 6157 -3136 7333 -4581 -4520 4279 -5978 -2628 -2532 2895 -4725 1100
23083 1100 11063 14636 4166 -2031 -27496 -87098 -72772 -59503 -42261 -15102 22697 22688 22527 42104
23069 42104 14510 6941 28697 30330 65064 67353 69396 42579 23253 20417 -15643 -13143 -17022
23056 -17022 -33861 5029 10809 -369 11899 7070 14068 47233 92335 81271 64133 51569
23044 51569 34941 14445 27031 41774 54743 45025 2343 -11665 31581 38767 28130 23127
23032 23127 12801 25314 51355 45281 75937 89427 68397 58801 21651 -34225 -64710 -44445
23020 -44445 -25782 10714 27804 25567 11576 31424 17908 5104 24555 18340 -5619 16223
23008 16223 20048 15008 -28978 -58475 -52421 -58250 -19295 18895 64366 95066 63069 27319
22996 27319 38417 52760 38162 37862 40622 21599 3880 -7615 -29641 -71998 -58916 -5905
22984 -5905 -14553 -43995 -41902 -25040 -49674 -55620 -55463 -6993 29730 42164 34519 10455 41924
22971 41924 25966 -29550 -26410 -16063 -20846 -8900 -1647 -30098 -17941 -20754 17085 60224
22959 60224 71952 50256 12042 -2623 -12792 -37286 -33073 9750 36326 55658 44163 6683
22947 6683 -22607 -11432 -9238 -29544 -47446 -36405 -27195 -39374 -30018 -13286 -4019 -1683 1546
22934 1546 26579 23332 -14081 -64005 -54628 -36109 -14680 -9799 -39504 -32001 28036 74521 56671
22921 56671 14898 -18801 -29075 -9595 -20001 -51105 -67215 -58093 -22144 -24131 -32553 9252
22909 9252 43227 17623 19694 6836 -12973 -35728 -26268 -4243 -10257 -13855 -23341 -8904 -23372
22896 -23372 -2851 -8467 -31842 -45973 -64646 -35678 -20257 -3710 -32824 -38218 -18337 -35904
22884 -35904 -39930 -14592 5370 70115 70141 79653 78384 49311 23954 -1828 -15642 -6491 15671
22871 15671 27756 -22205 -53906 -20598 18147 2066 7759 -22935 7829 32552 56208 82757
22859 82757 105083 64158 10377 11108 29748 40294 19059 27342 37055 35318 35498 65697 44693
22846 44693 3322 -18619 -71432 -48301 -17109 -30532 -14559 3393 1350 -26664 -20254 35162
22834 35162 26678 3506 921 -32670 -15057 15657 21958 23229 -5724 -19989 -15768 4717 10610
22821 10610 -26029 13483 33243 -17914 -58323 -40423 -24749 -31997 -27562 -34071 -40542 -27256
22809 -27256 -6146 11903 14482 -3995 -45796 -80933 -70854 -66661 -88280 -85048 -69469 -43716
22797 -43716 -28196 -20617 -26989 -48386 -59899 -33658 -14601 31590 46107 39475 29882 15669
22785 15669 19143 2340 -14474 -11114 -494 -464 13793 6902 27166 13994 5352 1120 -18571
22772 -18571 -2112 18483 41861 45419 5585 -24174 -735 18226 32899 43132 31628 16558
22760 16558 8892 1861 7590 -17676 17310 12694 -12296 -3946 -3159 -8941 -39296 -76641 -69823
22747 -69823 -38709 -23706 -9967 5548 9826 29716 17030 7953 -19495 -38740 -53617 -62268
22735 -62268 -37895 -37182 -4907 7438 14530 15822 5988 3205 8426 2749 8464 25837 59406
22722 59406 71779 61404 20154 -24968 -33435 -9395 14517 8705 23161 23825 -114 -8268 6807
22709 6807 -11327 -21865 -30512 -18114 -41648 -58191 -43744 -46637 -24660 -5070 7956 16225
22697 16225 32095 2936 16094 59149 81743 58254 4366 -39290 -75659 -38647 27015 19437
22685 19437 -36390 -62649 -74630 -50888 -20865 1650 8172 -16910 -61148 -76539 -92404 -72463
22673 -72463 -39854 -46286 -56548 -63982 -50147 -11510 -1910 -16121 -31627 -18843 -2184 -17122
22661 -17122 -38329 -40519 -61209 -88777 -40929 13781 20476 -36971 -49005 -31632 -23735 -14912
22649 -14912 -5969 -32034 -45467 -25545 -2428 22292 20617 27118 18903 7655 25533 1704
22637 1704 -13097 -4912 -19211 -54676 -64091 -10747 37445 27614 7358 9097 -4585 -3630 8890
22624 8890 10567 9976 14575 5083 8188 -21834 -12182 16245 8288 -26068 -32370 -36371 -18100 -33492
22610 -33492 -28487 -23084 -66105 -61455 -45049 -33089 581 5218 -21300 1650 24413 15131 11658
22597 11658 10730 -10949 11405 37737 51479 37112 33974 42422 50048 21066 3959 -14081 16942
22584 16942 18642 6180 -18390 -13598 -15322 -12786 7694 9332 18238 -2045 -21465 -27574 7428
22571 7428 41582 15641 -6960 4841 29722 22716 16357 9166 -8391 -20876 -28981 4235 3737
22558 3737 1551 -6189 -11825 -24487 -11261 8552 -28526 -16961 38245 30599 23440 48152 -1562
22545 -1562 -30221 -29590 -26411 -34086 -16787 -8947 8988 974 8270 791 1843 -13350 -14596 -4105
22531 -4105 12335 17383 26157 45138 52395 32839 -12268 -24919 -28514 -48008 -35061 -43142 -60633
22518 -60633 -76061 -65061 -68056 -34557 -27935 -27333 -16336 18000 44244 26134 -4706 -18655
22506 -18655 -23154 -41638 -40725 -44224 -18488 -50748 -57319 -30270 -7397 -8862 34030 27607 -4549
22493 -4549 3109 7358 -8523 -31705 -40044 -52768 -15256 14353 7135 3502 28906 16263 1335
22480 1335 -618 -17391 -16910 20281 55106 64832 57250 64452 53733 36111 1548 25163 10922
22467 10922 8869 32197 30947 1609 15500 41925 27740 11808 10320 3986 -14532 -22229 -26221
22454 -26221 -46204 -70842 -63482 -48886 -34393 -20994 -19972 3894 18013 22524 18325 -18205
22442 -18205 -26700 -14251 -19965 -31551 -26082 -37390 -21809 -38189 -75179 -91588 -49817 -23947
22430 -23947 -29383 -36243 -10794 -25852 -22066 -11546 -24943 -39499 -30836 -34077 -29689 -16363 -6721
22417 -6721 -2049 -35293 -69817 -43774 2670 27478 -6286 -32878 -22219 -18400 -40482 -35976
22405 -35976 -11144 -18258 -23 7255 13129 42320 61275 48413 11979 -35537 -18275 -485
22393 -485 -10510 -2351 2826 -13661 7946 18144 -5651 3204 23738 1088 -47988 -35600 -55742
22380 -55742 -93594 -56142 -49137 -43231 8168 32889 14759 5804 18908 21593 -9917 -54549
22368 -54549 -73374 -20616 7528 650 -7666 2661 9174 9568 -7980 -1585 27493 44764 27974
22355 27974 35871 29808 18758 22954 5372 13756 -13581 -17824 -15843 19691 -12145 -26151 -5839
22342 -5839 -4530 4559 21941 3223 -11248 17377 50503 8320 -35107 -5487 12152 -29446
22330 -29446 -48890 -35652 -47714 -19315 16776 21133 4193 -22546 -53544 -22484 -11677 -3448
22318 -3448 -24985 -58981 -45881 -10502 2369 18413 9360 -15953 -28544 -2726 2880 6486
22306 6486 4444 -1773 -5396 17119 47808 26941 -7410 -9592 -12227 -25875 -23739 -34368 15714
22293 15714 29146 -1778 3896 27843 29284 -1242 28462 41463 65406 62234 39093 23359
22281 23359 5618 2118 -11563 15296 13463 9627 39782 61360 59492 26925 -20544 -35595
22269 -35595 -21318 -15674 -3431 1299 20222 63841 62244 42733 52682 42296 6478 -31394
22257 -31394 -14877 -12402 6007 47907 110360 91969 81763 46620 22195 -4747 -31226 -2084
22245 -2084 16881 11132 25533 42609 12712 -6884 -18168 -31386 -16324 -16744 -12579 -17792 -30529
22232 -30529 -32766 -63282 -74049 -53591 -34957 -51276 -41038 -14025 -18357 -17998 -8910 -10125 14327
22219 14327 11041 8780 -16841 -46123 -66063 -35602 -33682 -50612 -49987 -5053 -2480 17495 19638
22206 19638 76479 86355 48150 8969 -331 -27709 -16607 6018 5972 -13170 -39665 -64600 -17551
22193 -17551 6278 21777 13459 1984 790 -580 4036 -11800 5404 39473 43368 1225 774
22180 774 6809 30063 46722 18058 -3388 -7556 -18036 -4540 19825 11387 -14582 -20289 -30261
22167 -30261 -31428 -62787 -53943 -35035 -29421 -50997 -30084 -48800 -61015 -41340 -73461 -76817
22155 -76817 -8097 39567 45504 17912 -10122 -30448 -20381 -16235 -27237 -62870 -71234 -51192
22143 -51192 -8280 11901 11443 -7824 -45963 -73582 -66496 -22138 -39474 -49900 -28511 -35135
22131 -35135 -25640 -4694 -4151 21064 3994 -27957 6649 23016 2450 -11777 2677 -16464
22119 -16464 -46195 -46271 -29621 -23840 -41534 -53023 -1016 12943 6881 27432 19453 3601 10640
22106 10640 29329 7731 42719 45109 11127 -15970 -24138 -26929 -17041 13868 14475 -8570 8963
22093 8963 23816 18868 22126 17430 1312 13708 42426 45947 24045 -557 -27017 -28632 -41267
22080 -41267 -44838 -14328 -2010 36169 20643 11012 7612 -10075 -1260 -27137 -52536 -33041
22068 -33041 -8712 -4545 -7594 -16565 -21709 2257 15839 2496 -5164 -16576 -1404 8490 -15583
22055 -15583 -47371 -43714 -2456 4045 10694 -18869 -56615 -32470 -196 -10407 9877 13047
22043 13047 -7563 -25499 -29362 -33851 -33122 -30562 -31196 -7658 14156 -15772 -32090 -39969 -36661
22030 -36661 342 39435 43765 40150 28996 53525 52961 46329 46181 33709 -6331 -15052 22086
22017 22086 55045 50134 45517 58341 54552 53305 1452 -31525 -42365 -23142 -2438 -2805 1564
22004 1564 -9101 -13999 -6622 -22559 1844 21784 -17489 -47439 -22980 -19103 -31791 -19382
21992 -19382 2346 -2243 6454 21384 -6322 -6435 -1856 -13436 -13623 19755 4688 -33137 -239
21979 -239 19262 37266 42038 19292 18774 23 -15011 3058 14042 40991 42283 35749 21632
21966 21632 21915 8072 -8012 -21272 13732 4393 -602 -4934 1392 15503 21845 -256 28428
21953 28428 47754 4603 4899 2469 -40687 -20274 -2451 2709 34378 39640 36006 40993 32550
21940 32550 12968 2864 36117 44900 16996 3372 26726 47528 27628 29598 13757 12452
21928 12452 43416 51849 43120 44091 -16978 -32648 -1405 4288 -15034 -19438 10383 -3495 -30152
21915 -30152 -39720 -23388 -35273 -35222 -41946 -47322 -50987 -20551 -3130 -13317 -20344 -9560 -1666
21902 -1666 20990 20360 2418 25543 58306 57106 21246 -11505 -35220 -16294 -4104 -3493 -4656
21889 -4656 -15726 -42086 -60723 -70335 -31430 -13693 -33193 -37229 5123 6457 13138 30477 645
21876 645 -31800 -25624 -18000 -9065 -4580 -41973 -25548 2192 13764 -31613 -77683 -78489 -50886
21863 -50886 -42353 -23340 -31703 -67476 -78445 -77410 -44006 -28150 -9863 -42501 -55309 -45003
21851 -45003 -14296 6159 -11640 -14396 -51723 -49546 -62870 -78474 -53702 -4001 9587 -15734
21839 -15734 -27332 -28465 -31544 -40018 -17930 -6864 31274 9512 -1868 18504 23888 17883 33189
21826 33189 38980 29440 10533 -21332 -7983 -12190 -35907 -25965 -49376 -57994 -49338 -14062 24453
21813 24453 34894 40353 28419 6261 9850 36846 31566 15171 5053 -529 -17808 14539
21801 14539 27215 -4272 4576 17480 -4965 -34879 -37345 -47673 -61981 -48590 -33828 -24389
21789 -24389 6871 41273 -349 -9244 -21584 -26481 -20986 -23780 -31018 -35054 -18192 2378 -31099
21776 -31099 -43695 -4685 -21214 -45911 -20412 -14922 -19076 -12205 9050 -29594 -25789 -40521
21764 -40521 -44849 -22470 -13025 -28191 -34213 13359 43893 29979 14349 -40624 -66302 -61398
21752 -61398 -30375 -7517 -17979 5527 25026 4431 20688 6769 -38907 -74104 -59978 -33723
21740 -33723 -4251 23666 45302 26730 42342 34257 17422 19351 31628 21549 12228 20091
21728 20091 3144 -11835 -22620 -3373 27584 45488 22038 29071 35069 31737 9246 4135
21716 4135 46566 60304 25465 21801 5127 -6377 -27527 -13857 7404 -13671 -46356 -44412
21704 -44412 -30923 -65190 -104400 -100320 -85508 -72764 -55608 -3527 30552 41557 -18577 -17794
21692 -17794 -5703 -33510 -22812 342 8617 7996 21314 21210 2570 -4473 27087 47383 78478
21679 78478 74023 35206 32350 51272 38292 4916 -4437 -16713 10955 22539 20724 20672 17350
21666 17350 2163 -22986 -21653 -11376 -12999 -42452 -81890 -81116 -53385 -14773 23421 52073
21654 52073 37605 19470 15292 -4964 6251 20763 24372 16083 16935 20385 8711 -18956 -50419
21641 -50419 -57961 -31162 -12317 -12268 -214 1124 -15167 19320 46586 13799 14131 -2013 -4111
21628 -4111 11057 24859 20830 9512 -20350 -1299 -17940 -15562 -19378 1159 13395 6357 7752
21615 7752 -4405 5784 4105 -19726 -37227 -32504 2777 27096 30813 29449 6827 -19055 -2506
21602 -2506 -25143 5038 -7260 -904 -2245 2752 -964 -35622 -22460 25361 -841 -2494 6036
21589 6036 3877 1068 -1990 -5218 27778 43852 43892 33733 34636 11333 25266 57025 73881 45284
21575 45284 7004 -16859 -7458 14972 15907 -26965 -3430 -19782 -44914 6686 677 216 -24883
21562 -24883 -23985 -33332 -66952 -16281 -261 6078 -2943 -16190 -13656 12989 31107 15526 -18901
21549 -18901 -47665 -26972 -17344 -40800 -56784 -96325 -92429 -78515 -37763 4784 21209 -6886
21537 -6886 564 28086 37568 30395 -9429 -47884 -31949 1628 -9925 -10286 5745 -35 -24412
21524 -24412 -2413 -29751 -40206 -98977 -89177 -28622 6595 17320 -2745 -16857 -46720 -40227
21512 -40227 -22900 -2757 7511 5024 -18182 -49344 12110 61671 48940 32835 15292 -17509
21500 -17509 -665 9900 3317 18555 28356 10470 -7882 -32944 -65008 -49893 -29353 13064
21488 13064 10558 -9378 4320 15162 11261 5497 38394 22688 28401 36834 29581 20008 47810
21475 47810 50192 8536 30589 94712 88311 32444 -13612 -54670 -66643 -85661 -87287 -53974
21463 -53974 -13142 -3267 -34987 -42664 -38824 -15257 -1430 26004 16463 -19562 -54839 -71195
21451 -71195 -39653 -48424 -41063 -42672 -15876 13113 15275 49004 38800 12887 7549 -13503 -33829
21438 -33829 7897 29944 2065 1127 -4008 -16287 -12078 -25353 -55969 -65768 -23745 -18699 -16655
21425 -16655 -23104 -38096 -8902 -6 10106 -1541 -3594 -26859 -31881 -21815 17652 3257
21413 3257 -48064 -37061 23448 40653 5940 -35684 -30198 -39574 -25167 -13767 15542 17229
21401 17229 11964 4506 -1785 27427 -5299 -12212 -5069 -25729 -24557 -13663 -3719 9000 34289
21388 34289 33484 -2417 -9930 -1998 2281 20710 14668 -9013 -4885 3015 -6371 -19434 -10051 11252
21374 11252 13010 -2696 -16939 -17968 148 -39419 -67957 -36897 -37389 -13560 14374 2275
21362 2275 -21 3025 -16410 -22734 -35680 -45199 -54670 -46833 -36499 15077 15092 -14355 -8252 -12476
21348 -12476 -30595 -29438 -4950 26708 16775 10107 -8971 -23732 -25900 -41200 -37762 -43639 -51271
21335 -51271 -42208 -17876 -20336 -42425 -59094 -64587 -35518 -16556 42336 43453 19537 -28794
21323 -28794 -66649 -58718 -16123 -27043 -19443 -23432 -38437 -25976 -25872 -44112 -68669 -70151 -43438
21310 -43438 -29579 -23059 711 12428 -26118 -8848 34078 40990 12923 -33779 -101020 -72634
21298 -72634 -7495 23969 9498 -32280 -40984 -30186 2884 -20488 -14095 19159 -335 -40499
21286 -40499 -32689 -11289 25190 14404 2624 -19456 -22975 1410 6289 7628 -38268 17739
21274 17739 35726 27233 40178 30889 10721 12797 -1880 -31371 -47130 -16530 -31828 -49810
21262 -49810 -24113 -19423 3883 21049 34072 14344 -2093 -12340 7500 6078 -9651 -33324
21250 -33324 -8576 -45 7775 5143 -4329 8933 7756 -4220 -40196 -45489 -18158 23460 21590
21237 21590 19788 19691 12911 7639 30498 8150 -29509 -13654 14570 18659 15885 15355 -12824 -46805
21223 -46805 -55300 -20438 -5448 -5818 -23516 -26969 -33368 25641 38665 47480 50401 21616 20181
21210 20181 4558 -8505 16030 19387 21375 10371 26895 53745 45973 44200 53604 47014 36157
21197 36157 49007 20704 23504 37340 33258 21913 26339 32621 51513 64678 56002 32254 17153
21184 17153 4897 -37303 -22036 27186 5679 4462 24129 47156 72255 101060 119801 150037
21172 150037 186580 215117 236759 284448 319231 359705 370953 393054 387796 301202 240139 238969
21160 238969 209429 181066 142579 117144 115681 91288 90896 47686 -9153 -11512 27119 22391
21148 22391 27318 36953 50884 49571 26071 32543 46999 16639 -7649 -27056 -34134 -36906 7893
21135 7893 30993 32073 20520 3520 9421 37415 28666 28284 50679 48532 41665 46789 26389
21122 26389 15444 31991 66937 65732 39041 2866 11388 2017 -30933 -53853 -69865 -65098
21110 -65098 -17091 8112 243 24215 18223 13777 29922 64415 40013 20229 -23042 11809
21098 11809 41514 24207 -5961 -26380 -62852 -65071 -49805 -41265 -3276 47378 50240 35176
21086 35176 31031 30848 -13763 -26199 -7167 -15075 8434 28410 30405 21410 28831 35596 33074
21073 33074 35544 20591 28855 41132 45821 64543 49826 36537 23148 42746 45456 10961
21061 10961 13716 26588 12003 -25108 -37125 -23332 -43009 -38204 -10025 10327 4568 -4217
21049 -4217 -6807 -12909 -40706 -32773 -23080 -9944 3618 14468 4413 -14761 16159 49393 63661
21036 63661 44966 58876 40371 23176 1295 7567 -11637 -21814 -19624 1811 38856 36596
21024 36596 41976 12778 3264 -6661 9848 34205 46332 35748 30094 9561 16778 48593 34636
21011 34636 26704 19593 45224 21218 -10282 -45098 -56093 -20687 34615 55334 41522 22480
20999 22480 -22418 -46424 -17277 -9847 -4103 7975 35721 18939 -20806 -52553 -61184 -52814
20987 -52814 -47806 2265 37580 34511 38607 54735 75842 75232 61931 31081 19343 29156 21134
20974 21134 -5079 -43760 -48636 -37460 -8228 7221 11807 1735 25748 42348 33806 59679
20962 59679 29236 22067 19014 -29360 -49603 -63714 -53497 -42753 -38557 -11544 4878 -27113
20950 -27113 -46586 -39335 -42043 12561 28402 22230 24072 25182 23135 31927 71500 79427 67638
20937 67638 17436 -2646 6341 33166 46687 63913 74258 29287 17477 187 -24493 -1867
20925 -1867 18267 12804 13114 15675 27451 12140 3834 16946 56133 74473 72065 66667 88645
20912 88645 72711 43132 30564 61955 73793 31496 41461 3871 -45525 -36 6924 -12235
20900 -12235 -18148 11985 31099 19665 41941 57371 33353 -21787 -26994 1992 16251 -10058
20888 -10058 10373 69446 70595 35797 -5011 -31446 696 39198 52143 23538 -30725 -23220
20876 -23220 -2995 11600 40664 38260 56949 52575 16522 -20723 -6531 -11951 -13473 -12651 -4564
20863 -4564 22192 36815 36622 16898 6574 4970 -11431 378 5103 13002 23699 19072 17574
20850 17574 30940 22678 -2230 -18317 -453 8540 25788 22065 19346 24345 51483 71540 71091
20837 71091 23788 -30772 -39821 -24483 -19353 -19827 -4229 3154 1628 -13342 -27379 -3139 38958
20824 38958 48661 19882 4156 -2177 -15237 -14743 -46348 -83536 -84614 -49064 -52355 -30818 -21942
20811 -21942 8079 17223 125 -8251 8751 30319 34210 47834 47375 33968 18061 21754 17496
20798 17496 13664 25557 21391 -4519 28610 32961 6105 44099 46122 28089 33802 37492 26262
20785 26262 19724 32199 59756 68718 84586 64723 52495 39478 16853 27804 47964 60157
20773 60157 40366 29238 34710 40422 47308 73671 80027 47245 19969 65489 110529 111965 86536
20760 86536 55248 75166 86601 76651 97458 83215 61461 58322 55647 39708 38018 68344
20748 68344 78650 76217 40566 15709 37044 56609 40383 52793 41852 53858 70761 52371
20736 52371 31233 22787 34028 37833 18719 6018 2148 34728 28464 10718 24102 1935
20724 1935 -8762 -17769 1198 45533 54855 58490 55146 29758 34532 69201 92176 120557 138848
20711 138848 116886 110341 89007 88020 94736 72816 69585 65714 61196 46854 56018 75430 51822
20698 51822 63387 72666 64708 29911 26261 24762 45551 88918 88103 102907 108057 124963 110014
20685 110014 122557 111120 102534 60939 52513 44454 67040 102266 69040 55344 69409 73949
20673 73949 73327 39418 75802 83132 77729 91750 119340 115642 106479 89952 104473 140237 164504
20660 164504 150734 113295 132309 188665 205095 191480 170117 146835 142474 146193 151090 189705
20648 189705 201985 179468 178314 175401 173128 190048 169521 177498 200071 172456 115936 140198
20636 140198 170760 184495 207716 200156 203755 199427 199246 252322 269781 247694 217169 202736
20624 202736 229069 232232 206936 190840 174771 165118 134988 137484 170129 183029 195194 203098
20612 203098 201724 201267 190251 189557 228976 214175 211121 197898 200556 277064 290105 227652 239929
20599 239929 261757 253722 283237 290675 284586 281860 314775 302032 310835 328473 346165 366773
20587 366773 389526 389872 344760 360301 404084 410048 401012 381900 354083 338985 365373 430052
20575 430052 465320 475642 502005 517896 548687 582260 578397 594607 623515 653681 681843 697453
20563 697453 723260 775876 828061 874701 951400 1054233 1177265 1263816 1331954 1381965 1414707
20552 1414707 1468381 1523314 1623449 1765050 1898337 1981202 2049349 2092586 2070851 2004646 1958182
20541 1958182 1924236 1921314 1964648 2069523 2148461 2237259 2354098 2487438 2644053 2858442
20531 2858442 3055898 3249538 3470515 3760556 4094541 4441914 4912819 5451152 6027561
20522 6027561 6741792 7638431 8701145 9990768 11604088 13700858 16392694 19845872
20514 19845872 24321542 30154053 37567094 46679589 57203763 67998025 76750622 80525141
20506 80525141 77451004 68461164 56818767 45690164 36491188 29364872 24002710 19948705
20498 19948705 16901003 14542162 12687931 11238813 10048993 9025285 8139835 7431612
20490 7431612 6856762 6312929 5794909 5369384 4996821 4682073 4372374 4099675 3854244
20481 3854244 3641620 3464397 3254231 3063996 2938435 2846635 2767960 2686711 2672966 2658457
20471 2658457 2644285 2654883 2686859 2647360 2558107 2412275 2265482 2098616 1959468 1856481
20461 1856481 1796058 1732704 1659815 1637678 1643038 1575995 1459258 1372301 1280172 1188302 1140491
20450 1140491 1068171 1017656 976601 922151 867776 861923 813325 765916 744699 771753 762056 695979
20438 695979 636368 597990 600452 585851 565513 533086 509097 509780 503873 514136 490709 458198
20426 458198 426352 386113 405646 421137 419600 427556 431017 409636 360906 366290 386297 396182
20414 396182 372155 333990 308023 283711 283680 292105 252912 252822 264055 260816 247332 246540 258729
20401 258729 276601 276912 267323 230786 250535 269291 236921 232738 250702 233136 222980 184685
20389 184685 174246 185792 173414 175991 190516 227716 251561 257315 218544 164346 115081 77717
20377 77717 101697 129688 124573 123679 148207 136564 138091 126091 112413 97491 127523 101203
20365 101203 83494 100757 112266 86961 50631 50705 30854 29555 41753 1306 -31770 -27878
20353 -27878 -37410 -55487 -43032 -16117 38056 49651 50036 37540 40052 57657 53543 97217 110918
20340 110918 99235 91992 88383 99408 111992 81484 82452 71573 52646 46209 43009 34742 31167
20327 31167 27044 28520 40930 37236 50006 59238 36950 13731 1703 21577 6064 -7021
20315 -7021 8205 21802 53794 94169 87952 65568 35906 25371 28450 44473 51135 49987 59306
20302 59306 49918 51878 49234 3911 10985 -2136 -28884 -20754 -39466 21705 36470 13820 -6334
20289 -6334 4651 39319 43446 43301 65744 103391 93156 68291 76195 59012 41751 6306 28399
20276 28399 38619 61760 48679 33926 26018 29121 1892 -3077 -19833 -42478 -44472 -16502
20264 -16502 38406 62031 63783 49999 43492 45380 14055 28641 43018 25993 27846 54847
20252 54847 42457 22564 19062 19816 21562 46056 38285 57427 51122 50511 72346 86648 76232
20239 76232 64057 42038 7870 -2323 -7284 25084 41948 8538 -31216 -18388 -26428 -13313
20227 -13313 -10154 3754 -23947 -30478 8616 24739 20636 5040 31378 20194 -12109 917
20215 917 -4392 -12092 -593 7836 -917 26611 32585 21042 29350 27487 28230 61939 99187 88601
20201 88601 75466 124171 158976 150157 131961 109788 77203 32362 13819 33303 6443 -47391
20189 -47391 -18394 12947 25148 13679 -8045 -8254 45304 28887 18862 20547 -2061 -24765
20177 -24765 -4766 -5207 12488 26122 44684 43534 25734 27748 10047 6827 41524 42103 14210
20164 14210 -14065 -21729 16856 51292 45173 52923 5318 -19044 26409 55630 38519 44573
20152 44573 88837 88804 91025 126715 175987 218637 281627 370325 502350 551795 535919 434543
20140 434543 331663 270582 222615 156254 107844 78696 75350 61681 58497 64611 83512 102115
20128 102115 53899 33323 44585 69832 64143 47347 86050 96501 56312 5639 66858 102714
20116 102714 81104 62691 49919 64364 50078 52320 40868 11836 19371 37118 32886 21132
20104 21132 37634 31408 14387 3447 46148 78740 71054 29658 8251 7116 2690 2822 -325
20091 -325 14508 17049 8695 -10727 -26324 -29656 -11590 -16889 735 27140 9269 21299 14230
20078 14230 12355 37649 31032 10400 -23258 -10291 -4330 -26670 -39372 -38425 -23666 -8615 -13409
20065 -13409 -8325 -11182 -28854 10292 32010 8488 -14472 -35534 5322 35175 18525 -17497
20053 -17497 -28998 -9693 -5752 -3150 12756 36719 20507 -195 57128 65613 61148 57269 53515
20040 53515 71339 75937 60095 41414 22101 -586 -54628 -54785 -42132 -17150 -47062 -35061
20028 -35061 -38507 -5387 23040 20349 36919 15696 -10234 -32333 -37608 -17886 11547 20542
20016 20542 38874 40905 50646 39616 41823 39062 48926 34929 36153 42249 37948 22192 -24019
20003 -24019 -20595 7135 9287 9799 8085 37594 75093 47029 16330 16822 13372 -19781 13210
19990 13210 37435 19074 27277 31515 21572 20971 19877 22305 39743 28105 483 -14969 24528
19977 24528 31831 41355 21965 13633 34629 37440 48790 17911 -7161 3798 -7452 -29138
19965 -29138 11577 14308 -25153 -15448 7121 -18749 -14953 10513 20048 -9297 -3775 3424 -8983
19952 -8983 -41399 -39221 -8608 24300 21521 17255 -9299 5727 53034 70353 65283 61046 49551
19939 49551 18725 -2609 15314 45018 85138 71168 53738 46074 13457 483 27721 49044
19927 49044 32047 9948 5791 -279 -9909 -2027 9177 782 2955 1947 -8610 -19867 -24520
19914 -24520 -36841 -33888 12689 20249 2452 20564 40979 54075 64582 31362 16591 3580
19902 3580 8548 -12795 -14553 15152 -20757 -12867 18385 40604 -2798 12192 31394 43801
19890 43801 750 1374 15624 23414 14907 36694 50066 81918 86205 54165 57088 69734 53228
19877 53228 45173 32248 13468 5993 3634 1304 -2184 -27225 16340 62574 47148 12261 21831
19864 21831 32640 41170 32649 20150 23153 30164 29002 40847 44898 53461 86737 93082 78251
19851 78251 63066 62022 61339 81408 116894 161615 201593 257444 295921 349248 413942 382178
19839 382178 334926 296909 214609 195080 196847 146082 87132 44530 14941 -2285 11904 39361
19827 39361 22174 19183 37989 33257 52474 54857 51652 55619 101921 127333 123467 143817 158316
19814 158316 169549 140823 121688 95926 66514 85007 74731 73073 66803 60019 53907 46592
19802 46592 15379 46097 46790 53533 71075 86494 89359 65222 24134 -5143 -19783 9378
19790 9378 12598 2687 17247 46732 46067 58914 66845 62555 44411 47641 87319 75840 103061
19777 103061 80876 70268 86648 102162 131065 124364 99683 52627 31244 38215 53838 60610
19765 60610 45889 40728 39090 -1060 -19679 -23760 -28461 -30746 -15280 15088 53196 47482 23626
19752 23626 24939 51757 37547 -17890 -15916 -14256 -282 -4217 -276 6852 32200 36559 22227
19739 22227 33151 20017 52842 66382 40334 32175 45217 15202 16909 42229 66362 60688
19727 60688 105378 144182 125435 98335 101653 93297 76451 68084 51462 50483 39633 69680 120641
19714 120641 133079 128991 103405 81552 87005 106043 99366 67223 25110 12137 32901 78168
19702 78168 65182 64522 99475 102920 63012 24021 24172 22248 40481 29305 30824 30054 24755 42001
19688 42001 41293 45507 78172 89142 93889 125934 126518 107846 93592 94652 124207 139166 177366
19675 177366 227529 258632 227343 168094 156900 154983 144857 123598 121322 101827 87703 92695
19663 92695 117870 136464 120900 112695 131977 116980 140633 171527 159913 159388 134809 129018
19651 129018 134030 142347 139508 100215 118610 144328 175210 138808 94015 108359 146244 160375
19639 160375 150514 166434 136365 92392 73844 125114 168521 164297 145972 132341 155436 147433
19627 147433 170232 202127 189403 161317 159773 163800 146832 130490 153638 180268 188729 172488
19615 172488 180378 200141 236075 236306 221444 236681 244364 242330 271128 312470 324583 258893
19603 258893 228594 250872 257597 260060 283633 306784 325639 325418 312525 322630 336778 323173
19591 323173 330139 344189 349077 346736 361270 383817 389960 401494 420831 410615 427201 455669
19579 455669 503551 533114 520090 550557 605623 626022 611120 597573 590087 634243 695819 721371
19567 721371 747571 759768 817217 912981 982017 1048650 1162908 1257922 1342253 1412645 1462071
19556 1462071 1539601 1679984 1828975 1977022 2011042 1983935 1979972 2005717 2046845 2173216 2322982
19545 2322982 2502732 2728742 2916728 3084849 3259088 3528697 3883632 4289383 4782496
19536 4782496 5352228 6055581 6929912 7977819 9290925 10895035 12954532 15697900 19512402
19527 19512402 24863692 32349991 42787001 56624941 73516192 91003329 103242058
19520 103242058 103234462 89537054 69333570 51135411 37848042 28798440 22671900 18465910
19512 18465910 15524818 13407240 11798204 10446669 9298400 8273412 7413189 6695899
19504 6695899 6112399 5642455 5269640 4932839 4661781 4414728 4175035 3939757 3725761
19495 3725761 3488339 3271976 3081644 2943756 2859787 2792154 2757809 2718068 2633652 2461878
19485 2461878 2260734 2101614 1939252 1817854 1742016 1693518 1666102 1657719 1597266 1493298
19475 1493298 1389439 1276598 1188578 1105901 1042158 1032827 988424 942669 896620 901983 891906
19464 891906 868074 818582 783533 780328 752961 727917 648042 579082 601246 643056 600153 593992
19452 593992 583863 597111 547823 509756 501314 482555 470567 482355 480087 447683 424319 393704
19440 393704 401105 367060 321988 315129 311745 289873 271611 288384 295835 300511 319415 319178 318767
19427 318767 341170 328969 287192 236663 261063 260691 239515 242385 232552 237630 282294 311644
19415 311644 290387 270719 266490 260605 250288 253564 261792 264676 225405 170779 161527 146398 151755
19402 151755 160382 171861 200725 188342 190264 190711 191835 186059 178040 181947 161022 154476 129299
19389 129299 129781 139175 138778 114980 110335 145245 139668 103671 86080 71426 82369 110392 119300
19376 119300 104250 117497 113479 69357 51272 38602 30939 11233 -17763 -50005 -44766 -45514
19364 -45514 -21273 27106 39174 38767 47165 14730 -27684 3374 40355 52320 51206 44957 80095
19351 80095 85285 87039 75872 31347 11312 51689 67453 101593 96106 77736 29323 42270
19339 42270 26511 37114 64294 95588 98095 37716 377 -27811 -14893 -1076 40810 26338
19327 26338 -7148 -826 46643 73679 40978 51146 55308 68586 66164 47994 17734 20069
19315 20069 7810 -26523 11102 14214 -18018 -2354 15644 46272 47989 15830 -2683 37688
19303 37688 32891 16881 -9330 -31717 -6921 32309 45668 40871 23679 15510 14291 47413
19291 47413 54754 33641 53073 83004 53830 51012 37102 2378 18410 65991 56949 43796
19279 43796 15488 25332 42599 25464 11968 -24542 2682 15762 34937 55061 58371 34128
19267 34128 13201 18683 13693 10386 19089 20312 25892 18711 22689 -7470 -49425 -68018 -44466
19254 -44466 -29415 -32972 -19925 2179 -8687 -18409 -1911 -1461 -9835 -26943 -37488 -32125 3795
19241 3795 6322 -23953 -2311 11102 35883 2938 4078 26695 29216 46430 46507 50766 34309
19228 34309 11259 -15202 13528 40233 10495 3851 -4276 -3094 -33721 -35809 -30583 -4879 4674
19215 4674 50303 74856 73074 79555 73711 50880 25845 22971 14474 -11063 -25477 -46690 -25518
19202 -25518 -8032 29592 40365 35589 18412 9556 -8318 -14006 -22836 -11492 8294 37618
19190 37618 19487 -19628 -21823 -15791 -38324 -27429 -29439 -14817 -24317 -16058 5783 12866 3957
19177 3957 -9589 -16850 -30429 -35307 -31610 576 62919 44307 16735 31088 15271 24015 39685
19164 39685 49801 48326 31375 35702 59738 68871 37967 33902 18245 31347 9230 10118 25914
19151 25914 10317 30257 43026 42297 35587 33770 44733 60109 55704 43176 28469 50857 47415
19138 47415 74331 92815 81554 62165 26725 19649 41860 65102 53833 29824 15577 -10411
19126 -10411 -3073 31527 28237 31409 23095 11744 18305 350 -34364 -11292 19428 19349 -15992
19113 -15992 -11730 -4481 4026 13983 2724 -6661 -17871 -4435 5792 -483 -21575 -7862 592
19100 592 -17129 -24591 -24546 -40905 -41895 12580 22988 -9262 -25924 -18724 -6297 -849 14964 3341
19086 3341 17593 29152 38955 70752 95244 63511 44135 45694 65543 55886 8109 -22214
19074 -22214 -24658 -31467 -20051 12177 -11563 -17881 -14815 -9635 -14697 3033 -22873 -37638 -50025
19061 -50025 -21621 1045 -28483 -27465 -33465 -22829 -6372 11974 43638 42191 13681 -25148
19049 -25148 -53344 -31125 18375 14124 16109 12271 7627 -5220 -8473 9567 4554 23488 10828
19036 10828 -5761 -28474 17669 38299 2777 -14799 -21989 -16543 13687 1945 -21167 -31761
19024 -31761 -30550 -10329 13182 35947 23528 2068 -36425 -18390 -19685 -26933 -48267 -19115
19012 -19115 42955 21459 4488 18415 2192 1133 5405 17334 9775 -9875 -10707 3034 18294
18999 18294 35960 20491 2416 -10296 -22195 -18555 6526 -17128 -57937 -59383 -22826 -25188
18987 -25188 -28012 -27280 26598 55422 46453 27620 9681 -41650 -33914 -24274 -15792 -25633 -49648
18974 -49648 -44223 -4411 -14327 6645 23207 7420 -6331 -42870 -24431 -20488 -31376 -23329
18962 -23329 -3924 -1498 2303 48259 41607 52105 36054 17406 -10924 4691 15902 14969 -12349
18949 -12349 -43936 -35839 -18621 90 -4341 -5121 5190 11433 -6553 -3764 -27830 -8074 8759
18936 8759 4497 -1170 -27020 -7642 7716 8278 15756 23643 42684 31730 4545 -2712 -22891
18923 -22891 -41454 5917 52184 58459 35450 29976 30959 9894 -946 31659 29006 18332 2965
18910 2965 24897 29808 33385 34999 53505 60605 76466 71855 67543 56764 34613 53846 121645
18897 121645 154779 180826 223833 291980 374498 459394 514294 539571 480175 383563 328185
18886 328185 303461 249052 179851 124737 70215 33267 2600 1277 46196 54061 37304 30696
18874 30696 1802 -13613 15171 37414 5449 18793 50944 17593 41026 31702 3676 -7639
18862 -7639 35829 31571 -9658 -30527 -46786 -33999 4136 15807 -13104 -18652 856 -537
18850 -537 166 13926 -10939 -20441 -18353 -21172 -47221 -46752 -42772 -22349 23129 40707 4796 -54696
18836 -54696 -51761 -44012 -27098 -32885 -28117 -12012 -26479 -30005 8055 8045 14632 2719 -5361 -14359
18822 -14359 -28729 -20643 -3306 8522 9019 10083 10764 13313 -706 -11699 -31111 -28627 3952
18809 3952 20824 49721 13931 6440 32565 16089 -17173 1793 3206 4006 34355 41000 36212
18796 36212 42053 22265 -3087 -31666 -5426 8095 645 16803 -940 -22472 -63130 -54523
18784 -54523 -50159 -76455 -47766 -29164 -32571 -14687 10275 49273 44678 44379 56739 50562 101106
18771 101106 117940 171513 264346 257532 211041 164468 112900 47701 46985 58942 42640 3207
18759 3207 -14845 -26208 -33293 -22538 985 19487 27913 35580 32387 39539 47169 17269 9015
18746 9015 2824 -9093 -7753 -813 14409 20731 9151 3789 32435 46981 -5763 -27490 -57514
18733 -57514 -38159 -48699 -44787 -25564 -14486 -23206 -17306 -17685 -5125 6086 8019 -13802 -31242
18720 -31242 -57230 -57758 -26724 -4072 -23219 -28366 -16098 19683 16722 -28105 -66026 -70458 -26979
18707 -26979 -22519 -17517 -27620 -7644 -2825 -27566 -27316 -45941 -67115 -45345 -38828 -19012 -7711
18694 -7711 -17793 12858 9725 7806 15224 25226 30224 4151 -29436 -31223 -38541 -57034 -54189
18681 -54189 -22249 -12489 -23847 13191 16745 -98 -14534 -13599 -23896 16684 23818 -13052 -23573
18668 -23573 -12108 1382 55468 66556 57951 74419 57785 6649 -3275 39318 36958 -6071
18656 -6071 7717 20514 34949 22301 45477 58276 55208 35538 39861 27805 -2990 4801
18644 4801 -21815 -15231 17395 20752 23131 -4026 -48565 -44813 -41522 -25664 -1674 12538 836
18631 836 18763 29943 11229 -29069 -47550 -14368 333 -3589 -3270 11823 -15591 -18227 -7919
18618 -7919 -8166 3255 10144 19329 -8874 1181 15670 16550 43423 38208 33541 24091 41811 48775
18604 48775 -711 -25820 -21891 -19264 -27676 5820 30118 50223 42412 18571 11881 3962 10426
18591 10426 17566 31170 27320 18555 -2534 15282 23779 25328 15160 25491 60035 61324 28720
18578 28720 -14540 -44784 -30738 -19277 -38836 -23981 33762 20767 3097 20250 28471 33696
18566 33696 37064 28547 24953 -2611 8189 25409 41726 61392 50284 26896 29408 7314
18554 7314 29088 72647 90231 53354 17885 12856 3529 4370 16875 12854 35776 43567 31501
18541 31501 28162 5180 1013 8724 7423 -26306 -58467 -37746 10500 41430 12792 -2172
18529 -2172 -12401 3310 23700 -999 -18777 -11444 -32635 -27206 -50311 -27842 -13787 32235
18517 32235 45478 6586 -13997 -41039 -20780 -344 -5625 11948 11458 -21392 9861 3957
18505 3957 9223 51228 52411 31928 -31355 -1692 37368 18176 8791 -3556 -27917 -6052
18493 -6052 -581 5492 -16624 -13850 -16108 -74695 -84922 -43104 -11944 -12597 -9358 -15767 -1765
18480 -1765 2264 -27103 -47803 -43113 -35500 -9062 24781 6075 -10014 7368 93 6621 21453
18467 21453 18029 -13975 -10145 12270 18410 25036 -31600 -59071 -35957 1272 22606 13597 41345
18454 41345 40335 -7236 -21265 22164 40400 12437 -24310 -30416 -21178 -12638 -26218 -56494
18442 -56494 -55487 -25012 -21106 -4147 -11012 -33442 -42197 -34677 -20625 -23822 -17201 -1020 -17687
18429 -17687 -11026 14266 13353 11173 -1894 9811 6890 -40228 -45802 -51001 -56371 -58031 -69936
18416 -69936 -53648 -29793 9080 63606 79008 44416 -19925 -43656 -55406 -46407 -33789 -39061
18404 -39061 -23987 -53433 -70863 -44269 -12804 59724 92124 63904 19259 -4338 -1214 -20961
18392 -20961 -10306 -11669 15578 16074 -24802 -5401 10275 31122 2058 21182 28977 33437 22601
18379 22601 4943 -29315 -21178 -5162 18747 33677 43132 46008 59216 90252 95170 80641
18367 80641 84413 110394 93140 62017 77218 86729 73133 63420 70286 11223 -1183 -3575 -12739
18354 -12739 4911 6532 5462 7129 11221 8185 -9160 -23123 11841 6212 43574 42321 18894
18341 18894 19057 37199 31154 2039 21713 -9942 -36229 -31334 14939 25328 1726 -18861
18329 -18861 -37112 -42166 -19802 -3351 -24566 -34549 -39416 -30930 -37827 -10144 -15706 -24208 5032
18316 5032 28614 11703 4300 21852 48173 39147 13310 -10971 -20576 -24339 -25051 -22675 -6350
18303 -6350 16229 304 -9127 -13336 -11705 -10748 -28807 -23643 6935 17377 -8106 -26601 6913
18290 6913 8523 7481 10239 -4419 10766 35970 849 -23993 -5904 18620 23338 8827 36998
18277 36998 17129 14391 17693 29926 41341 25318 12674 19914 30414 17683 14488 70574
18265 70574 102104 97766 106711 110000 72251 21429 54865 82835 78873 45043 16016 11917 17676
18252 17676 24304 32201 37852 28458 15976 9437 22180 41173 32269 7419 -25436 -21264 -417
18239 -417 17637 49692 85495 74452 54504 74569 66470 67720 65315 34466 7826 -30897 -5430
18226 -5430 20335 42640 58818 44548 31298 27811 -17485 -17617 24643 61197 57682 32365 8021
18213 8021 12719 22064 28182 45719 31234 62004 74990 49630 48321 55673 53607 61399 51997
18200 51997 84508 94625 43694 42619 64529 67077 7423 -6096 33005 80993 67235 70762
18188 70762 67250 56907 40584 51183 73655 88605 104632 137135 147763 143881 158480 133990
18176 133990 121100 108647 103949 92134 78023 92560 102630 84972 64540 71386 66211 57112
18164 57112 53163 55526 55535 66256 86792 142559 204553 199696 186129 153195 167090 184783 182987
18151 182987 169159 193445 238876 261176 284203 265682 263090 268635 284742 284442 271988 284359
18139 284359 328992 391505 418401 465163 489371 556482 623637 698798 751769 769282 814741
18128 814741 885001 1032708 1164165 1241240 1387416 1569544 1750264 1994519 2326383 2823678
18118 2823678 3505772 4411271 5710908 7674739 10656591 15160657 21633423 30363544
18110 30363544 40059992 45839228 42054365 30133211 19512305 13006219 9173762 6870016
18102 6870016 5419627 4465761 3780220 3262331 2903022 2596378 2322786 2104917 1908521
18093 1908521 1723951 1597364 1508135 1433356 1341536 1258092 1160031 1072282 992498 929576 872297
18082 872297 811598 749190 713800 686422 663126 631434 628502 567195 485638 451705 404570 359781
18070 359781 364449 358071 362339 373409 353172 335892 317473 316446 298331 263962 259720 286591
18058 286591 290447 288308 295290 316603 287081 248922 277142 267112 230882 175569 157237 167183
18046 167183 166553 176500 219418 233614 202533 171990 193898 167352 126395 132958 136930 159241
18034 159241 142685 132209 131320 135104 141662 126749 120505 115361 122542 117998 108087 78862 83612
18021 83612 89265 89194 87159 81830 71789 57564 71389 88356 115580 87933 84308 70357 46799
18008 46799 38644 39008 45103 71056 49694 42864 65531 112942 124758 123112 101372 98683 94933
17995 94933 82905 77889 86474 100318 117155 83731 52872 39076 62854 96902 66907 38789
17983 38789 36920 40911 41936 63491 71407 51447 43939 32866 20208 34962 27808 -5696 -19339
17970 -19339 22990 25115 -16583 -24141 -5191 -17046 -16173 -11756 -16079 -22898 -25592 -54855 -41265
17957 -41265 -18150 -45679 -79393 -64987 -22928 639 -9673 1019 -9704 -15421 -27945 -26945
17945 -26945 -7263 -18450 -21985 -22808 36769 58637 52202 34756 35710 59893 71289 46392 40641
17932 40641 21396 2809 -19630 5115 -1982 8009 -14055 -4165 53064 70802 84435 116468
17920 116468 88700 85028 48046 40998 55717 66149 34617 47953 43517 18389 -10194 -26966
17908 -26966 -46151 -42134 -35739 -24201 -7998 -1845 24477 42605 -2160 -2485 6863 6932 3314 3429
17894 3429 2341 -24152 -48146 -54819 -9013 -21226 -28522 -23728 -32707 375 48707 16462 20221
17881 20221 21065 -849 -14047 -27491 -19630 -8810 2916 23392 15679 12207 9455 1604 39013
17868 39013 38807 798 -10831 26461 43275 34293 51253 31182 30956 16442 4047 19029 52991
17855 52991 62315 37750 15914 2959 -10377 -28653 -1033 22055 22464 7696 6215 6126 -12069
17842 -12069 -13041 30904 55274 32054 570 13712 29196 26526 6293 -145 4183 -4537 -22143
17829 -22143 -4948 -6596 12602 -3551 6883 31166 38273 32957 -5130 -13325 11113 -21652
17817 -21652 -50397 -66328 -62482 -27693 -15598 -11645 -29516 -37960 863 18056 10590 9504 45833
17804 45833 30607 38206 26178 11130 19091 -7911 -35848 -49315 -32963 -35845 -47796 -32157
17792 -32157 -9390 15486 39876 28049 -20653 -37499 -29147 -17043 -30765 -30860 -33357 -20633 -31383
17779 -31383 -24784 -14812 -6199 -8322 23925 51335 15501 -15759 -50890 -55045 -46732 -26383 -5624
17766 -5624 9850 20948 19304 42206 43974 15037 -117 -10113 12847 -10118 -54492 -60211 -58498
17753 -58498 -56755 -34539 -3985 -13061 -8952 14404 11254 -23638 -17935 -16239 -24724 -6440 -8158
17740 -8158 -6715 -6540 -21954 -44978 -42807 -31321 -11695 15311 9732 283 -22422 -23295 -11137
17727 -11137 -14795 -21655 -4726 -20902 -6328 -40195 -43527 -30159 -22947 -8559 -7833 -42873 -22635
17714 -22635 -46202 -51182 -68805 -63124 -4818 27205 23204 39203 42486 13018 -3306 -5891 5698
17701 5698 -10057 -32099 -20802 -17598 -5727 -13427 -15969 -25796 -25287 -13855 -18741 -2299 -12648
17688 -12648 -10930 -2269 1376 -14276 4212 -10035 -11181 -41495 -39853 -24702 -195 12225 -6351
17675 -6351 -19249 -13126 -18467 -42213 -48623 -42353 -17910 17725 34996 13793 -22171 -39996 -71279
17662 -71279 -77104 -48579 -31219 -15508 -26221 -20650 5526 5752 2494 -6204 -7001 -1799 -25690
17649 -25690 -3023 24482 -2458 -9295 -10174 -1095 3922 17461 18248 28831 22598 44825 40562
17636 40562 43660 34898 21465 60989 50531 14167 -27352 -39376 -40095 -42377 -45223 -40970 -8689
17623 -8689 21350 50915 36168 19057 5126 31010 36953 38603 41255 42218 43439 51412 51616 36547
17609 36547 -6650 -21853 -27769 -31539 -20100 -19660 -13759 -10020 -32207 -17211 8913 24502 24223
17596 24223 -17415 -51283 -75174 -97097 -61043 -13519 -3371 -13982 -43071 -50050 -45572 -68864
17584 -68864 -76058 -56723 -20368 3739 28630 -4607 -49062 -34649 -43339 -2301 2075 8233
17572 8233 10677 2385 -24922 -31333 -46968 -50438 -39333 -35682 -44907 -47206 -26261 -894 -10062
17559 -10062 -15921 -11136 17061 8232 -17371 -11028 9873 29445 14304 -17681 -48827 -51386 -19785
17546 -19785 171 1803 31865 25309 -5309 -2974 45090 48949 44326 50905 56559 50052 8416
17533 8416 -3792 -14359 4354 -7119 -25398 -25462 -55654 -40801 -16404 -21949 1632 15725 15538
17520 15538 5570 5529 23407 12551 30824 69580 77990 58938 37714 15878 -20615 -10907 7262
17507 7262 -22524 -64201 -72184 -41227 -8875 -7116 -20510 -22032 4799 -6409 -1336 -1126 18315
17494 18315 36164 36496 30692 31208 12897 39425 60082 62588 25495 18372 40106 55369 71378
17481 71378 41156 17183 -8877 -2297 -19215 -32095 196 14299 29605 10331 -3753 4019
17469 4019 -11931 -7595 -17663 -29442 13123 38049 22600 22499 2908 1889 10715 28871 -20445
17456 -20445 -34736 -9241 -3919 471 31571 34113 27072 1897 -13724 31946 74358 157126
17444 157126 185549 182690 160517 122663 54804 41168 33648 10846 8185 31469 -6172 -10120
17432 -10120 -5123 -25873 4278 17347 22363 14648 41169 55733 28901 16551 9994 -13233
17420 -13233 -80636 -89007 -69197 -49619 -21578 17711 34271 1847 -9871 -13003 -41715 -48800
17408 -48800 -42457 -43828 -34862 1705 5459 14090 33244 49195 25067 42936 39281 5367 -14109
17395 -14109 22364 41087 32334 32448 -3011 -21485 -36271 -19734 -9763 -7295 16583 18940 -11133
17382 -11133 -13736 33055 43594 49179 64203 46343 26019 19125 -3473 19469 21823 10780
17370 10780 18242 1581 -11192 -13631 -20918 -2717 -15079 -25722 -22329 -19323 -7855 -28788 -40272
17357 -40272 -53995 -45706 -29847 -3731 31539 46413 45517 23170 20643 28128 -14174 -9174 -25724
17344 -25724 -11475 -23276 -28214 -18343 -2730 8204 -10642 -14441 -11744 -1743 -9795 -16836 6965
17331 6965 17003 8472 -2192 -8608 -4334 13920 23197 49219 41587 24660 6301 -1382 8531
17318 8531 25642 10247 -6110 -45369 -73953 -63907 -38286 -911 -23359 -43674 -23901 -20341
17306 -20341 3926 13196 -29897 -66937 -30347 10620 41176 63062 47728 57638 17635 16075
17294 16075 22150 6091 -29061 -38496 -66753 -64672 -28996 -45338 -40531 -50421 -39158 -27594 -40845
17281 -40845 -31901 -31232 -39394 -16111 18533 28017 -4432 -2404 -18425 -2022 22647 -10130 -3147
17268 -3147 21192 18719 27245 -8659 776 15086 -9669 -24105 -21752 -22420 -5366 2549 -2352
17255 -2352 -29493 -75644 -78147 -35794 -29690 -51558 -57458 -27002 -34052 -94892 -102555 -54665 -6395
17242 -6395 7983 -15265 -12401 5054 1141 302 4305 -1619 -36053 -39249 -5201 9813 -502
17229 -502 -6864 -34526 -31677 5771 16114 42058 37279 25310 14552 -18595 -29805 4339 1501
17216 1501 -22722 -11431 2362 -7422 278 -10801 -28757 -36916 -49572 -29880 -19166 -32243
17204 -32243 -35047 -29387 -22826 -58400 -38280 -19944 -6725 -26871 -49403 -29516 -7507 -23605
17192 -23605 -8323 -6662 -5332 31093 51983 45017 31640 22701 -13028 -7424 -9232 13650 22323
17179 22323 3139 -29632 -52317 -39447 -21609 -19620 -15104 -30936 -16411 7462 4790 25950
17167 25950 27665 -3091 -12744 -16980 6159 42042 57796 33378 -1673 -39249 -32189 -44683
17155 -44683 -21485 16990 14699 -9943 -17615 7212 55953 48337 30790 11025 -18338 -7560
17143 -7560 -6144 3843 24289 12885 -13723 -17348 -4858 5387 -2985 4767 -19 -11490 -24794
17130 -24794 -16631 -14084 15076 12368 -15322 -44482 -2280 22911 -1257 8407 -23882 -2720
17118 -2720 17917 15727 23914 29141 40126 11524 -29672 9016 9672 24921 16553 17823 30793
17105 30793 15821 -23516 -15859 3676 13998 -12867 -62444 -79737 -75557 -33999 -27462 -28474
17093 -28474 -6255 22973 -2118 -11998 -22891 -29055 -20778 -20766 -36765 -16204 -4036 -24021 -42637
17080 -42637 -43800 -41910 -40258 -32966 -28014 -27175 -48653 -51924 -55971 -24466 7255 10367 -9698 -46286
17066 -46286 -33357 -12414 -16501 -50857 -55546 -43054 -41308 -61166 -74761 -48598 -9622 24829
17054 24829 46157 11721 -14783 -7975 -9844 2098 -16204 -50058 -55235 -42931 -24544 19728
17042 19728 2722 -12686 -37803 -42252 -54623 -35055 1348 1707 -2491 15859 33515 7889
17030 7889 -8392 -6864 -19425 -30754 -36494 -40874 -32927 -16436 8788 24122 27110 14282 -6348
17017 -6348 -25709 -24014 -32200 -22842 17446 36728 13703 37475 18423 7831 35404 46000
17005 46000 14013 -9378 850 4699 -9326 -11115 -14816 -30942 -43820 -16265 -30429 -45063
16993 -45063 -62328 -77810 -42140 4466 -23067 -19980 -220 41415 27056 -6597 -2610 8087
16981 8087 26436 53288 38468 36277 33673 47690 36909 -9163 -19000 -32021 -57756 -18422
16969 -18422 -17674 -22104 -10712 -5630 -14097 -9652 -42651 -77647 -44102 -25188 -34138 -29964 -43856
16956 -43856 -42855 -42012 -26599 -30290 -43530 -27796 -18628 -3400 -12680 3901 24358 -9028 -37455
16943 -37455 -33255 -21519 -30080 -27751 -7625 26800 -2403 -38667 -50485 -33718 -56063 -68541
16931 -68541 -64881 -59082 -47815 -19808 -13829 -12833 1811 -16713 -32062 -21240 2538 -26401 -45581
16918 -45581 -37216 -8358 15703 10901 -11890 -45413 -42468 -41046 -32345 -28481 -25633 -13641 -36232
16905 -36232 -39413 19176 57557 30440 45915 52580 61172 38622 5615 -3301 -3876 18073 64298
16892 64298 93371 109925 93920 60514 22005 -4641 -24606 -38151 -22015 -27980 -31296 -33770
16880 -33770 -17858 12685 13438 54401 45700 -21615 -37346 -18360 -21634 -12505 14823 32452 14442
16867 14442 18588 37765 60896 56659 40231 8228 22090 46490 57138 17703 -10026 -9416
16855 -9416 11401 2320 -12404 -10096 -25192 -31518 -29943 -34725 -18088 1242 4566 -6114 -6026 -2421
16841 -2421 1033 -12247 10675 40032 42094 45220 25361 -5209 -24822 -33627 -14998 9641 -35
16828 -35 -20741 -42214 -31237 -30574 -31842 -59103 -56252 -31693 -21009 -43416 -42507 -1036 886 -4903
16814 -4903 4027 40285 23970 20271 3309 -46515 -59574 -57939 -55976 -47426 -32581 -39817 -54135
16801 -54135 -2713 20915 14440 -42225 -58632 -49302 -32104 -4462 -26971 -37288 -16289 -19705
16789 -19705 -34156 -83722 -87562 -36480 -39677 -28565 -13276 18932 -2785 -25001 -21407 -39840
16777 -39840 -36018 -39965 -61265 -63039 -35966 -8832 18684 -2508 -13158 -27936 -53940 -34318
16765 -34318 -42345 -29672 -52849 -39914 -47962 -47241 -24411 -44869 -20589 10294 13257 4116 8188
16752 8188 11698 1578 -11875 -31416 -42046 -42857 -36021 -32973 -24579 -10563 -26896 -44895 -32412
16739 -32412 -25865 -26230 -11958 -9780 8622 19412 22109 19700 15547 -4979 -45091 -72120 -44342
16726 -44342 -15571 2620 -8257 -2787 30050 -365 -12015 -17767 -28767 -22834 -19984 -31324
16714 -31324 -38320 -30250 -44851 -56718 -75586 -50120 -4867 -9713 -39871 -60016 -19852 -20634 -36423
16701 -36423 -52817 -104520 -104120 -39228 -28242 -37743 -53122 -50608 -50964 -52899 -37514 13811 44396
16688 44396 10879 -41549 -42441 -13952 -28103 -29210 -22685 -23185 -32054 -22278 -9218 -54058 -102075
16675 -102075 -64269 -13072 20132 20768 -6772 -16152 -22076 -15027 6715 12238 -15587 -41603 -4141
16662 -4141 49794 43918 -8230 -36966 -29191 4673 15922 8146 -12438 -20799 1524 -8756 -38528
16649 -38528 -37392 -32149 -22331 -11903 -16636 -9003 -2246 -58965 -75308 -50135 -24628 -10108 17272
16636 17272 19132 -3818 -46079 -56484 -57800 -23925 -3388 3909 1056 227 48814 46802 11717
16623 11717 -12118 -35864 -56875 -38887 -5872 3983 26775 15134 17779 4954 10321 -4046
16611 -4046 -38475 -4550 6738 -22124 -48855 -35872 -6434 -6871 -5533 14440 12981 -1510 -9178
16598 -9178 -31134 -24378 -44368 -27978 -1851 -14000 11080 32555 7666 -828 -7719 -12803 -676
16585 -676 -24858 -27489 14608 50103 64804 51243 10326 -8736 -15000 -16477 1485 -12479 -19638
16572 -19638 -64699 -98545 -66623 -2208 33185 28413 27038 2831 -32782 -21840 -27933 -48999
16560 -48999 -14426 -9944 -29611 -24380 -2285 -8937 -22608 -4779 -19242 -27206 -10516 -12858 -39704
16547 -39704 -61008 -86021 -42237 4612 -12315 -22808 2782 43039 48330 52154 16907 -17420
16535 -17420 -21753 3604 3318 33208 39148 33018 -6431 2256 -17001 -12189 16107 22374 -31130
16522 -31130 -38051 -29659 -17687 -36483 -39365 -36733 -59114 -57344 -35041 -48277 -37123 -26019 -29763
16509 -29763 -16728 -22276 -23021 12336 8414 -3636 -37006 -48140 -3179 6232 -4880 -12433 -20112
16496 -20112 -30709 -46961 -45606 -27750 7929 3865 -5457 -3234 18122 39111 -6099 -31154
16484 -31154 -57441 -62637 -4988 25234 8183 44535 59378 45899 31405 -7237 -26049 -45056
16472 -45056 -62065 -55103 -30518 -14677 -4658 16922 15463 -29995 -48386 -7180 13378 27877
16460 27877 27306 18879 36213 35799 24781 -21119 -43204 -66904 -35836 -18263 4071 12645 5299
16447 5299 -30794 -7061 24782 18476 -6330 -24807 -15915 -14303 -22627 -6958 -3497 5518 9028
16434 9028 -16319 -3931 6807 9007 16498 1068 -19318 -5547 -7854 -5691 -8963 4816 19316
16421 19316 35305 77224 76024 30863 -13749 -35876 -19998 -10373 -39285 -32513 -12206 3042
16409 3042 -3312 -13351 -36402 -43168 -7346 -2210 -11977 -14590 -20442 -23252 -7479 -10028 -16458 447
16395 447 10293 13901 21714 -10176 2399 11736 8192 -2918 -12148 -21124 -13825 -29951 -8621 -16843
16381 -16843 -13299 -15933 -16816 -32152 -49713 -62496 -58768 -12692 -1339 -36173 -50034 -26707 2609
16368 2609 -6953 8782 5070 25648 38123 18529 3954 1887 15365 -9893 -6451 -1939 -6917
16355 -6917 -40912 -48195 -71269 -78620 -54350 -67469 -92832 -64158 -22590 -16105 -23560 -43260 -52325
16342 -52325 -67168 -69431 -51622 -63674 -70610 -54527 -53677 -62609 -71784 -59349 -47313 -65042 -43724
16329 -43724 5875 5115 -9419 -6985 14820 990 -12059 -31414 -24720 -49272 -27706 -30643 -69871
16316 -69871 -70052 -32784 -49490 -57631 -41258 13177 50032 33499 -3448 -13190 -53961 -64330
16304 -64330 -65529 -43021 3410 17681 32758 40194 54889 27552 22467 12146 -12239 -25866
16292 -25866 -36282 -22335 -13869 -6066 -41833 -46907 -81024 -83186 -62954 -68206 -44090 -28406 -45069
16279 -45069 -43038 -22056 1162 -13253 -41143 -1309 18924 -749 41323 58478 37356 27854
16267 27854 33525 14323 18425 11041 -16082 -35839 -35695 -31142 -39837 -20812 -21405 18769 22935 589
16253 589 -11088 -19977 -28755 -11001 728 -26978 -31584 -33681 -62437 -78692 -63154 -16735 7273
16240 7273 -10798 -49442 -42722 -32961 -63965 -18727 -12111 -16192 -15543 -29281 -44220 -4760 24220
16227 24220 5574 27496 29442 -8199 -37247 -52127 -101615 -81510 -57974 -82476 -80363 -58213
16215 -58213 -46655 -53132 -58328 -41150 -8795 -14063 -56295 -36084 -46398 -70055 -68592 -57503
16203 -57503 -41255 -29526 -16468 -47756 -44822 -30606 -8286 -4886 -24505 -21479 -32531 -32828 -24195
16190 -24195 22 25990 31973 -20359 -64079 -79037 -64051 -58557 -39194 -4059 34108 41160
16178 41160 -6685 -32664 -23710 -1928 841 -3855 1043 20198 3801 3822 29114 28173 27338 -1379
16164 -1379 -10770 -10030 -1407 7199 1506 20894 9655 12867 -12047 -11978 -2436 32060 75795 77612
16150 77612 39783 31374 26291 13403 21054 3795 -27482 -27697 -5843 8690 1540 7284 -21272
16137 -21272 -38102 -38671 -24357 65 21452 -7805 -25034 -14987 -20473 -26382 -10545 13116
16125 13116 -3107 -44081 -51413 -31665 -41446 -29705 2821 50446 17144 -733 4563 -8058
16113 -8058 -8206 -50391 -47753 -16951 -51023 -62897 -26877 -26017 -38676 -38396 -48081 -37957 -48261
16100 -48261 -91279 -87120 -77220 -64873 -45856 -15813 -30409 -46478 -53230 -30585 -15041 24040
16088 24040 37310 14247 -4313 -7824 47195 51849 22229 -1255 6490 -20476 -51692 -61207
16076 -61207 -57964 -33911 -2904 -26956 -22647 7172 -3610 -39058 -48902 -42004 -52922 -36749
16064 -36749 2052 9670 -9975 -3909 2208 -679 7527 12288 -9357 -5478 -29603 -65032 -73631
16051 -73631 -52412 -44708 -65768 -60175 -8470 -5585 -1603 -24487 -16065 -9999 -2068 -14312 -20353
16038 -20353 -14283 -17997 -32447 -15844 -15877 -21299 -8138 13302 4862 2374 -8214 -17997 -15412 -20637
16024 -20637 -22599 -23542 -27987 -72964 -75926 -65467 -54628 -23542 1677 26420 -10244 -23330 -35630
16011 -35630 -24448 2246 8344 -11054 -36864 -24162 -8530 -30076 -32952 -45734 -82201 -78411
15999 -78411 -20911 24801 29086 9181 6424 41732 13584 -39429 -56541 -69304 -33111 10425
15987 10425 -3352 -42143 -78752 -59351 -30832 -33488 -42072 -41080 -38830 -29349 9380 51117 63338
15974 63338 37620 -6433 -15555 28545 42363 41939 3852 -31459 -25567 -14548 11888 -3985
15962 -3985 -23085 -22445 8474 17118 12530 19817 10323 8716 -23995 4692 -9804 -32096 -25932
15949 -25932 -29531 -46978 -9338 -15240 -2201 -1781 -7827 -20356 -18409 -17407 -34638 -44928 -33225
15936 -33225 7208 15227 -729 -8729 10046 15587 6449 -19537 -24072 -12845 34462 23163 28020
15923 28020 66389 74861 37232 23941 24731 4283 15302 -10220 -2660 2300 -12250 -15617 -28532
15910 -28532 8542 19806 31056 29122 49107 29399 4781 893 -10657 10035 -13332 -24524
15898 -24524 -33386 -59818 -76860 -75040 -87957 -79487 -75179 -48065 -24217 -23156 -39041 -56730 -52309
15885 -52309 -56644 -46768 -45050 -46196 -42688 -4113 1816 -35320 -18688 -3923 -13742 -68226 -88528
15872 -88528 -58091 -28745 -14690 -9253 6345 21901 4197 -18098 -13992 15038 -2057 -39651
15860 -39651 -28402 3693 19534 9071 38458 54427 32895 11982 -3830 662 12957 1395
15848 1395 10144 -14653 2088 11076 30304 38808 23148 14042 -18671 -33800 -24143 -59516 -42568
15835 -42568 -22607 11891 50135 61900 36313 5734 -12320 55185 67913 38648 -1735 -3821
15823 -3821 15216 13427 34828 50492 82691 42553 -32865 -75288 -70125 -25957 -3910 -18597
15811 -18597 -17437 13156 28405 31143 6425 -43986 -37314 -15553 -12010 -22662 -12063 -25987
15799 -25987 -34773 -18176 -24983 -70968 -83799 -74096 -45682 -23772 -946 -20464 -37389 -71613
15787 -71613 -80001 -83421 -60915 -56550 -43669 -28813 -26761 -25744 -53815 -32183 -34974 -21311 -8626
15774 -8626 -1395 9146 27115 7411 12611 6801 -13422 -38524 -58691 -51825 -60371 -63431 3821
15761 3821 17253 -9167 -17265 10193 12411 -39030 -49005 -56201 -33297 -57066 -60800 -24509 21703
15748 21703 48197 80499 74255 56082 59927 37857 -4035 -10009 -21602 -22409 -51445 -31774 -35288
15735 -35288 -34830 -5463 -4974 -10856 -17873 -54750 -85958 -86361 -58244 -30833 -43958 -49242 -79615
15722 -79615 -52138 -23334 -39433 -33127 4591 -10134 -13786 -37641 -28994 -19421 -10589 -11316 -9799
15709 -9799 -44352 -66211 -37583 -335 22124 21291 23101 -4148 -572 -4050 19442 13984 -8683
15696 -8683 17017 796 6723 -1460 -4019 -14992 -28308 -27706 18870 2570 -19852 -20223 -1245
15683 -1245 44828 64995 31323 9525 13049 29749 46140 48911 41165 44703 29420 -8025 -11869
15670 -11869 -5773 -6473 8089 2369 1465 25521 -25721 -45285 -23209 -23410 -40390 -49570 -57450 -46179
15656 -46179 -30331 -51000 -58253 -60832 -58366 -53394 -63219 -46421 -18025 -30619 -53587 -55433 -34337
15643 -34337 -75210 -68671 5522 42584 30012 7054 1131 -16588 -7100 8841 -2942 2667
15631 2667 19137 24692 28835 24629 42657 63118 66921 41806 26662 29236 36022 25150 -1852
15618 -1852 -22866 -2239 32000 41914 54623 31040 -23803 -15529 -17386 -51393 -44932 -43565 -5822
15605 -5822 24811 19113 -26708 -30911 -32929 4990 6188 -17436 -41315 -39218 -28522 -25098 -19277
15592 -19277 -38993 -45002 -59026 -47247 -42218 -31502 -26572 -3235 7358 -3082 -12066 -39218
15580 -39218 -55410 -41699 5660 5706 -17357 -22916 -10935 -30562 -59125 -26153 -17105 9192 27003
15567 27003 7244 2852 -1698 -20995 -33477 -10303 13623 22366 22930 3593 13298 -18102 -27636
15554 -27636 -36620 -45553 -35732 -15770 -27639 -7198 -879 -33621 -37309 -31492 -23768 4136 37562
15541 37562 6548 -5824 -13317 -14298 -4123 13526 19719 9299 -1771 12705 -6336 -34317
15529 -34317 -40586 -13475 15113 21967 3310 8294 59599 90385 49466 8692 17659 38955
15517 38955 53539 46746 41909 -10494 -63601 -70960 -25339 17674 15839 -35500 -73205 -75980 -54459
15504 -54459 -47546 -63623 -42698 -27129 -28107 -18386 -36437 -54910 -77225 -54058 -14409 8279
15492 8279 31353 46008 46197 11808 2020 -3224 -3630 -16813 28792 14736 -25913 -9995 397
15479 397 33101 41554 37787 4048 -35767 -27742 -20542 -2008 -15464 -13554 -656 -11507 -27051
15466 -27051 -24623 -18793 -73812 -83364 -85165 -66687 -35305 -53074 -83114 -88595 -75892 -30628 9394
15453 9394 20367 8875 18694 7042 -5924 1752 -15755 -13212 -7652 -14716 -27935 -39806 -47929
15440 -47929 -29021 -13221 -7706 -27107 -16814 -17270 -7815 -26351 -39369 -35959 -33917 -13255 -7042
15427 -7042 12072 10551 -27834 -76045 -54199 -26576 7271 -3744 1046 14696 -8753 -9521 -16278
15414 -16278 -43566 -24391 -19352 -20034 -26776 -2304 -5227 20564 19247 5711 11507 21035 52686
15401 52686 65810 72850 65409 44403 7944 -8530 -11535 -44054 -55171 -32780 -38355 -16680
15389 -16680 33818 38592 -12207 -1902 14972 -7937 -10253 -28365 -35798 -48741 -46529 -28676
15377 -28676 -19939 -13414 -18139 -10470 -6717 4261 39838 13004 -17508 -35831 -4811 21324 3383
15364 3383 -4244 29755 31347 23564 21795 -1687 -32274 -6903 16810 33639 40607 44275 9979
15351 9979 -25093 -19264 11269 25727 41812 22154 -12650 -47177 -39044 -33085 -1172 21666
15339 21666 27046 20819 35823 10917 8092 -28145 -34551 -14853 6920 3937 -15620 -5427 -2412
15326 -2412 -13223 -56840 -63322 -43510 -27861 -32943 -44065 -35906 -34794 -41394 -75344 -40194 -11297
15313 -11297 -26345 -38098 -40615 -67823 -73993 -18200 -17217 -41945 -50426 -49361 -54183 -24979 -21524
15300 -21524 -12489 -239 -10036 -39654 -35549 -2195 15735 11823 3639 -24058 -9637 -23525 -26791
15287 -26791 -1138 -17209 -30778 -58476 -53747 -47729 -24791 -1491 -7763 630 13231 -24302
15275 -24302 -25834 -14043 -8366 9064 7153 -17963 -56811 -89873 -64869 -37276 -51865 -49320
15263 -49320 -58285 -53730 -17514 31777 36669 26200 20827 11765 31185 21967 1655 -44021 -53608
15250 -53608 -10562 2823 3808 12599 -16870 -46016 -33804 -6669 24225 11436 2178 16518
15238 16518 -16120 -57907 -76596 -75489 -60425 -35404 -29417 -22197 -27650 3449 -4199 -52035 -37030
15225 -37030 4536 5281 1297 26062 19205 19953 39587 60182 38277 22022 38021 29082 -5288
15212 -5288 -30088 1227 -46186 -83929 -53092 -27045 -16784 6319 9572 -18061 -5758 29383
15200 29383 44992 14199 -1710 12476 16122 29663 10203 5596 3067 -6890 -12215 5792 14832
15187 14832 6582 -43125 -41896 17501 38758 41918 986 14648 35789 5689 -33902 -12356
15175 -12356 -11838 -11853 32004 49049 28129 322 -27455 -42608 -22901 -56343 -22998 -16387 -22225
15162 -22225 -34704 -21996 -19772 -19145 -3751 5768 4109 -28369 -72538 -62511 -43929 -27474 -29406
15149 -29406 7827 33858 4787 -42623 -58407 -19574 -6642 9479 5346 -9887 8825 -19970
15137 -19970 -8145 49193 49378 32753 2648 -19674 -4237 -14164 -45711 -51176 -48333 -38937 562
15124 562 -32808 -59784 -63473 -40474 -6804 -43248 -77600 -58305 -5720 3367 -31169 -26913 9867
15111 9867 19388 3393 16535 33851 20649 779 -15075 -7286 2102 -1965 704 41603 45575
15098 45575 33227 34899 36587 28775 25067 14502 20370 45617 58632 63462 41512 -4779 8022
15085 8022 27447 17697 7785 -6843 -18259 425 -14569 -67353 -114737 -96939 -100672 -98658 -90250
15072 -90250 -63342 -54917 -45104 -48454 -35936 -459 1535 -16938 -18275 380 728 -3082 18442
15059 18442 21870 796 8880 11427 -2645 21202 -6204 -29015 -54118 -59770 -30117 -57198
15047 -57198 -39798 -10032 23947 4842 427 32258 27976 -14956 -11670 -6050 24400 52222
15035 52222 2824 -30755 -59902 -45446 -15354 -10517 25815 24478 14987 16080 6137 -47605 -48441
15022 -48441 -20422 -27632 -25612 1599 12059 46975 38812 22068 13767 604 32076 67575
15010 67575 69171 76107 67783 66008 78484 100590 138068 184450 276609 436919 592565 738546
14998 738546 774438 635227 455298 283827 164103 96237 71359 80666 104024 125670 135276
14987 135276 134837 83394 43323 61320 78129 48331 30511 843 32056 53567 25034 -11926
14975 -11926 -14805 4415 -25790 -47531 -32166 -21527 31899 36189 -6804 -19032 -2585 7188
14963 7188 221 -27427 -41608 -15754 399 -3694 22265 37690 17257 22775 -5155 -2773 -41403
14950 -41403 -64727 -76960 -60323 -43676 -28829 -35594 -18336 -11374 -13014 -15569 473 -16505
14938 -16505 -7374 -14826 -21233 -36594 -47430 -65420 -48012 -34308 -37525 -33756 -10213 14784 16582
14925 16582 24186 44733 14821 31554 39957 14416 -12937 -12201 11225 -10306 -2079 -8608 -1642
14912 -1642 -1891 -24479 -58137 -56489 -27792 -63513 -34012 -3479 21231 30842 37006 -10796 37147
14899 37147 29725 1568 15103 27025 9289 -41632 -46781 -11686 -8789 -17474 9559 10207 -26724
14886 -26724 -25410 -33212 -41022 -21693 10928 13646 -6966 -58226 -65970 -47270 -20869 -13270 -8816
14873 -8816 -8396 10175 21026 9307 -24341 -25932 -71039 -74721 -39328 -32575 -46670 -26306 12246
14860 12246 33772 26521 9070 26920 28337 31957 53977 41967 34519 15562 -11033 -25640
14848 -25640 -32677 -25444 -15325 -27531 -26178 -18792 -19050 9192 34784 24612 -80 -4365 -8673
14835 -8673 -9703 3486 -24362 -9607 16998 21552 27613 19832 -25105 -68829 -47347 -34519 7486
14822 7486 39447 13877 -12054 -13564 7762 -11649 -8521 -5240 -10863 -23930 -32619 -17147 4063
14809 4063 8502 -4781 5196 -6389 -3114 9393 21682 28497 15633 1720 -11055 -21123 -48442
14796 -48442 -26039 -40971 -35296 -27195 -6800 -8617 -14914 -14121 -2154 4413 -2526 -31264 -18234
14783 -18234 11542 9800 21573 35307 24051 12551 -13433 -37845 -55078 -31879 88 -1155
14771 -1155 4546 -9538 -17481 -8476 -7161 6611 11257 -4281 33877 45715 31261 38357 30141
14758 30141 -17715 -39613 -40725 -41326 -5352 24026 11780 5207 -16634 -20132 7128 -20984 -46611
14745 -46611 -49163 -20250 -22670 -29797 -46364 -62428 -52818 -17975 27015 25663 -11536 -22842 -39647
14732 -39647 -13222 11991 17614 -13211 -65037 -58284 -26311 -31830 -19356 20576 48070 59649
14720 59649 49974 33147 3972 -16574 -21273 -23668 -15705 -1781 13307 35392 30036 16751 13942
14707 13942 -18193 2143 7910 14910 9290 -46614 -10910 21756 9842 -12392 -11610 20069 41062
14694 41062 49827 15864 3718 -9792 -18422 -33924 -50106 -32000 -8421 11001 -3729 -16013
14682 -16013 -14179 17906 25339 25435 29567 16937 2836 17097 32847 52541 19924 -8051 9923
14669 9923 -19033 -18463 -18247 -21370 -6622 21074 43789 43154 9491 39236 28545 20784 25412 34055
14655 34055 35306 32297 1374 -28217 -22228 -42908 -50764 -33303 -9968 15626 31421 5720
14643 5720 21845 -14470 -39606 -36391 -35206 -22489 -36458 -55642 -82587 -82445 -4945 -8467 7429
14630 7429 -8551 -17833 -17879 -25098 -39161 -37752 -30796 -14250 -6331 -20958 -3563 -14745 -2710
14617 -2710 13033 11248 21383 -10486 -30323 -14515 -23923 -16754 -6409 -1233 5193 -250 16705
14604 16705 20349 -15470 -37952 -42245 -2217 16583 -10891 -9690 -25255 495 25936 57547
14592 57547 77217 102431 78602 40890 37907 31806 3553 -20179 -22442 14050 27149 28952
14580 28952 32769 33178 9123 3359 10636 39743 40154 36089 -1504 22933 26370 7764 4860 4630
14566 4630 -8487 -6015 3098 -3591 -17601 -25887 -34962 -23687 -17965 -12732 -30494 -17687 -5798
14553 -5798 -20404 -20734 -34100 -8537 23213 24515 56121 70463 33737 623 31818 92185
14541 92185 69641 22059 -3033 34317 36456 40572 33636 46304 48012 13450 22567 44522 -6586
14528 -6586 -8309 -13408 -15516 32386 17339 -7664 -37536 -13214 34468 23065 44749 15324
14516 15324 7159 39318 73401 76578 69183 67381 11485 16444 4964 -20575 16634 23611 4660
14503 4660 20632 62386 48226 13164 -11688 -29943 -44048 -48925 -33069 -19476 -20624 -20671 -18628
14490 -18628 -12691 29903 21109 -13843 -3589 38946 38133 60317 48194 48168 24395 2498 -29708
14477 -29708 -18989 28934 42861 8243 -31082 621 12931 9271 -12114 -18785 6306 32093
14465 32093 5531 14486 15888 22259 38398 -3139 -37102 -49926 -34912 -27 -8022 -3407 28895
14452 28895 7746 7261 29697 35790 51763 36073 28700 45015 43297 -825 -38369 -26652 9374
14439 9374 34412 11526 9284 12250 14487 27715 28342 36533 17593 8380 17321 17598 13402 -18397
14425 -18397 -15108 20143 16099 -14667 -36484 -23743 -16387 -16205 22976 9440 -16348 -30650 -26340
14412 -26340 5126 -4395 -1533 -5493 -19054 -30381 -17657 -15440 -819 16148 18156 10174 26736
14399 26736 90682 107106 53265 41663 23772 34156 20751 39189 41101 25419 20769 18868
14387 18868 2396 -28591 -45577 -35052 -13710 16681 10631 20398 29220 29376 30168 10342 -8372
14374 -8372 6294 162 -9789 16804 45469 32528 40874 36241 29476 -1269 -35145 -22990 23524
14361 23524 57776 53603 43877 9396 -23361 -18435 -3635 18559 8055 -10854 7250 34210
14349 34210 40751 32074 19276 4737 -95 -18046 -19158 -3029 -14010 -3101 51827 66251
14337 66251 39636 13452 -19690 -46005 -29878 -33548 -77202 -52919 -2532 15528 -4585 5592
14325 5592 3579 -25654 -20709 3816 2040 384 -4104 -16379 -30498 -49734 -37216 -18024 -29491
14312 -29491 -63390 -60034 9916 -8946 -48336 -22699 14293 15942 28036 37176 39054 53265
14300 53265 29925 6592 -19667 -7546 25644 66063 79437 57276 44313 58337 43767 5051
14288 5051 46770 66236 65935 14799 1107 23395 20252 -9957 7997 -8456 -13363 6408 11498
14275 11498 14856 27812 25092 23138 19736 999 12591 43115 46223 20064 -2336 -10735 -16541
14262 -16541 -16551 -8187 -3572 -5258 -22646 -40043 -49521 -28990 -39632 -40104 -15945 -35541 -36613 -33556
14248 -33556 -19703 -4266 9036 13754 19393 14182 -2006 -14563 -36935 -45715 -62432 -91299
14236 -91299 -78807 -43822 8785 7465 -18777 -22247 -30239 -23123 -42338 -23173 7805 11714 -5443
14223 -5443 -41757 -32152 -62295 -98439 -59215 -64763 -37345 -15551 401 6194 -1384 -11098 -7880
14210 -7880 -22976 -51722 -25499 -9055 -4495 11784 -1757 -15010 612 23609 48105 33104
14198 33104 8756 -30549 -49759 -78776 -65841 -64443 -42709 -47112 -50252 -48572 -17490 19036
14186 19036 42169 70497 33758 17985 40289 42760 30576 15145 9298 12932 -29043 -67813
14174 -67813 -76055 -70329 -67635 -57506 -22313 -3360 9510 33362 -4331 -33235 -23463 -14928 -46314
14161 -46314 -37277 -5581 -8188 -13971 -15044 -3354 3960 19130 -5456 -10176 11808 3578 -16427
14148 -16427 2961 2917 22788 -3148 -14651 -9567 -5948 15787 25354 -15518 -66547 -61961 -53885
14135 -53885 -30223 -61725 -80750 -97122 -74108 -52469 -10234 -6464 -30971 -25989 17522 48301
14123 48301 42949 20138 37487 13039 -15821 9068 -3363 -885 1142 28728 33345 37381 11114
14110 11114 -6734 -27031 -40689 -16469 46932 46909 23699 41536 27118 -9087 24986 27875
14098 27875 -24816 -49884 -34679 -6133 -3905 -9802 -19429 -11134 -22185 -28640 -14158 -4542 17094
14085 17094 20190 17818 24251 24729 5218 -17004 -7804 -16651 19576 45205 28905 -2826 12765
14072 12765 -23532 -29733 -45346 -37996 -54788 -40805 -13876 -25953 -36890 -55103 -48915 -25673
14060 -25673 -14038 16437 21540 6537 -23711 -26713 -25507 -4277 18053 4074 -9429 -37110
14048 -37110 -63213 -60905 -31017 422 22944 29868 40799 39921 28577 15724 9779 7162 -9461
14035 -9461 845 -3970 -14984 -16304 -26436 -31482 13536 47105 13305 36880 46880 41633 32291
14022 32291 -3984 -16098 -27389 -3132 5180 -7394 -28194 -21626 4201 22808 33125 38358
14010 38358 44455 9101 -30939 -31057 -28817 -18620 -35417 -43718 -39552 -35661 -41665 -22636 471
13997 471 28426 33285 41063 47918 57865 10733 -17345 -39583 -7810 -3890 7675 -31531 -49232
13984 -49232 -38628 -38343 -25878 -17032 -8601 -24806 -7952 -7918 -11214 17917 849 -26443 -14095
13971 -14095 8313 643 -8063 13522 4483 7353 11797 19054 6746 -17171 -42115 -46859 -20103
13958 -20103 -6519 -3507 14705 12568 9061 -4463 -9090 -12989 -11035 31630 48162 15845 -4244
13945 -4244 -4906 16689 -3230 -37527 -24041 -7377 24101 32645 27509 -4648 -29132 20642 37338
13932 37338 46182 50089 51662 24801 6459 5124 2849 9752 40510 28911 -42 -49116 -34252
13919 -34252 -34768 -42168 -33274 -17442 5486 11220 -9048 -17040 -12789 -38712 -16878 12147 32239
13906 32239 45133 27687 2608 -19511 -25301 -23825 1845 -9576 -11263 16149 52817 48903
13894 48903 31970 11797 42468 53644 -5081 -14419 -32997 -39332 -31141 -8855 -17225 -6446
13882 -6446 24612 39847 28926 -903 -17204 -21728 -2603 18753 44734 57268 25245 -19812
13870 -19812 -25175 -10382 -13199 -19205 -25190 -39551 -29225 17774 52732 37519 1649 -23513
13858 -23513 -20368 -11879 -30384 -26245 -19658 -37570 -26835 -52900 -67240 12931 27219 -956
13846 -956 -20818 -8744 12243 24106 33631 29640 19378 14505 -22254 -32171 13559 21867 27967
13833 27967 9294 -23170 -683 19148 36322 62075 76729 99708 62745 16593 -26198 -17184
13821 -17184 16821 14195 17088 41913 51554 59943 91147 41598 -9684 -42282 3361 14874
13809 14874 -10780 3558 29598 81351 81625 45951 43489 15049 -158 38936 62537 64812
13797 64812 69077 80153 75456 44166 -6694 -18843 9922 3122 2914 12841 12933 30326 14710
13784 14710 5705 16499 16465 10949 -43908 -47882 -25780 4694 -17061 -30974 -41255 -12993 -25042
13771 -25042 -49522 -34412 -35950 -25530 4576 22632 18844 -2841 -26495 -25149 -41571 -37632
13759 -37632 6335 233 -11292 -1200 12523 6609 -34128 -50322 -26982 -4650 -4352 -27000
13747 -27000 -57916 -74858 -76428 -45007 -35416 -32172 -21153 11716 -6738 -32539 -28695 -34360 -19768
13734 -19768 2 -18136 -37816 -30838 -34456 -25409 -21261 -37068 7577 -1223 -15616 -17009 -27721
13721 -27721 -39672 -8590 3031 -1608 -1891 -24957 -50056 -71934 -30658 -29397 -36105 -11785 8868
13708 8868 3573 -2484 -4701 -21152 -46523 10817 64465 75929 57095 17228 -231 -12542
13696 -12542 11247 13053 41369 33424 28553 18056 -3942 -34525 -82460 -55082 -16465 26330
13684 26330 37911 50978 15568 -39949 -19187 24285 29430 51645 56571 68035 48856 16674
13672 16674 3241 10628 22681 9417 -13242 -492 25971 26036 15762 50835 63005 48453
13660 48453 25846 -7744 -13333 34829 43886 25223 15838 34344 49965 59648 75714 108785
13648 108785 84093 57869 32309 69091 90267 102142 142616 158568 158155 175478 195734 210778
13636 210778 251471 337819 457012 620318 820193 1167489 1589659 1956421 2101261 1850943
13626 1850943 1343463 905536 658281 494767 370738 300634 253320 217136 217053 213313 167339
13615 167339 143892 136751 135516 120793 103589 102585 98771 70110 52883 87717 99932 104741
13603 104741 107165 102319 116138 113910 83107 56905 58603 82641 89664 94296 136069 112882 91653
13590 91653 74549 55710 84981 97504 74974 71861 55094 22973 39898 79100 77196 56217
13578 56217 60925 59467 69896 51627 68541 44524 15356 3079 33837 63391 35002 25492
13566 25492 20410 -9580 -21465 -17116 12648 18737 37187 67988 78614 43985 47464 11100
13554 11100 -12934 24974 59479 79892 56495 36261 46218 75696 61148 32965 57400 74970
13542 74970 54004 36401 39525 18218 -21180 -9709 29141 49320 33960 25578 51380 51382 22632
13529 22632 49038 77146 67266 70644 83798 63508 63918 59763 25107 8712 -19220 2983 13768
13516 13768 8608 -10945 -29538 -28264 -12730 -33510 -69065 -82482 -59849 -20409 -31104 -34672
13504 -34672 -44488 -48321 8504 32805 4861 -31151 -79367 -118971 -113797 -163852 -166500 -206795
13492 -206795 -233672 -201605 -128812 -34682 49673 106867 106853 136425 161048 145901 129426 85210
13480 85210 72472 98132 105570 89522 64681 -883 -37948 -8670 28996 34997 50401 76416
13468 76416 96274 113085 111859 105749 105949 108491 81381 80330 88573 109572 77269 43524 58395
13455 58395 89330 132171 151614 189139 203389 194495 151010 142018 120064 124457 135710 196867
13443 196867 243570 296593 384755 423822 410855 412616 410959 363300 313738 218776 160310 162650
13431 162650 157643 156963 137684 122720 118852 121632 102455 112694 152223 132177 95832 74986
13419 74986 72994 59818 23882 30716 49965 51642 68739 85568 89428 82666 91043 75031 74228
13406 74228 109711 133543 98867 67645 72280 87707 109330 93555 66023 38141 42958 78573
13394 78573 73144 90282 119191 114538 141794 167432 162484 168249 158695 178814 175884 135664 120316
13381 120316 128850 148399 145147 124207 150404 144740 143712 163663 123537 72241 89003 86022
13369 86022 108890 155392 145480 109435 99014 123834 102710 87667 100831 67650 60513 92270
13357 92270 75447 95943 141373 171281 146350 153011 203523 232341 222096 210090 207731 201829
13345 201829 243540 291712 358467 425205 489204 579367 664513 686512 654052 589327 499689
13334 499689 410331 362028 332852 309442 296744 279817 310192 309208 294085 309959 316693 321025
13322 321025 312492 308119 320472 314389 329370 343912 378905 439095 511538 535958 537850 550203
13310 550203 536777 521056 504580 449274 380575 348036 341820 343985 391462 408436 393296 369340
13298 369340 368927 362788 371292 366075 340164 337574 364613 375174 377763 359154 338070 337894 379765
13285 379765 425734 417808 384103 367152 383531 432342 507918 530435 535268 540797 557837 597454
13273 597454 588702 568459 583683 615186 650183 645746 657089 647766 652453 641184 654015 708636
13261 708636 724190 740545 778679 834390 891988 921861 905720 882500 874587 873033 852319 898606
13249 898606 962509 1007375 1054740 1100714 1146032 1180235 1233259 1286004 1334512 1346965 1368217
13238 1368217 1384141 1387159 1446359 1499829 1561640 1612577 1707151 1789587 1851320 1889039 1917877
13227 1917877 1992228 2123908 2216301 2331764 2463061 2607191 2722377 2808875 2954473 3178005
13217 3178005 3373742 3580378 3827633 4076914 4324209 4585023 4857620 5164637 5557393
13208 5557393 6022068 6489587 6989770 7542688 8222291 9014749 9991934 11122805 12404018
13199 12404018 13866075 15640706 17940354 20982958 25005078 30337514 37470897 47143508
13191 47143508 60435611 79147527 106482448 146991827 204335827 279078396 358633005
13184 358633005 404812102 376144322 282452915 191384738 131521158 95441507 73353694
13177 73353694 59001791 48732595 40855535 34882412 30370521 26873252 23996743 21549052
13169 21549052 19489334 17802168 16470524 15328782 14328911 13369095 12439526 11553705 10741038
13160 10741038 9993780 9356693 8788765 8252800 7781625 7398409 7025708 6668102 6324802
13151 6324802 6045968 5758797 5501286 5263222 4991831 4713340 4470573 4276212 4115716
13142 4115716 3974847 3864147 3757777 3606130 3435691 3306313 3206156 3112634 2954564 2837347
13132 2837347 2752715 2606847 2482547 2393007 2318432 2240380 2164818 2096534 2039535 2002807 1982816
13121 1982816 1977862 1900121 1841975 1785413 1689030 1615622 1532546 1435661 1385403 1356052 1307570
13110 1307570 1290774 1256944 1227411 1228379 1192578 1127905 1055224 1032169 1006599 977193 968324 940689
13098 940689 930758 910833 879311 857103 867199 886627 859711 814982 806553 810586 826578 816759
13086 816759 805209 788492 774627 749210 752829 741171 712239 640839 607031 604394 557735 499994
13074 499994 510035 494840 457593 489914 502097 488087 475394 441849 435202 468068 469168 503511
13062 503511 481486 466417 478821 532664 578767 593015 559478 523708 476264 422812 371748
13051 371748 327146 303097 284171 304530 298329 256883 223494 218106 233403 239561 205222 215239
13039 215239 196255 136658 110577 116435 95720 57975 -21872 -100913 -183416 -223444 -176089 -112375
13027 -112375 -39968 57089 93418 123613 163278 175296 142762 136573 160652 198759 257002 264891
13015 264891 232653 201348 192066 178775 147271 117123 112860 102912 111828 141090 181148 205992
13003 205992 182813 163693 186437 209361 193475 197576 184219 131415 55987 44175 20662 18924
12991 18924 34238 14077 24659 46849 92893 126070 144733 170901 159375 162168 205829 275117
12979 275117 360453 397800 336391 259108 167180 133778 122947 102599 90616 67678 84007
12968 84007 162281 172388 140869 116547 106072 152512 158354 129448 101706 91381 86645 102152
12956 102152 106631 110179 138099 106066 86207 56844 22009 -6525 -8630 8633 25830 45416
12944 45416 54397 78693 105016 95533 98011 105067 69275 44311 65676 97898 114911 119799 136754
12931 136754 148721 140894 120838 74880 62117 61115 79494 95711 90053 94047 85771 35482
12919 35482 64822 77460 77029 97479 82613 32815 33729 63122 73150 69772 64144 24318 9270
12906 9270 7483 32782 2812 -10651 -3543 5509 -8965 -3605 9574 25412 -1076 -25416 -30509
12893 -30509 -449 19009 40 -27569 -8807 -8629 4447 26148 31557 22588 11500 18566 49092
12880 49092 67437 73514 146952 231982 286092 301701 235489 139866 80516 76506 103468 104154
12868 104154 76437 64273 58048 54574 44480 36332 28953 16868 38821 48976 16361 -15894
12856 -15894 1645 -15006 -2985 32102 31066 16577 6138 13870 21012 15990 32014 87724
12844 87724 80456 62000 20249 15797 2556 23251 31790 22315 26318 5521 14905 42634 66981
12831 66981 74998 59949 55916 65357 56152 21847 30442 53031 56436 63843 94605 112206 86321
12818 86321 95122 71616 41639 38762 35319 14493 -2115 29122 8028 -4347 9771 41074
12806 41074 53960 53123 39836 25002 22379 39965 37999 37437 34666 20262 18806 26550 16166
12793 16166 26982 -7136 -16157 -6103 -12036 2208 32792 18363 -1696 16033 11627 5328
12781 5328 17354 17937 13514 1764 17662 35184 8254 3297 5379 -15700 18628 37222 26807
12768 26807 31276 12185 18772 26993 35284 40006 60994 69347 56473 17071 27574 64206 56328
12755 56328 37761 39325 21067 37131 67442 83213 61184 81117 109835 128648 156601 186024
12743 186024 226343 235925 290251 369105 437503 544781 733482 1034055 1433456 1900006 2180756
12732 2180756 2056072 1588208 1092619 757715 574175 444014 318040 264472 236123 216371
12722 216371 205738 186893 189906 180476 171222 132975 98470 117864 143286 109192 44710 31544
12710 31544 92862 108025 123671 108897 106083 80829 81765 86815 77955 82735 85629 64465 52909
12697 52909 58579 37813 18617 18967 43907 60508 29435 52768 45102 4631 -15964 -37752
12685 -37752 -47979 -21929 16343 52423 36447 -7199 -3555 19629 10270 -3053 -2875 -13344
12673 -13344 -17804 1655 34078 49748 57165 51786 25216 17603 36044 6762 -37176 -43447 -12931
12660 -12931 -25760 3528 5210 -20949 -6205 -26637 -42939 -28809 -37885 -20533 -11064 4342
12648 4342 583 11805 24098 2849 -13251 14084 34796 17431 -4123 -5262 2232 -4975 -51506
12635 -51506 -40766 2574 17494 -2320 17640 9697 39171 65561 49862 16269 11340 13543
12623 13543 6817 29898 39146 61015 59939 40050 15434 23968 17215 8981 26210 -1145 -7057
12610 -7057 20576 -3986 -31364 -7593 4315 8641 5058 -4340 279 1855 24071 31391 4598
12597 4598 -13354 -22368 -3093 -7781 13111 13833 -15681 -15938 2683 4537 6365 16591 30567
12584 30567 18084 12261 -21741 -20099 19939 38906 26976 12930 12907 23139 19971 -14745 -16966
12571 -16966 -28484 10306 44011 50482 39836 49104 33539 35543 5263 22658 39615 -7742
12559 -7742 20436 10533 -8203 -8915 -7530 -14304 -28602 -24778 3963 -1673 -26962 -17465 -36490
12546 -36490 -45366 -15403 -15556 -33839 -39473 -59815 -76010 -63625 -39089 -32435 -10242 -16926 -9869
12533 -9869 -12438 -17466 -23003 5155 -17581 -7380 19060 -20034 -57762 -11805 26411 24199 21912
12520 21912 59729 24977 12825 -10877 2367 -955 19468 33016 58990 66678 46772 26807
12508 26807 12631 14016 10827 44767 38990 -10813 -5080 35535 31975 23210 3469 1157 -34966
12495 -34966 -9417 7202 24907 29598 17167 24272 44248 30027 8799 -23207 -4017 25715
12483 25715 36609 2248 -6079 8565 17767 28533 1922 -8505 -42663 -35739 5669 4612
12471 4612 25929 39775 35128 16492 10974 1343 140 21187 8909 987 -24374 -18206 14525
12458 14525 30097 33211 -1990 -29163 -16100 6377 11845 17089 23928 5486 -40782 -60530
12446 -60530 -60832 -93547 -94351 -46341 -37720 -2130 24475 33224 43147 32324 -11160 3245 21625
12433 21625 26458 20637 15848 12022 17280 25831 -19831 -25403 -10481 4483 39280 35809 -7295
12420 -7295 -44031 -16257 -5389 6689 -6990 -24238 7560 27019 56339 74408 68543 41613
12408 41613 33854 27513 43966 38932 14228 3946 17533 9991 -18717 -44804 670 -18186
12396 -18186 -29613 -3745 -16223 -1548 -9497 -37414 -24733 2717 11321 34849 66429 57942
12384 57942 248 -19177 -34003 -25179 16811 70511 54800 62157 52920 44144 19106 21819 23083
12371 23083 15527 31449 19854 10099 -14339 19377 35139 22380 30976 34421 -2945 -5622 10089
12358 10089 16386 11788 -14857 -36896 -51456 -58881 -28120 -2053 -36 14839 12602 2623 -876
12345 -876 10967 34619 44685 21191 39953 61138 77909 75638 39750 -4412 -16480 -21729
12333 -21729 -23077 24367 27629 23131 40076 27644 29770 20242 6124 12193 11521 -22057 -31310
12320 -31310 10383 19219 10510 -655 -12230 26531 50534 34008 11801 14272 26488 39156
12308 39156 8142 5151 5563 -147 13943 37015 52903 59138 63860 30512 30107 28671 19535 13998
12294 13998 36963 13299 -11495 24250 26469 29802 51315 48353 77285 82009 84768 49013 22116
12281 22116 18893 12833 -3521 -7917 11432 31884 18531 10872 -12282 -11379 6126 -6720 14550
12268 14550 15425 13308 32018 22314 23291 28949 21709 -2789 -7537 -9938 38766 80862 93193 59105
12254 59105 34525 22175 13446 10775 5499 10278 -6795 -17086 9597 46044 40774 32069 31179
12241 31179 -8650 -36547 -40096 -13884 11909 28439 3731 -23419 -17352 -5384 1275 36359
12229 36359 74228 28940 -27882 -13571 13284 17948 5244 11256 8653 7960 28615 25327 12776
12216 12776 -12578 -902 17541 32361 14175 -35735 -65926 -45814 -17410 17287 31602 14667
12204 14667 -19598 -43900 -49939 -52781 -28572 9149 32027 7093 17064 21616 31548 52695 58287
12191 58287 27963 -6885 -12003 -18483 -26605 -24107 -22675 -4645 9295 19497 5270 6979 32857
12178 32857 33597 -3071 4237 23911 20696 13378 -15494 -32105 -34380 -23840 13199 -20413 -16412
12165 -16412 -2271 -5215 -7945 -2807 8340 25977 7529 -42525 -47603 -5219 3894 4906 -6014
12152 -6014 -2753 -6676 -7094 -5668 -841 2831 -21048 -8765 11397 6267 -3300 -15239 2615 28906
12138 28906 30617 28635 39165 -5506 -22426 26647 40815 38624 19643 -21177 -7639 2186
12126 2186 -9022 -10164 -9526 1255 17127 28473 -1060 -30981 -11753 -3386 493 -585 -7184
12113 -7184 -10920 -12289 -10801 6326 -39720 -47904 -12934 11673 -2661 -7204 33472 40867 61578
12100 61578 54217 30442 24962 6378 -19748 -11146 24364 58680 63768 684 -31822 -56481
12088 -56481 -46326 -36164 -10961 2511 -3014 36397 80862 68219 69300 55880 40756 49574
12076 49574 64076 54723 54985 27237 31669 36040 35538 10177 -6690 232 5151 6155 15729 44215
12062 44215 47944 52340 27658 -19461 -189 25532 14591 23915 21684 -4396 -9289 -36651 -47167
12049 -47167 -17533 120 28961 67376 35663 -10172 -24314 12392 28076 11871 -18151 -12907
12037 -12907 26118 34843 66217 73195 33966 30853 38349 38920 28014 -2230 -21485 -46254 -81435
12024 -81435 -92938 -44258 2820 19927 43899 34714 20376 23333 38697 41139 19243 19495 18108
12011 18108 6331 -7397 11765 -3302 6435 23109 46139 38195 -4099 -14030 13847 -5966
11999 -5966 -35487 -37708 -31491 -10059 -14450 -51637 -45174 -4506 6360 9981 8958 -23030 4454
11986 4454 23860 -9191 -6264 -4583 -23930 -8208 10654 14051 10210 -12384 6279 17455 -28711
11973 -28711 -40170 -33987 -17942 1378 -24783 -38976 3739 29562 25304 11616 10502 21910
11961 21910 12008 12521 1167 9457 19862 53920 46406 22656 24990 17335 12202 -6565 -24545
11948 -24545 -36067 -36959 -9432 -20318 -31512 -22331 -28626 -30162 -4177 23790 -23362 -23592 41486
11935 41486 55467 41472 47591 40958 28464 -10641 -33629 -36041 -40595 -45948 -49233 -53199 -47080
11922 -47080 -39164 -39203 -5692 5382 -19810 6754 22630 -5058 8625 39738 33430 30050 949
11909 949 -25864 -32592 -53568 -61107 -64860 -21468 -13178 -11064 -22764 -22228 -12868 -40965 -67490 -39111
11895 -39111 -33069 -30695 -21709 -28289 -20098 -15802 -30643 -7836 -862 -40618 -31271 -17763 -27933
11882 -27933 -7181 -7296 -2565 -5674 19823 25100 17849 -30180 -51283 -57937 -68202 -62855 -63316 -63294
11868 -63294 -39463 -15536 -38104 -28125 -5980 -27854 -76818 -124614 -90858 -57874 -38659 -30884
11856 -30884 -6429 -5269 -5886 -5947 1308 -20006 -9308 17703 32787 54094 54254 60078 31177 13992
11842 13992 48406 13298 -4668 1942 33595 27142 -16421 -33431 -9022 -6101 -36654 -64436
11830 -64436 -57885 -32547 -18399 -49506 -51245 -26654 -40123 -24908 -4273 9947 17694 24011
11818 24011 11538 -14751 -32693 -5218 7546 22423 -5583 -26061 -9055 3474 23295 29189
11806 29189 25020 11693 2152 19538 42626 41253 -16506 -21311 2269 -3759 2349 -383 10461
11793 10461 11958 6584 1858 15933 29472 62247 74524 42877 22774 38033 85006 62480
11781 62480 25896 1854 -30233 -49514 -26972 -6502 -39671 -20792 44387 57995 65264 26941
11769 26941 -120 -53657 -57749 -33180 -17488 5747 -28005 -54143 -52671 -5788 -4920 -23443
11757 -23443 -31358 -23038 -34944 -26768 -29139 -18037 -9484 -18876 4213 9841 -19801 -18785 -5688
11744 -5688 -1380 -16753 -26083 -19663 -39333 -29086 7134 18198 22159 -5841 10169 10011 -78
11731 -78 9388 16144 32870 17094 37384 53630 54108 10379 -35491 -6810 29991 6286 -6963
11718 -6963 10009 13469 -12423 -29762 -41294 -32151 -29459 -6699 6339 15787 7887 34730 10438
11705 10438 18536 21293 -11604 -11885 18604 -5050 -42554 -61784 -50838 -44216 -62619 -59685 -26365
11692 -26365 -1387 -25254 -68140 -77649 -70668 -80617 -41937 -28953 10709 -9564 -25402 -26135 -11025
11679 -11025 -19660 -61751 -28550 -3134 -1041 6371 963 -2979 7190 19144 21062 5460 12367
11666 12367 23320 16676 -2069 -23431 2149 -27264 -25182 -7757 5125 9446 3747 30634
11654 30634 62058 66499 28369 3366 -6213 40506 34597 33000 1741 3463 -1361 -28219 -19485
11641 -19485 -24245 -31037 -38840 -68738 -98859 -70152 -50516 1118 13491 8026 -34666 -46570
11629 -46570 -38078 -28387 -3068 450 -23425 -10550 3377 -11463 -10249 12685 9673 -13161 4628
11616 4628 29696 25543 31788 13790 48727 90194 72010 18891 -32334 -30798 -39024 -33926 -10378
11603 -10378 -10571 -10419 10944 38969 69788 55157 80553 103910 84743 9827 -21514 -11491
11591 -11491 -26249 1430 35483 23530 24039 23094 32445 39304 43225 14461 9796 76147 70465
11578 70465 45703 21610 4417 4509 23965 21411 -5005 -27733 -27599 -38048 -24917 -45763 -24149
11565 -24149 12665 24513 31961 3695 12303 2683 -4564 -13424 -27921 -24098 5404 20511 53187
11552 53187 53779 49923 50594 25991 11624 13189 20105 14341 8016 1735 -12410 -60187 -67936 -43079
11538 -43079 -11707 12684 -4485 -4996 24405 28481 11620 27449 23170 43453 52185 35272 41516
11525 41516 39512 10674 -30308 -18460 -11599 -16174 -21112 -6712 7915 2207 678 11515 -5622
11512 -5622 -29661 -21055 -16656 -62511 -71370 -61869 -63321 -39728 -25932 -19053 -7615 23412 33363
11499 33363 20249 -9808 16504 12642 -39437 -50975 10592 14379 11070 36946 31331 19619
11487 19619 -10271 -15866 -13974 -10046 -18182 -14820 -23304 -3480 11647 -9406 22067 62638 58885
11474 58885 11818 -19152 8671 19967 13596 -7251 -10201 22271 5078 -31799 -53162 -44154
11462 -44154 -49770 -28991 -3193 14315 24963 29919 30627 20640 -28719 -20011 2520 -2307 -14940
11449 -14940 6372 17494 36685 -7090 -48416 -69109 -54174 -47317 -11850 20650 40199 39546
11437 39546 44917 16564 5402 -3958 -1921 -9992 -1720 -15736 -52451 -40387 -64858 -57547 -54318
11424 -54318 -21130 -27760 -21196 -11997 -22687 -13177 -2066 -14999 -23749 -52218 -26904 -43302 -50764
11411 -50764 -78631 -97125 -79652 -58424 -38312 -67635 -76170 -55561 -19287 635 31681 51645
11399 51645 33274 29335 39990 52181 65030 50071 34405 18416 -15623 -59184 -61844 -17538
11387 -17538 -3161 -7601 -16068 -24624 -14137 -12256 -24668 -15309 -8326 -34338 -33425 -21586 -27238
11374 -27238 -17282 5069 5567 7683 14513 9596 -6649 -40168 -20124 6120 30305 26891 -23355
11361 -23355 -37897 -10880 8953 18517 26791 32937 25936 6543 1355 8491 47267 42746 26921
11348 26921 4711 -6261 -13535 -3872 5351 7444 10488 12191 -1527 9989 20239 30366 20262
11335 20262 18103 32966 36073 50533 71640 34626 -1686 -25129 -12718 20359 7686 -13778
11323 -13778 -32263 -57596 -32734 6484 31732 37861 40134 4913 -26734 -33530 -4946 6690
11311 6690 -11245 6914 -8322 -8928 -28895 -27169 -8555 6210 28499 6273 -31242 -45512
11299 -45512 -38334 -38670 -27462 -3236 1114 -1191 21758 31997 29935 7798 -5765 -21444 -42383
11286 -42383 -53729 -54931 -25750 2471 37665 56133 20080 13514 21069 8380 -23421 -23975 -4317
11273 -4317 958 4093 -19050 -9514 -29021 -34411 -24130 -44067 -56183 -14269 4687 -31643 -27309
11260 -27309 10943 31993 26465 25453 -556 11278 29752 16308 -2124 393 -19469 -5726
11248 -5726 280 -29387 -32090 -6596 -1592 -34446 -45312 -39997 -66633 -89032 -87590 -77049 -52173
11235 -52173 -32169 -9290 3752 12815 -5880 -22307 -1889 13823 10003 16710 -8197 7464
11223 7464 13227 -2278 28232 57733 55484 42663 24271 -10292 -52125 -28914 -8347 6840
11211 6840 -16853 -24521 -42428 -42187 -36490 -20113 -24592 -10894 -2075 -382 4209 -11592 -16391 -29237
11197 -29237 -28037 -29161 -44337 -18996 25672 35582 16177 3853 -27886 -45131 -77320 -52481
11185 -52481 -27248 -18494 -52297 -63473 -53855 -26127 -14046 -38055 -33848 -4633 32463 28224
11173 28224 13396 -32452 -50912 -12666 -5306 -3290 24645 44247 62416 20028 31919 5118
11161 5118 -22934 -13812 32221 52966 27534 -9877 -31183 -34894 -18475 2522 -6326 -26508
11149 -26508 -26891 -42114 -45993 -55373 -22293 -5649 -36413 -45221 -26801 -14363 -23225 -18889 18442
11136 18442 18902 -25351 -42715 -44303 -9483 11834 13618 17532 51945 49574 16355 5133 15942
11123 15942 17974 1735 3335 7769 -23589 -32236 -25289 21447 17870 26574 14959 15626 -6222
11110 -6222 -31682 -32779 -40499 -62032 -56387 -39449 -35857 -10811 -4614 13357 -21280 -42488 -13537
11097 -13537 -14104 -8973 -495 -22933 435 10857 -3849 -1651 19312 -5860 -7607 10217 5888
11084 5888 14663 1620 -30835 3575 22470 -5762 6634 16006 19232 60969 30847 19236
11072 19236 -200 -2415 -6009 -38931 -52695 -38566 -45006 -37710 18570 87318 92480 78763 33138
11059 33138 -7355 -7096 17192 32132 -20134 -66301 -61794 -20408 7044 13652 12224 26145 -10805
11046 -10805 -34477 -37273 -46562 -4735 46714 43813 25219 -29007 -32031 -17052 -34201 -13579
11034 -13579 9597 45202 18902 -25293 -42275 -19605 9978 12040 -10843 -19839 -11670 -21175
11022 -21175 -42739 -50699 -54670 -44400 -31785 -37557 -71237 -45043 -47940 -58282 -61109 -62560 -68213
11009 -68213 -57351 -27536 16612 15546 8908 20721 17739 22873 50723 55031 18257 -15311 9372
10996 9372 44968 38737 31696 46365 57836 70716 84367 77324 26419 2873 27368 6025
10984 6025 -12649 -10486 3533 -33910 -28188 6772 -22363 -30369 -37931 -164 -8874 2255 12836
10971 12836 -4460 5510 -4894 -21213 -7025 8786 7759 3126 20316 14502 5690 -13408 -40772
10958 -40772 -29459 -8071 22805 44893 19709 -14647 15013 -10885 -31563 -8678 8239 2550
10946 2550 -37754 -59167 -51023 -22228 5570 27755 26446 57534 69630 50698 50666 26998 -28915
10933 -28915 -19432 683 1695 -38736 -34010 -30578 -6382 -32926 -1692 16509 4480 -29679
10921 -29679 -35898 -1400 35515 54247 32086 22469 22392 3731 -30875 -33234 -20328 13446 12750
10908 12750 -8847 -29160 -31444 -24816 -29424 -54141 -40161 -11458 -21203 -71556 -91690 -52719
10896 -52719 -13722 36008 31954 -19720 -32566 -38772 -39637 -36831 -10473 9929 9627 7768 4388
10883 4388 -18537 -22066 -38911 -48396 -48336 -35591 -11727 -9182 -47205 -96569 -59624 -19786 -18418
10870 -18418 -25272 4063 -1446 -6647 -48985 -51944 -35008 -8649 17632 36012 18529 15916 13649
10857 13649 6968 -16014 -631 18478 30356 35050 16733 12686 1777 15668 37836 18630
10845 18630 -4152 28719 40598 25543 21217 29421 -7297 -21166 -22093 -9095 29719 58359
10833 58359 55686 32271 39459 27424 -6559 179 -2059 -4472 -21896 -33356 -9794 3724 -5124
10820 -5124 -2722 2468 4366 -104 -12733 597 -5945 -15556 17066 43158 44962 16983 -2272
10807 -2272 6225 -10438 -15758 -31208 -12215 -11902 -18979 -12011 -14661 -5823 38628 46825 2297 -30033
10793 -30033 -34009 -33233 -1519 -1436 18438 5915 5036 22010 -487 -6568 -20372 -20102 -29130 -21402
10779 -21402 -14306 -379 -600 -16498 -38800 -25540 -2303 11640 20357 22987 30430 33178 44858
10766 44858 45376 31985 44818 38186 2115 -40660 -19237 23809 36879 2869 6585 7126 7530
10753 7530 19234 -7507 7049 39891 41360 25429 5338 -31652 -43828 -32842 -32338 -47992
10741 -47992 -40064 -18900 -44936 -36271 -21320 2762 29892 32854 1049 -13243 -22762 -18851 -3840
10728 -3840 10781 4091 -8877 -5631 -29192 -19030 -1124 -18203 -28406 -14108 -6489 8432
10716 8432 -12569 -20240 4742 21250 -408 -48546 -52334 -16319 14297 -17610 -12136 1255
10704 1255 -13814 -47773 -46564 -4648 16649 16368 -276 -1854 33210 16328 -5556 3404 -3311
10691 -3311 5715 7860 40317 25516 -21394 -9908 24923 -3050 -36993 -31444 -27674 -39185 -37921
10678 -37921 -46798 -36308 -10623 -19221 -42213 -64361 -88525 -63929 -51203 -41045 -13945 8061
10666 8061 -12148 -27056 -35316 -9090 15319 -8556 -17324 -16920 -25395 -41257 -41544 -27631 2274
10653 2274 -8490 -32621 -50546 -44633 -34186 7157 35645 21393 13637 22789 73268 79845 71868
10640 71868 48209 39522 45669 30885 -13893 -14481 -20339 -5826 -10493 -30199 -26377 22988 17259
10627 17259 883 -9385 -10291 7322 31304 28220 20374 23008 7476 23455 47697 32399 8595
10614 8595 -3353 -11318 -18841 -14538 -3308 -2411 729 -9285 -1375 -28702 -48298 -66928 -77087
10601 -77087 -54491 -61958 -73019 -57849 -54860 -43394 -40761 -41025 -21435 -33451 -22998 -35972 -74884
10588 -74884 -56710 -67621 -50372 -38013 -31108 -72789 -93010 -51696 -17969 4171 12826 7530
10576 7530 11139 18711 17065 30310 46552 42747 22797 8568 8674 16455 11618 10761 -19361 -7395
10562 -7395 14926 29991 3980 -12131 -22520 -25299 -22869 -36049 -23257 -9059 -20127 -29890
10550 -29890 -6406 -15201 -43996 -47416 -41899 -25637 -39445 -33194 -8969 -48437 -48306 -25702 1956
10537 1956 8246 -6716 -39868 -38749 -52729 -88259 -53684 -49068 -21348 -21714 -11606 -12229 -10163
10524 -10163 13863 8818 4112 -15512 -9959 -13972 18633 35771 29465 8013 -12710 7943 24805
10511 24805 10887 -6271 -9587 -30389 6587 -5853 -21016 -22628 -21093 -8954 -32908 -41417
10499 -41417 -50016 -27874 -18252 14021 9932 10474 32639 -4051 -74 13905 9040 24218 22788
10486 22788 12248 11554 26917 26299 12692 -22182 -35873 -33203 -35604 -40754 -259 -4514 20047
10473 20047 35227 -14462 -69149 -110171 -101297 -94261 -99551 -60441 -42447 -45043 -56973 -35562
10461 -35562 1005 19025 326 14834 29985 -9038 -36655 -29924 -59532 -41226 -21182 -10994
10449 -10994 -10214 -14761 -13136 -28366 -55367 -32235 -21327 -29893 3783 33118 45735 46023 15804
10436 15804 -11919 -29731 -51687 -46486 -67991 -62209 -61688 -48254 -33053 -12841 -25612 -42866
10424 -42866 -18857 42282 69117 62084 47834 6639 34554 21168 14025 -1893 26982 44179
10412 44179 46088 36210 21316 48482 44957 -14077 18887 25285 13387 -24295 -46923 -31947
10400 -31947 -14615 -11634 -36307 -61048 -36575 2169 52595 71149 58848 44449 13701 -2810
10388 -2810 6889 -1416 30242 37790 23953 7340 -23996 -22234 -25095 -35479 -44324 -29220 -17605
10375 -17605 -513 9451 -30826 -26757 -5832 -11798 12059 858 -12708 -108 -4384 -30768
10363 -30768 -47576 -47861 -30408 -13144 -21977 -23043 -48782 -48988 -31369 -41082 -47655 -30096 1036
10350 1036 25842 19647 -7411 -20573 -41237 -42388 -43636 -38182 -24723 -3691 35006 36711 44563
10337 44563 72989 90964 66815 65785 59798 64703 45316 30389 25839 15020 3511 19808
10325 19808 11879 5914 8286 19095 15478 23798 22128 20845 33760 40692 48005 62576 53433 56519
10311 56519 51045 14345 30826 29782 5341 29168 37068 15069 27051 25657 5163 16447
10299 16447 8740 5131 12254 20127 -18392 -14830 -20300 -36651 -6123 -35082 -49737 -30269 -12766
10286 -12766 -22023 -31997 -40354 -18781 21084 13068 -25776 -52393 -10731 12067 26579 13420
10274 13420 17615 26377 15593 -7072 -21968 -26549 -27637 -22879 -16774 -3552 37654 43298 26660
10261 26660 29658 21347 8110 15562 21631 36432 51040 34017 27470 17305 43 -1819 21495
10248 21495 24602 6264 -1105 -12613 -9856 -20055 30629 24878 23596 17102 3732 113 972
10235 972 -35484 -9825 -799 -6820 -2650 -5227 9648 23658 55171 39128 45531 88574 93454
10222 93454 72382 47923 38345 960 -17972 -14422 14090 -7929 -45780 -40443 -5837 20202
10210 20202 15543 1995 -3072 31539 34085 16093 21938 22973 51273 61204 53419 24650 -24369
10197 -24369 -58483 -52415 -40482 -21748 -10299 928 -6139 -7220 -21652 -34680 -12276 18683
10185 18683 1085 -46237 -51584 -47566 -39997 -23623 -18876 -18457 8259 35943 37544 42207 51866
10172 51866 32354 -43361 -78519 -43465 -20521 -17475 -23462 -42352 -35333 -50741 -42700 -73735
10160 -73735 -41034 5721 9754 6886 27845 37348 36823 -10636 13917 13832 37375 51841 52394 31354
10146 31354 38880 53929 53128 21153 -13920 -51328 -59583 -72809 -73663 -41889 -21148 -28696 -34122
10133 -34122 -32109 -2669 29701 11223 8626 -10680 13274 5194 -18345 -2755 -19058 -19892 17543
10120 17543 31289 932 15210 -7706 -5234 14645 -4348 2661 -5530 -8136 -23443 -20419 -47310
10107 -47310 -76304 -73591 -79379 -51636 -48553 -37100 -44432 -87095 -95800 -71408 -33817 8968 48060
10094 48060 6926 -6670 2092 11030 18046 18360 12536 10079 -10308 23466 33476 12188 19127
10081 19127 40151 24455 5059 -3133 -31505 -42329 -44209 -75535 -74836 -12977 39529 40015 12359
10068 12359 2566 5855 4836 -7893 46 14977 19781 28150 35593 40031 30469 -7308 -13372 -1234
10054 -1234 15495 5462 474 16608 38546 54840 83988 105052 140403 194974 227011 201030
10042 201030 131869 70384 39881 26038 25048 21546 1094 -1982 6958 13833 -5334 -14470 -11354
10029 -11354 -4388 -4453 26534 6519 6681 42066 38818 40641 22817 8768 21967 30306 29872 -5761
10015 -5761 2716 -12983 -39485 -32170 15275 39675 36240 6660 -8236 -6339 -13794 -22965 -34700
10002 -34700 -33594 -35904 -41549 6015 12299 41897 50873 55514 26557 34773 15051 -25648 -36454
9989 -36454 -55272 -60281 -43659 -14064 -1326 -33335 -29055 -20166 -19216 -26613 -4052 5755 -22178
9976 -22178 -22377 -30289 -33778 -17403 13971 27899 37784 7140 843 -10970 -38021 -51795 -55154
9963 -55154 -45248 -29998 -16078 -41967 -55701 -48270 -14514 10738 18940 8181 -319 4858 19548
9950 19548 23752 13939 -6992 20403 37671 -31979 -89525 -66308 2955 36047 38742 45321 54839
9937 54839 18476 -34444 -40664 -41809 -4828 8664 -12466 -25081 -20082 -5425 -22634 10563
9925 10563 36745 20492 21687 14097 -15413 -34132 -17089 -9252 -10925 -33815 -21738 -2749 -1792
9912 -1792 -5911 8960 11220 7040 4809 15779 10286 25136 52870 61937 31243 -4350 -23369
9899 -23369 -20491 -15011 -27830 -51844 -44264 -17203 5729 15033 7771 3273 34737 18500 -39036
9886 -39036 -59894 -54995 -53884 -29128 13763 13852 -12848 -4413 5587 -3154 -31251 -27490 -38463
9873 -38463 9273 28099 16057 25733 41889 44743 7767 1836 -21064 -20538 15144 18681 20072
9860 20072 49198 61137 81110 74918 73146 85308 79582 85171 92482 62582 42957 65137 59628
9847 59628 57706 59889 49924 11882 -13279 -9547 -32851 -50310 -23304 -1205 5001 30841 20279
9834 20279 3221 5781 7109 14747 27342 35723 25498 25459 -1258 -18829 -28443 -15542 -6196 -18581
9820 -18581 -31526 -41778 -4355 18294 -7243 -57051 -61162 -17430 6436 9309 -15236 2262
9808 2262 29589 39068 18082 -1064 -17156 -48891 -62616 -46421 -9105 562 20230 47158
9796 47158 66679 65047 37183 21274 7845 -5344 -13347 -13678 -20953 -1879 5139 18318 35340
9783 35340 15468 -12314 952 21024 19107 -173 -10836 -24545 -58089 -46266 -40352 -19563
9771 -19563 7249 16668 -8035 -41385 -46610 -26518 -15636 -45689 -22086 11621 -14447 -25248
9759 -25248 -17436 11012 39081 52301 -13759 -5295 53001 51011 42427 14963 32136 32033 35815
9746 35815 -18414 -68598 -62687 -34818 -29351 13919 30923 -10910 -29415 -41906 -30639 -18165
9734 -18165 11761 27142 58465 66709 97794 86292 65662 60109 51388 51725 37222 31678 39146
9721 39146 48811 9292 -1745 7021 -8215 16266 31340 24634 13972 16379 27253 41326 73957
9708 73957 67038 33999 42402 64876 96304 72158 45021 48359 29490 28975 40783 65188 48323
9695 48323 37309 32951 41649 -7467 -24868 -2671 16980 13333 8289 32548 35288 42282 56173
9682 56173 29209 4896 -2806 12758 60793 50036 8808 12063 -26323 -47882 -455 22312
9670 22312 57744 75156 88401 68833 34641 25624 45263 37494 2034 -11775 -14344 -21080 -12107
9657 -12107 857 20530 17981 14972 31043 47920 35560 43023 74996 76995 109986 106583 39434
9644 39434 18542 32036 40525 36271 37615 60128 44814 31185 10534 -7142 24548 49365
9632 49365 122115 105886 87043 75304 51078 58819 87088 99234 77899 87172 72121 66914
9620 66914 39045 17948 31664 56131 45490 42048 94382 86542 68377 48807 54750 49877 34628
9607 34628 6696 21180 29148 27752 11140 22676 38699 53744 35447 20659 9561 40139
9595 40139 55510 54032 41485 23822 31279 42561 19874 25866 32880 23097 44015 41527 51611
9582 51611 27350 -11758 -23887 19755 41497 53965 67273 25922 15834 30146 50758 42076
9570 42076 32517 20955 8487 -21035 -12080 14390 37466 32373 24001 18711 -4638 7558 27171
9557 27171 46414 38130 26199 4075 4916 25678 30240 48453 30516 23714 10140 -18876 3018
9544 3018 56065 44407 44225 54927 62572 38709 27141 30464 22966 -7898 -14118 10749 24738
9531 24738 21633 -4454 -16110 -7088 33666 51402 61048 74224 66595 39377 17633 -5726 -4860
9518 -4860 21195 49994 44260 28470 31196 62038 60224 35490 37640 22342 5673 43916 43864
9505 43864 36718 38692 -5537 -23998 -15435 18631 52465 32177 17780 1704 16400 21401 17062
9492 17062 6301 -3657 548 41968 73435 74987 85375 76133 75824 21615 32512 33167 17641
9479 17641 5414 -577 14606 17605 38634 60922 65535 78128 73508 77097 84769 46516 3206
9466 3206 26708 47762 40078 50962 57753 61240 81189 56726 34992 11630 8388 17306 35378
9453 35378 52529 65873 69131 32072 35589 56177 26215 5781 41885 50647 25401 23017 18527
9440 18527 -509 -14283 6088 25189 45877 13645 -12598 -14744 -1624 29108 42608 69948
9428 69948 63754 61998 47737 50002 54853 62138 65815 70700 79186 68191 71050 60054 52069 43912
9414 43912 9463 6046 26320 55576 57391 46797 60143 47858 -4122 -9239 13482 -3688
9402 -3688 11773 34627 86927 85265 85309 47059 20965 30081 22637 37238 65344 65218 60494 82384
9388 82384 105826 92751 55999 42204 77806 67067 82113 100638 100647 77795 52407 36697 53566
9375 53566 74420 77848 94330 87155 87607 45676 2612 28048 32411 20919 4392 -390 6811
9362 6811 8582 -24449 -24694 16534 26423 18431 -6936 6496 -10400 -15318 94 27547 55907
9349 55907 69517 74816 76748 91517 81045 56140 42840 40299 58172 101054 103882 80367 59271
9336 59271 57879 68898 101576 61113 67615 92370 84481 84258 100800 74373 58212 36507 9891
9323 9891 28574 51854 54671 22965 14349 25746 23535 12347 -3806 52670 74789 58435 25056
9310 25056 23622 45665 78609 67685 62615 75552 80052 98893 99288 94114 85301 50430 50479 58882
9296 58882 53568 45011 57812 87849 107176 121516 96767 82918 56230 26839 57149 85489
9284 85489 80129 96182 82464 58593 95777 85029 62466 52028 67984 41588 56201 81269
9272 81269 105830 127876 165454 127851 107144 121834 107122 80426 70679 73260 123520 163473
9260 163473 147328 118338 121271 116741 123268 141022 146192 158299 172865 191576 194767 190054 195455
9247 195455 219145 192083 194854 186994 211456 230876 199140 218534 243560 272736 281347 237063
9235 237063 247088 261468 309988 343263 324693 353458 401213 448954 449805 464182 480580 511772
9223 511772 543327 567038 588150 650873 677405 703338 742215 824812 931701 1007637 1085026
9212 1085026 1174860 1308389 1483648 1654499 1835361 2054112 2361960 2713716 3186428 3796995
9202 3796995 4564273 5560437 6809863 8460348 10626716 13298286 16314824 19256853 21388991
9193 21388991 21941274 20515784 17646356 14420283 11538506 9203452 7431331 6099949
9185 6099949 5131965 4376313 3809954 3384175 3010368 2670362 2419997 2237201 2027949 1863127
9175 1863127 1734153 1617574 1513972 1392616 1294679 1201400 1104429 1006574 919456 875573 859158
9164 859158 838557 817753 733582 688648 668978 665251 636203 591020 605197 579740 536792 504309
9152 504309 467243 453677 442985 420154 417195 439468 382412 390239 390733 390680 377317 318501 310662
9139 310662 315180 284290 277093 271208 246638 240656 281004 334010 313760 317338 319589 299184 246183
9126 246183 231024 264159 255545 243460 211246 186257 203668 221009 206172 180911 178449 185902
9114 185902 168687 156613 161482 174043 180439 168202 164534 177330 178941 211555 179952 135362
9102 135362 113001 141237 153157 160552 179083 197417 203289 198070 156941 167327 192653 171729
9090 171729 132303 113984 87221 89034 102045 100484 78315 82265 91506 145543 137895 129725 117814
9077 117814 108607 94415 87716 109760 124607 145991 174681 171022 186770 177171 142058 106550
9065 106550 100409 93077 100608 94007 102048 112499 107965 64790 79751 99707 55505 25926 45743
9052 45743 63510 76752 101526 100157 103311 119308 74958 52843 65320 77796 94619 71287
9040 71287 59955 39634 29671 26974 4924 -1869 -1742 23534 61307 91916 97727 74990 96292
9027 96292 94207 40649 48992 66349 62485 70240 82166 124365 113348 54086 42418 74453 89991
9014 89991 90017 80259 65256 42291 35286 68268 90383 115859 135192 111459 52534 35224 60478
9001 60478 84871 76060 96303 78626 74030 87915 127184 126652 118305 140965 119322 46519 40562
8988 40562 58752 91930 81641 52936 33005 60163 69117 48167 68066 85325 80899 92246
8976 92246 95637 89203 86211 117200 119114 117929 104928 94198 58928 54321 50639 44334 52735 42454
8962 42454 49206 46238 33210 43534 75020 82141 92904 99698 108228 82615 86669 54037 52897
8949 52897 53842 58820 89927 94878 83305 49705 48032 37769 40166 31024 20618 27671 32185 16344
8935 16344 33357 36499 50962 70528 82088 52419 17486 20554 25074 33225 31250 27187 26660
8922 26660 8549 -474 -10298 -3899 23727 20326 35558 37083 9958 24949 47800 61806 42244
8909 42244 39787 40400 34938 27108 62351 73767 57406 71158 57780 25377 18159 39317 52638
8896 52638 42708 19652 46002 43806 27788 22092 -10558 -5949 13946 1382 -20897 -4532 -4344
8883 -4344 -299 2767 36662 87621 100292 131404 133582 125415 113911 102935 118418 112835 92341
8870 92341 33064 32539 51351 26808 11203 13800 42520 47828 73560 115226 119911 101429 77250
8857 77250 105867 84202 117410 138422 125048 116001 129757 129582 97002 53408 40082 56117
8845 56117 73125 61971 60313 52242 44173 22031 23800 27994 26635 -2875 10387 34072 75173
8832 75173 96952 50422 33705 40596 50187 52978 71115 78958 65463 92434 85065 35033 41481
8819 41481 33609 8242 32016 83345 108372 110312 108272 78482 59041 76255 99137 76950
8807 76950 32636 58166 59094 37152 46012 62373 66438 111356 115914 97503 100857 64775 48779
8794 48779 47670 38359 29288 34324 65372 77035 42371 22951 29700 40554 42398 44960 36353
8781 36353 67762 89414 68665 50322 52965 97448 96922 55546 7877 2638 -1971 -7805 34188
8768 34188 40197 -4647 13874 16327 13247 34865 25069 29322 7538 23390 67314 74687 62688
8755 62688 74216 56985 48255 72758 101743 93578 103736 109679 100767 78265 48687 36030 50037
8742 50037 97735 118607 98674 97203 114630 116947 91991 142101 174649 161111 146536 120013
8730 120013 106542 104912 109954 136942 159762 154844 134138 110091 113585 150710 195619 202051 208947
8717 208947 220548 228263 250147 282396 351949 425241 426757 381339 338495 279398 210286 189289
8705 189289 195307 201345 203699 156757 122759 101634 60299 59842 89903 134614 129357 112970 122848
8692 122848 115943 136137 123023 107936 118246 119765 111138 97950 117496 100585 119147 137677
8680 137677 136367 172330 183085 182072 174327 194207 238682 210447 173263 168161 176493 162006 173840
8667 173840 218538 236573 201879 172263 176029 181127 197647 205416 243624 271227 285332 279817
8655 279817 253250 254571 272754 262169 267671 318425 316379 295341 305007 338097 367607 368623 380690
8642 380690 377738 383538 420833 466794 486172 567454 646225 707685 741492 750091 697477 621173
8630 621173 550197 506794 491345 461099 446635 460973 485645 475738 469520 474104 513306 514129 499976
8617 499976 512660 557336 561720 573724 567095 600440 651588 661533 691163 733822 758080 776057
8605 776057 790946 844984 879431 921547 950345 1005690 1055024 1121324 1198461 1248308 1326698 1414680
8593 1414680 1527257 1690656 1870695 2053070 2246266 2455059 2673509 2884654 3075958 3246027
8583 3246027 3332318 3292032 3148793 2884198 2599501 2246896 1921576 1676510 1467124 1280275
8573 1280275 1142721 1002972 881849 808471 758185 727949 695014 676073 630422 570733 514584
8562 514584 486639 478841 455169 449968 472445 449562 419570 383596 378914 379391 376425 347809 307882
8549 307882 318712 347181 341906 306344 291926 327615 310811 308892 303841 291667 291032 264322 241979
8536 241979 244678 234818 226443 216413 233267 241153 235591 224916 231512 234901 211231 183337 171374
8523 171374 167525 169597 203047 196803 150272 121514 170303 212877 213004 174353 155890 142359 153864
8510 153864 158145 152054 139240 163877 170961 142781 141286 164800 181670 187184 203532 211866 200840
8497 200840 142120 115985 124706 115398 113191 117672 129051 113497 112040 125876 130211 129312 127607
8484 127607 140592 133104 89112 93601 109945 107497 64926 24861 18209 21120 59539 77258 131321
8471 131321 147213 162050 157543 120429 83554 82061 73702 60247 73234 94593 104399 129851
8459 129851 157327 127587 92175 107068 111186 97591 116039 119981 74463 61423 43036 47390
8447 47390 63556 44081 65535 98572 110454 94127 101426 112151 31031 21991 57129 38589
8435 38589 45133 72393 93328 58895 52815 30894 17589 37971 43030 46091 72744 96523 117669
8422 117669 112722 89033 60636 63117 41775 31085 33955 56483 64717 101000 71730 48678
8410 48678 68692 50311 16529 43995 85177 78631 25375 22611 51103 41742 28948 50510
8398 50510 52961 52632 36032 19181 39375 75937 85642 87233 59319 51252 109624 126378 112190
8385 112190 108489 94945 62608 47028 50145 55324 62069 73462 55416 15003 -7613 23540
8373 23540 11824 38780 47822 42127 60179 78146 68318 53785 15881 46944 63050 30271
8361 30271 21898 53081 75685 67191 39530 18625 64 2691 -18591 -30443 -32155 -11097 -10472
8348 -10472 3538 20511 33311 39460 34300 36433 53995 67190 71409 79299 69669 83178 68138
8335 68138 55021 29121 34746 27563 25852 43779 21946 8362 27980 26217 31426 48292 28989
8322 28989 34588 36452 16787 -17012 -3954 501 -271 7883 4714 -6843 -9760 10017 36738
8309 36738 34377 18838 36462 43988 52942 47337 36352 32412 30312 20636 2293 14323 -4151
8296 -4151 10404 35000 54812 65864 57752 25450 13434 13668 30381 20534 10003 14309 21262
8283 21262 35211 63407 71301 76699 58565 46431 53666 50128 35022 39720 51099 60369 48935
8270 48935 12401 13669 49999 37194 35431 54210 67931 42043 18194 -15296 15110 56677
8258 56677 34053 16950 55148 58963 46173 50577 49613 42093 32136 -5213 -12217 -22855 -21216
8245 -21216 -12118 6258 90693 114379 81741 48723 12069 14974 60914 94900 75726 69133
8233 69133 59898 33717 33436 43971 35363 40597 37684 30992 43521 48231 51725 33296 14127 -10427
8219 -10427 -12051 -2144 -10328 1087 46538 67230 58342 38082 9168 20316 23718 35899 10033
8206 10033 11951 14978 56003 79524 53283 25982 19825 41686 50864 53578 36749 24791 17593
8193 17593 -3640 -26805 -4244 57167 40259 33682 32753 47925 44123 20101 -8270 -24582 -13854
8180 -13854 -11571 23282 12167 21088 42917 35068 13562 24865 46245 47897 36689 13648 -1481
8167 -1481 -6724 -17613 -23381 -15450 -5477 3453 44921 58012 39368 50814 95860 98615 78065
8154 78065 37179 44256 63124 64115 26712 54890 38261 52034 97837 81554 81272 57445 53616
8141 53616 71569 50808 29369 33334 40265 44594 38933 4239 -27006 1890 41620 15862 10784
8128 10784 33829 47396 56239 58284 72628 74590 73580 82033 60679 45695 44365 41786 48098
8115 48098 40655 30945 36776 58797 58358 44285 41154 42430 65397 63374 62413 70781 41962 4329
8101 4329 -23262 -15971 21567 59448 71439 91521 99853 87039 86314 62392 55346 43644 38046
8088 38046 25887 20703 21493 51451 62985 69049 92389 73929 80406 78576 65506 40914 32588
8075 32588 28863 43089 26272 28994 61499 93954 87657 104743 82085 28673 -11126 -11034 -10080
8062 -10080 -2195 39935 39564 27436 -6059 -16999 42502 66945 77221 56817 43298 83646
8050 83646 90836 77507 76406 88699 129189 115147 123030 121748 123158 132255 134252 118513 100958
8037 100958 119682 163188 179221 224386 226715 222108 207305 224465 246786 228452 230462 208399
8025 208399 171648 153238 167062 157633 166188 175503 185833 191198 174083 154320 171154 176142 214414
8012 214414 212415 173905 184518 202418 185415 177380 223396 238151 265523 306066 350835 323359
8000 323359 289227 336043 358639 388111 438074 463343 488180 463859 491280 503347 474682 451057
7988 451057 467424 461481 439157 458698 450204 450694 451431 420187 393831 365530 309593 248065 243893
7975 243893 264031 263697 214361 151414 177735 222361 275515 272960 247332 243065 274609 310702
7963 310702 325988 318492 322634 314424 314997 316360 305879 312886 371818 384129 380937 426763 425091
7950 425091 451242 467762 463219 460504 498479 541140 529630 482189 480488 482963 495501 450626
7938 450626 409593 372993 330777 295084 286025 265340 278241 284047 286327 287876 288896 259388 238682
7925 238682 211063 241116 300585 318130 314137 305281 296760 283690 296172 311741 338654 348203
7913 348203 352320 357139 353436 348725 335305 306585 317253 323330 319450 300570 248204 204968 182261
7900 182261 197012 200845 193550 162521 135656 158896 143826 149032 163911 169194 156263 155291 145194
7887 145194 132441 109644 136835 123285 77942 76683 89853 120482 132578 138500 178613 188482
7875 188482 174071 156722 116498 120614 163868 168620 137075 140559 156282 169296 157302 117024
7863 117024 118162 103088 80184 80552 90215 95847 124530 123561 99050 116269 127877 135087 118047
7850 118047 100622 106714 102419 93518 99212 97864 50471 14900 62611 76063 59697 48697 24901
7837 24901 32487 15286 1763 9010 35482 62530 68597 53905 66435 61046 33086 6014 22607
7824 22607 43539 65053 61359 62718 74336 75223 39678 6451 -14583 6464 53173 91535 60555
7811 60555 60874 72495 83832 66441 43375 -6393 -14660 7432 23725 39629 32258 32440 9346
7798 9346 26466 26839 -8940 11613 18511 11118 16161 -66 -4929 11410 23828 29082 27972 52523
7784 52523 63708 60803 41634 38021 53867 51737 59096 60720 79480 85682 101896 94409 47382
7771 47382 18283 -20552 15132 48908 39914 21743 -5142 -4846 -15259 -19573 -34855 -38569 -4297
7758 -4297 14902 31312 24075 8236 1272 4168 4995 -40790 -61862 -52787 -21942 -17138 2067
7745 2067 15240 -36119 -52986 -8882 34075 36976 19760 13952 26270 21590 31485 47577 31915
7732 31915 9394 23118 9059 4340 40643 40045 26495 25501 -11160 -42287 -43528 -10800 -660
7719 -660 -9057 -51380 -77650 -63379 -81444 -90658 -61116 -40551 -52647 -30238 -28450 -1419 688
7706 688 -18972 1441 7508 -484 26142 38036 25378 27063 26554 15107 39840 23049 -14349
7693 -14349 -20591 -19353 -10242 9836 4337 -13753 -20680 -310 -11863 -48443 -2765 24395 -840
7680 -840 -38007 -62811 -33822 -167 593 -2483 14537 18273 6020 20642 14066 10121 9989 8716
7666 8716 -9003 -20939 -9592 13724 27689 24579 35717 18108 3716 3163 5196 407 -14742
7653 -14742 -2794 -447 -2080 -21750 -72827 -89890 -68419 -30988 -28147 -38276 -20843 -2829
7641 -2829 1445 -13540 -36134 -62742 -60740 -31145 -24889 -18653 -5365 -48969 -75037 -90431 -48712
7628 -48712 -29536 -38058 3432 32620 42121 42464 34232 43493 10139 -17578 -10085 -16496 -7123 30478
7614 30478 32499 35896 36946 21290 10485 -16054 -12541 -27037 -17852 7697 -19388 -53128 -63323
7601 -63323 -40382 -39313 -5683 42918 24419 -9767 -25765 -10473 -7532 -42144 -75432 -40130
7589 -40130 -21066 -19174 -4673 37883 57749 59980 67916 74292 24622 -17433 -16977 -1521 22631
7576 22631 33353 23424 40094 36842 52060 56238 40537 12151 -2900 -10133 -442 48476 58903
7563 58903 28844 36079 49064 53796 62370 58268 21310 1202 -1387 -24239 -11135 -9056 -20519
7550 -20519 14409 34163 32998 16153 -11021 -32927 -23375 -11692 -48196 -63838 -33498 -9051
7538 -9051 -1809 20656 8192 4360 -2680 -27910 -31800 -52692 -54163 -42630 1001 13141 7699
7525 7699 -664 -23119 -40640 -53280 -66423 -42834 -23839 -12043 -18568 -11089 -2975 -634 -19604
7512 -19604 8424 53785 67641 27215 -29573 -25510 3891 26842 11777 -22703 -14721 -15785
7500 -15785 33596 57383 6613 -29311 -35078 -5712 16290 20085 29901 43802 40034 36778 41656
7487 41656 5295 -10283 -58193 -46110 28624 48630 23204 -10727 -12265 19204 7645 2702
7475 2702 -21179 -14136 22263 28100 -11848 -18610 -13752 -23526 -6755 -13423 -12793 -18826 -34907 -24976
7461 -24976 -3311 -39980 -49874 -32439 -13927 -28369 16054 32086 -14629 -28731 -28942 20836
7449 20836 36203 16199 18584 19319 5661 -13167 -18204 -4411 7438 1303 -23252 -18122 -22522
7436 -22522 1011 6392 -6987 -19134 -16086 -23954 -10758 2315 35077 9001 10773 17980 18187
7423 18187 -3326 -3875 -5346 41861 33177 13204 43600 47584 18605 11129 -6454 -20157 -4642
7410 -4642 26601 24990 10700 21137 25303 22646 -1917 8286 2776 -2805 13057 3062 12494
7397 12494 -10874 -11911 2961 12218 -13483 -44128 -11929 -26787 -57619 -53355 -30735 2485
7385 2485 -15024 9051 32067 14689 8901 7520 -33641 -38614 11253 11074 -3969 -35716 -23641
7372 -23641 -8865 1755 3531 439 24581 22707 8080 197 -10347 21599 38840 36534 1814
7359 1814 -49039 -68187 -56453 -12779 -35283 -73019 -56045 -36233 -60859 -69088 -59032 -86183
7347 -86183 -63587 -25716 -12412 -15431 -21973 -2972 21477 9504 1603 10395 2895 3361 15284
7334 15284 2185 9841 4708 -2063 14227 19644 25467 37956 29044 11070 -8237 -11808 -22369
7321 -22369 -26844 -28034 -22668 6517 2778 29713 15303 20585 19378 23424 -19343 -37378 -22568
7308 -22568 4959 16368 -16161 -11638 15490 27612 -12725 -60945 -69531 -72417 -54638 1846
7296 1846 -17673 -34371 -14829 6895 12547 13687 40309 36956 21652 -20526 -4862 -4552 -48095
7283 -48095 -48628 -50020 -43245 -54298 -73106 -42634 -31914 -46046 -19954 1067 -1219 -10301 -13202
7270 -13202 10090 -16169 -4904 16944 -11671 -44127 -3611 31677 25187 65308 57344 12799
7258 12799 5473 44056 49537 24755 -15175 -35475 -33336 -34134 -38261 -29779 11251 17704 8441 -10586
7244 -10586 -32582 -59545 -21011 12903 12030 6416 17980 16967 14337 -30382 -42143 -16329 -3750
7231 -3750 -26649 -29233 -40792 -40202 -23157 -18320 -31299 6862 16164 14068 35012 10573 -14285
7218 -14285 -5379 15618 1944 -43583 -38481 -21957 4021 38910 3453 -4633 -7412 -40528 -33229
7205 -33229 -25458 -35561 -31958 9211 36994 15704 55881 66363 34402 -4463 -3546 812 -56244
7192 -56244 -78249 -81328 -50025 -35542 -18240 -27481 -6043 13871 20454 39461 18792 -1792
7180 -1792 6486 11114 -20052 -33868 -58894 -59108 -43558 -10142 9404 -1744 7293 27770 23269
7167 23269 19594 -8041 -1774 996 8821 32388 38836 9143 -21067 -62245 -39133 1180 25664
7154 25664 -1387 -44574 -28166 -4963 51747 34689 23220 51677 41366 58653 63453 53883
7142 53883 48377 57496 44843 44547 27413 3963 -10310 12676 60296 97487 80788 58359 39401
7129 39401 33786 33002 48295 48425 51217 38936 19057 41296 41815 972 -24225 -28794 -37714 -19507
7115 -19507 -1744 35425 52283 64836 55001 20163 -6319 -9259 767 -9264 -15773 -69485
7103 -69485 -105307 -99563 -70248 -39327 7525 1873 -24796 -19450 21602 18169 -28661 -23077 10408
7090 10408 9230 8979 -8889 -36935 -30039 -29421 -33456 -32932 -19022 -13733 -28098 -27457 -52817 -75905
7076 -75905 -63473 -56103 -63731 -69409 -75334 -77151 -58863 -39499 -35324 -44896 -60395 -42910 -21063
7063 -21063 -18310 -19906 -22208 2326 29631 19023 -29573 -29650 -14431 -5807 14853 5803 2279 16359
7049 16359 34515 10460 21286 51936 79331 93177 99017 95060 40123 -2523 -66882 -90377
7037 -90377 -92446 -81702 -57717 -5169 11551 29715 9343 -45084 -43598 -22443 -17299 -1691
7025 -1691 18854 3206 23605 63641 73071 49980 62324 79690 47552 18125 8154 6259 10078
7012 10078 19829 23056 41675 15356 26727 64325 63921 53238 40720 24356 15961 7221 8442
6999 8442 24379 43229 38585 11962 30901 24015 -28729 -30252 -17914 17011 37031 15129 -18536
6986 -18536 -35156 4623 27678 27309 24526 29483 45497 29262 -14712 -14406 -24154 -31558 -40147 -33696
6972 -33696 11552 35703 63639 22894 5666 13228 49601 43964 50117 63518 41148 -19172
6960 -19172 -45460 -29166 -16260 -16888 -53130 -47968 1167 -24381 -24439 -8561 -15177 -35209 -39109
6947 -39109 -37531 -73279 -55449 -40644 -31048 -18781 -41029 -40624 -7002 -7750 -18689 3502 10794
6934 10794 31858 40419 32567 19249 22828 -24642 8121 51840 2933 -22101 -23637 -7882 -8125
6921 -8125 -15781 16115 67515 49873 35849 45386 34007 8698 7016 -17448 -36412 -9878 -20760
6908 -20760 -12508 15095 -26915 -29017 -9871 -20719 -21015 -6884 -21519 -20485 -16347 -49482 -99273
6895 -99273 -69957 -43240 -12362 -18353 -2096 -14590 -27582 -47351 -32237 -7724 -5830 -6559 2392
6882 2392 -6705 -33313 -20158 -17514 -23406 -48795 -31333 -6029 1269 6616 33180 40944 31598
6869 31598 14026 -3004 -33587 -34162 -41577 -16112 19443 21480 37651 64852 88915 75399 23799
6856 23799 42825 85967 74175 41386 36329 39477 39549 53197 46445 63311 31794 28705 45810
6843 45810 37183 -14869 -22751 -30969 5546 28361 1643 -20354 -64618 -43216 -41300 -36743 -48778
6830 -48778 -54477 -25784 6455 15683 -13245 -35234 -47394 -57809 -48332 -29487 -15904 -1632
6818 -1632 -30740 -45817 -42902 -12034 -16617 -53844 -48801 -29950 -73044 -90113 -42204 3942 -8421
6805 -8421 -26060 -28187 -10588 -8838 -22963 29833 47852 -11498 -30502 -7991 -3370 -34389 -38959
6792 -38959 -3559 13161 7420 5835 -1169 -18580 -11721 -59934 -62589 -44999 -31605 20923 47505
6779 47505 -9526 -23622 -41807 -61473 -47933 -44195 -41371 -49454 -51295 -22853 -14051 -34163 -31987
6766 -31987 8965 -1961 7283 45905 39891 11176 17879 -15761 -37137 -44393 -36606 -55372 -48237
6753 -48237 -29584 -11727 -3001 -2079 16285 -10645 -40453 -26956 -43961 -40736 -38554 15019 51770
6740 51770 57516 55410 60919 10882 11838 13633 13122 8886 -2537 1154 4011 -7177 -28668 -43726
6726 -43726 11264 28340 17226 19510 5172 -16680 -8108 -18239 -20441 25886 39678 21819
6714 21819 939 13561 43097 25331 27389 46957 50469 29904 26928 29822 24168 42794 29462
6701 29462 7111 -17395 -12405 -18083 -24556 -1239 -7292 -22298 5631 20730 21905 20427 -1849
6688 -1849 -32899 -61317 -37348 20640 40325 35172 21402 8568 -28284 -37719 -27004 -1040
6676 -1040 -5174 -30172 -57987 -52518 -38806 -52069 -7337 -4791 9802 2 -16347 -16336 -22015 -45953
6662 -45953 -54765 -20927 -16411 -62347 -84298 -43794 10822 18377 8853 12186 -5403 -50897 -58802
6649 -58802 -67042 -40104 6414 -22379 -40396 -44124 -59580 -60189 -8248 15929 -2386 -4224 -9300
6636 -9300 -4783 30588 33739 -33586 -45552 -41125 -8097 33927 5146 10964 19100 26071 -10660
6623 -10660 -31730 -53331 -67076 -62921 -13861 -1386 -15938 -17857 -26188 -25949 -7020 -6478 -39867
6610 -39867 -64133 -36423 -30285 -13353 -19782 8858 29037 33993 22389 43032 23386 35284
6598 35284 34169 23245 -4044 14852 40563 -6422 -7998 19630 20874 7070 -18731 -17695 -30636
6585 -30636 -49708 -46141 -14007 -7017 -16685 -47464 -34365 -3660 43172 44692 2943 -26939 -37363
6572 -37363 -8602 41399 35290 46255 36371 9782 13202 11883 15474 38964 21267 22176 1863
6559 1863 -32793 -51625 -36108 1267 45345 35358 450 22726 55362 65567 29022 -7886
6547 -7886 -26428 -30014 8711 16331 -13519 5533 3808 10206 21678 26100 -14683 -21480 15123
6534 15123 -11060 -20325 -4404 3340 222 -22169 -47685 -39855 -33426 -27970 -12989 -21572 -44421
6521 -44421 -58100 -35622 -32962 -44010 -54791 -19072 -7726 -3058 -515 -24983 -2117 41172
6509 41172 73754 37371 16638 27897 11131 12918 12540 14006 32998 41066 53185 63916 93210
6496 93210 95027 32930 776 20432 32112 62239 41631 1241 -22373 -24686 15865 15276 -9168
6483 -9168 3010 27829 65239 78268 70691 54037 8481 -33354 -32673 -2740 -1337 6559 8736
6470 8736 -5692 -27691 2964 38071 35287 42277 17116 -4153 4395 26321 52593 25369 -26070
6457 -26070 -36347 -46649 -52857 -23338 -18338 -11825 -27248 -50059 -62070 -61115 -77505 -48399 -66017
6444 -66017 -77968 -42442 -15135 -53383 -69636 -58552 -31560 3162 -10803 -54798 -47819 6231
6432 6231 56882 18767 2966 19407 52355 40112 -150 4897 -22568 -18682 -6694 16242
6420 16242 21788 9437 4392 -3976 20576 2795 -16128 -19935 30421 7489 -10996 -31442 -16485
6407 -16485 -35036 -40600 -61442 -18656 25535 -738 -25646 669 42024 78454 73165 63240
6395 63240 63887 36547 23505 33385 -16117 -24441 6243 11835 3237 14102 29716 13529 4509
6382 4509 -13149 -16412 305 -20723 -9229 49532 73946 74568 85660 51184 26262 13339 24534
6369 24534 7078 -3600 17618 44530 71023 41626 -7295 -38740 -34453 -29616 -11749 -1956
6357 -1956 1994 2407 -20656 5392 33293 21728 20225 9619 14419 8996 15959 56397 40944
6344 40944 6903 -5492 -8913 18873 22097 38411 62871 46953 26716 23552 48940 52302 36632
6331 36632 2255 9815 9398 13398 18259 245 -27548 -33331 -16006 -21653 17511 42266 11847
6318 11847 2875 42184 13697 -2098 5590 16359 10319 -9869 -47230 -69849 -58286 -45969
6306 -45969 2883 8543 -22488 -33806 -50470 -37655 -52120 -10677 -2292 -3389 13468 27198
6294 27198 18385 -9724 -20554 13020 5519 45803 20055 7675 29061 8299 -7204 17664
6282 17664 15275 7927 17972 7303 72 -16598 2378 13542 16160 4471 25646 27331 5923
6269 5923 12272 35391 9459 -7529 -2861 -12111 -21373 -41845 -36048 -27276 8268 57871 51513
6256 51513 43526 57341 33917 7703 -21894 -17359 29260 44207 23127 -8846 -7226 -10319 -18227
6243 -18227 -32527 -17831 -47500 -92289 -113444 -103154 -46105 -23628 -44829 -46012 -38251 -44249
6231 -44249 -23061 5157 5135 -19792 -37958 -48758 -52443 -49389 -20526 24935 2615 -30092 -35474
6218 -35474 -33620 -21038 -4710 18512 -18033 -74380 -85327 -110033 -113332 -59370 -246 35508
6206 35508 35697 23788 31074 55191 48025 18621 17938 4410 -18652 -25875 -25336 -28697 -983 -17212
6192 -17212 -35207 -4394 21224 26477 56573 20739 -388 -6944 -17780 -12034 -22437 -50732
6180 -50732 -25175 -14713 -15848 -40571 -58855 -72969 -49552 -49200 -65663 -57302 -56336 -13023 -20021
6167 -20021 -79850 -99458 -85458 -86455 -83278 -33770 -41075 -63026 -64301 -83357 -79005 -55186 -39802
6154 -39802 -56283 -41600 -20358 33206 46588 30264 44544 66832 88458 58592 39881 16824
6142 16824 35478 41116 24503 -17969 -16673 -13590 5526 -3249 -14453 18915 11433 7437 6184
6129 6184 -9808 -42232 -42098 -34687 -30748 -23358 4292 12890 -4467 -14723 -18781 -23865 -40655 -6452
6115 -6452 7625 -9894 -22439 -41949 -24646 4585 11831 24094 62408 47990 34718 7536
6103 7536 23024 30916 28501 12454 -9245 -18028 -19080 -6807 42126 33870 6162 8101 14320
6090 14320 21512 12614 -51076 -76200 -81759 -74894 -51387 -47405 -12099 14598 -6024 -5839 8944
6077 8944 7674 -30025 -52753 -53186 -66887 -57500 -30642 -26459 -20729 -43407 -41944 -9184 -45649
6064 -45649 -100126 -62016 -25894 -21930 -27948 -39422 -66505 -72683 -59234 -23775 22606 8424
6052 8424 -8123 9024 -5951 -44992 -30029 -18324 -47234 -59442 -49185 -39768 -11918 5365
6040 5365 -20659 -12321 -24907 -25494 -54858 -50086 -56765 -53963 -42860 -45279 -22309 -29438 -16552 35653
6026 35653 63194 52202 32240 29077 31499 32689 8601 -30016 -59893 -61403 -21881 -20706 -42556
6013 -42556 -24237 -21685 -21330 -32317 -27296 -36251 -24955 33502 56162 50873 22551 -9010 13020
6000 13020 9429 -15275 -63969 -42783 7301 17388 -14928 -58367 -51834 -15268 25117 -5309
5988 -5309 -7382 -4053 -27622 -39898 -17560 18172 33520 18386 -7412 -7715 -41345 -52495 -39817
5975 -39817 -19264 19356 15351 -39461 -47707 -32261 26125 37942 53569 57213 52932 26060 -8738
5962 -8738 -27554 -16398 -498 -5328 10661 19967 6101 -36114 -38751 8980 15996 -19753 -38744
5949 -38744 -31478 -1506 28443 5391 -10439 4299 -11608 -42368 -65571 -55587 -35496 -23513
5937 -23513 -30199 -57325 -67384 -49475 -25681 5234 29754 4723 6537 22303 37743 43411
5925 43411 27576 -4333 -16739 168 37886 34150 23125 -8576 -28314 -3854 -19605 -13504
5913 -13504 -9866 16036 17152 10736 -1507 -20732 -7931 4022 -17023 -34911 -62773 -62747 -51306
5900 -51306 -37462 -29857 -12518 -31739 -47572 -44052 -51279 -50823 -20900 31090 42192 46615 39775
5887 39775 9605 6865 36704 27751 -7699 -16315 3310 -4279 -32281 -14021 8231 -3535 -9047
5874 -9047 -2840 6874 -20808 -23203 -13388 -18492 -23883 -43645 9722 34890 67998 71475 33706
5861 33706 24573 28959 7725 -11307 -43549 -28342 -10539 -80 -36623 -80249 -90427 -52902
5849 -52902 -5615 -7169 -8322 -12878 -46067 -72120 -101977 -89747 -112599 -139305 -115797 -81989
5837 -81989 -27195 -5195 12066 28038 -2445 -41195 -58740 -58313 -48333 -33156 -55213 -70718
5825 -70718 -31340 20934 30459 30495 51217 21510 13877 -20576 -36786 -6355 22693 10359 -17825
5812 -17825 -21691 -7512 -27940 -47393 -43374 -33133 -21139 -20898 -22047 -68181 -84242 -45049 -30232
5799 -30232 -18322 -3621 23304 11064 7253 27358 25949 -7947 2366 14700 21814 -19169
5787 -19169 -32490 -15551 -6183 16373 7098 -51710 -92870 -82110 -56240 -28324 -17318 -20914
5775 -20914 -23353 -9956 -3413 8006 -9496 -38664 -37648 -38327 -15892 -5570 1359 -25811 -38164
5762 -38164 -32944 -51378 -38550 -7464 -20376 -33395 -36065 -23199 72 -23235 -44181 -60677
5750 -60677 -54416 -1139 44998 11821 1131 8376 30214 30101 16644 14903 12424 21999 42557
5737 42557 37354 32059 25737 21365 7781 3465 -3325 -37559 -38918 -39479 -39606 -17903 -22210 -27157
5723 -27157 -38273 -49282 -24345 -4769 25433 21958 -7904 -15888 -7263 1564 5408 -20303 -50406
5710 -50406 -32982 -24141 -11834 -10400 -47700 -38599 -17097 -31215 -29095 -26253 -6637 41682 61605
5697 61605 50502 6414 -10084 6541 -4002 -18477 -31732 -65065 -66828 -44274 -45666 3042
5685 3042 8252 -4986 -24435 -36325 -44132 -30000 -35697 -60688 -60159 -48031 -25452 -10959 -22739
5672 -22739 -15322 -16174 -27108 -17157 -6930 455 -22450 -21913 6558 15497 5616 13742 24562 17773
5658 17773 -2208 18340 29149 -1086 -31045 -5999 15942 12130 -46985 -35935 -9719 22897
5646 22897 15618 9584 -3920 72 -10738 -21620 -9654 11305 22692 14207 1801 23588 14341
5633 14341 -1642 18020 -15401 -34158 -43854 -61548 -70348 -48164 -24067 -33741 -34423 -32531 -14227
5620 -14227 -10515 -25729 -25979 -18119 -10155 -27295 -34906 -26497 -42904 -47020 -36853 -20345 -20981 -54761
5606 -54761 -47764 -63549 -45621 -29594 -23097 -8317 -10439 845 5722 17759 14322 -1031 -10595
5593 -10595 -9065 -7138 -23689 3763 -8602 -58327 -79654 -38764 -15155 17292 38335 20496
5581 20496 25715 10562 22347 42652 37648 16274 677 -1611 -21526 -14330 -40479 -66460 -52072
5568 -52072 -26853 24071 -1053 -29975 -23964 -24039 -22426 -42594 -42244 -49094 -49971 -49323 -56807 -34728
5554 -34728 -20268 14186 38210 27565 29614 33619 25172 41894 30863 18058 9047 4676 -1782
5541 -1782 -6533 -22325 -44978 -33393 -41037 -44768 -40063 -3692 14299 -5181 11607 31658 14413
5528 14413 -5893 -14542 -2783 22416 13214 7793 -25716 -20510 -17158 -18963 -41188 -51359 -49785
5515 -49785 -35330 -24206 -5416 -8731 -20413 -28099 -11086 -10158 6145 1520 -7195 -40987 -51500
5502 -51500 -15653 16402 12007 186 -15600 -22173 -49223 -37499 -44584 -52022 -28679 5878 -18191
5489 -18191 -40075 -29669 -14086 -5298 -30482 -85607 -87537 -67490 -54288 -51607 -39927 -48325 -51001
5476 -51001 -35450 -40173 -52733 -35701 -15172 -29115 -46538 -66259 -20729 -10515 7336 32019
5464 32019 37590 54301 30774 15959 -29317 -38551 -31402 -3390 13950 5679 -10709 17816 5007
5451 5007 -3648 20476 18896 24827 37297 -6531 -41590 -33160 -6237 869 -14470 -28071 -25647
5438 -25647 28385 42839 36910 40925 42393 34318 68360 99943 68621 11549 -5921 2802 -15615
5425 -15615 -34883 -13173 -9738 -20031 17756 48307 54986 48970 17999 10245 -6852 -15485 1162
5412 1162 -17967 -38802 -36631 -48706 -50529 -35695 -24590 -43393 -42738 -18870 -18398 -25750 -8551
5399 -8551 -21716 -19148 -18158 20738 -6963 -38963 -28978 744 6037 -16397 -41167 -35253 -36438
5386 -36438 -61237 -51483 -32200 -30689 -31385 21369 21877 -16336 -39503 -44762 -26801 -22982 -11810
5373 -11810 -21578 -2174 3461 27110 -3814 -21270 8652 21069 57807 68425 52979 19904
5361 19904 17064 44630 41341 16717 25492 22714 2158 21347 46770 72875 31715 -7669 8236
5348 8236 25300 12744 2605 -20039 -50923 -81903 -91725 -64638 -15667 5852 -17382 -56756
5336 -56756 -49877 -33035 -51503 -60815 -21158 10795 37484 34983 -1441 5182 18472 25097 -249
5323 -249 -25610 -56325 -26395 -11662 -8774 11035 33908 13141 -14036 -13016 -2350 1205 -7232
5310 -7232 8514 34468 -4748 -41834 -29925 -4648 -10656 -25528 -26 49421 45664 2311
5298 2311 -29762 -28406 -10155 13479 23710 3652 8035 15673 8258 17084 18324 19987 24055 14159
5284 14159 13443 2857 -1747 -21434 -23256 -29917 -38078 -59110 -44110 -36606 -52862 -71834 -47705
5271 -47705 11221 9009 31894 20039 8772 26509 5204 -14765 -8622 9810 -15392 5450
5259 5450 14238 11353 -24116 -40876 -43619 -11174 13368 37856 38831 27932 22750 31018 32600 12166
5245 12166 -26841 -27344 -9905 22949 23440 6600 12607 12681 -19373 -15957 -30775 -38058 -27331 -66448
5231 -66448 -72068 -28797 -29950 -46446 -33708 246 4596 -1165 -35385 -53406 -56515 -38272 -41330
5218 -41330 -34754 -26711 -15891 -504 20484 20024 45982 62122 62130 16019 -16896 -17481 17753 29051
5204 29051 8023 -9297 -15376 4205 -20608 -25172 -26197 -14234 11027 23150 -3576 -22476
5192 -22476 -4962 4947 21158 38975 36121 35120 21926 7257 -919 -4634 6182 19042 19675
5179 19675 16829 28803 34550 18828 -46793 -29481 4694 20908 1014 1162 20734 25373 24783
5166 24783 12351 14543 13917 171 1012 10773 -9084 -13346 11395 -14567 -5771 -3374 -1393 -19491
5152 -19491 -15030 -23727 -29903 -12473 14215 -2989 3671 -12638 -33922 -40347 -23924 -18830 -49780
5139 -49780 -30936 -16585 -7387 31486 39119 14085 9440 36243 24091 9732 -9564 -12542 -6155
5126 -6155 -18730 -2561 44325 74407 40199 -3213 -10354 -22375 -35829 -17207 1397 35042
5114 35042 56652 35812 -6078 -33753 -21669 33244 96100 96531 69073 77398 52832 -593
5102 -593 -32190 -32063 -5812 37483 32662 20730 37922 24383 -17918 -24609 -53386 -61554 -44443
5089 -44443 -4163 10833 -27192 -24453 -20234 -6047 -19835 -19681 -35464 -17788 -17023 -32174 1264
5076 1264 14662 -33605 -32011 17070 15408 30638 33061 12487 -7581 -23261 -12937 8719 29664
5063 29664 1024 -57517 -42005 -21529 -5154 21162 25991 7148 19120 33055 25220 18284
5051 18284 -23597 14397 55564 38070 18739 -11457 -44037 -49907 -59001 -43288 -380 6995
5039 6995 -7336 -10860 -14758 -20635 -28193 -49124 -51549 -38044 -41566 -40824 -58705 -46628 -34163 -12583
5025 -12583 -12390 -36211 -64187 -83282 -87100 -78566 -49509 -33880 -18358 -8617 -4753 -15969 -8117
5012 -8117 -22616 -12669 13143 21785 -23891 -48969 -35076 -47302 -27891 21312 -8304 -22239
5000 -22239 -37546 -39762 -35508 -22621 -23745 -41640 -42956 -26790 -33568 -23898 -9530 -1592 -7826
4987 -7826 -32527 -46665 -23251 -3683 17525 32704 10285 3279 4886 -2028 17624 12837 -20892
4974 -20892 -20730 -5792 3845 -1699 -24924 -40158 -19172 17244 15462 16291 5346 26304 45143
4961 45143 43873 28406 -32067 -78766 -67305 -11583 13055 26052 -3631 -38001 -32847 -40946
4949 -40946 -61125 -59580 -25676 16966 19037 11323 23593 51893 73034 71753 44199 -3995 -117
4936 -117 20013 44288 20485 33305 14667 -1830 -20785 -1494 22082 18613 -5472 -25823
4924 -25823 -12639 11418 19082 -5063 -39701 -65831 -65598 -54668 -17845 10205 5768 6124 -3459
4911 -3459 -14864 -17476 -39132 -35237 -17911 -15614 -28421 -47580 -48529 -16135 -23957 -63287 -50591
4898 -50591 -19999 -16555 -25033 -16937 -3469 -8142 -28357 -47144 -67129 -88947 -103741 -66773 -48703
4885 -48703 -33335 -36698 -3781 -12944 -39600 -42079 -23854 -50261 -38227 2950 -17694 -12216 13406
4872 13406 23252 29985 5576 -27459 -25054 -20516 11778 11837 -28569 -67565 -91524 -72922 -62478
4859 -62478 -65795 -23958 -7157 -8656 -23620 -39357 -49516 -55060 -20100 -14799 -46152 -46718 -5113
4846 -5113 24387 36775 11516 -10562 -21252 -4459 12159 4574 31579 8530 -42351 -55479
4834 -55479 -34943 -43169 -42589 -40656 -40830 -56442 -38764 -28428 -9558 -23723 -50655 -62247 -51217
4821 -51217 -49910 -40960 -2472 17851 8855 529 -15569 18145 -36755 -81956 -88906 -82672 -53193
4808 -53193 -2667 -25271 -31470 -23936 -11711 -19194 -6995 -4191 -9194 19056 25406 20932 20679 -3276
4794 -3276 -45598 -86578 -66131 -27578 -31631 712 11430 -22543 -42885 -22505 -181 4069
4782 4069 22908 21772 4862 -21297 9811 11676 -15113 -1389 19467 25562 24208 9493 -24267
4769 -24267 -26348 -17598 -2156 4002 6650 12263 27365 37220 -1513 6232 20196 13131 32591
4756 32591 28436 13422 -5856 -20341 -19242 7334 16516 -3471 -4280 12488 -2232 -13271 -5404
4743 -5404 -932 8246 49068 77405 39945 26642 3786 10131 35693 2351 -19170 -21623 -24584
4730 -24584 -21953 -25683 -6204 -21404 -29691 -58542 -40831 -26314 5688 17627 -5286 3756 -11386
4717 -11386 -8942 5497 -9747 -30451 -21646 22461 35658 50827 49800 35717 7752 -8642
4705 -8642 -5846 17048 26329 -2111 271 31688 15687 6465 2912 -18138 -24172 -33167 -31051 -14537
4691 -14537 -17471 -55825 -60650 -32318 -41855 -63079 -44778 -44112 -22379 3246 21953 -8877 -57072
4678 -57072 -62124 -50910 -46983 -49839 -50012 -48835 -10605 -18094 23861 37997 44260 27825 -6764
4665 -6764 -16081 -29584 -4099 19935 27965 19950 5228 30970 44453 3973 -53975 -60239 -37065
4652 -37065 -28305 -51664 -64761 -47431 -41006 7141 44733 25063 26376 -2098 28590 34449 -28807
4639 -28807 -4655 26249 20566 52001 49066 36307 20302 54698 32725 10464 26332 18198
4627 18198 28012 61644 57616 48250 21606 5396 11441 14580 30405 47210 17262 -24193 -12557
4614 -12557 -26531 -40475 -14627 18589 14345 597 -13974 -28681 -18905 5673 11115 -4801
4602 -4801 -13474 1601 5443 9581 -21544 -21671 -32185 -58357 -54241 -54376 -38609 -58893 -43252 -21588
4588 -21588 -4825 25474 19862 79 5946 14563 2136 -24331 -2150 -29560 -24045 -22474 -30164
4575 -30164 -20468 -249 27371 28938 -1058 9872 -26393 -30218 -12380 4213 9584 22983 -2132
4562 -2132 -21346 -20733 -7591 10585 37536 38653 40292 25149 -8185 4452 -15193 -18575 -32353
4549 -32353 -23430 2342 23398 -5860 -16578 -30242 -20859 -26405 -21299 -24167 11507 29742 12142
4536 12142 4352 -819 -17148 21652 60621 68896 52212 30945 39676 18592 -4668 110 7930
4523 7930 -36191 -33450 -58364 -72199 -50041 -64580 -47128 -22627 -28468 -60644 -64050 -26903 -13002
4510 -13002 25778 34379 26952 -3142 -16479 311 -1246 21246 21683 19469 26268 54966 56174
4497 56174 34700 13547 2993 -13187 -10499 -17977 -29721 -28327 -35727 -42954 -37790 2959 -3377
4484 -3377 -10681 8552 2990 -4922 -13535 -7896 18197 59245 79072 95090 83381 22821 98
4471 98 32509 53985 58241 41866 23175 17446 -4705 -36982 -51703 -18980 30680 35213 42977
4458 42977 23379 21357 44011 36741 25200 11234 -27625 -18864 19615 25615 5468 -5498 -9787
4445 -9787 -45887 -74025 -62961 -21121 6579 18554 17590 -6624 -23917 -30861 -41339 -25259 -17235
4432 -17235 -49012 -46106 -25738 -15275 -27372 -8635 21222 10299 -15067 -24455 -39119 -48907
4420 -48907 -31930 -24466 -25632 25949 23370 9358 22239 12389 -7068 -8448 -27291 -39732 -40987
4407 -40987 -48059 -7769 24652 38789 24701 33279 31467 22686 38490 21368 8538 -13950 -31913
4394 -31913 -33564 -25132 -116 7659 17501 14562 19808 43633 65649 60221 60293 47501 13332 -32249
4380 -32249 -38093 -12459 8758 15971 13335 -15191 -26393 -22654 3093 1840 -511 44431 57918
4367 57918 54163 38497 18113 5866 -10310 -21113 -32370 -14543 -47680 -42226 -21412 -22578
4355 -22578 -45675 -26240 740 6023 -13310 -11939 18479 45970 42603 17340 3296 -23110
4343 -23110 -32242 -22363 -39053 -68488 -76768 -79953 -75295 -38347 -17811 -4388 7425 -8705 -41478
4330 -41478 -14358 23942 18397 18744 27317 32590 40018 68019 45240 -6139 1165 4329 8439 -17294
4316 -17294 -1181 -13615 -46266 -54020 -35939 -12238 86 -6516 5248 13407 2035 -43493
4304 -43493 -39003 -45411 -11933 -20839 -16245 -11044 -2450 13718 45160 9371 11382 27851 4899
4291 4899 -23787 -17836 -12996 -16712 -19954 -2028 23856 23975 30506 34233 21825 -3271 -28502 -49233
4277 -49233 -43406 -21594 -14340 -33362 -31964 -37492 -38470 5407 -7796 -7740 -5238 -303 -17458 -24284
4263 -24284 -18106 758 15515 -26239 -45909 -53620 -57121 -29725 -43180 -41176 -25971 -2633 -7250
4250 -7250 -4964 -9340 15343 12199 -11926 -396 -10552 -2550 -33480 -31946 -28787 -3933 8780
4237 8780 -19854 -34875 -51399 -15441 19274 38202 22446 -5387 -10759 11221 5331 -19451
4225 -19451 -14803 8392 14646 30981 30067 -4064 -47763 -43785 -27941 -7954 -2972 -26239 -45658
4212 -45658 -47268 -44349 -20356 -20680 -15433 -41404 -73228 -84750 -65778 -67182 -44482 -17063 -28578
4199 -28578 -21791 -26365 -37960 -26211 5595 21833 33871 45391 -4372 -25132 1726 39235
4187 39235 38016 29259 15303 30549 35344 39886 49063 29006 28303 30986 -2135 -19296 -27471 -55675
4173 -55675 -33479 1436 35544 19136 -814 -23305 3358 12457 -3992 10632 34065 23623
4161 23623 -2227 -7167 28380 42650 -14725 -14419 2686 14268 51707 20833 4047 15072
4149 15072 -33543 -28882 14404 19014 18819 6515 25843 3830 -1123 6558 23904 31284 43899
4136 43899 72558 92062 73289 55805 22396 -20230 -26935 3260 14193 -22694 -48504 -40360
4124 -40360 -27510 -25935 -7323 -6209 -14375 -14072 -10566 -24906 -15312 -2497 -12739 -12624 -16627 -28380
4110 -28380 -37697 -24378 -20106 -46656 7856 34561 33492 6443 -17716 -28924 -31228 -21847 -31089
4097 -31089 -5683 27900 17270 21757 17805 13979 -7219 -17578 -15961 -14109 18043 21041 10565
4084 10565 16754 1510 5193 -35666 -49392 -18552 -17674 -13137 -9243 5992 21773 -10051 17999
4071 17999 7913 -31363 -36366 2608 10062 10501 11535 -4371 -3904 -16843 -38905 -24339 -45077
4058 -45077 -59988 -51108 -41658 -57794 -49337 7395 20794 -12605 -4281 16028 -11872 -24139 -9520
4045 -9520 21483 32214 17549 21331 12838 21310 14840 14186 50140 74079 72480 52951 42755
4032 42755 16845 11524 7951 -11248 -14989 -8203 -36203 -36728 -43823 -68573 -89432 -118399 -76813
4019 -76813 -56616 -89913 -88081 -41196 -6341 -2193 29889 45937 32935 31293 27172 10259 -1399
4006 -1399 1326 26433 23975 19284 2021 2284 299 -11866 -6096 22643 24856 11318 -10629 -24648
3992 -24648 -22098 10760 17982 11053 6493 17864 8511 -2824 -20895 -28556 -18024 -12089 -32178
3979 -32178 -48421 -76795 -91472 -76469 -34628 -51825 -59980 -59108 -27223 6343 5552 22855 9973
3966 9973 11420 6768 -7238 1562 47702 48241 15604 850 -40190 -67962 -47311 -22213 1585
3953 1585 -10325 18426 28101 -16551 -26322 -46193 -15634 26051 -27587 -31827 -27217 -18811 -22942
3940 -22942 -47775 -29572 5220 18160 -16641 -14783 11069 -7083 -46382 -55134 -34598 -798
3928 -798 -18079 -42872 -16061 -8424 -18782 -39737 -43825 -19568 11887 18161 25108 17495 9055
3915 9055 13256 2510 28821 34142 -10376 -33455 7698 32788 2927 -10915 -20896 -11803 -21240
3902 -21240 -43336 -45183 -30096 -48438 -71901 -82632 -65232 -55396 -19048 -8550 -7810 27528 36788
3889 36788 52924 62570 44762 14011 -16846 -69175 -64771 -72844 -89787 -93861 -78787 -77186 -56266
3876 -56266 -19443 -2098 -35059 -43621 -9882 4625 13289 -1998 -40133 -21562 -16556 13885
3864 13885 12036 6485 -17052 -29017 -2239 1258 -1885 2563 -5994 28298 22231 18629 23981 31622
3850 31622 18126 9265 -4868 -191 4238 40462 35239 61618 84284 65793 22579 -11008 14840
3837 14840 30234 28384 26267 56333 28511 -16029 -67657 -93269 -70468 -21726 -5588 12476
3825 12476 6829 -17017 -46690 -41406 -27372 -27427 -29860 -32112 -12153 4133 -2112 32382 47226
3812 47226 45866 28979 -1337 -27166 -17818 -927 6213 11314 5540 -32198 -41424 -62 -16410
3799 -16410 -50903 -54592 -21340 18982 45807 39693 23953 43240 44465 36548 39157 28164 40180
3786 40180 7467 -19900 -53648 -49915 -35708 -19616 4686 26525 8640 10854 42582 25118
3774 25118 2712 -24072 -57154 -54993 -76055 -62851 -1862 3608 -24530 -47876 -22989 -11792
3762 -11792 -16853 2348 22748 18875 42874 38683 1882 -30997 -7543 26975 14530 -12648
3750 -12648 -17261 -22262 -60573 -70304 -30941 -28703 -20702 19509 4595 -12050 -15278 -37580 -40451
3737 -40451 -33662 -46904 -60217 -64693 -63451 -43628 11684 22206 10200 8861 4509 7374 12624
3724 12624 -19511 -29624 -28792 -6320 7649 -2279 -386 9407 14204 28433 23010 12897 12066 14993
3710 14993 15665 22329 -5973 -37771 -46291 -27161 -20572 7145 5305 19106 -6596 -31139 -18302
3697 -18302 6763 -43115 -49133 -69337 -51896 -49826 -55508 -12069 12753 -7508 -9863 -30655 -38532
3684 -38532 1406 38151 65195 70486 45415 27118 41923 51753 47420 29556 53449 52101 22308
3671 22308 -1066 820 65211 66793 30347 22578 33111 45262 49421 12492 -520 26945 48733
3658 48733 33645 14641 2325 -9300 -14205 -50971 -27326 4643 15553 23988 20585 25984 32276
3645 32276 -314 -12342 1541 19673 21620 63831 65304 41001 20376 32164 54082 34206
3633 34206 41668 36410 41166 51378 54156 27199 367 -39323 -45762 -29894 -30028 -15478 -8461
3620 -8461 -29952 -59627 -38206 -52944 -13474 4859 -42207 -37704 -21438 -16528 -29250 2665
3608 2665 26077 28784 41764 13441 35868 31880 20492 15622 -16640 -20638 21408 33413 21745
3595 21745 12065 -2876 -8722 -16927 -8794 -21732 -31054 -56615 -44135 -40256 -43844 -48426 -71831
3582 -71831 -93787 -34644 28453 27287 15514 35503 18681 17169 -10748 -27987 -11199 4874
3570 4874 25600 25255 6108 27910 29563 26259 -28704 -29239 436 -2670 520 23506 32621 1331
3556 1331 -7576 3055 34903 59651 10904 -27893 -14014 -7019 -11061 1407 12455 -9453 -14389
3543 -14389 -44753 -22921 -6981 12405 -4438 -34096 -29471 -21792 -4366 49048 82943 63508
3531 63508 40602 51119 33137 48448 48289 54040 24669 3500 9549 11295 22950 34894 6433
3518 6433 16927 41433 43834 -7497 -25421 -14260 -7450 -18536 -48287 -32740 -24432 -9580 -7240
3505 -7240 6219 23600 31853 -4246 -17196 11258 17763 -730 12925 19676 32686 -2010 -10440
3492 -10440 12551 30963 2392 26820 29938 17861 3571 -5949 -832 -32635 -21322 -6663
3480 -6663 -10157 -13639 -1094 13184 -8933 -13475 16425 46126 42565 53590 44514 49140 15311
3467 15311 2540 -22866 -31959 -4535 51289 70451 64313 66343 85268 94708 69889 29769 -3892
3454 -3892 -17510 -387 601 -6184 -7756 19899 3204 216 11639 -1838 -28363 -41530 -41422
3441 -41422 -25792 -22271 -28175 -54971 -35927 -26305 -23659 -25197 -4594 -15198 15945 46442 80811
3428 80811 57796 6122 -6325 26820 48399 13445 -10435 13920 38868 27784 -49252 -61371
3416 -61371 -31944 -1745 10028 37217 65341 68692 15116 4058 34532 20427 21952 33493
3404 33493 44964 20455 -41945 -62936 -33744 -6952 8994 2962 13662 17741 3275 1384
3392 1384 26072 24977 20619 9047 4278 -27546 -40736 -34285 -54969 -48879 -25747 -1017 14240
3379 14240 34029 26517 23006 34956 6276 -31763 -11313 33712 41871 30999 48539 46065 32140
3366 32140 20752 -31893 -53864 -71781 -55284 -38602 -23886 -70939 -91441 -80074 -64028 -25438
3354 -25438 -29313 -12030 -55307 -30925 -40010 -54109 -46808 -38388 -32242 -45599 -22011 -30531 -41416
3341 -41416 -36188 -36124 -24596 -28260 -6663 18085 -4199 -37600 -40971 -37699 -23003 -49641 -89513
3328 -89513 -107500 -78314 -40223 -28122 7408 -12236 -22212 -22061 -41835 -31287 -4885 -14315 -31418
3315 -31418 -37914 -48076 -55639 -46439 -44884 -15358 2437 -17510 -26772 -12634 -7177 -44629 -38403
3302 -38403 -31293 -11441 17521 20610 7128 5741 -6997 6438 10475 30948 37570 44514 11922
3289 11922 16681 26519 35003 20528 13049 40665 23102 2589 11814 6085 7471 749 9448 24567
3275 24567 3200 -4571 6686 12171 29556 46313 26118 -7035 -11459 48181 40441 15290 -7805
3262 -7805 -23282 -39471 -35638 15429 14179 13283 -820 -30803 -75270 -124043 -112879 -68069 -78837
3249 -78837 -59724 -69547 -44400 -57526 -42401 -1886 23761 33198 30022 -20255 -60151 -51831 -49701
3236 -49701 -20925 -33285 -42988 -45216 -13018 -8949 -5351 -2898 -36235 -33331 -11491 -2686 -28185
3223 -28185 -56608 -25540 31555 33681 31496 39281 18376 -33832 -11195 -4703 -5242 -38990 -28877
3210 -28877 1301 25562 -14360 -28639 -9549 -12648 4525 51813 41607 7220 1622 -6818
3198 -6818 -5701 27656 35502 32302 15331 4384 901 -12439 -3589 20062 13035 34813 9860
3185 9860 -38172 -67753 -37085 -29288 6560 49280 50794 39682 -4990 -39959 -50129 -39832
3173 -39832 -49568 -50046 -51031 -71209 -55946 -30737 -18732 12018 -1243 -11176 -6937 -13325 -9114 -35000
3159 -35000 -40694 -4459 15121 31548 10283 -30733 -34611 -50485 -35573 -27423 -42982 -55972
3147 -55972 -47997 -36754 -36527 -40993 -32328 -24238 -34854 -42338 -51700 -21611 12611 18479 44686 20508
3133 20508 19252 11471 9035 3674 30475 12124 16514 39238 18356 16994 29406 33046 20146
3120 20146 -2467 1172 22634 5821 -31138 -66929 -91254 -46838 7917 5756 7693 717 10024
3107 10024 -11364 -9073 -9839 -30323 -30826 -14603 -668 -23462 -23031 -14375 -17245 3618 21775 24947
3093 24947 49070 52939 24479 13247 18946 29133 30401 10620 -16697 2974 36824 72297
3081 72297 63185 34167 12619 -9826 -32097 -21308 -11387 -21168 -30185 -29616 -14497 9062 4782
3068 4782 -22169 -34024 -46163 -72286 -57319 -68440 -49157 -41669 -38771 -16128 -8926 7845 1700
3055 1700 10219 -8080 6810 21040 23130 -5858 4206 25085 59634 50543 22634 23666 -4256
3042 -4256 -16861 -10688 15297 50124 56397 27779 5175 11635 6368 15485 9316 25177 21951
3029 21951 202 -17337 -18018 -16764 -7805 -29143 -46040 -66882 -59807 -7072 -5277 -7986 -2692
3016 -2692 -35285 -33326 -22094 -8209 -15021 -16696 2791 32386 48198 46573 32737 17103 10055
3003 10055 -11265 -6212 -22337 -30167 -12318 7184 -3768 8446 39580 51356 45754 41087 69003
2990 69003 98748 81795 52221 16178 -48313 -64653 -37027 -29733 -19714 -32729 -38990 -12815
2978 -12815 10751 35372 37556 36467 14808 22585 17702 6492 -23871 -9957 -8832 -10337 3748
2965 3748 53046 74896 81171 44226 16135 11932 10117 29299 25849 16597 3433 9552 -14308
2952 -14308 -53778 -38470 -44559 -38654 -22639 -38876 -21612 1175 7055 22217 38037 10754
2940 10754 -13114 -15946 -23718 -35034 -2488 69022 83133 42462 46230 53749 69672 91032 110086
2927 110086 88131 73907 73056 38138 29341 11220 -3184 13313 35850 21523 9387 -2227
2915 -2227 -24610 22662 68411 63291 59006 65989 90003 116804 93479 14685 -44249 -39385 15524
2902 15524 60173 55398 28618 11149 -10088 -35678 -22935 6188 16544 24150 33269 39748 22910
2889 22910 9673 -12304 -31149 -33495 -26098 -25487 -55158 -44783 -30828 -6732 -33969 -34281 -19683
2876 -19683 -13663 -21048 -8106 -13223 -14094 -39128 -17497 34688 48065 78480 56686 11330 -9516
2863 -9516 -7994 19000 36902 31629 68575 99072 84472 43856 52103 45832 26712 11477 9788
2850 9788 4363 -23282 799 9798 3336 15029 6547 2462 15140 -21020 -9024 3392 -46113
2837 -46113 -48908 -6070 47508 67500 60404 59024 59564 43109 24271 41839 24202 38733 65206
2824 65206 82113 79937 61175 26182 32737 12677 -5731 -16323 -14461 -2289 8485 -13202
2812 -13202 -49967 1647 29006 23672 27871 25519 -3580 -24349 -46435 -62884 -74793 -30101
2800 -30101 17336 -16948 -28894 561 20751 4210 7208 18569 10070 -4364 38594 38422 15820
2787 15820 7464 13193 21367 11539 -10660 -26515 -32031 -66652 -77686 -39480 -25813 -12361 41901
2774 41901 42789 47857 38321 35559 12766 -15518 -47940 -49556 -45403 -31844 9937 2630 -25412
2761 -25412 -19756 26445 2701 1890 -5270 35109 41776 24405 26302 35887 12301 4841 -30851
2748 -30851 -70710 -70558 -67964 -55156 -29724 -43980 -55302 -51965 -40622 -9558 -6838 18486 24933
2735 24933 37175 38452 41236 54914 58286 54281 38845 25246 28024 21542 5308 23896 30000
2722 30000 10665 32561 21057 -8489 29680 53123 67186 54378 61808 48387 35307 22071
2710 22071 -12051 2927 6857 -11588 -13913 -13933 23289 8255 -19992 -36826 -29628 4672 12305
2697 12305 14619 -3305 -14873 -25437 906 2871 39669 71296 79795 70140 56653 42406 -5065
2684 -5065 -36457 11840 -1858 -13311 -19783 -43447 -51832 -25699 -19210 -6656 -1232 -10086 2355
2671 2355 -895 -2246 -281 -7398 -35592 -42771 -33793 -22158 -16745 -18881 19341 9160 6124 7824
2657 7824 -32226 -18678 -12636 24511 45689 44978 41790 9705 -17710 3468 33426 38846 44851
2644 44851 45601 51234 27541 43856 46418 19263 10805 -18 25412 40610 25067 34565 59123
2631 59123 38378 29500 27137 39201 53066 36893 3096 -11827 -11114 20523 35987 22501 23056
2618 23056 58320 65745 64110 78571 55561 11254 26485 61750 72958 39064 11359 -2457
2606 -2457 -9741 -15543 -37522 -44891 -37437 -23741 -59543 -47891 8062 33229 53158 35478 11471
2593 11471 6830 -8458 359 -804 -35875 -54375 -59355 -39205 2934 29212 66591 64201 25133
2580 25133 20416 31478 70849 67302 43977 26254 27517 23489 9917 30521 19546 30563 17150
2567 17150 -27391 -27110 -20540 -28602 -32380 -3917 -8524 -15091 -10662 -52002 -49484 -33438 -8474 10948
2553 10948 -22995 -27296 -23960 10599 9824 -11105 -43471 -23098 1816 -27790 -73296 -63692 -21786
2540 -21786 4990 15143 -5 33058 38875 -638 -38711 -63440 -82821 -71287 -39475 -46057
$$ [...]
##END NTUPLES=NMR SPECTRUM
##END=
