##TITLE=Analysis number 323523
Compound Code mo 07995
Book Reference a
Project Code adrs
Chemist Name ians
##JCAMPDX= 6.0         $$ Bruker NMR JCAMP-DX V2.0
##DATA TYPE= NMR SPECTRUM
##DATA CLASS= NTUPLES
##ORIGIN= Bruker BioSpin GmbH
##OWNER= nmr
$$ XWIN-NMR		Version 3.5
$$ Thu Oct 26 11:04:58 2006 GMT Daylight Time (UT+1h)  MAYBRIDGE\nmr@NMR_250MHZ
##.OBSERVE FREQUENCY= 250.131544655141
##.OBSERVE NUCLEUS= ^1H
##.ACQUISITION MODE= SIMULTANEOUS (DQD)
##.ACQUISITION SCHEME= undefined
##.AVERAGES= 16
##.DIGITISER RES= 18
##SPECTROMETER/DATA SYSTEM= dpx250
##.PULSE SEQUENCE= zg30
##.SOLVENT NAME= DMSO
##.SHIFT REFERENCE= (INTERNAL, DMSO, 0, 16.522)
##AUDIT TRAIL= $$ (NUMBER, WHEN, WHO, WHERE, WHAT)
$$ ##TITLE= Audit trail, XWIN-NMR		Version 3.5
$$ ##JCAMPDX= 5.01
$$ ##ORIGIN= Bruker BioSpin GmbH
$$ ##OWNER= nmr
$$ C:\u/data/dgb/nmr/ADRS/1770/pdata/1/auditp.txt
$$ ##AUDIT TRAIL=  $$ (NUMBER, WHEN, WHO, WHERE, WHAT)
(   1,<2006-10-26 11:04:29.68 +100>,<MAYBRIDGE\nmr>,<NMR_250MHZ>,
      <created by zg, POWCHK disabled, PULCHK disabled
       configuration hash MD5:
       49 4B E0 1D 92 C2 6B 37 9F E6 65 BC 52 41 86 1D
       data hash MD5: 64K
       1D 22 EE C5 97 E5 B7 80 8C 21 4A F1 FE 43 76 0C>)
(   2,<2006-10-26 11:04:47.76 +100>,<MAYBRIDGE\nmr>,<NMR_250MHZ>,
      <Start of raw data processing
       ef LB = 0.3 FT_mod = 6 PKNL = 1 SI = 32K 
       data hash MD5: 32K
       EF 1D DC F8 84 D6 2E 3A B6 6A 4B 46 91 22 C5 53>)
(   3,<2006-10-26 11:04:49.70 +100>,<MAYBRIDGE\nmr>,<NMR_250MHZ>,
      <apk 
       data hash MD5: 32K
       97 94 A8 AF 5C FF 9A C3 78 AD EA 3D 13 FA 08 67>)
(   4,<2006-10-26 11:04:50.53 +100>,<MAYBRIDGE\nmr>,<NMR_250MHZ>,
      <abs ABSG = 5 
       data hash MD5: 32K
       FD 79 1C 73 48 A3 C9 23 71 9F 9E 75 F3 EF 0C D5>)
$$ ##END=
$$ 
$$ hash MD5
$$ 72 19 E6 3A A2 F4 7F 70 0F FB BC 65 0B 83 ED 29
##$RELAX= 
##$RELAX= 
##$RELAX= 
##$RELAX= 
##$RELAX= 
##$RELAX= 
##$RELAX= 
$$ Bruker specific parameters
$$ --------------------------
##$DU= <C:\u>
##$EXPNO= 1770
##$NAME= <ADRS>
##$PROCNO= 1
##$TYPE= <nmr>
##$USER= <dgb>
##$AMP= (0..31)
100 100 100 100 100 100 100 100 100 100 100 100 100 100 100 100 100 100 
100 100 100 100 100 100 100 100 100 100 100 100 100 100 
##$AQSEQ= 0
##$AQ_mod= 3
##$AUNM= <au_zg>
##$AUTOPOS= <19 >
##$BF1= 250.13
##$BF2= 250.13
##$BF3= 250.13
##$BF4= 250.13
##$BF5= 500.13
##$BF6= 500.13
##$BF7= 500.13
##$BF8= 500.13
##$BYTORDA= 1
##$CFDGTYP= 0
##$CFRGTYP= 5
##$CHEMSTR= <none>
##$CNST= (0..31)
1 1 145 1 1 1 1 1 1 1 1 1 1 1 1 1 1 1 1 1 1 1 1 1 1 1 1 1 1 1 1 1 
##$CPDPRG= <>
##$CPDPRG1= <>
##$CPDPRG2= <>
##$CPDPRG3= <>
##$CPDPRG4= <mlev>
##$CPDPRG5= <mlev>
##$CPDPRG6= <mlev>
##$CPDPRG7= <mlev>
##$CPDPRG8= <mlev>
##$CPDPRGB= <>
##$CPDPRGT= <>
##$D= (0..31)
0 1 0 0 0 0 0 0 0 0.06 0 0 0 0 0 0 0.0002 0 0 0 0 0 0 0 0 0 0 0 0 0 0 
0 
##$DATE= 1161857068
##$DBL= (0..7)
120 120 120 120 120 120 120 120 
##$DBP= (0..7)
150 150 150 150 150 150 150 150 
##$DBP07= 0
##$DBPNAM0= <>
##$DBPNAM1= <>
##$DBPNAM2= <>
$$ [...]
##$SUBNAM7= <"">
##$SUBNAM8= <"">
##$SUBNAM9= <"">
##$SW= 20.6930455092707
##$SWIBOX= (0..15)
0 0 3 0 0 0 0 0 0 0 0 0 0 0 0 0 
##$SW_h= 5175.983436853
##$TD= 65536
##$TD0= 1
##$TE= 683.16
##$TE2= 300
##$TE3= 300
##$TEG= 300
##$TL= (0..7)
0 120 120 120 120 120 120 120 
##$TP= (0..7)
150 150 150 150 150 150 150 150 
##$TP07= 0
##$TPNAME0= <>
##$TPNAME1= <>
##$TPNAME2= <>
##$TPNAME3= <>
##$TPNAME4= <>
##$TPNAME5= <>
##$TPNAME6= <>
##$TPNAME7= <>
##$TPOAL= (0..7)
0.5 0.5 0.5 0.5 0.5 0.5 0.5 0.5 
##$TPOFFS= (0..7)
0 0 0 0 0 0 0 0 
##$TUNHIN= 0
##$TUNHOUT= 0
##$TUNXOUT= 0
##$USERA1= <user>
##$USERA2= <user>
##$USERA3= <user>
##$USERA4= <user>
##$USERA5= <user>
##$V9= 5
##$VALIST= <valist>
##$VCLIST= <CCCCCCCCCCCCCCC>
##$VD= 0
##$VDLIST= <DDDDDDDDDDDDDDD>
##$VPLIST= <PPPPPPPPPPPPPPP>
##$VTLIST= <TTTTTTTTTTTTTTT>
##$WBST= 1024
##$WBSW= 4
##$XGAIN= (0..3)
0 0 0 0 
##$XL= 0
##$YL= 0
##$YMAX_a= 458323
##$YMIN_a= -443285
##$ZGOPTNS= <>
##$ZL1= 120
##$ZL2= 120
##$ZL3= 120
##$ZL4= 120
##$ABSF1= 16.522
##$ABSF2= -4.171173
##$ABSG= 5
##$ABSL= 3
##$ALPHA= 0
##$AQORDER= 0
##$ASSFAC= 0
##$ASSFACI= 0
##$ASSFACX= 0
##$ASSWID= 0
##$AUNMP= <proc_1d>
##$AZFE= 0.1
##$AZFW= 0.1
##$BCFW= 0
##$BC_mod= 0
##$BYTORDP= 0
##$COROFFS= 0
##$CY= 12.5
##$DATMOD= 1
##$DC= 0
##$DFILT= <>
##$DTYPP= 0
##$F1P= 14.0000005364418
##$F2P= -0.99999901652339
##$FCOR= 0.5
##$FTSIZE= 32768
##$FT_mod= 6
##$GAMMA= 0
##$GB= 0
##$INTBC= 1
##$INTSCL= 1
##$ISEN= 128
##$LB= 0.3
##$LEV0= 0
##$LPBIN= 0
##$MAXI= 10000
##$MC2= 0
##$MEAN= 0
##$ME_mod= 0
##$MI= 0
##$NCOEF= 0
##$NC_proc= -4
##$NLEV= 6
##$NOISF1= 0
##$NOISF2= 0
##$NSP= 0
##$NTH_PI= 0
##$NZP= 0
##$OFFSET= 16.522
##$PC= 1
##$PHC0= -46.82983
##$PHC1= 3.054668
##$PH_mod= 1
##$PKNL= yes
##$PPARMOD= 0
##$PSCAL= 4
##$PSIGN= 0
##$REVERSE= no
##$SF= 250.13
##$SI= 32768
##$SIGF1= 0
##$SIGF2= 0
##$SINO= 400
##$SIOLD= 32768
##$SREGLST= <1H.DMSO>
##$SSB= 0
##$STSI= 32768
##$STSR= 0
##$SW_p= 5175.98343685301
##$SYMM= 0
##$S_DEV= 0
##$TDeff= 65536
##$TDoff= 0
##$TI= <Analysis number 999999
Compound Code 99
Book Reference 9
Project Code 9>
##$TILT= no
##$TM1= 0
##$TM2= 0
##$TOPLEV= 0
##$USERP1= <user>
##$USERP2= <user>
##$USERP3= <user>
##$USERP4= <user>
##$USERP5= <user>
##$WDW= 1
##$XDIM= 32768
##$YMAX_p= 438960741
##$YMIN_p= -501548
$$ End of Bruker specific parameters
$$ ---------------------------------
##NTUPLES= NMR SPECTRUM
##VAR_NAME=  FREQUENCY,     SPECTRUM/REAL,   SPECTRUM/IMAG
##SYMBOL=    X,             R,               I
##VAR_TYPE=  INDEPENDENT,   DEPENDENT,       DEPENDENT
##VAR_FORM=  AFFN,          ASDF,            ASDF
##VAR_DIM=   32768,         32768,           32768
##UNITS=     HZ,            ARBITRARY UNITS, ARBITRARY UNITS
##FACTOR=    0.157963299565203, 1,           1
##FIRST=     4132.6476996994, 0,             0
##LAST=      -1043.33573715361, 0,           0
##MIN=       -1043.33573715361, -501548,     0
##MAX=       4132.6476996994, 438960741,     0
$$ Real data points
##PAGE= N=1
##DATA TABLE= (X++(R..R)), XYDATA
$$ [...]
17381C95362L3703p3062L5820n4550k2255K3122n2192k7005j7465J11107J02987
17370D55572K2118M3446L5030r5073k0800J25794M3229Q224n9366r6855n880n5973
17358C99466j7203J3950j15581p5351J0650M3699p8691m445R7750m4554K5423
17347B55113n6915k04297k8961J42392Q1357O3539Q9195o5908m424n1683m9531
17336A69877P3411M9567m5929M9320R654O9427l2528N3227L5242j08323k7803
17325B95142M0818J12192L0010k8234j09906j78978j43715J74824Q3586O444l8897
17314B43286M5496J22411J5058k6584n8223K6220Q8827l2168J1793j02307j74603
17303A59206n8669O5038M7584j9534J5594p5122J68050R6561P4321L964n7988
$$ plain form
17381 395362 429065 356003 391823 337273 315018 338140 285948 258943 241478 352585 455572
17370 455572 477690 521136 556166 461093 440293 566087 609316 617540 558174 461319 455439 399466
17358 399466 382263 396213 280632 205281 215931 259630 180939 176494 274244 229690 255113
17347 255113 198198 -6099 -35060 107332 188689 252228 341423 275515 271091 219408 169877
17336 169877 243288 292855 246926 296246 305900 375327 342799 396026 431268 322945 295142
17325 295142 335960 448152 478162 449928 340022 161044 17329 192153 275739 282183 243286
17314 243286 288782 411193 426251 399667 341444 367664 456491 424323 436116 333809 159206
17303 159206 100537 165575 213159 193625 209219 134097 302147 398708 473029 476993 419005
17292D19005j06092J56884J03681q1076r6743q2015M400J8417O736j4168o6744
17281B62285K5543l6092p8458m2413O8767J60210k081p6767N917Q4054M9871O8847
17269D89683j02942j61352M997j00008M0811J43885m3880j4765N3733M8822n6582
17258C02402J7077L1593l0123p2376k0908p747q2935o7033J4222L1339O0445J0733
17246A86689k6925m6715m8164k7726j19010Q132J9243K4185M3684n9114J39565
17235I3844K08887R8124j9173o3219l4963k01737m6071j1870J68479J01212l0830
17224B62683N9028R1016M6244j02883o6176l9972p8071J894j9128o249q9810k2390
17212C6186P3509q070q279M6732J27289P2696K321j30060j70376r8546J83226
$$ plain form
17292 419005 312913 469797 573478 492402 395659 313644 318044 336461 343197 329029 262285
17281 262285 287828 251736 173278 130865 199632 359842 357761 280994 286911 370965 420836 489683
17269 489683 386741 225389 230386 130378 171189 315074 271194 256429 310162 358984 302402
17258 302402 319479 351072 320949 248573 227665 219918 136983 69950 84172 115511 175956 186689
17246 186689 159764 113049 64885 37159 -81851 -73719 -54476 -30291 13393 -45721 93844
17235 93844 302731 400855 381682 318463 283500 81763 35692 23822 192301 293513 262683
17224 262683 321711 412727 458971 356088 289912 249940 171869 173763 154635 148386 58576 36186
17212 36186 109695 101625 93346 140078 267367 340063 342384 212324 41948 -56598 126628
17201A26628J44590R649q3931j66592J39787P0329j549l6937j06330o4538K25
17190C1331o480j8251j0029J23130Q9348n9522J5464P8494O572p2613j35868j3713
17178B7863L1457r3419j3244P5230j1288j437J07969J0488N0611k6568l1789J08251
17166B34124r7815k1467p5375j18443J0574l1520O3011L7808o2933J9342q857
17155e1551M785P3517J9148m1108r8104M9011M8391Q5464N6823P6940m8427j7864
17143A57025R3401l9954k9269R0416l5518j18116n8832J06611K6562q0711q0526
17132C1089O163J6456J03072j5659p2127M9190l1221M6669Q7759L8205r9876j06051
17120E3669l8931L9120L1457j7271J14488L5856m7950N0398k6710j34336J37711
$$ plain form
17201 126628 271218 280867 196936 30344 170131 240460 238911 201974 95644 31106 31331
17190 31331 24851 6600 -3429 119701 209049 149527 164991 243485 250057 177444 41576 27863
17178 27863 59320 -34099 -47343 27887 16599 15162 123131 133619 184230 157662 125873 234124
17166 234124 136309 114842 39467 -78976 -68402 -99922 -36911 897 -62036 -42694 -51551
17155 -51551 -46766 26751 45899 4791 -93313 -44302 4089 89553 146376 223316 174889 157025
17143 157025 250426 210472 181203 271619 236101 117985 59153 165764 192326 111615 31089
17132 31089 37252 53708 156780 141121 68994 118184 86963 133632 221391 259596 159720 53669
17120 53669 14738 53858 85315 68044 182532 218388 170438 220836 194126 59790 197501
17109A97501J07909L0441M0461j42037q7082O3900Q33r812o86q9842r8250J5684
17097B9020K8674L2592J6487j21332n2428N501k585j5683R6168J06646q928J1459
17085A25591K6513L9749j00728o6276l7305M5762P3951J02085N4286Q0039J36045
17074D79712J14317J35328o7518k06807O255j07717j08688P9628k1127l6229O0288
17063C27442P4198j3347j4513L0870l858R3190Q518j3338J35141J10623m5647
17052F89279p0399O6967j17707j79267j86223m2854N6254L6357O9695L8542p9021
17041B81623j26471O6556J29614Q3416j7782o6542M1401p6202m6760o886K2257
17030B84224q916p7540l0594q0364O3957N5155P342J9788J22747K02157Q1001
$$ plain form
17109 197501 305410 335851 376312 234275 147193 211093 211926 202114 201428 111586 13336 29020
17097 29020 57694 90286 106773 -14559 -66987 -61486 -64071 -79754 16414 123060 114132 125591
17085 125591 152104 191853 91125 24849 -12456 33306 107257 209342 263628 343667 479712
17074 479712 594029 729357 661839 455032 461287 353570 244882 324510 303383 267154 327442
17063 327442 401640 388293 373780 404650 400792 493982 502500 489162 624303 734926 689279
17052 689279 618880 685847 568140 388873 202650 159796 216050 252407 322102 360644 281623
17041 281623 155152 221708 351322 434738 416956 350414 391815 315613 268853 261967 284224
17030 284224 275308 197768 167174 86810 150767 205922 213264 233052 355799 557956 638957
17019F38957k4846j90055j51820K4214l6182J3786j6150k3223P3138Q5140J6462
17008D09421l1229J57631J48969n6895l613Q6585j6951m274j2365r7572k9315
16997E50392k2101j31226m4309L2624l2085j39986o4303m0916J32919K245j6569
16986B26685O1236j5446N6056j20162j60830j14886P6839R8901J3834p7295M0020
16975H4952M4738M8667N5937M7135L0711O3349q6617q4746j70645m9699K9270
16964A3052P0318m9366P0354N5996p1992m2312M8213M5272r540k7359M1127N119
16952A48882o3501j2421M6162k1288J5104Q9401K401q820j11520k6954J4472O397
16940G8315O8369n4588j02632R00J09873M8818j63950J4588Q5886k1330J1278
$$ plain form
17019 638957 614111 424056 272236 296450 260268 274054 257904 234681 307819 392959 409421
17008 409421 378192 535823 684792 627897 624284 710869 693918 689644 677279 579707 550392
16997 550392 528291 397065 352756 385380 353295 213309 149006 108090 241009 243254 226685
16986 226685 287921 272475 328531 208369 47539 -67347 9492 108393 122227 44932 84952
16975 84952 129690 178357 234294 281429 312140 375489 288872 204126 33481 -16218 13052
16964 13052 83370 34004 104358 160354 88362 46050 94263 139535 129995 102636 143763 148882
16952 148882 85381 72960 119122 97834 112938 202339 204740 195920 84400 57446 71918 78315
16940 78315 146684 92096 -10536 -9636 100237 149055 -14895 -307 85579 64249 75527
16929G5527n7022L806K2632J1057l7746J2958j5314k6453P4599n4410n1046M2376
16917I64J30473N371L7446O5584n4167M1868J09400M9618R434r2625p3361J0002
16905B40007n0954k2214K5072M955k7439k05841q2605R9772Q2102l9102k599L7171
16893E8325L8860k6543O6417m8867l8631m6436J03559n4680q0736J9157J02211
16882I2636J07863m0212k01478L9942R3216J179j7788L0746k3164K491j7936j4758
16870E2737M6862R2334J76006j2448m5652n4165j66835P8859J7935n2539K834
16859A35928N6109J7930j70559l1957K9875J06507P2393k3040j45515p9195J56518
16848A24994o393j9270M4534J00716P9949j06981q5076R8755N0503o8571o4697
$$ plain form
16929 75527 18505 22311 44943 56000 18254 31212 15898 -10555 64044 9634 -41412 964
16917 964 131437 136808 174254 239838 185671 227539 336939 386557 395991 303366 230005 240007
16905 240007 189053 166839 191911 196866 169427 -36414 -119019 -19247 62855 23753 21154 58325
16893 58325 97185 70642 137059 88192 49561 3125 106684 52004 -28732 -9575 92636
16882 92636 200499 160287 -41191 -1249 91967 93146 75358 106104 82940 85431 67495 52737
16870 52737 99599 191933 367939 355491 309839 255674 88839 167698 185633 133094 135928
16859 135928 192037 209967 39408 7451 37326 143833 216226 193186 47671 -31524 124994
16848 124994 118601 99331 143865 244581 324530 217549 132473 231228 281731 213160 148463
16837A48463j11360m2852q0652m0702L5527J12408M8152j3091l9230N0090n0r6387
16825b9684Q301Q250l0215M332N5204l3721l9947K4537J1480N443Q8750l0623
16813D2107o9282l6396L1721j6424P4786K4246Q7699j5651j02059j55092m1233
16802a75578J28810M2064p3701l9526o1435p7548j240N2370n9301P9660J32196
16791e3229m6590L1364J39217P9607P9761k7044j57581j45506J74848K0948l2905
16780F2890J13564j74802j03278Q1237j3061o9149n5696m9265Q1005Q8074P6360
16769C7879P5249j4986n9559K7270p1991K3724j12290P3590J55135o547j6228
16758A11246j30954n642K3287j5869O172J7838j1087l621j22921m301O3987R3369
$$ plain form
16837 148463 37103 -5749 -86401 -127103 -91576 20832 68984 55893 16663 66753 66703 -29684
16825 -29684 -21383 -13133 -43348 -39016 16188 -17533 -57480 -32943 -21463 -16020 72730 42107
16813 42107 -27175 -63571 -31850 -48274 26512 50758 138457 122806 20747 -134345 -175578
16802 -175578 -46768 -4704 -78405 -117931 -179366 -256914 -258154 -205784 -265085 -185425 -53229
16791 -53229 -99819 -68455 70762 150369 230130 203086 45505 -100001 74847 95795 62890
16780 62890 176454 1652 -101626 -20389 -33450 -102599 -158295 -207560 -126555 -38481 37879
16769 37879 113128 98142 38583 65853 -6138 17586 -94704 -21114 134021 127474 111246
16758 111246 -19708 -25350 -2063 -17932 -11760 6078 -5009 -8630 -131551 -135852 -71865 21504
16746B1504P2544j64354m1700J89941P2336M9435l9231q7817o023M3339P12L3467
16734A44153l9279k2149n9757J12082J64074l5397j33575m7783J13459j8383j08053
16723F9392j5832N9023K5386P5232L7213r9049j96322K6071j04612J6693R2701
16712a4104J7353l5050p0275M6759O0871L2761J0045P065o169J5391M7270Q3924
16700A95841n3415n2592p3738J4871N5J06541p3944Q595J08894k5717j33777r5560
16688g3946k0956p7596K7436O1321P2397K5816L2044M8158L2872k04173j69822
16677b46449m4698P0404R4640J26798J16100n8509j08321m4253P7933R0266m435
16666F9476n4171n4666o8446J23468M9396L120j37303n0101R4626J00927m7243
$$ plain form
16746 21504 94048 -70306 -112006 77935 150271 199706 160475 72658 66635 109974 110686 144153
16734 144153 104874 82725 22968 135050 299124 263727 130152 82369 195828 177445 69392
16723 69392 53560 112583 137969 213201 250414 151365 -44957 -18886 -123498 -106805 -14104
16712 -14104 3249 -31801 -102076 -55317 5554 38315 48360 55425 49256 64647 111917 195841
16700 195841 142426 89834 16096 30967 31022 137563 63619 72214 181108 155391 21614 -73946
16688 -73946 -94902 -172498 -145062 -83741 -11344 14472 46516 94674 127546 -76627 -246449
16677 -246449 -291147 -220743 -126103 695 116795 58286 -50035 -94288 -16355 73911 69476
16666 69476 15305 -39361 -107807 15661 65057 68177 -69126 -119227 -24601 76326 29083
16655B9083o5064j06026j6300J29074J03854l4134k8566M0613M8194m0874o9546
16644i692j1956n5941K7740P3818P2276r6603Q8803J13477n4705m8187r336r982
16632G9712p3254J3233p7161o5242N4891k6685K0003k8289j14688N9132J4398
16621a43950J8397M7072J23589P1550P9174k5713J7704j8175j32677q3109o5905
16610a12043N1439P2455K9716r256l9036R6963P2366j8209j40274j24598K9851
16599i0626P676M859O9831N9021L5001J51399N219J0630l6540r0821j33152J1964
16587D461P9275K8085R5346p0082j8448N712M0553k6258j6907o8513m5134P1354
16575G9444k7675q0025m0753O8900j9196J2979n710q077N2971n968L6907M3705
$$ plain form
16655 29083 -35981 -142007 -158307 -29233 74621 40487 11921 52534 100728 59854 -9692
16644 -9692 -21648 -77589 -49849 23969 96245 -358 88445 201922 147217 99030 89694 79712
16632 79712 6458 19691 -57470 -122712 -67821 -94506 -74503 -102792 -217480 -158348 -143950
16621 -143950 -125553 -78481 45108 116658 195832 170119 187823 169648 36971 -46138 -112043
16610 -112043 -60604 11851 41567 32311 -6725 90238 162604 144395 4121 -120477 -90626
16599 -90626 -82950 -78091 -8260 50761 85762 237161 242380 253010 216470 125649 -7503 4461
16587 4461 83736 111821 207167 137085 118637 124349 164902 138644 121737 53224 8090 79444
16575 79444 51769 -28256 -69009 -109 -19305 -6326 -12036 -20113 32858 26890 63797 107502
16563A07502p965k0298o6238P6941R6198M6234m3878k32405o8704R2227R2585
16552G2199J66936j05759r3856M1441M5103N2764M3562j9869m9201n9944p5848
16541A7528L5015L8141n8047l7304j508k0579o1483l7219J02210J84915J4243
16530A75912k598K321j55362j41937k4573L8030J8867N0922p898k6071n9316N331
16518a26372J99978O7067j20649j20448J0866M539O5405M4853j08126j5505L9392
16507e9000n1186K9146N0000j4778P5940R1059p5978L4102n1312r8858O1350P4109
16495F4594j510p0208N1301r687k6938R1004J42m4965j3505j27955k3182J13826
16483B917J12324R7357N6479j7269k06088j12877j1669m7545o53k6714K2559N0932
$$ plain form
16563 107502 99537 79239 13001 89942 186140 232374 188496 -43909 -112613 -20386 72199
16552 72199 239135 133376 39520 80961 126064 178828 222390 202521 153320 93376 17528
16541 17528 52543 90684 32637 -4667 -6175 -26754 -88237 -125456 -23246 161669 175912
16530 175912 173314 175635 20273 -121664 -146237 -108207 -89340 -38418 -46316 -72387 -131703 -126372
16518 -126372 73606 140673 20024 -100424 -89558 -85019 -19614 25239 -82887 -98392 -59000
16507 -59000 -110186 -81040 -31040 -45818 30122 121181 45203 79305 27993 -70865 -9515 64594
16495 64594 63084 -7124 44177 34490 7552 98556 98698 53733 40228 -87727 -110909 2917
16483 2917 115241 212598 269077 251808 45720 -67157 -78826 -126371 -127024 -153738 -131179 -80247
16471h0247J09327k5452L6235L2168P5219N1296o2015m8161o8500m733j7665j13163
16459a15691R5092q1600k9577J08647m5678k5250Q551k0900J04394L3092L7399
16448F8479R7109J8707l9466p2588q1746J151j0057p018O7393L0916l6382M890
16436D1388l8709Q6852k9351k6693o1167L2635N2532l6620q0035J2568p981j5321
16424f9902P0096r501q5266l1189K41540K23931L8046o3096j60268r9159O7536
16413A22768o5992j04059Q5821j1308N1024K13362m7851j21160m9496q6291j95702
16402b08884L2502L3078n2457J4994J44998M2168j09684m9364k8235j37656J29443
16391a89097Q6065M0283O9919R267m5074J9585J5894q7833m5319k8797q0628K0420
$$ plain form
16471 -80247 29080 3628 39863 72031 147250 198546 136531 88370 19870 15137 -2528 -115691
16459 -115691 -20599 -102199 -131776 -23129 -68807 -94057 -85506 -106406 -2012 31080 68479
16448 68479 165588 184295 144829 72241 -9505 -8354 -18411 -25429 41964 72880 36498 41388
16436 41388 2679 89531 60180 33487 -27680 4955 57487 20867 -59168 -46600 -54581 -69902
16424 -69902 194 -9307 -94573 -125762 115778 339709 377755 314659 154391 55232 122768
16413 122768 56776 -47283 38538 27230 78254 291616 243765 122605 73109 -13182 -208884
16402 -208884 -176382 -143304 -195761 -180767 -35769 6399 -103285 -152649 -180884 -318540 -189097
16391 -189097 -103032 -62749 7170 16437 -28637 -9052 6842 -80991 -126310 -155107 -235735 -215315
16379b15315K0021M5909J21419R2291O1122J5891l1198R2323j33662j10323M0158
16368a364M5950j4525L6258N5235J8542l2695j01274n2506J7598q9777L2014n21
16356h7065j5688p7789K6908J77040K1617K8581j5327j20367k1830O2255P9650
16345E7985K6187q792L2334P4297P9153N1826j983j28138j73511o2110r3582o132
16333a52466O2581P907j21650q3071J12154K8097J36598N386N2600Q2472j1879
16322A18729k9849n8718r0527J02141R7626o117o551K3157l8384j65230q0057
16311a33780J61010Q4246q2592l2896r2883n9521j02676r199O6867K06524J52379
16300A57479r8670k6971l8339L8647j4024P0109J21919n0222p9498p8918O3058
$$ plain form
16379 -215315 -195294 -149385 -27966 64325 125447 141338 110140 202463 68801 -41522 -1364
16368 -1364 44586 30061 66319 121554 140096 107401 6127 -46379 -28781 -118558 -86544 -87065
16356 -87065 -102753 -180542 -153634 23406 45023 73604 58277 -62090 -83920 -21665 57985
16345 57985 84172 75380 107714 182011 261164 312990 311007 182869 9358 -52752 -146334 -152466
16333 -152466 -89885 -81978 -203628 -286699 -174545 -146448 -9850 -4464 48136 130608 118729
16322 118729 88880 30162 -60365 41776 139402 133285 126734 149891 111507 -53723 -133780
16311 -133780 27230 111476 28884 -4012 -96895 -156416 -259092 -268291 -201424 5100 157479
16300 157479 58809 31838 -6501 32146 18122 88231 210150 159928 80430 1512 64570
16289F4570o4249Q872J6522j3785k12172l0346l1881k2223J15256K32729J46807
16278B10100k0800M1440j57429n5345K1008n0529J08229J06398m4839j81287k2274
16267d5328L2232p6922L8971p7019n6235L9335M0672P5299L6449O3734M5262K3723
16255A40173n9935j07965j01837L0065J49036M5077k1290L6803K7459m8534p9549
16244I503k1589P8180P7715l196n8792m7262l117P4525j00498j17387m2166n033
16232a59117K6534M9160L3419k5844K8507r8960R6911K04253L169j89846r2109
16221a23923J39099K5199o3599o1229l8804j4058M7874N3562L8118m2227l8869
16210g8857J4680R1313n0264o2979k1926p9324N9880O304l5968R691k0214J13791
$$ plain form
16289 64570 321 9193 25715 11930 -200242 -230588 -262469 -284692 -169436 63293 210100
16278 210100 189300 230740 73311 17966 38974 -11555 96674 203072 158233 -23054 -45328
16267 -45328 -13096 -90018 -51047 -128066 -184301 -144966 -104294 -28995 7454 71188 116450 140173
16255 140173 80238 -27727 -129564 -99499 49537 94614 73324 110127 137586 89052 9503
16244 9503 -12086 66094 143809 140613 81821 34559 31442 105967 5469 -111918 -154084 -159117
16232 -159117 -132583 -83423 -50004 -75848 -47341 -146301 -49390 154863 158032 -31814 -123923
16221 -123923 15176 40375 -23224 -84453 -123257 -137315 -89441 -35879 2239 -39988 -78857
16210 -78857 -64177 27136 -23128 -86107 -108033 -187357 -127477 -121173 -157141 -147450 -167664 -53873
16198e3873N6615P5626o7606K0536Q6241K6333j25766p2046J22776J00880j07082
16187F2634n1265Q1441j10112n8397M3504k7382j53509m8867K0539M8483J40622
16176e2309R7867n1840J8757o3789j17312N272K1204n8186j4768M071J09423k6001
16164a27611J03380n0327k829j2659J7584L6852J9652J2440q6988L6224k7263
16153h1545Q4774O6645J653k6474N3521m1888j6385O2188K9111n0267J12745j4419
16141A79659j31135J15081p3969j49095M3132J8376m4015J26591J1486l4331P0754
16130A32534J06447j2317j06109j11964l3064J0074J35690M4363l0125p7533m4968
16119A3028N2173K28j15083P362J53250q0815n1797j25371j10121N6085J56340
$$ plain form
16198 -53873 2742 78368 10762 31298 117539 143872 18106 -53940 68836 169716 62634
16187 62634 11369 92810 -17302 -75699 -32195 -59577 -213086 -261953 -241414 -192931 -52309
16176 -52309 45558 -6282 12475 -51314 -168626 -163354 -142150 -200336 -215104 -211033 -101610 -127611
16164 -127611 -24231 -74558 -77387 -90046 -72462 -35610 -15958 -3518 -90506 -54282 -81545
16153 -81545 3229 69874 71527 45053 98574 56686 40301 102489 131600 81333 194078 179659
16141 179659 48524 163605 89636 -59459 -16327 2049 -41966 84625 96111 61780 132534
16130 132534 238981 226664 120555 8591 -24473 -14399 121291 165654 135529 57996 13028
16119 13028 65201 65429 -49654 -42292 110958 30143 -21654 -147025 -257146 -201061 -44721
16108d4721L1736P6588J0578o541m7460M7250J38986O9294j74812o6917k5781
16097H200o1650M285Q3724K8685l0228N0887l1339L2750M5579r1483j07577n6056
16085a24223j1805o3557P2499J40813Q7661P368N378n3388q2093o1394P5588o298
16073a3451J2794J27696N8933p0658j606l0909j0368j6807j6668m6611l8855j04741
16061a51251Q012O7791O8780O6546n7382p4627M4383N3838Q1932j9987j0962R5656
16049A72729m4456q7815j54592n8544J6046J22443R9535j5520m3811j23140o112
16038a23237q474N5024Q1539K9938J6816J6408n5621J9835Q7404q7091Q1032O0935
16026A74508j21052j00351K2980M0228N6550N2709q3186P038k5372j3703O6151
$$ plain form
16108 -44721 -12985 63603 74181 67640 20180 67430 206416 275710 100898 33981 8200
16097 8200 -53450 -49165 34559 63244 33016 83903 52564 85314 130893 39410 -68167 -124223
16085 -124223 -136028 -199585 -127086 13727 101388 108756 114134 60746 -21347 -82741 -7153 -13451
16073 -13451 -657 127039 185972 115314 113708 82799 72431 55624 38956 -7655 -46510 -151251
16061 -151251 -143239 -75448 -6668 59878 2496 -72131 -27748 26090 108022 88035 77073 172729
16049 172729 128273 40458 -114134 -172678 -156632 -34189 65346 49826 6015 -117125 -123237
16038 -123237 -131711 -76687 4852 34790 51606 68014 12393 32228 119632 32541 113573 174508
16026 174508 53456 -46895 -23915 16313 72863 125572 42386 49424 24052 10349 76500
16015G6500m872Q3586j2360o0014q666j25803r7214Q8155J85499J41680N5453
16004C21944p4413j31296O0643o790q402L0197m0687k5112p1258p3868n0972l8683
15992a08697L9855J28634j2381M9804R3265j40056j8891L5128n2556o9008L0969
15981b3934Q621p3736L2383N1649p1335J31157j11056p2553P3341Q7913K0101
15970E2551m7520o831J42199o4670q9521o6468j15508J21160k6622J1071P5360
15959a4799M5107M3331n1407p5427P2679j3229l8343K5582j7302J6548j2011q8713
15947a07984J4692M386o8970J20390K8696K3790L8280L0001l0962N7164l6878
15936G2605p0127N7668N5569j5140j35652k0046K2178L8225J4864J56502L6512
$$ plain form
16015 76500 71628 155214 142854 82840 74174 -51629 -148843 -60688 124811 266491 321944
16004 321944 247531 116235 176878 170088 161686 191883 151196 126084 54826 -19042 -70014 -108697
15992 -108697 -68842 59792 47411 97215 190480 50424 31533 66661 14105 -54903 -23934
15981 -23934 -15313 -89049 -56666 -5017 -76352 54805 -56251 -128804 -55463 32450 52551
15970 52551 5031 -1800 140399 75729 -13792 -80260 -195768 -74608 -101230 -90159 -14799
15959 -14799 30308 73639 22232 -53195 19484 6255 -32088 -6506 -23808 -7260 -19271 -107984
15947 -107984 -93292 -88906 -157876 -37486 -8790 15000 53280 83281 52319 109483 72605
15936 72605 2478 60146 115715 100575 -35077 -55123 -32945 5280 20144 176646 213158
15925B13158j02972j21743j1408K5471J6390j37154k9800J16514k7711j54438
15915b13693L2278J79102j4384l3209k4799K4103Q4868L6344m0434L034o5674
15904c2464o1515J1095k5076p8343O5071P0952m0769o4089K2275J86768J09838
15893A63743n4286N2534O6397j04044n3582J4275m7956j03448p9397n1554P3641
15882a23677J9810N2116L8092j4251n0633n1882L7388K0536k2941m8618N6768
15871h7292J58642O6450k3767o3979n2107M3962J06586q7741l6452M6536K3951
15860I4789M7422l5334o5134l4400M5179O8226o6845p5653j14165n5893K2663
15849a69145J81846R9316N2572p8246n5465N1344j677k6819l5708k513q0110m6815
$$ plain form
15925 213158 110186 -11557 -22965 2506 18896 -118258 -148058 -31544 -59255 -213693
15915 -213693 -181415 -2313 -16697 -49906 -74705 -50602 34266 70610 30176 33210 -32464
15904 -32464 -93979 -82884 -107960 -186303 -121232 -50280 -91049 -155138 -132863 53905 163743
15893 163743 109457 161991 228388 124344 70762 85037 37081 -66367 -145764 -197318 -123677
15882 -123677 -103867 -51751 -13659 -27910 -78543 -130425 -93037 -72501 -95442 -144060 -87292
15871 -87292 71350 137800 114033 50054 -2053 41909 148495 60754 24302 70838 94789
15860 94789 142211 106877 41743 7343 52522 120748 53903 -21750 -135915 -191808 -169145
15849 -169145 12701 112017 164589 86343 30878 82222 80545 53726 18018 15505 -64605 -111420
15837a11420j01923M672K17621N4534j00604K4732L6404j17052j65987k0907J04302
15826a75628L8543l1161n3669r7272m3502J4431R5241J37140L9013k1718j3251
15815a11833J5138J42806M8058j9990p5539J3740n2164P1197k0306m4116p271
15804d0280n5917n3384J54037M9843j89791K7468q040j7641L2603O9611k4320
15793e5811j21714N5784Q3717N4639P910r2252k5335J4938N0198l0378M6060N7617
15781D5373K8477p552r8164k2289P8988K6722k0892k4018J5014J6595m1192K4634
15769B1696N7650n1819J5107L0744o8854Q251O7777J918o1632n2911p978L2189
15757g862K448l4323J13464M078L1730M9013k8804j53681j47337P2925M8177q1301
$$ plain form
15837 -111420 -213343 -208671 8950 63484 -37120 -12388 24016 -93036 -259023 -279930 -175628
15826 -175628 -137085 -168246 -221915 -319187 -362689 -348258 -253017 -115877 -76864 -98582 -111833
15815 -111833 -96695 46111 94169 74179 -1360 12380 -39784 31413 11107 -33009 -40280
15804 -40280 -96197 -149581 4456 54299 -135492 -108024 -116064 -133705 -101102 -31491 -55811
15793 -55811 -177525 -121741 -38024 16615 24525 -67727 -93062 -78124 -27926 -58304 -12244 45373
15781 45373 73850 66298 -31866 -54155 24833 51555 30663 6645 21659 38254 -2938 21696
15769 21696 79346 27527 42634 73378 4524 12775 80552 82470 20838 -32073 -40051 -7862
15757 -7862 -5414 -39737 73727 77805 109535 158548 129744 -23937 -171274 -98349 -50172 -131473
15745a31473K6825l9482J6335O0019L4323k7467k4995k6895O1199J1086j16320
15734a56845M6407K02695P7406j05480o7782J0364J0522n1121q999J13028M6663
15723A16858j84932p7161J2016J05341l3682N3027n3518P415l8077L5110J5476
15712d2127j23123K3964P7834O8990M941K4917j6315O749m5093k5809r4162M518
15700a34716J07559m9760N2144R5817r9859Q190L8361j3570M8486o5053P0362
15689E7961n4742j50562r1886N2486J3403M2439j2633k0504K9053Q8471Q0661
15678C4147l3923K288o476N3472m0502n0950p2664q961j1885J21769K0339K3465
15666C0119k5860q6471O0776N9156Q073k2973p0217K6286Q3778M0379p0088j3758
$$ plain form
15745 -131473 -104648 -144130 -127795 -67776 -33453 -60920 -85915 -112810 -51611 -40525 -156845
15734 -156845 -110438 92257 169663 64183 -3599 6765 17287 -33834 -42833 70195 116858
15723 116858 -68074 -145235 -133219 -27878 -61560 -8533 -62051 -54636 -92713 -57603 -42127
15712 -42127 -165250 -141286 -63452 5538 10479 35396 19081 25830 -19263 -45072 -139234 -134716
15700 -134716 -27157 -76917 -24773 71044 -28815 -20625 17736 4166 52652 -12401 57961
15689 57961 3219 -147343 -239229 -186743 -173340 -130901 -143534 -164038 -134985 -46514 34147
15678 34147 224 2512 -3964 49508 9006 -41944 -114608 -123569 -135454 -13685 6654 30119
15666 30119 4259 -82212 -21436 37720 45793 22820 -47397 -21111 62667 103046 32958 19200
15654A9200l5697n7387n9363L3942j9096L2060j1574m5599P9772j16480m7818
15643b28040L4521P1128p145P6515Q67r0770j072j6881L1329j42074P621J87439
15631g6562Q6898q714k615m1356N2561K267O110k943J3972q4551Q46J30648l1000
15618D5561n0223l5414J4481p0118l24r1497p9493N3632J6572J2567Q3118Q7108
15606a4030n9612p7087K8408m5427l5575r4245L3573J00615J12864J5843m8168
15595h2841r236N8307J12733L802n62J15652J2525o8710J9938l399P6002l8578
15583A95633r9306q6720j55226r4572Q22p151j11710L796N29N4829O5547K00203
15571c3326L9253p5554J29645K0252j27414p2903J6799Q495O8176L3108R6325
$$ plain form
15654 19200 -16497 -73884 -133247 -99305 -118401 -86341 -97915 -143514 -63742 -180222 -228040
15643 -228040 -193519 -122391 -129536 -53021 -52154 -142924 -143996 -160877 -129548 -271622 -264001 -76562
15631 -76562 10336 1622 -993 -42349 10212 12479 18589 15646 29618 -54933 -54087 76561 45561
15618 45561 -4662 -40076 -25595 -95713 -96037 -187534 -267027 -213395 -196823 -184256 -101138 -14030
15606 -14030 -73642 -150729 -122321 -167748 -203323 -297568 -263995 -163380 -50516 -34673 -82841
15595 -82841 -92077 -33770 78963 82765 82203 197855 210380 141670 161608 158209 234211 195633
15583 195633 96327 9607 -145619 -240191 -239369 -246520 -358230 -354434 -353905 -299076 -233529 -33326
15571 -33326 5927 -69627 60018 80270 -47144 -120047 -103248 -94753 -26577 6531 102856
15560A02856R5230l698k0918k4408r5929p4973j07479j11203J24768J38474o7496
15549d4776j3800L3498K7748R7896n2698j24721J32408N4681j06383k5431n545
15538b7123J07833k154p2828K2757M7337M6029M3189n5048n8684P699o9078j9105
15526b9176K2822J018k9288n0683K1305l6225L7712M6058J40445j6282p1946o3855
15514b8095k7833N3535j6941k8643l2010O6042m0341O4501n1748k2754o3977q3197
15502b11461J06254L5600M4288P8100R4381l7698l6618j14992J15469L5874m7805
15491F1392o7040k37509Q2873K46613k5567M6522n5570l2489j0950J1091M4371
15480F3737R262m6641j15468j6280O4374k1152n0291j66323M0077N9686J02650
$$ plain form
15560 102856 198086 194388 173470 149062 53133 -21840 -129319 -240522 -115754 22720 -44776
15549 -44776 -58576 -25078 2670 100566 47868 -76853 55555 110236 3853 -21578 -27123
15538 -27123 80710 78556 5728 28485 75822 121851 165040 109992 51308 59007 -10071 -29176
15526 -29176 -6354 -5336 -34624 -85307 -64002 -100227 -62515 -16457 123988 107706 35760 -28095
15514 -28095 -55928 -2393 -19334 -47977 -79987 -13945 -54286 10215 -41533 -64287 -128264 -211461
15502 -211461 -105207 -69607 -25319 52781 147162 109464 72846 -42146 73323 109197 61392
15491 61392 -5648 -243157 -160284 86329 60762 107284 51714 19225 8275 19366 63737
15480 63737 72999 26358 -89110 -105390 -41016 -62168 -112459 -278782 -238705 -179019 -76369
15469g6369p5580o9369J28294J48331P8978o9779p6547l9705p9266M4927j6913
15458a02998p1817K6625j0555J165J46248Q6322m5516j339N0838O3873o2530r5816
15446a5500l3193K6865J22562R442J3596l653K260r7325p0083J26090J20377J02816
15434C04254Q181m2486j04272j02728J8320L1955j0992L9025m5673j63419J1252
15423e6583J30966J6973j08473p4812L0471Q7966j2768m7370L1146m2163J01068
15412E6421P7624J04089p6954k49290j27385J82240J46595M1498r7145l5338m741
15401A7614Q3550M7287J01204j49023p8566m7455n570L462p0842m772N2715L3540
15389a6856o7021p4135J02968M5981L8410o1268m3756O5777K9541j01736j604
$$ plain form
15469 -76369 -151949 -221318 -93024 55307 134285 64506 -12041 -51746 -131012 -86085 -102998
15458 -102998 -174815 -148190 -158745 -157580 -11332 74990 29474 28135 78973 142846 80316 -15500
15446 -15500 -48693 -21828 100734 110176 123772 120119 122379 25054 -45029 81061 201438 304254
15434 304254 312435 269949 165677 62949 81269 113224 102232 141257 95584 -67835 -56583
15423 -56583 74383 91356 -17117 -91929 -61458 26508 13740 -33630 -2484 -44647 56421
15412 56421 134045 238134 161180 -88110 -215495 -33255 113340 154838 57693 22355 17614
15401 17614 101164 148451 249655 100632 22066 -25389 -30959 -27497 -98339 -103111 -50396 -16856
15389 -16856 -83877 -158012 -55044 -9063 29347 -31921 -75677 -9900 19641 -82095 -83699
15378h3699J87027n5905m9371J02282k1854L0325l6916o1884p5712J2246K9433
15367b4028q309Q5247K7633j5436j96882j0506M6258p0354R1064M9045P1051N5989
15355A00772o6390q6750k0946n998J39951L5382j1707J1482k4569Q482K4549j06671
15343b413J2853j02036n8915J08416J9611q5540p580l4122J31880q1366k8383
15332a27595R7028J03829J14077l5234j6066n2524P2877L9366K5752o6881j8942
15321A35687o7273L189M3073O9033l2234K6086r1248J0076j10376k9457M3442
15310bJ07924n1366o9020J034n3807N0979J67568m4130k05180l3334L1455J5350
15298h2529Q9799P4869j7335L6612q2319n7584q759n1129N8914J19707m257o5086
$$ plain form
15378 -83699 103328 47423 -1948 100334 78480 108805 71889 10005 -65707 -53461 -24028
15367 -24028 -32337 52910 80543 65107 -131775 -142281 -96023 -166377 -75313 -26268 44783 100772
15355 100772 34382 -52368 -73314 -79312 60639 96021 84314 95796 71227 79709 104258 -2413
15343 -2413 10440 -91596 -150511 -42095 -22484 -108024 -115604 -149726 -17846 -99212 -127595
15332 -127595 -30567 73262 187339 152105 136039 83515 156392 195758 221510 154629 135687
15321 135687 68414 71603 114676 183709 151475 177561 86313 96389 -13987 -43444 -2
15310 -2 107922 56556 -12464 -11430 -65237 -14258 153310 109180 -96000 -129334 -97879 -82529
15298 -82529 7270 82139 64804 101416 19097 -38487 -47246 -98375 -39461 80246 75989 10903
15286A0903J24316j26339p4206J18000O2430M7703k4347K5777J7721m0738j38192
15275C028m2922K4444L777o7694O5567K7047l0159J1826N8286l4320J28102j6132
15263A30850j64551p4190R4669Q0946r1532j10013q6873K9154J15145l7398q7567
15252b01360j2749J54327J54060k1094q0944j19322j2213k7177J7273O0359R396
15241g9444l0074l1757k4174N4271J21500L5467N1484M0400N3856r4617j15551
15230a8639j06285r991j9585j1230J13179L3743P8307n328k1083M2439o5571j1872
15218a916O8250J1063k4366r4772k3365K691r8897o2743J32727J42597J6515p9234
15206a1450L992r80K5720L1172m0434L5690j4187M096K1932l5540j23326L9078
$$ plain form
15286 10903 135219 8880 -65326 52674 115104 162807 138460 164237 181958 141220 3028
15275 3028 -39894 -15450 -11673 -79367 -13800 13247 -16912 -5086 53200 18880 146982 130850
15263 130850 -33701 -107891 -13222 67724 -23808 -133821 -220694 -191540 -76395 -113793 -201360
15252 -201360 -214109 -59782 94278 73184 -7760 -127082 -139295 -166472 -149199 -88840 -79444
15241 -79444 -109518 -141275 -165449 -111178 10322 45789 97273 137673 191529 96912 -18639
15230 -18639 -124924 -134915 -154500 -165730 -52551 -18808 59499 54171 33088 75527 9956 -1916
15218 -1916 66334 77397 53031 -41741 -65106 -62415 -161312 -224055 -91328 51269 67784 -11450
15206 -11450 -7458 -8438 17282 48454 8020 43710 29523 33619 55551 20011 -103315 -64237
15194f4237J4240J6915m8063l8717P6858k0286J176O1842Q8738j6655j08580j19306
15182a56075M774L6231N4965n3812k9543Q6876K2554n1680l4161j2817L5044j3491
15170a11135l5892M5032p7125k8373J23965P8489P6715n9394J10l0804j45377
15159a63789n7916R9895J26946L2978l5447N234j2458m1149q278K5624Q4149K224
15147E8013m922p0500q7500R9205R2001n1227p9066p9593J4825k692l8602J06277
15135d3781K9742j7837p5986j2289Q4096q952N0740q14o2241j8532L407J3977
15123e8470k3519L5140O3104n328L3855J21133o2508m0375j7359n7386N9220J8131
15111F5638m6127r1071o1584P9019j9q7334O2661J97398q6915j74977J9505P8380
$$ plain form
15194 -64237 -49997 -33082 -81145 -119862 -43004 -63290 -62114 -272 88466 71811 -36769 -156075
15182 -156075 -151301 -115070 -60105 -113917 -143460 -56584 -34030 -85710 -119871 -132688 -97644 -111135
15170 -111135 -147027 -101995 -179120 -207493 -83528 -5039 71676 12282 12392 -18412 -163789
15159 -163789 -221705 -121810 5136 38114 2667 7901 -4557 -45706 -53984 -28360 55789 58013
15147 58013 53091 -17409 -104909 -5704 86297 35070 -43996 -123589 -108764 -111456 -150058 -43781
15135 -43781 -14039 -31876 -107862 -120151 -36055 -45007 5733 4919 -57322 -75854 -72447 -58470
15123 -58470 -81989 -46849 16255 10927 44782 165915 103407 63032 45673 -11713 47507 65638
15111 65638 19511 -71560 -133144 -54125 -54144 -141478 -78817 118581 31666 -143311 -123806 -45426
15099d5426L0733J34813Q8451n3036m9844l8728L363j4001j80586K6764O3315
15088c4182j0425n4023j29634O5761l628J9659K7981M889P3015J20402K3946n7487
15076D6274j51060q0908L467j988j3070k2570N4606M9758j31296k652J67810K1201
15064f0428q2319q19M3358Q9690J8479l6660j47285J34494J04672K8779k3239
15053F8722m4665o5130j23486J2287N3799J2882m9190k0849L1248Q4215l7640
15042g7807r2256R1131J94909N7935j34081n5105Q6782L6209o553j346o761K0062
15030A13119m6596k6792K9538J2463J11K0853J8740p8997j47816L2969J63229
15019I0821k5868n8516M4432k3909n1395O876k6087j3378k8938L8578k5901J10804
$$ plain form
15099 -45426 -14693 120120 208571 155535 105691 66963 70326 56325 -124261 -97497 -34182
15088 -34182 -44607 -98630 -228264 -162503 -166131 -146472 -118491 -113602 -40587 79815 103761 46274
15076 46274 -104786 -185694 -182227 -184215 -197285 -219855 -165249 -115491 -246787 -249439 -81629 -60428
15064 -60428 -142747 -143566 -100208 -10518 7961 -28699 -175984 -41490 63182 91961 68722
15053 68722 24057 -41073 -164559 -152272 -98473 -85591 -134781 -155630 -124382 -40167 -77807
15042 -77807 -170063 -78932 115977 173912 39831 -15274 71508 107717 101164 99818 93057 113119
15030 113119 66523 39731 69269 81732 81843 102696 121436 42439 -105377 -72408 90821
15019 90821 64953 6437 50869 26960 -24435 -17559 -43646 -57024 -85962 -47384 -73285 37519
15007C7519j3891J10848L3397o2389r8669o9103n7630N185M8075j8157L6421L5890
14995a2504M2242J3530n1956o4044r334n8839J92k9123o1243J4380K870L5104
14983a78725N5525M6280j5016K0986J9035L8156M6288p2355j23000N0130R2626
14972b0070j32498L947J84676M087k15461j08447O8708N7378K08898O8060p1j13739
14960E468k3449O7034N4640j08936Q956O9233K6588J8359L2047M0370r3193k42055
14948a44938K4549M4366J4870Q0377j4410m5848N814q16r2414m4152J22734J27043
14936G7175j36864o3910J11040P3495L3082q966j27075j0613O3740M9321R139
14925F9564q0826p7118k9532P5367J38045M1681n4360j54332o6446O5943j4898
$$ plain form
15007 37519 23628 134476 167873 105484 6815 -62288 -119918 -114733 -66658 -84815 -48394 -12504
14995 -12504 29738 43268 -8688 -72732 -82066 -140905 -140713 -169836 -231079 -216699 -213829 -178725
14983 -178725 -123200 -76920 -91936 -70950 -51915 -13759 32529 -39826 -162826 -112696 -20070
14972 -20070 -152568 -148621 36055 40142 -175319 -283766 -215058 -157680 51218 119278 119207 5468
14960 5468 -17981 49053 103693 -5243 3713 72946 99534 117893 149940 190310 97117 -144938
14948 -144938 -120389 -76023 -61153 19224 4814 -41034 -35220 -36036 -128450 -172602 -49868 77175
14936 77175 -59689 -123599 -12559 60936 94018 85052 -42023 -52636 11104 60425 69564
14925 69564 -11262 -88380 -117912 -42545 95500 137181 82821 -71511 -137957 -72014 -86912
14914h6912l2402M671l0588o5438R5379N4562O8703j72421Q0442J34839q4589
14903c3754n032m7167O4335R7083J04327K2729j02667j21668q2965N6556K6481
14892b1742N184j2985r1948l5355n2027o1109L9511J04070O2608M0358l4237J2717
14880d4955L2388N2010P6086j5986K3504P1454m9392l4620n3376k9711q2691l002
14868e8291k6997j0895J14148N4721K9604q1821L2777O6228N7471j36j04106j53250
14856h0547M2383J14698l3032R1958q0604q6698q161l944J0664O4196o7762p0630
14844a07479J38349K8656o3760p8362R5482l9974j06248k0881M6696J04948n1236
14833e3809j09602n9658R1333J62024J1816M2166J9850p8867j01298j7854j4146
$$ plain form
14914 -86912 -119314 -114643 -145231 -210669 -115290 -60728 7975 -164446 -84004 50835 -33754
14903 -33754 -38786 -85953 -21618 75465 179792 202521 99854 -21814 -104779 -48223 -21742
14892 -21742 -16558 -29543 -121491 -156846 -208873 -269982 -230471 -126401 -63793 -23435 -57672 -44955
14880 -44955 -12567 39443 115529 99543 123047 194501 145109 110489 57113 27402 -55289 -58291
14868 -58291 -85288 -96183 17965 72686 102290 20469 53246 119474 176945 176809 72703 -80547
14856 -80547 -38164 76534 43502 135460 54856 -31842 -40003 -43947 -33283 30913 -36849 -107479
14844 -107479 30870 59526 -4234 -82596 12886 -27088 -133336 -154217 -107521 -2573 -53809
14833 -53809 -163411 -223069 -131736 30288 42104 84270 104120 25253 -76045 -93899 -108045
14822a08045k9143L2336j3182R196k3571O368L7831M6387K1571m1273o3688n1639
14810a76852Q9576r9622P693K6164l4880p2045J3540J50043J62808K6075j1359
14799H1141J4984j7966J9458J5562r1292j4850K957J47185J5042r1916j40975
14788f0670L2182l0668k9529L5095R5311J64023J6992j93270j42728P5532M7547
14777I817p685N984n9336J969K1423J5965q7189m8441q4477j4682N7748J62097
14765b6807r1920N9942K3619j07500k8293J37180l1997O0859J19745K4205n9706
14754G9327Q911k9584q8864r610J0901n585o3237M0401P8819Q6877j82706j38097
14742b12447K1574N0663J09877O3024q3714r810Q5965J55604M8381o1311l1737
$$ plain form
14822 -108045 -137188 -104852 -118034 -108838 -132409 -126041 -88210 -41823 -20252 -61525 -125213 -176852
14810 -176852 -87276 -186898 -179205 -153041 -187921 -259966 -246426 -96383 66425 92500 81141
14799 81141 96125 78159 97617 113179 21887 7037 9994 157179 172221 80305 -60670
14788 -60670 -28488 -59156 -88685 -53590 41721 205744 222736 29466 -113262 -37730 9817
14777 9817 2132 8116 -51220 -49251 -27828 -11863 -99052 -147493 -231970 -246652 -188904 -26807
14765 -26807 -118727 -58785 -35166 -142666 -170959 -33779 -65776 -4917 114828 139033 79327
14754 79327 88238 58654 -30210 -39820 -28919 -34504 -97741 -57340 21479 108356 -74350 -212447
14742 -212447 -190873 -140210 -30333 32691 -51023 -60833 25132 180736 229117 167806 136069
14731A36069K1972J2577L6871k798j62834j67330Q3951Q7575L2360j1748j6705
14720D9960r3171n5696N1614q3757q5171J00517n6700J2287k2397J01686j148
14709h1976j3054R6410M6173k0852j4028L0416O3166J9848l8781k3621j21821
14698e8120l9952l9704O0451O2914r9637o2385p451m6670K7857K7914J502J56693
14686a6588N5006J9603k5668r3471K4304R8863K938r9395l4068O375M0650r5632
14674a17083K6112R0682l6959j04230N8411O455q3405J6594J30009l4976m1581
14663h9971K5457J26916j18282j16508M6732K9490n6330N7971J9463p2152N4638
14652i2576O2809J47177j5002J5871j6137o5277o6216j77007L8762P4179n0068
$$ plain form
14731 136069 158041 170618 207489 204691 41857 -125473 -41522 46053 78413 66665 49960
14720 49960 -43211 -98907 -47293 -131050 -216221 -115704 -172404 -160117 -182514 -80828 -81976
14709 -81976 -95030 1380 47553 26701 12673 43089 106255 126103 87322 63701 -58120
14698 -58120 -98072 -137776 -77325 -14411 -114048 -176433 -183884 -230554 -202697 -174783 -173281 -16588
14686 -16588 38418 58021 32353 -61118 -36814 62049 64987 -34408 -68476 -62101 -21451 -117083
14674 -117083 -90971 -289 -37248 -141478 -83067 -76612 -160017 -143423 -13414 -48390 -89971
14663 -89971 -64514 62402 -55880 -172388 -125656 -96166 -152496 -94525 -75062 -147214 -92576
14652 -92576 -29767 117410 102408 118279 102142 36865 -29351 -206358 -167596 -93417 -143485
14641a43485j6006O7103L993q3227N5208L0142J06581N2841L2455K3368n8668
14630G0305q9759n1371O3560N8267J5304M6107j93741j04176N8824J10625m9195
14619f5250l4671r623J17911l9620j6703K9923P0177O2666j051m9652k7450L4586
14607G1243j5067n2363R502J9124n0997L2405M7792p8654J2205l8105l5173N1268
14595b6820L153j7017J6707L1052m230Q0456q1855l2805p3869j08247M3973k0953
14583a90455J04166o0077J36051J35023j06583n1225O9456p1570j19990N8248
14573i6956J07543m2465N9777K0574J9668l1581L9524j29728n0921j4983q0346
14562a99894M0902J10272K8070q686m1721J20225m1691l1852J5451k5129j02916
$$ plain form
14641 -143485 -159491 -92388 -88395 -171622 -116414 -86272 20309 73150 105605 128973 70305
14630 70305 -19454 -70825 -7265 51002 66306 112413 -81328 -185504 -126680 -16055 -65250
14619 -65250 -99921 -109544 8367 -31253 -47956 -18033 52144 114810 113759 64107 36657 71243
14607 71243 56176 3813 13315 32439 -18558 13847 61639 -17015 -4810 -42915 -78088 -26820
14595 -26820 -23667 -40684 -23977 7075 2845 83301 1446 -31359 -105228 -213475 -169502 -190455
14583 -190455 -86289 -146366 -10315 124708 18125 -33100 36356 -35214 -155204 -96956
14573 -96956 10587 -31878 27899 48473 68141 36560 76084 -53644 -104565 -119548 -199894
14562 -199894 -158992 -48720 -20650 -29336 -71057 49168 7477 -24375 -8924 -34053 -136969
14551a36969l2603L4195q9337o0536N0392J15830P0231m1214l7460n9177J7295
14540a69353k777k3377L6055R6385J16015J69288K5095j2269Q2189j62012j74870
14529a9631j09057n76o9852m0867L2784L0566K8227N0606o222J1367Q5027J18557
14517A10929L3134j30820r4784n7126J07981R2505n685k1177M1708P6967o8176
14506H5456l9496K991Q776R1710l3713O4765l2189j06815j2640q4189q3600l3920
14494a72864J27594L6699r0522K3939N7395M4753M4175M3481n4382p8658m0899
14483e9289m4764K2778R1418k4203J00637m7953n6013J30897J4600j8427N2071
14472A61752K9319j08154j05217o0984O0549J06168J02968L2106o3592J1887k235
$$ plain form
14551 -136969 -169572 -135377 -224714 -285250 -234858 -119028 -48797 -90011 -127471 -186648 -169353
14540 -169353 -172130 -195507 -159452 -63067 52948 222236 247331 235062 317251 155239 -19631
14529 -19631 -128688 -129264 -199116 -239983 -207199 -176633 -148406 -97800 -104022 -92655 -7628 110929
14517 110929 144063 13243 -81541 -138667 -30686 61819 56134 34957 76665 153632 85456
14506 85456 45960 48951 57727 149437 115724 180489 148300 41485 28845 -55344 -138944 -172864
14494 -172864 -45270 -8571 -99093 -75154 -17759 26994 71169 114650 60268 -18390 -59289
14483 -59289 -104053 -81275 10143 -14060 86577 38624 -17389 113508 128108 109681 161752
14472 161752 191071 82917 -22300 -83284 -22735 83433 186401 218507 154915 166802 164567
14461A64567m2795n2994N2234R9146o3810k1761N3231M3355J581R8020K26071
14450E56845Q1347O0187Q2074j0572l5985n7531j1241k21113j77035N0011j16125
14439B00862j92781p5763o2922J34027J01381Q197Q910j2559q868r4057P1760
14428G8187R0835k9492L1472k6105L4555K7520j58993j12103p912O7442O4886
14417F0292O226n1254m2452m0231n9224P5640J96426m4109j39433M0217K9567
14406C1665m9293j9937K1570J7560M726P3817N7735j5163K7082q4789k3339j01637
14394f0003l2124R4260l4359J4634q5848o2165N5892j3420m5514R2275N7620l5611
14382e4363R6267k1426r9266M7705j6996J47681L7778j37614j9237J11310l0674
$$ plain form
14461 164567 121772 68778 121012 220158 156348 134587 187818 231173 232754 330774 556845
14450 556845 638192 698379 780453 769881 733896 676365 665124 444011 266976 316987 200862
14439 200862 8081 -67682 -130604 3423 104804 113001 121911 109352 100484 6427 78187
14428 78187 169022 139530 171002 144897 179452 206972 47979 -64124 -72036 -4594 60292
14417 60292 66518 15264 -27188 -67419 -126643 -51003 145423 101314 -38119 2098 31665
14406 31665 -17628 -37565 -15995 1565 6291 80108 137843 122680 149762 64973 41634 -60003
14394 -60003 -92127 2133 -32226 -17592 -103440 -165605 -109713 -123133 -168647 -76372 -18752 -54363
14382 -54363 41904 20478 -78788 -31083 -48079 99602 137380 -234 -19471 91839 61165
14371F1165l6848p6563J2393m9885J8998j544k9361j7879m3945p7412j51053q5346
14359d77280J51044J48481N8348n795l5586P7547k0071O3283j1485j9669l8073
14348a09256M6825O4019n5422J5171M3457K2595M4284K4154M3215P040O9050j00510
14336A14622j30115j3916N8999q8044j4337P0942o538J17280N3580j58048j00466
14325i6041p6062K5871O3553o5232O0805R2989j0212j093O5360J15959l6850j39321
14313b74K6214M7895l0536j05811k4846j5023P5993L3884M9211j0683K4209Q2474
14301A52707m4099J2203n9451r6868r1958K7597N8570o83O0817k7021o5130o5324
14289a38640l5029K3357M2926l4936j4474N6175k5995k485o7208m4311r774N2456
$$ plain form
14371 61165 24317 -52246 -39853 -89738 -70740 -72284 -101645 -119524 -163469 -240881 -391934 -477280
14359 -477280 -326236 -177755 -119407 -125202 -160788 -83241 -103312 -40029 -51514 -71183 -109256
14348 -109256 -62431 1588 -53834 -38663 4794 27389 71673 95827 139042 146082 215132 114622
14336 114622 -15493 -29409 29590 -58454 -72791 -1849 -8387 108893 162473 4425 -96041
14325 -96041 -172103 -146232 -82679 -147911 -87106 5883 -4329 -5422 59938 175897 139047 -274
14313 -274 25940 73835 43299 -62512 -87358 -102381 -26388 7496 56707 46024 70233 152707
14301 152707 108608 120811 61360 -35508 -127466 -99869 -41299 -41982 18835 -8186 -73316 -138640
14289 -138640 -173669 -150312 -107386 -142322 -156796 -100621 -126616 -129101 -196309 -240620 -250394 -197938
14277a97938N8812K2806n6995n461K2177P291J5368k6573j26588m7691N0784M8553
14265b35455J10644P5470J24386Q6926N2030r2543j79297L561O5019q3669j91575
14254b64503l1001J1754J12694K40397P4005j7173j30893L3413k99J32460m8822
14243A12032m5278J5751m3512J846j04232o4377j4098K866j23303M9586P9920
14232a32799J24516j4254p7582j93737l616J31196M6242J34997m7227p4506N6555
14221e0215N0856p3960m4504J3719j918K9299Q8178k967N7387j37236m8061M0874
14209g8548P5168R6259K6920j03708o5066m2137K6051n7913j5836N2252l2245
14198a18803R7488J35166j3590j4857O7295j25652p9287J6679m8022o8440n0920
$$ plain form
14277 -197938 -139126 -116320 -173315 -178776 -156599 -149308 -133940 -160513 -287101 -334792 -284008 -235455
14265 -235455 -124811 -49341 75045 161971 214001 121458 -57839 -54278 10741 -72928 -264503
14254 -264503 -295504 -283750 -171056 69341 143346 126173 -4720 28693 28394 160854 112032
14243 112032 66754 82505 38993 40839 -63393 -127770 -141868 -139002 -262305 -212719 -132799
14232 -132799 -8283 -22537 -100119 -293856 -297472 -166276 -120034 14963 -32264 -106770 -50215
14221 -50215 641 -73319 -117823 -104104 -106022 -76723 11455 8488 65875 -71361 -119422 -78548
14209 -78548 -3380 92879 119799 16091 -48975 -91112 -65061 -122974 -138810 -86558 -118803
14198 -118803 -21315 113851 100261 85404 152699 27047 -52240 -35561 -83583 -152023 -202943
14187b02943J04627P8737O4620j29037J0172J7469J00612m7938o9768n6631n0578
14176a80658Q4383J5033J06450J53933r94j87015o8647J74067j4389J3767m1488
14165E4442r7381j16991l7749Q7725L3414M885m8149n3303J01235R1925N406n8278
14153c2819O9160r4196n2738j8849O8630J70627r4356q6879l5102p2961m1690
14142b21173M1989Q6574Q2691j634K0624J1634m8209N843J36321k7148p9666l4511
14130b6665m0275J70o5773m956p3666m3086L3200Q5232J30710L4728l9408j6745
14118b6534L2391L3857J20446p8419r9735p9476q2706L4250J38782m3810m0747
14107i1701J6836K5779k2809P4733J58960J8921m4577r1053l8676M5994J3978
$$ plain form
14187 -202943 -98316 -19579 45041 -83996 -73824 -56355 44257 -3681 -73449 -130080 -180658
14176 -180658 -96275 -81242 25208 179141 178147 -8868 -77515 96552 82163 95930 54442
14165 54442 -42939 -159930 -197679 -109954 -76540 -71655 -119804 -173107 -71872 20053 25459 -32819
14153 -32819 36341 -57855 -110593 -129442 -60812 109815 15459 -71420 -106522 -179483 -221173
14142 -221173 -179184 -92610 -9919 -11553 9071 20705 -27504 -21661 114660 87512 7846 -26665
14130 -26665 -66940 -66770 -132543 -137499 -211165 -254251 -221051 -135819 -5109 29619 -9789 -26534
14118 -26534 5857 39714 160160 81741 -17994 -97470 -180176 -145926 -7144 -50954 -91701
14107 -91701 -74865 -49086 -71895 2838 161798 180719 136142 45089 6413 52407 66385
14096F6385l1216r1971m2510P9778J41878j0861n7379p882k17301M8729P557L7416
14084g7377L7548m6794j29754l4874o2945K7290J78103P4012j2769Q3137l9890
14073d313j6694p6912l7552l8455J49081K0421P9950J2202p1375n2196j0372N3554
14061G339k4226P4987K7505n8204p1348j90082P0281Q7623k799j7016J47935M5196
14049I7191j09039j11059J21224J0021r5782J5539q188n8881k8120J03127O0523
14038c444q2986k3924L8597K1840O1330J678l3967j29420L9724K1953J6087M6761
14026b5771q9403n4297J36971J37490m2739L4783m4992k6762k8856j085R7843
14015I3182j02234j39573Q4035R6030j81120j4762J54590R4131j40769q4149J8403
$$ plain form
14096 66385 35169 -56802 -99312 -19534 122344 111483 54104 46222 -171079 -122350 -114793 -77377
14084 -77377 -39829 -86623 -216377 -251251 -314196 -286906 -108803 -34791 -47560 35577 -4313
14073 -4313 -21007 -97919 -135471 -173926 -24845 -4424 75526 87728 16353 -35843 -46215 7339
14061 7339 -16887 58100 85605 27401 -43947 -234029 -163748 -76125 -78924 -95940 51995 97191
14049 97191 -11848 -122907 -1683 8338 -87444 -71905 -80093 -138974 -167094 -63967 -3444
14038 -3444 -86430 -110354 -71757 -49917 11413 13091 -20876 -150296 -110572 -88619 -72532 -25771
14026 -25771 -115174 -169471 -32500 104990 62251 97034 52042 25280 -3576 -4661 93182
14015 93182 -9052 -148625 -64590 31440 -149680 -164442 -9852 84279 -56490 -140639 -122236
14004a22236L2300N7038O4997K72j08687j8787M3123J9116k7182J27287l9720
13993B7521l0794N8591M4543n6924J0941q9621j8755m9311o4024o8361L0146R1287
13981a14761N377r7317m1603N1749m4488M4333M1178j59984o8056J51473Q4691
13970a47408M3643j0280k1449m881Q1378k0088J6446q474o399l5927n4676J59087
13958i028Q3931J5787j18325j2190R051M1544n3230l3398J08999J06600M5128
13947A84869n7647N1888p4588R601K3754K6561l0291k46572m9236J0891k6029
13936a76799q7252K2927P1604Q8305R0456J60494m9765j17458k1339R4102M0689
13925A15964p0797j2816N3898N7808q3980j40149j2166p5621J2636J59293O7676
$$ plain form
14004 -122236 -89936 -32898 32099 32371 -76316 -95103 -51980 -32864 -60046 67241 27521
13993 27521 -3273 55318 99861 42937 53878 -35743 -54498 -103809 -167833 -236194 -206048 -114761
13981 -114761 -109384 -206701 -248304 -196555 -241043 -196710 -155532 -315516 -383572 -232099 -147408
13970 -147408 -103765 -114045 -135494 -140375 -58997 -79085 -62639 -71113 -77512 -113439 -168115 -9028
13958 -9028 74903 90690 -27635 -39825 -30774 10770 -42460 -75858 33141 139741 184869
13947 184869 127222 179110 104522 114123 137877 164438 134147 -112425 -161661 -150770 -176799
13936 -176799 -264051 -241124 -169520 -81215 9241 169735 119970 2512 -18827 75275 115964
13925 115964 45167 32351 86249 144057 60077 -80072 -92238 -167859 -155223 4070 71746
13914G1746N8753j5856o7699j1329o7829N8479k5752l6235o2174P332O4178k2190
13902d8576P1716N0825n2974k4649o031R4113K6034k0506j20650r2618O5963L8612
13890a8741K864l4796N818L1130j6275m9289j7564M463K5449m9337N682P4792
13878c5804L0718Q3713k4307j56602j0283R8059m7959j36298q5296P6325R0903
13867a16831O1814n806N674L784P1161O9766L524j21236j00203K8631O9946L1102
13855A326O8503m5761l5602j15753o402M2857K8640O1447M371L9385k5486J4179
13843C1704P877j2736j5594J7586K6639j2176n8350p5285R5739q9633j5728j1641
13831a11598N2042O5632j70275o0230k4927P1119L9026M5739k4494J0231J12138
$$ plain form
13914 71746 130499 114643 46944 35615 -32214 26265 513 -35722 -97896 -90564 -26386 -48576
13902 -48576 23140 73965 20991 -3658 -9689 84424 110458 89952 -30698 -123316 -57353 -18741
13890 -18741 -15877 -50673 -44855 -13725 -30000 -79289 -96853 -92390 -66941 -116278 -110596 -35804
13878 -35804 -5086 78627 54320 -102282 -112565 -14506 -62465 -198763 -284059 -207734 -116831
13867 -116831 -55017 -60823 -55149 -51365 19796 89562 93086 -28150 -128353 -99722 -29776 1326
13855 1326 69829 24068 -11534 -127287 -133689 -90832 -62192 -745 3626 43011 17525 31704
13843 31704 39581 26845 11251 28837 55476 43300 -15050 -90335 5404 -84229 -99957 -111598
13831 -111598 -59556 6076 -164199 -224429 -249356 -178237 -139211 -93472 -117966 -107735 4403
13820D403n3870p2J16523N6679o1103N7727m4816Q4722j9119j67950n7849N9236
13808b5489J8506o0671l6990R4978j15078j30321o3466L6176J65025N5212k0194
13797h2312r9268l8467P3992N1297R331J8180o295O0166j1684m2186m1353j4002
13785a22601j05370R1352l6174n1666J132N2649N3852L0943p3835m3370Q4689
13774a18399J7724L6189n0400m4208l7353M6702J59142O264j0793p3667r8431
13763a67230N3258J27361Q6472j1207m7690l4243n8719m31R0857n6977R707Q3145
13751G4303L0034j0591p6203K2093j44190Q8596k930o8371l0695J17867r800P2216
13739F2329K1085N3555k6662m821j59228n6424q725l766j4036N0642N8733m8203
$$ plain form
13820 4403 -49467 -49539 66984 123663 62560 120287 75471 160193 141074 -26876 -84725 -25489
13808 -25489 -6983 -67654 -104644 -9666 -124744 -255065 -318531 -282355 -117330 -62118 -82312
13797 -82312 -181580 -220047 -146055 -94758 -85427 -67247 -73542 -13376 -25060 -67246 -108599 -122601
13785 -122601 -227971 -136619 -172793 -224459 -223327 -170678 -116826 -85883 -159718 -203088 -118399
13774 -118399 -100675 -64486 -114886 -159094 -196447 -149745 9397 15661 4868 -68799 -167230
13763 -167230 -113972 13389 99861 88654 40964 6721 -51998 -52429 38428 -18549 -8842 74303
13751 74303 104337 93746 17543 39636 -104554 -15958 -18888 -87259 -117954 -87 -9887 62329
13739 62329 83414 136969 110307 105486 -53742 -110166 -118891 -122657 -136693 -86051 -27318 -75521
13727g5521r3851l4045K6516O7253P0566n8967o6235p5503J00423J00111p1773
13716a11026l9871k779k5242L6175M9893J37113q5566p1200L6494O7041o745o0096
13704g5809n6830O5294Q2299p7497L3074J5882j4564m788n0765L051N6746J13037
13692H9130J25669L0542k16587j12709L7356K1070M2386j4681j80058k6520l9922
13681b44324J7330J01287P1826P9637J8467M931O433K5899m3820k0118m1863p2767
13669i7082j35023N8258J38126n2075m6372K3073J19915J07082J356k9362j8003
13658F9893j19688j17394j64511m6877j8750J10915K20937L3250P7833k9089p1863
13647e5344N9659O0830m2722p8780k5638J34771L120J3234l3723N9620J8925j22682
$$ plain form
13727 -75521 -169372 -203417 -176901 -109648 -39082 -98049 -164284 -239787 -139364 -39253 -111026
13716 -111026 -150897 -153676 -178918 -142743 -92850 44263 -41303 -112503 -76009 -8968 -15713 -75809
13704 -75809 -132639 -67345 14954 -62543 -29469 -13587 -28151 -32939 -83704 -80653 -23907 89130
13692 89130 214799 245341 28754 -83955 -46599 -25529 16857 2176 -177882 -204402 -244324
13681 -244324 -226994 -125707 -53881 25756 44223 49154 55587 81486 37666 17548 -24315 -97082
13669 -97082 -232105 -173847 -35721 -87796 -134168 -111095 8820 115902 117258 87896 69893
13658 69893 -49795 -167189 -331700 -378577 -397327 -286412 -65475 -32225 45608 16519 -55344
13647 -55344 4315 65145 22423 -56357 -81995 52776 55896 69130 35407 95027 113952 -8730
13635h730q4055N0457J02916J59809k0053p5994m2315N7604K6191L6519k1863
13624A80486n5913r125k2355l953q6590n2770P7009n202K573m6076R60j15887
13612a36843R049N5284M2062Q412l4143M4023P4188J4907l9154K5868J3269j21240
13600d4318j22020K7755J35093r9124K2671Q2602j2714J1425J25435M1282q3841
13589H4246O9105j05798J3292N6425m9699l9477l2152j22582k0166J27359P2032
13578E2585M0787p6709q1484m2539n7431P575K6634p7726M1412J12192P6887k9078
13566f895k8641m8808J0891N3701O8606L4587Q1377r3602l8918m7021j25062M4764
13554i5021m436N1945J6242M65K2737P3086j05564k3476R2093j6151n9410O4170
$$ plain form
13635 -8730 -92785 -42328 60588 220397 200344 124350 82035 139639 165830 202349 180486
13624 180486 124573 115448 93093 89140 2550 -50220 26789 21587 24160 -21916 -20956 -136843
13612 -136843 -127794 -72510 -30448 -22036 -56179 -12156 62032 76939 37785 63653 76922 -44318
13600 -44318 -166338 -138583 -3490 -102614 -79943 2659 -10055 1370 126805 168087 84246
13589 84246 153351 47553 60845 117270 67571 28094 -4058 -126640 -146806 -19447 52585
13578 52585 93372 16663 -64821 -107360 -164791 -157216 -130582 -208308 -166896 -54704 22183 -6895
13566 -6895 -35536 -84344 -73453 -19752 48854 83441 164818 71216 32298 -14723 -139785 -95021
13554 -95021 -99457 -47512 -31270 -30805 -8068 65018 -40546 -64022 28071 11920 -47490 16680
13542A6680M1710M6493m5741R6103K2792j72698o1839m1356j25804M5753K8411
13531a49496P6334l7564M6271n4206L0663N5253j17591K6849J04027N1840M1312
13520G3692J15222p4794j24869o500K3054m1493K976r1173J18032J44117L8097
13509A76361j75008j17584n3861N6599P3299K7836k4293n8321j0625J4734o9808
13498a60671k2509M0501j8803M2669n9197K5394J38103J21538L7880r8714P639
13487E3830J45370j7022N3711p7360j35732q2277J12129L7914q4961j17522L882
13476a08038o825m0101p2876n4326n0269J13710L9890N451J13363o7270p4334
13465b01625M0182O3832K04849M5408m8104r9791j43037N37Q8387M954j0199o5974
$$ plain form
13542 16680 58390 104883 59142 155245 178037 5339 -56500 -97856 -223660 -177907 -149496
13531 -149496 -73162 -110726 -64455 -118661 -87998 -32745 -150336 -123487 -19460 32380 73692
13520 73692 188914 114120 -10749 -17249 5805 -35688 -32712 -123885 -5853 138264 176361
13509 176361 1353 -116231 -170092 -113493 -40194 -12358 -36651 -94972 -105597 -90863 -160671
13498 -160671 -183180 -142679 -161482 -118813 -178010 -152616 -14513 107025 144905 46191 53830
13487 53830 199200 182178 235889 158529 22797 -59480 52649 90563 5602 -111920 -108038
13476 -108038 -114863 -154964 -227840 -282166 -332435 -218725 -178835 -173384 -60021 -127291 -201625
13465 -201625 -161443 -97611 107238 152646 104542 4751 -138286 -137749 -49362 -44408 -54607 -120581
13453a20581J934M6061J3082n2684M5993J84160N0950m7398r393L9189m9867m5823
13441E5623O1153O3967o7366k8677J8637M549p4285o0700L2601J0863J07848K2071
13429A46284P2270Q5888L8600r3617n0552j15684j1164P2373J4324J31524P9793
13418C70039N5216r8086k6790m0327m6026J32785q0064j04079j5324J16643j8430
13407B45557j35296o1707P0863k9711k8842p6215q0070l1569J44107J0431j4296
13396A3252K6823l1001m6219q2592K7470M0137M0142q2364p7800j10851M5181
13385b37822M4694O5538q4930N4945P1111m8818m2556J01440K5403K7016K6810
13374B831j0610l9532j05410m8659J42416k1638l9347O0606J40345l1692n7403
$$ plain form
13453 -120581 -118647 -72586 -59504 -112188 -66195 117965 168915 121517 112124 151313 101446 55623
13441 55623 116776 180743 113377 84700 103337 107886 33601 -27099 5502 16365 124213 146284
13429 146284 218554 304442 343042 249425 198873 83189 72025 144398 158722 290246 370039
13418 370039 425255 327169 300379 260052 214026 346811 266747 162668 147344 263987 245557
13407 245557 110261 48554 119417 89706 60864 -15351 -95421 -126990 17117 27548 13252
13396 13252 40075 9074 -37145 -119737 -92267 -52130 -11988 -94352 -172152 -283003 -237822
13385 -237822 -193128 -127590 -212520 -157575 -86464 -135282 -177838 -76398 -50995 -23979 2831
13374 2831 -7779 -47311 -152721 -201380 -58964 -80602 -119949 -59343 81002 49310 -8093
13363h093N6095k9040q3526R729j8982j9905q0079N7520R1048m2955n8714K2719
13351a04183P4631K1212p2821j44046j37759J19787J87151J3413j34290J9089
13341a57816K2303j29586j31854L0312M5486M9421M6777J26822J7221l8921p1841
13330a91676l3688p4323P7190J19389K4444J1364O9490L8110p7682p7205o2679
13319a77266L8152Q0898L2397Q2398n0161j81712j8488K3232J5310N5539K0505
13308g9196M0176q1494P207m2801J54843M9635j50917m1643L9398o4290l1560
13297b00642J07215N7695j14844k5560K6650M3486R1608j399r1922p9629L4798
13286a52544N1410j0771q977N6967P76n5329o1899o750k5158M4480J3343P5468
$$ plain form
13363 -8093 48002 18962 -64564 -54835 -73817 -93722 -173801 -116281 -25233 -68188 -126902 -104183
13351 -104183 -29552 -8340 -81161 -225207 -362966 -243179 -56028 -42615 -176905 -157816
13341 -157816 -135513 -265099 -396953 -366641 -321155 -271734 -224957 -98135 -80914 -119835 -191676
13330 -191676 -225364 -299687 -222497 -103108 -78664 -67300 2190 40300 -37382 -114587 -177266
13319 -177266 -139114 -58216 -25819 56579 6418 -175294 -193782 -170550 -155240 -99701 -79196
13308 -79196 -39020 -120514 -113307 -156108 -1265 48370 -102547 -144190 -104792 -169082 -200642
13297 -200642 -93427 -35732 -150576 -176136 -149486 -106000 -14392 -15791 -107713 -187342 -152544
13286 -152544 -101134 -111905 -120882 -63915 -63139 -118468 -180367 -187117 -212275 -167795 -154452 -78984
13274g8984K2211m796M4657M1223l0830r3967j1601R3469J30617K4557J0732m309
13262A42979j02788j35671m6880M3858J12355J0611q8296L5681k1179l2103l3688
13251a15121R1970K21075R8899j76153r3629J1340l2578l2409Q335R226L1838
13240B2793k1552O48P9112k3605k266q780l5053j35881J5316J5961j18940O1705
13228a50542o284L4220o0869j71402j46671J09107J53007J2367R9137N5837l1354
13217a03447r228K1856p8813J2506M7054L2504m2596m1821Q6642p9378k8393Q5677
13205i7437l6131R9548Q4171o0521j2790j0080J3913q7875j40504j59691P2126
13194c35271J55497J38470J14195L4507m6461J4463L9468q7275j97596j40192
$$ plain form
13274 -78984 -56773 -61569 -16912 24311 -6519 -100486 -112087 -18618 111999 136556 147288 142979
13262 142979 40191 -95480 -142360 -98502 13853 24464 -63832 -28151 -49330 -81433 -115121
13251 -115121 -23151 197924 296823 120670 27041 38381 5803 -26606 -18271 -9045 22793
13240 22793 1241 1889 81001 57396 55130 46350 11297 -124584 -109268 -93307 -212247 -150542
13228 -150542 -156826 -122606 -183475 -354877 -501548 -392441 -239434 -227067 -127930 -72093 -103447
13217 -103447 -112675 -90819 -169632 -157126 -110072 -77568 -120164 -161985 -75343 -154721 -183114 -97437
13205 -97437 -133568 -34020 50151 -10370 -23160 -33240 -19327 -107202 -247706 -407397 -335271
13194 -335271 -179774 -41304 72891 107398 60937 75400 114868 27593 -170003 -310195
13184c10195J26688J86086R3499M7520Q031N339n6102j41994k7719j79237k4394
13173b72478R4225O8871l5828K8098l3245o0822J15695O2592O7910L215j07522
13162f9289m9548k063l6265m3707N1220J36627m9167n8353l6969J97414k2552
13151A7348K9877p8503p1345P2563j56357j9602k32q56m8446J6403O7194J10186
13139f1770L8203k0284J15898N7927p6853p3538j3941P1974m6882j5203K7821
13128C352r4128N2419N9227n7140j8252l7120l0759j35281p0470J01326O2391
13117a64435l9141J63078k550j00971J00349P4555J1494K2741k6347j6394j7750
13106D629P1592j064m7869r615l7049Q9552J15579m6793o9128k2806k9686J4813
$$ plain form
13184 -310195 -183507 2579 96078 143598 151629 156968 100866 -41128 -68847 -248084 -272478
13173 -272478 -178253 -109382 -145210 -117112 -150357 -211179 -95484 -32892 35018 38233 -69289
13162 -69289 -118837 -120900 -157165 -200872 -149652 -13025 -62192 -120545 -157514 39900 17348
13151 17348 47225 -31278 -102623 -30060 -186417 -206019 -206251 -207107 -255553 -239150 -171956 -61770
13139 -61770 -23567 -43851 72047 129974 53121 -20417 -34358 37616 -9266 -24469 3352
13128 3352 -90776 -38357 20870 -36270 -54522 -91642 -122401 -257682 -328152 -226826 -164435
13117 -164435 -203576 -40498 -43048 -144019 -43670 30885 42379 65120 38773 22379 4629
13106 4629 76221 75157 27288 17673 -19376 70176 185755 138962 69834 47028 17342 32155
13094C2155n3402j16491K7910K2631q1308m028L6320P0251k9168K8796L2802J18951
13082H5419j3388j10287Q773L8227L0135j01103r0630O3383K8999k7877J30552
13071D2203R5086J7040O6456j41305r9873o6639n0292M5127M7973k444P5154j01586
13059g3100j4492j6314m7628l8076L6260J8451p1700J01765J13339N5731j18794
13048e4558K6862J09334R3241j18531j20590J8197J8476k5020N5819l4949j08433
13037a40152j09095L3662N5306J07126M4972j4099K7923q340J53301J55710m1289
13026B65025P84r2315j58931l7742k8326q157l9697J8750J2377L1429L2734O8958
13014F4889m8420p9021n8038l288p7895O3268M3581L4058J64123J4199r0481Q647
$$ plain form
13094 32155 -21247 -137738 -109828 -87197 -168505 -172533 -136213 -65962 -95130 -66334 -33532 85419
13082 85419 72031 -38256 -29483 8744 38879 -62224 -152854 -89471 -60472 -88349 42203
13071 42203 137289 154329 220785 79480 -20393 -87032 -137324 -92197 -44224 -46668 28486 -73100
13059 -73100 -87592 -103906 -151534 -189610 -153350 -134899 -206599 -104834 8505 64236 -54558
13048 -54558 -27696 81638 174879 56348 -64242 -46045 -27569 -52589 3230 -31719 -140152
13037 -140152 -249247 -215585 -160279 -53153 -8181 -22280 5643 -2697 150604 306314 265025
13026 265025 265809 173494 14563 -23179 -51505 -59662 -99359 -80609 -68232 -36803 -4069 64889
13014 64889 16469 -62552 -120590 -123878 -201773 -138505 -94924 -60866 103257 117456 26975 35622
13002C5622n3804r3543p2175K1360L9471O6078O3326n4516O1548Q8426N7305k5371
12990A33727o3635l9562j3092j40569Q8504J14663N0338Q2396J84823n7140j08907
12979B31546n3472N148P180N1471l7367q2566Q3962l6053n5723j83501j39738
12968b09113m5991p8433R8756J49904p106L7958j72848L1629J96163o54m7315
12957d7050q7392K3746K3016k1186j6621Q5200J5554P8502l8006j29374K1581
12946i2030J33389m4293Q8409Q9041N5225p6757n7692M3142J48363P3460k7774
12935C32483j25816m3303n7593o701L6471r7590m1971o8264M5664Q4460J16981
12924A74821n6936j09530k9313K1896l6710o6823J22144R1947J0793j56587j51046
$$ plain form
13002 35622 -18182 -111725 -183900 -162540 -123069 -56991 6335 -48181 13367 101793 159098 133727
12990 133727 70092 30530 17438 -123131 -34627 80036 130374 212770 397593 340453 231546
12979 231546 178074 183222 190402 241873 204506 121940 205902 169849 114126 -69375 -209113
12968 -209113 -255104 -333537 -234781 -84877 -91983 -54025 -226873 -195244 919 265 -47050
12957 -47050 -134442 -110696 -87680 -108866 -125487 -40287 -24733 53769 15763 -113611 -92030
12946 -92030 41359 -2934 85475 174516 229741 152984 95292 138434 286797 360257 332483
12935 332483 206667 163364 105771 99070 135541 37951 -4020 -72284 -26620 57840 174821
12924 174821 117885 8355 -20958 938 -35772 -102595 19549 111496 122289 -34298 -185344
12913a85344Q9074K9100N5456K8965Q9298l5480o3813P1307N2622J350n7831m682
12901G0022K7049q8104n6046O7257k6761q018J15946J13825j24133k5837j554
12890F3646k7836J1455L5707K7815Q2291n3551L1473N2405q0137r0865r5302j04842
12878a47741L8651k2641k2259N5979M1878L1825O841K6210Q298n8662n0291n8981
12866a50893m9005o6542j8054J36991M2102N8218m8578o3525j6885N4728r607
12855a31050J24359j3033K3135l5728k8375L3036O7079k3479j3495J2781o8169
12844e2939m29j19552j20979n0323M310K7324J09675Q2781P2632j2400J4591n997
12832e1306o9564j47180J0591J02199J28656N3844r3090j05786K3115L4542J46230
$$ plain form
12913 -185344 -96270 -67170 -11714 17251 106549 71069 7256 78563 131185 132535 74704 70022
12901 70022 97071 8967 -47079 20178 -6583 -14601 101345 215170 91037 65200 63646
12890 63646 35810 47265 82972 110787 193078 139527 171000 223405 143268 52403 -42899 -147741
12878 -147741 -109090 -131731 -153990 -98011 -56133 -24308 -17467 8743 17041 -41621 -91912 -150893
12866 -150893 -199898 -266440 -284494 -147503 -105401 -47183 -95761 -159286 -176171 -121443 -131050
12855 -131050 -6691 -19724 3411 -32317 -60692 -27656 39423 15944 2449 15230 -52939
12844 -52939 -53368 -172920 -293899 -344222 -339912 -312588 -202913 -120132 -47500 -59900 -45309 -51306
12832 -51306 -120870 -268050 -257459 -155260 -26604 27240 -65850 -171636 -148521 -113979 32251
12821C2251O9874p8477j60208j34942m7649J77285J63703l6631l6236n582K5898
12810c0714p8263O7454N4922p5596j3813Q2244j40703j03672Q1541J4158R5988
12799d6454o8234n882k6611q0256J31565J27339j31337o0580L1928J10234K1895
12788C607j11844l6516L4736J04305j1520l2850j83399l6790R954o7430N3883
12777b73864O7691N6031L9349J17813n3261J0744K7661K9315J10892j69890j72399
12766b09918l7161J41513Q6023J13574m3302o3480k4940J2713J34032n105j01762
12755B187j317L2035n0944j08078k5215Q6571k1017l3674k0893k57q535J26358
12743b2779Q8305n5849q2204r4384P4894L8258p4890p2710K0076Q2472k5461N4331
$$ plain form
12821 32251 102125 23648 -136560 -271502 -319151 -141866 21837 -14794 -51030 -56612 -30714
12810 -30714 -108977 -41523 13399 -62197 -76010 6234 -134469 -238141 -156600 -142442 -46454
12799 -46454 -114688 -120570 -147181 -227437 -95872 31467 -99870 -160450 -128522 -18288 3607
12788 3607 -108237 -144753 -110017 -5712 -17232 -50082 -233481 -270271 -260317 -327747 -273864
12777 -273864 -206173 -150142 -110793 7020 -46241 -35497 -7836 21479 132371 -37519 -209918
12766 -209918 -247079 -105566 -19543 94031 50729 -12751 -37691 -24978 109054 103949 2187
12755 2187 870 32905 -18039 -126117 -151332 -64761 -85778 -119452 -140345 -140602 -149137 -22779
12743 -22779 65526 9677 -72527 -166911 -92017 -53759 -128649 -201359 -181283 -98811 -124272 -69941
12731f9941R3734m5410q6848j8078Q8610K2220n6556M6469k185O7207n8406k8745
12719d7929L0980n9313J1722J07360R857o2418k0540j2515k02465l2591J28234
12708a49618Q9789L0221m051l4655n2026k444R6723O632q3505O0253O2633r7804
12696g7852n6665o853n904O6950n6222N4546M3928l6116L4857M7942k2479m3166
12684e7034J806R7859M8736k4384M2656N816j01093o374o7247j15242j2010k1373
12672b07884Q4962M0768K2165p1525r9966K4444k6841L9609J13660K16711L9275
12661A75378n9678J556o9251j26203j09375j3967p226j06278p1866M2556K70186
12650g4168J7200j46220k6877m690J02220j6463j8800Q9422K0374J9977L7046
$$ plain form
12731 -69941 23793 -21617 -108465 -126543 -37933 -15713 -72269 -25800 -27985 39222 -19184 -47929
12719 -47929 -16949 -76262 -64540 42820 52677 -9741 -30281 -42796 -245261 -277852 -149618
12708 -149618 -59829 -29608 -33659 -68314 -120340 -122784 -26061 -19429 -102934 -42681 19952 -77852
12696 -77852 -134517 -141370 -147274 -80324 -136546 -82000 -38072 -74188 -39331 8611 -13868 -57034
12684 -57034 -55228 42631 91367 66983 109639 115455 14362 7988 -59259 -174501 -186511 -207884
12672 -207884 -122922 -82154 -59989 -131514 -231480 -207036 -233877 -194268 -80608 136103 175378
12661 175378 115700 117256 48005 -78198 -187573 -201540 -208766 -315044 -386910 -344354 -74168
12650 -74168 -56968 -203188 -230065 -234755 -132535 -148998 -167798 -78376 -58002 -38025 -979
12639i79o6981j37061p1466J2453N3747J73627L371j17031k1854J48686J5238
12628h250j15616N5821n4526j0995P2011P016M2384O4706l3302N4606l9448n9612
12616b5205j09597R5723L5871q0638k1251k5423M7111P0083n666J8653O7416j6282
12604E0795L684K19278N012j50073m4186j14766q0861l7182M7892l0108o9092
12593a99607P8192N6261K7979O8968o033j35776j19934K45111J97951r2798r3331
12582B6983K4988M1283L8913J0228k7723O0990r2884q6422k1534q0034q1734m762
12570a91708k8298k732j8876l7122j14396r2412J01785J99471Q1122Q6597r2923
12559a09492o2523J5873L209k8536Q0198L5894K4732J3623L9660J17441O0042
$$ plain form
12639 -979 -67960 -205021 -276487 -264034 -210287 -36660 -33289 -150320 -172174 -23488 -8250
12628 -8250 -123866 -68045 -122571 -133566 -61555 -54539 -12155 52551 19249 73855 34407 -25205
12616 -25205 -134802 -39079 -3208 -83846 -105097 -130520 -83409 -13326 -18992 -339 67077 50795
12604 50795 54479 273757 278769 128696 84510 -30256 -111117 -148299 -100407 -130515 -199607
12593 -199607 -121415 -65154 -37175 31793 25760 -110016 -229950 15161 213112 120314 26983
12582 26983 51971 93254 132167 142395 114672 175662 82778 -3644 -25178 -105212 -186946 -191708
12570 -191708 -220006 -222738 -241614 -278736 -393132 -485544 -383759 -184288 -103166 -16569 -109492
12559 -109492 -172015 -156142 -152933 -181469 -101271 -65377 -40645 -27022 12638 130079 190121
12548A90121n4487k9173o6221j30286o2809R5325M8535j21370n1940j9949r7048
12537b99302j14662O3571K5631N324R5727l0804J16323P0438m381P0911j1925
12526a3149o715J0399J419k6538J41294J9613j22148q6677P851N7969L0282L8697
12514E2297N107o0739p7357p044p7198J3637m0051J25334J32245o2668N170J9503
12502B8236j00864q0954K2860L766J01997N4650M3415p9948p5943n456j3148j2138
12490a13527J46876p2486n0198J6174L9541M6534l4605m0427J8302Q652p7282
12479a12446r9241J8143N7694n3486j5796R0683n5287r9031M2344L2727N7069
12468a36627R9495J65213R9545p3267q3346j28666N4528K9987q6303j770P0098
$$ plain form
12548 190121 135634 106461 40240 -90046 -152855 -57530 -8995 -130365 -182305 -202254 -299302
12537 -299302 -413964 -350393 -324762 -319438 -223711 -254515 -138192 -67754 -72135 -1224 -13149
12526 -13149 -19864 -9465 -8046 -34584 106710 126323 4175 -82502 -74651 -16682 13600 52297
12514 52297 57404 -3335 -80692 -87736 -164934 -151297 -191348 -66014 66231 3563 8733 28236
12502 28236 -72628 -153582 -130722 -126956 -24959 29691 73106 -6842 -82785 -88241 -101389 -113527
12490 -113527 33349 -39137 -89335 -73161 -33620 12914 -21691 -62118 -43816 -35164 -112446
12479 -112446 -211687 -193544 -135850 -189336 -205132 -114449 -169736 -268767 -226423 -193696 -136627
12468 -136627 -37132 128081 227626 154359 71013 -57653 -3125 26862 -59441 -61211 8887
12457H887L8639o0601j56824j4778K5190j13916j24180N4699K141Q8685J25028
12446a27030L9035m6347j09069Q6895R3821K1946P1899j0351k5537K3697l1091
12435a2132j0616K709M2538L3661m5882O9025m0600k5836j658N1038J19851l3150
12423A48948r6377O9608J19979r9426j29855O1919m9366p7804p8011K837M9185
12412g8363j7353N0610J06457n642n8970J0802N7336j40657j55737j9308J07677
12401a43148J21414p5726q59n514k022J05191J3145j04876j51960L3273N5262
12390a55820l5609m4242m960J64956J19328j15708k7813O6717M0026j6190m8055
12379e7370N1733r2766p4046L4581K7221m4828P7543J24381O9009M6449q8539
$$ plain form
12457 8887 47526 -13075 -169899 -184677 -159487 -273403 -397583 -342884 -340743 -252058 -127030
12446 -127030 -87995 -134342 -243411 -156516 -62695 -40749 31150 20799 -4738 18959 -12132
12435 -12132 -22748 -20039 22499 56160 10278 79303 38703 12867 11209 62247 182098 148948
12423 148948 52571 122179 242158 142732 12877 74796 25430 -52374 -130385 -127548 -78363
12412 -78363 -95716 -45106 61351 55709 -3261 7541 64877 -75780 -231517 -250825 -143148
12401 -143148 -21734 -97460 -98319 -103833 -105855 -664 12481 -92395 -244355 -211082 -155820
12390 -155820 -191429 -235671 -240631 -75675 43653 -72055 -99868 -33151 6875 -9315 -57370
12379 -57370 -5637 -98403 -172449 -137868 -110647 -155475 -77932 46449 115458 161907 73368
12368G3368j30531m9500N8822j3179N4573k8029p8709q5424k3392J44877P5634
12357a490J38769L7577o5899J1405P5350k2442J1065j16377j15173o2544R9920
12346i839o506K8976M7039m8361K0661n8662J03002L9213O0575k7265L1800m4321
12334A36312o4812j4887L2464m5635m7759j23299o5864Q4254N7598Q318R066N342
12322b8902l0398O988m3039o6362m1913R115J04877J4896p571j44740n2724L3211
12310b46562P8027J3887l0024n4857K7844J84477J355K0797M542k10375n9432
12299b70321P1544O830Q559J2790N4408L0251P5419J2397o493k0876L274m2030
12287f4248J6614Q2015O7274P255j03319m4813P8986J7544j34687j23018N4336
$$ plain form
12368 73368 -57163 -106663 -47841 -61020 -6447 -34476 -113185 -198609 -222001 -77124 -1490
12357 -1490 137279 174856 108957 120362 195712 173270 184335 67958 -47215 -109759 -9839
12346 -9839 -16345 12631 59670 11309 31970 -26692 76310 115523 176098 148833 180633 136312
12334 136312 71500 56613 89077 43442 -4317 -127616 -193480 -109226 -51628 -43310 -34244 -28902
12322 -28902 -59300 -52312 -95351 -161713 -203626 -194511 -89634 -74738 -82309 -227049 -279773 -246562
12310 -246562 -168535 -154648 -184672 -239529 -211685 -27208 -25853 -5056 -514 -210889 -270321
12299 -270321 -198777 -191947 -183388 -170598 -116190 -85939 -10520 1877 -4616 -25492 -22218 -64248
12287 -64248 -47634 34381 101655 108910 5591 -39222 39764 57308 -77379 -200397 -146061
12276a46061Q3432k3726R821J06878J02369n3023j36741J267M3438K3314L7208
12265D8176J4602L142R2297Q3551p2544l1268p9699j00790N2433k0841o2492O3621
12253i812N4753k5256M025P1926L3165m7123k3408o3195J61j8043l6884N8185
12241a506J63431r7607j76533r1593K6784L8425j1599l681J2627Q0759L2695m5398
12229g3196k9384L1489P1907J05860j07719k8971L5877k9649r486P6247O2727
12218A05702j24725k4543J27506o6706p0339J42261M7663L0539m3469k2514L7924
12207A39299Q2768k1832j9824M5995m5324L7568o6498q6493M4354L65m2036Q2149
12195A50491J1030q7369M9930q686n3738J15266J5812L1069J9284Q6229N8919
$$ plain form
12276 -146061 -62629 -86355 -76534 30344 132713 79690 -57051 -55784 -12346 10968 48176
12265 48176 62778 65920 158217 241768 169224 137956 58257 -42533 9900 -10941 -73433 -9812
12253 -9812 44941 19685 23710 95636 128801 81678 58270 -4925 -4764 -22807 -59691 -1506
12241 -1506 161925 64318 -112215 -203808 -177024 -138599 -150198 -153879 -141252 -60493 -27798 -73196
12229 -73196 -102580 -71091 816 106676 -1043 -30014 5863 -23786 -33272 42975 105702
12218 105702 -19023 -43566 83940 17234 -53105 89156 136819 167358 123889 101375 139299
12207 139299 222067 200235 180411 226406 181082 218650 152152 65659 110013 110378 68342 150491
12195 150491 161521 74152 124082 115396 61658 176924 192736 223805 243089 329318 388237
12184C88237P0213J11986J18743j24913j58240m4604j3633j04447j17250q8583
12174C7509o3795l5792N243j0671r853M044p3255R4042K20982J10574M3783p5457
12162B47354l6812j2635j16329J0528j05381J4674q308J9079q4503o0879L2232
12151a00980J37407j4790J5724R6606O688l1110j08803q5000O9692J06638r5761
12140c689q1153J8255L0556M1834O1482L0180m1708j27950m727J27281N7167j9780
12128H7748k3107J3164L2421J7277o9115L9161M5820J09524O516o1876j48351
12117D9182k7565J67352O9998j9769j9037j54261M8395R0377J13614P5830o0714
12106C33402o6801o4161j4441l1254q8624N1455M2391J61232n1969n56R9459j4319
$$ plain form
12184 388237 458450 570436 689179 564266 406026 361422 347789 243342 126092 37509
12174 37509 -26286 -62078 -56835 -67506 -77359 -73315 -146570 -52528 168454 279028 322811 247354
12162 247354 210542 197907 81578 92106 -13275 1399 -6909 12170 -72333 -133212 -100980
12151 -100980 36427 21637 37361 133967 140655 109545 742 -84258 -14566 92072 -3689
12140 -3689 -84842 -66587 -36031 5803 67285 97465 55757 -72193 -76920 50361 107528 87748
12128 87748 64641 77805 110226 127503 58388 97549 143369 252893 259409 197533 49182
12117 49182 21617 188969 258967 239198 220161 65900 114295 204672 318286 394116 333402
12106 333402 266601 202440 187999 156745 68121 119576 161967 323199 271230 270674 370133 355814
12094C55814j67613j97951N6382J03077J50695P1626p9000P3924q2901p7073J24960
12083C31940p904L3110R6911m5817j05913j18678j9202L5206o1963J11876K02776
12072D52342P4620p9734P0365J25051r7113R939o103p4135l4557K1181j2531Q6363
12060E35688P945M8285N6784L137j20427J049j2867k6327K0737k5306L0475J15968
12048F35141P4658m8155j11060j28027M0916n8360o2136J10606q5440o6357q793
12037B92993O3188K0566p3195K2815M1766O0334J41312Q8024j69877o1651J8492
12026D44767J52130Q4997k9099j08599J18359J17538j6676m1766n0770J05621
12016G76502J16157J22052J1995k5670o229n45m9440R5751M8246M492N7478M6090
$$ plain form
12094 355814 188201 -9750 46632 149709 300404 372030 293030 366954 284053 206980 331940
12083 331940 324036 357146 454057 408240 302327 183649 164447 199653 137690 249566 452342
12072 452342 526962 447228 517593 642644 545531 555470 549367 475232 440675 461856 449325 535688
12060 535688 543633 591918 648702 651839 531412 532461 519594 493267 514004 488698 519173 635141
12048 635141 709799 661644 550584 422557 463473 405113 342977 453583 368143 301786 292993
12037 292993 356181 376747 303552 326367 368133 428467 569779 657803 487926 426275 444767
12026 444767 596897 681894 652795 544196 662555 780093 763417 721651 670881 776502
12016 776502 892659 1014711 1026706 1001036 994807 994262 944822 1040573 1088819 1093311 1150789 1196879
12004A196879N7348J15855R4546j3647m4982Q319P9752J12771P1524P3618J50966
11993A902949J33794m2009L286J29758L1417j2387Q0871Q9762R8761N9858K59531
11982B735591K08137O8526L9316j231R2928J74940J73492Q5717K04115P5866K01329
11971D058726K52954L87567K83220K61113K81210K52622K65221L88314L51843
11962F782790L53745M12748M80750N94408O54581O95434P69572R07892Q68270
11953A2520190J015998J276145J430883J469206J790440K075864K391863K677823
11945B6648412L097228L789242M553453N598188O929355Q432514J0696428J3590515
11937H3335335J7243403K2298820K8331678L4750741M0138760M1711960L7492795
$$ plain form
12004 1196879 1254227 1370082 1464628 1450981 1405999 1414318 1494070 1606841 1678365 1751983 1902949
11993 1902949 2036743 1994734 1998020 2127778 2159195 2146808 2227679 2317441 2416202 2476060 2735591
11982 2735591 2943728 3012254 3051570 3050339 3143267 3318207 3491699 3577416 3781531 3857397 4058726
11971 4058726 4311680 4699247 4982467 5243580 5524790 5777412 6042633 6430947 6782790
11962 6782790 7136535 7549283 8030033 8624441 9279022 9974456 10744028 11651920 12520190
11953 12520190 13536188 14812333 16243216 17712422 19502862 21578726 23970589 26648412
11945 26648412 29745640 33534882 38088335 43686523 50615878 59048392 69744820 83335335
11937 83335335 100578738 122877558 151209236 185959977 226098737 267810697 305303492
11930C05303492K7442484J3142702n112328k5238675m0431922m5411134m1805468
11923A87889151l4434626k7034687k0997114j6198731j2535390r960981p935659
11916E8791963o411839n172474m318774l623192l002423k635646k279960k079238
11908B9268417j736025j555091j544018j453348j120127j097941r71904q18834
11900A8971129q71273p28623o06435p79866n82467n84815n90374n08731m06604
11891A3311941n19259m57820m58642n69193o19958m74635m24698n15442m70685
11882H801609m13433l81304m12513l81218k33257k10983k33472k17436k76164
11873F041829k50766k52455k77152j90120j44437p8270k14052o9369k23120j32981
$$ plain form
11930 305303492 332745976 345888678 340776350 315537675 275105753 229694619 187889151
11923 187889151 153454525 126419838 105422724 89223993 76688603 66727622 58791963
11916 58791963 52380124 47207650 42888876 39265684 36263261 33627615 31347655 29268417
11908 29268417 27532392 25977301 24433283 22979935 21859808 20761867 19789963 18971129
11900 18971129 18099856 17371233 16764798 15984932 15402465 14817650 14227276 13718545 13311941
11891 13311941 12792682 12334862 11876220 11307027 10687069 10212434 9787736 9272294 8801609
11882 8801609 8388176 8006872 7594359 7213141 6979884 6768901 6535429 6317993 6041829
11873 6041829 5791063 5538608 5261456 5071336 4926899 4848629 4634577 4565208 4342088 4209107
11863D209107k21603j40067k6029r6190j51080l6050K598o7045p1306k54j13076
11852C289005j64018k36451k9651n3027K367n7036j73877p7279N7270j27428o6123
11841B363752N7093q5631o2835j67135p0753K501K5888n1920j94189j95760J0904
11830A631915J22704R470q2683M375n1805j16508L3751j01714l1933j2455m0006
11819A365111M3155J09706m577N2222k6573j5015J37943j07430j30358r0704j21269
11808A212211j24965L1002J07345Q1356j8534p4201J8137P507K8346N2554J0279
11797A331037p1535q1902q1725j04540P13P669K7694j69244p7j13692j0243R1068
11785H25223N0570m2060r8962j13459o5017R8514R5980o0698j34163j7011k8064
$$ plain form
11863 4209107 3987504 3847437 3821408 3725218 3574138 3538088 3540686 3473641 3402335 3402081 3289005
11852 3289005 3124987 2888536 2858885 2805858 2808225 2751189 2577312 2500033 2557303 2429875 2363752
11841 2363752 2420845 2335214 2272379 2105244 2034491 2036992 2062880 2010960 1816771 1621011 1631915
11830 1631915 1754619 1764089 1681406 1685781 1633976 1517468 1551219 1449505 1417572 1405117 1365111
11819 1365111 1408266 1517972 1513395 1565617 1539044 1524029 1661972 1554542 1424184 1333480 1212211
11808 1212211 1087246 1118248 1225593 1306949 1288415 1214214 1232351 1239858 1268204 1320758 1331037
11797 1331037 1259502 1177600 1095875 991335 992048 999717 1027411 858167 858090 744398 734155 825223
11785 825223 875793 833733 734771 621312 556295 654809 750789 690091 555928 538917 510853
11774E10853q0378o0004p7810R7235M9978P368M7994J17092J9010k7510l1512
11763E72316m6406L9393r012Q797m9665M2654o0921o9189l1952m1196M4811R7262
11751D96892N4493q6855K7203l8646J1846N6839O730M4080j8215m6599j00002
11740D07766k3059j36293k2476J57639j9134j38858m2640k9702L2743J2499k5715
11729A72770k5036M5578k6843J43762k302n3759L6737j5444k4579M4542M1488
11718C36914J7363J19763r789j17094m3438L3360j4971j03647l9163R7169m5222
11707B31245p5029J24320m1753n5637K4886K3056N399o5017K7771r5650j8774
11696H4817J01704N1062O2327J5570q8828j32096J7291L0406P7996R5125j9322
$$ plain form
11774 510853 430475 370471 292661 389896 439874 447242 495236 612328 631338 603828 572316
11763 572316 525910 565303 556291 565088 515423 558077 497156 427967 396015 354819 399630 496892
11751 496892 551385 464530 491733 453087 464933 521772 528502 572582 554367 507768 407766
11740 407766 384707 248414 225938 383577 364443 225585 182945 153243 185986 198485 172770
11729 172770 147734 193312 166469 310231 307929 254170 290907 275463 250884 295426 336914
11718 336914 354277 474040 464251 347157 303719 337079 322108 218461 179298 276467 231245
11707 231245 156216 280536 238783 183146 208032 231088 236487 171470 199241 103591 84817
11696 84817 186521 237583 299910 315480 226652 94556 111847 142253 220249 315374 296052
11685B96052j38801J6619j99R5910P0012M8869R4254N1152n3443j78823j33608
11674A67994k51O5515L2568m5360k2840p908M611Q1901m0463Q793J7204q337o4905
11661A88522J70924J07699q5646k39952o5069O3089J03671Q48p7573O0079J12621
11650C39213N787r6014o0931M5617n2307k8415p4864M4668p2651o5080J17715
11639A02738R5777p7823r6154M9446J335N0396L178l904n2418L7138O8252j0215
11627A67746M7713Q7253M3982J5779q4423n856j01056j20763O8172J34114R6024
11616C48685j0589r311o2657p7880j04262M6635P5514j22717j72406n4045M9854
11605i3179J25415J61479K3807M9385K3067o3203m6915j45192P630N171M5081
$$ plain form
11685 296052 157251 173870 173671 269581 339593 388462 482716 533868 480425 301602 167994
11674 167994 167743 233258 265826 220466 197626 189718 194329 276230 235767 244560 261764 253427 188522
11661 188522 359446 467145 381499 141547 76478 139567 243238 244086 166513 226592 339213
11650 339213 345000 248986 188055 233672 181365 152950 78086 122754 50103 -14977 102738
11639 102738 198515 120692 24538 73984 75319 125715 128893 124989 72571 109709 177961 167746
11627 167746 215459 302712 346694 362473 278050 272194 171138 50375 118547 252661 348685
11616 348685 338096 328785 266128 188248 83986 130621 206135 83418 -88988 -143033 -93179
11605 -93179 32236 193715 217522 266907 289974 226771 179856 34664 42294 47465 92546
11594I2546O2799L0855J07118m2270j31744Q7929o3957J00411K5859j9398L8757
11583B88905l5563J8689j37279j68532o9816l043J21962N7427J38129K9942j38105
11572A02716K2203k3778J24602O8309j6491m7371j39809k8321k2897p7622L6712
11561a747J79950O0140j63230K9334M764M946k6216N4342l3302j03998l0900l1512
11549e7429n7207R4385P7373L2810K9450r0535q0960L9620N1744k7093N790n8770
11537d0822n2168n1060k9121m9594R8158Q3403M6951M7785Q204p7112K2276R9153
11525A06053N1427l9632O0500j2133k06340q2011J06392m6059K7509L3404j34640
11514a35530m9334Q9695K1149P3714J67699k5900k04903Q707P4278j3565K0811
$$ plain form
11594 92546 155345 186200 293318 251048 119304 207233 143276 243687 269546 250148 288905
11583 288905 253342 272031 134752 -33780 -103596 -106639 15323 72750 210879 240821 102716
11572 102716 124919 101141 225743 294052 277561 230190 90381 62060 39163 -38459 -1747
11561 -1747 178203 238343 75113 104447 109211 114157 87941 142283 108981 4983 -25917 -57429
11549 -57429 -114636 -20251 57122 89932 119382 28847 -52113 -12493 39251 12158 17948 -40822
11537 -40822 -92990 -144050 -173171 -222765 -124607 -41204 5747 53532 61736 -15376 6900 106053
11525 106053 157480 117848 178348 166215 -40125 -122136 -15744 -61803 -34294 -890 -135530
11514 -135530 -184864 -95169 -74020 -306 167393 141493 -63410 -54703 19575 6010 26821
11503B6821N7860K7784j3753J8276M7044j5922K061j51302j00211O9846M6192
11492A4696J58879M8173o8457q1860K2752O1907M9052j3440o3332j11429n9108
11481d2167l2847Q9506p0465J24390J64171J8372K7969r8941j26464k2670M251
11470C5105K8430j40455j57946Q6109J68598O7955Q8295O9198j9138p4640r65
11459A50546J10130j21265K0345J6221o1656o3547o0369K8664J9114P7487J00462
11448B16132j72923j04759Q8628P8433K6793m9375j39569N3170P2305o8058o6815
11437f6038M0311J33745J25834m5183j23969p6513m9825P8821K3055r7582N638
11426e1706p1262q222J63188N8757j9752P9545j46014o3074j1417N5460n0121
$$ plain form
11503 26821 84681 112465 98712 116988 164032 148110 150171 -1131 -101342 -31496 14696
11492 14696 173575 221748 153291 71431 94183 156090 205142 191702 128370 16941 -42167
11481 -42167 -75014 14492 -55973 68417 232588 250960 278929 179988 53524 30854 35105
11470 35105 63535 -76920 -234866 -148757 19841 87796 176091 245289 226151 151511 150546
11459 150546 260676 139411 159756 175977 114321 50774 -9595 19069 38183 115670 216132
11448 216132 43209 -61550 27078 105511 132304 82929 -56640 -3470 68835 777 -66038
11437 -66038 -25727 108018 233852 188669 64700 -11813 -61638 17183 40238 -57344 -51706
11426 -51706 -122968 -131190 31998 90755 71003 150548 4534 -58540 -69957 -14497 -64618
11415f4618j5079n1317K10599M275o1057L9660P2679m4579r543o5335o7766P9387
11403B7306L5219Q8045M2846q4156p3204o579n144Q0926j01751J24598J387j65760
11391c6267j12631J28315J7022q8937K000K1163K1950M861R7503R8975M1430q0183
11379A15201n8493J29063N0625j64716p4710J06302J26060J69201j07317j42783
11369A48433k5768p9790r268L9081k7572j0363p7075L0169J02837K4422r5446
11358A9660R050M0042L6123l4566l0318o7132n4829O0851K0646M9877P7370m2506
11346H4268q161l3762n0504p8257J088J42030L8491j11374j24883J2620R6987
11335c1457M4060M9195n8752M8545j6147m6248L9308n2668L9913p3922Q49R2508
$$ plain form
11415 -64618 -79697 -131014 79585 83860 22803 62463 135142 90563 81020 15685 -52081 27306
11403 27306 62525 150570 193416 109260 36056 29477 24333 105259 3508 128106 129493 -36267
11391 -36267 -148898 -20583 -3561 -92498 -90498 -69335 -47385 -42524 54979 153954 195384 115201
11379 115201 56708 185771 236396 71680 -3030 103272 229332 398533 291216 148433
11369 148433 122665 42875 33607 72688 45116 34753 -42322 -12153 90684 115106 19660
11358 19660 28710 68752 104875 70309 39991 -27141 -81970 -21119 -473 49404 126774 84268
11346 84268 76107 42345 -8159 -86416 -85328 56702 95193 -16181 -141064 -128444 -31457
11335 -31457 12603 61798 3046 51591 35444 -10804 28504 -24164 15749 -58173 -57324 35184
11323C5184n734j36329N3678K9915m1780M7266K9030Q6351k3558k5618Q3715R4781
11311B26901j23610n4948O3831k6994m3042P9590N6966j12512K8767J06357M2898
11300B44204p1925j00111K52l4895j3627l3591p3095o407J25138O2423P273J588
11288A07227Q1382l0926j48031l3440M5341m1684O6300k3600n1404J04464N1756
11277A27385n178J0316j28373J7378P7265m6163M412L0648r0342p3025r7713Q47
11265a72543J58972Q7806N2051r0025n4548o6870n3316Q5771J49276P5092K9698
11254B01364j16917O033N8902l5502k8022O2248L4981n2454j27112l8335L2401
11243b413k7862p1701r236m8701k3657Nj0835K2338J67255P8216k9778l9819n9522
$$ plain form
11323 35184 29450 -106879 -53201 -23286 -65066 -17800 11230 97581 74023 48405 132120 226901
11311 226901 103291 48343 112174 85180 42138 121728 178694 66182 94949 201306 244204
11300 244204 172279 72168 72420 37525 23898 -9693 -82788 -89195 35943 98366 105639 107227
11288 107227 188609 157683 9652 -23788 21553 -20131 46169 22569 -28835 75629 127385
11277 127385 122207 132523 4150 21528 98793 52630 57042 87690 -2652 -75677 -173390 -172543
11265 -172543 -13571 74235 126286 36261 -18287 -85157 -138473 -52702 96574 171666 201364
11254 201364 84447 90480 149382 113880 85858 148106 183087 130633 3521 -34814 -2413
11243 -2413 -30275 -101976 -111212 -159913 -183570 -183565 -194400 -172062 -4807 73409 43631 3812 -55710
11230e5710Q8494j09220j80389l7359J73154Q3178q3004O3812O2047P956j757
11219A1202m1295J10493N3617J4369j04628o4002k6383J04909j748o7124J34636
11208A24046L9295j21842m5322j4284o469N315p7887j22340K3815J23260K4803
11197d7610J8727m9364O8581P423P166m761N5486J908j22756j13975J10392J65524
11185I6741l9206N3389j05061j01982M9490Q4425M8043r6703j13916m1150J6650
11174a49280P979J18601K1756o9844J2420Q1256M6101Q1419o1025k05287n8085
11163a73989l360k5839j47780K7495m2915L0827K14079K6665N0933J15979o338
11152F5757q4872o3241K2544M6412K7730j01183k4299l2585l991Q362J2151R08
$$ plain form
11230 -55710 32784 -76436 -256825 -294184 -121030 -37852 -120856 -57044 5003 12959 11202
11219 11202 -30093 80400 134017 148386 43758 -20244 -46627 58282 56534 -10590 124046
11208 124046 163341 41499 -3823 -18107 -24576 -19261 -97148 -219488 -195673 -72413 -47610
11197 -47610 -28883 -78247 -9666 -2243 4923 162 55648 57556 -65200 -179175 -68783 96741
11185 96741 57535 110924 5863 -96119 -46629 37796 85839 -10864 -124780 -165930 -149280
11174 -149280 -141301 -22700 -944 -70788 -58368 22888 68989 150408 89383 -115904 -173989
11163 -173989 -177349 -203188 -350968 -323473 -366388 -335561 -121482 -94817 -43884 72095 65757
11152 65757 -19115 -82356 -59812 -13400 14330 -86853 -111152 -143737 -147728 -139366 -127215 -126307
11140a26307O6667m69J0131L3246j7836J45977N1006r7739r0756L4714J28368
11129A37002o5958k8091l9574j68063N3163O2734N9448N2211j4590N8918Q2691
11118A89891j3931j39220j08064n1365Q9147P9053L0657Q52o9267j12283M0000
11107f4530P5605L8929k759p5534j09330K9426J18851L9660j1991j3508l7143
11096a2324R050L3981K0147j2096j6530k819r3150j04330J01627J39355n6324
11085F587j9672M0724L8901p5016m4602L1925N3334p6456P0457P0799k7402k3649
11073D5930q2257p965L2924R4526m1522n9119P5268P975j66389k5195K9613J55314
11061E9103J80669p0345j06345Q4374o7204j21588Q085l6074J32144J82046J62074
$$ plain form
11140 -126307 -59640 -60109 -49978 -16732 -34568 111409 162415 64676 -26080 8634 137002
11129 137002 71044 42953 3379 -164684 -111521 -48787 10661 62872 48282 107200 189891
11118 189891 175960 36740 -71324 -122689 -33542 45511 76168 77020 7753 -104530 -64530
11107 -64530 11075 50004 47245 -28289 -137619 -108193 10658 50318 38327 24819 -12324
11096 -12324 -3274 30707 50854 38758 22228 19409 -73741 -178071 -76444 62911 6587
11085 6587 -13085 27639 66540 -8476 -53078 -21153 32181 -44275 26182 96981 69579 45930
11073 45930 -36327 -44292 -11368 83158 41636 -17483 57785 65760 -100629 -125824 -96211 59103
11061 59103 239772 169427 63082 147456 80252 -41336 -33251 -69325 62819 244865 406939
11050D06939p4448J6126q4407j15330o0586j617o4342K8035L9136J11848k0211
11039A81143j696P9063J02074R7163R1097N0536n0746l6891n2537k9057L2802
11028D62951n2757r5190K3500J43107J35738P2502L6583o0261j57366p8694J2854
11017D42967M3540J27351M1800j85582j06229O2317l6346n8657P8711L3633Q483
11006D51988j31231l1718K2284m8980m5250m1976M3050N5303k9763r166L9692
10995B74233j08163q9541j65737m6761K8396m1967J0162L1590O6652L7958j510
10984d688O3597o9831j1598m5885q5329J5618N1136Q3827R7203j11519N3135k1717
10972A3949Q096O4561p011j5413r1519q4979p2052L2128J30979O9877j43895l8180
$$ plain form
11050 406939 332491 348617 264210 148880 88294 86677 22335 50370 89506 201354 181143
11039 181143 179447 258510 360584 457747 548844 599380 548634 511743 459206 430149 462951
11028 462951 410194 315004 338504 481611 617349 689851 726434 666173 508807 430113 442967
11017 442967 486507 613858 655658 470076 363847 426164 389818 331161 409872 443505 451988
11006 451988 320757 289039 311323 262343 217093 175117 218167 273470 243707 234541 274233
10995 274233 166070 76529 -89208 -135969 -107573 -149540 -139378 -107788 -41136 -3178 -4688
10984 -4688 58909 -10922 -22520 -68405 -153734 -138116 -86980 -3153 94050 -17469 35666 13949
10972 13949 22045 86606 79595 64182 -27337 -112316 -184368 -152240 -21261 48616 -95279 -133459
10960a33459M5753Q9264P0012J35892l2843q4139m3077n4035M3477J19763O9588
10949B26196o3703m5034R1l0571J4133m3660N878m0231R349M6533n2577o3328
10937c6924k9138N722j6159N3084O2735m0752m8913j12868j836K2713N1475P8957
10925a1904k1575j36071l2503N0660J8180P1428N5545j08681j0418P3506P7715
10914B5882M0026Q4416m5690m549n058m5526J2581J35414j4794o4910j31883J2843
10902a248M4216q9011M4146k831P165K1017j7064O263J6177l5971q4587Q703j7416
10889a00441k3140J56784j7100k3420P2252K1909N2559K9299Q7395j0586j10410
10878A35101q3718o5548M4005l1361p3719L9116Q8036L0213M5410M9128j7282
$$ plain form
10960 -133459 -87706 1558 71570 207462 174619 90480 47403 -6632 36845 156608 226196
10949 226196 162493 117459 117550 86979 101112 57452 63330 23099 32448 78981 26404 -36924
10937 -36924 -66062 -60340 -76499 -23415 39320 -1432 -50345 -163213 -165049 -142336 -90861 -11904
10925 -11904 -33479 -169550 -202053 -151393 -133213 -61785 -6240 -114921 -125339 -51833 25882
10914 25882 65908 150324 104634 100085 95027 49501 62082 197496 182702 117792 -14091 -1248
10902 -1248 42968 -46043 -1897 -4728 2437 23454 6390 12653 28830 -7141 -91728 -83025 -100441
10889 -100441 -123581 33203 16103 -7317 64935 86844 139403 168702 256097 245511 135101
10878 135101 51383 -14165 29840 -1521 -75240 -36124 51912 82125 127535 176663 159381
10867A59381k5391J5720K378o2817J5835R042j50375O159J48383J46618l7368
10856B27565l9879m9654l2601n276r5123K1768K4871O1363n5727p4841O01j0420
10844b7353N9989M9787m17N3815p1351L4189M904l6209j82273m205M3715N8617
10832a6792N0810j31847k6135m1262N4319J55949N0905p5514m2726K8103J02369
10821A08179J31984m3019j24334j10907n3170N7163N0680j36139L1359P2316M9371
10810C3483Q1582K0690j23370j45981k9911P1933J32640P4217r8796j7595M3962
10799D2854L1673k5317K4659k9341N0202J01387N8791J66434m141k03815j20788
10788I2598R0450j5641p9425o3337L7996J23786j08115j9067n036K6986m4885
$$ plain form
10867 159381 133990 149710 152088 89271 105106 114148 -36227 -30068 118315 264933 227565
10856 227565 187686 138032 105431 100155 5032 26800 51671 113034 57307 -17534 -16933 -27353
10844 -27353 32636 82423 82006 135821 64470 98659 103563 67354 -114919 -119124 -75409 -16792
10832 -16792 34018 -97829 -123964 -165226 -110907 45042 95947 20433 -22293 5810 108179
10821 108179 240163 197144 72810 -38097 -91267 -34104 16576 -119563 -88204 -15888 33483
10810 33483 115065 135755 12385 -133596 -163507 -91574 41066 115283 16487 -1108 42854
10799 42854 74527 49210 73869 44528 94730 196117 254908 421342 417201 213386 92598
10788 92598 183048 167407 87982 24645 62641 186427 78312 59245 54209 81195 36310
10777C6310q1294M4078R0690l0970O8730M4832J16196q6988j00040j75129J1685
10766f1900J13898n0498j17504K423l9947N0425p221k5919K2561J72222P936l3739
10754C2737m2617J0519n0499L5849M9374j2564M3874j8525j09366l7751P3806
10743b5163J5189J4535P8363m9604r568L6571Q7603j11229K6769K6768Q098j6984
10731H1348J21796J46318r5235p2091K463Q7466O1553J3780q686l8253J1339O084
10719C17882P5265p6585p609j44408j07788j31446J11934K39807k40r0091k1685
10708A65036j57432n888q5778q9014M2330J46026J48630R9778Q2019L6981r2777
10697B89911j17196o248J01060k327k08570O6924J22098J6043n5517K3738J20329
$$ plain form
10777 36310 -44984 -906 89784 58814 127544 172376 288572 201584 101544 -73585 -61900
10766 -61900 51998 1500 -116004 -113581 -153528 -103103 -110324 -136243 -113682 58540 66476 32737
10754 32737 -9880 639 -49860 -14011 35363 22799 66673 48148 -61218 -98969 -25163
10743 -25163 -9974 4561 82924 33320 23752 60323 147926 36697 63466 90234 98332 81348
10731 81348 203144 349462 254227 182136 184599 272065 333618 347398 338712 300459 311798 317882
10719 317882 393147 316562 308953 164545 56757 -74689 37245 277052 276812 186721 165036
10708 165036 7604 1716 -84062 -173076 -130746 15280 163910 263688 345707 382688 289911
10697 289911 172715 166467 267527 265200 56630 123554 245652 261695 206178 229916 350245
10686C50245r578k30922M0781R3935n6427J06167P6977n6029k7337K7689J43808
10675D59309N9790j44320r5196j1588N7029K799N2954M5259n4542O5597J05022
10664E42113L8800J8089M2016M5230j09974q2194R7260J39225J85886J16222j870
10653A030803J7167M9551P6339Q8874K5778n5177q7462K5558J06171R6457M4331
10642A418390J66090J93821J47801K98064L27093K37699Q9619J85393L91576L68398
10632C823944M41718N00027N44090N26230N94223P94719J287316J808064K183501
10623A2503832K859849L731608M626838N325324N567873N107988M076429K544316
10615D6344057Q08470m39910o78590M40072K527208N146804P832863R724811R892673
$$ plain form
10686 350245 340667 109745 150526 244461 188034 294201 371178 315149 287812 315501 459309
10675 459309 519099 374779 279583 267995 325024 327823 380777 426036 371494 437091 542113
10664 542113 580913 599002 641018 686248 576274 494080 591340 730565 916451 1032673 1030803
10653 1030803 1047970 1097521 1173860 1262734 1288512 1233335 1145873 1171431 1277602 1374059 1418390
10642 1418390 1584480 1778301 1926102 2224166 2551259 2788958 2878577 3063970 3455546 3823944
10632 3823944 4265662 4765689 5309779 5836009 6430232 7224951 8512267 10320331 12503832
10623 12503832 15363681 19095289 23722127 29047451 34615324 39723312 43799741 46344057
10615 46344057 47152527 46712617 46034027 46474099 49001307 54148111 61980974 71705785 81598458
10606H1598458Q270973O064698K739514k024421n557779n793191k966339J116754
10598H3448667N548299R431440J1635689J1323040Q474596M583523q43403p905428
10590A25696423j3046443j3239128r518274m928754o19809L126900M919668M638640
10582I7029223K730414M5365l706276q304297j1102367j0554787q047930m970569
10574E3118776k346744o36932M25182M30753n23133j818336l268438m974657o025581
10565C4380890n816029m850323l645914k744869k106928j609155j160844r95782
10557A1451046q67577q18366n42551o44942n51700m14697l58882l85311l59570
10548F507450l20287l27331k88579k28048l32201l52432m1650l2683j52033l70786
$$ plain form
10606 81598458 89869431 95934129 98673643 96649222 91091443 85298252 82331913 83448667
10598 83448667 88996966 98428406 110064095 121387135 129861731 134445254 133601851 125696423
10590 125696423 112649980 99410852 89892578 84963824 84344015 87470915 92390583 97029223
10582 97029223 99759637 99805002 96098726 87794429 76692062 66137275 58089345 53118776
10574 53118776 50772032 50135100 50560282 50991035 50467902 48649566 45381128 40406471 34380890
10565 34380890 28564861 23714538 20068624 17323755 15216827 13607672 12446828 11451046
10557 11451046 10583469 9765103 9222552 8577610 8025910 7611213 7252331 6867020 6507450
10548 6507450 6187163 5859832 5571253 5343205 5011004 4658572 4616922 4584239 4432206 4061420
10538D061420k16591j28712k07283k5102j08478j27816r0558m9864j28800r534
10528B968682K8259j50591r0417m0511p9729j76752r0347q8209n9651j06903r5238
10517B018593j6781j7976j05727n615l1568P767n9893j03926j21972L3430n5656
10506A540676k7886M0131L5109j53659J512n8529j19961K2617o8588l6637J8851
10495A193636Q670k2976l7832j25987P5103N453j67901q184J59143K6438k6918
10484A078645p9952p2379j48463j01012n2746J9866L7864o5330M8605J19876J12143
10473H97117P0896J03023l7255o8967j21496o2934L7016J26067N9393J31826o5390
10462A069296j74452n4042n1724l8061j78912r3277R090K7275o5549j0570J26182
$$ plain form
10538 4061420 3844829 3716117 3508834 3483732 3375254 3247438 3156880 3107016 2978216 2968682
10528 2968682 2996941 2846350 2755933 2715422 2635693 2458941 2368594 2280385 2220734 2113831 2018593
10517 2018593 2001812 1983836 1878109 1872494 1840926 1848693 1788800 1684874 1562902 1596332 1540676
10506 1540676 1512790 1552921 1588030 1434371 1435883 1377354 1257393 1280010 1211422 1174785 1193636
10495 1193636 1202306 1179330 1141498 1015511 1090614 1096067 928166 919982 1079125 1105563 1078645
10484 1078645 998693 926314 777851 676839 624093 643959 681823 616493 665098 784974 897117
10473 897117 968013 1071036 1033781 964814 843318 780384 817400 943467 1002860 1134686 1069296
10462 1069296 894844 840802 789078 751017 572105 478828 487918 515193 449644 439074 565256
10451E65256p5377j52039k6865J31272N6073K775R3830J2245k1924n4752p7756
10440D52738l7912p343P1268M748j32056M7829j806j03793L7235R6146J3088J9082
10428D59224N0574K6096l7160L0678o2798r8289L8203J8819o3795j11203j02974
10417A47375R8369O1680q8367q5337m4068M2814P5815J4319o0267N8630m1381
10406A79582n7114P4519M5102q8973K1283J03572n3813p3980n2167o9685R3910
10395A22236K04415N2792j04623j42836L8651k088L8329R980k0854J31411J19538
10384D46951o661j05473q3867K1545p9062j29405J31345O3800o7842K2935k574
10373B11692j3297q8413j35957m4595l1315M2152L8415R7833R7325R138Q3175
$$ plain form
10451 565256 489879 337840 310975 442247 498320 501095 594925 607170 585246 530494 452738
10440 452738 414826 407483 478751 483499 351443 399272 397466 293673 330908 427054 440142 459224
10428 459224 509798 535894 498734 529412 466614 368325 406528 425347 361552 250349 147375
10417 147375 245744 307424 219057 133720 89652 132466 208281 222600 162333 220963 179582
10406 179582 122468 196987 242089 153116 174399 277971 224158 150178 98011 28326 122236
10395 122236 326651 379443 274820 131984 170635 168547 206876 216856 196002 327413 446951
10384 446951 440290 334817 250950 272495 193433 64028 195373 259173 191331 214266 211692
10373 211692 198395 109982 -25975 -70570 -101885 -59733 -21318 76515 173840 182978 266153
10362B66153K7981n4307K5767j08511o9555Q6221l5206K5763L9613o1140r0195
10351E2584L5432N7380P623j8369N8943J1973R657L7353q6827m0934N2358J06369
10339B83542k8306p0485n4358M4926R7436l9593j50770q1203j2442P0365Q8900
10328A48012p3990o0805J10120N9453q3340j101Q566l8441L629p6855M9850k3708
10316B1390O718q143R7994J54225Q64L313j05926k2488L3352m8177N4895P5794
10304B63811L2185j036P193L6169n2502o0883n354N700j87969l2801N2725M9983
10292A07221k0385j41339q3505L2004J34576K43999O5306p1282j64375p2263k15936
10281a85979R5901N2515M5476Q2322J10216J20781N1387q3716j23563l4610l3958
$$ plain form
10362 266153 294134 239827 265594 157083 87528 173749 138543 164306 203919 142779 52584
10351 52584 88016 145396 153019 134650 193593 205566 215223 252576 165749 124815 177173 283542
10339 283542 255236 184751 130393 175319 272755 233162 82392 1189 -11253 59112 148012
10328 148012 74022 13217 123337 182790 99450 98349 106915 68474 72103 -4752 45098 21390
10316 21390 28108 19965 117959 272184 273048 276361 170435 147947 181299 133122 188017 263811
10304 263811 295996 294960 302153 338322 285820 224937 219583 225283 37314 4513 57238 107221
10292 107221 86836 -54503 -138008 -106004 28572 272571 337877 266595 102220 29957 -185979
10281 -185979 -90078 -37563 7913 90235 200451 321232 372619 288903 165340 130730 96772
10270I6772O1623q0248j27325J05170J25201J0320r787j2399P0036k3903j65605
10259D9855K47p6615n5653O1685O8770K9237M100n2790o2542m6724k9065O7117
10247d2378k5901p484L1351J82662Q5784j06120j50711L1955M5472L4779J2587
10236I1996o2305J14577Q8389L2137J8035k8769n6283l7860J5876j45043o0478
10225b9728O3139P9268r7537p9289M3313P3562L3581j27875J0602N736J34959
10214A09731O7797l8857o5892k043K5213j34994m6278L6470K23515m8727j21914
10203D021L8544O1567n915J9269m800r8674r7200l7437J18254N5218r5873N3421
10191A0395Q9563l4928K6232L7065j53194N974Q8299J42037j34074l0396P5039
$$ plain form
10270 96772 158395 78147 -49178 55992 181193 191513 181726 169327 239363 215460 49855
10259 49855 50102 -26513 -82166 -20481 48289 77526 81626 28836 -33706 -80430 -109495 -42378
10247 -42378 -68279 -75763 -44412 138250 224034 117914 -32797 -842 44630 79409 91996
10236 91996 29691 144268 232657 264794 282829 254060 197777 159917 175793 30750 -29728
10225 -29728 33411 112679 15142 -64147 -20834 52728 86309 -41566 -30964 -25228 109731
10214 109731 177528 138671 72779 70736 95949 -39045 -85323 -48853 174662 125935 4021
10203 4021 42565 104132 98217 117486 112686 14012 -83188 -120625 -2371 52847 -43026 10395
10191 10395 99958 65030 91262 128327 -24867 -18893 69406 211443 77369 46973 122012
10180A22012J02508O8238M1493O7049n6391q1526L9496J80198J59966l0418m1059
10169E71566j9251j4850M8954J17810l2586j54188k4739l603j8441J50521J26211
10158G47404j589L1378R12j35305o9120O0208j06053j09367j416L3167J07595
10147E57814M7157p6627j491M0090o03m1001n8689j82252l7667o1376p0766O6382
10135A80971J12400J64047O5163r2374j00831j03393k0121p4438O6954k3230L4576
10124B09724J30194k2955r1851j46256q6226n0056K5520N5305j7691N2156J7243
10113G5107L7098l9476J6903M1432q7086j01497K9510J06489J04240o7058r4079
10102B1583O6350J4267l2594j17062N4439R5143Q9763P1502l8987p1884m9744
$$ plain form
10180 122012 224520 292758 334251 401300 344909 263383 302879 483077 643043 612625 571566
10169 571566 552315 537465 586419 704229 671643 517455 492716 489113 470672 621193 747404
10158 747404 745815 777193 778105 642800 573680 633888 527835 418468 417052 450219 557814
10147 557814 604971 528344 526853 566943 566340 525339 466650 284398 246731 185355 114589 180971
10135 180971 293371 457418 522581 430207 329376 225983 205862 131424 198378 175148 209724
10124 209724 339918 316963 225112 78856 -7370 -57426 -31906 23399 5708 57864 75107
10113 75107 112205 72729 89632 131064 43978 -57519 -28009 78480 182720 115662 21583
10102 21583 87933 102200 69606 -47456 6983 102126 191889 263391 224404 152520 102776
10091A02776J5197k398m0637r6578l0912Q26l5027l7844m5233o73J01032Q4472
10079A5001p47j15992p9891Q6334J57863L8438n4338L0942j790q3527L5985K2345
10067E0623m6848q703n2719O446K7558J6888J12401J6514l7785P4574J29066j06212
10055A81803j19129p8576l2668K8157J61268P0964j90400j31136P1851P0153P0454
10044A02741r297L2020K1942j14901p1382n1583o138K9143K5929J3214j0640j10900
10032a49852Q9395J44920m946N3383L0935P5579m5803k8046o0245n7834J2200
10021E9686j1794N6168j50034j5386R2853R8284Q9125j40984j7672N85M5966p2003
10009C4794q791j242k9217m694L9664J14007P2351k4211l6007q7060m6585L1502
$$ plain form
10091 102776 117973 115575 74938 -21640 -52552 -51726 -86753 -124597 -169830 -170503 -69471 15001
10079 15001 14254 -101738 -181629 -95295 62568 101006 46668 77610 75820 -7707 28278 50623
10067 50623 3775 -4928 -57647 -51201 -23643 -6755 105646 122160 84375 158949 288015 181803
10055 181803 62674 -15902 -48570 -20413 140855 211819 21419 -109717 -37866 32287 102741
10044 102741 93444 125464 147406 32505 -38877 -90460 -96598 -67455 -41526 -28312 -38952 -149852
10032 -149852 -60457 84463 79517 132900 163835 239414 193611 165565 105320 47486 59686
10021 59686 47892 104060 -45974 -61360 31493 129777 218902 77918 60246 60831 106797 34794
10009 34794 26003 24761 -4456 -9150 30514 144521 216872 192661 156654 69594 23009 54511
9997E4511K0166j29617j8397m2803J32935M7083p7977p3459J11702K8222k8009
9986B4357j3435Q5026L3089J43878p344j03556k5142K9272k7442j0136J36262
9975B64829o5397j31270m9786n6555k530Q832P1084J66559J3689j03549r163N9552
9963A66295M2075L8384m2589q7623p7988N9591J25270K6319Q7738J79711K91889
9952H09072L06325K77703K14422K6066j30706j53960l53745l50467l58626j75290
9942A10794m1954R0518N2941n7348l6904q0717k7493K2098k5057n3849J05935
9931E8964N8845k463J32521K4835q7698o1171j14723p5340j1851O1701J26515
9920A10135R3531k4108k9600k192k7995j01845j16117O3918J14618J05105J66708
$$ plain form
9997 54511 74677 -54940 -73337 -116140 16795 63878 -14099 -87558 24144 52366 24357
9986 24357 10922 95948 129037 272915 265571 162015 136873 166145 138703 128567 264829
9975 264829 199432 68162 18376 -38179 -40709 -31877 39207 205766 219455 115906 106743 166295
9963 166295 208370 246754 204165 116542 38554 98145 223415 249734 337472 517183 809072
9952 809072 1115397 1393100 1607522 1633588 1502882 1348922 995177 644710 286084 110794
9942 110794 68840 159358 212299 154951 118047 37330 9837 31935 6878 -46971 58964
9931 58964 117809 115346 247867 272702 185004 123833 9110 -66230 -78081 -16380 110135
9920 110135 203666 179558 149958 147766 119771 17926 -98191 -34273 80345 185450 352158
9909C52158P0551o2387j30809n8582j36659q8516o8533K9354j12304K441N5813
9898a47473N8794J54575q972O2286M0839k9665j37204j125N0500K9892J05256
9887A77703J7522O197q6342m7493o3477j1097O0378o2976l8071J05177L0809j6469
9875G1861N5708r919q8770j22294K7229J27364j6636q595M7418O0562M5018o18
9863A88328M0238K7077r1426n3587Q2424M8895j84256j35206Q8310J34465L3421
9852A78683L420P644m965m6795K3723L1148M2232j38939r9621q6361j8306K8966
9840g9171p8901J06471q7482m7860J41164M7810l7597p5917L2491O5339J16492
9829A02839Q1110p4455o1694J1501M3574J29218L5931q3573n5791N2843r267O1945
$$ plain form
9909 352158 422709 360322 229513 170931 34272 -54244 -122777 -93423 -205727 -203286 -147473
9898 -147473 -88679 65896 56924 119210 160049 130384 -6820 -7945 42555 72447 177703
9887 177703 195225 201422 115080 67587 4110 -6987 53391 -9585 -47656 57521 88330 71861
9875 71861 127569 117650 28880 -93414 -66185 61179 44543 35948 83366 143928 188946 188328
9863 188328 228566 255643 164217 110630 193054 241949 57693 -77513 10797 145262 178683
9852 178683 182103 189747 184782 137987 161710 192858 235090 96151 -3470 -89831 -108137 -79171
9840 -79171 -158072 -51601 -139083 -186943 -45779 2031 -35566 -111483 -78992 -13653 102839
9829 102839 183949 109494 47800 59301 102875 232093 268024 184451 128660 181503 172236 234181
9817B34181M652m8475n7887M3741o418j77092J2496L9583m4391Q6162O8812K2728
9805A78092j66618j38244M4640n3632P4302O1740Q0034R1674l7114q1115r9877
9794d6118M5327N3558j2394k8348n3752N5768J27023L8445Q298L0630J19982J93551
9782E31970L72520K66479K71396K99961J68191k3175o1610m19707n56785l13768
9772E35472n8974r3108k03063m6021J0380P0296O4401M0107N753j62066j8836
9761A44341n5790k5245N3808n1652N2084R402q2884M5529j5198p9103N2555N8927
9749A06774J1157J0130o6801j37341O3259J45511o2794l5380L7682N203O0923
9738A38323R1136o8924j29138k4967J05725k6332p8754P9174n8296L419k0537
$$ plain form
9817 234181 238833 190358 132471 176212 169794 -7298 5198 44781 390 86552 155364 178092
9805 178092 11474 -126770 -82130 -135762 -61460 280 80314 171988 134874 53759 -46118
9794 -46118 -791 52767 40373 12025 -41727 14041 141064 179509 187807 218437 338419 531970
9782 531970 904490 1170969 1442365 1742326 1910517 1887342 1825732 1406025 849240 535472
9772 535472 476498 383390 180327 134306 144686 214982 279383 319490 325243 163177 144341
9761 144341 88551 63306 117114 65462 117546 126948 44064 89593 74395 -4708 47847 106774
9749 106774 117931 128061 61260 -76081 -12822 132689 69895 34515 72197 77400 138323
9738 138323 229459 160535 31397 6430 112155 85823 7069 86243 27947 31366 10829
9727A0829L2515Q5940n5718K3748p0650r3681P504Q4704L5359m0272R33j05500
9715h4289r4571N7929J26144J12522j8545m187j23969O622j2842j1919N0074K8573
9703C1542j06016Q528J19791j3601n3255j19110R737Q1940O310J2840K4940J9587
9691B3233l7120N7623L2673l5973p6718j03914m4989M3318J9654L4153L1014N0136
9679f910J3255j17296m0444r42M7254J37371l2632j9264P7126J02476n9965n4015
9667D6014n2932l3097N3462J66538J45224r831j48765k2036p0187N6569Q8085
9656B19044N7247M5038K0949k9472m4098O9785j54703j44517R4938K4874m6009
9645A13076m139R9935p8869j10959J389K0001n8858n897J02264j25583j43339
$$ plain form
9727 10829 43344 129284 73566 97314 26664 -67017 -59513 25191 60550 20278 21211 -84289
9715 -84289 -178860 -120931 5213 117735 99190 95003 -28966 -22344 -35186 -47105 2969 31542
9703 31542 -74474 -65946 53845 40244 -13011 -132121 -122384 -40444 -34134 -21294 3646 23233
9691 23233 -13887 43736 76409 40436 -36282 -140196 -185185 -141867 -122213 -88060 -57046 -6910
9679 -6910 6345 -110951 -151395 -152337 -105083 32288 -344 -19608 57518 159994 100029 46014
9667 46014 -6918 -40015 13447 179985 325209 315378 166613 144577 74390 130959 219044
9656 219044 276291 321329 342278 312806 268708 338493 183790 39273 134211 159085 113076
9645 113076 108937 208872 130003 19044 20433 40434 -18424 -24321 77943 -47640 -190979
9634a90979L5263j5368L1362K32863J5144r0223L1149k5567N5468P3683j26740
9623B6055r2723j4962j39605P314k155P2545P2453L7776N5393M0148r3243p7735
9611a08739Q258R1718K2599M3478P4596J60373j4781j15220n7853j48616q405
9600e2592J02574K6833j31986j769J27191K8825l441o1079K6376L3113L8226N1121
9588A83392o7800k30455m9208O7773L7751L6850J53127k5086j1098j37850j14611
9577a57215m1004M4015K2016J30765J4443p3483M7543m4291N6877J21558P9451
9566B00675L8415O573o4601k1781m9028j23930k268J5255n1421m3111M8878k6560
9554g2904P2778L2222L1423m8954N247J34792k4256j59835l5136m0671M9465O2346
$$ plain form
9634 -190979 -155716 -171084 -139722 93141 108285 18062 49211 23644 79112 152795 26055
9623 26055 -66668 -81630 -221235 -213921 -216076 -143531 -71078 -33302 22091 62239 -31004 -108739
9611 -108739 -100481 -8763 13836 57314 131910 292283 277502 162282 104429 -44187 -52592
9600 -52592 49982 76815 -55171 -56940 70251 99076 95635 34556 60932 94045 132271 183392
9588 183392 115592 -114863 -164071 -96298 -58547 -21697 131430 106344 95246 -42604 -157215
9577 -157215 -198219 -154204 -132188 -1423 13020 -60463 -12920 -57211 -334 121224 200675
9566 200675 239090 245663 181062 159281 110253 -13677 -15945 -690 -52111 -95222 -46344 -72904
9554 -72904 -126 32096 63519 14565 19812 154604 130348 -29487 -64623 -105294 -55829 6517
9542F517o7979r7665o107J2644N942k814Q1773O2086q7659j0553o3747N824P2336
9529h9402K1147R603j0511o9476j02521J6461J09178K5921r3913j06423J07682
9518a82254K06284j3673M113Q3373M0936p1413j52947Q352K5492J50276R8424
9507A96963M1400n0697j16704l740k6329j46665R0509J08009j5373j566J7805
9496I3612o0772p5745p9511N1510P919j43075r286M9022P0523R730k2212N613
9484a02672n4640K526R392L960M9324J6455o717r9058M3684l43K10698O8060j10139
9471C0530j8616n852M3481j8446J27965m9964p8212o2973Q439k1638M1722l4136
9459c7700K221J7585M5185o8383m1498m4866n4852P6706J9025n1112M4060J829
$$ plain form
9542 6517 -61462 -159127 -165234 -152590 -146648 -149462 -67689 -5603 -93262 -103815 -167562 -161738 -89402
9529 -89402 -68255 -58652 -69163 -138639 -241160 -224699 -115521 -89600 -183513 -289936 -182254
9518 -182254 24030 10357 14470 97843 138779 67366 -85581 -77229 -51737 98539 196963
9507 196963 238363 187666 70962 67222 40893 -105772 -15263 92746 77373 75807 93612
9496 93612 32840 -42905 -122416 -70906 -62987 -206062 -215348 -166326 -95803 -86073 -108285 -102672
9484 -102672 -157312 -154786 -145394 -141434 -92110 -75655 -82372 -181430 -137746 -138089 72609 140669 30530
9471 30530 11914 6062 49543 31097 159062 109098 30886 -32087 -23648 -45286 -3564 -37700
9459 -37700 -35479 -17894 27291 -41092 -82590 -127456 -182308 -105602 -86577 -137689 -93629 -91800
9447i1800P5091O3646p5517J11666m1274p2495R909j9907k2996l2646N5504N5788
9435A4969l355N2711P634o1638l2613m9502l4305o5114J70884L8355j0992L59
9423B7393m3852n6066K5406O6853k0331L8428l6624R7196J4556o7010n753p4488
9411c4292n1728r037P2938j7346J9031Q2379P0767M3615l2889j3097p817J807
9399A24331R8278j05661j56820l7179J15141J2760m5136m0256J24322j4474p8556
9388c250r071J133n1267J7338l500m4651l2580m0911J18150J77927k1709J12530
9376B20139M8141p4654J5811L6675j28704p9919M5377O6784n8142J9661j04931
9365F238q2484l5438J6J00884J51190O5708r0684q1301j9644K5064J70407n1771
$$ plain form
9447 -91800 -16709 46937 -28580 83086 41812 -30683 -20774 -40681 -63677 -96323 -40819 14969
9435 14969 11614 64325 71959 10321 -22292 -71794 -106099 -171213 -329 38026 27034 27393
9423 27393 -16459 -72525 -47119 19734 -597 37831 1207 98403 112959 45949 40196 -34292
9411 -34292 -86020 -95057 -22119 -39465 -20434 61945 132712 176327 143438 130341 122524 124331
9399 124331 222609 116948 -39872 -77051 38090 50850 5714 -34542 89780 75306 -3250
9388 -3250 -12321 -11188 -62455 -45117 -48617 -93268 -125848 -166759 -48609 129318 107609 220139
9376 220139 268280 193626 209437 246112 117408 37489 82866 149650 91508 111169 6238
9365 6238 -76246 -111684 -111668 -10784 140406 206114 115430 34129 14485 39549 209956 158185
9353A58185J4762M0132j10287q5788k3777r6482q7500l3155m6037R0955M1488
9342a37504j0709n374P4849L3113j9419R2135L3350j64706p1046J0442l7416l8261
9330b40546K4165P4503J11735L5577o8523N5114P5732k3041N5525p9109K3102
9319D4234j0546p710R2056K0847r3589n4624L5526o5981M9751O1866J7384k3275
9307F5939J094k5347n5533q3482L0723l5880L9610J61612L4727J2422O734k4532
9295A28087k8271j13412K2057M2497l621o1466L3855L4805j4347j23858j46278
9284b29952l8524J15077J04166r1379j3912J31598J45968L2484j65538K7145J15992
9273A33125m1549m4489k9441P4615p6299L155Q4809o6353n6774j5428L5512R2101
$$ plain form
9353 158185 172947 213079 102792 17004 -6773 -103255 -190755 -223910 -269947 -178992 -137504
9342 -137504 -148213 -153587 -78738 -45625 -65044 27091 60441 -104265 -175311 -164869 -202285 -240546
9330 -240546 -216381 -141878 -30143 5434 -63089 -7975 67757 44716 100241 21132 44234
9319 44234 33688 25978 118034 138881 45292 -9332 26194 -39787 9964 71830 89214 65939
9307 65939 67033 41686 -13847 -97329 -66606 -102486 -62876 98736 133463 145885 152619 128087
9295 128087 99816 -13596 8461 50958 47337 -14129 19726 54531 40184 -83674 -229952
9284 -229952 -268476 -153399 -49233 -140612 -154524 -22926 123042 155526 -10012 17133 133125
9273 133125 91576 47087 17646 92261 15962 19117 103926 37573 -19201 -34629 883 92984
9261I2984O6851m3074R6212K9413o8571r8194m0577j24783K39q456P4063L9536
9249A5643L1246p0838k2749L2043j05681o8672N391Q1138J89989J5828o6116J2957
9237E0179O9503L0143j06409l4682p1453j46494J50761J43843R0496j5067k3272
9226A37548l2207o4899r2270q0076K2398Q6315J5209J8513m1279O7017n8818m0188
9214f2737P1381J19170j7256j19398P3499N836k17084R0105O0546N6889Q1019
9203A41970m5107q1330j13721J5901K3544j861J7835n1253O321o2329r0173K7046
9191b13157J34176r0198N7501J00593J37648l0878l3051L9032L5310r4559j0707
9180C1710q8757q5332L9308J580j32731m3055J38033n2491K2257j4440J20017
$$ plain form
9261 92984 159835 116761 212973 242386 173815 75621 35044 -89739 -89500 -97956 -23893 15643
9249 15643 46889 -23949 -46698 -14655 -120336 -189008 -183617 -102479 87510 103338 37222 50179
9237 50179 119682 149825 43416 8734 -62719 -209213 -58452 85391 175887 160820 137548
9226 137548 105341 40442 -51828 -131904 -109506 -23191 -7982 10531 -30748 36269 -22549 -62737
9214 -62737 8644 127814 110558 -8840 64659 70495 -146589 -56484 4062 60951 141970
9203 141970 96863 15533 -98188 -82287 -58743 -60604 -42769 -94022 -87701 -150030 -240203 -213157
9191 -213157 -78981 -169179 -111678 -11085 126563 95685 62634 101666 136976 42417 31710
9180 31710 -57047 -142379 -103071 -101491 -234222 -277277 -139244 -191735 -169478 -183918 -63901
9169f3901J21173O128q1329K1696Q8621j537q9891M7085O1978j17303j75936K2087
9157a61129K0957J55964J13533k5360j30262k1148J08380J05387k4976k18863
9147g7517j0843J01384J18317q777j05273m1584n4680m125J9825j26240o5924
9136b55437J0879q7868P7161J94182r186k6433J2067J12539l908Q338J5055n3696
9124f307M8463M3439K5328p1158M2622j1569r120p6087K6238L3003q5332r8188
9112a38668o2124J32267Q0482j37804R24R4050l5315j15037L1981O5857j0450
9101i3837R9666J12990n4502M5756K6784m6839n4192j13631n9551R3882Q1687
9090C8213K7199J10606N9632r8021j24072N2810n5332j9659l8543j04150Q301
$$ plain form
9169 -63901 57272 63400 -17929 3767 92388 90851 960 48045 110023 -7280 -183216 -161129
9157 -161129 -140172 15792 129325 103965 -26297 -47445 60935 166322 141346 -77517
9147 -77517 -88360 13024 131341 122564 17291 -24293 -78973 -83098 -63273 -189513 -255437
9136 -255437 -244558 -332426 -255265 -61083 -70269 -96702 -84635 27904 23996 32334 47389 -6307
9124 -6307 42156 85595 110923 39765 82387 70818 61698 -14389 11849 44852 -40480 -138668
9112 -138668 -200792 -68525 11957 -125847 -124923 -30873 -66188 -181225 -149244 -83387 -93837
9101 -93837 5829 118819 64317 110073 136857 90018 35826 -77805 -137356 -43474 38213
9090 38213 65412 176018 235650 137629 13557 66367 11035 -8624 -47167 -151317 -143016
9079a43016N2602K2978J8909J918O181n3118P5636N7069J01012R4739o8305j72912
9067f307R0059K1801j04803K980O6374N8978K4601k1127j5595k2492j24007j16616
9055a46154m3519m5302N3860J22361j3722N9473M8759R0051q6383p2248j0501
9044d3325M9706Q2893M118o815L7950j3158k8771j16239J0876M5561p712M0025
9032E5109K1869L8663J0686m1494j6831r3789L0455J02337q0736J0499P2081j8179
9020I0670m2399l9063k580j772n0583m5805N4869J1178l0586j8876R4901Q2666
9008A02620j0832j63431p2071m0684J2749P5892O3698K1996m9609p925N5565J22547
8996A10515Q8342j3920J0519o6570k5179j35659p3516R478j25585J29435N8880
$$ plain form
9079 -143016 -90414 -67436 -48527 -46609 -40428 -93546 -17910 39159 140171 234910 166605 -6307
9067 -6307 83752 105553 750 3730 70104 129082 153683 132556 116961 94469 -29538 -146154
9055 -146154 -189673 -234975 -181115 -58754 -72476 -13003 35756 125807 39424 -32824 -43325
9044 -43325 6381 89274 93392 86577 124527 111369 82598 -33641 -22765 22796 15084 55109
9032 55109 76978 115641 126327 84833 68002 -25787 4668 107005 26269 36768 108849 90670
9020 90670 48271 9208 6628 4856 -45727 -91532 -36663 -25485 -56071 -74947 19954 102620
9008 102620 91788 -71643 -143714 -184398 -171649 -95757 -32059 -10063 -59672 -67597 -12032 110515
8996 110515 198857 184937 195456 128886 103707 -31952 -105468 -95990 -221575 -92140 -33260
8985c3260K3839p8818r0602k4727Q5953L3817Q6360K3038n6470n4423N179K9369
8973e0745J19083R4554n4618j35518J5792J13358J04646n7968q625m2156Q9845
8962A87648l0942K3632n147j82493P844J70889J12119m237n2583l0653r0852q2806
8950B2419j4991L0848P2049K9570j43939m5654j4202J02077J15094n9179k01703
8939a07611p4908j9874j081P4413L8979R7364O3273M0096q1639j58687l2787K32531
8927G0069m3666l9300q7064q4841Q9159J70323o5430j27964L2728R9058J07628
8916A20700K0746O4004m716o4079k7537n6598l7886k6444p7048O7876M5318N0958
8904G5294K8816j7055j20856r2519N9352J8297m226J28926R6152j760j03349j7142
$$ plain form
8985 -33260 -9421 -88239 -178841 -203568 -117615 -83798 2562 25600 -30870 -85293 -80114 -50745
8973 -50745 68338 162892 108274 -27244 -11452 101906 206552 148584 139959 97803 187648
8962 187648 156706 180338 175191 -7302 542 171431 283550 279313 226730 196077 105225 22419
8950 22419 7428 38276 110325 139895 -4044 -49698 -63900 38177 153271 94092 -107611
8939 -107611 -182519 -202393 -203474 -129061 -90082 7282 70555 110651 29012 -129675 -162462 70069
8927 70069 26403 -12897 -99961 -184802 -95643 74680 9250 -118714 -85986 13072 120700
8916 120700 141446 205450 200734 136655 109118 52520 14634 -11810 -88858 -20982 24336 75294
8904 75294 104110 87055 -33801 -126320 -66968 -48671 -52897 76029 172181 170421 67072 49930
8892D9930O1073m538O9287j07303n5778m6657k1158k4378K7064L8217P9778M1175
8880A06712l3703o1049O3993P5238K9831K733j16739l0045n3342J5488R4768M2477
8868A36362L4750j05459m7820n9273p7342M7814O8596J6118p4193o6587O849n8764
8856a78949L0333R8794M5680m4092r3251k859j1341J9926L5825N1110K1755q3775
8844a10844K2739N3244P5721L0047J421P64m6889l0120M9221N992J09985N074
8832A66355j03132J7275J31764L1392j17484k1658r0802P853l1562N0216k1836
8821A8381J4440m120q1815j15638M7492R5747l0055p7493j8317J85337p587j22981
8809i6609j6012O452J11529K0928q9818k5022L3861L7515j4342k2909j5887j3350
$$ plain form
8892 49930 111003 106465 175752 68449 12671 -33986 -55144 -79522 -52458 -14241 65537 106712
8880 106712 73009 11960 75953 151191 181022 183755 67016 36971 -16371 -883 93885 136362
8868 136362 171112 65653 17833 -41440 -118782 -70968 -2372 13746 -60447 -127034 -120185 -178949
8856 -178949 -148616 -49822 -4142 -48234 -141485 -144344 -155685 -135759 -99934 -48824 -27069 -110844
8844 -110844 -88105 -34861 40860 70907 72328 73092 26203 -3917 45304 51296 161281 166355
8832 166355 63223 80498 212262 243654 126170 104512 13710 21563 -9999 40217 18381
8821 18381 32821 28701 -53114 -168752 -121260 -25513 -55568 -133061 -151378 33959 26372 -96609
8809 -96609 -112621 -106169 5360 26288 -63530 -88552 -54691 -17176 -31518 -54427 -70314 -83664
8797h3664J65052L4364m9573J1765N3826j12196q5933M169o457J30378L2577j4924
8785G9384m4993L8236M2671M5590j24968j43201k4716j0434J6285o1531K020J18687
8773f6970R4832M1874M2199k97K0805N7957j08683o2111m9241k1687n2577m1115
8761a45014L4023O7641J06701J6187M1903o6802q6027l9252J5126p5988l5343
8750a66845J11922K19982j0179l9667l850L1524j06303q8271n3939J79195N372
8739G8941j64234L6458J93996n6966j29462o1203N6889Q4022R100L0817L0973
8728A09331J3454L5724J16785k7743j19090q9850o1169L9228R9249k772j12856
8717B91K7979J919M7282R0936m4607O1582n3671j12669P4470n6101j68797N2070
$$ plain form
8797 -83664 81388 115752 66179 77944 131770 19574 -66359 -62190 -68647 61731 94308 79384
8785 79384 34391 72627 115298 160888 35920 -107281 -131997 -142431 -126146 -187677 -185657 -66970
8773 -66970 27862 69736 111935 111638 132443 190400 81717 19606 -29635 -51322 -103899 -145014
8761 -145014 -110991 -43350 63351 79538 121441 54639 -31388 -70640 -55514 -131502 -166845
8750 -166845 -54923 165059 154880 115213 111363 142887 36584 -51687 -105626 73569 78941
8739 78941 -85293 -48835 145161 88195 -41267 -102470 -45581 38441 47541 78358 109331
8728 109331 122785 158509 275294 247551 128461 38611 -22558 16670 115919 113147 291
8717 291 28270 30189 77471 168407 123800 185382 131711 19042 93512 37411 -131386 -79316
8705g9316J86640O2062j42369l2627J57708J02271J01469k00389r3949k4165R4185
8694A31520m0509n1433J1006J43247j01060k3280P2856j21671M8128p2191l102
8683f489j01754M5769M238L2933O8995j43585q987m7369J08092L4951j10766M8474
8671g5498J00561R2013L6941L4967O77m3271p1471Q3559k8467m6699o9080K146
8659A6378J71707J12970o4231J4984K6082n2039m7693M0164l2254n9564o454K0478
8647A40528j44539l9462L0085L9148Q0831J37027L6744k228j21628k974L4599
8636A88131q5037p3808J9689k8777k6616K9923n0400R30O1158J6233J5183P2493
8624A39102k1357k1993N1225k7888p2537J0222L4603k4279m6803J01500P4062
$$ plain form
8705 -79316 107324 169386 27017 -5610 152098 254369 355838 155449 61500 37335 131520
8694 131520 91011 39578 50584 193831 92771 69491 142347 20676 68804 -3387 -6489
8683 -6489 -108243 -62474 -58236 -25303 43692 -99893 -108880 -156249 -48157 -13206 -123972 -75498
8671 -75498 25063 117076 154017 188984 189661 146390 74919 158478 130011 83312 14232 16378
8659 16378 188085 301055 236824 251808 277890 225851 178158 218322 186068 126504 120050 140528
8647 140528 -4011 -43473 -13388 25760 106591 243618 280362 278134 156506 153532 188131
8636 188131 103094 29286 48975 20198 -6418 23505 -26895 -25965 35193 51426 66609 139102
8624 139102 117745 95752 146977 119089 46552 56774 91377 67098 20295 121795 195857
8613A95857l3120K5914j8992k16418l9951M6050Q8491Q3087M1076l1484k6581
8602A13929R5510L9315q7374m8700L9680J00069o5647j29271K3981J89332J25567
8591C96391j3938m0870k6795M5662k8757r4044J09968R1553J5149P8669m6057
8580D86931n2941L2208R0373p2764j42813n6646L7795K9148K4408O2766J19412
8569E57877m2768j05934M9598o3643n1840j82893m5223J88577J17353P6161r4499
8558D02766l7274q576j90796j03932K8782P0545o3066N5978J65925o7984j13856
8547A38512o4055j22449p3160J10586O2562J41657L1906o2444r521K2139N3578
8536B29311M7878k336n4610R5230L9569J05281P6988l0953l1320o5696o0055j71734
$$ plain form
8613 195857 162737 188651 169659 -46759 -86710 -40660 47831 130918 171994 140510 113929
8602 113929 209439 248754 161380 112680 152360 252429 186782 57511 81492 270824 396391
8591 396391 382453 341583 314788 360450 331693 237649 347617 439170 454319 532988 486931
8580 486931 433990 466198 556571 483807 340994 284348 322143 351291 375699 438465 557877
8569 557877 515109 409175 458773 395130 343290 160397 115174 303751 421104 497265 402766
8558 402766 365492 356916 166120 62188 90970 161515 98449 154427 320352 252368 138512
8547 138512 74457 -47992 -121152 -10566 51996 193653 225559 163115 153594 175733 229311
8536 229311 277189 274853 220243 315473 355042 460323 537311 506358 475038 409342 349287 177553
8524A77553j46967O4533J41475L5972K8256P5114l1657r9182j18654j7374K5166
8513A34235M1856P1595J1054n7811r3563q618J77992J02672J3925n9504p6932
8502B56901R2094r2837j34204p4873R4681k0625r1520j33481J03442m956L0869
8491B5491J26067J39975J21155K08501J49727J83464Q6701l4339k70381l31002
8481D05359j74431l9386j32432M0687O370P543R2326k4405K3122J9629Q2932L2230
8469C39544K4285m1793n4855q2680o6862J3328N4830K5867J535p3451J50012k0018
8457B69742p551J2905j75651o3789Q5438K469j1771n8947M0059J48252R0437K149
8445C33742m0453O1338J72343J24327j0040M343Q4614j37628k59556k12510K997
$$ plain form
8524 177553 30586 95119 236594 272566 300822 375936 344279 245097 126443 109069 134235
8513 134235 176091 247686 258740 200929 107366 98748 276740 379412 393337 333833 256901
8502 256901 348995 256158 121954 47081 141762 121137 29617 -103864 -422 -5378 25491
8491 25491 151558 291533 412688 621189 770916 954380 1041081 1006742 736361 405359
8481 405359 230928 191542 59110 99797 106167 113710 206036 181631 204753 224382 307314 339544
8469 339544 363829 322036 267181 184501 117639 130967 185797 211664 213199 139748 289760 269742
8457 269742 262191 275096 99445 35656 121094 123563 111792 52845 92904 241156 331593 333742
8445 333742 293289 354627 526970 651297 641257 645600 730214 592586 333030 120520 123517
8434A23517P6546J1625j08855r3574O8459J24154R4839m6685j23069m2486o3600
8423B0871o015Q1604J2528o8491j45343j111O5934R3676r0256Q4880k3038J9749
8411D4988J31908j11376K8476o690n5705k0374L5502q5684j3901N750k6848M9744
8399b4210K9834J4906L0543O2482L7205j17045k06923J18888L6230O4167J08159
8388A54236l2245J18146j0241j2831k27438j48037J60171k7897m1715o8829p2724
8377b09404m191J0956J09968J15525P1938M3741j14926j14593p2406p8051j9945
8366b61388J40198M6511l364o9008J7896r1137k1208J09623o585O6875J17594
8355D6007N5231J506j12287n8489j92725P4735n0618j00693M4257J17035J34272
$$ plain form
8434 123517 200063 211688 102833 9259 77718 201872 296711 250026 126957 84471 20871
8423 20871 14856 96460 108988 40497 -104846 -105957 -40023 53653 -36603 48277 25239 44988
8411 44988 176896 65520 93996 87306 31601 11227 46729 -38955 -52856 -47106 -73954 -24210
8399 -24210 5624 20530 51073 113555 150760 33715 -173208 -54320 -18090 46077 154236
8388 154236 121991 240137 229896 217065 -10373 -158410 1761 -26136 -67851 -136680 -209404
8377 -209404 -213595 -202639 -92671 22854 94792 138533 23607 -90986 -163392 -241443 -261388
8366 -261388 -121190 -74679 -78043 -147051 -129155 -220292 -241500 -131877 -138462 -71587 46007
8355 46007 101238 102744 -9543 -68032 -260757 -186022 -236640 -337333 -293076 -176041 -41769
8344d1769J74001m4769j42506m304P3656m0525k8181M4222O819O1096O0789K6998
8332A45527r8680j08020m5739q741P3674r4067K8257L1416N0491M0536m5214L2464
8320A904K4299N8708n3298J3564O3396o8501j00688L1580m0983K7886K3834Q9481
8308G1182K2373o7237o2547q4739J27221K426j7558N8902m2982J3658l4685p509
8296b1495Q0168J48693l9871M9422o8809n41n561o4557o4979l6437j7168L8087
8284c048m6394j0539r0211N9513J01746J26308L6585q3499r5251n4839l6705N8575
8272c7759M769P6694K125j03161j4503k3250O6703Q8556K0962K12k5936P3798
8260A29210j8292j17822m4021L4847Q754l0445L9579L4980O7854o5345N9388L244
$$ plain form
8344 -41769 132232 87463 -55043 -59347 14309 -26216 -54397 -10175 -3356 57740 118529 145527
8332 145527 46847 -61173 -106912 -115653 -41979 -136046 -107789 -76373 -25882 14654 -30560 1904
8320 1904 26203 84911 31613 45177 108573 40072 -60616 -29036 -70019 -42133 -18299 71182
8308 71182 93555 26318 -36229 -120968 6253 8679 -8879 50023 7041 20699 -13986 -21495
8296 -21495 58673 207366 167495 216917 148108 147567 142006 77449 12470 -23967 -41135 -3048
8284 -3048 -49442 -59981 -150192 -90679 11067 137375 173960 90461 -4790 -59629 -96334 -37759
8272 -37759 -32990 43704 45829 -57332 -71835 -95085 -28382 60174 81136 81348 55412 129210
8260 129210 110918 -6904 -50925 -16078 -7324 -37769 1810 36790 104644 39299 98687 101931
8248A01931j04185k5756k629l3747K2772k1122K47786m8334p4529j14026R0120
8237C8281j6570k6283p2910k6056K2921K84L5212M1178m461J1885L66m7363M9889
8224F373l8500J616K8119o6675M1563p9207o4957n8137J80306O9896r8967L4062
8212d4508Q7074J3918J31052N9329l0153l2068q8355l5815M4493K9085K2383j1037
8200A45398o9727m8655j9170r2385K7929j3189M9579m8433k2874L0550P2623R3561
8188A05207o9816j17202N9761N9236O4416P7498K3279q2333r7151o046J4053j21
8176C0781j12569M5393P27j5367J18105M9942l1604m5615q9506j14362k8620J68725
8164b3970N5481M2405Q9046K2403q1817p9592j47229n788N8692o9714l0723o5006
$$ plain form
8248 101931 -2254 -28010 -30639 -64386 -41614 -62736 185050 136716 62187 -51839 38281
8237 38281 21711 -4572 -77482 -103538 -80617 -80333 -45121 -3943 -8404 3481 3847 -43516 6373
8224 6373 -32127 -30511 -2392 -69067 -27504 -106711 -171668 -229805 -49499 20397 -78570 -44508
8212 -44508 42566 56484 187536 246865 216712 184644 96289 60474 104967 134052 156435 145398
8200 145398 75671 27016 7846 -84539 -56610 -69799 -20220 -68653 -91527 -60977 11646 105207
8188 105207 35391 -81811 -22050 37186 101602 179100 202379 120046 22895 16849 30902 30781
8176 30781 -81788 -36395 -35668 -51035 67070 117012 85408 39793 -49713 -164075 -192695 -23970
8164 -23970 31511 73916 162962 185365 103548 23956 -123273 -129061 -70369 -140083 -170806 -235812
8152b35812l2273J11884J0440n4247K6043R8926j00085L2700m5714l5720l0186
8141b54044K9408J01048O1378o004J3726J28765j6045r6706J9865l5818q660O2140
8129i47n4466p1947R7417L8915P6104l2605o1041j2914O7227J03539p6647j80195
8117a07560j00200l1762J7019L2684N715J10232R1264L4369o9799R913l3207q0746
8105a22078N2732R8153j6163j11009J8580J6766l6186j9222R0279J04775L6545
8094A13172p4367p3821O1892J9429L7057J04353j02192j98777p4678O3618J09831
8083a4483L8303M3272N3308n012p1015K6254m3489k7124j9810M6078j643r1537
8071f6898K7274J44190O2795p2811p3609k6947K5771J5761R7046n1783p814l9423
$$ plain form
8152 -235812 -268085 -156201 -145761 -200008 -173965 -75039 -175124 -142424 -188138 -223858 -254044
8141 -254044 -224636 -123588 -62210 -68214 -54488 74277 58232 -38474 -18609 -54427 -63087 -947
8129 -947 -55413 -127360 -29943 8972 85076 52471 -8570 -21484 45743 149282 72635 -107560
8117 -107560 -207760 -239522 -222503 -189819 -184104 -73872 17392 51761 -18038 -8125 -41332 -122078
8105 -122078 -69346 28807 12644 -98365 -79785 -63019 -99205 -118427 -28148 76627 113172
8094 113172 38805 -35016 26876 46305 83362 187715 85523 -113254 -187932 -124314 -14483
8083 -14483 23820 67092 120400 115388 44373 70627 27138 14 -19796 26282 24639 -66898
8071 -66898 -39624 104566 167361 94550 20941 -6006 19765 35526 132572 80789 72975 33552
8059C3552j56568q8442L1568Q6292J93614L1742l5493j28621j7752O9673O7669
8048H7234K7399j17298J4721N05l9624q2293M7577Q6811K4151Q041J3621j15083
8036d4238J3392M9938p0439k8727J36241N1740N54k3199j3283q0520q4415K1353
8024g1603K09330R9254j17938m2173Q9555m3562L3336L7107k8588J172J5774q448
8012A73216n7701K5073M4956Q4572j1366L5442r4972q5689L123M5064J08864l3033
8000B37549L5227O3988P249Q1226n4100K2207J6125n3445k4448r2890p9338p3560
7988H5790P3490j3274M3393N1781N2858J32437K7956J762J42090l7081j99039
7977C62163p3489J46939o4856m9891R5708J11104l9541j04021j8584L3243L295
$$ plain form
8059 33552 -123016 -211458 -179890 -93598 100016 131758 96265 -32356 -50108 19565 87234
8048 87234 114633 -2665 12056 12561 -27063 -109356 -61779 25032 49183 57224 70845 -44238
8036 -44238 -30846 19092 -51347 -80074 56167 107907 108461 85262 71979 -8541 -92956 -71603
8024 -71603 137727 236981 119043 76870 166425 122863 156199 193306 164718 165890 181664 173216
8012 173216 115515 140588 185544 270116 258750 294192 199220 113531 116654 161718 270582 237549
8000 237549 272776 336764 344013 425239 371139 393346 409471 356026 331578 238688 159350 85790
7988 85790 159280 146006 189399 241180 294038 426475 454431 456193 598283 561202 362163
7977 362163 288674 435613 370757 320866 416574 527678 488137 384116 365532 398775 402070
7966D02070n0168j31947j02481J0140L8292o8584q7597j8038n5559J8507m8J1430
7954c3983L1808j6300N7868J45119N6931l9166j2561J18926P7567j0637R9972
7943D75544P0939k4026k1956q0932L2278l4012N3815m4567j93848j38468P7008
7932A71775l1081M7697J0139m0640o2808L1554p0256N9102J13647p1807m2488
7921A14834J2993o834o568J08988N0478p5326o6020O449M3339n5151R233o371
7909A30044N5001L1244j2753r4840L6735m5221j62499l8477Q6856q605Q43L8627
7897A6955P0434q2538O700j0518L4843Q1213m7818q5895j5099K2392M6395m111
7885C2953p9781R6011Q1903j04421q3587p3409Q722M135k0391j0573L6882q196
$$ plain form
7966 402070 351902 219955 117474 127614 165906 97322 9725 -8313 -63872 -45365 -45413 -33983
7954 -33983 -2175 -18475 39393 184512 241443 202277 189716 308642 386209 375572 475544
7943 475544 546483 522457 500501 419569 451847 417835 471650 427083 233235 94767 171775
7932 171775 140694 188391 198530 157890 95082 126636 56380 115482 229129 157322 114834
7921 114834 127827 120993 114425 223413 273891 198565 132545 138994 182333 127182 136415 130044
7909 130044 185045 216289 203536 108696 145431 100210 -62289 -100766 -13910 -22515 -21672 16955
7897 16955 87389 4851 11551 1033 35876 117089 69271 -16624 -31723 -9331 37064 32953
7885 32953 -46828 49183 131086 26665 -56922 -130331 -121609 -117474 -137865 -148438 -111556 -119752
7873a19752m1895n7787J64089O7960p7668Q39J2786K7620j4749j3046m4011M7904
7861d7710P7573N0K9149j9444N4381M0634j16420M2646r467o8532j155o658m3918
7848f8871q1334M7914O3588J14476O884n5215K6563N5124J5217j29537J9275Q1035
7836I5119K5863j778r5891J8582N1058J05266P9496r2349k4097o7501J734O4753
7824A60255N2243o4020j17158j02275Q0771M8120r6579k8573J44263q7554j39715
7813a50222j24607J08556J94698J9709o5016K4225M6330L8822M5131L2560Q4481
7802B54667P1271j2691j41328k06205J3219N1804k6279p2227l1061O2838N2722
7791A6730J4885Q312Q7695l7201l801j15475l3502m3743O7500J10844L80q0363
$$ plain form
7873 -119752 -161647 -219434 -55345 12615 -65053 -64214 -51428 -23808 -38557 -51603 -95614 -47710
7861 -47710 29863 29913 59062 39618 93999 134633 18213 60859 51392 -17140 -18295 -24953 -68871
7848 -68871 -150205 -102291 -38703 75773 82657 27442 54005 109129 124346 -5191 14084 95119
7836 95119 120982 119204 23313 41895 92953 198219 277715 185366 161269 93768 95502 160255
7824 160255 212498 148478 31320 -70955 9816 57936 -38643 -67216 77047 -10507 -150222
7813 -150222 -274829 -166273 28425 48134 -16882 7343 53673 92495 137626 170186 254667
7802 254667 325938 313247 171919 -34286 -21067 30737 4458 -67769 -98830 -35992 16730
7791 16730 31615 39927 127622 90421 86620 -28855 -62357 -106100 -38600 72244 72624 -7739
7779g739J7374q622j2115r020L3289k6148j18431q471J19242K4783m0766n3243
7767h9867l7624J2603N663M4396k7799j852j32669K8392O5215K00563r4088l7563
7755f4630o7714M8296n1098l9951J19697M62K2291Q1365J7403l6889m5027k2815
7743c8610N1817m2231L1294O34j3354J33088l983k7486m1236J33633N5052p441
7731B31177q5975p9886r1987n2998m0277l2762O4600j16549O9830J10642r335
7720c3520k7038J0184m0481N296K9727N9964l9473J8096n5591p9809J2699J63041
7708B3095l6805o3096r0057J26036J6738r162J9660p5833q099R0021j5176M5403
7696B2725l3060r5202M9259J33086j20211j82034R4936l0241K2111R5432J15978
$$ plain form
7779 -7739 9635 1013 -11102 -20122 13167 -12981 -131412 -139883 -20641 4142 -36624 -89867
7767 -89867 -127491 -114888 -109225 -64829 -92628 -94480 -227149 -198757 -133542 67021 -27067 -64630
7755 -64630 -132344 -84048 -135146 -175097 -55400 -54938 -32647 48718 66121 29232 -15795 -38610
7743 -38610 13207 -29024 2270 2904 -10450 122638 118655 91169 49933 183566 238618 231177
7731 231177 145202 65316 -26671 -79669 -119946 -152708 -88108 -204657 -134827 -24185 -33520
7720 -33520 -60558 -50374 -90855 -85559 -55832 4132 -35341 -17245 -72836 -152645 -139946 23095
7708 23095 -13710 -76806 -166863 -40827 -24089 -33251 -13591 -89424 -97523 -7502 -22678 22725
7696 22725 -10335 -105537 -56278 76808 -43403 -225437 -130501 -160742 -138631 -43199 72779
7685G2779o8139j28733P8013k7592M7073p0036J1851K4982K3792L6469m2752J9174
7673b3119M3071J36841o2054o9605j04329N3102P3391j5227n066K297L9576J9230
7661H8108j2159p2690o0372J10697M8983j2467l6919k0645J5050m8034m7488J21980
7649G4044n5888j80209j55607P4802J81917N2528r6261J43718J86655j29555j35075
7638c8931J1121J192J6064P5591K6206J11604j01747j15492N9490J03888J3984
7627A62970o1724P2935M2944j47754n135R7428q1485K2332N6534r8855p4486k2421
7615c6717j5442K7169J2589N0306J3033k7039J402Q905M4786O1018j92043j58445
7603b10478L5291J35136J22448p7488j58829M8341N3152j5178L9704Q9947J04959
$$ plain form
7685 72779 4640 -124093 -46080 -73672 -26599 -96635 -84784 -59802 -36010 459 -42293 -23119
7673 -23119 19952 156793 94739 25134 -79195 -26093 47298 32071 27005 29302 68878 88108
7661 88108 75949 3259 -57113 53584 102567 90100 53181 32536 47586 -448 -47936 74044
7649 74044 18156 -162053 -317660 -242858 -60941 -8413 -104674 39044 225699 96144 -38931
7638 -38931 -27810 -26618 -10554 65037 91243 202847 101100 -14392 45098 148986 162970
7627 162970 101246 174181 217125 69371 64236 161664 80179 102511 159045 60190 -14296 -36717
7615 -36717 -52159 -24990 -12401 37905 50938 23899 25301 34206 78992 140010 -52033 -210478
7603 -210478 -175187 -40051 82397 4909 -153920 -105579 -52427 -67605 -27901 62046 167005
7592A67005p1496n2562q6016q408N3116J37826j2636j14173O220M9687k68p5581
7580g286P6703r1763r1122j9916n2840J08230P9235L9772m6223p6706K3044m217
7568f3089K11970P8498o0291m3748J2239n2485p1545j0160p0843j62826J4841
7557b17439J31878l5850J6889j8949l5957m4965J88567O4153j6491M7825J3252
7546I2913M5140q4625j12550k7118N9646L3669j07521J4348K0106o4441j7307
7535a47740N4020j9772Q9501L5294j15903K6383k3459m8416K8695O6621j1725
7524f6501K3647l8296k767M2598M7830K867j208L0937j2930L4065k8754l2670
7512a182p0652l0810j2149M0185K9683k0584j17650l6185J38958P4346m1813J26529
$$ plain form
7592 167005 95509 42947 -43069 -51477 1639 139465 126829 12656 18876 68563 68295 -7286
7580 -7286 69417 -22346 -113468 -133384 -186224 -77994 1241 41013 -5210 -81916 -58872 -63089
7568 -63089 148881 227379 167088 123340 135579 83094 11549 1389 -69454 -232280 -217439
7557 -217439 -85561 -121411 -104522 -123471 -159428 -204393 -15826 48327 31836 79661 92913
7546 92913 138053 53428 -59122 -86240 -26594 7075 -100446 -86098 -65992 -130433 -147740
7535 -147740 -93720 -113492 -23991 11303 -104600 -78217 -101676 -150092 -121397 -54776 -66501
7524 -66501 -42854 -81150 -83917 -41319 6511 9378 8170 39107 26177 60242 31488 -1182
7512 -1182 -71834 -102644 -114793 -74608 -44925 -65509 -183159 -219344 -80386 -6040 -47853 78676
7500G8676O7071K0735p2888l7366n780p8991M246J7209m9327l6029N0999J20724
7488G9279O497j8948J0633J4828j53587p1658n208L0544k0660j9593K9754J39874
7476B1755r4976r8858O5360J16730R3065L6940o1067j86645M2959P6710R8469
7465A10442M7950m0628P9466j5262p0614l5098n3598q8150l8664m8474K7961J04605
7453b0064O6351Q6383q7141j61050L8689j7442J09958R6153l4387p4468m4524
7442d1542J671q0249n5783Q4201J37142r573k3577o319j00498l2494N4809L0273
7430d1939n0205q9350m3770L8937k5071M4218L6637M7241l0211q9101K08190K15526
7418B21102O1245j06446j83216j19288n6484l8423J09242L1938k3159l506q9496
$$ plain form
7500 78676 145747 166482 93594 56228 50448 -28543 -24297 -7088 -56415 -92444 -41445 79279
7488 79279 85776 66828 77461 92289 -61298 -132956 -138164 -107620 -128280 -147873 -118119 21755
7476 21755 -73221 -172079 -106719 10011 103076 140016 78949 -107696 -64737 11973 110442
7465 110442 158392 117764 197230 181968 111354 76256 22658 -65492 -104156 -152630 -124669 -20064
7453 -20064 46287 132670 45529 -115521 -76832 -94274 15684 111837 77450 2982 -41542
7442 -41542 -39871 -120120 -175903 -91702 45440 35867 12290 5971 -94527 -127021 -72212 -41939
7430 -41939 -92144 -181494 -225264 -186327 -211398 -167180 -130543 -83302 -113513 -202614 5576 221102
7418 221102 282347 175901 -7315 -126603 -183087 -221510 -112268 -80330 -103489 -106995 -196491
7407a96491K8062R2073J42672N4100o7765N0073L1768j21871j7088M2889j68087
7396a29665Q0099M7366K5790R302j1257j01323O9701P5425J6314L0812L521k5783
7384I0302L0596J1087k5679p7350j04872j33024n1138J39856r2993j9083p877
7373b40175M083K8482O1264J86958n871J3792j9998j00393q3333J2927j1665P217
7361a46712R5815K80564r6914j47369k8864J29701o4117j02038O2438P8086M1713
7350A02303P3957o2170p9358m4653l8054R3958p0629Q2504J14375n0198r519j23943
7338a1427J2085J00180m6905l7635P6525m2142m8188R8595l9506j34604L5786
7327c7236K5058L3115O9962J08760p3224j47366R386P615p34Q9490P0232l9779
$$ plain form
7407 -196491 -168429 -76356 66316 120416 52651 102724 134492 12621 -4467 38422 -129665
7396 -129665 -49566 -2200 23590 32892 21635 -79688 -9987 65438 81752 112564 116085 90302
7384 90302 120898 131985 106306 28956 -75916 -208940 -260078 -120222 -213215 -232298 -240175
7373 -240175 -236092 -207610 -146346 40612 34741 48533 28535 -71858 -155191 -142264 -153929 -146712
7361 -146712 -50897 229667 132753 -14616 -43480 86221 22104 -79934 -17496 60590 102303
7350 102303 176260 114090 34732 -9921 -47975 45983 -24646 57858 172233 122035 112516 -11427
7338 -11427 658 100838 53933 16298 92823 50681 2493 101088 61582 -73022 -37236
7327 -37236 -12178 20937 90899 199659 126435 -20931 -11545 -3930 -4664 84826 155058 115279
7315A15279j44681n9533J37143q1105r6929m0494L329Q1077K8788L6599p5375
7304i5902l0913N0097J70379M0245Q4405m7284q1399r493j27387M3310p3471p1572
7292a48985M6183m9794M8838K9542J061n109m8049N1637R8411n8511j447J1380
7280b4843Q342M5566Q9525L5093q2303o8430O4646p892q2778j10167J943J87794
7268E6496J1161o8079Q1484k6928Q092P6667J3205r6583n0471N8685P364k1941
7256D9152l961j01650k4705K9063M8638O5224o4124q1730p216M9470J1914j0275
7244d0200O9880J21736o3068J3245q0309m8856J2214J11074j08438k0205l9212
7233g2139Q8579J1135r1613L2578l3590J56833j7804J540K2375j30759k8757K2286
$$ plain form
7315 115279 -29402 -88935 48208 -32897 -129826 -170320 -166991 -85914 -57126 -20527 -95902
7304 -95902 -126815 -76718 93661 133906 218311 171027 89628 80135 -47252 -3942 -77413 -148985
7292 -148985 -102802 -152596 -103758 -74216 -73155 -78264 -126313 -74676 23735 -34776 -36223 -24843
7280 -24843 -16501 29065 118590 153683 71380 2950 67596 59704 -23074 -133241 -131298 56496
7268 56496 67657 -422 81062 54134 62226 138893 152098 55515 5044 63729 71093 49152
7256 49152 45191 -56459 -81164 -52101 -3463 61761 -2363 -84093 -91309 -41839 -29925 -40200
7244 -40200 29680 151416 88348 101593 21284 -27572 -15358 95716 -12722 -32927 -72139
7233 -72139 16440 27575 -64038 -31460 -65050 91783 73979 75519 97894 -32865 -61622 -39336
7221c9336K4085k5717l1270Q4985J0403r554L4965q6248j11055o3251K0135P3912
7209a17946J11208P3865J629j864K645Q7467N1051j53059j47622k3811j2068m4365
7197a72870J5471O052P0897m1561q5898J8616J76688K1797j5269p1462M0486M0132
7185C079k1892R970j1297J05230o2247L6136n7123j01346o69m343M0145K6929
7173c7428K366j09225r744q736M0921P0685M0339n033m4888l6035P0036J30640
7161A03898M4036l1907p4907N5935M9162k10948k5985o9493P546L9845Q8488M137
7149b0193j55213P4807j9547j82159P2851J81773P34K383o7813n3448J17908j548
7137d9465O5799J0032j2973n9722j09680O5424R8571m3707j17040K954Q5475j22841
$$ plain form
7221 -39336 -15251 -40968 -72238 12747 23150 13596 48561 -37687 -148742 -211993 -191858 -117946
7209 -117946 -6738 67127 68756 66892 69537 157004 208055 54996 -92626 -116437 -128505 -172870
7197 -172870 -157399 -151347 -80450 -122011 -207909 -189293 -12605 9192 -6077 -77539 -37053 3079
7185 3079 -18813 -8843 -20140 85090 22843 58979 1856 -99490 -100159 -104502 -64357 -37428
7173 -37428 -35062 -144287 -154031 -162767 -121846 -51161 -10822 -15855 -60743 -96778 -26742 103898
7161 103898 147934 116027 41120 97055 146217 -64731 -90716 -160209 -152663 -112818 -24330 -20193
7149 -20193 -175406 -100599 -120146 -302305 -229454 -47681 -46947 -44564 -112377 -165825 -47917 -49465
7137 -49465 16334 26366 13393 -46329 -156009 -90585 7986 -35721 -152761 -149807 -64332 -187173
7125a87173o6293J48680L8438m110j36533q212Q8246M1343M5044L1942j7109O7979
7113D2242l3021j09838O8621P2715J02825Q3507q6907j49043Q6556J25224J00997
7102C03878j32974Q27r1394p2354k8553N2305j3471j41559m331P2622o5675R0259
7090c0420J40305J29349n9431j51259j42030L559O0473l8348K8670M1671J0724
7079f737k1152j35125j2315R1010M8268K9055l6171J7600J04623O0569j06381
7068C3244j19636n4163Q5025J25275J21301m9561K0261J1353j75682n9853R0661
7057B8225J69232l0282j31907o0393j13556J7615M9282M5355j9344r7319R5298
7046d7794r257j09474J8553R8511j1923O8626J35400n9827p7754L236m5163o2371
$$ plain form
7125 -187173 -253466 -104786 -66348 -70458 -206991 -215203 -126957 -85614 -40570 -8628 -25737 42242
7113 42242 9221 -100617 -31996 40719 143544 227051 140144 -8899 77657 202881 303878
7102 303878 170904 171731 80337 7983 -20570 31735 18264 -123295 -127626 -55004 -120679 -30420
7090 -30420 109885 239234 179803 28544 -113486 -109927 -49454 -87802 -59132 -17461 -6737
7079 -6737 -27889 -163014 -175329 -84319 -36051 -6996 -43167 -25567 79056 139625 33244
7068 33244 -86392 -140555 -55530 69745 191046 141485 161746 173099 -2583 -62436 28225
7057 28225 197457 167175 35268 -25125 -138681 -121066 -71784 -26429 -45773 -143092 -47794
7046 -47794 -57051 -166525 -147972 -49461 -61384 7242 142642 82815 5061 8297 -36866 -99237
7034i9237J19220O7570j18646j03148P913P2171j3537k603P8737L7635q256j6376
7022B1443l967L8138N309l5506l6337L9806M3730r5776r0924m3967O3640j07842
7010b02253o0081M4873J5077M4785J3788Q6143j07348L9053J45982M8566l1630
6999C6955M9995l8148j47063l7277J07037J39141n996n8378O1052q0764j16316
6988h9762p0223k2285k5990J23000J22909o3079j6069O7647J0086m4878j0925
6977a9569L0213L3930J5230J0474k8999N1144l8311J530K5887q4410K0598n5900
6965c8183o5721P8023J2049o0803J10968J37782n5134m5488l5615r8638n6647
6954a17407m2072o0936R2184J93261J19483j8642q1641o7906j2663l9967K7490
$$ plain form
7034 -99237 19983 87553 -31093 -134241 -126328 -54157 -67694 -70297 8440 46075 37819 21443
7022 21443 17476 55614 60923 25417 -10920 28886 72616 -23160 -114084 -158051 -94411 -202253
7010 -202253 -262334 -217461 -202384 -157599 -143811 -57668 -165016 -125963 20019 68585 36955
6999 36955 86950 48802 -98261 -135538 -28501 110640 104644 46266 107318 26554 -89762
6988 -89762 -159985 -182270 -208260 -85260 37649 -25430 -41499 26148 36234 -8644 -19569
6977 -19569 10644 44574 59804 70278 41279 92423 54112 55642 81529 -2881 17717 -38183
6965 -38183 -103904 -25881 -13832 -74635 36333 174115 118981 73493 37878 -60760 -117407
6954 -117407 -159479 -220415 -128231 65030 184513 165871 84230 16324 3661 -36306 -8816
6943h816m6191J57962P3756J1395p3656p5329l5523o489M2878j2055j08537K7766
6931e2839J14923m3675l8616L058Q792J46979q783j10207k7428J07883J3032K1154
6919A34273j94668R2372N0864o624n8644l6582l5648k6941p290J4458M315K1114
6907d9001M6929j9118j0687N3140p5516j86803j0848J41054p1137n5907J07831
6896a30063J16110R6176M2746r7383j07778J34536l3834m731o0906l9767Q2878
6885b016m3748l3177M0882N083J2481j03462j2601N6466K8044N6769P5541J29457
6873B09719n5154j71790J01755J23144p2573m189k2688k044o9163N2984j7141
6862G2860r2595Q6874j5007N4182J13226j0116j07879j28832n481q3927n7579
$$ plain form
6943 -8816 -55007 102955 176711 188106 114450 39121 3598 -2891 39987 27932 -80605 -52839
6931 -52839 62084 18409 -20207 -17149 -8357 138622 129839 19632 -7796 100087 113119 134273
6919 134273 -60395 31977 82841 76217 17573 -19009 -54657 -81598 -88888 -74430 -70115 -49001
6907 -49001 -2072 -21190 -31877 21263 -54253 -241056 -251904 -110850 -181987 -237894 -130063
6896 -130063 -13953 82223 124969 27586 -80192 54344 20510 15779 -45127 -84894 -2016
6885 -2016 -45764 -78941 -38059 -32976 -20495 -123957 -136558 -80092 -52048 4721 80262 209719
6873 209719 154565 -17225 84530 207674 135101 130912 108224 106180 37017 90001 72860
6862 72860 -19735 67139 52132 106314 219540 209424 101545 -27287 -32768 -116695 -174274
6851a74274n4625p707O6130J05390J01401k2954J15291J56564p1828j90308l6637
6840a3557n7629k6359J20120o54P3532K3141j15274M6961q469j4500j05258L9652
6828c8294O2439j37479j21897l2822j5622m2929N7431J31347L6870j54844j5174
6817b70974J45694O8326L645P8528l7684n1190O8330n3654J3773N1896q1265j78841
6805b43416R0433k2822q4038n0665J42267J29951Q0388j4792r4645p2644M8823
6794i1160N4239L2848M969J8639j05255j01244M2524P6300J04252p5229j28246
6783a67363Q5305M6432o6935L4572O8676J01662j2731l6277n1395j04761P9025
6772b3790Q612n4063J9115L6749j792N0803J56277M4631j9883j09718q8763m2595
$$ plain form
6851 -174274 -228899 -236606 -170476 -65086 36315 13361 128652 285216 213388 23080 -13557
6840 -13557 -71186 -97545 22575 21921 95453 118594 3320 50281 41812 27312 -77946 -38294
6828 -38294 24145 -113334 -235231 -268053 -283675 -326604 -269173 -137826 -100956 -255800 -270974
6817 -270974 -125280 -56954 -53309 25219 -12465 -63655 4675 -48979 -35206 16690 -64575 -243416
6805 -243416 -152983 -175805 -259843 -310508 -168241 -38290 42098 27306 -67339 -139983 -91160
6794 -91160 -36921 -4073 896 19535 -85720 -186964 -144440 -68140 36112 -39117 -167363
6783 -167363 -82058 -35626 -102561 -67989 687 102349 89618 53341 1946 -102815 -23790
6772 -23790 -15178 -69241 -50126 -13377 -15169 35634 191911 236542 216659 106941 18178 -24417
6760b4417j1989N4901K7483r3356j53650Q001j364q097R787J13194J75238k4129
6748G1602Q627L2253q8867J6222P8204j8067r3352q6885L1212K0333P5646N0863
6736I7791N9470k1697r4615k0132M0675R369o7852O8376N3436j51210j5172J48557
6724A06996k6434o6368Q2718l1379j51629N4843K0750o4830J9877J50227L4824
6713A29595R757n5442n2603q1505k7366p1469n1964R5166O1925K7106L1582j406
6701A3376m5746j067J1625K1223J14670q2110q0754l7554j16473m7607P4035J18022
6689e8360M9593M7923K754M667K1451J1222j43828J11703n7956l1125l5071K2957
6677e4070J6103N4620O0951K0358P460q1982j08711j475N7234M3686n0742K4445
$$ plain form
6760 -24417 -36406 18495 45978 -47378 -201028 -193027 -194391 -202488 -192701 -79507 95731 71602
6748 71602 80229 112482 23615 39837 118041 99974 6622 -80263 -49051 -28718 46928 97791
6736 97791 157261 135564 40949 20817 61492 70861 3009 71385 124821 -26389 -41561 106996
6724 106996 80562 14194 96912 65533 -86096 -31253 -10503 -75333 -55456 94771 129595
6713 129595 139352 83910 31307 -50198 -77564 -149033 -200997 -105831 -43906 -16800 14782 13376
6701 13376 -32370 -33437 -21812 -589 114081 31971 -48783 -86337 -202810 -250417 -176382 -58360
6689 -58360 -8767 39156 41910 46577 68028 79250 -64578 47125 -10831 -41956 -77027 -54070
6677 -54070 -37967 16653 77604 97962 105422 23440 -85271 -86746 -29512 14174 -36568 -12123
6665a2123o8365l3638N6352J7834o5483O7243M304o1353p1294P3384P1325j00212
6653a22026J3287J05880J17501M0535N0202m6230p8113l8212p8936p1434P644
6642i9902M3469p8643l5002n1354J66251J51401m4232q5907q8327K537M1256J39145
6630F0692P1098o9717j08669L5948J6968k1514r6258l2337Q0640M4506n2676J180
6618g0139J6482M5792L7205N7211r1397m8657n6940n0477J21559O9440N6774K6741
6606A13594l4006M5961O2844l1392m8781k9878r0636o5414R577N7424M2087Q9802
6594A21182J68417r1390j72410J9631J15670n8014j02965r7702k5343J37603l5892
6583b1213j15745J5726L1644k174O513P3160P1368o8663r3737P9296L2098j29219
$$ plain form
6665 -12123 -80488 -114126 -57774 -39940 -105423 -38180 -33876 -95229 -166523 -93139 -21814 -122026
6653 -122026 -108739 -2859 114642 155177 205379 159149 81036 42824 -36112 -107546 -99902
6642 -99902 -56433 -135076 -170078 -221432 -55181 96220 51988 -33919 -122246 -119709 -78453 60692
6630 60692 131790 62073 -46596 -10648 6320 -15194 -111452 -143789 -63149 -18643 -71319 -70139
6618 -70139 -53657 -7865 29340 86551 -4846 -53503 -110443 -160920 -39361 30079 86853 113594
6606 113594 79588 125549 188393 157001 108220 78342 -12294 -77708 -68131 -10707 31380 121182
6594 121182 289599 198209 25799 45430 161100 103086 121 -97581 -122924 14679 -21213
6583 -21213 -136958 -121232 -89588 -91762 -85249 -12089 59279 -9384 -103121 -23825 8273 -120946
6571a20946j76751l1780J48302Q7145r6544J7247k1040P8681R7782J4307m0816
6560d4413P3318J7828n8562L4225O6401j00263j05403n9309M9100P5848K7518
6549b3712N2479J17284J11907j33526o8978J0710M2155o3351n9871o7636M9392
6538c3147r623q8389k157O0238k8318J16472R549p3230N9478K6566L1774L1835
6526A01048o3087M3265m4849J8429j37028k8561J27131L0774j37382n0980P67
6515a40473N6654J12313o0734L7303l4752p5403M173J1339j9313N26J0921O5488
6503c1958M7445J5744j32660l9563J2752m9833l1012J03271J21456J17732q1100
6492E2274q7079N0909l433j43224l3410L1314J15460P0666p8371j81842Q67J65191
$$ plain form
6571 -120946 -297697 -329477 -181175 -94030 -190574 -173327 -194367 -115686 -17904 -3597 -44413
6560 -44413 28905 46733 -11829 22396 88797 -11466 -116869 -176178 -127078 -51230 -23712
6549 -23712 28767 146051 257958 124432 55454 66164 108319 44968 -14903 -82539 -33147
6538 -33147 -42770 -131159 -133316 -73078 -101396 15076 24625 -48605 10873 37439 69213 101048
6526 101048 37961 81226 36377 54806 -82222 -110783 16348 47122 -90260 -141240 -140473
6515 -140473 -83819 28494 -32240 5063 -29689 -105092 -100919 -89580 -108893 -108367 -97446 -31958
6503 -31958 15487 31231 -101429 -140992 -128240 -178073 -209085 -105814 15642 133374 52274
6492 52274 -34805 16104 12671 -130553 -163963 -132649 -17189 53477 -24894 -206736 -205869 -40678
6480d0678O1000J2842M5768n2541m7864n5878k4848k6516r090j8157K0808J2261
6468a22893J681m6695M5673K6019J62055Q5880m2364o1255r8112J2510O1652N6946
$$ plain form
6480 -40678 20322 33164 78932 26391 -21473 -77351 -102199 -128715 -137805 -155962 -135154 -122893
6468 -122893 -121212 -167907 -122234 -96215 65840 151720 109356 48101 -50011 -37501 24151 81097
$$ [...]
##END NTUPLES=NMR SPECTRUM
##END=
