##TITLE=Analysis number 324425
Compound Code ac 34564
Book Reference c
Project Code adrs
Chemist Name frontier sci
##JCAMPDX= 6.0         $$ Bruker NMR JCAMP-DX V2.0
##DATA TYPE= NMR SPECTRUM
##DATA CLASS= NTUPLES
##ORIGIN= Bruker BioSpin GmbH
##OWNER= nmr
$$ XWIN-NMR		Version 3.5
$$ Wed Nov 22 11:46:48 2006 GMT Standard Time (UT+0h)  MAYBRIDGE\nmr@NMR_250MHZ
##.OBSERVE FREQUENCY= 250.131544655141
##.OBSERVE NUCLEUS= ^1H
##.ACQUISITION MODE= SIMULTANEOUS (DQD)
##.ACQUISITION SCHEME= undefined
##.AVERAGES= 16
##.DIGITISER RES= 18
##SPECTROMETER/DATA SYSTEM= dpx250
##.PULSE SEQUENCE= zg30
##.SOLVENT NAME= DMSO
##.SHIFT REFERENCE= (INTERNAL, DMSO, 0, 16.522)
##AUDIT TRAIL= $$ (NUMBER, WHEN, WHO, WHERE, WHAT)
$$ ##TITLE= Audit trail, XWIN-NMR		Version 3.5
$$ ##JCAMPDX= 5.01
$$ ##ORIGIN= Bruker BioSpin GmbH
$$ ##OWNER= nmr
$$ C:\u/data/dgb/nmr/ADRS/820/pdata/1/auditp.txt
$$ ##AUDIT TRAIL=  $$ (NUMBER, WHEN, WHO, WHERE, WHAT)
(   1,<2006-11-22 11:46:17.33 +000>,<MAYBRIDGE\nmr>,<NMR_250MHZ>,
      <created by zg, POWCHK disabled, PULCHK disabled
       configuration hash MD5:
       49 4B E0 1D 92 C2 6B 37 9F E6 65 BC 52 41 86 1D
       data hash MD5: 64K
       B1 C5 9B FC C1 6D 2C 07 50 2C 44 29 68 2F EE 17>)
(   2,<2006-11-22 11:46:34.31 +000>,<MAYBRIDGE\nmr>,<NMR_250MHZ>,
      <Start of raw data processing
       ef LB = 0.3 FT_mod = 6 PKNL = 1 SI = 32K 
       data hash MD5: 32K
       9B 0A A5 CB 56 1C FF D3 35 96 43 82 9C 3A BC 67>)
(   3,<2006-11-22 11:46:36.08 +000>,<MAYBRIDGE\nmr>,<NMR_250MHZ>,
      <apk 
       data hash MD5: 32K
       06 53 03 6B 2E D9 A9 DF 66 2E E3 A3 4E BD 6E 0D>)
(   4,<2006-11-22 11:46:37.06 +000>,<MAYBRIDGE\nmr>,<NMR_250MHZ>,
      <abs ABSG = 5 
       data hash MD5: 32K
       78 87 DF 63 FE 10 B7 8C 90 17 16 EF 7D 6F 01 53>)
$$ ##END=
$$ 
$$ hash MD5
$$ 41 65 7E 9A 40 E4 A7 BD 91 A9 B8 BE 97 80 97 E2
##$RELAX= 
##$RELAX= 
##$RELAX= 
##$RELAX= 
##$RELAX= 
##$RELAX= 
##$RELAX= 
$$ Bruker specific parameters
$$ --------------------------
##$DU= <C:\u>
##$EXPNO= 820
##$NAME= <ADRS>
##$PROCNO= 1
##$TYPE= <nmr>
##$USER= <dgb>
##$AMP= (0..31)
100 100 100 100 100 100 100 100 100 100 100 100 100 100 100 100 100 100 
100 100 100 100 100 100 100 100 100 100 100 100 100 100 
##$AQSEQ= 0
##$AQ_mod= 3
##$AUNM= <au_zg>
##$AUTOPOS= <41 >
##$BF1= 250.13
##$BF2= 250.13
##$BF3= 250.13
##$BF4= 250.13
##$BF5= 500.13
##$BF6= 500.13
##$BF7= 500.13
##$BF8= 500.13
##$BYTORDA= 1
##$CFDGTYP= 0
##$CFRGTYP= 5
##$CHEMSTR= <none>
##$CNST= (0..31)
1 1 145 1 1 1 1 1 1 1 1 1 1 1 1 1 1 1 1 1 1 1 1 1 1 1 1 1 1 1 1 1 
##$CPDPRG= <>
##$CPDPRG1= <>
##$CPDPRG2= <>
##$CPDPRG3= <>
##$CPDPRG4= <mlev>
##$CPDPRG5= <mlev>
##$CPDPRG6= <mlev>
##$CPDPRG7= <mlev>
##$CPDPRG8= <mlev>
##$CPDPRGB= <>
##$CPDPRGT= <>
##$D= (0..31)
0 1 0 0 0 0 0 0 0 0.06 0 0 0 0 0 0 0.0002 0 0 0 0 0 0 0 0 0 0 0 0 0 0 
0 
##$DATE= 1164195976
##$DBL= (0..7)
120 120 120 120 120 120 120 120 
##$DBP= (0..7)
150 150 150 150 150 150 150 150 
##$DBP07= 0
##$DBPNAM0= <>
##$DBPNAM1= <>
$$ [...]
##$SUBNAM7= <"">
##$SUBNAM8= <"">
##$SUBNAM9= <"">
##$SW= 20.6930455092707
##$SWIBOX= (0..15)
0 0 3 0 0 0 0 0 0 0 0 0 0 0 0 0 
##$SW_h= 5175.983436853
##$TD= 65536
##$TD0= 1
##$TE= 683.16
##$TE2= 300
##$TE3= 300
##$TEG= 300
##$TL= (0..7)
0 120 120 120 120 120 120 120 
##$TP= (0..7)
150 150 150 150 150 150 150 150 
##$TP07= 0
##$TPNAME0= <>
##$TPNAME1= <>
##$TPNAME2= <>
##$TPNAME3= <>
##$TPNAME4= <>
##$TPNAME5= <>
##$TPNAME6= <>
##$TPNAME7= <>
##$TPOAL= (0..7)
0.5 0.5 0.5 0.5 0.5 0.5 0.5 0.5 
##$TPOFFS= (0..7)
0 0 0 0 0 0 0 0 
##$TUNHIN= 0
##$TUNHOUT= 0
##$TUNXOUT= 0
##$USERA1= <user>
##$USERA2= <user>
##$USERA3= <user>
##$USERA4= <user>
##$USERA5= <user>
##$V9= 5
##$VALIST= <valist>
##$VCLIST= <CCCCCCCCCCCCCCC>
##$VD= 0
##$VDLIST= <DDDDDDDDDDDDDDD>
##$VPLIST= <PPPPPPPPPPPPPPP>
##$VTLIST= <TTTTTTTTTTTTTTT>
##$WBST= 1024
##$WBSW= 4
##$XGAIN= (0..3)
0 0 0 0 
##$XL= 0
##$YL= 0
##$YMAX_a= 555502
##$YMIN_a= -325966
##$ZGOPTNS= <>
##$ZL1= 120
##$ZL2= 120
##$ZL3= 120
##$ZL4= 120
##$ABSF1= 16.522
##$ABSF2= -4.171173
##$ABSG= 5
##$ABSL= 3
##$ALPHA= 0
##$AQORDER= 0
##$ASSFAC= 0
##$ASSFACI= 0
##$ASSFACX= 0
##$ASSWID= 0
##$AUNMP= <proc_1d>
##$AZFE= 0.1
##$AZFW= 0.1
##$BCFW= 0
##$BC_mod= 0
##$BYTORDP= 0
##$COROFFS= 0
##$CY= 12.5
##$DATMOD= 1
##$DC= 0
##$DFILT= <>
##$DTYPP= 0
##$F1P= 14.0000005364418
##$F2P= -0.99999901652339
##$FCOR= 0.5
##$FTSIZE= 32768
##$FT_mod= 6
##$GAMMA= 0
##$GB= 0
##$INTBC= 1
##$INTSCL= 1
##$ISEN= 128
##$LB= 0.3
##$LEV0= 0
##$LPBIN= 0
##$MAXI= 10000
##$MC2= 0
##$MEAN= 0
##$ME_mod= 0
##$MI= 0
##$NCOEF= 0
##$NC_proc= -5
##$NLEV= 6
##$NOISF1= 0
##$NOISF2= 0
##$NSP= 0
##$NTH_PI= 0
##$NZP= 0
##$OFFSET= 16.522
##$PC= 1
##$PHC0= -48.04638
##$PHC1= 7.789635
##$PH_mod= 1
##$PKNL= yes
##$PPARMOD= 0
##$PSCAL= 4
##$PSIGN= 0
##$REVERSE= no
##$SF= 250.13
##$SI= 32768
##$SIGF1= 0
##$SIGF2= 0
##$SINO= 400
##$SIOLD= 32768
##$SREGLST= <1H.DMSO>
##$SSB= 0
##$STSI= 32768
##$STSR= 0
##$SW_p= 5175.98343685301
##$SYMM= 0
##$S_DEV= 0
##$TDeff= 65536
##$TDoff= 0
##$TI= <Analysis number 999999
Compound Code 99
Book Reference 9
Project Code 9>
##$TILT= no
##$TM1= 0
##$TM2= 0
##$TOPLEV= 0
##$USERP1= <user>
##$USERP2= <user>
##$USERP3= <user>
##$USERP4= <user>
##$USERP5= <user>
##$WDW= 1
##$XDIM= 32768
##$YMAX_p= 353099184
##$YMIN_p= -888876
$$ End of Bruker specific parameters
$$ ---------------------------------
##NTUPLES= NMR SPECTRUM
##VAR_NAME=  FREQUENCY,     SPECTRUM/REAL,   SPECTRUM/IMAG
##SYMBOL=    X,             R,               I
##VAR_TYPE=  INDEPENDENT,   DEPENDENT,       DEPENDENT
##VAR_FORM=  AFFN,          ASDF,            ASDF
##VAR_DIM=   32768,         32768,           32768
##UNITS=     HZ,            ARBITRARY UNITS, ARBITRARY UNITS
##FACTOR=    0.157963299565203, 1,           1
##FIRST=     4132.6476996994, 0,             0
##LAST=      -1043.33573715361, 0,           0
##MIN=       -1043.33573715361, -888876,     0
##MAX=       4132.6476996994, 353099184,     0
$$ Real data points
##PAGE= N=1
##DATA TABLE= (X++(R..R)), XYDATA
$$ [...]
$$ plain form
24899 222018 211141 109877 37949 111016 192912 120399 80989 62872 44781 104579 97844
24888 97844 -15318 -240529 -244233 -225911 -207676 -195135 -292038 -299099 -184171 -94133 -249180
24877 -249180 -297869 -176263 -86276 -155279 -184759 -177178 -156983 -92410 20168 140465 170003
24866 170003 256591 247204 206895 69878 -106008 -248203 -134718 33653 82756 86058 99649
24855 99649 113985 61930 74667 92533 67954 -13225 -39730 -117623 -126967 -118509 16849 -11616
24843 -11616 -110744 -22338 93601 122946 132940 -45488 -124800 -223149 -198957 -136715 -27825
24832 -27825 -72789 -91667 -94018 183204 287385 345921 205208 3109 467 52111 243891
24821 243891 247942 86003 31342 -81460 -86599 36938 152290 192997 38552 -25294 -54761
$$ packed form
24899B22018j0877j01264p1928P3067Q1896p2513l9410j8117j8091N9798o735
24888I7844j13162k25211l704J8322J8235J2541r6903p061J14928R0038j55047
24877b49180m8689J21606Q9987o9003k9480P581K0195O4573J12578J20297K9538
24866A70003Q6588r387m0309j37017j75886j42195J13485J68371M9103L302J3591
24855I9649J4336n2055J2737J7866k4579q1179k6505p7893r344Q458J35358k8465
24843a1616r9128Q8406J15939K9345R994j78428p9312r8349K4192O2242J08890
24832b7825m4964j8878k351K77222J04181N8536j40713k02099k642N1644J91780
24821B43891M051j61939n4661j12802n139J23537J15352M0707j54445o3846k9467
$$ plain form
24810 -54761 97147 77839 -40813 -235781 -155181 -36754 -62983 -257563 -272568 -189303 -230290
24799 -230290 -197983 150123 467108 410920 381152 110909 -52636 -147839 -16424 222151
24789 222151 247091 -33713 -286202 -153198 -202666 -282830 -48474 -77464 3118 -193430
24779 -193430 -368925 -424744 -302762 -111320 -214185 -244262 -161321 8225 59782 73956
24769 73956 -5873 -101558 -192728 -196760 -148239 -206119 -442851 -350526 -188336 -194063 -250656 -119267
24757 -119267 -98660 -154936 -191854 -45185 107742 -62923 -141944 -43614 75782 140368 140803
24746 140803 202549 141918 101170 120198 60338 65454 -66440 -301674 -171303 -51775 -171359
24735 -171359 -141867 -96618 -127842 -73646 -121675 -174965 -24047 -90924 -11187 81927 56916
$$ packed form
24810e4761J51908j9308j18652j94968Q0600J18427k6229j94580j5005Q3265m0987
24799b30290L2307L48106L16985n6188k9768k70243j63545r5203J31415K38575
24789B22151K4940k80804k52489J33004m9468q0164K34356k8990Q0582j96548
24779a93430j75495n5819J21982J91442j02865l0077Q2941J69546N1557J4174
24769G3956p9829r5685r1170m032M8521n7880k36732R2325J62190n727n6593J31389
24757a19267K0607n6276l6918J46669J52927j70665p9021R8330J19396O4586M35
24746A40803O1746o0631m0748J9028n9860N116j31894k35234J30371J19528j19584
24735a71359K9492M5249l1224N4196m8029n3290J50918o6877P9737R3114k5011
$$ plain form
24724 56916 89186 146229 -18403 -174914 -295105 -238144 48901 207104 131587 129672 196851
24713 196851 153141 -25173 -115028 -175941 -124247 -73650 -52542 35147 70516 154130 242256
24702 242256 302518 259580 124414 93977 184580 236301 179300 180625 2717 -96733 -35200
24691 -35200 -101808 -137810 -37526 -47331 21582 -33671 8134 119470 -7854 -53182 -58194
24680 -58194 -157238 -226951 -105947 -182075 -313971 -233875 -74033 190243 118513 105250 79896
24669 79896 70646 -7897 -120610 -153984 -69220 66976 119659 -98838 -65587 -11500 -18256
24658 -18256 12415 110655 209469 210737 230573 127981 105656 292316 428062 457965 391865
24647 391865 277673 290375 223142 167725 118993 64401 79487 50930 46951 101295 330768
$$ packed form
24724E6916L2270N7043j64632j56511j20191N6961K87045J58203p5517j915O7179
24713A96851m3710j78314q9855o0913N1694N0597K1108Q7689L5369Q3614Q8126
24702B42256O0262m2938j35166l0437R0603N1721n7001J325j77908r9450O1533
24691c5200o6608l6002J00284r805O8913n5253M1805J11336j27324m5328n012
24680e8194r9044o9713J21004p6128j31896Q0096J59842K64276p1730j3263k5354
24669G9896r250p8543j12713l3374Q4764J36196N2683k18497L3251N4087o756
24658a8256L0671R8240R8814J268J9836j02592k2325J86660J35746K9903o6100
24647C91865j14192J2702o7233n5417m8732n4592J5086k8557l979N4344K29473
$$ plain form
24636 330768 271928 109027 130332 247112 247517 198123 44335 -4637 -62273 195077 151398
24625 151398 129394 278854 274922 156968 88929 100878 175278 92864 -3748 111570 119170
24614 119170 -78732 -6957 2239 -190191 -121356 -93669 -121316 -235109 -194112 -90909 15372
24603 15372 107672 23523 -92837 -59538 -28602 69173 41090 122777 138841 75630 79052 -36153
24591 -36153 -128046 -146319 -216152 -236334 -185119 -187951 -103170 -180856 -216534 -285791 -125419 -143320
24579 -143320 -267434 -140906 10734 -68951 -154290 -204270 -127723 81670 -37443 -180314
24569 -180314 -116037 -3173 -561 -135656 -253825 -215818 -150076 -252149 -250277 -146244 -82223
24558 -82223 -108783 -102837 -72884 -69976 -108326 -74507 -141114 -162602 21602 70715 109386 24224
$$ packed form
24636C30768n8840j62901K1305J16780M05m9394j53788m8972n7636K57350m3679
24625A51398k2004J49460l932j17954o8039J1949P4400q2414r6612J15318P600
24614A19170j97902P1775R196j92430O8835K7687k7647j13793M0997J03203J06281
24603A5372R2300q4149j16360L3299L0936R7775k8083Q1687J6064o3211L422j15205
24591c6153r1893j8273o9833k0182N1215k832Q4781p7686l5678o9257J60372j7901
24579a43320j24114J26528J51640p9685q5339m9980P6547K09393j19113j42871
24569a80314O4277J12864K612j35095j18169L8007O5742j02073J872J04033O4021
24558h2223k6560N946K9953K908l8350L3819o6607k1488J84204M9113L8671q5162
$$ plain form
24546 24224 -15344 -50145 -406 97680 98112 58711 -9444 44035 217303 125887 -126489 -167258
24534 -167258 -190900 -203392 -50555 37411 195060 299020 134035 18434 8505 -7392 -20937
24523 -20937 -82005 24510 129713 133977 98626 100922 53770 47179 116621 165629 -6564 -142699
24511 -142699 -152086 -58074 -17515 -27616 -61355 -51984 19001 -71432 -226086 -308062 -284202 -110722
24499 -110722 57120 -25459 -81219 40458 84961 -113852 -108903 -138055 -272414 -169959 -74165
24488 -74165 -101859 -88524 -167313 -185872 -169536 -195709 -130519 -31041 -65693 243070 372128
24477 372128 102160 -138372 -52086 -199891 -252884 -82626 7004 31096 -31857 -108989 -148914
24466 -148914 -69062 -179513 -195806 -87165 246282 156758 132151 293716 393468 322379 180156
$$ packed form
24546B4224l9568l4801M9739R8086M32l9401o8155N3479J73268r1416k52376m0769
24534a67258k3642j2492J52837Q7966J57649J03960j64985j15601r929j5897j3545
24523b0937o1068J06515J05203M264l5351K296m7152o591O9442M9008j72193j36135
24511a42699r387R4012M0559j0101l3739R371P0985r0433j54654q1976K3860J73480
24499a10722J67842q2579n5760J21677M4503j98813M949k9152j34359J02455R5794
24488g4165k7694J3335p8789j8559J6336k6173O5190R9478l4652L08763J29058
24477C72128k69968k40532Q6286j47805n2993J70258Q9630K4092o2953p7132l9925
24466a48914P9852j10451j6293J08641L33447q9524k4607J61565R9752p1089j42223
$$ plain form
24455 180156 72623 76604 73209 -680 163766 263281 245649 115362 39222 -106272 -108868
24444 -108868 81580 43322 80985 181900 140570 161485 109732 -33921 -244033 -95176
24434 -95176 92627 88054 -435 123548 280958 219494 18337 -93669 -81263 -44557 -80762
24423 -80762 -79282 -156686 -160567 -68908 -147615 -230353 -211828 -233942 -127355 -86024 -119706 -8485
24411 -8485 -27483 -119202 -186982 -89444 55426 170511 37268 -164851 -62573 26091 3737
24400 3737 -110738 -281054 -245664 -75639 111078 54882 14753 -129322 -157671 -182778 -208166
24389 -208166 -55150 80850 23509 220592 224129 118471 148815 178945 121363 100250 110339
24378 110339 71959 -9019 -46712 -127981 -94461 26566 53899 155119 156225 244989 58903
$$ packed form
24455A80156j07533L981l395p3889J64446R9515j7632j30287p6140j45494k596
24444a08868J90448l8258L7663J00915m1330K0915n1753j43653k10112J48857
24434i5176J87803m573q8489J23983J57410o1464k01157j12006J2406L6706l6205
24423h0762J480p7404l881R1659p8707q2738J8525k2114J06587M1331l3682J11221
24411h485j8998r1719o7780R7538J44870J15085j33243k02119J02278Q8664k2354
24400C737j14475j70316L5390J70025J86717n6196m0129j44075k8349k5107k5388
24389b08166J53016J36000n7341J97083L537j05658L0344L0130n7582k1113J0089
24378A10339l8380q0978l7693q1269L3520J21027K7333J01220J106Q8764j86086
$$ plain form
24367 58903 -58068 38314 138094 101767 110219 77576 44353 -66550 -180428 -113061 137393
24356 137393 65484 -122619 -330721 -280935 -306868 -243301 -257927 -233709 -97984 48200 59064
24345 59064 -20089 43631 -49286 -130155 -184066 -167126 -2898 153974 166289 61142 45859
24334 45859 88947 64440 -121127 -214514 -132215 -116751 -108492 -66107 -75630 -93290 -187067 -220576
24322 -220576 -274608 -100713 32644 -43757 -181006 -191947 45900 109092 258020 305323
24312 305323 253931 96530 -20556 -129181 -119360 -32620 185916 168819 89790 123509 74635
24301 74635 -30065 70077 195732 245848 234940 204691 127230 -21486 56165 141089 73010
24290 73010 -43353 20580 115776 66008 118918 88393 32336 20617 -11039 -127919 -128598 -75013
$$ packed form
24367E8903j16971R6382R9780l6327Q452l2643l3223j10903j13878O7367K50454
24356A37393p1909j88103k08102M9786k5933O3567j4626K4218J35725J46184J0864
24345E9064p9153O3720r2917q0869n3911J6940J64228J56872J2315j05147j5283
24334D5859M3088k4507j85567r3387Q2299J5464Q259M2385r523j7660r3777l3509
24322b20576n4032J73895J33357p6401j37249j0941K37847O3192J48928M7303
24312C05323n1392j57401j17086j08625R821Q6740K18536j7097p9029L3719m8874
24301G4635j04700J00142J25655N0116j0908l0249p7461j48716P7651Q4924o8079
24290G3010j16363O3933R5196m9768N2910l0525n6057j1719l1656j16880o79N3585
$$ plain form
24278 -75013 -84328 -139146 -180066 -107503 14458 -44152 79537 142260 13704 -182758 -222996
24267 -222996 -131209 -191507 -59047 70943 92163 -14013 -30650 -69531 -146336 -46002 16487
24256 16487 35276 155791 213826 121409 -123025 -286339 -227224 -106232 69555 -47922
24246 -47922 -103584 -97812 5569 -64976 -110361 -52254 -129262 -289393 -275263 -161775 -274523
24235 -274523 -301747 -277404 -127270 -167900 -153588 116 100458 94851 -34343 25831 130876
24224 130876 191482 209373 55174 -30081 -48593 -14209 122404 241090 215172 112470 77822
24213 77822 36962 81627 15325 -119563 36784 213393 115597 -54931 -221809 -32557
24203 -32557 199629 96614 45135 -52651 -171542 -205764 -300370 -236605 75699 221050 60854
$$ packed form
24278g5013r315n4818m0920P2563J21961n8610J23689O2723j28556j96462m0238
24267b22996R1787o0298J32460J29990K1220j06176j6637l8881p6805J00334O2489
24256A6487J8789J20515N8035r2417k44434j63314N9115J20992J75787j17477
24246d7922n5662N772J03381p0545m5385N8107p7008j60131J4130J13488j12748
24235b74523k7224K4343J50134m0630J4312J53704J00342n607j29194O0174J05045
24224A30876O0606J7891j54199q5255j8512L4384J36613J18686k5918j02702l4648
24213G7822m0860M4665o6302j34888J56347J76609r7796j70528j66878J89252
24203c2557K32186j03015n1479r7786j18891l4222r4606O3765L12304J45351j60196
$$ plain form
24192 60854 65001 243111 292731 366657 335745 246729 86809 90098 24845 -75322 -108853
24181 -108853 -203243 -70451 -29199 32139 -41794 -207509 -238735 -268391 -202625 -165135 -52734
24170 -52734 -48627 138463 299638 283102 299050 123946 182944 233502 220554 106440 169089
24159 169089 212904 161768 154415 237527 8963 -131337 -13456 40217 -41720 -238468 -179040
24148 -179040 27006 190487 105093 -63838 38681 77633 -56109 -240057 -197579 -61273
24138 -61273 -92684 -166191 -214634 -208032 -207956 -112671 -12473 -45022 -36688 -65801 34141 -44552
24126 -44552 -92217 -59552 56263 169594 78017 -72535 -237543 -175711 -73866 -59350 -34375
24115 -34375 -14031 21117 78347 38064 -154346 -217242 -99187 -17046 8696 -49973 118270
$$ packed form
24192F0854M147J78110M9620P3926l0912q9016j59920L289o5253j00167l3531
24181a08853r4390J32792M1252O1338p3933j65715l1226k9656O5766L7490J12401
24170e2734M107J87090J61175j6536J5948j75104N8998N0558j2948j14114O2649
24159A69089M3815n1136p353Q3112k28564j40300J17881N3673q1937j96748N9428
24148a79040K06046J63481q5394j68931J02519L8952j33742j83948M2478J36306
24138f1273l1411p3507m8443O602P6R5285J00198l2549Q334k9113R9942p8693
24126d4552m7665L2665J15815J13331r1577j50552j65008O1832J01845J4516K4975
24115c4375K0344L5148N7230m0283j92410o2896J18055Q2141K5742n8669J68243
$$ plain form
24104 118270 167316 123445 -17040 38814 22855 -107431 -27555 151308 74078 -51674 -174802
24093 -174802 -166609 -159408 -180588 -192603 -88357 92274 -6246 -198432 -390451 -183060 37123
24082 37123 47194 24469 95939 97443 190373 134032 243485 218204 323887 329653 175991
24071 175991 -24676 -196155 -214114 -62186 56002 17865 -16849 46580 160355 122468
24061 122468 -66453 54276 1603 -59519 -56630 -104257 83339 126130 -106245 -77313 -90511
24050 -90511 -220168 -284272 -244568 -147603 88512 29375 -145165 -95525 -57789 -199401 -189601
24039 -189601 -54373 39183 117415 180954 220038 330337 249961 188569 230703 155279 186570
24028 186570 200171 264863 239414 98028 57598 -66549 -6201 -76616 -82959 -132339 -86432
$$ packed form
24104A18270M9046m3871j40485N5854j5959j30286P9876J78863p7230j25752j23128
24093a74802Q193P201k1180j2015J04246J80631r8520j92186j92019K07391K20183
24082C7123J0071k2725P1470J504R2930n6341J09453k5281J05683N766j53662
24071A75991k00667j71479j7959J51928J18188l8137l4714O3429J13775l7887
24061A22468j88921J20729n2673o1122K889m7627J87596M2791k32375K8932j3198
24050i0511j29657o4104L9704R6965K36115n9137j74540M9640L7736j41612R800
24039a89601J35228R3556P8232O3539L9084J10299q0376o1392M2134p5424L1291
24028A86570J3601O4692k5449j41386m0430j24147O0348p0415o343m9380M5907
$$ plain form
24017 -86432 -89847 -186214 -170583 -127175 -118280 -284527 -297778 -296473 -196039 -110492 -142158 -80720
24005 -80720 -15255 -236260 -371924 -250277 -230072 -135461 -232988 -396376 -373793 -254090 -250081
23994 -250081 -307533 -233066 -47255 -35301 67814 73134 -3644 32262 76111 -13540 -81654
23983 -81654 -7418 -48413 -23628 110453 131223 -18238 40797 24655 -18878 -236779 -163488
23972 -163488 -95241 43807 -44446 22285 49342 -4340 58454 81233 144617 132833 52891
23961 52891 112347 53578 68563 144971 95393 151494 98722 129891 113161 14224 -29173 99487
23949 99487 76127 125682 5092 -114253 -320630 -424132 -287037 -210213 -171645 -252364 -170478
23938 -170478 -35808 36871 -55165 -104621 35922 210448 120649 7767 -100632 -52916
$$ packed form
24017h6432l415r6367J5631M3408Q895j66247j3251J305J00434Q5547l1666O1438
24005h0720O5465k21005j35664J21647K0205R4611r7527j63388K2583J19703M009
23994b50081n7452P4467J85811J1954J03115N320p6778L5906M3849q9651o8114
23983h1654P4236m0995K4785J34081K0770j49461N9035j6142m3533k17901P3291
23972a63488O8247J39048q8253O6731K7057n3682O2794K2779O3384j1784p9942
23961E2891N9456n8769J4985P6408m9578N6101n2772L1169j6730r8937m3397J28660
23949I9487k3360M9555j20590j19345k06377j03502J37095P6824L8568q0719Q1886
23938a70478J34670P2679r2036m9456J40543J74526q9799j12882j08399M7716
$$ plain form
23928 -52916 -90287 -303576 -361286 -146286 6288 -3043 -64423 121554 121299 32182 -54534
23917 -54534 23382 17408 -59644 -130541 -37691 2332 -168034 -86617 102885 52618 104843
23906 104843 -5945 17123 92464 190608 169353 39268 -65405 -108765 -160213 -198033 -105082
23895 -105082 -127408 -119587 -47072 147637 235709 42237 -33531 -89827 -75556 -50641 -93702
23884 -93702 -192511 -179108 -73970 -183675 -189688 -228383 -293594 -271724 -130582 -142715 -75076
23873 -75076 128581 93449 123236 170106 263173 190047 69376 43254 44998 -127008 -117301
23862 -117301 32863 -60283 -91777 -78715 -37110 62914 66754 -62182 74384 104095 109901
23851 109901 110125 76763 22769 -42514 -76797 -61689 47570 8167 -72617 -118756 -202776 -238973
$$ packed form
23928e2916l7371k13289n7710K15000J52574r331o1380J85977k55q9117q6716
23917e4534P7916n974p7052p0897R2850M0023j70366Q1417J89502n0267N2225
23906A04843j10788K3068P5341R8144k1255j30085j04673m3360n1448l7820R2951
23895a05082k2326P821P2515J94709Q8072j93472p5768n6296J4271K4915m3061
23884i3702r8809J3403J05138j09705o013l8695o5211K1870J41142j2133O7639
23873g5076K03657l5132K9787M6870R3067p3126j20671k6122J744j72006R707
23862a17301J50164r3146l1494J3062M1605J00024L840j28936J36566K9711N806
23851A09901K24l3362n3994o5283l4283J5108J09259l9403q0784m6139q4020l6197
$$ plain form
23839 -238973 -194176 -375403 -417302 -158138 22784 169771 38448 -13700 -46804 -34325
23829 -34325 -150758 -239138 -100126 -126 173 88057 72108 141572 281823 74002 -204633
23818 -204633 -307245 -210390 -212919 -314274 -205259 -128382 -137738 -214657 -87310 -83816 -152117
23807 -152117 -128503 25243 8217 -95583 -165661 -229349 -319007 -255703 -195067 -146568 -22025
23796 -22025 -38713 41947 -19251 -117778 45125 62279 -60595 -3794 -43250 -44784 -83672
23785 -83672 -79123 25130 -113637 -142537 -75995 10352 98156 219095 221733 143740 103328
23774 103328 110628 -55029 16637 66518 -32627 -57456 -6644 -52625 -106641 -15343 10190
23763 10190 -22841 26581 -33566 -41794 -206009 -200576 -118726 -127936 -124800 -124023 -136024 -97996 -271216
$$ packed form
23839b38973M4797j81227m1899K59164J80922J46987j31323n2148l3104J2479
23829c4325j16433q8380J39012J00000K99Q7884j5949O9464J40251k07821k78635
23818b04633j02612R6855k529j01355J09015P6877r356p6919J27347L494o8301
23807a52117K3614J53746j7026j03800p0078o3688q9658O3304O0636M8499J24543
23796b2025j6688Q0660o1198r8527J62903J7154j22874N6801l9456j534l8888
23785h3672M549J04253j38767k8900O6542Q6347Q7804J20939K638p7993m0412
23774A03328P300j65657P1666M9881r9145k4829N0812m5981n4016R1298K5533
23763A0190l3031M9422o0147q228j64215N433Q1850r210L136P77j2001L8028j73220
$$ plain form
23750 -271216 -287621 -311809 -285199 -138897 -202284 -421012 -440540 -356292 -281809 -197289 -188070
23739 -188070 -100547 100993 24650 -127143 -264369 -341662 -373500 -223337 -90733 -187541
23729 -187541 -142337 -213541 -216032 -190988 -139963 -135921 -261468 -73622 35857 -95465 -182129
23718 -182129 -236288 -308849 -248594 -7335 -9814 -91833 -131734 -122973 -243828 -278752 -174544
23707 -174544 -311407 -281942 -140605 -190761 -300845 -152479 -118861 3818 -76927 -63996
23697 -63996 -93608 -155838 -200245 -225995 -246286 -278460 -136539 -50805 -17350 11755 91702
23686 91702 333365 424805 322930 320124 71851 40115 150044 66340 -123498 -94937 81913
23675 81913 134503 140562 97936 185759 181047 168186 164314 34454 30617 250226 281647 180859
$$ packed form
23750b71216j6405k4188K6610J46302o3387k18728j9528Q4248P4483Q4520R219
23739a88070Q7523K01540p6343j51793j37226p7293l1838J50163J32604r6808
23729a87541M5204p1204k491K5044N1025M042j25547J87846J09479j31322q6664
23718a82129n4159p2561O0255K41259k479q2019l9901Q761j20855l4924J04208
23707a74544j36863K9465J41337n0156j10084J48366L3618J22679q0745J2931
23697f3996k9612o2230m4407k5750k0291l2174J41921Q5734L3455K9105P9947
23686I1702K41663R1440j01875k806k48273l1736J09929q3704j89838K8561J76850
23675H1913N2590O059m2626Q7823m712j2861l872j29860l837K19609L1421j00788
$$ plain form
23663 180859 63001 -98579 -210722 -181380 -139798 -354184 -212962 131562 226241 186264
23653 186264 218985 329925 348425 173495 -7528 -143593 -311618 -465919 -468373 -259544
23643 -259544 -140195 -202975 -233395 -166861 -72673 -45793 -357389 -311247 -280060 -200708 -114481
23632 -114481 -32401 28975 130736 117391 25139 58726 -98154 -78930 -127606 -144206 -134158
23621 -134158 -63207 -58461 -74414 -95044 -166971 -192738 -301549 -246726 -218675 -257070 -39136
23610 -39136 64739 76054 -102415 -179639 -273872 -205596 -116317 -198352 -265593 -271457 -139876
23599 -139876 67891 17117 -16344 21012 156691 69423 81967 96149 97543 123558 153263
23588 153263 161680 118345 116658 100873 278791 327907 238502 278883 313045 224153 75775
$$ packed form
23663A80859j17858j61580j12143K9342M1582k14386J41222L44524R4679l9977
23653A86264L2721J10940J8500j74930j81023j36065j68025j54301k454K08829
23643b59544J19349o2780l0420O6534R4188K6880l11596M6142L1187P9352Q6227
23632a14481Q2080O1376J01761j3345r2252L3587j56880J9224m8676j6600J0048
23621a34158P0951M746j5953k0630p1927k5767j08811N4823K8051l8395K17934
23610c9136J03875J1315j78469p7224r4233O8276Q9279q2035o7241n864J31581
23599a39876K07767n0774l3461L7356J35679q7268J2544J4182J394K6015K9705
23588A53263Q417m3335j687j5785J77918M9116q9405M0381L4162q8892j48378
$$ plain form
23577 75775 41345 1500 -63056 -145161 -177036 -142140 -44343 29397 -121822 -203224 -229957
23566 -229957 -293644 -260859 -1245 90979 32994 24915 -62661 -11531 36052 -43488 18535
23555 18535 -13317 105740 140711 115540 137009 71313 -85322 -226202 -148234 -84016 -45184
23544 -45184 20383 -26483 -145053 -98900 21617 -96075 -193944 -122479 -293798 -356097 -224514
23533 -224514 -54330 -27823 29207 52093 -154620 129098 295714 259132 197436 204350 287137
23522 287137 355986 284883 353340 269747 193584 150411 148430 174292 213327 149715 155559 -25082
23510 -25082 -31135 173408 217741 205335 45566 -56939 -21136 15225 96187 35182 -40186
23499 -40186 36045 10615 -2072 47366 -36931 -53730 -74413 -123255 -71931 -8466 51120 -61824
$$ packed form
23577G5775l4430l9845o4556q2105l1875L4896R7797P3740j51219q1402k6733
23566b29957o3687L2785K59614R2224n7985q079q7576N1130M7583p9540O2023
23555A8535l1852J19057L4971k5171K1469o5696j56635j40880P7968O4218L8832
23544d5184O5567m6866j18570M6153J20517j17692r7869P1465j71319o2299J31583
23533b24514J70184K6507N7030K2886k06713K83718J66616l6582o1696O914Q2787
23522B87137O8849p1103O8457q3593p6163m3173j981K5862L9035o3612N844j80641
23510b5082o053K04543M4333j2406j59769j02505L5803L6361Q0962o1005p5368
23499d0186P6231k5430j2687M9438q4297j6799k0683m8842N1324O3465N9586j12944
$$ plain form
23487 -61824 -175592 -135066 -18809 87135 138370 143819 -56780 -256109 -363251 -410438 -243509
23476 -243509 -114199 -122433 -149283 -74760 -124872 -140377 -256416 -198259 -218171 -333967 -314361
23465 -314361 -171582 -188101 -102592 62817 20792 -68703 -260217 -366576 -269105 -216710 -203587
23454 -203587 -266921 -173898 -160171 -17273 155201 74442 73485 -58635 -167750 -74385 -140359
23443 -140359 -213226 -304526 -101862 -1571 -149210 -338145 -333700 -425299 -393663 -306506 -110187
23432 -110187 -78561 -192032 -442320 -363510 -162379 -112270 -51513 210886 233882 149266 182198
23421 182198 88727 33306 67457 95515 106628 84481 43200 -90002 -271139 -320295 -143673
23410 -143673 -72817 -91840 -113514 -96874 -104012 -182832 -96360 -33423 43639 -40535 -188124
$$ packed form
23487f1824j13768M0526J16257J05944N1235N449k00599j99329j07142m7187J66929
23476b43509J29310q234k6850P4523n0112j5505j16039N8157j9912j15796J9606
23465c14361J42779j6519Q5509J65409m2025q9495j91514j06359R7471N2395J3123
23454b03587o3334R3023J3727J42898J72474q0759r57j32120j09115R3365o5974
23443a40359p2867r1300K02664J00291j47639j88935M445r1599L1636Q7157J96319
23432a10187L1626j13471k50288P8810K01131N0109O0757K62399K2996q4616L2932
23421A82198r3471n5421L4151K8058J1113k2147m1281j33202j81137m9156J76622
23410a43673P0856j9023k1674J6640p138p8820Q6472O2937P7062q4174j47589
$$ plain form
23399 -188124 -170288 -104773 -125374 -88055 -143429 -206540 -213340 -309835 -409253 -398036 -221464
23388 -221464 -191877 -131700 -82913 52033 63095 -159242 -182548 -28923 96836 194051 210652
23377 210652 61169 -54855 -75954 -59790 168025 73161 -221525 -234175 -235023 -151754 -177104
23366 -177104 -166181 -49332 -86808 -175597 -214695 -279148 -298943 -22973 -40169 -147674 16962
23355 16962 11626 94282 78921 202743 177754 -47632 -263593 -316302 -153914 -135537 -19577
23344 -19577 322521 298079 196536 20762 -53306 20737 31405 180393 85989 -94698 -304472
23333 -304472 -222936 19060 75101 -6548 -113580 -97170 -48603 -24267 36342 32808 -75693
23322 -75693 -174571 -20484 83532 56512 -11345 -49617 -13885 163766 137238 62972 -22935
$$ packed form
23399a88124J7836O5515k0601L7319n5374o3111o800r6495r9418J1217J76572
23388b21464K9587O0177M8787J34946J1062k22337k3306J53625J25759R7215J6601
23377B10652j49483j16024k1099J6164K27815r4864k94686j2650q48Q3269k5350
23366a77104J0923J16849l7476q8789l9098o4453j9795K75970j7196j07505J64636
23355A6962n336Q2656j5361J23822k4989k25386k15961n2709J62388J8377J15960
23344a9577L42098k4442j01543j75774p4068P4043J0668J48988r4404j80687k09774
23333c04472Q1536K41996N6041q1649j07032J6410M8567K4336O0609l534j08501
23322g5693r8878J54087J04016k7020o7857l8272L5732J77651k6528p4266q5907
$$ plain form
23311 -22935 -144231 -186943 -57541 -85810 -60426 151986 195788 167904 92297 15631 52810
23300 52810 200783 314245 123268 90911 190128 201920 214065 191697 3229 -176814 -259143
23289 -259143 -63241 27818 54862 49596 226927 57448 -25186 87288 149014 82686 26557
23278 26557 74508 108535 145809 128194 118301 -24086 -174283 -211655 -115179 18571 8685
23267 8685 -31604 -14538 57759 10001 106152 57816 -48686 -146220 -236045 -131653 14910
23256 14910 54076 -101430 -177594 -160672 -52382 131150 106538 72268 73749 -107655 -11528
23245 -11528 36338 -48909 -151902 -76186 2679 -105747 -87089 -110364 -26716 151228 208415
23234 208415 203240 231365 132866 -8776 -89121 28290 -17786 29984 -76082 -71914 186039
$$ packed form
23311b2935j21296m2712J29402k8269K5384K12412M3802k7884p5607p6666L7179
23300E2810J47973J13462j90977l2357R9217J1792J2145k2368j88468j80043q2329
23289b59143J95902R1059K7044n266J77331j69479q2634J12474O1726o6328n6129
23278B6557M7951L4027L7274j7615r893j42387j50197l7372R6476J33750r886
23267H685m0289J7066P2297m7758R6151m8336j06502r7534q9825J04392J46563
23256A4910L9166j55506p6164J6922J08290J83532k4612l4270J481j81404R6127
23245a1528M7866q5247j02993P5716P8865j08426J8658k3275Q3648J77944N7187
23234B08415n175K8125r8499j41642q0345J17411m6076M7770j06066M168K57953
$$ plain form
23223 186039 347924 161367 -60517 -246649 -390440 -493873 -446744 -417382 -451191 -282868
23213 -282868 -148730 -19485 -134095 -82787 -105634 51659 72859 152004 452680 566897
23203 566897 397027 304407 352458 159405 1343 -112958 57371 99305 37781 52327
23193 52327 -95655 -65471 -65787 -20135 -23088 -142640 -123644 -80208 30097 38257 40092 35261
23181 35261 19202 9077 20696 -27569 -59050 21231 35642 -100356 -63890 -38372 -30967 113485
23169 113485 92590 -35683 -78545 24718 -67467 -120231 -62084 -188653 -161032 -204136 -242789
23158 -242789 -80635 -20197 -53600 -122312 -176061 -299238 -259953 -310661 -449769 -372007 -265762
23147 -265762 -77268 -76079 -177872 -298136 -301609 -303861 -95671 146558 157921 9801 27732
$$ packed form
23223A86039J61885j86557k21884j86132j43791j03433M7129K9362l3809J68323
23213b82868J34138J29245j14610N1308k2847J57293K1200P9145L00676J14217
23203E66897j69870r2620M8051j93053j58062j14301J70329M1934o1524J4546
23193E2327j47982L0184l16M5652k953j19552J8996M3436J10305Q160J835m831
23181C5261j6059j0125J1619m8265l1481Q0281J4411j35998L6466K5518P405J44452
23169A13485k0895j28273m2862J03263r2185n2764N8147j26569K7621m3104l8653
23158b42789J62154O0438l3403o8712n3749j23177L9285n0708j39108P7762J06245
23147b65762J88494J189j01793j20264l473k252K08190K42229J1363j48120J7931
$$ plain form
23136 27732 -33174 -111405 -172822 -13640 -76982 -155211 -132845 -121168 68517 108315 -96705
23125 -96705 -282857 -336200 -114358 94758 124304 -13042 -110744 -103730 -138545 -180764 -35140
23114 -35140 65237 -72319 -182110 -121750 47399 152018 105831 67631 198758 360700
23104 360700 308564 198688 59789 89341 -49128 -118612 -70777 68270 194756 300850
23094 300850 182554 73307 -26276 -61955 49399 120399 -78679 -329776 -219352 -109769
23084 -109769 -87615 -30514 -41800 -65203 -104405 -194656 -194297 -171177 -32675 -37805 119133 122104
23072 122104 -129099 -284991 -156867 -131295 -131564 167018 20254 -164457 -267475 -169899
23062 -169899 47439 99743 21426 -207216 -210924 -133920 -179928 -91709 24938 150099 249018
$$ packed form
23136B7732o0906p8231o1417J59182o3342p8229K2366J1677J89685L9798k05020
23125i6705j86152n3343K21842K09116K9546j37346r7702P014l4815m2219J45624
23114c5140J00377j37556j09791O0360J69149J04619m6187l8200J31127J61942
23104C60700n2136j09876j38899K9552j38469o9484M7835J39047J26486J06094
23094C00850j18296j09247r9583l5679J11354P1000j99078k51097J10424J09583
23084a09769K2154N7101j1286k3403l9202r0251L59K3120J38502n130J56938K971
23072A22104k51203j55892J28124K5572k69K98582j46764j84711j03018R7576
23062a69899K17338N2304p8317k28642l708P7004m6008Q8219J16647J25161R8919
$$ plain form
23051 249018 256559 -83416 -227845 -216835 -70114 -107629 -88549 157967 287062 438313
23041 438313 272664 185446 165906 98390 149109 50147 84144 108430 61649 95663 151474
23030 151474 75380 -48792 -176945 -116238 -17212 87465 18836 84490 110156 7010 91758
23019 91758 23470 -293 74913 107211 76491 203356 114925 -115166 -76136 104502 208710
23008 208710 187403 28775 -27669 -72364 -55511 -116365 -48943 129407 181701 -17740 -193479
22997 -193479 -274244 -359922 -249137 46351 134686 57757 -36168 18769 86071 -46531 -172563
22986 -172563 -197589 -113731 5965 73741 112393 123005 -55935 -57225 -26294 -10697 -24573
22975 -24573 -241127 -416460 -348293 -375482 -244751 -136655 -143111 -194186 -165969 -181937 -116733
$$ packed form
23051B49018P541l39975j44429J1010J46721l7515J9080K46516J29095J51251
23041D38313j65649q7218j9540o7516N0719r8962L3997K4286m6781L4014N5811
23030A51474p6094j24172j28153O0707R9026J04677o8629O5654K5666j03146Q4748
23019I1758o8288k3763P5206L2298l0720J26865q8431k30091L9030J80638J04208
23008B08710k1307j58628n6444m4695J6853o0854O7422J78350N2294j99441j75739
22997a93479q0765q5678J10785K95488Q8335p6929r3925N4937O7302j32602j26032
22986a72563k5026Q3858J19696O7776L8652J0612j78940j290L0931J5597j3876
22975b4573k16554j75333O8167k7189J30731J08096o456n1075K8217j5968O5204
$$ plain form
22964 -116733 -83936 109464 35892 59062 -9805 -118979 -66815 -122446 -200249 -288085 -126683
22953 -126683 -18838 -14618 -91259 -44457 122575 236147 108873 79712 134717 -9366 -96801
22942 -96801 -223653 -273817 -243165 -134749 -97794 42764 87231 -58382 -150088 -141326 13851
22931 13851 154464 152848 245441 38254 -7142 52848 57194 -108536 -102480 -3615 -12744 -156321
22919 -156321 -170767 -134946 2245 28931 17664 -50165 -100491 -179790 -17564 193881 16322
22908 16322 -186057 -222536 -98909 -38274 114751 169040 170751 201043 280498 291992 339536
22897 339536 225643 151865 -12625 135725 166950 84181 131557 -37786 -286216 -407168
22887 -407168 -317028 -112743 -18539 -39800 -62449 -177293 -157371 13006 142452 75335 90164
$$ packed form
22964a16733L2797J93400p3572K3170o8867j09174N2164n5631p7803q7836J61402
22953a26683J07845M220p6641M6802J67032J13572j27274k9161N5005j44083q7435
22942i6801j26852n0164L0652J08416L6955J40558M4467j45613r1706Q762J55177
22931A3851J40613j616R2593k07187m5396N9990M346j65730O056R8865r129j43577
22919a56321j4446L5821J37191K6686j1267o7829n0326p9299J62226K11445j77559
22908A6322k02379l6479J23627O0635J53025N4289J711L0292P9455J1494M7544
22897C39536j13893p3778j64490J48350L1225q2769M7376j69343k48430j20952
22887d07168R0140K04285R4204k1261k2649j14844J9922J70377J29446o7117J4829
$$ plain form
22876 90164 -53509 -80763 -67626 -68096 19820 68889 122494 250511 299610 178121 1735
22865 1735 45670 130509 250968 283253 231555 42445 63772 66367 15288 117072 70855
22854 70855 149042 75199 6474 -111288 -167174 -139231 -121299 -283643 -248792 -255868 -231546
22843 -231546 -55081 98178 -1958 -35452 8239 -5590 79482 81207 55045 -86701 -69821
22832 -69821 -106061 -239005 -187073 -130479 -212868 -382019 -172727 -3636 -124527 -269849
22822 -269849 -323185 -345498 -338919 -312021 -270065 -105080 -61485 -25472 20824 -89601 -33180
22811 -33180 -59506 -120895 -58310 -161284 -140692 38924 4193 37222 83333 199534 205084
22800 205084 220708 222521 158036 42538 -26741 86403 149292 144650 144050 -50616 -267805
$$ packed form
22876I0164j43673k7254J3137m70Q7916M9069N3605J28017M9099j21489j76386
22865A735M3935Q4839J20459L2285n1698j89110K1327K595n1079J01784m6217
22854G0855P8187p3843o8725j17762n5886K7943J7932j62344L4851p076K4322
22843b31546J76465J53259j00136l3494M3691j3829Q5072J725k6162j41746J6880
22832f9821l6240j32944N1932N6594q2389j69151K09292J69091j20891j45322
22822b69849n3336k2313O579K6898M1956J64985M3595L6013M6296j10425N6421
22811c3180k6326o1389O2585j02974K0592J79616l4731L3029M6111J16201N550
22800B05084J5624J813o4485j15498o9279J13144O2889m642o00j94666k17189
$$ plain form
22789 -267805 -309642 -338820 -178820 -168996 -327419 -422106 -454862 -215396 1338 -10258 -25723
22778 -25723 75745 166414 60944 7863 -120016 -233123 -318359 -322930 -136507 -118040 -74693
22767 -74693 -86585 -67616 -13087 -24270 46937 133637 171963 64122 -120674 -202852 -241912
22756 -241912 -174161 -146695 -140281 -205117 -131024 -78191 15995 -38924 -185937 -237757 -262253
22745 -262253 -218879 -143862 22607 -190080 -224065 -81389 52188 10965 62020 77300 34134
22734 34134 -38399 -147523 -180908 -77137 -191688 -291486 -131721 26705 9176 9396 -36255
22723 -36255 -170231 -180803 -250118 -93748 -97521 -181041 -166343 -243112 -210657 -80886 38032
22712 38032 185668 240087 135040 186868 59376 141232 78924 141103 67588 -89708 -201689
$$ packed form
22789b67805m1837k9178J60000R824j58423r4687l2756K39466K16734j1596j5465
22778b5723J01468R0669j05470n3081j27879j13107q5236m571J86423J8467M3347
22767g4693j1892J8969N4529j1183P1207Q6700L8326j07841j84796q2178l9060
22756b41912O7751K7466O414o4836P4093N2833R4186n4919j47013n1820k4496
22745b62253M3374P5017J66469k12687l3985J42676J33577m1223N1055J5280m3166
22734C4134p2533j09124l3385J03771j14551r9798J59765J58426j7529K20m5651
22723c6255j33976j0572o9315J56370l773q3520J4698p6769L2455J29771J18918
22712C8032J47636N4419j05047N1828j27492Q1856o2308O2179p3515j57296j11981
$$ plain form
22701 -201689 -390033 -418738 -345901 -204893 -94226 -60190 -52192 -70107 4958 62447 27358
22690 27358 17833 70031 -2402 -11436 -112666 -97026 67355 63925 44436 49570 164251 96204
22678 96204 -116400 67217 108558 118589 81046 -97209 -59148 -68956 -58657 -83237 -86402
22667 -86402 -244018 -183856 -135232 19158 85595 -123115 -261014 -249676 -239742 -162186 -213111
22656 -213111 -273959 -257894 -201967 -44963 -48811 -2236 120718 169209 87988 -35529 -318709
22645 -318709 -244386 -16157 -12978 -109967 -217939 -152295 -72380 8157 40221 -82934 -89650
22634 -89650 -98404 -104830 -54401 -94610 -108144 17030 -14861 -6808 -66292 70085 86433 90899
22622 90899 63826 75256 56933 25261 118272 256219 214293 82295 -43106 -180687 -298993
$$ packed form
22701b01689j88344k8705P2837J41008J10667L4036P998j7915P5065N7489l5089
22690B7358r525N2198p2433r034j01230J5640J64381l430j9489N134J14681o8047
22678I6204k12604J83617M1341J0031l7543j78255L8061r808J0299k4580l165
22667h6402j57616O0162M8624J54390O6437k08710j37899J1338R934P7556n0925
22656b13111o0848J6065N5927J57004l848M6575J22954M8491q1221j23517k83180
22645c18709P4323K28229L179r6989j07972O5644P9915Q0537L2064j23155o716
22634h9650q754o426N0429m0209j3534J25174l1891Q053n9484J36377J6348M466
22622I0899k7073J1430j8323l1672R3011J37947m1926j31998j25401j37581j18306
$$ plain form
22611 -298993 -230315 -217245 -151656 -105886 -228836 -305107 -259546 -197492 -222249 -310671 -263818
22600 -263818 -111497 -104000 20950 85797 64797 -43213 -35840 123228 188732 -61756 -89959
22589 -89959 -8359 -57318 -135707 -123935 -206962 -107747 -197638 -82378 -131606 -201207 -202063 -221710
22577 -221710 -290579 -192823 -79935 -18774 53273 -34226 -160867 -131266 -108306 -182090 -341437
22566 -341437 -149422 -24269 42855 12607 -16760 6026 -84713 -104989 -140654 -50159 19456
22555 19456 163972 290232 211548 116941 143910 67439 -27897 47204 -50943 -8900 142856
22544 142856 -42921 -264853 -9594 183808 181691 222597 73617 219841 86365 -23390
22534 -23390 -140180 -144444 -256110 -251100 2045 126046 173430 46193 -58225 -73178 -124323
$$ packed form
22611b98993O8678J3070O5589M5770j22950p6271M5561O2054k4757q8422M6853
22600b63818J52321P497J24950O4847k1000j08010P373J59068O5504k50488k8203
22589h9959Q1600m8959p8389J1772q3027R9215q9891J15260m9228o9601q56j9647
22577b21710o8869R7756J12888O1161P2047q7499j26641K9601K2960p3784j59347
22566c41437J92015J25153O7124l0248k9367K2786r0739k0276l5665R0495O9615
22555A9456J44516J26260p8684r4607K6969p6471r5336P5101r8147M2043J51756
22544A42856j85777k21932K55259J93402k117M0906j48980J46224j33476j09755
22534b3390j16790m264j11666N010K53145J24001M7384j27237j04418j4953n1145
$$ plain form
22523 -124323 -153581 -167906 -242022 -8367 71934 -49419 -56956 16327 28689 -28957 8703
22512 8703 -71570 -75565 -38160 -45193 2189 89140 167996 53696 -60217 -100151 -29886 -28830
22500 -28830 -202799 -284132 -370283 -132485 45501 150856 199197 309815 356378 275503 247698
22489 247698 339736 256164 96753 168154 227719 187214 -110911 -136477 -103165 -5284 27289
22478 27289 65859 -4534 16529 -857 -2005 42809 245879 253289 164117 105628 -60833 -95143
22466 -95143 20252 58772 134100 57645 24243 103261 139868 35455 61009 90216 61402
22455 61402 149552 188214 22471 -231027 -110163 48172 83526 83196 246095 189156 184931
22444 184931 162814 51460 7345 197561 191705 59549 -96477 -148037 6597 -5180 -154533
$$ packed form
22523a24323k9258j4325p4116K33655Q0301j21353p537P3283J2362n7646L7660
22512H703q0273l995L7405p033M7382Q6951P8856j14300j13913l9934P0265J056
22500b8830j73969q1333q6151K37798J77986J05355M8341J10618M6563q0875k7805
22489B47698R2038q3572j59411P1401N9565m0505k98125k5566L3312R7881L2573
22478B7289L8570p0393K1063j7386j148M4814K03070P410q9172n8489j66461l4310
22466i5143J15395L8520P5328p6455l3402P9018L6607j04413K5554K9207k8814
22455F1402Q8150L8662j65743k53498J20864J58335L5354l30J62899n6939m225
22444A84931k2117j11354m4115J90216n856j32156j56026n1560J54634j1777j49353
$$ plain form
22433 -154533 -134970 101316 -15940 -107402 -312749 -482366 -452333 -375386 -236040 -126273
22423 -126273 -195263 -103896 -85912 -15649 113452 108881 41025 -64228 -117175 -215177 -128854
22412 -128854 -35690 -118840 -149974 -132714 -10689 -39967 -113524 37377 147227 212240 252580
22401 252580 250339 180966 45312 -60425 -76300 8115 25453 -40772 77777 204410 94678
22390 94678 -164101 -233671 -574 19545 -182571 -212333 -34472 265695 217696 171298 98286
22379 98286 -94443 -103369 1760 122170 146324 221591 76555 46018 -101363 -181985 -130833
22368 -130833 -166243 -264942 -173722 -174950 -333964 -370653 -201582 5115 188402 36289 -102408
22357 -102408 -250862 -246780 -199100 -99602 -150803 -215889 -223486 -134540 36554 -55294 -74541
$$ packed form
22433a54533J9563K36286j17256r1462k05347j69617L0033P6947J39346J09767
22423a26273o8990R1367J7984P0263J29101m571o7856j05253n2947r8002Q6323
22412a28854R3164q3150l1134J7260J22025k9278p3557J50901J09850O5013M0340
22401B52580k241o9373j35654j05737j5875Q4415J7338o6225J18549J26633j09732
22390I4678k58779o9570K33097K0119k02116k9762J77861L00167m7999m6398p3012
22379I8286j92729q926J05129J20410K4154P5267j45036l0537j47381q0622N1152
22368a30833l5410r8699R1220j228j59014l6689J69071K06697J83287j52113j38697
22357a02408j48454M082M7680R9498n1201o5086p597Q8946J71094r1848j9247
$$ plain form
22346 -74541 -38248 -35425 -100003 20945 164724 53932 -47739 -25164 -108354 -162228 -71620
22335 -71620 -63985 -112343 -120591 -264458 -317007 -358538 -171098 10267 -1916 -176376 -187840
22324 -187840 -155308 -60351 -160864 -126224 -42203 -20597 41956 38798 149133 13650 -32068
22313 -32068 -58642 -152858 -136953 -142108 -263238 -323789 -331172 -383544 -252020 -238070 -312471 -320520
22301 -320520 -248843 -147090 30236 128906 115034 -44756 -56238 80240 -23695 20528
22291 20528 -150165 -140611 -39716 11647 -32806 -190207 -256854 -339452 -399731 -318174 -148190
22280 -148190 -69890 -125264 -96386 -104685 -211640 -302483 -72518 -14859 -116237 -245396 -256201
22269 -256201 -147031 -1166 -84593 -67645 -108758 -134388 -167035 -145953 -205527 -221058 -124813
$$ packed form
22346g4541L6293K823o4578J20948J43779j10792j01671K2575q3190n3874R0608
22335g1620P635m8358q248j43867n2549m1531J87440J81365j2183j74460j1464
22324a87840L2532R4957j00513L4640Q4021K1606O2553l158J10335j35483m5718
22313c2068k6574r4216J5905n155j21130o0551p383n2372J31524J3950p4401q049
22301c20520P1677J01753J77326R8670j3872j59790j1482J36478j03935M4223
22291B0528j70693R554J00895N1363m4453j57401o6647q2598o0279Q1557J69984
22280a48190P8300n5374K8878q299j06955r0843K29965N7659j01378j29159j0805
22269b56201J09170J45865q3427J6948m1113k5630l2647K1082n9574j5531R6245
$$ plain form
22258 -124813 -24308 57861 -14737 -138057 -120275 -61969 27657 3653 -50531 -66148 -40707
22247 -40707 1487 -5857 -210580 -83497 1980 -154069 -255175 -199722 -113969 -110378 23442
22236 23442 30456 -36027 -102797 -78585 574 102219 76243 64425 -47297 79295 -2327
22225 -2327 -39571 -36900 -246134 -378864 -326310 -212878 111599 168557 44321 2831 16089
22214 16089 -115732 -171222 -30812 5591 39050 -180718 -404653 -401775 -406568 -239256 -233026
22203 -233026 -203823 -127381 -102739 -216153 -179472 -221543 -116943 -90898 -26679 23194 112155
22192 112155 104312 113421 49710 -8566 767 44893 92421 150344 22714 -97693 14399
22181 14399 66256 107555 17000 -178845 -314956 -239578 -41630 71330 169561 130931 -23647
$$ packed form
22258a24813J00505Q2169p2598j23320J7782N8306Q9626k4004n4184j5617K5441
22247d0707M2194p344k04723J27083Q5477j56049j01106N5453Q5753L591J33820
22236B3442P014o6483o6770K4212P9159J01645k5976j1818j11722J26592q1622
22225b327l7244K671k09234j32730N2554J13432L24477N6958j24236m1490J3258
22214A6089j31821n5490J40410L6403L3459k19768k23935K878m793J67312O230
22203b33026K9203P6442K4642j13414L6681m2071J04600K6045O4219M9873Q8961
22192A12155p843R109o3711n8276R333M4126M7528N7923j27630j20407J12092
22181A4399N1857M1299r0555j95845j36111P5378J97948J12960R8231l8630j54578
$$ plain form
22170 -23647 -126822 -14209 -51049 -30114 185047 117742 -178839 -215755 17635 15711 -125683
22159 -125683 -133093 18929 -14490 -153551 -95175 6912 -5156 56851 -4606 -79214 -121412
22148 -121412 2529 -22898 -62011 -108004 17404 5182 -63185 -7347 -85146 -81879 -99895
22137 -99895 -90275 -22283 80173 128897 106007 -46812 -21141 -64293 -172630 -76851 -38748
22126 -38748 -158367 -196338 -55648 64239 55427 145235 98557 15001 -45724 24746 35544
22115 35544 -149276 -77735 160496 273444 193395 163236 241839 321243 97630 -9854 -8952
22104 -8952 -136197 -274714 -201894 89010 208032 90757 -79867 -266997 -240043 -125137
22094 -125137 -6405 -148079 -149962 -164942 -240941 -31947 -23566 -113179 -137406 -109154 30051
$$ packed form
22170b3647j03175J12613l6840K0935K15161o7305k96581l6916K33390j924j41394
22159a25683p410J52022l3419j39061N8376J02087j2068O2007o1457p4608m2198
22148a21412J23941k5427l9113m5993J25408j2222o8367N5838p7799L267j8016
22137i9895R620O7992J02456M8724k2890j52819K5671m3152j08337R5779L8103
22126c8748j19619l7971J40690J19887q812Q9808m6678q3556o0725P0470J0798
22115C5544j84820P1541K38231J12948q0049l0159P8603P9404k23613j07484R02
22104h952j27245j38517P2820K90904J19022j17275j70624j87130K6954J14906
22094a25137J18732j41674j883j4980p5999K08994Q381q9613k4227K8252J39205
$$ plain form
22083 30051 127355 14593 127305 256566 207286 172891 108871 88752 54373 188423 196229
22072 196229 140919 86305 29862 -42014 -23132 -53315 -167814 -237794 -127557 -34937 -48132
22061 -48132 -177164 -159607 -51191 19434 50125 -77431 -258115 -281936 -293008 -236986 -120758
22050 -120758 90829 94023 90521 35378 -120116 -143512 48537 179833 70606 -39781 -107173
22039 -107173 -101615 -181204 -201943 -130570 -27392 10498 17029 44691 -97601 -48947 -8687
22028 -8687 -106242 -75250 96641 -45368 -203063 -177997 -171310 -119021 -117533 18748 33696
22017 33696 104726 290171 194635 45290 -96528 -148849 34175 212044 358075 371016
22007 371016 439474 378813 346860 250993 65018 -96036 -351383 -336447 -164560 -34468
$$ packed form
22083C0051R7304j12762J12712J29261m9280l4395o4020k0119l4379J34050P806
22072A96229n5310n4614n6443p1876J8882l0183j14499o9980J10237R2620j3195
22061d8132j29032J7557J08416P0625L0691j27556j80684k3821j1072N6022J16228
22050a20758K11587L194l502n5143j55494k3396J92049J31296j09227j10387o7392
22039a07173N558p9589k0739P1373J03178L7890O531K7662j42292M8654M0260
22028h687r7555L0992J71891j42009j57695K5066O687N2289J488J36281J4948
22017C3696P1030J85445r5536j49345j41818n2321J83024J77869J46031J2941
22007C71016O8458o0661l1953r5867j85975j61054k55347J4936J71887J30092
$$ plain form
21997 -34468 -185969 -223188 -191098 -42151 100608 20286 102345 74964 101492 18591 -88541
21986 -88541 -110506 -102753 -20157 22703 76975 113065 -22578 -171202 -123483 -103023 -191036
21975 -191036 -190886 -119051 -136170 -93651 -110811 899 -81373 -24012 162438 175714 161716
21964 161716 29174 -114104 -48618 70505 52663 196677 190565 171153 127847 96990 57036
21953 57036 106000 37645 72301 -38358 -114255 -107441 -38505 -8412 -25195 -134713 -178371
21942 -178371 -162823 -117718 -163539 -39041 74986 244890 55205 130271 119886 135697 78735
21931 78735 -30513 -114320 -94039 -145421 -224136 -370526 -221398 25403 130435 161032 -26210
21920 -26210 89053 110807 145420 68721 -30657 -154381 -228015 -212845 -95061 -172207 -71085
$$ packed form
21997c4468j51501l7219L2090J48947J42759q0322Q2059k7381K6528q2901j07132
21986h8541k1965P753Q2596M2860N4272L6090j35643j48624M7719K0460q8013
21975a91036J50P1835j7119M2519j7160J11710q2272N7361J86450J3276j3998
21964A61716j32542j43278O5486J19123j7842J44014o112j9412m3306l0857l9954
21953E7036M8964o8355L4656j10659p5897O814O8936L0093j6783j09518m3658
21942a78371J5548M5105m5821J24498J14027J69904j89685P5066j0385J5811n6962
21931G8735j09248q3807K0281n1382p8715j46390J49128K46801J05032L0597j87242
21920b6210J15263K1754L4613p6699r9378j23724p3634J5170J17784p7146J01122
$$ plain form
21909 -71085 -14206 -23960 -29920 -106508 -157197 -137098 -126885 -69895 -165782 -166739 -193766 -149836
21897 -149836 -372914 -574952 -429964 -282614 -162762 -45233 -44118 -33900 -109304 -89300
21887 -89300 10865 67644 39834 39949 12614 110115 221242 227606 264235 267298 255458 110816
21875 110816 80689 236227 235670 148865 180985 138481 108137 28290 113963 138996 110461 297758
21863 297758 419706 373585 521777 507341 390319 294150 244672 119566 -17533 4335
21853 4335 -62497 -25915 24260 -126266 -301476 -316232 -285185 -113415 -7898 -126586 -429754
21842 -429754 -581775 -421369 -209957 -79063 -19697 -14660 5782 5898 -23348 -117053 -233003
21831 -233003 -279012 -50470 -61077 -233328 -316482 -281693 -287221 -174711 -108288 7367 -39506
$$ packed form
21909g1085N6879r754n960p6588n0689K0099J0213N6990r5887r57k7027M3930
21897a49836k23078k02038J44988J47350J19852J17529J115J0218p5404K0004
21887h9300J00165N6779k7810J15k7335R7501J11127O364L6629L063j1840j44642
21875A10816l0127J55538n57q6805L2120m2504l0344p9847Q5673K5033k8535J87297
21863B97758J21948m6121J48192j4436j17022r6169m9478j25106j37099K1868
21853D335o6832L6582N0175j50526j75210j4756L1047J71770J05517j18688l03168
21842d29754j52021J60406K11412J30894N9366N037K0442J16k9246r3705j15950
21831b33003m6009K28542j0607j72251q3154L4789n528J12510O6423J15655m6873
$$ plain form
21820 -39506 -267294 -360684 -251686 -130586 -66988 153150 282389 222867 129582 20752
21810 20752 147081 226356 146838 139242 44563 -130941 -233103 -218084 -58533 -57895 -142388
21799 -142388 -337931 -240739 -96640 14789 44124 14381 14023 -127130 -180154 -207254 -91893
21788 -91893 77124 212787 293338 230181 -33317 6003 78268 -10347 -44260 15560 46345
21777 46345 10644 -111830 -72642 74687 71874 6961 -268524 -213875 -266379 -194329 -202588
21766 -202588 -198436 -241211 -41139 144297 302265 333591 276909 242240 153148 118800 -20570
21755 -20570 -211023 -316582 -15146 59288 -73527 -146386 -210836 -199646 -323933 -329584 -330382
21744 -330382 -288972 -193536 -28605 -42283 -179811 -283668 -398351 -414314 -385963 -191572
$$ packed form
21820c9506k27788r3390J08998J21100O3598K20138J29239n9522r3285j08830
21810B0752J26329P9275p9518p596r4679j75504j02162J5019J59551O38q4493
21799a42388j95543R7192J44099J11429K9335k9743l58j41153n3024k7100J15361
21788i1893J69017J35663Q0551o3157k63498L9320P2265q8615l3913N9820L0785
21777D6345l5701j22474L9188J47329k813o4913k75485N4649n2504P2050q259
21766b02588M152m2775K00072J85436J57968L1326n6682l4669q9092l4348j39370
21755b0570j90453j05559L01436P4434j32815p2859o4450J1190j24287n651p98
21744c30382M1410R5436J64931j3678j37528j03857j14683j5963K8351J94391
$$ plain form
21734 -191572 -205836 -283636 -235392 -258380 -147184 -7153 47460 45294 -42983 13945 137609
21723 137609 193496 162757 235322 411024 239639 127285 119811 121160 87317 138058 79336
21712 79336 -49427 -100924 -123791 -184184 -128893 15896 -42039 -6108 56085 239119 283845
21701 283845 51882 -64878 7742 181491 112444 130410 206343 215797 -85401 -225079 -129195
21690 -129195 98252 -7406 -33310 -151695 -313036 -407246 -325868 2482 99679 198437
21680 198437 223452 119506 -35506 8738 164632 307728 235381 179313 161187 155657 19074
21669 19074 -14039 37243 -112627 -103796 -157455 -17117 175840 98327 93487 59451 -24618
21658 -24618 -10434 -61246 -140065 -156799 -321489 -429493 -173938 -5022 -76106 -191666 -67514
$$ packed form
21734a91572j4264p7800M8244k2988J11196J40031N4613k166q8277N6928J23664
21723A37609N5887l0739P2565J75702j71385j12354p474J349l3843N0741n8722
21712G9336j28763n1497k2867o0393N5291J44789n7935L5931O2193J83034M4726
21701B83845k31963j16760P2620J73749o9047J7966P5933R454l01198j39678R5884
21690a29195K27447j05658k5904j18385j61341r4210Q1378L28350R7197R8758
21680A98437K5015j03946j55012M4244J55894J43096p2347n6068j8126n530j36583
21669A9074l3113N1282j49870Q831n3659J40338J92957p7513m840l4036q4069
21658b4618J4184n0812p8819j6734j64690j08004K55555J68916p1084j15560J24152
$$ plain form
21647 -67514 186291 137177 58263 71886 102711 36165 -62642 -72363 -179234 -204738 -116966
21636 -116966 -124916 -131276 -44720 -117815 -316939 -443532 -336913 -150535 118297 99136 -105862
21625 -105862 -266961 -35607 31914 141473 218352 98272 -96037 -296268 -288530 -170197
21615 -170197 -165194 -246114 -98642 -49672 -39317 71423 78523 -3282 -89346 -66927 24880
21604 24880 97873 -59269 -145776 -199264 -245056 -324590 -344087 -291955 -237255 -249405 -74489
21593 -74489 -13225 -217220 -310372 -230123 -125530 -69075 -150909 -189552 -270939 -138360 39513
21582 39513 -45546 -186361 -305329 -133940 -80444 -189071 -138716 -32222 39575 38415 -209984
21571 -209984 -449681 -423116 -229384 -197650 -287038 -224499 -128064 -23661 -38737 5959 -48524
$$ packed form
21647f7514K53805m9114p8914J3623L0825o6546r8807r721j06871k5504Q7772
21636a16966p950o360Q6556p3095j99124j26593J06619J86378K68832j9161k04998
21625a05862j61099K31354O7521J09559P6879j20080j94309k00231P738J18333
21615a70197N003q0920J47472M8970J0355J10740P100q1805q6064K2419R1807
21604B4880P2993j57142q6507n3488m5792p9534j9497N2132N4700j2150J74916
21593g4489O1264k03995r3152Q0249J04593N6455q1834l8643q1387J32579J77873
21582C9513q5059j40815j18968J71389N3496j08627N0355J06494P1797j160k48399
21571b09984k39697K6565J93732L1734q9388O2539R6435J04403j5076M4696n4483
$$ plain form
21560 -48524 -150364 -211448 -204238 -202179 -285191 -177152 -120358 -124624 96199 260416 226891
21549 226891 190495 137387 -33197 92207 171806 164687 38438 -11214 -114695 -119428 -165381
21538 -165381 -202370 -202995 -62165 -73266 -4589 91125 52580 51636 -68886 -144003 -128217 -9324
21526 -9324 108821 -123775 -176456 -68133 90154 246639 166455 158173 127394 -60156 -230488
21515 -230488 -296507 -244751 -200604 -232145 -154440 -302716 -314173 -268186 -179558 -195594 -317840
21504 -317840 -545983 -528031 -234670 -38555 -85447 -249050 -221211 -365563 -349926 -300908
21494 -300908 -71205 143962 170116 345052 356861 255377 144293 92298 99711 -128366
21484 -128366 -134196 -53033 -205321 -57243 170703 158555 30964 32526 90986 -43549 -49182
$$ packed form
21560d8524j01840o1084P210K059q3012J08039N6794m266K20823J64217l3525
21549B26891l6396n3108j70584J25404P9599p119j26249m9652j03481m733m5953
21538a65381l6989o25J40830j1101O8677R5714l8545r44j20522p5117J5786J18893
21526i324J18145k32596n2681J08323J58287J56485q0184q282l0779j87550j70332
21515b30488o6019N1756M4147l1541P7705j48276j1457M5987Q8628j6036j22246
21504c17840k28143J7952K93361J96115m6892j63603K7839j44352J5637M9018
21494c00908K29703K15167K6154J74936J1809j01484j11084n1995P413k28077
21484a28366n830Q1163j52288J48078K27946j2148j27591J562N8460j34535n633
$$ plain form
21473 -49182 -87019 -19514 -11267 -25562 -130932 -142211 -200166 -185690 -168967 -119627 -11094
21462 -11094 55386 70981 84095 143841 113594 -84524 -290871 -254204 -6778 -67139 -189106
21451 -189106 -209086 -323772 -333082 -54376 -4649 -72571 39723 78643 100653 21644 -180503
21440 -180503 -378602 -439764 -281902 -64533 -84247 -90106 -302597 -268160 -22204 65067 -20700
21429 -20700 -82950 -305 -70412 6787 62035 118278 34900 78215 147901 146315 99325 188440
21417 188440 27031 88057 174355 176325 129437 159617 120305 83035 116213 130172 338454
21406 338454 297594 77378 24656 68757 -133406 -242568 -164318 49335 -60519 -260593
21396 -260593 -340748 -277286 -173768 -28291 -22570 -48686 700 29048 -1536 -57905 -50398
$$ packed form
21473d9182l7837O7505Q247j4295j05370j1279n7955J4476J6723M9340J08533
21462a1094O6480J5595J3114N9746l0247j98118k06347L6667K47426o0361j21967
21451a89106j9980j14686r310K78706M9727o7922J12294L8920K2010p9009k02147
21440a80503j98099o1162J57862K17369j9714n859k12491L4437K45956Q7271q5767
21429b0700o2250Q2645p0107P7199N5248N6243q3378M3315O9686j586m6990Q9115
21417A88440j61409O1026Q6298J970m6888L0180l9312l7270L3178J3959K08282
21406C38454m0860k20216n2722M4101k02163j09162P8250K13653j09854k00074
21396b60593q0155O3462J03518J45477N721k6116M9386K8348l0584n6369P507
$$ plain form
21385 -50398 -128688 -217558 -27692 -25215 -104270 -128048 52628 143070 -50756 2475 -39284
21374 -39284 -190497 -166995 -40177 -128644 -59365 -150532 -188982 -65554 -9392 58055 -7564
21363 -7564 69894 126693 33637 -49919 -183695 -271287 -190898 -191685 -207818 -259383 -336139 -464088
21351 -464088 -504234 -223539 21026 29227 65467 107126 219371 170565 -24618 -24702 240546
21340 240546 457301 456700 292700 185200 -1757 -94133 -233184 -265631 -107709 34592
21330 34592 147503 163213 27952 59513 71755 7383 -78475 -131555 -155700 -81669 57038
21319 57038 103295 141658 89544 60926 -77313 -158553 -96703 -51199 -199083 -317922 -119683
21308 -119683 -46205 -88663 99115 878 -40778 -47114 -35084 -29989 20512 12541 -49362 -8137
$$ packed form
21385e0398p8290q8870J89866K477p9055k3778J80676R0442j93826N3231m1759
21374c9284j51213K3502J26818q8467O9279r1167l8450J23428N6162O7447o5619
21363g564P7458N6799r3056q3556j33776q7592Q0389p87j6133n1565p6756j27949
21351d64088m0146K80695K44565Q201L6240M1659J12245m8806j95183q4K65248
21340B40546K16755o01j64000j07500j86957r2376j39051l2447J57922J42301
21330C4592J12911J5710j35261L1561J2242o4372q5858n3080k4145P4031J38707
21319E7038M6257L8363n2114k8618j38239q1240O1850M5504j47884j18839J98239
21308a19683P3478m2458J87778r8237m1656o336J2030N095N0501p971o1903M1225
$$ plain form
21296 -8137 -164116 -105317 -49619 62542 88049 95088 40240 -42659 24814 14794 -149584
21285 -149584 -262229 -82764 44959 -51455 -61155 81334 -88497 -170013 -35915 86822
21275 86822 59031 38936 56955 216037 190005 -38634 -10730 -32280 -40651 -18412 63094
21264 63094 -92940 -104236 -27024 188633 310699 244150 62189 -92077 -65234 -59370 -180144
21253 -180144 -92793 -204363 -174551 -330315 -401565 -85694 107200 166311 -94213 -266115
21243 -266115 -243577 -234622 -188544 16803 58182 104383 103420 199548 280336 260257 215780 301482
21231 301482 366124 309235 100225 -11596 101741 93546 118056 41277 29477 119303 245532
21220 245532 305624 325278 79615 59511 43829 145024 120251 130114 70234 55137 53476
$$ packed form
21296h137j55979N8799N5698J12161K5507P039n4848q2899O7473j0020j64378
21285a49584j12645J79465J27723r6414r700J42489j69831q1516J34098J22737
21275H6822k7791k0095J8019J59082k6032k28639K7904k1550q371K2239Q1506
21264F3094j56034j1296P7212K15657J22066o6549j81961j54266K6843N864j20774
21253a80144Q7351j11570K9812j55764p1250L15871J92894N9111k60524j71902
21243b66115K2538Q955M6078K05347M1379M6201r63R6128Q0788k0079m4477Q5702
21231C01482O4642n6889k09010j11821J13337q195K4510p6779j1800Q9826J26229
21220B45532O0092J9654k45663k0104j5682J01195k4773R863n9880j5097j661
$$ plain form
21209 53476 24186 8333 103406 236723 229556 263353 268927 236455 184305 194319 221993 118555
21197 118555 105672 207843 269324 269876 223466 195555 318166 316561 272791 240376 146695 77940
21185 77940 195459 27941 -9512 107519 78916 40255 116162 119790 -163173 -343132 -230393
21174 -230393 -170042 -136158 -50133 -105843 -115764 -200587 -192679 -77077 -30017 10948 87970 87200
21162 87200 2193 -150629 -150769 -114780 -84405 -83390 -25108 -19324 33765 119270 155274 -7115
21150 -7115 -21085 63203 159033 182487 73609 43136 75447 11885 37902 122493 142946 202344
21138 202344 324419 200131 75123 94051 -5512 -43412 20909 115587 84844 197892 244397
21127 244397 241906 152463 274878 291068 266637 117799 -9459 -160656 -186638 -101310 4078
$$ packed form
21209E3476k9290j5853R5073J33317p167L3797N574l2472n2150J0014K7674j03438
21197A18555j2883J02171O1481N52m6410k7911J22611j605m3770l2415r3681o8755
21185G7940J17519j67518l7453J17031k8603l8661P5907L628k82963j79959J12739
21174b30393O0351L3884Q6025n5710r921q4823P908J15602M7060M0965P7022p70
21162H7200q5007j52822j40L5989L0375J015N8282N784N3089Q5505L6004j62389
21150g115j3970Q4288R5830K3454j08878l0473L2311o3562K6017Q4591K0453N9398
21138B02344J22075j24288j25008J8928r9563l7900O4321R4678l0743J13048M6505
21127B44397k491q9443J22415J6190k4431j48838j27258j51197k5982Q5328J05388
$$ plain form
21116 4078 -123465 -138356 -242328 -199126 -195216 -129148 -116593 -61314 -126276 38429 213268
21105 213268 328535 288188 110527 45320 -912 -329520 -336927 -270833 -31320 116316 180650
21094 180650 113337 -12461 -114732 -131942 -88278 -181755 -47681 211220 158471 39913
21084 39913 38629 156168 262969 294381 234289 242162 -7001 -178047 -146888 -117871 -310
21073 -310 -77742 -237575 -242277 -83437 -85504 -37493 89997 23386 133432 177428 -20820
21062 -20820 15592 192644 95100 1364 1052 106684 121204 48591 -93657 -87414 -145729 -153746
21050 -153746 -33976 113850 144561 236359 296185 348636 311393 262723 100972 -53137 -241821
21039 -241821 -433601 -343059 -329915 -338758 -359531 -337126 -197588 -186711 -167028 -69588 34650
$$ packed form
21116D078j27543j4891j03972M3202L910O6068J2555N5279o4962J64705J74839
21105B13268J15267m0347j77661o5207m6232l28608p407O6094K39513J47636O4334
21094A80650o7313j25798j02271j7210M3664r3477J34074K58901n2749j18558
21084C9913j284J17539J06801L1412o0092P873k49163j71046L1159K9017J17561
21073c10p7432j59833m702J58840k067M8011J27490o6611J10046M3996j98248
21062b0820L6412J77052r7544r3736l12J05632J4520p2613j42248O243n8315q017
21050a53746J19770J47826L0711R1798N9826N2451l7243m8670j61751j54109j88684
21039b41821j91780R0542J3144q843k0773K2405J39538J0877J9683R7440J04238
$$ plain form
21028 34650 17199 41340 113841 20380 -13970 46492 235229 319161 171943 -965 -52742
21017 -52742 -200385 -164200 -21972 34203 -30812 -195234 -90017 -22180 -72192 -70572 -55424
21006 -55424 -114887 -91291 -4977 -105334 -95369 -118584 -106864 58128 140312 97537 79084
20995 79084 155935 36835 -107864 -77924 -139122 -153853 -132870 -168240 -109330 -116979 -44217
20984 -44217 74822 71717 -40141 -185993 -212934 -223204 -126265 136338 166779 248249 133097
20973 133097 -4925 -5937 45370 89792 6583 -221000 -211027 -186804 -274984 -186612 33113
20962 33113 262066 188467 126331 26614 -83892 -119676 -72332 -199927 -58186 -74814 -133974
20951 -133974 -171490 -218618 -42575 127774 -18695 19568 6950 8752 74331 34782 -159773
$$ packed form
21028C4650j7451K4141P2501r3461l4350O0462J88737Q3932j47218j72908n1777
21017e2742j47643L6185J42228N6175o5015j64422J05217O7837n0012J620J5148
21006e5424n9463K3596Q6314j00357R965k3215J1720J64992Q2184m2775j8453
20995G9084P6851j19100j44699K9940o1198j4731K0983l5370N8910p649P2762
20984d4217J19039l105j11858j45852k6941j0270R6939K62603L0441Q1470j15152
20973A33097j38022j012N1307M4422q3209k27583R973K4223q8180Q8372K19725
20962C3113K28953p3599o2136r9717j10506l5784M7344j27595J41741j6628n9160
20951a33974l7516m7128J76043J70349j46469L8263j2618J802O5579l9549j94555
$$ plain form
20940 -159773 -204590 -116571 -20973 -39640 -165351 -116744 -56596 -36245 -92081 -125895 -114665
20929 -114665 39549 12176 116789 186769 232085 194883 -13134 -46871 -24093 -54509 67184
20918 67184 155696 -4885 57521 148713 -1171 52776 193209 289155 365924 318593 223633
20907 223633 119417 88456 130663 205563 106789 -22996 -59450 -209353 -25422 57050 -38608
20896 -38608 -72030 -21432 38088 84984 166977 -13189 -84504 17145 94514 226215 143279
20885 143279 43717 131951 123690 86622 178687 88840 -111295 -53932 67587 -79833 -90884
20874 -90884 -43747 -142453 -71307 116530 94373 62368 5713 -170478 -204196 -94689 40157
20863 40157 -23700 -32691 -306484 -336529 -210315 -58612 -59392 -95588 -97463 -159697 -82237 -77277
$$ packed form
20940a59773m4817Q8019R5598j8667j25711M8607O0148K0351n5836l3814J1230
20929a14665J54214k7373J04613O9980M5316l7202k08017l3737K2778l0416J21693
20918F7184Q8512j60581O2406R1192j49884N3947J40433R5946P6769m7331r4960
20907B23633j04216l0961M2207P4900r8774j29785l6454j49903J83931Q2472r5658
20896c8608l3422N0598N9520M6896Q1993j80166p1315J01649P7369J31701q2936
20885A43279r9562Q8234q261l7068R2065q9847k00135N7363J21519j47420j1051
20874i0884M7137r8706P1146J87837k2157l2005n6655j76191l3718J09507J34846
20863D0157o3857q991k73793l0045J26214J51703p80l6196j875o2234P7460M960
$$ plain form
20851 -77277 -10828 4935 10965 -25655 -93418 -225076 -166905 -94877 -73050 -135264 -157174 -260891
20839 -260891 -175739 -255658 -328207 -434599 -360149 -123062 -93445 -76688 -3161 -26723 -87881
20828 -87881 -36720 -43575 -111478 -60837 -58040 -133673 -79151 -78742 76772 57660 -5744 38937
20816 38937 -974 -100149 -18642 81221 42291 -34498 80653 15083 -16032 85937 -118339
20805 -118339 -233920 -121046 -62391 8440 72696 -69692 -94962 79814 69241 137150 141942
20794 141942 156429 277125 206019 187376 3314 -102964 -77959 -79288 -5660 80838 19967
20783 19967 44688 76712 56754 143898 56162 3130 63077 65509 8049 -29251 76766 131010
20771 131010 92199 305172 300412 115616 168574 266903 246309 196792 132568 -432 24687
$$ packed form
20851g7277O6449J5763O030l6620o7763j31658N8171P2028K1827o2214k1910j03717
20839b60891Q5152p9919p2549j06392P4450K37087K9617J6757P3527k3562o1158
20828h7881N1161o855o7903N0641K797p5633N4522M09J55514j9112o3404M4681
20816C8937l9911r9175Q1507R9863l8930p6789J15151o5570l1115J01969k04276
20805a18339j15581J12874N8655P0831O4256j42388k5270J74776j0573O7909M792
20794A41942J4487J20696p1106j8643j84062j06278K5005j329P3628Q6498o0871
20783A9967K4721L2024j9958Q7144q7736n3032N9947K432n7460l7300J06017N4244
20771A31010l8811K12973m760j84796N2958R8329k0594m9517o4224j33000K5119
$$ plain form
20760 24687 89867 169479 107822 68570 20115 81137 96142 46078 24602 -28722 -44370 -23272
20748 -23272 99823 172317 119631 96466 79781 32976 -38966 57819 15687 -24575 -37599
20737 -37599 -7588 27906 -45140 -125780 -37376 116294 -20876 -135653 -58825 25240 -14254
20726 -14254 58306 12132 -42167 -76035 -10952 -58564 -61554 24896 99693 175400 34820 95237
20714 95237 163815 74785 -60116 -40980 -70006 -170343 -182436 20086 226083 229316 47658
20703 47658 -21009 22312 -12880 -38618 15825 114784 261587 338995 177843 155970 177261
20692 177261 169181 188594 286250 136964 -2704 69017 -18253 -22822 122557 145682 82868
20681 82868 132994 5470 10634 132743 225818 105427 -77521 -134431 -154857 -228741 -85127
$$ packed form
20760B4687O5180P9612o1657l9252m8455O1022J5005n0064k1476n3324j5648K1098
20748b3272J23095P2494n2686k3165j6685m6805p1942R6785m2132m0262j3024
20737c7599L0011L5494p3046q0640Q8404J53670j37170j14777P6828Q4065l9494
20726a4254P2560m6174n4299l3868O5083m7612k990Q6450P4797P5707j40580O0417
20714I5237O8578q9030j34901J9136k9026j00337j2093K02522K05997L233j81658
20703D7658o8667M3321l5192k5738N4443R8959J46803P7408j61152k1873K1291
20692A77261q080J9413R7656j49286j39668P1721q7270m569J45379K3125o2814
20681H2868N0126j27524N164J22109R3075j20391j82948n6910k0426p3884J43614
$$ plain form
20670 -85127 349031 455855 193267 71814 -134707 -88704 55121 -80331 -221161 -146020
20660 -146020 -35870 35094 105629 243214 349129 343334 202505 8883 -33530 -99108 -195360
20649 -195360 -5072 249780 253365 208623 51632 69318 142642 185577 174493 224646 61810
20638 61810 -28458 -135535 -183043 -39726 115446 280338 100955 -48425 13097 26933
20628 26933 107336 122245 50442 37187 49309 208325 276325 340376 406658 326594 156127
20617 156127 80524 -39258 -215484 -132008 -5229 164432 255218 165089 87906 15843 53186
20606 53186 37352 -189941 -186820 -83475 8137 -147089 -235977 57080 224043 258750 172739
20595 172739 247635 130277 94711 105313 245619 104663 -58002 29336 117971 113944 135769
$$ packed form
20670h5127M34158J06824k62588j21453k06521M6003J43825j35452j40830P5141
20660a46020J10150P0964P0535J37585J05915n795j40829j93622m2413o5578r6252
20649a95360J90288K54852L585m4742j56991J7686P3324M2935j1084N0153j62836
20638F1810r0268j07077m7508J43317J55172J64892j79383j49380O1522J3836
20628B6933Q0403J4909p1803j3255J2122J59016O8000O4051O6282q0064j70467
20617A56127p5603j19782j76226Q3476J26779J69661R0786r0129p7183p2063L7343
20606E3186j5834k27293L121J03345R1612j55226q8888K93057J66963L4707q6011
20595A72739P4896j17358l5566J0602J40306j40956j62665Q7338Q8635m027K1825
$$ plain form
20584 135769 175450 97696 -31612 31473 25584 37683 79459 183249 355523 188088 41915
20573 41915 167276 17906 -101997 -25146 137434 339291 291900 151657 36770 -43009
20563 -43009 -122966 -179993 -92436 -134810 -59934 23590 38752 -80395 -311898 -234098 -130687
20552 -130687 -104590 -55394 -82443 53227 172331 244403 286876 275477 178949 258917 119281
20541 119281 82697 50115 43423 49230 117538 71024 -47991 -26640 135682 261860 166861
20530 166861 62082 150408 263537 203477 169919 153567 19439 -123510 -189858 -274231 -251451
20519 -251451 -70760 -57905 41025 -38121 -174522 -239979 -213014 -124810 -75029 -7288 -127410
20508 -127410 -74059 113742 396937 445688 258365 358067 411267 230612 175065 181557 216174
$$ packed form
20584A35769L9681p7754j29308O3085n889J2099M1776J03790J72274j67435j46173
20573D1915J25361j49370j19903P6851J62580K01857m7391j40243j14887p9779
20563d3009p9957n7027Q7557m2374P4876Q3524J5162j19147k31503P7800J03411
20552a30687K6097M9196k7049J35670J19104P2072M2473j1399r6528P9968j39636
20541A19281l6584l2582o692N807O8308m6514j19015K1351J62322J26178r4999
20530A66861j04779Q8326J13129o0060l3558j6352j34128j42949o6348q4373K2780
20519b51451J80691J2855R8930p9146j36401o5457K6965Q8204M9781O7741j20122
20508a27410N3351J87801K83195M8751j87323R9702N3200j80655n5547O492L4617
$$ plain form
20497 216174 28476 119282 289977 446549 379788 268291 185110 197052 115358 181577 384382
20486 384382 209940 141164 173481 304585 291720 200984 199678 279404 381514 260061 411459
20475 411459 600686 573094 276210 21500 60091 211401 267144 295813 283974 155948
20465 155948 102890 177975 166625 224453 233636 308235 426102 407433 353235 322942 333017
20454 333017 424935 559901 467063 332115 346469 171440 95339 144031 40541 80376 69694
20443 69694 180613 315836 367865 464675 384932 200396 293860 303094 403427 602203 560578
20432 560578 367908 265465 280362 160787 145278 129086 188771 206139 239808 304557 294705
20421 294705 285519 287548 270756 273339 354225 242274 285272 431420 412109 401200 482086 352597
$$ packed form
20497B16174j87698R0806J70695J56572o6761j11497q3181J1942q1694O6219K02805
20486C84382j74442o8776L2317J31104j2865r0736j306P9726J02110j21453J51398
20475D11459J89227k7592k96884k54710L8591J51310N5743K8669j1839j28026
20465A55948n3058P5085j1350N7828R183P4599J17867j8669n4198l0293J0075
20454C33017R1918J34966r2838j34948J4354j75029p6101M8692j03490L9835j0682
20443F9694J10919J35223N2029R6810p9743j84536R3464R234J00333J98776m1625
20432E60578j92670j02443J4897j19575j5509j6192N9685J7368L3669O4749r852
20421B94705r186K029j6792K583Q0886j11951M2998J46148j9311j0909Q0886j29489
$$ plain form
20409 352597 122436 66304 199009 330867 250975 167980 204152 502851 609333 451107
20399 451107 239235 -1522 -73532 81516 246847 191822 189587 328051 445966 519003
20389 519003 461948 440735 515241 564315 360055 244431 328752 373131 333482 257589 380541
20378 380541 353552 213000 199175 257835 295401 141552 158062 371325 388478 247116 307533
20367 307533 172375 -2110 -5987 -9787 -68213 8724 35105 171311 308421 316527 414822
20356 414822 163347 -97982 -363455 -234919 -22597 152771 151227 100135 103586 181631 73793
20345 73793 163846 237957 136317 37566 148637 211014 72008 108487 285621 365517 265344
20334 265344 290491 248369 371154 180073 -47344 -258578 -123131 -48843 -116481 -3283
$$ packed form
20409C52597k30161n6132J32705J31858p9892q2995L6172K98699J06482j58226
20399D51107k11872k40757p2010J55048J65331n5025k235J38464J17915P3037
20389E19003n7055k1213P4506M9074k04260j15624Q4321M4379l9649p5893J22952
20378C80541k6989j40552j3825N8660L7566j53849J6510K13263J7153j41362O0417
20367C07533j35158j74485l877l800n8426P6937K6381J36206J37110Q106R8295
20356D14822k51475k61329k65473J28536K12322J75368j544n1092L451P8045j07838
20345G3793R0053P4111j01640r8751J11071O2377j39006L6479J77134P9896j00173
20334B65344K5147m2122J22785j91081k27417k11234J35447P4288o7638J13198
$$ plain form
20324 -3283 82333 -84679 99180 320861 326201 139878 142573 151239 11100 8645 101929 262233
20312 262233 300690 335539 234366 210173 328812 291238 198376 153645 -58731 -111163 -364265
20301 -364265 -528278 -411174 -126405 295081 257328 239233 235233 268092 113741 18895 -45589
20290 -45589 22851 69094 146378 256202 177098 78699 10589 -2788 -144043 -182675 -100815
20279 -100815 15469 286580 372442 361723 484789 332572 201263 269213 321916 66530
20269 66530 75440 168734 226742 146497 -6072 -26265 -30877 18263 45815 -847 32138 132883
20257 132883 214764 88859 -111715 -209208 3129 182395 188713 226670 252073 287362 186806
20246 186806 138829 92761 62862 124321 117049 -34496 60318 23362 57119 339301 416066
$$ packed form
20324c283Q5616j67012J83859K21681N340j86323K695Q666j40139k455R3284J60304
20312B62233L8457L4849j01173k4193J18639l7574r2862m4731k12376n2432k53102
20301c64265j64013J17104K84769M21486l7753j8095m000L2859j54351r4846o4484
20290d5589O8440M6243P7284J09824p9104r8399o8110j3377j41255l8632Q1860
20279a00815J16284K71111Q5862j0719J23066j52217j31309O7950N2703k55386
20269F6530Q910R3294N8008q0245j52569k0193m612M9140K7552m6662L2985J00745
20257A32883Q1881j25905k00574r7493K12337J79266O318L7957K5403L5289j00556
20246A86806m7977m6068k9899O1459p272j51545R4814l6956L3757K82182P6765
$$ plain form
20235 416066 407025 287844 268944 416462 363248 107552 187961 168841 144210 201329 238693
20224 238693 145322 61346 121223 266542 188066 64107 47427 197736 229852 168375 101915
20213 101915 -70292 27387 27286 92045 255147 222278 159513 227062 295255 297988 248836 186980
20201 186980 207999 186361 149630 211882 204019 284101 293574 245644 266157 207431 156358 164177
20189 164177 233248 308865 190244 179180 180497 286656 254813 241027 253012 225815 163867
20178 163867 219197 256561 156399 83432 175406 188453 336103 547286 574555 509794 390825
20167 390825 315720 255831 117088 113227 230037 312889 258407 262486 281901 362701 362199 315668
20155 315668 245089 131798 79650 111744 155262 215226 239855 252149 216824 249197 438235
$$ packed form
20235D16066r041j19181j8900J47518n3214k55696Q0409j9120k4631N7119L7364
20224B38693r3371q3976N9877J45319p8476j23959j6680J50309L2116o1477o6460
20213A01915j72207R7679j01O4759J63102l2869o2765O7549O8193K733m9152o1856
20201A86980K1019k1638l6731O2252p863Q0082R473m7930K0513n8726n1073P819
20189A64177O9071P5617j18621j1064J317J06159l1843j3786J1985k7197o1948
20178A63867N5330L7364j00162p2967R1974J3047J47650K11183K7269o4761j18969
20167C90825p5105n9889j38743l861J16810Q2852n4482M079J9415Q0800n02m6531
20155C15668p0579j13291n2148L2094M3518N9964K4629J2294l5325L2373J89038
$$ plain form
20144 438235 417630 233730 29163 131494 249069 347776 220179 51927 42209 14070
20134 14070 147557 214858 245240 153337 -65345 -39086 -59635 146257 -24848 -80834 -45944
20123 -45944 -146542 -40076 102092 384843 351317 225902 186006 281804 350181 287894 167814
20112 167814 192377 236382 363149 359355 346663 332723 357774 165540 175640 120097 193229
20101 193229 313423 305213 305513 264081 267742 210500 237276 349400 317069 294488 366478 473046
20089 473046 648956 564029 303557 233589 213508 396794 423454 165926 137448 193652 359970
20078 359970 461543 387038 333134 224888 143355 113811 224354 182435 219091 206011 248706
20067 248706 409150 458966 556210 668453 567299 350482 238513 141789 256927 456978
$$ packed form
20144D38235k0605j83900k04567J02331J17575R8707j27597j68252r718k8139
20134A4070J33487O7301L0382r1903k18682K6259k0549K05892j71105n5986L4890
20123d5944j00598J06466J42168K82751l3526j25415l9896R5798O8377o2287j20080
20112A67814K4563M4005J26767l794j2692j3940K5051j92234J0100n5543P3132
20101A93229J20194q210L00m1432L661n7242K6776J12124l2331k2581P1990J06568
20089D73046J75910q4927k60472o9968k0081J83286K6660k57528k8478N6204J66318
20078C59970J01573p4505n3904j08246q1533k9544J10543m1919L6656j3080M2695
20067B48706J60444M9816R7244J12243j01154k16817j11969r6724J15138K00051
$$ plain form
20057 456978 392610 163546 316110 244641 237261 276008 200860 172383 95489 80712 199694
20046 199694 448871 605631 352895 273572 363597 532562 568784 543358 302344 162639
20036 162639 306194 458749 463460 549226 704109 610554 642255 469477 180807 292279
20026 292279 381488 434402 603161 519318 492688 487317 522347 407303 367369 333400 511660
20015 511660 694932 626090 481023 501957 480591 536596 622600 521561 516552 432575 346399
20004 346399 370937 434706 421566 373002 507643 557319 512825 597980 552780 456790 396777
19993 396777 189130 197167 286353 393134 543780 620318 498634 400533 503914 677606
19983 677606 662406 696912 732617 596331 533504 683297 745096 588430 501507 584360 553669
$$ packed form
20057D56978o4368k29064J52564p1469p380L8747p5148k8477p6894j4777J18982
20046A99694K49177J56760k52736p9323R0025J68965L6222k5426k41014j39705
20036A62639J43555J52555M711Q5766J54883r3555L1701j72778k88670J11472
20026B92279Q9209N2914J68759q3843k6630n371L5030j15044l9934l3969J78260
20015E11660J83272o8842j45067K0934k1366N6005Q6004j01039n009q3977q6176
20004C46399K4538O3769j3140m8564J34641M9676m4494Q5155m5200r5990o0013
19993C96777k07647Q037Q9186J06781J50646P6538j21684r8101J03381J73692
19983F77606j5200L4506L5705j36286o2827J49793O1799j56666q6923Q2853l0691
$$ plain form
19972 553669 668065 794684 812169 653616 431236 459649 678865 862530 887160 943639
19962 943639 877626 748379 755682 921011 876111 836850 599396 435939 556015 671057
19952 671057 828731 812303 671833 656064 741369 926353 842323 858669 1024325 1004367 1151895
19941 1151895 1255943 1222726 1226339 1209733 1211179 1141461 1189279 1350827 1455237 1286683 1172458
19930 1172458 1155590 1202878 1189552 1222888 1151511 1152487 1205755 1319519 1248701 1274387 1266054 1111487
19918 1111487 1003937 917871 861111 930837 1072269 1057950 1162230 1135951 997058 1037451
19908 1037451 1201361 1375614 1447341 1385014 1307838 1339561 1213827 1018141 970130 1081061
19898 1081061 1193168 1214370 1256751 1242195 1104796 959416 927507 973282 1049395 1125660 1218838
$$ packed form
19972E53669J14396J26619J7485j58553k22380K8413K19216J83665K4630N6479
19962I43639o6013j29247P303J65329m4900l9261k37454j63457J20076J15042
19952F71057J57674j6428j40470j5769Q5305J84984q4030J6346J65656j9958J47528
19941A151895J04048l3217L613j6606J446o9718M7818J61548J04410j68554j14225
19930A172458j6868M7288j3326L3336p1377R76N3268J13764p0818K5686q333j54567
19918A111487j07550q6066n6760O9726J41432j4319J04280k6279j38893M0393
19908A037451J63910J74253P1727o2327p7176L1723j25734j95686m8011J10931
19898A081061J12107K1202M2381j4556j37399j45380l1909M5775P6113P6265R3178
$$ plain form
19887 1218838 1171369 1342658 1558651 1529508 1435291 1316640 1196242 1111407 1270690 1335713
19877 1335713 1222519 1156378 1265484 1502813 1518413 1440101 1363556 1291409 1343265 1526611
19867 1526611 1603698 1690424 1522756 1523639 1591783 1562751 1547149 1637159 1566873 1627345 1598149
19856 1598149 1538537 1502620 1567730 1683275 1638237 1595223 1748503 1730256 1690622 1794030 1926781
19845 1926781 1910999 1946644 2045592 2101567 2055785 2188598 2113633 2036230 2237992 2275024 2131341
19834 2131341 2216446 2234693 2263882 2434519 2506583 2463545 2372923 2367974 2363936 2683024 2771745
19823 2771745 2759448 2884810 2687936 2529588 2605583 2694525 2859440 2940241 2870505 2877703 3079078
19812 3079078 3223411 3328915 3212050 3052964 3028731 3123079 3226219 3412778 3618942 3715821
$$ packed form
19887A218838m7469J71289K15993k9143r4217j18651j20398q4835J59283O5023
19877A335713j13194o6141J09106K37329J5600p8312p6545p2147N1856J83346
19867A526611P7087Q6726j67668Q83O8144k9032j5602R0010p0286O0472k9196
19856A598149n9612l5917O5110J15545m5038m3014J53280j8247l9634J03408J32751
19845A926781j5782L5645R8948N5975m5782J32813p4965p7403K01762L7032j43683
19834B131341Q5105J8247K9189J70637P2064m3038r0622m949m038L19088Q8721
19823B771745j2297J25362j96874j58348P5995Q8942J64915Q0801o9736P198K01375
19812C079078J44333J05504j16865j59086k4233R4348J03140J86559K06164R6879
$$ plain form
19802 3715821 3764110 3725213 3731949 3725206 3617200 3683795 3815005 3968790 3978798 4067708 4193391
19791 4193391 4420468 4593023 4587317 4623813 4595614 4477053 4325501 4323375 4561437 4673684
19781 4673684 4892387 5062337 5357218 5425568 5456242 5330326 5332018 5353740 5514120 5767682
19771 5767682 5939772 6039799 6000400 6047386 6218089 6369315 6785526 7046210 7146779 7213633
19761 7213633 7247237 7382419 7586168 7768311 7869966 8135293 8385645 8723397 9088882 9159491
19751 9159491 9317393 9530139 9756912 10093843 10350190 10660929 11094426 11340684 11578354
19742 11578354 11928187 12273834 12709200 13225461 13585070 13984231 14507936 15104951 15633690
19733 15633690 16089466 16601545 17263541 17894193 18588596 19365624 20173261 20987909 21829317
$$ packed form
19802C715821M8289l8897O736o743j08006O6595J31210J53785J0008Q8910J25683
19791D193391K27077J72555n706L6496k8199j18561j51552k126K38062J12247
19781D673684K18703J69950K94881O8350L0674j25916J692K1722J60380K53562
19771E767682J72090J00027l9399M6986J70703J51226M16211K60684J00569O6854
19761G213633L3604J35182K03749J82143J01655K65327K50352L37752L65485P0609
19751I159491J57902K12746K26773L36931K56347L10739M33497K46258K37670
19742A1578354L49833L45647M35366N16261L59609L99161N23705N97015N28739
19733A5633690M55776N12079O61996O30652O94403P77028Q07637Q14648Q41408
$$ plain form
19724 21829317 22697912 23444444 24180652 25006615 25984315 27128538 28265692 29363499 30418325
19715 30418325 31702162 33111390 34728456 36658159 38654064 40552502 42682775 45039886
19707 45039886 47549017 50172832 53001472 56081372 59617136 63504700 67646072 72201400
19699 72201400 77247711 82814705 88999075 95527976 102721286 110609175 119374223 129171648
19691 129171648 140029250 151720450 164564680 178663428 193798932 209993107 226910466
19684 226910466 244464689 262664119 280696363 298101372 314199123 328105898 339506058
19677 339506058 347874186 352537700 353099184 349673816 342566551 332098005 318749285 303385560
19669 303385560 286823353 269564690 252329655 235175291 218765995 203384267 189159366
$$ packed form
19724B1829317Q68595P46532P36208Q25963R77700J144223J137154J097807J054826
19715C0418325J283837J409228J617066J929703J995905J898438K130273K357111
19707D5039886K509131K623815K828640L079900L535764L887564M141372M555328
19699G2201400N046311N566994O184370O528901P193310P887889Q765048R797425
19691A29171648J0857602J1691200J2844230J4098748J5135504J6194175J6917359
19684B26910466J7554223J8199430J8032244J7405009J6097751J3906775J1400160
19677C39506058Q368128M663514N61484l425368p107265j0468546j3348720j5363725
19669C03385560j6562207j7258663j7235035j7154364j6409296j5381728j4224901
$$ plain form
19662 189159366 175705217 163424850 152030573 141666624 132248591 123686416 115911402
19655 115911402 108692124 102042220 96008942 90538951 85681469 81161468 76997703 72784311
19647 72784311 69075308 65766218 62639256 60012256 57304520 54693289 52333127 50076726
19639 50076726 48022306 46235370 44408422 42682231 40976661 39525929 38244478 36866969
19631 36866969 35493522 34414894 33237167 32066748 31145144 30069455 29283257 28493154
19623 28493154 27664522 26863923 26280093 25572123 24745229 24118647 23733580 23341106 22865244
19614 22865244 22427756 21918506 21501848 21054942 20798546 20577736 20174491 19669472 19433951
19605 19433951 19265056 18914908 18338941 17891829 17702651 17408182 17059479 16680040 16182371
$$ packed form
19662A89159366j3454149j2280367j1394277j0363949r418033q562175p775014
19655A15911402p219278o649904o033278n469991m857482m520001m163765m213392
19647G2784311l709003l309090l126962k627000k707736k611231k360162k256401
19639E0076726k054420j786936j826948j726191j705570j450732j281451j377509
19631C6866969j373447j078628j177727j170419r21604j075689p86198p90103
19623B8493154q28632q00599n83830p07970q26894o26582l85067l92474m75862
19614B2865244m37488n09250m16658m46906k56396k20810m03245n05019k35521
19605A9433951j68895l50148n75967m47112j89178k94469l48703l79439m97669
$$ plain form
19596 16182371 15845993 15557255 15248202 14927605 14572807 14073062 13689511 13512426 13313066
19587 13313066 13050639 12734316 12466725 12061028 11597831 11356817 11197960 10857412 10742196
19578 10742196 10554134 10408294 10328861 10000332 9734138 9543422 9349598 9232807 9093150
19569 9093150 8970968 8783608 8454447 8251732 8245070 8400804 8238661 7998771 8021958 7923450
19559 7923450 7799031 7829336 7817347 7658598 7471467 7324733 7256130 7217050 7252048 7199851
19549 7199851 7187887 7050924 6981320 6982905 6914972 6807138 6669128 6500610 6293401 6170781
19539 6170781 6095521 6095633 5902783 5655570 5639801 5730386 5862817 5868503 5556621 5524185 5626827
19528 5626827 5633346 5570725 5530682 5657068 5782861 5640597 5615953 5628652 5363707 5270956 5283020
$$ packed form
19596A6182371l36378k88738l09053l20597l54798m99745l83551j77085j99360
19587A3313066k62427l16323k67591m05697m63197k41014j58857l40548j15216
19578A0742196j88062j45840p9433l28529k66194j90716j93824j16791j39657
19569I093150j22182j87360l29161k02715o662J55734j62143k39890K3187r8508
19559G923450j24419L0305j1989j58749j87131j46734o8603l9080L4998n2197
19549G199851j1964j36963o9604J585o7933j07834j38010j68518k07209j22620
19539F170781p5260J12j92850k47213j5769R0585J32431N686l11882l2436J02642
19528E626827O519o2621m0043J26386J25793j42264k4644J2699k64945r2751J2064
$$ plain form
19517 5283020 5130322 4901679 4813492 4822687 4823271 4775932 4612066 4474090 4550994 4406320 4270072
19506 4270072 4039554 3899055 3811355 3634695 3558063 3628163 3497626 3308081 3219373 3320342
19496 3320342 3359575 3183566 2952524 2904209 3031119 2991790 2793470 2811106 2908290 2925774
19486 2925774 2826580 2913324 2983919 3040879 2971052 2764325 2741276 2802907 2968479 3009790 2809680
19475 2809680 2808680 2889769 2942028 2927049 2989895 2986475 3096808 3072216 3040775 3067013 3091304
19464 3091304 3180398 3276792 3411033 3303961 3097149 3029959 2874991 2610831 2602912 2690442
19454 2690442 2696418 2515231 2413403 2361632 2189636 2131838 2042791 1871462 1826699 2012939
19444 2012939 2094244 2244527 2223606 2178236 1915557 1864152 1898363 1878609 1647914 1653702 1796915
$$ packed form
19517E283020j52698k28643q8187R195N84m7339j63866j37976P6904j44674j36248
19506D270072k30518j40499q7700j76660p6632P0100j30537j89545q8708J00969
19496C320342L9233j76009k31042m8315J26910l9329j98320J7636R7184J7484
19486B925774r9194Q6744P0595N6960o9827k06727k3049O1631J65572M1311k00110
19475B809680j000Q1089N2259j4979O2846l420J10333k4592l1441K6238K4291
19464C091304Q9094R6394J34241j07072k06812o7190j54968k64160p919Q7530
19454B690442N976j81187j01828n1771j71996n7798q9047j71329m4763J86240
19444B012939Q1305J50283k0921m5370k62679n1405L4211j9754k30695N788J43213
$$ plain form
19433 1796915 1759261 1707120 1864026 1893970 1905728 1844950 1718109 1732252 1720213 1670652 1618385
19422 1618385 1554050 1537861 1619015 1616243 1697895 1553751 1472253 1419927 1224540 1209686 1272424
19411 1272424 1376829 1341413 1356413 1276984 1174327 1270913 1393570 1363049 1423352 1485058 1626615
19400 1626615 1543229 1562869 1558366 1521807 1562661 1456417 1555665 1790981 1682406 1507650 1545479
19389 1545479 1597454 1568546 1563148 1465484 1406769 1521970 1676084 1490271 1324848 1415019 1463685
19378 1463685 1521796 1498073 1470623 1607625 1624060 1454205 1349769 1397655 1552709 1724176
19368 1724176 1798723 1889039 1727297 1649901 1649272 1608814 1771482 1902658 2084760 1877900 1937085
19357 1937085 2086382 2064983 2030853 1981434 1968628 2009867 2036156 2143878 2047764 1778906 1637313
$$ packed form
19433A796915l7654n2141J56906K9944J1758o0778j26841J4143j2039m9561n2267
19422A618385o4335j6189Q1154k772Q1652j44144q1498n2326j95387j4854O2738
19411A272424J04405l5416J5000p9429j02657R6586J22657l0521O0303O1706J41557
19400A626615q3386J9640m503l6559M0854j06244R9248K35316j08575j74756L7829
19389A545479N1975k8908n398r7664n8715J15201J54114j85813j65423R0171M8666
19378A463685N8111k3723k7450J37002J6435j69855j04436M7886J55054J71467
19368A724176P4547R0316j61742p7396o29m0458J62668J31176J82102k06860N9185
19357A937085J49297k1399l4130m9419j2806M1239K6289J07722r6114k68858j41593
$$ plain form
19346 1637313 1522213 1651128 1717451 1586575 1416943 1375774 1379609 1359764 1274680 1254376 1292719
19335 1292719 1214351 1263711 1321502 1248788 1152601 1111931 1245900 1277183 1265330 1202925 1295603
19324 1295603 1314537 1250637 1401628 1592967 1555593 1468674 1338022 1293384 1212252 1180422 1225600
19313 1225600 1148359 1303438 1397932 1498966 1546427 1641702 1550506 1364502 1358103 1275891 1189527
19302 1189527 1296649 1298239 1290324 1208714 1118926 898224 956640 1014729 1030948 947122 906025
19291 906025 1086190 1089246 967105 956544 1040359 1205771 1337903 1413411 1454721 1415780 1181730
19280 1181730 1127650 1128287 1019059 1025675 1275892 1262224 1159537 1192660 1070011 1027397 1105711
19269 1105711 1110198 1002346 936766 952818 1116209 1153099 1268188 1450739 1417540 1192886
$$ packed form
19346A637313j15100J28915O6323j30876j69632m1169L835j9845q5084k0304L8343
19335A292719p8368M9360N7791p2714r6187m0670J33969L1283j1853o2405R2678
19324A295603J8934o3900J50991J91339l7374q6919j30652m4638q1132l1830M5178
19313A225600p7241J55079R4494J01034M7461R5275r1196j86004o399q2212q6364
19302A189527J07122J590p915q1610q9788k20702N8416N8089J6219q3826m1097
19291I06025J80165L056j22141j0561Q3815J65412J32132P5508M1310l8941k34050
19280A181730n4080O37j09228O616K50217j3668j02687L3123j22649m2614P8314
19269A105711M487j07852o5580J6052J63391L6890J15089J82551l3199k24654
$$ plain form
19259 1192886 1115508 1090266 1035458 1040404 1320506 1186251 1145366 1211782 1125827 1063688 1247780
19248 1247780 1366007 1329823 1412659 1370354 1251775 1187143 1112978 1113099 1081199 1431783 1374973
19237 1374973 1391081 1491139 1468719 1362362 1186665 1123971 1136446 1275167 1307794 1110363
19227 1110363 1088462 1166577 1090179 1236549 1408335 1460088 1327098 1348097 1374456 1478916
19217 1478916 1679403 1624764 1577743 1556982 1589722 1707921 1641456 1825643 2001934 1884585
19207 1884585 1713836 1635869 1773236 1693206 1844196 2073401 2260221 2217786 2069135 2001062
19197 2001062 2062742 1983301 1893443 1831572 1929131 1876926 1898153 1950793 1899557 1790147 1761461
19186 1761461 1738236 1706737 1686310 1761511 1923298 1828164 1945546 1957723 1820094 1779553 1780896
$$ packed form
19259A192886p7378k5242n4808M946K80102j34255m0885O6416q5955o2139J84092
19248A247780J18227l6184Q2836m2305j18579o4632p4165J21l1900L50584n6810
19237A374973J6108J00058k2420j06357j75697o2694J2475J38721L2627j97431
19227A110363k1901P8115p6398J46370J71786N1753j32990K0999K6359J04460
19217A478916K00487n4639m7021k0761L2740J18199o6465J84187J76291j17349
19207A884585j70749p7967J37367q0030J50990K29205J86820m2435j48651o8073
19197B001062O1680p9441q9858o1871R7559n2205K1227N2640n1236j09410k8686
19186A761461k3225l1499k0427P5201J61787r5134J17382J2177j37629m0541J343
$$ plain form
19175 1780896 1855263 1798002 1606826 1608322 1511125 1490841 1585572 1771306 1942745 1897928 2046812
19164 2046812 1976383 1849428 1745994 1708717 1557987 1465303 1427373 1352111 1333413 1355064 1281139
19153 1281139 1211442 1016429 968062 1047711 1121947 972369 974048 1019779 897728 869721 939547
19142 939547 878034 911705 794641 731114 894115 823150 726007 812975 838466 907681 998392
19131 998392 837580 768083 837755 886786 900583 1023837 1031168 877935 680477 670652 737451
19120 737451 887604 814947 761043 707190 763671 727239 541350 434891 595781 609885 679658
19109 679658 816764 975605 894221 748366 624124 792477 825697 728519 773756 802064
19099 802064 713444 801740 856685 932921 1097535 1114775 1068368 1160957 1304534 1361728 1271609
$$ packed form
19175A780896P4367n7261j91176J496r7197k0284R4731J85734J71439m4817J48884
19164B046812p0429j26955j03434l7277j50730r2684l7930p5262j8698K1651p3925
19153A281139o9697j95013m8367P9649P4236j49578J679M5731j22051k8007O9826
19142I39547o1513L3671j17064o3527J63001p0965r7143Q6968K5491O9215R0711
19131I98392j60812o9497O9672M9031J3797J23254P331j53233j97458r825O6799
19120G37451J50153p2657n3904n3853N6481l6432j85889j06459J60890J4104O9773
19109F79658J37106J58841q1384j45855j24242J68353L3220r7178M5237K8308
19099H02064q8620Q8296N4945P6236J64614J7240m6407R2589J43577N7194r0119
$$ plain form
19088 1271609 1258528 1293382 1420667 1722436 1677498 1465833 1571030 1329862 1056270 1080258
19078 1080258 1162144 1232746 1132833 967003 1073291 1293652 1363779 1286607 1203501 1142337 1305871
19067 1305871 1384734 1378192 1264515 1164979 1248916 1150054 1137465 1039994 1053386 1077439 1103751
19056 1103751 1199150 1398284 1417427 1309133 1158800 1312875 1311236 1332917 1283846 1333463 1597780
19045 1597780 1815666 1910527 1934167 1729761 1557583 1460521 1639890 1832260 1799806 1621285
19035 1621285 1400919 1415430 1617767 1921778 1882681 1903906 1917998 1906141 1948377 1864593 1744459
19024 1744459 1845004 1873061 1801126 2012124 2194890 2282274 2361726 2431628 2509356 2439696 2567870
19013 2567870 2785075 2708202 2692832 2834707 2844009 2798154 2876321 3005467 2952819 2838755 2858044
$$ packed form
19088A271609j3081L4854J27285L01769m4938k11665J05197k41168k73592K3988
19078A080258Q1886P0602r9913j65830J06288K20361P0127p7172q3106o1164J63534
19067A305871P8863o542j13677r9536Q3937r8862j2589r7471J3392K4053K6312
19056A103751R5399J99134J9143j08294j50333J54075j639K1681m9071M9617K64317
19045A597780K17886R4861K3640k04406j72178r7062J79369J92370l2454j78521
19035A621285k20366J4511K02337L04011l9097K1225J4092j1857M2236q3784j20134
19024A744459J00545K8057p1935K10998J82766Q7384P9452O9902P7728o9660J28174
19013B567870K17205p6873j5370J41875R302m5855P8167J29146n2648j14064J9289
$$ plain form
19002 2858044 2922655 2947938 3041709 3009016 2979838 2939510 2951863 2900763 2764671 2727675 2788979
18991 2788979 2627689 2534257 2561494 2500312 2584287 2790263 2963685 3080451 3079117 2873265
18981 2873265 2903575 3043373 3052260 3175270 3306680 3407901 3555783 3626846 3834836 4046763
18971 4046763 4198527 4324463 4472243 4753842 5286174 5799962 5991479 6255427 6579854
18962 6579854 6811333 7328696 7803337 7981550 7902754 8076489 8159371 8196757 8097008 7994454
18952 7994454 7742023 7366901 7115907 6929848 6624117 6239912 5912962 5648076 5170970
18943 5170970 4986414 4809335 4731891 4671633 4638280 4481449 4536137 4324368 4099370 4046338
18933 4046338 4129852 4103360 4011710 4157298 4215697 4306419 4369792 4515078 4824373 5198758
$$ packed form
19002B858044O4611K5283R3771l2693k9178m0328J2353n1100j36092l6996O1304
18991B788979j61290r3432K7237o1182Q3975K05976J73422J16766j334k05852
18981B873265L0310J39798Q887J23010J31410J01221J47882P1063K07990K11927
18971D046763J51764J25936J47780K81599N32332N13788J91517K63948L24427
18962F579854K31479N17363M74641J78213p8796J73735Q2882L7386r9749j02554
18952G994454k52431l75122k50994j86059l05731l84205l26950k64886m77106
18943E170970j84556j77079p7444o0258l3353j56831N4688k11769k24998n3032
18933D046338Q3514k6492r1650J45588N8399R0722O3373J45286L09295L74385
$$ plain form
18923 5198758 5493599 5779000 6151846 6639748 7182126 7436847 7669487 7920939 8064039
18914 8064039 8482875 8661425 8874582 9000363 8993464 8929965 8855195 8849801 8711293 8559270
18904 8559270 8184467 7863280 7411138 6961790 6641131 6390881 6210788 5965821 5727643
18895 5727643 5399291 5234122 4951479 4948465 4895364 4792524 4914439 4788647 4712614 4855528
18885 4855528 5210290 5464588 5677896 5771380 5925623 6085986 6458434 6951088 7356047 7629883
18875 7629883 8090905 8617888 9098878 9681975 10309146 11054738 12039559 13102822 14069640
18866 14069640 15205515 16664153 18029375 19219087 20702683 22253978 23736537 24936312
18858 24936312 26387243 27738249 28760107 29693747 30228071 30638901 30874992 30692932 30324513
$$ packed form
18923E198758K94841K85401L72846M87902N42378K54721K32640K51452J43100
18914H064039M18836J78550K13157J25781o899o3499p4770n394j38508j52023
18904H559270l74803l21187m52142m49348l20659k50250j80093k44967k38178
18895E727643l28352j65169k82643l014n3101j02840J21915j25792p6033J42914
18885D855528L54762K54298K13308R3484J54243J60363L72448M92654M04959K73836
18875G629883M61022N26983M80990N83097O27171P45592R84821J063263R66818
18866A4069640J135875J458638J365222J189712J483596J551295J482559J199775
18858B4936312J450931J351006J021858R33640N34324M10830K36091j82060l68419
$$ plain form
18849 30324513 29815377 28969548 27960091 26884618 25732654 24509908 23391383 22145774
18841 22145774 20811869 19656516 18755924 17813641 16993350 16514632 15989366 15473942 15282169
18832 15282169 15166841 14886125 14868509 15029823 15345733 15681160 16033546 16472317 16989018
18823 16989018 17551623 18556115 19746449 21002358 22383419 23823993 25443469 27026619
18815 27026619 28723709 30403482 32033578 33359587 34721934 35850965 36770763 37358448
18807 37358448 37630058 37623785 37294410 36709450 35841542 34774001 33355827 32053752 30463168
18798 30463168 28726251 26813856 24998463 23347731 21842593 20476109 19238560 18165306
18790 18165306 17147434 16155802 15185610 14272136 13492518 12745470 12237890 11744178 11377431
$$ packed form
18849C0324513n09136q45829j009457j075473j151964j222746j118525j245609
18841B2145774j333905j155353r00592r42283q20291m78718n25266n15424j91773
18832A5282169j15328k80716j7616J61314L15910L35427L52386M38771N16701
18823A6989018N62605J004492J190334J255909J381061J440574J619476J583150
18815B7026619J697090J679773J630096J326009J362347J129031R19798N87685
18807C7358448K71610o273l29375n84960q67908j067541j418174j302075j590584
18798C0463168j736917j912395j815393j650732j505138j366484j237549j073254
18790A8165306j017872r91632r70192r13474p79618p47048n07580m93712l66747
$$ plain form
18781 11377431 10946150 10727182 10536137 10448516 10117009 9907973 9800304 9449167 9108408
18772 9108408 8858171 8717664 8484471 8330996 8163281 7915550 7729457 7480782 7396275 7472192
18762 7472192 7391004 7203218 7056488 6938595 6982237 7081301 7051433 7083836 6972428 6864874
18752 6864874 6820396 6863501 7038613 7348463 7471574 7512700 7469535 7708221 7827334 8074738
18742 8074738 8326867 8534112 8871275 9145636 9535572 9761338 10031093 10498336 11135425
18733 11135425 11628588 12154377 12698102 13250702 13860900 14645767 15694601 16950061 18527887
18724 18527887 20379464 22708232 25716083 29234373 33301772 37973426 43294535 49338933
18716 49338933 56256503 63892060 71681530 79450666 86906093 94205017 101767385 109398378
$$ packed form
18781A1377431m31281k18968j91045q7621l31507k09036j07669l51137l40759
18772I108408k50237j40507k33193j53475j67715k47731j86093k48675q4507P5917
18762G472192q1188j87786j46730j17893M3642R9064k9868L2403j11408j07554
18752F864874m4478M3105J75112L09850J23111M1126m3165K38686J19113K47404
18742H074738K52129K07245L37163K74361L89936K25766K69755M67243O37089
18733A1135425M93163N25789N43725N52600O10198P84867J048834J255460J577826
18724A8527887J851577K328768L007851L518290M067399M671654N321109O044398
18716D9338933O917570P635557P789470P769136P455427P298924P562368P630993
$$ plain form
18708 109398378 116222724 121103273 123457145 124010784 123502976 122481458 120697108 117744031
18700 117744031 113025952 106488996 98565058 90468260 83003528 75946163 69326615 62852696
18692 62852696 56801662 51344806 46614880 42697007 39617930 37111888 35191195 33903750
18684 33903750 33035594 32584283 32533227 32818647 33218935 34139614 35700992 37993830 40961696
18675 40961696 44708209 49258874 54566470 60832937 68263990 76779734 85994775 95741689
18667 95741689 105410986 115036376 124633370 134625953 144459021 153247952 159753909 163336137
18659 163336137 164524890 164135548 163199611 161577267 158375244 152768395 144889380 135289602
18651 135289602 125361590 116139595 107778664 100125292 92686939 85460837 78592675 72610793
$$ packed form
18708A09398378O824346M880549K353872N53639n07808j021518j784350k953077
18700A17744031m718079o536956p923938q096798p464732p057365o619548o473919
18692F2852696o051034n456856m729926l917873l079077k506042j920693j287445
18684C3903750q68156m51311n1056K85420M00288R20679J561378K292838K967866
18675D0961696L746513M550665N307596O266467P431053Q515744R215041R746914
18667I5741689R669297R625390R596994R992583R833068Q788931O505957L582228
18659A63336137J188753l89342r35937j622344l202023n606849p879015r599778
18651A35289602r928012r221995q360931p653372p438353p226102o868162n981882
$$ plain form
18643 72610793 67642992 63471102 59935127 56929021 54611690 52445925 50681486 49210694
18635 49210694 47953689 46856686 45961321 45004725 44278227 43549532 43095965 42501151 42011066
18626 42011066 41532128 40658342 39696839 38583004 37362630 35984909 34500012 32913944
18618 32913944 31391906 30094572 28931147 27660976 26533271 25700535 24952632 24068921
18610 24068921 23378593 22976812 22898343 22990353 23010738 23002574 23176542 23263782 23639697 24151234
18600 24151234 24839823 25772530 26848801 28238910 30110927 32304770 34772406 37883540
18592 37883540 42057416 46948416 52734616 59290869 66322098 74008030 82167683 90492055
18584 90492055 98226664 105014290 110488337 114276539 116110491 116628267 115978166 114324922
$$ packed form
18643G2610793m967801m171890l535975l006106k317331k165765j764439j470792
18635D9210694j257005j097003q95365r56596p26498p28695m53567n94814m90085
18626D2011066m78938q73786r61503j113835j220374j377721j484897j586068
18618C2913944j522038j297334j163425j270171j127705q32736p47903q83711
18610B4068921o90328m01781p8469R2010K0385q164J73968Q7240L75915N11537
18600B4151234O88589R32707J076271J390109J872017K193843K467636L111134
18592C7883540M173876M891000N786200O556253P031229P685932Q159653Q324372
18584I0492055P734609O787626N474047L788202J833952N17776o50101j653244
$$ plain form
18576 114324922 111894611 109243211 106609644 104324269 102910662 102724759 103999252 106539721
18568 106539721 110368326 114834946 119068917 122409125 124451649 124942122 123591126 120585173
18560 120585173 116314223 110973080 104431440 97040194 88785841 80397454 72181403 64710298
18552 64710298 57981570 52370270 47806665 44088314 40995490 38390559 36286229 34686896
18544 34686896 33204773 32022582 30977661 30258537 29547624 29038397 28957807 28817387 28669214
18535 28669214 28772583 29191628 29912717 30824405 32317284 34252888 36780950 39717884 43426483
18526 43426483 47994594 53368669 59493188 66129731 72908497 79575924 85875408 91207111
18518 91207111 95109079 97446444 98426936 98149333 97037354 95245642 93056560 90334364
$$ packed form
18576A14324922k430311k651400k633567k285375j413607j85903J274493K540469
18568A06539721L828605M466620M233971L340208K042524M90473j350996l005953
18560A20585173m270950n341143o541640p391246q254353q388387q216051p471105
18552F4710298o728728n611300m563605l718351l092824k604931k104330j599333
18544C4686896j482123j182191j044921p19124p10913n09227q0590j40420j48173
18535B8669214J03369M19045P21089R11688J492879J935604K528062K936934L708599
18526D3426483M568111N374075O124519O636543O778766O667427O299484N331703
18518I1207111L901968K337365R80492k77603j111979j791712k189082k722196
$$ plain form
18510 90334364 87441706 85257067 83884150 83597946 84936531 87758652 91307558 95301455
18502 95301455 99132043 102001570 103286975 103304465 102035007 99335822 95488937 90801116
18494 90801116 85011112 78440109 71281173 63990322 57073066 51082059 45898582 41459191
18486 41459191 38123573 35712462 33557319 31674067 30118060 29038576 28248547 27635196
18478 27635196 27091408 26745591 26265340 25715862 25245244 25074143 25107314 25183494 25228402 25253296
18468 25253296 25310143 25153104 24867592 24540125 23975694 23319792 22452553 21602087 20675394
18459 20675394 19846473 19083934 18445009 17896956 17351865 16947138 16804153 16522902 16059037
18450 16059037 15738351 15722925 15838410 15784784 15704764 15868285 16127808 16604991 17022628 17426865
$$ packed form
18510I0334364k892658k184639j372917k86204J338585K822121L548906L993897
18502I5301455L830588K869527J285405J7490j269458k699185l846885m687821
18494I0801116n790004o571003p158936p290851o917256n991007n183477m439391
18486D1459191l335618k411111k155143j883252j556007j079484p90029o13351
18478B7635196n43788l45817m80251n49478m70618j71101L3171P6180M4908K4894
18468B5253296N6847j57039k85512l27467n64431o55902q67239q50466r26693
18459B0675394q28921p62539o38925n48053n45091m04727j42985k81251m63865
18450A6059037l20686j5426J15485n3626q0020J63521K59523M77183M17637M04237
$$ plain form
18440 17426865 17880427 18345820 18881883 19718760 20729118 21586620 22437888 23429891 24412471
18431 24412471 25511300 26541419 27544898 28196326 28668772 29079099 29442990 29843245 30215474
18422 30215474 30674787 31080368 31289538 31637581 31887734 31939020 31809417 31826607 31540035 31055324
18412 31055324 30587807 30191194 29719142 29407397 29263816 29502176 30028729 31219469 33266033
18403 33266033 35941848 39431219 43589662 48096279 52915541 57666811 61937893 64972839
18395 64972839 66315572 65890178 63501058 59675580 55453202 51342952 47657468 44914690
18387 44914690 43173218 41941958 41324973 41018431 40799645 40584357 40686679 40918043 41239628
18378 41239628 41338531 41029896 40644353 40490021 40505176 40591044 40947625 41437283 42312381 43523579
$$ packed form
18440A7426865M53562M65393N36063Q36877J010358Q57502Q51268R92003R82580
18431B4412471J098829J030119J003479O51428M72446M10327L63891M00255L72229
18422C0215474M59313M05581K09170L48043K50153N1286j29603J7190k86572m84711
18412C1055324m67517l96613m72052l11745j43581K38360N26553J190740K046564
18403C3266033K675815L489371M158443M506617M819262M751270M271082L034946
18395F4972839J342733m25394k389120l825478m222378m110250l685484k742778
18387D4914690j741472j231260o16985l06542k18786k15288J02322K31364L21585
18378D1239628R8903l08635l85543j54332J5155Q5868L56581M89658Q75098J211198
$$ plain form
18368 43523579 45239269 47414080 50404047 53928540 58125634 62576945 67204976 71820351
18360 71820351 75824296 78956998 80717429 81267596 80662762 79820904 79388622 80143595 82432264
18351 82432264 86212494 90710658 95267631 99451248 102871824 105383648 106775326 106611703
18343 106611703 104237997 99918833 93771504 86007231 77825851 70030936 63068402 57337232
18335 57337232 52892540 49439297 46580373 44156566 42420809 40807378 39475441 38269181
18327 38269181 37401188 36699778 36383113 36425053 37278370 38757073 40647396 43530003 47287307
18318 47287307 52000353 57480505 63667451 70676736 78061781 85280665 91739037 97430093
18310 97430093 101795047 105011985 106992052 107869081 107395516 105419026 102520180 99089214
$$ packed form
18368D3523579J715690K174811K989967L524493M197094M451311M628031M615375
18360G1820351M003945L132702J760431N50167o04834q41858m32282P54973K288669
18351H2432264L780230M498164M556973M183617L420576K511824J391678j63623
18343A06611703k373706m319164o147329p764273q181380p794915o962534n731170
18335E7337232m444692l453243k858924k423807j735757j613431j331937j206260
18327C8269181q67993p01410l16665M1940Q53317J478703J890323K882607L757304
18318D7287307M713046N480152O186946P009285P385045P218884O458372N691056
18310I7430093M364954L216938J980067Q77029m73565j976490k898846l430966
$$ plain form
18302 99089214 95719018 93124813 91503988 90296880 88953212 86700347 82831393 77398453
18294 77398453 70651333 63272252 56000437 49587402 44171965 39810386 36388170 33544574
18286 33544574 31301298 29542739 27964539 26683675 25536786 24641724 24062819 23677409
18278 23677409 23352055 23130521 22950352 23041820 23232098 23703569 24688212 26175577 28318103
18269 28318103 30869598 34263389 38540501 43318392 48153090 53007816 57849400 61770019
18261 61770019 64163995 64593801 62554376 58486907 53078511 46878929 40913414 35581684
18253 35581684 31163476 27774405 25082254 22914822 21193495 19938255 19002289 17971765
18245 17971765 17128210 16478937 16005058 15488240 14848939 14356309 13849579 13495565 13185091
$$ packed form
18302I9089214l370196k594205j620825j207108j343668k252865l868954n432940
18294G7398453o747120p379081p271815o413035n415437m361579l422216k843596
18286C3544574k243276j758559j578200j280864j146889q95062n78905l85410
18278B3677409l25354k21534j80169R1468J90278M71471R84643J487365K142526
18269B8318103K551495L393791M277112M777891M834698M854726M841584L920619
18261F1770019K393976M29806k039425m067469n408396o199582n965515n331730
18253C5581684m418208l389071k692151k167432j721327j255240r35966j030524
18245A7971765q43555o49273m73879n16818o39301m92630n06730l54014l10474
$$ plain form
18236 13185091 12856511 12585658 12396544 12274912 11989905 11710258 11383202 11372922 11282446 11060122
18226 11060122 10881613 10512185 10282121 10040849 9897431 9641723 9444341 9207359 8816356
18217 8816356 8609709 8366143 8211112 8198296 8220412 8146590 8040860 8171439 8111199 8108094
18207 8108094 8299423 8311760 8241512 8332278 8242773 8187313 8114757 8035348 8181123 8270873 8111729
18196 8111729 8191816 8295231 8210427 8178724 8108918 8045435 8012663 7863063 7708937 7573896
18186 7573896 7502596 7332421 7391640 7497466 7624245 7678607 7562197 7345439 7246551 7133052
18176 7133052 7310203 7274060 7429064 7578314 7417126 7315688 7177035 7124999 7020769 6989885
18166 6989885 6902606 6985316 7201060 7218476 7215863 7245773 7307551 7352239 7360178 7520471 7661985
$$ packed form
18236A3185091l28580k70853j89114j21632k85007k79647l27056j0280r0476k22324
18226A1060122j78509l69428k30064k41272j43418k55708j97382k36982l91003
18217H816356k06647k43566j55031j2816K2116p3822j05730J30579o0240l105
18207H108094J91329J2337p0248R0766q9505n5460p2556p9409J45775Q9750j59144
18196H111729Q0087J03415q4804l1703o9806o3483l2772j49600j54126j35041
18186G573896p1300j70175N9219J05826J26779N4362j16410k16758r8888j13499
18176G133052J77151l6143J55004J49250j61188j01438j38653n2036j04230l0884
18166F989885q7279Q2710K15744J7416k613K9910O1778M4688P939J60293J41514
$$ plain form
18155 7661985 7729129 7839268 7894017 7874449 8177746 8299370 8432180 8706172 9161018 9521201
18145 9521201 10018369 10567455 11019441 11488973 12022403 12680763 13404579 14131675 14834180
18136 14834180 15706339 16604674 17850411 19391471 21377486 23705400 26587122 30040855
18128 30040855 34104279 38616075 43533975 48524338 53724858 59399868 64508109 68574578
18120 68574578 71250853 72530027 72891243 73206142 73313847 73102901 72313744 70873760 68542823
18111 68542823 66072363 64335912 63425575 63581874 64656506 66575736 68789172 70834237
18103 70834237 72256978 72440903 71543981 70140136 68510461 67028865 65112687 62204744
18095 62204744 58146796 53306617 48229085 43636900 39791875 36695732 34272368 32452732
$$ packed form
18155G661985O7144J10139N4749j9568L03297J21624J32810K73992M54846L60183
18145I521201M97168N49086M51986M69532N33430O58360P23816P27096P02505
18136A4834180Q72159Q98335J245737J541060J986015K327914K881722L453733
18128C0040855M063424M511796M917900M990363N200520N675010N108241M066469
18120F8574578K676275J279174L61216L14899J07705k10946p89157j439984k330937
18111F8542823k470460j736451r10337J56299J074632J919230K213436K045065
18103G0834237J422741J83925q96922j403845j629675j481596j916178k907943
18095F2204744m057948m840179n077532m592185l845025l096143k423364j819636
$$ plain form
18087 32452732 31268492 30507924 29774148 29713984 29947511 30405144 31225664 32488020 34149631
18078 34149631 36210302 39046080 42717590 46707672 51327346 56672862 62658138 69432882
18070 69432882 76576484 83376963 89564099 94892011 99736123 104437311 109223180 113098392
18062 113098392 115503276 116097140 115244221 113616358 112504660 112184660 111910999 111541854 110555004
18053 110555004 109221226 108167282 107251533 106996859 106793410 106554707 107079579 107818669 107691068
18044 107691068 106128857 102864113 98244689 93020903 87803412 82961579 77865694 72300432
18036 72300432 66143786 59723921 53751724 48439984 43970432 40260367 37223676 34892963
18028 34892963 33149282 31746164 30675628 29965400 29483375 29420514 29685420 30186285 31326693
$$ packed form
18087C2452732j184240p60568p33776o0164K33527M57633Q20520J262356J661611
18078C4149631K060671K835778L671510L990082M619674N345516N985276O774744
18070F9432882P143602O800479O187136N327912M844112M701188M785869L875212
18062A13098392K404884N93864q52919j627863j111698l20000k73661l69145r86850
18053A10555004j333778j053944r15749k54674k03449k38703N24872P39090j27601
18044A07691068j562211l264744m619424n223786n217491m841833n095885n565262
18036G2300432o156646o419865n972197n311740m469552l710065l036691k330713
18028C4892963j743681j403118j070536p10228m82025o2861K64906N00865J140408
$$ plain form
18019 31326693 32933880 34957723 37472176 40391495 43492003 46842464 50434090 54029311
18011 54029311 56968097 58950696 59747691 59687982 59430300 59129859 58911721 58061193 56427134
18002 56427134 54452762 52147579 50422136 49638566 49465580 49666146 50363938 51642762 53092937
17993 53092937 54293169 54742919 54245050 53021704 51657601 50062607 48489323 46482626
17985 46482626 43731999 40339215 36402050 32543965 29054982 26098210 23603380 21526912
17977 21526912 19859596 18451053 17373780 16550796 15794026 15172873 14528359 13905072 13465199
17968 13465199 12879067 12287852 12071924 11860707 11822309 11691845 11488553 11264684 11030557
17959 11030557 10726638 10382674 10112405 9955742 9884631 9653462 9566195 9451811 9146752 8828118
$$ packed form
18019C1326693J607187K023843K514453K919319L100508L350461L591626L595221
18011E4029311K938786J982599P96995n9709k57682l00441k18138q50528j634059
18002E6427134j974372k305183j725443p83570j72986K00566O97792J278824J450175
17993E3092937J200232M49750m97869j223346j364103j594994j573284k006697
17985D6482626k750627l392784l937165l858085l488983k956772k494830k076468
17977B1526912j667316j408543j077273q22984p56770o21153o44514o23287m39873
17968A3465199n86132n91215k15928k11217l8398j30464k03292k23869k34127
17959A1030557l03919l43964k70269j56663p1111k31169q7267j14384l05059l18634
$$ plain form
17949 8828118 8658626 8455033 8240712 8215870 8154097 7931422 7727424 7497922 7330987 7245589
17939 7245589 7164748 7024143 6975832 7119552 7200446 7097359 6757668 6443962 6242159 6041282
17929 6041282 5949853 5824084 5762839 5613155 5471207 5136687 5002061 4968488 4871432 4968042
17919 4968042 5012105 5012847 4849301 4721093 4655107 4639706 4678813 4682810 4729438 4778249 4628485
17908 4628485 4588768 4566458 4517505 4469614 4547343 4700836 4815821 4994295 4987479 4992439 5077422
17897 5077422 5111378 5097626 4917746 4875768 5020425 5037294 5051494 4949912 4700713 4600821
17887 4600821 4627797 4545275 4408906 4293642 4473010 4517354 4376237 4142004 4146209 4151392 4010068
17876 4010068 3902341 3882079 3747587 3612469 3422916 3309437 3129810 3063058 3053416 3049851
$$ packed form
17949H828118j69492k03593k14321k4842o1773k22675k03998k29502j66935q5398
17939G245589q0841j40605m8311J43720Q0894j03087l39691l13706k01803k00877
17929F041282r1429j25769o1245j49684j41948l34520j34626l3573r7056R6610
17919D968042M4063P42j63546j28208o5986j5401L9107L997M6628M8811j49764
17908D628485l9717k2310m8953m7891P7729J53493J14985J78474o816M960Q4983
17897E077422L3956j3752j79880m1978J44657J6869J4200j01582k49199r9892
17887D600821K6976q2522j36369j15264J79368M4344j41117k34233M205N183j41324
17876D010068j07727k0262j34492j35118j89553j13479j79627o6752r642l565
$$ plain form
17866 3049851 2960322 2767432 2613911 2643266 2607354 2634045 2391843 2360648 2180944 2232422
17856 2232422 2271598 2275778 2178223 2276679 2379876 2425102 2516171 2613034 2766711 2767638 2660367
17845 2660367 2602062 2560169 2564763 2607653 2646927 2836091 2805741 2700214 2683501 2764401 2752501
17834 2752501 2627505 2571334 2623493 2664523 2485427 2272534 2184951 2110527 2050039 1922564
17824 1922564 1902910 1882719 1878506 1912614 1726753 1550631 1444324 1426870 1388675 1311104 1396520
17813 1396520 1501046 1573411 1542803 1503551 1426575 1307057 1287665 1270202 1284794 1186997 1097239
17802 1097239 1148283 1379691 1424626 1362534 1430177 1608490 1707942 1479189 1490653 1499375 1458760
17791 1458760 1426811 1394066 1305284 1137088 1298419 1445613 1426212 1572882 1668462 1538308
$$ packed form
17866C049851q9529j92890j53521K9355l5912K6691k42202l1195j79704N1478
17856B232422L9176M180r7555R8456J03197M5226R1069R6863J53677R27j07271
17845B660367n8305m1893M594M2890L9274J89164l0350j05527j6713Q0900j1900
17834B752501j24996n6171N2159M1030j79096k12893q7583p4424o0488j27475
17824A922564j9654k0191m213L4108j85861j76122j06307j7454l8195p7571Q5416
17813A396520J04526P2365l0608l9252p6976j19518j9392j7463J4592r7797q9758
17802A097239N1044K31408M4935o2092O7643J78313R9452k28753J1464Q722m0615
17791A458760l1949l2745q8782j68196J61331J47194j9401J46670R5580j30154
$$ plain form
17781 1538308 1565198 1550888 1474496 1358745 1282813 1158590 954575 950188 1117979 1138682 1013627
17770 1013627 762658 633881 480782 450586 634621 799318 793253 711494 630019 700692
17760 700692 763350 712365 727769 644119 620662 706592 763536 845272 937409 1048706 1100894
17749 1100894 941985 735371 804832 934474 833241 917774 894804 879474 820464 834541
17739 834541 989837 935453 660714 501647 626124 563186 561945 812320 789629 709894 697479
17728 697479 651031 517002 570486 608287 625573 578689 490257 609843 687592 764299 584328
17717 584328 503617 615854 745933 664264 618663 458474 460511 406695 334297 357921 442565
17706 442565 610458 579792 487471 461972 473548 479500 583547 594604 455852 425626 607285
$$ packed form
17781A538308K6890j4310p6392j15751p5932j24223k04015m387J67791K0703j25055
17770A013627k50969j28777j53099l0196J84035J64697o065q1759q1475P0673
17760G00692O2658n0985J5404q3650k3457Q5930N6944Q1736R2137J11297N2188
17749A100894j58909k06614O9461J29642j01233Q4533k2970j5330n9010J4077
17739H34541J55296n4384k74739j59067J24477o2938j241K50375k2691p9735j2415
17728F97479m6448j34029N3484L7801J7286m6884q8432J19586P7749P6707j79971
17717E84328q0711J12237J30079q1669m5601j60189K037n3816p2398K3624Q4644
17706D42565J67893l0666r2321k5499J1576N952J04047J1057j38752l0226J81659
$$ plain form
17695 607285 588829 543431 558003 608244 626974 626686 514583 394426 430043 583512 650813
17684 650813 697417 583278 673762 518055 578192 740944 836234 820380 789743 778982 715788
17673 715788 733363 599957 565881 697465 739647 695732 788733 909979 959323 837443 740612
17662 740612 685037 719238 709559 643894 673420 708070 617695 676323 798054 799188 764711 702388
17650 702388 886033 1045790 1020996 1062611 877649 884594 879771 757775 675467 564141 686066
17639 686066 707119 709597 766638 915090 1009186 862674 815909 715289 606087 574315 591567
17628 591567 493185 430980 427173 427704 518796 745697 873836 889333 807479 674012 736573
17617 736573 983622 1005504 1061551 1120636 1014396 936170 759167 768606 988463 985727 940882
$$ packed form
17695F07285j8456m5398J4572N0241J8730k88j12103j20157L5617J53469O7301
17684F50813M6604j14139R0484j55707O0137J62752R5290j5854l0637j0761o3194
17673G15788J7575j33406l4076J31584M2182m3915R3001J21246M9344j21880r6831
17662G40612n5575L4201r679o5665K9526L4650r0375N8628J21731J134l4477o2323
17650G02388J83645J59757k4794M1615j84962O945m823j21996q2308j11326J21925
17639F86066K1053K478N7041J48452R4096j46512m6765j00620j09202l1772J7252
17628E91567r8382o2205l807N31R1092K26901J28139J5497q1854j33467O2561
17617G36573K47049K1882N6047N9085j06240p8226j77003R439K19857k736m4845
$$ plain form
17606 940882 943528 1159577 1236617 1062812 912874 813799 939275 1078712 1293897 1436605
17596 1436605 1422387 1126058 1038602 990046 973655 1070080 1206428 1135379 1106501 975081 980621
17585 980621 1004632 990880 918610 1050758 1120446 1252679 1216910 1055020 980536 973388 867851
17574 867851 797903 766559 934222 1077911 1091777 1043706 1071777 910201 940369 1010097 1096670
17563 1096670 1069536 909613 848640 954984 1096265 1188764 1093122 1000909 1009411 918407 899968
17552 899968 1047696 1265659 1337649 1288254 1271342 1353513 1361727 1309340 1272182 1102427 1130931
17541 1130931 1243382 1267273 1306415 1246506 1369156 1528888 1511959 1368227 1236032 1306446
17531 1306446 1280494 1239426 1044250 1101056 1062549 1004776 1099441 1140499 1130291 982773 844120
$$ packed form
17606I40882K646K16049P7040j73805j49938r9075J25476J39437K15185J42708
17596A436605j4218k96329q7456m8556j6391R6425J36348p1049k8878j31420N540
17585I80621K4011j3752p2270J32148O9688J32233l5769j61890p4484p148j05537
17574H67851o9948l1344J67663J43689J3866m8071K8071j61576L0168O9728Q6573
17563A096670k7134j59923o0973J06344J41281R2499r5642r2213Q502r1004j8439
17552H99968J47728K17963P1990m9395j6912Q2171Q214n2387l7158j69755K8504
17541A130931J12451K3891L9142n9909J22650J59732j6929j43732j32195P0414
17531A306446k5952m1068j95176N6806l8507n7773R4665M1058j0208j47518j38653
$$ plain form
17520 844120 785263 935225 952611 958344 904231 876361 900281 1015901 911438 704455 519008
17509 519008 562754 595626 473377 399202 541615 788313 730003 716766 857126 924064 1028865
17498 1028865 1242382 1144761 1059459 931628 871145 777438 593781 610921 743570 871505
17488 871505 863998 792418 791372 762146 738303 660721 536913 498345 680257 776207 944011
17477 944011 1025529 1147883 1034884 954433 710039 517209 454707 542488 569374 574641 625191
17466 625191 710921 678094 652289 564100 381806 317080 476021 650557 615877 480964 482115
17455 482115 473793 517426 486246 485618 522927 362126 261982 292771 332350 274481 159463
17444 159463 292973 269609 180914 228339 372401 450309 512661 521810 565226 485004 533567
$$ packed form
17520H44120n8857J49962J7386N733n4113k7870K3920J15620j04463k06983j85447
17509E19008M3746L2872j22249p4175J42413K46698n8310j3237J40360O6938J04801
17498A028865K13517r7621q5302j27831o0483r3707j83657J7140J32649J27935
17488H71505p507p1580j046k9226k3843p7582j23808l8568J81912R5950J67804
17477I44011Q1518J22354j12999q0451k44394j92830o2502Q7781K6886N267N0550
17466F25191Q5730l2827k5805q8189j82294o4726J58941J74536l4680j34913J151
17455D82115q322M3633l1180o28L7309j60801j00144L0789L9579n7869j15018
17444A59463J33510k3364q8695M7425J44062P7908O2352R149M3416q0222M8563
$$ plain form
17433 533567 511881 333011 289161 386634 430153 582888 605316 438146 398089 192884 151668
17422 151668 167798 295643 297082 332264 280623 353855 268501 345208 413769 387036 362927
17411 362927 373826 516418 533937 611205 547089 448059 516562 491749 259442 94363 136506
17400 136506 127319 164304 196902 212950 352460 298602 302044 287852 125794 235548 391141
17389 391141 281877 185639 197659 163943 17811 249412 173602 202087 287822 251693 211772
17378 211772 150753 189695 285506 431442 431961 249607 191027 297944 266573 391224 459577
17367 459577 442882 563670 667867 729273 523529 338052 431248 593704 548245 347221
17357 347221 226682 76577 86213 75589 -49060 -44974 -21428 -34188 136802 390777 330941
$$ packed form
17433E33567k1686j78870m3850R7473M3519J52735K2428j67170m0057k05205m1216
17422A51668J6130J27845J439L5182n1641P3232q5354P6707O8561k6733k4109
17411C62927J0899J42592J7519P7268o4116r9030O8503k4813k32307j65079M2143
17400A36506r187L6985L2598J6048J39510n3858L442j4192j62058J09754J55593
17389C91141j09264r6238J2020l3716j46132K31601p5810K8485Q5735l6129l9921
17378B11772o1019L8942R5811J45936N19j82354n8580J06917l1371J24651O8353
17367D59577j6695J20788J04197O1406k05744j85477R3196J62456m5459k01024
17357C47221j20539j50105R636j0624j24649M086K3546j2760J70990K53975n9836
$$ plain form
17346 330941 209551 194680 132499 203852 227146 417600 509190 364470 144740 139551 298901
17335 298901 342520 259714 243620 98474 38992 184223 182774 240724 28610 101133 59986
17324 59986 58545 76865 50237 82497 12503 2859 -1121 174796 175392 268730 361966 383334
17312 383334 349529 240209 245371 230961 342592 252646 310204 259840 94139 -34960 -120568
17301 -120568 -79659 -16587 114877 145556 164745 247143 153088 249701 225257 246766 449888
17290 449888 650010 610755 586885 496404 184506 224824 459365 579940 481591 476739 383826
17279 383826 207750 57721 143238 204235 76845 -28950 -94844 -33047 262829 384061
17269 384061 100844 32713 139620 129875 134511 153703 159755 162051 212408 260250 322737 328390
$$ packed form
17346C30941j21390j4871o2181P1353K3294J90454R1590j44720k19730n189J59350
17335B98901M3619q2806j6094j45146n9482J45231j449N7950k12114P2523m1147
17324E9986j441J8320k6628L2260o9994r644l980J75917N96R3338R3236K1368
17312C83334l3805j09320N162j4410J11631q9946N7558n0364j65701j29099q5608
17301a20568M0909O3072J31464L0679J9189Q2398r4055R6613k4444K1509K03122
17290D49888K00122l9255k3870r0481l11898M0318K34541J20575r8349m852r2913
17279C83826j76076j50029Q5517O0997j27390j05795o5894O1797K95876J21232
17269C84061k83217o8131J06907r745M636J9192O052K296N0357M7842O2487N653
$$ plain form
17257 328390 304693 43575 10570 45965 98384 208287 391931 352102 409844 275997 89772
17246 89772 33736 75635 116378 52676 213762 346837 531110 595264 431973 295977 212734
17235 212734 214299 84700 211849 315797 241595 145348 160537 169860 143548 207263 214884
17224 214884 121008 65032 232885 150265 -41267 -41201 36031 129336 64990 160287 84951 -58648
17212 -58648 -106656 -175198 -95678 -12260 198464 277098 270662 193950 54021 -32855 -34817 -105837
17200 -105837 -176058 -222418 -92452 -23326 6239 -53052 -57231 -14518 161941 186843 167571
17189 167571 166378 218270 384126 451278 355026 339882 219224 40510 22253 -38000 -31605
17178 -31605 12945 143095 397078 395526 396392 333260 36683 129502 328486 231928 241825 157450
$$ packed form
17257C28390k3697k61118l3005L5395N2419J09903J83644l9829N7742j33847j86225
17246H9772n6036M1899M0743o3702J61086J33075J84273O4154j63291j35996q3243
17235B12734J565j29599J27149J03948p4202r6247J5189R323k6312O3715P621
17224B14884r3876n5976J67853q2620j91532O6P7232R3305o4346R5297p5336j43599
17212e8648m8008o8542P9520Q3418K10724P8634o436p6712j39929q6876j962p1020
17200a05837p0221m6360J29966O9126K9565n9291m179M2713J76459K4902j9272
17189A67571j193N1892J65856O7152r6252j5144j20658j78714j8257o0253O395
17178c1605M4550J30150K53983j552Q66o3132k96577R2819J98984r6558R897q4375
$$ plain form
17166 157450 110759 161525 236351 425733 520513 551252 354881 184879 114016 198512 154933
17155 154933 70173 97233 10550 -2460 28114 -47072 20804 65332 83163 59450 -96782
17144 -96782 -156739 -186699 -86083 -30949 96504 75653 62152 138875 53524 31758 284069
17133 284069 307113 208405 236506 288019 504607 375455 285844 229993 150644 450952 430138
17122 430138 63461 29164 213615 442318 553256 389991 380259 356538 202869 210839 206831
17111 206831 102590 223848 252717 189854 213998 137059 42397 -60232 71762 155266 174044
17100 174044 148979 177360 192988 374077 303537 280776 239152 223115 219362 334585 485361
17089 485361 468144 381675 460539 373821 391560 503848 642531 720765 739772 765667 613350
$$ packed form
17166A57450m6691N0766P4826J89382R4780L0739j96371j70002p0863Q4496m3579
17155A54933q4760K7060q6683j3010L0574p5186O7876M4528J7831k3713j56232
17144i6782n9957k9960J00616N5134J27453k0851j3501P6723q5351k1766K52311
17133B84069K3044r8708K8101N1513K16588j29152q9611n5851p9349L00308k0814
17122D30138l66677l4297J84451K28703J10938j63265r732k3721j53669P970m008
17111B06831j04241J21258K8869o2863K4144p6939r4662j02629J31994Q3504J8778
17100A74044k5065K8381J5628J81089p0540k2761m1624j6037l753J15223J50776
17089D85361j7217q6469P8864q6718J7739J12288J38683P8234J9007K5895j52317
$$ plain form
17078 613350 691979 815822 625368 478319 397088 262774 363331 369888 379059 476671 567699
17067 567699 646729 671540 665646 622370 668261 845082 769759 740191 795809 873515 736613
17056 736613 688617 769714 772644 877816 830616 753390 1001672 1053579 1031193 988737 982678
17045 982678 1086513 1054880 899520 822774 957871 1189150 1287221 1315166 1176698 1199916
17035 1199916 1253905 1246244 1195772 1486108 1492539 1418402 1318436 1224909 1252900 1564452 1676680
17024 1676680 1492288 1550051 1693293 1622153 1519418 1570878 1469315 1561165 1632982 1533957
17014 1533957 1467323 1416746 1407777 1452454 1375770 1324595 1429399 1508157 1407890 1375392 1674413
17003 1674413 1879885 1764042 1649500 1470902 1451592 1602286 1676507 1670628 1531297 1561304
$$ packed form
17078F13350P8629J23843j90454j47049q1231j34314J00557O557R171R7612R1028
17067E67699P9030K4811n894m3276M5891J76821p5323k9568N5618P7706j36902
17056G36613m7996Q1097K930J05172m7200p7226K48282N1907k2386m2456o059
17045I82678J03835l1633j55360p6746J35097K31279R8071K7945j38468K3218
17035A199916N3989p661n0472K90336O431p4137r9966r3527K7991L11552J12228
17024A676680j84392N7763J43242p1140j02735N1460j01563R1850P1817r9025
17014A533957o6634n0577q969M4677p6684n1175J04804P8758j00267l2498K99021
17003A674413K05472j15843j14542j78598j9310J50694P4221n879j39331L0007
$$ plain form
16993 1561304 1503133 1506188 1362880 1186806 1216882 1137319 1150449 1151081 1142411 1043089 1114798 1142286
16981 1142286 1085135 1075735 969406 837305 945898 950739 1017909 1029132 1042982 929921 883838
16970 883838 840746 852422 901983 895160 884543 855203 656379 636602 778426 837661 803663
16959 803663 788612 904316 889395 829007 828359 698188 573175 527104 686295 824800 585266
16948 585266 263669 307671 382559 324887 348693 438352 485847 444971 347929 260717 259875 239123
16936 239123 254656 375366 309488 283590 402871 527016 410018 504225 570895 411296
16926 411296 283350 309551 375952 490958 386610 524144 564116 563636 499124 321468 78668
16915 78668 -78070 70747 230811 209731 88580 -124762 -128209 28338 21873 -32532 -28566
$$ packed form
16993A561304n8171L055j43308j76074L0076p9563J3130O32q670r9322P1709K7488
16981A142286n7151r400j06329j32101J08593M841O7170J1223J3850j13061m6083
16970H83838m3092J1676M9561o823j0617k9340j98824j9777J41824N9235l3998
16959H03663j5051J15704j4921o0388o48j30171j25013m6071J59191J38505k39534
16948E85266l21597M4002P4888n7672K3806Q9659M7495m0876r7042q7212q42k0752
16936B39123J5533J20710o5878k5898J19281J24145j16998R4207O6670j59599
16926D11296j27946K6201O6401J15006j04348J37534L9972m80o4512j77656k42800
16915G8668j56738J48817J60064k1080j21151k13342l447J56547o465n4405L966
$$ plain form
16904 -28566 14448 135662 174178 207822 160888 256058 305191 352202 294936 338376 136544
16893 136544 -60732 -22945 16238 -9542 -89287 8878 58876 56078 36601 145185 111137
16882 111137 106130 152736 272735 74243 -90525 -98130 -117230 -12860 123387 186228 259519
16871 259519 308131 268901 133381 122912 155351 261289 122505 -86937 82162 180501
16861 180501 198544 92794 40437 165836 177537 176843 87553 44676 55743 238604 346249
16850 346249 314069 210608 150160 94124 89412 -22963 -105118 32155 182818 170095 249155
16839 249155 188491 199167 188983 182954 117771 244016 361837 337557 118751 -14770 -52383
16828 -52383 -117272 -41696 -153750 -180736 68885 56444 -3661 -170361 -176205 -76332 -149847
$$ packed form
16904b8566M3014J21214L8516L3644m6934R5170M9133M7011n7266M3440k01832
16893A36544j97276L7787L9183k5780p9745R8165M9998k798j9477J08584l4048
16882A11137n007M6606J19999j98492j64768p605j9100J04370J36247O2841P3291
16871B59519M8612l9230j35520j0469L2439J05938j38784k09442J69099R8339
16861A80501J8043j05750n2357J25399J1701o94q9290m2877J1067J82861J07645
16850C46249l2180j03461o0448n6036m712j12375q2155J37273J50663j2723P9060
16839B49155o0664J0676j0184o029o5183J26245J17821k4280k18806j33521l7613
16828e2383o4889P5576j12054k6986K49621j2441o0105j66700n844R9873p3515
$$ plain form
16817 -149847 -268420 -267599 -150124 -183515 -40659 -102074 -109673 -46847 3598 -110897 72116
16806 72116 156077 74424 72330 141258 48078 199444 349809 367993 274727 202889 80278
16795 80278 -8745 -40822 -5920 150172 138916 72219 -9082 111778 102508 -23292 59781
16784 59781 213372 43213 -115382 -39558 74074 166452 -22873 -86119 15833 37012
16774 37012 126824 43502 -120670 -112873 -155081 83776 158926 -24256 -111254 -115754 -12008
16763 -12008 -139747 -87974 -8856 -61557 -74813 -151118 -202776 -143095 27612 87827 34467
16752 34467 -18071 -31582 85346 -82416 84719 263085 245097 196029 215394 181165 190721
16741 190721 147631 265845 242776 133217 126426 42622 -113342 11464 119615 91308 142271
$$ packed form
16817a49847j18573Q21J17475l3391J42856o1415p599O2826N0445j14495J83013
16806G2116Q3961q1653k094O8928r3180J51366J50365J8184r3266p1838j22611
16795H0278q9023l2077L4902J56092j1256o6697q1301J20860r270j25800Q3073
16784E9781J53591j70159j58595P5824J13632R2378j89325o3246J01952K1179
16774C7012Q9812q3322j64172P797m2208K38857P5150j83182q6998m500J03746
16763a2008j27739N1773P9118n2701j3256p6305n1658N9681J70707O0215n3360
16752C4467n2538j3511J16928j67762J67135J78366j7988m9068J9365l4229R556
16741A90721m3090J18214k3069j09559o791q3804j55964J24806J08151k8307N0963
$$ plain form
16730 142271 57641 76225 106723 11789 -12743 135257 110397 -52965 -156468 -38337 -50770
16719 -50770 5825 134013 204646 78879 -33726 -28198 48058 126451 45647 32456 88369
16708 88369 61744 117945 150356 119145 131273 57976 23218 -105756 -214774 -199041 -99623
16697 -99623 10933 139278 198165 144407 39898 -59516 -9959 63354 95459 131893 146462
16686 146462 194414 200943 130453 185393 233923 203595 176068 233207 159919 101860 38021 -48528
16674 -48528 -122261 -28217 264609 343199 322928 254560 208656 305854 218164 185188 177159 98194
16662 98194 -21176 -48156 -33799 132061 231430 253285 279338 244776 199891 103564 91112
16651 91112 87490 146534 185023 258274 -36979 -57713 33640 99492 -1886 30971 187050
$$ packed form
16730A42271q4630J8584L0498r4934k4532J48000k4860j63362j03503J18131j2433
16719e0770N6595J28188P0633j25767j12605N528P6256P8393q0804j3191N5913
16708H8369k6625N6201L2411l1211J2128p3297l4758j28974j09018J5733R9418
16697i9623J10556J28345N8887n3758j04509r9414M9557P3313L2105L6434J4569
16686A46462M7952O529p0490N4940M8530l0328k7527N7139p3288n8059o3839q6549
16674d8528p3733R4044K92826P8590k0271o8368m5904R7198q7690l2976q029p8965
16662I8194j19370k6980J4357J65860R9369K1855K6053l4562m4885r6327j2452
16651I1112l622N9044L8489P3251k95253k0734R1353O5852j01378L2857J56079
$$ plain form
16640 187050 44229 69481 49869 -4824 83585 102469 9725 -24360 -24818 -55658 31175 121712
16628 121712 103611 153399 188261 252052 321474 386716 396675 265345 106968 -102697 10099
16617 10099 4560 -131571 -73705 -130518 -7972 40317 98885 153357 85756 167511 206130
16606 206130 122876 120289 245330 210882 96799 118786 208484 43084 -98126 -131683 -275056
16595 -275056 -265477 -255559 -291495 -323618 -412026 -348177 -156093 -38074 129017 193016 25685
16584 25685 -21064 37559 -60370 -74153 79639 138477 140655 242659 85515 -4223 128923
16573 128923 190178 40920 -28350 17699 6060 -53891 25085 59987 85124 140137 18754
16562 18754 54993 168125 204954 187332 150315 190649 116904 -29780 -105551 -75562 59839
$$ packed form
16640A87050j42821K5252j9612n4693Q8409J8884r2744l4085m58l0840Q6833R0537
16628A21712j8101M9788L4862O3791O9422O5242R959j31330j58377k09665J12796
16617A0099n539j36131N7866n6813J22546M8289N8568N4472o7601Q1755L8619
16606B06130q3254k587J25041l4448j14083K1987Q9698j65400j41210l3557j43373
16595b75056R579R918l5936l2123q8408O3849J92084J18019J67091O3999j67331
16584B5685m6749N8623r7929j3783J53792N8838K178J02004j57144q9738J33146
16573A28923O1255j49258o9270M6049j1639n9951P8976L4902K5137N5013j21383
16562A8754L6239J13132L6829j7622l7017M0334p3745j46684p5771K9989J35401
$$ plain form
16551 59839 60477 32481 16428 -30450 -117189 -108444 28356 179226 169464 73626 85995 48239
16539 48239 92130 339436 510183 196046 -10077 -7163 -58970 -53808 -34999 49872 23941
16528 23941 191695 150626 123336 106768 -30653 -2695 -125399 -193285 -214765 -129716 -198725
16517 -198725 -233000 -386943 -285150 -85940 2766 141504 111640 81743 69736 12963 -40528
16506 -40528 -121023 -39699 -30450 -7119 172384 173585 116138 -116225 -202225 -141467 -120174 -46322
16494 -46322 -105924 -213581 -123333 -163902 -94079 -6433 -22949 53929 -3637 -111454 -80427
16483 -80427 -1346 -131892 10166 211460 48757 -129871 -134882 109175 203681 227131 210147
16472 210147 93733 -47284 -141659 -109850 -160261 -259992 -302796 -280124 -219655 -223419 -303027
$$ packed form
16551E9839O38k7996j6053m6878q6739Q745J36800J50870r762r5838J2369l7756
16539D8239M3891K47306J70747l14137k06123K914n1807N162J8809Q4871k5931
16528B3941J67754m1069k7290j6568j37421K7958j22704o7886k1480Q5049o9009
16517a98725l4275j53943J01793J99210Q8706J38738k9864k9897j2007n6773n3491
16506d0528q0495Q1324R249K3331J79503J201n7447k32363q6000O0758K1293P3852
16494d6322n9602j07657R0248m0569O9823Q7646j6516P6878n7566j07817L1027
16483h0427P9081j30546J42058K01294j62703j78628n011K44057R4506K3450j6984
16472B10147j16414j41017r4375L1809n0411r9731m2804K2672O0469l764p9608
$$ plain form
16461 -303027 -316153 -196625 66512 15900 -12201 -136073 -177158 -209774 -178393 -76915 -77219
16450 -77219 67467 151002 -34481 -102383 164 40442 87291 113163 149799 220769 247340
16439 247340 150488 149859 95588 34714 -17491 -17869 -111924 -161337 -254692 -114133 -28506 -38674
16427 -38674 -123730 -99771 -188013 -293987 -238431 -167708 -139357 -148299 -32829 -19773 147885
16416 147885 264568 79833 69885 109302 93540 -78493 -232063 -180783 -225625 -102766 31660
16405 31660 -2924 -76916 -112428 -137051 26975 -7723 -96111 192801 165477 28396 -85294
16394 -85294 -175821 -104444 -112552 -166050 -277476 -304012 -163478 -50258 -41631 15623 61823
16383 61823 5270 -34813 -12441 -2222 -86975 -151352 -227239 -271987 -192604 -96857 118371
$$ packed form
16461c03027j3126J19528K63137n0612k8101j23872m1085l2616L1381J01478l04
16450g7219J44686Q3535j85483o7902J02547M0278M6849K5872L6636P0970K6571
16439B47340r6852o29n4271o0874n2205l78r4055m9413r3355J40559Q5627j0168
16427c8674q5056K3959q8242j05974N5556P0723K8351q942J15470J3056J67658
16416A47885J16683j84735r948L9417j5762j72033j53570N1280m4842J22859J34426
16405C1660l4584p3992l5512k4623J64026l4698q8388K88912k7324j37081j13690
16394h5294r0527P1377q108n3498j11426k6536J40534J13220Q627N7254M6200
16383F1823n6553m0083K2372J0219q4753o4377p5887m4748P9383R5747K15228
$$ plain form
16372 118371 295004 167375 143708 47031 -87533 -89310 77200 206878 128836 179129 247318
16361 247318 93460 -8293 61691 -115839 -295289 -257510 -315946 -185207 10414 117774
16351 117774 74566 16059 -40888 -140326 -86459 -66597 -94502 -153217 -158752 -104764 -84946 -248848
16339 -248848 -313032 -426697 -370981 -213258 -174007 -144823 21500 81081 3035 -40119 -6931
16328 -6931 110549 73840 -8618 -53954 102023 165795 240210 144204 45110 26956 -88896
16317 -88896 -166906 -149624 -92199 -50644 -17379 73088 120457 137204 62796 -51677 -38503
16306 -38503 -25815 53640 167225 194846 99608 -31893 -43058 86147 56707 9798 107035
16295 107035 169673 55943 -155172 -191315 -46773 -42815 -186871 -120023 -93063 -37069 -26211
$$ packed form
16372A18371J76633j27629k3667r6677j34564j777J66510J29678p8042N0293O8189
16361B47318j53858j01753O9984j77530j79450L7779n8436J30739J95621J07360
16351A17774m3208n8507n6947r9438N3867J9862k7905n8715n535N3988J9818j63902
16339b48848o4184j13665N5716J57723L9251K9184J66323N9581p8046m3154L3188
16328f931J17480l6709q2458m5336J55977O3772P4415r6006r9094j8154j15852
16317h8896p8010J7282N7425M1555L3265R0467M7369J6747p4408j14473J3174
16306c8503J2688P9455J13585K7621r5238j31501j1165J29205k9440m6909R7237
16295A07035O2638j13730k11115l6143J44542L958j44056O6848K6960N5994J0858
$$ plain form
16284 -26211 -64781 -43534 5516 -44386 -12660 -91888 -168859 -202317 -145958 -146682 -152969 -136849
16272 -136849 -71839 -105006 -201916 -97565 -56443 -73816 -57745 -50001 116017 194174 95886
16261 95886 29058 -53917 -121077 -250038 -208540 58853 130735 75721 -102952 -115305 -50960
16250 -50960 -983 -87493 -88450 -153723 -84966 -60307 -124713 -47640 143930 -19636 -187509
16239 -187509 -4865 85260 61045 -39398 -63918 -131500 -164141 -135769 -110623 -134635 -95623
16228 -95623 -91109 -85599 -4886 203431 297438 147511 -12532 87402 129484 -68566 -102118
16217 -102118 4743 29652 78032 75228 188895 155587 105605 -21094 5193 100571 -29015
16206 -29015 45374 43850 40084 30814 -10210 -50189 -131162 -317236 -266627 -190591 -244787 -238381
$$ packed form
16284b6211l8570K1247M9050m9902L1726p9228p6971l3458N6359p24o287J6120
16272a36849O5010l3167r6910J04351M1122j7373J6071P744J66018P8157r8288
16261I5886o6828q2975o7160j28961M1498K67393P1882n5014j78673j2353O4345
16250e0960M9977q6510r57o5273O8757K4659o4406P7073J91570j63566j67873
16239a87509J82644R0125k4215j00443k4520o7582l2641K8372K5146k4012L9012
16228i5623M514N510Q0713K08317R4007j49927j60043R9934M2082j98050l3552
16217a02118J06861K4909M8380k804J13667l3308m9982j26699K6287R5378j29586
16206b9015P4389j524l766r270m1024l9979q0973j86074N0609P6036n4196O406
$$ plain form
16194 -238381 -45868 13402 -137146 -122323 -83550 -139168 -104892 -94898 -132438 -27857 -87888
16183 -87888 -107021 -17696 -51939 -22963 18241 -21557 -57112 -100650 -126524 -131225 -34279 126492
16171 126492 -43901 -164675 -207908 -291544 -417516 -310224 -104348 -17894 -13289 -32385 -111244
16160 -111244 -98675 -194653 -108548 -8651 21738 30351 50181 95151 47227 -93795 -183314
16149 -183314 -194890 -106477 -111289 30665 136994 -55874 -97250 -82574 -33602 -64565 -11840
16138 -11840 -123048 -221221 -309017 -261928 -120721 -74159 -14747 -36869 141505 -23630 -161323
16127 -161323 -140586 -13791 68316 132492 147888 82034 81271 -4820 -177861 -173763 -108477 -110158
16115 -110158 -308170 -458902 -543591 -612005 -313590 -212795 -204498 -153215 -117010 -130524 -141125
$$ packed form
16194b38381J92513N9270j50548J4823L8773n5618L4276R994l7540J04581o0031
16183h7888j9133Q9325l4243K8976M1204l9798l5555m3538k5874m701R6946J60771
16171A26492j70393j20774m3233q3636j25972J07292K05876Q6454M605j9096p8859
16160a11244J2569r5978Q6105R9897L0389Q613J9830M4970m7924j41022q9519
16149a83314j1576Q8413m812J41954J06329j92868m1376J4676M8972l0963N2725
16138a1840j11208r8173q7796M7089J41207M6562N9412k2122J78374j65135j37693
16127a61323K0737J26795Q2107O4176J5396o5854p63q6091j73041M098O5286j681
16115a10158j98012j50732q4689o8414K98415J00795Q297N1283L6205j3514j0601
$$ plain form
16104 -141125 -63677 -895 -47309 -115423 -52197 -106397 -179134 -260164 -350605 -250396 -178778
16093 -178778 -263558 -325219 -279924 5585 250239 157782 10213 180089 166458 -101359
16083 -101359 -29544 130128 106229 46215 97736 -39131 -16259 139556 47254 -83148 -232249
16072 -232249 -285965 -239000 -118013 104454 296669 280115 309987 162130 86001 8743 29500
16061 29500 -33551 -80054 -37336 -189800 -215826 -216006 -148701 -92985 -55055 -104057 -243514 -255902
16049 -255902 -241350 -131000 -284598 -379758 -198094 139138 92078 -164262 -7667 13877
16039 13877 -107470 -22411 -14428 51723 186643 233323 134501 49620 -25741 20635 204786
16028 204786 50585 -11226 -45521 9627 -14469 -49476 -66382 -81637 -27563 -68646 -42492
$$ packed form
16104a41125P7448O2782m6414o8114O3226n4200p2737q1030r0441J00209P1618
16093a78778q4780o1661M5295K85509K44654r2457j47569J69876j3631k67817
16083a01359P1815J59672k3899o0014N1521j36867K2872J55815r2302j30402j49101
16072b32249n3716M6965J20987K22467J92215j6554K9872j47857p6129p7258K0757
16061B9500o3051m6503M2718j52464k6026j80O7305N5716L7930m9002j39457j2388
16049b55902J4552J10350j53598r5160J81664L37232m7060k56340J56595K1544
16039A3877j21347Q5059P983O6151J34920M6680r8822q4881p5361M6376J84151
16028B04786j54201o1811l4295N5148k4096l5007j6906j5255N4074m1083K6154
$$ plain form
16017 -42492 -18658 -56427 -152106 -161351 -154065 -235719 -348706 -284633 -192565 -168583 -82830 -127222
16005 -127222 9678 65810 136611 229889 222139 335084 421153 429716 289860 5848 -19270
15994 -19270 -92712 -101669 40163 -115388 -80883 -128359 -328508 -95792 145795 63649 59099
15983 59099 242732 263950 203511 63905 -133685 1894 123776 -86044 -184943 -14945
15973 -14945 180925 301391 259154 137371 143121 185789 242374 132905 9107 -139733 -114682
15962 -114682 -221189 -247332 -219953 -32997 -39508 -107819 -132558 -82484 -71565 -103607 -90177
15951 -90177 -3705 67425 -18774 -92526 -139598 -158027 -15129 -265149 -393050 -394651 -346286
15940 -346286 -318123 -241460 -125366 -23295 -31354 -186210 -123506 -3128 -2660 23257 56286
$$ packed form
16017d2492K3834l7769r5679r245P286q1654j12987O4073R2068K3982Q5753m4392
16005a27222J36900N6132P0801R3278p750J12945Q6069Q563j39856k84012k5118
15994a9270p3442q957J41832j55551L4505m7476k00149K32716K41587q2146m550
15983E9099J83633K1218o0439j39606j97590J35579J21882k09820r8899J69998
15973a4945J95870J20466m2237j21783N750M2668N6585j09469j23798j48840K5051
15962a14682j06507k6143K7379J86956o511o8311k4739N0074J0919l2042J3430
15951i0177Q6472P1130q6199p3752m7072j8429J42898k50020j27901j601M8365
15940c46286K8163P6663J16094J02071q059j54856O2704J20378M68K5917L3029
$$ plain form
15929 56286 -10542 44571 199579 152723 141461 132921 155253 -11931 -16607 -16115 -14388 99470
15917 99470 170547 62358 -90875 -111322 -34936 -98543 -37541 -35853 -25323 -7623 -135512
15906 -135512 -183181 43838 112963 155107 37087 146626 188611 162892 106141 116723 50889
15895 50889 -115963 -245965 -244398 -14369 13408 -52793 -11331 133669 166736 93109 -1170
15884 -1170 45976 -39450 -161410 -153131 -263676 -210928 -40339 59580 9150 -33209 -76621
15873 -76621 -19726 -27511 -205657 -146934 -21431 44457 19970 26302 -20934 -24167 94439 134206
15861 134206 -2017 -90994 -104640 -85898 75169 188440 169354 102434 147899 34566 -54810
15850 -54810 -100961 -172865 -98550 -168093 -170307 -43517 -4735 -29675 -90615 -33746 23343 162468
$$ packed form
15929E6286o6828N5113J55008m6856j1262q540K2332j67184m676M92J727J13858
15917I9470P1077j08189j53233k0447P6386o3607O1002J688J0530J7700j27889
15906a35512m7669K27019O9125M2144j18020J09539M1985k5719n6751J0582o5834
15895E0889j66852j30002J567K30029K7777o6201M1462J45000L3067p3627r4279
15884a170M7146q5426j21960Q279j10545N2748J70589R9919n0430m2359m3412
15873g6621N6895p785j78146N8723J25503O5888k4487O332m7236l233J18606L9767
15861A34206j36223q8977j3646J8742J61067J13271j9086o6920M5465j13333q9376
15850e4810m6151p1904P4315o9543k214J26790L8782k4940o0940N6869N7089J39125
$$ plain form
15838 162468 -30005 -109590 -89422 33230 3869 -125355 -107639 -169801 -132036 -205054 -169924
15827 -169924 -310933 -353532 -239808 -274433 -240996 -247114 -314828 -276076 -166866 -50488 -19748
15816 -19748 -52710 -99350 -38655 -45915 -65233 90728 275584 250683 272256 162083 -121197
15805 -121197 -251428 -297618 -340892 -278783 -84871 -106503 -177871 -118430 18388 225012 45325
15794 45325 -191724 -211967 -228219 -11682 -45720 -213885 -109852 43407 159555 -11983
15784 -11983 -87458 -97413 -146521 -97235 -46745 -94346 -181746 -81647 -30246 -181196 -333470
15773 -333470 -480318 -382230 -257766 -82488 -72036 -207945 -300543 -276990 -96107 55987
15763 55987 102421 96662 -94207 -160089 -74012 -124233 -142021 -173169 -334826 -415826 -151835
$$ packed form
15838A62468j92473p9585K0168J22652k9361j29224J7716o2162L7765p3018L5130
15827a69924j41009m2599J13724l4625L3437o118o7714L8752J09210J16378L0740
15816a9748l2962m6640O0695p260j9318J55961J84856k4901K1573j10173k83280
15805a21197j30231m6190m3274O2109J93912k1632p1368N9441J36818K06624j79687
15794D5325k37049k0243j6252K16537l4038j68165J04033J53259J16148j71538
15784a1983p5475r955m9108M9286N0490m7601q7400J00099N1401j50950j52274
15773c33470j46848R8088J24464J75278J0452j35909r2598K3553J80883J52094
15763E5987M6434n759j90869o5882Q6077n0221j7788l1148j61657q1000K63991
$$ plain form
15752 -151835 49880 106967 65010 28065 74060 127190 34073 73239 121194 139543 116059
15741 116059 100175 79728 97883 222082 35362 -67241 9491 -42211 -226101 -151470 -50769
15730 -50769 46541 83201 62875 -40850 -174254 -88232 2577 -80399 11946 61406 146396
15719 146396 83226 103843 192831 155426 -25768 -5885 29594 100925 25118 -79119 -34333
15708 -34333 112928 276434 468747 393757 30684 72330 20716 -139169 -281988 -196980
15698 -196980 -74327 88586 217447 296778 193385 158170 123398 -114447 -371842 -316980
15688 -316980 -299079 -446497 -527655 -465595 -417923 -152874 -120420 -49363 138549 147686 76596
15677 76596 128391 -15056 -63887 -20383 92392 102273 -44862 -83897 -36504 -157743 -114677
$$ packed form
15752a51835K01715N7087m1957l6945M5995N3130r3117L9166M7955J8349k3484
15741A16059j5884k0447J8155J24199j86720j02603P6732n1702j83890P4631J00701
15730e0769R7310L6660k0326j03725j33404Q6022R0809q2976R2345M9460Q4990
15719A46396o3170K0617Q8988l7405j81194J9883L5479P1331p5807j04237M4786
15708c4333J47261J63506J92313p4990l63073M1646n1614j59885j42819Q5008
15698a96980J22653J62913J28861P9331j03393l5215l4772k37845k57395N4862
15688c16980J7901j47418q1158O2060M7672K65049L2454P1057J87912R137p1090
15677G6596N1795j43447m8831M3504J12775R881j47135l9035M7393j21239M3066
$$ plain form
15666 -114677 82895 47054 38823 131035 39048 -4187 -103791 -200129 -167642 -108285 -173788
15655 -173788 -174492 -279115 -271744 -200008 -123220 -149306 -274969 -271663 -306289 -213462 -71204 -214842
15643 -214842 -282430 -269827 -194261 10710 48603 -80724 -150591 64540 213359 71306
15633 71306 -59289 -212040 -222188 -105121 16290 80089 121527 -68552 19838 49744 84518
15622 84518 -87166 -177651 -192734 -90027 30285 52450 26695 -130931 -26968 67386 121670
15611 121670 196081 64157 36879 143896 170874 9778 -131694 -131138 -119209 -134473 -29903
15600 -29903 -9975 -129139 -100259 25029 157257 297888 324207 291504 353173 286820 258381
15589 258381 204944 26724 -94851 -53225 -3456 83808 78116 -3406 -190407 -161489 -59174
$$ packed form
15666a14677J97572l5841q231R2212r1987m3235r9604r6338L2487N9357o5503
15655a73788p04j04623P371P1736P6788k6086j25663L306l4626R2827J42258j43638
15643b14842o7588J2603P5566K04971L7893j29327o9867K15131J48819j42053
15633G1306j30595j52751j0148J17067J21411O3799M1438j90079Q8390K9906L4774
15622H4518j71684r0485j5083J02707J20312K2165k5755j57626J03963R4354N4284
15611A21670P4411j31924k7278J07017K6978j61096j41472N56J1929j5264J04570
15600b9903J9928j19164K8880J25288J32228J40631K6319l2703O1669o6353k8439
15589B58381n3437j78220j21575M1626M9769Q7264n692q1522j87001K8918J02315
$$ plain form
15578 -59174 -124006 -235849 -128760 -56511 116417 69537 -100768 -111829 -84183 -43996 91550
15567 91550 39267 21079 161992 230978 177350 38965 -16729 166603 199378 164161 -12737
15556 -12737 -222116 -353977 -267647 -136531 -24367 41631 196024 139782 73464 221529
15546 221529 241944 142231 38897 76809 110541 211548 130361 -13350 53175 35919 -45155
15535 -45155 11848 -17299 89219 181806 102963 -28371 -1158 -52329 -138306 -302167 -395386
15524 -395386 -407733 -148906 -106378 -164792 -266939 -262918 -249707 -269783 -169870 -109940 -87830
15513 -87830 -124989 -80292 -13553 -68462 -213159 -284697 -79231 -108082 -59926 104607 39786
15502 39786 -41280 -60118 26159 16285 28646 -7981 -22839 -239870 -267824 -192056 -85141
$$ packed form
15578e9174o4832j11843J07089P2249J72928m6880j70305j1061K7646M0187J35546
15567I1550n2283j8188J40913O8986n3628j38385n5694J83332L2775l5217j76898
15556a2737k09379j31861Q6330J31116J12164O5998J54393n6242o6318J48065
15546B21529K0415r9713j03334L7912L3732J01007q1187j43711O6525j7256q1074
15535d5155N7003k9147J06518R2587p8843j31334K7213n1171q5977j63861r3219
15524c95386j2347K58827M2528n8414j02147M021J3211k0076R9913N9930K2110
15513h7830l7159M4697O6739n4909j44697p1538K05466k8851M8156J64533o4821
15502C9786q1066j8838Q6277r874J2361l6627j4858k17031k7954P5768J06915
$$ plain form
15491 -85141 -200080 -371275 -266634 56954 107332 16125 -174402 -242329 -182829 -272979 -317223
15480 -317223 -245161 -345516 -120365 -83085 -84375 107593 54393 44187 88969 170172 262228
15469 262228 184953 91361 -108954 -171974 -99304 -81458 -292434 -276440 -301663 -232774 -124437
15458 -124437 -77276 68432 34852 129414 241061 336876 239433 160177 260477 237326 -5234
15447 -5234 -32519 -76983 -138040 -169824 -97215 164017 63881 25926 82537 181438 70074
15436 70074 67539 96129 164887 23388 -146053 -2626 4746 1989 92566 148543 343741
15425 343741 264191 108964 67101 -31456 180099 78295 -41536 -18887 51953 73685 92060
15414 92060 89649 -71477 -99455 -91045 -47489 -94342 -40314 181195 201882 -31311 -120766
$$ packed form
15491h5141j14939j71195J04641L23588N0378r1207j90527o7927N9500r0150m4244
15480c17223P2062j00355K25151L7280j290J91968n3200j0206M4782Q1203R2056
15469B62228p7275r3592k00315o3020P2670J7846k10976J5994k5223O8889J08337
15458a24437M7161J45708l3580R4562J11647R5815r7443p9256J00300k3151k42560
15447e234k7285m4464o1057l1784P2609K61232j00136l7955N6611R8901j11364
15436G0074k535K8590O8758j41499j69441J43427P372k757R0577N5977J95198
15425C43741p9550j55227m1863r8557K11555j01804j19831K2649P0840K1732J8375
15414I2060k411j61126k7978Q410M3556m6853N4028K21509K0687k33193q9455
$$ plain form
15403 -120766 -241245 -370707 -483899 -313311 -19105 129286 171764 20677 -57088 19417
15393 19417 -72220 -153358 -23418 -120181 -169541 -178706 -94437 -99087 -25459 159135 166763 236012
15381 236012 229886 139401 26476 47656 226527 215718 29348 132642 282128 146942
15371 146942 -58117 -29729 -20556 -244664 -222563 -91226 -176884 -130673 -257037 -250338 -5658
15360 -5658 -2544 -80648 -157044 -134640 -68596 -109485 -109566 -24380 40036 84713 -46604 -72172
15348 -72172 48341 -46783 -210945 -307217 -304298 -248733 43193 145291 162859 37790 -111307
15337 -111307 -89201 55618 143847 279515 280991 188204 64199 42965 36898 22952 53826
15326 53826 109984 31821 -46497 -234981 -241516 -240819 -171617 -190196 4876 122919 267698
$$ packed form
15403a20766j20479j29462j13192J70588K94206J48391M2478j51087p7765P6505
15393A9417r1637q1138J29940r6763m9360r165Q4269m650P3628J84594P628O9249
15381B36012o126r0485j12925K1180J78871j0809j86370J03294J49486j35186
15371A46942k05059K8388R173k24108K2101J31337q5658M6211j26364O699K44680
15360e658L114p8104p6396K2404O6044m0889q1Q5186O4416M4677j31317k5568
15348g2172J20513r5124j64162r6272K919N5565K91926J02098J7568j25069j49097
15337a11307K2106J44819Q8229J35668J476r2787j24005k1234o067j3946L0874
15326E3826N6158p8163p8318j88484o535O97O9202j8579J95072J18043J44779
$$ plain form
15315 267698 339292 233769 76949 -111830 -69734 4593 124066 242066 264718 285232
15305 285232 356498 314969 136607 35132 -88447 -40139 -85163 -92980 -195520 -206159 -305565
15294 -305565 -197208 -125259 -68843 -178005 -236412 -269991 -272388 -125913 -132717 -111539 -199866
15283 -199866 -183692 -58213 -92611 -120774 -161749 -91161 7349 188381 72338 27336 12313
15272 12313 -160933 -100050 -4738 55873 177262 74683 -13235 -70873 -230992 -219502 -303194
15261 -303194 -191274 -70142 -80693 -87378 -129117 -84865 -109536 -64188 -15396 -604 -34227
15250 -34227 -74215 88231 238172 251368 161759 259417 87504 6457 -2404 15131 -141859
15239 -141859 -323495 -130098 34390 28625 -107273 -185376 -72759 5316 17936 -92843
$$ packed form
15315B67698P1594j05523j56820j88779M2096P4327J19473J18000K2652K0514
15305B85232P1266m1529j78362j01475j23579M8308m5024p817j02540j0639r9406
15294c05565J08357P1949N6416j09162n8407l3579k397J46475o804K1178q8327
15283a99866J6174J25479l4398k8163m0975P0588R8510J81032j16043m5002j5023
15272A2313j73246O0883R5312O0611J21389j02579q7918n7638j60119J1490q3692
15261c03194J11920J21132j0551o685m1739M4252k4671M5348M8792J4792l3623
15250c4227l9988J62446J49941J3196q9609R7658j71913q1047q861J7535j56990
15239a41859j81636J93397J64488n765j35898p8103J12617P8075J2620j10779
$$ plain form
15229 -92843 -164504 -45224 -79196 -225484 -339062 -407967 -403609 -274955 -125579 -121852 46656
15218 46656 88853 188004 122006 -78379 10187 -49249 -413893 -304919 -36092 161595 94322
15207 94322 11241 -179596 -119758 7797 -43377 -11720 -177775 -107213 26720 53574 116793
15196 116793 50654 56834 136549 106589 81889 57316 14405 -41260 -25969 -101879 -82713 112977
15184 112977 252034 175022 236220 21044 72145 36409 -109987 -144293 -209083 -137110 -56347
15173 -56347 21814 110744 116170 48832 -53933 -122636 -138677 -205480 -173481 -18376 -59499
15162 -59499 -74268 -100437 -366081 -596402 -555864 -534694 -372379 -226154 -119930 -174456 -43745
15151 -43745 29962 83960 43351 69322 80786 154040 205698 157137 36346 112659 119381 11009
$$ packed form
15229i2843p1661J19280l3972j46288j13578o8905M358J28654J49376L727J68508
15218D6656M2197R9151o5998k00385Q8566n9436l64644J08974K68827J97687o7273
15207I4322q3081j90837N9838J27555n1174L1657j66055P0562J33933K6854O3219
15196A16793o6139O180P9715k9960k4700k4573m2911n5665J5291p5910J9166J95690
15184A12977J39057p7012O1198k15176N1101l5736j46396l4306o4790P1973Q0763
15173e6347P8161Q8930N426o7338j02765o8703j6041o6803L1999J55105m1123
15162e9499j4769k6169k65644k30321M0538K1170J62315J46225J06224n4526J30711
15151d3745P3707N3998m0609K5971J1464P3254N1658m8561j20791P6313O722j08372
$$ plain form
15139 11009 12609 75749 109710 -3952 -49850 6646 18880 -60314 -12703 59725 -69890
15128 -69890 -85939 -54563 -170236 -157254 -141295 -135664 -117477 -75034 23990 247929 98912
15117 98912 5788 -34379 -46706 14703 79736 169692 41296 -25965 32589 71874 29357
15106 29357 142148 262584 69164 31342 105946 207726 159815 128915 167204 317644 103242
15095 103242 138584 273103 264794 152880 -45648 19190 -22537 -74664 -146442 -202413 -238767
15084 -238767 -217647 -88323 116786 96550 -50830 -298310 -344225 -111417 -60901 -41102
15074 -41102 -5895 3908 -98814 -8953 101115 32639 25605 -167990 -228497 -28290 -9549
15063 -9549 -245910 -324109 -209737 -130264 -186207 -159142 -60476 -45856 -57635 -114491 -266328
$$ packed form
15139A1009J600O3140L3961j13662m5898N6496J2234p9194M7611P2428j29615
15128f9890j6049L1376j15673J2982J5959N631J8187M2443R9024K23939j49017
15117I8912r3124m0167j2327O1409O5033Q9956j28396o7261N8554L9285m2517
15106B9357J12791J20436j93420l7822P4604J01780m7911l0900L8289J50440k14402
15095A03242L5342J34519q309j11914j98528O4838m1727n2127p1778n5971l6354
15084b38767K1120J29324K05109k0236j47380k47480m5915K32808N0516J9799
15074d1102L5207R803j02722Q9861J10068o8476p034j93595o0507K00207J8741
15063i549k36361p8199J14372P9473n5943K7065R8666J4620j1779n6856j51837
$$ plain form
15052 -266328 -365090 -197306 -232104 -262392 -312550 -257735 -299299 -304432 -149908 77295 -57125
15041 -57125 -215394 -185847 -349676 -362482 -267338 -150579 -165946 -212780 -262080 -372769 -360799
15030 -360799 -224458 -159725 -154300 -64611 -56532 -139891 -171258 -159122 -52711 -62907 -118573
15019 -118573 -92817 -74619 -217897 -249714 -376984 -372419 -352353 -449773 -378816 -106539 -140103
15008 -140103 -4722 111476 165197 241369 243432 104961 -19498 -200393 -344511 -304309
14998 -304309 -255029 -235075 -127178 -158143 -170292 -271042 -179801 -160672 -217810 -210066 -82838
14987 -82838 62206 127848 665 -68710 -6615 182573 129020 -57996 -44292 108040 56758
14976 56758 -228183 -312456 -235084 -26050 19465 -117440 -231857 -305384 -167248 -180213 -107887
$$ packed form
15052b66328r8762J67784l4798l0288n0158N4815m1564n133J54524K27203j34420
15041e7125j58269K9547j63829j2806R5144J16759j5367m6834m9300j10689J1970
15030c60799J36341O4733N425Q9689Q079q3359l1367J2136J06411j0196n5666
15019a18573K5756J8198j43278l1817j27270M565K0066r7420P0957K72277l3564
15008a40103J35381J16198N3721P6172K063j38471j24459j80895j44118M0202
14998c04309M9280J9954J07897l0965j2149j00750R1241J9129n7138P744J27228
14987h2838J45044O5642j27183o9375O2095J89188n3553j87016J3704J52332n1282
14976E6758k84941q4273P7372K09034M5515j36905j14417p3527J38136j2965P2326
$$ plain form
14965 -107887 -116979 -125505 -55868 -174119 -262743 -142849 -75195 3404 17377 -13031 2134
14954 2134 20623 -66577 -133891 -130880 -180942 -104622 -125768 -159875 -204487 -126669 -41625 -175611
14942 -175611 -12641 -26485 -163890 -180570 -144009 -96622 -138664 -313536 -495492 -382196
14932 -382196 -235575 18649 19578 -146533 -256506 -392947 -310172 -138113 6088 -53379
14922 -53379 -120940 73319 257783 53725 -144815 -127549 -147754 -60686 -124455 -105330 19126
14911 19126 40211 62151 212440 287118 162650 73729 -83194 -254142 -216433 -451648 -430184
14900 -430184 -305294 -351349 -319883 -237685 -261956 -269006 -212931 -204876 -123659 -160217 -205029 -103783
14888 -103783 43337 24396 -13780 -55873 -216583 -246765 -219599 -272077 -368934 -305554 -350266
$$ packed form
14965a07887r092q526O9637j18251q8624J19894O7654P8599J3973l0408J5165
14954B134J8489q7200o7314L011n0062P6320k1146l4107m4612P7818Q5044j33986
14942a75611J62970j3844j37405j6680L6561M7387m2042j74872j81956J13296
14932c82196J46621K54224R29j66111j09973j36441Q2775J72059J44201n9467
14922e3379o7561J94259J84464k04058j98540J7266k0205Q7068o3769J9125J24456
14911A9126K1085K1940J50289P4678j24468q8921j56923j70948L7709k35215K1464
14900d30184J24890m6055L1466Q2198k4271p050N6075Q055Q1217l6558m4812J01246
14888a03783J47120j8941l8176m2093j60710l0182K7166n2478r6857O3380m4712
$$ plain form
14877 -350266 -228469 -107767 -153910 -194087 -205761 -180108 -77760 -36883 28274 -138250 -269325
14866 -269325 -247738 -210327 -47693 -119334 -247311 -182053 -86269 -109837 -257755 -272554 -173704
14855 -173704 12297 230539 85046 -127718 -189465 -78584 180716 162642 162418 123092 252519
14844 252519 147938 96057 262954 314890 96374 -247107 -237366 -114416 -102741 -123784 -12186
14833 -12186 19164 -34193 -20345 70913 284486 245589 187026 91465 59660 29336 -13063
14822 -13063 42810 103546 148915 137566 -176390 -137536 22482 -188408 -212453 -49541 58257
14811 58257 83281 26048 -169167 -354414 -246446 -184522 -224893 -399936 -515943 -280841
14801 -280841 -160132 -248428 -265476 -65434 10384 -3254 -252181 -296991 -167864 9796
$$ packed form
14877c50266J21797J20702m6143m0177j1674K5653J02348M0877O5157j66524j31075
14866b69325K1587L7411J62634p1641j27977O5258R5784k3568j47918j4799R8850
14855a73704J86001K18242j45493k12764o1747J10881K59300j8074k24l9326J29427
14844B52519j04581n1881J66897N1936k18516l43481R741J22950J1675k1043J11598
14833a2186L1350n3357J3848R1258K13573l8897n8563r5561l1805l0324m2399
14822a3063N5873O0736M5369j1349l13956L8854J60018k10890k4045J62912J07798
14811E8257K5024n7233j95215j85247J07968O1924m0371j75043j16007K35102
14801b80841J20709q8296j7048K00042P5818j3638k48927m4810J29127J77660
$$ plain form
14791 9796 64532 -18972 6941 26999 101282 71231 -237172 -337046 -253347 -144808 -65425
14780 -65425 -60964 -9715 48536 -26912 -77331 -122011 -143106 -154031 -153709 -230291 -262039 -173758
14768 -173758 -90142 178275 223104 51863 -49442 -174192 -232855 -204362 -183781 -160188 -69161
14757 -69161 -33656 -115651 -172004 -248470 -137819 -69904 -245183 -379132 -307523 -362043 -218310
14746 -218310 -103001 -301350 -245229 -62000 144768 228874 206020 235392 98751 -6017
14736 -6017 29236 11298 -115474 -118096 -33445 15784 107 -160804 -223115 -155097 -104245 -126498
$$ packed form
14791I796N4736q3504K5913K0058P4283l0051l08403r9874Q3699J08539P9383
14780f5425M461N1249N8251p5448n0419m4680k1095j0925L22p6582l1748Q8281
14768a73758Q3616K68417M4829j71241j01305j24750n8663K8493K0581K3593R1027
14757f9161L5505q1995n6353p6466J10651O7915j75279j33949P1609n4520J43733
14746b18310J15309j98349N6121J83229K06768Q4106k2854K9372j36641j04768
14736f017L5253j7938j26772k622Q4651M9229j5677j60911o2311O8018N0852k2253
$$ [...]
##END NTUPLES=NMR SPECTRUM
##END=
