##TITLE=Analysis number 324759
Compound Code ac 35935
Book Reference b
Project Code adrs
Chemist Name frontier sci
##JCAMPDX= 6.0         $$ Bruker NMR JCAMP-DX V2.0
##DATA TYPE= NMR SPECTRUM
##DATA CLASS= NTUPLES
##ORIGIN= Bruker BioSpin GmbH
##OWNER= nmr
$$ XWIN-NMR		Version 3.5
$$ Thu Nov 30 11:23:15 2006 GMT Standard Time (UT+0h)  MAYBRIDGE\nmr@NMR_250MHZ
##.OBSERVE FREQUENCY= 250.131544655141
##.OBSERVE NUCLEUS= ^1H
##.ACQUISITION MODE= SIMULTANEOUS (DQD)
##.ACQUISITION SCHEME= undefined
##.AVERAGES= 16
##.DIGITISER RES= 18
##SPECTROMETER/DATA SYSTEM= dpx250
##.PULSE SEQUENCE= zg30
##.SOLVENT NAME= DMSO
##.SHIFT REFERENCE= (INTERNAL, DMSO, 0, 16.522)
##AUDIT TRAIL= $$ (NUMBER, WHEN, WHO, WHERE, WHAT)
$$ ##TITLE= Audit trail, XWIN-NMR		Version 3.5
$$ ##JCAMPDX= 5.01
$$ ##ORIGIN= Bruker BioSpin GmbH
$$ ##OWNER= nmr
$$ C:\u/data/dgb/nmr/ADRS/1530/pdata/1/auditp.txt
$$ ##AUDIT TRAIL=  $$ (NUMBER, WHEN, WHO, WHERE, WHAT)
(   1,<2006-11-30 11:22:43.35 +000>,<MAYBRIDGE\nmr>,<NMR_250MHZ>,
      <created by zg, POWCHK disabled, PULCHK disabled
       configuration hash MD5:
       49 4B E0 1D 92 C2 6B 37 9F E6 65 BC 52 41 86 1D
       data hash MD5: 64K
       2E 10 44 91 52 84 16 88 77 BC 9C 14 3B E1 DC 78>)
(   2,<2006-11-30 11:23:01.53 +000>,<MAYBRIDGE\nmr>,<NMR_250MHZ>,
      <Start of raw data processing
       ef LB = 0.3 FT_mod = 6 PKNL = 1 SI = 32K 
       data hash MD5: 32K
       28 A8 08 BE 29 20 57 9E 35 BB 73 91 EE 8F 42 93>)
(   3,<2006-11-30 11:23:03.63 +000>,<MAYBRIDGE\nmr>,<NMR_250MHZ>,
      <apk 
       data hash MD5: 32K
       4D 2F 47 6D 17 87 D3 2C 67 11 61 41 77 41 0F BB>)
(   4,<2006-11-30 11:23:04.50 +000>,<MAYBRIDGE\nmr>,<NMR_250MHZ>,
      <abs ABSG = 5 
       data hash MD5: 32K
       DA 18 20 13 77 8D 03 CA 03 BA 5C B4 A3 EA C2 A0>)
$$ ##END=
$$ 
$$ hash MD5
$$ D6 CE 36 92 11 9A 25 42 4D 45 4C 87 21 F5 BC 87
##$RELAX= 
##$RELAX= 
##$RELAX= 
##$RELAX= 
##$RELAX= 
##$RELAX= 
##$RELAX= 
$$ Bruker specific parameters
$$ --------------------------
##$DU= <C:\u>
##$EXPNO= 1530
##$NAME= <ADRS>
##$PROCNO= 1
##$TYPE= <nmr>
##$USER= <dgb>
##$AMP= (0..31)
100 100 100 100 100 100 100 100 100 100 100 100 100 100 100 100 100 100 
100 100 100 100 100 100 100 100 100 100 100 100 100 100 
##$AQSEQ= 0
##$AQ_mod= 3
##$AUNM= <au_zg>
##$AUTOPOS= <15 >
##$BF1= 250.13
##$BF2= 250.13
##$BF3= 250.13
##$BF4= 250.13
##$BF5= 500.13
##$BF6= 500.13
##$BF7= 500.13
##$BF8= 500.13
##$BYTORDA= 1
##$CFDGTYP= 0
##$CFRGTYP= 5
##$CHEMSTR= <none>
##$CNST= (0..31)
1 1 145 1 1 1 1 1 1 1 1 1 1 1 1 1 1 1 1 1 1 1 1 1 1 1 1 1 1 1 1 1 
##$CPDPRG= <>
##$CPDPRG1= <>
##$CPDPRG2= <>
##$CPDPRG3= <>
##$CPDPRG4= <mlev>
##$CPDPRG5= <mlev>
##$CPDPRG6= <mlev>
##$CPDPRG7= <mlev>
##$CPDPRG8= <mlev>
##$CPDPRGB= <>
##$CPDPRGT= <>
##$D= (0..31)
0 1 0 0 0 0 0 0 0 0.06 0 0 0 0 0 0 0.0002 0 0 0 0 0 0 0 0 0 0 0 0 0 0 
0 
##$DATE= 1164885761
##$DBL= (0..7)
120 120 120 120 120 120 120 120 
##$DBP= (0..7)
150 150 150 150 150 150 150 150 
##$DBP07= 0
##$DBPNAM0= <>
##$DBPNAM1= <>
$$ [...]
##$SUBNAM7= <"">
##$SUBNAM8= <"">
##$SUBNAM9= <"">
##$SW= 20.6930455092707
##$SWIBOX= (0..15)
0 0 3 0 0 0 0 0 0 0 0 0 0 0 0 0 
##$SW_h= 5175.983436853
##$TD= 65536
##$TD0= 1
##$TE= 295.16
##$TE2= 300
##$TE3= 300
##$TEG= 300
##$TL= (0..7)
0 120 120 120 120 120 120 120 
##$TP= (0..7)
150 150 150 150 150 150 150 150 
##$TP07= 0
##$TPNAME0= <>
##$TPNAME1= <>
##$TPNAME2= <>
##$TPNAME3= <>
##$TPNAME4= <>
##$TPNAME5= <>
##$TPNAME6= <>
##$TPNAME7= <>
##$TPOAL= (0..7)
0.5 0.5 0.5 0.5 0.5 0.5 0.5 0.5 
##$TPOFFS= (0..7)
0 0 0 0 0 0 0 0 
##$TUNHIN= 0
##$TUNHOUT= 0
##$TUNXOUT= 0
##$USERA1= <user>
##$USERA2= <user>
##$USERA3= <user>
##$USERA4= <user>
##$USERA5= <user>
##$V9= 5
##$VALIST= <valist>
##$VCLIST= <CCCCCCCCCCCCCCC>
##$VD= 0
##$VDLIST= <DDDDDDDDDDDDDDD>
##$VPLIST= <PPPPPPPPPPPPPPP>
##$VTLIST= <TTTTTTTTTTTTTTT>
##$WBST= 1024
##$WBSW= 4
##$XGAIN= (0..3)
0 0 0 0 
##$XL= 0
##$YL= 0
##$YMAX_a= 154802
##$YMIN_a= -368953
##$ZGOPTNS= <>
##$ZL1= 120
##$ZL2= 120
##$ZL3= 120
##$ZL4= 120
##$ABSF1= 16.522
##$ABSF2= -4.171173
##$ABSG= 5
##$ABSL= 3
##$ALPHA= 0
##$AQORDER= 0
##$ASSFAC= 0
##$ASSFACI= 0
##$ASSFACX= 0
##$ASSWID= 0
##$AUNMP= <proc_1d>
##$AZFE= 0.1
##$AZFW= 0.1
##$BCFW= 0
##$BC_mod= 0
##$BYTORDP= 0
##$COROFFS= 0
##$CY= 12.5
##$DATMOD= 1
##$DC= 0
##$DFILT= <>
##$DTYPP= 0
##$F1P= 14.0000005364418
##$F2P= -0.99999901652339
##$FCOR= 0.5
##$FTSIZE= 32768
##$FT_mod= 6
##$GAMMA= 0
##$GB= 0
##$INTBC= 1
##$INTSCL= 1
##$ISEN= 128
##$LB= 0.3
##$LEV0= 0
##$LPBIN= 0
##$MAXI= 10000
##$MC2= 0
##$MEAN= 0
##$ME_mod= 0
##$MI= 0
##$NCOEF= 0
##$NC_proc= -5
##$NLEV= 6
##$NOISF1= 0
##$NOISF2= 0
##$NSP= 0
##$NTH_PI= 0
##$NZP= 0
##$OFFSET= 16.522
##$PC= 1
##$PHC0= 191.7543
##$PHC1= 45.88546
##$PH_mod= 1
##$PKNL= yes
##$PPARMOD= 0
##$PSCAL= 4
##$PSIGN= 0
##$REVERSE= no
##$SF= 250.13
##$SI= 32768
##$SIGF1= 0
##$SIGF2= 0
##$SINO= 400
##$SIOLD= 32768
##$SREGLST= <1H.DMSO>
##$SSB= 0
##$STSI= 32768
##$STSR= 0
##$SW_p= 5175.98343685301
##$SYMM= 0
##$S_DEV= 0
##$TDeff= 65536
##$TDoff= 0
##$TI= <Analysis number 999999
Compound Code 99
Book Reference 9
Project Code 9>
##$TILT= no
##$TM1= 0
##$TM2= 0
##$TOPLEV= 0
##$USERP1= <user>
##$USERP2= <user>
##$USERP3= <user>
##$USERP4= <user>
##$USERP5= <user>
##$WDW= 1
##$XDIM= 32768
##$YMAX_p= 583582171
##$YMIN_p= -2907957
$$ End of Bruker specific parameters
$$ ---------------------------------
##NTUPLES= NMR SPECTRUM
##VAR_NAME=  FREQUENCY,     SPECTRUM/REAL,   SPECTRUM/IMAG
##SYMBOL=    X,             R,               I
##VAR_TYPE=  INDEPENDENT,   DEPENDENT,       DEPENDENT
##VAR_FORM=  AFFN,          ASDF,            ASDF
##VAR_DIM=   32768,         32768,           32768
##UNITS=     HZ,            ARBITRARY UNITS, ARBITRARY UNITS
##FACTOR=    0.157963299565203, 1,           1
##FIRST=     4132.6476996994, 0,             0
##LAST=      -1043.33573715361, 0,           0
##MIN=       -1043.33573715361, -2907957,    0
##MAX=       4132.6476996994, 583582171,     0
$$ Real data points
##PAGE= N=1
##DATA TABLE= (X++(R..R)), XYDATA
$$ [...]
27391A1401J3390l4112l1221Q0417j589l1093m5760j05711J6656J02611P4544
$$ 11401 24791 -9321 -40542 39875 38286 7193 -38567 -144278 -127622 -25011 49533
27380D9533R3760K1995j1004r6756n2392p7228m1632L4047K8436J4940K8931O8273
$$ 49533 143293 165288 154284 57528 5136 -72092 -113724 -79677 -51241 -36301 -7370 60903
27368F0903L5908n3687q7701o7549N8398O2606k1502M0769r074L9035m396j05769
$$ 60903 96811 43124 -44577 -112126 -53728 8878 -12624 28145 19071 58106 53710 -52059
27356e2059N0046J10818O7265j1855k7514j8349j0991K5277o2519q454M7134O7163
$$ -52059 -2013 108805 176070 164215 136701 118352 107361 132638 70119 61665 108799 175962
27344A75962r33q1587r5827j684k6722l1441K813L1187J695j3384O1854l2322
$$ 175962 175029 93442 -2385 -4069 -30791 -62232 -59419 -28232 -26537 -39921 21933 -10389
27332a0389K1323Q304K7638P4409L6427M8453l3447l4303j5559l4950q7194p8686
$$ -10389 10934 19238 46876 121285 157712 206165 172718 138415 122856 87906 712 -77974
27320g7974l6301J09108M9164J2140m5189M0189L1816n3788n353m8648o5345j6245
$$ -77974 -114275 -5167 43997 56137 10948 51137 82953 29165 23812 -24836 -90181 -106426
27308a06426M1938j533l2564p467k185O5012M4834k3255R805N42q0974J2614M5642
$$ -106426 -64488 -66021 -98585 -106052 -108237 -43225 1609 -21646 -11841 -11299 -92273 -79659 -34017
27295c4017m9024R6156P606r717l8102l2147J6387L3732j6173Q260M3507M7272
$$ -34017 -83041 13115 20721 11004 -27098 -59245 -42858 -9126 -25299 -17039 26468 73740
27283G3740L2735l0697k9468Q148K8472K4288k845M4212m7255j40572j5345L093
$$ 73740 106475 75778 46310 54458 82930 107218 104373 148585 101330 -39242 -54587 -51494
27271e1494k9277k6436O6751J4408L3905O8402k4298p2356K1204p7429n4190R2170
$$ -51494 -80771 -107207 -40456 -26048 7857 76259 51961 -20395 809 -76620 -130810 -38640
27259c8640J8458J7564O3212N9164R180K7026n4854p5000K4135p14l3648J8088
$$ -38640 -20182 -2618 60594 119758 128938 155964 101110 26110 50245 49531 15883 33971
27247C3971L012L5345L7781P409m1036J9573M833r8719k6577N4693N8165M7667
$$ 33971 36983 72328 110109 117518 76482 96055 100888 2169 -24408 30285 88450 136117
27235A36117N0360n1582o5839r2570q1699L4836L2551m6766O0279O7028Q0423
$$ 136117 186477 134895 69056 -23514 -105213 -70377 -37826 -84592 -24313 42715 123138
27224A23138K2420K6750m2183o9258N5919J9171n0809M80q4964p0877J6027j2014
$$ 123138 145558 172308 130125 60867 116786 135957 85148 85628 664 -70213 -54186 -66200
27212f6200K5726K8654k0351k4344J06136M186j20156k3128M8055K2287o4780
$$ -66200 -40474 -11820 -32171 -56515 49621 53807 -66349 -89477 -41422 -19135 -83915
27201h3915J3719J6910J04112r393k9932L550J41107J03410n6110j54690r7671
$$ -83915 -70196 -53286 50826 41433 11501 15051 156158 259568 203458 48768 -48903
27190d8903j0836j127l2456j9114m7420L3509J5464k4536Q8502m8661K5893O0400
$$ -48903 -59739 -60866 -93322 -112436 -159856 -126347 -110883 -135419 -46917 -95578 -69685 -9285
27178i285N9771J2317l657l3975k7990K9507M874P1433J4862q1521k5406M3494
$$ -9285 50486 62803 59146 25171 -2819 26688 31562 102995 117857 36336 10930 54424
27166E4424k009N8219J2253n4461r8560j4575O7192J07024M3173k5350p4336j7403
$$ 54424 52415 110634 122887 68426 -30134 -44709 22483 129507 172680 147330 72994 55591
27154E5591K0880p2660l9513K8596P8573N4399k9264P650j09013p5713K1299o313
$$ 55591 76471 3811 -35702 -7106 71467 125866 96602 104252 -4761 -80474 -59175 -65488
27142f5488k547l2233J5177M8991l8009N3896P6058k8828N2808o6914k3861l93
$$ -65488 -68035 -100268 -85091 -36100 -74109 -20213 55845 27017 79825 12911 -10950 -11343
27130a1343K5420K3545r5296K2508N6239j1469j8932N7782P5463K4634r8017q2351
$$ -11343 14077 37622 -57674 -35166 21073 9604 -9328 48454 123917 148551 50534 -31817
27118c1817Q1906N0464K5016K6545l3619L7097n6989n5068M7151j7007n6802N6748
$$ -31817 50089 100553 125569 152114 118495 155592 98603 43535 90686 73679 16877 73625
27106G3625M2979j9784n0474K433j5598r2255M7455K2208m7598O8880n775m480
$$ 73625 116604 96820 46346 48779 33181 -59074 -11619 10589 -37009 31871 26096 21616
27094B1616P154p594l249l9799P2503J14786K4210k0362l6271o3589m4863p7301
$$ 21616 28770 21176 17927 -21872 50631 165417 189627 169265 132994 69405 24542 -52759
27082e2759P5268N6032N7077K8979k4120j29948j9295J00652J29535m6230q2427
$$ -52759 22509 78541 135618 164597 140477 10529 -8766 91886 221421 175191 92764
27071I2764L693K3739m2673k9739p055M2110o6427k8024O2805j1672j12596M2750
$$ 92764 96457 120196 77523 47784 40729 82839 16412 -11612 51193 39521 -73075 -30325
27059c0325O9700m6538Q6425k9454N1986N1221j0371q4676j11076l1011L0292
$$ -30325 39375 -7163 79262 49808 101794 153015 142644 57968 -53108 -84119 -53827
27048e3827R7138R363j01238q842J23482L8279M0487j28594L3878M4321K9810
$$ -53827 43311 52674 -48564 -57406 66076 104355 144842 16248 50126 94447 124257
27037A24257k7975q105R685M3738j392q5445M5579m845J3749m5054o1272J4061
$$ 124257 96282 88177 97862 141600 140208 54763 100342 95497 109246 64192 2920 16981
27025A6981J7758j13222n2757K9231L2978J8621p2338k7745P1428P9349n62r619
$$ 16981 34739 -78483 -131240 -102009 -69031 -50410 -122748 -150493 -79065 284 -278 -9897
27013i897r026q4627j9623J5199Q1272J9619m3124Q0150Q0161k5378N9500j282
$$ -9897 -18923 -103550 -123173 -107974 -26702 -7083 -50207 29943 110104 84726 144226 142944
27001A42944l8306n7186O237j9647q4557p0096J57087J50210o6355r5810l4191
$$ 142944 104638 47452 53689 34042 -50515 -120611 36476 186686 120331 24521 -9670
26990i670j1057m783m8704n4210K4465N0031M8411M8404J07055q2807k7432M6769
$$ -9670 -20727 -25510 -74214 -128424 -103959 -53928 -5517 42887 149942 67135 39703 86472
26978H6472L6543m8420p2977P031R6491o471n8915l6066k539L4320M0268Q1372
$$ 86472 123015 74595 1618 8649 105140 98669 39754 3688 1149 35469 75737 157109
26966A57109n0976N1739q7691r4525L4437k9445O1196J08438L643J6032n6739
$$ 157109 106133 157872 70181 -24344 10093 -19352 41844 150282 153925 169957 113218
26955A13218k4465o625o0339k3446j1429l6205P4829K7928m8082m857k9574k2498
$$ 113218 88753 82128 21789 -1657 -13086 -49291 25538 53466 5384 527 -29047 -51545
26943e1545L3882M482L6164n410R1622l759k7926O273M132p0811o7306K6649N0098
$$ -51545 -17663 -13181 22983 17573 109195 105436 77510 83783 87915 17104 -50202 -23553 26545
26930B6545N0581R947r0272K0704N0204K4007k1661o7684m2505n0377J1098j4841
$$ 26545 77126 87073 -3199 17505 67709 91716 70055 2371 -40134 -90511 -79413 -94254
26918i4254m6217K3037N2371j1890n78L7888o185q5738m0354R4750R1585L9086
$$ -94254 -140471 -117434 -65063 -76953 -77531 -39643 -45828 -131566 -171920 -77170 14415 53501
26906E3501r2444K9636M9478L5605j25044o9989N5243M3763N7047K7954n6702
$$ 53501 -38943 -9307 40171 75776 -49268 -119257 -64014 -20251 36796 64750 8048
26895H048j13210j5024M0687K7319M845K8437L8778M6573M0436j7300O7598L0206
$$ 8048 -105162 -120186 -79499 -52180 -47335 -18898 19880 66453 106889 89589 157187 187393
26883A87393J9933k1485j43112q8183O8473M0115m0637n5184j2021K6547n6996
$$ 187393 207326 185841 42729 -45454 23019 63134 22497 -32687 -44708 -18161 -75157
26872g5157J2806P1850M2157n2427l3431K5220q4842k1261N4337J7432j14051
$$ -75157 -62351 9499 51656 -771 -34202 -8982 -93824 -115085 -60748 -43316 -157367
26861a57367o8610O1730J20385R1298o1726n7559P502K4756M6837j0418j8969
$$ -157367 -225977 -164247 -43862 47436 -14290 -71849 -64347 -39591 7246 -3172 -22141
26850b2141Q1400P522m3450n0940j643J6310O2390O9513j8202o5837j1213r3789
$$ -22141 59259 66781 23331 -27609 -29252 -12942 49448 118961 100759 34922 23709 -70080
26838g0080q4967P2245j5464j4523m9121K7507P0473m4852L4330R2817L6479P424
$$ -70080 -155047 -82802 -98266 -112789 -161910 -134403 -63930 -108782 -74452 18365 54844 62268
26826F2268N1820j03238l1692N3202o9724j0659P0368j7592j06138L9361M1006
$$ 62268 114088 10850 -20842 32360 -37364 -48023 22345 4753 -101385 -62024 -21018
26815b1018L3234R7183k6757J9290L3456j12952l7920J610O990N0479J7758q8216
$$ -21018 12216 109399 82642 101932 135388 22436 -15484 -13874 -6884 43595 61353 -26863
26803b6863n3706L5357P9042J45772K3711j2888p8174m494K1944p2000r3066n495
$$ -26863 -80569 -45212 33830 179602 203313 190425 112251 107757 129701 57701 -35365 -40860
26791d0860P0280Q3834j5172p7990O0170J9201k4708K3940J346m3421p4674L5855
$$ -40860 29420 113254 98082 20092 80262 99463 74755 98695 100041 56620 -18054 17801
26779A7801L3085J02724r4378j44687k1671L1108N5433j6730Q3322K9816k0936
$$ 17801 50886 153610 59232 -85455 -107126 -76018 -20585 -37315 46007 75823 54887
26768E4887l3450o1771j5177r577N9069K7714Q99R533k3595l3971l9159M9677
$$ 54887 21437 -40334 -55511 -65088 -6019 21695 22594 32127 8532 -25439 -64598 -14921
26756a4921N2339m6178J4269P1341l1855J448P363k2607p5009P4563O1529k9231
$$ -14921 37418 -8760 5509 76850 44995 46443 53806 31199 -43810 30753 92282 63051
26744F3051n2628n8700l6862j930O8885M5916J10248O6697K0968m7274l6164j10639
$$ 63051 10423 -48277 -85139 -87069 -18184 27732 137980 204677 225645 178371 142207 31568
26732C1568p7174J1807M1688L0198o1821p3476J0406K7177N6998O1885J9213M9543
$$ 31568 -45606 -33799 7889 38087 -23734 -97210 -86804 -59627 -2629 59256 78469 128012
26720A28012k6308r4338p7275l3255N6396M9997K7097M5792m3953r5410m829Q6173
$$ 128012 101704 7366 -69909 -103164 -46768 3229 30326 76118 32165 -63245 -68074 18099
26708A8099j4331l2820n8821Q1252M452J0926M2480l1534R334O8061m2824l1779
$$ 18099 3768 -29052 -87873 -6621 -2169 8757 51237 19703 29037 97098 54274 22495
26696B2495j19392r2424P6363J03471L248l7790J2727L9405l8081k1753L5013
$$ 22495 -96897 -189321 -112958 -9487 -6239 -44029 -31302 8103 -29978 -51731 -16718
26685a6718O0276N2193R8470o3393j10304p3147j1881l7490o3630N4089M0673
$$ -16718 43558 95751 194221 130828 20524 -52623 -64504 -101994 -165624 -111535 -70862
26674g0862l2061r8495J9518M7531N1423p520N811N6038J52424P524q4763j35033
$$ -70862 -102923 -201418 -181900 -134369 -82946 -90466 -84655 -28617 123807 131331 46568 -88465
26662h8465k3908J8599o4397L7432L2430r64m1887K3793R3306R984o6722J0198
$$ -88465 -112373 -93774 -158171 -120739 -88309 -89273 -131160 -107367 -14061 -4077 -70799 -60601
26650f0601L2766L4361Q5272J8404j10085l7583N2633J7627K4502j5702K4392
$$ -60601 -27835 6526 91798 110202 117 -37466 15167 32794 57296 41594 65986
26639F5986P7365J3226n7115j68017p8267r151k2325o856L1138l4596L305J7387
$$ 65986 143351 156577 99462 -68555 -146822 -155973 -178298 -185154 -154016 -188612 -185307 -167920
26627a67920L240J8483R3867M2927k0025m3591K5498R042J7030O490j7946N7662
$$ -167920 -164680 -146197 -52330 -9403 -29428 -73019 -47521 -38479 -21449 -14959 -32905 24757
26615B4757j8782r577O6518R3042P7108m1674p4472p5367J4671p9594j15770n9316
$$ 24757 5975 -3602 62916 155958 233066 191392 116920 41553 56224 -23370 -139140 -198456
26603a98456J25474Q5761j7619q9324m1315n657L8247M1486O3621l2906l9346
$$ -198456 -72982 12779 -4840 -94164 -135479 -141136 -102889 -61403 2218 -30688 -70034
26592g0034P820P2110L46m5029l1062q8886Q4786J25918K6569k8375N846o4739
$$ -70034 -62214 9896 10242 -34787 -65849 -154735 -69949 55969 82538 54163 60009 -4730
26580d730j6172j2482L365J9373L211K8936L9323p858o3145o142l0947j5449q885
$$ -4730 -20902 -33384 -30019 -10646 -7435 21501 60824 52966 -10179 -16321 -47268 -62717 -71602
26567g1602Q215R5401R3473n8696o651p0578l4001L9175L2109p0022R292n0518
$$ -71602 -63387 32014 125487 66791 60140 -10438 -44439 -5264 26845 -43177 -33885 -84403
26555h4403k6143L9744N1767K5430o5545l9283j2072R58J240J8444P352j2592
$$ -84403 -110546 -70802 -19035 6395 -59150 -98433 -110505 -109547 -108307 -89863 -82511 -95103
26543i5103j7465N6991M9564L5589m6186m4590j25117k402R2301j8841j9647J53019
$$ -95103 -112568 -55577 -6013 29576 -16610 -61200 -186317 -188719 -96418 -115259 -134906 18113
26531A8113J40539q9615p8127N4810K9115N3453O376Q928M0195L7855j55956r2677
$$ 18113 158652 69037 -9090 45720 74835 128288 134664 143592 183787 221642 65686 -26991
26519b6991M4246J565l2356k012K9836J9922n2306P614n323l9956o363L160N3105
$$ -26991 17255 18820 -13536 -15548 14288 34210 -18096 -10482 -15805 -55761 -62124 -58964 -5859
26506e859Q3946J3667k1149n153N2416O9910p3450p5885n435j0319O7826n2534
$$ -5859 78087 91754 70605 65452 117868 187778 114328 38443 33008 22689 90515 37981
26494C7981j44742N0265J5761K9730j6266k7466J8224m2558k8169N3506O5151
$$ 37981 -106761 -56496 -40735 -11005 -27271 -54737 -36513 -79071 -107240 -53734 11417
26483A1417j6604K2955l3850q514P3994J06183r2939q0746k4746k0025M4513j0830
$$ 11417 -5187 17768 -16082 -24596 49398 155581 62642 -18104 -42850 -62875 -18362 -29192
26471b9192q1174K4909k8767m2578J9618n3984J17328J61333p434m5183k5705
$$ -29192 -110366 -85457 -114224 -156802 -137184 -191168 -73840 87493 80059 34876 9171
26460I171l0732k6383K1048M840P6817J7041q8707O2793l1812q4352q693n331
$$ 9171 -21561 -47944 -26896 -22056 54761 71802 -16905 45888 14076 -70276 -78969 -84300
26448h4300n963J03058N0987r038L0537K133m0471l8091k9945k6813O7546K1607
$$ -84300 -90263 12795 63782 54744 85281 87414 46943 8852 -21093 -47906 19640 41247
26436D1247J7404k0185q1275m8725J7574J17955l269R18L2405n2010J1695m948
$$ 41247 58651 38466 -42809 -91534 -73960 43995 40726 41644 74049 22039 33734 28786
26424B8786m554L6387N3033O357r1345k6043r8746l5552L3126r8902R0654P9084
$$ 28786 24232 60619 113652 120009 28664 2621 -96125 -131677 -98551 -197453 -106799 -27715
26412b7715R902P890J0157M3737l4684m26K7663l3680q984q217j5814N3859J8796
$$ -27715 -17813 -9923 234 43971 9287 8861 36524 2844 -6140 -14357 -30171 23688 42484
26399D2484L7751n3705L6057K6184l3773k2396n0037l1778k2980j4026m3837n1235
$$ 42484 80235 26530 62587 88771 54998 32602 -17435 -49213 -72193 -86219 -130056 -181291
26387a81291p135L2989O132L3309J3873L0609L7341Q3675o3901o406K3305J6158
$$ -181291 -188426 -155437 -149305 -115996 -102123 -71514 -34173 49502 -14399 -20805 2500 18658
26375A8658k8138K6098q0886l1500l4684k9072R3002M8805L24k275M8168l184
$$ 18658 -9480 16618 -64268 -95768 -130452 -159524 -66522 -17717 -17393 -19668 28500 25316
26363B5316k5968P0194P6588N7013k4323j37822q8247K0390M2419j13525J857
$$ 25316 -652 69542 146130 203143 178820 40998 -47249 -26859 15560 -97965 -96108
26352i6108K6812O7719K4431k4769m75j452n3591K3334j9682n6975L1539q894
$$ -96108 -69296 -1577 22854 -1915 -2390 -3842 -57433 -34099 -53781 -110756 -79217 -88111
26340h8111K2462J6142j7728L2772J2428r1037O214L767K3240q0389j374P8679
$$ -88111 -65649 -49507 -67235 -34463 -22035 -113072 -106858 -103091 -79851 -160240 -161614 -82935
26328h2935J3216N2312O11l4048J685K6067P5587P433j1121J7586n5022n0801
$$ -82935 -69719 -17407 -16796 -50844 -49159 -23092 52495 59928 48807 66393 11371 -39430
26316c9430k0884O1349N1406l4884N3516l6269n8039P1333Q65j8834J3315K688
$$ -39430 -60314 1035 52441 17557 71073 34804 -23235 48098 48963 30129 43444 46132
26304D6132J6067J0807o0345j31725o412m2883l2474Q4391J43518J8938K6263
$$ 46132 62199 73006 12661 -119064 -125476 -168359 -200833 -116442 27076 46014 72277
26293G2277k434M5634j2808p7916J15059J15606j7273k2703j42794j9089j1936
$$ 72277 69843 115477 102669 24753 139812 255418 238145 215442 72648 53559 41623
26282D1623J5834K9506J11803n84j95731j00891J9901j4783j4224L3274P3534
$$ 41623 57457 86963 198766 198182 2451 -98440 -78539 -93322 -107546 -74272 -738
26271g38Q090k9863q3290L2257m3459k885J01379Q1270l8752r7053K0439N2542
$$ -738 7352 -22511 -105801 -73544 -117003 -119888 -18509 62761 24009 -73044 -52605 -63
26259f3K2291m8600j17177M3712O9939o5653N5301K16332k9472j94194k4247r769
$$ -63 22228 -26372 -143549 -99837 -29898 -95551 -40250 176082 146610 -47584 -71831 -81600
26247h1600K5694r1325M1398J18338N3962m5694p0457J7704K951Q913P0880K3168
$$ -81600 -55906 -147231 -105833 12505 66467 20773 -49684 -31980 -29029 -20116 50764 73932
26235G3932K7375K9664M4006o7757k8735p5664m0969K2491m6584n9585K3380l3800
$$ 73932 101307 130971 174977 107220 78485 2821 -38148 -15657 -62241 -121826 -98446 -132246
26223a32246M3103L0392M1965R1687L9953o5285k73n8408o0125l324M2080r1297
$$ -132246 -89143 -58751 -16786 74901 114854 49569 49296 -9112 -69237 -72561 -30481 -121778
26211a21778K9700N1032k7687o69N3647m1945j0265j9293K7831K3231n2019M9088
$$ -121778 -92078 -41046 -68733 -69402 -15755 -57700 -67965 -87258 -59427 -36196 -88215 -39127
26199c9127M0088K0745N0543q5496J1784R7185N0163n0467m4548j3329n9763P0882
$$ -39127 961 21706 72249 -13247 -1463 95722 145885 95418 50870 37541 -22222 48660
26187D8660O0996j7025q8972r6083n8275N2600P957K9243J07711k3577n7714k8468
$$ 48660 109656 92631 3659 -92424 -150699 -98099 -90142 -60899 46812 23235 -34479 -62947
26175f2947l5179j9652p9389K5828K7018l076m974m510J3453n515L3048N8375
$$ -62947 -98126 -117778 -197167 -171339 -144321 -147397 -152371 -156881 -143428 -148943 -115895 -57520
26163e7520J9041M3420K5436J4171p245L0386N5101o3658l1021m3908k6085K6860
$$ -57520 -38479 4941 30377 44548 37303 67689 122790 59132 28111 -15797 -41882 -15022
26151a5022O8451n1112J0821k7803o4093p650j9008J956J6509M3931k0150r3287
$$ -15022 53429 2317 13138 -14665 -78758 -86408 -105416 -103460 -86951 -43020 -63170 -156457
26139a56457n0020J03390K8619l917l6780p99K7841N7412R7576m6141o7866o605
$$ -156457 -206477 -103087 -74468 -78385 -115165 -115964 -88123 -30711 66865 20724 -47142 -53747
26127e3747q2609o3705K5449L3468M9505J17634R3244o4440l8676p7235o8435
$$ -53747 -136356 -200061 -174612 -141144 -91639 25995 119239 54799 16123 -61112 -129547
26116a29547O3514l8507j01902N4327L8966J35584J09991o0298j10670m8392O046
$$ -129547 -66033 -104540 -206442 -152115 -113149 22435 132426 72128 -38542 -86934 -80888
26105h0888R7364J604m3626k9276m085J2356k0408o054M4114Q179J921n1568m9406
$$ -80888 16476 18080 -25546 -54822 -58907 -46551 -66959 -73013 -28899 -20720 -18799 -70367 -119773
26092a19773M6144M3519P7721n2327l7492k0459R3476O7920N465j15137j57424
$$ -119773 -73629 -30110 47611 -4716 -42208 -62667 30809 98729 104194 -10943 -168367
26081a68367o6988j2218N5364j12815L066J40886N0747K975j4288L4868J69064
$$ -168367 -235355 -247573 -192209 -305024 -301958 -161072 -110325 -107350 -121638 -86770 82294
26070H2294L7352j28041n4278N4188O7081J2381p7119l2537K133R444k3395L1738
$$ 82294 119646 -8395 -62673 -8485 58596 70977 -6142 -38679 -36546 -27102 -50497 -18759
26058a8759p667m224j3244o8497r684J7676j1256O0524K4295o1573J1451K1768
$$ -18759 -26426 -30650 -43894 -112391 -122075 -104399 -115655 -55131 -30836 -92409 -80958 -59190
26046e9190J0920k7278j1997P0879L1946J4628j4689j14603o989J16501p3606
$$ -59190 -48270 -75548 -87545 -16666 15280 29908 15219 -99384 -106373 10128 -63478
26035f3478n628o269m7984n6784j664K1468R9256N5235q5294J5446P0036P1710
$$ -63478 -69106 -75375 -123359 -180143 -181807 -160339 -61083 -5848 -91142 -75696 -5660 66050
26023F6050m6535k2217p7086R7538R5013k4848r0056N091M9519o3693m8752p6074
$$ 66050 19515 -2702 -79788 17750 112763 87915 -2141 2950 52469 -11224 -59976 -136050
26011a36050N9548l7745l7880K8573K7304P351m5116l0213n121N6357J12896J39439
$$ -136050 -76502 -114247 -152127 -123554 -96250 -88899 -134015 -164228 -169349 -112992 -96 139343
25999A39343j20p5153L4626K4281l1117m9891j28562J0928N9871J5509M5758J3556
$$ 139343 139223 64070 98696 122977 91860 41969 -86593 -75665 -15794 -285 45473 59029
25987E9029k6281o7605p2877Q0068K6401O7986p6046q7677J6938R6493p0585m2096
$$ 59029 32748 -34857 -107734 -27666 -1265 66721 -9325 -97002 -80064 16429 -54156 -96252
25975i6252j25358K8530O5834q365P3979k0097j3384j753n053J26500l2721l9584
$$ -96252 -221610 -193080 -127246 -135611 -61632 -81729 -95113 -96866 -101919 24581 -8140 -47724
25963d7724k4291l6876J9713L3175L6031P2359N6715j61261q679R941M3643P2355
$$ -47724 -72015 -108891 -89178 -56003 -19972 52387 109102 -52159 -60838 -50897 -7254 65101
25951F5101k126m1565n2564p0534r503Q020P2468K1079L6654L7956J9271O61k3561
$$ 65101 62975 21410 -31154 -101688 -111191 -103171 -30703 -9624 27030 64986 84257 84918 61357
25938F1357n3451n7605k5475N9526k0829m7487o0016m0220P707N556l4701m8396
$$ 61357 7906 -49699 -75174 -15648 -36477 -83964 -143980 -184200 -176493 -170937 -205638 -254034
25926b54034J22497J69983N0315j10125q2246Q9097K4720o9970r5044J1268O8171
$$ -254034 -131537 38446 88761 -21364 -103610 -14513 10207 -59763 -154807 -143539 -75368
25915g5368j670o0455p0995l7960l5301o5231J00473L2167j2840J2079N0130Q9195
$$ -75368 -77038 -137493 -208488 -246448 -281749 -346980 -246507 -214340 -227180 -215101 -164971 -75776
25903g5776M3379P5358k4714p013n2784L7031k9087n1009l241O252L7794l8492
$$ -75776 -32397 42961 18247 11234 -41550 -4519 -33606 -84615 -87856 -81604 -43810 -82302
25891h2302m2546J8117o5398j8559L9216K3846o481j2863Q9182K5577n2310q276
$$ -82302 -124848 -106731 -172129 -190688 -151472 -127626 -134107 -146970 -57788 -32211 -84521 -92797
25879i2797P4732l465m4623j022j4516P866K6326r0312o7967O4899R7524J0175
$$ -92797 -18065 -21530 -66153 -67175 -81691 -73825 -47499 -137811 -205778 -140879 -43355 -33180
25867c3180n6259N0M503p16N9932L0486O3015j562l5934m8778l0121K8076N0448
$$ -33180 -89439 -89389 -84886 -85602 -25670 4816 67831 66269 30335 -18443 -48564 -20488 29960
25854B9960L580j37496j743J0332k7698J1723O196L1394q664k0136m3174J6931
$$ 29960 33540 -103956 -105699 -95367 -123065 -111342 -105146 -73752 -82416 -102552 -145726 -128795
25842a28795J23694j5073j4711O0367n0429j9043N8261P459J9318Q6661k1982
$$ -128795 -5101 -20174 -34885 25482 -24947 -43990 14271 21730 41048 127709 105727
25831A05727o8392r9760L7803J9738M3309j4930r1123J6168n3926r882O7708K3332
$$ 105727 37335 -62425 -24622 -4884 38425 23495 -67628 -51460 -105386 -115268 -47560 -24228
25819b4228J7679n1278L3391j0471M666m1593K3102M0912N5084J3119q8200k2785
$$ -24228 -6549 -57827 -24436 -34907 -30241 -71834 -48732 -7820 47264 60383 -27817 -50602
25807e0602P6990l7035m9319L7333K9717P2311L4998j5487O262P1156j7963o6287
$$ -50602 26388 -10647 -59966 -22633 7084 79395 114393 98906 105168 176324 158361 92074
25795I2074K8241q0316k5055o6345L0852M7633J0549n967q6193o4285m8914j4789
$$ 92074 120315 39999 14944 -51401 -20549 27084 37633 31666 -54527 -118812 -167726 -182515
25783a82515J3490N8508R835m3421O166L1547m4172K3583L4164J8198j9428l8976
$$ -182515 -169025 -110517 -100682 -144103 -137937 -106390 -150562 -126979 -92815 -74617 -94045 -133021
25771a33021o2468j417O4324R3519k704O6826j5279L5272j06722m5144O5657K1833
$$ -133021 -195489 -196906 -132582 -39063 -41767 25059 9780 45052 -61670 -106814 -41157 -19324
25759a9324r523n8422N5507M1784J5312P3687K7974r6385k3547N0244N6691p5328
$$ -19324 -28847 -87269 -31762 10022 25334 99021 126995 30610 7063 57307 113998 38670
25747C8670p3551L8639K940P27n3677k9016K5499O5057Q4320P492j04846n2275
$$ 38670 -34881 3758 6698 7425 -46252 -75268 -49769 15288 99608 107100 2254 -50021
25735e0021P438K8588o5682K6554R2548j33575j9129M9723M8806k2270j7543J8950
$$ -50021 -42583 -13995 -79677 -53123 39425 -94150 -113279 -63556 -14750 -37020 -54563 -35613
25723c5613o9736j9728m4802k2166N3315M2036R9817n6034k4967O896Q8598K5506
$$ -35613 -105349 -125077 -169879 -192045 -138730 -96694 3123 -52911 -77878 -70982 17616 43122
25711D3122j05189q2888q3055l56n166L6541K886M1654J5190L3409L4814p9940
$$ 43122 -62067 -144955 -228010 -228366 -233532 -196991 -194105 -152451 -137261 -103852 -69038 -148978
25699a48978q5633J52433J75620Q257p6101L410M0918o7208Q840O0967O1631L8945
$$ -148978 -234611 -82178 93442 101699 25598 29008 69926 2718 11558 72525 134156 173101
25687A73101J2990K1028j36841n4379L1071j4234P5553m4542q1492K4838N2154
$$ 173101 186091 207119 70278 15899 46970 32736 108289 63747 -17745 7093 59247
25676E9247L5659r8746j55850M1699J74802k4243p8968l101Q4601o322n119n9708
$$ 59247 94906 -3840 -159690 -117991 56811 32568 -46400 -49501 35100 28778 23659 -36049
25664c6049L2422Q942m5793M545L4222j5052k892j31495p4453J17164K6891l6476
$$ -36049 -3627 5315 -40478 -35933 -1711 -16763 -19655 -151150 -225603 -108439 -81548 -118024
25652a18024j060M6228O6577j071Q7738k3333q1571j6192J3539q4575O291L968
$$ -118024 -119084 -72856 -6279 -7350 80388 57055 -24516 -40708 -27169 -111744 -105453 -101485
25640a01485l4265K492n4820L731J5234K0257L2289J08611J1083M2062J853L4658
$$ -101485 -135750 -133258 -188078 -184347 -169113 -148856 -116567 -7956 3127 45189 47042 81700
25628H1700N9774o9794j04841j08828n0586l786P7562J69017Q068j4237K7987
$$ 81700 141474 71680 -33161 -141989 -192575 -196361 -118799 50218 58286 44049 72036
25617G2036O3770l5091j69884L466J02345O0882K0586J5128j21701n9688q3115
$$ 72036 135806 100715 -69169 -65703 36642 97524 118110 133238 11537 -48151 -131266
25606a31266R331J27757J15029K0680m809p6275o8304q0807J4325K2604p66l6909
$$ -131266 -121935 5822 120851 141531 136722 60447 -7857 -88664 -74339 -51735 -52501 -89410
25594h9410l1141p0336O8437m8056l1444M7175J20239O6038O9002n0818K0662
$$ -89410 -120551 -190887 -122450 -170506 -201950 -154775 -34536 31502 100504 49686 70348
25583G0348P5746J7041j5843j01120j7850r375p617n7272J9761O6615J6269j3090
$$ 70348 146094 163135 147292 46172 28322 18947 11330 -45942 -26181 40434 56703 43613
25571D3613K8635l4658r6986R174K7917O207J8341J675l5149m6743N1961j17812
$$ 43613 72248 37590 -59396 -50222 -22305 -16098 2243 3918 -31231 -77974 -26013 -143825
25559a43825O716N9926L2879j5518J4502J04003m3369J1427l5700m8619n8974
$$ -143825 -137109 -77183 -44304 -59822 -45320 58683 15314 26741 -8959 -57578 -116552
25548a16552k1M1547r755p1830p45R1614p3400J06711O7255J2983m6799p9393
$$ -116552 -116573 -75026 -84781 -156611 -157356 -65742 -139142 -32431 34824 47807 1008 -78385
25536g8385j5530L7743M1763n8903K0822O202K9779J6894M0429m3616j6327l5975
$$ -78385 -93915 -56172 -14409 -73312 -52490 -46288 -16509 385 40814 -2802 -19129 -55104
25524e5104L4848R160J4744K2361L3403J3173m9130l1546J1513J7431l7939p6068
$$ -55104 -20256 -11096 3648 26009 59412 72585 23455 -8091 3422 20853 -17086 -93154
25512i3154m2436K7792j1001j03618o8206L7945J23153J25041K021m9228M6536
$$ -93154 -135590 -107798 -118799 -222417 -290623 -252678 -129525 -4484 -2463 -51691 -5155
25501e155N4425K2194l2679k8734Q1982r245o0011r947j6094j5684q5693n1415
$$ -5155 49270 71464 38785 10051 92033 82788 22777 12830 -3264 -18948 -104641 -156056
25489a56056O0202L8429J9309j0867P596K4960p0033N9716P0584K4041n6097q6977
$$ -156056 -95854 -57425 -38116 -48983 -41387 -16427 -86460 -26744 43840 67881 11784 -75193
25477g5193O0268O0646L1357o2359j25385l375K0531p329j04770J0562P1681j1016
$$ -75193 -14925 45721 77078 14719 -110666 -114041 -93510 -100839 -205609 -195047 -123366 -134382
25465a34382P0982J18044O469J9700j0822k0510P76m5372l9775N0909O1931J02714
$$ -134382 -63400 54644 61113 80813 69991 49481 50257 4885 -34890 16019 77950 180664
25453A80664o6308m9795l085q4961J8729j9047j6993m743m437O3410J3567m1828
$$ 180664 114356 64561 61476 -23485 -4756 -23803 -40796 -45539 -49976 13434 27001 -14827
25441a4827j19420j05548P149p271R8129J17171L91o1396n7454L7797R1109P0642
$$ -14827 -134247 -239795 -232646 -239917 -141788 -24617 -24226 -85622 -143076 -105279 -14170 56472
25429E6472k482k5785m630o248j2053O0222L3446n2645j9663L0008J9079m5169
$$ 56472 53990 28205 23575 17327 5274 65496 98942 46297 26634 56642 75721 30552
25417C0552k1485L4091l2370j6240l9334r440l5437N9059L8776M0805P451j04943
$$ 30552 9067 43158 10788 -5452 -44786 -54226 -89663 -30604 8172 48977 56428 -48515
25405d8515q0350N3373J15487k6183N5810Q0720m3498r6263L4764M4513m4896
$$ -48515 -128865 -75492 39995 13812 69622 150342 106844 10581 45345 89858 44962
25394D4962K1386K0226p4932J11351N4941j25020p9471l6451n6338K8697K8675
$$ 44962 66348 86574 11642 122993 177934 52914 -26557 -63008 -119346 -90649 -61974
25383f1974J7749O956K9288k8766J1733O202k5619L3848L5067m7187j5953j1876
$$ -61974 -44225 -37269 -7981 -36747 -25014 -18812 -44431 -10583 24484 -22703 -38656 -50532
25371e0532p8770N7694O081L5494K979q6542j7466P0974Q6514O8404q6059o0958
$$ -50532 -129302 -71608 -65527 -30033 -27054 -113596 -131062 -60088 26426 94830 8771 -52187
25359e2187M3088N3556l229j2248m5535n6848K9193R992m3051O7556N5462J0019
$$ -52187 -9099 44457 41228 28980 -16555 -73403 -44210 -34218 -77269 -9713 45749 55768
25347E5768o9504N862O4229K237P0550j1935K6384R687J4302J386j0906j45293
$$ 55768 -13736 -7874 56355 58592 129142 117207 143591 153278 167580 168966 158060 12767
25335A2767l5135l3064l8231K2574p009Q7856J6107q8960L3591R1936k1877q8744
$$ 12767 -22368 -55432 -93663 -71089 -78098 9758 25865 -63095 -29504 62432 40555 -48189
25323d8189P9474L615j13297k8807J5563k7022Q7617K1388q0110L029l2058q105
$$ -48189 31285 34900 -78397 -107204 -91641 -118663 -31046 -9658 -89768 -86739 -118797 -126902
25311a26902L2064K8023j4314m6196j2686J05222q486P4411j9588l2713l8641
$$ -126902 -94838 -66815 -81129 -127325 -140011 -34789 -43275 31136 11548 -21165 -59806
25300e9806p6897j9354K7109O2555K3451l8377O6970L8294m7447m516M2684N9257
$$ -59806 -136703 -156057 -128948 -66393 -42942 -81319 -14349 23945 -23502 -28018 14666 73923
25288G3923o9094o2358Q032P5665n6820j00396J747O0069L2226L8157K6445n3687
$$ 73923 4829 -57529 -49497 26168 -30652 -131048 -129301 -69232 -37006 1151 27596 -26091
25276b6091j2598l072K1301Q9810O284j19241M6038n870j6972m2947o3646J19693
$$ -26091 -38689 -41761 -20460 69350 75634 -43607 2431 -3439 -20411 -63358 -127004 -7311
25264g311p878l4858K8722O6l0490m110m5026L9678M0124j6516K1247m495r5766
$$ -7311 -15189 -50047 -21325 -21259 -51749 -55859 -100885 -61207 -21083 -37599 -16352 -20847 -116613
25251a16613l3148J7879J53441O8901m7069j9331l0236J6742P721p3476L3729
$$ -116613 -149761 -131882 21559 90460 43391 24060 -6176 10566 18287 -55189 -21460
25240b1460M860l5248j4221L8944l5942j27857j6468K0838J3147O7347K5413Q2248
$$ -21460 -16600 -51848 -66069 -27125 -63067 -190924 -207392 -186554 -173407 -106060 -80647 1601
25228A601N7819N9632K1110j28757p9793P9088k6582O1693O0387r304J1757k0899
$$ 1601 59420 119052 140162 11405 -68388 10700 -15882 45811 106198 96894 108651 87752
25216H7752k3519m7069n0935N9597R3764Q542q9020l1141L3865p9747M273J4455
$$ 87752 64233 17164 -33771 25826 119590 128132 39112 7971 41836 -37911 -33638 -19183
25204a9183p245P1393p2173l5126m0352K5756L7053N0635j5041J0013K5137J1196
$$ -19183 -26428 44965 -27208 -62334 -102686 -76930 -39877 10758 -4283 5730 30867 42063
25192D2063K6936o0489m614M9298l3025o5833n5889p6519N8035P3130L871M3147
$$ 42063 68999 8510 3896 53194 20169 -45664 -101553 -178072 -120037 -46907 -43036 111
25180A11k2335n7238p4624n5136K4437J8941P1851M9783P1264j8037m6172p7013
$$ 111 -22224 -79462 -154086 -209222 -184785 -165844 -93993 -44210 27054 9017 -37155 -114168
25168a14168l8130l8420p6988P2920J39152O2858N1918q2831n9566M7883L2143
$$ -114168 -152298 -190718 -267706 -194786 -55634 7224 59142 -23689 -83255 -35372 -3229
25157c229P7504J03180N9178j06478m2380q9512o4639J436j8918J4042n6918K2011
$$ -3229 74275 177455 236633 130155 87775 -1737 -66376 -64940 -83858 -69816 -126734 -104723
25145a04723P8681J2687l5614K3229j1083J0442n1857q9851Q7702Q8324K8219
$$ -104723 -26042 -13355 -48969 -25740 -36823 -26381 -78238 -168089 -80387 7937 36156
25134C6156k0932j31776m2712L5862O5313m398m1512N9310J07026j1757p8694
$$ 36156 15224 -116552 -159264 -123402 -58089 -62487 -103999 -44689 62337 50580 -28114
25123b8114K7701k2141n420M2811l0427J8225j31330J601k0971L9895N8020J42756
$$ -28114 -413 -22554 -27974 14837 -15590 2635 -128695 -127094 -148065 -108170 -50150 92606
25111I2606Q7585o0861j6132r002o9977j00351q8339p924k1384j0456J3924M2350
$$ 92606 180191 119330 103198 94196 24219 -76132 -164471 -172395 -193779 -204235 -190311 -147961
25099a47961N4492L1903M2975l4240M7586K4604p853l3519j07023P767K6607L8838
$$ -147961 -93469 -61566 -18591 -52831 -5245 19359 11506 -22013 -129036 -121269 -94662 -55824
25087e5824L165q282k2551l9093N9592J4919j7712j34066q9977P3427J39881J42933
$$ -55824 -52659 -60941 -83492 -122585 -62993 -48074 -65786 -199852 -289829 -216402 -76521 66412
25075F6412L9971J5089j11028q4483l1962m1115N6768L7340J1889l4740M5498
$$ 66412 106383 121472 10444 -74039 -106001 -147116 -90348 -53008 -41119 -75859 -30361
25064c0361Q7282R4910j9759o6608r4985j16064o720K1072J1613J05162Q491n6765
$$ -30361 56921 151831 132072 65464 -29521 -145585 -152305 -131233 -119620 -14458 -5967 -62732
25052f2732l2636k7959P3500P85M181k3997O2499N6731R4739j33154l6370J2145
$$ -62732 -95368 -123327 -49827 -49042 -44861 -68858 -6359 50372 145111 11957 -24413 -12268
25040a2268L3575N7685m4061j04387n2762o9431j1984L8818K7006M8490m1226
$$ -12268 21307 78992 34931 -69456 -122218 -191649 -203633 -164815 -137809 -89319 -130545
25029a30545O0806R2951r3738l6531p2912O8222P1803k5212L0275P1460r0376
$$ -130545 -69739 23212 -70526 -107057 -179969 -111747 -39944 -65156 -34881 36579 -53797
25018e3797o1894k8049p4008p9050K4041N8842p086L9006J15134J0133k1068j8716
$$ -53797 -115691 -143740 -217748 -296798 -272757 -213915 -221001 -181995 -66861 -56728 -77796 -96512
25006i6512p4124k8059n073K8770M3130K9164k9300p2859M665M1757L4621K3348
$$ -96512 -170636 -198695 -203768 -174998 -131868 -102704 -132004 -204863 -200198 -158441 -123820 -100472
24994a00472L3885M8806P8363j2757l0801l6066k8610L7505N5148M1557j11472
$$ -100472 -66587 -17781 60582 47825 17024 -19042 -47652 -10147 45001 86558 -24914
24983b4914M2295J5212j1133p5518j07509j5999J4815N1420j4226Q7151K0819
$$ -24914 17381 32593 21460 -54058 -161567 -177566 -162751 -111331 -125557 -38406 -17587
24972a7587r3564j5372O5461M9046M628J7076J3306n6670n6504J31199k5535q0562
$$ -17587 -111151 -126523 -61062 -12016 -7388 9688 22994 -33676 -90180 41019 15484 -65078
24960f5078M7872o7852j6562o6007M2121L4066j5640J7754J05786K6559P495R231
$$ -65078 -17206 -85058 -101620 -167627 -125506 -91440 -107080 -89326 16460 43019 50514 59745
24948E9745k1715o5287k4469k6376o680L4797R920m1067k7618K8339J6912O5782
$$ 59745 38030 -27257 -51726 -78102 -84782 -49985 -40065 -81132 -108750 -80411 -63499 2283
24936B283o827l903o1786o6048k1166k103N3131P7133k9911J417R3655L7717K5896
$$ 2283 -4544 -8447 -70233 -136281 -157447 -159550 -106419 -29286 -59197 -57780 35875 73592 99488
24923I9488q0355m3382J9129p2913p3219N6165j833K7104N557j3889L2302l9235
$$ 99488 19133 -24249 -5120 -78033 -151252 -95087 -96920 -69816 -64259 -78148 -45846 -85081
24911h5081L3551J27577l0378n6426j48634j642P655L2977K0095l5675J89226
$$ -85081 -51530 76047 45669 -10757 -159391 -161033 -153378 -120401 -100306 -135981 53245
24900E3245J04832p5366j13627n2311m604l8832O373M2287O3104K2126J5140L9289
$$ 53245 158077 82711 -30916 -83227 -87831 -126663 -120290 -78003 -14899 7227 22367 61656
24888F1656N9057o5867j17679L7266R936m8979K8288J000L0932N5321M1055l9195
$$ 61656 120713 54846 -62833 -25567 -15631 -64610 -36322 -35322 -4390 50931 91986 52791
24876E2791m1779m4504p7824N4074p2452l7716J33650M9898r4694j6343J0134
$$ 52791 11012 -33492 -111316 -57242 -129694 -167410 -33760 16138 -78556 -94899 -84765
24865h4765L620L2211K7503m0823p654M9990N1528j2552n3658o5557k9998o971
$$ -84765 -81145 -48934 -21431 -62254 -69908 -19918 31610 19058 -34600 -100157 -130155 -137126
24853a37126j24741l112j3897J9592M3168P7892J6739M5731M3450K2462q7681
$$ -137126 -261867 -264979 -278876 -259284 -216116 -138224 -121485 -75754 -32304 -9842 -97523
24842i7523o7120R7508Q3266P11n1282N3493L6118j45627n7388L5001K9750m947
$$ -97523 -164643 -67135 16131 16842 -34440 19053 55171 -90456 -147844 -112843 -83093 -88040
24830h8040L3626j5561m1797K9849J04089j3688m4316O304J4409l7008n4765M6989
$$ -88040 -54414 -69975 -111772 -81923 22166 8478 -35838 -29534 -15125 -52133 -106898 -59909
24818e9909Q340o5120k9237l280l9152M8015O8543l2775J0122m9493p2676p4315
$$ -59909 -51569 -116689 -145926 -149206 -188358 -140343 -71800 -104575 -94453 -143946 -216622 -290937
24806b90937J05023J41068k465K545K7030O1452l7927o3410J6286n1558j01759
$$ -290937 -185914 -44846 -47311 -44766 -17736 43716 5789 -57621 -41335 -92893 -194652
24795a94652L9232R9547j8485R536M9969J5270q7770k816J57330k4364j13508
$$ -194652 -155420 -55873 -74358 -64822 -14853 417 -87353 -90169 67161 42797 -70711
24784g0711p4133l1545k9439m4225K0010O8146J1756L4279n457j8341K8181R2693
$$ -70711 -144844 -176389 -205828 -250053 -230043 -161897 -150141 -115862 -121319 -139660 -111479 -18786
24772a8786m9696n0025p5941P1430K8712Q1136J6828l6336K0882J04932O5283
$$ -18786 -68482 -118507 -194448 -123018 -94306 -13170 3658 -32678 -11796 93136 158419
24761A58419j4890m9661m0731k022n3352r5508K4810N8540n914r4644p1656M7175
$$ 158419 143529 93868 53137 51115 -2237 -97745 -72935 -14395 -20309 -114953 -186609 -139434
24749a39434J2978N945Q325P642N1005k4144M342j4503r3442o8212m7860K2722
$$ -139434 -126456 -120511 -112186 -104544 -53539 -77683 -73341 -87844 -181286 -249498 -297358 -274636
24737b74636L6393O6138J17324Q5549J6336K1078m1681k3231L0710L2330o7071
$$ -274636 -238243 -172105 -54781 30768 47104 68182 26501 3270 33980 66310 -761
24726g61K3377K4597O731q7484N8632J37026l6968r4668n67j70178m666J19628
$$ -761 22616 47213 53944 -33540 25092 162118 125150 30482 29915 -140263 -144929 -25301
24714b5301J58787N79j49289j06605J73691J9250j41232j22343J568J46705L5455
$$ -25301 133486 134065 -15224 -121829 51862 71112 -70120 -192463 -190895 -44190 -8735
24703h735L2052m2220l1626K9826N564j7495j8315J9994K1629N721k4893j09957
$$ -8735 23317 -18903 -50529 -20703 -15139 -32634 -50949 -30955 -9326 -3605 -28498 -138455
24691a38455J9718R3827M9095K8542J7140n1624j27888m8267K3022O0078N8082
$$ -138455 -118737 -24910 24185 52727 69867 18243 -109645 -157912 -134890 -74812 -16730
24680a6730M6336j13164m7532l4997l4978M7214M0783q278M8114l0848k8655j517
$$ -16730 29606 -83558 -131090 -166087 -201065 -153851 -113068 -121346 -73232 -104080 -132735 -134252
24668a34252J03675l6939n0891P3157J9765Q294m3711j1645M4483J2102m7950
$$ -134252 -30577 -67516 -118407 -45250 -25485 -17191 -60902 -72547 -28064 -15962 -63912
24657f3912m0191p6606j6697P8220k9921L9272L8949r135o8872n9477J2049L7709
$$ -63912 -104103 -180709 -197406 -119186 -149107 -109835 -70886 -80021 -148893 -208370 -196321 -158612
24645a58612P5586o269K5354J20500r476k6803m003j3732j2141M4445J6640M8996
$$ -158612 -83026 -89295 -63941 56559 47083 20280 16277 2545 -9596 34849 51489 100485
24633A00485k5971K6880p431K3383j02545q8111K5465m2072K5968J44843n7361
$$ 100485 74514 101394 93963 117346 14801 -73310 -47845 -89917 -63949 80894 23533
24622B3533j22932K8061Q5877N8084q2295q476p3574l2424J9071Q1979K5129l594
$$ 23533 -99399 -71338 14539 72623 -9672 -18148 -91722 -124146 -105075 -23096 2033 -1561
24610a561m2982m5661q0795L57J29685j787M1979K4754j15635p3034J18800j0718
$$ -1561 -44543 -90204 -170999 -170642 -40957 -42744 -765 23989 -91646 -164680 -45880 -56598
24598e6598O6392Q7427l2924q4172r2024N1838J5278O7665Q1364j0047n6421j6583
$$ -56598 9794 97221 64297 -19875 -111899 -60061 -44783 22882 104246 94199 37778 21195
24586B1195p3819l9009j9880L6513o428n1026N6858M1695j0078Q4758o246j04500
$$ 21195 -52624 -91633 -111513 -75000 -81428 -132454 -75596 -33901 -43979 40779 34533 -69967
24574f9967k3889R1029k4232k2362j0535r842q8055l5004n0893J45564J09636
$$ -69967 -93856 -2827 -27059 -49421 -59956 -69798 -157853 -192857 -243750 -98186 11450
24563A1450m8432l1094j5228O6698M0197o4547L7395J1706n9806j11797l5524
$$ 11450 -36982 -68076 -83304 -16606 23591 -40956 -3561 8145 -51661 -163458 -198982
24552a98982R9750N715n1262O0072M3538M9060l8904l5237N6424P821l0311O649
$$ -198982 -99232 -93517 -144779 -84707 -41169 7891 -31013 -66250 -9826 -2005 -32316 -25667
24540b5667K831P652r987K2542Q3282R4124r1842j4603n4762K6064j5768L945
$$ -25667 -22836 -15184 -25171 -2629 80653 174777 82935 68332 13570 39634 23866 27811
24528B7811j01865p996J00625N2605o7606j05401K3223K5095j9739L9876K1879
$$ 27811 -74054 -82050 18575 71180 3574 -101827 -78604 -53509 -73248 -33372 -11493
24517a1493J4546j9753Q9359R1653n4328j08788J8696J9295K4781l4372l3209
$$ -11493 3053 -16700 72659 164312 109984 1196 19892 39187 63968 29596 -3613
24506c613o4153q9242k399Q67J2722N5706J0498k0479m7304K1212J04503O3051
$$ -3613 -67766 -157008 -159407 -158540 -145818 -90112 -79614 -100093 -147397 -126185 -21682 41369
24494D1369k3697j6675j2610j21412j1511O8666J6964M044L8547l0358m5381q4827
$$ 41369 17672 997 -11613 -133025 -144536 -75870 -58906 -54862 -16315 -46673 -92054 -176881
24482a76881K1431N7657k5508p7418j6673R5313l0086j0439M6456K6918r6138
$$ -176881 -155450 -97793 -123301 -200719 -217392 -122079 -152165 -162604 -116148 -89230 -185368
24471a85368p4829O0708K9284m439p5758K7963J19294J2722j6290K9869M864P97
$$ -185368 -260197 -199489 -170205 -174644 -250402 -222439 -103145 -90423 -106713 -76844 -71980 -71183
24459g1183l4820Q2941Q0739l0327p499o4809j5014j6695q7794R7642J0536m0979
$$ -71183 -106003 -23062 57677 27350 19851 -44958 -59972 -76667 -164461 -66819 -56283 -97262
24447i7262J2589Q4053k3417j21633p8730J2604Q1403L2330j8607o0645p1148
$$ -97262 -84673 -620 -24037 -145670 -224400 -211796 -130393 -98063 -116670 -177315 -248463
24436b48463r591Q7911O6633K0483K8140n611L6633L315n3484p8037M6341P9106
$$ -248463 -258054 -170143 -103510 -83027 -54887 -60498 -23865 -20550 -74034 -152071 -105730 -26624
24424b6624N8952k8830o9371M9753m1287m6672L4044J97910o6200j27204k8952
$$ -26624 32328 3498 -65873 -16120 -57407 -104079 -70035 127875 61675 -65529 -94481
24413i4481R1202l8621P593M3856N507K7045K9108n9905K1277j0168l4744l4526
$$ -94481 -3279 -41900 -34307 9549 15056 42101 71209 11304 32581 22413 -12331 -46857
24401d6857m626j4213r019N9589J0188j4302n5723o2299J6875N5007p058L8410
$$ -46857 -51483 -65696 -74715 -15126 -4938 -19240 -74963 -137262 -120387 -65380 -72438 -34028
24389c4028k8003m5458P660k4201K1801L2541l1055K6153J06499Q1195Q753r2715
$$ -34028 -62031 -107489 -99829 -124030 -102229 -69688 -100743 -74590 31909 113104 121857 29142
24377B9142q3937p2353L4026L2521q4522K4915J31685J2146l9693J1643J2629
$$ 29142 -54795 -127148 -93122 -60601 -145123 -120208 11477 23623 -16070 -4427 8202
24366H202j5251j34368K7292O0948L7710O2690N1205j11464n3233j7528l7675
$$ 8202 -7049 -141417 -114125 -53177 -15467 47223 98428 -13036 -66269 -83797 -121472
24355a21472M7175L9519p1098p0803O4690R4801K9249m9092p8148J520J30817
$$ -121472 -74297 -34778 -105876 -176679 -111989 -17188 12061 -37031 -115179 -113659 17158
24344A7158J9255l107p0305k0807L2994J1940j8423n3651k6207N2015L6644l1413
$$ 17158 36413 33306 -36999 -57806 -24812 -12872 -31295 -84946 -111153 -59138 -22494 -53907
24332e3907j01654m4209O7452p571L528j0576l9664J8219J11536Q4369m7899j3306
$$ -53907 -155561 -199770 -132318 -139889 -136361 -146937 -186601 -168382 -56846 27523 -20376 -33682
24320c3682K5256l0712m2008j3448K3391M5393J0914R2446l5955k5228Q2034K6117
$$ -33682 -8426 -39138 -81146 -94594 -71203 -25810 -14896 77550 41595 16367 98401 124518
24308A24518j3755j13337j381J2608P480n5940q232R1681O1996J071o9107o0538
$$ 124518 110763 -2574 -3955 8653 16133 -39807 -48039 43642 105638 106709 37602 -22936
24296b2936n0877L1616Q2366M0092N1925m3556j12108j34390J03O6407J8024m2232
$$ -22936 -73813 -42197 40169 80261 132186 88630 -23478 -157868 -157765 -91358 -73334 -115566
24284a15566M9253J9597K7432j20387j6572O2714L9815j32538j9322R5924J9433
$$ -115566 -66313 -46716 -19284 -139671 -156243 -93529 -53714 -186252 -205574 -109650 -90217
24273i0217M2245Q8339k360j07858j246m8616o0806O1225J6486K3347l8508Q67
$$ -90217 -47972 40367 38007 -69851 -71097 -119713 -180519 -119294 -102808 -79461 -117969 -117102
24261a17102M4105O7910n0347l6326K7367M8820M3761N334j00708L102r936M3600
$$ -117102 -72997 -5087 -55434 -91760 -64393 -15573 28188 33522 -67186 -64084 -74020 -30420
24249c0420Q5816L243k3509j1664K6383n975l7703n4890o6135l4581m9394r471
$$ -30420 55396 58639 35130 23466 49849 43874 6171 -48719 -114854 -149435 -198829 -208300
24237b08300J106J191J13855k9169j8310q4612l0412K6143l55N3507J18812L50
$$ -208300 -207194 -206003 -92148 -121317 -139627 -224239 -254651 -228508 -228863 -175356 -56544 -56194
24225e6194p2506j554Q3978Q2160j1921l8703N887l3869q7745N827J4021N7760
$$ -56194 -128700 -130254 -46276 35884 23963 -14740 -8853 -42722 -130467 -124640 -110619 -52859
24213e2859O2527O5129k3241n2597l3909j5136N4290N4439L0725j24177m2987
$$ -52859 9668 74797 51556 -1041 -34950 -50086 4204 58643 89368 -34809 -77796
24202g7796L2477n5371J2573N7320j7671k719o0420L6589j9076k2221N6048O9927
$$ -77796 -45319 -100690 -88117 -30797 -48468 -51187 -111607 -75018 -94094 -116315 -60267 9660
24190I660j3152K91j33401j6708J0529O0294Q4953K7874O4918j01408j0765n5114
$$ 9660 -3492 -3201 -136602 -153310 -142781 -82487 2466 30340 95258 -6150 -16915 -72029
24178g2029p7102K3724l6925P36Q1299N5666m6861r1592O0864O5853M9301j09412
$$ -72029 -149131 -125407 -162332 -161596 -80297 -24631 -71492 -163084 -102220 -36367 12934 -96478
24166i6478q5275m2932Q4982Q6896k8877k7434j7468O9187P3287J07876J9545
$$ -96478 -181753 -224685 -139703 -52807 -81684 -109118 -126586 -57399 15888 123764 143309
24155A43309k7188j01181k675O9855k4869q9674o4476j3775K6239P2702p454k7910
$$ 143309 116121 14940 12265 82120 57251 -32423 -96899 -110674 -84435 -11733 -19187 -47097
24143d7097k4929j6235j12929j392o792L2046p9677R353J60459Q3690j2959L1671
$$ -47097 -72026 -88261 -201190 -202582 -209374 -177328 -257005 -247652 -87193 -3503 -16462 15209
24131A5209j3993o4616n4486p564M2853M6986M4152l7960m2305l6903J8932p483
$$ 15209 1216 -63400 -117886 -125450 -82597 -35611 8541 -29419 -71724 -108627 -89695 -97178
24119i7178M1302O7354k8934J1438L8868o3902J139L0573j01138r4985L7500R4073
$$ -97178 -55876 11478 -17456 -6018 32850 -31052 -29913 660 -100478 -195463 -157963 -63890
24107f3890Q7383q0855N917L148L5294l4017R240m0460q1610l277K4487J3421
$$ -63890 23493 -57362 -51445 -48297 -13003 -47020 -37780 -78240 -159850 -163127 -138640 -125219
24095a25219n9610o8496q85K7816O7611J69608K5755j84598n7053M2264Q7948
$$ -125219 -184829 -253325 -254210 -226394 -158783 10825 36580 -148018 -205071 -162807 -74859
24084g4859k5096q6655m9629o371K6579M2055j4922L6963M0336l0544L4766P7005
$$ -74859 -99955 -186610 -236239 -242610 -216031 -173976 -188898 -151935 -111599 -142143 -107377 -30372
24072c0372P8725k006J4412o7187j2734k2606k5976m8251J6178N2173l0944N0457
$$ -30372 48353 46347 60759 -6428 -19162 -41768 -67744 -115995 -99817 -47644 -78588 -28131
24060b8131o4221l1293L2046K7777O357P8348M9668p0369j3175J3498L3898o827
$$ -28131 -92352 -123645 -91599 -63822 -57465 20883 70551 182 -12993 505 34403 27576
24048B7576j5576j439r298L1582N096m9563K3538j08625j8634L0293J7583O8852
$$ 27576 12000 10561 1263 32845 37941 -11622 11916 -96709 -115343 -85050 -67467 1385
24036A385M4500n9680n4455P2268K8370k9224p4517p0817m2522N551K6228Q9050
$$ 1385 45885 -13795 -68250 4018 32388 3164 -71353 -142170 -184692 -179141 -152913 -63863
24024f3863L5322J7373N4490O5909O5613l7216r9336j4039m7451p0205j082n943
$$ -63863 -28541 -11168 43322 109231 174844 137628 38292 24253 -23198 -93403 -94485 -100428
24012a00428R329R0585o8602N4842R3182K4880r0593l3537M7281N5602Q8982Q4064
$$ -100428 -91099 -514 -69116 -14274 78908 103788 13195 -20342 26939 82541 171523 255587
24000B55587j18049k1032M4216q5467p2116K3326O77M9342M9507n6415m8609r622
$$ 255587 137538 116506 160722 75255 3139 26465 27142 76484 125991 69576 20967 11345
23988A1345j3251m5909J6858o7923l1615o783j8142K8490J2813O0216R3003j02831
$$ 11345 -1906 -47815 -30957 -98880 -130495 -137278 -155420 -126930 -114117 -53901 39102 -63729
23976f3729j14156L9192J05634K9647j8769J008m2580k0271J3399o7996R188P9227
$$ -63729 -177885 -138693 -33059 -3412 -22181 -21173 -63753 -84024 -70625 -138621 -129433 -50206
23964e0206j4242K2526J1660j14888r2258Q2050R6297K7067J918n2087j2623J8789
$$ -50206 -64448 -41922 -30262 -145150 -237408 -155358 -59061 -31994 -30076 -82163 -94786 -75997
23952g5997K3681m2672L3474N2995o3803k0307m2515l8199N9555O1782J05676
$$ -75997 -52316 -94988 -61514 -8519 -72322 -92629 -135144 -173343 -113788 -52006 53670
23941E3670M1261k5646n0345l4909P5591j4969j57220l712M372j6709O8438K8853
$$ 53670 94931 69285 18940 -15969 59622 44653 -112567 -116279 -111907 -128616 -60178 -31325
23929c1325k5189k102L939N4914p768m2348M9813P008j6829q0916o0617m052J1319
$$ -31325 -56514 -58616 -54677 237 -7531 -49879 -66 6942 -9887 -90803 -151420 -155472 -144153
23916a44153n3067k4367K6688l6843N7462J80083n464l7113Q7228l2998m8803
$$ -144153 -197220 -221587 -194899 -231742 -174280 5803 339 -36774 50454 17456 -31347
23905c1347k0114m2372k8064l6234L5977N2236n760m156J06917N4021p126l6477
$$ -31347 -51461 -93833 -121897 -158131 -122154 -69918 -75678 -79834 27083 81104 73978 37501
23893C7501o0467k1779J20301L2477o2548K7587L8831k9062k7855q7264k0896
$$ 37501 -22966 -44745 75556 108033 45485 73072 111903 82841 54986 -32278 -53174
23882e3174j6629P057k6348m6168L5850N6587R3683m041j2249p6511L1946N5408
$$ -53174 -69803 -62746 -89094 -135262 -99412 -42825 50858 46817 34568 -41943 -9997 45411
23870D5411j25912r8017Q0435P2942N692N647J6188P7937n0312l41K4867j12609
$$ 45411 -80501 -178518 -98083 -25141 -19449 -13802 2386 80323 30011 29670 54537 -58072
23858e8072q5691K9722J13956J07232L3620j2688j18076m2676K4687N1358q3756
$$ -58072 -143763 -114041 -85 107147 140767 128079 10003 -32673 -7986 43372 -40384
23847d0384k1246j7328R7154Q9842k4939n9235L3002J9973n679m7999m4733o8448
$$ -40384 -61630 -78958 18196 108038 83099 23864 56866 76839 71160 23161 -21572 -90020
23835i0020P745K6285N9574j0486m6847Q7862o1681j04404o9216J40199J4291
$$ -90020 -82275 -55990 3584 -6902 -53749 34113 -27568 -131972 -201188 -60989 -46698
23824d6698l4527p4217K0732P1887O6021P5595l25j77535l0084R6643J14993N4039
$$ -46698 -81225 -155442 -134710 -62823 3198 78793 78468 -99067 -129151 -32508 82485 136524
23812A36524r3359q1809L76L6089O2246M6682K2628m7233J115L439j22274q532
$$ 136524 43165 -38644 -38268 -2179 60067 106749 129377 82144 83259 86698 -35576 -44108
23800d4108j14039j4529N2465M7252J24298R750p376n9205l8246p0540m8101J525
$$ -44108 -158147 -172676 -120211 -72959 51339 61089 53713 -5492 -43738 -114278 -162379 -160854
23788a60854J03233L8604j0106O0159J562M2152l0442m3369r210K725J2545M8308
$$ -160854 -57621 -19017 -29123 31036 32598 74750 44308 939 -8271 -5546 6999 55307
23776E5307R7069n8997q7259m9769m4597m7945r632N5202m0593R876L5000n2624
$$ 55307 152376 93379 6120 -43649 -88246 -136191 -145823 -90621 -131214 -121338 -86338 -138962
23764a38962K7859K7062n4177l4259M8195M1720k5558o7506n4731R8313Q6247
$$ -138962 -111103 -84041 -138218 -172477 -124282 -82562 -108120 -175626 -230357 -132044 -45797
23753d5797J0533L2078k1152K3401N0653m1618o3550M6365L0271q3667R739P5356
$$ -45797 -35264 -3186 -24338 -937 49716 8098 -55452 -9087 21184 -62483 -52744 22612
23741B2612j5403l4601m526q111p8596K1304k2723j28561J5318J26147P0951J08296
$$ 22612 7209 -27392 -31918 -40029 -118625 -97321 -120044 -248605 -233287 -107140 -36189 72107
23729G2107p368j03952m3422j8321J17366L4562J0815n4522j13795o304N7477
$$ 72107 64739 -39213 -82635 -100956 16410 50972 61787 7265 -106530 -112834 -55357
23718e5357N0431k9161M9495R6383j3641n6244j09412r2634L0948R2493K1527
$$ -55357 -4926 -34087 15408 111791 98150 41906 -67506 -160140 -129192 -36699 -15172
23707a5172N137o648p181P4859Q0345k1409l724n1996k5669o6793q5702p649O9309
$$ -15172 -10035 -16683 -23864 50995 131340 109931 106207 54211 28542 -38251 -123953 -131602 -62293
23694f2293M4421n1869O6734J00721o7518l1215k2736r850J9524L2569R372L9527
$$ -62293 -17872 -69741 -3007 97714 30196 -1019 -23755 -33605 -14081 18488 27860 67387
23682F7387J6595o4451J6626M4553j358J2350q8946j36906L6366J00845o3470
$$ 67387 83982 19531 36157 80710 79352 91702 2756 -134150 -97784 3061 -60409
23671f0409Q2341Q631r2348k2502O6066J5701p6316j02150q4821L0022J56472
$$ -60409 21932 30563 -61785 -84287 -18221 -2520 -78836 -180986 -265807 -235785 -79313
23660g9313L5979l6615l1105j0981q0564P9809M9332p0483n4167m513L9992J37696
$$ -79313 -43334 -79949 -111054 -122035 -202599 -122790 -73458 -143941 -198108 -202621 -162629 -24933
23648b4933M4840j8665o5220l6519o4071p120K6237K7306K8959n8329o3384K0863
$$ -24933 19907 1242 -63978 -100497 -164568 -171688 -145451 -118145 -89186 -147515 -210899 -190036
23636a90036J34313L1756j4658p9691p1879Q8533N0420K9884Q9617q3627k02155
$$ -190036 -55723 -23967 -38625 -118316 -190195 -101662 -51242 -21358 68259 -15368 -217523
23625b17523J9369R7318K8303l6941M761Q1053J4172n529l1428n256O5135k9979
$$ -217523 -198154 -100836 -72533 -109474 -104713 -23660 -9488 -15017 -46445 -51701 13434 -16545
23613a6545n9152J452K7810n5311n2989j0253p6109R7105J81303l584o5564o1453
$$ -16545 -75697 -74245 -46435 -101746 -154735 -164988 -241097 -143992 37311 33727 -31837 -93290
23601i3290j7687M3948O754J0270K5981P1444l9983q0282Q6648P6617o0981q9911
$$ -93290 -110977 -67029 -60275 -50005 -24024 47420 7437 -72845 13803 90420 29439 -60472
23589f0472Q7105N2311q5870m1633r1642o0988N2233O1903l1570k9910J17768
$$ -60472 26633 78944 -6926 -48559 -140201 -201189 -148956 -87053 -118623 -148533 -30765
23578c0765J23228j51691m6652l550L828P431O0624O2062l8360J3198J23072r4069
$$ -30765 92463 -59228 -105880 -109430 -105602 -98171 -37547 24515 -13845 -647 122425 28356
23566B8356q2766n6034P4794M5849K8040j0243p4902k3076J7086J00763Q4476
$$ 28356 -54410 -110444 -35650 10199 38239 27996 -46906 -69982 -52896 47867 132343
23555A32343l1616q3337O289J8192J9272m3077j268j3709j9076k3295j43191p1931
$$ 132343 100727 17390 23679 41871 61143 18066 16798 3089 -15987 -39282 -182473 -254404
23543b54404K9268Q9771J57449k3191k3821J0895J00654k7977o9074q4816p3353
$$ -254404 -225136 -135365 22084 -1107 -24928 -14033 86621 58644 -10430 -95246 -168599
23532a68599j4150O9506m1363M0172O5824o3581p4165P8586J64492J32236l6585
$$ -168599 -182749 -113243 -154606 -114434 -48610 -112191 -186356 -107770 56722 188958 152373
23521A52373j52166o4163j6697K2553L4645M0886j9301J0280K5184K1892k2356
$$ 152373 207 -63956 -80653 -58100 -23455 17431 -1870 8410 33594 55486 33130
23510C3130k8986j3229m5145P2325q340n2784P8656N6592l9745q8178j13119j49802
$$ 33130 4144 -9085 -54230 18095 9755 -43029 35627 92219 52474 -35704 -148823 -298625
23498b98625M9266J62429L9976l4115P625k2260p4484P757p3306k6216N5473Q8621
$$ -298625 -249359 -86930 -46954 -81069 -73444 -95704 -170188 -162431 -235737 -261953 -206480 -117859
23486a17859J0544N4500L0508J2563M3188m2280n3176M2666J9733M9745N0710
$$ -117859 -107315 -52815 -22307 -9744 33444 -8836 -62012 -19346 387 50132 100842
23475A00842q3555K527J0434m0941L924J17189M3576o8098k7656Q538n5279l6577
$$ 100842 17287 19814 30248 -10693 -6769 110420 153996 85898 58242 66780 11501 -25076
23463b5076K124j1385J6495r4141o0173m5716M285j6375J38105R3390J7111l6784
$$ -25076 -22952 -34337 -17842 -111983 -172156 -217872 -213587 -229962 -91857 1533 18644 -18140
23451a8140r790M4342K6690k4351k8639R4505O5316j14866o4540j0293p8807J1377
$$ -18140 -27930 16412 43102 18751 -9888 84617 149933 35067 -29473 -39766 -118573 -107196
23439a07196K9066N6416J28680K0456m503q7197M6537K7240j28629O02L5865O5241
$$ -107196 -78130 -21714 106966 127422 122919 35722 82259 109499 -19130 -18528 17337 82578
23427H2578n3109k6468k3113k5160J8841j1595N9601R8119L478o3982J1656q490
$$ 82578 29469 3001 -20112 -45272 -26431 -38026 21575 119694 123172 59190 70846 62356
23415F2356L4759k0370o5325n2267M0678N1463K3846m3048L089K4125j8776l8318
$$ 62356 97115 76745 11420 -40847 -169 51294 75140 32092 35181 59306 40530 2212
23403B212M8565N3853j02019j28148n8147J60186O9419n6212k1721N8956J0910
$$ 2212 50777 104630 2611 -125537 -183684 -23498 45921 -10291 -32012 26944 37854
23392C7854r9280o9737m884J06051O5689P1420k1468m8960k3739R083m3619l0555
$$ 37854 -61426 -131163 -136047 -29996 35693 107113 85645 36685 12946 22029 -21590 -52145
23380e2145N8612R2998N4918M4749L1737p7373j85064j12048p8987J5839J71224
$$ -52145 6467 99465 154383 199132 230869 153496 -31568 -143616 -222603 -206764 -35540
23369c5540J6065L8834K859N7215Q3226m2024n913P3876L9293Q56l2119j33926
$$ -35540 -19475 19359 22218 79433 162659 120635 114722 188598 227891 228747 196628 62702
23357F2702j09548J4853P0355P3917M9544n480J4458K0078r8516K6219J040j6521
$$ 62702 -46846 -31993 38362 112279 161823 156343 170801 190879 92363 118582 119622 103101
23345A03101J1455j9268K2665k292L0350j2769k190P2925N045K2768q2307k4115
$$ 103101 114556 95288 117953 115661 146011 133242 131052 203977 209022 231790 149483 125368
23333A25368O580N0957K5981q1839L4321P2398J5042n8268k2663J5464n7695m5242
$$ 125368 131948 182905 208886 127047 161368 233766 248808 190540 167877 183341 125646 80404
23321H0404J1878N4461n0964M1807l5050m9900L4090J8061Q1932R983O2487K347
$$ 80404 92282 146743 95779 137586 102536 52636 86726 104787 186719 196702 259189 261536
23309B61536p3990Q9164L6749p4112N1708N4962O7748k4908J6383k5639r5720
$$ 261536 187546 276710 313459 239347 291055 346017 413765 388857 405240 379601 283881
23298B83881J8133N1278l8058p3371o487k7161L0264K9997l2622j5753M2183j2220
$$ 283881 302014 353292 315234 241863 235376 208215 238479 268476 235854 220101 262284 250064
23286B50064n431n9911M1370O6312K5946r6744k6507M6739Q6749J4482j0092L4972
$$ 250064 244633 184722 226092 292404 318350 221606 195099 241838 328587 343069 332977 367949
23274C67949L3686k7339L2922P5354M3406M910Q749P29p786J0054O642N5740K2866
$$ 367949 401635 374296 407218 482572 525978 530888 539637 540366 532580 542634 549276 605016 627882
23261F27882m4516k88P2408J64239Q4564O2659J73576j2604O8731J44673J10028
$$ 627882 583366 583078 655486 819725 904289 966948 1140524 1127920 1196651 1341324 1451352
23250A451352J30703K73227L11086K69253L41598K66432L31557M25802N62907
$$ 1451352 1582055 1855282 2166368 2435621 2777219 3043651 3375208 3801010 4363917
23241D363917P54898P39362N75097N35372M41602L15623K71750j15917m15693
$$ 4363917 5118815 5858177 6433274 6968646 7410248 7725871 7997621 7881704 7466011
23232G466011p01798q83895q76141p94512o98146n51215m98171l09644k45737
$$ 7466011 6764213 5880318 5004177 4209665 3511519 2960304 2462133 2152489 1906752
23223A906752l68361k62389k31398j11422k30229k91835n7625j3082K5469K1790
$$ 1906752 1538391 1276002 1044604 933182 702953 411118 353493 340411 365880 387670
23213C87670k3240r6363p3629L4098j5789j20867o2196q7150O0894J1079m3145
$$ 387670 364430 268067 194438 228536 212747 91880 29684 -57466 3428 14507 -28638
23202b8638j9785P6672J25534r6108o1052L8037L2169j6020j6288l1397P5208
$$ -28638 -48423 28249 153783 57675 -3377 34660 66829 50809 34521 3124 78332
23191G8332L7599j9759o9900J6809M4135k7977n9454m3214J5851j17595l8969
$$ 78332 115931 96172 26272 43081 87216 59239 -215 -43429 -27578 -145173 -184142
23180a84142L271J20531J02999n2749M901k2500M0234K9362n1726o5703L7096
$$ -184142 -180871 -60340 42659 -10090 -5189 -27689 12545 41907 -9819 -75522 -38426
23169c8426K4595k5240r759P2144O7907O1611J04054j00517j16912R1932l8250
$$ -38426 -13831 -39071 -48830 23314 91221 152832 256886 156369 39457 131389 93139
23158I3139j32071L2485Q1225n2131j7213k0463L8541O324q0279o0518j9132N8596
$$ 93139 -38932 -6447 74778 22647 5434 -15029 23512 29836 -50443 -110961 -130093 -71497
23146g1497J25059n031J0820r2490k4906K3552j1695M4623j7962q8284J3043L5475
$$ -71497 53562 48531 59351 -33139 -58045 -34493 -46188 -1565 -19527 -107811 -94768 -59293
23134e9293k0377L7980R589O5447M794q0083q6106L6437J8494k256M7841Q3309
$$ -59293 -79670 -41690 -32101 33346 38140 -41943 -128049 -91612 -73118 -75374 -27533 55776
23122E5776n9274n545Q1191q4147l7380P7531J11153j5619l7664p0293P817P5661
$$ 55776 -3498 -9043 72148 -11999 -49379 28152 139305 123686 86022 15729 23546 99207
23110I9207l4282p7232N1402p2293l7037Q126M9175Q2792j3257r044R727n8432
$$ 99207 64925 -12307 39095 -33198 -70235 -62109 -12934 69858 56601 47557 57284 -1148
23098a148l1949J456K9512j0122m5351J8003M8653o7169r195N7778j8411J1421
$$ -1148 -33097 -31641 -2129 -12251 -57602 -39599 9054 -58115 -67310 -9532 -27943 -16522
23086a6522K1791j7493n6663n4013N6798L5285n6650L8605m131M3136M5019L7492
$$ -16522 5269 -12224 -68887 -122900 -66102 -30817 -87467 -48862 -52993 -9857 35162 72654
23074G2654j4373O6662P1027k3367J3887m6732p9617k5406P7741P2884j7664k9723
$$ 72654 58281 124943 195970 172603 186490 139758 60141 34735 112476 185360 167696 137973
23062A37973o5707k8099R753q0869l1202q4378P8168J29692j01688O361J8617
$$ 137973 72266 44167 53920 -26949 -58151 -142529 -64361 65331 -36357 -29996 -11379
23051a1379J24972L7780j32606q6191r557M9057k6708q2513j17539p072P2928
$$ -11379 113593 151373 18767 -67424 -76981 -27924 -54632 -137145 -254684 -261756 -188828
23040a88828J18805L0208k1363J4200M4035P8008j9591j56937L4735N3220j6856
$$ -188828 -70023 -39815 -61178 -46978 -2943 75065 55474 -101463 -66728 -13508 -30364
23029c0364R385O5768o8810l5921M0561q162K3803N6050K2372q0261r8151n4738
$$ -30364 -20979 44789 -24021 -59942 -19381 -27543 -3740 52310 74682 -5579 -103730 -158468
23017a58468l3538O3430J27267q998p6096J1475k061l1300M8216Q030J1861O3447
$$ -158468 -192006 -128576 -1309 -10307 -86403 -74928 -76989 -108289 -60073 -52043 -40182 23265
23005B3265Q9555q4406J279O2276Q7815l0516o2405N9951o1120j15509L3786J12047
$$ 23265 112820 28414 29693 91969 179784 149268 86863 146814 85694 -29815 3971 116018
22993A16018J18869j2397j78342j3766M0084k2874j28646j11130K5977J23101
$$ 116018 234887 222490 44148 30382 70466 47592 -81054 -192184 -166207 -43106
22983d3106P5415M0260J8444M6759o2136l063m8131O5747L341P460P3441K2465
$$ -43106 32309 72569 91013 137772 75636 72573 24442 90189 93530 100990 174431 196896
22971A96896J5704j00401m2357o1596j2001K8518l9774M7805K0240n1516n5433
$$ 196896 212600 112199 69842 8246 -3755 24763 -15011 32794 53034 1518 -53915
22960e3915k3498Q61N7950j4390l3371Q8256M2357J9248k754j7979o9587J02472
$$ -53915 -77413 -76552 -18602 -32992 -66363 21893 64250 83498 80744 62765 -6822 95650
22948I5650l7216n3740J5328J558q7684P6242O4258j6786m0147p048k9509K5956
$$ 95650 58434 4694 20022 21580 -66104 10138 74396 57610 17463 10415 -19094 6862
22936F862N7198j347Q389o6979r3155n1923O8116r411O4123K3872J6618N1849
$$ 6862 64060 62713 71102 4123 -89032 -140955 -72839 -82250 -18127 5745 22363 74212
22924G4212j10312m6977L0070Q3223J49620j0201j00148k1278j1207q1141K701
$$ 74212 -36100 -83077 -53007 30216 179836 169635 69487 48209 37002 -44139 -41438
22913d1438m7973J660J3504N0484P8851j7849o3307J3277K0078M3753Q0035J179
$$ -41438 -89411 -87751 -74247 -23763 55088 37239 -26068 -12791 7287 51040 131075 132254
22901A32254q3043j4917N4743J6775m5067p0098o0417j5270k8831N602o0699L4905
$$ 132254 49211 34294 89037 105812 60745 -9353 -69770 -85040 -113871 -108269 -168968 -134063
22889a34063Q0896L1740R2540n458l9439N0471K2595j23681M8651J01099p6441
$$ -134063 -53167 -21427 71113 65655 26216 76687 99282 -24399 24252 125351 48910
22878D8910p9601J3424M2731P071R1610P796k1855O0874r2299j12780J0264k4551
$$ 48910 -30691 -17267 25464 32535 124145 131941 110086 170960 78661 -34119 -23855 -48406
22866d8406m8963J3128J09310l625j8933k0024l0108J3249q101N606J374P1526
$$ -48406 -97369 -84241 25069 21444 2511 -17513 -47621 -34372 -42473 -36867 -35493 36033
22854C6033j1654K7265J04441M2416r0861n8534r00l2173N9231m6104m7947N8509
$$ 36033 24379 51644 156085 198501 107640 49106 48206 16033 75264 29160 -18787 39722
22842C9722J8535o602K8659K2809m3082l7136R4119K6643M5946J04785n4213j60763
$$ 39722 58257 51655 80314 103123 60041 22905 117024 143667 189613 294398 240185 79422
22830G9422o8938O8927m732k6050R0473J15488j17097m7689Q1560m8745r9444
$$ 79422 10484 79411 74679 48629 139102 254590 137493 89804 171364 122619 23175
22819B3175l8772n607j4514J539N0836N4370M5876K1152m8382O0701m4035o6917
$$ 23175 -15597 -21204 -35718 -34179 16657 71027 116903 138055 89673 150374 106339 39422
22807C9422p6656p5100j5868P4850M4606M7343L3863k314l2540j0185J0874m7826
$$ 39422 -37234 -112334 -128202 -53352 -8746 38597 72460 70146 37606 27421 38295 -9531
22795i531l5101j6124M2181N3563M1464K4923n1521l2531L8728p29O3575M135
$$ -9531 -44632 -60756 -18575 34988 76452 101375 49854 17323 56051 55322 118897 123032
22783A23032J2118j6829P4951O0729o6640n164p414r8834p4125L8748P0423K7921
$$ 123032 135150 118321 193272 254001 187361 182197 174783 75949 1824 40572 110995 138916
22771A38916n0015j20556q0828K4777O5985m910J0161Q4594P3995J3207o109L6028
$$ 138916 88901 -31655 -112483 -87706 -21721 -26631 -16470 68124 142119 155326 149217 185245
22759A85245J7566J698j536p1156o0466p8346J499J39244K9937m8024l7952m9534
$$ 185245 202811 204509 202973 131817 71351 -6995 -5496 133748 163685 115661 77709 28175
22747B8175M484j3767N1987J3568L3183n207M854O629P9807m4231p4231k9151
$$ 28175 32659 18892 70879 84447 117630 112423 117277 123906 203713 159482 85251 56100
22735E6100r538m1716k5059N9556J747q296n5804R1431K3075l1524O3547m21j87827
$$ 56100 46562 4846 -20213 39343 41090 32794 -23010 68421 91496 59972 123519 123098 -64729
22722f4729k0726J52081J00537O3452r236j00549M3362J42606k0045j05811j05122
$$ -64729 -85455 66626 167163 230615 221379 120830 164192 306798 286753 180942 75820
22711G5820N534k2714N681l419P6306R5220M6266q838m5743m8108n2491n2855
$$ 75820 81354 58640 64321 60902 137208 232428 278694 269856 224113 176005 123514 70659
22699G0659K7340L5130P7078K7256j12387l3106p5565m0713P2306R9126K8813
$$ 70659 97999 133129 210207 237463 125076 91970 16405 -24308 47998 147124 175937
22688A75937j7805O5480K9928m5478n4803L4870J8934k9211k9465n484J4519J839
$$ 175937 158132 223612 253540 208062 153259 188129 207063 177852 148387 142903 157422 159261
22676A59261L3343Q0714r2994N525p467j1106j5355n4847L993p7217K7654L1904
$$ 159261 192604 273318 180324 185849 178382 167276 151921 97074 101067 23850 51504 83408
22664H3408L8991j4531L8552J6635L6377J069p7228N400r93P2040O4655J5234
$$ 83408 122399 107868 146420 163055 199432 200501 123273 128673 127680 199720 264375 279609
22652B79609N633j6474j4953j7257J3164R4896Q786r1505J1871l7868k3927K6138
$$ 279609 285242 268768 253815 236558 249722 344618 353404 261899 273770 235902 211975 238113
22640B38113N1110m6681l1056o7096Q2250K4448N3816K6270o7312j14052m0708
$$ 238113 289223 242542 211486 144390 226640 251088 304904 331174 263862 149810 109102
22629A09102J128J17319J14118m9796j44716J5899J4361p782j8675L4167N0066
$$ 109102 110230 227549 341667 291871 147155 163054 177415 169633 150958 185125 235191
22618B35191n9201o5019k7033J2679k7447L7632Q3255P3473k890l3606P650m2728
$$ 235191 175990 110971 83938 96617 69170 106802 190057 263530 260640 227034 234684 191956
22606A91956j02948l4620K7528P0214P2461k7125j1341J29429K5843o2191N6449
$$ 191956 89008 54388 81916 152130 224591 197466 186125 315554 341397 279206 335655
22595C35655l212o9029q6119r0074n9387R2393J73105m7037m5064n711r4577m9137
$$ 335655 332443 263414 177295 87221 27834 120227 293332 246295 201231 195520 100943 51806
22583E1806K6784N3063O3360N7961j765m5132p336N304L1526n7289L6034k8343
$$ 51806 78590 131653 195013 252974 251209 206077 198741 204045 235571 178282 214316 185973
22571A85973K9311P2286l377n71l0833p1139N7193K2299N7864M6002K7555j8402
$$ 185973 215284 287570 284193 283622 252789 181650 238843 261142 319006 365008 392563 374161
22559C74161j9524k3793K1506k538l6312k4272k7458n0485J094j7976p357p3936
$$ 374161 354637 330844 352350 349812 313500 289228 261770 211285 212379 194403 187046 113110
22547A13110J1238J22367Q8807k2041r850Q936N7202L194q7844J05099j1875m0492
$$ 113110 124348 246715 335522 313481 303631 312567 369769 372963 285119 390218 378343 337851
22535C37851j15259L2003L2444L5869Q6640M3508K8916m0144N1667J2195J5022
$$ 337851 222592 254595 287039 322908 409548 453056 481972 441828 493495 505690 520712
22524E20712K3903n2472N392J06713K044M112J13323J45126J87492J75304J77422
$$ 520712 544615 492143 497535 604248 606292 610404 723727 868853 1056345 1231649 1409071
22513A409071K77828K94417K63602K03610J25853m8075l86063m38912m58347k56439
$$ 1409071 1686899 1981316 2244918 2448528 2574381 2526306 2140243 1701331 1242984 986545
22503I86545j32660q0660j20040j00338p4144p307p2126p474K7649o3648j52151
$$ 986545 853885 773225 653185 552847 478703 471396 399270 391796 419445 355797 203646
22492B03646J7449O8320O2393n2292M3717O1842J7230N932j04829j22034q959
$$ 203646 221095 289415 351808 299516 343233 405075 422305 428237 323408 201374 192415
22481A92415J5176J1168J21939J40635N4688n8097q6868j8572J3801l2193l6706
$$ 192415 207591 218759 340698 481333 536021 477924 391056 372484 386285 354092 317386
22470C17386R2655O5438j8856l8951l7753l0317j10582n8348J3610K2616j4916
$$ 317386 410041 475479 456623 417672 379919 349602 239020 180672 194282 216898 201982
22459B01982l4308j6714J2910K1615J98993o5541n4818J24613K9476q9258k8616
$$ 201982 167674 150960 163870 185485 384478 318937 264119 388732 418208 328950 300334
22448C00334J2555j8246m9189J3217O0212o899m323R333J0222p476n825L9324
$$ 300334 312889 294643 245454 258671 318883 311984 307661 316994 327216 319740 313915 353239
22436C53239k1342j69302k3123M4842O6460N5409j2327J02342N4360p4384j33763
$$ 353239 331897 162595 139472 184314 250774 306183 293856 396198 450558 376174 242411
22425B42411M3290L797M0792M9119K1999M3458o5605L6426J70934k9923j34333
$$ 242411 285701 289498 330290 379409 401408 444866 379261 415687 586621 556698 422365
22414D22365k4194M4134J5282n2122j31348P2465P6052J1328q4212j1510n3016
$$ 422365 398171 442305 457587 405465 274117 346582 422634 433962 349750 338240 285224
22403B85224J4086J732J9978O8889j5269n4784K98q0721o7477J8334J09871j02938
$$ 285224 299310 301042 321020 389909 374640 319856 320154 239433 171956 190290 300161 197223
22391A97223o9427L4922Q6247M3333P6001o4444K4956m7151j5180N0807P1949
$$ 197223 127796 162718 248965 292298 368299 303855 328811 281660 266480 317287 389236
22380C89236L2475k0165j5237p2874l9466l2859j15562m1268J53166J22715J28211
$$ 389236 421711 401546 386309 313435 273969 241110 125548 84280 237446 360161 488372
22369D88372M94k7898m8603m3034p283m8824N8960O5123J04372j0974r6895n0331
$$ 488372 488866 460968 412365 369331 362048 313224 372184 437307 541679 530705 433810 383479
22357C83479K7863j02884n9275j6772Q6852L1713R4181J53746j7221J172N0776
$$ 383479 411342 308458 249183 232411 319263 350976 445157 598903 581682 582854 633630
22346F33630K5197K3005j03392o1490o0694m1844J0835j1708J2427R097n3964
$$ 633630 658827 681832 578440 516950 456256 414412 425247 413539 425966 435063 381099
22335C81099k0082L2442O4638k1145N2061P3402k5358K3409O7462l9636K78J0610
$$ 381099 361017 393459 458097 436952 489013 562415 537057 560466 627928 588292 588570 599180
22323E99180N9367J9154N7438M5343j17593j40131L1739N5116j15765m3862L912
$$ 599180 658547 677701 735139 780482 662889 522758 554497 609613 493848 449986 453898
22312D53898l9283K058J34842L3903m3630j1953n4446m0391k6068Q3520L5446
$$ 453898 414615 416673 551515 585418 541788 529835 475389 434998 408930 492450 527896
22301E27896m2412r7926p4373O6593k2053l6542J10400R3857J05159L0390p7384
$$ 527896 485484 387558 313185 379778 357725 321183 431583 525440 630599 660989 583605
22290E83605l6741n1701N6570M5011m6006j28043k2495N9824K6396n1852Q3647
$$ 583605 546864 495163 551733 596744 550738 422695 400200 460024 486420 434568 518215
22279E18215J16705m7905o1291l0158l7265p1227P4178N5405L693J14997K1553
$$ 518215 634920 587015 525724 495566 458301 387074 461252 516657 520350 635347 656900
22268F56900m8579r1512m4408J13273N2018n2394n9079O08K1669P7125l520n6502
$$ 656900 608321 516809 472401 585674 637692 585298 526219 526827 548496 625621 622101 565599
22256E65599L0407N526M9632N2705j2221M0513J6380M9101J08692O8874Q6094
$$ 565599 596006 601532 651164 703869 691648 732161 748541 797642 906334 975208 1061302
22245A061302J03908J05958J4093j6414P4713L0180J1098N0485j50860j28767
$$ 1061302 1165210 1271168 1285261 1268847 1343560 1373740 1384838 1435323 1284463 1155696
22235A155696j56054q8645q2385p2881p4421Q5004K2564p0345m2181k1772L783
$$ 1155696 999642 910997 828612 755731 681310 766314 788878 718533 676352 654580 658363
22224F58363L8882j6840p298R754M9414Q0558R960n954j0747j1432l5176k4550
$$ 658363 697245 680405 673107 682861 732275 812833 822793 816839 806092 794660 759484 734934
22212G34934J18623j1897m8477K2609K5587M8451j0619q0008p1801m0934J19886
$$ 734934 853557 841660 793183 815792 841379 889830 879211 799203 727402 686468 806354
22201H06354J51394K0450k3514O7124Q2313m4829m2240Q9604K907q1341q5682
$$ 806354 957748 978198 954684 1021808 1104121 1059292 1017052 1106656 1109563 1028222 942540
22190I42540o2863q2316J50j9361o1311n8139Q511N3474P6200L4354n9385L4222
$$ 942540 879677 797361 797511 778150 716839 658700 667211 720685 796885 831239 771854 806076
22178H06076O3261L963N5335p9350l2864P6221j8822l6084L6960j8126N7310R62
$$ 806076 869337 873300 928635 849285 816421 892642 873820 837736 874696 856570 913880 914842
22166I14842K4497M7409k7222k8097n3420J738L5269k6796l7107l2767N1390M5258
$$ 914842 939339 986748 959526 931429 878009 879747 915016 888220 851113 818346 869736 914994
22154I14994J25682j8377o8462R722M4143J7540j6656K7058L9653o0853j13391
$$ 914994 1040676 1022299 953837 963559 1007702 1025242 1008586 1035644 1075297 1014444 901053
22143I01053o8488M502J9720O1729J07944R6159M6284L5709j21616q069K3546
$$ 901053 832565 837067 856787 918516 1026460 1122619 1168903 1204612 1082996 1074927 1098473
22132A098473O4774J702m7696J2474L9238L5627J3032P2231O0915O7859m3907
$$ 1098473 1163247 1164949 1117253 1129727 1168965 1204592 1217624 1289855 1350770 1418629 1374722
22121A374722k9938k4506p5512j13687M2408P8650P6141m8905N0348M3166K3959
$$ 1374722 1344784 1320278 1244766 1131079 1173487 1252137 1328278 1279373 1329721 1372887 1396846
22110A396846n2369L6187P2256M0812o7449m3151J9857J1754k3991K4132o5787
$$ 1396846 1344477 1380664 1452920 1493732 1426283 1383132 1402989 1414743 1390752 1414884 1349097
22099A349097j9465P9197R2542q000l0257m6475l9970O2067Q7286K073K4654J6379
$$ 1349097 1329632 1408829 1501371 1493371 1463114 1416639 1376669 1438736 1526022 1528095 1552749 1569128
22087A569128K3238N6175N6991m5934k7845l0091J20256J13098L1146N1809L0313
$$ 1569128 1592366 1648541 1705532 1659598 1631753 1601662 1721918 1835016 1866162 1917971 1948284
22076A948284P4929J2823J13306O4261p9974q5385r024k7828q9671j42837j43475
$$ 1948284 2023213 2036036 2149342 2213603 2133629 2048244 2039220 2011392 1921721 1778884 1635409
22065A635409m3405j2211l7636j26049k6461J20139P3970k493L1869N3303J09397
$$ 1635409 1592004 1579793 1542157 1416108 1389647 1509786 1583756 1581263 1613132 1666435 1775832
22054A775832Q4333Q2833j9168P2596J00001P3900J22028J03200O2952K69422
$$ 1775832 1860165 1942998 1923830 1996426 2096427 2170327 2292355 2395555 2458507 2727929
22044B727929M14355L79145M30371L90708L65207M40298L45024l17355q08657
$$ 2727929 3142284 3521429 3951800 4342508 4707715 5148013 5493037 5175682 4367025
22035D367025o49120l59576k95098k67673j49242J07675J00751K5699k7725j44873
$$ 4367025 3717905 3358329 3063231 2795558 2646316 2753991 2854742 2880441 2852716 2707843
22025B707843p0427M0952k2526m7209k353Q2963Q7967J09170K2566l525k7929
$$ 2707843 2637416 2678368 2655842 2608633 2606280 2689243 2777210 2886380 2908946 2905421 2877492
22014B877492l5424R8591J10775R6284M5599l4377R6843J03104M204R8515Q2232
$$ 2877492 2842068 2940659 3051434 3147718 3193317 3158940 3255783 3358887 3363091 3461606 3543838
22003C543838Q5542O3028Q7407R4912M8880K6467J92268J37724r406J03379R5414
$$ 3543838 3629380 3692408 3779815 3874727 3923607 3950074 4142342 4280066 4270660 4374039 4469453
21992D469453P6454J17697J42931N1949J21513Q2533N1201R5792K46339J60624
$$ 4469453 4545907 4663604 4806535 4858484 4979997 5062530 5113731 5209523 5455862 5616486
21982E616486K10321M11079K56150Q7309J77714K89722L51909K96141K68028J80087
$$ 5616486 5826807 6237886 6494036 6581345 6759059 7048781 7400690 7696831 7964859 8144946
21972H144946L09257M00696M14695M66701M99912N39975O50368P74481O91191
$$ 8144946 8454203 8854899 9269594 9736295 10236207 10776182 11426550 12201031 12892222
21963A2892222Q94560J030556J162898J208851J482612J809649J986984K381189
$$ 12892222 13786782 14817338 15980236 17189087 18671699 20481348 22468332 24849521
21955B4849521K899544L617257M591240O075714Q257743J1693340J7347982K6691620
$$ 24849521 27749065 31366322 35957562 42033276 50291019 61984359 79332341 106023961
21947A06023961M0620189N6147492O6160827O6162057O3110095P2078547Q3513376
$$ 106023961 146644150 202791642 268952469 335114526 398224621 470303168 553816544
21940E53816544K9765627r7110298j64834770j27616639p2944124m0540346k3766501
$$ 553816544 583582171 486471873 321637103 194020464 121076340 80535994 56769493
21933E6769493j4928762j0068480p130176n032150l646338k649794j940490j466124
$$ 56769493 41840731 31772251 24642075 19609925 15963587 13313793 11373303 9907179
21925I907179j157524q18450n37589k37839J55497L49045L15700N96485J129469
$$ 9907179 8749655 7931205 7393616 7155777 7311274 7660319 7976019 8572504 9701973
21916I701973J575634K021152K398634K597142K562409K436101K008745Q61836
$$ 9701973 11277607 13298759 15697393 18294535 20856944 23293045 25301790 26163626
21908B6163626j452152l853456m946292m449910l249213k125679j618207j165573
$$ 26163626 24711474 20858018 15911726 11461816 8212603 6086924 4468717 3303144
21900C303144q98819p61521n79591l33067k64375j55216j10676j31101j42250
$$ 3303144 2404325 1642804 1063213 730146 465771 310555 199879 68778 -73472
21891g3472j08824j17050o5046j0357R286N7942L3029M3374R1635M9247N8356
$$ -73472 -182296 -299346 -364392 -374749 -365463 -307521 -274492 -231118 -139483 -90236 -31880
21880c1880J6357M4637J82843J60089P0170Q8219J66181K68789L23200k349l65726
$$ -31880 -15523 29114 211957 372046 442216 530435 696616 965405 1288605 1286256 920530
21869I20530l65785j61640j23030K9016N8375P6080Q1303N1530J48938J76155
$$ 920530 554745 393105 270075 299091 357466 433546 514849 566379 715317 891472
21859H91472K44093J77065J91688K24923M33324N49948K74874l79963k90259O8207
$$ 891472 1135565 1312630 1504318 1729241 2162565 2712513 2987387 2607424 2317165 2385372
21849B385372L43216L80465J1630q9573J47677K49328L11866L57811M40460J1466
$$ 2385372 2728588 3109053 3120683 3031110 3178787 3428115 3739981 4097792 4538252 4549718
21839D549718n54255p03788l33199k03729j93753o1936j9735J09988J42134J97444
$$ 4549718 3995463 3291675 2958476 2754747 2560994 2499058 2479323 2589311 2731445 2928889
21829B928889J01860M3379Q6726R3500R2402J64120J44027J20737J09056M8749
$$ 2928889 3030749 3074128 3160854 3254354 3346756 3510876 3654903 3775640 3884696 3933445
21819C933445J01803L1461o6223j48891q6623o6061N751j26920j84167j07553
$$ 3933445 4035248 4066709 4000486 3851595 3764972 3698911 3704662 3577742 3393575 3286022
21809C286022m3694j49058j08009n0746K2529n3525n6775K9219n7818o3207j28160
$$ 3286022 3242328 3093270 2985261 2934515 2957044 2903519 2846744 2875963 2818145 2754938 2626778
21798B626778j20236l2349N8811k2448j19975m8021K9208J5168N6462P4749J3341
$$ 2626778 2506542 2474193 2533004 2510556 2390581 2342560 2371768 2386936 2443398 2518147 2531488
21787B531488N8734J10290R5216J17116K04055K44381J27772K39452L00585M27117
$$ 2531488 2590222 2700512 2795728 2912844 3116899 3361280 3489052 3728504 4029089 4456206
21777D456206L32029K80647M74072O02532R59735J371610J777659K089572K417204
$$ 4456206 4788235 5068882 5542954 6145486 7105221 8476831 10254490 12344062 14761266
21768A4761266K521128K385978K100065J389065j34194k120300l680689l895694
$$ 14761266 17282394 19668372 21768437 23157502 23023308 20903008 17222319 13326625
21760A3326625l316978k562691j842941j282823r90292p71313n12083l81995l79378
$$ 13326625 10009647 7446956 5604015 4321192 3330900 2559587 2047504 1665509 1286131
21751A286131k80538j64456k33533j80217q0341p0612j14309p0797r4052j07459
$$ 1286131 1005593 841137 607604 427387 347046 276434 162125 91328 -2724 -110183
21741a10183Q2669R1754k0212n4610m2082l4252M9922p3635j20373n8531p0242
$$ -110183 -27514 64240 44028 -10582 -52664 -86916 -36994 -110629 -231002 -289533 -359775
21730c59775l2395q4062Q2505M3104M7718J42781J3690j146p1353K697M9936Q021
$$ -359775 -392170 -476232 -393727 -350623 -302905 -160124 -146434 -147580 -218933 -216236 -166300 -158279
21718a58279p5540j15178m8809L0560L8779l148j3794j5584k9359J0627M8751
$$ -158279 -233819 -348997 -397806 -367246 -328467 -331615 -345409 -360993 -390352 -379725 -330974
21707c30974J925N7341N6830J0205N2673Q9151j3184j18687q0272K7071J00123
$$ -330974 -329049 -271708 -214878 -204673 -152000 -62849 -76033 -194720 -274992 -247921 -147798
21696a47798r891p6883k9626q7966k896K2667P301K3437L0818j11P4516m4764
$$ -147798 -157689 -234572 -264198 -352164 -355060 -332393 -325092 -301655 -270837 -270948 -196432 -241196
21684b41196j19323n7855L8744k5490l7006J4513J02810J19787j4332K1467O4997
$$ -241196 -360519 -418374 -379630 -405120 -442126 -427613 -324803 -205016 -219348 -197881 -132884
21673a32884O8983K730q6656n3500o6147J15056O7491L6016J1589q2707n7908
$$ -132884 -63901 -61171 -147827 -201327 -267474 -152418 -84927 -48911 -37322 -120029 -177937
21662a77937J10745k5518q804K0831j11142k7737J477k0005r80J5026k8171l5522
$$ -177937 -67192 -92710 -101514 -80683 -191825 -219562 -218085 -238090 -239070 -224044 -252215 -287737
21650b87737j1568m8104R8361O7729L0845P9514J130p0985O457L1837n3453n0180
$$ -287737 -299305 -347409 -249048 -181319 -150474 -70960 -69830 -140815 -134358 -102521 -155974 -206154
21638b06154o700k5046O3310Q749l8527l1739l713J35248J13558p1306L895p8430
$$ -206154 -212854 -237900 -174590 -165841 -204368 -236107 -239820 -104572 8986 -62320 -58425 -136855
21626a36855j4793P7637o254O1076j2153j9554N0568R5475O5972k5502p5405q6963
$$ -136855 -151648 -74011 -80265 -19189 -31342 -50896 -328 95147 161119 135617 60212 -26751
21614b6751K4069L4590K2128P167j434m1496p7377l9599J76816J44711K9745M1319
$$ -26751 -2682 31908 54036 61203 59769 18273 -59104 -98703 78113 222824 252569 293888
21602B93888O8629J8024R5167J62112O6041M1748j9720n916l8458m7865j42882
$$ 293888 362517 380541 475708 637820 703861 745609 725889 719973 681515 633650 490768
21591D90768j91630j54144k2343N3981j10132j28132m6352N4112K434m1007n823
$$ 490768 299138 144994 122651 176632 66500 -61632 -107984 -53872 -51438 -92445 -98268
21580i8268J7641k0570p8818o248P9848L4719p9630r487K7467M1904m0780q4130
$$ -98268 -80627 -101197 -180015 -186263 -106415 -71696 -151326 -160813 -133346 -91442 -132222 -216352
21568b16352p6013K096J41826J13660O8587L6991n931m5220l0526j3789j74262
$$ -216352 -292365 -290269 -148443 -34783 33804 70795 64864 19644 -10882 -24671 -198933
21557a98933K1062o139K9970r298j6910M6673j7772k7188k2401l4261k6417l998
$$ -198933 -177871 -184010 -154040 -163338 -180248 -133575 -151347 -178535 -200936 -235197 -261614 -265612
21545b65612M1187L4671n258K8275O4130j4665M7272N0011l5551N1678J5572L8301
$$ -265612 -224425 -189754 -195012 -166737 -102607 -117272 -70000 -19989 -55540 -3862 11710 50011
21533E0011n8556j54407m7988m6873J999R1786R016M2427O999Q9530R7066q3598
$$ 50011 -8545 -162952 -210940 -257813 -255814 -164028 -155012 -112585 -105586 -16056 81010 -2588
21521b588p7436o6486l2795r3419j3836J62956J19301O6907K1278n3805l941J8740
$$ -2588 -80024 -146510 -179305 -272724 -286560 -123604 -4303 62604 83882 30077 26136 44876
21509D4876j2466N6370k6577q0837K0582Q5924l6485n8230r6689L241J07845J1904
$$ 44876 32410 88780 62203 -18634 1948 87872 51387 -6843 -103532 -100291 7554 19458
21497A9458m3947q5641l1598J1538k2491k3385j9954N0804M6141R4973L7913l8384
$$ 19458 -24489 -110130 -141728 -130190 -152681 -176066 -196020 -145216 -99075 -4102 33811 -4573
21485d573j29638j2816P6154J30408j0507q4708L7769L9986M5706L0034P3561
$$ -4573 -134211 -147027 -70873 59535 49028 -35680 2089 42075 87781 117815 191376
21474A91376o0539j19910K3652J31760K8279n0307q866L0003m0278p8279k5624
$$ 191376 130837 10927 34579 166339 194618 144311 135445 165448 125170 46891 21267
21463B1267p886J0573J07348q1596q3589l2585k8364O355K3477o9311L5911J35362
$$ 21267 13381 23954 131302 49706 -33883 -66468 -94832 -88477 -65000 -134311 -98400 36962
21451C6962O007n1758j3943K0185m744Q646J03171K3128m0243J5466k4334p2080
$$ 36962 42969 -8789 -22732 -2547 -7291 1355 104526 127654 87411 102877 78543 6463
21439F463j070O8162R9521O2616n8431n2481j5754p5446M564Q9165M4567p6104
$$ 6463 5393 73555 173076 235692 177261 124780 109026 33580 38144 127309 171876 95772
21427I5772L6849N7693N2100N4102q5435o5256K3295M7691P442L0342j37523r1201
$$ 95772 132621 190314 242414 296516 211081 145825 169120 216811 224253 254595 117072 25871
21415B5871k0782P3859j7020J9771L010l0039J00904Q3267Q4476M2296m6587k8643
$$ 25871 5089 78948 61928 81699 84709 54670 155574 238841 323317 365613 319026 290383
21403B90383m4712K1874l8133p0654n0063K9664j1111L7972J8787J06005O4328
$$ 290383 245671 267545 229412 158758 108695 138359 127248 165220 184007 290012 354340
21392C54340n8110p0982O4930L2703q5290L5105R9908L1281L9292P3114r1065
$$ 354340 296230 225248 290178 322881 237591 272696 372604 403885 443177 516291 425226
21381D25226m0831L5054L0591J30312K9814L0116M6243M3415N6920O7169J25434
$$ 425226 384395 419449 450040 580352 610166 640282 686525 729940 786860 854029 979463
21370I79463K40435J98468L90968K17272J21418K30918J98942J40730o4440l26334
$$ 979463 1219898 1418366 1809334 2026606 2148024 2378942 2577884 2718614 2654174 2327840
21360B327840l25242l79506k89119j98830o4025j06608j53754j11530n7317K8769
$$ 2327840 2002598 1623092 1333973 1135143 1071118 964510 810756 699226 641909 670678
21350F70678L5179L1222k5992l4820k3708j3282k2685L2907m7477l0318o0990
$$ 670678 705857 737079 711087 676267 652559 639277 616592 649499 602022 571704 510714
21339E10714l4706N9623R1420L4508r5010n2101j9999m9946L5035J2481J5711
$$ 510714 476008 535631 627051 661559 566549 514448 494449 444503 479538 492019 507730
21328E07730r0504M237N7119L6401j7608j9674N2375M5867K3438L2243m0983j12870
$$ 507730 417226 421463 478582 514983 497375 477701 530076 575943 599381 631624 590641 477771
21316D77771l6692l3833L1446N357L2576q2022N6770Q5796K1493K1030n8070p3886
$$ 477771 441079 407246 438692 444049 476625 394603 451373 537169 558662 579692 521622 447736
21304D47736N1626J04126L0884n5217l5054Q504m6555n8853J7730J8806k2046
$$ 447736 499362 603488 634372 579155 544101 552605 506050 447197 464927 483733 461687
21293D61687M7540L3802o4087L9289J42137o8708l9413K9232J10053R1849O1276
$$ 461687 509227 543029 478942 518231 660368 591660 552247 581479 691532 783381 844657
21282H44657p7959m7478L6568P4327J5546L4656J33523J9806p8054k7906J75584
$$ 844657 766698 719220 755788 830115 845661 880317 1013840 1033646 955592 927686 1103270
21271A103270N3534p330O0335J34559M2149L580o600L6613N3424J46415J90630
$$ 1103270 1156804 1149474 1209809 1344368 1386517 1390097 1383497 1420110 1473534 1619949 1810579
21260A810579R8726K0316M6450J77746R3261Q2742J70467K85693J96317J92094
$$ 1810579 1909305 1929621 1976071 2153817 2247078 2329820 2500287 2785980 2982297 3174391
21250C174391K58709L31243K94731L62777M42879O41904J115533J866130K763816
$$ 3174391 3433100 3764343 4059074 4421851 4864730 5506634 6622167 8488297 11252113
21241A1252113L507215M209418M409477M545667N363812M246601q21269n961533
$$ 11252113 14759328 18968746 23378223 27923890 33287702 37534303 36713034 30751501
21233C0751501r612066q355898m678266k532224j460362p73782n88609m25312
$$ 30751501 21139435 12783537 8105271 5573047 4112685 3338903 2750294 2324982
21225B324982k93046k63069j85087k34890j40737o7985r0344n6713j38494p4317
$$ 2324982 2031936 1768867 1583780 1348890 1208153 1140168 1049824 993111 854617 780300
21215G80300m0760J4901l91Q3452j5881j76616p9032M9719K4171M0715j2249L6488
$$ 780300 739540 754441 754050 837502 821621 645005 565973 615692 639863 680578 668329 704817
21203G04817O152j3763r9832n5368O1919k0423p2918j9159J3932L2104n1732j06679
$$ 704817 710969 697206 597374 542006 603925 583502 510584 491425 505357 537461 485729 379050
21191C79050j8591P8588O8702P2450k9303M240j38K2181l5308j8676K2551o0103
$$ 379050 360459 439047 507749 580199 550896 555136 554998 577179 541871 523195 545746 485643
21179D85643j0203J17345j7013K5907l7922l1450P1953j02144l4383K1210n1613
$$ 485643 475440 592785 575772 601679 563757 532307 604260 502116 467733 488943 437330
21168D37330O6131n939M2957r154K697J22117j7301j2598q8154l0156N317Q3086
$$ 437330 503461 497522 540479 531325 534022 656139 638838 626240 538086 507930 513247 596333
21156E96333l704m8885M6129j4010l43J32164N8705j7730R747o971j3614K6240
$$ 596333 592629 543744 589873 575863 575520 707684 766389 748659 758406 751435 737821 764061
21144G64061Q018J16354L359r1319n0075Q24J07L0556L5957J0479J6359j4154
$$ 764061 772079 888433 891792 800473 750398 751222 751329 781885 817842 828321 844680 830526
21132H30526m4954l3523m1776j0456k7728M4088J5189j3379K4792j1679K9720
$$ 830526 785572 752049 710273 699817 672089 716177 731366 717987 742779 731100 760820
21121G60820J19351J1340l3777n1234m9443k4473j28357q255J13998J08542P7980
$$ 760820 880171 891511 857734 806500 757057 732584 604227 595972 709970 818512 896492
21110H96492J21399P2352k623P9831J0184j9357N9545J72233K61207J25625k894
$$ 896492 1017891 1090243 1087620 1167451 1177635 1158278 1217823 1390056 1651263 1776888 1773994
21099A773994j37926j02955n2587J9288J7270l7349j8761K4559O1738J3982j4760
$$ 1773994 1636068 1533113 1480526 1499814 1517084 1479735 1460974 1485533 1547271 1561253 1546493
21088A546493j58321j05980j97070j25309j00004o5225l159Q5857J0081N4852
$$ 1546493 1388172 1282192 1085122 959813 859809 794584 791425 877282 887363 942215
21078I42215P7908l7804k040J4193K131q2675j6520j695K7714P2342j0359J0310
$$ 942215 1020123 982319 980279 994472 996603 913928 897408 895713 923427 995769 985410 995720
21066I95720J2712L9837m4257m6089k116o0852j5221J29374J27319K8554j3531
$$ 995720 1008432 1048269 1004012 957923 955807 894955 879734 1009108 1136427 1164981 1151450
21055A151450n8469N5221J04728J7872P0841J60904J90541J35037r4522j29810
$$ 1151450 1092981 1148202 1252930 1270802 1341643 1502547 1693088 1828125 1733603 1603793
21045A603793j43629j16096p1653j32126q9261Q7220q5382j0383M1947M448n890
$$ 1603793 1460164 1344068 1272415 1140289 1051028 1138248 1052866 1042483 1084430 1088878 1082988
21034A082988l7232k0963r3841r5111m9047P8689J76555P7646j6126K21j951n0575
$$ 1082988 1045756 1024793 930952 835841 786794 865483 1042038 1119684 1103558 1103779 1101828 1051253
21022A051253K5005m665r72J14625L4389o0797m9760l3111J321J12497O5577q0961
$$ 1051253 1076258 1071593 1070621 1185246 1219635 1158838 1109078 1075967 1077288 1189785 1255362 1174401
21010A174401N5868L7337r487J10100j1240m8997j5904o4911N7639J0221q6985
$$ 1174401 1230269 1267606 1258119 1368219 1356979 1307982 1292078 1227167 1284806 1295027 1208042
20999A208042n7970M8991l64K336R1692J66383Q8664l7072j11105n5824j9798
$$ 1208042 1150072 1199063 1198699 1201035 1292727 1459110 1547774 1510702 1399597 1343773 1323975
20988A323975o390M9811O864n269K5662L0706j5328k0307M5210j2506K6958k5877
$$ 1323975 1317585 1367396 1374260 1368991 1394653 1425359 1410031 1389724 1434934 1422428 1449386 1423509
20976A423509O2441J7477m543j385K215l380K2369m1480L2459Q405J02169l0420
$$ 1423509 1485950 1503427 1498884 1497499 1499714 1496334 1518703 1477223 1509682 1518087 1620256 1589836
20964A589836J0138R7120l3767l4577k1200P428P6266p1030M5748N0331O6996
$$ 1589836 1599974 1697094 1663327 1628750 1607550 1614978 1691244 1620214 1665962 1716293 1783289
20953A783289p1455j19926o0932R5233m952L2866J1194n9292J4118J12361P5702
$$ 1783289 1711834 1591908 1530976 1626209 1621257 1654123 1665317 1606025 1620143 1732504 1808206
20942A808206k8929m1825j8976J3195n8393j7031J06400N7735n5208M4986K7819
$$ 1808206 1779277 1737452 1718476 1731671 1673278 1656247 1762647 1820382 1765174 1810160 1837979
20931A837979m9178n5207K7653J07950K1192j8197K2211j888L5555M6534m320
$$ 1837979 1788801 1733594 1761247 1869197 1890389 1872192 1894403 1892515 1928070 1974604 1970284
20920A970284n3822q6358N9643P2315n6457k1547j0141n3745L0806J5259K0230
$$ 1970284 1916462 1830104 1889747 1962062 1905605 1884058 1873917 1820172 1850978 1866237 1886467
20909A886467P0743N6622l1306L1710Q303N4657K6061Q0320K3641l0284p0347
$$ 1886467 1957210 2013832 1982526 2014236 2022539 2077196 2103257 2183577 2207218 2176934 2106587
20898B106587m4382l6049L0254J48454R1793j5917q2076p5660o3324P5066M4095
$$ 2106587 2062205 2026156 2056410 2204864 2296657 2280740 2198664 2123004 2059680 2134746 2178841
20887B178841m5214l4097N1151J17035o4880J4395P904O7910M2887l0469j3607
$$ 2178841 2133627 2099530 2150681 2267716 2202836 2217231 2225135 2293045 2335932 2305463 2291856
20876B291856M2693K4475j810K4338l611J4254N0586p2445k0999K6386p8663l6255
$$ 2291856 2334549 2359024 2357214 2381552 2377941 2392195 2442781 2370336 2349337 2375723 2297060 2260805
20864B260805P5281J27142J44922M540n5515Q8259N9815K1586N5026N5859r4916
$$ 2260805 2336086 2463228 2608150 2612690 2557175 2645434 2705249 2726835 2781861 2837720 2742804
20853B742804j01207j8622J12495K239j02675N2833n384k2868k1698J39228O4208
$$ 2742804 2641597 2622975 2735470 2737709 2635034 2687867 2682483 2659615 2637917 2777145 2841353
20842B841353j281r3651q6752P1927N2031K9908r58j9172N9874N6956L534O883
$$ 2841353 2840072 2746421 2659669 2731596 2783627 2813535 2812577 2793405 2853279 2910235 2913769 2920652
20830B920652j04083Q168L8891k1837O6571K6221J46437O3791N6896J737J7841
$$ 2920652 2816569 2824737 2863628 2841791 2908362 2934583 3081020 3144811 3201707 3203444 3221285
20819C221285p2906j13680M921K7052L3132K0657M499j1156k898p95Q6765J02571
$$ 3221285 3148379 3034699 3039620 3066672 3099804 3120461 3124960 3113804 3110906 3110111 3196876 3299447
20807C299447L7136r838L0447Q9574j1351n8084n7133L6691L2827L7124M6790
$$ 3299447 3336583 3326745 3357192 3446766 3435415 3377331 3320198 3356889 3389716 3426840 3473630
20796C473630O3355M0447O999p1990J2767N4616L3361l394j9995J725O5895N0038
$$ 3473630 3536985 3577432 3584431 3512441 3525208 3579824 3613185 3609791 3589796 3591521 3657416 3707454
20784C707454L8217J50k6477j31118K9613J08751J9378R9413J2319j5448j3457
$$ 3707454 3745671 3745821 3719344 3588226 3617839 3726590 3745968 3845381 3857700 3842252 3828795
20773C828795K0075N2666J31413K4056K8013q3029P303J2189j03866o5623Q619
$$ 3828795 3848870 3901536 4032949 4057005 4085018 4001989 4009292 4021481 3917615 3851992 3860611
20762C860611P4951K8146J6131k1126O6872m9713L0319L4868O6690J23287K8690
$$ 3860611 3935562 3963708 3979839 3958713 4025585 3975872 4006191 4041059 4107749 4231036 4259726
20751D259726o2595n0791P9250K3553n3078N6328Q6165O064K0331L906p0824O6707
$$ 4259726 4197131 4146340 4225590 4249143 4196065 4252393 4338558 4344622 4364953 4368859 4298035 4364742
20739D364742P9858N6779J118J3147n236O1973L5935k2420J1251k8147o1632O5684
$$ 4364742 4444600 4501379 4502497 4515644 4510408 4572381 4608316 4585896 4597147 4569000 4507368 4573052
20727D573052J30010K6281j04602m1521J08015K7727r929O1786q4282M076R1096
$$ 4573052 4703062 4729343 4624741 4583220 4691235 4718962 4709033 4770819 4686537 4690613 4781709
20716D781709n850k9439Q3433K6477l0006J17480N1316J0832L1782p351q083J15104
$$ 4781709 4775859 4746420 4829853 4856330 4826324 4943804 4995120 5005952 5037734 5030383 5022300 5137404
20704E137404O5249J659N6685r615K9319J9013J32943L1431N145p2639n921r646
$$ 5137404 5202653 5204312 5260997 5251382 5280701 5299714 5432657 5464088 5469233 5396594 5390673 5381027
20692E381027m99L6176O7621J7694J5781J53009j1550M7836K9581o2733o8660
$$ 5381027 5380528 5416704 5484325 5502019 5517800 5670809 5659259 5707095 5736676 5673943 5605283
20681E605283Q7203K5551K911L8855P1805O1002O811l0052j5221J2521Q2815M2923
$$ 5605283 5692486 5718037 5720948 5759803 5831608 5892610 5899421 5869369 5854148 5866669 5949484 5992407
20669E992407o1654j20300L3125J24301O0780J14374m63j0068M016j2868K9290
$$ 5992407 5930753 5810453 5843578 5967879 6028659 6143033 6142570 6132502 6136518 6123650 6152940
20658F152940O3048M5334l8326M4070J67810L8512K6308O9143J1948o5891j5680
$$ 6152940 6215988 6261322 6222996 6267066 6434876 6473388 6499696 6568839 6580787 6514896 6499216
20647F499216O9442P9743M637J8272P2338M9797M3981l1667J8428K0118l1016
$$ 6499216 6568658 6648401 6653038 6671310 6743648 6793445 6837426 6805759 6824187 6844305 6813289
20636F813289k8540R7599P5747N6266N9248J9886n3913J18582J49107K6995l1705
$$ 6813289 6784749 6882348 6958095 7014361 7073609 7093495 7039582 7158164 7307271 7334266 7302561
20625G302561K1605M1812K1517M1689M7403J3336l8044O746P0422K4328K8710
$$ 7302561 7324166 7365978 7387495 7429184 7476587 7489923 7451879 7458625 7529047 7553375 7582085
20614G582085o146Q4043J19181O276m4180L4440j5324J52864J26306Q7774o3916
$$ 7582085 7575939 7659982 7779163 7785439 7741259 7775699 7760375 7913239 8039545 8127319 8063403
20603H063403j0369L8423J72195J55241L3894k8256M0967N1876L4425m9429L5273
$$ 8063403 8053034 8091457 8263652 8418893 8452787 8424531 8465498 8517374 8551799 8502370 8537643
20592H537643K3975O6097P524L792Q1023R0385Q4113P7759K6264Q8214L4427k0738
$$ 8537643 8561618 8627715 8635239 8639031 8720054 8810439 8894552 8972311 8998575 9086789 9121216 9100478
20580I100478O0019P1811l0481R614J13631M1274K9051J16106J28690J8084K8854
$$ 9100478 9160497 9232308 9201827 9211441 9325072 9366346 9395397 9511503 9640193 9658277 9687131
20569I687131R7895J3459P123L5159J17340J08590l375q6397O8850J11548J05348
$$ 9687131 9785026 9798485 9805608 9840767 9958107 10066697 10063322 9976925 10045775 10157323 10262671
20558A0262671M0981M019n0095m0696J06524J26864O3799J5952l152P1007J65300
$$ 10262671 10303652 10307671 10257576 10216880 10323404 10450268 10514067 10530019 10526867 10597874 10763174
20547A0763174P3959O958n251O233N2132P5582J52034J46610J7000N3291Q9218
$$ 10763174 10837133 10844091 10838840 10845073 10897205 10972787 11124821 11271431 11288431 11341722 11430940
20536A1430940R0344J30953J6885N2658N4962n2274p346N0216M4847J60264N9475
$$ 11430940 11521284 11652237 11669122 11721780 11776742 11724468 11717122 11767338 11812185 11972449 12031924
20525A2031924Q5001j7149J6082J39203P3673J18807J29011P3626J13397Q0430
$$ 12031924 12116925 12099776 12115858 12255061 12328734 12447541 12576552 12650178 12763575 12844005
20515A2844005K1176O7876P7492l8948k4761N7171m902O9489J58256J26257Q6111
$$ 12844005 12865181 12933057 13010549 12971601 12946840 13004011 12999109 13068598 13226854 13353111 13439222
20504A3439222R536K4886k5297L2119R3570J02384J59509J140K3626R9277O9378
$$ 13439222 13448758 13473644 13448347 13480466 13574036 13676420 13835929 13837069 13860695 13959972 14029350
20493A4029350K0959L8967N977N2537J08987j051P8436M0783K3611N0090Q6459
$$ 14029350 14050309 14089276 14095253 14147790 14256777 14255726 14334162 14374945 14398556 14448646 14535105
20482A4535105J24168Q1634J46851P7533M0254J19279O3367k0491o0045p4335
$$ 14535105 14659273 14740907 14887758 14965291 15005545 15124824 15188191 15167700 15107655 15033320
20472A5033320M1962J43662J43989O4402P6751N2647m0388P8826J10280J00563
$$ 15033320 15075282 15218944 15362933 15427335 15504086 15556733 15516345 15595171 15705451 15806014
20462A5806014J25058M3455R4175K7968J8841o955q4526o3990J07948J60139J72581
$$ 15806014 15931072 15974527 16068702 16096670 16115511 16108556 16024030 15960040 16067988 16228127 16400708
20451A6400708Q7688L1541P2996k7746n2757L7984M3117L8803R1720j0692L6410
$$ 16400708 16488396 16519937 16592933 16565187 16512430 16550414 16593531 16632334 16724054 16713362 16749772
20440A6749772L5518J29425Q7820J3633K6763M3585l3720K0215N7895j4743M3577
$$ 16749772 16785290 16914715 17002535 17016168 17042931 17086516 17052796 17073011 17130906 17116163 17159740
20429A7159740P4174K397j7056m8759N5821N9678L7877j0466L8930O0111O8832
$$ 17159740 17233914 17236311 17219255 17170496 17226317 17285995 17323872 17313406 17352336 17412447 17481279
20418A7481279R8627J49587p703m9238j9178j1328o0976N88J58914j9595n5221
$$ 17481279 17579906 17729493 17721790 17672552 17653374 17642046 17581070 17581658 17740572 17720977 17665756
20407A7665756j05190M3905J01172R9199o1376m270k4166q7657p8971p5491O5617
$$ 17665756 17560566 17604471 17705643 17804842 17743466 17739196 17715030 17627373 17548402 17472911 17538528
20396A7538528J39227M6335j30698o859N4756l4888L743l1867o0437K6870J6664
$$ 17538528 17677755 17724090 17593392 17586533 17641289 17606401 17610144 17578277 17517840 17544710 17561374
20385A7561374L1476M5734l2363O9514o5350r8163j3868j6138o7753K6697n428
$$ 17561374 17592850 17638584 17606221 17675735 17610385 17512222 17498354 17482216 17414463 17441160 17435732
20374A7435732L7633N2498k8088n9416m2063q9509o9105K6896M7252k6838p8819
$$ 17435732 17473365 17525863 17497775 17438359 17396296 17306787 17237682 17264578 17311830 17284992 17206173
20363A7206173q3695m9463j07581n7647k5726o5930K8000K7971k0536m55j20799
$$ 17206173 17122478 17073015 16965434 16907787 16882061 16816131 16844131 16872102 16851566 16851111 16730312
20352A6730312j05211k6717j4429o0886j30100j15060k382j4033m9271n7286n4779
$$ 16730312 16625101 16598384 16583955 16523069 16392969 16277909 16275527 16261494 16212223 16154937 16100158
20341A6100158j8622O8044K2101j22906j01780r3195l7101j3861L500m258m360
$$ 16100158 16081536 16149580 16171681 16048775 15946995 15853800 15816699 15802838 15806338 15802080 15797720
20330A5797720q1110j12734j06125p2371l0776j06724j7359j7618j36603L021
$$ 15797720 15716610 15603876 15497751 15425380 15394604 15287880 15270521 15252903 15116300 15119321
20320A5119321k0661m9191l3324j68092j39229N9386l6926o8246j11529n7801
$$ 15119321 15098660 15049469 15016145 14848053 14708824 14768210 14731284 14663038 14551509 14493708
20310A4493708m5829o5834Q861j3067j24625l0800k2132j43590j43406j41419
$$ 14493708 14447879 14382045 14390906 14377839 14253214 14222414 14200282 14056692 13913286 13771867
20300A3771867p3571o5445k4140l7727n2131L791J815o6511m1222j27274j0098
$$ 13771867 13698296 13632851 13608711 13570984 13518853 13522644 13524459 13457948 13416726 13289452 13279354
20289A3279354r3997p7728M213j0440q4120p6189r2147o8273k2373q7434j10412
$$ 13279354 13185357 13107629 13111842 13101402 13017282 12941093 12848946 12780673 12758300 12670866 12560454
20278A2560454j19459m3469n0020j05216q0668j016m8608n3792k5648l3238r6084
$$ 12560454 12440995 12397526 12347506 12242290 12161622 12160606 12111998 12058206 12032558 11999320 11903236
20267A1903236j33303r9484l1753p684k7129o0199j00917o2958n5854m0612n4571
$$ 11903236 11769933 11670449 11638696 11631012 11603883 11543684 11442767 11379809 11323955 11283343 11228772
20256A1228772p8508j0150j40956j44881q5739J310r808j9718n6121o5000o7817
$$ 11228772 11150264 11140114 10999158 10854277 10768538 10769848 10760040 10740322 10684201 10619201 10551384
20245A0551384j1839r0680p2806j0808p5452n356m9568o8886r5380j27368r7731
$$ 10551384 10539545 10448865 10376059 10365251 10289799 10284443 10234875 10165989 10070609 9943241 9845510
20234I845510n7235K0500j0910j24590o3736p4159r6179q7643k1778m3457n7291
$$ 9845510 9788275 9808775 9797865 9673275 9609539 9535380 9439201 9351558 9329780 9286323 9229032
20223I229032j08366j03415l0747j7844J8399o7871j53169r8490j7747O9919K4560
$$ 9229032 9120666 9017251 8986504 8968660 8987059 8919188 8766019 8667529 8649782 8719701 8744261
20212H744261r5505j9349n0901L0126p6620p992p9467r9304q0884j82919j21070
$$ 8744261 8648756 8629407 8578506 8608632 8532012 8524020 8444553 8345249 8264365 8081446 7960376
20201G960376r40n2178l5698N8910R9465p417p6494N8420r8124j77802o976Q067
$$ 7960376 7959436 7907258 7871560 7930470 8029935 8022518 7946024 8004444 7906320 7728518 7721542 7729609
20189G729609j61818j19816L7754P5064j6436j17211j40201r0449l4821p6896
$$ 7729609 7567791 7447975 7485729 7560793 7544357 7427146 7286945 7196496 7161675 7084779
20179G084779k4637Q7942k5569j11937p6250o0312q5146j0226L110M2406L4622
$$ 7084779 7060142 7148084 7122515 7010578 6934328 6874016 6788870 6778644 6781754 6824160 6858782
20168F858782j30016q1211O9252P6932n5114r7104j00061l5528k2864J3723m3476
$$ 6858782 6728766 6647555 6716807 6793739 6738625 6641521 6541460 6505932 6483068 6496791 6453315
20157F453315j06106L8922J7430q2391o8755q4795o8580j3746k9470P30j9534
$$ 6453315 6347209 6386131 6403561 6321170 6252415 6167620 6099040 6085294 6055824 6056554 6037020
20146F037020J0461j6833j63086j27977K1580j4782k0595q3861o8321j53200L7627
$$ 6037020 6047481 6030648 5867562 5739585 5761165 5746383 5725788 5641927 5573606 5420406 5458033
20135E458033J58086Q185j29143q2366l0345k0065m3177l4081J1529r7660o0517
$$ 5458033 5616119 5624304 5495161 5412795 5382450 5362385 5319208 5285127 5296656 5198996 5138479
20124E138479k6988K0386q1929m0328n496n2631Q260p6259j695M7826L8142q4049
$$ 5138479 5111491 5131877 5049948 5009620 5004124 4951493 4959753 4883494 4881799 4929625 4967767 4883718
20112D883718o3909l5716J1395L1321m0524p414r1908L136o3110j12211n0044
$$ 4883718 4819809 4784093 4795488 4826809 4786285 4778871 4686963 4690099 4626989 4514778 4464734
20101D464734J0597K2974n839j7770j34982j43395o4585N5658Q1429P0513M9933
$$ 4464734 4475331 4498305 4492466 4474696 4339714 4196319 4131734 4187392 4268821 4339334 4389267
20090D389267m445J6937K2548m4402L7738R082j8217k8305q6421n0418K1604p2736
$$ 4389267 4384822 4401759 4424307 4379905 4417643 4426725 4408508 4380203 4293782 4243364 4264968 4192232
20078D192232p8866o2154J05933M2093k017P8890n9479j48447j04050j27327p4553
$$ 4192232 4113366 4051212 4157145 4199238 4197221 4276111 4216632 4068185 3964135 3836808 3762255
20067C762255K2944j22179J3998m0468q2106J079J63909J55885l0815p7235j35320
$$ 3762255 3785199 3663020 3677018 3636550 3554444 3555523 3719432 3875317 3844502 3767267 3631947
20056C631947j17818N5048R921j9758j8687m8123n1227J8964p1749k6057K4921
$$ 3631947 3514129 3569177 3579098 3559340 3540653 3492530 3441303 3460267 3388518 3362461 3387382
20045C387382M0090o0318m1081N519N0748J3874j36700n6055K5465Q8882p4784
$$ 3387382 3427472 3367154 3326073 3331592 3382340 3396214 3259514 3203459 3228924 3317806 3243022
20034C243022j4934n95o1500o7879l7552J19434R3994m3837J81j0847o9860k9539
$$ 3243022 3228088 3227493 3165993 3098114 3060562 3179996 3273990 3230153 3230334 3219487 3149627 3120088
20022C120088l7050m1318N1464J3526k7939K3180l8422J0029L0602q7837q0199
$$ 3120088 3083038 3041720 3093184 3106710 3078771 3101951 3063529 3073558 3104160 3016323 2936124
20011B936124j08310J6765L9801L8831l5746P385K1724o4829k0144n8115j04968
$$ 2936124 2827814 2844579 2884380 2923211 2887465 2894850 2916574 2851745 2831601 2773486 2668518
20000B668518N4069n725o8785P5878O1017J2316J6882K1171p976p2570j1022l5504
$$ 2668518 2722587 2716862 2648077 2723955 2784972 2797288 2814170 2835341 2827365 2754795 2743773 2708269
19988B708269m0461r850n6396M5706L3661m4504q8760J8801k4145m2241R144L9816
$$ 2708269 2667808 2657958 2601562 2647268 2680929 2636425 2547665 2566466 2542321 2500080 2509224 2549040
19976B549040L3359K4048j8535j05658n65l4923n1900l3043j2391l8431r252m9462
$$ 2549040 2582399 2606447 2587912 2482254 2481689 2446766 2394866 2361823 2349432 2311001 2301749 2252287
19964B252287k0705p0292M2191K3100P0240K1402j7684L0229m6828j0801p6040
$$ 2252287 2231582 2161290 2203481 2226581 2296821 2318223 2300539 2330768 2283940 2273139 2197099
19953B197099L811P1956N2733O545q0319o6880n4379l9406m1507k0265k5536L1314
$$ 2197099 2200910 2272866 2325599 2332144 2251825 2184945 2130566 2091160 2049653 2029388 2003852 2035166
19941B035166Q6674l606q6239m9293J9700l2206o8586n1931l6121j1446m212J28943
$$ 2035166 2121840 2118234 2031995 1982702 2002402 1970196 1901610 1849679 1813558 1802112 1797900 1926843
19929A926843J21442J215n8035o1488n8477Q444K5955N0532K1198j06485M6526
$$ 1926843 2048285 2049500 1991465 1929977 1871500 1879944 1905899 1956431 1977629 1871144 1917670
19918A917670J6168m4964p1329j886q9919L8642M5522l5877j8565o3928m7229
$$ 1917670 1933838 1888874 1817545 1815659 1725740 1764382 1809904 1774027 1755462 1691534 1644305
19907A644305k9466P7174Q445J03285J5744Q100j6474j3961j05527l1712K7100
$$ 1644305 1614839 1692013 1700458 1803743 1819487 1827587 1811113 1797152 1691625 1659913 1687013
19896A687013M4058j1735M1709J478K8773n4744r5242L3542l8921q3589M4360
$$ 1687013 1731071 1719336 1761045 1762523 1791296 1736552 1641310 1674852 1635931 1552342 1596702
19885A596702J30406r2928M7157J873J000j06738n2837J34984m589l9699j09983
$$ 1596702 1727108 1634180 1681337 1683210 1684210 1577472 1524635 1659619 1655030 1615331 1505348
19874A505348q7695J9737l344O2053J6782l9124o8783N8343Q3347K4982l54n4219
$$ 1505348 1417653 1437390 1434046 1496099 1512881 1473757 1404974 1463317 1546664 1571646 1571292 1517073
19862A517073K2811j5189p2884K1280L8743M6490J8803J7927j29309r124J17756
$$ 1517073 1539884 1524695 1451811 1473091 1511834 1558324 1577127 1595054 1465745 1456621 1574377
19851A574377J1666n5528k7070p4394j2549p5252o0507l796j4613L6172R3104
$$ 1574377 1586043 1530515 1503445 1429051 1416502 1341250 1280743 1276947 1262334 1298506 1391610
19840A391610L3856j1796K0018R727k176K327n9298N628n3918o9472p8691J8530
$$ 1391610 1425466 1413670 1433688 1443415 1441239 1443566 1384268 1389896 1335978 1266506 1187815 1206345
19828A206345J2858J23566R8916o1611p413K6566r2354p2512K8813k0070j6965
$$ 1206345 1219203 1342769 1441685 1380074 1372661 1399227 1306873 1234361 1263174 1243104 1226139
19817A226139R9607N7243J3345j90j43762o9375Q779J0393j7714r6996K191K359
$$ 1226139 1325746 1382989 1396334 1396144 1252382 1183007 1191786 1202179 1184465 1087469 1089660 1092019
19805A092019L093N1747L3165K3990k8214r5055m5995L0023K7010j2576j4174
$$ 1092019 1095112 1146859 1180024 1204014 1175800 1080745 1034750 1064773 1091783 1079207 1065033
19794A065033o087O6914m3909n3428l5797M7486J1994J7936J5457n029n249J0250
$$ 1065033 1058946 1125860 1081951 1028523 992726 1040212 1052206 1070142 1085599 1080570 1075321 1085571
19782A085571L0995J3439n7807Q44l4157o1585O0352L779o2167M8426J08692M0417
$$ 1085571 1116566 1130005 1072198 1073042 1038885 977300 1037652 1041431 979264 1027690 1136382 1176799
19770A176799m8128n1097L9791Q9051n9788q3405p1630L6519l236j9185L4023
$$ 1176799 1128671 1077574 1117365 1206416 1146628 1063223 991593 1028112 1024876 1005691 1039714
19759A039714N2528q1767k9167J00179l3649j1284K1846l419P132m3046o3457
$$ 1039714 1092242 1010475 981308 1081487 1047838 1036554 1058400 1054981 1062113 1019067 955610
19748I55610p3007j1556k2262n0355J6421L9932n4610j9005M8773l9049l561N035
$$ 955610 882603 871047 848785 798430 814851 854783 800173 781168 829941 790892 787331 792366
19736G92366L2130J15204O1641N7723l9669p12q306N265m7029l4558L6563M5349
$$ 792366 824496 939700 1001341 1059064 1019395 1018683 1010377 1015642 968613 934055 970618 1015967
19724A015967n7832l9048N3492q71p1155m768J9345J13090M9819r6656r8606k971
$$ 1015967 958135 919087 972579 971708 900553 895785 915130 1028220 1078039 981383 882777 879806
19712H79806l0685n8412M6113N5502J4910j060k9600J5240L8109J0756M308n3925
$$ 879806 849121 790709 836822 892324 907234 906174 876574 891814 929923 940679 944987 891062
19700H91062K9408R0768M5651l5073k7680j551M6130L8129L3945l7451n9808k9285
$$ 891062 920470 1011238 1056889 1021816 994136 992585 1038715 1076844 1110789 1073338 1013530 984245
19688I84245K8888J05760M8391Q8732l8879p1692L1223O885j03482J4314N4636
$$ 984245 1013133 1118893 1167284 1256016 1217137 1145445 1176668 1183553 1080071 1094385 1149021
19677A149021L2656L2810J30726l5682j21402r7981r0995o6169L0607m6889O130
$$ 1149021 1181677 1214487 1345213 1309531 1188129 1090148 999153 932984 963591 916702 922832
19666I22832K7426k5019m5260n8705N3275K1963L9232Q792p244j8460L6033p8556
$$ 922832 950258 925239 879979 821274 874549 896512 935744 944536 937292 918832 954865 876309
19654H76309L8877j6072L7609O5896q0246k9183N058k5696J03143j7760j17913
$$ 876309 915186 899114 936723 1002619 922373 893190 898248 872552 975695 957935 840022
19643H40022q0015O4348M1441J4665m0320n1183k1720l0141M049j357J22953O5288
$$ 840022 760007 824355 865796 880461 840141 788958 767238 737097 741146 739789 862742 928030
19631I28030m3811p546O3949N7217J1591J183k2153l6420m156P5639J2695n8988
$$ 928030 884219 876673 940622 997839 1009430 1010613 988460 952040 947884 1023523 1036218 977230
19619I77230q0694J8199l497r942l4718O5668Q3388J4138P446P061J1109J6889
$$ 977230 896536 914735 911238 901296 866578 932246 1015634 1029772 1037218 1044279 1055388 1072277
19607A072277j8831k7762q5678q476Q0495L0498q4478n4420J19017L2230l4769
$$ 1072277 1053446 1025684 940006 931530 1012025 1042523 958045 903625 1022642 1054872 1020103
19596A020103Q752o2998j4254j3959k5652j8355o59J02617o2814j7285k7062M6685
$$ 1020103 1028855 965857 951603 937644 911992 893637 892978 995595 932781 915496 888434 935119
19584I35119K0758R3616L160j8286q6561p1173J1909j6913L9330L0981k19849
$$ 935119 955877 1049493 1052653 1034367 947806 876633 888542 871629 910959 941940 722091
19573G22091q7471j401J5270N8676j2366l6587K2787J9639N4098k1820n0485k8209
$$ 722091 634620 633219 648489 707165 694799 658212 680999 700638 754736 732916 682431 654222
19561F54222J00933N775n7668j6421K4053J43824j133n20Q7106n03j09550j4615
$$ 654222 755155 760930 703262 686841 710894 854718 853585 853065 940171 939668 830118 815503
19549H15503M2764Q952m3628j46019o9753J9026O7855l6392l761J2730J8027O8205
$$ 815503 858267 867219 823591 677572 607819 626845 694700 658308 654547 667277 685304 753509
19537G53509N8088N5355o0363o1323r2382P2238n419K7769l3569m306m629p6954
$$ 753509 811597 866952 806589 745266 652884 725122 719703 747472 713903 709597 704968 628014
19525F28014m8081o842J26673R0240N4137N4832Q4618Q4499k3716j31981n2761
$$ 628014 579933 573091 699764 790004 844141 898973 983591 1068090 1044374 912393 859632
19514H59632l1631n0219j1240j03614K1904J3196q541P0342o1417j13832m3076
$$ 859632 828001 777782 766542 662928 684832 698028 689487 759829 698412 584580 541504
19503E41504l0168o131j5265J9980K3884Q8187q4992n5805L1298P838K6869l8517
$$ 541504 511336 505205 489940 509920 533804 621991 536999 481194 512492 520330 547199 508682
19491E08682J04959Q7641P5907l9557J7950k6892q0472p6465l5313N2101J09142
$$ 508682 613641 701282 777189 737632 755582 728690 648218 571753 536440 588541 697683
19480F97683J56211J29392J43786J31198J49124j02917l4982M7184K24021Q6194
$$ 697683 853894 983286 1127072 1258270 1407394 1304477 1269495 1316679 1540700 1626894
19470A626894k08102j01754O1331J35083R4777l5278j28874l6619k6969J62107
$$ 1626894 1418792 1317038 1378369 1513452 1608229 1572951 1444077 1407458 1380489 1542596
19460A542596L3067k40109j78266j23494J7816P6333j94627k08665J2031p9575
$$ 1542596 1575663 1335554 1157288 1033794 1051610 1127943 933316 724651 736682 657107
19450F57107n0785l3794J365N6085p910m412M8702j05958p8199J9564J9203j2079
$$ 657107 606322 572528 573893 629978 622068 617656 666358 560400 482201 501765 520968 508889
19438E08889K9435L2245m7689O1179m6685q2330p0112P920k1373J26833n5480
$$ 508889 538324 570569 522880 584059 537374 455044 384932 392852 371479 498312 442832
19427D42832o191J01707J10633K7760L8540o7569N7999J7273N133J6545q1741
$$ 442832 436641 538348 648981 676741 715281 647712 705711 722984 728117 744662 662921
19416F62921q5016m3943m5737J4881l9394L5146P372O3252R7580Q3057R466k800
$$ 662921 577905 533962 488225 503106 463712 498858 506230 569482 667062 750119 759585 756785
19404G56785p1620L3541R1615N1622j8409k3797j08502m9374p1044j0694K0757
$$ 756785 685165 718706 810321 861943 843534 819737 711235 661861 590817 580123 600880
19393F00880q7194l9102p2187J4753M6366J2536J23477P3264M0237l4221J0640
$$ 600880 513686 474584 402397 417150 463516 476052 599529 672793 713030 678809 689449
19382F89449o1359l8161K8726M2397N0300K6403q4215n3726K1857k8O4443M1777
$$ 689449 628090 589929 618655 661052 711352 737755 653540 599814 621671 621643 686086 727863
19370G27863o402l4470m9460n7425O5362Q0971L1988r1520r4088Q3637J23677
$$ 727863 721461 686991 637531 580106 645468 726439 758427 666907 572819 656456 780133
19359G80133j12267r0850p0547N6879n2146j50430K3188O9760Q9888O8065p3728
$$ 780133 667866 577016 506469 563348 511202 360772 383960 453720 543608 611673 537945
19348E37945o6219J6951N9564m4207j07695M7426P1005k78m7011l2781n0301l9034
$$ 537945 471726 488677 548241 504034 396339 443765 514770 514492 467481 434700 384399 345365
19336C45365j0836m6731M472K0235N622J15102J412q9291m1091J02571p9157m5656
$$ 345365 334529 287798 292270 312505 318127 433229 434641 345350 304259 406830 327673 282017
19324B82017Q5868L9242R099j6176q5825m8576R9539k6370K1104L9985J3414n6222
$$ 282017 367885 407127 416226 400050 314225 265649 365188 338818 359922 399907 413321 357099
19312C57099l4856q5694k8514M5096R3911J0951j3670K523M8539N4526K1057j7024
$$ 357099 322243 236549 208035 253131 347042 357993 344323 346846 395385 449911 470968 453944
19300D53944o5700j8335q9040o3520J796J2682n5793Q9987J10692j5436J4942
$$ 453944 388244 369909 280869 217349 219145 231827 176034 266021 376713 361277 376219
19289C76219j9020k7929k0537P8375L7355j10369j03557o6945O529Q7619o276
$$ 376219 357199 329270 308733 387108 424463 314094 210537 143592 150121 237740 231464
19278B31464P1738P160O1413k145k3289q3264n9183R8651J7990L6339L026o8843
$$ 231464 303202 310362 371775 369630 346341 263077 203894 302545 320535 356874 359900 291057
19266B91057L1199R5131J8732n7775J3735k8991M7798J1637k4016J6736k4739
$$ 291057 322256 417387 436119 378344 392079 363088 410886 422523 398507 415243 390504
19255C90504n9942M7021L6793n9219J1875J06374n4386j03115J11299M5830J0176
$$ 390504 330562 377583 414376 355157 367032 473406 419020 315905 427204 473034 483210
19244D83210r5739p3220m1151N3805O3709p5641L8170O1534p8086q6816j41783
$$ 483210 387471 314251 273100 326905 390614 314973 353143 414677 336591 249775 107992
19233A07992P7239J03087M7926J19823P1037n2584q9965j6618l696N7146R666
$$ 107992 185231 288318 336244 456067 527104 474520 384555 367937 364241 421387 431053
19222D31053m6175j27067q4316J23322J15003l4920J1658k5504n0174k8196R670
$$ 431053 384878 257811 173495 296817 411820 376900 388558 363054 312880 284684 294354
19211B94354p259K6426J6091J2481n529m5976k5859k3270O6121n0944j5703L1113
$$ 294354 287095 313521 329612 342093 336564 290588 264729 241459 307580 256636 240933 272046
19199B72046k6771N3200R006m213O9132N5640k123K5257k1165p9321l3112R3210
$$ 272046 245275 298475 307481 303268 372400 428040 425917 451174 430009 350688 317576 410786
19187D10786R42m0794q526J717K478L3533M6092M6569N314K8758K4329j0506j18867
$$ 410786 411728 370934 362408 364125 366603 400136 446228 492797 498111 526869 551198 540692 421825
19174D21825k5587j1609m4233M0292J05100k4459k7013J6755p2765l2544L4985
$$ 421825 396238 384629 340396 380688 485788 461329 434316 451071 378306 345762 380747
19163C80747L0759R8568L1419r3952k6123K0109M6105J7372o4026M5027p7102
$$ 380747 411506 510074 541493 447541 421418 441527 487632 505004 440978 486005 408903
19152D08903j850N9752l5133m7663M0162q0272j0354K8511P0951L573j9270N2895
$$ 408903 407053 466805 431672 384009 424171 343899 333545 362056 433007 436580 417310 470205
19140D70205J4515r3567j8509J26621k2058l4969J5948l6374k2779l4550L7725
$$ 470205 484720 391153 372644 499265 477207 442238 458186 421812 399033 364483 402208
19129D02208Q4485Q2414j6498J2385J6472J03404J28893J03733r477j7089M6065
$$ 402208 486693 569107 552609 564994 581466 684870 813763 917496 908019 890930 936995
19118I36995M35p3020o2728o8038K0340j8000p2548N1770k2160n6687M3917L1318
$$ 936995 937430 864410 801682 733644 753984 735984 663436 715206 693046 636359 680276 711594
19106G11594p9277l4145n0611Q509m3231J47508J39425J66332J22605l5714j3216
$$ 711594 632317 598172 547561 556070 512839 660347 799772 966104 1088709 1052995 1039779
19095A039779m2901J8236n4592j739r105p8008o8911m5535m0984j02060r2926
$$ 1039779 996878 1015114 960522 958783 949678 871670 802759 757224 716240 614180 521254
19084E21254K2501L9761K9317J1826m5262m415k7278O801J00262M9494Q6690R9435
$$ 521254 543755 583516 612833 624659 579397 574982 547704 554505 654767 704261 790951 890386
19072H90386k4899j3739N1210M6723M4872k0716m0242j45219q2607N8935N4381
$$ 890386 865487 851748 902958 949681 994553 973837 933595 788376 705769 764704 819085
19061H19085m2396o0929o8642P8181J82972K4958K0512J23708J60073J16633J39147
$$ 819085 776689 715760 647118 725299 908271 933229 953741 1077449 1237522 1354155 1493302
19050A493302K19426J86043K3387q0642k1721j05039r9281j09421k18918n6007
$$ 1493302 1712728 1898771 1922158 1841516 1819795 1714756 1615475 1506054 1287136 1231129
19040A231129j26497p4101q6668p2933n1747p3281J4619M7910M1431J67262J89236
$$ 1231129 1104632 1030531 943863 870930 819183 745902 760521 808431 849862 1017124 1206360
19029A206360O2739J23901M6501M0200k5391j16843j59027j75699j30434k9962
$$ 1206360 1269099 1393000 1439501 1479701 1454310 1337467 1178440 1002741 872307 842345
19019H42345M8664J48109o233o9354j33870j77104m776Q7497j7032m9052k4668
$$ 842345 891009 1039118 1032885 963531 829661 652557 647781 735278 718246 669194 644526
19008F44526L2311M958L9808r1743k7518J2110k3464L168k3119l0333r047j990
$$ 644526 676837 681795 721603 629860 602342 614452 590988 594156 571037 540704 531657 529667
18996E29667K2471M5278J11820m3767o5981Q7232l1515m4642J4568j2925M7158
$$ 529667 552138 597416 709236 665469 599488 686720 655205 610563 625131 612206 659364
18985F59364J03379O0451J4334k7652j02687p5929j55482k0552l1216L2854J7254
$$ 659364 762743 823194 837528 809876 707189 631260 475778 455226 424010 456864 474118
18974D74118M953Q3523Q6617L7484j22087p2572l9816J031k8722M8513Q7682m4309
$$ 474118 479071 562594 649211 686695 564608 492036 452220 453251 424529 473042 560724 516415
18962E16415o7982J04389Q5796m537M0180J9204N2220M2408L740Q3529j3774o7037
$$ 516415 448433 552822 638618 634081 674261 693465 745685 788093 791833 875362 861588 794551
18950G94551p5570j51843J35432O5199n6159J9476L8626k3098m0932m06l5535
$$ 794551 718981 567138 702570 767769 711610 731086 769712 746614 705682 705276 669741
18939F69741P292K3093m2359m2278J6735J9344n3503j13521M3051J4108j7516
$$ 669741 677033 700126 657767 615489 632224 651568 598065 484544 527595 541703 524187
18928E24187m1837M6869j185L2163j7478O0170N8088J6900j0627n0286r6378O310
$$ 524187 482350 529219 528034 560197 542719 602889 660977 677877 667250 616964 520586 526896
18916E26896k1404k4390Q2686J9790n398r0856J1129O5851j00977j47823p627
$$ 526896 505492 481102 563788 583578 578180 487324 498453 564304 463327 315504 307877
18905C07877Q9905P2549l6416J21843K9730p7912j19201m1967J27502P6120j5410
$$ 307877 397782 470331 433915 555758 585488 507576 388375 346408 473910 550030 534620
18894E34620J0081j65696k2601j9579k3647j8419l6725M7860N2015M4383j03713
$$ 534620 544701 379005 356404 336825 313178 294759 258034 305894 357909 402292 298579
18883B98579l0558J55572P4720q7274J9664J02833k1002j2325R379j395Q090K2022
$$ 298579 268021 423593 498313 411039 430703 533536 512534 500209 509588 508193 516283 538305
18871E38305J1777J0719j1750j0711n3878j09762j43529J9124P5611R1206N9468
$$ 538305 550082 560801 549051 538340 484462 374700 231171 250295 325906 417112 476580
18860D76580K5996l4335n4068J0029P656l9575r7689k7294N2977J19239L1467
$$ 476580 502576 468241 414173 424202 431858 392283 294594 267300 320277 439516 470983
18849D70983Q975m978K7660k5435P3601m4265n0266J40941J38378M2967J175l3695
$$ 470983 479958 474980 502640 477205 550806 506541 456275 597216 735594 778561 779736 746041
18837G46041L8329J81818P7949m3386m5679k9304l3904o0824l5460O5149l5353
$$ 746041 784370 966188 1044137 1000751 955072 925768 891864 831040 795580 860729 825376
18826H25376j25684p0680j9455K2629K451j0601o9202n4791l0551J2961L1851
$$ 825376 699692 629012 609557 632186 634637 624036 554834 500043 469492 482453 514304
18815E14304N0156k1510l5046K9890O8224m4070m1324o2440o5518p7739O0829
$$ 514304 564460 542950 507904 537794 606018 561948 520624 458184 392666 314927 375756
18804C75756Q6972L1945M1087m0293n1087j22893n7032J56983J5527o5036j9097
$$ 375756 462728 494673 535760 495467 444380 321487 264455 421438 436965 371929 352832
18793C52832n5680O2171M1002K6355m9756j7736R3355Q6803n3439k1753j3054
$$ 352832 297152 359323 400325 426680 376924 359188 452543 539346 485907 464154 451100
18782D51100K0165P0189J246J9825l9116k0377k5290l7660P1533P621n4420n1915
$$ 451100 471265 541454 542700 562525 523409 503032 477742 440082 511615 519236 464816 412901
18770D12901l6657j1544L9221m5274L8218J46393L3376o0590O3050N3719R557
$$ 412901 376244 364700 403921 358647 396865 543258 576634 516044 579094 632813 642370
18759F42370r9386o028J43336L3636m4794N0988J951Q3747M3728m4430M6328j0637
$$ 642370 542984 536956 680292 713928 669134 720122 722073 805820 849548 805118 851446 840809
18747H40809K0463L9861l6108o4372p1961m6113R9663Q869j8796o56q5686k1730
$$ 840809 861272 901133 865025 800653 728692 682579 782242 791111 772315 771659 685973 664243
18735F64243j9542L8754L2897L3267Q3128O978r9304n9418p3576J11600N9452
$$ 664243 644701 683455 716352 749619 832747 839725 740421 681003 607427 719027 778479
18724G78479L2952R6925j0444j66677l9028N3236P370M441q4276K001r277l8769
$$ 778479 811431 908356 897912 731235 692207 745443 752813 757254 672978 674979 665702 626933
18712F26933R3678Q1299M7843r4745m4436k0572Q2070M2225j8369p874P8926L1960
$$ 626933 720611 801910 849753 755008 710572 690000 772070 814295 795926 788052 866978 898938
18700H98938q6197R346k6657j54215l1443M8444M3732J5155P689p1730J0865j1303
$$ 898938 812741 822087 795430 641215 609772 658216 701948 717103 724792 653062 663927 652624
18688F52624m4900m8681k1890m7678K5494L6213K0006Q0592M2043m3798n5280
$$ 652624 607724 559043 537153 489475 514969 551182 571188 651780 693823 650025 594745
18677E94745N8132J0672P9360N0557P0765M9781p0675o3775N6397k0831J419m3020
$$ 594745 652877 663549 742909 793466 864231 914012 843337 779562 835959 815128 816547 773527
18665G73527m99m9016O0312L6621Q0462J47628M2089l4155n6985o3524L6028M4538
$$ 773527 773028 724012 784324 820945 901407 1049035 1091124 1056969 999984 936460 972488 1017026
18653A017026J435k3973j8423j9650R3366J74279Q6896P5334Q9127J57564J03844
$$ 1017026 1018461 994488 976065 956415 1049781 1224060 1310956 1386290 1475417 1632981 1736825
18642A736825N6997p9647j08494j28857p7188j17473m1498n0759K6189L1449k4082
$$ 1736825 1793822 1714175 1605681 1476824 1399636 1282163 1240665 1189906 1216095 1247544 1223462
18631A223462j1740J14142L7458l633O3338R3451J77350J60207J05764J46056
$$ 1223462 1211722 1325864 1363322 1359689 1423027 1516478 1693828 1854035 1959799 2105855
18621B105855O7115R0693L1671j3474j23190k35155k88199k39499k45783j65429
$$ 2105855 2172970 2263663 2295334 2281860 2158670 1923515 1635316 1395817 1150034 984605
18611I84605j32427L5905M6991J00317k630k5863Q7925O8759J42965N7660R1044
$$ 984605 852178 888083 935074 1035391 1032761 1006898 1094823 1163582 1306547 1364207 1455251
18600A455251J87587J24121J68407K60927r8207k79911o4367n7146L4656j63100
$$ 1455251 1642838 1766959 1935366 2196293 2098086 1818175 1753808 1696662 1731318 1568218
18590A568218k71293k64898p4431L530m577q995J18895L7270L7588K9087J6162
$$ 1568218 1296925 1032027 957596 961126 956549 947554 1066449 1103719 1141307 1170394 1186556
18579A186556O0067M2508O5404J84011K97110L00822l2905k29914o469J33716
$$ 1186556 1246623 1289131 1354535 1538546 1835656 2136478 2103573 1873659 1867190 2000906
18569B000906J45234j96650k54443j60277j57923j0824M3517m1862J0515R9794
$$ 2000906 2146140 1949490 1695047 1534770 1376847 1366023 1409540 1367678 1378193 1477987
18559A477987K0396l6502n9160k8605n3508L8954J20631J3362j2166L9797R9102
$$ 1477987 1498383 1461881 1402721 1374116 1320608 1359562 1480193 1493555 1481389 1521186 1620288
18548A620288J4419n3379M8982J00490R4606K9369m6794N4407l3570p3840k783
$$ 1620288 1634707 1581328 1630310 1730800 1825406 1854775 1807981 1862388 1828818 1754978 1752195
18537A752195O4447K21292J86759J56724O7102P4144J07618M0824O3348J33706
$$ 1752195 1816642 2037934 2224693 2381417 2448519 2522663 2630281 2671105 2734453 2868159
18527B868159J62792J99112K77768K95319K18935K46757L08434K55413R3587j28208
$$ 2868159 3030951 3230063 3507831 3803150 4022085 4268842 4577276 4832689 4926276 4798068
18517D798068p6825q815K02647M76691M94819M74345O05842O20071N27926L49057
$$ 4798068 4721243 4712428 4915075 5391766 5886585 6360930 6966772 7586843 8114769 8463826
18507H463826L80531O75327Q70884J215156J606719K118603K656148L575564M972607
$$ 8463826 8844357 9519684 10390568 11605724 13212443 15331046 17987194 21562758 26535365
18498B6535365P180629J0511553J5491860K1938876K7478358K9039440K7748311
$$ 26535365 33715994 44227547 59719407 81658283 109136641 138176081 165924392
18491A65924392K9841404L6964824K6312104k6794427o5108740n4379185l3565011
$$ 165924392 195765796 232730620 259042724 232248297 167139557 112760372 79195361
18484G9195361j9951853j2086056p398566m470146k349371p34684R30654K764939
$$ 79195361 59243508 47157452 39758886 35288740 32939369 32204685 33135339 35900278
18476C5900278M888343P909133J2745869J9660769K7042654L1419315L1143966
$$ 35900278 40788621 48697754 61443623 81104392 108147046 139566361 170710327
18469A70710327L0378535L5421263L9240149N980528n7497329p3082533n0528921
$$ 170710327 201088862 236510125 275750274 281730802 224233473 151150940 100622019
18462A00622019l0240413j8458102j1853947p839837n304552l768223k781168
$$ 100622019 70381606 51923504 40069557 32229720 26925168 23156945 20375777
18455B0375777k152017j979155j777198j386735r99460o15249m16745k18515L340
$$ 20375777 18223760 16244605 14467407 13080672 12081212 11465963 11049218 10830703 10834043
18446A0834043J45427J32754J64022N59551J188950J674866J903018K019488K354171
$$ 10834043 10979470 11112224 11276246 11835797 13024747 14699613 16602631 18622119 20976290
18437B0976290K799843K467840r60922l855177k931467j376999m67322J59145
$$ 20976290 23776133 26243973 25283051 21427874 18496407 17119408 16652086 16811231
18429A6811231O12958Q20772Q85451M67234o99417j596461j459646p90034j2592
$$ 16811231 17424189 18244961 19130412 19597646 18898229 17301768 15842122 15052088 15039496
18420A5039496R20856J524558J837824J726906J752193K400530K585543k54495
$$ 15039496 15960352 17484910 19322734 21049640 22801833 25202363 27787906 27533411
18412B7533411l998052l961631k297000p48511K28001P94139Q05490O84101M01840
$$ 27533411 23535359 19573728 17276728 16528217 16756218 17550357 18355847 19039948 19441788
18403A9441788q59557j978510k242113j959318j459137r63255n27237l57116m39684
$$ 19441788 18582231 16603721 14361608 12402290 10943153 9979898 9452661 9095545 8655861
18394H655861m54610l10527j56361j73363j81022o4008j5155J55947R0824K77298
$$ 8655861 8201251 7890724 7734363 7561000 7379978 7315970 7300815 7456762 7547586 7824884
18384G824884K95341L18137M18189O92276Q81170J155625J338604J379639J548931
$$ 7824884 8120225 8438362 8856551 9548827 10429997 11585622 12924226 14303865 15852796
18375A5852796J447479J360971P59862m18228j617052k344975k218590j711559
$$ 15852796 17300275 18661246 19421108 19002880 17385828 15040853 12822263 11110704
18367A1110704j226971q58832n83687k78457r5510n1249R6509K25058M14423N91716
$$ 11110704 9883733 9024901 8441214 8162757 8067247 8015998 8112507 8337565 8751988 9343704
18357I343704R73324J236948J387071J397169J224528J066540O79251o22786k102355
$$ 9343704 10317028 11553976 12941047 14338216 15562744 16629284 17308535 16685749 14583394
18348A4583394k477462k264335j783460j332320j035005p90575o09718m67451
$$ 14583394 12105932 9841597 8058137 6725817 5690812 4900237 4290519 3823068
18340C823068l75752l08969k81573j33390k00322j63229j47932j60040q3119j52538
$$ 3823068 3447316 3138347 2856774 2723384 2523062 2359833 2211901 2051861 1968742 1816204
18330A816204q6669o3718m7564M9799l3189o4122l4023n7388m1110l3669n6447
$$ 1816204 1729535 1665817 1618253 1668052 1634863 1570741 1536718 1479330 1438220 1404551 1348104
18319A348104m2114k9806j13967o8350M6489m101j100m5633K654m7408j5762q8852
$$ 1348104 1305990 1276184 1162217 1093867 1140356 1136255 1135155 1089522 1092176 1044768 1029006 940154
18307I40154j04687m1838L9125J7430j0033k0848J1254p2568n5768k2207m0137
$$ 940154 835467 793629 832754 850184 840151 819303 830557 757989 702221 680014 639877
18296F39877K5026P2141M3394K2953M4938n0219K2831J6016N0103O6674L3155
$$ 639877 664903 737044 780438 803391 848329 798110 820941 836957 887060 953734 986889
18285I86889P0068L0539j6794O6683R0665L4534P8188O5604O3128R0212r485j43209
$$ 986889 1056957 1087496 1070702 1137385 1228050 1262584 1340772 1406376 1469504 1559716 1550231 1407022
18273A407022r1721j49761p3105j04467r1978o8539R142l2243m5746o286l1958
$$ 1407022 1315301 1165540 1092435 987968 895990 827451 836593 804350 758604 752318 720360
18262G20360J04124J4636P0268J14512J77933J41001L5911p8665m2738Q4133K0472
$$ 720360 824484 839120 909388 1023900 1201833 1342834 1378745 1300080 1257342 1341475 1361947
18251A361947n6234k31834o5948j2166r0097r875O0672P159j29348p7658J18669
$$ 1361947 1305713 1073879 1007931 995765 905668 895793 956465 963624 834276 756618 875287
18240H75287J06767Q4861M5965r535r097N9503k6443p1937n7601R3648M391o2334
$$ 875287 982054 1066915 1112880 1103345 1094248 1153751 1127308 1055371 997770 1091418 1095809 1033475
18228A033475r5251p1134Q4166J01097j1810m964p0931K6310J90847J68373l244
$$ 1033475 938224 867090 951256 1052353 1040543 1035579 964648 990958 1181805 1350178 1346934
18217A346934O8483R1715q4677j54046j10064k1038n3991k9134R607m3815l5438
$$ 1346934 1415417 1507132 1422455 1268409 1158345 1137307 1083316 1054182 1063789 1019974 984536
18206I84536p3773L4001M553j8510j53563L0121m41R037M5511K7486J04658J00845
$$ 984536 910763 944764 949317 930807 777244 807365 806924 815961 861472 888958 993616 1094461
18194A094461N3030p3471j84974j25446J18172L796j96769j63051K0892M5199
$$ 1094461 1147491 1074020 889046 763600 881772 885568 688799 525748 546640 591839
18184E91839R2118l7389j53841L5318R0179J04998N9016m8264M142O0916P8788
$$ 591839 683957 646568 492727 528045 618224 723222 782238 733974 738116 799032 877820
18173H77820J4389L6074J2419q220N3878j6270q0222l4100O8995m621J2965N6571
$$ 877820 892209 928283 940702 932482 986360 970090 889868 855768 924763 920142 933107 989678
18161I89678k9777L5084J01617l8258o3309P686r2417o2655N2309L8301M2867
$$ 989678 959901 994985 1096602 1058344 995035 1002721 910304 847649 899958 938259 981126
18150I81126m4462M4660M3366j4180J64169O3292L1702Q3963k2439Q3739L6058
$$ 981126 936664 981324 1024690 1010510 1174679 1237971 1269673 1353636 1331197 1414936 1450994
18139A450994L3220l263l4272N9135M3532m3037J05148J37962Q1963m3305J43080
$$ 1450994 1484214 1480951 1446679 1505814 1549346 1506309 1611457 1749419 1831382 1788077 1931157
18128A931157J72112K38297K86022K13039K50773L38132J66991K9964j82779k04517
$$ 1931157 2103269 2341566 2627588 2840627 3091400 3429532 3596523 3626487 3443708 3239191
18118C239191p1398Q2616J02396M647J51252L60470L76994K36053L77025M56262
$$ 3239191 3167793 3250409 3352805 3357452 3508704 3869174 4246168 4482221 4859246 5315508
18108E315508N10561N63002P22522P36031N97067M56434O72770J026157J354084
$$ 5315508 5826069 6389071 7111593 7847624 8444691 8901125 9573895 10600052 11954136
18099A1954136J391687J376351J789220K597450L603174N224987Q038416J2234631
$$ 11954136 13345823 14722174 16511394 19108844 22712018 27937005 35975421 48210052
18091D8210052J8101315K4788288K9739082L1559883L1618261L4094680L5663456
$$ 48210052 66311367 91099655 120838737 152398620 184016881 218111561 253775017
18084B53775017J6300096k7542692o0427854n7126827l7824705k2850590j3900869
$$ 253775017 270075113 242532421 182104567 124977740 87153035 64302445 50401576
18077E0401576q654218n352512l119427j546485J233J756528M016774P386612
$$ 50401576 41747358 36394846 33275419 31728934 31730167 33486695 37503469 44890081
18069D4890081J2007834J7832532K3608514K7021906K7437870K8319173L1976776
$$ 44890081 56897915 74730447 98338961 125360867 152798737 181117910 213094686
18062B13094686K7455855l819417m3963718n7525953m4261338k7788504j7169258
$$ 213094686 240550541 236731124 192767406 135241453 90980115 63191611 46022353
18055D6022353j1002075p344198n132487l799676k758830j996408j522407j108402
$$ 46022353 35020278 27676080 22543593 18743917 15985087 13988679 12466272 11357870
18047A1357870r35226p37055o62470m56647k84282m15073n26860p08307r35715
$$ 11357870 10422644 9685589 9023119 8566472 8282190 7867117 7340257 6631950 5696235
18038E696235p63192o01453m16941l79148l52442k30401j60736l30046k80138
$$ 5696235 4933043 4331590 3914649 3535501 3183059 2952658 2791922 2461876 2181738
18029B181738o9119j4054p8384Q4883J01146R2036P5395N9553J4078p904q2855
$$ 2181738 2112619 2098565 2020181 2105064 2206210 2298246 2373641 2433194 2447272 2439368 2356513
18018B356513l74703k90661k05329j23289p9207j30992j83992j21633L2742R3615
$$ 2356513 1981810 1691149 1485820 1362531 1283324 1152332 968340 846707 879449 973064
18008I73064N561p2370l8894j06509L7074l0481N6484k6000j03684J01487m8151
$$ 973064 978625 906255 867361 760852 797926 767445 823929 797929 694245 795732 747581
17997G47581j2187M1394J2702p5398j45867L0830O5185P8836K7285k6337q7994
$$ 747581 735394 776788 789490 714092 568225 599055 664240 743076 770361 744024 656030
17986F56030k2244q3632l3501k1723O5781L0234j9678L8633o3813j7687P0968
$$ 656030 633786 550154 516653 494930 560711 590945 571267 609900 546087 528400 599368
17975E99368l3055R3926n9132j8982K5651N8734R5454J10626Q7610O780o9232
$$ 599368 566313 660239 601107 582125 607776 666510 761964 872590 960200 966980 897748
17964H97748q133n0411L5670l8945n0983j30917n8357Q830K8196Q073j04703j35189
$$ 897748 889615 839204 874874 835929 784946 654029 595672 604502 632698 640771 536068 400879
17952D00879k0884l2441J0132M127O6337J25661R3942P1631J03161M6915L3200
$$ 400879 379995 347554 357686 361813 428150 553811 647753 719384 822545 869460 902660
17941I02660r1529k6263j06721j52182r2711P8398k2232n8003o0332p6368K7624
$$ 902660 811131 784868 678147 525965 433254 511652 489420 431417 371085 294717 322341
17930C22341J60366J36945mJ44356K86213J73413L8814K6065m0636J01082o7298
$$ 322341 482707 619652 619648 764004 1050217 1223630 1262444 1288509 1247873 1348955 1281657
17919A281657l07526k81676m2539N6569q7576j05383p6073j12238j34710Q4709
$$ 1281657 974131 692455 649916 706485 618909 513526 437453 325215 190505 275214
17909B75214K1606O6504J2491q574J06990O9164J15857R8238J07245P2190O6321
$$ 275214 296820 363324 375815 367241 474231 543395 659252 757490 864735 936925 1003246
17898A003246n4626n4891j39408n1276j03083j66141j15543r1106N1568J74247
$$ 1003246 948620 893729 754321 703045 599962 433821 318278 227172 278740 452987
17888D52987J9628q3240J8643j09762q8559Q877L5426q1279M1929L6492N1201
$$ 452987 472615 389375 408018 298256 209697 218574 254000 172721 214650 251142 302343
17877C02343J01045K991L0103L2410O6716M9526k2023J8836R3209K3413L6166
$$ 302343 403388 406379 436482 468892 535608 585134 563111 581947 675156 698569 734735
17866G34735P7516K4742k605L6561j0611j7331J57875O1996R4505O0699N2777
$$ 734735 812251 836993 834388 870949 860338 843007 1000882 1062878 1157383 1218082 1270859
17855A270859R1693J5948J4547O7593P6610J8290m657M2503N2665J6060r134Q6924
$$ 1270859 1362552 1378500 1393047 1460640 1537250 1555540 1550883 1593386 1646051 1662111 1652977 1739901
17843A739901K36800K88905M40415P20417J143005J528623J871155K143893K162715
$$ 1739901 1976701 2265606 2706021 3426438 4569443 6098066 7969221 10113114 12275829
17834A2275829K329638K656303K097238m81986l438869m466694l275143j930032
$$ 12275829 14605467 17261770 19359008 18877022 15438153 10971459 7696316 5766284
17826E766284j090656n82891m80907k65904o8194O5848K39258K78496M81001Q35763
$$ 5766284 4675628 4092737 3611830 3345926 3277732 3343580 3582838 3861334 4342335 5178098
17816E178098J324512J719375J945551J910576K055025K551170K501847K07044
$$ 5178098 6502610 8221985 10167536 12078112 14133137 16684307 19186154 19393198
17808A9393198k890704m364838l260777j680709o77776n3506N41760R39039J191977
$$ 19393198 16502494 12137656 8876879 7196170 6518394 6464888 7006648 7945687 9137664
17799I137664J429594J429211J434796J189384M67274o24751j638021k157554
$$ 9137664 10567258 11996469 13431265 14620649 15087923 14463172 12825151 10667597
17791A0667597k061649j579004j032138q00197o06681l45831k82830K1022J83100
$$ 10667597 8605948 7026944 5994806 5194609 4587928 4242097 3959267 3980289 4163389
17782D163389K23672L65057N76194R85826J165973J331866J376526J391518J256918
$$ 4163389 4387061 4752118 5328312 6314138 7480111 8811977 10188503 11580021 12836939
17773A2836939N35369m96262j530380k021792j849752j531271j140475q14983
$$ 12836939 13372308 12876046 11345666 9323874 7474122 5942851 4802376 3987393
17765C987393o52294n23674l36245k87977k26017j32442j65979k58170j54359
$$ 3987393 3335099 2811425 2475180 2187203 1961186 1828744 1662765 1404595 1250236
17756A250236K9502r8516p0984q2623o0725J5608R6284j3744o0187m6221j08738
$$ 1250236 1279738 1181222 1110238 1027615 966890 982498 1078782 1065038 1004851 958630 849892
17745H49892n5038l765K5716K2965k8378O0125J26359j8335r2145n0267Q4692
$$ 849892 794854 791089 816805 839770 811392 871517 997876 979541 887396 837129 921821
17734I21821l5574N537L707j2407j0946r8773j03758r6662M7515l948l704j4581
$$ 921821 886247 891784 895491 883084 872138 773365 669607 572945 620460 616512 612808 598227
17722E98227K0480K3579R8007N2663K1105Q748N2732P2466K2327M7283J70448
$$ 598227 618707 642286 740293 792956 814061 822809 875541 948007 970334 1017617 1188065
17711A188065R2498O3013n0616j50651j78594j01319o6848j4266m7216o4325k4877
$$ 1188065 1280563 1343576 1292960 1142309 963715 862396 795548 781282 734066 669741 644864
17700F44864P7732o0437k9803R1324J61212J76597J01254J9486K7367L1971J00401
$$ 644864 722596 662159 632356 723680 884892 1061489 1162743 1182229 1209596 1241567 1341968
17689A341968R1099J36009R753k10195j24719n4063j25676j45091m374J6386j79053
$$ 1341968 1433067 1569076 1578829 1368634 1243915 1189852 1064176 919085 914711 931097 752044
17678G52044j70458p5976P1392N3922r966l2212J9206j3438k0416q4376j7838
$$ 752044 581586 505610 577002 630924 620958 588746 607952 594514 574098 489722 471884
17667D71884J16033K5789K2712J9933M3742L1491J8958K2180M5054o291j15073
$$ 471884 587917 613706 636418 656351 700093 731584 750542 772722 817776 811485 696412
17656F96412n2755K1819L087J2211r0088m8020l7788M7150M9656J6790J287L3334
$$ 696412 643657 665476 668563 680774 590686 542666 504878 552028 601684 618474 619761 653095
17644F53095K0918j4422j6691M355k196R8445K5806l1017p2847p2987K1213K2664
$$ 653095 674013 659591 642900 647255 645059 743504 769310 738293 665446 592459 613672 636336
17632F36336l4291q279r902m2883J10056N0388n2265O0710R7502P2051k4960n2028
$$ 636336 602045 593766 583864 540981 651037 701425 649160 709870 807372 879423 854463 802435
17620H02435N5606j0111N572M0117K5869J26130R8931Q4856J11077O9372O4242
$$ 802435 858041 847930 853502 893619 919488 1045618 1144549 1229405 1340482 1409854 1474096
17609A474096J07776J41863J87319L07663K93284L12690K03110L25650L91316
$$ 1474096 1581872 1723735 1911054 2218717 2512001 2824691 3027801 3353451 3744767
17600C744767L84775N40767P39421R91275J208147J330195J466979J484017J346089
$$ 3744767 4129542 4670309 5409730 6401005 7609152 8939347 10406326 11890343 13236432
17591A3236432R48509j71475j435571j993248j976410j524692j076854p06632
$$ 13236432 14184941 14013466 12577895 10584647 8608237 7083545 6006691 5300059
17583E300059l90712j43368j37577n2046J19544K17358M39886N56943O90270J052643
$$ 5300059 4909347 4765979 4628402 4576356 4695900 4913258 5353144 5910087 6600357 7653000
17573G653000J370294J405351J305220J316963R81096J77685j102325k209381
$$ 7653000 9023294 10428645 11733865 13050828 14031924 14209609 13107284 10897903
17565A0897903k372587j912922j405743q55478o73216n74795m35297k33432k00619
$$ 10897903 8525316 6612394 5206651 4351173 3677957 3103162 2667865 2434433 2233814
17556B233814k81435k10207j17271p1778n7691j32026l4492j07283k0279j09370
$$ 2233814 1952379 1742172 1624901 1553123 1495432 1363406 1328914 1221631 1201352 1091982
17546A091982q0205q9893j29083o8703K0976K4717r6849n2583Q8534M3621Q7088
$$ 1091982 1011777 921884 792801 724098 745074 769791 672942 620359 708893 752514 839602
17535H39602J43159O0097r320k5096Q340l683K0022J42444J01247P7887J63886
$$ 839602 982761 1042858 1033538 1008442 1016782 1013099 1033121 1175565 1276812 1354699 1518585
17524A518585K07969K585N5188k272j45515j48681j79247j74162p4680j01718
$$ 1518585 1726554 1729139 1784327 1782055 1636540 1487859 1308612 1134450 1059770 958052
17514I58052j07950J1924R0633J46782O1511m8260j12982O0839K4975J34908K37086
$$ 958052 850102 862026 952659 1099441 1160952 1112692 999710 1060549 1085524 1220432 1457518
17503A457518J06233Q1929R9451O3439k2460q3730j35692k32386j44634j3669
$$ 1457518 1563751 1645680 1745131 1808570 1786110 1702380 1566688 1334302 1189668 1175999
17493A175999r4476m8031P7891K4467j09151j23036M3351Q6654p107q9947J19663
$$ 1175999 1081523 1033492 1111383 1135850 1026699 903663 947014 1033668 1026561 936614 1056277
17482A056277M6074k5932K6493r967o338M2534n3980k9099O0694O4642l4620L6633
$$ 1056277 1102351 1076419 1102912 1092945 1086607 1129141 1075161 1046062 1106756 1171398 1136778 1173411
17470A173411n893j5062J1327k2223p667k7385j5325l3752p1414j0929J2454P6059
$$ 1173411 1167518 1152456 1163783 1141560 1133893 1106508 1091183 1057431 986017 975088 987542 1063601
17458A063601N5141L9801P3762L1862J4480k7515K8106K3841k6732R1367M1963
$$ 1063601 1118742 1158543 1232305 1264167 1278647 1251132 1279238 1303079 1276347 1367714 1409677
17447A409677o3399l1027l4250n4246j06925o3254O4709M613k2128P0492J26753
$$ 1409677 1346278 1315251 1281001 1226755 1119830 1056576 1121285 1125898 1103770 1174262 1301015
17436A301015M1012l8406N3680M3791n346K1419o5094M475K6940j7041l1090J05881
$$ 1301015 1342027 1303621 1357301 1401092 1395746 1417165 1352071 1356546 1383486 1366445 1335355 1441236
17424A441236m447K0984O436Q315M4537j6129r2150J1581R9209Q5108J0840l3893
$$ 1441236 1436789 1457773 1464209 1472524 1517061 1500932 1408782 1420363 1519572 1604680 1615520 1581627
17412A581627j9119M3541O3821R8056K1789R3324Q1238M5885J23896l324K0621
$$ 1581627 1562508 1606049 1669870 1767926 1789715 1883039 1964277 2010162 2134058 2130734 2151355
17401B151355J43770M0854J99433J83374j05778k06723j14297K2820J16643J13786
$$ 2151355 2295125 2335979 2535412 2718786 2613008 2406285 2291988 2314808 2431451 2545237
17391B545237K29214J34397N0394L9781N007k45018l06706j79390r820Q071N230
$$ 2545237 2774451 2908848 2959242 2999023 3004030 2759012 2452306 2272916 2263096 2271167 2276397
17380B276397J13478M3693O6429J65803K26619Q9042k38542j54105l7442J8548
$$ 2276397 2389875 2433568 2499997 2665800 2892419 2981461 2742919 2588814 2551372 2569920
17370B569920K4068J44568J05926j7493L5713O3338q3977k59969l42788j96733
$$ 2569920 2593988 2738556 2844482 2826989 2862702 2926040 2842063 2582094 2239306 2042573
17360B042573p8943l6375L8255o167n2392l9054J9681L0561o646j5532j50745
$$ 2042573 1963630 1927255 1965510 1959343 1906951 1867897 1887578 1918139 1911493 1895961 1745216
17349A745216n8462M93J1905M5205l3676n7448q192P9463o8547j20722o2633o0745
$$ 1745216 1686754 1687247 1699152 1744357 1710681 1653233 1645041 1724504 1655957 1535235 1472602 1411857
17337A411857j8055j09921k9925k734L2089K6754n3291K5278K2200n3859o2768
$$ 1411857 1393802 1283881 1253956 1251222 1283311 1310065 1256774 1282052 1304252 1250393 1187625
17326A187625P3541K6810j3060j22348k3242P043k3947R1134o49j10600k3861
$$ 1187625 1261166 1287976 1274916 1152568 1129326 1136369 1112422 1203556 1202907 1092307 1068446
17315A068446p5472o695L6537J9067N5190k197J8171N1942P9935m8242q5955L8235
$$ 1068446 992974 986279 1022816 1041883 1097073 1094876 1113047 1164989 1244924 1196682 1110727 1148962
17303A148962q826n245p6628n4708p4203p0754q5144J5643O5144J4985k1930m1910
$$ 1148962 1140136 1134891 1058263 1003555 929352 858598 773454 789097 854241 869226 847296 805386
17291H05386r361R903k980O8139n5775j16919K7902R0253L2896n4805r7640L1311
$$ 805386 796025 805928 802948 871087 815312 698393 726295 816548 849444 794639 696999 728310
17279G28310Q9209Q0757M0079Q4411l0861p4752l9722j5338Q332l4109j17951
$$ 728310 817519 898276 938355 1022766 991905 917153 877431 862093 870425 836316 718365
17268G18365j00993m3277J10124R1852N7549M6570J6909p1458L1940P2351L9364
$$ 718365 617372 574095 684219 776071 833620 880190 897099 825641 857581 929932 969296
17257I69296n4815l032J7922k5420o2174M8588Q9916j479j9987P3492R6610L7444
$$ 969296 914481 911449 929371 903951 841777 890365 980281 978802 958815 1032307 1128917 1166361
17245A166361P9873j4951m8209q1761J2726R3880J15521M2316J6557L1047K0262
$$ 1166361 1246234 1231283 1183074 1101313 1114039 1207919 1323440 1365756 1382313 1413360 1433622
17234A433622N7783j720p0514r2949J56545N1914j4482J0800P3593J45213P3533
$$ 1433622 1491405 1489685 1419171 1326222 1482767 1534681 1520199 1530999 1604592 1749805 1823338
17223A823338P8242K04470K30992J60963K46818L43893N43354P95322R69328J207658
$$ 1823338 1901580 2106050 2337042 2498005 2744823 3088716 3632070 4427392 5396720 6604378
17213F604378J415019J490082J510927J409110J215242M75547q77750j948596
$$ 6604378 8019397 9509479 11020406 12429516 13644758 14120305 13242555 11293959
17205A1293959k116551j712887j306170r98247p08362m57428k26017j19427M1801
$$ 11293959 9177408 7464521 6158351 5160104 4451742 3994314 3768297 3648870 3690671
17196C690671K32070L05150O04884Q58445J094893J284845J365750J372673J318569
$$ 3690671 3922741 4227891 4832775 5691220 6786113 8070958 9436708 10809381 12127950
17187A2127950J096560J83018r91465j904212k193641j865852j251805q98628
$$ 12127950 13224510 13407528 12416063 10511851 8318210 6452358 5200553 4301925
17179D301925o40142n78589m68278l12002k68978j95645j66598j76037m6287p1347
$$ 4301925 3661783 3083194 2614916 2302914 2033936 1838291 1671693 1495656 1449369 1378022
17169A378022j9339P0161j16062j47803l5310n8045j26020l1177p0790L106P472
$$ 1378022 1358683 1428844 1312782 1164979 1129669 1071624 945604 914427 843637 846743 854215
17158H54215J9434Q1282o6606n8741M4263K0873j4043N9658l7090O2402J23408
$$ 854215 873649 954931 888325 829584 873847 894720 880677 940335 903245 965647 1089055
17147A089055M9466J2745K1552N4214o2267N067l3451m1025n3477j44766j50240
$$ 1089055 1138521 1151266 1172818 1227032 1164765 1169832 1136381 1095356 1041879 897113 746873
17136G46873n5322l1359K0264J3861j3475O8436P1679l2118P759L6806n1994j26065
$$ 746873 691551 660192 680456 694317 680842 749278 820957 788839 796598 833404 781410 655345
17124F55345r2096j2786M555l7208R7210O0006j6220k4091j2993o1698M2723K383
$$ 655345 563249 550463 555018 517810 615020 675026 658806 634715 621722 560024 602747 605130
17112F05130q4756L8439L9714O4704L5568O3245L1067m6907r7979J8307j4747
$$ 605130 520374 558813 598527 663231 698799 762044 793111 746204 648225 666532 651785
17101F51785K9991l2481J2389m480K4011N6776R1690O6151q263j47589j01353
$$ 651785 681776 649295 661684 657204 681215 737991 829681 895832 887569 739980 638627
17090F38627J7357p5173q4702k5995P0465M3378q377k7380o0989N7928M5782j0261
$$ 638627 655984 580811 496109 470114 540579 583957 575580 548200 487211 545139 590921 580660
17078E80660p5346l5450k2766J12202J22335R1412J2864o0982l3012M2878q743
$$ 580660 505314 469864 447098 559300 681635 773047 785911 724929 691917 734795 726052
17067G26052P8204N8067J28970R0270J8435j40769j17840k4058n1678k9600M0492
$$ 726052 804256 862323 991293 1081563 1099998 959229 841389 817331 765653 736053 776545
17056G76545M7304l6325n9671N4595K3923m1766n0268l5137O9440J34714K342
$$ 776545 823849 787524 727853 782448 806371 764605 714337 679200 748640 883354 885696
17045H85696k0675Q0431M4445L015J2976n9140m3097q8722p1267n8178l2579J1359
$$ 885696 865021 945452 989897 992912 1005888 946748 903651 814929 743662 685484 652905 664264
17033F64264J3482Q5533M0912m0732o0854p599n597n8295k4092n310j6155K7996
$$ 664264 677746 763279 804191 763459 702605 695006 689409 631114 607022 601712 585557 613553
17021F13553n6805p5423r5225l1778N3763M6481k1676m7062r4069r4302M8323
$$ 613553 556748 481325 386100 354322 408085 454566 432890 385828 291759 197457 245780
17010B45780k8194Q0016J19482m8121N0842j9230O5815K9575l293M5727k2291
$$ 245780 217586 297602 417084 368963 419805 400575 466390 495965 492672 538399 516108
16999E16108K9648n5339p4954q0673j4822M2516M8039J1829n0542J7352M0868
$$ 516108 545756 490417 415463 334790 319968 362484 410523 422352 371810 389162 430030
16988D30030M8329m8396m8904J3327K0772k5334m9908j10040l4695L4711N0542
$$ 430030 478359 429963 381059 394386 415158 389824 339916 229876 195181 229892 280434
16977B80434n1204P3254J11961m6497L7342M7781q651k2804M31K8203j9349j8174
$$ 280434 229230 302484 414445 367948 405290 453071 444420 421616 422047 450250 430901 412727
16965D12727p2831J86P6032n357j1079O3549K8773l544K1856l2823l7617n0375
$$ 412727 339896 340082 416114 410757 399678 463227 492000 488456 510312 477489 439872 389497
16953C89497j1030P1299r234J8259M2339N0261m1179l1667m1698r5157k5772M6562
$$ 389497 378467 449766 440532 458791 501130 551391 510212 478545 436847 341690 315918 362480
16941C62480P6900l933K556l5684p2752n8792P9520N8679m1819Q547M562p5027
$$ 362480 439380 435447 438003 402319 329567 270775 350295 408974 367155 375702 380264 305237
16929C05237j2133l0082L430P086K9250j1873j4638K2292p570j18789j6653L6107
$$ 305237 293104 263022 266452 273538 302788 290915 276277 298569 290999 172210 155557 191664
16917A91664J9940K9108P4307P9535p9099k0676N7810Q2188O9272m871k2892n597
$$ 191664 211604 240712 315019 394554 315455 294779 352589 434777 504049 499178 476286 470689
16905D70689r6930o7653J5062n8124o1506O9946M7380m090k2881J0333m7161K2488
$$ 470689 373759 306106 321168 263044 201538 271484 318864 314774 291893 302226 255065 277553
16893B77553J03792L9838p0176o9014P9949n5164n9002L4148L5026k9625N7376
$$ 277553 381345 421183 351007 281993 361942 306778 247776 281924 316950 287325 344701
16882C44701j4347K5401P1250j3651P927K329j11531r7795J04001L7757q7248
$$ 344701 330354 355755 427005 413354 421281 423610 312079 214284 318285 356042 268794
16871B68794K2540J62153M9596M187K4402N9527Q1064K0875j02219j8298o8208
$$ 268794 291334 453487 503083 507270 531672 591199 672263 693138 590919 572621 504413
16860E04413K3476q9599j6151J18645J05115M1839k9986j18029j24134P094K7204
$$ 504413 527889 438290 422139 540784 645899 687738 657752 539723 415589 422683 449887
16849D49887J8085K9543J6245j3609O1485R5913j911k1735J764p175l8144m0586
$$ 449887 467972 497515 513760 500151 561636 657549 655638 633903 635667 628492 590348 549762
$$ [...]
##END NTUPLES=NMR SPECTRUM
##END=
