##TITLE=Analysis number 323733
Compound Code aw 00372
Project Code adrs
Chemist Name melford labs ltd
##JCAMPDX= 6.0         $$ Bruker NMR JCAMP-DX V2.0
##DATA TYPE= NMR SPECTRUM
##DATA CLASS= NTUPLES
##ORIGIN= Bruker BioSpin GmbH
##OWNER= nmr
$$ XWIN-NMR		Version 3.5
$$ Wed Nov  8 09:29:35 2006 GMT Standard Time (UT+0h)  MAYBRIDGE\nmr@NMR_250MHZ
##.OBSERVE FREQUENCY= 250.131544655141
##.OBSERVE NUCLEUS= ^1H
##.ACQUISITION MODE= SIMULTANEOUS (DQD)
##.ACQUISITION SCHEME= undefined
##.AVERAGES= 16
##.DIGITISER RES= 18
##SPECTROMETER/DATA SYSTEM= dpx250
##.PULSE SEQUENCE= zg30
##.SOLVENT NAME= CDCl3
##.SHIFT REFERENCE= (INTERNAL, CDCl3, 0, 16.522)
##AUDIT TRAIL= $$ (NUMBER, WHEN, WHO, WHERE, WHAT)
$$ ##TITLE= Audit trail, XWIN-NMR		Version 3.5
$$ ##JCAMPDX= 5.01
$$ ##ORIGIN= Bruker BioSpin GmbH
$$ ##OWNER= nmr
$$ C:\u/data/dgb/nmr/ADRS/2410/pdata/1/auditp.txt
$$ ##AUDIT TRAIL=  $$ (NUMBER, WHEN, WHO, WHERE, WHAT)
(   1,<2006-11-08 09:28:48.02 +000>,<MAYBRIDGE\nmr>,<NMR_250MHZ>,
      <created by zg, POWCHK disabled, PULCHK disabled
       configuration hash MD5:
       49 4B E0 1D 92 C2 6B 37 9F E6 65 BC 52 41 86 1D
       data hash MD5: 64K
       E9 45 66 F3 E3 44 1E 64 41 45 CF AF 38 83 75 58>)
(   2,<2006-11-08 09:29:11.60 +000>,<MAYBRIDGE\nmr>,<NMR_250MHZ>,
      <Start of raw data processing
       ef LB = 0.3 FT_mod = 6 PKNL = 1 SI = 32K 
       data hash MD5: 32K
       21 17 8E 3A D6 2D F2 60 7A 82 D2 34 87 9A FE 2A>)
(   3,<2006-11-08 09:29:15.74 +000>,<MAYBRIDGE\nmr>,<NMR_250MHZ>,
      <apk 
       data hash MD5: 32K
       2F B8 72 49 1D 0C 09 B1 C1 F5 09 42 D1 9E 0F 73>)
(   4,<2006-11-08 09:29:20.46 +000>,<MAYBRIDGE\nmr>,<NMR_250MHZ>,
      <abs ABSG = 5 
       data hash MD5: 32K
       B3 2A F0 6B 78 0B 60 F8 60 4D 6A A3 2B B1 6A 2C>)
$$ ##END=
$$ 
$$ hash MD5
$$ 76 4E C8 DD 5C 02 0D C7 3F 56 DB 96 14 DC BB C9
##$RELAX= 
##$RELAX= 
##$RELAX= 
##$RELAX= 
##$RELAX= 
##$RELAX= 
##$RELAX= 
$$ Bruker specific parameters
$$ --------------------------
##$DU= <C:\u>
##$EXPNO= 2410
##$NAME= <ADRS>
##$PROCNO= 1
##$TYPE= <nmr>
##$USER= <dgb>
##$AMP= (0..31)
100 100 100 100 100 100 100 100 100 100 100 100 100 100 100 100 100 100 
100 100 100 100 100 100 100 100 100 100 100 100 100 100 
##$AQSEQ= 0
##$AQ_mod= 3
##$AUNM= <au_zg>
##$AUTOPOS= <2 >
##$BF1= 250.13
##$BF2= 250.13
##$BF3= 250.13
##$BF4= 250.13
##$BF5= 500.13
##$BF6= 500.13
##$BF7= 500.13
##$BF8= 500.13
##$BYTORDA= 1
##$CFDGTYP= 0
##$CFRGTYP= 5
##$CHEMSTR= <none>
##$CNST= (0..31)
1 1 145 1 1 1 1 1 1 1 1 1 1 1 1 1 1 1 1 1 1 1 1 1 1 1 1 1 1 1 1 1 
##$CPDPRG= <>
##$CPDPRG1= <>
##$CPDPRG2= <>
##$CPDPRG3= <>
##$CPDPRG4= <mlev>
##$CPDPRG5= <mlev>
##$CPDPRG6= <mlev>
##$CPDPRG7= <mlev>
##$CPDPRG8= <mlev>
##$CPDPRGB= <>
##$CPDPRGT= <>
##$D= (0..31)
0 1 0 0 0 0 0 0 0 0.06 0 0 0 0 0 0 0.0002 0 0 0 0 0 0 0 0 0 0 0 0 0 0 
0 
##$DATE= 1162978125
##$DBL= (0..7)
120 120 120 120 120 120 120 120 
##$DBP= (0..7)
150 150 150 150 150 150 150 150 
##$DBP07= 0
##$DBPNAM0= <>
##$DBPNAM1= <>
##$DBPNAM2= <>
$$ [...]
##$SUBNAM7= <"">
##$SUBNAM8= <"">
##$SUBNAM9= <"">
##$SW= 20.6930455092707
##$SWIBOX= (0..15)
0 0 3 0 0 0 0 0 0 0 0 0 0 0 0 0 
##$SW_h= 5175.983436853
##$TD= 65536
##$TD0= 1
##$TE= 683.16
##$TE2= 300
##$TE3= 300
##$TEG= 300
##$TL= (0..7)
0 120 120 120 120 120 120 120 
##$TP= (0..7)
150 150 150 150 150 150 150 150 
##$TP07= 0
##$TPNAME0= <>
##$TPNAME1= <>
##$TPNAME2= <>
##$TPNAME3= <>
##$TPNAME4= <>
##$TPNAME5= <>
##$TPNAME6= <>
##$TPNAME7= <>
##$TPOAL= (0..7)
0.5 0.5 0.5 0.5 0.5 0.5 0.5 0.5 
##$TPOFFS= (0..7)
0 0 0 0 0 0 0 0 
##$TUNHIN= 0
##$TUNHOUT= 0
##$TUNXOUT= 0
##$USERA1= <user>
##$USERA2= <user>
##$USERA3= <user>
##$USERA4= <user>
##$USERA5= <user>
##$V9= 5
##$VALIST= <valist>
##$VCLIST= <CCCCCCCCCCCCCCC>
##$VD= 0
##$VDLIST= <DDDDDDDDDDDDDDD>
##$VPLIST= <PPPPPPPPPPPPPPP>
##$VTLIST= <TTTTTTTTTTTTTTT>
##$WBST= 1024
##$WBSW= 4
##$XGAIN= (0..3)
0 0 0 0 
##$XL= 0
##$YL= 0
##$YMAX_a= 547267
##$YMIN_a= -610019
##$ZGOPTNS= <>
##$ZL1= 120
##$ZL2= 120
##$ZL3= 120
##$ZL4= 120
##$ABSF1= 16.522
##$ABSF2= -4.171173
##$ABSG= 5
##$ABSL= 3
##$ALPHA= 0
##$AQORDER= 0
##$ASSFAC= 0
##$ASSFACI= 0
##$ASSFACX= 0
##$ASSWID= 0
##$AUNMP= <proc_1d>
##$AZFE= 0.1
##$AZFW= 0.1
##$BCFW= 0
##$BC_mod= 0
##$BYTORDP= 0
##$COROFFS= 0
##$CY= 12.5
##$DATMOD= 1
##$DC= 0
##$DFILT= <>
##$DTYPP= 0
##$F1P= 14.0000005364418
##$F2P= -0.99999901652339
##$FCOR= 0.5
##$FTSIZE= 32768
##$FT_mod= 6
##$GAMMA= 0
##$GB= 0
##$INTBC= 1
##$INTSCL= 1
##$ISEN= 128
##$LB= 0.3
##$LEV0= 0
##$LPBIN= 0
##$MAXI= 10000
##$MC2= 0
##$MEAN= 0
##$ME_mod= 0
##$MI= 0
##$NCOEF= 0
##$NC_proc= -2
##$NLEV= 6
##$NOISF1= 0
##$NOISF2= 0
##$NSP= 0
##$NTH_PI= 0
##$NZP= 0
##$OFFSET= 16.522
##$PC= 1
##$PHC0= -55.22441
##$PHC1= 16.39646
##$PH_mod= 1
##$PKNL= yes
##$PPARMOD= 0
##$PSCAL= 4
##$PSIGN= 0
##$REVERSE= no
##$SF= 250.13
##$SI= 32768
##$SIGF1= 0
##$SIGF2= 0
##$SINO= 400
##$SIOLD= 32768
##$SREGLST= <1H.CDCl3>
##$SSB= 0
##$STSI= 32768
##$STSR= 0
##$SW_p= 5175.98343685301
##$SYMM= 0
##$S_DEV= 0
##$TDeff= 65536
##$TDoff= 0
##$TI= <Analysis number 999999
Compound Code 99
Book Reference 9
Project Code 9>
##$TILT= no
##$TM1= 0
##$TM2= 0
##$TOPLEV= 0
##$USERP1= <user>
##$USERP2= <user>
##$USERP3= <user>
##$USERP4= <user>
##$USERP5= <user>
##$WDW= 1
##$XDIM= 32768
##$YMAX_p= 376129198
##$YMIN_p= -79690
$$ End of Bruker specific parameters
$$ ---------------------------------
##NTUPLES= NMR SPECTRUM
##VAR_NAME=  FREQUENCY,     SPECTRUM/REAL,   SPECTRUM/IMAG
##SYMBOL=    X,             R,               I
##VAR_TYPE=  INDEPENDENT,   DEPENDENT,       DEPENDENT
##VAR_FORM=  AFFN,          ASDF,            ASDF
##VAR_DIM=   32768,         32768,           32768
##UNITS=     HZ,            ARBITRARY UNITS, ARBITRARY UNITS
##FACTOR=    0.157963299565203, 1,           1
##FIRST=     4132.6476996994, 0,             0
##LAST=      -1043.33573715361, 0,           0
##MIN=       -1043.33573715361, -79690,      0
##MAX=       4132.6476996994, 376129198,     0
$$ Real data points
##PAGE= N=1
##DATA TABLE= (X++(R..R)), XYDATA
$$ [...]
$$ plain form
14986 18584 15763 11748 5022 19286 41393 32066 23550 29835 32588 33817 19344 515 7184
14973 7184 8426 -1551 7527 5228 1059 -1944 4097 8208 12976 12433 23137 22508 15018 13144 15522
14958 15522 10273 18812 21275 10785 8502 9163 14345 16879 24756 27797 19378 10869 16117 17186
14944 17186 22078 25690 32488 30178 28273 33636 37726 40394 51579 57367 47847 41071 37736 25044
14930 25044 26551 35818 29683 23346 26633 30029 23996 19442 20931 26024 13141 8139 13375 16694
14916 16694 19743 21317 27815 30886 23608 24201 34866 37325 52692 60663 53029 32759 39628 45244
14902 45244 43372 40613 35620 38644 27443 24570 11873 17765 30769 33152 29439 17174 13671
14889 13671 16898 23420 25153 26352 35844 40039 35723 33581 27744 25341 28227 28494 34052 41181 45959
$$ packed form
14986A8584k821m015o726J4264K2107r327q516O285K753J229j4473j8829O669
14973G184J242r977R078k299m169l003O041M111M768n43J0704o29p490j874K378
14958A5522n249Q539K463j0490k283O61N182K534P877L041q419q509N248J069
14944A7186M892L612O798k310j905N363M090K668J1185N788r520o776l335j2692
14930B5044J507R267o135o337L287L396o033m554J489N093j2883n002N236L319
14916A6694L049J574O498L071p278N93J0665K459J5367P971p634k0270O869N616
14902D5244j872k759m993L024j1201k873j2697N892J3004K383l713j2265l503
14889A3671L227O522J733J199R492M195m316k142n837k403K886K67N558P129M778
$$ plain form
14874 45959 41780 41259 34617 30874 15986 19440 26653 32508 29534 21830 40973 52990 43868 55478
14860 55478 61187 43320 34814 25802 20162 38553 36612 22333 37151 41529 50596 53172 41199
14847 41199 34735 27264 25374 34931 38956 31768 26418 22257 24024 21530 23938 36386 40708 44162
14833 44162 37363 35391 52207 49685 45510 49057 47935 33151 29684 32683 27696 25522 25237 34604
14819 34604 38944 39861 46816 53201 47456 35402 38445 50133 55717 55984 61031 55662 49375 47641
14805 47641 53588 55670 62774 62379 62957 68987 70770 63561 49142 50316 63271 72698 63696 44699
14791 44699 32633 30511 49618 50427 56145 59621 57472 60700 58715 56525 56083 57451 37034 37882
14777 37882 61876 80250 68730 57718 51211 62740 59616 54119 48107 48212 50983 61112 57923
$$ packed form
14874D5959m179n21o642l743j4888L454P213N855k974p704J9143J2017r122J1610
14860E5478N709j7867q506r012n640J8391j941j4279J4818M378R067K576j1973
14847D1199o464p471j890R557M025p188n350m161J767k494K408J2448M322L454
14833D4162o799j972J6816k522m175L547j122j4784l467K999m987k174k85R367
14819C4604M340R17O955O385n745j2054L043J1688N584K67N047n369o287j734
14805D7641N947K082P104l95N78O030J783p209j4419J174J2955R427r002j8997
14791D4699j2066k122J9107Q09N718L476k149L228j985k190m42J368k0417Q48
14777C7882K3994J8374j1520j1012o507J1529l124n497o012J05K771J0129l189
$$ plain form
14764 57923 54966 41751 47095 65105 67047 59581 65939 65247 61898 58214 48990 59059 69735 69938
14750 69938 64128 69346 66956 71343 73924 74370 74469 70715 75487 77106 65264 66719 70863 69648 72229
14735 72229 82873 84326 83527 85286 87643 81054 76317 68777 72617 66828 72140 63756 63592 64991 64132
14720 64132 64491 62025 70656 75318 67851 66414 83742 93888 98887 86982 75766 68652 52121
14707 52121 59600 72386 63922 61359 75502 83552 81263 82161 83983 78678 82400 93289 92173 92469
14693 92469 95297 93851 92547 80276 74304 70700 72101 82932 85726 84878 85018 95229 106404 93265
14679 93265 83397 69233 78746 79953 64550 73756 94016 92297 82940 92322 104575 107512 116675
14666 116675 121767 112948 111308 116588 104889 103606 121859 128464 123237 124429 122276 108474 111258
$$ packed form
14764E7923k957j3215N344J8010J942p466O358o92l349l684r224J0069J0676K03
14750F9938n810N218k390M387K581M46R9l754M772J619j1842J455M144j215K581
14735G2229J0644J453p99J759K357o589m737p540L840n789N312q384j64J399q59
14720F4132L59k466Q631M662p467j437J7328J0146M999j1905j1216p114j6531
14707E2121P479J2786q464k563J4143Q050k289Q98J822n305L722J0889j116K96
14693I2469K828j446j304j2271n972l604J401J0831K794q48J40J0211J1175j3139
14679I3265r868j4164R513J207j5403R206K0260j719r357R382J2253K937R163
14666A16675N092q819j640N280j1699j283J8253O605n227J192k153j3802K784
$$ plain form
14653 111258 115003 97814 96037 114524 127382 135283 121689 118275 119254 120252 136268 129937 122542
14640 122542 125105 122057 122805 135657 138910 136439 135153 136901 130044 139189 160877 156283 146488 152076
14626 152076 149635 138375 134170 140769 152524 152006 155116 160396 153733 166938 161280 154472 163751 165678
14612 165678 175779 177525 165421 157639 174001 176447 186367 183642 177145 180038 195001 205137 199223
14599 199223 200446 201063 191033 187445 189909 182102 197153 206693 201318 202887 191924 185064 187169 195393
14585 195393 199983 206595 203446 196396 201941 213907 203735 185979 186195 202449 210831 209095 215955
14572 215955 209676 215652 230502 243463 245739 238163 232620 225796 219977 219162 233541 245395 246542
14559 246542 232615 235600 240050 244086 248973 257522 264632 273505 264855 268849 266585 267355 260004 255363
$$ packed form
14653A11258L745j7189j777J8487J2858P901j3594l414R79R98J6016o331p395
14640A22542K563l048P48J2852L253k471j286J748o857R145K1688m594r795N588
14626A52076k441j1260m205O599J1755n18L110N280o663J3205n658o808R279J927
14612A65678J0101J746j2104p782J6362K446R920k725o497K893J4963J0136n914
14599A99223J223O17j0030l588K464p807J5051R540n375J569j0963o860K105Q224
14585A95393M590O612l149p050N545J1966j0172j7756K16J6254Q382j736O860
14572B15955o279N976J4850J2961K276p576n543o824n819q15J4379J1854J147
14559B46542j3927K985M450M036M887Q549P110Q873q650L994k264P70p351m641
$$ plain form
14545 255363 258907 255201 262729 267782 285933 302230 299264 293609 297710 302094 313518 320288 325665
14532 325665 329942 324707 319274 329690 333876 330162 335237 345345 360173 361162 387617 393072 374847
14519 374847 376322 372410 375673 381388 372315 351407 354218 364452 379115 383899 384233 382715 393102
14506 393102 410070 417229 414829 402592 418772 445242 452247 452355 456891 460439 463740 475402 494657
14493 494657 502855 503352 503779 493757 491948 494156 499154 510921 529190 535834 540705 533147 549179 550152
14479 550152 553821 556674 555078 562093 586946 615756 632037 643835 640546 638750 652263 654124 656282
14466 656282 668662 681310 697475 720947 728090 739112 769873 780234 776678 802770 820446 825412
14454 825412 829324 837901 850523 866270 888327 891271 906586 910626 930807 957831 970649 988011
$$ packed form
14545B55363L544l706P528N053J8151J6297k966n655M101M384J1424O770N377
14532C25665M277n235n433J0416M186l714N075J0108J4828R89K6455N455j8225
14519C74847J475l912L263N715r073k0908K811J0234J4663M784L34j518J0387
14506C93102J6968P159k400j2237J6180K6470P005J08M536L548L301J1662J9255
14493D94657Q198M97M27j0022j809K208M998J1767J8269O644M871p558J6032R73
14479E50152L669K853j596P015K4853K8810J6281J1798l289j796J3513J861K158
14466F56282J2380J2648J6165K3472P143J1022L0761J0361l556K6092J7676M966
14454H25412L912Q577J2622J5747K2057K944J5315M040K0181K7024J2818J7362
$$ plain form
14442 988011 996604 998828 1012015 1044764 1076130 1107153 1135599 1151365 1151023 1165198 1186894 1223917
14430 1223917 1235236 1248721 1264603 1282977 1297693 1315048 1341542 1377660 1413761 1459697 1481322
14419 1481322 1489169 1495443 1520006 1555072 1589903 1621619 1643952 1661057 1673059 1691210 1717142 1744949
14407 1744949 1766194 1795622 1829781 1859587 1883598 1916872 1938025 1956622 1978741 1997972 2036718
14396 2036718 2077695 2110825 2140495 2149947 2163993 2193373 2221311 2251300 2261053 2268945 2286157 2312844
14384 2312844 2336272 2364676 2389695 2433639 2457067 2467142 2484757 2499779 2499256 2518335 2536339 2552371
14372 2552371 2570448 2598240 2618291 2645414 2664940 2659853 2667961 2679946 2689309 2691494 2702652 2700365
14360 2700365 2703278 2713315 2711534 2721793 2736139 2748717 2762369 2785355 2782806 2759355 2746222 2738835
$$ packed form
14442I88011Q593K224J3187L2749L1366L1023K8446J5766l42J4175K1696L7023
14430A223917J1319J3485J5882J8374J4716J7355K6494L6118L6101M5936K1625
14419A481322P847O274K4563L5066L4831L1716K2333J7105J2002J8151K5932K7807
14407A744949K1245K9428L4159K9806K4011L3274K1153J8597K2119J9231L8746
14396B036718M0977L3130K9670R452J4046K9380K7938K9989R753P892J7212K6687
14384B312844K3428K8404K5019M3944K3428J0075J7615J5022n23J9079J8004J6032
14372B552371J8077K7792K0051K7123J9526n087Q108J1985R363K185J1158k287
14360B700365K913J0037j781J0259J4346J2578J3652K2986k549k3451j3133p387
$$ plain form
14348 2738835 2739890 2733922 2726644 2724685 2720056 2715989 2699945 2679373 2670049 2673527 2663789 2656636 2653864
14335 2653864 2648589 2638414 2614227 2599337 2586402 2561265 2536411 2525520 2501573 2465487 2447459
14324 2447459 2425852 2407837 2389517 2376644 2360299 2337759 2322571 2304938 2284581 2255418 2236271
14313 2236271 2202772 2170582 2155527 2142133 2121218 2099005 2064363 2043563 2031351 1993047 1968094
14302 1968094 1945349 1926400 1899441 1865785 1840983 1814012 1786982 1764647 1739682 1728711 1712642
14291 1712642 1688591 1663392 1646991 1625352 1596057 1579191 1556249 1528950 1500628 1474906 1448611
14280 1448611 1432797 1406870 1391550 1373542 1363316 1337036 1319122 1304379 1284613 1257198 1221341
14269 1221341 1201967 1193693 1182825 1164867 1147819 1131730 1109665 1094524 1082218 1063813 1049653
$$ packed form
14348B738835J055n968p278j959m629m067j6044k0572r324L478r738p153k772
14335B653864n275j0175k4187j4890j2935k5137k4854j0891k3947l6086j8028
14324B447459k1607j8015j8320j2873j6345k2540j5188j7633k0357k9163j9147
14313B236271l3499l2190j5055j3394k0915k2213l4642k0800j2212l8304k4953
14302A968094k2745j8949k6959l3656k4802k6971k7030k2335k4965j0971j6069
14291A712642k4051k5199j6401k1639k9295j6866k2942k7299k8322k5722k6295
14280A448611j5814k5927j5320j8008j0226k6280j7914j4743j9766k7415l5857
14269A221341j9374q274j0868j7958j7048j6089k2065j5141j2306j8405j4160
$$ plain form
14258 1049653 1037183 1039876 1020984 1010679 997592 976063 961956 951065 951842 952123 927895 909373
14246 909373 899720 896691 883963 861046 851298 832364 812727 809116 811085 785931 761728 747633
14234 747633 737889 731318 722544 728172 713111 703461 690782 683425 686046 676075 662813 666992 665402
14221 665402 650108 629745 622853 622981 609868 610007 625221 618946 608546 595474 584591 577448 560200
14208 560200 555033 566159 563037 554304 544450 531350 526982 529514 514517 496734 487386 482357 493549
14195 493549 503228 508405 512831 499589 491367 498971 494671 469452 464495 467814 473672 465529 465068 461129
14181 461129 456654 459069 457998 456634 457056 464865 448993 425702 411306 406638 409149 399176 392397 395958
14167 395958 391644 375650 379583 381737 371299 361901 353501 344196 346546 354951 363504 366104 363607 372780
$$ packed form
14258A049653j2470K693j8892j0305j3087k1529j4107j0891P77K81k4228j8522
14246I09373r653l029j2728k2917r748j8934j9637l611J969k5154k4203j4095
14234G47633r744o571q774N628j5061r650j2679p357K621r971j3262M179j590
14221F65402j5294k0363o892J28j3113J39J5214o275j0400j3072j0883p143j7248
14208E60200n167J1126l122q733r854j3100m368K532j4997j7783r348n029J1192
14195D93549R679N177M426j3242q222P604m300k5219m957L319N858q143m61l939
14181D61129m475K415j071j364M22P809j5872k3291j4396m668K511r973o779L561
14167C95958m314j5994L933K154j0438r398q400r305K350Q405Q553K600k497R173
$$ plain form
14153 372780 371454 352661 339460 340505 354306 357768 356278 349141 335235 330170 331978 324636 318677
14140 318677 314218 311523 329628 338188 342461 342954 339874 323865 325803 324616 313588 324123 332787
14127 332787 326853 309322 312180 324148 321767 309214 294324 292131 296237 306553 304480 312396 323841
14114 323841 316564 302676 305615 309868 297519 298758 302023 303590 289972 288775 284705 284256 283583 263719
14100 263719 265606 266688 269727 276769 285392 283441 277963 288721 294910 294485 291545 275018 273055 272404
14086 272404 259835 258195 262938 268765 270422 270092 274080 260551 267075 282786 280325 275364 268936 265363
14072 265363 275846 273314 281005 269651 261548 258172 256725 254361 268817 272032 268138 265211 273699
14059 273699 267799 267519 257697 272067 286549 279492 258998 263747 261908 256400 262565 263865 255752 263774
$$ packed form
14153C72780j326j8793j3201J045J3801L462j490p137j3906n065J808p342n959
14140C18677m459k695J8105Q560M273M93l080j6009J938j187j1028J0535Q664
14127C32787n934j7531K858J1968k381j2553j4890k193M106J0316k073P916J1445
14114C23841p277j3888K939M253j2349J239L265J567j3618j197m070m49o73j9864
14100B63719J887J082L039P042Q623j951n478J0758O189m25k940j6527j963o51
14086B72404j2569j640M743N827J657l30L988j3529O524J5711k461m961o428l573
14072B65363J0483k532P691j1354q103l376j447k364J4456L215l894k927Q488
14059B73699n900k80r822J4370J4482p057k0494M749j839n508O165J300q113Q022
$$ plain form
14045 263774 248743 244109 241747 234665 228787 226660 227779 236478 246867 246562 247366 251118 258233 257382
14031 257382 256544 266272 255457 240501 240034 242244 244314 252887 247975 246011 238230 241456 250077 240704
14017 240704 235812 239268 236651 232913 233115 236117 235885 224655 222967 234765 233172 226834 227795 234349
14003 234349 230935 241004 247342 239108 246305 251102 250216 243607 247930 248606 230556 211110 210537 211393
13989 211393 211502 206481 209496 210186 212584 228511 227704 219473 220309 235584 249141 230022 216016 220574
13975 220574 208455 212127 210779 209804 202082 200588 203295 188402 186827 208124 218112 210185 199320
13962 199320 193151 202598 206403 194090 186215 182845 193637 190103 198747 196927 191695 198091 204882 208204
13948 208204 199808 196531 179657 163599 159544 164399 177488 184259 179621 176502 182358 172680 179291
$$ packed form
14045B63774j5031m634k362p082n878k127J119Q699J0389l05Q04L752P115q51
14031B57382q38R728j0815j4956m67K210K070Q573m912j964p781L226Q621r373
14017B40704m892L456k617l738K02L002k32j1230j688J1798j593o338R61O554
14003B34349l414J0069O338q234P197M797q86o609M323O76j8050j9446n73Q56
13989B11393J09n021L015O90K398J5927q07q231Q36J5275J3557j9119j4006M558
13975B20574j2119L672j348r75p722j494K707j4893j575K1297R988p927j0865
13962A99320o169R447L805j2313p875l370J0792l534Q644j820n232O396O791L322
13948B08204q396l277j6874j6058m055M855J3089O771m638l119N856r678O611
$$ plain form
13935 179291 184537 182775 182435 184515 182258 182279 173940 165830 153700 143552 150239 156218 148731 157424
13921 157424 160039 161308 173110 186146 180363 168661 158047 145767 136607 143905 138083 129517 126377
13908 126377 130836 143242 142111 141222 151175 142296 125439 127792 134756 138509 146706 141780 136012 146001
13894 146001 145064 140303 143743 154465 162291 152321 144504 141874 134864 133091 134634 138221 139045 133449
13880 133449 130403 119657 119771 122801 126405 124080 122847 114160 102596 101587 110416 132304 145846
13867 145846 126960 116609 103711 103797 110142 105347 96636 87537 95706 98969 98641 102302 101202 98486
13853 98486 90174 88338 86989 91355 91155 87904 79601 83760 87450 95060 102055 104373 105098 85516 70599
13838 70599 69635 60120 65016 88512 93193 91763 81744 79007 80960 78323 81952 76055 70940 72521
$$ packed form
13935A79291N246j762l40K080k257K1q339q110j2130j0148O687N979p487Q693
13921A57424K615J269J1802J3036n783j1702j0614j2280r160P298n822q566l140
13908A26377M459J2406j131q89R953q879j6857K353O964L753Q197m926n768R989
13894A46001r37m761L440J0722P826r970p817k630p010j773J543L587Q24n596
13880A33449l046j0746J14L030L604k325j233q687j1564j009Q829K1888J3542
13867A45846j8886j0351j2898Q6O345m795q711r099Q169L263l28L661j100k716
13853I8486q312j836j349M366k00l251q303M159L690P610O995K318P25j9582j4917
13838G0599r64r515M896K3496M681j430j0019k737J953k637L629n897n115J581
$$ plain form
13824 72521 77878 77784 73831 76221 73541 83925 75152 74946 85379 90005 85788 79204 76753 65312
13810 65312 58737 54630 47941 58396 59862 58310 65710 62875 60822 54462 52539 61872 52196 42855
13796 42855 58407 68739 57116 48002 56184 66031 64029 53358 53351 59889 79127 76620 60157 63926
13782 63926 71252 65854 56149 63972 62697 55248 59302 62864 60049 51253 48455 52471 71858 69985
13768 69985 52396 43766 31735 25607 31806 44852 40243 31501 35175 42950 48657 47387 36735
13755 36735 42060 48418 44030 51162 52165 31804 23035 25803 24799 24530 31142 29806 36356 40216
13741 40216 40399 27063 23189 34738 37487 34203 30894 28740 29851 23949 20122 15324 26359 28964
13727 28964 45889 58811 52075 47197 41919 35048 30158 33732 36086 29809 23052 19639 17874 13855
$$ packed form
13824G2521N357r4l953K390k680J0384q773k06J0433M626m217o584k451j1441
13810F5312o575m107o689J0455J466j552P400k835k053o360j923R333r676r341
13796D2855J5552J0332j1623r114Q182R847k002j0671pO538J9238k507j6463L769
13782F3926P326n398r705P823j275p449M054L562k815q796k798M016J9387j873
13768F9985j7589q630j2031o128O199J3046m609q742L674P775N707j270j0652
13755C6735N325O358m388P132J003k0361q769K768j004k69O612j336O550L860
13741D0216J83j3336l874J1549K749l284l309k154J111n902l827m798J1035K605
13727B8964J6925J2922o736m878n278o871m890L574K354o277o757l413j765m019
$$ plain form
13713 13855 17798 27720 35203 34433 37451 33216 30367 33801 36944 25962 23872 18522 10736 21090
13699 21090 29151 31937 23036 23468 13182 19406 29634 26531 14417 8387 23639 25766 13332
13686 13332 14620 22162 22506 12913 15999 22477 24642 30386 32802 18758 12971 18309 13272 7360
13672 7360 8380 13649 14311 18018 20011 20170 17326 17289 16670 20467 21785 24754 31474 35465 32009 21847
13656 21847 23580 37446 38676 22501 14434 10793 9861 16865 24506 17300 2798 3163 23569 38770
13642 38770 24994 17811 18114 27909 25779 26848 36880 32531 9867 -6979 -18123 -3984 16358
13629 16358 20379 21581 39846 28899 34414 23791 14296 949 -15960 -15181 -8582 14007 23399
13616 23399 23290 14969 6418 554 11749 12561 7353 6917 -841 12008 14522 19941 21267 5480
$$ packed form
13713A3855L943R922P483p70L018m235k849L434L143j0982k090n350p786J0354
13699B1090Q061K786q901M32j0286O224J0228l103j2114o030J5252K127j2434
13686A3332J288P542L44r593L086O478K165N744K416j4044n787N338n037n912
13672G360J020N269O62L707J993J59k844l7o19L797J318K969O720L991l456j0162
13656B1847J733J3866J230j6175q067l641r32P004P641p206j4502L65K0406J5201
13642C8770j3776p183L03R795k130J069J0032m349k2664j6846j1144J4139K0342
13629A6358M021J202J8265j0947N515j0623r495j3347j6909P79O599K2589R392
13616B3399j09q321q551n864J1195Q12n208m36p758J2849K514N419J326j5787
$$ plain form
13602 5480 -3448 -3274 -8041 -3305 10289 4996 -158 3039 8532 2668 -4283 -2272 5622 9688 16096
13587 16096 23533 27924 16323 7518 4453 5375 6892 4842 4906 13844 4435 7088 -273 1481 -970
13572 -970 -5637 4113 5691 4665 3291 3399 10716 16778 18927 16888 8327 18389 24716 16400 1089
13557 1089 -10008 121 13542 22640 19255 7984 12273 18871 14880 -6679 -19675 -19641 -8478
13544 -8478 3757 6021 12908 85 -2047 -12155 2676 4791 -7867 -20036 -22056 -15896 -9555
13531 -9555 -5801 -13331 -13596 -14246 -2946 212 4530 10558 9212 9053 10664 15 -12264 -3977 875
13516 875 5121 2136 -5207 -7079 -224 14268 16395 7270 -3215 -460 5395 12765 8876 2332
13502 2332 -1868 -5246 -5804 4161 7672 4745 -3171 8105 -1992 -2478 -3347 -13162 266 6017 15980
$$ packed form
13602E480q928J74m767M736J3594n293n154L197N493n864o951K011P894M066O408
13587A6096P437M391j1601q805l065R22J517k050O4Q938r409K653p361J754k451
13572i70m667R750J578j026j374J08P317O062K149k039q561J0062O327q316j5311
13557A089j1097J0129J3421R098l385j1271M289O598l991k1559j2996L4J1163
13544h478J2235K264O887j2823k132j0108J4831K115j2658j2169k020O160O341
13531i555L754p530k65o50J1300L158M318O028j346j59J611j0649j2279Q287M852
13516H75M246k985p343j872O855J4492K127r125j0485K755N855P370l889o544
13502B332m200l378n58R965L511k927p916J1276j0097m86q69r815J3428N751R963
$$ plain form
13487 15980 9980 8022 18821 15079 11946 14255 15060 7533 6054 16513 12408 3493 5224 9327
13473 9327 -6426 -7173 1396 11098 13087 4596 195 -941 -9436 317 27268 29283 9172 3698
13459 3698 2680 16551 13679 17538 22917 14439 14022 17628 8954 802 -6111 1222 3555 -5627 -21386
13444 -21386 -33852 -18215 -5865 4256 11181 10801 -1072 8183 15855 14612 4444 -7352 -12740
13431 -12740 -16264 -17550 -15721 -1143 -6829 -11284 -9988 -8050 -10075 -11471 -9489 -5612 12535 4611
13417 4611 7388 14343 10893 6725 8940 16138 7080 5043 -819 5743 5850 12891 16066 19118 23442
13402 23442 21117 30503 22225 4637 -12082 -26444 -36662 -29661 -17930 -18624 -23003 -17789 -5982
13389 -5982 -2225 5479 14980 27933 31656 17040 16245 22449 13698 -3201 -2200 7157 4748 7980
$$ packed form
13487A5980o000j958J0799l742l133K309Q05p527j479J0459m105q915J731M103
13473I327j5753p47Q569R702J989q491m401j136q495R753K6951K015k0111n474
13459C698j018J3871k872L859N379q478m17L606q674q152o913P333K333r182j5759
13444b1386j2466J5637J2350J0121O925l80j1873R255P672j243j0168j1796n388
13431a2740l524j286J829J4578n686m455J296J938k025j396J982L877J8147p924
13417D611K777O955l450m168K215P198r058k037n862O562J07P041L175L052M324
13402B3442k325R386q278j7588j6719j4362j0218P001J1731o94m379N214J1807
13389e982L757P704R501J2953L723j4616p95O204q751j6899J001R357k409L232
$$ plain form
13375 7980 10746 7672 4482 635 195 -6421 -12470 -14578 -1229 -9677 -9604 315 6240 17495 23315
13360 23315 22332 9277 11200 15242 8934 2141 2296 4664 10032 7969 18098 20686 7421 16503
13346 16503 16681 7057 5916 -8669 -14735 -15290 -10356 134 -499 9570 13289 17431 6231 -3657
13332 -3657 -5308 4327 -6596 -1111 10723 9346 2791 -12660 -9515 6516 5147 -4199 6007
13319 6007 9095 11968 11777 6900 -5645 -9155 -6969 -1375 -22477 -20753 -19046 -7519 -12797 -21352
13305 -21352 -24819 -23412 -24884 -15502 2620 12382 13575 8380 -1784 -8877 -6455 -7411 3391 -283
13291 -283 -6802 -14645 -13910 -5948 -11669 -18998 -7200 6409 16592 7348 -1964 -18079 -14367 -10207
13277 -10207 -26289 -23749 -16343 -26625 -23585 -17491 -12756 -11846 -863 3568 975 8795 8165 268
$$ packed form
13375G980K766l074l190l847m40o616o049k108J3349q448P3R919N925J1255N820
13360B3315r83j3055J923M042o308o793J55K368N368k063J0129K588j3265R082
13346A6503J78r624j141j4585o066n55M934J0490o33J0069L719M142j1200r888
13332c657j651R635j0923N485J1834j377o555j5451L145J6031j369r346J0206
13319F007L088K873j91m877j2545l510K186N594k1102J724J707J1527n278q555
13305b1352l467J407j472R382J8122R762J193n195j0164p093K422r56J0802l674
13291b83o519p843P35P962n721p329J1798J3609J0183r244r312j6115L712M160
13277a0207j6082K540P406j0282L040O094M735R10J0983M431k593P820o30p897
$$ plain form
13263 268 3395 15961 17761 12931 11972 -5594 -17391 -17087 -6570 326 3226 -4151 -7509 -4735
13249 -4735 -12996 -17403 -5781 2526 -14009 -26684 -22207 -16324 -8013 -9386 -25443 -15377 -6263
13236 -6263 -1206 -3857 1852 2925 8991 3334 -6430 -10630 -8132 4429 4160 -2776 1245 1292 -6936
13221 -6936 -9307 -5970 -1309 -11264 -18451 -10851 -16772 -1792 6032 14794 26873 20708 -268 5121
13207 5121 3569 6841 -3590 -4838 9516 15402 -714 -1041 7838 728 3787 11774 5779 4156
13193 4156 -5838 518 6689 5458 6568 13699 9674 -254 -1659 -9444 -10562 -10722 -8761 6130 8137
13178 8137 -6204 -8962 -4373 -16062 -25801 -28759 -14417 -7516 -12010 -5156 17340 23318 6011
13165 6011 -4722 3344 10556 12147 -13550 -27483 -20621 -13542 -6631 -12344 -3014 -6171 -11317 -7488
$$ packed form
13263B68L127J2566J800m830r59j7566j1797L04J0517O896K900p377l358K774
13249d735q261m407J1622Q307j6535j2675M477N883Q311j373j6057J0066R114
13236f263N057k651N709J073O066n657r764m200K498J2561k69o936M021M7q228
13221f936k371L337M661r955p187P600n921J4980P824Q762J2079o165k0976N389
13207E121j552L272j0431j248J4354N886j6116l27Q879p110L059P987n995j623
13193D156r994O356O171j231J110P131m025r928j405p785j118j60J961J4891K007
13178H137j4341k758M589j1689r739k958J4342O901m494O854K2496N978j7307
13165F011j0733Q066P212J591k5697j3933O862P079O911n713R330l157n146L829
$$ plain form
13151 -7488 -4123 -4510 533 -1740 -13841 -17934 -27444 -17920 -24026 -27333 -23305 -1739 11368 4505
13137 4505 -937 -5487 511 2948 4380 13579 747 4222 12109 8894 -1229 9519 4772 -14330
13123 -14330 -22994 -10538 8107 21696 25342 23750 14483 -1900 -13881 -13078 -10325 -9793 -14755 -17812
13109 -17812 -26133 -19744 -6465 -14830 -485 395 -6843 -6752 1917 6501 8201 7796 -469 -1289 11272
13094 11272 2248 -12429 -13279 -7881 2901 13036 19863 15970 13963 480 -14275 -2120 -2461
13081 -2461 5013 7056 5447 10132 16501 18859 24376 19117 11361 -6981 -26224 -29008 -19937 -16340
13067 -16340 -6809 -8934 -17963 -22540 -19014 -9633 -11976 -22933 -31311 -34384 -41604 -33866 -35250 -43230
13053 -43230 -30578 -11757 2592 16979 18805 7024 2837 2170 7528 13000 13299 15109 7214 4271
$$ packed form
13151g488L365l87N043k273j2101m093r510R524o106l307M028K1566J3107o863
13137D505n442m550N998K437J432R199j2832L475P887l215j0123J0748m747j9102
13123a4330q664J2456J8645J3589L646j592r267j6383j1981Q03K753N32m962l057
13109a7812q321O389J3279q365J4345Q80p238R1Q669M584J700m05q265q20J2561
13094A1272r024j4677q50N398J0782J0135O827l893k007j3483j4755J2155l41
13081b461P474K043j609M685O369K358N517n259p756j8342j9243k784R071L597
13067a6340R531k125r029m577L526R381k343j0957q378l073p220P738j384p980
13053d3230J2652J8821J4349J4387J826j1781m187o67N358N472K99J810p895k943
$$ plain form
13039 4271 559 -5704 -12111 -4593 1276 7214 -1662 12840 12679 1906 1162 2030 4074 -3682 2116
13024 2116 2271 11624 16069 12098 -407 7111 16621 31072 29195 4572 7307 -6923 -32379 -31767
13010 -31767 -29245 -16711 -15601 -16641 7007 8480 14117 10049 10455 17024 17763 11096 13650 -3118
12996 -3118 -32943 -40727 -30636 -31645 -24897 -9679 -13148 -16114 -16009 -5160 -9129 -18129 -17363 -2818
12982 -2818 2187 -997 5000 -3306 -10412 -5850 -5586 -7874 23 10595 6890 -210 -8558 -25930
12968 -25930 -35577 -24542 -25997 -8027 6550 3852 899 -548 452 -3731 -2024 3110 -1673 -984
12954 -984 5343 -1988 -5713 -13946 -21639 -30259 -20940 -4515 -3475 -2917 3655 6788 -4985 -10163 3403
12939 3403 9981 -2959 -65 -15403 -20252 -11082 -10937 -4439 -17329 -23337 -18530 -16226 -11970 -18709
$$ packed form
13039D271l712o263o407P518N869N938q876J4502j61j0773p44Q68K044p756N798
13024B116J55R353M445l971j2505P518R510J4451j877k4623K735j4230k5456O12
13010c1767K522J2534J110j040K3648J473N637m068M06O569P39o667K554j6768
12996c118k9825p784J0091j009O748J5218l469k966J05J0849l969r000P66J4545
12982b818N005l184N997q306p106M562K64k288P897J0572l705p100q348j7372
12968b5930r647J1035j455J7970J4577k698k953j447J000m183J707N134m783O89
12954i84O327p331l725q233p693q620R319J6425J040N58O572L133j1773n178J3566
12939C403O578j2940K894j5338m849R170J45O498j2890o008M807K304M256o739
$$ plain form
12925 -18709 -15154 -19233 -19561 -18176 -11618 -12852 6312 10783 6768 5297 8887 5675 1648 -8643
12911 -8643 -3987 -5753 -3716 -6308 -3734 2215 11877 2771 -3533 7894 15802 14481 4012 4389
12897 4389 2480 -4736 -16236 -12749 2055 2125 2864 3498 6162 8537 16973 5388 -6504 -9656 3316
12882 3316 17975 20867 17377 2432 468 12063 6525 2214 548 3401 9141 5866 8207 13316
12868 13316 12570 17388 16247 11882 10236 -10199 -20402 -17406 -2857 -1670 -17439 -13876 -12142 -4027
12854 -4027 -3595 -6952 -6034 -14737 -14480 177 6741 -651 -3000 -11625 -18922 -21049 -12039 -11790 -18179
12839 -18179 -20127 -17463 -13325 -3546 -3203 -3457 -4663 -1611 -6438 3953 18038 20087 6836 2437
12825 2437 1980 6543 11879 11530 10725 8954 -6989 -7864 -13823 -13339 -10463 -6611 324 12946 7708
$$ packed form
12925a8709L555m079l28J385O558j234J9164M471m015j471L590l212m027j0291
12911h643M656j766K037k592K574N949R662r106o304J1427P908j321j0469L77
12897D389j909p216j1500L487J4804P0P39O34K664K375Q436j1585j1892l152J2972
12882C316J4659K892l490j4945j964J1595n538m311j666K853N740l275K341N109
12868A3316p46M818j141m365j646k0435j0203K996J4549J187j5769L563J734Q115
12854d027M32l357R18q703K57J4657O564p392k349q625p297k127R010K49o389
12839a8179j948K664M138R779L43k54j206L052m827J0391J4085K049j3251m399
12825B437m57M563N336l49q05j771j5943q75n959M84K876L852O935J2622n238
$$ plain form
12810 7708 10622 33062 39463 15666 3316 2968 47 -2444 -12904 -16204 -7284 -10671 -22072 -19878
12796 -19878 -11704 -14691 -12630 -13164 -9235 1468 -268 -9054 -5662 -57 -3908 -11320 -14645 -19691
12782 -19691 -10435 4877 13594 15095 14702 4223 6346 8567 3302 -9637 -25407 -33145 -14677
12769 -14677 -4842 -1963 -789 -8171 -21859 -25314 -28823 -39348 -32491 -26764 -28994 -22440 -12533 781
12755 781 8553 9751 20587 13279 10268 15708 15050 6502 16756 9246 -12209 -26213 -15523 -697
12741 -697 13914 9000 2581 -7069 -12288 -15129 -15912 -21594 -16458 -13947 -7940 3535 15575 12549
12727 12549 -2272 -11943 -12516 787 -3257 -1591 5464 13993 18524 12007 9137 14737 7268 12988
12713 12988 18737 13436 12545 12294 10614 -1369 1467 8056 491 -3739 2924 -1590 722 7112 11376
$$ packed form
12810G708K914K2440O401k3797j2350l48k921k491j0460l300Q920l387j1401K194
12796a9878Q174k987K061n34L929J0703j736q786L392N605l851p412l325n046
12782a9691R256J5312Q717J501l93j0479K123K221n265j2939j5770p738J8468
12769a4677R835K879J174p382j3688l455l509j0525O857N727k230O554R907J3314
12755G81P772J198J0836p308l011N440o58q548J0254p510k1455j4004J0690J4826
12741f97J4611m914o419r650n219k841p83n682N136K511O007J1475J2040l026
12727A2549j4821r671n73J3303m044J666P055Q529M531o517k870N600p469N720
12713A2988N749n301q91k51j680j1983K836O589p565m230O663m514K312O390M264
$$ plain form
12698 11376 7856 9513 -2882 -5663 -2917 -4011 -603 -1581 3098 -691 5866 17173 13013 -11368
12684 -11368 -18051 -15311 -9978 2092 -752 -11827 -14920 -17602 -18134 -10364 -836 9580 10600 11363
12670 11363 9569 -7065 -11963 -9338 -1469 1408 2410 -5471 -11377 -592 -16868 -18316 -12007 -13131
12656 -13131 -6742 7405 2506 4703 2288 8534 17828 13973 -4851 -11665 -19067 -14881 -25873 -29511
12642 -29511 -17166 -12030 -26290 -12732 -3944 -4118 -4788 -5267 -1135 7791 1220 3088 -1102 -3870
12628 -3870 -6351 1559 11086 13696 10041 -1855 -15282 -12655 -3709 -3604 3640 4156 -6049 -11382
12614 -11382 -10191 -15449 -9975 4968 9529 8187 -208 -3157 -8775 -17483 -11844 -5385 6629 9487
12600 9487 5228 -2086 -12232 -27804 -15007 2441 3870 -13679 -7684 8992 12528 9261 2616
$$ packed form
12698A1376l520J657j2395k781K746j094L408r78M679l789O557J1307m160k4381
12684a1368o683K740N333J2070k844j1075l093k682n32P770R528J0416J020P63
12670A1363j794j6634m898K625P869K877J002p881n906J0785j6276j448O309j124
12656a3131O389J4147m899K197k415O246R294l855j8824o814p402M186j0992l638
12642b9511J2345N136j4260J3558Q788j74o70m79M132Q926o571J868m190k768
12628c870k481P910R527K610l655j1896j3427K627Q946J05P244N16j0205n333
12614a1382J191n258N474J4943M561j342q395k949n618q708N639O459J2014K858
12600I487m259p314j0146j5572J2797J7448J429j7549N995J6676L536l267o645
$$ plain form
12587 2616 -9841 -13290 -10090 -13818 -19347 -10180 9695 24669 22794 16193 3785 1273 17110
12574 17110 21366 14529 1034 -11774 -10099 -4685 15719 5330 -88 2419 9036 3810 -10588
12561 -10588 -16149 1179 7447 25158 28125 12378 4437 2156 12428 32943 38480 27695 27858
12548 27858 28893 21626 10086 11701 11123 -1962 -4575 2695 4589 7678 16694 9380 6678 132
12534 132 -5146 -891 -8721 -21880 -24409 -19677 -18985 -6713 299 -11281 -9094 3844 9638 15701
12520 15701 16782 12959 16501 14753 6633 11978 9615 8714 8073 14168 19414 18089 -3006 -8338 5660
12505 5660 11434 5502 6460 3662 4539 15472 15526 12458 9516 19227 730 -9313 5396 3514 12525
12490 12525 14447 10503 5462 12862 10414 10272 6301 4342 300 -1254 -1482 -1029 -3660 7009 16737
$$ packed form
12587B616j2457l449L200l728n529R167J9875J4974j875o601j2408k512J5837
12574A7110M256o837j3495j2808J675N414K0404j0389n418K507O617n226j4398
12561a0588n561J7328O268J7711K967j5747p941k281J0272K0515N537j0785J63
12548B7858J035p267j1540J615n78j3085k613P270J894L089R016p314k702o546
12534A32n278M255p830j3159k529M732O92J2272P012j1580K187J2938N794O063
12520A5701J081l823L542j748q120N345k363r01o41O095N246j325k1095n332J3998
12505E660N774n932R58k798Q77J0933N4l068k942R711j8497j0043J4709j882R011
12490A2525J922l944n041P400k448j42l971j959m042j554k28M53k631J0669R728
$$ plain form
12475 16737 33035 23191 28605 28677 6365 8659 7624 -3870 -13872 -4995 13359 8343 12068 12638
12461 12638 8888 16088 16518 7213 4103 10123 20519 32900 21515 8224 4544 6486 12103 21154
12447 21154 15457 11417 448 -1495 2807 12797 16642 14719 -1421 3139 -3585 -4392 -7563 -5891
12433 -5891 2207 8503 9378 -6463 2350 8023 17836 19298 11874 -6965 -3857 8160 15317 13482
12419 13482 13203 4777 -915 3018 11911 10190 12893 17448 21779 22090 9148 1182 -2501 -5506 208
12404 208 9160 6005 7890 7449 17433 28658 15961 3913 5923 9934 11180 18539 18311 24153 28625
12389 28625 44156 42357 26195 20524 13313 21509 23317 26360 24955 10242 11409 11265 7645 11761
12375 11761 13070 5603 1420 6152 4866 -3189 -10980 -7441 1827 13516 25151 31186 33158 19827
$$ packed form
12475A6737J6298r844N414P2k2312K294j035j1494j0002Q877J8354n016L725N70
12461A2638l750P200M30r305l110O020J0396J2381j1385j3291l680J942N617R051
12447B1154n697m040j0969j943M302R990L845j923j6140M560o724q07l171J672
12433e891Q098O296Q75j5841Q813N673R813J462p424j8839L108J2017P157j835
12419A3482k79q426n692L933Q893j721K703M555M331L11j2942p966l683l005N714
12404B08Q952l155J885m41R984J1225j2697j2048K010M011J246P359k28N842M472
12389B8625J5531j799j6162n671p211Q196J808L043j405j4713J167j44l620M116
12375A1761J309p467m183M732j286q055p791L539R268J1689J1635O035J972j3331
$$ plain form
12361 19827 7392 2235 -5538 -8009 -8528 -2561 6399 4194 -816 -5459 -4884 -821 475 -19765
12347 -19765 -20996 -19380 -13001 7632 22137 22973 17855 524 -4547 -4017 -4393 -5415 2447 26890
12333 26890 29061 11182 8441 505 -4804 1158 16930 23654 23375 12381 4971 1365 -5863 -14490
12319 -14490 -25652 -17882 707 60 7674 7162 4773 4605 3623 -9905 -10824 1199 14769 11318
12305 11318 -368 1987 8789 16338 13204 1878 -12771 -7054 -19835 -15896 482 4767 734
12292 734 6358 4772 1936 1387 13152 13971 21607 16377 5323 13551 29927 27151 11262 5951
12278 5951 12135 7788 -1885 1262 8764 7705 4593 6289 3936 1176 16 -2628 -21151 -14896
12264 -14896 5947 3795 -3449 -846 12134 14757 14711 14843 16563 17057 12580 5082 5382 13683 1434
$$ packed form
12361A9827j2435n157p773k471n19N967Q960k205n010m643N75M063J296k0240
12347a9765j231J616O379K0633J4505Q36n118j7331n071N30l76j022P862K4443
12333B6890K171j7879k741p936n309N962J5772O724k79j0994p410l606p228q627
12319a4490j1162P770J8589o47P614n12k389j68r82j3528r19J2023J3570l451
12305A1318j1686K355O802P549l134j1326j4649N717j2781L939J6378M285m033
12292G34N624j586k836n49J1765Q19P636n230j1054Q228J6376k776j5889n311
12278E951O184m347r673L147P502j059l112J696k353k760j160k644j8523O255
12264a4896K0843k152p244K603J2980K623m6J32J720M94m477p498L00Q301j2249
$$ plain form
12249 1434 -8530 -9552 -6639 -1104 1990 21152 34576 29992 23769 21774 23313 23996 21275 19251
12235 19251 20893 26301 28732 25963 29383 34993 34119 21730 11142 3170 9224 18986 10587 3669
12221 3669 11038 15433 15354 18558 19454 14447 6336 2969 6662 13411 8073 1284 16957 30687 25569
12206 25569 13828 14119 8654 17230 33965 49567 40357 33153 27414 24910 15294 16463 16271 10411
12192 10411 20544 22163 24540 37022 41704 28769 26462 29973 22345 25582 16455 19400 15247 7614
12178 7614 11149 5523 -391 7233 2562 6355 12939 13975 19178 18413 15734 13907 8813 7379 8631
12163 8631 19041 16848 17643 17335 12857 8599 6962 11194 26502 40831 35604 28991 31954 39320
12149 39320 34589 38297 28382 24932 25923 36320 38660 38584 41177 33294 23826 19706 26477 26142 16892
$$ packed form
12249A434r964j022K913N535L094J9162J3424m584o223j995J539O83k721k024
12235A9251J642N408K431k769L420N610q74j2389j0588p972O054R762q399o918
12221C669P369M395p9L204Q96n007q111l367L693O749n338o789J5673J3730n118
12206B5569j1741K91n465Q576J6735J5602r210p204n739k504r616J169j92n860
12192A0411J0133J619K377J2482M682j2935k307L511p628L237r127K945m153p633
12178G614L535n626n914P624m671L793O584J036N203p65k679j827n094j434J252
12163H631J0410k193P95l08m478m258j637M232J5308J4329n227o613K963P366
12149C9320m731L708r915l450R91J0397K340p6K593p883r468m120O771l35r250
$$ plain form
12134 16892 14417 16536 23765 27976 27070 26796 34891 42465 41670 43116 38073 36244 30011 40447 41806
12119 41806 32596 27407 35439 47276 51346 47941 50858 48461 52940 67948 67740 57996 51734 57935
12105 57935 61512 65095 69819 72999 77525 76029 77920 82798 67719 57607 57170 57773 64478 72779
12091 72779 85976 92504 82665 77060 73397 70292 83875 105373 98768 94132 84145 84191 79938 73755
12077 73755 78505 91890 96754 102957 117642 127094 139959 152080 157179 162481 175452 179965 160761
12064 160761 150744 143641 140149 143987 146199 156423 162963 154157 156791 163705 160149 142898 138593
12051 138593 145619 155567 154435 148020 151077 151824 156814 150442 146124 153834 159893 171780 173507 182302
12037 182302 177768 186190 202742 205128 205620 202979 212753 226700 233573 237643 229106 224553 223017 218320
$$ packed form
12134A6892k475K119P229M211r06k74Q095P574p95J446n043j829o233J0436J359
12119D1806r210n189Q032J1837M070l405K917k397M479J5008k08r744o262O201
12105E7935L577L583M724L180M526j496J891M878j5079j0112m37O03O705Q301
12091G2779J3197O528r839n605l663l105J3583K1498o605m636r987M6m253o183
12077G3755M750J3385M864O203J4685R452J2865J2121N099N302J2971M513j9204
12064A60761j0017p103l492L838K212J0224O540q806K634O914l556j7251m305
12051A38593P026R948j132o415L057P47M990o372m318P710O059J1887J727Q795
12037A82302m534Q422J6552K386M92k641R774J3947O873M070q537m553j536m697
$$ plain form
12023 218320 223429 218491 203332 192591 196726 198704 206763 210135 195654 192807 197406 201159 191563
12010 191563 162255 163970 189326 200733 210119 207216 213369 210133 214051 218793 210659 202402 213288
11997 213288 206885 207326 210972 206427 222049 235526 236846 237711 224904 230412 235703 230444 224548 228743
11983 228743 237837 245642 238393 218877 210975 208969 213795 225104 236444 236064 223848 216378 218736
11970 218736 224109 244980 253774 248174 237364 237937 236586 233760 229983 241050 251973 259055 248148
11957 248148 241221 217124 194225 204066 213781 196374 186885 204054 217359 224980 220518 228634 224695
11944 224695 229806 238471 231060 229637 227589 230366 222377 227453 244847 250937 247297 256614 267005 261004
11930 261004 255212 257104 260927 257374 243338 240926 243043 230754 208868 192788 174726 169261 172331
$$ packed form
12023B18320N109m938j5159j0741M135J978Q059L372j4481k847M599L753r596
12010A91563k9308J715K5356J1407R386k903O153l236L918M742q134q257J0886
11997B13288o403M41L646m545J5622J3477J320Q65j2807N508N291n259n896M195
11983B28743R094P805p249j9516p902k006M826J1309J1340l80j2216p470K358
11970B18736N373K0871Q794n600j0810N73j351k826l777J1067J0923P082j0907
11957B48148o927k4097k2899R841R715j7407r489J7169J3305P621m462Q116l939
11944B24695N111Q665p411j423k048K777p989N076J7394O090l640R317J0391o001
11930B61004n792J892L823l553j4036k412K117j2289k1886j6080j8062n465L070
$$ plain form
11917 172331 176036 165530 147171 139527 148429 156964 153878 150924 167438 166467 162735 166134 168944 158167
11903 158167 146606 145585 161045 168298 169651 169576 161788 155282 173753 185794 188856 185520 178665 169382
11889 169382 165167 155869 146926 143487 135416 131790 145893 150128 134760 123631 124516 123907 112057 102633
11875 102633 107563 124446 113068 97509 76649 72510 80482 82398 82453 81137 87144 93694 98762 95226
11861 95226 99444 100293 99980 97818 106149 109193 116032 108825 107637 106217 105208 102402 98571 104640 121470
11846 121470 126364 119663 119061 120750 116637 126469 148524 160168 163777 158006 166305 169604 166156 172316
11832 172316 170981 168403 175530 182814 187565 201217 210000 224659 224306 205386 195612 188647 186414 180822
11818 180822 185286 185255 182481 187147 185937 175625 177511 179447 182493 183977 183347 186934 199605 202058
$$ packed form
11917A72331L705j0506j8359p644Q902Q535l086k954J6514r71l732L399K810j0777
11903A58167j1561j021J5460P253J353p5p788o506J8471J2041L062l336o855r283
11889A69382m215r298q943l439q071l626J4103M235j5368j1129Q85o09j1850r424
11875A02633M930J6883j1378j5559k0860m139P972J916N5j316O007O550N068l536
11861I5226M218Q49l13k162Q331L044O839p207j188j420j009k806l831O069J6830
11846A21470M894o701o02J689m113R832K2055J1644L609n771Q299L299l448O160
11832A72316j335k578P127P284M751J3652Q783J4659l53j8920r774o965k233n592
11818A80822M464l1k774M666j210j0312J886J936L046J484o30L587J2671K453
$$ plain form
11804 202058 194887 190185 193168 201056 192795 204919 225971 225335 230733 241528 243701 229666 210678
11791 210678 202345 213918 211058 216181 236240 237643 221478 218614 230594 232550 220532 220284 218652
11778 218652 211310 201993 200557 190811 180228 180606 179158 181916 182206 181971 190276 192062 194996 194418 207942
11763 207942 233936 233534 234983 232186 225344 228173 218301 215754 208135 204245 216413 231821 240027 237031
11749 237031 223017 214329 215123 215687 230386 245673 236420 239643 230235 220100 223972 226807 237763
11736 237763 245012 247426 238471 245887 252142 265468 280483 288342 295377 282527 271082 290725 320101
11723 320101 341354 335669 333465 339725 338533 348239 359274 372126 391316 408832 427014 442413
11711 442413 462062 472361 472564 486953 513236 532718 559645 585313 602749 637322 670128 706008
$$ packed form
11804B02058p171m702K983P888q261J2124K1052o36N398J0795K173j4035j8988
11791B10678q333J1573k860N123K0059J403j6165k864J1980J956j2018k48j632
11778B18652p342r317j436r746j0583L78j448K758K90k35Q305J786K934n78J3524
11763B07942K5994m02J449k797o842K829r872k547p619l890J2168J5408Q206k996
11749B37031j4014q688P94N64J4699J5287r253L223r408j0135L872K835J0956
11736B37763P249K414q955P416O255J3326J5015P859P035j2850j1445J9643K9376
11723C20101K1253n685k204O260j192R706J1035J2852J9190J7516J8182J5399
11711D42413J9649J0299K03J4389K6283J9482K6927K5668J7436L4573L2806L5880
$$ plain form
11699 706008 743699 777119 799346 838385 879122 927318 1004268 1088746 1163457 1241510 1336375
11688 1336375 1454500 1593860 1737036 1896742 2092556 2324159 2573400 2859185 3187385
11679 3187385 3556281 3949155 4354057 4772635 5161802 5488912 5733674 5884604 5913512 5827184
11669 5827184 5650584 5405930 5111285 4825742 4559710 4316795 4122301 3956989 3814185
11660 3814185 3712566 3656823 3639840 3672182 3714011 3789647 3907335 4068950 4284626 4551190
11650 4551190 4873324 5246059 5699789 6237422 6856988 7556282 8331954 9202803 10152217
11641 10152217 11171092 12229338 13263731 14213764 15023390 15617752 15952343 16016733 15814315
11632 15814315 15386467 14786935 14075038 13269164 12449670 11653301 10880251 10154421 9489607
$$ packed form
11699G06008L7691L3420K2227L9039M0737M8196P6950Q4478P4711P8053R4865
11688A336375J18125J39360J43176J59706J95814K31603K49241K85785L28200
11679C187385L68896L92874M04902M18578L89167L27110K44762J50930K8908q6328
11669E827184j76600k44654k94645k85543k66032k42915j94494j65312j42804
11660C814185j01619n5743j6983L2342M1829P5636J17688J61615K15676K66564
11650D551190L22134L72735M53730N37633O19566O99294P75672Q70849R49414
11641A0152217J018875J058246J034393R50033Q09626N94362L34591O4390k02418
11632A5814315m27848n99532p11897q05874q19494p96369p73050p25830o64814
$$ plain form
11623 9489607 8906069 8388851 7939709 7559816 7248990 7035978 6892469 6798605 6774884 6834521
11613 6834521 6978981 7192826 7484103 7883474 8371135 8942003 9622702 10409064 11306640
11604 11306640 12290222 13329437 14388239 15400807 16307259 17020171 17488487 17650489 17490293
11595 17490293 17039648 16383917 15563473 14640956 13644724 12657463 11724763 10815641 9974734
11586 9974734 9203031 8499269 7874449 7307645 6803652 6363633 5990478 5678733 5406939
11577 5406939 5188723 5014535 4906512 4846364 4825648 4846661 4902994 5024740 5195009 5413957
11567 5413957 5679633 6000432 6354611 6721686 7100906 7443753 7691097 7813543 7817953 7675968
11557 7675968 7402618 7015846 6562551 6070397 5558303 5076282 4642882 4261122 3903972
$$ packed form
11623I489607n83538n17218m49142l79893l10826k13012j43509r3864k3721N9637
11613F834521J44460K13845K91277L99371M87661N70868O80699P86362Q97576
11604A1306640R83582J039215J058802J012568R06452P12912M68316J62002j60196
11595A7490293m50645o55731q20444r22517r96232r87261r32700r09122q40907
11586I974734p71703p03762o24820n66804n03993m40019l73155l11745k71794
11577E406939k18216j74188j08023o0148k0716K1013N6333J21746J70269K18948
11567E413957K65676L20799L54179L67075L79220L42847K47344J22446M410j41985
11557G675968k73350l86772m53295m92154n12094m82021m33400l81760l57150
$$ plain form
11548 3903972 3588771 3325094 3087326 2854932 2659207 2476279 2313772 2169806 2037334
11539 2037334 1915531 1812694 1728839 1651312 1571678 1497195 1436139 1376104 1310775 1259919 1213211
11528 1213211 1167277 1129924 1084944 1047630 998134 966319 952186 926349 884311 847408 826558
11517 826558 829641 811177 788301 766338 739674 715011 683160 659256 643905 626324 625164 619779
11505 619779 600316 579064 565307 534373 527947 536282 525834 501844 489077 483584 479130 469147
11493 469147 458832 448325 432787 420697 426679 431841 444291 451988 457220 462272 469218 477590 492584
11480 492584 505791 504579 509420 512354 533041 555029 575250 612068 648388 672208 682777 666313
11468 666313 644921 599698 532119 466364 415708 385850 374651 344975 336962 320798 307098 297319
$$ packed form
11548C903972l15201k63677k37768k32394j95725j82928j62507j43966j32472
11539B037334j21803j02837q3855p7527p9634p4483o1056o0035o5329n0856m6708
11528A213211m5934l7353m4980l7314m9496l1815j4133k5837m2038l6903k0850
11517H26558L083j8464k2876k1963k6664k4663l1851k3904j5351j7581j160n385
11505F19779j9463k1252j3757l0934o426Q335j0448k3990j2767n493m454r983
11493D69147j0315j0507j5538j2090N982N162J2450P697N232N052O946Q372J4994
11480D92584J3207j212M841K934K0687K1988K0221L6818L6320K3820J0569j6464
11468F66313k1392m5223o7579o5755n0656k9858j1199k9676q013j6164j3700r779
$$ plain form
11456 297319 286317 281874 285309 298206 292625 281169 268628 282076 310653 331590 329408 320990
11444 320990 325651 336987 329455 336836 349170 354169 362260 378477 397592 412903 471778 534912
11432 534912 586094 631135 677748 713228 711131 671098 603014 520324 444889 384634 325055 302268
11420 302268 273232 248343 214654 197626 204632 206952 193658 195966 200379 189341 169178 171955
11408 171955 155147 143047 133308 135511 136620 148293 165586 166610 159717 154846 149344 147706 167877
11395 167877 173875 194300 209712 230767 254735 286002 299196 311384 318722 309157 282136 257783
11383 257783 227935 190088 158415 138897 127442 111077 110359 108267 97400 92273 81097 74094
11371 74094 90794 96537 89847 90419 89560 89236 76059 67388 62667 48688 29247 24670 24229 34685
$$ packed form
11456B97319j1002m443L435J2897n581j1456j2541J3448K8577K0937k182q418
11444C20990M661J1336p532P381J2334M999Q091J6217J9115J5311N8875O3134
11432E34912N1182M5041M6613L5480k097m0033o8084q2690p5435o0255n9579k2787
11420C02268k9036k4889l3689j7028P006K320j3294K308M413j1038k0163K777
11408A71955j6808j2100r739K203J109J1673J7293J024o893m871n502j638K0171
11395A67877N998K0425J5412K1055K3968L1267J3194J2188P338r565k7021k4353
11383B57783k9848l7847l1673j9518j1455j6365p18k092j0867n127j1176p003
11371G4094J6700N743o690N72q59l24j3177q671m721j3979j9441m577m41J0456
$$ plain form
11357 34685 46463 44564 51274 52850 48031 49787 54041 65189 72496 55894 51449 50813 50203 42921
11343 42921 41419 40376 37662 44391 55623 70535 59537 62136 58865 45045 48519 60174 61187
11330 61187 62964 81324 80780 57529 36528 24846 10311 11090 14878 15744 19321 25638 29629 31982
11316 31982 37281 27162 38688 41470 45205 56002 68861 60715 63210 62576 59621 44367 37955
11303 37955 43303 21197 7747 18851 28095 24848 25296 13299 10870 20667 40214 40842 41029 35502
11289 35502 28200 1659 -19450 -3107 8944 16719 27625 35304 43887 49687 56673 66145 56850
11276 56850 45974 40790 31014 37481 54481 55931 45301 25167 19923 23875 14352 12000 19736
11263 19736 31435 34113 33580 23868 14188 7369 4 11974 10612 10508 13889 14090 12178 3793 10708
$$ packed form
11357C4685J1778j899O710J576m819J756M254J1148P307j6602m445o36o10p282
11343D2921j502j043k714O729J1232J4912j0998K599l271j3820L474J1655J013
11330F1187J777J8360n44k3251k1001j1682j4535P79L788Q66L577O317L991K353
11316C1982N299j0119J1526K782L735J0797J2859q146K495o34k955j5254o412
11303C7955N348k2106j3450J1104R244l247M48j1997k429R797J9547O28J87n527
11289C5502p302k6541k1109J6343J2051P775J0906P679Q583N800O986R472r295
11276E6850j0876n184r776O467J7000J450j0630k0134n244L952r523k352P736
11263A9736J1699K678n33r712r680o819p365J1970j362j04L381K01j912q385O915
$$ plain form
11248 10708 12341 15604 17955 24721 30555 35536 45533 61841 59259 57349 67141 55482 58184 60901
11234 60901 64029 58105 41032 32998 37412 50279 62594 68303 64560 63696 53014 53950 59636 59370
11220 59370 55810 52197 54689 49363 57628 58602 53749 67643 72978 80697 95075 94636 99847 101609
11206 101609 100504 89144 85958 88260 96001 96897 105121 101766 90898 99439 101411 110261 123337 107931
11192 107931 117756 132104 138351 152050 169619 173702 157186 137122 129539 133008 128283 127937 129574
11179 129574 132398 136175 140701 134892 123225 125098 110504 104795 111936 111273 105986 110946 123059 146741
11165 146741 145960 138280 145136 161739 177960 171897 154735 151884 161873 173877 188519 202582 191007
11152 191007 177895 181658 179511 177983 177734 179980 183201 177547 183365 183100 184066 182467 174824 163749
$$ packed form
11248A0708J633L263K351O766N834M981R997J6308k582j910R792j1659K702K717
11234F0901L128n924j7073q034M414J2867J2315N709l743q64j0682R36N686k66
11220E9370l560l613K492n326Q265R74m853J3894N335P719J4378m39N211J762
11206A01609j105j1360l186K302P741Q96Q224l355j0868Q541J972Q850J3076j5406
11192A07931R825J4348O247J3699J7569M083j6516k0064p583L469m725l46J637
11179A29574K824L777M526n809j1667J873j4594n709P141o63n287M960J2113K3682
11165A46741p81p680O856J6603J6221o063j7162k851R989J2004J4642J4063j1575
11152A91007j3112L763k147j528k49K246L221n654N818k65R66j599p643j1075
$$ plain form
11138 163749 156861 145284 137279 147632 151648 166955 181152 173801 166958 171542 183696 202444 211018
11125 211018 207213 209141 226694 223777 208450 212265 222040 237004 236612 230139 224881 235558 268180
11112 268180 277725 273976 286895 288249 284943 286165 299337 313768 317789 325839 328004 327536 331359 346122
11098 346122 368570 395185 417734 432264 451176 474083 489665 503126 520184 537653 562700
11087 562700 592996 635485 685253 726911 762819 820337 882786 950482 1009447 1093868 1199877
11076 1199877 1327355 1479727 1653016 1852346 2090035 2385580 2758552 3243752 3876836
11067 3876836 4720482 5855491 7406338 9529826 12286940 15590923 19138090 22410667
11059 22410667 24763794 25597164 24586420 21951349 18405076 14829021 11816097 9534351
$$ packed form
11138A63749o888j1577q005J0353M016J5307J4197p351o843M584J2154J8748Q574
11125B11018l805J928J7553k917j5327L815R775J4964l92o473n258J0677L2622
11112B68180R545l749J2919J354l306J222J3172J4431M021Q050K165m68L823J4763
11098C46122K2448K6615K2549J4530J8912K2907J5582J3461J7058J7469K5047
11087E62700L0296M2489M9768M1658L5908N7518O2449O7696N8965Q4421J06009
11076A199877J27478J52372J73289J99330K37689K95545L72972M85200O33084
11067C876836Q43646J135009J550847K123488K757114L303983L547167L272577
11059B2410667K353127Q33370j010744k635071l546273l576055l012924k281746
$$ plain form
11051 9534351 7863872 6661394 5797343 5149926 4643695 4254205 3960404 3739540 3597112
11042 3597112 3512926 3513079 3589195 3724968 3933212 4247673 4699529 5318721 6137833 7156811
11032 7156811 8351220 9709394 11241552 12941817 14822698 16929174 19352102 22101003
11024 22101003 25075881 28126427 31105540 33756698 35557903 35791283 33868583 30006957
11016 30006957 25349278 21023706 17544703 14806121 12512869 10519004 8860543 7542770
11008 7542770 6514026 5718967 5109499 4634657 4263984 3969135 3734173 3560596 3452838
10999 3452838 3381687 3380618 3438758 3535751 3708284 3978251 4365723 4910072 5695395 6808794
10989 6808794 8346238 10360112 12739202 15299349 17664302 19381065 19959588 19203200
$$ packed form
11051I534351j670479j202478q64051o47417n06231l89490k93801k20864j42428
11042C597112q4186J53P6116J35773K08244L14461M51856O19192Q19112J018978
11032G156811J194409J358174J532158J700265J880881K106476K422928K748901
11024B2101003K974878L050546K979113K651158J801205K33380j922700l861626
11016C0006957m657679m325572l479003k738582k293252j993865j658461j317773
11008G542770j028744p95059o09468m74842l70673k94849k34962j73577j07758
10999C452838p1151j069N8140R6993J72533K69967L87472N44349P85323J113399
10989F808794J537444K013874K379090K560147K364953J716763N78523p56388
$$ plain form
10981 19203200 17279636 14638371 11867612 9440286 7549528 6142138 5103240 4325200
10973 4325200 3731714 3250269 2862434 2561812 2310786 2078735 1893964 1743069 1613564
10964 1613564 1480983 1378239 1307054 1239159 1150336 1071137 1025334 988939 955409 920504 883343
10953 883343 862248 837444 803195 797916 800808 841435 925988 1001960 1067652 1108858 1100987 991902
10941 991902 836410 732018 665688 603633 568100 534426 499832 487670 476897 451233 426157
10930 426157 403168 382303 378941 379622 359532 336571 323422 313248 299555 300827 303601 295628 277726
10917 277726 249460 232611 225288 234619 238519 229171 233793 241495 241350 227039 224157 236354 229255
10904 229255 213771 212172 196368 189478 183706 185684 184329 189139 197536 187596 194626 196285 193073 192814
$$ packed form
10981A9203200j923564k641265k770759k427326j890758j407390j038898p78040
10973D325200n93486m81445l87835l00622k51026k32051j84771j50895j29505
10964A613564j32581j02744p1185o7895q8823p9199m5803l6395l3530l4905l7161
10953H83343k1095k4804l4249n279K892M0627Q4553P5972O5692M1206p871j09085
10941I91902j55492j04392o6330o2055l5533l3674l4594j2162j0773k5664k5076
10930D26157k2989k0865l362O81k0090k2961j3149j0174j3693J272K774p973j7902
10917B77726k8266j6849p323R331L900r348M622P702j45j4311k882J2197p099
10904B29255j5484j599j5804o890n772J978j355M810Q397r940P030J659l212k59
$$ plain form
10890 192814 173579 145138 145444 152125 131037 127243 134266 131196 128229 130875 114734 109078 104203
10877 104203 97790 101600 103710 104436 93364 96404 102312 114706 114453 106106 93641 91174 73072 73983
10863 73983 69510 59191 63858 77023 72984 65111 60429 71539 71081 65641 66668 85167 80467 63523
10849 63523 56563 38474 18212 21432 43827 51818 53986 60676 57035 58057 55369 55996 52890 43984
10835 43984 32142 40821 62943 60873 57667 47256 31640 28703 22941 18396 27132 25847 9672
10822 9672 19093 36594 43470 39837 31836 29625 26741 26345 32567 30517 20114 8588 10754 7075
10808 7075 17897 34509 39736 30205 21563 12017 10007 -10416 -17760 13664 22552 20882 24559 18206
10794 18206 25327 27686 16724 10801 4691 -3457 -13528 -16628 -4524 9432 7432 5641 5219 6002
$$ packed form
10890A92814j9235k8441L06O681k1088l794P023l070k967K646j6141n656m875
10877A04203o413L810K110P26j1072L040N908J2394k53q347j2465k467j8102R11
10863G3983m473j0319M667J3165m039p873m682J1110m58n440J027J8499m700j6944
10849F3523o960j8089k0262L220K2395P991K168O690l641J022k688O27l106q906
10835D3984j1842Q679K2122k070l206j0411j5616k937n762m545Q736j285j6175
10822I672R421J7501O876l633q001k211k884l96O222k050j0403j1526K166l679
10808G075J0822J6612N227r531q642r546k010k0423p344L1424Q888j670L677o353
10794A8206P121K359j0962n923o110q148j0071l100J2104J3956k000j791m22P83
$$ plain form
10780 6002 4571 5021 13206 22089 22697 8920 -454 -5661 6241 16893 17582 9822 -443 -4891
10766 -4891 -3373 -16407 -19838 2823 10804 -2779 -12895 -20670 -23964 -11188 703 11776 3444
10753 3444 -839 -18032 -38913 -37433 -30546 -26235 -22549 -22361 -24521 -18711 -9197 -1669 3004 3076 -8707
10738 -8707 -23786 -35944 -41680 -36558 -20672 -9080 2278 -139 -6893 -9915 -35038 -41175 -36926
10725 -36926 -31159 -32846 -32164 -30430 -32457 -30308 -16085 -9560 -4718 708 -8512 -17720 -31498 -38121
10711 -38121 -39555 -45784 -51777 -62238 -79690 -77953 -53134 -32738 -29680 -27799 -24276 -25549 -31709
10698 -31709 -27080 -23400 -33126 -38488 -31004 -22977 -20874 -24104 -26023 -28575 -31216 -28421 -33509 -36378
10684 -36378 -35477 -22626 -9375 -9098 -17548 -24095 -35659 -35498 -20733 -34580 -39996 -47642 -58225 -38289
$$ packed form
10780F002j431M50Q185Q883O08j3777r374n207J1902J0652O89p760j0265m448
10766d891J518j3034l431K2661P981j3583j0116p775l294J2776J1891J1073q332
10753C444m283j7193k0881J480O887M311L686J88k160N810R514P528M673P2j1783
10738h707j5079j2158n736N122J5886J1592J1358k417o754l022k5123o137M249
10725c6926N767j687O82J734k027K149J4223O525M842N426r220r208j3778o623
10711c8121j434o229n993j0461j7452J737K4819K0396L058J881L523j273o160
10698c1709M629L680r726n362P484Q027K103l230j919k552k641K795n088k869
10684c6378R01J2851J3251K77q450o547j1564J61J4765j3847n416p646j0583J9936
$$ plain form
10670 -38289 -29183 -35622 -25370 -15235 -19297 -14171 -3564 -992 8815 2155 -6082 -13118 -16862 -9783
10656 -9783 -6548 -16245 -22147 -25922 -16802 -6008 -3622 5893 3873 3081 11206 12591 5592 10138 11213
10641 11213 -2921 -549 7198 16660 17454 18215 16600 31099 42564 53785 73973 90907 88870
10628 88870 101100 110855 107030 96504 81431 65426 49933 39260 42885 35956 21221 4469
10616 4469 7122 16691 12446 -4800 -4560 -3453 -16128 -21089 -4878 6313 -11861 -7226 10264
10603 10264 29530 41762 47402 58191 77614 72940 76359 97903 122042 151006 148859 162911
10591 162911 173156 171476 179649 171166 154527 135419 112698 78491 49229 36711 25784 25123
10579 25123 32169 43662 47656 38916 26398 22344 13484 9199 -1266 -4345 7173 16252 15936 9327
$$ packed form
10670c8289R106o439J0252J0135m062N126J0607K572R807o660q237p036l744P079
10656i783L235r697n902l775R120J0794K386R515k020p92Q125J385o999M546J075
10641A1213j4134K372P747R462P94P61j615J4499J1465J1221K0188J6934k037
10628H8870J2230R755l825j0526j5073j6005j5493j0673L625o929j4735j6752
10616D469K653R569m245j7246K40J107j2675m961J6211J1191j8174M635J7490
10603A0264J9266J2232N640J0789J9423m674L419K1544K4139K8964k147J4052
10591A62911J0245j680Q173q483j6639j9108k2721l4207k9262j2518j0927o61
10579B5123P046J1493L994q740j2518m054q860m285j0465l079J1518R079l16o609
$$ plain form
10565 9327 5744 16563 20289 19892 11950 25815 46196 55438 66495 82499 88729 92278 94061 100670
10551 100670 99139 90672 73721 54540 35996 24142 23103 29642 40300 56107 48672 36729
10539 36729 11895 -12754 -20045 -25899 -26995 -24895 -19378 -21599 -13494 -14320 -23938 -18913 -18363 -20608
10525 -20608 -14419 -2046 -19263 -24322 -13808 -6854 -11156 -3788 -15663 -18840 -13493 -9532 -12726
10512 -12726 -15422 -8140 -6395 -3629 -2137 -2151 -5635 21055 24549 10723 4388 9907 11080 3238
10498 3238 -6550 -2343 663 -8487 -7173 1984 -5320 -16206 -26342 -21471 -11341 -1904 -8518 -2799
10484 -2799 8912 9675 5815 -16486 -10759 -3998 5256 5832 2428 -10245 -16496 -16746 -24036 -20310 -10676
10469 -10676 4007 9568 2447 769 5061 1440 8000 13722 8959 -3487 -10987 -10304 -6231 -4489
$$ packed form
10565I327l583J0819L726l97p942J3865K0381R242J1057J6004O230L549J783O609
10551A00670j531q467j6951j9181j8544j1854j039O539J0658J5807p435j1943
10539C6729k4834k4649p291n854j096K100N517k221Q105q26r618N025N50k245
10525b0608O189J2373j7217n059J0514O954m302P368j1875l177N347L961l194
10512a2726k696P282J745K766J492j4l484K6690L494j3826o335N519J173p842
10498C238r788M207L006r150J314R157p304j0886j0136M871J0130R437o614N719
10484b799J1711P63l860k2301N727O761R254N76l404j2673o251k50p290L726R634
10469a0676J4683N561p121j678M292l621O560N722m763j2446p500O83M073J742
$$ plain form
10455 -4489 -10101 -14664 -7945 -2135 17223 15779 9287 4324 -365 1825 15091 1809 -5390 21493
10441 21493 38525 71261 113008 162055 201257 224598 224597 202648 144477 79263 50190 40036
10429 40036 34860 25141 37541 43693 37461 37380 39577 21181 9416 2115 25455 19212 577 -5354
10415 -5354 10753 23064 4119 -16924 -13525 -10426 -8257 -10163 -22699 -24867 -20720 -23167 -20384
10402 -20384 -7902 -14107 -13229 -19361 -20361 -20333 -21732 -18190 -13449 -14588 -26320 -16782 -6880 10389
10388 10389 4214 -18489 -20540 -22014 -18397 -6059 2353 1004 -9212 -10075 -6090 -1897 3728 6063
10374 6063 9514 26189 33510 41975 37661 17711 12287 -700 -3989 -4638 -2805 -17220 -34245 -24549
10360 -24549 -15134 -9455 210 -2852 -7181 -6350 -19737 -26716 -14937 -9721 -12457 -10373 -13180 -7334
$$ packed form
10455d489n612m563O719N810J9358j444o492m963m689K190J3266j3282p199K6883
10441B1493J7032L2736M1747M9047L9202K3341jk1949n8171o5214k9073j0154
10429D0036n176r719J2400O152o232q1K197j8396j1765p301K3340o243j8635n931
10415e354J6107J2311j8945k1043L399L099K169j906j2536k168M147k447K783
10402b0384J2482o205Q78o132j000K8j399L542M741j139j1732R538R902J7269
10388A0389o175k2703k051j474L617J2338Q412j349j0216q63L985M193N625K335
10374F063L451J6675P321Q465m314j9950n424j2987l289o49J833j4415j7025R696
10360b4549R415N679R665l062m329Q31j3387o979J1779N216k736K084k807N846
$$ plain form
10346 -7334 -6574 9517 14458 9407 22077 27815 13694 -13813 -22028 -10516 -6601 444 8983 8165
10332 8165 14519 7205 14229 -1502 -13950 -21349 -12503 -14336 -11849 7273 1236 -22050 -27060 -26529
10318 -26529 -25430 -22089 -14498 -12913 -6584 8538 11096 11021 15253 16828 2658 -2701 5666 11225
10304 11225 14627 2726 15957 21820 12476 15041 13283 7684 1002 -22040 -25531 -15576 -4853
10291 -4853 -1762 -6923 39 7816 -9346 7556 11340 6144 3447 2181 3599 -1065 -9050 -9702
10277 -9702 -4109 16977 26976 14486 3376 9857 12104 7341 9149 -2238 -10585 -2900 -418 17160
10263 17160 17628 4296 550 14976 21849 20487 20957 9176 4731 13582 11846 12154 16024 25884
10249 25884 29347 32561 28731 12402 7446 8263 1353 -211 -2335 -6037 -1432 2151 16942 13085
$$ packed form
10346g334P60J6091M941n051J2670N738j4121k7507q215J1512L915P045Q539q18
10332H165O354p314P024j5731j2448p399Q846j833K487J9122o037k3286n010N31
10318b6529J099L341P591J585O329J5122K558p5M232J575j4170n359Q367N559
10304A1225L402j1901J3231N863r344K565j758n599o682k3042l491R955J0723
10291d853L091n161O962P777j7162J6902L784n196k697j266J418m664p985o52
10277i702N593K1086R999j2490j1110O481K247m763J808j1387q347P685K482J7578
10263A7160M68j3332l746J4426O873j362M70j1781m445Q851j736L08L870R860
10249B5884L463L214l830j6329m956Q17o910j564k124l702M605L583J4791l857
$$ plain form
10235 13085 -304 400 736 1926 1540 -2987 -8558 -7266 -9625 -11359 1921 19934 19537 9042
10221 9042 -4465 -9952 5893 10731 12208 10488 -2803 2908 21439 12586 6269 1539 5697 -372
10207 -372 -12679 -17836 -13002 2557 15128 11268 17961 34049 36589 23551 10875 -295 -2029
10194 -2029 5874 8225 -4191 -5527 13029 24903 17693 8523 23319 27867 21347 5780 837
10181 837 -10986 -13091 -7178 761 -314 -16966 -23212 -19379 -14555 -6917 -5353 -1895 726 7945
10167 7945 15767 20458 29301 21182 3406 -10940 -847 9712 12594 2456 -1510 1644 6736
10154 6736 9149 -5168 -17444 -8768 -20608 -25440 -14155 -4806 -11748 -5207 10888 20983 31336
10141 31336 34298 23008 9463 11344 10715 5892 1762 2366 -7334 -14000 -20210 -24711 -12193 144
$$ packed form
10235A3085j3389P04L36J190l86m527n571J292k359j734J3280J8013l97j0495
10221I042j3507n487J5845M838J477j720j3291N711J8531q853o317m730M158o069
10207c72j2307n157M834J5559J2571l860O693J6088K540j3038j2676j1170j734
10194b029P903K351j2416j336J8556J1874p210r170J4796M548o520j5567m943
10181H37j1823k105N913P939j075j6652o246L833M824P638J564L458K621P219
10167G945P822M691Q843q119j7776j4346J0093J0559K882j0138l966L154N092
10154F736K413j4317j2276Q676j1840m832J1285R349o942O541J6095J0095J0353
10141C1336K962j1290j3545J881o29m823m130O04r700o666o210m501J2518J2337
$$ plain form
10127 144 3000 6647 8589 9974 -1487 -2085 -5210 3564 79 11737 9199 14793 12959 -2350
10113 -2350 -14672 -16379 -8335 -6552 -16432 -5477 6589 18829 20148 13712 16382 35256 32965
10100 32965 35223 33646 24489 11502 8955 10789 2181 1403 14982 28885 30321 25339 25955 27376
10086 27376 34350 26048 17044 16780 9318 10964 11671 19578 7347 4501 8517 9035 6880 12350 4735
10071 4735 -1664 3785 317 -6367 41 11832 16550 29235 33591 29745 33796 29343 21350 22049
10057 22049 18784 21106 22310 28550 48999 54512 56624 51198 46499 45624 67904 81909 92914 115894
10043 115894 180601 298109 500480 838413 1279327 1638446 1912454 2184726 1992310 1249914
10033 1249914 730308 470824 321554 234789 195202 164910 143797 119049 104361 85628 73077
$$ packed form
10127A44K856L647J942J385j1461n98l125Q774l485J1658k538N594j834j5309
10113b350j2322j707Q044J783r880J0955J2066J2240J319o436K670J8874k291
10100C2965K258j577r157j2987k547J834q608p78J3579J3903J436m982O16J421
10086B7376O974q302r004k64p462J646P07P907j2231k846M016N18k155N470p615
10071D735o399N449l468o684O408J1791M718J2685M356l846M051m453p993O99
10057B2049l265K322J204O240K0449N513K112n426m699q75K2280J4005J1005K2980
10043A15894O4707J17508K02371L37933M40914L59119K74008K72272j92416p42396
10033A249914n19606k59484j49270q6765l9587l0292k1113k4748j4688j8733j2551
$$ plain form
10022 73077 66765 66590 65716 60652 52188 52029 46892 35902 41128 30970 31748 36663 32661 22301 18385
10007 18385 22395 31929 25620 24699 25892 18391 21721 25351 26786 30112 31182 36725 32786 32906 36824
9992 36824 30344 23509 25974 24912 35365 36566 26632 20037 31129 26606 25917 29289 23501 10145
9978 10145 13363 25001 24021 21169 29175 22080 16539 14068 9649 19545 19203 17326 18538 30643 37813
9963 37813 40145 31564 24402 29653 17905 11037 14277 5216 5820 -878 -5089 -7329 -2027 5518 11496
9948 11496 3290 -955 4945 19651 42977 36993 23853 19809 18660 14738 5748 9901 27441 29660
9934 29660 28560 13949 12440 14142 16280 17914 16917 17485 12688 18760 14993 12534 16576 19634 12862
9919 12862 6869 10288 12905 17901 27826 20287 20315 32513 28400 31297 30685 23332 15195 18158 25724
$$ packed form
10022G3077o312j75q74n064q464j59n137j0990N226j0158P78M915m002j0360l916
10007A8385M010R534o309r21J193p501L330L630J435L326J070N543l939J20L918
9992C6824o480o835K465j062J0453J201r934o595J1092m523o89L372n788j3356
9978A0145L218J1638r80k852Q006p095n541k471m419R896l42j877J212J2105P170
9963C7813K332q581p162N251j1748o868L240r061O04o698m211k240N302P545N978
9948A1496q206m245N900J4706K3326n984j3140m044j149l922q990M153J7540K219
9934B9660j100j4611j509J702K138J634r97N68m797O072l767k459M042L058o772
9919A2862n993L419K617M996R925p539K8J2198m113K897o12p353q137K963P566
$$ plain form
9904 25724 28379 34870 22846 29458 34682 25822 30932 28009 21207 2536 208 17933 19957 21380
9890 21380 30878 35394 38286 33600 37966 25489 27676 22839 12730 7741 1408 630 5255 15240
9876 15240 16912 23378 24016 27170 24409 29248 27986 21473 15706 23278 21444 22127 25439 38326 38950
9861 38950 44646 43637 37553 30729 28757 18340 11055 4569 2985 11737 14944 16025 10049 18729
9847 18729 24334 25425 33665 43059 32427 31877 35426 41576 33122 31342 26453 14933 18473 23168
9833 23168 27413 32876 23863 23540 24603 31279 52768 59373 53446 54984 43184 25282 30062 33936
9819 33936 39907 47379 47431 43419 41409 54604 61119 68060 78603 95019 124682 160865 204861 258720
9805 258720 323380 388816 427757 464414 475675 446183 419492 441847 504942 600166 689821 760224
$$ packed form
9904B5724K655O491j2024O612N224q860N110k923o802j8671k328J7725K024J423
9890B1380R498M516K892m686M366j2477K187m837j0109m989o333p78M625R985
9876A5240J672O466O38L154k761M839j262o513n767P572j834O83L312J2887O24
9861C8950N696j009o084o824j972j0417p285o486j584Q752L207J081n976Q680
9847A8729N605J091Q240R394j0632n50L549O150q454j780m889j1520L540M695
9833B3168M245N463r013l23J063O676K1489O605n927J538j1800j7902M780L874
9819C3936N971P472N2m012k010J3195O515O941J0543J6416K9663L6183M3996N3859
9805B58720O4660O5436L8941L6657J1261k9492k6691K2355O3095R5224Q9655P0403
$$ plain form
9793 760224 796900 768084 658964 554245 489947 470788 471897 478243 473716 458479 416278 336878
9781 336878 251833 190006 156802 138634 116782 110925 111407 88561 76556 78545 72112 51771 48003
9768 48003 55043 65795 83477 78201 63619 64119 65408 54784 42070 39545 35152 29879 33391 33256
9754 33256 27261 38395 58109 50889 50825 52655 38834 37308 44581 41641 35950 31620 22417 5007
9740 5007 13414 22121 15270 29074 42944 41587 48565 42490 29907 39513 36860 38224 42790 42625
9726 42625 46249 49212 42182 41566 45076 25867 3011 -4719 4209 11907 13553 22596 33787 34501
9712 34501 21292 23207 33280 32861 20706 15807 30260 37393 34069 28427 36830 33199 23371 17582
9698 17582 15760 20519 19018 15423 13882 13115 14713 20793 19850 25442 24740 22797 24367 24486 14530 12144
$$ packed form
9793G60224L6676k8816j09120j04719o4298j9159J109O346m527j5237m2201p9400
9781C36878q5045o1827l3204j8168k1852n857M82k2846j2005J989o433k0341l768
9768D8003P040J0752J7682n276j4582N00J289j0624j2714k525m393n273L512j35
9754C3256n995J1134J9714p220o4J830j3821j526P273k940n691m330r203j7410
9740E007Q407Q707o851J3804J3870j357O978o075j2583R606k653J364M566j65
9726D2625L624K963p030o16L510j9209k2856p730Q928P698J646R043J1191P14
9712C4501j3209J915J0073m19j2155m899J4453P133l324n642Q403l631r828n789
9698A7582j822M759j501l595j541p67J598O080r43N592p02j943J570J19r956k386
$$ plain form
9682 12144 20797 28145 42507 49889 40173 20047 28084 40533 45673 32522 33016 52104 56410 52658
9668 52658 51534 47566 40669 39369 33787 52206 49202 36081 13231 4186 19640 20396 16490 14742
9654 14742 24999 31667 27043 25372 30088 31068 23653 37315 44454 42376 54245 50802 40215 31998
9640 31998 27391 10409 20230 32489 44331 49587 41615 30054 22800 37565 43894 42263 45424
9627 45424 42601 46876 39392 43086 52160 61292 58204 56350 40732 32642 21756 18483 26618 25442
9613 25442 22088 27183 45751 57113 56904 43809 37233 26850 23644 29003 28523 14798 18342 33870
9599 33870 36578 41637 44502 42944 48654 60367 62097 73604 70148 55082 51939 52797 57414 64974
9585 64974 59296 50276 46363 31112 44507 47447 41030 44463 52175 48071 46368 53149 56236 57835
$$ packed form
9682A2144Q653P348J4362P382r716k0126Q037J2449N140j3151M94J9088M306l752
9668E2658j124l968o897j300n582J8419l004j3121k2850r045J5454P56l906j748
9654A4742J0257O668m624j671M716R80p415J3662P139k078J1869l443j0587q217
9640C1998m607j6982R821J2259J1842N256p972j1561p254J4765O329j631L161
9627D5424k823M275p484L694R074R132l088j854j5618q090j0886l273Q135j176
9613B5442l354N095J8568J1362k09j3095o576j0383l206N359m80j3725L544J5528
9599C3870K708N059K865j558N710J1713J730J1507l456j5066l143Q58M617P560
9585F4974n678r020l913j5251J3395K940o417L433P712m104j703O781L087J599
$$ plain form
9571 57835 42341 39773 39644 40162 42650 49005 50372 48059 57558 68401 54136 36073 35330 39182
9557 39182 38867 42811 41140 37498 35727 41350 49661 48590 49580 50177 47618 41629 36230 44304 47467
9542 47467 57077 68620 81939 80211 68018 60139 55407 52145 58716 57008 55649 61508 53720 54814
9528 54814 53056 57626 64952 81534 79914 76349 86085 100339 99483 92420 97212 98919 101401 104435
9514 104435 113284 134721 146392 170352 204187 283408 392082 490987 582671 686810 783100
9503 783100 872589 957583 1040698 1112535 1108610 989053 842695 731276 645968 558367 433405
9492 433405 330219 255074 196674 171545 172158 168780 148984 142377 131346 122650 112432 97884
9480 97884 89349 81136 76739 75591 80864 92292 91300 88780 96825 100751 94187 95018 103122 111523 97324
$$ packed form
9571E7835j5494k568j29N18K488O355J367k313R499J0843j4265j8063p43L852
9557C9182l15L944j671l642j771N623Q311j071R90N97k559n989n399Q074L163
9542D7467R610J1543J3319j728j2193p879m732l262O571j708j359N859p788J094
9528E4814j758M570P326J6582j620l565R736J4254q56p063M792J707K482L034
9514A04435Q849K1437J1671K3960L3835P9221J08674R8905R1684J04139R6290
9503G83100Q9489Q4994Q3115P1837l925j19557j46358j11419q5308q7601j24962
9492D33405j03186p5145n8400k5129O13l378j9796o607j1031q696j0218j4548
9480I7884q535q213m397j148N273J1428r92k520Q045L926o564Q31Q104Q401j4199
$$ plain form
9465 97324 78770 73794 83959 91598 101186 91574 91227 84266 90646 107868 111221 97188 75187 77784
9451 77784 71604 67753 61872 67599 60676 57968 60222 74481 82506 77815 68873 69852 68974 69713 68380
9436 68380 72573 85304 80011 85912 84342 85259 97780 84487 71501 77268 70761 66953 71649 73792
9422 73792 80275 86103 88621 77028 72986 80053 83668 74971 82075 83249 79098 77979 84333 84377 76301
9407 76301 76439 66722 69892 75023 84744 93453 108792 107725 86395 81334 93709 95105 96088 111275
9393 111275 121453 111543 104021 94391 98678 101236 100515 94319 84974 87821 97574 98725 97068 92157
9379 92157 83494 78649 85371 91604 99629 97720 91188 94582 92086 88143 92073 90207 78689 72989
9365 72989 71072 74048 70188 65808 79055 95162 100761 96179 96727 91587 82656 81317 88683 89217 85593
$$ packed form
9465I7324j8554m976J0165P639R588r612l47o961O380J7222L353j4033k2001K597
9451G7784o180l851n881N727o923k708K254J4259Q025m691q942R79q78P39j333
9436F8380M193J2731n293N901j570R17J2521j3293j2986N767o507l808M696K143
9422G3792O483N828K518j1593m042P067L615q697P104J174m151j119O354M4q076
9407G6301J38r717L170N131R721Q709J5339j067k1330n061J2375J396R83J5187
9393A11275J0178r910p522r630M287K558p21o196r345K847R753J151j657m911
9379I2157q663m845O722O233Q025j909o532L394k496l943L930j866j1518n700
9365G2989j917K976l860m380J3247J6107N599m582N48n140q931j339P366N34l624
$$ plain form
9350 85593 79946 80727 93007 92956 107946 115492 127319 136184 138987 150783 160134 163619 166714 173796
9336 173796 148105 128168 139252 139296 126641 123907 112765 120937 120681 113970 117929 120202 128896 126338
9322 126338 117971 118540 128631 133285 138781 129004 127391 135707 149199 159313 156306 162308 165939 178020
9308 178020 178895 182265 186811 190405 203152 216950 226322 237565 245999 268796 294721 324818 362240
9295 362240 400782 452216 531364 618300 710872 810189 941456 1070801 1205575 1338229 1455327
9284 1455327 1542175 1583849 1592339 1546977 1481949 1392714 1279425 1165779 1025671 883887 768362
9273 768362 673730 594344 519281 470439 432951 408056 369492 338782 316855 292506 273169 267022
9261 267022 263488 246639 227179 228276 229406 226774 223314 210289 210024 221243 216924 207258 211758 195344
$$ packed form
9350H5593n647P81J2280n1J4990P546J1827Q865K803J1796R351L485L095P082
9336A73796k5691j9937J1084M4j2655k734j1142Q172k56o711L959K273Q694k558
9322A26338q367N69J0091M654N496r777j613Q316J3492J0114l007O002L631J2081
9308A78020Q75L370M546L594J2747J3798R372J1243Q434K2797K5925L0097L7422
9295C62240L8542N1434P9148Q6936R2572R9317J31267J29345J34774J32654J17098
9284A455327Q6848M1674Q490m5362o5028q9235j13289j13646j40108j41784j15525
9273G68362r4632p9386p5063m8842l7488k4895l8564l0710k1927k4349j9337o147
9261B67022l534j6849j9460J097J130k632l460j3025k65J1219m319r666M500j6414
$$ plain form
9247 195344 201510 213598 215557 216708 214940 211853 199139 187467 191922 186923 182871 190769 206630
9234 206630 218803 219733 194721 181591 184402 189806 203567 214027 211420 215613 209771 193285 201544
9221 201544 209416 201125 207511 214544 224243 232602 235905 225590 220711 217204 209906 220808 236362 254862
9207 254862 281072 294642 299839 305927 302105 323086 348526 363285 376900 400610 448622 516246
9195 516246 563173 582273 588743 546137 469259 367272 263251 190609 140906 127342 126448 131258
9183 131258 144284 172728 189799 195401 193310 183336 169989 168759 162882 165776 168198 163842 160184
9170 160184 166809 154745 155426 158093 169838 176942 181079 198049 207974 206710 220482 223689 215575 207749
9156 207749 207653 198087 202317 207587 206263 211754 226413 239010 244751 257906 288952 322512 377705
$$ packed form
9247A95344O166J2088J959J151j768l087j2714j1672M455m999m052P898J5861
9234B06630J2173R30k5012j3130K811N404J3761J0460k607M193n842j6486Q259
9221B01544P872q291O386P033R699Q359L303j0315m879l507p298J0902J5554J8500
9207B54862K6210J3570N197O088l822K0981K5440J4759J3615K3710M8012O7624
9195E16246M6927J9100O470m2606p6878j01987j04021p2642m9703j3564q94M810
9183A31258J3026K8444J7071N602k091r974j3347j230n877K894K422m356l658
9170A60184O625j2064O81K667J1745P104M137J6970R925j264J3772L207q114p826
9156B07749r6r566M230N270j324N491J4659J2597N741J3155L1046L3560N5193
$$ plain form
9143 377705 431172 480651 545857 592100 615416 621403 611685 583306 533004 479888 436377 397819
9131 397819 363444 330215 312703 293111 272103 258156 259522 257822 245993 242398 250358 256050 265077
9118 265077 282967 281357 267846 254918 258890 267061 281551 274559 262377 264890 270011 259575 259035
9105 259035 255759 248210 236139 226473 224551 221178 225544 238304 271599 296532 306584 293177 283786
9092 283786 299509 303316 292484 283071 282415 285466 287402 275545 268836 267624 293159 299626 291047 279091
9078 279091 282538 285984 287149 288221 297701 303391 305776 314133 345940 360748 370118 386954 393666 415507
9064 415507 424810 430265 443447 451797 450800 448754 451141 447713 446245 451545 464969 477733 489578 504773
9050 504773 512912 518173 522939 543034 553260 567365 573706 564881 531622 496769 476829 455839 426186
$$ packed form
9143C77705N3467M9479O5206M6243K3316N987r718k8379n0302n3116m3511l8558
9131C97819l4375l3229j7512j9592k1008j3947J366j700j1829l595P960N692R027
9118B65077J7890j610j3511j2928L972Q171J4490o992j2182K513N121j0436n40
9105B59035l276p549j2071r666j922l373M366J2760L3295K4933J0052j3407r391
9092B83786J5723L807j0832r413o56L051J936j1857o709j212K5535O467q579j1956
9078B79091L447L446J165J072R480N690K385Q357L1807J4808R370J6836O712K1841
9064D15507R303N455J3182Q350r97k046K387l428j468N300J3424J2764J1845J5195
9050E04773Q139N261M766K0095J0226J4105O341q825l3259l4853j9940k0990k9653
$$ plain form
9037 426186 382462 361727 358017 360974 382732 411107 444211 483825 513377 525642 531145 544715
9025 544715 556352 567780 597117 620680 638286 648454 653366 675582 733851 796166 852282 897472
9013 897472 940598 980095 1016708 1051971 1041884 985864 927877 903354 902264 895500 897953 900246
9001 900246 915833 926324 944524 956507 960854 966465 965465 964806 971357 981607 992232 1014771 1032961
8988 1032961 1048922 1085660 1112864 1135912 1177995 1202535 1223991 1254326 1303470 1351785 1395961
8977 1395961 1456961 1495671 1540829 1599782 1654631 1691589 1738821 1777946 1815817 1852316 1905781
8966 1905781 1969687 2030307 2088552 2160779 2250997 2355384 2462427 2558498 2642253 2731648 2840668
8955 2840668 2937547 3022542 3107877 3181730 3255387 3351441 3429399 3520612 3642978 3752231 3854280
$$ packed form
9037D26186m3724k0735l710K957K1758K8375L3104L9614K9552J2265N503J3570
9025E44715J1637J1428K9337K3563J7606J0168M912K2216N8269O2315N6116M5190
9013H97472M3126L9497L6613L5263j0087n6020n7987k4523j090o764K453K293
9001I00246J5587J0491J8200J1983M347N611j000o59O551J0250J0625K2539J8190
8988A032961J5961L6738K7204K3048M2083K4540K1456L0335M9144M8315M4176
8977A395961O1000L8710M5158N8953N4849L6958M7232L9125L7871L6499N3465
8966A905781O3906O0620N8245P2227R0218J04387J07043R6071Q3755Q9395J09020
8955B840668R6879Q4995Q5335P3853P3657R6054P7958R1213J22366J09253J02049
$$ plain form
8944 3854280 3978888 4105369 4242476 4370144 4496083 4627863 4779278 4933016 5078406 5215953
8934 5215953 5363021 5499256 5640914 5766527 5888052 6036804 6187073 6317267 6439211 6580504
8924 6580504 6728597 6894523 7072891 7274436 7505546 7772358 8050117 8342866 8664056 9039498
8914 9039498 9476542 9983537 10571984 11236964 11997932 12854586 13838793 14953578 16190677
8905 16190677 17591628 19268966 21282191 23697237 26547360 29877794 33752876 38262825
8897 38262825 43547898 49880549 57681305 67690220 81071079 99361113 124453456 158270826
8889 158270826 201583227 252055986 303247334 346451689 373418868 376129198 349560281
8882 349560281 300163268 244335154 194976732 156228793 127162283 105528100 89240524
$$ packed form
8944C854280J24608J26481J37107J27668J25939J31780J51415J53738J45390J37547
8934E215953J47068J36235J41658J25613J21525J48752J50269J30194J21944J41293
8924F580504J48093J65926J78368K01545K31110K66812K77759K92749L21190L75442
8914I039498M37044N06995N88447O64980P60968Q56654R84207J114785J237099
8905A6190677J400951J677338K013225K415046K850123L330434L875082M509949
8897C8262825N285073O332651P800756J0008915J3380859J8290034K5092343L3817370
8889A58270826M3312401N0472759N1191348M3204355K6967179K710330k6568917
8882C49560281m9397013n5828114m9358422l8747939k9066510k1634183j6287576
$$ plain form
8875 89240524 76759003 66997648 59203948 52831658 47454539 42736044 38485317 34639778
8867 34639778 31205908 28189195 25596437 23380921 21476437 19813668 18347105 17046044
8859 17046044 15905462 14911655 14002390 13205722 12495857 11853737 11260241 10731751 10251285
8850 10251285 9785032 9350517 8950209 8586210 8235119 7908193 7606832 7330301 7064661
8841 7064661 6809029 6578197 6367578 6161045 5975993 5787274 5613120 5427514 5240184 5098724
8831 5098724 4968501 4835184 4704555 4584088 4464999 4361504 4276793 4193736 4109959 4017049
8821 4017049 3925821 3830748 3740910 3652642 3583444 3508015 3435044 3384642 3329782 3288958 3266663
8810 3266663 3249442 3217449 3171639 3132049 3092565 3051472 3017283 2973561 2941439 2904115 2844038
$$ packed form
8875H9240524j2481521r761355p793700o372290n377119m718495m250727l845539
8867C4639778l433870l016713k592758k215516j904484j662769j466563j301061
8859A7046044j140582r93807r09265p96668p09865o42120n93496n28490m80466
8850A0251285m66253m34515m00308l63999l51091l26926l01361k76531k65640
8841G064661k55632k30832k10619k06533j85052j88719j74154j85606j87330j41460
8831E098724j30223j33317j30629j20467j19089j03495q4711q3057q3777r2910
8821D017049r1228r5073q9838q8268o9198p5429p2971n0402n4860m0824k2295
8810C266663j7221l1993m5810l9590l9484m1093l4189m3722l2122l7324o0077
$$ plain form
8799 2844038 2792521 2736011 2673816 2630438 2569604 2518283 2479625 2449532 2425243 2395405 2374433
8788 2374433 2339229 2299772 2283475 2255317 2230254 2195636 2157003 2130958 2106060 2088446 2073601
8777 2073601 2054621 2037823 2015235 1993070 1976859 1971724 1975643 1970158 1969008 1965149 1962603 1981637 1998298
8764 1998298 2028422 2074165 2117739 2135865 2163290 2186003 2199005 2198444 2177923 2147384 2083890 2031634
8752 2031634 1986442 1942040 1906622 1886741 1871468 1864749 1859772 1850780 1847697 1844066 1838775 1851390 1870208
8739 1870208 1888403 1904830 1916386 1931027 1943524 1944190 1937790 1905665 1855769 1807723 1774413 1747601
8727 1747601 1745443 1750318 1755481 1747914 1737250 1733067 1738901 1754126 1764363 1793378 1812501 1831135 1858824
8714 1858824 1890724 1911481 1907887 1914401 1932947 1958295 1982612 2000147 1994962 2009522 2034318 2056074
$$ packed form
8799B844038n1517n6510o2195m3378o0834n1321l8658l0093k4289k9838k0972
8788B374433l5204l9457j6297k8158k5063l4618l8633k6045k4898j7614j4845
8777B073601j8980j6798k2588k2165j6211n135L919n485j150l859k546J9034J6661
8764A998298L0124M5743M3574J8126K7425K2713J3002n61k0521l0539o3494n2256
8752B031634m5192m4402l5418j9881j5273o719m977q992l083l631n291J2615J8818
8739A870208J8195J6427J1556J4641J2497O66o400l2125m9896m8046l3310k6812
8727A747601k158M875N163p567j0664m183N834J5225J0237K9015J9123J8634K7689
8714A858824L1900K0757l594O514J8546K5348K4317J7535n185J4560K4796K1756
$$ plain form
8702 2056074 2082210 2110461 2143609 2161192 2199287 2225752 2249293 2268565 2285641 2310538 2330833
8691 2330833 2349436 2365541 2369504 2385558 2416216 2444133 2467974 2491115 2524441 2541949 2571057 2584537
8679 2584537 2588767 2596009 2621899 2657840 2687160 2727975 2771204 2800622 2825162 2855932 2883659 2907894
8667 2907894 2923876 2947045 2981193 3034374 3059526 3068368 3096944 3125584 3169392 3212135 3248859 3272613
8655 3272613 3318109 3354730 3387592 3422056 3474104 3513450 3549018 3600246 3652485 3700816 3747099
8644 3747099 3789913 3821576 3860564 3907572 3942144 3979508 4014644 4065431 4118303 4156187 4199688
8633 4199688 4257385 4309397 4346142 4384179 4430344 4474872 4529178 4598079 4671463 4724341 4792823
8622 4792823 4873930 4935493 5015189 5094380 5164141 5232766 5310576 5409933 5579079 5853632 6330395
$$ packed form
8702B056074K6136K8251L3148J7583L8095K6465K3541J9272J7076K4897K0295
8691B330833J8603J6105L963J6054L0658K7917K3841K3141L3326J7508K9108J3480
8679B584537M230P242K5890L5941K9320M0815M3229K9418K4540L0770K7727K4235
8667B907894J5982K3169L4148N3181K5152Q842K8576K8640M3808M2743L6724K3754
8655C272613M5496L6621L2862L4464N2048L9346L5568N1228N2239M8331M6283
8644C747099M2814L1663L8988M7008L4572L7364L5136N0787N2872L7884M3501
8633D199688N7697N2012L6745L8037M6165M4528N4306O8901P3384N2878O8482
8622D792823Q1107O1563P9696P9191O9761O8625P7810R9357J69146K74553M76763
$$ plain form
8611 6330395 7207678 8574417 10155796 11389056 12404369 13168183 11926361 9387456 7850232
8602 7850232 7095238 6700659 6466545 6334983 6267195 6227856 6204965 6188049 6185797 6184046 6167792
8591 6167792 6145083 6140525 6137817 6142372 6178173 6204105 6234438 6273372 6296982 6297262 6265149 6207606
8579 6207606 6137601 6046209 5961250 5909117 5897480 5923498 5970243 6008258 6024634 6022630 6016925 6004041
8567 6004041 5998806 5999622 5993363 5969026 5943515 5926342 5907201 5896392 5873663 5844112 5816168 5791802
8555 5791802 5752638 5726688 5696595 5668307 5647436 5612422 5573281 5531331 5493033 5471502 5427119
8544 5427119 5388372 5368121 5330972 5281153 5239191 5188929 5137237 5108772 5079598 5036621 4987896
8533 4987896 4926860 4874011 4838622 4797158 4750747 4710206 4671619 4624377 4584076 4555550 4525344
$$ packed form
8611F330395Q77283J366739J581379J233260J015313P63814j241822k538905j537224
8602G850232p54994l94579k34114j31562o7788l9339k2891j6916k252j751j6254
8591F167792k2709m558k708M555L5801K5932L0333L8934K3610K80l2113n7543
8579F207606p0005r1392q4959n2133j1637K6018M6745L8015J6376k004n705j2884
8567F004041n235Q16o259k4337k5511j7173j9141j0809k2729k9551k7944k4366
8555E791802l9164k5950l0093k8288k0871l5014l9141m1950l8298k1531m4383
8544E427119l8747k0251l7149m9819m1962n0262n1692k8465k9174m2977m8725
8533D987896o1036n2849l5389m1464m6411m0541l8587m7242m0301k8526l0206
$$ plain form
8522 4525344 4486236 4442775 4385795 4326592 4282914 4252260 4205508 4146275 4096441 4068514 4027252
8511 4027252 3993154 3952852 3913437 3872141 3838885 3796914 3778772 3744445 3716642 3675357 3647808
8500 3647808 3620997 3593345 3574626 3547470 3526538 3525651 3527822 3554082 3560447 3589377 3650112 3715758
8488 3715758 3809322 3918797 4023262 4111884 4189880 4239271 4265941 4270741 4236955 4148160 4029592
8477 4029592 3884979 3726243 3554273 3398296 3250626 3128349 3019056 2930749 2844023 2753464
8467 2753464 2681336 2618860 2572951 2523361 2481479 2445194 2402922 2377454 2344294 2307951 2266462
8456 2266462 2236436 2213079 2195857 2168719 2145851 2125770 2087705 2058462 2021778 2002040 1986554
8445 1986554 1962215 1932042 1889008 1872848 1853335 1824434 1808933 1796383 1775129 1757354 1743357
$$ packed form
8522D525344l9108m3461n6980n9203m3678l0654m6752n9233m9834k7927m1262
8511D027252l4098m0302l9415m1296l3256m1971j8142l4327k7803m1285k7549
8500C647808k6811k7652j8719k7156k0932q87K171K6260O365K8930O0735O5646
8488C715758R3564J09475J04465Q8622P7996M9391K6670M800l3786q8795j18568
8477D029592j44613j58736j71970j55977j47670j22277j09293q8307q6726r0559
8467B753464p2128o2476m5909m9590m1882l6285m2272k5468l3160l6343m1489
8456B266462l0026k3357j7222k7138k2868k0081l8065k9243l6684j9738j5486
8445A986554k4339l0173m3034j6160j9513k8901j5501j2550k1254j7775j3997
$$ plain form
8434 1743357 1710373 1679411 1670541 1657443 1628595 1596784 1579665 1557728 1542718 1555835 1577600 1555888
8422 1555888 1545551 1530591 1510843 1502742 1492642 1470733 1448208 1433320 1417579 1398543 1373471 1356266
8410 1356266 1343634 1350039 1346525 1343033 1309211 1268793 1254406 1245755 1244579 1229913 1205708 1194595
8398 1194595 1180585 1168180 1176658 1178262 1168344 1145746 1133736 1134735 1129576 1108337 1090989 1078949 1068657
8385 1068657 1067195 1062093 1048094 1028629 1023187 1011493 1008806 999188 991679 992036 986928 964220 951489
8372 951489 959474 954077 930604 927554 925115 909467 889072 880940 874697 880801 886292 864369 831042
8359 831042 829943 835668 840363 828770 816355 799475 795073 792538 777872 761429 759361 761339 765621
8346 765621 760021 749431 749896 737771 726561 723572 732058 726077 705934 695574 708744 714095 705849
$$ packed form
8434A743357l2984l0962q870j3098k8848l1811j7119k1937j5010J3117K1765k1712
8422A555888j0337j4960j9748q101j0100k1909k2525j4888j5741j9036k5072j7205
8410A356266j2632O405l514l492l3822m0418j4387q651j176j4666k4205j1113
8398A194595j4010j2405Q478J604r918k2598j2010R99n159k1239j7348j2040j0292
8385A068657j462n102j3999j9465n442j1694k687r618p509L57n108k2708j2731
8372I51489P985n397k3473l050k439j5648k0395q132o243O104N491k1923l3327
8359H31042j099N725M695j1593j2415j6880m402k535j4666j6443k068J978M282
8346G65621n600j0590M65j2125j1210k989Q486n981k0143j0360J3170N351q246
$$ plain form
8333 705849 699646 702776 710585 709546 696773 678515 662233 651556 657713 656958 637350 625615 617882
8320 617882 624743 625570 621279 612021 598340 603053 597927 585611 587867 596002 592841 582584 568721 565602
8306 565602 575318 576082 566626 571864 572869 556298 535741 527483 522437 524608 504338 498481 499846 509048
8292 509048 497244 487795 486926 492914 501290 490381 475522 475736 478751 478640 473761 465804 464819 472887 483424
8277 483424 487943 494568 490509 490417 484552 485198 495924 493560 484227 478124 481042 458415 440460 437837
8263 437837 424294 417764 413279 409932 399071 403878 416914 420769 415548 419663 407124 388852 379941
8250 379941 376007 367667 362931 352172 360863 371410 368967 368231 368981 356330 346599 348906 360164 362263
8236 362263 357675 358723 381272 391947 400729 405450 398314 375514 362033 353191 367977 377534 365092
$$ packed form
8333G05849o203L130P809j039j2773j8258j6282j0677O157p55j9608j1735p733
8320F17882O861Q27m291r258j3681M713n126j2316K256Q135l161j0257j3863l119
8306E65602R716P64r456N238J005j6571k0557q258n046K171k0270n857J365R202
8292E09048j1804r449q69N988Q376j0909j4859K14L015j11m879p957r85Q068J0537
8277D83424M519O625m059r2n865O46J0726k364r333o103K918k2627j7955k623
8263D37837j3543o530m485l347j0861M807J3036L855n221M115j2539j8272q911
8250C79941l934q340m736j0759Q691J0547k443p36P50j2651r731K307J1258K099
8236C62263m588J048K2549J0675Q782M721p136k2800j3481q842J4786R557j2442
$$ plain form
8223 365092 345716 343591 338957 341818 341824 342211 337825 328563 326327 330837 328653 325607 330381 317428 310030
8208 310030 327030 338342 320571 321140 328561 328570 315031 317568 313541 317800 309508 291293 287407 283804
8194 283804 273931 256601 267067 289735 293709 296572 300787 301753 290250 287525 284592 278321 264167
8181 264167 250908 256051 272663 275505 275592 272099 269757 278055 283609 270566 261472 260965 262942 247324
8167 247324 235226 225990 225546 233076 223425 219206 218318 225485 240129 258329 273136 263007 253373 240106
8153 240106 225569 219218 217529 224993 217820 215101 223258 230721 241757 251472 244308 240932 237064 222358
8139 222358 212867 212551 220120 227257 236442 242906 241463 230628 214204 207502 211465 217993 227462 227562
8125 227562 227643 227088 224049 218062 220015 221113 229664 235556 228266 218901 209605 211954 212563 212072 208275 204259
$$ packed form
8223C65092j9376k125m634K861OL87m386r262k236M510k184l046M774j2953p398
8208C10030J7000J1312j7771N69P421Rj3539K537m027M259q292j8215l886l603
8194B83804r873j7330J0466K2668L974K863M215R66j1503k725k933o271j4154
8181B64167j3259N143J6612K842Q7l493k342Q298N554j3043r094n07J977j5618
8167B47324j2098r236m44P530r651m219q88P167J4644J8200J4807j0129r634j3267
8153B40106j4537o351j689P464p173k719Q157P463J1036R715p164l376l868j4706
8139B22358r491l16P569P137R185O464j443j0835j6424o702L963O528R469J00
8125B27562Q1n55l039n987J953J098Q551N892p290r365r296K349O09m91l797m016
$$ plain form
8109 204259 212447 215479 210004 204154 192893 194083 192690 196845 183926 178550 190758 205066 194925
8096 194925 170119 165480 172497 176964 169914 162613 164763 178903 192953 195259 196683 200122 187784
8083 187784 166846 148961 159713 171717 178862 199332 208387 201648 189309 182072 188420 186949 192364
8070 192364 180969 172726 170669 172773 165396 149496 152029 154334 147059 162966 170741 159767 166600
8057 166600 181795 173571 168819 168127 165544 162692 162374 168116 160983 151645 142310 145627 155414 159114 165266
8042 165266 166382 171366 157200 144015 149489 155505 165155 156557 153632 165085 168144 157276 156688 157130
8028 157130 167089 194406 184729 171100 168867 165630 164629 159235 150560 152991 158102 146079 135048
8015 135048 147175 152452 147394 137815 133786 149466 156592 160852 156646 154582 163783 156100 142819 129989
$$ packed form
8109B04259Q188L032n475n850j1261J190j393M155j2919n376J2208J4308j0141
8096A94925k4806m639P017M467p050p301K150J4140J4050K306J424L439j2338
8083A87784k0938j7885J0752J2004P145K0470R055o739j2339p237O348j471N415
8070A92364j1395q243k057K104p377j5900K533K305p275J5907P775j0974O833
8057A66600J5195q224m752o92k583k852l18N742p133r338r335L317R787L700O152
8042A65266J116M984j4166j3185N474O016R650q598k925J1453L059j0868n88M42
8028A57130R959K7317r677j3629k233l237j001n394q675K431N111j2023j1031
8015A35048J2127N277n058r579m029J5680P126M260m206k064R201p683j3281j2830
$$ plain form
8001 129989 128282 148298 150982 145936 151820 152759 150599 147313 138283 146046 143357 153917 148327 137912
7987 137912 149862 140325 142419 137536 128428 138444 143789 134830 134945 138232 131155 137785 160415 168260
7973 168260 161969 162055 169797 156069 148212 148622 146444 145637 151831 157836 161672 167829 154383 146965 139677
7958 139677 143665 146496 143704 140910 131222 134923 144286 141494 131358 116944 122274 146604 154956 137192
7944 137192 126172 132619 135638 131234 132166 154618 167074 161777 149099 146775 152200 168074 174008
7931 174008 171285 159428 145054 149605 150369 149441 149009 139932 128201 133857 136011 132923 121469 118597
7917 118597 126547 141043 141427 129629 124766 125112 119591 110216 114932 121131 134493 141911 142856 135457
7903 135457 133395 128987 128181 120224 116442 120232 129015 125974 131617 142280 150674 146638 135552 129127
$$ packed form
8001A29989j707K0016K684n046N884R39k160l286r030P763k689J0560n590j0415
7987A37912J1950r537K094m883r108J0016N345q959J15L287p077O630K2630P845
7973A68260o291Q6P742j3728p857M10k178q07O194O005L836O157j3446p418p288
7958A39677L988K831k792k794r688L701R363k792j0136j4414N330K4330Q352j7764
7944A37192j1020O447L019m404R32K2452J2456n297j2678k324N425J5874N934
7931A74008k723j1857j4374M551P64r28m32r077j1731N656K154l088j1454k872
7917A18597P950J4496L84j1798m863L46n521r375M716O199J3362P418R45p399
7903A35457k062m408q06p957l782L790Q783l041N643J0663Q394m036j1086o425
$$ plain form
7889 129127 118286 111340 96656 101763 111572 115202 87522 99924 124502 125938 119237 114742 108251
7876 108251 91530 88283 100234 105141 108982 118741 115993 109108 102537 90836 88878 106582 112566
7863 112566 115592 97398 87645 99764 104110 99501 110848 107415 107098 105816 98121 110550 109940 100868
7849 100868 88575 81682 76320 84309 91203 90036 94268 96128 93780 85605 82480 79007 72163 70682
7835 70682 85030 84375 81442 100761 101647 92186 84203 89199 88580 82151 81002 91756 89636 89113 88686
7820 88686 85802 83171 82544 78436 76830 78636 87137 88041 75356 58475 70694 83355 80909 85035
7806 85035 86028 77592 72018 75496 71309 76390 84350 78762 83008 99275 97205 81666 73155 72459 78513
7791 78513 76289 65135 62758 57209 54480 58813 59784 65227 60462 59680 66391 79967 92574 90454
$$ packed form
7889A29127j0841o946j4684N107R809L630k7680J2402K4578J436o701m495o491
7876A08251j6721l247J1951M907L841R759k748o885o571j1701j958J7704N984
7863A12566L026j8194r753J2119M346m609J1347l433l17j282p695J2429o10r072
7849A00868j2293o893n362P989O894j167M232J860k348q175l125l473o844j481
7835G0682J4348o55k933J9319Q86r461p983M996o19o429j149J0754k120n23m27
7820H8686k884k631o27m108j606J806Q501R04j2685j6881J2219J2661k446M126
7806H5035R93q436n574L478m187N081P960n588M246J6267k070j5539q511o96O054
7791G8513k224j1154k377n549k729M333R71N443m765p82O711J3576J2607k120
$$ plain form
7777 90454 72668 60071 71455 80487 70908 65957 72119 80619 73024 82602 94576 84076 76968
7764 76968 79756 71684 54168 66864 85295 90848 90841 76508 69196 63355 65197 55630 70526 87499
7750 87499 82493 72045 74034 72310 57877 53633 65079 68891 77376 70481 52729 58419 74223
7737 74223 76580 80346 80833 77502 76261 68647 64426 52311 46706 43922 52344 58896 61081 60808 41410
7722 41410 38053 52682 59525 57838 60402 69150 73974 71998 60371 65694 84547 83864 70803 52018
7708 52018 58425 54785 53086 55632 52762 43562 51429 56214 51094 46333 71174 91487 84449 76963
7694 76963 53228 47470 44013 37828 29253 31438 43991 44406 43107 47535 51762 53126 38726 48430
7680 48430 53857 51879 54523 54586 47009 59395 58842 53476 55256 49428 41431 44852 52652 45958 41668
$$ packed form
7777I0454j7786j2597J1384R032r579m951O162Q500p595R578J1974j0500p108
7764G6968K788q072j7516J2696J8431N553pj4333p312n841J842r567J4896J6973
7750H7499n006j0448J989j724j4433m244J1446L812Q485o895j7752N690J5804
7737G4223K357L766M87l331j241p614m221j2115n605k784Q422O552K185k73j9398
7722D1410l357J4629O843j687K564Q748M824j976j1627N323J8853o83j3061j8785
7708E2018O407l640j699K546k870r200P867M785n120m761K4841K0313p038p486
7694G6963k3735n758l457o185q575K185J2553M15j299M428M227J364j4400R704
7680D8430N427j978K644O3p577J2386n53n366J780n828p997L421P800o694m290
$$ plain form
7665 41668 39842 54293 56544 44696 32553 30390 27868 25465 20118 15290 28305 31212 39950 48612
7651 48612 62671 58503 53700 57947 42891 32425 35730 42998 34602 30299 29581 40498 41101 40840
7637 40840 48695 40349 36244 54769 76659 83437 74399 56934 57912 55414 59006 52522 52733 62284
7623 62284 62050 49694 33368 11253 11547 25319 27959 25674 41771 52755 41366 39149 54413
7610 54413 56099 55534 58542 50212 49940 56926 65434 53484 61725 62718 62484 46804 38474 29792 29231
7595 29231 29173 42769 52000 38790 46214 60568 74391 70846 44507 38144 34149 33363 41395 46266
7581 46266 60543 70530 55839 44603 42734 36954 29216 29589 21077 19339 21236 23185 31139 30864
7567 30864 44985 58442 60419 71732 65313 45965 35981 34578 30692 27765 27021 14430 15615 36588
$$ packed form
7665D1668j826J4451K251j1848j2143k163k522k403n347m828J3015K907Q738Q662
7651D8612J4059m168m803M247j5056j0466L305P268q396m303p18J0917O03k61
7637D0840P855q346m105J8525K1890O778r038j7465R78k498L592o484K11R551
7623F2284k34j2356j6326k2115K94J3772K640k285J6097J0984j1389k217J5264
7610E4413J686n65L008q330k72O986Q508j1950Q241R93k34j5680q330q682n61
7595B9231n8J3596R231j3210P424J4354J3823l545k6339o363l995p86Q032M871
7581D6266J4277R987j4691j1236j869n780p738L73q512j738J897J949P954k75
7567C0864J4121J3457J977J1313o419j9348r984j403l886k927p44j2591J185K0973
$$ plain form
7553 36588 43144 35697 27401 22151 27330 24550 18763 10309 4048 4438 7240 16955 26347 29083 27804
7538 27804 25974 27470 29139 36298 40232 42062 46657 56062 55375 53244 46455 34451 39656 40464 37972
7523 37972 39250 35764 25436 27170 40715 41394 27919 24602 33091 24256 11726 22081 40511
7510 40511 43293 24093 28840 35320 38692 40966 41899 32756 30023 35589 34787 24018 29081 44491
7496 44491 47503 55138 40890 35671 46679 38393 35806 34788 22058 7641 3256 5395 16933
7483 16933 21321 10776 5333 17130 34894 39698 33167 36021 27646 25730 33160 26213 30689 31270
7469 31270 28453 22895 25703 24323 29345 17604 14673 19561 32321 53031 51475 34854 32481 26938
7455 26938 30183 32166 36625 38568 31849 29807 30084 34969 20381 13179 30558 35607 14745 20783
$$ packed form
7553C6588O556p447q296n250N179k780n787q454o261L90K802R715R392K736j279
7538B7804j830J496J669P159L934J830M595R405o87k131o789j2004N205Q08k492
7523C7972J278l486j0328J734J3545O79j3475l317Q489q835j2530J0355J8430
7510D0511K782j9200M747O480L372K274R33r143k733N566q02j0769N063J5410
7496D4491L012P635j4248n219J1008q286k587j018j2730j4417m385K139J1538
7483A6933M388j0545n443J1797J7764M804o531K854q375j916P430o947M476N81
7469C1270k817n558K808j380N022j1741k931M888J2760K0710j556j6621k373n543
7455B6938L245J983M459J943o719k042K77M885j4588p202J7379N049k0862O038
$$ plain form
7441 20783 38532 39649 42353 44458 35783 27976 25363 23921 28900 40872 31473 26241 39107 52544
7427 52544 50446 57312 45007 39843 37174 50011 43576 40320 41586 30691 37334 40201 38821 24497
7413 24497 12939 5884 16563 25242 15239 -3084 -587 9915 17432 22015 30663 31157 35006 39403
7399 39403 33213 34943 37777 41144 29883 24808 20807 13870 24222 25758 16303 -11221 -19164 -11341
7385 -11341 -1072 14608 21789 24235 28801 26319 22285 19599 18405 21577 20376 18146 13726 18009
7371 18009 16730 6248 3026 12507 13508 5757 13932 18421 14437 17747 36965 49522 46691 42144
7357 42144 34681 31432 43920 44366 31307 23488 28057 28625 25467 29035 33879 28060 35054 38990 35707
7342 35707 29389 16571 3556 11705 31207 27691 16263 21359 18247 21411 29034 30214 22280 22045
$$ packed form
7441B0783J7749J117K704K105q675p807k613j442M979J1972r399n232J2866J3437
7427E2544k098O866j2305n164k669J2837o435l256J266j0895O643K867j380j4324
7413B4497j1558p055J0679Q679j0003j8323K497J0502P517M583Q648M94L849M397
7399C9403o190J730K834L367j1261n075m001o937J0352J536r455k7524p943P823
7385a1341J0269J5680P181K446M566k482m034k686j194L172j201k230m420M283
7371A8009j279j0482l222R481J001p751Q175M489l984L310J9218J2557k831m547
7357D2144p463l249J2488M46j3059p819M569N68l158L568M844n819O994L936l283
7342C5707o318j2818j3015Q149J9502l516j1428N096l112L164P623J180p934k35
$$ plain form
7328 22045 22922 26679 36366 39760 35823 42856 39607 31573 31151 23614 19240 12086 8053 11576 -577
7313 -577 -13964 -17625 -7644 4848 10976 15663 11351 1161 6972 12812 15837 729 -4863 -2146
7299 -2146 6830 17041 20223 32460 27359 15871 15890 28393 32949 19490 8127 23878 32607 33721
7285 33721 33551 24528 13644 4787 11202 29553 26722 12884 15381 24673 24191 24562 32153 37779 37460
7270 37460 31204 19099 14327 19081 30085 40316 37056 30170 21483 2574 1069 12676 14736
7257 14736 11312 14391 31796 24240 10312 1119 8685 16051 19180 15591 3245 1114 12771 22553
7243 22553 39376 53119 46066 36976 35074 37932 29909 14943 21602 16909 3296 3716 13493 14055
7229 14055 9853 8608 23077 38894 32054 21921 21481 28560 29043 33182 15279 1740 6175 16191
$$ packed form
7328B2045Q77L757R687L394l937P033l249q034m22p537m374p154m033L523j2153
7313e77j3387l661R981J2492O128M687m312j0190N811N840L025j5108n592K717
7299b146Q976J0211L182J2237n101j1488J9J2503M556j3459j1363J5751Q729J114
7285C3721j70r023j0884q857O415J8351k831j3838K497R292m82L71P591N626l19
7270C7460o256j2105m772M754J1004J0231l260o886q687j8909j505J1607K060
7257A4736l424L079J7405p556j3928r193P566P366L129l589j2346k131J1657R782
7243B2553J6823J3743p053r090j902K858q023j4966O659m693j3613M20R777N62
7229A4055m202j245J4469J5817o840j0133m40P079M83M139j7903j3539M435J0016
$$ plain form
7215 16191 31327 36344 27518 19747 13241 20848 34148 34850 23269 10668 7851 7934 4796 13820
7201 13820 13784 13037 -4662 -13280 -6666 9067 23288 33482 39353 26565 20618 24447 18390 2296
7187 2296 258 9820 26806 27978 15854 12431 13069 10878 6625 12221 16727 935 -423 22475
7173 22475 32521 32271 34163 26847 23437 16409 21467 22338 25078 25531 18611 17006 17827 19482 19864 27958
7157 27958 25864 20471 18153 23587 17429 12556 17555 12975 5996 14050 18428 16111 25683 10749
7143 10749 8403 6569 2060 10674 10748 15140 6494 -1876 4593 10140 14568 20112 27634 16863 1604
7128 1604 -3953 3267 2184 12549 22911 24411 24110 13005 8363 4628 -2667 -531 5367 12922
7114 12922 14307 19889 30744 27411 26893 22553 21972 15969 22578 23100 15379 23705 13990 3081 13917
$$ packed form
7215A6191J5136N017q826p771o506P607J3300P02j1581j2601k817Q3l138R024
7201A3820l6p47j7699q618O614J5733J4221J0194N871j2788n947L829o057j6094
7187B296k038R562J6986J172j2124l423O38k191m253N596M506j5792j358K2898
7173B2475J0046k50J892p316l410p028N058Q71K740M53o920j605Q21J655L82Q094
7157B7958k094n393k318N434o158m873M999m580o979Q054M378k317R572j4934
7143A0749k346j834m509Q614P4M392q646q370O469N547M428N544P522j0771j5259
7128A604n557P220j083J0365J0362J500l01j1105m642l735p295K136N898P555
7114A2922J385N582J0855l333n18m340n81o003O609N22p721Q326r715j0909J0836
$$ plain form
7099 13917 7698 -2267 -6018 -10787 -4043 5243 5814 2347 -2856 -5592 374 4865 8371 6261 8758
7084 8758 20944 3789 -6595 -3760 9914 12103 6356 22368 19990 12942 11830 17881 18297 7843
7070 7843 15074 27509 19944 8632 19447 33522 33314 25900 18065 19692 20721 21847 17217 5373
7056 5373 10131 15342 18388 3615 6368 3679 5643 8514 7781 8650 11209 2955 5146 7666 6408
7041 6408 6962 16616 4627 -12462 -7304 -1883 1756 2550 1225 8090 8629 12127 10139 4160 4393
7026 4393 16097 16509 7074 14586 22986 19947 15956 1779 -865 1931 13128 14826 7415 -4793
7012 -4793 177 4571 12905 25028 22185 16712 19210 17876 24631 25245 25897 25500 15515 4640 3552
6997 3552 8487 15034 13302 1721 -4226 -8042 6223 13491 21008 18968 20215 20932 29440 31546 19486
$$ packed form
7099A3917o219r965l751m769O744R286N71l467n203k736N966M491L506k110K497
7084H758J2186j7155j0384K835J3674K189n747J6012k378p048j112O051M16j0454
7070G843P231J2435p565j1312J0815J4075k08p414p835J627J029J126m630j1844
7056E373M758N211L046j4773K753k689J964K871p33Q69K559q254K191K520j258
7041F408N54R654j1989j7089N158N421L639P94j325O865N39L498j988n979K33
7026D393J1704M12r435P512Q400l039l991j4177k644K796J1197J698p411j2208
7012d793M970M394Q334J2123k843n473K498j334O755O14O52l97r985j0875j088
6997C552M935O547j732j1581n947l816J4265P268P517k040J247P17Q508K106j2060
$$ plain form
6982 19486 18714 19990 22121 14552 12552 19386 28696 16542 5939 1367 16503 22327 18061 26507
6968 26507 21356 7155 7472 -1829 -697 269 7505 3911 -5883 8623 23759 31751 32771 16466
6954 16466 5243 4919 15653 -3856 -11576 -10970 -13274 1559 914 -8742 -13207 -23463 -20232 -13900
6940 -13900 -8794 7030 15852 21048 17905 7062 3537 11172 24194 22081 27806 14544 695
6927 695 4320 7242 4472 172 -6541 -2168 4866 -2095 -4547 8806 11831 3957 8800 12688 12128
6912 12128 5031 -8370 -4159 2013 4494 4831 -2449 4830 14041 15139 16717 15546 9767 -4310
6898 -4310 -2172 9180 17055 16357 12361 -99 -4077 -6173 -119 10514 11324 9105 4416 -5777
6884 -5777 -7769 -16073 -16536 -10207 -5410 2834 8235 -2608 8262 405 -6937 -2545 2537 -3558 1252
$$ packed form
6982A9486p72J276K131p569k000O834R310j2154j0603m572J5136N824m266Q446
6968B6507n151j4201L17r301J132R66P236l594r794J4506J5136P992J020j6305
6954A6466j1223l24J0734j9509p720O06k304J4833o45r656m465j0256L231O332
6940a3900N106J5824Q822N196l143j0843l525P635J3022k113N725j3262j3849
6927F95L625K922k770m300o713M373P034o961k452J3353L025p874M843L888n60
6912A2128p097j3401M211O172K481L37p280P279R211J098J578j171n779j4077
6898d310K138J1352P875o98l996j2460l978k096O054J0633Q10k219m689j0193
6884e777j992q304m63O329M797Q244N401j0843J0870p857p342M392N082o095M810
$$ plain form
6869 1252 -1319 -10523 -3854 3047 7438 8958 7017 -6448 -3462 909 12567 25572 18597 4537
6855 4537 -478 3484 -2877 9292 12699 11143 2388 -6393 4129 13898 17738 27417 21177 8617
6841 8617 -2280 -1289 -9661 -7674 -5971 3390 6535 3292 -1744 -14674 -16064 -2214 8681 10606
6827 10606 12143 9489 13231 12440 15356 -3178 -23868 -10893 5575 20655 23680 17764 20757 16867
6813 16867 13917 8456 13589 22064 22986 20876 12910 6036 13841 16606 3616 -864 -6846 -6610 -1153
6798 -1153 14794 21698 20860 15640 10986 -1514 -8953 -17158 -12280 -8992 -13465 -19839 -7207 189
6784 189 13298 23118 31801 25226 1718 -164 5594 4780 27211 28637 19692 15063 6110 8919 10669
6769 10669 3920 -8065 -12671 -4096 4882 2251 8019 274 -382 5241 12592 8354 11031 12836 14798
$$ packed form
6869A252k571r204O669O901M391J520j941j3465K986M371J1658J3005o975j4060
6855D537n015L962o361J2169L407j556q755q781J0522R769L840R679o240j2560
6841H617j0897R91q372J987J703R361L145l243n036j2930j390J3850J0895J925
6827A0606J537k654L742p91K916j8534k0690J2975J6468J5080L025n916K993l890
6813A6867k950n461N133Q475R22k110p966o874P805K765j2990m480n982K36N457
6798a153J5947O904q38n220m654j2500p439q205M878L288m473o374J2632P396
6784A89J3109R820Q683o575k3508j882N758q14K2431J426q945m629q953K809J750
6769A0669o749j1985m606Q575Q978k631N768p745o56N623P351m238K677J805J962
$$ plain form
6754 14798 6500 -2038 532 23176 29633 18958 2000 -355 1610 15391 26036 21344 22454
6741 22454 11150 14974 23513 13868 20671 21479 17920 6339 6355 7082 5131 -5770 2597 15621 6500
6726 6500 -849 -3409 -3262 -10947 -13423 -2191 9752 8323 14245 19205 32590 38080 39014 40431 45910
6711 45910 44567 37716 34132 33623 22449 4514 1210 2265 5433 5966 7986 5745 205 -1779 -177
6696 -177 7782 -605 -4590 -18752 -13344 4752 8169 -9637 -5603 -7681 -9695 -7209 -1768 8128
6682 8128 6809 6862 4396 5320 -5304 -5180 4703 10399 13779 15296 9154 7457 13862 25428 34069
6667 34069 30529 21887 14589 14965 23435 20960 11331 6156 7595 13210 3055 -3308 1802 6982 498
6652 498 -9629 -5903 6979 7406 10714 8303 2995 -4069 -1390 1360 2143 3605 210 233 1367 2828
$$ packed form
6754A4798q298q538K570K2644O457j0675j6958k355J965J3781J0645m692J110
6741B2454j1304L824Q539r645O803Q08l559j1581J6P27j951j0901Q367J3024r121
6726F500p349k560J47p685k476J1232J1943j429N922M960J3385N490R34J417N479
6711D5910j343o851l584n09j1174j7935l304J055L168N33K020k241n540j984J602
6696a77P959q387l985j4162N408J8096L417j7806M034k078k014K486N441R896
6682H128j319N3k466R24j0624J24R883N696L380J517o142j697O405J1566Q641
6667C4069l540q642p298L76Q470k475r629n175J439N615j0155o363N110N180o484
6652D98j0127L726J2882M27L308k411n308p064K679K750P83J462l395K3J134J461
$$ plain form
6636 2828 1571 6629 21196 35400 34372 23663 14551 8178 -1908 -9362 5016 11374 1415 -2333
6622 -2333 4569 6276 3529 1168 8183 14487 19433 17138 7477 13330 17056 15585 10974 10628 2917
6607 2917 -11516 -16251 -15714 -2924 -10638 -22310 -10624 1143 11479 15369 9816 1745 -5865 -15196
6593 -15196 -21175 -17373 -6350 288 -426 5849 4453 5698 5080 -4813 -14764 6428 24169 12812
6579 12812 5227 -6273 -18044 -10302 1745 11635 11540 7023 746 1173 -1689 5447 5949 2184 10290
6564 10290 8787 6847 15811 15205 4502 -7203 -12204 -6015 -6152 -5054 -6480 -9259 7701 23274
6550 23274 14148 5063 3694 -1616 4626 2967 -3387 -4256 -15030 -19149 -15273 -20752 -13173 -1369
6536 -1369 7178 15803 16164 9027 2651 6703 -342 -22650 -21144 -16614 -27188 -28170 -12991 -8135 -7078
$$ packed form
6636B828j257N058J4567J4204j028j0709r112o373j0086p454J4378O358r959l748
6622b333O902J707k747k361P015O304M946k295r661N853L726j471m611l46p711
6607B917j4433m735N37J2790p714j1672J1686J1767J0336L890n553q071p610r331
6593a5196n979L802J1023O638p14O275j396J245o18r893r951K1192J7741j1357
6579A2812p585j1500j1771P742J2047R890r5m517o277M27k862P136N02l765Q106
6564A0290j503j940Q964o06j0703j1705n001O189j37J098j426k779J6960J5573
6550B3274r126r085j369n310O242j659o354q69j0774m119L876n479P579J1804
6536a369Q547Q625L61p137o376M052p045k2308J506M530j0574r82J5179M856J057
$$ plain form
6521 -7078 3939 8165 7302 9251 9132 1218 -2559 -11627 -18520 -35383 -39971 -30510 -13097 5744
6507 5744 1580 -9070 -14899 -18995 -21103 -13349 -5253 11347 8105 971 -598 -3411 -12530 -806
6493 -806 -7091 -9461 444 8826 9518 13288 24290 20232 6426 2457 -1759 -447 11681 14211 10938
6478 10938 10845 3855 -8165 -13429 -6244 -2058 3326 3155 6505 9962 12238 8900 1653 7365 8542
6463 8542 11445 6987 1480 4871 17471 11260 3724 -11071 -18623 -10988 -6449 -1621 2449 -3697
6449 -3697 -4897 -746 1608 -1120 -2194 -16543 -21358 -9177 -12585 -2044 5463 3546 -304 2534
6435 2534 6801 -3331 -7511 -15154 -13580 -9292 -14502 -25248 -21123 -11979 -5395 -1298 -5024 -2556
6421 -2556 3456 1527 -7236 -3448 -3009 1509 -12399 -7880 -1519 -2508 -2440 -1438 -184 2454 9851 6630
$$ packed form
6521g078J1017M226q63J949j19p914l777r068o893j6863m588R461J7413J8841
6507E744m164j0650n829m096k108P754Q096J6600l242p134j569k813r119J1724
6493h06o285k370R905Q382O92L770J1002m058j3806l969m216J312J2128K530l273
6478A0938r3o990j2020n264P185M186N384j71L350L457K276l338p247N712J177
6463H542K903m458n507L391J2600o211p536j4795p552P635M539M828M070o146
6449c697j200M151K354k728j074j4349m815J2181l408J0541P507j917l850K838
6435B534M267j0132m180p643J574M288n210j0746M125R144O584M097l726K468
6421b556O012j929q763L788M39M518j3908M519O361r89O8J002J254K638P397l221
$$ plain form
6405 6630 8781 11225 19173 16957 7726 -4348 -307 1781 7198 10938 15098 21465 28667 29420 23130
6390 23130 12972 146 1637 8509 -2514 -5965 -2337 5788 19260 22878 19703 14316 5560 3702
6376 3702 -14929 -17157 -4372 -3132 -10174 -8781 -2849 351 -5520 -5458 -4787 -1087 -1218 7650 -720
6361 -720 -4627 2135 -10059 -12882 -12856 -5048 2007 -1464 3008 15465 9612 2455 3082 8613 4599
6346 4599 5432 -401 -15581 -8253 5233 42 431 9716 16252 20042 6117 2643 -3598 7457
6332 7457 4009 4973 8254 14106 24093 27705 21660 25831 21962 13521 -514 -8227 4914 11919 12997
6317 12997 10141 5555 4370 1880 -122 4886 12755 5121 5808 3250 -10476 -14943 -8439 -7960 3065
6302 3065 6485 -4555 1766 12479 880 -5380 -1963 -13736 2675 9124 3216 -3518 -592 -8316
$$ packed form
6405F630K151K444P948k216r231j2074M041K088N417L740M160O367P202P53o290
6390B3130j0158j2826J491O872j1023l451L628Q125J3472L618l175n387q756j858
6376C702j8631k228J2785J240p042J393N932L200n871O2O71L700j31Q868q370
6361g20l907O762j2194k823K6P808P055l471M472J2457n853p157O27N531m014
6346D599Q33n833j5180P328J3486n191L89R285O536L790j3925l474o241J1055
6332G457l448R64L281N852R987L612o045M171l869q441j4035p713J3141P005J078
6317A2997k856m586j185k490k002N008P869p634O87k558j3726m467O504M79J1025
6302C065L420j1040O321J0713j1599o260L417j1773J6411O449n908o734K926p724
$$ plain form
6288 -8316 -9781 -4934 -12277 -18607 -11720 -6471 -16406 -26991 -19583 -19526 -10262 -2888 4057 8398 10339
6273 10339 3035 -451 4258 4859 -1074 -13059 -16197 -12594 -13322 -26546 -30379 -15231 -16405 -15325
6259 -15325 -2983 10373 16170 18853 -3551 -7607 -1469 1037 2134 4795 7390 4347 718 2711
6245 2711 8839 11065 170 7000 -2924 -6011 -11005 -73 7192 10876 20308 33293 33607 25245
6231 25245 15529 16871 17065 24337 24883 27295 17075 7887 9739 -466 5090 -1122 -2840 -10333 -7099
6216 -7099 -2690 4949 1724 -4849 3278 6568 6714 13789 12272 4167 -1889 4272 14903 9265 4888
6201 4888 7534 5774 3092 -7328 -24197 -11578 2366 -493 7873 7595 -4048 -1815 -3842 -10817
6187 -10817 -2014 -4431 -16975 -15578 -5417 -8221 -11573 -7095 -9925 -3800 -4446 -18829 -24914 -23218
$$ packed form
6288h316j465M847p343o330O887N249r935j0585P408N7R264P374O945M341J941
6273A0339p304l486M709O01n933j1985l138L603p28j3224l833J5148j174J080
6259a5325J2342J3356N797K683k2404m056O138K506J097K661K595l043l629J993
6245B711O128K226j0895O830r924l087m994J0932P265L684R432J2985L14q362
6231B5245r716J342J94P272N46K412j0220r188J852j0205N556o212j718p493L234
6216g099M409P639l225o573Q127L290J46P075j517q105o056O161J0631n638m377
6201D888K646j760k682j0420j6869J2619J3944k859Q366k78j1643K233k027o975
6187a0817Q803k417j2544J397J0161k804l352M478k830O125o46j4383o085J696
$$ plain form
6173 -23218 -7270 -9960 -16059 -18635 -11529 -6335 3035 3859 8683 2632 731 908 -1156 2296 -5995
6158 -5995 -12494 -20872 -18154 -3515 847 -8211 -14614 -18746 -20973 -21486 -22791 -18390 -8845 -8356 -3728
6143 -3728 -11210 -6219 -9785 -10996 -19606 -18081 -21812 -7457 4671 12156 12413 -542 -5638 -3582
6129 -3582 -17451 -13232 -3320 4330 -160 -624 -1201 5217 13188 4961 1911 -4893 -9655 -301 9805
6114 9805 4641 4863 7367 255 -19563 -23656 -15555 -18674 -11323 -584 -5490 -12193 -21770 -21228 -28660
6099 -28660 -18818 -17374 -13868 -1646 3998 -2760 -8676 -17803 -17397 -7812 4523 5254 -4805 -4547 10291
6084 10291 22529 26652 9018 1908 -1929 1214 9742 -657 -8301 -8189 -9907 -10071 -11380 -7189
6070 -7189 -11279 -10402 -12243 -12319 -2674 -4344 -2975 -5400 7464 19385 7679 13776 10087 -2240 -916
$$ packed form
6173b3218J5948k690o099k576P106N194R370Q24M824o051j901J77k064L452q291
6158e995o499q378K718J4639M362r058o403m132k227n13j305M401R545M89M628
6143c728p482M991l566j211q610J525l731J4355J2128P485K57j2955n096K056
6129c582j3869M219R912P650m490m64n77O418P971q227l050o804m762R354J0106
6114I805n164K22K504p112j9818m093Q101l119P351J0739m906o703r577N42p432
6099b8660R842J444L506J2222N644o758n916r127M06R585J2335P31j0059K58J4838
6084A0291J2238M123j7634p110l837L143Q528j0399p644J12j718j64j309M191
6070g189m090Q77j841p6R645j670J369k425J2864J1921j1706O097l689j2327J324
$$ plain form
6055 -916 1931 -5453 -23330 -20652 -9123 9616 24085 37194 33588 21103 11572 8970 -2560
6042 -2560 -18770 -36281 -27328 -5524 -1082 -549 -3161 -10235 2615 20564 8477 10084 5681 2131
6028 2131 7147 3761 -7093 -8415 -6698 -7856 -5934 5128 14718 9181 13234 11839 13461 5766
6014 5766 -2526 -7223 -16201 -8152 -281 1478 16751 13322 1440 -6178 -9353 -16064 -14430 -5670
6000 -5670 -5784 9898 15247 21470 6451 -819 -4651 2219 1688 6384 6915 6273 7275 8367 -12820
5985 -12820 -17984 -18331 -18069 -17454 -4854 -3852 283 8771 7854 7011 3259 -8713 -5001 -3782 -11961
5970 -11961 -16453 -14881 -2804 -11760 -17376 -9366 -2519 6765 1735 -2367 -2156 -4413 -15739 -6295
5956 -6295 3452 -2481 -5434 -6906 -8801 -7386 -8743 -11343 -4235 -3005 3456 7457 10516 604 905
$$ packed form
6055i16K847p384j7877K678J1529J8739J4469J3109l606j2485r531k602j1530
6042b560j6210j7511Q953K1804M442N33k612p074J2850J7949j2087J607m403l550
6028B131N016l386j0854j322J717j158J922J1062R590n537M053j395J622p695
6014E766q292m697q978Q049P871J759J5273l429j1882p618l175o711J634Q760
6000e670j14J5682N349O223j5019p270l832O870n31M696N31o42J002J092k1187
5985a2820n164l47K62O15J2600J002M135Q488r17q43l752j1972L712J219q179
5970a1961m492J572J2077q956n616Q010O847R284n030m102K11k257j1326R444
5956f295R747n933k953j472j895J415j357k600P108J230O461M001L059r912L01
$$ plain form
5941 905 6119 5802 7116 812 -6082 -4361 5076 6206 3589 7732 4088 -7629 -18880 -13295 -4087
5926 -4087 -7971 -4943 -10113 -18217 -18789 -15975 -21919 -3965 3585 -1812 -12365 -25864 -16405 -12626
5912 -12626 -4076 5464 27355 29879 27500 6246 -8544 -13094 -12169 -10855 -27909 -31250 -27322 -23859
5898 -23859 -16441 -21216 -25425 -16828 -18057 -21957 -23356 -18588 -11797 -4700 2938 8043 6240 -5845
5884 -5845 -4194 -7206 -13996 -19579 -21082 -13442 -6010 8634 9491 2196 8619 5348 -11352 -20132 -22784
5869 -22784 -26365 -18720 -15460 733 69 -3693 3718 8154 11484 17038 20089 23904 15305 8301 5288
5854 5288 2871 7359 4754 10488 7915 8069 15553 12712 16199 20375 16591 13776 11824 24656 24666
5839 24666 15032 7392 3332 -7265 3463 6689 1438 2408 -6632 -16659 -20431 -23254 -15735 3372
$$ packed form
5941I05N214l17J314o304o894J721R437J130k617M143l644j1717j1251N585R208
5926d087l884L028n170q104n72K814n944J7954P550n397j0553j3499R459L779
5912a2626Q550R540K1891K524k379k1254j4790m550R25J314j7054l341L928L463
5898b3859P418m775m209Q597j229l900j399M768O791P097P638N105j803j2085
5884e845J651l012o790n583j503P640P432J4644Q57p295O423l271j6700q780k652
5869b2784l581P645L260J6193o64l762P411M436L330N554L051L815q599p004l013
5854E288k417M488k605N734k573J54P484k841L487M176l784k815j952J2832J0
5839B4666r634p640m060j0597J0728L226n251R70r040j0027l772k823P519J9107
$$ plain form
5825 3372 787 -3229 1559 24490 30502 23285 15351 6196 11861 5393 13716 -1169 2732 6506
5811 6506 -6943 -12806 -6227 -10513 -8808 -2060 -1519 -11670 -23614 -23406 -10115 -13565 -17793 -7086
5797 -7086 -2523 1828 12615 8154 5724 -6696 -6416 14213 14330 8287 1953 -4488 -3066 10655
5783 10655 13605 3218 3932 4380 -12258 -14288 -9060 -12811 -5815 -8607 -15299 -19537 -27014 -14247
5769 -14247 6640 8405 -5121 -9252 -6445 5285 -4048 -5645 4306 3746 3449 801 -969 2093
5755 2093 7893 -6766 -25416 -25113 -16644 -17816 -12352 -14669 -22835 -26231 -23339 -32337 -15755 2882
5741 2882 1534 7468 -2690 -14109 1020 9337 11886 22258 20743 11688 12599 7423 -6208 -4033
5727 -4033 -1422 339 -6544 -11653 -5343 7133 5508 4826 5049 -3823 -22850 -8667 1454 10245
$$ packed form
5825C372k585m016M788K2931O012p217p934r155N665o468Q323j4885L901L774
5811F506j3449n863O579m286J705O748N41j0151j1944K08J3291l450m228J0707
5797g086M563M351J0787m461k430j2420K80K0629J17o043o334o441J422J3721
5783A0655K950j0387P14M48j6638k030N228l751O996k792o692m238p477J2767
5769a4247K0887J765j3526m131K807J1730r333j597R951n60k97k648j770L062
5755B093N800j4659j8650L03Q469j172N464k317q166l396K892q998J6582J8637
5741B882j348N934j0158j1419J5129Q317K549J0372j515r055R11n176j3631K175
5727d033K611J761o883n109O310J2476j625o82K23q872j9027J4183J0121Q791
$$ plain form
5713 10245 15734 11214 -6563 -14815 -13759 -17940 -10733 -5978 -3 4921 2443 -4608 -17987 -13863
5699 -13863 2955 11553 5454 2999 -277 -4844 -24636 -25942 -15247 -1190 11772 12214 11517 5679
5685 5679 1415 -1739 -7122 -7731 -14276 -12973 395 -4640 -8889 -15866 -18680 -20595 -18838 -4148 -4033
5670 -4033 -694 3989 3592 4249 -17921 -29954 -23934 -24490 -23910 -7575 4766 -1559 -8583 -9075 -15795
5655 -15795 -21552 -2866 263 -488 -3497 -20987 -27581 -25332 -20491 -20175 -23380 -15765 -11538 -3099 4941
5640 4941 7489 -1016 -11361 -17155 -14395 -4993 -693 -9247 -8637 -3263 -11918 -15683 -18498 -18187 -10575
5625 -10575 -12607 -13677 -15122 -12259 -6090 -7681 -12287 -14716 -30206 -22821 -6817 7346 13134 12788
5611 12788 19936 11106 10288 25743 23945 10621 -1058 -7510 -52 9623 11840 12698 14984 14986 382
$$ packed form
5713A0245N489m520j7777q252J056m181P207M755N975M924k478p051j3379M124
5699a3863J6818Q598o099k455l276m567j9792j306J0695J4057J2962M42o97n838
5685E679m264l154n383o09o545J303J3368n035m249o977k814j915J757J4690J15
5670d033L339M683l97O57k2170j2033O020n56N80J6335J2341o325p024m92o720
5655a5795n757J8686L129p51l009j7490o594K249M841L16l205P615M227Q439Q040
5640D941K548q505j0345n794K760R402M300q554O10N374q655l765k815L11P612
5625a0575k032j070j445K863O169j591m606k429j5490P385J6004J4163N788l46
5611A2788P148q830q18J5455j798j3324j1679o452P458R675K217Q58K286Kj4604
$$ plain form
5596 382 -9353 -15215 -4290 -15916 -21696 -24823 -23262 -30663 -32437 -18068 623 22064 23274 7982
5582 7982 9070 9831 7888 15661 8510 15594 18708 8606 -14652 -19239 -5760 -8722 -15244 -8829
5568 -8829 2211 4840 -3114 2148 14203 10605 186 16314 25335 26626 21208 12252 3192 -9996
5554 -9996 -12729 -5934 -17151 -17311 -10712 -3327 -2714 -6582 -5216 -9568 -294 23895 36154 12116
5540 12116 859 743 6495 9700 9232 9572 7483 -2898 -4935 -144 -1282 8240 -709 -20916 -31338
5525 -31338 -31475 -30784 -29806 -25186 -28421 -18284 -2368 -1017 -11993 -12137 -14422 -16463 -18102 -9039 -9055
5510 -9055 -1516 11692 6663 4935 2338 -16843 -12877 -6599 -15199 -5114 -4219 -12954 -9302 -10596
5496 -10596 -15479 -15586 -7549 -8491 -9049 -17141 -8130 -13153 -15484 -23670 -26204 -22508 -19546 -25469 -21726
$$ packed form
5596C82r735n862J0925j1626n780l127J561p401j774J4369J8691K1441J210j5292
5582G982J088P61j943P773p151P084L114j0102k3258m587J3479k962o522O415
5568h829J1040K629p954N262J2055l598j0419J6128R021J291n418q956r060j3188
5554i996k733O795j1217j60O599P385O13l868J366m352R274K4189J2259k4038
5540A2116j1257j16N752L205m68L40k089j0381k037M791j138R522q949k0207j0422
5525c1338j37O91R78M620l235J0137J5916J351j0976j44k285k041j639R063j6
5510i055P539J3208n029j728k597j9181L966O278q600J0085Q95q735L652j294
5496a0596m883j07Q037r42n58q092R011n023k331q186k534L696K962n923L743
$$ plain form
5481 -21726 -19017 -26479 -20755 -14906 -1235 -17634 -31151 -27880 -11200 -4086 1631 16861 22026
5468 22026 18300 119 -5321 -2457 1971 -12869 -16607 -6300 -11258 -21974 -20103 -10953 -5190 6513
5454 6513 9328 9693 3872 619 2131 -3253 -6628 -13568 -19596 -26721 -12221 -7141 -10863 5875 16036
5439 16036 10190 75 -2426 -7410 -11781 -9772 1053 12963 14127 4765 -7533 -21834 -16269
5426 -16269 -557 993 -7523 -10959 -7571 -18 6411 -966 988 -14792 -18380 -16813 -14504 -222
5412 -222 6700 -3154 -9535 -14508 -10112 -1935 15239 17037 10792 11177 1548 -7587 1624 14391 9283
5397 9283 -1328 3541 13798 12816 -2092 -11063 -7134 5007 9758 14663 12492 1193 -10585 -18281
5383 -18281 -10831 -2983 -13931 -14247 -18229 -16535 255 -10392 -12099 -6396 2040 -6278 -4969 -4121
$$ packed form
5481b1726K709p462N724N849J3671j6399j3517L271J6680P114N717J5230N165
5468B2026l726j8181n440K864M428j4840l738J0307m958j0716J871R150N763J1703
5454F513K815L65n821l253J512n384l375o940o028p125J4500N080l722J6738J0161
5439A6036n846j0115k501m984m371K009J0825J1910J164r362j2298j4301N565
5426a6269J5712J550q516l436L388P553O429p377J954j5780l588J567K309J4282
5412b22O922r854o381m973M396Q177J7174J798o245L85r629r135R211J2767n108
5397I283j0611M869J0257r82j4908q971L929J2141M751M905k171j1299j1778p696
5383a8281P450P848j0948l16l982J694J6790j0647j707N703Q436q318J309Q48
$$ plain form
5369 -4121 3634 13496 9638 5993 477 -11949 -16981 -4951 -11581 -14170 -14454 -3650 -10507 -10246 2725
5354 2725 9979 -1471 -6761 -1266 4355 -189 6204 15285 15049 4439 6693 3311 407 -4290 -9096
5339 -9096 -3503 -30 5083 7219 1247 5887 8305 2466 -3884 -3766 631 -1387 -14204 -22764 -4712
5324 -4712 -6895 -21352 -32167 -31581 -20122 -25998 -29336 -16683 -6318 -5643 -3676 -467 7961 15469
5310 15469 22105 16463 12571 2055 -3240 2076 1467 5025 14253 2079 -9443 -5735 -4685 -4638 13792
5295 13792 21529 13845 -2263 -3877 6938 -3207 -11349 -23101 -25541 -20273 -18983 -1271 20554
5282 20554 23317 24080 14607 5962 -1387 -3029 -1803 5165 3689 -9876 -12028 -4755 -12786 1994
5268 1994 18442 25557 21516 17565 5110 -3580 -12847 -2548 2200 -8337 -14358 -13244 -7383 -3442
$$ packed form
5369d121P755R862l858l645n516j2426n032J2030o630k589k84J0804o857K61J2971
5354B725P254j1450n290N495N621m544O393R081k36j0610K254l382k904m697m806
5339i096N593L473N113K136n972M640K418n839o350J18M397k018j2817q560J8052
5324d712k183j4457j0815N86J1459n876l338J2653J0365O75J967L209Q428P508
5310A5469O636n642l892j0516n295N316o09L558R228j2174j1522L708J050M7J8430
5295A3792P737p684j6108j614J0815j0145q142j1752k440N268J290J7712K1825
5282B0554K763P63r473q645p349j642J226O968j476j3565k152P273q031J4780
5268A994J6448P115m041l951j2455q690r267J0299M748j0537o021J114N861L941
$$ plain form
5254 -3442 -5832 3354 -10941 -8469 -12807 -6444 -13184 1969 16638 2425 -12352 -9534 -8116 -8492
5240 -8492 -8842 -8306 -16636 -8842 -301 -861 -4464 -2371 -9879 -16604 -15288 -3513 525 9481 3244
5225 3244 7959 13419 12350 12613 28742 13068 -6197 -4594 -5868 4514 -2380 -7266 3266 7663
5211 7663 2580 -4574 -8015 -2558 1734 -2716 -11173 -15622 -14874 -13699 -6366 -4379 -20326 -27752 -23517
5196 -23517 -15647 -6586 -7241 -11022 -12311 -18977 -17550 -13029 -16525 -17000 -15261 -11375 -9310 -621 9013
5181 9013 11373 10004 -10033 -24644 -19214 -34088 -47338 -21768 -2354 2549 4845 7158 9527
5168 9527 17002 7987 -7508 -14129 -29975 -33452 -37116 -29072 -24149 -24171 -10950 -14727 -16188 -13393 -10901
5153 -10901 -17185 -17657 -19668 -11666 3838 -2164 -7508 -12072 -8317 387 -2203 -9971 -13216 -11998 10460
$$ packed form
5254c442k390R186j4295K472m338O363o740J5153J4669j4213j4777K818J418l76
5240h492l50N36q330P794Q541n60l603K093p508o725J316J1775M038Q956o237
5225C244M715N460j069K63J6129j5674j9265J603j274J0382o894m886J0532M397
5211G663n083p154l441N457M292m450q457m449P48J175P333J987j5947p426M235
5196b3517P870R061o55l781j289o666J427M521l496m75J739L886K065Q689R634
5181I013K360j369k0037j4611N430j4874j3250K5570J9414M903K296K313K369
5168I527P475r015j5495o621j5846l477l664Q044M923k2J3221l777j461K795K492
5153a0901o284m72k011Q002J5504o002n344m564L755Q704k590p768l245J218K2458
$$ plain form
5138 10460 13201 6134 12049 19321 12530 1086 -6579 -15861 -17627 -11713 -16152 -26634 -17979 -15578
5124 -15578 -15169 -15047 -14387 -21024 -13582 -10894 -4436 3407 17786 18235 9607 1348 -6532 -5107 4443
5109 4443 1157 1002 -6516 -28609 -27329 -18153 -7135 -1223 -2711 2826 -10814 -16696 -15478 -10059
5095 -10059 -10117 -10417 1451 5049 -173 2952 -7265 -12717 -14219 1945 2863 4358 9557 2942 -8139
5080 -8139 -10262 -8581 -10618 -12842 -7718 -13758 -11705 -23490 -28988 -25242 -15425 3032 7029 -2800
5066 -2800 -8635 -18713 -18229 2481 18688 4068 1695 5290 10589 7124 6901 16827 23186 8678
5052 8678 1110 -3218 -2888 -6790 -13866 -20982 -11671 -14618 -10946 -4238 -6586 -13746 -22865 -20246 -16439
5037 -16439 -19022 -9904 5417 14160 9624 -2864 -9054 -16253 -4928 -2541 -400 3661 13956 16017
$$ packed form
5138A0460K741p067N915P272o791j1444p665r282j766N914m439j0482Q655K401
5124a5578M09J22O60o637P442K688O458P843J4379M49q628q259p880J425R550
5109D443l286j55p518k2093J280R176J1018N912j488N537j3640n882J218N419
5095a0059n8l00J1868L598n222L125j0217n452j502J6164R18J495N199o615j1081
5080h139k123J681k037k224N124o040K053j1785n498L746R817J8457L997r829
5066b800n835j0078M84K0710J6207j4620k373L595N299l465k23R926O359j4508
5052H678p568m328L30l902p076p116R311k947L672O708k348p160r119K619L807
5037a6439k583R118J5321Q743m536j2488o190p199J1325K387K141M061J0295K061
$$ plain form
5023 16017 17311 18054 14246 14591 2869 6007 8875 3240 -3029 9940 7822 14558 19291 18505 7320
5008 7320 -22 -6629 -4868 -8632 -9893 -15765 -16825 -15281 -23771 -28839 -13317 -11909 6450 8089
4994 8089 -457 -1835 -3464 -1264 -941 -8788 -14338 -11622 -11935 -8967 -11253 -4956 -3523 1528 -2246
4979 -2246 -6764 -11046 -6951 2312 15648 12306 6782 -4558 -15213 -24811 -34650 -25588 -31654 -21866
4965 -21866 -14621 -14041 -16399 -12219 -5734 -27403 -20576 -16088 -22678 -21318 -22750 -27920 -13017 -4222
4951 -4222 -759 7292 7009 14039 12428 5078 4728 -1716 -7102 -2033 4190 3870 6941 10903 8856 7081
4935 7081 9182 271 8141 9173 3156 -2163 -3233 2596 2484 -1186 -1338 -2742 6339 20547 17633
4920 17633 -2643 -6029 -2124 -1622 1884 15668 5640 10016 18532 20838 16812 12292 10769 8681
$$ packed form
5023A6017J294P43l808L45j1722L138K868n635o269J2969k118O736M733p86j1185
5008G320p342o607J761l764j261n872j060J544q490n068J5522J408J8359J639
4994H089q546j378j629K200L23p847n550K716l13K968k286O297J433N051l774
4979b246m518m282M095R263J3336l342n524j1340j0655r598r839R062o066R788
4965b1866P245N80k358M180O485k1669O827M488o590J360j432n170J4903Q795
4951d222L463Q051k83P030j611p350l50o444n386N069O223l20L071L962k047j775
4935G081K101q911P870J032o017n319j070N829j12l670j52j404R081J4208k914
4920A7633k0276l386L905N02L506J3784j0028M376Q516K306m026m520j523k088
$$ plain form
4906 8681 11771 14161 14282 16428 805 -11269 -5212 3819 -3806 -18619 -20353 -17051 -3321 1521
4892 1521 -298 586 2922 -4537 2464 -2441 1119 5073 867 805 -1689 2683 2472 -6214 -1700 -3705
4876 -3705 -5580 -10264 -9989 -4914 -12894 -14605 -17936 -8218 -10028 -18959 -20606 -6826 897 -3444 -9603
4861 -9603 -16909 -18026 -10414 7070 3035 -7790 -17559 -3444 1816 -189 4694 -3039 1478 2092
4847 2092 -3061 -18401 -20371 -26330 -22537 3505 1097 -4677 2842 11336 15054 6821 13921 16929
4833 16929 12783 8859 2054 -6369 2614 319 -3300 -4900 5229 1766 -10912 -19649 -18879 -4302
4819 -4302 -629 -2510 15845 20902 16113 6847 2382 10512 12950 -2306 -6785 -8760 -4646 -7195
4805 -7195 -18902 -18916 -11832 -19398 -15343 -4496 629 -17499 -19004 -20917 -9278 10405 19440 16424
$$ packed form
4906H681L090K390J21K146j5623j2074O057R031p625j4813j734L302J3730M842
4892A521j819Q84K336p459P001m905L560L954m206o2k494M372k11q686M514k005
4876c705j875m684K75N075p980j711l331R718j810q931j647J3780P723m341o159
4861i603p306j117P612J7484m035j0825r769J4115N260k005M883p733M517O14
4847B092n153j5340j970n959L793K6042k408n774P519Q494L718q233P100L008
4833A6929m146l924o805q423Q983k295l619j600J0129l463j2678q737P70J4577
4819d302L673j881J8355N057m789r266m465Q130K438j5256m479j975M114k549
4805g195j1707j4P084p566M055J0847N125j8128j505j913J1639J9683R035l016
$$ plain form
4791 16424 122 -13853 -21619 -31781 -53797 -55434 -29982 -15101 -2903 3641 -5215 -11849 -5569
4778 -5569 1705 6214 840 -2253 -903 -3116 -173 4212 18392 3654 -13864 -8735 -11763 -18074
4764 -18074 -12446 -14180 -13411 -13024 -6389 981 4047 -3138 -22632 -30704 -26496 -21189 -20401 -17212 -28263
4749 -28263 -27788 -19157 -16029 -21165 -21948 -7573 6243 7948 7008 7186 916 -1969 11067 19671 11765
4734 11765 10788 -4911 -111 -2788 1638 13634 20984 33335 22802 3551 -4930 -5300 -817 -8097
4720 -8097 -23857 -20127 2934 23668 36067 35477 36069 34936 13551 1063 -3854 -10685 -24198 -29971
4706 -29971 -32548 -18521 -1413 19553 13182 -6329 -8456 -13232 -10184 -13703 -11227 -4284 -9676 -15306
4692 -15306 -17655 -11260 -13174 -7991 -15255 -20052 -20368 -25934 -19988 -8843 -4089 4650 2247 -5864 -12534
$$ packed form
4791A6424j6302j3975p766j0162k2016j637K5452J4881J2198O544q856o634O280
4778e569P274M509n374l093J350k213K943M385J4180j4738j7518N129l028o311
4764a8074N628j734P69L87O635P370L066p185j9494q072M208N307P88L189j1051
4749b8263M75Q631L128n136p83J4375J3816J705r40J78o270k885J3036Q604p906
4734A1765r77j5699M800k677M426J1996P350J2351j0533j9251q481l70M483p280
4720h097j5760L730K3061K0734J2399n90N92j133k1385j2488m917o831j3513n773
4706b9971k577J4027J7108K0966o371j9511k127m776L048l519K476O943n392n630
4692a5306k349O395j914N183p264m797l16n566N946J1145M754Q739k403q111o670
$$ plain form
4677 -12534 -16551 -3778 4224 -1053 13816 23545 25082 22102 6095 -4150 -16498 -14630 -2139
4664 -2139 6172 -909 5318 -75 -10538 -14127 -6708 -9818 -6147 -5403 -1386 3130 11318 9569 -6188
4649 -6188 -5935 3025 638 -17788 -14715 -2335 13227 17805 4420 -12543 -6172 -10463 -7502 -18599
4635 -18599 -24058 -23302 -23250 -26048 -29045 -28061 -17943 -7131 -4728 -7958 -2177 -13630 -5331 -15840 -21494
4620 -21494 -18911 -17316 -2888 4640 5611 7238 12676 21036 17765 -4793 -14005 -20823 -15032 -1546
4606 -1546 -1066 -793 -3613 7169 20063 24400 16828 9637 9466 2778 2860 -8932 -9958 -15374 -4050
4591 -4050 1145 -3227 -15359 -4913 855 7807 15585 14221 30128 24067 -32 -7905 1146 6880
4577 6880 4161 -2491 -2926 1154 -3166 865 1671 -4954 -8120 -13014 -12321 -8912 3776 7936 9116
$$ packed form
4677a2534m017J2773Q002n277J4869R729J537k980j6007j0245j2348J868J2491
4664b139Q311p081O227n393j0463l589P419l110L671P44M017M516Q188j749j5757
4649f188K53Q960k387j8426L073J2380J5562M578j3385j6963O371m291K961j1097
4635a8599n459P56N2k798k997R84J0118J0812K403l230N781j1453Q299j0509n654
4620b1494K583J595J4428P528R71J627N438Q360l271k2558r212o818N791J3486
4606a546M80K73k820J0782J2894M337p572p191j71o688Q2j1792j026n416J1324
4591d050N195m372j2132J0446N768O952P778j364J5907o061k4099p873R051N734
4577F880k719o652m35M080m320M031Q06o625l166m894O93L409J2688M160J180
$$ plain form
4562 9116 -513 -9417 -9087 -3525 18948 27948 16113 839 -15288 -15175 -9263 -13896 -15635 845
4548 845 7412 1717 6707 12916 22776 13829 12972 -4285 -19508 -12820 -238 11484 8410 -1873
4534 -1873 -6053 -13404 -19677 -29884 -18612 -16733 -31015 -16214 -8289 6120 -2406 -4146 -78 1611
4520 1611 -6609 -12853 -17248 -4136 -1065 -14974 -13837 -8665 -8718 -1722 6070 3203 -11696 -8477 6866
4505 6866 9605 960 6837 -5908 -5266 -14681 -14477 -16801 -8969 1227 11765 20140 23289 13136
4491 13136 681 -7145 3987 -1904 -8613 -15340 -6288 -3689 -12753 -21966 -16043 -7142 5730 13553
4477 13553 17644 25844 25535 9606 420 -23504 -24962 -23672 -19665 -19795 -16966 -14934 -8407 -4595 -3860
4462 -3860 5375 11595 13660 11444 -861 1844 2157 -3950 -11580 -16755 -12782 -11698 859 5170 822
$$ packed form
4562I116r629q904L30N562K2473R000j1835j5274j6127J13N912m633j739J6480
4548H45O567n695M990O209R860q947q57j7257j5223O688J2582J1722l074j0283
4534a873m180p351o273j0207J1272J879j4282J4801P925J4409q526j740M068J689
4520A611q220o244m395J3112L071j3909J137N172n3O996P792k867j4899L219J5343
4505F866K739q645N877j2745O42r415K04k324P832J0196J0538Q375L149j0153
4491A3136j2455p826J1132n891o709o727R052K599r064r213N923Q901J2872P823
4477A3553M091Q200l09j5929r186k3924j458J290M007j30K829K032O527L812P35
4462c860R235O220K065k216j2305K705L13o107p630n175L973J084J2557M311m348
$$ plain form
4447 822 -6333 3115 8206 9653 8719 12947 1998 -3868 -149 1795 4952 9949 -4944 -1178 2072
4432 2072 14199 14749 4 963 -518 8619 14818 -2222 -2502 779 3595 6298 -458 -8500 -17935
4417 -17935 -21193 -25344 -10730 -57 14366 13497 10822 11841 3408 -7634 -14947 -28582 -24786 -15751
4403 -15751 -15579 -10786 -6026 1710 -6796 2189 8765 14936 9747 6674 -206 -693 -1086 -17188 -25969
4388 -25969 -24550 -22194 -14441 -13352 -230 4183 13505 14161 -7746 -16505 -4899 441 5315 17469
4374 17469 10448 5396 -6140 -20177 -19692 -26940 -30737 -27812 -16422 -20873 -22917 -13720 -16104 -21369
4360 -21369 -27007 -18724 -20336 -14634 -8769 -14096 -16837 -4827 1590 -5470 -11851 -4337 -2847 6847
4346 6847 6417 4632 8029 8038 439 -23064 -23041 -21060 -27928 -37019 -23197 -13210 -13248 -5540 -7718 -10046
$$ packed form
4447H22p155R448N091J447r34M228j0949n866L719J944L157M997j4893L766L250
4432B072J2127N50j4745R59j481R137O199j7040k80L281K816K703o756q042r435
4417a7935l258m151J4614J0673J4423q69k675J019q433j1042p313j3635L796R035
4403a5751J72M793M760P736q506Q985O576O171n189l073o880m87l93j6102q781
4388b5969J419K356P753J089J3122M413R322O56k1907q759J1606N340M874J2154
4374A7469p021n052j1536j4037M85p248l797K925J1390m451k044R197k384n265
4360b1369n638Q283j612N702N865n327k741J2010O417p060o381P514J490R694
4346F847m30j785L397Rp599k3503K3J981o868r091J3822R987l8P708k178k328
$$ plain form
4330 -10046 -10043 -9105 -2088 -3097 -8825 -7197 -14134 -3913 10502 -2117 -98 -4882 -9679 -15651 -9819
4315 -9819 -2519 11048 -30 -16181 -2595 7122 5576 13005 19339 12107 4882 -6908 -18765
4302 -18765 -13099 -1796 -1234 -1296 10988 26059 33365 29388 -39 -14819 -22469 -26649 -21574 -16037
4288 -16037 -14271 -11014 -8490 -3666 -9479 -10326 -2251 -1997 -13821 -4782 -850 5792 1210 -5004 -75
4273 -75 13113 3733 -4158 -7297 -1455 -4639 -2408 2782 1488 -3316 -6300 -12984 -3805 5878 1685
4258 1685 1780 5093 4130 503 -11135 -4772 8041 -8690 -23895 -25936 -9788 10376 15559 11313
4244 11313 14478 16452 9121 3098 9672 -961 -5863 4259 -1626 -6216 -10669 -16112 -16627 -9725
4230 -9725 -12727 -15198 255 6578 -749 -11967 -16461 -16957 -26933 -28142 -23111 -16011 -14347 -17405 -23811
$$ packed form
4330a0046LR38P017j009n728J628o937J0221J4415j2619K019m784m797n972N832
4315i819P300J3567j1078j6151J3586R717j546P429O334p232p225j1790j1857
4302a8765N666J1303N62o2J2284J5071P306l977k9427j4780p650m180N075N537
4288a6037J766L257K524M824n813q47Q075K54j1824R039L932O642m582o214M929
4273g5J3188r380p891l139N842l184K231N190j294m804k984o684R179R683m193
4258A685R5L313r63l627j1638O363J2813j6731j5205k041J6148K0164N183m246
4244A1313L165J974p331o023O574j0633m902J0122n885m590m453n443n15O902
4230i725l002k471J5453O323p327j1218m494m96r976j209N031P100J664l058o406
$$ plain form
4215 -23811 -27934 -14695 8335 17745 8604 744 2936 -2717 -13486 -10189 -10043 6442 15165 7011
4201 7011 9562 1514 6621 -4600 -10275 -8020 -6066 -3343 969 1593 1106 -17141 -20841 -11863 -14932
4186 -14932 -13099 -10302 -14113 -7128 8050 14017 -9668 -14061 1578 8240 11679 11627 7087 -6203
4172 -6203 -10086 2215 4421 -7740 7731 9743 10049 5875 11679 23451 34405 32771 24734 19993
4158 19993 10199 -7351 -25520 -14934 -14332 -9478 20501 29509 -6015 -21284 -16987 -4090 978
4145 978 1190 -5326 -9833 -16092 -7753 -8785 3129 14614 21895 21852 24826 24301 15188 9862 -3016
4130 -3016 -16442 -12535 -9196 -15521 -21196 -19414 -26273 -37887 -30619 -25114 -29477 -19406 -12219 -6326
4116 -6326 -2812 4014 409 6886 12466 6862 1647 -7786 -20371 -33565 -24433 -2972 -642 -839
$$ packed form
4215b3811m123J3239K3030R410r141p860K192n653j0769L297J46J6485Q723q154
4201G011K551q048N107j1221n675K255J954K723M312O24m87j8247l700Q978l069
4186a4932J833K797l811O985J5178N967k3685m393J5639O662L439n2m540j3290
4172f203l883J2301K206j2161J5471K012L06m174N804J1772J0954j634q037m741
4158A9993r794j7550j8169J0586O02M854K9979R008l5524j5269M297J2897N068
4145I78K12o516m507o259Q339j032J1914J1485P281m3K974n25r113n326j2878
4130c016j3426L907L339o325n675J782o859j1614P268N505m363J0071P187N893
4116f326L514O826l605O477N580n604n215r433j2585j3194R132K1461K330j97
$$ plain form
4102 -839 -7696 -13346 -1858 -11954 -6362 -11669 -21759 -22367 -19251 -8726 6132 -1433 12186 8238
4088 8238 5390 9352 16565 12029 -769 -696 3952 15161 11785 7876 -8842 -3284 -3944 906 -1699
4073 -1699 -13638 -5705 5565 1370 -12584 -11229 -10740 -1339 9891 -11 -12324 -10364 -13603 -6883
4059 -6883 -7603 -16 -2833 -1015 15517 5096 -6005 -13671 -21530 -15174 -2058 3537 4198 -10256
4045 -10256 -22357 -32503 -30265 -37260 -40777 -35256 -9203 844 9707 4758 -319 -10103 -7355 -2678
4031 -2678 -4398 7809 6659 -14121 -18793 -16141 684 12710 12540 20050 8030 -3680 -3400 -9714
4017 -9714 -23361 -19816 -29252 -40832 -30114 -19209 -5149 8058 12185 24251 12049 317 -1288
4004 -1288 -13302 -16764 -20077 -22808 -17891 -9820 412 3166 4288 3092 -8730 -5817 -3708 3055
$$ packed form
4102h39o857n650J1488j0096N592n307j0090o08L116J0525J4858p565J3619l948
4088H238k848L962P213m536j2798P3M648J1209l376l909j6718N558o60M850k605
4073a699j1939P933J1270m195j3954J355M89R401J1230r902j2313J960l239O720
4059f883p20P587k817J818J6532j0421j1101p666p859O356J3116N595O61j4454
4045a0256j2101j0146K238o995l517N521K6053J0047Q863m949n077r784K748M677
4031b678j720J2207j150k0780m672K652J6825J2026j70P510j2020j1710K80o314
4017i714j3647L545r436j1580J0718J0905J4060J3207M127J2066j2202j1732j605
4004a288j2014l462l313k731M917Q071J0232K754J122j196j1822K913K109O763
$$ plain form
3990 3055 22554 24865 1634 -14533 -12550 -13840 2007 23303 22652 6511 -5156 -4641 -1270 -10639
3976 -10639 -6178 -1957 -9757 -19765 -17128 -19101 -25919 -19366 507 8240 7443 15651 16371 14196 2029
3961 2029 -5844 -9069 -6546 -10249 -16217 -30141 -25552 -14664 -21572 -23315 -17328 -2229 8490 3862
3947 3862 -5826 -8663 -2131 -7498 -20021 -18773 4636 9468 8832 10105 15928 21784 16270 785
3933 785 -14878 -9268 -8554 4648 13631 16400 19960 16159 -7067 -10493 8037 6280 1846 14511
3919 14511 21097 4600 8139 14125 8368 4252 -5353 -6299 -7240 -12355 -18739 -17215 -7490 -1275 -11976
3904 -11976 -11886 -1573 -926 -3042 -10508 -23143 -29968 -20759 -1170 7214 -8960 -8135 -10827 -8094 -4138
3889 -4138 -1748 5686 6833 7287 7465 5309 3962 -3000 -2250 7952 3189 -10920 -10444 -4784 -5954
$$ packed form
3990C055J9499K311k3231j6167J983j290J5847K1296o51j6141j1667N15L371r369
3976a0639M461M221p800j0008K637j973o818O553J9873P733p97Q208P20k175j2167
3961B029p873l225K523l703n968j3924M589J0888o908j743N987J5099J0719m628
3947C862r688k837O532n367j2523J248K3409M832o36J273N823N856n514j5485
3933G85j5663N610P14J3202Q983K769L560l801k3226l426J8530j757m434J2665
3919A4511O586j6497L539N986n757m116r605r46r41n115o384J524R725O215j0701
3904a1976R0J0313O47k116p466j2635o825R209J9589Q384j6174Q25k692K733L956
3889d138K390P434J147M54J78k156j347o962P50J0202m763j4109M76N660j170
$$ plain form
3874 -5954 -4255 -13436 -12947 -470 108 5637 257 -19529 -7801 4409 -3606 -5186 934 2400
3860 2400 -5870 -4013 857 -3238 -1385 -4659 5073 9454 6048 720 -11117 -10142 -11457 -15981 -22636
3845 -22636 -11361 4742 15266 20601 3067 -6836 -24793 -33372 -23350 -11233 -4182 1043 -5432
3832 -5432 -5670 3927 7491 12200 19702 19023 6451 -9446 -6692 5747 9023 -13202 -15071 -10564
3818 -10564 5904 3140 -1632 -9868 -15344 -907 -9064 -9583 -8136 -8287 6872 7054 1799 -2959 -7335
3803 -7335 -965 -810 -7491 -4163 -5149 -9108 -3934 -4842 -5879 -12278 -7326 -21780 -19268 -20268 -5823
3788 -5823 -1478 -4612 -4345 -5713 -14309 -7959 -428 5265 4557 -18530 -8792 401 -12107 -6005 4884
3773 4884 16282 22790 15283 4255 8757 19165 6772 -14677 -8405 886 -7179 -20501 -10561
$$ packed form
3874e954J699r181M89J2477N78N529n380j9786J1728J2210q015j580O120J466
3860B400q270J857M870m095J853l274R732M381l406n328j1837R75j315m524o655
3845b2636J1275J6103J0524N335j7534r903j7957q579J0022J2117P051N225o475
3832e432k38R597L564M709P502o79j2572j5897K754J2439L276k2225j869M507
3818a0564J6468k764m772q236n476J4437q157n19J447j51J5159J82n255m758m376
3803g335O370J55o681L328r86l959N174r08j037o399M952j4454K512j000J4445
3788e823M345l134K67j368q596O350P531N693p08k3087R738R193j2508O102J0889
3773D884J1398O508p507j1028M502J0408j2393k1449O272R291q065j3322R940
$$ plain form
3760 -10561 -10044 -7470 -4226 -17413 -17905 -20332 -15757 -14271 -21088 -17475 -17065 -3652 10725 10874 1221
3745 1221 8125 11374 8679 6866 5679 7560 -4203 -11530 -14345 -16544 -20192 -12984 -1591 997
3731 997 10235 1864 -4478 -21662 -27749 -16384 -10851 -2959 -11260 -15423 -15817 4566 15522 15983 3273
3716 3273 -14264 -13475 -7273 -7742 -11610 -3737 -3300 -7818 -2091 60 6653 1876 -814 -8553 -15299
3701 -15299 -18283 -21191 -21277 -6153 4176 10057 12735 -5093 -3156 6948 3202 -4313 8696 2893
3687 2893 -19524 -27207 -17822 -22641 -29727 -24647 -11629 4765 10165 18182 21456 26403 27268 26052
3673 26052 26981 12498 -9361 -3540 4177 -1704 -7619 -16103 -31271 -33553 -30508 -28276 -22815 -4467
3659 -4467 4153 6460 -2108 -11895 -9284 -10382 -13901 -11173 729 3366 3688 -2381 -7709 -8659 -4544
$$ packed form
3760a0561N17K574L244j3187m92k427M575J486o817L613M10J3413J4377J49r653
3745A221O904L249k695j813j187J881j1763p327k815k199l648P208J1393K588
3731I97R238q371o342j7184o087J1365N533P892q301m163l94K0383J0956M61j2710
3716C273j7537P89O202m69l868P873M37m518N727K151O593m777k690p739o746
3701a5299k984k908q6J5124J0329N881K678j7828J937J0104l746p515J3009n803
3687B893k2417p683R385m819p086N080J3018J6394N400Q017L274M947Q65j216
3673B6052R29j4483k1859N821P717n881n915q484j5168k282L045K232N461J8348
3659d467Q620K307q568r787K611j098l519K728J1902K637L22o069n328r50M115
$$ plain form
3644 -4544 -23184 -23344 -3122 -68 -1368 298 -15394 -29916 -20642 -7983 1991 2609 9466 12124
3630 12124 6801 4144 1481 660 5941 7550 7313 6249 -3663 -8540 -3326 6708 18034 19197 17192
3615 17192 7415 -8164 -6954 -10592 -14525 -11499 -2217 -6424 -8442 -4624 15187 11438 2221 -10961
3601 -10961 -4301 -5291 -13942 -25306 -31160 -35435 -43946 -47074 -34324 -32036 -24953 -13346 -14436 -16760
3587 -16760 -21691 -25312 -6779 -3328 2009 4416 1448 -3954 11249 15855 765 -19257 -23029 -21147
3573 -21147 -17359 -17448 -12148 -13550 -17083 -12761 -9609 -9529 -11738 -8551 -25744 -28962 -9022 2314 -1206
3558 -1206 -12955 -12650 918 7817 1074 -872 -7052 -14084 -499 1461 -3744 1010 -2878 -12102
3544 -12102 -21971 -17556 -8762 -49 -10257 -14785 -16653 -8095 -12296 -4662 4588 -8786 -12871 -6166
$$ packed form
3644d544j8640j60K0222L054j300J666j5692j4522R274J2659R974O18O857K658
3630A2124n323k657k663q21N281J609k37j064r912m877N214J0034J1326J163k005
3615A7192r777j5579J210l638l933L026R282m207k018L818J9811l749r217j3182
3601a0961O660r90q651j1364n854m275q511l128J2750K288P083J1607j090k324
3587a6760m931l621J8533L451N337K407k968n402J5203M606j5090k0022l772J882
3573b1147L788q9N300j402l533M322L152Q0k209L187j7193l218J9940J1336l520
3558a206j1749L05J3568O899o743j946o180p032J3585J960n205M754l888r224
3544a2102r869M415Q794Q713j0208m528j868Q558m201P634R250j3374m085O705
$$ plain form
3530 -6166 -1936 2341 16670 11725 6999 12397 7158 -5006 -23163 -31240 -23344 -9642 818 -4520
3516 -4520 -5973 1340 -437 1900 7503 -9390 -8105 3044 11800 17614 23237 23875 23114 12473 12385
3501 12385 8706 -6032 4748 11373 3545 373 -932 -5708 10964 -1261 -14265 -1647 9509
3488 9509 16477 12037 69 -5719 -456 -7879 -21022 -26825 -28699 -24295 -20446 -15451 -12602 -6624
3474 -6624 757 -2232 239 1912 -9579 -15900 -19878 -19088 -19554 -18766 -12724 -5414 -7530 15759 24491
3459 24491 18997 9299 2606 -8969 -8324 689 236 -1796 -15982 -24965 -24835 -22769 -17062 -8482 -14787
3444 -14787 -17994 -1533 9363 -9102 -6201 11950 14306 20753 -1068 -22099 -31823 -24858 -15894
3431 -15894 -11472 -13378 -31329 -35566 -10649 -23081 -34449 -25541 -10150 -13543 -34753 -27014 -22445
$$ packed form
3530f166M230M277J4329m945m726N398n239j2164j8157q077P896J3702J0460n338
3516d520j453P313j777K337N603j6893J285J1149Q756N814N623O38p61j0641q8
3501A2385l679j4738J0780O625p828l172j305m776J6672j2225j3004J2618J1156
3488I509O968m440j1968n788N263p423j3143n803j874M404L849M995K849N978
3474f624P381k989K471J673j1491o321l978P90m66P88O042P310k116K3289Q732
3459B4491n494r698o693j1575O45R013m53k032j4186q983J30K066N707Q580o305
3444a4787l207J6461J0896j8465K901J8151K356O447k1821k1031r724O965Q964
3431a5894M422j906j7951m237K4917j2432j1368Q908J5391l393k1210P739M569
$$ plain form
3418 -22445 -11026 -13479 -15982 -16174 -13291 -13378 -19309 -14480 -5162 3242 -2848 1179 3757 7905 8122
3403 8122 5069 15932 25367 22214 16049 22386 15804 1894 -9020 -6018 -578 -4641 -7818 -21383
3389 -21383 -11709 403 -3415 -9901 -15465 -29017 -16497 -6352 -1485 385 -7220 -4590 -12037 -23151
3375 -23151 -9086 3102 9332 -961 -11488 -13605 -4808 -2162 -1637 4852 7285 6832 1475 625
3361 625 9427 -1695 -21320 -20412 -19998 -18346 -10391 -8402 -17003 -14011 -10192 -7380 -5751 -14424 -14567
3346 -14567 -6302 -16273 -35652 -41668 -41228 -30665 -12538 -5818 9804 5648 4092 -786 -8633 -3018
3332 -3018 1474 -7796 -9933 -5784 3248 6884 9964 -749 -11615 -14556 -7519 -9291 -6451 -2467
3318 -2467 3209 1867 -13473 -11786 -6547 -953 -9261 -14851 -16478 -8829 11459 28182 31186 14465
$$ packed form
3418b2445J1419k453k503j92K883q7n931M829R318Q404o090M027K578M148K17
3403H122l053J0863R435l153o165O337o582j3910j0914L002N440m063l177j3565
3389b1383R674J2112l818o486n564j3552J2520J0145M867J870p605K630p447j1114
3375b3151J4065J2188O230j0293j0527k117Q797K646N25O489K433m53n357q50
3361F25Q802j1122j9625R08M14J652P955J989q601K992L819K812J629q673j43
3346a4567Q265r971j9379o016M40J0563J8127O720J5622m156j556m878p847N615
3332c018M492r270k137M149R032L636L080j0713j0866k941P037j772K840L984
3318b467N676j342j5340J687N239N594q308n590j627P649K0288J6723L004j6721
$$ plain form
3304 14465 5574 2757 -2592 -15265 -19848 -28321 -29893 -42287 -41463 -33975 -29322 -19168 -11369 -17307
3290 -17307 -20935 -14322 2346 7331 1434 2646 2365 10293 19635 15496 6749 8347 6227 14207 28423
3275 28423 35432 34602 31673 18755 5314 -1239 394 -1571 7843 6026 4074 13920 1022 1329
3261 1329 -9953 -15616 -11970 -17883 -10072 -2508 3372 5802 1606 -4536 -2588 3083 -3419 -10046 -9681
3246 -9681 -14162 -28980 -37381 -34603 -26338 -27102 -21785 -24690 -13609 -6852 -13716 -11633 -29881 -35844
3232 -35844 -20314 -19072 -19883 -18957 -27334 -46370 -32306 -17527 -10248 -5307 3931 -631 256 -63 -2535
3217 -2535 -10491 -14161 -9082 2929 3091 -9426 -18101 -13786 -4097 -8716 -15129 -5369 11674 17499
3203 17499 10185 2690 375 5663 7251 3180 -8014 -16931 -8970 -4272 -13966 -20376 -24573 -20472
$$ packed form
3304A4465q891k817n349j2673m583q473j572j2394Q24P488M653J0154P799n938
3290a7307l628O613J6668M985n897J212k81P928R342m139q747J598k120P980J4216
3275B8423P009q30k929j2918j3441o553J633j965R414j817j952R846j2898L07
3261A329j1282n663L646n913P811P564N880K430m196o142J948N671o502o627L65
3246i681m481j4818q401K778Q265p64N317k905J1081O757o864K083j8248n963
3232c5844J5530J242q11R26q377j9036J4064J4779P279M941R238m562Q87l19k472
3217b535p956l670N079J2011J62j2517q675M315R689m619o413R760J7043N825
3203A7499p314p495k315N288J588m071j1194q917P961M698r694o410m197M101
$$ plain form
3189 -20472 -5968 -1933 -7117 -7502 -8892 980 335 -5191 -5434 -11727 1907 5805 -4442 -6137 -4237
3174 -4237 -11437 -10211 4168 -689 -2258 9036 18 -1981 3682 -14847 -33303 -25298 -17398 -18785
3160 -18785 -16033 -14736 -8578 5948 2471 -18018 -19483 -10568 -8771 -5927 -23337 -24067 -6493 -2267
3146 -2267 -8544 -1470 1012 -11934 -8819 -3510 14154 17167 11824 16504 12742 15750 12436 -39
3132 -39 -5398 -5256 -7400 -15204 -16482 1531 -395 -2874 565 7184 11637 22580 18198 14702 16219
3117 16219 12240 16098 12971 14079 4331 -2865 -11112 -11674 -19484 -14643 -7285 3367 16671 18064
3103 18064 5188 -8373 1422 18926 30828 36601 30899 13311 3650 4572 9336 6305 -1094 -2566
3089 -2566 6695 824 -7914 7413 1969 -5587 5209 10068 12035 9558 -6485 -10675 -9814 -2574
$$ packed form
3189b0472J4504M035n184l85j390R872o45n526k43o293J3634L898j0247j695J900
3174d237p200J226J4379m857j569J1294r018j999N663j8529j8456Q005P900j387
3160a8785K752J297O158J4526l477k0489j465Q915J797K844j7410p30J7574M226
3146b267o277P074K482j2946L115N309J7664L013n343M680l762L008l314j2475
3132c9n359J42k144p804j278J8013j926k479L439O619M453J0943m382l496J517
3117A6219l979L858l127J108r748p196q247n62p810M841P358J0652J3304J393
3103A8064j2876j3561R795J7504J1902N773n702j7588r661R22M764l031p399j472
3089b566R261n871q738J5327n444p556J0796M859J967k477j6043m190Q61P240
$$ plain form
3075 -2574 6142 11335 7391 -8960 -2924 2331 -3278 2355 6385 2087 1051 5844 4844 7873 237
3060 237 -8615 -9352 -3454 2574 5962 11312 1907 4759 -439 -6510 -2319 966 8622 2776 3015 2176
3044 2176 -10340 -3705 6290 -3036 -18622 -21303 -9092 4792 15189 7471 2498 9889 11619 6068
3030 6068 24104 36477 23493 17405 8092 -2824 2304 -1620 -13192 -22936 -20119 -5254 -1327
3017 -1327 5897 -3476 -12887 956 27820 27409 14100 1465 -1405 -5450 -7549 -8785 -17320 -1841
3003 -1841 10160 -11287 -21828 -13405 -3118 8218 2123 -15137 -7442 5863 2032 6236 8467
2990 8467 13045 20317 22005 22136 19778 6082 8115 8871 16301 16585 11453 2634 3909 16811 17670
2975 17670 1667 -15846 -27503 -23012 -7641 -4605 2232 16012 4273 -5371 -13988 6356 29309
$$ packed form
3075b574Q716N193l944j6351O036N255n609N633M030m298j036M793j000L029p636
3060B37q852p37N898O028L388N350r405K852n198o071M191L285P656n846K39q39
3044B176j2516O635R995r326j5586k681J2211J3884J0397p718m973P391J730n551
3030F068J8036J2373j2984o088r313j0916N128l924j1572r744K817J4865L927
3017a327P224r373r411J3843K6864m11j3309j2635k870m045k099j236q535J5479
3003a841J2001k1447j0541Q423J0287J1336o095j7260P695J3305l831M204K231
2990H467M578P272J688J31k358j3696K033P56P430K84n132q819J275J2902Q59
2975A7670j6003j7513j1657M491J5371L036O837J3780j1739r644q617K0344K2953
$$ plain form
2962 29309 29576 21802 8940 2672 14 2599 -10544 -25372 -27725 -19585 -14673 -7148 6556 8551
2948 8551 2285 5833 4649 -4010 -3180 2269 2815 4009 -3467 -10958 -6906 9866 13506 24807 32873
2933 32873 26637 3356 -8261 -13192 -8099 -15886 -21160 -16834 -13922 -14497 2819 8511 6320 10173
2919 10173 2175 -106 9450 11062 4871 15564 16400 17654 18989 16499 9016 1047 13251 12875 6296
2904 6296 5980 6302 -1850 -10319 -6264 -9423 -7532 -2581 -13707 -3107 5740 6426 -8747 -10781 -13678
2889 -13678 -22249 -18074 -15919 -5445 -7308 -12542 -9649 -13901 -5980 4433 4597 -3499 -3747 1919 7880
2874 7880 5235 6527 -2435 -1629 -593 1082 2862 -3465 -6280 -4379 -2504 -3471 -9028 -9473 -2348 4340
2858 4340 -6353 -8302 -10650 -11864 -15804 -15060 -21974 -24524 -31236 -21697 -5525 -6940 -376 7014 -3897
$$ packed form
2962B9309K67p774j2862o268k658K585j3143j4828k353Q140M912P525J3704J995
2948H551o266L548j184q659Q30N449N46J194p476p491M052J6772L640J1301Q066
2933C2873o236k3281j1617m931N093p787n274M326K912n75J7316N692k191L853
2919A0173p998k281R556J612o191J0693Q36J254J335k490p483p969J2204l76o579
2904F296l16L22q152q469M055l159J891M951j1126J0600Q847O86j5173k034k897
2889a3678q571M175K155J0474j863n234K893m252P921J0413J64q096k48N666N961
2874G880k645J292q962Q06J036J675J780o327k815J901J875r67n557m45P125O688
2858D340j0693j949k348j214l940P44o914k550o712R539J6172j415O564P390j0911
$$ plain form
2843 -3897 -17453 -8072 3610 556 6305 5543 6592 8328 -2724 -13534 -9945 -15635 -15258 8013
2829 8013 5523 6263 16406 9835 2818 816 -26 3914 8734 21178 23708 13755 10585 6706 1157
2814 1157 -10190 -23879 -22806 -20870 -18045 -10272 -1940 -4639 -2578 3358 10799 13094 5504 -11077
2800 -11077 -12635 -7949 3402 6057 6524 -4865 1314 16574 9020 6123 15425 14723 18798 23010
2786 23010 21839 14338 14145 8827 4024 1716 1721 1774 10303 23409 28413 12588 -4113 -3855 5259 12024
2770 12024 17311 14397 2729 -1556 -1110 12507 23343 23837 22954 25794 24037 22094 2517 -14927
2756 -14927 -17358 -8519 -2804 6478 2579 5642 2537 636 -3645 -7293 9945 9714 733 4945 4048
2741 4048 -3982 -2086 1668 7058 1294 1098 6058 -3014 -10630 -9167 3177 -858 -5743 -10317 -4539
$$ packed form
2843c897j3556R381J1682l054N749p62J049J736j1052j0810L589n690L77K3271
2829H013k490P40J0143o571p017k002q42L940M820J2444K530r953l170l879n549
2814A157j1347j3689J073J936K825P773Q332k699K061N936P441K295p590j6581
2800a1077j558M686J1351K655M67j1389O179J5260p554k897R302p02M075M212
2786B3010j171p501j93n318m803k308NN3Q529J3106N004j5825j6701K58R114O765
2770A2024N287k914j1668m285M46J3617J0836M94q83K840j757j943j9577j7444
2756a4927k431Q839N715R282l899L063l105j901m281l648J7238k31q981M212q97
2741D048q030J896L754N390n764j96M960r072p616J463J2344m035m885m574N778
$$ plain form
2726 -4539 -2122 2705 10744 9748 1925 1980 3189 13716 17847 14685 11691 7969 -4731 -2285 -3951
2711 -3951 -11244 -11462 -9417 -2448 765 8607 17165 13358 -13329 -13491 -4554 2027 -1394 -9191 -13004
2696 -13004 -11253 -9291 2631 10600 9254 -4293 -18394 -4004 7181 10958 254 -5648 771
2683 771 -13906 -14525 -15934 -20770 -1360 7274 -1338 -687 -12122 -4580 5665 7688 2941 12942
2669 12942 13569 4689 -5040 -6167 -13869 -11687 -8714 -13383 -16781 -15125 -26564 -19276 -10367 -18579 -20516
2654 -20516 -11701 -12139 -18566 -25887 -28308 -18469 -5431 -6510 -2004 4015 12166 16523 7399 7738 11882
2639 11882 8833 2815 -2278 1106 11295 11261 14086 8939 12064 -13001 -18107 2709 26449 23779
2625 23779 15721 2819 1787 -2116 1047 9900 -3480 -10146 -455 10522 5697 17936 17960 8796
$$ packed form
2726d539K417M827Q039r96p823N5J209J0527M131l162k994l722j2700K446j666
2711c951p293k18K045O969L213P842Q558l807k6687j62Q937O581l421p797l813
2696a3004J751J962J1922P969j346j3547j4101J4390J1185L777j0704n902O419
2683G71j4677o19j409m836J9410Q634q612O51j1435P542J0245K023m747J0001
2669A2942O27q880r729j127p702K182K973m669l398J656j1439P288Q909q212j937
2654b0516Q815m38o427p321k421R839J3038j079M506O019Q151M357r124L39M144
2639A1882l049o018n093L384J0189l4K825n147L125k5065n106K0816K3740k670
2625B3779q058j2902j032l903L163Q853j3380o666R691J0977m825J2239K4r164
$$ plain form
2611 8796 -443 -2876 -3783 -5496 -12926 -5437 8528 11570 10534 16026 3365 -1657 -1157 -8954 -4686
2596 -4686 -8998 2559 -3305 -2129 4777 6595 665 -4911 -3905 10335 10333 11812 13755 16537 19604
2581 19604 20797 18508 5588 -1723 -4446 -728 10569 7720 -6688 -7053 5563 8681 11608 -3804
2567 -3804 -6362 -9354 -13560 -18094 -28442 -31267 -31443 -35875 -21265 -10207 -13818 -21564 -14932 9272
2553 9272 28017 23226 13479 1305 10505 17747 11725 -7070 -20825 -10030 -101 -5267 -10980 -10140
2539 -10140 -16081 -854 10486 14872 21960 17176 11096 4035 -305 2502 -403 -6200 6228 12191
2525 12191 9229 3424 -8631 -9037 -7364 -10604 -5637 12106 28256 15480 17279 19429 12525 9882
2511 9882 14153 14031 19941 20644 22108 646 -9219 -13643 -8342 14560 16379 13168 12571 1923 -3609
$$ packed form
2611H796r239k433r07j713p430P489J3965L042j036N492j2661n022N00p797M268
2596d686m312J1557n864J176O906J818n930n576J006J4240kJ479J943K782L067
2581A9604J193k289j2920p311k723L718J1297k849j4408l65J2616L118K927j5412
2567c804k558k992m206m534j0348k825j76m432J4610J1058l611p746O632K4204
2553I272J8745m791r747j2174R200P242o022j8795j3755J0795R929n166n713Q40
2539a0140n941J5227J1340M386P088m784o080p061m340K807k905n797J2428N963
2525A2191k962n805j2055m06J673l240M967J7743J6150j2776J799K150o904k643
2511I882M271j22N910P03J464k1462r865m424N301K2902J819l211n97j0648n532
$$ plain form
2496 -3609 -5510 3926 -5991 -5424 -3168 -3526 4679 7884 9305 -702 -3428 -6348 -1256 11155 5246
2481 5246 -10793 -14829 -20150 -19767 -16383 -9877 -11795 -3117 -2183 -17449 -22376 -10516 -5794 -636 -6396
2466 -6396 -2829 -3115 -8215 -1517 -7100 -7646 -5922 -11970 -9927 555 14982 12024 3880 -4522 -7953
2451 -7953 -13529 -10972 -13144 -11699 -17219 -27105 -26686 -13220 -430 4405 2523 558 -15446 -15683 5172
2436 5172 9251 19167 17705 11115 9326 7479 -8492 -9753 -19226 -9952 4165 8745 9144 4363 -7391
2421 -7391 -2399 27775 37889 33146 25751 15527 5164 -11798 -14136 -6952 7252 19147 32572
2408 32572 27980 18126 9904 7912 10735 9732 6056 -6794 3864 24109 12371 3880 13269 -5833
$$ packed form
2496c609j901R436r917N67K256l58Q205L205J421j0007k726k920N092J2411n909
2481E246j6039m036n321L83L384O506j918Q678R34j5266m927J1860M722N158n760
2466f396L567k86n100O698n583n46J724o048K043J0482J4427k958q144q402l431
2451g953n576K557k172J445n520r886M19J3466J2790M835j882j965j6004k37K0855
2436E172M079R916j462o590j789j847j5971j261r473R274J4117M580L99m781j1754
2421g391M992L0174J0114m743p395j0224j0363j6962k338P184J4204J1895J3425
2408C2572m592r854q222j992K823j003l676j2850J0658K0245j1738q491R389j9102
$$ [...]
##END NTUPLES=NMR SPECTRUM
##END=
