##TITLE=Analysis number 324420
Compound Code btb 02933
Book Reference 270963
Project Code adrs
Chemist Name shaunh
##JCAMPDX= 6.0         $$ Bruker NMR JCAMP-DX V2.0
##DATA TYPE= NMR SPECTRUM
##DATA CLASS= NTUPLES
##ORIGIN= Bruker BioSpin GmbH
##OWNER= nmr
$$ XWIN-NMR		Version 3.5
$$ Wed Nov 22 10:20:18 2006 GMT Standard Time (UT+0h)  MAYBRIDGE\nmr@NMR_250MHZ
##.OBSERVE FREQUENCY= 250.131544655141
##.OBSERVE NUCLEUS= ^1H
##.ACQUISITION MODE= SIMULTANEOUS (DQD)
##.ACQUISITION SCHEME= undefined
##.AVERAGES= 16
##.DIGITISER RES= 18
##SPECTROMETER/DATA SYSTEM= dpx250
##.PULSE SEQUENCE= zg30
##.SOLVENT NAME= CDCl3
##.SHIFT REFERENCE= (INTERNAL, CDCl3, 0, 16.522)
##AUDIT TRAIL= $$ (NUMBER, WHEN, WHO, WHERE, WHAT)
$$ ##TITLE= Audit trail, XWIN-NMR		Version 3.5
$$ ##JCAMPDX= 5.01
$$ ##ORIGIN= Bruker BioSpin GmbH
$$ ##OWNER= nmr
$$ C:\u/data/dgb/nmr/ADRS/790/pdata/1/auditp.txt
$$ ##AUDIT TRAIL=  $$ (NUMBER, WHEN, WHO, WHERE, WHAT)
(   1,<2006-11-22 10:19:46.35 +000>,<MAYBRIDGE\nmr>,<NMR_250MHZ>,
      <created by zg, POWCHK disabled, PULCHK disabled
       configuration hash MD5:
       49 4B E0 1D 92 C2 6B 37 9F E6 65 BC 52 41 86 1D
       data hash MD5: 64K
       36 66 96 3D 49 5D 46 67 D7 B3 36 C3 62 5D FE 9A>)
(   2,<2006-11-22 10:20:05.03 +000>,<MAYBRIDGE\nmr>,<NMR_250MHZ>,
      <Start of raw data processing
       ef LB = 0.3 FT_mod = 6 PKNL = 1 SI = 32K 
       data hash MD5: 32K
       79 3F 40 ED 3F 6D FC 45 32 DE A4 76 A7 0D 2B 72>)
(   3,<2006-11-22 10:20:06.85 +000>,<MAYBRIDGE\nmr>,<NMR_250MHZ>,
      <apk 
       data hash MD5: 32K
       76 95 56 6C 88 6B D9 85 E9 C2 4E EE 2B 88 67 73>)
(   4,<2006-11-22 10:20:07.58 +000>,<MAYBRIDGE\nmr>,<NMR_250MHZ>,
      <abs ABSG = 5 
       data hash MD5: 32K
       EE C2 E7 D1 37 07 E5 8B AD 10 85 0E 38 60 5F FC>)
$$ ##END=
$$ 
$$ hash MD5
$$ 9C AA FB 60 CE 99 9F 35 60 7C E2 CF 33 46 4B D4
##$RELAX= 
##$RELAX= 
##$RELAX= 
##$RELAX= 
##$RELAX= 
##$RELAX= 
##$RELAX= 
$$ Bruker specific parameters
$$ --------------------------
##$DU= <C:\u>
##$EXPNO= 790
##$NAME= <ADRS>
##$PROCNO= 1
##$TYPE= <nmr>
##$USER= <dgb>
##$AMP= (0..31)
100 100 100 100 100 100 100 100 100 100 100 100 100 100 100 100 100 100 
100 100 100 100 100 100 100 100 100 100 100 100 100 100 
##$AQSEQ= 0
##$AQ_mod= 3
##$AUNM= <au_zg>
##$AUTOPOS= <33 >
##$BF1= 250.13
##$BF2= 250.13
##$BF3= 250.13
##$BF4= 250.13
##$BF5= 500.13
##$BF6= 500.13
##$BF7= 500.13
##$BF8= 500.13
##$BYTORDA= 1
##$CFDGTYP= 0
##$CFRGTYP= 5
##$CHEMSTR= <none>
##$CNST= (0..31)
1 1 145 1 1 1 1 1 1 1 1 1 1 1 1 1 1 1 1 1 1 1 1 1 1 1 1 1 1 1 1 1 
##$CPDPRG= <>
##$CPDPRG1= <>
##$CPDPRG2= <>
##$CPDPRG3= <>
##$CPDPRG4= <mlev>
##$CPDPRG5= <mlev>
##$CPDPRG6= <mlev>
##$CPDPRG7= <mlev>
##$CPDPRG8= <mlev>
##$CPDPRGB= <>
##$CPDPRGT= <>
##$D= (0..31)
0 1 0 0 0 0 0 0 0 0.06 0 0 0 0 0 0 0.0002 0 0 0 0 0 0 0 0 0 0 0 0 0 0 
0 
##$DATE= 1164190784
##$DBL= (0..7)
120 120 120 120 120 120 120 120 
##$DBP= (0..7)
150 150 150 150 150 150 150 150 
##$DBP07= 0
##$DBPNAM0= <>
##$DBPNAM1= <>
$$ [...]
##$SUBNAM7= <"">
##$SUBNAM8= <"">
##$SUBNAM9= <"">
##$SW= 20.6930455092707
##$SWIBOX= (0..15)
0 0 3 0 0 0 0 0 0 0 0 0 0 0 0 0 
##$SW_h= 5175.983436853
##$TD= 65536
##$TD0= 1
##$TE= 683.16
##$TE2= 300
##$TE3= 300
##$TEG= 300
##$TL= (0..7)
0 120 120 120 120 120 120 120 
##$TP= (0..7)
150 150 150 150 150 150 150 150 
##$TP07= 0
##$TPNAME0= <>
##$TPNAME1= <>
##$TPNAME2= <>
##$TPNAME3= <>
##$TPNAME4= <>
##$TPNAME5= <>
##$TPNAME6= <>
##$TPNAME7= <>
##$TPOAL= (0..7)
0.5 0.5 0.5 0.5 0.5 0.5 0.5 0.5 
##$TPOFFS= (0..7)
0 0 0 0 0 0 0 0 
##$TUNHIN= 0
##$TUNHOUT= 0
##$TUNXOUT= 0
##$USERA1= <user>
##$USERA2= <user>
##$USERA3= <user>
##$USERA4= <user>
##$USERA5= <user>
##$V9= 5
##$VALIST= <valist>
##$VCLIST= <CCCCCCCCCCCCCCC>
##$VD= 0
##$VDLIST= <DDDDDDDDDDDDDDD>
##$VPLIST= <PPPPPPPPPPPPPPP>
##$VTLIST= <TTTTTTTTTTTTTTT>
##$WBST= 1024
##$WBSW= 4
##$XGAIN= (0..3)
0 0 0 0 
##$XL= 0
##$YL= 0
##$YMAX_a= 381514
##$YMIN_a= -337793
##$ZGOPTNS= <>
##$ZL1= 120
##$ZL2= 120
##$ZL3= 120
##$ZL4= 120
##$ABSF1= 16.522
##$ABSF2= -4.171173
##$ABSG= 5
##$ABSL= 3
##$ALPHA= 0
##$AQORDER= 0
##$ASSFAC= 0
##$ASSFACI= 0
##$ASSFACX= 0
##$ASSWID= 0
##$AUNMP= <proc_1d>
##$AZFE= 0.1
##$AZFW= 0.1
##$BCFW= 0
##$BC_mod= 0
##$BYTORDP= 0
##$COROFFS= 0
##$CY= 12.5
##$DATMOD= 1
##$DC= 0
##$DFILT= <>
##$DTYPP= 0
##$F1P= 14.0000005364418
##$F2P= -0.99999901652339
##$FCOR= 0.5
##$FTSIZE= 32768
##$FT_mod= 6
##$GAMMA= 0
##$GB= 0
##$INTBC= 1
##$INTSCL= 1
##$ISEN= 128
##$LB= 0.3
##$LEV0= 0
##$LPBIN= 0
##$MAXI= 10000
##$MC2= 0
##$MEAN= 0
##$ME_mod= 0
##$MI= 0
##$NCOEF= 0
##$NC_proc= -5
##$NLEV= 6
##$NOISF1= 0
##$NOISF2= 0
##$NSP= 0
##$NTH_PI= 0
##$NZP= 0
##$OFFSET= 16.522
##$PC= 1
##$PHC0= -38.60513
##$PHC1= 1.101408
##$PH_mod= 1
##$PKNL= yes
##$PPARMOD= 0
##$PSCAL= 4
##$PSIGN= 0
##$REVERSE= no
##$SF= 250.13
##$SI= 32768
##$SIGF1= 0
##$SIGF2= 0
##$SINO= 400
##$SIOLD= 32768
##$SREGLST= <1H.CDCl3>
##$SSB= 0
##$STSI= 32768
##$STSR= 0
##$SW_p= 5175.98343685301
##$SYMM= 0
##$S_DEV= 0
##$TDeff= 65536
##$TDoff= 0
##$TI= <Analysis number 999999
Compound Code 99
Book Reference 9
Project Code 9>
##$TILT= no
##$TM1= 0
##$TM2= 0
##$TOPLEV= 0
##$USERP1= <user>
##$USERP2= <user>
##$USERP3= <user>
##$USERP4= <user>
##$USERP5= <user>
##$WDW= 1
##$XDIM= 32768
##$YMAX_p= 502849382
##$YMIN_p= -632671
$$ End of Bruker specific parameters
$$ ---------------------------------
##NTUPLES= NMR SPECTRUM
##VAR_NAME=  FREQUENCY,     SPECTRUM/REAL,   SPECTRUM/IMAG
##SYMBOL=    X,             R,               I
##VAR_TYPE=  INDEPENDENT,   DEPENDENT,       DEPENDENT
##VAR_FORM=  AFFN,          ASDF,            ASDF
##VAR_DIM=   32768,         32768,           32768
##UNITS=     HZ,            ARBITRARY UNITS, ARBITRARY UNITS
##FACTOR=    0.157963299565203, 1,           1
##FIRST=     4132.6476996994, 0,             0
##LAST=      -1043.33573715361, 0,           0
##MIN=       -1043.33573715361, -632671,     0
##MAX=       4132.6476996994, 502849382,     0
$$ Real data points
##PAGE= N=1
##DATA TABLE= (X++(R..R)), XYDATA
$$ [...]
13820E36810n4685j46841J50633O6672P3122J19855R5637j01607r1542J2765k8660
13809F32159p6837J0550P2508J6673j7726j665m0305J7144K79431J55595K9713
13798A077240L6501j02599m2896j28280q9619j21998j43628l5857j41975R7390
13788D04279P5012P0039P2259J35075j23790r5628R6375K2647p7312j81270J9569
13777D17255J9442L512J9881q0319p4447j71447J0984P0599J06506J47880k7983
13766D41863l5419l5921l0264M8864j1796o3403J65357p7257O381M5821l1882
13755D22344L5232l2070j27679Q6267M6507J5451r5101j6888j21408Q7151N0694
13744C50500n3594O2597J33304j64960j73802j0104L7907M0138j3186q0786O5734
$$ y = [536810, 482125, 335284, 485917, 552589, 625711, 745566, 841203, 739596, 648054, 660819, 632159, 555322, 565872, 638380, 655053, 637327, 635662, 595357, 612501, 891932, 1047527, 1077240, 1113741, 1011142, 968246, 839966, 750347, 628349, 484721, 448864, 306889, 404279, 479291, 549330, 621589, 756664, 632874, 537246, 633621, 656268, 578956, 397686, 417255, 436697, 440209, 460090, 379771, 305324, 133877, 144861, 215460, 321966, 469846, 441863, 406444, 370523, 340259, 389123, 377327, 313924, 479281, 402024, 408405, 454226, 422344, 457576, 425506, 297827, 384094, 430601, 446052, 350951, 334063, 212655, 299806, 350500, 296906, 359503, 492807, 327847, 154045, 143941, 181848, 221986, 208800, 128014, 193748]
13733A93748J24890m1354j12415j37627j46406J17914J18082l4353R4594J34724
13723C11797J93267l1169k09927o3019q5932j37919N56K49664J56812j24232j1777
13712B48121l1671K3282j4704J42289n7154j99500j34233J3334O8768m4436l9480
13701b5384R7926o4910m6646M8676J03280N9109R3900J01182j72490j93166J20609
13690A22086J30476j47812o7725o8874k8182J6217K0958Q6427k9553j04269J53481
13679H3230J32707J09772J66500p0972l14711q7314K2161J17656j12062j08109
13669f1142J73084O2781J41098r9800j22107j36645K2102k5123J71993J12030
13659B38271J12742L899j09690m4563q4689o0096j37435m0821L0401P3162O9537
$$ y = [193748, 318638, 277284, 164869, 27242, -119164, -1250, 116832, 82479, 177073, 311797, 505064, 473895, 263968, 200949, 115017, -22902, -22346, 227318, 384130, 259898, 248121, 216450, 239732, 225028, 367317, 310163, 110663, -23570, -10236, 58532, 14096, -25384, 72542, 7632, -39014, 9662, 112942, 172051, 265951, 367133, 194643, 1477, 122086, 252562, 104750, 37025, -31849, -60031, -43814, -22856, 63571, 34018, -70251, 83230, 215937, 325709, 492209, 421237, 106526, 19212, 41373, 159029, 46967, -61142, 111942, 174723, 315821, 216021, 93914, -42731, -20629, -45752, 126241, 238271, 351013, 354912, 245222, 200659, 115970, 55874, -81561, -122382, -91981, -18819, 50718]
13648E0718j7299j01284j4233J95955O205Q2329J85741J3530J9572Q7687q631
13637E00290j35711J31932k6364j66627m7077o5022J7528J8925J14697r3971k80349
13626c1749O6170k5740j25011Q7535K2907Q1015J46997j15322O6540J17452n8276
13615B32518q804J26037J76353j3449r818o2048j31354q610j74550K6684n405
13604A47554J81156o7308p5435L3270k5404k4175O4493K13982l7754P7839O6972
13593E55190j15701M2244J20789N1568j42859l2817O0462K585o8172O6583P2775
13582F12647J81020J20829K9799Q0772J15418K8328J24384K25035L22510L50579
13572B191321M98315O47017O92260R50693J137731R78562K84025r27239j503464
$$ y = [50718, 33419, -67865, -82098, 113857, 120062, 202391, 388132, 401662, 421234, 508921, 500290, 364579, 496511, 470147, 303520, 256443, 191421, 208949, 227874, 342571, 248600, -31749, 34421, 8681, -116330, -28795, -5888, 75127, 222124, 106802, 173342, 290794, 232518, 223714, 349751, 526104, 512655, 502837, 440789, 309435, 300825, 126275, 152959, 147554, 328710, 261402, 185967, 219237, 193833, 169658, 234151, 448133, 410379, 488218, 555190, 439489, 481733, 602522, 654090, 511231, 478414, 538876, 541461, 473289, 539872, 612647, 793667, 914496, 944295, 1025067, 1140485, 1168813, 1293197, 1518232, 1840742, 2191321, 2689636, 3336653, 4028913, 4979606, 6117337, 7095899, 7379924, 6452685, 4949221]
13563D949221j387849p62848m82739n63261k55527J93564J20300j13823K6494
13554A723532R8202J02883J1562k64337J1076K8035k0069j20202k76567J9868
13544A313983J8832r6581J08763p488R4141J57767J69355J02815J19931L5212
13534B016730R9506K88918M09417L71725M42292P35571Q06939J476611J968258
13525H615967K328305K825324L392429L388816K251515r05853l824203m412730
13517A3659570l269582j989238j178700q12670m15197J5033M9312K04121L70035
13508F632684L31258M91227Q75139J273340J711840K051016K667344L311676L673465
13499B3018989L277097J199025j920272l821212m189034l205975k324990j538870
$$ y = [4949221, 3561372, 2798524, 2315785, 1752524, 1496997, 1690561, 1810861, 1697038, 1723532, 1821734, 1924617, 1936179, 1671842, 1682918, 1710953, 1690884, 1570682, 1294115, 1313983, 1332815, 1236234, 1344997, 1337509, 1431650, 1589417, 1758772, 1861587, 1981518, 2016730, 2116236, 2405154, 2814571, 3186296, 3628588, 4364159, 5171098, 6647709, 8615967, 10944272, 13769596, 17162025, 20550841, 22802356, 21896503, 18072300, 13659570, 10389988, 8400750, 7222050, 6409380, 5994183, 6009216, 6058528, 6262649, 6632684, 6963942, 7455169, 8330308, 9603648, 11315488, 13366504, 16033848, 19345524, 23018989, 26296086, 27495111, 25574839, 21753627, 17564593, 14358618, 12033628, 10494758]
13491A0494758q31174o66389m84328j46178k1545J67254K31633N24224P18927
13482I987182J073081J400085J787930K485564L232596L583333L041069L53290
13474B6944130k892219m306632l609264k256362j189148p42266Q0558N02064O87715
13465A3218576P99605J436749J944108K672534L345335M401053O187707Q089201
13457D2094868J0427313J2601704J4948145J5930857J1835887L74761j2209941
13450I6003594j8187314j7175998j2905293q486310n543716l775367k526602j655349
13442B5747645j087138p86040o19069k12367Q9699O41527J213266J736957K521600
13433B9246080L686204M963978N996947O545151O910106P324765P695710N390469
$$ y = [10494758, 9663584, 8997195, 8512867, 8366689, 8345144, 8512398, 8744031, 9268255, 9987182, 11060263, 12460348, 14248278, 16733842, 19966438, 23549771, 26590840, 26944130, 24051911, 19745279, 16136015, 13879653, 12690505, 11948239, 12028797, 12530861, 13218576, 14018181, 15454930, 17399038, 20071572, 23416907, 27817960, 34005667, 42094868, 52522181, 65123885, 80072030, 96002887, 107838774, 108213535, 96003594, 77816280, 60640282, 47734989, 39248679, 33704963, 29929596, 27402994, 25747645, 24660507, 23874467, 23255398, 23043031, 23132730, 23774257, 24987523, 26724480, 29246080, 32932284, 37896262, 43893209, 50438360, 57348466, 64673231, 72368941, 77759410]
13425G7759410j426612q215952j0439271q690906n588248k986964j083010L71831
13417C9700278J742187L030365M692029P049890J0018842J3476230J7147791K0476789
13409A17334401K3660552K2849274J1035509q926642k4545652k9002328k4328379
13402H8076735j6994447j0895057p075642m644017k993511j698366r07010l47031
13394D2521654L21577R66221J886560L287060M812854O369170Q876775J2266809
13386H1308680J6356494K0250232K3938402K7409993K9330564K2444952k756886
13379B18282431l1074186l9223833l1996285k1820661j3793221q728808n522380
13372F6123057l144803j314288K74995J914747L998009O345152Q701610J1248984
$$ y = [77759410, 76332798, 68116846, 57677575, 48986669, 43398421, 40411457, 39328447, 39700278, 41442465, 44472830, 49164859, 56214749, 66233591, 79709821, 96857612, 117334401, 140994953, 163844227, 174879736, 165953094, 141407442, 112405114, 88076735, 71082288, 60187231, 53111589, 48467572, 45474061, 43775695, 42868685, 42521654, 42843231, 43809452, 45696012, 48983072, 53795926, 60165096, 69041871, 81308680, 97665174, 117915406, 141853808, 169263801, 198594365, 221039317, 218282431, 187208245, 147984412, 115988127, 94167466, 80374245, 71645437, 66123057, 62978254, 61663966, 61938961, 63853708, 67851717, 74196869, 82898479, 94147463]
13364I4147463J3659332J4429549R790538j071099j2635501j9248181j8465824
13357H0606277j3614083r201241o131328l717630k311693j383005n50125J05457
13349D3802629O19002J701034K860332L998742N650556P820990J0594257J4004207
13341I1051749J8291781K2802339K6034538K7617115K7895768K0121672m889267
13334B28925695l3715860m2328150l4529737k4004051j6088101j0682664p224784
13327F0352348m988221l674009k873627k134802j298948o04499Q6127J023680
13319D5888049J751271K167771J385821l96668k933661m756780n001692m038268
13311C4065843l242915k484077j471856j001584o98551l94319J53204M63351P70555
$$ y = [94147463, 107806795, 122236344, 132026882, 130955783, 118320282, 99072101, 80606277, 66992194, 57790953, 51659625, 47941995, 45630302, 44247297, 43697172, 43802629, 44421631, 46122665, 48982997, 52981739, 58632295, 66453285, 77047542, 91051749, 109343530, 132145869, 158180407, 185797522, 213693290, 233814962, 228925695, 195209835, 152881685, 118351948, 94347897, 78259796, 67577132, 60352348, 55364127, 51690118, 48816491, 46681689, 45382741, 44778242, 44864369, 45888049, 47639320, 49807091, 51192912, 50796244, 47862583, 43105803, 38104111, 34065843, 30822928, 28338851, 26866995, 25865411, 25166860, 24772541, 24925745, 25389096, 26159651]
13302B6159651J180161J859833K639744L535592M548162O018098P693078R453070
13294F3087389J0250177R556470P314562K685945n143717j2417696j4113349j2141810
13286D9077971q888151o169440m127426l011383k337685j885152j501235j225495
13278A9932004j306542j279311r69820q11678q95707q57570p89604m57791l70838
13269A2193143m59318k59464m30371l76373k48063k64690l44125j43372N3366
13260I720733o373j65835J23914J73710J63111K16423J63359L17487L79933P75758
13250A1862220R22844N02090K82960m52160j482401j614781j301700q55492o15098
13241G248482n80411k94023l1763q0013o6809p8604j80982n4619j76290k24770
$$ y = [26159651, 27339812, 29199645, 31839389, 35374981, 39923143, 45941241, 53634319, 63087389, 73337566, 82894036, 90208598, 92894543, 87750826, 75333130, 61219781, 49077971, 40189820, 34020380, 29892954, 26881571, 24543886, 22658734, 21157499, 19932004, 18625462, 17346151, 16376331, 15564653, 14668946, 13811376, 13021772, 12563981, 12193143, 11733825, 11474361, 11043990, 10667617, 10419554, 10154864, 9810739, 9667367, 9720733, 9714360, 9548525, 9672439, 9846149, 10009260, 10225683, 10389042, 10706529, 11086462, 11862220, 12785064, 13287154, 13570114, 13117954, 11635553, 10020772, 8719072, 7863580, 7248482, 6668071, 6374048, 6342285, 6262272, 6195463, 6116859, 5935877, 5881258, 5704968, 5480198]
13231E480198k81662l11293q866Q1352j44201j61835j61300j82405K3739j28939
13221D204788j9595o2795j97194J0991k9770j18963r9698R2304o0676j03254j04792
13210C511346Q8786J4398j57758k97238k72084j83264k2249J07061p3997n7832
13200B657169q1836J10380N0003n122l5934q4771n2010k5420R176R1846M1821
13189B675302j93954n6383o7861l8649K0450J19100m964j97523j39285J8545J59463
13178B294241k4244k52567j43082o9459j6971K7167O2531R55l5361n1909L2516
13167A823817K76218J5952r6552M9336k7612k34795o0260J31099P958j26799j51029
13156A607333l7033L8592N7786k7510J07107J59008K6925n3490r0349j20685k00569
$$ y = [5480198, 5198536, 4887243, 4878377, 4959729, 4815528, 4653693, 4492393, 4309988, 4333727, 4204788, 4185193, 4122398, 3925204, 3936195, 3906425, 3787462, 3687764, 3780068, 3719392, 3616138, 3511346, 3600132, 3614530, 3456772, 3159534, 2887450, 2704186, 2681937, 2788998, 2715001, 2657169, 2575333, 2685713, 2735716, 2730594, 2694660, 2609889, 2557879, 2532459, 2541635, 2633481, 2675302, 2481348, 2424965, 2357104, 2318455, 2338905, 2458005, 2453041, 2255518, 2116233, 2134778, 2294241, 2269997, 2017430, 1874348, 1804889, 1787918, 1815085, 1877616, 1878571, 1843210, 1791301, 1823817, 2100035, 2115987, 2019435, 2068771, 2041159, 1806364, 1746104, 1877203, 1885161, 1758362, 1607333, 1570300, 1608892, 1666678, 1639168, 1746275, 1905283, 1932208, 1878718, 1788369, 1667684, 1467115]
13145A467115k09257p3810r161k5285q911J37861K18840n6533J2324k21972l7630
13134A193581J34675j42364N8976R8675N2178L2145r3746k35848n2356J78595
13124A224511J14983q5375j90024L3457J43071m5096j46680r5825N8318J47422
13114A158762J07255Q0596p1223J7692K26373L21914L01907O9551q89Q5065j43591
13103B153412k96731k98410k18482q7817j53992j14612q6397j43016q0625n7464
13093F15866J7603J55368O7115Q6237j60058k00279m106P3449L2575n1046j5413
13082F17311q9995L7303J60491J89333R3690j02038j62183q5640p6636R9351J670
13071F82657N1985M5882q5553j0525L66645K07533o2882J16753K76685L08031
$$ y = [1467115, 1257858, 1184048, 1174887, 1149602, 1140691, 1278552, 1497392, 1440859, 1453183, 1231211, 1193581, 1328256, 1185892, 1244868, 1343543, 1395721, 1427866, 1334120, 1098272, 1045916, 1224511, 1339494, 1254119, 1064095, 1097552, 1240623, 1195527, 1048847, 953022, 1011340, 1158762, 1266017, 1346613, 1275390, 1293082, 1519455, 1841369, 2143276, 2212827, 2211938, 2297003, 2153412, 1856681, 1558271, 1339789, 1251972, 1097980, 983368, 896971, 753955, 673330, 615866, 633469, 788837, 855952, 942189, 782131, 581852, 577746, 651195, 683770, 632724, 617311, 527316, 564619, 725110, 914443, 1008133, 906095, 743912, 658272, 581636, 680987, 682657, 734642, 780524, 694971, 684446, 1051091, 1258624, 1195742, 1312495, 1589180, 1897211]
13061A897211J44860P7560K3889k95956l53914l19873p7328J00371q4718j65241
13051I46861r8311K5052L760J66871K1763o1455j18244j53423J05261L0446j03335
13040G65246j6858M0578n9178j73442J29564K14343P5868j05662N4889N9869o2374
13029I22843k30176J115L3380R0091m4368Q6196J51004K45476J5192j48858j08514
13018A013381j29548N2284K30195K55720L7935j72350q2048j52141j01289O6536
13008A018675m6527m0437n3807l3519N8252j13750J5122J12873Q0657J02443l8919
12997A061063q3664k1988m1391k5946R4084J6517J1874P7632j30409p3374l5494
12986H48904m2003P7066K79020J0996j6283L8690L1934L6721L20567N1382Q7881
$$ y = [1897211, 2042071, 2119631, 2143520, 1847564, 1493650, 1173777, 1096449, 1196820, 1112102, 946861, 848550, 873602, 877362, 1044233, 1065996, 1004541, 886297, 732874, 838135, 868581, 765246, 748388, 788966, 729788, 556346, 685910, 900253, 976121, 870459, 925348, 985217, 922843, 692667, 693782, 727162, 817253, 772885, 859081, 1010085, 1255561, 1270753, 1121895, 1013381, 883833, 936117, 1166312, 1422032, 1459967, 1287617, 1205569, 1053428, 952139, 1018675, 972148, 931711, 877904, 844385, 902637, 788887, 804009, 916882, 997539, 1099982, 1061063, 977399, 955411, 914020, 888074, 982158, 998675, 1010549, 1088181, 957772, 884398, 848904, 806901, 883967, 1162987, 1173983, 1157700, 1196390, 1228324, 1265045, 1585612, 1636994, 1724875]
12975A724875j7018j66569L0882J13664J64501k9991r578M0462m9754j95236M3989
12964A650227R8153J08206K04703J57715J23231J79136L70112L23735K02932L93151
12954C811301L43138O6065J14855K77410J42839K24351K82334L27879M47949M34776
12944F472897L90757M98718N06461O21982P74109J338616J742425K140995K724141
12935A7211101L599568M817636O173450P868887J0178451J2530492J5251127J7700005
12927I5330717J8247090J4018264L118484j0467885j9520379k0670586j6944032
12920F3111673j1944224p985930n097188l336181k266936j008137O9458J089852
12912C2632387K057168L174686M776998O530598Q584887J1003965J3585771J6051764
$$ y = [1724875, 1707857, 1541288, 1572170, 1685834, 1850335, 1820344, 1810766, 1851228, 1801474, 1606238, 1650227, 1748380, 1856586, 2061289, 2219004, 2342235, 2521371, 2891483, 3215218, 3418150, 3811301, 4154439, 4220504, 4335359, 4612769, 4755608, 4979959, 5262293, 5590172, 6038121, 6472897, 6863654, 7362372, 7868833, 8490815, 9264924, 10603540, 12345965, 14486960, 17211101, 20810669, 25628305, 31801755, 39670642, 49849093, 62379585, 77630712, 95330717, 113577807, 127596071, 130714555, 120246670, 100726291, 80055705, 63111673, 51167449, 43181519, 38084331, 34748150, 32481214, 31473077, 31542535, 32632387, 34689555, 37864241, 42641239, 49171837, 57756724, 68760689, 82346460, 98398224]
12904I8398224J6955568J3048071K914304j0216913j9408082k1063352j7401355
12897F3226465j2704137q778131o123547m403419l262842k616974k117028j645512
12889B1574875j335458j027254q58435q62522r51864p93432o14302o04107p60627
12880A3766874o39036n66415k79562m13849n01372m20985n50520l96812j52020
12871I846303l14094l47439l30878j30980l49689l49618j31828l12522m16601
12862G162654l89499k64414k44225j72597k17490k14391k50935j53118l37375
12853D918610j18550j02166k22634l1522K9133j28291j20559k00480m1580p9245
12843C902716j54775q4516n7632k45821j43666m0041k67414j03450J42281J17427
$$ y = [98398224, 115353792, 128401863, 131316167, 121099254, 101691172, 80627820, 63226465, 50522328, 41744197, 35620650, 31217231, 27954389, 25337415, 23220387, 21574875, 20239417, 19212163, 18353728, 17491206, 16539342, 15745910, 15131608, 14527501, 13766874, 13127838, 12561423, 12281861, 11868012, 11366640, 10945655, 10395135, 9998323, 9846303, 9532209, 9184770, 8853892, 8722912, 8373223, 8023605, 7891777, 7579255, 7162654, 6773155, 6508741, 6264516, 6091919, 5874429, 5660038, 5409103, 5255985, 4918610, 4800060, 4697894, 4475260, 4443738, 4472871, 4344580, 4224021, 4023541, 3981961, 3902716, 3747941, 3663425, 3605793, 3359972, 3216306, 3176265, 2908851, 2805401, 2947682, 3065109]
12833C065109o1218j55931j40262P4556k44J9873k4051n9156q756k7278K9709
12822B712351l9094j20722j28785Q7682L0165j30190j51580j97281J63909j07403
12812B119052j59828o1912K74152k2689m8484r8248r1535q4559J33725K9301j84839
12801A804136q8448K3865j2611n3772j6504j5349k01831l2344J66831L2799j02399
12790A504373j44939j03752l5596P8718L17116J6444r7141k2943k71038j75978
12780A065264k4755J12366K8753j47819j0872J23477P6927m7086m4059k9438J8830
12769A121588K9899j40581q6863K7150J681q1372r3044l4562m8395O8333J9286
12758G83120J00022j6534O1109k25596j33421J02518N4449m5212m667R0794O2944
$$ y = [3065109, 3003891, 2847960, 2707698, 2782254, 2782010, 2801883, 2777832, 2718676, 2709920, 2682642, 2712351, 2673257, 2552535, 2423750, 2511432, 2541597, 2411407, 2259827, 2062546, 2226455, 2119052, 1959224, 1897312, 2171464, 2148775, 2100291, 2002043, 1910508, 1825949, 1959674, 1988975, 1804136, 1715688, 1739553, 1726942, 1673170, 1656666, 1641317, 1439486, 1407142, 1573973, 1606772, 1504373, 1359434, 1255682, 1220086, 1298804, 1615920, 1632364, 1535223, 1512280, 1241242, 1065264, 1040509, 1152875, 1181628, 1033809, 1022937, 1146414, 1223341, 1176255, 1132196, 1102758, 1121588, 1151487, 1010906, 924043, 951193, 952874, 871502, 778458, 743896, 695501, 763834, 783120, 883142, 866608, 927717, 702121, 568700, 671218, 725667, 680455, 675788, 766582, 829526]
12747H29526K639j78000R4899n7940J0990l6501N3541j54858J38336J65039j27452
12736G40219j73430k4412j13749K11821P713r7644j10558O2882O9918m201M3200
12725F11759N7969K6157L4892M1392p3752k13261n7765R8539j8875l9778o6283
12714D00994L967o0583N1842l0901N6298k5135J24490Q1343j15385r5751J70458
12703E61637O6672L461o7081k52823j42826o5719r458P1139K08395J01567o7683
12692D07281j23686J70217J28105p1508M7745r3548N3110j4295N3340J71118L3287
12681G61166j81087k97953q0470L6461k5800J04703Q069J95758l7707k36108q0840
12670A66192J31764j1076K6727o9786j57348j46972K6744J37681K80024J20299
$$ y = [829526, 832165, 654165, 749064, 691124, 702114, 665613, 719154, 564296, 702632, 867671, 740219, 566789, 542377, 428628, 640449, 648162, 550518, 439960, 502842, 572760, 568559, 611759, 669728, 695885, 730777, 772169, 698417, 485156, 427391, 525930, 507055, 467277, 400994, 404961, 344378, 396220, 365319, 421617, 396482, 520972, 602315, 486930, 391179, 561637, 628309, 631770, 564689, 311866, 169040, 103321, 93863, 165002, 373397, 474964, 407281, 283595, 453812, 581917, 510409, 558154, 464606, 517716, 503421, 556761, 727879, 761166, 580079, 282126, 201656, 238117, 212317, 317020, 325089, 520847, 483140, 247032, 166192, 297956, 286880, 313607, 243821, 86473, -60499, -33755, 103926, 383950, 504249]
12660E04249j17158j08780j25117M591J03013R6117l138r6790L0403o4195J08506
12649C31701J33564o2330j71280K4040J07038k80489j66720O0653J23561M4779
12639A44517j67246j31033P0202m4201J77151P2253K07316k6789q6855m1992L0228
12628B03551L1340R8957L7502k4471o1632l9943K9309k7064j61958j81338M1245
12617e4502J54986J10822K3624m1832n6662j19771J3867J2668K3661Q9207J38799
12606B94867j38439K2385j18504o1318N8570J59688Q7367p287J14271o6567r3195
12595B51838m8581o6602Q3955J33227j1488r4421P6326j04423n5936O5193M6739
12584B75827J166r8211J9605l5185j88668q0580L2542R5055J27814Q2894K06690
$$ y = [504249, 387091, 278311, 153194, 157785, 260798, 356915, 353777, 256987, 287390, 223195, 331701, 465265, 402935, 231655, 255695, 362733, 82244, -84476, -23823, 99738, 144517, -22729, -153762, -83560, -127761, 49390, 121643, 328959, 302170, 215315, 173323, 203551, 234891, 333848, 371350, 346879, 285247, 245304, 274613, 247549, 85591, -95747, -54502, 100484, 211306, 234930, 193098, 136436, 16665, 30532, 43200, 66861, 156068, 294867, 156428, 178813, 60309, -1009, 57561, 217249, 304616, 297329, 411600, 345033, 251838, 203257, 136655, 220610, 353837, 342349, 247928, 324254, 219831, 163895, 229088, 275827, 276993, 178782, 198387, 163202, -25466, -106046, -73504, 21551, 149365, 232259, 438949]
12573D38949K7236N599J6408J63749K88119M58218K95645j39575l29495m18157
12563H06696n6129o8991n1563r0506k25952j52242J12733K94363J37860j22792
12553E83477j08157p7862j2789J37493K22377N9244k728L1728K98417L23156L15029
12542A769385j65834m01560l37710j83075J2013n6750r6881O215J29977j25763
12532E50017l11956O4199j30719j78316K4148Q6183O8589p0401j5664J07471J3572
12521B07123L8914Q8099P0465M0058p7838M7853l5031j59973K9612J41666j44600
12510B46348m3292N6238J20781L6246j38051r587n4067R7942M3040n2487J01819
12499D04930K07559l3793q7545q0179k9647P6169J4292p7087j79700o083J28680
$$ y = [438949, 466185, 471784, 488192, 651941, 940060, 1398278, 1693923, 1554348, 1224853, 806696, 750567, 681576, 630013, 539507, 313555, 161313, 274046, 568409, 706269, 583477, 475320, 397458, 384669, 522162, 744539, 803783, 801055, 832783, 1131200, 1454356, 1769385, 1603551, 1201991, 864281, 681206, 693219, 636469, 539588, 545803, 675780, 550017, 238061, 302260, 171541, -6775, 17373, 103556, 172145, 101744, 86080, 193551, 207123, 246037, 334136, 404601, 444659, 366821, 414674, 379643, 219670, 249282, 390948, 246348, 203056, 259294, 380075, 416321, 278270, 268683, 214616, 312558, 355598, 303111, 404930, 612489, 578696, 491151, 410972, 381325, 457494, 471786, 394699, 214999, 208916, 337596]
12488C37596J08722J32616j2289J61136J79310n7825R9294o2503k28157j58343
12478D99557k20097n3652L4993L3270L7242K03567k1778j22215O5768o8146J6000
12467D04509Q3500O1938r3377k5138O2728J12946J13807p5814k8551j95861K5223
12456D45910j81026J35397J8722n0848j9885J51598n1482k0095p9473J70291P8206
12445E97315o1922p4146p1983j30980j46996p8126j7833J43491O2993N297l6684
12434A90426n2136R8801l9209k0287M6614n0622P9573K29301j18225k6040o887
12423C31309o8296N9889j560l0369O8683j02249r5818j67309P1533j4463p9937
12412b8587J67826L0891L6137l4014m4966N2020k309J6041r2845J37600j5724
$$ y = [337596, 446318, 578934, 566645, 727781, 907091, 849266, 948560, 886057, 657900, 499557, 279460, 225808, 260801, 294071, 331313, 534880, 513102, 390887, 456655, 388509, 404509, 488009, 549947, 456570, 431432, 494160, 607106, 720913, 645099, 616548, 420687, 445910, 264884, 400281, 419003, 368155, 348270, 499868, 448386, 428291, 348818, 519109, 597315, 535393, 461247, 389264, 258284, 111288, 33162, 15329, 158820, 221813, 227110, 190426, 138290, 237091, 197882, 177595, 224209, 173587, 253160, 482461, 364236, 338196, 331309, 263013, 322902, 321342, 290973, 359656, 257407, 161589, -5720, 65813, 51350, -28587, 139239, 170130, 206267, 172253, 127287, 179307, 176998, 193039, 100194, 237794, 222070]
12401B22070J8793l633j41399L9860J0842l7659L756J16057L127K078J4932M731
12389B53555K5833Q6581P3059n011m3436j30590k17565L5767J22758n1135k8773
12378A21043M4126n4314o9652Q7066J050j50784R2079j28986m7082m2244J04450
12367d3248k8199j28776J20270J52459l2227Q972k4251j38298J34769J38905n286
12356A55090k2146M6785M1850q0559O5961o2430n8149O1538J67770o7432j63073
12345H5205j08173r106M3222q4987l3532R5812J30025J61432n6829m5742P6748
12334B54075P9815R2498q3421j13122p6577J71751m029j64173j94648K7034M9272
12323C8475j2364K3349O2207M7891j44519J56822J76808l0770j90189l5342j3340
$$ y = [222070, 240863, 237230, 95831, 135691, 146533, 108874, 112630, 228687, 231814, 233892, 248824, 253555, 279388, 365969, 439028, 434017, 390581, 259991, 42426, 78193, 200951, 149816, 121043, 165169, 110855, 41203, 128269, 129319, -21465, 70614, -58372, -105454, -147698, -43248, -71447, -200223, -79953, 72506, 40279, 49251, 25000, -113298, 21471, 160376, 155090, 132944, 179729, 221579, 141020, 206981, 144551, 86402, 147940, 315710, 248278, 85205, -22968, -32074, 11148, -73839, -107371, -11559, 118466, 279898, 223069, 177327, 254075, 333890, 426388, 342967, 229845, 153268, 325019, 320990, 156817, -37831, -10797, 38475, 26111, 49460, 111667, 159558, 15039, 171861, 348669, 317899, 127710, 92368, 79028]
12312G9028J54783j77631l8320m0226n7000j3235J36719J52398j07279J1211J83200
12301B83648K3997N9046k71431k75024l1144N1650J2725N7211R5086L61985J08656
12290D76405j45230j46981q9841J4929j2507m8802J1427j2599J04827J56303p0654
12279B37277j94208J49353O6669N087j41434q8205r7029R1693J3346q9329L3554
12268a3226J21920j21517j62449k55804m137J52224K50756Q2259J96065m8641
12258A97450n466j1983k0790n858j16615q6887K41952K11315J5462j24471k31393
12247F2716j32576k73418R9524K09702J39361K9737p6479K4063K28j8286p4344
12236i772M3504J39799j35697q1857J62192l5347N6270N0012m3564j50900l2209
$$ y = [79028, 233811, 56180, 17860, -22366, -79366, -92601, 44118, 196516, 89237, 100448, 283648, 307645, 366691, 95260, -179764, -210908, -159258, -146533, -89322, 5764, 367749, 476405, 331175, 184194, 94353, 109282, 96775, 47973, 59400, 46801, 151628, 307931, 237277, 43069, 192422, 259091, 264178, 122744, 34539, -62490, 29203, 42549, -46780, -13226, 108694, -12823, -175272, -431076, -435213, -282989, -32233, 50026, 246091, 197450, 191984, 180001, 159211, 153353, 36738, -50149, 191803, 403118, 418580, 294109, 62716, -69860, -343278, -243754, -34052, 105309, 135046, 58567, 82630, 82858, 64572, -9772, 33732, 173531, 37834, -44023, 118169, 82822, 139092, 189104, 145540, -5360, -37569]
12225c7569K73604M5103o9174j39175j93604p7265o9986M570j1890j4615K5602
12214b64399Q3774N901J1744J72343j3188r6346M8645L2335m7982n8575q457L1830
12202a02375K02921M3485O0050J685o7467J05148M4776n2398k98718r6571K68703
12191A09239J83372j1357r8631O4321n3697M8747J16095l1254o3209K4519n2602
12180B35543K0118o1300j6759J06877n7616K9792K07785j65680o2963K31571j01520
12169C65848k30225l81686J34157K13117N0357K5300N3911P2698N869Q7972K9056
12158D26374p5451k08801k51325R9242j074R4168J62768l4686j10206j00276k2787
12147b2054J99992R1598P9871j863L9530j27732k08883j4539n0674l3717L9521
$$ y = [-37569, 236035, 281138, 211964, 72789, -120815, -198080, -268066, -263496, -275386, -290001, -264399, -180625, -174724, -162980, 9363, -3825, -100171, -51526, -19191, -67173, -125748, -134205, -102375, 100546, 144031, 204081, 205766, 138299, 243447, 288223, 235825, -62893, -159464, 109239, 292611, 281254, 182623, 246944, 193247, 241994, 358089, 326835, 263626, 288145, 235543, 255661, 194361, 177602, 284479, 226863, 256655, 464440, 298760, 235797, 467368, 365848, 135623, -246063, -111906, 101211, 151568, 176868, 230779, 303477, 309346, 397318, 426374, 350923, 142122, -109203, -9961, -11035, 83133, 245901, 211215, 101009, 733, -22054, 177938, 269536, 349407, 347544, 387074, 259342, 50459, 35920, -14754, -48471, -8950]
12136h950J66789N147N5795j23941k63083k8649J09338J35441J23210j07097O8402
12125A32402j3370J22302M9976n0479n8895K7946o8990N5557q3337J6296R655
12114A39063R3409R4171o5800p309o3786j90393j32718M7544K11417K391j16797
12103A1192m9386q1137N7367R3090j5238n0201L6886K71093J67721K5296l1992
12092D34691j16692j50627N6476L5813q6786M0173J7405j14510J2623J79400J59519
12081D67485J42571R7208j20546j71167k02618l0113J40668O0911j4447r1778
12071B78174q9167j5193k03125O5131N3015P4355p3660m5273m6676o827J07802
12060I8556Q339j6754k15696Q9102J16982o0505l1487R8219q8129k8058R385O6933
$$ y = [-8950, 157839, 162986, 218781, 94840, -168243, -196892, -87554, 47887, 171097, 64000, 132402, 119032, 241334, 291310, 240831, 181936, 209882, 140892, 196449, 113112, 129408, 139063, 232472, 326643, 260843, 253534, 189748, -645, -133363, -85819, 125598, 127989, 11192, -38194, -119331, -61964, 31126, 15888, -34313, 2573, 273666, 441387, 466683, 434691, 317999, 167372, 223848, 259661, 172875, 213048, 230453, 115943, 128566, 307966, 467485, 610056, 707264, 586718, 415551, 212933, 182820, 323488, 384399, 369952, 278174, 189007, 173814, -29311, 35820, 88835, 163190, 89530, 44257, -2419, -9246, 98556, 106895, 90141, -125555, -36453, 80529, 20024, -11463, 86756, -1373, -29431, -20046, 46887]
12048D6887l1347O5979O3323k2847O2663j16389k58066R0008J62625J03758L6467
12037B03061o6733n2781j64798K4692K94204L9573j20010n2958O902O9526J0209
12026A90887n9187P3169K4050L1235j42420J4544J20437l2896j62906j34861J05774
12015B7826K8204J22267N0853r0387O3132m4089L8206N9801K4704k7319J213o5991
12003A88420k92039k26757p0674J28056J63609j24297J3951M9731n7784L5540
11993a92244J80102R733M3520L236M1057n4356k18183j384m7282J48625J14166
11982B6990K34463L1883n5004K7700r7289j41177J05280J61703j9731l6616L8233
11971B76435l3610O3857J01666m4080O5945q9907j69765r611l766l0302M3928
$$ y = [46887, 15540, 81519, 144842, 121995, 184658, 68269, -189797, -99789, 62836, 166594, 203061, 136328, 83547, -81251, -56559, 237645, 277218, 157208, 104250, 111152, 180678, 190887, 131700, 204869, 228919, 260154, 117734, 132278, 252715, 219819, 56913, -77948, 27826, 56030, 178297, 229150, 138763, 201895, 157806, 196012, 255813, 280517, 253198, 254411, 188420, -103619, -330376, -401050, -272994, -109385, -233682, -219731, -170000, -227784, -192244, -12142, -2409, 41111, 44347, 85404, 31048, -187135, -188519, -235801, -87176, 26990, 261453, 293336, 238332, 266032, 168743, 27566, 132846, 294549, 274818, 238202, 276435, 242825, 306682, 408348, 364268, 430213, 340306, 170541, 160930, 157164, 126862, 170790]
11960A70790Q4444K4536l6420J6133O6367k51932k97730j70827J16535K32670
11950d5434J90437q2306j5028j04977n2602J66150J85829P0100o4776k26929j42943
11939a22479J09460Q8456j43460j04671M2803K4384j01394J37692R9710j72809
11929a42308J2217J06205P8824J78047K25576K026j75419l26171L4932J29296
11919A23225k40701o3691J64112j25563j00858O9506O9516N1890n0541R4694q1328
11908h9739j01838p871k7013n8516J51454O3716J07299K8977j92822m7698J51189
11897b2862K9875K4445n1117q9793N3393R8306J3744j83726l7540M6192K87215
11886A68132o6215n0276K7671j3447q3880p1296K87j09872o5650n5229K09093
$$ y = [170790, 255234, 279770, 243350, 259483, 325850, 73918, -223812, -394639, -278104, -45434, 145003, 62697, 47669, -57308, -109910, 56240, 242069, 312169, 247393, 20464, -122479, -13019, 75437, -68023, -172694, -129891, -105507, -206901, -69209, 30501, -142308, -130091, -23886, 54938, 232985, 458561, 460587, 285168, -41003, -6071, 123225, -117476, -181167, -17055, -142618, -243476, -173970, -104454, -52564, -103105, -8411, -89739, -191577, -199448, -226461, -284977, -133523, -69807, 37492, 66469, -126353, -174051, -22862, 7013, 31458, -19659, -109452, -56059, 42247, 55991, -127735, -165275, -119083, 168132, 101917, 51641, 79312, 65865, -18015, -89311, -89024, -198896, -264546, -319775, -110682]
11875a10682L6734o803N2389j88589j18906P6303L6295K2153J70732J99079K0393
11864A89098o9811p9055K985N6435m4295j75456J07429J14147K0027k38432m1140
11853a58068O5186m5932j22989R3153J12207R0966j27597K5202M0697j4594K9042
11842a2727J39665J35402j59254o2675l9933M6353R5564m8262j18432l0118L9368
11831a5049j9839j6562j3218J3272k4872j18492J99868Q9793O617n0469j95634
11820a44585p8718O4579N8936J0912p622p4464m5724m1312P5594L2377m3630J41253
11808e2404J07977p1968m0600N8171R6821j83952j39753J01666J40068O4923K49111
11797C30060K8169j20195j64190L4558l9488R3423K242j15604q3856l5527n0958
$$ y = [-110682, -73948, -80751, -28362, -216951, -335857, -259554, -223259, -201106, -30374, 168705, 189098, 119287, 40232, 43217, 99652, 55357, -120099, -12670, 101477, 121504, -116928, -158068, -92882, -138814, -261803, -168650, -56443, 34523, -93074, -67872, -27175, -41769, -12727, 126938, 262340, 103086, 40411, 478, 46831, 142395, 94133, -24299, -54417, -15049, -34888, -51450, -64668, -51396, -76268, -194760, 5108, 94901, 101518, 51049, -144585, -223303, -158724, -99788, -88876, -96498, -170962, -216686, -257998, -182404, -150027, -193657, -52404, 55573, -16395, -56995, 1176, 97997, -85955, -225708, -124042, 16026, 80949, 330060, 358229, 238034, 73844, 108402, 68914, 162337, 164579, 48975, -34881, -70408, -121366]
11786a21366J9786L6521r041J00686P4277j01789j3244P1492M1634J4454J11421
11775B24831K0083j34147j05452p9849J14111J13293L9054q433j34221j55010
11765a05740Q4041J06855J57933k1586J8251Q51p224O725l3069j05858J7786J69450
11753B88415J5018k89168j99262J1041k6030l658R5224J45464K30001O9123j66074
11742A70094k06170p7854N0208L9083n4525J27348o4027j19009J02969O2003j18883
11731h8763M4307k9987j25829j51325P4530R6066J45195K7873o1502R4731J0021
11720C5317j41890M8488n1137p0267K02771q9082k89747P3681K97509J25621K03203
11709C44467K8913j05497k18970L7000n3160k8833j9334O6395j7945J6628j8146
$$ y = [-121366, -101580, -65059, -74100, 26586, 100863, -926, -14170, 57322, 98956, 113410, 224831, 244914, 110767, 5315, -74534, 39577, 152870, 191924, 183491, 49270, -105740, -21699, 85156, 243089, 221503, 239754, 240605, 233381, 240106, 207037, 101179, 118965, 288415, 303433, 14265, -184997, -173956, -199986, -203644, -108420, 37044, 267045, 336168, 170094, -36076, -113930, -63722, -24639, -79164, 48184, -15843, -134852, -31883, 30120, -88763, -44456, -74443, -200272, -351597, -277067, -181001, -35806, -7933, -69435, 25296, 35317, -106573, -58085, -109222, -179489, 23282, -65800, -355547, -281866, 15643, 141264, 344467, 373380, 267883, 48913, 85913, 32753, 3920, -15414, 50981, 33036, 49664, 31518]
11698C1518m4477M771j32696o4728J16779J25370l7760P5777j03594N5814O575
11687C3349j63007J065J16810J05555R8219J947j5687j03915O1822N6784J4223
11676B07165o4957j8378J05803M4962K3354r9188M8026l7155J9595j37323r5517
11665c613m5583l3848L9660o8440k49215r4036L8998Q4041J12970J299l4137J17421
11653a34483R3767J05660N2621K1349O6459m1990r8316n8362O6287N4202L6838
11642A64032k949M3286K8392j03122j27995J25921K31497l3809j86822j44980
11632f549j66695J52741M559j80497p1089k0739K0922M9263K6928O5366q6820
11621b12610n4492j6102J67649J13900Q9301O384P3539Q3102r4902L5152L6680
$$ y = [31518, -12959, -8188, -140884, -205612, -88833, 36537, -1223, 74554, -29040, 26774, 33349, -129658, -128593, -11783, 93772, 191991, 193938, 178251, 74336, 136158, 192942, 207165, 142208, 123830, 229633, 274595, 297949, 198761, 246787, 209632, 229227, 91904, -3613, -49196, -83044, -43384, -111824, -361039, -455075, -416077, -332036, -219066, -217767, -251904, -134483, -40716, 64944, 117565, 138914, 205373, 163383, 65067, 6705, 72992, 127194, 164032, 161083, 204369, 232761, 129639, 1644, 127565, 359062, 325253, 138431, -6549, -173244, -20503, -15944, -196441, -267530, -288269, -267347, -218084, -191156, -125790, -212610, -267102, -283204, -115555, -1655, 87646, 94030, 167569, 250671, 155769, 190921, 227601]
11610B27601n6981q1832k02346j46301j01464K45445J95931K12118j06038k33510
11600d7377q7779R4324R4499j43981o9263J07296R3077l7028k0622j24150j22074
11589b63078J10610J1063J21687j3943q7607m2673j6449k369P4379j36206j4808
11578b59394L3445Q3261P7335J0489O3581J26888L5043n4187J2258m341p5153
11567D9225M6980N9095j57282l8770J79361L7924o8170j3729j25226j63735l6178
11556b30505J59630j0110Q5841K07346p0265j00742K192J1651j00064K5043P5179
11545E5196L8635J8274r4048o0258q9908j17031R9031J73578j40685j44343L11642
11534E0083l6860k9706k633L0569m6573P3828M2098k096J64453Q6868q8845j16487
$$ y = [227601, 170620, 88788, -113558, -259859, -361323, -115878, 80053, 292171, 186133, -47377, -135156, -40832, 53667, -90314, -159577, -52281, 40796, 3768, -16854, -141004, -263078, -152468, -141405, -19718, -33661, -121268, -163941, -180390, -182759, -108380, -244586, -259394, -225949, -142688, -65353, -54864, 8717, 135605, 170648, 116461, 128719, 124378, 49225, 96205, 155300, -1982, -40752, 138609, 176533, 108363, 94634, -30592, -194327, -230505, -70875, -80985, 4856, 212202, 141937, 41195, 43387, 55038, -45026, -19983, 55196, 93831, 112105, 18057, -42201, -132109, -249140, -150109, 23469, -117216, -261559, 50083, 13223, -16483, -19116, 11453, -35120, 38708, 80806, 78710, 243163, 330031, 241186, 124699]
11522A24699j87203K659J70271J60107o1738k09267r4388J20937K4823l7157j41112
11511a27369R1367J73879p2397k4530M4542j13781j9796p2683J26428Q7367k2294
11500G0733J52401m144j44073m020N4191r3543L8650p5125K9049O6229N8908J1411
11488A60667j08113l4803n5263J49003O3004j36960L9396j35482o9333J39069
11478A1185R5470j00242j4168r8031r4515o0812l9429J0472m8189M2971J765j86202
11466d79725J67145L41014M0152Q3052J14293n089k11086j53590l8178j09196
11456b51208N3708J33512l6476j07104P6714R9890r853O4278N7419l98n5127j08787
11444h3432q6951J09644J03445j78850j34303L007L9798r5176N039J03304M2709
$$ y = [124699, -62504, -59845, 110426, 270533, 208795, -472, -94860, 26077, 50900, 13743, -127369, -36002, 137877, 65480, 40950, 85492, -28289, -48085, -120768, 5660, 93027, 70733, 223134, 218990, 74917, 70897, 125088, 31545, 70195, -4930, 24119, 90348, 149256, 160667, 52554, 17751, -37512, 111491, 174495, 37535, 76931, -58551, -127884, 11185, 106655, 6413, -7755, -105786, -200301, -261113, -300542, -290070, -338259, -295288, -293523, -479725, -312580, 28434, 68586, 151638, 265931, 260842, 49756, -103834, -142012, -251208, -197500, -63988, -100464, -207568, -130854, -30964, -40817, 23461, 80880, 80482, 25355, -83432, -170383, -60739, 42706, -136144, -270447, -267440, -227642, -322818, -317779, -214475, -171766]
11433a71766J3071j52740L7142J90947N0129J19288M9879O7332P8851K6207k54974
11422E3366L1418O9312K83211K32510k50968k24399o7396p8717j29343J5822p717
11411g2901p0876j1002J50605J36080m5260l1520O732Q8043J07616r937j31864
11400A15716j01933j59912o7451o7140Q7423M2037L19543O9246m0462P167J23530
11389C27764l5087q8396j79605q4257M4730K1706m5487j05613J40511O6598m6887
11378A5977q9704J26331O8137N5337p2748J3871j36367n6150J74205L098q4243
11367A7744j26124O2471K403Q4612J06301J1796J59149p3725j16102j11392M5168
11356F2301K01087O4037o3194P3750p9937m3244r8909j98275m1398K00978M7068
$$ y = [-171766, -158695, -311435, -274293, -83346, -33217, 86071, 135950, 203282, 282133, 308340, 53366, 84784, 154096, 437307, 669817, 418849, 194450, 127054, 48337, -81006, -65184, -72901, -143777, -154779, -4174, 131906, 86646, 55126, 61858, 149901, 257517, 247580, 115716, 13783, -146129, -213580, -280720, -193297, -151260, 168283, 237529, 197067, 204234, 327764, 292677, 204281, 24676, -59581, -14851, 6855, -38632, -144245, -3734, 62864, 15977, -73727, 52604, 120741, 176078, 103330, 117201, -19166, -75316, 98889, 101987, 17744, -108380, -45909, -43506, 41106, 147407, 159203, 318352, 244627, 128525, 17133, 62301, 263388, 327425, 264231, 337981, 258044, 214800, 115891, -82384, -123782, 77196, 124264]
11345A24264k6996J47753p2784j3750r5926k24540M7855j809j78146j55217N7171
11334c92125k0289K20249K3888j62309J2702Q5882N6851J86982J19428k7022j70331
11323f6094p9413P2457R3770Q8766J48115p718r3592j56812l9705P2220J63535
11312A95529n7348k27950r8394p0106O2458J13556J26461o270n6558l3749J6118
11301c6253J32632p560j62611j45338k6573P9546J71535q1721q6820O9136N5549
11290c8478l7816j67635j6231K40719O5078j03132p5456N3420r4192o0001P4848
11279a58876Q0978J22765j04598Q0578J72388L6584q2867j52891L320K2593J9948
11268C9922j5803l5246k4116K5239L2860j68109J06935M0334l1479l7609m3899
$$ y = [124264, 97268, 245021, 172237, 158487, 62561, -161979, -114124, -115933, -294079, -449296, -392125, -412414, -192165, -168277, -330586, -317884, -232002, -175151, 11831, 131259, 104237, -66094, -145507, -73050, 20720, 109486, 257601, 249883, 156291, -521, -40226, 31994, 195529, 138181, -89769, -188163, -258269, -195811, -82255, 44206, 37936, -18622, -52371, -36253, 96379, 88819, -73792, -219130, -245703, -166157, 5378, -76343, -163163, -94027, -38478, -76294, -243929, -260160, -19441, 45637, -57495, -132951, -79531, -173723, -233724, -158876, -77898, 44867, -59731, 20847, 193235, 229819, 146952, -5939, -2619, 19974, 39922, 24119, -11127, -35243, -10004, 22856, -145253, -38318, 2016, -29463, -67072, -110971]
11257a10971M1633p652j04937q6856k4028O4098O5387J83905Q4752O2850J09739
11246B77920o7026j47983p1753J0780Q0128O725j77943J4109k1302K5534j14508
11235a85319P1762L8061K9054n6742j34921o352J32869J57680J65487J4051j91740
11224C3890k9449N2563j2541N6774l4226m0831P123N1918j29254j60174L8266
11213a65941M4009R2438J64313Q4315j08844m5993K6546J12397j02485K2665J61988
11202B85408Q3083j3650k00230k17098k9138J63285J01315J07681J30517p1856
11192C39317q2936p3301j13869J16718K1324k1438L5046j40938M9927K0996J6926
11181A67772R1019o9680j95381l3221J94189p6052j88989J00124K20412P5114
$$ y = [-110971, -69338, -76990, -181927, -268783, -292811, -228713, -163326, 20579, 105331, 168181, 277920, 210894, 62911, -8842, 1938, 82066, 88791, -89152, -75043, -96345, -70811, -185319, -113557, -75496, -46442, -103184, -238105, -244457, -111588, 46092, 211579, 225630, 33890, 4441, 57004, 44463, 101237, 67011, 26180, 33303, 85221, -44033, -204207, -165941, -121932, -29494, 134819, 219134, 110290, 64297, 90843, 203240, 100755, 123420, 285408, 368491, 354841, 154611, -62487, -91625, 71660, 172975, 280656, 411173, 339317, 256381, 183080, 69211, 185929, 207253, 185815, 220861, 79923, 129850, 150846, 167772, 258791, 189111, -6270, -39491, 154698, 78646, -110343, -10219, 210193, 285307]
11171B85307j13245m7690o9576M1937l3156J10935j97756j09179j17857q8711
11161c38991J4561K46070j03511m5447J64358K05195j8141j23385q1596l6543
11151a17430k37258J39906O3054M5523j6687J9320J56475n1364j61320Q3458P5145
11140a178l0196M932J85052j28928j21285p8243J34300J57022M6437Q024r6541
11129G9396r135k4528Q5960Q2821K0737j02052k1319J11243O2797n8063j24011
11118A03846R8506M1956o339j49683n4126K7965j48559o8489M9707r948K17265
11107A02101n7896j19194q2065M4004P1136j0397j7857j67956l5196J91707Q3245
11096A632j8863j46983n9162o5095N301J61233R5250n3748k08994Q1830Q5141
$$ y = [285307, 172062, 124372, 54796, 96733, 63577, 174512, -23244, -132423, -250280, -338991, -324430, -78360, -181871, -227318, -62960, 142235, 124094, 709, -80887, -117430, -354688, -214782, -151728, -106205, -122892, -103572, 52903, 1539, -159781, -76323, -1178, -31374, -26442, 158610, 29682, -91603, -169846, -35546, 121476, 167913, 175937, 79396, 70261, 45733, 131693, 214514, 235251, 133199, 111880, 223123, 285920, 227857, 103846, 202352, 244308, 237969, 88286, 34160, 62125, -86434, -154923, -105216, -115164, 102101, 44205, -74989, -157054, -113050, -41914, -52311, -70168, -238124, -273320, -81613, 1632, -17231, -164214, -223376, -288471, -283170, -121937, -26687, -80435, -289429, -207599, -122458]
11085a22458m7083j04985r6522J29189O3535L093o1301j41533J27698K55933J0
11074E576j23091N4284K0325M1801K8852p6776j50328L1820N4740J72905P0513
11063A30621J89657K30215j3621k47098k09268j43167J3325k2854j44519j6601
11053b33310j36934M8829K99884R3823o9753J58189k08120q0842J76190J66955
11043B14911o2843m1485q6958m1273j26951m478L1592R9333R4685p7739m4338
11032d5544j1916J65600N1882j07942Q031j18782q2459k3306k693K69873l443
11021I9301n1347l6273j15820r0706M1456M0164J58046k268R716o0226j2558L6775
11009A6260J23351M8315Q3191o0298j47202n2174K5471l0243J7320r4919M8208
$$ y = [-122458, -169541, -274526, -371048, -241859, -178324, -175231, -236532, -378065, -250367, 5566, 5576, -117515, -63231, -42906, -1105, 27747, -49029, -199357, -167537, -112797, 60108, 130621, 320278, 550493, 536872, 289774, 80506, -62661, -49336, -72190, -216709, -233310, -370244, -321415, -21531, 72292, 2539, 160728, -47392, -128234, 47956, 214911, 152068, 110583, 23625, -17648, -144599, -149077, -117485, -18152, 76533, -1206, -45544, -57460, 108140, 160022, 52080, 60111, -58671, -141130, -164436, -167129, 102744, 99301, 47954, 11681, -104139, -194845, -153389, -113225, 44821, 42553, 52269, -7957, -20515, 16260, 139611, 187926, 271117, 210819, 63617, 11443, 36914, 6671, 23991, -70928, -22720]
10998b2720P5998J58709R0396j26767j62049j38269J1345j7333J24942o1082P7435
10987A0605K05525J90959j13737n1737j23562j93214k0967M3087K1396j0470k367
10976d4482j74601j3613J6038J54311Q0964m0298k6226K702n9133j17686j4054
10965b36078O9407O293J07007m9229M5554r1766J5530J86104l9429j34792o2682
10954a84081n6382J98066J03048j05535k84582Q548P6557J46091J44433j24984
10944g8821j22501J26320K15440M5100n1637j57916J75817n5398k7649p1453K9769
10933B7071K7003q3758j35885J0014P0094K8554Q2291m640j31732j59001j35916
10922d05905J40297J29703K6521p8233J6447J46788J7901J4823j63198j1511j9243
$$ y = [-22720, 53278, 211987, 302383, 175616, 13567, -124702, -113357, -130690, -5748, -66830, 10605, 216130, 407089, 293352, 241615, 118053, -75161, -96128, -53041, -31645, -42115, -44482, -219083, -232696, -216658, -62347, 18617, -21681, -47907, -45205, -104338, -222024, -236078, -166671, -160378, -53371, -102600, -57046, -148812, -133282, 52822, 13393, -121399, -184081, -240463, -42397, 60651, -44884, -329466, -320918, -244361, -98270, 46163, -78821, -201322, -75002, 140438, 185538, 133901, -24015, 151802, 96404, 68755, -2698, 27071, 54074, -29684, -165569, -155555, -85461, -56907, 25384, 20744, -110988, -269989, -405905, -265608, -135905, -109384, -187617, -171170, -24382, -6481, 8342, -154856, -166367, -185610]
10911a85610p2363l5133M1256L9517P6397J90178L6253k24206j29346L6769j7435
10900b43723r930J85394p355j16530j1849R1103M0076o6407q6373r7174r1036
10889d13804L2997J61413k1930p1331J79101j6150q9852J33124J3474J7311L4851
10878d0796J08703r6101L6432J38163O0750j47189k0009Q9830R0299O9901k44786
10867D5197k31883L3184k5660r999J18112p8393N0717J29810K41825p3581j21061
10856G8268l8823L2298K2141l7744N4541K27387o4936J2456K3017l6249j33597
10845A38759o073k33277o5788J69183J36033k53996k16433J19883J87622J83864
10835A59777j30256j22399P331k02126o7438J38542K81964J26906m9005k4770
$$ y = [-185610, -257973, -293106, -251850, -212333, -135936, 54242, 90495, -133711, -263057, -226288, -243723, -253653, -68259, -75614, -192144, -203993, -112890, -72814, -139221, -225594, -322768, -413804, -380807, -219394, -241324, -312655, -133554, -149704, -239556, -106432, -92958, -75647, -40796, 67907, -28194, 8238, 146401, 207151, 59962, 39953, 129783, 220082, 289983, 45197, -186686, -153502, -179162, -189161, -71049, -149442, -98725, 31085, 272910, 199329, 78268, 39445, 71743, 93884, 56140, 110681, 338068, 273132, 285588, 308605, 272356, 138759, 132686, -100591, -166379, 2804, 138837, -115159, -331592, -211709, -24087, 159777, 29521, -92878, -85547, -287673, -355111, -216569, 65395, 192301, 143296, 118526]
10825A18526r1942n4866n1306o2741N2670J7490J27913J09289j3703p3889j11042
10814c3601L105L6790P6120O9029j2394j5578M4140k0159P8663J11630o4219n8507
10802B15019L1624k12916j71899q8886k4606J81708Q3971j14004P4042p680j50730
10791a84357j09429J33596K24430o404k293J38516J18562k6408j79261q1371r871
10780A5710m8247n3388J34804j59679p1466J35390L7585L214j0616m0174p8030
10769a34897k9739o442J70015L025m6774J84698K0181J616p2203j56469j37362
10758b04351J8853J15031L5321O8503J45188k08121j04482M3572R5644l7326P2006
10747C9838O5854r6502k60011j25729K30941P1299l308p9314M3836L8362J57373
$$ y = [118526, 26584, -28282, -79588, -142329, -89659, -72169, 55744, 165033, 151330, 77441, -33601, -30496, 6294, 82414, 151443, 139049, 123471, 167611, 147452, 226115, 337745, 273526, 215019, 246643, 33727, -138172, -227058, -251664, -69956, 14015, -99989, -25947, -33627, -184357, -293786, -160190, 64240, 57836, 55543, 194059, 312621, 286213, 106952, 25581, 15710, -32537, -85925, 48879, -110800, -182266, -46876, -9291, -6077, -16693, -56867, -134897, -164636, -171078, -1063, 1962, -44812, 139886, 160067, 161683, 89480, -66989, -204351, -185498, -70467, -35146, 33357, 178545, -29576, -134058, -90486, 5158, -32168, 39838, 105692, 9190, -250821, -376550, -145609, -74310, -77618, -156932, -113096, -74734, 82639]
10736H2639R072k05141j2767J11807P6144j08459j11095K47120J16634j52178
10726E3776L428R2438L0336J17806n0399j85814m1253n7764j58495m5763J16220
10715a25484Q2584n2484J6309P8090J15702j7330q2989j78183N868J31029n8446
10704h5334k18129Q3419J22245m9646J5779Q2158Q3078m0262l0214j37182j24851
10693b98939M9743N2070Q6167k7936p9714k7648K01967R0892P1899p0425o8550
10682b0474j04863n3844N6263l854R8923K5909q5158R3590j0786o885k64J25032
10670A13589Q9547j3140k19282j19941K29633J47776r8994P5404k7532j28679
10660D8381j9387O3252N4380J9908m7404l707J1529J9159j0417j17241j2483Q5344
$$ y = [82639, 91711, -113430, -126197, -14390, 61754, -46705, -157800, 89320, 205954, 53776, 57204, 149642, 179978, 297784, 247385, 61571, 20318, -37446, -195941, -241704, -125484, -42900, -95384, -79075, -985, 114717, 97387, 14398, -163785, -157917, -26888, -85334, -303463, -220044, -97799, -147445, -131666, -49508, 33570, -6692, -36906, -174088, -298939, -249196, -197126, -110959, -138895, -218609, -246257, -44290, 46602, 118501, 48076, -20474, -125337, -179181, -122918, -126772, -27849, -1940, -87098, 6492, -4294, -11179, -11443, 113589, 203136, 189996, -29286, -149227, 80406, 228182, 129188, 204592, 177060, 48381, 28994, 92246, 146626, 166534, 119130, 115423, 126952, 146111, 135694, 18453, 5970, 91314]
10648I1314K7973J2911M584q3990j18318K735K7788L0335p5257j12411Q9878N4096
10636d8362J01774o0518k3735m7028L3790J30683l6337N0931J1924J5333l3847
10625I4608m5684j48101N9322L5716J04480L8341k1470l9718O7027J40520o9157
10614B15884o392j21852O9773j3779O8745Q2277J16361l8108k9813j42913n1890
10603A48293K0216J59312O1663O5511n9419j18448j79998j23962O5745J41539
10593A80452j27289J32653r5295l65146J36369J98401J26181R9550j18448j98655
10583c1227n4501Q4226J57115j00364R2998L3491q7249k522k7604P5768m9844
10572I0287k2543Q7222m4464L3855Q0022k8299q6155j42995Q3619j801P2758r563
$$ y = [91314, 119287, 132198, 136782, 52792, -65526, -62791, -35003, -4668, -79925, -192336, -102458, -48362, 53412, -7106, -30841, -77869, -44079, 86604, 50267, 101198, 113122, 128455, 94608, 48924, -99177, -39855, -4139, 100341, 138682, 117212, 77494, 144521, 285041, 215884, 209492, 87640, 157413, 143634, 212379, 294656, 411017, 372909, 343096, 200183, 148293, 168509, 327821, 389484, 454995, 395576, 277128, 97130, -26832, 38913, 180452, 53163, 185816, 90521, -274625, -138256, 60145, 186326, 285876, 167428, -31227, -85728, -1502, 155613, 55249, 148247, 181738, 94489, 91967, 64363, 140131, 90287, 67744, 154966, 110502, 144357, 224379, 196080, 109925, -33070, 50549, 48748, 121506, 111943]
10560A11943j2372r4080j98454q8843R3919Q8939p4007M8410J03365r5162J8673
10549i7669j06330m058j37438J66842J30867K5649R0846Q9774j45450k0124M6438
10538C9347p7944j50721R104l3405j5844m2908j6156R6997R97o216Q6441k41213
10526c51521n7721P5214Q5267N9410O530J0249N9293K9816N8391j4986l9486o8214
10514a47758r2913m7262K839j9809J54579M0014P8396q3712j05856Q8035P7475
10503e5972q1098J87714p3255j93088L4771R0307Q689k1955L7032j37086J9261
10492a84680J11472k7912j867m2149O723R7633n9055j62512J448J18467L9159
10481a03273p097j50955r2553r221J56349Q9825j12051n9301j18197J10941N2376
$$ y = [111943, 99571, 5491, -192963, -281806, -187887, -98948, -172955, -124545, -21180, -116342, -97669, -203999, -208057, -345495, -178653, -47786, -22137, 68709, 158483, 13033, -7091, 39347, -38597, -189318, -180214, -213619, -229463, -272371, -288527, -191530, -190533, -196749, -110308, -351521, -409242, -334028, -248761, -189351, -182821, -172572, -113279, -83463, -25072, -40058, -79544, -147758, -240671, -287933, -285094, -304903, -150324, -110310, -31914, -115626, -221482, -133447, -55972, -137070, 50644, -22611, -215699, -180928, -90621, -81932, -103887, -66855, -203941, -184680, -73208, -101120, -102987, -145136, -138413, -40780, -99835, -262347, -260899, -142432, -103273, -110370, -261325, -353878, -363099, -206750, -116925, -228976, -288277, -406474, -295533, -243157]
10470b43157j25906l7835R853l5610M3779K20858J3287k007l9676r0521N4015
10459b32920L22697J70914p6044j27709L6649K02341J68056j71435p2949p3358
10449A46242M477j70079j56297J00318p8105j97817j4305J00536J42413m3026
10439a65643O9630M3319q395Q7242o1852J60888J60426j52705k64396J74318J27374
10428A70206j05015j97420O7701R6928O4425K0809r7180M620L3688k6276Q1585
10417A14071M503j55135j67009R9609K53297j7116o1312j33879l8466J31888r5777
10406f5326k79537J1449J57547r2278J320J45071k5098l7274O9623P3183R7889
10395E6569N4524M0844j54724j08582P1898k4816j89392n0989N4687P3688p6819
$$ y = [-243157, -369063, -406898, -397045, -432655, -388876, -168018, -154731, -156738, -196414, -286935, -232920, 89777, 260691, 184647, 56938, 93587, 295928, 463984, 292549, 219600, 146242, 150719, -19360, -175657, -75339, -153444, -351261, -365566, -265030, -122617, -165643, -96013, -52694, -61089, 26153, -35699, 125189, 285615, 132910, -131486, 42832, 170206, 65191, -132229, -64528, 32400, 96825, 117634, 20454, 25074, 58762, 32486, 114071, 118574, -36561, -203570, -103961, 149336, 132220, 70908, -62971, -101437, 30451, -65326, -344863, -333414, -175867, -268145, -266825, -121754, -146852, -184126, -114503, -41320, 56569, 111093, 151937, -2787, -111369, -39471, -64287, -253679, -304668, -249981, -176293, -253112]
10384b53112j07377M9908J28383J52738J46283J0818l2946j44219j06060k8828
10374a84412l8760k10905m789R3302J06279O4730q9847j03295R7128J13868r1875
10363b48576p8231j11642J0003J79900K19695m4748j35236l1940J51550l0730
10353a19955M8343j71305j0184J1183J0556P2836J11982k04656l5576k2887J61448
10342a48215J67963l7730q2849P1418O2760j94619m8083r6107J42101Q3047J42321
10331F2007J8329j93012j2988m1272J0352Q9525m76J07437o2789L0139K6124j14776
10319h1400k2053n7080K0697J22333j43359j52301J48311K74719J89046J06254
10309D05167j34936l08929l3035P7377j92413L2015Q2796J0475m3982J61253M4375
$$ y = [-253112, -360489, -310581, -182198, -29460, 116823, 127641, 94695, -49524, -155584, -184412, -223172, -434077, -438866, -345564, -239285, -174555, -264402, -367697, -270569, -156701, -248576, -326807, -438449, -428446, -248546, -28851, -73599, -208835, -240775, -89225, -119955, -71612, -242917, -253101, -241918, -231362, -158526, -46544, -251200, -286776, -309663, -148215, 19748, -17982, -100831, -29413, 33347, -161272, -209355, -305462, -163361, -80314, 62007, 80336, -112676, -125664, -166936, -156584, -67059, -67535, 39902, -22887, 7252, 33376, -81400, -103453, -160533, -139836, -17503, -160862, -313163, -164852, 109867, 298913, 405167, 270231, -38698, -71733, 5644, -186769, -154754, -71958, -61483, -105465, 55788, 100163]
10298A00163o2959j19534r0197J6549J30039K2567j27862m4965M3360J31640Q7697
10287H6498J52929m3796j21930r8176j29961l7873J24093J04573N160j32956k09747
10276c01186m5126K19194J11093o622l8593p4300P0977J04897j2691k38851O6239
10265a44969J72354J71029l3619k39290j52105R5481k0886K353r894J45051M5835
10254C1340o362N7942j12980j69062l1322K13798j7422Q7761J33844J03069l5606
10243B55000j15647m8139p4061j56370K5985J8753J29152J05841m0378j05394
10233e258m1090P9070k5494P4070M2881k51169p5798K17480J14705O1332j00916
10222H9813o4841n6476m3992n3457l078p7697j2986o2982l3410N3737J26375m1071
$$ y = [100163, 37204, -82330, -172527, -155978, -25939, -3372, -131234, -176199, -132839, -1199, 86498, 239427, 195631, 73701, -24475, -154436, -192309, -68216, 36357, 41517, -91439, -301186, -346312, -127118, -16025, -22647, -61240, -135540, -64563, 40334, 27643, -211208, -144969, 27385, 198414, 164795, -74495, -226600, -131119, -152005, -149652, -159546, -14495, 31340, 24978, 82920, -30060, -199122, -230444, -16646, -34068, 53693, 187537, 290606, 255000, 139353, 91214, 17153, -139217, -113232, -94479, 34673, 140514, 100136, -5258, -46348, 32722, 7228, 81298, 124179, -126990, -202788, 14692, 129397, 190729, 89813, 24972, -31504, -75496, -128953, -132031, -209728, -222714, -285696, -319106, -265369, -138994, -180065]
10210a80065k1294O3160J13484J94437n5027j12381j15434j4521K03898J14712
10200A90969l9260k15626j36141j572L9840K3369M0319M7756n0634J43418l8480
10189C958p7743q0653J19858O2939j19508j42109J00844J53433J63000o5787j91225
10178g2993n7090r6614R9897J00390j8170J42368J22721L7741L2387j40512p5243
10167G4882n9277j57967q0435M2605M2546j46800M9020J08507N7915J4869J17459
10156F3324M4896k3247n875K676J65321n7614j39710L7294m1408J7031m2893K4068
10144D3863n3637J43797l6595K6313q6402j12873o2659K0618J33608J57033m4403
10133A28663k21357j6014M8930j62469R1816j2546n1028J51212J29691J8251j1167
$$ y = [-180065, -201359, -138199, -24715, 169722, 114695, 2314, -113120, -127641, 76257, 190969, 151709, -63917, -200058, -201630, -161790, -138421, -98102, -50346, -100980, 42438, 3958, -73785, -154438, -34580, 28359, -91149, -233258, -132414, 21019, 184019, 118232, -72993, -130083, -226697, -126800, -26410, -44580, 97788, 220509, 258250, 290637, 150125, 74882, 15605, -142362, -222797, -180192, -137646, -284446, -235426, -126919, -69004, -54135, 63324, 108220, 84973, 79098, 81774, 247095, 189481, 49771, 87065, 45657, 62688, 19795, 43863, -9774, 134023, 97428, 123741, 37339, -75534, -138193, -117575, 16033, 173066, 128663, -92694, -108708, -59778, -222247, -130431, -142977, -194005, -42793, 86898, 105149, 93982]
10122I3982j93667r68J12358j9510Q4611J33289k51751j05255j5482O491L3544
10111a22358o8725K4657M9922j01757j65501R0683r8918o9388N0503K9992J45589
10100b35301J54275Q1146J6483J6203l8572j16683j07810R5897R5498j2357n0302
10089a01523q9416n5681J00836K49413l9118j22019N6117j22953j37510J1516
10079b50338m0151O1761J32119o0861O9953J47674K0673J18693K43676J56321
10069E99520j00202r1030J43773Q407J59632K10762Q2371j6326P4532K71648M19284
10058A762371P30224R36742J438779J821501K069550K638167L803545L153757
10050A8354636k452369n155699l735926k103103j344491q90735m15231j59842
$$ y = [93982, -99685, -100653, 11705, -7805, 76806, 210095, -41656, -146911, -162393, -155902, -122358, -191083, -166426, -116504, -218261, -383762, -293079, -391997, -461385, -410882, -380890, -235301, -81026, 120, 16603, 32806, -5766, -122449, -230259, -134362, -38864, -51221, -101523, -190939, -246620, -145784, 103629, 64511, -57508, -1391, -124344, -261854, -250338, -290489, -228728, -96609, -157470, -87517, 60157, 80830, 199523, 443199, 599520, 499318, 408288, 552061, 560468, 720100, 930862, 1013233, 996907, 1071439, 1343087, 1762371, 2492595, 3429337, 4868116, 6689617, 8759167, 11397334, 15200879, 18354636, 15902267, 10746568, 7010642, 4907539, 3563048, 2672313, 2257082, 2097240]
10042B097240j68063j56407j56621j86537j21498N4832j49208r2636N2477K6615
10032A200194k27320r5726K9863q6044j13978j60250L5934l59j32737j10447K0908
10021C60038K8438L2371N6577J4206J04068n5835r6628L6150k2253j9668m1519
10010C95945j09375J14762m6612N0011M4952m0322L0971j50742j80350J00235
10000B09475R2362j15462j14115J02115P8629K880O8149J78620j66152l40651
9990d150j23998J45690J68197k9209p8316M3026m976l3734K6748O5347J59698
9979C34323k5109j02225m9218R7046n527k9383j17957j69535R3755Q2540n1004
9968E7706p0911r3005j29759l5725J3112J88935j5232j14891J71175L00499p4215
$$ y = [2097240, 1929177, 1772770, 1616149, 1429612, 1308114, 1362946, 1213738, 1121102, 1173579, 1200194, 972874, 877148, 907011, 820967, 706989, 546739, 582673, 582314, 449577, 339130, 360038, 388476, 420847, 477424, 491630, 595698, 539863, 443235, 479385, 457132, 437464, 395945, 286570, 401332, 354720, 404731, 449683, 409361, 440332, 289590, 109240, 209475, 301837, 186375, 72260, 174375, 253004, 255884, 324033, 502653, 336501, -4150, -128148, 17542, 185739, 156530, 78214, 121240, 116264, 82530, 109278, 174625, 334323, 309214, 206989, 157771, 254817, 249290, 219907, 101950, -67585, 26170, 108710, 57706, -13205, -106210, -235969, -271694, -258582, -69647, -84879, -199770, -28595, 271904, 197689]
9957A97689m1183j35322j26872L11983J58764j42478m7228k25554l53786Q9787
9947c14200k051N4476K15927K013j17012K12677O068J60170k0584k3228J346j11625
9935F3977j87800o2001K45084p606m280j21235R5131j23759k39046P2203J66961
9924a02371K7692j05379J05799l844j47715o688J43750J29588M0121J5904j74367
9913g7510P8419q5089j74849N3392L9081O6359M5246M590j20609n1214j4774M7888
9901a89070K52310M9473j85080j77209j40603J11326N7063k6749j1012K4830J40542
9890i4179P0884o4709o46L6580m9446j00801j6888M718j07779R6437K03720K17316
9878A95207j3694j24584j77808j13942O3358K63391M2715J5386M810k17149o3594
$$ y = [197689, 156506, 21184, -105688, 206295, 365059, 222581, 175353, -50201, -403987, -314200, -316251, -261775, -45848, -43835, -160847, 51830, 57898, 218068, 197484, 174256, 175602, 63977, -123823, -185824, 59260, 51654, 47374, -73861, 21270, -102489, -341535, -269332, -102371, -74679, -180058, -74259, -78103, -225818, -232506, -88756, 40832, 80953, 96857, -77510, 909, -84180, -259029, -205637, -166556, -100197, -54951, -50361, -170970, -222184, -236958, -189070, 63240, 112713, -72367, -249576, -390179, -278853, -221790, -248539, -259551, -234721, -94179, -23295, -88004, -88650, -52070, -101516, -202317, -219205, -214487, -322266, -225829, -22109, 195207, 181513, 56929, -120879, -234821, -171463, 91928, 134643, 150029, 154839, -62310, -125904]
9867a25904K39797L94j39790K34J76217O2125j06071O670K6829K6963K3994j89497
9855A961L9560L1934N2933j32441O7045L3525Q6706J80997j95737k20702n2852
9844a07071k4383R6702O4456j8537j44809L5637J18938K7412j41714J18173l9416
9833a4612Q1851O6167J28229r8800r8657q0239j26290K6596j6332J743M0825R8312
9821H793O3373l6144n9416M8279N526L9313n8223R9786O0687L2937M9453l5236
9809B19128j67982l5298M7479J03740K28693j79138m6931N5453n2532K1140p8273
9798A15479j04912Q1770N6645j21023k21751J43898P7290J00420M3082k25053
9788e4155K128R7693N6440l5915k08980j32379J99715M8511l7095O8588m2587
$$ y = [-125904, 113893, 114287, -25503, -25269, 150948, 213073, 107002, 113672, 140501, 167464, 191458, 1961, 41521, 73455, 126388, -6053, 60992, 94517, 181223, 362220, 166483, -54219, -107071, -131454, -34752, 29704, 11167, -133642, -98005, 20933, 48345, -93369, 24804, -14612, 67239, 133406, 261635, 162835, 64178, -16061, -142351, -115755, -132087, -130344, -89519, 8793, 72166, 36022, -23394, 24885, 30411, 69724, 11501, 111287, 171974, 204911, 254364, 219128, 51146, 15848, 63327, 167067, 395760, 216622, 169691, 225144, 172612, 193752, 115479, 10567, 92337, 148982, 27959, -193792, -49894, 27396, 127816, 170898, -54155, -52027, 45666, 102106, 66191, -142789, -275168, -75453, -26942, -64037, 4551, -38036]
9777c8036m70J3394j05314j8429J36173J76045k8243j62958j43017j54301p700
9766c32856M4123N2318L8318o6694J26634o6275j06241K8752J51372J30785n752
9755e516L5725n6282O248J31792K6186J4298m2614m4945o7662J755L1114l8736
9743h637O4664Q8510j27253q4633j11881p7831N2898J42082Q5506j00150j37129
9732b13854L4500m8401j23961K5132J34825K2423J85691N999j22732J44664K8455
9721G2741j13707K980R5074L7890q8298q8087M280J28256O3337j65192j2154m7707
9709a10587k9623L7825o298P0618Q8395K2237Q2796j47816Q681J28277R1165J04362
9697C40032q1613l02554j00317q5327J03263K69056q3785j64227o8198J21151
$$ y = [-38036, -38506, -25112, -130426, -148855, -12682, 163363, 135120, -27838, -170855, -325156, -332856, -288733, -236415, -198097, -264791, -138157, -204432, -310673, -281921, -130549, 236, -5516, 30209, -26073, -19825, 111967, 138153, 152451, 109837, 64892, -2770, -1015, 30099, -8637, 56027, 144537, 17284, -67349, -179230, -257061, -204163, -62081, 23425, -76725, -213854, -179354, -227755, -351716, -326584, -191759, -169336, 16355, 22354, -100378, 44286, 72741, -40966, -37986, 57088, 94978, 6680, -81407, -77127, 51129, 114466, -50726, -62880, -110587, -140210, -102385, -108683, -38065, 50330, 72567, 155363, 7547, 16228, 144505, 235670, 340032, 258419, -44135, -144452, -229779, -126516, 142540, 58755, -105472, -173670, -52519]
9687e2519j9968k03830L0974P3030K8102Q9258n3327j12226q2734K29697J23509
9676D9966j46539j01023l4667p7568K907J11314J46568L7766q195j37209k05569
9665c62249j56460J40862K62810m196k4845J91049J11631j10050j12913m8029
9655a12390J24204N6129j07210R2740J8507L8602k4006m7911k5317J00310J7298
9644A30956r1641m9363R1196J45850j16125k02516L976J16598J55049n957k48545
9633g0522Q3531K01030L7097q2207j04963m1777k4544o5909J05276O9425K2038
9622A28475j39687n3363J67089K05433j24439k68074o4523N2827J73857P2255
9612A49850n095o3980r1965m2689R4433L3429K7029O0657O0527R3166q1453j31863
$$ y = [-52519, -72487, -276317, -245343, -172313, -144211, -54953, -108280, -220506, -303240, -73543, 49966, -96573, -197596, -232263, -309831, -306924, -195610, -49042, -11276, -19471, -156680, -362249, -518709, -377847, -115037, -119233, -144078, 46971, 158602, 48552, -64361, -112390, 11814, 67943, -39267, 53473, 71980, 110582, 86576, 38665, 13348, 113658, 130956, 39315, -10048, 81148, 226998, 110873, -91643, -87667, 28931, 183980, 178023, -70522, 13009, 214039, 251136, 168929, 63966, 22189, -2355, -68264, 37012, 106437, 128475, -11212, -64575, 102514, 307947, 183508, -84566, -149089, -96262, 77595, 149850, 144755, 80775, -11190, -53879, 40554, 73983, 101012, 161669, 222196, 315362, 233909, 102046]
9600A02046J17224q5163k55590q7968J5850Q3915r8658j03327p418P506K9489
9589b82094Q4449O7204J13748o9912j51058l0908J90521R3367j11878K5821J38817
9578F8077o5364r3971k8672J35507J3389l4927j36168r3942p585K22148p4479
9567i5987p7830J1046J70860K46501J55605k06726k69027o7402j52587m0172Q4061
9556b41658J43311k3089m0646J82756P1642K1885J6078j10929n6596o838m4731
9545h8815j0171L8916L8827j61491j26464L4264n0940L9555J46774K10926l1423
9534C9958j45131o6289M2009J65020r6465J1779q9987o3058N1087j6077O1853
9523a05301m2338k49n3317j11678O3626J32031J97925k2781l4369o5752j65131
$$ y = [102046, 219270, 134107, -121483, -209451, -193601, -109686, -208344, -311671, -319089, -311583, -282094, -197645, -130441, -16693, -86605, -237663, -268571, -78050, 15317, -96561, -70740, 68077, 2713, -91258, -119930, 15577, 28966, -5961, -142129, -236071, -243656, -21508, -95987, -173817, -162771, 8089, 254590, 410195, 203469, -65558, -132960, -285547, -325719, -241658, -98347, -121436, -162082, 20674, 92316, 114201, 130279, 19350, -37246, -44084, -88815, -98986, -60070, -21243, -182734, -309198, -274934, -325874, -286319, -139545, 71381, 39958, -105173, -171462, -129453, 35567, -60898, -49119, -139106, -202164, -151077, -167154, -105301, -147639, -147888, -201205, -312883, -249257, -117226, 80699, 57918, 23549, -42203, -207334]
9512b07334j36890J1609j3829o342q2830M0009O25J71254J84470J11179k9226
9501D2695j29399p4731q4788K29451m9845j7875Q5253k569p2716k4976J78776
9490G9276L0661l7776J21099p7304j49719k8330r6137K9015m513K49059l1356
9479H3975n4498l7210M3657J17496m3688n6397J3748j44983K6199M7675J4053
9468A0027k5346j06070R7L9304K321q9251p0425M586L1381O9360r0675j42417
9456c67108M6476Q2992J84721M6583k1342j67414j50182N1540K12604J48191r7424
9445c0363j7274J99348o1869j9838j83589l03515l4781N0849L8715J49449L203
9434b09665J23667J23720R6047J9871p2807J5037J36940N2253q674j59882k02807
$$ y = [-207334, -344224, -332615, -346444, -352786, -435616, -395607, -394982, -223728, -39258, 71921, 42695, -86704, -161435, -246223, -16772, -66617, -84492, 761, -1808, -74524, -99500, 79276, 109937, 72161, 193260, 115956, -33763, -62093, -158230, -129215, -133728, 115331, 83975, 29477, -7733, 35924, 153420, 109732, 53335, 67083, -77900, -51701, -4026, 10027, -15319, -121389, -121292, -81988, -79667, -168918, -239343, -234757, -203376, -134016, -224691, -367108, -320632, -237640, -52919, -6336, -27678, -195092, -345274, -293734, -81130, 67061, -30363, -47637, 151711, 89842, 70004, -113585, -417100, -451881, -401032, -362317, -212868, -209665, -85998, 37722, 133769, 153640, 80833, 95870, 232810, 285063, 276389, 116507, -86300]
9423h6300P9794J18337o6134m0047J01261r7400L2362J6012j01575J13073R4778
9412A64161r979j78143J796J96879N1777n7899q0983k5161l5867p4114r0357k7603
9400a65493J8293l7504J08452J68567r621k13732n2121j30487L2624J89930O0833
9389c0259K50167l7074j46997r0797j3728L622P3694J00159J48025m6439J15991
9378C26364Q226j30186P0600K2068n3960K2414K0689j08316o3175q4060j6726
9367A3938Q23k533j50105q106M9871n1332j4767m3303K6619J82275K075l2000
9355b6545o4423K6848p723l9996K3607j36702m341l4901J38700J63037J91317
9344B28878j03539j39718l6615J07932k1565p224o108o8401K1761O3008Q9006
$$ y = [-86300, -6506, 111831, 45697, 5650, 106911, 9511, 41873, 57885, -43690, 69383, 164161, 154182, -23961, -22165, 174714, 226491, 168592, 87609, 62448, 26581, -47533, -137890, -165493, -147200, -184704, -76252, 92315, 82694, -131038, -183159, -313646, -281022, -91092, -30259, 219908, 182834, 35837, -54960, -68688, -65066, 8628, 108787, 256812, 210373, 326364, 334590, 204404, 275004, 297072, 243112, 265526, 286215, 177899, 114724, 30664, 13938, 14761, 12228, -137877, -145983, -96112, -147444, -162211, -205514, -178895, 3380, 5455, -26545, -90968, -64120, -71843, -111839, -88232, -224934, -229275, -264176, -125476, 37561, 228878, 125339, -14379, -50994, 56938, 35373, 28149, 22041, -46360, -24599, 38409, 127415]
9333A27415q4453j68798O8602q632L9146m5178J30450K33738P3614r1559j73500
9322A00845k80867N9242O3658N3653j3764Q3341l0227j9861k3698Q3919L3445
9311A09686j97049N0371O871l3940J96440N0408L3549j30054j09667l6475O068
9300e3792M33L8092O8740j9433J15708J17548q1581j06109m1990l131j4605J1625
9288C1505p9835o0270P0072Q5113o8580m9265j06620j34198O8698P7309J59599
9277f472N1996k6904q978j11377j16243J97213m8540j21463K76902J23893Q5253
9266B95280j4958m1402K4244J43021o2771j77957O8642N3235L2589j39848K8779
9255B08854J56257R6424r1994j88389k8965K5986J18655Q2779j27593m8232r5763
$$ y = [127415, 42962, -125836, -57234, -65866, -26720, -71898, 58552, 292290, 365904, 274345, 100845, -180022, -120780, -57122, -3469, -17233, 66108, 35881, 16020, -7678, 76241, 109686, -87363, -36992, -30121, -64061, 132379, 182787, 216336, 86282, -23385, -59860, -53792, -53359, -15267, 53473, 34040, 149748, 267296, 185715, 79606, 37616, 34485, 19880, 31505, -48330, -108600, -38528, 46585, -21995, -71260, -177880, -312078, -243380, -166071, -6472, 45524, 18620, 9642, -101735, -217978, -20765, -69305, -190768, 86134, 210027, 295280, 280322, 238920, 263164, 406185, 343414, 165457, 234099, 287334, 319923, 180075, 208854, 365111, 461535, 369541, 181152, 152187, 178173, 296828, 379607, 252014, 203782, 108019]
9244A08019J53709R7379k13452n2645M7577J20710j6923J54247J11179j6944K1449
9233E14305j49030q3632r2951k8078o0974l256J5381J49628J39197n1563j9348
9222C29679n0485k3883p0552P1760L7617L9312M8638J81748K0433l15429n0602
9211B18236J00834O0394J76832o2960k38819l871l6737q1240K18152n5915K9527
9200C24433J7717Q0835J39788J07752J583q8487m9780J11513Q4574N8493J7233
9189H05654j2106J18303R2041j25191m3722P0949M4352J76537J66652J14992K00126
9178A608587L98854J48359l3895k857j48803l38848k64643q0848J20602J23083
9168A529591j36029j50059J30828p4055k6815P7604J51106P0977K5851J34905
$$ y = [108019, 261728, 359107, 145655, 93010, 140587, 261297, 244374, 398621, 509800, 492856, 514305, 365275, 281643, 188692, 160614, 99640, 96384, 111765, 261393, 400590, 349027, 329679, 279194, 255311, 184759, 256519, 294136, 333448, 382086, 563834, 584267, 268838, 218236, 319070, 379464, 556296, 493336, 254517, 250646, 213909, 132669, 350821, 294906, 324433, 342150, 422985, 562773, 670525, 672108, 583621, 533841, 645354, 729928, 788421, 805654, 793548, 911851, 1003892, 878701, 834979, 905928, 950280, 1126817, 1293469, 1408461, 1608587, 2007441, 2155800, 2121905, 2119048, 1970245, 1631397, 1366754, 1285906, 1406508, 1529591, 1393562, 1243503, 1374331, 1300276, 1273461, 1351065, 1502171, 1573148, 1598999, 1733904]
9158A733904Q1100N723J12650K13568P7626N7596J46491J58860L67305K66619
9148C221442K56412K46744P084j33800k32902J3418J63411J40566J64003K43528
9138D089906K31051L73691L32554M34019M41776N59381O38403M37833o73j92472
9128G345469j74952K44396K31245L40558L06935J28109L07475N09336N63850Q01036
9118A0603457P91945O24382Q60224P36525O18711O72189P58670P69851O31063
9109A7067017P38653R09943M84615L89899N61898M12948L96018J97918l49142
9100B0809767q68848q61544q72714r28166r69962q58393o21837n94413o81714
9091A3552176p80415m51433k92771k81611m04545o27838n94572o37028o20885
$$ y = [1733904, 1815004, 1820727, 1933377, 2146945, 2224571, 2282167, 2428658, 2587518, 2954823, 3221442, 3477854, 3724598, 3731682, 3597882, 3364980, 3378398, 3541809, 3682375, 3846378, 4089906, 4320957, 4694648, 5027202, 5461221, 5902997, 6462378, 7100781, 7538614, 7537941, 7345469, 7170517, 7414913, 7646158, 7986716, 8293651, 8421760, 8729235, 9238571, 9802421, 10603457, 11395402, 12019784, 12880008, 13616533, 14235244, 14907433, 15666103, 16435954, 17067017, 17805670, 18715613, 19200228, 19590127, 20152025, 20564973, 20960991, 21158909, 20809767, 19940919, 19079375, 18206661, 17278495, 16308533, 15450140, 14828303, 14233890, 13552176, 12771761, 12320328, 12027557, 11745946, 11341401, 10713563, 10118991, 9481963, 8861078]
9082H861078o56237n16873l68078l01992k20105k23360m27813j58732j72771m27430
9072E387687m16715m43485k43519p6492k3285K8344j04429j57587k95691L357
9062C658185k3787k53684J5782L40151K37557J82259N8519j88058k50391l10687
9052C465846k21911j32334k92570j82336j9165j06026o907O05m0189j29556j20933
9041B214524M4184l917q9571j39136j32393j10042n8559j31878m1652r5736r1782
9030A364042J31602J74626o3049r0149q3706p9075j64713r1002K3336K18928Q8055
9019A428895l0130p1536l0110J796k552j45533j21472p1523j16068L0946j0597
9008H62116n40r102k3145K6504L7318L1332J59834j47490l2083p090K76498J10073
$$ y = [8861078, 8204841, 7687968, 7319890, 7017898, 6797793, 6574433, 6146620, 5987888, 5815117, 5387687, 4970972, 4527487, 4283968, 4207476, 4184191, 4212535, 4108106, 3950519, 3654828, 3658185, 3634398, 3380714, 3396496, 3736647, 3974204, 4156463, 4214982, 4026924, 3776533, 3465846, 3243935, 3111601, 2819031, 2636695, 2617530, 2511504, 2504597, 2505202, 2465013, 2335457, 2214524, 2258708, 2254791, 2165220, 2026084, 1893691, 1783649, 1725090, 1593212, 1551560, 1455824, 1364042, 1495644, 1670270, 1607221, 1517072, 1433366, 1354291, 1189578, 1098576, 1121912, 1340840, 1428895, 1398765, 1327229, 1297119, 1298915, 1296363, 1150830, 1029358, 957835, 841767, 872713, 862116, 861576, 852474, 829329, 855833, 893151, 924483, 1084317, 936827, 904744, 897654, 1174152, 1284225]
8996A284225j05043j31031k7137j75371K0111O57p0818K72646K42798j0623j04707
8985A195707K4460r47j2237k02030k44695Q3784l3132m8171j8100n1904m0456
8974F52279q9787n958m2723M7149M6283J27101L8021p6494k0170j18644R3966
8963F51023J87295j49352o3147m8419j61186K17047J81774M3088m0299J00374
8953I18198k331m7487P0159J35001o4991j11214k05550N6345n748P2358J31742
8942I46482o00j9854k0295r0267j40995J02463J64564k6266l9548p7351n6001
8931G42332j30947l273O4840j2730m6324J52435P417k0912k1074j16763j75971
8920D39030N07M5261j97324l4969K9424l475J25961N6948J60748Q2788k9682K4131
$$ y = [1284225, 1179182, 1048151, 1021014, 845643, 865754, 866411, 795593, 1068239, 1311037, 1300414, 1195707, 1220167, 1219220, 1206983, 1004953, 760258, 844042, 810910, 762739, 744639, 692735, 652279, 562492, 556534, 513811, 560960, 607243, 734344, 772365, 695871, 675701, 557057, 651023, 838318, 688966, 625819, 577400, 416214, 633261, 815035, 858123, 817824, 918198, 915867, 868380, 938539, 1073540, 1008549, 897335, 691785, 748130, 742382, 814740, 946482, 945882, 926028, 905733, 815466, 674471, 776934, 941498, 915232, 875684, 798333, 742332, 611385, 608112, 672952, 660222, 613898, 766333, 773750, 752838, 731764, 615001, 439030, 439537, 484798, 287474, 252505, 281929, 278454, 404415, 461363, 622111, 704899, 675217, 699348]
8908F99348n0992J00627K9330K6445q4461R5025J39962J7811j48717q3461j6856
8897G24061J40912j22914j13922J81865J58278J58244P9488j67411j39103n9077
8887H40421j39031N1419J10140k5923k44907j54068J65294L1235P235J10854J35170
8876H87839N7652o888r9783K0857k09860N3618k9469Q3273M7944j8177N5574L20905
8864A163485J54782R7558J36622L8972j26237j31003j16041j67358o4863q2066
8854I03851j26969L49708J14580Q5009J06646J5627O6083J38407J57498J85237
8844A995677k3328j56058j07713j01591L7251J53186L2155q7573J04639J24493
8834A971138L3942Q4316K12937M4699k4143n441m834J5544N4310p9271K39658
$$ y = [699348, 648356, 748983, 778313, 804758, 720297, 815322, 955284, 973095, 824378, 740917, 724061, 864973, 742059, 628137, 810002, 968280, 1126524, 1206012, 1038601, 899498, 840421, 701390, 752809, 862949, 837026, 592119, 438051, 603345, 634580, 641815, 752669, 887839, 945491, 938603, 838820, 859677, 649817, 703435, 673966, 757239, 805183, 787006, 842580, 1163485, 1318267, 1415825, 1552447, 1591419, 1465182, 1334179, 1218138, 1050780, 985917, 903851, 776882, 1126590, 1241170, 1326179, 1432825, 1448452, 1514535, 1652942, 1810440, 1995677, 1972349, 1816291, 1708578, 1606987, 1644238, 1797424, 1829579, 1742006, 1846645, 1971138, 2005080, 2089396, 2302333, 2347032, 2322889, 2317448, 2312614, 2328158, 2382468, 2303197, 2542855]
8823B542855K18496M1118P6926L7632n37J43339J50545Q2387M2515J94856j06876
8812C423256n7932J16235J83267J70065K09303M14187K07614J49010L03564M09907
8802E528476N80455N98699M46591N97200N58436O90106Q12228J132517J193592
8793A2138300J384688J783272K317014K557807L009318L798500M841693O766789
8785C8597381R300006J2434851J6420617K0633689K5258277K9840925L4114676
8778A86600422L0158564M519961k8877539m1841635l5837561k5406041j6769596
8771G2546575j0895923p813882n555290m113271k798880j787577j094889n87670
8763C7899193k46400o5949m276O04061J194587J589312K353310L620659M840025
$$ y = [2542855, 2761351, 2802469, 2879395, 2917027, 2916490, 3059829, 3210374, 3292761, 3335276, 3530132, 3423256, 3365324, 3481559, 3664826, 3834891, 4044194, 4458381, 4665995, 4815005, 5118569, 5528476, 6108931, 6707630, 7154221, 7751421, 8309857, 8999963, 9812191, 10944708, 12138300, 13522988, 15306260, 17623274, 20181081, 23190399, 26988899, 31830592, 38597381, 47897387, 60332238, 76752855, 97386544, 122644821, 152485746, 186600422, 216758986, 221278947, 192401408, 150559773, 114722212, 89316171, 72546575, 61650652, 53836770, 48281480, 44168209, 41369329, 39581752, 38486863, 37899193, 37652793, 37586844, 37582568, 38186629, 39381216, 40970528, 43323838, 46944497, 51784522]
8754E1784522P125969R794063J3707255J8306141K3049629K8182151L3877518
8747A85827248L9570406L4689089L767819l1049648l8888852k7229156j2320438
8740A54366468Q67473J2910388K4433950L5669932M6596952N7618639P1149086
8733D03612888O8618809Q530759p0608776r4482592p7100609n3255630l4658564
8726A50656285k2370025j5703301j1704037q659213o303591m568403l155985k388623
8718G5803107j768004j184845q20029j99819O11548J821730K963057M485345P293889
8709H9005979J1055179J5841062K2632808L1074259M0826951N1070282O1270866
8702C22777386P5314930P9941330K4815736o6104417r8638658p8018273m9837534
$$ y = [51784522, 58910491, 68704554, 82411809, 100717950, 123767579, 151949730, 185827248, 225397654, 260086743, 263854562, 232804914, 193916062, 166686906, 154366468, 155233941, 168144329, 192578279, 228248211, 274845163, 332463802, 403612888, 472231697, 480762456, 410153680, 315671088, 238570479, 185314849, 150656285, 128286260, 112582959, 100878922, 92219709, 85916118, 81347715, 78191730, 75803107, 74035103, 72850258, 72030229, 71830410, 72441958, 74263688, 77226745, 81712090, 89005979, 100061158, 115902220, 138535028, 169609287, 210436238, 261506520, 322777386, 398092316, 478033646, 502849382, 436744965, 338106307, 260088034, 210250500]
8695B10250500k7911243j1969526o73086Q213325J5346814K1257201K6734820
8688B41248805K4889132K520378k9977688m4030570l9175416k8762943j9808047
8681A06903651j3786954r979517p459764n572112m640741l627008k758111k265815
8673E6813629k045338j592147j252759r18872l76140J86183P30513J550984K821260
8664E5917313M556413O592925R368271J3082838J7594209K2209330K6637742L1796847
8656A87755888L4036270J7243897k0407665m3970855m1876426l0719485k0352920
8649H1708704j3256671r097875o387190m749179l736533k903135k497349k042078
8641C7038694j728699j867429j876547j801879j886450j669877j306187j161939
$$ y = [210250500, 182339257, 170369731, 169696645, 177909970, 193256784, 214513985, 241248805, 266137937, 268658315, 238680627, 194650057, 155474641, 126711698, 106903651, 93116697, 83137180, 75677416, 70105304, 65464563, 61837555, 59079444, 56813629, 54768291, 53176144, 51923385, 51004513, 50628373, 50814556, 51545069, 53096053, 55917313, 60473726, 67066651, 76434922, 89517760, 107111969, 129321299, 155959041, 187755888, 221792158, 239036055, 218628390, 174657535, 132781109, 102061624, 81708704, 68452033, 59354158, 52966968, 48217789, 44481256, 41578121, 39080772, 37038694, 35309995, 33442566, 31566019, 29764140, 27877690, 26207813, 24901626, 23739687]
8633B3739687j028367q55054q56192q54505q77523o60465n56019n06077n67039
8624A6978446p21493n31040m01406k40197l50330k83583l32354m10768n31302
8615A3175973l07546q5584j51954k45492l50377l18107k42187k15028k07233l05271
8605A0747194n33217l39053k10277j88242k74242o8174q6020j40311l00493k50649
8595H356516j76773k44838j10122j50330k71070m5033p5109q0455j45715k08630
8585F848441k96074k08535r3249k96875j21791n0054k4562J61123J5958n7595
8575E876787q8538j35903j55665n1041l2503l12905k25694k72511J4103K8053
8565D644183P1731J54067l872j02523j73205j79041k2803n3828j45773j4192j17958
$$ y = [23739687, 22711320, 21856266, 21000074, 20145569, 19268046, 18607581, 18051562, 17545485, 16978446, 16256953, 15725913, 15324507, 15084310, 14733980, 14450397, 14118043, 13707275, 13175973, 12868427, 12782843, 12630889, 12385397, 12035020, 11716913, 11474726, 11259698, 11052465, 10747194, 10213977, 9874924, 9664647, 9476405, 9202163, 9133989, 9047969, 8907658, 8607165, 8356516, 8179743, 7934905, 7824783, 7674453, 7403383, 7358350, 7283241, 7202786, 7057071, 6848441, 6552367, 6343832, 6250583, 5953708, 5831917, 5781863, 5757301, 5918424, 5934382, 5876787, 5788249, 5652346, 5496681, 5445640, 5413137, 5100232, 4874538, 4602027, 4616130, 4644183, 4715914, 4869981, 4866109, 4763586, 4590381, 4411340, 4388537, 4334709, 4188936, 4174744, 4056786]
8554D056786k13165j62713p4795m7594k8547p1980k6304o54J955j89722j90937
8543C052330q5194j17624q8232J19772o2642Q9379q2567P8968n2471o2186m8388
8532B741145m1165l6366l4857L9793L0793J74380k0224o9140J9049J03792j832
8521B905368P6503J71241J39691J88599K64946K42021k50867n77043m45610m61910
8511B252939j94815j8490K8865Q8897l8925N6643Q6288j99527j36099j83013j96761
8500A546002r2457K6599L4173k7294Q6853J93949n949p534j52747l3684j4804
8489A553107m8083p3929k5659n1035K4748l8232J8033J05531N8743K56391K84307
8478B063922K06362J91728J62171L08524L25660K76059O99169M68578j57548o94037
$$ y = [4056786, 3843621, 3680908, 3606113, 3558519, 3529972, 3457992, 3431688, 3431034, 3432989, 3243267, 3052330, 2967136, 2849512, 2761280, 2881052, 2818410, 2907789, 2825222, 2904190, 2851719, 2789533, 2741145, 2699980, 2663614, 2628757, 2668550, 2699343, 2873723, 2853499, 2784359, 2803408, 2907200, 2905368, 2981871, 3153112, 3292803, 3481402, 3746348, 3988369, 3737502, 3160459, 2714849, 2252939, 2058124, 2039634, 2068499, 2157396, 2118471, 2175114, 2261402, 2061875, 1925776, 1742763, 1546002, 1453545, 1480144, 1514317, 1487023, 1573876, 1767825, 1761876, 1754342, 1601595, 1567911, 1553107, 1505024, 1431095, 1405436, 1354401, 1379149, 1340917, 1358950, 1464481, 1523224, 1779615, 2063922, 2270284, 2462012, 2624183, 2932707, 3258367, 3534426, 4233595, 4702173, 4544625, 3850588]
8468C850588p03747o98096n42342k83194j67242r6110J3870P8023K03M4793l4562
8457A462184k16465o2020j52414L3739j3084o1110o6412k1707l2382N4630M5421
8446I70380M0075n643N8614k3353j90661K4724o9198p8613K18692J20062r6046
8435I69033L7270l9067J36296k7991Q6842L18618J82719J02848J39206J25864
8425B031638q9278l10528j74645l28656j91987R4333k2667p1733j48669N9261
8415H47069O0399j51657o1862J6679j9713j05865k8769P859J46065l7927j56212
8404E16066k29829l6946M2505J97182k9035l4382J53989m2719j22999R0141O6120
8393E70093P7549j02069o7593M1892R5468L0961O9967j3015k02925j46332N4919
$$ y = [3850588, 3146841, 2448745, 1906403, 1623209, 1455967, 1359857, 1373727, 1451750, 1451953, 1496746, 1462184, 1245719, 1183699, 1031285, 1065024, 1051940, 990830, 924418, 902711, 870329, 924959, 970380, 1010455, 1004812, 1063426, 1040073, 849412, 874136, 804938, 726325, 945017, 1065079, 969033, 1006303, 967236, 1103532, 1075541, 1162383, 1481001, 1663720, 1766568, 1905774, 2031638, 1942360, 1631832, 1457187, 1128531, 936544, 1030877, 1008210, 936477, 787808, 847069, 907468, 755811, 693949, 710628, 690915, 585050, 556281, 564140, 710205, 672278, 516066, 286237, 249291, 291796, 488978, 459943, 425561, 579550, 536831, 413832, 503973, 570093, 647642, 545573, 477980, 519872, 615340, 646301, 716268, 703253, 500328, 353996, 408915]
8382D08915K6229J79384J61624J27067J60352J98207P5867J42065L05564K223
8372A787497j87205k27918l34161j05041q8205J9154o6763r4650j90868m7492
8362D64348M7731L0808o1640m5684O9073J24574N7688J21132k058K7955j31873
8351G02054j83126L2047P0652N204k5007K42136N53J03873J36861J22806K0236
8340A228289R4828L54712Q5753n3731q1945j41488q7287R0474L42941J97118K13121
8329B242785K38899L01969o7398m41114l57927l44813k11908k75882j79342O756
8319I12025j05576j51589K7826Q4069r028Q4932j31372j86910j17247J05285M2619
8308E55034r893R285J15062J55627J7711M2389R4843J09203R2351J85478K34989
$$ y = [408915, 435144, 614528, 776152, 903219, 1063571, 1261778, 1337645, 1479710, 1785274, 1787497, 1600292, 1372374, 1038213, 933172, 844967, 864121, 797358, 702708, 511840, 464348, 512079, 542887, 481247, 435563, 504636, 629210, 686898, 808030, 805972, 833927, 702054, 518928, 550975, 621627, 626831, 601824, 843960, 844513, 948386, 1085247, 1208053, 1228289, 1323117, 1677829, 1763582, 1709851, 1627906, 1486418, 1399131, 1489605, 1832546, 2029664, 2242785, 2481684, 2783653, 2716255, 2275141, 1917214, 1572401, 1360493, 1084611, 905269, 912025, 806449, 654860, 682686, 766755, 757727, 842659, 711287, 524377, 407130, 512415, 555034, 545141, 554426, 669488, 825115, 842826, 885215, 980058, 1089261, 1181612, 1367090, 1602079]
8297A602079K86365J73543L90900L66860P6587m14083m04688k94452k24473p6674
8287A481964l4274m8480J15258J03984J30134p7204k14432j83410k49509l26648
8277F97383m9910K73601o2261q0677O811o2913n0684N5832M2091K4284l567j8490
8265G71500r1474j28424j27576n0855q1521J8148O2972K1689l8960K09017J12478
8254F76994J29117N210J41586J82438J34639j2634j14231j30749k23140j03188
8244F86042j70180j03339O0839k76r7216j85865j55824J06109J41039l9319j24821
8233A17189N7016P8160J8196J22677O8406M665j27953o0962J13842r2778Q1620
8222C80078P8229J31959j73055j92894l7044P9306R3224p4215J07751L4333j50116
$$ y = [1602079, 1888444, 2061987, 2452887, 2819747, 2896334, 2482251, 2077563, 1783111, 1558638, 1481964, 1447690, 1399210, 1514468, 1618452, 1748586, 1671382, 1456950, 1273540, 1024031, 697383, 647473, 921074, 858813, 778136, 784947, 722034, 671350, 727182, 769273, 793557, 789990, 771500, 680026, 551602, 424026, 373171, 291650, 309798, 372770, 394459, 355499, 564516, 676994, 806111, 811321, 952907, 1135345, 1269984, 1257350, 1143119, 1012370, 789230, 686042, 515862, 412523, 473362, 473086, 375870, 190005, 34181, 140290, 281329, 242010, 117189, 174205, 252365, 270561, 393238, 461644, 466309, 338356, 277394, 391236, 298458, 380078, 458307, 590266, 417211, 224317, 187273, 266579, 359803, 285588, 393339, 427672, 277556]
8211B77556j13877K6911P5476K5980R5933L6040j57982R4516L9856Q6392J30815
8200F17616q3443j48426j20139r8523Q1726L5269o471o0884j3277P424M2610r3144
8188A60338j30187j6954O7762J35388l3392j21532p567N2542j7309R1551o4623
8177A16017L0909O235p5220P2697L0863j09628r7080P4923J13250J24708J3027
8166C00701j32169J10017r7393p4133K33716K0505j13449m7649j55079O9053R1850
8155B05970j6646o6161r185L0851r8156J00983k8840o824L7454o8581o3743P2418
8143H9540j7738O1339P2533j44855l4997P1178p5361m7715N5282K02683k3796
8132B08093j80419O952K3823n0320N9861q461k4965J22950l0781N0009k3370L7857
$$ y = [277556, 163679, 190590, 266066, 292046, 387979, 424019, 266037, 360553, 400409, 486801, 617616, 534173, 385747, 265608, 167085, 248811, 284080, 277609, 216725, 203448, 210872, 253482, 160338, 30151, 13197, 80959, 216347, 182955, 61423, 53856, 106398, 89089, 180640, 116017, 146926, 153161, 77941, 150638, 181501, 71873, -25207, 49716, 162966, 287674, 300701, 168532, 278549, 181156, 107023, 340739, 361244, 247795, 200146, 45067, 114120, 205970, 189324, 123163, 113978, 144829, 46673, 147656, 118816, 111992, 149446, 80865, 17122, 89540, 71802, 133141, 205674, 60819, 25822, 97000, 21639, -26076, 29206, 231889, 208093, 27674, 34626, 58449, 8129, 67990, 59529, 34564, 157514, 126733, 176742, 153372, 191229]
8120A91229j11790k8894N9166l5970q9860J65664M2278j35353R8167J80285j10354
8109B24568n9932o9601J24471J384j79120J7158K5200K16144M9469L1439n6360
8098C24820q4749j23729M0464j14665J9167k0042K0176L6723j72931j1383J47029
8087F0880K0645R3357K728o4768p4908j43270L8607O2876K5357j32056O0902R2437
8075D2787K6127o9903q867l543R3949j6798J45890j1392k8139j3639q9600l2355
8063C4517o7795J41283K1099N9206K06301r6217j43357o6358k6739j08343n6907
8052a03310J3938J60338J16164k7834j21104p0582O4052L2623N1886N4641o7631
8041A03181P4604m4218l2832P6561P6330K30727p022k38353k6960L0292o9765
$$ y = [191229, 79439, 50545, 109711, 73741, -16119, 149545, 191823, 56470, 154637, 334922, 224568, 164636, 95035, 219506, 220890, 41770, 58928, 84128, 300272, 349741, 381180, 324820, 240071, 116342, 156806, 42141, 61308, 41266, 61442, 98165, -74766, -86149, 60880, 81525, 174882, 177610, 112842, 37934, -105336, -66729, -3853, 21504, -110552, -49650, 42787, 68914, -989, -9856, -13399, 80550, 63752, 209642, 198250, 170111, 156472, 66872, 34517, -33278, 108005, 129104, 188310, 394611, 298394, 155037, 88679, 61940, -46403, -103310, -89372, 70966, 187130, 159296, 38192, -32390, 31662, 64285, 116171, 170812, 103181, 177785, 133567, 100735, 177296, 253626, 484353, 477331, 238978, 212018, 242310, 172545]
8030A72545N446q2655j97468L7358J1917J28765j8020j31887Q3530Q6309M1060
8019A36900m5553n1271l3718J94485K8692j33626N8403k9965q5322m0120O9322
8008F8227K094m0371k2537j10472J24099M5692l1465J04556q9552j61562J62692
7997E1401J67502k4030j78917N7424m994k1270Q503j08881j9141J9158J94617
7986A41372l5632k05987Q148R3738M9182J73444P1219j08542j95879m9343J54481
7975I6201J54866k9696j23066j02738K8207m1740l7186q3734m3449l3925K7352
7964a88908R3350j6075p031L5773Q8846N8875R5851k9363m1630J0949K358R0322
7952A93317N7777k1280L8411k8403j83283l2836J17506q9734L4769R6186n5986
$$ y = [172545, 177991, 95336, -102132, -64774, -52857, 75908, 57888, -73999, 9531, 95840, 136900, 91347, 40076, 6358, 200843, 229535, 95909, 154312, 124347, 39025, -1095, 68227, 70321, 29950, 7413, -103059, 21040, 66732, 35267, 139823, 50271, -111291, 51401, 218903, 194873, 15956, 73380, 68386, 47116, 55619, -53262, -72403, -53245, 141372, 105740, -100247, -92099, 1639, 50821, 224265, 295484, 186942, -8937, -58280, 96201, 251067, 221371, 98305, -4433, 23774, -17966, -55152, -138886, -182335, -216260, -188908, -95558, -111633, -118664, -82891, 5955, 64830, 160681, 131318, 89688, 100637, 102995, 193317, 251094, 229814, 268225, 239822, 56539, 23703, 141209, 51475, 86244, 182430, 126444]
7941A26444q102R1903k0057k9259O0975p0091k38881p4102J57651J48119k0894
7930A23706j14612N7348N1080m751P5633o8139j69648N4154J44121J74807r6425
7919B27274j350O9811k73684k38861N9789m4590j22176J53764K41480R8772r8414
7908G1815l549o7621P1288J27938l8487j13713o511J30310K9033j04317J23038
7897B19224o1423o6065K8071J7479j16262M2504M7873j37914K6929J13826M9199
7886A63441k7407K6081n0175K0316R1345J8125R391j0986P414J25148j55898j01706
7874A15089l2687j54421j03859l2310k4508N404k7282j16816L2604K18569R253
7863a10964q9969N2204R8162l9025O7528l5637N9322o368J41556K651n304J3614
$$ y = [126444, 118342, 210245, 190188, 160929, 221904, 151813, -87068, -161170, -3519, 144600, 123706, 9094, 66442, 117522, 112771, 188404, 120265, -49383, 4771, 148892, 323699, 227274, 225924, 295735, 22051, -216810, -157021, -201611, -323787, -170023, 71457, 170229, 71815, 68266, 645, 71933, 199871, 161384, 47671, 41160, 171470, 200503, 96186, 219224, 157801, 91736, 119807, 137286, 21024, 63528, 111401, -26513, 416, 114242, 163441, 136034, 162115, 111940, 132256, 223601, 241726, 251117, 240131, 247545, 372693, 216795, 115089, 82402, -72019, -175878, -208188, -232696, -227292, -254574, -371390, -338786, -120217, -110964, -200933, -148729, -50567, -89592, -22064, -57701, 1621, -4747, 136809, 139460, 134156, 147770]
7851A47770q8355Q5305J26472M4666n2819j11365J0880R092M297J00731m8561
7840B28113j00089p4822j6359j55220N9234m8518P6053J40370k5354O7842K5487
7829A76737p4415J54689q2136k53179j31320M8093J50598J08142L7799j2961N1626
7818A73673N4273P5899m481m8710j57680j05302k6628J48565J87260J3960J3396
7807C24225r2488j88821p3066M514J4816N0952R1818J0637j64770O8386j2053
7796C4150m7748p3942N1348J21572o90J80620Q0710j51846K8510j1391J13537
7785C24830J87105k06674j91936R3521J11936k0053o923j4751j88172j67322q6621
7774a65060R9186k6883n2135m7625J31501J37395p4297O2720k38249p7823Q6044
$$ y = [147770, 59415, 144720, 271192, 315858, 263039, 151674, 162554, 171646, 175943, 276674, 228113, 128024, 53202, 36843, -118377, -59143, -107661, -31608, 108762, 83408, 151250, 176737, 102322, 257011, 174875, -78304, -209624, -161531, -10933, 97209, 135008, 122047, 173673, 227946, 303845, 299364, 250654, 92974, -12328, -38956, 109609, 296869, 310829, 324225, 231737, 42916, -30150, -25636, -10820, 40132, 131950, 142587, -22183, 46203, 34150, -13598, -87540, -36192, 85380, 84690, 265310, 346020, 194174, 222684, 211293, 324830, 511935, 305261, 113325, 206846, 318782, 298729, 291806, 277055, 88883, -78439, -165060, -65874, -92757, -144892, -192517, -61016, 76379, 2082, 64802, -173447, -251270, -165226]
7763a65226J08953O8887j5907L1176k3134Q7166r848J23781J5555j69109r5768
7752d3474N5234Q8270M7771o1120n2545q9691K02345P7095k5848k38822r2741
7741a33526R4090J46799L8409L1319j2430l9315p3197L3958j04243K4384K398
7730H646o4089J1265k1046r5540P9359J76549O3813k2237j55777j0542O8251J94809
7718B33461o9242n0280J7180K773Q5628J19513n312j58814j69670j67767l9045
7707b01575O94M2898j5235m7546N2154O4834l9028K3837K0942m5005J84554J42684
7695A84208j07199q7955J21021J50188L1977R0450l2152j11486j55122j41718
7685e7788n1483Q7281M673J59351O2615j46448J34043N8417k1646j59731j83081
$$ y = [-165226, -56273, 12614, -3293, 27883, 4749, 91915, 82067, 205848, 221403, 52294, -43474, 11760, 100030, 147801, 86681, 34136, -55555, 146790, 223885, 198037, -40785, -133526, -39436, 107363, 145772, 177091, 164661, 125346, 52149, 86107, -18136, 6248, 8646, -55443, -44178, -65224, -160764, -81405, 95144, 158957, 136720, -19057, -29599, 38652, 233461, 164219, 113939, 131119, 133892, 219520, 339033, 333721, 174907, 5237, -162530, -201575, -200881, -157983, -173218, -220764, -168610, -103776, -142804, -118967, -98025, -143030, 41524, 184208, 77009, -10946, 110075, 260263, 292240, 382690, 350538, 239052, 83930, -57788, -109271, -21990, -17317, 142034, 204649, 58201, 192244, 250661, 229015, 69284, -113797]
7674a13797l1825J83641O0775r6924j01885j70129J76139J52575p3049O236J51781
7663A43538K3928P7310j9688l7293l5940p6937J8597j08213J9114j24083j14413
7652b34080Q6393J19113l836Q2048J00384O1197j16578j76376k6945k8492o6328
7641b03500K20091J34319l4795j06697j13184m905P3971j8223p8500q7000J02680
7630a15743J4833L6012P7152J28847J2481j00863k2772J16399j7793q5164m3215
7619A74n4290p0316o8116J44240L0644k32892p7515J20416O7838J84398J48268
7608A92849M0179j55637j95209r8293J41456j5755J49427K08295l0724m2022o5483
7597A29083J0938n5625j9493q6487j50718m0660J62666K10542M9598o5587M7919
$$ y = [-113797, -145622, 38019, 98794, 1870, -100015, -270144, -94005, 58570, -14479, -8243, 143538, 167466, 244776, 225088, 187795, 151855, 74918, 93515, -14698, 4416, -119667, -234080, -147687, -28574, -32410, 49638, 150022, 211219, 94641, -81735, -108680, -137172, -203500, 16591, 150910, 116115, 9418, -103766, -108671, -34700, -52923, -131423, -218423, -115743, -100910, -64898, 12254, 141101, 153582, 52719, 29947, 146346, 128553, 43389, 174, -54116, -124432, -192548, -48308, -17664, -250556, -328071, -207655, -139817, 44581, 192849, 233028, 77391, -117818, -216111, -74655, -90410, 59017, 267312, 236588, 194566, 129083, 140021, 84396, 64903, -21584, -172302, -212962, -50296, 160246, 209844, 144257, 192176]
7586A92176Q4200n3804k53872q5663K53311k1112j84140m1558j39366j15286J6642
7575c48472j2093N7388L6384K42601Q7061M7226J15919J12189O5972m9684j50553
7564B03938j96603r8746k4715O4951M2284r0325L0087K44316j0480J6289o2377
7553A18619n8921r2588r7947j04965K5236J78260J63761j58632p9384Q5367L3285
7542A2091r884J01042J40071L5169j77473j9718P1476K0521j8624Q3830K4396
7531B62897m2432r2800p7668O6590M4582o3862k3078o8605J6758k2557p3524j31487
7519b05186l4812j1235M0145K68182l5292j72362o5003N5464Q3983J55744M4777
7508A24405M6674p0561q0217L8420P9822o9874p8801Q258J99947R3781k6350j82733
$$ y = [192176, 276376, 222572, -31300, -116963, 136348, 115236, -68904, -110462, -249828, -365114, -348472, -360565, -303177, -266793, -24192, 62869, 110095, 226014, 338203, 404175, 354491, 203938, 7335, -91411, -116126, -51175, -8891, -99216, -69129, 175187, 164707, 180996, 118619, 59698, -32890, -130837, -235802, -210566, -32306, 131455, -27177, -106561, -21194, 12091, 2207, 103249, 243320, 278489, 101016, 81298, 152774, 173295, 154671, 238501, 262897, 220465, 127665, 49997, 116587, 161169, 97307, 74229, 5624, 22382, -175, -73699, -205186, -239998, -251233, -211088, 57094, 21802, -150560, -215563, -160099, -76116, 79628, 124405, 171079, 100518, 20301, 58721, 138543, 68669, -10132, -1874, 198073, 291854, 265504, 82771]
7496H2771j03254K8326k5142J13991L4464j00824J57764j66622j69958L4881J32114
7485A8511Q1544J8602j07064R0694L4300M0281J42036r555r1201j51257j11883
7474d4992J8589j35180j13286J17264K12238r7004j24907r7413Q8838R9834n7284
7463a33303j29281p587K5536K8712j07024j639p8278J31889M8661p490j29917
7452c59721K767M961L3825N6169R6140L33870j7304l6606J17065L4291k85235
7441a9778k72867R3652R1931O8305J42611L6098l8270J548q2040p6801j8003O0347
7429a3267Q5960J97847j1019j23887j44383q1205J39199P3863J6726J6611J34437
7418B90882k30349j89717j8277j75933Q6731J21464J14563l6313p2545M3240J03411
$$ y = [82771, -20483, 7843, -17299, 96692, 131156, 30332, 188096, 21474, -148484, -113603, 18511, 100055, 118657, 11593, 102287, 136587, 176868, 318904, 309349, 218148, 66891, -44992, -26403, -161583, -274869, -157605, 54633, -42371, -167278, -264691, -175853, -76019, -133303, -262584, -270171, -244635, -215923, -322947, -324586, -402864, -270975, -222314, -229804, -359721, -356954, -351993, -318168, -261999, -165859, 168011, 150707, 114101, 231166, 265457, -19778, -292645, -198993, -107062, -38757, 103854, 139952, 101682, 103230, 21190, -55611, -73614, -13267, 72693, 270540, 259521, 135634, -8749, -89954, 49245, 123108, 139834, 156445, 290882, 60533, -129184, -147461, -323394, -236663, -115199, -636, -36949, -109494, -66254, 37157]
7407C7157O1179O5947J3866l6118J8214p2367j46846M0511K33280Q9798k1340
7396B83281k65091L595J15029l5046j91304j74666K5673L0535J4387J41227J24162
7385G1782n5072J28523J06017r3137m0945J905n7999p2886J11088j27405q9608
7374a17737M7202N0465J57529l7348J10705P525m4176j87823r5207l6550M9119
7363i6296N0626j05615M4774J50243L1442j00599j66822j32198L7895Q7548R0340
7352a08662J41608J0518j52763q0745L0711J07854m3188%l6582m7569J04591P3725
7340e02j25293p6443J13121O4490n7955J0754P6566M4954J02518m8780k04184
7329a00754l8968J73256R236m079J2867j27666K22360K6362n9124m5979k28549
$$ y = [37157, 98336, 164283, 178149, 142031, 160245, 87878, -58968, -18457, 214823, 304621, 283281, 18190, 21785, 136814, 101768, -89536, -264202, -238529, -207994, -193607, -52380, 71782, 16710, 145233, 251250, 158113, 117168, 119073, 61074, -11812, 99276, -28129, -117737, -70535, -20070, 137459, 100111, 210816, 218341, 174165, -13658, -108865, -145415, -96296, -45670, -151285, -106511, 43732, 75174, -25425, -192247, -324445, -286550, -199002, -108662, 32946, 43464, -109299, -190044, -159333, -51479, -94667, -94667, -131249, -178818, -74227, -502, -125795, -202238, -89117, -24627, -82582, -71828, 4738, 49692, 152210, 103430, -100754, -139722, 33534, 42770, 38691, 51558, -76108, 146252, 172614, 113490, 67511, -161038]
7318a61038j39549n5895J70514O0474J66750L4666j07440j5417m248r5075K07760
7307F1502o351K6984K4819j27063o3756k08344K562J22919J15900M2337k58760
7296b67251j32380N2352j69368q9608k6416M1474N8341J09434R2039n4184J45316
7285b40251J14767J01640j1351n3028Q3132J4214k7328n7841M8604R5687Q6703
7274A54948O3089j02623j62984r870J09300k31907k56514J63238J19339P0131
7264h3853l9026K6683L8556q0139M0969P5022J28514L5645J5300J9215j53221
7253B3665k7818K40114J89256j57853j45435O8225J10408j15369n8114q348j35462
7242a6731l0600Q0557M4149n949j37147j38042l0582J58714P5084L7638O254l6316
$$ y = [-161038, -300587, -356482, -185968, -125494, 41256, 75922, -31518, -46935, -51183, -146258, 61502, 55151, 82135, 106954, -20109, -83865, -292209, -289647, -166728, -50828, -8491, -267251, -399631, -347279, -516647, -606255, -632671, -591197, -532856, -423422, -331383, -385567, -240251, -125484, -23844, -35195, -88223, -5091, 9123, -18205, -76046, -27442, 68245, 154948, 218037, 115414, -47570, -57440, 51860, -180047, -436561, -273323, -153984, -83853, -122879, -96196, -57640, -137779, -96810, -21788, 106726, 142371, 157671, 176886, 23665, -4153, 235961, 425217, 267364, 121929, 190154, 300562, 185193, 127079, 118731, -16731, -47331, 33226, 77375, 71426, -65721, -203763, -234345, -75631, -547, 37091, 43345, 7029]
7230G029j06290J04541M998j58914J24509L53667j8428o0540q3056j61515j19450
7219a13449n9757J14463O3688K9517K32624l4363j09839m4372q5193n7100O0102
7208c679k17589k2316K72014J38659Q1843j01021J82113M6397k12019J3257O5022
7197B42681r8081j36751l5220j83565k1470J00071J10230P7349j2169Q4075P9114
7186B06264J43640K580K862q8117k30403n9159N6632q3307k8888K7742J10084
7175E9930j05301j10141l73l2027Q7039J87310J1347m1504N3048r8884L2894Q9686
7163A33024M0377J315l7130p3314j8209O7547J11191o8965p7964j44051Q1125
7152A4946K2138m9852k3833J11120K4801j09182j41468o536L2652n8919M5426
$$ y = [7029, -99261, 5280, 10278, -148636, -24127, 329540, 311112, 250572, 167516, 6001, -113449, -173206, -58743, 4945, 34462, 267086, 232723, 122884, 78512, -6681, -63781, -3679, -221268, -243584, 28430, 167089, 248932, 147911, 330024, 376421, 164402, 177659, 242681, 144600, 7849, -27371, -210936, -232406, -132335, -22105, 55244, 43075, 127150, 206264, 349904, 352484, 355346, 267229, 36826, -22333, 34299, -49008, -77896, -50154, 59930, -45371, -155512, -155885, -187912, -100873, 86437, 97784, 56280, 109328, 10444, 43338, 133024, 173401, 174716, 137586, 64272, 46063, 113610, 224801, 155836, 77872, -66179, 14946, 37084, -12768, -36601, 74519, 99320, -9862, -151330, -157866, -125214, -184133, -138707]
7141a38707n4027K9594J10437J28908o6789j98219j44502l586J21686k6570l5772
7130b77547K2528J1036J06885J72541J16012j05336J9654K14354K9428r3513M3907
7119B59949o9142K5633o0792N5004r6145j05841l6753p6246n0201j16761P7287
7108a94008K03894J8407L2375q9445k3803J66681M8369j62434n2705Q079J16835
7097G2245J64634j4537O0210O635j05141j8557n3218q6944k05321N5677K58635
7086A34318O6363l5355j52022L6108J8998N1540O3640N0577k3282L2744p0766
7075A72863j64939L1331P9323J44829J8188R3849Q1056n5718j39794l4684J1496
7064B37800n3699l7957j8786N5423M9196j23734o8220K7721m9458j1873K4925
$$ y = [-138707, -192734, -163140, -52703, 76205, 9416, -188803, -333305, -336891, -215205, -241775, -277547, -255019, -243983, -137098, 35443, 151455, 46119, 65773, 280127, 309555, 216042, 259949, 190807, 216440, 155648, 210652, 114507, 8666, -28087, -104333, -154534, -271295, -194008, 9886, 28293, 60668, -28777, -52580, 114101, 162470, 36, -52669, -44590, 72245, 236879, 222342, 282552, 289187, 184046, 165489, 112271, 25327, -179994, -124317, 134318, 200681, 165326, 13304, 49412, 68410, 119950, 183590, 234167, 210885, 243629, 172863, 7924, 39255, 118578, 263407, 281595, 375444, 456500, 400782, 260988, 226304, 237800, 184101, 146144, 127358, 182781, 231977, 108243, 40023, 67744, 18286, 6413, 31338]
7053C1338J3104q402L7281o9343l1624J2325P2405j6225n8208J738j20686k07966
7041c44263j77312L58004K76152p7913m2013M5047n6460l7218J62796j4120j1799
7030H0901J17298p5344j2206p8562L560O7149r702l0785n2684j7510o5507j47339
7018b20731O0924p8360o699J29978Q1163p3479j59828J43816J28174N5054j0338
7007D9674j84027j18100K48200l3850j85690o9540k01700j5603L34719q7585N4916
6996b08586J14380k5663P4726J05599J6074k9571l2844j329q2628Q0113Q2510
6985I2781J8064m9090P7506J6773o652j29490j10144M1629K3556M5247m9478N0455
6973B1157K7498j45684j49441n7655O1190J92010J16950j0989J28526j43297l259
$$ y = [31338, 44442, 36040, 73321, 3978, -27646, -15321, 57084, 40859, -17349, -15611, -136297, -344263, -521575, -163571, 112581, 34668, -7345, 37702, -18758, -55976, 106820, 92700, 80901, 198199, 122855, 110649, 32087, 35647, 102796, 93094, 62309, 9625, -7885, -73392, -220731, -159807, -238167, -244866, -114888, -33725, -107204, -267032, -123216, 4958, 60012, 49674, -134353, -252453, -4253, -38103, -223793, -293333, -495033, -510636, -175917, -263502, -208586, -94206, -119869, -45143, 60456, 76530, 46959, 14115, 12786, -69842, 10271, 92781, 110845, 61755, 139261, 156034, 149382, 19892, -90252, -48623, -25067, 20180, -29298, 21157, 48655, -97029, -246470, -304125, -242935, -50925, 66025, 55036, 183562, 40265, 37006]
6962C7006J9416J21558j66117R7750o9650M5258L6330k3861q0332q8514q1988
6951a53144R3886J10365K4515n172M3853m9872r8702N0206p9127n6804N7069J43195
6939H0268R0865o3466l3865N3033o0310o6254j4362K1066K207M1108m174p7282
6927c1166J03364k9544M22k3963m0514r095o1019O932J47940o5270J7504k6190
6915a0599j23859N0174R02J24338P166n4125J60536L0501j3137K2794Q3670j5047
6903B63314K2449O6728j99566k05054R4586R6221l4897j80151J4863r3831p5458
6892b30796J8341J42235J70331p4726m2108N6614r214J2103O5016k5142p4581
6881H073j60686o6550J10183J83140j43850j44235J4790O3494K2488l0498K5429
$$ y = [37006, 56422, 177980, 11863, 109613, 39963, 85221, 121551, 97690, 17358, -71156, -153144, -59258, 51107, 75622, 70450, 114303, 64431, -34271, 15935, -63192, -119996, -62927, 80268, 171133, 107667, 73802, 126835, 66525, 271, -14091, 6975, 9182, 50290, 46116, -31166, 72198, 42654, 43076, 19113, -21401, -30496, -91515, -84583, 63357, -1913, 15591, -10599, -134458, -84284, -83382, 40956, 48122, -6003, 154533, 185034, 171897, 194691, 278361, 263314, 285763, 352491, 152925, -52129, 42457, 138678, 103781, -76370, -61507, -155338, -230796, -212455, -70220, 100111, 25385, -16723, 39891, 30677, 42780, 107796, 82654, 8073, -152613, -219163, -108980, 74160, -69690, -213925, -199135, -135641, -113153, -143651, -118222]
6870a18222P6189R6432N7545k553L6175n3957j24982R5564R1779O9968M1360j19518
6858A45780j58899n0325j6000m7479M9025M8873Q2055M8452J9472k44632j10917
6847b34595J45006K07847l009j89285n5231J3723J20891J45492l6150j72778l00654
6836c58743l4131L02204O1286J22382P7782L8668L8051k07470j58193n8970o0208
6825b37342J74924k4070p0047j49945O2118R7731J53526N4731m2801J2451l8052
6814f776N3998L4131J0465J5599P4358J4073j05754k69385j67997J2239J26511
6803b08538p9990K448J44974Q8304j08995j7809O4075q0160j759P5083p29k1417
6791a44513K12514j19972j35007Q739Q1579M6111r2793k2786J00870j13002J5391
$$ y = [-118222, -42033, 54399, 111944, 109391, 145566, 91609, -33373, 62191, 153970, 223938, 265298, 145780, -13119, -63444, -79444, -126923, -77898, -29025, 53030, 101482, 120954, -123678, -234595, -89589, 118258, 115249, -74036, -129267, -115544, 5347, 150839, 114689, -58089, -358743, -392874, -90670, -29384, 92998, 170780, 209448, 247499, 40029, -118164, -177134, -237342, -62418, -86488, -156535, -306480, -244362, -146631, 6895, 61626, 18825, 31276, -6776, 47222, 81353, 91818, 107417, 181775, 195848, 90094, -179291, -347288, -335049, -208538, -288528, -286080, -141106, -52802, -161797, -179606, -115531, -195691, -197450, -122367, -123096, -144513, 68001, -51971, -186978, -178239, -96660, -50549, -143342, -166128, -65258, -178260, -162869]
6780a62869K6617L8309J12149N3473P9365j70445m8699j18863J00952L0130L6143
6769b3738j11980j04741N6087j498j28273O0174L1560P8501q7551J07694J30388
6758F623o6120n6350j50591J5490J33611Q5182l2465j29052m6598n0614J00277
6747a90607M0601K48127N4187n003j69044o3955N3865q952J1504j30643n4876
6736b14796l0731J93980J60622o5416p4623J8188J76037J33264j60516j44930
6726h921o404p7450K2727p8302P379J72598J32369L8901k51889j27648l7716m2794
6714b57150J6452j8923R243J62696p4353O2289l9031P4596m3766j0662k56070
6703c74679n4887l9475O1978K52608J62745L8305r7423J36015o413k56139J4691
$$ y = [-162869, -136252, -97943, 14206, 67679, 147044, -23401, -72100, -190963, -90011, -59881, -23738, -135718, -240459, -184372, -185870, -314143, -253969, -222409, -143908, -231459, -123765, 6623, -59497, -115847, -266438, -250948, -117337, -32155, -64620, -193672, -240270, -290884, -190607, -150006, 98121, 152308, 147305, -21739, -85694, -31829, -40781, -29277, -159920, -214796, -245527, -51547, 109075, 43659, -30964, -12776, 163261, 296525, 136009, -8921, -15325, -92775, -70048, -148350, -140971, 31627, 163996, 202897, -48992, -176640, -214356, -257150, -240698, -259621, -250378, -87682, -162035, -99746, -138777, -64181, -107947, -118609, -374679, -429566, -469041, -407063, -154455, 8290, 46595, -50828, 85187, 78774, -177365, -162674]
6692a62674J86747k9122N3288L0627l4794j31073O2079m2366k03214p7438J29326
6681b18614J61749n6654M2223K11935J74620j07742j46930l187P4799o9492J071
6670F3778j19354j30268R125L6942K00829K18431m4014j54258l8143m2282j61483
6659a60697o7861o6482R841J00049K79979j4496l8694L1283o6279j35977J2746
6648a16588j57369n1722J64665J83700O2732L0470j40548q1292L8783J76956n7195
6637E2592k14909M8333M7533l3170q3076O58O2875M7845k5181R5342O1215j0867
6625D9190M4418k4038j50734k15143J49544Q9483l3027J12833m0500m7367j3769
6614g9110J82012J40996O631j39672j87337l4637J5339L2743m4403j33041j06743
$$ y = [-162674, 24073, -5049, 48239, 78866, 44072, -87001, -24922, -67288, -270502, -347940, -218614, -56865, -113519, -71296, 140639, 315259, 207517, 60587, 57400, 132199, 62707, 63778, -55576, -185844, -176719, -139777, 61052, 279483, 235469, 81211, 43068, 786, -160697, -228558, -295040, -285199, -185150, 94829, 80333, 41639, 72922, 6643, -129334, -116588, -273957, -325679, -161014, 22686, 85418, 115888, -24660, -105952, -67169, 109787, 52592, -162317, -113984, -66451, -99621, -182697, -182039, -119164, -71319, -96500, -1158, 60057, 49190, 93608, 69570, -81164, -296307, -146763, -57280, -90307, 22526, -17974, -65341, -79110, 102902, 243898, 250529, 110857, -76480, -111117, -95778, -63035, -107438, -240479, -347222]
6603c47222J51081N0415R8739M2525j02632o5684N4952J30596M0533k0831Q3696
6592A16168j71892n9688n0037k16819J96950J60589r3081R2671M2893J2621Q1171
6581A11546J61736j84339r9847j17905L1986P5964k7760p8860o9350J2887P1557
6570a12385J11512P9729N2667J00115L3594j14522j89100m2293O0167Q8145R9399
6559A67028k3517p0152L0747J24057l4670j46696o1879N9156q979P3980J10185
6548B19260j4877j06279m5575q6886j04764R2176J15308J2369q1007J62767K9026
6537A91518j52722j00175K0667Q5217O0804m4441J8262J03632m5927j54847q8482
6526a06494k0146r9926q6100K61071K12745j41729j66905J09641N9874n6727k58785
$$ y = [-347222, -196141, -145726, -46987, -4462, -107094, -172778, -117826, 12770, 53303, 32472, 116168, -55724, -115412, -165449, -382268, -185318, -24729, -117810, -25139, 17754, 30375, 111546, 273282, 88943, -10904, -128809, -96823, -20859, -48619, -127479, -196829, -183942, -112385, -873, 78856, 131523, 231638, 265232, 150710, -38390, -80683, -20516, 67629, 167028, 143511, 73359, 104106, 228163, 193493, 46797, -15082, 44074, 35095, 109075, 219260, 204383, 98104, 52529, -34357, -139121, -46945, 68363, 80732, -275, 162492, 191518, 38796, -61379, -40712, 44505, 105309, 60868, 79130, 182762, 136835, -18012, -106494, -126640, -226566, -312666, -51595, 161150, 19421, -147484, -37843, 22031, -34696, -293481]
6515b93481k6341Q7676Q5794j61652o4258Q2253J45228J40905J7300J4095J50179
6504A77698n7152N210K61446j56694k09846K1705j2723n2122m2151Q9147J68251
6493A92769K24341j12694l68568j28286J15950k1865j6431J10365j6740p1069
6483i2228j13957N107O7012p997M1668J94697O0044k50310j80989K75910K558
6472A515j41735L4626n6287l6652P0240j02282Q5233q99M0473J26815K1257j47414
6460a05110r2533m3621M4581O2128j93339j5020M4480L7187J63423r9570K4079
6449a73315M0201R1836n2985p9300O5647M1693P1300j14221M197j28943j05719
6438c39609j51336Q7529L17202J17212n8520r3868m9743J77929M3772O5279l9413
$$ y = [-293481, -319822, -232146, -146352, -308004, -372262, -290009, -144781, -3876, 13424, 27519, 177698, 120546, 125756, 387202, 230508, 20662, 42367, 29644, -22478, -64629, 24518, 192769, 417110, 304416, -64152, -192438, -76488, -98353, -114784, -4419, -21159, -92228, -206185, -201078, -134066, -142063, -100395, 94302, 154346, -95964, -276953, -1043, 1515, -140220, -105594, -161881, -198533, -128293, -230575, -145342, -146241, -105768, 21047, 42304, -105110, -197643, -241264, -196683, -134555, -327894, -342914, -298434, -261247, -97824, -197394, -173315, -133114, -41278, -94263, -173563, -107916, -66223, 5077, -109144, -104947, -233890, -339609, -490945, -403416, -86214, 30998, -27522, -121390, -171133, 6796, 50568, 115847, 76434]
6427G6434l8354k11689j16554J61269J86090J85877L3289j63921j46666M474K5674
6416d077k8877M0254j37614j07375J76081J18422l1141q0843J55002Q6786q6076
6405A00542k087K9402m9494j49116j41839l4507J18199O2563j8784M3362R5123
6394E3364L4752K589j20407j46723p3134P6339Q1766p0299j63637J7254K1785
6383b86351K4933j7305M9361J28396l370m0691N9808q215O138O0438M912O7293
6371D5347r979p1559M750K6205J1384J17389k4200j14224n4732L2989p1564o1613
6359a69807Q7245l1058k1235L5474r1373J8118J43674l7191L8098J15994j57303
6348f9364j31559o861j9827j5056n9838j13959J51426Q9388K9540J45448J12236
$$ y = [76434, 38080, -173609, -290163, -128894, 57196, 243073, 276362, 112441, -34225, -29751, -4077, -32954, 7300, -130314, -237689, -61608, 56814, 25673, -55170, 99832, 186618, 100542, 98455, 127857, 78363, -70753, -212592, -247099, -128900, -66337, -85121, -41759, 53364, 88116, 90705, -29702, -176425, -249559, -173220, -91454, -161753, -325390, -308136, -286351, -261418, -278723, -229362, -100966, -104336, -145027, -85219, -93434, -87296, -26858, -21946, 45347, 35368, -36191, -31441, -5236, 6148, 123537, 99337, -14887, -69619, -36630, -108194, -169807, -82562, -113620, -134855, -99381, -190754, -172636, -28962, -66153, -28055, 87939, -69364, -200923, -207784, -227611, -242667, -302505, -416464, -265038, -175650, -146110, -662, 111574]
6337A11574p4843Q4352l6205r1562k856q0735m5608r2500P1492J25996j5179J65402
6325A19328j46998j67759J17238M8945J4961j38902L6576J68231J15782J06442
6315B73844j72169k04781j34266O6796j49545Q279J70057Q1298K6415N3198q2302
6304f3176J0955R1767p8172j39779Q6545R9822K2221o2949P1587l3168j91741
6293a86088K4808J16246J00542L9388l1677j9443J46075k20498M49L5929R1085
6282I6816Q0059l4396j87698j16544J7372j3782p2785l3N6187k4406R8796P6560
6270b3854q0364j20153J08404L0227k637l1523n0443J35300J34023j9034N942
6259H5888P3673O5295k3398K3538j57690j41734R5000J07699J06533j01384O4801
$$ y = [111574, 36731, 121083, 84878, -6684, -9540, -90275, -135883, -228383, -156891, -30895, -46074, 119328, -27670, -195429, -78191, -29246, -14285, -153187, -116611, 51620, 167402, 273844, 101675, -103106, -237372, -170576, -320121, -311842, -141785, -60487, -34072, 19126, -63176, -52221, 39546, -38626, -178405, -91860, 7962, 30183, -32766, 38821, 5653, -186088, -161280, -45034, 55508, 94896, 63219, 43776, 189851, -30647, -30198, 5731, 96816, 176875, 142479, -45219, -161763, -144391, -158173, -230958, -230991, -174804, -199210, -100414, -23854, -104218, -224371, -115967, -85740, -88377, -119900, -170343, -35043, 98980, 79946, 85888, 159561, 224856, 201458, 224996, 67306, -74428, 20572, 128271, 234804, 133420, 198221]
6248A98221r5749K9973j8527k1529j11445L8273j50082j10769J46507J09937j4721
6237H9L0966k1554k6240P1586k4351j4539k718j29000J2663L5765k04073O7555
6225b03851M7879p769n6947p604J79841J21036L7502n3519r340J0539j95203M1174
6213i6262J99611J35754j40491k16909L9106p7315l8326J05504n9457R4508J25256
6202G0979m2106k3646j72903r8674J81694Q4949j89039n390j05065P66J05580
6191a92855J14390J9015j17216J97408J02742l2504o5485Q777r835o6896j9512
6180f1971m0605N5680J09526p8220N4620m2204L7776j13123r3097J30822l5302
6169g6098M7016J50526J3041n1434m8999N5689l445m1517j40317r938J4176k7167
$$ y = [198221, 102472, 132445, 113918, 92389, -19056, 19217, -130865, -241634, -95127, 14810, 89, 31055, 9501, -16739, 54847, 30496, 15957, 13239, -115761, -103098, -67333, -271406, -203851, -155972, -163741, -220688, -228292, -48451, 72585, 110087, 56568, 47228, 57767, -137436, -96262, 103349, 239103, 98612, -118297, -79191, -156506, -194832, -89328, -148785, -54277, 70979, 28873, 5227, -167676, -266350, -84656, 293, -188746, -194136, -299201, -298435, -192855, -78465, -59450, -176666, 20742, 123484, 90980, 25495, 34272, 24437, -42459, -61971, -102576, -46896, 62630, -15590, 39030, -3174, 34602, -78521, -171618, -40796, -76098, -29082, 121444, 134485, 83051, 34052, 89741, 86296, 44779, -95538, -105476, -91300, -118467]
6157a18467k1740N2893r2873L5054M59P1395L355K8674J3889J5043j12385N5744
6145f8959M6162j73003K1197K2027K7791m8439q9336J7746m731Q0669J16417M4449
6133h010R3415k2762J23489p8030j34033J9227m3222M7488P022L000J4870K9259
6121E1713j95525J00844K5460j02084p6674j2340j47791m9618L24560J32243N5585
6110A06373o2729j24190j35455J20846J18786R1407j00220l1737j46122j6210
6100a79251J89551P5817p9766J7751o8777k13656J18958l654n2784N2594r5421
6089b38638j65170K31059K32581N8346k210o3607j42793O2217k7199j44529L2417
6078a67526N1831p0878k8323j17357l1871Q2382K4403O4186N5155j21451l0694
$$ y = [-118467, -140207, -87314, -180187, -145133, -144674, -73279, -69924, -41250, -27361, -12318, -124703, -68959, -22797, -195800, -174603, -152576, -124785, -173224, -262560, -244814, -249545, -168876, -52459, -8010, 85405, 62643, 186132, 108102, -25931, -6704, -49926, -2438, 4584, 7584, 22454, 51713, -143812, -42968, -17508, -119592, -196266, -208606, -356397, -406015, -81455, 50788, 106373, 43644, -80546, -216001, -95155, 23631, 115038, 14818, -16919, -163041, -179251, 10300, 86117, 6351, 24102, -44675, -258331, -139373, -143027, -195811, -143217, -238638, -403808, -172749, 59832, 118178, 115968, 52361, -90432, -28215, -55414, -199943, -167526, -115695, -186573, -214896, -332253, -364124, -281742, -257339, -193153, -137998, -259449, -290143]
6067b90143J15306l4747J4083J83936J6086o0967Q155Q8299l6316p5545O9009
6056b844n6708j30608L753j43941Q933K16903L5155j35614j49402J06016J89471
6045e8886R1468M0537M0045k9812J00558J24057p0620j80889j59207j04405L9650
6034a67504K96618J98685j15867j05465n9851N0813P1109j10897j4380J08162
6024A51423M2642k05475j00707m8950l4500J02147P9086P0209j5428P7190L5907
6013A53544q0334r5335R9044k0212p0379L8139j79998m904L03415J12648q4123
6002A71505p2939l8015M6709J73974n8209j76303j88987P0944P7530K1515m3159
5991a5435Q0184J01173n5759K7271l4440j87540l3290l3744O9982J31531j2093
$$ y = [-290143, -174837, -209584, -195501, -11565, 4521, -56446, -48291, 40008, 3692, -71853, -2844, -59552, -190160, -186407, -330348, -321415, -104512, -69357, -204971, -354373, -248357, -58886, 32582, 73119, 113164, 83352, 183910, 307967, 237347, 56458, -102749, -207154, -167504, 129114, 327799, 211932, 106467, 46616, 97429, 168538, 57641, 43261, 151423, 194065, -11410, -112117, -161067, -195567, -93420, -14334, 55875, 40447, 117637, 153544, 73210, -22125, 76919, 56707, -13672, 24467, -155531, -160435, 142980, 255628, 171505, 98566, 60551, 107260, 281234, 223025, 46722, -142265, -71321, 6209, 27724, -15435, 64749, 165922, 110163, 137434, 102994, -84546, -117836, -151580, -81598, 49933, 37840]
5980C7840m9408l0431J9402N6300K3217l8024l1521N7879L8157j3903o03j31795
5968f2890j00508n071J28256R8662j783o6069r882l816L8251l3093N199O1572
5956D8828J1589q2562k22423j09898K1206J92079K4293m3298j21614k2342N8883
5945b45259P0208R1049k6454k7245N2634M6529j11277K1751O2472O6622l9967
5934c8937J09482j68337j70265L9812J05320M2697O1189p0466j4760L4765k2243
5923i1743l8768O7290k0753o7074J54557L8635N1821k1604q5412N2474j09256
5912f9833O0714J95771p5752K4425n5027K5220j04826r1056M7725j51851K5211
5901a69279L905l47839L95J82543L01506r619r3049M39l5678p0807o7951j765
$$ y = [37840, -11568, -41999, -22597, 33703, 56920, 18896, -12625, 45254, 83411, 69508, 68905, -62890, -163398, -168469, -40213, 58449, 56666, -9403, -19285, -23101, 15150, -17943, -12744, 48828, 60417, -22145, -244568, -354466, -333260, -141181, -116888, -160186, -281800, -304142, -245259, -175051, -84002, -110456, -137701, -85067, -38538, -149815, -128064, -65592, 1030, -38937, 70545, -97792, -268057, -228245, -122925, -80228, -19039, -89505, -104265, -69500, -91743, -130511, -63221, -83974, -151048, 3509, 42144, 93965, 72361, -13051, 39423, -69833, -9119, 186652, 110900, 135325, 80298, 105518, 692, -90364, -42639, -194490, -169279, -165374, -513213, -512818, -330275, -28769, -38388, -131437, -130998, -166676, -237483, -305434, -307199]
5889c07199J60318J31614L0188R1158m4892N7986L2534l3682o6540q0594J30109
5878A01000j75440L813O6522r9579j55879m5945P4518J0987r0463q1982K56553
5867a35895Q7100k0092o725L7373l724l9236k29587P9934O9383J8959P268R0186
5855d5056K6288j51084n2520j4107J16947l18J7689L8725O0428Q1175O070q6842
5843b605L8775q3655o8628o2877q3178j62382N6631N6094M4502L7342p1689q5565
5831c87235K1770K8728R0920K10030K46779j9774m2821n3323r4009J23705Q3600
5820B08370p8951n9159m6301j70856J0782k4715n9182J14161J76831J96212j42210
5809A24982j44836m6398p3890r2215J41949N868j45788M6382P9522L9168L213
$$ y = [-307199, -146881, -15267, 14921, 106079, 61187, 119173, 151707, 118025, 51485, -29109, 101000, -74440, -70627, -4105, -103684, -259563, -305508, -230990, -220003, -310466, -392448, -135895, -48795, -68887, -75612, -38239, -41963, -81199, -310786, -230852, -161469, -142510, -135242, -45056, -18768, -169852, -222372, -236479, -119532, -119850, -102161, -63436, -3008, 78167, 84237, -2605, 36170, -47485, -116113, -178990, -262168, -424550, -367919, -311825, -267323, -229981, -301670, -387235, -365465, -336737, -245817, -35787, 210992, 191218, 148397, 95074, 1065, 124770, 208370, 129419, 70260, 23959, -146897, -136115, -160830, -220012, -105851, 70980, 267192, 124982, -19854, -66252, -140142, -232357, -90408, -84540, -230328, -183946, -104424, -65256, -62043]
5798f2043m651Q054J74428M4637k9966j0448J51514K5868k40491j24259k9193
5787i6550N2648O3944R6748j3755j634q3287q5556P83M427p6625q4330K5648J71355
5774b6184J8406j59076o4605l6966J41030P7146k0044N339J22422k3572N30K3849
5762E8275q1961l2695L324p0309R2669j02563j63815o4692M3628J77194J48839
5751G894K2855j30704j0389M4882n9063J83864K3910J01105q0354j00039M6406
5740E0367N9623j4283M0527K0055o3104m9687n2211K6165J95637r531j80671j12367
5728h9480o8344j30981o0311M9874J1155k0551J55057K66169m656P4651R9325
5717B81908o8405j54869j63584J03722k57m3188J30568O5747J05625j26685o2133
$$ y = [-62043, -66694, -58640, 115788, 160425, 130459, 120011, 271525, 297393, 56902, -67357, -96550, -43902, 20042, 116790, 103035, 101401, 18114, -67442, -66659, -62232, -138857, -223187, -197539, -26184, -7778, -166854, -231459, -268425, -127395, -50249, -70293, -64954, 57468, 33896, 34426, 58275, -23686, -56381, -53057, -123366, -30697, -133260, -297075, -361767, -318139, -140945, 7894, 30749, -99955, -110344, -65462, -124525, 59339, 83249, 184354, 104000, 3961, 50367, 109990, 95707, 136234, 156289, 93185, 43498, -8713, 17452, 213089, 203558, 22887, -89480, -157824, -288805, -349116, -299242, -288087, -308638, -153581, 112588, 107932, 182583, 281908, 213503, 58634, -104950, -1228, -1485, -44673, 85895, 151642, 257267, 130582, 68449]
5706F8449P3032M3016j11109k40468l324Q7486M5645k29645O1371J20581J73272
5695H8306j9158J58917j41796m2529K8828j16069o7856J86806N0212m5430J84093
5684B64324p6358j55931K17702P4170j05249j86942r6905Q0590J24144J76493
5674C16038j18427l3769k2020q7447j72957p961p9556O5627l7762j65948R7026
5663b47156J33140q4689M3311P2667L2399N0420j365N5126J3276j6528J67971
5652B18572k09082l8505k0918m8205j28641r2709O3515O7421L11O5019J79962
5641E6740O9417j01955l881L6393l3125Q080K1766q7866r5842J66958O720o3704
5629b0299L2108p732j43246n6053o3137o3652L6896j2616J11571J49546L7514
$$ y = [68449, 141481, 184497, 73388, -167080, -170404, -82918, -37273, -266918, -205547, -84966, 88306, 69148, 228065, 86269, 43740, 72568, -43501, -111357, 75449, 125661, 80231, 264324, 187966, 32035, 249737, 323907, 218658, 31716, -65189, 15401, 139545, 316038, 197611, 163842, 141822, 54375, -118582, -126543, -206099, -140472, -178234, -344182, -247156, -114016, -198705, -155394, -82727, -50328, 92, -1273, 53853, 67129, 50601, 218572, 9490, -29015, -49933, -98138, -226779, -319488, -255973, -188552, -188241, -123222, 56740, 126157, 24202, 20321, 56714, 23589, 31669, 53435, -34431, -130273, 36685, 43405, -20299, 11809, 4077, -139169, -195222, -258359, -322011, -285115, -297731, -186160, -36614, 900]
5618I00j35332J32406L6745m0930L4194K61M0332j55135P8326M9896J23523j81485
5606a6299L0220J05433j06254R593m6143n8962O3658m0846o2046L1415o08j68826
5594b59665r8948J7637J8401J21821J11135l2619M111J41897J5353j5727n5025
5583c1629R911j024O0663m3807L3219M5986N9152p8352j72634j38027J41675k8299
5571a43166J23015M8026j24220j30463J18076J44624J16194k2270J4942l6829
5561A07929m8110o4246j26895J39035J59563k7965o94k06967q2287j90122k6077
5550c66836K02057J88262j63498p3815R7709J36610l3407j09709L7020k2297M1088
5539f6816P5047O9425Q829p8990j00021k3542J39553q8360j66532n4741J16851
$$ y = [900, -134432, -2026, 34719, -6211, 27983, 28244, 68576, -86559, -8233, 41663, 165186, -16299, 13921, 119354, 13100, 22693, -23450, -82412, -18754, -59600, -121646, -90231, -90839, -259665, -358613, -340976, -322575, -200754, -89619, -122238, -118127, 23770, 39123, 23396, -31629, -21718, -22742, 37921, -5886, 27333, 73319, 132471, 54119, -118515, -256542, -114867, -143166, -20151, 27875, -96345, -226808, -108732, 35892, 152086, 129816, 144758, 107929, 59819, -4427, -131322, 7713, 167276, 139311, 138617, -68350, -150637, -340759, -366836, -164779, 23483, -140015, -213830, -116121, 20489, -12918, -122627, -85607, -107904, -66816, 8231, 77656, 86485, 7495, -92526, -116068, 23485, -64875, -231407, -286148, -169297]
5528a69297p9704J06299J96007J01335M8975P184p7022k6614n1623l5793J44626
5517A64373R135M2526k4197j39053K2051m5842Q9152J774k6580j93086n2001r754
5505a61502L6118J23487J10729k3122M475q4503j25575p2317J12253J16760q4944
5494d8141j19235p8151K1812J21112J4568j95896j45860J51535O8881q24Q2474
5483a27725R2548K3892J0145j62582q6182Q1095J52969l0514j13749k7881J95844
5472G860J66615k11307j02821O042L8434Q8777N3218j96703n4517L2574J9961
5461a51867q2642N4779J20529p872o094j7537J50670m2708j12451j8986m3167
5450a57346J64229J885P0388L2392j05706j70058M1591K40234j09895j61660M6835
$$ y = [-169297, -249001, -142702, 53305, 154640, 203615, 210799, 133777, 107163, 55540, 19747, 164373, 173508, 216034, 191837, 52784, 74835, 28993, 118145, 119919, 93339, -99747, -151748, -161502, -125384, -1897, 108832, 85710, 90185, 5682, -119893, -192210, -79957, 36803, -48141, -167376, -245527, -223715, -102603, -88035, -283931, -429791, -278256, -209375, -210199, -127725, -35177, -11285, -1140, -163722, -249904, -168809, -15840, -46354, -160103, -187984, 7860, 174475, -36832, -139653, -133611, -95177, -6400, 46818, -149885, -204402, -171828, -151867, -234509, -179730, -59201, -67073, -73167, -90704, 59966, 17258, -95193, -114179, -157346, 6883, 8768, 79156, 111548, 5842, -164216, -122625, 117609, 7714, -153946, -107111]
5439a07111J6840l416L684j41822N5340O306m7209K3297J6726r525q0057J43972
5427a22975J43736j23654j62418J38653J27107j0406P6598j39151j8475m5038
5417a36023M4807J39186j4111j5312R2073N2875o2386p5001r1003j16306k7900
5406b09101J13412R2847K61166J93710j72872k79440P738N025O8671N9995n7819
5395H3332j33797m9468o8636n5209M6027J03401l1274q872J11113J42895m0155
5384I9357p5236K227P2739r5200j03761M5004p26J86665R7809j58976Q4652M0939
5372A95493q8319l5324j54147J3329k9065N45K22890l3770M7801K1381K6299j12967
5360G4146r5291M8037o6059p5859J10608p3289m564J15492M291p6863l251O242
$$ y = [-107111, -90271, -93687, -90003, -231825, -176485, -170179, -217388, -194091, -177365, -186890, -266947, -122975, 20761, -102893, -265311, -126658, 449, -9957, 66641, -72510, -90985, -136023, -91216, 47970, 33859, 18547, 110620, 163495, 101109, 26108, -64895, -181201, -209101, -95689, -2842, 258324, 452034, 279162, -278, 7460, 12485, 81156, 141151, 83332, -50465, -99933, -168569, -223778, -177751, -74350, -105624, -114496, -3383, 139512, 99357, 24121, 26348, 99087, 3887, -99874, -54870, -55596, 131069, 228878, 69902, 154554, 195493, 107174, 71850, -82297, -68968, -98033, -97488, 125402, 91632, 139433, 160814, 187113, 74146, -21145, 26892, -39167, -115026, -4418, -77707, -82271, 33221, 37512, -39351, -42602, -36360]
5348c6360k7875J11096J38530r9724j25455J360p7549l0992K0953J26171M3793
5337D3948J37972q5448j2596n7206j9037n8243J04513M0497j86082o298J04601
5326F621R2071J68081j6895k73920k31286J54351J91200J24169L0936p6410k07567
5315c8649j6831q19R991m6342P7020K8319Q1630j6578o6229J37379P3812l7616
5303A85087k1923l3191j46914k37833J1103K59162P1088J6135q077j055k52953
5292a59371j07664o0302j8371k3914J04729K32233J433J00629Q714l0153l834
5281D4129M2559m924K272j28434k8042k1090N1925Q9655l5729j03805L3632J14655
5269E6803O1417M3689p7913m4362M473m0526j6850J03183N7987l1216o9776l9898
$$ y = [-36360, -64235, 46861, 185391, 85667, -39788, -38428, -115977, -146969, -126016, 155, 43948, 181920, 96472, 83876, 26670, 7633, -50610, 53903, 94400, -91682, -97980, 6621, 98692, 266773, 249878, -24042, -255328, -100977, 90223, 214392, 245328, 168918, -38649, -55480, -56299, -46308, -92650, -15630, 12689, 94319, 77741, 11512, 148891, 222703, 185087, 163164, 129973, -16941, -254774, -243671, 15491, 86579, 102714, 94637, 93582, -159371, -267035, -327337, -345708, -369622, -264893, -32660, -31227, 69402, 78116, 47963, 44129, 86688, 81764, 84036, -44398, -72440, -93530, -41605, 48050, 12321, -91484, -57852, 56803, 118220, 161909, 83996, 39634, 44107, 3581, -13269, 89914, 147901, 116685, 46909, 7011]
5257G011r7260r234o2675j8890n9436k4987J52166Q3628n3028O5703J51232j09802
5245B4428m1347j01902L6290O8923m9015j05715J58927J4093J15686M0085j7576
5234A42877J6630M1690j59946K9855m2833j60214Q0619J8825O512R5707K8045
5223I7767k9547k9725P6577L4298L789n2912R6792P3034q5263j31878k18436l4734
5211b00238Q3151J11211n015k00188k5920K3480M4220L4220J06837J41996J51604
5200B65358J65100o5823j73389k38732r3103o9014J23707J02481J15814j30989
5190A410p5399K12688L6852k3246M3553K1427j84151M5973o0411N2124r3986l8167
5178f1333m2286K12409L4884r9133l9382m8581j27406R5686J7174Q0524p79Q1183
$$ y = [7011, -90249, -99483, -162158, -181048, -240484, -265471, -113305, -29677, -82705, -17002, 134230, 24428, -16919, -118821, -82531, -13608, -62623, -168338, -9411, 4682, 120368, 160453, 142877, 159507, 201197, 41251, 71106, 28273, -131941, -51322, -32497, -25985, 69722, 97767, 68220, 38495, 115072, 149370, 153159, 100247, 197039, 270073, 184810, 52932, -165504, -200238, -117087, -5876, -10891, -211079, -236999, -213519, -169299, -135079, -28242, 113754, 265358, 430458, 364635, 191246, -47486, -140589, -209603, -85896, 16585, 132399, 1410, -73989, 138699, 175551, 152305, 195858, 217285, 33134, 79107, 18696, 70820, -23166, -61333, -103619, 108790, 143674, 44541, 5159, -43422, -170828, -75142, -57968, 22556, 21777, 102960]
5166A02960R4664K2211j5967j63373M9298J4805R5039j39116m2197l6114N8193
5155D0403j34239m2248R9152k20789J03698J88131j4159j4509p5629q7143k5494
5144a82826R1463n1390j4688J616O4980L2133j01055O8457k1493J0293R6680j55644
5132a61474L3405J0367N5150J21221K65813q9172n9622j1334N0772m5172k8362
5121A41592k8095K3170q8639j85932m3011L2197j3530n6862M8559n1009O8781
5110a52779J5283O5852q4555o6016J8333R4575K159J18776J29638j27510k45639
5099b31883N7697J72008J20337k2567j48837P334k4814q4274Q7035m5708j31818
5088b45490O1424j3803j7446J64662N6217O8742O2126q4789j50781P4559J12203
$$ y = [102960, 197624, 219835, 203868, 40495, 89793, 104598, 199637, 60521, 18324, -17790, 40403, -93836, -136084, -36932, -257721, -154023, 34108, 19949, 5440, -70189, -157332, -182826, -91363, -142753, -157441, -155825, -90845, -58712, -159767, -91310, -112803, -102510, -5830, -161474, -128069, -117702, -62552, 58669, 324482, 235310, 175688, 164354, 215126, 169954, 141592, 113497, 136667, 48028, -137904, -180915, -148718, -162248, -219110, -170551, -221560, -152779, -137496, -71644, -156199, -222215, -203882, -109307, -107148, 11628, 141266, 13756, -231883, -174186, -2178, 118159, 95592, -53245, -45911, -70725, -154999, -67964, -113672, -245490, -184066, -197869, -215315, -50653, 5564, 74306, 136432, 51643, -99138, -24579, 87624]
5077H7624j50437j84036q6191O6494J06955M0127L23061k5214k674j64868l11423
5066c00582N6963J59122O4712J06495R0253L4825j56001j35937P7878J21082J51880
5055B70690K2726j77549j13334j8619J55437l3153j07784K3780p897K5625J15851
5044A55773K15636m397k29633j19777K43022r451k85005p2555j605r9854j887
5033b09733n7688Q5358P9343J2771p7411p0410P2377J62820j02931j74576k2588
5022c02668K47445j0246n8639j0217j7233J61194J08246n9132q6564j39889j0368
5011a78071K14564j23307l2831J48863J51013j22865M171k18809l0190J59327
5001b8135j3042q2243P8559J02632O40P2810j24324R8271J47551j23664j05777
$$ y = [87624, -62813, -246849, -333040, -266546, -159591, -119464, 203597, 178383, 175709, 10841, -300582, -243619, -84497, -19785, 86710, 176963, 211788, 55787, -80150, -2272, 118810, 270690, 293416, 115867, 2533, -16086, 139351, 106198, -1586, 22194, 14297, 39922, 155773, 371409, 367012, 137379, 17602, 260624, 251173, -33832, -106387, -107992, -207846, -209733, -267421, -182063, -102720, -89949, -167360, -237770, -165393, -2573, -105504, -280080, -302668, -55223, -65469, -124108, -134325, -151558, 9636, 117882, 58750, -27814, -167703, -178071, 36493, -86814, -119645, 29218, 180231, 57366, 61537, -157272, -187462, -28135, -41177, -123420, -44861, 57771, 58411, 131221, 6897, 105168, 252719, 129055, 23278]
4990B3278P6330j017j02155l5928Q4152J19812l396j38687o1403N1500P9448q4255
4978G679l9031k9052K7551P8218r8977O954J5331J81507j34892p0702Q2057N7060
4966H3703o1195j00132r392m6776j358J5921L3217N8910L7292n0980j26079n4650
4954b21519P2263j8975J4558J48568k29700k09516J13306K75339K06766l2584
4944A18506q9012p421j17394m2049K4077J31608O3581M7257j946o7547k69331
4933b09671K288J87539N004m8044L8084r661L569N3311J8536k3926O2399P9566
4921A58994j9432J0136j14514k02076P4060o8177k3485J85440m3739o2167j4038
4910a18998J16591K1918L6794o9862k9562Q9787j7801n6323k8499k79965n1509
$$ y = [23278, 99608, 98591, -3564, -39492, 44660, 164472, 161076, 22389, -39014, 12486, 91934, 7679, -31352, -60404, -32853, 45365, -53612, -46658, -31327, 150180, 15288, -55414, 26643, 83703, 22508, -77624, -87016, -133792, -135150, -119229, -86012, -27102, 10190, -40790, -166869, -221519, -149256, -168231, -153673, -5105, -234805, -444321, -331015, -55676, 151090, 118506, 29494, 22073, -95321, -137370, -113293, 18315, 81896, 129153, 127207, 59660, -209671, -207383, -19844, -14840, -62884, -24800, -34461, -30892, 22419, 40955, 17029, 79428, 158994, 139562, 149698, 35184, -166892, -92832, -161009, -184494, 946, -42793, -104960, -118998, -2407, 19511, 56305, -13557, -43119, 46668, 28867, -27456, -55955, -335920, -387429]
4899c87429J72528R3251j6719K3286K1774l1848L7482J02144J63395M5335j22622
4888A00577j77069L2307l3169K28054j36811j59692J30213P2055P7435o1l14442
4877a80603n5599J82960N8362j4843P2255P1366J04197J25531j3546j56951j28461
4866F4668O506q5859Q7394M3752j52797J6176j21679j40510n1950J12574J51357
4855g0368L4980j7576j25206j19624R2406R9260J32950j48335j30740K9745n4233
4844b76741j7197M1515J45956J16283j4870Q9683j21521k56564P5970J10791N3916
4833e2779J47937R5634j47127l8590K6625k0977J31358P6368j56756j60694m9397
4822a48398J7685L0439R9322K2379J20300M2119m5564K4607R0812k82889j59551
$$ y = [-387429, -214901, -121650, -138369, -115083, -93309, -125157, -87675, 14469, 177864, 223199, 100577, -76492, -44185, -77354, 150700, 13889, -145803, -15590, 56465, 133900, 133839, -180603, -236202, -53242, 5120, -9723, 62532, 133898, 238095, 363626, 350080, 193129, 64668, 71174, -14685, 72709, 116461, -36336, -20160, -141839, -282349, -334299, -221725, -70368, -35388, -52964, -178170, -297794, -205388, -106128, 26822, -121513, -252253, -222508, -276741, -293938, -252423, -106467, 9816, -5054, 84629, -36892, -293456, -217486, -106695, -52779, 95158, 190792, 43665, 5075, 31700, 10723, 142081, 218449, 61693, -99001, -148398, -130713, -100274, -952, 21427, 141727, 183846, 138282, 162889, 253701, -29188, -188739]
4811a88739j52976J47289J2242M3179j66070Q0045j55R7575l1476p0301J3622
4800b15765r0266K3473q5555P9034K1412R4733L4961q2889K05201J57091k89596
4789a48166j79964K8374J6594l1807J41355J66892J02800n8537j26173o1524j5349
4778a65505n2921Q9368N9397o0023j28480J04870J56789k6747O8237o696l8555
4767b66j6933k0549L3306m4815K1827k4998k04810J2754J29990o0887j49354q9442
4755d14177j17387R6791K87355J83564k2238j02373M5489P9146K2658m6064O0175
4744G2939j1232N5786j38346j16098L9545L4039J51107j60279j4847K47287k7834
4733A32067j05914O9578P3362p9947P1672j13052q4889j21583J1859J90531K0029
$$ y = [-188739, -341715, -194426, -182184, -139005, -305075, -225030, -225185, -127610, -159086, -229387, -215765, -306031, -282558, -368113, -289079, -267667, -172934, -137973, -220862, -15661, 141430, -148166, -328130, -299756, -283162, -314969, -173614, -6722, 96078, 37541, -88632, -150156, -165505, -218426, -129058, -69661, -129684, -258164, -153294, 3495, -23252, 44985, 38289, -266, -17199, -37748, -4442, -49257, -27430, -52428, -257238, -244484, -114494, -175381, -324735, -414177, -531564, -434773, -147418, 36146, 13908, -88465, -42976, 36170, 58828, 12764, 72939, 61707, 117493, -20853, -136951, -97406, -63367, 87740, -72539, -87386, 159901, 132067, 26153, 95731, 169093, 89146, 160818, 47766, -37123, -158706, -146847, 43684, 63713]
4722F3713N5347j5983n2400L769J52401O4943Q914p1389O4100J31316q9213r8566
4710B16952j45033j16520J64623J03203j48194o8832J08648O5015N5661j12251
4700A23272M17j06895j05041K154Q5462J34906l8810L2348l4790q9690k19357
4689b16024j7149K57114M1112P6523J58304k0471L0661J11487m6661m6073p0874
4678B57949n4264j15905q2545j27352J00629j11764r049O9619K47358J05278n8820
4667B21134j27944q1861j7140J8745P6439n4869j68599o9542m9418Q4323R6166
4656g2566l0118M6711M9353J40677M4200n3127p2936J2028N4686p7081n5858N2687
4644C8656j7008j21342k2072j22955m4649k6275J94989K15689p7822j94398p767
$$ y = [63713, 119060, 103077, 50677, 54446, 206847, 271790, 280704, 209315, 273415, 404731, 315518, 216952, 71919, -44601, 120022, 223225, 75031, 6199, 114847, 179862, 235523, 123272, 123689, 16794, -88247, -86093, -631, 134275, 95465, 127813, 93023, 3333, -216024, -233173, 23941, 65053, 141576, 299880, 279409, 310070, 421557, 374896, 328823, 257949, 203685, 87780, 5235, -122117, -21488, -133252, -142301, -72682, 174676, 279954, 221134, 93190, 11329, -5811, 12934, 89373, 34504, -134095, -203637, -253055, -168732, -72566, -102684, -55973, -6620, 134057, 178257, 125130, 52194, 64222, 118908, 41827, -14031, 38656, 21648, -99694, -121766, -244721, -289370, -315645, -120656, 95033, 17211, -177187, -184954]
4633a84954O4944n5662O503N9740K9838K38078J52347K6781j73296J17581J70680
4622D52580j31607k47752r4731q7184q6798k1737j73497j2508Q6936j15843J48782
4611b83359J23381Q6827N9455j5941o8791j08427n4937j7654J26190J46997K8979
4600B2720o4049j58745j8509Q9950L0875J86030J44665l514Q6484m7189l2033
4589B36685k23975k19655M8251O0357j72342R9733J78814J8940j50380j3506M5455
4578i1623l586K9240R3986j7603l6767J08989k0572O3290r2226k02279r3339J85260
4566g7230P4584J88266N6991m4881q9321j32115k1287l1654P1133O8534k5421
4555C7599k1179j8396j4138r9854j35270j9909Q2574J47559j34623k9937J42521
$$ y = [-184954, -120010, -175672, -169169, -109429, -79591, 158487, 310834, 337615, 164319, 281900, 452580, 320973, 73221, -21510, -108694, -195492, -217229, -390726, -403234, -316298, -432141, -283359, -159978, -73151, -13696, -29637, -98428, -206855, -261792, -279446, -153256, -6259, 22720, -41329, -200074, -218583, -128633, -97758, 88272, 232937, 229423, 315907, 268718, 236685, 12710, -206945, -158694, -98337, -270679, -170946, 7868, 26808, -123572, -137078, -91623, -95209, -65969, 28017, 10414, -26353, 82636, 62064, 125354, 33128, -169151, -262490, -77230, -2646, 185620, 242611, 197730, 108409, -23706, -44993, -76647, -5514, 63020, 37599, 16420, -1976, -16114, -115968, -251238, -271147, -188573, -41014, -175637, -205574, -63053]
4544f3053q2577j2509N8176r904L230j13098m8996j1602J20412J18876L3314k747
4532a0478m3516m3424J65883J08925J6963o018k74891j0501l529K0443R5375N8784
4520G4016k9385m7439n1549L8048m8173l34406R889J80557L5304O6295J18748
4509A1905l9450m5664M2251j25647m7454K79315P0720j31381k11607j10659L2557
4498b75114J98232J14676J39488p5558l5233O8563n327l5326J37734n9320k04235
4487c1420j15081r4515K350P6811J68482M6708o3578m8980l676J21299O6923n4912
4475G0411Q3784R1412k8066r7100q8420J22027M2692J5712j08787m9922J4146
4464F7889k7096O3833M1205j17533l0985P6741J53940J08402n8887r6109j50728
$$ y = [-63053, -145630, -158139, -99963, -109867, -106637, -219735, -268731, -280333, -159921, -41045, -7731, -10478, -53994, -97418, 68465, 177390, 194353, 188335, -86556, -97057, -100586, -80143, 15232, 74016, 44631, -2808, -54357, -16309, -64482, -398888, -388999, -208442, -173138, -106843, 11905, -27545, -73209, -30958, -156605, -204059, 75256, 145976, 14595, -197012, -307671, -275114, -76882, 37794, 177282, 101724, 66491, 135054, 129727, 94401, 232135, 172815, -31420, -146501, -241016, -238666, -161855, 6627, 53335, -10243, -59223, -62899, 58400, 125323, 70411, 154195, 245607, 217541, 120441, 32021, 154048, 196740, 212452, 103665, 53743, 67889, 40793, 104626, 145831, 28298, -2687, 74054, 227994, 336396, 277509, 181400, 30672]
4453C0672L5156p9038l5315n072j7009j6194J11635l8648n9544J58682J1353j27465
4441c0787R2495n6028M9669J18967q4356p7607n6391M7330k2177R8650m1638j04471
4429f6344N1765L1175l1315L0703P9145L756N850R5012l1042j44294r567J6898
4417C1742N2872r1891j23855J69508N7021p5676P0804m6801M3603L5242k7606
4406I4963n2393N8261j3501Q4650O0829L4557K9469r280p6319l41690P3146J11158
4394E3850K1842o8330J52700L1986j41449k8169l0329j28K28162Q2374j2357L2317
4382C22469l7623o4811p1589n4019j00616n4111J34268P8188j51232j55627J06171
4371d8532K43615O3649m0056L9098O064J9674L8789j96903o6123m768J49952J05474
$$ y = [30672, 65828, -13210, -48525, -53597, -70606, -86800, 24835, -13813, -73357, 85325, 96678, -30787, 61708, 5680, 55349, 174316, 89960, 12353, -44038, 3292, -18885, 79765, 38127, -66344, -14579, 16596, -14719, 15984, 95129, 98885, 104735, 199747, 168705, 24411, 14844, 31742, 84614, -7277, -131132, 38376, 95397, 19721, 90525, 43724, 87327, 122569, 94963, 42570, 100831, 87330, 171980, 232809, 267366, 296835, 287555, 211236, -130454, -57308, 53850, 75692, 7362, 160062, 192048, 50599, 22430, -7899, -8027, 220135, 302509, 290152, 322469, 284846, 220035, 148446, 94427, -6189, -60300, 73968, 152156, 924, -154703, -48532, 195083, 258732, 218676, 257774, 263838, 283512, 322301, 125398, 59275, 54507, 204459, 309933]
4359C09933q2633j11560l8768k3731o1659k7695J5389k9931J12872J85909k2231
4348B25895k40786j05572K7441m9765n8009J5667K07194J27390M852j30424k18279
4337a94396J44495J10296m2533O3766K0753q9518R8895j49839l5289n7432j59229
4326b90031j30838r1996K09819K90291P9065o1184J30164R5333j315j85348j16967
4315g3007O3262J40368j35043j45035J36301P2502n5476L3984J94614p187j53001
4304G2282k5663k06376n2124P2333J609J40869J23190m4852j85399j35884j521
4293b41536l2166P245L0745J34768K7116o5673l2595J04143J14688N413o6335
4282a4187k5645j68147l8950J25545l6681J36030J82646k0597j12625N3498p7795
$$ y = [309933, 227300, 115740, 76972, 53241, -8418, -36113, -20724, -50655, 62217, 248126, 225895, -14891, -120463, -93022, -142787, -200796, -185129, 22065, 149455, 154307, 23883, -194396, -49901, 60395, 17862, 81628, 102381, 12863, 111758, -38081, -73370, -130802, -290031, -420869, -512865, -303046, -12755, 66310, 5126, 135290, 230623, 229308, 43960, -73007, -9745, 130623, -4420, -149455, -13154, 59348, 3872, 37856, 232470, 225283, 72282, 46619, -159757, -211881, -139548, -137939, 2930, 126120, 81268, -104131, -240015, -241536, -273702, -266457, -235712, -100944, -73828, -139501, -172096, -67953, 46735, 52148, -14187, -39832, -207979, -246929, -121384, -158065, -22035, 160611, 140014, 27389, 80887, 3092]
4271C092M6300r6857N6181J4318J56759M1532n1249p8294Q6302N7976k23971j10901
4259i8812Q0527J01097R1954r571n8028l4573J29673j01616m5667K8889r0668
4248f795j47708q3745P8831l706N7191P7095J12898m6372J37598L7859j45885
4237F7261l18000k93157J00969J36853J04873M0958J7944O4311Q8891k9670L0471
4226A1704N6778n921N215Q1543p5633J5469J63149o320j18447j4957J6293P3387
4214B02260k4383R8722o8156j49652M4097L7013k3697k1421p0223j4975J64307
4203A73892J73916j58113k41744J04528K5853o0959n5829o3372j08187O8404j35217
4192b76828r8481L20626L21665N7795k52914o7751O5925q6996R3579J34342O8424
$$ y = [3092, 49392, -47465, 8716, 23034, 179793, 221325, 170076, 91782, 178084, 236060, 12089, -98812, -18285, 82812, 174766, 165195, 107167, 72594, 202267, 100651, 54984, 83873, -6795, -154503, -238248, -159417, -163123, -105932, -28837, 84061, 37689, 175287, 213146, 67261, -250739, -543896, -442927, -306074, -201201, -160243, -142299, -77988, 10903, -18767, 11704, 68482, 62561, 67776, 149319, 73686, 89155, 252304, 245984, 127537, 112580, 128873, 202260, 177877, 276599, 208443, 58791, 102888, 139901, 116204, 94783, 24560, 9585, 173892, 347808, 189695, -52049, 52479, 78332, 17373, -38456, -101828, -210015, -141611, -276828, -375309, -54683, 266982, 324777, 71863, 4112, 70037, -16959, 76620, 210962, 279386]
4181B79386k127J21989j02003o4717o2152o6917M5051J10058j15700j35054O5719
4170G3533k5768p4382p8985m7657j80116M3935J34179J43080j3151k0446P1625
4159B5847q4581J8057n012o738r0014J98589Q8564k56526j18418k4199l3863J38745
4147a49549J07474J08961J60743R6720P8089O9093n7551k6432m2101m2579o9318
4136B33550P1295R246p0224m7993k6543p2841P0493q2657m9371P877p4015p832
4124c9015j22209l1111J5035J6441j4401l048Q6241p9843Q1981k3951j33992J75375
4112g2497Q6406O1713K6617o0123K0727Q1630m1331J5091M127J25546l7758j80611
4100B9537k9779J40184j42007j75702o7222O7013k5940M9367j4603J57825L8055
$$ y = [279386, 277259, 399248, 297245, 232528, 170376, 103459, 148510, 258568, 142868, 7814, 73533, 47765, -26617, -105602, -153259, -333375, -289440, -155261, -12181, -25332, -45778, 25847, -58734, -40677, -45689, -52427, -142441, 56148, 144712, -111814, -230232, -254431, -288294, -149549, -42075, 66886, 227629, 324349, 402438, 471531, 413980, 387548, 345447, 302868, 233550, 304845, 314091, 243867, 195874, 169331, 96490, 166983, 84326, 34955, 42832, -31183, -39015, -161224, -192335, -177300, -160859, -175260, -178308, -92067, -171910, -89929, -113880, -247872, -72497, 13909, 75622, 102239, 42116, 62843, 144473, 103142, 118233, 122360, 247906, 210148, 29537, -242, 139942, -2065, -177767, -244989, -177976, -203916, -154549, -169152, -11327, 26728]
4089B6728j50382j15106k6620J54149J40973j5084q9549j13239J67942J21964
4079A01776m7831R6797L1156j14054r5593j50207N5505Q4785m344R1497J49124
4068A98611r9761j57954N6119L9414j89451K6243k9087j17778j02828J19409J50844
4057a06219J39265K3432M9429J27614P7807J8942r9346j00330Q2686K11666j0760
4046D14186l05411m5774p1297P0142n3350j59707o8559O2541j3999Q7513O6066
4035a7649j17379j3715k416P8121j520j06427J50451K02024q2171j12281n8694
4024h1656o5259J07268K36251N3176j1535O0035q7674p3275l0292j21353j10838
4013a25152M2356r7409J08569K63219R2341j02670k47094q0430o5274j9410J11934
$$ y = [26728, -123654, -238760, -265380, -111231, 29742, 14658, -74891, -188130, -20188, 101776, 53945, 150742, 181898, 67844, -27749, -177956, -122451, -37666, -42010, 49487, 198611, 98850, -59104, -2985, 36429, -153022, -126779, -155866, -273644, -376472, -257063, -106219, 33046, 56478, 105907, 233521, 311328, 330270, 230924, 130594, 213280, 424946, 414186, 108775, 63001, -8296, 61846, 8496, -151211, -219770, -157229, -171228, -83715, -17649, -135028, -148743, -151159, -73038, -74558, -180985, -30534, 171490, 89319, -22962, -81656, -146915, -39647, 196604, 249780, 238245, 298280, 210606, 137331, 107039, -14314, -125152, -82796, -180205, -71636, 191583, 283924, 181254, -65840, -146270, -211544, -230954, -119020]
4002a19020R5792o7476N1537M1321K7839l1040k06261J22441R5078p1838L0862
3991c0765J22335j58185j13905j35941j21316J57751J10693k7148K9588Q3917
3981h2976K2638j16865J31037P8239p8828n2262J1325J35109R4310J33889p6114
3970A99502M0662P3190k3197j14478k7366q9503o4384M7842k5046R2370j46622
3959c7030o4596J05082L3094j69155q2318K29796K33500p0309o4966l4462J70691
3948B49327J7719r5149j82839j75344Q2719J01321p3805K3785O5921P4068o5269
3937B2454p8052j17867j13219m7049J11316O770l9329J41579M1805M7770M9497
3926B5675q8076K3025p4999m769R0463n0203M871M1573J03919m6429n0708j5561
$$ y = [-119020, -23228, -90704, -39167, 2154, 29993, -1047, -207308, -84867, 10211, -61627, -30765, 91570, -66615, -180520, -316461, -437777, -280026, -169333, -196481, -166893, -82976, -60338, -177203, -46166, 32073, -46755, -99017, -87692, 47417, 141727, 275616, 199502, 240164, 313354, 290157, 175679, 148313, 58810, -5574, 42268, 17222, 109592, -37030, -101626, 3456, 36550, -132605, -214923, 14873, 248373, 178064, 113098, 78636, 249327, 267046, 171897, -10942, -186286, -103567, -2246, -76051, -52266, 13655, 87723, 22454, -55598, -173465, -286684, -333733, -222417, -215647, -254976, -113397, -71592, -23822, 25675, -62401, -39376, -114375, -119144, -28681, -78884, -74013, -32440, 71479, 25050, -25658, -41219]
3914d1219j44584j23389K36170J10276q414J01007p4068J32568J05464r354j68763
3903A15694l6915j01850P0762L2858M1477k27801p3432J56062j1681j73178j9113
3892b27117K12408R4044J6675N0873r4129j89277j4007N7762L9582J3756L1208
3881h222M7152j19003M4298j07973j61663N0017Q4023M1600J27424P7568J35723
3870B10944R1116M0312Q219j87176p7653J78464p0673j03317J39851n9590l8624
3859A31873K0029m3054m0956P3410o0950J2783J51441p5344j7132L0991J35523
3848C18614q6898L9144q7984o1842q5440p5060m4251m3076N4482O5804J12127
3837A05620K02895j12504j69326K347L259j46954K9827K03793q826l3830k2768
$$ y = [-41219, -185803, -309192, -73022, 37254, 28840, 129847, 55779, 188347, 293811, 284457, 115694, 78779, -23071, 47691, 80549, 122026, -105775, -179207, -23145, -34826, -208004, -227117, -14709, 79335, 96010, 146883, 52754, -136523, -150530, -92768, -53186, -39430, -8222, 38930, -80073, -35775, -143748, -305411, -255394, -171371, -129771, -2347, 75221, 210944, 302060, 342372, 350591, 163415, 85762, 264226, 193553, 90236, 230087, 170497, 131873, 151902, 108848, 67892, 141302, 80352, 93135, 244576, 169232, 152100, 183091, 318614, 231716, 270860, 182876, 121034, 35594, -39466, -83717, -126793, -72311, -6507, 105620, 308515, 196011, 26685, 29032, 32291, -114663, -84836, 118957, 110131, 76301, 53533]
3826E3533j3346k2685J30787n3686k14715P2526L28181R8835k41954L312K7459
3815A68247o693j68848j26755l0294l8676N2991M67k3910J74653J22688J38573
3804B62443j10321k50811j02895J6808J52613j01163j02767M8673R4424M8155
3794d4841j7488Q3270J2128k2077j44054O8043j3288l7644N1418j27535n2848
3783b44916M9843K24162J65204o7262O3358n7084j71144k2581R8715L6143p2097
3772B341k7513M8915l2152P985L0515J04208j96235j20223R9565P9035J45828
3761A42269m2706j82685K40424n4784j49850Q3622N3597q5769k29765n6574R2981
3750a89240J30330J42006J05061Q2754j33478j13002p4796M2724O6745j1524K3374
$$ y = [53533, 40187, 17502, 148289, 94603, -120112, -47586, 280595, 379430, 137476, 140788, 168247, 161554, -7294, -134049, -164343, -203019, -150028, -149561, -173471, 1182, 123870, 262443, 152122, -98689, -201584, -184776, -32163, -133326, -236093, -187420, -92996, -44841, -62329, 20941, 33069, 10992, -133062, -65019, -78307, -115951, -64533, -192068, -244916, -195073, 29089, 194293, 127031, 190389, 133305, -37839, -60420, 38295, 74438, 2341, -25172, 23743, -8409, -424, 30091, 134299, -61936, -182159, -82594, -3559, 142269, 99563, -83122, 157302, 102518, -47332, 36290, 89887, 4118, -225647, -282221, -189240, -58910, 83096, 188157, 270911, 137433, 24431, -50365, -7641, 59104, 47580, 70954]
3739G0954M4361Q3938o656Q657m0639j71090j12083P5748Q1384J01759j2636p6493
3727D7204R793j32658j06894J16192J41177J92563r7580p1607p2133r7512J20583
3716D9128J18793K5762j45184K0616r3140J2355J57640L1222j52816J3922p5412
3705c7114k98585o9575J51983J36452J00059J22114o6524q0756j73869k10796
3695d26611P4839J47432K16775J12592J8162j4685j6655k8688j0445l6361j07894
3684g1539L511L0121K0278J29399l3888j33414n6545p7721k9260n4370O463J23523
3672a43442j9673Q8609K8315n4134r6618J09790J9791j617K8170J5429k3275O1672
3660A3017L8566j05625m2377j7259j30914K0578J80058j2124l2614J86930J24096
$$ y = [70954, 115315, 199253, 192597, 201254, 160615, -10475, -122558, -46810, 34574, 136333, 123697, 47204, 56997, -75661, -182555, -66363, 74814, 267377, 169797, 98190, 26057, -71455, 49128, 167921, 193683, 48499, 69115, -24025, -11670, 145970, 177192, 24376, 38298, -37114, -335699, -405274, -253291, -116839, -16780, 105334, 38810, -41946, -215815, -426611, -351772, -204340, 12435, 125027, 143189, 128504, 111849, 83161, 72716, 36355, -71539, -68028, -37907, -17629, 111770, 77882, -55532, -112077, -189798, -219058, -273428, -266965, -143442, -163115, -74506, -46191, -100325, -196943, -87153, -67362, -68979, -40809, -25380, -48655, 13017, 51583, -54042, -96419, -113678, -244592, -224014, -43956, -56080, -88694, 98236, 222332]
3649B22332q8180j17152j8542J05662L0688J3950R9244m9217j75341L5586n7805
3638A225j15210l1094p6327l5309R3513J33245Q8646j27212o3202Q9967K51681
3627B09923o8310j83227j6075m932q0669n0804J01367O8895K0155J31038m2748
3616H4613q081o8631j98128Q7294J48306j6738L8513N1948k6315j31898p9958
3605a19075J70455O0568j48152r0234K8355J67871J8987q2110k4391J6617j62843
3594a63952r1413M6603o9041K5197K58601J00192l0298J3048Q417j86427q2199
3583a71272J35046J25951j6337k30899m0031q7041l4788p1586J57135J10242q9554
3572b13134J44762J21655K4461j44755j23422j08335R8268L3252O3052n0506p827
$$ y = [222332, 134152, 17000, -1542, 104120, 134808, 148758, 248002, 198785, 23444, 59030, 1225, -113985, -145079, -221406, -256715, -163202, -29957, 58689, -68523, -131725, -41758, 209923, 141613, -41614, -57689, -62621, -143290, -194094, -92727, -23832, -3677, 127361, 84613, 76532, 7901, -190227, -102933, 45373, 28635, 67148, 119096, 92781, -39117, -119075, 51380, 111948, -36204, -126438, -98083, 69788, 88775, 6665, -17726, -1109, -163952, -255365, -208762, -277803, -252606, 5995, 106187, 75889, 88937, 97354, -89073, -171272, -36226, 89725, 73388, -157511, -197542, -284583, -319371, -390957, -233822, -123580, -213134, -68372, 53283, 77744, -67011, -190433, -298768, -200500, -167248, -104196, -154702, -162529]
3561a62529N4167K2716k4718P7229N189j01688p5287N710M350Q8100K71073J03127
3549B67439n7418k24552m0248J28177p1436j9264P6623K3171M9375r8684j20262
3538h7079j8699K6246k5717j04475p1687K7885M8944j8156Q3432K16453J14272
3527A91419j41279P7400m7869L5780K5782r9007O1789k9536J1855K01553p6766
3516B11121p6761l7598P3217J48491p3276J6440k0913j0141j42053k3040J30660
3505A96147J314k4525o399n0653m113r2926M5720P8910n1784q0012k07263l7238
3493b32822J50372J57745j0682l3984J31117M3949L1933o4515R147k08708j23204
3482a49652P865r0910J2551Q0752J76029Q1977q6626L5921N1480j46294j23363
$$ y = [-162529, -108362, -85646, -110364, -33135, -27946, -129634, -204921, -199211, -194861, -106761, 164312, 267439, 210021, -14531, -54779, 73398, 1962, -17302, 59321, 82492, 131867, 33183, -87079, -105778, -79532, -105249, -209724, -281411, -253526, -204582, -222738, -139306, 77147, 191419, 50140, 127540, 79671, 115451, 141233, 42226, 104015, 74479, 86334, 287887, 211121, 134360, 96762, 169979, 318470, 245194, 261634, 240721, 230580, 88527, 65487, 196147, 197461, 172936, 166537, 115884, 111771, 18845, 64565, 143475, 91691, 11679, -195584, -232822, -82450, 75295, 64613, 30629, 161746, 205695, 237628, 173113, 182260, -26448, -149652, -141787, -232697, -220146, -139394, 36635, 118612, 31986, 67907, 119387, -26907, -150270]
3471a50270j18425J41472J19497J0899J34114J12600j18192p9859J4150q503l3770
3460B3713J0650q3937r378K178j07274n2023L8002R6072J53797n717J1282l2278
3448D5087j82251q3767J61714N0298l9067M0658O3909N5324K02060j45587m3273
3437A25105n7212L5759n7015n083m3943k8703j11703J34989J31404j13989j78501
3426a68892o0928J4332J01605J74594j1284m1212k0158q4932p5537j7548R298
3415a80662N0012J34604J24062j06861k285N6038m6278P6299m9099r1324N0539
3404A5045j19193K51934J14299j22591k16742j2164O2331l7528o1509m7179j09275
$$ y = [-150270, -268695, -127223, -7726, 3173, 137287, 249887, 131695, 51836, 65986, 57483, 23713, 34363, -49574, -58952, -56774, -164048, -216071, -178069, -81997, 71800, 66083, 77365, 45087, -137164, -220931, -59217, -8919, -47986, -7328, 56581, 111905, 313965, 168378, 125105, 67893, 103652, 46637, 41554, -2389, -31092, -142795, -7806, 123598, 9609, -168892, -229820, -215488, -113883, 60711, 49427, 8215, -11943, -96875, -172412, -189960, -180662, -130650, 3954, 128016, 21155, 18870, 74908, 28630, 104929, 55830, -35494, 15045, -104148, 147786, 262085, 139494, -77248, -89412, -27081, -64609, -126118, -173297, -282572]
$$ [...]
##END NTUPLES=NMR SPECTRUM
##END=
