##TITLE=Analysis number 324054
Compound Code btb 09899
Project Code adrs
Chemist Name adomenas
##JCAMPDX= 6.0         $$ Bruker NMR JCAMP-DX V2.0
##DATA TYPE= NMR SPECTRUM
##DATA CLASS= NTUPLES
##ORIGIN= Bruker BioSpin GmbH
##OWNER= nmr
$$ XWIN-NMR		Version 3.5
$$ Tue Nov 14 11:46:28 2006 GMT Standard Time (UT+0h)  MAYBRIDGE\nmr@NMR_250MHZ
##.OBSERVE FREQUENCY= 250.131544655141
##.OBSERVE NUCLEUS= ^1H
##.ACQUISITION MODE= SIMULTANEOUS (DQD)
##.ACQUISITION SCHEME= undefined
##.AVERAGES= 16
##.DIGITISER RES= 18
##SPECTROMETER/DATA SYSTEM= dpx250
##.PULSE SEQUENCE= zg30
##.SOLVENT NAME= CDCl3
##.SHIFT REFERENCE= (INTERNAL, CDCl3, 0, 16.522)
##AUDIT TRAIL= $$ (NUMBER, WHEN, WHO, WHERE, WHAT)
$$ ##TITLE= Audit trail, XWIN-NMR		Version 3.5
$$ ##JCAMPDX= 5.01
$$ ##ORIGIN= Bruker BioSpin GmbH
$$ ##OWNER= nmr
$$ C:\u/data/dgb/nmr/ADRS/250/pdata/1/auditp.txt
$$ ##AUDIT TRAIL=  $$ (NUMBER, WHEN, WHO, WHERE, WHAT)
(   1,<2006-11-14 11:45:59.80 +000>,<MAYBRIDGE\nmr>,<NMR_250MHZ>,
      <created by zg, POWCHK disabled, PULCHK disabled
       configuration hash MD5:
       49 4B E0 1D 92 C2 6B 37 9F E6 65 BC 52 41 86 1D
       data hash MD5: 64K
       63 6F 88 87 E6 5C EE B7 72 FF AE AA 44 BC 97 F6>)
(   2,<2006-11-14 11:46:16.12 +000>,<MAYBRIDGE\nmr>,<NMR_250MHZ>,
      <Start of raw data processing
       ef LB = 0.3 FT_mod = 6 PKNL = 1 SI = 32K 
       data hash MD5: 32K
       49 1F F6 3C 68 84 8E D0 1A 91 A6 D0 02 6A 7A 7B>)
(   3,<2006-11-14 11:46:17.95 +000>,<MAYBRIDGE\nmr>,<NMR_250MHZ>,
      <apk 
       data hash MD5: 32K
       47 0B 81 87 A4 72 BE 30 37 45 FD 10 16 2A E7 39>)
(   4,<2006-11-14 11:46:18.83 +000>,<MAYBRIDGE\nmr>,<NMR_250MHZ>,
      <abs ABSG = 5 
       data hash MD5: 32K
       26 7C 1C E2 82 2F 1C 44 DE 2E C7 E0 7F AE 18 79>)
$$ ##END=
$$ 
$$ hash MD5
$$ A9 A7 28 D4 DA A1 7E 53 5E 8E 3F 95 FB D3 EC EF
##$RELAX= 
##$RELAX= 
##$RELAX= 
##$RELAX= 
##$RELAX= 
##$RELAX= 
##$RELAX= 
$$ Bruker specific parameters
$$ --------------------------
##$DU= <C:\u>
##$EXPNO= 250
##$NAME= <ADRS>
##$PROCNO= 1
##$TYPE= <nmr>
##$USER= <dgb>
##$AMP= (0..31)
100 100 100 100 100 100 100 100 100 100 100 100 100 100 100 100 100 100 
100 100 100 100 100 100 100 100 100 100 100 100 100 100 
##$AQSEQ= 0
##$AQ_mod= 3
##$AUNM= <au_zg>
##$AUTOPOS= <28 >
##$BF1= 250.13
##$BF2= 250.13
##$BF3= 250.13
##$BF4= 250.13
##$BF5= 500.13
##$BF6= 500.13
##$BF7= 500.13
##$BF8= 500.13
##$BYTORDA= 1
##$CFDGTYP= 0
##$CFRGTYP= 5
##$CHEMSTR= <none>
##$CNST= (0..31)
1 1 145 1 1 1 1 1 1 1 1 1 1 1 1 1 1 1 1 1 1 1 1 1 1 1 1 1 1 1 1 1 
##$CPDPRG= <>
##$CPDPRG1= <>
##$CPDPRG2= <>
##$CPDPRG3= <>
##$CPDPRG4= <mlev>
##$CPDPRG5= <mlev>
##$CPDPRG6= <mlev>
##$CPDPRG7= <mlev>
##$CPDPRG8= <mlev>
##$CPDPRGB= <>
##$CPDPRGT= <>
##$D= (0..31)
0 1 0 0 0 0 0 0 0 0.06 0 0 0 0 0 0 0.0002 0 0 0 0 0 0 0 0 0 0 0 0 0 0 
0 
##$DATE= 1163504758
##$DBL= (0..7)
120 120 120 120 120 120 120 120 
##$DBP= (0..7)
150 150 150 150 150 150 150 150 
##$DBP07= 0
##$DBPNAM0= <>
##$DBPNAM1= <>
##$DBPNAM2= <>
$$ [...]
##$SUBNAM7= <"">
##$SUBNAM8= <"">
##$SUBNAM9= <"">
##$SW= 20.6930455092707
##$SWIBOX= (0..15)
0 0 3 0 0 0 0 0 0 0 0 0 0 0 0 0 
##$SW_h= 5175.983436853
##$TD= 65536
##$TD0= 1
##$TE= 683.16
##$TE2= 300
##$TE3= 300
##$TEG= 300
##$TL= (0..7)
0 120 120 120 120 120 120 120 
##$TP= (0..7)
150 150 150 150 150 150 150 150 
##$TP07= 0
##$TPNAME0= <>
##$TPNAME1= <>
##$TPNAME2= <>
##$TPNAME3= <>
##$TPNAME4= <>
##$TPNAME5= <>
##$TPNAME6= <>
##$TPNAME7= <>
##$TPOAL= (0..7)
0.5 0.5 0.5 0.5 0.5 0.5 0.5 0.5 
##$TPOFFS= (0..7)
0 0 0 0 0 0 0 0 
##$TUNHIN= 0
##$TUNHOUT= 0
##$TUNXOUT= 0
##$USERA1= <user>
##$USERA2= <user>
##$USERA3= <user>
##$USERA4= <user>
##$USERA5= <user>
##$V9= 5
##$VALIST= <valist>
##$VCLIST= <CCCCCCCCCCCCCCC>
##$VD= 0
##$VDLIST= <DDDDDDDDDDDDDDD>
##$VPLIST= <PPPPPPPPPPPPPPP>
##$VTLIST= <TTTTTTTTTTTTTTT>
##$WBST= 1024
##$WBSW= 4
##$XGAIN= (0..3)
0 0 0 0 
##$XL= 0
##$YL= 0
##$YMAX_a= 767329
##$YMIN_a= -764916
##$ZGOPTNS= <>
##$ZL1= 120
##$ZL2= 120
##$ZL3= 120
##$ZL4= 120
##$ABSF1= 16.522
##$ABSF2= -4.171173
##$ABSG= 5
##$ABSL= 3
##$ALPHA= 0
##$AQORDER= 0
##$ASSFAC= 0
##$ASSFACI= 0
##$ASSFACX= 0
##$ASSWID= 0
##$AUNMP= <proc_1d>
##$AZFE= 0.1
##$AZFW= 0.1
##$BCFW= 0
##$BC_mod= 0
##$BYTORDP= 0
##$COROFFS= 0
##$CY= 12.5
##$DATMOD= 1
##$DC= 0
##$DFILT= <>
##$DTYPP= 0
##$F1P= 14.0000005364418
##$F2P= -0.99999901652339
##$FCOR= 0.5
##$FTSIZE= 32768
##$FT_mod= 6
##$GAMMA= 0
##$GB= 0
##$INTBC= 1
##$INTSCL= 1
##$ISEN= 128
##$LB= 0.3
##$LEV0= 0
##$LPBIN= 0
##$MAXI= 10000
##$MC2= 0
##$MEAN= 0
##$ME_mod= 0
##$MI= 0
##$NCOEF= 0
##$NC_proc= -2
##$NLEV= 6
##$NOISF1= 0
##$NOISF2= 0
##$NSP= 0
##$NTH_PI= 0
##$NZP= 0
##$OFFSET= 16.522
##$PC= 1
##$PHC0= -50.06876
##$PHC1= 4.287785
##$PH_mod= 1
##$PKNL= yes
##$PPARMOD= 0
##$PSCAL= 4
##$PSIGN= 0
##$REVERSE= no
##$SF= 250.13
##$SI= 32768
##$SIGF1= 0
##$SIGF2= 0
##$SINO= 400
##$SIOLD= 32768
##$SREGLST= <1H.CDCl3>
##$SSB= 0
##$STSI= 32768
##$STSR= 0
##$SW_p= 5175.98343685301
##$SYMM= 0
##$S_DEV= 0
##$TDeff= 65536
##$TDoff= 0
##$TI= <Analysis number 999999
Compound Code 99
Book Reference 9
Project Code 9>
##$TILT= no
##$TM1= 0
##$TM2= 0
##$TOPLEV= 0
##$USERP1= <user>
##$USERP2= <user>
##$USERP3= <user>
##$USERP4= <user>
##$USERP5= <user>
##$WDW= 1
##$XDIM= 32768
##$YMAX_p= 555924073
##$YMIN_p= -123099
$$ End of Bruker specific parameters
$$ ---------------------------------
##NTUPLES= NMR SPECTRUM
##VAR_NAME=  FREQUENCY,     SPECTRUM/REAL,   SPECTRUM/IMAG
##SYMBOL=    X,             R,               I
##VAR_TYPE=  INDEPENDENT,   DEPENDENT,       DEPENDENT
##VAR_FORM=  AFFN,          ASDF,            ASDF
##VAR_DIM=   32768,         32768,           32768
##UNITS=     HZ,            ARBITRARY UNITS, ARBITRARY UNITS
##FACTOR=    0.157963299565203, 1,           1
##FIRST=     4132.6476996994, 0,             0
##LAST=      -1043.33573715361, 0,           0
##MIN=       -1043.33573715361, -123099,     0
##MAX=       4132.6476996994, 555924073,     0
$$ Real data points
##PAGE= N=1
##DATA TABLE= (X++(R..R)), XYDATA
$$ [...]
19058C1753q751n533J059j285j030K981l96o093o960q54P188J928L016K883K871
19043B2777l035O3o58j270k06M569L96n206m237N296L148p75k233p310l554O972
19027A4737O491k153j366l921L940J844o647m93M387M491L049j357k785J488j277
19012B0428j286N109J2060R971q68R07j76q716n570r913k146K063m386j064K513
18997A8926m42L921K02P259j377K188K654R1p156j1689k972R420N584j590p743
18982A7276k900K4J918p129n28Q760J2592r557n097J279M584Q702r81k463O18
18967B7098M385m062P73m181k958l976L679Q516N070J870J529l46k978q155M645
18952C0909J1390J0312Q355M895J1297J1739J9744K2346J8076J4156M646J7915
$$ plain form
19058 31753 23002 17469 18528 17243 16213 19194 18798 12705 5745 4891 12079 14007 17023 19906 22777
19043 22777 19742 19805 19147 17877 17671 22240 22636 17430 13193 18489 21637 20862 18629 11319 7765 14737
19027 14737 21228 19075 17709 13788 17728 19572 12925 12432 16819 21310 24359 23002 20217 21705 20428
19012 20428 19142 24251 36311 46282 45414 46321 46145 37429 31859 21946 19800 21863 17477 16413 18926
18997 18926 18484 22405 22607 29866 28489 30677 33331 33422 26266 14577 11605 21025 26609 25019 17276
18982 17276 14376 14400 16318 9189 8661 17421 30013 20456 15359 16638 21222 29924 28943 26480 27098
18967 27098 31483 27421 28194 24013 21055 17079 20758 29274 34344 36214 37743 37397 34419 26264 30909
18952 30909 42299 52611 60966 65861 77158 88897 108641 130987 149063 163219 167865 185780
18940A85780K4795L5092M0770J7739m232l0947l3966j7103k024M513J3077K3068
18928B56562K9520M6624L8231J4295k287k5434m4212o3282m4253k1747r668P033
18916A81382J8400K1381R782j2721k9886l9217l0970k0130o924l575p621j1432
18904F8469l768m021j396N817N982N011N124P676J4574J2068K0799K1805L0093
18891A88233K1568J04j7994k0536j6647m477J2684L2046M1362M9848N5156M4920
18879C86267Q408l383m93m454j3325k6546k9247k6687j8931m311J5108L1842K8115
18866C42363k393l6098n7381m8210k9065j1178m231n279n130j2945k2590j6846
18854I1017j1878q441m340j4302M340J103l528k58r042p09N15l626n049l450R74
$$ plain form
18940 185780 210575 245667 286437 304176 299944 268997 235031 217928 215904 220417 233494 256562
18928 256562 286082 332706 370937 385232 382945 357511 313299 250017 205764 184017 174349 181382
18916 181382 199782 221163 230945 218224 188338 149121 118151 98021 91097 87522 79901 68469
18904 68469 64701 60680 59284 65101 71083 76094 81218 88894 103468 115536 136335 158140 188233
18891 188233 209801 209905 191911 171375 154728 150251 162935 194981 236343 286191 341347 386267
18879 386267 394675 391292 390799 386345 373020 346474 317227 290540 271609 267298 282406 314248 342363
18866 342363 339970 303872 246491 198281 169216 158038 153807 148528 143398 130453 107863 91017
18854 91017 79139 70698 66358 52056 56396 57499 53971 53713 44671 43962 44477 40851 35802 32352 33326
18839C3326K70q557k273R071N54k289q43m454k158n208j665N263P932M595N567
18824C9131o121m041j219J055J126K719n441m961p76K738M749o02l43J0225N454
18809D3693q745l756O798k092p546j928N619J1121M91J607p632m166L00J247m890
18794C0121L944J009L07J342J468N28l501J673n18N79k733l787m242N80K380o67
18778B8483o438j452O016O119j753Q145N870L356J2963J3116R604j789o195j4520
18764F1525j2740r734j1263p194j958J397n938K676J0686L239m99o38K160J512
18750C3231j656l215N65N249k252L152K652n068n909m400j788j370J620O3l661
18735A7213L699J208M717O707O615P737Q712K498k992j0905o562n346q145m383
$$ plain form
18839 33326 33596 25039 22766 31837 32391 30102 29259 24805 22647 17439 15774 21037 28969 33564 39131
18824 39131 33010 28969 27750 28805 29931 32650 27209 22248 21472 24210 28959 28357 28014 38239 43693
18809 43693 34948 31192 37990 35898 28352 26424 32043 43164 43655 45262 37630 33464 33764 35011 30121
18794 30121 34065 35074 35381 36723 38191 38719 35218 36891 36373 36952 34219 30432 26190 26770 29150 28483
18778 28483 22045 20593 26609 32728 30975 39120 44990 48346 61309 74425 84029 82240 76045 61525
18764 61525 48785 39051 27788 20594 18636 20033 14095 16771 27457 30696 30197 29559 31719 33231
18750 33231 31575 28360 28925 34174 31922 35074 37726 32658 26749 22349 20561 19191 20811 20874 17213
18735 17213 20912 22120 26837 33544 40159 47896 56608 59106 56114 45209 38647 33301 25156 20773
18721B0773P163N552J655K414j651r36K312N340m086K611k533l588L675K069j910
18706C8860j127k701k651m349M741J970m508O06l621n066R256Q859N475j613N369
18691D9500M604J500K373J646l83j062k687n169K944K089J911J2155J6041Q588
18677I4050K2022K4608K0753K0160J2865l026j8471k3643k6400k1578j9343L270
18665H5267P355l00j527O20M703Q704m96n368m571j1688j0133J065J0678J604
18651H5913n359j3325p46j966L016J1258L607k699j248K650K139k668K410L812
18637H6794J533J755M55O798Q587K287N866N594L423J98L2K967K112P260R114
18622A44775J2301J6015N307N263J4692J2324m844k3577k1849k0117k0648j2246
$$ plain form
18721 20773 27936 33488 35143 37557 35906 34970 37282 42622 38536 41147 38614 35026 38701 40770 38860
18706 38860 37733 35032 32381 28032 32773 34743 30235 30841 27220 22154 31410 40269 45744 44131 49500
18691 49500 54104 55604 57977 59623 59240 58178 55491 50322 53266 55355 57266 69421 85462 94050
18677 94050 116072 140680 161433 181593 194458 191432 172961 149318 122918 101340 81997 85267
18665 85267 92622 92322 90795 91415 96118 104822 104326 98958 94387 82699 72566 73631 84309 85913
18651 85913 80554 67229 66483 64517 67533 78791 82398 79699 78451 81101 83240 80572 82982 86794
18637 86794 88327 90082 90537 97335 105922 108209 114075 119669 123092 123290 123322 126289 128401 135661 144775
18622 144775 157076 173091 178398 183661 198353 210677 205833 182256 160407 140290 119642 107396
18610A07396k721J100o108k266K675p3Q474o70j3722O309O022n159J210O050M965
18595A13482J829K441K926j595p530k85K657P693J1605K177o727m143r321m337
18581A10872L194L018K126j500l304K331K552J762K108m266N643J920J446K304
18567A30206P848j621N62m631n364j0716J08O011O61J0545R525k560O197P839
18553A54610O722J0359J1073J6955K6922K3059M359l010j6571k6530k3840j3480
18541A70628r844m226K838L453Q727R531J7314L888L37j1880j4861n714J73P537
18527A77901n243m358r67l593P9K369m684k426Q442N241j76P996J4099Q849J0692
18512B14221R297J1682N347k157O761J2661J8389R309P034J19r63j5633o395Q410
$$ plain form
18610 107396 104675 105775 99667 97401 100076 100003 108477 107807 94085 100394 106416 101257 102467 108517 113482
18595 113482 115311 117752 120678 119083 111553 111268 113925 121618 133223 135400 128673 124530 115209 110872
18581 110872 114066 117084 119210 117710 114406 116737 119289 121051 123159 118893 124536 126456 127902 130206
18567 130206 138054 136433 136995 132364 127000 116284 116392 122403 123064 133609 143134 140574 146771 154610
18553 154610 161332 171691 182764 199719 226641 249700 254059 251049 234478 207948 184108 170628
18541 170628 160784 156558 159396 162849 171576 181107 198421 202309 202646 190766 175905 170191 170364 177901
18527 177901 172658 168300 167333 163740 163819 166188 161504 159078 167520 172761 172585 180581 194680 203529 214221
18512 214221 223518 235200 240547 238390 245151 257812 276201 285510 292544 292663 291700 276067 269672 278082
18498B78082J7609J9449J7073J4732J4681J6031J8655J9373R374o964k3114k3233
18486C71748j1841l304R127R316J2103Q322O093J0757P143Q227J0267J4415J7422
18473D69795K0900J6662K6600L6422M5768M1742L8773K0065J8706K2767K6704
18462G84904L8568M8296O3543P1524P2120P8051R1436J20946J53876J81512K12630
18451A917406K36759K15555J25108M6660K3013J10764K53267M23462O70017J018760
18441E040771J456124J854572K084430J992532J136181l09831j494195j858162
18433I902422j228952m33685K04019P55965J340450K115759L301858N233917Q316659
18424B9508412J2530002J6873172J9970307K0623317J5005247J105734j1819512
$$ plain form
18498 278082 295691 315140 332213 346945 361626 377657 396312 415685 425059 418095 394981 371748
18486 371748 359907 356603 365730 375046 387149 395471 401564 412321 419464 427691 437958 452373 469795
18473 469795 490695 507357 533957 570379 616147 657889 696662 716727 735433 758200 784904
18462 784904 823472 871768 935311 1006835 1078955 1157006 1248442 1369388 1523264 1704776 1917406
18451 1917406 2154165 2369720 2494828 2541488 2564501 2675265 2928532 3351994 4022011 5040771
18441 5040771 6496895 8351467 10435897 12428429 13564610 13254779 11760584 9902422
18433 9902422 8673470 8239785 8443804 9199769 10540219 12655978 15957836 21191753 29508412
18424 29508412 42038414 58911586 78881893 99505210 114510457 115616191 103796679
18417A03796679j9487996j6551001j1928487r868733q839730o668866k997556
18410B7454310L28016K714505M026616L998722J657088k560452o033647p422797
18402B4162361n972813m012114k570069j636266j037006o48566l62440j37302
18394G785785J4722P5214M0561k2579q6012q9430l3584J27132M40378Q34907J345914
18383A0433008K079636L149590M490068N741511O418635O068275L562425q01862
18375D1141286m313872n415943l088341L92896L845242P118557J0452036J3777842
18367F3909703J5545777J6131670J5697304J4066826N472230j0756404k3753849
18360I6313257k8651369k1666781j3515866q161828n032057l214455k066329j255441
$$ plain form
18417 103796679 84308683 67757682 55829195 45960462 37120732 30451866 27454310
18410 27454310 27782326 30496831 34523447 38522169 40179257 37618805 31585158 24162361
18402 24162361 18189548 14177434 11607365 9971099 8934093 8285527 7923087 7785785
18394 7785785 7800507 7875721 7916282 7893703 7807691 7718261 7684677 7811809 8252187 9087094 10433008
18383 10433008 12512644 15662234 20152302 25893813 32312448 38380723 41943148 41141286
18375 41141286 36827414 31411471 28323130 28716026 32561268 39679825 50131861 63909703
18367 63909703 79455480 95587150 111284454 125351280 130823510 120067106 96313257
18360 96313257 67661888 45995107 32479241 24317413 19285356 16070901 14004572 12749131
18352A2749131n96956M5543P06509J305101J698766J676361P67778j038440k516297
18343A4797496l146829k496592j628732j051052p12980m94301l49361k35043j52100
18334D530506j31735j84407k77812l34384l24256k64313k07146j57706j35251
18325B513496j18054j00302r4183r8512r4423q4399p4984o7365n2284o3240n8589
18314A607161o1785n7173m9269m4394m3995m5197m3294l7725l2252m2093m3180
18303A106804l8668l7501l3776k0524k1378k5404n828P021J898J3793J3535L926
18291I63898J53J1945K7696L2395J87j6566k4875m2606p2126p6095o6603m4866
18279F92537l6428l0326k2970j8756n803m429j4982j8717j9878k1451k5182j8290
$$ plain form
18352 12749131 12152175 12197718 12904227 14209328 15908094 17584455 18352233 17313793 14797496
18343 14797496 11650667 9154075 7525343 6474291 5761311 5267010 4917649 4682606 4530506
18334 4530506 4398771 4214364 3936552 3602168 3277912 3013599 2806453 2648747 2513496
18325 2513496 2395442 2295140 2200957 2102445 2008022 1923623 1848639 1781274 1728990 1665750 1607161
18314 1607161 1545376 1488203 1438934 1394540 1350545 1305348 1262054 1224329 1192077 1149984 1106804
18303 1106804 1068136 1030635 996859 976335 954957 929553 923725 930746 932644 946437 959972 963898
18291 963898 964051 975996 1003692 1036087 1036274 1019708 994833 952227 880101 804006 737403 692537
18279 692537 656109 625783 602813 584057 578254 573825 558843 540126 520248 498797 473615 455325
18267D55325j3356j1347j6483j1489n570p332J043k753n979j1008j2831j1912
18255C46308j250Q28N475M815K808N646M886P090R772J8395J2416O173P342R65
18241D31669m629J842J8733K0139L0720L7497L2825K1121J8301J9574J4331j5911
18229F26212l4430n6181p5579q6330o8619m4380k3917j6148j0012j2633p128q071
18217A82784L61o80n26l617k141o695r138R5n426j5228j2049r776q177p37q98
18202A08152p738j528l272j459l914n306j0652K890N011L65p159j1637o021M164
18188F1896J501L566O672M210L48J9Q79j256l586J515j512o083k092Q11L001J063
18172G0952P29K503K86K108k341n431K843J1794L261l935p58k243m012M817L001
$$ plain form
18267 455325 441969 430622 414139 402650 397080 389748 390791 388038 382059 371051 358220 346308
18255 346308 345058 345886 351361 356176 358984 364630 369516 376606 386378 404773 417189 423362 430704 431669
18241 431669 427040 428882 447615 467754 498474 535971 568796 589917 608218 627792 642123 626212
18229 626212 591782 535601 460022 373692 305073 260693 236776 220628 210616 197983 190855 182784
18217 182784 183145 182465 181939 178322 176181 169486 160348 160443 155017 139789 127740 117964 109787 109050 108152
18202 108152 100414 98886 95614 94155 90241 84935 74283 77173 82184 82549 75390 63753 57732 61896
18188 61896 63397 66963 73635 77845 78193 78212 79091 77835 74249 75764 74252 68169 66077 66888 69889 70952
18172 70952 71681 74184 74470 76578 74237 68806 71649 83443 86704 82769 82011 79768 75756 80573 83574
18157H3574N322q92L014L277n471o304K593Q448M525k583l884o095r157Q3N846
18142H2296L669lJ454m09M185N324l207k217k037O212N758J254O572J1400J7594
18127A37845J7469J4260J4556J6126L0111L3159M5886N2333O8655R7020J33640
18116F61060K00881L37032N56283R07184J380645J688826J717055J614210M21529
18107I484705k530720k649762j586585q84189n11403l15042k06481j42710r6843
18098E60970o5800n6577n2112l6670j9076j8962k2699j8809j7845j6126j2787
18087B23507j2030q408j2035n442q279j8356r582p297l757l314l381K269l388
18074A30507o670l311n833p654j4600p97J002n242l801k250l59K93J733Q85L834
$$ plain form
18157 83574 88896 88004 91018 94295 88824 82520 85113 93561 98086 95503 91619 85524 76367 76450 82296
18142 82296 85965 85962 87416 87007 91192 96516 93309 91092 89055 95267 101025 102279 108851 120251 137845
18127 137845 155314 169574 184130 200256 230367 263526 309412 361745 430400 527420 661060
18116 661060 861941 1198973 1755256 2662440 4043085 5731911 7448966 9063176 9484705
18107 9484705 6953985 4304223 2717638 1833449 1322046 1007004 800523 657813 560970
18098 560970 495170 438593 386481 349811 330735 311773 289074 270265 252420 236294 223507
18087 223507 211477 203069 191034 185592 177313 158957 149375 142078 138321 135007 131626 133895 130507
18074 130507 123837 120526 114693 107039 92439 91642 92644 87402 83601 81351 80992 81285 83018 83903 87737
18059H7737j044p421j5522j5387l628m322J0466J3928L459l37n267K04N573M282
18045G2721l536p083m202K815K675l063j199l125l780k475M946K609j655m153
18031E1495M814K567k247k777m364L45J561J535Q64O884K729K610L832k881k132
18016F4835r13r94L026j985m555J808q19k455K914N20Q694J5361J1315J2681J7073
18001A26506J7163L0289M1543N7219O6033O3739L9892Q250k5987o3229p4692o0657
17989B26069l1571k2401l580J3587J8770J1316K2732L0370K4743L2731L2853K3355
17977C78974L3406J3633j3212l5399l2856j5722Q596J2800k4486n8155n6858l6153
17965A74568l1854l0367k0318o388k035j664j682l744Q03J898N005J4339J9518
$$ plain form
18059 87737 86693 79272 63750 48363 44735 40413 50879 64807 68266 67929 62662 62866 68439 72721
18045 72721 69185 62102 57900 60715 63390 60327 59128 56003 52223 49748 54694 57303 55648 51495
18031 51495 56309 58876 56629 53852 49488 49833 51394 52929 53793 60677 63406 66016 69848 66967 64835
18016 64835 63922 62928 65954 63969 59414 61222 60403 57948 60862 61382 70076 85437 96752 109433 126506
18001 126506 143669 173958 215501 272720 338753 402492 442384 450634 424647 361418 286726 226069
17989 226069 194498 172097 168517 182104 200874 212190 234922 265292 290035 322766 355619 378974
17977 378974 412380 426013 412801 377402 344546 328824 337420 350220 325734 267579 210721 174568
17965 174568 142714 112347 92029 85641 83606 81942 80260 76516 77319 79217 84222 98561 118079
17952A18079J9004J7550J1558m56k716j6364j5729j630o076K639J1887K2150L0484
17939A90380M1954M5397M7407L0683j698l1451l9347m1984l1710m25K0257K6095
17927B55558L5578L2677J7181j787j0817R697J3556N494O112j8029n0656m8635
17915B45929j8679J6011L4384L6438L3871O367k3585k6831j6447M52K7134L2854
17903C47898L8965K1312r762k5784j7192j1130j6439l8109n1784m9691l7519j9631
17891A31134l067J394P972R510Q324J7619O447R87j1139k3825k6010k0462r101
17878H9783k534m094j578N529l740k272M82M875J0850Q809J1690K0963K0360L1391
17864A90514L8944L6730K5392O227j3690j2948R118K9694M8432O2290N7652J0108
$$ plain form
17952 118079 137083 154633 166191 165735 163019 146655 130926 129296 123220 125859 137746 159896 190380
17939 190380 232334 277731 325138 355821 354123 322672 283325 241341 209631 209206 229463 255558
17927 255558 291136 323813 340994 339207 328390 338087 351643 357137 363249 345220 294564 245929
17915 245929 227250 243261 277645 314083 347954 354321 330736 303905 287458 287910 315044 347898
17903 347898 386863 408175 398413 372629 355437 344307 327868 289759 237975 188284 150765 131134
17891 131134 128067 129461 137433 146943 155267 172886 179333 180320 169181 145356 119346 98884 89783
17878 89783 87249 83155 81577 87106 83366 81094 81576 86451 97301 106110 117800 138763 159123 190514
17864 190514 229458 266188 291580 297807 284117 271169 280287 309981 358413 420703 478355 488463
17852D88463m5836p4792p7065n7324l5037l816J2095K1505K9529M0978L6841L2507
17840C68048J6808j4118l1435m2999k7291j6242k3371l2857l9479l4017k1114
17829A01933j3039q447k900m579r376n520O878K604m785k52n107k250m745L02
17815E0717M96M223j068k392n02o12o367k101K397l706l223m091l505k595k482
17800B5189j927J126Q3N385m08K27K219l088j428P028J0483J1837L229m646l173
17785E2136m282p083k480l507Q04L51l39j329J892P608O042M265l311m764k151
17770D3852k078J1694P977j722kl669o154J716q86r335n97P788m833j237k405
17755D0109K460j716k625N673P472J0569M799R52l184L209L048p31K06L259P126
$$ plain form
17852 488463 442627 367835 290770 233446 198409 194593 206688 228193 257722 298700 335541 368048
17840 368048 384856 370738 339303 296304 269013 252771 229400 196543 157064 123047 101933
17829 101933 88894 80447 77547 72968 63592 58072 64950 67554 62769 62517 57410 55160 50415 50717
17815 50717 51213 55436 54368 51976 51474 50862 44495 42394 44791 41085 37862 33771 30266 27671 25189
17800 25189 23262 24388 24471 29856 29448 29675 31894 28806 27378 34406 44889 56726 59955 55309 52136
17785 52136 47854 40771 38291 34784 35588 35939 35600 34271 36163 43771 49813 54078 50767 46003 43852
17770 43852 41774 53468 61445 59723 59721 56052 49898 51614 50728 41393 40796 48584 43751 42514 40109
17755 40109 42569 40853 38228 43901 51373 61942 66741 67693 64509 67718 70766 70035 70241 73500 80626
17740H0626K1742K7498K0534K0018K3239L0896J8565l331j3472j7818k9519l5409
17728A43569j8537k0979m748N642N669M883O545K569j216j1230p827k21j25m885
17714I9109L26n787j2745j933j234n977j246N004J829K463R220n03J536R515l59
17699I9218M036P753O25k742k727L115R266M081Q460N34l635P21L976J778L620
17684A38079J0945K0555J7565Q266L789N799O351j357q495j6165k3368k7360j9931
17671A14673r273l411L340J237l910q72L799N896K817J25k121o863J510O864L309
17656A17120J0714M607p08j937L374p016M44P886J927k84L801l252m008J157M541
17641A38366J565n511m008k742o261l658P829J0265K92J333Jp850n337N3N219
$$ plain form
17740 80626 102368 129866 150400 170418 193657 224553 243118 239787 226315 208497 178978 143569
17728 143569 125032 104053 99305 104947 110616 115499 122044 124613 123397 112167 104340 104119 103994 99109
17714 99109 99435 93648 80903 78970 77736 71759 70513 75517 77346 79809 89029 88526 90062 99577 99218
17699 99218 103254 111007 111632 108890 106163 109278 118544 122625 131085 131619 127984 128705 132681 134459 138079
17684 138079 149024 169579 187144 195410 199199 204998 211349 209992 201497 185332 161964 134604 114673
17671 114673 105400 101989 105329 106566 102656 101784 105583 111479 114296 114421 112300 105437 106947 113811 117120
17656 117120 127834 132441 131733 129796 133170 126154 126598 134484 136411 136127 139928 136676 132668 133825 138366
17641 138366 139931 134420 130412 127670 121409 117751 125580 135845 136137 137470 137471 129621 124284 124337 129556
17626A29556M479P808j825r449k028KL341N663J740L124O175O125R515J3681K1251
17611A99158J6052K3370K8295K2743R92k4457l2130k5912k3625p478j109lO198
17598A82094j051J0425K004K608L355n378l022l095p647k865l955n308q841K71
17584A59595J629O378P456J0564J1389N786J764L422J5032J8013J1537M027K930
17571B59522O485N448M055Q379J3744P738L966J419q670n238R078J4318P647Q434
17557C36325J5085J6581J0150J7456J8764J5768Q962j522j3895k2828j5974O128
17545C91000Q432P629J1942P147J0420J6687J1030R436J3111K1216K0681L3038
17533E61769L2231K2148L0578L2216L5944L4638L5086L9134M2601M6016L8801
$$ plain form
17626 129556 134035 141843 140018 130569 128541 128543 131884 137547 139287 142411 148586 154711 164226 177907 199158
17611 199158 215210 238580 266875 289618 290610 266153 234023 208111 184486 177008 175899 175896 182094
17598 182094 181043 191468 193472 196080 199435 194057 191035 187940 180293 177428 173473 168165 159324 159595
17584 159595 161224 167602 175058 185622 197011 202797 204561 207983 223015 241028 252565 256592 259522
17571 259522 266007 271455 275510 283889 297633 305371 309337 310756 302086 296848 305926 320244 327891 336325
17557 336325 351410 367991 378141 395597 414361 430129 439091 437569 423674 400846 384872 391000
17545 391000 399432 407061 419003 426150 436570 453257 464287 473723 486834 508050 528731 561769
17533 561769 594000 616148 646726 678942 714886 749524 784610 823744 866345 912361 951162
17522I51162L5861M2449O1761Q7051J14874J33895J60061J82002J71717J53102
17512B093935J51743J70609J94922K51193L11894L31303L29282L80820N73255
17503D788956R42341J431928J957801K322444K343033J756697J87798j668876
17495A4062122k216990j510858n48296K48329R04503J576419K403964L566368
17487A8485561N445208Q533058J3076695J8268854K2221357K3268539J9347944
17480A28647216N955911j3301305k3009536j9810281j3932719j1526760j0444878
17473D2577648p666740l914452m72923K186085L744241M005556K638965j123314
17465D1975066n997509q168923o958804m766437l007433j849531j136852o99009
$$ plain form
17522 951162 987023 1029472 1091233 1178284 1293158 1427053 1587114 1769116 1940833 2093935
17512 2093935 2245678 2416287 2611209 2862402 3174296 3505599 3834881 4215701 4788956
17503 4788956 5731297 7163225 9121026 11443470 13786503 15543200 15730998 14062122
17495 14062122 11845132 10334274 9785978 10034307 10938810 12515229 14919193 18485561
17487 18485561 23930769 32463827 45540522 63809376 86030733 109299272 128647216
17480 128647216 134603127 121301822 98292286 78482005 64549286 53022526 42577648
17473 42577648 34910908 30996456 30523533 32709618 36453859 40459415 43098380 41975066
17465 41975066 35977557 27808634 20849830 16083393 13075960 11226429 10089577 9390568
17457I390568m24401k74350k18134k05957k30246k13934j25279m0735j5075P5232
17447G717689K72624N46200R48982J546345K450498L666182M977400N930261O070950
17438C4127131M830474J346516l205011n068427l363646k13020K918475N675887
17430C7048379Q266029J0973298J3107996J3684961J3621841J3021963P977625
17423A17702092n696065k1526100k6152550k0233963j2837472p725655m733771
17416A8796516l031301j983123j315842q69490m72629J5426N95007J049394J225817
17407A4009775R66222n3759j642334k523219k216778j493710r28660n93706m20180
17398E103651l47768l41325l64113l79317l36540k70096k05594j58210j28961
$$ plain form
17457 9390568 8966167 8691817 8473683 8267726 8037480 7823546 7698267 7657532 7642457 7717689
17447 7717689 7990313 8536513 9485495 11031840 13482338 17148520 22125920 28056181 34127131
17438 34127131 38957605 40304121 37099110 32030683 28667037 28454017 31372492 37048379
17430 37048379 45314408 56287706 69395702 83080663 96702504 109724467 117702092
17423 117702092 112006027 90479927 64327377 44093414 31255942 23530287 18796516
17416 18796516 15765215 13782092 12466250 11596760 11124131 11139557 11734564 12783958 14009775
17407 14009775 14975997 14922238 13279904 10756685 8539907 7046197 6117537 5523831 5103651
17398 5103651 4755883 4414558 4050445 3671128 3334588 3064492 2858898 2700688 2571727
17389B571727j23545j04196j07120r9804q7528q0894p7783o3122n6041o0430o5259
17378A646005p9060p2156n3579m9962m6712l7232l4753l5501m6790m8151l6814
17367A105295l4930l6502m2728m2160k7828k1038j9964j8024j3453j6392j0236
17356H22040J5570J1080j0800k7074m1560m6477m4784l8660k7111j9604j9132
17345E73488j4782j1616r127n913j7435j6269j5522j7312j9038k7326j9267j3086
17333C86795m509q388m762k941n473K342J742p841q319n659n342n236j1441n667
17319C15301m653j1123j0346p422o831M59M350k442q521j528r702o296l886P06
17305B48066j571P358J4317n92R80j70P993Q925n457k2440k3678l6789k7831j5199
$$ plain form
17389 2571727 2448182 2343986 2236866 2137062 2049534 1968640 1890857 1827735 1771694 1711264 1646005
17378 1646005 1566945 1494789 1441210 1391248 1344536 1307304 1272551 1237050 1190260 1142109 1105295
17367 1105295 1070365 1033863 991135 948975 921147 900109 880145 862121 848668 832276 822040
17356 822040 837610 848690 837890 810816 769256 722779 677995 639335 612224 592620 573488
17345 573488 558706 547090 537963 532050 514615 498346 482824 465512 446474 419148 399881 386795
17333 386795 382286 373898 369136 366195 360722 363064 364806 356965 348646 342987 337645 332409 320968 315301
17319 315301 310648 299525 289179 281757 274926 275385 279735 277293 268772 267244 257542 251246 247360 248066
17305 248066 246495 253853 268170 267578 268558 268388 276381 285306 279849 257409 233731 196942 169111 153912
17291A53912n543k017K393M381n097n866j980l336o726O29L694k080j2824r683
17277A09857l649J681N178N112L328R318J1988J8653Q824J4956M452m602j0366
17264A74730j3702j6322j3159r260j5137j5075j6953j1481o292n112m33O17Q77
17251E3298q765k058N000L246J642K732r07L066n594j0798n115j824M644J1959
17237E0526P31m641n202M21n95p427J224Jl389K339Q775O430K512p372l226j869
17221C9238j121o135j0100p36N201Q72L177m18M650J532J766p331l655l108n719
17206A8113Q173N844P183J0908J0891J5734J7144J0458J1721J5773K845m617j1754
17193A18416j9775k7275k2205r643m836n256k013k191j329l466M211J1900k399
$$ plain form
17291 153912 148369 146352 148745 153126 148029 142163 140183 136847 130121 130750 134444 132364 119540 109857
17277 109857 106208 107889 113067 118179 121507 130825 142813 161466 170290 185246 189698 185096 174730
17264 174730 161028 144706 131547 122287 107150 92075 75122 63641 57349 52237 51804 52421 53298
17251 53298 44533 42475 47475 50721 52363 55095 54188 57254 51660 40862 35747 33923 38567 50526
17237 50526 51257 46616 41414 41835 41240 33813 35037 35038 31649 33988 42763 49193 51705 44333 41107 39238
17221 39238 38117 31982 21882 21146 26347 27219 30396 29978 34628 36160 37926 30595 26940 23832 18113
17206 18113 26286 32130 39313 50221 61112 76846 93990 104448 116169 131942 134787 130170 118416
17193 118416 98641 71366 49161 39518 34682 29426 27413 25222 23893 20427 24638 36538 34139
17180C4139k958P66P55m912p843n178q758l372l172L63R310J3323K325J311R854
17165C5953J3417M236o180K049Q768J2274J6050K0993J9502K0281J0302L595p068
17152A54172j2735j7702j9423j1613j6789j7475l371J678m298l977r186q196k282
17139B8803o448m096r59k282m234O419j283O882j868j344J49J274N30j400q673
17124A1470r80P502N670N959Q3R68K202j0855j1171p949L623N399P474K92q11
17109A8876N328j790l411P001l005n825L731M924Q429M823j133j2107j447l080
17095B1314P176N151Q08N409J4709K4419K0763J6601J3915N110K591k927j5530
17082A19509j4000j7136k1801j3829r326j1017l598j430k850k365j1j932j616
$$ plain form
17180 34139 31181 31947 32702 27790 19947 14769 6011 2639 -533 -170 9140 22463 24788 26099 35953
17165 35953 49370 53606 47426 49475 58243 70517 86567 107560 127062 147343 157645 161240 154172
17152 154172 141437 123735 104312 92699 75910 58435 55064 56742 52444 48467 39281 31085 28803
17139 28803 22355 18259 17300 15018 10784 17203 15920 22802 20934 19590 19739 21013 21543 20143 11470
17124 11470 10490 17992 23662 29621 29704 30672 32874 22019 10848 2899 6522 11921 19395 19687 18876
17109 18876 24204 22414 19003 26004 22999 17174 20905 25829 34258 39081 37948 25841 24394 21314
17095 21314 28490 33641 34449 39858 54567 78986 99749 116350 130265 135375 137966 135039 119509
17082 119509 105509 88373 66572 52743 43417 32400 28802 27372 24522 22157 22146 20214 18598
17069A8598j137l110J74M244M96J008K7j72k766J197N830M08l663K738r9q104
17053A5669o611m243L569l222K975j109k451N40R587p49n833P227Q057Nn364r71
17037A7076o900k291j322l561R71J1354k665j809j502P67L868m830n472M36J784
17022E904j109N097n657J894O125J741L212m444L350l68m367K992N089N268m316
17007B0411o334k683R38K89J831R04n7J410J340K226n754k531M077J7463J7283
16992E0813M620P823J778k849p520Q418Q756O998K2429L7881M9740M4785N3894
16979B87566N0479J6216j7488k0939l04P273q868l5704m7853m5892k0536J1422
16967A75372L5575M9780M9351M8026M0667Q032k9472o1393p8794o7747l9588k0536
$$ plain form
17069 18598 17461 14351 14525 18769 19265 20273 20300 20128 17362 18559 24389 24797 21134 23872 23773 15669
17053 15669 9058 4815 8384 5162 8137 7028 4577 5117 14704 13955 8122 15349 23406 23411 18047 17076
17037 17076 10176 7885 6563 3002 3973 15327 12662 10853 9351 10118 13986 9156 3684 4120 5904
17022 5904 4795 9892 4235 6129 12254 13995 17207 12763 16113 15745 11378 14370 19459 24727 20411
17007 20411 14077 11394 12332 12621 14452 15356 15299 16709 18049 20275 14521 11990 16067 33530 50813
16992 50813 55433 63256 65034 62185 54665 63083 71839 78837 101266 139147 188887 233672 287566
16979 287566 338045 354261 336773 315834 315530 322803 313935 278231 230378 184486 163950 175372
16967 175372 210947 260727 310078 358104 398771 406803 377331 315938 237144 169397 129809 109273
16955A09273r346j2656m79J716M156K194N121R528N934j101o439j9982k1337o872
16941E9710n616n513l526J109N350J252N762J5167J6042L0975K7670L7488M6436
16928B32306M5343L2978P761O52J4774J9801J1334j2005m6855n5091m9089m6059
16916A55850l0347j4801r289K317J0888J3917J5793J9768L5007M3635N8648N6525
16904C57911K6244j6331n4794p1131o4678n2197l3440j9357j4492j6305m587j390
16892C5453j78k408k162j199o239p075l889N405k135n682R65Q21M400O202J979
16877B4258k567l411k107k545J713o992k200M000k736Q50N69j281m37O058N377
16862A8549k465p51k89p222n798O45r15rJ423n257n653j7M326M200K008j572J600
$$ plain form
16955 109273 99927 87271 86792 88508 92664 94858 99979 109507 115441 114340 107901 87919 66582 59710
16941 59710 54094 48581 45055 46164 51514 52766 58528 73695 89737 120712 148382 185870 232306
16928 232306 277649 310627 318388 319040 333814 353615 364949 352944 306089 250998 201909 155850
16916 155850 125503 110702 101413 103730 114618 128535 144328 164096 199103 242738 301386 357911
16904 357911 384155 367824 313030 241899 177221 125024 91584 72227 57735 41430 36843 35453
16892 35453 35275 32867 30705 29506 23267 16192 12303 17708 15573 9891 10856 11677 16077 22279 24258
16877 24258 21691 18280 16173 13628 15341 8349 6149 10149 7413 8263 8832 7551 7114 13172 18549
16862 18549 16084 15333 15044 7822 2024 2669 1754 1745 3168 -2089 -7742 -7759 -3433 767 2775 1203 2803
16845B803j789N359J175j0990j13M66K703N930j723j266O113k847l970n723M614
16830G42j455J984L545L990m963N41L243k268r152p088K911L670n49Q919K231
16815F301l035k913j172K669k852j202l166L102N159k690j275j128K173N053j074
16800C950l499q915P780R291j863p78j243l340R11L953j644p187k883L415M847
16785B795K284p141K360k443j251m773K681j732j04M442L805j954j525l16o052
16770h924M07J466l493M647m301O570R820q779n953P718K063q53n664j997L802
16755c471J126N598K640o876q086J255Q93N918O69M558J79Q45J358j184k104r55
16739B363n455n774O360Q091M076j205Q58m949o86K431J691m866j543j523l649
$$ plain form
16845 2803 1014 6373 7548 -3442 -3555 -3089 -386 5544 3821 2555 8668 5821 1851 -3872 742
16830 742 -713 1271 4816 8806 3843 4384 7627 5359 -3793 -10881 -7970 -4300 -4849 4070 6301
16815 6301 3266 353 -819 1850 -1002 -2204 -5370 -2268 2891 201 -1074 -2202 -29 5024 3950
16800 3950 451 -8464 -684 8607 6744 5966 4723 1383 2294 6247 4603 -2584 -5467 -2052 2795
16785 2795 5079 -2062 298 -2145 -3396 -8169 -5488 -7220 -7324 -2882 923 -1031 -2556 -2872 -8924
16770 -8924 -8517 -7051 -10544 -5897 -10198 -3628 6192 -2587 -8540 -822 1241 388 -5276 -7273 -3471
16755 -3471 -2345 3253 5893 -983 -9069 -7814 -6921 -1003 -334 4224 4403 5248 6606 5422 3318 2363
16739 2363 -3092 -8866 -2506 5585 9661 8456 9314 4365 3679 6110 7801 2935 1392 -131 -3780
16724c780L138N420l141j491J233n456k834J577j659l05L618J824J52k305j986
16709e995l234o92j034N52j39j220Q504O749l704n666K137j374L944n60L272k35
16693A305m24k052o740N385O347J578k33J420j860n622p91k435k76K338j540K272
16677a328Q987j68K53k875p907o23J359J914j122K077O18J738L019n523j2027
16662a1608o307Q593J060k798j030L556L843n42J799rj58m966K290L504L719K68
16646A214j827j573N516J319o077j173M241R983l216o565l982K718M659m810l397
16631b970j81o450J332j547j68N784j3k788n476K57j263o15K021k200K421M0J536
16614a0280j426O122J173M440K319j862q30J867k516l863M925j293K21L578j823
$$ plain form
16724 -3780 -642 4778 1637 146 1379 -4077 -6911 -5334 -6993 -7298 -3680 -1856 -1704 -4009 -5995
16709 -5995 -9229 -9921 -10955 -10403 -10542 -11762 -3258 3491 -213 -5879 -3742 -5116 -1172 -1732 1540 1305
16693 1305 881 -1171 -7911 -2526 3821 5399 5166 6586 4726 -896 -1687 -4122 -4398 -2060 -3600 -1328
16677 -1328 7659 7491 7744 4869 -3038 -3661 -2302 -388 -1510 567 1185 2923 5942 419 -11608
16662 -11608 -17915 -9322 -8262 -11060 -12090 -8534 -4691 -5233 -3434 -3443 -3601 -8567 -6277 -2773 946 1214
16646 1214 -613 -2186 3330 4649 -1428 -2601 1640 11623 8407 1842 -2140 578 5237 427 -2970
16631 -2970 -3151 -9601 -8269 -9816 -9984 -4200 -4213 -7001 -12477 -12220 -13483 -14098 -12077 -14277 -11856 -11816 -10280
16614 -10280 -11706 -5584 -4411 29 2348 486 -344 1523 -993 -4856 69 -1224 -1003 2575 752
16599G52Q49N761L862n05j0398l295k760K308L82p349K950N609K747K051R63l728
16583A99J19j813l833j769j51j959K997N951n246m971J21M620k36j720m882J605
16567a0968Q758M109r957m302N278J958p619J014P962M867K447k437k406n602
16553f898k831K686N37O636K459N18j402P07l885m833L852j472L136R43m440j533
16537e820m468m6R529N263M028r05r855r953l251O296M944N542q33r619k297o080
16521a7525l315J3170M783N402p036m612L288n51m167K775l617n917l447l315
16507b4084m40O762R552P117j73L2p633N85N000J904o203j356K911M334J308n000
16491e384m476R630N228r726j701K613R267M976O84m498R24J537l857o752K760
$$ plain form
16599 752 1601 7362 11224 10719 321 -2974 -5734 -3426 -3044 -10393 -7443 -1834 913 2964 3927 199
16583 199 318 -1495 -5328 -7097 -7248 -9207 -6210 -259 -5505 -10476 -10355 -5735 -5971 -7691 -12573 -10968
16567 -10968 -2210 1899 -8058 -12360 -7082 -5124 -12743 -11729 -3767 1100 3547 1110 -1296 -6898
16553 -6898 -9729 -7043 -6506 130 2589 3107 1705 2412 -1473 -6306 -2454 -3926 -790 153 -4287 -5820
16537 -5820 -10288 -10334 -805 4458 8486 7581 -2274 -12227 -15478 -9182 -4238 1304 471 -9148 -11445 -17525
16521 -17525 -20840 -7670 -2887 2515 -4521 -9133 -5845 -6396 -10563 -7788 -11405 -17322 -20769 -24084
16507 -24084 -24524 -17762 -8210 -1093 -1266 -1234 -8867 -8282 -3282 -1378 -7581 -8937 -6026 -1692 -384 -5384
16491 -5384 -9860 -230 4998 -4728 -6429 -3816 5451 10427 11111 6613 7537 9074 5217 -1535 1225
16476A225M079M640k516p660m85p443k653R236m256l466J920J431k465J364O290
16461g59M871J11m613o702K67L361l234L514n416n633K509L670O48J560K431N225
16445A810p374l269K646k212M552r64M186k207o973N062l284m185O271K828k407
16430e520k521l883K062K518j380J811P60M438L397n06r440o451J384J816N338
16415f177p84L59O571J012n234k467o151k086J3040N305j249k257J292K779j90
16400C763j3733n524M206O641p82j098j467p12M465L339L309K410L337k75j958
16385E921k05m452l577O034K187o55L431K113J51k050p231M21J813n530q666q566
16369a8861J255M720J433j040k722l2N284M091p978l55N318j551l348K006L789
$$ plain form
16476 1225 5304 9944 7428 -232 -717 -8160 -10813 -1577 -5833 -9299 -7379 -5948 -8413 -7049 -759
16461 -759 4112 4223 -390 -7092 -6825 -3464 -6698 -3184 -8600 -14233 -11724 -8054 -7406 -5846 -3415 1810
16445 1810 -5564 -8833 -6187 -8399 -3847 -4811 -625 -2832 -9805 -4743 -8027 -12212 -5941 -3113 -5520
16430 -5520 -8041 -11924 -9862 -7344 -8724 -6913 -6153 -1715 1682 1176 -8264 -14715 -13331 -11515 -6177
16415 -6177 -6961 -6602 -31 981 -4253 -6720 -12871 -14957 -1917 3388 2139 -118 1174 3953 3763
16400 3763 -9970 -15494 -11288 -4647 -5429 -6527 -7994 -8706 -4241 -902 2407 4817 8154 7879 5921
16385 5921 5716 1264 -2313 3721 5908 5253 8684 10797 10948 8898 1667 2088 3901 -1629 -10295 -18861
16369 -18861 -17606 -12886 -11453 -12493 -15215 -15247 -9963 -5872 -13850 -14205 -8887 -10438 -13786 -11780 -7991
16354g991P698p694p487l340O431P829K067j545J075J565j790N141J69L25j309
16339A144l551L33R214K457j1586r000M56j175j417Q309J309o018k057N111P915
16324A444n160n672l731L019N957O904J578j769K152k666k672j750k926L605J730
16309D3j87L186m807m292q657l338k946L965M955M351J943O99K173J794k64J67
16293a215o677l127N698O818J453M989m473l218m45j378p222n496j197J223R598
16278d669R631J747j2683j503K982L96m117Q75R60M160q82L282K279k78k367q43
16262a030J736J034o056j0787K721M37l017N16P962M084K820P36o44o600l21m787
16246a1196P2L761N388K488J390J722l789O16l422o649O00J0367P433j236j676
$$ plain form
16354 -7991 -293 -7987 -15474 -18814 -12383 -4554 -2487 -4032 -2957 -1392 -3182 1959 2128 2453 1144
16339 1144 -2407 -2074 7140 9597 -1989 -10989 -10533 -11708 -13125 -4816 -3507 -9525 -11582 -6471 1444
16324 1444 -3716 -9388 -13119 -10100 -4143 2761 4339 2570 4722 2056 -616 -2366 -5292 -1687 43
16309 43 -144 3042 -1765 -6057 -14714 -18052 -20998 -17033 -12078 -7727 -5784 -5085 -2912 -1118 -1382 -1215
16293 -1215 -7892 -11019 -5321 1497 2950 7939 3466 248 -197 -1575 -8797 -14293 -15490 -14267 -4669
16278 -4669 4962 6709 -5974 -7477 -4495 -4099 -8216 -7341 -6381 -2221 -3103 179 2458 2180 -187 -1030
16262 -1030 706 1740 -4316 -15103 -12382 -11945 -14962 -14446 -6484 -2400 420 1156 512 -6088 -6409 -11196
16246 -11196 -11124 -7363 -1975 513 1903 3625 -164 452 -2970 -9619 -9019 1348 8781 7545 5869
16231E869p524l197M708N321r10q68O778J41o175o606L149L638L773k987j0023
16216d913k906l099m670L741N522M586k067m68R91j027L414j093n038j635k28
16201h890J661p623k343P015O92r61k61r92k585K849R936l266l343L802O919L453
16185F063j005q652k800M355j976o240l091O582N591j26J082K836Q93k419k252
16170a159n875p93M388R66J663L51l147n090K412J0089K690n716j0166n442k426
16155a7255M083P401Q203m88j080R55K792L463j638m114l891j115N743q030o925
16140a1896J088O597O131j117l895j703l835K389L614j044m915j172n630M125
16126a1263n984L056O107O78N61K345K439m015k537r583L935P325N574L06n811
$$ plain form
16231 5869 -1655 -4852 -144 5177 4267 3399 10177 10318 4143 -2463 686 4324 8097 5110 -4913
16216 -4913 -7819 -10918 -15588 -11847 -6325 -1739 -3806 -4274 -3283 -4310 -896 -1989 -7027 -8662 -8890
16201 -8890 -7229 -14852 -17195 -10180 -9488 -10449 -10710 -11702 -14287 -11438 -1502 -4768 -8111 -4309 2610 6063
16185 6063 5058 -3594 -6394 -2039 -4015 -10255 -13346 -6764 -1173 -1299 -217 2619 3512 1093 -1159
16170 -1159 -7034 -7827 -3439 -2473 -810 -459 -3606 -8696 -6284 3805 6495 779 -9387 -14829 -17255
16155 -17255 -13172 -5771 2432 1944 864 1819 4611 8074 6436 2322 -1569 -2684 3059 -4971 -11896
16140 -11896 -10808 -4211 1920 803 -3092 -4795 -8630 -6241 -2627 -3671 -8586 -9758 -15388 -11263
16126 -11263 -17247 -14191 -8084 -7406 -6845 -4500 -2061 -6076 -8613 -18196 -14261 -6936 -1362 -1056 -6867
16111f867k058O416p46n173l62l33p41k505K018O716M533L887M6l815r168n672
16095a3824l807m131J360P705O401q28M775l482q247j501P069r14j6M369O017
16080I46n54n19q165o877R751M1k118j75K927m362j027L562n862q218O38N082
16064a4930M542j514j073K978J024l070k988n92O105Q978M812k000M702K57R06
16049H137O59M39j514j0721k568m34J203J440J389J408J832k823j210o8k050j997
16033f878O325n309k840m2J583P057M43k223k595j1227k107O832J1260M863o106
16018i64j734O97m456K723Q254j6k109J020j835k724p013k007m07l422Q91K445
16002a0657M954J198K732K81K519k57l645m866J652k447K498P002j586p199l54
$$ plain form
16111 -6867 -8925 -2509 -3255 -8428 -8790 -9123 -9864 -12369 -10351 -3635 898 4785 4831 1016 -8152 -13824
16095 -13824 -17631 -21762 -20402 -12697 -6296 -7124 -2349 -5831 -14078 -15579 -8510 -9424 -9440 -5071 946
16080 946 392 -127 -8292 -15169 -5418 -5377 -7495 -7670 -4743 -9105 -10132 -6570 -12432 -20650 -20012 -14930
16064 -14930 -10388 -11902 -12975 -9997 -8973 -12043 -15031 -15623 -9518 -540 4272 2272 6974 7231 8137
16049 8137 8796 9235 7721 -3000 -5568 -6002 -4799 -3359 -1970 -562 1270 -1553 -2763 -2831 -4881 -6878
16033 -6878 -553 -5862 -8702 -8744 -7161 -104 339 -1884 -4479 -15706 -17813 -10981 279 5142 -964
16018 -964 -2698 -2001 -6457 -3734 4520 4504 2395 3415 1580 -1144 -8157 -10164 -10571 -13993 -13102 -10657
16002 -10657 -5703 -4505 -1773 -1492 1027 770 -2875 -7741 -6089 -8536 -6038 964 -622 -7821 -8175
15987h175k840N656M869L032j475n802L53q74n44J040j512J033L912K464o458
15972e321r60o757L508P755N19k758m448k183P11M954m83M430L710m803n600M06
15956g320l484j094J047P247Q522k966p499j243k286n333M289K064l145k141p417
15941b0759K700K903N831N437K619j131j076k028p627j169N914K482N012P711
15927F819j289o449n300J14m34p175k412M863l109K433P646P612l083K804j559
15912A481l233m455l771m874O770N406K858o04n242m898J042K661j004L52J935
15897e576K983K19J833n192m07J941l423L997o41j956J036K222L031r1L937m428
15881e15K464l071l192q342j179O642L389j260k696O007O931K229k239n900r326
$$ plain form
15987 -8175 -11015 -5359 -490 2542 1067 -4735 -4382 -5256 -5800 -4760 -6272 -5239 -1327 1137 -5321
15972 -5321 -6281 -13038 -9530 -1775 -1256 -4014 -8462 -10645 -9934 -4980 -5463 -1033 2677 -2126 -7726 -7320
15956 -7320 -10804 -11898 -10851 -3604 4918 1952 -5547 -6790 -9076 -14409 -10120 -8056 -11201 -13342 -20759
15941 -20759 -18059 -15156 -9325 -3888 -1269 -2400 -3476 -5504 -13131 -14300 -8386 -5904 -892 6819
15927 6819 5530 -919 -6219 -6105 -6539 -13714 -16126 -11263 -14372 -11939 -4293 3319 236 3040 1481
15912 1481 -1752 -6207 -9978 -14852 -8082 -2676 182 -422 -5664 -10562 -9520 -6859 -7863 -7511 -5576
15897 -5576 -2593 -2374 -541 -5733 -6140 -4199 -7622 -3625 -4266 -6222 -5186 -2964 67 -24 3913 -515
15881 -515 1949 -1122 -4314 -12656 -13835 -7193 -3804 -5064 -7760 -1753 5178 7407 5168 -732 -10058
15866a0058m790P909J0317J097l81J415K99j170q048j1978l263O628J237K36K882
15851g668L32L86J204n91o751m436M193J0989J886m370m081j466K414M241j179
15836d897k413m836k517N099Q416m400k244K059l576M170K869k088k453j404K000
15821f215k176n631J583M788P072N6j295O68r036j0655N955K566M774J414O07
15806e525N736J2616J070n529L074j102p231p499k69L932n82M771m848r506k087
15791a2979R14k378j807j366k565N561R924J594K719j703l606J055j249J332r07
15776e461j0023L567N578L456L242N465l362j025l385k221J793J607p508j231
15762i508M006M046K62p949R53N231r672K123N115J560M550J025k303m928k786
$$ plain form
15866 -10058 -14848 -6939 3378 4475 4094 5509 5808 4638 -3410 -15388 -18651 -12023 -10786 -10550 -7668
15851 -7668 -7336 -6950 -5746 -6337 -13088 -17524 -13331 -2342 -456 -4826 -8907 -10373 -7959 -3718 -4897
15836 -4897 -7310 -12146 -14663 -9564 -1148 -5548 -7792 -5733 -9309 -5139 -2270 -4358 -6811 -8215 -6215
15821 -6215 -8391 -14022 -12439 -7651 -579 -523 -1818 -1150 -10186 -20841 -14886 -12320 -7546 -6132 -5525
15806 -5525 211 12827 13897 8368 11442 10340 3109 -4390 -4659 -727 -1309 3462 -1386 -10892 -12979
15791 -12979 -12065 -14443 -16250 -17616 -20181 -14620 -4696 -3102 -383 -2086 -5692 -4637 -5886 -4554 -5461
15776 -5461 -15484 -11917 -6339 -2883 359 5824 2462 1437 -1948 -4169 -2376 -769 -8277 -9508
15762 -9508 -5502 -1456 -1194 -9143 -8190 -2959 -12631 -10508 -5393 -3833 717 1742 -561 -5489 -8275
15747h275J117l63J523L535l467r41K437k300k333m118j260j058j57n09L628P253
15731e288j668o804K089K585q92M876L987L484K130J820m660n964l655P64N817
15716a379M776K228n632J388q170L030k16p668J702L187K21j794l1L000Q234j040
15700A836n306K880o907l791j387P23J584K781j816O832O786K646k731n340m97
15685a707j280m573m946N743J588R67k885K244R583j901K134N569J386k716j801
15670G405n975k687j955o498m857J426N202L992l871J608L734N257k104J602o777
15655d498r339k502J2114o3q083M511K783m97r527J966M929N114P866q67M099
15640H006k68j0733q738j912O4Q298K042k4j921L22l715M350L239k05Q06j837
$$ plain form
15747 -8275 -7158 -7521 -5998 -2463 -5930 -6871 -4434 -6734 -9067 -13185 -14445 -15503 -15660 -16169 -12541 -5288
15731 -5288 -6956 -13760 -11671 -9086 -9978 -5102 -1115 2369 4499 6319 1659 -4305 -7960 -7196 -1379
15716 -1379 3397 5625 -7 1381 -6789 -3759 -3975 -11643 -9941 -6754 -6533 -8327 -8358 -5358 2876 1836
15700 1836 -3470 -590 -7497 -11288 -12675 -11952 -10368 -7587 -9403 -2571 4215 6861 4130 -1210 -1707
15685 -1707 -2987 -7560 -12506 -6763 -5175 -4208 -7093 -4849 4734 2833 4967 10536 11922 9206 7405
15670 7405 1430 -1257 -3212 -9710 -14567 -13141 -7939 -3947 -7818 -6210 -2476 2781 677 2279 -4498
15655 -4498 -13837 -16339 -4225 -4288 -12371 -7860 -5077 -5574 -15101 -13135 -8206 -3092 4774 3907 8006
15640 8006 7738 -2995 -11733 -13645 -13581 -5283 -3241 -3265 -5186 -4864 -8579 -4229 -990 -1195 -389 -2226
15624b226N654L13n248L556M416O778J390n354m290J552j108M187k589J28l962
15609C197m714k446j154M214J823m879r210N255O888P504M824n463n721j328K448
15594A238j850j532M007k373K292m249p052N348Q234L42J603L319L046k568J338
15579A1143M544K835N298j568M295K579P097J2944J7593K9214L6038L3703L3849
15566A99564L7579j713k8294j0757P420J7004J8579o035n1468n3817l6276k6158
15554F5628j9439m833M55m225j2041o757l492n390k200j523p865P246Q40R13Q89
15539H206p617P6j218Q82l091J552K646lq60m993N180o89N569N11m978M465J513
15522G151m243J389o041n501o513L587J1434k582l013J512Q75m002L633K515q350
$$ plain form
15624 -2226 3428 3741 -1507 2049 6465 13243 14633 9279 4989 6541 5433 9620 7031 7159 3197
15609 3197 -1517 -3963 -5117 -903 920 -3959 -13169 -7914 -1026 6478 11302 5839 118 -1210 1238
15594 1238 -612 -2144 1863 -510 1782 -2467 -9519 -4171 4063 4405 6008 9327 12373 9805 11143
15579 11143 15687 18522 23820 22252 26547 29126 36223 49167 66760 95974 132012 165715 199564
15566 199564 237143 235430 207136 196379 203799 220803 239382 233347 181879 128062 91786 65628
15554 65628 46189 41356 41811 37586 25545 18788 15296 9906 7706 6183 -1682 5564 6404 7317 8206
15539 8206 589 665 -553 329 -2762 -1210 1436 1433 573 -4420 760 71 5640 6151 1173 5638 7151
15522 7151 2908 4297 -1744 -7245 -13758 -10171 1263 -1319 -4332 -2820 -1945 -5947 -2314 201 -8149
15507h149M47k116j187M820N103l074J452m386L126k70o507M27j841M759K886
15492d510j35M470M667R55m563r560O334O481L833m48m29j481k835J446l818l653
15476c246l525N038M953k602mj638L393p1J87j446K21P341Q192O322N151R390
15460C7656J5842J8221L0743L9591K8939L0707J5728k0596k7744o903J3354J9916
15448A95454R809l5918n1295l6243k2362k2627j4040n439m945k398K64m813m53
15435D994Q42N389P2K358M679O86N64k898j1008p695J422N963L18j685j853J212
15419C360k831J7L439K519m886j729K355n636m554K931O664n52o382o225K356
15404i154K345J925n420j707M168L403P372M725j374m292o006l540l199J654j8
$$ plain form
15507 -8149 -7702 -9818 -11005 -6185 -1082 -4156 -2704 -7090 -3964 -4234 -10741 -10314 -12155 -7396 -4510
15492 -4510 -4645 -175 4492 5447 884 -8676 -2342 4139 7972 7524 7095 5614 2779 4225 407 -3246
15476 -3246 -6771 -1733 3220 618 614 -1024 2369 2298 2485 1039 1260 8601 16793 23115 28266 37656
15460 37656 53498 71719 102462 142053 170992 201699 217427 196831 169087 162184 175538 195454
15448 195454 205263 169345 118050 81807 59445 36818 22778 17339 12394 9996 10260 5447 4994
15435 4994 5836 11225 11297 13655 18334 19020 19584 16686 5678 -2017 -595 5368 5686 4001 2148 3360
15419 3360 529 546 3985 6504 1618 -111 2244 -3392 -7946 -5015 1649 1097 -5285 -11510 -9154
15404 -9154 -6809 -4884 -10304 -12011 -7843 -4440 2932 7657 6283 1991 -4015 -7555 -10754 -9100 -9118
15389i118J910J837L689L260k430k289j350l071N29M752j67j942k08J158l109
15374f549L659L570l68o566l53J268k145K042O868j48k915n292J928Q79L394m799
15358e527K279o891N615p18p64j797J801L671q57k122j997K559L098M748m337
15343a239J497R302P87j2344l112K680M157n456k842J65J428l38O227J191o801
15328d698j2868m077L452J6013R020j2141j1368J513Q198P483P73j557j216j495
15314b968j74l053N06k378o33J125O013J073m042k415N682R599m698l982k10J731
15298A176K07j315n468K781O88j398j118l940k258n61n747O37M952M155n943J237
15282a1915O780M787N040K768o428J141l957r86l910K239Q018k085l619n573j605
$$ plain form
15389 -9118 -7208 -5371 -1682 1578 -852 -3141 -4491 -7562 -7033 -2281 -2448 -4390 -4598 -3440 -6549
15374 -6549 -2890 680 312 -6254 -6607 -5339 -7484 -5442 1426 1278 -1637 -6929 -5001 -4122 -728 -5527
15358 -5527 -3248 -10139 -4524 -5242 -6006 -7803 -6002 -2331 -3188 -5310 -7307 -4748 -1650 3098 -1239
15343 -1239 258 9560 10347 -1997 -5109 -2429 1728 -3728 -6570 -6405 -4977 -5315 912 2103 -4698
15328 -4698 -17566 -21643 -18191 -2178 6842 -5299 -16667 -15154 -6956 527 1300 -257 -1473 -2968
15314 -2968 -3142 -6195 -5689 -8067 -8700 -7575 -1562 -489 -4531 -6946 -1264 8335 3637 -345 -555 1176
15298 1176 1383 68 -5400 -2619 -1931 -3329 -4447 -8387 -10645 -11206 -16953 -16316 -11364 -7209 -13152 -11915
15282 -11915 -5135 -348 4692 7460 1032 2173 -1784 -2770 -6680 -4441 3577 1492 -2127 -7700 -9305
15267i305K279k827j207J065p889L55N370N187M966Q28k681N436O477k105p322
15252a373q883J903M669P005n630m272o3K183J0779M583l631l295q64j0300k192
15237i381M879K271l218M024P919J63p895K077J087l339r18N93J328l278j416
15222e104k255L43J469K051l529k026K877M186l377O698N990M436l622n176k978
15207a7l229k354M613N330J246l685p62q502J902M402L089K167j763m042k320
15192c925J338j139K825N185N526M923k965j024j819m571m349l613l555o138L289
15177a0012K026L880J887N03L24k362j0671m488M0K847R268M933P547P31Q20k479
15161D794k488j948L230M183l348j757K447L548p52k368j735p357j105K442j171
$$ plain form
15267 -9305 -7026 -9853 -11060 -9995 -17884 -17529 -12159 -6972 -2006 -1178 -3859 1577 8054 5949 -1373
15252 -1373 -10256 -8353 -3684 3321 -2309 -6581 -6644 -4461 6318 10901 7270 3975 3111 -7189 -9381
15237 -9381 -4502 -2231 -5449 -1425 6494 6657 -1238 839 1926 -1413 -2331 -1738 -410 -3688 -5104
15222 -5104 -7359 -7016 -5547 -3496 -7025 -9051 -6174 -1988 -5365 1333 7323 11759 8137 2961 -17
15207 -17 -3246 -5600 -987 4343 5589 1904 1142 -7360 -5458 -1056 2033 4200 2437 -1605 -3925
15192 -3925 -2587 -3726 -901 4284 9810 14733 11768 10744 8925 4354 5 -3608 -7163 -13301 -10012
15177 -10012 -7986 -4106 -2219 -1716 -1392 -3754 -14425 -18913 -18873 -16026 -6758 -1825 5722 6453 7273 4794
15161 4794 2306 358 3588 7771 4423 2666 5113 8661 7909 5541 3806 -3551 -4656 -2214 -3385
15146c385K530l674l141M555l86j553n504k894M90L203P939L158P06Q2r69P57
15130A914M466J421n501M933l346p224l699L92J273k061j275J566r6m25p71m330
15114a2763M869J552j646l493L315O89k569M81M381M252J130J954r31n22q39n422
15098e562J968J0007M67K078K945n661n078M49l539k073J104P1L473l692l577
15083f620Q42K717L022L726O670k168o082K161k187P93L671M767k270j3297m412
15068h667Q45k45J0376K386n197j812l36j662K790j884o02L99O37m962K434N906
15052D06n28m661N260J0626Q19k592j433m116k27k742l292J167q64Q5m349l74
15036f815N464K110o68l24k964O09n507M515L73L026Q236m226p919O1k012K351
$$ plain form
15146 -3385 -855 -4529 -7670 -3115 -3501 -5054 -10558 -13452 -12962 -9759 -1820 1338 2044 2126 1157 1914
15130 1914 6380 7801 2300 7233 3887 -3337 -7036 -6644 -5371 -7432 -8707 -7141 -7237 -7662 -8433 -12763
15114 -12763 -7894 -6342 -7988 -11481 -8166 -7477 -10046 -9565 -5184 -932 198 2152 1221 699 -140 -5562
15098 -5562 -3594 6413 6880 8958 11903 6242 1164 1613 -1926 -3999 -2895 -2824 649 -3043 -6620
15083 -6620 -5778 -3061 -39 3687 10357 8189 2107 4268 2081 2874 6545 11312 9042 -4255 -8667
15068 -8667 -7822 -8067 2309 4695 -502 -2314 -2650 -4312 -1522 -3406 -4008 -3609 -2972 -7934 -5500 406
15052 406 -122 -4783 477 11103 11922 9330 7897 3781 3554 812 -2480 -1313 -2177 -2092 -6441 -6815
15036 -6815 -1351 759 91 -233 -3197 -2588 -8095 -3580 -3207 -181 8055 3829 -4090 -4029 -6041 -3690
15020c690L529l081K060L245q615p970K511O142N653n85n692Q88J0217M782k066
15005G328l386Q46o330q30p081L340J999L891k160j079P667Q1p079N74R0J404
14989g25N460o34K536K805m637l959k919N751j280n409O91j843L236M744R132
14974A2949o152Q70k646l713N23k712q722R34N696J744M197M74K599m520m073
14959b552n967L111R32K360k212M514n49N346p40m67K135K61k878R85L567P32
14943H578J589l804j528l530O43J619J87J008n640k075K998N465m063p264m889
14928a0706R460P429j261J009j300r98p460p89O833O020p804N15L839L344j725
14913F406j1085l63K644l92n93l074j565J627M388L048J88K136J782k718n766
$$ plain form
15020 -3690 -161 -3242 -1182 2063 -6552 -14522 -12011 -5869 -216 -801 -6493 -5605 4612 9394 7328
15005 7328 3942 4788 -1542 -2372 -9453 -6113 -4114 -223 -2383 -3462 4205 4286 -2793 -2219 -2129 -725
14989 -725 4735 4101 6637 9442 4805 846 -2073 3678 2398 -3011 -2320 -4163 -927 3817 12949
14974 12949 6797 7667 5021 1308 1831 -881 -9603 -8669 -2973 -1229 2968 3442 6041 1521 -2552
14959 -2552 -8519 -5408 -4476 -2116 -4328 186 -363 4983 4243 3776 5911 6172 3294 4279 7846 8578
14943 8578 10167 6363 4835 1305 1948 3567 3754 4762 -878 -2953 45 5510 1447 -5817 -10706
14928 -10706 -1246 6183 4922 5931 4631 3633 -3827 -4616 2217 8237 433 948 4787 8131 6406
14913 6406 -4679 -5042 -2398 -2790 -3383 -6457 -8022 -6395 -2007 1041 1229 3365 5147 2429 -3337
14898c337J086K600j710J5m085L980R159Q57m381M938j166R42M27o913L16n51
14882B177O6K188j16P590n596k444M220n962l498O36j850Q17Q940n31l828J77
14866B986p83m636m342k265p491J742q67R68K756J463K429n965K706n399k859
14851a9557K20n74M918N576R185m80l083k226l090j256L045M867L482M967J222
14836G216k542l095p618m028K846L958o0N433P08n292k402K091J505l881m250
14821i411M844K716j422J86J395Q147K542p652L577L346k060r610l379O571L903
14806C693L323o285o19L393M995J553l295P97K444J064J020l88j566k769j749
14791E611O929k273l906M756O529j459L224p571Q19Q192J7526K1027K8809L6820
$$ plain form
14898 -3337 -2251 349 -1361 -1346 -5431 -1451 7708 8565 4184 9122 7956 8898 9325 2412 2728 2177
14882 2177 2243 4431 4315 11905 6309 3865 8085 2123 -1375 -739 -2589 -1772 7168 6637 2809 2986
14866 2986 2203 -2433 -6775 -9040 -16531 -14789 -15656 -14688 -11932 -10469 -8040 -14005 -11299 -16698 -19557
14851 -19557 -19337 -19911 -14993 -9417 -232 -712 -3795 -6021 -9111 -10367 -7322 -2455 1027 5994 7216
14836 7216 4674 1579 -6039 -10067 -7221 -3263 -3323 2110 2818 -2474 -4876 -2785 -1280 -5161 -9411
14821 -9411 -4567 -1851 -3273 -3087 -1692 6455 8997 1345 4922 8268 6208 -3402 -6781 -210 3693
14806 3693 7016 731 112 3505 8500 10053 6758 7555 9999 11063 12083 11695 10129 7360 5611
14791 5611 12540 10267 6361 11117 17646 16187 19411 11840 12659 20851 38377 59404 88213 125033
14777A25033M2090L8626K6140j0075k4945j3168R482J9469N611k6791m4022m0044
14765A07406k8791j6306j6630o931k987j0944p111k205P02M283O844j070j1483
14752A4777o277n571n54O234J698R37L75O59o35J670n529j045o02J07m65n642
14736A37J120j264n383L998P776K546k213p659k24n117j248l150J533M500J386
14721c262L783R683P998L252M905j831k105O325Q026P933J8546K7441L7932M0723
14707A69349L8274J6904j3687k2599j5105J2383J8150P223j8284m3239m7939l8507
14695F2923k2550j3101n625J20M915l065j0904l505p87R53m23L011j961q771o356
14680e126J062M729k267k00l21O71J68M094k531M293N36m545K085k836j223L406
$$ plain form
14777 125033 167123 205749 231889 221814 196869 183701 193183 212652 218263 191472 147450 107406
14765 107406 78615 62309 45679 38748 35761 24817 17706 15501 16203 20486 27330 26260 14777
14752 14777 8500 2929 2375 8609 10307 11244 11619 12278 11643 13313 7784 6739 6137 6244 5779 137
14736 137 1257 -7 -5390 -1392 6384 8930 6717 -942 -1166 -6283 -7531 -10681 -9148 -4648 -3262
14721 -3262 521 10204 18202 21454 26359 24528 22423 28748 36774 44707 63253 90694 128626 169349
14707 169349 207623 224527 210840 188241 173136 185519 203669 210892 192608 149369 101430 62923
14695 62923 40373 27272 21647 21767 26682 23617 12713 9208 8421 9374 8951 11962 10001 1230 -5126
14680 -5126 -4064 665 -1602 -1802 -2123 -1452 -1284 2810 279 4572 5108 563 2648 -188 -1411 1995
14664A995K463n857n492j092o83O922M362n94L624q42o194o656M15L055l992j782
14648a0348p90N532J899m66j021j304L744N81O67K336l606r33K922K712L73N069
14632G367K312m628p120j227M903P37k726p814k404J689n1L416L160O882n76L357
14616G277R55k196P5l606l588m295r6Q91k459L373J570n421L551L782o9k635q45
14599c736J280j409j321N265j850M245O451l700q142j848P052L565k498j0182
14585f828l768N432j757K891j41K358P531l454n068K041k078L317R65j050p332
14570f941l597k498O58o89L893N897M054p11l509J29K514j874o410k390N813O023
14554C62k196J799k615K784L06O484L085q212j564j240P53K441J219L054O412
$$ plain form
14664 1995 4458 -1399 -6891 -7983 -8666 -1744 2618 2024 5648 4806 -1388 -8044 -7629 -4574 -8566 -10348
14648 -10348 -11138 -5606 -3707 -4173 -5194 -6498 -2754 -2173 -1506 830 -2776 -3709 -787 1925 2298 7367
14632 7367 9679 5051 -2069 -3296 1607 2344 -382 -8196 -10600 -8911 -8962 -5546 -2386 4496 3920 7277
14616 7277 8232 6036 6111 2505 -1083 -5378 -5474 -4583 -7042 -3669 -2099 -7520 -3969 -187 -256 -2891 -3736
14599 -3736 -2456 -3865 -5186 79 -1771 2474 8925 5225 -2917 -4765 2287 5852 3354 -6828
14585 -6828 -10596 -5164 -6921 -4030 -4171 -1813 5718 2264 -2804 -763 -2841 476 1441 391 -6941
14570 -6941 -10538 -13036 -12378 -13067 -9174 -3277 777 66 -3443 -3314 -800 -2674 -9084 -11474 -5661 362
14554 362 -1834 -35 -2650 134 440 6924 10009 1797 233 -1007 -254 2187 3406 6460 12872
14539A2872k581m308R79L368K676k064J846j732k985o722J337j213P331J068j762
14524H110k550j840n281k909K304k568n812k686L641L697l265J996Q212l137k466
14509d554l884m785L290K973n578J732N015l375j843l018L23j200N349k096L928
14494g723K919l71N980P585J688j540j552J649J23m654j1028p400M715L663k080
14479h026k169K698M071k748n580N238J298O06l720l225N324K33J666M328O64
14464F58n546J59N385K711n127k021l014N29L814j41p349J349M135j818K756N993
14448B473j598m651K582Q52q593l42P537M653R90P020J522K63o832P43j183m087
14432A349O65k052J098p344m797j798M026N315N768O720j499m163l282J312k301
$$ plain form
14539 12872 10291 5983 6962 10330 13006 10942 12788 11056 8071 1349 2686 1473 8804 9872 8110
14524 8110 5560 3720 -1561 -4470 -2166 -4734 -10546 -13232 -9591 -5894 -9159 -7163 1049 -2088 -4554
14509 -4554 -8438 -13223 -9933 -6960 -12538 -10806 -5791 -9166 -11009 -14027 -13704 -14904 -9555 -11651 -7723
14494 -7723 -4804 -5175 805 8390 10078 8538 6986 8635 8758 4104 -6924 -14324 -9609 -5946 -8026
14479 -8026 -10195 -7497 -3426 -6174 -11754 -6516 -5218 -4612 -8332 -11557 -6233 -6000 -4334 -6 658
14464 658 -4888 -4729 656 3367 -1760 -3781 -6795 -6266 -2452 -2593 -9942 -8593 -4458 -6276 -3520 2473
14448 2473 875 -3776 -1194 -342 -8935 -9277 -1740 2913 3903 10923 12445 12708 5876 6619 5436 1349
14432 1349 2014 -38 1060 -6284 -11081 -12879 -8853 -3538 2230 8950 7451 3288 6 1318 -983
14417i83J518M421j290l491P87L170K723L211k058j5949o124k31P783R87J799
14402c727n944q608K620K601k842l458L319P178M531j217K620k067m52J380M942
14387H76j813j26L783L242o640j2935J877J1411l75K172J490n050O242q2j051
14372C021o59K404O514m783L37j25k494j322J079M693K406p53r108o15M047p291
14356b649j756J491k588O460L900m669J238M567L932l721P49O456n0j1122n646
14341c408r25L36J820j213m082l01K855M49R177J955K168j237k560l475m905j082
14325d428k885MN240J679L207K294K178j150j200o356J489K03p38j8k260p32m22
14308c895k936J952K814j279K345J919r01J435N35k556p280M74n107j132J385
$$ plain form
14417 -983 535 4956 3666 175 962 4132 6855 10066 8008 -7941 -14065 -14296 -6513 -5526 -3727
14402 -3727 -9671 -18279 -15659 -13058 -15900 -19358 -16039 -8861 -4330 -5547 -2927 -4994 -5446 -4066 876
14387 876 -937 -1063 2720 5962 -678 -13613 -11736 -325 -700 1472 2962 -2088 4154 4072 3021
14372 3021 2362 4766 11280 6497 6834 6709 4215 2893 3972 8665 11071 10318 1210 595 4642 -2649
14356 -2649 -4405 -2914 -5502 958 4858 189 1427 5994 9926 6205 6954 13410 13360 2238 -3408
14341 -3408 -4333 -3997 -2177 -3390 -7472 -7773 -4918 -4469 4708 6663 8831 7594 5034 1559 -3346 -4428
14325 -4428 -7313 -7309 -2069 -390 2817 5111 7289 6139 4939 -1417 72 275 -463 -481 -2741 -3473 -3895
14308 -3895 -6831 -4879 -2065 -3344 -999 920 19 1454 1989 -567 -7847 -7373 -12480 -13612 -12227
14293a2227O741J0090J232o340j07k621N042N915j938l301K188k079M748j192
14279F151j114m228L476N623J21m40o26j861l659j067L82p557J213j625q166M661
14263h716P660O840r43L640l216n129l427K780l454k063K056L318o396j0043Q676
14248h417J2973L065Q72j306m747K402N636K884m246p976n626M941m90M081O193
14233A0239m248m250K53k271N250M736j390q8m580p503L523K356o822O05n14J624
14217c080l84O528O578K593k792r564J505K305L137K021M18k465k558k522J887
14202C607M249l255j860j886j626O225O59K40M4j161O89r892p543J800P157K012
14186e41J831l054K55R766K696N616J017m813r3Q31r96r491J696K375J585p115
$$ plain form
14293 -12227 -5486 4604 5836 -504 -611 -3232 1810 7725 5787 2486 4674 2595 7343 6151
14279 6151 5037 809 4285 9908 10029 9589 8963 7102 3443 2376 2758 -4799 -3586 -5211 -13377 -8716
14263 -8716 -1056 5784 4841 8481 5265 136 -3291 -511 -3965 -6028 -3972 -654 -7050 -17093 -8417
14248 -8417 4556 7621 8493 7187 2440 4842 10478 13362 9116 1140 -4486 455 -35 4046 10239
14233 10239 5991 1741 1994 -277 4973 9709 8319 8231 3651 -3852 -329 2027 -4795 -4190 -4704 -3080
14217 -3080 -3464 3064 9642 12235 9443 -121 1384 3689 6826 8847 9265 6800 4242 1720 3607
14202 3607 7856 4601 2741 855 -771 5454 6113 6353 6397 5236 5925 -3967 -11510 -9710 -2553 -541
14186 -541 1290 -1764 -1509 8257 10953 16569 17586 12773 12680 13511 12515 3024 4720 7095 8680 1565
14170A565L01K760j868k863m163L917P307Q45m150l852m970n70K745j569K956
14155a609K460j503l208P64k056k424m048L060M863l940k28m65L952O130k975
14140a227m888j928L176m81M248j135k536K91q15P411Q087o14l440N77J189o550
14124A365l936J371N692N388p157m600N921O323j637r04K226J16N718J625M268
14109B1779K284K715J903q404l029j874Q52m544L605L740Q78m60j455o508p396
14094D086N517L472j619P252K986K174j554k191j2866L24m462l754l40N551L169
14079G745N23L77l203k282J914l5J155n722q134P916O341m294p30J318P454M849
14063A5192m084l168j943k979J174NJ146j913N126O025k964R89n098M215J239
$$ plain form
14170 1565 1866 4626 2758 -105 -4268 -351 6956 7801 3651 -201 -5171 -5741 -2996 -4565 -1609
14155 -1609 851 -652 -3860 -3096 -5152 -7576 -11624 -8564 -3701 -7641 -7869 -8334 -4382 1748 -1227
14140 -1227 -6115 -8043 -4867 -5348 -1100 -2235 -4771 -4480 -5295 2116 10203 9589 6149 6726 7915 1365
14124 1365 -2571 -1200 4492 9880 2723 -1877 4044 10367 8730 7826 10052 10168 15886 17511 21779
14109 21779 24063 26778 28681 20277 17248 15374 16226 11682 15287 19027 19905 19445 17990 11482 4086
14094 4086 9603 13075 11456 18708 21694 23868 22314 20123 7257 7581 3119 -635 -975 4576 7745
14079 7745 8268 8645 5442 3160 5074 5039 6194 472 -7662 254 6595 2301 1571 2889 10343 15192
14063 15192 11108 7940 5997 3018 4192 4197 5343 3430 8556 14581 11617 12606 7508 11723 12962
14048A2962j0122p260P6R05r65q68k016j329l3N139K72L993R257J197j39k011
14032I058O400M387n785m836p615l978p25J665L48j160j450J046M834J1287J622
14017A5098o781n253p49m033K610K493J14K590L532M968j665o152k906n515o80
14002b329O639J0385l911p313K417K803k961o303q080P384O111J452J738o738
13988A294N57o096r087n18O134O358L758J363q77K97L302q46o000n731Q15K419
13972b858J918K920N331m938n582L627J398P400k762j4905J605R572K42n477J34
13957b375p0L055l04l02P70k182K843O899K076K648M162k97n209r150n492k316
13941e244L014M288P593O250l105L425p631j3198l909N315L094N339J674J707
$$ plain form
14048 12962 2840 -4420 -4344 -3439 -4404 -5272 -7288 -8617 -8650 -3511 -3239 754 10011 11208 11069 9058
14032 9058 15458 19845 14060 9224 1609 -2369 -3094 -1429 -1081 -2241 -3691 -2645 2189 13476 15098
14017 15098 8317 3064 2315 -1718 892 3385 3499 6089 9621 14589 12924 6772 3866 -1649 -2329
14002 -2329 4310 14695 10784 3471 5888 8691 5730 -573 -8653 -1269 4842 6294 8032 1294
13988 1294 1851 -4245 -13332 -13850 -7716 -1358 2400 3763 2886 3183 6485 5639 -361 -6092 -5277 -2858
13972 -2858 -940 1980 7311 2373 -3209 418 1816 9216 6454 -8451 -6846 2726 2968 -2509 -2375
13957 -2375 -2445 610 306 4 774 -1408 1435 8334 10410 13058 17220 16923 11714 2564 -2928 -5244
13941 -5244 -2230 2058 9651 15901 12796 16221 8590 -4608 -8517 -3202 -108 5231 6905 8612
13927H612j62K688O25k694N787n00m274N904P78l048m607P36L808k989n443o399
13911a178n076L087Q018Q612P580K469K382l788j2073r600n032j379K013k877
13897f842k704R66M329M014j629j471j568M721P443M706j51m413p08N324N915
13882A7932r59l710j054K104o376j145o91L958N20j344n082k154J79o43P181J665
13866A0381Q27J836o873j915N170K076J502k242j609o370m829M710P820m581o326
13851d23J11K38M048J928L271q82l566K34J684q34K303L653P22k453n621L992
13835H405l241m396l267M019J919l529l91j757l178Q26L089L387K525N73K634
13820G618j609n292M339O561k033q719o38k060J900M870J915j995M181K644n46
$$ plain form
13927 8612 8450 11138 11763 9069 14856 14356 10082 15986 16764 13716 9109 9845 13653 10664 5221 -1178
13911 -1178 -6254 -3167 4851 13463 21043 23512 25894 22106 10033 433 -4599 -5978 -3965 -6842
13897 -6842 -9546 -8580 -4251 -237 -1866 -3337 -4905 -184 7259 11965 11814 7401 6693 12017 17932
13882 17932 16973 13263 12209 14313 7937 6792 6101 10059 10579 9235 4153 1999 2178 1535 8716 10381
13866 10381 11208 13044 6171 4256 9426 11502 13004 10762 9153 2783 -2046 2664 10484 5903 -423
13851 -423 -312 -74 3974 5902 9173 8291 4725 4959 6643 5809 8112 11765 12487 10034 4413 8405
13835 8405 5164 768 -2499 1520 3439 -90 -481 -2238 -5416 -4590 -1501 1886 4411 4984 7618
13820 7618 6009 717 5056 11617 9584 865 227 -1833 67 4937 6852 4857 9038 11682 11136
13805A1136M85J905l850m768n233m428O812K35l371K698j121j846R93m26k999
13790c778O18K858M464J128k559K005l189j292J509K570J2203N160j733L515l323
13775B0156p206r78m716P98k501k326j635N65j766L334K74j050N3K156L133L859
13759A2150O493k140m946m166N724j101l785O03j184j561k241l171o639O082P695
13744G813L57j046L669l102o987L914O814r72m92o24o2J691k212j2973L58K463
13728a391p63N75j603N455L875O64l67J521K222M467n79l664n01J584k77r424
13712A794o735K842M497M01K2j680J950J252R9l630K439O386r90q51o597K436
13696C635P000j369j74P653J280l977k111J893k884J891r47l531j837J171Q16
$$ plain form
13805 11136 11621 13526 9676 4908 -325 -4753 2059 2294 -1077 1621 500 -1346 -353 -779 -3778
13790 -3778 -3160 -302 4162 5290 2731 4736 1547 255 1764 4334 16537 21697 19964 23479 20156
13775 20156 12950 11972 7256 8054 5553 3227 1592 2157 391 3725 3999 2949 3002 5158 8291 12150
13759 12150 18643 16503 11557 7391 13115 12014 8229 8832 7648 6087 3846 675 -5964 118 7813
13744 7813 8170 7124 10793 7691 704 4618 11432 10460 9968 9344 9282 10973 8761 -4212 -3854 -1391
13728 -1391 -2154 -1579 -3182 2273 6148 6812 6445 7966 10188 14655 14076 10412 9911 11495 11218 1794
13712 1794 -4941 -2099 2398 2799 2821 1141 3091 4343 4442 812 3251 9637 8647 7796 1199 3635
13696 3635 10635 9266 9092 16745 18025 14048 11937 13830 10946 12837 11890 8359 6522 7693 8509
13681H509m697J06m65L332J531j22J857L658M820o579m762K851L632m324L547
13666A2894K113r12j422j874J662j19M125K906J187j563l893J449k604N347L443
13651B2739q561n314L74j254m143p141Q93P672M56M074J744l209q65J107N309
13636A3881L238j67J641L004j093p358j884m1l645K268J0953K860J007l635m539
13621A6490o349l091l736l864L679O34j19j297j946M71R290M296l034p129j897
13606B398j720J287j259K148L97l932J331P482L331J905J97k314j0040l791j091
13591c671K974L64j805O148J0258L496j791Kk129J815L294k395n38J205L663K491
13575B3381M522P11j05l119k729j058l385n641P3o072j823M295K906j150o815
$$ plain form
13681 8509 3812 3918 3453 6785 8316 8194 10051 13709 18529 11950 7188 10039 13671 9347 12894
13666 12894 15007 14095 12673 10799 12461 12342 16467 19373 20560 18997 15104 16553 13949 19296 22739
13651 22739 14178 8864 9238 7984 3841 -3300 -2407 5265 5721 9795 11539 8330 7465 8572 13881
13636 13881 17119 16952 18593 21597 20504 13146 11262 11221 7576 9844 20797 23657 24664 21029 16490
13621 16490 10141 7050 3314 -550 3129 3763 3644 2347 401 872 10162 14458 11424 4295 2398
13606 2398 678 1965 706 2854 3251 -681 650 8132 11463 13368 13565 11251 1211 -2580 -3671
13591 -3671 -697 -333 -2138 4010 14268 17764 15973 15975 13846 15661 18955 16560 16022 17227 20890 23381
13575 23381 27903 28614 28509 25390 22661 21603 18218 12577 12650 6578 4755 9050 11956 10806 3991
13560C991j230M142L751K575M267J177l512L289n255L064j569J928O202Q785J055
13545C2660r320n800n52l226J404J050K161L111K717j426k600m988p653r43M390
13530A0985Q388j404j957n12K111l857m170L683P22N972J518J254J374n285j795
13515A7027L661p606j325Q85o420l297J532J1336L728M1j530N004N860m44p697
13500B0755o354k667j322K584k282p61j894R187J0489m88q50k785j400Q01n342
13485A7671m39J0051K338K39p244m744L212J142Q61O840p109m8K831M897l505
13470B6993k443l225m024P527j342j2440J126M49r03N143P997l995l446K025K290
13455B1732j36K211k386l233K1j619l235L190m747M770L617j720j096L10m451
$$ plain form
13560 3991 2761 6903 10654 13229 17496 18673 15161 18450 13195 16259 14690 16618 22820 31605 32660
13545 32660 23340 17540 16988 13762 15166 16216 18377 21488 24205 22779 20179 15191 7538 6595 10985
13530 10985 19373 17969 16012 15500 17611 13754 9584 13267 13989 19961 21479 22733 24107 18822 17027
13515 17027 20688 13082 11757 12642 6222 2925 4457 15793 19521 19562 18032 23036 28896 28452 20755
13500 20755 14401 11734 10412 12996 10714 9953 8059 17246 27735 27247 26397 23612 22212 23013 17671
13485 17671 17232 27283 29621 29860 22616 17872 21084 22226 23087 29927 22818 22770 25601 30498 26993
13470 26993 24550 21325 17301 24828 23486 11046 12172 12621 11718 16861 24858 20863 17417 19442 21732
13455 21732 21596 23807 21421 18188 18209 16590 13355 16545 11798 16568 20185 18465 17369 17679 13228
13440A3228k425k245O56m7o146n932L718N462K177L058n08Q3j80L054O287M762
13424B5002K222L68k244j452J736M02k762k180m627j899M698M455k196K53n773
13409A6003Q745N637m015J174l008k096P615M56l210p469o996m239N337O949k522
13394A8361l904K024M300m899K794Q616K878j755j868m90m845q06N738n57k724
13379B2863J753K795l225m212j1985J395N373O115N98M156K924k087l350J609
13365B4722K444j163q12j719l501k807l609Q14K469R9J699L648M238l643m133
13350A8746P39M181J0866l045l965N03p785l289j181j0M95K525J485l828J048
13335A7485J723J749q69m525m79M642K479K474o821k706O78P159N582m155k07
$$ plain form
13440 13228 10803 8558 9214 9167 3021 -2911 807 6269 8446 11504 10996 11079 10899 13953 20240 25002
13424 25002 27224 27592 25348 23896 25632 26034 23272 21092 16465 14566 19264 23719 21523 21776 16003
13409 16003 24748 30385 26370 27544 24536 22440 30055 30511 27301 19832 12836 8597 13934 20883 18361
13394 18361 14457 16481 20781 15882 18676 27292 30170 28415 26547 26057 21212 20406 26144 25587 22863
13379 22863 24616 27411 24186 19974 7989 9384 14757 20872 21470 25626 28550 26463 23113 24722
13365 24722 27166 26003 25191 23472 19971 17164 13555 14369 16838 16937 18636 22284 26522 22879 18746
13350 18746 19485 23666 34532 31487 27522 28025 20240 16951 15770 15760 16255 18780 20265 16437 17485
13335 17485 19208 20957 20088 15563 15084 19726 22205 24679 17858 15152 15830 22989 28571 24416 24209
13320B4209j978M006K754m14o32l968o26J002o624n183J804J1145k67k109j493
13305B1626p07L966q44M165M417l126q457j617K528n764m120j621M132J904K861
13290A9343j312l499J459M944N298k738r73N192k081M81M876L07j0062p872K456
13275A5819J030L488K445J71O481L423k46k899p908m662J869P134M519k158o336
13260B2170m163L12N870J854J528n767M93J0603l857p753L125O678K243L166q89
13245C5613l370M481n640L33K843K476n200M55M492k959l15J256q72P358L972
13230D4923k650j995k106o111k893K520O006K004k891o24l320J694j330J163O798
13215D1188n001L58R32K868M823m170r403j1165N892N286O399Q46k543m127q76
$$ plain form
13320 24209 22231 26237 28991 28577 27945 23977 23351 24353 17729 12546 14350 25495 25228 23119 21626
13305 21626 20919 24885 24041 28206 32623 29497 21040 19423 21951 16187 12067 10446 14578 16482 19343
13290 19343 18031 14532 15991 20935 26233 23495 22522 27714 25633 26114 30990 31297 21235 13363 15819
13275 15819 16849 20337 22782 22953 29434 32857 32611 29712 21804 17142 19011 26145 30664 28506 22170
13260 22170 18007 18319 24189 26043 27571 21804 22297 32900 29043 21290 24415 31093 33336 36502 35613
13245 35613 32243 36724 31084 31417 34260 36736 31536 31991 36483 33524 33209 34465 33593 40951 44923
13230 44923 42273 40278 38172 32061 29168 31688 37694 39698 36807 36183 32863 34557 33227 34390 41188
13215 41188 36187 36545 37477 40345 45168 40998 31595 20430 26322 31608 38007 38853 36310 32183 31307
13200C1307J930k334m400J019p42o989j365O768L033M844O663L855j169k443J77
13185D0154J998M779p46k495P59j827k401Q25M816j361o408k555k225P514M005
13170D4832P436J1039M968j1088q685N603k172l757n259M669m018l703K637L354
13156D5856Q995J0108k667o892J291l52n824K334J2489P337q22q080j228O220
13142F8765m917j628k941l448j1489L103J5559O079M630o988r129o679k954O582
13128E4545M817J091J369M005L601K523L607m408l182j35M151J0249Q501J1401
13114A02135j975m923K003N686J3548J3449J8805J8834K7896L5312N7071Q5412
13102C73253J13089J70078K64501L92791M91856N29056M74316K11713l00835o74767
$$ plain form
13200 31307 33237 30903 26503 27522 26780 19791 18426 25194 28227 33071 39734 43589 42420 39977 40154
13185 40154 42152 46931 46185 43690 44449 42622 40221 41046 45862 44501 38093 35538 33313 40827 44832
13170 44832 52268 63307 68275 57187 48502 54105 51933 48176 42917 47586 43568 39865 42502 45856
13156 45856 54851 64959 62292 55400 56691 56339 50515 52849 65338 72675 71853 63773 62545 68765
13142 68765 63848 62220 59279 55831 44342 47445 63004 69083 73713 66725 57596 50917 47963 54545
13128 54545 59362 60453 61822 65827 69428 71951 75558 71150 67968 67833 71984 82233 90734 102135
13114 102135 100160 95237 97240 102926 116474 129923 148728 167562 195458 230770 287841 373253
13102 373253 486342 656420 920921 1313712 1805568 2334624 2808940 3020653 2719818 2045051
13092B045051o46074m48336k82188j61817r7794p1640n3106m3369k8949j7212
13082A94566j5280j3865j0363p546o021m138m372j0355rK90m074o298n942o634
13068I9959n071q352k234j08m063k186o769o814l515l665K004N368P513Q440k372
13053G8135j552K510J302O699Q78r369k383M970J771L935Q281j115o448o419j087
13038H0108n10P25k882j906N00J0508L090m640J50K582L133P372K74l170N4p866
13022H7522J555K564n576J558o652j2915m939r640r476m335L086P745J588k324
13008D9761j433J601o697r21l271L625N429K242J1181K736l64N268j764p959J770
12993F1204K990k7O638J473q10o221n683k451k911Q936O628j713m217P634J001
$$ plain form
13092 2045051 1398977 950641 668453 506636 408842 337202 284096 240727 211778 194566
13082 194566 179286 165421 155058 147512 141491 137353 132981 122626 122617 122907 118833 112535 106593 99959
13068 99959 94888 86536 84302 84194 80131 77945 71176 64362 60847 57182 59186 64554 72067 80507 78135
13053 78135 76583 79093 80395 87094 87972 78603 76220 81190 82961 86896 95177 94062 87614 81195 80108
13038 80108 79598 80323 77441 75535 76035 86543 89633 84993 85143 87725 90858 98230 98504 95334 95388 87522
13022 87522 89077 91641 86065 87623 80971 68056 63117 53477 44001 39666 42752 50497 52085 49761
13008 49761 48328 49929 43232 42311 39040 42665 48094 50336 61517 64253 63889 69157 67393 59434 61204
12993 61204 64194 64167 70805 72278 71468 65247 59564 57113 54202 63138 69766 68053 63836 71470 72471
12978G2471K249O484M215m605k101l558j7025j0669o464J680o588k099q36m146
12964B9008K794N333j803p949q314l5n05O435K0619K4746K9888L1466L2106K6749
12950A90538J835m6124o0983l7019n268K0368K6729J2544J0615K044l328n599
12938A06352p924m950l860N210R524J0255J0616K634k224o410p450n669j002j1279
12924I3823r213j549l069P959J2082J362L030R853N969Q193J2337J0741M285N661
12910A61464M350k1N672K7642K0260K0368K5974M7178N5745O6572N9999N3182
12898E48385Q1864Q0505P928o8276j12345j10711q2666n2152m8823l8505j5820
12887A89384j0396m737N086J2549Q749n941N177k648j6803j0487J360P626M638
$$ plain form
12978 72471 74720 81204 85419 80814 78713 75155 58130 47461 40997 42677 36089 33990 33154 29008
12964 29008 31802 37135 35332 27383 19069 19034 18529 24964 45583 70329 100217 131683 163789 190538
12950 190538 192373 146249 85266 48247 42979 63347 90076 102620 113235 115279 111951 106352
12938 106352 98428 93478 89618 94828 104352 114607 125223 127857 125633 119223 111773 106104 105102 93823
12924 93823 84610 83061 79992 87951 100033 101395 104425 114278 120247 128440 140777 151518 155803 161464
12910 161464 165814 165793 171465 199107 219367 239735 265709 312887 368632 435204 495203 548385
12898 548385 630249 710754 718682 650406 538061 427350 344684 292532 243709 205204 189384
12887 189384 178988 174251 179337 191886 200635 194694 199871 197223 180420 169933 171293 178919 183557
12874A83557m315K231J433k095J61N243N252N487N90j217PP287O533J1006L054
12859B24214j1334k2484k3749j9016n457P954J4803J5936J2277N063m98l962m479
12846A89268l935k526r218j6277n712j082Q914J0178k791j791q41J213O717k011
12832A70106l186P377R498m010r160P579O406l634j885j172M386J1126K3690K2349
12818B39470J5128R132R581K980m851M549M415J0232J5q043n793j1867j8073j0670
12804B36205q1J0933J8504J2691N148N086p768q062L817J2055R781M190J942O192
12790C10633R120N428J3338J6584J6656J9143K1545K2042K1122J8926R496J600
12778D85633N493K1922K9843M5249N9968Q3050J06714J07365O1874m5743j35188
$$ plain form
12874 183557 179242 181473 182906 180811 180972 186215 191467 196954 197544 196327 196334 203621 210154 221160 224214
12859 224214 212880 190396 166647 147631 142174 150128 164931 180867 193144 198207 197709 193747 189268
12846 189268 185333 182807 173589 157312 151600 150518 159432 169610 166819 165028 164187 165400 172117 170106
12832 170106 166920 174297 183795 179785 170625 178204 184610 180976 179091 177919 182305 193431 217121 239470
12818 239470 254598 263730 273311 276291 271440 275989 280404 290636 290651 282608 276815 264948 246875 236205
12804 236205 236124 247057 265561 278252 283400 288486 280718 272656 276473 288528 298309 302499 304441 310633
12790 310633 319753 325181 338519 355103 371759 390902 412447 434489 455611 474537 484033 485633
12778 485633 491126 513048 542891 588140 648108 731158 837872 945237 1007111 961368 826180
12767H26180j56231j06392n1502m2242m6780l4400j7221r371k492q637k061N342
12755C54193J907J197M438J4455J3527L236q652j5437o664p048O732J8527K3322
12742D03733K1293K4778L1147L2334L1792L6749L6083L1099J7904L637j1857j7830
12730F40862j3709j557J0767Q111j924j4874o254J5784L0698K7180K2497K2972
12718G40553J2914J5693O630L494J7089L6762N4831O6946O7645O3916M4949L3566
12706A164988K6594J2308J4150J9864J9273J6685Q527J1259K0433M6350P5253
12695A435684P5303Q2345J06680J27393J39011J17597Q9997O8669O5074P8161
12685B385914J00342J17697J19101J19501J21629J41906J47286J47832J72351
$$ plain form
12767 826180 669949 563557 512055 469813 423033 388633 371412 362041 359549 350912 348851 354193
12755 354193 356100 357297 361735 376190 389717 392953 384301 368864 362200 355152 361884 380411 403733
12742 403733 425026 449804 480951 513285 545077 581826 617909 649008 666912 670549 658692 640862
12730 640862 627153 625596 636363 644474 642550 627676 621422 637206 667904 695084 717581 740553
12718 740553 753467 769160 775790 779284 796373 833135 887966 954912 1022557 1086473 1131422 1164988
12706 1164988 1191582 1203890 1218040 1237904 1257177 1273862 1282389 1293648 1314081 1360431 1435684
12695 1435684 1510987 1593332 1700012 1827405 1966416 2084013 2174010 2242679 2307753 2385914
12685 2385914 2486256 2603953 2723054 2842555 2964184 3106090 3253376 3401208 3573559
12676C573559J93758K29783K56154K88850K89939K81865K74670K91378L51119
12667F031075M66321O07126P20586Q23579R46311J122950J378224J727529K165024
12658A5988725K621419L065939L469860L697361M150039N632184Q410452J2619157
12650E9655136J9109855K9487750M5506037O6912500Q7111065R5700349Q9820707
12643D93303399O2620674q987828r8461095j31177116j03533839o6522301m0976061
12636A06265833k5881217j7061974j1575099p997712n648713m130589l183328
12629C0787201k738471k770893k763410k382642j927739j573646j298341j079628
12621A4252431r34534q05721p15079o54378o37269o36060n80931m96613m18851
$$ plain form
12676 3573559 3767317 3997100 4253254 4542104 4832043 5113908 5388578 5679956 6031075
12667 6031075 6497396 7104522 7825108 8648687 9594998 10717948 12096172 13823701 15988725
12658 15988725 18610144 21676083 25145943 28843304 32993343 38625527 47035979 59655136
12650 59655136 78764991 108252741 153758778 220671278 307782343 403482692 493303399
12643 493303399 555924073 546936245 448475150 317298034 213764195 147241894 106265833
12636 106265833 80384616 63322642 51747543 43749831 38101118 33970529 30787201
12629 30787201 28048730 25277837 22514427 20131785 18204046 16630400 15332059 14252431
12621 14252431 13317897 12512176 11797097 11142719 10505450 9869390 9288459 8791846 8372995
12612H372995l54379l16936l04855l00050l08477l07015k95819k73763k39995
12603E671706k36370k38082k37597k22486k06961k05757k08141j75338j39929
12594C801045j13981q4695p6690r6934j25166j31538j23133j18353j21325j39480
12584B669750j46970j35571j15212q7358p1083p4203p1353n6135m4567k7448q561
12573A831289j4717l2404n3695o1996o6432o0231m9638l7248k4205l1935k7598
12562A371190m4736n3866n4584n7543m3476l0505m1445m8891m9563l8442l4415
12551H73724k0864j4360j338J2316O579k193m652m662k178o631o901p551k2875
12538G98414k9441k2895k3443k2584j8465j0570o207J1386L270o275j936p63j2065
$$ plain form
12612 8372995 8018616 7701680 7396825 7096775 6788298 6481283 6185464 5911701 5671706
12603 5671706 5435336 5197254 4959657 4737171 4530210 4324453 4116312 3940974 3801045
12594 3801045 3687064 3602369 3525679 3428745 3303579 3172041 3048908 2930555 2809230 2669750
12584 2669750 2522780 2387209 2271997 2184639 2113556 2039353 1968000 1911865 1867298 1839850 1831289
12573 1831289 1816572 1784168 1730473 1668477 1602045 1541814 1492176 1454928 1430723 1398788 1371190
12562 1371190 1326454 1272588 1218004 1160461 1116985 1086480 1045035 996144 946581 908139 873724
12551 873724 852860 838500 837162 849478 856057 853864 849212 844550 842372 835741 828840 821289 798414
12538 798414 768973 746078 722635 700051 681586 671016 664809 676195 679465 673190 671254 670491 658426
12525F58426L135J2580J2681J5225J4205K8404N4516Q4836Q4397J3028q8816j61083
12513G31534j60297j12826p5297l8540q343n467j1957K44n793j3512j3467r563
12501B76716l888m867r155j6879o712k58p87l23N575j359j4734j7305j3026o483
12487A86515j0593r177k787K59L638M844l798j2985j7777j9965j3646j0671n043
12474H8814P745n037r298m537m679J843j854J0733J5495J2589J0463P105J876
12461A31258r544q985p627K963J0656R85r579j5510k864N755j387k433L299p2
12447I6915j6O231j859o44j0594j2752k1901j3679o146Q06k856k435P402M809
12433D3281P057O571N892l685r418j3514j8722j9978j4612p575j636M151n112
$$ plain form
12525 658426 661561 674141 686822 702047 716252 744656 799172 884008 968405 981433 892617 731534
12513 731534 571237 458411 383114 344574 336231 330764 318807 319051 313258 299746 286279 276716
12501 276716 272828 267961 258806 241927 235215 234957 234170 233847 239422 238063 223329 206024 192998 186515
12487 186515 175922 166745 163958 164217 167855 172699 168901 155916 138139 118174 104528 93857 88814
12474 88814 96559 91522 82224 77687 73008 74851 72997 83730 99225 111814 122277 129382 131258
12461 131258 121714 112729 105102 108065 118721 119706 110127 94617 91753 97508 96121 93688 96987 96915
12447 96915 96899 103130 101271 100627 90033 77281 55380 41701 35555 36361 33505 31070 38472 43281
12433 43281 50338 56909 62801 59116 49698 36184 17462 -2516 -17128 -24703 -26339 -22188 -27300
12420b7300m153M858M567J799J510R771L59K408m495l811n507n19O670R653k590
12405f780q489m787M709Q571K065O224J5545N203n571M256L941K653J197L555
12391C2292m994J051O740L642q782r349q532j0919j0692o091j2988j276L451l16
12377b6763J1853R454P32K25r94O912O255R316K172m822Q137O774Q375L471j670
12362C9427j873l425q986o778j0063r83j0463q244k619N82M102K793J2203P482
12348A3155Q5k059k550m683m710Q04Q017J7035J2740L14j9593l8943n0481m3850
12334a14719j27M7222N5540M3896J9966n06J551P256Q025k734m513m921r00m340
12320E0696K661n96o971p618N429J998k739K42j1255j9574r380n79j023j59O589
$$ plain form
12420 -27300 -31453 -26595 -22028 -20229 -18719 -8948 -8589 -6181 -10676 -14487 -19994 -20513 -13843 -4190 -6780
12405 -6780 -15269 -20056 -15347 -6776 -4711 1513 17058 22261 16690 20946 24887 27540 28737 32292
12391 32292 27298 28349 35089 38731 29949 20600 12068 1149 -9543 -15634 -28622 -29898 -26447 -26763
12377 -26763 -14910 -5456 -4724 -4499 -5493 1419 7674 16990 19162 14340 22477 29251 37626 41097 39427
12362 39427 37554 34129 25143 18365 8302 7319 -3144 -11388 -14007 -13425 -9323 -6530 5673 13155
12348 13155 13240 11181 8631 3948 -762 42 8059 25094 37834 38148 18555 -20388 -70869 -114719
12334 -114719 -114846 -67624 -12084 31812 51778 51272 52823 60079 68104 65370 60857 55936 55036 50696
12320 50696 53357 52761 45790 38172 43601 45599 42860 43102 31847 12273 2893 2314 1291 1132 7721
12305G721O402l647L260M245l986r887M778K35l534q231P35k451l408J971J0569
12290D772J2059j930j985m317k969L442J1718P529k52Q8q61k933j854p674k967
12275A1866N55J736N126L988j088l244q045m433M002l96K581O536j986p543p811
12260A844k132k067l330q557K0M165L481K879j765K310L036l699N805n23j0896
12245i429N730L114m701O27O155l896j155j13j951K501N309K280l404J294O592
12230H953J4070Q097P244K316P39K24j432j982n436k464M365K00n223N100M048
12215C8819q280n963j386j890n709L082m875L914J1538R739R319J0934O338J7
12201F5597M041J07O168J5686J4015K0126K2288J9991K8324M4118O2121R5402
$$ plain form
12305 7721 14123 10476 13736 17981 13995 4108 8886 9121 5587 -2644 -1909 -4360 -7768 -5797 4772
12290 4772 16831 14901 12916 8599 5630 9072 20790 28319 28067 28155 27294 24361 22507 14833 11866
12275 11866 12421 14157 19283 23271 22183 18939 10894 6461 10463 10067 12648 19184 17198 9655 1844
12260 1844 -288 -2355 -5685 -14242 -14222 -10057 -6576 -3697 -5462 -3152 -116 -3815 1990 1467 -9429
12245 -9429 -3699 -585 -5286 -4659 1496 -2400 -3555 -3668 -5619 -3118 2191 4471 1067 2361 8953
12230 8953 23023 31120 38364 40680 41419 41643 40211 38229 32793 30329 34694 34894 29671 34771 38819
12215 38819 30539 24576 23190 21300 15591 18673 13798 17712 29250 38989 48308 59242 65580 65597
12201 65597 69638 69745 75913 91599 105614 125740 148028 168019 196343 240461 302582 397984
12189C97984J48927K28115L39277M52745N25191N17897L72246m3093n45974o95068
12179A698247n23245l13687j68209p8062q050M9554R9840J39842J41128O3129
12169A100487m4550j50198k00659j87340j34586r0685o3825l9409k9381k0293
12159A39561k0024j3426n463n679n767j5862j6616r664k068K2J1627M693l897
12146E7437m145j0022k568l634l135j897l462M149P49q958o455j181L395j003
12132A9270J873J0043o21p320K580J21j801J722o181q691l5L730l569m49j050
12117I622K135j192R0O161j638q143J672N271p4m213K909k188K804o127k829o30
12101C630R48M721L544j88N02O44K2k634p414N97J323l094l984L13O973O926J0406
$$ plain form
12189 397984 546911 775026 1114303 1567048 2092239 2610136 2982382 2939289 2393315 1698247
12179 1698247 1175002 861315 693106 615044 606994 656548 756388 896230 1037358 1100487
12169 1100487 1055937 905739 705080 517740 383154 292469 228644 189235 159854 139561
12159 139561 119537 106111 100648 94969 89202 73340 56724 47060 44992 45014 56641 61334 57437
12146 57437 53292 43270 40702 37068 33933 32036 28574 32723 33472 24514 18059 16878 20273 19270
12132 19270 21143 31186 30565 23245 25825 25946 24145 25867 19686 10995 10960 14690 11121 10672 9622
12117 9622 11757 10565 10655 16816 15178 7035 8707 13978 13904 9691 12600 10412 13216 7089 4260 3630
12101 3630 4578 9299 12843 12655 13157 13801 13823 11189 3775 4372 5695 2601 -1383 -1070 5903 12829 23235
12084B3235p492n312l97q826j26j995K538Q944K897j2552l722k413L663o478L06
12069g730L201L669L122K476K83m30p444m087r40M458p41j796N443J3530j692
12054A1322r476J597O708k43k495m734J074p84J695J273p338K39l953M8J2466
12039G399K115M86q32n689l547l335J297K88l639J91K930N067k522N808N445p43
12023A0719m607k770J786M980K690m11q575k042N181J820p641n019J0497M122
12009A0730n821j767O183m255l310O02l350P553N407P74k722k135n69P07j584
11994F443p98K07J767j454k036O644J268k374k278l026k624k966L843J518J11
11979D245J366L430m099n271l06P705O356M049m245O155n393n59j695j153n96
$$ plain form
12084 23235 15743 10431 10034 1208 1082 -913 1625 10569 13466 914 -2808 -5221 -1558 -8036 -7730
12069 -7730 -4529 -860 2262 4738 5021 4591 -2853 -6940 -7880 -3422 -4163 -5959 -516 13014 11322
12054 11322 1846 3443 10151 9908 7413 2679 3753 2969 4664 5937 -1401 -1162 -5115 -5067 7399
12039 7399 9514 10000 9168 3479 -68 -3403 -2106 -1818 -5457 -5266 -2336 2731 209 6017 11462 10719
12023 10719 6112 3342 5128 10108 12798 12387 3812 1770 6951 8771 1130 -3889 6608 10730
12009 10730 4909 3142 9325 5070 1760 2362 -988 6565 11972 12746 10024 7889 7320 8027 6443
11994 6443 5645 5852 7619 6165 4129 10773 12041 9667 7389 4363 1739 -1227 2616 4134 4245
11979 4245 5611 9041 4942 -329 -635 7070 13426 17475 13230 19385 13992 13433 11738 10585 9989
11964I989k374J058L528j780o159m493K30L249K722p63j526J802K129Q4m909j277
11948A510J379N351O328p586r492J774j353l07K042K980J823M771O986R52K070
11933A9228k315o215m442K956m493o14N513L595o604o681L236N547J719r81o026
11918C423j945K491k026l509K812L265J545q005J012L160n29J202J195m124j588
11903a621L269L382k579o961o210L007N39m302j016P335P154O428o556n171M498
11888A196m394P04M013L670P244m59J143K904k43N81n723m197l574q622j454L663
11872c548l955k039N561p2O405m203K506j91K870m362k772K350J631m350j458
11857e627m97K498N501K577J582l168j347N134r299j1112q23M775M631O050L461
$$ plain form
11964 9989 7615 8673 12201 10421 4262 -231 -1 3248 5970 5207 3681 5483 7612 7696 2787 1510
11948 1510 2889 8240 14568 6982 -2510 -736 -2089 -2396 -354 2626 4449 9220 16206 17158 19228
11933 19228 16913 10698 6256 9212 4719 4105 9618 13213 6609 -72 3164 8711 10430 9449 3423
11918 3423 1478 3969 1943 -1566 1246 4511 6056 -1949 -937 2223 1694 2896 4091 -33 -1621
11903 -1621 1648 5030 2451 -4510 -10720 -7713 -7174 -11476 -12492 -5157 1997 8425 1869 -3302 1196
11888 1196 -3198 -2494 1519 5189 12433 11974 13117 16021 15778 16359 10636 6439 2865 -5757 -7211 -3548
11872 -3548 -7503 -9542 -3981 -4053 2352 -1851 655 464 3334 -1028 -3800 -1450 181 -4169 -5627
11857 -5627 -6124 -3626 1875 4452 6034 2866 1519 6653 -2646 -13758 -14581 -9806 -5175 875 4336
11842D336J779L010M614k453m726K25n380r77l884j953O301Q088J971o135M869
11827I685M79K1L249K909j034m318l203o671n105M463k77N09M109O692L013k068
11811A2453o377p274l964j391O232K334j944K679P53l648o896p720L672M335n88
11796g344j300M397L066n791m457O684L844m83L309l54R28j819M75p70k792K195
11780b12N625J549K611J926J221j30k346o99K103k643l848o62N965Q245l731p916
11764G058P66K797J322Q519J136R36n162l626J722J205o864m168q918O982J042
11749D747k78O129O71J301j870J881m742k385m255L452L592k017m981L879J543
11734F667J804N293J788l928L59J627r18l086k39N21J456J965M11N503n721J645
$$ plain form
11842 4336 6115 9125 13739 11286 6560 6785 1405 428 -3456 -5409 892 8980 10951 4816 9685
11827 9685 10164 10185 13434 16343 15309 10991 7788 1117 -3988 475 198 707 4816 11508 14521 12453
11811 12453 6076 -1198 -5162 -6553 -321 2013 69 2748 3501 -147 -7043 -14763 -11091 -6756 -7344
11796 -7344 -8644 -4247 -1181 -6972 -11429 -4745 -901 -1384 1925 1571 2499 680 1155 385 -2407 -212
11780 -212 5413 6962 9573 11499 12720 12590 10244 9545 11648 9005 5157 4495 10460 18705 14974 7058
11764 7058 7824 10621 11943 20462 21598 22534 17372 13746 15468 16673 9809 5641 -3277 3705 4747
11749 4747 4469 10598 11269 12570 10700 12581 7839 5454 1199 4651 8243 6226 1245 5124 6667
11734 6667 8471 13764 15552 11624 11983 13610 12692 9606 9367 9888 11344 13309 13720 19223 13502 15147
11718A5147P291K464k268n132m794J986O674m409o578q331k51l45j575L661L923
11703G463L552R89p206m612j217K916L062K130m407j475J0929M546J1040J2458
11689D0168Q830Q436l793k1988k3843r708l32J1887J1980O592J348k1l962o853
11675A8741m550J934N937L089N114K780k977k656p376j244k571j437j251j557
11661A1976k862k011J921J557P744O518l85o905K641N309j388m337L816J0997
11647C4591P401O177N893K862L066J6946J9810L915J4814J7389J5913K2980K0534
11634A92291J4840Q827j3575l7957l8637k9346k2506j3182o157j841K373o54K569
11621E7045M241L132o171o411q04R56j23m632k063J883K431j526n060K23K249
$$ plain form
11718 15147 22438 24902 22634 17502 12708 14694 21368 16959 10381 2050 1799 1454 -121 3540 7463
11703 7463 11015 12004 4798 186 -1031 1885 4947 7077 2670 1195 12124 16670 27710 40168
11689 40168 48998 57434 53641 31653 7810 -1898 -2230 9657 21637 28229 29577 29556 25594 18741
11675 18741 14191 16125 22062 25151 30265 33045 30068 27412 20036 18792 16221 14784 13533 11976
11661 11976 9114 7103 9024 10581 18325 24843 24458 17553 20194 25503 24115 19778 23594 34591
11647 34591 41992 48169 54062 56924 59990 76936 96746 100661 115475 132864 148777 171757 192291
11634 192291 207131 215958 202383 164426 125789 96443 73937 60755 54598 52757 55130 54476 57045
11621 57045 61286 64418 58247 51836 51032 51988 51865 47233 45170 47053 49484 47958 42898 43121 45370
11606D5370L360O290O08r299j094O081N301O082m472q230j459r133n190n044k451
11591B6720q18L014J0072J387n471n26L687J159J315K099M63l374o487l177P628
11576C7691N536l658J810N243m192M166O135Q237M128o918m097k869M003k520
11562E2695m522J1466P26j481P019R039N602r19Q235P119M346R897J2677L219
11548A25118o50K362M038J0995K1551L5246N5451Q5959J39485J75305J90716J47012
11536I92588O6846o6699j78894k11485j80850j13868o9844m5397k1252j2300j7385
11525A41460q734o111k234L011N359M137J67K91p479k169J1621J5330J1141J6994
11511A82784K1937L5072L0504K7865O638k7938m8575n0534m4947l3699j7296j867
$$ plain form
11606 45370 48730 55020 55628 46329 45235 51316 56617 62699 58227 49997 48538 39405 34215 29171 26720
11591 26720 25902 28916 38988 40375 34904 34378 38065 39224 40539 42638 43101 39727 33240 30063 37691
11576 37691 43227 39569 41379 46622 42430 46596 52731 60968 65096 58178 54081 51212 55215 52695
11562 52695 48173 59639 60365 58884 65903 74942 80544 79625 87860 94979 99325 109222 121899 125118
11548 125118 124468 126830 130868 141863 163414 198660 254111 340070 479555 654860 845576 992588
11536 992588 1059434 992735 813841 602356 421506 307638 237794 192397 171145 158845 141460
11525 141460 132726 126615 124381 127392 132751 136888 137055 137346 129867 127698 139319 154649 165790 182784
11511 182784 204721 239793 270297 298162 304800 276862 228287 177753 132806 99107 81811 79944
11499G9944O58l972m563J625J0085Q846O434M212r504K084P285n092q049o587
11485H3406o761m186k272R507J5846O765J57L504J2546J5096J2781L248J1929
11472A61566R246K246M56k876j432r9M098o768l895l980M903l608L736N753J0926
11457A80272P030Q62m21j713P70O532J1919J1863J9907J7491J9109J9969R031
11444C02621J1510P503j911P956O861j030K618O680O176L738J7174K5184J3336
11431D08416K0024L5851M7223M0546L5990L3160J9421J9449J6165K3972K5639
11420G25856K4772K4424K8049L7813L2601L1996L9121M9205O2165P4251P6465
11409A206718P5996P1593O8557P2779R0913J27001J64106J94945K17501K53730
$$ plain form
11499 79944 80602 76630 72067 73692 83777 92623 99057 103269 93765 95849 103134 98042 89993 83406
11485 83406 76645 72459 70187 79694 95540 102305 102462 105966 118512 133608 146389 149637 161566
11472 161566 170812 173058 173514 170638 169206 169107 173205 166437 162542 158562 163465 159857 163593 169346 180272
11457 180272 187302 188164 187743 186030 186800 193332 205251 217114 237021 254512 273621 293590 302621
11444 302621 314131 321634 319723 327679 334540 333510 336128 342808 348984 352722 369896 395080 408416
11431 408416 428440 464291 511514 552060 588050 621210 640631 660080 676245 700217 725856
11420 725856 750628 775052 803101 840914 873515 905511 944632 993837 1056002 1130253 1206718
11409 1206718 1282714 1354307 1422864 1495643 1586556 1713557 1877663 2072608 2290109 2543839
11399B543839L02718L71370M67097N93146P43868R06562J053363J206814J444997
11390I633774J899130K773323M240494O635976J0433617J5958781K2633284K8913555
11382A03121934L2515139K8560944J3413971q256146k9810922l7580667l3781719
11375F8182534k2522776j3311774q078253n309748l700990k614172j813962j259599
11367I571260r18175p33215o82895o93235o63832n99574m97152l94215l18690
11358D070277k63592k28776j98870j88061j91105j73718j61536j41553j14716
11349B408350r5859q2964p5845q1427r3846r1094q0184p6531p5192p7185p2148
11338A506075n9783o7584o4463o2470n6664m3063l9794l7047j8518j8795l0994
$$ plain form
11399 2543839 2846557 3217927 3685024 4278170 5022038 5928600 6981963 8188777 9633774
11390 9633774 11532904 14306227 18546721 25182697 35616314 51575095 74208379 103121934
11382 103121934 135637073 164198017 177611988 169355842 139544920 101964253 68182534
11375 68182534 45659758 32347984 24269731 18959983 15258993 12644821 10830859 9571260
11367 9571260 8653085 7919870 7236975 6543740 5879908 5280334 4783182 4388967 4070277
11358 4070277 3806685 3577909 3379039 3190978 2999873 2826155 2664619 2523066 2408350
11349 2408350 2312491 2229527 2153682 2072255 1978409 1887315 1807131 1730600 1655408 1578223 1506075
11338 1506075 1446292 1378708 1314245 1251775 1195111 1152048 1112254 1075207 1056689 1037894 1006900
11327A006900l9542l9615l4952m2668m3554m3007l6512l5282k9365k4532k5847
11316F12024k6124j5883j6917j1869k503j0611q078j0939j3879k4137k2463j0773
11304D37848q712p251j3715r361j5182m540r009j8918j1510k0266k1927r162q854
11291B79441j4790j3926p284k74l355O5L678M704L343m194L521j996K505j787
11277B49651j1158r070j1997j6586j1060k063n604O933N195J603l734j957P984
11264A98137J800k154n119L002K44N044N460J2572K2003K2467K2148j716k3874
11251B60014m4595m6261l3909k5737j6326m705N692j967n38k798J279J152k761
11238H8540q44M259P228L43J125Q179J2674R917J6704L7867M9500P5775J11808
$$ plain form
11327 1006900 967358 927743 892791 850123 806569 763562 727050 691768 662403 637871 612024
11316 612024 585900 570017 553100 541231 538728 528117 520039 509100 495221 471084 448621 437848
11304 437848 429136 421885 408170 398809 383627 379087 370078 351160 339650 319384 297457 288295 279441
11291 279441 264651 250725 243441 243167 239812 239877 243555 248259 251602 247408 250929 248933 251438 249651
11277 249651 238493 229423 217426 200840 189780 187717 182113 189046 194241 195844 192110 190153 198137
11264 198137 199937 197783 192664 195666 195910 200954 206414 218986 240989 263456 285604 283888 260014
11251 260014 215419 169158 135249 109512 93186 88481 94173 92206 91668 88870 90149 91301 88540
11238 88540 87696 91955 99183 99526 100651 108830 121504 131421 148125 185992 235492 311267 423075
11225D23075J42321J77817J75805R3626k8876j55718k05104j96580j30744q0696
11215B14926m7483l5377k7995j5275j0936j3689j0223j1070R13O36r998l754M626
11202C5301Q302M156P056k847m313j770m345p71l314l915k246l92p722n65J641
11187B4256J648Q32O50n500r546k069J371J193r63m079j183M49P61m916m065l92
11171a553j602J11J0916P863m307j2980p985r023k496J376l233n968l198j415
11157c3494M803Q7Q531L848L504l013N268Q676k153k719j688P138O686l912j0395
11142h833p556q948J215Q028J0734L916j373L472K130J30r473j024l430L408j286
11127h890N4P717L754j880M681n324j6032j1072m38L574M339P388J357q926n164
$$ plain form
11225 423075 565396 743213 919018 1012644 983768 828050 622946 426366 295622 214926
11215 214926 167443 132066 104071 88796 77860 64171 53948 42878 43791 44427 34429 30675 35301
11202 35301 43603 47759 54815 51968 47655 45885 41540 40769 37455 33540 31294 30902 23180 22615 24256
11187 24256 25904 26736 27386 21886 12340 10271 11642 12835 11872 7793 6610 7059 7820 2904 -1161 -1553
11171 -1553 -3155 -3044 7872 15735 11428 -1552 -9537 -18560 -21056 -19680 -22913 -28881 -32079 -33494
11157 -33494 -28691 -28604 -20073 -16225 -12721 -15734 -10466 -1790 -3943 -6662 -8350 -1212 5474 1562 -8833
11142 -8833 -16389 -25337 -24122 -16094 -5360 -1444 -2817 655 2785 2915 -6558 -7582 -11012 -7604 -8890
11127 -8890 -8836 -1119 2635 755 5436 112 -15920 -26992 -27430 -23856 -19517 -12129 -10772 -19698 -24862
11112b4862O288N823l119R073R462O450m483j771j442m6p322p296J141L093K112
11097f899k338n16p1k76p209l0Q979L240L870M652o95O12L53l5j303r17k798K704
11079A323o69k648K158k08r586k1109j4187R03O786J340J3876K1218K881m687
11065b609M575J1167O259p55m595p959o687m9l305L259O084K736n815J447J10
11050C863k618m987K554l955q37n545r214O80O640K918Q485K27k844j716m87L040
11034c796J338j876r19L104K390j157k486L1R0J235j593q722j530O836j483O082
11018b456R216R80p449j574n995K081K153j456M079n134J334K934j676M606j010
11003F33q788P66O233m92j630k79n892q359k801K845J780k493o685M237R933R202
$$ plain form
11112 -24862 -18574 -12751 -15870 -6797 2665 9115 4632 2861 1419 1373 -5949 -13245 -12104 -9011 -6899
11097 -6899 -9237 -9753 -9824 -10100 -17309 -17339 -8360 -5120 -1250 3402 2707 3319 3672 3637 2334 1417 -1381 1323
11079 1323 654 -1994 164 -44 -9630 -30739 -44926 -44023 -37237 -35897 -22021 -803 2078 -2609
11065 -2609 1966 13133 19392 18637 14042 6083 -604 -653 -3958 -699 5385 8121 2306 3753 3863
11050 3863 1245 -3742 -1188 -5143 -5980 -11525 -20739 -20059 -13419 -10501 -2016 -1789 -4633 -6349 -6836 -3796
11034 -3796 -2458 -4334 -5253 -2149 241 -916 -3402 -3371 -3281 -2046 -3639 -12361 -13891 -7055 -8538 -2456
11018 -2456 6760 7740 291 -1283 -7278 -5197 -3044 -4500 -421 -5555 -4221 -1287 -2963 1643 633
11003 633 -8155 -7389 -1156 -1648 -3278 -3557 -9449 -17808 -20609 -17764 -15984 -18477 -25162 -20925 -10992 -1790
10987a790L65q31L529J124l758p148J392l059K449l309k774k491K611K177K782
10972h731M809N324k222k183QO348J09n631q65K644L676O558j393l058n566o182
10956f355n358P37Q085N77M070k764n289j013m49p939M8M659M22M008K166J046
10940c349n449J439n04p104N272j562j497N155M387k806K45q0j698J939N108J382
10924H78l756l450M259K196o939j748o23o56N14n402K135L284n268L840N54p133
10908a7315J05M373m9R936K672O673K803o890j0267j017M715l092k644K935J018
10893f044J528K799n487q072l354J084J551L268Q50P873K845p339l825j02L594
10878h831K891j012J513k569P97l216O42O862L447n462l963j119J174l597q805
$$ plain form
10987 -1790 -1425 -2256 1273 2397 -1361 -8509 -7117 -10176 -7727 -11036 -13810 -16301 -13690 -11513 -8731
10972 -8731 -3922 1402 -820 -3003 -2995 3353 3462 -2169 -3034 -390 3286 9844 8451 5393 -173 -6355
10956 -6355 -11713 -10976 -2891 -2314 1756 -1008 -6297 -7310 -7759 -15698 -15650 -10991 -10569 -6561 -4395 -3349
10940 -3349 -8798 -7359 -7863 -14967 -9695 -11257 -12754 -7599 -3212 -6018 -5773 -5853 -7551 -5612 -504 878
10924 878 -2878 -6328 -2069 127 -6812 -8560 -9183 -9839 -9325 -14727 -12592 -9308 -14576 -10736 -10182 -17315
10908 -17315 -17210 -12837 -12886 -2950 -278 6395 9198 2308 -7959 -8976 -4261 -7353 -9997 -7062 -6044
10893 -6044 -4516 -1717 -7204 -15276 -18630 -17546 -15995 -12727 -11877 -4004 -1159 -8498 -12323 -12425 -8831
10878 -8831 -5940 -6952 -5439 -8008 -7211 -10427 -9785 -2923 524 -4938 -8901 -10020 -8846 -12443 -21248
10863b1248l53l181M21Q378k252P393M917m99n71m391j939M400O65p201k954J553
10847a6862l10K004L976O462k959j733l028l309M791M151m34J342k969k963R811
10832b030M106p957k082O517n29L093l894m501N160N105N529J194m931r18O934
10817A0796K534n256k724m382q597k071N43Q458N85N811j010o156p5n237K601
10802d180J825k935K65M448k523N146Q399j6l936R030K643j0605m389n144N038
10787C066R786J33m082n230l871k28l529q915j965J507o0O922K075k929j112j445
10771i877n853m781o37j393N264N571k520O90M612K457L263j012m11M174k90r13
10755a656j231j615l894M458J672L219N867j129J562L532K574Q5n601o734m394
$$ plain form
10863 -21248 -21601 -24782 -24361 -15983 -18235 -10842 -5925 -6424 -6995 -11386 -13325 -8925 -8260 -15461 -18415 -16862
10847 -16862 -17172 -15168 -11192 -4730 -7689 -9422 -12450 -15759 -10968 -6817 -7251 -5909 -8878 -11841 -2030
10832 -2030 2076 -5881 -7963 -1446 -1975 1118 -2776 -7277 -2117 2988 8517 9711 4780 3862 10796
10817 10796 13330 8074 5350 968 -7629 -9700 -9157 -699 -114 5697 4687 -1469 -1544 -6781 -4180
10802 -4180 -2355 -5290 -5025 -577 -3100 2046 10445 10429 6493 15523 18166 7561 3172 -1972 3066
10787 3066 12852 12985 8903 3673 -198 -426 -3955 -12870 -14835 -13328 -13388 -6466 -4391 -7320 -8432 -9877
10771 -9877 -15730 -20511 -21148 -22541 -17277 -11706 -14226 -13536 -8924 -6467 -3204 -4216 -4627 -453 -743 -1656
10755 -1656 -2887 -4502 -8396 -3938 -2266 953 6820 5691 7253 10785 13359 13444 7843 1109 -3285
10740c285n21P088O508N216o436q411m22K87j1541K669Q304P618Q411n09q924
10725F052q139j097Q915L230p228K348K18n251r00k177j961N391O703J547q967
10710a316n405K583L61P09R6l775K042n263P33P754M815l398l18j257L975L453
10694E789n046M134m62m06J6j637l160p81L480n166j999j113N928p95M618N232
10678H632k935R89k265p44O414J86M169O908J829J957N05k911n489l381n983k037
10662E844K045L444l768Q62K959p262J399M530q32l968k202K997k373q857K19
10647d963o217q155K547R501L127k783m793K325K171p05j663P117L434K865L731
10632G539K219q495o026j029L941P92m596j473L123L093N550M253l051l973J986
$$ plain form
10740 -3285 -3806 3282 9790 15006 8570 159 -263 24 -11517 -8848 -544 7074 15485 14976 6052
10725 6052 -2087 -3184 5731 8961 1733 4081 4299 -952 -1852 -4029 -5990 -599 6104 7651 -1316
10710 -1316 -6721 -4138 -3777 -3068 -2972 -6747 -4705 -9968 -9235 -1481 3334 -64 -382 -1639 2336 5789
10694 5789 743 4877 4415 4009 4025 2388 -772 -1553 1927 -3239 -5238 -6351 -423 -1218 3400 8632
10678 8632 5697 6686 4421 3677 10091 10277 14446 21354 23183 25140 25645 22734 17245 13864 7881 5844
10662 5844 7889 11333 7565 8427 11386 4124 5523 10053 9221 5253 3051 6048 3675 -5182 -4963
10647 -4963 -11180 -19335 -16788 -7287 -4160 -6943 -11736 -9411 -7240 -7945 -9608 -2491 943 3808 7539
10632 7539 9758 1263 -4763 -5792 -1851 -1059 -5655 -7128 -4005 -912 4638 8891 5840 1867 3853
10617C853m266j994m0L540J621j626q55l12k2n95K322j067J484N126M333J186
10601A2688P027N113L031M130r59K934N413J2455R765J1683L6252N3082P7417
10588B40031J13822J41297J70016J70458J02660N045j19102j86920j83991j41617
10578C11699r6155o2201l9091k4087j8384j3294j2207j2413n292J596l914o365
10566A9892o617m362J218l083K356j198m531R6N17j445J743m060k604L918q27
10551A013k907J071M095K34k179N69M895m856K332O110p90r09K238K030m222r730
10535a006j342L904J925n291o584L062L572m43L673l103m015n07M117M003K844
10520D809J692o501m953m535J97k054o207R289J0006L439J782o987Q79o491k440
$$ plain form
10617 3853 -413 -2407 -2447 1093 2714 1088 233 -79 -101 -696 1626 559 2043 7169 11502 12688
10601 12688 19715 24828 27859 31989 31030 33964 39377 51832 61597 73280 109532 162614 240031
10588 240031 353853 495150 665166 835624 938284 943329 824227 637307 453316 311699
10578 311699 215544 153343 114252 90165 71781 58487 46280 33867 28575 30171 26257 19892
10566 19892 13275 8913 10131 7048 9404 8206 3675 3771 4288 2843 4586 526 -2078 1840 1013
10551 1013 -1894 -823 3272 3506 1327 1896 6791 1935 4267 10377 9587 8678 10916 12946 8724 -1006
10535 -1006 -2348 1556 3481 -1810 -8394 -5332 -1760 -2203 1470 -1633 -5648 -6155 -2038 1965 4809
10520 4809 6501 0 -4953 -9488 -9291 -11345 -17552 -8263 1743 5182 6964 -23 856 -5635 -8075
10505h075L546O36L862N249k064l466l393M314o73k494p941j381J730P002L693
10490E45L763L474j0244o675L478k681n222J364L399j974J587K987J507N97n316
10475i411M723L260J954k580m496K630L810M056K956l342j0196q266J439O252
10461g211M118l56K890Q180K472R8n729l799P03k869l804K504M340p90k681K20
10445a714K395M822k250k63l287P67P528M60j991l033j949o23K113J797l84j486
10429B902m073L363M324j792o589J272m209P7R2m538j009j055M226o031j064N348
10413h756k360l174m62K278o806j393O436K96J983k532j091O014O09k203l097
10398a4258n930J476R28O8q99k722P325M587n906k303N025N049j010P54J54k472
$$ plain form
10505 -8075 -4529 -3893 -31 5218 3154 -312 -3705 609 -64 -2558 -10499 -11880 -10150 -3148 545
10490 545 4308 7782 -2462 -9137 -5659 -8340 -13562 -12198 -8799 -10773 -9186 -6199 -4692 -4095 -9411
10475 -9411 -4688 -1428 526 -2054 -6550 -3920 -110 3946 6902 3560 -6636 -14902 -13463 -7211
10461 -7211 -3093 -3449 -559 7621 10093 10191 4462 663 1366 -1503 -5307 -2803 1537 747 -1934 -1714
10445 -1714 681 5503 3253 2990 -297 470 7998 8458 6467 3434 1485 862 2975 4772 4388 2902
10429 2902 -1171 2192 6516 4724 -1865 -593 -4802 -4725 -4633 -9171 -10180 -11235 -7009 -13040 -14104 -8756
10413 -8756 -11116 -14290 -14752 -12474 -19280 -20673 -14237 -13941 -11958 -14490 -15581 -9567 -8958 -11161 -14258
10398 -14258 -20188 -18712 -17784 -17716 -18615 -21337 -14012 -9425 -15331 -17634 -12609 -7560 -8570 -7816 -7662 -10134
10382a0134L273l26N07K758m302m419J0024P150J373J20p250l607p7M181O732
10367F003Q38j553k702q547j0091L708j765j5N511k222l88J798n778J349J543
10352a2311J949O148j757n07p052k585P68M216o143J849N576l139p46J718N920
10337f096j215n789q491L142Q098O493j981m715j653J293Q432k565r07L849K255
10322A50J06m930j294j778m9O667j751k778L946M448k680p641J182Q78N537l237
10306c224j0414k535L687L308P295K408M45K254k524k635n001O481K384n424m04
10291c899q087l84J810K130L331P40j362r57N35n70p205R03N390k49J001N581
10275a292J38r83M838Q185K593q714p245m976J608K610J588m700J426L477m260
$$ plain form
10382 -10134 -6861 -7187 -6680 -3922 -8224 -12643 -2619 4531 5904 6024 -1226 -4833 -4910 -729 6003
10367 6003 6841 5288 2586 -5961 -16052 -12344 -14109 -14124 -8613 -10835 -11223 -9425 -15203 -13854 -12311
10352 -12311 -10362 -4214 -5971 -6478 -13530 -16115 -15347 -11131 -17274 -15425 -9849 -12988 -13734 -12016 -6096
10337 -6096 -7311 -13100 -21591 -18449 -10351 -3858 -5839 -10554 -12207 -10914 -2482 -5047 -5954 -2105 150
10322 150 256 -4674 -5968 -7746 -7795 -1128 -2879 -5657 -1711 2737 57 -7584 -6402 -5524 13 -3224
10306 -3224 -13638 -16173 -12486 -9178 -1883 525 970 3224 700 -1935 -6936 -455 1929 -3495 -3899
10291 -3899 -11986 -12370 -10560 -8430 -5099 -4359 -5721 -6678 -6143 -6713 -13918 -13015 -7625 -7874 -6873 -1292
10275 -1292 -1154 -2137 2701 10886 13479 4765 -2480 -7456 -5848 -3238 -1650 -6350 -4924 -1447 -5707
10260e707J227J055k146q77M591j660l262M218M966M620k028M43J0605J349O01
10245A7995o681p390K297J102k998J073J479Q95K828N116P89j510k218m481o22
10230G674l518R38L562o268n698J847m421l997O209O860r3K712N206k495j222
10215G296n548p61J509j987k802K540J101p08n293o985N312o47J608L800N932
10200D367L63L693l515p710p184J624j519l641o7P213J3808P524j680j181o369
10185E726p458o834m78O802n84O92l786m370M961P173l769o34K77k657J764k69
10169c444m649k212O218O979k066M47M76l491k915M79K077p593J935J1312P283
10154A0836M712m484r342j0452m644K979K178J672O245r60l115P23J142Q822M634
$$ plain form
10260 -5707 -4480 -3425 -5571 -6448 -1857 -3517 -6779 -2561 2405 7025 4997 5440 16045 17394 17995
10245 17995 11314 3924 6221 7323 4325 5398 6877 7772 10600 15716 16505 14995 12777 8296 7674
10230 7674 4156 5094 8656 2388 -3310 -1463 -5884 -9881 -3672 3188 3095 5807 11013 8518 7296
10215 7296 1748 987 2496 509 -2293 247 1348 640 -4653 -11638 -6326 -6973 -5365 -1565 4367
10200 4367 4730 8423 4908 -2802 -9986 -8362 -9881 -13522 -13589 -6376 7432 14956 13276 12095 5726
10185 5726 -1732 -8566 -9044 -2242 -2826 -2134 -5920 -10290 -5329 1844 -1925 -2559 -2282 -4939 -3175 -3444
10169 -3444 -8093 -10305 -4087 2892 826 1273 1749 -1742 -4657 -4178 -2101 -9694 -7759 3553 10836
10154 10836 15548 11064 1722 -8730 -13374 -10395 -8217 -6545 -300 -1260 -4375 -3652 -2510 6312 10946
10139A0946m688j000j125N668m33o750n992r45K400o156l351P25M339M547K837
10124A022P481n030j745l409J278l217r346o250L913N120M789K165m78n934K635
10109g006N87M617N208K418Q68l120k351P134L368l287R27N408j2290l541L058
10094A998J120N563K154m539m247L909R310M723k016K815L986M276L032j627J279
10079C1736n565l617j335n90p669p604k167K592k706n546p487P316L232q97k06
10064e13J347n663j09J122j022N850M436l998m964L780l79J638Q835N519L020
10049A8899l167j352J463M447j342m967j372J076m177r840l683L651k660k700
10035e724j330J990J441P241K344m30J294j93J746m302j0695k965N914k904k051
$$ plain form
10139 10946 6258 5258 4133 9801 9368 2618 -3374 -4319 -1919 -8075 -11426 -10701 -6362 -1815 1022
10124 1022 8503 3473 1728 -1681 -403 -3620 -12966 -19216 -15303 -10183 -5394 -3229 -3707 -9641 -7006
10109 -7006 -6419 -1802 3406 5824 6692 3572 1221 8355 11723 8436 9363 14771 2481 -1060 1998
10094 1998 3118 8681 10835 6296 2049 5958 15268 19991 17975 20790 24776 29052 32084 30457 31736
10079 31736 26171 22554 21219 20629 12960 5356 3189 5781 3075 -2471 -9958 -2642 590 -307 -513
10064 -513 834 -4829 -4938 -3816 -4838 1012 5448 1450 -3514 266 -113 1525 10360 15879 18899
10049 18899 15732 14380 15843 20290 18948 13981 12609 13685 9508 -332 -4015 -364 -3024 -5724
10035 -5724 -7054 -5064 -3623 3618 5962 5532 6826 6633 8379 4077 -6618 -9583 -3669 -6573 -8624
10020h624j182j686M27N70N023O803K666n715l92P347r35n479k529J776m122l075
10004i127m570O88l16J051K370O027L783n890n507N339O779O37L122p75P63l752
9988F22l478p80K1K273J931J789k400J606O71N216l787o478j378k599O02J181
9972d988L04J072m210m757p83J756M409j437j831M773K915m247n327K595l167
9957a2923L91j327J884L556k258P53K042P584O392l124m176o679M126K863J464
9942E68n507k295R41N82Q465n82m186n45J432J846J210o445l832M401j750n11
9926f208o961M93M935M670k023K709K647j761l832l501M915J590l954N126L441
9911B286J644n902q593m936P114R160j46l275j454Q46k39J780K790M214O316J734
$$ plain form
10020 -8624 -9806 -11492 -11065 -10495 -5472 1331 3997 -1718 -2110 5237 4302 -1177 -3706 -1930 -6052 -9127
10004 -9127 -13697 -13009 -13325 -12274 -9904 -3877 -94 -5984 -11491 -6152 627 1264 4386 3611 4374 622
9988 622 -2856 -3636 -3615 -1342 589 2378 -22 1584 2255 7471 3684 -2794 -4172 -6771 -6169 -4988
9972 -4988 -4684 -3612 -7822 -12579 -13362 -11606 -7197 -8634 -10465 -5692 -2777 -7024 -12351 -9756 -12923
9957 -12923 -12532 -13859 -11975 -8419 -10677 -9924 -7882 -298 6094 2970 -1206 -7885 -3759 -896 568
9942 568 -4939 -7234 -6293 -5711 2754 2172 -2014 -2559 -1127 719 1929 -4516 -8348 -3947 -5697 -6208
9926 -6208 -13169 -12676 -7741 -3071 -5094 -2385 262 -1499 -5331 -8832 -3917 -2327 -6281 -1155 2286
9911 2286 3930 -1972 -10565 -15501 -8387 773 627 -2648 -4102 -3256 -3495 -1715 1075 5289 11605 13339
9895A3339l157q532n3n283r71m332m272q97J1548l243k691M90p91Q403k409m001
9879f852p374j212J0606J829L136l137K2j735m536p200m536J0288L457K532K80
9864d432j821p4m112m690L163L520R731O2r860l18j21k811P44r202J407J083K565
9847a5166K228K323N524q21O597j093m557k60M244p97o95L606j883q708j784j448
9831a2690N999O021L507P145R53m092R52k675J77J163K959m509n498L366j970
9816H08o371k843p67L797j244L342M234k598l724m596k978L271k28l710L02J251
9800a2054J819l920L179K81L621M695L351m379o181k320n668j898O17L047L351
9785a2459n428q510o339J2666P636P151Q210n8p263j262J23P631p96l733J665
$$ plain form
9895 13339 10182 1650 1597 -3686 -4657 -8989 -13261 -14158 -2610 -5853 -8544 -8054 -8845 -442 -2851 -6852
9879 -6852 -14226 -15438 -4832 -3003 133 -3004 -2982 -4717 -9253 -16453 -20989 -10701 -7244 -4712 -4432
9864 -4432 -6253 -6327 -10439 -15129 -11966 -8446 1285 1347 -8513 -8831 -8952 -11763 -11019 -20221 -18814 -17731 -15166
9847 -15166 -12938 -10615 -5091 -5912 685 -408 -4965 -5225 -981 -1778 -2473 1133 -750 -9458 -11242 -12690
9831 -12690 -6691 -670 2837 9982 10935 6843 7795 5120 5297 6460 9419 4910 -588 2778 808
9816 808 -5563 -8406 -9173 -5376 -6620 -3278 956 -1642 -5366 -9962 -12940 -9669 -9897 -13607 -13305 -12054
9800 -12054 -10235 -14155 -10976 -10695 -7074 -2379 972 -3407 -9588 -11908 -17576 -19474 -18857 -15810 -12459
9785 -12459 -17887 -26397 -32736 -20070 -12434 -5283 2927 2869 -4394 -5656 -5533 2098 1302 -2431 -766
9770g66O89k193j672K11J590J640O83m757o066m795j227J119Q03L469N202l5J59
9753e946k106p287J120Q508O129k857o660Q548q66p2J413R54M089j831q139M628
9737c75l209j567N852M361j914j853p885m798L641o074n473R032O849M846J273
9722B706k129o131m343M65k273R376O03p21O05K85J60K433l215l957L600m864
9706g400j190M19L814N031n781p763K560J782K871L865l196o966M630P827q751
9691h248p245J174K089M429L11N338k849M25n622k191M891J768n0L33m132j554
9675a1133K483M321o608j147P499r29p77M693K318R5O356k757L261q39j327m331
9659A178k871m370q269L244K699k570n170J667m449K026N545K333R348R273l423
$$ plain form
9770 -766 -77 -2270 -3942 -3731 -2141 -501 182 -4575 -10641 -15436 -16663 -15544 -14741 -11272 -6070 -6105 -5946
9753 -5946 -8052 -15339 -14219 -5711 418 -2439 -9099 -551 -1417 -1489 -76 878 4967 3136 -5003 -375
9737 -375 -3584 -5151 701 5062 3148 1295 -6590 -11388 -7747 -13821 -19294 -10262 -3413 1433 2706
9722 2706 577 -5554 -9897 -9432 -11705 -2329 -1726 -2447 -1842 -1557 -1397 1036 -2179 -6136 -2536 -7400
9706 -7400 -8590 -8171 -4357 674 -5107 -12870 -10310 -8528 -5657 -1792 -4988 -11954 -7324 503 -8248
9691 -8248 -15493 -14319 -12230 -7801 -7490 -2152 -5001 -4576 -10198 -12389 -7498 -5730 -5780 -5447 -9579 -11133
9675 -11133 -8650 -4329 -10937 -12084 -4585 -5514 -6291 -1598 720 815 7171 4414 7675 6836 5509 1178
9659 1178 -1693 -6063 -14332 -11088 -8389 -10959 -16129 -14462 -18911 -16885 -11340 -9007 341 9614 6191
9644F191J201n374q25m65P63J372J565r780n206M497R08k385j211j878O193L876
9628e58m099l351j0079M817P784N888N635l527q708L906M31J647r54j033m116
9613f317m29J481l399l794O361P272L154k870P36L839j415j050r173M069m266
9598e801q838m522N594R23K120l115j805K629R652L624q233l323j41k250O218
9583g268M467o031N852k622p002L75l139k794K440K58O716M41L008K336l022q350
9567a4335L288Q570K681o81n85k410k094k17m660K902N627P47L270m411j732L357
9551f83k835l715P05l992p747L151Q911q28K243j116n664k119J1622M857Q933
9536A1723k1k58O97m303o176k884r3o078K781L04K643j143j098m088k327p135
$$ plain form
9644 6191 7392 2018 1193 728 1491 2863 4428 -5352 -10558 -6061 -5153 -7538 -8749 -10627 -4434 -558
9628 -558 -4657 -8008 -18087 -13270 -5486 402 6037 2510 -6198 -2292 -1861 -214 -1168 -2201 -6317
9613 -6317 -6746 -5265 -8664 -12458 -6097 1175 4329 1459 2195 6034 4619 3569 -5604 -1535 -5801
9598 -5801 -14639 -19161 -13567 -12644 -10524 -13639 -15444 -12815 -3163 461 -7772 -11095 -11236 -13486 -7268
9583 -7268 -2801 -8832 -2980 -5602 -12604 -12229 -15368 -18162 -15722 -15464 -8748 -8307 -5299 -2963 -5985 -14335
9567 -14335 -11047 -2477 204 -477 -1062 -3472 -5566 -5783 -10443 -7541 -1914 -1167 2103 -2308 -4040 -683
9551 -683 -3518 -7233 -6528 -10520 -18267 -15116 -6205 -7033 -4790 -5906 -11570 -13689 -2067 2790 11723
9536 11723 11702 11444 12141 7838 1662 -1222 -1315 -7393 -4612 -4308 -1665 -2808 -3906 -7994 -10321 -17456
9520a7456K501Q820J683N03L365o222l313k016L719N515N728k994q317j503r92
9505a0979M327o0m762j210M570p67K63K669j886K368P400o96l577L362J777n540
9489b741l221k150J164l445m133O320L241M44P26j175P655L247J146k600q574
9474d096M644K591L206N348j088j857l994n435J459K737n508j135j896m156j90
9459i370R50J85j843j014M204K747L45O342K259o376n904L110o53l364k521Q732
9443b171O736k34l962q222l356K081L017k405j888k564M274q89M346k563p77R583
9427A006jK082O536N207P98N933q83l750n182q082k710m057n66L064J854k050
9411h01m223k322L157r3K975n9n644l296M336K834J475K929L202J627k546k29
$$ plain form
9520 -17456 -14955 -6135 -4452 -3949 -584 -6806 -10119 -12135 -8416 -2901 2827 -167 -8484 -9987 -10979
9505 -10979 -6652 -6712 -11474 -12684 -8114 -8881 -8618 -5949 -7835 -5467 1933 1237 -2340 1022 2799 -2741
9489 -2741 -5962 -8112 -6948 -10393 -14526 -8206 -4965 -4521 -3795 -4970 2685 5932 7078 4478 -4096
9474 -4096 548 3139 6345 11693 10605 8748 4754 -681 778 3515 -1993 -3128 -5024 -9180 -9370
9459 -9370 -8420 -8235 -10078 -11092 -6888 -4141 -3796 2546 4805 -1571 -7475 -4365 -5018 -8382 -10903 -2171
9443 -2171 4565 4331 369 -7853 -11209 -9128 -6111 -8516 -10404 -12968 -8694 -9583 -5237 -7800 -8577 1006
9427 1006 1005 3087 9623 14830 15628 21561 20678 16928 11746 3664 954 -3103 -3669 -605 1249 -801
9411 -801 -5024 -7346 -4189 -4282 -1307 -1366 -7010 -10306 -5970 -3136 -1661 1268 4470 6097 3551 3322
9395C322J908J647R899j416n762k816j212J952K256j528j654k886N1K692k772
9380C681n496Q60L447L444L117k338k681K132O52j058M123M252K784O08p654p19
9364I154L390q577r102J214K343q418L838O458P98L839P69p407o162M432O311
9349B880K015M568j1k89m5k121l256k47k259n396k011Q56J0045N666J937m10q51
9332A1071J84N074q28r684j4791l783J0856L285J557j350R55L371N122j252k624
9317G163k019k629n920o07P749m4p518J540J0920m668j537M043R13j396J170o274
9301H86j661N496N549l937j462K209N771k739o15l257m972Q371J41k104J944m55
9285I165J944J27N23N333p82l258m131K482K86J396p8k306n89l263k924N454k136
$$ plain form
9395 3322 5230 6877 16776 15360 9598 6782 5570 7522 9778 8250 6596 3710 3761 6453 3681
9380 3681 -1815 -955 2492 5936 9053 6715 4034 6166 6818 5760 9883 14135 16919 17527 9873 9154
9364 9154 12544 3967 -5135 -3921 -1578 -9996 -6158 300 1098 4937 5706 -1701 -7863 -3431 2880
9349 2880 4895 9463 9452 9163 9118 6997 3741 3494 1235 -4161 -6172 -5316 4729 10395 12332 11922 11071
9332 11071 11255 16329 15501 5817 -8974 -12757 -1901 1384 2941 1591 2546 5917 11039 9787 7163
9317 7163 5144 2515 -3405 -4012 3737 3693 -3825 -2285 8635 3967 2430 6473 7386 5990 7160 886
9301 886 -775 4721 10270 6333 4871 7080 12851 10112 9497 6240 1268 9639 9780 7676 9620 9165
9285 9165 11109 11236 11759 17092 16310 13052 8921 11403 11689 13085 13007 10701 10112 6849 3925 9379 7243
9268G243k372l513j664L351m006P433P142J93m287J1032O105P5p900q789l246
9253F797l680n711Q732k109k721l03N122J0085L85m162j321J678M189K273n561
9238A3693n044P22J1477N660l302k93L689j478r762o422R01n364m575m37J489
9223I54P826l77K468Q298j853r27p243l787L139P24O82M73K41m827j188n218M093
9206C478M791N15M65K963n401K259Q576N740N512R82K467m011l679k213k188K49
9190B0505J82K145m91m27o825J576M218O967l893l805N774N623m749l343j155
9175B2302P151M124n781N96P631k452J548L680J595q512q864j164O686N528J74
9160C4242K155K920L296O703R580J511k497k359J562N509N024J3435K1524J5239
$$ plain form
9268 7243 4871 1358 -306 3045 -961 6472 13614 13807 9520 20552 26657 26732 18832 10043 6797
9253 6797 3117 -2594 6138 4029 1308 1005 6127 16212 16597 12435 11114 12792 16981 19254 13693
9238 13693 8649 9371 20848 26508 23206 22913 26602 25124 15362 8940 9841 4477 -98 -535 954
9223 954 8780 8403 10871 19169 17316 16389 9146 5359 8498 9222 9904 10377 10618 5791 4603 -615 3478
9206 3478 8269 8784 9249 12212 6811 9070 17646 23386 28898 29880 32347 28336 24657 22444 20256 20505
9190 20505 20687 22832 22341 21914 15089 16665 20883 27850 23957 20152 25926 31549 26800 23457 22302
9175 22302 29453 33577 27796 28392 36023 33571 35119 38799 40394 31882 23018 21854 28540 34068 34242
9160 34242 36397 39317 42613 49316 58896 60407 57910 55551 57113 62622 67646 81081 102605 117844
9146A17844J0283J1704P736K3489K4626L2144M0326M8359P0260J05818J61857
9135F54446K63436M44308P20157J038018J224901J249277J097437n1363j980957
9126D659660j785809j049991n85769l40477k12299j33683q8603o8006o2801m4480
9116B87742l4902k1754j9802k4837j7404j7599j0372n915k890q293l569j0482
9104A09923o913n350q312l764K889p006j701n003p77N642p81k694q059n025k325
9089F0744m806M37q14m010m519n981j923k695O0M176p218N403m901l760O701K713
9073C9607o551o915k331o242q085O172K516k662K405M874L750k381j994k729k550
9058A6884k554j204M926Q9m306j916m427p54J587K287M597J458j0104n038P23
$$ plain form
9146 117844 128127 139831 147567 171056 195682 227826 268152 316511 386771 492589 654446
9135 654446 917882 1362190 2082347 3120365 4345266 5594543 6691980 6640617 4659660
9126 4659660 2873851 1823860 1238091 897614 685315 551632 463029 395023 332222 287742
9116 287742 252840 231086 211284 186447 169043 151444 141072 135157 132267 123974 120405 109923
9104 109923 103010 97660 89348 85584 88473 81467 79766 74763 73986 79628 78847 76153 68094 63069 60744
9089 60744 55938 56375 55561 51551 47032 41051 39128 36433 36493 40669 33451 38854 33953 30193 36894 39607
9073 39607 33056 26141 23810 17568 9483 15655 18171 15509 17914 22788 26538 24157 22163 19434 16884
9058 16884 14330 13126 18052 18141 13835 11919 7492 6738 8325 10612 15209 16667 6563 1525 2248
9043B248J670L82l81l241n56J581L981M152K330l082k720K244l811p41J347k900
9027B503l13O929J029M440j757k753m246l972j236N898L32m75L665q9M11J748
9011A2114K705l996m441l868K828m73j183L01J975m27r11L287M115o962l084o675
8995d695p348O225R551P634j221j778M006N179o10m636o896k937j114P91K23p011
8979d637k678J320M30p772M718K652m032K629L772R36J567k028M425N219j215
8964E306l99j743M789J684K096P37n86j154j067r15q930J52P449N899L199p68
8948A5749j308o717J020j42J592o275j0754j668L419R68j723N20m15k504l578
8933a1816N966l988R74N819Q33M310m196n179R011N171k080o052k081j819j63
$$ plain form
9043 2248 3918 4300 3919 678 122 1703 5684 9836 12166 9084 6364 8608 4797 4056 5403 2503
9027 2503 2190 9119 10148 14588 12831 10078 5832 1860 624 6522 6854 6379 10044 9955 10366 12114
9011 12114 14819 10823 6382 2514 5342 4869 3686 3987 5962 5535 4624 7911 12026 5064 1980 -4695
8995 -4695 -12043 -5818 3733 11367 10146 8368 12374 17553 16943 12307 5411 2474 1360 2151 2374 -4637
8979 -4637 -7315 -5995 -5565 -13337 -8619 -5967 -9999 -7370 -3598 -2662 -1095 -3123 1302 6521 5306
8964 5306 4907 3164 7953 9637 11733 12470 11884 10730 9663 8748 -182 -30 7419 13318 16517 15749
8948 15749 14441 7724 8744 8602 10194 3919 -6835 -8503 -5084 -4116 -5839 -5319 -5734 -8238 -11816
8933 -11816 -5850 -9838 -8864 -3045 -2212 2098 -2098 -7277 1734 6905 4825 -1227 -3308 -5127 -5290
8918e290K096q63L620N889N182k178l298J964k515R16Q895M889K062J295N615
8903B8279l051j4166r260p338j910P649N150Q16k029k885k898k844M711q82K180
8888A522J346J567p350l514N031M380n299O377k03J408l154n825m206J089J368
8873e463M229K367oP201K943l919Q20P235N271L302L643J3049J0834O028n990
8858E1544j3096r773m281l538K016l889p852o788j609j65k639N630K887j1697
8844c250j1259O433J3395j472k833j125N249J302o245j959P82j99K759R59j882
8829F55M270J128n677K987m371q892k219P314Q794P101J66R572K664K88N013n204
8813B3589k659m711o988l306J317L687k490J060L969L385k415o742j006l808k961
$$ plain form
8918 -5290 -3194 -4057 -437 5452 10634 8456 5158 7122 4607 5523 14418 19307 21369 22664 28279
8903 28279 25228 11062 1802 -5536 -7446 203 5353 6169 4140 1255 -1643 -4487 224 -658 1522
8888 1522 2868 4435 -2915 -6429 -1398 2982 -2317 4060 3857 5265 2111 -3714 -7920 -6831 -5463
8873 -5463 -1234 1133 1127 8328 11271 7352 8172 15407 20678 23980 27623 40672 51506 57534 51544
8858 51544 38448 28675 24394 20856 22872 18983 11131 4343 2734 2569 -70 5560 8447 -3250
8844 -3250 -14509 -8076 5319 3847 1014 -111 5138 6440 195 -1764 -982 -1181 1578 2537 655
8829 655 4925 6053 376 3363 -1008 -9900 -12119 -4805 3989 11090 11256 20828 23492 23780 28793 23589
8813 23589 20930 16219 9231 5925 7242 10929 8439 9499 13468 16853 14438 7696 6690 2882 -79
8798g9k919K06K022j501J767K608J309K442j593n316M536N813P763m437L0l18
8782A2333K467L75l513m788l178O760L351j200j884o032j74N714j526n357l922
8767e74k132O046M070P13J424l663K222M892J855M855J204L235r796L812K78o823
8751A1618M156P167N294N824K073k058r391r880J721L899L744J031l546K71J271
8736B3194J936J609k684j0776m81m18K664L603L319J1138R786k367j8314q587
8722A3622L54L883j693P083K618k257p897o82N820Q051J3259J2952Q000J502m710
8707E9905j1929j4937q031J625p923k77j491j448J191m493M375j84j001J2361
8693B7743N848J203Q423L205p833l551M849M241L298j466l889p373l709J193P769
$$ plain form
8798 -79 -2998 -2792 -770 -2271 -504 2104 3413 5855 4262 -1054 3482 9295 17058 12621 12651 12333
8782 12333 14800 15175 11662 6874 3696 10456 13807 12607 10723 4691 4517 10231 8705 3348 -574
8767 -574 -2706 3340 7410 8123 9547 5884 8106 12998 14853 19708 20912 24147 14351 18163 18441 11618
8751 11618 15774 22941 28235 34059 36132 34074 24683 14803 16524 20423 24167 25198 21652 21923 23194
8736 23194 25130 26739 24055 13279 12798 12380 15044 18647 21966 33104 42890 40523 22209 13622
8722 13622 13976 17859 16166 23249 25867 23610 15713 15031 20851 28902 42161 55113 63113 64615 59905
8707 59905 47976 33039 25008 26633 18710 18433 16942 15494 16685 12192 16567 16383 15382 27743
8693 27743 33591 34794 43217 46422 38589 35038 39887 44128 47426 45960 42071 34698 30989 32182 39951
8678C9951M545K423m36l65K346n876r235q20j020N37o125J075K815K491J229Q103
8662D1638l757o755n405l348q064M697P235l409k225M711J2171O808k4k068L234
8647D5439L659l391n634p660o946M07k979o549K720Q661O042J2914J0645J816
8633E9144O462P20n460M110L983M172l823P667J4309P245O82L301L625M85k644
8618A03978j863q560p791r737o568n261r920n760p023n120m75L119j061n75q96
8603C6487m580L4Q34j878n848j640J268m812q613O453Q470o328o842N586J425
8588B0016k313N706n60o982o016L162M265K310k861k794L943l118P02L836k524
8573A6772P01N718k659j274J933N419Q13J131M65J885l203q07K167o531j0726
$$ plain form
8678 39951 44496 46919 46483 46118 48464 42588 33353 32533 31513 32050 25925 27000 29815 32306 33535 41638
8662 41638 37881 31126 25721 22373 14309 19006 26241 22832 20607 25318 37489 44297 44273 42205 45439
8647 45439 49098 45707 40073 32413 25467 25874 22895 16346 19066 27727 33769 46683 57328 59144
8633 59144 65606 66326 60866 64976 68959 73131 69308 76975 91284 98529 99211 102512 106137 106622 103978
8618 103978 102115 93555 85764 76027 69459 64198 54278 48518 41495 36375 35900 39019 37958 37383 36487
8603 36487 31907 31941 32775 30897 25049 23409 24677 19865 11252 17705 26175 19847 13005 18591 20016
8588 20016 17703 23409 22849 15867 9851 13013 17278 19588 16727 13933 17876 14758 15460 19296 16772
8573 16772 17473 23191 20532 19258 21191 26610 27423 28554 29019 30904 27701 26894 29061 22530 11804
8558A1804O050o965m894k186j791N087P52M670K426k86K444q6n64n052l459O324
8542A4274l813n319M151Q003q91p326K984L593n291q313J023r03J627o13L578
8527F764J941N08J16J293O49J915O172N50O249l147n949P611O947M689O118P17
8511D3143n1J1835J6031n273j4843r094r196n850l180P58P20n327j203k220R58
8496A7208k31l809j846j097L306N215k989q468l492M080M696L583n420n201N905
8481A1440R695k189n45m294J0789K809L704K575P047J954O550M382j469q502j4363
8466B9583j0768r640K84j929J889K960M9j509k491l977N516L472J413j59l674
8451A1019l08j790K786j107l001m662k183l670J827L911l640L641K671l861J439
$$ plain form
8558 11804 17854 10889 5995 3809 2018 7105 7857 12527 14953 14667 17111 17025 16461 11409 7950 14274
8542 14274 10461 5142 9293 17296 16405 9079 12063 15656 10365 2052 3075 2172 3799 3186 6764
8527 6764 8705 9213 9329 10622 11271 13186 19358 19908 26157 23010 17061 24672 31619 36308 42426 43143
8511 43143 43092 54927 70958 65685 50842 41748 32552 26702 23522 24280 25000 19673 18470 16250 17208
8496 17208 16977 13168 11322 10225 13531 18746 15757 7289 3797 7877 12573 16156 10736 5535 11440
8481 11440 21135 18946 18401 14107 24896 27705 31409 33984 41031 42985 49535 53917 52448 43946 29583
8466 29583 18815 9175 9459 7530 9419 12379 12428 10919 8428 4451 9967 13439 14852 14693 11019
8451 11019 10711 8921 11707 10600 7599 2937 754 -2916 -1089 2822 -818 2823 5494 1633 3072
8436C072N308m145k811j610J429j088l795L875M473L121n798m245l27L684R99
8421B142m047L331l715N200J415l776J0062J1746l574m565p777j974L740o203
8407B005N465J995n886L83J490o010N629L712J578l245n809N22K937k11j46M21
8391D830J217R45J757k15L153P19L636K762K036k331P339Q06m034k933r769k263
8375G655N283Q76o334j050m355p108l648J427N770J2445Q159r574j053q036m116
8360c659j321J830j209m409J287J617j525L943J0144N094l026m688j1779J667
8346f034P385N838n193k334P855j840n289J380O544j28j705o280M04K200n05k049
8330B49N804P380J102n434m984n690p722K160M713L808n977o404m79L529l929
$$ plain form
8436 3072 8380 4235 1424 -186 1243 155 -3640 235 4708 7829 2031 -2214 -2541 1143 2142
8421 2142 -1905 1426 -2289 2911 4326 550 10612 22358 18784 14219 6442 4468 8208 2005
8407 2005 7470 9465 3579 3962 5452 -558 5071 8783 10361 7116 1307 1829 4766 4555 4409 4830
8391 4830 6047 6992 8749 8534 11687 12406 16042 18804 20840 18509 25848 26654 22620 19687 9918 7655
8375 7655 12938 13814 7480 6430 2075 -5033 -8681 -7254 -1484 10961 19120 9546 8493 457 -3659
8360 -3659 -4980 -3150 -4359 -8768 -7481 -5864 -7389 -3446 6698 11792 8766 4078 -7701 -6034
8346 -6034 1351 7189 1996 -338 7517 5677 388 1768 8312 8184 6479 199 603 2803 2298 249
8330 249 6053 13433 14535 9101 4117 -1573 -9295 -7135 -2422 1386 -4591 -10995 -11474 -7945 -11874
8315a1874n755L397M205N129k845n057m504k423K550L310P791j906m453L329L156
8300e950N133N488m098j865J774O091N578q30o074n38k357m151q135L210J430
8285e294M580j735l32K401n75l859l751k69J498M886Q63o385L707L82R037j369
8269C785J738N705j65m72l407j1957L6N842k283j0617k636P666Q147J362j854
8254H90M380L643o168p850M693o34m84N88q57O132N880j772l563M43N626L750
8238A4697k160n987l43L555n915p324l711k338M671J915L907j132k287J503k632
8223c581n610J938K260N632R11L704N91j583l091p950r601M474J0614K121l533
8208b704k610K333M595j224J816L999K671K618l181q3O651N068p354o686q78N196
$$ plain form
8315 -11874 -17629 -14232 -10027 -4898 -7743 -12800 -17304 -19727 -17177 -13867 -6076 -7982 -12435 -9106 -5950
8300 -5950 -817 4671 573 -1292 482 6573 12151 11321 5247 4709 2352 -1799 -9934 -6724 -5294
8285 -5294 -714 -2449 -2781 -380 -955 -4814 -8565 -8834 -7336 -2450 -1587 -7972 -4265 -3883 5154 3785
8269 3785 5523 11228 11063 10591 7184 -4773 -4737 1105 -1178 -11795 -14431 -6765 1382 2744 890
8254 890 5270 8913 2745 -5105 -412 -1046 -1530 -942 -1799 4333 10213 8441 4878 5321 10947 14697
8238 14697 12537 6550 6207 9762 3847 -3477 -7188 -9526 -4855 -2940 967 -165 -2452 -949 -3581
8223 -3581 -9191 -7253 -4993 639 1550 5254 5845 4262 1171 -6779 -16380 -11906 -1292 829 -2704
8208 -2704 -5314 -2981 1614 390 2206 6205 8876 11494 8313 8230 14881 19949 12595 5909 5031 10227
8192A0227M80l706N891K581o041m278o747K878L624p56K687M045j484k942k947
8177C512K867P65L062m077l296L361j628K241M085M395P332oq829m293R11l345
8161G057L90M128r65o872r33J505l263j032J340r02n19J568o63j882j91L726N517
8144H009k733l544m595N213j367l479Q430L183l655L008q46l552N485o839l076
8129c58M10M186J0129N911N040k039O053J835O786N196k149l702n412o372r968
8114A5546m178k232P88L198M611L069l15j571O565m709r879K297j165k928o079
8099C018j715L412Q156N2k908q820j108j990N135K381L903K678R18L349P115N537
8083B9113R37m824j576M937O671M246j370N625n214q103M365J584K886j465R12
$$ plain form
8192 10227 10707 7001 12892 15473 9432 5154 -1593 1285 4909 4153 6840 10885 9401 6459 3512
8177 3512 6379 7144 10206 6129 2833 6194 4566 6807 10892 15287 22619 22613 13784 9491 10402 7057
8161 7057 7447 11575 10610 3738 2805 4310 1047 15 1355 453 -66 1502 839 -1043 -1234 2492 8009
8144 8009 5276 1732 -2863 2350 983 -2496 5934 9117 5462 8470 7624 4072 9557 2718 -358
8129 -358 52 4238 14367 20278 25318 23279 29332 31167 37953 43149 41000 37298 31886 25514 15546
8114 15546 11368 9136 9924 13122 17733 20802 20487 18916 25481 20772 10893 13190 12025 9097 3018
8099 3018 1303 4715 12871 12923 10015 1195 87 -1903 3232 5613 9516 12194 13112 16461 23576 29113
8083 29113 30050 25226 23650 28587 35258 39504 38134 43759 38545 30442 34807 36391 39277 37812 38724
8068C8724j36k386l65K181n131l746J816m401k585J902o527J501Q903O846Q73
8053C7469O986k121k660k737Q40j204l329o813l609P785n544p501N200L778M183
8038C0723l68L354K116J163Q580K501k381K316L132q860N479L876L380J2219Q080
8023G5310O802N865J223k965n077k293K954n218p724j2517l045n492P40L04n270
8008D3597m24o53Ql910O87j465o054p405k166p37L508j290l425M194J153K98l75
7991B5541j092L025M30l027O429n49j503K673k372l948J329N474k774J170L634
7976C4440L073Q406n14k282r097q970j268N839J474m494l244n372j490j310l107
7961A2084l576j097Q4l553k49N153O73N393O736J741j799o281r948l007R391P763
$$ plain form
8068 38724 38588 36202 35837 38018 32887 29141 30957 26556 23971 25873 19346 20847 29750 36596 37469
8053 37469 44455 42334 39674 36937 37777 36573 33244 26431 22822 30607 25063 17562 22762 26540 30723
8038 30723 30355 33709 35825 36988 45568 48069 45688 48004 51136 42276 47755 51631 55011 67230 75310
8023 75310 82112 87977 89200 86235 81158 78865 81819 76601 68877 56360 53315 47823 48563 48867 43597
8008 43597 43173 42520 42528 38618 39305 37840 31786 24381 22215 21478 24986 23696 20271 24465 25618 25916 25541
7991 25541 24449 27474 27904 24877 31306 30757 29254 31927 29555 25607 26936 32410 29636 30806 34440
7976 34440 37513 45919 45405 43123 34026 25056 23788 29627 31101 26607 23363 17991 16501 15191 12084
7961 12084 8508 7411 7495 3942 3693 8846 9519 14912 21648 23389 21590 15309 5361 2354 11745 19508
7945A9508n632k541N481p87k959k888o39M138j798P58o720k138n113N763j207
7930C226m556l729k75N394M06L925L402L201m633j971j092M966J34m108p54L259
7914F795R637m2k909K41N10m579o601m36L274j455j010p327m004O802P073j954
7898D015m998l723N646R855L450L322j757l408n401l796o311K396Q824k978m904
7883B32N74k717J146K517K325M725n812N288l020q101N111K776m61n322q679k236
7867a1654K931N136K583P356N475m153N355L877j7232o830j70K575M530J0223
7853A0002o41l560r781N81J1433N169k026l999j286m675n286L202P634L441o064
7838D144p411l998m856m482R39O042O735P513r4o201J233K238Q57n02J945m104
$$ plain form
7945 19508 13876 11335 16816 16029 13070 10182 9543 13681 11883 12641 5921 3783 -1330 4433 3226
7930 3226 -1330 -5059 -5334 60 466 4391 7793 10994 6361 4390 3298 8264 8398 4290 3536 6795
7914 6795 16432 16390 13481 13722 14232 9653 3052 2616 5890 4435 3425 -3902 -7906 -1104 5969 4015
7898 4015 -983 -4706 940 10795 14245 17567 15810 12402 7001 3205 -3106 -710 8114 5136 232
7883 232 806 -1911 -765 1752 4077 8802 2990 8278 5258 -2843 2268 5044 4583 -739 -9418 -11654
7867 -11654 -8723 -3587 -1004 6352 11827 7674 13029 16906 -326 -7156 -7326 -4751 -221 10002
7853 10002 9361 5801 -3980 -3399 8034 13203 11177 7178 5892 1217 -4069 -867 6767 10208 4144
7838 4144 -3267 -7265 -12121 -16603 -15664 -9622 -2887 4626 4532 -1669 -436 1802 2659 2157 4102 -2
7822bj85l40J244K363j975J885M10q738P838K413n411k184J976l549k60O198P934
7805I617P105n010r525j2993p58M148N171L83K905l39n346p103K026j434L34K275
7789h544Q95N187K607k792j060J511K433J162K137k41k018M202n480j931L299
7774A367m048n399L943P884j852j612L227J925o306Q33n655n674P54L191K89l76
7758g509M910o503p69M886R55j937m67l92p929n606N733Q917k845l454j103O242
7742f871J0552j0253m111J2462J1251j317j1382n148Q142J41k43m346Q92k03o01
7727a035l646L73l154J278L640o217k537L071N820M389j805o376K213p31J108
7712c609L294L681L418l151n361L33M157n253J686N605n227n565l219L949Q017
$$ plain form
7822 -2 -187 -527 717 3080 1105 2990 3400 -5338 2500 4913 -498 -2682 -706 -4255 -4515 1683 9617
7805 9617 16722 11712 2187 -10806 -11564 -7416 -2245 -1862 1043 704 -4642 -11745 -9719 -11153 -10819 -8544
7789 -8544 -7649 -2462 145 -2647 -3707 -2196 237 1399 3536 3295 1277 5479 -1 -1932 1367
7774 1367 -2681 -8080 -4137 3747 1895 283 3510 5435 -871 -38 -5693 -11367 -10613 -7422 -7133 -7509
7758 -7509 -2599 -9102 -9871 -4985 -4030 -5967 -6434 -6826 -14755 -20361 -14628 -5711 -8556 -12010 -13113 -6871
7742 -6871 3681 -6572 -10683 1779 13030 11713 331 -4817 3325 3466 3223 -1123 -231 -434 -1035
7727 -1035 -4681 -4308 -7462 -6184 -2544 -8761 -11298 -8227 -2407 1982 177 -6199 -3986 -4717 -3609
7712 -3609 -315 3366 6784 3633 -1728 -1395 2762 -2491 -805 4800 -427 -5992 -9211 -5262 2755
7697B755O590L64j0107J210N644L712k558p085m257j155k485p02L427l371j0292
7682a8310M700J1184K691L838J048o888k95L572L948o81k081j959j393m2m602
7667e270k324j287p986j414K923P992Q673l467l352K959m195J57M511M273K312
7652D505o3J296k57k756n401o950j150M45J0746k749n080m579l738l845N601J519
7636a2456L118n88N21O410j949m025k651k536k26K259P659J818q01m44l617l009
7620a0517j819l671L188k01l461l887L229M804L385k828l372M750O976L129m193
7605d488o563m208K162L259O805K301l834k156K578M171K234p008J368l257p470
7590a4106K405M785L051L047j479m171J87L409j448J239l584k03p578L459P684
$$ plain form
7697 2755 9345 9709 -398 812 6456 10168 7610 525 -3732 -4887 -7372 -8074 -4647 -8018 -18310
7682 -18310 -13610 -2426 265 4103 5151 -1737 -2032 1540 5488 4807 2726 767 -626 -668 -5270
7667 -5270 -7594 -8881 -16867 -18281 -15358 -7366 1307 -2160 -5512 -2553 -6748 -6591 -2080 2193 4505
7652 4505 4442 5738 5481 2725 -2676 -9626 -10776 -10331 415 -2334 -7414 -11993 -15731 -19576 -13975 -12456
7636 -12456 -9338 -9926 -9405 -2995 -4944 -8969 -11620 -14156 -14382 -12123 -4464 -2646 -3447 -3891 -7508 -10517
7620 -10517 -12336 -16007 -12819 -13020 -16481 -20368 -17139 -12335 -8950 -11778 -15150 -10400 -3424 -295 -4488
7605 -4488 -11051 -15259 -13097 -9838 -3033 -732 -4566 -6722 -4144 27 2261 -4747 -3379 -6636 -14106
7590 -14106 -11701 -6916 -3865 -818 -2297 -6468 -6281 -2872 -4320 -3081 -6665 -6868 -14446 -10987 -3303
7575c303k031j676J350k492M305L975M707r811r584J179m04M571P047L085p00
7560B18M677l538j689m031J239O341J375k987j789j326q478p919Q619P712K598
7545A022l041k145L83J440J237L030K671L199K585n968j1448r737m53J567N274
7530a0384n65L3J0582J193m993j735K584j895J275O807J27k742n279L76M688o023
7514e951k945j929q33L949n683j829k422o42J076L997J3017J091o864O59L577
7499a732p675o254J044m538L047L325k215N618J0905K003J884l366l545M589L695
7484F785j471q068k451j837M509K958j113J78M17J603l838n825l6k868m663J009
7468a4711K787Q689j871l073K954K919j671j663L787M897R48jk173j050m514N038
$$ plain form
7575 -3303 -5334 -7010 -5660 -8152 -3847 128 4835 -4976 -14560 -13381 -13785 -9214 -2167 918 218
7560 218 4895 1357 -332 -4363 -3124 3217 4592 1605 -184 -1510 -9988 -17907 -9288 -1576 1022
7545 1022 -2019 -4164 -3781 -2341 -1104 1926 4597 7796 10381 4413 -7035 -16772 -17225 -15658 -10384
7530 -10384 -10949 -10916 -334 859 -4134 -5869 -3285 -5180 -3905 2902 3029 287 -4992 -4616 72 -5951
7514 -5951 -8896 -10825 -11658 -7709 -13392 -15221 -17643 -18285 -17209 -13212 -195 896 -5968 -5309 -1732
7499 -1732 -9407 -15661 -14617 -19155 -16108 -12783 -14998 -9380 1525 3528 5412 2046 -1499 3090 6785
7484 6785 5314 -2754 -5205 -7042 -2533 425 -688 -510 -93 1510 -2328 -8153 -8189 -11057 -15720 -14711
7468 -14711 -11924 -3235 -5106 -8179 -5225 -2306 -3977 -5640 -1853 3044 3992 3991 1818 768 -3746 1292
7452A292M618K444j752J147l1m498m570L887o457r210m488M019J17N219O343J591
7436c29M717j576n469R10k638l845k025n032j34J2690M218o372o15l01j53N396
7420e58J936L360j227o149q01O88j33j989Q217m973o698L841Q970K54r916m107
7404i285K468M917k56l618o001k31M495M583O09L543J4k380k444p213J426K605
7388f768L427n10M335m109p507m368O035J3257N154m422r874o23J909n954N341
7373d677J300j899o712n96k946Q136P094L1J751P887L601K67p785p861l439J957
7357c891K715J968J397m704n028K474N354l97O209P520o659q495j819N46M203
7342A393j624L188K092m714n439j839k865L994q306k744k00j067N41P262k637
$$ plain form
7452 1292 5910 8354 6602 7749 7718 3220 -1350 2537 -3920 -13130 -17618 -13599 -13482 -8263 -1920 -329
7436 -329 4388 2812 -2657 -1747 -4385 -8230 -10255 -15287 -15421 -2731 1487 -4885 -5500 -5801 -5954 -558
7420 -558 1378 4738 3511 -2638 -3439 -2751 -2884 -4873 3344 -1629 -8327 -4486 4484 4738 -5178 -9285
7404 -9285 -6817 -1900 -2156 -5774 -11775 -12006 -7511 -2928 -2319 1224 1238 -1142 -3586 -10799 -9373 -6768
7388 -6768 -3341 -3851 484 -3625 -11132 -15500 -9465 3792 8946 4524 -5350 -5973 -4064 -10018 -4677
7373 -4677 -3377 -5276 -11988 -12584 -15530 -7394 -300 -269 1482 9369 12970 13237 5452 -2409 -5848 -3891
7357 -3891 -1176 792 2189 -2515 -7543 -5069 285 -112 6097 13617 6958 -1537 -3356 -2810 1393
7342 1393 -231 2957 5049 335 -5104 -6943 -9808 -5814 -14120 -16864 -17064 -18131 -17590 -10328 -12965
7327a2965n91K432k399k274j732l308P435P555R340n55j0337m794P158l215r569
7312a7819J640m43l065J1938P027l2K631p666m425N34M735p08p76O318M035K08
7296D132K136L611j91j855o127n540o431k130M051Q431N715K060k796J254J646
7281G966j850L417L308q033q016l979j848j93M961P573J943m422o137J06j349
7266f553m690M926L492J278N302o49p966K60K684m624K469r77J105M014o475m880
7250a1284M443M15k172k85L388k119R64k370K245Q14J023O14m370L09Q766k738
7234b357L737j215j1789K830R727J020m583J108l861j175Q97m801L951j884L761
7219d634P237L727o898l457n198k957L946l138k789P227r92N944N332M810K932
$$ plain form
7327 -12965 -13556 -11124 -13523 -15797 -17529 -20837 -13402 -5847 3493 2938 -7399 -12193 -5035 -8250 -17819
7312 -17819 -16179 -16622 -19687 -7749 -722 -754 1877 -5789 -10214 -9680 -4945 -5653 -6429 -111 3924 4132
7296 4132 6268 9879 9688 7833 1706 -3834 -10265 -12395 -8344 87 5802 7862 5066 6320 7966
7281 7966 6116 9533 12841 4808 -3208 -7187 -9035 -9228 -4267 3306 5249 827 -5310 -5204 -6553
7266 -6553 -11243 -6317 -2825 -1547 3755 3106 -4860 -4600 -1916 -6540 -4071 -5048 -3943 71 -6404 -11284
7250 -11284 -6841 -6426 -8598 -8883 -5495 -7614 -6650 -9020 -6775 -5961 -4938 -4324 -8694 -8385 381 -2357
7234 -2357 1380 165 -11624 -8794 933 1953 -2630 -1522 -5383 -6558 -5661 -10462 -6511 -8395 -4634
7219 -4634 2603 6330 -568 -4025 -9223 -12180 -8234 -11372 -14161 -6934 -7926 -1982 3350 8160 11092
7204A1092o412P00l939j1560M155K335O802J47j725J192l739l885j952L32m35
7189f892L807J911m647k444J33K319j85K327j659l97k847l139P377N961j645K87
7173B67o899m809L867R650P085O828n812q795p125n77K981N851K369m596l048
7158b763N115m49p49m985M968J297K16M078k179q379l016j329K989K88J086l884
7142g696J2O412l333k018P69m245m286k698j083k97l717M846O158J0779J791m266
7126b872m554K085J714J819M037k352l910j218M671K093m269m422j753O02L442
7111d887O825L657l323J922k223o063q218l66L188K725l561J82k766m013O226
7096a0695J0909J146N26K877n325p906l507j031L243K401m01n075M356M927P789
$$ plain form
7204 11092 4680 5380 1441 -10119 -5964 -3629 3173 3320 1595 2787 -952 -4837 -6789 -6457 -6892
7189 -6892 -3085 -1174 -5821 -8265 -8132 -5813 -5998 -3671 -5330 -5727 -8574 -11713 -4336 1625 -20 267
7173 267 -6632 -11441 -7574 2076 9161 15989 10177 1382 -5743 -6320 -3339 2512 4881 285 -2763
7158 -2763 2352 1903 1154 -3831 1137 2434 2650 6728 4549 -3830 -6846 -8175 -5186 -4898 -3812 -7696
7142 -7696 -7684 -1272 -4605 -6623 -5854 -10099 -14385 -17083 -18166 -18463 -22180 -17334 -11176 -397 1394 -2872
7126 -2872 -7426 -5341 -3627 -1808 2229 -123 -4033 -5251 -580 1513 -2756 -7178 -8931 -8329 -4887
7111 -4887 1938 5595 2272 4194 1971 -4092 -12310 -12676 -9488 -6763 -10324 -10142 -12908 -16921 -10695
7096 -10695 214 1360 1886 4763 -562 -8468 -11975 -13006 -9763 -7362 -7763 -12838 -8482 -3555 4234
7081D234m196R2k243l172J03q81m081m42L606M711K611J123N261L29O5j0073m209
7064g162j299k007K030L196P94m370N845k470o367J095O587K961M033o668J057
7049b745M784J778L037o921n316k929P40K85J335O670N443k865k05n437o756n015
7033a4117J615o90K042N70K973J41K584j041k636m336l07R597j149k534l876K009
7017i155L046J134M853j885J881P58K782N32l418j286j949l071K559J505n306
7002g020n506j141O020R58M949N61m745J067M383L913m695p499L446N248J358
6987A297K319k605N43O1r347k424K763L926l981M652Q10m415O3j317j746L656
6971e745l481M070M123k674p868m345J0285P881QJ655K642j0260l157O214J999
$$ plain form
7081 4234 38 130 -2113 -5285 -5182 -6063 -10144 -10586 -6980 -2269 342 1465 6726 7055 7120 -2953 -7162
7064 -7162 -8461 -10468 -8438 -5242 -4448 -8818 -2973 -5443 -11810 -10715 -4128 -1167 2866 -3802 -2745
7049 -2745 2039 3817 6854 -67 -5383 -8312 -7572 -7287 -5952 718 6161 3296 3091 -2346 -9102 -14117
7033 -14117 -12502 -13192 -11150 -10580 -7607 -7466 -4882 -5923 -8559 -12895 -13202 -3605 -4754 -7288 -11164 -9155
7017 -9155 -6109 -4975 -122 -2007 -126 632 3414 3946 528 -758 -2707 -5778 -3219 -1714 -7020
7002 -7020 -12526 -13667 -7647 -6689 -1740 -1179 -5924 -4857 -474 3439 -1256 -8755 -5309 -61 1297
6987 1297 3616 1011 1554 1615 -7732 -10156 -7393 -3467 -7448 -2796 -1986 -6401 -6338 -7655 -9401 -5745
6971 -5745 -9226 -5156 -1033 -3707 -11575 -15920 -5635 2246 2254 3909 6551 -3709 -6866 -652 1347
6956A347M350o28p759k614K809j56K001j351P288M190p071j53n189K223J099j744
6940a358k087M43K814L673m245j276J670j591L252K896l697n920j960O781R74
6925C69N455O634P251j288q377j0435m779J950N8o036p863j125N709R083R40K720
6909B66M13J79k678K822j191J354n953n432l972P702L08n250%k215M750K229K764
6892c904J0553J487j127l236l864K736P27j903n896K705N946Q02L426N8l992o744
6876b226m452j729l69K690k459K132k254j732M423P143K905n523l022j900j951
6861h324J034Q015M083o622J40q23o49k214M673j283k90J909k833m55P45J517
6845a377j782l308l50k870M91O052P770n087K392L613p318j530l023J291p067
$$ plain form
6956 1347 5697 5069 -2690 -5304 -2495 -2651 -650 -2001 5287 9477 2406 2253 -2936 -713 386 -1358
6940 -1358 -3445 -3002 -188 3485 -760 -2036 -366 -1957 1295 4191 494 -5426 -7386 -605 369
6925 369 5824 12458 19709 18421 10044 -391 -5170 -3220 -3162 -9198 -17061 -18186 -12477 -3394 -2454 266
6909 266 679 858 -1820 1002 -189 1165 -4788 -10220 -14192 -6490 -6182 -11432 -11432 -13647 -8897 -6668 -3904
6892 -3904 6649 8136 7009 3773 -91 2645 3372 1469 -4427 -1722 4224 5026 8452 8510 4518 -2226
6876 -2226 -6678 -8407 -8776 -6086 -8545 -6413 -8667 -10399 -5976 1167 4072 -1451 -4473 -6373 -8324
6861 -8324 -7290 725 4808 -1814 -1674 -2497 -3146 -5360 -687 -1970 -2260 -351 -3184 -3639 -2894 -1377
6845 -1377 -3159 -6467 -6817 -9687 -9196 -3144 4626 -461 1931 5544 -1774 -3304 -6327 -5036 -12103
6830a2103l115K972N385N112N249o40j387O93m582J2250P699o870l687m694l633
6815a351K987J850o78L133o047j756K233j997n302N820O252K595n243m169n483
6800g156K059N783o2l746k179l251M173J947P713k560q132L620N066j90k859M316
6784D542J886m582r402p64P02J993k783k38L615r48o903M621K924K67P918j700
6768A148l627M096J268j0036n012N461N518m344M212k019n211j766m6j977k267
6753a4602L777M66j81K389J523J381n901K621M676O81l449K918N3l676N0M35K8
6736f811m599N625O458r5J29M633M275j211m245o592q840n8k493K638M485N188
6720a513K278o146k076L327n484o005m304k03O531m82Q03Q670M013J554M46K074
$$ plain form
6830 -12103 -15218 -12246 -6861 -1749 3500 2860 1473 2166 -2416 9834 17533 10663 6976 2282 -1351
6815 -1351 1636 3486 2808 5941 -106 -1862 371 -1626 -6928 -1108 5144 7739 2496 -1673 -7156
6800 -7156 -5097 686 624 -3122 -5301 -8552 -4379 -2432 5281 2721 -5411 -1791 3275 3085 226 4542
6784 4542 6428 1846 -7556 -8320 -7618 -5625 -8408 -8646 -5031 -5979 -12882 -8261 -5337 -5070 2848 1148
6768 1148 -2479 1617 2885 -7151 -12163 -6702 -1184 -5528 -1316 -3335 -8546 -10312 -10358 -12335 -14602
6753 -14602 -10825 -10359 -10540 -8151 -6628 -5247 -11148 -8527 -3851 -3170 -6619 -3701 -3648 -7324 -7274 -6839 -6811
6736 -6811 -11410 -5785 673 578 707 5340 9615 8404 4159 -2433 -11273 -11331 -13824 -11186 -6701 -1513
6720 -1513 765 -5381 -7457 -4130 -9614 -15619 -19923 -20126 -13595 -14077 -13274 -4604 -591 963 1409 3483
6704C483l386m44l435j531q08n685L744O885K907k800o460L421n93q36K927m346
6688f957k757R821M319n124l998J744M179j663r90l564M783O933n79N85M2p865
6672a091J418K001J214N33l866q626j394O208n72k32N174j538K548L427l079m729
6656b604j681P85r75J874N524l559m659p043J893k376M678K619K636J455l397
6641d830n63M720l21l587J796J368R40J391N99n492K213N454k890m861p02L261
6625a504m513m281J93j000K018q39k959L418K253L139j948j553J634R712k933
6610H37M246L031p29J2R07j033n669p151m214K803O85m577O046J567Q22m812q332
6593a5561N807M264o288P88M504N612O704M935q315m998R19M876k009N35l042
$$ plain form
6704 3483 97 -347 -3782 -5313 -6121 -11806 -8062 -1177 1730 -1070 -7530 -4109 -4702 -5538 -2611 -6957
6688 -6957 -9714 107 4426 -698 -4696 -2952 1227 -436 -1426 -4990 -207 6726 6147 6732 6774 -1091
6672 -1091 327 2328 3542 4075 209 -8417 -9811 -3603 -4175 -4407 767 -771 1777 5204 2125 -2604
6656 -2604 -4285 -3500 -4475 -2601 2923 -636 -5295 -12338 -10445 -12821 -8143 -5524 -2888 -1433 -4830
6641 -4830 -5393 -673 -994 -4581 -2785 -1417 -477 914 1513 -3979 -1766 3688 798 -4063 -4765 -1504
6625 -1504 -6017 -10298 -10105 -11105 -9087 -9926 -12885 -9467 -7214 -4075 -6023 -7576 -5942 3770 837
6610 837 5083 8114 7385 7397 8304 7271 1602 -5549 -9763 -6960 -6275 -10852 -4806 -3239 -2417 -7229 -15561
6593 -15561 -9754 -5490 -11778 -10990 -6486 -874 5830 10765 2450 -2548 -1629 3247 1238 1773 -1269
6578a269m010O546K161l120o225j480j809Q87K080N285M470m623k839k870j957
6563h773k62j479J877O687P226M252K830K101l210l660j991p03J404j679o897
6548b277M44N824N209o724O75n49n046J737M079M590j277q23j2297l780Q9m316
6532a4442J260L780K611J631O759J241L26J192o398O54J9m772j110P19Q356J573
6516C399p011m087K708p97j885L016N12k044l601R344N759r56L735K194m905o272
6500h91K063l444p904p073j360M626R927L734L057m821k749J802Q508P54m537
6485A692K387L306j293n361P274O704j685n051K147o241k697N075o148r57k444
6470c292m371j577M179m41K282J263j78J126k356p554r531K401M438o65k20P480
$$ plain form
6578 -1269 -5279 1267 3428 308 -5917 -7397 -9206 -8319 -6239 -954 3516 -1107 -3946 -6816 -8773
6563 -8773 -9035 -10514 -8637 -1950 5276 9528 12358 14459 11249 7589 5598 4895 6299 4620 -2277
6548 -2277 -1833 3991 9200 2476 3151 2602 -2444 -707 3372 7962 6685 5862 -6435 -10215 -10126 -14442
6532 -14442 -13182 -9402 -6791 -5160 1599 2840 3166 4358 -2040 -1386 -1367 -6139 -7249 -6530 1826 3399
6516 3399 -3612 -7699 -4991 -5788 -7673 -4657 -4145 -6189 -9790 -446 5313 4357 8092 10286 5381 -891
6500 -891 1172 -2272 -10176 -17249 -18609 -13983 -4056 -322 2735 -2086 -4835 -3033 5475 6229 1692
6485 1692 4079 7385 6092 731 8005 14709 13024 7973 10120 3879 1182 6257 109 -848 -3292
6470 -3292 -7663 -9240 -5061 -5502 -3220 -1957 -2135 -1009 -3365 -10919 -20450 -18049 -13611 -14276 -14496 -7016
6454g016j676m604K498M67k0N18L410M90m114j962J551j082K1M057j702M196K355
6437b613l753J815K945m503J093J828j217j708M24j068O568K15p886n7k065K30
6421i752m314Q76Q562J402J541N486K250j2173l179N062K942n043j777k34J812
6406f539L498O458Q22r870k675p527K267j245N9M217l35k948N766N888n177l863
6390a1204k836P15l339M156k904O12J122J07Q324p18o616r24R339J482m821K158
6374e347J762J160m195J779j617R2n32k342M14J10N775J961j346M537K037j44
6358D104l500k269j236m354n206m060L174M999k250q09M457Q025j888o113l376
6343a0302N38R66K361N17j018m201m308K06J1142J601k118P58J0266M074j635
$$ plain form
6454 -7016 -8692 -13296 -10798 -10331 -10351 -9833 -6423 -5933 -10047 -12009 -10458 -11540 -11519 -7462 -9164 -4968 -2613
6437 -2613 -6366 -4551 -1606 -6109 -5016 -3188 -4405 -6113 -5689 -6757 -189 26 -7860 -7917 -9982 -9752
6421 -9752 -14066 -13190 -4628 -3226 -1685 3801 6051 -6122 -9301 -4239 -1297 -6340 -8117 -8351 -6539
6406 -6539 -3041 3417 4239 -5631 -8306 -15833 -13566 -14811 -14752 -10535 -10870 -13818 -8052 -2164 -7341 -11204
6390 -11204 -14040 -13325 -16664 -12508 -15412 -14800 -13678 -13571 -5247 -5965 -12581 -13505 -4166 -2684 -7505 -5347
6374 -5347 -3585 -2425 -6620 -4841 -6458 -6366 -6898 -9240 -8826 -8716 -2941 -980 -2326 2211 4248 4104
6358 4104 604 -1665 -2901 -7255 -12461 -16521 -13347 -8348 -10598 -11407 -6950 1075 -813 -6926 -10302
6343 -10302 -9764 -8798 -6437 -5920 -6938 -11139 -15447 -15241 -4099 -2498 -4616 -3858 6408 10482 8847
6328H847M365j553n587m714J862n284L47Q134J792j532k291m954n251K105n53
6313d267L739L326n330o427M837O188L678J453M065j236k687m711m736n00j909
6298d517K604o4L639J345N872L782l900q298j507R18J196L096L172J373K513o662
6282D562n657o09K566m181p266m077m52J755K210Q039L341p77J49N064L977K65
6266H909J795n016j421l745k131O781J708j825m72n787O6j438o838n396L751M307
6250f752R909L527J532n712p003j024L685L022J996L816o667J637l8r534L46J815
6234e445M571J548j589J623J592J94q70k500l965m199k200J733M65O151o20P467
6218C956K007m993m52j147k736q080M280N099k951n292K308J373N177K595l407
$$ plain form
6328 8847 13212 11659 6072 1358 3220 -2064 -1717 6417 8209 6677 4386 -568 -5819 -3714 -4267
6313 -4267 -528 2798 -2532 -8959 -4122 2066 5744 7197 11262 10026 7339 2628 -2108 -2608 -4517
6298 -4517 -1913 -1977 1662 3007 8879 12661 8761 463 -1044 -126 1070 4166 7338 8711 11224 4562
6282 4562 -1095 -1704 862 -3319 -10585 -14662 -15114 -13359 -11149 -3110 231 -546 -397 4667 8644 8909
6266 8909 10704 5688 4267 522 -1609 5172 6880 5055 4583 -1204 -1138 -2576 -9414 -14810 -11059 -6752
6250 -6752 3157 6684 8216 2504 -4499 -5523 -1838 1184 3180 6996 329 1966 1928 -7606 -7260 -5445
6234 -5445 -874 674 -915 708 2300 2494 1624 -876 -4841 -9040 -11240 -9507 -9042 -2891 -3511 3956
6218 3956 5963 970 518 -629 -3365 -11445 -7165 -2066 -5017 -10309 -8001 -6628 -1451 1144 -2263
6203b263k659L970J038p35L930m117n511k537K449l326k88l66j273P127J232j102
6187d431l793N704J1732k755o577m259k040j006J940M221J632K634L959k038o015
6172a092n56L83j712p798k579N380N822k651q095n140N787J3228l846k070l645
6157h584J055L740j592j015O655M073j826k700j349P74P88j873n922K976M307
6142d93K009p6o539M990P91k97n047K692l710K811K777m741M216j604m04l617
6126f242n658N031j904K84M382l030k400M405P783m820l569R534J224o307j009
6111b296j141l182L454Q909M967k254n473m985j712j602m284K308Q8J659K628
6096b916L62l569l09L458N379J211O60j501k048K703M63q636L787J0539l350K034
$$ plain form
6203 -2263 -4922 -952 86 -649 3281 -836 -6347 -8884 -6435 -9761 -10049 -10415 -11688 -4561 -3329 -4431
6187 -4431 -8224 -2520 9212 6457 -120 -4379 -6419 -7425 -5485 -1264 368 3002 6961 4923 -1092
6172 -1092 -1648 -1265 -2977 -10775 -13354 -7974 -2152 -4803 -12898 -18038 -12251 977 -2869 -4939 -8584
6157 -8584 -7529 -3789 -5381 -6396 259 4332 2506 -194 -1543 -769 19 -1854 -7776 -4800 -493
6142 -493 1516 1440 -5099 -109 682 385 -4662 -1970 -5680 -2869 -92 -4833 -617 -2221 -2625 -6242
6126 -6242 -11900 -6869 -8773 -8489 -4107 -7137 -9537 -5132 2651 -2169 -5738 3796 5020 -1287 -2296
6111 -2296 -3437 -6619 -3165 5744 10711 8457 2984 -2001 -3713 -5315 -9599 -7291 -7203 -5544 -2916
6096 -2916 -2554 -6123 -6432 -2974 2405 3616 4276 2775 727 3430 3893 -4743 -956 9583 6233 8267
6080H267N80O50m465r92J033M47j388N798l791m876o529m009o70K005K667O36
6064d637p41j182L431n683l776r3L401M686J012k99N961R7O99L044M21j027l763
6047A551l55J431N37o734J47k720l27k082o50O297L872Q55k206n03O048M980j786
6030H355o17j253j6616n689M644P377K739m584K49n56J474j535j003j4n844L857
6014i016J0540o360m764K180L747m05n229k032K164o838o89Q564P69j305O020
5999b654O873j2682o004Q821L237j180Q59L363j319Q16O58r323m059K548k618
5984a2664J518N471K233R77K638J340k481m641n13L10O777N447J644q610k839
5969c393l310M1k099J52L616O266M494m127r936K280L987J388j890O052K476q131
$$ plain form
6080 8267 8847 9497 5032 4040 5073 5520 4132 9930 6139 1263 -5266 -9275 -9945 -7940 -5273 -4637
6064 -4637 -5378 -6560 -3129 -8812 -12588 -12681 -9280 -4594 -3582 -3881 2080 2177 2876 5920 6341 5314 1551
6047 1551 1196 2627 3164 -3570 -3423 -6143 -6470 -8552 -9202 -2905 967 1822 -384 -887 5161 10141 8355
6030 8355 7738 6485 -10131 -15820 -11176 -3799 -1060 -5644 -5395 -5951 -4477 -6012 -7015 -7029 -12873 -9016
6014 -9016 1524 -4836 -9600 -7420 -3673 -4078 -9307 -11339 -9175 -16013 -16702 -8138 -7369 -8674 -2654
5999 -2654 4219 -8463 -14467 -5646 -2409 -3589 -2730 633 -686 130 788 -8535 -12594 -10046 -12664
5984 -12664 -11146 -5675 -3442 -2465 173 1513 -968 -5609 -6122 -5812 965 6412 8056 -554 -3393
5969 -3393 -6703 -6662 -8761 -8609 -4993 1273 5767 1640 -8296 -6016 -2029 -641 -2531 3521 5997 -2134
5953b134k584j455J825o451K443M417N229O594P014k908o697Q4j005k72j013j400
5937A687o86P50N937P8o630m801P339M47l113o66n48Q5k358j413L851K128j051
5920A036k762J882k311J982k174k563n20j791K632J667m820l811q728j571O048
5905a5804Q968P257m882o656M398J259j342J589k469j377K663K296n690j094K431
5890h453N221R35m273j0283M190P176O720m283k894L95J253O924K307o71j599
5875B665o431k192n814j773N189N977k711k548O20q147k94M217L166J968k712
5860h820m432m086N562P020M689J812j524p619n445O849O077n547k622j862j404
5845a1352j29L253N327P495q237o224j151N172Q595L778j094o994j741j009p6
$$ plain form
5953 -2134 -4718 -6173 -4348 -10799 -8356 -3939 1290 7884 14898 11990 5293 5377 4372 4100 3087 1687
5937 1687 1001 1751 7688 7766 1136 -3665 3674 4121 1008 342 -206 -121 -2479 -3892 -41 2087 1036
5920 1036 -1726 156 -2155 -173 -2347 -4910 -5430 -7221 -4589 -2922 -7742 -11553 -20281 -21852 -15804
5905 -15804 -6836 421 -4461 -11117 -6719 -5460 -6802 -5213 -7682 -9059 -6396 -4100 -9790 -10884 -8453
5890 -8453 -3232 -2297 -6570 -16853 -12663 -5487 1233 -3050 -5944 -5549 -4296 2628 4935 4264 2665
5875 2665 -3766 -5958 -11772 -13545 -8356 -2379 -5090 -7638 -7018 -15165 -15459 -11242 -8076 -6108 -8820
5860 -8820 -13252 -17338 -11776 -4756 -67 1745 221 -7398 -12843 -5994 83 -5464 -8086 -9948 -11352
5845 -11352 -11481 -8228 -2901 4594 -3643 -9867 -11018 -5846 2749 6527 5433 -1561 -3302 -4311 -4387
5830d387L70j600j507J2252M618l66n500J939k169o328k950j095Q985K279m118
5815D23k026n298N315l10l501J251J653K912l154l864j913p81M599K523j3o623
$$ plain form
5830 -4387 -4017 -5617 -7124 5128 9746 9380 3880 5819 3650 -2678 -5628 -6723 2262 4541 423
5815 423 -1603 -6901 -1586 -1896 -5397 -4146 -2493 419 -2735 -6599 -8512 -9293 -4694 -2171 -2184 -8807
$$ [...]
##END NTUPLES=NMR SPECTRUM
##END=
