##TITLE=Analysis number 324043
Compound Code cc 00243
Project Code adrs
Chemist Name endeavour
##JCAMPDX= 6.0         $$ Bruker NMR JCAMP-DX V2.0
##DATA TYPE= NMR SPECTRUM
##DATA CLASS= NTUPLES
##ORIGIN= Bruker BioSpin GmbH
##OWNER= nmr
$$ XWIN-NMR		Version 3.5
$$ Tue Nov 14 09:47:06 2006 GMT Standard Time (UT+0h)  MAYBRIDGE\nmr@NMR_250MHZ
##.OBSERVE FREQUENCY= 250.131544655141
##.OBSERVE NUCLEUS= ^1H
##.ACQUISITION MODE= SIMULTANEOUS (DQD)
##.ACQUISITION SCHEME= undefined
##.AVERAGES= 16
##.DIGITISER RES= 18
##SPECTROMETER/DATA SYSTEM= dpx250
##.PULSE SEQUENCE= zg30
##.SOLVENT NAME= CDCl3
##.SHIFT REFERENCE= (INTERNAL, CDCl3, 0, 16.522)
##AUDIT TRAIL= $$ (NUMBER, WHEN, WHO, WHERE, WHAT)
$$ ##TITLE= Audit trail, XWIN-NMR		Version 3.5
$$ ##JCAMPDX= 5.01
$$ ##ORIGIN= Bruker BioSpin GmbH
$$ ##OWNER= nmr
$$ C:\u/data/dgb/nmr/ADRS/120/pdata/1/auditp.txt
$$ ##AUDIT TRAIL=  $$ (NUMBER, WHEN, WHO, WHERE, WHAT)
(   1,<2006-11-14 09:46:36.39 +000>,<MAYBRIDGE\nmr>,<NMR_250MHZ>,
      <created by zg, POWCHK disabled, PULCHK disabled
       configuration hash MD5:
       49 4B E0 1D 92 C2 6B 37 9F E6 65 BC 52 41 86 1D
       data hash MD5: 64K
       9B BA 08 09 5B F7 58 D1 21 70 A7 4D E7 9A A9 F2>)
(   2,<2006-11-14 09:46:53.28 +000>,<MAYBRIDGE\nmr>,<NMR_250MHZ>,
      <Start of raw data processing
       ef LB = 0.3 FT_mod = 6 PKNL = 1 SI = 32K 
       data hash MD5: 32K
       CA D6 D2 B9 03 1C BF 79 6A 5D F8 E3 D8 41 56 94>)
(   3,<2006-11-14 09:46:55.00 +000>,<MAYBRIDGE\nmr>,<NMR_250MHZ>,
      <apk 
       data hash MD5: 32K
       85 20 11 3C D7 77 C0 8A 24 3D 95 FD 68 7F 03 F2>)
(   4,<2006-11-14 09:46:55.78 +000>,<MAYBRIDGE\nmr>,<NMR_250MHZ>,
      <abs ABSG = 5 
       data hash MD5: 32K
       FB BE 32 33 A3 82 2B 39 AD B2 49 B1 8A 64 2A E3>)
$$ ##END=
$$ 
$$ hash MD5
$$ 1D DA 5D 68 95 7A 0A 18 A0 DB BD 44 4F 44 48 1E
##$RELAX= 
##$RELAX= 
##$RELAX= 
##$RELAX= 
##$RELAX= 
##$RELAX= 
##$RELAX= 
$$ Bruker specific parameters
$$ --------------------------
##$DU= <C:\u>
##$EXPNO= 120
##$NAME= <ADRS>
##$PROCNO= 1
##$TYPE= <nmr>
##$USER= <dgb>
##$AMP= (0..31)
100 100 100 100 100 100 100 100 100 100 100 100 100 100 100 100 100 100 
100 100 100 100 100 100 100 100 100 100 100 100 100 100 
##$AQSEQ= 0
##$AQ_mod= 3
##$AUNM= <au_zg>
##$AUTOPOS= <13 >
##$BF1= 250.13
##$BF2= 250.13
##$BF3= 250.13
##$BF4= 250.13
##$BF5= 500.13
##$BF6= 500.13
##$BF7= 500.13
##$BF8= 500.13
##$BYTORDA= 1
##$CFDGTYP= 0
##$CFRGTYP= 5
##$CHEMSTR= <none>
##$CNST= (0..31)
1 1 145 1 1 1 1 1 1 1 1 1 1 1 1 1 1 1 1 1 1 1 1 1 1 1 1 1 1 1 1 1 
##$CPDPRG= <>
##$CPDPRG1= <>
##$CPDPRG2= <>
##$CPDPRG3= <>
##$CPDPRG4= <mlev>
##$CPDPRG5= <mlev>
##$CPDPRG6= <mlev>
##$CPDPRG7= <mlev>
##$CPDPRG8= <mlev>
##$CPDPRGB= <>
##$CPDPRGT= <>
##$D= (0..31)
0 1 0 0 0 0 0 0 0 0.06 0 0 0 0 0 0 0.0002 0 0 0 0 0 0 0 0 0 0 0 0 0 0 
0 
##$DATE= 1163497595
##$DBL= (0..7)
120 120 120 120 120 120 120 120 
##$DBP= (0..7)
150 150 150 150 150 150 150 150 
##$DBP07= 0
##$DBPNAM0= <>
##$DBPNAM1= <>
##$DBPNAM2= <>
$$ [...]
##$SUBNAM7= <"">
##$SUBNAM8= <"">
##$SUBNAM9= <"">
##$SW= 20.6930455092707
##$SWIBOX= (0..15)
0 0 3 0 0 0 0 0 0 0 0 0 0 0 0 0 
##$SW_h= 5175.983436853
##$TD= 65536
##$TD0= 1
##$TE= 683.16
##$TE2= 300
##$TE3= 300
##$TEG= 300
##$TL= (0..7)
0 120 120 120 120 120 120 120 
##$TP= (0..7)
150 150 150 150 150 150 150 150 
##$TP07= 0
##$TPNAME0= <>
##$TPNAME1= <>
##$TPNAME2= <>
##$TPNAME3= <>
##$TPNAME4= <>
##$TPNAME5= <>
##$TPNAME6= <>
##$TPNAME7= <>
##$TPOAL= (0..7)
0.5 0.5 0.5 0.5 0.5 0.5 0.5 0.5 
##$TPOFFS= (0..7)
0 0 0 0 0 0 0 0 
##$TUNHIN= 0
##$TUNHOUT= 0
##$TUNXOUT= 0
##$USERA1= <user>
##$USERA2= <user>
##$USERA3= <user>
##$USERA4= <user>
##$USERA5= <user>
##$V9= 5
##$VALIST= <valist>
##$VCLIST= <CCCCCCCCCCCCCCC>
##$VD= 0
##$VDLIST= <DDDDDDDDDDDDDDD>
##$VPLIST= <PPPPPPPPPPPPPPP>
##$VTLIST= <TTTTTTTTTTTTTTT>
##$WBST= 1024
##$WBSW= 4
##$XGAIN= (0..3)
0 0 0 0 
##$XL= 0
##$YL= 0
##$YMAX_a= 420258
##$YMIN_a= -361333
##$ZGOPTNS= <>
##$ZL1= 120
##$ZL2= 120
##$ZL3= 120
##$ZL4= 120
##$ABSF1= 16.522
##$ABSF2= -4.171173
##$ABSG= 5
##$ABSL= 3
##$ALPHA= 0
##$AQORDER= 0
##$ASSFAC= 0
##$ASSFACI= 0
##$ASSFACX= 0
##$ASSWID= 0
##$AUNMP= <proc_1d>
##$AZFE= 0.1
##$AZFW= 0.1
##$BCFW= 0
##$BC_mod= 0
##$BYTORDP= 0
##$COROFFS= 0
##$CY= 12.5
##$DATMOD= 1
##$DC= 0
##$DFILT= <>
##$DTYPP= 0
##$F1P= 14.0000005364418
##$F2P= -0.99999901652339
##$FCOR= 0.5
##$FTSIZE= 32768
##$FT_mod= 6
##$GAMMA= 0
##$GB= 0
##$INTBC= 1
##$INTSCL= 1
##$ISEN= 128
##$LB= 0.3
##$LEV0= 0
##$LPBIN= 0
##$MAXI= 10000
##$MC2= 0
##$MEAN= 0
##$ME_mod= 0
##$MI= 0
##$NCOEF= 0
##$NC_proc= -4
##$NLEV= 6
##$NOISF1= 0
##$NOISF2= 0
##$NSP= 0
##$NTH_PI= 0
##$NZP= 0
##$OFFSET= 16.522
##$PC= 1
##$PHC0= -44.61752
##$PHC1= 8.643394
##$PH_mod= 1
##$PKNL= yes
##$PPARMOD= 0
##$PSCAL= 4
##$PSIGN= 0
##$REVERSE= no
##$SF= 250.13
##$SI= 32768
##$SIGF1= 0
##$SIGF2= 0
##$SINO= 400
##$SIOLD= 32768
##$SREGLST= <1H.CDCl3>
##$SSB= 0
##$STSI= 32768
##$STSR= 0
##$SW_p= 5175.98343685301
##$SYMM= 0
##$S_DEV= 0
##$TDeff= 65536
##$TDoff= 0
##$TI= <Analysis number 999999
Compound Code 99
Book Reference 9
Project Code 9>
##$TILT= no
##$TM1= 0
##$TM2= 0
##$TOPLEV= 0
##$USERP1= <user>
##$USERP2= <user>
##$USERP3= <user>
##$USERP4= <user>
##$USERP5= <user>
##$WDW= 1
##$XDIM= 32768
##$YMAX_p= 402548703
##$YMIN_p= -508986
$$ End of Bruker specific parameters
$$ ---------------------------------
##NTUPLES= NMR SPECTRUM
##VAR_NAME=  FREQUENCY,     SPECTRUM/REAL,   SPECTRUM/IMAG
##SYMBOL=    X,             R,               I
##VAR_TYPE=  INDEPENDENT,   DEPENDENT,       DEPENDENT
##VAR_FORM=  AFFN,          ASDF,            ASDF
##VAR_DIM=   32768,         32768,           32768
##UNITS=     HZ,            ARBITRARY UNITS, ARBITRARY UNITS
##FACTOR=    0.157963299565203, 1,           1
##FIRST=     4132.6476996994, 0,             0
##LAST=      -1043.33573715361, 0,           0
##MIN=       -1043.33573715361, -508986,     0
##MAX=       4132.6476996994, 402548703,     0
$$ Real data points
##PAGE= N=1
##DATA TABLE= (X++(R..R)), XYDATA
$$ [...]
17561 267558 184348 101968 143251 127030 129271 240224 266829 258663 304751 243620 141430
17550 141430 137596 57710 81441 -41271 -59023 222 13829 73863 93539 -15010 69935
17539 69935 -19878 -195243 -129578 -24361 37463 79433 14450 -131759 -160271 -61620 -17936
17528 -17936 28802 107933 178809 23408 -164452 -164820 -275502 -235759 -59127 27044 -14467
17517 -14467 -88884 -17633 68203 146467 119395 82229 160320 132044 116502 113553 135621 143468
17505 143468 91578 116927 129608 35156 -124472 -164607 -158172 -122143 -72415 -2550 41156
17494 41156 82429 44005 121812 387245 240930 126996 133078 110642 138087 171206 235037
17483 235037 293153 315567 328774 381176 320935 307487 327898 500320 664488 603087 593186
17472 593186 630922 632303 645884 817553 860545 823251 659565 440328 412881 454315 407905
17461 407905 513865 478471 362423 410760 360048 343264 334822 343882 233629 206865 159041
17450 159041 142227 140660 185373 242485 482924 750567 906027 1116782 1198037 960463 623166
17439 623166 573836 439088 427086 336983 282610 436653 582877 719702 733454 674365 697540
17428 697540 778190 782297 698474 406395 277593 161934 122907 126537 144338 221090 283855
17417 283855 323861 385947 357172 324313 334135 383684 339207 206713 149752 -26316 -146474
17406 -146474 -170264 -40549 8330 -44618 -53370 13781 41640 122319 -4582 -113442 7109
17395 7109 69140 -59949 43799 -4752 12235 156883 140036 189238 198555 143572 29133
17384 29133 182215 122148 100073 171117 110209 -31406 -47807 -57323 20610 -268 -117427
17373 -117427 -260418 -288678 -219554 -65052 14701 -74598 -89751 90066 43532 92353 253751
17362 253751 237590 100983 22605 -60716 52302 152277 157597 81511 -86946 -220268 -248238
17351 -248238 -221150 -109867 10835 -157268 -127390 -98915 -206130 -19005 159906 98974
17341 98974 92153 49875 -24554 140012 252279 227326 143937 -88984 -107537 -68738 37523
17330 37523 6932 -26900 506 -14808 -114586 -160515 -195577 -238559 -61353 190481 177436
17319 177436 152175 202805 202651 146495 126878 127410 20055 -42360 -224955 -160379 -79610 -77744
17307 -77744 -126680 -105439 -6250 -4290 91583 68716 66893 45650 17849 43799 21675 31707
17295 31707 96172 140069 165935 159002 14076 -38443 -25081 -48365 -19699 75121 105726 -9003
17283 -9003 105725 84024 -21974 -13788 -86828 -37810 37970 216215 373587 193018 69942
17272 69942 151009 162472 54673 49962 25976 -32550 -9626 -28372 45519 -20520 -57192 -34172
17260 -34172 20293 71865 48571 75690 70415 -22468 -2855 93778 78674 95230 -16144 -183288
17248 -183288 -160896 5980 71573 103258 4248 54761 -13420 -40184 38174 7746 17859
17237 17859 107141 49643 119391 141730 246880 161536 -8644 -57936 952 17880 73185
17226 73185 83093 56034 17329 11433 -43871 4157 67516 -34903 111936 37524 -27068 42455
17214 42455 138675 100207 108223 52582 129989 21650 15111 -29768 -18374 83577 19223 -14200
17202 -14200 -52477 -9076 44391 67102 283685 453580 556890 412653 238365 132243
17192 132243 82442 126968 137112 186271 113617 41329 120924 83647 -139115 -184589 -195232
17181 -195232 -181432 -244534 -153279 -94937 -33329 -154388 -263129 -123110 17138 127248
17171 127248 99028 -29405 51170 170740 245431 237476 251318 121099 82579 104823 -4044
17160 -4044 -115697 -150251 -71035 39203 156838 178306 116976 36738 37906 79775 137309
17149 137309 141725 49175 -61383 -133717 -173714 -185613 -176021 -271082 -260996 -178362 -47529
17138 -47529 -8489 -88629 -110573 50282 263085 240069 119192 -6994 3447 78074 130270
17127 130270 81352 43690 94957 222 -69288 26953 66779 91426 161383 105334 87775
17116 87775 -26018 18618 48961 29833 -14694 -28770 53233 134480 87898 19146 5086
17105 5086 149973 186197 -40271 -29072 -48658 -28002 -59378 64845 22004 -34747 118416
17094 118416 97578 19799 8506 89530 208005 283278 275249 125412 44507 44760 92401 151388
17082 151388 92417 -78612 -129814 -76639 -115454 -244073 -208291 -136346 -51346 -127829 -157630
17071 -157630 8625 -44620 19169 194147 208626 224906 258210 245295 297498 60307 -3019
17060 -3019 108784 211136 175101 165155 -17671 50475 60234 -69884 -259615 -296693 -76863
17049 -76863 70897 84621 190501 213214 224198 159186 50663 -31098 43050 89685 155184
17038 155184 107608 -10248 23325 23776 -12807 -9288 13512 58137 24249 49551 -27260 6259
17026 6259 126199 203948 237228 253646 163122 178026 130065 121165 40870 81150 55905 -17323
17014 -17323 -140303 -262459 -183323 -108411 -14796 -31892 -66534 -87453 -224342 -127331 22098
17003 22098 79844 89970 36186 23044 -12921 18155 6658 -63565 46649 2540 118168
16992 118168 77596 58356 23365 46574 32763 -55729 -6029 106955 43110 124022 182349
16981 182349 173758 104558 37548 -40404 -52809 5819 174305 298185 114750 18553 -25
16970 -25 -66887 -68263 -13794 -3934 35014 85091 109294 109342 -94266 -103481 49614 118101 169884
16957 169884 307714 419970 369786 385854 261158 151869 149075 75928 -44440 -118594 -214383
16946 -214383 -229771 -14105 81171 -13058 142433 181582 85389 227930 289388 240387 213578
16935 213578 169682 72115 55923 61703 66865 74355 132060 108414 112380 104106 94265 77828 125183
16922 125183 68861 74290 40699 22114 -45013 32968 104374 2422 -70559 -171916 -170215
16911 -170215 -122777 12179 114353 226420 291677 329170 240793 159855 87277 42344 88404
16900 88404 191389 218250 184292 180996 46077 -34938 16356 -32184 -87682 4463 11937 -117097
16888 -117097 -175621 -121142 -66072 -40012 66847 138351 122214 27140 56428 121368 201284
16877 201284 233122 156657 134146 22729 94463 178807 53797 49362 176180 241880 256206
16866 256206 296982 268940 174253 186637 148816 208317 154846 192718 95052 16660 65933
16855 65933 36170 44759 116946 184589 84124 -2414 -24742 96127 140040 124672 73358
16844 73358 92701 286199 332094 122227 79562 99286 128462 99122 134987 260108 225237
16833 225237 32213 -29568 -86918 -66096 -57317 45273 49680 120358 130797 65741 44374
16822 44374 181909 268166 189468 72578 87375 95533 179217 165132 115317 110032 41270 93539
16810 93539 42240 -60751 35224 105496 91002 84278 205340 232421 124046 -81 -150776
16799 -150776 -262769 -136617 4458 51341 92339 273373 271970 367870 533052 701217
16789 701217 781555 901884 977444 1006510 1098137 1118665 951387 754556 516743 418082 415853
16778 415853 463257 389942 222650 182143 220441 201499 129897 9304 52675 132449 198467
16767 198467 100877 125442 195270 217762 173770 14174 40180 96166 89729 99580 204829
16756 204829 170573 267629 430934 366727 387284 425466 493506 243804 25695 107262 159615
16745 159615 250164 165737 -28549 -46433 85881 119292 140381 74032 15777 90049 83118
16734 83118 -13225 -74160 55126 141902 192662 179501 144619 259518 305448 232357 328131
16723 328131 376361 405233 317936 111541 -21704 29307 89016 135485 140526 129463 215173
16712 215173 199689 187372 154299 155450 117340 255849 105597 95708 89061 170103 186653 218746
16700 218746 359247 474560 399932 367182 336462 493692 410505 331329 330108 233401 334054
16689 334054 477810 539029 437766 445498 491294 462954 466043 367882 262304 49375 -59467
16678 -59467 -10748 27011 77971 135484 101419 13872 42408 89734 141196 219577 197274 175795
16666 175795 131751 153041 273328 238474 194642 125873 18509 136513 253287 226824 256459
16655 256459 190638 162354 195417 58828 10767 119521 91973 -41477 -21458 21282 -52930
16644 -52930 155190 162872 264053 122545 29597 98492 66975 9066 -84028 -58252 55761
16633 55761 171703 224120 387822 405677 487254 481149 458257 366244 148634 130767 256914
16622 256914 409466 437078 455753 424367 360903 305387 247823 199449 276508 149817 85794
16611 85794 200415 399797 345292 285118 395580 483873 358357 320789 248318 309126 290013
16600 290013 192055 300277 295307 323654 397347 302814 153581 221652 295808 380744 366359
16589 366359 324276 272738 218835 292676 301544 231018 299496 400072 395588 424808 326693 431031
16577 431031 506105 492184 446895 354902 392757 538903 617084 536977 470989 466321 427274
16566 427274 353141 333286 449092 565624 591078 491675 495286 603796 586435 645107 816836
16555 816836 802900 732168 1011774 1178083 1183015 1202804 1282961 1163172 976619 792531 678093
16544 678093 530817 534784 558798 544192 507508 493857 343900 251832 247599 340909 402667
16533 402667 413857 317021 340190 445540 500925 484875 447521 603982 705110 645166 635115
16522 635115 582579 526488 597141 535694 395431 485844 579594 683049 713095 692819 473470
16511 473470 555020 535774 476349 516367 600167 656869 795018 799199 747862 752468 744675 627617
16499 627617 578241 624762 575031 456870 579088 601174 679020 713945 696959 650309 657798
16488 657798 734749 854288 935483 872037 715623 673214 627121 584879 578914 690775 676995
16477 676995 558816 670292 684488 676305 826431 778498 729068 771008 841267 896909 927361
16466 927361 771424 784162 855036 918341 942744 856512 961937 1085015 1083804 969405 808413
16455 808413 831652 909372 836807 832037 934308 1018118 1080601 1063734 1183269 1276177 1269738
16444 1269738 1230574 1385954 1624619 1714439 1756844 1677621 1626290 1478675 1338099 1332786 1391053
16433 1391053 1517677 1439198 1396677 1246749 1309081 1384170 1434650 1485436 1534729 1462004 1433503
16422 1433503 1517813 1517353 1563080 1611931 1626209 1555139 1618958 1697712 1725782 1734463 1964477 2047233
16410 2047233 2055320 2036076 2034812 2130263 2166208 2007471 1925964 1961623 2014389 2001356 2078225
16399 2078225 2135639 2015436 2008702 2179084 2246042 2287642 2198853 2278816 2315777 2542352 2526855
16388 2526855 2524936 2571714 2631641 2749729 2789413 2718570 2840043 2801357 2831234 2787973 2745578
16377 2745578 2776329 2959239 3151705 3288765 3282548 3213753 3157238 3288048 3311055 3311959 3497717
16366 3497717 3610184 3755680 3845868 3851912 3886174 4003525 4125095 4254251 4310680 4425553
16356 4425553 4526454 4729360 4789829 4975010 5032547 5025188 4964885 4947503 4987408 5202263 5455515
16345 5455515 5722272 5847812 5986599 6262595 6386493 6425028 6720179 7058404 7156819 7269497
16335 7269497 7468800 7767498 8047662 8292960 8574039 8748333 9026268 9346383 9690675
16326 9690675 10011911 10436694 10928232 11240372 11558306 12050575 12525024 12786307 13107112
16317 13107112 13626311 14224972 14737063 15287594 15838893 16348246 16853787 17680461 18392687
16308 18392687 19197778 20014105 20697432 21512359 22497885 23354118 24197174 25182706 26331125
16299 26331125 27655654 28974728 30299777 31748530 33290177 34878982 36487681 37913677
16291 37913677 39499157 41305888 43201198 45110075 47245359 49285320 51252177 53300222
16283 53300222 55376472 57311104 59245881 60913020 62614992 64232006 65669575 66895867
16275 66895867 67930136 68951694 69504247 69657658 69628393 69486497 68981363 68245294 67317205
16266 67317205 66138166 64783962 63379520 61870056 60160536 58397238 56615211 54654152
16258 54654152 52699559 50900054 49090842 47030872 45104798 43356946 41729496 40108644
16250 40108644 38336693 36754699 35230822 33775054 32418661 31185653 30050578 28833924
16242 28833924 27673454 26807164 25884051 24762153 23652568 22988305 22259778 21543657 20827944
16233 20827944 20036557 19311299 18676599 18149962 17607838 17141242 16609281 16107134 15807330
16224 15807330 15390343 15024428 14746758 14550629 14241541 13981813 13828806 13792781 13915308
16215 13915308 14034442 14046682 14010096 13832551 13633781 13518686 13319891 13085367 13077968 13370790
16205 13370790 13833159 14387573 15293448 16628702 18606944 21285836 25154694 30922746
16197 30922746 39544874 52170803 69897283 93482577 122241969 153037922 178866229
16190 178866229 196984083 209054953 204511908 177443246 145877761 118019777 90803194
16183 90803194 66896882 50033607 38964730 31656825 26811423 23254294 20629728 18387124
16175 18387124 16529496 15127349 14012151 13165926 12413971 11924536 11486880 11105562 10829240
16166 10829240 10534350 10155286 9735218 9181025 8691417 8025451 7481729 7022650 6509758
16157 6509758 6205996 5942683 5665445 5666535 5553909 5326271 5094198 4943617 4908740 4796796
16147 4796796 4531520 4437711 4352931 4420055 4532403 4330659 4165350 4055623 3998471 3972499
16137 3972499 3918879 3656284 3462857 3467426 3459648 3379719 3277517 3173158 2916041 2805275
16127 2805275 2852570 2879595 2921868 2867840 2672795 2487996 2416132 2314295 2320748 2438680 2367477
16116 2367477 2312969 2220501 2100315 1962291 1960847 2054944 2078685 2115155 2130734 2191719 2200448
16105 2200448 2067750 1983085 1998139 2085769 2010452 1904124 1878335 1920242 1929708 1881663 1758111
16094 1758111 1772680 1843816 1691477 1537518 1418592 1345152 1518451 1441515 1390454 1295152
16084 1295152 1367191 1277261 1313959 1328941 1316109 1251581 1172819 1213468 1300977 1209910 1196663
16073 1196663 1190871 1295239 1353019 1217266 1158489 1168378 1179602 1333849 1403513 1383751 1269909
16062 1269909 1186379 1167735 1278315 1157476 1055817 1070396 1138626 1084060 986542 855341
16052 855341 806469 736019 836663 988044 910652 926413 931354 888557 778101 604790 475751
16041 475751 453015 586055 680937 786531 844238 882073 874661 790362 788368 879864 885646 638680
16029 638680 628324 687295 684760 949767 1056925 856887 640420 560066 569848 581153 611141
16018 611141 706636 798213 940952 770329 660201 633661 552478 501780 574909 675911 701143
16007 701143 765445 837598 852517 867674 742366 783134 965467 908774 867859 915367 933640
15996 933640 981479 1011582 1148204 1285575 1247158 1022566 959525 870092 721665 642675 708385
15985 708385 606110 538732 683524 569332 430835 485026 589333 620572 734133 756868
15975 756868 596861 433940 363217 418941 526098 575809 539780 482478 358267 311595 438661
15964 438661 435327 330964 359597 428269 539829 605029 518787 422070 527178 603415 518356
15953 518356 468661 320163 202060 274234 345712 416555 347474 352445 500175 509211 509812 368531
15941 368531 308984 275314 282444 284074 262432 363532 399500 404995 352102 214035 299892 338346
15929 338346 274291 352664 213014 216189 316622 280606 215032 226413 325342 395803 449166
15918 449166 407105 508467 637115 564389 435684 394492 433557 314294 342275 337720 255549
15907 255549 198202 220547 293123 240784 221283 245008 250988 324230 327157 290779 209256 201647
15895 201647 173441 286930 317833 377193 408531 477563 622595 639689 485899 310437 181586
15884 181586 237553 333741 341069 409346 352740 238008 245089 269915 198041 230428 281183 395685
15872 395685 336202 207121 149557 -41493 -20434 81374 110675 30859 72016 138000 139709
15861 139709 74264 34575 116712 173854 211418 151679 126917 112217 109642 174996 161374 174732
15849 174732 244335 119344 176711 89029 96773 168468 188804 188492 115634 125143 183314 233399
15837 233399 322864 265687 246683 202028 167674 191491 149076 207297 221501 316474 369114
15826 369114 369398 237091 182900 58062 9609 142951 220150 387057 460534 400347 313533
15815 313533 249421 167089 235926 227990 206766 151095 184512 92054 -19399 -19476 -49824 -29947
15803 -29947 59276 30277 -89356 33907 203942 339053 341214 412947 359933 167548 -35081
15792 -35081 -17920 -34420 27451 103907 66453 102815 285228 361092 362072 273741 176910 54940
15780 54940 38855 12257 127200 262044 185465 -31484 -45826 -62994 -28989 52921 91716
15769 91716 182615 119359 88751 146733 321047 328516 154580 185014 127608 112927 165064
15758 165064 159666 207100 117226 116045 38146 77928 134400 210859 88827 66433 132688 201745
15746 201745 203383 262870 122930 -71114 -124276 -78650 14142 -16256 30533 -70365 -65749
15735 -65749 -44502 -25077 22480 -59655 -200276 -153825 138608 203616 193316 68699 -99368
15724 -99368 -146205 -45650 50115 84525 675 4261 36627 34960 137077 333518 408153
15713 408153 302160 173936 191416 269429 284905 231925 172517 226068 217367 125612 36059
15702 36059 81594 112670 38200 8277 -42254 -34726 -40280 -52098 4662 17421 55193 16694
15690 16694 34826 -16574 78587 166720 65206 35586 78112 85443 138158 152923 125341 86416
15678 86416 97733 121398 301203 357561 200543 51550 20948 -20644 58423 85597 -16276
15667 -16276 -74924 -70722 88918 230850 208009 86190 102236 55919 75108 146722 85186
15656 85186 -106399 -240822 -163357 -60325 -2838 -129897 -149755 -117103 -88307 -54557 79747
15645 79747 154659 36584 83966 212801 375740 491583 504632 361535 139714 -106110
15635 -106110 -153854 -150858 -118700 -180179 -49782 97910 14246 -74665 -98223 -180661 -133389
15624 -133389 -51707 25279 -1988 -79578 -110834 -77426 -45133 -65378 -2354 -59344 -36681
15613 -36681 23507 97210 72577 122614 147287 89663 77563 103214 57969 166074 204916
15602 204916 164196 99215 90795 233002 145278 54898 142446 208679 249408 259520 283835
15591 283835 391897 666357 1023026 1013300 1007776 1154369 1193813 1128622 1051116 921769 834931
15580 834931 577126 391624 379782 341002 289400 299456 182257 17296 -16744 40365 31033
15569 31033 -79444 -54165 65809 135794 102304 105762 116136 225798 291447 353768 289474
15558 289474 153608 197566 193888 233794 230403 174472 62684 -49069 30362 138534 177532
15547 177532 136669 105193 114153 220649 257711 178834 168442 220090 218700 42004 -112683
15536 -112683 -72641 -8378 -46538 66172 140280 136563 174584 49156 144487 129508 152175
15525 152175 169612 122439 126721 134491 216204 293767 246134 243146 188528 115127 112140 -39188
15513 -39188 45313 145971 129120 243981 348585 422239 463588 365788 183129 162354 168683
15502 168683 169843 217946 206221 205275 208983 171097 253399 364810 354228 231865 -27545 -162464
15490 -162464 -6774 96755 43199 61033 86717 -21259 -37719 -65035 -15522 12374 20205
15479 20205 211854 241589 236486 304577 271244 222342 150286 183706 195066 127879 163705 171132
15467 171132 142926 35204 -157965 -158760 -119145 -8125 -84922 -37811 -115440 -11420 91987
15456 91987 98409 30881 122178 124643 58316 -3547 60820 91118 132816 68602 187292 205227
15444 205227 170210 32286 40404 -58506 -36155 27038 90257 85380 776 -64976 17104 11288
15432 11288 -32804 2194 114860 77556 75730 91122 214711 210897 112435 165840 218191 99928
15420 99928 34104 93781 180826 234191 165219 -584 -67755 -92926 -77208 8860 59097
15409 59097 92958 87739 146491 57862 -44410 -87539 -115373 -116560 -165417 -52827 22231 76734
15397 76734 110821 105591 -22214 -104950 -151784 -161684 -56019 69873 -52451 -176361 -196533
15386 -196533 -226847 -125667 -209007 -36595 10946 -40132 -69389 -107897 -177758 -208504 -272390
15375 -272390 -282622 -270317 -204973 -60779 -112952 -234833 -222047 -196196 -58329 133211 243580
15364 243580 232631 56665 -125027 -162463 -34826 13412 6606 -3749 127918 65150 -58629
15353 -58629 -55510 29675 126125 -23273 -55468 -68204 -9524 -59250 -123369 -94978 -66523 -24890
15341 -24890 -104498 -164671 -177650 -160223 -107232 52354 -16213 -110451 -119777 -101613 -169640 -108096
15329 -108096 63368 147819 162289 87668 -62872 -39080 32350 -81413 -12839 -29478 -29429
15318 -29429 6714 -54757 -94059 35950 233834 87882 -47877 112862 121692 122765 15108
15307 15108 -11055 -96847 -119652 -91575 -34735 -46186 -16381 125626 129058 -17910 -60408
15296 -60408 -179792 -162120 -45127 -16236 -48062 -130854 -50040 -25017 15943 -14307 -13729 55339
15284 55339 -70667 -108720 -245317 -241334 -61715 3130 -2239 -13267 38332 -1933 -137654
15273 -137654 -186130 -197444 -299366 -193887 -113323 -90206 -45507 -58963 -59522 -156683 -139275
15262 -139275 -51155 9527 -11313 -57496 -77874 -158694 -253293 -241989 -234799 -192496 -164188 -2820
15250 -2820 110747 197466 212837 122388 -33766 -71193 124654 248560 127283 23910 -91104
15239 -91104 -52599 -95085 -120584 -42074 111892 94543 30262 7894 25477 -2158 -75893
15228 -75893 -22242 -224007 -241752 -93976 -75281 -129412 -132599 -154992 -43200 -18795 -71918
15217 -71918 67522 90926 3796 -113813 -190927 -153884 -102654 -14547 49659 144321 183539
15206 183539 135019 6884 -1101 13781 -5272 2989 -18926 -68863 -75592 -56287 -74364 23546
15194 23546 72128 -22880 -177381 -226475 -41584 41928 112155 20466 -48675 -64530 -21377
15183 -21377 -12363 7407 -26061 115645 171343 159117 237270 295872 303421 282685 249309 192549
15171 192549 52225 -156121 -239715 -242107 -309437 -325513 -270688 -86775 92317 139451 230315
15160 230315 257876 275877 343674 346186 228093 -18484 -48555 112438 304841 359641 318905
15149 318905 204497 129985 58566 15701 29897 -121337 -152127 -157091 -81737 -70194 -9114
15138 -9114 95295 198349 137532 97448 90212 60195 152376 138229 155594 204248 313793
15127 313793 306653 177117 151962 30218 86480 185128 221034 262496 302144 112289 55430
15116 55430 115940 11266 -133007 -108825 -131146 -121181 -54281 -58550 -47691 -74223 16116 105596
15104 105596 16780 12432 19577 121886 126448 43453 10742 21212 -77127 -167643 -166166 -177745
15092 -177745 -134049 -49944 -73445 -82638 7392 -15542 2822 -33945 -150151 3650 76312
15081 76312 5347 17684 -17535 -194246 -309346 -456838 -452491 -258509 -164988 -54542 -138661
15070 -138661 -254167 -298275 -284665 -222307 -126745 -184082 -161057 14764 114171 80019 64558
15059 64558 104567 158785 178937 138944 59742 -18082 -88394 -109636 -222695 -254987 -112731
15048 -112731 33934 58563 -4403 -1820 91493 69982 40713 74880 12719 33198 -47424
15037 -47424 -62399 143684 102396 -164318 -230254 -138726 -15092 123808 11433 -96253
15027 -96253 -151448 -136487 -118145 -209767 -83269 -42463 -8033 -103445 -50584 -37767 -42042 -13713
15015 -13713 48468 -2474 -49296 -197316 -181849 -108908 -38475 -69990 -163903 -183350 -63904
15004 -63904 10704 -180843 -148731 -102984 -95076 -109880 -89137 -121670 -83463 -30299 -34374 -67582
14992 -67582 -53687 25501 107669 158383 139383 3003 -100174 -16766 108326 -22523 -81781
14981 -81781 -62020 -144935 -20182 94685 143674 149286 204942 198631 102306 35184 -117879
14970 -117879 -134639 -35906 985 -24350 -52683 -41422 -78028 -97528 -52196 -52040 -37795 447
14958 447 37453 45886 104398 15959 -20604 -156408 -110777 -111385 -107584 -19290 -86775 -81119 -73609
14945 -73609 -48454 -100386 -6807 20092 -6314 -7815 73854 159697 68877 9248 -121501 -64819
14933 -64819 -53132 -152626 -172190 -174590 13100 38625 77873 156908 283643 350675 227977
14922 227977 96032 37238 21813 39126 119202 25423 -44804 -173140 -202745 -33387 -66002
14911 -66002 -43939 -33884 -1789 89308 49613 -242003 -360132 -381479 -268831 -92757 -178487
14900 -178487 -267830 -386374 -276002 -124762 -52136 -6392 -16540 -91610 774 137783 84379
14889 84379 31370 192202 41425 -107981 -41028 37276 40339 295 2705 -67218 -66051 -21093
14877 -21093 -1256 -26813 -142243 -129903 -10271 44496 109351 92058 43046 27763 -96128
14866 -96128 -143438 -136270 -115763 -2868 10845 13025 -83132 -46325 -80630 -130018 -19927 -87763
14854 -87763 -62364 91270 61308 -107659 -156496 -260970 -178554 -75426 -70460 -115410 -90767
14843 -90767 -123578 26849 -25247 -172752 -257352 -40747 64688 20725 -700 -57469 -51467
14832 -51467 -42724 -64087 -117322 -141286 -107504 -203356 -298713 -198431 -87887 -58445 -158564
14821 -158564 -139055 -90440 -98335 -167620 -225231 -334914 -267096 -243321 -152770 -95618 -190702
14810 -190702 -163873 -53357 12604 -29676 75560 -1982 -147369 -274658 -273412 -148110 -52916
14799 -52916 -33711 63487 54074 131015 97573 69207 47370 -74902 -191617 -112358 -101177
14788 -101177 -133651 -181954 -256111 -86163 -87982 -143965 -182515 -175126 -67432 61857 57715
14777 57715 -31955 -123843 -250435 -264917 -138393 -2801 38404 80305 131236 187622 268132
14766 268132 303142 288200 71977 61979 131119 161827 119877 266922 239283 40600 -172323
14755 -172323 -128133 -121442 -135678 654 136677 75257 30898 88621 124603 7485 5727
14744 5727 111303 237894 263955 193180 36611 7199 -4427 -122883 -125591 -9324 -54993
14733 -54993 -112425 -99250 -104058 -102100 -70224 -43523 -115516 -208573 -253130 -134405 28697 154229
14721 154229 144249 294167 231005 5331 -152816 -133019 -193686 -46811 161654 115497 36984
14710 36984 19900 152438 167337 138368 50868 -197919 -420366 -406200 -188529 -59448 53695
14699 53695 12622 22255 23285 67612 61816 -18502 -57921 18853 60126 156476 96055 85223
14687 85223 33127 53885 64700 5489 -22630 -50073 -32587 -17119 -76886 -64518 -62828 106384
14675 106384 210631 4385 -27036 -53215 -159988 -170193 -78633 -28418 -224091 -349967
14665 -349967 -190783 6677 -40941 -94204 -80292 34171 44151 140763 129438 236462 229950
14654 229950 232052 184725 126818 55914 -64513 99449 191222 224732 178306 42498 -120887
14643 -120887 -126245 -49829 -22805 -58886 -133139 -203998 -259688 -167932 -132543 -66091 -79354 -75241
14631 -75241 -59052 2660 6116 -13154 -134169 -315887 -312473 -250935 -165968 -153095 -106635 -162175
14619 -162175 -181636 -101527 44908 108396 27114 21095 135835 90339 -21700 -132507 -91699
14608 -91699 13136 84886 88655 57868 -40523 -64726 -1952 20634 -55102 -60901 -59666 -149642
14596 -149642 -51600 16429 -40997 -107357 -108519 -88598 -73943 -9270 34083 62150 -9318 -70082
14584 -70082 -79552 -30917 1016 18700 -55564 71345 -38318 -78093 21197 98248 -19677
14573 -19677 -101787 -107082 -330467 -255345 -122069 -69735 -83953 -121285 -42946 -20255 39486
14562 39486 15180 16644 -43704 71234 146734 51416 -5176 -73798 -143859 -106487 -108545 -32287
14550 -32287 -5150 15639 -140290 -208682 -95219 81052 251959 174626 123763 213184 209202
14539 209202 95899 9484 -26069 -78705 73206 115473 -59916 -59283 115589 45531 -15027
14528 -15027 109940 113175 4013 -5610 -64341 -25914 -55157 29948 128767 156196 286424
14517 286424 239056 212351 100413 -35672 -38788 -190505 -222676 -213439 -215874 -97207 75951
14506 75951 11668 -22583 13704 149604 115159 -19054 -51079 -75131 -109079 -54762 -828
14495 -828 5245 -124355 -208857 -135305 -155358 -275473 -271882 -203176 -94459 -48179 54528 159879
14483 159879 143403 103972 27198 -117777 -83325 60514 3270 29837 191469 133760 118632
14472 118632 39478 -42292 -28488 -62781 -154651 -179162 -291580 -243353 -159310 4879 56410
14461 56410 102021 98678 136121 88760 44739 76130 80257 9965 -20202 670 -7751 -51386
14449 -51386 -23567 13825 -11757 30938 7929 22766 88803 -19561 79885 34357 -92074
14438 -92074 -154514 -79583 -80327 24888 98569 -54871 -268341 -209812 -101134 -131426 -218969
14427 -218969 -145819 -169662 -334232 -326542 -194571 -136617 -139647 -85131 -69469 -54240 110403
14416 110403 94784 37310 64651 -89362 -134601 -82917 -100473 -219864 -87423 -42628 -44171
14405 -44171 19968 -65079 40617 156525 95737 40072 10324 77750 198837 67152 18990
14394 18990 32022 141273 -18960 -87923 -34761 78432 159379 87158 28976 17767 13267
14383 13267 -13268 -86107 -132383 111440 84006 -107589 -214873 -46963 36513 91094 86810
14372 86810 73949 -42569 -178343 -219273 -226974 -346531 -278734 -186352 -5601 36162 496
14361 496 -158903 -166637 -136960 -164817 -119881 -140250 -174525 -158615 -166091 -163824 -117477 -110044 -124631
14348 -124631 -184415 -189343 -127257 -116583 -125945 -33082 -788 41963 -60257 -73595 -56136 5688
14336 5688 113719 184610 193662 31965 -23839 -62569 -140596 -161220 -167284 -141426 -202972 -286724
14324 -286724 -177139 47981 44316 1144 -29678 -146108 -152016 -183480 -300936 -228997 -173989
14313 -173989 -131955 -166957 -4457 61431 27888 2577 -6984 -57721 -162990 -200848 -135165
14302 -135165 2861 94875 135021 14020 -60855 -113559 -61734 -51884 105913 72959 -31084
14291 -31084 -68957 -73476 -155646 -152675 -136150 -57873 66737 -21641 -37033 3761 -57459 29315
14279 29315 155235 25533 -116414 -86459 7781 76574 64337 31950 119270 114221 -3265
14268 -3265 -159696 -89684 -14817 -76366 -58990 103488 180173 122868 -68404 13179 -47558
14257 -47558 -169266 -47787 65710 -67632 -94174 -88836 -172402 -205594 -156004 -46465 -50986
14246 -50986 -120536 -103931 -2947 -16094 27013 43246 -8686 -2062 -34156 -37125 74111 143279
14234 143279 24733 133356 213797 52465 -10465 192 94144 94706 72094 10120 -21414
14223 -21414 16702 8468 51108 -42721 -71131 -134946 -123196 24274 -78204 -93458 -27348
14212 -27348 89588 129108 98941 137202 120001 205849 156892 -43321 -30002 38109 103831
14201 103831 152047 92386 121121 203851 224321 250385 50082 -150679 -39081 -25086 -27516
14190 -27516 65104 30138 -96640 -66680 -49071 57159 63053 -63445 -133327 -89577 -45232
14179 -45232 -10900 -139979 -136615 -183102 -275918 -277247 -145078 -58259 -67038 -105791 -175777 -152252
14167 -152252 -165433 -234391 -301032 -135183 -139412 -79243 -37889 -152973 -237250 -269238 -57802
14156 -57802 126395 111181 70554 102962 141514 52579 -70968 -73858 52726 -18921 -114696
14145 -114696 -106733 -201065 -258964 -89032 24594 17203 -6384 145066 271867 272539 166636
14134 166636 190760 163214 120682 133375 107889 92033 632 71654 -118847 -79944 67222
14123 67222 -92786 -14684 47588 85735 76721 -87085 -73083 -19946 -42389 -27977 103891
14112 103891 -16251 60142 128084 214258 256514 170829 270657 206383 160740 182614 113139
14101 113139 151706 71750 79104 34323 12469 90477 214165 234846 116557 -9724 -23624
14090 -23624 38820 -58819 -80045 -155949 -98285 -197523 -222468 -172224 -137803 -65695 1344 -82778
14078 -82778 -10705 58670 -30640 -76680 -88188 -69855 -162799 -236295 -317943 -161442 117754
14067 117754 104051 40220 -82102 -212930 -235938 -72225 -82837 -77958 -29069 101422 18192
14056 18192 -95790 -33934 -13371 -86211 -145628 -116230 -3617 37106 86044 -10519 -165265
14045 -165265 -48340 68927 30453 69014 104885 99966 111036 74887 114355 241150 290401
14034 290401 74125 -100293 -71234 -169012 -99490 -5034 36878 100296 50744 37393 37546
14023 37546 142685 108822 -11440 -38077 85551 -72524 -262170 -132478 94813 113409
14013 113409 42990 30043 -87070 -115337 59346 65957 -4854 16030 -74046 -120376 -174179
14002 -174179 -162278 78242 165237 38029 -26375 49101 -37617 -39989 49697 173834 138340
13991 138340 68823 -143870 -145755 -55063 -40492 -14750 -50583 -261899 -257410 -57588 80083
13980 80083 35422 22916 -37355 -149602 -191687 -54772 -102536 -165092 -117730 -105412 -117603
13969 -117603 -119722 -106712 -70721 -100261 -111518 -28244 128261 57156 -36590 77717 114514
13958 114514 80174 38798 -46389 -95818 49804 42964 -21448 -14741 -38884 7779 135362
13947 135362 101650 107205 25787 -109732 -74217 86415 129348 134261 93113 118910 162519
13936 162519 50442 37062 104483 82955 29284 71617 61681 8043 73002 25453 -46621
13925 -46621 75321 150716 41679 44711 99022 170391 75739 -42369 -84236 -13657 53824
13914 53824 -63384 -110316 -185556 -115133 -5847 -25841 -118375 -242053 -177970 -265642 -222465
13903 -222465 -106166 -49943 224 38725 37659 15587 -40353 -30975 671 -39957 -68801 -58924
13891 -58924 29389 170767 146179 25613 -57984 -7844 24695 70167 137198 227735 87117
13880 87117 -662 15547 121602 49379 -106253 -247295 -296146 -202520 -63783 -36872 -4491
13869 -4491 -31131 18355 44814 -30204 -147191 -217533 -254252 -157088 -74138 -54632 -185953
13858 -185953 -339671 -326269 -200090 -60800 -8050 28458 -149124 -118534 -53791 40188 25144
13847 25144 21675 92775 29936 -19023 -130560 -82489 -47778 -8743 -112105 -92176 5879
13836 5879 -3567 1418 176186 148391 -5505 -32066 -91111 16331 -22618 -17437 -86311 -28976
13824 -28976 -78230 -165335 -69007 48597 69278 -2598 -210065 -239421 -174604 -170386 -46613
13813 -46613 -41891 13641 126260 128797 121354 32357 56872 1692 -103528 -117515 -64413 -30813
13801 -30813 -108723 -167165 -75931 -20733 19907 75373 96108 154343 119433 171899 171840 61080
13789 61080 10732 4835 56536 -29943 -61988 -89221 -24796 -53481 -98915 -31264 -13945 -42019
13777 -42019 -38607 -79801 -47767 -38602 -47173 -40501 -11030 -111054 -50849 22561 -77618 -153609
13765 -153609 -88156 -186251 -180793 -91093 -70845 -33468 -11531 35141 -25167 -120742 -38131 -78410
13753 -78410 36209 -10443 -96700 -76934 82146 198011 223030 187753 -11152 56245 89637
13742 89637 -15181 17609 34366 -4552 -55584 -62453 -135264 -191632 -24369 153268 167648
13731 167648 109451 190809 210096 195336 208676 169947 74134 67675 168639 82106 -11985
13720 -11985 -47665 -264114 -397235 -288124 -98987 -109034 -178331 -158277 -60303 85242 117872
13709 117872 -6317 37551 -33825 -200479 -178312 -44711 116373 190199 125510 -9272
13699 -9272 -112706 -102037 -44895 -20921 -6816 -21412 20737 77025 81532 75351 -26798 -85578
13687 -85578 -154657 -78371 62602 28815 49541 -23126 53828 27218 48697 89406 158645
13676 158645 218486 140429 29779 -18373 57025 131672 76565 -28804 -39203 81120 77950
13665 77950 152784 37010 -51263 67596 -29702 -19149 40787 66317 10709 -47151 -90076
13654 -90076 -72963 61481 60561 87038 178134 137136 235081 249036 81208 -82668 -223536
13643 -223536 -228401 -137288 2501 113127 189070 129960 179682 199739 -630 -138725 -130268
13632 -130268 -87409 7269 -54834 -63938 -105128 -64235 -17797 17342 66642 80133 54807 -55864
13620 -55864 -36096 78295 206313 71525 -119983 -227430 -123253 48768 100860 11898
13610 11898 -175874 -189371 -70570 37406 120214 198772 244212 164573 81206 142916 50109
13599 50109 -107893 -122734 -56269 -39282 32921 -5558 -34609 81793 121247 53279 147334
13588 147334 169458 125978 5154 -144123 -152066 -141754 -132654 -19403 35661 66566 76989
13577 76989 -4633 15010 67872 79320 86474 107477 208469 301061 404408 416622 386912
13566 386912 248878 21017 57371 67134 -7353 58924 186194 223632 178954 111425 -16246
13555 -16246 -66461 -9149 -94969 -126763 -131740 -242042 -166920 -45915 85954 182941 181430
13544 181430 143019 51660 -127699 -116582 -105249 17964 26625 -143818 -85036 -1338 92969
13533 92969 175181 274301 160119 105339 172145 304458 430407 629259 809887 991741
13523 991741 974090 810498 489728 177572 166330 221319 153005 43202 -181 -57474 -120769
13512 -120769 -208072 -258334 -200268 -185919 -89284 -83774 -118129 -67509 7879 34170 -77704
13501 -77704 -180337 10697 108155 125475 76446 -66894 -134048 -128912 -158611 -113392 -52006
13490 -52006 61634 143038 208067 177069 131962 109914 312643 439379 615985 827246 938964
13479 938964 1105769 1312708 1213895 879001 573102 410464 398486 390718 272506 77006
13469 77006 84927 17622 48240 98301 181795 148466 75347 123515 146261 121976 80307 130718
13457 130718 72287 -23775 -89192 23003 41852 -50515 -69694 -43546 -43334 -20448 82231
13446 82231 19528 -58723 -103685 -156879 -184030 -332862 -270334 101735 326092 339332 306201
13435 306201 265931 248210 368267 211099 155616 178302 116867 171933 223290 265739 304276
13424 304276 223892 6902 -30011 38572 1941 -74019 -174892 -135654 -6027 129230 137118
13413 137118 80466 -86976 -131080 -63933 -162885 -223653 -216166 -217760 -100290 -35710 -41280 -143389
13401 -143389 -194014 -231225 -151046 -168192 -160528 -150464 -192745 -209911 -191485 -227752 -163854 -121918
13389 -121918 -89012 -2812 -89472 -192437 -324965 -341351 -327974 -234842 -249700 -78486 -116253
13378 -116253 -140534 -187939 -139275 -59941 36232 17769 50743 213366 196441 203975 104387
13367 104387 211230 222722 200981 148421 106399 6549 30028 124227 141370 166032 -9463
13356 -9463 -90631 21831 60962 -22435 -67594 -68781 -1640 45858 -52794 -104581 -60666 -34069
13344 -34069 128403 83829 71947 63037 28719 112343 102296 60764 -29271 -41882 35618 26721
13332 26721 18392 -37589 -45937 44333 78471 -54605 -159045 -189593 -94683 -63859 -23092 124643
13320 124643 235081 161286 177710 244739 340213 361984 246379 148892 -2305 109103 127419
13309 127419 198752 118570 -8430 -55278 64980 67147 26109 108332 114337 48116 -66375
13298 -66375 -92948 -122817 -179398 -25926 -51276 -70706 -41996 -226862 -140434 -89288 -110354
13287 -110354 -40787 6352 16839 -47621 -137268 -85366 5943 56209 -58336 -212094 -64576
13276 -64576 17738 52631 131255 164066 282598 253829 141533 89643 7022 70345 185655
13265 185655 139069 217663 134613 38997 45097 -12535 -161503 -155838 -36676 35654 50326
13254 50326 -69889 -17085 -646 72360 53521 63375 15883 -118296 -33987 85581 110982
13243 110982 190075 111094 155441 110498 163866 80155 67313 128882 189859 175708 168620 218360
13231 218360 329865 259782 263814 244224 319560 319720 226795 178325 35685 36923 103963 115928
13219 115928 140161 30172 -172798 -305039 -208512 -106707 -163576 -94741 -90603 -14686 99911
13208 99911 113294 56070 85692 -82508 -94967 -136179 -65173 -4210 49648 117373 168382
13197 168382 230710 129967 -16151 -5291 -3863 7357 64067 74844 84076 64446 159611
13186 159611 183703 119952 78571 64217 -12223 12593 82284 241526 275352 154649 174822
13175 174822 173656 192901 121362 -64988 59951 150931 91846 169831 137834 156526 180731
13164 180731 103923 65538 206299 158569 136525 72046 185893 313949 330512 273967 176477
13153 176477 229772 333648 263770 250255 316182 425503 375064 386517 418284 461518 657811
13142 657811 756995 648274 611876 613780 560329 574707 607921 638453 589937 559104 644547
13131 644547 768731 835794 910583 1020049 989466 928752 1043904 1221885 1398969 1720005
13121 1720005 2090846 2349496 2965243 3633992 4479098 5489774 6826425 8603153 11373218
13112 11373218 15738708 21927681 30057403 39284202 48766661 56773086 58887976 50699747
13104 50699747 38073033 27603413 20165513 15205145 12024115 10075261 8824287 7817172
13096 7817172 7095481 6371401 5774453 5347880 5002738 4733223 4517741 4286054 4116034
13087 4116034 4113885 4188031 4303699 4209909 4181203 4226810 4359155 4529284 4943924 5447952
13077 5447952 6020713 6754988 7791046 9184945 10814030 12952343 15791113 19604761
13069 19604761 24886941 32726394 45026331 63516976 88193165 117508087 148671357
13062 148671357 176307469 190457758 169063424 123947134 86453772 61407133 45485243
13055 45485243 35394096 28659508 24174790 21067627 18516151 16186789 14367176 12824346
13047 12824346 11696082 10703878 9957353 9315074 8836696 8403890 8100509 7766260 7568027
13038 7568027 7374021 7234693 7305029 7468171 7660081 8025341 8610464 9344483 10204385 11381266
13028 11381266 12939240 14866637 17493438 21259034 26397079 33844754 45573181 63186371
13020 63186371 87159047 116168594 147699738 176655471 194119047 178796734 133726134
13013 133726134 93313020 65878218 48274329 37130383 29814682 24991003 21692132
13006 21692132 18961919 16543171 14546709 12874722 11612302 10595327 9600071 8803580
12998 8803580 8227618 7773879 7394171 6929389 6604397 6251360 5975178 5658783 5584075 5629163
12988 5629163 5752750 5740109 5859946 5993961 6292437 6720162 7343636 8138705 9296637
12979 9296637 10903228 13453781 17330170 22959392 30599695 39767497 49631413 58784560
12971 58784560 64144509 60147161 47483008 34442295 24885745 18500435 14390392 11620489
12963 11620489 9890194 8653714 7626924 6738223 6021371 5452430 4888277 4429241 4030814
12954 4030814 3673310 3394903 3192074 2961903 2845336 2758548 2590374 2327295 2121817 2151693
12944 2151693 1987255 1779310 1757051 1772571 1757370 1761903 1661817 1535062 1569655 1567684 1467223
12933 1467223 1404211 1202187 1106651 1087773 1224980 1247591 1133421 1151680 1125423 986585
12923 986585 813421 850412 1080471 1086418 958792 861310 748658 560791 625372 647100 640179
12912 640179 623251 756360 697163 642028 677202 709630 743910 742259 633573 649116 653147
12901 653147 671719 657320 571874 533774 617020 597564 556045 463465 515634 611405 747552
12890 747552 788050 794221 803796 757570 688367 519789 535899 534496 417779 388780 335496 200904
12878 200904 180793 230732 326323 433416 497509 421656 412708 541322 418114 331116 207199
12867 207199 280192 383928 462943 434892 373492 427788 490779 451278 286797 241646 267006
12856 267006 201807 177451 311586 333773 360695 279941 367590 329041 261908 272716 192723
12845 192723 197410 244019 203928 232204 126140 29790 -15863 86203 99506 70044 94814
12834 94814 71714 127716 97459 184141 251347 286481 127594 119985 239305 282634 265714
12823 265714 127304 91947 32554 57886 106913 220379 276871 293699 273602 325166 228946
12812 228946 277348 339709 352888 222986 84919 57024 75149 69969 37729 131451 259084
12801 259084 134694 48545 -59795 80912 187299 181107 194634 169139 27251 -72041 1941
12790 1941 49538 42923 52710 98294 54705 115 78279 158962 261033 366118 353086 243575
12778 243575 109669 -36773 -64811 -58539 -32158 -17520 86000 169650 54928 71421 96654
12767 96654 169072 17513 -26332 -5285 57435 -89065 -22968 94134 193005 202803 227058
12756 227058 249792 246434 297759 305188 255004 36667 -47367 29381 42241 -44670 -90339 -47603
12744 -47603 64763 90027 71422 68212 77072 163913 190711 140670 153248 323647 273266 245487
12732 245487 144183 58208 87707 94135 31889 -68761 -151032 -90528 -47382 -112819 -130906
12721 -130906 -36266 -30819 -118739 -62525 63881 110924 62572 -7014 92782 -49812 -126538
12710 -126538 13459 44478 11690 130095 172283 102456 67554 94032 138094 233735 316816
12699 316816 366329 375795 255211 267297 231073 280186 281341 152991 50365 60500 -6040
12688 -6040 -55619 -45990 -36898 -68534 -131267 -188027 -121162 -168652 -177360 -37904 -158137 -125783
12676 -125783 30516 22838 59952 7346 74938 77223 73096 -83253 -20076 131588 201174
12665 201174 139075 188699 126590 119138 76801 143063 205309 143135 87932 86915 77305 -17132
12653 -17132 -61783 -31052 109341 77975 86150 30150 -27180 61312 -36209 -52600 -35155 62222
12641 62222 118441 199297 209436 237308 251516 332057 405651 150429 110373 87955 -2529
12630 -2529 33862 4122 60950 79734 187520 116393 119261 293076 305119 240328 230606 21341
12618 21341 -180786 -113253 -25383 126968 106957 -112551 -134276 -22438 60888 65436 58753
12607 58753 43826 -4571 -57244 -81644 17401 52919 177851 253332 215490 234729 312101
12596 312101 300735 227591 350531 636567 906345 928685 860571 689584 537120 347275
12586 347275 212092 236464 82949 -43622 -15932 113576 211389 144341 75760 17946 -51387
12575 -51387 -40631 -1621 42648 311 -141567 -105442 -57076 -34544 -25718 -13828 -2913 67827
12563 67827 214145 173577 134162 43176 -43112 20051 24435 73955 164242 229454 210469 229716
12551 229716 418259 575440 796386 1074132 1361217 1609327 1626604 1359935 1002934 799058
12541 799058 721225 678168 501812 329504 190696 192782 262640 324751 315597 216886 130700
12530 130700 57465 -5706 146918 256954 95528 60263 75438 257238 448758 294699
12520 294699 197478 189401 269728 348268 234155 180973 155540 183158 293194 214986 277111
12509 277111 285845 174155 149062 203274 397791 478279 396930 415545 532239 641758 558542
12498 558542 417863 239925 111654 127912 110690 75099 151970 184187 69318 -5467 -74728
12487 -74728 96291 307067 285526 258610 231443 181905 142983 131977 160515 22203 21151
12476 21151 85468 140807 181290 159291 145252 209454 119517 193270 300396 297425 306569 477711
12464 477711 523686 481129 411192 319402 224914 176375 123355 123518 175367 281708 217505 135827
12452 135827 266512 193636 84479 88654 114028 40289 108048 168978 117746 203128 228775
12441 228775 158312 202935 290756 262275 238916 296868 250188 173913 135523 86309 156855
12430 156855 135798 -31538 -175755 -228699 -239041 -270110 -350494 -209717 -73470 -44180 20755
12419 20755 43332 -88283 -177864 -101709 -45884 -123629 -164231 -20415 72667 222173 206877
12408 206877 43742 -108945 -243151 -262691 -260869 -274949 -220591 -180149 -119871 -116396 -88771
12397 -88771 -109705 -150081 -114427 -130791 -109954 -140184 -165859 -226493 -236908 -280949 -228837 -45747
12385 -45747 13282 -28041 -54116 -50075 -81056 -124609 -136558 -115064 26529 55098 -2168 -112858
12373 -112858 -44907 68378 57231 -52210 -97493 -208065 -137667 -95338 -125833 -244791 -267521
12362 -267521 -161899 -109284 -81563 -218478 -293669 -216508 -107359 -102938 38745 -2906 -125972
12351 -125972 -109242 -58924 -41981 -71002 -143095 -71577 53944 -133132 -229797 -214772 -193889
12340 -193889 -145444 -136223 -40001 88658 29631 -130236 -275582 -163902 -37301 -99456 -134298
12329 -134298 -85720 -108921 -210110 -254755 -155763 -123993 -169726 -92987 -18516 -130609 -227494
12318 -227494 -54274 107617 117556 82678 175071 202590 45201 -6983 45778 74323 56155
12307 56155 82193 54299 72062 -9500 -76552 -61777 -73445 126808 207096 150110 14700
12296 14700 30090 70385 137291 197232 209677 33522 -15015 51287 44647 -88595 4104
12285 4104 77838 133780 87191 -42788 -212511 -230659 -209423 -90353 -103668 -142786 -203553
12274 -203553 -201134 -104153 15664 90027 91643 99249 135524 98593 10094 -59314 137059 105675
12262 105675 -69963 19827 129902 104460 129166 90672 163335 187525 -10075 -28241 -83311
12251 -83311 -79995 -20800 -39951 -31899 -113409 -217355 -258291 -407210 -236042 -17269 36819
12240 36819 -127269 -236662 -350908 -206549 590 57901 13559 -75328 -33856 -51651 -132228
12229 -132228 -52387 -19174 607 -24034 50659 60731 -98240 -98107 -39927 -27101 -78685 -68454
12217 -68454 -109981 6273 -22094 -56648 48333 95059 -64402 -65565 -37222 -117610 -229999
12206 -229999 -212510 -154959 -18658 11789 -20974 77207 212286 253845 230212 126149 -45521
12195 -45521 -146084 -189965 -244224 -124449 -205917 -353505 -308672 -158816 -13966 -3610 -7219
12184 -7219 -22518 -100594 -125969 -161707 -54337 -25914 -34835 -24333 -41852 -54660 -52262 -73863
12172 -73863 -71449 -92443 -124124 -88902 -121128 24024 45274 143948 178400 219177 219674 165575
12160 165575 70113 -20859 100850 203132 72633 13062 -1435 18021 -46883 -31304 147760
12149 147760 141891 -23597 -17394 57405 58724 -80638 29668 124361 64474 -127957 -65567
12138 -65567 -42279 -183884 -214949 -99981 -39210 -13558 -121207 -20780 121230 43650 -149089
12127 -149089 -214468 -61891 68272 132983 102215 56135 80147 37641 53555 234342 343627
12116 343627 297737 198218 238195 125637 24971 79763 96834 181742 267182 308913 215306
12105 215306 62358 6558 -101013 -149072 -89457 -79654 -109721 -83152 -128610 -149985 28297
12094 28297 105177 -11159 -95851 -67543 -157245 -254834 -191400 -96127 -97024 -70571 93957 -42857
12082 -42857 -54609 -48892 10078 -79965 -97694 -35624 68189 43954 103815 88759 -62277
12071 -62277 -92627 22312 249441 255551 180909 263617 301018 133169 -74711 -135565 25937
12060 25937 113132 -22721 -194594 -77440 -6674 -41121 -62484 -160311 -230937 -140583 -100831
12049 -100831 -133141 -1760 -8443 75834 22980 19845 30542 115505 109414 79422 76819 199544
12037 199544 298938 234742 164847 112154 102833 97959 147309 -13793 -197912 -219031 -102079
12026 -102079 -118424 -40576 55238 95293 18577 -105102 -63988 94824 239295 163162 77075
12015 77075 53261 42952 17169 2175 22227 -17961 -126095 8527 83494 -64950 -9318
12004 -9318 21650 -54356 28877 3268 -46439 -60924 6404 42846 43345 117756 99822 51049
11992 51049 16866 -67096 -63928 -88673 -229 -35287 -209225 -199489 3546 47793 137733 -16679
11980 -16679 -23700 -52381 -65427 -113275 -141464 -56405 -12435 -34597 -104812 -48220 58141 107272
11968 107272 97702 55510 -40011 -104386 -115341 -23721 -26371 -66217 -43098 82081 127516 -9466
11956 -9466 -144967 -117585 -72451 -17021 133998 244405 210606 -7405 -149205 -220178 -114182
11945 -114182 4223 -21492 -118672 -123949 38532 151816 74172 -54211 -137982 -84276 13094
11934 13094 53671 33865 -34040 65081 224290 375518 211194 105969 -7107 -105093 -11413
11923 -11413 38568 73711 -2824 -646 -13129 -59857 -22008 22854 94222 67792 12657 -77710
11911 -77710 -87800 75710 84544 115612 200301 156618 -49268 -82795 -16479 58391 84688
11900 84688 97731 125890 116771 106935 195826 38681 19250 1505 42520 69487 92204 -26684
11888 -26684 -172425 -63563 -57429 -2071 -59703 -188700 -50805 -131315 -111361 -17872 -7348
11877 -7348 -24396 -25821 52253 70833 21823 29072 -70111 -108795 -111858 -67054 40081 -34421
11865 -34421 -5037 78205 14037 -61212 17855 8886 -203384 -219814 -299870 -342513 -58596
11854 -58596 104753 -10222 -122025 -19989 79483 70956 143236 292077 270874 231754 -10073
11843 -10073 -85846 -127840 -63624 -100046 52114 273028 180117 -15501 -50162 20910 119079
11832 119079 163420 83189 27261 69996 19512 9391 -19039 -54353 -53987 -175213 -236490 -174512
11820 -174512 -98627 -45768 42086 211157 286563 100817 -15559 -35428 -11337 -12309 -5874
11809 -5874 -123582 21832 -21229 -183443 -177274 -138124 36963 52810 -25879 -8877 -4446
11798 -4446 123630 137300 24927 -41143 -28842 -53273 25322 -101429 -75432 12668 -19020
11787 -19020 -68822 -18652 45458 94297 186559 24166 -53366 -37605 15643 -62612 -61467 -34585
11775 -34585 -47031 -26962 32422 90573 15447 -21869 -56099 12119 207924 114369 174909
11764 174909 273742 190096 95094 54925 -89107 -60441 70872 119423 10812 -60717 -106266
11753 -106266 35583 94006 -11320 -42718 -11009 -2351 -156026 -214046 -51216 159081 114310
11742 114310 39007 -55350 -106553 -214113 -263014 -380749 -466540 -393297 -299319 -330813 -346278
11731 -346278 -341606 -289932 -181748 -129107 -212958 -159926 12312 124634 183726 161613 102407
11720 102407 91824 1718 -71914 -105329 -38868 2728 8048 -54334 -111391 -81169 -161046 -38133
11708 -38133 48588 -49629 -214812 -163921 -135233 -126174 -39047 37471 -30664 -66418 -142610 -217423
11696 -217423 -116004 -14538 -18007 -169488 -131550 -179530 -180082 -121068 -62204 -55805 -142018 -102092
11684 -102092 -44049 -117981 -103620 -90905 -79155 -66642 -84039 -177094 -160025 -130727 -91777
11673 -91777 8564 24408 -111026 -190997 -148744 -91738 -28874 -98609 -59903 72472 3161
11662 3161 11690 105172 53094 104424 83839 56830 106795 165293 134323 143833 15504 -23335
11650 -23335 -34431 -9312 -21296 -12760 -12308 -489 38252 738 -105086 -153223 -196595 -190806
11638 -190806 -120925 -80415 -3657 118072 175240 199558 189936 37652 -85886 -153085 -100594
11627 -100594 -179421 -142310 -143799 -259103 -255717 -155561 -213698 -423127 -376599 -257694 -143702
11616 -143702 -94295 -149160 -291077 -342863 -286972 -276853 -182172 -74811 -106285 -64099 -20706
11605 -20706 -118111 -146587 7414 127288 141059 135816 121181 25423 18041 53705 -4739 -198675
11593 -198675 -186062 -100876 -149358 -183777 -88997 -6024 10073 -31510 152306 347168 283648
11582 283648 139286 -31082 -143481 -133127 63235 150852 -91269 -171399 -45850 -8438
11572 -8438 -144422 -196960 -147846 -34892 11035 -145731 -114139 -24232 -21542 -8104 174145
11561 174145 115180 24983 -18093 -54508 -121111 -210405 -762 -97946 -233277 -206822 -223057
11550 -223057 -202877 -207149 -349515 -475005 -413217 -393574 -193219 -155502 -103001 -88532 -264267
11539 -264267 -376513 -331286 -207970 -82185 -82220 -14734 -8832 -41525 -109246 -102941 -74465 -36846
11527 -36846 -52840 -58352 -67072 -75670 -133871 -84744 -20095 95629 67751 11759 -11283 -37913
11515 -37913 227 -37133 -79770 -124902 -168149 -203800 -299519 -263691 -209901 -164879 -80521 -65950
11503 -65950 17966 -29680 -203618 -212654 -184358 -158561 -69038 63680 178689 200300 199908 156089
11491 156089 109193 58404 154707 81032 -28969 73368 236088 129412 160818 120309 41356
11480 41356 -50068 62216 39032 6761 83917 110333 41306 6601 122848 73716 86228
11469 86228 63308 15315 5063 16677 57966 241551 257211 224963 150646 113859 56050
11458 56050 -3813 39912 -55338 -56348 -75509 -7537 129732 142188 128701 117400 124298 149518
11446 149518 91559 129198 36649 -114642 -95726 -65686 -71809 -199995 -285518 -276517 -299950
11435 -299950 -128793 -3541 36173 9811 -67950 771 52562 55147 -92284 -127100 -34084
11424 -34084 -39947 -27164 54628 5385 -76701 -49830 68483 139252 166467 75856 -31633
11413 -31633 -90747 -89572 33475 65304 150049 254233 272940 188548 84256 -70460 -166165
11402 -166165 -223490 -124758 -125366 -39112 36752 97582 112856 -142884 -153125 68193 34866
11391 34866 -10298 5109 -83977 -115598 -96681 25649 -31549 77796 77056 -23637 -25689 -44288
11379 -44288 -42270 -85517 -140433 -121262 -10094 133002 175579 46875 -117711 -134391 -169108
11368 -169108 -67524 1461 -28705 38537 14905 -30723 56057 82167 145119 111386 75249
11357 75249 60667 137292 120766 118951 123508 55469 13947 -66089 -110364 -40739 26268 -4261
11345 -4261 54398 229039 256152 178676 -242 -139695 -157781 9869 76820 109711 82820
11334 82820 63255 116242 136586 221314 234032 55740 67010 61725 83334 167781 177361 206498
11322 206498 116015 65118 63343 197174 157264 105323 110178 144681 152029 73547 48461 210470
11310 210470 276773 255490 292761 359283 251314 288398 297369 302688 247200 276087 361340 415405
11298 415405 243267 224323 150007 95704 43427 -144 113171 46420 -29319 -65287 -126916
11287 -126916 -176049 1841 105729 53857 114788 143769 156921 147878 66512 -40744 -86355
11276 -86355 -80412 8999 -27745 -15674 -69332 6871 34352 127774 140762 -18105 -1541 27037
11264 27037 149091 224443 182854 243922 206768 130570 40827 16218 -79672 -157950 10431
11253 10431 43144 135351 100175 14048 37187 81085 66296 78988 84146 48000 -123955 -159679
11241 -159679 6809 -60199 -17509 -35458 -120640 -118794 -202947 -226018 -318240 -238869 -108177
11230 -108177 -15659 28433 78869 111597 93734 120882 133684 16389 -3035 -66242 -201838
11219 -201838 -170430 -194942 -258336 -310498 -316965 -53343 192988 139498 58824 -14890 -43105
11208 -43105 14161 -15681 -111118 -143794 -211650 -201281 -137987 -117764 -177848 -185977 -33618 -31062
11196 -31062 -8378 40839 -93209 -175609 -194814 -197087 -304111 -380406 -223755 -48365 146524
11185 146524 146227 51534 20062 172062 188932 14009 -195646 -313665 -253819 -141929 -148163
11174 -148163 -172485 -120872 65563 47414 -16408 -16123 100725 138800 175878 92293 -42939
11163 -42939 -175864 -250960 -252891 -333164 -332642 -276297 -58183 10178 4000 7814 22020 -68457
11151 -68457 -52763 42888 -51586 -198432 -224041 -268140 -140546 30355 111159 178639 116446
11140 116446 104454 195439 108894 70403 -21478 -44792 -13154 402 3455 -1041 25380 144931
11128 144931 57256 65346 85877 144093 117027 237270 254918 198901 156613 -41497 -120995
11117 -120995 -157011 -154796 -69455 -59266 -100954 -145214 -54565 -36839 -49984 -55474 -141305 -292864
11105 -292864 -267183 -259989 -245173 -268273 -213402 -159719 -153595 -13353 2 15168 -39946 19239
11093 19239 7785 28792 132173 225563 183639 103908 10830 -83037 -214063 -229132 -27839
11082 -27839 -956 -5748 -78093 -129656 -67832 -49183 -45719 -214133 -274056 -169168 -57162
11071 -57162 -47063 -94415 -118977 -83150 -63902 54973 15402 -82983 -84593 -61769 -6181 -59702
11059 -59702 -114637 -197373 -210499 -191417 -127382 -262047 -351491 -322821 -262647 -261801 -146698 -128665
11047 -128665 -71183 -107769 -54087 -51366 -185342 -247868 -325223 -295170 -229532 -265503 -180075
11036 -180075 -187896 -187891 22941 77968 47159 43403 113250 105398 112289 194966 172479 132887 140771
11023 140771 87793 30198 132946 62831 -111467 -206075 -230452 -323770 -307716 -293533 -318160
11012 -318160 -257397 -126148 -36028 -71904 -141278 -166545 -105031 -111629 -132596 -129152 -199367 -211728
11000 -211728 -49246 12901 -48341 51246 133964 33833 21635 -18439 -59713 -31784 109038
10989 109038 121221 127527 11070 -18868 38904 -13207 1424 56939 59332 -418 -46533 8628
10977 8628 -152033 -125086 -19228 -85804 -12744 145706 90380 -27205 -125712 -127876 -10056
10966 -10056 138881 133008 140249 146569 141095 136473 22117 -31814 22572 -11350 -98569 -203723
10954 -203723 -239512 -153752 -199553 -167356 -196826 -156354 -61458 8397 31621 200357 412017
10943 412017 408212 304962 236747 195472 115467 94277 98644 172578 242210 149680 4909
10932 4909 72547 124586 3691 -134476 -201283 -206339 -124815 -229975 -282123 -277686 -186397 -23246
10920 -23246 21953 29889 -101301 8305 -130239 -217308 -213673 -160660 -55286 -67654 -189380
10909 -189380 -256547 -202877 -197752 -296556 -377594 -252358 -157197 -70032 -30032 -300 -127419
10898 -127419 -88662 -44470 -56773 -54358 -148901 -223467 -178877 -151680 -179479 -156717 -173956 -186690
10886 -186690 -183568 -79702 34128 -48250 79678 181613 184294 116427 -23209 -97533 -77177
10875 -77177 -101764 -109155 -27612 -2599 -9324 155201 146885 144628 100001 33590 -126710 -189367
10863 -189367 -195689 -70765 -9697 -29986 -38840 -62305 41848 31071 6799 -3433 -23544
10852 -23544 106414 115435 61470 -67897 -99397 -17694 -42307 -20741 92546 114327 150715
10841 150715 77232 140301 90271 59239 44675 -80699 -162790 -210834 -170186 -79280 -153806
10830 -153806 -181758 -218281 -237892 -313789 -292800 -283272 -270713 -121066 14556 -4373 29985
10819 29985 67395 52868 -51427 26420 112727 6198 -119622 -79006 -39622 -59574 -82830
10808 -82830 -20673 143695 122827 104942 158983 189207 -14379 -70356 -148116 -107072 -113129
10797 -113129 -145002 -168604 -75297 -68471 -163308 -176414 -142962 -301860 -306782 -320066 -293971 -214120
10785 -214120 -88961 -186690 -199752 -75061 40047 71335 -140326 -108306 -117703 -25160 90960
10774 90960 40661 -45408 -61637 -226930 -260794 -279406 -343890 -307676 -248692 -262507 -253805 -240529
10762 -240529 -32848 136602 39189 14169 200 -14266 7787 -65613 -99314 -154352 -218744
10751 -218744 -176986 -236549 -143022 -15320 -80436 -50844 -88577 -219155 -163124 -159995 -90330
10740 -90330 22763 -46218 -73785 -110928 -105958 -60750 -78589 -130278 14115 31384 84251
10729 84251 108979 67736 219988 248272 143349 144022 267619 211780 252256 368380 629046
10718 629046 847356 1182064 1632415 1986070 2389570 2613016 1921691 1169592 720593 562281
10708 562281 331246 299658 277678 253252 267542 104671 53172 2388 99750 231218 103304
10697 103304 155 -50013 -47998 58490 115948 45034 68944 5093 89215 178807 203389
10686 203389 71907 -7702 -1832 -81377 52144 33752 -56168 -184989 -220408 -185077 -156281
10675 -156281 -74831 -23134 134944 250686 174326 49453 98592 -32718 80344 284260
10665 284260 219039 162873 152616 46103 -4554 29142 -60827 -133836 -124231 -60655 -53658 -16095
10653 -16095 70254 107258 95462 -34051 -127868 -152514 -67757 -191314 -162155 -116427 -187278
10642 -187278 -308226 -367091 -297648 -185010 -80295 -81701 -168503 -120252 -141760 -91895 -34678
10631 -34678 -64919 11928 219011 256902 -7698 -31806 -25289 4046 120418 165075 181477
10620 181477 -17061 -105174 -166171 -34491 120255 91246 -17551 -39339 61569 71445 34828
10609 34828 58035 79738 117715 113690 102120 74513 216601 137838 -6563 -141405 -202125
10598 -202125 -236238 -250873 -129627 48594 -106336 -86421 14049 87901 18464 -80617 -22159
10587 -22159 22932 -84815 -156206 -307392 -354503 -223038 -220097 -333992 -430547 -344901 -201880
10576 -201880 -255573 -49738 19834 53834 50884 -44436 -130076 -89848 -99669 -287855 -242620
10565 -242620 -225951 -160858 -47827 17723 28449 19210 35061 122304 10845 24112 132081
10554 132081 127031 114387 24217 -21756 69237 42334 -39451 -61605 43463 136446 108682
10543 108682 36678 -4643 -10534 -13031 29810 23612 5102 54742 -97741 -184277 -77015 70506
10531 70506 213481 406030 353003 169137 137816 115162 23620 60460 146631 193218 72278
10520 72278 -25893 -122899 -99572 -66492 13411 52445 103745 268010 248893 201238 199599 84876
10508 84876 91750 59457 -82369 -149431 12151 271877 320913 451191 790434 1070753 1304743
10497 1304743 1390406 1231898 1144418 1139444 1257277 1479928 1501267 1308760 1083993 821625
10487 821625 535560 299731 261696 106971 38830 -58238 2761 -62831 -58994 56575 23484
10476 23484 14198 -32273 -76139 -205208 -67146 103895 187068 116573 123696 -1063 -186825
10465 -186825 -247008 -205216 -217479 -213009 -165451 -124924 -49826 147371 123162 76995 75687 14090
10453 14090 -81303 -38181 57564 139842 108559 140504 299962 260866 62378 -298 -46564
10442 -46564 41687 66297 -71996 -176007 -151070 -107599 -3388 66385 87761 11227 56098
10431 56098 99897 45429 36653 33188 228649 148330 144048 223421 149249 -48389 -106168 -41623
10419 -41623 -102186 -78952 -7822 194154 287313 223523 82936 146188 106536 29361 77653
10408 77653 20721 35879 68244 -35569 -93231 -95807 -246558 -136469 -63835 -145950 -128026
10397 -128026 -163935 -145994 -103 107391 136544 27133 -29593 -78554 -232105 -275470 -299826
10386 -299826 -207706 -183002 -246835 -268139 -92870 -83939 -67930 104949 104740 -73429 -122245
10375 -122245 -112838 -243783 -292639 -219931 -117627 -76549 18527 181478 140698 151348 197061
10364 197061 145398 211023 198506 91486 52796 -24115 -79084 -89416 -47478 1715 153906
10353 153906 117764 100660 -28016 -124132 -67781 -124358 -87574 -6992 -1976 21109 75345
10342 75345 -47394 -51086 22861 101536 19161 -131134 -197364 -42265 -30892 -76194 -126390
10331 -126390 -182093 -55427 200879 178344 150677 235572 253779 94682 -32323 -45472 -20319
10320 -20319 31368 -2082 74483 138856 125954 166727 20478 16336 128686 30820 21581 -19800
10308 -19800 -3137 65137 16623 43273 -64606 54301 176373 85034 81488 201766 162756
10297 162756 47058 -52619 -70971 -27930 -42114 -28942 8152 5447 -113539 -88703 26653
10286 26653 92476 95489 58279 -40675 -34452 78036 164994 53274 912 -57907 -125137 46574
10274 46574 6904 -130387 -90311 48445 37830 122764 221433 97876 -76004 -83708 131763
10263 131763 225296 258580 139638 51530 37115 63248 110120 102836 98792 -22664 -86375
10252 -86375 -100409 66804 14296 47582 -60315 -107218 -33531 63443 -60820 -62164 -80141
10241 -80141 7252 -20926 81238 116815 -38781 -105951 -59789 17062 -88780 -79839 -104298
10230 -104298 -202949 -132415 -51902 54591 58882 77038 53280 -134020 -184074 -181538 -173433 -81397
10218 -81397 11025 -48099 54075 157758 202909 129942 -41380 50087 139807 195155 122089
10207 122089 133906 76675 30071 120139 166620 190274 112482 78056 120844 188923 204728
10196 204728 73885 -11683 -178544 -135236 -71505 -155814 -199580 -130872 -94492 -58215 120323
10185 120323 116480 150565 48844 -51040 -181905 -39727 104725 91792 87080 69419 5635
10174 5635 44669 110110 -44163 -135513 13264 -83077 -209138 -202019 -138426 -97827 -52882
10163 -52882 -114706 -109692 -145224 -129267 -93521 -184578 -131335 -5598 62128 -68690 -70331 -6649
10151 -6649 -117439 -281265 -199196 -231532 -103879 97139 43326 38329 69196 79609 144555
10140 144555 84077 165570 262699 72599 90062 108036 152066 20768 -86679 27733 21935
10129 21935 -2441 120020 146917 212986 150173 99577 48761 -105847 -141062 -199597 -213788
10118 -213788 -194130 -152810 -182764 -217990 -354607 -357007 -244027 -229590 -243570 -115010 -86383
10107 -86383 -133034 -125020 -128932 -165682 -129355 -103025 -27703 -167896 -170673 -128627 -13985 108283
10095 108283 138437 152459 140823 28004 -112174 -187302 -237424 -346404 -228913 -7095
10085 -7095 34927 -33943 -207472 -192787 -167456 -213560 -131441 -127635 -218616 -244419 -256725 -311915
10073 -311915 -334475 -286218 -240459 -233638 -189581 -146982 -56879 22137 31339 82344 109344 -73702
10061 -73702 -210136 -17700 107452 94393 217247 362989 383332 376383 205814 14856
10051 14856 68759 36026 88908 75098 138725 66059 -150660 -142112 -93319 -37427 -70059 -133116
10039 -133116 -153245 -48736 -35042 -144981 -124917 -66701 -49387 -68766 -43917 -48768 -12565
10028 -12565 103182 33388 -137360 -202893 -215951 -278599 -299103 -308672 -265528 -252517 -221054
10017 -221054 -273150 -248451 -9042 49081 -52578 -177107 -157697 -117887 -125881 -78334 23301
10006 23301 126802 235543 117051 -4739 -45960 -13590 -10357 2818 -6808 88953 116544
9995 116544 97536 18436 -83779 -84307 -86252 130069 191503 136807 683 -116919 -218874
9984 -218874 -152525 -120556 -5196 -52904 -119571 -109174 -38579 -8489 -45783 -131188 -169486
9973 -169486 -193876 -139660 -70515 -112592 -144692 -120149 -130505 -53155 -7881 -115318 -209038
9962 -209038 -295135 -248389 -156565 -77853 -17972 -123516 -88782 -69573 -196284 -174996 -111954
9951 -111954 84680 45710 -230705 -309316 -172493 -41601 16984 29256 24429 77060 90968
9940 90968 -36760 30911 44760 -114918 -17133 109663 30682 -83181 -255331 -367026 -301910
9929 -301910 -313078 -199239 -137543 -156090 -260156 -253214 -95971 -67261 10383 -83270 -190540
9918 -190540 -191267 -138352 -212662 -306801 -253847 -54091 -16390 -86642 -140397 -59985 5622 26574
9906 26574 -13724 -54095 -133504 -89597 -5595 -14618 35992 15232 25483 100552 75571 102483
9894 102483 84345 -20353 -52415 -76612 -150905 -115960 -102522 -283253 -314061 -196288 -185841
9883 -185841 -142650 -71811 -219621 -220905 50832 39217 -102875 -136646 -55284 72231 163663
9872 163663 170540 135463 111528 -53060 -127597 -142921 -100711 -166878 -174203 -170408 -76570 99139
9860 99139 -4926 10322 50221 -6281 -9725 62532 152462 240837 242402 166202 108540 -16569
9848 -16569 -146399 -189372 -139728 -21618 36157 34887 70807 191954 47708 -25871 -55904
9837 -55904 -70449 -91088 -41915 -77116 -148179 -161043 -94757 -24168 -39096 -137259 -99783 -69923
9825 -69923 -272009 -252217 -76569 31325 -53714 -53789 40248 89343 10666 -142931 -120661 -19930
9813 -19930 -40687 12538 31965 -7719 -20277 24646 -92407 -97126 -124199 -240906 -187392 -109756
9801 -109756 30843 67203 157440 87364 141258 193705 103477 70066 66420 128094 116112 52330
9789 52330 34605 3343 -72375 -148596 -244520 -169834 -30424 20118 53376 35617 28366 -24805
9777 -24805 -233756 -225895 -148213 -113555 -12542 -21050 -42221 -79568 76345 86374 -143884
9766 -143884 -225506 -201623 -173712 -137856 -190515 -220288 -171980 -111090 -64935 -218443 -170087
9755 -170087 -198213 -108689 -28191 -136206 -171084 -142505 -180916 -197397 -264298 -268376 -225523 -256402
9743 -256402 -255608 -138309 -60342 -148648 -200488 -178697 -132114 -169191 -194177 -121949 -137063 -73593
9731 -73593 -227875 -225962 -90461 -93001 -54624 -20537 86688 97558 -7726 -92228 -68481
9720 -68481 88245 99129 -14983 -29186 23973 -41475 -41625 -80198 -189626 -184521 -157426 -110357
9708 -110357 -127532 -234048 -200805 -37285 78557 75775 18027 98778 -36393 -272358 -238866
9697 -238866 9340 130882 184638 192492 181195 86212 -3195 55117 45760 167546 170764 -29022
9685 -29022 -187272 -180251 -184639 -259326 -177567 -145356 -46297 94350 -34412 -143967 -58599
9674 -58599 55987 101352 66922 51825 91204 -13580 -81073 -96815 -52693 35930 142314
9663 142314 139239 -70697 -336422 -308449 -277721 -356979 -462441 -387497 -217735 -195284 -158223
9652 -158223 -142829 -64929 -55244 50776 31777 -73322 -101165 -74355 8725 -70304 -134294
9641 -134294 -160362 -169533 -118003 -84510 -188227 -313197 -264474 -213201 -164344 -112185 -24397
9630 -24397 -28408 -53517 -673 -59761 -81974 -139210 -133788 -19894 -55898 -89901 -114301 -54412
9618 -54412 -29201 64802 83397 161324 247609 191943 184554 192498 95901 -19210 44540 107686
9606 107686 101559 30445 -16673 -74602 -158353 -127487 -86920 -139626 -149589 -102672 -196761 -223006
9594 -223006 -204050 -211943 -137359 -185022 -224753 -228897 -96927 -177639 -146115 -55871 -133797 -164952
9582 -164952 -119097 -99049 -35160 -108381 -119109 -61781 -33655 -110894 -191555 -229360 -138603 -60363
9570 -60363 69464 88116 129345 -3506 -12102 19843 -21775 -67644 -165411 -83867 36232
9559 36232 145636 235904 281393 73309 -81354 -5286 123480 85498 -123375 -172674 27469
9548 27469 32471 -8688 -68766 -155792 -146731 -73018 456 65880 88574 27547 -72779 -57190
9536 -57190 26163 194081 39981 -18947 8265 70189 60975 -57656 -126824 -212778 -173037
9525 -173037 -123436 -134038 -61861 -109122 -225547 -60253 158344 177222 179179 110983 79980
9514 79980 189593 224632 215101 217595 15390 43877 200611 154593 -39067 -157465 -156730 -63492
9502 -63492 -131614 -88746 24568 50161 37498 -39562 -67772 -92235 -47298 -51991 -63026 -35146
9490 -35146 56401 -31680 86766 101700 -114414 -263616 -242146 -36436 65996 64343 93564
9479 93564 131752 171944 119556 39039 -53356 -176507 -102883 -126228 -187052 -207332 -32652
9468 -32652 5769 -3691 -78630 -74953 -127306 -212911 -155166 -102181 -74748 -39423 -45529 62280
9456 62280 62108 -67965 -19865 57531 -28337 -38396 1791 -21525 -267 24984 66314 184614
9444 184614 230075 185583 184388 267632 221301 156205 92319 50081 81073 202733 168433 6172
9432 6172 35388 22042 -37316 -121378 -21873 10252 -92054 -29125 -35553 -77302 -44076 -10075
9420 -10075 -18889 -67348 -124610 -149104 -170073 -92224 -57107 34337 57167 -165544 -281801 -243930
9408 -243930 -153513 -128829 -117130 43127 103683 1315 -8611 -56437 -7419 63338 -38107
9397 -38107 -79797 -92245 -102301 -323125 -397682 -252308 -180151 -37643 75039 60970 1517
9386 1517 4072 30093 90376 -17081 -116005 -162153 -233095 -181795 -236985 -351373 -172683 91425
9374 91425 254938 266152 190704 231907 187725 83272 53469 10899 150710 264102 250782
9363 250782 -25374 -164713 -176201 -155212 -28392 105766 13525 64716 -60678 -136395 -20103
9352 -20103 -78655 -90226 55393 55727 -89454 -115615 -144992 21602 161886 175832 162193
9341 162193 27836 -49364 -106430 38638 216163 316981 428941 304373 167370 217413
9331 217413 69338 -125604 -116506 -76757 -113737 -146156 68377 61967 -63680 13970 82371
9320 82371 10647 -52026 48447 33603 5866 108512 207488 138523 141648 2447 -68048
9309 -68048 -165596 -160201 -200209 -100700 42878 76715 10987 -79939 -4333 -52339 26910 35207
9297 35207 30896 59340 -45347 1629 31278 24043 -57028 -75567 117206 150683 202124 155220
9285 155220 -5784 -138373 -48440 -18809 -9571 -26949 22161 37369 -33423 -63804 -24363
9274 -24363 -74277 -62341 -1341 43542 80098 50711 -6612 -47719 -1139 14564 72559 297704
9262 297704 357576 241023 127392 34762 45765 126374 22912 -115309 -12218 33659 28205
9251 28205 103647 138584 80359 132707 150237 101621 -19717 13995 154656 324257 263687
9240 263687 99975 159239 182638 129734 51457 24794 -122015 -81957 -102466 -184385 -104836
9229 -104836 -15300 -73020 -13540 149282 157746 13616 17245 151917 170729 229548 200999
9218 200999 145248 65710 135262 233999 175902 48115 -3393 12435 77788 111701 350381
9207 350381 358296 319248 248148 200391 224500 266672 206865 304973 353889 373185 355621 322797
9195 322797 283387 145483 48566 194359 167939 145401 165264 261811 386118 307788 223264
9184 223264 204292 237157 364625 433315 423168 298926 284380 241794 246241 357212 340794
9173 340794 348687 464662 538844 404160 192425 171946 108307 175526 215412 326380 366044
9162 366044 434659 448265 533877 527858 449454 504874 676860 598307 511623 603734 527841 456710
9150 456710 500003 601567 617412 700540 831876 894819 911384 870338 793349 777133 909477
9139 909477 960515 967800 953998 824291 883679 1044036 1156323 1379150 1424680 1400542 1644006
9128 1644006 1684265 1668595 1685988 1770855 1936374 2066160 2212886 2376584 2363460 2473247
9118 2473247 2697109 2862653 3073489 3188794 3351269 3454861 3698449 3892898 4326126 4677313
9108 4677313 5085776 5553453 6154709 6784790 7364497 8114257 8980217 9976361 11013677
9099 11013677 12059968 13418430 14965786 16754673 18667493 20751561 22907690 25158743
9091 25158743 27360992 29364992 31269800 32616965 33360864 33351224 32804552 31497197 29911632
9082 29911632 28025448 25924998 23797085 21590627 19633895 17801522 16238838 14753142
9074 14753142 13368230 12127793 11132596 10324566 9539556 8842915 8199620 7568969 7009237
9065 7009237 6503706 6029819 5672519 5517161 5295896 4954127 4661743 4372310 4078196 3879859
9055 3879859 3672340 3473260 3175214 2978833 2749399 2561333 2507559 2537354 2537909 2363370
9045 2363370 2170761 2092595 2117224 2075325 1887027 1704412 1644150 1699643 1720122 1693606 1690019
9034 1690019 1563304 1505615 1475443 1310100 1222452 1220107 1304260 1193401 1056708 1081460 1164182
9023 1164182 1138107 1113742 1074867 892142 956919 1091996 820935 672845 783907 886477
9013 886477 882881 780771 714674 718856 761042 818291 912377 871860 885818 868490 909292 792519
9001 792519 607153 593470 603495 582399 507209 561515 543728 478813 569405 578980 564548 603448
8989 603448 568610 493249 385208 318895 359492 324075 292441 418244 468984 566344 507902
8978 507902 387181 287574 139448 195329 251098 284242 307251 192800 25584 -13725 -85050
8967 -85050 -78816 -74965 563 42190 27526 80229 239352 209315 290244 287939 118767 38113
8955 38113 67838 100998 253805 380488 238568 241605 231416 270087 257756 226967 372883
8944 372883 274187 152065 199099 181557 223922 182607 100217 140729 145798 81694 87790 129936
8932 129936 -19709 15600 61161 20013 -55158 -107121 -104018 -91692 -33760 -16646 -8325 -65898
8920 -65898 -92955 -103364 -26566 -71051 -161611 -84449 69134 60505 162831 208603 174312 139294
8908 139294 5676 -126034 -170303 -159500 -246682 -238044 -202169 -140094 -37500 69395 -30118
8897 -30118 -181939 -181156 -141500 -64759 -92254 -165752 -26337 8980 -11098 138828 241610
8886 241610 252532 255374 115381 89487 221949 207025 213052 144879 20019 8803 -33489
8875 -33489 91669 115155 149045 272943 192373 119333 174147 163780 119082 91064 114758
8864 114758 209242 101889 91387 231329 243732 74872 60347 186732 58543 -51849
8854 -51849 18084 28066 34963 -78772 -143330 -17889 105953 -11685 -106880 -82120 -40571
8843 -40571 113523 72886 31388 46504 37176 -70520 -76242 102308 67336 22758 -25584 -77750
8831 -77750 -5906 -12123 -75070 -46157 -109162 -159512 -67573 -81212 -106993 -92475 -84540 16121
8819 16121 54684 -25477 -249793 -417759 -346212 -106655 -8502 -21696 18753 -16922 -68425
8808 -68425 -39534 -42503 16257 138130 -19497 -116217 102552 197271 84179 6967 66461
8797 66461 138092 45528 -40178 4039 -54817 -13960 11792 54410 89091 104805 159514 153490
8785 153490 19162 -200256 -189169 -71351 18358 66391 -57039 -117241 -171459 -7244 114109
8774 114109 24971 -13871 56536 110572 164821 187496 129169 137254 270604 227361 192167 249077
8762 249077 154447 20543 -63431 -175458 -205706 -45978 67225 109201 103972 70333 74097
8751 74097 65699 99473 175391 209826 224389 -68808 -160496 3758 118532 135142 199032
8740 199032 184551 154270 194717 316136 457277 441755 359113 323701 289731 273168 298422
8729 298422 440059 438844 352864 270548 351344 431310 387204 246324 160764 139101 95580
8718 95580 234376 314833 312731 305502 89805 -171662 -192556 -51848 137708 225264 223226
8707 223226 256468 175945 170904 217856 209800 249788 94659 14952 135020 104111 131383 188027
8695 188027 323558 362867 363599 302738 285433 497613 620351 692042 750047 708314 796880
8684 796880 813177 728122 618730 670226 535995 450572 364943 213546 209550 324039 263158
8673 263158 159839 50437 94217 102013 7622 -18146 29079 -42626 -83053 -141681 -149163 -175038
8661 -175038 -97140 -149997 -124063 -98691 5077 48994 26354 33640 -12081 -14427 -41237 -113452
8649 -113452 -54852 -40338 -24259 67157 289617 398903 450794 522672 530047 558521 593598
8638 593598 600503 539306 488552 441184 448583 385880 428292 582374 811139 984448 1176284
8627 1176284 1212460 1067148 783171 564878 431839 479506 397225 426521 621247 787461
8617 787461 975780 1134409 806126 502685 486445 278400 108146 120254 133037 166533
8607 166533 349036 314818 267460 89779 57271 221602 315423 307288 241565 204881 276633
8596 276633 233902 120116 106296 77295 136463 187739 351526 665019 816350 1110185 1395779
8585 1395779 1717261 2182295 2481919 1962591 1492799 1010484 695929 526375 551864 632318
8575 632318 814735 1001581 1263140 1672432 1884125 1821619 1547816 1171097 979761 778704
8565 778704 532700 285376 200084 259977 447888 570843 407543 344133 226977 94509
8555 94509 229524 309965 210392 120661 -1118 14568 -3369 19393 -21561 130932 162500
8544 162500 376864 602684 843422 893431 1012373 1299760 1097249 788011 552487 490302
8534 490302 512060 500379 509465 522248 755677 1029806 1262871 1405706 1367880 1184568 1097803
8523 1097803 720501 395287 250412 144383 172995 307087 417253 348619 158487 187736
8513 187736 78428 -68875 4737 -38130 -27378 2579 112607 146810 153950 71686 3237
8502 3237 9521 76126 157763 189896 297404 191105 141262 -33911 -57982 -76551 -90757 -47475
8490 -47475 104694 109423 133632 3336 -33170 -42193 -142704 -95815 4794 -93217 -211676
8479 -211676 -213679 -125138 -184768 -232892 -42306 73536 103182 209274 200593 181802 149504
8468 149504 149470 233043 287163 174807 38340 -97189 9192 -71353 -128366 -128102 -61383 -52677
8456 -52677 -172773 -126252 -95903 -12143 20024 31286 58280 128337 -1362 -160275 41621
8445 41621 257610 191079 65524 -41511 -24248 -38535 -109709 -190988 -226507 -313846 -312954 -330828
8433 -330828 -239475 58507 198563 195476 237851 246077 366515 319960 299248 253549 154700
8422 154700 148216 105948 18373 2715 -38231 -90772 72835 61077 36022 29458 62492 35750
8410 35750 -120882 -105408 -35748 -15739 -136566 -186756 -21082 87072 74251 -40570 -98550
8399 -98550 -142756 -169953 -155368 -72455 -67366 -154088 -187658 -147613 -155975 -258575 -138879 49777
8387 49777 50163 -35407 101194 173602 142583 103434 31161 98329 -4507 -70613 -64723 -45642
8375 -45642 -75199 -178704 -59049 23614 139110 167576 168607 65243 -32900 450 -29409
8364 -29409 -43210 -103121 -160401 -151152 -144618 -78728 33557 119091 194245 254305 214556 144426
8352 144426 164289 141985 72870 14236 -141929 -19612 2541 2429 89998 32887 76413 44900
8340 44900 26843 -18108 47581 -47811 80014 15498 -29414 -172613 -63329 -19606 -146853
8329 -146853 -302040 -319136 -237936 -136909 -68697 19694 17862 -48110 -109930 -42914 -53731
8318 -53731 -11308 -167231 -269660 -317789 -327617 -255092 -203854 -192637 -82417 -81447 -59834 -6152
8306 -6152 -30968 -112237 -98528 -2501 122149 271005 205898 238722 255229 419799 405827
8295 405827 353471 406464 377596 240764 249583 156006 -110593 -98572 -1326 8138 72991 77692
8283 77692 71693 -47672 -167860 -145438 -119716 -113294 -53641 51049 54216 162573 287100
8272 287100 421308 277176 147272 70283 82582 185942 248072 316598 343501 476293 355481
8261 355481 428817 517263 549294 682022 719187 778539 899333 926775 959862 1010788 1158932
8250 1158932 1332262 1348006 1227426 1175914 1230612 1294058 1406775 1477397 1597482 1829449
8240 1829449 1980833 2205909 2412528 2661881 2888222 3348592 4002077 4785822 5656637 6724978
8230 6724978 7905784 9280697 10933651 13193007 16582348 21893758 30307131 43285797
8222 43285797 62425690 88059175 118843133 151750234 181931825 197789101 176803571
8215 176803571 131785733 92689197 65976651 48631369 37334146 29890721 24846168
8208 24846168 21316650 18768445 16796885 15323097 14199999 13231699 12540046 12057872 11376843
8199 11376843 10747121 10226805 9812395 9415788 9386877 9467971 9609095 9860959 10184993 10812989
8189 10812989 11799453 12857931 14025680 15629947 17903483 20380934 23047321 26871731
8181 26871731 32793928 41994144 56846615 80797019 117136768 166919222 227826035
8174 227826035 294842899 359200313 402548703 366733187 271579230 188828810 132640907
8167 132640907 96213404 72811879 57600331 47516880 40196128 34888111 30956265
8160 30956265 27735521 25337977 23501705 22009166 20502632 18796687 17236658 16060418
8152 16060418 14882042 13824150 12976625 12530572 12326675 12093732 11891419 11833934 11845452
8143 11845452 12008574 12396196 13071075 13971904 14889176 15911238 17663107 20490811 24804478
8134 24804478 31897895 42866238 59230559 81873617 109811076 140912499 170908851
8127 170908851 191893807 183781488 143228304 101503416 71693392 52031187 39461990
8120 39461990 31343965 25864959 21993593 19228602 17141398 15343600 13964865 13051643
8112 13051643 12170831 11247231 10218522 9360639 8597113 8010682 7446990 7010246 6459710
8103 6459710 5980714 5705115 5450489 5143609 4942569 4747759 4434042 4371968 4416751 4324197
8093 4324197 4082607 3941041 3926044 3652256 3293748 3205408 3192493 3182470 3106179 3026024 2878943
8082 2878943 2714648 2752354 2665043 2552287 2615751 2492385 2285787 2244370 2227457 2171118 2151973
8071 2151973 2116394 1936699 1879568 1916901 1917332 1831950 1701457 1624299 1644589 1609745 1550207
8060 1550207 1654866 1620114 1445246 1400467 1303765 1326059 1444990 1381961 1251577 1347488 1433574
8049 1433574 1544702 1681468 1647875 1588873 1481433 1349429 1182452 1297621 1260048 1131144
8039 1131144 1017663 911827 903960 931783 937430 851229 696506 710339 727718 677602 640973
8028 640973 705480 752164 708432 792631 873711 1020483 1121047 1111289 1239691 1223598 1277237
8017 1277237 1126150 972169 820956 825128 820164 783670 888616 864713 758416 689618 650188
8006 650188 587907 518772 533126 462730 545635 706372 744572 732754 774626 769542 681355 508178
7994 508178 559561 508342 442602 333299 383015 422107 468723 408303 523093 757289 798821
7983 798821 767876 651559 519332 406751 349290 390328 351413 383119 673290 771904 762724
7972 762724 847450 716025 834471 972670 919746 761280 599373 531650 426133 240722
7962 240722 280244 349562 363031 398720 466708 540373 502578 458931 435594 427525 392458 548128
7950 548128 562495 406048 380505 382876 462482 563604 561941 468316 420449 578393 495725
7939 495725 362560 195354 146213 182556 154832 68273 65571 118436 293341 412146 361544
7928 361544 372546 454820 435792 305934 314495 350293 344911 339921 381522 536547 441511 371499
7916 371499 473109 488184 417115 477308 501606 484294 549488 653520 557681 525787 498714
7905 498714 430872 314301 296033 405895 379891 295702 208786 164916 53662 13055 84898
7894 84898 214915 130174 26942 35175 89810 211536 224997 175381 193644 218870 249054
7883 249054 114877 98787 105321 130662 191772 94929 -36549 19465 168575 108402 33611
7872 33611 51100 202726 173306 120543 68003 50093 136557 -6211 -79016 13192 41619
7861 41619 212258 267397 231807 347230 431978 258486 224748 262232 300573 189307 110279
7850 110279 27791 52120 145855 178993 206709 310872 318940 340181 314153 107530 7605
7839 7605 -57694 -29214 -54760 93375 3545 -77796 85748 318948 395809 399966 250049
7828 250049 229596 341718 307405 307012 387183 382003 411038 472198 512292 487494 371674 346674
7816 346674 452642 543959 744542 1017683 1024653 1012708 830818 464063 359216 411033 374052
7805 374052 382603 553772 532443 409505 294510 307595 275542 163811 129098 97746 125864
7794 125864 247663 338363 251300 110207 109016 142789 64917 68417 69541 151313 114317 101800
7782 101800 30525 20323 118043 144308 58890 103857 253611 302849 343201 368625 611148
7771 611148 897597 1154622 1487348 1814580 2120302 1982984 1611425 1202472 940979 662019
7761 662019 602050 586467 553732 383068 264030 255818 270837 268650 383500 462244 399054
7750 399054 268762 331282 461836 436391 320155 226723 220768 117485 139673 115148 144959
7739 144959 177691 97357 150925 112598 112637 70896 102632 24492 -43340 55227 39598 133007
7727 133007 271765 536420 717507 689306 753625 955154 1089005 982659 762120 531940
7717 531940 447313 333134 230422 349033 398482 233449 203249 188878 105309 7357 -38650
7706 -38650 76915 74315 188199 269087 210678 123077 133152 111158 141939 149550 193290 97309
7694 97309 16840 48385 193404 218779 81366 -61305 -26408 124188 52206 -7410 -63744
7683 -63744 -81162 -101 28472 114534 195660 211510 143638 173979 342105 275030 40971
7672 40971 -114554 -4268 22747 117818 169497 65694 20780 -90587 -19915 80767 67148
7661 67148 64521 27923 56448 92802 20723 38554 190343 126743 8059 -56661 -39632 54129
7649 54129 150948 88621 -14156 35735 71462 36715 31052 133255 126678 100173 210301 139835
7637 139835 12618 20826 58996 58636 -701 -72153 -81734 -63571 20980 32497 68285 48554
7625 48554 62363 -27682 -198307 -153629 -65885 -114521 -230154 -111369 -84971 -23061 -1491
7614 -1491 8294 92403 245521 220228 125526 99552 -42589 -86917 26847 60219 71321 94800
7602 94800 30344 -6510 -81582 -105682 -126430 -61917 -153371 -116421 -29844 -5311 77072 -9032
7590 -9032 -13913 -25343 31927 91779 9836 103368 4489 -51670 -123432 -124222 40859 171592
7578 171592 180231 169649 117918 131586 36716 83015 65990 43830 168760 90162 43654 7704
7566 7704 3746 19079 4518 113206 115051 -40516 -148273 -172766 -95615 -50330 -1710 117885
7554 117885 145509 71209 -153406 -371014 -217532 26451 120445 -18929 -15463 81925 65269
7543 65269 270113 400988 296992 134607 21231 74621 183433 199626 132054 -24545
7533 -24545 -128850 -133830 -66768 121628 34348 -120999 -138173 -240133 -338577 -300247 -52686
7522 -52686 -59789 -68148 -26939 -96081 -23205 -79398 -64720 6322 -10042 -3087 61084 40687
7510 40687 42976 367 41893 106839 53418 -116897 -166489 -269836 -279171 -216030 -138576 -37193
7498 -37193 10384 59800 133253 130041 151863 249152 119040 78548 8534 -40918 -6644 112896
7486 112896 249258 277553 154116 167082 118777 -45545 -122099 -52683 -85385 70273 21350
7475 21350 4039 -89888 -137504 -122334 -78749 -42008 -22583 -44894 -135121 -154573 -96301 -81874
7463 -81874 -66338 -108085 -5742 52486 -46745 -125795 -161217 -85545 -46700 37090 242564
7452 242564 255449 113488 122636 -46285 -63007 -66710 -78566 -33291 59476 15517 -98348
7441 -98348 -208583 -258097 -79403 -51122 46102 78924 37277 1569 -90553 -105243 6277
7430 6277 6700 -172866 -237551 -153424 -49441 57874 72225 1115 7314 76513 212813 222925
7418 222925 195379 155557 275594 323711 241902 25540 35996 44666 215969 206175 136117
7407 136117 131891 82805 154017 171131 204899 52768 -106408 -35699 112375 13956 -19496
7396 -19496 141074 -17050 -83975 -80915 -61628 10805 34323 101073 107433 174591 168115 63271
7384 63271 -47701 -136739 -146879 -58433 11765 209586 135469 78119 33907 7112 54849
7373 54849 32726 145171 163601 27475 59831 -91987 -223014 -216290 -178466 -102034 -141105
7362 -141105 -294439 -303835 -94840 163679 93048 34853 2949 82469 -9018 -18848 14667
7351 14667 -2713 1179 103637 212408 235659 240662 155074 182523 97344 122852 120101 128405
7339 128405 125935 258218 226220 144661 126970 70276 -10275 -8487 57396 104422 -40714 -85444
7327 -85444 9379 159416 271821 190949 -48365 -128362 -38672 -58203 -196619 -110992 -57265
7316 -57265 -10109 -158347 -260106 -216342 -139957 60312 32046 -32972 19509 75359 200335
7305 200335 271191 303545 126807 37092 191329 251063 242400 236912 165513 218261 359645
7294 359645 431651 451019 284611 202058 199401 19497 -89895 -120662 -38377 60490 175223
7283 175223 298993 223971 180046 38705 4431 44499 -61988 -57336 -152198 -166839 -18504
7272 -18504 35317 -54128 -55050 25831 -62629 -164437 -311776 -360020 -204022 -141954 -52568 -77909
7260 -77909 -32726 -63235 -139433 -197597 -37588 98427 157919 201169 38113 133396 234823
7249 234823 250448 94626 -40303 -22339 -31644 7201 -27875 -127745 -58342 -24994 18782
7238 18782 58585 132366 213945 229866 87838 -134029 -166541 -150171 -36046 6833 -119541
7227 -119541 -97219 7034 -9111 -75697 -67572 -56144 54445 134075 80223 74231 52012 -128010
7215 -128010 -217818 -167878 -211678 -53089 -92754 -9285 49476 73072 -78934 -189415 -164689
7204 -164689 -149894 -39497 -1580 -45944 40236 -35730 -43984 -52991 -77698 13796 71052 95282
7192 95282 24320 -202876 -202106 -29268 -4590 -95419 -16905 -2924 109872 160078 110376 83052
7180 83052 6021 -42559 24211 64202 -126019 -76069 -20360 44544 72670 5414 -50490 -10040
7168 -10040 16731 105775 -15333 -36079 -101513 -198095 -113128 -82717 -274742 -261439 -136768
7157 -136768 -125377 -178561 -67067 -79038 -114238 -70077 -53622 -13669 -91125 -128693 -218615
7146 -218615 -224017 -201756 -66228 37363 30792 -107036 -279372 -115034 90582 151192 77052
7135 77052 49454 121754 205898 135835 67814 -26628 -55494 -65408 -140017 -148796 -184594 -122248
7123 -122248 -56031 -121202 -263161 -258657 -120669 -126331 -23083 -14904 -101568 11288 91944
7112 91944 166178 110019 9436 -21559 -58943 -116180 -56171 97081 74640 -44017 57075
7101 57075 63595 90835 62885 -96973 -140394 -52807 49660 22009 20781 1257 -34603 25709
7089 25709 -66893 -108471 -30110 115180 149920 76954 96539 1627 -114046 -49930 -5096
7078 -5096 109872 -14832 2729 67720 43418 180698 214346 162826 186286 215129 164716
7067 164716 2584 -177692 -212038 -92419 23179 -17550 -54315 96117 27421 138154
7057 138154 148851 32165 54199 43588 122160 120749 134588 80725 17551 142331 149084 96852
7045 96852 -11383 -18247 28017 94098 147429 115717 10286 -24453 53390 165214 84586
7034 84586 12500 66354 41306 87714 235566 147016 47703 75865 104313 224213 237899
7023 237899 236464 262465 163343 74725 -22239 -19889 9842 -46897 -73941 -29287 -101494 -133735
7011 -133735 13976 -11286 19547 18243 11624 -102246 -19196 127994 70968 9328 38182
7000 38182 -22994 -71431 -80107 -123895 -75365 -95967 -122397 -83150 -60340 -113845 -161521 -33495
6988 -33495 -58332 -39498 -52796 -193176 -146441 12588 -23819 -23015 73758 124862 93825 4754
6976 4754 -67891 -85759 106390 140464 103156 199200 176483 16265 889 73363 -5606 -52586
6964 -52586 -74280 -70563 -60704 -73366 -83899 -112538 -132796 -34888 -18301 -19947 18064 117099
6952 117099 235913 194506 122602 166731 184755 174204 103796 66529 20112 -37078 -75695
6941 -75695 -27488 -69751 69045 116603 80239 56090 31576 -20904 -57320 19980 244124
6930 244124 354616 241713 199954 119366 -28434 37004 31276 5094 44652 20417 -6288
6919 -6288 30015 -54690 -195897 -202846 -130750 -171847 -258941 -158421 -8930 136603 109583
6908 109583 -1203 -154800 -235063 -196906 -211727 -158429 -128975 -168827 -224262 -67548 -69128
6897 -69128 -127190 -58486 -32521 -31801 -75224 -125193 -95802 -36771 14542 53690 54714 -61049
6885 -61049 30609 156372 57908 42854 80335 84507 -46458 -116793 -84747 -118044 -199143 -105535
6873 -105535 -77859 -55019 -45157 -26575 -36079 82496 132442 14788 9963 103264 81585 -71103
6861 -71103 10122 153585 126399 62906 -73719 -292869 -196819 28865 208116 160015 85681
6850 85681 225688 199228 114524 31326 -13557 -10095 -31275 -119785 -276817 -269332 -285074 -327206
6838 -327206 -188930 -143681 -149641 -80724 -20770 -20992 1444 -58685 -54504 -143051 -200962 -168126
6826 -168126 -59655 23053 -7892 -91322 -163643 -59785 -125210 40551 262276 196246 163045
6815 163045 208066 144816 -65798 -36635 117733 152228 70410 -3834 46362 64861 -117949
6804 -117949 -240096 -105416 38523 165762 60464 12628 -48597 -64312 -64278 -189831 -194845
6793 -194845 -91593 -37664 179847 310432 317250 154709 38086 1860 -102664 -178101 -252232
6782 -252232 -197230 -93806 -160161 -230249 -248245 -185849 -35473 230893 335744 258928 229770
6771 229770 124147 -8757 2806 12975 117162 21248 36161 -45343 -86602 -56060 -109736
6760 -109736 -6539 56077 -81206 -215607 -170411 -217170 -289219 -216648 -161349 -44600 40723
6749 40723 2229 -41531 -122878 -144688 -147032 -66773 102883 210472 114954 133700 175225 130561
6737 130561 29191 39623 62897 42739 73512 153742 138699 240449 165404 205565 188913
6726 188913 165722 -7957 79503 303799 269544 246540 72930 -62686 21038 111946 22797
6715 22797 -106582 -176272 -127995 -9114 15368 26312 111633 162156 56043 -8277 45188
6704 45188 95761 110948 198464 100731 109328 92602 -88631 -160505 -13760 155244 221773
6693 221773 214371 145650 135649 135774 120857 1376 -34697 -102568 -74006 98443 116629 124159
6681 124159 144243 65491 -73300 -61075 56994 13083 574 38028 12242 -64847 8283
6670 8283 27080 11770 -34686 -3283 -117989 -84971 57348 8679 50513 105025 150573 85623
6658 85623 35684 -15416 -58953 -31470 -80391 -148759 -10893 60266 17842 -74084 -65624 -117069
6646 -117069 -136214 16151 -18611 -134118 -61995 -27705 -85816 29952 115838 63321 30412
6635 30412 -209313 -263265 -217177 -249589 -117997 23512 31311 36565 -165131 -317931 -319824
6624 -319824 -116979 -8876 191872 266144 221963 34784 -215930 -148468 -280747 -286178 -102674
6613 -102674 -5736 -185409 -207340 -2152 115873 46426 -8764 -147133 -293557 -316522 -208987
6602 -208987 -246996 -154847 -74025 -106437 -46273 26462 -4065 -75806 55156 196357 254641
6591 254641 280686 327287 294513 240259 173568 59214 157426 152366 161817 179995 196756 305213
6579 305213 394723 322818 155136 105487 125890 68326 81232 48512 -22029 26777 22946 -71461
6567 -71461 -43250 -32387 104688 46563 111037 130819 137417 163965 103201 40531 117889 205981
6555 205981 172974 -82999 -179603 -191254 -141313 -87850 -38512 -131739 -161929 -39415 -28573
6544 -28573 -145637 -80581 -94459 -83891 -10639 83563 6688 -105826 1192 29425 -22990
6533 -22990 -46969 94461 200420 258116 64488 -46913 -29589 44279 60862 77629 223211
6522 223211 263267 118035 -5447 55311 35445 -7737 -107021 -126605 -106096 -45795 -84211
6511 -84211 -61150 -185467 -354256 -376877 -386688 -332331 -328817 -95984 -3024 -121604 -149405
6500 -149405 -145131 -125114 -65669 -111681 -365606 -270816 -122632 -103981 -152522 -107740 -91153
6489 -91153 83031 72506 17633 120186 239834 121156 -30961 -31776 63381 137620 118086
6478 118086 -79541 -53548 34600 12113 -26915 -23370 -102489 -199620 -271750 -195977 -23401
6467 -23401 159548 131933 59182 -65411 -26619 175339 258853 384800 234980 63500 27201
6456 27201 12542 22656 -45646 71968 137090 79613 -86506 -132506 -331803 -285619 -124051
6445 -124051 -21413 -49636 -34554 58491 -34944 -94674 38752 96989 -52465 -76768 -84209
6434 -84209 -28869 9577 13139 -26956 29093 -4992 -189237 -155147 -114571 -162393 -122927 10471
6422 10471 24849 -27139 9182 57853 65432 153065 189558 166373 63267 -93383 -92204 32570
6410 32570 237 1287 55527 131660 76364 49645 28228 -7188 -91154 -49001 25420 34854
6398 34854 -57086 -69898 -108636 -103573 44156 144641 237062 229578 144606 174455 113630 86072
6386 86072 111390 3216 30754 120437 79847 -46712 -24783 107704 47263 60202 94913
6375 94913 105978 145257 40441 -66207 -25374 -41655 -92181 -174301 -179461 -19194 -8204
6364 -8204 -133158 -161308 -2258 131072 201119 37436 -91150 -57590 -11599 -33070 -39125
6353 -39125 -33478 -8003 47704 156186 135389 58300 -60054 -117302 25054 146162 87541
6342 87541 79680 72877 30820 72126 46349 -26022 -130290 -271041 -233667 -126661 -129824 -224583
6330 -224583 -216512 -143682 -111104 -39980 47015 -16522 18041 9010 28237 27722 1859 50501
6318 50501 113755 215353 50795 -52435 -50495 -76407 -68790 26728 59125 109254 -32590
6307 -32590 -246202 -285978 -186041 -190955 -237656 -117569 -19209 48382 2303 -30614 54118 167268
6295 167268 230069 246510 161566 86587 120212 -11026 23975 61510 25668 49038 -25393
6284 -25393 -105185 -72376 -55454 -87673 -123475 -117631 -24410 -104649 -143525 -173612 -280002 -212261
6272 -212261 -283264 -215357 -97589 -48189 -125381 -178834 -144359 -150612 -178787 -190710 -112073 77243
6260 77243 155790 29602 42538 33638 40268 139874 60260 96350 105278 106345 31830 64004
6248 64004 47557 68919 114056 -35562 -12071 68015 20277 70193 94921 55412 -66115
6237 -66115 -82885 125352 96484 -1019 -7645 73167 126660 81414 26447 -34858 -156903 -137489
6225 -137489 -199516 -262886 -250632 -49262 65551 158014 225461 158301 227607 335747 326807
6214 326807 339050 169386 -24008 -127926 -170274 -129915 -22629 -20717 -15199 18143 -27004
6203 -27004 -19845 20836 30573 59252 56265 -55925 -142916 -122639 -50055 53294 -36995 31258
6191 31258 55161 -81652 -83317 8647 -140599 -214605 -125293 -81593 -180193 -116798 -72062 4859
6179 4859 -106714 -236275 -343416 -281058 -198592 -174340 -151668 -148641 -202792 -219173 -247187 -99018
6167 -99018 37827 -14102 -96338 -61667 71571 162423 197190 154837 39905 35415 56038
6156 56038 145289 206796 232541 100732 156086 157358 135952 93538 -31155 -107278 -132848 -107975
6144 -107975 -133722 -118207 -45881 -91056 -133070 -111859 -82664 -62940 -47242 -75690 -199979
6133 -199979 -181602 -96204 7951 -47837 -70423 94605 54765 87395 68443 90261 -4990
6122 -4990 -5974 59655 88109 23409 96954 89707 106545 77650 -46538 -85652 -233482 -266175
6110 -266175 -205490 -87952 91345 69635 28038 -40426 -36240 -138448 -111681 -155849 -92296
6099 -92296 -11331 67928 35181 66791 70577 -10954 -9409 45069 -82025 -160077 -46262 -103684
6087 -103684 -295330 -326210 -257429 -74673 -33351 41207 -51207 -151223 -94867 -92602 -71918
6076 -71918 -69797 -210636 -115761 22647 -36750 -79301 -109774 15300 217551 217394 126052 166584
6064 166584 163494 93560 -4633 -27946 53804 91436 245987 282805 62044 -10397 -37720
6053 -37720 1758 -55874 -100011 -183824 -212673 -221957 -239533 -39026 -41154 -148003 -330987 -343779
6041 -343779 -304570 -137856 -76641 -29487 -105185 -294828 -268913 -169319 -118447 -50436 148266
6030 148266 151082 158144 250703 173039 178223 136401 143932 26749 -67274 -174141 -95375 68328
6018 68328 55819 -73199 -84012 -26394 142103 170435 86338 -73183 -1979 205560 221722
6007 221722 152312 29355 -57629 -99943 -257124 -342672 -168393 -116640 -173076 -312900 -370315
5996 -370315 -288350 -246174 -143841 -63432 -60880 -120144 -203071 -57576 57978 55211 -82500
5985 -82500 -175040 -187961 -158737 -162989 -111069 -227759 -309037 -200963 -67459 -26370 -86470
5974 -86470 -243748 -248807 -101306 12006 -60001 -87159 -99795 -123082 -163329 -175170 -115587
5963 -115587 -128650 -20486 135777 92842 59383 174585 215025 114150 -7290 -99227 -118202
5952 -118202 77894 187338 67653 -87678 14723 27691 -44077 4296 -21928 -171116
5942 -171116 -206998 -186132 -153523 -33205 186523 277448 185478 42926 1609 -102949 -146837
5931 -146837 -145842 45665 137629 28041 112344 182373 85923 154714 210995 121776 6917
5920 6917 -196423 -173384 -41738 14462 79439 64134 91501 129998 11095 -26647 -10418
5909 -10418 -54668 -72412 10622 161302 158838 97125 21450 36188 5553 -11434 20953 -24830
5897 -24830 -32291 17634 118407 109148 140408 94249 17530 -10804 -9241 17374 -67278 -168385
5885 -168385 -152527 -137493 -106949 -26433 7434 45697 116584 199480 191144 159433 -22102 -70027
5873 -70027 -72430 -136379 -221524 -304865 -221587 -91579 -829 51077 -59590 -117862 -47589 -27241
5861 -27241 -287758 -290917 -148664 -143753 -211536 -302821 -370968 -390823 -256116 -235569 -250359 -223935
5849 -223935 -149071 64465 79037 -32854 -151715 -293184 -212713 -116101 -170368 -113562 -70313
5838 -70313 -137162 -197556 -118965 15104 74222 103205 22429 100893 18400 -78543 -74761 134525
5826 134525 298359 278204 199715 77627 36598 -49758 -156102 -280289 -283395 -176346 -38614
5815 -38614 35787 19855 72614 127074 103674 112781 105132 67601 -76353 -264132 -164443 10025
5803 10025 -73049 -323345 -355307 -168478 -113726 34242 25132 -65910 7875 169841 151651
5792 151651 73597 25916 4731 13371 85413 13550 -95396 -209267 -104453 48939 -13125
5781 -13125 -160622 -44505 19693 -62901 14732 -7343 3087 31350 -66221 -39600 -32456 -122677
5769 -122677 -175446 -266248 -182555 -25216 -38422 -22994 33957 -27187 -223696 -271039 -248321
5758 -248321 -230779 -77509 -26512 -66475 -72318 -139901 -204234 -159370 28653 56064 88035
5747 88035 154880 86416 2461 -203928 -181938 -123918 -173278 -44282 -6416 -23146 -113451
5736 -113451 19119 145814 91216 137757 186840 181065 89313 -44350 -65129 -102562 147936
5725 147936 81899 132 -64992 46544 19162 -105572 -270708 -212550 -180526 -171099 -15599
5714 -15599 89798 -41699 -130710 -95434 -89310 -117591 -152280 -195983 -110996 8061 122893
5703 122893 146630 -27966 -1393 -36365 -171251 -226637 -25749 39560 19462 -7830 -33503
5692 -33503 -41028 -18401 76281 51685 -48159 -41438 76158 52097 -9461 138845 71602 -17467
5680 -17467 -49731 -63363 -97430 58326 171342 169772 99882 -15102 -78900 -164391 -89982
5669 -89982 -136396 -221968 -242632 -196722 -128626 -123932 -120100 -66370 -62063 -158298 -165144 -202016 -167508
5656 -167508 -155575 -116366 -30593 -56417 -59724 -109669 -65012 -37332 -44850 -137454 -73735 -32196
5644 -32196 22692 65648 189360 212166 147760 101215 -3447 49209 22482 21508 143363 165178
5632 165178 37150 -145219 -118355 -86017 -278327 -328981 -229179 -167788 -53153 -48555 -187889
5621 -187889 -5664 -15525 14486 154614 174797 103932 -21855 -35362 23493 82411 158121
5610 158121 186717 139856 -9273 36505 142698 28095 64728 205558 260562 208699 174416
5599 174416 -16145 -155977 -90197 138760 24145 -10879 44123 95094 -101328 -131097 -159645
5588 -159645 -104755 -86114 -168246 -95071 15378 7818 16708 -44395 -96529 -16678 50138 1125
5576 1125 -30551 558 160053 170974 145383 99616 -10296 100246 52305 25680 49131
5565 49131 -74496 -144501 -17894 11375 -8604 48062 4943 20631 66618 74513 91563 113927
5553 113927 -72492 -201997 -37637 182158 269399 4773 -82551 18777 -27679 -48122
5543 -48122 -32460 -144335 -73521 -53569 -82774 -101221 -288053 -187136 -207345 -294744 -344782
5532 -344782 -278043 -293728 -382576 -208957 -72389 107203 164139 97284 33359 61426 6571
5521 6571 53137 51015 8116 -25767 -27791 138886 255344 238575 82627 -121875 -189894 -63929
5509 -63929 58780 211411 232355 183330 175772 183872 132697 83006 185439 108893 94466 47846
5497 47846 79844 145594 63482 6659 -46592 -6615 35644 48716 82089 128969 124458 37313
5485 37313 -18685 75790 137023 -40260 -283168 -205331 -134680 -115184 -172813 -164941 -212380 -38034
5473 -38034 14610 150013 145039 -4110 -72901 -161660 -299129 -210004 -100339 -77224 62067
5462 62067 191 -46654 -43265 -12904 107667 147561 91368 67026 -26466 -89776 -42403 -109114
5450 -109114 -283547 -252767 -13090 140676 186600 105036 8103 -48271 -116795 17770 -12440
5439 -12440 -108130 -46896 42870 128896 54598 -43207 -21075 -33476 54971 50930 7649 -23115
5427 -23115 -87346 -141093 -179243 -137684 -172113 -277101 -239208 -56235 29329 -26877 -74580
5416 -74580 -64916 -27581 -82223 -153802 -116932 20612 -40661 -60446 -101646 -144374 -121743 -79540
5404 -79540 25411 122634 214286 156799 242810 290580 339503 284169 314393 141289 51224
5393 51224 -17368 -54123 11513 69967 43726 -52791 -26918 -17398 27110 43647 112815 67030
5381 67030 -87799 -10110 -52928 -93642 -114849 -88993 -133897 -152239 -160136 -165476 -129384 -135283
5369 -135283 -65382 -131751 -190702 -233888 -138090 -111703 -158195 -70227 -38887 -70813 -73858 -131942
5357 -131942 -199994 -120283 46008 -5997 -113780 -178817 -207501 -244637 -316737 -308125 -343741
5346 -343741 -384344 -329712 -212409 -166211 -148737 -49729 -36629 -76027 -56623 -83852 -79346 69596
5334 69596 140264 34240 -63919 -38357 -84767 -30578 39130 47954 -39232 -49301 42790 -4725
5322 -4725 -82923 -25137 -46964 -148760 -188255 -121412 -45748 -138903 -24612 111730 101964 128779
5310 128779 161172 -18749 -104119 16836 4889 -38072 173715 355675 264994 259091 115150
5299 115150 13527 21798 43563 51080 62625 -60876 -67780 -81134 -118307 -138153 -272504 -269891
5287 -269891 -235459 -202455 -62402 -28532 -122260 -143191 -5084 78696 84102 42926 114709
5276 114709 138019 129722 221765 67907 -108214 -101963 32739 106766 13813 -13147 -13647 -53012
5264 -53012 -48238 -71483 -72777 -49845 30296 47430 44638 -3966 -48850 -83125 -83555 -4790 109992
5251 109992 141511 80870 27160 12368 -93496 -24661 -17716 -51698 -1304 117262 160598
5240 160598 23569 -119203 -69638 -64403 -48597 10986 27225 -76821 19080 141997 32655
5229 32655 -7178 -27758 -167290 -273967 -257018 -222943 -184817 -123037 -80149 -89924 -29406 -46907
5217 -46907 -28629 -13335 -149768 -166917 -146518 -122717 19190 72805 -91866 -94304 86480
5206 86480 119387 123056 57491 47602 113856 114319 184728 87705 -14747 -108674 -143372 -6206
5194 -6206 188616 265860 345314 456319 403553 118608 -15892 20630 -6668 -5059 13982
5183 13982 52303 32609 -44344 -103509 -118072 -278508 -297731 -256708 -310916 -266062 -219781 -183564
5171 -183564 -59461 46394 -7540 -73568 -32094 67522 -30784 -106816 -145472 -253311 -265793
5160 -265793 -141825 59881 196881 44559 -153163 -186271 -260907 -266989 -337685 -322039 -242176
5149 -242176 -222200 -260147 -98437 16685 19119 -57096 -125951 -36466 74008 102605 98275
5138 98275 -87690 -134362 -164260 -250625 -149085 -82539 112903 215413 173574 32047 -14658
5127 -14658 -82613 -191984 -238099 -188900 -115748 4144 -23213 -16587 -73103 -70066 -44251 14485
5115 14485 -5147 -25322 41536 122281 118054 -22769 -76643 -88669 -9386 142816 6699
5104 6699 -19811 -60518 -43838 -15551 -29141 53977 76287 66412 31760 65865 134725 20702
5092 20702 20643 -6222 62881 108031 35107 -101828 -200336 -264392 -177878 2061 159159 103548
5080 103548 197983 158673 51825 -120754 -147985 -125915 -69996 36218 156425 180629 194730
5069 194730 99384 77697 81123 112508 915 -94695 8327 107160 13375 -124991 -237492
5058 -237492 -268233 -78166 -686 57953 227953 231634 92188 126773 49453 -60873 -41052
5047 -41052 -34893 -86916 -77486 -73029 -35139 23023 -10049 36263 -38283 -44753 33094 107643 37720
5034 37720 -37568 -15582 50016 79798 58520 47241 89814 2845 -49038 24206 40991 -38248
5022 -38248 -129283 -129771 -38960 19943 102853 152327 253746 182828 -6365 -62477 -167122 -223303
5010 -223303 -178312 -24237 38142 -13618 112263 232909 256120 153686 24278 -131391
5000 -131391 -79193 29717 37445 -54523 -208304 -214977 -90781 -120776 -115618 -28238 -177371
4989 -177371 -326017 -334509 -194715 -176792 -128752 -153594 -190042 -97384 -157771 -158986 -177883 -194954
4977 -194954 -169517 20587 143486 174495 118609 41192 -39886 -137592 -707 56325 79508
4966 79508 83100 210129 282415 215073 116478 -22980 -119993 -95695 -29920 -27642 -398 -6870
4954 -6870 211989 157689 171437 285917 155120 -8748 -6315 -50637 -140298 -298709 -196167
4943 -196167 -6474 -48235 -135753 -112832 -163311 -133864 -79493 -169796 -101640 8280 20887
4932 20887 80158 17021 36297 37340 23997 167106 128293 61734 25584 62443 57175 122963
4920 122963 102594 105274 81124 -65691 -43270 -66205 -104299 -78636 -24118 -97714 -184523 -83056
4908 -83056 103756 -35991 9031 -2794 45368 18542 25726 179437 209786 105340 -115220
4897 -115220 -186617 -247193 -171415 -146836 80126 152393 52104 66535 166847 198420 175207
4886 175207 143830 -15106 -56684 11910 45972 90971 116315 231081 158870 111753 161219
4875 161219 143458 820 -86442 1785 126821 184038 332069 256941 169832 86647 161765
4864 161765 94909 152253 64355 11896 60985 119959 48451 145660 159052 196169 178627 47421
4852 47421 -33584 -43222 -106727 20749 22833 60998 -4020 -3010 65133 120827 150212 68594
4840 68594 79906 116549 50923 -93066 -119272 -97230 -10228 78639 141703 110621 120416 -46212
4828 -46212 -34262 7028 70566 57663 -47103 -69980 -39608 83691 61574 -230178 -310458
4817 -310458 -208365 -115203 -58324 -32284 21214 -6977 -50807 10843 12568 16256 83115 123085
4805 123085 165491 165895 91319 117225 60764 57264 8228 127084 68859 -116149 -224989 -105391
4793 -105391 143659 88449 -50252 -104738 -88490 -24557 -72552 -69152 -61441 -183272 -191056 -51488
4781 -51488 -21863 714 89283 119734 99800 -14293 15055 -10731 71290 288734 278698
4770 278698 187762 115962 120162 145723 34894 -160799 -171145 -129295 -189163 -257333 -246439
4759 -246439 -128714 -94999 -97377 -52171 -140433 -121213 -161608 -222070 -178780 -163978 -179554 -149069
4747 -149069 -232862 -203652 -159188 -153546 -81327 -154787 -202074 -260354 -203184 -119509 -84249 -4422
4735 -4422 101894 95691 -60275 -75408 -88159 -56725 -6676 43737 -42112 -20212 34093 -59038
4723 -59038 -133006 -126512 -134649 -121431 -8737 -32107 -136086 -125228 -8240 53449 27659 27136
4711 27136 -113598 -197224 -147870 -165490 -161802 -239795 -230170 -131976 -171422 16974 194876 204562
4699 204562 167662 28447 101836 128976 80191 169931 182191 37783 72010 155138 63733
4688 63733 -56234 -136872 -152024 -100269 -217452 -293817 -378342 -341127 -148408 -62117 -48404
4677 -48404 -74282 -121776 -226717 -250269 -153399 -79930 -104677 -230481 -135122 -144157 -135187 15447
4665 15447 -5452 -66222 -87571 -132766 -49645 98038 59576 108336 206081 40297 24179
4654 24179 98257 176215 125999 65110 62933 132743 83222 21516 -25949 74623 86534 -181729
4642 -181729 -241861 -141206 -200757 -181126 -63116 -47277 -158012 -326170 -242562 -251018 -222433
4631 -222433 -43062 188170 209902 118196 137901 164761 94075 22429 -18882 1904 -64581
4620 -64581 -6893 62423 5888 -75532 -23051 58051 67110 85375 83882 101273 66563 151783
4608 151783 217106 57321 50762 29558 5903 -49190 18122 163458 286699 243587 47724
4597 47724 45539 143260 40728 12732 45028 98364 -11940 21036 -73206 -140904 -70766 -143000
4585 -143000 -40979 23927 -70810 -11668 53455 107041 53863 -92305 -172927 -80150 -72726
4574 -72726 -61464 -105574 -66810 -35624 27576 56443 75268 103138 60288 143706 261482 213777
4562 213777 193504 156326 156230 116693 48412 105207 101094 91978 97073 91393 139290 171145 52522
4549 52522 -53399 -48227 78573 119281 116381 157386 83757 107985 43633 141497 277705 210446
4537 210446 179451 214412 277761 284746 239374 175779 126889 45259 -29882 22778 37519 22594
4525 22594 67610 112592 -24249 -75804 -63392 -18505 91255 192826 99273 36596 6106
4514 6106 -89928 61428 111741 10378 3047 -44299 -197673 -267778 -242350 -175491 -95986 -112406
4502 -112406 -63901 -37089 147637 210057 142844 -45595 -97357 -152673 -111021 -36283 10360
4491 10360 -1188 -86063 -236382 -168425 25379 142588 84505 -13227 -17313 96685 100256
4480 100256 90260 56185 42573 60031 -92414 -226472 -94704 -26796 49219 29410 48183
4469 48183 -77635 -223639 -131459 -110727 -68959 74543 74133 69605 54557 70683 63634 7850
4457 7850 90224 28929 32159 116860 93830 -34561 -82061 -42955 -60337 -123151 -150146 -179009
4445 -179009 -192387 -237196 -218102 -195051 -74031 33903 83954 12717 -91163 -97143 3743
4434 3743 29220 -755 8113 -56597 -120759 -70941 73228 220141 72191 -145371 -4322
4423 -4322 36006 -118809 -234605 -166178 -10151 49064 89470 73892 29993 119350 153774
4412 153774 39441 -13547 -59281 -46549 128171 120233 18584 25464 54790 -35271 -75354
4401 -75354 28017 139829 179925 195223 157083 114406 202918 97156 5298 -76911 -93883
4390 -93883 -33226 -50761 -48359 -153404 -151083 -116562 -167414 -33343 62302 111780 131354 4198
4378 4198 64313 101274 84325 132589 166001 142971 359184 399836 350032 186548 228074 110003
4366 110003 -158730 -363507 -283963 -198770 -223739 -241639 -94272 68527 19371 84470 -32058
4355 -32058 -62599 65492 43914 -154899 -354048 -243623 -162681 -201276 -242696 -148782 -104860
4344 -104860 -150279 -103523 -150206 -219445 -128464 -121496 -79013 -190388 -217752 -67153 145581
4333 145581 282806 192311 23551 -97961 -204667 -179727 -116813 -147083 -80589 67685 319014
4322 319014 248637 104760 50185 4436 23032 124317 -18822 87873 132712 29469 113795
4311 113795 175791 298072 232570 85316 93443 174359 140884 -46800 -82458 -22586 87495
4300 87495 21785 27711 108282 74229 80680 125733 107259 42025 139504 312462 316319 116502
4288 116502 -75058 -152412 -145885 -60839 5574 -24422 25625 157277 73897 -58462 -63838
4277 -63838 -30102 -49459 -84095 30765 85787 51367 -77774 -220875 -82738 42624 150327
4266 150327 155277 121393 138349 68214 -59122 -46397 -116453 -105363 -21291 21387 -40185 -200946
4254 -200946 -323989 -340684 -259578 -166050 -158070 -82825 -31688 -94942 -250836 -254642 -101876
4243 -101876 -156692 -91962 48436 11839 -80259 -41353 -24462 40993 105528 72702 -147357
4232 -147357 -261474 -114169 -132703 -84206 5492 -58446 -103986 -56484 118712 211252 251898
4221 251898 173645 163648 136075 175606 229898 20583 -84396 -15350 136257 286551 5271
4210 5271 -100302 44696 -35371 -95836 -6373 -27901 49873 132972 46985 -20182 -89394 -116112
4198 -116112 -54838 48469 23517 -46190 -95286 -101632 -49420 48382 5024 -169550 -192625
4187 -192625 -204837 -171107 -84214 120706 101832 76746 -40508 -106272 9343 75910 93200
4176 93200 112610 94567 47897 -67237 -45020 17939 6909 55628 -43067 -29765 62632 178062
4164 178062 115532 45081 164149 167619 113843 244166 260227 107414 -52713 828 -58166
4153 -58166 -20331 -21032 -54387 -155525 -194928 -176060 -42685 84957 100783 100051 -104639 -133966
4141 -133966 -50681 -81930 -163000 -170577 -107541 51362 -2367 -54136 -146104 -236870 -253602 -123240
4129 -123240 -10267 -30820 78154 250532 263237 108890 75164 52520 25024 22364 73649
4118 73649 5424 -44195 46364 -21452 43408 46296 -79651 -49246 -159904 -284505 -295217
4107 -295217 -278778 -23020 10353 139149 160372 198133 166412 196938 165881 69562 52881
4096 52881 -62457 -222058 -206367 -148402 -118873 -120434 -68327 -139054 -186199 -167981 -155827 -146989
4084 -146989 -91289 -179302 -304796 -222255 -31461 -33069 -96105 -104265 -95102 5220 147913
4073 147913 134994 44192 27834 45720 151353 203964 78228 -26993 -106572 -125756 -198721
4062 -198721 -82402 30175 88390 73012 -73306 -159987 -24038 -23025 79855 107903 -132663
4051 -132663 -204769 -137206 -22893 33964 60177 -111287 -195873 -174207 1363 75229 153102
4040 153102 126217 192284 168167 97464 243031 284098 135890 122976 69580 -69856 -63929
4029 -63929 20467 -102658 -65825 41538 112869 135467 146535 146403 158891 -2041 -102842
4018 -102842 69997 113602 128413 97713 -19434 -27588 -68875 -215756 -155533 11816 14764
4007 14764 -76921 -37902 -37877 -93573 -57147 -91991 -19464 73016 179656 97390 88059 81759 166250
3994 166250 259037 163426 12922 14211 25024 38809 -26540 -69757 -53917 -58181 -51382 -52953
3982 -52953 4929 69332 7256 -126739 -96090 -42578 -106496 -176738 -180208 -43393 -29457 -50432
3970 -50432 -76397 -62394 123614 179909 109694 175386 167712 143663 153604 157398 84267 117190
3958 117190 110413 8099 -74355 -105958 -72161 49913 -95021 -94491 -51521 14451 78219 -5838
3946 -5838 -91196 -193020 -222147 -101836 -167324 -230410 -158303 -94355 4641 104603 129325 35887
3934 35887 -103546 69190 171971 83212 201132 279170 213182 -35076 -115673 -173312 -158960
3923 -158960 -42150 89104 201146 77517 9189 -13740 -2668 -60676 -12817 9070 -20633
3912 -20633 -171665 -150523 32612 99809 111950 30989 8002 49138 60700 67304 41194 260221
3900 260221 318287 99898 -35327 -87264 -99344 -2309 84804 42785 -77350 8890 95046
3889 95046 135825 282660 228166 40115 -6932 -94216 -7840 80834 88906 9078 58442 -21956
3877 -21956 -121099 -179285 -203853 -431 -11235 -11002 -92895 -135867 13499 42828 -13895 -62757
3865 -62757 55765 104393 -49096 -206443 -186633 -77470 73637 203452 286663 179790
3855 179790 160370 169954 177331 167059 122830 112643 131563 64691 99442 126746 282851 298730
3843 298730 306111 68332 -41321 34247 15843 11636 57069 -67071 -167605 3585 294317
3832 294317 260995 34452 -81888 -130681 9879 -11648 -63636 -76069 -37013 -1418 -7604
3821 -7604 -45402 -69211 2257 -46537 5025 37031 119341 124585 162169 187169 44984 -2715
3809 -2715 84387 172630 317914 88617 65170 84231 131872 138806 40962 -65497 -65117 8324
3797 8324 73858 132966 49189 -31438 -71800 -101020 -24599 31581 50003 17629 -11580 164525
3785 164525 59006 -114614 -167609 -143718 -110838 -21447 188781 219740 132253 39300 12344
3774 12344 103502 201533 126200 165284 170435 16809 -41798 -155928 -23058 -35907 -70987
3763 -70987 89047 168799 -32403 -187665 -264338 -232798 -227966 -264912 -116781 -87426 -137061
3752 -137061 -116083 -26298 98320 204561 249868 279160 175457 -12213 -126101 -6107
3742 -6107 260509 353667 264258 29954 71726 84328 5940 -51394 -88626 -217795 -208035 -225691
3730 -225691 -94993 -30272 -103802 -208827 -126429 -73541 -103486 -192759 -119022 -499 19103
3719 19103 88641 112618 34324 -71160 -58830 -13189 -10193 68296 154890 147974 128016 14340
3707 14340 33826 29364 -80591 61379 122566 19910 45476 43219 2162 -153268 -159729 -71996
3695 -71996 17580 80837 9643 37067 29486 -12218 33547 -92330 -67850 -152260 -85179 -8577
3683 -8577 -2331 11002 -58387 -137226 79607 247855 225591 156472 165647 41924 -129540 -193462
3671 -193462 -84062 79574 6418 -128828 -133525 -96550 12736 99161 98504 -40689 4935
3660 4935 50900 32117 41224 -9001 36292 99701 179718 328620 278378 66432 -59003 2263
3648 2263 70044 223581 206226 174725 225857 144 -103407 62295 164683 205084 148722
3637 148722 94999 8284 -68308 -27538 -73677 -145284 -263674 -144996 -27109 -99204 -17746
3626 -17746 3677 -17919 -58168 -83303 -42792 129385 177135 99775 -3567 -23373 -130678
3615 -130678 -184727 -12573 15335 50756 82208 77404 124717 90353 -31795 -38295 -149737
3604 -149737 -50416 12520 -46557 -4997 33148 -36833 -82816 54950 49737 115458 190546 207131
3592 207131 148780 35291 67047 64116 226348 225734 96750 154725 69189 -13663 -48253 -87543
3580 -87543 431 -65899 -185461 -99748 65672 215024 203527 81936 17029 92298 226993
3569 226993 170194 178465 191627 66910 -32707 -150581 -211487 -140875 42014 61193 26920
3558 26920 96801 -15191 -177605 -171308 -113405 -9193 46676 53978 50620 9287 -191212 -166770
3546 -166770 -107642 -135168 -22304 24238 160783 104087 -101857 -142011 -126495 -96659 -57136
3535 -57136 -47654 -163485 -173020 -67448 68301 82165 93090 133170 152522 -22425 -119144
3524 -119144 -193454 -204305 -332797 -336420 -237324 -231266 -182292 -120627 40842 74715 126509 137837
3512 137837 195673 217068 132225 133830 123485 63528 97842 75083 43409 127773 158426 -13044
3500 -13044 -5470 436 -49069 -89395 35452 20109 94811 -42395 -83239 -22324 -23312 -52548
3488 -52548 -5217 84305 189210 213894 -19722 -185011 -129122 -141710 -130620 67426 175431
3477 175431 150706 4765 18475 55870 121344 -27997 -5547 35267 -53934 -137799 -185477
3466 -185477 -370525 -382076 -294348 -259066 -187306 -94815 32303 114571 -8483 -60183 52549
3455 52549 52198 33244 -31002 43868 61577 -72047 -288251 -323264 -341667 -250211 -148121 -90767
3443 -90767 -132633 -180673 -89389 -168097 -154553 -113253 -133328 -163784 -68532 -114704 -174923 -199423
3431 -199423 -151644 -176146 -136588 -1285 50614 7099 -134204 -188886 -246669 -265330 -192176
3420 -192176 -205321 -238099 -200464 -150162 -85018 -190971 -121451 -172969 -187518 -110606 -254082
3409 -254082 -267948 -191484 -104397 6135 103295 50607 62562 -60802 -102870 -30926 -92516
3398 -92516 -66454 -130436 -153624 -59375 -38215 -28775 81254 281462 295705 284128 314030 172471
3386 172471 78229 127522 70330 -27070 -96074 -83053 -32072 128715 113300 -141377 -119946
3375 -119946 -111783 -84073 -63769 -49934 9618 72235 97863 144740 158425 -28941 -104941 -22513
3363 -22513 141957 183591 229905 216245 97130 -21201 106733 133008 98698 43916 50724
3352 50724 45461 16377 -80478 -71854 -71745 -111437 -73086 -19565 -48598 20350 28271 85244 14745
3339 14745 -40878 15142 211306 233250 244065 86066 97958 141444 88985 6420 38712
3328 38712 58675 66310 25754 -30418 -44689 -2975 37885 -29028 -5490 65715 50564 -16553
3316 -16553 -41625 -90326 -156267 -48866 -48586 -111492 71410 190128 182640 178485 159795 145804
3304 145804 264532 334866 204890 -22354 -162389 -163836 -68676 -75217 -199322 -271604 -80012
3293 -80012 24418 30707 48207 147002 144440 3745 -2910 -12411 -10192 -20281 70356 213283
3281 213283 257048 94301 -165330 -255140 -336754 -304313 -345640 -210489 -77636 -20458 12889
3270 12889 -28920 -74711 -113996 -70595 75719 142002 189008 179392 124364 142737 112508 22064
3258 22064 -109809 35954 72865 -95848 -130013 -101952 -99365 -184841 -102293 11058 -1762
3247 -1762 11551 52645 37839 41404 18434 -33977 -31228 31824 84565 -19661 1285 -78653
3235 -78653 -22417 158522 183722 116343 19056 12938 40395 -8854 -131962 -154957 -202747 -188002
3223 -188002 2251 -6886 20205 -61229 -69601 -81023 -55358 -87 78940 63871 -7720 -34636
3211 -34636 -134093 -79189 -114413 -258270 -304496 -119685 938 44563 93738 32512 -55673
3200 -55673 -79947 53510 116248 99405 19935 -48066 2187 -1273 21745 3327 14360 46705
3188 46705 43066 115886 92669 -72796 -112360 -103881 -145174 -150241 -192432 -76533 -63035 -202873
3176 -202873 -157366 -120197 -153502 -68672 -134002 -187595 -79115 15340 39202 105018 85431
3165 85431 125703 -79477 -136032 -9640 89460 209514 208224 220520 189535 36575 -74178
3154 -74178 -153047 -213532 -173061 26776 143261 118665 154690 149135 91009 91737 169181 152726
3142 152726 105413 163655 215928 194033 68882 72895 -9109 -26875 -60477 -86042 -51749 112482
3130 112482 87971 51424 -56028 -106995 -84181 -37224 105720 197204 223508 184440 118884
3119 118884 -1017 -30986 -20035 -159848 -143950 -46703 39915 7038 26285 11663 25891
3108 25891 116132 221729 263076 174308 82301 97186 -17537 -156882 -121334 -108958 -112099
3097 -112099 -82234 -133208 -45230 -20913 -124630 -184553 -87617 -144741 -114368 -64865 -10929
3086 -10929 -78672 -46901 3830 36644 28759 -51801 -49300 -6490 -27655 -29637 -38383 37402 123944
3073 123944 142086 142258 93690 64134 131839 72786 142210 151698 150503 77867 23746 97731
3061 97731 68874 -27187 3801 -50704 -59894 -51006 -111834 -8983 10676 -121490 -134235 -149063
3049 -149063 -159810 -93160 -99514 -112902 -78609 17301 141229 97888 -39714 -34452 32890 109461
3037 109461 135147 218355 161609 91648 146125 175073 113478 63187 97831 265701 290971
3026 290971 177912 97539 51852 19682 171827 207924 172956 24170 -54077 60439 47826
3015 47826 29775 78012 99816 105869 60792 67038 -1470 -22683 -51941 -75871 -177039 -170745
3003 -170745 -48050 -15685 110858 202698 116228 17906 22263 77748 44475 -28956 -32879 -44499
2991 -44499 -148008 -79560 40200 70187 41306 -65665 -109966 -39038 2249 30202 30229 32044
2979 32044 57067 4063 56559 143068 55062 -109051 -163935 -36862 49061 249144 102113
2968 102113 18980 62292 -16761 -117491 -111372 -24888 16071 47389 17103 86930 218882
2957 218882 277785 293136 292775 162139 -17556 -192679 -172569 -32332 94720 121935 161389
2946 161389 151776 59082 71630 91461 19719 -4584 115029 322578 201624 84464 83308
2935 83308 169853 76355 -160986 -145029 12725 203024 190385 186852 255651 281162 125367
2924 125367 -52735 -62613 6221 5057 -12476 -161623 -35206 -39069 -81571 -74994 -168623 -138082
2912 -138082 -193965 -185679 -232632 -102631 -151691 -201155 -77160 -58472 -174607 -183680 -110099
2901 -110099 -127395 -64137 -71762 -90129 -132618 15300 155923 171511 188560 184455 115510 156979
2889 156979 197527 209501 277301 306251 101191 32530 52483 86039 107176 -25731 -110641
2878 -110641 -180150 -240485 -180949 -65936 49055 119099 93479 48626 166300 124043 135322
2867 135322 100496 1498 -87460 -175014 -182398 -105689 94262 120629 178989 209585 116144 15009
2855 15009 -77105 -76495 -99632 -75662 -5832 7 -8273 -51303 -10764 -41558 -126869 -94598 49055
2842 49055 -58347 -200696 -245519 -188849 -137738 -125807 -143640 -103115 -175348 -123211 -62965
2831 -62965 -32911 77059 97157 18949 -115507 -82602 -62464 30225 124733 63081 -67884
2820 -67884 11788 47912 -11338 -11902 58102 13178 19269 -80726 -52195 -63949 -1277 96008
2808 96008 236870 165343 85912 77963 141310 140417 65708 -76639 -107755 -89453 -75154 -24210
2796 -24210 -22523 22324 9757 -18870 -73434 40254 114099 131687 93582 -690 -108956 -102794
2784 -102794 -97157 23064 -75804 26295 75871 -58033 -51075 -33345 -77209 -50404 72620
2773 72620 -20813 -99220 -80029 -100168 42131 89693 13374 -55 107220 198705 130534
2762 130534 -56672 -28038 -63258 -138309 -66788 57120 79949 -25672 45030 50685 30215
2751 30215 -3057 -26366 892 -118896 -147771 -92389 -37646 12491 -10882 110672 124364
2740 124364 181987 172060 188166 131586 69847 3295 -83488 -163662 -321242 -323663 -184972 -129659
2728 -129659 -99426 -35595 112045 112400 52722 159414 107568 65277 86537 116346 56632 -16707
2716 -16707 -42463 -38095 -36888 -81909 58759 153507 104117 88819 41615 16692 -84264 -157498
2704 -157498 -294546 -328557 -185591 -135339 -82284 50416 3655 -44740 55486 8893 46626
2693 46626 148871 104641 101161 231861 217823 216473 230046 101174 1706 45398 116690 101220
2681 101220 62836 157148 172748 170198 111889 80868 218547 251367 113896 115661 203403 146405
2669 146405 149710 64727 39402 127966 137188 63535 -12657 11543 -39383 -285663 -331891 -218784
2657 -218784 -133998 -30828 -15486 -57197 -110712 -92435 -147620 -191563 -205507 -256307 -50049
2646 -50049 166317 124154 118728 106295 41665 161565 152560 183865 236572 91210 -20949
2635 -20949 55576 20712 -74088 -3744 70896 -6695 -74756 83846 107913 16521 90450 93304
2623 93304 3764 89264 146690 119501 229108 275748 303828 228158 104623 60620 89805
2612 89805 150596 155467 58986 -13668 35692 89959 45138 -53573 87391 119603 143839 10531
2600 10531 4879 171590 270285 77772 -116679 -136601 -59859 -184748 -116064 -2491 -4146
2589 -4146 64205 -25194 21954 50059 92792 192868 141270 148661 170375 305558 236848 111429
2577 111429 -55282 -75134 -33002 78708 7543 -97553 -53745 11921 103248 179949 204433
2566 204433 170483 98663 102813 45413 137496 -8253 -150325 -66145 27972 26876 25253 112062
2554 112062 -56237 -141090 -61100 32751 47676 -91965 -53551 28524 67931 -103488 -221510
2543 -221510 -203108 -172812 -188831 -28021 -30460 -40410 83439 183642 325052 445641 374686
2532 374686 289474 106099 109212 90160 87097 108730 64791 -63345 -54438 17017 -98795 -129635
2520 -129635 -30684 -27242 -48879 53295 181907 290717 128438 7646 -53328 -43360 36077
2509 36077 -65041 -123882 -100654 -112369 -78236 59623 -110092 -221493 -214568 -87204 -24512
2498 -24512 -28579 -29738 35629 30426 -1408 39127 74427 -70502 -163974 -162838 -64174 165719
2486 165719 265453 178413 23707 -113911 -92130 -67175 -24088 -47239 -147758 -36664 -43025
2475 -43025 -23712 82460 67331 -46659 -100944 -68617 -98497 -57767 -53092 -71023 -62215 2048
2463 2048 70959 116937 48174 38619 19350 12595 -46545 -123071 -178207 -147562 -208172 -252574
2451 -252574 -233276 -143923 -92596 -124804 -95228 -104391 -162602 -227327 -148567 -71392 -3962 27945
2439 27945 -34917 -66448 -5138 -156979 -216677 -198205 -228173 -9141 72536 -101121 -119480
2428 -119480 -196991 -199156 -83150 33029 59100 11779 130257 165013 46815 128748 272691
2417 272691 322602 188784 164074 257228 149890 32188 -54409 -63498 -74903 -62906 -59984
2406 -59984 34833 97618 165033 95855 143265 195910 244185 196882 203417 146525 78329 103975
2394 103975 232841 242270 202759 162026 29902 107945 -44272 35201 150257 227930 264218
2383 264218 67448 -103855 -157492 -161771 -5412 140355 147943 45081 1364 67293 44109
2372 44109 26810 -12481 -64517 40508 126526 101415 26690 -143015 -81875 58173 170781
2361 170781 126396 36674 -75597 -148681 -96122 -41809 85979 39497 19096 -23169 -95986
2350 -95986 -21949 43873 71750 15791 -86511 -252442 -243316 -109427 -101034 -38563 -18548 -71397
2338 -71397 -78750 -55152 -143557 -108553 -100256 -165230 -173972 -263545 -237326 -107972 -83233 194350
2326 194350 278273 177183 118111 124865 84859 74026 38933 110906 -32789 5690 -117384
2315 -117384 -167723 -180355 -94219 -4705 -12840 142850 196017 253580 223555 80165 7445
2304 7445 -31925 -75216 -84300 -334 20523 -38930 -22381 -84687 -98541 -154965 -138986 -158378
2292 -158378 -289136 -155219 -24050 -102276 -32577 -9948 -1651 -78275 -163632 -117092 -113353
2281 -113353 -32047 50271 78045 61490 100370 98547 60478 -6908 -42135 -85009 -36959 -14975
2269 -14975 15868 144758 81596 13422 94824 69572 -32262 11869 133317 180844 275919
2258 275919 250760 188323 107749 50205 50441 147274 177129 72389 45052 14835 -39094 -18823
2246 -18823 -68424 -19126 132543 185728 142002 144751 172383 33563 16545 136167 92963
2235 92963 -93426 -17650 114303 92756 48237 -92160 -94087 -68390 -115807 -95111 -80027
2224 -80027 32057 102144 177805 286951 185566 155927 85416 127877 149551 121199 225984
2213 225984 93608 -97622 -31124 50360 41295 -72703 -96122 -26997 12918 -1528 52966
2202 52966 60802 60089 3877 -69488 -140450 -203426 -19169 79865 32585 -101993 -244027 -122980
2190 -122980 46957 18112 14709 -87171 -249474 -248746 -211631 -139982 4447 221088 246090
2179 246090 173693 173653 104172 44623 92067 56881 26838 -11415 25856 -11468 -77814 -155045
2167 -155045 -114093 -91799 -19779 -70046 -101100 -51752 -61448 -87001 -52548 -83251 48817 76193
2155 76193 118539 275318 310907 163866 50552 -30345 87396 51973 -95884 -126066 24260
2144 24260 -29368 -69426 65246 82421 223991 161456 28843 -87768 -116091 -159287 -199933
2133 -199933 -214736 -166069 -146263 -191451 -219164 -113511 45742 29020 -79689 -126976 -99081
2122 -99081 -2824 9838 11677 167689 87046 68980 4129 -52372 29130 199698 320410
2111 320410 382373 383955 315962 79472 36390 103279 86104 47989 -52244 6907 -12474
2100 -12474 50145 117561 4807 -6791 -96246 -94523 -91248 -13774 68861 -37749 -138951 -211754
2088 -211754 -266244 -206948 -165219 -93476 -49846 -102435 -55819 -55412 -81107 -6109 95508 123722
2076 123722 35863 -13675 -3216 -117728 -147312 -142447 62729 -4184 -90478 -127879 -216865
2065 -216865 -238795 -272682 -271204 -95137 20849 -65102 -96673 -217251 -231202 7068 100608
2054 100608 20693 -109025 -157699 -180938 -143310 -110805 -37386 -20431 -148111 -96233 -18340
2043 -18340 -94420 -325106 -320099 -177781 -96437 -80448 -42111 50468 9439 67362 132244 11402
2031 11402 -84816 -134074 -162414 -59231 -69616 -114679 -258430 -190501 -59885 64809 198399
2020 198399 187187 97253 -68654 -8848 29541 -52356 -103824 -48353 104103 100898 48881
2009 48881 60236 87463 49509 208973 144185 -73703 -200663 -74712 -117549 -65680 666
1998 666 53373 146894 111081 129733 40794 53789 85509 -37474 -212132 -143998 -55551 -93881
1986 -93881 -122994 -85700 -17554 -78291 -116827 -27854 -145839 -19614 28389 -29488 131902
1975 131902 177476 140692 89571 231550 219055 110045 124641 296574 250874 119558 34190
1964 34190 -660 -1077 105482 270466 322415 181445 38799 25685 109953 62392 -22233
1953 -22233 -105334 15722 20236 27902 -25890 -90884 -85224 -178845 -137428 -6524 53395 263498
1941 263498 265547 100080 157935 273878 279094 249710 188688 95277 9062 68124 81359 -76981
1929 -76981 -139603 -70574 28807 96354 -63844 -111295 -134840 -105042 -63552 72004 101230
1918 101230 5285 -26446 -25608 -12288 85404 112917 219133 126380 -139230 -182606 -77877
1907 -77877 -166735 -206854 -292598 -211064 -85238 -125158 -79318 -45666 57753 132948 118856
1896 118856 75695 -19643 -32876 -46919 -80079 -63711 -219173 -194239 -54429 -18607 -16969
1885 -16969 -167552 -136532 -155776 -73949 -89992 3796 52641 74987 46841 28045 -11012 -72466
1873 -72466 -113577 -57252 65106 223450 257480 300674 259674 135064 40515 -19742 55447
1862 55447 149116 184772 179622 257081 188053 69997 10524 98042 206765 144819 -40087
1851 -40087 -167518 -176860 9022 2649 -133018 -416369 -482741 -263096 -154498 -177485 -154623
1840 -154623 -4269 12094 -46265 30123 80466 120373 49420 -16658 43482 132696 -42299
1829 -42299 -115736 -233267 -165095 -151969 -103491 56337 161050 263651 460990 318058 122609
1818 122609 113701 75813 -29448 -26430 80763 -81938 -104916 -55517 77523 151550 95458
1807 95458 119996 118932 -77361 -127591 -10342 -37166 31974 -4956 -140088 -240471 -304795
1796 -304795 -161924 -119136 5001 126871 79936 11416 18390 83080 161873 171593 93619
1785 93619 20994 -51775 -7970 -19810 36791 -35315 58891 69935 -4215 48758 246338 439441
1773 439441 288792 129592 82295 -102175 -182927 -172221 -212876 -174427 -15692 168452 107993
1762 107993 44173 90290 8095 -39153 -39430 42871 30068 45688 -21504 45929 147500 243447
1750 243447 174622 130238 172397 213260 97989 -1237 605 -20295 20775 119475 66401 113420
1738 113420 64128 112582 243679 157606 -9080 -102056 -114822 -42163 -2853 34783 176240
1727 176240 17590 -68705 33384 39702 180827 351183 400729 319505 228377 193520 98633
1716 98633 41804 183993 218001 193736 60852 -623 57558 46836 74816 -64450 -170929
1705 -170929 -13809 126477 45682 -100580 -159808 -215353 -237091 -81240 -109015 -2135 -19409
1694 -19409 -42359 -77948 -72149 -54669 -53669 -37682 -18407 -4259 -66485 -99474 -118660 -58778
1682 -58778 43972 -11535 -39928 -64910 -119074 31404 214136 134809 94988 12090 -102339
1671 -102339 -102620 -167516 -135129 -25812 213682 244912 119951 49065 69101 46667 -16291
1660 -16291 -4675 -40467 -7847 74844 103395 72821 -64691 -141545 -47953 -68449 -126400 -64717
1648 -64717 35326 180028 199494 38875 48212 43505 -6828 90188 227311 297026 259256
1637 259256 292112 269042 343434 228278 89047 35595 103672 206767 253979 116464 28430
1626 28430 30481 69409 13986 112095 171058 146292 -32505 -142857 -149937 -32976 17868 -39733
1614 -39733 -14324 35644 -46876 -40264 -46180 -13040 -76031 -39418 98308 -120957 -267491 -201378
1602 -201378 -44089 15270 31842 -46100 -75494 -117987 -139574 -35333 64021 97182 247721
1591 247721 385995 353174 205417 146467 43673 22405 -5145 65037 97698 114979 68822
1580 68822 -20976 -67037 -159553 -143872 -7307 38784 198694 223365 131903 51559 111907
1569 111907 91012 67474 44953 106069 145606 -3863 -37670 63623 58770 -24486 -77799
1558 -77799 -31471 50034 20833 45063 80448 233363 164989 78085 28732 -7422 70026 190106
1546 190106 197598 254867 210530 98307 -72827 -240815 -210403 -102058 -100705 -39733 -2994
1535 -2994 14528 -56477 -145097 -139760 -117686 4952 174911 228205 85195 80503 160208 224624
1523 224624 154004 155368 190331 158771 159699 176302 237096 156531 4839 -77688 -59159 64115
1511 64115 51893 -27636 -49568 -28546 6124 -12310 -99017 -16861 -4756 -1280 -58810 -92073
1499 -92073 69492 105524 125449 191878 140956 24013 -79353 -116571 -117740 -119915 84791
1488 84791 142145 37717 -7797 -105207 -153226 -5652 -37101 -179097 -99430 -152801 -160442
1477 -160442 -168033 -243515 -199454 -128692 -234115 -176566 -37767 -95703 -197304 -99531 70070
1466 70070 176732 105141 28377 -86337 -104659 45694 110013 150466 100870 38613 -13241
1455 -13241 -18656 56148 29081 37158 -1762 -5817 -158632 -218067 -33466 98448 118102 -16191
1443 -16191 -119673 -73817 59251 94314 11777 -27678 -149267 -267015 -283265 -268214 -248524
1432 -248524 -167989 -181374 -230535 -210523 -188368 -215116 -124951 -60580 -14649 -45006 -30047 -101980
1420 -101980 -107027 -94136 -166966 -274062 -324648 -227895 -285428 -199335 -41238 43745 141690
1409 141690 33425 -60000 -102831 -47903 -81553 -138740 -52528 -51038 -131394 -102937 149019
1398 149019 276120 166168 116577 56454 -124197 -84596 -31376 -88905 15678 -41800 -94133
1387 -94133 -100181 -128801 -171982 -155775 -85463 -61993 -51820 34830 31013 68611 94462 48322
1375 48322 -63612 -107652 31895 201333 170310 70980 -6249 -72 -5115 -59413 -84840 -103616
1363 -103616 -61069 -116883 11634 97561 103646 101316 66851 63413 15783 66291 -38450 -119805
1351 -119805 -115844 -44018 57709 109702 14023 54471 70129 62688 207113 390535 369618
1340 369618 291704 239020 143374 97232 22746 44196 34948 -26513 -148943 -90199 -117649 -130658
1328 -130658 -86282 -85900 -4465 58104 138481 171740 150577 194789 146513 89113 167424 140151
1316 140151 153208 149172 100336 52271 -96551 -59769 28384 28557 141299 97887 104937 41501
1304 41501 -6128 -61916 -67893 -155680 -154297 -99137 15116 -37453 -54911 33084 36892 -42474
1292 -42474 -197274 -256481 -251183 -150134 -64899 -96593 -99257 -148546 -154249 -108538 -229759 -218117
1280 -218117 -183918 -189193 -204463 -22007 31579 29049 -72902 -21599 -57961 -84945 -107857 -188995
1268 -188995 -137040 -177433 -168715 -118291 -72511 -11958 -8964 -25533 67268 -102950 -141883 -170040
1256 -170040 -163892 -184555 -183346 -124719 -52288 -64491 23508 -50905 -16507 -29178 5807 -74063
1244 -74063 -181606 -127571 116668 217981 172720 149524 113699 148365 71479 -8351 -46607
1233 -46607 -92865 31254 143987 202776 77034 89950 136192 15509 -150636 -170716 -160589
1222 -160589 -190371 -88750 -29869 -24832 -55124 -161537 -216364 -173793 -97896 -81998 -131926
1211 -131926 -133298 -61576 38494 -74929 -155859 -227127 -149595 -64403 -9221 45261 -13319
1200 -13319 -20788 -16071 12815 36084 -59532 -44758 57134 -73795 -82331 -178079 25312 163608
1188 163608 185976 55735 -34235 -107593 -39601 46520 72089 137150 161165 193591 328419
1177 328419 218109 106954 137222 76661 81652 100200 7371 67781 216115 193302 158415
1166 158415 75327 19096 -31518 30400 126033 128056 68984 129184 56419 -41466 -14957 43923
1154 43923 -22858 -120532 -176889 -191817 -63511 17598 -68729 -105030 18781 78568 179535
1143 179535 127864 -60454 -233763 -274433 -114740 88501 97513 116364 85257 -30925 -69457
1132 -69457 44344 49710 96035 154361 5138 -58087 -58211 -3391 8460 -46461 61200 141958
1120 141958 140941 75346 -11328 -88367 -55674 8229 18289 60159 56905 4109 64660 175268
1108 175268 107058 -57454 135445 194391 257386 319242 331041 272966 219705 140899 119394
1097 119394 238903 215890 138562 80380 96485 273525 304603 249358 225046 137048 85499
1086 85499 89166 29328 42651 124906 110680 70374 89553 221114 105902 18763 -144421
1075 -144421 -82004 122398 5916 -113222 -138048 -201669 -162038 -102541 -33653 51531 89392
1064 89392 116906 -18844 -158421 -101788 -24816 42822 101451 16398 52756 123513 45091
1053 45091 37770 -58595 -73529 -40067 -75425 -1890 -31987 88275 124635 46053 -13891 52527
1041 52527 140213 222549 219181 92316 9195 -54604 8500 -46492 -176448 -225389 -179165 -251809
1029 -251809 -281645 -317706 -195015 64422 150363 -48116 -72479 -14904 101171 15822 89773
1018 89773 143214 -21352 -28592 97672 81257 36783 -30272 -66740 -118671 -31971 183193
1007 183193 330453 200355 195866 109596 -45924 -52205 38330 59793 -43975 -176250 -252887
996 -252887 -249020 -290244 -241520 -247652 -257510 -190473 -134376 -42045 -76085 -99784 -57304 -30091
984 -30091 -100399 -72074 95309 1700 -119743 21037 -19654 -55536 -52275 -42672 29484 95912
972 95912 -20003 -45502 -97951 -229269 -79756 -66025 -80013 76681 201133 13727 -78232
961 -78232 25454 57965 1754 18690 124660 206622 134796 -64047 -85015 -150201 23340
950 23340 107185 79252 126325 171402 84338 -7896 -33940 -67999 -54314 -113895 -161690 -59629
938 -59629 -28394 -47672 37361 48655 56095 158873 20782 60408 2024 -196694 -334893
927 -334893 -338392 -213896 -113223 -75442 -20768 -57862 2567 -30611 -214731 -76662 -48905
916 -48905 -145188 -174216 -143678 -213085 -215483 -21441 -29304 -14773 91248 154961 69163 199421
904 199421 271433 116503 86805 66748 -55381 -81268 -9902 -1388 98534 232786 325132
893 325132 225343 107186 62469 72506 42959 -79941 -179000 -86203 -37640 -46043 -14389 24918
881 24918 -61245 63316 99445 118765 187607 207509 184036 197145 87271 26592 -45784 -30723
869 -30723 -15160 -117391 -48598 -49527 99090 255260 147227 79910 13133 82013 222061
858 222061 206736 171935 98997 -17352 -13199 -181278 -304410 -308840 -391548 -353866 -193358
847 -193358 -162354 -105485 -86761 -136825 -66473 -74281 -1281 -5443 -64344 -155837 -91565 -134175
835 -134175 -97018 -50410 35677 153932 133168 -19859 27010 174460 292306 163995 -58721
824 -58721 -133005 -178630 -113780 17634 165320 167784 138854 57070 -19677 69021 59792 -84882
812 -84882 -139588 35304 110519 166014 181046 24068 -138921 -214675 -81602 53635 86471
801 86471 70870 86581 235382 223668 91096 166909 197197 185740 165374 144959 113584 51911
789 51911 101060 50666 26436 67901 56516 -78694 -82918 -43000 30448 -23068 30588 22364
777 22364 -45762 92164 78403 -71086 -125678 -232067 -192127 -127021 9985 85681 -121047
766 -121047 -230255 -192797 -145078 -117334 -138010 -171471 -127935 -30870 -164348 -3474 183900
755 183900 226617 108542 78398 82509 19510 -1378 95526 215040 298593 355458 360048 252807
743 252807 290835 325219 352982 194195 210573 205424 149265 98898 158182 127647 136833 209713
731 209713 111743 91346 11508 63071 216859 263168 238103 180540 148368 -17710 -8103 -99550
719 -99550 -78101 21029 100016 156040 3228 -130828 -147246 -103283 16734 -83565 -137083
708 -137083 -161967 -128480 10744 53117 115283 137255 209101 309022 234037 193141 221019 37419
696 37419 -131762 -270091 -273251 -306873 -258050 -207417 -86271 31667 -31358 -45593 123836
685 123836 81732 52567 83138 100656 12340 63658 84190 -62400 -161407 -214567 -243277 -173260
673 -173260 9376 80457 -31070 -101492 -92318 -66114 -73874 -127602 -175645 24134 193374
662 193374 194853 40938 -9882 22429 133075 245686 50034 -55343 -3967 125787 143874
651 143874 163920 157615 146421 60661 -26967 -25796 223231 257148 161985 136355 100085 -46460
639 -46460 -59031 -23516 45118 98309 36617 45574 133005 187470 183152 121365 184205 218291
627 218291 220008 166001 106254 51801 -57324 -130223 -14994 -6393 -119694 -128166 -143909 -23577
615 -23577 158396 73338 -90170 -134559 -60349 -16060 -71054 -13391 -68584 -142224 -73474 63295
603 63295 36303 46805 102717 68181 2376 18980 3278 17754 157687 254081 243618 186201
591 186201 26010 -54603 -24013 24718 23067 -60737 -130449 -73231 -18970 54654 111909 209635
579 209635 173472 117128 90873 78617 47861 42199 116428 170546 29733 -93089 -65499 3857
567 3857 -68967 -111508 -11830 -78741 -159375 -111903 -4680 39890 89652 46191 10006 240086
555 240086 285462 273623 235310 250837 158023 6449 27906 123586 97701 -2897 -115871
544 -115871 -132058 -72029 -145687 -193130 -118280 -6803 152292 245176 287704 226330 103834
533 103834 84413 17137 -33682 -164592 -132460 21830 68253 -47314 -13450 -2683 -40004
522 -40004 20574 38984 15898 -6814 24744 -8037 14618 14747 -56975 -17863 -29615 -39414 31835
509 31835 -95836 96734 229209 180139 54665 54590 105 -79031 -49095 -108004 27989 222016
497 222016 194921 185551 19404 5298 32321 88037 174646 114553 -104859 -171163 -8681
486 -8681 84313 41026 79735 51 50615 129190 317287 286059 293505 254283 278446 338074
474 338074 198182 27441 7109 163891 195791 69101 128576 340607 300051 154544 108139
463 108139 136035 34873 15356 3486 130360 185696 95519 54820 -96525 -113088 -78834
452 -78834 -88749 48096 35682 3126 134279 187525 126701 56973 -16991 -97962 -30974 -8955
440 -8955 45201 82870 95991 110312 43082 48978 75118 82714 151484 235165 117655 23321
428 23321 -29178 3993 -131309 -154879 -1309 117579 38614 45697 105482 -22583 41931
417 41931 144774 215069 211005 133486 148272 102014 115824 152104 205253 135467 16468 31841
405 31841 97397 43360 -32910 -108251 -144899 -139550 -80337 -21178 -97372 -25488 18760 5240
393 5240 -18593 66986 176372 80924 -127148 -38326 110216 80578 -5463 -142793 -206902
382 -206902 -228005 -208627 -154424 -89922 -72360 -80967 -34295 123437 138109 76876 117270 131929
370 131929 91701 145436 283450 264083 253953 229732 225035 241964 49885 16115 -11351 18768
358 18768 182021 107436 -7743 -63199 -101647 -107111 -124119 -89890 -36571 7296 64691 52757
346 52757 -44154 12469 110748 121849 118690 115826 24847 -4167 -28514 98165 73154 -40489
334 -40489 -91483 -82914 -216360 -195498 -142670 -128452 -36456 -31509 -68927 -14067 -4796 97710
322 97710 -20653 -190302 -200904 58484 144278 185944 120440 -60702 -126677 -114736 -51193
311 -51193 43088 82497 90360 -19545 -12018 34321 134310 163379 81937 -65770 -153336 -191176
299 -191176 -254860 -173395 -45943 -40809 -153630 -96398 -120252 -155050 -58635 -49176 -69854 -44993
287 -44993 49504 60488 14122 -52748 -16577 -31740 25705 21339 -118108 -93823 75750 47565
275 47565 39790 97908 -1973 -45933 67309 109401 129326 125245 69712 144660 61619 49159
263 49159 44994 -101045 -92432 8428 40430 -7978 -106982 -94904 -69806 10473 139823 186445
251 186445 139748 106007 51911 21227 42571 119113 140452 38478 -69446 -62679 -95748 -62002
239 -62002 -11387 79871 153362 175610 173639 179077 77518 58492 140586 131925 116181 135874
227 135874 136825 42025 -26036 -19074 82291 104343 36056 45204 88363 65097 41675 33428 160051
214 160051 270787 236305 170978 172943 231316 264904 270201 227794 79478 89954 61921 121000
202 121000 213586 301039 208875 31908 44429 205014 245806 219591 120008 162276 204641
191 204641 201838 95283 1299 -31194 83888 149890 205176 183671 80178 -64056 -101171
180 -101171 -34977 43590 54505 133527 102331 46100 7048 -94656 -133426 -76393 -78594 -6599
168 -6599 -72115 -40825 3306 50061 15389 46743 -13609 -54254 -53975 -73710 -126218 -106459 -103425
155 -103425 -50659 -46120 -132093 -166376 -128593 -95606 -65057 -38284 -64202 -175153 -138671 -48117
143 -48117 75213 212882 314729 275412 221211 245903 188946 130587 148341 50335 42017 -66520
131 -66520 -42175 58376 -2210 -33195 -70174 -122217 -136213 -136095 -54372 21611 98874 43895
119 43895 -23556 -57539 -59960 7483 96369 167941 210373 270880 256007 241712 154444 138181
107 138181 134272 88993 5184 -29867 -20638 32844 43141 -49872 -26251 -91876 -186744 -166796
95 -166796 -96408 -63389 -20760 74034 88132 96715 -17984 -47330 65473 29751 26206 17807
83 17807 -53211 -30945 -81652 -74114 76138 95238 39682 55369 53546 16572 9197 67928 95950
70 95950 127683 9627 -44256 -80705 -23160 5520 87738 107990 119734 95566 73116 100782
58 100782 72141 37798 75239 124409 169104 132560 102564 79017 35674 4902 -82126 -15306
46 -15306 86981 96597 63548 111689 120887 104243 81903 -25457 -90507 -95648 -43412 -66828
34 -66828 -94017 -78123 -112042 -122721 -67217 -35783 -43500 67214 104656 169237 207463 146322
22 146322 95516 13688 -36561 15883 92195 21724 -2075 -69826 -72996 -50380 47912 44725
10 44725 -6249 17775 65156 56996 102409 102144 89519 176671 72915 -69582
0 -69582
$$ Imaginary data points
##PAGE= N=2
##DATA TABLE= (X++(I..I)), XYDATA
32767 290116 243664 121793 103837 84473 69707 12820 133745 261893 241056 154553 192805
32756 192805 200184 213558 182899 210849 184828 188462 160371 249835 315187 286771 205355 169775
32744 169775 172335 236318 353181 457154 482911 393139 290890 196223 227623 347322 367823
32733 367823 338054 285502 288571 288380 253060 300000 294350 248305 229574 175309 264363 303801
32721 303801 280929 209617 199776 236219 289593 358448 333604 209999 262617 246656 257360
32710 257360 391012 381969 321990 333378 300627 290192 218356 160046 140904 225121 250157
32699 250157 160953 142194 177490 233053 217039 264352 300900 352756 384563 286312 291015 244936
32687 244936 240331 274986 286854 335299 355489 301406 308447 255933 220512 153046 156598 174014
32675 174014 144653 189866 234991 220322 173659 239925 207919 192921 259194 327477 350886
32664 350886 343348 352955 245803 207344 234270 290489 350368 340618 390764 545343 578928 557065
32652 557065 376642 352952 381370 467913 412975 442481 411807 340963 385502 355533 335253
32641 335253 329984 307874 349493 381712 528494 605507 476379 452696 491440 488965 513068
32630 513068 441208 426350 466849 348471 347903 380858 459038 445385 365403 317243 378947 432278
32618 432278 458079 393267 407678 400878 415499 406052 371097 334324 421989 452975 430009 395646
32606 395646 394628 356654 374503 483562 499764 463838 473332 301913 277971 331207 296220
32595 296220 277196 269312 205780 300629 479755 419303 317615 332015 421057 428795 499013
32584 499013 548006 491453 545249 494124 456022 469507 457185 417791 409204 516069 464187
32573 464187 492249 513438 516631 517049 474482 414169 435352 546514 602015 577263 592099 559411
32561 559411 519741 501069 453964 378531 371603 387634 332000 276039 401994 462705 407861
32550 407861 346000 264584 258406 262737 272847 391665 470380 424967 503000 616190 546258
32539 546258 498920 558021 551387 588129 639023 571035 427713 369505 453538 564223 463211
32528 463211 452855 498989 521977 621102 660347 765795 699448 576738 470597 639565 785911
32517 785911 727028 585039 467523 364411 326804 300687 290940 445119 614616 766431
32507 766431 686816 646984 627540 637569 736538 661390 441391 330926 340057 372187 438023
32496 438023 458760 401914 343454 212477 239975 299296 294980 266520 316542 336632 350762
32485 350762 282909 285739 432668 541039 419825 242238 273954 328336 348951 361080 508821
32474 508821 632034 733658 782395 683560 648895 672671 494932 487946 518248 674710 704070
32463 704070 716484 813851 878190 811323 702014 578357 527542 637743 742031 764002 773789
32452 773789 759471 659153 588899 558586 592170 597711 535728 518893 505677 457006 427934
32441 427934 475491 507111 529222 509533 403060 358446 342218 371485 495277 627537 675161
32430 675161 542749 517576 584025 640256 664511 539824 474614 551508 723960 806582 874902
32419 874902 793160 647188 585421 531312 511713 627321 630179 475009 513958 498137 433883
32408 433883 392996 510807 661030 710392 718054 657000 637361 669268 675090 666526 633563 529723
32396 529723 631297 727201 715128 754942 779811 737950 731791 758063 834288 874600 896042
32385 896042 867378 783082 703889 709089 786294 653879 634854 631011 626315 614402 548632 580339
32373 580339 530189 579798 654240 609180 544457 481790 395650 451291 562598 690545 827935
32362 827935 855691 926714 917509 870282 688992 547580 532347 598633 723949 844601 814488
32351 814488 680626 611464 713575 704206 752171 837573 833336 720107 769666 697675 639933
32340 639933 643933 742217 730470 730660 707595 670950 679158 804409 896714 914940 788751 728706
32328 728706 792252 742437 629915 596740 657858 754225 696365 586295 621282 547313 542381
32317 542381 630786 576485 623603 605293 618909 759641 765980 869352 772883 728337 677119
32306 677119 664845 660679 556003 516330 390454 349899 377962 378199 360197 466232 517669
32295 517669 490667 524049 438067 433079 497131 626618 637527 590557 682844 678530 561319
32284 561319 637290 642184 615967 720476 778164 668330 536617 415674 525421 577533 678330
32273 678330 725990 735407 795683 809841 858824 832948 943275 992327 986790 816257 678923
32262 678923 565709 623490 671653 672564 619120 615333 731734 801711 884263 827241 674167
32251 674167 534253 622325 659041 546677 459490 499304 527488 478091 572743 785652 807319
32240 807319 717712 558547 505902 473729 385477 492610 644593 674786 709441 829043 842633
32229 842633 601280 512628 511576 620454 676290 721955 681608 638291 743966 777557 762998
32218 762998 757314 622750 517973 493567 557102 639875 763008 810027 926547 839934 604775
32207 604775 540844 515249 578696 674499 668028 830826 711469 617477 718611 800589 861184
32196 861184 743603 580795 420663 524889 590545 627031 677018 651512 676774 708176 681251
32185 681251 638504 589774 575572 632095 711924 721804 587360 570952 626792 542029 571710
32174 571710 571369 538350 523088 574841 599882 573080 545638 777827 699480 691615 724786 796852
32162 796852 771317 852302 697161 681598 721939 575878 489222 579957 732795 777018 671307
32151 671307 536595 601372 608972 501268 507309 569840 644711 704901 695301 663242 736949 677080
32139 677080 587286 541032 572391 776099 782984 615871 699932 800947 769478 730995 753187
32128 753187 753672 639681 651080 686398 762580 761904 697681 685551 735364 733817 694319 637304
32116 637304 656517 670978 577239 633352 641449 756458 740219 657969 607242 646114 703496
32105 703496 702673 726856 579950 615077 616091 681487 707501 853752 954109 833105 845372
32094 845372 917704 843078 749321 649968 635168 740494 703073 682491 704378 744340 811392
32083 811392 851703 807934 803946 794095 794914 788704 888617 856340 867482 918526 1075742 1067417
32071 1067417 911103 750112 654175 517963 451327 400252 446885 558088 632229 583950
32061 583950 665333 691926 656792 775548 850490 886311 904425 874354 769473 653702 532616
32050 532616 530008 518665 554460 565311 519900 635049 642774 585821 595077 807610 755489 664261
32038 664261 758284 745659 725226 772234 701261 605630 547929 510343 582628 713179 687327
32027 687327 638074 649878 704585 728865 713653 701849 719484 675080 623205 644145 672731
32016 672731 732860 887406 955706 941141 759468 725239 704373 732016 645426 603734 757018
32005 757018 760924 738945 683434 738864 627596 468448 511869 709592 786981 880381 920196
31994 920196 741887 681249 666707 581381 553627 636577 696002 612196 596390 598648 597793 647724
31982 647724 644752 630045 688427 798495 936274 1064146 875161 715054 728189 787347 846143
31971 846143 756693 662026 619705 524378 651859 705386 511928 531848 616543 684135 716188
31960 716188 671177 783392 853217 697707 654188 609755 736617 699763 562690 570376 709907
31949 709907 715055 723615 816542 896104 935540 849102 825116 805922 863304 912715 941080 895838
31937 895838 902945 810354 849012 863697 806443 732984 773707 819479 750373 737821 734408 754549
31925 754549 798558 752981 660424 528165 596454 727138 827523 836732 773450 769048 831409
31914 831409 899299 775418 708101 671686 730121 778899 730521 624040 563279 533313 509665
31903 509665 513017 589935 686967 683618 642498 613719 552887 620748 636052 613246 633730 697125
31891 697125 727647 674083 613866 578664 535401 559153 625292 727901 665331 760481 911175
31880 911175 817151 718522 610404 646149 723075 834062 798183 806885 767388 707471 774509
31869 774509 794228 759026 741265 659974 563397 637380 636557 697696 668781 526678 462125 567261
31857 567261 697149 667726 669256 777052 712049 695338 570398 448323 418093 587222 619349
31846 619349 627897 633779 592207 503859 569072 670322 697648 786913 720101 548409 487759
31835 487759 590716 700105 675821 564807 597757 693329 692445 804592 870400 840915 793673
31824 793673 752027 757842 848637 818872 730755 644051 529691 512284 602990 668197 631349
31813 631349 623397 608840 706917 842885 796164 674840 603477 648789 641423 580980 591187
31802 591187 652157 616666 692049 762200 693396 646357 527494 637787 824729 863643 777980
31791 777980 598684 482037 561479 613715 674963 713367 626577 626250 737734 781864 586750
31780 586750 537218 587081 700902 695578 617823 684888 638505 771498 730690 699207 717170
31769 717170 633207 567810 425300 573646 692972 754728 769967 836754 855758 934212 759335
31758 759335 631161 682696 713003 626250 551745 569297 540161 581666 597502 646238 659921
31747 659921 603005 703961 795683 830419 788501 825171 960414 863062 782986 732863 699363
31736 699363 868047 915124 820855 747133 812618 891527 828650 628264 569781 622649 648517
31725 648517 735101 711543 724168 674536 644335 628897 716711 859507 938918 837872 703767
31714 703767 702809 869195 839578 741384 888544 858810 718734 597445 495530 534940 554950
31703 554950 666716 743945 754250 860967 973497 837967 698463 707005 760591 676478 700869
31692 700869 706017 729950 648316 518463 585354 784691 966702 845914 622004 626118 578241
31681 578241 654760 774227 770538 715074 776735 790226 785760 804970 877702 969016 972570 862404
31669 862404 777794 736700 719823 752059 848792 844681 886698 870782 853714 835685 776086 815898
31657 815898 815395 802044 739533 655190 727993 819155 774528 844992 954816 994350 1064937 1013792
31645 1013792 891830 1006591 1104765 990090 883663 831767 821489 808559 806003 839261 775533
31634 775533 703402 734086 674050 727022 755397 677075 604427 803253 772527 721895 776352
31623 776352 732061 628481 531950 660862 782278 791702 781834 788807 748957 635608 560510
31612 560510 644686 767435 834486 603598 541946 484225 469467 524972 602075 787852 773679
31601 773679 761481 841446 751870 719927 770133 747805 644913 530634 582030 640172 733588
31590 733588 828363 901591 895083 870499 770460 661032 545714 653438 537786 453816 486904
31579 486904 674940 709342 623962 624576 536931 658633 717812 812049 954529 924320 793757
31568 793757 807537 783297 817329 887502 855039 721159 680729 758418 823895 831160 819878
31557 819878 788875 783517 770576 727504 768126 808141 821269 859718 835380 897090 862606 709317
31545 709317 667979 751725 717635 684097 674545 738971 610342 640766 683008 678658 672814 664602
31533 664602 782059 861412 840134 729902 748646 669347 712161 826902 953185 874582 647806
31522 647806 543814 669273 654781 706058 824954 791893 626443 718591 772645 775486 770468
31511 770468 692069 687505 704315 784937 630002 713244 874475 934857 930619 853657 795429
31500 795429 768314 789627 820914 775933 903921 863328 806586 836162 980906 971763 970944 951048
31488 951048 955920 919523 928218 1003117 968205 951192 906573 911438 868595 843301 795084 722568
31476 722568 576055 613595 810636 778964 736924 661585 645043 669639 779101 741001 624788
31465 624788 630312 642109 779447 942129 951096 824282 691819 661737 647648 769551 873095
31454 873095 857261 937399 1030316 1059396 911514 802603 724339 788192 702257 754144 827601
31443 827601 830649 836866 836158 917888 921284 886191 948347 1024343 919934 781244 772533 824966
31431 824966 741875 712885 772986 697999 773866 769606 630445 506505 614633 627675 650360
31420 650360 632221 621330 732896 824481 834921 802208 728963 660862 689354 770169 759334
31409 759334 864297 711325 405176 304548 472024 688266 798539 782513 778049 650990
31399 650990 639838 847257 935454 850861 816620 800943 738828 593576 506339 493683 617503
31388 617503 755005 832391 886900 1021852 966958 718380 602847 567869 518919 649509
31378 649509 706311 728072 664173 742129 776111 772229 849156 781921 729169 792877 822361 832129
31366 832129 851653 863314 920212 834321 753086 718615 739009 753542 748090 691476 558196
31355 558196 649366 693987 692362 637745 535610 593286 827311 941185 953998 867565 662472
31344 662472 523000 583406 667300 682967 673898 576138 529300 440788 414234 593718 681745
31333 681745 740799 666648 642281 699347 650171 719134 952185 989315 966043 905926 843041
31322 843041 771973 804318 781350 738169 680367 608763 605728 710691 749872 674279 573867
$$ [...]
##END NTUPLES=NMR SPECTRUM
##END=
