##TITLE=Analysis number 324015
Compound Code cc 00512
Project Code adrs
Chemist Name scarfell organics
##JCAMPDX= 6.0         $$ Bruker NMR JCAMP-DX V2.0
##DATA TYPE= NMR SPECTRUM
##DATA CLASS= NTUPLES
##ORIGIN= Bruker BioSpin GmbH
##OWNER= nmr
$$ XWIN-NMR		Version 3.5
$$ Fri Nov 10 18:14:45 2006 GMT Standard Time (UT+0h)  MAYBRIDGE\nmr@NMR_250MHZ
##.OBSERVE FREQUENCY= 250.131544655141
##.OBSERVE NUCLEUS= ^1H
##.ACQUISITION MODE= SIMULTANEOUS (DQD)
##.ACQUISITION SCHEME= undefined
##.AVERAGES= 16
##.DIGITISER RES= 18
##SPECTROMETER/DATA SYSTEM= dpx250
##.PULSE SEQUENCE= zg30
##.SOLVENT NAME= DMSO
##.SHIFT REFERENCE= (INTERNAL, DMSO, 0, 16.522)
##AUDIT TRAIL= $$ (NUMBER, WHEN, WHO, WHERE, WHAT)
$$ ##TITLE= Audit trail, XWIN-NMR		Version 3.5
$$ ##JCAMPDX= 5.01
$$ ##ORIGIN= Bruker BioSpin GmbH
$$ ##OWNER= nmr
$$ C:\u/data/dgb/nmr/ADRS/2730/pdata/1/auditp.txt
$$ ##AUDIT TRAIL=  $$ (NUMBER, WHEN, WHO, WHERE, WHAT)
(   1,<2006-11-10 18:14:11.65 +000>,<MAYBRIDGE\nmr>,<NMR_250MHZ>,
      <created by zg, POWCHK disabled, PULCHK disabled
       configuration hash MD5:
       49 4B E0 1D 92 C2 6B 37 9F E6 65 BC 52 41 86 1D
       data hash MD5: 64K
       91 BB B8 0D 4A 69 5F 22 F2 D1 17 76 8E DE 25 CB>)
(   2,<2006-11-10 18:14:27.94 +000>,<MAYBRIDGE\nmr>,<NMR_250MHZ>,
      <Start of raw data processing
       ef LB = 0.3 FT_mod = 6 PKNL = 1 SI = 32K 
       data hash MD5: 32K
       C5 E2 5E 8E 9E 73 4F 41 B8 58 20 3A 50 7B BA D5>)
(   3,<2006-11-10 18:14:29.81 +000>,<MAYBRIDGE\nmr>,<NMR_250MHZ>,
      <apk 
       data hash MD5: 32K
       03 BC 3B 56 2C 2A E6 A2 CA 21 67 29 EA 58 AA 99>)
(   4,<2006-11-10 18:14:30.53 +000>,<MAYBRIDGE\nmr>,<NMR_250MHZ>,
      <abs ABSG = 5 
       data hash MD5: 32K
       38 B1 B6 64 DE D5 BF 21 3B 6F 0C 53 C4 8C 18 1D>)
$$ ##END=
$$ 
$$ hash MD5
$$ 82 89 D5 00 62 CF 6C B4 CF 04 35 AD FD 49 11 E5
##$RELAX= 
##$RELAX= 
##$RELAX= 
##$RELAX= 
##$RELAX= 
##$RELAX= 
##$RELAX= 
$$ Bruker specific parameters
$$ --------------------------
##$DU= <C:\u>
##$EXPNO= 2730
##$NAME= <ADRS>
##$PROCNO= 1
##$TYPE= <nmr>
##$USER= <dgb>
##$AMP= (0..31)
100 100 100 100 100 100 100 100 100 100 100 100 100 100 100 100 100 100 
100 100 100 100 100 100 100 100 100 100 100 100 100 100 
##$AQSEQ= 0
##$AQ_mod= 3
##$AUNM= <au_zg>
##$AUTOPOS= <57 >
##$BF1= 250.13
##$BF2= 250.13
##$BF3= 250.13
##$BF4= 250.13
##$BF5= 500.13
##$BF6= 500.13
##$BF7= 500.13
##$BF8= 500.13
##$BYTORDA= 1
##$CFDGTYP= 0
##$CFRGTYP= 5
##$CHEMSTR= <none>
##$CNST= (0..31)
1 1 145 1 1 1 1 1 1 1 1 1 1 1 1 1 1 1 1 1 1 1 1 1 1 1 1 1 1 1 1 1 
##$CPDPRG= <>
##$CPDPRG1= <>
##$CPDPRG2= <>
##$CPDPRG3= <>
##$CPDPRG4= <mlev>
##$CPDPRG5= <mlev>
##$CPDPRG6= <mlev>
##$CPDPRG7= <mlev>
##$CPDPRG8= <mlev>
##$CPDPRGB= <>
##$CPDPRGT= <>
##$D= (0..31)
0 1 0 0 0 0 0 0 0 0.06 0 0 0 0 0 0 0.0002 0 0 0 0 0 0 0 0 0 0 0 0 0 0 
0 
##$DATE= 1163182450
##$DBL= (0..7)
120 120 120 120 120 120 120 120 
##$DBP= (0..7)
150 150 150 150 150 150 150 150 
##$DBP07= 0
##$DBPNAM0= <>
##$DBPNAM1= <>
##$DBPNAM2= <>
$$ [...]
##$SUBNAM7= <"">
##$SUBNAM8= <"">
##$SUBNAM9= <"">
##$SW= 20.6930455092707
##$SWIBOX= (0..15)
0 0 3 0 0 0 0 0 0 0 0 0 0 0 0 0 
##$SW_h= 5175.983436853
##$TD= 65536
##$TD0= 1
##$TE= 683.16
##$TE2= 300
##$TE3= 300
##$TEG= 300
##$TL= (0..7)
0 120 120 120 120 120 120 120 
##$TP= (0..7)
150 150 150 150 150 150 150 150 
##$TP07= 0
##$TPNAME0= <>
##$TPNAME1= <>
##$TPNAME2= <>
##$TPNAME3= <>
##$TPNAME4= <>
##$TPNAME5= <>
##$TPNAME6= <>
##$TPNAME7= <>
##$TPOAL= (0..7)
0.5 0.5 0.5 0.5 0.5 0.5 0.5 0.5 
##$TPOFFS= (0..7)
0 0 0 0 0 0 0 0 
##$TUNHIN= 0
##$TUNHOUT= 0
##$TUNXOUT= 0
##$USERA1= <user>
##$USERA2= <user>
##$USERA3= <user>
##$USERA4= <user>
##$USERA5= <user>
##$V9= 5
##$VALIST= <valist>
##$VCLIST= <CCCCCCCCCCCCCCC>
##$VD= 0
##$VDLIST= <DDDDDDDDDDDDDDD>
##$VPLIST= <PPPPPPPPPPPPPPP>
##$VTLIST= <TTTTTTTTTTTTTTT>
##$WBST= 1024
##$WBSW= 4
##$XGAIN= (0..3)
0 0 0 0 
##$XL= 0
##$YL= 0
##$YMAX_a= 434912
##$YMIN_a= -447104
##$ZGOPTNS= <>
##$ZL1= 120
##$ZL2= 120
##$ZL3= 120
##$ZL4= 120
##$ABSF1= 16.522
##$ABSF2= -4.171173
##$ABSG= 5
##$ABSL= 3
##$ALPHA= 0
##$AQORDER= 0
##$ASSFAC= 0
##$ASSFACI= 0
##$ASSFACX= 0
##$ASSWID= 0
##$AUNMP= <proc_1d>
##$AZFE= 0.1
##$AZFW= 0.1
##$BCFW= 0
##$BC_mod= 0
##$BYTORDP= 0
##$COROFFS= 0
##$CY= 12.5
##$DATMOD= 1
##$DC= 0
##$DFILT= <>
##$DTYPP= 0
##$F1P= 14.0000005364418
##$F2P= -0.99999901652339
##$FCOR= 0.5
##$FTSIZE= 32768
##$FT_mod= 6
##$GAMMA= 0
##$GB= 0
##$INTBC= 1
##$INTSCL= 1
##$ISEN= 128
##$LB= 0.3
##$LEV0= 0
##$LPBIN= 0
##$MAXI= 10000
##$MC2= 0
##$MEAN= 0
##$ME_mod= 0
##$MI= 0
##$NCOEF= 0
##$NC_proc= -3
##$NLEV= 6
##$NOISF1= 0
##$NOISF2= 0
##$NSP= 0
##$NTH_PI= 0
##$NZP= 0
##$OFFSET= 16.522
##$PC= 1
##$PHC0= -49.85861
##$PHC1= 6.520919
##$PH_mod= 1
##$PKNL= yes
##$PPARMOD= 0
##$PSCAL= 4
##$PSIGN= 0
##$REVERSE= no
##$SF= 250.13
##$SI= 32768
##$SIGF1= 0
##$SIGF2= 0
##$SINO= 400
##$SIOLD= 32768
##$SREGLST= <1H.DMSO>
##$SSB= 0
##$STSI= 32768
##$STSR= 0
##$SW_p= 5175.98343685301
##$SYMM= 0
##$S_DEV= 0
##$TDeff= 65536
##$TDoff= 0
##$TI= <Analysis number 999999
Compound Code 99
Book Reference 9
Project Code 9>
##$TILT= no
##$TM1= 0
##$TM2= 0
##$TOPLEV= 0
##$USERP1= <user>
##$USERP2= <user>
##$USERP3= <user>
##$USERP4= <user>
##$USERP5= <user>
##$WDW= 1
##$XDIM= 32768
##$YMAX_p= 521411725
##$YMIN_p= -228770
$$ End of Bruker specific parameters
$$ ---------------------------------
##NTUPLES= NMR SPECTRUM
##VAR_NAME=  FREQUENCY,     SPECTRUM/REAL,   SPECTRUM/IMAG
##SYMBOL=    X,             R,               I
##VAR_TYPE=  INDEPENDENT,   DEPENDENT,       DEPENDENT
##VAR_FORM=  AFFN,          ASDF,            ASDF
##VAR_DIM=   32768,         32768,           32768
##UNITS=     HZ,            ARBITRARY UNITS, ARBITRARY UNITS
##FACTOR=    0.157963299565203, 1,           1
##FIRST=     4132.6476996994, 0,             0
##LAST=      -1043.33573715361, 0,           0
##MIN=       -1043.33573715361, -228770,     0
##MAX=       4132.6476996994, 521411725,     0
$$ Real data points
##PAGE= N=1
##DATA TABLE= (X++(R..R)), XYDATA
$$ [...]
21991 -59901 -55906 -23964 -51149 -51752 3116 -29051 -63653 -30320 -17554 -14867 -39156 -45557 -18652
21978 -18652 35644 133709 126998 39699 24923 41110 -47635 -68400 -82323 -141835 -141815 -54679
21966 -54679 -6740 -15314 -96962 -71732 -46754 -43863 -14884 19167 36822 71080 99706 118180
21954 118180 138483 86358 77634 94700 45661 56669 21861 -9371 -10871 55726 119013 66936
21942 66936 -29864 48788 75987 27561 -49555 -27664 18002 11551 -22200 -42501 -29035 -11917
21930 -11917 42895 84378 95319 76760 -26306 -57547 -17627 -41603 -7021 -11812 -14831 4913
21918 4913 13090 15682 -13724 -34675 -69425 -21594 56352 44940 56868 105085 120333 82152
21906 82152 -14722 -70714 -62785 -85606 -76291 -6397 -14190 -36666 33796 25747 11937 -27149
21894 -27149 -34327 -64400 1411 78622 83902 54048 84314 71069 -29072 -21233 31856 65455
21882 65455 54115 48773 81746 72851 22831 31217 101051 56529 33758 20445 -27893 -26922 -27827
21869 -27827 -32076 24861 63764 56415 -8258 -59433 -77574 -69045 -37045 -59293 -52280 -18516
21857 -18516 -35687 -29580 -40594 -27373 -84294 -104007 -81572 -76464 -63057 -17933 -16445 34674
21845 34674 18365 15515 -20973 -45918 -17663 3488 -49179 -76144 -45268 -22333 -82355 -69613
21833 -69613 -21029 3998 16271 -42748 -48907 6092 65612 107234 82525 14968 -74386 -69010
21821 -69010 -80399 -81709 -54831 -22502 -22291 1496 9874 -3622 10048 -19972 -14950 -23239 21520
21808 21520 49665 51733 15105 -22043 41482 93215 70737 41853 43419 50318 17376 20563
21796 20563 45472 21772 46903 20035 -30114 -67120 50449 106585 95200 87666 49614 42837
21784 42837 8551 -883 9904 -13344 4231 72945 45945 65412 70173 60732 54255 8071
21772 8071 56979 124892 146079 86131 38520 34867 9725 -35646 2524 -50545 -98146 -76072
21760 -76072 -79249 -97496 -83848 -117352 -103532 -16926 -17550 -40636 -36761 -34874 -42611 23981 76963
21747 76963 46864 92362 108882 25794 -15180 -33919 2719 26218 -27755 -20274 -52664 -61048
21735 -61048 -40301 22573 22915 -11621 57104 26838 -63720 -65619 -46848 -9123 9494 15070
21723 15070 -1126 -42210 -48218 -13281 -1532 3345 -24376 -2861 -35124 -88528 -87128 -72874
21711 -72874 -69510 -37594 -56626 -93057 -18595 30896 17521 61580 69389 21699 323 -7909
21699 -7909 23442 67536 135743 166644 150912 81699 11450 12122 49939 26275 -6792 21282
21687 21282 57652 52147 69237 57378 30550 -7351 -2584 28335 37117 30347 -19459 -4055
21675 -4055 -17772 -33681 -13308 5408 -17752 -24174 14613 20640 -36399 176 54726 40183
21663 40183 21909 30700 26725 -18285 -53844 -98439 -101989 -39965 60517 75417 34326 26381
21651 26381 52308 33932 11453 -8961 16411 5314 9779 -15466 -16188 19150 29047 -81631
21639 -81631 -156805 -157630 -68965 29739 42779 -13597 -60466 -22896 -82618 -124891 -125550 -97424
21627 -97424 -146998 -101513 23811 -19207 -77094 -64723 10957 50162 32311 56921 61807 48169
21615 48169 95140 95412 59713 33707 29511 12623 -45829 -63277 -40861 -2465 -2440 41345 70597
21602 70597 29475 -13150 -34838 -34652 27773 14419 3889 -18351 -42590 -77365 -64535 -5457
21590 -5457 21212 36511 35113 1942 -27000 -41832 -34384 -693 -18306 -51270 -80450 -72108
21578 -72108 -47165 -42409 -31026 -65991 -65062 -96648 -16757 33654 -114 2419 6892 -25659 -57993
21565 -57993 -129246 -91424 -78422 -149022 -114072 -123519 -83454 -36316 12446 38283 12483 -31228
21553 -31228 -16710 -39020 13846 4182 -7064 -76283 -75885 -8570 -27458 -3105 9546 54858
21541 54858 -6668 -18908 -22084 -5975 13755 -56280 -66510 -25929 21129 5245 -39403 -9892
21529 -9892 39220 40022 44316 -9936 -24668 -2489 -26893 12369 55642 26777 -19662 6119
21517 6119 52763 54066 32565 -144 2363 14501 59168 39901 -1961 7068 -30654 -37419 5513
21504 5513 19663 16146 71765 59609 73480 91082 38315 -2872 -40101 -19818 12405 28132
21492 28132 34740 10636 35402 11763 26209 17652 22838 -39513 -102639 -130761 -116600 -92754
21480 -92754 -46468 46383 91694 105138 97121 108082 89509 98305 51852 12822 41783 37177
21468 37177 14315 19964 7086 -17958 -4868 -3415 10540 35965 30467 31124 88281 60399 53162
21455 53162 21895 -29378 -68342 -21158 -9857 21035 55333 33106 -21655 -13705 -62014 -8559
21443 -8559 -46365 -74378 17565 14570 -19746 68053 123886 95850 80834 92706 92762 57918 -28200
21430 -28200 -38021 24971 58288 31790 22732 -24041 -60071 -38317 10682 6763 15379 24355 1174
21417 1174 -29834 -70274 -84162 -134520 -137999 -112841 -22462 34233 70337 85845 20598 -42722
21405 -42722 -66913 -10505 -32194 -26695 -58143 -58363 -30200 -2862 -13555 -26472 3571 48229
21393 48229 -25162 -61086 -53739 -15041 -27001 -22466 37067 66313 50346 114783 123137 91619
21381 91619 56063 41960 42860 52208 73801 28609 -11075 -54173 17950 63776 8077 -43020
21369 -43020 -57707 -51356 -39223 -47070 -81049 -64337 -72510 -62417 -62803 -111888 -94959 -63902 -65067
21356 -65067 -48619 -52246 -38157 -28740 -44897 -34421 -40565 -37040 -54780 -49807 -32454 -60216 3988
21343 3988 42520 62973 61667 9957 18704 55068 16167 -57099 -35887 11698 14642 -1904
21331 -1904 42478 64798 1365 -26426 -59600 -4085 -21653 -63648 -43733 37308 25533 -42
21319 -42 -22088 4719 -17577 -8670 23559 -26638 -83833 -21943 12531 19841 -32590 -55755 -25947
21306 -25947 2986 30779 29916 -9849 -70757 -81421 -67206 -29276 -8051 5873 1233 29924
21294 29924 -105 26066 107274 175300 85855 -5684 -2451 -5710 5296 -20824 -114340 -78611
21282 -78611 19358 51065 -4059 -5344 -31361 -52841 -10415 4967 -38258 -79405 20754 46241
21270 46241 43957 40613 23058 42362 24125 62644 26422 31237 15393 -37815 -1825 43945
21258 43945 7583 -1113 -30897 -5663 -30831 -63379 -67074 -58352 -67984 -45689 -75616 -96352
21246 -96352 -105406 -50583 -50226 -33528 12165 66151 62596 -990 25711 73331 34987 8060
21234 8060 4598 -1185 -15215 -60640 -98535 -139772 -136503 -124388 -126845 -54696 2883 -62482 -75964
21221 -75964 -17594 5407 39106 -6521 -36586 -65065 -37747 7950 14527 22696 5548 -34720
21209 -34720 -24479 -50256 -34175 1301 -25200 -14389 -11940 -4817 -1884 -38882 -32537 -10626
21197 -10626 -46639 -39658 -5493 78916 130122 113411 80852 27938 103843 53648 95359 138440
21185 138440 94023 62988 61180 51883 105642 48536 -24082 7546 55756 78395 22338 -24567
21173 -24567 -80800 -166666 -158582 -114381 -123387 -6207 61042 51420 62623 -9837 -57554 -72126
21161 -72126 -116795 -100961 -71843 -104078 -133427 -119804 -81594 -75905 -78752 -89945 -41366 -37205
21149 -37205 -38266 -27432 -41302 -56282 -46485 26177 56566 43902 65818 57899 50303 81456
21137 81456 76313 100368 77689 21444 22348 16119 13017 9874 43510 70227 64980 60710 63511
21124 63511 60830 77927 81665 48855 21306 -19110 -77967 -35364 -20896 -17976 -20033 -21416 1713
21111 1713 -23977 -93705 -87654 -35128 3936 25253 1207 -37774 -42145 -26672 27654 95875
21099 95875 144702 109513 28229 1626 11565 -1242 -50556 -54220 -42829 -43763 -29595 16371
21087 16371 45426 49779 60089 53994 44696 55501 25685 -38001 -24823 -14919 55100 81367
21075 81367 65100 59499 38866 924 -34089 -38173 -8674 49617 83017 41105 24895 19363
21063 19363 37691 68202 -9763 -92905 -68570 -15345 -38846 -61982 -26841 -18403 53735 92870
21051 92870 31887 10623 9871 -22583 -47355 13411 57424 32077 -46004 -19409 27721 5431
21039 5431 33609 54901 19279 51261 23062 -34246 -36706 -35630 -14957 61333 115090 98761
21027 98761 92916 88819 125268 148756 96425 89065 70033 26422 -27497 -15393 -17984 3720
21015 3720 -24042 -53538 -57354 -35490 -9610 73684 59841 -23089 -40727 -10431 22602 20704
21003 20704 -37363 -38828 -5297 9182 57503 84976 30605 61376 134875 107538 8061 -32442
20991 -32442 -51767 8276 -40130 -44987 -44294 -16449 -13882 -19952 81316 130906 137005 110810 89775
20978 89775 39607 -13996 43083 37580 19037 -15108 38822 25509 9835 34199 71822 142089
20966 142089 110432 33461 -66001 -63184 -31396 -30090 8082 19819 75962 90035 140659 128119
20954 128119 10699 -45295 -60038 -50152 22616 44523 119288 84761 42648 75476 35083
20943 35083 22673 1026 24625 69652 85903 88657 73071 66920 39903 24611 -1931 -12950
20931 -12950 -8239 50572 55199 41935 61792 79555 85854 42578 49189 51045 26635 -24806 -18801
20918 -18801 20116 32107 -75675 -72749 -37790 8877 -45754 -37352 -23278 -2534 -6332 -63842
20906 -63842 -60034 -37196 -31895 36785 69926 98751 74403 23858 24241 41102 66554 81994
20894 81994 65607 43407 39536 55531 97241 53943 7008 9692 34107 76675 34476 -2172
20882 -2172 -22506 -59830 -42944 11358 3121 -38205 -61405 -51975 -49148 -28581 -7826 913 -43504
20869 -43504 -85433 -104084 -169481 -129445 -70415 -51017 -29341 -89369 -72239 -42540 -64857 -101922
20857 -101922 -152371 -180447 -119951 -92527 -94139 -98092 -74760 -74983 -66572 -20652 59674 39493
20845 39493 -54783 -87025 -66244 -57338 -48412 -39705 -24356 -48048 -47551 -12601 50202 54394 51111
20832 51111 35950 65080 79934 13280 -1177 15661 37756 2604 36741 58911 64368 77797
20820 77797 46391 25013 26750 52656 62280 33425 33041 35108 27166 -44915 -101636 -35459 -15622
20807 -15622 21837 35693 12185 -3324 -3705 -2351 8446 76306 72610 17410 52553 116273
20795 116273 182872 176578 136693 70326 22507 3733 40926 105411 47175 -27655 -41705 -88252
20783 -88252 -98556 -60703 -48718 -35763 -25360 25024 79084 103810 45315 -20498 -50259 -40070
20771 -40070 -85946 -56333 -28590 -76194 -37977 -18434 -33103 -49081 14340 7171 13879 77109
20759 77109 58568 25670 40076 26386 -48578 -97657 -128304 -138475 -115605 -94296 -43465 -20565
20747 -20565 35897 54169 37978 14937 -24521 -51713 -3010 50642 38434 -2548 -17417 -34458
20735 -34458 -86610 -132673 -84124 14513 30147 2554 -65929 -96692 -81692 -81814 -71097 -47689
20723 -47689 -36985 51906 69673 36014 -56720 -77665 -76873 -39616 13549 -14857 -41774 -73522
20711 -73522 -128632 -67533 7415 50304 80043 65531 24840 -36532 -46598 -40535 6642 -13556
20699 -13556 -41887 -80358 -23880 10271 -60266 -106191 -91689 -25495 28021 34593 -18516 26298
20687 26298 4337 -36399 -41189 -14414 -21020 16124 11892 13638 60213 19296 -16122 -37516
20675 -37516 -45562 -32667 -4665 -51648 -81038 -58143 -49996 -23609 -51114 -67118 -100550 -73715
20663 -73715 -61308 -84428 -70799 -53540 -26900 23948 29734 8360 -36766 -39976 29576 60912
20651 60912 55325 -8364 9927 74131 96722 18382 15284 2658 15234 74033 25201 25926
20639 25926 125982 154102 149834 124278 181100 225375 218010 199727 160616 61624 60450 108139
20627 108139 75790 -8079 15867 76905 46788 -24650 -23238 -11480 3381 13308 33022 -21158
20615 -21158 -27477 -39041 -43426 -45633 -44785 -67970 -49434 8478 18716 3973 18412 -19891 -14154
20602 -14154 -1419 33988 65995 46806 16464 -35551 -28324 -13674 -48036 -69337 -51119 -67306
20590 -67306 -104349 -87432 -71617 -73225 -17012 33175 53267 29981 20019 -25358 -46737 -27268
20578 -27268 -19664 -36805 -42825 11619 49048 73132 72846 49788 19479 18140 52153 -2449 18995
20565 18995 -8781 -7651 -22634 -3815 46543 -2263 17753 77978 124524 136838 49292 46600
20553 46600 96095 113004 75343 41831 629 -37787 -85996 -55054 4962 -7566 80284 67727
20541 67727 88788 127712 87079 4683 -88237 -52104 11531 -12019 14706 34630 101678 77233
20529 77233 53769 64942 44334 5974 -45979 -53811 39093 82769 47154 11490 11471 -65053
20517 -65053 -36927 29273 54649 29442 -54650 -61331 -100440 -139458 -133301 -104579 -96499 -18013
20505 -18013 15184 18589 8664 -22428 4847 -13701 6174 7115 -90875 -43242 -15705 -20735 -77668
20492 -77668 -32117 -21315 -17510 47119 89501 24161 52666 94091 44242 33504 -70177 -62938
20480 -62938 -68038 -56295 -65375 -76827 -84466 -78850 -46162 -63243 -74716 -80146 -70216 -53992 -56184
20467 -56184 -18710 113 -45071 -13010 40517 1016 -8796 43543 -8456 -5699 40560 9461
20455 9461 24092 30746 -5829 -37029 -53567 -55808 -19095 62145 89435 62842 64757 48458
20443 48458 31562 43043 -45743 -104173 -83898 -22367 32002 44959 45541 -16589 -83353 -55698
20431 -55698 -8799 815 -21501 -63497 -96680 -68349 -54929 -6298 -2505 -20870 -45617 -56266
20419 -56266 -63501 -71963 -14924 37146 27991 -9515 -84346 -145677 -127815 -131936 -100359 -31750
20407 -31750 -7999 -50629 -29129 -23038 -26374 -49503 -48165 -44245 -31221 -48817 -79839 -59253
20395 -59253 -20054 -20381 -70591 -69010 -52622 -51540 -21815 -16821 -38982 -42239 -59928 -74990 -43156
20382 -43156 -12224 25713 27188 -26948 -54897 24684 41333 9796 -15669 -36327 -42007 8678
20370 8678 65464 97021 81507 -19763 -32867 -6816 27393 4715 -26472 -58334 -88754 -65613
20358 -65613 -43243 -46944 -73575 -46919 -6427 -13311 -32598 -38392 -14679 -32687 -15422 -18522
20346 -18522 -42489 -69981 -24962 -13952 -47532 -92932 -47581 -27317 6852 10608 -24070 -92328
20334 -92328 -111242 -95112 -60948 -39551 -22723 3139 17882 24917 -22118 -648 -18188 -14493
20322 -14493 -9232 -11267 -4415 34429 40771 44597 47042 34012 49569 73907 57420 48903 15086
20309 15086 32321 49713 24577 -37510 -93174 -99059 -45127 -29569 -7408 55691 10270 -78368
20297 -78368 -9685 14733 -14987 -30437 -85662 -126247 -74604 -38016 -34103 4299 -18701 -63081
20285 -63081 -69157 -25054 6025 22934 50157 62760 81646 64673 -6667 -6332 66281 104048
20273 104048 47990 10939 -12536 -31754 -62437 -52524 -49281 -67727 -50786 5436 1492 -2099
20261 -2099 24020 -34562 -55892 -32252 -23203 -45524 -65070 -9604 2214 -125501 -87046 -85669
20249 -85669 -104466 -79213 -18133 -56784 -39042 -37604 -70628 -61075 -64885 -64860 -45227 -28131 14206
20236 14206 9654 -34979 -17409 59236 24894 20371 21531 37851 17865 16250 26353 -6535
20224 -6535 -14850 10908 -6556 -55047 -572 102392 98644 77933 92324 36671 -43652 -57384
20212 -57384 -28235 -23063 -9443 50291 94849 121723 111709 46356 12553 5267 15943 64061
20200 64061 105046 89200 46632 103913 108539 21777 2689 15302 -5296 55375 73714 96821
20188 96821 103797 135880 126745 60959 -21928 -50998 -42729 11416 70426 105311 66189 18652
20176 18652 17803 56226 38988 -15012 21799 66236 81299 88689 67792 47486 35172 36717
20164 36717 25999 31084 34974 -541 11251 75 23655 86306 184936 168542 93402 68902
20152 68902 -7335 -53595 -58384 -90265 -78948 -38491 -60392 -43192 -62994 -71396 24842 67347
20140 67347 6478 -34587 -29756 -41249 -3516 62306 67209 64997 49240 -546 -13095 25613
20128 25613 12965 798 -13674 3368 27034 41062 -30763 -58001 -15594 -30270 -48320 -44541
20116 -44541 -41604 -40778 1822 35317 48337 69851 144072 99338 26062 12776 19090 -12671
20104 -12671 -13156 47944 51260 40934 71960 43404 10112 -19535 -3001 29043 46733 -6728
20092 -6728 -39016 -38301 -22540 -25768 -47274 -61634 -30676 -47436 -41697 -13553 2838 -29634 4101
20079 4101 16917 71117 50074 9623 -21394 29642 9221 -6402 41902 28056 -7772 -60810
20067 -60810 -81279 -21046 25521 -21478 -60287 11703 94561 69679 72342 137159 116218 22092
20055 22092 32595 62153 58293 16527 2856 62721 102670 115937 97439 39426 39286 1636
20043 1636 46361 71941 76625 83086 133592 188418 203223 151531 82610 48196 40635 44201 17536
20030 17536 -34142 -4451 69583 41351 24274 39788 18944 -17324 13439 22912 -13561 17494
20018 17494 41641 26502 9484 -13782 17538 11474 8537 -67238 -55199 40510 43603 25860
20006 25860 29534 26527 14933 39588 80979 123645 96682 3302 12053 48704 52359 -12660
19994 -12660 -4099 61352 55753 41873 86862 52215 135940 147812 169816 193420 205237 178779
19982 178779 129355 124619 115789 119942 118187 93403 51937 90028 135164 106767 57147 28949
19970 28949 69780 74368 54597 50078 44402 64677 72586 60228 63048 -1774 -11348 23643 27784
19957 27784 57824 67781 56079 60118 86253 100543 159657 133331 65428 69827 112209 60240
19945 60240 46551 99992 101829 21824 -3872 -25671 -10460 61011 66953 46260 1196 -1514
19933 -1514 56142 39110 -19281 38835 74777 88036 41241 78596 19681 36934 73071 116643
19921 116643 164753 195716 131361 52380 -21619 -63213 -19636 12483 -51967 -95273 -54327
19910 -54327 -60428 29727 78247 -3867 19605 96451 67009 17848 9463 69801 68401 51187
19898 51187 106270 116574 115284 138637 132632 105353 110698 86832 68389 71487 -26549 -53763
19886 -53763 32982 35587 45460 96251 195433 218422 156934 82582 15765 40166 78508 40474
19874 40474 24942 66361 98192 180478 202434 177396 152205 174352 232263 220340 178256 171430
19862 171430 141044 176095 242261 345637 406220 326425 245102 207940 180404 104155 76337
19851 76337 89256 118457 85965 78282 131702 180977 148305 110760 59088 126724 157512 144540
19839 144540 97153 92931 150459 143807 110834 134502 150172 163581 195667 238612 223785 209175
19827 209175 213048 190164 142549 91453 138934 187417 146532 158158 223292 214885 229452 253565
19815 253565 246567 250811 295966 259686 254386 297857 388121 349370 310961 312483 368380 426241
19803 426241 463057 432825 447975 399212 393733 412128 386281 388036 420539 423506 423630 414087 444371
19790 444371 515285 533374 548969 529472 563331 596387 651834 634131 572429 570897 636570 667042
19778 667042 678694 715243 765082 835857 885483 949454 963029 988561 1019613 1058463 1123043
19767 1123043 1181903 1274947 1392576 1478436 1532177 1613775 1720655 1886856 2081638 2197717
19757 2197717 2369009 2611981 2883975 3190556 3559860 3935505 4317408 4723191 5201897
19748 5201897 5899385 6827521 7880473 9228356 10903329 13181472 16360799 20951464
19740 20951464 27704683 37196146 49350433 63411987 78663663 95008518 112369584
19733 112369584 129204556 141644895 143018508 128841647 104661878 80614292 61356261
19726 61356261 47306009 37292048 30019766 24557232 20307276 16996191 14433274 12436601
19718 12436601 10841237 9425223 8216704 7247332 6409941 5740043 5240215 4804538 4444379
19709 4444379 4112721 3816039 3567003 3312207 3108327 2891060 2731705 2564412 2387706
19700 2387706 2329374 2250154 2133576 2021683 1890736 1769952 1666084 1582457 1464379 1429314
19690 1429314 1397353 1380390 1379965 1357043 1327564 1274650 1215361 1187641 1220645 1209119 1131152 1100872
19678 1100872 1050025 915642 822880 792356 777273 778579 771404 721417 658979 581240 546425
19667 546425 602048 642172 650549 625325 545308 533649 534518 541369 547590 538645 529972 428834 374236
19654 374236 349678 293335 283877 269121 287671 297416 287368 347839 369323 332974 318968 306086
19642 306086 317705 350029 346454 279434 203599 201175 270316 282452 248469 288841 276659 235528
19630 235528 231046 219944 236378 208288 197068 196042 199087 222628 207469 113057 134750 157685
19618 157685 176996 170415 142232 115243 132440 188992 207743 236841 267432 311286 307176 338880
19606 338880 326959 268241 241628 223799 184875 186786 162081 186980 194648 192348 140476 102585
19594 102585 122662 133907 127609 161682 190292 113234 146146 197478 231152 217608 160985 136265
19582 136265 107069 70575 128308 164278 117269 138965 139192 133756 84816 70271 69504 38177
19570 38177 16789 40942 60862 102946 139281 85270 59632 50165 72131 56575 14247 -5800
19558 -5800 -45362 -32703 15649 75025 52633 36726 59247 68776 -12637 -26668 -44591 -107228
19546 -107228 -74901 -2684 -31264 -30780 -60365 -39206 -43732 -117723 -130297 -79475 -59890 -93055
19534 -93055 -48010 -63881 -83708 -17880 35029 57063 54731 60397 71894 78588 51418 24187
19522 24187 90451 106900 131868 115152 118292 102145 78158 78662 51006 34370 29389 79775
19510 79775 101863 105909 76418 63542 27225 -43650 -51726 -45283 9030 26903 25668 33859 27392
19497 27392 44979 62884 59933 6639 -34607 -29767 -28141 -8279 34249 28484 -12091 -53391
19485 -53391 -66951 -83235 -120802 -73484 35137 63559 10901 -24363 -77133 -34285 16512
19474 16512 18491 41498 49579 51100 36884 37508 95828 91348 47000 47340 4265 -45752 -28508
19461 -28508 28638 26846 39314 38934 39192 2198 -2478 56823 42789 47545 102939 131091 77190
19448 77190 33458 6628 57948 70015 23615 43993 75319 69968 57773 33663 1855 -26305
19436 -26305 -47992 -59201 -51812 -21020 -6999 -10509 11098 56711 104996 99267 32600 40095
19424 40095 6278 -27078 -5154 16327 110703 136985 123538 53420 68129 79149 68188 11809
19412 11809 -49106 1318 11985 25410 18722 41060 44976 14281 56018 83317 114957 146342
19400 146342 139318 78128 40916 35910 17789 14153 3573 58273 47796 1639 22065 22834
19388 22834 24260 29504 -1399 36999 89851 102902 101842 82174 63471 5161 -16652 -57368
19376 -57368 -31160 51326 114941 75567 -22262 -27104 -1289 53245 62244 96072 85228 103838
19364 103838 87967 61962 72787 5850 -670 84461 86253 70561 41912 55186 53949 16753
19352 16753 5898 4866 5872 4296 2449 14946 -32685 -36825 -20571 -5205 -22955 -24338 -18917
19339 -18917 -80464 -98618 -44175 -35756 -9516 50328 66922 87840 72921 38243 109518 183954
19327 183954 195047 208611 234201 185786 119193 142176 106588 117058 109416 88927 64795 58297
19315 58297 67401 82720 81189 35982 49522 79813 98588 140537 139707 119790 109916 89568 92266
19302 92266 120742 197871 190170 142023 95865 33895 29476 27528 71320 93607 126266 146955
19290 146955 173969 196534 196228 187336 181657 189515 163244 153012 174537 181571 111842 9402
19278 9402 29705 64453 23618 34544 46984 107459 117890 137420 127610 68625 53028 67949
19266 67949 85374 135543 154520 75634 18577 22705 66206 47203 27790 -11573 19221 15374
19254 15374 40317 108103 32965 -41822 -61679 -25938 27098 39832 70872 28429 45216 70061
19242 70061 80954 70363 59819 97057 146330 150986 116130 111059 120107 119581 23963 -37591 -42355
19229 -42355 18986 61857 85712 71307 67910 26027 2696 36933 44694 9498 9134 -32776
19217 -32776 -32162 73150 63958 26835 73353 52956 9119 9411 16290 -6520 -35955 -67027 -69228
19204 -69228 -84270 -41544 -38296 -65668 -121819 -97889 -5441 27405 26819 -48250 -80728 -22879
19192 -22879 -31706 -31167 -41728 22326 17534 -31636 -23115 -46146 -44673 -77351 -50804 11940 12132
19179 12132 6589 33325 66163 94032 54110 36892 12238 57920 87050 120771 186348 172580
19167 172580 123575 74519 25293 4020 -20158 -21855 54514 46356 -12311 -28789 -14435 -28943
19155 -28943 10985 76388 117763 102032 101207 73573 52657 29491 52765 93846 26569 -24810
19143 -24810 -35970 38431 56741 47803 25181 18314 57735 12306 64431 100179 67004 48490
19131 48490 48037 70839 43844 59943 108664 61146 -45071 -39265 -35252 -33893 -8818 31928
19119 31928 33416 85196 81429 99752 91381 40554 35601 48571 43928 2433 16463 25956 30004
19106 30004 64928 24216 12289 -1099 11681 9324 -25029 -3061 -20081 17988 31296 -13665
19094 -13665 8346 1024 -43543 -12712 23831 60121 51648 5316 -12685 -1337 32598 26276
19082 26276 36592 51093 30186 73054 107845 108690 58751 48450 101277 126893 123790 57579
19070 57579 97538 220830 273410 242976 197489 160992 105280 106686 193227 228750 175550 174131
19058 174131 124599 84541 112175 119033 126741 143427 128655 122003 136458 115521 129148 171156
19046 171156 146823 129168 74919 57691 77382 85975 76253 161356 207894 190623 191973 187539
19034 187539 179959 217856 233135 184179 147399 138724 149919 151363 152768 91077 89095 129825
19022 129825 220018 257783 219405 279458 289170 240184 214511 177084 158723 205290 274924 244733
19010 244733 235430 211002 150057 196275 205680 163736 168287 178576 229288 233413 222947 189446
18998 189446 119039 105732 99362 82090 97200 109578 177209 183340 161762 143539 134195 123984
18986 123984 156472 180177 169370 124606 114206 172799 197155 202935 193387 258158 302756 273249
18974 273249 247133 203520 252023 233025 160171 185556 194086 177014 212133 215933 244355 316318
18962 316318 375829 344748 306094 251049 253634 252264 270002 230597 196069 211678 249786 249272
18950 249272 257054 272911 247099 266775 301834 354578 419794 387443 346867 313776 265614 255826
18938 255826 250350 214970 192014 198048 260212 345174 331972 346206 318651 304300 313882 284043
18926 284043 209332 226318 249528 271680 319297 348042 294337 247781 188505 205773 178604
18915 178604 183864 260044 250996 188041 179088 234336 333807 375995 402983 390692 376823 342200
18903 342200 348176 277703 270491 260970 282653 345529 405162 399581 419628 435017 418986 379577
18891 379577 421876 395160 364424 398235 412751 402592 332531 293765 326453 354755 328761
18880 328761 272203 295293 313588 299135 319365 319508 328909 340344 370314 395012 396799 482423
18868 482423 594740 651404 711083 728389 720660 736765 770762 801544 819060 892739 996580
18857 996580 1081084 1170239 1297726 1463407 1638624 1746649 1776882 1712017 1671798 1664595 1699641
18846 1699641 1784827 1901034 2111040 2325563 2506558 2610300 2632222 2740579 3001979 3432004
18836 3432004 3938821 4550148 5232130 6119344 7224347 8560864 10011766 11454919 12759043
18827 12759043 13859166 15177612 17059542 19098179 20763928 20938586 19349711 17465829
18819 17465829 16138266 15614714 15658761 15779094 15706168 15156639 14456180 14069865 14267520
18810 14267520 14853150 15502858 15983541 16220692 16591752 17632138 19252182 21427512 23984484
18801 23984484 26513564 28584349 29677498 29299603 28050508 26355336 24565043 23328772
18793 23328772 22505637 21153332 18984652 16516097 14362598 12814322 11920943 11740443
18785 11740443 12202924 13238254 14783826 16549957 18439328 20682722 23565118 27117991
18777 27117991 30537362 32791986 32318716 29626812 26826572 24751572 22969230 20765547
18769 20765547 19002164 18454370 19013315 20342027 22277983 24816632 27601988 29884521
18761 29884521 30660654 28464440 24311447 20102365 16404985 13344074 10923434 9205584
18753 9205584 8050969 7247013 6645859 6160852 5663299 5156326 4805120 4584476 4455920
18744 4455920 4512675 4606888 4835388 5143455 5447657 5548124 5341684 4856807 4198054 3589860
18734 3589860 3172666 2884208 2721860 2548796 2446864 2465765 2470004 2461209 2415910 2340538 2205407
18723 2205407 2066836 1820617 1606802 1384344 1165045 1115444 1044506 981106 895991 833848
18713 833848 807035 749749 748582 713125 666954 661742 617560 596099 592147 604738 550106 561876
18701 561876 571797 528718 498258 593813 665626 679154 669962 639253 643842 628887 575524 515016
18689 515016 488121 485925 544956 577962 551862 466816 411807 390793 419121 394251 338709 343993
18677 343993 420682 443117 381159 410672 411240 443440 430149 471210 484309 428431 377724 394993
18665 394993 363357 329740 332815 315832 345410 436937 414198 347895 258856 278827 369705 375674
18653 375674 425976 413416 378987 375272 416965 471979 484064 415589 354991 334218 355561 384796
18641 384796 416820 426334 399011 377826 373546 357973 338084 299982 313855 323452 231139 221085
18629 221085 268992 286474 308631 296391 278394 270480 241891 268529 253073 268907 243922 239854
18617 239854 274081 291692 235956 246723 340921 361104 342339 269098 230579 316547 346090
18606 346090 362234 339666 294969 294711 287114 294908 311716 382055 412150 396153 403656 362356
18594 362356 318289 334227 348211 344450 316279 282251 329607 376217 365218 325303 302280 299808
18582 299808 248869 276359 305467 295396 317953 322054 292915 310829 323632 330142 297884 300997
18570 300997 334125 319465 233601 186537 141108 192691 234112 307690 389845 414408 436115
18559 436115 408430 376634 378385 335740 350409 357263 312612 357847 403844 416761 414800 410686
18547 410686 429264 451169 460244 456551 450226 422279 476274 507269 581393 662554 788919 866803
18535 866803 1015983 1250111 1446214 1624820 1716781 1821620 1973320 1989115 1891952 1796123
18525 1796123 1747948 1767439 1854953 1984473 2120073 2127885 2049056 1978075 1877645 1783950 1574964
18514 1574964 1352535 1335414 1373668 1324020 1245813 1244743 1292401 1375885 1503383 1684637 1859300
18503 1859300 2116535 2523495 2886251 3278305 3821183 4458174 5204780 5977280 6782885
18494 6782885 7337587 7702520 8122277 8711411 9595087 10613699 11511243 12042837 11686910
18485 11686910 11064009 10720249 10883158 11450160 12109410 12370013 12280793 12247176 12840978 14186439
18475 14186439 16368789 19172986 22248439 25462697 29121912 33180224 37379728 40649013
18467 40649013 42196331 42334867 40882663 38885607 37777021 37875619 38677907 39156604 37691285
18458 37691285 34565468 31610073 29801711 29116482 28913613 28463259 27413772 26096286
18450 26096286 25244604 25658376 27318064 29987639 33611188 38227315 43524240 48991812
18442 48991812 53595464 56134470 56087012 53895895 49827871 44847347 40132806 36012942
18434 36012942 32240951 29531849 28715764 29784112 32207768 35422431 39330747 44193578
18426 44193578 49542144 54158053 55815718 51597086 43025500 34346036 27833840 23467421
18418 23467421 20500498 17987377 15555363 13517263 12047947 10997057 10141145 9203091
18410 9203091 8094553 7148642 6486601 6093402 5973144 5957726 5997836 6187856 6434697 6671550
18400 6671550 6787000 6488921 5787060 5011976 4306446 3668821 3193854 2872038 2603924
18391 2603924 2425301 2240902 2135790 1986178 1883895 1759008 1684526 1684542 1671776 1590640 1633206
18380 1633206 1640523 1608532 1553627 1394726 1247713 1175794 1140185 1114618 1047551 957670 941500
18369 941500 959634 964365 931144 955432 894310 797002 707466 652337 625927 681136 691473 599454
18357 599454 552257 515152 542841 598017 609094 643721 649713 590437 501271 462719 404951 378612
18345 378612 392964 407665 428022 358819 371188 382902 371000 379166 371530 309077 280500 322781
18333 322781 377544 385953 413341 415814 420071 391211 351263 351746 389361 369673 344301 329320
18321 329320 328242 281120 243276 219216 253579 277416 366670 341742 325249 321985 327368 344818
18309 344818 334689 361513 422112 449086 454349 401832 366581 296463 240130 271654 327968 343219
18297 343219 351659 350307 352369 314764 259003 311014 318178 265107 274263 234313 263048 229326
18285 229326 186583 200642 260422 231677 171529 175522 188323 204227 189731 200218 248734 210517
18273 210517 231372 257230 279721 282349 227619 150464 163495 158606 171751 213267 274931 281990
18261 281990 238976 189100 159850 152359 180183 189480 199537 232966 321102 336591 265372 194496
18249 194496 154373 213552 244996 185757 121705 123461 169488 183903 152424 145969 176123 194126
18237 194126 171395 137727 175299 179986 185401 208602 173351 104530 123400 154297 163580 148588
18225 148588 142123 132610 203417 230926 204483 188867 178230 166314 146511 184259 192525 168980
18213 168980 89972 24595 50243 72747 91536 66388 52861 48341 100623 150772 161069 112414
18201 112414 56903 78506 74736 117952 131242 84419 55069 53971 78403 107046 153431 166648
18189 166648 190463 180163 139374 171828 164886 64232 -3165 81017 130099 115131 139449
18178 139449 157441 186521 139864 109760 52305 87928 147975 215489 161060 173687 185465
18167 185465 162868 109548 125485 169303 181572 93616 64694 62027 107320 136831 114513 103773
18155 103773 82640 45348 12108 2429 54115 55032 2403 -36836 24003 59297 35179 66572
18143 66572 83952 117102 83873 43192 8563 -40287 -22463 52983 71968 71566 93591 71203
18131 71203 29771 22003 54423 90911 66840 33281 -786 25610 37144 -964 -30359 6246
18119 6246 33790 109485 162774 181910 222075 176039 120114 68076 145950 102865 21517 35972
18107 35972 54175 84622 98907 47920 12843 -35667 -8896 56930 90447 117552 90412 37244
18095 37244 8108 51007 80669 8006 -20392 -24223 -2170 18958 -5882 -12620 9010 71631
18083 71631 89382 27822 -23808 12170 38980 23655 33849 20529 530 24920 62841 128703
18071 128703 151974 115452 107825 142583 153741 61972 -29736 12554 15943 29343 98120 116587
18059 116587 126958 160000 146171 104094 83608 47282 54351 26599 -24586 -24496 9586 -19123
18047 -19123 -45508 -32420 -2173 -5032 6779 21227 6878 -16009 -19006 -12065 -9936 25511
18035 25511 -1731 3743 24699 60955 22891 -23160 -30967 -15562 -29763 -13027 21749 7499
18023 7499 -22931 -67756 -46333 -84715 -57600 -45778 -17252 57178 92632 60701 3557 58451
18011 58451 83879 13316 -28268 -27858 33647 93397 73749 57814 58145 21270 32591 81549
17999 81549 59339 57643 39707 -30989 -24814 2094 22179 71569 117040 92819 116137 135897
17987 135897 108068 123380 111490 89912 112626 75503 65166 34861 42762 94360 118750 134244
17975 134244 136795 179213 177533 196414 200130 179652 173808 181018 158092 122011 132625 218513
17963 218513 305745 304843 214683 182385 191979 207076 255630 219816 168931 106811 84004 77214
17951 77214 101058 111498 91181 133215 137901 181095 189682 174750 196775 144208 172857 217917
17939 217917 171928 153780 141753 110080 143000 144210 118137 104450 70497 119507 157132 109709
17927 109709 119285 153839 139695 154022 174829 185984 205798 196518 213261 218034 206532 126020
17915 126020 145384 163432 143824 194552 166978 168268 206350 193902 175802 181178 132959 111408
17903 111408 97807 102276 135820 114403 84359 76494 59613 30865 7008 35730 28641 667
17891 667 4621 68598 86247 129746 98009 57672 101418 113106 137235 133832 85807 126050
17879 126050 122156 55091 25733 35263 10746 -6211 54483 83474 41819 28272 11366 24928
17867 24928 19509 35122 62493 6397 17764 35476 3004 21838 44674 66580 98043 144583
17855 144583 104315 66649 98165 124141 150419 61923 -684 31520 56743 75018 93955
17844 93955 97244 92025 115045 78133 40727 -292 -11026 34881 72075 51234 30982 -33584
17832 -33584 -39156 -34290 -37046 -14181 -28505 -56621 -66770 -79923 -95789 -43306 -9272 30591
17820 30591 44133 -10811 -33387 544 -34033 -84708 -100841 -88187 -67841 -57644 -8675 7465
17808 7465 -34862 311 -31283 -68379 -6834 65480 97204 35059 -57199 -91010 -78589 39550
17796 39550 104349 65186 13651 59315 123980 79214 65418 55721 71104 74170 79489 40694
17784 40694 5431 -18211 -26324 19920 21099 9316 -3142 -52733 -73825 9279 64086 93234
17772 93234 141220 129738 50218 58813 -11048 72517 150248 80716 -21020 -39058 -97668 -153574
17760 -153574 -134016 -139458 -139634 -113865 -97854 -84578 -76149 -62938 -26846 -23691 17299 381
17748 381 7373 19375 19680 -514 -54143 -97300 -48120 14196 24972 31264 22981 39958 -32397
17735 -32397 -81306 -57358 -26388 5106 64769 62391 59031 15950 -27573 3017 -20304 -24856
17723 -24856 -52353 -48114 -5274 23642 39630 58383 34419 -9786 -37630 -25357 -17953 -33070
17711 -33070 -8867 -17972 -48018 -44124 -38244 -21599 54446 74498 83239 114557 71430 42372
17699 42372 29584 42779 57006 29087 41621 1463 -25927 -59688 -83247 -75106 -49304 -77096
17687 -77096 -70661 -60811 -75076 -148200 -183453 -130753 -78774 -35515 -18585 -8143 59820 109175
17675 109175 54535 -506 61707 88605 59347 13156 -31776 -74744 -96312 -115877 -64367
17664 -64367 -22750 -32612 -14758 -22543 -95622 -59351 18972 63368 34037 -1061 -30459 -45540
17652 -45540 -13711 -41104 -90675 -92196 -92543 -25564 4159 -42221 -41376 36214 46098 60511 42520
17639 42520 9740 -53594 -84220 -49037 -22762 7122 9903 -306 -36294 -77305 -65322 15325
17627 15325 63138 77734 40179 51443 76719 -5149 -38564 -38335 -5754 24516 54283 60050
17615 60050 -6512 -67976 -41889 -79699 -67152 -37826 -43611 -57038 -69816 -53631 -4367 19102
17603 19102 -15071 -33465 -43071 -43559 -64460 -74803 -94127 -69216 -35707 -49258 -6681 18645
17591 18645 -17513 -22157 -19613 -14771 -45332 10947 -7599 -7245 11397 40817 11447 -2693 -2758
17578 -2758 -9566 9694 -45276 -78783 -68842 -14773 -620 -22113 32388 30216 28350 5377 -28375
17565 -28375 -70886 -107931 -57753 -44136 -101008 -83547 -60856 -42973 -51934 -65203 -43655 -41921
17553 -41921 -27824 54067 39092 10508 -64239 -86019 -44014 -64846 -78932 -91782 -42150 37731
17541 37731 45383 -14973 583 10539 24105 60674 81484 48093 38406 44855 2897 -44111
17529 -44111 -26866 19967 18549 15759 29707 28636 28917 -16597 -10080 -7138 -36823 -38164 -629
17516 -629 16259 28799 66752 59833 21198 -42228 -95688 -77168 -75749 -82082 -33972 -18362 -1448
17503 -1448 -8966 -8589 39490 44726 29293 13670 2772 33145 46110 106052 89923 45897 23759
17490 23759 45165 81156 87073 51850 -49014 -110086 -129288 -89740 -21413 -15161 -60414 -100617
17478 -100617 -100463 -45128 -82672 -71344 1786 -199 2191 35283 53246 39959 13690 7484
17466 7484 16519 5921 -10729 -24548 -58716 -37006 -42836 -9998 48889 80590 -6279 22975
17454 22975 38485 34211 47018 37234 -4460 -58952 -89490 -70091 -25936 46300 94602 61302
17442 61302 7408 -29969 12860 -252 -45507 -44674 40980 56122 47512 24067 44987 46201
17430 46201 17043 -73939 -107203 -46208 -25357 33244 60157 60715 -38243 -97863 -56677 -28084
17418 -28084 -57912 -69700 -47015 -47271 -109571 -126148 -93013 -76614 -106714 -85942 -100030 -5686
17406 -5686 16535 27159 46538 67458 31854 60761 113435 102695 122408 117144 56633 54615
17394 54615 8663 13246 20550 10137 26341 35609 -2215 -12987 66533 58068 62584 28880 -18263
17381 -18263 1413 -24087 -14115 33663 11801 21549 40452 48376 109891 133236 134850 99352
17369 99352 127725 119630 70145 30652 43425 103567 64451 90629 96010 60716 53217 59759
17357 59759 91417 137369 116453 80681 110518 85487 23183 42489 62660 53378 104991 117037
17345 117037 -24214 -70824 -49205 -49547 -12959 36906 -15524 -87534 -88763 -95332 -78067 -15972
17333 -15972 52251 58587 71167 117265 146966 109903 97583 102486 64454 53714 104396 94646
17321 94646 51009 19096 65609 88430 54975 56540 16361 -38243 -40329 -75115 -47372 -35154
17309 -35154 -21532 141 -4319 38326 -21313 -28525 -32729 -29036 -56051 -91790 -55829 -25627
17297 -25627 43159 56785 -4069 -52133 -57101 -76349 -45785 -30810 -61433 -116798 -109043 -69774
17285 -69774 -11379 55709 85363 13995 -21471 28473 40984 51841 91971 86074 75385 54922
17273 54922 34797 27836 -8123 13378 21253 -5728 -68715 -107593 -106086 -30541 -22886 22142
17261 22142 35281 21764 25727 -4131 -50748 -86408 -27422 -42051 -90993 -92646 -20426 35559
17249 35559 -24354 -14614 28767 -5031 -3168 22443 160 -47720 -58781 -21039 72370 71888
17237 71888 -11316 -51521 -44709 -25823 11965 -15879 -7546 312 -83353 -126618 -102742 -94250
17225 -94250 -72023 -19010 6729 -29951 30148 64907 57546 80932 32901 -37458 -61599 -21459
17213 -21459 712 15608 -30135 -69520 -96230 -81798 -122531 -113681 -34604 -67009 -76624 -51698
17201 -51698 43631 28712 21307 13229 -21238 23000 -9873 -24215 4546 25112 19772 -8907
17189 -8907 13169 10140 -56792 -92334 -70219 -67010 -11861 28809 64899 6688 -71626 -47718
17177 -47718 13391 29986 72326 19866 -45881 -97469 -84504 -67065 -8071 -8376 -31387 -17207
17165 -17207 -4398 23221 21508 2512 15448 70209 13580 -44747 -68134 -47508 -13631 -30129
17153 -30129 -37719 4769 32320 21503 23685 -19042 -52801 -22854 -58388 -97520 -81902 -47185
17141 -47185 -23427 -46449 -41018 -35407 -77088 -40852 -40441 -47787 -57013 -19934 -2178 -33303 -59275
17128 -59275 -58570 -54596 -35260 -82471 -66381 -12076 -17 1915 37447 67354 69448 -33924
17116 -33924 -127731 -119448 -61728 -58474 -48328 -44314 -52524 -97411 -131093 -71666 -36094 -80927
17104 -80927 -114811 -90877 -105178 -105812 -80501 -80979 -24789 -16817 -51710 -26401 -35821 -72116 -87085
17091 -87085 -65080 -18840 58412 87629 100462 46041 -34020 -77387 -89096 -85269 -68933 -6932
17079 -6932 75498 62774 -23784 -38432 -13586 -15934 -40162 -19238 41578 52853 41082 35970
17067 35970 4740 -81111 -109227 -95353 -64431 -125512 -125649 -60945 -30004 9790 -9959 -3115
17055 -3115 6986 16481 74584 64649 31271 10983 59568 23558 -47853 -63642 -85425 -73474
17043 -73474 -9278 7447 7386 -12463 -12092 5184 37666 25780 33441 98244 103910 18908 5604
17030 5604 34596 57404 -30682 -56472 -66611 -13294 45452 56088 55202 21869 -29540 -64095
17018 -64095 -68687 -4227 33315 75323 99395 116842 159689 148030 77945 97751 65656 43393
17006 43393 98235 61720 1346 -12674 -28569 -35988 -42929 -45615 -83284 -106975 -107231 -94729 -64982
16993 -64982 6861 -10257 -45391 -68064 -53529 -2191 43089 15682 18568 25109 -2470 3553
16981 3553 -48577 -88526 -62939 13479 92523 41038 13080 22821 9519 42014 49227 36983
16969 36983 16735 17046 1688 32294 7909 41299 -10278 1210 25008 12467 -28606 -23723
16957 -23723 -37558 -56606 -60637 -68002 -89743 -63160 -56280 -38934 22212 2252 -58788 -52510
16945 -52510 20216 82033 98926 93430 22501 12582 7717 32440 48305 59570 19349 -33447
16933 -33447 65170 47633 26933 16612 -26755 -120095 -125464 -87543 -47345 33225 18366 32221
16921 32221 19903 -22841 -16245 9890 -2128 -18777 -38457 -51807 -46573 -43639 -41941 8912
16909 8912 6466 -21501 -79484 -44249 -17719 37538 60757 -21785 -69683 -102090 -12180 -38331
16897 -38331 -23336 -16639 18225 19614 -7042 -28985 25539 47874 32106 49797 66636 71651
16885 71651 23616 80617 8124 -72213 -100721 -102563 -77252 -18910 -9822 -37860 -17414 -9950
16873 -9950 -42581 -35388 9132 36725 54213 4213 3005 -43493 -61001 -57165 -86678 -81091 -107076
16860 -107076 -109815 -49124 -41104 11641 22460 -28171 -34895 12653 21389 -16461 -89908 -141765
16848 -141765 -132833 -131843 -75899 -41764 -67473 -65937 -41462 41704 28870 -51963 -67658 -81596
16836 -81596 -28233 -6740 -50590 -94877 -48685 -22322 -69171 -65178 -11714 13271 6865 52020
16824 52020 119106 138370 107730 87987 44372 89554 78083 40935 18967 7831 -18681 -4131
16812 -4131 44027 48171 46817 61916 65035 79531 57202 58696 72072 36908 21068 12574 72769
16799 72769 63588 61798 59598 64353 14920 -41390 35825 71346 49443 8271 -7449 2210 -19369
16786 -19369 33404 87947 -31439 -86561 -22950 -18623 -31239 -39771 -40716 -20943 -19790 -60328
16774 -60328 -95520 -126112 -130702 -152776 -144799 -108953 -8284 27567 -5729 -115975 -115423 -15226
16762 -15226 -32020 -106942 -70031 -66057 -103242 -126953 -114750 -117785 -71140 -12484 -27675 26163
16750 26163 55055 1109 -22258 -3524 5282 -6259 22241 14081 62380 -13486 -72212 -16784
16738 -16784 -12227 -22273 -63267 -23200 -13286 -23619 -29104 -52181 -86309 -94498 -87743 -76783 -24086
16725 -24086 -35453 -33643 -39349 -70249 -60009 -51361 -26445 44343 10670 -20646 3620 42592
16713 42592 45789 -36969 -84901 -30238 18143 -43062 -114280 -137685 -174856 -192173 -127978 -95436
16701 -95436 -73683 -46756 23524 22960 -21552 -71847 -90745 -46025 -28646 -66232 -58533 -49609
16689 -49609 -59312 11298 23582 7646 39769 -12586 -89768 -135850 -82346 -57046 -131904 -119632
16677 -119632 -43013 -6025 4328 -21368 -18273 -34673 -94006 -112515 -77352 -122294 -107088 -85499
16665 -85499 -76946 -42667 51 14076 -48224 -47944 -7425 23352 -4216 -67913 -75527 -88701
16653 -88701 -166610 -136613 -81428 -65469 -90176 -87650 -101153 -75857 -57224 -5111 2811 -28489
16641 -28489 -106432 -95715 -40051 -55272 -58492 -86885 -39355 -8150 -7050 -54095 -51239 -28552
16629 -28552 -34499 -37419 49354 42195 -30315 -40993 -76146 -54815 -13875 46402 53071 68369
16617 68369 33094 24589 32234 -5123 -36170 -6768 7649 50532 58093 77346 61541 33915
16605 33915 660 -71139 -106271 -42052 -27952 -6805 -74619 -89516 -104115 -132929 -166584 -94872
16593 -94872 -41978 -16038 -23884 1794 59344 13981 5805 5765 -4452 13024 60777 -16137 -91506
16580 -91506 -101782 -125333 -123068 -77786 -50563 567 14120 -16291 -41413 -36505 6816 5713
16568 5713 -20005 -17 -2188 -46649 -112515 -107130 -85208 -73597 -95428 -38749 5530 700
16556 700 -6059 -15754 -16896 5554 13222 27880 16916 -20079 -94378 -94077 -49495 -64057 -101597
16543 -101597 -65075 -25782 -5294 -11379 -31202 -46679 -101147 -122013 -49820 -37768 -21263 -58323
16531 -58323 -79471 -26542 45227 44111 6873 11325 5905 -6062 19962 68464 73172 49078
16519 49078 23928 40430 20183 -27592 -59573 -41250 -21997 -25103 -31900 -7348 -50990 -50447
16507 -50447 -10081 16357 7112 23417 18970 -31376 -82860 -85844 -49555 -81505 -113246 -77070
16495 -77070 -38073 3532 40348 19598 44918 56204 59474 57711 30336 11164 76420 103475
16483 103475 113546 75036 9346 -23241 7054 47847 11140 -25704 -22197 -16332 9070 8170
16471 8170 -53782 -52060 -116210 -76527 -28512 -28840 -77042 -86800 -41735 -67304 -46667 -42022 -76276
16458 -76276 -79486 -120086 -113698 -71861 -77922 -86097 -44133 -10836 36583 9940 9128 1762 48980
16445 48980 82791 45091 40620 31179 1341 9217 -1476 -37542 -76651 -65288 37969 76697
16433 76697 75218 48609 -2935 13029 -9622 -15881 -94245 -110354 -11596 55595 58930 -10753
16421 -10753 -56317 -33694 2911 39221 84607 87798 56588 58338 72758 123598 91333 -25685
16409 -25685 -16352 20839 -102 -13310 23511 8726 -4018 -33905 -53129 -49251 -38647 -21684
16397 -21684 -74692 -85086 -59246 -9129 -12949 -42673 -55193 -53581 -54890 -46020 -69590 -64114 -63426
16384 -63426 -68853 -16954 50265 30343 12138 -11917 -29511 3667 -15852 -33970 -20233 19649
16372 19649 39625 -10405 -46820 -35054 19359 62305 29359 30301 25755 13685 -22440 -29773
16360 -29773 -6044 50456 77680 81568 91342 43552 -22348 -51862 -73707 -97501 -49370 -72913
16348 -72913 -72156 -39158 -7194 -44998 -50162 -41950 -56548 -42933 -48780 -79612 -49186 -32320 -62619
16335 -62619 -39656 -13242 -24845 -74228 -108888 -97770 -38652 -5530 510 3353 6011 30300
16323 30300 1551 -29918 -56946 -56639 -62668 -27069 -65983 -30779 -41738 -83021 -31180 -54452
16311 -54452 -73562 -89668 -75333 -60448 -47909 -65609 -35096 23400 11899 -73697 -76654 -20813
16299 -20813 3329 13622 29559 -19603 -56201 -28042 -34305 -38700 -5309 -39945 3169 3269
16287 3269 -33489 -51157 -16838 11943 24638 -1341 -20126 -2845 -4177 11861 7294 53814
16275 53814 43125 -9119 -4292 -35844 -21174 1557 -67011 -36295 -1085 18890 2619 -17692
16263 -17692 -45674 -38760 4370 -5994 3381 2197 -18565 -48568 -23138 -19980 -51373 -36043
16251 -36043 -8744 23556 7488 -30410 -27263 -18488 -30481 -4034 -22384 -29171 -10356 3697
16239 3697 75808 64641 40211 31061 -1670 -2322 -20056 -77019 -87529 -84421 -25136 -371 -23458
16226 -23458 6991 70049 95683 43401 23530 15275 -24163 -91118 -87929 -53869 2925 -12648
16214 -12648 -19161 -19293 -19116 11928 18367 38086 61444 80208 56262 48197 22904 2465 49625
16201 49625 76203 45784 50016 26255 4226 38322 55518 -25415 -40622 -14146 37348 36095
16189 36095 -32838 -57613 -67763 -44042 -67758 -79701 -22091 4382 -11541 5761 22589 64160
16177 64160 28014 38703 36072 -1539 -86030 -89288 -62867 -41200 29073 44943 -31545 -115230
16165 -115230 -102644 -35460 9769 978 -55442 -111830 -154342 -149244 -101643 -59593 -10000 27777
16153 27777 -896 -40596 -27193 -2755 -50600 -88404 -121666 -58993 -4535 36262 7369 17211
16141 17211 -2445 -73965 -103653 -88245 -60566 -77199 -50699 17971 -13912 -58057 -72461 -20545
16129 -20545 -26061 -23410 6151 6298 -63887 -88847 -121473 -84356 -68041 -102702 -110106 -100148 -86942
16116 -86942 -22757 -4444 -40822 25213 80509 65403 89384 53309 17858 20695 3489 35510
16104 35510 74998 20980 2850 -12753 10588 -41232 -29924 10733 27024 26282 -695 18474
16092 18474 13949 11197 880 -43681 -67911 -35639 -58637 -56046 22809 36930 5312 -51114
16080 -51114 -135876 -55154 78773 89270 76267 79487 -2038 26880 34489 -25217 -33872 -41997
16068 -41997 -23339 25306 -32246 -73877 -26038 -31421 -83088 -93165 -76703 -113902 -126012 -67649
16056 -67649 -19701 8037 -52322 -57991 -99017 -73707 9518 33171 -18037 -30182 -30986 -46160
16044 -46160 -112667 -204495 -202363 -174443 -128924 -70712 -41143 -66993 -95254 -62732 -60313 -5051
16032 -5051 56321 47058 65101 21085 17574 16755 -34349 -61404 -25610 -15008 20569 29846 -27929
16019 -27929 -29172 5588 34009 31730 32131 -45257 -18669 55751 77458 73244 32680 -25635 -44022
16006 -44022 -11812 -20305 -60572 -107248 -76104 -17964 -11314 13224 -34932 -42429 -29260 -37915
15994 -37915 -38695 -73620 -52928 -3889 -5361 -9033 -66738 -100505 -95991 -84906 -85872 -45338 -17586
15981 -17586 -14920 -67993 -103407 -92085 -93957 -27455 -19910 -46448 -58810 -44997 -97287 -68091
15969 -68091 -20739 -15422 3135 -813 -3703 -53284 -60915 -45993 36507 54944 54779 29600 -12722
15956 -12722 -28594 -44692 -25749 -8588 -32283 -1636 95972 117259 64575 7912 5666 2575
15944 2575 13635 -10744 -36321 -71015 -106304 -74956 -9265 -33997 -21277 -88724 -88108 -52111
15932 -52111 -34228 7785 -8301 4893 -29811 11204 25277 -20914 -50939 -3032 7707 -83355
15920 -83355 -72833 -48735 -12528 4211 30194 25970 -16790 -24174 -95647 -124799 -104119 -110203
15908 -110203 -49171 -15504 -20304 -9527 3501 -24688 -39134 -79008 -49241 -37711 -77328 -27240
15896 -27240 -5455 -23711 -13907 -57617 -29180 35836 74048 120590 120996 49560 -4195 -45266
15884 -45266 -85056 33337 32564 38654 67336 47535 46972 23469 -15390 -1604 14112 45393
15872 45393 73832 63904 59708 9643 -7815 -18287 -23401 -65930 -55554 -103788 -92651 -73678
15860 -73678 -47135 -11044 -43382 -26718 -6396 23253 17528 41332 68590 40311 32013 33361
15848 33361 37533 421 16201 17041 -29909 -96418 -94855 -81258 -49601 -53281 -79540 -14611 47194
15835 47194 13914 -15206 -34121 -31959 -46142 -66104 -51606 -71906 -103471 -50701 -18999 5467
15823 5467 898 13049 38228 61409 84753 83652 59707 37427 -40743 -71009 -72349 -33270
15811 -33270 5292 -20455 1296 27024 80029 33018 -51475 -17430 83548 67630 49160
15800 49160 43711 71999 399 -69241 -90647 -129982 -107806 -141713 -109827 -82444 -61530 -75202
15788 -75202 -75982 -62225 -75991 -62689 -48447 -55925 -40532 -37785 -15031 -1548 25519 -3733
15776 -3733 -18037 5342 30177 31203 -14615 -23907 -81255 -115217 -31267 10303 -25787 -9464
15764 -9464 -15368 -28484 -19911 6798 -5711 -45205 -82166 -101524 -94959 -61792 -27608 -68245
15752 -68245 -174114 -108738 -76176 -41352 -82712 -54126 -32246 -21242 -54591 -75783 -32530
15741 -32530 -11814 -51023 -97463 -106208 -71555 -43735 -5375 -9389 -16326 6648 38517 34323
15729 34323 -30787 -7698 -61135 -96075 -43220 16266 110641 81766 53982 46154 32299 3177
15717 3177 -44330 -71964 -26664 -51933 -90533 -2332 22681 -72170 -93314 -49814 26482 42737
15705 42737 99384 118694 101766 98651 91956 33718 15595 10063 30939 31892 33961 74543 145210
15692 145210 92405 36275 45942 -1141 -28905 40203 114497 108289 118531 50101 -5919 -66973
15680 -66973 -105803 -91185 -32009 229 -29662 -53363 -29488 -40866 -67157 -23798 -20005 -24337
15668 -24337 -69913 -23166 31041 39321 3401 5942 20299 82513 101181 53695 -5968 -76514
15656 -76514 -49973 -25156 -9193 5187 -55081 -99326 -98533 -49785 -11400 2845 -7082 11794
15644 11794 17239 -30390 -63306 -97231 -81571 -47858 23231 46424 -3315 15999 19783 11989
15632 11989 -10122 -34691 2306 23534 38461 97409 103288 100713 49350 35190 39471 1014
15620 1014 -28937 -54153 -65159 -87402 -85466 -92385 -21077 9784 -2376 44691 22616 -45682
15608 -45682 -73955 -32930 33788 9529 -31514 -5341 -46424 -57757 433 30251 69181 58673
15596 58673 4417 46397 79403 67148 94558 78138 49214 43046 -68630 -104471 -84159 -73981
15584 -73981 -65657 -30856 -50868 -39920 -15128 -25431 21143 61064 42220 -8672 -29711 -52661
15572 -52661 -106740 -126258 -131708 -78822 -16130 17114 -9536 -64642 -73342 -53632 -92406 -74932
15560 -74932 -88504 -103051 -104496 -128696 -101154 -54160 15719 6093 -72087 -68908 -13111 -16566
15548 -16566 -37530 -22299 6796 53865 21920 -9967 -256 -19311 -37129 -76425 -81126 -45619
15536 -45619 -29049 -63685 -125586 -113834 -130469 -106630 -87525 -94192 -87926 -50335 5710 11032
15524 11032 56728 39858 52017 31286 38793 7646 -24744 -64455 -85911 -74336 -18056 42574
15512 42574 86829 33237 6632 25356 37808 -29911 -79147 -52062 -29094 9216 -19390 -81627
15500 -81627 -138664 -139975 -60807 11091 -11224 -6225 34452 -37539 7168 37494 63663 18742
15488 18742 -25897 20639 3354 -18546 -46241 -59412 -44303 -7538 -39129 -71581 -77783 33409
15476 33409 41316 -21758 -55326 -13869 20071 -32441 -73792 -27983 -46557 -3404 9802 45379
15464 45379 -57298 -111390 -83717 -78182 -56003 -35731 -13516 -92580 -66959 -21844 276 -37619
15452 -37619 -23692 -979 15576 97777 67378 -5314 10566 32123 11307 -23205 -4061 -62075
15440 -62075 -77573 -106231 -54214 -37458 -81087 -140566 -128162 -83327 -70754 -44512 -5427 7158
15428 7158 -46633 -104601 -145771 -124646 -108464 -70579 -35388 -40317 -42538 -3285 -47223 -41791
15416 -41791 -63879 -36817 -11430 9035 45401 55485 35202 -8488 -28053 -36510 -52032 33273
15404 33273 34786 28767 13292 -47334 -32697 -35026 -10961 9819 -4168 18983 -52266 -64888
15392 -64888 -52674 -13578 33836 49615 30304 78637 80668 59243 17850 -12610 -27943 4915
15380 4915 1055 19225 13165 6221 -39846 -64209 34390 66143 46253 38164 -8754 -104939 -168783
15367 -168783 -163929 -112519 -108741 -92164 -113960 -106186 -58444 -70131 -39594 -14345 -6812 -16014
15355 -16014 -20050 -50748 -118304 -137901 -115795 -92000 -76479 -67814 -34770 -66216 -76243 -27785
15343 -27785 9142 56752 53267 2082 -74525 -118852 -151229 -154755 -119725 -91770 -65218 -31422
15331 -31422 -47199 -56109 -35077 -18789 -42970 -54915 -64578 -73125 -55635 -94436 -109390 -25906
15319 -25906 -26307 -70854 -81977 -71010 -39976 -96878 -48685 22017 32056 25701 62470 75465
15307 75465 17456 -31630 -84349 -66528 -25265 -36212 -81683 -109805 -90026 -76316 -111583 -118293
15295 -118293 -119905 -102501 16541 36994 -4094 -36726 -63678 -38866 -9958 -36547 -36780 -60056
15283 -60056 -87390 -53959 33301 39809 20379 21935 47849 30190 -15552 32511 67120 25807
15271 25807 -8781 -8207 -29932 -41479 -52782 -44471 -36568 -42220 -55861 -49053 -22755 13730 30561
15258 30561 -29446 -31307 34401 92853 13034 -62883 -57944 -22548 -6703 -12278 -19958 -20468 -47759
15245 -47759 -49981 -22197 -1779 -4502 -10240 6667 2462 -24018 -7101 -5120 -11877 23292 26358
15232 26358 15983 5694 -21892 -62733 -73048 -17828 -57196 -111379 -91152 -106800 -164611 -137934
15220 -137934 -86962 -121828 -98207 -28319 6576 3616 -24250 -14146 -8702 -95682 -142293 -99456
15208 -99456 -87325 -44719 -67647 -49644 -10696 -9588 26711 22893 -16889 -84047 -97773 -78481
15196 -78481 -58593 -53522 -97226 -108299 -101930 -57821 -73093 -136930 -125076 -114028 -129384 -117054
15184 -117054 -125396 -103065 -60010 -108760 -142326 -108603 -2418 25661 -2379 -65978 -92714
15173 -92714 -18021 35816 65153 11051 -95957 -81409 -57057 -48783 -34498 21385 22036 1190
15161 1190 -16223 -5799 -284 13265 27853 67427 70774 51707 22534 37645 75851 13014
15149 13014 29667 60684 49001 62 10934 57181 88509 58551 21216 6520 -27657 -68919
15137 -68919 -47804 -14587 -36231 -18488 -30168 -55143 -82508 -75915 -43777 -73865 -71561 -57823
15125 -57823 -43603 -53832 -43292 -39962 -43011 -73404 -57367 4078 -15204 -69281 -73390 -39893
15113 -39893 -33356 -31298 -52021 -71860 -76815 -131393 -149377 -77682 -47931 -3133 37731 3866
15101 3866 -53416 -84946 -75946 -120933 -163392 -104203 -65781 -43244 -10301 -34271 -46402 -33406
15089 -33406 -43277 -29331 -4374 -27634 -35739 -43410 -69995 -123100 -125521 -118282 -106194 -28034 45122
15076 45122 14756 1522 -15995 5016 44467 47706 10784 4666 -52478 -24037 -18997 -12339
15064 -12339 58257 100281 62420 -55550 -102786 -152516 -148118 -85056 -70927 -38513 -22090 -53651
15052 -53651 -103640 -62091 902 12793 -31598 -35338 -11497 -32353 3428 6548 -4127 9292
15040 9292 76261 80558 21606 -3759 5033 58860 35945 32060 3781 37944 25783 79241
15028 79241 59754 31275 -22677 -4118 22741 69786 94657 103093 156114 138544 109848 79292
15016 79292 115464 131238 28519 -12060 -37597 17056 2045 -9074 -3889 42580 49848 52463
15004 52463 41212 10753 -26341 -13854 27209 27407 22853 10399 -53777 -129614 -81868 -41160
14992 -41160 -22465 38746 24779 -45145 -42823 -25694 -83944 -65522 -87516 -94997 -59783 -93034
14980 -93034 -50931 38113 35558 -13848 -5378 9993 16839 29900 4026 -39985 -101031 -129611
14968 -129611 -113801 -108304 -58713 3488 33015 10946 -39370 -77134 -65 52829 65092 -6426
14956 -6426 -19298 7309 50712 82884 1290 -67223 -62403 -37704 -44575 -33687 -44255 -65517
14944 -65517 -86401 -87156 -85926 -82457 -115526 -65390 -39325 21769 2746 -8427 15706 97196
14932 97196 101918 44582 -23598 -29487 -69165 -139369 -113253 -61367 -52573 -32699 57187 89278
14920 89278 106064 60471 13163 -30410 -4076 21099 40197 -4939 5835 -24728 -56739 -51168
14908 -51168 -19994 58386 98100 37482 -7790 -38817 -24213 48551 53829 41384 -26372 -23409
14896 -23409 -17193 -12719 4608 9389 -1039 -36491 -79833 -91358 -95247 -80018 -39228 1287
14884 1287 -11457 -33264 -17628 -41952 -51640 -50848 -3907 45069 20704 31030 49287 -2467
14872 -2467 -3559 11426 14886 32679 14853 -10447 -14821 -32103 11711 9461 -7911 -21851 -6918
14859 -6918 24158 58330 61366 55043 33034 -33723 -41577 -22222 20748 5386 33865 15463
14847 15463 20754 36109 28955 -24666 -74478 -85659 -38665 -7772 -33901 -51087 -7939 -23163
14835 -23163 -1386 41917 26961 -11894 -77255 -70887 -31818 12955 63969 51427 -21292 -96910
14823 -96910 -146348 -150292 -90918 -61312 -45625 -75430 -93482 -68726 -58627 -38063 10386 -15298
14811 -15298 -61263 -72072 -57330 -43330 -55261 -90404 -91954 -66322 -59671 -52365 -99293 -84983
14799 -84983 -27402 -38508 -48416 -51142 -47388 -8709 -31744 -53174 -39153 3037 12263 -5941
14787 -5941 -13931 13994 -21509 -48952 -23421 30311 -3392 18981 77950 84123 120 -28002
14775 -28002 20582 54708 50759 50633 18668 -13337 12277 9848 -10635 -18192 -16096 6240 -47943
14762 -47943 -51976 -25974 -62296 -135564 -180787 -176404 -105571 -65526 -57337 -70461 -35320 -10175
14750 -10175 15581 -17365 -77460 -140321 -130354 -128680 -132531 -97851 -57354 -95104 -74678 -61023
14738 -61023 -44720 -35966 8728 18996 -3097 -15757 -33030 -48060 -59689 1014 2474 -605
14726 -605 65453 6583 -38284 -22686 -19899 -10424 -41872 -44005 22427 35018 25010 76417 77542
14713 77542 47137 11854 -18735 -30467 -84613 -69790 -15591 -44101 -82710 -79466 -28441 -9381
14701 -9381 -22318 -8025 -10693 -81525 -92940 -25888 24407 17363 -13376 -27499 -27754 -39471 -3154
14688 -3154 -42758 -59354 -27524 -41924 -42465 -71905 -74102 -52257 -35728 8475 21804 5660
14676 5660 46341 36411 66480 77129 46488 11441 3554 4061 -8407 -33923 -37151 -36631 -19439
14663 -19439 -1022 32743 21063 15177 23561 584 -20044 -78514 -93843 -162990 -169222 -142616
14651 -142616 -129345 -119215 -182326 -148294 -43712 28943 32890 10225 -19472 -64296 -102176
14640 -102176 -102428 -155876 -146835 -90575 -145719 -149641 -126227 -92573 -81740 -30691 15335 -5061
14628 -5061 22213 33176 -8063 -11145 -88222 -96926 -37133 -45855 -13290 -3166 5892 9419 9520
14615 9520 32051 56302 29767 16943 40443 4739 -37980 -25719 -78504 -70486 -42567 -9525
14603 -9525 -15886 -61060 -91502 -106610 -64355 -45282 -43402 -39717 -37342 -10944 -6332 1285 -8352
14590 -8352 -12259 29636 21919 9738 34556 50998 40479 -8282 -54575 2682 -10671 -49804
14578 -49804 -61496 -38640 35884 73084 60745 13038 -28871 -34240 -41847 -78519 -91883 -59230
14566 -59230 50289 86091 87791 61782 30036 -15330 5717 -16248 -25561 -16504 -13388 9514
14554 9514 23615 -11675 -13487 -75900 -128166 -142038 -64887 -19457 27438 16497 -11809 -78787
14542 -78787 -124296 -49935 -10869 -54460 -66970 -85851 -39159 95137 97327 17753 -46167 -54147
14530 -54147 -31066 -55771 -93504 -108696 -75947 -40805 -74243 -53343 -34415 -10934 44429 73251
14518 73251 59589 37238 -17230 -52390 -32845 -14601 -10752 -45515 -23229 21189 -17352 10419
14506 10419 5104 -10305 17325 363 -23823 -32016 -25447 -34234 -90519 -120900 -80028 -51759
14494 -51759 -38606 -86660 -84920 -74859 -47393 -42627 -35190 -34221 -88715 -94177 -73268 -87033 -125815
14481 -125815 -104939 -85373 -20810 -2358 -43078 -47338 -24839 78270 52020 11493 -35036
14470 -35036 -21464 -6359 -54190 -82957 21163 18085 957 -8971 26353 28211 68169 44736
14458 44736 -22791 -53504 -61122 -64251 -140401 -121082 -89294 -72322 -137316 -114113 -27979 -10697
14446 -10697 -45432 -33834 -46033 -33885 -41756 -41145 -32007 5238 15163 23348 27170 30837 -5657
14433 -5657 43566 104908 129817 118521 98375 93080 56192 -17456 -32623 -57380 -57784 -21055
14421 -21055 873 -23196 -25532 36824 44742 -28775 -72794 -13684 51208 59306 26407 80956
14409 80956 16598 1722 21278 -26829 -67397 -56302 -36244 -21942 -36546 -71657 -68134 -70754
14397 -70754 -53417 20739 83200 44879 13952 34519 79810 120509 74643 687 -46952 -67667
14385 -67667 -35560 -27837 -24711 -13848 12235 691 -43051 -4385 -28942 -58594 -11578 -25879
14373 -25879 -60890 -137494 -135858 -28274 34493 5245 -13733 -43890 -83358 -122398 -103969 -84787
14361 -84787 1303 24794 -36743 25093 54922 36737 57467 66069 90069 89889 64630 78516
14349 78516 25889 12263 9598 -25067 -30941 -27282 -16574 -22062 -74239 -76914 -67253 -83803 -104849
14336 -104849 -151053 -104490 -84049 -60562 -10354 46232 23936 -42055 -19611 -42738 -49036 24896
14324 24896 36020 51234 25679 19666 53410 23942 43731 51619 40254 23594 -60823 -99056
14312 -99056 -60521 -72558 -38623 -101583 -115842 -72579 -398 55123 54255 18570 13937 -4379
14300 -4379 1379 1951 18229 -22230 -8490 63560 -1687 10968 50735 92964 91095 74719 67781
14287 67781 35483 30638 31569 79532 106739 45903 47289 48576 43587 -20098 -61410 -75455 -29224
14274 -29224 5404 22647 -6572 -85622 -74525 -84311 -147651 -141704 -109849 -48154 -29831 -50596
14262 -50596 -22794 -12256 -50079 -24612 -40881 -86932 -15971 -55237 -27464 -15990 -32079 -45327
14250 -45327 -46062 -69454 -83398 -16544 -23354 -57961 -86918 -73054 -60097 -58651 -40748 -100868
14238 -100868 -160005 -91184 13267 39076 10089 16163 38688 -34398 -46480 -4352 -17040
14227 -17040 -88307 -101575 -136485 -138577 -70168 32414 77935 38041 42814 13627 -28681 -25104
14215 -25104 -50627 -62418 -62771 21771 -21854 -23391 -58921 -63190 -34253 25818 56688 42733
14203 42733 31165 14373 -44746 -94799 -123509 -99448 -27695 20390 11680 -53911 -52896 -40816
14191 -40816 -37778 -25141 2037 35644 41370 -10112 -31441 -49170 -32852 -63523 -78977 -102142
14179 -102142 -132426 -67866 -54920 -80462 -104997 -129423 -94805 -1071 -10646 33702 74759 91405
14167 91405 65865 -39932 -34746 -5547 6072 32604 -19807 -88238 -58926 -11317 -25083 -82103
14155 -82103 -79387 -660 -28165 -78488 -43837 -68594 -49453 -92835 -60819 -12412 -9398 -26908
14143 -26908 -3110 -46813 -22996 57988 27309 -55347 -36073 -21270 -4432 4966 -26309 -21057
14131 -21057 -71436 -79360 -77059 -53189 -68787 -65185 -3450 19970 -39940 -34121 50951 42215 7276
14118 7276 -9703 -65908 -36724 11348 63085 44657 53320 28264 42173 64867 100017 93845
14106 93845 48746 19999 33964 -16959 -88974 -62889 -74354 -81636 -26296 -8793 -20643 -8720
14094 -8720 17416 73141 91501 84856 57120 48622 57443 -14459 -74613 -112476 -143171 -122851
14082 -122851 -84095 -86427 -35191 -22484 -60247 -63522 -70749 -75434 -72361 -80594 -59537 -82610 -70236
14069 -70236 -13804 -2330 883 38465 36444 23858 5216 -11360 6588 40662 23491 8865
14057 8865 -17891 -15974 -4728 -37810 -43737 -35952 -43234 -21174 -14505 54795 40538 -12566 -24778
14044 -24778 -17149 8697 -16425 -53743 -76930 -73733 -88980 -37974 -26698 -79223 -104884 -57860
14032 -57860 31558 59428 15915 -12985 35462 92241 123123 40497 38246 70009 48545 25909
14020 25909 91954 105495 71699 73431 66145 50336 22035 -48036 -14851 14000 15324 10501
14008 10501 9291 -22408 -14584 15759 2687 50569 65365 53629 92016 33932 -15407 -26757
13996 -26757 4985 38696 114221 119481 44426 51427 2878 -49921 -33900 -69459 -55252 3983
13984 3983 29680 5373 25524 105920 91794 47103 73953 119948 91153 65788 44927 34574
13972 34574 27332 22613 47769 98588 157869 139326 79459 7178 35323 61691 -36111 -9797
13960 -9797 29925 43640 67529 35211 -17385 -4560 18474 43059 44452 40842 -24900 -91181
13948 -91181 -81722 -26073 2832 -19259 1683 -9814 -67498 -103179 -63661 -35785 -75309 -72391
13936 -72391 -73636 -88807 -6131 -6870 -4098 10925 45973 61719 46436 29401 -48583 -95023
13924 -95023 -76393 -23521 24716 11706 -686 9971 -100 -38246 -107351 -56073 9683 26470
13912 26470 43915 12893 33810 46500 109914 67421 42952 67284 22927 -10253 -35418 10086
13900 10086 8365 -67916 -77775 -55753 -23746 -15187 -39192 -14298 15447 26459 24810 22426 1339
13887 1339 -34445 -1175 12426 -20514 -3877 43970 29714 -9861 -28066 -72023 -91057 -69005
13875 -69005 -47800 -22785 -11341 -9620 2040 25652 50073 61912 43670 -62810 -57298 12692
13863 12692 -20761 -20627 -9586 -10354 36251 32623 -10682 -20573 -51155 -16323 7104 2691 -21249
13850 -21249 -33974 -26357 3609 28600 29487 -1649 27745 19605 -19885 -81857 -96463 -72789
13838 -72789 -59601 -65537 -95889 -70720 -42335 -47667 -40455 -39002 -19921 5794 -4895 -141 -50746
13825 -50746 -46246 -58564 -38732 -39952 -51409 -105465 -120375 -47573 -31185 -49478 -20955 -47561
13813 -47561 -96010 -57451 33528 27309 73106 76083 16085 -16103 403 42909 70391 88189
13801 88189 80318 22780 -13808 -21562 10099 53445 76948 41937 21397 -19729 -49063 -32212
13789 -32212 -28144 9728 -4438 -73902 -100390 -39419 4517 60848 107482 61568 -36503 -44003
13777 -44003 -27809 -63095 -75246 -41160 -24987 8927 -8530 -73456 -97515 -18360 -17627 -47642
13765 -47642 -87492 -67806 -83431 -99638 -69217 -77826 -50840 -42356 -3460 36890 1623 -57991
13753 -57991 -71587 -59801 -33717 -50638 -48100 -7902 28668 -5613 -21107 -32412 -21465 -12474
13741 -12474 -10517 -2700 41206 34771 32730 18164 36806 52374 52583 31137 46132 9608 15662
13728 15662 41701 32181 -22536 -54320 -75206 -91040 -76905 1041 48273 68429 84022 109812
13716 109812 66337 2873 -51879 -6025 15446 -28085 -18388 -16097 -17599 -10437 -45122 -12646
13704 -12646 -14937 -35162 -40228 -60305 -18712 -1636 -20806 -29143 -47671 -20751 -47238 -65562
13692 -65562 -78720 -94519 -89751 -69984 -74898 -81870 -74455 -27148 1197 -43284 -15152 32609
13680 32609 75606 77846 77264 28925 9074 -23558 -63516 -43351 -29382 35475 84622 70358
13668 70358 36876 18421 -4235 -89317 -119275 -97365 -12421 61950 19832 -14627 -63142 -108101
13656 -108101 -93776 -52698 10112 17967 -61921 -66287 -38199 -58031 -66905 -83853 -58543 -50435
13644 -50435 -40940 -32440 -22526 -4547 107078 193594 140786 109564 59092 97544 112329 44773
13632 44773 -7318 25466 16825 -37006 -57653 -13704 -19074 13679 52271 -11143 -61423 -32271
13620 -32271 -57627 -66972 -50656 -58946 -77701 -55015 -31785 -39843 -32653 -42494 -90805 -135617 -136967
13607 -136967 -188130 -219514 -108415 -7068 64479 22788 5457 72904 85827 52310 53384
13596 53384 16643 -48960 -33458 -3073 8281 -20107 -76201 -101010 -38071 -39433 -16656 23731
13584 23731 28418 22378 39714 67300 69861 4807 13217 38781 110786 110626 44863 44662 46801
13571 46801 14528 49843 44579 -17610 -83404 -81894 -31870 -49856 -91771 -84550 -71141 -68985
13559 -68985 -52945 7739 43355 85098 153740 150077 90028 38665 34283 70112 80011 91520
13547 91520 69829 48526 -35906 22471 80429 35855 22099 -8084 -79255 -66568 -74362 -37057
13535 -37057 -7705 35769 40450 18124 29068 69470 81901 37351 5040 -5800 70643 65865
13523 65865 46192 16254 23319 45878 87550 94847 84769 150220 95199 67670 108056 148583
13511 148583 139439 130311 64039 -59630 -70399 -21067 43731 34476 -18111 -36017 -2063 -15898
13499 -15898 -35833 -1682 -14186 -31922 -30148 -11554 4485 -13905 -68773 -65761 -30042 -34517
13487 -34517 24850 46929 39762 22888 -6884 -30264 -99705 -155190 -146786 -72695 -9817 9366
13475 9366 10263 12452 -4272 16009 79341 68023 39268 53683 100303 185255 152181 118493
13463 118493 89513 42869 79197 57574 50279 114198 126960 36777 -22046 16149 95987 104425
13451 104425 107044 137271 120181 58252 -14785 -25368 -3086 53531 113404 130237 136140 88737
13439 88737 50280 -1303 20942 31391 78964 65757 4101 11965 -13359 -5364 30185 22103
13427 22103 -1993 -63711 -67913 -44032 130 -6347 8811 -5796 -999 -51677 -32891 -35239
13415 -35239 -39290 -32520 -8283 92791 99567 88368 84587 44227 4882 -481 22640 70527
13403 70527 61261 94227 91987 22725 26314 5589 -23793 -22408 21741 56319 77103 18994
13391 18994 -61532 -61614 -21433 -23576 -933 40561 53183 30946 6216 -24317 -42170 -18996
13379 -18996 30017 55215 -2081 -28623 -49212 -25815 -2286 9698 -747 36461 45078 49659
13367 49659 35402 31384 9730 36154 86266 80327 94468 126979 124436 66489 12729 -2366
13355 -2366 -2255 29324 87229 63275 36465 17976 -7622 21824 97495 106012 114581 76171 18174
13342 18174 30351 93520 71590 32072 13046 17356 -88704 -164161 -162187 -165040 -129230 -137233
13330 -137233 -132431 -81335 -6585 12802 2552 18687 1020 -14911 30478 66222 13482 -58720
13318 -58720 -47984 -37513 25104 93970 84457 73444 1472 -112359 -87815 -52001 -31710 -11375
13306 -11375 -17520 4213 42489 63421 57930 80287 48571 45351 73722 86591 112134 131866
13294 131866 67268 46991 68663 26772 -33185 -60481 -54164 -46911 -12349 46751 953 -39079
13282 -39079 -42862 -47007 -65728 -54755 -55329 -20011 39970 15144 -15790 22112 88986 106875
13270 106875 99428 97389 79578 53042 16010 9904 53938 79271 64801 56669 44008 30728
13258 30728 21501 10107 -19029 -38825 13743 38235 55495 93557 175787 161787 66615 25226
13246 25226 74221 118354 87475 81123 123328 135524 44502 -14358 2371 8451 -50856 -36396
13234 -36396 27537 18477 11712 1435 -21646 -12378 -28585 -9765 -30142 -19430 227 422 -54756
13221 -54756 -15191 -1163 -26442 -15013 34707 -365 13135 -11503 -10454 12650 67404 12384
13209 12384 -582 5921 -21817 17915 44493 30500 -19197 -36136 8008 36856 102268 100890
13197 100890 101030 107333 44206 -25588 -4414 60645 59508 57685 89534 77177 13084 42158
13185 42158 84809 8440 2445 10114 56686 87568 64121 18690 2123 -34777 -16289 -53381
13173 -53381 -97882 -83319 -71351 -78546 -95110 -75084 -69512 -1010 -3053 -60994 -24490 -8216
13161 -8216 -37895 -62136 -68238 -88722 -71654 -27574 -48488 -29696 14778 45949 76341 104598
13149 104598 61235 89608 107776 88968 31452 -1106 -37384 -27615 29026 15125 52098 45206
13137 45206 22435 37002 90605 107625 100359 49760 38811 -8678 -22478 -3408 48536 118538
13125 118538 118729 66240 60064 27501 47943 37859 3829 14776 65420 120881 175074 186514
13113 186514 107669 85343 46989 26313 28890 19420 -18166 -36468 -55892 12297 46366 73021
13101 73021 59138 -5493 -48733 35779 88038 43927 40719 71711 56052 15505 -21030 -25711
13089 -25711 10861 -10808 -86474 -65253 -4378 59161 48782 13482 36276 95126 123851 167095
13077 167095 198180 124278 74696 93854 75783 79893 53530 83559 77446 1527 -29720 -45096
13065 -45096 -48949 -28063 3833 90718 116047 136457 103628 150930 102531 59789 11915 -63718
13053 -63718 -51387 -34827 -18079 77152 82815 3990 -75028 -63847 -37882 -34468 -17925 -16900
13041 -16900 -23215 -1075 29641 38586 127774 218421 276349 309089 374042 456958 465644 424167
13029 424167 322959 171427 123522 69119 26178 36421 18153 -12992 -15230 61201 57139
13018 57139 54429 50230 11751 38616 88804 35264 52852 78147 88835 87419 94177 67729
13006 67729 64830 82304 98690 42543 35542 21196 -49932 -95021 7858 24478 15339 63404
12994 63404 45233 95017 149908 162157 221480 370491 431305 424937 367026 327722 287693 244512
12982 244512 167913 104300 79749 75481 83935 84637 59649 60110 7690 29789 1150 -63575 -93160
12969 -93160 -59680 -38287 6640 19599 18560 19824 -30717 -15591 -65427 -93320 -86863 -52420
12957 -52420 -95685 -86379 -43170 35408 -11216 -63899 -42380 17103 31474 29285 47250 132915
12945 132915 120839 116407 114858 131037 119955 119628 91913 38961 55263 81429 69853 -17887
12933 -17887 -5819 36126 80707 66798 -32740 -15348 21401 55126 45721 75890 88042 57411
12921 57411 57505 44552 70850 21851 17239 -44048 -70792 -54340 -54767 -36694 1052 12860 -10320
12908 -10320 31408 47400 25237 15045 -8444 -29296 -44091 -47309 -79762 -106267 -109931 -116193
12896 -116193 -99594 -45833 19057 -3259 -29226 9063 25819 36287 37003 38439 -4361 -40930
12884 -40930 -23646 -22393 -16739 -17229 -8073 -29409 43077 41079 15412 5692 2141 -24912 4792
12871 4792 6555 -37322 -34451 7633 -24471 -18417 10804 -25377 -39813 -2384 10087 41519
12859 41519 81812 99544 45581 -8811 -36 7188 -20487 -84414 -96421 -62109 -37868 -67951
12847 -67951 -81237 -49612 -25119 -35547 13854 68913 77728 83739 14018 3292 -5597 -31111
12835 -31111 -2407 25852 66297 60932 26815 68704 51041 5228 -49862 -69447 16065 98744
12823 98744 50308 -27149 -50086 -41768 -47853 -87927 -78417 -46124 -31703 4651 -18808 -83013
12811 -83013 -44324 -72032 -39522 -1628 -49796 -44895 -50781 -26849 -13320 31195 69317 33686
12799 33686 -13783 -41913 -22783 -54582 -61029 -91757 -38400 -7516 -39018 138 9255 -20272
12787 -20272 10838 39140 -22461 -56510 21223 73585 76882 37354 29320 55416 8393 48571
12775 48571 98419 93226 70657 26676 -20624 390 -3677 -14491 -20875 -2559 12366 24305
12763 24305 73116 29688 7795 31142 -9922 -16670 -14337 -8061 -12401 -6158 50392 78483 52264
12750 52264 61767 46667 23459 71218 25402 -56855 -44224 -46480 -3313 47447 46988 17362
12738 17362 11329 -19109 41587 74943 35369 -8880 -44901 -6548 11388 -49742 -122500 -47045
12726 -47045 48551 78198 39203 21489 48151 12083 -26199 55555 39550 -7137 -10985 -15135
12714 -15135 29042 61689 -1122 -41047 6949 4311 -16577 -45998 -74391 -54703 -41090 -68293
12702 -68293 -93748 -22177 -2327 -57173 -70753 -100156 -58667 -29965 -4235 7946 -23058 -726
12690 -726 21758 24332 36294 62881 36534 14689 19684 50528 80269 84108 62819 19894 46586
12677 46586 61885 47413 -21235 -33559 -65010 -53128 20520 40481 41315 8921 -7175 38608
12665 38608 51620 -15742 -26757 -8823 -5700 -14548 20102 1909 -30960 -33556 -33756 -5417 42769
12652 42769 82926 66171 64941 83663 35227 -8425 -54390 -34395 -61396 -25856 -48771 -45588
12640 -45588 -40275 17486 83075 5802 -100297 -109136 -76916 -52813 -49634 -61556 -52474 -28072
12628 -28072 21407 14532 -12590 -40827 18448 57575 91612 35622 -17193 -8285 25579 20713
12616 20713 44485 58786 77794 57981 62205 93420 89091 32768 17166 20411 7722 -20418
12604 -20418 -22121 -2950 11074 83225 36407 17015 39970 52837 61894 42627 49546 88799
12592 88799 75079 52315 27401 90741 113767 51424 9570 -17457 19398 41297 35468 -2563
12580 -2563 35667 -4620 -6556 18095 -7844 -3231 28786 26865 -179 -19929 -39969 -36903 -52940
12567 -52940 -76034 -62631 -17638 36649 28402 70553 95746 116316 123295 65999 24139 45929
12555 45929 46024 6688 -14653 -50645 -82257 -92077 -79757 -19298 -4504 703 22475 4444 18804
12542 18804 11442 28602 26843 34899 27795 -13389 -29617 -3751 57642 95891 67305 57672 39170
12529 39170 34035 30919 24579 16551 -31562 -83545 -60772 -1406 -29188 -53119 -33842 -41771 -13386
12516 -13386 15997 58633 41041 -33157 -51914 -24029 -47868 -56928 -26793 -6724 -20119 -17136
12504 -17136 -11805 27441 32322 33544 58307 32494 41651 72583 47222 26555 -5199 -29947
12492 -29947 -32292 -34937 32045 79837 62791 -6539 -51337 26423 31565 24108 -42062 -17821
12480 -17821 -6710 -1129 19677 31975 9074 85939 104276 65000 -7188 -10813 1862 24996
12468 24996 40033 66651 40094 37714 84842 70712 11064 -16404 -22165 -5024 47113 19952
12456 19952 -6512 9821 -13405 -41489 -55011 6770 24544 -20146 30059 99171 60251 -22702
12444 -22702 -45450 -411 9350 47636 67103 76939 78180 87757 104940 86555 105949 104990 72423
12431 72423 66082 92829 113094 93251 89844 53533 60274 63400 16504 26223 61955 65970 36163
12418 36163 5068 -21158 -3063 14335 39503 65258 37538 24015 19134 18841 17710 22461 -5958
12405 -5958 -7830 8984 26727 33536 -687 -47325 -75738 -29578 83094 102560 72481 53821
12393 53821 59991 145861 71876 14336 -28815 -52749 -48810 -7975 13251 -33841 -17992 -2338
12381 -2338 16283 56040 87779 82108 57158 37445 42187 21991 13603 -12248 8086 8290 -10164
12368 -10164 -22910 -36928 -31728 -27245 -55157 -4460 -8808 -32351 -57764 -29036 15556 36828
12356 36828 9874 -10684 -4285 30229 71096 81906 44754 30208 -20760 -26842 -22455 -18018
12344 -18018 -8507 -1517 -15116 -21642 -55247 -56843 -10978 3372 -39205 -58036 -24561 -58850
12332 -58850 -57495 -1255 -6820 19898 430 -58551 -32934 1189 23788 48023 51495 51889 56927
12319 56927 35603 -28667 11041 9346 18076 9767 29215 24650 63748 113264 153022 156806 168737
12306 168737 175207 152164 148345 119705 89908 88933 31817 18450 40753 109110 93295 67703
12294 67703 83474 41028 9524 46045 81134 46461 -44825 -44692 -52429 -47488 -59562 -37820
12282 -37820 -5070 1080 14773 8854 7454 -30742 -57009 -101610 -106923 -118682 -40608 20146
12270 20146 72049 97164 61408 27496 41617 66482 41335 63307 103290 92149 58500 46254
12258 46254 33287 53980 77792 51543 61411 59268 39190 13994 33614 21947 -53310 -73045
12246 -73045 -111841 -147657 -132830 -145124 -137933 -109607 -72464 -6514 45169 41336 115052 91894
12234 91894 117063 124781 88241 71593 130924 94731 73744 71138 66132 46774 -11297 -3266
12222 -3266 46069 72649 7027 4725 23467 24893 18174 7347 -10126 22968 30338 74265 101509
12209 101509 125514 158462 119249 100874 136209 205484 181550 158767 134006 69981 65801 85794
12197 85794 133708 168680 253623 339375 389083 437093 440782 424460 401889 462985 518819 611324
12185 611324 642078 577076 466378 389799 369461 345611 277846 248391 279531 288186 275406
12174 275406 263317 211317 200562 209791 203102 239686 197478 186865 180570 210550 219580 182451
12162 182451 124546 73026 111525 165594 172204 208727 169212 181295 231771 223683 235709 240609
12150 240609 197553 158061 154665 94786 110636 87905 104359 136202 120940 146280 187748 189483
12138 189483 194286 207517 145464 115261 128410 178754 238875 250956 218764 281253 329783 305303
12126 305303 303709 368366 349909 319246 380154 391366 337914 284384 232083 239532 305359 324969
12114 324969 295595 305170 251816 220555 263544 328852 327224 257403 261691 305467 273581 290103
12102 290103 340232 309009 245417 266397 273827 246087 297893 325642 300189 327468 363608 311141
12090 311141 334582 365910 378328 395322 438695 381910 356369 321215 298244 287249 319568
12079 319568 323414 359944 388413 437643 469142 478063 506696 578849 592180 520291 528219 564057
12067 564057 567108 547858 522519 576496 657854 725422 751191 847005 878051 894868 787767
12056 787767 662501 603751 562695 498680 479668 513784 551758 524675 436206 373290 395930
12045 395930 361063 384874 446731 459239 464588 473498 481088 485930 535375 564519 607883 657186
12033 657186 629577 570350 628124 585480 628524 677323 676707 636292 661090 644802 606091 571498
12021 571498 588770 640818 622620 630137 666821 761559 810044 799923 822807 796429 807103 877415
12009 877415 946138 1011373 1010930 998618 1068343 1124515 1174705 1170190 1201749 1254084 1273509 1357440
11997 1357440 1373780 1415538 1434394 1433251 1366367 1387928 1456723 1535341 1605212 1665242 1728205
11986 1728205 1811304 1875266 1955805 2033304 2092803 2153942 2229123 2345259 2484285 2645111 2774461
11975 2774461 2963411 3119322 3290428 3498869 3705862 3870798 4095025 4328291 4568563
11966 4568563 4828966 5094196 5439434 5752866 6065535 6469732 6930378 7378765 7960331
11957 7960331 8707853 9617980 10656632 11844259 13191311 14638911 16289043 18147160
11949 18147160 20444990 23381793 27208159 32146781 38693876 47602937 60251280 78733741
11941 78733741 105794550 143267029 189827576 241010620 293915371 350492805 412922383
11934 412922383 474009229 519388616 521411725 457311815 363081552 276728748 210665280
11927 210665280 163267973 129354245 104419418 85291274 70398389 58801024 49655369
11920 49655369 42483926 36850886 32300567 28579758 25501912 22981052 20827231 19009123
11912 19009123 17481897 16188428 15090840 14111175 13258998 12453794 11637701 10946620 10357879
11903 10357879 9790599 9314884 8804110 8290603 7882024 7589229 7237502 6928263 6605843
11894 6605843 6319299 6062914 5842106 5616938 5374628 5145180 4934120 4781102 4650178
11885 4650178 4515168 4371480 4230625 4054956 3963751 3859965 3666625 3473451 3367113 3272497
11875 3272497 3209353 3169562 3070205 2920984 2862987 2755224 2631964 2502238 2438343 2360341
11865 2360341 2299827 2238576 2114786 2038603 1977568 1871600 1829011 1842271 1834082 1770132 1756692
11854 1756692 1707604 1579958 1466793 1388217 1411111 1430869 1399871 1406688 1369812 1355016 1338969
11843 1338969 1265555 1202490 1186803 1185224 1186572 1180976 1167587 1169132 1087948 1033137 1012046 997316
11831 997316 946623 900217 915014 910427 930145 919719 943349 879508 904244 841561 704432
11820 704432 644245 643657 686287 742631 717980 721844 737289 771148 875794 965902 987377 1027374
11808 1027374 1044535 1048221 1038007 1010038 1009472 973783 846375 657065 559477 511359 470491
11797 470491 428777 397024 357834 332366 370080 390327 462947 488816 464847 410808 432678
11786 432678 425655 374795 350246 314661 338013 348389 288231 329445 344325 352837 293076 254153
11774 254153 292579 304983 311338 304520 291899 298869 349238 302757 284388 273697 253682 212604
11762 212604 214824 205113 219139 197906 164470 167014 165381 233174 200944 154372 181306 132283
11750 132283 54704 85440 78663 102273 179850 160278 142998 163012 121205 24799 29779 41090
11738 41090 22732 41579 73566 43531 32745 22139 34898 43246 38996 81312 80420 75096 62569
11725 62569 91354 93528 161747 200570 176742 213817 206241 185097 209263 186531 129987 126490
11713 126490 176586 180529 124816 113042 105668 98542 122962 115036 51950 42911 12882 99589
11701 99589 85386 62502 24470 24850 -9961 1825 321 3629 24566 47505 70171 42802
11689 42802 18803 69777 100469 71269 51347 29954 90782 27219 8768 27995 64054 92266
11677 92266 123736 153088 176259 169520 194267 208179 151748 94468 56739 105814 125465 78993
11665 78993 46584 88982 155807 112724 106751 110536 72372 41111 -37464 -58302 -25890 -20435
11653 -20435 -2839 79141 116966 93385 70751 52486 53048 61302 127612 105354 57354 16890
11641 16890 -2149 42632 27188 820 -16532 -5628 -18340 -63619 -45898 -13090 -20270 -25004
11629 -25004 17137 93724 151484 200965 233638 270311 359877 379876 274028 204831 186602
11618 186602 202725 257019 282754 242018 165459 108993 126993 116242 81112 45576 15165
11607 15165 -5359 24132 39321 17341 9230 3618 -17438 15448 40421 56239 87361 77435
11595 77435 113884 164554 242442 271799 180705 133125 143046 115873 43784 64923 88618 153526
11583 153526 188134 136853 85149 -13110 10255 69624 98907 95561 11505 -12741 22789 80786
11571 80786 73232 62921 79244 91489 59777 57903 52614 47332 63552 118691 143405 121065
11559 121065 68478 61488 82526 93181 50463 11047 1168 -30989 19312 75403 113515 72785
11547 72785 56109 24450 67071 98660 20629 -11519 -39046 -52538 -54970 -51355 -44043 -21670
11535 -21670 35684 10106 46827 112008 85566 2619 3483 47413 77767 110297 92350 73753
11523 73753 67523 72253 85356 97277 152303 184601 174571 133867 70392 72853 92276 81357
11511 81357 43801 17228 -34272 22850 65095 64803 42537 8048 15359 -16902 -12710 -5726 -27731
11498 -27731 10292 29941 49440 -511 -85207 -18069 22359 -14608 -55615 -19017 9716 11385
11486 11385 26894 41189 48317 33899 72001 98003 15379 7544 37851 70699 59498 43909
11474 43909 7283 6698 58608 36387 16279 24660 73500 80942 96174 91187 15875 -3468 18130
11461 18130 -3820 38246 36024 4640 -7294 32261 2321 -26603 -5400 -56686 -111279 -115386
11449 -115386 -83247 -34118 -41274 -21260 23583 24348 -7192 2646 -7649 -17788 -38307 -45567
11437 -45567 -7243 35536 34500 43939 45993 -499 16538 -6734 -38512 25816 100569 112358
11425 112358 73724 38214 41364 3671 31676 55908 50067 16050 -9323 8650 46964 50333
11413 50333 75003 46370 -28297 -7114 1835 17730 20903 -2885 10791 -39733 -94654 -95384
11401 -95384 -52560 -65352 -57246 13057 64176 66132 82295 83261 81428 139922 76465 23492 51049
11388 51049 40166 17036 48127 72344 94758 107517 98784 52422 56072 109453 98470 42037
11376 42037 37991 84961 43432 -36350 -34671 -4171 4843 2212 11087 12498 -16229 19518 64784
11363 64784 82976 111305 134985 136226 76766 68135 75287 83397 80833 97810 83954 86352 40047
11350 40047 24827 24964 37264 14958 -24053 -73641 -71536 -32741 -18909 -64747 -82952 -25912
11338 -25912 -18312 -58531 -55980 -28548 -14957 -6273 -45624 -30581 -4125 19810 50516 74223
11326 74223 137571 121640 92192 83099 41425 45063 58138 51025 86045 162629 122021 39310
11314 39310 -47022 -43663 35600 100554 124229 98644 104382 196128 179049 153107 115173 152352
11302 152352 150764 79031 86182 148391 118616 77580 49905 66635 55460 74327 75292 32621
11290 32621 65505 45464 -38043 -32722 -47816 -41388 -28147 11686 52388 33534 -47123 -130038
11278 -130038 -125188 -37177 -39702 -560 40281 -557 -68192 -108715 -85432 -15865 37898 30173
11266 30173 27934 40543 27380 32927 13937 43555 -4685 -102221 -81269 -42871 -50798 -56253
11254 -56253 -111480 -104575 -55833 -15021 15432 43715 10785 23770 31069 19537 -60313 -126838
11242 -126838 -82272 -9394 -11630 14264 29973 -37218 -22514 -28565 -17043 -7520 -57263 -77367
11230 -77367 -31860 -3595 -44399 -83455 3961 12533 -74411 -156638 -140258 -66612 -25432 -29696
11218 -29696 24510 27400 -24315 -20736 -5625 -2764 19097 25395 63584 -4243 -45156 -52911 -40662
11205 -40662 2590 4790 41857 63950 69865 25966 51405 33325 54305 70825 51386 9432
11193 9432 -11127 -36151 -58389 -29954 5154 15510 -39325 -45841 -45647 -61840 -17729 19208
11181 19208 12080 13073 67319 74182 -1187 -32794 44162 43655 14671 -1977 -23373 -42299 -37022
11168 -37022 -93936 -121038 -101539 -68165 -16824 -30364 -5573 -6175 -47057 -63572 -106230 -56207
11156 -56207 14008 11707 -29734 20468 15955 20975 74166 80795 54229 27054 63583 87501
11144 87501 80474 76053 71123 35814 -16356 -3797 37706 77556 53767 34837 8648 -2234
11132 -2234 -6243 -7079 28617 23197 -12720 -3091 -29066 -69941 -124731 -62189 -51121 -29103 34794
11119 34794 26797 21538 72776 71372 43233 23687 -40506 -91068 -38068 -12033 -444 -1261 18694
11106 18694 12490 17477 36530 40192 85732 127162 177538 135401 64895 21992 -29104 -121808
11094 -121808 -51321 -9109 -26254 -17387 22356 5207 -62917 -49193 7662 29131 -43752 -50248
11082 -50248 -7836 74497 151937 124580 110670 151399 132057 88301 -4425 -14072 -9720 14316
11070 14316 53115 41379 37567 8736 70779 116551 83943 107363 56310 40062 -14216 -40039
11058 -40039 -289 41819 -4066 -53437 -48344 -8674 49025 47186 62475 67053 15909 48469
11046 48469 136024 185390 213946 220653 181960 150079 174715 145937 225769 277445 293873 360845
11034 360845 367540 359718 326478 306136 330566 384636 447502 466138 417822 453201 473405 491287
11022 491287 451830 433280 416204 331649 276522 294494 286399 316656 339498 307173 237681 261825
11010 261825 258240 276549 214186 173998 180648 186896 207151 209863 186987 197708 147689 124642
10998 124642 145366 174444 161536 133437 72914 114396 151990 97144 115538 61419 50881
10987 50881 67121 18254 7998 36054 78444 100743 39916 22691 46083 29366 39579 22589
10975 22589 61147 87857 79526 49750 57942 35621 22183 41976 68931 62525 89826 33912
10963 33912 -46059 -19860 -30270 -45143 -45400 41283 89992 110493 145524 145231 139073 142585 122069
10950 122069 136532 148412 162501 186703 204392 211044 214525 296707 363972 449249 522350 634821
10938 634821 754457 866000 950426 963567 879844 767716 657576 513668 466377 336543
10928 336543 253417 266009 249840 230819 114944 74575 125969 170030 165604 184255 151399
10917 151399 114996 108403 139011 167570 163362 138992 133755 127955 128705 147258 213033 240148 208315
10904 208315 125131 132715 99810 76523 142213 112481 83747 135596 167756 136335 58679 30856
10892 30856 60008 56358 61331 64385 51112 75909 110414 93641 123608 99554 103185 142608
10880 142608 135214 110257 122780 93217 93602 92774 142575 214965 215074 204924 149965 157190 126730
10867 126730 51047 32550 38575 33171 -26289 -13109 -21664 -39388 10154 119091 75100 65746
10855 65746 65538 83068 135873 90445 111901 109201 73664 50309 41019 7285 -3121 49364
10843 49364 14490 32357 70690 61918 -247 13132 44864 66365 101298 162386 79801 122470
10831 122470 129112 151699 138922 118986 99168 106905 117932 131685 104788 72667 39833 10792
10819 10792 16900 -27929 -2368 23554 16278 17470 48718 46313 68996 33848 81221 49971
10807 49971 77356 117523 134672 143876 71091 93268 92959 81167 99774 104455 151447 152172 205067
10794 205067 223464 216111 207078 172000 102709 127233 93758 135659 216297 190146 185699 229664
10782 229664 256837 334000 349818 237036 177941 196235 157253 148486 200705 190913 162061 132230
10770 132230 190015 247101 258029 215353 243082 192944 126211 61096 -9092 17860 39537
10759 39537 76451 111788 129310 168705 175698 60341 46934 -12334 -17251 -6656 24644 60051
10747 60051 -5859 10689 103008 142946 201805 239057 234969 192911 258745 341672 322404 288816
10735 288816 295068 280564 272176 267712 257360 236020 260788 293483 285367 261230 254287 291571
10723 291571 324708 299136 293863 286009 265293 268783 271152 244285 254971 293170 308600 300811
10711 300811 311688 313088 273948 252517 244193 228477 238746 235500 197050 176826 214662 207343
10699 207343 260308 233753 231710 160914 184670 305693 309072 258129 282669 327120 283068 263542
10687 263542 297894 365628 390063 331549 295039 291265 281275 293590 290185 333925 327220 355364
10675 355364 377569 356564 349824 396153 440476 382600 344981 356403 353293 384326 418940 468474
10663 468474 461304 502283 617934 647089 682437 742883 830504 840784 848928 906789 941222 900965
10651 900965 834803 802223 785533 800256 888556 917011 981867 981006 1018140 1061028 1116796 1210991
10639 1210991 1317427 1404127 1458252 1530236 1705766 1917264 2085836 2310373 2539482 2797972
10629 2797972 3188834 3664952 4259892 5120367 6241605 7722844 9452971 11444723 13692578
10620 13692578 16081408 18677825 21189518 23238921 24564655 25155426 25459788 26091855
10612 26091855 27353648 29519640 32404324 35818492 39828199 44205079 48300375 51352530
10604 51352530 52387845 51372186 49390402 47884293 47859247 49396487 52187662 55939955
10596 55939955 60365563 65044927 69060370 71091389 69855418 65385244 59566611 54354639
10588 54354639 50731883 48892871 48456723 49054449 50323011 51832469 52811404 52423552 49828238
10579 49828238 45261856 40080095 35453451 32007134 29755344 28365205 27618106 27284925
10571 27284925 27091339 26606645 25502662 23579340 20835814 17879880 15206637 12961654
10563 12961654 11159985 9873814 8978456 8257836 7686209 7309672 7058187 6986882 7020137
10554 7020137 7129328 7223517 7397680 7674549 8115386 8640338 9123531 9505292 9903351 10539076
10544 10539076 11425628 12543041 14060616 16096586 18842694 22535996 27612496 34760786
10536 34760786 44842809 58650725 76206181 95903024 116354097 137733197 161289892
10529 161289892 184010722 200176880 203104643 181008844 146357945 113984242 88659293
10522 88659293 69898507 56148540 46022533 38205351 31974873 26936133 22909766 19677499
10514 19677499 17146998 15104830 13465174 12134980 11066688 10280696 9612405 8972278
10506 8972278 8468779 8057746 7641953 7071354 6486350 6002850 5627088 5269623 4925393
10497 4925393 4600743 4261385 3970565 3784798 3617110 3511732 3432386 3278846 3135651 3026129
10487 3026129 2888151 2765184 2689803 2621315 2517286 2398912 2334119 2380852 2391464 2335188
10477 2335188 2219733 2120891 2045561 1923372 1818213 1789677 1747338 1629421 1525885 1474806
10467 1474806 1476242 1472085 1455383 1416820 1340204 1264595 1229243 1230737 1230119 1180224 1130918 1109568
10455 1109568 1105605 1076885 989330 978613 913713 794044 773198 780246 789290 761648 771182 735633
10443 735633 752884 785339 765826 685218 637512 649126 653308 703917 672115 652167 685739 679506
10431 679506 616534 579366 553325 511621 523901 530873 436585 419240 411943 394341 391303 419184
10419 419184 428718 320303 302341 383781 358256 295870 276847 298636 380110 424989 425733 414695
10407 414695 403639 348484 339155 359964 445710 515790 534616 555170 580144 515508 479101 432296
10395 432296 329560 331555 351018 300731 261887 309310 334790 306196 312769 304541 286842 290973
10383 290973 384533 376256 247237 196245 147819 103684 99177 91028 96591 136399 147670 160313
10371 160313 172963 156167 209014 213962 157864 91730 48523 107187 222372 226392 176128 191593
10359 191593 227360 239403 248643 261047 239008 150658 56368 67515 126790 116116 48321 39533
10347 39533 49323 76040 93241 53083 85937 74965 92159 86636 67674 55378 36159 53419
10335 53419 70141 40022 47979 73538 74354 59076 64705 73250 53730 74528 111696 109416 74171
10322 74171 81121 84084 67587 71549 53914 6231 -10224 18369 47888 108282 140289 156490
10310 156490 121496 60466 79873 100300 57904 21602 -2913 32525 56823 56268 103985 144256
10298 144256 58593 4243 -7910 7698 55112 106993 112015 93489 76777 74226 74383 59086
10286 59086 61015 62380 50823 20162 73342 100200 77867 35672 28415 22723 100373 106698 103321
10273 103321 96183 149349 170878 117191 63887 26634 7067 19147 43915 80917 112540 135376
10261 135376 120895 140732 155082 206344 212880 165227 122244 127636 132097 68345 63673 83383
10249 83383 53118 86681 90125 72743 40464 37928 90167 110664 117029 77912 26047 -3428
10237 -3428 -44581 -77840 -116201 -92535 -87348 -17750 22733 57025 96253 29253 20207 -18294
10225 -18294 12370 14437 21261 40904 36004 143566 247046 243968 199678 162471 148892 174123
10213 174123 132164 147838 125414 70659 70608 52460 40571 24010 61386 77052 -755 -4358
10201 -4358 32949 101360 167721 143789 47667 -24894 -38414 44796 84165 74389 108278 126763
10189 126763 83324 43754 55371 60730 78922 105356 132846 97081 129810 156874 151137 187943
10177 187943 204297 231663 230672 215824 238079 181534 174172 236761 222305 335958 417375 439878
10165 439878 439489 391452 345860 291542 304225 269315 340236 365833 446584 493108 468751 379662
10153 379662 299919 250433 305529 332459 352975 295372 286905 343603 310240 305626 325922 310856
10141 310856 295250 274207 227531 182767 177343 212592 262128 276627 252623 230062 234710 219893
10129 219893 185930 213858 247746 221633 206295 233943 283682 338360 431953 571251 684710
10118 684710 807593 842704 902994 997214 1019296 1004217 821812 591778 470888 439485 414790
10107 414790 285903 242022 194592 200564 189975 139623 89384 132600 148786 143102 137700 85592
10095 85592 69465 -7775 -59422 -57150 3010 -22245 -10522 36535 33812 35698 49154 60728
10083 60728 98768 125463 115068 63757 58387 60039 96689 102169 77995 46995 15994 -3656
10071 -3656 10327 17107 34392 21647 65646 42530 100791 160289 115217 113230 115836 102745
10059 102745 108638 122195 114849 65303 14907 -4981 7223 -4653 13482 72669 86723 113420
10047 113420 120705 26727 -10171 3090 4275 33422 16188 -11277 -65425 -22224 10652 -13143
10035 -13143 -40840 -88477 -97145 -68862 -2307 32662 27840 50293 53592 75622 41556 181
10023 181 -35638 -56560 -37354 -1239 61204 92856 88743 124474 130358 141575 70244 -34507
10011 -34507 -67236 -21305 4202 -8845 -46727 -31365 -35164 -11483 24975 16287 -18536 11567
9999 11567 46897 43976 46635 43780 41773 -36367 -46543 -1267 26777 77072 97558 111812 92621
9986 92621 77673 90464 110351 56016 -3726 49481 68906 39653 121292 127026 68625 86413
9974 86413 120698 109772 128903 124444 162617 161203 164234 138603 177772 197222 238527 228502
9962 228502 245412 254936 245005 199558 190227 222392 230752 255028 228142 189387 162443 186123
9950 186123 211637 178885 151678 115167 88469 84308 66214 -3972 26815 51915 102976 180757
9938 180757 193652 140677 49752 -32555 9791 51758 99808 47034 15450 47660 106481 142515
9926 142515 112887 145036 154445 59667 12186 -51830 -9589 44636 67195 124544 155934 169001
9914 169001 137815 145406 155504 136800 130041 117176 127003 131910 115280 106827 134157 223889 266509
9901 266509 289737 321446 281711 226338 213376 312869 344306 305525 280393 278094 264037 212482
9889 212482 152431 156768 142450 96690 81901 54611 2089 2187 70009 72247 49151 14952 23910
9876 23910 68165 98765 111368 98770 83019 81041 41014 44103 42226 5393 -10540 -12414 65350
9863 65350 71371 70572 81332 -9767 -51229 -13755 40056 62120 64163 94341 121534 122377 83777
9850 83777 24363 48369 57065 37021 57195 110779 67922 74356 118200 183482 159077 122592
9838 122592 202288 208823 169830 164550 128310 91268 106433 146558 172782 207463 210486 130290
9826 130290 96025 57063 72791 55571 17287 -36315 -51517 -14700 31587 68570 63894 19035
9814 19035 -76391 -71275 -18218 24508 -8130 -58748 -12533 24454 52418 31303 19489 -2056
9802 -2056 2630 47573 10523 -6047 14815 76367 89589 85871 52668 28905 68639 171865
9790 171865 199384 303111 487736 685996 833092 1016970 1218099 1468348 1773141 1853221
9780 1853221 1643690 1263158 902131 636853 475249 391014 365331 316834 219416 195568
9770 195568 164360 140425 95243 62816 73237 18306 -22 41962 -4277 -37233 -29180 19872
9758 19872 62929 -14498 -34767 9140 47642 121592 84616 47487 53952 65600 78118 69282
9746 69282 58759 65378 88004 87226 94536 102531 109813 114018 93044 98522 93551 59872 13707 19964
9732 19964 34182 18311 -4614 -65127 -19407 -20442 26278 70208 31275 -14415 27329 -22467
9720 -22467 -54437 -18140 -45048 -49562 -10376 -28185 -36239 -65952 -120445 -112291 -112672 -90293 -45962
9707 -45962 -24390 -5261 -6009 -38252 -44475 -65489 -52553 -26889 34136 26304 46874 -35452 -82414
9694 -82414 -68875 -70797 -71137 -54764 -57158 -97714 -75660 -84801 -51427 -11401 -18185 6391 -9548
9681 -9548 -5542 -23124 -49972 -5137 -1042 53748 92846 101177 58886 -30127 -60893 -10191 4321
9668 4321 38898 88255 67059 -1956 35748 59796 104297 176866 235246 279736 290453 286962
9656 286962 358601 399787 442037 403466 332439 218706 122617 73331 74943 103302 95709 73774
9644 73774 25205 20085 -2504 -8879 -37302 -8751 61128 57549 51829 57776 91038 89536 92642
9631 92642 46145 -2957 33766 45639 23165 41861 -31109 -3285 25179 33730 24837 -1634
9619 -1634 -35239 28218 82789 65474 46710 46897 25045 56438 48509 37294 56170 45612 32932
9606 32932 -6224 4235 53868 14067 -6396 -37473 17637 48904 -30683 -33603 -28309 31168
9594 31168 64894 103454 131491 128387 12029 -64474 -28156 51539 27495 27431 67216 49351
9582 49351 46597 17782 -20688 -49632 -89132 -122818 -99143 -83155 -38887 -31917 -15151 -47518
9570 -47518 -59316 -47404 -94853 -53672 9122 19299 61861 90416 111388 67925 93267 129045
9558 129045 101127 24853 -1402 37981 67301 36522 37416 71934 64859 -8089 -20208 -35537
9546 -35537 -24342 19988 20173 -5529 -46124 -57976 -61997 6973 23604 29027 -5485 -32054 -22721
9533 -22721 -46073 -45847 -45389 -45037 -16713 6180 -10098 -53891 -89476 -70407 -54448 -36901 -10186
9520 -10186 18923 49858 1481 -25588 -19889 -69967 -85675 -56580 48300 108690 87595 58518
9508 58518 29694 13074 30295 45650 56455 53024 45018 73051 104642 139322 135844 65320
9496 65320 61266 58155 14690 -27475 -25016 -20898 -88297 -89550 -14301 31121 28175 43621 5567
9483 5567 -48475 -82729 -66030 -48277 -88022 -64609 26567 46129 13076 -67797 -72419 -28076
9471 -28076 -38266 -21366 33312 73031 40687 56186 64483 25343 17458 27607 62722 140941
9459 140941 128899 38914 21212 66978 90679 109690 65670 55957 47575 60315 33406 -402
9447 -402 -33453 31485 37352 -13063 -21143 -52049 -50502 -25965 -25817 34511 3927 5411 33392
9434 33392 49812 91155 90824 29889 19720 -652 9605 62526 117868 77528 56087 65803
9422 65803 48117 -17861 -27914 -63264 -71513 -17050 25423 69731 106150 123635 143409 163885
9410 163885 143559 111628 150771 115136 62342 57247 130480 102242 119028 121293 127939 79105
9398 79105 7087 3485 29385 35633 5540 -37745 -55181 3287 -25555 -4184 -38013 -38071 -61356
9385 -61356 -27354 43552 9730 -46218 -66140 -30350 -68247 -13447 -36349 -51018 -24437 -46442
9373 -46442 -59825 -15466 -14830 -28007 24926 68328 45080 7961 -35441 -65080 -30238 13904
9361 13904 5704 -56957 -60527 -24300 -19407 -55116 -11239 24352 71823 132491 143585 120187
9349 120187 124928 81632 98178 111956 72382 108804 150053 123609 138133 98677 68355 11687
9337 11687 9362 76258 78315 30302 -101208 -123689 -95446 -46628 8422 45480 33342 -41380
9325 -41380 -64719 -15159 22670 36470 55041 13484 5971 27213 -8262 7229 -17954 -30705
9313 -30705 -35600 -86430 -69266 13181 23064 70506 47522 6575 -93531 -127620 -108367 -110346
9301 -110346 -54577 52554 46779 27093 -18580 2074 45707 50389 3952 -28849 -7520 53839
9289 53839 17903 3593 -17615 28204 63764 18667 -10713 24643 -19372 -72061 -31932 -45971
9277 -45971 -17759 47617 55676 28798 36452 73207 42907 -731 19667 45632 101798 106034
9265 106034 89157 79072 69990 53374 19301 7449 6100 -10279 -20318 -10194 2964 -2610
9253 -2610 -97887 -59449 -15870 -8267 -16071 -2267 -18872 4113 -9395 -22293 4613 47582
9241 47582 51043 28078 31049 71395 75877 66712 1033 -35628 -69324 -107734 -72765 -43291 -45902
9228 -45902 -84638 -98901 -61920 2187 48851 58423 39492 2927 5019 13960 16972 277 -26811
9215 -26811 -51157 -13489 -45304 -43060 -11405 -21361 23733 -3399 -26803 -57390 -26514 33184
9203 33184 18734 -4781 6390 -60423 -94987 -38996 16321 29132 51685 44082 63673 -24319
9191 -24319 -13319 44871 25423 34294 10969 -402 3015 -13277 -34951 -46654 -48966 -3819
9179 -3819 21098 -28394 -47118 -6874 -45630 -91838 -161487 -166786 -103653 -70585 -60216 -61604
9167 -61604 -37854 1866 -13441 -55952 -312 11244 -26436 -16391 7779 76728 45479 27020
9155 27020 -28753 4511 46999 24547 -7499 1219 53451 107213 80040 58146 43290 6742
9143 6742 -67280 -80806 -39981 -25274 -79126 -94528 -20011 30614 93228 86120 36437 80996
9131 80996 110774 41969 -48393 -84795 -45935 -54551 -83342 -113029 -92539 -82185 -61656 -49735
9119 -49735 -24515 -21148 27486 47829 44169 119635 99065 103354 99896 -4003 -43667 11940
9107 11940 17767 35992 58902 -36490 -46729 -22483 13803 21677 14744 10942 -7416 8964 10026
9094 10026 39043 46544 45293 57277 77436 52775 79546 87913 127499 92094 55607 47732 55461
9081 55461 83947 57248 -2242 -28157 -41843 3449 52971 67992 36742 2824 -6323 6189
9069 6189 33927 30138 34070 68652 74096 78364 47737 128980 138790 57432 33742 28093 14265
9056 14265 12361 -16649 -83846 -49476 -2673 -47149 -62804 -66823 -62882 -55457 -57694 -64995 -63779
9043 -63779 -18347 -32104 -44520 -50220 -27989 -37794 -16551 9159 45473 28270 82173 33955
9031 33955 13950 -4211 -27621 -8465 -12286 6393 35375 1754 -9008 -16370 -23897 -58258
9019 -58258 -42225 -43638 -48477 -61215 -68737 -61098 -59360 -66505 -69192 -25308 56571 72902 -41878
9006 -41878 11416 69314 1190 -18653 -22705 -68856 -72636 17796 18257 -17360 -41558 -70008 -94775
8993 -94775 -112474 -132319 -46347 -38954 -62738 -66858 3392 5737 21818 -5256 -30442 -2966
8981 -2966 11069 24347 13546 -18694 36926 92664 130395 36892 -13543 568 -47439 -47972
8969 -47972 -78586 -70854 -30729 32353 51544 -30326 -39080 21466 45461 -6559 -11084 -21454
8957 -21454 2062 44400 50083 76876 69823 22773 -46544 -24601 5979 56035 31130 -7015
8945 -7015 -20134 -55538 -50831 -64388 -97007 -86295 -1171 29335 5497 31909 8806 -10381
8933 -10381 -6129 -21224 -14845 -23210 -8446 12684 73768 87196 105149 86339 85611 36806 1588
8920 1588 -17543 42014 58019 25949 38504 41207 -4878 19756 -562 -33669 -32823 39681 64680
8907 64680 75715 80822 79907 62795 62954 64930 44881 95078 99684 36662 5079 13694 -31530
8894 -31530 -39696 -24232 -9259 -2746 -19284 7666 -5437 24517 76944 79489 102285 71679
8882 71679 35381 49845 57756 -19365 -52164 -30644 5582 86733 58369 -36191 -12934 75562
8870 75562 55372 63263 80076 114526 113867 84897 22001 2520 -22830 -6011 14167 18624 54577
8857 54577 100453 87486 11776 -25838 -41007 -55218 -48008 -21809 -9891 -38214 -2191 -20314
8845 -20314 -4754 122572 150120 128321 42287 503 1524 9565 33193 18513 -18644 -34021
8833 -34021 -18935 -6691 -24039 4129 23021 14780 -28863 -62306 -34638 -3858 21869 55926
8821 55926 52703 40122 11422 60284 115412 86904 63487 45571 29548 -13766 -52710 -80831
8809 -80831 -97604 -43573 5207 38413 66692 63079 55308 27779 85845 53539 49500 47903 -7278
8796 -7278 -13848 -32791 15921 36226 7095 56748 68601 65862 37420 27240 35536 16539 32795
8783 32795 26372 4603 -25369 -59807 -3955 29792 15050 -8498 8556 -10084 -54391 -11911
8771 -11911 -16257 -80389 -90671 -3238 3813 24150 36070 42225 4222 -1063 37340 10525 -32727
8758 -32727 -16589 7193 40890 9160 -36608 -83622 -89984 -30558 -34698 -46644 46805 76490
8746 76490 80872 96735 129816 116765 60279 -2481 -1972 -6993 -17418 -10504 40525 138572 126421
8733 126421 59676 55343 42912 10507 -29754 -75341 -83499 -50198 7438 55135 65779 4456
8721 4456 4302 77655 98816 106851 123707 135241 167434 165521 110298 71610 21994 -12681 13979
8708 13979 -214 -20708 55630 67404 66801 29415 10610 -30855 -12989 -10945 -10109 46042 63167
8695 63167 76009 61353 28804 27921 44489 52173 58248 54327 17039 7200 13695 -2071 35060
8682 35060 58684 29003 -42996 -16959 -50524 -59718 -3615 10745 43743 21736 31907 44844
8670 44844 79858 114910 50209 93951 100249 117726 97748 93491 111668 95558 73881 9028
8658 9028 22084 10401 24139 32973 49929 66684 34439 -30854 -2811 -7031 -4719 18687 37207
8645 37207 82710 77593 89043 67674 61948 28369 42681 37238 58560 92121 69224 57688
8633 57688 55148 90026 109226 91976 92615 89152 57091 67282 29388 -32409 2963 917 -31412
8620 -31412 2536 17829 25517 22940 13669 -14805 33203 119137 141057 146528 115213 94114 16823
8607 16823 -34093 -79402 -94228 -46566 62486 74205 36123 42833 44188 -19918 -36541 70033
8595 70033 66616 32475 48216 19515 18552 33812 70204 51184 72371 110243 47359 47175 31927
8582 31927 -10515 -8241 7759 45034 67754 33768 -25929 -4532 61868 78724 86853 130789
8570 130789 94144 46513 21635 -57201 -68213 31393 65070 10804 -12221 8480 -8589 -1188
8558 -1188 30355 62043 134792 118460 89475 60065 21846 -863 -4379 23903 7968 16411
8546 16411 69198 30790 9591 69727 137305 166095 200125 290180 337477 363013 406501 497174
8534 497174 558728 462685 280321 154160 47534 60245 65872 83296 102841 102524 66504 12345
8522 12345 40832 3244 7526 59462 70740 25380 -24671 -16503 -35364 -9676 -9519 -18662 7581
8509 7581 95344 113202 87986 58761 95918 97658 77373 107321 124109 101615 77238 82473
8497 82473 160647 307937 377627 392243 507152 681034 893267 972846 1027588 840003 598152
8486 598152 427655 327016 302634 233153 182114 168182 231143 205269 117352 37662 9749
8475 9749 -4087 -31783 -21115 40937 53150 31581 -16905 55976 101143 79762 33831 9910
8463 9910 42145 92263 76231 128924 150171 118994 84976 59834 59587 117194 171133 158924
8451 158924 124231 165439 249132 336120 401634 412135 514086 517551 460620 325114 196796
8440 196796 205938 154302 121011 76333 93220 17894 16761 46355 19265 40140 -25343 -107134
8428 -107134 -110493 -67915 -36000 -33194 -3459 -14918 -28302 -13580 -5733 71482 55439 48995
8416 48995 14799 -41648 -32045 -44433 -23896 -653 22591 7196 70123 99249 38468 -16716
8404 -16716 -25033 5856 48117 21329 -28662 -38226 -31792 -36211 19987 47695 47986 43227 31128
8391 31128 34771 52253 52839 44820 53528 26482 -20477 -11875 21129 37478 48462 89724 105270
8378 105270 78600 28100 8649 -24992 -10244 18094 61590 20323 -3786 60390 75562 41830
8366 41830 -16864 -16347 67788 78944 45147 34144 -4464 55114 49466 36947 36197 38367 22331
8353 22331 -52765 -59231 12690 74482 134646 125219 132759 164557 171442 142012 155381 164760 141730
8340 141730 85948 13190 5478 10007 -76703 -70701 -24693 -43937 -24456 30803 9686 47975
8328 47975 172827 214442 162158 101002 101291 128352 126201 107359 42565 38650 -19688 -99972
8316 -99972 -49446 -14718 11353 -21037 26468 45611 -613 -39508 44954 123150 221800 172636
8304 172636 188807 206943 222746 262528 276285 190162 103105 72592 77623 79229 101188 121165
8292 121165 118899 85149 52603 -17392 -19273 -24122 -60439 -79501 -115594 -147462 -89898 -11470
8280 -11470 -7053 -61626 -53088 -36471 -48340 -38129 9295 6387 -52290 -57548 -29506 -8094 2586
8267 2586 -34166 -14527 14985 -6526 3192 19075 24745 42795 53203 34122 69069 97970
8255 97970 115756 102397 48626 22059 -5135 -10409 -3970 22691 20541 30360 54524 42769 18975
8242 18975 -21695 -14945 -33834 -49212 -69839 -59168 -20293 56763 73147 45563 61661 -5208
8230 -5208 22206 -1487 -57938 -22380 -10376 -29212 22123 54508 48269 47847 47729 43976 -3825
8217 -3825 -35191 -33726 -48034 8795 45982 47144 41959 53560 44275 50360 49780 69646 44566
8204 44566 -56687 -124022 -86662 -19570 2497 16891 60565 15256 -13844 -43859 -121680 -142523
8192 -142523 -90218 -51163 7401 43853 47334 30550 28047 2454 -4354 3470 -13796 -49927
8180 -49927 -85218 -125357 -98868 -91395 -66954 -68350 -42264 -65068 -28850 37693 44773 71052
8168 71052 75923 57595 44696 3256 8114 485 -23502 -30218 -37778 -50099 -309 46384 41728
8155 41728 44792 40681 9167 -3893 8855 25941 -8120 -46246 -39047 18702 -6632 6584
8143 6584 -12832 -18882 -19478 -53097 -69578 -61625 -59527 -14388 26411 22827 7666 -49221 -19262
8130 -19262 8102 -19325 -33713 -2789 -59967 -130494 -144333 -124427 -85636 -26669 4453 50769
8118 50769 52556 53081 21891 -35763 831 -10577 -31660 -41510 -8307 21685 -84575 -91517 -87331
8105 -87331 -66511 -46717 -78472 -68319 -25048 20612 23372 53435 62845 39613 17263 71865
8093 71865 86133 77209 92107 41683 -15294 24888 15975 7611 58365 53389 47612 53080 -10038
8080 -10038 11266 7026 -986 35510 -1834 -29167 -90697 -78865 13730 61235 73045 112962
8068 112962 112581 116000 118986 151726 45085 -4138 -3988 9277 40443 61661 28926 20766 -13702
8055 -13702 -15639 28811 47035 73222 61213 55318 22738 16736 -10115 -13225 30135 65421 66241
8042 66241 109127 120240 92781 32490 14725 21455 7724 -31593 11776 19801 12667 54982
8030 54982 59169 25985 18990 21332 66198 73627 103616 67706 -6237 -6100 -23323 -20877 40080
8017 40080 15103 -4483 30936 77520 68695 19547 -25947 -9156 -21351 75535 125343 74663
8005 74663 11946 -18 10105 15390 32158 64037 -3721 -21922 14423 24807 68794 91917
7993 91917 62319 73346 67882 17409 -24028 -57549 -33930 -9095 16404 64353 132991 142689
7981 142689 121256 75773 12375 19006 47916 31265 8571 23982 82538 108720 108091 138810
7969 138810 131702 159704 169469 117519 78473 38218 -74072 -44863 44368 68266 35920 24106
7957 24106 -7351 -22690 15618 49509 50371 19827 10487 -2974 17157 -30237 -53441 -10315
7945 -10315 16474 9933 -48167 -60083 -36174 -16498 48219 81530 23964 22809 24027 59069
7933 59069 79899 85209 113006 91442 67781 40807 53249 22493 100777 90751 31421 -11703
7921 -11703 7449 -24952 -77215 3513 52037 50524 -15500 -33875 12471 59900 52115 25430
7909 25430 34223 62358 103234 15301 -6332 -11878 71446 73680 53680 95766 92103 74895 41484
7896 41484 47978 49018 7522 -10898 -41027 -61050 -61563 28745 78996 82194 46898 -27719 -5821
7883 -5821 -13587 -26292 -22193 -44128 -85946 -53986 -6759 16912 39191 33684 21614 35627 43942
7870 43942 52910 39358 -3294 -77019 -128769 -145560 -69944 -8074 45593 11856 14515 17121
7858 17121 13310 10380 -22948 -64657 -92575 -71322 -73867 -119806 -77354 -42176 -57222 -109765
7846 -109765 -103452 -10956 57978 14351 -13552 -16620 -27139 -59809 -68741 -85694 -81902 -85336 -37174
7833 -37174 58567 82783 19561 32582 12472 -6010 34289 37388 -5097 19814 -8515 -88361
7821 -88361 -117083 -91276 -38940 -15437 -9164 5548 -86920 -172408 -107819 -61719 -35241 13718
7809 13718 30034 43894 26171 -12928 -33521 -70641 -12410 -7269 -90056 -147547 -76583 -15463
7797 -15463 -11255 -7245 -62810 -102221 -148119 -110312 -47264 33385 40731 9168 -6682 28894
7785 28894 -15132 -81647 -66493 2597 -42477 -53846 -9765 8474 13152 -27681 -67282 -83592
7773 -83592 -47165 -14399 9892 3029 13273 -13889 -87954 -67600 -36345 16813 40191 33174
7761 33174 52743 84639 75240 49766 43812 328 -5784 -8182 -19518 30554 62330 64974 73393
7748 73393 56203 98924 58402 22487 17122 -24426 -3973 44693 8599 15393 44232 -14283
7736 -14283 2155 8929 12969 82590 99828 7622 -33811 25868 21254 10738 30864 77741
7724 77741 94686 70752 12117 -16513 -47091 -27369 -27344 -54211 -38099 38199 34701 -53316 -111510
7711 -111510 -73798 -38166 -20141 -14389 -31921 -88037 -70964 -56633 3951 57229 31648 12017
7699 12017 -155 2958 -33251 -38166 13960 47465 14435 -70417 -90382 -71868 -66327 -57812 -25182
7686 -25182 12248 71285 63371 46298 36183 -1616 -22254 -28974 -57106 -5757 -32872 -125111
7674 -125111 -60330 -22460 6966 -45228 -46771 -52236 -79995 -46134 -69636 -71997 -61528 -86204
7662 -86204 -131333 -127556 -54070 -70563 -79842 -34625 17837 -4678 30336 50757 -1130 -25571
7650 -25571 21925 22526 18552 -12057 -19242 -30928 -25476 -4221 20036 36288 81671 114399 133091
7637 133091 52273 -1111 -3253 -32935 11576 78334 70246 -1407 -18094 -28983 -11409 16660
7625 16660 17076 43572 38180 14248 -13133 6453 66641 84122 36109 -5516 -16558 -85357
7613 -85357 -86495 -52541 -97612 -37437 -18228 -36776 -25378 2771 -45509 -52281 -13448 36467
7601 36467 26444 7181 -41334 -38126 5840 30666 103508 85207 -876 5097 26039 -21297
7589 -21297 -22764 -53681 -37599 -71492 -115142 -109264 -73906 -64741 -65825 -80772 -99000 -40497 10768
7576 10768 29450 57579 59129 31014 -15370 -7398 8748 53497 64096 33028 33944 50974 41488
7563 41488 53468 72662 79368 45548 23116 40919 -20896 -4061 28958 16052 -25026 -42407
7551 -42407 -96895 -71006 -21228 -22199 -16454 -10589 9318 -8358 -18570 -31899 -59311 -53075 -52821
7538 -52821 -34058 -4282 -11130 -10119 25042 22919 -78577 -156942 -114814 -48247 -66273 -118375
7526 -118375 -144135 -111908 -42747 14347 23376 48432 13883 -61101 -63210 -10386 67771 76298
7514 76298 79087 32424 13059 -29043 -97092 -144463 -115158 -106999 -35183 -59532 -29038 25190
7502 25190 67916 -19270 -81651 -56848 -12121 12348 -27804 -31591 -30936 10651 -3298 53400
7490 53400 18359 -34546 -24331 -40472 -18101 -9380 55358 55136 22022 1217 -51562 -20213
7478 -20213 -806 -29335 -41688 -28418 -70399 -91899 -55809 -26239 10267 14038 66233 91902
7466 91902 69729 85624 40684 74518 130416 108097 45214 -23517 -53279 -7728 29392 9769
7454 9769 11654 -45522 -92987 -74252 -58653 -57423 -4804 15583 6584 -59786 -101205 -101371 -38742
7441 -38742 -23178 -89028 -90221 -30565 -897 -26095 -39601 31644 61823 55573 70627 48997
7429 48997 21265 62685 22709 -35764 -56600 -77316 -25312 14786 17709 -67930 -129606 -81182
7417 -81182 -74585 -64574 -65512 -65570 -63706 -83301 -62031 -69185 -31995 42295 14542 -18559 -19943 -24043
7403 -24043 -4845 53353 77093 14600 -31234 -33620 -23467 33231 34532 68587 55887 72760
7391 72760 75159 26255 -39665 -56321 -41657 39544 30628 26942 15983 18170 -5949 -31292 -66677
7378 -66677 -101927 -62706 -34304 114 -5006 -20529 -52944 -22262 -21980 -9810 19751 31581
7366 31581 -2949 50387 95377 85659 -6987 14007 48433 24290 -34819 -31911 -46453 -59723
7354 -59723 -2904 33637 16913 7010 -22602 -24660 5922 28555 -20364 -22844 -23260 -12962 -45119
7341 -45119 -9319 19275 -10745 -20768 -62216 -50624 11164 -6737 58527 102031 60044 -13131
7329 -13131 10297 6220 15966 4897 405 27491 64020 109566 73360 55952 49629 56089 12964
7316 12964 -15130 -41194 -89438 -96158 -46551 -44541 -86878 -64615 -61076 -91609 -75872 -13492
7304 -13492 55556 13501 -41730 -21332 -67861 -65280 28914 56358 -8574 -55837 -52695 -41087
7292 -41087 -40754 -55504 31881 98062 71399 49967 45635 24235 -42990 -151464 -145377 -99954
7280 -99954 -58083 -32314 -1215 37379 57147 40312 3141 -17132 -75705 -106163 -74418 -39663
7268 -39663 -30350 -42166 -12095 29002 3798 4989 7754 8148 8899 -9777 -22781 -25586 -28390 -90636
7254 -90636 -118300 -126103 -76958 -105901 -87016 -59960 -22034 22714 24541 29186 -32310 -32447 -44181
7241 -44181 -101970 -109399 -97094 -39679 37127 64496 13992 49065 63230 46253 28460 27696
7229 27696 -8796 -15405 -30546 -54295 -43674 -72454 -72257 -61749 -58323 -3733 52549 50279 56141
7216 56141 64119 38358 19531 -2974 34889 -12193 -49042 -27211 -10842 -1069 29595 22000
7204 22000 17329 10366 4475 45085 99139 67293 -13591 -27973 21888 44 33582 24381 -68396
7191 -68396 -87530 -18600 17475 -26281 -48506 -55829 -31917 -50632 -53550 -25018 -30325 -71897
7179 -71897 -54128 -81552 -99429 7255 43606 -41839 -39987 -20484 58828 85041 132487 84115
7167 84115 32379 -9567 -7790 -3742 -3705 -14820 -12129 8701 62082 83312 60997 23637 -13065
7154 -13065 -43165 -13901 14787 -17719 -52987 -101855 -100288 -56193 -7172 114072 144261 89811
7142 89811 43678 -36946 -28473 20391 28071 30495 38753 30237 -17027 -14237 -56281 -14736 -2745
7129 -2745 -52780 -98174 -94991 -67102 -22660 -4725 -19079 -73362 -27877 2924 -52395 -54290
7117 -54290 34497 37037 13123 12361 -4967 -30643 -89246 -104792 -148574 -183148 -154331 -79028
7105 -79028 1337 42709 23546 6983 -38770 -26362 4533 -40700 -40354 -62408 -49302 -34030
7093 -34030 -29057 -72915 -54432 -34384 -50015 -73701 -59952 -65823 -70769 -38194 -60846 -8415
7081 -8415 18773 -3013 23569 29423 40766 20077 -12270 -66404 -20469 24268 -4416 -18395
7069 -18395 -35347 -61982 -96033 -93887 -54889 680 18219 -6252 4691 -2606 -34548 -30617
7057 -30617 39563 62911 12957 -42390 -63111 -44323 -55293 -105514 -187224 -157162 -78775 -71559
7045 -71559 -94260 -73474 -78626 -44105 5675 -5267 -82000 -80533 -19325 7125 -1746 -63235
7033 -63235 -69810 -72617 -67104 -70499 -106700 -128381 -95842 -78493 -40780 -6336 -65917 -78423 -95747
7020 -95747 -75410 -20069 19985 40145 13673 16610 30140 -7913 -35571 10329 38242 4019
7008 4019 2069 1672 36149 7536 -28805 -12428 -10231 -3464 799 14645 -17398 -65690 -71342
6995 -71342 -104756 -130250 -87962 -38837 -61017 -97422 -45546 26413 37874 -12978 -15715 -14339
6983 -14339 -37510 -45825 -79904 -95098 -20116 -1104 -8548 -32068 -17311 -7552 -28547 410
6971 410 -24769 13229 83092 27487 -20996 -4469 64450 -2805 -42981 -69962 -77782 -31603
6959 -31603 31107 -13071 10358 3647 -8176 -9652 -48605 -81717 -65075 -55910 -22131 45633
6947 45633 35878 27047 -3195 -35001 -44701 -68677 -70745 -28127 -62394 -76268 -37558 -51786 -74930
6934 -74930 -32607 -88814 -78485 12320 -2088 37843 34005 1904 1732 -3261 -105424 -174498
6922 -174498 -123642 -79115 -85997 -56170 -13624 -2366 33809 68423 55952 42243 21779 7518
6910 7518 -19123 -26039 -34999 -7206 -42463 15929 57286 31376 636 -57002 -82596 -132737
6898 -132737 -97131 -30153 -11555 -28896 -18609 4278 48704 40373 6262 -7620 29792 72109
6886 72109 16619 -17502 34266 124474 104315 54451 -12524 57 4990 9078 38742 56179
6874 56179 18750 40383 48216 50013 -16088 -26915 -61862 -109130 -109741 -111364 -50604 -13756 16130
6861 16130 9792 41357 10914 -11376 -30451 -23966 -17081 -60616 -46277 27761 45044 4474
6849 4474 -8558 -23935 -38148 -25256 -34026 -14308 49861 60707 53806 855 -17705 -24260 20170
6836 20170 37702 -29356 -38893 -69291 -64324 -77798 -45401 -6689 1875 -26949 -26533 -26566 -7783
6823 -7783 -25587 -25636 39564 -194 -12818 2539 34152 47337 60619 66668 64722 38641 60089
6810 60089 69264 66413 51580 -8175 3468 -25965 -67145 -80888 -5660 29942 2755 15237
6798 15237 -78589 -111264 -65353 -70131 -116548 -83936 3882 14996 1371 -20454 -30833 -7887
6786 -7887 -16852 -22250 18629 10787 2688 21842 19027 10360 55151 10887 -30036 -42673 -27621
6773 -27621 -37144 -44608 -31330 -2966 14991 70155 87235 103319 84652 93825 75268 54044
6761 54044 32014 62305 24073 -15341 15912 12066 -39338 -69428 -26136 161 52195 52486
6749 52486 -15639 -6447 75535 59335 -22019 -22743 -3871 40843 91610 38040 -5661 -28987
6737 -28987 -17886 -21962 -17805 18239 -5273 -43483 -6730 -12290 -44525 -52912 -27701 35306 25660
6724 25660 4386 6552 33099 52287 58349 47887 9180 3436 42371 8202 -92640 -131763
6712 -131763 -72376 -23103 -21588 -35 -32363 -57862 -30562 -28337 -56436 -59594 -113644 -114047 -61452
6699 -61452 37777 30207 33842 48269 29782 -4715 -7531 -61197 -58905 -30629 -35822 -24207 -20708
6686 -20708 -84164 -107105 -87491 -41781 -34120 -21991 7365 392 -70595 -68391 -37509 -31741 -82694
6673 -82694 -74049 -57229 -40228 -25284 -9888 1467 2365 8346 27701 45930 41098 138973 194294
6660 194294 177932 152253 70369 78935 56326 40479 24087 10470 10596 -35299 -48349 -20122
6648 -20122 -27606 5482 1068 -1218 -38189 -87632 -97339 -89277 -62654 -48489 7983 -24009 -45249
6635 -45249 25992 63192 55892 18444 -4270 -2895 -31434 -43985 8429 97420 132306 148807
6623 148807 100732 -21900 -135292 -135903 -65783 -7481 -27164 24103 17984 -17830 -48727 -11024
6611 -11024 17320 -32832 -135726 -132226 -42097 48591 105446 100251 74930 24569 -11929 36220
6599 36220 60831 5286 -17579 -22729 -63961 -54880 -63844 -993 -17706 -28973 -22652 -54167 -39923
6586 -39923 -29008 -9372 35703 41042 -39468 -71432 -1145 31607 11688 20149 15752 -8400
6574 -8400 17784 21730 -10211 -5372 -43140 -2742 27627 31583 -12531 -18076 -19742 11002 90178
6561 90178 93518 47676 -13852 9120 27052 64708 62676 52342 43167 -16632 -52245 -78332
6549 -78332 -102627 -4830 45209 -13863 -75110 -102718 -73264 -40366 13472 -8965 -30504 -38093
6537 -38093 51125 96488 113541 102374 107982 69324 66834 119710 108260 63172 10886 -37336
6525 -37336 -11773 3309 6813 14673 -49936 -67765 -5670 -17498 -7644 -11617 -2927 59921 13472
6512 13472 -30188 3384 17838 3481 48475 98198 85842 84249 39768 368 -37574 -32406
6500 -32406 -64203 -86487 -121638 -62182 -11513 -11827 -37746 -83166 -85472 -70508 -11484 -4504 9493
6487 9493 -1344 -57540 -7109 93 -28333 -29923 -32543 21740 105291 148724 128082 37082 -77230
6474 -77230 -106772 -92653 -97997 -79626 -66050 -51549 32855 -3894 -24732 -43893 -83516 -73232
6462 -73232 5025 -1478 29823 32936 16222 37564 19059 48356 71259 45457 68324 46110
6450 46110 42416 73235 99570 87919 32143 -8140 -53979 -55646 -18556 29286 43321 59559
6438 59559 22929 -4251 -37482 15390 65407 84428 43826 23123 -12274 -216 -41793 -44949
6426 -44949 1955 5207 -49971 -86688 -39663 13499 29281 -9008 -56463 -49843 -7602 60154
6414 60154 72681 -7794 2559 8635 1766 -19504 -20155 -12059 -449 -2363 -24045 6682 38376
6401 38376 2423 -46737 -53174 -57512 -19526 4268 -16825 15707 52773 63982 26544 -11987
6389 -11987 -23678 -23529 43216 39537 51531 20802 6417 -9009 -72352 -66635 -10790 -10529 14930
6376 14930 2552 59782 49510 24425 35528 -60 43713 75641 18562 -51917 -92078 -99719
6364 -99719 -95555 -14438 33799 35319 26790 38015 -4128 -30432 41871 82505 20132 -35403
6352 -35403 -36449 18226 -12859 -25577 -4047 -3296 -15140 -17581 -8846 -22305 -16601 -33545 6727
6339 6727 23500 9501 16366 54976 89802 111235 94607 26788 -16850 -4244 -10008 5140
6327 5140 -16432 -45898 14545 66892 10099 18879 11043 -15905 18979 60788 27960 15292
6315 15292 4516 -1418 -23245 -29367 -12393 -37628 -70654 -72849 -40871 -59828 -35433 -12992
6303 -12992 -33503 -11097 2886 26985 82810 52378 33553 -45939 -46476 -5830 -38151 -56764
6291 -56764 -113344 -75295 -45724 16973 40683 82961 37456 -35226 23791 50746 86082 42959
6279 42959 -27824 -85001 -51681 -57127 -66092 -31021 -20090 -26826 -41105 -40377 -57730 -79846 -101266
6266 -101266 -108343 -97793 -79958 -50121 -44889 -127895 -130941 -139329 -124612 -86076 -135241 -114770
6254 -114770 -65998 -83902 -56152 -13096 970 -2965 -16182 -31460 -14355 -16407 34093 66446
6242 66446 59828 96977 79556 -40413 -86177 -19619 19358 -1950 -2073 67344 120057 113249
6230 113249 98148 61896 29958 37866 53288 83273 102973 65557 34536 -6586 53003 85109
6218 85109 65186 -14193 -19329 -33878 -29000 24196 32431 -27658 -58394 -80346 -38854 -45387 -52270
6205 -52270 -10952 2833 -24730 2393 3242 7257 -22569 -23845 48627 68321 52034 71447 8684
6192 8684 -42059 41178 62238 63696 112692 114796 54171 64395 -1284 -2549 -1942 24394 -87975
6179 -87975 -156239 -95300 -33152 -74560 -26274 76961 126755 111062 68688 3835 -14252 11861
6167 11861 45928 17755 -31691 -29338 -23579 58336 50281 -24380 -58313 -20742 46176 20611
6155 20611 -46510 -51129 -75353 -127868 -122048 -82974 -51640 -40240 -47872 -34751 -120875 -97478
6143 -97478 -103722 -75913 -61746 18438 55820 17220 1668 50862 102812 122125 165133 172080
6131 172080 100350 59744 64447 46584 27439 -35821 -31141 69855 82848 26663 -32625 -31315
6119 -31315 -5307 54478 40606 74594 99188 41022 34776 50411 46635 48804 23569 -25280
6107 -25280 -71743 -91710 -17635 -40838 -64032 -54676 -18981 6892 -564 -61040 -114205 -60410
6095 -60410 -61722 -80901 -88273 -66037 -21755 13326 -10195 -48058 -15073 52886 37025 -18530
6083 -18530 -50671 -74536 -97227 -135187 -30030 -19295 -31273 -43581 -65633 -45018 -15889 13731
6071 13731 15203 -7187 -7338 -19729 -39133 18223 121406 73536 -44772 -144034 -115284 -18104
6059 -18104 19659 52361 72056 62484 25954 -4459 -40289 -78343 -56991 -65352 -79526 -93669
6047 -93669 -57255 -33913 -40916 11438 23529 15535 34515 54112 114195 102665 48731 -36186
6035 -36186 -107120 -93161 -78327 -34485 -22512 -41242 -72774 -78854 -52881 -26609 -37983 -67318
6023 -67318 -34194 -17837 10396 4510 -39191 -62146 -120515 -83725 6550 4619 -25629 10154
6011 10154 29063 -22647 -56375 -77665 -23834 -8483 22200 47737 11413 7879 52778 46797
5999 46797 -1709 -68326 -72975 -53372 -10166 20395 -9632 -14209 -50434 -82417 -80536 -85668 -89922
5986 -89922 -108016 -88906 -71248 -75099 -85489 -58409 -12478 21244 -1920 19687 11705 28439
5974 28439 119473 69327 -14660 -8840 -4805 -18649 -52383 -47009 -35153 -42469 -25948 -83373 -143404
5961 -143404 -150522 -93690 -46348 -40933 -100317 -129428 -97461 -49929 -39471 -42632 -127995 -145619
5949 -145619 -141483 -159884 -152429 -118562 -61963 -8727 -30563 -62151 -74670 -68772 -46677 -58952
5937 -58952 -2980 32021 19082 7440 -33421 -62045 -74265 -47788 -57031 -47221 -44848 -84278
5925 -84278 -47335 2449 3236 -4608 -35470 -69555 -37534 39505 38187 6748 -21428 -54495 -57515
5912 -57515 -27561 -29731 36140 33858 -29170 -83981 -50058 26999 1991 -61475 -71969 -65077
5900 -65077 -66415 -66293 -67580 -8563 34763 3712 -117 -67694 -118444 -88585 -67115 -67108 -63119 -91383
5886 -91383 -8844 36363 20937 -613 14885 -22677 -15026 -46877 -113736 -97219 -65820 -51397
5874 -51397 -18910 -14911 812 42151 42894 29621 35767 82711 97421 55039 17999 -45039 -102289
5861 -102289 -124170 -109648 -61150 -39809 -38354 -13368 -538 20744 3593 -668 -30888 -24551
5849 -24551 25496 44484 7789 -1718 -32927 -2596 -11932 -37976 -24283 -35004 -13868 -20478
5837 -20478 -25223 -6651 51709 63682 -12961 -49540 -36209 31676 73440 129539 51243 19479
5825 19479 79987 85664 71965 25558 -50968 -118294 -124253 -80735 -27091 23160 58202 66012
5813 66012 46825 -48401 -83107 -161324 -140392 -84644 -108185 -114724 -22590 -25788 -23632 4132
5801 4132 43592 47847 26535 -5212 4486 -23672 -14567 -8712 -4827 5114 -732 -16765 7157
5788 7157 779 -38172 -48683 -55696 -38977 -5156 19868 25629 -16337 -77476 -114133 -33963 -37276
5775 -37276 -26763 44010 40008 8190 -34015 -63403 6512 -21445 -82616 -98391 -103073 -53778
5763 -53778 17336 29456 -13999 -44461 -98073 -150625 -122373 -108376 -94577 -27546 -6585 -30370
5751 -30370 -29030 -39237 -34739 -42825 -35845 17313 45204 12532 -27277 -52593 -62389 -59662 -46653
5738 -46653 -14089 -16723 73226 87191 -5300 -46540 -37024 -27016 86378 143294 157743 123707
5726 123707 53894 -29603 -93182 -88753 -59808 -17609 9693 47706 27489 46783 40385 43619
5714 43619 49411 8899 -42391 -36595 46544 716 -74142 -77113 -83592 -87939 -69008 -48857 -12727
5701 -12727 5536 -554 -52893 -48510 16629 -24314 -26130 -28644 -40005 -31848 11106 38366 -8283
5688 -8283 -55204 -76039 -83591 -66134 -90196 -43394 -1012 26454 -16117 -30695 -14979 73900
5676 73900 73355 53857 36590 47271 56406 107054 123328 142624 117908 48455 26530 -15607
5664 -15607 -15093 -9362 9067 69285 37456 72438 -10855 -47411 -50185 -28889 -66240 -41871 -66824
5651 -66824 -90498 -82879 -70748 -27388 -22673 -29000 -47926 -50925 177 11418 68284 22664 -33100
5638 -33100 22216 113804 108942 82258 94608 83382 -13735 -90312 -76157 -65524 -69050 -32311
5626 -32311 70015 90151 92394 90996 36850 -4708 18055 46589 94062 76623 18270 18349 92843
5613 92843 56714 -17008 -16998 -7679 3713 15264 5862 75667 67302 10089 -39918 -28192 -45291
5600 -45291 -75888 3012 -32595 -16910 48953 99749 76501 2144 7572 30262 24388 40393
5588 40393 -8300 1700 40913 31510 77553 109509 145442 186119 138676 47551 -18188 -38527
5576 -38527 -29069 -52521 -76553 -87413 -80326 35704 58726 -29620 -62381 -56094 -27869 -60950
5564 -60950 -115526 -105510 18487 69786 83425 19839 -53423 -48069 -13322 -1869 -20376 -13130
5552 -13130 31415 21174 -44161 -81937 -70453 -95764 -89843 -113747 -88183 -65391 -61252 -68107
5540 -68107 -73948 -11530 50612 160433 176828 175077 77282 3333 16514 42886 -25851 -81053
5528 -81053 -33596 544 -2443 -63674 -98042 -68734 -62063 -66866 -64701 5891 22453 -3230 1530
5515 1530 -23610 -85806 -124796 -88559 -82560 -64778 -27685 -48001 -99464 -62869 -3947 25581
5503 25581 -3381 -42213 -100086 -127864 -140546 -36479 3767 -61320 -84435 -50441 345 -2644
5491 -2644 -32093 -9952 33266 71476 90063 39326 47038 13699 -40335 -51991 -88423 -99336
5479 -99336 -95921 -87228 -97687 -88424 -85768 -18141 -817 30897 71978 34200 52271 40656 -19726
5466 -19726 -56298 308 -5730 -22164 6991 41696 38572 9507 38633 7153 -13873 32947
5454 32947 27222 9734 -5452 7160 -294 -55707 -92159 -73596 -16705 5502 9058 12694 18643
5441 18643 -3847 9328 -33712 -51242 -880 13520 -59276 -77165 -3778 -4074 -28349 -56138
5429 -56138 -37710 -28926 -22409 -14713 -32940 -6790 -23053 -25900 26413 37001 -25618 8221 46355
5416 46355 50836 -1594 -27657 -41371 -80540 -34919 22043 29497 70040 56174 31065 37051
5404 37051 101404 46303 7147 12002 46188 39889 59618 23099 -45527 -83243 -86572 -35873
5392 -35873 -7478 12218 45248 104784 68241 36099 37380 7938 19455 -27552 -68224 1508
5380 1508 15178 -7385 -66410 -39888 -33666 -76866 -101186 -107497 -66039 17614 3575 -21846
5368 -21846 -102900 -127325 -104711 -77847 -101809 -38226 16794 -6381 -729 9787 10927 14669
5356 14669 14297 35687 39653 9714 45030 112255 156582 155222 111663 57722 106573 120299 90117
5343 90117 45133 -53247 -50814 45876 46691 10984 440 -42834 6042 -48059 -129823 -107032
5331 -107032 -27100 19087 61874 -36590 -117801 -152898 -96505 -35577 -11111 2844 8187 4174
5319 4174 -19747 -77491 -137769 -116484 -47551 -10002 -24459 -16857 26144 70287 80626 69530
5307 69530 -4285 -18492 27122 -20860 -29359 -22289 -70710 -50554 -52432 -87753 -35518 7684
5295 7684 13063 14121 -32310 -9265 17843 10118 -20329 -23655 65287 82457 52806 76023 77219
5282 77219 66715 63601 86213 147614 154465 83949 93919 79295 67071 -14317 -93978 -94329 -76009
5269 -76009 -67450 -56826 -92554 -97876 -43797 38669 13287 -53683 -35190 13347 16968 18636 9822
5256 9822 -17896 -49924 -24368 13520 15306 -7093 16179 -11396 -26078 -35472 -40088 -64266 -62899
5243 -62899 -24500 -31036 -22683 -4803 -28365 -45645 -18894 -43377 -51050 -49238 -80039 -160521 -163876
5230 -163876 -93399 -89753 -170478 -152553 -114348 -156573 -122240 -103717 -124967 -86235 -6150 7556
5218 7556 -7151 -85186 -15295 22182 31900 70066 21150 20586 -36303 -25285 -39014 -50150 -37002
5205 -37002 -18167 -14076 -40525 -51290 -54423 -46014 -36545 10696 14857 -2460 -65160 -49238 -32486
5192 -32486 -13323 82236 127015 106330 49168 13228 12482 50413 61039 21626 -7999 -27112
5180 -27112 -51677 -46627 -72731 -83996 -68280 -39389 8856 11455 68886 34684 35257 72113 41958
5167 41958 62221 71790 10755 -4851 -52914 -49727 -47829 -46342 -28795 12498 -15468 -79905 -49081
5154 -49081 -29190 3239 39935 -10563 7953 -17831 4686 -64672 -101073 -106378 -38305 -1988
5142 -1988 -36923 -66537 -71665 -8862 34670 25163 29891 61594 75638 51711 20040 -14193 -46489
5129 -46489 -72997 -32736 37112 41757 4273 -28381 18346 16098 35777 -21100 -75580 -124648
5117 -124648 -99753 -4645 -116 -38502 -22131 -26821 -13692 -10113 -13821 -63781 -96487 -101529 -73899
5104 -73899 -83936 -110892 -23925 16187 15223 -78285 -92438 -21861 28251 37100 43232 8249 1846
5091 1846 7806 978 -14439 13282 28611 23172 16818 27546 41588 74867 57634 17157 16155
5078 16155 -25466 -17154 1663 -15944 -12512 43896 -16880 -65966 -28535 13942 52722 68765
5066 68765 30597 -25450 -12476 12214 23429 3742 -95391 -53506 52332 82022 89093 38968
5054 38968 53757 40999 35609 30367 80433 99938 34142 -13191 -20903 -14316 8622 -14372 27759
5041 27759 39587 11477 4836 22980 36708 56032 1100 -53713 -54361 -98903 -133348 -140007 -131569
5028 -131569 -110727 -58323 -24015 -77038 -136654 -106419 -66051 -36001 -72239 -26199 13058 25351
5016 25351 16399 -6326 -27615 14561 9274 14690 -6773 -68144 -32158 -47025 -47311 11572 34163
5003 34163 -9575 -71167 -55824 -42218 -22357 -73904 -24403 -17163 -36440 -5124 2993 6973
4991 6973 -41811 -21305 7711 -8602 -10089 31506 70531 67348 39297 -30829 -65109 -97279
4979 -97279 -39336 -5772 -81087 -63361 -22052 -52393 -70517 -61834 -25679 -48877 -58271 -59468
4967 -59468 -61242 -28773 13142 10438 -51219 49515 94558 71377 73460 31984 56884 57965
4955 57965 68860 53231 79764 83558 18422 6809 45372 32088 -2962 21384 -5698 -42552
4943 -42552 -31030 -9800 52008 28314 -2980 -9039 38952 27245 63129 43324 29905 2466
4931 2466 5266 -9044 -46576 -46359 -53828 -28375 -6772 48738 13303 -17045 53854 94803 35343
4918 35343 15678 -45371 -22911 31627 60880 83716 95594 45650 -13340 -32467 -4906 -24782
4906 -24782 11603 -2784 48512 65027 37993 14677 42544 9168 -6719 87191 140838 52756
4894 52756 -9961 -52959 -24498 -30852 16845 79356 106234 50738 29618 52595 20066 -8157
4882 -8157 34404 33401 24178 7843 4942 31912 58590 58373 53732 91950 130309 101289 10315
4869 10315 -3147 18481 69704 57094 24552 27089 34631 9724 10261 13435 -20917 -10777 37708
4856 37708 53578 -48105 -58934 -21436 -34499 21670 27678 3027 -15368 7774 13434 -26521
4844 -26521 -39296 16514 57986 32460 50349 23310 6201 -4335 -39633 -72838 -28740 -1523
4832 -1523 -53852 -43829 -23078 -10464 9094 12451 -34897 -80242 -66727 -73293 -41383 6102
4820 6102 11484 77896 80835 50433 84144 106059 103295 71755 110590 111603 60696 57705 -42740
4807 -42740 -62421 -17156 3592 18235 87441 99632 67957 25619 6198 -18841 15939 29542
4795 29542 -8273 -10097 -17176 -20783 -39411 -1958 4705 -1857 6744 20119 30037 -7747 -8741 -16815
4781 -16815 28686 86051 59199 63121 35365 23983 66222 -30575 -50038 -49743 -90314 -120844
4769 -120844 -12085 14981 -41973 -80753 -85078 -86249 -69452 -40788 -20521 39456 79798 116950
4757 116950 76227 -22391 -85870 -66662 -663 132462 144496 97925 80721 28252 18402 54975
4745 54975 24697 -26165 -33912 4814 10227 -4733 -7204 10180 51774 20874 -53448 -110348
4733 -110348 -115649 -59843 -41774 -86171 -76635 -13194 75093 98609 -9604 -2509 34221 58100
4721 58100 100839 90406 68882 67178 36932 31564 18606 -7206 22314 28114 -15022 -8965 -45078
4708 -45078 -52530 -55177 -52084 -64925 -110813 -81423 -59144 -97124 -153940 -137687 -90668 -78232
4696 -78232 -32364 14983 110 393 -4310 29328 19386 -863 -4443 16214 19158 -50392 -40945
4683 -40945 -9331 17970 26945 593 -32717 26658 -3716 18497 43696 -21811 -64814 -48213
4671 -48213 22988 63111 12279 -56647 -101525 -39128 -7925 -2329 29941 52266 28609 20567
4659 20567 16697 -25298 -52389 -27632 -70173 -110867 -59540 -5474 3064 -8882 -72648 -38147
4647 -38147 3583 18306 -1697 -33695 -36343 -10745 -825 25599 -16751 -46201 -29645 -40829
4635 -40829 -69445 -40477 -44607 -20110 -73069 -87679 -42754 2252 -11931 -36226 5303 -7143
4623 -7143 -41465 -62702 -10044 44122 -270 -26778 22144 76034 39653 231 7641 -17021
4611 -17021 -79302 -105176 -57111 -55528 -72262 -54413 -51829 -30967 -58451 -50325 -299 44090
4599 44090 -13764 -46787 -13451 13093 15294 -7180 46375 110499 59361 43300 27033 32323
4587 32323 8393 16587 32427 27517 -8650 -43549 -71213 -98861 -112394 -106427 -59680 -41153
4575 -41153 -77513 -89245 -61032 -25748 -26635 -31013 -49359 -45669 -66154 -68950 -120057 -145964 -94723
4562 -94723 -143861 -167959 -74550 -23135 -24511 -57369 -27180 -35253 -25923 -25409 -50567 -36090 -11199
4549 -11199 -4946 3019 -20827 -27293 -33518 -23128 -49545 -95229 -67361 -79912 -61234 -39478 -62631
4536 -62631 -59034 -65527 -29301 3253 7822 17352 -36626 -18718 37090 60918 61694 23799 23461
4523 23461 -17942 -17053 -6413 -7558 2364 -23917 32289 92254 104071 95333 50167 34186 44559
4510 44559 38038 -3466 -68585 -114023 -80922 -59114 -114000 -125410 -158421 -158801 -132149 -132602 -55762
4497 -55762 44285 63867 1116 -78149 -39784 1151 -2393 46846 42250 65250 88315 71573
4485 71573 15961 -34797 -26351 3863 87814 87051 70787 50062 105555 108330 60535 37031 59645
4472 59645 66469 -2622 -13153 -56652 -55156 17857 44237 -3482 41205 20517 -15427 -21615
4460 -21615 -12040 20720 3686 -15415 -54692 -43409 -11544 -41266 9557 42148 37932 -220
4448 -220 4116 2667 -45111 -13612 2045 -31004 -60261 -16887 17022 40010 53397 -24992 -83469
4435 -83469 -87302 -92547 -94103 -80171 -64174 -48947 -53365 -16856 -29903 -52545 37596 73297 90131
4422 90131 45434 54402 88557 59484 33516 15421 -52259 -102476 -90956 -66514 -95158 -101273
4410 -101273 -77465 -68703 -91299 -39800 -12445 -78351 -99932 -131291 -74836 39569 137733 161981
4398 161981 46979 -48626 -67186 -52957 -38250 43157 18674 -64702 -66383 -96021 -54405 -33957
4386 -33957 -29884 -5881 -468 36326 90457 39350 2704 7443 55720 79489 73694 31881 -20813
4373 -20813 -8231 61199 58189 18399 13105 34786 75861 108388 41359 -41813 -43132 -34909 -26468
4360 -26468 -58305 -100059 -120450 -74170 8369 55444 49924 37208 -37400 -92495 -51269 -4987
4348 -4987 47193 50529 13491 -16845 -15673 20725 32584 37849 61779 -6959 -22226 -54152 -38725
4335 -38725 -36974 -76024 -88914 -62363 -35610 -20375 -34647 -103708 -69821 -47997 -65739 -83085
4323 -83085 -72976 3595 52618 50410 34760 -4784 -16327 -3783 -20928 -3864 -20955 77366
4311 77366 103650 80590 26645 -6654 -43455 -75679 -18574 26108 26973 -14061 2439 38008
4299 38008 31173 -32976 -83925 -116260 -65531 -16350 12451 26476 21851 36942 -21973 -83996
4287 -83996 -76495 -23100 -57223 -75963 -65003 -41923 -16504 -12018 -18202 -3270 -58804 -60924 -42168
4274 -42168 17601 34879 68882 108767 84831 -7381 -33205 -100602 -69864 2256 18905 -12933
4262 -12933 -5401 -8554 -24930 -31656 -31914 -9539 15081 34537 66678 67435 94689 46767 36943
4249 36943 58838 81796 71055 28648 80249 108881 33431 37627 57644 61950 67082 37039
4237 37039 25053 13434 21620 60418 74278 92730 67770 36180 -14608 14037 -47110 -107868
4225 -107868 -66061 -58532 -32561 -68780 -32856 -12136 -590 22787 40469 681 -17708 -1536
4213 -1536 21892 481 -74664 -72059 -43144 -8216 -16881 -13617 39307 89513 114735 89229 -7356
4200 -7356 -79560 -43108 -5504 18311 97422 88296 16622 13498 70528 67278 66299 39487 -5542
4187 -5542 29922 41956 17222 21458 -23007 -129115 -88075 -22377 13448 15829 57315 31168
4175 31168 -32942 -36110 17744 45328 127 4955 5869 -3960 8314 11880 -5895 -73254 -134760
4162 -134760 -52604 21855 8364 -65292 -106193 -74582 -36681 9967 38138 28138 -19699 -27382
4150 -27382 -28870 -74331 -57975 -94598 -69927 -41634 -16743 -56087 -112491 -93691 -98846 -86016
4138 -86016 -22223 27505 9466 -46102 -92952 -94326 -30754 -38639 -57150 -72209 -41616 -57665
4126 -57665 -123240 -152592 -93236 -18710 -5182 -25033 -17534 -12792 -16215 13363 30596 -18337
4114 -18337 -15405 33177 65087 31008 -24170 -62831 -129233 -136522 -108046 -97478 -69950 -33008
4102 -33008 -18624 1102 48803 15074 15298 -20468 -40831 -20378 5893 54071 81332 159977
4090 159977 146591 89571 35675 -5914 -28389 19613 61583 97684 62265 -6895 6889 -10143
4078 -10143 -52586 -33830 -34217 -2847 4113 -16999 -56572 -68153 -83851 -50860 -54564 -76289 -108570
4065 -108570 -107648 -87438 -77990 -65930 -84530 -46743 20087 14819 -8565 -53262 -82464 -37656
4053 -37656 30093 42873 75755 22257 -46641 -84672 -65119 -46517 -57486 -29528 38487 40705
4041 40705 -2949 -1969 -29196 -13496 11714 506 50315 36993 14538 -3871 9379 18157
4029 18157 26686 63432 76096 15444 -32059 -89682 -109264 -36313 1418 6596 -8038 -22499
4017 -22499 -44802 -46746 -25179 -543 -1936 -11007 -44152 -74468 -112770 -142039 -138622 -121990 -99141
4004 -99141 -85678 -55876 -40022 5270 42722 42657 42606 26905 -41817 -58518 1128 26282 22453
3991 22453 -54009 -97840 -77875 -53970 -9338 -4051 -10251 -48416 -32574 -10651 -17919 61
3979 61 -1227 6254 7339 12604 45151 65059 78626 15548 -49491 -92380 -100565 -80182 -86296 -43977
3965 -43977 -2597 -49570 -85767 -97764 -79667 -34365 -30312 -11607 58272 37692 -14224 -19530
3953 -19530 -51661 -68600 9499 35988 34460 343 -18174 -9810 3531 22855 64325 28351
3941 28351 26091 -30442 -20768 99656 110189 83922 106381 148754 154865 144588 136199 118187
3929 118187 -8450 -95252 -45479 3449 -19505 -31462 -63138 -73816 -124520 -118253 -34904 75262
3917 75262 103320 52696 26552 -6433 11350 37296 -10500 -9781 26204 83513 95071 51042
3905 51042 -15875 -79934 -105111 -91670 -57032 -72395 -38056 -1749 22373 14283 -49785 -27093
3893 -27093 -15428 -51082 -63093 -19848 -22057 -21919 -59458 -26627 7629 -13268 21136 55444
3881 55444 -12310 -64677 -104883 -143634 -107284 -106053 -58152 -22544 -9675 -11272 11602 26932
3869 26932 95035 81121 13250 -38573 -73706 -19547 743 24694 -6937 -16387 21692 47104
3857 47104 97692 72756 29710 26907 -9413 -63839 -8416 43689 12273 -43731 -13324 15539
3845 15539 -5315 3910 40908 84379 80810 -10989 -15975 2225 24939 67442 44511 -42034
3833 -42034 -51093 -29782 -13772 -106517 -135826 -119898 -116220 -53214 -81921 -119086 -98447 -97872 -5400
3820 -5400 27134 15749 -29083 -33388 2938 18315 -3750 -21155 -9241 20298 58893 30447
3808 30447 17899 15708 10471 37147 28088 61221 35880 2243 -20206 784 15801 -15975
3796 -15975 36153 44728 7272 -37283 -38971 -47491 -64629 -39626 -28429 -11625 -40081 -86685
3784 -86685 -77752 -79058 -36074 -48136 -46652 -25222 12653 3344 8162 -31221 -13271 -8624 39544
3771 39544 -25564 -120887 -114589 -42228 -6829 15136 66752 96484 27132 -17236 -47797 -61573
3759 -61573 -109127 -104256 -88530 -78013 -119989 -101923 -32565 201 30346 35271 2116 14789
3747 14789 24275 -21226 -95116 -75858 -79980 -88015 -65053 -60388 -1926 -11068 -48159 -85612 -71943
3734 -71943 -25442 -24896 -48576 -77999 -79957 -3586 29147 5679 -51975 -64952 -49889 -398
3722 -398 961 2572 23037 27965 38282 -3034 38620 52248 51035 67058 33042 -72834 -13897
3709 -13897 16020 -18724 -68002 -31555 -22106 19084 58275 50768 25219 31046 13170 -48509
3697 -48509 -21490 42109 45291 100815 83692 77454 85308 135556 129877 105310 144681 159218 138178
3684 138178 59853 61213 81104 63205 68929 59046 21944 41555 13945 -17522 -19556 29537
3672 29537 33580 9079 998 -1 -47008 -84599 -58887 -40234 -19294 -31562 -29665 -103473 -133474
3659 -133474 -96201 -46604 -4979 36778 89325 14907 -109717 -121649 -40398 -10351 -63568
3648 -63568 -88869 -38300 49239 72611 36477 -24528 -21443 34364 60580 70107 54602 34219
3636 34219 14017 -17018 -24822 -32467 -82146 -72518 -27665 28566 68919 20421 -10083 51575
3624 51575 97710 78242 -15616 -37873 -43173 -23362 30263 35691 35836 49765 27961 9088 13563
3611 13563 22702 20449 1466 5830 17990 49241 58894 38101 50689 36052 5317 -16513 -5561
3598 -5561 44276 97086 47977 54638 44288 2149 -42268 -32462 37765 60346 -26273 -94377
3586 -94377 -55777 9955 42672 54591 70983 57705 36082 49531 28287 -10192 -15232 -71702
3574 -71702 -70269 -26179 -4654 19879 -12007 -36825 -57031 -41105 6270 51753 106967 84358
3562 84358 7124 -85210 -125770 -90406 -79986 -138978 -84119 -38250 22120 61525 -61301 -162370
3550 -162370 -131947 -112896 -90278 -81169 -103454 -77887 -34390 -29848 -30357 -554 7407 15884 26411
3537 26411 9049 -46833 -58970 -19439 -21008 -46492 -53426 -12014 -26521 -4023 -2401 49490
3525 49490 80979 78092 84728 71623 50865 87221 84550 83670 68246 17106 -6727 14853 -29404
3512 -29404 -61635 -73259 6311 -241 -26442 10018 11717 20983 -5602 -26721 -19906 -46046 -34825
3499 -34825 11514 -8980 8534 -26626 -26353 50868 61123 29646 -10516 -35258 -15309 57605
3487 57605 70201 57339 64920 53417 57405 50284 -16058 -32650 -12353 33649 30392 31413 99818
3474 99818 73361 69368 34558 -22587 -31975 -15648 -29002 -58611 -60639 -14599 -15021 10222 5102
3461 5102 70527 62679 3220 -77724 -89235 -21020 21951 2176 -17140 -56918 -32002 -24129
3449 -24129 -49952 -21127 -11323 17789 54119 53160 90710 20515 -80481 -78350 -71203 -66243 -56997
3436 -56997 -85391 -62992 -54145 -41791 -45535 -72378 -125525 -143909 -28205 12708 -2143 -3802
3424 -3802 -21396 -27778 -11568 -18204 19688 85974 60573 43806 23284 -5485 -47364 -61864
3412 -61864 -29882 39472 40811 -30852 -3286 -9757 5611 23845 -20856 -50708 -108016 -95579
3400 -95579 -35272 -12045 18503 -23808 9754 61251 65631 -161 -89611 -96600 -59419 -142307
3388 -142307 -130284 -96264 -83520 -47837 -23374 -8464 3215 11459 -21604 -51792 -93827 -71321
3376 -71321 -104191 -67753 -52264 -85744 -133399 -121408 -70618 -22943 -24147 -14597 15607 35270
3364 35270 -1910 -64402 -12531 -4783 39698 130123 159726 99522 73030 74143 121484 72343
3352 72343 55325 22215 45950 54453 53259 56449 37400 48198 81078 76360 -5979 -50144 -8360
3339 -8360 25847 -71718 -85936 -11307 10245 -2441 -27120 -83268 -141794 -105910 -27361 60555
3327 60555 43570 -22908 7317 -6440 -21199 2466 -33724 6559 42899 11117 15187 -16849
3315 -16849 13837 38986 58546 29652 48267 53807 -17718 -20880 23183 10254 36169 74827
3303 74827 78389 73494 74254 569 -39459 -41199 -1634 -28646 -113476 -135678 -90179 -29160 6095
3290 6095 70661 59422 -8741 -73941 -24226 -29426 -60395 -24785 63653 91381 -9722 -37765
3278 -37765 -46470 -30825 -2563 6913 7514 7417 26473 36428 16653 40938 48333 49311 104092 124101
3264 124101 96378 61294 37628 79539 30247 19411 -31861 -45159 25674 2010 -47921 -82686
3252 -82686 -61072 -20639 61428 30166 -71025 -85890 -79963 -70796 -11081 46794 43252 15701
3240 15701 43423 83103 49166 18067 14157 27300 67591 48191 60022 28971 16958 45003
3228 45003 56797 -7062 -80413 -50718 -687 1284 -73416 -103082 -111420 -72452 -88145 -28698
3216 -28698 -2438 -76826 -142911 -89262 -47960 -73199 -68794 -40726 -57857 15534 -16787 -48167
3204 -48167 -81341 -118284 -94930 -94035 -36526 26370 37219 54006 79300 61002 16618 695
3192 695 33347 19647 19020 29081 25149 34510 4811 42623 99819 50289 31154 77750 99337
3179 99337 97630 76024 36814 27083 24337 3656 25450 61852 24484 12464 -1781 32843
3167 32843 17464 -10298 -52022 -40050 -16917 14949 915 -2119 -4002 -13739 -69855 -101622
3155 -101622 -153578 -120430 -5271 10969 -79171 -44887 11149 48999 55404 -7800 4438 18877
3143 18877 55768 77603 157155 216265 76073 46231 73833 13773 -1915 20925 22188 16348
3131 16348 16089 22702 46642 40639 54366 51574 31478 65755 44046 44247 45284 58487 100
3118 100 -19768 -2870 -24909 -54842 -56036 -37721 -36994 -57671 -39485 -61380 -69765 -14607 39957
3105 39957 10900 13063 20546 66215 77114 60232 35456 -20922 -76177 -33148 -30321 -48458
3093 -48458 -753 14450 11527 9409 -48681 -124863 -91587 -83475 -107686 -85927 -114306 -66465
3081 -66465 35537 79927 23488 15880 20517 -14048 -35543 38250 -7356 -42448 -34333 -23708
3069 -23708 -47129 -104038 -111403 -48150 -6892 -59181 -78209 -82704 -73518 -27355 -12347 -4549 -21246
3056 -21246 -55126 -52809 -61482 -36819 -11509 -21967 -1128 -1018 -18543 8358 -14239 -25559 -37105
3043 -37105 -58017 -22362 -51211 -58412 -30169 12011 15762 10405 -13952 11099 8135 -18087 -20923
3030 -20923 -46412 19908 63332 42593 74829 61131 56543 87379 40922 24531 8524 -33317
3018 -33317 -41057 -57181 1508 29648 84261 99903 85721 66319 11490 15826 -37407 -96728
3006 -96728 -55437 -74340 -50460 1522 -3647 -3222 2428 -38340 -45252 2395 32978 21827 -13142
2993 -13142 30209 127622 131215 77869 78733 33819 -4069 -12164 -43135 -45176 3699 16170 76831
2980 76831 174685 175210 113047 48444 18272 25188 28326 31032 4224 17728 -10603 22289 2392
2967 2392 -14326 -53604 -87664 -59386 -38709 -1834 26605 -2586 3750 17150 -12134 22662
2955 22662 28822 12252 11610 11862 51490 25687 16416 3556 -11690 -3256 4141 10654 29098 48010
2941 48010 3433 34807 43502 43843 86810 50775 50832 44318 27268 57394 111177 86302 93785
2928 93785 119795 110462 58677 -16002 -90250 -79354 -66587 -97110 -67139 751 41131 80585
2916 80585 95411 97987 73757 57189 26551 -18588 6638 -3288 -50128 -59307 -20140 3273
2904 3273 -13079 -9649 26704 827 -49279 -24732 19985 103964 107799 71823 -23642 -27835 -18926
2891 -18926 -22950 -31494 -14095 -38030 -6750 52585 40234 -45066 -12729 24864 15295 50279
2879 50279 15049 32993 3619 -5199 19399 -2194 -12151 101958 130577 59961 21161 13285
2867 13285 19119 38185 52469 62816 -16419 -7171 13348 -1387 -930 50586 40079 -9860 -1695
2854 -1695 -7010 3685 -32367 -73747 -30325 38473 4614 -17207 -75374 -65918 -15173 26235
2842 26235 74229 85390 40134 3172 -6246 2473 11843 1047 13553 -77856 -159408 -176503
2830 -176503 -162060 -46076 25128 -23766 -21319 -15218 4592 -5043 -32259 -33615 -20730 -11761
2818 -11761 17942 38808 8288 -63177 -77972 -34899 -68450 -93404 -52542 2600 -94440 -170927
2806 -170927 -138560 -68164 -97173 -72583 7609 17801 51293 33493 38895 84411 145295 129661
2794 129661 78531 54386 6883 -3087 -20388 26568 60648 38594 57290 88956 86002 75684
2782 75684 3048 -27495 -33721 -63864 -41680 12803 6204 23313 44975 21099 11862 -24115
2770 -24115 -67041 -86498 -91599 -48744 -27968 -14901 51022 13502 -49939 -52668 -36594 -36592 -21839
2757 -21839 3392 60091 131541 88481 29547 -22291 3482 45174 29694 79674 90933 43592
2745 43592 71335 44566 7352 -26549 -15921 -54265 -22894 -230 2129 53156 75177 52085
2733 52085 -460 -55254 -90472 -42071 -41048 -16042 -2399 -42337 -85344 -90280 -36161 -42906
2721 -42906 -24410 -50091 -41299 -38276 -61395 -99991 -112706 -72577 -50885 -10577 10036 26389
2709 26389 -21078 -45650 -7021 42635 29294 -16577 -17960 1091 38122 32278 48678 94339
2697 94339 127893 125258 127964 107370 68071 -4853 15610 80555 116304 80771 73684 27981
2685 27981 2936 44404 25544 -981 76769 104613 48444 6037 88699 147575 127625 101339
2673 101339 31250 7882 -26952 -47161 -33198 -25204 -52076 -88021 -73972 1701 125460 144559
2661 144559 141450 59241 34765 75504 139126 55571 27349 25918 11709 -13053 -13898 -49302
2649 -49302 -84427 -68143 -16277 63374 136045 117005 43528 -37812 -42562 -55731 -51636 -113902
2637 -113902 -128730 -79833 -40482 -45764 -38824 -30612 3 35704 -19296 17459 31491 60003
2625 60003 58932 25379 35486 12129 -86686 -90744 -86165 -111815 -155244 -149837 -56050 -11446 -39462
2612 -39462 -22452 -24266 6846 15883 3344 21983 57275 59387 -6653 -61402 -41594 -14869
2600 -14869 -54639 -44456 -41236 -73616 -26383 -21150 12584 53374 58592 -56347 -84874 -64898
2588 -64898 -71024 4742 32056 46708 76911 60163 23740 60539 44711 19899 76024 128082
2576 128082 82275 88299 -1518 -69608 -65938 2072 54670 77548 81424 60792 90238 115614
2564 115614 91806 105646 50626 -5285 7307 28528 80714 51456 -29761 -22883 59661 83848
2552 83848 2354 -54760 -61462 -23802 -48789 -90197 -86809 -68385 -24425 38403 47901 23999
2540 23999 -30531 -44504 -67914 -92595 -104193 -97462 -83172 -36270 -65703 -60829 -70410 -45827
2528 -45827 18255 -4539 -38669 11222 66361 54565 -10839 -58684 -44291 25292 29470 -4819
2516 -4819 -37695 -118697 -109202 -93625 -32190 -19773 -44886 1746 -2848 -18131 -15207 3563 -13616
2503 -13616 -14973 -27498 1137 7540 -19463 -3234 10608 19703 39808 18977 -12425 -10307 54685
2490 54685 69133 10405 -72385 -101579 -77475 -38038 -71558 -69051 -28688 -35153 -32748 14377
2478 14377 13434 -35204 -34251 -18056 -44206 -42572 -13950 -1124 2612 -18340 -21602 3993 37024
2465 37024 -2857 -79513 -68746 -29323 -72564 -75459 -4377 42402 29799 -3996 23873 40824
2453 40824 3341 -9689 35999 75557 44086 86978 54754 8527 -15880 -37661 12717 -7519
2441 -7519 -46151 37162 45954 54629 11633 -50777 -109600 -108300 -162503 -186056 -140362 -103385 -57994
2428 -57994 -16660 57698 74481 69650 68424 51272 18031 -13282 -45331 -32388 -46208 -51842
2416 -51842 1256 58227 47541 62072 37051 7238 -27989 -48619 -19904 -9550 -11900 37212
2404 37212 20534 -13427 -48739 -104291 -17850 30370 10241 -9726 22783 -5001 -521 40224
2392 40224 71407 111029 132435 83739 15652 -79908 -148822 -121808 -120216 -100039 -16750 4851
2380 4851 19517 12314 8069 -15033 -28811 -47362 -47262 -3420 35126 98494 50318 -100664 -104005
2367 -104005 -70151 -135 21657 -32834 -86170 -71894 -37158 -63624 -40475 -2414 48994 -13135
2355 -13135 -54619 -54714 -50285 -15638 -7522 -1810 -47672 -32824 -30883 -1372 32048 71974 77899
2342 77899 8584 -39701 -42536 -46391 -92772 -136133 -67343 -17330 26556 33398 -9981 -24868
2330 -24868 -482 14265 -10103 -15823 18091 55893 27986 -5773 -567 52806 39511 -46150
2318 -46150 4146 70026 80045 100536 99494 140509 157362 162252 108896 46147 25066 5390
2306 5390 -29938 -89445 -93519 -54870 35068 101198 81361 21142 42114 -13148 -35046 -843
2294 -843 61505 111536 69943 25013 60365 71843 28562 2223 -42032 -86726 -90113 -48632
2282 -48632 7212 1439 -16503 -15592 1601 57068 40548 -9067 14273 45346 74025 4627
2270 4627 -21571 -3051 -31863 -71555 446 36980 25825 -7989 -32658 -26637 -69118 -22110
2258 -22110 66462 79579 58164 36007 17630 39897 -18810 -34901 -31256 -20739 9242 42378
2246 42378 39350 20180 20614 -15825 -38467 -67915 -3981 -25878 -41813 -29432 -6278 41813
2234 41813 8508 27785 -7352 5082 -802 -44951 -90421 -74971 -80541 -67514 -24214 28056
2222 28056 -27532 -25726 -21709 30012 118368 94477 42107 64525 -5129 -39132 -18795 -21730
2210 -21730 -47192 -98258 -95362 -32144 16036 19094 21748 21747 41900 -14003 -52984 -51876 -46191 -72405
2196 -72405 -98377 -47552 17769 35490 700 17585 13314 -34091 -85371 -114206 -44443 -81301
2184 -81301 -92149 -16689 34500 30974 -191 4087 -15696 24955 36670 36192 39294 14546 -24799
2171 -24799 -86111 -47637 28978 30523 -9701 -69887 -60342 -46809 -45552 -89908 -109552 -133314
2159 -133314 -62341 -11493 10627 53323 68525 82014 14538 -33608 -13762 12047 4166 6217
2147 6217 18657 33846 15172 48322 -30153 -52439 -36412 -18044 17848 32297 5385 42489
2135 42489 89732 91254 83669 82950 27711 -6807 -35491 -45399 29610 99627 84579 90079 54053
2122 54053 -2327 -48191 -43583 5407 29684 46744 60268 51521 94775 142804 122171 58554
2110 58554 89030 153232 125299 126454 103097 55439 105625 114791 113738 75998 45327 40287 26364
2097 26364 35439 46142 18566 6945 -38154 -37346 -29970 -15886 33185 85932 62139 1260 5884
2084 5884 -13833 -11873 -46999 -66534 3470 39933 33610 62134 -5873 10097 37909 1955
2072 1955 21404 26856 4376 21979 47495 63184 93800 88708 95763 79799 60342 57619 39809
2059 39809 38059 -1625 -42673 13754 14324 -6878 -3009 -18860 5856 1672 -65070 9 55447
2046 55447 34606 -11822 23535 68554 13882 -56527 -91519 -82076 -25556 -244 38123 22685
2034 22685 6241 -4225 -6157 -18736 -45741 -62197 -67026 -85451 -72031 -46514 -76971 -97228
2022 -97228 -55648 -36928 -8516 26608 40263 74801 78985 -2742 -13403 10127 56408 55392
2010 55392 93856 112671 74931 32967 8840 56811 75712 62916 29856 16432 -4158 -5525
1998 -5525 -23187 15201 66675 94592 123557 110208 82909 81639 63720 79356 39166 7623
1986 7623 81700 85088 43367 -25663 -42738 -25181 -42421 -17827 -35575 -29336 11329 42937
1974 42937 -9041 -7783 -866 -7075 -6803 15977 96569 97943 56457 14613 8900 36688 38581
1961 38581 32137 35361 -5924 -53050 -101080 -73142 -36779 -7191 -24631 -41800 -72761 -68071
1949 -68071 -60014 -18585 22601 28638 62524 61255 66391 124910 171604 165683 103806 12760 39090
1936 39090 23658 3216 -15199 -3233 55783 67647 66039 68956 19189 14057 5886 -540 25543
1923 25543 45351 65065 50392 43507 68573 45482 45210 79902 100875 69503 24221 38565
1911 38565 39406 -27956 -32196 40237 34176 -20959 -38056 17115 -9287 -21972 -30790 -37633 29437
1898 29437 28123 25295 63304 17781 -40975 -53852 -26026 648 34364 38761 -25828 -113572
1886 -113572 -117243 -72380 7826 39106 19256 -9977 -39455 -33266 -62232 18133 75235 6769
1874 6769 -20588 -20496 -23953 -26723 -38347 -42052 -34548 -18018 14010 -3301 2243 16157 16883 -2788
1860 -2788 -1472 24276 -25839 -10576 30617 35333 68941 102651 83869 69931 6396 -60465
1848 -60465 -60279 17868 43593 26485 12549 -8344 -58450 -83330 -128492 -94453 -55 41687
1836 41687 -14634 -57989 -44473 -24444 -7341 44042 46298 32743 5927 21432 14883 -8488
1824 -8488 -35161 -20331 30692 -13616 -75189 -7135 -52323 18857 82004 62691 49661 58114
1812 58114 46125 -295 -52477 -65907 -27556 4055 14382 23182 103353 138670 134701 67621
1800 67621 -18053 -39844 -62296 -69387 -96718 -138544 -144049 -109063 -41736 -10302 -36882 -7246
1788 -7246 12390 -21594 -70234 -91073 -99407 -54878 -30202 -43488 -61711 9201 18728 26786 19362
1775 19362 -6589 11474 22314 -817 -37117 3268 21524 12499 40342 21903 -12414 -54584
1763 -54584 -31010 44767 48523 15155 -23451 -51620 -28907 -11770 -63388 -45200 -1052 -18551
1751 -18551 -6009 -12043 -3222 51626 27238 32301 16606 53905 96669 103540 48771 17379 -2789
1738 -2789 38677 32468 1116 8684 34990 20946 13502 23135 -31476 -77775 -91440 -48961 -124827
1725 -124827 -154805 -114101 -44392 -44403 -28751 -17268 -34726 20609 20580 18898 53979 15004 -38705
1712 -38705 6728 9573 -24846 200 -38527 -72712 -100440 -100424 -82379 -87751 -97108 -53286 -12178
1699 -12178 -16447 -60434 -45086 25553 23982 -26769 -24290 -40781 -58387 -52988 10931 24101 -61362
1686 -61362 -128405 -145765 -142285 -90817 -35544 9230 -11688 -33682 -3175 18985 4371 -89041
$$ [...]
##END NTUPLES=NMR SPECTRUM
##END=
