##TITLE=Analysis number 323800
Compound Code cc 08901
Project Code adrs
Chemist Name namiki
##JCAMPDX= 6.0         $$ Bruker NMR JCAMP-DX V2.0
##DATA TYPE= NMR SPECTRUM
##DATA CLASS= NTUPLES
##ORIGIN= Bruker BioSpin GmbH
##OWNER= nmr
$$ XWIN-NMR		Version 3.5
$$ Tue Nov  7 17:51:29 2006 GMT Standard Time (UT+0h)  MAYBRIDGE\nmr@NMR_250MHZ
##.OBSERVE FREQUENCY= 250.131544655141
##.OBSERVE NUCLEUS= ^1H
##.ACQUISITION MODE= SIMULTANEOUS (DQD)
##.ACQUISITION SCHEME= undefined
##.AVERAGES= 16
##.DIGITISER RES= 18
##SPECTROMETER/DATA SYSTEM= dpx250
##.PULSE SEQUENCE= zg30
##.SOLVENT NAME= TFA
##.SHIFT REFERENCE= (INTERNAL, TFA, 0, 16.522)
##AUDIT TRAIL= $$ (NUMBER, WHEN, WHO, WHERE, WHAT)
$$ ##TITLE= Audit trail, XWIN-NMR		Version 3.5
$$ ##JCAMPDX= 5.01
$$ ##ORIGIN= Bruker BioSpin GmbH
$$ ##OWNER= nmr
$$ C:\u/data/dgb/nmr/ADRS/2340/pdata/1/auditp.txt
$$ ##AUDIT TRAIL=  $$ (NUMBER, WHEN, WHO, WHERE, WHAT)
(   1,<2006-11-07 17:51:02.32 +000>,<MAYBRIDGE\nmr>,<NMR_250MHZ>,
      <created by zg, POWCHK disabled, PULCHK disabled
       configuration hash MD5:
       49 4B E0 1D 92 C2 6B 37 9F E6 65 BC 52 41 86 1D
       data hash MD5: 64K
       7B 73 06 5C 85 51 26 16 BF 85 A7 75 DF FF 27 72>)
(   2,<2006-11-07 17:51:19.87 +000>,<MAYBRIDGE\nmr>,<NMR_250MHZ>,
      <Start of raw data processing
       ef LB = 0.3 FT_mod = 6 PKNL = 1 SI = 32K 
       data hash MD5: 32K
       41 8D 87 6C DC 82 81 FA 0D 1C EA 20 02 03 CF 7F>)
(   3,<2006-11-07 17:51:21.51 +000>,<MAYBRIDGE\nmr>,<NMR_250MHZ>,
      <apk 
       data hash MD5: 32K
       8C 1C 68 68 ED BA 5D BD AE 80 DA 26 EA A2 4A C3>)
(   4,<2006-11-07 17:51:22.25 +000>,<MAYBRIDGE\nmr>,<NMR_250MHZ>,
      <abs ABSG = 5 
       data hash MD5: 32K
       29 EC 4C 0D DD F3 D4 38 57 4D 15 DF EF C3 C2 0C>)
$$ ##END=
$$ 
$$ hash MD5
$$ EB 57 60 E6 94 A9 73 61 E0 3F 4D 1F 85 56 59 62
##$RELAX= 
##$RELAX= 
##$RELAX= 
##$RELAX= 
##$RELAX= 
##$RELAX= 
##$RELAX= 
$$ Bruker specific parameters
$$ --------------------------
##$DU= <C:\u>
##$EXPNO= 2340
##$NAME= <ADRS>
##$PROCNO= 1
##$TYPE= <nmr>
##$USER= <dgb>
##$AMP= (0..31)
100 100 100 100 100 100 100 100 100 100 100 100 100 100 100 100 100 100 
100 100 100 100 100 100 100 100 100 100 100 100 100 100 
##$AQSEQ= 0
##$AQ_mod= 3
##$AUNM= <au_zg>
##$AUTOPOS= <29 >
##$BF1= 250.13
##$BF2= 250.13
##$BF3= 250.13
##$BF4= 250.13
##$BF5= 500.13
##$BF6= 500.13
##$BF7= 500.13
##$BF8= 500.13
##$BYTORDA= 1
##$CFDGTYP= 0
##$CFRGTYP= 5
##$CHEMSTR= <none>
##$CNST= (0..31)
1 1 145 1 1 1 1 1 1 1 1 1 1 1 1 1 1 1 1 1 1 1 1 1 1 1 1 1 1 1 1 1 
##$CPDPRG= <>
##$CPDPRG1= <>
##$CPDPRG2= <>
##$CPDPRG3= <>
##$CPDPRG4= <mlev>
##$CPDPRG5= <mlev>
##$CPDPRG6= <mlev>
##$CPDPRG7= <mlev>
##$CPDPRG8= <mlev>
##$CPDPRGB= <>
##$CPDPRGT= <>
##$D= (0..31)
0 1 0 0 0 0 0 0 0 0.06 0 0 0 0 0 0 0.0002 0 0 0 0 0 0 0 0 0 0 0 0 0 0 
0 
##$DATE= 1162921861
##$DBL= (0..7)
120 120 120 120 120 120 120 120 
##$DBP= (0..7)
150 150 150 150 150 150 150 150 
##$DBP07= 0
##$DBPNAM0= <>
##$DBPNAM1= <>
##$DBPNAM2= <>
##$DBPNAM3= <>
$$ [...]
##$SUBNAM7= <"">
##$SUBNAM8= <"">
##$SUBNAM9= <"">
##$SW= 20.6930455092707
##$SWIBOX= (0..15)
0 0 3 0 0 0 0 0 0 0 0 0 0 0 0 0 
##$SW_h= 5175.983436853
##$TD= 65536
##$TD0= 1
##$TE= 683.16
##$TE2= 300
##$TE3= 300
##$TEG= 300
##$TL= (0..7)
0 120 120 120 120 120 120 120 
##$TP= (0..7)
150 150 150 150 150 150 150 150 
##$TP07= 0
##$TPNAME0= <>
##$TPNAME1= <>
##$TPNAME2= <>
##$TPNAME3= <>
##$TPNAME4= <>
##$TPNAME5= <>
##$TPNAME6= <>
##$TPNAME7= <>
##$TPOAL= (0..7)
0.5 0.5 0.5 0.5 0.5 0.5 0.5 0.5 
##$TPOFFS= (0..7)
0 0 0 0 0 0 0 0 
##$TUNHIN= 0
##$TUNHOUT= 0
##$TUNXOUT= 0
##$USERA1= <user>
##$USERA2= <user>
##$USERA3= <user>
##$USERA4= <user>
##$USERA5= <user>
##$V9= 5
##$VALIST= <valist>
##$VCLIST= <CCCCCCCCCCCCCCC>
##$VD= 0
##$VDLIST= <DDDDDDDDDDDDDDD>
##$VPLIST= <PPPPPPPPPPPPPPP>
##$VTLIST= <TTTTTTTTTTTTTTT>
##$WBST= 1024
##$WBSW= 4
##$XGAIN= (0..3)
0 0 0 0 
##$XL= 0
##$YL= 0
##$YMAX_a= 511118
##$YMIN_a= -516554
##$ZGOPTNS= <>
##$ZL1= 120
##$ZL2= 120
##$ZL3= 120
##$ZL4= 120
##$ABSF1= 16.522
##$ABSF2= -4.171173
##$ABSG= 5
##$ABSL= 3
##$ALPHA= 0
##$AQORDER= 0
##$ASSFAC= 0
##$ASSFACI= 0
##$ASSFACX= 0
##$ASSWID= 0
##$AUNMP= <proc_1d>
##$AZFE= 0.1
##$AZFW= 0.1
##$BCFW= 0
##$BC_mod= 0
##$BYTORDP= 0
##$COROFFS= 0
##$CY= 12.5
##$DATMOD= 1
##$DC= 0
##$DFILT= <>
##$DTYPP= 0
##$F1P= 14.0000005364418
##$F2P= -0.99999901652339
##$FCOR= 0.5
##$FTSIZE= 32768
##$FT_mod= 6
##$GAMMA= 0
##$GB= 0
##$INTBC= 1
##$INTSCL= 1
##$ISEN= 128
##$LB= 0.3
##$LEV0= 0
##$LPBIN= 0
##$MAXI= 10000
##$MC2= 0
##$MEAN= 0
##$ME_mod= 0
##$MI= 0
##$NCOEF= 0
##$NC_proc= -3
##$NLEV= 6
##$NOISF1= 0
##$NOISF2= 0
##$NSP= 0
##$NTH_PI= 0
##$NZP= 0
##$OFFSET= 16.522
##$PC= 1
##$PHC0= -42.22543
##$PHC1= 4.675059
##$PH_mod= 1
##$PKNL= yes
##$PPARMOD= 0
##$PSCAL= 4
##$PSIGN= 0
##$REVERSE= no
##$SF= 250.13
##$SI= 32768
##$SIGF1= 0
##$SIGF2= 0
##$SINO= 400
##$SIOLD= 32768
##$SREGLST= <1H.TFA>
##$SSB= 0
##$STSI= 32768
##$STSR= 0
##$SW_p= 5175.98343685301
##$SYMM= 0
##$S_DEV= 0
##$TDeff= 65536
##$TDoff= 0
##$TI= <Analysis number 999999
Compound Code 99
Book Reference 9
Project Code 9>
##$TILT= no
##$TM1= 0
##$TM2= 0
##$TOPLEV= 0
##$USERP1= <user>
##$USERP2= <user>
##$USERP3= <user>
##$USERP4= <user>
##$USERP5= <user>
##$WDW= 1
##$XDIM= 32768
##$YMAX_p= 330033509
##$YMIN_p= -499684
$$ End of Bruker specific parameters
$$ ---------------------------------
##NTUPLES= NMR SPECTRUM
##VAR_NAME=  FREQUENCY,     SPECTRUM/REAL,   SPECTRUM/IMAG
##SYMBOL=    X,             R,               I
##VAR_TYPE=  INDEPENDENT,   DEPENDENT,       DEPENDENT
##VAR_FORM=  AFFN,          ASDF,            ASDF
##VAR_DIM=   32768,         32768,           32768
##UNITS=     HZ,            ARBITRARY UNITS, ARBITRARY UNITS
##FACTOR=    0.157963299565203, 1,           1
##FIRST=     4132.6476996994, 0,             0
##LAST=      -1043.33573715361, 0,           0
##MIN=       -1043.33573715361, -499684,     0
##MAX=       4132.6476996994, 330033509,     0
$$ Real data points
##PAGE= N=1
##DATA TABLE= (X++(R..R)), XYDATA
$$ [...]
$$ plain form
24459 136225 142605 192620 158382 125106 216947 242824 275367 261476 266566 283072 150271 133341
24447 133341 151401 175958 182092 177747 65691 8212 55196 89125 108093 62802 37465 128318
24435 128318 166285 116900 39503 76180 128796 110550 141367 138841 109350 114050 103666 21090
24423 21090 81551 33964 56199 128884 149973 156351 180984 226331 251202 210921 199878 188153
24411 188153 201546 247061 209589 127799 55235 -30224 8203 10699 55993 36878 83100 111606
24399 111606 84344 110985 82439 33945 -51813 -58756 43428 55920 91525 53078 12888
24388 12888 413 -17189 57799 99681 37335 100998 31966 38586 151198 181832 61889
24377 61889 -5638 14143 -16471 5870 124108 97845 112697 121758 132982 128934 86872 50683
$$ packed form
24459A36225O380N0015l4238l3276R1841K5877L2543j3891N090J6506j32801j6930
24447A33341J8060K4557O134m345j12056n7479M6984L3929J8968m5291k5337R0853
24435A28318L7967m9385p7397L6677N2616j8246L0817k526k9491M700j0384q2576
24423B1090O0461m7587K2235P2685K1089O378K4633M5347K4871m0281j1043j1725
24411A88153J3393M5515l7472q1790p2564q5459L8427K496M5294j9115M6222K8506
24399A11606k7262K6641k8546m8494q5758o943J02184J2492L5605l8447m0190
24388A2888j2475j7602P4988M1882o2346O3663o9032O620J12612L0634j19943
24377F1889o7527J9781l0614K2341J18238k6263J4852R061J1224m048m2062l6189
$$ plain form
24365 50683 45147 69538 30754 38901 91440 100754 163991 190016 183836 218471 233881 122918
24353 122918 31249 21517 35985 57982 93771 115537 210536 176409 146272 147911 202751 206543
24341 206543 179390 139300 68143 56924 114321 51989 54645 82292 120250 140901 108067 4831
24329 4831 -47111 -85219 -139097 -54006 28822 84684 86691 5543 -60463 5269 23202 -2253
24317 -2253 -8367 99519 244864 252877 143754 61439 52776 15221 28569 -65766 -97706 -118231
24305 -118231 -53868 -4790 74321 176623 190224 72090 10094 33243 -6046 -37737 -58484
24294 -58484 -45276 -75623 -38603 -6218 17081 79083 123931 115997 41117 11837 51632 90704
24282 90704 151202 142239 35827 29505 -15764 36422 94356 101475 64200 97118 126646 134487
$$ packed form
24365E0683n536K4391l8784Q147N2539R314O3237K6025o180L4635J5410j10963
24353A22918r1669r732J4468K1997L5789K1766R4999l4127l0137J639N4840L792
24341B06543k7153m0090p1157j1219N7397o2332K656K7647L7958K0651l2834j03236
24329D831n1942l8108n3878Q5091Q2828N5862K007q1148o6006O5732J7933k5455
24317b253o114J07886J45345Q013j09123q2315q663l7555J3348r4335l1940k0525
24305a18231O4363M9078P9111J02302J3601j18134o1996K3149l9289l1691k0747
24294e8484J3208l0347L7020L2385K3299O2002M4848p934p4880k9280L9795L9072
24282I0704O0498q963j06412o322m5269N2186N7934P119l7275L2918K9528P841
$$ plain form
24270 134487 19496 -8745 4056 40236 68850 43644 27329 78351 -2106 -59160 41148
24259 41148 107767 28408 25850 18909 35658 96125 126936 115657 168292 124525 25934 1223
24247 1223 6199 2739 -17652 2044 13377 138224 107072 53805 -19132 -100641 -42162 54227
24235 54227 88173 43175 -4150 -34460 18526 126870 80396 46767 101644 158745 92371
24224 92371 58017 44003 129359 167394 148765 27924 15306 84972 83262 -44790 -83278
24213 -83278 -129627 -167310 -83827 -28297 -11642 11778 21278 52258 97802 67510 65043 88723
24201 88723 102183 85277 52561 20010 33150 161351 262245 233810 195059 151460 120424
24190 120424 24178 12731 23473 -31204 -49623 59494 83123 93570 101689 65144 98834
$$ packed form
24270A34487j14991k8241J2801L6180K8614k5206j6315N1022q0457n7054J00308
24259D1148O6619p9359k558o941J6749O0467L0811j1279N2635m3767r8591k4711
24247A223M976l460k0391J9696J1333J24847l1152n3267p2937q1509N8479R6389
24235E4227L3946m4998m7325l0310N2986J08344m6474l3629N4877N7101o6374
24224I2371l4354j4014Q5356L8035j8629j20841j2618O9666j710j28052l8488
24213h3278m6349l7683Q3483N5530J6655K3420R500L0980M5544l0292k467K3680
24201H8723J3460j6906l2716l2551J3140J28201J00894k8435l8751m3599l1036
24190A20424r6246j1447J0742n4677j8419J09117K3629J0447Q119l6545L3690
$$ plain form
24179 98834 84067 67310 60550 50517 41685 -102305 -112685 -63502 -28286 -96897 -177979 -155841
24167 -155841 -175189 -146336 -67817 19061 -19954 -77181 -129550 -78237 -57683 -70815 -43127
24156 -43127 -74909 -51777 -81252 -85131 1870 -5611 47388 99649 32180 39208 24871 68227
24144 68227 81241 56202 57600 47985 92699 139212 184053 160706 164995 209477 208069 133132
24132 133132 71428 36345 -29054 -34929 61290 77424 99799 79837 67984 101379 126076 93988
24120 93988 103865 -11464 50186 143407 167734 106859 111662 170041 53076 -7763 21568 32366
24108 32366 5527 -27195 6408 1863 -67583 -80094 -15868 699 -68002 -51895 -10059 -17668
24096 -17668 62945 104802 158747 190108 160587 129426 119756 98546 155950 78388 49517 70645
$$ packed form
24179I8834j4767j6757o760j0033q832j43990j0380M9183L5216o8611q1082K2138
24167a55841j9348K8853P8519Q6878l9015n7227n2369N1313K0554j3132K7688
24156d3127l1782K3132k9475l879Q7001p481N2999N2261o7469P028j4337M3356
24144F8227J3014k5039J398r615M4714M6513M4841k3347M289M4482j408p4937
24132A33132o1704l5083o5399n875R6219J6134K2375j9962j1853L3395K4697l2088
24120I3988R877j15329O1650R3221K4327o0875M803N8379j16965o0839K9331J0798
24108C2366k6839l2722L3603m545o9446j2511O4226J6567o8701J6107M1836p609
24096a7668Q0613M1857N3945L1361k9521l1161r670k1210N7404p7562k8871K1128
$$ plain form
24084 70645 79433 66519 61855 73706 68783 57364 3161 -68607 -24323 -21062 19949 -19224
24072 -19224 -60454 -67437 -86821 15673 35936 86438 108518 105835 144773 149791 157948 62592
24060 62592 -31501 -51038 21405 42548 94573 61315 -41747 -20870 10976 13085 31658 51184
24048 51184 28204 38505 73378 44290 -9163 6032 41103 -27972 -13503 7413 -3630 -21456
24036 -21456 33030 14451 14539 17018 -18184 -144586 -112354 -17995 71440 110566 88275 105729
24024 105729 149182 170477 152107 77845 28283 2319 -20408 80160 160864 102761 130794
24013 130794 126483 154887 90863 70400 169613 119353 -47055 -102796 -35893 -70097 -23143
24002 -23143 8320 58166 40042 21179 -83988 -121452 -79792 9123 86781 98505 77451
$$ packed form
24084G0645Q788j2914m664J1851m923j1419n4203p1768M4284L261M1011l9173
24072a9224m1230o983j9384J02494K0263N0502K2080k683L8938N018Q157r5356
24060F2592r4093j9537P2443K1143N2025l3258j03062K0877L1846K109J8573J9526
24048E1184k2980J0301L4873k9088n3453J5195L5071o9075J4469K0916j1043j7826
24036b1456N4486j8579Q8K479l5202j26402L2232R4359Q9435L9126k2291J7454
24024A05729M3453K1295j8370p4262m9562k5964k2727J00568Q0704n8103K8033
24013A30794m311K8404o4024k0463R9213n0260j66408n5741O6903l4204M6954
24002b3143L1463M9846j8124j8863j05167l7464M1660Q8915P7658J1724k1054
$$ plain form
23991 77451 43269 98529 75295 92287 124087 88213 43579 5335 987 41496 10532 25275
23979 25275 40986 121246 144854 36171 5967 20092 35404 25223 16341 -57882 -950 50979
23967 50979 101390 49965 -29096 -42990 -40642 -35607 8776 20571 -23441 -15604 2730 2281 -61237
23954 -61237 -72629 -90146 -93711 -58729 9559 102537 72719 21508 -251 -38056 -42265 -37840
23942 -37840 18627 20671 41433 22448 -58486 -123560 -73420 -42743 -79757 -47416 11379 24765
23930 24765 -21701 -43922 -4010 -53198 -5589 -4935 21622 69907 77296 121983 71804 32829
23918 32829 -58890 -76294 -113198 -115595 -80800 -66532 -72490 -68550 675 30490 -76124 -118989
23906 -118989 -163685 -156176 -137187 -79107 -46519 20240 41950 49877 57533 -20316 -101935 -175995
$$ packed form
23991G7451l4182N5260k3234J6992L1800l5874m4634l8244m348M0509l0964J4743
23979B5275J5711Q0260K3608j08683l0204J4125J5312j0181q882p4223N6932N1929
23967E0979N0411n1425p9061j3894K348N035M4383J1795m4012P837J8334m49o3518
23954f1237j1392j7517l565L4982O8288R2978k9818n1211k1759l7805m209M425
23942c7840N6467K044K0762j8985q0934o5074N0140L0677l7014L2341N8795J3386
23930B4765m6466k2221L9912m9188M7609O54K6557M8285P389M4687n0179l8975
23918C2829r1719j7404l6904k397L4795J4268n958L940O9225K9815j06614m2865
23906a18989m4696P509J8989N8080L2588O6759K1710P927P656p7849q1619p4060
$$ plain form
23894 -175995 -154538 -51256 97011 115067 101504 68602 77320 75175 66018 64183 -11623 -64233
23882 -64233 -75623 -5632 37336 63738 32514 125603 144969 91986 -98223 -158648 -48782
23871 -48782 12781 -37515 34204 78051 6186 -107646 -97204 -87110 -86749 -79839 8866 70733
23859 70733 25860 61655 60103 80450 107179 129963 97315 112254 150548 174530 118299 -46167
23847 -46167 -65786 -43272 -25785 -1904 6140 4887 -77960 -52969 -46203 -28594 73618 160827
23835 160827 147332 99937 81989 154026 151381 66476 -64196 -143678 -129322 -110290 -65410
23824 -65410 -25034 -6529 -89136 -63396 7488 72811 61826 63585 37357 -3114 -15975 -16528
23812 -16528 -2898 -19344 4276 75741 132609 55808 21269 -29023 25869 91378 99062 56263
$$ packed form
23894a75995K1457J03282J48267J8056j3563l2902Q718k145r157j835p5806n2610
23882f4233j1390O9991M2968K6402l1224R3089J9366n2983j90209o0425J09866
23871d8782O1563n0296P1719M3847p1865j13832J0442J0094L61O910Q8705O1867
23859G0733m4873L5795j552K0347K6729K2784l2648J4939L8294K3982n6231j64466
23847d6167j9619K2514J7487K3881Q044j253q2847K4991O766J7609J02212Q7209
23835A60827j3495m7395j7948P2037k645q4905j30672p9482J4356J9032M4880
23824f5410M0376J8505q2607K5740P0884O5323j0985J759k6228m0471j2861n53
23812a6528J3630j6446K3620P1465N6868p6801l4539n0292N4892O5509P684m2799
$$ plain form
23800 56263 37099 -8195 95619 51733 -44702 -42556 -104314 -90320 -18758 29151 38744 70986
23788 70986 111051 711 -91668 -40050 100168 83338 79701 45748 -40891 -1034 -13157
23777 -13157 -9985 20914 69717 23224 20550 -18505 -10441 -24092 -88155 -122564 -28763 -2007
23765 -2007 4214 -59857 -82813 -74989 -132900 -54560 -11783 -42208 -4998 -17392 -96172 12853
23753 12853 98468 90852 79225 104802 125726 112331 118687 70501 62923 196480 185543 108632
23741 108632 17346 43780 68289 66797 35056 4458 18372 87386 103388 159123 191550 205067
23729 205067 167596 153370 139269 90996 62257 57143 86060 66775 21761 -18589 -12616 40648
23717 40648 121494 121381 22489 -13882 72144 114841 123553 98525 77681 18767 -420 42252
$$ packed form
23800E6263j9164m5294J03814m3886r6435K146o1758J3994P1562M7909R593L2242
23788G0986M0065j10340r2379N1618J40218j6830l637l3953q6639L9857j2123
23777a3157L172L0899M8803m6493k674l9055Q064j3651o4063l4409R3801K6756
23765b007O221o4071k2956P824n7911P8340M2777l0425L7210j2394p8780J09025
23753A2853Q5615p616j1627K5577K0924j3395O356m8186p578J33557j0937p6911
23741A08632r1286K6434K4509j492l1741l0598J3914O9014J6002N5735L2427J3517
23729B05067l7471j4226j4101m8273k8739n114K8917j9285m5014m0350N973N3264
23717D0648Q0846j13r8892l6371Q6026M2697Q712k5028k0844n8914j9187M2672
$$ plain form
23705 42252 -60562 -94652 -38865 -22985 -24064 43862 71753 41291 44963 54401 30190 -13432
23693 -13432 -22223 4753 6266 -39686 -61104 -57982 -23798 76049 -15437 536 15791 2868
23681 2868 45307 29462 -24858 -152073 -152761 -49477 -19853 -54057 -106364 -97285 -119971 -79736
23669 -79736 -67424 -33736 -49968 -35354 -26090 16181 35566 9141 -51305 -89688 -128191 -58628
23657 -58628 37775 32071 -63747 -84176 -83844 -131715 -151235 -75696 -11782 104167 55452 -41739
23645 -41739 -44917 -41993 -67881 -93490 -91635 -81956 -82282 -58909 -105715 -152006 -88167 -96478 -135495
23632 -135495 -110435 -744 37629 22143 17692 -39217 -117916 -39841 10811 32848 29995 -99261
23620 -99261 -124226 -82606 -114952 -72977 -121978 -133316 -144992 -153455 -103986 -35796 20540 28438
$$ packed form
23705D2252j02814l4090N5787J5880j079O7926K7891l0462L672R438k4211m3622
23693a3432q791K6976J513m5952k1418L122L4184R9847r1486J5973J5255j2923
23681B868M2439j5845n4320j27215o88J03284K9624l4204n2307R079k2686M0235
23669g9736J2312L3688j6232J4614R264M2271J9385k6425o0446l8383l8503O9563
23657e8628R6403n704r5818k0429L32m7871j9520P5539O3914J15949m8715r7191
23645d1739l178K924k5888k5609J855R679l26K3373m6806m6291O3839q311l9017
23632a35495K5060J09691L8373j5486m451n6909p8699P8075N0652K2037k853j29256
23620i9261k4965M1620l2346M1975m9001j1338j1676q463M9469O8190N6336P898
$$ plain form
23608 28438 -40391 40313 83759 27921 -24401 -133407 -74342 -76964 -130335 -138523 -33688 -94636
23596 -94636 -112540 -71361 15756 -8005 25911 5349 -11475 13991 50440 62466 -99171
23585 -99171 -180482 -98472 -84381 -94185 -70280 -26497 26780 -54804 -132377 -89159 31928 111266
23573 111266 24801 -31181 -119327 -120599 -79871 -25525 -77634 -66705 -21603 -74238 -133017 -131713
23561 -131713 -90130 -116845 -126431 -100402 1165 28886 -4928 -2133 16717 -6550 -110354
23550 -110354 -166193 -96393 -45148 -82859 -59873 -48744 -28163 -21088 -7795 44966 36050 -30953
23538 -30953 -83761 -130722 -140358 -120609 -75664 -59951 -59517 -60783 -125795 -155483 -79811 -7623
23526 -7623 -15886 -13813 -69645 -102871 -160762 -184905 -51267 41266 32086 79803 42034 -1376
$$ packed form
23608B8438o8829Q0704M3446n5838n2322j09006N9065k622n3371q188J04835o0948
23596i4636j7904M1179Q7117k3761L3916k0562j6824K5466L6449J2026j61637
23585i9171q1311Q2010J4091r804K3905M3783N3277q1584p7573M3218J21087P9338
23573A11266q6465n5982q8146j272M0728N4346n2109J0929M5102n2635n8779J304
23561a31713M1583k6715r586K6029J01567K7721l3814K795J8850k3267j03804
23550a10354n5839O9800N1245l7711K2986J1129K0581P075J3293N2761q916o7003
23538c0953n2808m6961r636J9749M4945J5713M34j266o5012k9688P5672P2188
23526g623q263K073n5832l3226n7891k4143J33638R2533r180M7717l7769m3410
$$ plain form
23514 -1376 -7901 -119673 -216365 -141332 394 60422 66461 107050 88913 163808 110301 -6732
23502 -6732 -29340 2007 -19343 31792 111841 84461 86591 80247 46910 -3612 -64077 -19824
23490 -19824 49450 81954 147047 141915 178619 109455 -38189 -62157 -36336 7506 108759
23479 108759 -298 12755 -2783 -82011 12992 55507 34398 -59725 -155987 -106955 -111313
23468 -111313 -97756 -41354 19663 -38953 -112098 1244 30677 63540 143039 120661 80874
23457 80874 68703 51968 89314 87271 74541 -4617 -47644 47632 101276 42736 88548 117947
23445 117947 114269 249083 235937 181924 114891 93433 137493 149332 39283 62649 111010
23434 111010 51016 -5067 -44601 -34947 -59774 4902 9537 36404 -4953 -69412 -121067 -107863
$$ packed form
23514a376o525j11772r6692P5033J41726O0028O039M0589j8137P4895n3507j17033
23502f732k2608L1347k1350N1135Q0049k7380K130o344l3337n0522o0465M4253
23490a9824O9274L2504O5093n132L6704o9164j47644k3968K5821M3842J01253
23479A08759j09057J3053j5538p9228R5003M2515k1109r4123r6262M9032m358
23468a11313J3557N6402O1017n8616p3145J13342K9433L2863P9499k2378l9787
23457H0874j2171j6735L7346k043j2730p9158m3027R5276N3644n8540M5812K9399
23445A17947l678J34814j3146n4013o7033k1458M4060J1839j10049K3366M8361
23434A11010n9994n6083l9534R654k4827O4676M635K6867m1357o4459n1655J3204
$$ plain form
23422 -107863 -79220 -126640 -47929 -57644 -116535 -111306 -101009 -97543 -56774 -105542 -110945 -50441
23410 -50441 -37845 -10743 -58956 -19892 -59954 -32557 -30669 56041 91003 44703 -9531 -35799
23398 -35799 30464 72985 55584 115428 39221 73332 171385 119678 109338 88614 -46111
23387 -46111 -23955 -15909 6784 -18688 22739 71452 -17631 -5021 -5867 -64661 -71279 -70133 -60070
23374 -60070 -79977 -107448 -119577 -96540 -76277 -11531 27653 -34568 -83882 -178047 -193103 -120542
23362 -120542 -133484 -144017 -163687 -202703 -185008 -181695 -183921 -147107 -131093 5941 4242 27091
23350 27091 38229 -84009 -115026 26778 84203 25645 -9042 -26263 -43785 -145936 -168757
23339 -168757 -96241 -52074 12236 42021 24148 3183 52164 76032 2831 30772 19734
$$ packed form
23422a07863K8643m7420P8711r715n8891N229J0297L466M0769m8768n403O0504
23410e0441J2596K7102m8213L9064m0062K7397J888Q6710L4962m6300n4234k6268
23398c5799O6263M2521j7401N9844p6207L4111R8053n1707j0340k0724j34725
23387d6111K2156Q046K2693k5472M1427M8713q9083J2610q46n8794o618J146J0063
23374f0070j9907k7471j2129K3037K0263O4746L9184o2221m9314r4165j5056P2561
23362a20542j2942j0533j9670l9016J7695L313k226L6814J6014J37034j699K2849
23350B7091J1138j22238l1017J41804N7425n8558l4687j7221j7522j02151k2821
23339a68757P2516M4167O4310K9785j7873k0965M8981K3868p3201K7941j1038
$$ plain form
23328 19734 -70404 -68913 -147208 -199176 -99381 4563 -25450 -77859 -69481 -78729 -15016 -20201
23316 -20201 -11195 -7695 -50598 -19034 85857 29453 -13505 -68429 -190454 -249397 -188989 -134557
23304 -134557 -102886 -74278 -60444 -82738 -87902 -51156 -97548 -72120 -97616 -121769 -129188 -68833
23292 -68833 -20512 -55266 -15443 82871 4394 8842 -4174 16796 101676 920 -133162
23281 -133162 -97958 4533 73073 84609 89239 -11130 -40675 42647 38224 27287 -3791
23270 -3791 -66408 -79960 -123999 -76883 -73567 -15045 -12035 -75804 -126411 -113879 -14107 -10036
23258 -10036 -88524 -115463 -68206 -34636 31998 134236 91015 72350 65252 30936 82241 10412
23246 10412 -33534 -97544 -156365 -81347 55095 84235 48847 -48527 -49269 -55988 32407 73765
$$ packed form
23328A9734r0138J491p8295n1968R9795J03944l0013n2409Q378r248O3713n185
23316b0201R006L500m2903L1564J04891n6404m2958n4924j22025n8943O0408N4432
23304a34557L1671K8608J3834k2294n164L6746m6392K5428k5496k4153p419O0355
23292f8833M8321l4754L9823R8314p8477M448j3016K0970Q4880j00756j34082
23281a33162L5204J02491O8540J1536M630j00369k9545Q3322m423j0937l1078
23270c791o2617j3552m4039M7116L316N8522L010o3769n0607J2532R9772M071
23258a0036p8488k6939M7257L3570O6634J02238m3221j8665p098l4316N1305p1829
23246A0412m3946o4010n8821P5018J36442K9140l5388r7374p42o719Q8395M1358
$$ plain form
23234 73765 -7272 -13920 -57270 -105598 -27973 -38922 -90558 -3145 17158 22048 31285 66
23222 66 -12404 -35087 -70644 -49448 -14362 -10503 58919 56424 45291 24810 45367 39935 53135
23209 53135 71161 -46257 -32321 -5312 -102544 -171776 -180760 -179165 -134699 -107780 -53248 -11687
23197 -11687 -68204 -148793 -126480 -167555 -163364 -98254 -113296 -108542 -111352 -84837 -67936 -141299
23185 -141299 -49407 48347 49369 18789 139806 205091 148941 -4874 -8144 75675 44574
23174 44574 87076 146894 109469 -3745 -80091 -84312 -2592 69107 84841 52244 -40372 -39712
23162 -39712 27545 -73978 -175637 -162831 -9106 -21419 -65950 -84441 58339 110926 153585
23151 153585 98373 -30351 -4160 61034 34214 -29392 29254 66300 65130 4971 -52476
$$ packed form
23234G3765q1037o648m3350m8328P7625j0949n1636Q7413K0303M890R237l1219
23222F6j2470k2683l5557K1196L5086L859O9422k495j1133k0481K0557n432J3200
23209E3135J8026j17418J3936K7009r7232o9232q984J595M4466K6919N4532M1561
23197a1687n6517q0589K2313m1075M191O5110j5042M754k810K6515J6901p3363
23185a41299R1892R7754J022l0580J21017O5285n6150j53815l270Q3819l1101
23174D4574M2502N9818l7425j13214p6346m221Q1720P1699J5734l2597r2616O60
23162c9712O7257j01523j01659J2806J53725j2313m4531j8491J42780N2587M2659
23151A53585n5212j28724K6191O5194k6820o3606N8646L7046j170o0159n7447
$$ plain form
23140 -52476 -27999 -47149 -41552 33435 104407 111517 111763 59464 18490 54802 19459 923
23128 923 42273 136124 96532 -10322 60317 154104 116349 -19087 -82050 -46770 69461
23117 69461 8110 -31465 18077 58446 46942 29249 37033 -7533 22969 125579 53893 -13708
23105 -13708 30008 49108 152 -63359 -110193 -73828 -86185 -135527 -113441 -32159 -21300 -101922
23093 -101922 -26983 61768 84330 28028 -30157 -106445 -70195 28909 45056 47137 111648 177031
23081 177031 209050 200933 139863 82187 109654 53843 43744 32116 863 28422 110898 143197
23069 143197 143682 33530 -18511 -42136 -69756 -79214 -14017 14300 26339 41761 81038 26612
23057 26612 4995 131852 114588 52049 -48398 -85269 -79419 -77035 -18682 71484 126425 141617
$$ packed form
23140e2476K4477j9150N597P4987P0972P110K46n2299m0974L6312l5343j8536
23128I23M1350R3851l9592j06854P0639R3787l7755j35436o2963L5280J16231
23117F9461o1351l9575M9542M0369j1504j7693P784m4566L0502J02610p1686o7601
23105a3708M3716J9100m8956o3511m6834L6365j2357m9342K2086Q1282J0859q0622
23093a01922P4939Q8751K2562n6302n8185p6288L6250R9104J6147K081O4511O5383
23081A77031L2019q117o1070n7676K7467n5811j0099j1628l1253K7559Q2476L2299
23069A43197M85j10152n2041k3625k7620r458O5197K8317J2039J5422L9277n4426
23057B6612k1617J26857j7264o2539j00447l6871N850K384N8353R0166N4941J5192
$$ plain form
23045 141617 105233 35934 102912 140742 126211 101890 8917 -82890 -64928 -86620 -34721
23034 -34721 29292 59278 102895 135593 74811 9831 36764 11462 -6169 40249 -687 -20630
23022 -20630 -91752 -193692 -89967 -20486 20844 87179 89598 181151 175785 132972 87665 101033
23010 101033 104187 31405 -31912 -78506 -67812 -12060 70246 151320 97447 10337 -85881 -101975
22998 -101975 -117997 -139301 -100321 17370 75576 55200 63721 22980 -87579 -88526 -12313 137174
22986 137174 116299 13125 -72583 -111111 -59628 -4444 8691 -22470 15399 62521 67349
22975 67349 26767 18907 49453 97971 67373 6205 72875 53496 24836 10510 47224 14275
22963 14275 -36934 -90640 -108278 -52694 7013 -8364 -13093 -14286 12984 25397 2864 -45331
$$ packed form
23045A41617l6384o9299O6978L7830j4531k4321r2973r1807J7962k1692N1899
23034c4721O4013K9986M3617L2698o0782o4980K6933k5302j7631M6418m0936j9943
23022b0630p1122j01940J03725O9481M1330O6335K419R1553n366m2813m5307J3368
23010A01033L154p2782o3317m6594J0694N5752Q2306Q1074n3873q7110r6218j6094
22998a01975j6022k1304L8980J17691N8206k0376Q521m0741j10559r47P6213J49487
22986A37174k0875j03174q5708l8528N1483N5184J3135l1161L7869M7122M828
22975F7349m0582p860L0546M8518l0598o1168O6670j9379k8660j4326L6714l2949
22963A4275n1209n3706j7638N5584N9707j5377m729j193K7270J2413k2533m8195
$$ plain form
22951 -45331 -98391 -117208 -70510 -59846 -149418 -153025 -19741 42769 96733 77071 15761 -27990
22939 -27990 -62266 7891 114841 163418 74258 -39669 -47271 -23356 -27082 -124008 -148360 -166932
22927 -166932 -87473 -52734 -22664 -71928 -50396 -1224 31170 36663 140103 182882 94708
22916 94708 15078 6462 -9897 4727 7010 -63145 -91642 -34763 3239 -6051 20575 33591
22904 33591 5214 4302 -46134 -81452 86740 164264 132181 50041 23301 33276 -5294 -67871
22892 -67871 -24543 59450 63170 4886 -329 59313 42764 3704 27282 -3135 8579 94036
22880 94036 184688 161676 51706 55694 44852 81332 172543 166347 77919 19682 13413 104856
22868 104856 112567 30060 -85416 -146737 -94113 -8387 61855 204932 150094 81116 102518
$$ packed form
22951d5331n3060j8817M6698J0664q9572l607J33284O2510N3964j9662o1310m3751
22939b7990l4276P0157J06950M8577q9160j13927p602K3915l726r6926k4352j8572
22927a66932P9459L4739L0070m9264K1532M9172L2394N493J03440M2779q8174
22916I4708p9630q616j6359J4624K283p0155k8497N6879L8002r290K6626J3016
22904C3591k8377r12n0436l5318J68192P7524l2083q2140k6740R975l8570o2577
22892f7871M3328Q3993L720n8284n215N9642j6549l9060K3578l0417J1714Q5457
22880I4036R0652k3012j09970L988j0842L6480R1211o196q8428n8237o269R1443
22868A04856P711q2507j15476o1321N2624Q5726P0242J43077n4838o8978K1402
$$ plain form
22857 102518 73544 68133 15157 -37559 -61935 -28957 -12186 36518 -7520 -21725 13072 -97015
22845 -97015 -120655 -70202 -16602 52000 4730 23841 -9667 -120709 -48089 -45931 -993 69608
22833 69608 61581 32690 3817 -32055 -70791 -67682 -70342 -113918 -88271 24985 23789 -80168
22821 -80168 -201341 -208423 -179146 -182638 -169184 -104293 -20671 -34095 -24656 13934 -42265 -36387
22809 -36387 -93581 -96734 -131569 -118919 -36639 -15275 12151 58006 -8476 -47968 -23398 -30690
22797 -30690 -50402 -48855 -49936 -66242 18242 44519 15828 -80560 -121343 -95629 -91137 801
22785 801 28268 -84488 -86044 4060 68085 18443 -50057 -153110 -199859 -127268 -23808 12469
22773 12469 -17985 -84072 -149665 -92416 -24476 84948 69320 51615 22655 30023 88118 19551
$$ packed form
22857A02518k8974n411n2976n2716k4376L2978J6771M8704m4038j4205L4797j10087
22845i7015k3640N0453N3600O8602m7270J9111l3508j11042P2620K158M4938P0601
22833F9608q027k8891k8873l5872l8736L109k660m3576K5647J13256j196j03957
22821h0168j21173p082K9277l492J3454O4891Q3622j3424R439L8590n6199N878
22809c6387n7194l153l4835J2650Q2280K1364K7426M5855o6482l9492K4570p292
22797c0690j9712J547j081j6306Q4484K6277k8691r6388m0783K5714M492R1938
22785H01K7467j12756j556R0104O4025m9642o8500j03053m6749P2591J03460L6277
22773A2469l0454o6087o5593N7249O7940J09424j5628j7705k8960P368N8095o8567
$$ plain form
22761 19551 -21146 -44218 -98672 -197177 -151229 -92105 -20744 39957 -2229 -31899 2944 18110
22749 18110 22652 30533 46671 53485 54751 50328 2715 -37466 -53502 -126957 -219790 -110456
22737 -110456 14805 32939 -51566 -130796 -148570 -145630 -66614 -29176 17196 -32869 -40544 -6556
22725 -6556 23021 -24596 -8634 10463 17555 7333 -62390 -167975 -154400 -16215 -9524 -44719
22713 -44719 -51941 -51413 -92835 -56563 31367 18345 -4045 11071 -34728 -98127 -63421 -18382
22701 -18382 -17427 -27079 15276 139270 202964 130838 111446 69061 -22275 -35904 -27663 -82926
22689 -82926 -39214 36262 -6247 -69140 -71323 -79257 -70407 7481 -13426 -54655 -22288 70694
22677 70694 12368 -51804 -19045 77221 87828 54619 17090 62921 36813 -25312 -43205 -8616
$$ packed form
22761A9551m0697k3072n4454r8505M5948N9124P1361O0701m2186k9670L4843J5166
22749A8110M542P881J6138O814J266m423m7613m0181j6036p3455r2833J09334
22737a10456J25261J8134q4505p9230j7774K940P9016L7438M6372n0065p675L3988
22725f556K9577m7617J5962J9097P092j0222o9723j05585J3575J38185O691l5195
22713d4719p222N28m1422L6272Q7930j3022k2390J5116m5799o3399L4706M5039
22701a8382R55r652M2355J23994O3694p2126j9392m2385r1336j3629Q241n5263
22689h2926M3712P5476m2509o2893k183p934Q850P7888k0907m1229L2367R2982
22677G0694n8326o4172L2759R6266J0607l3209l7529M5831k6108o2125j7893L4589
$$ plain form
22665 -8616 -35542 -95688 -157718 -190295 -95245 -30569 5205 28176 55348 -46850 -79910 20666
22653 20666 46334 -24696 -90998 -138850 -191911 -79627 -81591 -128904 -189620 -206466 -131405 -134574
22641 -134574 -172128 -86476 -54393 -3119 8321 -34034 -69625 -36890 -98853 -90874 -41611 -25323
22629 -25323 85255 -17048 -52738 -26825 -68412 -140317 -147495 -156672 -147529 -96285 -57750 -48251
22617 -48251 -94197 -67633 44897 54474 -73489 -111133 -112759 -66978 19423 -58241 -88010 -33795
22605 -33795 -15668 -14398 -42212 -6643 79297 114318 62541 -61035 -84901 -89134 -51262 -64960
22593 -64960 -79234 -83890 14825 104859 124681 61353 -6753 45555 79978 150272 128441 25316
22581 25316 35915 26871 -16861 9252 -5429 34600 -7729 -42073 -129274 -179706 -222985 -130416
$$ packed form
22665h616k6926o0146o2030l2577R5050O4676L5774K2971K7172j02198l3060J00576
22653B0666K5668p1030o6302m7852n3061J12284j964m7313o0716j6846P5061l169
22641a34574l7554Q5652L2083N1274J1440m2355l5591L2735o1963P979M9263J6288
22629b5323J10578j02303l5690K5913m1587p1905p178r177R143N1244L8535R499
22617d8251m5946K6564J12530R577j27963l7644j626M5781Q6401p7664k9769N4215
22605c3795J8127J270k7814L5569Q5940L5021n1777j23576k3866m233L7872j3698
22593f4960j4274m656R8715R0034J9822o3328o8106N2308L4423P0294k1831j03125
22581B5316J0599r044m3732K6113j4681M0029m2329l4344q7201n0432m3279R2569
$$ plain form
22569 -130416 -165057 -95195 -13121 -51802 -51313 -84898 -74072 -71060 -85899 -48056 -36510 -7152
22557 -7152 9702 -8036 56736 101810 30614 -56784 28889 114291 96912 89324 140634 114623
22545 114623 87012 91732 42675 -34085 -88537 -2780 23533 22473 44743 173487 183091 194038
22533 194038 98445 43632 98691 93266 79668 42734 -425 -55189 -18103 103615 146022
22522 146022 94939 45880 -11810 -36215 -38952 28717 28796 99271 172852 66223 -6741 -57037
22510 -57037 -51477 -45455 -48658 -43438 24667 39962 96533 115775 -1788 -76300 -125394 -81936
22498 -81936 -33873 -64356 -35060 -14934 77497 39142 63898 104566 78891 3892 -1023 -57469
22486 -57469 -49931 94965 112362 56788 -1958 -21106 18657 20036 2350 -5407 -55742 -29748
$$ packed form
22569a30416l4641O9862Q2074l8681M89l3585J0826L012j4839L7843J1546K9358
22557g152J6854j7738O4772M5074p1196q7398Q5673Q5402j7379p588N1310k6011
22545A14623k7611M720m9057p6760n4452Q5757K6313j060K2270J28744R604J0947
22533A94038r5593n4813N5059n425j3598l6934m3159n4764L7086J21718M2407
22522A46022n1083m9059n7690k4405k737O7669P9P0475P3581j06629p2964n0296
22510e7037N560O022l203N220O8105J5295N6571J9242j17563p4512m9094M3458
22498h1936M8063l0483K9296K0126R2431l8355K4756M0668k5675p4999m915n6446
22486e7469P538J44896J7397n5574n8746j9148L9763J379j7686p757n0335K5994
$$ plain form
22474 -29748 5312 -17625 -5659 -50703 -134645 -130625 -134397 -82349 -22877 36350 2877 49993
22462 49993 109583 114604 93840 68719 -37954 937 168904 89109 68635 83742 96534
22451 96534 163765 123698 55032 116602 96177 87640 41066 -38432 -29188 105310 198081 94351
22439 94351 22741 -59522 -9462 83471 53793 42774 52858 36474 6421 -26583 -46691 -54301
22427 -54301 12721 24915 43774 89210 40055 -28842 -138677 -40712 44179 28275 -43426
22416 -43426 -4364 44848 12247 -17940 1561 74844 67767 -1853 -50301 -56255 -10734 44268
22404 44268 -23629 -115842 -31701 64200 43952 54093 2400 -37765 -12103 10395 95176 129677
22392 129677 54754 3933 -2609 -23987 -21840 28655 -3656 -70058 -53893 -132829 -128281 -55506
$$ packed form
22474b9748L5060k2937J1966m5044q3942M020l772N2048N9472N9227l3473M7116
22462D9993N9590N021k0764k5121j06673L8891J67967p9795k0474J5107J2792
22451I6534O7231m0067o8666O1570k0425q537m6574p9498R244J34498R2771j03730
22439I4351p1610q2263N0060R2933k9678j1019J0084j6384l0053l3004k0108p610
22427e4301O7022J2194J8859M5436m9155o8897j09835R7965Q4891j5904p1701
22416d3426L9062M9212l2601l0187J9501P3283p077o9620m8448n954M5521N5002
22404D4268o7897r2213Q4141R5901k0248J0141n1693m0165K5662K2498Q4781L4501
22392A29677p4923n0821o542k1378K147N0495l2311o6402J6165p8936M548P2775
$$ plain form
22380 -55506 -74888 -194044 -202363 -140860 -80619 -10936 -27299 -61340 -76750 -66618 -98062 -109887
22368 -109887 -4830 30554 -78996 -94700 -120304 -12981 9484 17001 37505 75487 163256
22357 163256 205838 168556 52480 23796 -103838 -125879 -47080 119639 190079 160303 60191
22346 60191 -46480 -65200 -42448 -56098 -119893 -160814 -131688 -64639 -13109 -46619 -37664 42201
22334 42201 75076 -29810 -27593 -25551 -16991 -14395 -21070 -64041 21464 142270 76374 27137
22322 27137 6548 -3769 -59881 -40116 37325 -28443 -23737 31328 -28997 -73306 -47648 62755
22310 62755 86567 -26644 -98086 -117079 -57575 42249 71978 120243 87170 35776 -7395
22299 -7395 -69566 -36666 21158 66842 60426 -20814 -58154 64326 96455 74687 119313 80739
$$ packed form
22380e5506j9382j19156q319O1503O0241O9683j6363l4041j5410J0132l1444j1825
22368a09887J05057L5384j09550j5704k5604J07323K2465P517K0504L7982Q7769
22357A63256M2582l7282j16076k8684j27634k2041P8799J66719P0440k9776j00112
22346F0191j06671j8720K2752j3650o3795m0921K9126O7049N1530l3510Q955P9865
22334D2201L2875j04886K217K042Q560K596o675m2971Q5505J20806o5896m9237
22322B7137k0589j0317n6112J9765P7441o5768M706N5065o0325m4309K5658J10403
22310F2755K3812j13211p1442j8993N9504R9824K9729M8265l3073n1394m3171
22299g395o2171L2900N7824M5684o416q1240l7340J22480L2129k1768M4626l8574
$$ plain form
22287 80739 -28241 -131183 -58397 -45783 -23378 40802 37605 -24298 -78687 -31216 -25304 -22702
22275 -22702 -25217 7493 -13806 5187 11671 -60964 -143472 -135750 -65445 -27505 -3499 -43798
22263 -43798 -64436 -61569 -64780 -76985 -32273 -51219 -68316 31546 118281 164122 87652 77116
22251 77116 9222 -47526 -56195 -75518 -55429 62232 68972 56454 22306 3370 -67288 -138498
22239 -138498 -102788 24199 -8847 -23928 21895 39035 -30704 -3794 6899 22642 -35786
22228 -35786 -35823 86453 110440 67720 -64840 -37828 79980 50163 33003 62204 -71209
22217 -71209 -119447 -83383 5659 -17445 -13895 15798 16538 -10307 69411 36717 102712 108281
22205 108281 116160 119479 17402 20381 68176 -6232 -55071 -23220 4015 81444 123535 114990
$$ packed form
22287H0739j08980j02942P2786J2614K2405O4180l197o1903n4389M7471N912K602
22275b2702k515L2710k1299J8993O484p2635q2508P722P0305L7940K4006m0299
22263d3798k0638K867l211j2205M4712j8946j7097R9862Q6735M5841p6470j0536
22251G7116o7894n6748q669j9323K0089J17661O740j2518l4148j8936p0658p1210
22239a38498L5710J26987l3046j5081M5823J7140o9739K6910J0693J5743n8428
22228c5786l7J22276K3987m2720j32560K7012J17808k9817j7160K9201j33413
22217g1209m8238L6064Q9042k3104L550K9693P40k6845P9718l2694O5995N569
22205A08281P879L319j02077K979M7795p4408m8839L1851K7235P7429M2091q545
$$ plain form
22193 114990 40259 47441 -6849 -108941 -94882 -22551 -67355 -21998 -21226 -6551 -74963 -137882
22181 -137882 -140521 -122402 -170479 -152031 -69172 -84910 -56534 -54348 -85063 -59333 -36394 -25714
22169 -25714 -12934 10298 -86834 -89434 -15465 -2749 -27530 -66374 -96081 -128440 -74407 15751
22157 15751 -14990 -61271 -53593 -60733 -13808 68846 97403 136395 151801 163203 64932 -27304
22145 -27304 -11585 7131 14502 -22203 711 30178 -10923 55119 89650 -34840 -90815 -55720
22133 -55720 -11954 28335 25578 -15390 -44703 4452 2716 20960 -37940 -29892 -53226 6614
22121 6614 73257 -26264 -45191 41158 69373 28099 -21648 -94996 -62017 -130190 -173701 -126259
22109 -126259 4513 5598 -65096 -112932 -76372 45333 -10405 -25739 -25694 -78535 -154398 -107501
$$ packed form
22193A14990p4731P182n4290j02092J4059P2331m4804M5357P72J4675o8412o2919
22181a37882k639J8119m8077J8448Q2859j5738K8376K186l0715K5730K2939J0680
22169b5714J2780K3232r7132k600P3969J2716k4781l8844k9707l2359N4033R0158
22157A5751l0741m6281P678p140M6925Q2654K8557L8992J5406J1402r8271r2236
22145b7304J5719J8716P371l6705K2914K9467m1101O6042L4531j24490n5975L5095
22133e5720M3766M0289k757m0968k9313M9155j736J8244n8900Q048k3334N9840
22121F614O6643r9521j8927Q6349K8215m1274m9747p3348L2979o8173m3511M7442
22109a26259J30772J085p0694m7836L6560J21705n5738j5334M5n2841p5863M6897
$$ plain form
22097 -107501 -100578 -84692 -99439 -111835 -64336 -63158 -33263 11587 -44232 -2248 -3875 -544
22085 -544 44658 32788 -10932 -58872 -48977 -32865 -13614 -120748 -147234 -131491 -147435 -35606
22073 -35606 27633 64634 50965 71085 91384 162098 145055 91119 52238 7574 16747 92023
22061 92023 129086 28516 5124 -10607 -6968 31928 73492 23433 -11862 45560 -4266 -6644
22049 -6644 -38009 -56547 -60934 -46959 -56353 -126650 -133198 -98502 -48219 9248 -8929 -76461
22037 -76461 -95892 8461 96100 52020 241 10417 52713 56204 51143 -21453 -96376 -35631
22025 -35631 33191 50609 73053 114017 53590 13460 30817 57567 3611 2011 -56622 -19861
22013 -19861 -10610 -35448 39939 54034 62588 146568 104986 42288 -57094 -92167 -124071 -77738
$$ packed form
22097a07501O923J5886j4747j2396M7499J178K9895M4850n5819M1984j627L331
22085e44M5202j1870m3720m7940R895J6112J9251j07134k6486J5743j5944J11829
22073c5606O3239L7001j3669K0120K0299P0714j7043n3936l8881m4664R173P5276
22061I2023L7063j00570k3392j5731L639L8896M1564n0059l5295N7422m9826k378
22049f644l1365j8538m387J3975r394p0297o548L4696N0283N7467j8177o7532
22037g6461j9431J04353Q7639m4080n1779J0176M2296L491n061p2596p4923O0745
22025c5631O8822J7418K2444M0964o0427m0130J7357K6750n3956j600n8633L6761
22013a9861R251k4838P5387J4095Q554Q3980m1582o2698r9382l5073l1904M6333
$$ plain form
22001 -77738 -45094 -81682 -80643 -50311 -26665 43748 17893 -65545 -119377 -47918 -46274 -78751
21989 -78751 -67136 -36664 -89593 -121462 -78966 -94635 -108885 -78080 -35278 23960 17011 -49041
21977 -49041 -72542 -62426 -66955 -41213 23535 18599 -18329 23272 16726 20741 67505 43725
21965 43725 -45132 -169441 -263188 -187063 -57162 7675 -3790 27948 21778 47668 -5258
21954 -5258 -26270 11484 40912 1716 79421 92577 18232 -35394 -29234 -2119 -29934 -26104
21942 -26104 -291 1681 23883 20392 7635 -25419 -74056 -90652 -60860 -85531 -77168 -55327
21930 -55327 7745 101923 148862 63757 10914 -118935 -145959 -69666 -56148 -82816 -136852
21919 -136852 -171279 -136143 -177381 -121594 -71978 -55782 -58322 -3972 -45691 -37917 1464 -64796
$$ packed form
22001g7738L2644l6588J039L0332K3646P0413k5855q3438n3832P1459J644l2477
21989g8751J1615L0472n2929l1869M2496j5669j4250L0805M2802N9238o949o6052
21977d9041k3501J0116m529K5742O4748m936l6928M1601o546M015M6764k3780
21965D3725q8857j24309r3747P6125J29901O4837j1465L1738o170K5890n2926
21954e258k1012L7754K9428l9196P7705J3156p4345n3626O160K7115k7815L830
21942b6104K5813J972K2202l491j2757l3054m8637j6596K9792k4671Q363K1841
21930e5327O3072R4178M6939q5105n2843j29849k7024P6293J3518k6668n4036
21919a36852l4427L5136m1238N5787M9616J6196k540N4350m1719P774L9381o6260
$$ plain form
21907 -64796 -67278 -15835 12376 2736 -5956 -29564 -20502 -24133 -50031 -14703 -50486 -148351 -183084
21894 -183084 -143825 -76730 -34169 -75439 -50887 -108316 -225020 -125718 -49849 -22576 53554
21883 53554 64172 -2075 -80984 -140815 -67924 3157 -7536 -52105 -33579 -16841 24773 18997
21871 18997 -26801 -43487 -111752 -197087 -137498 -126313 -77333 43944 53544 32553 16550 70800
21859 70800 -18334 -148266 -145724 -151461 -134900 -122163 -23863 133926 69397 -57089 -108417
21848 -108417 -61241 -101618 -66529 -86151 -127747 -75900 -39149 -72491 -146874 -146600 -87794 -8298
21836 -8298 -81173 -142486 -140626 -143108 -145252 -196319 -208028 -188988 -91236 -40006 42423 69672
21824 69672 73755 45537 -48276 -36915 -57169 -111383 -77648 -6513 -78032 -165482 -96593 -5949
$$ packed form
21907f4796k482N1443K8211r640q692k3608R062l631k5898L5328l5783r7865l4733
21894a83084L9259O7095M2561m1270K4552n7429j16704R9302P5869K7273P6130
21883E3554J0618o6247p8909n9831P2891P1081j0693m4569J8526J6738M1614n776
21871A8997m5798j6686o8265q5335N9589J1185M8980J21277R600k0991j6003N4250
21859G0800q9134j29932K542n737J6561J2737R8300J57789o4529j26486n1328
21848a08417M7176m0377L5089j9622m1596N1847L6751l3342p4383K74N8806P9496
21836h298p2875o1313J860k482k144n1067j1709J9040R7752N1230Q2429K7249
21824F9672M083k8218r3813J1361k0254n4214L3735P1135p1519q7450O8889R0644
$$ plain form
21812 -5949 -30277 -23508 -86648 -66988 -36236 -52046 -73616 -43670 -3770 79288 54504 -52636
21800 -52636 -156402 -160156 -162471 -91056 3669 -4066 -2891 -37926 -45724 9013 38616 -17027
21788 -17027 -24783 -60427 -136583 -76514 35536 31897 64948 39299 -4194 -5856 26948 32363
21776 32363 11051 1201 58560 108813 63451 68303 112349 150820 87194 -8405 2187 51307
21764 51307 96255 59070 46511 68572 97073 92837 111457 68741 82158 109845 93225 85252
21752 85252 119108 79949 34283 -36630 13763 44004 29883 45087 20709 -22789 -51183 48447
21740 48447 39906 64951 20356 -2116 2572 -40121 -39204 7273 35207 -70231 -103332 5985
21728 5985 15835 -96527 -121120 2788 -12217 -33287 13425 -12480 85074 144843 209032 208159
$$ packed form
21812e949k4328O769o3140J9660L0752j5810k1570K9946L9900Q3058k4784j07140
21800e2636j03766l754k315P1415R4725p735J175l5035p798N4737K9603n5643
21788a7027p756l5644p6156O0069J12050l639L3051k5649m3493j662L2804N415
21776C2363k1312r850N7359N0253m5362M852M4046L8471o3626r5599J0592M9120
21764E1307M4948l7185j2559K2061K8501m236J8620m2716J3417K7687j6620p973
21752H5252L3856l9159m5666p0913N0393L0241j4121J5204k4378m3498k8394R9630
21740D8447q541K5045m4595k2472M688m2693R17M6477K7934j05438l3101J09317
21728E985R850j12362k4593J23908j5005k1070M6712k5905R7554N9769O4189q73
$$ plain form
21716 208159 129811 191631 190922 171596 104971 48332 56449 70660 126967 113782 -34180 -125532
21704 -125532 -86168 -10847 53297 23710 -7911 35080 33396 46514 7709 -57782 -28387 27532
21692 27532 -12729 -64796 -88026 -58491 -106214 -158060 -114601 35898 126166 81661 49691
21681 49691 16278 -72256 -171734 -155948 -123965 -99736 -28712 53127 3479 -112048 -20402
21670 -20402 139460 194850 99672 52941 78468 61162 17286 10998 1396 -33910 -18162 -22739
21658 -22739 -57478 -32281 -29637 -80488 -25335 7712 3054 47540 41919 10712 -20926 -6367
21646 -6367 -21612 -67459 -49637 -13910 -6158 34936 47393 39359 72538 135788 133168 34672
21634 34672 -9918 46603 129915 65326 -75334 -176016 -273287 -315893 -120973 -40829 31014
$$ packed form
21716B08159p8348O1820p09j9326o6625n6639Q117J4211N6307j3185j47962r1352
21704a25532L9364P5321O4144k9587l1621M2991j684J3118l8805o5491K9395N5919
21692B7532m0261n2067k3230K9535m7723n1846M3459J50499R0268m4505l1970
21681D9691l3413q8534r9478J5786L1983K4229P1024Q1839m9648j15527R1646
21670b0402J59862N5390r5178m6731K5527j7306m3876o288r602l5306J5748m577
21658b2739l4739K5197K644n0851N5153L3047m658M4486n621l1207l1638J4559
21646f367j5245m5847J7822L5727P752M1094J2457q034L3179O3250k620r8496
21634C4672m4590N6521Q3312o4589j40660j00682r7271m2606J94920Q0144P1843
$$ plain form
21623 31014 55852 86590 5365 -40286 -12503 39810 -1012 8735 -31018 -126842 -171976 -134425
21611 -134425 -3425 60708 72460 157141 81623 -81706 -80310 -147673 -187953 -116883 -29723
21600 -29723 83015 77804 58205 38967 10606 -3051 5544 -13703 -56692 -87048 -42474 13162
21588 13162 -39950 18200 40844 -46461 -89602 -83020 7587 63092 130161 188143 132157 151462
21576 151462 143394 112982 153467 112101 -24715 3135 136817 113680 46018 44327 71740
21565 71740 41244 -19822 -35196 -75747 -38483 -33781 -62974 -79306 -76339 -31407 64499 90948
21553 90948 94904 43091 83894 81650 -13556 -52156 -1722 42925 -15809 1519 20568 -24469
21541 -24469 41569 33317 27490 36136 101219 88145 32555 17687 -28154 -16298 -43683 -148414
$$ packed form
21623C1014K4838L0738q1225m5651K7783N2313m0822R747l9753r5824m5134L7551
21611a34425J31000O4133J1752Q4681p5518j63329J396o7363m0280P1070Q7160
21600b9723J12738n211j9599j9238k8361j3657Q595j9247m2989l0356M4574N5636
21588A3162n3112N8150K2644q7305m3141O582R0607N5505O7069N7982n5986J9305
21576A51462q068l0412M0485m1366j36816K7850J33682k3137o7662j691K7413
21565G1740l0496o1066j5374m0551L7264M702k9193j6332K967M4932R5906K6449
21553I0948L956n1813M0803k244r5206l8600N0434M4647n8734J7328J9049m5037
21541b4469O6038q252n827Q646O5083j3074n5590j4868m5841J1856k7385j04731
$$ plain form
21529 -148414 -142076 -83997 -48314 -31273 -14518 -38667 -91772 -123651 -29382 50867 65479 43207
21517 43207 5543 -15314 -23120 -31083 -38199 -51612 -106182 -75661 -57287 -98202 -71972 -116620
21505 -116620 -153855 -40395 49251 25906 -12829 28141 71390 64093 27809 -52598 -101731
21494 -101731 -65227 -41095 7923 -16554 -49131 -18075 -33345 -7722 126652 162790 38066
21483 38066 -80072 -84426 -68135 -4140 3162 -44224 -99495 -89116 -76388 -109565 -74341 -77997
21471 -77997 -115896 -112253 -74209 -53690 -30116 43735 -10962 8807 40298 658 -83104 -114478
21459 -114478 -68146 -97130 -127355 -74393 -15172 33102 81505 116031 32543 8118 -27482
21448 -27482 -15241 48016 -3960 -32334 -18446 -63724 -100085 -82364 -57441 -23033 107300
$$ packed form
21529a48414O338N8079L5683J7041J6755k4149n3105l1879R4269Q0249J4612k2272
21517D3207l7664k0857p806p963p116j3413n4570L0521J8374m0915K6230m4648
21505a16620l7235J13460Q9646k3345l8735M0970M3249p297l6284q0407m9133
21494a01731L6504K4132M9018k4477l2577L1056j5270K5623J34374L6138j24724
21483C8066j18138m354J6291O3995P302m7386n5271J0379J2728l3177L5224l656
21471g7997l7899L643L8044K0519K3574P3851n4697J9769L1491l9640q3762l1374
21459a14478M6332k8984l0225N2962N9221M8274M8403L4526q3488k4425l5600
21448b7482J2241O3257n1976k8374J3888m5278l6361J7721K4923L4408J30333
$$ plain form
21437 107300 200689 13115 -20896 -16289 1936 -8303 1859 47588 53658 4816 -71532 -85237
21425 -85237 -69826 -71939 -100245 -110687 -183521 -198324 -110982 -72727 -93480 -43397 -57879 -15980
21413 -15980 -78255 -81292 -85523 -55476 -78422 -70910 -50134 -25468 15621 -35030 -56162 70489
21401 70489 171730 62932 8103 -91503 -106581 -105449 -60535 -23627 -51340 -35653 13792
21390 13792 14617 39844 52236 17391 17474 152328 197179 142485 87480 85237 131913 106820 45129
21377 45129 -51173 -69793 -49305 6834 48347 -63053 -194846 -151044 -41411 -14736 -29395
21366 -29395 -61633 -97187 -50995 -18084 -18549 -45740 -46610 -28564 -72018 -61721 -57620 -70777 -89788
21353 -89788 -43315 23041 -13854 -76258 -59362 -14747 -1068 -16848 -59083 6857 -22765 -114229
$$ packed form
21437A07300R3389j87574l4011M607J8225j0239J0162M5729O070m8842p6348j3705
21425h5237J5411k113k8306j0442p2834j4803Q7342L8255k0753N0083j4482M1899
21413a5980o2275l037m231L0047k2946P512K0776K4666M1089n0651k1132J26651
21401G0489J01241j08798n4829r9606j5078J132M4914L6908k7713J5687M9445
21390A3792Q25K5227J2392l4845Q3J34854M4851n4694n5005k243M6676k5093o1691
21377D5129r6302j8620K0488N6139M1513j11400j31793M3802J09633K6675j4659
21366b9395l2238l5554M6192L2911m65k7191q70J8046m3454J0297M101j3157j9011
21353h9788M6473O6356l6895o2404J6896M4615J3679j5780m2235O5940k9622r1464
$$ plain form
21341 -114229 -181604 -120950 -9059 12003 -485 94161 39093 -21116 7065 17177 5145
21330 5145 12064 9891 -19083 -28779 -31980 14580 145527 162043 87177 24374 7261 -69629
21318 -69629 -143534 -170349 -153151 -50126 90665 55915 59747 19689 -36004 -78803 -58173
21307 -58173 231 -12950 4326 27087 -38287 -41675 -49383 -27690 -36595 50520 127423 52244
21295 52244 70723 123586 81476 47360 43813 116315 95346 92810 72656 10102 -90289 -102872
21283 -102872 -144137 -166126 -104625 -60472 -79576 14144 62026 97076 54631 -10968 43258
21272 43258 93169 113749 45373 79640 57004 -12821 -69662 -84872 2191 115948 101203
21261 101203 115806 18520 -16811 -49300 -32883 -119469 -192204 -156103 -85068 -135500 -114868
$$ packed form
21341a14229o7375O0654J11891K1062j2488R4646n5068o0209K8181J0112j2032
21330E145O919k173k8974r696l201M6560J30947J6516p4866o2803j7113p6890
21318f9629p3905k6815J7198J03025J40791l4750L832m0058n5693m2799K0630
21307e8173N8404j3181J7276K2761o5374l388p708K1693q905Q7115P6903p5179
21295E2244J8479N2863m2110l4116l547P2502k0969k536k0154o2554j00391j2583
21283a02872m1265k1989O1501M4153j9104R3720M7882L5050m2445o5599N4226
21272D3258M9911K0580o8376L4267k2636o9825n6841j5210Q7063J13757j4745
21261A01203J4603r7286l5331l2489J6417q6586p2735L6101P1035n0432K0632
$$ plain form
21250 -114868 -38108 22152 -35887 -21571 75286 44481 1352 -1873 -3332 40657 -7513 -78540
21238 -78540 -91179 -22459 -13369 -66036 -10934 11493 92170 110998 -7139 -118923 -120172 -117121
21226 -117121 -83905 -151148 -165358 -205259 -127101 -55187 1506 27068 27539 3491 -16001 -10126
21214 -10126 43361 104211 18552 -390 -6951 141301 131236 -12001 -27393 -61946 -18924
21203 -18924 119106 177716 107198 -11783 -50173 17581 87219 107663 66682 81615 118484
21192 118484 110829 92466 70903 -11398 -6506 -5089 -26311 -132874 -180836 -109802 -61233 -33904
21180 -33904 -108140 -151103 -86850 -114078 -145513 -167094 -151437 -57397 10208 71759 113303 149039
21168 149039 73184 2406 -14904 16691 39547 53428 25526 -17019 -54458 -124283 -104059
$$ packed form
21250a14868P6760O0260n8039J4316R6857l0805m3129l225j459M3989m8170p1027
21238g8540j2639O8720R090n2667N5102K2427Q0677J8828j18137j11784j249L051
21226a17121L3216o7243j4210l9901P8158P1914N6693K5562M71k4048j9492N875
21214a0126N3487O0850q5659j8942o561J48252j0065j43237j5392l4553M3022
21203a8924J38030N8610p0518j18981l8390O7754O9638K0444m0981J4933L6869
21192A18484p655j8363k1563q2301M892J417k1222j06563m7962P1034M8569K7329
21180c3904p4236m2963O4253k7228l1435k1581J5657R4040O7605O1551M1544L5736
21168A49039p5855p0778j7310L1595K2856J3881k7902m2545l7439o9825K0224
$$ plain form
21157 -104059 -37772 52156 85742 101692 26270 -21902 -62334 -119087 -154738 -81917 -34929
21146 -34929 20265 20215 -44 -25617 -14156 -5870 -35982 -68226 -26957 -71678 -57755 -5706
21134 -5706 63629 195331 199392 95908 22640 -95050 -95881 -79399 -127283 -51471 -102001 -80589
21122 -80589 -126342 -129224 -170750 -105320 -78013 -69943 8223 30051 18108 -120997 -126196 -96569
21110 -96569 -63399 -51657 10814 -39250 7885 48294 57072 86325 21149 -71235 -124694 -140013
21098 -140013 -39515 -43415 -70677 -65558 -33925 -73050 -85166 -53535 -118180 -135683 -224924 -264307
21086 -264307 -155037 -38024 -65262 -61214 10118 41555 5746 59660 50306 -49758 -27298
21075 -27298 75095 13519 59301 66934 31152 19928 -27412 -57872 -113460 -179919 -182565 -142429
$$ packed form
21157a04059O6287Q9928L3586J5950p5422m8172m0432n6753l5651P2821M6988
21146c4929N5194n0k0259k5573J1461Q286l0112l2244M1269m4721J3923N2049
21134e706O9335J31702M061j03484p3268j17690q31J6482m7884P5812n0530K1412
21122h0589m5753k882m1526O5430K7307Q070P8166K1828j1943j39105n199K9627
21110i6569L3170J1742O2471n0064M7135M0409Q778K9253o5176r2384n3459j5319
21098a40013J00498l900k7262N119L1633l9125j2116L1631o4645j7503q9241l9383
21086b64307J09270J17013k7238M048P1332L1437l5809N3914r354j00064K2460
21075b7298J02393o1576M5782P633l5782j1224m7340l0460n5588o6459k646M0136
$$ plain form
21063 -142429 -99918 -91561 -186921 -136936 -65670 -88437 -50887 -33622 -41676 -17552 -11148 -37046
21051 -37046 -44818 -17484 69961 39156 -45241 -21355 -47237 -47548 -97675 -66703 -112611 -81531
21039 -81531 -41187 53277 105473 42456 -17257 47609 12168 29385 80043 192197 248816
21028 248816 200885 184311 48253 -17763 -34883 -66590 -117749 -103918 -45129 -79694 -20945
21017 -20945 -17452 -79775 -87580 -112442 -106972 -53006 -57934 -104595 -140621 -100523 -78773 -25875
21005 -25875 7018 -29655 -8156 43347 26190 -28067 -90445 -155361 -158594 -106759 -39099 -11421
20993 -11421 -15187 -62179 -16392 37824 40040 95269 66535 71240 70360 14841 -91046 7123
20981 7123 82172 99277 97379 68802 6729 -69851 -113089 -98926 -154298 -160561 -106290 -132126
$$ packed form
21063a42429M2511Q357r5360M9985P1266k2767L7550J7265q054K4124O404k5898
21051c7046p772K7334Q7445l0805q4397K3886k5882l11n0127L0972m5908L1080
21039h1531M0344R4464N2196o3017n9713O4866l5441J7217N0658J12154N6619
21028B48816m7931j6574j36058o6016j7120l1707n1159J3831N8789l4565N8749
21017b0945L493o2323p805k4862N470N3966m928m6661l6026M0098K1750N2898
21005b5875L2893l6673K1499N1503j7157n4257o2378o4916l233N1835O7660K7678
20993a1421l766m6992M5787N4216K216N5229k8734M705q80n5519j05887R8169
20981G123P5049J7105j898k8577o2073p6580m3238J4163n5372o263N4271k5836
$$ plain form
20969 -132126 -128565 -149338 -51371 -11118 34180 -8744 33064 38854 49150 64908 138356 135777
20957 135777 61508 -14260 -165150 -224340 -140630 -139433 -164099 -173837 -153694 -162946 -144110 -90210
20945 -90210 -5558 -76004 -129090 -151441 -126061 -182574 -157166 -102483 -104011 -90095 -62073 -46806
20933 -46806 -62928 2036 45165 148427 209829 203128 209467 90116 50205 63072 73883 107379
20921 107379 52882 47066 134618 158585 58901 -3323 31788 60197 -30377 -151041 -158548 -109992
20909 -109992 -34375 72651 58081 5724 -38702 -41295 -83672 -81831 -122119 -84727 13219 -5160
20897 -5160 -49701 -34834 -50367 -33808 -77831 -73223 -43571 -99935 -1890 26862 33544 10424
20885 10424 -31894 -19788 -25232 73862 119627 67352 -101 -55468 -67603 -77075 -6254 19308
$$ packed form
20969a32126L561k0773R7967M0253M5298m2924M1808N790J0296J5758P3448k579
20957A35777p4269p5768j50890n9190Q3710J197k4666r738K0143r252J8836N3900
20945i0210Q4652p0446n3086k2351K5380n6513K5408N4683j528J3916K8022J5267
20933d6806j6122O4964M3129J03262O1402o701O339j19351l9911J2867J0811L3496
20921A07379n4497n816Q7552K3967r9684o2224L5111K8409r0574j20664p507M8556
20909a09992P5617J07026j4570n2357m4426k593m2377J841m0288L7392R7946j8379
20897e160m4541J4867j5533J6559m4023M608K9652n6364R8045K8752O682k3120
20885A0424m2318J2106n444R9094M5765n2275o7453n5367j2135r472P0821K5562
$$ plain form
20873 19308 18639 -20011 -34803 14977 -11872 -33205 -31941 50821 74771 33957 -21134 -64285
20861 -64285 -93264 -27899 53137 7762 -21972 -28179 -1267 42826 23161 37244 -34530 -55758
20849 -55758 -50190 -42978 4451 37161 18299 -9930 -31187 -141221 -121441 -41112 -14498 -55926
20837 -55926 30981 -61461 -155302 -136837 -123423 -105441 -90171 -36691 -470 -120332 -134484
20826 -134484 -99314 -64964 -20894 -99121 -58973 -42818 -9228 34656 -10053 -75235 -46676
20815 -46676 -31454 -30833 3990 -9702 -99356 -143193 -67733 -40475 -36102 -4034 96745 151609
20803 151609 78079 1682 19527 -13437 10874 36593 21856 -68931 -127848 -204622 -167373
20792 -167373 -80622 -83613 -68690 8543 55176 51735 1928 -98578 -33780 4632 16074 -10359
$$ packed form
20873A9308o69l8650j4792M9780k6849k1333J264Q2762K3950m0814n5091m3151
20861f4285k8979O5365Q1036m5375k9734o207K6912M4093j9665J4083p1774k1228
20849e5758N568P212M7429L2710j8862k8229k1257j10034J9780Q0329K6614m1428
20837e5926Q6907r2442r3841J8465J3414J7982J5270N3480L6221j19862j4152
20826a34484L5170L4350M4070p8227M0148J6155L3590M3884m4709o5182K8559
20815d6676J5222O21L4823j3692q9654m3837P5460K7258M373L2068J00779N4864
20803A51609p3530p6397J7845l2964K4311K5719j4737r0787n8917p6774L7249
20792a67373Q6751k991J4923P7233M6633l441m9807j00506O4798L8412J1442k6433
$$ plain form
20780 -10359 -6066 -55748 -51428 -11626 -38320 -52558 -22934 -55233 17214 38028 54904 107452
20768 107452 31500 3244 113516 140687 67966 14242 -73744 -36063 -3472 -19339 -31787
20757 -31787 108246 144715 99596 -9983 -123147 -102008 -54132 -46406 -42010 -22768 -90743
20746 -90743 -87665 -127015 -75742 -75278 -58290 -74367 10895 133072 94163 -21586 1275 33035
20734 33035 -61906 -79756 -41420 30948 84456 7662 -113881 -108556 -34986 -58354 -14050 110881
20722 110881 100267 40305 10412 31223 113021 86693 29681 -50947 -48033 -71822 -79386 -102970
20710 -102970 -76739 -26692 68184 -5733 -37334 -74944 -75628 -28683 -85340 3855 48974 77848
20698 77848 101646 5622 -84844 -154153 -159151 -87683 1285 33042 59522 -42617 -150674
$$ packed form
20780a0359M293m9682M320L9802k6694j4238K9624l2299P2447K0814J6876N2548
20768A07452p5952k8256J10272K7171p2721n3724q7986L7681L2591j5867j2448
20757c1787J40033L6469m5119j09579j13164K1139M7876P726M396J9242o7975
20746i0743L078l9350N1273M64J6988j6077Q5262J22177l8909j15749K2861L1760
20734C3035r4941j7850L8336P2368N3508p6794j21543N325P3570k3368M4304J24931
20722A10881j0614n9962k9893K0811Q1798k6328n7012q0628K914k3789p564k3584
20710a02970K6231N0047R4876p3917l1601l7610o84M6945n6657Q9195M5119K8874
20698G7848K3798r6024r0466o9309m998P1468Q8968L1757K6480j02139j08057
$$ plain form
20687 -150674 -181979 -204892 -263496 -237216 -103023 43001 24117 -54602 -102107 -45941 50886
20676 50886 112469 109799 44943 -4434 -19414 22048 79634 96808 13514 -36594 -76729 -77123
20664 -77123 10771 -19340 -54122 -30910 37834 30488 -17046 17762 26672 84945 29067 -9559
20652 -9559 -16121 -42665 -82218 -18768 35842 7841 -14527 -48386 -29665 -7815 4035 5625
20640 5625 32412 82512 40579 58164 41882 -19286 -29082 -115420 -156371 -111379 -97139 -25991
20628 -25991 -50873 -83889 -63953 -66884 -152061 -173875 -124952 -43048 20411 19836 45265 -29228
20616 -29228 -25099 -13091 -55934 -64616 -32329 -57037 -82590 -93938 -121548 -75725 -114328 -50526
20604 -50526 -15874 20627 -39874 -102791 -122072 -93152 -20156 63575 25155 32030 96529 101761
$$ packed form
20687a50674l1305k2913n8604K6280J34193J46024j8884p8719m7505N6166R6827
20676E0886O1583k670o4856m9377j4980M1462N7586J7174q3294n0108m0135l94
20664g7123Q7894l0111l4782K3212O8744p346m7534L4808Q910N8273n5878l8626
20652i559o562k6544l9553O3450N4610k8001k2368l3859J8721K1850J1850J590
20640E625K6787N0100m1933J7585j6282o1168r796q6338m0951M4992J4240P1148
20628b5991k4882l3016J9936k931q5177k1814M8923Q1904O3459n75K5429p4493
20616b9228M129J2008m2843q682L2287k4708k5553j1348k7610M5823l8603O3802
20604e0526L4652L6501o0501o2917j9281K8920P2996Q3731l8420O875O4499N232
$$ plain form
20592 101761 20792 -106021 -75015 20351 35601 -8293 -37455 -60306 -70975 -52320 -31139
20581 -31139 -78635 -66563 -18170 34913 64701 69674 57816 1165 -72070 -116813 -122858 -56485
20569 -56485 -76652 1212 -7384 -17796 68802 120666 89293 69721 1962 -39784 -39958 12347
20557 12347 -34864 -31229 -18440 -71384 13075 27346 35641 -22538 -4436 -37676 31515 7223
20545 7223 -14644 95402 45640 88867 99307 125833 122025 39828 5307 -19433 -60353 -22686
20533 -22686 37652 2793 42987 63747 53250 56546 128797 122849 103797 74150 9205 86429
20521 86429 85412 -28845 -70855 -57844 -10328 53973 46482 22226 26270 5591 62000 137705
20509 137705 110357 85748 113328 123548 79411 66149 51202 12267 -61143 -54516 5439 94238
$$ packed form
20592A01761q0969j26813L1006R5366J5250m3894k9162k2851j0669J8655K1181
20581c1139m7496J2072M8393N3083K9788M973j1858n6651p3235m4743o045O6373
20569e6485k0167P7864q596j0412Q6598N1864l1373j9572o7759m1746j74N2305
20557A2347m7211L635J2789n2944Q4459J4271Q295n8179J8102l3240O9191k4292
20545G223k1867J10046m9762M3227J0440K6526l808q2197l4521k4740m0920L7667
20533b2686O0338l4859M0194K0760j0497L296P2251n948j9052k9647o4945P7224
20521H6429j017j14257m2010J3011M7516O4301p491k4256M044k0679N6409P5705
20509A37705k7348k4609K7580J0220m4137j3262j4947l8935p3410O627N9955Q8799
$$ plain form
20497 94238 104902 54323 5964 -51254 -98286 -110625 -90845 -131777 -127468 -60423 -49265 -94051
20485 -94051 -165987 -166655 -59607 7911 -25279 -98059 -70019 -56107 -49643 -41374 -72805 -94499
20473 -94499 -115689 -71278 -55509 1036 54249 74076 55779 41461 65857 8159 -34339 -8322
20461 -8322 38780 29358 1268 89030 41443 6551 -7068 29465 47150 61285 -39817 -87644
20449 -87644 -18358 -6 -32325 -88447 -120661 -140227 -130254 -69613 -57057 -17261 -1298 27579
20437 27579 32337 -18345 -54761 -71945 -91754 -104346 -64441 -15521 10140 -3493 29210 31096
20425 31096 -40915 -47336 -53245 -24935 -30111 -76480 -120318 -99746 -51347 -40848 43523 57025
20413 57025 26972 -32423 -83704 -85952 -113856 -110311 -174163 -104088 -5979 66664 41787 9644
$$ packed form
20497I4238J0664n0579m8359n7218m7032j2339J9780m0932M309O7045J1158m4786
20485i4051p1936o68J07048O7518l3190p2780K8040J3912O464Q269l1431k1694
20473i4499k1190M4411J5769N6545N3213J9827j8297j4318K4396n7698m2498K6017
20461h322M7102r422k8090Q7762m7587l4892j3619L6533J7685J4135j01102m7827
20449h7644O9286J8352l2319n6122l2214j9566R973O0641J2556L9796J5963K8877
20437B7579M758n0682l6416j7184j9809j2592L9905M8920K5661j3633L2703J886
20425C1096p2011o421n909K8310n176m6369m3838K0572M8399J0499Q4371J3502
20413E7025l0053n9395n1281k248k7904L545o3852P0075R8109P2643k4877l2143
$$ plain form
20401 9644 -9175 -57164 -96146 -98903 -25753 -126083 -238133 -229288 -227654 -227550 -75065 3470
20389 3470 56367 70067 86157 87765 105748 53785 1552 44879 23660 -21784 -21839 9775 8052
20376 8052 11244 -20809 -67163 740 7497 -103345 -149522 -117298 -124326 -12920 9569 60626
20364 60626 22609 -22044 -51874 -61177 1255 70407 50873 -18626 -74747 29310 47670 61871
20352 61871 26661 -83524 -94975 -2311 76681 22871 6137 16464 27289 -42962 -2036
20341 -2036 53482 78789 34678 -82927 -134774 -65770 -28785 -15921 -3786 56949 126157 135887
20329 135887 74444 38997 62168 67765 48956 43254 34548 36772 49983 36758 15449 19938
20317 19938 -11334 -81150 9516 121561 109804 45743 45006 56417 51368 29880 -9353 -4176
$$ packed form
20401I644j8819m7989l8982k757P3150j00330j12050Q845J634J04J52485P8535
20389C470N2897J3700J6090J608J7983n1963n2233M3327k1219m5444n5L1614j723
20376H052L192l2053m6354O7903O757j10842m6177L2224p028J11406K2489N1057
20364F0626l8017m4653k9830r303O2432O9152j9534o9499n6121J04057J8360J4201
20352F1871l5210j10185j1451R2664P8992n3810j6734J0327J0825p0251M0926
20341b036N5518K5307m4111j17605n1847O9004L6985J2864J2135O0735O9208R730
20329A35887o1443l5447K3171N597j8809n702q706K224J3211j3225k1309M489
20317A9938l1272o9816R0666J12045j1757o4061p37J1411n049k1488l9233N177
$$ plain form
20305 -4176 -31787 -30223 103687 196868 193293 153545 40633 -11471 71243 43313 -63944 -69827
20293 -69827 13138 -133 -83983 -171809 -188890 -97693 -71211 -85388 -14665 -16498 -93148 -20712
20281 -20712 58439 33132 -39222 -19213 -60251 -142132 -76868 -70082 -44765 -17926 27149 14076
20269 14076 5672 -13104 -9380 45178 99408 31539 -67148 -152769 -159644 -116638 -2271 47769
20257 47769 -518 -56750 -27074 -112202 -97821 -40020 -32218 -67964 -86929 -41619 39674 23815
20245 23815 29100 28904 31690 46106 -44514 -108425 -117510 -34909 -27719 -56700 -61927 -24428 39071
20232 39071 105500 71807 65269 129149 71082 -39571 -129136 -145293 -71643 -30481 29156 133952
20220 133952 96624 -21193 -11016 99625 31861 -53216 -62761 30544 70382 171442 159497
$$ packed form
20305d176k7611J564J33910R3181l575l9748j12912n2104Q2714k7930j07257n883
20293f9827Q2965j3271q3850q7826j7081R1197K6482j4177P0723j833p6650P2436
20281b0712P9151k5307p2354K0009m1038q1881O5264O786K5317K6839M5075j3073
20269A4076q404j8776L724N4558N4230o7869r8687q5621o875M3006J14367N0040
20257D7769m8287n6232K9676q5128J4381N7801P802l5746j8965M5310Q1293j5859
20245B3815N285j96K786J4416r0620o3911r085Q2601P190k8981n227L7499O3499
20232C9071O6429l3693o538O3880n8067j10653q9565j6157P3650M1162N9637J04796
20220A33952l7328j17817J0177J10641o7764q5077r545R3305L9838J01060j1945
$$ plain form
20209 159497 22566 -54670 -41903 5655 6476 37122 27182 54084 60208 -45201 -75381 -95914
20197 -95914 -192085 -165993 -88317 -90505 -45584 -40794 13848 -43883 -99706 -124360 -88407 -89034
20185 -89034 -25033 -37264 -75944 -143158 -142632 -70342 -39761 -109567 -68728 -62019 -32947 -27347
20173 -27347 -61178 -48704 11568 32067 152957 107258 22644 -16389 -25872 -30746 -57450 -28406
20161 -28406 23041 11528 -63812 -113487 -65700 -878 30656 81809 42834 48147 95604 185935
20149 185935 173354 97977 -10968 -62104 -48634 -6722 -13341 -32769 -39454 -8713 -17567 -12227
20137 -12227 -43955 12852 23082 47405 -20877 -11761 -26935 -78910 -36209 -93559 -109027 -23527
20125 -23527 -22534 -62780 -102898 -120936 -119509 -55923 -55266 -4032 28511 -7476 34265 69743 67009
$$ packed form
20209A59497j36931p7236J2767M7558Q21L0646r940K6902O124j05409l0180k0533
20197i5914r6171K6092P7676k188M4921M790N4642n7731n5823k4654L5953o27
20185h9034O4001j2231l8680o7214N26P2290L0581o9806M0839O709K9072N600
20173b7347l3831J2474O0272K0499J20890m5699q4614l9033r483m874k6704K9044
20161b8406N1447j1513p5340m9675M7787O4822L1534N1153l8975N313M7457R0331
20149A85935j2581p5377j08945n1136J3470M1912o619j9428o685L0741q854N340
20137a2227l1728N6807J0230K4323o8282R116j5174n1975M2701n7350j5468Q5500
20125b3527R93m0246m0118j8038J427O3586O57N1234L2543l5987M1741L5478k734
$$ plain form
20112 67009 104450 -17730 -100337 -147170 -154915 -54372 14317 -10679 -26168 25433 11167
20101 11167 -61905 -81396 -19996 64373 36925 -29934 -90250 -75095 -51990 -44845 20030 118136
20089 118136 196015 125133 -1 -38438 -5034 97043 84546 74509 4603 31120 117016
20078 117016 65808 61102 123049 123117 59249 45619 83010 47329 -37757 -15326 50279 2158
20066 2158 56214 38924 -22072 -45424 -30127 45928 63831 32085 30855 27946 104501 126148
20054 126148 48844 53598 55871 -37631 -43484 -13580 102740 115558 109616 139351 170195 87580
20042 87580 -87566 -87731 28713 34484 139335 102023 60790 46788 -11223 44157 35549 73651
20030 73651 108361 97964 84538 45940 83616 101633 20572 -11124 19521 6627 25706 -32328
$$ packed form
20112F7009L7441j22180q2607m6833p745J00543O8689k4996j5489N1601j4266
20101A1167p3072j9491O1400Q4369k7448o6859o0316J5155K3105P145O4875R8106
20089A18136P7879p0882j25134l8437L3404J02077j2497j0037o9906K6517Q5896
20078A17016n1208m706O1947O8o3868j3630L7391l5681q5086K2431O5605m8121
20066B158N4056j7290o0996k3352J5297P6055J7903l1746j230k909P6555K1647
20054A26148p7304M754K273r3502n853K9904J16320J2818n942K9735L0844q2615
20042H7580j75146j65J16444N771J04851l7312m1233j4002n8011N5380q608L8102
20030G3651L4710j0397j3426l8598L7676J8017q1061l1696L0645j2894J9079n8034
$$ plain form
20018 -32328 16801 99921 120764 75234 84250 117418 107269 57752 7358 -17411 13872 -54203
20006 -54203 -139191 -153471 -75138 -79462 -28020 -82281 -139879 -110820 -34993 -56266 -37132 -7444
19994 -7444 -14352 -38624 -51021 6393 -43994 -61467 -35412 15244 -6353 -52740 -68752 -62561
19982 -62561 4169 -65350 4498 18278 -67293 -28925 -46025 -36820 -14863 4481 55758 87264
19970 87264 68506 72276 7166 -96408 -152781 -113690 -113723 -28306 68729 89151 53514 38221
19958 38221 -11140 17587 39306 41308 47139 64007 91961 55757 44796 65251 33411 47179
19946 47179 -44952 -120802 -22268 24268 -33353 -22403 -8055 -59268 -127281 -61462 -77563 -102439
19934 -102439 -34404 -30703 -43551 -7035 -15428 -3585 24960 18105 35158 -58676 -12349 37635
$$ packed form
20018c2328M9129Q3120K0843m5530R016L3168j0149m9517n0394k4769L1283o8075
20006e4203q4988j4280P8333m324N1442n4261n7598K9059P5827k1273J9134K9688
19994g444o908k4272j2397N7414n0387j7473K6055N0656k1597m6387j6012O191
19982f2561O6730o9519O9848J3780q5571L8368j7100R205K1957J9344N1277L1506
19970H7264j8758L770o5110j03574n6373L9091l3Q5417R7035K0422l5637j5293
19958C8221m9361K8727K1719K002N831J6868K7954l6204j0961K0455l1840J3768
19946D7179r2131p5850R8534M6536n7621J0950J4348n1213o8013O5819j6101k4876
19934a02439O8035L701j2848L6516q393J1843K8545o855J7053r3834M6327M9984
$$ plain form
19922 37635 54469 -8816 -58648 -96227 -31951 -11895 -29522 -76161 -12683 43756 18174 1927
19910 1927 38043 51296 20417 61481 17382 10464 56420 67731 95593 43736 22801 81690
19898 81690 25127 -43799 -14237 -26866 18675 45297 113012 86199 76600 42309 -24886 -106454
19886 -106454 -64074 -110647 -173411 -129898 -94478 -56750 -25007 -21898 -39957 -90592 -180620 -169589
19874 -169589 -113726 -51922 -33963 -51491 -50378 27578 35639 34628 -6718 -20431 18315 91657
19862 91657 102183 88775 7784 -47387 -65830 55821 91218 132791 91348 69366 -25470
19851 -25470 -47030 -20844 48091 60813 34181 -44083 -5444 15736 -60890 -43360 22037 79000
19839 79000 85282 26555 -31984 -24675 38159 127448 149003 5095 -59939 -51871 -107453 -121134
$$ packed form
19922C7635J6834o3285m9832l7579O4276K0056j7627m6639O3478N6439k5582j6247
19910A927L6116J3253l0879M1064m4099o918M5956J1311K7862n1857k0935N8889
19898H1690n6563o8926K9562j2629M5541K6622O7715k6813r599l4291o7195q1568
19886a06454M2380m6573o2764M3513L5420L7728L1743L109j8059n0635r0028J1031
19874a69589N5863O1804J7959j7528J113P7956Q061j011m1346j3713L8746P3342
19862I1657J0526j3408q0991n5171j8443J21651L5397M1573m1443k1982r4836
19851b5470k1560K6186O8935J2722k6632p8264L8639K1180p6626J7530O5397N6963
19839G9000O282n8727n8539P309O2834Q9289K1555j43908o5034Q068n5582j3681
$$ plain form
19827 -121134 -149868 -74145 -25169 -19722 21270 72130 86287 58288 59330 52297 61489 21762
19815 21762 30452 -59710 -133143 -96443 -80417 -126510 -7475 58583 126504 103322 39002 22269
19803 22269 -17195 58038 71269 92270 152628 220027 211457 168325 53830 31903 55712 57140
19791 57140 2154 -49657 -5418 54934 -2526 -58797 -95244 -91449 -108745 -63389 -79761 2337
19779 2337 306 12707 -20354 -33761 -56150 8286 15043 -76598 -99240 -91516 -81779 7982 110305
19766 110305 38787 -28626 -58710 -20473 44604 7027 -24245 -77159 -116008 -197984 -204360 -166710
19754 -166710 -177943 -99555 2041 102313 86638 38086 -70670 -129787 -165485 -92738 -72273
19743 -72273 -27727 7824 -21792 24741 -28644 -5791 -49461 -19113 45026 43668 70120 93193
$$ packed form
19827a21134k8734P5723M8976N447M0992N0860J4157k7999J042p033R192l9727
19815B1762Q690r0162p3433L6700J6026m6093J19035O6058O7921k3182o4320j6733
19803B2269l9464P5233J3231K1001O0358O7399q570m3132j14495k1927K3809J428
19791E7140n4986n1811M4239O0352n7460n6271l6447L795j7296M5356j6372Q2098
19779B337k031J2401l3061j3407k2389O4436O757r1641k2642P724R737Q9761J02323
19766A10305p1518o7413l0084L8237O5077l7577l1272n2914l8849q1976o376L7650
19754a66710j1233P8388J01596J00272j5675m8552j08756n9117l5698P2747K0465
19743g2273M4546L5551k9616M6533n3385K2853m3670L0348O4139j358K6452K3073
$$ plain form
19731 93193 69641 -59758 -100917 12904 132688 172589 88198 59736 16663 36358 114368
19720 114368 143443 139349 43545 -23728 -44808 -120736 -86668 -46165 8254 61782 51257 10691
19708 10691 -99863 -110430 -95370 -138339 -138490 -66197 -13846 6984 -24487 -18274 -51603 47686
19696 47686 96330 80562 140976 131767 55763 -90541 -108627 -97306 -112366 -19090 8178 -18505
19684 -18505 -16534 -45993 -103601 -64440 28564 63465 83911 128369 151581 109070 96394 45058
19672 45058 43623 46408 30850 30824 14963 -33590 -61935 -88999 -112925 -131589 -66938 -75096 -25683
19659 -25683 93170 117504 -12454 -25344 49853 81077 75793 -3632 -96214 -94156 -35822 28996
19647 28996 107959 222461 179247 126870 181213 123465 66652 59044 90312 -59906 -125395
$$ packed form
19731I3193k3552j29399m1159J13821J19784L9901q4391k8462m3073J9695P8010
19720A14368K9075m094r5804o7273k1080p5928L4068M0503N4419N3528j0525m0566
19708A0691j10554j0567J5060m2969j51P2293N2351K0830l1471O213l3329R9289
19696D7686M8644j5768O0414r209p6004j46304j8086J1321j5060R3276K7268k6683
19684a8505J971k9459n7608L9161R3004L4901K0446M4458K3212m2511j2676n1336
19672D5058j435K785j5558k6j5861m8553k8345k7064k3926j8664O4651q158M9413
19659b5683J18853K4334j29958j2890P5197L1224n284p9425r2582K058N8334O4818
19647B8996P8963J14502m3214n2377N4343n7748n6813p608L1268j50218o5489
$$ plain form
19636 -125395 -145444 -107530 -38317 -34554 -66023 -48550 -70281 -62825 -76968 -24130 42446 85134
19624 85134 1704 -72919 -78572 -39090 -43354 60070 88926 74066 19356 -72338 -115890 -109831
19612 -109831 -51257 -30733 -41579 -15581 8265 -25407 -1483 68169 44480 28951 149764
19601 149764 160014 79477 39155 25330 41994 68819 46300 96131 144935 196428 204256 236514
19589 236514 184560 209048 213704 161825 169510 146933 113297 78837 35360 27968 46704 61304
19577 61304 27836 -10696 -43654 8447 91684 67408 92914 106673 80848 105860 146114 141521
19565 141521 102656 71640 88171 119585 160407 174059 130767 77903 -20435 30020 71948
19554 71948 13393 -101900 -120023 -122478 -29740 3642 56552 106482 68364 116365 175194 143822
$$ packed form
19636a25395k0049L7914O9213L763l1469J7473k1731P456j4143N2838O6576M2688
19624H5134q3430p4623n653L9482m264J03424K8856j4860n4710r1694m3552O059
19612a09831N8574K0524j0846K5998K3846l3672K3924O9652k3689j5529J20813
19601A49764J0250q0537m0322j3825J6664K6825k2519M9831M8804N1493P828L2258
19589B36514n1954K4488M656n1879P685k2577l3636l4460m3477p392J8736J4600
19577F1304l3468l8532l2958N2101Q3237k4276K5506J3759k5825K5012M0254m593
19565A41521l8865l1016J6531L1414M0822J3652m3292n2864r8338N0455M1928
19554G1948n8555j15293j8123k455R2738L3382N2910M9930l8118M8001N8829l1372
$$ plain form
19542 143822 125753 125453 175937 153729 205933 246662 202274 196375 154300 197886 228633 263196
19530 263196 246657 177395 226704 160767 141711 139991 210158 187892 202321 209930 172036 249070
19518 249070 277660 301252 303710 408163 461424 487085 555767 593802 599887 567243 528970 548688
19506 548688 618148 839387 1001958 1137481 1227982 1276190 1304533 1158228 995908 879889
19496 879889 877514 837429 725471 715900 759617 774891 796803 828774 812270 784225 738092 729286
19484 729286 740864 629004 465241 307156 214966 162959 159717 208274 239131 231308 205148
19473 205148 82627 98767 115836 101402 4457 -1058 -2864 -30216 -72654 -128069 -143142 -91994
19461 -91994 -139945 -114180 -21852 88761 90044 -32629 273 33189 7766 -58680 -39925
$$ packed form
19542A43822j8069l00N0484k2208N2204M0729m4388n899m2075M3586L0747L4563
19530B63196j6539o9262M9309o5937j9056j720P0167k2266J4429P609l7894P7034
19518B49070K8590K3592K458J04453N3261K5661O8682L8035O085l2644l8273J9718
19506E48688O9460K21239J62571J35523R0501M8208K8343j46305j62320j16019
19496H79889k375m0085j11958r571M3717J5274K1912L1971j6504k8045m6133q806
19484G29286J1578j11860j63763j58085r2190n2007l242M8557L0857p823k6160
19473B05148j22521J6140J7069j4434r6945n515j806k7352m2438n5415j5073N1148
19461i1994m7951K5765R2328J10613J283j22673L2902L2916k5423o6446J8755
$$ plain form
19450 -39925 -23215 11308 60971 51154 79426 150905 134512 136726 98830 101222 87225 38116
19438 38116 179032 183080 116613 40516 -103340 -106017 -45318 -109672 -69436 10229 31869 3801
19426 3801 28995 -15975 -91614 -176614 -147548 -101335 -68792 22727 -46634 -120733 -42502 11062
19414 11062 19391 14943 89310 60782 74150 27740 3373 -46853 -32299 7532 44472 53815
19402 53815 -10310 19421 64608 115893 96412 83299 33864 -28878 -80233 -25296 -41728 -63480
19390 -63480 -91740 12985 111717 168347 176850 252720 231096 157464 231754 249951 223773 213020
19378 213020 221098 231324 153798 94140 20882 -25897 -36273 -82364 35168 35086 35441 70333
19366 70333 169017 204405 143927 53063 80704 31805 28857 -45853 -49674 -60105 -77712 -128322
$$ packed form
19450c9925J6710L4523M9663r817K8272P1479j6393K214l7896K392j3997m9109
19438C8116J40916M048o6467p6097j43856k677O0699o4354M0236P9665K1640k8068
19426C801K5194m4970p5639q5000K9066M6213L2543R1519o9361p4099P8231N3564
19414A1062Q329m448P4367k8528J3368m6410k4367n0226J4554L9831L6940R343
19402E3815o4125K9731M5187N1285j9481j3113m9435o2742n1355N4937j6432k1752
19390f3480k8260J04725R8732N6630Q503P5870k1624p3632P4290J8197k6178j0753
19378B13020Q078J0226p7526n9658p3258m6779j0376m6091J17532q2L55L4892
19366G0333R8684L5388o0478r0864K7641m8899k948p4710l821j0431j7607n0610
$$ plain form
19354 -128322 -84973 10932 40366 103622 70447 74833 96482 83966 13161 -5574 -33319 6632
19342 6632 67492 85243 24064 96873 104510 131131 143388 139592 96567 13985 -31565 53833
19330 53833 25070 -15393 -54574 -66589 58163 125242 89130 51184 80889 150585 206514
19319 206514 244657 210553 124446 184166 178262 135291 78346 23820 57772 83227 77529 71687
19307 71687 155191 185042 142145 105166 51872 30083 16670 -15523 37395 81392 92123 40424
19295 40424 43846 -7484 -59709 -65742 -44028 -30490 -6248 -13610 -4438 -36288 -11706 24538
19283 24538 -37966 -55327 -46478 755 25410 23173 -31920 -30919 15993 -56465 -93200 -120536
19271 -120536 -162426 -191684 -257529 -277557 -190972 -123214 -154885 -147671 -149314 -94046 -97753 -77410
$$ packed form
19354a28322M3349R5905K9434O3256l3175M386K1649j2516p0805j8735k7745L9951
19342F632O0860J7751o1179P2809P637K6621J2257l796m3025q2582m5550Q5398
19330E3833k8763m0463l9181j2015J24752O7079l6112l7946K9705O9696N5929
19319B06514L8143l4104q6107N9720n904m2971n6945n4526L3952K5455n698n842
19307G1687Q3504K9851m2897l6979n3294k1789j3413l2193N2918M3997J0731n1699
19295D0424L422n1330n2225o033K1714J3538K4242p362R172l1850K4582L6244
19283B4538o2504j7361Q849M7233K4655k237n5093J001M6912p2458l6735k7336
19271a20536m1890k9258o5845k0028Q6585O7758l1671P214j643N5268l707K0343
$$ plain form
19259 -77410 -79927 -82775 -107689 -95987 -19955 -64767 -46933 26610 -67172 -119458 -104065 -58539
19247 -58539 43250 73575 38696 67757 61350 23574 18565 91395 85786 206145 286245 369191
19235 369191 346827 333312 409170 387696 317802 360468 342618 210038 127586 35171 79968
19224 79968 65851 54179 121354 189121 251246 215475 196448 235596 156283 144740 159092 78082
19212 78082 61422 88894 40197 50960 96444 108566 36902 43636 27451 89290 81305 113544
19200 113544 154256 128141 67147 -12562 -121030 -113013 -17724 66560 154804 290866 291533 254745
19188 254745 267923 283598 298761 272055 264277 181792 82999 10321 65120 37435 84742 139741
19176 139741 198928 265941 392530 432068 381871 426051 486910 387661 196702 88825 104254
$$ packed form
19259g7410k517k848k4914J1702P6032m4812J7834P3543r3782n2286J5393M5526
19247e8539J01789L0325l4879K9061o407l7776n009P2830n609J20359Q0100Q2946
19235C69191k2364j3515P5858k1474o9894M2666j7850j32580q2452r2415M4797
19224G9968j4117j1672O7175O7767O2125l5771j9027L9148p9313j1543J4352q1010
19212G8082j6660K7472m8697J0763M5484J2122p1664O734j6185O1839p985L2239
19200A13544M0712k6115o0994p9709j08468Q017R5289Q4284Q8244J36062O67l6788
19188B54745J3178J5675J5163k6706p778q2485r8793p2678N4799k7685M7307N4999
19176A39741N9187O7013J26589L9538n0197M4180O0859r9249j90959j07877J5429
$$ plain form
19165 104254 227168 216710 197142 209311 167416 151387 160586 233915 255123 156231 103748
19154 103748 123417 168430 220347 250119 281841 277826 360105 376863 391403 409566 421509 415082
19142 415082 389260 370641 335301 274392 260369 191119 108942 176821 186266 251916 293642 347163
19130 347163 401792 409964 396357 445531 405822 405840 399820 401465 447788 509550 474443 486558 417354
19117 417354 424462 512997 415745 360310 420159 437828 491292 574333 681098 785492 676575
19106 676575 618344 608800 622369 577390 524744 481562 548320 500150 501332 532358 596758 668596
19094 668596 654586 537627 438076 285648 258894 195471 91441 -40393 -176378 -307402
19084 -307402 -356933 -307166 -232035 -215418 -170678 -39948 33439 59426 78170 51516 76624
$$ packed form
19165A04254J22914j0458j9568J2169m1895j6029R199P3329K1208r8892n2483
19154A03748J9669M5013N1917K9772L1722m015Q2279J6758J4540J8163J1943o427
19142D15082k5822j8619l5340o0909j4023o9250q2177O7879R445O5650M1726N3521
19130C47163N4629Q172j3607M9174l9709J8o020J645M6323O1762l5107J2115o9204
19117D17354P108Q8535r7252n5435N9849J7669N3464Q3041J06765J04394j08917
19106F76575n8231r544J3569m4979n2646m3182O6758m8170J182L1026O4400P1838
19094F68596j4010j16959r9551j52428k6754o3423j04030j31834j35985j31024
19084c07402m9531M9767P5131J6617M4740J30730P3387K5987J8744k6654K5108
$$ plain form
19073 76624 49003 12816 -105992 -132520 -135532 -191914 -254348 -279794 -233327 -166687 -108900 -117181
19061 -117181 -138837 -212443 -174100 -62446 -25276 22728 13694 -47845 -91870 -46908 -110384
19050 -110384 -94752 -77788 -72645 -28071 -47337 -85550 -62856 -81869 -101443 -75026 -67782 -98209
19038 -98209 -205812 -240295 -257179 -243126 -289216 -298568 -331567 -342726 -395704 -461427 -498149 -466232
19026 -466232 -383297 -326041 -142824 -84297 -120911 -25656 -68799 -121413 -177326 -101716 -35708
19015 -35708 14677 90185 199825 373131 413761 335053 348272 374166 393160 422416 405492
19004 405492 447794 434585 332906 325453 360840 485716 541988 522620 472392 454420 497120
18993 497120 419183 349917 282067 194499 201194 237169 264237 279968 347380 352460 273295 206502
$$ packed form
19073G6624k7621l6187j18808k6528l012n6382o2434k5446M6467O6640N7787q281
19061a17181k1656p3606L8343J11654L7170M8004r034o1539m4025M4962o3476
19050a10384J5632J6964N143M4574j9266l8213K2694j9013j9574K6417P244l0427
19038i8209j07603l4483j6884J4053m6090r352l2999j1159n2978o5723l6722L1917
19026d66232Q2935N7256J83217N8527l6614R5255m3143n2614n5913P5610O6008
19015c5708N0385P5508J09640J73306M0630p8708J3219K5894J8994K9256j6924
19004D05492M2302j3209j01679p453L5387J24876N6272j9368n0228j7972M2700
18993D97120p7937o9266o7850q7568O695L5975K7068J5731O7412N080p9165o6793
$$ plain form
18981 206502 242436 268897 213503 233178 212501 281709 292368 197437 40484 -58292 -15447
18970 -15447 118848 328842 439161 478185 411019 404849 440735 463615 523490 495410 446518
18959 446518 343668 274668 337919 425901 576163 662317 755713 629678 480690 462565 545257
18948 545257 587218 589100 545584 682693 706621 708309 737515 933919 1149421 1307852 1335826
18937 1335826 1322898 1324171 1216693 1129865 903654 621831 537047 697475 864493 1140301
18927 1140301 1377803 1459468 1480068 1499262 1445573 1470304 1685123 1985060 2177221 2354229
18917 2354229 2523113 2620314 2711279 2840889 2908830 2974024 3020905 3007776 2835840 2707089
18907 2707089 2659980 2615584 2476079 2275269 2226459 2503844 2777637 3210833 3710347 4078907
$$ packed form
18981B06502L5934K6461n5394J9675k0677O9208J0659r4931j56953r8776M2845
18970a5447J34295K09994J10319L9024o7166o170L5886K2880N9875k8080m8892
18959D46518j02850o9000O3251Q7982J50262Q6154R3396j26035j48988j8125Q2692
18948E45257M1961J882m3516J37109K3928J688K9206J96404K15502J58431K7974
18937A335826j2928J273j07478q6828k26211k81823q4784J60428J67018K75808
18927A140301K37502Q1665K0600J9194n3689K4731K14819K99937J92161J77008
18917B354229J68884R7201R0965J29610O7941O5194M6881j3129j71936j28751
18907B707089m7109m4396j39505k00810m8810K77385K73793M33196M99514L68560
$$ plain form
18897 4078907 4434769 4937430 5371242 5485648 5357248 5076295 4740022 4619054 4774960
18888 4774960 5147449 5646404 6317048 7195461 8268454 9565976 10769842 11854142 12902011
18879 12902011 13775586 14159763 14055939 13652863 13032477 12682147 13268196 14945287 17098488
18870 17098488 19405604 22027798 24966219 28443914 32554959 37372023 43002950 50126134
18862 50126134 59554291 73845389 95767389 122225436 146197954 162901564 170111865
18855 170111865 169172937 163714532 157633152 153901301 153546764 157531116 165567614 176740662
18847 176740662 192127112 214515518 247792725 289621441 324440571 330033509 301174876
18840 301174876 254933811 206737422 165021628 131656693 104694833 83457982 67396806
$$ packed form
18897D078907L55862N02661M33812J14406j28400k80953l36273j20968J55906
18888D774960L72489M98955O70644Q78413J072993J297522J203866J084300J047869
18879A2902011Q73575L84177j03824m03076o20386l50330N86049J677091K153201
18870A7098488K307116K622194K938421L477695M111045M817064N630927P123184
18862E0126134R428157J4291098K1922000K6458047K3972518J6703610P210301
18855A70111865r38928n458405o081380l731851l54537L984352Q036498J1173048
18847A76740662J5386450K2388406L3277207M1828716L4819130N592938k8858633
18840C01174876m6241065m8196389m1715794l3364935k6961860k1236851j6061176
$$ plain form
18833 67396806 55168735 46027232 39507660 34850459 30964937 27266418 23984299 21542573
18825 21542573 19851123 18579754 17509541 16344684 14871428 13351663 11943156 10504857
18817 10504857 9253180 8243311 7812080 7871408 8144585 8490271 8712757 8804464 8576437
18808 8576437 7951050 7292258 6828397 6551547 6312985 6007903 5671723 5406720 5161231
18799 5161231 4818045 4433933 4006534 3672480 3580626 3380423 3098039 2728801 2333235 2060390
18789 2060390 1971498 2058711 2073537 2171418 2403218 2719302 2912232 2784676 2410712 2100547
18779 2100547 1937281 1991296 2110279 2120315 2055100 1844037 1572280 1540114 1562220 1670557
18769 1670557 1874312 2114969 2288791 2352394 2239908 2103558 1877751 1666216 1451767 1455068
$$ packed form
18833F7396806j2228071r141503o519572m657201l885522l698519l282119k441726
18825B1542573j691450j271369j070213j164857j473256j519765j408507j438299
18817A0504857j251677j009869m31231N9328K73177L45686K22486R1707k28027
18808H576437o25387o58792m63861k76850k38562l05082l36180k65003k45489
18799E161231l43186l84112m27399l34054r1854k00203k82384l69238l95566k72845
18789B060390q8892Q7213J4826R7881K31800L16084J92930j27556l73964l10165
18779B100547j63266N4015J18983J0036o5215k11063k71757l2166K2106J08337
18769A670557K03755K40657J73822O3603j12486j36350k25807k11535k14449L301
$$ plain form
18759 1455068 1621178 1742256 1721353 1580052 1337684 1210533 1143150 1092484 878118 569521
18749 569521 312340 224247 283875 388294 620066 727975 749448 830812 921519 891848 930725
18738 930725 827299 685360 660422 637925 619886 593617 680409 854088 1056322 1174359
18728 1174359 1173663 1155624 1177400 1226229 1104741 881132 795528 797392 774352 764860 706754 741750
18716 741750 783181 723750 799477 891188 1026842 1121121 1073960 1081490 1141895 1063854 905882
18705 905882 755970 603874 569324 618580 663468 713811 788022 749366 698225 547302 462771
18694 462771 458957 384838 255583 141052 -20271 -119145 -12714 82533 159351 309350 368583
18683 368583 388200 391013 470599 539609 612830 570909 500709 398990 474179 634098 784463
$$ packed form
18759A455068J66110J21078k0903j41301k42368j27151o7383n0666k14366l08597
18749E69521k57181q8093N9628J04419K31772J07909K1473Q1364R0707k9671L8877
18738I30725j03426j41939k4938k2497j8039k6269Q6792J73679K02234J18037
18728A174359o96j8039K1776M8829j21488k23609q5604J864k3040r492n8106L4996
18716G41750M1431n9431P5727R1711J35654R4279m7161P530O0405p8041j57972
18705I05882j49912j52096l4550M9256M4888N0343P4211l8656n1141j50923q4531
18694D62771l814p4119j29255j14531j61323r8874J06431R5247P6818J49999N9233
18683C68583J9617K813P9586O9010P3221m1921p0200j01719P5189J59919J50365
$$ plain form
18672 784463 906055 1002512 954938 881167 910810 883951 914866 880323 862390 841814 786589
18661 786589 629881 537720 478350 476029 557745 589004 627007 658441 608962 632537 677474
18650 677474 651946 608637 608436 510340 353253 159147 22255 25989 201398 323647 419532
18639 419532 509089 583562 624612 600999 634181 635504 574286 616741 646647 621464 632724 656348
18627 656348 567316 480403 392356 385869 316716 230922 142371 79701 160755 208386 376012
18616 376012 455705 348186 200493 146276 220456 316216 346401 400132 398468 386472 375482
18605 375482 310677 151661 210054 214147 176806 173541 131027 2221 -74778 -201795 -313178
18594 -313178 -313103 -274686 -186670 -215942 -278654 -332136 -303195 -331807 -427120 -499684 -451265 -377376
$$ packed form
18672G84463J21592R6457m7574p3771K9643k6859L0915l4543j7933k0576n5225
18661G86589j56708r2161n9370k321Q1716L1259L8003L1434m9479K3575M4937
18650F77474k5528m3309k01r8096j57087j94106j36892L734J75409J22249R5885
18639D19532Q9557P4473M1050k3613L3182J323o1218M2455K9906k5183J1260K3624
18627F56348q9032q6913q8047o487o9153q5794q8551o2670Q1054M7631J67626
18616C76012P9693j07519j47693n4217P4180R5760L0185N3731j664j1996j0990
18605C75482o4805j59016N8393M093l7341l265m2514j28806p6999j27017j11383
18594c13178P5L8417Q8016k9272o2712n3482K8941k8612r5313p2564M8419P3889
$$ plain form
18582 -377376 -285355 -174771 -201325 -226587 -204199 -234053 -213797 -224537 -196433 -113444 5601
18571 5601 149862 106352 32165 11565 -48470 -67919 -127017 -172906 -201765 -269846 -275616 -243549
18559 -243549 -248419 -314091 -370670 -338465 -302109 -268708 -261489 -277130 -240109 -232333 -340961 -420674
18547 -420674 -391753 -421164 -375924 -374990 -332675 -255477 -224935 -209201 -202759 -158583 -134375 -102066
18535 -102066 -83608 30936 83517 36910 64643 108545 92822 107879 71869 -15469 -57466
18524 -57466 -63703 -47095 -62167 -43990 -5622 -47392 -59295 -68419 -83001 -67907 -176095 -240683
18512 -240683 -247697 -218435 -169102 -219240 -213338 -178457 -207588 -247437 -128986 -94044 -105173 -105195
18500 -105195 -171749 -151317 -132204 -141938 -84089 -24598 -20750 34812 105627 118596 -54480 -104282
$$ packed form
18582c77376R2021J10584k6554k5262K2388k9854K0256j0740K8104Q2989J19045
18571E601J44261m3510p4187k0600o0035j9449n9098m5889k8859o8081n770L2067
18559b43549m870o5672n6579L2205L6356L3401P219j5641L7021P776j08628p9713
18547d20674K8921k9411M5240R34M2315P7198L0542J5734O442M4176K4208L2309
18535a02066J8458J14544N2581m6607K7733M3902j5723J5057l6010q7338m1997
18524e7466o237J6608j5072J8177L8368m1770j1903r124j4582J5094j08188o4588
18512b40683p014K9262M9333n0138N902L4881k9131l9849J18451L4942j1129k2
18500a05195o6554K0432J9113r734N7849N9491L848N5562P0815J2969j73076m9802
$$ plain form
18488 -104282 -144704 -149000 -94674 -103939 -64296 -1711 -16137 -44439 -85850 -83801 -95254 -84716
18476 -84716 -45241 -51667 -65555 -23381 -51357 -6362 -35900 -70674 -126882 -261135 -231042 -134835
18464 -134835 -85759 -102956 -98560 -98867 -102792 -125280 -35989 53027 84511 122373 104524 22963
18452 22963 -124630 -121244 -72632 -96366 -105174 -85874 -89317 -6391 -5413 11706 18882 43493 206498
18439 206498 301846 329768 310289 232575 217944 190328 233305 231781 160345 95912 62190 39250
18427 39250 40708 52497 52848 126869 179996 144391 183779 250553 319145 259469 157531 209858
18415 209858 244848 159613 111123 145355 190236 107193 97124 160568 257502 265566 221730 118067
18403 118067 -34878 -29027 -2986 -83140 -19391 -38871 -119950 -79324 58309 101058 48532
$$ packed form
18488a04282m0422m296N4326r265L9643O2585j4426k8302m1411K049j1453J0538
18476h4716L9475o426j3888M2174k7976M4995k9538l4774n6208j34253L0093R6207
18464a34835M9076j7197M396l07l925k2488Q9291Q9016L1484L7862j7849q1561
18452B2963j47593L386M8612k3734q808J9300l443Q2926R78J7119P176K4611J63005
18439B06498R5348K7922j9479p7714j4631k7616M2977j524p1436o4433l3722k2940
18427C9250J458J1789L51P4021N3127l5605L9388O6774O8592n9676j01938N2327
18415B09858L4990q5235m8490L4232M4881q3043j0069O3444R6934Q064m3836j03663
18403A18067j52945N851K6041q0154O3749j9480q1079M0626J37633M2749n2526
$$ plain form
18392 48532 -46910 -130182 -84621 -97190 -118036 -133488 -186638 -219561 -214573 -188927 -178991 -167628
18380 -167628 -97399 -82632 -98930 -91497 -93332 -119885 -84890 -39321 -44333 -118691 -148917 -133620
18368 -133620 -74873 -49475 -9957 -45815 -88148 -50728 -32960 50 15818 -51277 -20699
18357 -20699 -52588 -73536 -67184 -54644 -46870 -83727 -128761 -11452 -13395 -58268 -54227 -45635
18345 -45635 22888 62935 69245 47195 24171 -19497 -75311 26920 113280 39764 18453 67811
18333 67811 55816 -3000 30416 155935 209689 213367 130752 31400 40951 95689 102748 86533
18321 86533 44004 -29821 -1368 27001 14136 -19455 -22676 123034 223228 192375 43278
18310 43278 -15859 -37477 -47269 26336 23001 -15154 -22871 -111853 -108598 -17226 36998 78035
$$ packed form
18392D8532r5442q3272M5561j2569k0846j5452n3150l2923M988K5646R936J1363
18380a67628P0229J4767j6298P433j835k6553L4995M5569n012p4358l0226J5297
18368a33620N8747K5398L9518l5858m2333L7420J7768L3010J5768o7095L0578
18357b0699l1889k0948O352J2540P774l6857m5034J17309j943m4873M041Q592
18345d5635O8523M0047O310k2050k3024m3668n5814J02231Q6360p3516k1311M9358
18333F7811j1995n8816L3416J25519N3754L678q2615r9352R551N4738P059j6215
18321H6533m2529p3825K8453K8369j2865l3591l221J45710J00194l0853j49097
18310D3278n9137k1618r792P3605l335l8155p717q8982L255R1372N4224M1037
$$ plain form
18298 78035 48606 76960 25194 54236 -19274 -112192 -52037 4294 8342 6764 -48763 -63803
18286 -63803 -24156 16356 34409 -23825 60969 84002 20595 40848 91064 -9718 -30778
18275 -30778 8639 -30353 -91399 -28391 26925 -19671 -42588 10734 67638 79021 138218 152476
18263 152476 146434 91309 90289 97004 41675 36554 81351 39198 19661 12016 5003 -70565 -115402
18250 -115402 -92460 -33268 -23102 -80246 -80384 -42383 -16756 -45004 -142543 -165051 -204606 -196187
18238 -196187 -124198 -24098 17984 44547 59576 55518 -74861 11444 52257 22789 17752
18227 17752 69183 116765 153338 68872 -8103 72456 163616 87291 107560 146195 92323 48197
18215 48197 60064 114919 158254 196060 263049 294306 391182 506177 480240 506398 513719 555898
$$ packed form
18298G8035k9429K8354n1766K9042p3510r2918O0155N6331M048j578n5527j5040
18286f3803L9647M0512J8053n8234Q4794K3033o3407K0253N0216j00782k1060
18275c0778L9417l8992o1046O3008N5316m6596k2917N3322N6904J1383N9197J4258
18263A52476o042n5125j020O715n5329n121M4797m2153j9537p645p013p5568m4837
18250a15402K2942N9192J0166n7144j38L8001K5627k8248r7539k2508l9555Q419
18238a96187P1989J00100M2082K6563J5029m058j30379Q6305M0813k9468n037
18227A7752N1431M7582L6573q4466p6975Q0559R1160p6325K0269L8635n3872m4126
18215D8197J1867N4855M3335L7806O6989L1257R6876J14995k5937K6158P321M2179
$$ plain form
18203 555898 699185 767192 704137 670220 764487 842592 853941 937867 906675 849727 899484
18192 899484 959123 1009782 1070583 1137075 1154062 1015013 840274 769396 866451 889194 873476
18181 873476 953664 908567 834668 819554 673837 548903 538038 396599 367344 359987 250010
18170 250010 160516 102199 105856 194110 134103 59020 25699 1434 -58712 -83888 -107287 -116196
18158 -116196 -47262 -52431 15089 83876 77941 109005 92784 20162 -22016 100458 260154
18147 260154 210209 88403 9619 -42904 -74316 -147560 -127787 -102589 -153787 -99161 11614
18136 11614 41632 80727 -39620 -125019 -69804 -4293 25829 -32774 -16605 39885 -40240
18125 -40240 -88823 -45837 35698 29896 -63913 -38588 83424 71510 15902 52249 6066 -112218
$$ packed form
18203E55898J43287O8007o3055l3917R4267P8105J1349Q3926l1192n6948M9757
18192H99484N9639N0659O0801O6492J6987j39049j74739p0878R7055K2743j5718
18181H73476Q0188m5097p3899j5114j45717j24934j0865j41439k9255p357j09977
18170B50010q9494n8317L657Q8254o0007p5083l3321k4265o0146k5176k3399q909
18158a16196O8934n169O7520O8787n935L1064j6221p2622m2178J22474J59696
18147B60154m9945j21806p8784n2523l1412p3244J9773K5198n1198N4626J10775
18136A1614L0018L9095j20347q5399N5215O5511L0122n8603J6169N6490q0125
18125d0240m8583M2986Q1535n802r3809K5325J22012j1914n5608L6347m6183j18284
$$ plain form
18113 -112218 -119050 -78470 -71864 -77627 -56498 -77111 -37239 -35109 -131385 -140613 -45264 46456
18101 46456 5169 -5304 -39094 -71729 -88575 -85197 -18499 39750 91909 -34828 -55401 -14837
18089 -14837 79407 137558 128816 -12658 -126972 -149973 -144544 -203243 -183842 -77982 -47636
18078 -47636 -53847 52302 107328 115377 101144 57269 15029 55624 110260 158441 121350 20474
18066 20474 -52550 -84157 -126936 -78265 38735 177516 185652 93703 53725 -84564 -148679
18055 -148679 -190481 -140151 -101171 -168999 -182415 -147205 -87460 -114500 -126269 -51894 -19283
18044 -19283 8728 42424 96989 99725 46635 -60795 -17628 33217 -10535 30941 43032 73798
18032 73798 101714 19555 3608 58280 58965 15569 25675 -25787 -59104 -86207 -123076 -157141
$$ packed form
18113a12218o832M0580O606n763K1129k0613L9872K130r6276r228R5349R1720
18101D6456m1287j0473l3790l2635j6846L378O6698N8249N2159j26737k0573M0564
18089a4837R4244N8151q742j41474j14314k3001N429n8699J9401J05860L0346
18078d7636o211J06149N5026Q049j4233m3875m2240M0595N4636M8181l7091j00876
18066B0474p3024l1607m2779M8671J17000J38781Q136r1949l9978j38289o4115
18055a48679m1802N0330L8980o7828j3416L5210N9745k7040j1769P4375L2611
18044a9283K8011L3696N4565K736n3090j07430M3167N0845m3752M1476J2091L0766
18032G3798K7916q2159j5947N4672O85m3396J0106n1462l3317k7103l6869l4065
$$ plain form
18020 -157141 -83098 -63604 -19775 -12218 1848 -59695 -67717 -49658 -142824 -214642 -191884 -127777
18008 -127777 -83209 -53645 24528 -19744 -15022 -40940 -2037 -2383 -37752 -30831 -10916 16329
17996 16329 87998 99921 25662 -41822 -57954 -60426 -164789 -140814 -150103 -116828 -99560 -121565
17984 -121565 -103626 -55385 61861 61224 17455 -56746 -2487 32465 38509 15996 28605 18714
17972 18714 24321 22289 11508 47221 102799 120158 55048 81715 68933 7330 -1152 53409
17960 53409 32716 15764 9052 -39962 -102471 -13254 54455 109776 152261 17603 -26522 46061
17948 46061 13064 -92716 -85621 -90671 -37346 -9780 -16755 62827 71283 65727 9250 -42232
17936 -42232 -10046 -12770 -34024 -18352 34472 18623 -3107 -45530 9482 -35048 -66180 -43881
$$ packed form
18020a57141P4043J9494M3829P557J4066o1543q022J8059r3166p1818K2758O4107
18008a27777M4568K9564P8173m4272M722k5918L8903l46l5369O921J9915K7245
17996A6329P1669J1923p4259o7484j6132k472j04363K3975r289L3275J7268k2005
17984a21565J7939M8241J17246o37m3769p4201N4259L4952O044k2513J2609r891
17972A8714N607k032j0781L5713N5578J7359o5110K6667j2782o1603q482N4561
17960E3409k0693j6952o712m9014o2509Q9217O7709N5321M2485j34658m4125P2583
17948D6061l2997j05780P095n050N3325K7566o975P9582Q456n556n6477n1482
17936d2232L2186k724k1254J5672N2824j5849k1730m2423N5012m4530l1132K2299
$$ plain form
17924 -43881 -70295 -43561 -52163 -124550 -187748 -135843 -101836 -44574 36920 40457 72189 76368
17912 76368 62357 71459 66848 -1848 58447 77347 -2866 -83166 -111205 13688 92118 85522
17900 85522 924 -27460 -91914 -25789 34878 81641 207219 258898 162060 62362 -22516
17889 -22516 16382 -1626 -35560 -49990 -103892 -105477 -22698 -29900 28863 31260 11432 2407
17877 2407 58264 128522 64911 -6381 -30860 -96738 -99077 -113671 -70308 -23548 -21785 -7629
17865 -7629 36204 33706 -35990 -20820 46076 131489 66290 26209 14180 45658 -28222 -98030
17853 -98030 -99822 -47721 11492 41793 35034 13986 28126 46143 73199 67014 -8569 -41462
17841 -41462 -46406 -47873 -63665 -27962 31874 86012 33721 -119873 -68468 114137 219828
$$ packed form
17924d3881k6414K6734q602p2387o3198N1905L4007N7262Q1494L537L1732M179
17912G6368j4011R102m611o8696O0295J8900q0213q0300k8039J24893P8430o596
17900H5522q4598k8384o4454O6125O0667M6763J25578N1679r6838r9698q4878
17889b2516L8898j8008l3934j4430n3902j585Q2779p202N8763K397j9828r025
17877B407N5857P0258o3611p1292k4479o5878k339j4594M3363M6760J763J4156
17865g629M3833k498o9696J5170O6896Q5413o5199m0081j2029L1478p3880o9808
17853i8030j792N2101N9213L0301o759k1048J4140J8017K7056o185p5583l2893
17841d1462m944j467j5792L5703N9836N4138n2291j53594N1405J82605J05691
$$ plain form
17830 219828 234453 142578 42289 48500 13468 -43415 11371 66536 77289 9360 -20588
17819 -20588 -12166 54524 67264 127645 61817 -17407 -12354 76831 139093 156833 74095 17292
17807 17292 -46053 -40667 10339 58572 104265 75126 -16724 20319 108193 116184 120726 89290
17795 89290 46262 128 -69616 -36924 -34778 -53259 30250 159675 125305 45038 69456 -5058
17783 -5058 -45815 -36855 -19734 27842 -22202 -124039 -88300 -43533 -59811 -106778 -123097 -121665
17771 -121665 -127689 -81352 -137200 -142235 -105139 4785 16730 -65534 -212280 -249087 -282676
17760 -282676 -201748 -88604 37851 114588 83038 52692 98924 60662 39134 84555 200112
17749 200112 169898 129300 100733 65963 4351 -51877 -43534 -34195 50981 78162 95524 50702
$$ packed form
17830B19828J4625r1875j00289O211l5032n6883N4786N5165J0753o7929k9948
17819b0588Q422O6690J2740O0381o5828p9224N053Q9185O2262J7740q2738n6803
17807A7292o3345N386N1006M8233M5693k9139r1850L7043Q7874P991M542l1436
17795H9290m3028m6134o9744L2692K146j8481Q3509J29425l4370q0267K4418p4514
17783e058m0757Q960J7121M7576n0044j01837L5739M4767j6278m6967j6319J432
17771a21665o024M6337n5848n035L7096J09924J1945q2264j46746l6807l3589
17760b82676Q0928J13144J26455P6737l1550l0346M6232l8262k1528M5421J15557
17749B00112l0214m0598k8567l4770o1612n6228Q343R339Q5176K7181J7362m4822
$$ plain form
17737 50702 -22802 -84080 -92658 -32108 -84906 -129729 -143455 -182950 -156957 -94117 -56610 -89876
17725 -89876 -91588 -92506 -42859 5294 -70671 -66060 -42390 -70585 -33478 35997 56204 28142
17713 28142 47549 -8795 -27693 54155 102419 139159 106955 21650 -71525 -70764 -22097 4977
17701 4977 -43723 -77121 -73922 -30930 -14486 -37049 -44792 -100821 -264171 -245501 -145623 -70710
17689 -70710 -22464 71140 -10270 -56301 -49341 -6195 15755 7927 11020 -37501 -86933 -123157
17677 -123157 -181636 -108541 -59003 -46777 -45381 -55763 -71513 -53455 -3486 21985 25889 126210
17665 126210 117219 -47517 -125950 -98466 -66241 -25017 -13673 5976 112913 137502 88278
17654 88278 91546 25683 34195 91651 24119 -88956 -82200 -87393 -106255 -39065 -7307 -8962
$$ packed form
17737E0702p3504o1278q578O0550n2798m4823j3726l9495K5993O2840L7507l3266
17725h9876j712r18M9647M8153p5965M611K3670k8195L7107O9475K0207k8062
17713B8142J9407n6344j8898Q1848M8264L6740l2204q5305r3175P61M8667K7074
17701D977m8700l3398L199M2992J6444k2563p743n6029j63350J8670R9878P4913
17689g0710M8246R3604q1410m6031O960M3146K1950p828L093m8521m9432l6224
17677a23157n8479P3095M9538J2226J396j0382j5750J8058M9969K5471L904J00321
17665A26210q991j64736p8433K7484L2225M1224J1344J9649J06937K4589m9224
17654H8278L268o5863Q512N7456o7532j13075O756n193j8862O7190L1758j655
$$ plain form
17642 -8962 26044 43751 29454 -17640 -35808 -7719 73264 131666 25135 -29988 -96647 -57142
17630 -57142 -6070 64506 100548 59185 14874 -4599 2654 -25975 -104058 -106970 -86613 -135674
17618 -135674 -189414 -138819 -60234 -28313 20314 16447 116875 164086 159357 191659 171555 50249
17606 50249 67068 122668 9310 -11188 14521 10131 -39649 -103966 -99365 -97049 -72824 -82291
17594 -82291 -64319 -49125 -1450 71150 136208 104279 48709 110135 90455 8015 42328 18037
17582 18037 -52682 -60377 -71121 -73476 -74333 -114135 -105604 -109337 -64574 -211824 -227563 -120171
17570 -120171 50211 22568 28986 114740 142137 109079 37942 -77876 -87743 -161786 -150696
17559 -150696 -48233 34001 -28017 -90780 -109434 -117584 -102848 -79316 1279 -28452 -65253
$$ packed form
17642h962L5006J7707j4297m7094j8168K8089Q0983N8402j06531n5123o6659L9505
17630e7142N1072P0576L6042m1363m4311j9473P253k8629p8083k912K0357m9061
17618a35674n3740N0595P8585L1921M8627l867J00428M7211m729L2302k0104j21306
17606E0249J6819N5600j13358k0498K5709m390m9780o4317M601K316K4225r467
17594h2291J7972J5194M7675P2600O5058l1929n5570O1426j9680q2440L4313k4291
17582A8037p0719p695j0744k355q57l9802Q531l733M4763j47250j5739J07392
17570a20171J70382k7643O418Q5754K7397l3058p1137j15818r867p4043J1090
17559a50696J02463Q2234o2018o2763j8654q150J4736K3532Q0595k9731l6801
$$ plain form
17548 -65253 -75673 -167151 -133802 -72444 -4960 2487 -87486 -149194 -94848 69826 157408 91842
17536 91842 -22979 8407 536 -55933 -58848 62676 -28404 -86393 -62322 -38011 6545 37861
17524 37861 78139 -3689 -42689 8896 -44719 -60591 -27952 -9757 -26671 -37207 -99943 -62714
17512 -62714 -95876 -114804 -75333 -88718 -25578 23098 81389 21990 9116 -9748 -5357 -56722
17500 -56722 -62829 -42524 -7840 -35583 5575 6139 -45502 -105134 -33932 3130 31003 49162
17488 49162 13283 -65403 -9036 -36862 -24678 21772 21318 9536 -75009 -169764 -131603 -41147
17476 -41147 12126 -59970 -63128 -68046 -4620 56458 49807 10730 84543 20735 -112970 -97312
17464 -97312 -97516 -129302 -142829 -193747 -154675 -41675 -57532 -100903 -106009 -108076 -83292 -21658
$$ packed form
17548f5253j0420r1478L3349O1358O7484P447q9973o1708N4346J64674Q7582o5566
17536I1842j14821L1386p871n6469k915J21524r1080n7989K4071K4311M4556L1316
17524C7861M0278q1828l9000N1585n3615j5872L2639J8195j6914j0536o2736L7229
17512f2714l3162j8928L9471j3385O3140M8676N8291n9399j2874j8864M391n1365
17500e6722o107K0305L4684k7743M1158N64n1641n9632P1202L7062K7873J8159
17488D9162l5879p8686N6367k7826J2184M6450m54j1782q4545r4755L8161R0456
17476d1147N3273p2096l158m918O3426O1078o651l9077P3813o3808j33705J5658
17464i7312k04l1786j3527n0918L9072J13000j5857m3371n106k067K4784O1634
$$ plain form
17452 -21658 -6961 -84648 -66507 -28033 9424 26265 25342 25770 13438 29824 -26647 -13365
17440 -13365 15222 15878 -44819 -89088 -21038 26441 126469 132878 83684 80067 25705 -24970
17428 -24970 39098 113798 34836 -98535 -182234 -183393 -69340 -43542 -106073 -128229 -69628
17417 -69628 -81220 63835 46025 9777 16568 41175 -23664 -35629 -51340 -37628 -12777 24175
17405 24175 -13232 -19800 38141 59378 61401 63598 -14940 5990 105555 69489 65672 68451 -3551
17392 -3551 8870 48043 43982 51185 19565 -14304 49017 21953 -38285 -122905 -51701 -7930
17380 -7930 -31991 -53859 -63733 -89019 -18880 -1847 29381 57608 91476 163218 193812 142810
17368 142810 43643 32261 23488 134376 104826 63186 -29951 -18617 14467 120043 53040
$$ packed form
17452b1658J4697p7687J8141L8474L7457J6841r23M28j2332J6386n6471J3282
17440a3365K8587O56o0697m4269O8050M7479J00028O409m9194l617n4362n0675
17428b4970O4068P4700p8962j33371q3699j159J14053K5798o2531k2156N8601
17417f9628j1592J45055j7810l6248O791K4607o4839j1965j5711J3712K4851L6952
17405B4175l7407o568N7941K1237K023K197p8538K0930R9565l6066l817K779p2002
17392c551J2421L9173m061P203l1620l3869O3321k7064o0238q4620P1204M3771
17380g930k4061k1868r874k5286P0139J7033L1228K8227L3868P1742L0594n1002
17368A42810r9167j1382q773J10888k9550m1640r3137J1334L3084J05576o7003
$$ plain form
17357 53040 -56875 -88820 -128776 -131154 -67168 -93232 -93217 -53129 -49097 -6693 36050 92750
17345 92750 54380 8448 35174 28282 17219 73369 -28579 -44015 -59043 -31948 62913 52105
17333 52105 72497 62989 64935 58445 54401 12220 -36891 -88732 -89573 -22359 16974 34667 -83141
17320 -83141 -50266 -43329 -50866 -45521 -71498 -22361 40911 54803 85199 115636 37226 34093
17308 34093 117336 216581 153063 22793 -71163 -130309 -138717 -88480 -25484 33540 94584 149271
17296 149271 169290 125656 177952 206540 171177 61149 3172 -98606 -58990 -4207 -195
17285 -195 64978 51551 14173 -53632 -47703 -45628 -34482 51424 99862 44954 -78675 -117190
17273 -117190 -48177 -9150 65802 101583 118593 135769 102648 134894 153887 155902 113030 115861
$$ packed form
17357E3040j09915l1945l9956k378O3986k6064J5M0088M032M2404M2743N6700
17345I2750l8370m5932K6726o892j1063N6150j01948j5436j5028K7095R4861j0808
17333E2105K0392r508J946o490m044m2181m9111n1841q41O7214L9333J7693j17808
17320h3141L2875O937p537N345k5977M9137O3272J3892L0396L0437p8410l133
17308C4093Q3243R9245o3518j30270r3956n9146q408N0237O2996N9024O1044N4687
17296A49271K0019m3634N2296K8588l5363j10028n7977j01778L9616N4783M012
17285a95O5173j3427l7378o7805N929K075J1146Q5906M8438n4908j23629l8515
17273a17190O9013L9027P4952L5781J7010J7176l3121L2246J8993K015m2872K831
$$ plain form
17261 115861 60952 -451 -360 -60882 -76559 11887 101172 77414 51769 78644 78220 8696
17249 8696 19781 39888 -19948 -35230 -50202 -64509 -67897 -46142 -131848 -76430 -80754 -63307
17237 -63307 921 -51824 -146269 -142776 -145122 -92286 10373 58558 7892 73438 120253 126873
17225 126873 104341 106377 36932 -57872 -79539 -38978 38165 38914 112446 76349 -15526 18301
17213 18301 76721 4437 -53215 -66854 -14611 60049 88182 72889 19245 36591 15541 8225
17201 8225 -91008 -15408 35946 79934 191603 197954 98851 93021 108152 19540 -53891 -2152
17189 -2152 89381 108713 121341 56991 -16714 -29312 -21337 -1713 -6022 47107 155867 211228
17177 211228 82732 53056 -1378 53885 104489 52275 102075 113146 87543 103924 104318 112192
$$ packed form
17261A15861n4909o1403R1o0522j5677Q8446Q9285k3758k5645K6875m24o9524
17249H696J1085K0107n9836j5282j4972j4307l388K1755q5706N5418m324J7447
17237f3307O4228n2745r4445L493k346N2836J02659M8185n0666O5546M6815O620
17225A26873k2532K036o9445r4804k1667M0561P7143P49P3532l6097r1875L3827
17213A8301N8420p2284n7652j3639N2243P4660K8133j5293n3644J7346k1050p316
17201H225r9233P5600N1354M3988J11669O351r9103n830J5131q8612p3431N1739
17189b152R1533J9332J2628o4350p3705j2598P975J9624m309N3129J08760N5361
17177B11228j28496k9676n4434N5263N0604n2214M9800J1071k5603J6381L94P874
$$ plain form
17165 112192 94165 74980 123636 154677 89349 -4757 -100652 -105471 -124088 -62482 69774
17154 69774 -33125 -21716 -15898 -122463 -174292 -144088 -149421 -160003 -166971 -165886 -9588 37172
17142 37172 -19457 -37782 -61664 -46165 44789 40598 -43196 29944 39986 -20545 -57945 -13922
17130 -13922 29059 97428 93623 55540 38653 51223 27174 65737 13925 -30129 -44351 -109219
17118 -109219 -81076 -72276 -84804 3995 20512 -5179 -38945 -18100 -29868 -21537 -11341 -41730
17106 -41730 -40062 -20428 -44591 -93624 -8504 66641 137404 156499 141001 123532 92703 108030
17094 108030 97120 60438 24309 7538 89562 133416 38445 82278 44632 -36927 13966
17083 13966 155902 124994 80358 112995 102009 26986 27166 107023 146506 61258 15867 13903
$$ packed form
17165A12192j8027j9185M8656L1041o5328r4106r5895m819j8617O1606J32256
17154F9774j02899J1409N818j06565n1829L0204n333j0582o968J085J56298M6760
17142C7172n6629j8325k3882J5499R0954m191q3794P3140J0042o0531l7400M4023
17130a3922M2981O8369l805l8083j6887J2570k4049L8563n1812m4054j4222o4868
17118a09219K8143Q800j2528Q8799J6517k5691l3766K0845j1768Q331J0196l0389
17106d1730J668J9634k4163m9033Q5120P5145P0763J9095j5498j7469l0829J5327
17094A08030j0910l6682l6129j6771Q2024M3854r4971M3833l7646q1559N0893
17083A3966J41936l0908m4636L2637j0986p5023J80P9857L9483q5248m5391j964
$$ plain form
17071 13903 40097 49876 104120 151861 199112 153906 90531 40281 69151 38462 -50570 -101356
17059 -101356 -23083 121571 106070 93 -53950 -50236 28172 -46670 -124827 -18242 -24936
17048 -24936 -31840 -35606 -145213 -161162 -162980 -128801 -72346 -36696 9793 -17394 -81256 -36528
17036 -36528 13330 -5461 -15936 -59012 -44346 -68540 -103435 -107005 -109795 -132622 -153565 -150024
17024 -150024 -141159 -183396 -259744 -195022 -65621 -10553 -31205 -93824 -62265 -55574 -48126 -28536
17012 -28536 -48113 -11340 43357 -317 -12110 54697 59001 40244 -22413 -71750 -104640 -38735
17000 -38735 -36563 -25282 -65086 -33911 -8586 -23153 14232 -18497 -46977 -93436 -126018 -64545
16988 -64545 -63414 -112401 -79569 -101516 -80396 -140402 -155907 -116593 -48979 -108558 -89629 -20044
$$ packed form
17071A3903K6194R779N4244M7741M7251m5206o3375n0250K8870l0689q9032n0786
17059a01356P8273J44654j5501j05977n4043L714P8408p4842p8157J06585o694
17048b4936o904l766j09607j5949j818L4179N6455L5650M6489k7187o3862M4728
17036c6528M9858j8791j0475m3076J4666k4194l4895l570k790k2827k0943L541
17024a50024Q865m2237p6348O4722J29401N5068k0652o2619L1559O691P448J9590
17012b8536j9577L6773N4697m3674j1793O6807M304j8757o2657m9337l2890O5905
17000c8735K172J1281l9804L1175K5325j4567L7385l2729k8480m6459l2582O1473
16988f4545J131m8987L2832k1947K1120o0006j5505L9314O7614n9579J8929O9585
$$ plain form
16976 -20044 -6727 -6549 -46064 -15324 -26369 -88502 -130222 -64302 -48085 -93543 -40591 43703
16964 43703 42256 17938 52481 107637 110802 -24785 -92064 -107445 -109910 -124421 -119538 -78533
16952 -78533 -25339 -46437 38969 60725 -43357 -57284 -153923 -137338 -113838 -142182 -69584
16941 -69584 -15356 75867 73265 17601 -19231 47505 117366 142393 117356 74611 43656 -52018
16929 -52018 -64133 -92066 -109031 7766 75835 42572 26050 -5408 -42702 -58305 -75875
16918 -75875 -165103 -158349 -102904 32032 -1361 -12945 49183 19918 -49724 -166002 -159812 -149722
16906 -149722 -111290 -55888 -12870 8210 12460 65385 49907 39436 -43258 -114342 -163680 -143172
16894 -143172 -102188 -106675 2255 60161 -42415 -63432 27947 84526 30437 -78544 -61067
$$ packed form
16976b0044J3317J78l9515L0740j1045o2133m1720O5920J6217m5458N2952Q4294
16964D3703j447k4318L4543N5156L165j35587o7279j5381k465j4511M883M1005
16952g8533N3194k1098Q5406K1756j04082j3927r6639J6585K3500k8344P2598
16941f9584N4228R1223k602n5664l6832O6736O9861K5027k5037m2745l0955r5674
16929e2018j2115k7933j6965J16797O8069l3263j6522l1458l7294j5603j7570
16918g5875q9228O754N5445J34936l3393j1584O2128k9265o9642j16278O190J0090
16906a49722L8432N5402M3018K1080M250N2925j5478j0471q2694p1084m9338K0508
16894a43172M0984m487J08930N7906j02576k1017R1379N6579n4089j08981J7477
$$ plain form
16883 -61067 -46803 -118230 -124176 -17772 10596 -8320 -48075 25735 -20988 -39078 -74711 -82692
16871 -82692 -100178 -48821 -12280 -43695 -94941 -285861 -413379 -341671 -169203 -91887 -15045
16860 -15045 19596 35032 7499 -24271 26704 139002 132722 132738 74488 118082 96402 62241
16848 62241 57341 53239 114257 54175 -59313 1895 -41858 -61101 -94076 -32281 -963 -13290
16836 -13290 -8204 -24014 -32754 -118586 -156221 -32197 39135 25533 -39373 -26639 -62437 20634
16824 20634 11766 -47197 -51802 -56241 -8601 41817 -1624 -3297 44291 56050 118566 176574
16812 176574 87969 44511 -37271 -106431 -113558 -104768 -177711 -141034 -114126 -83301 -41790 -127137
16800 -127137 -88763 -10324 75266 159334 135003 128655 12748 -64875 -134881 -77486 -69683 3661
$$ packed form
16883f1067J4264p1427n946J06404K8368j8916l9755P3810m6723j8090l5633p981
16871h2692j7486N1357L6541l1415n1246j90920j27518P1708J72468P7316P6842
16860a5045L4641J5436k7533l1770N0975J12298o280J6n8250M3594k1680l4161
16848F2241m900m102O1018o0082j13488O1208m3753j9243l2975O1795L1318j2327
16836a3290N086j5810q740q5832l7635J24024P1332j3602o4906J2734l5798Q3071
16824B0634q868n8963m605m439M7640N0418m3441j673M7588J1759O2516N8008
16812A76574q8605m3458q1782o9160p127Q790p2943L6677K6908L0825M1511q5347
16800a27137L8374P8439Q5590Q4068k4331o348j15907p7623p0006N7395P803P3344
$$ plain form
16788 3661 23961 -13734 14019 59498 14030 40936 29386 9953 -73061 -106768 -82895 -107281
16776 -107281 -44719 -23035 -74193 -106634 -55607 51273 88055 147938 117788 94537 32806
16765 32806 66962 47538 -40257 -80124 -75576 -42462 -66975 -18163 53732 88778 7175 -7637
16753 -7637 40639 -14056 14201 -35077 39132 187586 128641 69561 53119 119030 64613 151396
16741 151396 215495 138748 109660 22138 -155265 -140935 -52420 -16918 -31439 -37832 29419
16730 29419 68509 -42846 -160785 -178204 -173621 -169952 -95230 -2444 49637 3804 -10496 -115523
16718 -115523 -47914 12075 -18909 -137157 -88929 -5077 -49530 -65477 6270 80804 56457
16707 56457 22448 55652 41514 28514 -14961 -59979 -108847 -26467 3196 43871 10067 -20396
$$ packed form
16788C661K0300l7695K7753M5479m5468K6906j1550j9433q3014l3707K3873k4386
16776a07281O2562K1684n1158l2441N1027J06880L6782N9883l0150k3251o1731
16765C2806L4156j9424q7795l9867M548L3114k4513M8812P1895L5046q1603j4812
16753g637M8276n4695K8257m9278P4209J48454n8945n9080j6442O5911n4417Q6783
16741A51396O4099p6747k9088q7522j77403J4330Q8515L5502j4521o393O7251
16730B9419L9090j11355j17939j7419M583L669P4722R2786N2081m5833j4300j05027
16718a15523O7609N9989l0984j18248M8228Q3852m4453j5947P1747P4534k4347
16707E6457l4009L3204j4138j3000m3475m5018m8868Q2380K9663M0675l3804l0463
$$ plain form
16695 -20396 33996 36820 41877 86635 57885 -38355 -32283 4505 50062 88127 30888 76453
16683 76453 22593 -2825 -50829 -38584 4652 99380 110362 111262 113882 171377 230057 190355
16671 190355 110444 65577 84268 82846 116588 29094 9047 88348 127202 175282 100781 50527
16659 50527 22693 39353 79150 143471 119270 -29335 -72914 10671 -22038 -148084 -160805
16648 -160805 -99965 -67472 -48803 -126036 -127075 -60837 12597 26536 39737 96917 164164 199541
16636 199541 187533 125591 -69334 -79065 -47699 10582 59835 32931 -61222 -68321 -86086 -50106
16624 -50106 -40736 -58159 -133649 -174080 -114174 -120131 -36452 -14603 -12631 29481 58109 93175
16612 93175 76104 72262 85894 29473 -13475 -33128 -41621 -60651 -92225 7165 109477 66334
$$ packed form
16695b0396N4392K824N057M4758k8750r6240O072L6788M5557L8065n7239M5565
16683G6453n3860k5418m8004J2245M3236R4728J0982R00K620N7495N8680l9702
16671A90355p9911m4867J8691j422L3742q7494k0047P9301L8854M8080p4501n0254
16659E0527k7834J6660L9797O4321k4201j48605m3579Q3585l2709j26046j2721
16648a60805O0840L2493J8669p7233j039O6238P3434J3939J3201N7180O7247L5377
16636A99541j2008o1942j94925r731L1366N8281M9253k6904r4153p099j7765L5980
16624e0106R370j7423p5490m0431N9906n957Q3679K1849J972M2112K8628L5066
16612I3175j7071l842J3632n6421m2948j9653q493j9030l1574R9390J02312m3143
$$ plain form
16600 66334 -31825 -24227 -34998 -113582 -34405 -16634 19563 20308 -61854 -4374 48395 86740
16588 86740 40939 -27885 -124931 -74329 57567 70534 85995 42378 6436 -44395 -13431
16577 -13431 30487 8723 23638 59178 113082 151345 125042 90269 116069 44216 85834 66474
16565 66474 15044 -13080 -100272 -165662 -172851 -193581 -79860 68518 116624 -24574 -51192
16554 -51192 -78860 -67880 -44349 10347 -58425 -35570 46285 28334 -4884 41558 68369 53172
16542 53172 110085 108381 28611 -31092 -35582 46978 74668 82339 30412 25280 94789 103320 -17272
16529 -17272 -36193 -46137 7006 74648 51146 -6776 -26105 1090 27895 10565 36251 16221
16517 16221 19331 19748 -56280 -83668 -39356 -34931 -18440 -15027 4165 -7021 26946 16238 -96915
$$ packed form
16600F6334r8159P598j0771p8584P9177J7771L6197P45q2162N7480N2769L8345
16588H6740m5801o8824r7046N0602J31896J2967J5461m3617l5942n0831L0964
16577a3431M3918k1764J4915L5540N3904L8263k6303l4773K5800p1853M1618j9360
16565F6474n1430k8124q7192o5390p189k0730J13721J48378M8106j41198k6618
16554e1192k7668J0980K3531N4696o8772K2855Q1855j7951l3218M6442K6811j5197
16542E3172N6913j704p9770n9703m490Q2560K7690P671n1927n132O9509Q531j20592
16529a7272j8921r944N3143O7642k3502n7922j9329K7195K6805j7330K5686k0030
16517A6221L110M17p6028k7388M4312M425J6491L413J9192j1186L3967j0708j13153
$$ plain form
16504 -96915 -112394 -178051 -128752 -80631 -104800 -82131 -142589 -155146 -10267 79609 94457
16493 94457 9410 -42053 -3194 -57916 -140057 -159574 -79584 56413 26027 -1998 54160
16482 54160 134937 120767 123031 194152 179877 132213 75220 78108 9087 -27517 14604 45922
16470 45922 29304 5356 -28599 -9477 -59872 -86288 -66611 -8873 60988 32909 40846 87813
16458 87813 79643 8187 -4626 8861 47332 45430 47901 77459 15782 -26509 42793 89331
16446 89331 30356 -52860 -32035 18462 36195 85694 82010 10232 -41718 -2345 60156 88336
16434 88336 26965 -11025 27146 10733 4114 43378 75353 85968 -5175 -139095 -115207 -51838
16422 -51838 853 50546 128743 178618 215806 120756 -16918 -80654 -21785 -46365 27849
$$ packed form
16504i6915j5479o5657M9299M8121k4169K2669o0458j2557J44879Q9876J4848
16493I4457q5047n1463L8859n4722q2141j9517P9990J35997l0386k8025N6158
16482E4160Q0777j4170K264P1121j4275m7664n6993K888o9021l6604M2121L1318
16470D5922j6618k3948l3955J9122n0395k6416J9677N7738O9861k8079P937M6967
16458H7813q170p1456j2813J3487L8471j902K471K9558o1677m2291O9302M6538
16446H9331n8975q3216K0825N0497J7733M9499l684p1778n1950L9373O2501K8180
16434H8336o1371l7990L8171j6413o619L9264L1975J0615r1143j33920K3888O3369
16422e1838N2691M9693P8197M9875L7188r5050j37674o3736N8869k4580P4214
$$ plain form
16411 27849 26429 115997 149410 78022 97592 169927 122475 151361 161081 153172 98387 93448
16399 93448 11786 33918 64437 -40608 -193186 -195826 -139245 -44058 -18243 -70370 -76038 -118288
16387 -118288 -96703 -6491 -27391 -13644 -11139 -25454 17908 -40103 -99516 -61363 -24269 -13448
16375 -13448 -13307 -57087 -112021 -125373 -111954 -116246 -88597 -12582 -3468 -20669 -14340 -54000 -88070
16362 -88070 -22335 -13944 -110501 -43845 45166 86439 75990 27290 13250 -17671 -32277 -148830
16350 -148830 -111446 -96182 -100671 -84420 28661 59901 38171 14687 -3159 -12474 24360 83287
16338 83287 70880 66305 13068 -61282 -18462 -21976 -76631 -21870 29804 20557 -94336 -128933
16326 -128933 -131758 -120064 -40493 -4324 -34450 1289 76014 65530 -19049 -51491 -78608 -112147
$$ packed form
16411B7849j420Q9568L3413p1388J9570P2335m7452K8886R720p909n4785m939
16399I3448q1662K2132L0519j05045j52578k640N6581R5187K5815n2127n668m2250
16387a18288K1585R0212k0900J3747K505j4315M3362n8011n9413L8153L7094J0821
16375a3448J41m3780n4934j3352J3419m292K7649P6015R114j7201O329l9660l4070
16362h8070O5735Q391r6557O6656Q9011M1273j0449m8700j4040l0921j4606j16553
16350a48830L7384J5264m489J6251J13081L1240k1730k3484j7846r315L6834N8927
16338H3287j2407m575n3237p4350M2820l514n4655N4761N1674r247j14893l4597
16326a28933k825J1694P9571L6169l0126L5739P4725j0484q4579l2442k7117l3539
$$ plain form
16314 -112147 1149 86940 22824 -188 4771 25047 11159 -34754 -59552 -58869 -26578 -20395
16302 -20395 -28032 63430 147949 144941 52799 -18560 29938 -41382 -37832 -40740 -103944 -209901
16290 -209901 -204914 -182828 -78045 -16711 -10211 -3283 10281 -61410 -64037 -6800 38340 121929
16278 121929 89616 19445 10136 91314 126371 9515 -54913 -85737 -125698 -72485 -17562
16267 -17562 2758 57151 91227 58096 -53715 -28161 -13325 -17406 -151333 -150595 -141039 -97957
16255 -97957 -61910 9074 44323 11473 -59406 -26000 17572 63290 57614 65935 32470 -14107
16243 -14107 -18167 -65103 -122406 -66339 -67612 -130846 -144570 -103188 -36158 -16787 -68028 -105822
16231 -105822 -23142 30037 -2820 -103893 -66177 3455 54320 19968 -50215 -103723 -31335
$$ packed form
16314a12147J13296Q5791o4116k3012M959K0276j3888m5913k4798O83L2291O183
16302b0395p637R1462Q4519l008r2142p1359M8498p1320L550k908o3204j05957
16290b09901M987K2086J04783O1334O500O928J3564p1691k627N7237M5140Q3589
16278A21929l2313p0171r309Q1178L5057j16856o4428l0824l9961N3213N4923
16267a7562K0320N4393L4076l3131j11811K5554J4836m081j33927P38R556M3082
16255i7957L6047P0984L5249l2850p0879L3406M3572M5718n676Q321l3465m6577
16243a4107m060m6936n7303N6067j273o3234j3724M1382O7030J9371n1241l7794
16231a05822Q2680N3179l2857j01073L7716O9632N0865l4352p0183n3508P2388
$$ plain form
16220 -31335 16117 51376 95881 133105 84508 41292 10619 -5734 -4107 -44349 -65561 -78091
16208 -78091 -59815 -23130 -14579 9953 -12851 -80451 -14572 -47176 11039 -5990 -18092 -10005
16196 -10005 -72264 -80321 -45306 -96839 -120492 -105439 -124456 -129464 -232638 -236054 -153747 -145076
16184 -145076 -87846 -26656 -65385 -128332 -43993 -26167 -81197 35653 89788 44359 28779
16173 28779 -9994 -19621 -76354 -72612 -127298 -137937 -150650 -35701 34780 -31478 -48276 -80488
16161 -80488 -52092 -50429 -87413 -71161 -36031 -48414 -32237 -59141 -110989 -33806 -26542 13861
16149 13861 83234 53241 57554 118288 83667 46419 -79971 -153190 -142409 -99597 -73892 -38195
16137 -38195 -23650 15701 71284 139135 120656 32913 -32019 8698 107853 112996 35832 -8185
$$ packed form
16220c1335M7452L5259M4505L7224m8597m3216l0673j6353J627m0242k1212j2530
16208g8091J8276L6685Q551K4532k2804o7600O5879l2604N8215j7029j2102Q087
16196a0005o2259q057L5015n1533k3653J5053j9017n008j03174l416Q2307Q671
16184a45076N7230O1190l8729o2947Q4339J7826n5030J16850N4135m5429j5580
16173B8779l8773r627n6733L742n4686j0639j2713J14949P0481o6258j6798l2212
16161h0488K8396J663l6984J6252L5130j2383J6177k6904n1848P7183P264M0403
16149A3861O9373k9993M313O0734l4621l7248j26390p3219J0781M2812K5705L5697
16137c8195J4545L9351N5583O7851j8479q7743o4932M0717R9155N143p7164m4017
$$ plain form
16125 -8185 3488 62875 78731 118017 113738 138614 49365 23685 -77496 -201044 -155938 -43287
16113 -43287 87758 45175 38736 65292 36428 78308 -9295 -42252 -21262 -84080 -16300 52298
16101 52298 89995 15316 66608 80428 -68639 -186314 -207484 -152263 -134772 -115579 -74958
16090 -74958 -127322 -141766 -140400 -153682 -145992 -54786 -1057 43477 -13922 24460 66160 50453
16078 50453 83428 -19524 -47504 50398 73817 19988 -25897 6098 16373 -49595 -54035 42784
16066 42784 72130 72372 66261 158917 171345 93696 3634 -28383 622 5933 -19336 -62662
16054 -62662 -60372 -23008 -31923 -69367 -91355 -62490 3002 -55377 -133073 -114334 -143638 -104161
16042 -104161 -129906 -110175 5754 59760 129915 51271 10666 -4065 -55216 28141 42429
$$ packed form
16125h185J1673N9387J5856L9286m279K4876q9249k5680j01181j23548M5106J12651
16113d3287J31045m2583o439K6556k8864M1880q7603l2957K0990o2818O7780O8598
16101E2298L7697p4679N1292J3820j49067j17675k1170N5221J7491J9193M0621
16090g4958n2364j4444J366j3282P690R1206N3729M4534n7399L8382M1700j5707
16078E0453L2975j02952k7980R7902K3419n3829m5885L1995J0275o5968m440R6819
16066D2784K9346K42o111R2656J2428p7649r0062l2017K9005N311k5269m3326
16054f2662K290L7364q915l7444k1988K8865O5492n8379p7696J8739k9304L9477
16042a04161k5745J9731J15929N4006P0155p8644m0605j4731n1151Q3357J4288
$$ plain form
16031 42429 18007 54935 114570 166612 57743 -2345 46155 74456 49743 46351 43610 10399
16019 10399 -34551 -3587 44708 49637 56053 -27208 -38717 -24956 -86583 -84462 -11045 34087
16007 34087 50328 127102 199506 121921 10604 -22645 14179 9311 -31916 -30138 -26214 -60074
15995 -60074 -35866 -35666 -13562 16254 97166 26426 -74612 -70055 -24898 -49978 8479 72350
15983 72350 5152 -91744 -79543 -78050 -38990 103832 223957 111289 -48267 -87951 -171301
15972 -171301 -125727 -37554 -54714 -2873 9228 25372 -30198 -61954 -66361 -11453 21949 39110
15960 39110 60524 9920 27160 88542 70924 -34108 -49606 -16284 -37433 -37549 -51175 44659
15948 44659 85464 107608 125277 27400 -47437 -11644 37765 81260 132681 78881 31800 14817
$$ packed form
16031D2429k4422L6928N9635N2042j08869o0088M8500K8301k4713l392k741l3211
16019A0399m4950L0964M8295M929O416q3261j1509J3761o1627K121P3417M5132
16007C4087J6241P6774P2404p7585j11317l3249L6824m868m1227J778L924l3860
15995f0074K4208K00K2104K9816Q0912p0740j01038M557M5157k5080N8457O3871
15983G2350o7198r6896J2201J493L9060J42822J20125j12668j59556l9684q3350
15972a71301M5574Q8173j7160N1841J2101J6144n5570l1756m407N4908L3402J7161
15960C9110K1414n0604J7240O1382j7618j05032j5498L3322k1149j16j3626R5834
15948D4659M0805K2144J7669r7877p4837L5793M9409M3495N1421n3800m7081j6983
$$ plain form
15936 14817 34477 -31285 -69749 -57485 -43558 -21100 -43145 -128873 -130878 -97171 -72921 -22165
15924 -22165 -77481 -144523 -141830 -163623 -36395 -17101 -75657 -40174 -28728 16017 -31390 -64051
15912 -64051 -80385 -121771 -49806 -118632 -254643 -194975 -19070 4154 -30758 -62628 -13558
15901 -13558 36755 -4967 -10589 69867 99162 72163 3097 -89053 -66095 -50893 -75017 -105335
15889 -105335 -150046 -133121 -116657 -43483 -31610 21351 139454 114685 83402 22413 -32826
15878 -32826 -49727 -73193 25594 59894 108501 77157 5117 -2267 68949 90715 81773 156670
15866 156670 219348 119713 42531 124136 107716 88161 15481 -41092 -92369 -122383 -148109
15855 -148109 -100161 -168301 -92601 -2068 -5901 -66062 -109689 -134290 -149260 -123372 -90194 -131787
$$ packed form
15936A4817J9660o5762l8464J2264J3927K2458k2045q5728k005L3707K4250N0756
15924b2165n5316o7042K693k1793J27228J9294n8556L5483J1446M4745m7407l2661
15912f4051j6334m1386P1965o8826j36011N9668J75905K3224l4912l1870M9070
15901a3558N0313m1722n622Q0456K9295k6999o9066r2150K2958J5202k4124l0318
15889a05335m4711J6925J6464P3174J1873N2961J18103k4769l1283o0989n5239
15878c2826j6901k3466R8787L4300M8607l1344p2040p384P1216K1766q942P4897
15866A56670O2678r9635p7182Q1605j6420j9555p2680n6573n1277l0014k5726
15855a48109M7948o8140P5700R0533l833o0161m3627k4601j4970K5888L3178m1593
$$ plain form
15843 -131787 -167608 -169141 -100142 14110 72467 1082 -5126 -29762 -137900 -114071 -108114 -15536
15831 -15536 129644 140009 -12435 -40781 24383 -34310 -29231 3499 -26519 -90212 -73904
15820 -73904 -45207 13965 119722 100986 35667 -29597 -114708 -125113 -87928 -82683 -46834 -25779
15808 -25779 -17532 -48908 -20216 -4293 -36380 -23441 53539 63339 3510 -28340 -2732 -5880
15796 -5880 -56719 -14504 -16669 28115 154825 215059 166934 84728 8875 14081 94613 128958
15784 128958 164229 87981 28770 115962 93297 66181 68207 57074 26390 -70586 -124525 -129269
15772 -129269 -125278 -71899 -55723 -114799 -139405 -56760 28932 76090 136805 138735 79901 -27311
15760 -27311 48996 19475 4682 -4264 -71349 -54971 280 2639 20072 -32871 -177801 -191491
$$ packed form
15843a31787l5821j533O8999J14252N8357p1385o208k4636j08138K3829N957R2578
15831a5536J45180J0365j52444k8346O5164n8693N079L2730l0018o3693J6308
15820g3904K8697N9172J05757j8736o5319o5264q5111j0405L7185N245L5849K1055
15808b5779Q247l1376K8692J5923l2087J2939P6980R800n9829l1850K5608l148
15796e880n0839M2215k165M4784J26710O0234m8125q2206p5853N206Q0532L4345
15784A28958L5271p6248n9211Q7192k2665k7116K026j1133l0684r6976n3939m744
15772a29269L991N3379J6176n9076k4606Q2645Q5692M7158O0715J930n8834j07212
15760b7311P6307k9521j4793q946o7085J6378N5251K359J7433n2943j44930j3690
$$ plain form
15748 -191491 -172760 -136551 -34176 -17372 -17421 -5618 37147 111841 65872 74235 39291 3658
15736 3658 -27054 -28487 45074 36581 56391 86402 72471 112705 87765 73494 8726 461
15724 461 22390 -23411 -71038 -74055 30841 37591 -47771 -80697 -79553 1739 114946 136804
15712 136804 96468 42200 94854 151037 145184 101567 64430 62333 20528 17352 37874 13912
15700 13912 -162209 -163229 -111614 -19531 38258 53803 8218 2606 44197 51517 104296 68652
15688 68652 -58703 -172355 -145050 -92944 -72678 -43704 10454 -44926 -108741 -101659 -87003
15677 -87003 -21594 3543 -73214 -133153 -47316 84130 122907 67401 117113 75387 -38497
15666 -38497 -148602 -170595 -84890 -59811 -76563 -125725 -103020 -18336 -18593 18563 24360 -71696
$$ packed form
15748a91491J8731L6209J02375J6804m9J1803M2765P4694m5969Q363l4944l5633
15736C658l0712j433P3561q493J9810L0011j3931M0234k4940j4271o4768q265
15724D61K1929m5801m7627l017J04896O750q5362l2926J144Q1292J13207K1858
15712A36804m0336n4268N2654N6183n853m3617l7137k097m1805l176K0522k3962
15700A3912j76121j020N1615R2083N7789J5545m5585n612M1591P320N2779l5644
15688F8652j27355j13652K7305N2106K0266K8974N4158n5380o3815P082J4656
15677h7003O5409K5137p6757n9939Q5837J31446L8777n5506M9712m1726j13884
15666c8497j10105k1993Q5705K5079j6752m9162K2705Q4684k57L7156N797r6056
$$ plain form
15654 -71696 -33376 -33557 -94695 -174078 -179038 -37602 -64808 -108578 -86935 -53877 950 -25930
15642 -25930 -76466 -38901 -9593 13744 14315 57942 83324 19101 30572 87639 129623 133116
15630 133116 85868 18800 -74625 -129204 -73059 24658 125923 125438 79059 -29362 -50890
15619 -50890 -13698 -8517 28524 117136 137639 152549 200375 112711 62443 61724 43645 45705
15607 45705 3513 -44003 -63709 -104473 5629 130986 139156 41858 -130992 -171678 -58522
15596 -58522 119015 94827 -1548 12933 -49015 -45973 30445 28954 -11988 -33987 -31856 -70971
15584 -70971 -48064 -42222 -12385 -5624 -976 -64660 -52227 -11131 -20707 30306 86879 159373
15572 159373 234524 264683 141236 67904 42672 17397 22174 39794 101309 20109 23615 25379
$$ packed form
15654g1696L8320j81o1138p9383m960J41436k7206m3770K1643L3058N4827k6880
15642b5930n0536L7565K9308K3337N71M3627K5382o4223J1471N7067M1984L493
15630A33116m7248o7068r3425n4579N6145R7717J01265m85m6379j08421k1528
15619e0890L7192N181L7041Q8612K0503J4910M7826q7664n0268p19j8079K060
15607D5705m2192m7516j9706m0764J10102J25357Q170r7298j72850m0686J13156
15596e8522J77537k4188r6375J4481o1948L042P6418j491m0942k1999K131l9115
15584g0971K2907N842K9837O761M648o3684J2433M1096r576N1013N6573P2494
15572A59373P5151L0159j23447p3332k5232k5275M777J7620O1515q1200L506J764
$$ plain form
15560 25379 9088 52956 105374 81523 19046 12737 19603 6027 18739 -551 32888 94127
15548 94127 -13656 -6933 -15470 812 6531 -10206 -33137 -28149 -27035 -18207 64303 -34514 -80697
15535 -80697 -41902 12600 66536 53643 -8901 6344 -28427 -86229 -53596 -8301 11866 58772
15523 58772 2538 -13071 39176 28681 48353 -2128 -84622 -88110 -123040 -101103 -91764 -105791
15511 -105791 -87734 -71417 -71926 34511 120241 169245 118946 -7319 32895 60816 48322
15500 48322 45290 87656 75953 -12616 -72725 -60798 -63155 -83236 -65264 -15044 113 -12485
15488 -12485 68365 78990 -45836 -103830 -92567 -45404 36155 25679 63833 121442 15276
15477 15276 -30326 12953 -46170 -28888 -1950 12404 -11614 -6813 27260 -38564 -69433 -20223
$$ packed form
15560B5379j6291M3868N2418k3851o2477o309O866j3576J2712j9290L3439O1239
15548I4127j07783O723q537J6282N719j6737k2931M988J114Q828Q2510r8817m6183
15535h0697L8795N4502N3936j2893o2544J5245l4771n7802L2633M5295K0167M6906
15523E8772n6234j5609N2247j0495J9672n0481q2494l488l4930K1937R339j4027
15511a05791J8057J6317n09J06437Q5730M9004n0299j26265M0214K7921j2494
15500D8322l032M2366j1703q8569o0109J1927k357k0081J7972N0220J5157j2598
15488a2485Q0850J0625j24826n7994J1263M7163Q1559j0476L8154N7609j06166
15477A5276m5602M3279n9123J7282K6938J4354k4018M801L4073o5824l0869M9210
$$ plain form
15465 -20223 -690 36004 96332 100974 93034 70447 90644 42709 31646 130043 106810 140899
15453 140899 157210 61673 49482 -35222 -28740 46189 91758 145732 120134 56236 -1942 14412
15441 14412 -5375 -85176 -28267 61724 104283 32949 97587 124852 6880 -77517 -66266
15430 -66266 -54530 -72739 -5397 43816 60478 70799 62981 43196 8662 -64949 -56768 -94098
15418 -94098 -126561 -96031 -64894 -107347 -137740 -63791 -264 49944 5237 32353 56241 -24489
15406 -24489 -108582 17421 98184 84359 65544 135829 136875 118875 43435 -1815 -66488 -70994
15394 -70994 -144375 -84473 -47434 41834 -44721 -106454 -9493 88987 -32516 -142266 -110593
15383 -110593 -32968 15601 25242 56708 29833 62087 62173 -3245 55410 33543 15512 41465
$$ packed form
15465b0223J9533L6694O0328M642p940k2587K0197m7935j1063R8397k3233L4089
15453A40899J6311r5537j2191q4704O482P4929M5569N3974k5598o3898n8178J6354
15441A4412j9787p9801N6909Q9991M2559p1334O4638K7265j17972q4397J1251
15430f6266J1736j8209O7342M9213J6662J0321p818j9785l4534p3611Q181l7330
15418i4098l2463L0530L1137m2453l0393P3949O3527N0208m4707K7116K3888q0730
15406b4489q4093J26003Q0763j3825j8815P0285J046j8000p5440m5250o4673m506
15394g0994p3381N9902L7039Q9268q6555o1733R6961R8480j21503j09750L1673
15383a10593P7625M8569R641L1466k6875L2254Q6o5418N8655k1867j8031K5953
$$ plain form
15371 41465 96000 84108 63513 110867 32689 31728 41217 86036 109871 148036 109064 33453
15359 33453 29270 -53572 -112392 -80343 -93922 -47973 -16166 15754 56364 73566 108816 55013
15347 55013 63634 30718 36755 49391 1716 -31699 26445 -33047 63176 44853 -17142 -47570
15335 -47570 10563 80071 36989 22927 -2249 -63279 -84064 -77601 -134175 -133728 -126002 -99779
15323 -99779 -53063 22724 86057 57505 83358 127297 117464 161638 129093 68832 18552 64655
15311 64655 11403 -74904 -73672 -2898 69393 24974 -38907 -82063 -37753 -12476 -100776 -141340
15299 -141340 -109485 -52287 -25632 -19564 27408 3841 -31433 -64999 -134337 -114755 -25065 19815
15287 19815 -11607 -45883 54123 128926 142366 147185 82305 81134 97672 83139 56797 100758
$$ packed form
15371D1465N4535j1892k0595M7354p8178r61R489M4819K3835L8165l8972p5611
15359C3453m183q2842n8820L2049j3579M5949L1807L1920M0610J7202L5250n3803
15347E5013Q621l2916O037J2636m7675l3415N8144n9492R6223j8323o1995l0428
15335d7570N8133O9508m3082j4062k5176o1030k0785O463n6574M47P726K6223
15323i9779M6716P5787O3333k8552K5853M3939r833M4174l2545o0261n0280M6103
15311F4655n3252q6307J232P0774P2291m4419o3881m3156M4310K5277q8300m0564
15299a41340L1855N7198K6655O068M6972k3567l5274l3566o9338J9582Q9690M4880
15287A9815l1422l4276J00006P4803J3440M819o4880j171J6538j4533k6342M3961
$$ plain form
15275 100758 170262 62029 -56620 -72305 -12436 29345 97246 106938 139729 124672 33415
15264 33415 40255 65021 69399 76830 126805 186988 165044 33995 44684 73485 147180 66362
15252 66362 36200 15685 -17973 -41374 23833 31727 3270 86031 135368 99275 6907 -72763
15240 -72763 -93978 -96065 -114961 -59842 69322 65549 -5164 -29748 -31173 -11974 30163 145038
15228 145038 61855 -75167 -132614 -101047 -100652 -175340 -97992 -50247 -44908 -76531 -131326 -70177
15216 -70177 -59160 -81180 -95176 -19542 159974 118822 26845 -48818 -119142 -102614 -36120
15205 -36120 -42579 -88143 -40978 30971 73873 45986 -20299 -54632 -41573 -22492 20687 54908
15193 54908 18927 -66585 -14277 -3831 37635 52880 42403 85778 127391 116607 64244 13986
$$ packed form
15275A00758O9504j08233j18649j5685N9869M1781O7901R692L2791j5057r1257
15264C3415O840K4766M378P431M9975O0183k1944j31049J0689K8801P3695q0818
15252F6362l0162k0515l3658k3401O5207P894k8457Q2761M9337l6093r2368p9670
15240g2763k1215k087j8896N5119J29164l773p0713k4584j425J9199M2137J14875
15228A45038q3183j37022n7447L1567L95p4688P7348M7745N339l1623n4795O1149
15216g0177J1017k2020j3996P5634J79516m1152r1977p5663p0324J6528O6494
15205c6120o459m5564M7165P1949M2902k7887o6285l4333J3059J9081M3179L4221
15193E4908l5981q5512N2308J0446M1466J5245j0477M3375M1613j0784n2363n0258
$$ plain form
15181 13986 -66689 -46221 -16371 68686 27454 66028 169248 144957 136609 145879 90162 21985
15169 21985 12737 101945 75193 6274 12884 83417 91938 62890 51969 39344 -16799 -32213
15157 -32213 -74285 -21286 -15952 -1174 22467 24666 -41970 65631 88250 48014 -46946 -148924
15145 -148924 -156883 -45119 71398 99757 69142 24304 8520 -50038 3965 61382 86076
15134 86076 129825 112272 71285 104973 101528 69373 51138 50074 22004 17748 14767 -40956
15122 -40956 -77836 -127500 -79356 49528 123642 64557 -23692 -23705 -41055 14722 40339 95632
15110 95632 139382 120101 89909 4192 7272 34466 9223 100245 172155 155317 35122 18033
15098 18033 94625 175599 198661 102819 63437 44190 52978 -3592 -47349 -35689 25291 2053
$$ packed form
15181A3986q0675K0468K9850Q5057m1232L8574J03220k4291q348R270n5717o8177
15169B1985r248Q9208k6752o8919O610P0533Q521k9048j0921j2625n6143j5414
15157c2213m2072N2999N334J4778K3641K199o6636J07601K2619m0236r4960j01978
15145a48924p959J11764J16517K8359l0615m4838j5784n8558N4003N7417K4694
15134H6076M3749j7553m0987L3688l445l2155j8235j064k8070m256k981n5723
15122d0956l6880m9664M8144J28884P4114n9085q8249j3j7350N5777K5617N5293
15110I5632M3750j9281l0192q5717L080K7194k5243R1022P1910j6838j20195j7089
15098A8033P6592Q0974K3062r5842l9382j9247Q788n6570m3757J1660O0980k3238
$$ plain form
15086 2053 73287 74715 -73433 -119393 -71168 -19564 5911 17342 -3182 -26335 -5706 -33174
15074 -33174 32972 38744 35690 113837 101314 62245 102650 152122 107093 89354 46508 23115
15062 23115 55560 -63794 -203182 -171524 -80071 -18513 56454 47835 28683 95992 22050
15051 22050 56044 60669 72405 60164 93725 3133 32800 104484 66822 66482 41843 -2031
15039 -2031 1409 14457 62883 122103 95425 39754 5996 41844 91282 45589 41196 64243
15027 64243 141600 135631 118 -672 14401 40870 -197 -56849 18195 107248 99943 55512
15015 55512 25523 -35483 -45849 -57371 -114270 -28502 46885 -27327 -92009 -77144 -22426 -7300
15003 -7300 -18518 -74895 -130280 -73976 35027 41890 24584 24533 18291 36086 -26595 -61602 -43864
$$ packed form
15086B053P1234J428j48148m5960M8225N1604K5475J1431k0524k3153K0629k7468
15074c3174O6146N772l054P8147j2523l9069M0405M9472m5029j7739m2846k3393
15062B3115L2445j19354j39388L1658R1453O1558P4967q619j9152O7309p3942
15051B2050L3994M625J1736j2241L3561r0592K9667P1684l7662l40k4639m3874
15039b031L440J3048M8426N9220k6678n5671l3758L5848M9438m5693m393K3047
15027F4243P7357n969j35513p90J5073K6469m1067n6652P5044Q9053p305m4431
15015E5512k9989o1006j0366j1522n6899Q5768P5387p4212o4682J4865N4718J5126
15003g300j1218n6377n5385N6304J09003O863j7306n1o242J7795o2681l5007J7738
$$ plain form
14990 -43864 -38819 -21641 461 -44828 -19022 -6688 21702 45979 97766 50183 69079 7381
14978 7381 50705 57404 13093 39016 59787 -18811 -105446 -101392 -88451 -50701 65501 67196
14966 67196 58692 70404 43988 27806 62423 -9955 -81843 -104852 -57081 -33321 -68818 -106877
14954 -106877 12526 56577 -41496 -81865 -61384 -43431 -32371 -54852 -33512 25643 7347
14943 7347 24076 23701 30812 -39995 -21386 35471 66728 6669 18167 -45468 -110308 -40173
14931 -40173 4299 18739 3490 -58505 380 43211 -10482 -116771 -122663 -65453 -68311 -27634
14919 -27634 -25903 -131466 -163976 -117625 -88588 -117696 -161569 -99422 -68961 -47392 -9670 61145
14907 61145 44514 -9608 12038 -6666 -12122 38616 26990 12371 22433 32530 105736 164007
$$ packed form
14990d3864N045J7178K2102m5289K5806J2334K8390K4277N1787m7583J8896o1698
14978G381M3324O699m4311K5923K0771p8598q6635M054J2941L7750J16202J695
14966F7196q504J1712k6416j6182L4617p2378p1888k3009M7771K3760l5497l8059
14954a06877J19403M4051r8073m0369K0481J7953J1060k2481K1340N9155j8296
14943G347J6729l75P111p0807J8609N6857L1257o0059J1498o3635o4840P0135
14931d0173M4472J4440j5249o1995N8885M2831n3693j06289n892N7210k858M0677
14919b7634J731j05563l2510M6351K9037k9108m3873O2147L0461K1569L7722P0815
14907F1145j6631n4122K1646j8704n456N0738j1626j4619J0062J0097P3206N8271
$$ plain form
14895 164007 85456 17111 41408 78524 58445 10836 24106 159680 103185 64987 58279
14884 58279 77186 31738 -49934 -35528 -5131 62091 78229 34880 23933 61481 -11873 -93037
14872 -93037 -72402 -59672 -10509 -561 96989 118571 53056 -46943 -144321 -72938 -52812 25464
14860 25464 18784 -3577 -108199 -180190 -222229 -252186 -88861 39203 29459 -30489 -17074
14849 -17074 -7939 -41165 -70978 2274 87283 93950 135311 175044 224791 131031 92082 79419
14837 79419 18390 -69105 -19536 109571 69984 -57172 -81416 -168901 -176176 -97077 -54190
14826 -54190 11780 123571 104292 90078 153508 152609 71793 52112 51722 -24427 -102167 -133624
14814 -133624 -142909 -131817 -60924 -40466 35472 71694 -39044 -80866 -117066 -96214 -55798
$$ packed form
14895A64007p8551o8345K4297L7116k0079m7609J3270J35574n6495l8198o708
14884E8279J8907m5448q1672J4406L0397O7222J6138m3349j0947L7548p3354q1164
14872i3037K0635J2730M9163R948R7550K1582o5515r9999r7378P1383K0126P8276
14860B5464o680k2361j04622p1991m2039k9957J63325J28064r744n9948J3415
14849a7074R135l3226k9813P3252Q5009O667M1361L9733M9747r3760l8949j2663
14837G9419o1029q7495M9569J29107l9587j27156k4244q7485p275P9099M2887
14826e4190O5970J11791j9279j4214O3430q99q0816j9681l90p6149p7740l1457
14814a33624r285J1092P0893K0458P5938L6222j10738m1822l6200K0852M0416
$$ plain form
14803 -55798 17891 -23448 -30929 37394 -66026 -93735 -66340 -50802 -67228 -45447 -47475 -36345
14791 -36345 -93533 -99025 -88635 -67635 -8749 -86835 -122802 -57117 2970 67000 141961 196161
14779 196161 236737 60517 -7734 18915 77438 55988 63245 57692 -24298 -99000 -32365 67255
14767 67255 95106 -8187 -130050 -134074 -75695 -58829 -57550 -49587 -40502 -109423 -116221 -87993
14755 -87993 -35521 -1649 -54700 -33407 29563 -50398 -120527 -66367 -107196 -171921 -211081 -175428
14743 -175428 -36317 38872 30789 28144 -52289 -90970 -64319 -61370 -123362 -162710 -66143 -102338
14731 -102338 -142627 -76797 -84374 -50235 -92749 -22079 75855 31743 8537 45486 35831 7592
14719 7592 9848 31071 61534 49721 61772 61138 31001 36826 -29787 -163032 -152340 -44960
$$ packed form
14803e5798P3689m1339p481O8323j03420k7709K7395J5538j6426K1781k028J1130
14791c6345n7188n492J0390K1000N8886p8086l5967O5685O0087O4030P4961N4200
14779A96161M0576j76220o8251K6649N8523k1450P257n553q1990p4702O6635R9620
14767F7255K7851j03293j21863m024N8379J6866J279P963R085o8921o798K8228
14755h7993N2472L3872n3051K1293O2970p9961p0129N4160m0829o4725l9160L5653
14743a75428J39111P5189q083k645q0433l8681K6651K949o1992l9348R6567l6195
14731a02338m0289O5830p577L4139m2514P0670R7934m4112k3206L6949r655k8239
14719G592K256K1223L0463j1813J2051o34l0137N825o6613j33245J0692J07380
$$ plain form
14707 -44960 74212 145064 69680 1234 -20435 40601 23071 -6572 -63427 -57806 -48748 13601
14695 13601 -2752 11202 -6802 -44808 -82802 -106899 -76691 -87300 -58146 -56631 -8393 12140
14683 12140 -5140 -15093 -27982 -92684 -60690 -90571 -89073 -3326 22236 -15429 10165 46436
14671 46436 6673 34200 43478 -15104 -11333 57059 64842 24542 -21067 75921 154076 139331
14659 139331 47098 12178 -26432 -18558 -23581 50918 21633 18746 61126 69300 82847 10883
14647 10883 -3829 -2258 -90958 -150187 -47233 -354 -53792 -89621 -48634 4389 -62943 -60592
14635 -60592 -45708 -33814 -57215 -33066 -20710 -61637 -134411 -74908 -105851 -51337 -15176 -57819
14623 -57819 -54944 -54058 18444 33356 64859 101851 55774 53765 94355 75890 57261 12539
$$ packed form
14707d4960J19172P0852p5384o8446k1669O1036j7530k9643n6855N621R058O2349
14695A3601j6353J3954j8004l8006l7994k4097L0208j0609K9154J515M8238K0533
14683A2140j7280r953j2889o4702L1994k9881J498Q5747K5562l7665K5594L6271
14671D6436l9763K7527R278n8582L771O8392P783m0300m5609R6988P8155j4745
14659A39331r2233l4920l8610P874n023P4499k9285k887M2380Q174J3547p1964
14647A0883j4712J571q8700n9229J02954M6879n3438l5829M0987N3023o7332K351
14635f0592J4884J1894k3401K4149J2356m0927p2774N9503l0943N4514L6161m2643
14623e7819K875Q86P2502J4912L1503L6992m6077k009M0590j8465j8629m4722
$$ plain form
14611 12539 7702 -6267 -55283 -41517 -73011 -57781 18189 -33102 -54227 -12651 -29073 -22262
14599 -22262 30403 72066 48129 43655 72630 -10226 -85778 -53052 -114292 -114095 -30785 88342
14587 88342 142154 78963 6624 36515 -11443 -27932 32613 59224 59862 50700 115967 10261
14575 10261 -93429 -21116 11603 -20084 -27002 -5676 -5982 -72535 -145608 -120785 -18849 32430
14563 32430 99226 109677 39540 112359 239049 189853 177369 132916 56589 37021 20077
14552 20077 -19643 -73478 3945 52930 43679 15167 2653 35898 29248 33613 79240 14178
14540 14178 -15368 9425 13246 27978 -1863 81862 100911 60466 -5343 -65493 -76247 18573
14528 18573 95705 85128 74503 127038 61302 1813 30697 159206 231888 198536 78834
$$ packed form
14611A2539m837j3969m9016J3766l1494J5230P5970n1291k1125M1576j6422O811
14599b2262N2665M1663k3937m474K8975q2856p5552L2726o1240J97Q3310J19127
14587H8342N3812o3191p2339K9891m7958j6489O0545K6611O38r162O5267j05706
14575A0261j03690P2313L2719l1687o918K1326l06o6553p3073K4823J01936N1279
14563C2430O6796J0451p0137P2819J26690m9196j2484m4453p6327j9568j6944
14552B0077l9720n3835P7423M8985r251k8512j2514L3245o650M365M5627o5062
14540A4178k9546K4793L821J4732k9841Q3725J9049m0445o5809o0150j0754R4820
14528A8573P7132j0577j0625N2535o5736n9489K8884J28509P2682l3352j19702
$$ plain form
14517 78834 18868 8106 125751 143024 108083 85357 56750 27521 -11610 36827 108116
14506 108116 55015 49162 40276 13179 -54883 -84021 -4121 24521 -40669 7443 35625 -76086
14494 -76086 -98399 -43750 -34786 -105547 -118824 -143850 -16323 33608 -22311 -4497 -22023 -26252
14482 -26252 -41860 -57578 -75453 -78750 -100969 -94137 2178 100132 121261 128383 118695 39008
14470 39008 -36179 -102746 -195684 -222774 -149504 -105548 -16524 52421 36100 16615 18937 34059
14458 34059 -5709 -79236 -1860 -22668 83421 90984 12463 24041 -42533 -38623 43432 73924
14446 73924 82535 106692 118487 183003 133414 144310 77935 -21195 28728 42426 29860 36907
14434 36907 38693 55856 93823 105589 89961 28502 31133 8863 -69533 -93729 -81916 -120068
$$ packed form
14517G8834n9966j0762J17645J7273l4941k2726k8607k9229l9131M8437P1289
14506A08116n3101n853q886k7097o8062k9138P9900K8642o5190M8112K8182j11711
14494g6086k2313N4649Q964p0761j3277k5026J27527M9931n5919J7814j7526m229
14482b6252j5608j5718j7875l297k2219O832R6315R7954K1129P122r688p9687
14470C9008p5187o6567r2938k7090P3270M3956Q9024O8945j6321j9485K322J5122
14458C4059l9768p3527P7376k0808J06089P563p8521J1578o6574L910Q2055L0492
14446G3924Q611K4157J1795O4516m9589J0896o6375r9130M9923J3698j2566P047
14434C6907J786J7163L7967J1766j5628o1459K631k2270p8396k4196J1813l8152
$$ plain form
14422 -120068 -98522 -36775 -49625 -152763 -99789 -88149 -54554 29670 -18346 18519 36972
14411 36972 56283 123760 138000 34033 -33751 -15408 45354 63304 3892 17986 89299
14400 89299 92391 86654 25332 -79985 -167901 -256404 -163376 -18895 38990 78395 89299 22118
14388 22118 -25583 -74331 -22933 2898 -25730 -112692 -181620 -139171 -73748 -67986 -102084 -112487
14376 -112487 -51860 4034 -3003 -135142 -55250 38664 59260 40202 21832 -18495 -20124 -69059
14364 -69059 -114697 -62275 -58117 -44605 -832 42125 28041 90637 134087 146792 67657 114928
14352 114928 170375 147179 113571 74206 58934 85217 129756 46502 67709 52977 36144
14341 36144 22612 -60427 -108717 -74657 -72776 -117484 -105754 -139799 -98893 67561 77999 25495
$$ packed form
14422a20068K1546O1747j2850j03138N2974J1640L3595Q4224m8016L6865J8453
14411C6972J9311O7477J4240j03967o7784J8343O0762J7950n9412J4094P1313
14400H9299L092n737o1322j05317q7916q8503R3028J44481N7885L9405J0904o7181
14388B2118m7701m8748N1398K5831k8628q6962o8928M2449O5423N762l4098j0403
14376a12487O0627N5894p037j32139P9892R3914K0596j9058j8370m0327j629m8935
14364f9059m5638N2422M158J3512M3773M2957j4084O2596M3450J2705p9135M7271
14352A14928N5447k3196l3608l9365j5272K6283M4539q3254K1207j4732j6833
14341C6144j3532q3039m8290L4060J881m4708J1730l4045M0906J66454J0438n2504
$$ plain form
14329 25495 87489 93113 129492 67223 49275 70300 -5123 8108 71117 29065 61427 68969
14317 68969 80028 3030 10101 36900 16368 57037 40954 -12707 -92796 -102906 -45435 -8040
14305 -8040 24879 53386 72162 10363 -5348 11618 28066 39038 61237 153398 180205 68643
14293 68643 3479 -12516 -58294 -33448 -82470 -58212 -30883 13375 -10105 -18757 -4269 -842
14281 -842 3681 5948 -10115 28639 99681 103862 76217 103701 105940 119821 142889 58585 11995
14268 11995 -65199 -84625 -81121 33116 107043 117917 59044 -78861 -151799 -86641 -83773 -81796
14256 -81796 -18364 27018 -19881 -49460 -28275 72419 116880 18972 -67313 -116873 -198847
14245 -198847 -126714 -52423 13949 18907 657 13753 17568 -50324 -73280 -50246 95581 79342
$$ packed form
14329B5495O1994N624L6379o2269j7948K1025p5423J3231O3009m2052L2362P542
14317F8969J1059p6998P071K6799k0532M0669j6083n3661q0089j0110N7471L7395
14305h040L2919K8507J8776o1799j5711J6966J6448J0972K2199R2161K6807j11562
14293F8643o5164j5995m5778K4846m9022K4258K7329M4258k3480q652J4488L427
14281h42M523K267j6063L8754P1042M181k7645K7484K239J3881K3068q4304m6590
14268A1995p7194j9426L504J14237P3927J0874n8873j37905p2938O5158K868J977
14256h1796O3432M5382m6899k9579K1185J00694M4461r7908q6285m9560q1974
14245a98847P2133P4291O6372M958j8250J3096L815o7892k2956K3034J45827j6239
$$ plain form
14233 79342 -40010 -86296 -24221 84380 74706 47693 -9677 -7544 69801 32548 55137 58566
14221 58566 -15857 -150322 -101393 -59274 -75716 -64349 -35102 -1744 -5912 29963 49574 455
14209 455 -10481 45633 44558 -18333 -32088 -45900 -44165 -1999 -38393 -53987 -15925 -48013
14197 -48013 56219 92432 -34135 -18283 38088 33708 -18339 -120537 -59339 73515 3007
14186 3007 -1797 -13790 19876 33142 81096 154951 132663 48317 111740 220207 226131 230985
14174 230985 206045 142859 132694 131237 109716 12500 -92145 -119477 -60947 -89273 -155695
14163 -155695 -143789 -101266 -27442 -32362 43614 -6097 -99988 -84162 89894 104139 19936
14152 19936 -110976 -94657 20643 52596 54256 9348 38032 75223 104854 84199 99421
$$ packed form
14233G9342j19352m6286O2075J08601r674k7013n7370K133P7345l7253K2589L429
14221E8566p4423j34465M8929M2119j6442J1367K9247L3358m168L5875J9611m9119
14209D55j0936N6114j075o2891j3755j3812J735M2166l6394j5594L8062l2088
14197d8013J04232L6213j26567J5852N6371m380n2047j02198O1198J32854p0508
14186C007m804j1993L3666J3266M7954P3855k2288q4346O3423J08467N924M854
14174B30985k4940o3186j0165j457k1521r7216j04645k7332N8530k8326o6422
14163a55695J1906M2523P3824m920P5976m9711r3891J5826J74056J4245q4203
14152A9936j30912J6319J15300L1953J660m4908K8684L7191K9631k0655J5222
$$ plain form
14141 99421 139578 133882 146336 58232 60175 72519 106660 75553 23150 33196 -12215 27974
14129 27974 -31662 -5367 -20149 23836 13936 -82027 -113905 -54798 3434 7470 21495 88420
14117 88420 49778 -34874 -133857 -108099 -44697 -80249 -87978 -66622 22150 86731 -64 -8021
14105 -8021 66330 123940 96771 105382 127966 117106 140067 145214 204784 160331 140271 48738
14093 48738 -13562 -34100 -87511 -81615 -12875 -95842 -102268 -16046 -46096 -132106 -88050 15462
14081 15462 71843 -16253 -72752 -75782 -22745 36908 13073 28198 23848 -37259 -37546 20120
14069 20120 50372 88114 41602 42975 48196 -15227 -59722 -59152 -51749 2754 48482 8987 -48114
14056 -48114 -56384 -136771 -138655 -109641 -35807 84234 8619 -92497 -14626 -13951 -54433 8254
$$ packed form
14141I9421M0157n696J2454q8104J943J2344L4141l1107n2403J0046m5411M0189
14129B7974n9636K6295j4782M3985r900r5963l1878N9107N8232M036J4025O6925
14117H8420l8642q4652r8983K5758O3402l5552p729K1356Q8772O4581q6795p957
14105h021P4351N7610k7169Q611K2584j0860K2961N147N9570m4453k0060r1533
14093D8738o2300k0538n3411N896O8740q2967o426Q6222l0050q6010M4056J03512
14081A5462N6381q8096n6499l030N3037N9653k3835J5125m350o1107k87N7666
14069B0120L0252L7742m6512J373N221o3423m4495N70P403N4503M5728l9495n7101
14056d8114q270q0387j884K9014P3834J20041p5615j01116P7871O75m0482O2687
$$ plain form
14044 8254 -62257 -115816 -83128 -45605 -55358 -95615 -105855 34659 83830 66532 -13790 52743
14032 52743 66696 46832 4471 86714 140064 89952 21461 96034 7599 -69525 18565 82322
14020 82322 56524 8058 -3618 82403 102095 47651 -14836 -76393 -48053 -54128 -7432 13107
14008 13107 -72151 9507 42161 -5068 -105900 -131677 -86259 -16510 26173 7719 -27538
13997 -27538 -96526 -82775 -147074 -175994 -47176 -31653 -111262 -152530 -78410 -32231 -85071
13986 -85071 -86962 -52162 -116992 -88275 -110767 -122574 -56088 -13593 -9148 18005 70801 97092
13974 97092 108802 139025 119779 33911 -32710 -40837 -38300 -131524 -155045 -74593 -33315 -8451
13962 -8451 52784 -5309 -21563 -28917 -82854 -75077 -38024 -36600 127861 160090 27910 3257
$$ packed form
14044H254p0511n3559L2688L7523r753m0257j0240J40514M9171j7298q0322O6533
14032E2743J3953j9864m2361Q2243N3350n0112o8491P4573q8435p7124Q8090O3757
14020H2322k5798m8466j1676Q6021J9692n4444o2487o1557K8340o075M6696K0539
14008A3107q5258Q1658L2654m7229j00832k5777M5418O9749M2683j8454l5257
13997b7538o8988J3751o4299k8920J28818J5523p9609m1268P4120M6179n2840
13986h5071j891L4800o4830K8717k2492j1807O6486M2495M445K7153N2796K6291
13974I7092J1710L0223j9246q5868o6621q127K537r3224k3521Q0452M1278K4864
13962h451O1235n8093j6254p354n3937P777L7053J424J64461L2229j32180k4653
$$ plain form
13950 3257 20948 18120 68870 23497 31468 89701 60492 41212 90368 16195 -5122 -102200
13938 -102200 -50933 -2044 78152 141006 115473 57787 -37750 -62989 -82472 -108174 -106220 -60201
13926 -60201 21388 51161 87890 78407 112041 83754 45623 -72725 -18336 -25156 -16238 -22275
13914 -22275 -20876 -42466 -35358 -42292 -19 79012 91092 -11799 23517 63870 43103 29990
13902 29990 56 -77763 -130554 -50042 16674 -135614 -155743 -88824 -836 -5456 -72457 -65975
13890 -65975 -50572 -41346 -53296 -31583 -29755 1492 -6550 -18373 -10106 -58237 -76383 -54752
13878 -54752 -130358 -155660 -128129 -121283 -121964 -92647 5874 59116 42301 -58686 -101877 -41154
13866 -41154 18953 -18677 48869 133130 83058 72676 185004 252260 220068 160750 113256
$$ packed form
13950C257J7691k828N0750m5373P971N8233k9209j9280M9156p4173k1317r7078
13938a02200N1267M8889Q0196O2854k5533n7686r5537k5239j9483k5702J954M6019
13926f0201Q1589K9773L6729r483L3634k8287l8131j18348N4389o820Q918o037
13914b2275J399k1590P108o934M2273P9031J2080j02891L5316M0353k0767j3113
13902B9990k9934p7819n2791Q0512O6716j52288k0129O6919Q7988m620o7001O482
13890f5975J5403R226j1950K1713J828L1247q042j1823Q267m8131j8146K1631
13878e4752p5606k5302K7531O846o81K9317R8521N3242j6815j00987m3191O0723
13866d1154O0107l7630O7546Q4261n0072j0382J12328O7256l2192n9318m7494
$$ plain form
13855 113256 63491 87968 76691 24163 57137 86154 75150 27699 -72406 -1213 10990
13844 10990 -39223 22882 97649 66761 88233 -2716 -14586 -76244 -81183 -65574 -57087 -102799
13832 -102799 -58295 -19963 42535 43971 15217 -82353 -141314 -199876 -208994 -161454 -85131 -138365
13820 -138365 -222001 -159077 -52677 -88162 25105 44541 -26611 35777 49130 72599 57264
13809 57264 35846 13895 67662 61607 72483 84808 50692 31060 76784 73794 71494 62768
13797 62768 -14230 -66300 -58369 -70207 49740 -1135 -56204 -97246 -135881 -92024 -32220 1448
13785 1448 70676 122633 162240 215521 275639 113377 50420 -15903 -51794 -41781 -19980 3539
13773 3539 -49710 -58666 76422 81185 7755 -50664 -52883 -59114 -21202 58101 82645 64223
$$ packed form
13855A13256m9765K4477j1277n2528L2974K9017j1004m7451j00105P1193J2203
13844A0990n0213O2105P4767l0888K1472r0949j1870o1658m939J5609Q487m5712
13832a02799M4504L8332O2498J436k8754r7570n8961n8562r118M7540P6323n3234
13820a38365q3636O2924J06400l5485J13267J9436p1152O2388J3353K3469j5335
13809E7264k1418k1951N3767o055J0876J2325l4116j9632M5724k990k300q726
13797F2768p6998n2070P931j1838J19947n0875n5069m1042l8635M3857N9804L3668
13785A448O9228N1957L9607N3281O0118j62262o2957o6323l5891J0013K1801K3519
13773C539n3249q956J35088M763p3430n8419k219o231L7912P9303K4544j8422
$$ plain form
13761 64223 101668 153010 162839 36192 -68803 -75803 -35582 27834 27952 -32916 -30970 -13499
13749 -13499 -75566 -12223 -25969 -54273 3070 -913 -2362 62453 34684 17567 7984 -28710
13737 -28710 -30164 -7769 9463 26441 34485 64793 118046 40557 41603 14814 -21770 74807
13725 74807 20210 -18084 49503 27906 12227 -11461 -37797 25391 73132 20898 -27239 4930
13713 4930 43433 47197 -43934 -29966 26395 -69183 -11339 70140 12599 -19984 -18776 26336
13701 26336 -21191 16730 17516 -1528 37853 72314 34123 -22280 -58946 -59833 -60059 -40581 -110130
13688 -110130 -128230 -37132 -2877 -24521 -21173 16143 26784 -8852 3827 11453 -32439 -76556
13676 -76556 -115874 -135793 -160185 -219703 -251376 -177421 -158158 -99538 -93633 -136658 -87832 -77780
$$ packed form
13761F4223L7445N1342R829j26647j04995p000M0221O3416J18o0868J946J7471
13749a3499o2067O3343j3746k8304N7343l983j449O4815k7769j7117r583l6694
13737b8710j454K2395J7232J6978Q044L0308N3253p7489J046k6789l6584R6577
13725G4807n4597l8294O7587k1597j5679k3688k6336O3188M7741n2234m8137L2169
13713D930L8503L764r1131J3968N6361r5578N7844Q1479n7541l2583J208M5112
13701B6336m7527L7921P86j9044L9381L4461l8191n6403l6666q87k26J9478o9549
13688a10130j8100R1098L4255k1644L348L7316J0641l5636J2679P626m3892m4117
13676g6556l9318j9919k4392n9518l1673P3955J9263N8620N905m3025M8826J0052
$$ plain form
13664 -77780 -73789 -62498 -79917 -90295 -56783 5681 -3229 -4857 23276 -48658 -107670 -43463
13652 -43463 42830 112902 93215 84261 47947 75530 77935 17482 -16977 309 124037 100996
13640 100996 48024 -37245 -11582 47095 51281 128057 164860 142470 84490 121911 133183 63970
13628 63970 -78870 -137334 -131298 -55470 -8546 61634 37112 -15539 -20209 -48510 -105618 -213374
13616 -213374 -221395 -136068 -43389 -26767 -14530 -15004 -76728 -162250 -222634 -170260 -103496 -37976
13604 -37976 21826 29653 93711 103108 26681 54724 30194 -38636 43450 29454 49149 108305
13592 108305 42646 23955 -92 50330 84711 52173 10027 -91439 -125169 -31554 7106
13581 7106 -82938 -99505 -52842 -6492 -3077 4557 23604 19404 6552 -7390 376 7037 -15524
$$ packed form
13664g7780L991J1291j7419j0378L3512O2464q910j628K8133p1934n9012O4207
13652d3463Q6293P0072j9687q954l6314K7583K405o0453l4459J7286J23728k3041
13640A00996n2972q5269K5663N8677M186P6776L6803k2390n7980L7421J1272o9213
13628F3970j42840n8464O036P5828M6924P0180k4522n2651m670k8301n7108j07756
13616b13374q021Q5327R2679J6622J2237m74o1724q5522o0384N2374O6764O5520
13604c7976N9802P827O4058R397p6427K8043k4530o8830Q2086j3996J9695N9156
13592A08305o5659j8691k4047N0422L4381l2538m2146j01466l3730R3615L8660
13581G106r0044j6567M6663M6350L415P634J9047m200j2852j3942P766O661k2561
$$ plain form
13568 -15524 14061 70234 77111 106572 110518 77504 55731 42796 -46688 -138622 -92549 -78639
13556 -78639 -20594 12669 -54011 -122017 -103110 -86561 -19031 -7223 30487 102877 135525 107444
13544 107444 119595 134325 37589 -6674 -15023 45027 63712 3954 -2071 58447 16755 -62116
13532 -62116 4975 70145 16401 24493 58907 39740 -5568 -30273 -92934 -94802 -118884 -93005
13520 -93005 -594 -43829 8977 47288 25129 57288 70767 99339 127840 70337 30236 -14490
13508 -14490 -44952 -71426 18496 64859 74659 9344 -58820 6034 48625 -23882 -95626 -99198
13496 -99198 -17520 -4073 -30026 23572 124910 60786 25850 25846 49076 13623 -42830 -53152
13484 -53152 -75572 -76015 -7840 -12740 -77519 -89090 -66535 -37280 -5432 100990 218404 240202
$$ packed form
13568a5524K9585N6173O877K9461L946l3014k1773j2935q9484r1934M6073J3910
13556g8639N8045L3263o6680o8006J8907J6549O7530J1808L7710P2390L2648k8081
13544A07444J2151J4730r6736m4263q349O0050J8685n9758o025O0518m1692p8871
13532f2116O7091O5170n3744Q092L4414j9167m5308k4705o2661j868k4082K5879
13520i3005R2411m3235N2806L8311k2159L2159J3479K8572K8501n7503m0101m4726
13508a4490l0462k6474Q9922M6363R800o5315o8164O4854M2591p2507p1744l572
13496i9198Q1678J3447k5953N3598J01338o4124l4936mK3230l5453n6453j0322
13484e3152k2420m43O8175m900o4779j1571K2555K9255L1848J06422J17414K1798
$$ plain form
13472 240202 243698 187201 97377 17029 6131 44924 70591 -15887 -28580 47256 68778 81157
13460 81157 19173 -37531 -74740 -42699 -58250 -45854 -8116 69147 74925 15713 -128270 -135775
13448 -135775 37139 101802 119324 165295 260991 235993 106496 -3943 22531 41653 -26044
13437 -26044 -48335 -84444 -80226 -19680 21060 59276 -19772 -138808 -146016 -41938 -4546 -21303
13425 -21303 34285 36725 76267 29860 -30399 -35827 -138770 -146271 -114390 -103633 -134928 -154641
13413 -154641 -111602 670 52848 86014 49391 12341 -77003 -75241 -60594 -44000 -110601
13402 -110601 -127642 -29819 9896 17571 -33772 -18770 9831 67576 99108 77640 125855 93280
13390 93280 50925 36904 37933 90203 108650 94947 122796 166628 172657 122818 20935 -47510
$$ packed form
13472B40202L496n6497q9824q0348j0898L8793K5667q6478j2693P5836K1522J2379
13460H1157o1984n6704l7209L2041j5551J2396L7738P7263N778n9212j43983p505
13448a35775J72914O4663J7522M5971R5696k4998j29497j10439K6474J9122o7697
13437b6044k2291l6109M218O0546M0740L8216p9048j19036p208J04078L7392j6757
13425b1303N5588K440L9542m6407o0259n428j02943p501L1881J0757l1295j9713
13413a54641M3039J12272N2178L3166l6623l7050q9344J762J4647J6594o6601
13402a10601j7041R7823L9715P675n1343J5002K8601N7745L1532k1468M8215l2575
13390I3280m2355j4021J029N2270J8447j3703K7849M3832O029m9839j01883o8445
$$ plain form
13378 -47510 -63051 -21137 31719 63160 190447 183247 80419 56553 150924 219508 172735
13367 172735 37798 75895 138965 163455 139411 59211 52612 19391 92445 48481 -6882
13356 -6882 -4177 8600 71581 69987 182637 197522 69669 -5005 21076 39192 42942 114000
13344 114000 91188 -9190 -100212 -100936 79251 154547 106693 63391 -18098 10767 -71596
13333 -71596 -193982 -193619 -82802 -60397 -39783 -16010 86372 190885 127378 74606 42098
13322 42098 -28572 -118056 -71770 -98918 -128861 -125265 -47141 -10341 33715 130860 132088 76179
13310 76179 125763 124559 125554 32000 10199 25803 25364 -21790 22646 76827 96531 85983 83765
13297 83765 77913 133597 183169 60839 -11120 -14519 90981 167627 126834 -25060 -99748
$$ packed form
13378d7510j5541M1914N2856L1441J27287p200j02828k3866R4371O8584m6773
13367A72735j34937L8097O3070K4490k4044q0200o599l3221P3054m3964n5363
13356f882K705J2777O2981j594J12650J4885j27853p4674K6081J8116L750P1058
13344A14000k2812j00378r1022p24J80187P5296m7854m3302q1489K8865q2363
13333g1596j22386L63J10817K2405K0614K3773J02382J04513o3507n2772l2508
13322D2098p0670q9484M6286k7148k9943L596P8124L6800M4056R7145J228n5909
13310G6179M9584j204R95r3554k1801J5604m39m7154M4436N4181J9704j0548k218
13297H3765n852N5684M9572j22330p1959l399J05500P6646m0793j51894p4688
$$ plain form
13286 -99748 -97384 -74212 -40747 12535 50119 23810 94770 196398 92304 -72055 -133705
13275 -133705 -97278 -60924 -60722 -10947 59915 67048 83371 94055 40726 10617 -236 -28707
13263 -28707 -23084 23766 -18182 -29749 28329 1917 78388 135442 83121 49197 45978 166135
13251 166135 224285 206940 155894 129822 85469 39073 32077 107925 52266 37224 -7305 21186
13239 21186 38151 117147 155474 196796 198623 169590 127576 56546 -16887 -32818 -76608 -48224
13227 -48224 -11628 75743 94547 177491 145470 123466 140360 128466 79011 19904 90408 154419
13215 154419 94333 28830 -48332 -100924 -40821 50558 110703 93252 106785 97217 67820 -29467
13203 -29467 -51597 43196 45315 63063 51814 2402 -28865 -8486 97 -14835 -64116 -47091
$$ packed form
13286i9748K364K3172L3465N3282L7584k6309P0960J01628j04094j64359o1650
13275a33705L6427L6354K02M9775P0862P133J6323J0684n3329l0109j0853k8471
13263b8707N623M6850m1948j1567N8078k6412P6471N7054n2321l3924l219J20157
13251A66135N8150j7345n1046k6072m4353m6396o996P5848n5659j5042m4529K8491
13239B1186J6965P8996L8327M1322J827k9033m2014p1030p3433j5931m3790K8384
13227d8224L6596Q7371J8804Q2944l2021k2004J6894j1894m9455n9107P0504O4011
13215A54419o0086o5503p7162n2592O0103R1379O0145j7451J3533r568k9397r7287
13203b9467k2130R4793K119J7748j1249m9412l1267K0379Q583j4932m9281J7025
$$ [...]
##END NTUPLES=NMR SPECTRUM
##END=
