##TITLE=Analysis number 323801
Compound Code cc 09111
Project Code adrs
Chemist Name fudan
##JCAMPDX= 6.0         $$ Bruker NMR JCAMP-DX V2.0
##DATA TYPE= NMR SPECTRUM
##DATA CLASS= NTUPLES
##ORIGIN= Bruker BioSpin GmbH
##OWNER= nmr
$$ XWIN-NMR		Version 3.5
$$ Tue Nov  7 17:59:33 2006 GMT Standard Time (UT+0h)  MAYBRIDGE\nmr@NMR_250MHZ
##.OBSERVE FREQUENCY= 250.131544655141
##.OBSERVE NUCLEUS= ^1H
##.ACQUISITION MODE= SIMULTANEOUS (DQD)
##.ACQUISITION SCHEME= undefined
##.AVERAGES= 16
##.DIGITISER RES= 18
##SPECTROMETER/DATA SYSTEM= dpx250
##.PULSE SEQUENCE= zg30
##.SOLVENT NAME= CDCl3
##.SHIFT REFERENCE= (INTERNAL, CDCl3, 0, 16.522)
##AUDIT TRAIL= $$ (NUMBER, WHEN, WHO, WHERE, WHAT)
$$ ##TITLE= Audit trail, XWIN-NMR		Version 3.5
$$ ##JCAMPDX= 5.01
$$ ##ORIGIN= Bruker BioSpin GmbH
$$ ##OWNER= nmr
$$ C:\u/data/dgb/nmr/ADRS/2350/pdata/1/auditp.txt
$$ ##AUDIT TRAIL=  $$ (NUMBER, WHEN, WHO, WHERE, WHAT)
(   1,<2006-11-07 17:59:07.89 +000>,<MAYBRIDGE\nmr>,<NMR_250MHZ>,
      <created by zg, POWCHK disabled, PULCHK disabled
       configuration hash MD5:
       49 4B E0 1D 92 C2 6B 37 9F E6 65 BC 52 41 86 1D
       data hash MD5: 64K
       00 C8 70 4E 2D 8F 0A 3E 81 EC EA A2 F8 BF 43 1D>)
(   2,<2006-11-07 17:59:23.90 +000>,<MAYBRIDGE\nmr>,<NMR_250MHZ>,
      <Start of raw data processing
       ef LB = 0.3 FT_mod = 6 PKNL = 1 SI = 32K 
       data hash MD5: 32K
       E1 4C 3F F4 BA 02 DB 23 4C BD 85 5D 30 E3 23 E0>)
(   3,<2006-11-07 17:59:25.95 +000>,<MAYBRIDGE\nmr>,<NMR_250MHZ>,
      <apk 
       data hash MD5: 32K
       C6 5B 11 27 AD 44 23 57 87 98 12 15 99 D7 2F 0C>)
(   4,<2006-11-07 17:59:26.68 +000>,<MAYBRIDGE\nmr>,<NMR_250MHZ>,
      <abs ABSG = 5 
       data hash MD5: 32K
       05 87 D8 20 3F D6 B9 B0 42 5B E3 07 29 93 6A EE>)
$$ ##END=
$$ 
$$ hash MD5
$$ 8C 2F 98 72 4C 79 C0 67 21 40 91 63 F5 1F F4 BC
##$RELAX= 
##$RELAX= 
##$RELAX= 
##$RELAX= 
##$RELAX= 
##$RELAX= 
##$RELAX= 
$$ Bruker specific parameters
$$ --------------------------
##$DU= <C:\u>
##$EXPNO= 2350
##$NAME= <ADRS>
##$PROCNO= 1
##$TYPE= <nmr>
##$USER= <dgb>
##$AMP= (0..31)
100 100 100 100 100 100 100 100 100 100 100 100 100 100 100 100 100 100 
100 100 100 100 100 100 100 100 100 100 100 100 100 100 
##$AQSEQ= 0
##$AQ_mod= 3
##$AUNM= <au_zg>
##$AUTOPOS= <30 >
##$BF1= 250.13
##$BF2= 250.13
##$BF3= 250.13
##$BF4= 250.13
##$BF5= 500.13
##$BF6= 500.13
##$BF7= 500.13
##$BF8= 500.13
##$BYTORDA= 1
##$CFDGTYP= 0
##$CFRGTYP= 5
##$CHEMSTR= <none>
##$CNST= (0..31)
1 1 145 1 1 1 1 1 1 1 1 1 1 1 1 1 1 1 1 1 1 1 1 1 1 1 1 1 1 1 1 1 
##$CPDPRG= <>
##$CPDPRG1= <>
##$CPDPRG2= <>
##$CPDPRG3= <>
##$CPDPRG4= <mlev>
##$CPDPRG5= <mlev>
##$CPDPRG6= <mlev>
##$CPDPRG7= <mlev>
##$CPDPRG8= <mlev>
##$CPDPRGB= <>
##$CPDPRGT= <>
##$D= (0..31)
0 1 0 0 0 0 0 0 0 0.06 0 0 0 0 0 0 0.0002 0 0 0 0 0 0 0 0 0 0 0 0 0 0 
0 
##$DATE= 1162922346
##$DBL= (0..7)
120 120 120 120 120 120 120 120 
##$DBP= (0..7)
150 150 150 150 150 150 150 150 
##$DBP07= 0
##$DBPNAM0= <>
##$DBPNAM1= <>
##$DBPNAM2= <>
$$ [...]
##$SUBNAM7= <"">
##$SUBNAM8= <"">
##$SUBNAM9= <"">
##$SW= 20.6930455092707
##$SWIBOX= (0..15)
0 0 3 0 0 0 0 0 0 0 0 0 0 0 0 0 
##$SW_h= 5175.983436853
##$TD= 65536
##$TD0= 1
##$TE= 683.16
##$TE2= 300
##$TE3= 300
##$TEG= 300
##$TL= (0..7)
0 120 120 120 120 120 120 120 
##$TP= (0..7)
150 150 150 150 150 150 150 150 
##$TP07= 0
##$TPNAME0= <>
##$TPNAME1= <>
##$TPNAME2= <>
##$TPNAME3= <>
##$TPNAME4= <>
##$TPNAME5= <>
##$TPNAME6= <>
##$TPNAME7= <>
##$TPOAL= (0..7)
0.5 0.5 0.5 0.5 0.5 0.5 0.5 0.5 
##$TPOFFS= (0..7)
0 0 0 0 0 0 0 0 
##$TUNHIN= 0
##$TUNHOUT= 0
##$TUNXOUT= 0
##$USERA1= <user>
##$USERA2= <user>
##$USERA3= <user>
##$USERA4= <user>
##$USERA5= <user>
##$V9= 5
##$VALIST= <valist>
##$VCLIST= <CCCCCCCCCCCCCCC>
##$VD= 0
##$VDLIST= <DDDDDDDDDDDDDDD>
##$VPLIST= <PPPPPPPPPPPPPPP>
##$VTLIST= <TTTTTTTTTTTTTTT>
##$WBST= 1024
##$WBSW= 4
##$XGAIN= (0..3)
0 0 0 0 
##$XL= 0
##$YL= 0
##$YMAX_a= 470179
##$YMIN_a= -341980
##$ZGOPTNS= <>
##$ZL1= 120
##$ZL2= 120
##$ZL3= 120
##$ZL4= 120
##$ABSF1= 16.522
##$ABSF2= -4.171173
##$ABSG= 5
##$ABSL= 3
##$ALPHA= 0
##$AQORDER= 0
##$ASSFAC= 0
##$ASSFACI= 0
##$ASSFACX= 0
##$ASSWID= 0
##$AUNMP= <proc_1d>
##$AZFE= 0.1
##$AZFW= 0.1
##$BCFW= 0
##$BC_mod= 0
##$BYTORDP= 0
##$COROFFS= 0
##$CY= 12.5
##$DATMOD= 1
##$DC= 0
##$DFILT= <>
##$DTYPP= 0
##$F1P= 14.0000005364418
##$F2P= -0.99999901652339
##$FCOR= 0.5
##$FTSIZE= 32768
##$FT_mod= 6
##$GAMMA= 0
##$GB= 0
##$INTBC= 1
##$INTSCL= 1
##$ISEN= 128
##$LB= 0.3
##$LEV0= 0
##$LPBIN= 0
##$MAXI= 10000
##$MC2= 0
##$MEAN= 0
##$ME_mod= 0
##$MI= 0
##$NCOEF= 0
##$NC_proc= -4
##$NLEV= 6
##$NOISF1= 0
##$NOISF2= 0
##$NSP= 0
##$NTH_PI= 0
##$NZP= 0
##$OFFSET= 16.522
##$PC= 1
##$PHC0= -39.63764
##$PHC1= 4.862193
##$PH_mod= 1
##$PKNL= yes
##$PPARMOD= 0
##$PSCAL= 4
##$PSIGN= 0
##$REVERSE= no
##$SF= 250.13
##$SI= 32768
##$SIGF1= 0
##$SIGF2= 0
##$SINO= 400
##$SIOLD= 32768
##$SREGLST= <1H.CDCl3>
##$SSB= 0
##$STSI= 32768
##$STSR= 0
##$SW_p= 5175.98343685301
##$SYMM= 0
##$S_DEV= 0
##$TDeff= 65536
##$TDoff= 0
##$TI= <Analysis number 999999
Compound Code 99
Book Reference 9
Project Code 9>
##$TILT= no
##$TM1= 0
##$TM2= 0
##$TOPLEV= 0
##$USERP1= <user>
##$USERP2= <user>
##$USERP3= <user>
##$USERP4= <user>
##$USERP5= <user>
##$WDW= 1
##$XDIM= 32768
##$YMAX_p= 293881220
##$YMIN_p= -872701
$$ End of Bruker specific parameters
$$ ---------------------------------
##NTUPLES= NMR SPECTRUM
##VAR_NAME=  FREQUENCY,     SPECTRUM/REAL,   SPECTRUM/IMAG
##SYMBOL=    X,             R,               I
##VAR_TYPE=  INDEPENDENT,   DEPENDENT,       DEPENDENT
##VAR_FORM=  AFFN,          ASDF,            ASDF
##VAR_DIM=   32768,         32768,           32768
##UNITS=     HZ,            ARBITRARY UNITS, ARBITRARY UNITS
##FACTOR=    0.157963299565203, 1,           1
##FIRST=     4132.6476996994, 0,             0
##LAST=      -1043.33573715361, 0,           0
##MIN=       -1043.33573715361, -872701,     0
##MAX=       4132.6476996994, 293881220,     0
$$ Real data points
##PAGE= N=1
##DATA TABLE= (X++(R..R)), XYDATA
$$ [...]
23100C5840m0504K08415J53752P0981N8479l76915l25435k65614q7293K84583
23090b83711L06490j88353l9597p2093M0379K27197q7750j29410J92161R4700
23080F0013R3896R9682k10663l06907J48648J70312J80069j3412P9356l7380N4731
23069C18345j88463j89659j65652J01500K21732k31443j56569j5365K68527N2361
23059A5314Q1800k3745o5294J95843O5966J00346j87249j16615K4331k9182O0339
23048A21854o0902j03678N4783o6448l1728J8503n5141j18332j66193l14345j26939
23037h48566L31458K17679J19N0229J26130J1763j35465o7297P1625j5546N9419
23026a98452J61995o0076p6870K00969J60548q7196n9350q5407k64529J73559
$$ plain form
23100 35840 -4664 203751 357503 428484 486963 110048 -215387 -481001 -568294 -283711
23090 -283711 22779 -165574 -205171 -277264 -236885 -9688 -97438 -226848 -34687 60013
23080 60013 153909 253591 42928 -263979 -115331 54981 235050 221638 300994 263614 318345
23069 318345 129882 -59777 -225429 -123929 97803 -133640 -290209 -305574 -37047 15314
23059 15314 97114 73369 8075 203918 269884 370230 182981 66366 90697 61515 121854
23048 121854 60952 -42726 12057 -54391 -86119 -67616 -122757 -241089 -407282 -721627 -848566
23037 -848566 -517108 -299429 -299310 -249081 -122951 -111188 -246653 -313950 -242325 -257871 -198452
23026 -198452 -36457 -96533 -173403 27566 188114 100918 41568 -43839 -308368 -134809
23016a34809J27638k52516m4250m9587K77919J69358M4834J61378P1546l83778
23006a2267r5405R7000n9020j14039O9165j00697p2802L3615L02444J78673j45807
22995H0860m1665j31667J91835K4298J3920R3148n0149n7905r2383l5531J06209
22984A00970j33134m2255J87042j12827j64715l8328J62503k5945j10270N8305
22974a18654R4768K179J10823J74796k06141j58720j12768j43398P0832o1177
22964c47460J31442P6975o5692m3326J42733J80490M8488l3537K8015J50556j14621
22953A54063l05775J31639L1367j04410K02413j30950n2360o6710j98594N5839
22943b83478k8654J0085K39825M1055k6806J16816K01373r2277k41817j61511
$$ plain form
23016 -134809 -7171 -259687 -303937 -353524 -75605 93753 138587 299965 371511 -12267
23006 -12267 -107672 -10672 -69692 -183731 -114566 -215263 -288065 -254450 47994 226667 80860
22995 80860 39195 -92472 99363 123661 137581 230729 180580 122675 30292 -5239 100970
22984 100970 -32164 -74419 112623 -204 -164919 -203247 -40744 -66689 -176959 -118654
22974 -118654 -23886 -21707 89116 263912 57771 -100949 -213717 -357115 -286283 -347460
22964 -347460 -216018 -139043 -204735 -248061 -105328 75162 123650 90113 118128 268684 154063
22953 154063 -151712 -20073 11294 -93116 109297 -21653 -74013 -140723 -339317 -283478
22943 -283478 -312132 -302047 -62222 -21167 -47973 68843 270216 177939 -63878 -225389
22933b25389K50043J06949N2492K10446p3087j01543R7979J64546j95349k08600
22923G8487K7722m5654k97373k29128k0674M56433J91739O9582q78k17001n6277
22912d3022j15639J541j39492j34830J48653M7607j47594k76942K01707L26847
22902a31164O4857l2304P7923Q9305P8381k44397l15860L097l2775k6815J01369
22891c68383l2517O7326M98496K13123j28746J23534p1551L6359J41079M7341
22881E26061l05773j07865P9213m2130J89595o7424j16976j4938k13855j97228
22871b71320j59910J48519K29385J46264J70287k7228M6451j9801k01828R8150
22861A58969J1856o7720n7514j11537K53396J02548L8030k98756q3401o0503O5572
$$ plain form
22933 -225389 24654 131603 184095 394541 321454 219911 317890 482436 287087 78487
22923 78487 106209 60555 -236818 -465946 -486620 -30187 161552 231134 230256 13255 -43022
22912 -43022 -158661 -157120 -296612 -431442 -282789 -235182 -382776 -659718 -458011 -131164
22902 -131164 -66307 -98611 -20688 68617 146998 -97399 -413259 -410162 -442937 -469752 -368383
22891 -368383 -400900 -333574 164922 378045 249299 372833 301282 337641 478720 526061
22881 526061 220288 112423 191636 149506 339101 271677 154701 139763 -74092 -271320
22871 -271320 -431230 -282711 -53326 92938 263225 235997 282448 262647 60819 158969
22861 158969 170825 103105 45591 -65946 187450 289998 328028 29272 -54129 -114632 -49060
22850d9060k355o9803K7692L72350q6717r3533j16369j75702k07357K30739L70906
22839B00791M5807j03020J89936j39499o8963L9900j00210j90623j68882j9982
22829c14745J83825j31172j57645K32815O047J65292J17913k96839P0952L09131
22819A85574m5165j44080J21534J59603k0131M8924M4866j89886K0988J39210
22809C21437j70194k35511Q322K58752J29133M2164k45954Q3168j18740m2193
22799C0384j07583J43193j68538J03607Q8476O2755L1912O4022M8365l9890j98755
22788E7948k21345L8393L24215Q6954k08046j71885N0140L20058K3998j19039
22778A81391K13188N5691k58837j55444j45897j30603k1773n147P7851o2997K00074
$$ plain form
22850 -49060 -51415 -121218 -93526 278824 192107 98574 -17795 -193497 -400854 -170115 200791
22839 200791 246598 143578 333514 194015 125052 164952 64742 -125881 -294763 -314745
22829 -314745 -130920 -262092 -419737 -186922 -180875 -15583 102330 -194509 -123557 185574
22819 185574 140409 -3671 117863 277466 257335 306259 351125 161239 182227 321437
22809 321437 151243 -84268 -75946 182806 311939 354103 108149 191317 72577 30384
22799 30384 -77199 65994 -102544 1063 89539 152294 184206 248228 296593 256703 57948
22788 57948 -163397 -125004 199211 286165 78119 -93766 -43626 276432 300430 181391
22778 181391 394579 450270 191433 35989 -109908 -240511 -262284 -267431 -189580 -252577 -52503
22767e2503Q5126Q61P2366j1792j20531m391J58970L392k1635L3149N0503K2046
22755B15561j31556r0309j18677o5546o6662l479J34429M3274J25090N5270J0433
22744A07828M1452J61813O1059k3069j41725J2604k17717J27824J71672n8795
22734B42946r966k51654J2116J57803j62912j61157k55946r0074K89580K64494
22724C5230J21236q5221k90m1493q6397k5390J81930J11732j09034J43028m8442
22713A96889r599j17375k63875q6287l670n7380q2575l4378o0432P7379M8187
22702c93116R8672L9147k7981J54244K23261o6684k96804J14178J65466r6368
22692h5985n6567l9168j17907R2656q3776P7553L70784J51453J00264J67135K5907
$$ plain form
22767 -52503 32623 33484 105850 94058 -26473 -30864 128106 131498 109863 143012 193515 215561
22755 215561 84005 -6304 -124981 -190527 -257189 -260668 -126239 -82965 42125 97395 107828
22744 107828 149280 311093 372152 349083 207358 219962 2245 130069 301741 242946
22734 242946 232980 -18674 -6558 151245 -11667 -172824 -428770 -518844 -229264 35230
22724 35230 156466 71245 70955 29462 -56935 -82325 99605 211337 102303 245331 196889
22713 196889 187290 69915 -193960 -280247 -283917 -341297 -423872 -458250 -518682 -441303 -393116
22702 -393116 -294444 -255297 -283278 -129034 94227 27543 -269261 -155083 10383 -85985
22692 -85985 -142552 -181720 -299627 -206971 -290747 -213194 157590 309043 409307 576442 602349
22681F02349j88997R7430k654q7250k09273m9152j13199j14002k40820j52791
22671d58359K96085O7747K19019K23256j46378j4821j14664j74498R0968R3044
22661H1399J09800n7059j05604q0815J072l814K4754J86518L1200j94892k86267
22650b93708p707K92307j0326m7962J03991K17982k8854K7926n3141j17804J51161
22639B33865j30608N3323m1663l21737k2141p8953R1303J72024n6498l8195R2316
22628d6964M4348j5815J11917K31795k36202j91059k41843l05496J63837L08612
22618a76870K07262J20441J5213j20382N9512L21221K5819l81830j38593o8302
22608a36509R7632L6923r5202K5415P517j8641j05478k2088J08885L7809m102
$$ plain form
22681 602349 413352 510782 508128 420878 211605 162453 49254 -64748 -305568 -458359
22671 -458359 -162274 -94527 124492 347748 201370 186549 71885 -102613 -11645 81399
22661 81399 191199 134140 28536 -52279 -51207 -55021 -30267 156251 187451 -7441 -293708
22650 -293708 -301415 -9108 -19434 -67396 36595 254577 225723 253649 200508 82704 233865
22639 233865 103257 156580 114917 -206820 -228961 -307914 -216611 -44587 -101085 -139280 -46964
22628 -46964 -2616 -18431 93486 325281 89079 -101980 -343823 -649319 -485482 -176870
22618 -176870 30392 150833 166046 45664 105176 426397 452216 70386 -68207 -136509
22608 -136509 -38877 -1954 -97156 -71741 -64224 -82865 -188343 -210431 -101546 -63737 -67839
22597f7839K383l06604M4174Q7932K6002q308J38819L02942L1387j2674K92444
22586E30658J02286m61622l28815L3945J48338k40002L3675M3150J31626L4200
22576B7439J884J2053Q2285J506j95352R7829J93019j57273k25760L7756M8871
22565g5743j25548M6444P8379N6103k2403J00303K72633j67280K98396p3623m18188
22554c0527k60008q893K308K78813j52933K86749J32835J28976k36537l28254
22544a87471k3178J3153m8795l1918Q7902p8642K6184K09664K18869J05817j13935
22533A77650L822Q8830m377l6260j48555k12519n3652J01516o3209r1973J70612
22522f8115K54431O8422r7223l8589j21558p4662K02228J79188O0389m77017J13735
$$ plain form
22597 -67839 -65456 -372060 -327886 -239954 -213952 -222260 -83441 219501 250888 238214 530658
22586 530658 632944 171322 -157493 -123548 24790 -215212 -181537 -138387 -6761 27439
22576 27439 29323 41376 123661 125167 -70185 27644 220663 63390 -162370 -124614 -75743
22565 -75743 -201291 -154847 -76468 -20365 -42768 57535 330168 162888 461284 387661 -30527
22554 -30527 -290535 -299428 -297120 -18307 -171240 115509 248344 377320 140783 -187471
22544 -187471 -210649 -197496 -246291 -278209 -190307 -268949 -242765 -33101 185768 291585 177650
22533 177650 181472 270302 265925 229665 81110 -131409 -185061 -83545 -146754 -238727 -68115
22522 -68115 186316 254738 157515 118926 -2632 -77294 124934 304122 364511 -112506 1229
22511A229K77992o6900k0934j66610o8267j84357j14042J79291m818k2565o3554
22500b53535P498l0591R2497J8034L02643J64083p4497o3276P7872Q7168o2210
22489B65686k1886J5776j78862m0354l69260l93545N7244J58799L30480o1138
22479b37060j38336j1234q5398L6084L0958J36801J28513k1352j88532j49135
22469d98691J91859K15031M6836J87697Q2315J66787l44985j12246j27359R0860
22459a01896J64612l736k29502l9722J15549J02481J89254o8372l7879r4233J9096
22448A5652j55961R441l3652k5030L84459l9714r5829J05015J03569L8532j60496
22437A45986k36735Q8879j42302J00116M34074l7214j25153J02056q5924o1173
$$ plain form
22511 1229 279221 212321 191387 24777 -43490 -227847 -341889 -162598 -167416 -189981 -253535
22500 -253535 -246037 -276628 -184131 -166097 136546 300629 226132 162856 240728 327896 265686
22489 265686 243800 259576 80714 40360 -328900 -722445 -665201 -506402 -175922 -237060
22479 -237060 -375396 -386630 -472028 -435944 -404986 -268185 -139672 -161024 -349556 -498691
22469 -498691 -306832 -91801 -44965 142732 225047 391834 46849 -65397 -192756 -101896
22459 -101896 62716 58980 -170522 -210244 -94695 7786 197040 128668 90789 -3444 15652
22448 15652 -140309 -130868 -164520 -189550 194909 155195 59366 164381 267950 306482 145986
22437 145986 -90749 -1870 -144172 -44056 390018 352804 227651 329707 243783 182610
22427A82610n8193P4970j6469k68064p6834K08513K34353k0184j17357q864Q2687
22416B17168L4696k04757j93323j62498m8299o1966R7253K07154J67749r773R9444
22405A42848n1760k58527j30607J13036K69875O5167J75286r0573N4429M6487
22395C35661k08431k17319k69387o6710K45331Q5129o6081L4179J53889P4178
22385A00439o8502r0956n8948J04884l5654O8146j69464j31027j6686L04313l0370
22374b3825J9652k55760j32009j21756n5800J34045j68480L2187J12784K192R2292
22363c64478K06295J52544k7004J20791j5837j10699k77985J10661J45292j24534
22353a84954J29588R137m1798k61815M8148K17557J01407m1886m287K68371Q6992
$$ plain form
22427 182610 124417 199387 182918 -85146 -161980 46533 280886 260702 143345 134481 217168
22416 217168 251864 47107 -146216 -308714 -357013 -418979 -321726 -114572 53177 43404 142848
22405 142848 91088 -167439 -298046 -185010 84865 150032 325318 234745 289174 335661
22395 335661 127230 -90089 -359476 -426186 -180855 -95726 -161807 -127628 26261 100439
22385 100439 31937 -59019 -117967 -13083 -48737 19409 -150055 -281082 -297768 6545 -23825
22374 -23825 -4173 -259933 -391942 -513698 -569498 -435453 -603933 -571746 -458962 -456770 -364478
22363 -364478 -158183 -5639 -32643 88148 72311 -38388 -316373 -205712 -60420 -184954
22353 -184954 -55366 -46229 -88027 -349842 -301694 -84137 17270 -24616 -28903 239468 326460
22342C26460l5213r2349j55849k72454R2803o1809J11347K68275P2194k93962
22332d0557J1243J21296j47201n1129M1923J10411j70299r0420J75501O3712j83526
22321a59046j81900J29692o1015j37939N7449Q8092J30281k5286k05310J8525
22311c46457K03277J19171J69366J3870r0819j21179k81344M6362K87299j22860
22301a23314r8608M52968J48790k85390l56211J52368L48077K59821j14841J7779
22291D01439j45809j01821K35592q3472r6295q5659p2811j19292j87903n3885
22281c09916L26484j8810J49492J19921j77098j55866P5941K19227j7250L5864
22271B47989j49595l36275j64488K06915K90234j3468k27690K00909J26030k75866
$$ plain form
22342 326460 291247 198898 43049 -229405 -136602 -198411 -87064 181211 253405 -40557
22332 -40557 -29314 91982 -55219 -106348 -64425 45986 -124313 -214733 -39232 24480 -159046
22321 -159046 -340946 -211254 -272269 -410208 -352759 -264667 -134386 -159672 -364982 -346457
22311 -346457 -143180 -24009 145357 159227 68408 -52771 -334115 -287753 -454 -123314
22301 -123314 -221922 231046 379836 94446 -261765 -109397 238680 498501 383660 401439
22291 401439 255630 153809 389401 305929 209634 123975 51164 -68128 -256031 -309916
22281 -309916 16568 -2242 147250 267171 90073 -65793 10148 229375 212125 247989
22271 247989 98394 -237881 -402369 -195454 94780 81312 -146378 54531 180561 -95305
22261i5305k73835j07611P8205L06830J53279j6675J08376J66733j58230j88389
22251b6622K82943N3752j45455N7487N3106k52981o3909n5144N3086j28187r1046
22240b62970R9039J82862J23940r0675j72595J04783L0601n4728p7773p845q9250
22229b14611J59433J11367j41777j24288K05160k21843K8492J22047Q7954l13719
22219c01785P7824R1574P6288K09751O6416R0887m5429j3532j82674r1904j31275
22208a53859j3109m3551R8985J42227Q7550O7353j63936j697K37604K08269j31929
22197C33907k16594l037J2941j9477j82220o0684o1621j08883O6104J38447p4462
22186a75579Q7724J30522j71934l47183J72996K99707K02987k423k50532k911
$$ plain form
22261 -95305 -369140 -476751 -398546 -91716 61563 44888 153264 319997 161767 -26622
22251 -26622 256321 310073 164618 222105 275211 22230 -41679 -96823 -43737 -171924 -262970
22240 -262970 -163931 18931 142871 52196 -120399 -15616 14985 -39743 -117516 -125361 -214611
22229 -214611 -55178 56189 -85588 -209876 -4716 -226559 -198067 -76020 11934 -301785
22219 -301785 -223961 -132387 -56099 153652 220068 310955 265526 251994 69320 -22584 -153859
22208 -153859 -166968 -210519 -111534 30693 118243 185596 21660 19963 257567 465836 333907
22197 333907 117313 114276 127217 107740 -74480 -135164 -196785 -305668 -239564 -101117 -175579
22186 -175579 -87855 42667 -129267 -476450 -303454 -3747 199240 196817 -53715 -56626
22176e6626P0968J47196K11891j00676l98809k66176J00808K77791K07783L2979
22166B27129k13559j28040K37956J16565N3001k41938k43126m6892q1299j0463
22156c30666J20426K46261L260j5502J30933q3885l2508j54470p3380J13521O2486
22145a3524p130N0376j23586q1727K50104k0316j16842J66531P5684j80160O8586
22134F7996J483L33833R1027k33411l8081j83414j87102k20848L79258K12274
22124B23015Q3962p5825q4594J72818q5831l37034p6752M1270M00M7755k42034
22113c32850J66505J54745P1734J14586J57450k7931l29556k15848R3031l0398
22103a78532J9901j80658l8739J12860k8981J52803J23277k96285k27487J864
$$ plain form
22176 -56626 14342 161538 373429 272753 -126056 -392232 -291424 -13633 194150 227129
22166 227129 13570 -114470 123486 240051 293052 51114 -192012 -238904 -320203 -330666
22156 -330666 -210240 36021 39281 23779 154712 70827 38319 -116151 -189531 -76010 -13524
22145 -13524 -20654 29722 -93864 -175591 74513 54197 -62645 103886 179570 -590 67996
22134 67996 69479 403312 494339 260928 222847 39433 -147669 -368517 10741 223015
22124 223015 306977 231152 146558 319376 233545 -103489 -180241 -138971 -138571 -90816 -332850
22113 -332850 -166345 -11600 60134 174720 332170 304239 -25317 -241165 -148134 -178532
22103 -178532 -158631 -339289 -378028 -265168 -294149 -141346 -18069 -314354 -541841 -539977
22093e39977K66313J68011k34378k4314O9107J39758j9775P733j4856O5591q4922
22082b01709Q2432l3879n0150J35693K87593l1503k06173k89385K32911J34960
22072F0790j24168r1448j27050l1609P6542r2507R6570K43934J82139p7453j64033
22061d8293K3816m5646n6265K34510O5232N1878j02290k62500K5025K84402J61184
22050C31053k52760J4000j1220o5766m8072j95903J37768J28640l5527J04632
22040A06845k76278l04172l40172K76549J41845J17174R1999o2321k600j30155
22030c81286K492Q2972J21468K34686j68541J23000L6690l476J84578l2402o4668
22019A35513o2398k11438p8229j49516j95205J7317m035J11917L05202J14108
$$ plain form
22093 -539977 -273664 -105653 -340031 -364345 -295238 -155480 -175255 -167522 -182378 -116787 -201709
22082 -201709 -119277 -153156 -203306 -67613 219980 188477 -17696 -307081 -74170 60790
22072 60790 -63378 -154826 -281876 -313485 -236943 -329450 -232880 11054 193193 115740 -48293
22061 -48293 -24477 -70123 -126388 108122 173354 225232 122942 -139558 -114533 169869 331053
22050 331053 78293 92293 81073 15307 -32765 -228668 -90900 37740 2213 106845
22040 106845 -169433 -473605 -813777 -537228 -395383 -278209 -186210 -248531 -251131 -381286
22030 -381286 -378794 -295822 -174354 60332 -108209 14791 51481 48005 232583 200181 135513
22019 135513 73115 -138323 -216552 -366068 -561273 -543956 -547991 -436074 -130872 -16764
22009a6764P9177j45681J64969K31171j5307q9273j233j37736J47390Q6223k10648
21998I2288k6891O8091N0806O3766j69914j95520j10686J60795J14258J11961
21988A58954N6291m2907Q4109j7367J6166j09061j92333j26662J86641K69343
21978B83174J3720j9126j69279j03600r701J84274J47914M148k62059l18968L7228
21967b12275M19758n2536j21680Q4246L7169K9655J7571j1084J40299M4184n4123
21956C21184j18527k3947K2080r3580o2528k18812k09849Q4861Q6819j32163K0532
21945c23930N8685j70685K2299k59329M0880L40719J31944N0171N3825O508n8811
21934a07724j7632R3024K24210q8580J61384j8507k21237k34577J63361L14254
$$ plain form
22009 -16764 62413 -83268 81701 312872 297565 208292 207059 69323 216713 302936 92288
21998 92288 65397 133488 184294 248060 78146 -117374 -228060 -67265 46993 158954
21988 158954 215245 172338 256447 239080 255246 146185 -46148 -172810 13831 283174
21978 283174 296894 277768 108489 4889 -4812 179462 327376 331524 69465 -249503 -212275
21967 -212275 207483 154947 33267 117513 154682 184337 201908 190824 331123 375307 321184
21956 321184 202657 178710 200790 107210 44682 -174130 -383979 -299118 -212299 -344462 -323930
21945 -323930 -265245 -435930 -413631 -672960 -632080 -291361 -159417 -109246 -55421 -48913 -107724
21934 -107724 -125356 -32332 191878 103298 264682 246175 24938 -209639 -46278 267976
21924B67976l34406j12534O1659J60583J93520j5571m8909j31414K03015k8662
21914B15257l06883o9956J05911p588J13129J27770J12674J04808J66228M8858
21904F10208m07854j36776J58733p1490K8678j09907o3342J94707J56367l50145
21894I179r2055J77545K29845k8519j15397m4059j25569J8117j05536k55388Q9162
21883b42675R792K60340q3251n7318P3991p7362m6207J25890J48443l3948m0310
21872C7385p7649J41175Q762j11853k832J2309J93635O3627n4472j70003j74249
21861a34165J51569K11533r5312j05229l898l9930o9046j40179o1764J80354P2549
21850c3518k45691L0673L20128N9838J31739j58342j77958n7548k4128k235J19037
$$ plain form
21924 267976 -66430 -178964 -117305 43278 236798 221227 172318 40904 243919 215257
21914 215257 -91626 -161582 -55671 -63259 49870 177640 290314 395122 561350 610208
21904 610208 202354 65578 224311 152821 181499 71592 8250 202957 359324 9179
21894 9179 -82876 94669 324514 295995 180598 136539 10970 29087 -76449 -331837 -242675
21883 -242675 -232883 27457 -55794 -113112 -39121 -116483 -162690 -36800 111643 77695 37385
21872 37385 -40264 100911 109673 -2180 -5012 7297 200932 264559 210087 40084 -134165
21861 -134165 17404 228937 133625 28396 24498 -15432 -84478 -224657 -286421 -106067 -33518
21850 -33518 -279209 -248536 71592 131430 263169 104827 -73131 -130679 -154807 -157042 -38005
21839c8005P2351J72774j65018l11283o8229L55296p2900r411O4529l2183j06255
21828a38334K46931K6615j58060R5386m9708J0197O0500p6204K0862J52293J2250
21817B02728j51336m7843J41241K20816j72584o9389l0300L0964m2963K6566R4256
21806B02156r872N9507J03243R1321j8520j23472j80030N0579p758k79147J07677
21795d316l1029j35500O6453j2296J53265j01366p6740K98318R4867k4330j60209
21784F7117k8526J20551r7052j19315J1509J37428K7103P4541R6780l4704k71311
21773a5879j05407J37958J08801k02568J19691P8520R932n4211K2568k40924j48942
21762b90461P8140J01822L72320K47456m9013j59711k32119N5785j75277j34777
$$ plain form
21839 -38005 34346 207120 42102 -269181 -337410 17886 -55014 -64425 104 -32079 -138334
21828 -138334 108597 135212 -22848 72538 22830 33027 93527 17323 38185 190478 202728
21817 202728 51392 3549 144790 365606 193022 123633 93333 124297 81334 107900 202156
21806 202156 192284 251791 355034 446355 427835 304363 124333 174912 167154 -111993 -4316
21795 -4316 -35345 -170845 -104392 -116688 36577 -64789 -141529 156789 251656 227326 67117
21784 67117 38591 159142 62090 -57225 -45716 91712 118815 193356 290136 255432 -15879
21773 -15879 -121286 16672 125473 -77095 42596 121116 131048 76837 99405 -141519 -290461
21762 -290461 -212321 -110499 261821 509277 460264 300553 68434 124219 -51058 -185835
21752a85835m9411R9972J01911p1151Q8528N8754n8699j7502M6937j41305L2823
21741i4978m700l23780q9481Q0980O3350k8425k9734J20428J22959J66692R5560
21730G8871j52658n9383m6420J5982L31455J82238k35067m8250K1597k5427J78774
21719B41712j22932j02268l2719L13006J8883o1608n3113J1611j7768K24862J11038
21708E30704j94502m69796M710k9048J98945L22032k7784k77906O1939k4259o230
21697H8805J2614p6454j9065j28857Q8507L58738N6767l3921J25521J36815r9819
21686E09651j02548m6944K49996k14543o8017k01766j14501J27264J68789j25371
21676A82010k92749J17747L56548M2976j41341M2229m4844j93488r1897J55017
$$ plain form
21752 -185835 -235246 -135274 -33363 -104514 -15986 42768 -15931 -33433 13504 -127801 -94978
21741 -94978 -99678 -423458 -512939 -431959 -368609 -397034 -426768 -306340 -183381 -16689 78871
21730 78871 -73787 -133170 -179590 -163608 167847 350085 115018 66768 88365 62938 241712
21719 241712 118780 16512 -16207 296799 315682 254074 200961 212572 194804 419666 530704
21708 530704 336202 -133594 -128884 -157932 41013 363045 335261 57355 119294 95035 88805
21697 88805 101419 24965 5900 -122957 -34450 324288 381055 347134 472655 609470 509651
21686 509651 407103 360159 610155 395612 327595 125829 11328 138592 307381 182010
21676 182010 -110739 7008 363556 406532 265191 307420 262576 69088 -22809 132208
21666A32208j79254j74356J33779K12186J6687O9473J24368k17958L098Q7720
21656B07951J10227K06487J15357j74866j98994r1389J75437J93395m4524j82895
21646C16186M15M5406j13004l29148m3669j19569j30902O0464L7729L2426K5071
21635b18595J36320R9823J99445j92435j69399J53661J68650K6127m7232k64994
21625a08629j19905q6191O4936J02499J50075j7040m3130M8785K50034J13975
21615C55409o0608l03660j70008R2950J23783M9910j45845J43495r2770j62342
21605a69686m7435j31322l7937J85652k23927j65090L37991R7320m1961M12643
21595B16248j15299l34749k10501m0935J18844K96678J62732j07021J6612Q4520
$$ plain form
21666 132208 -47046 -221402 -87623 124563 141250 210723 335091 117133 120231 207951
21656 207951 318178 524665 640022 465156 266162 174773 350210 543605 499081 316186
21646 316186 316601 362007 249003 -80145 -123814 -243383 -374285 -313821 -276092 -243666 -218595
21635 -218595 -82275 17548 216993 24558 -144841 8820 177470 203597 156365 -108629
21625 -108629 -228534 -314725 -249789 -147290 2785 -14255 -57385 -8600 241434 355409
21615 355409 294801 -8859 -178867 -85917 37866 87776 -58069 85426 -7344 -169686
21605 -169686 -217121 -348443 -386380 -200728 -424655 -589745 -251754 -154434 -196395 216248
21595 216248 100949 -233800 -444301 -485236 -366392 -69714 93018 -14003 2609 87129
21585H7129l6968P1002j8232j05778k06095p6908J31556J45875j51924j69393
21575c29736J21967P1705k20764j66535N4263J34754M4137J1634k3918J94532
21565a07961P7870J3744J29244J09279j31610j78214l38675n2824J06727J34193
21555b38227K04012j8981J1068p0875J6188o8454j14500J61013O1534j00388q2608
21544b40218J93970M0583p331j39109J13534j46241j08395K00692O0650Q6949
21534E5084J85059q9993j66193j63187K6425K7470j92673j70716K1249Q9317K73023
21523a05135J49193l083k61541j87418M0482p303J69014r0406J27417R9255j00832
21512a70357J91606P8153k14818j15655J07891J29447K69221L3269N344j85371
$$ plain form
21585 87129 50161 121163 102931 -2847 -208942 -285850 -154294 -8419 -160343 -329736
21575 -329736 -207769 -136064 -356828 -523363 -469100 -334346 -290209 -278575 -302493 -107961
21565 -107961 -30091 -16347 112897 222176 90566 -87648 -426323 -479147 -372420 -238227
21555 -238227 -34215 -53196 -42128 -113003 -96815 -165269 -279769 -118756 -57222 -157610 -240218
21544 -240218 -46248 -5665 -12996 -152105 -38571 -184812 -293207 -92515 -31865 55084
21534 55084 240143 150150 -16043 -179230 -152805 -125335 -318008 -488724 -467475 -378158 -105135
21523 -105135 44058 40975 -220566 -407984 -367502 -374805 -205791 -296197 -168780 -69525 -170357
21512 -170357 21249 99402 -115416 -231071 -123180 6267 275488 308757 314101 128730
21502A28730Q3505K29566r8904m14923O2330K66907J7669j35017J22891R3476
21492C56230l45157L1847L07670j9626j67116j79446J40177K54829J52140n4233
21482D77315l25536j13108j72489J72002K56471j7478k43681k04701K0787K28021
21472G7603Q4139j52075Q0632J88392P9907n5274j12935j10128J2555j51878l15073
21461c74135k1205L00210L5900O6629L6077K76262J21348q0830m26289k51552
21451c17585L35851J08964j21422j08427q0951J59971R1409j97725Q9469K04286
21441A63840K27273k3216k82357J45604J075O2329j31630M9282M5311Q145j29364
21430A36292K03390O7441j74360l40356j11882P8851j32813j11242J1935q7697
$$ plain form
21502 128730 212235 441801 342897 -72026 -9696 257211 274880 139863 262754 356230
21492 356230 11073 42920 350590 330964 163848 -15598 124579 379408 531548 477315
21482 477315 151779 38671 -133818 38184 294655 277177 33496 -171205 -150418 77603
21472 77603 161742 9667 90299 278691 358598 303324 190389 80261 92816 -59062 -374135
21461 -374135 -395340 -95130 -59230 7399 43476 319738 441086 360256 -66033 -317585
21451 -317585 18266 127230 5808 -102619 -183570 -23599 67810 -129915 -40446 163840
21441 163840 391113 367897 85540 231144 232219 294548 162918 212200 257511 265656 136292
21430 136292 339682 407123 232763 -107593 -219475 -140624 -273437 -384679 -372744 -460441
21420d60441J57550K55486J57736M5722k24376j07886J14339L9738k33526K4366
21410b31292O1701q5919k3221J47682J23864J14187P9652K3245N8249J5883q2398
21399B01633P6303j30767k53476k82478K8821J08363k7887J76549J12484J63383
21389A72928j83740K6593M1173o0129J1175k90095p2360R4318K3879J51977K0484
21378f3797q2848j9018L60166J60114N60j02754Q3525J36904j08815l30854q9305
21367e6122K55862J01143j47686J28347j73401k86884j47882N9718o6338L68649
21357C5406J99956k438J01559k8374q3479j73067m2580j07791j836k4136p4101
21346b00881k13702J47737O5410J80072J77638j22558o6364J9338l01326r058
$$ plain form
21420 -460441 -302891 -47405 110331 156053 -68323 -176209 -61870 -22132 -255658 -231292
21410 -231292 -169591 -255510 -278731 -131049 -7185 107002 186654 209899 268148 284031 201633
21399 201633 277936 147169 -106307 -388785 -359964 -251601 -279488 -102939 9545 172928
21389 172928 -10812 15781 56954 -3175 8000 -282095 -354455 -260137 -236258 -84281 -63797
21378 -63797 -146645 -165663 194503 354617 355177 252423 335948 472852 364037 33183 -56122
21367 -56122 199740 300883 153197 281544 108143 -178741 -326623 -266905 -333243 35406
21357 35406 235362 232924 334483 306109 222630 49563 6983 -100808 -102644 -126780 -200881
21346 -200881 -414583 -266846 -201436 -21364 156274 33716 -32648 -13310 -314636 -323694
21336c23694O6475K63421J63086J13590j35580l0993J68324J1933r6007j65809
21326C4746l36774K30214K86486q1303M8930K9394K648K8686j09047P8450n5151
21315A57279k18484k49038k4423j36862m1737J0684K67579J01059L8723K7900
21305f7320q0441j24399M0092K39984l6546J66403J48937M110J0491k69725k21689
21294a90103K47051K66890k05131k71746J43990P103m4970j25633n7952M9877
21284a80624k4594J9873m4971J04225l2288p2985k8486K28477J61521K2834o927
21273A46055k01554r8894L18456O6490k43776j66793K43053Q2084M8138R4791
21263B88050j60859J10641J59343j98850p6754j2673l7949P8174j0822j6512J4724
$$ plain form
21336 -323694 -257219 6202 169288 282878 147298 116305 284629 296562 200555 34746
21326 34746 -302028 -71814 214672 133369 182299 211693 214341 243027 133980 212430 157279
21315 157279 -61205 -310243 -334666 -471528 -513265 -502581 -235002 -133943 -95220 -67320
21305 -67320 -147761 -272160 -232068 7916 -28630 137773 286710 290820 301311 31586 -190103
21294 -190103 56948 323838 118707 -153039 -9049 -1946 -46916 -172549 -230501 -180624
21284 -180624 -205218 -185345 -230316 -126091 -158379 -231364 -259850 -31373 130148 152982 146055
21273 146055 -55499 -154393 164063 230553 -13223 -180016 63037 145121 193259 288050
21263 288050 127191 237832 397175 198325 121571 108898 70949 149123 138301 121789 136513
21252A36513M6705N3039j6393K6134o2662J4611N223K2880k12276q6780m1345
21241a14351L2958m5497p8632J75230J32127o6507N1129j23813M6778O5538J01425
21230A76385M5270m4362k48020K276J27213k9942n0195J00625J19046q9963j64852
21219e6519M7994Q664m6947j4454L9983k190N0082K8597j46335l2325j65256J45489
21207a43217j192j87106j37038j756n3598L58901K70062P0105m9439k66204N9319
21196h1163J30127k74315j26777R0191K0811P8786J60063L794K333J49759J08020
21185B61629p8350l4709j20001N09J94403j23224J2353R0792o227j33048j67252
21174a03125k04952P4j40404p3002L03120K31641M7301n5849o0497J38372K04758
$$ plain form
21252 136513 183218 236257 219864 245998 183336 197947 203170 226050 13774 -73006 -114351
21241 -114351 -81393 -126890 -205522 -30292 101835 35328 86457 -37356 9422 74960 176385
21230 176385 221655 177293 -70727 -68451 58762 28820 -21375 79250 198296 108333 -56519
21219 -56519 -8525 139 -46808 -61262 -21279 -23469 26613 55210 -91125 -123450 -288706 -143217
21207 -143217 -144409 -331515 -468553 -470309 -523907 -165006 105056 175161 125722 -140482 -81163
21196 -81163 48964 -225351 -352128 -261937 -241126 -162340 -2277 1517 3850 153609 261629
21185 261629 183279 148570 28569 29078 223481 100257 112610 203402 197175 64127 -103125
21174 -103125 -308077 -308003 -448407 -521409 -218289 13352 60653 4804 -55693 82679 287437
21163B87437P1886j25030k32218j35228J62514Q4257K24039J15350P4286j75353
21153C51940k53131k81770p3153R8508L8059p1275M5522M1080K28361k3924k04838
21142a04621j13314K160J2517J81235N5415J37020k706k81082p5905k29193k09168
21131f27642J12258J70732M24219k0777j98115k13996K7018K80013K90966M21341
21121F66017j04294k33057l78498p3506K19120P9545q0373j57239j07607j81967
21111c51859j31803K03106J72258K4190L09K11142n7910j24325j43726j1441O8659
21100a41400m0242J73660K0589j1354J50824n7927k12779j05166J47748M0026
21090c6021P4557j89836j61295J23660M7604j42804N7797m4578p6601J9361K76081
$$ plain form
21163 287437 359323 234293 2075 -133153 29361 113618 337657 453007 527293 351940
21153 351940 98809 -182961 -256114 -157606 -119547 -190822 -145300 -104220 124141 100217 -104621
21142 -104621 -217935 -215775 -203258 -22023 33392 170412 167706 -113376 -189281 -418474 -627642
21131 -627642 -515384 -344652 79567 58790 -139325 -353321 -326303 -46290 244676 666017
21121 666017 561723 328666 -49832 -123338 95782 175327 94954 -62285 -169892 -351859
21111 -351859 -483662 -280556 -108298 -84108 -83799 127343 69433 -54892 -198618 -210059 -141400
21100 -141400 -181642 -7982 12607 1253 152077 94150 -118629 -223795 -76047 -36021
21090 -36021 38536 -151300 -312595 -188935 -141331 -284135 -226338 -270916 -347517 -328156 -52075
21079e2075P920M9215J28896L5932J77006J62617j458j63715J48940J2143k32063
21068B73358j24379p1132p399Q4871P7164j09986j20360J33350J70892p1918j6019
21057B18442j88129n5508n2748O3606L18501J15089k52761r4393l2448L3733j16277
21046d2893R0037J78084N3308J57276j59653k48948j08407L452j13482m4977j50160
21035c86363M2990N355J14800J54928o4127k1731J3543J30822P4695J31246J80311
21024C76469J70481r8989k73436l92096J5750K00614k04097J46067M06121L20428
21014F67312R08j56652l21346r2790j75689j23561K02425p6879p0227L81554O8006
21003C03061j15678r2905k31985j78527L0720j15131k7941K32416o3998j72687
$$ plain form
21079 -52075 -44155 5060 133956 169888 346894 509511 508053 344338 493278 505421 273358
21068 273358 148979 77847 70448 155319 232483 122497 2137 135487 306379 234461 218442
21057 218442 30313 -25195 -77943 -14337 304164 419253 166492 72099 39651 73384 -42893
21046 -42893 47144 225228 278536 435812 276159 27211 -81196 -77744 -191226 -236203 -386363
21035 -386363 -343373 -338018 -223218 -68290 -132417 -154148 -140605 -9783 64912 196158 376469
21024 376469 546950 447961 174525 -217571 -201821 -1207 -205304 -59237 346884 667312
21014 667312 668220 511568 190222 97432 -78257 -201818 607 -76272 -146499 235055 303061
21003 303061 187383 94478 -137507 -316034 -285314 -400445 -428386 -195970 -259968 -432655
20993d32655R4497J24232J63429J10427m0826q424Q9513n0598J7816o6304J66218
20982A67325J12309J67482o4153j35546R8919N0335q3137j66582j55171j6278
20972b4497l2245J15267J94119j25280J6576j13238q3029L5754M9141K05929k19334
20961A9163j0319J76446Q3669Q542o5945L4976k1219r4220j6148J75777k8672
20950B62050l8656k53577K38670k5541j249L0530P4373j00918J20453q391o0500
20939B37244m6101j25113j82350L497n0972j20218j31346J79136M0306q9825J33205
20928a52537J21505j82943j75689K16840J33954J58814M0491L2751j51865n7888
20918a6567k7077l56042n274K29184k908o2791J72864J16815o0938O9266K16329
$$ plain form
20993 -432655 -338158 -213926 -50497 59930 19104 10680 100193 49595 67411 1107 167325
20982 167325 279634 447116 382963 247417 346336 396671 313534 146952 -8219 -24497
20972 -24497 -56742 58525 252644 127364 143940 30702 -52327 -16573 32568 238497 19163
20961 19163 8844 185290 268959 277501 211556 246532 225313 131093 114945 290722 262050
20950 262050 223394 -30183 208487 182946 181697 212227 286600 185682 306135 297744 237244
20939 237244 191143 66030 -116320 -112823 -163795 -284013 -415359 -236223 -195917 -285742 -152537
20928 -152537 -31032 -213975 -389664 -172824 -38870 119944 160435 193186 41321 -16567
20918 -16567 -43644 -399686 -404960 -175776 -178684 -241475 -68611 48204 -12734 56532 272861
20907B72861p400p6609m9943j0515q2278Q072r8251N5929j9655J07188K40563
20896C39962j67694q4514r840J12339j6731q8130J31809J60377m00821k92313
20886c15556K08458L17173k28796n3410J14409K58309k14733k50290J03380J40
20876f0916m9484J29550L7811J87430j59001j61576j53104j9273R3799L42827
20866A88063n3719j31928l8635J17745N5148k3679j94766L1565R9395K12393n9289
20855B02293K1796J02931j52312r8591j38124j4920K48400O6191p7739K93711
20845D53636K94748j51940j08864k64296J03396J31394j28836p1588o4990k23521
20835c0861J4063j75628l298J11427P8747n4530N2274J43720J03899j21625O8656
$$ plain form
20907 272861 265461 188852 138909 128394 46116 54188 -44063 11866 -7789 99399 339962
20896 339962 172268 87754 77914 190253 173522 85392 217201 377578 -23243 -315556
20886 -315556 -107098 210075 -18721 -72131 42278 300587 85854 -164436 -61056 -60916
20876 -60916 -110400 19150 56961 244391 85390 -76186 -229290 -248563 -154764 188063
20866 188063 134344 2416 -36219 81526 136674 112995 -81771 -50206 49189 261582 202293
20855 202293 224089 327020 174708 76117 -62007 -76927 171473 237664 159925 453636
20845 453636 748384 596444 487580 223284 326680 458074 329238 257650 192660 -30861
20835 -30861 -16798 -192426 -195724 -84297 -5550 -60080 -7806 135914 239813 118188 186844
20824A86844k2627j24548J13196l2352q9953J17736O2214j61491M1261j43168
20814e2888k28906j6308P7456l6148J52984o1371j33611j58557j94886J84857
20804d67378L25911j23662q3741O7085J79974J84792j15992j53878l0837j3411
20794b31137J7214R1111O2885J68845j0901J92742J30864m4654j98891j9994J159
20783A59243j0754k19001J4947K7249r3437Q0706J50510K67150J20204k31398
20773B65419j80290j0824j74182L0897n082M1261j07337j7795L4354k4696r577
20762a57852O881K40937j11093q5744n3390o9441k6867R1461j11666Q6441j9009
20751b09342n8575n6010J25014R3370q5104K09813j93055o4944J75091J4162K664
$$ plain form
20824 186844 164217 39669 152865 120513 30560 148296 210510 49019 90280 -52888
20814 -52888 -281794 -298102 -220646 -256794 -103810 -165181 -298792 -457349 -652235 -467378
20804 -467378 -141467 -265129 -348870 -281785 -101811 82981 -33011 -186889 -217726 -231137
20794 -231137 -213923 -122812 -59927 108918 98017 290759 421623 376969 178078 158084 159243
20783 159243 148489 -70512 -55565 -28316 -121753 -41047 109463 376613 496817 265419
20773 265419 85129 74305 -99877 -68980 -74062 -32801 -140138 -157933 -123579 -148275 -157852
20762 -157852 -150971 89966 -21127 -106871 -160261 -229702 -256569 -165108 -276774 -190333 -209342
20751 -209342 -267917 -323927 -198913 -105543 -190647 19166 -173889 -238833 -63742 -49580 -46916
20740d6916J39397m5847m9793J10989j5526k0532j27246m962l3873P1187J37973
20729A14851J13912j35971j93960J03938K22830J9202J5851o948k42092n7158
20719d5545L64542J85978j67881j44479n5082r6105j79244L09083L9957o950r246
20708A95028P340j483j3149l89885j98318J7403J26269k8543m0355r4823J51697
20697b68819n2667L1157N3092L069K36312K778J21195O3490j42022O0111O1779
20686A69475q6039p5949J7442j74367J33024J13274O2969j15129j23943R176P7583
20675G516K37246K39610j49781l4758k43653M9047J02605m4706L3516j31536j17170
20664e2064J09356o9920k664L58254M6509n1479r8296j07880P2336J7048j89645
$$ plain form
20740 -46916 92481 46634 -3159 107830 92304 71772 -55474 -60436 -94309 -23122 114851
20729 114851 228763 92792 -101168 2770 225600 244802 260653 253705 11613 -45545
20719 -45545 318997 504975 337094 192615 137533 41428 -137816 171267 211224 204274 195028
20708 195028 202368 200885 187736 -202149 -400467 -383064 -256795 -285338 -325693 -420516 -268819
20697 -268819 -321486 -290329 -237237 -234168 2144 4922 126117 189607 47585 107696 169475
20686 169475 83436 7487 24929 -149438 -16414 96860 159829 44700 -79243 -70067 7516
20675 7516 244762 484372 334591 299833 56180 105227 207832 163126 196642 65106 -52064
20664 -52064 57292 -12628 -15292 342962 389471 337992 239696 131816 204152 221200 31555
20653C1555l76665J26502K12729L5982R2658j93675j44150J50288L10342n6599
20643A88967l04481O951J90129M0283M6284j38389m6536j92622O8612j00043J01033
20632a39812R1500K25538p0205k99536m2367Q1418J54270O2442k5922j63850p6862
20621b03386j18777j46312J00768P3643J16571L40270P8925m72607J41991J04378
20611A5464k66864K9607L42023Q2341q3597j28867J55242J15123m11208l48279
20601d99015q2103Q1671K31879J74953J14138L10018k35749j73433N9627j47752
20591a65766R5544J51049N2284p8745p2435J6915j8399K27407R4677j22303j82061
20580a833j20496L4411r9991j86182n9160J477J67975K18168J11372k1614r7865
$$ plain form
20653 31555 -345110 -218608 -5879 30103 122761 -70914 -215064 -64776 245566 188967
20643 188967 -115514 -108563 81566 121849 168133 29744 -16792 -209414 -140802 -240845 -139812
20632 -139812 -48312 177226 107021 -192515 -234882 -153464 806 63248 37326 -126524 -203386
20621 -203386 -322163 -468475 -367707 -294064 -177493 162777 241702 -230905 -88914 15464
20611 15464 -251400 -221793 120230 202571 118974 -9893 145349 260472 -150736 -499015
20601 -499015 -581118 -499447 -267568 -92615 21523 331541 95792 -77641 -18014 -165766
20591 -165766 -70222 80827 133111 54366 -18069 -1154 -19553 207854 302531 180228 -1833
20580 -1833 -122329 -87918 -187909 -374091 -433251 -431774 -263799 -45631 65741 44127 -53738
20569e3738j88370j37595K56283K71961N516J7223N269p2895j31846J32352r9074
20558E086k79304K32743o4243n8325k06073J14911K23407K2363n625J85987o8004
20547A02923j24324J08280J03392o3127m4779r9301p5058o2538K2442K13662j60983
20536g9411l7412Q3757j73012r2345K29901K02100M205m2158l6177j30717o0833
20525a32102M0048J34041R0995P0961M5957j617k21320j69865k78865m0470K87230
20514a75007M00652m8303l40478m6327j6692M8581R8696P1653L5426k43413m947
20503b20159N3388J38689p538M6142j8113j95077j63514J15538J22631J73544
20493D5531J05609k25819l843P297K943j20377k6989Q6080J41333j0491O3882
$$ plain form
20569 -53738 -242108 -379703 -123420 148541 154057 171280 176549 103654 -28192 104160 5086
20558 5086 -274218 -41475 -105718 -164043 -370116 -255205 -31798 -9435 -15060 170927 102923
20547 102923 -21401 86879 190271 127144 82365 -16936 -91994 -154532 -132090 81572 -79411
20536 -79411 -116823 -33066 -206078 -298423 -68522 133578 137783 95625 59448 -71269 -132102
20525 -132102 -92054 41987 132982 203943 249900 248283 26963 -142902 -421767 -462237 -175007
20514 -175007 225645 177342 -163136 -209463 -226155 -177574 -78878 -7225 28201 -215212 -220159
20503 -220159 -166771 -28082 -35620 10522 -7591 -202668 -366182 -250644 -128013 45531
20493 45531 151140 -74679 -78522 -71225 -68282 -188659 -215648 -129568 11765 1274 65156
20482F5156m2416k9920R7138Q323J00321p6751j6878k3730j44830q6345J31135
20471a8797J39056k0926J45089k89532l17538J15392j24847j74493q4626K22781
20461d08441J72266J9817J92387n4214J35430K45436j18355l75960p0936P8223
20451a84347K87815K66380j48755k08808p7669J71809n9871l10499m540J75641
20441i2844J03536J54163q5314r1024l9943j6804j2383K45692j8958L3985j30066
20430E0040q3320m0763J3954o51J62767j67714j90134R2472l2996k7509r6267
20419c20121j1661r4307N2357K94284J06719j38251r3280J27214K10498r0078
20409D3374K8782n5778Q7612K38189q6188l35927k18882N7029M31716n4272N268
$$ plain form
20482 65156 22740 -7180 89958 98281 198602 121851 104973 81243 -63587 -149932 -18797
20471 -18797 120259 99333 244422 -45110 -362648 -247256 -372103 -546596 -631222 -408441
20461 -408441 -236175 -216358 -23971 -78185 57245 302681 184326 -191634 -262570 -184347
20451 -184347 103468 369848 221093 12285 -65384 106425 46554 -263945 -268485 -92844
20441 -92844 10692 164855 79541 -11483 -51426 -68230 -80613 165079 146121 180106 50040
20430 50040 -33280 -74043 -60089 -60740 102027 -65687 -255821 -163349 -196345 -223854 -320121
20419 -320121 -331782 -426089 -373732 -79448 27271 -110980 -204260 -77046 133452 43374
20409 43374 72156 16378 103990 342179 255991 -79936 -298818 -241789 189927 135655 140923
20398A40923p0151n7583K27413j44258j42170K22966o5318p0795q0109k07797
20388b46879j5676J6227O3068R722K50643J89757j18937l42641k17988R0090K1106
20377c01508M8011o7402q7780L62580K75426M2039j05192k3646J51444p9157J11080
20366C25895J97377l01900l11866M8479J19822M0715K8789p3135N5294m3523q4074
20355A873k9550j1142N6807J23187j31406j42208J70295J54136J60904n6524k24547
20344G1825j58211j76935L3702J40142o9595o8873j33837m0680K61864K21047
20334H0449k21838j43177n8434J47941J84311J55063Q437r6643j25528k02464
20324b71883j71248J24137J68865m4243m1349J3457r1394J14673K24436Q2686
$$ plain form
20398 140923 70772 13189 240602 96344 -45826 177140 111822 41027 -39082 -246879
20388 -246879 -262555 -246328 -183260 -173538 77105 266862 147925 -194716 -412704 -322614 -301508
20377 -301508 -253497 -320899 -408679 -46099 229327 271366 166174 142528 293972 214815 325895
20366 325895 523272 221372 -90494 -42015 77807 118522 147311 74176 129470 85947 1873
20355 1873 -27677 -38819 17988 141175 9769 -132439 37856 191992 352896 296372 71825
20344 71825 -86386 -263321 -229619 -89477 -159072 -227945 -361782 -402462 -140598 80449
20334 80449 -141389 -284566 -343000 -195059 -10748 144315 152752 56109 -69419 -271883
20324 -271883 -443131 -318994 -150129 -194372 -235721 -222264 -313658 -198985 25451 108137
20314A08137J19898j35837k52161M6887K2109L3082j73032J7585P8709P9805o1639
20303a16457j0807M4695k50062Q9368J2629J41970j27512K561K86503O7058q1731
20292E8215J3871l2504j77196o056N3395p8025m8795J7293J47180m5695j70623
20281b68940K6360K14589J79027L03664j19852k19201k51069j61713R769K34047
20271e3319L34053J6180j49751M921j19206k01015q2066p739K67574j52184J38140
20260d412K17675Q3432n0209j87950R2955J87132J10797p2239o1081k8614J85843
20249D73329r2047j99540l34552j19946K6156J08850L0270J4039j36098k5790
20239b55329K11070K0788j38630n9406j32564j27818K52162J78126J43752K04439
$$ plain form
20314 108137 228035 92198 -159963 -113076 -90967 -57885 -230917 -213332 -134623 -54818 -116457
20303 -116457 -127264 -82569 -332631 -243263 -230634 -88664 -216176 -213615 72888 139946 58215
20292 58215 72086 39582 -137614 -143670 -90275 -168300 -217095 -199802 -52622 -98317 -268940
20281 -268940 -242580 -27991 151036 454700 334848 115647 -135422 -297135 -287366 -53319
20271 -53319 280734 296914 147163 152084 32878 -168137 -250203 -257942 9632 -142552 -4412
20260 -4412 213263 296695 246486 58536 151491 338623 449420 377181 316100 287486 473329
20249 473329 381282 181742 -152810 -272756 -246600 -137750 -107480 -93441 -229539 -255329
20239 -255329 -44259 -23471 -162101 -221507 -354071 -481889 -229727 -51601 92151 296590
20229B96590J19626j14284n6900n356k48148l62267J2007K68216k8415j17773
20219b36704Q7749P481R98L07044J62673O560k98142l4609L80703K8083j6912
20208C94924o9147l51984q7244J79214J62527K0005p476O6455k00689k10971P1771
20197c2615q4061J03677l3249n3168n0218J44513J74686J51027P1022k33923n7946
20186I9745j11767j03752j56937J045J09537K22202j36943j71461r8023J38298
20176b08056J55558o6164L52265O4864k26710O7928J10324O3487L4501j5853J01600
20165D33744j66164j56662k84816m3455j62804J6320n9193K66309K31368m6319
20155B8328j84762J84634K59433J9861n7144j97009m0845M2345R3434L5550k08367
$$ plain form
20229 296590 416216 301932 245032 239676 -8472 -370739 -358732 -90516 -118931 -236704
20219 -236704 -148955 -141474 -140476 166568 329241 335801 37659 3050 383753 411836 394924
20208 394924 325777 -26207 -113451 65763 228290 248295 240819 307274 106585 -104386 -32615
20197 -32615 -116676 -12999 -46248 -99416 -149634 -5121 169565 320592 391614 157691 99745
20186 99745 -12022 -115774 -272711 -271666 -162129 60073 -76870 -248331 -346354 -208056
20176 -208056 -52498 -118662 233603 298467 71757 139685 250009 313496 347997 332144 433744
20165 433744 267580 110918 -173898 -217353 -380157 -363837 -423030 -156721 74647 28328
20155 28328 -156434 28200 287633 307494 250350 53341 12496 54841 148275 183825 -24542
20144b4542N0058n1457Q9127L38755m5326k12033L1861j56229k9239J47095R4302
20133B32372l71697J15361n88j22380J60466J10411r5317M1232P8862j86472M3956
20122F206m2915j9598Q5771K41428q5551k63249l87645P084J32530j13158K24388
20111b14709J35311P0835P9621L3906p3526k24501J15307K35243J64772M1055
20101C63314j67258q3642J52919N4557n8987j64547j18363M0479m0732l8297K3456
20090c7101K15627J41815L1769P2613k00493K0638L3792k33042j23657J51223
20080G3184p0841N9735j02063p8057k1878N5923J90256J97208l50392m9217J92162
20069I6020p8987K5072J62530J7600k07063n2358K6503l9838J06830n5298k65450
$$ plain form
20144 -24542 25516 -25941 63186 401941 356615 144582 176443 20214 -9025 138070 232372
20133 232372 -139325 -23964 -24552 -146932 13534 123945 28628 69860 148722 -37750 6206
20122 6206 -36709 -56307 29464 270892 185341 -77908 -465553 -458469 -325939 -439097 -214709
20111 -214709 -79398 -8563 71058 104964 31438 -193063 -77756 157487 322259 363314
20101 363314 196056 112414 265333 319890 260903 96356 -22007 18472 -22260 -60557 -37101
20090 -37101 178526 320341 352110 424723 224230 244868 278660 45618 -78039 73184
20080 73184 2343 62078 -39985 -118042 -139920 -83997 106259 303467 -46925 -96142 96020
20069 96020 17033 42105 204635 222235 15172 -37186 -10683 -50521 56309 1011 -264439
20058b64439l46905L27760L71908m4030k03098j02820J16199K92052r1246j6750
20048C8631k8616K161J53573J7106J42170L1968j16734o422L6682O1292K4643
20037C56454K10811j83605j2981j1388m5458j09744Q1050o7436J7467j84069q2614
20026c1513j07556p9644j48994K21205K22345p2477j20498J05623K44442p328
20016B25605k36948k38765m5038N2836J67457p0434J35857J70841M5944J69452
20006C76807j04803n4722q5521K78377j98999l94677O3428K20008m8326m8760
19996B812J3174J50940j16409m0847K4988J83653R1069p7858M1680K97030J79853
19985G50085j9695P6160J86732J45189K20633J48189P9847k20308j57118Q748
$$ plain form
20058 -264439 -611344 -283584 88324 44294 -158804 -261624 -145425 146627 55381 38631
20048 38631 10015 12176 165749 182855 325025 356993 240259 233837 270519 331811 356454
20037 356454 567265 383660 370679 359291 313833 204089 285139 217703 235170 51101 -31513
20026 -31513 -139069 -218713 -367707 -146502 75843 3366 -117132 -11509 232933 225605
20016 225605 -11343 -250108 -295146 -242310 -74853 -145287 -9430 161411 207355 376807
20006 376807 272004 217282 131761 410138 211139 -183538 -120110 99898 51572 2812
19996 2812 15986 166926 50517 9670 34658 218311 309380 231522 273202 570232 750085
19985 750085 730390 806550 993282 1138471 1359104 1507293 1587140 1366832 1209714 1218462
19975A218462j69205j94075k65147l75553l53116m2373j45288l9838p4634J62283
19965b78484P8657J84004K97823j4806R4741m6915p2424o4607r4860P5880M4161
19954B03170m236K71313j82777j44943J4203K04430j63004j75665K34487p5595
19944A81383q6631k7663K8593J51738J40833L88207K90023k66075J73401K52704
19934A226513L96047q5208k16314l78160j37349J13920k6933r1734k82225j36365
19924C82192n2091k6222j66186n5480j0801J86820l5164k38235m581J2681M7201
19913D0134K0590K0621L662R1493o3206j5517n8605p9644M8127M5279J61064J55993
19901C69991J19039J7797k16166r4318J23831k9123j34180m9742J12987j26524
$$ plain form
19975 1218462 1049257 855182 590035 214482 -138634 -181007 -326295 -366133 -440767 -278484
19965 -278484 -199827 -15823 282000 267194 361935 315020 242596 177989 83129 159009 203170
19954 203170 198934 470247 287470 142527 156730 361160 198156 22491 256978 181383
19944 181383 94752 67089 95682 247420 388253 776460 1066483 800408 973809 1226513
19934 1226513 1622560 1537352 1321038 942878 805529 919449 892516 800782 518557 382192
19924 382192 330101 303879 137693 82213 71412 258232 223068 -15167 -19748 -7067 40134
19913 40134 60724 81345 85007 176500 113294 97777 39172 -40472 7655 52934 213998 369991
19901 369991 489030 506827 290661 196343 320174 291051 156871 107129 220116 93592
19891I3592j00405K05470K14094p0733k63848m3395p5757N7535j87664J6148L07158
19880A52195J91051k08875k19646j88214o2362L07263K52881J67979r2722o0783
19870B38767p0101k47082n1697J23867J79999N682l42315j13437J26480L43018
19860A93181k5334j89377O788J35153J50408O7819k17966j23149J4699K58569
19850B70791K03820r1233k09092k67324L4291K15999O9877k1297j1942j17365
19840G6525L493J07037N7149K1264j46061r2076j42140J56084K26274k2497j5162
19829B29890r4707j89126j77884k02531K12591M3755K3113J59719j959K0167J79956
19818B02984M001k37829j39200O5836K46054p126M348J40019P4923k14303j5597
$$ plain form
19891 93592 -6813 198657 412751 342018 78170 34775 -40982 16553 -171111 -154963 152195
19880 152195 343246 134371 -85275 -273489 -335851 -28588 224293 392272 299550 238767
19870 238767 168666 -78416 -130113 -6246 173753 179435 -162880 -276317 -149837 193181
19860 193181 167847 -21530 -14742 120411 270819 338638 120672 -2477 12222 270791
19850 270791 474611 383378 174286 -93038 -58747 157252 227129 205832 193890 76525
19840 76525 80018 187055 244204 265468 119407 27331 -114809 41275 267549 245052 229890
19829 229890 135183 -53943 -231827 -434358 -221767 -178012 -154899 4820 2861 23028 202984
19818 202984 206985 -30844 -170044 -104208 141846 134720 139068 279087 354010 139707 124110
19807A24110K14966L37602j88507j86845K08213J50090O3587j06792k7640K11427
19797H00211M21745R8739J58768R446k63322j53450o8645J56870l5005l82769
19787G42588k92859k55125l13202j8625L16534K21663J38213j64288k07931L5654
19777B02622K7302J69482J3444j05219j54897j18293N5011J51123M7866J54417
19767D42858K3183j13142j76348O284L42473j08934l33688J62814j14519J19471
19757B50452J82765M7516j56147j46480J19473j67412l9015n5332J60262j10327
19747H5755K31653J02262J67012M338J52049J60372M25760K53402M5632m36159
19737A192076o6062Q6042j9940J02033L2804j69961k22077m02515k17647J08092
$$ plain form
19807 124110 339076 676678 488171 301326 509539 659629 723216 616424 588784 800211
19797 800211 1221956 1320695 1479463 1488909 1225587 1072137 1003492 1160362 1125357 742588
19787 742588 449729 194604 -118598 -137223 179311 400974 539187 374899 166968 202622
19777 202622 229924 399406 412850 307631 152734 34441 89452 240575 288441 442858
19767 442858 466041 352899 176551 182835 525308 416374 82686 245500 130981 250452
19757 250452 433217 480733 324586 178106 297579 130167 91152 35820 196082 85755
19747 85755 317408 419670 586682 591020 743069 903441 1329201 1582603 1628235 1192076
19737 1192076 1126014 1212056 1192116 1294149 1326953 1156992 934915 532400 314753 422845
19727D22845O6586J61312k06131J7511J15156j19459j94344J22158p2292p6911
19717B36431J31383j439l3872K7195N2000J44410l0351p8029n1488N0890k2913
19706D24217J4390l9130M5711k19925l03876J62591K26706k30842P889K25104
19696C12835l41719j48842m2141M4095j1359L88998J22928n27434k39538J84408
19686b57769o1029R5981K72185K40902K31806l8649q5166j44275j33971j65744
19676d5729l0203K53342K49416j62159j43451M2189J24449o6278k4323n9845J96311
19665C33719Q331O9922j498j8713J39092j24576r8561k5893r5366K62862M4694
19654D94013r8874P4340R2080L8698O1967l2095k10450Q3620P0110j87791m7513
$$ plain form
19727 422845 489431 650743 444612 462123 577279 457820 263476 385634 313342 236431
19717 236431 367814 366375 332503 359698 411698 556108 525757 447728 396240 447130 424217
19706 424217 438607 399477 445188 225263 -78613 83978 310684 79842 87731 312835
19696 312835 -28884 -177726 -219867 -175772 -187131 201867 324795 -202639 -442177 -257769
19686 -257769 -318798 -222817 49368 290270 522076 483427 398261 253986 120015 -45729
19676 -45729 -75932 177410 426826 264667 121216 163405 287854 221576 197253 137408 333719
19665 333719 342050 411972 410474 391761 530853 406277 307716 281823 186457 449319 494013
19654 494013 395139 469479 561559 600257 662224 630129 419679 503299 573409 385618 338105
19643C38105k6319l2937k2423m9905j05041P1123k32r898Q9633P3824m08783Q1986
19631h67K43992J47725q399q4243K09075J77815J14801j71222j57270J25152J217
19620E97776p4410j24854k9434j19024O8859P653j1193L6447o9782j13287L8657
19609B07408M0580J16461q164J4691o5635k7519J84144n0732q7679n5618k92682
19598b4745J8452m1621K24335K82745J88665P5842n8508n8851p4479M4939j4662
19587E62112j74666j06279Q2022J61346M821J65776Q33j14335j34045K90895J15083
19576H53563j42238j37761Q5109o706n2913J45676L12653j87533m11178L3707
19566D92379K51836J77995p8636j74832j0847q2830M1889j66676l03515l18L67877
$$ plain form
19643 338105 311786 278849 256426 206521 101480 172603 172371 162473 252106 325930 -82853 -867
19631 -867 243125 390850 382451 298208 507283 685098 799899 628677 471407 596559 597776
19620 597776 523366 398512 369078 250054 318913 326566 315373 351820 282038 168751 207408
19609 207408 247988 364449 356285 370976 305341 277822 461966 411234 323555 267937 -24745
19598 -24745 -6293 -47914 176421 459166 647831 723673 665165 606314 531835 576774 562112
19587 562112 387446 281167 363189 524535 529356 695132 695965 581630 447585 738480 853563
19576 853563 711325 573564 658673 651967 599054 744730 1057383 869850 458672 492379
19566 492379 744215 922210 843574 668742 657895 575065 616954 450278 146763 146445 514322
19555E14322L57569O1157p800j84027j13344J82995L4204J86664k55923j25972
19545F49845P2668J87085p709j46076j25164n8932k5424J26207M7468J59704J74329
19534A054001K63494j02475j09202j69653L1373m214N2628j1710k3210J39359
19524A120391M6313j0165P1742J30157K61482q2432o2854q7468o7919Q3337N5326
19513A457910J02513q2346m0112R598J34248J96468J6991K67438Q4920k01824
19503A945804k19392j74807k11003J02179K55676N4711J98855K19863O4543J02502
19493B338931L114J89059K39608M94978K42716N0531Q3997J35383O67325O41629
19483E087271M39306N19775M65378M89216N93242L61595O6037j2056J61036L27731
$$ plain form
19555 514322 871891 933048 925248 741221 627877 810872 845076 1031740 775817 649845
19545 649845 722513 909598 901889 755813 630649 571717 546293 672500 719968 879672 1054001
19534 1054001 1317495 1215020 1105818 936165 967538 963324 1015952 1004242 981032 1120391
19524 1120391 1166704 1156539 1228281 1358438 1619920 1537488 1474634 1387166 1319247 1402584 1457910
19513 1457910 1560423 1478077 1437965 1447563 1581811 1778279 1795270 2062708 2147628 1945804
19503 1945804 1726412 1551605 1340602 1442781 1698457 1753168 1952023 2171886 2236429 2338931
19493 2338931 2342045 2531104 2770712 3265690 3508406 3558937 3642934 3778317 4445642 5087271
19483 5087271 5526577 6046352 6511730 7000946 7594188 7955783 8021820 8009764 8170800 8498531
19473H498531N81038N68744P52972Q94576J418796J659578J848083K304873L314544
19464B1841735M439985O160837Q954174J2954116J9452478K8408210L5549950
19457A37761485L2199928K4331661J8942147Q116364n998050l661570J111288
19450B12803253r15674o539785k4100597m4826187m0996935k5970090j5781547
19443E3672438r997869o684338m792299l375206k511290j853598j462988j245045
19435B1749805j048107r16175o79134o72555m78774K2708J18813J27391O71568
19426A8895540O68816R37265J063991J078583J426693K123322L154074M302876
19418C3651160O232295R567556J4357694K1768503L1523202L8262064L3527763
$$ plain form
19473 8498531 9079569 9648313 10401285 11295861 12714657 14374235 16222318 18527191 21841735
19464 21841735 26281720 32442557 41396731 54350847 73803325 102211535 137761485
19457 137761485 169961413 194293074 213235221 221351585 215353535 211691965 212803253
19450 212803253 211887579 205347794 181247197 136421010 95424075 69453985 53672438
19443 53672438 43674569 36990231 32197932 28822726 26311436 24457838 22994850 21749805
19435 21749805 20701698 19785523 19106389 18433834 17955060 17977768 18096581 18223972 18895540
19426 18895540 19564356 20501621 21565612 22644195 24070888 26194210 29348284 33651160
19418 33651160 39883455 49451011 63808705 85577208 117100410 155362474 188890237
19411A88890237K5196316J9582632O669663p875307l669757Q33364j782093r047011
19403B18798044k9049027m9157333m2526099k6907471j6649660j1004018p599698
19396C5904738n428475l856879k843631k542500k042969j447906j285629j271162
19388A5185587r60386p49336p57421r02900n65252n28038m11661j82783k42728
19379I885082j82013m72039n96086l61367n04665l29532k40926o92160o80760
19370E825534l03046l58038j87463j79247k66169m3664k4693l15813j92698j56164
19360C798539J07110J07583j19640j97684l5218J34925M62434O83560J041715
19351E983324J445037J678702Q66909O44302J03954j350702k329044j631074r63635
$$ plain form
19411 188890237 214086553 233669185 240338848 232463541 228793784 229627148 227845055 218798044
19403 218798044 189749017 140591684 98065585 71158114 54508454 43504436 35904738
19396 35904738 30476263 26619384 23775753 21233253 19190284 17742378 16456749 15185587
19388 15185587 14225201 13475865 12718444 11815544 11250292 10722254 10310593 10127810 9885082
19379 9885082 9703069 9231030 8634944 8273577 7768912 7439380 7198454 6506294 5825534
19370 5825534 5522488 5164450 4976987 4797740 4531571 4487907 4463214 4147401 3954703 3798539
19360 3798539 3905649 4013232 3893592 3695908 3660690 3795615 4258049 4941609 5983324
19351 5983324 7428361 9107063 9973972 10618274 10722228 9371526 7042482 5411408 4447773
19342D447773n85716m24723j07800q4743m5170m9217l30795j01530L4212q5290
19332B667001m931K1618J66364j20455j10007m2957K2986n938k15018j6938R0842
19321B452567p7672J0597K62867K1029K45935J01590l34649k58677j34926J91491
19311B480152n1949o6299K71009K47870L83120M66867P15462P72350J518561K130073
19301H867216J620603J037262O13554k28420j707142k152897j151183p00893l29329
19292E868771k7331J49558L7397L01802L43696O5721L26447N26798L48302P96364
19282H737525P59358O31362P96336Q76187R73248J585536J853932K286836K870713
19273B1371033L614559N264819P747153J1587919J7887729K6670332L5351064
$$ plain form
19342 4447773 3862057 3437334 3329534 3244791 3199621 3150404 2819609 2718079 2752291 2667001
19332 2667001 2662070 2683688 2850052 2729597 2619590 2576633 2599619 2593681 2378663 2361725 2452567
19321 2452567 2374895 2385492 2648359 2669388 2915323 3016913 2682264 2423587 2288661 2480152
19311 2480152 2428203 2361904 2632913 2880783 3263903 3730770 4446232 5218582 6737143 8867216
19301 8867216 10487819 11525081 12138635 11910215 10203073 8050176 6898993 6198100 5868771
19292 5868771 5841440 5990998 6028395 6330197 6673893 6739614 7066061 7592859 7941161 8737525
19282 8737525 9496883 10128245 10924581 11800768 12774016 14359552 16213484 18500320 21371033
19273 21371033 24985592 30250411 37997564 49585483 67473212 94143544 129494608
19266A29494608L5391428K6924862K0496861J0395530n980781r312231j614417
19259B05795860j625780m938773j7778706l9091061m2895550k8867784j7620799
19252E2977407j1245992p398298n004216l546134k794672k225733j826833j213631
19244A7721898j209258r05374o64019k80626j3525k57768o36325m68348j62941
19235A3123714n7775r2793O2247K60867K09997l0974j35682J06727J70525L88003
19225A4004856N07233P64599R91958J070207J370063J983225K600062L747126
19217B7039329M981694O892651J0276641J5567978K3961978L5290209M2038556
19210A66049036L6164332K6708368J8857226L159112j3539103q106854k234448
$$ plain form
19266 129494608 164886036 191810898 212307759 222703289 216722508 207410277 205795860
19259 205795860 204170080 199231307 181452601 142361540 99465990 70598206 52977407
19252 52977407 41731415 34333117 29328901 25782767 22988095 20762362 18935529 17721898
19244 17721898 16512640 15607266 14943247 14662621 14649096 14391328 13755003 13286655 13123714
19235 13123714 13065939 12973146 13035393 13296260 13506257 13475283 13339601 13446328 13616853 14004856
19225 14004856 14512089 15276688 16268646 17338853 18708916 20692141 23292203 27039329
19217 27039329 32021023 38913674 49190315 64758293 88720271 124010480 166049036
19210 166049036 202213368 228921736 247778962 250938074 237398971 229292117 227057669
19203B27057669l717404j0234493k9370860m8450756m1381656k6019599j6000171
19196E1882730j0356674o805486m941109l791792k984801k547387k192765j745717
19188A6516999j391215j108566q07970o01983o05790p86555q74479p31692n48587
19179I060162m98343j94942p22661n20584j40896n30336j72464k01194l53658
19170E725084n09709l51228k53208l4282q6268l30199k66829m8923k23552J705
19160C622591p699j95638j60933k77542k47022r5711p1510m8213R6461m08274
19150B206510j75216J27024r1053P6457p1788j96931l10916J29277K39550J9491
19140A952405O1242J50466k1471O2858r5k15071k79811o3607K819j84727l4885
$$ plain form
19203 227057669 223340265 213105772 183734912 135284156 93902500 67882901 51882730
19196 51882730 41526056 34720570 29779461 25987669 23002868 20455481 18262716 16516999
19188 16516999 15125784 14017218 13209248 12607265 12001475 11214920 10340441 9608749 9060162
19179 9060162 8561819 8366877 7644216 7123632 6982736 6452400 6279936 6078742 5725084
19170 5725084 5215375 4864147 4610939 4576657 4490389 4160190 3893361 3844438 3620886 3622591
19160 3622591 3614892 3419254 3258321 2980779 2733757 2638046 2566536 2518323 2614784 2206510
19150 2206510 2031294 2158318 2067265 2143722 2071934 1875003 1564087 1693364 1932914 1952405
19140 1952405 2013647 2164113 2142642 2205500 2205405 1990334 1710523 1646916 1649735 1465008 1430123
19129A430123j7131L4917k68182N6232o2109k36438n6054L7659J87900J14024
19119A220941n717k35980n0249q2524m11139j55008J02731J40039K07762J8955
19109G49811J28916K8512q2371l8000J22233J94218m5798j42539q1993m2430l7200
19098G53359j04739j28569j47757M0225J43252q8270n5889J28148R2917o7948
19088E64729k21113o9131J77833J32280J08388O0250M6727O9120l6471R8369o4507
19077H66474k34838o0762j1197P9748q8282M144k2467l4118k25070J4718L27589
19066F15939k36082j54036K8038l2962K81456J14649j59285o7531p9672j49408
19056A61106j9229q2541J9369J65100J77662j29093q3432K16459J13969J31056
$$ plain form
19129 1430123 1412992 1447909 1179727 1235959 1173850 937412 881358 919017 1106917 1220941
19119 1220941 1215224 979244 928995 846471 435332 280324 383055 523094 730856 749811
19109 749811 878727 907239 824868 786868 909101 1103319 1057521 914982 832989 790559 753359
19098 753359 648620 520051 372294 412519 555771 467501 411612 539760 632677 564729
19088 564729 343616 274485 452318 584598 692986 753236 799963 869083 832612 930981 866474
19077 866474 631636 570874 559677 639425 551143 555287 532820 498702 273632 288350 615939
19066 615939 379857 225821 253859 220897 502353 617002 457717 390186 310514 161106
19056 161106 141877 59336 78705 243805 421467 292374 208942 425401 539370 670426
19046F70426K18547m06362m67424K55913K53003j27906K2494j1636j91297j01554
19036A14204j40729R3801J90868r4956p1119k4108J30422j34675j52588P2994
19026a5886J90731J25691l1228J8032K2463k08131J90831N5466p1472j18694n8568
19015I9235j96713R7348P9417j57423j6316N1691K67459o8927j2123k01079J01552
19004D4121Q0764q7958k53581Q7165J29940R9499J01830l9421J14882r733k11576
18993E5932j71341q7289M0386J53428J94898J15209k079k4196j10612J81590j5634
18982C30292k56379k8303r4557J42572J75840J12501m2638j62309j8738J49039
18972C07320j11962k907O7366J5775M0033j37392K25441J77564k89090j26684
$$ plain form
19046 670426 888973 482611 15187 271100 524103 396197 418691 407055 215758 114204
19036 114204 -26525 67276 258144 163188 92069 67961 198383 63708 -88880 -15886
19026 -15886 174845 300536 269308 287340 309803 101672 292503 347969 276497 157803 99235
19015 99235 -97478 -130 79287 -78136 -94452 -42761 224698 155771 143648 -57431 44121
19004 44121 124885 36927 -216654 -129489 451 99950 201780 162359 277241 267508 55932
18993 55932 -115409 -202698 -162312 -8884 186014 301223 299144 274948 164336 345926 330292
18982 330292 73913 45610 -48947 93625 269465 381966 339328 177019 158281 307320
18972 307320 195358 192451 259817 275592 315625 178233 403674 581238 292148 165464
18962A65464k1109k67141R091P2429o338J83600J54984j80790M4902L13842K28693
18951F97627k02407k92033j14118O3172j16318M2145O5242o535N8826N238J56802
18940C57641R0385k13499j36071P7501M24234K92346k89668k57064k8716J37321
18930D54410K93576N497K09238J21809m2970P9762K21555M55565K4290k89909
18920A532823n65640P9953L5440k14578k07786k61029l86182J96215O6812k14767
18910F1261q1911l839r0363J98440O9757k00065k42151J06362L40622J61105j28959
18899A90259k01299k08770K45572j03448k330K22973M3583J90783J50129J50724
18889F78176j66999l29321Q0528M0398J69839J34819J83633J54212K11140J41308
$$ plain form
18962 165464 144355 -122786 -113695 -41266 -47604 135996 290980 110190 155092 468934 697627
18951 697627 495220 203187 89069 152241 35923 78068 143310 136775 195601 200839 357641
18940 357641 448026 234527 98456 175957 600191 892537 602869 345805 317089 454410
18930 454410 747986 753483 962721 1084530 1041560 1121322 1342877 1798442 1822732 1532823
18920 1532823 967183 1047136 1082576 867998 660212 399183 13001 209216 276028 61261
18910 61261 -20650 -24489 -114852 83588 153345 -46720 -288871 -182509 158113 319218 190259
18899 190259 -11040 -219810 25762 -77686 -80016 142957 186540 377323 527452 678176
18889 678176 511177 181856 262384 302782 472621 607440 791073 945285 1156425 1297733
18879A297733J12077n3663o4390K04480J20669l5533k01181j80213k69921j11904
18869H18154j84220j37960j57059J8638J6257J53021j10347j50846J4552j74914
18859A05276Q8707m4186j82371j02802n5653n8828m1327K31209J48038O3771J25241
18848B77075o2632k26624o3398R5635Q430R5820N983J00271l5887j04675n7911
18837C2087j79223O0651P41k16020J67980K89206J59792r008n9604J01310j19741
18826B28171j98554N3075Q2175m6260L1405k0633q8286K0638r7238j19099P2627
18815h1979P2345j08775l3706J49566K70923K10743K39076k29094j28131J30163
18805D91131K51530L60589K72046O7223r8061m50611k99077k13828n0853J64272
$$ plain form
18879 1297733 1409810 1356147 1291757 1496237 1616906 1581373 1380192 1199979 930058 818154
18869 818154 633934 495974 338915 357553 373810 526831 416484 265638 280190 105276
18859 105276 193983 149797 -32574 -135376 -191029 -249857 -291184 -59975 88063 151834 277075
18848 277075 214443 -12181 -75579 20056 28486 124306 130289 230560 194673 89998 32087
18837 32087 -147136 -86485 -85744 -301764 -133784 155422 315214 306206 246602 347912 228171
18826 228171 29617 82692 164867 118607 150012 129379 41093 61731 -35507 -154606 -81979
18815 -81979 -9634 -118409 -152115 -2549 268374 479117 718193 489099 360968 491131
18805 491131 742661 1103250 1375296 1442519 1344458 893847 594770 380942 330089 494361
18795D94361p3654j44668J28024J19817j37805q8326j73244L9511J52220j07758
18785B08478j41921j90613K42531K01368N0305k66359R842J13475j29215k34478
18775a36587J24194K46746L76656K57699M01559L83660R3653J00834J3j77178
18765A671249k83360k93935j78095n1717J43669J42998J33582N8797J71092j34423
18755A379857k21356o7146r416l7774N851J85228R1448L5951r0449J25558L2085
18744A429837j90952l95241o5646l7408N7827K0052j63643p4348k48122k30746
18734A01610R1034K21884J23426J85444R7434n101L40975K27696J70358k64744
18724A290016j51667J4192N7447j010K9191k38950J40103l91399l08165k17617
$$ plain form
18795 494361 420707 276039 404063 523880 386075 297749 124505 164016 316236 208478
18785 208478 66557 -124056 118475 319843 370148 103789 113631 227106 97891 -136587
18775 -136587 -12393 234353 611009 868708 1270267 1653927 1747580 1848414 1848427 1671249
18765 1671249 1387889 1093954 915859 864142 1007811 1150809 1284391 1343188 1514280 1379857
18755 1379857 1158501 1091355 1081939 1044165 1050016 1235244 1326692 1362643 1272194 1397752 1429837
18744 1429837 1238885 843644 777998 740590 798417 818469 654826 580478 332356 101610
18734 101610 192644 414528 537954 723398 820832 815731 1156706 1384402 1554760 1290016
18724 1290016 1138349 1152541 1209988 1208978 1238169 999219 1139322 747923 439758 222141
18714B22141R0431J59814j65750j13555k65742j51710K00948L40093J79936J08364
18704F04970J7533J31153K67416K16628K1480j14732l09567l18169p4956p6936
18694C64820Q1793J33115o6723P3395o1691k16093j21151j9842k10049j11265
18684a53691J10724m113M2704O7854j66000K66936L74121K4390R5734L28784J36932
18673A124375J55085R1735J93042R3461N2218k62443p4578n8017J1869k86034
18663A040713k94826m1543j94802k85051j89151K49728J32311j76O6256k00878
18653B82581k46394j54146J87226K52560N7898r0704k5381r4610J98939M27369
18643G95338Q2152p6462k49472k39382m7829J46800j25304j10746J45134l6288
$$ plain form
18714 222141 312572 472386 306636 193081 -72661 -224371 -23423 316670 496606 604970
18704 604970 622503 753656 1021072 1237700 1259180 1144448 834881 516712 441756 364820
18694 364820 446613 579728 513005 586400 524709 308616 187465 167623 -42426 -153691
18684 -153691 -42967 -47080 -4376 63478 -102522 164414 538535 562925 658659 987443 1124375
18673 1124375 1279460 1371195 1564237 1657698 1709916 1447473 1372895 1314878 1326747 1040713
18663 1040713 745887 704344 509542 224491 35340 285068 417379 417203 483459 282581
18653 282581 36187 -117959 69267 321827 379725 289021 263640 169030 367969 795338
18643 795338 877490 801028 551556 312174 264345 411145 285841 175095 320229 283941
18633B83941n5692J06203o4756l12915m9829K8780K36745K9109j71182q3331j15515
18622a68442K90478L29069l06789r7308M0225O424J38782J63633m6554j60704
18612A88814k11443J12736K35589j93998J3890J6508J54726L31502O4143k49757
18602D62710k19291j87413k89527l8401m5320Q0957J55587Q422M9k9800J13749
18591A1722J81553m109q1848K55577Q486O2739R9780k81010k97838q5567j14157
18580b44672J07363K16982j38550Q1291K39555J1624k70126j2684L0228J36587
18570A57598N4384p9158M2939J19152M8358n9406j7643k5619r0678j32473j58881
18559a41427J61576J23937J82761j02229k25991R4601J26462J3474J10322O6300
$$ plain form
18633 283941 228249 334452 269696 -43219 -93048 -64268 172477 201586 30404 -52927 -168442
18622 -168442 122036 451105 144316 47008 87233 93657 232439 396072 349518 188814
18612 188814 -22629 90107 325696 131698 145588 162096 316822 648324 712467 462710
18602 462710 243419 56006 -233521 -271922 -317242 -236285 -80698 -72276 -72227 -102027 11722
18591 11722 193275 189166 107318 362895 371381 434120 533900 252890 -44948 -130515 -244672
18580 -244672 -137309 79673 -58877 22414 261969 273593 3467 -9217 21011 157598
18570 157598 211982 132824 175763 294915 343273 283867 266224 240605 149927 17454 -141427
18559 -141427 20149 144086 326847 224618 -1373 93228 219690 233164 343486 409786
18549D09786n7256R6759K9500r0881r182l9555q4074j8496P9173N0465l8201j10481
18537B17557l3242k22920j04921K5182N0859m342K89673l37077n1516J33319M1096
18526C668K76066j41910p6081j34306k8117J70431O737m414K542p6089j51404
18515a52877j05274J05358L06238l6588l8694j10091K01956K09140J36962k70312
18505B45818j67083L9143k09919j42104K28658m0880j56097K1621K38214p5834
18495a8463K18799K78612O8951j20419J5854l721k043J40944j80272k86704p7514
18484C4024l9240J23071L19963o3998k73514N7357L9180J23334L5321M1213j9064
18473C77647O7263J92623P4696O8182J7823j23841j02533k102j74010R6195m3237
$$ plain form
18549 409786 352530 449289 478789 387908 378726 339171 255097 236601 315774 366239 328038 217557
18537 217557 184315 -38605 -143526 -118344 -67485 -71827 217846 -119231 -170747 -37428 3668
18526 3668 279734 137824 61743 -72563 -100680 69751 76488 72074 74616 -1473 -152877
18515 -152877 -258151 -152793 153445 116857 78163 -31928 170028 379168 516130 245818
18505 245818 78735 117878 -92041 -234145 -5487 -46367 -202464 -180843 57371 -18463
18495 -18463 200336 478948 547899 427480 443334 439613 437570 578514 398242 111538 34024
18484 34024 -5216 117855 437818 373820 100306 157663 196843 320177 355498 396711 377647
18473 377647 444910 637533 712229 780411 798234 674393 571860 569758 395748 491943 448706
18462D48706j5388l4784J48133M7676j49682j41617m2728j8280k1863J20009K37426
18451E77608j35657M757l38650j57795n134R4365k37242L2747o7801M22881J82804
18440C72883K22466j59873j67404J216L2153O0889q0718L8862j46745K6499J23113
18429C23341K44214O2105q5010p3364j39353l03748J32072M07936M5413J39138
18419G52744K10028J45648K47114q9529m6303o4947O0200j42684l03457J51702
18409I20516m0575j82820j01089K63599J04565J856j68791M8982K4418j04493
18399G66168k30417j36679K63581J42631K9690M0059o8320J00541K21405M7566
18389A176225J08369K90068O50910P58573J041621J665301J887533J042616O60607
$$ plain form
18462 448706 433318 398534 546667 594343 444661 303044 260316 242036 220173 340182 577608
18451 577608 441951 446708 108058 -49737 -54871 39494 -197748 -165001 -232802 190079 372883
18440 372883 595349 435476 268072 269288 301441 362330 281612 320474 173729 200228 323341
18429 323341 567555 629660 544650 471286 331933 28185 160257 568193 613606 752744
18419 752744 962772 1108420 1355534 1266005 1219702 1154755 1214955 1072271 768814 920516
18409 920516 879941 697121 596032 859631 964196 966052 797261 846243 870661 766168
18399 766168 535751 399072 662653 805284 834974 875033 806713 907254 1128659 1176225
18389 1176225 1284594 1574662 2225572 2984145 4025766 5691067 7578600 8621216 9281823
18380I281823O3192j246986k322814j745365j034856n83808k97684l17885m01059
18371A394558J5394L7933M6328m0856O6093N5106o7470K66806J71001l7919j59192
18360A747782j76113l10920l362J435j85961P8261O4197j17510J69966p5389K96356
18349A488742N9996K37279J49017l0438J0441q634l751J52677M45144J97951M32349
18338C130773N78089Q30699J216409J256955J310890R91647N53918j85298j596229
18329H087853j945438j183739n99569j37158L06525K90001R4842k42169k74103
18320D397045k83447m59656k60545j18208L23409K71444q5015j60316m6008J26903
18310C705606L63989K63228M92884J43788L27464K52101P64134R04797J059906
$$ plain form
18380 9281823 9345015 8098029 5775215 4029850 2994994 2411186 2113502 1795617 1394558
18371 1394558 1409952 1447885 1494213 1453357 1519450 1574556 1507086 1773892 1944893 1906974 1747782
18360 1747782 1571669 1260749 1257387 1258822 1072861 1151122 1215319 1097809 1267775 1192386 1488742
18349 1488742 1548738 1786017 1935034 1904596 1915037 1906403 1902652 2055329 2500473 2698424 3130773
18338 3130773 3708862 4539561 5755970 7012925 8323815 9315462 9869380 9684082 8087853
18329 8087853 6142415 4958676 4359107 4221949 4528474 4818475 4913317 4671148 4397045
18320 4397045 4113598 3653942 3393397 3275189 3598598 3870042 3785027 3624711 3578703 3705606
18310 3705606 4069595 4332823 4825707 4969495 5296959 5549060 6313194 7217991 8277897
18301H277897J289240J362507J815527K330337K777436M061089N697937Q237244
18293C5849214J2872060J9554227K8650097L6686768L3298077K0328048Q803438
18286A96041929j0278512l7765015m5436660l1026233j8765957j1728169p558360
18279C3483023n254685l794801l156294k966681k087127j533443j012974p87034
18271A2889984l71843r2545j25720m46866l68248k87246m29550k29350n6796K24467
18261A0706287L33732M29371N11651O34097P61870J381278J712395K088353K638139
18252B1197173L396884M062643N661850Q113409J2299640J9323079K8267009L5193979
18244A37515666L0484285J8826012Q749227r287370l3611615l5845242j8966016
$$ plain form
18301 8277897 9567137 10929644 12745171 15075508 17852944 21914033 27611970 35849214
18293 35849214 48721274 68275501 96925598 133612366 166910443 187238491 196041929
18286 196041929 185763417 147998402 102561742 71535509 52769552 41041383 33483023
18279 33483023 28228338 24433537 21277243 18310562 16223435 14689992 13677018 12889984
18271 12889984 12518141 12425596 12299876 11853010 11484762 11197516 10767966 10538616 10481820 10706287
18261 10706287 11040019 11469390 11981041 12615138 13377008 14758286 16470681 18559034 21197173
18252 21197173 24594057 28656700 34318550 42431959 54731599 74054678 102321687 137515666
18244 137515666 167999951 186825963 195575190 186287820 152676205 116830963 97864947
18237I7864947l294751R831605K2189603K8300873K1529126J1060503j81984k1410351
18229A65889571m2182319l7371075k3534104j4397388r237925o212847m501420
18222B8452493l542785k992847k668226k116134j300210r80150j038417q25642
18214A2988082p35432k26948k51896l08916n3442K69497K16572j1358j56785m9760
18204A1679614k99557m7462M29494R49751J009288J481437J872314K212071K554424
18195B1841374L773500N253108Q008590J2673927J9845077K7932677L0620888
18188A29949141K1501684J1373129l37711k1606471l9372514l2517281j9853625
18181D9136352j2233219q233033n600789l721388k355840k137602j748659j431748
$$ plain form
18237 97864947 94570196 104401801 126591404 154892277 176421403 187481906 187299922 165889571
18229 165889571 123707252 86336177 62802073 48404685 39166760 32953913 28452493
18222 28452493 24909708 21916861 19248635 17132501 15832291 14852141 13813724 12988082
18214 12988082 12252650 12025702 11773806 11464890 11411448 11680945 11897517 11886159 11729374 11679614
18204 11679614 11380057 11332595 11762089 12711840 13721128 15202565 17074879 19286950 21841374
18195 21841374 25614874 30867982 38876572 51550499 71395576 99328253 129949141
18188 129949141 151450825 162823954 162486243 140879772 101507258 68989977 49136352
18181 49136352 36903133 28670100 23069311 19347923 16992083 14854481 13105822 11674074
18173A1674074j100109r47899q82354p06379n06476n12108l88624m17027l80319
18164E832779m05886k40494n9727j96041j3324N541N9335K67895o69L4179R298
18153E292886J55398l8326J02879k2198k02781m34369k25207p2258L8927k78747
18143D316204j76066j99087J43363o8790r5977K15842J18906J13937J95054L05168
18133D868554L77309M90824L77276L44485M54320K47184M14598O86551Q53358
18124I114459J194075J545170J925263K276223K698897L199247N108058P483229
18116C4544621J1186080J7288412K7092736M2323478N7409201N4471355L3400960
18109B77716843J6164377j1522145n7953045p5902011n1085446k9240369j7601127
$$ plain form
18173 11674074 10573965 9626066 8743712 8037333 7530857 7018749 6630125 6213098 5832779
18164 5832779 5426893 5186399 5126672 4930631 4917307 4922848 4982183 5250078 5249409 5283588 5292886
18153 5292886 5448284 5409958 5512837 5490639 5287858 4853489 4628282 4556024 4594951 4316204
18143 4316204 4140138 3941051 4084414 4015624 3919647 4135489 4254395 4368332 4563386 4868554
18133 4868554 5245863 5736687 6113963 6458448 6912768 7159952 7574550 8261101 9114459
18124 9114459 10308534 11853704 13778967 16055190 18754087 21953334 27061392 34544621
18116 34544621 45730701 63019113 90111849 132435327 189844528 244315883 277716843
18109 277716843 293881220 282359075 224406030 148504019 97418573 68178204 50577077
18102E0577077j1280350p744003n466967m094211l065363k121662j831870j748876
18094A3223775j420129q67424q08510q12432o89024p47514o46725n73861o29305
18085F028851m02697k85959O4879o9749m53428l58669k06169j39379k61112k28490
18075C688078j57337k94518m06711j03793l2629J80477l4217j06000l6148j38908
18065B558294k99360p3855O1975k7552M8710q0134j49118j08087k75906j67356
18055A487611J88192k3346N5731r2427j45398k7688l0005J4799N7881l02332j96763
18044I86255j43506j81302J12689K22530K4087R231P7363j75654m3234L1536Q9698
18033A009693R0587p0749o6667j83465j39721K6047o8404J95275j95715k28520
$$ plain form
18102 50577077 39296727 31552724 26085757 21991546 18926183 16804521 14972651 13223775
18094 13223775 11803646 10936222 10127712 9315280 8626256 7878742 7232017 6658156 6028851
18085 6028851 5626154 5340195 5405074 5335325 4881897 4523228 4317059 4177680 3916568 3688078
18075 3688078 3530741 3236223 2829512 2725719 2693090 2873567 2839350 2733350 2697202 2558294
18065 2558294 2258934 2185079 2247054 2219502 2268212 2188078 2038960 1930873 1654967 1487611
18055 1487611 1675803 1652457 1708188 1615761 1470363 1442675 1412670 1427469 1485350 1183018 986255
18044 986255 842749 661447 774136 996666 1020753 1029984 1107347 931693 888459 919995 1009693
18033 1009693 1100280 1029531 962864 779399 639678 665725 597321 792596 596881 368361
18023C68361j7078q099j28878j38044l6627J82818K10306K84057n7332o1250l3064
18012E65170r9317j23076J62932J03832l73925k45389J66514J56932M557Q827
18002C27057n6486J08817l1233o1397J35740q3922l8733l2837O5070K38975J51728
17991G22779O6867j86940j2883M8624j65202Q6116k10805k16079j95829r0962
17981a54314J38899K86656R1441k82798n2810J77416q9026j98857p9318J66115
17971C404k8741j09945N0335k7748J53440J94917J88659l7930q7944j14919q137
17960A75391n6685m3835K80115q7225J39748J42747m7649Q3881N4105q7878j34946
17949D17769j90587j20771J9499J35904J7562l3088L08697r0356m75172k30357
$$ plain form
18023 368361 351283 343184 214306 76262 39635 222453 432759 716816 659484 598234 565170
18012 565170 465853 342777 505709 609541 235616 -9773 156741 313673 318230 327057
18002 327057 270571 379388 348155 286758 422498 338576 299843 267006 332076 571051 722779
17991 722779 789646 602706 589823 638447 473245 559361 348556 132477 -63352 -154314
17981 -154314 -15415 271241 362682 79884 27074 204490 115464 -83393 -162711 3404
17971 3404 -25337 -135282 -84947 -112695 40745 235662 424321 386391 298447 183528 175391
17960 175391 118706 74871 354986 267761 407509 550256 502607 586488 640593 552715 417769
17949 417769 227182 106411 125910 261814 279376 246288 554985 464629 -10543 -240900
17939b40900M9683K35023o1518j9750J65869O6927j40933J1979j28876J89397
17929A26901M7373o8389k21267K01006p7337J01729L4286j07345J97379k59o6208
17918A67869l9919l6038j3174O4598O2332K275k2964k85391k9751J92088p1605
17907i680j95182J72612J62158k25591M8647k83446j32980J91980K02977J12083
17897D3578J22881J39330j55669j51091J60733N6057j42196j80888q5417j1389
17887b04071K89265J16549n7099Q281j7235J02432r4403K9268j46756j05696j45115
17876b24580J701J98647J59495M4202p1402j26009l0705j48795m9073K20257J51788
17865A25526r3827k10106J56382J93937o3044R2487K56049j40355j36921m9535
$$ plain form
17939 -240900 -191217 43806 -17712 -37462 128407 195334 54401 66380 -62496 126901
17929 126901 174274 105885 -115382 85624 8287 110016 144302 36957 234336 234077 167869
17918 167869 127950 91912 78738 143336 205668 207943 184979 -100412 -130163 61925 -9680
17907 -9680 -204862 -32250 129908 -95683 -47036 -330482 -463462 -271482 -68505 43578
17897 43578 166459 305789 150120 -971 159762 215819 73623 -107265 -192682 -204071
17887 -204071 85194 201743 144644 152925 135690 238122 143719 172987 26231 -79465 -224580
17876 -224580 -222879 -24232 135263 179465 108063 -17946 -48651 -197446 -246519 -26262 125526
17865 125526 31699 -178407 -22025 171912 108868 201355 457404 317049 180128 130593
17855A30593K27935J60072j21657j74542J31223J8461n5976j24725j24220k68552
17845b01388J34482J59129J71582j8107j84299q0403P0725Q9045j50005p174j3045
17834b9458L346j01612J86814J44065o8390l1793K6303j88161q7894J96387K14922
17823B64529j23966p1395j05418p5748j1680j40375J85313J07748j36349j9532
17813a26873n816P4687L2351J05477k21282j38347q382k03789p9303K89111N3309
17802b28857k18435l0322j231J76851M25479R2009j93340K6781k36293P9603R3817
17791a3938m4681K47899M4000r2549m7719k72805O6770J92880O3782k256k85164
17780a43781k03439J04152K22656J80697K35936j95739p2896K07118K03216K32667
$$ plain form
17855 130593 358528 518600 396943 222401 353624 372085 316109 191384 67164 -201388
17845 -201388 -66906 92223 263805 245698 61399 -19004 51721 140766 -9239 -16413 -29458
17834 -29458 -26112 -127724 59090 203155 134765 102972 129275 -58886 -146780 49607 264529
17823 264529 140563 69168 -36250 -111998 -123678 -264053 -78740 29008 -107341 -126873
17813 -126873 -132689 -58002 -25651 79826 -141456 -279803 -288185 -491974 -571277 -282166 -228857
17802 -228857 -447292 -477614 -478845 -301994 123485 215494 22154 48935 -187358 -107755 -13938
17791 -13938 -58619 189280 233280 140731 93012 -179793 -113023 79857 143639 141383 -143781
17780 -143781 -347220 -243068 -20412 160285 396221 200482 127586 334704 537920 770587
17770G70587R0098n8085l893J21901P3448k62213k84088k10714l6394N8567j9092
17759B40122j23547j43076r2398Q1943K29816p7563j74944q6892j32888j856J14957
17748a66326K0435l1459M1086K21665k3476j29319k3684m1169N9159J0081K6781
17737c6226J33857L0031p9243o1207j60129P5327K15553j55904m385J36103K50835
17726C44612P3661N4121Q5981J50252L93944J40197l8509m00254k66494J67202
17716G04713J26690Q3405J9976L20774J63135k03433m13836k02373k12176Q245
17706C95120q5574k01867r5094j57722N2249J22027J07801J90043q2586j51986
17696I2411m2627j20034K12396K2010q4741K06862J42303j62031j63364j89041
$$ plain form
17770 770587 860685 802600 798707 920608 994056 731843 447755 237041 200647 259214 240122
17759 240122 116575 -26501 -118899 -36956 192860 115297 -59647 -146539 -279427 -281283 -166326
17748 -166326 -145891 -177350 -136264 85401 61925 -67394 -91078 -132247 -73088 -63007 -36226
17737 -36226 97631 127662 48419 -12788 -172917 -97590 117963 -37941 -42326 93777 344612
17726 344612 418273 472394 558375 708627 1102571 1242768 1204259 804005 537511 704713
17716 704713 831403 914808 934784 1255558 1418693 1215260 801424 599051 386875 395120
17706 395120 309546 107679 12585 -145137 -92888 29139 136940 326983 244397 92411
17696 92411 49784 -70250 142146 164156 79415 286277 428580 266549 103185 -85856
17686h5856q0090N6240O1619n804j48640m6231J94488J24176k20339M7159R4959
17675h319P4470J96871q1942j98912k02397J32591N55220K99525j62405j484o3395
17664E39823n5407R1702j07446k49138k6965Q8638n4706J20919M7671j13172k29423
17653E2496M011J01846k0625j41265L71044J18259j69642j17650j83439J2238
17643B7273J91591l4620r9317j46019p5944K2724L28620J83497q8426k74144j01308
17632f6073j14327j17051N9685J18608J56793m7704j12138o6899Q1174L12957
17622B05025k8214k01613j31384j49752K01808J08542J8696J43458J95098j08152
17612B53512k11K00246j28212j62627k85064m8509J95301K37526J03594J30605
$$ plain form
17686 -85856 -165946 -109706 -48087 -53891 -202531 -248762 -54274 69902 -150437 -103278 -8319
17675 -8319 66151 263022 181080 -17832 -220229 -87638 467582 767107 604702 603218 539823
17664 539823 484416 576118 468672 219534 192569 281207 226501 347420 395091 281919 52496
17653 52496 56507 158353 137728 -3537 367507 485766 316124 198474 15035 27273
17643 27273 218864 184244 84927 -61092 -137036 -114312 214308 397805 309379 35235 -66073
17632 -66073 -180400 -297451 -237766 -119158 37635 -10069 -122207 -189106 -107932 205025
17622 205025 176811 -24802 -156186 -305938 -104130 4412 23108 166566 361664 253512
17612 253512 253301 453547 325335 162708 -122356 -170865 24436 261962 365556 496161
17602D96161m1310m244j87378n8316q4638j82978j8286n0792J85206q3983K08433
17591A77875O5129k714j43757J30591p9304j96845P4694o8650L676L130j18843
17580a55018K3283R0578N5107m7070m3848l40168p3438l9850P8792J68493K7723
17569b55416j94130m2840K08408K21960L0427m8713N8189L4958j19868J96360
17559H9335J21565m2748J03996j1623J05826j6261J29156o6417j30457j19204
17549A63168j51642j79424q6125J37408J65450J82201p7417j16348P9123N1889
17539A68283j85053J9830J60930J68016j50855j78933K16793K9532K4203l66048
17529i3302k98437L4808L2390J77040J29737J85694o9109j13019j12737M5823
$$ plain form
17602 496161 454851 450607 263229 204913 120275 -62703 -80989 -131781 53425 -30558 177875
17591 177875 243004 240290 96533 227124 147820 -49025 25669 -42981 -39305 -36175 -155018
17580 -155018 -131735 -41157 13950 -33120 -76968 -417136 -490574 -530424 -451632 -283139 -255416
17569 -255416 -449546 -492386 -283978 -62018 -31591 -80304 -22115 12843 -107025 89335
17559 89335 210900 168152 272148 260525 366351 350090 479246 412829 282372 163168
17549 163168 11526 -167898 -254023 -116615 48835 231036 153619 37271 116394 168283
17539 168283 -16770 3060 163990 332006 181151 2218 219011 248543 272746 -93302
17529 -93302 -391739 -356931 -324541 -147501 -17764 167930 98821 -14198 -126935 -81112
17519h1112P8508M1186J84660J53906j93236j37335j16151j39330j35664J66957
17509a77611R0043M6859J21806l0388J64622p0507l00907J22575L4898n830J74623
17498A70183j05646R4816j0345J02837P7838k26908j19997j42358J01760J22275
17488F4455j41445R5883O1088m281R5203M6072k5092J4157Q3651n468k76425q4459
17476g6661K5188j35044l4875L29372R3370n0106k29249q061l653J46449O8681
17465A25411O1432o0213M7441o4583j18198j03563j928J35576j86030M5652O316
17454a12687N5696P7708p2146O5282Q9688P0317Q0448M75828M27812J56830J74960
17443A489736J65080j51437k81242n34089k37714j52369j36037j11862L4595j7172
$$ plain form
17519 -81112 -2604 38582 223242 377148 183912 46577 -69574 -208904 -344568 -177611
17509 -177611 -87568 -40709 81097 50709 215331 144824 -156083 -33508 1390 -4440 170183
17498 170183 64537 159353 149008 251845 329683 102775 -17222 -159580 -57820 64455
17488 64455 -76990 18893 79981 75700 170903 216975 191883 206040 289691 284223 7798 -76661
17476 -76661 -51473 -186517 -221392 107980 201350 151244 -78005 -86066 -89719 56730 125411
17465 125411 186843 126630 174071 109488 -8710 -112273 -114201 21375 -164655 -119003 -112687
17454 -112687 -56991 20717 -51429 13853 103541 173858 254306 730134 1157946 1314776 1489736
17443 1489736 1654816 1503379 1222137 688048 450334 297965 161928 50066 84661 67489
17433F7489J28207P361j4728n5480J24294k2689J47062r5011k12591r7650q4487
17422a08223J50002O57j46380r0084o2464j66697K54588K58794o1472J5753J6448
17411F0922j7354o2205L0888J3310j00004l1846p8485J50092K49126m0581k04027
17400c0164j72633j99829m2777J7204j04028N8990L8964L02404O0611j41917M1904
17389a71271K0014N5580J48805j04890j07603M5821K21249L27943J68114p8333
17379E25429k52807k22714q6708K61596L23538K9881k51799k00260j86485m9727
17369a10056n3805m67785j58773K98348L21959J21748k12017l4757J93240P0265
17359c1633Q8621j12708k8880j26449l0696l6920M9977L37341j04223j4580J55989
$$ plain form
17433 67489 195696 203057 188329 132849 257143 234454 381516 286505 73914 -23736 -108223
17422 -108223 41779 42436 -103944 -194028 -256492 -423189 -168601 90193 28721 44474 60922
17411 60922 43568 -18637 12251 25561 -74443 -106289 -184774 -34682 214444 173863 -30164
17400 -30164 -202797 -402626 -445403 -428199 -532227 -473237 -434273 -131869 -71258 -213175 -171271
17389 -171271 -151257 -95677 53128 -51762 -159365 -113544 107705 435648 603762 525429
17379 525429 272622 49908 -36800 224796 548334 578215 326416 126156 -60329 -110056
17369 -110056 -163861 -631646 -790419 -492071 -170112 -48364 -260381 -295138 -101898 -31633
17359 -31633 56988 -55720 -84600 -211049 -241745 -278665 -228688 108653 4430 -10150 145839
17348A45839L5476j11707L7329O6200l25251k13584J15325J24305M8754j1089
17338h8403j67918k79287L1458J64949K16830Q8186m954o0850N6053m7586j31455
17327b22977O9042j48759R2025L3290j741L13989K6444o31n1335n4384K44776
17316B99739J67687j62755j57610k43315r592j7843m6661j3885J58591J49585
17306A23941j4164k53105j98916M5171J53653m5790L508J52328K73633j52160
17296H8099l62829j90376o3341o5712K32127J713J57809Q5844l73640o8583N0871
17285e08018j77L22851J02347o2716j20299M0322L53562Q3428j73647r7600m5949
17274a05896K9927j58111n5458L4151J7320J03213k7184n1768M7977j1210p12
$$ plain form
17348 145839 181315 69608 106937 173137 -152114 -365698 -250373 -126068 -77314 -88403
17338 -88403 -256321 -535608 -504150 -339201 -122371 -34185 -39139 -99989 -43936 -91522 -222977
17327 -222977 -153935 -302694 -210669 -177379 -179120 134869 161313 160682 109347 54963 299739
17316 299739 467426 304671 147061 -96254 -105846 -123689 -170350 -184235 -25644 123941
17306 123941 109777 -143328 -342244 -297073 -143420 -189210 -185702 -33374 240259 88099
17296 88099 -274730 -465106 -528447 -594159 -362032 -360319 -202510 -116666 -490306 -558889 -508018
17285 -508018 -508195 -185344 -82997 -145713 -266012 -225690 127872 211300 37653 -59947 -105896
17274 -105896 -75969 -234080 -289538 -255387 -238067 -134854 -162038 -213806 -165829 -177039 -177751
17263a77751j77559n1071L7520J34623J37667l0222k25695o1836J71823P6128
17253a66373m1340j78046L8827o8226J18494Q4058J35487J24989j4086r5285j09278
17242a70779K20560Q0817n4589n3616Q7621P6911J73206k61462k63867j10768
17232b75966J41802m1497l04411j81282P9084o8150M6063N7669N21074K47570
17222B21956O4657j25135O698j79546k61860L5359o6096J14254j92613l4393r7799
17211e14518n2614J33422K83203O4550j06185p2424K28048O0481k02497j60568
17201c39102J05397J05020l2738O1883j30556j17615M4211R5383J13156l02818
17191c97779j7164J41384O5349K0340K9856j13480o7912j0363K35941o285j11890
$$ plain form
17263 -177751 -355310 -406381 -368861 -234238 -96571 -126793 -352488 -414324 -242501 -166373
17253 -166373 -207713 -385759 -346932 -415158 -296664 -212606 -77119 47870 33784 -61501 -170779
17242 -170779 49781 130598 76009 22393 110014 186925 360131 98669 -165198 -275966
17232 -275966 -134164 -175661 -480072 -661354 -582270 -650420 -604357 -546688 -25614 221956
17222 221956 286613 161478 168176 -11370 -273230 -237871 -303967 -189713 -382326 -416719 -514518
17211 -514518 -567132 -433710 -150507 -85957 -192142 -264566 -36518 23963 -178534 -339102
17201 -339102 -233705 -128685 -161423 -99540 -230096 -347711 -303500 -208117 -94961 -397779
17191 -397779 -414943 -273559 -208210 -187870 -158014 -271494 -339406 -349769 -113828 -120113 -232003
17180b32003O3129K29014O2129j88097o0469J4692k73610j35084J55055q3232
17170d48476M5442J04832N4532K9312J58816j5691l039m0535j11146L20543j1845
17159H2745j20925l4678k28757n6351K14547J99527n0047K597j03191K10970K08733
17148C25170M4940k05749k02356l0811j03303K6690J4935r3006J49285o8479j28651
17137b71335J65528K65322N2708r9047k25016j56660k23098p7187K1891K49162
17127b97732n3962p0867L6791N1451M19534J93705Q0752O3533J9493j68489k11204
17116F3005j18400L978J03842l8303k3108p4757j66216J73992L07532J23261O902
17105C61728k26497k25865j57601r7261J28359J11371J24501Q4428j13182k5303
$$ plain form
17180 -232003 -168874 60140 122269 -65828 -126297 -111605 -385215 -520299 -365244 -448476
17170 -448476 -403034 -298202 -243670 -214358 -55542 -71233 -74272 -114807 -225953 94590 82745
17159 82745 -38180 -72858 -301615 -357966 -143419 56108 6061 8658 -94533 116437 325170
17148 325170 370110 164361 -37995 -68806 -172109 -145419 -130484 -223490 -74205 -142684 -271335
17137 -271335 -105807 159515 212223 113176 -111840 -268500 -491598 -568785 -546894 -297732
17127 -297732 -351694 -422561 -385770 -334319 85215 278920 359672 423205 442698 274209 63005
17116 63005 -55395 -51417 52425 14122 -8986 -83743 -249959 -75967 231565 354826 361728
17105 361728 135231 -90634 -248235 -345496 -217137 -105766 18735 103163 -10019 -35322
17095c5322R7027O2371j87723j32997j2807r5048j0259L59470j0550j99239J16642
17084d8435P5701j48779p9418O1697j9120l8416m8593K87845K58846P7198n1672
17073C26854l2485o0906p7177K4063j6711n4098p8367j84439j0848J56817P6262
17062F8965j08369j21423R2343K4798J49152j31395k36191j5639j3927j11258
17052d02944J4828M10604J8718j79733k12615J51765J38279n3751K14913O8474
17042A68538L4208j90041o3468N8981q9874J24813n3837l7500J97071K37670q3538
17031C03023k17286l05833J91653J33548K38720Q2352p705j88117k83343R5838
17021D2850J94151P5411j83331j18516l2774L96394L6380R8323j2633J4819P9758
$$ plain form
17095 -35322 61705 124076 -63647 -196644 -209451 -304499 -314758 44712 34162 -165077 -48435
17084 -48435 27266 -121513 -200931 -139234 -158354 -196770 -245363 42482 301328 378526 326854
17073 326854 294369 233463 156286 180349 163638 109540 31173 -153266 -164114 -7297 68965
17062 68965 -39404 -160827 -68484 -43686 105466 -25929 -262120 -277759 -291686 -402944
17052 -402944 -388116 22488 41206 -138527 -351142 -199377 -61098 -114849 100064 168538
17042 168538 202746 12705 -50763 8218 -81656 43157 -10680 -48180 148891 386561 303023
17031 303023 85737 -220096 -28443 105105 343825 426177 418472 230355 -52988 42850
17021 42850 237001 312412 129081 10565 -22209 374185 410565 508888 496255 511074 590832
17010E90832j0951j19815j52116j91921k61379o617o1724q5819p9746O6078L9030
16999b74148J04442k4658j1140R0710R0076J69825J6066n5783j98167j99983J94609
16988i8151L4373p7960J85081k414r4116J13814O4045j40893j04636J40221Q6996
16977A06360p0466k8478O5242k76710l8130R6643K17350j82489j38290L33698
16967H4730P711j7400O9445J8738k69111o7398n8102k4385K17225K27317j1871
16956A76899q0884r4962j5933K67530n9025j62264Q5851J86517l9626k02888m015
16945E7200l9054J24422P3639j40460l5049J75643J15451j04356j89584j39343
16935a01491P9759R1408o4190j36138P6906K4205K56154J25208j2934j36098N979
$$ plain form
17010 590832 579881 460066 307950 116029 -145350 -151967 -213691 -299510 -379256 -313178 -274148
16999 -274148 -169706 -194364 -205504 -114794 -24718 145107 161173 105390 -92777 -292760 -98151
16988 -98151 -63778 -141738 43343 40929 -53187 60627 124672 -16221 -120857 19364 106360
16977 106360 35894 7416 72658 -204052 -242182 -145539 71811 -110678 -248968 84730
16967 84730 92441 75041 144486 163224 -105887 -173285 -231387 -255772 -38547 188770 176899
16956 176899 96015 1053 -14880 252650 193625 31361 117212 303729 264103 61215 57200
16945 57200 18146 142568 216207 75747 40698 216341 331792 227436 37852 -101491
16935 -101491 -21732 69676 5486 -130652 -53746 -29541 226613 351821 338887 202789 208768
16924B08768N3866m7991k30388k44334k85744q1689K42153L1067O4022J12386
16914a77884K58298l4116J29283o3733o5019k40854P6548N3964k79756J5410K05146
16903a22713J15452J05741P1268n2270r8456J06479j8776r0646J00831J1171m8749
16892G9332r7722J0395K81557n7991k42888k36742k25710K58048K93018L6852
16882I8149n4513k1851J0466k64714j02563K246J86341J35748K5813J14401l22551
16871a93028k84372Q6870R4115j75601K80564J29055l6630k24753j27589l4259
16861d85628L1013K64541P6646L4812K4069R6320j04611j4153k5763o4235Q4826
16850h2163J17196J47484q528j45941o4073J18161l18960l17060K16834K99229
$$ plain form
16924 208768 262634 214643 -15745 -260079 -545823 -627512 -385359 -354292 -290270 -177884
16914 -177884 80414 46298 175581 111848 46829 -194025 -117477 -63513 -343269 -327859 -122713
16903 -122713 -7261 98480 169748 117478 19022 125501 106725 16079 116910 128081 79332
16892 79332 -18390 -7995 273562 215571 -27317 -264059 -489769 -231721 61297 98149
16882 98149 43636 21785 32251 -232463 -335026 -332780 -146439 -10691 15122 129523 -193028
16871 -193028 -477400 -390530 -296415 -472016 -191452 -62397 -99027 -323780 -451369 -485628
16861 -485628 -454615 -190074 -113428 -78616 -54547 41773 -62838 -76991 -102754 -166989 -82163
16850 -82163 35033 182517 173989 28048 -36025 82136 -236824 -553884 -337050 -37821
16840c7821J01040N0242j88400l24290L0216L16692L40213J11579j32781j93760
16830G2930j06025L4617q1015j02590N9714L77313K00220k25230j28928K09114
16820C10120r1951j50086o6542R8096k1970Q5730j3625O3339J73506Q3124k47121
16809B22620l14802N279J21224L065k61732M2863J20863K66J3560O0801K88152
16798C02159J63158k75116r9341j16618l36702n5229L1981K59900j79479k34173
16788e39460K0564J02245l8852j67344J04353L47751L7823o9553J75988o8830
16778i5315j35j04113j7209J10176L3778J9759j33326J25177J91786r022r8408
16767B3148j73869j73917L06364Q1587l9499j34574j25406J94570K77583L5771
$$ plain form
16840 -37821 63219 113461 -74939 -399229 -369013 -52321 287892 399471 266690 72930
16830 72930 -33095 1522 -79493 -182083 -122369 254944 455164 229934 101006 310120
16820 310120 218169 68083 1541 99637 77667 163397 149772 213111 386617 469741 222620
16809 222620 -92182 -86903 34321 37386 -224346 -181483 -60620 -60354 -46794 14007 302159
16798 302159 465317 190201 90860 -25758 -362460 -417689 -385708 -125808 -305287 -539460
16788 -539460 -518896 -416651 -455503 -622847 -518494 -170743 -132920 -202473 -26485 -95315
16778 -95315 -95450 -199563 -216772 -106596 -72818 -53059 -186385 -61208 130578 121556 23148
16767 23148 -150721 -324638 -18274 63313 23814 -110760 -236166 -41596 235987 271758
16757B71758k60181l38044p139M840J28819L6015j60687O72L71278L4358k6889
16746E4800k17282j48057J40862K3731L4796j18163L0196O7554k12636p6209O5768
16735c54640R5983J9406J05968p8725k26309J86575n5734J33862j77861N5160
16725b96315J50793L27831j06894k10226l10755J09453R8295N9164o3978J9427
16715b23205O6451j52581J60225L04197j49878k47324J0692M48817K73323k19750
16705B70967j44551n8720k9870r12P0964J24101j65320k02892j0867K38534p864
16694H3570k38527L2808J92931L4545k45491K1381j36907O28L4920j0521K3920
16683b06743R4466M286k06394J61828N0524l4590P055N0824J09291l9785N43O5179
$$ plain form
16757 271758 11577 -326467 -333606 -328766 -199947 -163932 -324619 -323947 47331 81689 54800
16746 54800 -162482 -310539 -169677 -145946 -111150 -229313 -199117 -131563 -344199 -420408 -354640
16735 -354640 -258657 -239251 -133283 -212008 -438317 -251742 -307476 -173614 -351475 -296315
16725 -296315 -145522 182309 75415 -134811 -445566 -336113 -237818 -178654 -242632 -223205
16715 -223205 -156754 -309335 -149110 155087 5209 -242115 -231423 217394 490717 270967
16705 270967 126416 67696 37826 36914 107878 231979 66659 -136233 -147100 91434 83570
16694 83570 -154957 -122149 70782 105327 -140164 -118783 -255690 -255062 -220142 -230663 -206743
16683 -206743 -112277 -107991 -314385 -152557 -102033 -136623 -129568 -78744 30547 -9238 -8695 56484
16671E6484k7084m3032r266q2543j42716k47093p3986j3443R4718l2817P739L65628
16659a47411j2947N0980J38127j14317j47301M3714J39252k53390k76247L5133
16649e44407J23005m7205o6496k5800M1464K17177K51428K6067k99420j6248J0018
16638c30417R9304J06665r1779J14590K07044O8835L6834k0729k59579j24324
16628a93556J31340K07622K5131q3911P5387J39756q3383j08510k37933j98788
16618c26845J40168p590J76704K8977j27201k98151o0838J41702J91843M4073
16608i7158q0566J01223j61216j34183J25233M706J08960Q8521n3952j01521O6598
16597a33355m8072Q7296K48420j40616N9605K87920J24342J38411k29287m54204
$$ plain form
16671 56484 29400 -13632 -22898 -105441 -248157 -495250 -569236 -582679 -487961 -520778 -513039 -147411
16659 -147411 -160358 -109378 28749 -85568 -232869 -189155 -49903 -303293 -579540 -544407
16649 -544407 -421402 -468607 -535103 -560903 -519439 -302262 -50834 -24767 -324187 -340435 -330417
16638 -330417 -231113 -124448 -216227 -101637 105407 174242 211076 190347 -69232 -193556
16628 -193556 -62216 145406 170537 86626 162013 301769 218386 109876 -128057 -326845
16618 -326845 -186677 -194267 -17563 11414 -115787 -413938 -474776 -333074 -141231 -97158
16608 -97158 -177724 -76501 -237717 -371900 -246667 -241961 -133001 -44480 -98432 -199953 -133355
16597 -133355 -181427 -94131 154289 13673 73278 361198 485540 623951 394664 -59540
16587e9540K6108k09373k51101r4884m397K75585J48072k0509k8531Q6422J71162
16576C9014p5434j16905J27622J87152J14764l20634k08748j67744J14735J53942
16566a52236K30792O9565j35064r3631r0546j02499j88038K46710N8998L2310
16556a23639J02245r5044r9761j86220K00886J1482n0118K00616r7080o3911k5171
16545b25715p2394K3216J27818J18219k6187p6742j06069J77385o3341l37783
16535d61593l2048J59854J05705m6388j8617R7725J85975o1119q2515O282k43271
16524c90010j99091L89372L65442K0387m9638k60957j65772o5388M1821k4206
16514c38040J02631J03050N9818r7518J87897Q5069M6570N9908o6116j78048r66
$$ plain form
16587 -59540 -33432 -242805 -493906 -588790 -593187 -317602 -169530 -190039 -218570 -132148 39014
16576 39014 -36420 -153325 -25703 161449 276213 -44421 -253169 -420913 -306178 -152236
16566 -152236 78556 148121 13057 -80574 -171120 -273619 -461657 -214947 -155949 -123639
16556 -123639 -21394 -116438 -216199 -402419 -201533 -190051 -240169 -39553 -136633 -200544 -225715
16545 -225715 -298109 -274893 -147075 -28856 -55043 -131785 -237854 -60469 -123810 -461593
16535 -461593 -493641 -333787 -228082 -274470 -293087 -195362 -9387 -70506 -153021 -146739 -390010
16524 -390010 -589101 -199729 165713 186100 136462 -124495 -290267 -355655 -313834 -338040
16514 -338040 -235409 -132359 -72541 -170059 17838 102907 149477 209385 143269 -34779 -35745
16503c5745Q9449o2337K42841L3777o0808N2043j38826J10917k6305j26303j26893
16492d8190J37848O7213K28644P7514l01064O1745p1193j07948j28746j8877l33869
16481d36923J7381j7792N5646M07188J35001J36778j04520k91753n9682J78166
16471A9490K61520R5756q9788l3294j11661j43629N228p490K3843K2047m0568
16460A454k34354n5139L20000O7833J8352j46697j52824J03682J86277j95289
16450h6705N3714N9787N9052O473K11846K45450k18108k81125r3870j00909m3668
16439a88063N0866J89509J18697m3243k64766L5297P2586j60145R5991K17085
16429A23814J1118k3008j47764R1145J32507l32709l0367O3308K8100N6939M9139
$$ plain form
16503 -35745 53704 -8633 234208 267985 207177 259220 120394 231311 205006 78703 -48190
16492 -48190 89658 156871 385515 463029 161965 223710 152517 44569 -84177 -103054 -436923
16481 -436923 -419542 -437334 -381688 25500 160501 297279 192759 -98994 -158676 19490
16471 19490 281010 376766 286978 253684 142023 -1606 3622 -3868 19975 42022 1454
16460 1454 -232900 -288039 31961 99794 118146 -28551 -181375 -77693 108584 -86705
16450 -86705 -32991 26796 85848 92321 304167 549617 331509 50384 -43486 -144395 -188063
16439 -188063 -137197 52312 171009 127766 -137000 -101703 -29117 -189262 -93271 123814
16429 123814 134932 111924 -35840 55305 187812 -144897 -175264 -111956 -83856 -26917 22222
16418B2222J01010J14822j66384k95357Q21K50005k9934R247m1417J4288l0079
16407e0756j16164m0059J1J41281K05727O6940l7487m3878k5886K21787o3233
16396B58283j05661l96352J09778K65274n4817J81035R1273O9164j66757k93647
16386d2427k05942P8017K60250M2373J34925N4519k93800k7973J61670k38088
16376g6476r2550J92373l2292k3775n0070N4652J20740j29070l26941p8721R2030
16365c50100J65562K54895J72329l05016m0860o9810q6856j6803L2190J58370
16355h6099K32041k9497k53199J55713L8478O00m0662k70743J30791Q3505M29119
16344C90047l5680J5277J5312l86683j31881k95231j5948K59271J61884J22196
$$ plain form
16418 22222 123232 238054 71670 -223687 -222866 27139 -2795 6452 -34965 -20677 -50756
16407 -50756 -166920 -206979 -206968 -65687 140040 206980 169493 125615 99729 321516 258283
16396 258283 152622 -243730 -133952 131322 76505 257540 348813 417977 251220 -42427
16386 -42427 -248369 -170352 89898 132271 267196 321715 27915 -58 161612 -76476
16376 -76476 -169026 23347 -8945 -32720 -82790 -28138 92602 -36468 -363409 -442130 -350100
16365 -350100 -184538 70357 242686 -62330 -103190 -173000 -259856 -276659 -244469 -86099
16355 -86099 145942 116445 -136754 18959 57437 58037 17375 -253368 -122577 -39072 390047
16344 390047 354367 369644 384956 -1727 -133608 -428839 -444787 -185516 -23632 98564
16334I8564P9078k86384k85120o22K05782K46605J56252k76340j43169L99244
16324A93890J90058j45015k16690l6455k61028K0762M7850M386K31193J84930
16314B13881k55209k16693J92170j9311m3773q4964p7679K59050J21874n3343
16304C6003L144j22817N4299j27838R2601K17880k45966j98056J65667L45669
16294B20586m3286l82585j51273j26207M4775L08687L65763J98688j26797j21198
16284A87153N7850N9769J39976l30715l1584J1470k1974R2873n983j93808n30248
16273e65221o6108L13285Q0095J75702N4399k21936j50614J31301j96100J24987
16263c20210p7079j17218J97914K08025J15230j4173l08447j40456K27504J46516
$$ plain form
16334 98564 177642 -108742 -393862 -394484 -188702 57903 214155 -62185 -205354 193890
16324 193890 383948 238933 22243 -14212 -275240 -254478 -206628 -202242 28951 213881
16314 213881 -41328 -258021 -65851 -85162 -128935 -213899 -291578 -32528 89346 36003
16304 36003 39147 -83670 -29371 -157209 -64608 153272 -92694 -290750 -125083 220586
16294 220586 177300 -205285 -356558 -482765 -437990 -129303 236460 435148 308351 187153
16284 187153 245003 304772 444748 114033 82449 93919 71945 164818 158835 -34973 -565221
16273 -565221 -631329 -318044 -237949 -62247 -7848 -229784 -380398 -249097 -445197 -320210
16263 -320210 -397289 -514507 -316593 -108568 6662 -7511 -315958 -456414 -228910 -82394
16253h2394j81810P3451K94921K17177j2247k05744j64803m0348N1110K47058
16243A96371J79347j93080j45036r5515J7377Q8437K57450M027r1849m8074j39530
16232B9925j31414j95372N3240k6840K32015K63678n8618m9842L0779J58720L5830
16221C42101k29128m18379j45316Q9080M32567K81575k23330O8101R3548j94153
16211I6666j59034J86939K12887j26034r6566j3657k89019j90459K80918J73139
16201G5780P6261j8865m05924m2667N1568J06631J44292L2327M1782J09006K1373
16190A91564k28523o7308J76639J68100j88796j66871j65451o0812J0766j71949
16180e02641K21649M75899K2392k90773j86976P0147K7795O5406j96852k36158
$$ plain form
16253 -82394 -264204 -190753 104168 321345 309098 103354 -61449 -101797 -50687 196371
16243 196371 375718 182638 37602 -57913 -40536 47901 305351 309378 217529 169455 29925
16232 29925 -101489 -296861 -243621 -270461 -38446 225232 166614 116772 147551 306271 342101
16221 342101 112973 -305406 -450722 -361642 70925 352500 129170 197271 290819 96666
16211 96666 -62368 124571 337458 211424 114858 101201 -187818 -378277 -97359 75780
16201 75780 152041 133176 -272748 -315415 -263847 -157216 -12924 19403 61185 170191 191564
16190 191564 -36959 -104267 72372 240472 51676 -115195 -280646 -341458 -330692 -502641
16180 -502641 -280992 194907 217299 -73474 -260450 -190303 -162508 -97102 -293954 -530112
16170e30112L99458K96607j14255j03899k35938Q7588O7933R1139K82240J07399
16160C48160m0402j23856k89318l8004K25806l293N2853k0856j54770J44998J97410
16149B98728j08703j47693p0461j75869n2863J48247j8233M1541K42434j49849
16139G279j21088P3635P988K00512K0312j87565j25878J65278M857j2627Q2130
16128A14833M420j85151j08819J48282J78920K0558j44207R5759j75241p9638
16118a30284o1347O3646J00619J50147m5573l00227j12182K26766R4453Q9794
16108G5812J420o9228N0735l7774j21433K2605k00428k47866K20845N2153J25629
16097a27530K18203K65992k340k27697l37584J97124P5089k03354k59641r7317
$$ plain form
16170 -530112 -130654 165953 51698 -52201 -288139 -200551 -132618 -41479 240761 348160
16160 348160 307758 183902 -105416 -143420 82386 79093 131946 111090 -43680 101318 298728
16149 298728 190025 42332 -28129 -203998 -256861 -108614 -126847 -85306 157128 7279
16139 7279 -113809 -40174 -32186 168326 188638 1073 -124805 40473 45330 32703 114833
16128 114833 119253 -65898 -174717 -26435 152485 173043 28836 124595 -50646 -130284
16118 -130284 -191631 -127985 -27366 122781 77208 -223019 -335201 -108435 -13982 75812
16108 75812 77232 8004 58739 20965 -100468 -77863 -278291 -526157 -305312 -253159 -127530
16097 -127530 90673 356665 354325 126628 -210956 -13832 61257 -142097 -401738 -499055
16087d99055n9178K02499J28429J22846K8017j39834p293K4285l0547n6418J13491
16076a72758J21600j1235j29621j21034J43848J14831o9854K38958L00550J67715
16066E83000o3574j75034l9932j94466Q328n9265J0663p0827j24712J70213J65502
16055B09896L2870m9591k3031K4811k7566n0847J7805p0548q9280j07581Q6636
16044d6426J68369K3777m2550l18164j10726K34909N4732j64373j2828K1717J65056
16033b6507l13306l160K48679N2687J43887j8251o9592N6474L7132N2666k03033
16022d2324m25731n5558J44679J85487M30093M0802n8016L0000L0728j06757P8591
16011B51994J40956j01596k11576j25732m6681m7088J35854J38017K46735N9088
$$ plain form
16087 -499055 -558233 -355734 -227305 -104459 -76442 -216276 -223569 -199284 -229831 -286249 -172758
16076 -172758 -51158 -62393 -192014 -313048 -169200 -54369 -124223 114735 415285 583000
16066 583000 519426 344392 304460 109994 118322 59057 69720 -1107 -125819 44394 209896
16055 209896 242766 193175 170144 194955 167389 116542 134347 63799 -25481 -133062 -46426
16044 -46426 121943 145720 103170 -214994 -325720 -90811 -36079 -200452 -213280 -191563 -26507
16033 -26507 -339813 -342973 -94294 -41607 102280 84029 14437 70911 108043 160709 -42324
16022 -42324 -468055 -523613 -378934 -193447 236646 277448 219432 249432 280160 173403 251994
16011 251994 392950 291354 79778 -45954 -92635 -139723 -3869 134148 380883 439971
16001D39971j82950k85115r5757J7469J26294J20033p535l22436n3239N2260M0546
15990a50459J11716O0518j49161n9837n1254j66709j522q2856j18199K36984J95514
15979a75265K23357K28733j3063J05864m9052j89985k22667j28088J47607J28500
15969E5941o8969P1570M01654l1318l02111k79007P3895K23269J44423J51797
15959D41144r0164l1575j32604l35309k37928R0731J47714J13818P4476n2440
15949a2137o9913J06613J40584L7089N8896M9961m2371k16180Q5589P9043j6816
15938B00358J40782M6738k33070k17839K9929k2341r5683L6889O2468j32437o4873
15927b49079j78393J48220J27169L971n9066J39629j74968k07880P9302J64360
$$ plain form
16001 439971 257021 -28094 -123851 -106382 19912 139945 132410 -190026 -243265 -191005 -150459
15990 -150459 -38743 21775 -127386 -187223 -238477 -405186 -406708 -489564 -607763 -370779 -175265
15979 -175265 48092 276825 263762 369626 320574 130589 -92078 -220166 -72559 55941
15969 55941 -13028 58542 460196 428878 126767 -152240 -78345 144924 289347 441144
15959 441144 350980 319405 186801 -148508 -386436 -295705 -147991 -34173 40303 -12137
15949 -12137 -82050 24563 165147 202236 261132 311093 268722 52542 138131 217174 200358
15938 200358 341140 387878 154808 -63031 -33102 -55443 -151126 -114237 -51769 -184206 -249079
15927 -249079 -427472 -279252 -152083 -148112 -207178 -67549 -242517 -450397 -371095 -206735
15917b06735J6226J58081K2899j41426j43545J24301K71669J66225j89545j54111
15907g5961J15699n2113L4962P9303r696j31736P0249J44854r0008j30665L6369
15896h743R41k62197J85393L49704P7313k09450q8410M6621P2318j47805o9082
15885e3397M2132J58236j14595j28512J03189J87925r7573Q030k24138P084k9563
15874a41182l8119l0787K20340J05510J15326p0008o4503r1007r7684k6747j3520
15863a32381j77586m4735K89651J95338m212M4697O2487M4988j81723j37109j03090
15852a43675K08560J98061j45414j59954j13193L0229j05808j61981l27j17448
15842e10950l61751K67767L24972M43679P3086q6769j32745j46250j43950J81977
$$ plain form
15917 -206735 -190509 -32428 -9529 -150955 -294500 -170199 101470 267695 78150 -75961
15907 -75961 39738 -12375 22587 101890 92194 -39542 30707 175561 85553 -45112 -8743
15896 -8743 -7802 -269999 -84606 265098 342411 132961 44551 91172 163490 15685 -53397
15885 -53397 -11265 146971 32376 -96136 7053 194978 97405 105435 -118703 -111619 -141182
15874 -141182 -179301 -210088 10252 115762 231088 161080 96577 5570 -92114 -118861 -132381
15863 -132381 -309967 -354702 -65051 130287 126075 170772 233259 278247 96524 -40585 -143675
15852 -143675 64885 262946 117532 -42422 -155615 -125386 -231194 -393175 -393502 -510950
15842 -510950 -872701 -604934 -279962 163717 236803 150034 17289 -128961 -272911 -90934
15832i0934J92054l1057p3607k06274q7304L32304O0949m539P2729k96181j91082
15821c22942L25426K64059j89638J77171K12338j20997q3963j99803P0978N9471
15811A92100k57146k16424M5216L22420k4979j38527M9120O3568p9680Q2979j29966
15800i1319n1539J43953j34080k55196J77137K09420L4864j51177j17751J57212
15790g8476k17011k01456J7079J38981K46353m0478j80700K1870K32420R2846
15780C1428k0021J24435J5429k17085J1R9497L7363k32798K4134j4902j22570
15769b75079J6234r4031j1814k5459J71203K23991j1994N6806J15115k87811k72016
15758c94855K00568J56541J1468j1967n0865O9212J48085J83228o3730l05119
$$ plain form
15832 -90934 101120 70063 -3544 -209818 -297122 35182 96131 91592 164321 -131860 -322942
15821 -322942 2484 266543 76905 254076 466414 345417 261454 61651 132629 192100
15811 192100 -65046 -281470 -236254 86166 61187 -77340 -28220 35348 -44332 38647 -91319
15800 -91319 -142858 1095 -132985 -388181 -211044 -1624 33240 -117937 -235688 -78476
15790 -78476 -295487 -496943 -479864 -340883 -94530 -135008 -315708 -293838 -61418 31428
15780 31428 11407 135842 151271 -65814 -65803 33694 71057 -161741 -137607 -152509 -275079
15769 -275079 -258845 -352876 -364690 -390149 -218946 5045 -6949 49857 164972 -122839 -394855
15758 -394855 -194287 -37746 -26278 -38245 -89110 -19898 128187 311415 247685 -57434
15748e7434O0244K2359q9442J56253L14268K891k72237j6983O1738j12357j25867
15737e6567O2372K20652J26809l59378j14125J63406j8462j11233m0048L191r9999
15726b23382j03255N4968J19360L09700J76323j12541P0051j87766k66100J38402
15716b4240j93459l52854L31107J65219m7719m1686P1550k0237J16110J48387
15706A52178K91028k0275k82873K0115j69471k59386j14653K17387K4945k71076
15696d12081L7812K69119M0850j03910K373J10105j10206p9237k1524Q108N3084
15685b05507l2796o1505L8705K12615j8652k30915m6032J11403O0646k7291o6345
15674b65674K6189J86706L2011o789j6577J23j4609r992k52030n1645r9323J98941
$$ plain form
15748 -57434 2810 25169 -64273 91980 406248 409139 136902 119919 181657 69300 -56567
15737 -56567 5805 226457 353266 -6112 -120237 43169 24707 -86526 -126574 -123383 -223382
15726 -223382 -326637 -271669 -152309 157391 333714 221173 291224 103458 -162642 -24240
15716 -24240 -217699 -570553 -239446 -74227 -121946 -163632 -92082 -112319 3791 152178
15706 152178 443206 422931 140058 160173 -9298 -268684 -383337 -165950 -141005 -412081
15696 -412081 -374269 -105150 -64300 -168210 -165837 -55732 -165938 -245175 -266699 -258591 -205507
15685 -205507 -238303 -299808 -261103 -48488 -67140 -298055 -344087 -232684 -172038 -199329 -265674
15674 -265674 -239485 -52779 -20768 -27557 -44134 -44011 -58620 -68612 -320642 -372287 -471610 -272669
15662b72669N8716L628L2481L07664J52567m07046j80550L46027L0656j8357p8599
15651b5482q1665k19347j35300N6600K22023j28739o6807P0511J95744R8418J7393
15640C349j96293Q2378p3811Q081R2165r429j90172p7914M9883J79644M2367j09532
15628a99284j67179k5613P1898J55218J12970Q9594m8485K09974K9150j0349o1040
15617A56854l4101k24489k73425j61740O0793J69330K43703K6831k01015O0044
15607a77215K15743J38033j52627j6202K27926J9725k22470r7109K24727M0667
15597B01198R0199p3605m5107J09773J8336q9655q4557j16404K3283l6341q958
15586a1838J06825j702j91069j89523L604J57121J93465k6325k80645O4176R1702
$$ plain form
15662 -272669 -213953 -210325 -177844 129820 282387 -124659 -305209 40818 71474 53117 -25482
15651 -25482 -107147 -326494 -461794 -405194 -183171 -311910 -378717 -308206 -112462 -14044 3349
15640 3349 -192944 -110566 -184377 -176296 -84131 -93560 -283732 -361646 -311763 -132119 -89752 -199284
15628 -199284 -366463 -392076 -320178 -164960 -51990 37604 -10881 199093 228243 217894 156854
15617 156854 122753 -101736 -375161 -536901 -476108 -306778 -63075 -36244 -237259 -177215
15607 -177215 38528 176561 23934 7732 235658 255383 32913 -64196 160531 201198
15597 201198 291397 217792 172685 282458 300794 211139 126582 10178 33461 -2880 -11838
15586 -11838 94987 93285 -97784 -287307 -283703 -126582 66883 40558 -240087 -175911 -84209
15575h4209j4632K43404j37703j16728L29446k6783l50732j60387L09233Q6152
15565G7061k32922K27719O3529k5011N0845P6377q1481j04754L1514j80322J06318
15554H873n7981r9991M9003j73750q3731M0442J88234J20476o2694l7369p1573
15543a80061R4198J77970J10334J3938m1217N0977J27431R2401l45229k69848
15533a69106J26918K32352q4419m00412j33758J54462K45543k4K1764m5820J92039
15522A39539Q4352J23003k59985j77536J75908J95387J36685J63388r0047k19274
15512B71420N8020o2641l72900k27896J0087J64998N3678J43246J99262j67489
15502F9785j43926n4629J45372r110K17118K69956j85019j86702o8045q8143j0237
$$ plain form
15575 -84209 -98841 144563 6860 -109868 219578 192795 -157937 -318324 -9091 77061
15565 77061 -155861 71858 135387 110376 161221 237598 156117 51363 82877 -97445 8873
15554 8873 -49108 -149099 -100096 -273846 -357577 -317135 -128901 -8425 -71119 -108488 -180061
15543 -180061 -85863 92107 202441 216379 175162 226139 353570 445971 100742 -169106
15533 -169106 -42188 190164 105745 -294667 -428425 -273963 -28420 -28444 -6680 -52500 139539
15522 139539 223891 346894 86909 -90627 85281 280668 417353 580741 490694 271420
15512 271420 329440 266799 -106101 -333997 -323910 -158912 -105234 38012 237274 69785
15502 69785 -74141 -128770 16602 7492 224610 494566 309547 122845 54800 -33343 -43580
15491d3580L59580K92632j8900n6469l72409k97960j19994j8802j05105J63238
15481b17769K03268N380K1050k38163n7207j13269Q0760j80406J16885J04904
15471b74567q0389L0917K1717J7690L86990Q4524j08239j24963p9307l3328K19449
15460F0494j20768j1682j81377q6827q4090Q2767n8028K69516k4215j9466M4972
15449a28704Q9864N2610P0220M9985q3616o4615J33128J42304j32065p9945n711
15438D3455m9600j20057j62397l3260j40680P9926Q5896J99643j3260p296P4592
15427d3038K16414J90930j9014L0000j37314k63949o8630n7467l5016o01J83860
15416c825K87707N2924k67574J27883M032o8134K0996J33885k58760l00721j77913
$$ plain form
15491 -43580 316000 608632 589732 533263 160854 -137106 -257100 -275902 -381007 -217769
15481 -217769 -14501 -9121 11929 -226234 -283441 -396710 -315950 -496356 -379471 -274567
15471 -274567 -354956 -324039 -302322 -284632 102358 186882 78643 -46320 -125627 -158955 60494
15460 60494 -60274 -71956 -253333 -340160 -424250 -341483 -399511 -129995 -154210 -173676 -128704
15449 -128704 -38840 13770 83990 133975 50359 -14256 118872 261176 129111 49166 43455
15438 43455 -6145 -126202 -288599 -321859 -462539 -382613 -296717 -97074 -110334 -117630 -43038
15427 -43038 173376 364306 345292 375292 237978 -25971 -94601 -152068 -187084 -187685 -3825
15416 -3825 283882 336806 69232 197115 201147 133013 154009 287894 29134 -271587 -449500
15405d49500R2453J91840J98963j48168L8636K27453M8065J63654j22594K7896
15395B68698q0361j32533J0620j76659L8847J89122P8235R7586O4922j07562k40541
15384A0374Q7021J43167L14318M318j48985n363k19749j48882m5038J93618q5760
15373I9039l20172J86254K55977j45536O666M0138L40656o2824j34752o7276k15354
15362a7184j06476l633q8122l8459M20J04852R081M7176j50258K7466O1098O8970
15350h5069J04988n1391J10532J34260m0436L3607J25757J01408P8951P23j68380
15339C44950j48436j34304j07474J20175K2097o4915J63277L13324k31467j17808
15329A59419J40392J48669l3436l31168j63530o206j7345J09928j91041j35065
$$ plain form
15405 -449500 -357047 -165207 33756 -114412 -75776 151677 199742 363396 240802 268698
15395 268698 188337 55804 66424 -110235 -71388 117734 195969 293555 358477 250915 10374
15384 10374 97395 240562 554880 559198 410213 404850 185101 36219 -8819 184799 99039
15373 99039 -221133 -34879 221098 75562 82228 122366 463022 400198 265446 198170 -17184
15362 -17184 -123660 -127293 -215415 -253874 -253454 -148602 -139521 -92345 -242603 -215137 -154039 -85069
15350 -85069 19919 -31472 79060 213320 172884 206491 332248 433656 512607 513330 344950
15339 344950 196514 62210 -45264 74911 97008 32093 195370 508694 277227 159419
15329 159419 299811 448480 415044 83876 -79654 -85860 -103205 6723 -184318 -319383
15319c19383n3671J32468j5435J95598J23404r7224J33375R7727l58967m8732
15309b10840P6051q6217j96457J38902L783K3072K00475K09831O2391o4677N389
15298A61703k5830j28442m313l12848l08295J19041L97090P4124K52994q7582
15288A37642Q043J39058q8372O2308n7697o6885M8439q4088j08680j90187Q5062
15277a15357P8791L8795k01639N5700k8662j58620L1408J44790J57076m1905j66311
15266b05934l0817o1066k58013k17587O3416J87092J49515L12644L9085l74171
15256c95836k93475K56425M3690J21043J27809J26977j4328J9313j08942K33124
15246A15800J9140r2968J99978O6389k2026k2712j1018j70413K7680Q7065j33984
$$ plain form
15319 -319383 -373054 -240586 -256021 -60423 62981 -34243 99132 196859 -162108 -210840
15309 -210840 -134789 -221006 -417463 -278561 -274778 -251706 -51231 158600 220991 156314 161703
15298 161703 135873 7431 3118 -309730 -618025 -498984 -101894 -27770 225224 137642
15288 137642 145685 284743 196371 258679 200982 134097 182536 98448 -10232 -200419 -115357
15277 -115357 -36566 2229 -199410 -143710 -172372 -330992 -299584 -154794 2282 -39623 -205934
15266 -205934 -236751 -297817 -555830 -773417 -710001 -522909 -373394 -60750 -21665 -395836
15256 -395836 -689311 -432886 -389196 -268153 -140344 -13367 -27695 -8382 -117324 115800
15246 115800 134940 41972 241950 308339 286313 263601 252583 82170 109850 196915 62931
15235F2931k58191n8832k44343L1485K53278L63397R9912n987n9003j29115j03871
15224d8339J43466Q7033j59232r5898L845j98668j61732J66539J87043p0480Q8185
15213e8238J71630p5333K1971J56231K99066p6852j47550K3041Q3309J9963j31238
15202B86000J19932M2103m02204l15268K34931L00245J23784R9561j10763k65736
15192A12585j80569R3387L0309J36345J11287k80312k01800L0150K7866P1620
15182d9132n715r6043O1070l9139l4681O8019k8401Q5232l7593j59237N8128Q2831
15170i4661J6403Q2030o9687J13429P3367j24967n034K0590L0948n9135r0159
15159a06876q0395R9885L9983q0987J2356O8488J75753j22888j36315J03176J21552
$$ plain form
15235 62931 -195260 -254092 -498435 -466950 -213672 149725 249637 243650 184647 55532 -48339
15224 -48339 95127 182160 22928 -72970 -69125 -267793 -429525 -262986 -75943 -146423 -58238
15213 -58238 113392 38059 60030 216261 515327 438475 290925 313966 397275 417238 286000
15202 286000 405932 448035 45831 -269437 -34506 265739 389523 489084 378321 112585
15192 112585 -67984 25403 55712 192057 303344 23032 -178768 -148618 -120752 -49132
15182 -49132 -54847 -150890 -89820 -128959 -163640 -95621 -124022 -38790 -76383 -235620 -177492 -94661
15170 -94661 -78258 3772 -65915 47514 120881 -4086 -9120 11470 42418 -16717 -106876
15159 -106876 -187271 -87386 -47403 -128390 -116034 -47546 128207 5319 -130996 -27820 93732
15148I3732K7577J31080n7043j22972m4164p9376J99586R2804o6753l17177n534
15137a48240R2031J60518o9954j38950J8863N936j44897R0861r8955K0811j17418
15126c29394j59837P0165P9583n385J21515K81236J58265j8673j38094k2143J7281
15115E4519K06939j38228j13077M6920K81220p2127j55786J9414k75564k46852
15105c92622j9471M6736K22509O5007q0968j025J90037L0109k31494K86182K584
15094A17584k64428K03205J17642J25285R643j44164k27334P0219K15470N2195
15084B75317J6068M5641L1288k721j20415j82037k75332L68977M65262l6197M4587
15073F30438q6543o4386p2039k97152j1352k24762j48209J9938K36274J80471
$$ plain form
15148 93732 121309 252389 195346 72374 28210 -51166 148420 241224 174471 -142706 -148240
15137 -148240 -56209 104309 34355 -104595 -85732 -79796 -224693 -133832 -232787 -211976 -329394
15126 -329394 -489231 -419066 -339483 -344868 -223353 57883 216148 197475 59381 37238 54519
15115 54519 261458 123230 10153 57073 338293 266166 110380 129794 -145770 -392622
15105 -392622 -412093 -365357 -142848 -77841 -158809 -159834 30203 60312 -171182 115000 117584
15094 117584 -146844 56361 174003 299288 308931 164767 -62567 7652 223122 275317
15084 275317 291385 337026 368314 365593 245178 63141 -212191 156786 622048 585851 630438
15073 630438 543895 479509 407470 110318 98966 -125796 -274005 -254067 -17793 162678
15063A62678p2752M9443k7630K9563k70882N4538J47684j30954Q0634J25749M968
15052A53039m9165n0916l9335k40210m8239J71051J35743j27112P1200q1621k36049
15041c41614R2897o6532j56505m9532r5728P6703K00641J66801j18449M0006O8522
15030a82790K5463O078M03445K90392o0199r8405j93474m8012O3377j98319n924
15019A632j02327j8184J63712j39546k10719Q5155m3863n4923J67022p6721n1440
15008b80202o8004K06507L23237q0348q3503k12608r2244J81757K42949R4417
14998B31958q7809j14722J57960M07908j7287j67056L0308R2428k03263k9864
14988C00561j78123k19869K9161J36300J17524p9517M6688J38278L12959l1493
$$ plain form
15063 162678 89926 139369 111739 141302 -129580 -75042 72642 -58312 22322 148071 153039
15052 153039 103874 52958 13623 -226587 -274826 -103775 31968 -95144 -23944 -105565 -341614
15041 -341614 -248717 -315249 -471754 -521286 -617014 -540311 -339670 -172869 -291318 -251312 -182790
15030 -182790 -157327 -151249 252196 542588 482389 383984 190510 142498 205875 7556 1632
15019 1632 -100695 -118879 44833 -94713 -305432 -220277 -264140 -319063 -152041 -228762 -280202
15008 -280202 -348206 -141699 181538 101190 17687 -194921 -287165 -105408 137541 231958
14998 231958 144149 29427 187387 595295 578008 410952 441260 533688 330425 300561
14988 300561 122438 -97431 -68270 68030 185554 106037 152725 291003 603962 572469
14978E72469r0923j58555j11533l03732K00523j35592l13876J75707K33896k85719
14968b17335r1050O332j40412j79249K90033M0274N6097L2715j79668p4993R4791
14957c62465K09630n6510k5188K25543K32471r7902j8996q4607j30980J4437J43374
14946D8807p883l4373j57805N3865j0831J4983j8595l7179j38782L1513L38592
14935H2312Q6567j9398q0191J60480P9741p8399L7131L4034j32748k62088r6717
14924a89276K4886l26403J1649K36090K55255J83410J0293j9570j77332J1655
14914B0657J42311j11818k64J6982j16335J00461j1788M197m1423p4793R0773
14903A8960J93116o0745j46292K32919O6810l96894k33631R2836J8610L7409K00306
$$ plain form
14978 572469 481546 322991 211458 -92274 108249 -27343 -341219 -165512 68384 -217335
14968 -217335 -308385 -302053 -442465 -621714 -331681 -291407 -235310 -202595 -382263 -457256 -362465
14957 -362465 -152835 -209345 -234533 -8990 223481 125579 106583 21976 -109004 -94567 48807
14946 48807 40924 6551 -151254 -97389 -108220 -93237 -111832 -149011 -287793 -256280 82312
14935 82312 168879 149481 69290 229770 309511 231112 268243 302277 169529 -92559 -189276
14924 -189276 -164390 -490793 -479144 -243054 12201 195611 205904 186334 9002 20657
14914 20657 162968 51150 50886 67868 -48467 51994 40206 44403 2980 -71813 18960
14903 18960 212076 151331 5039 237958 304768 -92126 -325757 -232921 -214311 -176902 23404
14892B3404K55313r9412l18357J47671P230j83156r9248J36698O6089r4224K62509
14881A04517j07863l54022r7822L21833J93972J01383J31562J15383l6944j17594
14871B54405q0346j18492Q7644k7846j16258j16634J7104O9203J6409J3203j72592
14860a74200j752j61319J2366J07534n0982K04669K51101j8540J24777m0478k09366
14849D3810J82563R0222O8738n1025j39027j61316L1961M9588j83548l05499o7619
14838d41152Q3644N2905Q2427n4246j5754K20874R2600l06912K0790O6981J93034
14827d809J25289p1152J78953Q650O5741o5910j05849k4496N7762k0792j47242
14816c855k00268O3985R4486J3396P9557o7526J1007Q9238J01361q6132M9123
$$ plain form
14892 23404 278717 179305 -139052 8619 15849 -167307 -266555 -129857 -63768 -157992 104517
14881 104517 -3346 -357368 -455190 -133357 60615 161998 293560 408943 371999 254405
14871 254405 174059 55567 143211 115365 -893 -117527 -100423 -31220 -14811 -1608 -174200
14860 -174200 -175952 -337271 -324905 -217371 -268353 -63684 187417 168877 293654 253176 43810
14849 43810 226373 316595 385333 334308 195281 33965 65926 115514 -68034 -373533 -441152
14838 -441152 -357508 -304603 -222176 -276422 -292176 -71302 21298 -285614 -264824 -197843 -4809
14827 -4809 120480 49328 228281 236931 302672 236762 130913 106417 164179 143387 -3855
14816 -3855 -204123 -140138 -45652 -32256 47301 -20225 -9218 80020 181381 95249 144372
14805A44372L6936j79761O696k03120M7847J84397J96104k3990p0193k47996r9129
14794b07837J35073l8438j89635Q9534j77465Q108J78452j5731J95617K02362
14784A80040j28985o1095J99511N6210j72230M7817j41658J41541N6291j01485
14774G5957j651J00868j11544j61661l8300J69736j13242o0118k2324K67261r964
14763I5018j65257L88697M4827n9933j06160m2358j12378l10152j11832M7160
14753c32368K73653L69391n8836q9518q1447P8520m4165j6601J19193k713m53265
14742b38156j09857o1933q7998K24478J12251j51462j45101J22304J03091J61227
14732g1156l4208K12176j20680l8432O8226J20013q7696Q6389j84480k90786K11480
$$ plain form
14805 144372 181308 1547 8243 -194877 -147030 37367 233471 209481 139288 -108708 -207837
14794 -207837 -72764 -111202 -300837 -211303 -388768 -380660 -202208 -217939 -22322 180040
14784 180040 51055 -10040 189471 245681 73451 121268 -20390 121151 177442 75957
14774 75957 74306 175174 63630 -98031 -136331 33405 -79837 -139955 -162279 104982 95018
14763 95018 -70239 318458 363285 303352 197192 154834 42456 -267696 -379528 -332368
14753 -332368 -58715 310676 251840 162322 80875 159395 115230 98629 217822 215109 -238156
14742 -238156 -348013 -409946 -497944 -273466 -161215 -312677 -457778 -335474 -232383 -71156
14732 -71156 -105364 106812 -13868 -52300 15926 135939 48243 134632 -49848 -340634 -129154
14721a29154J63294l1158j5148q539J75409J56922J08531j08100k15542K352k65092
14710a66225k6045J08059q1274m5227j62292j24803K8651J98193r2730j05880
14700d69573N2206J79636l7445K0188j8677M4546K01372K02760P8434k07099o6268
14689a9920o9854m4095o6754R3384j00993j35540O0570K04499j8251K4098j30703
14678b03559J18525J10257J03572o5190j77425j11895J6934m1334j7064j18489
14668c85668j38777K51934R626q3275j7338Q0322K6843J00656R4524J1251l12447
14657c62349L8256K01079n908p4110j8155L2147q328l8528R8510k5421j59187
14646c21994l6638R9879j08043j12249K32433K59462K39977n1616o8138j38105
$$ plain form
14721 -129154 34140 2982 -12166 -20705 154704 311626 420157 312057 96515 98867 -166225
14710 -166225 -192270 -84211 -165485 -210712 -373004 -497807 -469156 -270963 -363693 -469573
14700 -469573 -417367 -237731 -275176 -254988 -273665 -229119 -27747 175013 253447 46348 -19920
14689 -19920 -89774 -133869 -200623 -107239 -208232 -343772 -283202 -78703 -96954 -72856 -203559
14678 -203559 -85034 25223 128795 63605 -113820 -225715 -208781 -250115 -267179 -385668
14668 -385668 -524445 -272511 -262885 -346160 -363498 -283176 -256333 -155677 -61153 -49902 -362349
14657 -362349 -324093 -123014 -128922 -203032 -221187 -189040 -197368 -235896 -137386 -162807 -321994
14646 -321994 -358632 -258753 -366796 -479045 -246612 12850 252827 201211 133073 -5032
14636e032j49861O3256o2234K33570J21902m0788j27945j31532J71995P3912l2149
14625A15094q8886K2799J40569k9982j76105O3405K33417J86458k94530m199P6265
14614B44305j04568R3920J988R0606N113k34374j39580j7861Q5538n5187j34296
14603a64396n3867j2288P8095j05777k22999j24256J62881K71882K28504K27279
14593B85058p5294J9688j71858J9740M652k59319r838K09774J48298q7666j03663
14582b0428m8514j46744K22440K82532J6620j79624R9108j58916m4818J19038
14572A40694J60534L9202K4452p262j59887l49473J62521o5517P6045j52895j19550
14561b51136l6026K98666J85357r0697j51743O6240o2520k88658J78436J27184
$$ plain form
14636 -5032 -154893 -91637 -153871 79699 201601 160813 32868 -98664 73331 147243 115094
14625 115094 26208 49007 189576 159594 -16511 46894 280311 466769 172239 168040 244305
14614 244305 139737 233657 235645 326251 331364 96990 -42590 -60451 25087 -30100 -164396
14603 -164396 -218263 -230551 -152456 -258233 -481232 -605488 -442607 -170725 57779 285058
14593 285058 209764 229452 57594 77334 81986 -177333 -187171 22603 170901 83235 -20428
14582 -20428 -68942 -215686 6754 289286 305906 126282 225390 66474 21656 140694
14572 140694 301228 340430 364882 357620 197733 -151740 10781 -54736 21309 -131586 -251136
14561 -251136 -287162 11504 196861 106164 -45579 20661 -41859 -330517 -152081 -24897
14551b4897P5620J30710K24349N2829l47926L5592K70940q3743k04403l08937
14541a79866L2649J6726J27603J62616K6807j01947m17394m53841p662K07389
14531e86920J16212L72655K72901r216k66284r8464O2912N6802j55797K4853j24263
14520c34609J21256L42957J5932j36815j23726M1827Q0824J48023q3621J4297
14510H6345j07448q0960J28941K02346Q4509p5159j61454j77975J7550K1767L2435
14499b9103j59176k04783J01956J50003j20954j00051j3812J0442P2701j08606
14489d01383J78136J00012J38553J87569l99612l6281K67185j20160n3349k9476
14479a68806j8172R948J47760N3220o1975P6448Q7368K63888J8485j36853p0303
$$ plain form
14551 -24897 50723 181433 405782 458611 110685 146277 417217 333474 129071 -179866
14541 -179866 -147217 -130491 -2888 159728 186535 84588 -332806 -786647 -794309 -586920
14531 -586920 -470708 -98053 174848 165632 -100652 -199116 -136204 -79402 -235199 -210346 -334609
14520 -334609 -213353 129604 145536 8721 -115005 -73178 7646 155669 72048 86345
14510 86345 -21103 -102063 26878 229224 313733 238574 77120 -100855 -83305 -61538 -29103
14499 -29103 -188279 -393062 -291106 -141103 -262057 -362108 -375920 -365478 -292777 -401383
14489 -401383 -223247 -123235 15318 202887 -196725 -233006 34179 -85981 -139330 -168806
14479 -168806 -186978 -177030 -29270 23950 -38025 38423 125791 389679 408164 271311 201008
14468B01008K8476L0296j07295n8580J7393P5407o6011o0406k02103O0250K59836
14457A78271L75082j12012k20714R6411M0122k01032l0520p6922k48144J67366
14447c2092K92473L3173j9207k73562j87874l9941Q3013R0292J71985O0069J79441
14436C57770N9j5882J61016m3095k80775l80386j67710l1113K75549J8129j19958
14425b26396j07115j7658N5201Q775N3795P4693O7998P9656J73904J24459l0481
14414B56831j34783P8814K90209j42511k13361P1360j82098j18145J83100N2744
14404A42160n5884J34104j00020j67386j51396j86604j66667K72596L02246j64784
14394a41635q8253J83659j03294j9033K75294J16849j22786j88936p6096k2080
$$ plain form
14468 201008 229484 259780 152485 93905 111298 186705 120694 60288 -141815 -81565 178271
14457 178271 553353 441341 220627 317038 357160 156128 125608 48686 -199458 -32092
14447 -32092 260381 293554 274347 785 -187089 -227030 -144017 -53725 118260 178329 357770
14436 357770 357829 341947 502963 459868 179093 -201293 -369003 -400116 -124567 -106438 -226396
14425 -226396 -333511 -351169 -295968 -287193 -233398 -158705 -90707 -11051 162853 287312 256831
14414 256831 122048 200862 491071 348560 135199 206559 24461 -93684 89416 142160
14404 142160 86276 220380 120360 -47026 -198422 -385026 -551693 -279097 23149 -141635
14394 -141635 -229888 -46229 -149523 -168556 106738 223587 100801 -88135 -164231 -186311
14384a86311r8147o463J18032L37430K85272n6254p3223j34801j72502J32348
14374A45381j76795j63446K5741P5654j12017J64382R0878k36381R7713j65388
14364b54278j93049J19745n1984K1109R1207J90645J76004k36720o58P1719J5529
14353e0731N8711L519n7788J49645K19844J00552L5234l10888j73713Q3313K26237
14342B83935j18194j15029k15396j96655J47735K24190j38185k6889n618j62373
14332c22479j81877O0479J31772K04623J61079J7733K46395R9935k9977k18916
14322A68767M4033J09527k20306k65958K0776J05308J16175J42877j21592j38040
14312c8433k61339J34261M31799n9163J1776j09392k7476q8077j53279j27390
$$ plain form
14384 -186311 -284458 -290921 -172889 164541 449813 393559 320336 185535 13033 145381
14374 145381 -31414 -194860 -169119 -93465 -205482 -41100 49778 -186603 -88890 -254278
14364 -254278 -447327 -327582 -379566 -358457 -267250 -76605 99399 -137321 -137979 -66260 -50731
14353 -50731 7980 11499 -46289 103356 323200 423752 458986 148098 -25615 57698 283935
14342 283935 165741 50712 -164684 -361339 -213604 10586 -127599 -154488 -160106 -322479
14332 -322479 -504356 -443877 -312105 -107482 53597 71330 317725 417660 387683 168767
14322 168767 212800 322327 102021 -163937 -143161 -37853 78322 221199 99607 -38433
14312 -38433 -299772 -165511 266288 207125 218901 109509 82033 -6044 -159323 -286713
14302b86713j74715J54499J87543M221J3252J2429k78061J37030P1842L8982p8969
14291a98660L156M6094j94412K7969J22871m1843J30872R5682P2885R9852k86821
14280a22355p1704m0897l5624J06818n6932o8334p5980J63114J21161k7041K6984
14269h0790k7561J02919J23070J23989j57112m96l8477j6861K7057M7067k44186
14258a41381J41495k0885n2662J33147p0954q6130j44590r0525J09044K18190
14248e251O1139P5505k26959j77085J97937J1614j4805K6159J34643p0305J74688
14237A87280J01271j64351j59708k2735k5776p0805J5784N738j2239J95682J21436
14226A71577J02959l4795j20066K09205n0400j37806j04450J03598P7180j69919
$$ plain form
14302 -286713 -461428 -306929 -119386 -115165 -101913 -89484 -367545 -230515 -158673 -119691 -198660
14291 -198660 -195504 -149410 -343822 -315853 -192982 -234825 -103953 -8271 64614 164466 -122355
14280 -122355 -194059 -234956 -270580 -163762 -220694 -289028 -365008 -201894 -80733 -107774 -80790
14269 -80790 -108351 -5432 117638 241627 84515 84019 45542 28681 55738 102805 -141381
14258 -141381 114 -20771 -73433 59714 -11240 -97370 -241960 -332485 -223441 -5251
14248 -5251 55888 131393 -95566 -272651 -74714 -63100 -77905 -51746 82897 12592 187280
14237 187280 288551 124200 -35508 -58243 -84019 -154824 -139040 -133302 -145541 50141 171577
14226 171577 274536 239741 119675 328880 278480 140674 36224 139822 217002 47083
14216D7083R0845P4203q568J72182l3464j58345K56902o6108q0784M5799Q0608
14205D20353m2972q2053j77713k0567J05527j85209m0123j56238J52555m3598
14195g0038K31410J5359k3312k51134j38552J06628J16136m414K273O706J68284
14184A59346J33342J19568r7907j40835J24851O3903j09015j75259k78267J52159
14174d8114M1942j17146j8609J72721O5118o9637j89809p8625n9600L41770J79721
14163B19732q9856Q4882J40469k38840K0002K31455o7115m80051J3457P9949O5494
14152b0422J97572n6423j84198K04436q8888j204J8756m4257o3116O0764N9808
14141H2828L9349K931O3957k21758j41483j45412K32059M63397j0167l70566l56007
$$ plain form
14216 47083 137928 212131 203563 375745 342281 183936 440838 374730 293946 339745 420353
14205 420353 377381 295328 117615 97048 202575 17366 -22757 -178995 -26440 -70038
14195 -70038 161372 176731 153419 -97715 -236267 -129639 -13503 -17917 -15644 -8938 159346
14184 159346 292688 412256 314349 173514 298365 362268 253253 77994 -200273 -48114
14174 -48114 -6172 -123318 -141927 30794 95912 26275 -163534 -242159 -301759 40011 219732
14163 219732 129876 214758 355227 116387 136389 367844 300729 -179322 -165865 -85916 -20422
14152 -20422 177150 120727 -63471 140965 52077 50873 69629 25372 -37744 23020 82828
14141 82828 122177 125108 189065 -32693 -174176 -319588 -87529 375868 365701 -4865 -360872
14130c60872O2915P6758J44172m762J10746J0992j08481r5306R1794j67089m3784
14119b82917J75816J74878J78146K6109j07426P5903K18819K4124k06752k00333
14109G6367k2078k71370m3541M1053J95172Q6170o8646k6052J32552M9142O8507
14098B17276p1286k02634j93794m6055O4666L00129J85209J57636J2452j4544
14088D09055k12607N3849p7286j71934J507N2941k57083j19015q9815P1626J09381
14077b29381k0712K59909L09078N8593k40135j68994m0757J83773O5443j36571
14067D0246p5918J33548J27726j55536n619K42451r4150p3507j4611n5278k06544
14056a37192J42497J58847l60283J15599J58332j79923m3508J5643J06520O9255
$$ plain form
14130 -360872 -297957 -221199 -77027 -81789 28957 39949 -68532 -163838 -72044 -239133 -282917
14119 -282917 -107101 67777 245923 272032 164606 240509 459328 483452 276700 76367
14109 76367 54289 -217081 -260622 -219569 -24397 61773 -6873 -32925 99627 148769 217276
14098 217276 145990 -56644 -250438 -296493 -231827 68302 253511 411147 423599 409055
14088 409055 196448 250297 173011 1077 2584 55525 -201558 -320573 -410388 -338762 -229381
14077 -229381 -250093 9816 318894 377487 137352 -31642 -72399 111374 176817 40246
14067 40246 -35672 97876 225602 70066 64447 306898 212748 139241 124630 69352 -137192
14056 -137192 5305 164152 -196131 -80532 77800 -102123 -145631 -129988 -23468 45787
14046D5787Q6578o5564j04486M4667M0123k43745j11370j23153J21938L89111
14036G9886k5114l8371q9808Q2009Q1515Q7767j11116m1083L2512o5368J26785
14025A19614Q541j9717q6524K34023K22288p2491m9961O4582J45067l17577k02912
14014D4933J7382j89576j7084j21789p3761n2515J25558N3242R2592J9946L92
14003a00680l7088P6615k04338J86839L50217j37330o5533J7763q5639P7509K92369
13992C70704K05297J16240j16501k60018j92382R2506J9930j09093j33715N6532
13982D9500J12666J59636R3016r7054r871R8104q7229k06198j71298j47517K7648
13971a78597L5161K7047K4721k248j56098l3527R6643K01473j7796o5971j4219
$$ plain form
14046 45787 132365 66801 -37685 6982 47105 -196640 -308010 -431163 -309225 79886
14036 79886 54772 16401 -73407 8602 90117 177884 66768 25685 58197 -7171 119614
14025 119614 128155 108438 21914 255937 478225 405734 355773 420355 565422 247845 44933
14014 44933 62315 -127261 -144345 -266134 -339895 -392410 -266852 -213610 -121018 -101072 -100680
14003 -100680 -137768 -61153 -265491 -78652 271565 134235 68702 86465 826 78335 370704
13992 370704 576001 692241 575740 315722 123340 215846 235776 126683 -7032 49500
13982 49500 162166 321802 414818 317764 307893 405997 318768 112570 -58728 -206245 -178597
13971 -178597 -143436 -116389 -91668 -93916 -250014 -283541 -186898 14575 -3221 -69192 -83411
13960h3411Q632Q116Q7549k6705j81199K7555J92720J54783K8636l31774K1675
13949i3423K8424O6627J29847J08676K9491k01709o2872Q526j62865M194J23725
13938b1359K43456K03322L1742K9264k30321k5700q2199r2434j23521J02476L320
13927C8046P4983o3734J24592K3884j09294j43159J8172j13221J25953J23486
13917I9708K4979q4585j12386r2766j37888L3499K17394J57236k69844j64903
13907c29556J17747R1056K6435M9517J44163K67575j6427k19916j89350K6017
13897c2739n2091o220Q3100j57585r5643L54209J35052J82254J33008n7873j38209
13886C47263m73477j0791k6660k53820O7773P1255P3802K30062L9910q8375K55390
$$ plain form
13960 -83411 -74779 -66663 20886 -5819 -187018 -159463 33257 188040 216676 -115098 -93423
13949 -93423 -64999 1628 131475 240151 269642 67933 5061 13587 -149278 -145084 -21359
13938 -21359 222097 425419 457161 486425 256104 230404 148205 55771 -67750 34726 38046
13927 38046 113029 49295 173887 197771 88477 -54682 -36510 -149731 -23778 99708
13917 99708 124687 40102 -72284 -165050 -302938 -269439 -52045 105191 -164653 -329556
13907 -329556 -211809 -120753 -94318 -44801 99362 366937 350510 130594 -58756 -32739
13897 -32739 -84830 -91050 -7950 -165535 -261178 93031 228083 410337 543345 485472 347263
13886 347263 -126214 -137005 -163665 -417485 -349712 -278457 -204655 25407 65317 -23058 232332
13875B32332L8010O2225J83429j56424j47520q9760K4339o4030k03112n1932L23829
13864A51386J72332l810j02782P3203K9377j59995j45825j00352k4567P1955K3419
13853a5659n4851M9704O5977k22261r2254P2880J88786K76182J7108l19169j60291
13842a93848n9195L42412K77298Q1966j19910l06252k08313J33917O9245J3420
13832C0740P5444m7572j78421j90310o9010K3445P2715n7849p482J90633L18057
13821A60390j44986j20999J18771l4587j54318j03252l8706K23964R5024P7030
13811G8331L41170J55595j22470l1417O7538k81274m56966k11698J0428J50211
13801c00552j59759M3067J74771K37945K72712j1936J2375J09620j65834K7j27008
$$ plain form
13875 232332 270342 332567 515996 359572 212052 122292 146631 82601 -120511 -172443 151386
13864 151386 323718 319908 217126 290329 319706 159711 13886 -86466 -111033 -39078 -15659
13853 -15659 -70510 -20806 45171 -177090 -269344 -196464 -7678 268504 285612 -33557 -193848
13842 -193848 -253043 89369 366667 448633 328723 22471 -185842 -51925 17320 30740
13832 30740 106184 58612 -119809 -310119 -379129 -355684 -282969 -340818 -348300 -157667 160390
13821 160390 15404 -105595 13176 -21411 -175729 -278981 -317687 -93723 1301 78331
13811 78331 419501 575096 452626 421209 488747 207473 -249493 -461191 -450763 -300552
13801 -300552 -460311 -417244 -242473 -4528 268184 256248 268623 378243 212409 212436 85428
13790H5428k46046K7652N5702J65377r5120j29416Q3420N1084k5660p3966N1321
13779e0224n3707n8954O4509M6955j39368L4440R9929j8130J3047q1361M656K19294
13767H1086K07960m0942R547M6507J2525k8273j78663l09400j44247J31062l1589
13756b44427q7159Q8601J42731l0553q3631j65940J20905J06287O6496n7678P3000
13745g1368J2553j32477J43857J22557Q3167Q5105j79272j32808j60380o6563
13735b95629J49585R9766p3597M1640K46594J2751n3039l2199K1723j54282n1771
13724h8458J67670M8127k12649k36204j39512K79498M06858L3084q8986r1619
13714G7809j51004J08822K56331j6895n9813k19182k89751o8909J13861J2681
$$ plain form
13790 85428 -160618 -132966 -77264 88113 -7007 -136423 -53003 -1919 -27579 -101545 -50224
13779 -50224 -103931 -162885 -98376 -51421 -190789 -156349 -56420 -74550 -61503 -142864 -138208 81086
13767 81086 289046 248104 257651 304158 316683 288410 109747 -199653 -343900 -212838 -244427
13756 -244427 -331586 -242985 -100254 -130807 -214438 -380378 -259473 -153186 -86690 -144368 -71368
13745 -71368 -58815 -191292 -47435 75122 158289 243394 64122 -68686 -229066 -295629
13735 -295629 -146044 -46278 -119875 -78235 168359 181110 128071 95872 117595 -36687 -88458
13724 -88458 79212 127339 -85310 -321514 -461026 -181528 225330 258414 169428 77809
13714 77809 -73195 35627 291958 275063 215250 -3932 -293683 -362592 -248731 -236050
13704b36050n9042j98807O8400o8441j22247J71448k7301O2297J30151J79457
13694a00135J20358K1043K22520o7783j59128O9564J1743J9249l6709l60459p9105
13683c38842K98170L64832P3757o6740o2726o8406j79652L1870M5265j53922n0963
13672a07357l5536J36046J38191L01909l8748q7848L8440j92163l68998O7928
13662a48136K19259J5652r7629j15320J9267J39264n5487K333J10122n8455O2036
13651I2906q9687J23272M2795l3799r5989M8787j55003k81418j27544N9355l8421
13640d54746l8103N37664L29489p9096j21499R0259L7005n5390j25223j27271
13630f911j13500l2120j14475k52347J62773K28618q4552J88765M9105j89157
$$ plain form
13704 -236050 -295092 -493899 -425499 -493940 -616187 -444739 -472040 -409743 -279592 -100135
13694 -100135 20223 41266 263786 196003 36875 106439 118182 137431 100722 -259737 -338842
13683 -338842 -40672 324160 397917 331177 268451 200045 20393 52263 97528 -56394 -107357
13672 -107357 -142893 -6847 131344 433253 394505 306657 345097 152934 -216064 -148136
13662 -148136 71123 86775 -10854 -126174 -106907 32357 -23130 -20797 89325 30870 92906
13651 92906 3219 126491 169286 135487 39498 88285 -66718 -348136 -475680 -416325 -454746
13640 -454746 -492849 44815 374304 295208 173709 263968 300973 245583 120360 -6911
13630 -6911 -120411 -152531 -267006 -519353 -356580 -127962 -212514 -23749 25356 -163801
13620a63801M7805J04123J02386j47620o4823J28442j77050J05052J46661Q528
13610H9703M6992Q3335j51087j54054j9814k32999J32890O6613O0683J00001p9415
13599e7152O7078P6050J21344j49798j11140P7661J1146K09975q2806r5300k21914
13588a54856k73539J05665P4001P731L3948o5083m4158O7521M7003j05020j9648
13577c26435K96618J4681J57883j7559O5827m524k17805j01428J66593J63908
13567A97759J7552j18287j36495l5127K25925J37399o6258m9194p1931m9654m51871
13556d00182p4710K66837r74J12727M7606m5695j75306j32389O4866J57900J03495
13545g5825n1783q0533j67644j27970q5356j92191o9693K06753M26692J94244
$$ plain form
13620 -163801 -115996 -11873 90513 -57107 -121930 6512 -170538 -65486 81175 89703
13610 89703 136695 220030 68943 -85111 -104925 -337924 -205034 -138421 -77738 22263 -57152
13599 -57152 9926 85976 207320 57522 -53618 24043 35189 245164 162358 67058 -154856
13588 -154856 -428395 -322730 -248729 -240998 -207050 -272133 -316291 -248770 -201767 -306787 -326435
13577 -326435 -29817 -15136 142747 125188 191015 186491 -31314 -132742 33851 197759
13567 197759 215311 97024 -39471 -74598 151327 288726 222468 173274 101343 51689 -400182
13556 -400182 -474892 -208055 -209029 -96302 -48696 -94391 -269697 -402086 -337220 -179320 -75825
13545 -75825 -127608 -208141 -375785 -503755 -589111 -781302 -850995 -644242 -217550 -23306
13535b3306n7715j84781n8164J1531K34136Q0599Q4619j09370k71949L7430m0783
13524b97753j00229M0399K56295L68950L9856J7001m6838N3431r0105O8757M533
13513C14297k49082j10132J82357J18937j21575j88773j11833n9733J60839j97122
13503b61820N068J20685K52462r067J71766K11078k12338o2479Q7404l25779j35909
13492a58929L1630J11197j20536j02420K46783J00380j61581O9651M5343j29233
13482f7715P9452J682j26324j2420M4489K8681L34419q3937j29886r4607n7056
13471h3222J72418k38147k07108J45206K45612r1336k23439o9940O9954P9308
13461b00694o5728O4856J4063j93236j7935K1849K69118r3312k18222K77047j28160
$$ plain form
13535 -23306 -81021 -265802 -323966 -312435 -78299 2300 86919 -22451 -294400 -256970 -297753
13524 -297753 -397982 -357583 -101288 267662 307518 324519 277681 331112 241007 309764 314297
13513 314297 65215 -44917 137440 256377 134802 -53971 -165804 -225537 -64698 -261820
13503 -261820 -256752 -136067 116395 107328 279094 490172 277834 215355 302759 -23020 -158929
13492 -158929 -127299 -16102 -136638 -239058 7725 108105 -53476 16175 61518 -67715
13482 -67715 11737 13419 -112905 -125325 -80836 -52155 282264 198327 68441 -26166 -83222
13471 -83222 89196 -148951 -356059 -210853 34759 -56577 -280016 -349956 -280002 -200694
13461 -200694 -266422 -201566 -187503 -380739 -398674 -376825 -107707 -201019 -419241 -142194 -270354
13450b70354j37290J77806J71629Q4376r5462r7541j9487J4905j7289K42617K28714
13439B82624m4866j11040k10580j24438J85581K98028n816k0094j00949j01548
13429D6902n5241o0500k20923r5778j21538k2189K54752J25587P4127j47304k2217
13418b44322J03422J4378k0261M05402K95959o5898j07309j21733l02223P9477
13408C6892J85712L4818j07734j27982j07818j60411M3162K01767K49037k55634
13398h191m32373J7125J44600o2090L4506K8903K13039L9322j1285j55083J74206
13387a7321K17019j4166o526J27938m4335q3877q7200N2477k04937J54308r6702
13376c322j86494l4921K38800R7938m0359K5830j02146j07126j14700J46155J22913
$$ plain form
13450 -270354 -407644 -229838 -58209 26167 -69295 -166836 -186323 -171418 -188707 53910 282624
13439 282624 237758 126718 -83862 -208300 -22719 275309 269493 249399 148450 46902
13429 46902 -8339 -68839 -289762 -385540 -507078 -529267 -274515 -148928 -74801 -222105 -244322
13418 -244322 -140900 -126522 -146783 258619 554578 488680 381371 259638 -42585 36892
13408 36892 222604 257422 149688 21706 -86112 -246523 -203361 -1594 247443 -8191
13398 -8191 -440564 -423439 -278839 -340929 -306423 -277520 -64481 -25159 -36444 -191527 -17321
13387 -17321 199698 185532 179006 306944 262609 178732 91532 144009 -60928 93380 -3322
13376 -3322 -189816 -224737 14063 112001 71642 97472 -4674 -111800 -226500 -80345 42568
13365D2568J63731J31917j63518k46872r1283j12323p13J42609J80537J0977j53743
13354i6113J16K35326Q8356k05935q5912L50574J02319j84407o4170o7521O8501
13343A41134q5777l33573L1012P2614J50758J02755j16597k39150o5954R6041
13333b46737O0942K07785m329k4612k67590N0424K08009j38516J532o1487j69580
13322c84159q8627K14250M128l6527O1858K19343p5351L7803q7911J66076L9909
13311G0792k36761q5168j58279q1102p9667n2209L5151K05527J60596J11552L17871
13300B08303J0434j38110j0145j24524m6345o8988j8962L3243K5937k6489J35022
13289b0624K35712q3825o4084k2902k44845Q9449j0922j72624Q0991n113M5745
$$ plain form
13365 42568 206299 338216 174698 -72174 -163457 -275780 -276493 -133884 46653 57630 -96113
13354 -96113 -95997 139329 227685 21750 -64162 286412 388731 204324 140154 72633 141134
13343 141134 55357 -278216 -247204 -174590 -23832 78923 -37674 -276824 -342778 -246737
13333 -246737 -185795 21990 17661 -6951 -274541 -224117 -16108 -154624 -153092 -214579 -384159
13322 -384159 -472786 -258536 -254408 -290935 -229077 -9734 -85085 -47282 -135193 30883 70792
13311 70792 -165969 -251137 -409416 -490518 -570185 -622394 -587243 -381716 -221120 -109568 208303
13300 208303 218737 80627 70482 -54042 -100387 -169375 -188337 -155094 -129157 -155646 -20624
13289 -20624 215088 131263 67179 44277 -200568 -111119 -122041 -294665 -213674 -218787 -173042
13278a73042o8499J06456K8814Q3903l9857k29542l7998J31708l15064k18831
13268g31952J19378J44846J57914Q7568N2482J08213O4513k7573p8402Q793K30780
13257A36560J86954L2616k75390j27800j04308k2643K73171j9047J1869m9677
13247D2305k1972M3221j23487j96579j52511o3487M4361J80842K86434j10462
13237g1335j5243O0691j01498L58992N1848j92436j75423m5888J14570k77936
13227b93658r9340l3239M3778K80241P4302L3170j07355q9846J31087l1223n6411
13216a48494q8274j43983N7014K9854J22982K36638J31486N7581j25124j72251
13206d2571N176j2655j9743M2067J67166J00078j0970k72170J082J76150J4612
$$ plain form
13278 -173042 -241541 -135085 -106271 -22368 -62225 -291767 -329765 -198057 -513121 -731952
13268 -731952 -612574 -467728 -309814 -222246 -169764 -61551 2962 -24611 -103013 -94220 136560
13257 136560 323514 356130 80740 -47060 -151368 -174011 99160 80113 91982 42305
13247 42305 20333 63554 -59933 -256512 -409023 -472510 -428149 -247307 39127 -71335
13237 -71335 -86578 -25887 -127385 231607 283455 91019 -84404 -130292 -15722 -293658
13227 -293658 -392998 -426237 -382459 -102218 -27916 5254 -102101 -191947 -60860 -92083 -148494
13216 -148494 -236768 -380751 -323737 -293883 -170901 65737 197223 254804 129680 -42571
13206 -42571 -37395 -50050 -69793 -27726 139440 239518 228548 -43622 -42540 133610 148222
13195A48222K0304l5226j56847r8996O7251m0063m4371l07337j8136K43280L9107
13184a82812o7542N6325K33495K23764p8231p1267k10198j92461J15142K08416
13174C4631J46549l5439k9687M7450J01866j03421j91103K46524M5681r5105o4182
13163A03764k81283j10023j9658r4537j38297J46587j25902K6599R0848J56499
13153b45403L5862K65344M684k20964j99769O0133N5833k8647m8393j00924J29780
13142b92464K0852L9482p647k8923o3346J08580K17657m1515R9821J815L6835
13131I1147O7520P7809o9762k81394J69765L0824j13129J50930j65311K7968j10754
13120a24387j29785m9251J40792R4613J29911k02745o1954O0692O0838m1263n6529
$$ plain form
13195 148222 168526 133300 -23547 -122543 -55292 -95355 -139726 -447063 -465199 -221919 -182812
13184 -182812 -250354 -194029 39466 263230 184999 113732 -96466 -288927 -173785 34631
13174 34631 181180 145741 116054 163504 265370 161949 -29154 217370 263051 167946 103764
13163 103764 -177519 -287542 -307200 -401737 -540034 -393447 -519349 -492750 -401902 -245403
13153 -245403 -209541 55803 60487 -160477 -360246 -300113 -244280 -272927 -321320 -422244 -292464
13142 -292464 -271612 -232130 -239777 -268700 -332046 -223466 -5809 -47324 52497 54312 91147
13131 91147 158667 236476 166714 -114680 55085 85909 -27220 123710 -41601 -13633 -124387
13120 -124387 -254172 -303423 -162631 -68018 61893 -140852 -202806 -142114 -81276 -122539 -179068
13109a79068j35159m8813r1345r509J35882Q3643Q2460K32001J18757l7998l5481
13098A15370o468j36974m9294j0254J01464J22780N6017l40j30091p3070M0387
13087B9527m1347J60976l9024j60448j87064N7138J19089M1434R4703Q2385j00178
13076E7191o5759L8494m2914K25306J68867m9465j28670n1965J79716O9700k00944
13065A99557j42394m8109J54755k1287M5798j01507J49245R7636O5767k18661
13055A80800n67827j32527N0421K26590m505k3899J20756N0631J30386k29176
13045a98350p1675N942j73812Q7425q1260P0978Q0314Q172J4610K48423P4228
13034F4995o0978j11595j75801o3535L21609K6462j11935j42006q7782J72861
$$ plain form
13109 -179068 -314227 -363040 -454385 -463894 -328012 -244369 -161909 70092 188849 150851 115370
13098 115370 108902 -28072 -77366 -87620 13844 136624 192641 192301 62210 -10860 29527
13087 29527 -11820 149156 110132 -50316 -237380 -180242 -61153 -19719 74984 157369 57191
13076 57191 -8568 29926 -12988 212318 381185 331720 203050 151085 330801 400501 199557
13065 199557 57163 9054 163809 142522 188320 86813 236058 333694 399461 180800
13055 180800 -387027 -519554 -469133 -242543 -247048 -270947 -150191 -99560 30826 -198350
13045 -198350 -270025 -264083 -437895 -350470 -431730 -360752 -280438 -272266 -257656 -9233 64995
13034 64995 4017 -107578 -283379 -346914 -25305 1157 -110778 -252784 -340566 -167705
13024a67705K09638J25044k54491j96491M8804M2757R2439k668j58922K9211K7510
13013b04874L0661J28475P8963n9138J81160L4604o2023r4487j45210p8460o0629
13002b50958L7248K80913J86604J26969J0217k5478M1554r8036l05621r1471J12015
12991B3956j47689k60883p7667L51129J71129n8548k0626R5662O5567Q1315j69650
12980E3695k01033P7045p7205J14870J24185P3975k68046p2263n720K4361l8305
12969a94441L2086K33191r2283j05299k05836r6378L9284N4357N7631J35060M3932
12958i8696q7496Q533p051L1994K08472o3573p8266O3325p6466N740j45654M5819
$$ plain form
13024 -167705 41933 166977 -87514 -284005 -235201 -192444 -100005 -102673 -261595 -232384 -204874
13013 -204874 -174213 -45738 33225 -25913 155247 189851 127828 33341 -111869 -190329 -250958
13002 -250958 -213710 67203 253807 380776 390993 365515 407069 309033 3412 -88059 23956
12991 23956 -123733 -384616 -462283 -111154 59975 1427 -19199 76463 142030 223345 53695
12980 53695 -147338 -70293 -147498 -32628 91557 165532 -102514 -174777 -180497 -156136 -194441
12969 -194441 -162355 70836 -21447 -126746 -332582 -428960 -389676 -335319 -277688 -142628 -98696
12958 -98696 -186192 -177659 -184710 -152716 55756 -7817 -86083 -22758 -99224 -93484 -239138 -193319
$$ [...]
##END NTUPLES=NMR SPECTRUM
##END=
