##TITLE=Analysis number 324755
Compound Code cc 12613
Project Code adrs
Chemist Name ugmt
##JCAMPDX= 6.0         $$ Bruker NMR JCAMP-DX V2.0
##DATA TYPE= NMR SPECTRUM
##DATA CLASS= NTUPLES
##ORIGIN= Bruker BioSpin GmbH
##OWNER= nmr
$$ XWIN-NMR		Version 3.5
$$ Thu Nov 30 10:01:41 2006 GMT Standard Time (UT+0h)  MAYBRIDGE\nmr@NMR_250MHZ
##.OBSERVE FREQUENCY= 250.131544655141
##.OBSERVE NUCLEUS= ^1H
##.ACQUISITION MODE= SIMULTANEOUS (DQD)
##.ACQUISITION SCHEME= undefined
##.AVERAGES= 16
##.DIGITISER RES= 18
##SPECTROMETER/DATA SYSTEM= dpx250
##.PULSE SEQUENCE= zg30
##.SOLVENT NAME= CDCl3
##.SHIFT REFERENCE= (INTERNAL, CDCl3, 0, 16.4798)
##AUDIT TRAIL= $$ (NUMBER, WHEN, WHO, WHERE, WHAT)
$$ ##TITLE= Audit trail, XWIN-NMR		Version 3.5
$$ ##JCAMPDX= 5.01
$$ ##ORIGIN= Bruker BioSpin GmbH
$$ ##OWNER= nmr
$$ C:\u/data/dgb/nmr/ADRS/1490/pdata/1/auditp.txt
$$ ##AUDIT TRAIL=  $$ (NUMBER, WHEN, WHO, WHERE, WHAT)
(   1,<2006-11-30 10:01:15.69 +000>,<MAYBRIDGE\nmr>,<NMR_250MHZ>,
      <created by zg, POWCHK disabled, PULCHK disabled
       configuration hash MD5:
       49 4B E0 1D 92 C2 6B 37 9F E6 65 BC 52 41 86 1D
       data hash MD5: 64K
       10 7D 69 67 AF 61 40 C9 EC BD 17 D6 D2 68 B8 E2>)
(   2,<2006-11-30 10:01:31.11 +000>,<MAYBRIDGE\nmr>,<NMR_250MHZ>,
      <Start of raw data processing
       ef LB = 0.3 FT_mod = 6 PKNL = 1 SI = 32K 
       data hash MD5: 32K
       C8 23 24 E1 83 24 49 55 9A 4D CA 5C 7D 69 6D B0>)
(   3,<2006-11-30 10:01:33.16 +000>,<MAYBRIDGE\nmr>,<NMR_250MHZ>,
      <apk 
       data hash MD5: 32K
       07 57 A9 05 EA 46 41 35 62 20 2E 74 F6 DA 33 64>)
(   4,<2006-11-30 10:01:34.03 +000>,<MAYBRIDGE\nmr>,<NMR_250MHZ>,
      <abs ABSG = 5 
       data hash MD5: 32K
       B8 73 93 FE 81 B8 1D E1 8F B2 16 96 EE 47 58 F2>)
$$ ##END=
$$ 
$$ hash MD5
$$ 3A BE A2 84 47 01 F6 83 4C 77 A2 2E 66 E9 0D 42
##$RELAX= 
##$RELAX= 
##$RELAX= 
##$RELAX= 
##$RELAX= 
##$RELAX= 
##$RELAX= 
$$ Bruker specific parameters
$$ --------------------------
##$DU= <C:\u>
##$EXPNO= 1490
##$NAME= <ADRS>
##$PROCNO= 1
##$TYPE= <nmr>
##$USER= <dgb>
##$AMP= (0..31)
100 100 100 100 100 100 100 100 100 100 100 100 100 100 100 100 100 100 
100 100 100 100 100 100 100 100 100 100 100 100 100 100 
##$AQSEQ= 0
##$AQ_mod= 3
##$AUNM= <au_zg>
##$AUTOPOS= <11 >
##$BF1= 250.13
##$BF2= 250.13
##$BF3= 250.13
##$BF4= 250.13
##$BF5= 500.13
##$BF6= 500.13
##$BF7= 500.13
##$BF8= 500.13
##$BYTORDA= 1
##$CFDGTYP= 0
##$CFRGTYP= 5
##$CHEMSTR= <none>
##$CNST= (0..31)
1 1 145 1 1 1 1 1 1 1 1 1 1 1 1 1 1 1 1 1 1 1 1 1 1 1 1 1 1 1 1 1 
##$CPDPRG= <>
##$CPDPRG1= <>
##$CPDPRG2= <>
##$CPDPRG3= <>
##$CPDPRG4= <mlev>
##$CPDPRG5= <mlev>
##$CPDPRG6= <mlev>
##$CPDPRG7= <mlev>
##$CPDPRG8= <mlev>
##$CPDPRGB= <>
##$CPDPRGT= <>
##$D= (0..31)
0 1 0 0 0 0 0 0 0 0.06 0 0 0 0 0 0 0.0002 0 0 0 0 0 0 0 0 0 0 0 0 0 0 
0 
##$DATE= 1164880873
##$DBL= (0..7)
120 120 120 120 120 120 120 120 
##$DBP= (0..7)
150 150 150 150 150 150 150 150 
##$DBP07= 0
##$DBPNAM0= <>
##$DBPNAM1= <>
##$DBPNAM2= <>
$$ [...]
##$SUBNAM7= <"">
##$SUBNAM8= <"">
##$SUBNAM9= <"">
##$SW= 20.6930455092707
##$SWIBOX= (0..15)
0 0 3 0 0 0 0 0 0 0 0 0 0 0 0 0 
##$SW_h= 5175.983436853
##$TD= 65536
##$TD0= 1
##$TE= 294.16
##$TE2= 300
##$TE3= 300
##$TEG= 300
##$TL= (0..7)
0 120 120 120 120 120 120 120 
##$TP= (0..7)
150 150 150 150 150 150 150 150 
##$TP07= 0
##$TPNAME0= <>
##$TPNAME1= <>
##$TPNAME2= <>
##$TPNAME3= <>
##$TPNAME4= <>
##$TPNAME5= <>
##$TPNAME6= <>
##$TPNAME7= <>
##$TPOAL= (0..7)
0.5 0.5 0.5 0.5 0.5 0.5 0.5 0.5 
##$TPOFFS= (0..7)
0 0 0 0 0 0 0 0 
##$TUNHIN= 0
##$TUNHOUT= 0
##$TUNXOUT= 0
##$USERA1= <user>
##$USERA2= <user>
##$USERA3= <user>
##$USERA4= <user>
##$USERA5= <user>
##$V9= 5
##$VALIST= <valist>
##$VCLIST= <CCCCCCCCCCCCCCC>
##$VD= 0
##$VDLIST= <DDDDDDDDDDDDDDD>
##$VPLIST= <PPPPPPPPPPPPPPP>
##$VTLIST= <TTTTTTTTTTTTTTT>
##$WBST= 1024
##$WBSW= 4
##$XGAIN= (0..3)
0 0 0 0 
##$XL= 0
##$YL= 0
##$YMAX_a= 602743
##$YMIN_a= -580762
##$ZGOPTNS= <>
##$ZL1= 120
##$ZL2= 120
##$ZL3= 120
##$ZL4= 120
##$ABSF1= 16.47983
##$ABSF2= -4.213343
##$ABSG= 5
##$ABSL= 3
##$ALPHA= 0
##$AQORDER= 0
##$ASSFAC= 0
##$ASSFACI= 0
##$ASSFACX= 0
##$ASSWID= 0
##$AUNMP= <proc_1d>
##$AZFE= 0.1
##$AZFW= 0.1
##$BCFW= 0
##$BC_mod= 0
##$BYTORDP= 0
##$COROFFS= 0
##$CY= 12.5
##$DATMOD= 1
##$DC= 0
##$DFILT= <>
##$DTYPP= 0
##$F1P= 14.0000005364418
##$F2P= -0.99999901652339
##$FCOR= 0.5
##$FTSIZE= 32768
##$FT_mod= 6
##$GAMMA= 0
##$GB= 0
##$INTBC= 1
##$INTSCL= 1
##$ISEN= 128
##$LB= 0.3
##$LEV0= 0
##$LPBIN= 0
##$MAXI= 10000
##$MC2= 0
##$MEAN= 0
##$ME_mod= 0
##$MI= 0
##$NCOEF= 0
##$NC_proc= -2
##$NLEV= 6
##$NOISF1= 0
##$NOISF2= 0
##$NSP= 0
##$NTH_PI= 0
##$NZP= 0
##$OFFSET= 16.47983
##$PC= 1
##$PHC0= 69.56937
##$PHC1= 6.814521
##$PH_mod= 1
##$PKNL= yes
##$PPARMOD= 0
##$PSCAL= 4
##$PSIGN= 0
##$REVERSE= no
##$SF= 250.13001054778
##$SI= 32768
##$SIGF1= 0
##$SIGF2= 0
##$SINO= 400
##$SIOLD= 32768
##$SREGLST= <1H.CDCl3>
##$SSB= 0
##$STSI= 32768
##$STSR= 0
##$SW_p= 5175.98343685301
##$SYMM= 0
##$S_DEV= 0
##$TDeff= 65536
##$TDoff= 0
##$TI= <Analysis number 999999
Compound Code 99
Book Reference 9
Project Code 9>
##$TILT= no
##$TM1= 0
##$TM2= 0
##$TOPLEV= 0
##$USERP1= <user>
##$USERP2= <user>
##$USERP3= <user>
##$USERP4= <user>
##$USERP5= <user>
##$WDW= 1
##$XDIM= 32768
##$YMAX_p= 337185093
##$YMIN_p= -77070
$$ End of Bruker specific parameters
$$ ---------------------------------
##NTUPLES= NMR SPECTRUM
##VAR_NAME=  FREQUENCY,     SPECTRUM/REAL,   SPECTRUM/IMAG
##SYMBOL=    X,             R,               I
##VAR_TYPE=  INDEPENDENT,   DEPENDENT,       DEPENDENT
##VAR_FORM=  AFFN,          ASDF,            ASDF
##VAR_DIM=   32768,         32768,           32768
##UNITS=     HZ,            ARBITRARY UNITS, ARBITRARY UNITS
##FACTOR=    0.157963299565203, 1,           1
##FIRST=     4122.09999875009, 0,            0
##LAST=      -1053.88343810292, 0,           0
##MIN=       -1053.88343810292, -77070,      0
##MAX=       4122.09999875009, 337185093,    0
$$ Real data points
##PAGE= N=1
##DATA TABLE= (X++(R..R)), XYDATA
$$ [...]
$$ plain form
19482 9447 8444 8062 7919 6688 3734 -1141 -1574 2509 2707 3575 4041 2450 3019 2268 -1491 -3187 -3559
19465 -3559 -2597 -1923 -2676 -2898 -4309 1635 3527 2471 -904 -947 -1329 -861 2010 675 -6 82 444 429
19447 429 -3097 -4421 -5696 -3591 -3319 -687 -1776 -3467 -459 1638 -1749 -1220 367 1380 -806
19432 -806 -1460 36 1639 -1064 -2055 -2386 -3375 -2271 1163 756 -315 2436 1053 -1882 -3334 -2803
19416 -2803 -2579 -2233 -2038 -1781 -1868 124 -1132 -1088 -2030 -3347 -2353 1194 4422 6889 7497 2119 1147 912
19398 912 2230 6872 7982 6561 5275 4416 3715 5696 4040 563 -1490 -3679 -4601 -5054 -3802 -4574
19382 -4574 -4249 -4050 -2078 -591 -2224 -4126 -5152 -5508 -3571 -6846 -6902 -7326 -7167 -6005 -2851 1519
19366 1519 2307 1328 -775 -1322 -1285 -1693 -3946 -3286 -2306 -1825 -4955 -3735 -1157 -1444 -1642 -4766 -4306 -6788
$$ packed form
19482I447j003l82j43j231k954m875m33M083J98Q68M66j591N69p51l759j696l72
19465c559R62O74p53k22j411N944J892j056l375m3l82M68K871j335o81Q8L62j5
19447D29l526j324j275K105K72K632j089j691L008K097l387N29J587J013k186
19432h06o54J496J603k703r91l31r89J104L434m07j071K751j383k935j452N31
19416b803K24L46J95K57q7J992j256M4r42j317R94L547L228K467O08n378r72k35
19398I12J318M642J110j421j286q59p01J981j656l477k053k189r22m53J252p72
19382d574L25J99J972J487j633j902j026l56J937l275n6m24J59J162L154M370
19366A519P88r79k103n47L7m08k253O60R80M81l130J220K578k87j98l124M60k482
$$ plain form
19348 -6788 -6660 -4896 -1010 -650 -1479 -3787 -4254 -3120 -3074 -3235 -3928 -3844 -3323 -1306 -247 -1523 -1136 -2262
19330 -2262 -2907 -3289 -2461 495 70 3384 1173 597 938 907 691 3197 5076 4362 3635 134 -1650
19313 -1650 -1265 -2716 -4186 -6858 -9329 -8106 -8939 -7028 -6233 -5544 -4696 -989 4408 6284 4101 2533
19297 2533 2065 4675 3310 917 -1664 -1973 -343 866 -4043 -2605 -771 -447 1763 1682 401 670
19281 670 3216 2762 -237 -1258 -1848 -1792 -2329 57 668 -111 -1196 1406 461 776 1868 2104 1156 437
19263 437 -1111 957 1560 1657 -1619 299 1335 1973 1161 -125 -2088 305 -1306 -1569 -1050 341 -758
19246 -758 -548 2034 6043 7200 5580 3374 1187 -4515 -6117 -5227 -5547 -4836 -2951 -1066 1709 -2267
19230 -2267 -1920 -1046 -192 509 1704 1132 -357 -310 -4146 -3600 547 1630 2473 5221 4501 2339 3407
$$ packed form
19348f788J28J764L886L60q29k308m67J134M6j61o93Q4N21K017J059j276L87j126
19330b262o45l82Q28K956m25L314k211n76L41l1k16K506J879p14p27l501j784
19313a650L85j451j470k672k471J223q33J911P95O89Q48L707N397J876k183j568
19297B533m68K610j365k393k581l09J630J209m909J438J834L24K210q1j281K69
19281F70K546m54k999j021n90N6n37K386O11p79j085K602r45L15J092K36r48p19
19263D37j548K068O03R7l276J918J036O38q12j286j963K393j611k63N19J391j099
19246g58K10K582M009J157j620k206k187n702j602Q90l20P11J885J885K775l976
19230b267L47Q74Q54P01J195n72j489M7l836N46M147J083Q43K748p20k162J068
$$ plain form
19213 3407 5239 6983 5652 5625 5903 6531 7853 2685 159 202 -2818 -4352 -5349 -1789 1128 -1344
19197 -1344 -1882 -732 -2704 -3277 -718 3112 138 -4199 -5211 -3325 -2663 -102 1331 -860 -2007
19182 -2007 -3751 -2489 387 690 1068 2457 65 -554 -4572 -6252 -4803 -393 -446 -2543 -3657 -3197
19166 -3197 -2994 -2747 -1405 -4368 -4135 -1626 531 -959 236 2401 2798 3362 2330 -957 -4101 -1968
19150 -1968 786 -369 -3115 -1874 -705 14 -743 85 -951 -1181 -2703 -3756 -4819 -6422 -6790 -9380
19134 -9380 -4335 -1729 -1140 -842 1999 3233 1718 -1379 -991 2203 1221 272 44 -207 -1113 -1933 -2585
19117 -2585 -6483 -10491 -9575 -5160 -4247 -2800 -1881 -5324 -4791 -5206 -6004 -2561 -2413 -4362 -6470 -3903
19101 -3903 -317 -2984 -3583 681 -425 -2109 -1783 -2941 -2654 -2768 -1114 2768 -238 -3152 -6273 -7112
$$ packed form
19213C407J832J744j331k7K78O28J322n168k526M3l020j534r97L560K917k472
19197a344n38J150j972n73K559L830k974m337j012J886O62K561J433k191j147
19182b007j744J262K876L03L78J389k392o19m018j680J449M410n3k097j114M60
19166c197K03K47J342k963K33K509K157j490J195K165L97N64j032l287l144K133
19150a968K754j155k746J241J169P19p57Q28j036k30j522j053j063j603l68k590
19134i380N045K606N89K98K841J234j515l097L88L194r82r49k28k51r06q20o52
19117b585l898m008R16M415R13J447R19l443N33m15p98L443J48j949k108K567
19101c903L586k667n99M264j106j684L26j158K87j14J654L882l006k914l121q39
$$ plain form
19085 -7112 -3629 -3433 -1139 1333 808 1709 -466 -425 712 2611 3126 4256 5030 3823 1452 -1758
19069 -1758 -2789 -1275 -450 2454 5502 3462 1066 702 1236 -438 -1717 -1271 -549 -1293 -4522 -7777
19053 -7777 -7210 -4716 -3114 -1633 371 275 -2408 -772 -2428 -3320 -553 2667 1962 3538 1959 -2227
19037 -2227 -2326 1633 2786 4503 4423 5678 6949 5028 1543 -265 -2086 -2829 -2312 -3815 -4823 -2703
19021 -2703 -2022 -37 9 873 1383 2958 3144 2851 1620 528 1678 -3508 -3214 -2588 -2820 -818 1577
19004 1577 1176 2897 3039 3072 354 -2550 -2922 -417 -84 -1485 -1 -1594 -5485 -8229 -10642 -7514
18988 -7514 -5267 -2304 866 1934 65 1101 -1554 304 3556 3891 102 -3422 -26 -373 -3385
18973 -3385 -4133 -5284 -3711 1177 5005 181 -3647 -4281 -3894 -4627 -6025 -3260 262 517 -320 1761
$$ packed form
19085g112L483J96K294K472n25R01k175M1J137J899N15J130P74j207k371l210
19069a758j031J514Q25K904L048k040k396l64N34j674j279M46P22p44l229l255
19053g777N67K494J602J481K004r6k683J636j656q92K767L220p05J576j579m186
19037b227r9L959J153J717q0J255J271j921l485j808j821p43N17j503j008K120
19021b703O81J985M6Q64N10J575J86k93j231j092J150n186K94O26k32K002K395
19004A577m01J721J42L3k718k904l72K505L33j401J484j593l891k744k413L128
18988g514K247K963L170J068j869J036k655J858L252L35l789l524L396l47l012
18973c385p48j151J573M888L828m824l828o34L87p33j398K765L522K55q37K081
$$ plain form
18957 1761 -6 -476 -13 3806 6785 9888 7153 2710 5350 2943 2661 -153 -3759 -1622 994
18942 994 -1784 139 -187 -5348 -8397 -4639 -1830 -3358 -3443 -5109 -6618 -3540 -596 -250 -987 -1515
18926 -1515 -2105 -2206 460 1816 2336 2759 2839 51 910 -1387 -1358 2750 1667 44 268 -2335 322
18909 322 3050 1185 603 -51 -700 -573 -1487 -1594 -2547 -3099 -1566 726 -916 667 2195 3717 4636
18892 4636 4450 7884 6770 4932 5510 5094 2491 851 1288 1412 1720 2036 3766 3077 3147 3750 6432
18875 6432 7307 5762 3912 1810 1675 1766 -296 -2128 -3989 -2173 -948 1744 2517 393 1699 819
18859 819 -1541 -2281 -3016 -3361 -614 1097 434 -135 -274 3547 5049 2985 1336 1304 1787 -219 -469
18842 -469 1869 1372 1090 2539 4196 4787 5626 2374 -2228 238 413 -1241 -2320 -2935 -5020 -7055
$$ packed form
18957A761j767m70M63L819K979L103k735m443K640k407k82k814l606K137K616
18942I94k778J923l26n161l049L758K809j528q5j666j509L078K944L46p37n28
18926a515n90j01K666J356N20M23Q0k788Q59k297K9M108j083j623K24k603K657
18909C22K728j865n82o54o49J27r14j07r53n52J533K292j642J583J528J522R19
18892D636j86L434j114j838N78m16k603j640M37J24L08L16J730o89P0O03K682
18875F432Q75j545j850k102j35R1k062j832j861J816J225K692P73k124J306q80
18859H19k360p40p35l45K747J711o63n69j39L821J502k064j649l2M83k006k50
18842d69K338m97k82J449J657N91Q39l252m602K466J75j654j079o15k085k035
$$ plain form
18826 -7055 -4662 -4046 -3689 -1061 1075 1175 3291 2928 1096 -1467 936 996 -1853 -2030 -1896 -886 -343
18809 -343 -1315 -3474 -2115 -3007 -1458 2434 2967 2238 2110 -1198 -7452 -9520 -4864 1027 3399 2966
18793 2966 2056 -685 -4925 -4189 -3944 -2063 1176 166 986 1760 4 -294 -3789 -5204 -2418 -778
18777 -778 -752 -960 1903 4600 7818 12754 24786 43603 44417 30778 19338 11399 5686 2818 4788
18762 4788 6266 6076 -488 -89 3289 987 325 571 2115 2992 2066 -2006 -354 1018 -207 1259
18746 1259 -1931 -1147 -718 -1433 -1370 2425 4676 2441 -2490 -2050 -1060 -475 -236 -850 -726 -666 -4571 -10384
18728 -10384 -8811 -6469 -2644 -2070 -1753 -1055 -1286 -869 -339 375 -709 -3477 -716 947 -2677 -6186
18712 -6186 -4417 -5066 -8961 -8457 -8888 -7137 -6500 -3601 -434 222 30 38 -101 -1027 -1931 -2008 -93 4520
$$ packed form
18826g055K393O16L57K628K136J00K116l63j832k563K403O0k849j77J34J010N43
18809c43r72k159J359q92J549L892N33p29j28l308o254k068M656N891K372m33
18793B966r10k741m240P36K45J881L239j010Q20P74j756k98l495j415K786J640
18777g78K6k08K863K697L218M936J2032J8817Q14j3639j1440p939n713k868J970
18762D788J478j90o564L99L378k302o62K46J544Q77r26m072J652J372j225J466
18746A259l190P84M29p15O3L795K251k235m931M40R90N85K39o14J24O0l905n813
18728a0384J573K342L825N74L17O98k31M17N30P14j084k768K761J663l624l509
18712f186J769o49l895N04m31J751O37K899L167O56j92Qj39r26r04p7J915M613
$$ plain form
18694 4520 2849 1699 -3895 -5901 -8336 -7067 -6095 -7004 -6887 -2991 -849 -563 -1945 -931 -3572 -4945
18678 -4945 -3149 -2638 -4813 -6188 -4386 -2780 -6022 -6587 -5239 -2412 -999 -3267 -4052 -1641 -1604 -1720
18662 -1720 -1749 -845 -489 -1423 -468 1232 329 -196 1701 2244 1696 -187 246 -1968 -433 822 3712
18645 3712 4798 487 -3867 -2170 -469 1386 2346 1268 -645 1529 661 291 -612 -1362 -73 -1827
18629 -1827 -3159 -5035 -4909 -2074 -702 -3366 -5536 -9526 -8297 -5695 -6516 -6265 -5361 -3987 -3307 -2207
18613 -2207 -2883 -5602 -5704 -3812 -345 932 2862 2752 -2848 -4007 -1001 -1240 -2946 -601 537 1684
18597 1684 844 -1852 -531 -2491 -1931 -1393 -1244 -1283 -1026 -1180 -1716 -2790 -2525 1015 -1211 1337 -377
18580 -377 -3737 -1954 579 1325 -925 -1673 -3189 -2772 -2927 -3468 -1172 -661 1610 3036 675 -13 2478
$$ packed form
18694D520j671j150n594k006k435J269R72r09J17L896K142K86j382J014k641j373
18678d945J796N11k175j375J802J606l242n65J348K827J413k268p85K411L7j16
18662a720k9R04L56r34R55J700r03n25J897N43n48j883M33k214J535J255K890
18645C712J086m311m354J697J701J855R60j078j913K174q68l70r03p50J289j754
18629a827j332j876J26K835J372k664k170l990J229K602q21K51R04J374O80J100
18613b207o76k719j02J892L467J277J930j10n600j159L006k39j706K345J138J147
18597A684q40k696J321j960N60N38J49l9K57j54n36j074K65L540k226K548j714
18580c77l360J783K533P46k250p48j516M17j55n41K296N11K271J426k361o88K491
$$ plain form
18563 2478 -1742 -85 2525 2247 1230 -825 -4084 -2343 -3985 -5533 -5096 -1814 -4704 -5598 -2247
18548 -2247 -1695 183 4008 5452 3887 -1329 -4196 -1955 -3322 -3172 -2406 -762 -770 1890 2555 -1331
18532 -1331 -4620 -4872 -3198 -4155 -3092 456 1163 156 -51 1563 -542 -1363 -2097 664 1232 -1028
18516 -1028 -4615 -2996 -2641 -4894 -5641 -6431 -6909 -7888 -7229 -5440 -3847 -1620 1726 4506 5356 3477
18500 3477 -963 656 4086 6640 6613 2576 -2496 -7427 -5913 -4722 -7418 -4530 -277 -348 -369 188
18484 188 2339 2459 -916 -210 2090 2527 316 -959 79 1055 2084 4308 4085 1469 608 -421
18468 -421 -1277 -1450 -2655 -4273 -6718 -6202 -6991 -4374 -1461 175 -2429 -1323 -3720 -1040 700 -1372
18452 -1372 -1547 -3305 -1988 1817 5631 5690 3654 2875 3159 1300 1939 6616 5720 4414 5499 6586
$$ packed form
18563B478m220J657K610k78j017k055l259J741j642j548M37L282k890q94L351
18548b247N52J878L825J444j565n216k867K241j367J50P66J644qK660O65l886
18532a331l289k52J674r57J063L548P07j007k07J614k105q21p34K761N68k260
18516a028l587J619L55k253p47p90m78r79O59J789J593K227L346K780Q50j879
18500C477m440J619L430K554k7m037n072m931J514J191k696K888M253p1k1N57
18484A88K151J20l375P06K300M37k211j275J038R76J029K224k23k616q61j029
18468d21q56j73j205j618k445N16p89K617K913J636k604J106k397K680J740k072
18452a372j75j758J317L805L814N9k036p79K84j859O39M677q96j306J085J087
$$ plain form
18436 6586 4374 2095 1550 4475 5636 3374 1382 2043 3197 -1921 -3517 -3613 -2702 -1648 -988 921
18420 921 1369 -4508 -9113 -8515 -5867 -6031 -2925 -1131 -3947 -4677 -3369 -2744 -2132 -78 -1425 -3499
18404 -3499 -2640 824 1207 364 -5266 -7605 -6650 -4989 -3317 -1456 -3187 -1435 -530 -254 -2296 -797
18388 -797 1179 4520 7033 6211 1602 -3036 -1270 2084 2182 1971 684 -3343 -4707 -5674 -2800 -152
18372 -152 393 1840 831 493 -2525 -2892 -1515 -1788 -2727 -3818 -3278 -4076 -2232 4054 4500 2737 2
18355 2 -862 -54 2080 956 694 79 177 -2303 -4595 -5979 -6013 -6486 -4621 -6734 -8530 -7669 -6155 -3756
18337 -3756 -2778 -832 -1917 -2535 -2860 -169 2461 4055 5232 3521 3269 2241 1023 -161 -1064 -1597
18321 -1597 -3868 -3928 -2847 -3568 -5008 -2768 -164 25 1998 1621 1953 4254 7059 9502 9683 8669
$$ packed form
18436F586k212k279n45K925J161k262j992O61J154n118j596r6R11J054O60J909
18420I21M48n877m605N98K648j64L106J794k816p30J308O25O12K054j347k074
18404c499Q59L464L83q43n630k339R55J661J672J861j731J752R05K76k042J499
18388g97J976L341K513q22m609m638J766L354R8k11j287m027j364r67K874K648
18372a52N45J447j009l38l018l67J377k73r39j091N40p98J844O286M46j763k735
18355Bq64Q08K134j124k62o15R8k480k292j384l4m73J865k113j796Q61J514K399
18337c756R78J946j085o18l25K691K630J594J177j711k52j028j218j184r03n33
18321a597k271o0J081p21j440K240K604J89J973l77L32K301K805K443J81j014
$$ plain form
18305 8669 4241 5022 5403 4942 1850 -508 1394 4893 6550 4308 261 -3171 -1514 -3684 -5124
18290 -5124 -1243 -888 -2166 -632 2249 2365 1372 542 -438 2876 2046 1732 -642 244 -689 -2121 -454
18273 -454 3281 959 -1623 1698 7660 6220 1434 2116 2940 4061 2592 -327 -1062 -773 -4511 -3320
18257 -3320 262 2786 3532 2382 -142 381 2245 2988 3241 1551 330 -1693 -1983 -1586 793 3462
18241 3462 4791 6186 6717 6376 6263 6035 3598 1492 2122 3209 4873 5962 4940 6071 6254 6958
18225 6958 9005 10437 5771 3301 3135 5993 7683 6481 3659 1581 5416 7956 4298 2312 2484
18210 2484 5458 7391 6245 2957 1418 -792 2131 1510 20 -3051 -4101 -2546 -552 489 229
18195 229 3367 4768 3936 638 -1363 1609 3691 5098 5847 8901 9118 9114 8478 4909 3686 990 3165
$$ packed form
18305H669m428P81L81m61l092k358J902L499J657k242m047l432J657k170j440
18290e124L881L55j278J534K881J16r93q30r80L314q30l14k374Q86r33j432J667
18273d54L735k322k582L321N962j440m786O82Q24J121j469k919p35K89l738J191
18257c320L582K524P46j150k524N23J864P43K53j690j221k023k90L97K379K669
18241C462J329J395N31l41j13k28k437k106O30J087J664J089j022J131J83P04
18225F958K047J432m666k470j66K858J690j202k822k078L835K540l658j986J72
18210B484K974J933j146l288j539k210K923o21j490l071j050J555J994J041k60
18195B29L138J401q32l298k001K972K082J407P49L054K17mo36l569j223k696K175
$$ plain form
18178 3165 4207 5251 5520 3543 3143 869 -3588 318 244 1833 4931 7210 9665 8997 8124 3742
18162 3742 2357 3411 1214 2725 2736 -119 2326 6394 9261 10222 10309 9880 8154 11948 13897 13579
18146 13579 11870 10866 10156 12073 11478 12867 12631 15959 16722 20570 26345 26841 19621 19248 24188 35624
18130 35624 39542 44451 48657 57226 67825 80752 91278 103454 122252 146353 178258 215778
18118 215778 269693 348989 467984 656002 1000924 1661214 2957917 5287690 8241196
18109 8241196 8040967 4969250 2754295 1687941 1155820 846543 646509 505586 403562
18100 403562 331005 276700 228928 188925 159223 137911 123456 109379 94007 80926 68244
18089 68244 60135 56993 56654 51523 45221 39255 39511 37555 34842 30736 26306 22866 23533 22226 20718
$$ packed form
18178C165J042J044K69j977m00k274m457L906p4J589L098K279K455o68q73m382
18162C742j385J054k197J511J1k855K445M068K867R61Q7m29j726L794J949l18
18146A3579j709j004p10J917n95J389k36L328P63L848N775M96p220l73M940J1436
18130C5624L918M909M206Q569J0599J2927J0526J2176J8798K4101L1905L7520
18118B15778N3915P9296J18995J88018L44922O60290J296703K329773K953506
18109H241196k00229l071717k214955j066354n32121l09277k00034j40923j02024
18100D03562p2557n4305m7772m0003k9702k1312j4455j4077j5372j3081j2682
18089F8244q109l142l39n131o302n966K56j956k713m106m430l440O67j307j508
$$ plain form
18074 20718 19629 18285 19177 18328 18142 17627 16565 14556 11227 14288 15338 13936 11414 5836 4471
18059 4471 5461 4261 5961 4589 6626 6886 8532 9495 8474 6642 5931 7715 7393 3545 2970 3433
18043 3433 4901 6697 7576 6333 2518 -2631 -7627 -9542 -7267 -5214 -3689 -2753 -1030 1562 2551
18028 2551 722 3083 6520 7246 4723 1189 3146 1919 109 447 5306 9982 9808 4617 3100
18013 3100 3243 3483 3432 3080 3051 5211 3858 3244 3575 2187 -1231 -3584 -3008 1097 1264 1560 -1477 -2498
17995 -2498 -447 251 2599 1057 -942 -454 -749 820 3489 3106 2830 -1115 -1824 80 2140 -1368
17979 -1368 -2080 -1924 -2647 -81 1112 -205 1601 6189 6379 3483 3174 3116 6053 8210 6282 7535
17963 7535 5457 -3 -1534 -1013 30 1049 2067 906 -1316 -2952 -2326 -2553 -3050 -2076 -2739 -4137
$$ packed form
18074B0718j089j344Q92q49j86n15j062k009l329L061J050j402k522n578j365
18059D471R90j200J700j372K037K60J646R63j021j832p11J784l22l848n75M63
18043C433J468J796Q79j243l815n149m996j915K275K053J525R36J723K592R89
18028B551j829K361L437P26k523l534J957j227j810L38M859M676j74n191j517
18013C100J43K40n1l52k9K160j353o14L31j388l418k353N76M105J67K96l037j021
17995b498K051O98K348j542j999M88k95J569K669l83k76l945p09J904K060l508
17979a368p12J56p23K566J193j317J806M588J90k896l09n8K937K157j928J253
17963G535k078n460j531N21J043J019J018j161k222j636O26k27m97R74o63j398
$$ plain form
17947 -4137 -3982 -1381 -1385 -3654 -4305 -6248 -5321 -4091 -16 280 -96 -750 209 1762 3755 4216 3652 1156
17929 1156 -3217 -5475 -371 7732 8207 4482 5822 4631 753 -316 2207 2915 3275 6736 6129 4769
17913 4769 4149 3572 1547 -1438 -1944 873 2186 1085 -1041 -2886 -1646 -622 -3660 -6726 -6547 -5662
17897 -5662 172 2685 96 -401 2080 742 1903 -452 -2059 -2886 -2481 -935 1494 1868 -178 -370
17881 -370 -1988 -3821 -5129 -4358 -3024 -2081 -2144 -232 -481 -1651 1131 3260 175 -2974 -3116 -678
17865 -678 694 -1536 -2323 354 144 2380 1026 82 1423 574 2307 3714 2417 -180 -2174 -2569
17849 -2569 -1316 32 2943 2704 5130 7689 6273 2904 -2738 -2286 -2709 -5421 -3515 -553 -304 -401
17833 -401 -1610 -2025 1910 -1255 -271 3144 1432 -4563 -3248 -3982 -6559 -8140 -3945 -4566 -5824 -7400
$$ packed form
17947d137J55K601mk269o51j943R27J230M075K96l76o54R59J553J993M61n64k496
17929A156m373k258N104Q103M75l725J340j191l878j069K523P08L60L461o07j360
17913D769o20n77k025k985n06K817J313j101k126j845J240J024l038l066J79Q85
17897e662N834K513k589m97K481j338J161k355j607q27M05J546K429L74k046j92
17881c70j618j833j308P71J334R43o3J912k49j170K782K129l085l149j42K438
17865f78J372k230p87K677k10K236j354r44J341q49J733J407j297k597j994l95
17849b569J253J348K911k39K426K559j416l369n642M52m23k712J906K962K49r7
17833d01j209m15L935l165R84L415j712n995J315p34k577j581M195o21j258j576
$$ plain form
17817 -7400 -9004 -4736 -2000 -395 -37 -3384 -6878 -6296 -5043 -3803 -3038 -758 3306 2632 -148 -1945
17801 -1945 -2331 -3566 -4004 -4779 -4279 -6071 -3087 -1760 -3664 -3314 -6356 -5521 -3092 -2531 -755 -196 -3463
17784 -3463 -7109 -5785 -7258 -6023 964 2220 -1170 -4056 -2876 526 -1380 -1524 160 -94 -1109
17769 -1109 -2625 -3357 71 2859 2938 561 -4746 -6937 -11400 -12450 -8120 -3082 -861 -1827 -443 -937
17753 -937 -659 -2562 -1481 -1518 -1149 -206 907 3431 4878 4568 5763 4594 -1776 -5308 -5205 -3121 -6344
17736 -6344 -4522 -3211 -2545 -784 -2692 -6251 -8924 -7710 -5185 -2509 -2500 -3270 -1297 -1751 -3973 -2324
17720 -2324 534 7061 7588 4622 801 1216 3818 2633 -1675 275 2623 73 1105 1361 -1442
17705 -1442 -2468 -4537 -5287 -1737 -365 -566 -2895 -5528 -5413 -4277 -5007 -4204 -3152 -2016 -1074 -3531
$$ packed form
17817g400j604M268K736J605L58l347l494N82J253J240P65K280M064o74k780j797
17801a945l86j235m38p75N00j792K984J327j904L50l042Q35K429N61J776N59l267
17784c463l646J324j473J235O987J256l390k886J180L402j906j44J684k54j015
17769a109j516p32L428K788P9k377n307k191m463j050M330N038K221r66J384m94
17753i37K78j903J081l7L69R43J113K524J447l10J195j169o370l532J03K084l223
17736f344J822J311O66J761j908l559k673J214K525K676Rp70J973m54k222J649
17720b324K858O527N27k966l821M15K602j185m308J950K348k550J032K56k803
17705a442j026k069p50L550J372k01k329k633J15J136p30Q03J052J136R42k457
$$ plain form
17689 -3531 -4167 -4295 -2345 -2638 -3895 -3242 -1739 -2640 -5086 -4036 -3356 -5543 -5089 -5492 -5154 -6393 -4984
17672 -4984 -4820 -6663 -9243 -8677 -6831 -6719 -1767 499 -2016 -394 2655 -656 -2844 -4713 -4182 -309
17656 -309 2995 4098 3594 1466 1838 1219 1218 929 504 -16 2862 3469 -2147 -4767 -3105 -4006 -2825 -1756
17638 -1756 337 1395 3740 1564 -2101 -3625 -2957 -1909 -2583 933 3109 4048 4708 6109 3493 3323
17622 3323 8246 5273 1846 -442 970 2165 1550 554 1005 2406 4402 594 -331 -2535 -4932 -6016
17606 -6016 -3333 -1326 -2388 -2963 -4729 -6486 -2097 359 -29 665 -537 -2484 -3682 -4449 -3264 -3397
17590 -3397 -3797 -2048 -2342 -2911 -2474 -1928 -1985 -615 1855 869 1405 412 1116 -1727 -1866 481 0 2204
17572 2204 2984 3590 4358 3918 796 219 99 -2312 -3787 -1771 -2508 -3703 -2160 -3163 -3505 -6265 -7575
$$ packed form
17689c531o36j28J950k93j257O53J503r01k446J050O80k187M54m03L38j239J409
17672d984J64j843k580N66J846J12M952K266k515J622L049l311k188j869N31L873
17656c09L304J103n04k128L72o19jk89m25n20K878O07n616k620J662r01J181J069
17638a756K093J058K345k176l665j524O68J048o74L516K176R39O60J401k616j70
17622C323M923k973l427k288J412J195o15r96M51J401J996l808r25k204k397j084
17606f016K683K007j062n75j766j757M389K456l88O94j202j947j198p67J185j33
17590c397m00J749k94n69M37N46n7J370K470r86N36r93P04k843j39K347m81K204
17572B204P80O06P68m40l122n77j20k411j475K016p37j195J543j003l42k760j310
$$ plain form
17555 -7575 -5312 -2687 -1842 -855 -3150 -3698 695 1185 -1364 -3744 -7240 -3387 -3228 -5880 -6778 -5393
17539 -5393 -2414 -1969 -1740 -747 -2004 -5072 -5741 -6868 -10205 -6785 -5265 -6588 -7075 -3730 -994 -2434
17523 -2434 -7446 -7499 -4251 -4998 -5824 -2985 240 806 -651 -4132 -6171 -5316 -5293 -5764 -2506 -3886 -3945
17506 -3945 -3731 -3725 -5029 -4404 -5136 -6194 -7577 -2081 -323 -1693 -2638 139 1432 -106 -2329 201
17490 201 418 -5015 -4039 -3546 -2744 -827 622 1510 2288 6214 6945 1927 -1591 -2258 -3064 -6413 -4399
17473 -4399 -2386 -1865 -3952 -4573 -5411 -5150 -6038 -4183 -1241 1339 -984 -5380 -4777 -472 -1922 -4493
17457 -4493 -5894 -5978 -4848 -4809 -7327 -9071 -6930 -6810 -6881 -4567 -5866 -5056 2374 7945 16759 30788
17441 30788 37096 25729 12979 3279 -3359 -5747 -2510 2203 415 -526 -2611 -4270 -1625 1054
$$ packed form
17555g575K263K625Q45R87k295n48M393M90k549k380l496L853J59k652q98J385
17539e393K979M45K29R93j257l068o69j127l337L420J520j323m87L345K736j440
17523b434n012n3L248p47q26K839L225N66j457l481k039Q55K3m71L258j380n9
17506c945K14Oj304O25p32j058j383N496J758j370r45K777J293j538k223K530
17490B01K17n433R76M93Q02J917J449Q88P78L926P31n018l518o67q06l349K014
17473d399K013N21k087o21q38K61q88J855K942K580k323m396O03M305j450k571
17457d493j401q4J130L9k518j744K141J20p1K314j299Q10P430N571Q814J4029
17441C0788O308j1367j2750r700o638k388L237M713j788r41k085j659K645K679
$$ plain form
17427 1054 -570 299 210 -4100 -4582 -1942 -1437 -4098 -5072 -5573 1008 6416 5543 3277 -4698 -7022 -6764
17410 -6764 -8441 -6340 -2761 -3478 -3872 -2854 -4255 -5838 -2835 -917 -3215 -2717 -2970 -4408 -7608 -8318
17394 -8318 -5539 -4804 -9791 -12402 -7007 -5112 -6750 -6355 -8761 -7116 -6972 -4774 -2536 -948 1415
17379 1415 -3724 -8893 -6645 -3914 -3886 -2693 -1299 -2262 -3798 -3952 -3394 -1587 -2605 -2382 -5021 -6951
17363 -6951 -5600 -2305 -3184 -3224 -1284 534 -1210 -3685 -5696 -3546 -909 1318 1115 169 1019 -1192
17347 -1192 -4463 -6131 -5216 -3042 -2096 -710 -932 -1552 1211 1014 -4020 -3393 733 -733 -95 1214
17331 1214 1768 -1551 -2377 -3539 -585 2448 1996 328 488 -1196 -1747 -606 -122 -90 -455 -801 -1791
17314 -1791 -3869 -6485 -9912 -8358 -7293 -5940 -6765 -8563 -7451 -7870 -6639 -3081 -4788 -3652 -1346
$$ packed form
17427A054j624Q69q9m310m82K640N05k661r74n01O581N408q73k266p975k324K58
17410f764j677K101L579p17l94J018j401j583L003J918k298M98k53j438l200p10
17394h318K779P35m987k611N395J895j638L95k406J645J44K198K238J588K363
17379A415n139n169K248K731K8J193J394r63j536j54N58J807j018K23k639j930
17363f951J351L295q79m0J940J818j744k475k011K150K637K227k03r46Q50k211
17347a192l271j668R15K174R46J386k22o20K763j97n034O27M126j466O38J309
17331A214N54l319q26j162K954L033m52j668J60j684n51J141M84L2l65l46r90
17314a791k078k616l427J554J065J353q25j798J112m19J231L558j707J136K306
$$ plain form
17299 -1346 -1926 -4773 -3066 -2062 -3759 -3342 -4716 -3652 -775 1435 4781 6553 4966 1766 3223
17284 3223 4278 2828 -554 -2493 -3915 -3871 -3256 -6294 -7472 -8268 -6836 -2368 -1979 -4248 -2344 1036
17268 1036 1559 -379 -2132 -85 3853 2719 -2652 -5950 -5221 -5859 -6490 -1965 1301 2120 3348 2432
17252 2432 -300 -188 1639 -1767 -1565 2116 4129 2957 1311 -1039 -4423 -7428 -10390 -8205 -2249
17237 -2249 -2494 -5345 -7651 -7107 -5715 -6781 -8290 -7482 -5924 -6363 -1189 82 -1498 -2576 -1633 -1831
17221 -1831 -557 365 1557 1682 527 -746 226 163 -394 -3032 -2016 -1111 -475 333 -449 -1596 -2328
17204 -2328 -3317 -5587 -8893 -5883 -3157 -652 -4800 -7746 -5653 -266 1946 217 -2787 -2206 -998
17189 -998 -91 -3149 -4889 -5217 -6485 -5739 -5817 -5656 -7544 -7246 -5655 -1645 18 392 114 -2326 -3694
$$ packed form
17299a346n80k847J707J004j697M17j374J064K877K210L346J772j587l200J457
17284C223J055j450l382j939j422M4O15l038j178p96J432M468L89k269J904L380
17268A036N23j938j753K047L938j134n371l298P29o38o31M525L266Q19J228r16
17252B432k732J12J827l406K02L681K013j172j646k350l384l005k962K185N956
17237b249k45k851k306N44J392j066j509Q08J558m39N174J271j580j078R43j98
17221a831J274R22J192J25j155j273R72o3n57k638J016R05O36Q08p82j147p32
17204b328r89k270l306L010K726K505m148k946K093N387K212j729l004N81J208
17189i98R07l058j740l28j268P46p8J61j888K98J591M010J663L74k78k440j368
$$ plain form
17172 -3694 -2608 -1847 -434 335 2240 1619 4562 3421 1329 -3764 -10068 -6898 -3949 -1565 -118
17157 -118 -1593 -4050 -2788 -1258 -2386 -5413 -8532 -8260 -4648 -6996 -3160 117 -1950 -587 -3837
17142 -3837 -6302 -5483 -4812 -1908 22 2222 5893 7966 3285 -91 999 1179 446 311 1354 988
17126 988 1941 -902 -6399 -8705 -8321 -6797 -3609 -4943 -2212 1207 51 919 4609 3334 -245 -2910
17110 -2910 -881 -1947 -3673 597 870 -1277 1118 4453 2469 2491 1224 -490 -317 -2861 -2710 -2214
17094 -2214 -3649 -4827 -4790 -6700 -9281 -8832 -5082 -553 -148 -2479 -2984 -3200 -3002 -4792 -5048 -4294 -5198
17077 -5198 -5636 -2132 -1939 -484 -1730 -3927 -889 -133 -2594 -1394 -422 2626 476 -4243 -3059 461
17061 461 873 -952 -1853 -3231 -4485 -5870 -5771 -1633 624 1059 3072 -559 -373 612 1955 -106 -2112
$$ packed form
17172c694J086P61J413P69J905o21K943j141k092n093o304L170K949K384J447
17157a18j475k457J262J530j128l027l119K72L612k348L836L277k067J363l250
17142c837k465Q19O71K904J930K200L671K073m681l376J090J80p33j35J043l66
17126I88R53k843n497k306L84J524L188j334K731L419j156Q68L690j275l579k665
17110b910K029j066j726M270K73k147K395L335j984K2j267j714J73k544J51M96
17094b214j435j178L7j910k581M49L750M529M05k331n05k16J98j790k56P54r04
17077e198m38L504J93J455j246k197L038P56k461J200R72L048k150m719J184L520
17061D61M12j825r01j378j254j385R9M138K257M35K013l631J86R85J343k061k006
$$ plain form
17044 -2112 -2393 -1530 1076 3610 3095 1859 198 1507 2848 2922 -837 -210 -2419 -1891 376 -264 -2414
17027 -2414 -1954 -3291 -7303 -8426 -6825 -4561 -3847 -1881 -356 271 1107 1155 383 -1809 343 1563
17011 1563 462 1624 3231 1503 2367 1083 -2000 -5471 -2751 -1234 -3085 -1491 -1950 -3337 -888
16996 -888 -1409 -3048 -7299 -6611 -6218 -4771 -4051 -4460 -4324 -3128 -6240 -9012 -6427 -3855 -778 1012
16980 1012 -1887 -3575 -5762 -3107 1970 1545 1381 -263 -631 609 495 1211 -4367 -6395 -6624 -4632
16964 -4632 -2767 -5082 -6502 -8681 -7675 -6451 -3326 -1818 -2327 -4406 -4839 -2487 -601 30 2266
16949 2266 -3304 -5166 -4868 252 981 -2938 -2495 -2853 -3900 -1933 1982 3194 1112 -2515 -3384 -4499
16933 -4499 -2678 580 -649 -3819 -4084 -4019 -2196 -2689 -2503 -4512 -3427 -1926 -128 438 51 -817 2442
$$ packed form
17044b112k81Q63K606K534n15j236j661J309J341P4l759O27k209N28K267o40k150
17027b414M60j337m012j123J601K264P14J966J525O27Q36M8p72k192K152J220
17011A563j101J162J607j728Q64j284l083l471K720J517j851J594m59j387K449
16996h88n21j639m251O88L93J447P20m09J36J196l112k772K585K572L077J790
16980A012k899j688k187K655N077m25j64j644l68J240j14P16n578k028k29J992
16964d632J865k315j420k179J006J224L125J508n09k079m33K352J886O31K236
16949B266n570j862K98N120P29l919M43l58j047J967L915J212k082l627q69j115
16933d499J821L258j229l170k65O5J823m93J86k009J085J501J798N66l87q68L259
$$ plain form
16916 2442 1553 1685 3201 5812 6543 7434 3108 -461 -794 -2352 -1224 -2850 -2721 -2248 -2216 -1807 -3310
16899 -3310 -4627 -6072 -11168 -12297 -8891 -6325 -3834 -2377 241 1447 2352 2565 1861 1915 -1149 1465
16883 1465 3035 2365 596 -2802 302 1968 3899 6224 2110 -230 -2367 -4111 -6164 -7258 -5471
16868 -5471 -4669 -5139 -6144 -3688 -1424 -1204 -962 1276 -1148 -270 -1091 -5543 -5270 -4103 -1940 -1333 -5715
16851 -5715 -7771 -4591 -4292 -4210 -2509 -6001 -4259 -4993 -4215 -6250 -5502 -5542 -4986 -4605 -5322 -7073 -5773
16834 -5773 -4179 -6001 -5920 -3927 -1653 489 -1837 -4024 -645 987 1582 -448 -3175 -7395 -10333
16819 -10333 -9746 -8372 -6415 -3719 -2294 -4641 -10646 -10874 -5000 -1207 308 -934 -4458 -6420 -5604
16804 -5604 -3762 -3482 -879 -863 -1624 -1232 1599 2453 1708 -2128 -655 5093 5240 6461 9398 9250 11637
$$ packed form
16916B442q89J32J516K611P31Q91m326l569l33j558J128j626J29M73L2M09j503
16899c310j317j445n096j129L406K566K491J457K618J206R05K13p04N4l064K614
16883A465J570o70j769l398L104J666J931K325m114k340k137j744k053j094J787
16868e471Q02m70j005K456K264K20K42K238k424Q78q21m452K73J167K163O07m382
16851e715k056L180K99Q2J701l492J742p34P78k035P48m0N56L81p17j751J300
16834e773J594j822Q1J993K274K142k326k187L379J632N95k030k727m220k938
16819a0333N87J374J957K696J425k347o005k28N874L793J515j242l524j962Q16
16804e604J842K80K603J6p61L92K831Q54p45l836J473N748J47J221K937j48K387
$$ plain form
16787 11637 12944 10693 12156 11968 7316 2016 -1811 -1374 2404 5472 5689 5263 2606 -1879 -4436
16772 -4436 -3108 -3089 -7740 -6854 -845 4830 2794 -760 -2337 -2877 -555 -3258 -5283 -3612 -3336 -1585
16756 -1585 3935 5283 4334 -243 -656 -1355 293 -447 3197 3832 1595 34 1222 -249 -587 448
16740 448 60 2614 1783 1648 1839 1897 3349 1573 1985 824 2060 3245 3228 2127 1391 1405 1201 827
16722 827 -1766 -1191 4348 4867 2009 3364 3545 4215 5216 3517 4215 1855 -2381 296 2026 -151
16706 -151 3101 7447 8368 3838 5115 3953 3773 2322 -1 -677 -885 -2657 -4057 -1171 -15 -260
16690 -260 -1900 -2358 -5428 -2427 3157 3123 1316 -1037 -5721 -3821 -2077 -2492 -1008 2376 3326 4387
16674 4387 3156 4425 4877 4420 3358 3849 709 2883 1483 -94 549 2378 2222 2312 696 2713
$$ packed form
16787A1637J307k251J463j88m652n300l827M37L778L068K17m26k657m485k557
16772d436J328J9m651Q86O009N675k036l554j577n40K322k703k025J671K76J751
16756a585N520J348r49m577m13o99J648p40L644O35k237j561J188j471l38J035
16740D48l88K554q31j35J91N8J452j776M12j161J236J185j7j101p36J4k04l74
16722H27k593N75N539N19k858J355J81O70J001j699O98k360m236K677J730k177
16706a51L252M346R21m530J277j162j80j451k323o76k08j772j400K886J156k45
16690b60j640m58l070L001N584l4j807k353m684J900J744m15J484L384R50J061
16674D387j231J269M52m57j062M91l140K174j400j577O43J829j56R0j616K017
$$ plain form
16658 2713 3133 2078 -69 -17 541 -115 1929 -100 1477 1041 -1410 -786 -1379 329 3677 5744 -934
16641 -934 -1120 96 -2882 -2266 497 1722 960 -227 -1855 -3272 -5420 -4201 -1808 -2162 -531 -2271
16625 -2271 -1952 -634 1606 4621 4524 4284 1144 787 -4 -1640 -3994 -4709 -6884 -3454 117 -2143
16609 -2143 -3412 -857 -1696 -3420 -3137 -2874 -2671 -4288 -2526 -3456 -3626 -395 -891 -1305 -892 -1461 71
16592 71 1510 1353 -1448 -520 2042 618 450 801 2107 1114 -618 -3920 -3209 -2705 -3310 -5591 -5358
16575 -5358 -4469 -3795 -4022 -5700 -8328 -11066 -11296 -8334 -8081 -6400 -3873 -3019 -6613 -8836 -5023 -3509
16559 -3509 -4033 -6140 -5010 -3829 -3601 -2711 -2600 -2149 -2120 -1508 -1486 1055 1135 -2682 -4089 -2913 -2995 -5386
16541 -5386 -6794 -2560 -2460 200 -436 -3331 -4402 -5572 -684 832 -925 -3867 -5222 -3130 -3214 -4349
$$ packed form
16658B713M20j055k147N2N58o56K044k029J577m36k451O24n93J708L348K067o678
16641i34j86J216k978O16K763J225p62j187j628j417k148J219K393l54J631j740
16625b271L19J318K240L015r7k40l140l57p91j636k354p15k175L430L571k260
16609b143j269K555q39j724K83K63K03j617J762r30j70L231m96m14M13n69J532
16592G1J439j57k801R28K562j424j68L51J306r93j732l302P11N04o05k281K33
16575e358Q89O74k27j678k628k738k30K962K53J681K527Q54l594k223L813J514
16559c509n24k107J130J181K28Q90J11M51K9O12K2K541Q0l817j407J176q2k391
16541e386j408M234J00K660o36k895j071j170M888J516j757k942j355K092q4j135
$$ plain form
16525 -4349 -3202 -2192 -774 -660 460 -1133 2790 6097 5773 1018 -1085 -1185 -2851 -2501 -1720 -3473
16509 -3473 -4372 -5457 -3939 -937 1957 4639 1287 1129 386 -2272 -5196 -6554 -6400 -1587 2280 -755
16493 -755 -988 -1855 -897 -1440 -343 -1102 -2369 -4945 -2282 518 1418 5241 8308 5578 1781 -286
16477 -286 1635 3869 -363 -1199 1834 1432 3160 4528 6248 3278 589 346 602 -2290 -623 314
16461 314 -455 1513 286 1321 271 2473 2150 -593 -1715 828 2804 6526 9043 10829 11007 10677
16445 10677 6291 2025 2337 5641 9663 13941 13481 12039 16438 25790 37552 51142 68647 86361
16431 86361 102767 129978 164800 200091 232815 266663 293954 305231 306469 307157 301544 281830
16419 281830 253329 223890 190997 158027 126124 98974 79561 62230 48062 39217 32595 24132
$$ packed form
16525d349J147J010J418J14J120j593L923L307l24m755k103j00j666L50P81j753
16509c473q99j085J518L002K894K682l352j58p43k658k924j358J54M813L867l035
16493g55k33q67R58n43J097p59j267k576K663K800R00L823L067k730l797k067
16477b86J921K234m232q36L033m02J728J368J720k970k689k43K56k892J667R37
16461C14p69J968j227J035j050K202l23k743j122K543J976L722K517J786J78l30
16445A0677m386m266L12L304M022M278m60j442M399R352J1762J3590J7505J7714
16431H6361J6406K7211L4822L5291L2724L3848K7291J1277J238O88n613j9714
16419B81830k8501k9439l2893l2970l1903k7150j9413j7331j4168q845o622q463
$$ plain form
16407 24132 23039 20657 17873 16007 15392 13651 9103 8626 9360 9395 9210 7936 6412 3871 2359 -599
16391 -599 -2954 613 1306 641 2492 845 152 -1765 -698 2188 1973 2112 2094 2893 3083 2640 3936
16374 3936 5598 1548 -1695 -2221 -1342 -2377 -750 1174 1317 2833 6131 5711 5701 5965 5139 4948 4861
16357 4861 5800 757 -462 -1114 1938 2424 1423 3914 6292 5068 2338 3448 4792 6610 2707
16342 2707 -556 707 5035 8661 7883 7038 11017 14064 13019 10785 13341 10896 8109 7284 4736
16327 4736 3839 4072 3313 4362 6250 7651 9110 8718 7575 7855 5707 5460 1945 -1615 -2509 -3125 -4244
16310 -4244 -3655 -857 1771 531 -3506 -4971 -4682 1415 1631 207 -257 -1609 -670 1952 3445 3489
16294 3489 3494 3333 1367 -1213 -3891 -3922 -810 692 -1336 429 -557 434 -134 -606 1031 759 -1843
$$ packed form
16407B4132j093k382k784j866o15j741m548m77P34L5j85j274j524k541j512k958
16391e99k355L567O93o65J851j647o93j917J067K886k15J39j8P99J90m43J296
16374C936J662m050l243n26Q79j035J627J924J43J516L298m20j0K64q26j91q7
16357D861R39n043j219o52L052M86j001K491K378j224k730J110J344J818l903
16342B707l263J263M328L626p78q45L979L047j045k234K556k445k787q25k548
16327D736q97K33p59J049J888J401J459l92j143K80k148k47l515l560q94o16j119
16310d244N89K798K628j240m037j465K89O097K16j424m64j352R39K622J493M4
16294C489Nj61j966k580k678l1L112J502k028J765r86R91n68m72J637k72k602
$$ plain form
16277 -1843 -1737 -3336 -3377 -3714 -268 3685 3125 1324 1364 3715 5835 7738 5142 925 -2356 -3403
16261 -3403 -1174 -2730 -2567 -2061 -2151 -2176 -1152 129 -5198 -5450 -5602 -5605 -51 4451 3270 1640 4358
16244 4358 5318 7534 3580 -1438 -5322 -4315 -863 598 4193 4229 1311 -1370 583 178 1555 3937
16228 3937 1276 413 3808 5634 2697 1806 2595 2019 2396 -517 -2285 -773 547 2202 867 -423
16212 -423 1447 1459 513 1407 603 -408 -280 2403 6596 4375 1379 3417 2207 1285 2293 3232 1869
16195 1869 1561 839 536 -2299 -3727 -5405 -7625 -9732 -10713 -14314 -15568 -14859 -17510 -16788 -15219 -18017
16179 -18017 -17313 -12181 -5661 -4635 -2820 479 -250 2008 2307 1556 302 203 764 426 1463 -1114
16163 -1114 -3043 -1695 437 958 650 -1115 -4042 -564 -13 -2090 -1654 -2654 -5759 -2343 -580 349
$$ packed form
16277a843J06j599m1l37L446L953n60j801M0K351K120J903k596m217l281j047
16261c403K229j556J63N06r0k5J024J281n327k52j52lN554M502j181j630K718
16244D358R60K216l954n018l884J007L452J461L595L6k918k681J953m05J377K382
16228C937k661q63L395J826k937q91P89n76L77k913j768J512J320J655j335j290
16212d23J870J2r46Q94q04j011J28K683M193k221k996K038j210r22J008R39j363
16195A869l08p22l03k835j428j678k220k107r81l601j254P09k651P22J569k798
16179a8017P04N132O520J026J815L299p29K258K99p51j254r9N61l38J037k577
16163a114j929J348K132N21l08j765k927L478N51k077M36j000l105L416J763R29
$$ plain form
16147 349 -303 1195 3609 4535 8020 9685 11186 12679 14694 15491 17283 21771 23543 25540 24253 25653
16131 25653 26557 21002 22098 27128 26258 20317 19362 19031 18691 19792 17025 16319 14032 10503 6610 5580
16115 5580 8353 11032 12420 9658 6897 7062 8774 10786 11942 10864 10330 9302 8465 6104 6610 9579
16099 9579 10171 6738 8996 13176 13616 10991 11658 10115 12440 11334 13097 17125 12310 8218 4150
16084 4150 3492 4487 4784 7667 10725 8864 5932 5263 6734 10749 13846 18402 18157 18284 15017 14809
16068 14809 13817 12104 8590 2232 1781 4884 1383 -2216 -1348 -5014 -4887 -1846 1491 2352 844 -306
16052 -306 -1480 -5077 -2005 2596 -140 4090 4744 1734 2320 5455 5265 6172 10366 15707 18142 22922
16036 22922 26197 29581 31823 30289 26472 27503 24633 22023 20599 20087 18229 18956 17182 19166 18544
$$ packed form
16147C49o52J498K414R26L485J665J501J493K015P97J792M488J772J997j287J400
16131B5653R04n555J096N030q70n941r55l31l40J101k767p06k287l529l893j030
16115E580K773K679J388k762k761J65J712K012J156j078n34j028q37k361N06K969
16099I579N92l433K258M180M40k625O67j543K325j106J763M028m815m092m068
16084D150o58R95K97K883L058j861k932o69J471M015L097M556k45J27l267k08
16068A4809r92j713l514o358m51L103l501l599Q68l666J27L041L337Q61j508j150
16052c06j174l597L072M601k736M230O54l010N86L135j90R07M194N341K435M780
16036B2922L275L384K242j534l817J031k870k610j424n12j858P27j774J984o22
$$ plain form
16021 18544 17768 19174 19274 22018 29068 31538 36424 42035 47343 50188 55851 61692 66276 68938 72067
16006 72067 74557 79390 78306 76963 76647 76335 70419 69645 70923 70049 66489 65553 63728 66457 68312 67187
15990 67187 65372 64530 61495 62332 60258 60787 55626 53392 54548 55803 54449 53315 52164 54336 55132
15975 55132 58654 59645 55452 55221 54113 51498 48254 48744 49946 53359 53917 59203 65888 69175 69361 70593
15959 70593 71755 78492 84564 87855 95429 100759 100791 105158 106957 113775 116986 121214 123738 124555 126240
15944 126240 125384 127430 132231 135475 136235 140322 145531 150256 153006 153176 153733 157531 162865 166704 168506
15929 168506 171696 178314 188043 198817 204656 217259 229930 244411 265948 286845 307870 332919
15917 332919 356141 383677 418257 462348 512267 570856 638351 718354 803104 894227 995459
$$ packed form
16021A8544p76J406J00K744P050K470M886N611N308K845N663N841M584K662L129
16006G2067K490M833j084j343l16l12n916p74J278q74l560r36j825K729J855j125
15990F7187j815q42l035Q37k074N29n161k234J156J255j354j134j151K172P96
15975E5132L522R91m193k31j108k615l244M90J202L413N58N286O685L287J86J232
15959G0593J162O737O072L291P574N330L2M367J799O818L211M228K524Q17J685
15944A26240q56K046M801L244P60M087N209M725K750J70N57L798N334L839J802
15929A68506L190O618R729J0774N839J2603J2671J4481K1537K0897K1025K5049
15917C32919K3222K7536L4580M4091M9919N8589O7495Q0003Q4750R1123J01232
$$ plain form
15906 995459 1103717 1212722 1334260 1468656 1615299 1771158 1938991 2134487 2366565 2651696
15896 2651696 3012785 3487185 4161778 5163373 6666448 8867218 11837530 15409428 19756751
15887 19756751 25216820 31332492 37464700 43075629 48846086 53983408 56303265 57159255
15879 57159255 57150089 56212441 53076849 47610274 42241147 36687391 30656551 24824702 19840267
15870 19840267 15844499 12413543 9594944 7538891 6110589 5107185 4369339 3802709
15862 3802709 3357033 3000870 2714605 2466440 2247915 2063296 1905989 1768929 1636346
15853 1636346 1514801 1399674 1296125 1200035 1102294 1011903 930402 850696 775126 707130 646271
15842 646271 594292 549639 510432 478359 453512 427162 400400 381201 365104 350396 332763
$$ packed form
15906I95459J08258J09005J21538J34396J46643J55859J67833J95496K32078K85131
15896B651696L61089M74400O74593J001595J503075K200770K970312L571898M347323
15887A9756751N460069O115672O132208N610929N770457N137322K319857Q55990
15879E7159255r166r37648l135592n466575n369127n553756o030840n831849m984435
15870A9840267l995768l430956k818599k056053j428302j003404p37846n66630
15862C802709m45676l56163k86265k48165k18525j84619j57307j37060j32583
15853A636346j21545j15127j03549r6090r7741r0391q1501p9706p5570o7996o0859
15842F46271n1979m4653l9207l2073k4847k6350k6762j9199j6097j4708j7633
$$ plain form
15831 332763 316172 303782 288587 275630 261042 247163 235237 221911 205088 191506 182935 179293
15819 179293 169801 159103 152415 149316 142912 134577 122575 115040 110621 105001 102612 101011 101641 99488
15805 99488 99841 99542 96520 96163 97302 96654 94512 93730 95076 95532 93377 89246 87255 87871 88776 88551 86006
15788 86006 80467 75515 78532 76804 68962 67269 66947 65153 63343 63247 59725 60758 56409 47709 44755
15773 44755 43161 44936 45797 46693 47363 44610 46491 50240 48129 49352 52675 54373 51683 49862 53122
15758 53122 51698 52425 50239 50720 52159 55312 54552 52351 50265 50441 49503 48769 51039 50492 52736 55938
15742 55938 54386 50150 50020 49477 47915 46546 44330 42277 38183 33198 32243 34844 32006 28479 23516
15727 23516 23122 20785 22277 24947 25871 25881 27166 29761 33304 34780 37309 35891 35280 40014 39174 40054
$$ packed form
15831C32763j6591j2390j5195j2957j4588j3879j1926j3326j6823j3582q571l642
15819A79293r492j0698o688l099o404q335j2002p535m419n620k389j601O30k153
15805I9488L53k99l022l57J139o48k142p82J346M56k155m131j991O16R05k25k545
15788H6006n539m952L017j728p842j693l22j794j810r6l522J033m349q700k954
15773D4755j594J775Q61Q96O70k753J881L749k111J223L323J698k690j821L260
15758E3122j424P27k186M81J439L153p60k201k086J76r38p34K270n47K244L202
15742E5938j552m236j30n43j562j369k216k053m094m985r55K601k838l527m963
15727B3516l94k337J492K670R24J0J285K595L543J476K529j418o11M734q40Q80
$$ plain form
15711 40054 37482 36850 36079 32100 32957 32725 31262 31900 34783 34269 32579 31581 27716 27512 33279 32579 29047
15694 29047 23369 18365 14173 10551 9503 12737 17933 18745 19594 21476 21466 20273 17371 16638 17058 13548
15678 13548 12036 14379 16817 17730 17303 18575 18055 17760 21520 19603 13153 9016 11083 11286 12055 12995
15662 12995 13628 14710 16078 17057 18797 15062 12639 10708 6726 9590 13045 14144 13596 11376 12650
15647 12650 13236 15173 16634 13226 11201 11902 13465 18204 15645 13583 12848 15921 16098 13701 12907 11509
15631 11509 11796 13602 12643 10871 10452 15211 16360 18236 22928 25323 26242 22846 18606 18408 19300 15167
15615 15167 12827 14533 11600 11454 15668 16387 13087 10697 9518 11999 13188 11866 10079 14006 16945
15600 16945 15477 13120 8221 4370 2982 8887 18296 26806 36145 40027 32904 20547 8040 1930
$$ packed form
15711D0054k572o32p71l979Q57k32j463O38K883n14j690r98l865k04N767p00l532
15694B9047n678n004m192l622j048L234N196Q12Q49J882j0j193k902p33M20l510
15678A3548j512K343K438R13m27J272n20k95L760j917o450m137K067K03P69R40
15662A2995O33J082J368R79J740l735k423j931l982K864L455J099n48k220J274
15647A2650N86J937J461l408k025P01J563M739k559k062p35L073J77k397p94j398
15631A1509K87J806r59j772m19M759J149J876M692K395R19l396m240j98Q92m133
15615A5167k340J706k933j46M214P19l300k390j179K481J189j322j787L927K939
15600A6945j468k357m899l851j388N905R409Q510R339L882p123j2357j2507o110
$$ plain form
15586 1930 -1958 1756 11279 18697 25280 26410 21728 21147 22385 22745 21890 21387 21288 20264 14669 11275
15570 11275 11952 10007 5541 3860 3889 1534 1705 -69 626 687 -634 1365 39 1603 6378 9646
15554 9646 11382 9970 13943 13019 8566 5763 5819 3763 3928 5718 5122 1856 3091 4534 5239 5323 4791
15537 4791 2548 1197 2138 1937 -2617 -2034 3109 8018 5656 3947 1989 3606 4411 2860 3990 5997
15521 5997 2414 918 -1270 -2015 -2860 -1522 -1216 -630 -1816 1045 2823 1991 -921 -1174 -564 958
15505 958 1956 1922 5641 11259 11359 9552 2051 -3079 -4376 -2795 -30 4998 5249 4198 4430 1914
15489 1914 637 -2261 -4707 -2254 -1412 394 1180 3858 4079 2978 -1689 -6473 -8093 -8056 -8867 -5171
15473 -5171 -3094 -3259 -3776 -6591 -6690 -2612 113 -4187 -3425 -1817 3255 5163 3629 -1793 -2222 1096
$$ packed form
15586A930l888L714R523P418O583J130m682n81J238L60q55n03r9j024n595l394
15570A1275O77j945m466j681K9k355J71j774O95O1j321J999j326J564M775L268
15554I646J736j412L973r24m453k803N6k056J65J790n96l266J235J443P05Q4n32
15537D791k243j351R41k01m554N83N143M909k362j709j958J617Q05j551J130K007
15521E997l583j496k188p45q45J338L06N86j186K861J778q32k912k53O10J522
15505I58R98l4L719N618J00j807p501n130j297J581K765N028K51j051K32k516
15489A914j277k898k446K453Q42J806P86K678K21j101m667m784j620L7q11L696
15473e171K077j65n17k815r9M078K725m300P62J608N072J908j534n422m29L318
$$ plain form
15457 1096 2232 -986 -2539 -3826 -1998 2525 5143 5244 6987 7215 5577 749 1301 3696 3676 3958
15441 3958 2880 -49 -2729 -4662 -6726 -9381 -5638 -4215 -4847 -8253 -5816 -3134 -4930 -5095 -513
15426 -513 -1504 -3131 -1164 -1815 -1849 -1638 -3555 -5689 -2733 -837 -3201 -2856 -3609 -2983 -1712 -2668 -4697
15409 -4697 -4858 -5148 -4333 -2489 1148 481 -1323 -2280 186 2323 -563 -2177 -2396 -712 277 236 1342
15392 1342 3519 4088 872 -251 1811 1329 1506 304 718 3500 2857 567 -243 1400 -241 -1073
15376 -1073 -515 -2466 -5021 -2266 1430 4275 -792 -2806 548 2130 2954 2512 1602 -771 229 5126
15360 5126 7654 9422 8941 8291 7044 7031 7216 9321 11855 12598 16364 17376 16051 13121 11903 14179
15344 14179 17212 21944 34044 46632 65881 86660 109932 142003 175564 207350 238534 271059
$$ packed form
15457A096J136l218j553j287J828M523K618J01J743K28j638m828N52K395k0K82
15441C958j078k929k680j933k064k655L743J423o32l406K437K682j796j65M582
15426e13r91j627J967o51l4K11j917k134K956J896k364L45p53O26J271r56k029
15409d697j61k90Q15J844L637o67j804r57K466K137k886j614k19J684R89m1J106
15392A342K177N69l216j123K062m82J77j202M14K782o43k290q10J643j641q32
15376a073N58j951k555K755L696K845n067k014L354J582Q24m42r10k373J000M897
15360E126K528J768m81o50j247j3J85K105K534P43L766J012j325k930j218K276
15344A4179L033M732J2100J2588J9249K0779K3272L2071L3561L1786L1184L2525
$$ plain form
15332 271059 292677 305422 316112 317142 306357 278705 248867 221384 192504 160372 128456 102722
15320 102722 83443 69001 51293 38018 30586 26887 22512 17910 19009 14145 9214 7262 7496
15307 7496 8691 12720 14694 11403 7161 5084 5629 7502 5626 4831 1996 807 2541 4962 4647
15292 4647 5455 2197 -1314 -1252 -850 1128 -914 -2803 -2695 -3428 -2018 -2957 -1829 -2751 -1047 -485 -2393
15275 -2393 -2382 -3938 -7100 -6922 -2896 -4020 -6218 -3753 -1302 -3028 -6737 -10550 -7166 -1827 2245
15260 2245 -355 -2710 -1320 59 -312 -5583 -3431 579 -1278 142 -1309 -2651 156 4127 4932
15245 4932 868 1926 5123 6221 5790 5640 3546 3389 918 -3221 -3774 -2743 -4630 -2912 -2615 -1994
15229 -1994 1011 -1394 -4677 -5733 -5672 -4823 -2179 -3539 471 3888 3868 1673 -275 1583 3242 5558
$$ packed form
15332B71059K1618J2745J0690J030j0785k7652k9838k7483k8880l2132l1916k5734
15320A02722j9279j4442j7708j3275p432l699m375m602J099m864m931j952K34
15307G496J195M029J974l291m242k077N45J873j876p95k835j189J734K421l15
15292D647Q08l258l511O2M02J978k042j889J08p33J410r39J128r22J704N62j908
15275b393J1j556l162J78M026j124k198K465K451j726l709l813L384N339M072
15260B245k600k355J390J379l71n271K152M010j857J420j451j342K807L971Q05
15245D932m064J058L197J098m31j50k094j57k471m139n53J031j887J718K97O21
15229a994L005k405l283j056O1Q49K644j360M010L417k0k195j948J858J659K316
$$ plain form
15213 5558 3175 1621 3078 3053 -830 -2541 810 2945 4086 3165 302 -1806 -5044 -4974 -7111 -6204
15197 -6204 -5577 -4836 -5202 -4555 -3567 -4886 -4307 -3276 -1713 -3108 -5569 -8714 -8894 -7142 -8325 -4790
15181 -4790 -2855 -2936 -2793 -3177 -1622 550 1418 -388 -1229 -3869 -3186 -1744 -1766 -3182 -1802 -1221 -889
15164 -889 -2811 -4396 -5024 -5913 -3635 -1042 -360 694 3461 2560 -2923 -6676 -5809 -5286 -3850 -2210
15148 -2210 -164 1633 3442 2088 -893 628 -1051 -3183 -3403 -1361 -1676 -2415 -944 -2118 -2199 -2122
15132 -2122 -3229 -4464 -6754 -9845 -6671 -2996 -3269 -4042 -3522 -3067 -2721 -5908 -5939 -3011 -757 -1372 -3223
15115 -3223 -4216 -3442 -1283 -2580 -2454 -1976 2733 5313 5939 3968 331 -356 -1401 -1144 230 -911
15099 -911 -1317 -1417 -3969 -4299 -3007 -2167 -1874 -894 -2194 -1085 -748 -1900 -1848 415 -1024 -1696 -3399
$$ packed form
15213E558k383j554J457k5l883j711L351K135J141r21k863k108l238P0k137R07
15197f204O27P41l66O47R88j319N79J031J563j395k461l145j80J752j183L535
15181d790J935q1J43l84J555K172Q68j806q41k640O83J442k2j416J380N81L32
15164h89j922j585o28q89K278K593O82J054K767r01n483l753Q67N23J436J640
15148b210K046J797J809j354k981J521j679k132k20K042l15p39J471j174q1P7
15132b122j107j235k290l091L174L675k73p73N20M55L46l187l1K928K254o15j851
15115c223r93P74K159j297J26M78M709K580O26j971l637o87j045K57J374j141
15099i11m06j00k552l30J292Q40K93R80j300J109L37j152N2K263j439o72j703
$$ plain form
15082 -3399 -2573 -2924 -3136 -2454 -1160 1148 -1481 -6772 -7757 -3895 -1506 -3227 -7056 -7667 -5662 -4495
15066 -4495 -4461 -4188 -2492 -2356 -2825 -4404 -5432 -6672 -6004 -1576 2342 1428 1025 -1629 -463 -1352 -1458
15049 -1458 -2399 -433 541 -3911 -4271 -2155 -316 835 774 -1953 -2452 -4430 -7082 -5571 -4950 -8995
15033 -8995 -10287 -6651 -5354 -7894 -8642 -5938 -3338 -2420 -2889 -3626 -2783 -153 63 -775 -2947 -4630
15017 -4630 -4266 -6410 -6048 -4992 -1292 337 -1962 -2393 -2906 -5771 -5250 -4611 -116 56 -3873 -5332
15001 -5332 -3870 -3716 -1653 -74 -1878 -5410 -2466 -961 -2216 -2319 -5391 -4272 -64 -2172 -4970
14986 -4970 -5926 -6579 -7205 -7791 -2959 276 -3163 -2309 -1737 -843 -6514 -7768 -5662 -5074 -746 -538 -1819
14969 -1819 -1477 -1548 -1918 -1089 -2610 -1939 1611 4666 1055 -2254 -5025 -6948 -9516 -7197 -3727 -3969
$$ packed form
15082c399Q26l51k12O82J294K308k629n291r85L862K389j721l829o11K005J167
15066d495L4K73J696J36m69j579j028j240O68M428L918r14m03k654J166q89j06
15049a458r41J966R74m452l60K116J839J151o1k727m99j978k652J511O21m045
15033h995j292L636J297k540p48K704K600R18m69p37Q43K630K16q38k172j683
15017d630L64k144L62J056L700J629k299m31n13k865N21O39M495J72l929j459
15001e332J462J54K063J579j804l532K944J505j255j03l072J119M208k108k798
14986d970r56o53o26n86M832L235l439Q54N72Q94n671j254K106N88M328K08j281
14969a819L42p1l70Q29j521O71L550L055l611l309k771j923k568K319L470k42
$$ plain form
14953 -3969 -4154 -3447 -890 1165 1897 -1595 -4277 -4537 -3937 -2977 -2171 -1480 -2125 -5991 -7148 -4119 -775
14936 -775 1072 -659 -1064 -3470 -3902 676 3876 4399 1552 -502 -1298 -4497 -7304 -5469 -2616 -2953
14920 -2953 -2666 -470 1507 -1290 -1951 -2191 -245 -2347 -3939 -3341 -3659 -3962 750 -2761 -6477 -5554
14904 -5554 -5114 -4480 -4160 -4057 -5825 -5082 -4169 -5990 -3877 -1136 -3969 -2906 -3020 -3910 -2363 -6050 -6433
14887 -6433 -7268 -5226 -3343 -1088 365 -1329 -2991 -828 1448 3853 5684 4672 2595 -2584 -234
14872 -234 655 -1496 371 -1610 -3572 -2907 -3096 -2948 -463 -597 -3711 -4618 -1180 284 -764 -2926
14856 -2926 -2453 -3399 -7888 -7224 -6284 -7326 -4595 -1727 -1910 -3021 -6415 -3692 -4354 -7700 -7693 -3324 2267
14839 2267 3589 6286 8745 7788 5336 4210 1715 2719 -525 -5923 -7582 -8825 -10521 -10447 -6628
$$ packed form
14953c969j85P07K557K055P32l492k682k60O00R60Q06O91o45l866j157L029L344
14936g75J847j731m05k406m32M578L200N23k847k054p96l199k807J835K853l37
14920b953K87K196J977k797o61k40J946k102j592N98l18l03M712l511l716R23
14904e554M40O34L20J03j768P43R13j821K113K741k833J063j14q90J547l687l83
14887f433q35K042J883K255J453j694j662K163K276K405J831j012k077n179K350
14872b34Q89k151J867j981j962O65j89J48K485j34l114r07L438J464j048k162
14856b926M73r46m489O64R40j042K731K868j83j111l394K723o62l346PM369N591
14839B267J322K697K459r57k452j126k495J004l244n398j659j243j696P4L819
$$ plain form
14824 -6628 -3490 -2857 -4246 -2576 -2694 -4202 -3978 -4158 -3840 -3681 -1855 -2432 -5981 -5622 -5247 -6646 -5521
14807 -5521 -7008 -7998 -7260 -5483 -4995 -3622 -2477 -2887 -3572 -2965 -3659 -1920 -1461 -1204 437 -313 -1146
14790 -1146 -1369 -1173 -1233 872 -1148 -3998 -6858 -6243 -3547 -4601 -5121 -8496 -7034 -5886 -4128 -735
14774 -735 -1327 -2967 -5302 -6095 -6412 -6286 -4955 -3113 211 2404 1128 2406 2852 2599 -1437 -4535
14758 -4535 -6010 -5858 -6216 -5556 -1208 1294 1989 1787 -1237 -5481 -11321 -10493 -3943 7224 13323 10500
14742 10500 3511 -1248 3270 13023 18280 11151 -3271 -10774 -11493 -9147 -6830 -4460 -1816 -1488 -4808
14727 -4808 -7319 -8345 -8277 -7352 -2778 -2406 -1591 -327 -1214 2001 -2897 -4348 -1484 -1847 149 2976
14711 2976 -829 -5135 -4751 -4167 -3666 -2273 -2648 -1626 -42 -1819 -2030 -1171 -2028 -3177 -5990 -9052
$$ packed form
14824f628L138O33j389J670j18j508K24j80L18J59J826n77l549L59L75j399J125
14807e521j487r90P38J777M88J373J145m10o85O07o94J739M59K57J641p50q33
14790a146k23J96o0K105k020k850k860O15K696j054n20l375J462J148J758L393
14774g35n92j640k335p93l17J26J331J842L324K193j276J278M46k53m036l098
14758d535j475J52l58O60M348K502O95k02l024m244n840Q28O550J1167O099k823
14742A0500o989m759M518R753N257p129j4422p503p19K346K317K370K644L28l320
14727d808k511j026O8R25M574L72Q15J264q87L215m898j451K864l63J996K827
14711B976l805m306L84N84N01J393l75J022J584j777k11Q59q57j149k813l062
$$ plain form
14695 -9052 -8113 -4577 -2633 -4499 -1296 -99 -2230 -4944 -4461 -2755 -5786 -2800 -4112 -3526 -5365
14680 -5365 -3793 -1694 -1695 -4050 -3905 -238 -367 -4083 -4334 -2356 -3659 -3437 -3241 -6457 -7872 -4491 -3508
14663 -3508 -2691 -3 -911 -4658 -7367 -7526 -3886 599 2375 3912 -1417 -7444 -11055 -8400 -5426
14648 -5426 -4431 -3104 -4565 -5950 -9784 -11287 -2535 1900 1938 -2429 -5250 -4792 -1735 30 -951 -2312
14632 -2312 1733 5440 3455 114 305 -2350 -5073 -4595 -5162 -777 -1792 -6506 -6440 -4977 -1206 -1008
14616 -1008 -2928 8 4069 3942 132 2169 701 -1837 -338 -315 -3067 -6235 -8705 -8045 -7165 -5784
14600 -5784 -3066 85 802 -1396 -1109 475 -2908 -5327 -4234 -2074 -1269 -2228 -2758 -2750 -387 2209 2124
14583 2124 -2377 -6689 -7900 -5084 74 -2040 -4959 -5616 -2763 -2685 -3073 -4946 -3537 -3263 -5305 -7054
$$ packed form
14695i052R39L536J944j866L203J197k131k714M83J706l031K986j312N86j839
14680e365J572K099jk355J45L667j29l716k51J978j303K22J96l216j415L381R83
14663c508Q17K688r08l747k709j59L640M485J776J537n329o027l611K655K974
14648e426R95J327j461j385l834j503Q752M435L8m367k821M58L057J765r81j361
14632b312M045L707j985l341J91k655k723M78n67M385j015m714O6J463L771J98
14616a008j920K936M061j27l810K037j468k538J499K3k752l168k470O60Q80J381
14600e784K718L151P17k198K87J584l383k419J093K160Q05r59n30QK363K596q5
14583B124m501m312j211K816N158k114k919o57K853P8l88j873J409K74k042j749
$$ plain form
14567 -7054 -7103 -2178 -930 -5292 -6126 -4076 -4028 -6253 -4689 -3759 -2349 -1062 -4070 -4713 -3224 1433
14551 1433 4760 5253 5069 1312 -1992 -3839 -1406 1342 2007 3261 968 -608 -2443 -4294 -6447
14536 -6447 -10412 -9690 -6231 -7041 -5955 -5023 -6312 -6084 -6292 -4107 851 -1111 -80 -3100 -6614 -5290
14520 -5290 -5208 -4666 -3514 -517 905 -1628 -4509 -4392 -2644 -5391 -6018 -1749 1712 1936 -1039 -5802
14504 -5802 -4520 -2956 -2386 -1604 -4761 -6308 -7423 -6303 -7036 -9848 -8747 -5965 -3290 -1346 -1668 107
14488 107 -815 -3067 -711 380 -186 923 -44 2870 7186 7235 6969 9975 7807 1559 -1292 -2313
14472 -2313 -3585 -3190 -202 -3259 -4799 -4021 -3458 -3810 -2174 -1992 -1602 -1485 -256 684 413 2 -1950
14455 -1950 -4774 -765 2541 -1019 -155 -87 1046 1038 1967 610 -5797 -10949 -10748 -7593 -5557 -6225 -7834
$$ packed form
14567g054m9M925J248m362q34K050M8k225J564R30J410J287l008o43J489M657
14551A433L327M93j84l757l304j847K433K748O65J254k293j576j835j851k153
14536f447l965P22L459q10J086R32j289K28k08K185M958j962J031l020l514J324
14520e290Q2N42J152K997J422k533k881J17J748k747o27M269L461K24k975m763
14504e802J282J564N70P82l157j547j115J120p33k812J101K782K675J944l22J775
14488A07r22k252K356J091n66J109r67K914M316M9k66L006k168o248k851j021
14472b313j272L95K988l057j540P78N63l52J636J82L90J17J229R40k71m11j952
14455a950k824M009L306l560Q64O8J133qR29j357o407n152K01L155K036o68j609
$$ plain form
14438 -7834 -7086 -6925 -6291 -5768 -6561 -5565 -4837 -3333 -3811 -374 -3081 -2384 -2786 -5223 -3606 -5878 -5065
14421 -5065 -5464 -5141 -2901 -4943 -4254 -3292 -8311 -9452 -7084 -1663 -1437 -3069 -1973 -2055 -4693 -6214
14405 -6214 -4944 -4554 -5786 -4967 -2650 0 -1226 -993 851 2370 -1105 -1217 -957 -1893 -866 -1978
14389 -1978 -3051 -2302 -923 1434 2380 -796 -2595 -5512 -5277 -5194 -4930 -6781 -7228 -6245 -4064 -4053 -6162
14372 -6162 -3687 -1159 -3503 -4428 -1787 -697 549 1362 1228 -686 -1062 1034 1129 -813 -2433 -2409 -925
14355 -925 -179 -279 -2369 -2741 100 -1877 -2910 -901 -1165 -2970 -4492 -9146 -9603 -4833 -3284 -2330
14339 -2330 -1787 -599 1091 -938 2348 1049 -1241 -2643 -4135 -4092 -1959 -3155 -635 -583 -1278 -1684
14323 -1684 -1026 -3716 -6879 -4306 -2095 900 -2262 -3797 168 2499 149 -269 -1423 -3089 -4372
$$ packed form
14438g834P48J61O34N23p93R96P28J504m78L437k707O97m02k437J617k272Q13
14421e065l99L23K240k042O89R62n019j141K368N421K26j632J096q2k638j521
14405f214J270L90j232Q19K317K650j226K33J844J519l475j12K60r36J027j112
14389a978j073P49J379K357R46l176j799k917K35Q3K64j851m47R83K181J1k109
14372f162K475K528k344r25K641J090J246Q13j34j914l76K096R5j942j620K4J484
14355i25P46j00k090l72K841j977j033K009k64j805j522m654m57M770J549R54
14339b330N43J188J690k029L286j299k290j402j492M3K133j196K520N2o95m06
14323a684O58k690l163K573K211K995l162j535L965K331k350m18j154j666j283
$$ plain form
14308 -4372 -4371 -4403 -5772 -5666 -7016 -7973 -8588 -11378 -10468 -8286 -6006 -6670 -6267 -6137 -6417 -6096 -6742 -8014
14290 -8014 -6279 -3682 -677 -1199 -2214 -2909 -3046 -3339 -3475 -4032 -5007 -6721 -9005 -10469 -8627 -6838
14274 -6838 -3444 499 1150 -1967 -1693 -283 -990 -39 -1069 -4323 -1591 -1793 -4796 -7542 -11044 -11226
14258 -11226 -8187 -3806 -2383 -3182 -3592 -4303 -4020 -2993 -2323 -6243 -6460 -5910 -5850 -4608 -1606 -204 1328
14241 1328 -1141 -4721 -5130 -10169 -12263 -13247 -10326 -7746 -4972 -5294 -4899 -4482 -4182 -1958 -2672 -3696
14225 -3696 -4692 -1371 1183 -3266 -5925 -5870 -1986 265 -3955 -7354 -6127 -5372 -5085 -3601 -5998 -7756
14209 -7756 -8136 -6235 -5150 -9086 -8115 -4891 -4084 -5339 -6806 -6357 -7997 -7842 -3732 -4459 -7176 -7051
14193 -7051 -7762 -5499 -4015 -5531 -2101 2905 4863 1209 -5420 -6668 -4050 -5669 -4633 -4306 -6731
$$ packed form
14308d372Jl2j369J06j350r57o15k790R10K182K280o64M03J30k80L21o46j272
14290h014J735K597L005n22j015o95j37k93j36n57r75j714k284j464J842J789
14274f838L394L943O51l117K74J410p07R51j030l254K732k02l003k746l502j82
14258a1226L039M381J423p99m10p11K83J027O70l920k17N50O0J242L002J402J532
14241A328k469l580m09n039k094r84K921K580K774l22L95M17L00K224p14j024
14225c696r96L321K554m449k659N5L884K251m220l399J227P55K87J484k397j758
14209g756l80J901J085l936R71L224Q07j255j467M49j640J55M110p27k717J25
14193g051p11K263J484j516L430N006J958l654o629j248K618j619J036L27k425
$$ plain form
14178 -6731 -7940 -3595 -2623 -6433 -6350 -4434 -1232 -3679 -3531 -2996 -5670 -7319 -9788 -6109 -3595 -4083
14162 -4083 -5176 -4301 -5364 -7255 -5749 -6924 -7489 -5523 -3704 -7994 -12086 -11770 -8729 -6473 -2743
14147 -2743 -3441 -4672 -5896 -9547 -8631 -9805 -7157 -7533 -7379 -5745 -4399 -5555 -8253 -9051 -8907 -8979 -10391
14130 -10391 -11139 -7781 -5363 -5848 -7403 -8404 -8776 -7204 -6324 -5757 -5185 -5458 -5032 -3385 -3006 -4576 -7131
14113 -7131 -6493 -7367 -8735 -5365 -4586 -5264 -3758 -3207 -6738 -9083 -9092 -6027 -4764 -8704 -10417 -6958 -6993
14096 -6993 -6618 -6507 -3750 -2112 -2361 -3914 -3474 -4874 -4442 -6864 -6227 -3848 -4936 -8058 -5441 -2616
14080 -2616 -1780 66 -2758 -2325 -141 622 569 -1966 -1204 -1662 -4177 -3525 -6379 -3748 -342 -2154 -4490
14063 -4490 -5205 -2255 -412 -300 215 1350 2094 -13 -3078 -5002 -3120 1796 3756 4194 3519 -301
$$ packed form
14178f731j209M345R72l810Q3J916L202k447J48N35k674j649k469L679K514m88
14162d083j093Q75j063j891J506j175n65J966J819m290m092L16L041K256L730
14147b743o98j231j224l651R16j174K648l76J54J634J346j156k698p98J44p2j412
14130a0391p48L358K418m85j555j001l72J572Q80N67N72k73M26J647L79j570k555
14113g131O38q74j368L370P79o78J506N51l531k345rL065J263l940j713L459l5
14096f993L75J11K757J638k49j553M40j400M32k422O37K379j088l122K617K825
14080b616Q36J846k824M33K184P63n3k535P62m58k515O52k854K631L406j812k336
14063d490p15K950J843J12N15J135P44k107l065j924J882M916J960M38o75l820
$$ plain form
14047 -301 -2796 -3761 -4165 -4021 -5278 -6030 -5116 -4854 -4022 -4031 -2699 -3457 -2655 -2739 -1690 1351 4675 1450
14029 1450 -1573 -5837 -3885 1396 342 -717 314 5034 1003 -28 -1928 1 2123 2888 -1514
14014 -1514 -4406 -4474 -6255 -8538 -10090 -7981 -5989 -5464 -5392 -7062 -9114 -4640 -3967 -5831 -6532 -7022 -8014
13997 -8014 -4914 -6349 -6917 -4426 -5312 -8507 -12120 -12978 -14203 -12311 -12115 -11854 -14778 -11447 -7776 -5011
13981 -5011 -7385 -8882 -10027 -10241 -5655 -2278 -960 187 1024 -1953 -4886 -6092 -1907 -274 -2638
13966 -2638 -1602 -2147 -2121 1442 1311 -656 -3446 -4707 -5955 -6011 -284 6615 11353 13607 13577 14565 15475
13949 15475 15080 12309 7347 8268 9832 10071 10612 10125 10197 12931 15767 11275 6822 5053 2083 -842
13933 -842 -3844 -1403 -400 426 570 492 -1992 -6632 -5979 -6932 -9506 -6470 -3589 -1814 2070 212
$$ packed form
14047c01k495r65m04J44j257p52R14K62Q32rJ332p58Q02q4J049L041L324l225
14029A450l023m264J952N281j054j059J031M720m031j031j900J929K122P65m402
14014a514k892o8j781k283j552K109J992N25P2j670k052M474O73j864p01m90r92
13997h014L100j435n68K491q86l195l613q58j225J892J96K61k924L331L671K765
13981e011k374j497j145k14M586L377J318J147Q37k977k933j206M185J633k364
13966b638J036n45K6L563j31j967k790j261j248n6N727O899M738K254l0R88R10
13949A5475l95k771m962R21J564K39N41m87P2K734K836m492m453j769k970k925
13933h42l002K441J003Q26J44p8k484m640O53r53k574L036K881J775L884j858
$$ plain form
13917 212 -2188 -2085 -2916 -2112 -3146 -6166 -8312 -5978 -2564 -3651 -6110 -6450 -6313 -4580 -5617 -5528 -4138
13900 -4138 -5203 -8547 -8816 -8605 -4651 -2545 -3273 -5778 -12954 -13820 -8387 -4142 -3042 -4390 -5420 -3476
13884 -3476 -2378 2549 1905 1980 -767 -7150 -6882 -6318 -6118 -3450 -1666 -4216 -5548 -5868 -5356 -6357 -7015
13867 -7015 -8777 -6528 -6101 -5002 -4151 -6720 -6951 -4855 -8278 -6577 -5429 -2789 -1032 -5980 -6499 -3005
13851 -3005 -2663 -1991 -2843 -3159 -4279 -3448 -4672 -6450 -4273 -3092 -307 -129 -2678 -1090 551 -298
13835 -298 -408 -4753 -5875 -6710 -5978 -5242 -6828 -2641 3080 3335 -165 -3703 -5044 -5497 -4840 -3200 -462
13818 -462 -275 -1138 71 1200 -1075 -1300 -2321 -6301 -7477 -4500 -3959 -4437 -3468 -2193 -85 -1406
13802 -1406 -3501 -2158 -865 64 -231 1212 2113 4010 1740 847 1255 1934 1955 943 -3916 -6568 -4139
$$ packed form
13917B12k400J03q31Q04j034l020k146K334L414j087k459l40J37J733j037Q9J390
13900d138j065l344k69K11L954K106p28k505p176q66N433M245J100j348j030J944
13884c476J098M927o44P5k747o383K68N64K00K668J784k550j332l20N12j001o58
13867g015j762K249M27J099Q51k569k31K096l423J701J148K640J757m948n19L494
13851c005L42O72q52l16j120Q31j224j778K177J181K785J78k549J588J641q49
13835b98j10m345j122q35P32P36j586M187N721K55l500l538j341m53O57J640K738
13818d62J87q63J209J129k275k25j021l980j176K977N41m78R69J275K108j321
13802a406k095J343J293R29k95J443R01J897k270q93M08O79K1j012m859k652K429
$$ plain form
13785 -4139 -1966 -768 1488 327 -733 -1081 -115 -1973 -5411 -5787 -4969 -2270 2184 -1835 57 -1051
13769 -1051 185 2211 -131 -1175 -3035 -4548 -6086 -4591 -5825 -6582 -6503 -5855 -2852 2372 6166 9889
13753 9889 12095 10084 10014 10471 7360 6707 2323 2013 4407 4349 1272 -2903 -5576 -4535 -2359 -1547 -2258
13736 -2258 -1056 830 -1259 -5930 -9114 -10006 -8731 -8293 -3596 -265 70 -4114 -5976 -6007 -8745 -9752
13720 -9752 -9085 -6923 -9324 -10994 -10453 -9605 -8148 -6415 -4108 -999 -731 -687 -131 -2334 -2254 843 -4020
13703 -4020 -8055 -8193 -9686 -5647 -2998 -3741 -4693 -2958 -2475 -2529 -2182 -6233 -7719 -4219 -4890 -6156 -5295
13686 -5295 -5216 -6193 -6017 -8344 -7649 -6460 -4402 -3729 -3375 -3761 -5653 -4886 -3285 -2500 -3797 -3719 -3018 -4331
13668 -4331 -2424 2433 837 -404 -3877 -6692 -6091 -5062 -8343 -7748 -6623 -8600 -8626 -5847 -4231 -3136
$$ packed form
13785d139K173J198K256j161j060l48R66j858l438l76Q18K699M454m019J892j108
13769a051J236K026k342j044j860j513j538J495j234p57P9O48L003N224L794L723
13753I889K206k011p0M57l111o53m384l10K394n8l077m175k673J041K176Q12p11
13736b258J202J886k089m671l184q92J275M38M697L331L35m184j862l1k738j007
13720i752O67K162k401j670N41Q48J457J733K307L109K68M4N56k203Q0L097m863
13703d020m035j38j493M039K649p43r52J735M83n4L47m051j486L500o71j266Q61
13686e295P9r77J76k327O95J189K058O73L54l86j892P67J601P85j297P8P01j313
13668d331J907M857j596j241l473k815O01J029l281N95J125j977k6K779J616J095
$$ plain form
13652 -3136 -3865 -6477 -10418 -9421 -5595 -2967 -3483 -6414 -9760 -12002 -7003 -6509 -6607 -7186 -7302 -6976 -5543
13635 -5543 -3375 -3449 -3308 -5419 -7778 -7271 -6566 -6316 -3272 -3901 -2425 -2137 -2671 -1591 -2705 -2222 -2063
13618 -2063 -3066 -3032 -2379 1837 3016 2315 931 212 -874 742 3376 2933 435 -2409 -4876 -4444
13602 -4444 -1891 -3983 -761 -1081 -2830 -4685 -208 2553 1811 -1515 -3017 -2879 -2933 -3187 -2315 329
13586 329 2550 1559 2652 3275 1242 -3029 -6463 -7563 -6971 -5190 -4588 -4804 -1522 3967 2895 -339
13570 -339 -1871 -6305 -9285 -9638 -7133 -7588 -7913 -5511 -6051 -5053 -3447 -798 -940 -4267 -4625 -2122 -3450
13553 -3450 -6170 -5748 -6064 -2961 -937 -436 1024 -1683 -5554 -2978 -223 1006 -608 -2914 -3588 489
13537 489 1943 -316 -1059 -161 2425 2220 1957 1517 -1718 -4049 4 -353 -4616 -7136 -8507 -11161
$$ packed form
13652c136p29k612l941R97L826K628n16k931l346k242M999M94r8n79j16L26J433
13635e543K168p4J41k111k359N07P05K50L044o29J476K88n34J080j114M83J59
13618b063j003L4O53M216J179p01j384p19j086J616K634m43k498k844k467M32
13602d444K553k092L222l20j749j855M477K761p42l326j502J38n4k54Q72K644
13586C29K221r91J093O23k033m271l434j100N92J781O02k16L282N489j072l234
13570c39j532m434k980l53K505m55l25K402n40R98J606K649j42l327l58K503j328
13553c450k720M22l16L103K024N01J460k707l871K576K755J229j614k306o74M077
13537D89J454k259p43Q98K586k05k63m40l235k331M053l57m263k520j371k654
$$ plain form
13521 -11161 -9915 -8967 -10077 -7587 -4877 -3261 -1168 -1369 -73 525 -623 -723 1397 328 -2747
13506 -2747 -3510 -4703 -2057 -562 893 443 571 1489 443 -2742 -1877 1756 2416 -3148 -4712 -3705
13490 -3705 -3163 -1874 -2296 -3235 -3344 -2991 -2338 -2795 -3243 -1046 97 1646 -1495 -2483 -4680 -2796 221
13473 221 1703 -272 -2637 -1446 -23 2656 -1061 -6562 -9283 -8716 -7059 -6915 -7669 -6605 -9257 -7923
13457 -7923 -13320 -14053 -10468 -6443 -7643 -9617 -9395 -7255 -5358 -6656 -7524 -4347 -1446 2399 4131
13442 4131 5377 6108 1450 -2087 -4314 -6708 -7206 -6194 -8616 -7233 -4390 -4038 -3257 -2483 -121 -3364
13426 -3364 -5575 -3584 -399 2459 957 -405 834 2289 3420 1853 1999 -2593 -4373 -2429 -1640
13411 -1640 -1035 -4451 -3040 980 4170 2969 1731 2280 2411 1482 3703 8514 13845 17450 24839 32434
$$ packed form
13521a1161J246R48j110K490K710J616K093k01J296N98j148j00K120j069l075
13506b747p63j193K646J495J455m50J28R18j046l185Q65L633O60n564j564J007
13490c705N42J289m22r39j09L53O53m57m48K197J143J549l141r88k197J884L017
13473B21J482j975k365J191J423K679l717n501k721N67J657J44p54J064k652J334
13457g923n397p33L585M025j200j974K22K140J897j298q68L177K901L845J732
13442D131J246P31m658l537k227k394m98J012k422J383K843L52P81P74K362l243
13426c364k211J991L185K858j502j362J239J455J131j567J46m592j780J944P89
13411a640O05l416J411M020L190j201j238N49J31r29K221M811N331L605P389P595
$$ plain form
13395 32434 35405 39769 47442 51727 53089 52575 47779 42334 39641 40250 35444 32557 30695 27902 23809
13380 23809 20116 14318 12989 15690 16134 13839 13091 15360 15294 12602 11076 14100 11388 10699 14472 18015
13364 18015 20692 24906 28393 33153 36323 39500 44889 43303 37633 29855 25169 19316 12511 6465
13350 6465 2900 3878 4124 5286 6809 7747 10577 9227 6148 2099 1599 364 -2405 -2078 -239 121
13334 121 -3722 -2820 2467 3441 1190 2720 4864 3548 1776 -1997 -1051 -365 681 3119 7420 7421 6371
13317 6371 5927 5269 5974 5925 6113 2733 -1267 -1438 -2362 -2240 -878 1155 3217 4063 4628 6072 6111 6303
13299 6303 6676 6880 8364 7886 6225 3369 2157 26 2970 2747 -102 -5 1667 1714 844 1770 4361
13282 4361 5031 3917 5920 4920 3521 4389 7737 6866 7249 8899 8665 10907 10330 8308 7734 7419 5477
$$ packed form
13395C2434K971M364P673M285J362n14m796n445k693O09m806k887j862k793m093
13380B3809l693n798j329K701M44k295p48K269o6k692j526L024k712o89L773L543
13364A8015K677M214L487M760L170L177N389j586n670p778m686n853o805o046
13350F465l565R78K46J162J523R38K830j350l079m049n00j235k769L27J839L60
13334A21l843R02N287R74k251J530K144j316j772l773R46O86J046K438M301Jj050
13317F371m44o58P05m9J88l380m000j71r24J22J362K033K062Q46N65J444L9J92
13299F303L73K04J484m78j661k856j212k131K944k23k849R7J672M7q70R26K591
13282D361O70j114K003j000j399Q68L348q71L83J650k34K242n77k022n74l15j942
$$ plain form
13265 5477 3445 6084 5683 3688 256 39 1184 892 4978 9277 10310 11446 8387 6706 5516
13250 5516 3667 843 1373 12185 21247 24920 19227 8739 10009 17259 20665 14449 2891 -2298
13236 -2298 -2979 3304 6558 3680 2806 6494 4214 1843 2488 5216 5328 6352 8528 7936 5401 6774
13220 6774 5710 2733 2436 480 -1004 -3169 -1713 -251 -2872 -1389 1154 2528 2796 7107 8617
13205 8617 5962 2145 3133 8087 9841 11926 10703 10893 9561 10280 7038 5101 5599 5681 6539 8640
13189 8640 8213 5168 4469 6004 8206 6269 6205 5563 3231 5235 10077 11430 9327 6652 4079 4298
13173 4298 5052 901 2205 5995 6272 4764 6311 4827 4378 5171 4916 3501 -150 -438 3939 8257
13157 8257 8251 8048 5812 1609 1837 2921 549 -3151 -3207 -4309 -2849 -3478 -269 -41 2452 7402 6884
$$ packed form
13265E477k032K639m01j995l432k17J145k92M086M299J033J136l059j681j190
13250E516j849k824N30J0812R062L673n693j0488J270P250L406o216j1558n189
13236b298o81O283L254k878q74L688k280k371O45K728J12J024K176n92k535J373
13220F774j064k977k97j956j484k165J456J462k621J483K543J374K68M311J510
13205H617k655l817R88M954J754K085j223J90j332P19l242j937M98Q2Q58K101
13189H640m27l045o99J535K202j937o4o42k332K004M842J353k103k675k573K19
13173D298P54m151J304L790K77j508J547j484m49P93k55j415l651k88M377M318
13157H257ok03k236m203K28J084k372l700n6j102J460o29L209K28K493M950n18
$$ plain form
13140 6884 9689 10157 7443 4637 2815 2708 4000 6317 5965 6016 4852 200 -400 545 1247 -451 -54
13123 -54 -537 -2027 128 1004 582 819 865 2255 2688 2234 351 -1361 -133 2095 2190 1667 -660 -2751
13105 -2751 -3828 -2648 -1255 2651 4914 6632 8307 7397 11485 14624 10980 8938 8417 9177 9091 9869
13089 9869 6005 5336 5248 3093 5915 7421 7826 5124 3795 5428 3578 1517 2401 1655 -1203 -2347
13073 -2347 964 -48 250 1354 4738 495 -828 17 -2108 -3542 -3846 -2964 -1316 2792 4620 3755
13057 3755 4349 3457 4655 7935 4681 1361 3331 1974 -350 665 305 4290 7838 12050 13288
13042 13288 13216 10159 7910 5615 5495 3456 210 -1730 -2144 -1347 -780 -3821 -4237 -4688 -7747 -6122
13026 -6122 -6408 -3736 -836 416 1964 2637 4648 8354 6739 4411 1076 -3808 -2369 -1262 -2397
$$ packed form
13140F884K805M68k714k806j822j07J292K317l52N1j164m652o00R45P02j698L97
13123e4m83j490K155Q76m22K37M6J390M33m54j883j712J228K228R5n23k327k091
13105b751j077J180J393L906K263J718J675r10M088L139l644k042n21P60q6P78
13089I869l864o69q8k155K822J506M05k702j329J633j850k061Q84p46k858j144
13073b347L311j012K98J104L384m243j323Q45k125j434l04Q82J648M108J828q65
13057C755N94q92J198L280l254l320J970j357k324J015l60L985L548M212J238
13042A3288p2l057k249k295j20k039l246j940m14P97N67l041m16m51l059J625
13026f122k86K672K900J252J548O73K011L706j615k328l335m884J439J107j135
$$ plain form
13011 -2397 -524 911 1008 -1058 5069 9518 10256 11582 11611 8880 8290 8485 7696 8933 11248 10047 9293
12994 9293 12251 12395 7989 6582 8890 8811 11846 11697 5744 3248 2751 2869 2632 2534 2536 4635 5465 6026
12976 6026 2701 1587 4872 6628 11119 14653 14160 11074 7598 9556 9895 7405 3862 2995 3406 6303
12960 6303 8790 7531 6009 7965 10193 12795 11959 11666 12817 16684 20573 22752 25535 29363 28342
12945 28342 26762 28781 31099 31855 30698 29476 26202 25946 25349 27615 28429 29254 32047 38337 40782 39352
12929 39352 39850 44236 44761 42617 50863 57250 63720 77363 92704 114088 149866 207338 300484
12916 300484 437993 616901 803533 955025 1032664 1021612 924142 764643 584946 428714
12906 428714 311348 230967 184234 152597 129383 113892 97777 83172 72634 68186 67715 64154
$$ packed form
13011b397J873J435R7k066O127M449P38J326K9k731n90J95p89J237K315j201p54
12994I293K958J44m406j407K308p9L035j49n953k496m97J18k37r8KK099Q30N61
12976F026l325j114L285J756M491L534m93l086l476J958L39k490l543q67M11K897
12960F303K487j259j522J956K228K602q36k93J151L867L889K179K783L828j021
12945B8342j580K019K318P56j157j222l274k56n97K266Q14Q25K793O290K445j430
12929C9352M98M386N25k144Q246O387O470J3643J5341K1384L5778N7472R3146
12916C00484J37509J78908J86632J51492P7639j1052r7470j59499j79697j56232
12906D28714j17366q0381m6733l1637k3214j5491j6115j4605j0538m448m71l561
$$ plain form
12894 64154 61237 56290 49840 45477 42033 36168 34127 30489 27110 24473 23799 26449 25434 23264 17421
12879 17421 13534 15778 16573 14755 13237 11614 12489 13831 13694 10518 7917 5832 6238 7587 8361 11701
12863 11701 16606 19650 22347 27245 30087 34198 39604 42518 39400 35783 37081 37477 42422 53345
12849 53345 65739 76818 79791 80198 77558 76120 75644 80348 88363 100774 113985 136361 165561
12836 165561 207352 278140 398529 611956 956167 1415312 1839148 1985754 1757462 1309532
12826 1309532 879257 581273 402806 298226 232538 184976 152377 125767 105530 91197
12816 91197 79567 70877 65874 59256 56160 55646 55602 54451 51581 54745 57113 57643 63346 65247 60592
12801 60592 55983 50130 43627 38351 25530 16488 8500 476 -7250 -14774 -17308 -16169 -13644 -6348
$$ packed form
12894F4154k917m947o450m363l444n865k041l638l379k637o74K650j015k170n843
12879A7421l887K244P95j818j518j623Q75J342j37l176k601k085M06J349P74L340
12863A1701M905L044K697M898K842M111N406K914l118l617J298L96M945J0923
12849E3345J2394J1079K973M07k640j438m76M704Q015J2411J3211K2376K9200
12836A65561M1791P0788J20389K13427L44211M59145M23836J46606k28292m47930
12826A309532m30275k97984j78467j04580o5688m7562l2599k6610k0237j4333
12816I1197j1630q690n003o618l096n14m4j151k870L164K368N30N703J901m655
12801F0592m609n853o503n276j2821r042p988q024p726p524k534J139K525P296
$$ plain form
12787 -6348 415 7284 10963 13232 14569 16852 18736 17130 13986 13084 10703 7727 7430 3637 3161
12772 3161 5883 5705 4776 3594 3620 10424 17012 19443 20893 20882 18833 15854 14289 15383 17231 19829
12756 19829 20118 15970 15951 18514 21251 28167 38618 48860 57503 62935 63133 59575 54412 54002 54561
12741 54561 58441 65735 73429 80681 86488 90691 92473 90871 86112 79525 73138 62809 53480 43049
12727 43049 30462 25364 21962 22543 21608 22127 26749 30764 36466 42380 46955 49078 51766 50044 52022
12712 52022 52925 59501 64790 67345 70025 65032 60925 60028 53875 39999 22472 -2167 -23346 -33149
12698 -33149 -35129 -31751 -26641 -18503 -6593 4179 9286 12232 15630 19037 19934 22623 28264 32132
12684 32132 32727 36661 39704 42606 45605 49938 52069 53619 53512 49723 38313 25810 12619 3727
$$ packed form
12787f348O763O869L679K269J337K283J884j606l144r02k381k976k97l793m76
12772C161K722j78r29j182K6O804O588K431J450j1k049k979j565J094J848K598
12756A9829K89m148j9K563K737O916J0451J0242Q643N432J98l558n163m10N59
12741E4561L880P294P694P252N807M203J782j602m759o587o387j0329r329j0431
12727D3049j2587n098l402N81r35N19M622M015N702N914M575K123K688j722J978
12712E2022R03O576N289K555K680m993m107q97o153j3876j7527k4639k1179r803
12698c3149j980L378N110Q138J1910J0772N107K946L398L407Q97K689N641L868
12684C2132N95L934L043K902K999M333K131J550j07l789j1410j2503j3191q892
$$ plain form
12670 3727 -577 -10249 -11709 -10049 -2607 9856 18099 24500 23935 21697 20980 24104 27720 34377 49400
12655 49400 66198 80628 89617 87925 78172 70592 73198 82262 99192 117265 135732 158363 181729
12642 181729 200711 207900 203076 194028 175450 147165 121376 100973 90263 81102 70632 61215
12630 61215 57357 54388 55900 61051 68510 76378 86623 100912 113535 123912 132263 145652 158986
12617 158986 167368 175059 185429 191277 196903 204147 212068 216475 211655 202682 194695 187748 182768 180163
12603 180163 175041 166238 157816 153937 151367 150426 147660 144526 145346 147549 149571 153363 158280 167991 179164
12588 179164 187643 192446 202726 218606 231840 239777 236249 219296 195088 165870 133948 108219
12576 108219 91980 87467 94542 107873 126152 142711 157878 173540 185997 191532 200443 211601
$$ packed form
12670C727m304r672j460J660P442J2463Q243O401n65k238p17L124L616O657J5023
12655D9400J6798J4430Q989j692r753p580K606R064J6930J8073J8467K2631K3366
12642A81729J8982P189m824r048j8578k8285k5789k0403j0710r161j0470r417
12630F1215l858k969J512N151P459P868J0245J4289J2623J0377Q351J3389J3334
12617A58986Q382P691J0370N848N626P244P921M407m820q973p987o947m980k605
12603A80163n122q803q422l879k570r41k766l134Q20K203K022L792M917R711J1173
12588A79164Q479M803J0280J5880J3234P937l528j6953k4208k9218l1922k5729
12576A08219j6239m513P075J3331J8279J6559J5167J5662J2457N535Q911J1158
$$ plain form
12564 211601 223962 237558 251392 258509 257144 250846 250231 260303 275624 294386 304893 310681 321546
12551 321546 347841 391474 438311 471904 486799 482884 467024 446482 432267 429534 428962 430357
12539 430357 437643 447826 460540 476112 489660 509273 532864 554787 581832 612074 644915 688839
12527 688839 741986 806434 887587 972267 1067191 1150532 1214708 1268549 1328338 1413845 1522221
12516 1522221 1637817 1747408 1850171 1968736 2114413 2301005 2536599 2827211 3194497
12507 3194497 3674461 4300379 5043098 5804811 6502990 7132936 7793463 8629731 9777489
12498 9777489 11360324 13535617 16560069 20913374 27502207 37859569 54122256 78054322
12490 78054322 108698086 140602704 165936306 178810865 176906153 160902035 134237196
$$ packed form
12564B11601J2361J3596J3834P117j365o298o15J0072J5321J8762J0507N788J0865
12551C21546K6295M3633M6837L3593J4895l915j5860k0542j4215k733n72J395
12539D30357P286J0183J2714J5572J3548J9613K3591K1923K7045L0242L2841M3924
12527F88839N3147O4448Q1153Q4680R4924Q3341O4176N3841N9789Q5507J08376
12516A522221J15596J09591J02763J18565J45677J86592K35594K90612L67286
12507C194497M79964O25918P42719P61713O98179O29946O60527Q36268J147758
12498I777489J582835K175293L024452M353305O588833J0357362J6262687K3932066
12490G8054322L0643764L1904618K5333602J2874559j904712j6004118k6664839
$$ plain form
12483 134237196 103301875 75329228 54376381 40303565 31052471 24738596 20179989
12476 20179989 16718190 14018854 11909487 10281872 9042718 8077574 7280157 6570293
12468 6570293 5903034 5271045 4683392 4176410 3762563 3422973 3135356 2882557 2663131
12459 2663131 2465985 2294005 2151245 2028833 1924790 1828951 1748020 1671213 1593666 1522812
12449 1522812 1458359 1401023 1343915 1289820 1246461 1212592 1188220 1168654 1155356 1140897 1126066
12438 1126066 1116899 1111160 1104326 1103073 1117603 1149742 1185093 1222139 1265965 1309790 1353981 1404981
12426 1404981 1457296 1510667 1571022 1645270 1743092 1863600 2003321 2151598 2307773 2494421
12416 2494421 2739578 3061030 3459896 3930999 4493714 5182944 5978007 6764074 7473594
$$ packed form
12483A34237196l0935321k7972647k0952847j4072816r251094o313875m558607
12476B0179989l461799k699336k109367j627615j239154r65144p97417p09864
12468F570293o67259o31989n87653n06982m13847l39590k87617k52799k19426
12459B663131j97146j71980j42760j22412j04043r5839q0931p6807p7547p0854
12449A522812o4453n7336n7108n4095m3359l3869k4372j9566j3298j4459j4831
12438A126066r167n739o834j253J4530L2139L5351L7046M3826M3825M4191N1000
12426A404981N2315N3371O0355P4248R7822J20508J39721J48277J56175J86648
12416B494421K45157L21452L98866M71103N62715O89230P95063P86067P09520
$$ plain form
12407 7473594 8200866 9135921 10453920 12313377 14940701 18681324 23991406 31478898
12399 31478898 42396785 59666491 88883640 137531757 208051634 285102579 336772330
12392 336772330 337185093 287133792 213016413 145841282 99941695 72288242 55314273
12385 55314273 43793926 35182397 28503156 23340512 19360118 16249005 13797447 11870894
12377 11870894 10349242 9122589 8107285 7242123 6494057 5866389 5357114 4944225 4580893
12368 4580893 4226573 3885820 3581544 3328353 3120419 2937370 2760979 2592786 2438268
12359 2438268 2292641 2155900 2039435 1937438 1845565 1766089 1699991 1643497 1590339 1527241
12349 1527241 1463081 1392144 1321525 1259606 1208453 1170169 1142094 1113808 1076748 1024957 963977
$$ packed form
12407G473594P27272R35055J317999J859457K627324L740623N310082P487492
12399C1478898J0917887J7269706K9217149M8648117P0519877P7050945N1669751
12392C36772330M12763n0051301p4117379o7175131m5899587k7653453j6973969
12385E5314273j1520347q611529o679241n162644l980394l111113k451558j926553
12377A1870894j521652j226653j015304q65162p48066o27668n09275m12889l63332
12368D580893l54320l40753l04276k53191k07934j83049j76391j68193j54518
12359B438268j45627j36741j16465j01997r1873p9476o6098n6494n3158o3098
12349A527241o4160p0937p0619o1919n1153l8284k8075k8286l7060n1791o0980
$$ plain form
12338 963977 901844 846546 797541 753102 712027 676869 649757 634858 625591 615671 604138 586666
12326 586666 568229 546498 524969 503769 487797 477722 466836 457176 455243 465916 481770 489664
12314 489664 485319 478419 464386 448026 439657 436648 438749 440282 440467 439548 433159 424888 414365 400130
12300 400130 383324 367730 348612 324663 295092 268663 247723 242098 245312 248676 250221 252778
12288 252778 252241 248807 245531 247455 247437 248115 249911 255045 257273 253047 245343 236228 229836 229342 225979
12273 225979 221116 216402 210304 218917 240508 257382 267609 273262 271949 260519 244907 231925 223787
12260 223787 223346 226395 233002 236215 231599 231094 230011 232800 235795 233613 234068 229362 225267 220738 216043
12245 216043 218564 224767 224442 211065 185935 146502 108791 86896 88658 112542 144152 174490
$$ packed form
12338I63977o2133n5298m9005m4439m1075l5158k7112j4899r267r920j1533j7472
12326E86666j8437k1731k1529k1200j5972j0075j0886r660j933J0673J5854P894
12314D89664m345o900j4033j6360q369l009K101J533J85r19o389q271j0523j4235
12300D00130j6806j5594j9118k3949k9571k6429k0940n625L214L364J545K557
12288B52778n37l434l276J924j8O78J796N134K228m226p704r115o392m94l363
12273B25979m863m714o098Q613K1591J6874J0227N653j313j1430j5612j2982q138
12260B23787m41L049O607L213m616n05j083K789K995k182M55m706m095m529m695
12245B16043K521O203l25j3377k5130l9433l7711k1895J762K3884L1610L0338
$$ plain form
12233 174490 196911 205615 208606 215992 229829 242105 240893 230652 212679 194792 187529 187839 187910
12220 187910 186988 181670 174123 167657 170944 179219 192240 205163 215072 222474 219720 208026 185506
12207 185506 161161 137485 112491 92592 79263 73779 76875 89297 103309 114199 115798 113763
12195 113763 115253 118555 124783 129547 129738 126473 124236 124222 124969 125575 130729 133390 133966 133815 132632 132821
12179 132821 129215 118067 106920 99930 87989 74783 64649 63290 66107 70986 73705 77562 73071
12166 73071 65957 63070 61670 63191 69991 78664 89116 99508 105706 110657 109208 106197 101154 95706
12152 95706 90636 90077 89215 87237 85180 83272 81422 79987 80641 82156 81634 85854 92544 100862 107711
12137 107711 113755 117988 121571 117611 108506 98617 89146 86313 90834 97483 103925 105463 103903 95816
$$ packed form
12233A74490K2421Q704K991P386J3837J2276j212j0241j7973j7887p263L10P1
12220A87910r22n318p547o466L287Q275J3021J2923R909P402k754j1694k2520
12207A85506k4345k3676k4994j9899j3329n484L096J2422J4012J0890J599k035
12195A13763J490L302O228M764J91l265k237j4P47O06N154K661N76j51j183J89
12179A32821l606j1148j1147o990j1941j3206j0134j359K817M879K719L857m491
12166G3071p114k887j400J521O800Q673J0452J0392O198M951j449l011n043n448
12152I5706n070n59q62j978k057j908j850j435O54J515n22M220O690Q318O849
12137A07711O044M233L583l960r105r889r471k833M521O649O442J538j560q087
$$ plain form
12123 95816 86567 78879 73797 77635 83397 80322 76505 76670 79478 80486 83607 90324 91719 91103 88651
12108 88651 88026 84169 83204 82571 81242 78307 75939 72802 71647 74766 69128 66630 70566 70496 76522 85635
12092 85635 94854 108191 118804 132089 145404 148418 143128 129235 107907 84027 64207 49664
12080 49664 38930 38148 37874 39559 40878 42145 48900 55301 60632 67958 73122 77801 86635 99752
12066 99752 110458 123652 145270 171432 218560 300238 420046 581207 771438 945986 1058565
12055 1058565 1087361 1021973 879624 698956 526606 390391 292604 229234 187381 156197
12045 156197 135695 120558 107504 97787 84541 77142 71597 66061 60085 57949 50948 44737 41387
12032 41387 39792 37350 35760 36439 39636 41863 43556 41231 39703 39127 38093 38873 40648 41288 43345
$$ packed form
12123I5816r249p688n082L838N762l075l817J65K808J008L121O717J395o16k452
12108H8651o25l857r65o33j329k935k368l137j155L119n638k498L936p0O026R113
12092H5635R219J3337J0613J3285J3315L014n290j3893k1328k3880j9820j4543
12080D9664j0734p82k74J685J319J267O755O401N331P326N164M679Q834J3117
12066I9752J0706J3194K1618K6162M7128Q1678J19808J61161J90231J74548J12579
12055A058565K8796o5388j42349j80668j72350j36215r7787o3370m1853l1184
12045A56197k0502j5137j3054r717j3246p399n545n536n976k136p001o211l350
12032D1387j595k442j590O79L197K227J693k325j528n76j034P80J775O40K057
$$ plain form
12017 43345 49245 53959 52875 51168 50729 51947 49979 46812 42607 41751 42091 37746 33696 34680 37890
12002 37890 39897 42671 44994 47359 47835 45148 42276 43209 42407 40908 38313 35961 35192 32821 29067
11987 29067 28830 29039 26534 27404 26440 23950 22061 22592 26308 29667 29965 31896 34392 35823 36635 37240
11971 37240 43100 51927 55737 57793 61460 62927 69366 76313 84028 86865 94840 103365 117146 137894
11957 137894 166313 206074 268821 379421 575323 899314 1349797 1788301 1980036 1796876
11947 1796876 1369984 933219 616525 425746 313229 242976 190222 145522 110389 83659
11937 83659 63625 56141 57030 57392 58059 54367 46095 39384 37320 35088 32917 33780 33806 37337 40344 39261
11921 39261 38301 42825 43639 35044 27400 25811 24878 27244 29017 28282 28178 31134 31860 29474 31265 34741
$$ packed form
12017D3345N900M714j084j707m39J218j968l167m205q56L40m345m050R84L210
12002C7890K007K774K323K365M76k687k872R33q02j499k595k352p69k371l754
11987B9067k37K09k505Q70r64k490j889N31L716L359K98J931K496J431Q12O05
11971C7240N860Q827L810K056L667J467O439O947P715K837P975Q525J3781K0748
11957A37894K8419L9761O2747J10600J95902L23991M50483M38504J91735j83160
11947A796876m26892m36765l16694j90779j12517p0253n2754m4700l5133k6730
11937H3659k0034p484Q89L62O67l692q272o711k064k232k171Q63K6L531L007j083
11921C9261r60M524Q14q595p644j589r33K366J773p35j04K956P26k386J791L476
$$ plain form
11905 34741 34415 34415 34986 35862 34418 32685 31004 28715 29871 29458 23995 23565 24210 22478 18699 16204 17622
11888 17622 14952 12010 15102 19377 17450 15739 18729 21838 23622 25788 21809 20016 20695 20759 21249
11873 21249 21768 22235 22588 21408 20328 21792 21091 22151 24672 26168 26727 27613 29456 30759 29581 32548
11857 32548 35810 33982 31641 27883 25386 27075 24500 22855 20048 16505 16672 17207 16568 17569 17845
11842 17845 18119 17347 18963 20479 14243 15051 19852 19731 22109 21408 18826 20666 21269 19723 20845 17743
11826 17743 19606 21916 21729 20644 18669 17442 14953 17143 17414 19090 21257 20241 19108 20099 20097 14925
11810 14925 16452 17848 16586 13852 14273 15661 15485 15374 15849 13943 12967 12826 11601 13157 15106 16507
11794 16507 15797 13909 13706 14315 15033 15895 11356 6897 5657 7205 4728 1520 4 2087 6416 11794
$$ packed form
11905C4741l26%N71Q76j444j733j681k289J156m13n463m30O45j732l779k495J418
11888A7622k670k942L092M275j927j711K990L109J784K166l979j793O79O4M90
11873B1249N19M67L53j180j080J464p01J060K521J496N59Q86J843J303j178K967
11857C2548L262j828k341l758k497J689k575j645k807l543J67N35o39J001K76
11842A7845K74p72J616J516o236Q08M801j21K378p01k582J840O03j546J122l102
11826A7743J863K310j87j085j975j227k489K190K71J676K167j016j133R91kn172
11810A4925J527J396j262k734M21J388j76j11M75j906r76j41j225J556J949J401
11794A6507p10j888k03O09P18Q62m539m459j240J548k477l208j516K083M329N378
$$ plain form
11778 11794 12908 10185 11508 14727 15682 14635 16056 16376 16689 15948 16415 15980 13801 10242 5090 4623
11762 4623 8527 11238 13420 13957 16591 16839 18281 19268 19162 16974 17862 15219 11596 11372 11467 9562 6428
11745 6428 6397 5879 8814 11149 11394 11219 9432 9206 10871 6660 5326 8686 12064 12460 13216 9138 9072
11728 9072 7123 11512 13200 13062 12770 13709 17561 19125 14522 14850 19386 19254 19628 21511 19064 16109
11712 16109 14600 14115 16048 16229 16664 13570 13881 12740 10284 9889 7950 7958 5729 8181 9169 9504 10856
11695 10856 11804 12420 9941 8953 11950 10515 11066 11387 11405 9286 9126 10239 10851 10670 10504 10402 7973
11678 7973 7318 11129 11734 9763 10210 11387 12067 10224 12123 10270 11528 11234 5969 4447 9608 12139
11662 12139 12621 11824 9739 7735 9991 12123 14124 14761 15907 16948 15444 10956 8493 7387 6907
$$ packed form
11778A1794J114k723J323L219R55j047J421L20L13p41M67m35k179l559n152m67
11762D623L904K711K182N37K634K48J442R87j06k188Q88k643l623k24R5j905l134
11745F428l1n18K935K335K45j75j787k26J665m211j334L360L378L96P56m078o6
11728I072j949M389J688j38k92R39L852J564m603L28M536j32L74J883k447k955
11712A6109j509m85J933J81M35l094L11j141k456l95j939Qk229K452R88L35J352
11695A0856R48O16k479r88K997j435N51L21J8k119j60J113O12j81j66j02k429
11678G973o55L811O05j971M47J177O80j843J899j853J258k94n265j522N161K531
11662A2139M82p97k085k004K256K132K001O37J146J041j504m488k463j106m80
$$ plain form
11647 6907 11201 10336 12129 12405 9931 10008 10016 7514 3247 5075 5215 5600 6958 7999 10092 8490 10715
11630 10715 9349 6703 8559 10576 6877 4533 5618 6675 6349 5816 4155 829 -1900 -456 3250
11615 3250 6385 5765 4389 7359 7488 7210 7438 9661 8800 9009 8410 7495 8616 10433 10064 10966 10060
11598 10060 7118 10242 9794 12257 11724 9227 8259 6347 8290 8829 7163 5684 5355 -558 -1833 -362
11582 -362 3866 5283 7789 8453 11416 13928 15054 10288 5480 5040 5349 9007 9344 7278 4996 3061
11566 3061 3889 6219 3201 -1650 -3209 -722 4461 6280 1952 -2885 1081 6378 6865 3215 2023
11551 2023 5802 3776 946 4686 16949 22948 22311 16477 11142 13193 19918 23699 19284 10784 1381
11536 1381 -1271 1530 1152 1498 3668 8126 6969 2388 547 2657 4519 5424 8773 8367 8136 9400
$$ packed form
11647F907M294q65J793K76k474P7Qk502m267J828J40L85J358J041K093j602K225
11630A0715j366k646J856K017l699k344J085J057l26n33j661l326k729J444L706
11615C250L135o20j376K970J29k78K28K223q61K09n99r15J121J817l69R02r06
11598A0060k942L124m48K463n33k497r68j912J943N39j666j479l29n913j275J471
11582c62M228J417K506O64K963K512J126m766m808m40L09L658L37k066k282j935
11566C061Q28K330l018m851j559K487N183J819m328m837L966N297M87l650j192
11551B023L779k026k830L740J2263N999o37n834n335K051O725L781m415q500r403
11536A381k652K801l78L46K170M458j157m581j841K110J862R05L349m06k31J264
$$ plain form
11520 9400 14171 14869 15012 13344 11326 7984 3228 1117 1639 1250 1912 2912 4417 4484 3451 5026
11504 5026 5729 4548 8276 10121 7982 6703 10738 13478 13718 9964 9546 9190 8509 4616 2666 813
11488 813 2260 2231 4767 6124 6109 4191 5312 7019 9694 11901 12237 10931 10584 5399 3049 2576 307
11471 307 -1602 2554 1274 2409 2994 878 -249 3330 2230 3173 3935 1547 -844 1098 3535 9999
11455 9999 8719 4483 3843 2893 2093 934 -1408 -636 3797 5946 7653 7717 10033 12597 11654 9377
11439 9377 6614 5248 5346 5009 3787 4476 3716 1154 179 -114 1511 1659 506 75 2752 6261 5017
11422 5017 4609 3714 6566 8708 7039 4617 3212 -443 -2232 -3130 -989 -1104 -987 -1915 -260 145
11406 145 -628 -141 -1110 -1192 -1486 1368 2939 4448 5082 5406 5960 2210 3537 3909 2200 2143 1193 1475
$$ packed form
11520I400M771O98J43j668k018l342m756k111N22l89O62J000J505O7j033J575
11504E026P03j181L728J845k139j279M035K740K40l754m18l56o81l893j950j853
11488H13J447k9K536J357j5j918J121J707K675K207L36j306l47n185k350m73k269
11471C07j909M156j280J135N85k116j127L579j100R43P62k388k391J942K437O464
11455I999j280m236o40r50q00j159k342P72M433K149J707O4K316K564r43k277
11439I377k763j366R8l37j222O89p60k562r75k93J625J48j153m31K677L509j244
11422E017m08q95K852K142j669k422j405l655j789q98K141j15J17r28J655M05
11406A45p73M87r69q2k94K854J571J509O34L24N54l750J327L72j709n7r50K82
$$ plain form
11388 1475 1532 3274 1279 -3395 -3887 164 845 -86 1939 4185 6421 6229 5793 6574 5121 4726 4130
11371 4130 4331 2637 438 -1677 -1640 -181 -1872 -3411 -3551 -2355 -2157 -996 -2114 -411 3066 7155
11355 7155 5679 2780 2482 36 -1540 -1538 -2203 -3976 -3752 -1977 -509 -1501 -3261 -862 5535 8757
11339 8757 2743 -1160 -155 -1146 -515 -1412 -1933 1457 1764 2928 1190 -856 1023 4232 5878 8264
11323 8264 7448 4108 1919 -1470 365 4444 2589 1182 2591 2361 4597 6029 9332 6313 5042
11308 5042 4683 3569 3038 255 1138 2962 4730 4247 261 -2714 -707 4130 7248 6722 5861 6339
11292 6339 6727 2797 366 -834 -2853 -4543 -2404 -1088 3037 2483 1626 4811 6403 2397 72
11277 72 488 -1127 -4458 -6847 -3487 -2249 -2333 -1280 2140 2605 -386 -3705 534 2718 5591 4078
$$ packed form
11388A475N7J742j995m674m92M051O81r31K025K246K236j92m36P81j453l95n96
11371D130K01j694k199k115L7J459j691j539j40J196J98J161j118J703L477M089
11355G155j476k899k98k446j576Ko65j773K24J775J468r92j760K399O397L222
11339H757o014l903J005r91O31q97n21L390L07J164j738k046J879L209J646K386
11323H264q16l340k189l389J835M079j855j407J409k30K236J432L303l019j271
11308E042l59j114n31k783Q83J824J768m83l986k975K007M837L118n26q61M78
11292F339L88l930k431j200k019j690K139J316M125n54q57L185J592m006k325
11277G2M16j615l331k389L360J238q4J053L420M65k991l319M239K184K873j513
$$ plain form
11261 4078 1958 1863 -1415 -839 -552 1091 2416 2359 2484 4862 4087 -1719 -2899 294 78 39 4442
11244 4442 6215 7047 7645 8758 9226 5894 1444 -638 2393 4785 1386 -1242 -1199 -2696 -4410 -3756
11228 -3756 -776 -1678 -1098 -1759 -2523 -3976 -1224 3028 4862 4225 3928 1973 1899 1021 689 -276 340 2330
11210 2330 1521 1783 524 -579 1923 303 1412 1727 2944 -1712 -1067 2995 2891 2717 1536 1736
11194 1736 1416 2646 3449 3024 3835 1136 -1692 -499 -2099 -491 709 3003 3261 1913 -1506 -2703
11178 -2703 -1068 2245 597 -2424 -1430 3794 3110 2102 1377 625 -781 -1551 -1573 1004 1409 4658 7089
11161 7089 3262 4168 2753 3938 6480 3117 2129 5347 6861 7963 6702 5737 2335 1622 1997 5147
11145 5147 9475 9178 5668 3199 -341 769 1021 2296 2914 3324 2023 -477 -2507 -2953 -3557 -3075
$$ packed form
11261D078k120r5l278N76K87J643J325n7J25K378p75n806j180L193k16l9M403
11244D442J773Q32N98J113M68l332m450k082L031K392l399k628M3j497j714O54
11228c756K980r02N80o61p64j453K752M252J834o37k97j955p4q78l32r65O16J990
11210B330q09K62j259j103K502j620J109L15J217m656O45M062j04j74j181K00
11194A736l20J230Q03m25Q11k699k828J193j600J608J200K294K58j348l419j197
11178b703J635L313j648l021R94N224o84j008p25p52j406p70k2K577M05L249K431
11161G089l827R06j415J185K542l363r88L218J514J102j261r65l402p13L75L150
11145E147M328k97l510k469l540J110K52J275O18M10j301k500k030m46o04M82
$$ plain form
11129 -3075 1773 3303 4805 2936 -1158 -1318 771 -813 -3046 -2720 -3547 -891 -974 -1056 -28 3082
11113 3082 4383 2203 -479 -887 2045 5140 4034 1930 2541 1085 -2265 -4356 -3308 -779 2712
11098 2712 4248 3437 2890 3462 2913 60 -126 4339 2503 -1136 -407 -464 -759 491 4813 7126 8288
11081 8288 11989 10041 5020 1384 -4094 -3758 168 1627 2461 2328 3581 2491 4988 1259 1019 -1414
11065 -1414 1037 1590 1222 -1734 2544 5886 4354 2610 -1934 -2213 1044 1799 -1645 -2376 -1384 -3285
11049 -3285 -5326 -4888 -5068 -6618 -1543 1373 3481 5647 4600 1137 -2018 -2240 -1283 218 456 -2792
11033 -2792 -2146 -2054 -1839 -4103 -4645 -1546 -1520 -414 348 -526 2679 3474 4283 3146 -1460 -2990 -2097 -2444
11015 -2444 -4228 -5024 -2593 -286 2744 3200 1255 -2401 -3164 -2328 325 1190 4537 3980 2099 2805
$$ packed form
11129c075M848J530J502j869m094j60K089j584k233L26q27K656q3q2J028L110
11113C082J301k180k682m08K932L095j106k104O11j456l350k091J048K529L491
11098B712J536q11n47N72n49k853j86M465j836l639P29n7k95J250M322K313J162
11081H288L701j948n021l636n478L36L926J459Q34j33J253j090K497l729k40k433
11065a414K451N53l68k956M278L342j532j744m544k79L257P55l444p31R92j901
11049c285k041M38j80j550N075K916K108K166j047l463l155k22R57J501K38l248
11033b792O46R2K15k264n42L099K6J106P62q74L205P95Q09j137m606j530Q93l47
11015b444j784p96K431K307L030M56j945l656p63Q36K653Q65L347n57j881P06
$$ plain form
10999 2805 606 -350 -567 -939 -1855 -2329 -7286 -11370 -7603 -6493 -5943 -5784 -4541 -1095 -16 432 -859
10982 -859 -4650 -4288 -2101 -2848 -5493 -5247 -1535 -322 -1112 964 1953 3173 1978 1123 1528 2172 3352
10965 3352 3700 4124 5725 2338 3568 4396 5124 2017 1456 -902 -2668 -2526 -1843 -1757 -626 -2740 -3449
10948 -3449 -1342 -1288 -2551 -577 1132 2765 2436 -3389 -6868 -7149 -5018 -4388 -4233 -4468 -1495 -878 322
10931 322 1497 4139 4241 3200 4263 4023 4530 5869 2359 -435 -2823 -2258 -1170 2207 1600 -999
10915 -999 2326 1477 4111 6828 8538 7828 7333 4372 -177 580 4555 3554 -949 922 5338 7255
10899 7255 8816 11128 14765 16457 11318 12755 15689 10859 5073 3130 5506 3365 -3580 -8156 -3245
10884 -3245 3081 885 -2587 -3469 -2752 -1495 -998 -2320 -1038 570 -352 -2159 -808 2233 3102 3592
$$ packed form
10999B805k199r56k17l72r16m74m957m084L767J110N50J59J243L446J079M48j291
10982h59l791L62K187p47k645K46L712J213p90K076R89J220j195q55M05O44J180
10965C352L48M24J601l387J230Q28P28l107n61k358j766J42O83Q6J131k114p09
10948c449K107N4j263J974J709J633l29n825l479k81K131O30J55k35K973O17J200
10931C22J175K642J02j041J063k40N07J339l510k794k388N65J088L377o07k599
10915i99L325q49K634K717J710p10m95k961m549P57L975j001m503J871M416J917
10899G255J561K312L637J692n139J437K934m830n786j943K376k141o945m576M911
10884c245O326k196l472q82P17J257M97j322J282J608r22j807J351L041Q69M90
$$ plain form
10868 3592 8343 11242 7002 4365 4114 5167 4445 6233 7382 7185 3453 549 4951 6330 2157
10853 2157 2124 4858 4651 1602 1223 2632 4731 6526 5331 5792 6291 5209 6636 5782 3033 5975
10837 5975 6040 1640 889 2049 1312 8083 14847 22044 26754 27534 20281 14056 6834 5258 7025 8135
10821 8135 7462 7598 6275 4574 4270 2668 1806 3466 1515 -317 -2903 -4231 -641 1567 798 2376
10805 2376 813 596 641 -1693 -1585 -2582 -2417 -2886 253 -3129 -1944 2359 2018 3241 6281 5486 2145
10788 2145 3760 3468 4863 7643 6228 2917 537 -692 -2487 -1103 -4831 -6617 -4448 -3069 -1246
10773 -1246 -210 2575 1054 -464 -297 1157 -1419 -114 -1968 -9129 -11384 -6223 -2133 -1575 234
10758 234 -327 -722 -1893 -2412 -2691 -4844 -5665 -6138 -3151 -2560 93 1199 2869 3199 1017 -1521 -2519
$$ packed form
10868C592M751K899m240k637k51J053p22J788J149j97l732k904M402J379m173
10853B157l3K734k07l049l79J409K099J795j195M61M99j082J427q54k749K942
10837E975O5m400p51J160p37O771O764P197M710P80p253o225p222j576J767J110
10821H135o73J36j323j701l04j602q62J660j951j832k586j328L590K208p69J578
10805B376j563k17M5k334J08r97J65m69L139l382J185M303l41J223L040p95l341
10788B145J615k92J395K780j415l311k380j229j795J384l728j786K169J379J823
10773a246J036K785j521j518J67J454k576J305j854p161k255N161M090N58J809
10758B34n61l95j171n19k79k153q21m73K987N91K653J106J670L30k182k538r98
$$ plain form
10741 -2519 -502 1352 664 1758 2510 -910 498 1434 1351 2053 1619 -1449 -6271 -5839 -1902 -706 -1041
10724 -1041 -3506 -3284 -233 2361 498 290 3257 67 -2592 -1254 -1518 -5821 -8187 -6911 -3150
10709 -3150 333 -3291 -3788 -4022 -6420 -3874 -1026 1062 2436 3967 4420 8228 4966 893 667 547
10693 547 2166 1865 3483 1525 -1914 -5545 -6518 -6805 -6338 -4475 -1801 -2582 -5309 -3494 -1475 -995
10677 -995 -526 -2795 -5095 -4223 -2544 -3880 -2194 -2655 -4233 -1718 1164 2538 4499 8461 6944 4942
10661 4942 2504 -267 -3251 -5344 -2384 2441 1797 1798 3209 5587 6187 6663 2244 162 -702 2897
10645 2897 2418 2131 -118 -906 137 3938 3639 3294 5129 8268 5320 -97 -3603 -5852 -6890 -3847
10629 -3847 -2321 -1711 -2209 -1394 -3298 -2172 -1790 -3332 -1662 -2945 -6168 -5521 -2243 -3 -2006 -2748
$$ packed form
10741b519K017J854o88J094P52l420J408R36q3P02m34l068m822M32L937J196l35
10724a041k465K22L051K594j863k08K967l190k659J338k64m303k366J276L761
10709c150L483l624m97k34k398K546K848K088J374J531M53L808l262m073k26j20
10693E47J619l01J618j958l439l631r73k87M67J863K674p81k727J815K019M80
10677i95M69k269k300Q72J679j336J686m61j578K515K882J374J961L962j517k002
10661D942k438k771k984k093K960M825o44JJ411K378O00M76m419k082q64L599
10645B897m79k87k249p88J043L801k99l45J835L139k948n417l506k249j038L043
10629c847J526O10m98Q15j904J126L82j542J670j283l223O47L278K240k003p42
$$ plain form
10613 -2748 2032 4299 4186 4639 1365 1437 3728 3797 3272 -490 452 4060 4627 6075 5266 1820 1226
10596 1226 -310 2565 4911 1534 -3195 -4521 -3128 674 700 -3983 -6521 -6610 -5154 -782 -518 -1240
10580 -1240 -1684 -2571 -4275 -4091 -2262 149 12 2639 4707 810 -1251 -533 -327 -36 -1389 -1477 -2654
10563 -2654 -3947 -6845 -8935 -7799 -9143 -11492 -7104 -1527 48 1243 7497 9126 9309 7230 5803
10548 5803 6455 5466 1093 226 2778 3204 1238 -1603 -4623 -5790 -5539 -3897 -2574 1909 4968 3747
10532 3747 -186 -3754 -2809 -3292 -3734 -1551 510 137 2624 3516 -990 -5933 -8031 -5859 -3824 -5863
10516 -5863 -5645 2538 7809 10536 10607 7626 8167 11691 14177 11747 11171 13099 17375 21032 24138 27069
10500 27069 27175 31928 37433 40893 39976 33626 28383 28446 26104 24109 21344 17220 14561 14317 11758 13304
$$ packed form
10613b748M780K267j13M53l274P2K291O9n25l762R42L608N67J448q09l446n94
10596A226j536K875K346l377m729j326J393L802K6m683k538q9J456M372K64p22
10580a240m44q87j704J84J829K411j37K627K068l897k061P18K06K91j353q8j177
10563b654j293k898k090J136j344k349M388N577J575J195O254J629J83k079j427
10548E803O52r89m373q67K552M26j966k841l020j167K51J642J323M483L059j221
10532C747l933l568R45m83m42K183K061l73K487Q92m506m943k098K172K035k039
10516e863K18Q183N271K727P1k981N41L524K486k430n76J928M276L657L106K931
10500B7069J06M753N505L460r17o350n243O3k342j995k765m124k659k44k559J546
$$ plain form
10484 13304 14513 15351 13748 8132 3743 2227 6253 4445 2168 4607 6076 6516 7387 12884 18591
10469 18591 21636 25818 29262 34629 41450 43642 45670 49548 58837 71596 82444 97470 118089
10456 118089 150229 200150 278937 410566 621382 901958 1162450 1279413 1253793 1230501
10446 1230501 1279293 1287931 1133847 856568 588359 404674 291704 223757 181688 147887
10436 147887 121440 102010 89476 77546 67498 57996 55678 54616 47972 41968 36408 29414 26162
10423 26162 26342 26517 23801 23107 20764 22076 24584 25691 20530 17053 17823 16580 16374 16364 15808 14077
10407 14077 13974 14666 13810 10873 15538 14693 13477 14507 13366 10328 4955 4772 2721 2415 6949 11864
10391 11864 10375 11027 14692 19533 23622 26235 30171 28227 24269 20534 14953 10274 6034 5393 6375
$$ packed form
10484A3304J209Q38j603n616m389j516M026j808k277K439J469M40Q71N497N707
10469A8591L045M182L444N367O821K192K028L878R289J2759J0848J5026K0619
10456A18089L2140M9921P8787J31629K10816K80576K60492J16963k5620k3292
10446A230501M8792Q638j54084k77279k68209j83685j12970o7947m2069l3801
10436A47887k6447j9430j2534j1930j0048r502k318j062o644o004n560o994l252
10423B6162J80J75k716o94k343J312K508J107n161l477P70j243k06j0n56j731
10407A4077j03O92q56k937M665q45j216J030j141l038n373j83k051l06M534M915
10391A1864j489O52L665M841M089K613L936j944l958l735n581m679m240o41R82
$$ plain form
10376 6375 7815 7321 9838 12956 14636 16375 17041 18690 15432 11882 16901 21311 21634 25235 25671 24347
10360 24347 25772 27710 29881 23855 9429 -5043 -14978 -23694 -33595 -44749 -55846 -64521 -63646 -59306
10346 -59306 -55557 -47775 -35773 -23794 -13359 -9295 -7588 -5438 -4809 -652 4065 4139 2641 -1710
10332 -1710 -3161 -5181 -5454 -5146 -5209 -8711 -10983 -11534 -7669 -6475 -2571 559 563 -2345 -3283 -389 1297
10315 1297 -1539 -3779 -636 130 -691 4518 15787 30030 40788 46465 50207 60945 73235 79937
10301 79937 80211 77027 77142 78784 87623 99334 102562 102851 105821 106577 100213 86653 75038 66498 56856
10286 56856 46090 37946 30178 24630 18080 10722 11514 14248 13487 11859 14114 20301 23656 27907 28949
10271 28949 26141 27551 28536 25284 27580 27615 27413 26678 26586 23434 23265 25592 32975 34766 31022 31331 30910
$$ packed form
10376F375J440m94K517L118J680J739O66J649l258l550N019M410L23L601M36j324
10360B4347J425J938K171o026j4426j4472r935q716r901j1154j1097q675Q75M340
10346e9306L749P782J2002J1979J0435M064J707K150O29M157M717P4j498m351
10332a710j451k020k73L08o3l502k272n51L865J194L904L130Mk908r38K894J686
10315A297k836k240L143P66q21N209J1269J4243J0758N677L742J0738J2290O702
10301G9937K74l184J15J642Q839J1711L228K89K970P56o364j3560j1615q540r642
10286E6856j0766q144p768n548o550p358P92K734p61j628K255O187L355M251J042
10271B8949k808J410R85l252K296L5k02p35r2l152j69K327P383J791l744L09m21
$$ plain form
10254 30910 31872 34860 33529 28468 23328 18532 17645 16094 13883 13022 11727 11146 14734 21460 31501
10239 31501 46007 56907 62927 64886 67227 67077 61403 47536 27360 13013 2072 -11159 -25638
10226 -25638 -34241 -34391 -27315 -17109 -11349 -7365 -3653 374 8489 12389 12983 9987 442 -9539 -11737
10211 -11737 -8667 -9342 -16968 -23251 -24416 -10805 13904 38920 61154 77719 85063 87993 92709
10198 92709 98111 98877 89684 75974 61300 48718 42567 40730 42611 43830 41478 38538 39643 41926
10184 41926 43353 47679 56513 64098 70297 84547 106192 128919 146648 156731 162606 174608 196844
10171 196844 220052 228989 222288 208442 203541 206176 202799 194107 177900 162294 143870 134956 131102
10158 131102 131835 130164 131042 129480 135246 145070 148483 148907 153032 153889 157758 159744 158917 158918 155470 156996
$$ packed form
10254C0910R62K988j331n061n140m796q87j551k211q61j295n81L588O726J0041
10239C1501J4506J0900O020J959K341j50n674j3867k0176j4347j0941j3231j4479
10226b5638q603j50P076J0206N760L984L712M027Q115L900N94k996r545r981k198
10211a1737L070o75p626o283j165J3611K4709K5016K2234J6565P344K930M716
10198I2709N402P66r193j3710j4674j2582o151j837J881J219k352k940J105K283
10184D1926J427M326Q834P585O199J4250K1645K2727J7729J0083N875J2002K2236
10171A96844K3208Q937o701j3846m901K635l377q692j6207j5606j8424q914l854
10158A31102P33j671Q78j562N766R824L413M24M125Q57L869J986q27Jl448J526
$$ plain form
10142 156996 154934 150435 148744 140075 127040 120227 121522 121120 118269 119122 123151 129591 134998 146068
10128 146068 161084 165079 165060 166188 176332 192347 208751 222357 234287 250710 273175 296876
10116 296876 317838 329274 328632 328361 331543 338027 342545 343723 353617 363473 369802 376767 384922 391648
10102 391648 398740 403660 403933 403028 410542 419287 432476 441864 452753 473023 499788 526089 550274
10089 550274 580101 618860 658940 701717 754240 816178 889577 972532 1055942 1131766 1206043
10078 1206043 1284657 1372230 1471852 1589794 1720157 1867616 2034248 2254072 2570956 3017976
10068 3017976 3573899 4139480 4587041 4936261 5371436 5998230 6708672 7378533 8093098
10059 8093098 9076514 10426017 12108733 14220166 17121996 21314041 27460127 36928069
$$ packed form
10142A56996k062m499j691q669j3035o813J295m02k851Q53M029O440N407J1070
10128A46068J5016L995j9J128J0144J6015J6404J3606J1930J6423K2465K3701
10116B96876K0962J1436o42k71L182O484M518J178R894R856O329O965Q155O726
10102C91648P092M920K73r05P514Q745J3189R388J0889K0270K6765K6301K4185
10089E50274K9827L8759M0080M2777N2523O1938P3399Q2955Q3410P5824P4277
10078A206043P8614Q7573R9622J17942J30363J47459J66632K19824L16884M47020
10068C017976N55923N65581M47561L49220M35175O26794P10442O69861P14565
10059H093098R83416J349503J682716K111433K901830M192045O146086R467942
$$ plain form
10051 36928069 52480517 78397989 118340842 168297942 210149972 224842444 217185237
10044 217185237 212545387 221750100 224996375 201021817 155102324 109128946 76126281
10037 76126281 55480125 42573704 33929177 27654573 22933468 19419149 16739293 14509874
10029 14509874 12574081 11007287 9871635 9069554 8389365 7683969 7012089 6477995 6048593
10020 6048593 5578238 5020512 4466218 3991380 3616414 3341581 3156100 3061466 3073917 3180350
10010 3180350 3264178 3142047 2798742 2414681 2124850 1927684 1784551 1672164 1572877 1483311
10000 1483311 1406055 1338917 1276777 1215936 1157591 1104315 1048947 996904 947123 902883 860371
9989 860371 816482 768960 728548 694927 671907 648338 621184 596278 576263 554064 528115 500301
$$ packed form
10051C6928069J5552448K5917472L9942853M9957100M1852030J4692472p657207
10044B17185237m639850R204713L246275k3974558m5919493m5973378l3002665
10037G6126281k0646156j2906421q644527o274604m721105l514319k679856k229419
10029A4509874j935793j566794j135652q02081o80189p05396o71880n34094m29402
10020F048593m70355n57726n54294m74838l74966k74833j85481r4634J2451J06433
10010C180350Q3828j22131l43305l84061k89831j97166j43133j12387r9287q9566
10000A483311p7256o7138o2140o0841n8345n3276n5368n2043m9781m4240m2512
9989H60371m3889m7522m0412l3621k3020k3569k7154k4906k0015k2199k5949k7814
$$ plain form
9977 500301 475301 456270 437421 418173 400566 390186 390278 395260 397905 396872 391901 392503 398730 397761
9963 397761 389674 377676 363453 354327 352488 350537 349217 351860 351349 346764 343972 340481 330124 313190
9949 313190 294659 282117 272482 256720 239363 223177 214234 206942 202753 203772 204123 198689 198852 202170
9935 202170 206123 209576 216748 229233 251096 288491 354521 422258 385922 299796 248610 230827
9923 230827 228676 231618 226893 217157 216636 224117 228455 223605 219063 213263 205052 199856 190951 187042 185777
9908 185777 188377 188969 187367 187534 186999 184882 181150 178250 173818 173152 171716 168892 159476 146572 130656
9893 130656 118229 112980 113532 116259 113668 111778 111859 116896 124253 138126 154235 163028 166784 165109
9879 165109 159744 159965 162143 161611 154519 144317 132131 124409 123844 125038 128907 133770 139703 149012 156295
$$ packed form
9977E00301k5000j9031j8849j9248j7607j0380R2M982K645j033m971O02O227r69
9963C97761q087j1998j4223r126j839j951j320K643n11m585k792l491j0357j6934
9949C13190j8531j2542r635j5762j7357j6186q943p292m189J019L51n434J63L318
9935B02170L953L453P172J2485K1863L7395O6030O7737l6336q6126n1186j7783
9923B30827k151K942m725r736n21P481M338m850m542n800q211n196q905l909j265
9908A85777K600N92j602J67n35k117l732k900m432o66j436k824r416j2904j5916
9893A30656j2427n249N52K727k591j890Q1N037P357J3873J6109Q793L756j675
9879A65109n365K21K178n32p092j0202j2186p722n65J194L869M863N933R309P283
$$ plain form
9864 156295 164645 165869 157969 142122 130302 115853 95213 73932 57476 50862 49466 52885 54095
9851 54095 54748 63800 76644 86910 95139 97525 99362 99214 97089 96398 94581 92030 86500 80950 78426
9836 78426 73580 68278 67445 67201 67392 64763 60292 61956 65299 65932 63206 65020 66245 64628 63776 64511
9820 64511 68093 71166 67969 63179 59885 59704 64218 71938 79704 81950 86236 88466 90768 91295 87170
9805 87170 81431 78620 77579 73295 69949 69994 71755 68373 67191 68942 67920 70863 76231 80638 81723
9790 81723 85839 92593 92789 91201 92188 96150 95987 95901 96067 98698 94203 88386 87573 87390 87266 85823 84586
9773 84586 85942 81623 73976 70987 75404 79495 81721 84333 86944 90539 91626 91722 93937 95908 93028
9758 93028 89310 92080 91576 89064 89717 89411 88510 90998 98601 105205 107696 109289 114504 122708 127309 129562
$$ packed form
9864A56295Q350J224p900j5847j1820j4449k0640k1281j6456o614j396L419J210
9851E4095O53R052J2844J0266Q229K386J837j48k125o91j817k551n530n550k524
9836G8426m846n302q33k44J91k629m471J664L343O33k726J814J225j617q52P35
9820F4511L582L073l197m790l294j81M514P720P766K246M286K230K302N27m125
9805H7170n739k811j041m284l346M5J761l382j182J751j022K943N368M407J085
9790H1723M116O754J96j588R87L962j63q6J66K631m495n817q13j83j24j443j237
9773H4586J356m319p647k989M417M091K226K612K611L595J087R6K215J971k880
9758I3028l718K770n04k512O53l06r01K488P603O604K491J593N215Q204M601K253
$$ plain form
9742 129562 137131 140661 146027 146960 137587 126726 116997 106229 94540 78153 62661 51129 45448
9729 45448 47672 48163 41425 38169 37228 35358 32397 32311 32562 32302 31653 34745 42412 43138 47346 49555 52455
9712 52455 51057 48358 48800 48946 44543 42110 44696 45989 46704 46357 46381 45082 43220 45214 48195 50763
9696 50763 52338 52490 53765 54785 52756 52699 51834 50346 48849 47118 43496 42650 44058 47236 46659 45120
9680 45120 46873 47317 47416 45854 48621 53179 54641 54752 51497 53743 61178 68348 71957 75240 76585 77846
9664 77846 81101 83288 86632 94727 107536 115897 123550 130400 144441 168214 201792 243872 286420
9651 286420 319298 337637 338875 326157 305971 297159 311066 351817 419630 536915 727102 1006448
9639 1006448 1339519 1609865 1736362 1812831 2004033 2342223 2761100 3304420 4172519 5331173
$$ packed form
9742A29562P569L530N366R33r373j0861r729j0768j1689j6387j5492j1532n681
9729D5448K224M91o738l256r41j870k961q6K51k60o49L092P667P26M208K209K900
9712E2455j398k699M42J46m403k433K586J293P15l47K4j299j862J994K981K568
9696E0763J575J52J275J020k029n7q65j488j497j731l622q46J408L178n77j539
9680D5120J753M44R9j562K767M558J462J11l255K246P435P170L609L283J345J261
9664G7846L255K187L344Q095J2809Q361P653O850J4041K3773L3578M2080M2548
9651B86420L2878J8339J238j2718k0186q812J3907M0751O7813J17285J90187K79346
9639A006448L33071K70346J26497P6469J91202L38190M18877N43320Q68099J158654
$$ plain form
9629 5331173 5926784 5091614 3652462 2515193 1791429 1339741 1039030 832299 681051
9620 681051 567043 482491 420499 369821 324553 288786 260499 240489 225224 212527 203600 193976
9608 193976 185578 170605 155571 140091 125362 117392 108256 96722 89318 83136 80772 77730 75729
9595 75729 76736 74390 77356 77046 78020 84571 89378 90607 87987 82989 78874 73408 67253 59429 55323
9580 55323 50262 47372 47098 46403 43483 45532 51958 54321 55416 54003 52873 52081 55058 61778 66647
9565 66647 64802 67474 74224 80388 83265 84952 86063 87581 93076 98982 100102 94215 87153 82178 76893
9550 76893 69152 62807 56102 48901 49319 46703 43759 42575 41326 38389 38796 41627 41715 42826 44079 46514
9534 46514 49762 48991 46185 46019 43356 43105 43766 43525 45119 45346 43573 44563 44111 42297 44252 46320 47328
$$ packed form
9629E331173N95611q35170j439152j137269p23764m51688l00711k06731j51248
9620F81051j14008q4552o1992n0678m5268l5767k8287k0010j5265j2697q927r624
9608A93976q398j4973j5034j5480j4729p970r136j1534p404o182k364l042k001
9595G5729J007k346K966l10R74O551M807J229k620m998m115n466o155p824m106
9580E5323n061k890k74o95k920K049O426K363J095j413j130p92K977O720M869
9565F6647j845K672O750O164K877J687J111J518N495N906J120n887p062m975n285
9550G6893p741o345o705p201M18k616k944j184j249k937M07K831Q8J111J253K435
9534D6514L248p71k806j66k663k51O61k41J594K27j773R90m52j814J955K068J008
$$ plain form
9517 47328 47319 44810 44591 43559 49132 52206 51741 49363 46967 47921 49412 48927 41268 31879 16831 4065
9501 4065 -6614 -11165 -10414 -9139 -8558 -2285 5220 7233 12550 19008 23552 27326 28327 27057 30560
9486 30560 31554 30503 33382 35880 33740 29272 30388 30504 25895 23135 19962 22836 25945 30659 31718
9471 31718 28459 27486 25877 27825 30592 34757 35569 34638 32672 29059 32751 37350 46745 54487 62975
9456 62975 71962 75778 78904 80970 80539 78948 77851 81219 88274 89768 90628 96396 100500 98325 100241
9441 100241 102436 94434 83166 75001 66709 58339 50873 43594 37945 39948 40661 37972 35530 35135 43221
9426 43221 49716 54541 58416 58310 61152 60875 55968 52188 51121 52972 54015 54985 56190 53634 53858 54770
9410 54770 55593 55791 55475 59167 59352 59957 60966 61977 62561 63473 61162 54253 49652 43102 39028 38128 43155
$$ packed form
9517D7328rk509k19j032N573L074m65k378k396R54J491m85p659r389j5048j2766
9501D065j0679m551P51J275N81O273P505K013N317O458M544L774J001j270L503
9486C0560R94j051K879K498k140m468J116J16m609k760l173K874L109M714J059
9471C1718l259r73j609J948K767M165Q12r31j966l613L692M599R395P742Q488
9456F2975Q987L816L126K066m31j591j097L368P055J494Q60N768M104k175J916
9441A00241K195q002j1268q165q292q370p466p279n649K003P13k689k442l95Q086
9426D3221O495M825L875j06K842k77m907l780j067J851J043R70J205k556K24R12
9410E4770Q23J98l16L692J85O05J009J011N84R12k311o909m601o550m074r00N027
$$ plain form
9393 43155 45491 49109 54753 62064 66842 71079 80162 89897 97195 97686 91452 82826 74282 61585 48639
9378 48639 41214 34321 28451 29489 33054 35867 38587 46222 52081 53260 51417 52785 57132 57257 55675
9363 55675 52078 44999 36126 30614 30217 33911 38181 45201 54757 63286 76964 98506 117782 129723
9349 129723 132979 124777 113263 103839 98262 95363 93380 92433 93189 92694 94737 90899 88969 90990 95268
9334 95268 101320 107833 110922 110469 114407 122315 136975 151584 166289 182852 198410 209122 212612
9321 212612 212529 215019 226635 237576 242126 234609 219706 207618 199479 192659 189816 186600 182571 181015
9307 181015 187113 190822 195949 199703 199375 198057 203932 209381 211093 213908 218818 222989 226782 230537 230830
9292 230830 224604 221270 221886 218748 215882 214213 209097 208707 213182 219319 230624 243143 255583 266088
$$ packed form
9393D3155K336L618N644P311M778M237R083R735P298M91o234q626q544j2697j2946
9378D8639p425o893n870J038L565K813K720P635N859J179j843J368M347J25j582
9363E5675l597p079q873n512l97L694M270P020R556Q529J3678K1542J9276J1941
9349A29723L256q202j1514r424n577k899j983r47P56m95K043l838j930K021M278
9334I5268O052O513L089m53L938P908J4660J4609J4705J6563J5558J0712L490
9321B12612q3K490J1616J0941M550p517j4903j2088q139o820k843l216m029j556
9307A81015O098L709N127L754l28j318N875N449J712K815M910M171L793L755K93
9292B30830o226l334O16l138k866j669n116l90M475O137J1305J2519J2440J0505
$$ plain form
9278 266088 274593 282479 286628 291790 297129 301466 315062 335521 357670 379003 399091 418731 433825
9265 433825 442869 451530 457982 464052 472424 483510 491331 500097 514386 532839 553268 571497 589132
9252 589132 607482 619323 631701 642204 651095 662755 682266 711897 746519 778594 812177 845506
9240 845506 883591 919314 957853 1006778 1063792 1128453 1198688 1280246 1362840 1451721 1547240 1643661
9228 1643661 1743671 1849824 1968475 2100624 2252295 2423938 2612660 2814556 3034017 3279230
9218 3279230 3570316 3913248 4312254 4758607 5247229 5804801 6463394 7253681 8196067 9311185
9208 9311185 10637929 12249205 14256615 16805426 20105910 24473797 30385169 38552037
9200 38552037 50060059 66515476 89889338 121408044 158479402 190386233 200128329
$$ packed form
9278B66088Q505P886M149N162N339M337J3596K0459K2149K1333K0088J9640J5094
9265D33825R044Q661O452O070Q372J1086P821Q766J4289J8453K0429J8229J7635
9252E89132J8350J1841J2378J0503Q891J1660J9511K9631L4622L2075L3583L3329
9240H45506L8085L5723L8539M8925N7014O4661P0235Q1558Q2594Q8881R5519R6421
9228A643661J00010J06153J18651J32149J51671J71643J88722K01896K19461K45213
9218C279230K91086L42932L99006M46353M88622N57572O58593P90287R42386J115118
9208I311185J326744J611276K007410K548811L300484M367887N911372Q166868
9200C8552037J1508022J6455417K3373862L1518706L7071358L1906831R742096
$$ plain form
9193 200128329 181057220 146344366 112306903 85678140 66354137 52433371 42218820
9186 42218820 34552842 28692543 24129661 20507481 17584453 15204185 13263005 11670565
9178 11670565 10344109 9226871 8274537 7453017 6745053 6147919 5646802 5211038 4811917
9169 4811917 4440484 4108887 3817748 3565188 3339838 3131590 2935547 2756817 2591002 2443469
9159 2443469 2311401 2189829 2081169 1982557 1894389 1814793 1736129 1662687 1593156 1519011 1448026
9148 1448026 1384240 1327643 1278538 1232875 1189499 1149468 1103385 1056110 1009174 963170 922452
9137 922452 882886 846511 814866 786993 764949 743954 715965 690172 665309 637059 614003 590983
9125 590983 574390 562653 553767 549779 546656 539741 532493 528147 521756 514099 500332 485530 472730
$$ packed form
9193B00128329j9071109l4712854l4037463k6628763j9324003j3920766j0214551
9186D2218820p665978n860299m562882l622180k923028k380268j941180j592440
9178A1670565j326456j117238r52334q21520p07964n97134n01117m35764l99121
9169D811917l71433l31597k91139k52560k25350k08248j96043j78730j65815j47533
9159B443469j32068j21572j08660r8612q8168p9596p8664p3442o9531p4145p0985
9148A448026o3786n6597m9105m5663m3376m0031m6083m7275m6936m6004m0718
9137I22452l9566l6375l1645k7873k2044k0995k7989k5793k4863k8250k3056k3020
9125E90983j6593j1737q886l988l123o915p248m346o391p657j3767j4802j2800
$$ plain form
9112 472730 460367 447065 434976 429651 427604 421218 415135 410056 406602 405172 406015 398421 389430 376362
9098 376362 354315 331097 313610 301528 295276 288728 284147 276715 271355 266606 265955 264063 260903 262961
9084 262961 267565 266746 264074 260608 255673 246758 241053 238854 235068 229400 228061 229821 230720 236621 244274
9069 244274 246686 245958 242465 237966 232797 223298 214768 211243 212442 213814 213167 210903 207184 204637 203335
9054 203335 202236 200268 194480 189293 183907 179217 175192 173159 171023 170427 164864 151677 138555 124995
9040 124995 112091 109382 116002 130438 144246 153391 154830 155508 162677 172060 176549 178472 176406 171623
9026 171623 161757 155381 154310 151828 150009 148285 143217 139892 143810 149814 155787 157931 162872 168477
9012 168477 168706 161711 147673 131052 114023 95545 83229 80017 81132 85927 94133 98738 100117
$$ packed form
9112D72730j2363j3302j2089n325k047o386o083n079l454j430Q43p594q991j3068
9098C76362k2047k3218j7487j2082o252o548m581p432n360m749o51j892l160K058
9084B62961M604q19k672l466m935q915n705k199l786n668j339J760Q99N901P653
9069B44274K412p28l493m499n169r499q530l525J199J372o47k264l719k547j302
9054B03335j099j968n788n187n386m690m025k033k136n96n563j3187j3122j3560
9040A24995j2904k709O620J4436J3808R145J439O78P169R383M489J923k066m783
9026A71623r866o376j071k482j819j724n068l325L918O004N973K144M941N605
9012A68477K29o995j4038j6621j7029j8478j2316l212J115M795Q206M605J379
$$ plain form
8999 100117 102653 104311 106429 105884 107170 107408 106618 106471 105187 101648 97718 95690 91362 88893 90012
8984 90012 90816 91134 90573 90077 90003 88191 88486 88429 85802 83226 83779 82790 84984 83823 85499 83117 76090
8967 76090 72798 75506 78481 79475 83019 87805 90119 91164 94962 95340 93657 92005 92793 91305 90981 87209
8951 87209 83949 83549 83857 82714 78161 78033 77375 78315 82089 86389 89765 89594 90120 90254 94415 97895 98359
8934 98359 94466 90698 88006 86677 87257 89344 88587 86746 83579 80106 76663 75931 76361 78152 80945 81909
8918 81909 77555 74396 73858 74462 75065 77399 78548 76056 74039 76036 74620 70021 69879 69621 68295 66271
8902 66271 62491 62392 63914 64782 68440 69476 70456 73469 79129 86531 93133 98144 104227 106419 106236 101435
8886 101435 89089 77311 66566 58690 50668 44647 43507 42466 40837 40964 41010 39809 43872 45436
$$ packed form
8999A00117K536J658K118n45J286K38p90j47j284l539l930k028m328k469J119
8984I0012Q04L18n61m96p4j812K95n7k627k576N53r89K194j161J676k382p027
8967G6090l292K708K975R94L544M786K314J045L798L78j683j652P88j488l24l772
8951H7209l260m00L08j143m553j28o58R40L774M300L376j71N26J34M161L480M64
8934I8359l893l768k692j329N80K087p57j841l167l473l443p32M30J791K793R64
8918H1909m354l159n38O04O03K334J149k492k017J997j416m599j42k58j326k024
8902F6271l780r9J522Q68L658J036R80L013N660P402O602N011O083K192j83m801
8886A01435j2346j1778j0745p876q022o021j140j041j629J27M6j201M063J564
$$ plain form
8872 45436 44741 43054 41277 43192 47514 48831 49621 47147 45481 44961 46619 49477 51077 51395 50148 47931
8856 47931 45229 45189 43643 40286 41088 40884 41427 41489 40773 42070 43626 41572 41782 44642 45352 42181 40325
8839 40325 38702 37709 41142 41555 38131 36469 39131 41717 42836 42911 42057 39700 40083 42223 44972 42864
8823 42864 39534 36527 37237 40132 42256 42291 40323 42229 45951 45671 45018 42349 39995 35111 32158 35330
8807 35330 38585 37488 39185 38765 36242 35541 33114 31801 31082 28054 29336 28801 26384 22343 24373 28325
8791 28325 28131 32694 33090 31501 31685 30782 27635 25631 25805 22765 21465 19043 20808 24777 26133 28883
8775 28883 30949 30153 28401 29458 32171 36553 37245 36774 34426 32902 36079 38513 41653 42641 39857 39182
8759 39182 35496 32898 34160 33757 32104 32824 31741 25958 20923 19995 18396 16831 15079 11361 8922
$$ packed form
8872D5436o95j687j777J915M322J317P90k474j666n20J658K858J600L18j247k217
8856D7931k702m0j546l357Q02k04N43O2p16J297J556k054K10K860P10l171j856
8839D0325j623r93L433M13l424j662K662K586J119P5q54k357L83K140K749k108
8823D2864l330l007P10K895K124L5j968J906L722k80o53k669k354m884k953L172
8807C5330L255j097J697m20k523p01k427j313p19l028J282n35k417m041K030L952
8791B8325j94M563L96j589J84r03l147k004J74l040j300k422J765L969J356K750
8775B8883K066p96j752J057K713M382O92m71k348j524L177K434L140R88k784o75
8759C9182l686k598J262m03j653P20j083n783n035r28j599j565j752l718k439
$$ plain form
8744 8922 8657 7765 4044 548 -2617 -2812 1888 6872 12739 13025 13263 12247 13168 13312 17641 17912 15299
8727 15299 18797 24911 25776 26101 32776 35668 32540 30731 33099 31274 28287 28243 28818 30387 30152 25316
8711 25316 23337 27425 30618 30237 29311 29820 29982 30521 30698 29809 29590 30740 30668 30559 28384 29979 27752
8694 27752 25820 26034 23948 19769 17305 17278 18341 20512 20087 21088 22574 26679 27761 31951 30740 29593
8678 29593 27518 26615 29279 27881 25057 24444 26025 28047 27661 25168 25505 22502 21088 21516 27613 29113
8662 29113 24360 19200 19733 24670 26971 26624 22907 16984 20112 21791 22160 21157 20014 17091 15443
8647 15443 19717 25185 26973 28214 26375 25252 21966 21162 21710 20846 20560 23422 24307 24165 24320 24340 24985
8630 24985 23533 20084 20387 24766 24879 23984 27558 26867 23756 24321 23991 21529 21261 24133 23367 22533 19889
$$ packed form
8744H922k65q92l721l496l165j95M700M984N867K86K38j016R21J44M329K71k613
8727A5299L498O114Q65L25O675K892l128j809K368j825k987m4N75J569k35m836
8711B5316j979M088L193l81r26N09J62N39J77q89k19J150p2j09k175J595k227
8694B7752j932K14k086m179k464k7J063K171m25J001J486M105J082M190j211j147
8678B9593k075r03K664j398k824o13J581K022l86k493L37l003j414M28O097J500
8662B9113m753n160N33M937K301l47l717n923L128J679L69j003j143k923j648
8647A5443M274N468J788J241j839j123l286q04N48q64k86K862Q85j42J55K0O45
8630B4985j452l449L03M379J13q95L574o91l111N65l30k462k68K872p66q34k644
$$ plain form
8613 19889 22050 24338 21892 18292 17616 18307 15373 18246 20046 20642 20670 22468 24288 22686 17920 14056
8597 14056 16422 18264 20512 18140 16593 18018 20297 18685 15930 18165 19272 19340 16902 19783 21876
8582 21876 19637 18276 19942 23103 22396 24558 26654 21822 18963 20394 24228 28884 33993 33198 29133
8567 29133 28079 26036 21647 21704 21912 22528 23051 22375 21262 20610 19704 13935 15838 20082 23443 23077 17139
8550 17139 14676 15012 14668 11389 10452 11810 13473 11979 12194 17773 24025 25088 23744 23890 26247 27675
8534 27675 24393 26576 30452 32851 32077 28692 27791 24947 21739 19282 17392 17766 20580 21456 20433 17742
8518 17742 19392 21636 18760 19035 19824 17060 17761 19823 16746 18882 22349 22532 20679 18804 18764 18666 18603
8501 18603 17202 15175 19443 21284 19275 17835 18686 20050 22732 24490 23411 25664 30320 34707 35177
$$ packed form
8613A9889K161K288k446l600o76O91k934K873J800N96K8J798J820j602m766l864
8597A4056K366J842K248k372j547J425K279j612k755K235J107O8k438K881K093
8582B1876k239j361J666L161p07K162K096m832k859J431L834M656N109p95m065
8567B9133j054k043m389N7K08O16N23o76j113o52r06n769J903M244L361l66n938
8550A7139k463L36l44l279r37J358J663j494K15N579O252J063j344J46K357J428
8534B7675l282K183L876K399p74l385r01k844l208k457j890L74K814Q76j023k691
8518A7742J650K244k876K75P89k764P01K062l077K136L467J83j853j875m0r8o3
8501A8603j401k027M268J841k009j440Q51J364K682J758j079K253M656M387M70
$$ plain form
8486 35177 33715 33105 31144 26793 23610 20258 19811 19993 20684 19169 16660 16319 16291 16901 17972 17253 20165
8469 20165 18801 17051 19874 19527 18479 15445 14657 15825 16253 15577 16983 18081 20999 20895 17107 13485
8453 13485 14776 15321 15692 17425 19564 23504 21026 18375 17630 17620 19068 15900 17182 16304 14034 14614
8437 14614 16458 15104 13031 11519 13293 13108 13990 14005 12056 14687 17820 18486 17510 15029 14827 16826
8421 16826 16817 18918 22494 23883 19945 11969 7193 2495 5857 10576 11612 8177 4984 2444 3713
8406 3713 7278 11950 13619 11971 13899 17889 16534 16255 16405 14802 14470 17616 14954 11870 11621 12872
8390 12872 14703 16861 14157 12873 10671 11187 14067 14033 13902 14936 11600 8329 9148 11857 13211 11027
8374 11027 13034 13553 12016 7162 8615 12539 15875 15370 15804 16685 19891 19060 19411 17684 14403 11347
$$ packed form
8486C5177j462o10j961m351l183l352m47J82O91j515k509l41k8O10J071p19K912
8469B0165j364j750K823l47j048l034p88J168M28o76J406J098K918j04l788l622
8453A3485J291N45L71J733K139L940k478k651p45j0J448l168J282q78k270N80
8437A4614J844j354k073j512J774j85Q82J5j949K631L133O66r76k481k02J999
8421A6826rK101L576J389l938p976m776m698L362M719J036l435l193k540J269
8406C713L565M672J669j648J928L990j355k79J50j603l32L146k662l084k49J251
8390A2872J831K158k704j284k202N16K880l4j31J034l336l271Q19K709J354k184
8374A1027K007N19j537m854J453L924L336n05M34Q81L206q31L51j727l281l056
$$ plain form
8358 11347 11586 13143 12596 5826 5981 12285 12133 8992 10571 13308 12942 11945 8826 10378 10453 8815 7296
8341 7296 11022 12552 12767 13228 17121 16058 14624 14951 16859 19492 17245 12784 11881 10765 11674 9487
8325 9487 8976 9980 8340 8176 12651 16356 16789 15252 13351 10393 12328 11745 12473 9353 9084 11684
8309 11684 10992 9322 9802 12143 14043 11183 9932 13955 17642 15554 13927 12699 13390 14727 17661
8294 17661 21091 20357 19759 15989 13115 10740 13123 15386 10797 7275 4482 8173 10373 12625 12305
8279 12305 6804 6168 7671 7741 7111 6520 8885 9335 7613 9563 10149 9704 11030 7140 10139 14145 16205
8262 16205 15147 15099 14044 13596 13292 12574 11269 10969 10856 11701 13601 10786 9919 11734 10311 11408 12854
8245 12854 10865 9158 10580 12227 9031 8855 8670 10206 5989 7155 11118 11142 14221 14149 10731 9109
$$ packed form
8358A1347K39J557n47o770J55O304j52l141J579K737l66r97l119J552P5j638j519
8341G296L726J530K15M61L893j063j434L27J908K633k247m461r03j116R09k187
8325I487n11J004j640j64M475L705M33j537j901k958J935n83P28l120k69K600
8309A1684o92j670M80K341J900k860j251M023L687k088j627j228O91J337K934
8294A7661L430p34n98l770k874k375K383K263m589l522k793L691K200K252l20
8279A2305n501o36J503P0o30n91K365M50j722J950N86m45J326l890K999M006K060
8262A6205j058m8j055m48l04p18j305l00j13Q45J900k815q67J815j423J097J446
8245A2854j989j707J422J647l196j76j85J536m217J166L963K4L079p2l418j622
$$ plain form
8229 9109 6486 7900 9973 10689 10655 6895 7442 9438 10140 10267 8699 7709 11205 13124 14065 15238 14406
8212 14406 12234 12242 15696 18080 15622 14965 11541 9695 10970 10521 15482 13417 10453 5593 3342 7377
8196 7377 9164 8331 9300 8796 5869 4859 4730 5607 6797 8852 7702 7523 7807 9394 9482 12005 11339
8179 11339 7126 6119 6035 7194 12171 13807 8450 4302 1856 5261 8843 10137 10248 9149 8349 9825
8163 9825 8683 9698 10101 12843 14713 14021 11381 6841 5761 4883 5065 6450 5166 8858 11540 11247
8147 11247 10284 10891 6405 5713 3550 4457 4509 4732 6522 7571 6952 12043 14491 10458 9238 7635 7094
8130 7094 9907 11270 11013 11606 8264 11164 12403 10765 10422 12351 10444 6579 8637 11642 9238 10800
8114 10800 11067 11010 8959 10535 10492 11215 11234 11577 11134 10113 9213 8311 6382 5402 8123 9751 11241 7378
$$ packed form
8229I109k623J414K073P16l4l760N47J996P02J27j568r90L496J919R41J173q32
8212A4406k172QL454K384k458o57l424j846J275m49M961k065k964m860k251M035
8196G377J787q33R69n04k927j010j29Q77J190K055j150j79K84J587Q8K523o66
8179A1339m213j007q4J159M977J636n357m148k446L405L582J294J11j099q00J476
8163I825j142J015M03K742J870o92k640m540j080q78J82J385j284L692K682k93
8147A1247r63O07m486o92k163R07N2K23J790J049o19N091K448m033j220j603n41
8130G094K813J363k57N93l342K900J239j638l43J929j907l865K058L005k404J562
8114A0800K67n7k051J576m3P23J9L43m43j021r00r02j929r80K721J628J490l863
$$ plain form
8096 7378 3956 528 278 6421 8898 9998 11289 8247 11058 8191 7916 7013 4608 4978 7301 9542
8080 9542 8761 7259 5433 5321 8361 13605 14258 14269 15913 14636 11532 9930 9353 10689 12715 15469
8064 15469 15855 15251 16046 10134 8055 8519 8192 11621 10114 7740 7448 6928 6082 7443 6648 4768 5774
8047 5774 8772 9718 11509 10137 8878 10027 14661 11936 8493 9127 5071 5773 7198 8469 6754 5051
8031 5051 6547 9699 11366 12098 14114 14471 15962 10687 12938 16227 13814 10128 6841 7709 11673 14424
8015 14424 12045 9377 10847 9342 9515 9803 9404 10151 11769 11819 9159 6767 1175 3058 5724 9178
7999 9178 8962 6876 6554 5098 7584 10712 11928 10132 12090 13484 13047 15708 17543 16112 11759 9268
7983 9268 8151 8760 9703 9822 11872 7333 3818 6551 4683 -122 1166 2434 2394 3524 5216 4252
$$ packed form
8096G378l422l428k50O143K477J100J291l042K811k867k75r03k405L70K323K241
8080I542p81j502j826j12L040N244O53J1J644j277l104j602n77J336K026K754
8064A5469L86o04P95n912k079M64l27L429j507k374k92n20q46J361p95j880J006
8047E774K998R46J791j372j259J149M634k725l443O34m056P02J425J271j715j703
8031E051J496L152J667P32K016L57J491n275K251L289k413l686l287Q68L964K751
8015A4424k379k668J470j505J73K88l99P47J618N0k660k392n592J883K666L454
7999I178k16k086l22j456K486L128J216j796J958J394m37K661J835j431m353k491
7983I268j117O09R43J19K050m539l515K733j868m805J288J268m0J130J692r64
$$ plain form
7967 4252 1608 2960 4289 5232 6859 9901 9961 11285 8573 6104 2467 -240 373 3754 9680 12145
7951 12145 12032 10037 11389 9068 11733 11993 9382 8481 10982 9081 9636 11775 14341 14653 10492 9896
7935 9896 11000 13827 17284 16645 15387 13996 10665 11458 11851 12689 12643 8488 7373 10548 13262 11882
7919 11882 13386 13164 8302 4735 5236 3000 4862 7516 6256 9761 9991 7619 6544 7743 7810 9794
7903 9794 10843 9869 7852 7435 7183 8489 10479 11163 8488 7118 10490 9983 8343 10866 11478 9768
7887 9768 12550 12752 14073 10612 9886 10750 8128 7387 5902 6933 8465 11553 9740 9347 7339 8865
7871 8865 12192 13514 11246 11280 11270 10962 12400 13456 12690 13061 7997 4814 6476 8497 6002 8141 8611
7854 8611 7890 7253 7602 6661 7027 9062 8966 10189 8280 8005 7910 8842 11822 8366 8814 8974 9231 6240
$$ packed form
7967D252k644J352J329R43J627L042O0J324k712k469l637k707O13L381N926K465
7951A2145j13j995J352k321K665K60k611r01K501j901N55K139K566L12m161n96
7935I896J104K827L457o39j258j391l331P93L93Q38m6m155j115L175K714j380
7919A1882J504k22m862l567N01k236J862K654j260L505K30k372j075J199O7J984
7903I794J049r74k017m17k52J306J990O84k675j370L372n07j640K523O12j710
7887I768K782K02J321l461p26Q64k622p41j485J031J532L088j813l93k008J526
7871H865L327J322k268L4j0l08J438J056p66L71n064l183J662K021k495K139M70
7854H611p21o37L49r41L66K035r6J223j909k75r5R32K980l456M48J60K57k991
$$ plain form
7836 6240 5949 10467 6210 3993 5859 6417 9646 8262 5941 3880 5185 4898 6794 7306 7592 6904
7820 6904 8452 10025 7565 7936 8599 8329 9771 10138 8042 8642 12235 15925 12078 8075 6371 7918
7804 7918 8800 7873 7504 10142 11493 10285 8571 8041 10454 12662 15826 14994 10506 8277 6585 8362
7788 8362 8234 8567 8491 6004 7732 8367 10301 9849 10083 9268 8035 7570 3501 4302 5997 7127 6052
7771 6052 7051 7281 7534 5861 4236 2431 5560 8509 6775 7326 9852 12244 6850 658 3114 4696
7755 4696 5942 3913 2325 3081 4200 4533 3500 3577 4203 6869 10155 10189 8461 9504 9199 7632 6582
7738 6582 9218 8365 9258 7589 6357 7612 9407 10554 9157 7695 4242 1105 1943 6373 6735 3257
7722 3257 3099 5166 6671 5990 4755 7158 7382 4442 4228 3940 7417 9224 7318 6752 8781 7164
$$ packed form
7836F240k91M518m257k217J866N58L229j384k321k061J305k87J896N12K86o88
7820F904J548J573k460L71O63k70J442L67k096O00L593L690l847m003j704J547
7804G918Q82r27l69K638J351j208j714n30K413K208L164q32m488k229j692J777
7788H362j28L33p6k487J728O35J934m52K34q15j233m65m069Q01J695J130j075
7771F052R99K30K53j673j625j805L129K949j734N51K526K392n394o192K456J582
7755D696J246k029j588P56J119L33j033P7O26K666L286L4j728J043l05j567j050
7738F582K636q53Q93j669j232J255J795J147j397j462l453l137Q38M430L62l478
7722C257j58K067J505o81j235K403K24k940k14k88L477J807j906n66K029j617
$$ plain form
7706 7164 4549 669 2688 12267 19264 14359 4097 4200 12532 13434 15618 11765 883 -4717 1103
7691 1103 8737 13853 7073 -6303 -7778 -1119 2750 3681 2342 1837 3205 132 -7539 -6419 339
7676 339 6556 8539 8906 6372 4287 4568 5611 4328 7566 6310 4828 4996 5496 8037 6767 7371
7660 7371 6585 5230 2879 4274 7674 10046 9299 6191 4343 4721 5426 5363 4269 3848 2926 2932 3325 4700
7642 4700 3161 2272 2393 4580 3778 2387 1271 4896 5161 4490 6796 6050 7921 11574 11134 5830 3030
7625 3030 3360 164 -1531 -910 -1536 1686 5083 3416 1328 1865 5465 8887 9250 11327 10957 8557
7609 8557 6863 9694 9214 6831 6174 4601 4569 4777 7540 5555 5176 9551 10978 12327 15128 13948
7593 13948 9693 6016 6216 6288 7255 6833 4035 2687 3516 6744 6934 8525 9473 6736 4708 4928 5831
$$ packed form
7706G164k615l880K019R579O997m905j0262J03Q332R02K184l853j0882n600N820
7691A103P634N116o780j3376j475O659L869R31j339n05J368l073p671J120O758
7676C39O217J983L67k534k085K81J043j283L238j256j482J68N00K541j270O04
7660G371p86j355k351J395L400K372p47l108j848L78P05o3j094m21r22OL93J375
7642D700j539q89J21K187q02j391j116L625K65o71K306p46J871L653m40n304k800
7625C030L30l196j695O21o26L222L397j667k088N37L600L422L63K077l70k400
7609H557j694K831m80k383o57j573l2K08K763j985l79M375J427J349K801j180
7593A3948m255l677K00P2R67m22k798j348Q29L228J90J591R48k737k028K20R03
$$ plain form
7576 5831 5581 5758 3462 3883 4673 3569 5805 8821 10903 9057 5975 4916 5682 6870 6833 3686 3673
7559 3673 1754 -1969 -611 1594 1045 1926 5670 9892 9793 7532 9326 7206 4542 8324 8989 7873
7543 7873 8906 8860 6464 4903 6350 7449 8296 7761 7905 8932 7067 8565 8606 6949 6641 5227 6677
7526 6677 7379 7218 5930 8478 8791 6154 6869 5544 3518 3079 2683 2590 2362 3462 1898 974 919 -15
7508 -15 -1996 -2543 -1499 1686 2967 2728 2307 4298 2942 2126 3137 1709 -575 -1687 2576 3573 55
7491 55 2874 6723 4574 2608 -517 -1310 527 -1026 -3321 -2258 -1212 -979 -2620 -4328 -4760 -1940
7475 -1940 -1718 -799 647 3436 2194 292 2212 4579 7635 7639 4300 4196 4339 3337 5704 6418 2870
7458 2870 307 2986 632 368 2147 2264 3358 1667 1961 3278 1362 592 895 1314 24 3122
$$ packed form
7576E831k50J77k296M21P90j104K236L016K082j846l082j059P66J188l7l147j3
7559C673j919l723J358K205n49Q81L744M222r9k261J794k120k664L782O65j116
7543G873J033m6k396j561J447J099Q47n35J44J027j865J498M1j657l08j414J450
7526F677P02j61j288K548L13k637P15j325k026m39l96r3k28J100j564r24n5r34
7508a5j981n47J044L185J281k39m21J991j356q16J011j428k284j112M263R97l518
7491E5K819L849k149j966l125p93J837j553k295J063J046K33j641j708m32K820
7475a940K22R19J446K789j242j902J920K367L056Ml339j04J43j002K367P14l548
7458B870k563K679k354k64J779J17J094j691K94J317j916p70L03M19j290L098
$$ plain form
7442 3122 6066 4368 2446 843 921 5189 4908 3520 5278 4121 2120 3134 3724 1129 1092 4290
7426 4290 6985 8199 8533 6316 -1186 -1037 2640 3948 3182 210 1365 805 520 2194 5154 7718
7410 7718 8857 3972 1819 -1284 -805 2224 1573 -814 -288 4448 4323 796 5371 9989 6874 4050
7394 4050 2795 1840 -2008 -5746 -5205 -3011 511 2841 1415 -466 -1355 975 4339 5490 9503 6187
7378 6187 -251 2275 5892 5282 2529 -2986 -2264 2281 5756 7249 5869 3765 1345 173 -155 1382
7362 1382 3577 91 -426 2777 3949 4174 4472 5110 7300 6647 7945 4228 1565 -1646 -1058 928
7346 928 542 2573 3870 4001 4701 1992 1425 830 1709 1088 -617 1868 2803 2915 5607 6811 8450
7329 8450 5042 1157 332 1632 3491 3573 3606 3897 3187 4851 5122 5397 3253 1299 2095 5625 4737 1206
$$ packed form
7442C122K944j698j922j603P8M268k81j388J758j157k001J014N90k595l7L198
7426D290K695J214L34k217p502J49L677J308p66k972J155n60k85J674K960K564
7410G718J139m885k153l103M79L029o51k387N26M736j25l527M575M618l115k824
7394D050j255r55l848l738N41K194L522K330j426j881q89K330L364J151M013l316
7378F187o438K526L617o10k753n515P22M545L475J493j380k104k420j172l28J537
7362A382K195l486n17L203J172K25K98O38K190o53J298l717k663l211N88J986
7346I28l86K031J297J31P00k709n67n95Q79o21j705K485R35J12K692J204J639
7329H450l408l885q25J300J859Q2L3K91p10J664K71K75k144j954P96L530q88l531
$$ plain form
7311 1206 -513 536 1249 1144 -916 2523 6693 10339 12618 9870 7647 4835 2949 4321 4086 5358
7295 5358 5513 6969 4594 3106 3740 3321 3083 3818 4659 6147 3234 -204 -244 4296 3446 3658 3775 5103
7277 5103 863 -2274 1916 4992 1205 2887 2732 1294 818 3282 4746 6960 9606 6116 427
7262 427 -744 1116 2799 2476 2667 7538 4466 262 -2773 -1923 2306 3464 2169 3774 6576 5835
7246 5835 2176 4502 5048 6174 4454 7244 10673 7331 3504 3242 7366 9981 9700 6158 1221 472
7230 472 -2096 -3440 1207 5469 7008 4592 1033 -800 -1359 -3296 -6155 -5361 -3402 807 -619 -2598
7214 -2598 -969 4668 7052 4533 -1088 -1853 1825 4483 5183 4089 1985 992 1816 3029 1556 1837
7198 1837 3131 3518 325 -1056 -16 -2066 -1910 -63 2548 2199 3833 6361 5802 5077 3293 5292
$$ packed form
7311A206j719J049P13j05k060L439M170L646K279k748k223k812j886J372k35J272
7295E358J55J456k375j488O34m19k38P35Q41J488k913l438m0M540q50K12J17J328
7277E103m240l137M190L076l787J682j55j438m76K464J464K214K646l490n689
7262D27j171J860J683l23J91M871l072m204l035Q50M229J158j295J605K802p41
7246E835l659K326N46J126j720K790L429l342l827k62M124K615k81l542m937p49
7230D72k568j344M647M262J539k416l559j833n59j937k859P94J959M209j426j979
7214b598J629N637K384k519n621p65L678K658P00j094k104r93Q24J213j473K81
7198A837J294L87l193j381J040k050J56J847K611l49J634K528n59p25j784J999
$$ plain form
7182 5292 2093 -170 -501 -2512 1690 4523 5256 6287 4998 2809 -465 -1898 -3551 -1592 2787
7167 2787 2893 1663 92 6 -852 -830 1688 473 64 1714 891 816 3805 1366 -1158 -3870 -7353
7150 -7353 -4005 -554 -184 1313 3474 3753 3820 4557 3629 1521 2470 5321 1772 1383 162 -557 2236
7133 2236 3756 2361 1979 1046 -1267 -4297 -4027 -269 5667 6955 2613 2251 4654 5468 4541 2907
7117 2907 -1052 -1912 -182 264 -593 -2446 -7618 -6596 -1940 -2327 -1817 -640 -610 2241 6051 6843 2999
7100 2999 545 -2761 -5786 -5429 -2285 -2725 -3231 -2488 -2079 -2730 90 1501 488 1089 1806 1181 -142
7083 -142 2299 3360 4246 3884 3267 2668 567 -1890 -1969 -427 -2319 -3549 -505 -374 2659 3821 3677
7066 3677 746 -932 2254 2133 2190 3240 -94 -3207 -2716 -1814 -2610 -981 420 -1562 -2358 878 127
$$ packed form
7182E292l199k263l31k011M202K833P33J031j289k189l274j433j653J959M379
7167B787J06j230j571q6q58K2K518j215m09J650q23p5K989k439k524k712l483
7150g353L348L451L70J497K161K79O7P37r28k108R49K851l549l89j221p19K793
7133B236J520j395l82r33k313l030K70L758N936J288m342l62K403Q14r27j634
7117B907l959q60J730M46q57j853n172J022M656l87N10J177L0K851L810P92l844
7100B999k454l306l025L57L144m40n06P43M09o51K820J411j013O01P17o25j323
7083a42K441J061Q86l62o17n99k101k457p9J542j892j230L044J31L033J162j44
7066C677k931j678L186j21N7J050l334l113M91R02p96J629J401j982p96L236p51
$$ plain form
7049 127 -1119 -542 5486 10331 9443 6692 5280 600 -1132 4103 4791 5384 6544 4504 3817 3629 3794
7032 3794 912 2251 19 -2687 -6386 -5918 -232 3645 4681 3236 1088 2473 3531 142 1104
7017 1104 1602 -1321 -2770 -2821 -1570 188 2607 1004 717 -3843 -5008 700 4740 6166 4586 -753
7001 -753 -1883 1112 3261 6220 7201 5710 3446 3735 6190 4812 4311 2148 489 1684 -1382 -2356
6985 -2356 290 803 1329 -778 59 718 1090 2664 2275 4362 4848 3552 3693 6506 4336 -512 79
6968 79 -1144 -1409 1647 1703 1102 -2309 -3103 -2402 -1165 207 -3634 -3951 -1896 -2980 -4324 -3911 -865
6951 -865 -873 -1820 887 3471 4155 1109 -484 -2034 -6007 -7131 -5544 -3594 -4282 -4431 -633 5069 7000
6934 7000 4020 2511 1075 1527 4520 4194 6418 5324 2701 2891 1019 2648 5007 3301 2684 3403
$$ packed form
7049A27j246N77O028M845q88k751j412m680j732N235O88N93J160k040o87j88J65
7032C794k882J339k232k706l699M68N686L877J036j445k148J385J058l389R62
7017A104M98k923j449n1J251J758K419j603k87m560j165N708M040J426j580n339
7001g53j130K995K149K959R81j491k264K89K455j378n01k163j659J195l066r74
6985b356K646N13N26k107Q37O59L72J574l89K087M86j296J41K813k170m848N91
6968G9j223k65L056N6o01l411p94P01J237J372l841l17K055j084j344M13L046
6951h65qr47K707K584O84l046j593j550l973j124J587J950o88j49L798N702J931
6934G000k980j509j436M52K993l26K224j094k623J90j872J629K359j706o17P19
$$ plain form
6918 3403 1792 2371 1125 -298 1525 -2177 -3354 -2795 -1920 -5479 -7112 -4552 -5114 -5040 -4336 -2264 -3393
6901 -3393 -1314 9 53 -52 -422 990 468 1064 2084 4592 3375 1867 796 -786 -288 -2655 -1692
6884 -1692 987 1575 2861 2710 2279 1737 -160 1497 2126 3233 4363 2391 4117 2888 431 2221
6868 2221 5418 7302 6132 3814 2929 5045 6741 5767 8600 10811 9350 7648 4377 1323 234
6853 234 -6458 -6739 -1208 10561 18932 18145 12927 10779 11233 19594 23869 18652 6286 -2065 -1548 184
6837 184 -1368 -379 2332 -279 -3509 -3873 -4486 -3383 -2456 -2957 -1348 1241 1978 1847 1504 598 -383 -1356
6819 -1356 -546 -621 193 -2294 -4185 -4679 -3333 -4274 -3150 -2531 -2012 -1005 -1168 -429 -3095 -4778 -2748
6802 -2748 -393 2287 1508 3446 5431 -67 -2098 -2416 -3413 -5687 -7024 -5198 -2474 -33 558 181
$$ packed form
6918C403j611N79j246j423J823l702j177N59Q75l559j633K560n62P4P04K072j129
6901c393K079J323M4j05l70J412n22N96J020K508j217j508j071j582M98k367R63
6884a692K679N88J286j51m31n42j897J657O29J107J130j972J726j229k457J790
6868B221L197J884j170k318q85K116J696r74K833K211j461j702l271l054j089
6853B34o692k81N531J1769Q371p87n218k148M54Q361M275n217j2366q351N17J732
6837A84j552R89K711k611l230l64o13J103R27n01J609K589P37j31l43r06r81r73
6819a356Q10p5Q14k487j891m94J346r41J124O19N19J007j63P39k666j683K030
6802b748K355K680p79J938J985n498k031l18r97k274j337J826K724K441N91l77
$$ plain form
6786 181 973 3483 2090 829 -524 -703 -3683 -5345 -4613 -3940 -2796 -1061 -337 -3214 -1875 1502
6770 1502 291 699 4545 6051 -354 219 838 2495 7612 13549 13318 7862 3927 4559 5386 5606 6623
6753 6623 5044 6164 7946 4600 3268 3400 753 -1186 -194 2218 2219 1731 1907 4701 3940 2256 260
6736 260 -672 -2381 -1607 -1506 -640 1033 1845 3195 4879 5102 3361 2824 3468 3754 3093 1297 -36 2079
6718 2079 6052 9377 9618 6498 4756 5469 6822 5249 4696 3880 3587 6656 6794 4579 2761 4404
6702 4404 8808 10034 10573 7359 3806 98 -1046 1939 9067 7908 6213 6764 3936 184 1073 518
6686 518 1547 4254 3076 2453 5291 9426 11779 13652 15693 20901 27155 35895 54680 89666 115637
6671 115637 97719 58725 33202 22556 15453 9598 7778 10877 10229 7272 7426 11776 20170 30453
$$ packed form
6786A81P92K510j393j261j353j79k980j662P32O73J144J735P24k877J339L377
6770A502j211M08L846J506o405N73O19J657N117N937k31n456l935O32Q27K20J017
6753F623j579J120J782l346j332J32k647j939R92K412Jm88J76K794p61j684j996
6736B60r32j709P74J01Q66J673Q12J350J684K23j741n37O44K86o61j796j333K115
6718B079L973L325K41l120j742P13J353j573n53q16k93L069J38k215j818J643
6702D404M404J226N39l214l553l708j144K985P128j159j695N51k828l752Q89n55
6686E18J029K707j178o23K838M135K353J873K041N208O254Q740J8785L4986K5971
6671A15637j7918l8994k5523j0646p103n855j820L099o48k957J54M350Q394J0283
$$ plain form
6657 30453 38139 35772 21251 12942 11375 11232 9861 12684 16791 17615 15657 6619 3409 2839 1698
6642 1698 1338 1600 -501 -459 -498 -199 533 2060 -36 1712 3190 5128 5756 2311 2265 4192 6506 6002
6624 6002 2832 2206 2177 818 1148 1834 1247 -1849 1514 4823 2005 -2313 -876 119 2172 1459 1234
6607 1234 1357 102 -3155 -4650 -4498 -3855 -4334 -5034 -5925 -5148 -4936 -1585 193 893 1331 1980 529 -677
6589 -677 161 3002 4957 2847 1949 4307 1683 -2573 -1218 10 -1097 -3042 -1887 -2836 -1103 22
6573 22 -455 -692 -1861 -4377 -4294 -2341 -1215 3745 6250 7061 6222 3596 1269 3578 4498 5870 4210
6556 4210 4444 6470 4788 4285 2356 152 -1541 -2969 -4569 -4186 -1125 -4098 -6247 -7289 -4468 1199
6540 1199 2354 1828 -229 270 1221 592 -601 -253 -3459 -4429 -3871 -7209 -6192 -6616 -5754 -2147 -192
$$ packed form
6657C0453P686k367j4521q309j567j43j371K823M107Q24j958r038l210n70j141
6642A698l60K62k101M2l9K99P32J527k096J748J478J938O28l445m6J927K314n04
6624F002l170o26k9j359L30O86n87l096L363L309k818m318J437R95K053p13k25
6607A234J23j255l257j495J52O43m79p00q91P77K12L351J778P00M38O49j451j206
6589f77Q38K841J955k110q98K358k624m256J355J228j107j945J155r49J733J125
6573B2m77k37j169k516Q3J953J126M960K505Q11q39k626k327K309R20J372j660
6556D210K34K026j682n03j929k204j693j428j600L83L061k973k149j042K821N667
6540A199J155n26k057M99R51o29j193L48l206r70N58l338J017m24Q62L607J955
$$ plain form
6523 -192 2684 2480 488 213 -237 -147 -1676 -3121 -3396 534 -137 -1471 -1226 -338 -2232 -3369 -3758 -1563
6505 -1563 1212 -2042 -4322 -2160 1059 862 -2034 -2941 -2412 -2324 -3042 -3417 -4582 -6450 -5831 -6283 -5875
6488 -5875 -4470 -2330 -1220 -1306 -574 -430 -3224 -3061 -574 2389 1492 -120 -1358 -405 4368 6057 2707
6471 2707 -1584 -2524 -1622 -1042 2141 4720 3789 4664 3383 1354 1267 1656 -3575 -5088 -946 2825 3085
6454 3085 2666 4005 4066 2174 2777 3924 1022 553 1672 2084 3302 4552 880 -213 45 -1375 -2595
6437 -2595 71 288 -1277 97 329 3669 2859 -1311 -1450 1504 2222 1055 -1960 -2634 -4192 -5466
6421 -5466 -6875 -5124 -2311 -2012 -783 -4495 -6034 -3585 368 1331 415 815 2883 4004 2451 -1382
6405 -1382 -997 1340 3339 3152 1603 464 -693 -1113 -442 2103 2356 -37 -982 -259 -770 2635 4195
$$ packed form
6523a92K876k04j992k75m50R0j529j445k75L930o71j334K45Q88j894j137l89K195
6505a563K775l254k280K162L219j97k896r07N29Q8p18l75j165j868O19m52M08
6488e875J405K140J110q6P32J44k794J63K487K963q97j612j238R53M773J689l350
6471B707m291r40R02N80L183K579r31Q75j281k029q7L89n231j513M142L771K60
6454C085m19J339O1j892O03J147k902m69J119M12J218J250l672j093K58j420j220
6437b595K666K17j565J374K32L340q10m170j39K954P18j167l015o74j558j274
6421e466j409J751K813K99J229l712j539K449L953R63r16M00K068J121j553l833
6405a382L85K337J999j87j549j139j157m20O71K545K53k393r45P23n11L405J560
$$ plain form
6388 4195 5292 2994 1798 109 -1912 -2826 -3068 -2683 -1402 1146 2214 1670 1650 1076 1077 5687 6425 4613
6370 4613 2089 -122 -3071 -4167 -2490 -346 362 593 -1598 -2531 -2517 -1183 -1176 2937 3907 3233 4260
6353 4260 -697 -3135 -1100 121 738 89 962 142 -1725 -230 -1221 -915 -3119 -2717 -1908 -222 -32
6336 -32 -1093 -1838 747 4036 5112 4808 1460 -795 -1226 -33 408 -306 1942 2939 1058 2541 618
6319 618 -901 -3117 -5350 -4537 -2287 3400 1663 -2133 -2024 2817 5078 5258 3258 2851 351 -1097
6303 -1097 -2371 -4667 -3153 -1504 2067 -1526 -4918 -4947 -6029 -6158 -2201 1542 2164 1764 -2185 -999
6287 -999 -1418 -1611 4643 6751 4203 -516 -1556 1227 1838 1319 1355 1539 -851 -3809 -4536 -2628 -5174
6270 -5174 -2639 -619 -3215 -6519 -4972 -2924 -3246 -438 1407 2869 4722 3524 3109 1375 309
$$ packed form
6388D195J097k298j196j689k021r14k42L85J281K548J068n44k0n74JM610P38j812
6370D613k524k211k949j096J677K144P08K31k191r33J4J334PM113R70o74J027
6353D260m957k438K035J221O17o49Q73q20j867J495r91L06k204M02Q09J686J90
6336c2j061p45K585L289J076l04l348k255m31J193M41p14K248R97j881J483j923
6319F18j519k216k233Q13K250N687j737l796J09M841K261J80k000m07k500j448
6303a097j274k296J514J649L571l593l392k9j082j29L957L743O22m00l949J186
6287i99m19j93O254K108k548m719j040K783O11n19L6J84k390k958p27J908k546
6270e174K535K020k596l304J547K048l22K808J845J462J853j198m15j734j066
$$ plain form
6255 309 -1650 -1917 1721 1708 -2835 -4312 -2148 1682 2250 275 -253 4109 3484 3053 3330 589 424
6238 424 592 137 -714 564 3510 5061 2954 734 66 850 -1558 -2933 785 457 581 884 -524
6221 -524 779 6039 5741 1949 -1815 -4396 -5190 -2417 -2393 -3688 -3447 -3619 -2135 -1300 -3403 -287 1751
6204 1751 -1409 -1493 713 1063 -1346 -758 -96 1816 5531 5709 629 -670 620 -1273 -6113 -8982
6188 -8982 -9221 -5715 -750 -1939 -5095 -275 2065 -57 -3421 -3254 -2916 177 3164 1158 2672 2545
6172 2545 172 -943 -2991 -2995 -3170 -2492 231 2882 3140 1986 950 -1416 -1778 -1577 -2955 -2699 -2943
6155 -2943 -1148 -1244 3076 5330 4601 2551 974 -314 -1894 -2929 -1404 179 -1279 1517 3394 5385
6139 5385 6912 4811 5948 4175 478 -416 -1025 -1141 -1110 925 3249 3768 4833 3729 2068 1508 2201
$$ packed form
6255C09j959k67L638j3m543j477K164L830N68j975n28M362o25m31K77k741j65
6238D24J68m55q51J278K946J551k107k220o68P84k408j375L718l28J24L03j408
6221e24J303N260k98l792l764k581p94K773K4j295K41j72J484Q35k103L116K038
6204A751l160q4K206L50k409N88O62J912L715J78n080j299J290j893m840k869
6188h982k39L506M965j189l156M820K340k122l364J67L38L093K987k006J514j27
6172B545k373j115k048mj75O78K723K651K58j154j036k366l62K01j378K56k44
6155b943J795r6M320K254p29k050j577j288j580j035J525J583j458K796J877J991
6139E385J527k101J137j773l697q94o09j16L1K035K324N19J065j104j661n60O93
$$ plain form
6122 2201 5401 8903 6309 5464 6108 2992 497 -144 660 1180 773 253 4229 4976 5661 6371 2162
6105 2162 -1818 -2638 -4101 -4736 -2184 -1666 -2177 -719 881 -327 2721 7267 5083 1334 87 -1777
6089 -1777 -6809 -8618 -4923 -1564 -1298 -2067 -3317 -590 4750 4078 268 -1951 -3283 -740 2057 2255
6073 2255 -2 -2262 627 2273 2078 892 -129 3035 4499 -876 -4743 -1549 2516 504 -1397
6058 -1397 -2963 -682 -677 -595 -3964 -2126 2499 4119 1395 -2356 -1388 -177 -2805 -3448 -1769 1083 2633
6041 2633 1889 157 -3361 -5155 -5274 -3525 -816 -2941 -5497 -3405 -1848 -757 2108 1966 1521 -1488
6025 -1488 539 1938 226 -258 -541 -1928 -4603 -3750 72 1319 1175 -1905 -1210 -1774 -3218 -1726
6009 -1726 -454 -410 -4399 -4039 -4794 -4810 -3035 -3481 -6108 -7318 -8964 -4177 327 2242 633 -2738 -2960
$$ packed form
6122B201L200L502k594q45O44l116k495o41Q04N20m07n20L976P47O85P10m209
6105B162l980q20j463o35K552N18n11J458J600j208L048M546k184l749j247j864
6089a777n032j809L695L359K66p69j250K727N340o72l810k219j332K543K797J98
6073B255k257k260K889J646j95j186j021L164J464n375l867L194M065k012j901
6058a397j566K281NQ2l369J838M625J620k724l751R68J211k628o43J679K852J550
6041B633p44j732l518j794j19J749K709k125k556K092J557J091K865j42m45l009
6025a488K027J399j712m84k83j387k675Q53L822J247j44l080O95n64j444J492
6009a726J272M4l989L60p55j6J775m46k627j210j646M787M504J915j609l371k22
$$ plain form
5992 -2960 -3179 -6092 -7885 -1971 3658 1277 -719 1867 1470 760 1688 -1084 -3021 -2719 -999 1637
5976 1637 1711 329 1429 -1425 -3066 -807 4734 6461 5472 4918 4766 800 999 951 204 696 1197 1587
5958 1587 -3538 -4278 -3504 -2968 -692 -4354 -4899 -8439 -6506 -3157 -1345 -4421 -2384 -1207 -1082 -3025
5942 -3025 -4463 -1841 -388 -692 -1248 2174 4540 5008 1460 -3275 -5208 -1258 1847 1904 6546 5318
5926 5318 1450 1049 2694 3384 2135 -1204 -587 -521 1360 2176 2639 -17 -4562 -6430 -7370 -4413 -3822
5909 -3822 -1399 -1944 -1944 -3837 431 -100 -869 -829 -485 -1796 515 3504 2242 -99 -4138 -3617 -3347 -663
5891 -663 -1559 -5000 -7746 -8641 -7241 -3040 -2665 -2565 -1009 -1267 -976 -2278 -2630 -2933 -2348 -1391 -2136 -1319
5873 -1319 810 -695 -1457 592 3067 -1519 -4439 -5253 -2674 572 1814 3845 5250 4805 5572 3691
$$ packed form
5992b960k19k913j793N914N629k381j996K586l97p10R28k772j937L02J720K636
5976A637P4j382J100k854j641K259N541J727r89n54j52l966J99m8p47M92N01L90
5958A587n125p40P74N36K276l662n45l540J933L349J812l076K037J177J25j943
5942c025j438K622J453l04n56L422K366M68l548m735j933L950L105N7M642j228
5926E318l868m01J645O90j249l339O17O6J881Q16M63k656m545j868r40K957N91
5909c822K423n45%j893M268n31p69M0L44j311K311K989j262k341m039N21K70K684
5891f63q96l441k746q95J400M201L75J00J556k58K91j302l52l03N85R57p45Q17
5873a319K129j505p62K049K475m586k920q14K579L246J242K031J405m45P67j881
$$ plain form
5857 3691 3923 -537 -945 345 2861 4272 4582 5525 5340 3496 2326 1081 -2724 -4310 -2391 -329
5841 -329 -2084 -2412 -2264 1784 1969 301 -600 -4563 -3092 -1902 -5546 -6543 -430 2764 3250 2589 2840
5824 2840 2081 1940 2524 3290 4176 1352 1969 583 -1924 1406 3955 1053 -2345 -3175 -3724 -3999 -2020
5807 -2020 930 3388 7205 7371 6537 5442 2880 4305 2088 2035 2732 1459 860 276 -3919 -4035 -4865
5790 -4865 -6220 -5428 -1334 -2215 -4211 -2783 1257 1141 -2313 -6314 -4775 -2100 316 2052 2121 -623
5774 -623 362 -4036 -7583 -7743 -5754 -2654 -794 1636 -1529 -2096 -669 -168 3353 1454 549 877 -1500
5757 -1500 -3294 -3948 -4055 -2626 -1808 -4781 -185 1070 -953 -132 905 -3406 -6563 -6835 -1519 -633
5741 -633 1917 1167 44 -1764 -3724 -3906 -5550 -7114 -5553 1336 5006 1042 -1708 -1032 -1440 -2123
$$ packed form
5857C691K32m460m08J290K516J411L10R43j85j844j170j245l805j586J919K062
5841c29j755l28J48M048J85j668r01l963J471J190l644r97O113L194M86o61K51
5824B840p59j41N84P66Q86k824O17j386k507L330K549k902l398q30n49k75J979
5807b020K950K458L817J66q34j095k562J425k217n3O97j273n99n84m195j16q30
5790d865j355P92M094q81j996J428M040j16l454m001J539K675K416J736O9k744
5774f23R85m398l547j60J989L100J860K430l165n67J427N01L521j899r05L28k377
5757a500j794o54j07J429Q18k973M596J255k023Q21J037m311l157k72N316Q86
5741f33K550p50j123j808j960j82j644j564J561O889L670l964k750O76m08o83
$$ plain form
5725 -2123 -3686 -3757 -644 552 -419 498 -1697 -4654 -5209 -2263 -550 -730 -1271 2248 5279 6133 6207
5708 6207 6410 2235 3241 1725 2021 -788 -2531 -1914 823 1469 3299 5015 4139 707 -6308 -7744
5692 -7744 -5452 -3068 -2875 -3406 -2015 -1151 -959 -1551 -1196 -556 1259 4220 2437 1387 711 -2487 -5343
5675 -5343 -6210 -6371 -6334 -6931 -6437 -3585 -3011 -1447 5214 3658 -3529 -4937 -2780 -6282 -9055 -8210 -4575
5658 -4575 331 -1214 -4606 -3624 -5506 -7524 -6476 -5880 -2869 -4617 -5870 -4826 -5362 -5320 427 179
5642 179 -249 -714 -1283 2060 5321 3506 1136 -8 -1395 -1316 -1661 -2206 -2817 -1960 -2047 -3901 -171 5078
5624 5078 2427 -1709 -2457 -2885 -3065 -4947 -2867 -5860 -4927 -3617 -5139 -5556 -1632 2409 2862 4422
5608 4422 2473 14 -2241 -2746 -8228 -9751 -9420 -4743 355 2598 -733 -6018 -3957 -1001 -2301
$$ packed form
5725b123j563p1L113J196r71R17k195k957n55K946J713j80n41L519L031Q54P4
5708F207K03m175J006j516K96k809j743O17K737O46J830J716q76l432p015j436
5692g744K292K384J93n31J391Q64J92n92L55O40J815K961j783j050o76l198k856
5675e343q67j61L7n97M94K852N74J564O661j556p187j408K157l502k773Q45L635
5658d575M906j545l392R82j882k018J048N96L011j748j253J044n36M2N747k48
5642A79m28m65n69L343L261j815k370j144j387P9l45n45o11Q57q7j854L730N249
5624E078k651m136p48m28j80j882K080k993R33J310j522m17L924M041M53J560
5608D422j949k459k255n05n482j523L31M677N098K243l331n285K061K956j300
$$ plain form
5593 -2301 -1852 -1551 -2033 -3868 -5500 -4596 -4392 -6029 -2480 674 -721 1191 183 -1816 -3606 -2294
5577 -2294 -2571 -2798 -790 2762 2638 1150 -1407 -2893 -2645 -681 -947 -1862 -1502 240 3135 5725 6215
5560 6215 8945 8327 5587 783 -3409 -3725 -3362 -2151 -3439 -2519 -319 -1502 -4632 -2325 -2824 -6631
5544 -6631 -6346 -3940 -2951 -5338 -6548 -5702 -4719 -3133 -2406 -3604 -2612 -500 2163 -162 -883 -374 -1603
5527 -1603 -1125 1060 -1160 -3435 -5585 -4586 -4007 -2254 1429 2206 795 -301 -2715 -2676 -999 739
5511 739 5393 8453 7635 5064 1208 -187 -1468 -1880 -1391 -1221 -3602 -271 3382 1915 756 -1123
5495 -1123 -1921 -1879 -1126 -3910 -3913 -268 1692 647 -193 -2507 -3791 -5246 -5340 -3053 -1631 -818 -3478 -3960
5477 -3960 -2401 -3046 -5202 -6826 -3868 -1026 676 2994 3119 524 -834 -1702 -1233 1407 3080 -85
$$ packed form
5593b301M49L01m82j835j632R04K04j637L549L154j395J912j008j999j790J312
5577b294k77k27K008L552j24j488k557j486K48J964k66r15L60J742K895K590M90
5560F215K730o18k740m804m192l16L63J211j288R20K200j183l130K307m99l807
5544f631K85K406R89k387j210Q46R83J586P27j198R92K112K663k325p21N09j229
5527a603M78K185k220k275k150R99N79J753L683P77j411j096k414L9J677J738
5511G39M654L060q18k571l856j395j281m12M89J70k381L331L653j467j159j879
5495a123p98M2P53k784lL645J960j045q40k314j284j455r4K287J422Q13k660m82
5477c960J559o45k156j624K958K842J702K318J25k595j358q68M69K640J673l165
$$ plain form
5461 -85 -1890 -321 688 -1611 -2241 -1475 -721 -3648 -5029 -10190 -9975 -7142 -4348 -1226 2368 2076 -1999
5444 -1999 -3687 -5334 -6229 -3262 -2315 -3373 -1988 1287 2451 -3601 -5508 -1427 -470 -680 3180 2217
5428 2217 -1770 -1498 -1557 -3173 -2790 -1465 -2480 -2816 -920 460 3456 5086 4207 2377 2360 861 1947
5411 1947 1857 1315 3649 4972 6358 4908 4714 3827 -1086 -1868 384 2654 3265 3975 2676 1439 -1241
5394 -1241 -1651 -3326 -3993 -3074 -7236 -5819 -5466 -5369 -5443 -6690 -4254 -4501 -4575 -1730 -129 -1448 -3805 -4555
5376 -4555 -2167 -1684 17 -581 -4293 -3653 -4651 -4612 -1317 -1257 -3193 -3017 -1245 1058 4898 6282 4249
$$ packed form
5461h5j805J569J009k299o30P66P54k927j381n161K15K833K794L122L594k92m075
5444a999j688j647q95K967R47j058J385L275J164o052j907M081R57k10L860r63
5428B217l987K72n9j616L83J325j015l36J896J380K996J630q79j830j7j499J086
5411A947r0n42K334J323J386j450j94q87m913p82K252K270O11P10j299j237k680
5394a241m10j675o67R19m162J417L53R7p4j247K436k47p4K845J601j319k357p50
5376d555K388M83J701n98l712O40r98L9L295O0j936J76J772K303L840J384k033
$$ [...]
##END NTUPLES=NMR SPECTRUM
##END=
